##TITLE=Analysis number 314907
Compound Code spb 05624
Project Code adrs
Chemist Name prosynth
##JCAMPDX= 6.0         $$ Bruker NMR JCAMP-DX V2.0
##DATA TYPE= NMR SPECTRUM
##DATA CLASS= NTUPLES
##ORIGIN= Bruker BioSpin GmbH
##OWNER= NMR
$$ XWIN-NMR		Version 3.5
$$ Mon Oct 31 12:39:53 2005 GMT Standard Time (UT+0h)  MAYBRIDGE\NMR@NMR_250MHZ
##.OBSERVE FREQUENCY= 250.131544655141
##.OBSERVE NUCLEUS= ^1H
##.ACQUISITION MODE= SIMULTANEOUS (DQD)
##.ACQUISITION SCHEME= undefined
##.AVERAGES= 16
##.DIGITISER RES= 18
##SPECTROMETER/DATA SYSTEM= dpx250
##.PULSE SEQUENCE= zg30
##.SOLVENT NAME= CDCl3
##.SHIFT REFERENCE= (INTERNAL, CDCl3, 0, 16.522)
##AUDIT TRAIL= $$ (NUMBER, WHEN, WHO, WHERE, WHAT)
$$ ##TITLE= Audit trail, XWIN-NMR		Version 3.5
$$ ##JCAMPDX= 5.01
$$ ##ORIGIN= Bruker BioSpin GmbH
$$ ##OWNER= NMR
$$ C:\u/data/dgb/nmr/ADRS/11650/pdata/1/auditp.txt
$$ ##AUDIT TRAIL=  $$ (NUMBER, WHEN, WHO, WHERE, WHAT)
(   1,<2005-10-31 12:39:17.88 +000>,<MAYBRIDGE\NMR>,<NMR_250MHZ>,
      <created by zg, POWCHK disabled, PULCHK disabled
       configuration hash MD5:
       62 19 C7 07 E1 42 D1 B7 37 6C 3D D0 77 39 F9 E6
       data hash MD5: 64K
       53 68 8F E6 B2 A9 C0 7D 29 A2 62 95 E1 58 B3 81>)
(   2,<2005-10-31 12:39:34.93 +000>,<MAYBRIDGE\NMR>,<NMR_250MHZ>,
      <Start of raw data processing
       ef LB = 0.3 FT_mod = 6 PKNL = 1 SI = 32K 
       data hash MD5: 32K
       01 41 B2 18 0C 8F 97 91 1C 4A 0C 74 0E 09 C0 90>)
(   3,<2005-10-31 12:39:39.71 +000>,<MAYBRIDGE\NMR>,<NMR_250MHZ>,
      <apk 
       data hash MD5: 32K
       20 68 7A C3 0C EB 10 24 EA 11 3A 14 D3 82 57 3F>)
(   4,<2005-10-31 12:39:40.47 +000>,<MAYBRIDGE\NMR>,<NMR_250MHZ>,
      <abs ABSG = 5 
       data hash MD5: 32K
       D0 E8 50 F6 DF D7 01 82 6D 5C 44 16 8B 75 CC 54>)
$$ ##END=
$$ 
$$ hash MD5
$$ AC 12 F2 E3 EB 8C 2A 6B 04 6C 7B 37 FA 05 6F E3
##$RELAX= 
##$RELAX= 
##$RELAX= 
##$RELAX= 
##$RELAX= 
##$RELAX= 
##$RELAX= 
$$ Bruker specific parameters
$$ --------------------------
##$DU= <C:\u>
##$EXPNO= 11650
##$NAME= <ADRS>
##$PROCNO= 1
##$TYPE= <nmr>
##$USER= <dgb>
##$AMP= (0..31)
100 100 100 100 100 100 100 100 100 100 100 100 100 100 100 100 100 100 
100 100 100 100 100 100 100 100 100 100 100 100 100 100 
##$AQSEQ= 0
##$AQ_mod= 3
##$AUNM= <au_zg>
##$AUTOPOS= <27 >
##$BF1= 250.13
##$BF2= 250.13
##$BF3= 250.13
##$BF4= 250.13
##$BF5= 500.13
##$BF6= 500.13
##$BF7= 500.13
##$BF8= 500.13
##$BYTORDA= 1
##$CFDGTYP= 0
##$CFRGTYP= 5
##$CHEMSTR= <none>
##$CNST= (0..31)
1 1 145 1 1 1 1 1 1 1 1 1 1 1 1 1 1 1 1 1 1 1 1 1 1 1 1 1 1 1 1 1 
##$CPDPRG= <>
##$CPDPRG1= <>
##$CPDPRG2= <>
##$CPDPRG3= <>
##$CPDPRG4= <mlev>
##$CPDPRG5= <mlev>
##$CPDPRG6= <mlev>
##$CPDPRG7= <mlev>
##$CPDPRG8= <mlev>
##$CPDPRGB= <>
##$CPDPRGT= <>
##$D= (0..31)
0 1 0 0 0 0 0 0 0 0.06 0 0 0 0 0 0 0.0002 0 0 0 0 0 0 0 0 0 0 0 0 0 0 
0 
##$DATE= 1130762357
##$DBL= (0..7)
120 120 120 120 120 120 120 120 
##$DBP= (0..7)
150 150 150 150 150 150 150 150 
##$DBP07= 0
##$DBPNAM0= <>
##$DBPNAM1= <>
##$DBPNAM2= <>
$$ [...]
##$SUBNAM7= <"">
##$SUBNAM8= <"">
##$SUBNAM9= <"">
##$SW= 20.6930455092707
##$SWIBOX= (0..15)
0 0 3 0 0 0 0 0 0 0 0 0 0 0 0 0 
##$SW_h= 5175.983436853
##$TD= 65536
##$TD0= 1
##$TE= 295.16
##$TE2= 300
##$TE3= 300
##$TEG= 300
##$TL= (0..7)
0 120 120 120 120 120 120 120 
##$TP= (0..7)
150 150 150 150 150 150 150 150 
##$TP07= 0
##$TPNAME0= <>
##$TPNAME1= <>
##$TPNAME2= <>
##$TPNAME3= <>
##$TPNAME4= <>
##$TPNAME5= <>
##$TPNAME6= <>
##$TPNAME7= <>
##$TPOAL= (0..7)
0.5 0.5 0.5 0.5 0.5 0.5 0.5 0.5 
##$TPOFFS= (0..7)
0 0 0 0 0 0 0 0 
##$TUNHIN= 0
##$TUNHOUT= 0
##$TUNXOUT= 0
##$USERA1= <user>
##$USERA2= <user>
##$USERA3= <user>
##$USERA4= <user>
##$USERA5= <user>
##$V9= 5
##$VALIST= <valist>
##$VCLIST= <CCCCCCCCCCCCCCC>
##$VD= 0
##$VDLIST= <DDDDDDDDDDDDDDD>
##$VPLIST= <PPPPPPPPPPPPPPP>
##$VTLIST= <TTTTTTTTTTTTTTT>
##$WBST= 1024
##$WBSW= 4
##$XGAIN= (0..3)
0 0 0 0 
##$XL= 0
##$YL= 0
##$YMAX_a= 368883
##$YMIN_a= -416509
##$ZGOPTNS= <>
##$ZL1= 120
##$ZL2= 120
##$ZL3= 120
##$ZL4= 120
##$ABSF1= 16.522
##$ABSF2= -4.171173
##$ABSG= 5
##$ABSL= 3
##$ALPHA= 0
##$AQORDER= 0
##$ASSFAC= 0
##$ASSFACI= 0
##$ASSFACX= 0
##$ASSWID= 0
##$AUNMP= <proc_1d>
##$AZFE= 0.1
##$AZFW= 0.1
##$BCFW= 0
##$BC_mod= 0
##$BYTORDP= 0
##$COROFFS= 0
##$CY= 12.5
##$DATMOD= 1
##$DC= 0
##$DFILT= <>
##$DTYPP= 0
##$F1P= 14.0000005364418
##$F2P= -0.99999901652339
##$FCOR= 0.5
##$FTSIZE= 32768
##$FT_mod= 6
##$GAMMA= 0
##$GB= 0
##$INTBC= 1
##$INTSCL= 1
##$ISEN= 128
##$LB= 0.3
##$LEV0= 0
##$LPBIN= 0
##$MAXI= 10000
##$MC2= 0
##$MEAN= 0
##$ME_mod= 0
##$MI= 0
##$NCOEF= 0
##$NC_proc= -4
##$NLEV= 6
##$NOISF1= 0
##$NOISF2= 0
##$NSP= 0
##$NTH_PI= 0
##$NZP= 0
##$OFFSET= 16.522
##$PC= 1
##$PHC0= 79.9064
##$PHC1= 4.281727
##$PH_mod= 1
##$PKNL= yes
##$PPARMOD= 0
##$PSCAL= 4
##$PSIGN= 0
##$REVERSE= no
##$SF= 250.13
##$SI= 32768
##$SIGF1= 0
##$SIGF2= 0
##$SINO= 400
##$SIOLD= 32768
##$SREGLST= <1H.CDCl3>
##$SSB= 0
##$STSI= 32768
##$STSR= 0
##$SW_p= 5175.98343685301
##$SYMM= 0
##$S_DEV= 0
##$TDeff= 65536
##$TDoff= 0
##$TI= <Analysis number 999999
Compound Code 99
Book Reference 9
Project Code 9>
##$TILT= no
##$TM1= 0
##$TM2= 0
##$TOPLEV= 0
##$USERP1= <user>
##$USERP2= <user>
##$USERP3= <user>
##$USERP4= <user>
##$USERP5= <user>
##$WDW= 1
##$XDIM= 32768
##$YMAX_p= 354383760
##$YMIN_p= -358458
$$ End of Bruker specific parameters
$$ ---------------------------------
##NTUPLES= NMR SPECTRUM
##VAR_NAME=  FREQUENCY,     SPECTRUM/REAL,   SPECTRUM/IMAG
##SYMBOL=    X,             R,               I
##VAR_TYPE=  INDEPENDENT,   DEPENDENT,       DEPENDENT
##VAR_FORM=  AFFN,          ASDF,            ASDF
##VAR_DIM=   32768,         32768,           32768
##UNITS=     HZ,            ARBITRARY UNITS, ARBITRARY UNITS
##FACTOR=    0.157963299565203, 1,           1
##FIRST=     4132.6476996994, 0,             0
##LAST=      -1043.33573715361, 0,           0
##MIN=       -1043.33573715361, -358458,     0
##MAX=       4132.6476996994, 354383760,     0
$$ Real data points
##PAGE= N=1
##DATA TABLE= (X++(R..R)), XYDATA
$$ [...]
24149a9094o3762l4116K5263O6674k9235Q8889L1662M5019k163n6357J9062J54340
$$ -19094 -82856 -116972 -91709 -25035 -54270 34619 66281 111300 109137 52780 71842 226182
24137B26182j20979n6478O0408l6610m2066k507O9675j8200l6373n4931J5873
$$ 226182 105203 48725 109133 72523 30457 27950 97625 79425 43052 -11879 3994
24126C994J8018M0982p9483j10254O5902M8669j6524k4464N216m2235L1062J00705
$$ 3994 22012 62994 -16489 -126743 -60841 -12172 -28696 -53160 -47944 -90179 -59117 41588
24114D1588O8278k286N6515p7928J828k916p496l4202p5077l1297K3713k2515
$$ 41588 109866 107580 164095 86167 87995 85079 77583 43381 -31696 -62993 -39280 -61795
24102f1795j14852M2277J22992K6968l3223P437k6002j10317L8138j1387n8964
$$ -61795 -176647 -134370 -11378 15590 -17633 -10196 -36198 -146515 -108377 -119764 -178728
24091a78728N4455K8665O1627L9820L0568j1262k6893k405p5775K1332L5598k6307
$$ -178728 -124273 -95608 -33981 5839 36407 25145 -1748 -4153 -79928 -58596 -22998 -49305
24079d9305J9349M1896N2092J427o3738q3238m971N0620m0906k4987Q7917M9879
$$ -49305 -29956 11940 64032 65459 1721 -81517 -86488 -35868 -76774 -101761 -13844 36035
24067C6035m3711j3366J33224n1872m9439K8009k5267r0060Q848K1275N6418l5197
$$ 36035 -7676 -21042 112182 60310 10871 38880 13613 -76447 -67599 -46324 10094 -25103
24055b5103m4709M4282N6314o8835J04092J337r9914J9390j17217O2143p106j7963
$$ -25103 -69812 -25530 30784 -38051 66041 67378 -32536 -13146 -130363 -68220 -75326 -93289
24043i3289N0062O2616q4128j7103K8948J12239K1023r5652j02524n7317L0555
$$ -93289 -43227 19389 -64739 -81842 -52894 59345 80368 -15284 -117808 -175125 -144570
24032a44570J3288q4316M596m006j4713J42927N5871p71j7332J1186m7104k6672
$$ -144570 -131282 -215598 -211002 -215008 -229721 -86794 -30923 -31694 -49026 -37840 -84944 -111616
24020a11616o5063m711j7516J29981J52389j23242j02287K4799J37064L4390J05929
$$ -111616 -176679 -181390 -198906 -68925 83464 -39778 -142065 -117266 19798 54188 160117
24009A60117j00324j18141J5051M689j9807K4892M1516J5019q1921J1493l4867
$$ 160117 59793 -58348 -43297 -38608 -58415 -33523 7993 23012 -58909 -47416 -82283
23998h2283K5075m9275j5376M9949L2028n127k776M4331j441q822O1803n9833
$$ -82283 -57208 -106483 -121859 -71910 -39882 -45009 -47785 -3454 -4895 -13717 48086 -11747
23986a1747l1328N1467L7066N7026L1774N2647l0288r5182k6494o058L4488K4519
$$ -11747 -43075 8392 45458 102484 134258 186905 156617 61435 34941 28883 63371 87890
23974H7890p4880K4942Q2613P0292j8235j14824o9141k4047k0755k9581j8759
$$ 87890 13010 37952 120565 190857 172622 57798 -11343 -35390 -56145 -85726 -104485
23963a04485R3802J3790K8019K0959m6893l1156j12588R3575J32827k5627j17956
$$ -104485 -10683 3107 31126 52085 5192 -25964 -138552 -44977 87850 62223 -55733
23952e5733j1689Q9099j5507m0375O8311R1281k3599q213k4852J08996J1065J589
$$ -55733 -67422 21677 6170 -34205 34106 125387 101788 93575 68723 177719 188784 190373
23940A90373m1112l1109m0186m4818o0359L8792n3267R3553O4497Q9976r6311
$$ 190373 149261 118152 77966 33148 -27211 11581 -41686 51867 116364 206340 110029
23929A10029n2888j1288K4880O6722n343l2750k1101K4765J1629o3558p7976k8544
$$ 110029 57141 45853 70733 137455 132112 99362 78261 103026 114655 51097 -26879 -55423
23917e5423j3541N8447P003J46467K5578j01853r7998J7394N0076J4982Q6013
$$ -55423 -68964 -10517 -3514 142953 168531 66678 -31320 -13926 36150 51132 137145
23906A37145K5867j49827n5407l4357k7006J190J124l983m5652O6033k1283q6130
$$ 137145 163012 13185 -42222 -76579 -103585 -102395 -101271 -105254 -150906 -84873 -106156 -192286
23894a92286J7508R1921R5459k7199l0356m09K6369K1408K8698n0980n9244r9164
$$ -192286 -174778 -82857 12602 -14597 -44953 -45362 -18993 2415 31113 -19867 -79111 -178275
23882a78275q4634j9289M5213J7159O403K5606J9727l7846J17397Q9326l3597
$$ -178275 -262909 -282198 -236985 -219826 -213423 -187817 -168090 -205936 -88539 787 -32810
23871c2810l4588l5742L338J24864M8754m4613n782k0535P7773R0400L4594o4429
$$ -32810 -67398 -103140 -99802 25062 73816 29203 23421 2886 80659 171059 205653 141224
23859A41224p2487j07171j9716P0648K8565k8259R0589m5695k3094Q8785N9862
$$ 141224 68737 -38434 -58150 12498 41063 12804 103393 57698 34604 123389 183251
23848A83251l4114n1631K9583P4618k5691L774o265k9257m6776M2910n2335p9811
$$ 183251 149137 97506 127089 201707 176016 179790 173525 144268 97492 140402 88067 8256
23836H256n4101l2747R5183M0590o8543J02433O1934k7121q1165q5872n3389K4536
$$ 8256 -45845 -78592 16591 57181 -11362 91071 153005 125884 44719 -41153 -94542 -70006
23824g0006K3860Q4520K1538o7338N662L040r6029n0162M4433N7277k7894R4930
$$ -70006 -46146 38374 59912 -7426 -1764 1276 -94753 -144915 -100482 -43205 -71099 23831
23812B3831J6096N3176K9746J3066j47063j02600J69J35115n5248q3396k0145
$$ 23831 39927 93103 122849 135915 -11148 -113748 -113579 21536 -33712 -117108 -137253
23801a37253J7290l3658J5318P0036L2997J5164J31032q77j8923k7849J45Q114
$$ -137253 -119963 -153621 -138303 -68267 -35270 -20106 110926 110049 91126 63277 63422 71536
23789G1536m7090n7139L9963R1060o0069L514N2576o5382k300k5593J08816N3870
$$ 71536 24446 -32693 7270 98330 38261 41775 94351 28969 26669 1076 109892 163762
23777A63762m6136l7011k9062o3434o2591o2612J1747P3967J27857R2775J0735
$$ 163762 117626 80615 51553 -11881 -74472 -137084 -125337 -51370 76487 169262 179997
23766A79997p1337o1118l1551m5951p8214r1457J3090J06416l4382p8319L3330
$$ 179997 108660 47542 15991 -29960 -108174 -199631 -186541 -80125 -114507 -192826 -159496
23755a59496J1358Q2367J24405n0885j35097K9979Q8992R2534j8442q95m1884
$$ -159496 -148138 -65771 58634 7749 -127348 -97369 -8377 84157 65715 64820 22936
23744B2936n9720o649K2310r1889q1192M6811L659r7045o1650O6810j3630M7706
$$ 22936 -36784 -43433 -21123 -113012 -194204 -147393 -143734 -240779 -302429 -235619 -249249 -201543
23732b01543K4738O88O9722P4535j02793K8500P367l7209L7413J1049J3988J21283
$$ -201543 -176805 -176117 -106395 -31860 -134653 -106153 -98786 -135995 -98582 -87533 -73545 47738
23720D7738J17339p1094q8021L2733k0111J1692J4811L5762j8224q9817j1909
$$ 47738 165077 93983 5962 38695 18584 30276 45087 80849 62625 -27192 -39101
23709c9101Q02r8598M088Q251P9200M6707J0573L4301P0285p9110p4263N7783
$$ -39101 -38299 -136897 -132809 -124558 -45358 1349 11922 46223 116508 37398 -36865 20918
23697B0918O0876j08127l7443N3138o5432M1704J4587k4617n5610P530N072k0900
$$ 20918 81794 -26333 -63776 -10638 -76070 -34366 -19779 -44396 -100006 -92476 -87404 -108304
23685a08304P3884P4239q5983l9218l8009O888J04941K0435J9116O3756O1449
$$ -108304 -34420 39819 -46164 -85382 -123391 -116503 -11562 8873 27989 91745 153194
23674A53194O5373q2967l93L719J9145k9464j319j2576o5192j7727m8062K3044
$$ 153194 218567 135600 135207 138926 158071 128607 127288 114712 49520 31793 -16269 6775
23662F775l8131L9930O9705J2028p0119o4258J25365K6601o4480K5064K6587r4454
$$ 6775 -31356 8574 78279 90307 20188 -44070 81295 107896 43416 68480 95067 613
23650F13p3808K323m781O0688N7760M484L417r7783l6828k1290J9852J7803O914
$$ 613 -73195 -70872 -75653 -14965 42795 47279 50696 -47087 -83915 -105205 -85353 -67550 -60636
23637f0636K6643r8248O6591R7414m3128n3102k7391K8745K4371O4525m2757L4514
$$ -60636 -33993 -132241 -65650 31764 -11364 -64466 -91857 -63112 -38741 25784 -16973 17541
23625A7541j41q7380l4964k3467O02k6312P7656L0695m316m8270M5947P6604n0499
$$ 17541 17400 -69980 -104944 -128411 -127809 -154121 -76465 -45770 -50086 -98356 -52409 24195 -26304
23612b6304j47702n66K8664J15908N9306k7948k2491m1191N07L991N0149j2392
$$ -26304 -174006 -174572 -145908 -30000 29306 1358 -21133 -62324 -61817 -57826 -7677 -20069
23600b0069N9477j8203k7859o3378J6808N0268p0712L3088k3738j04862n3962
$$ -20069 39408 21205 -6654 -70032 -53224 -2956 -73668 -40580 -64318 -169180 -223142
23589b23142j8954Q7261J78856O709k8611k3786P5747M3111l4879j4153j27689
$$ -223142 -242096 -154835 24021 30730 2119 -21667 54080 97191 62312 48159 -79530
23578g9530R059K337k4920O3193O9608j9332l1024O0623j5259j06939o6151j838
$$ -79530 -70471 -68134 -93054 -29861 39747 20415 -10609 50014 34755 -72184 -138335 -140173
23566a40173L6518N7861P031M4317p4072k234p1212n4940O8455K0995J03890J25491
$$ -140173 -103655 -45794 -38763 5554 -68518 -70752 -141964 -196904 -128449 -107454 -3564 121927
23554A21927P2640n6855p5470n0954K7612M371k6314M1652n3529n6920o2457J003
$$ 121927 194567 137712 62242 11288 38900 43271 16957 58609 5080 -51840 -114297 -113294
23542a13294J62390l0758o6641O6028L0060n7432p405K2221n868M941K6982r305
$$ -113294 49096 18338 -48303 17725 47785 -9647 -17052 5169 -699 4242 31224 21919
23530B1919K1446n9655m1340l2633j4424K3198J2628o9010m878R5467M2487J3317
$$ 21919 43365 -16290 -57630 -90263 -104687 -81489 -68861 -137871 -142749 -47282 -4795 8522
23518H522n0340J20916p73r1741o2910O4417N5393k0614o2743j6208P007O3319
$$ 8522 -41818 79098 78325 -13416 -76326 -11909 43484 22870 -39873 -56081 -49074 14245
23506A4245K0726M241k7243o2414q44N3609M8576q1495j08325l0551L1297j5107
$$ 14245 34971 39212 11969 -50445 -51289 2320 50896 -30599 -138924 -169475 -138178 -153285
23494a53285O7185M9329k2620J5233K4014M3572m1030j29233L4070j658Q3331
$$ -153285 -86100 -36771 -59391 -44158 -20144 23428 -17602 -146835 -112765 -114423 -31092
23483c1092o9112o7691R6711J17283Q2749l7389o2175m3151j855m9082j9569p464
$$ -31092 -100204 -167895 -71184 46099 128848 91459 29284 -13867 -15722 -64804 -84373 -91837
23471i1837J11742k7287J5054L0218J07754n9324j18167M2372n4615j21474j8499
$$ -91837 19905 -7382 7672 37890 145644 86320 -31847 10525 -44090 -165564 -184063
23460a84063J12518M3157j2201m4285J1577L9670n1189R42L8409M1083Q1501p9331
$$ -184063 -71545 -28388 -40589 -84874 -73297 -33627 -84816 -83874 -45465 -4382 77119 -2212
23448b212n0826L1858L8406m4854n6811L4966M3654J27886P8710k4632J9476j22540
$$ -2212 -53038 -21180 17226 -27628 -84439 -49473 -5819 122067 200777 176145 195621 73081
23436G3081j51399m140M4293j2390L4186M5635o361j2087n5734O0268K8861k8576
$$ 73081 -78318 -82458 -38165 -50555 -16369 29266 22905 10818 -44916 15352 44213 15637
23424A5637l4218K4574o02m013l322p3856k0400J4567k2000r644L0451K1151l4386
$$ 15637 -18581 5993 5391 1378 -1944 -75800 -96200 -81633 -103633 -113277 -82826 -61675 -96061
23411i6061j18670l2927K3369O4756J39287k3611m6003l0128R0177J52629m4952
$$ -96061 -214731 -247658 -224289 -159533 -20246 -43857 -89860 -119988 -29811 122818 77866
23400G7866r8368J9955M0443m6457k7911L9349N6959J5551N1168r7834q2966j8349
$$ 77866 -20502 -547 39896 -6561 -34472 4877 61836 77387 128555 30721 -52245 -70594
23388g0594K7799K5571L8743o000J9423M8148M8854j3736J5404K9436j37625m2674
$$ -70594 -42795 -17224 21519 15519 34942 83090 131944 118208 133612 163048 25423 -17251
23376a7251P965L5596M8625m416l0218K3794L9192J8440J2375o1562j58042j16553
$$ -17251 -9286 26310 74935 70519 40301 64095 103287 121727 134102 72540 -85502 -202055
23364b02055J6334L8673K50L0118k0642n0191Q2188J15677m800J8378m4081j34772
$$ -202055 -185721 -147048 -146798 -116680 -137322 -187513 -105325 10352 5552 23930 -20151 -154923
23352a54923j4762P0671O5328J07931m3384k0824m1612q6220K1709R7518N1756
$$ -154923 -169685 -99014 -33686 74245 30861 10037 -31575 -117795 -96086 1432 53188
23341E3188l3690j9580k8837M6364o7390L4061N8712o4746n2051Q6111Q6383J5511
$$ 53188 19498 -82 -28919 17445 -49945 -15884 42828 -21918 -73969 12142 98525 114036
23329A14036o038m4523N1646k0423L95M1081k3523q9063l3646j3077Q324o4950
$$ 114036 107998 63475 115121 94698 95093 136174 112651 23588 -10058 -23135 -14811 -79761
23317g9761K3698J335n277J3442N9633K008k8049M11n2047r5172K6533J30248
$$ -79761 -56063 -54728 -60005 -46563 13070 15078 -12971 -12560 -64607 -159779 -133246 -2998
23305b998N4082m0932l6641K008k3967j1181J06108k8524n1225N8173K6890j3546
$$ -2998 51084 10152 -26489 -24481 -48448 -59629 46479 17955 -33270 24903 51793 38247
23293C8247r2805m0900O940n337Q7079N8879q6548r9807P6747L7658K1606M716
$$ 38247 -54558 -95458 -88518 -93855 -6776 52103 -34445 -134252 -57505 -19847 1759 6475
23281F475j36372q7881J24025J84203j2227n5339L8049k8737J1051j8378m0900
$$ 6475 -129897 -217778 -93753 90450 78223 22884 60933 32196 43247 24869 -16031
23270a6031m9121P4928l0356j10883q620L4811Q4556j7822Q8015o0225j11914
$$ -16031 -65152 9776 -20580 -131463 -140083 -105272 -20716 -38538 49477 -10748 -122662
23259a22662j00280q8480M3377J08463J10225N5153j40756m5994J17906Q4088
$$ -122662 -222942 -311422 -268045 -159582 -49357 5796 -134960 -180954 -63048 21040
23249B1040l8404k8952m8316k7255J57420R5400J6148o530k2760n8202q4874l0347
$$ 21040 -17364 -46316 -94632 -121887 35533 130933 147081 140551 117791 59589 -25285 -55632
23237e5632r1498L6450k7690N5943O3952N1190K793j2024p0996l3625k4011P5800
$$ -55632 -147130 -110680 -138370 -82427 -18475 32715 35508 23484 -47512 -81137 -105148 -29348
23225b9348O6477r3494n4819l9076q1850J18192O8431J04153j0794q744J753j2137
$$ -29348 37129 -56365 -111184 -150260 -232110 -113918 -45487 58666 47872 39128 40881 28744
23213B8744p267J3863l5078m6716P67J12712N3981n1950j2786N0433L7245N09
$$ 28744 21477 35340 262 -46454 -45687 67025 121006 69056 56270 106703 143948 144457
23201A44457n8705r5613j2629N8119J46147k672j13838j1630N5080O6119j0313
$$ 144457 85752 -9861 -22490 35629 181776 179104 65266 53636 108716 174835 164522
23190A64522r5018o2263p7981j1664R250L8481Q2454k4693j15454p0257M1475
$$ 164522 69504 7241 -70740 -82404 -73154 -34673 47781 23088 -92366 -162623 -121148
23179a21148L3872J9415M0630M2484J2584M9717o0046l1995j9051j8544j990p2589
$$ -121148 -87276 -67861 -27231 15253 27837 77554 17508 -14487 -33538 -52082 -54072 -126661
23167a26661L2551O4144j3149J09247K2155l0977N9150j735j35172K5183j0883
$$ -126661 -94110 -29966 -43115 66132 88287 57310 116460 114725 -20447 4736 -6147
23156f147P5001m0932m6811Q2681L2338k6858j56060l9729P5367L2127L1011p2389
$$ -6147 68854 27922 -18889 63792 96130 69272 -86788 -126517 -51150 -19023 11988 -60401
23144f0401L8336K8794J2056N6394P5766L215l1831j4493K6138o5504q0478j04697
$$ -60401 -22065 6729 18785 75179 150945 154160 122329 107836 133974 68470 -12008 -116705
23132a16705J4910Q0099J27495R5971M7486l0411q0751k0431m8470n2792M6022
$$ -116705 -101795 -21696 105799 201770 249256 218845 138094 117663 69193 16401 62423
23121F2423K3908K0692j6120j41342j7912J08609K7255l8631N514K5151K6539
$$ 62423 86331 107023 90903 -50439 -68351 40258 67513 28882 34396 59547 86086
23110H6086m5943p2878n153P5670R2093l4063m7255j7337O8271o0375P4826M2861
$$ 86086 40143 -32735 -37888 37782 129875 95812 48557 31220 99491 39116 113942 156803
23098A56803m3301j25365Q0568Q5126p515m3345k7481O3033N5225l8876j1061
$$ 156803 113502 -11863 68705 153831 146316 102971 75490 138523 193748 154872 143811
23087A43811l2099j4824j8986k3971q5777N2980K7473O6698J35607M7162j23740
$$ 143811 111712 96888 77902 53931 -31846 21134 48607 115305 250912 298074 174334
23076A74334j7146o0974o1714j1912q2717j9097j0472q2843J18997O7352J8553
$$ 174334 157188 96214 34500 22588 -60129 -79226 -89698 -172541 -53544 13808 32361
23065C2361N0809j39092j16574n0608J03060Q8868R5795P5933K0396k1435o5031
$$ 32361 83170 -55922 -172496 -223104 -120044 -31176 64619 140552 160948 139513 74482
23054G4482q034k5853m2400k4222r094J5887n9421K6534N8673M0181O0365K3695
$$ 74482 66448 40595 -1805 -26027 -35121 -19234 -78655 -52121 6552 46733 107098 130793
23042A30793Q648m6367k3777R2015J31852r8398p3173Q8491r5335j02868K5060
$$ 130793 139441 93074 69297 161312 293164 194766 121593 210084 114749 11881 36941
23031C6941K4887Q2201L2750o0709p6585o0113N6402R335n0421m1493p6644K6740
$$ 36941 61828 144029 176779 116070 39485 -20628 35774 45109 -5312 -46805 -123449 -96709
23019i6709j1818Q327M5245M5034m238n3842O7580O4513N2324P781N0019o3446
$$ -96709 -108527 -100200 -54955 -9921 -14159 -68001 -421 64092 116416 124197 174216 110770
23007A10770j21542M6463K7736j7819n3529O6848R3956j5085K9147k5785M5934
$$ 110770 -10772 35691 63427 45608 -7921 58927 152883 137798 166945 141160 187094
22996A87094r1567j4891j6342j08185L7751M7519o9657p403k5552R2942J1604
$$ 187094 95527 80636 64294 -43891 -6140 41379 -28278 -35681 -61233 31709 43313
22985D3313o8091j24796l356N4929R3874M8751n3251R5253m9626j90908k9270
$$ 43313 -24778 -149574 -152930 -98001 -4127 44624 -8627 86626 37000 -153908 -183178
22974a83178N4145l1428J11237O1129m2382Q2070J48352l9392j40394j8896L5614
$$ -183178 -129033 -160461 -49224 11905 -30477 51593 199945 160553 20159 1263 36877
22963C6877L0958M7332m4898J0256J531j4080M0655K2693p6524o0120j12669J18402
$$ 36877 67835 115167 70269 80525 82056 67976 108631 131324 54800 -5320 -117989 413
22951D13J23927j9530j20694j05297L0084M2036O5987o2230p1678M5181Q9060
$$ 413 124340 104810 -15884 -121181 -91097 -49061 16926 -45304 -116982 -71801 17259
22940A7259J41893o4002j55474n1160k975l8125j9274K9248j8941M7203J59830
$$ 17259 159152 95150 -60324 -111484 -114459 -152584 -171858 -142610 -161551 -114348 45482
22929D5482N7838Q0908m9867m1079J9853l9324m0808R3917k5849n8343M5865q3151
$$ 45482 103320 184228 134361 93282 113135 73811 33003 126920 101071 42728 88593 5442
22917E442p9909J7649m4789m1716q2035N8797Q1147N3861Q3227K0393J4223l2770
$$ 5442 -74467 -56818 -101607 -143323 -225358 -166561 -85414 -31553 51674 72067 86290 53520
22905E3520o2319M0864L8131p5169L0136Q4283m3767q0577O54p410J3050Q1979
$$ 53520 -8799 32065 70196 -4973 25163 109446 65679 -14898 -14244 -21654 -8604 73375
22893G3375l7060o5845J5643M3436l7443n2207q7336M4274K7581P6233N7282R240
$$ 73375 36315 -29530 -13887 29549 -7894 -60101 -147437 -103163 -75582 651 57933 67173
22881F7173j11811k096K4779j1534l6838m4444L9156J5398j0850n0289l0125Q132
$$ 67173 -44638 -46734 -21955 -33489 -70327 -114771 -75615 -60217 -71067 -121356 -151481 -143349
22869a43349Q9679M7921M8016M414J1378k2235n8k1814N4773N1729n7038l1125
$$ -143349 -53670 -5749 42267 46681 58059 35824 35766 13952 68725 120454 63416 32291
22857C2291q3559P1174K301k0407N4260j863J7467L5426N930n9240j21614o0164
$$ 32291 -51268 19906 22207 1800 56060 54197 71664 107090 113020 53780 -67834 -127998
22845a27998M4790O723k3363K1137O9914N2893o5981j04930j6296N2210m2162
$$ -127998 -83208 -76485 -99848 -78711 -8797 44096 -21885 -126815 -143111 -90901 -133063
22834a33063J9221Q0035K8238Q3558j36907l1269o676N660j2976k4963o51n0643
$$ -133063 -113842 -33807 -5569 77989 -58918 -90187 -96863 -91203 -104179 -129142 -129793 -180436
22822a80436o0435p7818J34591J28848M4146J6998n8930m3866J1469m373L8803
$$ -180436 -240871 -318689 -184098 -55250 -11104 5894 -53036 -96902 -85433 -89806 -51003
22811e1003M4397J9352k0086l2036M0880P730r6280J9904L1237k8813m0863R893
$$ -51003 -6606 12746 -7340 -39376 1504 9234 -87046 -67142 -35905 -64718 -105581 -95688
22799i5688Q6580K9427n7153l7909J11199L3005n3033n2966j5965O5278j614k7447
$$ -95688 -9108 20319 -36834 -74743 36456 69461 16428 -36538 -52503 12775 11161 -16286
22787a6286j7843L5453j8537J20864N1653j50854Q413O2863o705k3415K1882k8287
$$ -16286 -34129 1324 -17213 103651 155304 4450 12863 75726 69021 45606 67488 39201
22775C9201o7892l7569N506N1704N0037P4568K1285N3124j3626j03464j4162K5998
$$ 39201 -28691 -66260 -60754 -9050 40987 115555 136840 189964 176338 72874 58712 84710
22763H4710q7881P109K3729J6146N7526j9350n6210P217j36100k6901L6034o8941
$$ 84710 -3171 3938 27667 43813 101339 81989 25779 32996 -103104 -130005 -93971 -162912
22751a62912o8598R7536P6278P7105K5454r6583p4761L4510P6319j659o6461J9652
$$ -162912 -231510 -133974 -57696 19409 44863 -51720 -126481 -91971 -15652 -17311 -83772 -64120
22739f4120J11588k0725p5274j3942j3343l1970K9087M2550l861q627L5208O4321
$$ -64120 47468 26743 -48531 -62473 -75816 -107786 -78699 -36149 -40010 -48637 -13429 50892
22727E0892m2219k7689j05678k9697M217N5051K5645P3944o1458K9694R1359O0583
$$ 50892 8673 -19016 -124694 -154391 -150174 -95123 -69478 4466 -56992 -27298 64061 124644
22715A24644K1955r9085j53401Q0053J00389J8090M2122j4863j2840j23469j18290
$$ 124644 146599 47514 -105887 -25834 74555 92645 134767 119904 107064 -16405 -134695
22704a34695p5248l1961J07226J12570J23033L8461n6714j6958l4762k2941N5982
$$ -134695 -209943 -241904 -134678 -22108 100925 139386 82672 65714 30952 8011 63993
22693F3993l5131o4200j02716N025j12290Q1496J74661J88837J1581j06913L0289
$$ 63993 28862 -35338 -138054 -133029 -245319 -163823 10838 199675 211256 104343 134632
22682A34632Q8940j9199J3052K7956p1476n8031L3839j0123J2585j10142j48348
$$ 134632 223572 204373 217425 245381 173905 115874 149713 139590 152175 42033 -106315
22671a06315j7168J6177N5152P1333M9467K6861M4709r4845j08169N118j0936
$$ -106315 -123483 -107306 -52154 19179 68646 95507 140216 45371 -62798 -57680 -68616
22660f8616P3177K4136l7664K6840N6844K5093r6054O8273m4527m6669Q526k3097
$$ -68616 4561 28697 -8967 17873 74717 99810 3756 72029 27502 -19167 -10641 -33738
22648c3738J3634n9886J3804L4293n5040J3823R1720J03400O4216r2587j22404
$$ -33738 -20104 -79990 -66186 -31893 -86933 -73110 18610 122010 186226 93639 -28765
22637b8765L4015P3026n054m1635O344R462l1321l6919K3019K7870j08115n8170
$$ -28765 5250 78276 73222 31587 37931 47393 16072 -20847 2172 30042 -78073 -136243
22625a36243K4689J07779O264j30762p4171M1472N3175J49658K8546k2536N029
$$ -136243 -111554 -3775 2489 -128273 -202444 -160972 -107797 41861 70407 47871 52900
22614E2900r5233j8991N7591p138M589q3110J0813J21035O0604o7180l1631M1691
$$ 52900 -42333 -61324 -3733 -10871 -6282 -89392 -78579 42456 103060 35880 4249 45940
22602D5940l9759l6922K0797J2556m9539o4943k0787l8149L7773J30025N6973
$$ 45940 6181 -30741 -9944 2612 -46927 -111870 -132657 -170806 -133033 -3008 53965
22591E3965Q148j15322j1993K4057J11338N2175l1263n2703m3159j00566M6332
$$ 53965 62113 -53209 -65202 -41145 70193 122368 91105 38402 -4757 -105323 -58991
22580e8991j2012J970p9585p5518Q728O8629L4901k6930J1751M6192l3967Q563
$$ -58991 -71003 -69033 -148618 -224136 -215408 -146779 -111878 -138808 -127057 -80865 -114832 -106269
22568a06269K4069O4292J01065L1700j2688r8523k8082Q146p679P6602K2849j9577
$$ -106269 -82200 -17908 83157 114857 102169 3646 -24436 -16290 -23969 52633 75482 55905
22556E5905J1138N2K6150L537k3318j35596j13833R2890p833p017k1155K2783
$$ 55905 67043 67095 93245 96782 73464 -62132 -175965 -83075 -90908 -97925 -119080 -96297
22544i6297J84367Q0380p1393m234m3942M8079L0982j24586j08016n2316Q3553
$$ -96297 88070 168450 97057 92823 48881 96960 127942 3356 -104660 -156976 -73423
22533g3423J6741j7523q0283K9969Q2496k2936R7084j21012j42210M5597Q4817
$$ -73423 -56682 -74205 -154488 -124519 -42023 -64959 32125 -88887 -231097 -185500 -100683
22522a00683M9079O2888L1926m0726k2248n7114M9672Q6244N1320j1088r400j28676
$$ -100683 -51604 11284 43210 2484 -19764 -76878 -27206 59038 110358 99270 89870 -38806
22510c8806L0851L1935o9701M3047j11m5894j3822M9710p1797m9925m9866L6861
$$ -38806 -7955 23980 -45721 -2674 -2785 -48679 -62501 -12791 -84588 -134513 -184379 -147518
22498a47518K1733Q6584M6457m1184p858M6621J17761o743n2347o2854j1337M4815
$$ -147518 -125785 -39201 7256 -33928 -41786 4835 122596 115853 63506 652 -10685 34130
22486C4130K0359J8580J4881j12737j28959M8493R0581k94l3125l4202n0015N2735
$$ 34130 54489 73069 87950 -24787 -153746 -105253 -14672 -14966 -48091 -82293 -132308 -79573
22474g9573o9543k7143L2823M2188M8054L0271m7831Q0081O5082Q468j21199l8965
$$ -79573 -149116 -176259 -143436 -101248 -53194 -22923 -70754 9327 74409 82877 -38322 -77287
22462g7287P09k1984L9423j4157N0263M5361m9904j4158J6037P0331J9348r5562
$$ -77287 -76578 -98562 -59139 -73296 -23033 22328 -27576 -41734 -25697 44634 63982 -31580
22450c1580l7049N7770N2859r723P8655j8688Q3453l038p8477k4557o5954o7526
$$ -31580 -68629 -10859 42000 32277 110932 92244 175697 172659 94182 69625 3671 -63855
22438f3855j878N0609K3062K3536j8622l3361j7724k8726l395L146l4992P229
$$ -63855 -65733 -15124 7938 31474 12852 -20509 -38233 -66959 -70354 -67208 -102200 -94971
22426i4971p2670O4238Q8790N8364l604O0805P707q9266j38514o0350j9007K9371
$$ -94971 -167641 -103403 -14613 43751 40147 100952 108659 19393 -119121 -179471 -198478 -169107
22414a69107P3571j5652N1272L3150m5030m3339J9985N0191m5124k7430R3525
$$ -169107 -95536 -111188 -59916 -26766 -71796 -115135 -95150 -44959 -90083 -117513 -23988
22403b3988N6440p544N0106j9735j429q032k0546M7211p5441j6563K3880L8908
$$ -23988 32452 24908 75014 55279 53850 45818 25272 72483 -2958 -19521 4359 43267
22391D3267O7011m3836j12619k0450J0139m5053J6850R721N6222O1039J4199L6031
$$ 43267 110278 66442 -46177 -66627 -56488 -101541 -84691 -74970 -18748 42291 56490 92521
22379I2521m4431L2994Q7741o09L4893r6168j13318m0941l0439o550Q091n4597
$$ 92521 48090 81084 168825 168216 203109 106941 -6377 -47318 -77757 -84307 -76216 -130813
22367a30813J21598P2487k120j2384O5991j47476p3344R7603o380q1944O3420
$$ -130813 -9215 63272 61152 48768 114759 -32717 -106061 -8458 -14838 -96782 -33362
22356c3362L9840j7367J5973p086L5157q6797k3780J39726j10908o2458K2886
$$ -33362 6478 -10889 5084 -2002 33155 -53642 -77422 62304 -48604 -111062 -88176
22345h8176n4173J57254J18848j4357L4337k1235j3856n1145o996q8012J19332
$$ -88176 -142349 14905 133753 119396 153733 132498 118642 67497 60501 -27511 91821
22334I1821K6172k7954m7282j0047j7654q3300R317O2054K3453o7123K4546j4663
$$ 91821 117993 90039 42757 32710 15056 -68244 -58927 3127 26580 -40543 -15997 -30660
22322c0660l3165M4032P4218r142j19235P294r1108O37R6908J4144k3325j08105
$$ -30660 -63825 -19793 54425 45283 -73952 -66658 -157766 -157129 -60221 -46077 -69402 -177507
22310a77507P5275J3897O2513J55223m2512q5795J051m8560m6866p9318J66255
$$ -177507 -102232 -88335 -25822 129401 86889 1094 2145 -46415 -93281 -172599 -6344
22299f344L6748K3609L798r0017n3339Q5412q441P7062K196L5620n0026k1839
$$ -6344 30404 54013 57811 -32206 -85545 -133 -8574 68488 70684 106304 56278 34439
22287C4439m007P0417m480m7540K1916k8586k6755m7578Q350j16797L6785R7093
$$ 34439 30432 100849 96369 48829 70745 42159 15404 -32174 -23824 -140621 -103836 -6743
22275f743M7788j2248k0742J1666k8367l6715J4825P0184k60k5340m9077N884
$$ -6743 41045 28797 8055 19721 -8646 -45361 -30536 39648 39388 14048 -35029 -29145
22263b9145M6203j9759L9719m935j7219k7112l6778O7439Q5919O3069m7226p4498
$$ -29145 17058 -2701 37018 32083 14864 -12248 -49026 18413 104332 167401 120175 45677
22251D5677J03240m0410j03517M4546N6352q3543j24452n7514R921J6116L9781
$$ 45677 148917 108507 4990 49536 105888 22345 -102107 -159621 -149700 -133584 -93803
22240i3803P7079m5216L356P2587j9819l1939J14570L2549l3899r4205o5478J9535
$$ -93803 -16724 -61940 -58584 14003 -5816 -37755 76815 109364 75465 -18740 -84218 -64683
22228f4683o7205N4422J05678k4259L0383O7477o7429l921Q3156M5043k7967r4012
$$ -64683 -131888 -77466 28212 3953 34336 101813 34384 30463 113619 158662 130695 36683
22216C6683l721k6309J1615J6025K3354J5746O8857q3302m9915J0246L9781M5124
$$ 36683 32962 6653 18268 34293 57647 73393 142250 58948 9033 19279 59060 104184
22204A04184l1376j14186j6129Q2040l0319N2099K9075M1474M048p3957K4089
$$ 104184 72808 -41378 -57507 24533 -5786 46313 75388 116862 120910 46953 71042
22193G1042J0936j03439j7280J58201j3182j74742R0076M6782J534K9534K1670
$$ 71042 81978 -21461 -38741 119460 106278 -68464 21612 68394 69928 99462 121132
22182A21132L3071l4194o0692R517p1200M8249j02580k525P3751M5819j16373
$$ 121132 154203 120009 59317 68834 -2366 45883 -56697 -59222 14529 60348 -56025
22171e6025k7203M058K580k4233J30906J9625n0099l7209j1455M1363j4631m7442
$$ -56025 -83228 -79170 -76590 -100823 30083 49708 -391 -37600 -49055 -7692 -22323 -69765
22159f9765L2368L0952M1029R1572p22l8425l6204o131j5400K956J8928L6463
$$ -69765 -37397 -6445 34584 126156 125434 87009 50805 44674 29274 32230 51158 87621
22147H7621R1300j0550j15223q2088K5067O8273k6576j2285o5471P8138K7244
$$ 87621 178921 168371 53148 -28940 -3873 64400 37824 25539 -39932 38206 65450
22136F5450j295k0786l720J8344m233r937m5712j337m7640P3142L4477j11495
$$ 65450 64155 43369 39649 57993 53760 43823 -1889 -3226 -50866 22276 56753 -54742
22124e4742p3187L7202K1414m7067L8795P3985j2419R270m098J2515N182O2800
$$ -54742 -127929 -90727 -69313 -116380 -77585 -3600 -16019 -6749 -10847 1668 6850 69650
22112F9650N1117O9825p4924r6074r3211M7062N2767r9969L0650O8658l5324j17495
$$ 69650 120767 190592 115668 19594 -73617 -26555 26212 -73757 -43107 25551 -9773 -127268
22100a27268O288J0466N9497M9789P48j00788k7346N8536O0842m7384k5110n4851
$$ -127268 -120980 -110514 -51017 -1228 -480 -101268 -128614 -70078 -9236 -56620 -81730 -136581
22088a36581L7631Q3220J1727L039j5102m4839j8508K8011R9133R5965J708n3679
$$ -136581 -98950 -15730 -4003 -964 -16066 -60905 -79413 -51402 47731 143696 145404 91725
22076I1725n4286p0529m6200o443L8671q689J5946j0339o658m8162K6847Q4330
$$ 91725 37439 -33090 -79290 -85733 -47062 -55751 -39805 -50144 -56802 -104964 -78117 6213
22064F213L3625k4090k0951j7951Q7794J04883m3029r3825j11556l3528R3678
$$ 6213 39838 15748 -5203 -23154 64640 169523 126494 32669 -78887 -112415 -18737
22053a8737J01142J6673o7722j13601N3336P4107O339j10583j01503J15142N9783
$$ -18737 82405 99078 31356 -82245 -28909 45198 51537 -59046 -160549 -45407 14376
22042A4376Q0614M7121J3879J072o7123o5148m263p6905l5591L9227J26898o4675
$$ 14376 94990 142111 155990 157062 89939 24791 20528 -56377 -91968 -52741 74157 9482
22030I482m2873Q4286J27930m3058p1950K4851L2415p3947j20980n172O0217m0947
$$ 9482 -33391 50895 178825 135767 63817 88668 121083 47136 -73844 -79016 -18799 -59746
22018e9746p7373K6643L0392J2680J3395M9664k758K37R573o9864M7785N5061
$$ -59746 -137119 -110476 -80084 -67404 -54009 -4345 -7103 -6866 2707 -67157 -19372 35689
22006C5689Q5233o676L6734O1319l0032j26981j53489o7005P6526P6179L3582
$$ 35689 120922 114246 150980 212299 182267 55286 -98203 -165208 -88682 -12503 21079
21995B1079j4406p943j11332N7157M5824Q7085N7251n5072r4640J8279J2949k9394
$$ 21079 6673 -1270 -112602 -55445 -9621 77464 134715 79643 -14997 3282 16231 -13163
21983a3163k1759N276J0284L4668q4077P167J05302L9776j9930m2127j3829o7899
$$ -13163 -34922 -29646 -19362 15306 -68771 -61604 43698 83474 63544 21417 7588 -60311
21971f0311l9044l9488m8144J07341R6759P249l1361L1035J8987k5169l8183m0209
$$ -60311 -99355 -138843 -186987 -79646 17113 24362 -6999 24036 43023 17854 -20329 -60538
21959f0538N6781L70J6380p3042M2865N0726p0867Q4551K2781o6574j739n0537
$$ -60538 -3757 -3387 12993 -60049 -17184 33542 -37325 47226 70007 3433 1694 -48843
21947d8843J0378O4042m1131l6056k9044k9554j0335N666P9294P360l3399r91
$$ -48843 -38465 25577 -15554 -51610 -80654 -110208 -120543 -114877 -35583 -28223 -61622 -62613
21935f2613N5260J116K2943J7425q992k3537p0893j004K1336p7682L6237R4121
$$ -62613 -7353 -6237 16706 34131 25139 1602 -69291 -70295 -48959 -126641 -90404 3717
21923C717P2687k2248p0730m3534N2861N4046m7615l9055J12448n089j29323K6648
$$ 3717 76404 54156 -16574 -60108 -7247 46799 -816 -39871 72577 67488 -61835 -35187
21911c5187m2665p1931J17783J5255Q2038O8031m9194n3486k1838K199R9863M8024
$$ -35187 -77852 -149783 -32000 -16745 65293 133324 84130 30644 8806 11005 110868 158892
21899A58892j04229O1845j0300o4205K6227M7856J1046n6358l7052m918r7995
$$ 158892 54663 116508 106208 42003 68230 116086 127132 70774 33722 28804 -69191
21888f9191j5990J60486M9794j2778k4237P2986l3645m2492m5565j64531j8800
$$ -69191 -85181 75305 125099 112321 88084 161070 127425 84933 39368 -125163 -143963
21877a43963K3105Q9817N2926q81M7067j3553N7674k5663r668O1128J1089n521
$$ -143963 -120858 -31041 21885 21004 68071 54518 112192 86529 76861 137989 149078 143557
21865A43557p5247J650l3043l5721J4836M0656N1415L277j44461L0140J2563J2583
$$ 143557 68310 69960 36917 1196 16032 56688 108103 111380 -33081 -2941 9622 22205
21853B2205P6369p34J7244o1381J6793k0637j10886R0356K5586p3725j13380r959
$$ 22205 98574 97840 115084 53703 70496 49859 -61027 29329 54915 -18810 -132190 -142149
21841a42149M8775K4483j2929m3737M7692J37519o0765K0438J41576K5172j57407
$$ -142149 -93374 -68891 -81820 -125557 -77865 59654 -1111 19327 160903 186075 28668
21830B8668k2114k772j46229n8219N7560l80k1161Q5097M2843k5323l7704K3357
$$ 28668 6554 3782 -142447 -200666 -143106 -143486 -164647 -79550 -36707 -62030 -99734 -76377
21818g6377n2284k8544J17831J08365j8480m7752j3390J35758J4483k6872R0509
$$ -76377 -128661 -157205 -39374 68991 50511 2759 -10631 125127 139610 112738 203247
21807B03247P6989j0153r2479p0107Q7025M8359K0700n6644j06130p3119j4046
$$ 203247 280236 270083 177604 107497 194522 242881 263581 206937 100807 27688 13642
21796A3642Q6380P0436j23713L6829L1907L8010J20210R419j10484j21864j23936
$$ 13642 100022 170458 46745 83574 115481 153491 273701 283120 172636 50772 -73164
21785g3164J6069N1935R331k6425J2638l1277m8252K3221p561m1292K1513l0819
$$ -73164 -57095 -5160 4171 -22254 -9616 -40893 -89145 -65924 -73485 -114777 -93264 -124083
21773a24083l9414K9114N6987P4726L0671K1129j6097p2847j0027j9434N7064
$$ -124083 -163497 -134383 -77396 -2670 28001 49130 33033 -39814 -49841 -69275 -12211
21762a2211K5803J7762J04243J3708l5228n0712l6547k361M097M0516k4998l1671
$$ -12211 13592 31354 135597 149305 114077 63365 26818 24457 28554 69070 44072 12401
21750A2401J1012P6935L6430M1978k8248O2353j3566M240Q22p3306j46747n3767
$$ 12401 23413 100348 136778 178756 150508 212861 199295 203535 204357 131051 -15696 -69463
21738f9463O1123J52908R4897P6886o2160j42236q9929l3985l4527P8483R4662
$$ -69463 -8340 144568 239465 316351 254191 111955 22026 -11959 -46486 31997 126659
21727A26659J8613j08791n3310K342J02389j7255m2884p1827Q4475j0719M2911
$$ 126659 145272 36481 -16829 -14487 87902 70647 27763 -44064 40411 29692 72603
21716G2603J4866q920Q6779J15243R828q1685j24593l1534K173L4141O782n0742
$$ 72603 87469 78549 165328 280571 290399 208714 84121 52587 54760 88901 95683 44941
21704D4941j1789j532M4518J2337K9600r090r9309K5722O4231L6413n0022K8609
$$ 44941 33152 31620 76138 88475 118075 108985 9676 35398 99629 136042 86020 114629
21692A14629p1461O5542M9110l5009p5125N0438n1686l7853M3300J2119k3010
$$ 114629 43168 108710 157820 122811 47686 98124 46438 8585 51885 64004 40994
21681D0994j51540j24618J08646J21123R3821J6580j1860k7742R5168P235r5566
$$ 40994 -110546 -235164 -126518 -5395 88426 105006 93146 65404 160572 167807 72241
21670G2241n0930K4358J07936j22929o0911M5536M7099J4209p2721K2100K3938
$$ 72241 21311 45669 153605 30676 -30235 15301 62400 76609 3888 25988 49926
21659D9926N1827k0458m8814p075o435N0612P6843p1697j9567K7536O4803J1276
$$ 49926 101753 81295 32481 25406 18971 69583 146426 74729 55162 82698 147501 158777
21647A58777n5318m4677K1930l2523r4390N0840J38293o275j7114n9040j968J68008
$$ 158777 103459 58782 80712 48189 -46201 4639 142932 136657 119543 60503 58535 226543
21635B26543P2109j07111j91935p5465p9737N1181P7668l0925k2597J24668M1953
$$ 226543 298652 191541 -394 -75859 -155596 -104415 -26747 -57672 -80269 44399 86352
21624H6352P611L415r4393q5354K8601L1816O4942J13119j9731q7633l8375J2200
$$ 86352 93963 97378 2985 -82369 -53768 -21952 42990 156109 136378 48745 10370 22570
21612B2570L0409M0608n0872j12432j02257J7540J16574M1955k1112M0902l115
$$ 22570 52979 93587 42715 -69717 -171974 -154434 -37860 4095 -17017 23885 20770
21601B0770p6519N3808P0571l9291Q4660J85822O1596j35077j07850q4770j04443
$$ 20770 -55749 -1941 68630 29339 113999 299821 361417 226340 118490 33720 -70723
21590g0723O1668J1722n341o1497k7607N1987L5798M2559Q5768P0154n3194j09265
$$ -70723 -9055 2667 -2674 -64171 -91778 -39791 -3993 38566 124334 194488 141294 32029
21578C2029o5442m5297P6266j2063l7698J29375j0141Q643N2467j21119n6003
$$ 32029 -33413 -78710 -2444 -14507 -52205 77170 67029 75672 128139 7020 -48983
21567d8983m0216Q494j1841k3320K3731J06172O0761p4653r5651Q1426P2805k1217
$$ -48983 -89199 -80705 -92546 -115866 -92135 14037 74798 145 -95506 -14080 58725 37508
21555C7508K1972N096J9516L3207j2955K5862p7980o923k6671j1650J9103l0717
$$ 37508 59480 64576 84092 117299 104344 130206 52226 45303 18632 6982 26085 -4632
21543d632R1570Q859L8178N2598j2147n54l7794p0221o6011r1140M000n3j8577
$$ -4632 86938 95797 133975 186573 174426 173872 136078 65857 -154 -91294 -87294 -87347 -105924
21530a05924K0298K3306M3251M7265L120K4913o7399r0290O0952N8763Q3826K1616
$$ -105924 -85626 -62320 -19069 28196 31316 56229 -11170 -101460 -40508 18255 102081 123697
21518A23697r265k9056M1104N2958j3641n6300J903L8983K8875n9625K007n9261
$$ 123697 114432 85376 126480 179438 165797 109497 111400 150383 179258 119633 121640 62379
21506F2379n1194P5313N1268q7145j10400N9560J155n790k1233L654p3970n4323
$$ 62379 11185 86498 137766 50621 -59779 -219 936 -4854 -26087 -22433 -96403 -150726
21494a50726N6070J63943M8275q4958J2535J405j0522K9200m8362k9337J8781
$$ -150726 -94656 69287 117562 32604 45139 46544 36022 65222 16860 -12477 6304
21483F304O7457k5328Q1440m5m1121M178q8194k6091J6182J26410l6076m4696
$$ 6304 73761 48433 129873 129828 88707 92885 4691 -21400 -5218 121192 85116 40420
21471D0420J5848J312P039J3910N1454Q796l6225m2097N6409R537p9426K0969
$$ 40420 56268 57580 64619 78529 129983 138779 102554 60457 116866 126403 46977 67946
21459F7946L6768O1332J5774o5534m4195n0454J4862L3892K7897L6207R4949k4943
$$ 67946 104714 166046 181820 116286 72091 21637 36499 70391 98288 134495 229444 204501
21447B04501j22158o6940O3566L6622j8975j1564M5242Q2049M3590m5975q3845
$$ 204501 82343 15403 78969 115591 96616 85052 130294 212343 255933 209958 126113
21436A26113o4118r4346K3138Q1577K6175M7301K7548P1721J217j44860k9871
$$ 126113 61995 -32351 -9213 72364 98539 145840 173388 245109 246326 101466 71595
21425G1595J37836R825k3195J06874l6529k7957M477o5942j10471r6322M1785
$$ 71595 209431 219256 196061 302935 266406 238449 242926 176984 66513 -29809 11976
21414A1976N5344O2532q4582l8210K7423o8932n7507L3393J25908M6204l6968
$$ 11976 67320 129852 45270 7060 34483 -34449 -91956 -58563 67345 113549 76581
21403G6581q685n2384Q755J4350l3090q1237o060M416O2459M8046J6640N4328
$$ 76581 67896 15512 24267 38617 5527 -75710 -81770 -77354 -14895 33151 49791 104119
21391A04119L6405l4355L7076N8469k2181m1178J7833o7680j8428P0249O2454
$$ 104119 140524 106169 143245 201714 179533 138355 156188 88508 70080 140329 202783
21380B02783O2622o2381j56408p6525N623Q9238P3933j14562m9255o909j139J06406
$$ 202783 265405 203024 46616 -29909 -24286 64952 138885 24323 -24932 -31841 -32980 73426
21368G3426l7355o0401j1091j6883M8804k1278N0624L02j8934L9577q807j46891
$$ 73426 36071 -24330 -35421 -52304 -3500 -24778 25846 26148 7214 46791 37984 -108907
21356a08907j9052m6705n742J29524J03544O112m812K6067j0928q950k7977N8115
$$ -108907 -127959 -174664 -180406 -50882 52662 58774 53962 80029 69101 60151 32174 90289
21344I0289O7009M0035J8988r7310m7492k1211k0574K0824q4188n9729l4565J17679
$$ 90289 157298 197333 216321 119011 71519 50308 29734 50558 -33630 -93359 -127924 -10245
21332a0245Q2570J0966o9463n861k1513J8653J37466J12451Q988m2887p5882J9072
$$ -10245 72325 83291 13828 7967 -13546 5107 142573 255024 264012 221125 145243 164315
21320A64315p3430j09821p425J08788j8456q3076M454l7145m6240J0556O0466
$$ 164315 90885 -18936 -26361 82427 63971 -19105 -14651 -51796 -98036 -87480 -27014
21309b7014L9721q0198N1180Q005M6325M5795P2813r6466j4892J37980J4907j20025
$$ -27014 12707 -67491 -16311 -8306 38019 83814 156627 60161 45269 183249 198156 78131
21297G8131o1847N4240P7071k247k0284Q1092M8199N5584K6178o3381p3530K5761
$$ 78131 16284 70524 147595 145348 125064 206156 254355 309939 336117 272736 199206 224967
21285B24967J9877m9734r3673l3592n5679M6776p3367J928J2293n6205q2302m5068
$$ 224967 244844 195110 101437 67845 12166 58942 -14425 -12497 -204 -56409 -138711 -183779
21273a83779R7882J5745R2551Q8179K8415m467r4446m8840j5519q8324n3955Q8029
$$ -183779 -85897 -70152 22399 110578 138993 134526 40080 -8760 -24279 -112603 -166558 -78529
21261g8529J14491J07572m213L2103k3964n7098P7231R9454k4967j1864o1203
$$ -78529 35962 143534 139321 171424 147460 90362 167593 267047 242080 230216 169013
21250A69013n8476L4841j5971j29470m7224J53869L6936r5837J0620N4806J05430
$$ 169013 110537 145378 129407 -63 -47287 106582 143518 47681 58301 113107 218537
21239B18537m5501N4542K0615m4082k8175J7470J00524j09792j22376J9455n350
$$ 218537 173036 227578 248193 204111 175936 193406 293930 184138 61762 81217 75867
21228G5867K0496j7540n5554j8149P5785J47401q839j01452j3106k0066k3097
$$ 75867 96363 78823 23269 5120 80905 228306 219467 118015 104909 84843 61746
21217F1746k3890L8279J10431J7887j15802n2011j8383J18205q327l529J8210
$$ 61746 37856 76135 186566 204453 88651 36640 18257 136462 128135 124606 142816
21206A42816j0015j28994j839p1832J4367P5096J28210l0555j04855J11968P854
$$ 142816 132801 3807 1968 -69864 -55497 19599 147809 117254 12399 124367 132221
21195A32221J4899n8857k1886m2708K7023M7568L4529j24889K9615N1970m6988
$$ 132221 147120 88263 66377 23669 50692 98260 132789 7900 37515 89485 42497
21184D2497M789J9895q4959j3940P4433O4257j02421q9756K4246L7622N6231m039
$$ 42497 47286 67181 -17778 -31718 42715 106972 4551 -85205 -60959 -23337 32894 28855
21172B8855r7126K2455P4158K690P7962n4266q8795M6392O3030n5316m6530P376
$$ 28855 -68271 -45816 28342 31032 108994 54728 -34067 12325 75355 20039 -26491 -19115
21160a9115n1938j0222j02750l224P8103Q1137r028N3924j9444j587O7888k8307
$$ -19115 -71053 -81275 -184025 -187249 -109146 -28009 -37037 16887 -2557 -4144 63744 35437
21148C5437p779O9844n6011j2595r5924n1353Q2928J15944M2890J14101j07170
$$ 35437 27658 97502 41491 28896 -67028 -118381 -35453 80491 123381 237482 130312
21137A30312j67497m0726J01667J103m4703Q139O5208Q1922j5112n4216k1386
$$ 130312 -37185 -77911 23756 24859 -19844 -11705 53503 135425 120313 66097 44711
21126D4711M1286J3748j2186O8006o4578j59358l4767M1621J22834l2118p064
$$ 44711 85997 99745 87559 155565 90987 -68371 -103138 -61517 61317 29199 22135
21115B2135Q7806J52588l4574m6394L3218j03713j84371j4461P8934n2538M9514
$$ 22135 109941 262529 227955 181561 214779 111066 -73305 -87766 -8832 -61370 -11856
21104a1856N9998J6512M3539J28992k6529j18869j8291k9173k7916q5883K1686
$$ -11856 48142 64654 108193 237185 210656 91787 73496 44323 16407 -69476 -47790
21093d7790M9667P0918k3273k7553m2999O2851J37938K3732j12059O2315r041
$$ -47790 1877 72795 49522 21969 -21030 41821 179759 203491 91432 153747 144706
21082A44706m3818J00088m3031j6045O5170o3744j39516j22720m6465k7030N1124
$$ 144706 100888 200976 157945 141900 207070 143326 3810 -118910 -165375 -192405 -141281
21071a41281O3543R8537k7875j7388Q9289L4659r834M9390J6885L608L1189L0919
$$ -141281 -77738 20799 -7076 -24464 64825 99484 89650 139040 155925 159533 190722 221641
21059B21641J07391p3451j24823M4865n0985o5392L9822J06598l4657p7671j29633
$$ 221641 329032 255581 130758 175623 124638 59246 99068 205666 171009 93338 -36295
21048c6295m666q5045l1245K6882J3635J8224J54288O9785j58950m3142j5393
$$ -36295 -40961 -126006 -157251 -130369 -116734 -98510 55778 125563 -33387 -76529 -91922
21037i1922M8769j9837j3844N3879K03136N4739l4074j26428j20028L1892J3827
$$ -91922 -43153 -62990 -76834 -22955 180181 234920 200846 74418 -45610 -13718 109
21026A09N6169J02339P8561j20269j816O450m1190q7218m0321L3134N5228L3240
$$ 109 56278 158617 237178 116909 115093 121543 80353 -6865 -47186 -14052 41176 74416
21014G4416N968l6956J9530J13374o0347q4231L3987J4722q716K2333j9510l9998
$$ 74416 80384 43428 62958 176332 115985 31754 65741 80463 71747 94080 74570 34572
21002C4572r4407l5310K9201Q7639J04988J9447l5630L2877m8633l9946l84o5210
$$ 34572 -59835 -95145 -65944 21695 126683 146130 110500 143377 94744 54798 54414 -10796
20990a0796K0221J2978K7083p504M7151K3663p5688n1946j5741O3080L7318n1311
$$ -10796 9425 22403 49486 41982 89133 112796 37108 -14838 -30579 32501 69819 18508
20978A8508J828J728k7117K4365L3635O7292l623p5345K3359j4314k5852J36016
$$ 18508 20336 22064 -5053 19312 52947 120239 116616 41271 64630 50316 24464 160480
20966A60480m3955j5574l3928R342o5956n2908M269o910M5396j5161J3778R9558
$$ 160480 116525 100951 67023 76365 10409 -42499 -38230 -45140 256 -14905 -1127 98431
20954I8431K221K8563J02327j0141j17887o3779L0491L6762N6261R629k6153J4684
$$ 98431 100652 129215 231542 221401 103514 39735 70226 106988 163249 172878 146725 161409
20942A61409M1061k4429O82r8913N407L2028Q2496M1299M5678j34044r3457M6566
$$ 161409 202470 178041 178723 79810 85217 117245 199741 241040 286718 152674 59217 105783
20930A05783J15828L3001K0743l694p0236R8145J3705n8759R655P7554R0916N8191
$$ 105783 221611 254612 275355 271661 201425 299570 313275 254516 264171 341725 432641 490832
20918D90832P5024n8867N4047J13955R4227Q0724L5936j811M5745Q4009J30758
$$ 490832 565856 506989 561036 674991 769218 849942 885878 884067 929812 1013821 1144579
20907A144579J39769P9536L6722n2859J0056N4272M5199q4389l1888L3575M4660
$$ 1144579 1284348 1363884 1400606 1347747 1357803 1412075 1457274 1372885 1340997 1374572 1419232
20896A419232l8555p8768L2063R7203O9030p2455n7178n352n4794l6584o059n8562
$$ 1419232 1380677 1301909 1333972 1431175 1500205 1427750 1370572 1365220 1310426 1273842 1267783 1209221
20884A209221r4331j47884j13617j07785j00240n1565P8093k6584m8912j28928
$$ 1209221 1114890 967006 853389 745604 645364 593799 671892 645308 596396 467468
20874D67468p7605k4250q8451q3618r8848p0202O746K6894M3059j6737P8303q9968
$$ 467468 389863 365613 277162 193544 94696 24494 31240 58134 101193 84456 162759 72791
20862G2791p0190L9327l6015K852P3749P751q6615p7207l0805k2560J68290J36625
$$ 72791 2601 41928 5913 8765 82514 90265 3650 -73557 -104362 -126922 41368 177993
20850A77993O733L5283o6951M454O203O42l306p9749o4280k1589K3717N7994M2323
$$ 177993 184726 220009 153058 157512 163715 164357 161051 81302 17022 -4567 19150 77144 119467
20837A19467J13720L0846J379o4167j0737k1183m9212n5401j8594N7790k1464
$$ 119467 233187 264033 265412 201245 190508 169325 120113 64712 46118 103908 82444
20826H2444L6112j2844n3687J29677J1287n0998N3317N1811m4655m2440J08896
$$ 82444 118556 105712 52025 181702 192989 141991 195308 247119 202464 160024 268920
20815B68920l6333k6115k0693m2928m4835P0280N584j15194J6378M6182N9755
$$ 268920 232587 206472 185779 142851 98016 168296 173880 58686 75064 121246 181001
20804A81001m1970o4412P2232N6502p6208m0618K684N0254j789j5591P0833O2384
$$ 181001 139031 74619 146851 203353 127145 86527 89211 139465 137676 122085 192918 255302
20792B55302O5276o3948l3909o1071n9918m8515k0735J04361P5134m0536l623
$$ 255302 320578 256630 222721 161650 101732 53217 32482 136843 211977 171441 167818
20781A67818R4802j8738q3948n2102j2065P988p4235k9169m9719O0002J4792J007
$$ 167818 262620 243882 159934 107832 95767 103755 29520 351 -49368 10634 25426 26433
20769B6433j629L2766P4977L0155m9466j9995J52783K6903P0875j7191n7879M8415
$$ 26433 24804 57570 132547 162702 113236 93241 246024 272927 343802 326611 268732 317147
20757C17147o5311j0771N4712L5562o5999j13268J20944n81j28147p0205R3610
$$ 317147 251836 241065 295777 331339 265340 152072 273016 272435 144288 74083 167693
20746A67693Q381o8083J1635m4595l6588L3843N1811M3118k1803j6636k4511l6564
$$ 167693 176074 107991 119626 75031 38443 72286 124097 167215 145412 128776 104265 67701
20734F7701l5176K7934L8929M5314L4189M4786R4918M6906k9101n1260j2151m0761
$$ 67701 32525 60459 99388 144702 178891 223677 318595 365501 336400 285140 272989 232228
20722B32228O1056J8882j4643N062m2321m9248q3350R4342j9527m6038o3686N2240
$$ 232228 293284 312166 297523 302585 260264 211016 127666 222008 202481 156443 92757 144997
20710A44997J1044M3007M7533o4773j02285m0519J06642O9592Q725o8458l3571
$$ 144997 156041 199048 246581 181808 79523 39004 145646 215238 223963 155505 121934
20699A21934p0704j0143p01N7137O344J10422j6772m0522l6411j14757l1601J9797
$$ 121934 51230 41087 40386 97523 103867 214289 197517 156995 120584 5827 -25774 -5977
20687e977M3012J9294M8485K4048j5778K2642r4174L1732O1583K1973M0003J24135
$$ -5977 37035 56329 104814 128862 113084 135726 41552 73284 134867 156840 196843 320978
20675C20978J39510j13932m9179J9274J250j53611n3460r631m5638K8091J8301
$$ 320978 460488 346556 297377 316651 317901 164290 110830 101199 55561 83652 101953
20664A01953J9270J0517m808K8195l3933K2511N517l431j1596l2106J19808O4379
$$ 101953 121223 131740 126932 155127 121194 143705 149222 145791 134195 102089 221897 286276
20652B86276j7196j7484N0154m7132q242M5193k1717O7194l917n5757m0283k6368
$$ 286276 269080 251596 301750 254618 246376 291569 269852 337046 333129 277372 237089 210721
20640B10721n9877j4084J01223j1716J3437k0223R1758K5014M5079r3154m3020
$$ 210721 150844 136760 237983 226267 239704 219481 311239 336253 381332 288178 245158
20629B45158p3182N5764R3297L8348K5151J5062q3157K3658r546r5108O3144O2343
$$ 245158 171976 227740 321037 359385 384536 399598 316441 340099 330553 235445 298589 360932
20617C60932j46593J4487Q3109M0987k8560k8858K2317k902K3598M8309k592r3395
$$ 360932 214339 228826 311935 352922 324362 295504 317821 314919 338517 386826 384234 290839
20605B90839j60765J5732O2769m021J00577l1354l4589J05947J8011l2538P0111
$$ 290839 130074 145806 208575 204554 305131 273777 239188 345135 363146 330608 400719
20594D00719J9380j7216n2634k1620J1689K5706j8511j2821o7525J0044R1855
$$ 400719 420099 402883 350249 328629 340318 366024 347513 334692 267167 277211 369066
20583C69066O2060K7982M2183l6514j87K1350n516j7609K0908n3099j0830J09025
$$ 369066 431126 459108 501291 464777 464590 485940 480424 462815 483723 430624 419794 528819
20571E28819J3249n3536r8279M7746L5019P027m4813M9231n3933J6595L5867N1176
$$ 528819 542068 488532 390253 437999 473018 480045 435232 484463 430530 447125 482992 534168
20559E34168J0211j9380p9847L8704J8028p115L7370q3767l9083r1805l7470M0395
$$ 534168 544379 524999 445152 483856 501884 494769 532139 448372 409289 317484 280014 320409
20547C20409k847M8684P1516K8271j05897n7005P712J2765J1259J05728m4176
$$ 320409 317562 366246 437762 466033 360136 303131 310843 323608 334867 440595 396419
20536C96419m5650K7825O0793L1278j22691l7030L0642N4325R9962l3042p621
$$ 396419 350769 378594 439387 470665 347974 310944 341586 395911 495873 462831 455210
20525D55210L994n4405j7533O7595J14273l0541l3204j19944j01190N9052J2981
$$ 455210 459204 404799 387266 454861 569134 538593 505389 385445 284255 343307 356288
20514C56288L131n9740p8062K0776J33918J42004O9074j26832p6584n1526L6917
$$ 356288 359419 299679 221617 242393 376311 518315 587389 460557 383973 332447 369364
20503C69364L4806k7808J02546k3400k41883p269P8698J83634R2976O0043m7900
$$ 369364 404170 376362 478908 455508 213625 206356 285054 468688 561664 621707 573807
20492E73807j50030j41532j23740N1148P7463k4691O1980R6340p7058l3175k3983
$$ 573807 423777 282245 158505 209653 287116 262425 324405 420745 343687 310512 286529
20481B86529L8141J15071J27925K7148j51714n0168R8046K6555j6016J631Q0181
$$ 286529 324670 439741 567666 594814 443100 392932 490978 517533 501517 503148 583329
20470E83329J8758l0938k6035J6984L9270m9680l1897J4059m9927L4374k473J24763
$$ 583329 602087 571149 545114 562098 601368 551688 519791 533850 483923 518297 515824 640587
20458F40587J32431L378m0245M4023j2604m7103j488r8339k2170N6960j1847j07787
$$ 640587 773018 776396 736151 780174 767570 720467 718979 620640 598470 655430 643583 535796
20446E35796j04349O2018J06784K4943O327l7016J03802O5708M4783L0773j5670
$$ 535796 431447 493465 600249 625192 631519 594503 698305 764013 808796 839569 823899
20435H23899L7999m6596m5318n0077J41269J3874N3883p611O829m0205n8544n9540
$$ 823899 861898 815302 769984 719907 861176 875050 928933 921322 928151 887946 829402 769862
20423G69862O7598N3575O1177M0423L4567P7512k939l6120o7772R3307P5008q9062
$$ 769862 837460 891035 952212 992635 1027202 1104714 1101775 1065655 997883 1091190 1166198 1077136
20411A077136j20240R9640L8344J3741j2191J2371M4845J02871N4465k4492O7022
$$ 1077136 956896 1056536 1094880 1108621 1096430 1108801 1153646 1256517 1310982 1286490 1353512
20400A353512L7568k4643O1850O9266j8737k0566J18846R3415k3049J4557J02927
$$ 1353512 1391080 1366437 1428287 1497553 1478816 1458250 1577096 1670511 1647462 1662019 1764946
20389A764946Q3497J5531l4407P8437j9331l8139K29583K23329j2711O0669Q2433
$$ 1764946 1848443 1863974 1829567 1908004 1888673 1850534 2080117 2303446 2290735 2351404 2433837
20378B433837N7029j684J2677J9044K15276K23516J50032J67095K82580K11502
$$ 2433837 2490866 2489182 2501859 2520903 2736179 2959695 3109727 3276822 3559402 3770904
20368C770904K45189K27952J26192J75149K47787K98749L20145L37592K41483
$$ 3770904 4016093 4244045 4370237 4545386 4793173 5091922 5412067 5749659 5991142
20359E991142K53070K65177L06824K14439J82974M09370L98792L93764M30671
$$ 5991142 6244212 6509389 6816213 7030652 7213626 7622996 8021788 8415552 8846223
20350H846223N00846M62849M89406N73141O53149P62772Q37410Q16304J050677
$$ 8846223 9347069 9809918 10299324 10872465 11525614 12288386 13125796 13942100 14992777
20341A4992777J146738J232382J491897J730337K060838K323974K889177L681632
$$ 14992777 16139515 17371897 18863794 20594131 22654969 24978943 27868120 31549752
20333C1549752N031551O488988Q169290R593014J0440624J1144827J3190621J6642410
$$ 31549752 36581303 43070291 51239581 60832595 71273219 82418046 95608667 112251077
20325A12251077J9499733J9093790J5125015J2029832J3287492J6472100J6224188
$$ 112251077 131750810 150844600 165969615 177999447 191286939 207759039 223983227
20318B23983227J0538776L167829J4914K232646M067395J904793k638809m579102
$$ 223983227 234522003 237689832 237704746 239937392 244004787 245909580 243270771 238691669
20310B38691669j278226L424870L937197J76294l266254j471864L544995N184537
$$ 238691669 237413443 240838313 244775510 244951804 241685550 240213686 243758681 248943218
20302B48943218O53801p096284j1343764j0145452q479510j0394203j5098262
$$ 248943218 249597019 242500735 231156971 221011519 212532009 202137806 187039544
20295A87039544j9045652j9068934j7156189j6055120j5998153j5236429j3597874
$$ 187039544 167993892 148924958 131768769 115713649 99715496 84479067 70881193
20288G0881193j1461883r579917q029124o634130n308408m207888l196446k641259
$$ 70881193 59419310 49839393 41810269 35176139 29867731 25659843 22463397 19822138
20280A9822138k134657j647313j330828j233959j012437r46559q90485p03720
$$ 19822138 17687481 16040168 14709340 13475381 12462944 11516385 10625900 9922180
20272I922180o52649o50579o61567n06193m22822m32565l78490k60830k48308
$$ 9922180 9269531 8618952 7957385 7451192 7028370 6595805 6217315 5956485 5708177
20263E708177k14650j64727r1061j08964k05114k56201k39532k85149k63883k01603
$$ 5708177 5493527 5328800 5237739 5128775 4923661 4667460 4427928 4142779 3878896 3677293
20253C677293k60994j92389j85207j98626j52199j74370j76694r9517j32692j22513
$$ 3677293 3416299 3223910 3038703 2840077 2687878 2513508 2336814 2237297 2104605 1982092
20243A982092j39704j35530j11869j10780k2140O4411l1272n5938M4578p4676
$$ 1982092 1842388 1706858 1594989 1484209 1462069 1526480 1495208 1439270 1483848 1409172
20233A409172k70854j51093k9474j7755j00916o6980Q1215j1645m8561R729O0647
$$ 1409172 1138318 987225 957751 939996 839080 772100 853315 841670 793109 802838 863485
20222H63485j7938n9346M9839R850o773k0428j26161O0038J60589o9098j15841
$$ 863485 845547 786201 836040 845890 839117 818689 692528 752566 913155 844057 728216
20211G28216r5785j8523M4563m552k8357N730q3717j44725K3490K7424l1605n8448
$$ 728216 632431 613908 658471 653919 625562 631292 547575 402850 426340 453764 422159 363711
20199C63711L6956J5974m5918N8304P2847Q6794n1812o7843J11417R3164J4879
$$ 363711 400667 416641 370723 429027 501874 588668 536856 469013 580430 673594 688473
20188F88473K9992L515o0139j58779j77213P2301N2350K0026m7329M9461K9777
$$ 688473 718465 721980 661841 503062 325849 398150 450500 470526 423197 472658 502435
20177E02435n197R503J067L7622n9316o7868K5972O1080m3963p5704J2317J05345
$$ 502435 497238 506741 507808 545430 486114 418246 444218 505298 461335 385631 397948 503293
20165E03293n9864M2351J8310q6981K6632j6757k5346N419m7193o1497P5335O8915
$$ 503293 443429 485780 504090 417109 443741 426984 401638 407057 359864 298367 373702 442617
20153D42617l8354r3357j4869P3791m059q5308o8785p2327K9968O0300k0726k9568
$$ 442617 404263 310906 296037 369828 365769 280461 211676 139349 169317 229617 208891 179323
20141A79323m8666k7406P2380N8446m591M3889J9405L7616J04386Q0130m3190
$$ 179323 130657 103251 175631 234077 229486 273375 292780 330396 434782 514912 471722
20130D71722m9784j43657p8254p1668m4003j7148P2845K3369N6655P5893j4695
$$ 471722 421938 278281 200027 128359 84356 67208 140053 163422 220077 295970 281275
20119B81275l8421N7219M0121l4490P1437L5190j40214j0827n9887m7653j5842
$$ 281275 242854 300073 340194 305704 377141 412331 272117 261290 201403 153750 137908
20108A37908j2694m3631j03786K2934J42758M9849O0643K0818O2941p4599l5305
$$ 137908 125214 81583 -22203 731 143489 193338 253981 274799 337740 263141 227836
20097B27836l7454j6757p2391p9145L0570J9518o6937M4752O734j3979L4473J7374
$$ 227836 190382 173625 101234 22089 52659 72177 5240 49992 56726 42747 77220 94594
20085I4594j00130p0609k7350R4154J35597J15738J2371p245L974L1766O6395
$$ 94594 -5536 -76145 -103495 -9341 126256 241994 254365 247120 251094 282860 349255
20074C49255p8723o5043k8436L0131L3532n9083l6664j4010o7357R80M9032K1908
$$ 349255 270532 205489 177053 207184 240716 181633 144969 130959 63602 64582 113614 135522
20062A35522K7075J7300m0766J09672r024j20043K6355O1642k529o3418j13021
$$ 135522 162597 179897 139131 248803 239779 119736 146091 207733 205204 141786 28765
20051B8765j4165j4484N5544m4715j2974m7534j4665J6799p3802o9531N7941N5475
$$ 28765 14600 116 55660 10945 -2029 -49563 -64228 -47429 -121231 -190762 -132821 -77346
20039g7346Q6558J02180j31668j21814P6785L0290o3365o2975P7436J04179K0458
$$ -77346 9212 111392 -20276 -142090 -65305 -35015 -98380 -161355 -83919 20260 40718
20028D0718O3076L7852q6352m0617M9471j3917o1367L4673o7472p325j1306n4367
$$ 40718 103794 141646 55294 14677 64148 50231 -11136 23537 -43935 -51260 -62566 -116933
20016a16933m6197Q2471P4247o0698K5065K5966k0508n2902n2430J26897J33262
$$ -116933 -163130 -80659 -6412 -67110 -42045 -16079 -36587 -89489 -141919 -15022 118240
20005A18240N3697j3446N0846j19081o6779J6358m3115J2645R3488J34432k3743
$$ 118240 171937 158491 209337 90256 23477 39835 -3280 9365 102853 237285 213542
19994B13542j11009p7517p4834o3752J08453R7733n5602Q1874Q7932j04638o8771
$$ 213542 102533 25016 -49818 -113570 -5117 92616 37014 118888 206820 102182 33411
19983C3411K7667J3510M2411N6728J16871l2208j39260r698p4646r6301J06688
$$ 33411 61078 74588 116999 173727 290598 258390 119130 109432 34786 -61515 45173
19972D5173N0151n2231J08703J2299J5489O8803r1112j9645K4480k0944n39J7038
$$ 45173 95324 43093 151796 164095 179584 248387 157275 137630 162110 141166 140627 157665
19960A57665K463r323j19610l2724R3538j0934q3321O5594n8184L7097l6763l5948
$$ 157665 160128 150805 31195 -1529 92009 81075 -2246 63348 5164 42261 5498 -30450
19948c0450Q6824k2242o3235K5418q795k4030L0450M1901O1288O1815q835J5567
$$ -30450 56374 34132 -29103 -3685 -12480 -36510 -6060 35841 97129 158944 150109 165676
19936A65676J06145p604j28422p4541O3456n8507j70039n6737M736O9935M0148
$$ 165676 271821 264217 135795 61254 124710 66203 -103836 -160573 -155837 -85902 -45754
19925d5754r537K3681J01909Q1797o0167o7535n2555J3087J5849j6586K8919R1975
$$ -45754 -55291 -31610 70299 152096 91929 24394 -28161 -15074 775 -15811 13108 105083
19913A05083R4446m0044j7790k7685l3660o452N9636J0363q476j50664m6810n646
$$ 105083 199529 159485 141695 114010 80350 73898 133534 143897 135421 -15243 -62053 -67699
19901f7699J03576J7508l2862K263j1701l7840J3276J21755p023j1623j0509K474
$$ -67699 35877 53385 20523 22786 11085 -26755 -13479 108276 101253 89630 79121 81595
19889H1595m4062n8915l0744N1596k0773n6264L3697j6339J6911K9750p414r6547
$$ 81595 37533 -21382 -52126 -530 -21303 -77567 -43870 -60209 -43298 -13548 -20962 -117509
19877a17509L7283J50253l3972o2221J20j0198J2403L9391o3900l24J59036K7742
$$ -117509 -80226 70027 36055 -26166 -26046 -36244 -23841 15550 -48350 -48674 110362 138104
19865A38104o0578M5102K6918l2125N4240j47791j44252m9803N0766J30671J32180
$$ 138104 77526 122628 149546 117421 171661 23870 -120382 -170185 -119419 11252 143432
19854A43432k8202n1477n8754J3631K1186K0332K188r1585n9377n2074J31035
$$ 143432 115230 63753 4999 18630 39816 60148 62336 -29249 -88626 -140700 -9665
19843i665J6875k579p842j3518Q6309L1399o4437L8110Q5202p888j5891p4642
$$ -9665 7210 4631 -3211 -16729 69580 100979 36542 74652 159854 151966 136075 61433
19831F1433P3804K769j29448l4672J11832J5729l7406o4439m6508m507K2427J0098
$$ 61433 135237 138006 8558 -26114 85718 101447 64041 -398 -46906 -51413 -28986 -18888
19819a8888N7278O25J02589N6425L8399P4103l8530j17814M609l9721n5763p7221
$$ -18888 38390 39015 141604 198029 236428 310531 272001 154187 158796 119075 63312 -13909
19807a3909k9881J64545O1335n800L3272o7499m4773m7002l9970L4684M1695R4200
$$ -13909 -43790 120755 182090 176290 209562 142063 97290 50288 10318 45002 86697 180897
19795A80897m6006q2426k2513R5243J03685O4128l2906j07156j10376r2438M4709
$$ 180897 134891 52465 29952 125195 228880 293008 260102 152946 42570 -49868 -5159
19784e159J61927p3394m7448m0398M5793M5651J23144O440n8594o9149L2726K7095
$$ -5159 156768 83374 35926 -4472 41321 86972 210116 216556 157962 88813 121539 148634
19772A48634k8938N0601J0919K2145J7484K6338K4835p6964n1865O5232n4765
$$ 148634 119696 170297 181216 203361 220845 247183 272018 195054 143189 208421 153656
19761A53656j24291M9991O4319P289l6919m825J6825P9790N826j6044l8047l9431
$$ 153656 29365 79356 143675 150964 114045 109220 126045 205835 211661 195617 157570 118139
19749A18139J0696K3851Q281L4146L2394J4793J5965j6067n2994K3945O7238q540
$$ 118139 128835 152686 160967 195113 227507 242300 258265 242198 189204 213149 280387 271847
19737B71847l040J0155k6196N0467J60382M1597M2372P2541J19023J89606J07452
$$ 271847 268807 278962 252766 303233 463615 505212 547584 620125 739148 928754 1036206
19726A036206M5284O0803J03697K3738r5511j8548R56M0192J58453R4668L4059
$$ 1036206 1081490 1142293 1245990 1269728 1174217 1155669 1156625 1196817 1355270 1449938 1483997
19715A483997J7473l2286K5596M9633r8286o0768M8195Q9478M8154j52697o2290
$$ 1483997 1501470 1469184 1494780 1544413 1446127 1385359 1433554 1523032 1571186 1418489 1356199
19704A356199o1028j01125j979r3907j92556o972j6367j13555l5036q9390p3834
$$ 1356199 1295171 1194046 1192067 1098160 905604 898632 882265 768710 733674 644284 570450
19693E70450j64110k7962k9243r3321K9027k1165R4125o0035n8208M1666r7434
$$ 570450 406340 378378 349135 255814 284841 263676 357801 297766 239558 281224 183790
19682A83790q8932O5053j1685p4791j5750J13096Q7496K9080q0646n8578q1827
$$ 183790 94858 159911 148226 73435 57685 170781 258277 287357 206711 148133 66306
19671F6306K4002M4369J7768J2305j5915p1845L840M5227Q0415j165k4347j4398
$$ 66306 90308 134677 152445 164750 148835 76990 80830 126057 206472 205307 180960 166562
19659A66562K0516q0834o5408m0525m4866K6677L722J5771N8768Q6372N4044o2514
$$ 166562 187078 106244 40836 311 -44555 -17878 -14156 1615 60383 146755 200799 138285
19647A38285l9437l1168j25620P2349R0019M7904J2766L1396m5513j03627R3311
$$ 138285 98848 67680 -57940 14409 104428 152332 165098 196494 150981 47354 140665
19636A40665K3418o1180m7196l9701Q1517J18423L638r3837m9857o0205k5446
$$ 140665 164083 102903 55707 16006 97523 215946 219584 125747 75890 15685 -9761
19625i761n1424r7773j5129O3988J19670k4910M3521N7741o6083n8335P9069M1635
$$ -9761 -61185 -158958 -174087 -110099 9571 -15339 28182 85923 19840 -38495 40574 82209
19613H2209P6877j9070p1922j9248q4180o337L9967m4629Q1904Q5661Q2153k199
$$ 82209 159086 140016 68094 48846 -35334 -41671 -1704 -46333 35571 121232 203385 201186
19601B01186r7276n7111m1910L5826N714j2600M1812J667n4194L6144N3549k7082
$$ 201186 103910 46799 4889 40715 46429 33829 75641 77308 23114 59258 112807 85725
19589H5725N0136N0639k9500N0778J4284n5426L812j6592j6402j7607o0835m6047
$$ 85725 135861 186500 157000 207778 222062 166636 170448 153856 137454 119847 59012 12965
19577A2965K16j4096J8461J7592k595M0552J8769M6133L8022n8618M015m8984
$$ 12965 13181 -915 17546 35138 32543 73095 91864 137997 176019 117401 121416 72432
19565G2432j09364L7072J49200j02528o8755j4680p1220J23178O2825j24321k0751
$$ 72432 -36932 140 149340 46812 -21943 -36623 -107843 15335 78160 -46161 -66912
19554f6912K8546K2407K4974m0167K0091O1744N8611L5046l7866m8799m5682M3025
$$ -66912 -38366 -15959 9015 -31152 -11061 50683 109294 144340 106474 57675 11993 55018
19542E5018Q2587l0372L2597K4414O2614J509o6651m3913k1001N5321q7990q3338
$$ 55018 137605 107233 139830 164244 226858 228367 161716 117803 96802 152123 64133 -19205
19530a9205j436N6395j484J4989N8939N7453O955k6981m9267m851j0809n2567
$$ -19205 -20641 35754 34270 49259 108198 165651 172606 145625 96358 91507 80698 28131
19518B8131j369N8872r328j5849r7350L3470J70113J23567l4081n6630k9705p7817
$$ 28131 26762 85634 76306 60457 -36893 -3423 166690 290257 256176 199546 169841 92024
19506I2024q9475J39295P9235Q4420k5629p873N4412j9857o4248M0171p3685p6885
$$ 92024 2549 141844 221079 305499 279870 271997 326409 306552 242304 282475 208790 131905
19494A31905N8284J27186K01458J06602l6735P3334J61431K6225O3629M7809J84198
$$ 131905 190189 317375 518833 625435 588700 662034 823465 849690 913319 961128 1145326
19483A145326K9183p7262j24998j20665K817M6499m5472p0116J4224l8321j606
$$ 1145326 1174509 1097247 972249 851584 854401 900900 855428 785312 799536 761215 759609
19472G59609N9243R0081M3649J16287r8351o6440r536l7187j38989k11681j9193
$$ 759609 818852 908933 952582 1068869 970518 904078 894542 857355 718366 506685 487492
19461D87492L0895P510n7983p4710r1942L122Q12p6742q4195M3561J3023q6296
$$ 487492 518387 525897 467914 393204 301262 304384 305196 228454 144259 187820 200843 114547
19449A14547J522O1613J6070N4029l2077k6947j522Q3416J46745O6485L6273N3595
$$ 114547 116069 177682 193752 247781 215704 188757 187235 270651 417396 483881 520154 573749
19437E73749J03440J30883J01086R1467k0613n6977J01384O813k6504p3485j31983
$$ 573749 677189 808072 909158 1000625 980012 923035 1024419 1031232 1004728 931243 799260
19426G99260j01406K6075M8590K5025l3961N062M9974J73980J7759j19988J07115
$$ 799260 697854 723929 772519 797544 763583 768645 818619 992599 1010358 890370 997485
19415I97485J04564r0893j04320p0979m7072j69897j26481L870J4401j83114p3591
$$ 997485 1102049 1011156 906836 835857 788785 618888 492407 496277 510678 327564 253973
19404B53973j3682L2717p7074m1867M0163J9324J4230j04553m302J351J9041l4934
$$ 253973 240291 273008 195934 154067 194230 213554 227784 123231 118929 120280 139321 104387
19392A04387R7036q563l3887l8867J19423J10477J7139P5489K6758r1656j18274
$$ 104387 201423 192860 158973 120106 239529 350006 367145 442634 469392 377736 259462
19381B59462J5717l2487j2729N2049N786m7062m4878N4564L3353M0395q8085m1707
$$ 259462 275179 242692 229963 282012 287798 240736 195858 250422 283775 324170 236085 194378
19369A94378p3990l1717j09075M8638K34049K2950j32514n9751k0117k329l4576
$$ 194378 120388 88671 -20404 28234 262283 285233 152719 92968 72851 70522 35946
19358C5946L0658K6971j6401o978J23515Q1389k4381q8297M2487N386K1611L6277
$$ 35946 66604 93575 77174 70196 193711 275100 250719 162422 204909 210295 231906 268183
19346B68183q0203j23037L2067P1928O3551r653o6053j3316r3986m2797J7959
$$ 268183 187980 64943 97010 168938 232489 222836 156783 143467 49481 6684 24643
19335B4643M4358J06244M2169j0330k4256n7721N8626m8157o962L1219P7390k6549
$$ 24643 69001 175245 217414 207084 182828 125107 183733 135576 128614 159833 237223 210674
19323B10674m9919l6291N2077Q9448K6693Q5793K7520j20086n928K3350n1487
$$ 210674 160755 124464 176541 265989 292682 378475 405995 285909 279981 303331 251844
19312B51844M197J35344M0370j22209L0557j9415N8355Q3936J24154P2974J42259
$$ 251844 256041 391385 431755 309546 340103 320688 379043 462979 587133 660107 802366
19301H02366K82514K5033K58J9967J70334J68095L2447l7584p4302N479J1110
$$ 802366 1084880 1109913 1110171 1130138 1300472 1468567 1501014 1463430 1389128 1394607 1405717
19290A405717j34091j06684j76942j62426q8209j20995m4683m2426j03271j19903
$$ 1405717 1271626 1164942 988000 825574 737365 616370 571687 529261 425990 306087
19280C06087m625J1811j2527P793m69l6093l5697o4940O5793J81423J3303j8063
$$ 306087 301462 313273 300746 308539 308070 271977 236280 171340 237133 418556 431859 413796
19268D13796l3464o7474M0906R3612k5054p144j3919L3276n728L6071o0942n1569
$$ 413796 380332 312858 353764 447376 422322 415178 401259 434535 428807 464878 403936 352367
19256C52367M1072J408q874P0696J35571J68717J18847J65162J88911K65074K18451
$$ 352367 393439 394847 385973 456669 592240 760957 879804 1044966 1233877 1498951 1717402
19245A717402L4544J31042J68288K2310n3078m7966m1012j9531q1586k41468k01685
$$ 1717402 1751946 1882988 2051276 2073586 2020508 1972542 1931530 1911999 1830413 1588945 1387260
19234A387260k14576j81157j97210j08171j31014j8657j25161r1331j867N155
$$ 1387260 1172684 991527 794317 686146 555132 536475 411314 319983 318116 323271
19224C23271L6320J40454L7727l2592N400J8986q4384p7553N7103M399m9786L1457
$$ 323271 359591 500045 537772 505180 510580 529566 445182 367629 424732 429131 379345 410802
19212D10802O9983n645q4817n4464n2392m9675K5910Q624J1462k3306J51055J69936
$$ 410802 480785 475140 390323 335859 283467 233792 259702 268326 279788 256482 407537 577473
19200E77473P7690K8395J4185k6892Q4184j21979j6913m177q4650j01576P0616
$$ 577473 655163 683558 697743 670851 755035 633056 616143 611966 527316 425740 496356
19189D96356J5919k8424N3703j5977k9249j9162o6473l6199o39Q3703L9069j8789
$$ 496356 512275 483851 537554 521577 492328 473166 406693 370494 369855 453558 492627 473838
19177D73838J9558N6395k5584o212j3657o3360Q421n4192j5381R5844R3952P995
$$ 473838 493396 549791 524207 517995 504338 440978 449399 395207 379826 475670 569622 577617
19165E77617n5215o4257Q3244L0686p602M2962R8345J8545m3890m2159l9119o5888
$$ 577617 522402 458145 541389 572075 564473 607435 705780 724325 680435 638276 599157 533269
19153E33269r7195L5315J27838j1303m1278l693M1881m2138N014j00959M8628
$$ 533269 436074 471389 599227 587924 546646 542953 584834 542696 547710 446751 495379
19142D95379L3120k8073k4266O1187j3492K6559R2694j8197m4694l4618o7187
$$ 495379 528499 500426 476160 537347 523855 550414 643108 624911 580217 545599 478412
19131D78412M1634K9086o7019P1991J6864M0045k3839r8865l5778j2011J07316
$$ 478412 520046 549132 482113 554104 570968 611013 587174 488309 452531 440520 547836
19120E47836P3411j32892M8813R1505N9111j8108r773J04732K2909j61392n6322
$$ 547836 621247 488355 537168 628673 687784 669676 659903 764635 787544 626152 569830
19109E69830m6530l3114N4763k5717m8631J09651O4298L5490j01088j43398p282
$$ 569830 523300 490186 544949 519232 470601 580252 644550 680040 578952 435554 428272
19098D28272m591j4115l9525k8966P3859J67497n267R8178K4463p9624L4374J28483
$$ 428272 423681 409566 370041 341075 414934 582431 577164 675342 699805 620181 654555 783038
19086G83038K3642o2599o6296N3178O7021k7404r384j3818J6232K490l5109N1831
$$ 783038 806680 744081 677785 730963 797984 770580 761196 747378 763610 766100 730991 782822
19074G82822K9475m526j2349p1688J4420Q4683j9110Q5094m4527j54969N28O8328
$$ 782822 812297 807771 795422 723734 738154 822837 803727 888821 844294 689325 689853 758181
19062G58181P7267J4804l7502L9846m1680j21989L1223L8383j3887o65m8461O0423
$$ 758181 835448 850252 812750 852596 810916 688927 720150 758533 744646 743981 695520 755943
19050G55943K09090N3783l8487M8692n0139L6286R3486M9294j35649j17233r2610
$$ 755943 965033 1018816 980329 1029021 978882 1015168 1108654 1157948 1022299 905066 812456
19039H12456M609L7863J26119J06456J1911o0208J8169k7052K3906k084N2024
$$ 812456 817065 854928 981047 1087503 1099414 1039206 1057375 1030323 1054229 1052145 1104169
19028A104169Q0836O0449J8813k7944j487L822p0812n6400P2379K0254K248J47791
$$ 1104169 1185005 1245454 1264267 1236323 1234836 1238658 1167846 1111446 1183825 1204079 1206327 1354118
19016A354118J58230j298o9241J22181J01954J5691n6657J16537P9498J04506
$$ 1354118 1512348 1511050 1441809 1563990 1665944 1681635 1624978 1741515 1821013 1925519
19006A925519J04524M0850M8039P1167Q1231M7612J13852J77639J79864J52535
$$ 1925519 2030043 2070893 2118932 2190099 2271330 2318942 2432794 2610433 2790297 2942832
18996B942832J73228J81924J59985J89344J61410R6424Q1171R4090K7295K2374
$$ 2942832 3116060 3297984 3457969 3647313 3808723 3905147 3986318 4080408 4107703 4130077
18986D130077K20664L48101M60976L53305L81353N03510M68567M83691O67557
$$ 4130077 4350741 4698842 5159818 5513123 5894476 6397986 6866553 7350244 8017801
18977H017801P21194Q26255R14201J180277J597809K141605L162514M862105P559780
$$ 8017801 8738995 9565250 10479451 11659728 13257537 15399142 18561656 23423761 30983541
18968C0983541J0168746J1088252J0878808J4118637J8823540J5675903N750159
$$ 30983541 41152287 52240539 63119347 77237984 96061524 111737427 117487586
18961A17487586L467469Q490571L836273r102638j3290069q285106p512295j0385538
$$ 117487586 120955055 129445626 133281899 124179261 110889192 102604086 95091791 84706253
18953H4706253p890825j580131K110643L114299P125169J3486278J3026660M383273
$$ 84706253 76815428 75235297 77345940 80460239 87585408 101071686 114098346 118481619
18945A18481619J111075N953466L364380r053756j4860766j0976988j0099801
$$ 118481619 119592694 125546160 128910540 119856784 104996018 94019030 83919229
18938H3919229j4262335j4588248j1147795q126763o617509n181662l374176k052747
$$ 83919229 69656894 55068646 43920851 35794088 29176579 23994917 20620741 18567994
18930A8567994j222746n86340j91310N2502K24540L55420N63244R26793J144825
$$ 18567994 17345248 16758908 16567598 16620100 16844640 17200060 17763304 18690097 19834922
18921A9834922J548306K381177L694381N521758Q671202J3051781J6608033J7286330
$$ 19834922 21383228 23764405 27458786 32980544 41651746 54703527 71311560 88597890
18913H8597890J8245940K4810620L0147733K1491313O935476Q108890J3813948
$$ 88597890 106843830 131654450 161802183 183293496 190228972 198337862 212151810
18906B12151810J097278j8330770j9697361j1857873j3604463j7038941j0600626
$$ 212151810 213249088 194918318 175220957 163363084 149758621 132719680 122119054
18899A22119054q10960L796686O303559J4442632K3215962J8578207M832905L693937
$$ 122119054 121308094 125104780 131408339 145850971 169066933 187645140 192478045 196171982
18891A96171982J0591781P87535j9323606k3924162j7100273j8844736k5226827
$$ 196171982 206763763 207551298 188227692 164303530 147203257 128358521 103131694
18884A03131694k3598495j7527701j3470707j1240612q624968n884564l921747
$$ 103131694 79533199 62005498 48534791 37294179 28669211 22784647 18862900
18877A8862900k837046k187049j694353j293261j175315j013171r16578p73824
$$ 18862900 16025854 13838805 12144452 10851191 9675876 8662705 7746127 6972303
18869F972303o80076n68129m70895l29766k84621l26820p2438o8759k98797k72737
$$ 6972303 6292227 5724098 5253203 4923437 4638816 4311996 4239558 4170799 3872002 3599265
18859C599265r4072j13116k41049j85856j53497k04825j05540j98359k63743j23781
$$ 3599265 3505193 3392077 3151028 2965172 2811675 2606850 2501310 2302951 2039208 1915427
18849A915427p1496o0828q9849n5755M2706J8645l7305j01815j17048J7776R984
$$ 1915427 1843931 1783103 1693254 1637499 1680205 1698850 1661545 1559730 1442682 1460458 1470442
18838A470442O3838q2915k1303p440k962L2384L2242L0207k4940r1919o965J01476
$$ 1470442 1534280 1451365 1430062 1422622 1419660 1452044 1484286 1514493 1489553 1397634 1390669 1492145
18826A492145P9272j3382r5567n9449k0880M286O2891j8372k1383J03100R0006
$$ 1492145 1571417 1558035 1462468 1403019 1382139 1386425 1449316 1430944 1409561 1512661 1602667
18815A602667L1801m3544o3422P4372J0619m6920q874n7657O2464Q3117K397k6773
$$ 1602667 1634468 1590924 1527502 1601874 1612493 1565573 1556699 1499042 1561506 1644623 1647020 1620247
18803A620247J9988O7776j01587l4450J18668L1403q3192J17990N1281m8269J39897
$$ 1620247 1640235 1708011 1606424 1571974 1690642 1722045 1638853 1756843 1808124 1759855 1899752
18792A899752K08155J30852M8297L2798O0992N2923K1823J82341J42338J91348
$$ 1899752 2107907 2238759 2287056 2319854 2380846 2433769 2455592 2637933 2780271 2971619
18782B971619J62217M7130L8618K08914K29876K30750K15871K31174K67388K05399
$$ 2971619 3133836 3180966 3219584 3428498 3658374 3889124 4104995 4336169 4603557 4808956
18772D808956K73723M02006L81611M80328O23066P76335P31060R50846J025585
$$ 4808956 5082679 5484685 5866296 6346624 6969690 7746025 8477085 9427931 10453516
18763A0453516R89236Q17891Q26098R82005J102915J442995J786227K297290L109919
$$ 10453516 11442752 12260643 13086741 14068746 15171661 16614656 18400883 20698173 23808092
18754B3808092M370701O447356R441648J3794018J7874253J9600959K1154999
$$ 23808092 28178793 34626149 44067797 57861815 75736068 95337027 116492026
18747A16492026K8684773L9924693M0026425K5523235J7752145L0435346L7995859
$$ 116492026 145176799 185101492 225127917 250651152 268403297 298838643 336834502
18740C36834502J7549258j3029742j8208010l792244p710812l0756270m4036045
$$ 336834502 354383760 341354018 323146008 319353764 311642952 280886682 236850637
18733B36850637l5721390k5673626k8376038l1467228k6802342j9241551j4660129
$$ 236850637 201129247 175455621 147079583 115612355 88810013 69568462 54908333
18726E4908333j2264312r284585o547537m449463l050392k239457j647091j273368
$$ 54908333 42644021 33359436 26811899 22362436 19312044 17072587 15425496 14152128
18718A4152128r58358p96888o19773m22836l32125k84174k60251k7163R9758N3423
$$ 14152128 13193770 12396882 11777109 11354273 11022148 10737974 10477723 10450560 10550318 10603741
18708A0603741J70846M22290M64136O96763J005544J373296J880181K739988L978060
$$ 10603741 10774587 11196877 11661013 12357776 13363320 14736616 16616797 19356785 23334845
18699B3334845O212645R042605J1261523J1833075J3332028J9080502K5158341
$$ 23334845 29547490 38590095 49851618 61684693 75016721 94097223 119255564
18692A19255564K2642668J3055237J1568795K1049159K1941920N520823j0956345
$$ 119255564 141898232 154953469 166522264 187571423 209513343 215034166 204077821
18685B04077821r066461j015847p777270k2262990k6901656j9666862j5349536
$$ 204077821 195011360 193995513 186218243 163955253 137053597 117386735 102037199
18678A02037199j8246189j9076728j5211735j0784732q509022p192019n345553
$$ 102037199 83791010 64714282 49502547 38717815 30208793 23016774 17671221
18671A7671221l712170k497005j713867j231964r92532p87351p35853n64032n35087
$$ 17671221 13959051 11462046 9748179 8516215 7523683 6736332 6000479 5436447 4901360
18662D901360l92613m46058m64317l79947l55542l11512k55896k55808j55781
$$ 4901360 4508747 4062689 3598372 3218425 2862883 2551371 2295475 2039667 1883886
18653A883886j27618l5062j52720j19694j16412j91651q8756l2673N199Q907m8582
$$ 1883886 1756268 1721206 1568486 1448792 1332380 1140729 1051973 1019300 1024499 1033406 984824
18642I84824j31905j20345L340n1175J44637m6541n3155R04L7745L8780m7843
$$ 984824 852919 732574 735914 684739 829376 782835 729680 730584 768329 807109 759266
18631G59266p361j4179J4116o2114m4047j36770j07173o4991k0555P0421m0290
$$ 759266 751905 737726 751842 689728 645681 508911 401738 336747 316192 386613 346323
18620C46323k7668q2317o1932q1703M5391R7423J4642j8715l775R943K2873J8557
$$ 346323 318655 236338 174406 92703 138094 235517 250159 231444 227669 237612 260485 279042
18608B79042l2461N4288J7188j01557M0923N1046q3534j3201j8759J1015P6761
$$ 279042 246581 300869 318057 216500 257423 308469 224935 211734 192975 203990 280751
18597B80751J8094j25326K9124j3574p265k8926M1151l2810j15420p4189o934
$$ 280751 298845 173519 202643 189069 181804 152878 194029 161219 45799 -28390 -35324
18586c5324P9225R28k3649J36601j009J3326L4445l8957J1821M3662Q0429O9032
$$ -35324 43901 44829 21180 157781 156772 170098 204543 165586 177407 221069 301498 370530
18574C70530q000O1215L1139j33270j02483O4279K9176k9717o2244n2889M7996
$$ 370530 362530 423745 454884 321614 219131 283410 312586 282869 220625 167736 215732
18563B15732m4038P8313J60036O5501r4721N6740L1486r1028o6911R0827L7288
$$ 215732 171694 250007 410043 475544 380823 437563 469049 378021 311110 401937 439225
18552D39225k8188j05388j50938q3614j452R2714N2564J1284o4740m3573n8839
$$ 439225 411037 305649 154711 71097 69645 162359 214923 226207 161467 117894 59055
18541E9055n3954l4945M4103K2050N6627m5439k1956o3317N2287p1554q9916j07860
$$ 59055 5101 -29844 14259 36309 92936 47497 25541 -37776 14511 -57043 -146959 -254819
18529b54819M0545M8481N7046K8494P5841j3400J562Q8779n9511l8677J3125l5556
$$ -254819 -214274 -165793 -108747 -80253 -4412 -17812 -16250 72529 13018 -25659 -12534 -48090
18517d8090O2568J46625J85220J2242m3025p9585N2347J17338J3841j5173L539
$$ -48090 14478 161103 346323 358565 315540 235955 288302 405640 419481 404308 407847
18506D07847j5589l8206j01936J480O6536j7694J2554p8112n6263L0812J02090
$$ 407847 392258 354052 252116 253596 320132 302438 314992 236880 180617 211429 313519
18495C13519J09401j2788q3966J6041j8080L9516L7040K5851N8791J1893l6852
$$ 313519 422920 410132 326166 342207 324127 363643 400683 426534 485325 497218 460366
18484D60366k9383Q4568o0189p1874L756k9250l3254L8526l9391j00383m9133
$$ 460366 430983 515551 455362 383488 387244 357994 324740 363266 323875 223492 174359
18473A74359o1899j08903o4505n3074Q3032K4975q3882J3542J05907O9123J526
$$ 174359 112460 3557 -60948 -114022 -30990 -6015 -89897 -76355 29552 98675 100201
18462A00201K0331o9494o4250q8851o4424N0968P1150k8281m8104L6289M3882
$$ 100201 120532 51038 -13212 -102063 -166487 -115519 -44369 -72650 -120754 -84465 -40583
18451d0583J4861n6269J0788K148m3774Q231R7067L6591j0112M8827m1870N3475
$$ -40583 -25722 -81991 -71203 -69055 -112829 -104598 -7531 29060 18948 67775 25905 79380
18439G9380k4206m2280n9192m5019l0797R5986J82039M1054K8471J48354J43742
$$ 79380 55174 12894 -46298 -91317 -122114 -26128 155911 196965 225436 373790 517532
18428E17532R3311J24536J87076L37840J23005L70K8406J2019j20110j67672k15327
$$ 517532 610843 735379 922455 1260295 1383300 1383670 1412076 1424095 1303985 1136313 920986
18417I20986j49724n3070o89r2325l8582J3343M6273J03755J63300J33218L5049
$$ 920986 771262 718192 717503 625178 586596 599939 646212 749967 913267 1046485 1081534
18406A081534J10250k3922j28758j40369r8891j13800p5114j01087j32144j15696
$$ 1081534 1191784 1167862 1039104 898735 799844 686044 610930 509843 377699 262003
18396B62003j39527l4918k3786j2015j01K1395L2300n2160m6652r888O1369m3198
$$ 262003 122476 87558 63772 51757 51656 73051 105351 53191 6539 -3349 58020 14822
18384A4822j809J16198m5049o7437J0521P273N6382J08055J52118M3439M3412
$$ 14822 13013 129211 84162 16725 27246 34519 90901 198956 351074 394513 437925
18373D37925O2550K54349J22075p0247n676N2646j42823r5065M7811m0715p2963
$$ 437925 500475 754824 876899 806652 800976 853622 710799 615734 663545 622830 549867
18362E49867j24847k5975P3499M0308l0796J0623J14745J12045L9668J06349p0667
$$ 549867 425020 399045 472544 512852 482056 492679 607424 719469 759137 865486 794819
18351G94819j36393j27327l7112N498j00147j74400j33637q9351M2644J44834
$$ 794819 658426 531099 493987 499485 399338 224938 91301 1950 44594 189428
18341A89428p1721J0255M9693n5771m6343j8478j27418j8063o0507Q7796M0997
$$ 189428 117707 127962 177655 121884 75541 57063 -70355 -88418 -148925 -61129 -20132
18330b0132o0767q9664K1840J04555M2041P3880M0252j27901m2837m2602k1759
$$ -20132 -80899 -170563 -148723 -44168 -2127 71753 112005 -15896 -58733 -101335 -123094
18319a23094M1108L2514j2625j5885k307M1916J2589m1983m5127p3896N6551K4768
$$ -123094 -81986 -49472 -62097 -77982 -80289 -38373 -25784 -67767 -112894 -186790 -130239 -105471
18307a05471o4361k4899l4482M1365R3019L5317l4378j06017J6332K5314Q8072
$$ -105471 -169832 -194731 -229213 -187848 -94829 -59512 -93890 -199907 -183575 -158261 -70189
18296g0189m9251j1576P633L0696K512l2341O4604M6762N3180K9130n5602j33750
$$ -70189 -119440 -131016 -123383 -92687 -90175 -122516 -57912 -11150 42030 71160 15558 -118192
18284a18192J9528N5354L734N177O8522L6289J654m6255p7753j4306m5600L2784
$$ -118192 -98664 -43310 -39576 -34399 34123 70412 72066 25811 -51942 -66248 -111848 -79064
18272g9064M8476j7103M1403K5732K7555j0596P8074P2264M6169k4077q5831K1137
$$ -79064 -30588 -47691 -6288 19444 46999 36403 114477 186741 232910 208833 123002 144139
18260A44139n4667n7404N957J2986m5551K602o350O1001p51n7840j7671L7677
$$ 144139 89472 32068 38025 51011 5460 8062 1712 62713 61962 4122 -13549 24128
18248B4128J20806J12768o7843o859o2309K224M5525n9244o6157L5780Q8036k1395
$$ 24128 144934 257702 189859 183000 120691 122915 168440 109196 43039 78819 166855 145460
18236A45460o5659M1255J25268j05624j19475k1289j139k2164J7046M2396j14887
$$ 145460 79801 121056 246324 140700 21225 -64 -1203 -23367 -6321 36075 -78812
18225g8812K9464O2501O095l626K440j2487J18434J8817k0369Q4263j8201n1925
$$ -78812 -49348 13153 19248 15622 18062 5575 124009 142826 122457 206720 188519 136594
18213A36594o1454p037O0954P2099l7710j44947N2701J07005J1162K7819L7944
$$ 136594 75140 68103 129057 201156 163446 18499 71200 178205 189367 217186 255130
18202B55130j26234j17765Q9251Q9546J09809J62825J60666P1569L6780P2132
$$ 255130 128896 11131 100382 189928 299737 462562 623228 694797 731577 803709
18192H03709J68222J42538J58587J87081J22000K43155J01258r0043j25174l9042
$$ 803709 971931 1114469 1273056 1460137 1582137 1825292 1926550 1836507 1711333 1672291
18182A672291j77948k53210j35731j46721q5926p4404k21488j51565n4221N4629
$$ 1672291 1494343 1241133 1105402 958681 872755 798351 576863 425298 371077 425706
18172D25706o995K2029O8201o0719r949N782p3069m9757o8978J3184N1688o971
$$ 425706 418711 440740 508941 448222 438273 444055 370986 321229 252251 265435 317123 310152
18160C10152n0150J52677J11972o3271O8568j0266k5939j5703J24313P6881L952
$$ 310152 260002 412679 524651 461380 529948 519682 493743 478040 602353 679234 683186
18149F83186n0658o4774p5743Q842J07167J03460J71153K09017K07411J70951
$$ 683186 632528 567754 492011 500853 608020 711480 882633 1091650 1299061 1470012
18139A470012J87738K30290J33567J53776P9990Q7513J22519O745P3444N6461
$$ 1470012 1657750 1888040 2021607 2175383 2255373 2342886 2465405 2472150 2545594 2602055
18129B602055k1628k7002L4200N1358K35827Q9462R1826J57719L17104K79191
$$ 2602055 2580427 2553425 2587625 2638983 2874810 2964272 3056098 3213817 3530921 3810112
18119C810112L45295N15038O68331J058240J273386J785159K385567L159164M611793
$$ 3810112 4155407 4670445 5338776 6397016 7670402 9455561 11841128 15000292 19612085
18110A9612085P336061J2172579K2679845M1388305N2596694K5315503k4602921
$$ 19612085 26948146 39120725 61800570 103188875 155785569 181101072 156498151
18103A56498151k9672871j2685254k2684392l1411301k2383138j3011262p492916
$$ 156498151 126825280 114140026 91455634 60044333 37661195 24649933 17157017
18096A7157017m389480k917016k061155j387930j062530r17386o92188m66134
$$ 17157017 12767537 9850521 7789366 6401436 5338906 4421520 3729332 3263198
18088C263198l30348m95523m94932k83968o2716r4993k03361j08271j16191j26037
$$ 3263198 2932850 2437327 1942395 1658427 1595711 1500718 1297357 1189086 1072895 946858
18078I46858j23247j31195p2361j0150k9589r6075j42422q3179n6221J2177p1646
$$ 946858 823611 692416 620055 609905 580316 484241 341819 258640 202419 214596 142950
18067A42950P3118L68Q6516m7683r2204m9828l1374L9241R3748J8289k1340M7379
$$ 142950 216068 216436 302952 255269 163065 113237 81863 121104 214852 233141 211801 259180
18055B59180M4319q5983L9676p0724m1531k1506j06452M7474N910Q3392o8531
$$ 259180 303499 217516 257192 186468 144937 123431 16979 64453 70363 153755 85224
18044H5224o4629k8966l4056M2300n55j08187n7893J45541Q8528J10108r0354
$$ 85224 20595 -8371 -42427 -127 -682 -108869 -166762 -21221 67307 177415 87061
18033H7061n1801P2166k7669K6542J407p5646N6707J0125p1590j520M9935L3216
$$ 87061 35260 107426 79757 106299 107706 32060 88767 98892 27302 25782 75717 108933
18021A08933j08358o3768p330p2638q314N6538M0663J01080l9707m1826N180N8719
$$ 108933 575 -63193 -70523 -143161 -151475 -94937 -54274 46806 7099 -34727 -29547 29172
18009B9172N2885m1748m0778O599P2883P3751n1915o1145q5563J1221m2808o8282
$$ 29172 82057 40309 -469 6130 79013 152764 100849 39704 -45859 -34638 -77446 -145728
17997a45728J17405k9837m0083P3454R7854n3408R9616J00472n7915M1201k6952
$$ -145728 -28323 -58160 -98243 -24789 73065 19657 119273 219745 161830 203031 176079
17986A76079j00060n264J189K5013N9444N212p2739J1003J11811N7090j34852
$$ 176079 76019 70755 71944 96957 156401 161613 88874 99877 211688 268778 133926
17975A33926p4209J6626J9885O3442k331j7383n6998o2281k5424O7376k2716J6366
$$ 133926 59717 76343 96228 159670 157339 139956 82958 20677 -4747 62629 39913 56279
17963E6279j10020p3379m8861m6226j4448j1305L7126J47485R2532l9415o3085
$$ 56279 -53741 -127120 -175981 -222207 -236655 -247960 -210834 -63349 29183 -10232 -73317
17952g3317r6487p5841J3058L9768M8421k205M3544Q2849l454o5972k6280n644
$$ -73317 -169804 -245645 -232587 -192819 -144398 -146603 -103059 -20210 -23664 -89636 -115916 -121560
17940a21560P2381L5506N0215m2888k9563M4951o3815p2880R99P998R7704P1213
$$ -121560 -49179 -13673 36542 -6346 -35909 9042 -54773 -127653 -126654 -118656 -20952 50261
17928E0261k1295q7707m1753N393L5804j36475o0387O9397m6108r3601J06888
$$ 50261 28966 -58741 -100494 -95101 -59297 -195772 -256159 -186762 -232870 -326471 -219583
17917b19583J25373P7021K0916l5400q7647l8528j0571m7093M1630P9736L6744
$$ -219583 -94210 -17189 3727 -31673 -119320 -157848 -168419 -215512 -173882 -94146 -57402
17906e7402j1875J1185j1514M9703l9057r5767o2160n3845k4651L618k4721L3302
$$ -57402 -69277 -58092 -69606 -19903 -58960 -154727 -216887 -270732 -295383 -291765 -316486 -283184
17894b83184O0020j3274M6990k879M6847J4520Q9039M817m6118O7362N1869j2426
$$ -283184 -223164 -236438 -189448 -192327 -145480 -130960 -41921 -37104 -83222 -15860 36009 23583
17882B3583m0030l9751M787J578L2645k9232k4323J0966Q3536l7937l5193M2636
$$ 23583 -16447 -56198 -51411 -49833 -17188 -46420 -70743 -59777 23759 -14178 -49371 -6735
17870f735M9899j6744M747M2938N9827l1893j447L6098j34620l6998q1988q1950
$$ -6735 43164 26420 31167 74105 133932 102039 100592 136690 2070 -34928 -116916 -198866
17858a98866o2269M6201L1446Q8589J0759l991N351o4953n3366k4207J5299N4800
$$ -198866 -261135 -214934 -183488 -94899 -84140 -88131 -82780 -147733 -201099 -225306 -210007 -155207
17846a55207N8196J9218J7685L3330l056m1750j56381m8740M3349J5859R644M9237
$$ -155207 -97011 -77793 -60108 -26778 -29834 -71584 -227965 -276705 -233356 -217497 -207853 -158616
17834a58616M7573N4689j01118m6372K4967l1556n5958K5159O5799m3766P7970
$$ -158616 -111043 -56354 -157472 -203844 -178877 -210433 -266391 -241232 -175433 -219199 -141229
17823a41229N3923k6540K7679m9264l3584p004m59L9081L9487j0602o950K5429
$$ -141229 -87306 -113846 -86167 -135431 -169015 -176019 -176478 -137397 -97910 -108512 -115462 -90033
17811i0033Q2318K6331o5751k2120n8320l8377o8722j1544J00164J6292n7716
$$ -90033 -7715 18616 -47135 -69255 -127575 -165952 -234674 -246218 -146054 -129762 -187478
17800a87478O5186j2249m6578K07J503K6743N3208L8484q9880n4128k4160L4929
$$ -187478 -122292 -134541 -181119 -180912 -179409 -152666 -99458 -60974 -150854 -204982 -229142 -194213
17788a94213J32213K5381k4617k0858k5092P4848k4174J5329Q7538K043l8796
$$ -194213 -62000 -36619 -61236 -82094 -107186 -32338 -56512 -41183 46355 48398 9602
17777I602l1445k934l0655l6213K0707J3905P0238P2953n9896o466m6148p8196
$$ 9602 -21843 -24777 -55432 -91645 -70938 -57033 13205 86158 26262 19796 -26352 -104548
17765a04548n8551M0626J10575J7143j52266P745J64008K4363k3598k1182q0472
$$ -104548 -163099 -122473 -11898 5245 -147021 -139276 24732 49095 25497 4315 -76157
17754g6157m2414L4491J15371J4465P019L5246j17250n9372m641l3015q4195R3443
$$ -76157 -118571 -84080 31291 45756 52775 88021 -29229 -88601 -93242 -126257 -210452 -117009
17742a17009N0163L3312p6859N1540R1p6968L1882M5967O2193Q4954J6986j0525
$$ -117009 -66846 -33534 -110393 -58853 -58762 -135730 -103848 -57881 4312 89266 106252 95727
17730I5727m3582j1933o5339m7247L9579k8326k5228m214M495J2744M463l4082
$$ 95727 52145 40212 -25127 -72374 -32795 -61121 -86349 -90563 -86068 -73324 -68861 -102943
17718a02943r7846J2915n809J7699j596Q4447n142M3m7310j13367N7484J04865
$$ -102943 -200789 -187874 -193683 -175984 -177580 -93133 -98275 -98232 -145542 -258909 -201425 -96560
17706i6560o2823j9258Q9781O523j4174j0667o7936L1947N7412N0802q394J2374
$$ -96560 -159383 -178641 -88860 -82337 -96511 -107178 -175114 -143167 -85755 -34953 -43347 -30973
17694c0973p6941q2405J08376M1005m4778p1165K878R451R947K3906L0581m8553
$$ -30973 -107914 -190319 -81943 -40938 -85716 -156881 -154003 -144552 -134605 -110699 -80118 -128671
17682a28671j13063M0309M6458O657o3081L6368L6677l411M8624M2018j6080k3707
$$ -128671 -241734 -201425 -154967 -148310 -211391 -175023 -138346 -141757 -93133 -51115 -67195 -90902
17670i0902O04R2829M4230R062L7390O2049j9208l4230j31787o5127O2677q6694
$$ -90902 -90298 2531 46761 55823 93213 155262 136054 101824 -29963 -95090 -32413 -119107
17658a19107m7860r39R2454K4080R7971R908l1308J896L7262n5269m8677j21926
$$ -119107 -166967 -167906 -75452 -51372 46599 56507 25199 27095 64357 9088 -39589 -161515
17646a61515M6043P6565R3939j41302N7929M0993M7505k8148k8136J06235q1745
$$ -161515 -115472 -38907 55032 -86270 -28341 12652 60157 32009 3873 110108 28363
17635B8363j32646k4836l0763p8578P8303N3614N3304r084n5877K5992K1702m2031
$$ 28363 -104283 -129119 -159882 -238460 -160157 -106543 -53239 -62323 -118200 -92208 -70506 -112537
17623a12537J0240N3378J25611n0641k6297j01865j6996J2837o2293n2077j1749
$$ -112537 -102297 -48919 76692 26051 -246 -102111 -119107 -106270 -168563 -220640 -232389
17612b32389R9942R669M866N2675O8057M8379j72814r8302M3865J2761o9176p57
$$ -232389 -132447 -122778 -117912 -65237 2820 51199 -121615 -219917 -176052 -163291 -232467 -233224
17600b33224n1918k5390M5551J38853M9824k1013N0926M6633K9986j616m3492
$$ -233224 -285142 -310532 -264981 -126128 -76304 -97317 -46391 242 30228 28612 -14880
17589a4880l4677o7419J5207j3270k9958O7129N5460m2966J8307P2003J0759o5717
$$ -14880 -49557 -116976 -101769 -115039 -144997 -77868 -22408 -65374 -47067 24936 35695 -30022
17577c0022j4007L9515P4106L5139p3467q9849j2275J2941k6104M520R2696J01151
$$ -30022 -44029 -4514 69592 104731 31264 -58585 -70860 -57919 -84023 -79503 13193 114344
17565A14344l0522o5161o2734m8084o4171m2313J24984l1944o9290p7326J24545
$$ 114344 83822 18661 -44073 -92157 -156328 -198641 -73657 -105601 -174891 -252217 -127672
17554a27672R903N515l741M1008J2831l4611k791M7578L3005m3023l1828p5803
$$ -127672 -117769 -112254 -115995 -74987 -62156 -96767 -99558 -51980 -18975 -61998 -93826 -169629
17542a69629j3783l39N407O5701P3369O749P3475l5679n0938q1800Q4219L3641
$$ -169629 -183412 -183751 -178344 -112643 -39274 -32525 40950 5271 -45667 -127467 -43248 -9607
17530i607o7553o961L8623O4804M1827m5474p4565p3538J09204P0965J7362o7786
$$ -9607 -77160 -84121 -45498 19306 61133 15659 -58906 -132444 -23240 47725 65087 -2699
17518b699r881L6543P3839j28493p9878Q2072L0587q3602l5333K6419M2151n3498
$$ -2699 -12580 23963 97802 -30691 -110569 -28497 2090 -81512 -116845 -90426 -48275 -101773
17506a01773k3029r293J589K9759P9704o4647k4752P2121k4096J6133n7951j3709
$$ -101773 -124802 -134095 -132506 -102747 -23043 -87690 -112442 -40321 -64417 -48284 -106235 -119944
17494a19944K7411J5558M8710j1196N4461O789m8653N3873K1329J9651q0277J5193
$$ -119944 -92533 -76975 -28265 -39461 15000 21789 -26864 27009 48338 67989 -12288 2905
17482B905P303q5466j4691k0725M9982O6404P252l2441M8844j0717j21630L809
$$ 2905 10208 -75258 -89949 -110674 -60692 5712 12964 -19477 29367 18650 -102980 -99171
17470i9171M0010j10149k4435J04783N7072n7557q5179k8520N8028L3918J26508
$$ -99171 -59161 -169310 -193745 -88962 -31890 -89447 -174626 -203146 -145118 -111200 15308
17459A5308M7606r6915m7651l5561n3432J03122J26147j2470o1404n5110m8055
$$ 15308 62914 -34001 -81652 -117213 -170645 -67523 58624 46154 -15250 -70360 -118415
17448a18415m0061J0881R3829J20264P7501Q5416K9314J83510K72329J19865j3839
$$ -118415 -158476 -147595 -53766 66498 143999 229415 258729 442239 714568 834433 820594
17437H20594j51874p4357q6934j04477j95362j15472r0434O5854O4679l0451O0453
$$ 820594 668720 594363 507429 402952 207590 92118 1684 67538 132217 101766 162219
17426A62219J0892j07566r7270k1862k6011O3865p861P4454k9199j34201N5102
$$ 162219 173111 65545 -31725 -53587 -79598 -15733 -23594 50860 21661 -112540 -57438
17415e7438k1066n9995O3246n467l1821J5742P7724k656m4134N3271l4276k6740
$$ -57438 -78504 -138499 -75253 -80720 -112541 -96799 -19075 -21731 -65865 -12594 -46870 -73610
17403g3610j9873K9122l2075k2511k9312P8196J03054K7785p2806p408L473m2712
$$ -73610 -93483 -64361 -96436 -118947 -148259 -70063 32991 60776 -12030 -19438 -15965 -58677
17391e8677j6480k6844R5049P1191M3669n0064k7006o2367L5121J1562J340L5872
$$ -58677 -75157 -102001 -6952 64239 107908 57844 30838 -31529 3592 15154 16494 52366
17379E2366n503K3264k1578J18021J9925r9253J703p4687j13985j3412Q8599J39741
$$ 52366 46863 70127 48549 166570 186495 87242 88945 14258 -99727 -113139 -24540 115201
17367A15201O0221l4074q4805K78M1330j13200j36660m4035J7942J41695P5831
$$ 115201 175422 141348 56543 56821 98151 -15049 -151709 -195744 -177802 -36107 39724
17356C9724m7971R590P782k1008J1318P3334O2356q2268j70357o2445R7293J27922
$$ 39724 -8247 1343 9125 -11883 -565 72769 135125 52857 -117500 -179945 -82652 45270
17344D5270O2306n9964L7688n5914j25375o4459P0648N9521N1538Q172k9417n2899
$$ 45270 107576 47612 85300 29386 -95989 -160448 -89800 -30279 21259 29431 14 -52885
17332e2885N34Q156P1773J4795l427k4645p8037j9913P1468O3684o365j8431k0620
$$ -52885 -52351 -44195 27578 42373 38946 14301 -63736 -83649 -12181 51503 45138 26707 6087
17319F087j25351p5553m2393Q8622J04980R5647j2685l0045p87l8330l6479K7925
$$ 6087 -119264 -194817 -237210 -148588 -43608 52039 39354 9309 8522 -29808 -66287 -38362
17307c8362m101m3338l9271o068J05161L4151m3224K8330k8662m2511k8935l727
$$ -38362 -42463 -85801 -125072 -131140 -25979 8172 -35052 -6722 -35384 -77895 -106830 -110557
17295a10557n7025p7754K2602N6807K1309O0962K918l3691j03072m4944L6382
$$ -110557 -167582 -245336 -222734 -165927 -144618 -83656 -80738 -114429 -217501 -262445 -226063
17284b26063M9940R8472p3029K158L8580l5350J7379J02401N4103J2200O218k4661
$$ -226063 -176123 -77651 -150680 -148522 -109942 -145292 -127913 -25512 28591 40791 47009 22348
17272B2348K2706j9474k8598k280j7213p7764n9780K0268N7153P8477l0764k2312
$$ 22348 45054 25580 -3018 -5298 -22511 -100275 -160055 -139787 -82634 -4157 -34921 -57233
17260e7233N6845Q1384J46711j1212o5021j6955N7608K9896j5629p3003n1872
$$ -57233 -388 80996 227707 216495 151474 134519 192127 222023 206394 133391 81519
17249H1519k354o5213N1717R1359K1266r9249l8466n4057O428M0075m7799K0449
$$ 81519 79165 13952 65669 157028 178294 79045 40579 -13478 -7050 33025 -14774 5675
17237E675o679P7106l4038j13105k8250m3312L8561M0037k3168K697o0457k4568
$$ 5675 -1004 76102 42064 -71041 -99291 -142603 -104042 -64005 -87173 -84476 -144933 -169501
17225a69501k1270Q9323Q5043k7447p6627l496k6508M804M243J0634O4580N0414
$$ -169501 -190771 -101448 -16405 -43852 -120479 -123975 -150483 -145679 -141436 -130802 -66222 -15808
17213a5808Q8094Q3613m6197q6973j36820n7233Q8613K2278J02214r9491j72255
$$ -15808 72286 155899 109702 22729 -114091 -171324 -82711 -60433 41781 -57710 -229965
17202b29965j3927O7149Q7822l2099M0527N8873N8871P1453O8596m1807j58909
$$ -229965 -243892 -176743 -88921 -121020 -80493 -21620 37251 108704 177300 135493 -23416
17191b3416m1912Q454l0921L0746K7887n2291M8420l1397N8138R3978M2717J3287
$$ -23416 -65328 -56874 -87795 -57049 -29162 -81453 -33033 -64430 -6292 87686 130403 143690
17179A43690Q1853o8416j12598q6564j06387J03125J29477j4990j5721J00072
$$ 143690 225543 157127 44529 -42035 -148422 -45297 84180 69190 53469 153541
17169A53541Q0423M3084o9586j6134l2356p955K8564Q4028m3156k9946L7717n7555
$$ 153541 233964 277048 207462 191328 158972 151017 179581 263609 220453 190507 228224 170669
17157A70669o9555j15159j1461R7294Q8170p2895j15203r8442n0339m4173Q0L3145
$$ 170669 101114 -14045 -25506 71788 159958 87063 -28140 -126582 -176921 -221094 -221014 -187869
17145a87869N0768J16647K5321l3658l1936J11728O2901j79285k5201k629Q1700
$$ -187869 -137101 -20454 4867 -28791 -60727 51001 113902 -65383 -90584 -93213 -11513
17134a1513J9282O8842l0833j21188K6515R3555k2359k3301o0037j6855Q5730
$$ -11513 7769 76611 45778 -75410 -48895 44660 22301 -1000 -61037 -77892 7838
17123G838J9244J8282j952K4027p0785k6880k5410o053Q1264n1841p05J40910
$$ 7838 27082 45364 43412 67439 -3346 -30226 -55636 -61689 19575 -32266 -32971 107939
17111A07939N1044M9476M1402n8422k8904K8250P0493m5862l6595l8203n5914
$$ 107939 158983 208459 249861 191439 162535 190785 261278 215416 178821 140618 84704
17100H4704j4253q5349j48532k8427j540O9917q488J2142N8093Q4844O2864J3411
$$ 84704 70451 -14898 -163430 -191857 -193397 -123480 -131968 -119826 -61733 23111 85975 99386
17088I9386j02868m3138K8171K3228l192p5481K3918J43805Q38m5957j22860J1093
$$ 99386 -3482 -46620 -18449 4779 1587 -73894 -49976 93829 94667 48710 -74150 -63057
17076f3057P9702p6814L4048M6949m9077n7970k7270J47307M6813o7597k2961
$$ -63057 16645 -60169 -26121 20828 -28249 -86219 -113489 33818 80631 13034 -9927
17065i927L3085o4281j25026j1416R38K6374L1796J7900N7494N5091N2288K1373
$$ -9927 23158 -41123 -166149 -177565 -176627 -150253 -118457 -100557 -43063 12028 64316 85689
17053H5689m7360k2258j0068J5877M4373J214j11259j12170k8812l6956j5199
$$ 85689 38329 16071 6003 21880 66253 67467 -43792 -155962 -184774 -221730 -236929
17042b36929M2200J26897J79683n0058l084k1826R783Q245n4466j08779K3491
$$ -236929 -194729 -67832 111851 61793 58709 36883 46666 54911 445 -108334 -84843
17031h4843J3456O036O2560O1252N9061l540r3525o3559N3327j0335m060N1570
$$ -84843 -71387 -65351 -2791 58461 117522 113982 20457 -43102 10225 -110 -4170 47400
17019D7400m0252q3702k3565K35540N8699j33046j72201k5198J8245R2724l738
$$ 47400 7148 -76554 -100119 135421 194120 61074 -111127 -136325 -118080 -25356 -29094
17008b9094l9560N1437K0153k31j43328o132m1125J6148k2847N8117Q3071N3330
$$ -29094 -68654 -17217 2936 2705 -140623 -146755 -187880 -171732 -194579 -136462 -53391 -61
16996f1n208j8605N4227m5532o6829j2979p0037M8629J22190p0999n441J4207
$$ -61 -5269 -23874 30353 -15179 -82008 -94987 -165024 -116395 5795 -65204 -70645 -56438
16984e6438J6341K496j11547p9181J80633P3669j32689l4043P744l900j6983J8217
$$ -56438 -40097 -37601 -149148 -228329 -47696 25973 -106716 -140759 -133015 -136915 -153898 -135681
16972a35681J41628P9354J7533j51331M2799N4281l996n6263k4974J19832j0176
$$ -135681 5947 85301 102834 -48497 -5698 48583 44587 -11676 -36650 83182 73006
16961G3006l7184J19190k548q3121j31229l5267N3789q5451p5354L7992J5110
$$ 73006 35822 155012 152464 69343 -61886 -97153 -43364 -128815 -204169 -166177 -151067
16950a51067L0569P681K7898n2900R3209R0033M1917J544o9753j07106K273M956
$$ -151067 -120498 -112817 -84919 -137819 -44610 45423 87340 88884 19131 -87975 -85702 -80746
16938h0746P5604M9122k9103p33j3514K4415P1276J8256K6447j15354k4384R8067
$$ -80746 -5142 43980 14877 14144 630 25045 96321 114577 141024 25670 1286 99353
16926I9353M434j03591O399O0272p5206j05032R799L6439R5987M2210n6858L6597
$$ 99353 103787 196 6595 66867 -8339 -113371 -103572 -67133 28854 71064 14206 50803
16914E0803M6055j08426j04634P9193O7985q7768L970l8117L5740P3349j5512
$$ 50803 96858 -11568 -116202 -37009 30976 -56792 -52822 -90939 -55199 18150 2638
16903B638j11924M160L7965j3950N118J5078Q6454P3101M2889j14401p6419n8394
$$ 2638 -109286 -105126 -67161 -81111 -75993 -60915 25539 98640 141529 27128 -49291 -107685
16891a07685M2613R6817O5496n8763r0040j3424J22962k8521r8462n7341l0783
$$ -107685 -65072 31745 97241 38478 -51562 -64986 57976 29455 -69007 -126348 -157131
16880a57131j1481N901J08960O2941n6497j27151l5297P1568J628P7131Q5853
$$ -157131 -168612 -162711 -53751 9190 -47307 -174458 -209755 -138187 -136559 -59428 26425
16869B6425m9343J7942l2463M3599l2063L5586J3998m8728J2743k6331k3030R524
$$ 26425 -22918 -4976 -37439 6160 -25903 9683 23681 -25047 -12304 -38635 -61665 -52141
16857e2141m3123l1824K3208L0968J9295N978J7902K0757Q3466P3010j05682m1830
$$ -52141 -95264 -127088 -103880 -72912 -53617 -47639 -29737 -8980 74486 147496 41814 -16
16845a6j75440o6297J00966R3391J2376q9023O9327O0664o6345j26553n6884O0131
$$ -16 -175456 -241753 -140787 -47396 -35020 -124043 -54716 5948 -60397 -186950 -243834 -183703
16833a83703J73017R7920j17032j28380k095J5978o63L2400l5419m5492m2863
$$ -183703 -10686 87234 -29798 -158178 -160273 -144295 -144958 -112558 -147977 -193469 -236332
16822b36332J2815P9996K1967k5165K3684K2285J141M2965q315k9886J4864j5926
$$ -236332 -223517 -143521 -121554 -146719 -123035 -100750 -99609 -56644 -64959 -94845 -79981 -95907
16810i5907p9447j03126K1876J22880M7735N669M5210Q2708K5498l2758J5062
$$ -95907 -175354 -278480 -256604 -133724 -85989 -80320 -35110 47598 73096 40338 55400
16799E5400K2709r614q8203q92J03056l0612r895n52L6830L2754q0369n7213R9106
$$ 55400 78109 68495 -19708 -20600 82456 51844 41949 41397 78227 110981 30612 -26601 72505
16786G2505j4187k437o3654o2926n174J7162L2149n427m4873J39871R9949j05995
$$ 72505 58318 55881 -7773 -70699 -75873 -58711 -26562 -31989 -76862 63009 162958 56963
16774E6963j39563L0183J5466K0905m9036n8185j371J38608J19898M9551L2943
$$ 56963 -82600 -52417 -36951 -16046 -65082 -123267 -124638 13970 133868 183419 216362
16763B16362m7950j12916m4166j30428o035N7121L214n1894q1015r5766J24533
$$ 216362 168412 55496 11330 -119098 -125133 -68012 -64798 -116692 -197707 -293473 -168940
16752a68940k4537r1539J0341n5724k8059Q6146O7066N3603L2198L1637J5061
$$ -168940 -193477 -285016 -274675 -330399 -358458 -272312 -205246 -151643 -119445 -87808 -72747
16741g2747M9754J2496j5486K8529K3419j3485M670M5464J7612r2066m7958K3647
$$ -72747 -22993 -10497 -25983 2546 25965 12480 17150 62614 80226 -11840 -59798 -36151
16729c6151J9468l8722k0479J25626m4176q9693p8090K1479J7117Q6414J21121
$$ -36151 -16683 -55405 -75884 49742 5566 -84127 -162217 -140738 -123621 -37207 83914
16718H3914j2765q206k8125N249J9642l6969J05973O8099J4642m5376j10908K4008
$$ 83914 71149 62943 34818 40067 59709 22740 128713 196812 211454 166078 55170 79178
16706G9178N1670n5743M5009M7609j17882q4592l5263o1644r9965j4494R5819
$$ 79178 130848 75105 120114 167723 49841 -34751 -70014 -131658 -231623 -246117 -150298
16695a50298J45672m2211M7111L9182j0163L7645m5556K7086j3379R3659J8612
$$ -150298 -4626 -46837 274 39456 29293 66938 21382 48468 35089 128748 147360
16684A47360q8798o7507r0245o7840L5799P5828J15149N2352n7944l8802k7696
$$ 147360 58562 -8945 -99190 -167030 -131231 -55403 59746 112098 54154 15352 -12344
16673a2344l7454l448l3666l6713M2016j0939P5107O3278l1139J00476l2854j27523
$$ -12344 -49798 -53246 -86912 -123625 -81609 -92548 -17441 45837 14698 115174 82320 -45203
16661d5203r717K0183j5560J2530m6619K3993j34712j53139Q5767J21406J10304
$$ -45203 -54920 -34737 -50297 -37767 -84386 -60393 -195105 -348244 -262477 -141071 -30767
16650c0767q341L6867L6355n6020r9011O1783M7249N1493Q42r2852j48142k3783
$$ -30767 -39108 -2241 34114 -21906 -120917 -59134 -11885 39608 40450 -52402 -200544 -224327
16638b24327j4754J19115J01236j5138l0493N2798R8329R8404l0196j43030J5381
$$ -224327 -239081 -119966 -18730 -33868 -64361 -11563 86766 185170 154974 11944 27325
16627B7325N2103l5940q4173j12415P3374m222J3881k140M6206K7025m3118K190
$$ 27325 79428 43488 -40685 -153100 -79726 -83948 -70067 -72207 -26001 1024 -42094 -39904
16615c9904J04430P0221p9599r1185j33829l9229M9086R5515k5447J47245j705
$$ -39904 64526 134747 55148 -36037 -169866 -209095 -160009 -64494 -89941 57304 55599
16604E5599q5588j5417N6729P2150n8212n5844M4678k0364o4290m0418J2863K2943
$$ 55599 -29989 -45406 11323 83473 25261 -30583 14095 -6269 -70559 -110977 -98114 -75171
16592g5171q5476J7322K1406k7616L1321K5072j410R6840K1794n6781n7596k9717
$$ -75171 -160647 -143325 -121919 -149535 -118214 -93142 -94552 2288 24082 -32699 -90295 -120012
16580a20012l453O6745J7622m177l35M069O4528m5424m8703O9866j5140n6926
$$ -120012 -123465 -56720 -39098 -43275 -43610 -39541 24987 -20437 -69140 726 -14414 -71340
16568g1340m3385N077J3693L590q6195R808J03083J7952j5109q6826N8425L7624
$$ -71340 -114725 -109648 -95955 -92365 -178560 -168752 -65669 -47717 -62826 -149652 -91227 -53603
16556e3603l701k0412n4445j7766j7870M390p9706P7950J36616M5248m976l0346
$$ -53603 -57304 -77716 -132161 -149927 -167797 -163407 -243113 -165163 -28547 16701 11725 -18621
16544a8621q5186M2907J33037j10808o8617N6028O3408R1311n3166p9134K2554
$$ -18621 -103807 -60900 72137 -38671 -107288 -51260 12148 103459 50293 -28841 -6287
16533f287M6086p4789l0801m1942m0870J05081P8158l3624j67803J0030M8646
$$ -6287 39799 -34990 -65791 -107733 -148603 -43522 34636 1012 -166791 -156761 -108115
16522a08115p88N5574j8225M6111N4951L2971o9104L2576M6625N3818o9821O2912
$$ -108115 -108903 -53329 -71554 -25443 29508 62479 -6625 25951 72576 126394 56573 119485
16510A19485j9659p3808o5007O0558O1513k5269q8743p2982l9076N2417J04187
$$ 119485 99826 26018 -38989 21569 83082 57813 -30930 -103912 -142988 -90571 13616
16499A3616L2936K7127K4395Q705K1593Q9432n3680j50930j29718k5145P3907
$$ 13616 46552 73679 98074 106779 128372 217804 164124 13194 -116524 -141669 -67762
16488f7762N8960R8910n3711o3899P73R4223J349p302l156l5199L3850K2016l8996
$$ -67762 -8802 90108 36397 -27502 -26729 67494 68843 61541 58385 23186 57036 79052 40056
16475D0056j13757j05305M8426J2066R669N6065p2550m328J11214p2722p8975
$$ 40056 -73701 -179006 -130580 -118514 -108845 -52780 -125330 -129658 -18444 -91166 -170141
16464a70141Q1832O194o949n3939m1926J5279Q4893J10096R8488p9894j13642
$$ -170141 -88309 -82115 -89064 -143003 -184929 -169650 -84757 25339 123827 43933 -69709
16453f9709l4304Q086m0246R5721J09492J970Q8970M6425j39102m7460k5907J5039
$$ -69709 -104013 -95927 -136173 -40452 69040 71010 159980 206405 67303 19843 -6064 8975
16441H975K6531m529o0353P3872N7020m4389j18025K6476N3742j31441q0276M9178
$$ 8975 35506 30977 -29376 44496 101516 57127 -60898 -34422 19320 -112121 -192397 -143219
16429a43219J19243P8717o0482q6618m4475o1828J11171Q1679N698l3507q6605
$$ -143219 -23976 54741 -5741 -92359 -136834 -198662 -87491 -5812 -114 -33621 -120226
16418a20226m4639N2159O0455M5841J2058N5360N9296k2511p163k4233m9247l2715
$$ -120226 -164865 -112706 -52251 -6410 5648 61008 120304 97793 90630 66397 17150 -15565
16406a5565O64k1595N8101N6317J3383p2931o3279K8253K0352L3597L5452l663
$$ -15565 -14901 -36496 21605 77922 91305 18374 -44905 -16652 3700 37297 72749 69086
16394F9086l1683m4182J01276L3284n2384r0615O0286N2035k0132l3066M613M3531
$$ 69086 37403 -6779 94497 127781 75397 -15218 45068 97103 76971 43905 48518 92049
16382I2049j23484j24967k0267O858Q733k5656P9800J29814k5734k8461j437j255
$$ 92049 -31435 -156402 -176669 -169811 -161078 -186734 -106934 22880 -2854 -31315 -32752 -34007
16370c4007K6067m1046m5050J1914Q358N017P2552N1826l9803K4174j1712J8020
$$ -34007 -7940 -48986 -94036 -82122 -73764 -68747 3805 55631 15828 40002 28290 46310
16358D6310n215O7285J14619o1457j5962P3900J3171j0096r3667j8597m6401N1291
$$ 46310 41095 108380 222999 161542 145580 219480 232651 222555 128888 110291 63890 115181
16346A15181L7332L5847m4892q5617j09863j0137M6521j05003o3376Q4403k5832
$$ 115181 152513 188360 143468 57851 -52012 -62149 -15628 -120631 -184007 -99604 -125436
16335a25436L6156Q6372K8480j1147O3247L5905q9750q0130j9513K8803K4804
$$ -125436 -89280 -2908 25572 14425 77672 113577 23827 -56303 -75816 -47013 -22209
16324b2209J7491m2671N9156j2812m1353j9499o8259j6395N8284O6274l0272q9576
$$ -22209 -4718 -47389 11767 -1045 -42398 -61897 -130156 -146551 -88267 -21993 -52265 -141841
16312a41841r0867l4680O1384J05335M6427L6555P9061L0047K0253j29456j0581
$$ -141841 -232708 -267388 -206004 -100669 -54242 -17687 61374 91421 111674 -17782 -28363
16301b8363Q1722J00902k5959q3841p9529M7088n3594n4858K3020N6294m6025
$$ -28363 53359 154261 128302 44461 -35068 12020 -41574 -96432 -73412 -17118 -63143
16290f3143p9184l5194P4856J4968j6955N5538k2867k6681o000n8063l1521l97
$$ -63143 -142327 -177521 -102665 -87697 -104652 -49114 -71981 -98662 -104662 -162725 -194246 -194643
16278a94643Q6997P3775P95k283J4935N8011J14042L8253k4326m3832l4940l8937
$$ -194643 -107646 -33871 -33076 -35359 -20424 37587 151629 189882 165556 121724 86784 47847
16266D7847l334N459J0321q3433l2912M9248M9224m9400l1929M418N0002N2643
$$ 47847 44513 49972 60293 -23140 -56052 -6804 42420 -6980 -38909 -34491 15511 68154
16254F8154O2536M0837J4553j26082j02205R0196N8682Q1324j90036p5501J8501
$$ 68154 130690 171527 186080 59998 -42207 47989 106671 187995 -2041 -77542 -59041
16243e9041K7829K9996L7147k5869M1065n1753n7472j9755p2270l5364q165J3954
$$ -59041 -31212 -1216 35931 10062 51127 -626 -58098 -77853 -150123 -185487 -193652 -179698
16231a79698J6914Q2172L9964O053n8730l429M2158L0767l4836N1403l530o1055
$$ -179698 -162784 -80612 -40648 -34595 -93325 -96754 -54596 -23829 -58665 -7262 -10792 -71847
16219g1847L9363J9274l2020R1700M5830l2417j6997J0973J0979r9073L4929M4430
$$ -71847 -32484 -13210 -45230 46470 92300 59883 42886 53859 64838 -34235 694 45124
16207D5124r0079j41747k711J3434J0471L9570O9343P5598L7833N536o0585j36660
$$ 45124 -44955 -186702 -189413 -175979 -165508 -125938 -56595 19003 56836 62372 1787 -134873
16195a34873j30633L158J8574Q9160J44249N6462k4747R2864O1408j1506l7551
$$ -134873 -265506 -262348 -243774 -154614 -10365 46097 21350 114214 175622 164116 126565
16184A26565l9050K8611o5294r3936q9221J25N7944l235M2345J23166P5085p686
$$ 126565 87515 116126 50832 -43104 -132325 -132200 -74256 -77491 -35146 88020 163105 155419
16172A55419r1498j17890J421j4191q12N1317j5800N5870l2782o9254L4118J16424
$$ 155419 63921 -53969 -52548 -66739 -67551 -16234 -32034 23836 -8946 -78200 -44082 72342
16160G2342K7805j4352O783N3813M004r6955m0461l8872J6267p5608o2141J40998
$$ 72342 100147 85795 92578 146391 150395 53440 12979 -25893 -9626 -85234 -147375 -6377
16148f377N3942k356p4p9850l6280K4574J20730J25163o4491m9704l28K4399J56847
$$ -6377 47565 45209 45135 -34715 -70995 -46421 74309 199472 134981 85277 84949 109348 266195
16135B66195o512L6827n5045j55859n3080Q5140o2278o0853L6359O1366l5177
$$ 266195 259683 296510 241465 85606 32526 117666 55388 -5465 30894 92260 57083
16124E7083j23170K6138O1558L1r983j38461j09106n6861J76450K56612N1292
$$ 57083 -66087 -39949 21609 21640 11657 -126804 -235910 -292771 -116321 140291 191583
16113A91583p8157o0535k0820l4854p7264n1941P3414Q0353K6835j6895J58K3716
$$ 191583 113426 52891 32071 -2783 -80047 -131988 -58574 21779 48614 31719 31877 55593
16101E5593k5496j25223O114R6250L8903p2087o5184q1922n4438P8938J46444
$$ 55593 30097 -95126 -89012 7238 46141 -25946 -91130 -173052 -227490 -148552 -2108
16090b108m760q2679n6642r174J21770N0718p4996n4756K5941p3578L5182R9626
$$ -2108 -6868 -89547 -146189 -155363 -33593 17125 -57871 -112627 -86686 -160264 -125082 -25456
16078b5456J44430j05849p7335N471m8498O2097Q2349l0014k4376o6460j2275
$$ -25456 118974 13125 -64210 -58739 -107237 -45140 37209 7195 -17181 -83641 -95916
16067i5916L4235J15897P3736m821N8567p8182k5346n3399m7943O442p4948o4360
$$ -95916 -61681 54216 127952 123131 181698 103516 78170 24771 -23172 -16730 -91678 -156038
16055a56038j2446O2966M0130L4147R411K4794J2828l7333N962K4139J3195K8005
$$ -156038 -168484 -105518 -65388 -31241 -21830 2964 15792 -21541 -15579 8560 21755 49760
16043D9760J3566n9554J00877m166N9225l5503l7739L1492q8462o9790q022k6617
$$ 49760 63326 3772 104649 100483 159708 124205 86466 117958 29496 -40294 -48316 -74933
16031g4933j1147L4150L9161p4665J2480P220K3693Q2877O711m9607m8463O0293
$$ -74933 -86080 -51930 -12769 -87434 -74954 -67734 -44041 38836 45547 -4060 -52523 7770
16019G770P0186J8227l7911o9232q137j2782n0423J2375J12689J5483r3739l788
$$ 7770 77956 96183 58272 -10960 -19097 -31879 -82302 -69927 42762 58245 -35494 -39282
16007c9282m1846l9478j5157K2021J21982L8075k290m047n1096k1433k1782k781
$$ -39282 -81128 -120606 -135763 -113742 8240 46315 44025 39978 -11118 -32551 -54333 -57114
15995e7114K8992L422p3963m1279k039M60M4853j4749N2788k0867J2955J28808
$$ -57114 -28122 -24700 -98663 -139942 -141981 -141521 -96668 -111417 -58629 -79496 -66541 62267
15983F2267L3728p823K4915M670J0323P4059r5758n7977j8994N6765R0890l0352
$$ 62267 95995 88172 113087 117757 128080 202139 106381 48404 29410 86175 177065 146713
15971A46713l5851q6285l70l1087L1236M8072n5710P6049j6547R34m0999o1191
$$ 146713 110862 24577 24207 -6880 24356 72428 16718 92767 76220 77154 36155 -25036
15959b5036o5268K1147J03643P5756l3780m4212J710O0591K2617k8189o6627J6179
$$ -25036 -90304 -69157 34486 110242 76462 32250 33960 94551 117168 88979 22352 38531
15947C8531m825p80L2183q2864k273N9434P0929R8662r9099m8892Q948N05l72
$$ 38531 33706 32926 65109 -17755 -20028 39406 110335 208997 109898 61006 69954 70459 70087
15934G0087o4596j09610O3149J37644M2920O131q627o8609q8808o0624m7869J14021
$$ 70087 5491 -104119 -40970 96674 139594 145725 137098 68489 -20319 -80943 -128812 -14791
15922a4791J11498o5336J5331q8664j38713l0539L8756O067O6561l1819J6315
$$ -14791 96707 31371 46702 -41962 -180675 -211214 -172458 -166391 -99830 -131649 -115334
15911a15334R3824N6381l4346l2046r5619l1057k5667Q7636J14376j841J3056
$$ -115334 -21510 34871 525 -31521 -127140 -158197 -183864 -96228 18148 16307 29363
15900B9363M2747r0862m1284K9223N213P7803Q600Q0992j454l6142n7367J0641
$$ 29363 72110 -18752 -60036 -30813 -25600 52203 60803 141795 140341 104199 46832 57473
15888E7473n950N384k2174N348r7324l5863O612j3467Q080K2493R8949J0922p839
$$ 57473 51523 56907 34733 40081 -57243 -93106 -86494 -99961 -91881 -69388 29561 40483 32644
15875C2644q8753L2038N8573J0726m7419j12966k6104M7393O6280J9532p5708
$$ 32644 -56109 -24071 34502 45228 -2191 -115157 -141261 -93868 -27588 -8056 -83764
15864h3764J0801R1798q3914L8792M7873n0503n0254o1661K55K5895L9151P369
$$ -83764 -72963 18835 -65079 -26287 21586 -28917 -79171 -140832 -140577 -114682 -75531 -68162
15852f8162J4403O5264p4587j29139K5752J70803K7825M0270M4310J17863j3463
$$ -68162 -53759 11505 -63082 -192221 -166469 4334 32159 72429 116739 234602 221139
15841B21139j49653q3002j21205K9320J30158P1539o0103P1535k0275p6657j05010
$$ 221139 71486 -11516 -132721 -103401 26757 98296 38193 109728 89453 12796 -92214
15830i2214j09194R531K8181O1438R1123P0424O0074j06733k0295n149P2054r310
$$ -92214 -201408 -191877 -163696 -102258 -11135 59289 119363 12630 -7665 -12814 59240 49930
15818D9930m6187p4131M814J2126J9114N6755r654J0186M1127N0205j9674j04756
$$ 49930 3743 -70388 -65574 -53448 -34334 22421 12767 22953 64080 114285 94611 -10145
15806a0145l489M4852J6126J6697J9248j8730N7203p1780n2376O5910j6867m9052
$$ -10145 -13634 31218 47344 64041 83289 64559 121762 49982 -2394 63516 46649 -2403
15794b403l2770P9151j000j45668k1901M3597M8676L4799l9940L7917K5303J4045
$$ -2403 -35173 43978 42978 -102690 -124591 -80994 -32318 2481 -37459 458 25761 39806
15782C9806K5430L0744L1358o600r1408j9435n0065j2385L1194N3542K116j64215
$$ 39806 65236 95980 127338 120738 29330 9895 -40170 -52555 -21361 32181 34297 -129918
15770a29918j29357P4391J80360n7825o887N161K0134J4931J2611j2961o7737
$$ -129918 -259275 -184884 -4524 -62349 -69236 -64075 -43941 -29010 -16399 -29360 -97097
15759i7097n9841q205L880K5698L5408p6210N5682O3573k52j4135K7041R1964
$$ -97097 -156938 -165143 -161263 -135565 -100157 -176367 -120685 -57112 -57364 -71499 -44458 47506
15747D7506J1938P8545r7585r8186N4758q427p7560j0328P5307R8756j29678j11981
$$ 47506 59444 137989 40404 -57782 -3024 -11451 -89011 -99339 -24032 74724 -54954 -166935
15735a66935K5229J16312L2104r6544K5267J16862M0279o8141n4677L8129J02180
$$ -166935 -141706 -25394 6710 -89834 -64567 52295 92574 24433 -30244 7885 110065
15724A10065J5582q9128J6563K2944J12522L458q6226r1233k0369j13722m1864
$$ 110065 125647 36519 53082 76026 188548 192006 105780 14547 -5822 -119544 -161408
15713a61408l3503R6994Q1050N3811j03392p2816k1741N5511N4637k7440K734
$$ -161408 -194911 -97917 -16867 36944 -66448 -139264 -161005 -105494 -50857 -78297 -75563
15702g5563L0081j25955L8978J78419K0933l6142k8694q666j12881n2126R1689
$$ -75563 -45482 -171437 -132459 45960 66893 30751 2057 -6609 -119490 -171616 -79927
15691g9927N7520K1717O4175J7682j2414N2051l4138n3775l7685O5084J17555
$$ -79927 -22407 -690 63485 81167 68753 120804 86666 32891 -4794 60290 177845
15680A77845M1011r5466j19698N1792N5270l393L41o6661J2893O993j44472q962
$$ 177845 218856 123390 3692 55484 110754 107361 107702 41041 53934 60927 -83545 -92507
15668i2507N7247q0755p5055j0835Q5257l435p841N0822l1551j8088J3053K5169
$$ -92507 -35260 -116015 -191070 -201905 -116648 -120083 -127924 -77102 -108653 -126741 -113688 -88519
15656h8519j189n2737Q3729M5786P7565M9167j1488J0038J3906l7981m3527r1136
$$ -88519 -89708 -142445 -58716 -12930 64635 113802 102314 112352 126258 88277 44750 -46386
15644d6386o3449Q6424N1593N9027k6480m9365l8070p8927R8027J54049Q4929
$$ -46386 -109835 -23411 28182 87209 60729 11364 -26706 -105633 -7606 146443 231372
15633B31372j9227j54228j37544k3842R9148m3025L7558n3887j10150N7154M408
$$ 231372 212145 57917 -79627 -103469 -4321 -47346 -9788 -63675 -173825 -116671 -112263
15622a12263M2164M1970l8834Q097M4224N0602q5893q3173L2159P30O626N9225
$$ -112263 -70099 -28129 -66963 -58866 -14642 35960 -49933 -133106 -100947 -100217 -93591 -34366
15610c4366K8478J4004j23513J7797j5264J0747J0315N8958Q594K7925R893l8310
$$ -34366 -5888 8116 -115397 -97600 -112864 -102117 -91802 -32844 -24250 3675 13568 -24742
15598b4742k4L6043j02157q5666O0068Q1034k6640J7684J49942n4530m9806J5356
$$ -24742 -24766 11277 -90880 -176546 -116478 -35444 -62084 -44400 105542 51012 1206 16562
15586A6562j5601O629j53393j3912R8556Q037K4445q146l6797J17426P6143p2820
$$ 16562 961 7590 -145803 -159715 -61159 -53122 -28677 -36823 -73620 43806 119949 47129
15574D7129j03260k7384l4770L2233M5410k8561P3798J7737m5244P5632O1650
$$ 47129 -56131 -83515 -118285 -86052 -40642 -69203 4595 22332 -22912 52720 114370
15563A14370M4543P8830R968o1469j18913o55l0953j5736Q295K2620p7676N2519
$$ 114370 158913 237743 247711 186242 67329 66674 35721 19985 28280 50900 -26776 25743
15551B5743m6750o8133M8354m9759L0545J33289J4199p6559p2481n4235N0569
$$ 25743 -21007 -89140 -40786 -90545 -60000 73289 87488 10929 -61552 -115787 -65218
15540f5218k034l5192k4485N7412L3366Q8954j135p8991K2137k8232q0818k8895
$$ -65218 -67252 -102444 -126929 -69517 -36151 52803 51668 -27323 -5186 -33418 -114236 -143131
15528a43131j1292M3956M8535L8715K4399m3550j04221q2265P839R5257L8600
$$ -143131 -154423 -110467 -61932 -23217 1182 -42368 -146589 -228854 -221015 -125758 -87158
15517h7158j01515J50387N5368m8899M7033r5911n1115P6634L0181J2450m3242
$$ -87158 -188673 -38286 17082 -31817 15216 -80695 -131810 -55176 -24995 -12545 -55787
15506e5787j6983r479k2138M0389O4517q6306J3663j1270m9393N353L9103O458
$$ -55787 -72770 -82249 -104387 -63998 519 -85787 -72124 -83394 -132787 -127434 -88331 -81873
15494h1873l3769o8174K2153J22157M4979j6511j4573o3441K098j0293l6075M2311
$$ -81873 -115642 -183816 -161663 -39506 5473 -11038 -25611 -89052 -86954 -97247 -133322 -91011
15482i1011K8350L5488K7554p5778m773O7219J2181q0751L9963K3261r2958l3282
$$ -91011 -62661 -27173 381 -75397 -80170 -12951 -770 -81521 -41558 -18297 -111255 -144537
15470a44537L3639O5N393L4697n1060R2136Q8066L4909k0623j53838j39251o4933
$$ -144537 -110898 -110833 -105440 -70743 -121803 -29667 58399 93308 72685 -81153 -220404 -285337
15458b85337P6113J34993M1137J8714k5552m5029j9785J8120o6231O6827L7369
$$ -285337 -209224 -74231 -33094 -14380 -39932 -84961 -104746 -86626 -152857 -86030 -48661
15447d8661o8550l136n8265L8004J01011o8142J0200M2278r823m4817l023j3809
$$ -48661 -117211 -120347 -178612 -140608 -39597 -107739 -97539 -55261 -65084 -109901 -112924 -126733
15435a26733N965N9291k4183J5523k0572N8263Q672M0711P3653j0360m8528m1902
$$ -126733 -120768 -61477 -85660 -70137 -90709 -32446 -23774 16937 90590 80230 31702 -10200
15423a0200N1624J2604M1939o5774L345K444p6082l9892L8760K1352k4505q6596
$$ -10200 41424 54028 95967 30193 33538 35982 -40100 -79992 -41232 -19880 -44385 -130981
15411a30981O827O3766K4245O9034l808j04508n7274N2090L7671O0809P6177r021
$$ -130981 -124154 -60388 -36143 32891 29083 -75425 -132699 -80609 -42938 17871 94048 85027
15399H5027k5932M4702M4278j79803p3050N211j7602L9575q230L0204Q9190M4244
$$ 85027 59095 103797 148075 -31728 -104778 -99567 -117169 -77594 -85824 -55620 33570 77814
15387G7814M4528l4039k9600j0679m5131n9553J1637R09R7267M4695L1804N0394
$$ 77814 122342 88303 58703 48024 2893 -56660 -45023 -44114 53153 97848 129652 180046
15375A80046k9650m9688o6578O3688Q5457p1825j49160m9766m0931n867m5239
$$ 180046 150396 100708 34130 97818 183275 111450 -37710 -87476 -128407 -134274 -179513
15364a79513p171R2360J19733n2922O4525o4109J0605M5175n9301p7679M4167
$$ -179513 -186684 -94324 25409 -27513 37012 -27097 -16492 28683 -30618 -108297 -64130
15353f4130R8235M2966k2210P9804n9847n8206Q2367j2090q9971P040k9129O1097
$$ -64130 34105 77071 54861 134665 74818 16612 98979 86889 -3082 3958 -25171 35926
15341C5926p7788R974J3424j7832M1109n7690m4488m939l6095N0127J00169J11287
$$ 35926 -41862 -31888 -18464 -36296 4813 -52877 -97365 -102304 -138399 -88272 11897 123184
15329A23184l3160r9488m8781r4724K4202M9388Q0173m566L4739J0045o9269q5913
$$ 123184 90024 -9464 -58245 -152969 -128767 -79379 794 -3772 30967 41012 -28257 -114170
15317a14170j1040J00386O78k5999O7525J96379n9452j53204k8755j24389M1548
$$ -114170 -125210 -24824 -24146 -50145 17380 213759 154307 1103 -27652 -152041 -110493
15306a10493O1410J5411j4642M5036n1093K0115J9875k0803j2158L5467L5986
$$ -110493 -49083 -33672 -48314 -3278 -54371 -34256 -14381 -35184 -47342 -11875 24111
15295B4111q8905L6451O5733P4381k4685L393q1486K2875J1627J9666k1130j6194
$$ 24111 -64794 -28343 37390 111771 87086 90479 8993 31868 43495 63161 42031 25837
15283B5837K7552j10204p8858N969O0720J25033Q601R053Q3420o48r6305l8820
$$ 25837 53389 -56815 -135673 -129704 -68984 56049 64650 73703 157123 156475 60170 21350
15271B1350j06820k4315j26227p016J29413L5320L2430j0451J331J0635O5554
$$ 21350 -85470 -109785 -236012 -243028 -113615 -78295 -45865 -56316 -54985 -44350 21204
15260B1204P793N5751m4602O266M5432M3908o8339q2688M9319P2388J7485o508
$$ 21204 28997 84748 40146 46412 91844 135752 67413 -15275 34044 106432 123917 117409
15248A17409K602j0660j29105l5254J17678J7268J8506p3984j28424n994O6239
$$ 117409 120011 109351 -19754 -55008 62670 79938 98444 24460 -103964 -109958 -43719
15237d3719M9417j0599j2819M2470J6221k1854P3148j81167o5463Q3108N0794
$$ -43719 5698 -4901 -17720 24750 40971 19117 92265 -88902 -154365 -71257 -20463
15226b0463l9543N4399N5339m0575j13005L4633J03601j6578p4350L6909l2946
$$ -20463 -60006 -5607 49732 9157 -103848 -69215 34386 17808 -56542 -19633 -52579
15215e2579L6710R6723K1682k2716m4612L2502N5497l8943J8217K9396j38523
$$ -52579 -15869 80854 102536 79820 35208 67710 123207 84264 102481 131877 -6646
15204f646l7496R2877j2316o1145L1909p0423n8247o869L4865k1740J33214J44975
$$ -6646 -44142 48735 36419 -24726 7183 -63240 -121487 -128356 -93491 -115231 17983 162958
15192A62958l7523r2864j07083l7164n0334Q2063Q2170r0291k7053P4677r66n8642
$$ 162958 125435 32571 -74512 -111676 -162010 -79947 2223 -88068 -115121 -40444 -41410 -100052
15180a00052p621M6110R102N8032N6999j11681p9601j3002q604Q8315l803J9149
$$ -100052 -107673 -61563 -52461 5571 62570 -49111 -128712 -141714 -150318 -62003 -65806 -46657
15168d6657J9120O3724M8321P0233k4504q2153k7065J20642o3241J9703j427m5673
$$ -46657 -27537 36187 84508 154741 130237 48084 21019 141661 78420 98123 96696 51023
15156E1023o5199K8840k9526j8307J1770K9360Q2423m6078o3588K9575j6959j1408
$$ 51023 -14176 14664 -14862 -33169 -21399 7961 90384 44306 -19282 10293 -6666 -18074
15144a8074O2143k7871q5688J3672Q2486l4118j03076o5737L639Q973P0256J02745
$$ -18074 44069 16198 -69490 -55818 26668 -7450 -110526 -176263 -172624 -163651 -93395 9350
15132I350q2854o0371N7976r369l7171L1461J06744L8066n2809l1278P3663J43437
$$ 9350 -73504 -133875 -75899 -85268 -122439 -90978 15766 53832 1023 -30255 43408 186845
15120A86845J2358p7033q239M157j45801o3118j8591L3425N766k523l1092j9617
$$ 186845 199203 122170 113931 118088 -27713 -90831 -109422 -75997 -70231 -72754 -103846 -123463
15108a23463K8662J8749J7410K6533N0596J9593l5403K5034k6998K4238j11243
$$ -123463 -94801 -76052 -58642 -32109 18487 38080 2677 27711 713 24951 -86292
15097h6292o5027M6687J7394k8091j15780K3319N3626K6152L246j5345L6981M4755
$$ -86292 -151319 -104632 -87238 -115329 -231109 -207790 -154164 -128012 -124766 -140111 -103130 -58375
15085e8375J4730Q1076k7546n8422R576p872N6831K2423q8171o1893K3712L5440
$$ -58375 -43645 37431 9885 -48537 -38961 -46833 9998 32421 -55750 -117643 -93931 -58491
15073e8491k5079M4802L5786n9260j7174J29301m4966j37285J04387J02048L2953
$$ -58491 -83570 -38768 -2982 -62242 -79416 49885 4919 -132366 -27979 74069 107022
15062A07022J2876M7421K4299j2620J4953m3320l3907J728K5967q2948j71283
$$ 107022 119898 167319 191618 178998 193951 150631 116724 118452 144419 61471 -109812
15051a09812q2348J0668J34612J15856L4317p2878M9698R135n2101k9341R28j01552
$$ -109812 -192160 -181492 -46880 68976 103293 30415 80113 89248 37147 7806 8734 -92818
15039i2818M080P3093O2280J2706j3426r5705K9071M5813P3002J0018K1163l9170
$$ -92818 -88738 -15645 46635 59341 45915 -49790 -20719 25094 98096 108114 129277 90107
15027I0107j48529K8365O3370R1534M3871L032j14984o010N2503l2537p6925o4502
$$ 90107 -58422 -30057 33313 124847 168718 171750 56766 50756 103259 70722 -6203 -70705
15015g0705N8412n393P4100K0343n5353o2248k1422K0231P9953J86703M4191m8603
$$ -70705 -12293 -17686 56414 76757 21404 -40844 -62266 -42035 37918 224621 268812 220209
15003B20209M2704k817L7782J26702K78051L77533O50276R05086O69533j31118
$$ 220209 262913 260096 297878 424580 702631 1080164 1730440 2635526 3305059 3173941
14993C173941p81020l25754k03470o41542n07891k11936j78671j61001l3534n6046
$$ 3173941 2392921 2067167 1863697 1222155 714264 502328 323657 162656 129122 73076
14983G3076L6649N8316J2851k1744q682o4640j16567K7895m1876K3575N0291K2533
$$ 73076 109725 168041 180892 159148 150466 85826 -30741 -2846 -44722 -21147 29144 51677
14971E1677M0991j63191j4001N8311N4550M0613J38937O4277n4952n6064l7846
$$ 51677 92668 -70523 -84524 -26213 28337 68950 207887 272164 217212 161148 123302
14960A23302l2729K7148j2798o2768k830J3150o0665k3086O0681K7956O4967P0255
$$ 123302 90573 117721 104923 42155 39325 52475 -8190 -31276 29405 57361 122328 192583
14948A92583P809o7052p1378Q695k8177k4297n3514k4965n6607n0636M8255J02241
$$ 192583 200392 133340 61962 70657 42480 18183 -35331 -60296 -116903 -167539 -119284 -17043
14936a7043J10357J447j01012j3565J01486M0877p0654n0207M4588n1767r7760
$$ -17043 93314 94761 -6251 -19816 81670 122547 51893 1686 46274 -5493 -103253
14925a03253P385J3811j0580N3494L561p043Q5877j20438j45571J06488J39705
$$ -103253 -95868 -82057 -92637 -39143 -35582 -42625 43252 -77186 -222757 -116269 23436
14914B3436L2845k684L6957L168q751N2809l2972r2774K0696p2518p300m669j0314
$$ 23436 56281 53597 90554 93722 84971 137780 104808 12034 32730 -39788 -47088 -51757 -62071
14901f2071Q7957J7199N588M3807K3711l2619o941j1125k5459J3533r1486q8683
$$ -62071 25886 43085 48673 92480 116191 83572 76631 65506 40047 53580 -37906 -126589
14889a26589j7415K05585J2739j00695j292O0294n683j06257k8376O8359J34482
$$ -126589 -144004 61581 74320 -26375 -27667 32627 26944 -79313 -107689 -39330 95152
14878I5152N8959j20200l7263l6815O9251P7953j9554n9403J4118Q44j9827N1294
$$ 95152 154111 33911 -3352 -40167 29084 107037 87483 28080 42198 43042 23215 74509
14866G4509j638o8435j5369P6248l3535l4246k2450K5215n3982J4694Q6248n6575
$$ 74509 72871 4436 -10933 65315 31780 -2466 -24916 299 -53683 -38989 47259 -9316
14854i316j21109K4440J07337K0539l1262J6509J33221j8502p9286k8092q5234
$$ -9316 -130425 -105985 1352 21891 -9371 7138 140359 121857 42571 14479 -70755
14843g0755N4469n123R07p0986j3863M8506m9418P7225L9044J01091l1877o6336
$$ -70755 -16286 -21409 -20502 -91488 -105351 -56845 -106263 -29038 10006 111097 79220 12884
14831A2884m4879O3359m9875m6977J13700r105p0160L3317p5561M5283K0879O3910
$$ 12884 -31995 31364 -18511 -65488 48212 39107 -31053 2264 -73297 -28014 -7135 56775
14819E6775M0016P9682M2072M211q5569j17471q1150j5882Q8616l7113l1210M0080
$$ 56775 96791 176473 218545 222756 137187 19716 -61434 -77316 11300 -25813 -57023 -16943
14807a6943P7773k3132o1676M7087N161k5441m6313J2769p0007l5743O8076J9549
$$ -16943 60830 37698 -23978 23109 28270 2829 -43484 -30715 -100722 -136465 -68389 -48840
14795d8840M4414K5534N1548J9074k2946o1590P6942q349r7643k1321J77173m3258
$$ -48840 -4426 21108 72656 91730 68784 7194 84136 75787 -21856 -43177 133996 90738
14783I0738j77533N9715L3778j51n4518L054L352k0447o362O3823J31135Q1997
$$ 90738 -86795 -27080 6698 6547 -47971 -44917 -41565 -62012 -68374 -4551 126584 208581
14771B08581j10180q3206j01470J6262R4958Q1308L9318k2491r6486n706j69614
$$ 208581 98401 15195 -86275 -70013 24945 106253 145571 123080 26594 20888 -148726
14760a48726M8014J18361J04667J05363l6247p8587j12238J4818K3139l2059J4314
$$ -148726 -100712 17649 122316 227679 191432 112845 607 15425 38564 6505 20819
14749B0819m6446p8531k2473N3872L3421k8011P5198O976M468R5219j9964j9451
$$ 20819 -25627 -104158 -126631 -72759 -39338 -67349 7849 14825 19293 114512 94548 75097
14737G5097j02840r247Q9588P5035o4418o4834R6706j7376K3333O1962N2702m9918
$$ 75097 -27743 -36990 52598 127633 63215 -1619 95087 77711 101044 163006 215708 165790
14725A65790o6891J9743q0209q1620k7127J36606n1359k4136K5796o221o80J08670
$$ 165790 98899 118642 38433 -43187 -70314 66292 14933 -9203 16593 10372 9692 118362
14713A18362j6841m6644K5311j8347k6923K9606L676l1833m9477Q9583P7883P6517
$$ 118362 101521 54877 80188 61841 34918 64524 68200 36367 -13110 76473 154356 230873
14701B30873r1992n6649n1884P0031K9535r6047n623L9149m947N9854M0678l1889
$$ 230873 138881 82232 30348 100379 129914 33867 28244 67393 62446 122300 162978 131089
14689A31089p2294q5147p2870M8894j5061r289M1734j6349L0307L1563K2412l0107
$$ 131089 58795 -26352 -99222 -50328 -65389 -74678 -32944 -49293 -18986 12577 34989 4882
14677D882l2844o5381m5256k1043Q1586J1334J5641N3592O1058K16K5119m6911
$$ 4882 -27962 -93343 -138599 -159642 -78056 -66722 -51081 2511 63569 63785 88904 41993
14665D1993j26750K2094p1236P8129L1762Q891N6820j124n2397J06834j9919l5196
$$ 41993 -84757 -62663 -133899 -55770 -24008 -15117 41703 40579 -11818 95016 75097 39901
14653C9901n0317R5244j622p1506P3422j8954l6895l1603n7535k6313q368N152
$$ 39901 -10416 84828 83206 11700 85122 66168 29273 -2330 -59865 -86178 -94546 -89394
14641h9394J26442Q0347k4144p9499j0330P603j5841n9841j14321r2694J33631
$$ -89394 37048 117395 93251 13752 3422 11025 -4816 -64657 -178978 -271672 -138041
14630a38041J22025k464K2011p9176p5283j04431O5492J56867M8129o0395q1448
$$ -138041 -16016 -18480 3531 -75645 -150928 -255359 -189867 -33000 15129 -45266 -126714
14619a26714Q839Q9414j05628P003N1194j4284Q1430J0616r1220M3163N0398l2170
$$ -126714 -117875 -28461 -134089 -127086 -75892 -90176 -8746 1870 -89350 -46187 4211 -27959
14607b7959K2937Q3361q015R1695K8251p2977o7053L1846M9740m4071L8049J3775
$$ -27959 -5022 78339 70324 162019 190270 117293 50240 82086 131826 87755 125804 139579
14595A39579m9429m2552r1937m9971P17j05534J05894J42822j15968L3612P7772
$$ 139579 90150 47598 -44339 -94310 -93593 -199127 -93233 49589 -66379 -32767 45005
14584D5005N928L336k7516L5177j6120O37k1844O9790l2859l6310L1746k8615
$$ 45005 50933 54269 26753 61930 45810 46447 24603 94393 61534 25224 56970 28355
14572B8355o0211m7608J34168N8012N318j8221m6172J7689J9630K4031k1868K0289
$$ 28355 -31856 -79464 54704 112716 118034 99813 53641 71330 90960 114991 93123 113412
14560A13412l2644l8024j7184n5586o8197R4191Q1504M8900N8426M3720K2349
$$ 113412 80768 42744 25560 -30026 -98223 -4032 77472 126372 184798 228518 250867
14549B50867m8909j37178n2200K6614J3940R2099N2709m4439q3160K2497n3335
$$ 250867 201958 64780 12580 39194 53134 145233 197942 153503 70343 92840 39505
14538C9505R468j4760J3246O5875q0402q2964n1558J9480M4983P3378P2788J6380
$$ 39505 48973 34213 47459 113334 32932 -50032 -101590 -82110 -37127 36251 109039 125419
14526A25419J8572k1895j2276m1713k3007k3458M1859R399m2602r9958O023R3000
$$ 125419 143991 122096 109820 68107 45100 21642 63501 72900 30298 -69660 -63637 29363
14514B9363K5515m4010l594O1379J1166r8469p5108J7108J56834p149n1934O2315
$$ 29363 54878 10868 7274 68653 79819 -18650 -93758 -76650 80184 73035 21101 83416
14502H3416l7993m0072m7303P4938r927o4885k1420k0537K1896p8560J8329J60178
$$ 83416 45423 5351 -41952 32986 23059 -41826 -63246 -83783 -61887 -140447 -122118 38060
14490C8060J16579K0486r0979q6200k1306J3665l827J1201M1126k1726J6990P2965
$$ 38060 154639 175125 84146 -2054 -23360 -9695 -13522 -2321 38805 17079 34069 107034
14478A07034J8221q6200m7150P6683Q7405j04159j13926m3524k7558J8553M575
$$ 107034 125255 39055 -8095 68588 155993 51834 -62092 -105616 -133174 -114621 -110046
14467a10046O0084n3924q7116L1786J33449L1306q0131l9821J39J38570M1510
$$ -110046 -49962 -103886 -191002 -159216 -25767 5539 -74592 -114413 -114274 24296 65806
14456F5806p6888k8735O3561N5956J0854j30552p5014K3251M8349m282l8432j5587
$$ 65806 -11082 -39817 23744 79700 90554 -39998 -115012 -91761 -43412 -47694 -86126 -101713
14444a01713k478k2081K3427p175P9648P3997m6878K808m1006j99881j093J94037
$$ -101713 -104191 -126272 -102845 -110020 -30372 43625 -3253 -445 -41451 -241332 -242425 -48388
14432d8388J47615M5961m3085j53081o9518o8548j1716J4746r90P9309Q0680K0524
$$ -48388 99227 145188 102103 -50978 -120496 -189044 -200760 -186014 -187004 -107695 -27015 -6491
14420f491L0701J9043p9683P1731l2561J2529N5258Q5344o1408j03947p1830R9200
$$ -6491 24210 43253 -36430 35301 2740 15269 70527 155871 94463 -9484 -81314 17886
14408A7886K7140n491N0183J0854j8122j41640J7438J5675O2365m4490j12052
$$ 17886 45026 39535 89718 100572 82450 -59190 -41752 -26077 36288 -8202 -120254
14397a20254L7767J38201k9319l5591O9906M171n0707l1207j25491R3921J34977
$$ -120254 -82487 55714 26395 -9196 60710 64881 14174 -17033 -142524 -48603 86374
14386H6374j0719m5089R910R4091l8565j19810Q845p590m9193m2983L6915O2068
$$ 86374 75655 30566 40476 134567 96002 -23808 -14963 -22553 -71746 -114729 -77814 -15746
14374a5746L7808L2302l3538M8137K8731l6479J13142q9598r7665o2715p0285
$$ -15746 22062 54364 20826 68963 97694 61215 174357 84759 -12906 -75621 -145906
14363a45906K7795M6667J04087N7351K061k8445j03953n8549M3611L3252j07124
$$ -145906 -118111 -71444 32643 89994 92055 63610 -40343 -98892 -55281 -22029 -129153
14352a29153J00640J31015J3491o3490m089p761O5294Q7405j04035J8663p6516
$$ -129153 -28513 102502 115993 52503 48414 40653 105947 193352 89317 107980 31464
14341C1464j6346J04299N7006n2563m0796k9057M5587J7406n6816o346P4495j21412
$$ 31464 15118 119417 176423 123860 83064 54007 99594 117000 60184 53838 128333 6921
14329F921o2090Q3437p3393N157q2357J803Q7693P37K2421l2595O246m1353k0770
$$ 6921 -55169 28268 -45125 -39968 -122325 -120522 -32829 -32092 -9671 -42266 -36020 -77373 -98143
14316i8143p6942N7888J03192R3284J8646J3292J6185L600m9711j6756M304j22657
$$ -98143 -175085 -117197 -14005 79279 97925 111217 127402 131002 81291 64535 68839 -53818
14304e3818n2530J50215L1460k9400J0141J11620O7422j41785o9159J8066q5845
$$ -53818 -106348 43867 75327 45927 56068 167688 235110 93325 24166 42232 -43613
14293d3613L4639P8647N0552p8394q4568N8574L1984M704n9820L7320O163K8017
$$ -43613 -8974 69673 120225 41831 -42737 15837 47821 52525 -7295 30025 36188 64205
14281F4205N9820l7831r0868K8691O8141n9770J0921q888K1326O2967r2450r9653
$$ 64205 124025 86194 -4674 24017 92158 32388 43309 34421 55747 118714 26264 -73389
14269g3389N441k0219M7613J0803J35349L2855n457K605o9186L3021j8947p2773
$$ -73389 -67948 -88167 -40554 -29751 105598 138453 132996 135601 66415 99436 80489 7716
14257G716m2149N0533N408L5621L5100k9121K6950j07266Q8197R1368o8329n4143
$$ 7716 -34433 16100 21508 57129 92229 63108 90058 -17208 70989 162357 94028 39885
14245C9885K306m9277j8096O7611P8162m9923p2220j7843k274o982l4732L7680
$$ 39885 42191 -7086 -25182 42429 120591 70668 -1552 -19395 -21669 -28651 -63383 -25703
14233b5703P4326o3667j30185p6497J34409P4709J370J6960J204K9899l5299L5962
$$ -25703 48623 -15044 -145229 -221726 -87317 -12608 -11238 5722 6926 36825 1526 37488
14221C7488M6106j03655M2608q292p774m8014o725r86n0141N9940j29137K284
$$ 37488 83594 -20061 22547 14255 6481 -41533 -48258 -49244 -99385 -39445 -168582 -166298
14209a66298N7767J02520J06805p6827l7529k4365K1713j5654M6202n2137L5873
$$ -166298 -108531 -6011 100794 23967 -13562 -37927 -16214 -31868 14334 -37803 -1930
14198a930M6946n3956r8993j4400N1209m2897l2921Q3728P4721J4985o7921k985
$$ -1930 45016 -8940 -107933 -122333 -71124 -114021 -146942 -63214 11507 26492 -41429 -44414
14186d4414K5262j4197Q68N1139J5067j7135M8820r2178P5719P846o2672J5209
$$ -44414 -19152 -33349 -32481 18658 33725 16590 65410 -26768 48951 56797 -5875 9334
14174I334k02837K3862P1792N7607P5641p0L0108j1134m9522L520q1532l5277
$$ 9334 -193503 -169641 -97849 -40242 35399 35329 65437 54303 4781 8301 -73231 -108508
14162a08508q834N9951P058l284K6524j7972J2539j4519M3431J6084m4117k135
$$ -108508 -117342 -57391 -50333 -53617 -27093 -45065 -32526 -47045 -3614 12470 -31647 -33782
14150c3782N3848Q433N7140l9941K6390k5040j5671l4476k6900l9026M4354j4481
$$ -33782 20066 28499 85639 45698 72088 47048 31377 -3099 -29999 -69025 -24671 -39152
14138c9152k740m1398N1048N1732K1964L7559J0188o2576j49425m8698O1334n8332
$$ -39152 -41892 -83290 -32242 19490 41454 79013 89201 26625 -122800 -171498 -110164 -168496
14126a68496J0511M3213O8600Q5965Q383p8490q7036M0633J04503N8174O673J6980
$$ -168496 -157985 -114772 -46172 39793 48176 -30314 -117350 -76717 27786 85960 92633 109613
14114A09613q7212m907Q6946R2712O133j13565j9266o477p835j9293M1083M0233
$$ 109613 22401 17494 104440 197152 203285 89720 70454 63977 56142 36849 77932 118165
14102A18165j77360K419j2980k0761K7501O8791j1972o9360j01618K5658J05845
$$ 118165 -59195 -56776 -69756 -90517 -63016 5775 -6197 -75557 -177175 -151517 -45672
14091d5672L3832L580N4400O6303n5409j4506q748k9263n090N2341J20411J6079
$$ -45672 -11840 -8260 46140 112443 57034 42528 33780 4517 -573 51768 172179 188258
14079A88258N4471o578r2926j06586M4830K1213m0643J5807P982K3702L217j9933
$$ 188258 242729 236151 143225 36639 81469 102682 62039 77846 85828 109530 112747 92814
14067I2814m8298r677N6963o6759j0555o9014O681J4303K6775n5599M278J7737
$$ 92814 44516 34839 91802 25043 14488 -54526 -47845 -33542 -6767 -62366 -58088 -40351
14055d0351M5645O610l6592N9248K4635m956L6403O0780q3383r6148j29552M2893
$$ -40351 5294 11904 -24688 34560 59195 54239 90642 151422 68039 -28109 -157661 -114768
14043a14768l493R3052l3805p3019n3071M1157J1107j5811L7365k3540O6862K0237
$$ -114768 -118261 -25209 -59014 -132033 -185104 -143947 -132840 -148651 -111286 -134826 -67964 -47727
14031d7727J3935p4204O3707L0472N299m6895L0371j3558J5996m879n645k2646
$$ -47727 -33792 -107996 -44289 -13817 -8518 -55413 -25042 -38600 -22604 -27483 -33128 -55774
14019e5774j0880L6632l599Q4933L185p1899K3498k391r1104r4066N6165O7141
$$ -55774 -66654 -30022 -33621 51312 54497 -17402 6096 3705 -87399 -181465 -125300 -58159
14007e8159M7620M9524j7974m2037J7995k3704J5603K4713K7306J5639n2551K7342
$$ -58159 -10539 38985 21011 -21026 -3031 -26735 -11132 13581 40887 56526 3975 31317
13995C1317p732m2845n9622q6003J5885j6288J41376R1164j00097n2077M6265
$$ 31317 23585 -19260 -78882 -164885 -149000 -165288 -23912 67252 -32845 -84922 -38657
13984c8657O2727N355k4600p2632j40759n2168J41500P0756P6168J25662M4233
$$ -38657 24070 29425 4825 -67807 -208566 -260734 -119234 -48478 27690 153352 197585
13973A97585k5576J4289r366m0066q4534K3324j9071p2279K3402k4717j716K1887
$$ 197585 172009 186298 176932 136866 52332 75656 56585 -15694 7708 -17009 -18725 3162
13961C162P8474L6441j9670r448l601l2198j01869M1824m4210R3969J09911N2982
$$ 3162 81636 118077 98407 88959 85358 53160 -48709 -6885 -51095 42874 152785 205767
13949B05767J7526j01120j52395j6581K7163L8431M954Q8815j033j64375p066
$$ 205767 223293 122173 -30222 -46803 -19640 18791 23745 112560 111527 -52848 -59914
13938e9914P4361J4773m8579k6136N1669J6964q9053p281L4649j4284l5338L1288
$$ -59914 14447 29220 -19359 -45495 6174 23138 -65915 -73196 -38547 -52831 -88169 -56881
13926e6881r373n8491N0745j4647J2929p080l0996m4324l6586N8491N0065j2022
$$ -56881 -66254 -124745 -74000 -88647 -75718 -82798 -113794 -158118 -194704 -136213 -86148 -98170
13914i8170m1427P088R0565N6856r7235K1022M3758M3506K023l5933N6214N6544
$$ -98170 -139597 -132509 -41944 14912 -82323 -61301 -17543 25963 27986 -7947 48267 104811
13902A04811M4060N2039j13270m2734J61719j7315l4652r74n2289j47741p6624
$$ 104811 148871 200910 87640 44906 206625 189310 154658 153684 101395 -46346 -122970
13891a22970l3353k8816n2741R1593J33337o3057n1400O0698J25117L4554m1471
$$ -122970 -156323 -185139 -237880 -146287 -12950 -76007 -127407 -66709 58408 92962 51491
13880E1491k8403j3980N1671l0230J3056P4470M0428L9834m9305k9894l6328p9016
$$ 51491 23088 9108 60779 30549 43605 118075 158503 198337 149032 119138 82810 3794
13868C794J5876m193O748M0391O2323k1346J8171K5975j05869k3575O803K1789
$$ 3794 19670 15477 22225 62616 124939 103593 121764 147739 41870 18295 25098 46887
13856D6887J71172J3996j19644j8501M1446r7312n8616m5663M3716O3521N4M3590
$$ 46887 218059 232055 112411 93910 135356 38044 -20572 -66235 -22519 41002 41056 84646
13844H4646M9672K3313K5135k1296j10211j15861J02292R58r4944m3418J4605
$$ 84646 134318 157631 182766 161470 51259 -64602 37690 38648 -56296 -99714 -85109
13833h5109m0271K1159L6358O3046m0490K5351k4861l1699K8444R365m331J0914
$$ -85109 -125380 -104221 -67863 -4817 -45307 -19956 -44817 -76516 -48072 -38707 -43038 -32124
13821c2124J24348J5578n9935l7682k9389j01852q4265P385N0471Q4968m7790
$$ -32124 92224 107802 47867 10185 -19204 -121056 -205321 -197936 -147465 -62497 -110287
13810a10287O604L5468O3044M7613o3671p1609J02032O4241r8423j0337N0001
$$ -110287 -103683 -68215 -5171 42442 -21229 -92838 9194 73435 -24988 -35325 14676
13799A4676R4438M4456j60841o7751n5695J16525J59572k6348k3458q4448r6687
$$ 14676 109114 153570 -7271 -75022 -130717 -14192 145380 119032 95574 11126 -85561
13788h5561o7412M0308K9597N8629j0829K3366J5667R930O0232l5388k630o2523
$$ -85561 -152973 -112665 -83068 -24439 -35268 -11902 3765 13695 73927 38539 35909 -26614
13776b6614j6304K0259j4690M1205L2889q452j7630m9726N9548l388q6227o8162
$$ -26614 -42918 -22659 -37349 3856 36745 28293 10663 -39063 20485 17097 -69130 -137292
13764a37292j12484P7553J55970Q3103j703o0511K6264J28376N5082K4569p2458
$$ -137292 -249776 -172223 -16253 66850 65147 4636 30900 159276 214358 238927 166469
13753A66469p3888J412j7789p6394Q2726J30964L3837O7492K1422n0530j45299
$$ 166469 92581 93993 76204 -190 82536 213500 247337 314829 336251 285721 140422
13742A40422q8935M3657K5837O143N3491n7144J631O4536j71773j7999K7070N351
$$ 140422 51487 95144 120981 127124 180615 123471 125102 189638 17865 -134 26936 32287
13730C2287M2964Q5382J8165j6798r7740o6696K4066r3575j520J21775N920p0542
$$ 32287 75251 160633 178798 162000 64260 -2436 21630 -71945 -73465 48310 54230 -16312
13718a6312N7149K9625j19137j44881P0623M6979M5676k8491J3980k2269L9636
$$ -16312 40837 70462 -48675 -193556 -122933 -75954 -30278 -58769 -44789 -67058 -27422
13707b7422O8480n5693k6363j6433n6299p997Q7682N0731L2244n0497R768K7209
$$ -27422 41058 -14635 -40998 -57431 -113730 -121727 -34045 16686 48930 -1567 8201 35410
13695C5410J12784P8662j5545o1070n3645l9555l3269j6077r4594O9490L868K7952
$$ 35410 148194 226856 211311 150241 96596 57041 23772 7695 -86899 -17409 -13541 14411
13683A4411M640N0745j1293P8505J58893o0918j81381j8355M883L8586j5613J6921
$$ 14411 19051 69796 58503 137008 295901 234983 53602 35247 40130 78716 63103 80024
13671H0024M9551P115k7751j00913k4232k0802K1002L1441K2366j6625m6394q7018
$$ 80024 129575 136690 108939 8026 -16206 -37008 -16006 15435 37801 21176 -25218 -112236
13659a12236M7375J32832J37118o0000k59J8583k3655o5979p7693m9763q7190
$$ -112236 -64861 67971 205089 145089 144830 163413 139758 73779 -3914 -53677 -140867
13648a40867Q47L4004L2012O5148p6648j168R3869J35656M7737K8024l5506j20583
$$ -140867 -140020 -106016 -74004 -8856 -85504 -86672 7197 142853 190590 218614 183108 62525
13636F2525q3106M585j0781n1713J5147L2233J504O0587q7599p4678M7492k8104
$$ 62525 -20581 -15996 -26777 -78490 -63343 -31110 -29606 30981 -56618 -131296 -83804 -111908
13624a11908k918P3468J196M0260l5037j07096N066J26829J05364j0143N8278
$$ -111908 -114826 -41358 -40162 98 -34939 -142035 -136969 -10140 95224 85081 143359
13613A43359R529p0265m137L8861K3k984K7476q157L9229p1916j07420n7884m0198
$$ 143359 152888 82623 78486 117347 117370 114386 141862 133705 172934 101018 -6402 -64286 -104484
13600a04484p1923n1058j0103J12796P2835K0822j24870q9581P6567R0759Q9224
$$ -104484 -176407 -227465 -237568 -124772 -51937 -31115 -155985 -245566 -168999 -78240 10984
13589A0984j7674r6111k5884Q0346O5452P3172l0069j25807q3169r0591L0649
$$ 10984 -6690 -102801 -128685 -48339 17113 90285 60216 -65591 -148760 -239351 -208702
13578b08702J57939J19441P3522j79971M418J7034p4183r0252J01J12422P8314
$$ -208702 -50763 68678 142200 -37771 -33353 -16319 -90502 -180754 -180653 -68231 10083
13567A0083j4075o0643K4399K6890L213L956K0563k3822r7093L3606m6157J14978
$$ 10083 -3992 -64635 -40236 -13346 -10133 -6177 14386 -9436 -106529 -72923 -119080 -4102
13555d102K4066N4487M855r4721m5017O0505k7316l9974J34268J76941r2920j23121
$$ -4102 19964 74451 79306 -15415 -60432 73 -27243 -67217 67051 243992 151072 27951
13543B7951N2120J6601l1086q5388q8179M8447r4695K1009J30090P6917m3308
$$ 27951 80071 96672 65586 -19802 -107981 -59534 -154229 -133220 -3130 73787 30479
13532C0479k3013L0020j8058j8342p1751n8061l4226o2247N9328O1512M9220M8428
$$ 30479 7466 37486 19428 1086 -70665 -128726 -162952 -225199 -165871 -104359 -55139 -6711
13520f711p0394o854K4947n800J2553l2654j13530J01160J37530N113j7o1620
$$ -6711 -77105 -83959 -59012 -64812 -52259 -84913 -198443 -97283 40247 45360 45343 -16277
13508a6277K5160M0417n9835O7693O2944P1596N7884j73361q7008K3311J9045
$$ -16277 8883 49300 -10535 57158 120102 191698 249582 76221 -10787 12524 31569
13497C1569j370Q2825M136j50140m7741L5196k082O2778O9566j8129M7264m1805
$$ 31569 30199 113024 117160 -32980 -80721 -45525 -47607 15171 84737 66608 113872 72067
13485G2067j35209k9508n3932P4995k183l5566M0447M9534M1459L7307M6157K8516
$$ 72067 -63142 -92650 -146582 -71587 -73770 -109336 -68889 -19355 22104 59411 105568 134084
13473A34084p333J5043j4415j8456m3169P5684n6218r9814j0992R4842P2668L0395
$$ 134084 126751 141794 127379 108923 65754 141438 85220 -14594 -25586 69256 141924 172319
13461A72319J001r0276p4082n1348k5252J3387L9830O1220K8096o8255p8215K1390
$$ 172319 173320 83044 8962 -42386 -67638 -54251 -14421 46799 74895 6640 -71575 -50185
13449e0185j2584j7676n1828M5578N0677L6743l4922r3084p1414L425J57079J34606
$$ -50185 -62769 -80445 -132273 -86695 -36018 725 -34197 -127281 -198695 -195270 -38191 96415
13437I6415P1138J8679q5972N332Q5802p6711o0115M231q374J5559m367j4882
$$ 96415 167553 186232 100260 105592 191394 114683 54568 58799 50425 65984 61617 46735
13425D6735L5685J6752L1897k4960j14359n5203P0371n9009l9013K3410N1283
$$ 46735 82420 99172 131069 106109 -8250 -63453 6918 -52091 -91104 -67694 -16411
13414a6411J3232m9098L5002M3764n9115q4775k3082j1608Q9722J6980o7626N2829
$$ -16411 -3179 -52277 -17275 26489 -32626 -117401 -140483 -152091 -62369 -45389 -113015 -60186
13402f0186O6436M7747J4355j0621M7981l6023j40747k7487m9990R1944j0027
$$ -60186 6250 53997 68352 57731 105712 69689 -71058 -98545 -148535 -56591 -66618
13391f6618J12532J2180l121j1271n2498p9228Q606k9538Q4477J4401p0987k5358
$$ -66618 45914 58094 54973 43702 -8796 -88024 -79418 -108956 -24479 -10078 -81065 -106423
13379a06423J07468L8939J6113M0212L1747k1780l6126m0360k6646J1663L9266
$$ -106423 1045 39984 56097 96309 128056 106276 70150 29790 3144 14807 54073
13368E4073k6666j0686J1531l1204k1414J81K4591K0981J2077q5341O6670K8978
$$ 54073 27407 16721 28252 -2952 -24366 -24185 406 21387 33464 -51877 14793 43771
13356D3771J4859l6599O5635Q0973j48576j05491P7800O6280P6455j30552k1331
$$ 43771 58630 22031 87666 168639 20063 -85428 -7628 58652 135107 4555 -16776
13345a6776l8148j1682O0907O2708k9829k4712J7958J0291m8294o3238L4185K49
$$ -16776 -54924 -66606 -5699 57009 27180 2468 20426 30717 -17577 -80815 -46630 -46381
13333d6381N4733J3802J16283L8920m4796L1154n5944l8094p5606l8081Q0475
$$ -46381 8352 22154 138437 177357 132561 163715 107771 69677 -5929 -44010 36465
13322C6465J7874n811j2827j9906k0489k1649j28j9825p6266k9831N5921Q5041
$$ 36465 54339 48528 35701 15795 -4694 -26343 -26471 -46296 -122562 -152393 -96472 -11431
13310a1431O6318n617r7828j21716L0223N8378k2241l9723P3962N9536J06422
$$ -11431 54887 49270 -48558 -170274 -140051 -81673 -103914 -143637 -69675 -10139 96283
13299I6283P5778l0158n7559n2016J5974J7430j6247j04318n8481j4826p121n8364
$$ 96283 172061 141903 84344 32328 48302 65732 49485 -54833 -113314 -128140 -135261 -193625
13287a93625K7843K8868L5997M1763O4468J7270k1080j5724J14599P5491k8404
$$ -193625 -165782 -136914 -100917 -59154 5314 22584 1504 -14220 100379 175870 147466
13276A47466p6730n8502j0614l474l522J4933p7935M6936O9662o117k2652p3341
$$ 147466 70736 12234 1620 -1854 -5376 9557 -68378 -21442 48220 42103 19451 -53890
13264e3890L0303J28745J16223j550r6776j28226m7792q0816q1691N7426M0161
$$ -53890 -23587 105158 221381 219831 123055 -5171 -52963 -133779 -215470 -158044 -117883
13253a17883M1071M8795M66J0776J6325j157p9485j4772K179J53265L289o5163
$$ -117883 -76812 -28017 -27551 -16775 -450 -1607 -81092 -95864 -93685 59580 62869 -2294
13241b294P2731L3300O3384P7448j9203k2757Q07q4621m2294k2603o7040J1655
$$ -2294 70437 103737 167121 244569 225366 202609 203416 118795 76501 53898 -13142 -1487
13229a487K3397L4248m22p7213q1923p490N7169O3113j9963o5063M9601P5882
$$ -1487 21910 56158 55736 -21477 -103400 -110890 -53721 9392 -10571 -75634 -26033 49849
$$ [...]
##END NTUPLES=NMR SPECTRUM
##END=
