##TITLE=Analysis number 316585
Compound Code spb 06880
Project Code adrs
Chemist Name melford
##JCAMPDX= 6.0         $$ Bruker NMR JCAMP-DX V2.0
##DATA TYPE= NMR SPECTRUM
##DATA CLASS= NTUPLES
##ORIGIN= Bruker BioSpin GmbH
##OWNER= nmr
$$ XWIN-NMR		Version 3.5
$$ Thu Jan 19 16:20:01 2006 GMT Standard Time (UT+0h)  MAYBRIDGE\nmr@NMR_250MHZ
##.OBSERVE FREQUENCY= 250.131544655141
##.OBSERVE NUCLEUS= ^1H
##.ACQUISITION MODE= SIMULTANEOUS (DQD)
##.ACQUISITION SCHEME= undefined
##.AVERAGES= 16
##.DIGITISER RES= 18
##SPECTROMETER/DATA SYSTEM= dpx250
##.PULSE SEQUENCE= zg30
##.SOLVENT NAME= DMSO
##.SHIFT REFERENCE= (INTERNAL, DMSO, 0, 16.5165)
##AUDIT TRAIL= $$ (NUMBER, WHEN, WHO, WHERE, WHAT)
$$ ##TITLE= Audit trail, XWIN-NMR		Version 3.5
$$ ##JCAMPDX= 5.01
$$ ##ORIGIN= Bruker BioSpin GmbH
$$ ##OWNER= nmr
$$ C:\u/data/dgb/nmr/ADRS/14980/pdata/1/auditp.txt
$$ ##AUDIT TRAIL=  $$ (NUMBER, WHEN, WHO, WHERE, WHAT)
(   1,<2006-01-19 16:19:40.84 +000>,<MAYBRIDGE\nmr>,<NMR_250MHZ>,
      <created by zg, POWCHK disabled, PULCHK disabled
       configuration hash MD5:
       62 19 C7 07 E1 42 D1 B7 37 6C 3D D0 77 39 F9 E6
       data hash MD5: 64K
       80 B1 14 0C 7B E7 B5 7B FD 0A D5 B8 31 73 29 7E>)
(   2,<2006-01-19 16:19:53.67 +000>,<MAYBRIDGE\nmr>,<NMR_250MHZ>,
      <Start of raw data processing
       ef LB = 0.3 FT_mod = 6 PKNL = 1 SI = 32K 
       data hash MD5: 32K
       BE 22 81 6C 39 55 A4 86 DA CA 5A 38 E2 4E 63 4C>)
(   3,<2006-01-19 16:19:55.86 +000>,<MAYBRIDGE\nmr>,<NMR_250MHZ>,
      <apk 
       data hash MD5: 32K
       6E FC 33 C8 62 7B 96 60 45 67 11 E7 DF A5 29 E4>)
(   4,<2006-01-19 16:19:56.61 +000>,<MAYBRIDGE\nmr>,<NMR_250MHZ>,
      <abs ABSG = 5 
       data hash MD5: 32K
       76 C4 36 D0 A4 56 A3 A0 AE CE 55 1A D0 6F 9B 8A>)
$$ ##END=
$$ 
$$ hash MD5
$$ 15 1B D4 4D 03 83 11 AF E8 16 ED E4 FA 51 57 F9
##$RELAX= 
##$RELAX= 
##$RELAX= 
##$RELAX= 
##$RELAX= 
##$RELAX= 
##$RELAX= 
$$ Bruker specific parameters
$$ --------------------------
##$DU= <C:\u>
##$EXPNO= 14980
##$NAME= <ADRS>
##$PROCNO= 1
##$TYPE= <nmr>
##$USER= <dgb>
##$AMP= (0..31)
100 100 100 100 100 100 100 100 100 100 100 100 100 100 100 100 100 100 
100 100 100 100 100 100 100 100 100 100 100 100 100 100 
##$AQSEQ= 0
##$AQ_mod= 3
##$AUNM= <au_zg>
##$AUTOPOS= <6 >
##$BF1= 250.13
##$BF2= 250.13
##$BF3= 250.13
##$BF4= 250.13
##$BF5= 500.13
##$BF6= 500.13
##$BF7= 500.13
##$BF8= 500.13
##$BYTORDA= 1
##$CFDGTYP= 0
##$CFRGTYP= 5
##$CHEMSTR= <none>
##$CNST= (0..31)
1 1 145 1 1 1 1 1 1 1 1 1 1 1 1 1 1 1 1 1 1 1 1 1 1 1 1 1 1 1 1 1 
##$CPDPRG= <>
##$CPDPRG1= <>
##$CPDPRG2= <>
##$CPDPRG3= <>
##$CPDPRG4= <mlev>
##$CPDPRG5= <mlev>
##$CPDPRG6= <mlev>
##$CPDPRG7= <mlev>
##$CPDPRG8= <mlev>
##$CPDPRGB= <>
##$CPDPRGT= <>
##$D= (0..31)
0 1 0 0 0 0 0 0 0 0.06 0 0 0 0 0 0 0.0002 0 0 0 0 0 0 0 0 0 0 0 0 0 0 
0 
##$DATE= 1137687579
##$DBL= (0..7)
120 120 120 120 120 120 120 120 
##$DBP= (0..7)
150 150 150 150 150 150 150 150 
##$DBP07= 0
##$DBPNAM0= <>
##$DBPNAM1= <>
##$DBPNAM2= <>
$$ [...]
##$SUBNAM7= <"">
##$SUBNAM8= <"">
##$SUBNAM9= <"">
##$SW= 20.6930455092707
##$SWIBOX= (0..15)
0 0 3 0 0 0 0 0 0 0 0 0 0 0 0 0 
##$SW_h= 5175.983436853
##$TD= 65536
##$TD0= 1
##$TE= 294.16
##$TE2= 300
##$TE3= 300
##$TEG= 300
##$TL= (0..7)
0 120 120 120 120 120 120 120 
##$TP= (0..7)
150 150 150 150 150 150 150 150 
##$TP07= 0
##$TPNAME0= <>
##$TPNAME1= <>
##$TPNAME2= <>
##$TPNAME3= <>
##$TPNAME4= <>
##$TPNAME5= <>
##$TPNAME6= <>
##$TPNAME7= <>
##$TPOAL= (0..7)
0.5 0.5 0.5 0.5 0.5 0.5 0.5 0.5 
##$TPOFFS= (0..7)
0 0 0 0 0 0 0 0 
##$TUNHIN= 0
##$TUNHOUT= 0
##$TUNXOUT= 0
##$USERA1= <user>
##$USERA2= <user>
##$USERA3= <user>
##$USERA4= <user>
##$USERA5= <user>
##$V9= 5
##$VALIST= <valist>
##$VCLIST= <CCCCCCCCCCCCCCC>
##$VD= 0
##$VDLIST= <DDDDDDDDDDDDDDD>
##$VPLIST= <PPPPPPPPPPPPPPP>
##$VTLIST= <TTTTTTTTTTTTTTT>
##$WBST= 1024
##$WBSW= 4
##$XGAIN= (0..3)
0 0 0 0 
##$XL= 0
##$YL= 0
##$YMAX_a= 310512
##$YMIN_a= -421928
##$ZGOPTNS= <>
##$ZL1= 120
##$ZL2= 120
##$ZL3= 120
##$ZL4= 120
##$ABSF1= 16.5165
##$ABSF2= -4.176672
##$ABSG= 5
##$ABSL= 3
##$ALPHA= 0
##$AQORDER= 0
##$ASSFAC= 0
##$ASSFACI= 0
##$ASSFACX= 0
##$ASSWID= 0
##$AUNMP= <proc_1d>
##$AZFE= 0.1
##$AZFW= 0.1
##$BCFW= 0
##$BC_mod= 0
##$BYTORDP= 0
##$COROFFS= 0
##$CY= 12.5
##$DATMOD= 1
##$DC= 0
##$DFILT= <>
##$DTYPP= 0
##$F1P= 14.0000005364418
##$F2P= -0.99999901652339
##$FCOR= 0.5
##$FTSIZE= 32768
##$FT_mod= 6
##$GAMMA= 0
##$GB= 0
##$INTBC= 1
##$INTSCL= 1
##$ISEN= 128
##$LB= 0.3
##$LEV0= 0
##$LPBIN= 0
##$MAXI= 10000
##$MC2= 0
##$MEAN= 0
##$ME_mod= 0
##$MI= 0
##$NCOEF= 0
##$NC_proc= -5
##$NLEV= 6
##$NOISF1= 0
##$NOISF2= 0
##$NSP= 0
##$NTH_PI= 0
##$NZP= 0
##$OFFSET= 16.5165
##$PC= 1
##$PHC0= 233.891
##$PHC1= 4.99774
##$PH_mod= 1
##$PKNL= yes
##$PPARMOD= 0
##$PSCAL= 4
##$PSIGN= 0
##$REVERSE= no
##$SF= 250.130001373848
##$SI= 32768
##$SIGF1= 0
##$SIGF2= 0
##$SINO= 400
##$SIOLD= 32768
##$SREGLST= <1H.DMSO>
##$SSB= 0
##$STSI= 32768
##$STSR= 0
##$SW_p= 5175.98343685301
##$SYMM= 0
##$S_DEV= 0
##$TDeff= 65536
##$TDoff= 0
##$TI= <Analysis number 999999
Compound Code 99
Book Reference 9
Project Code 9>
##$TILT= no
##$TM1= 0
##$TM2= 0
##$TOPLEV= 0
##$USERP1= <user>
##$USERP2= <user>
##$USERP3= <user>
##$USERP4= <user>
##$USERP5= <user>
##$WDW= 1
##$XDIM= 32768
##$YMAX_p= 364677052
##$YMIN_p= -817239
$$ End of Bruker specific parameters
$$ ---------------------------------
##NTUPLES= NMR SPECTRUM
##VAR_NAME=  FREQUENCY,     SPECTRUM/REAL,   SPECTRUM/IMAG
##SYMBOL=    X,             R,               I
##VAR_TYPE=  INDEPENDENT,   DEPENDENT,       DEPENDENT
##VAR_FORM=  AFFN,          ASDF,            ASDF
##VAR_DIM=   32768,         32768,           32768
##UNITS=     HZ,            ARBITRARY UNITS, ARBITRARY UNITS
##FACTOR=    0.157963299565203, 1,           1
##FIRST=     4131.27228600827, 0,            0
##LAST=      -1044.71115084474, 0,           0
##MIN=       -1044.71115084474, -817239,     0
##MAX=       4131.27228600827, 364677052,    0
$$ Real data points
##PAGE= N=1
##DATA TABLE= (X++(R..R)), XYDATA
$$ [...]
$$ plain form
15665 -189141 -224892 -92830 -208068 -211713 -44746 166992 240368 177927 101055 8392 -155309
15654 -155309 -193443 -153726 -46862 6885 97330 172664 211340 179049 184419 -29344 -256903
15643 -256903 -282553 -96166 76302 257742 164943 13504 -115999 -142705 -114331 139101
15633 139101 232179 205754 -44721 -146874 -130921 -30011 -31189 -9145 -89095 -9625 216074
15622 216074 171089 41643 -154047 -180811 -66208 42353 59775 156852 227710 187621 -115516
15611 -115516 -233515 -229117 -276254 -58790 55901 211935 72830 -72719 -228512 -236243
15601 -236243 -280707 -60296 81638 201373 74636 -317125 -305010 -255390 -345660 -423095
15591 -423095 -459215 -386234 -232942 -277264 -416354 -448490 -233564 -406267 -369896 -270324 -257636
$$ packed form
15665a89141l5751J32062j15238l645J66967K11738P3376o2441p6872r2663j63701
15654a55309l8134L9717J06864N3747R0445P5334L8676l2291N370k13763k27559
15643b56903k5650J86387J72468J81440r2799j51439j29503k6706K8374K53432
15633A39101R3078k6425k50475j02153J5953J00910j178K2044p9950P9470K25699
15622B16074m4985j29446j95690k6764J14603J08561J7422R7077P0858m0089l03137
15611a15516j17999M398m7137K17464J14691J56034j39105j45549j55793p731
15601b36243m4464K20411J41934J19735j26737l91761J2115M9620r0270p7435
15591d23095l6120P2981J53292m4322j39090l2136K14926j72703L6371R9572J2688
$$ plain form
15580 -257636 -197274 -152944 -42369 36969 -116280 -266708 -79444 -159126 -295415 -309255
15570 -309255 -185645 24530 212033 265134 73618 -118343 -247790 -244387 -356506 -396694
15560 -396694 -282699 -156487 -181415 -276528 -294999 -288272 -284858 -214713 -131704 -72601 -41737
15549 -41737 -153828 -164417 -191588 -336123 -480261 -282942 -186350 -219300 -242951 -160310 -140431
15538 -140431 -133525 -46402 96932 -26195 -163718 -206333 -66282 -68428 -129319 -264169 -247734
15527 -247734 -328527 -306727 -407721 -518309 -431102 -280348 -407799 -351017 -420457 -679230
15517 -679230 -624951 -474091 -400758 -389092 -378279 -447721 -433358 -84699 248649 234803 118715
15506 118715 -104441 -287095 -398703 -229457 -175707 63488 144311 -62349 -148509 -118337
$$ packed form
15580b57636O0362M4330J10575P9338j53249j50428J87264p9682j36289j3840
15570c09255J23610K10175J87503N3101j91516j91961j29447L403j12119m0188
15560c96694J13995J26212k4928r5113j8471O727L414P0145Q3009N9103L0864
15549d1737j12091j0589k7171j44535j44138J97319R6592l2950k3651Q2641J9879
15538a40431O906Q7123J43334j23127j37523m2615J40051k146o0891j34850J6435
15527b47734q0793K1800j00994j10588Q7207J50754j27451N6782o9440k58773
15517f79230N4279J50860P3333J1666J0813o9442J4363L48659L33348j3846j16088
15506A18715k23156j82654j11608J69246N3750K39195Q0823k06660q6160L0172
$$ plain form
15496 -118337 -295770 -423538 -309600 -144138 -81819 -35158 -61967 -40358 42271 256302
15486 256302 366248 286438 214826 299712 382839 295378 187454 -112499 -173702 -130978 -269725
15475 -269725 -115462 -9083 -3783 -58942 -147470 -168750 -41437 56510 -157851 -72962 122646
15464 122646 26881 -21816 -123404 29688 219653 185746 123014 -5492 49645 77721 -101
15453 -101 119476 180133 19134 -43575 -13477 -142096 -115532 -94174 -49211 93678 132770
15442 132770 155534 85435 96171 185745 108289 -292503 -423687 -266970 -127848 -45452 -91252
15431 -91252 -77807 -20751 178728 69703 69861 156137 68840 33927 168516 79612 -147308
15420 -147308 -43431 188 -243145 -320996 -391839 -520449 -154096 -190364 -213575 -29628
$$ packed form
15496a18337j77433j27768J13938J65462O2319M6661k6809K1609Q2629K14031
15486B56302J09946p9810p1612Q4886Q3127q7461j07924k99953o1203M2724j38747
15475b69725J54263J06379N300n5159q8528k1280J27313R7947k14361Q4889J95608
15464A22646r5765m8697j01588J53092J89965l3907o2732j28506N5137K8076p7822
15453a01J19577O0657j60999o2709L0098j28619K6564K1358M4963J42889L9092
15442A32770K2764p0099J0736Q9574p7456m00792j31184J56717J39122Q2396m5800
15431i1252J3445N7056J99479j09025J58Q6276q7297l4913J34589q8904k26920
15420a47308J03877M3619k43333p7851p0843j28610L66353l6268k3211J83947
$$ plain form
15410 -29628 -92376 -280872 -215202 -131283 -29921 51336 149305 -123620 -250954 -83885 -19844
15399 -19844 267548 418036 197707 35437 -222325 -204884 -240431 -250307 13619 84299 37177
15388 37177 -48576 69586 80930 -34227 -26894 188776 204075 167848 135420 -37471 -190157
15377 -190157 -233918 -289851 -293107 -187904 -4679 49370 -37724 -36466 18707 83423 96992
15366 96992 4164 -141688 -158850 -227776 -227953 12398 66354 5269 -207027 -295945 -361891
15355 -361891 -152102 33275 -99872 -66403 170696 138589 -100124 -206234 -166417 -170823
15345 -170823 -14127 10726 86249 75179 -188353 -466898 -400459 -205855 -40768 -127118
15335 -127118 -383217 -409151 -253917 -127774 -210351 -265397 -168317 -119657 -168175 -316338 -602326
$$ packed form
15410b9628o2748j88496O5670Q3919J01362Q1257R7969k72925j27334J67069O4041
15399a9844K87392J50488k20329j62270k57762J7441l5547r876K63926P0680m7122
15388C7177q5753J18162J1344j15157P333K15670J5299l6227l2428j72891j52686
15377a90157m3761n5933l256J05203J83225N4049q7094J258N5173O4716J3569
15366I6992r2828j45852j7162o8926j77K40351N3956o1085k12296q8918o5946
15355c61891K09789J85377j33147L3469K37099l2107k38713j06110L9817m406
15345a70823J56696K4853P5523j1070k63532k78545O6439J94604J65087q6350
15335a27118k56099k5934J55234J26143q2577n5046R7080M8660m8518j48163k85988
$$ plain form
15324 -602326 -508181 -445435 -232216 -170019 -115898 -51124 -106941 20473 142980 215022 155513
15313 155513 231339 242283 192508 168374 95510 82904 -184353 -183861 38277 -60473 -175322
15302 -175322 -368128 -235087 -114056 -181024 -282644 -360229 -265373 -211686 -378020 -407102
15292 -407102 -249779 -112214 -121847 -318832 -218511 95693 30669 -35990 88747 44194
15282 44194 -34159 -161188 -304864 -310671 -40598 59872 10856 -67397 85421 81441 13456
15271 13456 49019 163176 -7964 -104972 -146170 -164913 -40993 -29201 -67968 34903 83967
15260 83967 -63627 -51685 152423 264129 131154 -34979 15209 108379 82684 123539 32409
15249 32409 10872 134769 273481 410306 395813 337370 297948 73448 -43388 -96710 -180687
$$ packed form
15324f02326R4145O2746K13219O2197N4121O4774n5817J27414J22507P2042n9509
15313A55513P5826J0944m9775k4134p2864j2606k67257M92K22138r8750j14849
15302a75322j92806J33041J21031o6968j01620p7585R4856N3687j66334k9082
15292d07102J57323J37565r633j96985J00321L14204o5024o6659J24737m4553
15282D4194p8353j27029j43676n807K70073J00470m9016p8253J52818l980o7985
15271A3456L5563J14157j71140r7008m1198j8743J23920J1792l8767J02871M9064
15260H3967j47594J1942K04108J11706j32975j66133N0188R3170k5695M0855r1130
15249C2409k1537J23897J38712J36825j4493n8443l9422k24500j16836n3322q3977
$$ plain form
15238 -180687 -276070 -295169 -201799 -228045 -76032 21021 182633 148404 -92524 -303380 -370060
15227 -370060 -290928 -117723 52281 -85909 -135203 -39304 -46311 -102957 17569 83683 58266
15216 58266 61032 9502 -144830 -139865 14021 -33259 -112121 -109599 -194852 -212309 -491482 -545808
15204 -545808 -557097 -339463 -47462 103042 -72800 -195971 -125795 -78890 28361 1256
15194 1256 -83486 -138321 -37088 44527 -86329 -282768 -104211 -147280 -148872 -223888 -349247
15183 -349247 -520212 -587486 -424086 -358740 -279750 -346098 -397259 -294802 -252928 -301808 -286015
15172 -286015 -100785 -94758 -60990 -132379 -140872 -287264 -142785 110191 101612 20984 46138
15161 46138 153834 281942 304143 312805 64617 -155822 -140071 -176272 -154731 -278794 -413732
$$ packed form
15238a80687r5383j9099R3370k6246J52013R7053J61612l4229k40928k10856o6680
15227c70060P9132J73205J70004j38190m9294R5899p007n6646J20526O6114k5417
15216E8266K766n1530j54332M965J53886m7280p8862K522q5253j7457k79173n4326
15204e45808j1289K17634K92001J50504j75842j23171P0176M6905J07251k7105
15194A256q4742n4835J01233Q1615j30856j96439J78557m3069j592p5016j25359
15183c49247j70965o7274J63400O5346P8990o6348n1161J02457M1874m8880J5793
15172b86015J85230O027L3768p1389q493j46392J44479K52976q579q0628K5154
15161D6138J07696J28108K2201Q662k48188k20439J5751l6201K1541j24063j34938
$$ plain form
15150 -413732 -461441 -283950 -122883 -191558 -153954 -148014 -115136 -218059 -410755 -427320 -573230
15139 -573230 -495999 -296026 -186579 -149579 -260640 -105092 37108 120293 206989 -2268
15129 -2268 -111601 -156424 -226025 -272352 -335527 -423889 -244134 -198363 -208687 -62121 49947
15118 49947 -194152 -403233 -196076 -121778 -263875 -228928 -200376 -104068 -93050 -184007 -247250
15107 -247250 -306927 -277383 -130116 -3675 -52651 -158327 -192745 -180881 -255490 -298504 -400492
15096 -400492 -666483 -622657 -493907 -380567 -351712 -278078 -294642 -198431 -98228 -57430 -58349
15085 -58349 -65440 19757 76912 63523 90148 60455 72532 51923 3775 -269911 -459216
15074 -459216 -275029 -65922 -288068 -358630 -336312 -430609 -496145 -422934 -472896 -539658 -574611
$$ packed form
15150d13732m7709J77491J61067o8675L7604N940L2878j02923j92696j6565j45910
15139e73230P7231J99973J09447L7000j11061J55548J42200Q3185Q6696k09257
15129b268j09333m4823o9601m6327o3175q8362J79755M5771j0324J46566J12068
15118D9947k44099k09081K07157P4298j42097L4947K8552R6308J1018r0957o3243
15107b47250n9677K9544J47267J26441m8976j05676l4418J1864p4609m3014j01988
15096d00492k65991M3826J28750J13340K8855P3634j6564R6211J00203M0798r19
15085e8349p091Q5197N7155j3389K6625k9693J2077k0609m8148k73686j89305
15074d59216J84187K09107k22146p0562K2318r4297o5536P3211m9962o6762l4953
$$ plain form
15063 -574611 -494429 -315130 -81391 -106364 -97106 -59408 -43707 -189963 -388853 -222788 -80899
15052 -80899 -34023 -161093 -236356 -275225 -234568 -358764 -497205 -435727 -490736 -524474 -235386
15041 -235386 45188 92390 16830 -138007 -316649 -192151 -128356 -234755 -109660 -120719
15031 -120719 -223456 -221152 -359590 -172917 -191207 -18270 135546 -50383 -18716 176700
15021 176700 127484 112991 96557 13585 -63512 -21896 46708 -158221 -295151 -313347 -378097
15010 -378097 -297975 -248536 -171581 -147642 -232279 -170885 -272823 -413564 -236879 21008 9799
14999 9799 -87338 -66274 70440 -123486 -23208 -59893 -94120 82405 78181 -84636 14360
14988 14360 23957 -22902 44106 1648 -73923 -103341 -148333 14375 64812 19568 19578 -125028
$$ packed form
15063e74611Q0182J79299K33739k4973R258L7698J5701j46256j98890J66065J41889
15052h0899M6876j27070p5263l8869M0657j24196j38441O1478n5009l3738K89088
15041b35386K80574M7202p5560j54837j78642J24498O3795j06399J25095j1059
15031a20719j02737K304j38438J86673j8290J72937J53816j85929L1667J95416
15021A76700m9216j4493j6434q2972p7097M1616O8604k04929j36930j8196o4750
15010c78097Q0122M9439P6955K3939q4637O1394j01938j40741J76685K57887j1209
14999I799r7137K1064J36714j93926J00278l6685l4227J76525m224j62817R8996
14988A4360R597m6859O7008m2458p5571k9418m4992J62708N0437m5244J0j44606
$$ plain form
14976 -125028 -143933 13808 93380 130106 15899 -3024 161354 171408 169828 -18302 -19805
14965 -19805 -6123 -94198 -18086 167361 166829 -143070 -47392 -115742 -183850 -178037 -296160 -613604
14953 -613604 -499646 -521859 -250002 -151703 -324127 -234423 -8866 -44362 -58043 -132642 126911
14942 126911 243903 122267 37515 123402 147974 50369 20105 -12945 -136776 -265722 -358093
14931 -358093 -141954 19176 76921 97827 -139036 -319851 -278714 -24836 244856 305604
14921 305604 236421 239355 104462 71201 -82650 -232764 -369379 -364552 -174220 -178220 -189621
14910 -189621 22845 242847 182828 111105 86326 -149425 -318663 -229370 -97756 -172427
14900 -172427 146614 123525 -5190 -125697 -268902 -143201 20765 67495 2662 -186960
$$ packed form
14976a25028j8905J57741P9572L6726j14207j8923J64378J0054j580j88130j503
14965a9805J3682q8075P6112J85447n32l09899R5678o8350o8108N813j18123l17444
14953f13604J13958k2213K71857R8299j72424Q9704K25557l5496j3681p4599K59553
14942A26911J16992j21636q4752Q5887K4572r7605l0264l3050j23831j28946r2371
14931c58093K16139J61130N7745K0906k36863j80815M1137K53878K69692O0748
14921C05604o9183K934j34893l3261j53851j50114j36615M827J90332m000j1401
14910a89621K12466K20002o0019p1723k4779k35751j69238Q9293J31614p4671
14900a72427L19041k3089j28715j20507j43205J25701J63966M6730o4833j89622
$$ plain form
14890 -186960 -304248 -312113 -183741 -90427 -162635 -255453 -276829 -338917 -388863 -395162 -234706
14879 -234706 34361 42755 -208005 -321560 -330484 -312945 -267662 -206153 -214115 -414855 -516457
14868 -516457 -324923 -311843 -368955 -255539 -311592 -128267 -87114 -142132 -96805 -146307 -122042
14857 -122042 -355956 -444859 -456516 -351692 -102940 13062 128865 197828 285955 80381
14847 80381 -9759 57668 -34214 -86437 -99566 -36130 -55803 -61226 -18562 65576 -10401 13597
14835 13597 -101869 -89010 -73712 -214527 -224408 -95224 -27748 -204294 -300711 -218776 -377472
14824 -377472 -432411 -279583 -262233 -319333 -168095 -108453 -252115 -253918 -204874 -180539 -173628
14813 -173628 -282170 -264804 -194175 -104974 185528 180580 204770 199751 222654 11369 -84576
$$ packed form
14890a86960j17288p865J28372R3314p2208r2818k1376o2088m9946o299J60456
14879b34706K69067Q394k50760j13555q924J7539M5283O1509p962k00740j01602
14868e16457J91534J3080n7112J13416n6053J83325M1153n5018M5327m9502K4265
14857a22042k33914q8903j1657J04824K48752J16002J15803O8963Q8127k05574
14847H0381r0140O7427r1882n2223j3129O3436j9673n423M2664Q4138p5977K3998
14835A3597j15466J2859J5298j40815r881J29184O7476j76546r6417Q1935j58696
14824c77472n4939J52828J7350n7100J51238N9642j43662j803M9044K4335O911
14813a73628j08542J7366P0629Q9201K90502m948K4190n019K2903k11285r5945
$$ plain form
14802 -84576 -173967 -228027 -167116 -61181 52914 38004 -158092 -272929 -31074 139635
14792 139635 -263921 -454708 -268123 -128907 102950 114396 231065 302890 185640 180025
14782 180025 108473 209029 203002 217542 156491 25807 104614 31052 -112110 -183045 -168827
14771 -168827 -127943 -8272 8463 115228 154847 241813 161841 179993 417959 269947 280935
14760 280935 246575 177402 287306 218137 318131 303321 61051 50529 199396 265475 160331
14749 160331 87137 -97163 -31047 -263443 -463060 -425620 -215630 -221226 -332611 -318000 -337725
14738 -337725 -401228 -551905 -465026 -255063 -50804 48606 212989 225017 212663 120976 141780
14727 141780 217802 251266 309113 170601 105385 240193 -8738 -158884 -85789 -49936 -106084
$$ packed form
14802h4576q9391n4060O0911J05935J14095j4910j96096j14837K41855J70709
14792A39635m03556j90787J86585J39216K31857J1446J16669P1825j17250n615
14782A80025p1552J00556o027J4540o1051j30684P8807p3562j43162p0935J4218
14771a68827M0884J19671J6735J06765L9619Q6966p9972J8152K37966j48012J0988
14760B80935l4360o9173J09904o9169R9994j4810k42270j0522J48867O6079j05144
14749A60331p3194j84300O6116k32396j99617L7440K09990n596j11385J4611j9725
14738c37725o3503j50677Q6879K09963K04259R9410J64383J2028j2354r1687K0804
14727A41780P6022L3464N7847j38512o5216J34808k48931j50146P3095L5853n6148
$$ plain form
14716 -106084 -67252 -112894 -241246 -236639 -341551 -458327 -197342 27701 -46232 -57847 -146531
14705 -146531 -225714 -176870 -184402 -167893 -216288 -196263 65997 133920 52835 145136 106890
14694 106890 -32168 -188929 -378088 -327145 -191113 -144598 -83621 65016 208953 82892
14684 82892 -30048 -76659 -27469 -32343 -155101 -133512 -124315 -293588 -361351 -284872 -270498
14673 -270498 -146632 81237 109943 -21943 -8194 126651 27961 -4620 30120 8008 -70349
14662 -70349 -76072 90586 -22677 -115357 -147396 -190504 -183456 -62205 -127779 -135439 -2666
14651 -2666 2048 -102540 -216471 -222963 -207995 -348649 -548550 -391376 20322 -132089 -202684
14640 -202684 -90836 -122905 -190170 -138582 485 33017 168191 63111 -76131 -5789
$$ packed form
14716a06084L8832m5642j28352M607j04912j16776K60985K25043p3933j1615q8684
14705a46531p9183M8844p532J6509m8395K0025K62260O7923q1085R2301l8246
14694A06890j39058j56761j89159N0943J36032M6515O0977J48637J43937j26061
14684H2892j12940m6611M9190m874j22758K1589R197j69273o7763P6479J4374
14673b70498J23866K27869K8706j31886J3749J34845r8690l2581L4740k2112p8357
14662g0349n723J66658j13263r2680l2039m3108P048J21251o5574p660J32773
14651b666M714j04588j13931o492J4968j40654j99901J57174M11698j52411p0595
14640b02684J11848l2069o7265N1588J39067L2532J35174j05080j39242P0342
$$ plain form
14630 -5789 -128851 -137777 95444 117495 68817 -45068 -128046 -2022 39400 160935 95499
14619 95499 -103176 -326619 -350103 -192394 50990 114396 30048 -26952 -91931 20489 131802
14608 131802 183266 280823 158853 48677 106490 93274 49985 113806 -15489 -272258 -211981
14597 -211981 -172058 -78098 -159975 -255845 -245817 -211835 -80324 -177941 -240526 -188890 -185520
14586 -185520 -161918 -248791 -292243 -227494 -377605 -222403 -126742 -236028 -505645 -608441
14576 -608441 -338302 -108789 111530 123159 7192 -124040 -172043 -141430 -245310 -194987
14566 -194987 -192164 -394138 -406136 -301828 -37680 2939 -23308 15433 -78699 94909 165765
14555 165765 -193113 -362256 -423095 -76564 -26786 -247121 -225046 -7124 206039 42181
$$ packed form
14630e789j23062q926K33221K2051m8678j13885q2978J26024M1422J21535o5436
14619I5499j98675k23443k3484J57709K43384O3406q4348n7000o4979J12420J11313
14608A31802N1464R7557j21970j10176N7813j3216m3289O3821j29295k56769O0277
14597b11981L9923R3960q1877r5870J0028L3982J31511r7617o2585N1636L370
14586a85520K3602q6873m3452O4749j50111J55202R5661j09286k69617j02796
14576f08441K70139K29513K20319J1629j15967j31232m8003L0613j03880N0323
14566a94987K823k01974j1998J04308K64148M0619k6247L8741r4132J73608P0856
14555A65765l58878j69143o0839L46531M9778k20335K2075K17922K13163j63858
$$ plain form
14545 42181 -61194 -219593 -301861 -197816 -137428 -105799 65879 -141781 -319491 -391207
14535 -391207 -181001 -20665 -226546 -301641 -411264 -653596 -472644 -476346 -477707 -326691
14525 -326691 -209141 -239687 -320073 -347367 -255368 -275744 -217549 -179908 -221291 -139448 -57928
14514 -57928 -12466 73621 279655 314994 162200 74098 148928 206504 187618 158659 52557
14503 52557 -103046 134416 54030 158869 86841 5102 -56983 -47011 -167591 -147367 -131143
14492 -131143 -98978 -158170 -132400 -291570 -353953 -162007 41137 -95972 -90407 -203410 -101233
14481 -101233 -68896 -152880 -102030 -15448 127685 25155 -34657 2579 32407 190433 369131
14470 369131 193979 139599 230201 169308 66744 -12514 -11719 -68234 -15111 -3168 40382
$$ packed form
14545D2181j03375j58399q2268J04045O0388L1629J71678k07660j77710p1716
14535c91207K10206J60336k05881p5095j09623k42332J80952l702j361J51016
14525c26691J17550l0546q0386k7294R1999k0376N8195L7641m1383Q1843Q1520
14514e7928M5462Q6087K06034L5339j52794q8102P4830N7576j8886k8959j06102
14503E2557j55603K37462q0386J04839p2028q1739o2085R972j20580K0224J6224
14492a31143L2165n9192K5770j59170o2383J91946K03144j37109N565j13003J02177
14481a01233L2337q3984N0850Q6582J43133j02530n9812L7236K9828J58026J78698
14470C69131j75152n4380R0602o0893j02564p9258P95n6515N3123J1943M3550
$$ plain form
14459 40382 -226616 -324600 -113466 -49114 -130171 -139194 -58721 -16405 154907 249594 139821
14448 139821 137546 153288 -7711 160294 150074 -66581 5403 19336 -58821 -288530 -204412
14437 -204412 -41684 -28640 -101566 -285340 -335251 -236061 -208552 -256036 -247844 -144655 -109450
14426 -109450 25854 107182 -207857 -390475 -183880 -181725 -319203 -388586 -391774 -327020 -331519
14415 -331519 -74797 -103009 -117163 -47685 -103530 -137158 -308959 -437253 -423920 -380937 -345109
14404 -345109 -396812 -360386 -73283 -60974 -173108 -197110 -362175 -410199 -156416 87854
14394 87854 160401 35738 -3800 -16323 -122439 5324 -120684 -255597 -228792 -58466
14384 -58466 -96722 -105299 18764 55730 5439 -19328 -86807 25349 103844 37468 120262
$$ packed form
14459D0382k66998r7984K11134O4352q1057r023Q0473M2316J71312R4687j09773
14448A39821k275J5742j60999J68005j0220k16655P1984J3933p8157k29709Q4118
14437b04412J62728J3044p2926j83774m9911R9190K7509m7484Q192J03189L5205
14426a09450J35304Q1328l15039j82618K06595K155j37478o9383l188O4754m499
14415c31519K56722k8212j4154O9478n5845l3628j71801j28294J3333M2983L5828
14404c45109n1703L6426K87103J2309j12134k4002j65065m8024K53783K44270
14394H7854P2547j24663l9538j2523j06116J27763j26008j34913K6805J70326
14384e8466l8256q577J24063L6966n0291k4767o7479J12156P8495o6376Q2794
$$ plain form
14373 120262 162632 141353 -36245 -13777 -30046 -32775 120987 72287 52627 -48925 -112604
14362 -112604 -106562 -132220 -272064 -412201 -328048 -157404 -71966 -230732 -339058 -63444
14352 -63444 110036 61918 184567 118690 38064 -155461 -109840 106464 237413 186774 75462
14341 75462 16350 -21356 -147630 -103595 -315227 -238750 -170150 -116422 -30194 -96032 -184584
14330 -184584 -186008 -219363 -369852 -280135 -104626 -119596 73982 111403 -114425 -308750 -244986
14319 -244986 -226458 -277879 -296486 -91741 -159041 -349388 -239610 -89815 -56305 116302
14309 116302 243639 135761 100609 -3040 -175977 -49234 93271 62610 -44535 -159633
14299 -159633 -307261 -252147 -156316 63869 138796 127011 102324 364145 191110 -139437
$$ packed form
14373A20262M2370k1279j77598K2468j6269k729J53762m8700j9660j01552o3679
14362a12604O042k5658j39844j40137Q4153J70644Q5438j58766j08326K75614
14352f3444J73480m8118J22649o5877q0626j93525M5621K16304J30949n0639j11312
14341G5462n9112l7706j26274M4035k11632P6477O8600N3728Q6228o5838q8552
14330a84584j424l3355j50489Q9717J75509j4970J93578L7421k25828j94325O3764
14319b44986J8528n1421j8607K04745o7300j90347J09778J49795L3510J72607
14309A16302J27337j07878l5152j03649j72937J26743J42505l0661j07145j15098
14299a59633j47628N5114R5831K20185P4927j1785k4687K61821j73035l30547
$$ plain form
14289 -139437 -84207 -163664 21127 154161 229877 131512 89482 63807 51847 -54827 -220309
14278 -220309 -130976 -103312 -119347 -218612 -367480 -316928 -66899 -887 -17720 12860 -128820
14267 -128820 -280686 -290250 -69063 54458 -123090 -164434 -241078 -202369 53772 97280 78169
14256 78169 279122 239547 151940 53124 -143422 -133520 -21153 -148640 -330076 -345226 -96674
14245 -96674 -20764 162276 187327 38766 -134196 -136068 82790 227002 285842 231453 122673
14234 122673 -48209 21134 272116 175544 -99916 -210284 -186666 -153877 -136623 78694
14224 78694 185238 154724 241156 226022 210867 143601 51623 -9444 111711 202376 -86776
14213 -86776 -291419 -214612 10779 119509 129782 70940 -72885 -174151 -382396 -489783
$$ packed form
14289a39437N5230p9457J84791J33034P5716r8365m2030k5675j1960j06674j65482
14278b20309Q9333K7664j6035r9265j48868N0552K50029O6012j6833L0580j41680
14267a28820j51866r564K21187J23521j77548m1344p6644L8709K56141M3508j9111
14256G8169K00953l9575q7607r8816j96546R902J12367j27487j81436j5150K48552
14245i6674P5910J83040K5051j48561j72962j872K18858J44212N8840n4389j08780
14234A22673j70882O9343K50982r6572k75460j10368K3618L2789J7254K15317
14224G8694J06544l0514Q6432j5134j5155o7266r1978o1067J21155R0665k89152
14213h6776k04643P6807K25391J08730J0273n8842j43825j01266k08245j07387
$$ plain form
14203 -489783 -328017 -222132 -89472 -29984 -217306 -239816 -455303 -392206 -186997 -268055
14193 -268055 -222822 -170346 -132007 40728 213798 122446 -32622 -79109 -93782 -33229 -141141
14182 -141141 -167304 -221073 -174867 -343904 -339768 -296362 -255113 -86247 -137741 -262082 -194352
14171 -194352 -5881 -128155 -237155 -15573 97824 -118974 -41519 94851 -128097 -125556
14161 -125556 5301 25940 -41229 -232647 -181602 -101351 -142067 -205634 -199810 -177888 -127723
14150 -127723 -133530 -220591 -294785 -172729 -14105 33662 128547 219025 16952 -81766 -237202
14139 -237202 -203601 149087 383320 246726 -921 -69702 -3563 14851 195845 371812
14129 371812 341230 305224 -139387 -305561 -274943 -336968 -237053 -148575 19183 -716 -2099
$$ packed form
14203d89783J61766J05885J32660N9488j87322k2510k15487O3097K05209q1058
14193b68055M5233N2476L8339J72735J73070r1352j55068m6487j4673O0553j07912
14182a41141k6163n3769M6206j69037M136M3406M1249J68866n1494j24341O7730
14171a94352J88471j22274j09000K21582J13397k16798P7455J36370k22948K541
14161a25556J30857K0639o7169j91418N1045Q0251m0716o3567N824K1922N0165
14150a27723n807q7061p4194J22056J58624M7767R4885R0478k02073r8718j55436
14139b37202L3601L52688K34233j36594k47647o8781O6139J8414J80994J75967
14129C71812l0582l6006m44611j66174L0618o2025R9915Q8478J67758j9899j383
$$ plain form
14118 -2099 141697 -37676 92266 216261 122247 -7514 117138 234153 208686 143790
14108 143790 134073 446060 409585 178946 95361 77257 184851 123370 -8394 47643 -12052
14097 -12052 -65863 -122646 -255942 -76256 -163347 -157886 -121440 -246941 -350106 -334644 -271687
14086 -271687 -73441 117112 -107432 -245313 -240382 -372334 -410255 -460652 -337225 -186061
14076 -186061 -58656 -112456 -186445 -284841 -89122 -44400 -23262 -272683 -428884 -127547
14066 -127547 -222708 -289297 -80612 -92229 -309976 -173899 -67849 -22305 -139598 -325920
14056 -325920 -236399 -293638 -190652 -182509 -121074 -188503 -182101 -210636 -353990 -403353 -361598
14045 -361598 -253297 -216922 -315899 -281076 -235733 -186706 -180377 -252950 -237460 -289215 -247288
$$ packed form
14118b099J43796j79373J29942J23995r4014j29761J24652J17015k5467o4896
14108A43790r717L11987l6475k30639q3585j8104J07594o1481j31764N6037n9695
14097a2052n3811n6783j33296J79686q7091N461L6446j25501j03165J5462O2957
14086b71687J98246J90553k24544j37881M931j31952l7921n0397J23427J51164
14076a86061J27405n3800p3989r8396J95719M4722K1138k49421j56201L01337
14066a27547r5161o6589K08685j1617k17747J36077J06050M5544j17293j86322
14056c25920Q9521n7239J02986Q143O1435o7429O402k8535j43354m9363M1755
14045c61598J08301L6375r8977L4823M5343M9027O329p2573J5490n1755M1927
$$ plain form
14034 -247288 -115205 -62673 -104548 -130545 -248645 -344360 -506323 -459809 -369266 -371320 -444124
14023 -444124 -463259 -137976 -92118 -118869 -161861 -26629 112692 57818 -20355 -156718 -53651
14012 -53651 116307 184278 100161 -129195 -350289 -14345 106076 173947 199818 318674
14002 318674 251127 287937 290270 -47754 19599 -12736 51482 -36817 -103284 -151367 -64539
13991 -64539 28392 22626 -869 102979 63865 -16916 18730 -124928 -352467 63733 434941
13980 434941 473658 437607 420283 232430 59823 101651 76156 113617 117405 273605 401745
13969 401745 385621 333026 369856 298252 -795 -131889 -261210 -380336 -409130 -293046
13959 -293046 -208800 -281054 -255543 -238092 36521 247569 471065 389342 344197 249679 107302
$$ packed form
14034b47288J32083N2532m1875k5997j18100r5715j61963M6514R0543k054p2804
14023d44124j9135L25283M5858k6751m2992J35232J39321n4874p8173j36363J03067
14012e3651J69958O7971q4117k29356k21094L35944J20421O7871K5871J18856
14002C18674o7547L6810K333l38024O7353l2335O4218q8299o6467m8083Q6828
13991f4539R2931n766k3495J03848l9114q0781L5646j43658k27539M16200L71208
13980D34941L8717l6051j7324j87853j72607M1828k5495L7461L788J56200J28140
13969D01745j6124n2595L6830p1604k99047j31094j29321j19126k8794J16084
13959b93046Q4246p2254K5511J7451K74613K11048K23496q1723m5145r4518j42377
$$ plain form
13948 107302 72951 -13960 -215284 -264197 -377186 -203242 65502 213478 250328 203604
13938 203604 22704 -147116 -66040 -56603 -174968 -180776 -279294 -572982 -438800 -319022 -249358
13927 -249358 -30845 -52656 -158716 -229040 -249086 -193856 -164716 -38926 -64334 -230138 -255437
13916 -255437 -381800 -536261 -627572 -488592 -232777 -192381 -167791 110078 342369 303239
13906 303239 114064 12740 86571 233001 178712 45543 42370 16287 5092 24223 -280377
13895 -280377 -345551 -205914 -214572 -159164 -250729 -385813 -290276 -277928 -221546 -77171 90637
13884 90637 16896 -211070 -201890 -19046 147066 148019 140739 148105 219918 69517 92879 222839
13872 222839 216681 121430 263508 133587 -93327 -5242 128624 81839 -82498 -173833 -148709
$$ packed form
13948A07302l4351q6911k01324m8913j12989J73944K68744J47976L6850m6724
13938B03604j80900j69820Q1076R437j18365n808r8518k93688J34182J19778O9664
13927b49358K18513k1811j06060p0324k0046N5230K9140J25790k5408j65804k5299
13916b55437j26363j54461r1311J38980K55815M0396K4590K77869K32291l9130
13906C03239j89175j01324P3831J46430n4289j33169l173k6083j1195J9131l04600
13895b80377o5174J39637q658N5408r1565j35084R5537J2348N6382J44375J67808
13884I0637p3741k27966R180J82844J66112R53p280P366P1813j50401K3362J29960
13872B22839o158r5251J42078j29921k26914Q8085J33866m6785j64337r1335K5124
$$ plain form
13861 -148709 -392046 -197138 86978 45535 53356 163734 213488 140023 -9462 -124095
13851 -124095 -123753 35796 95457 -33945 155144 346823 359383 213491 -119056 -110637 67257
13840 67257 196995 24149 -235330 -369750 -473300 -402986 -302716 -353246 -87577 -82353
13830 -82353 -43611 -30535 -102930 -70610 -239508 -405818 -423141 -476740 -535406 -388620 -241583
13819 -241583 -95822 -88208 -112291 -51329 42193 39021 51700 78812 100431 30545 -173978
13808 -173978 -150107 -78981 -41044 113952 166469 97847 14578 60473 109293 -38627 -213939
13797 -213939 -184084 25204 105172 129957 136471 6585 83717 192709 188495 156191 201333
13786 201333 277620 282233 77593 -315514 -424269 -362532 -314361 -216718 -79316 -179558 -230644
$$ packed form
13861a48709k43337J94908K84116m1443P821J10378M9754p3465j49485j14633
13851a24095L42J59549N9661j29402J89089J91679J2560j45892l32547Q419J77894
13840F7257J29738j72846k59479j34420j03550P0314J00270n0530K65669N224
13830h2353L8742J3076p2395L2320j68898j66310j7323n3599n8666J46786J47037
13819b41583J45761P614k4083O0962R3522l172J2679K7112K1619o9886k04523
13808a73978K3871P1126L7937J54996N2517o8622q3269M5895M8820j47920j75312
13797b13939K9855K09288P9968K4785O514j29886P7132J08992m214l2304M5142
13786B01333P6287M613k04640l93107j08755O1737M8171R7643J37402j00242n1086
$$ plain form
13775 -230644 -327517 -325892 -254005 -144138 -78919 -46654 -211630 -112170 -86787 -272255 -158046
13764 -158046 -30214 193843 268806 178089 316206 349745 376047 218752 167841 32221
13754 32221 -130115 -216816 34907 191977 -26821 -274501 -233493 23698 15679 183784
13744 183784 317088 -8409 -237360 -378500 -162754 1241 61193 77945 23072 17870
13734 17870 101816 -36316 -112035 -29240 50478 -175147 -239568 -373878 -402859 -424170 -592150
13723 -592150 -381904 -221846 -117327 -155116 -349255 -378860 -220548 -159811 106079 87941
13713 87941 -61075 29881 166723 171477 -123241 -224127 -409617 -504922 -357859 -143194
13703 -143194 -89741 -200283 -224338 -180478 -21362 -117661 -182926 -35968 22765 34655 84540
$$ packed form
13775b30644r6873J625P1887J09867O5219L2265j64976R9460K5383j85468J14209
13764a58046J27832K24057P4963r0717J38117L3539K6302j57295n0911j35620
13754C2221j62336q6701K51723J57070k18798k47680M1008K57191q019J68105
13744A83784J33304l25497k28951j41140K15746J63995N9952J6752n4873n202
13734A7870Q3946j38132p5719Q2795P9718k25625o4421j34310k8981k1311j67980
13723e92150K10246J60058J04519l7789j94139k9605J58312O0737K65890j8138
13713H7941j49016R0956J36842M754k94718j00886j85490r5305J47063K14665
13703a43194N3453j10542k4055M3860J59116r6299o5265J46958N8733J1890M9885
$$ plain form
13692 84540 84840 -100202 -156346 -100081 -23358 -119613 -199733 -63467 4567 -7098 68948 254173
13680 254173 329432 402031 314982 163305 -40297 -116244 66982 78353 417 -19865 118316
13669 118316 114095 53843 30384 31838 1841 -28724 -23919 49915 -108473 -42780 15212 179321
13657 179321 161213 93572 123684 -2589 -46925 227363 205308 151130 -34767 -123262 -70949
13646 -70949 -58449 -35767 -5964 -133436 -60646 -30599 -141011 -172473 -113991 -40156 -43390
13635 -43390 -2832 -81851 -280211 -334608 -60477 -199269 -284601 -74941 88834 -41602
13625 -41602 48186 184591 123486 29102 48107 5025 -67357 -116764 -24821 64391 -11333
13614 -11333 -161377 -164741 160939 194809 310956 378836 394934 74781 26194 -8515 -67312
$$ packed form
13692H4540L00j85042n6144N6265P6723r6255q0120J36266O8034j1665P6046J85225
13680B54173P5259P2599q7049j51677k03602p5947J83226J1371p7936k0282J38181
13669A18316m221o0252k3459J454k9997l0565M805P3834j58388O5693N7992J64109
13657A79321j8108o7641L0112j26273m4336K74288k2055n4178j85897q8495N2313
13646g0949J2500K2682K9803j27472P2790L0047j10412l1462N8482P3835l234
13635d3390M0558p9019j98360n4397K74131j38792q5332K09660J63775j30436
13625d1602Q9788J36405o1105r4384J9005m3082p2382m9407R1943Q9212p5724
13614a1333j50044l364L25680L3870J16147O7880J6098l20153m8587l4709n8797
$$ plain form
13603 -67312 -169093 -143664 13347 -91133 -186917 -248649 -245537 -171071 -48685 -94517 -292475
13592 -292475 -157620 69458 225480 163629 -12153 33616 83247 -116316 -280449 -181893
13582 -181893 -86067 49137 142963 344360 362302 363564 166495 -44075 -103657 -61030 51089
13571 51089 76237 91980 194124 212534 37721 -243923 -164219 -159056 -281421 -333682 -69629
13560 -69629 21399 -11656 -212153 -247110 -253248 -420589 -508079 -333279 27335 93292 -155410
13549 -155410 -235932 50774 164059 284081 330617 356308 193993 215838 86853 36080
13539 36080 13537 16880 8204 2554 190891 351710 454210 362046 63518 -18031 161480
13528 161480 135804 3627 -14566 38435 190654 71555 -237107 -185167 84464 -119017
$$ packed form
13603f7312j01781K5429J57011j04480r5784o1732L112P4466J22386m5832j97958
13592b92475J34855K27078J56022o1851j75782M5769M9631j99563j64133R8556
13582a81893R5826J35204R3826K01397J7942J262j97069k10570n9582M2627J12119
13571E1089K5148J5743J02144J8410j74813k81644P9704N163j22365n2261K64053
13560f9629R1028l3055k00497l4957o138j67341q7490J74800L60614O5957k48702
13549a55410q0522K86706J13285J20022M6536K5691j62315K1845j28985n0773
13539C6080k2543L343q676n650J88337J60819J02500r2164k98528q1549J79511
13528A61480k5676j32177j8193N3001J52219j19099l08662N1940K69631k03481
$$ plain form
13518 -119017 -245605 -42388 153018 171603 264742 304607 25549 166811 294923 184040
13508 184040 83449 36351 21231 -182402 -186350 28959 211078 8772 91024 212990
13498 212990 257589 179470 -83362 -7607 -57230 -120477 56341 -49958 -190321 -225455 -248983
13487 -248983 -350928 -375945 -229193 -164 156763 210352 288580 363292 327594 109007
13477 109007 38315 -10183 -137180 -208583 -96476 60251 1767 -119258 -78772 -93963 -181260
13466 -181260 -285387 -346616 -106762 -164266 -101028 -2373 -168170 -95677 -30644 -38819 -168541
13455 -168541 103782 207050 243783 351691 182394 -116614 -89204 35784 97507 -20599
13445 -20599 -78253 46887 -15409 -9458 20596 -72261 -90990 91570 -2605 -61664 55914
$$ packed form
13518a19017j26588K03217J95406J8585R3139L9865k79058J41262J28112j10883
13508A84040j00591m7098j5120k03633l948K15309J82119k02306Q2252J21966
13498B12990M4599p8119k62832P5755m9623o3247J76818j06299j40363l5134k3528
13487b48983j01945k5017J46752K29029J56927N3589P8228P4712l5698k18587
13477A09007p0692m8498j26997p1403J12107J56727n8484j21025M0486j5191q7297
13466a81260j04127o1229K39854n7504O3238R8655j65797P2493O5033q175j29722
13455a68541K72323J03268L6733J07908j69297k99008K7410J24988O1723j18106
13445b0599n7654J25140o2296N951L0054r2857j8729J82560r4175n9059J17578
$$ plain form
13434 55914 144596 -114248 -178197 4639 28570 -163011 15964 195931 160252 279932
13424 279932 300364 321109 45152 -207742 -260037 -90316 -38341 -83022 -138858 -250969 -139200
13413 -139200 -83582 -106601 -154300 -21471 135643 -42542 -17121 173520 227339 263400 117108
13402 117108 71274 86314 43784 181210 191452 290528 287786 86681 38337 96596 98494
13391 98494 219370 159308 215349 289451 186891 90156 -15095 -45128 -220463 -276838 -293845
13380 -293845 -21103 41184 41755 274005 67611 -202051 -273330 -252280 -342501 -451987 -337252
13369 -337252 -266836 -228396 -228429 -166242 -176197 -93366 -99423 -266895 -230739 -88246 -141601 -110711
13357 -110711 -131250 29084 219530 333431 -28138 -279670 -340916 -149564 -66239 44083
$$ packed form
13434E5914Q8682k58844o3949J82836K3931j91581J78975J79967l5679J19680
13424B79932K0432K0745k75957k52894n2295J69721N1975m4681n5836j12111J11769
13413a39200N5618k3019m7699J32829J57114j78185K5421J90641N3819L6061j46292
13402A17108m5834J5040m2530J37426J0242R9076k742k01105m8344N8259J898
13391I8494J20876o0062N6041P4102j02560r6735j05251l0033j75335n6375j7007
13380b93845K72742O2287N71K32250k06394k69662p1279K1050r0221j09486J14735
13369c37252P0416L8440l3O2187r955Q2831o057j67472L6156J42493n3355L0890
13357a10711k0539J60334J90446J13901l61569k51532o1246J91352Q3325J10322
$$ plain form
13347 44083 171313 25700 -69570 -18601 -129658 -307212 -257829 -129871 119142 426795
13337 426795 426593 352610 307668 283893 97592 -19960 -4326 -158512 -360536 -146538 -37790
13326 -37790 -115354 -241346 -404405 -338815 -108769 -23018 -17916 -93817 -103225 -156395 -144518
13315 -144518 -43794 113921 310279 362056 193670 37396 101917 143923 116001 109714 152572
13304 152572 113137 59227 32526 -102465 -143966 -2083 -22045 -48546 86841 155029 180731
13293 180731 199245 -13156 -103170 -73366 -127063 -339700 -202210 75328 28468 40337 -122651
13282 -122651 -114759 -51120 218431 275828 71996 -185160 -139677 -136714 -324945 -297727 -342732
13271 -342732 -242900 -188212 -288956 -338910 -306394 -138490 -14442 -86843 -32134 -51732 -15902
$$ packed form
13347D4083J27230j45613r5270N0969j11057j77554M9383J27958K49013L07653
13337D26795k02p3983m4942k3775j86301j17552J5634j54186k02024K13998J08748
13326c7790p7564j25992j63059O5590K30046Q5751N102p5901r408n3170J1877
13315a44518J00724J57715J96358N1777j68386j56274O4521M2006k7922o287M2858
13304A52572l9435n3910k6701j34991m1501J41883j9962k6501J35387O8188K5702
13293A80731J8514k12401r0014K9804n3697k12637J37490K77538m6860J1869j62988
13282a22651P892O3639K69551N7397k03832k57156M5483K963j88231K7218m5005
13271c42732R9832N4688j00744m9954L2516J67904J24048p2401N4709j9598L5830
$$ plain form
13260 -15902 -181330 -65450 21664 -94391 -76378 184504 286413 154139 -3869 124591
13250 124591 367828 344622 244155 255612 125991 88165 169318 22915 133004 187875
13240 187875 242251 338852 418860 165401 233372 358721 185163 -76407 -221078 -257911
13230 -257911 -123218 105558 138962 170826 262962 283958 132061 63698 -25470 132802 -43929
13219 -43929 -140395 -8440 66613 56001 58362 51242 162034 143638 -55033 -97507 26849
13208 26849 14457 -178227 -68377 123882 265676 163754 156955 248152 273433 232862 82483
13197 82483 130879 150812 332790 210041 54645 59164 28324 -6779 -19438 -93867 -64946
13186 -64946 145522 225504 178932 153381 85668 -125510 -113963 -57633 -12373 -62113 -194569
$$ packed form
13260a5902j65428J15880Q7114j16055J8013K60882J01909j32274j58008J28460
13250A24591K43237k3206j00467J1457j29621l7826Q1153j46403J10089N4871
13240A87875N4376R6601Q0008k53459O7971J25349j73558k61570j44671l6833
13230b57911J34693K28776L3404L1864R2136K0996j51897o8363q9168J58272j76731
13219d3929r6466J31955P5053j0612K361p120J10792j8396j98671m2474J24356
13208B6849j2392j92684J09850J92259J41794j01922o799R1197K5281m0571j50379
13197H2483M8396J9933J81978j22749j55396M519l0840l5103j2659p4429K8921
13186f4946K10468P9982m6572k5551o7713k11178J1547N6330M5260m9740j32456
$$ plain form
13175 -194569 -255128 63712 127756 161563 154037 117937 48671 141077 213757 89470 -4930
13164 -4930 109905 13775 -15285 -114008 -148420 29374 -25123 98279 281850 451560 403928
13153 403928 330882 104616 -63514 -53856 162258 254062 135247 80625 140578 45663 -25900
13142 -25900 -303951 -421824 -269663 -67228 -43029 50331 211585 385924 380272 197008
13132 197008 14336 -24176 97838 169909 236120 251241 334004 378034 235877 45810 99366
13121 99366 261370 114578 -112516 -301915 -241903 -77087 47533 -62115 -179905 -153418
13111 -153418 -111306 -175870 -205689 125576 32164 -71832 -165816 -203610 -206724 -44799 78681
13100 78681 -71811 -294029 -212358 25932 205886 219031 149091 177009 86062 24971 63544
$$ packed form
13175a94569o0559L18840O4044L3807p526l6100o9266R2406P2680j24287r4400
13164d930J14835r6130k9060r8723l4412J77794n4497J23402J83571J69710m7632
13153D03928p3046k26266j68130R658K16114R1804j18815n4622N9953r4915p1563
13142b5900k78051j17873J52161K02435K4199R3360J61254J74339n652j83264
13132A97008j82672l8512J22014P2071O6211J5121Q2763M4030j42157j90067N3556
13121I9366J62004j46792k27094j89399O0012J64816J24620j09648j17790K6487
13111a53418M2112o4564k9819L31265r3412j03996r3984l7794l114J61925J23480
13100G8681j50492k22218Q1671K38290J79954J3145o9940K7918r0947o1091L8573
$$ plain form
13089 63544 88082 1830 139848 250779 238214 31227 59084 258560 115532 318
13079 318 149965 326806 96772 146410 366614 499980 428543 472695 414943 109700 -125742
13068 -125742 -230082 -120541 59719 53785 42352 -52694 -109183 -51505 -25606 113985 53032
13057 53032 40099 169789 313950 340407 218523 122812 85273 -88 -36189 186714 211135
13046 211135 16198 -22200 -192123 -65384 171037 285818 273270 92378 176509 337238
13036 337238 223001 27749 -28421 91297 183628 106690 -154759 -184895 -47803 -51067 -51160
13025 -51160 -38865 -1826 201041 106523 203293 492412 449267 266906 86902 -24048 78092
13014 78092 173210 143887 -65960 29803 -5478 -147969 -260114 -107002 95592 182056 46992
$$ packed form
13089F3544K4538q6252J38018J10931j2565k06987K7857J99476j43028j15214
13079C18J49647J76841k30034M9638K20204J33366p1437M4152n7752l05243k35442
13068a25742j04340J09541J80260n934j1433r5046n6489N7678K5899J39591o0953
13057E3032j2933J29690J44161K6457j21884r5711l7539q5361l6101K22903K4421
13046B11135j94937l8398j69923J26739K36421J14781j2548j80892Q4131J60729
13036C37238j14237j95252n6170J19718R2331p6938k61449l0136J37092l264r3
13025e1160J2295L7039K02867r4518R6770K89119m3145j82361j80004j10950J02140
13014G8092R5118k9323k09847R5763l5281j42491j12145J53112K02594Q6464j35064
$$ plain form
13003 46992 82099 83517 13459 189877 151851 78594 -77286 -10101 96468 -78517 -39837
12992 -39837 -41411 -155547 -123753 -49877 -76833 41967 22636 -33881 -22594 59646 -36405
12981 -36405 -55524 -293401 -238136 -154209 -230632 -418886 -437598 -387357 -367113 -300914 -14612
12970 -14612 282659 360202 404129 306527 384805 381021 220522 27830 -106102 -80179 -102864
12959 -102864 15343 37557 91964 248173 335887 108603 -199576 -251908 -274086 -168448
12949 -168448 114812 7277 11645 195165 175201 59859 -163293 -92699 -9709 28165 126925
12938 126925 105993 152099 167742 352991 290433 358324 271334 241081 433912 323340 279073
12927 279073 320202 360799 262884 198356 263273 387572 199938 93092 -15635 -184586
$$ packed form
13003D6992L5107J418p0058J76418l8026p3257j55880O7185J06569j74985L8680
12992c9837j574j14136L1794P3876k6956J18800j9331n6517J1287Q2240r6051
12981c6405j9119k37877N5265Q3927p6423j88254j8712N0241K0244O6199K86302
12970a4612K97271P7543M3927r7602P8278l784j60499j92692j33932K5923k2685
12959a02864J18207K2214N4407J56209Q7714k27284l08179n2332k2178J05638
12949a68448K83260j07535M368J83520j9964j15342k23152P0594Q2990L7874R8760
12938A26925k0932M6106J5643J85249o2558O7891q6990l0253J92831j10572m4267
12927B79073M1129M0597r7915o4528O4917J24299j87634j06846j08727j68951
$$ plain form
12917 -184586 32863 202641 286608 411715 378257 204035 232493 298080 249590 330570 399224
12906 399224 470778 498476 371743 289959 296766 371356 270957 188143 285994 279407 338654
12895 338654 463369 513583 443907 443899 451849 487733 527243 555506 534631 432827 344587 684582
12883 684582 805413 693157 618545 455843 331191 182490 73735 -9408 22886 53769
12873 53769 -115035 -42671 146070 362955 232438 -147188 -331036 -184885 51455 24823
12863 24823 -64629 50643 146769 204813 156349 -105252 -326096 -248033 54278 312455 426865
12852 426865 591641 699127 597920 594786 620891 602906 472336 234228 367761 347810
12842 347810 67062 -4075 18809 136278 262835 396942 389251 372517 474558 288629
$$ packed form
12917a84586K17449J69778Q3967J25107l3458j74222K8458O5587m8490Q0980O8654
12906C99224P1554K7698j26733q1784O807P4590j00399q2814R7851o587N9247
12895C38654J24715N0214o9676qP950L5884L9510K8263k0875j01804q8240L39995
12883F84582J20831j12256p4612j62702j24652j48701j08755q3143L2294L0883
12873E3769j68804P2364J88741K16885j30517l79626j83848J46151K36340k6632
12863B4823q9452J15272R6126N8044m8464k61601k20844P8063L02311K58177J14410
12852D26865J64776J07486j01207l134K6105j7985j30570k38108J33533j9951
12842C47810k80748p1137K2884J17469J26557J34107p691j6734J02041j85929
$$ plain form
12832 288629 230981 248684 451798 492051 455896 298440 208178 318052 253678 305071 315217
12821 315217 97937 -14096 -129045 -193593 -138252 -120170 53389 294549 234227 212724
12811 212724 83189 105567 290554 162106 159574 209965 187655 380341 385685 431484 453765
12800 453765 304978 44135 39561 -13123 95141 167413 183450 304085 260029 225425 333259
12789 333259 462783 256048 239935 126970 22397 -7712 12669 256011 379360 394054
12779 394054 402638 417177 419417 363193 152175 135038 211534 295636 365812 292359 144720
12768 144720 -4694 4116 72385 183752 364232 489502 371909 363943 294917 158178 297358
12757 297358 413328 215981 165124 277318 286314 310987 312518 230669 270519 263324 121261
$$ packed form
12832B88629n7648J7703K03114M0253l6155j57456r0262J09874o4374N1393J0146
12821C15217k17280j12033j14949o4548N5341J8082J73559K41160o0322k1503
12811B12724j29535K2378J84987j28448k532N0391k2310J92686N344M5799K2281
12800D53765j48787k60843m574n2684J08264P2272J6037J20635m4056l4604J07834
12789C33259J29524k06735j6113j12965j04573l0109K0381K43342J23349J4694
12779C94054Q584J4539K240n6224k11018j7137P6496Q4102P0176p3453j47639
12768A44720j49414Q810O8269J11367J80480J25270j17593p966o9026j36739J39180
12757B97358J15970j97347n0857J12194Q996K4673J531q1849L9850p195j42063
$$ plain form
12746 121261 153615 213446 188347 401199 415964 390543 411238 463160 513231 546783 264816
12735 264816 223462 218393 209130 117251 -23466 -80433 -185986 -129 274620 300104 276824
12724 276824 294398 294950 318845 321319 327738 319025 411872 411608 203803 132719 186794 320834
12712 320834 401019 535302 826529 837611 726488 664922 549320 416790 314346 252740
12702 252740 355122 440094 580574 553719 422104 382726 482576 493205 513235 395256 464822
12691 464822 431917 535052 566541 443012 449197 532752 639917 636711 578725 438357 491162
12680 491162 356967 370651 609996 398194 494738 435952 438031 684060 703176 619470 409113
12669 409113 353010 369130 444539 706761 721585 666202 744806 698163 760022 778071 690227
$$ packed form
12746A21261L2354N9831k5099K12852J4765k5421K0695N1922N0071L3552k81967
12735B64816m1354n069r263r1879j40717n6967j05553J85857K74749K5484k3280
12724B76824J7574N52K3895K474O419q713R2847k64k07805p1084N4075J34040
12712C20834Q0185J34283K91227J1082j11123o1566j15602j32530j02444o1606
12702B52740J02382Q4972J40480k6855j31615l9378R9850J0629K0030j17979O9566
12691D64822l2905J03135L1489j23529O185Q3555J07165l206n7986j40368N2805
12680D91162j34195J3684K39345k11802R6544n8786K079K46029J9116q3706k10357
12669D09113n6103J6120P5409K62222J4824n5383P8604m6643O1859J8049q7844
$$ plain form
12658 690227 590908 457660 467937 655963 909536 997647 754481 575050 407224 497892
12648 497892 566323 593701 667437 855251 815599 537244 201142 277478 364002 307934 405444
12637 405444 622049 475585 349570 428890 513606 655449 894469 871212 875630 767289
12627 767289 732191 803868 734351 394852 223391 170856 260940 497502 617553 790729
12617 790729 735085 626881 606237 547388 375292 271508 401010 479214 427549 540078
12607 540078 637213 456871 579438 584481 517260 527736 615553 642714 668843 538810 665232
12596 665232 782592 539439 523674 461341 353401 425481 494499 699114 863427 617020
12586 617020 424241 475966 539658 577085 740711 682224 781095 804522 728233 716475 615908
$$ packed form
12658F90227r9319j33248J0277J88026K53573Q8111k43166j79431j67826R0668
12648D97892O8431K7378P3736J87814l9652k78355l36102P6336Q6524n6068R7510
12637D05444K16605j46464j26015P9320Q4716J41843K39020k3257M418j08341
12627G67289l5098P1677o9517l39499j71461n2535R0084K36562J20051J73176
12617G90729n5644j08204k0644n8849j72096j03784J29502P8204n1665J12529
12607E40078R7135j80342J22567N043o7221J0476Q7817K7161K6129j30033J26422
12596F65232J17360k43153j5765o2333j07940P2080O9018K04615J64313k46407
12586F17020j92779N1725O3692L7427J63626n8487R8871K3427p6289j1758j00567
$$ plain form
12575 615908 564421 669113 598833 418714 460661 742729 766067 869845 903309 925963 910523
12564 910523 839411 761141 719817 809857 843062 860223 769751 431610 498084 656416 869556
12553 869556 944229 987011 996463 958117 944518 849367 950623 819414 720616 704171 621212
12542 621212 527908 764203 902591 624898 449364 579968 718072 859074 946748 1092615
12532 1092615 958828 1088693 1059501 949306 877512 885319 868822 801791 928077 953157 826685
12521 826685 886847 1064895 1134886 1228531 1151588 805327 680048 952352 1092426 998416
12511 998416 1031006 900354 793981 898181 943097 948019 1119666 1123541 894257 899587 1049721
12500 1049721 1137436 1122865 1039389 1082600 1188500 1028688 927301 1003374 1058731 1144887 1343599
$$ packed form
12575F15908n1487J04692p0280j80119M1947K82068K3338J03778L3464K2654j5440
12564I10523p1112p8270m1324R0040L3205J7161r0472l38141O6474J58332K13140
12553H69556P4673M2782R452l8346j3599r5151J01256j31209r8798j6445q2959
12542F21212r3304K36295J38388k77693j75534J30604J38104J41002Q7674J45867
12532A092615j33787J29865k9192j10195p1794P807j6497o7031J26286K5080j26472
12521H26685O0162J78048O9991R3645p6943l46261j25279K72304J40074r4010
12511I98416L2590j30652j06373J04200M4916M922J71647L875k29284N330J50134
12500A049721Q7715j4571q3476M3211J05900j59812j01387P6073N5357Q6156J98712
$$ plain form
12489 1343599 1293106 1257026 1277722 974929 760835 804117 801310 986846 1210473 1319257
12479 1319257 1208594 996792 878005 798563 787521 856724 855088 848411 697390 821598 870647
12468 870647 965986 992861 1188371 1260976 1254094 1015577 1010281 1049288 1102498 1096268 1062388 1237439
12456 1237439 1321217 1516414 1599165 1563601 1567359 1488403 1429187 1341642 1236753 1220151 1198739
12445 1198739 1213606 1451952 1507062 1301502 1312474 1305568 1437416 1511464 1448528 1341601 1401401
12434 1401401 1448255 1453448 1365023 1380338 1484497 1517741 1445580 1388760 1276114 1345921 1519102
12423 1519102 1561742 1583584 1464191 1374172 1489276 1361323 1205724 1255441 1646338 1871030
12413 1871030 1686119 1611938 1698977 1757116 1757899 1776995 1883187 1782619 1617183 1705116 1707846
$$ packed form
12489A343599n0493l6080K0696l02793k14094M3282k807J85536K23627J08784
12479A319257j10663k11802j18787p9442j1042O9203j636o677j51021J24208M9049
12468H70647R5339K6875J95510P2605o882k38517n296L9007N3210o230l3880J75051
12456A237439Q3778J95197Q2751l5564L758p8956n9216q7545j04889j6602k1412
12445A198739J4867K38346N5110k05560J0972o906J31848P4048o2936j06927N9800
12434A401401M6854N193q8425J5315J04159L3244p2161n6820j12646O9807J73181
12423A519102M2640K1842j19393r0019J15104j27953j55599M9717L90897K24692
12413A871030j84911p4181Q7039N8139P83J9096J06192j00568j65436Q7933K730
$$ plain form
12402 1707846 1752456 1929225 1911646 1994730 2164461 2211222 2028052 2096847 1881054 1599241
12392 1599241 1593467 1763111 1751728 1559238 1679006 1834517 1752022 1565593 1667620 1851118
12382 1851118 1873574 1872175 1886821 1887434 1852107 1949260 2156316 2345226 2286848 2143147 2222540
12371 2222540 2300069 2453182 2311645 2335201 2402508 2387289 2294727 2201250 2115810 2182761 2310307
12360 2310307 2383747 2580983 2574905 2696159 2646405 2589749 2646836 2548479 2447063 2563672 2762468
12349 2762468 2673723 2508390 2418356 2523398 2579014 2388344 2253069 2255318 2459683 2672540
12339 2672540 2805494 2787347 2908575 2877194 2721929 2774385 3082689 3019804 2925892 2972179
12329 2972179 2944821 3293755 3395755 3266816 3054399 3142629 3254530 3135666 3138181 3042316
$$ packed form
12402A707846M4610J76769j7579Q3084J69731M6761j83170O8795k15793k81813
12392A599241n774J69644j1383j92490J19768J55511q2495j86429J02027J83498
12382A851118K2456j399J4646O13l5327R7153K07056J88910n8378j43701P9393
12371B222540P7529J53113j41537K3556O7307j5219r2562r3477q5440O6951J27546
12360B310307P3440J97236o078J21254m9754n6656N7087r8357j01416J16609J98796
12349B762468q8745j65333r0034J05042N5616j90670j35275K249K04365K12857
12339B672540J32954j8147J21228l1381j55265N2456L08304o2885r3912M6287
12329B972179k7358L48934J02000j28939k12417Q8230J11901j18864K515r5865
$$ plain form
12319 3042316 2934021 3042213 3267620 3222575 3060671 3041714 3401644 3711013 3605994 3587028
12309 3587028 3657600 3736071 3699921 3735831 3629548 3505659 3675514 3784040 3770438 3687277
12299 3687277 3632604 3692232 3814404 3780102 3806130 3842379 3936680 3933767 4009037 4149377 4238866
12288 4238866 4162074 4150195 4256455 4257443 4252148 4277679 4320641 4614630 4612896 4476837 4389956
12277 4389956 4426572 4652038 4729201 4905860 5014467 4992479 4778574 4874660 4979100 4878049
12267 4878049 4959782 4919166 5124920 5184374 5132515 5205963 5228800 5214804 5243573 5167663 5434539
12256 5434539 5659436 5674429 5831175 5852400 5999226 6080837 6157660 6095411 6147589 6181420 6155911
12245 6155911 6295314 6482548 6416266 6681898 6767982 6877687 7027723 6961804 7093813 7273787
$$ packed form
12319C042316j08295J08192K25407m5045j61904j8957L59930L09369j05019j8966
12309C587028P0572P8471l6150L5910j06283j23889J69855J08526j3602q3161
12299C687277n4673N9628J22172l4302K6028L6249R4301k913P5270J40340Q9489
12288D238866p6792j1879J06260R88n295K5531M2962K93989j734j36059q6881
12277D389956L6616K25466P7163J76659J08607k1988k13905R6086J04440j01051
12267D878049Q1733m0616K05754N9454n1859P3448K2837j3996K8769p5910K66876
12256E434539K24897J4993J56746K1225J46826Q1611P6823o2249N2178L3831k5509
12245F155911J39403J87234o6282K65632Q6084J09705J50036o5919J32009J79974
$$ plain form
12235 7273787 7242919 7149899 7156578 7315451 7529420 7525156 7711091 7833721 7962264 8208756
12225 8208756 8344649 8650288 8718994 8557844 8526634 8553174 8510124 8575981 8778004 8941640
12215 8941640 9044636 9152837 9264313 9349158 9331481 9492733 9681390 9828508 9905047 9901946
12205 9901946 9949949 10097000 10539789 10631724 10800012 10908709 11132902 11208314 11177804 11313310
12195 11313310 11655515 11979673 12030108 12260598 12543041 12621111 12703012 12874451 13042989 13173739
12185 13173739 13089814 13047055 13165745 13564540 13718700 13984432 14396712 14806357 14900724 14896200
12175 14896200 15178562 15637145 15826662 15990456 16060522 16335938 16415152 16491068 16768036 16966083
12165 16966083 17274656 17656792 17883247 18006797 18230160 18640653 18867384 19043350 19031731
$$ packed form
12235G273787l0868r3020O679J58873K13969m264J85935J22630J28543K46492
12225H208756J35893L05639O8706j61150l1210K6540m3050O5857K02023J63636
12215H941640J02996J08201J11476Q4845j7677J61252J88657J47118P6539l101
12205I901946M8003J47051M42789R1935J68288J08697K24193P5412l0510J35506
12195A1313310L42205L24158N0435K30490K82443P8070Q1901J71439J68538J30750
12185A3173739q3925m2759J18690L98795J54160K65732M12280M09645R4367m524
12175A4896200K82362M58583J89517J63794P0066K75416P9214P5916K76968J98047
12165A6966083L08573L82136K26455J23550K23363M10493K26731J75966j1619
$$ plain form
12156 19031731 19111382 19255243 19527248 19925672 20393160 20682861 20838572 21166462 21506788
12147 21506788 21783258 22051007 22094436 22337460 22574811 22806864 23100140 23443673 23764076
12138 23764076 23968040 24300341 24627407 24913530 25213061 25438319 25788726 26132025 26327731
12129 26327731 26641275 26783066 26848403 27050329 27368935 27539723 27792295 28055498 28344468
12120 28344468 28538374 28627357 28870045 29331061 29604504 29734978 29907276 30129494 30265282
12111 30265282 30489969 30777830 30717392 30773788 31048703 31106680 31301326 31454652 31454430 31584347
12101 31584347 31797449 31829806 31818245 31811789 31635583 31667898 31785605 31854694 31878328 31870411 31808104
12090 31808104 31682365 31731700 31609273 31294924 31254782 31247887 31082611 30936182 30775044 30714461
$$ packed form
12156A9031731P9651J43861K72005L98424M67488K89701J55711L27890L40326
12147B1506788K76470K67749M3429K43024K37351K32053K93276L43533L20403
12138B3764076K03964L32301L27066K86123K99531K25258L50407L43299J95706
12129B6327731L13544J41791O5337K01926L18606J70788K52572K63203K88970
12120B8344468J93906Q8983K42688M61016K73443J30474J72298K22218J35788
12111C0265282K24687K87861o0438N6396K74915N7977J94646J53326k22J29917
12101C1584347K13102L2357j1561o456j76206L2315J17707O9089K3634p917o2307
12090C1808104j25739M9335j22427l14349m0142o895j65276j46429j61138o0583
$$ plain form
12080 30714461 30779624 30775680 30663639 30483930 30128499 29693966 29388794 29380870 29377742 29042418
12070 29042418 28747725 28327921 28217998 28044937 27817845 27589627 27325701 27195168 26708745
12061 26708745 26471919 26310098 25975772 25728762 25567256 25460569 25331245 24818447 24335976
12052 24335976 24247222 23842180 23511983 23416578 23303890 23106038 22791760 22379084 21893706 21404441
12042 21404441 21054150 20717279 20694112 20782408 20472915 20127852 19822430 19661528 19493547 19165695
12032 19165695 18743023 18547070 18389583 18386157 18037504 17882192 17754872 17378664 17267031 17176404
12022 17176404 16979236 16674039 16343056 16086744 15979392 15679557 15443400 15289294 15117607
12013 15117607 14747166 14633090 14370455 14290372 14041988 13860513 13768539 13656320 13436081 13283172
$$ packed form
12080C0714461O5163l944j12041j79709l55431m34533l05172p924l128l35324
12070B9042418k94693m19804j09923j73061k27092k28218k63926j30533m86423
12061B6708745k36826j61821l34326k47010j61506j06687j29324n12798m82471
12052B4335976q8754m05042l30197r5405j12688j97852l14278m12676m85378m89265
12042B1404441l50291l36871k3167Q8296l09493l45063l05422j60902j67981l27852
12032A9165695m22672j95953j57487l426l48653j55312j27320l76208j11633r0627
12022A7176404j97168l05197l30983k56312j07352k99835k36157j54106j71687
12013A5117607l70441j14076k62635q0083k48384j81475r1974j12219k20239j52909
$$ plain form
12003 13283172 13080371 12885143 12779408 12853998 12709262 12292415 11873671 11967003 11920460 11769175
11993 11769175 11472604 11342461 11195356 10927744 10587156 10442755 10325562 10282338 10282900 10324388
11983 10324388 10283724 9841323 9660196 9784561 9818846 9758521 9737281 9586893 9595228 9576814
11973 9576814 9400268 9084317 8791579 8877380 8987218 8875197 8427864 8070691 7905065 7881444
11963 7881444 7933378 7949073 7941874 7963201 7807667 7521326 7391139 7391958 7268543 7041541 7027237
11952 7027237 7280724 7412437 7240408 7087128 7002153 6924116 6723537 6408881 6386043 6247206
11942 6247206 6068835 6158657 6094769 5869779 5774104 5774776 5721766 5656159 5665750 5655078 5693296
11931 5693296 5676091 5544148 5531948 5564613 5477369 5320841 5250038 5481399 5450777 5314280
$$ packed form
12003A3283172k02801j95228j05735P4590j44736m16847m18744R3332m6543j51285
11993A1769175k96571j30143j47105k67612l40588j44401j17193m3224N62M1488
11983A0324388m0664m42401j81127J24365L4285o0325k1240j50388Q335j8414
11973I576814j76546l15951k92738Q5801J09838j12021m47333l57173j65626k3621
11963G881444N1934J5695p199K1327j55534k86341j30187Q19j23415k27002j4304
11952G027237K53487J31713j72029j53280q4975p8037k00579l14656k2838j38837
11942F247206j78371Q9822o3888k24990r5675O72n3010o5607R591j0672L8218
11931E693296j7205j31943j2200L2665q7244j56528p0803K31361l0622j36497
$$ plain form
11921 5314280 5269756 5326435 4931887 4823699 4909013 5045556 4808233 4678734 4749506 4720912
11911 4720912 4663152 4572767 4624130 4511956 4233871 4125775 4156285 4182586 4284933 4396295
11901 4396295 4495785 4451071 4514403 4292190 4131179 4096730 4007475 4004464 4055681 3779462 3665155
11890 3665155 3556697 3452804 3667795 3701174 3633770 3846439 3873463 3690939 3580230 3290969
11880 3290969 3219470 3433255 3552237 3476815 3350745 3475114 3509256 3539596 3491668 3495743 3437839
11869 3437839 3421445 3401549 3134023 3147508 3223237 3080069 2961008 3186177 3216349 3032631
11859 3032631 2762733 2712435 2611767 2554876 2604116 2622447 2793467 2845940 2669904 2716486
11849 2716486 2859939 2871077 2614954 2475697 2432804 2438208 2523265 2349152 2441570 2485690 2460250
$$ packed form
11921E314280m4524N6679l94548j08188Q5314J36543k37323j29499P0772k8594
11911D720912n7760r0385N1363j12174k78085j08096L0510K6301J02347J11362
11901D396295R9490m4714O3332k22213j61011l4449q9255l011N1217k76219j14307
11890C665155j08458j03893K14991L3379o7404K12669K7024j82524j10709k89261
11880C290969p1499K13785J18982p5422j26070J24369L4142L0340m7928M075n7904
11869C437839j6394j9896k67526J3485P5729j43168j19061K25169L0172j83718
11859C032631k69898n0298j00668n6891M9240J8331J71020N2473j76036M6582
11849B716486J43453J1138k56123j39257m2893N404Q5057j74113R2418M4120k5440
$$ plain form
11838 2460250 2402218 2488378 2288745 2171151 2339261 2357844 2306964 2389917 2238236 1927549
11828 1927549 1917007 2071322 2299358 2303971 2346140 2275354 2185749 2179416 2120955 2159620 2125993
11817 2125993 2145934 2190072 2269168 2270869 2138674 2150666 2160103 1896288 1766510 1658918 1667611
11806 1667611 1582242 1689716 1783304 1818057 1939451 2048021 2082297 1987792 2022064 2123714
11796 2123714 2124899 2120514 2048613 1962413 1848935 1845579 1983634 2105231 2078329 2036516 2079195
11785 2079195 2001457 2074527 2047157 2143798 2083107 1944814 1845808 1938218 1947750 1915648 1816686
11774 1816686 1773136 1748795 1690484 1822094 2006651 1886671 1656178 1736955 1822029 1693476
11764 1693476 1723083 1734332 1505559 1465661 1305413 1523657 1922900 1814708 1428676 1327418
$$ packed form
11838B460250n8032Q6160j99633j17594J68110J8583n0880Q2953j51681l10687
11828A927549j0542J54315K28036M613M2169p0786q9605o333n8461L8665l3627
11817B125993J9941M4138P9096J701j32195J1992R437k63815j29778j07592Q693
11806A667611q5369J07474R3588L4753J21394J08570L4276r4505L4272J01650
11796B123714J185m385p1901q6200j13478l356J38055J21597k6902m1813M2679
11785B079195p7738P3070k7370R6641o0691j38293r9006R2410R532l2102r8962
11774A816686m3550k4341n8311J31610J84557j19980k30493Q0777Q5074j28553
11764A693476K9607J1249k28773l9898j60248K18244L99243j08192l86032j01258
$$ plain form
11754 1327418 1380512 1417732 1395037 1411238 1442125 1538256 1606313 1478526 1363600 1437961 1346191
11743 1346191 1252063 1206294 1139703 1032925 1079606 1062940 1081966 1324294 1657026 1507621
11733 1507621 1194891 1036001 1136424 1340913 1241572 1345379 1296201 1180457 1130105 1139695
11723 1139695 1123758 1277333 1268172 1313937 1276341 1398796 1197861 1104651 1077258 1106907 1046516
11712 1046516 1044939 1138682 1055795 1041632 1120068 1077188 1047065 1108918 1124603 926751 814248
11701 814248 766595 700283 760468 764202 967433 1211609 1330293 1318508 1205039 1116869 963219
11690 963219 988626 853730 681956 561217 643366 824434 887754 833278 867120 1062131
11680 1062131 1058077 835337 632668 553012 657864 762974 792768 643678 833544 1051196
$$ packed form
11754A327418N3094L7220k2695J6201L0887R6131O8057j27787j14926P4361r1770
11743A346191r4128m5769o6591j06778M6681j6666J9026K42328L32732j49405
11733A507621l12730j58890J00423K04489r9341J03807m9178j15744n0352R590
11723A139695j5937J53575r161M5765l7596J22455k00935r3210k7393K9649o0391
11712A046516j577R3743q2887j4163P8436m2880l0123O1853J5685j97852j12503
11701H14248m7653o6312O0185L734K03231K44176J18684j1785j13469q8170j53650
11690I63219K5407j34896j71774j20739Q2149J81068O3320n4476L3842J95011
11680A062131m054k22740k02669p9656J04852J05110K9794j49090J89866K17652
$$ plain form
11670 1051196 1015376 874303 879310 873741 961337 1005867 974134 746179 647576 963893 1188304
11659 1188304 1000519 922336 945050 1041978 986510 870535 638730 561529 469714 607552
11649 607552 907956 998386 920362 803945 779128 758195 654795 681552 712779 642271 780283
11638 780283 883439 745526 733273 902934 957518 745147 554077 596854 686399 790643
11628 790643 666120 563374 548540 728302 762801 755613 589662 654374 742738 758110 700236
11617 700236 657926 777620 895723 814886 754861 767802 727013 757497 743358 701375 699174
11606 699174 568161 391326 272036 289596 356410 434952 690342 665650 516252 450860
11596 450860 455856 356731 138320 177216 220826 220727 287382 474231 399878 421096 374050 470917
$$ packed form
11670A051196l5820j41073N007n569Q7596M4530l1733k27955r8603L16317K24411
11659A188304j87785p8183K2714R6928n5468j15975k31805p7201r1815J37838
11649F07552L00404R0430p8024j16417k4817k0933j03400K6757L1227p0508J38012
11638G80283J03156j37913j2253J69661N4584k12371j91070M2777Q9545J04244
11628G90643j24523j02746j4834J79762L4499p188j65951O4712Q8364J5372n7874
11617G00236m2310J19694J18103q0837o0025J2941m0789L0484j4139m1983k201
11606F99174j31013j76835j19290J7560O6814P8542K55390k4692j49398o5392
11596D50860M996r9125k18411L8896M3610r9O6655J86849p4353K1218m7046R6867
$$ plain form
11584 470917 585343 448158 416755 491904 554993 424369 640526 696951 705697 379909 284287
11573 284287 479907 610145 672939 470372 306256 207166 227349 401367 480307 367540
11563 367540 323840 371825 534299 722352 828909 741660 636920 548734 348950 421853
11553 421853 488127 282695 342643 401195 484576 401643 307807 393725 356532 268374 135946
11542 135946 338562 562570 729239 750829 590590 698435 754142 685058 354890 108009
11532 108009 154217 234066 253914 300293 430368 445733 481675 592982 547963 501891 615054
11521 615054 654857 597684 533519 627508 539323 555208 675276 636172 708094 790446 800684
11510 800684 794539 671058 743522 774727 609510 561481 276926 73811 67358 170866 97347
$$ packed form
11584D70917J14426j37185l1403P5149O3089j30624K16157N6425Q746l25788r5622
11573B84287J95620J30238O2794k02567j64116r9090K0183J74018P8940j12767
11563C67540m3700M7985J62474J88053J06557q7249j04740q8186j99784P2903
11553D21853O6274k05432N9948N8552Q3381q2933r3836Q5918l7193q8158j32428
11542A35946K02616K24008J66669K1590j60239J07845N5707o9084l30168k46881
11532A08009M6208P9849J9848M6379J30075J5365L5942J11307m5019m6072J13163
11521F15054L9803n7173o4165R3989q8185J5885J20068l9104P1922Q2352J0238
11510H00684o145j23481P2464L1205j65217m8029k84555k03115o453J03508p3519
$$ plain form
11499 97347 99822 230652 331421 265051 127649 207746 340558 332555 299826 309848 283510
11488 283510 341948 131408 161472 263448 520175 456219 542676 314394 152871 295993
11478 295993 111697 48198 150438 231988 513469 552634 384084 177886 230449 306198
11468 306198 284451 255029 313652 272005 344732 205591 218159 205463 159208 292587 294905
11457 294905 327947 519335 760200 799788 745293 658562 367160 210023 201777 269759 310171
11446 310171 235175 78114 38232 88779 175273 238863 30838 32782 -145573 -143657 -67216
11435 -67216 -15286 98413 298432 488742 526066 507506 475742 427609 493871 513250 408379
11424 408379 470533 412694 255677 185121 260721 395431 599085 706894 652361 549273
$$ packed form
11499I7347K475J30830J00769o6370j37402Q0097J32812q003l2729J0022k6338
11488B83510N8438k10540L0064J01976K56727o3956Q6457k28282j61523J43122
11478B95993j84296o3499J02240Q1550K81481L9165j68550k06198N2563P5749
11468C06198k1747k9422N8623m1647P2727j39141J2568j2696m6255J33379K318
11457B94905L3042J91388K40865L9588n4495q6731k91402j57137q246O7982M0412
11446C10171p4996j57061l9882N0547Q6494O3590k08025J944j78355J916P6441
11435f7216N1930J13699K00019J90310L7324j8560l1764m8133O6262J9379j04871
11424D08379O2154n7839j57017p0556P5600J34710K03654J07809n4533j03088
$$ plain form
11414 549273 302799 120309 42820 -18819 90309 119966 81964 -21186 -117700 118780
11404 118780 273655 76171 -154520 -46261 97997 265141 339596 509703 479773 365773
11394 365773 304951 422544 432673 362343 296531 403948 345281 296399 375795 279986 247894
11383 247894 259570 254730 139217 190174 140718 82679 145211 255539 119767 162253 121349
11372 121349 170250 157321 -36905 38561 196379 265690 461328 451395 543190 533212 344500
11361 344500 355515 414838 469201 535914 375787 398760 367702 233400 169155 97031 2453
11350 2453 -65826 79011 121823 23197 56949 163658 15559 -27103 -46481 -74006 78325
11339 78325 327596 348442 288903 113267 -58567 65210 2072 -19548 75188 123407 118447
$$ packed form
11414E49273k46474j82490p7489o1639J09128K9657l8002j03150r6514K36480
11404A18780J54875j97484k30691J08259J44258J67144P4455J70107k9930j14000
11394C65773o0822J17593J0129p0330o5812J07417n8667m8882P9396r5809l2092
11383B47894J1676m840j15513N0957m9456n8039O2532J10328j35772M2486m0904
11372A21349M8901j2929j94226P5466J57818O9311J95638r933R1795r978j88712
11361C44500J1015N9323N4363O6713j60127K2973l1058j34302o4245p2124r4578
11350B453o8279J44837M2812r8626L3752J06709j48099m2662j9378k7525J52331
11339G8325K49271K0846n9539j75636j71834J23777o3138k1620R4736M8219m960
$$ plain form
11328 118447 111074 -391 -201436 -389697 -122322 -24048 -71224 -10797 170300 136691 82065
11317 82065 52106 81353 -10815 91717 136701 330367 451584 426890 169349 -17373 138560
11306 138560 296973 239059 283449 344734 232288 216084 225181 35218 -90048 15600 142099
11295 142099 89772 201456 241060 136400 148860 278456 214834 223846 127122 233014 291913
11284 291913 230427 197179 228051 224666 206483 142778 -141647 -158371 -185537 -91119 87399
11273 87399 99163 24970 -11582 -66647 -60869 4793 338368 408854 363209 315838 237141 -2484
11261 -2484 -119844 104898 219719 65391 47907 165885 249720 260884 235327 190552 38789
11250 38789 -75416 49462 171043 147009 263508 282250 364112 344241 257651 192717 219817
$$ packed form
11328A18447p373j11465k01045j88261K67375R8274m7176O0427J81097l3609n4626
11317H2065k9959K9247r2168J02532M4984J93666J21217k4694k57541j86722J55933
11306A38560J58413n7914M4390O1285j12446j6204R097j89963j25266J05648J26499
11295A42099n2327J11684L9604j04660J2460J29596o3622R012r6724J05892N8899
11284B91913o1486l3248L0872l385j8183o3705k84425j6724k7166R4418J78518
11273H7399J1764p4193l6552n5065N778O5662L33575P0486m5645m7371p8697k39625
11261b484j17360K24742J14821j54328j7484J17978Q3835J1164k5557m4775j51763
11250C8789j14205J24878J21581k4034J16499J8742Q1862j9871q6590o4934K7100
$$ plain form
11239 219817 199820 262076 139992 3936 25865 226268 176224 144095 147171 27774 -119778
11228 -119778 -171129 -118877 -144163 -62762 60027 113129 110338 91640 45067 77370 140341
11217 140341 175980 -5925 -47197 140057 258954 282767 169028 107314 50514 7734 265693
11206 265693 458625 404437 112009 144043 368919 619894 808633 898099 920079 714849
11196 714849 275476 200536 456950 274818 21121 -122279 -99824 -53147 214743 237980
11186 237980 111359 -124152 -19460 197147 276616 60777 -37098 -203576 -290782 86581
11176 86581 92041 -55111 -132895 -285628 -488473 -541664 -209796 -67058 61662 86824 194428
11165 194428 189117 195323 202817 277165 -8230 -108122 -222653 -294574 -321642 -210265 -66300
$$ packed form
11239B19817j9997O2256j22084j36056K1929K00403n0044l2129L076j19397j47552
11228a19778n1351N2252k5286Q1401J22789N3102k791j8698m6573L2303O2971
11217A40341L5639j81905m1272J87254J18897K3813j13739o1714n6800m2780K57959
11206B65693J92932n4188k92428L2034K24876K50975J88739Q9466K1980k05230
11196G14849m39373p4940K56414j82132k53697j43400K2455M6677K67890K3237
11186B37980j26621k35511J04692K16607P9469k15839r7875j66478q7206L77363
11176H6581N460j47152p7784j52733k02845n3191L31868J42738J28720K5162J07604
11165A94428n311O206P494P4348k85395r9892j14531p1921k7068J11377J43965
$$ plain form
11154 -66300 -113347 -219323 -85861 169073 279568 32230 -25718 35131 -88817 -122779
11144 -122779 -82884 79667 262510 84352 -34557 161373 313148 230562 108717 -79624
11134 -79624 -8701 150074 139778 116457 75898 120260 199445 147107 -36687 69650 218952
11123 218952 148447 247230 593944 610522 504171 339687 36045 -136340 -295875 -191246
11113 -191246 -164597 -52403 -130945 -75838 -93748 -196481 -152988 122398 173092 129488 -11681
11102 -11681 173536 177928 166008 178945 187713 -1618 -254187 -421315 -232863 57158 126083
11091 126083 70327 48043 59881 185205 271611 251022 182060 293388 280893 151566 -47072
11080 -47072 -120652 -217690 -332859 -255751 -24279 133237 247110 188436 66653 294204
$$ packed form
11154f6300m7047j05976J33462K54934J10495k47338n7948O0849j23948l3962
11144a22779L9895J62551J82843j78158j18909J95930J51775q2586j21845j88341
11134g9624P0923J58775j0296k3321m0559M4362P9185n2338j83794J06337J49302
11123B18952p0505R8783L46714J6578j06351j64484l03642j72385j59535J04629
11113a91246K6649J12194p8542N5107j7910j02733M3493K75386N0694m3604j41169
11102a1681J85217M392j1920J2937Q768j89331k52569j67128J88452K90021O8925
11091A26083n5756k2284J1838J25324Q6406k0589o8962J11328j2495j29327j98638
11080d7072p3580r7038j15169P7108K31472J57516J13873n8674j21783K27551
$$ plain form
11070 294204 164044 -117728 -143727 -169943 -241789 -172308 -158809 -253527 -210366 -97411 91522
11059 91522 186985 183893 71111 -19447 29841 64098 144240 201655 288700 248367 95727
11048 95727 -101100 -129679 -51053 180177 172901 212937 267963 183964 264377 438023 452283
11037 452283 415154 448508 672585 957917 1022511 1036099 787998 839380 847606 1088934 1290426
11026 1290426 1335112 1261516 1485793 1426196 1159643 1012269 814564 545621 688363 861392
11016 861392 907553 1190144 1436094 1613094 1763993 1722031 1808603 1782843 1453822 1102214
11006 1102214 1133496 1158184 1085414 1248265 1586184 1744999 1572214 1416694 1243679 1001186
10996 1001186 746399 497189 523262 495756 214073 85879 191493 531784 825566 751386
$$ packed form
11070B94204j30160k81772k5999k6216p1846O9481J3499r4718M3161J12955J88933
11059I1522R5463l092j12782r0558M9288L4257Q0142N7415Q7045m0333j52640
11048I5727j96827k8579P8626K31230p276M0036N5026q3999Q0413J73646J4260
11037D52283l7129L3354K24077K85332O4594J3588k48101N1382Q226K41328K01492
11026A290426M4686p3596K24277n9597k66553j47374j97705k68943J42742J73029
11016H61392M6161K82591K45950J77000J50899m1962Q6572k5760l29021l51608
11006A102214L1282K4688p2770J62851L37919J58815j72785j55520j73015k42493
10996A001186k54787k49210K6073k7506k81683j28194J05614L40291K93782p4180
$$ plain form
10986 751386 543716 484990 447702 291229 138154 -139084 -158418 -172291 -182114 -216023 -271815
10975 -271815 -429841 -490557 -137028 74681 -34446 -44074 157218 136393 132752 -135610 -321300
10964 -321300 -400342 -326315 -10786 261816 96664 116459 91128 147816 114384 188649 139993
10953 139993 207843 321797 246281 13363 -56084 -104155 -304151 -376130 -356528 -170036 -22334
10942 -22334 -69402 -71747 -136707 -84258 140787 68595 -6622 -210278 -152430 21381 -8623
10931 -8623 -113589 -155913 -116677 -40081 -197410 -178700 -168673 -113846 -282450 -209355 5811
10920 5811 101860 114616 198618 210488 181893 53370 22061 -33552 -221606 -211576 44888
10909 44888 122615 1225 -42168 1506 181878 457599 438330 182181 81511 133210 87648
$$ packed form
10986G51386k07670n8726l7288j56473j53075k77238j9334j3873r823l3909n5792
10975b71815j58026o0716L53529K11709j09127r628K01292k0825l641k68362j85690
10964c21300p9042P4027L15529K72602j65152J9795k5331N6688l3432P4265m8656
10953A39993O7850J13954p5516k32918o9447m8071j99996p1979J9602J86492J47702
10942b2334m7068k345o4960N2449K25045p2192p5217k03656N7848J73811l0004
10931h623j04966m2324L9236P6596j57329J8710J0027N4827j68604P3095K15166
10920E811R6049J2756Q4002J1870k8595j28523l1309n5613j88054J0030K56464
10909D4888P7727j21390m3393M3674J80372K75721j9269k56149j00670N1699m5562
$$ plain form
10898 87648 101588 35779 19032 -16055 116051 282108 45183 17772 109031 38224 -59634
10887 -59634 52173 -93121 -233357 -311261 -110669 925 -3515 -69485 133793 213141 182088
10876 182088 222613 140376 68199 91452 113557 -28572 -252288 -424286 -134530 68455
10866 68455 103561 -83929 69586 183941 207810 181310 333939 334586 440692 555387 339891
10855 339891 424009 549446 247773 -66973 -162459 -29693 283239 174442 -2338 280511
10845 280511 400102 401958 470877 404027 357525 237301 183159 -16282 -39029 76730 17963
10834 17963 95174 123946 212752 99407 -24950 3323 203994 395446 524096 401334
10824 401334 327001 306777 199940 329433 305916 126345 -186846 -336078 -308929 -372272
$$ packed form
10898H7648J3940o5809j6747l5087J32106J66057k36925k7411R1259p0807r7858
10887e9634J11807j45294j40236p7904K00592J11594m440o5970K03278P9348l1053
10876A82088M0525q2237p2177K3253K2105j42129k23716j71998K89756K02985
10866F8455L5106j87490J53515J14355K3869k6500J52629O47J06106J14695k15496
10855C39891Q4118J25437l01673l14746r5486J32766L12932j08797j76780K82849
10845B80511J19591J856O8919o6850m6502j20224n4142j99441k2747J15759n8767
10834A7963P7211K8772Q8806j13345j24357K8273K00671J91452J28650j22762
10824D01334p4333k0224j06837J29493k3517j79571l13191j49232K7149o3343
$$ plain form
10814 -372272 -333848 -356985 -391653 -229568 -180682 -169558 10658 -28023 -214418 -128922 27408
10803 27408 39175 -64089 -69286 -209207 -173470 -167644 -196861 73992 86477 124660 30176
10792 30176 -68647 -124767 93840 204547 77593 40776 -104602 -299147 36668 -10211
10782 -10211 51295 114720 52689 -14959 -108496 -243352 -258539 -33352 179184 228713 179670
10771 179670 48932 -18560 -137843 -218432 -57120 21987 172085 202157 133580 20148
10761 20148 84173 57227 24267 559 -160688 -274085 -275323 -439190 -409627 -244260 -363006
10750 -363006 -631221 -482448 -215760 -73620 5545 -84310 -228629 -237001 -179912 -15485
10740 -15485 -117259 -73689 -60483 -183876 -225208 -246111 -77441 -133547 -219725 -74006 -102651
$$ packed form
10814c72272L8424k3137l4668J62085M8886J1124J80216l8681j86395Q5496J56330
10803B7408J1767j03264n197j39921L5737N826k9217K70853J2485L8183r4484
10792C0176r8823n6120K18607J10707j26954l6817j45378j94545L35815m6879
10782a0211O1506O3425o2031o7648r3537j34856j5187K25187K12536M9529m9043
10771A79670j30738o7492j19283q0589J61312P9107J50098L0072o8577j13432
10761B0148O4025k6946l2960k3708j61247j13397j238j63867K9563J65367j18746
10750c63006k68215J48773K66688J42140P9165q9855j44319q372N7089J64427
10740a5485j01774M3570J3206j23393m1332k0903J68670n6106q6178J45719k8645
$$ plain form
10729 -102651 -90028 128194 220633 243139 404115 460409 490407 329287 210368 190046 99027
10718 99027 -40606 34012 29818 132993 226036 193779 206931 139869 130978 330189 189303
10707 189303 119978 122737 -127926 -484217 -396294 -371465 -471520 -411944 -545502 -481737 -506899
10696 -506899 -460977 -281612 -289554 -272072 -187848 -299957 -388748 -567993 -495867 -376990 -359353
10685 -359353 -305751 -325725 -359692 -285057 -231549 -274492 -267774 -362823 -231564 -323647 -286815
10674 -286815 -247137 -107539 -145346 -146974 -276412 -461474 -612415 -511451 -541692 -413160
10664 -413160 -202548 -197489 -304268 -269030 -195895 -266891 -238444 -24602 -93668 -339784 -171105
10653 -171105 88671 135605 66808 102667 164488 79007 258168 493189 527175 521109 583630
$$ packed form
10729a02651J2623K18222R2439K2506J60976N6294K9998j61120j18919k0322r1019
10718I9027j39633P4618m194J03175R3043l2257J3152o7062q891J99211j40886
10707A89303o9325K759k50663l56291Q7923K4829j00055N9576j33558O3765k5162
10696e06899M5922J79365p942J7482Q4224j12109q8791j79245P2126J18877J7637
10685c59353N3602j9974l3967P4635N3508m2943O718r5049J31259r2083L6832
10674b86815L9678J39598l7807j628j29438j85062j50941J00964l0241J28532
10664d13160K10612N059j06779L5238P3135p0996K8447K13842o9066k46116J68679
10653a71105K59776M6934o8797L5859O1821q5481J79161K35021L3986o066O2521
$$ plain form
10642 583630 621111 764266 912889 830159 964081 1255576 1060594 1090494 1100767 980500
10632 980500 1171989 1279504 1477262 1556152 1680011 2178212 2601400 3144468 3741076 4412743
10622 4412743 5165028 5578512 6151368 6824216 7677620 8584234 10149556 12168537 14836289
10613 14836289 18894830 24548019 32226422 42812219 57316778 75336269 93543952
10606 93543952 107008139 113295534 113253080 109284025 104777162 102216916 103954705 112054210
10598 112054210 128830208 156423509 193494137 230389624 253237308 256875026 246163549
10591 246163549 227634208 208147225 193801716 188493573 195239921 216006970 252102710
10584 252102710 299977658 344337447 364677052 355925396 327843121 290542038 252418931
$$ packed form
10642E83630L7481J43155J48623q2730J33922K91495j94982K9900J0273j20267
10632I80500J91489J07515J97758P8890J23859M98201M23188N43068N96608O71667
10622D412743P52285M13484N72856O72848Q53404R06614J565322K018981K667752
10613A4836289M058541N653189P678403J0585797J4504559J8019491J8207683
10606I3543952J3464187O287395m2454l969055m506863k560246J737789Q099505
10598A12054210J6775998K7593301L7070628L6895487K2847684L637718j0711477
10591B46163549j8529341j9486983j4345509n308143O746348K0767049L6095740
10584B52102710M7874948M4359789K0339605q751656k8082275l7301083l8123107
$$ plain form
10577 252418931 221310322 201447944 194069701 199249104 216620656 241559033 262345236
10570 262345236 266051663 250936771 224257736 192609605 162236682 137917048 121462494
10563 121462494 112830856 110867007 114180512 120086242 123755469 120541101 110358564 95360525
10555 95360525 78945390 63188756 49700009 39277253 31440215 25454916 21192324
10548 21192324 18051497 15683052 13837049 12431224 11046463 10038890 9160622 8303918
10540 8303918 7651881 7136929 6780577 6444297 6033786 5679171 5447348 5067797 4693257
10531 4693257 4645162 4557139 4145532 3966994 3878962 3636848 3504550 3420669 3282950 3305898
10521 3305898 3137695 3214249 3255146 3230856 3184374 2973058 2785976 2565903 2495516 2466123
$$ packed form
10577B52418931l1108609j9862378p378243N179403J7371552K4938377K0786203
10570B62345236L706427j5114892k6679035l1648131l0372923k4319634j6454554
10563A21462494q631638j963849L313505N905730L669227l214368j0182537j4998039
10555I5360525j6415135j5756634j3488747j0422756p837038n985299m262592
10548B1192324l140827k368445j846003j405825j384761j007573q78268q56704
10540H303918o52037n14952l56352l36280m10511l54615k31823l79551l74540
10531D693257m8095q8023m11607j78538q8032k42114j32298q3881j37719K2948
10521C305898j68203P6554M0897k4290m6482k11316j87082k20073p0387k9393
$$ plain form
10511 2466123 2494795 2567550 2401479 2245271 2121993 2102992 2048695 2097447 2102237 1928762 1874502
10500 1874502 1917285 1935635 1889919 1847288 1726165 1745785 1678632 1610576 1769140 1627691 1431535
10489 1431535 1248189 1288540 1464888 1505371 1461127 1586165 1585703 1552452 1472495 1359949 1317701
10478 1317701 1240206 1206997 1213402 1331956 1207674 1042026 1035434 1185443 1059265 1132842 1001097
10467 1001097 814562 831909 908222 862821 1005176 1171637 1233198 1389282 1449268 1416246
10457 1416246 1372287 1442000 1431980 1148570 795329 605792 677257 814835 856495 880364
10447 880364 884105 909074 901802 802698 671366 524689 522408 589618 668447 591741 534415 735898
10435 735898 519406 233443 339701 346257 544186 538056 285427 323414 432067 534138
$$ packed form
10511B466123K8672P2755j66071j56208j23278j9001n4297M8752M790j73475n4260
10500A874502M2783J8350m5716m2631j21123J9620o7153o8056J58564j41449j96156
10489A431535j83346M0351J76348M0483m4244J25038m62l3251p9957j12546m2248
10478A317701p7495l3209O405J18554j24282j65648o592J50009j26178P3577j31745
10467A001097j86535J7347P6313m5401J42355J66461O1561J56084N9986l3022
10457A416246m3959O9713j0020k83410l53241j89537P1465J37578M1660K3869
10447H80364L741K4969p272r9104j31332j46677k281O7210P8829p6706n7326K01483
10435G35898k16492k85963J06258O556J97929o130k52629L7987J08653J02071
$$ plain form
10425 534138 471445 520221 548098 649829 848698 774825 639496 585660 814444 1001429
10415 1001429 814323 760307 712416 567072 459957 464593 604450 687898 994295 733568
10405 733568 566816 631332 658998 658540 327639 99212 168118 364064 476946 430905 281518
10394 281518 322607 453728 313445 343512 243014 207329 213393 437785 548419 512748 590622
10383 590622 555776 366198 268864 74542 119677 179540 236631 358559 340076 490373 561210
10372 561210 469798 305785 123868 259285 267783 338215 519841 463434 170229 198537 73714
10361 73714 190650 356694 355772 327098 286561 298596 381980 445460 506620 435537 364307 284482
10349 284482 416128 503904 428397 306792 292404 554012 657045 543913 328494 446895
$$ packed form
10425E34138o2693M8776K7877J01731J98869p3873j35329n3836K28784J86985
10415A001429j87106n4016m7891j45344j07115M636J39857Q3448L06397k60727
10405G33568j66752O4516K7666m58l30901k28427O8906J95946J12882m6041j49387
10394B81518M1089J31121j40283L0067j00498l5685O064K24392J10634l5671P7874
10383E90622l4846j89578r7334j94322M5135N9863N7091J21928j8483J50297P0837
10372E61210r1412j64013j81917J35417Q498P0432J81626n6407k93205K8308j24823
10361G3714J16936J66044r22k8674m0537J2035Q3384O3480O1160p1083p1230p9825
10349B84482J31646Q7776p5507j21605j4388K61608J03033j13132k15419J18401
$$ plain form
10339 446895 591826 626394 688850 648607 709470 684657 734769 690906 387192 336125 449155
10328 449155 510226 540088 445806 183989 199846 377515 385617 334863 335261 163977 120730
10317 120730 133842 457657 508135 296983 380053 420395 398910 592997 966012 1016308 823201
10306 823201 426876 83688 40136 69001 197863 333330 341964 373046 333691 267038 256068
10295 256068 300761 355960 234489 194811 253864 265417 335755 481551 448864 431401 373462
10284 373462 414969 591745 697869 603473 289393 207072 194661 97721 377332 454277 244519
10273 244519 183092 216905 161377 80435 74679 58489 270131 457694 645711 705355 747465
10262 747465 518733 265338 100283 229974 116983 188616 257002 123918 45476 66465
$$ packed form
10339D46895J44931L4568O2456m0243O0863k4813N0112m3863l03714n1067J13030
10328D49155O1071K9862r4282k61817J5857J77669Q102n0754L98j71284m3247
10317A20730J3112L23815N0478k11152Q3070M0342k1485J94087L73015N0296j93107
10306H23201l96325l43188m3552K8865J28862J35467Q634L1082l9355o6653j0970
10295B56068M4693N5199j21471l9678N9053J1553P0338J45796l2687j7463n7939
10284C73462M1507J76776J06124r4396l14080q2321j2411r6940K79611P6945k09758
10273B44519o1427L3813n5528q0942n756j6190K11642J87563J88017N9644M2110
10262G47465k28732k53395j65055J29691j12991P1633O8386j33084p8442K0989
$$ plain form
10252 66465 -37346 -60942 -67312 -27483 42522 126154 201659 158720 260447 373275 92169
10241 92169 -141641 -14568 96312 162709 193749 41317 -16194 -130027 -56680 -106556 18881
10230 18881 191315 221370 183096 244739 264174 281096 306658 337505 190942 246633 287636
10219 287636 230723 69224 -26910 167590 265164 403101 458609 413387 458077 598084 579614
10208 579614 750757 836532 578700 532523 556177 751586 711120 591254 441821 419511
10198 419511 363556 298892 325956 323991 253092 395883 455611 417456 385190 321544 314820 289170
10186 289170 200341 208484 218825 200570 343544 240988 58768 110037 22595 239196 271899
10175 271899 287043 334741 444983 552227 510143 525638 570101 737515 1039712 1051342 1025288
$$ packed form
10252F6465j03811k3596o370L9829P0005Q3632P5505m2939J01727J12828k81106
10241I2169k33810J27073J10880O6397L1040j52432n7511j13833P3347m9876J25437
10230A8881J72434L0055l8274O1643J9435J6922K5562L0847j46563N5691M1003
10219B87636n6913j61499r6134J94500R7574J37937N5508m5222M4690J40007j8470
10208E79614J71143Q5775k57832m6177K3654J95409m0466j19866j49433k2310
10198D19511n5955o4664K7064j965p0899J42791N9728l8155l2266o3646o724k5650
10186B89170q8829Q143J0341j8255J42974j02556j82220N1269q7442K16601L2703
10175B71899J5144M7698J10242J07244m2084J5495M4463J67414L02197J1630k6054
$$ plain form
10164 1025288 1036316 1033092 1016307 1204194 1409361 1666070 1863731 2085909 2093237 1955400
10154 1955400 1768196 1664078 1754127 1847961 2085760 2454857 2927169 3511185 4114937 4396349
10144 4396349 4474226 4479273 4298159 4108928 3972813 3849685 3693355 3249336 3060231 2769612
10134 2769612 2397616 2287572 2116861 1806326 1577670 1266029 1313560 1173096 964106 777399
10124 777399 623409 841463 1088275 1246145 1026818 687818 586314 644651 678687 538317
10114 538317 486677 410855 353707 482364 560593 502771 241829 352559 379767 205424 192965
10103 192965 105675 166989 61532 49582 198069 329425 436577 413656 243145 237500 161775
10092 161775 127271 111950 91779 93004 191739 353434 327946 354712 320167 316718 496898
$$ packed form
10164A025288J1028l224j6785J87887K05167K56709J97661K22178P328j37837
10154A955400j87204j04118R0049R3834K37799L69097M72312N84016O03752K81412
10144D396349P7877N047j81114j89231j36115j23128j56330m44019j89105k90619
10134B769612l71996j10044j70711l10535k28656l11641M7531j40464k08990j86707
10124G77399j53990K18054K46812J57870k19327l39000j01504N8337L4036j40370
10114E38317n1640p5822n7148J28657P8229n7822k60942J10730K7208j74343j2459
10103A92965q7290O1314j05457j1950J48487J31356J07152k2921j70511n645p5725
10092A61775l4504j5321k0171J225R8735J61695k5488K6766l4545l449J80180
$$ plain form
10081 496898 555222 536737 538112 318875 302159 208842 90286 67918 191534 115324 113982
10070 113982 159834 380711 470315 268631 163179 370289 491384 504759 309047 43287
10060 43287 297122 410842 383209 225660 67522 -134639 -246644 -299186 -187879 71023
10050 71023 218339 295084 337003 276007 262120 207867 7308 -14169 42601 42802 99727 -167013
10038 -167013 -173317 10474 -82742 -109893 -109117 6316 -232523 -113513 118689 318758 318495
10027 318495 236172 73112 18996 88107 124870 71636 6005 231213 377633 139426 -38767
10016 -38767 -147785 -211685 -77600 90094 141913 86126 -73966 -22593 18579 -55055 -89398
10005 -89398 66600 236927 304880 108527 -141517 -71183 -16681 -37771 -52527 197860 301706
$$ packed form
10081D96898N8324j8485J375k19237j6716r3317j18556k2368J23616p6210j342
10070A13982M5852K20877Q9604k01684j05452K07110J21095J3375j95712k65760
10060D3287K53835J13720k7633j57549j58138k02161j12005n2542J11307K58902
10050G1023J47316P6745M1919o0996j3887n4253k00559k1477N6770K01N6925k66740
10038a67013o304J83791r3216k7151P76J15433k38839J19010K32202K00069k63
10027C18495q2323j63060n4116O9111L6763n3234o5631K25208J46420k38207j78193
10016c8767j09018o3900J34085J67694N1819n5787j60092N1373M1172p3634l4343
10005h9398J55998J70327O7953j96353k50044P0334N4502k1090j4756K50387J03846
$$ plain form
9994 301706 86758 -102416 -78606 -15705 47155 233498 186186 114495 -14385 -46735 -27566
9983 -27566 10267 -84058 -99500 -82729 -165600 -338784 -363674 -192579 -188228 -636 -119868
9972 -119868 -271610 -280870 -181366 -200377 -415770 -438767 -125349 121374 253433 60267 8369
9961 8369 98293 236091 413253 170772 67393 40292 58221 143381 333242 338288 270760
9950 270760 145849 299296 198753 211149 209174 -27986 -28198 -11158 129886 20820 127706
9939 127706 175477 242524 249312 109142 7637 74510 144734 121721 167677 125237 25633
9928 25633 28417 212624 180182 193452 101157 189484 49625 25012 67343 40289 -64585
9917 -64585 17572 -20753 -67177 -118004 -329856 -234090 14225 -2552 229056 526312 590642
$$ packed form
9994C01706k14948j89174K3810O2901O2860J86343m7312p1691j28880l2350J9169
9983b7566L7833r4325j5442J6771q2871j73184k4890J71095M351J87592j19232
9972a19868j51742r260R9504j9011k15393k2997L13418K46723J32059j93166n1898
9961H369Q9924J37798J77162k42481j03379k7101J7929Q5160J89861N046o7528
9950B70760j24911J53447j00543J2396j975k37160k12J7040J41044j09066J06886
9939A27706M7771O7047O788j40170j01505O6873P0224k3013M5956m2440r9604
9928B5633K784J84207l2442J3270r2295Q8327j39859k4613M2331k7054j04874
9917f4585Q2157l8325m6424n0827k11852R5766K48315j6777K31608K97256O4330
$$ plain form
9906 590642 382891 84171 205537 205063 -83095 -156752 -62868 138963 322794 387412 482398
9895 482398 368226 322582 238248 316543 329663 24612 -128758 -42301 59669 280648 366117
9884 366117 217243 199978 236539 176809 99720 147281 142204 134257 78419 105292 82151 86878
9872 86878 135758 162958 229579 297482 232830 154561 202526 290903 394326 427542 548387
9861 548387 525483 509073 477004 169947 -101503 -56408 48848 10272 -88678 -33202 11856
9850 11856 -13038 27573 61134 -54 -110790 -71147 114703 33483 165189 24509 -306430
9839 -306430 -344949 -271319 -188918 -216867 -342430 -156398 -192236 -213106 -80678 -11778 -74916
9828 -74916 58421 309492 304363 238591 21774 -149751 -27320 -20296 109518 183517 18894
$$ packed form
9906E90642k07751k98720J21366m74k88158p3657R3884K01831J83831O4618R4986
9895D82398j14172m5644q4334P8295J3120l05051j53370Q6457J01970K20979Q5469
9884C66117j48874j7265L6561n9730p7089M7561n077p947n5838K6873k3141M727
9872H6878M8880K7200O6621O7903o4652p8269M7965Q8377J03423L3216J20845
9861E48387k2904j6410l2069l07057k71450M5095J05256l8576r8950N5476M5058
9850A1856k4894M0611L3561o1188j10736L9643J85850q1220J31706j40680l30939
9839c06430l8519P3630Q2401k7949j25563J86032l5838k0870J32428O8900o3138
9828g4916J33337K51071n129o5772k16817j71525J22431P024J29814P3999j64623
$$ plain form
9817 18894 -72235 -190017 -20115 54829 43597 -41503 37268 239957 300036 8682 -175447
9806 -175447 -90405 247499 291051 351076 437834 301537 280648 -17977 -243095 -179845 -18549
9795 -18549 -39967 120009 332235 539077 588083 222441 152087 192271 125335 94077 36883
9784 36883 -175211 -271786 -390434 -201993 -102855 -65870 -109762 -233979 -298539 -218351 -284757
9773 -284757 -241199 -290145 -177472 -226835 -437116 -439352 -275361 -91468 -8515 30221 -31873
9762 -31873 -58740 98622 65988 -70951 146932 93444 -80543 -178662 -53943 164319 168599
9751 168599 63835 20130 -91158 -17046 202125 126480 45221 103636 239307 145871 -72419
9740 -72419 -123897 -2220 20872 -52976 -46612 54011 143408 144901 -67843 -73842 -110861 -40638
$$ packed form
9817A8894r1129j17782J69902P4944j1232q5100P8771K02689O0079k91354j84129
9806a75447Q5042L37904M3552O0025Q6758j36297k0889k98625k25118O3250J61296
9795a8549k1418J59976K12226K06842M9006l65642p0354M0184o6936l1258n7194
9784C6883k12094r6575j18648J88441R9138L6985m3892j24217o4560Q0188o6406
9773b84757M3558m8946J12673m9363k10281k236J63991J83893Q2953L8736o2094
9762c1873k6867J57362l2634j36939K17883n3488j73987r8119J24719K18262M280
9751A68599j04764m3705j11288P4112K19171p5645q1259N8415J35671r3436k18290
9740g2419n1478J21677K3092p3848O364J00623Q9397J493k12744n999l7019P0223
$$ plain form
9728 -40638 62600 160265 143314 174596 182167 126427 -182227 -141227 -101824 13283 42455
9717 42455 86622 161746 233770 381089 383616 119157 -127400 -33128 53944 -39136 -266407
9706 -266407 -175895 -252810 -449595 -584312 -560286 -378898 -222796 -84352 -20868 39978 199653
9695 199653 214831 88929 -116455 -379345 -321954 -114448 -150186 -143273 -51332 -60567 -35579
9684 -35579 121842 103461 207710 177766 130708 272813 79524 -44521 164270 259050 255180
9673 255180 60049 83959 148767 257883 174971 126276 153435 263518 347234 287049 140316
9662 140316 21615 84472 115576 -148964 -398366 -358997 -184280 -120452 59682 105471 284109
9651 284109 313299 569161 446460 285768 200000 204998 275997 325573 555071 860799 939993
$$ packed form
9728d0638J03238R7665j6951L1282P571n5740l08654M1000L9403J15107K9172
9717D2455M4167P5124P2024J47319K527k64459k46557R4272Q7072r3080k27271
9706b66407R0512p6915j96785j34717K4026J81388J56102J38444O3484O0846J59675
9695A99653J5178j25902k05384k62890N7391K07506l5738O913R1941r235K4988
9684c5579J57421j8381J04249k9944m7058J42105j93289j24045K08791R4780l870
9673B55180j95131K3910O4808J09116q2912m8695K7159J10083Q3716o0185j46733
9662A40316j18701O2857L1104k64540k49402L9369J74717O3828J80134M5789J78638
9651B84109K9190K55862j22701j60692q5768M998P0999M9576K29498L05728P9194
$$ plain form
9640 939993 752151 746868 659431 454813 343210 105972 18136 117552 67486 10804 177316
9629 177316 166216 230454 248394 19396 -41064 115154 -63160 -301042 -357406 -119671 -127299
9618 -127299 -46304 149767 216469 232904 216328 9503 -284941 -263103 -198346 -227615 -348677
9607 -348677 -358296 -167003 44766 91809 1181 110553 72799 -108732 -8719 50730 361223
9596 361223 346436 449152 404844 304915 414304 331752 151138 125951 112023 155640 172177
9585 172177 268929 344672 302017 78162 -9895 -175693 -228837 -64556 76955 304434 351585
9574 351585 233126 163812 117683 17938 98533 31374 28259 108203 231179 276907 291140
9563 291140 350741 342615 292589 139686 201160 -68623 -294125 -255207 -112313 -15579 62292
$$ packed form
9640I39993j87842n283q7437k04618j11603k37238q7836R9416n0066n6682J66512
9629A77316j1100O4238J7940k28998o0460J56218j78314k37882n6364K37735p628
9618a27299Q0995J96071O6702J6435j6576k06825k94444K1838O4757k9269j21062
9607c48677r619J91293K11769M7043r0628J09372l7754j81531J00013N9449L10493
9596C61223j4787J02716m4308r9929J09389q2552j80614k5187j3928M3617J6537
9585A72177R6752P5743m2655k23855q8057j65798n3144J64281J41511K27479M7151
9574C51585j18459o9314m6129r9745Q0595o7159l115P9944J22976M5728J4233
9563B91140N9601q126n0026j52903O1474k69783k25502L8918J42894R6734P7871
$$ plain form
9552 62292 57047 167018 271101 159602 6588 60228 -24318 113489 140541 254105 243827
9541 243827 45585 -2757 4344 -155120 -55899 -5729 28708 123421 116185 105800 -224517
9530 -224517 -363199 -74659 20962 42391 -182269 -286099 -324339 -157666 -19646 122018
9520 122018 130084 135427 67578 -32837 -173358 -303352 -171378 -70167 -180086 -72903 -49580
9509 -49580 -74891 -26453 -61789 75827 15844 -76855 -213566 -404295 -239784 -83875 -113749
9498 -113749 3366 -137093 -137499 -269027 -365364 -215284 -61262 -26549 -34217 11236 154535
9487 154535 54517 79122 192271 140431 260995 139453 -34415 -88333 78452 126787
9477 126787 99866 269300 112738 -147259 -51532 46398 -169352 -194995 -267806 -320809 -275552
$$ packed form
9552F2292n245J09971J04083j11499j53014N3640q4546J37807K7052J13564j0278
9541B43827j98242m8342P101j59464R9221N0170L4437R4713p236j0385l30317
9530b24517j38682K88540R5621K1429k24660j03830l8240J66673J38020J41664
9520A22018Q066N343o7849j00415j40521j29994J31974J01211j09919J07183K3323
9509d9580k5311M8438l5336J37616n9983r2699j36711j90729J64511J55909k9874
9498a13749J17115j40459m06j31528r6337J50080J54022L4713p668M5453J43299
9487A54535j00018K4605J13149n1840J20564j21542j73868n3918J66785M8335
9477A26787k6921J69434j56562k59997R5727R7930k15750k5643p2811n3003M5257
$$ plain form
9466 -275552 -352322 -372311 -237446 -169110 -230961 -470576 -422784 -292463 -224436 -244321 -103233
9455 -103233 -44101 -2727 -5300 130571 -42130 -4550 189651 330684 233884 144769 142393
9444 142393 105224 232002 191432 -8741 20037 -28271 23824 47829 61503 -124529 -135024
9433 -135024 -70961 -195414 -116641 -67554 -115217 -51567 -261703 -454032 -316361 -163013 31063
9422 31063 79842 69122 -119819 -74006 26691 33930 -201469 -275425 -321311 -239518 -254295
9411 -254295 -287409 -359157 -236514 96997 191487 -1200 -168501 -136056 -41602 -221533 -275377
9400 -275377 -116958 -77339 -63707 79355 118570 53277 -32936 -141588 8447 36021 -12290
9389 -12290 -217937 -133768 -17284 189745 294739 261772 125398 162100 -1575 -144224
$$ packed form
9466b75552p6770j9989J34865O8336o1851k39615M7792J30321O8027j9885J41088
9455a03233N9132M1374k573J35871j72701L7580J94201J41033r6800q9115k376
9444A42393l7169J26778m0570k00173K8778m8308N2095K4005J3674j86032j0495
9433a35024O4063j24453P8773M9087m7663O3650k10136j92329J37671J53348J94076
9422C1063M8779j0720j88941M5813J00697P239k35399p3956m5886Q1793j4777
9411b54295l3114p1748J22643L33511R4490j92687j67301L2445R4454j79931n3844
9400b75377J58419L9619J3632J43062L9215o5293q6213j08652J50035K7574m8311
9389a2290k05647Q4169J16484K07029J04994l2967j36374L6702j63675j42649
$$ plain form
9379 -144224 6998 86270 130911 177970 117801 42299 43994 -45769 -93336 -42017 -163759
9368 -163759 -45142 318511 409208 307526 168051 134687 146009 52537 4559 186356 218454
9357 218454 121559 139349 76566 -92197 -153449 23780 104018 77855 110674 7890 40245
9346 40245 133108 71910 31411 -92837 -52669 -139567 -99385 -92176 -49303 96964 261868
9335 261868 141426 -91100 -158993 -139386 -159242 -14994 -35938 -93256 -246604 -155510 104195
9324 104195 238075 127737 45974 108018 -294 -96217 -51702 82064 266008 329476 184999
9313 184999 250318 97906 14982 -72297 -16961 -97621 35338 133955 146589 -1694 -187763
9302 -187763 -217610 26686 188843 1025 46559 47214 -128050 -185992 -135720 -25461 144869
$$ packed form
9379a44224J51222P9272M4641M7059o0169p5502J695q9763m7567N1319j21742
9368a63759J18617L63653R0697j01682j39475l3364J1322r3472m7978J81797L2098
9357B18454r6895J7790o2783j68763o1252J77229Q0238k6163L2819j02784L2355
9346D0245R2863o1198m0499j24248M0168q6898M0182P209M2873J46267J64904
9335B61868j20442k32526o7893J9607j9856J44248k0944n7318j53348R1094K59705
9324A04195J33880j10338q1763O2044j08312r5923M4515J33766J83944O3468j44477
9313A84999O5319j52412q2924q7279N5336q0660J32959R8617J2634j48283j86069
9302a87763k9847K44296J62157j87818M5534O55j75264n7942N0272J10259J70330
$$ plain form
9291 144869 245444 256183 178375 99067 -80843 -223917 -146779 -34614 -34383 -34794 20638 90864
9279 90864 305867 238738 128926 25284 32015 -105313 -44049 53296 32915 84326 265547
9268 265547 300076 68298 169027 177553 142661 342911 516565 292596 187224 35969
9258 35969 -47775 11500 136593 17832 -30595 -258493 -281202 -15670 251739 342234 430476
9247 430476 531006 554534 346026 288795 340944 357819 496366 335180 227824 250055 179769
9236 179769 -8066 -59149 -88022 -277378 -128096 6280 -152 5430 156729 317606 227599
9225 227599 61863 123205 57322 65567 127764 243613 302676 272806 251174 152354 258192
9214 258192 249849 190609 33933 -105068 -166417 -76491 -131870 -144320 50527 297338 116079
$$ packed form
9291A44869J00575J0739p7808p9308j79910j43074P7138J12165K31m11N5432P0226
9279I0864K15003o7129j09812j03642O731j37328O1264R7345k0381N1411J81221
9268B65547L4529k31778J00729Q526l4892K00250J73654k23969j05372j51255
9258C5969q3744N9275J25093j18761m8427k27898k2709K65532K67409R0495Q8242
9247D30476J00530K3528k08508n7231N2149J6875J38547j61186j07356K2231p0286
9236A79769j87835n1083k8873j89356J49282J34376o432N582J51299J60877r0007
9225B27599j65736O1342o5883Q245O2197J15849N9063k9870k1632r8820J05838
9214B58192q343n9240j56676j39001o1349Q9926n5379j2450J94847K46811j81259
$$ plain form
9203 116079 -102272 -102470 -68182 -73246 -173575 -132726 -43913 -102398 -61791 -77082 -116624 -85775
9191 -85775 -166938 -108260 -26072 158122 288542 201667 -20570 -268014 -209355 48486 292049
9180 292049 284002 2949 -34426 -78066 -242169 -177646 -140636 -136819 -72981 -85763 -148708 -250110
9168 -250110 -356657 -290415 -179337 -262921 -226526 -201745 41985 -77737 -115021 -160311 -209026
9157 -209026 -121547 -6979 -7036 -2403 202454 43294 -239985 -399444 -467038 -427847 -215696
9146 -215696 -215139 -247886 -145684 -36059 83221 128007 45725 130165 210818 177413 163155
9135 163155 112055 -122423 32510 -46154 -46650 -57412 -8095 -109511 -110544 171519 250852
9124 250852 25888 -72727 51957 5906 -84822 104765 159774 7778 117207 174253 167834
$$ packed form
9203A16079k18351j98L4288n064j00329M0849Q8813n8485M0607j5291l9542L0849
9191h5775q1163N8678Q2188J84194J30420q6875k22237k47444N8659K57841K43563
9180B92049q047k81053l7375m3640j64103O4523L7010L817O3838j2782o2945j01402
9168b50110j06547O6242J11078q3584L6395K4781K43730j19722l7284m5290m8715
9157b09026Q7479J14568n7M633K04857j59160k83279j59459o7594L9191K12151
9146b15696N57l2747J02202J09625J19280M4786q2282Q4440Q0653l3405j4258
9135A63155n1100k34478J54933p8664m96j0762M9317j01416j033K82063P9333
9124B50852k24964r8615J24684m6051r0728J89587N5009j51996J09429N7046o419
$$ plain form
9113 167834 38870 -182035 -306429 -222598 -74700 -57589 -18522 -118495 -259290 -478361
9103 -478361 -508950 -210459 31134 35603 -12385 -80387 -179712 87143 287212 240482 128686
9092 128686 -195320 -214533 -61399 -86196 -44747 -125348 -254042 -288667 -336048 -409942 -365234
9081 -365234 -401980 -303867 -102004 -12421 80037 76066 -106798 -140764 -234485 -256365 -99630
9070 -99630 120960 1456 111890 -15379 -147531 -230347 -165140 -335621 -35001 157949
9060 157949 137671 279937 209331 112250 -73067 -176061 -89497 104903 -45860 -176122
9050 -176122 -55696 228773 447425 276350 -32453 -151329 -231129 -238569 -259466 -149769
9040 -149769 20860 -70850 -165556 -331377 -561634 -446141 -152378 55329 160127 271262
$$ packed form
9113A67834j28964k20905j24394Q3831J47898J7111L9067r9973j40795k19071
9103d78361l0589K98491K41593M469m7988o8002r9325K66855K00069m6730j11796
9092A28686l24006j9213J53134k4797M1449q0601j28694l4625m7381p3894M4708
9081c65234l6746R8113K01863Q9583R2458l971j82864l3966r3721k1880J56735
9070i9630K20590j19504J10434j27269j32152q2816O5207j70481L00620J92950
9060A57949k0278J42266p0606r7081j85317j02994Q6564J94400j50763j30262
9050a76122J20426K84469K18652j71075l08803j18876p9800p440k0897J09697
9040a49769J70629r1710r4706j65821k30257J15493K93763K07707J04798J11135
$$ plain form
9030 271262 273720 179902 152627 209635 52142 -88556 -96032 -182854 -374187 -201788 -23310
9019 -23310 -27148 40712 309299 198389 65989 118060 -20853 -252438 -137818 112482 172447
9008 172447 264158 297971 12045 -306928 -220295 -13349 96405 119938 -36303 -185239
8998 -185239 -88720 -99014 -148474 -159906 56023 -97647 -367943 -442030 -224357 69939 174182
8987 174182 87692 21472 36349 130476 157622 154363 148166 -77890 -351303 -511392 -451438
8976 -451438 -485660 -326328 -345909 -290223 -321678 -407934 -450535 -192086 -10342 33612 -27944
8965 -27944 -88404 -155053 -212229 -375800 -325475 -175087 -46922 -91128 -168502 -354013 -390949
8954 -390949 -487250 -567965 -230530 -66432 56637 114243 158217 213664 121469 74223 -105679
$$ packed form
9030B71262K458r3818k7275N7008j57493j40698p476q6822j91333J72399J78478
9019b3310l838O7860K68587j10910j32400N2071j38913k31585J14620K50300N9965
9008A72447R1711L3813k85926l18973Q6633K06946J09754K3533j56241j48936
8998a85239R6519j0294m9460j1432K15929j53670k70296p4087K17673K94296J04243
8987A74182q6490o6220J4877R4127K7146l259o197k26056k73413j60089N9954
8976d51438l4222J59332j9581N5686l1455q6256m2601K58449J81744M3954o1556
8965b7944o0460o6649n7176j63571N0325J50388J28165m4206p7374j85511l6936
8954c90949r6301q0715L37435J64098J23069N7606M3974N5447r2195m7246j79902
$$ plain form
8943 -105679 -176516 -192179 -255633 -233835 -102338 91045 211066 15668 643 136585 248416
8932 248416 89555 99944 50486 9947 22048 -173026 -131807 72268 136967 227199 250294
8921 250294 120887 62626 -145317 -278258 -334183 -205558 -101196 -247678 -229875 -338022
8911 -338022 -390516 -462348 -432832 -246676 -45670 113489 74835 -117450 -288561 -134203
8901 -134203 -172724 -100972 281232 172847 -107349 -125977 78319 298417 387708 175359
8891 175359 101493 108134 257614 267235 88850 25372 -129838 -174232 8862 -39136 31760
8880 31760 -381 -197420 -127501 -55379 24307 278339 262421 112838 32562 -91773 -81486
8869 -81486 -73729 -55702 -75606 -39088 4618 -249393 -385839 -441176 -507643 -570924 -574992 -427073
$$ packed form
8943a05679p0837j5663o3454K1798J31497J93383J20021j95398j5025J35942J11831
8932B48416j58861J0389m9458m0539J2101j95074M1219K04075O4699R0232K3095
8921B50294j29407n8261k07943j32941n5925J28625J04362j46482J7803j08147
8911c38022n2494p1832K9516J86156K01006J59159l8654j92285j71111J54358
8901a34203l8521P1752L82204j08385k80196j8628K04296K20098Q9291k12349
8891A75359p3866O641J49480R621j78385o3478j55210m4394J83094m7998P0896
8880C1760l2141j97039O9919P2122P9686K54032j5918j49583q0276j24335J0287
8869h1486P757J8027j9904L6518M3706k54011j36446n5337o6467o3281m068J47919
$$ plain form
8857 -427073 -81418 6241 -227223 -83870 66937 154687 191492 1882 3275 36755 47682
8846 47682 13161 -88083 -61127 -39497 -56568 103379 110145 117183 234194 10273 -285932
8835 -285932 -261746 -106855 -234951 -70777 185706 256245 270010 342199 192821 96188 131453
8824 131453 201905 133131 84133 -106888 -121580 -380991 -278248 -139130 -268243 -343204 -109854
8813 -109854 -127262 -263770 -376524 -169517 -126699 -26523 42326 -68566 -37503 -59358 93072
8802 93072 159139 -2271 11461 91399 67582 208309 179841 220676 350006 303667 120463
8791 120463 10450 48801 161728 56610 137874 139528 -25229 -81579 -200113 -253503 21816
8780 21816 136236 -9983 -128762 44413 141531 114372 56653 -78644 15288 137166 247815
$$ packed form
8857d27073L45655Q7659k33464J43353J50807Q7750L6805j89610J393L3480J0927
8846D7682l4521j01244K6956K1630j7071J59947O766P038J17011k23921k96205
8835b85932K4186J54891j28096J64174K56483P0539J3765P2189j49378r6633L5265
8824A31453P0452o8774m8998j91021j4692k59411J02743J39118j29113p4961K33350
8813a09854j7408j36508j12754K07007M2818J00176O8849j10892L1063k1855J52430
8802I3072O6067j61410J3732P9938k3817J40727k8468M0835J29330m6339j83204
8791A20463j10013L8351J12927j05118Q1264J654j64757n6350j18534n3390K75319
8780B1816J14420j46219j18779J73175R7118k7159n7719j35297R3932J21878J10649
$$ plain form
8769 247815 307650 308975 139765 78754 157492 98538 62942 59430 16205 85127 366913 394021
8757 394021 125020 52888 54547 -37727 -380588 -321020 -94674 -117734 -193878 -171921 -302760
8746 -302760 -295159 -225907 -177537 -91893 -113457 -40567 -58131 -9444 266694 343059 341656 104161
8734 104161 115806 257249 167889 -5248 -14150 37226 48080 22236 22941 55517 44886 164281
8722 164281 146088 -59454 -102531 -72147 119196 248729 268138 51507 -92034 27294
8712 27294 74451 -116687 -272046 -270896 -52723 -36138 28464 -13175 -208550 -399525 -384555
8701 -384555 -272228 -325830 -23573 392820 222004 -96105 -88843 110012 45486 -151854
8691 -151854 -63858 -10219 72066 127954 79208 88519 234827 120893 111537 21691 -19931 -233022
$$ packed form
8769B47815N9835J325j69210o1011P8738n8954l5596l512m3225O8922K81786K7108
8757C94021k69001p2132J659r2274l42861N9568K26346k3060p6144K1957j30839
8746c02760P601O9252M8370Q5644k1564P2890j7564M8687K76138P6365j403k37495
8734A04161J1645J41443q9360j73137q902N1376J0854k5844P05L2576j0631J19395
8722A64281j8193k05542m3077L0384J91343J29533J9409k16631j43541J19328
8712B7294M7157j91138j55359J150K18173J6585O4602m1639j95375j90975J4970
8701c84555J12327n3602L02257M16393j70816l18109P262J98855o4526j97340
8691a51854Q7996N3639Q2285N5888m8746R311J46308j13934r356q9846m1622k13091
$$ plain form
8679 -233022 28332 101958 -45607 -171211 -272019 -309013 -9456 207573 305913 103528
8669 103528 -29779 -160352 -184549 -91416 -149406 -362192 -362778 -315534 -349815 -257565 -173344
8658 -173344 -377704 -361562 -345140 -331684 13620 299584 400495 197886 -133966 -221663
8648 -221663 -148168 -12092 113464 -36742 -180429 -139316 -93208 -69371 -131414 -231027 -94683
8637 -94683 -119294 18484 98929 -42936 -219848 -267272 -159099 162022 299980 187650
8627 187650 148254 25476 -138349 -228760 -236341 -49295 -157068 -120010 8786 95968 -7071
8616 -7071 126615 184324 220257 148858 -8732 -164982 11528 50355 -31793 -153723 -95224
8605 -95224 -31926 126864 133787 -61414 -304151 -410835 -180496 -82635 -227195 -186706 -96735
$$ packed form
8679b33022K61354P3626j47565j25604j00808l6994K99557K17029R8340k02385
8669A03528j33307j30573k4197R3133n7990k12786n86M7244l4281R2250Q4221
8658a73344k04360J6142J6422J3456L45304K85964J00911k02609l31852q7697
8648b21663P3495J36076J25556j50206j43687M1113M6108K3837o2043r9613J36344
8637i4683k4611J37778Q0445j41865j76912m7424J08173L21121J37958j12330
8627A87650l9396j22778j63825r0411p581J87046j07773L7058J28796Q7182j03039
8616g071J33686N7709L5933p1399j57590j56250J76510L8827q2148j21930N8499
8605i5224O3298J58790O923j95201k42737j06684K30339R7861j44560M0489Q9971
$$ plain form
8594 -96735 -12423 99182 45614 -96872 39350 384856 489096 353176 127707 -79482
8584 -79482 -36243 138218 238025 165289 90795 -102255 -252257 -190499 -38617 174180 356446
8573 356446 334491 306743 312721 232280 461357 442233 523785 427271 124851 -48140 49742
8562 49742 58816 88645 -112412 -285329 -194925 32920 -14581 -138094 -216893 -208832 -44819
8551 -44819 143264 219207 142592 -75146 49708 171031 268997 196635 86897 -133821 -128434
8540 -128434 -157023 -264840 -312223 -347985 -360672 -365803 -258391 -137411 -5570 167897 284946
8529 284946 7980 9417 139335 408364 393698 317362 376171 188394 146010 123114 -126493
8518 -126493 -218200 -138467 -165892 -383001 -485309 -193174 -106838 -187769 -17740 54255 -94360
$$ packed form
8594i6735Q4312J11605n3568j42486J36222L45506J04240j35920k25469k07189
8584g9482M3239J74461R9807p2736p4494j93050j50002O1758J51882K12797J82266
8573C56446k1955k7748N978q0441K29077j9124Q1552r6514l02420j72991R7882
8562D9742R074K9829k01057j72917R0404K27845m7501j23513p8799Q061J64013
8551d4819J88083P5943p6615k17738J24854J21323R7966p2362j09738k20718N387
8540a28434k8589j07817m7383l5762j2687n131J07412J20980J31841J73467J17049
8529B84946k76966J437J29918K69029j4666p6336N8809j87777m2384k2896k49607
8518a26493r1707P9733k7425k17109j02308K92135Q6336q0931J70029P1995j48615
$$ plain form
8507 -94360 -133425 -162076 -96331 -178679 -179045 38885 2013 -22973 52988 -103931 -101805 28638
8495 28638 228482 101623 108621 167210 84936 56258 106502 87965 84503 268883 206360 83176
8483 83176 333297 304038 -72804 -13257 -80041 35263 93301 114668 316518 230180 92167
8472 92167 135025 152726 187308 264463 365917 448252 589277 501833 527650 308430 97703
8461 97703 34160 109013 290451 351379 378554 293248 319867 238706 38356 89426 56905
8450 56905 106805 66307 -115040 -42208 -22958 -117600 45256 67024 51298 123668 402423
8439 402423 473649 556224 683246 523496 516574 527993 637758 672185 489040 708883 827512
8428 827512 770623 558962 524651 548555 733638 772700 693067 757571 684113 521935 467676
$$ packed form
8507i4360l9065k8651O5745q2348l66K17930l6872k4986P5961j56919K126J30443
8495B8638J99844j26859O998N8589q2274k8678N0244j8537l462J84380o2523j23184
8483H3176K50121k9259l76842N9547o6784J15304N8038K1367K01850q6338j38013
8472I2167M2858J7701L4582P7155J01454Q2335J41025q7444K5817k19220k10727
8461I7703o3543P4853J81438O0928K7175q5306K6619q1161k00350N1070l2521
8450E6905M9900m0498j81347P2832J9250r4642J62856K1768j5726P2370K78755
8439D02423P1226Q2575J27022j59750o922J1419J09765L4427j83145K19843J18629
8428H27512n6889k11661l4311K3904J85083L9062p9633O4504p3458j62178n4259
$$ plain form
8417 467676 600909 579400 439123 427568 522981 459212 258797 10525 -85021 15433 96744
8406 96744 239844 438710 549611 268061 205236 342475 231365 218442 97696 21388
8396 21388 194589 161161 52274 49456 68125 -99571 -101672 42935 165102 165 -205035
8385 -205035 -247777 -76458 -11336 171254 277505 122474 -19237 -45056 -120569 -41924 -25623
8374 -25623 -224605 -289504 -177290 50251 257332 236552 228263 314656 370224 239149 23677
8363 23677 -26945 -128478 -249305 -297387 -291439 -383998 -354209 -200436 -131780 1423 -7106
8352 -7106 -280519 -346527 -151100 -165337 -358485 -432450 -286703 -43982 2462 -77208 -263274
8341 -263274 -457703 -256209 -164055 -55700 -52750 -267021 -520977 -263942 -34184 47717
$$ packed form
8417D67676J33233k1509j40277j1555R5413o3769k00415k48272r5546J00454Q1311
8406I6744J43100J98866J10901k81550o2825J37239j11110j2923j20746p6308
8396B1388J73201l3428j08887k818J8669j67696k101J44607J22167j64937k05200
8385b05035m2742J71319O5122J82590J06251j55031j41711k5819p5513P8645J6301
8374b5623j98982o4899J12214K27541K07081k0780q289Q6393N5568j31075k15472
8363B3677n0622j01533j20827m8082N948r2559K9789J53773O8656J33203q529
8352g106k73413o6008J95427j4237j93148p3965J45747K42721M6444p9670j86066
8341b63274j94429K01494R2154J08355K950k14271k53956K57035K29758Q1901
$$ plain form
8331 47717 -58264 -133459 -158325 -243786 -269748 -269917 -160813 -126346 28676 101632 132953 -68298
8319 -68298 -168957 -100271 -178428 -175205 60208 23009 -74769 -123406 -227261 -326428 -287968
8308 -287968 -264419 -188763 -71054 -36223 -63498 -132997 -131097 -111027 26504 30328 61919 -58340
8296 -58340 -224415 -336327 -141844 -68533 -144024 -146830 -156598 -210791 -472700 -401393 -305258
8285 -305258 -171821 -39323 55061 -62413 -62880 -53968 110819 42477 -12086 153378 40440
8274 40440 49811 100896 321158 460811 307141 88003 -88824 -54529 171651 206211 339917
8263 339917 528177 642932 490291 254860 160232 120325 230924 154085 27498 122263
8253 122263 103965 11343 -1058 -62617 3801 88965 86631 99317 35433 78556 34640 -21502
$$ packed form
8331D7717j05981p5195k4866q5461k5962j69J09104L4467J55022P2956L1321k01251
8319f8298j00659O8686p8157L223K35413l7199r7778m8637j03855r9167L8460
8308b87968K3549P5656J17709L4831k7275o9499J900K0070J37531L824L1591j20259
8296e8340j66075j11912J94483P3311p5491k806r768n4193k61909P1307R6135
8285c05258J33437J32498R4384j17474m67Q912J64787o8342n4563J65464j12938
8274D0440R371N1085K20262J39653j53670k19138j76827L4295K26180L4560J33706
8263C39917J88260J14755j52641k35431r4628l9907J10599p6839j26587R4765
8253A22263j8298r2622j2401o1559O6418Q5164k334J2686o3884M3123m3916n6142
$$ plain form
8241 -21502 373395 374714 333488 332836 199916 -43979 -270118 -193517 -313421 -55423 129334
8230 129334 -7150 -88835 -33254 211020 272847 211264 56224 -237522 -252993 -39267 61115
8219 61115 181902 -2775 -64041 -166422 -251336 66999 188456 -67696 -176985 -96749
8209 -96749 72576 82612 -137823 -218820 -273237 -339970 -175855 -43403 -182340 -47458 205818
8198 205818 126203 41362 127422 68591 94223 276848 377300 245554 220937 214951 210790
8187 210790 127295 87057 -10396 -265360 -248693 -131978 -157344 -120842 -186912 -17964 38247
8176 38247 151695 216170 51923 -218828 -376766 -225855 84636 103682 30669 103427 151024
8165 151024 134317 41632 -95905 -289893 -184509 171618 273010 215459 187911 153313 184633
$$ packed form
8241b1502L94897J319m1226o52j32920k43895k26139P6601j19904K57998J84757
8230A29334j36484q1685N5581K44274O1827o1583j55040k93746j5471K13726J00382
8219F1115J20787j84677o1266j02381q4914L18335J21457k56152j09289Q0236
8209i6749J69325J0036k20435q0997n4417o6733J64115J32452j38937J34882K53276
8198B05818p9615q4841Q6060n8831K5632J82625J00452j31746k4617n986m161
8187B10790q3495m0238r7453k54964J6667J16715k5366L6502o6070J68948N6211
8176C8247J13448O4475j64247k70751j57938J50911L10491J9046p3013P2758M7597
8165A51024j6707r2685j37537j93988J05384L56127J01392n7551k7548l4598L1320
$$ plain form
8154 184633 46355 -137180 -141380 -211649 -247049 -286915 -144094 -153337 -109816 -80895 5825
8143 5825 -111203 -67867 354108 554691 361348 125433 -75210 -68220 -37749 114775 92515
8132 92515 73464 65665 -64243 41170 147206 110902 93568 -74880 -149343 -257711 -173508
8121 -173508 67566 291362 348702 340356 170893 107334 194716 -27855 -194607 -121443 -70039
8110 -70039 -52315 -63126 -125794 71 134038 57327 -182409 -246752 -27959 124374 213864
8099 213864 59196 69724 48267 -258882 -291128 -351081 -123036 49482 69149 149594 113850
8088 113850 146550 228228 210425 209868 233216 233747 102976 -68030 -86942 128214 171562 194094
8076 194094 295708 109759 -121148 -408212 -344667 -218626 -215546 -298783 -277246 -227847 -297430
$$ packed form
8154A84633j38278j83535m200p0269l5400l9866J42821r243M3521K8921Q6720
8143E825j17028M3336M21975K00583j93343k35915k00643O990L0471J52524k2260
8132I2515j9051p799j29908J05413J06036l6304j7334j68448p4463j08368Q4203
8121a73508K41074K23796N7340q346j69463o3559Q7382k22571j66752P3164N1404
8110g0039J7724j0811o2668J25865J33967p6711k39736o4343K18793J52333Q9490
8099B13864j54668J0528k1457l07149l2246n9953K28045J72518J9667Q0445l5744
8088A13850L2700Q1678j7803n57K3348N31j30771j71006j8912K15156M3348K2532
8076A94094J01614j85949k30907k87064O3545J26041L080q3237K1537M9399o9583
$$ plain form
8065 -297430 -271408 -268369 -154088 -111979 -73160 -249187 -54897 -13337 8419 36816 59460
8054 59460 -177597 -198590 -179955 -201377 -200771 -46236 -94072 -122274 -151283 -280043 -379906 -327211
8042 -327211 -353461 -194150 -126191 -259734 -245964 -326968 -188003 -55718 -687 378 -31855
8031 -31855 133985 194399 166595 28206 -63368 -277489 -382877 -117689 170954 66667
8021 66667 -10654 -56931 246444 335022 204846 205965 107836 -142004 -231132 -25119 17528
8010 17528 -121479 -316435 -375366 6300 233650 206797 267949 186570 137656 102922 11079
7999 11079 -137152 -163462 21358 58984 61839 75644 132583 32665 -76861 -216405 -415644
7988 -415644 -289497 -73257 -170761 -252709 -281741 -171707 80787 220329 152693 27758
$$ packed form
8065b97430K6022L039J14281M2109L8819j76027J94290M1560K1756K8397K2644
8054E9460k37057k0993J8635k1422O06J54535m7836k8202k9009j28760r9863N2695
8042c27211k6250J59311O7959j33543J3770q1004J38965J32285N5031J065l2233
8031c1855J65840O0414k7804j38389r1574k14121j05388K65188K88643j04287
8021F6667p7321m6277L03375Q8578j30176J119r8129k49840q9128K06013M2647
8010A7528j39007j94956n8931L81666K27350k6853O1152q1379m8914l4734r1843
7999A1079j48231k6310J84820L7626K855J3805N6939r9918j09526j39544j99239
7988d15644J26147K16240r7504q1948k9032J10034K52494J39542o7636j24935
$$ plain form
7978 27758 -355 -134134 -289703 -306282 -356514 -346779 -172441 7342 111816 145035 253672
7967 253672 212101 -1278 182125 326860 353238 371367 512536 423930 220044 113140
7957 113140 172211 158144 163028 25321 122856 87987 -90365 -115017 -138171 -357852 -233657
7946 -233657 181511 205790 -10559 -31246 -87985 -283186 -163789 -188735 -126291 -43054 101087
7935 101087 125110 71010 -32581 -66215 -146792 -126924 -233074 -340770 -207421 -105695 -3669
7924 -3669 -105028 -241749 -197572 -162055 123533 -32945 -61600 -47179 -182257 -160034 -107766
7913 -107766 -44979 -59663 -11300 -108305 -345012 -403196 -227566 -151816 -58094 108540 58293
7902 58293 -222378 -316108 -104904 -146131 8093 39665 -75044 -181159 149037 218387 65338
$$ packed form
7978B7758k8113j33779j55569j6579n0232R735J74338J79783J04474L3219J08637
7967B53672m1571k13379J83403J44735K6378J8129J41169q8606k03886j06904
7957A13140N9071j4067M884j37707R7535l4869j78352k4652k3154k19681J24195
7946b33657M15168K4279k16349k0687n6739j95201J19397k4946O2444Q3237J44141
7935A01087K4023n4100j03591l3634q0577J9868j06150j07696J33349J01726J02026
7924c669j01359j36721M4177L5517K85588j56478k8655J4421j35078K2223N2268
7913a07766O2787j4684M8363r7005k36707n8184J75630P5750R3722J66634n0247
7902E8293k80671r3730K11204m1227J54224L1572j14709j06115L30196O9350j53049
$$ plain form
7891 65338 163150 65532 232850 313704 378384 269486 116097 62966 129770 234467 141891
7880 141891 137422 121133 211065 77808 -12309 -72429 -132399 -40265 14377 -267900 -265702 -39473
7868 -39473 147718 213435 58389 -94633 -196697 -103088 -3908 100031 -25049 -287786
7858 -287786 -225885 -74036 -249214 -348452 -183820 -191398 -336837 -504286 -518384 -453463 -304389
7847 -304389 -266203 -275136 -290871 -314447 -131360 80923 314136 350112 209443 70324 -97279
7836 -97279 30295 134473 8411 -87991 -172155 -113543 -257770 -348384 -233848 -41776 40782
7825 40782 95945 67870 -20187 -88552 13608 92764 185041 -7707 -155002 -193324 -193003 -184658
7813 -184658 -203483 -232018 -75032 -116129 -10095 176653 47481 -136440 -223531 -77870
$$ packed form
7891F5338R7812r7618J67318Q0854O4680j08898j53389n3131O6804J04697r2576
7880A41891m469j6289Q9932j33257r0117o0120n9970R2134N4642k82277K198K26229
7868c9473J87191O5717j55046j53022j02064R3609R9180J03939j25080k62737
7858b87786O1901J51849j75178r9238J64632p578j45439j67449j4098O4921J49074
7847c04389L8186q933j5735k3576J83087K12283K33213L5976j40669j39119j67603
7836i7279J27574J04178j26062r6402q4164N8612j44227r0614J14536J92072Q2558
7825D0782N5163k8075q8057o8365J02160P9156R2277j92748j47295l8322L21Q345
7813a84658j8825k8535J56986m1097J06034J86748j29172j83921q7091J45661
$$ plain form
7803 -77870 -109662 -300117 -221401 -174656 80356 116747 -216305 -253135 -332312 -354845 -251761
7792 -251761 -20581 -141726 -289867 -105305 167343 275294 91156 225402 154362 134293
7782 134293 -117764 -216382 -37597 156797 343721 433134 482663 159839 103105 -44565
7772 -44565 31382 34939 66120 -11078 -168431 30581 61684 59067 40251 52834 98346 148776
7760 148776 117296 103248 -19568 -243406 -450816 -502891 -283422 -133024 70472 347442
7750 347442 425179 502133 233594 -119553 -210650 -248642 -299571 -270764 -161580 -68426 87039
7739 87039 131364 152459 267107 272916 210677 221534 323506 419627 409000 259456 253847 136919
7727 136919 103785 66009 -91356 -35561 150228 112711 214198 306424 114332 -8196 29455
$$ packed form
7803g7870l1792j90455P8716M6745K55012L6391l33052l6830p9177k2533J03084
7792b51761K31180j21145j48141J84562K72648J07951j84138J34246p1040k0069
7782A34293k52057r8618J78785J94394J86924Q9413M9529l22824n6734j47670
7772d4565P5947L557L1181p7198j57353J99012L1103k617j8816J2583M5512N0430
7760A48776l1480j4048j22816k23838k07410n2075K19469J50398K03496K76970
7750C47442P7737P6954k68539l53147r1097l7992n0929K8807J09184R3154J55465
7739H7039M4325K1095J14648N809o2239J0857J01972R6121j0627j49544n609j16928
7727A36919l3134l7776j57365N5795J85789l7517J01487R2226j92092j22528L7651
$$ plain form
7716 29455 -79541 -15534 -24247 167567 -41953 -188489 -234081 -48682 -9623 -106743 100287
7705 100287 194098 38254 -133526 -215307 -252368 -179740 -173032 -113062 -192983 -269887 -191789
7694 -191789 -104449 -62433 -21343 72314 9975 59608 110675 219845 111477 -128851 -233603
7683 -233603 -182063 -212413 -296899 -192778 -234910 -30285 -6505 -125784 -37668 60316 138976
7672 138976 312563 343522 314591 177435 318133 52873 -33679 10120 -33614 -29818 233508
7661 233508 210493 -19324 -412058 -492519 -301276 -272341 -253511 -76481 43300 -159035
7651 -159035 -308347 -6241 -21737 -270578 -109137 -128336 -121855 -146235 -239450 -255508 -60885
7640 -60885 -249910 -229963 -43106 6503 -11522 32418 65858 -30450 -230995 -388496 -236754
$$ packed form
7716B9455j08996O4007q713J91814k09520j46536m5592J85399L9059r7120K07030
7705A00287R3811j55844j71780q1781l7061P2628O708N9970p9921p6904P8098
7694a91789Q7340M2016M1090R3657o2339M9633N1067J09170j08368k40328j04752
7683b33603N1540l0350q4486J04121m2132K04625K3780j19279Q8116R7984P8660
7672A38976J73587L0959k8931j37156J40698k65260q6552M3799m3734L796K63326
7661B33508k3015k29817l92734q0461J91243K8935J8830J77030J19781k02335
7651a59035j49312L02106j5496k48841J61441j9199O481k4380r3215j6058J94623
7640f0885j89025J9947J86857M9609j8025M3940L3440r6308k00545j57501J51742
$$ plain form
7629 -236754 -312851 -356312 -364320 -247616 -299378 -361848 -357409 -345945 -362641 -346574 -358910 -235064
7617 -235064 -106989 -57019 3591 39293 21290 21313 64370 247208 298797 -49904 -274352
7606 -274352 -257392 -104169 138289 391804 396007 -8072 -252962 -254137 -172989 -155389 -151058
7595 -151058 -363719 -212346 141959 25807 -161709 -89043 90835 261715 158642 139415
7585 139415 252034 12048 -111077 53254 190312 300991 25788 45989 2980 43401
7575 43401 163345 106395 -28219 -243158 -196961 -86771 -191917 -154310 107025 287636
7565 287636 421773 206617 186161 313079 437005 337804 -74749 -130980 -237953 -254392
7555 -254392 -257886 -185282 4770 55904 127350 102642 44402 107316 187243 194573 215366 371091
$$ packed form
7629b36754p6097m3461q008J16704n1762o2470M439J1464j6696J6067j2336J23846
7617b35064J28075M9970O0610L5702j8003K3M3057J82838N1589l48701k24448
7606b74352J6960J53223K42458K53515M203m04079k44890j175Q1148J7600M331
7595a51058k12661J51373L54305j16152j87516P2666J79878J70880j03073j9227
7585A39415J12619k39986j23125J64331J37058J10679k75203K0201m3009M0421
7575D3401J19944n6950j34614k14939M6197J10190j05146L7607K61335J80611
7565B87636J34137k15156k0456J26918J23926r9201m12553n6231j06973j6439
7555b54392l494P2604J90052N1134P1446k4708n8240O2914P9927P330K0793J55725
$$ plain form
7543 371091 -39465 -253964 31600 177309 99192 45392 -16213 -102466 -21860 154069 65349
7532 65349 -113995 108124 283957 183682 20856 -8427 35432 205362 177409 190309 303542
7521 303542 136092 -117005 -155516 -182593 -144102 -83110 -128486 -31999 86855 247348 192620
7510 192620 -12004 -169128 -202965 -242725 -229872 -186395 -71275 106093 58257 -218821 -144289
7499 -144289 191160 408667 384267 174810 22821 -46972 -10984 107573 130363 -46534
7489 -46534 -91733 -28471 120811 78664 -79253 54194 -47765 -197368 -141085 92721 -406
7478 -406 -90303 79735 254376 318762 363411 375462 165606 121105 269542 232588 -1362
7467 -1362 -168603 40023 123194 3527 45988 -36800 42980 131599 164833 -15612 -135538
$$ packed form
7543C71091m10556k14499K85564J45709p8117n3800o1605q6253Q0606J75929q8720
7532F5349j79344K22119J75833j00275j62826k9283M3859J69930k7953J2900J13233
7521C03542j67450k53097l8511k7077L8491O0992m5376R6487J18854J60493n4728
7510A92620k04624j57124l3837l9760J2853M3477J15120J77368m7836k77078P4532
7499a44289L35449K17507k4400k09457j51989o9793L5988J18557K2790j76897
7489d6534m5199O3262J49282m2147j57917J33447j01959j49603N6283K33806r3127
7478d06q9897J70038J74641O4386M4649J2051k09856m4501J48437l6954k33950
7467a362j67241K08626Q3171j19667M2461q2788P9780Q8619L3234j80445j19926
$$ plain form
7456 -135538 -59620 169963 132567 222215 146554 34778 -62195 -106514 -180230 -144531 -205193
7445 -205193 -51589 25953 208397 249091 297752 87755 -119504 -272995 -211066 -26456
7435 -26456 130110 241644 128541 23477 -128302 -34244 145743 190854 -5078 -77252
7425 -77252 86742 90690 140159 289337 334689 287031 295756 178644 130232 180097 156807 123245
7413 123245 59862 -29124 -111393 -108986 24907 -2719 -404300 -545016 -431377 -327998 -134430
7402 -134430 -94148 -88964 -234439 -237533 -335546 -529720 -533456 -337545 -210769 -178651 -189197
7391 -189197 -202295 -232005 -162419 1400 -125602 -155710 -154376 71318 -87241 -38256 -59470
7380 -59470 -55057 -80345 -40098 -44831 -194384 -225315 -325873 -240196 -164368 -140248 -265678 -72590
$$ packed form
7456a35538P5918K29583l7396Q9648p5661j11776r6973m4319p3716L5699o0662
7445b05193J53604P7542J82444M0694M8661k09997k07259j53491O1929J84610
7435b6456J56566J11534j13103j05064j51779R4058J79987M5111j95932p2174
7425g7252J63994L948M9469J49178M5352m7658Q725j17112m8412M9865k3290l3562
7413A23245o3383q8986q2269K407J33893k7626m01581j40716J13639J03379J93568
7402a34430M0282N184j45475l094r8013j94174l736J95911J26776L2118j0546
7391a89197j3098k9710O9586J63819j27002l0108J334K25694j58559M8985k1214
7380e9470M413k5288M0247m733j49553l0931j00558Q5677P5828K4120j25430J93088
$$ plain form
7368 -72590 -30451 -133048 16799 25 261433 399157 319705 466376 380234 149941 15293
7357 15293 -161389 -237554 -243685 -122524 -264437 -314961 -203837 -182778 -117792 -227058 -239751
7346 -239751 -157730 -66870 -46256 -140961 -58956 -125258 -63515 37570 81004 195035 171237
7335 171237 89943 57438 99540 53950 -36008 -43091 -90069 -52043 -39300 -82252 15362 7173
7323 7173 -213990 -122724 66976 209067 18407 -79823 123531 48070 20278 147704 219499
7312 219499 148101 -11760 -91395 103781 234295 163114 21865 -193167 -200504 -140437 112785
7301 112785 85976 -26273 -54916 68820 192949 165618 101432 52626 10780 -228460 -330412
7290 -330412 -432949 -358291 -422105 -418907 -337151 -279853 -408321 -261887 -118071 -110969 -281806
$$ packed form
7368g2590M2139j02597J49847j6774K61408J37724p9452J46671q6142k30293j34648
7357A5293j76682p6165o131J21161j41913n0524J11124K1059O4986j09266j2693
7346b39751Q2021R0860K0614r4705Q2005o6302O1743J01085M3434J14031k3798
7335A71237q1294l2505M2102m5590q9958p083m6978L8026J2743m2952R7614q189
7323G173k21163R1266J89700J42091j90660r8230K03354p5461k7792J27426P1795
7312B19499p1398j59861p9635J95176J30514p1181j41249k15032p337O0067K53222
7301A12785k6809j12249k8643J23736J24129k7331o4186m8806m1846k39240j01952
7290c30412j02537P4658o3814L198Q1756N7298j28468J46434J43816P102j70837
$$ plain form
7279 -281806 -279743 -133504 -5901 -85020 -433642 -559803 -388439 -374196 -364475 -201634 -163345
7268 -163345 -182179 -68246 73874 108507 197387 143778 -57975 -299136 -132376 -149305 -176509
7257 -176509 -149019 22924 -124589 -144178 -112924 -125595 -107605 -1692 150511 161840 34304
7246 34304 -128465 42804 183262 -38562 -245858 -25032 78513 5046 -102919 -101837
7236 -101837 -130706 -248513 -322601 -379475 -260235 57779 201347 310325 232560 -33247
7226 -33247 -114236 -81255 -371564 -195864 -62787 -258212 -336319 -232956 20208 135138
7216 135138 403486 248712 -47992 64678 210609 287005 235054 36225 4801 27529
7206 27529 31322 37486 -120522 -366205 -265418 -241660 -200528 -188427 -443877 -685580 -308243
$$ packed form
7279b81806K063J46239J27603p9119l48622j26161J71364J4243R721J62841L8289
7268a63345j8834J13933J42120L4633Q8880n3609k01753k41161J66760j6929k7204
7257a76509K7490J71943j47513j9589L1254j2671J7990J05913J52203J1329j27536
7246C4304j62769J71269J40458k21824k07296K20826J03545p3467j07965J082
7236a01837k8869j17807p4088n6874J19240L18014J43568J08978p7765k65807
7226c3247q0989L2981k90309J75700J33077j95425p8107J03363K53164J14930
7216A35138K68348j54774k96704J12670J45931P6396n1951j98829l1424K2728
7206B7529L793O164j58008k45683J00787K3758M1132J2101k55450k41703L77337
$$ plain form
7195 -308243 -153061 -230132 -238112 -224228 -126852 -41539 89970 90221 55368 23856 -5755 -77643
7183 -77643 -122106 10799 -62040 -191545 -61376 17829 -221692 -200541 -252231 -122478 -98742
7172 -98742 -121342 -210403 -35035 -126155 -41281 16821 -173301 111151 270679 104557 -99046
7161 -99046 -106856 -170016 -207889 -166144 -174707 -160258 -17067 -9811 -93852 129803 260688 79897
7149 79897 20078 -4360 26674 214456 136449 -204663 -159807 80329 110340 -97946 -213165
7138 -213165 -40763 -35674 -32223 58296 150728 183958 -135709 -225081 -167723 -26293 177812
7127 177812 -35769 -252199 -277937 -549301 -559827 -253712 -45036 95536 107500 -17046
7117 -17046 138098 343756 215392 -141865 -425424 -420014 -133380 -227578 -175249 -145002 -103997
$$ packed form
7195c08243J55182p7071p980J3884R7376Q5313J31509K51l4853l1512k9611p1888
7183g7643m4463J32905p2839j29505J30169P9205k39521K1151n1690J29753K3736
7172i8742k2600q9061J75368r1120Q4874N8102j90122K84452J59528j66122k03603
7161i9046p810o3160l7873M1745q563J4449J43191P256q4041K23655J30885j80791
7149G9897n9819k4438L1034J87782p8007l41112M4856K40136L0011k08286j15219
7138b13165J72402N089L451R0519R2432L3230l19667q9372N7358J41430K04105
7127A77812k13581k16430k5738k71364j0526L06115K08676J40572J1964j24546
7117a7046J55144K05658j28364l57257k83559N410K86634r4198N2329L0247M1005
$$ plain form
7106 -103997 -166610 -188243 -144179 -85793 -9217 79115 166983 52897 -90357 -244598 -181811
7095 -181811 112554 122879 206927 294512 229940 67514 -99421 -22708 106871 48906 -123609
7084 -123609 -53497 -61461 -30633 106113 198748 77913 245357 239546 96465 -23826 2282
7073 2282 3746 26590 -71660 -127524 -53757 -82123 31667 -19027 -127773 -72910 223705 208520
7061 208520 115843 -1960 11770 35065 116717 65508 -175350 -379903 -174119 98382 172345
7050 172345 186961 292936 201266 142222 208452 239159 16991 129898 143345 -20921 15707
7039 15707 230327 275125 360893 361999 66828 52106 172780 197744 196581 138864 -32447
7028 -32447 -259109 -115516 -16126 53214 145293 72270 46298 12555 121862 -39717 -111282
$$ packed form
7106a03997o2613k1633M4064N8386P6576Q8332Q7868j14086j43254j54241O2787
7095a81811K94365J0325Q4048Q7585o4572j62426j66935P6713J29579n7965j72515
7084a23609P0112p964L0828J36746R2635j20835J67444n811j43081j20291K6108
7073B282J464K2844r8250n5864P3767k8366J13790n0694j08746N4863K96615j5185
7061B08520r2677j17803J3730K3295Q1652n1209k40858k04553K05784K72501P3963
7050A72345J4616J05975r1670n9044O6230L0707k22168J12907J3447j64266L6628
7039A5707K14620M4798Q5768J106k95171j4722J20674K4964j163n7717j71311
7028c2447k26662J43593R9390O9340R2079p3023k5972l3743J09307j61579p1565
$$ plain form
7017 -111282 139191 134626 323743 137564 35280 -127196 -319087 -332858 -11182 137782
7007 137782 -4304 -77217 -199771 -245179 -389008 -280534 -24736 -30231 -134929 -109121 -94799
6996 -94799 -107180 -292255 -311764 -357359 -76665 176967 109619 275065 499763 685157 748793
6985 748793 769505 834916 829908 697228 318035 87841 150009 142056 102320 135089 133447 49469
6973 49469 -23990 -194396 -110678 25678 -206080 -234983 -231517 -109893 3846 22798 -123574
6962 -123574 -97029 -124088 -282744 -217697 76799 27889 115059 160279 189861 156484 48399
6951 48399 -35781 -189112 -57151 -39833 -146470 -122084 -99197 -6246 99703 124315 299067
6940 299067 335970 216285 66330 31843 123129 137457 95024 -26760 14389 424120 409015
$$ packed form
7017a11282K50473m565J89117j86179j02284j62476j91891j3771L21676J48964
7007A37782j42086p2913j22554m5408j43829J08474K55798n495j04698K5808J4322
6996i4799j2381j85075j9509m5595K80694K53632o7348J65446K24698J85394O3636
6985G48793K0712O5411n008j32680l79193k30194O2168p953l9736L2769j642q3978
6973D9469p3459j70406Q3718J36356k31758k8903L466J21624J13739J8952j46372
6962a23574K6545k7059j58656O5047K94496m8910Q7170M5220K9582l3377j08085
6951D8399q4180j53331J31961J7318j06637K4386K2887R2951J05949K4612J74752
6940B99067L6903j19685j49955l4487R1286J4328m2433j21784M1149M09731j5105
$$ plain form
6929 409015 66460 33191 94118 148597 173302 83546 -51113 -155619 -269771 -246294 -167977
6918 -167977 -115402 -94022 -36998 72328 161682 132360 307943 71988 -178250 -336163 -506726
6907 -506726 -275138 -188212 -332387 -233927 -70320 -28630 -132973 -176097 -140067 -275060 -248102
6896 -248102 -180736 -131803 -234208 -377580 -339554 -225333 -163635 -185963 -169004 -154033 -325569
6885 -325569 -496930 -535336 -411905 -174533 -241090 -156628 -24032 34296 -50337 -79712 -23281
6874 -23281 53331 110562 -45725 -124259 -271201 -2508 64232 -97212 -167886 -24548 13896
6863 13896 126548 246113 299693 179670 -16063 21924 48834 -151450 -138106 17454 -17227
6852 -17227 -248145 -323554 -244742 391 -27021 -214240 -228243 -34240 -139274 -225963 -42893
$$ packed form
6929D09015l42555l3269O0927N4479K4705q9756j34659j04506j14152K3477P8317
6918a67977N2575K1380N7024J09326Q9354k9322J75583k35955k50238j57913j70563
6907e06726K31588Q6926j44175R8460J63607M1690j04343m3124L6030j34993K6958
6896b48102O7366M8933j02405j43372L8026J14221O1698k2328J6959J4971j71536
6885c25569j71361l8406J23431K37372o6557Q4462J32596N8328q4633k9375N6431
6874b3281P6612N7231j56287p8534j46942K68693O6740j61444p0674J43338L8444
6863A3896J12652J19565N3580j20023j95733L7987K6910k00284J3344J55560l4681
6852a7227k30918p5409P8812K45133k7412j87219j4003J94003j05034q6689J83070
$$ plain form
6841 -42893 94085 79576 52432 -101928 -125667 -87654 -139800 -160297 -159254 -131482 13196
6830 13196 -54817 18484 83537 -72898 -167047 -247916 -105226 -107850 -184537 -49871 -6476
6819 -6476 -203660 -346341 -146080 -91311 -115655 -190743 43884 -78555 -109336 -156402 -373073
6808 -373073 -152599 16824 -202241 -199002 -138381 -295481 -209920 -128396 -105228 -244593 -243023
6797 -243023 -4469 63461 216245 301637 275312 139051 -25198 3439 -16965 -99714 2871
6786 2871 -111648 -294376 -255672 -171517 -174114 -182842 64151 111581 53235 53383 -132287 140909
6774 140909 324326 326230 337944 114703 -3597 47680 -22093 -126452 28021 86137 127560
6763 127560 46811 50178 195331 252835 255883 88968 37329 86735 -25500 -69013 -34506
$$ packed form
6841d2893J36978j4509k7144j54360k3739L8013n2146k0497J043K7772J44678
6830A3196o8013P3301O5053j56435r4149q0869J42690k624p6687J34666M3395
6819f476j97184j42681K00261N4769k4344p5088K34627j22439l0781m7066k16671
6808c73073K20474J69423k19065L239O0621j57100Q5561Q1524K3168j39365J570
6797b43023K38554O7930J52784Q5392k6325j36261j64249K8637k0404q2749J02585
6786B871j14519j82728L8704Q4155k597q728K46993M7430n8346J48j85670K73196
6774A40909J83417J904J1714k23241j18300N1277o9773j04359J54473N8116M1423
6763A27560q0749L367J45153N7504L048j66915n1639M9406j12235m3513L4507
$$ plain form
6752 -34506 -116441 -202131 46786 -16817 -162281 -52547 9304 77185 105881 104657 180045
6741 180045 178843 -25257 -89903 -186726 -154404 -121317 -263504 -308468 -144854 -13528 98900
6730 98900 -93283 -243052 -52607 147315 226527 257241 282420 139444 189 -44697 -171692
6719 -171692 -151294 -32667 5675 -53214 -81901 733 102514 90722 99441 -234311 -434771
6708 -434771 -440467 -348413 26426 15649 -93526 48842 -2278 32303 146565 71710 41618
6697 41618 -35604 127136 288320 317666 76104 100607 30136 -159670 -300613 -526851 -596687
6686 -596687 -610066 -532316 -349204 -267411 -153639 -65362 205921 450299 291020 12864
6676 12864 -97355 -222313 -135452 86837 146790 191301 141966 150371 237205 393076 321271
$$ packed form
6752c4506q1935q5690K48917o3603j45464J09734O1851O7881K8696j224P5388
6741A80045j202k04100o4646r6823L2322L3087j42187m4964J63614J31326J12428
6730I8900j92183j49769J90445J99922P9212L0714K5179j42976j39255m4886j26995
6719a71692K0398J18627L8342n8889k8687Q2634J01781j1792Q719l33752k00460
6708d34771n696R2054L74839j0777j09175J42368n1120L4581J14262p4855l0092
6697D1618p7222J62740J61184K9346k41562K4503p0471j89806j40943k26238o9836
6686e96687j3379P7750J83112Q1793J13772Q8277K71283K44378j59279k78156
6676A2864j10219j24958Q6861K22289N9953M4511m9335Q405Q6834J55871p1805
$$ plain form
6665 321271 104638 -122182 -126202 -92182 -88171 -171594 -104709 65031 189855 322192 232920
6654 232920 69321 -28997 -115286 -94773 -130064 11111 237980 440760 405496 309849 557250
6643 557250 773744 861145 984269 1107587 1447272 1777387 2652052 4742551 6547119 5743960
6633 5743960 4896389 4437463 3676714 3027368 2651205 2882524 3146837 3587650 4221974 5164961
6623 5164961 6688302 8841749 11504790 14809525 19229768 27358022 43632405 82383640
6615 82383640 166833035 229186416 198541644 164668729 129603291 86796217 55002128
6608 55002128 37137228 26797376 19885464 14769035 11405347 9041702 7169630 5961566
6600 5961566 5203654 4714779 4269535 4062579 4001184 4629668 6193755 7680381 7069156
$$ packed form
6665C21271k16633k26820m020L4020M011q3423O6885J69740J24824J32337q9272
6654B32920j63599r8318q6289K0513l5291J41175K26869K02780l5264r5647K47401
6643E57250K16494Q7401J23124J23318L39685L30115Q74665K090499J804568q03159
6633E743960q47571m58926p60749o49346l76163K31319K64313M40813O34324R42987
6623E164961J523341K153447K663041L304735M420243Q128254J6274383L8751235
6615H2383640Q4449395O2353381l0644772l3872915l5065438m2807074l1794089
6608E5002128j7864900j0339852o911912n116429l363688k363645j872072j208064
6600E961566p57912m88875m45244k06956o1395O28484J564087J486626o11225
$$ plain form
6591 7069156 6118743 5069471 3866774 2908555 2298699 1756197 1422302 1221347 1059148
6582 1059148 1017397 1061870 1139972 905052 830046 673484 451808 588783 655374 587772 396638
6571 396638 331919 447262 542920 623612 666378 787152 810436 866021 641447 580633 415523
6560 415523 496875 645448 651384 523616 674809 810493 829244 885772 909882 659121 568342
6549 568342 380934 92590 -280286 -319988 -254284 -158586 143939 400917 509687 337876
6539 337876 307900 160613 177424 333681 226614 157919 74987 -77512 -214185 -301473 -67018
6528 -67018 4639 -81371 47003 62108 -53063 86973 202421 13352 -226028 -26801
6518 -26801 303693 665704 512504 190874 153045 232864 177421 104875 53669 88995 129190
$$ packed form
6591G069156r50413j049272j202697r58219o09856n42502l33895k00955j62199
6582A059148m1751M4473P8102k34920p5006j56562k21676J36975O6591o7602j91134
6571C96638o4719J15343R5658Q0692M2766J20774K3284N5585k24574o0814j65110
6560D15523Q1352J48573N936j27768J51193J35684J8751N6528K4110k50761r0779
6549E68342j87408k88344l72876l9702O5704R5698L02525K56978J08770j71811
6539C37876k9976j47287J6811J56257j07067o8695q2932j52499j36673q7288K34455
6528f7018P1657q6010J28374J5105j15171J40036J15448j89069k39380J99227
6518b6801L30494L62011j53200l21630l7829P9819n5443p2546n1206L5326M0195
$$ plain form
6507 129190 61782 60400 161944 170613 97896 -119434 -266634 -151915 -67605 -203543 -255355
6496 -255355 23900 14512 190794 230564 235047 176323 319603 226103 220805 28651 -151481
6485 -151481 -279311 -89201 68461 -9521 16086 35568 9037 197176 135816 151616 287644
6474 287644 264927 420154 426451 301122 148196 87914 142003 69849 31483 -109506 -13909
6463 -13909 199169 138989 129351 173929 347840 341444 187619 231140 255424 73916 168869
6452 168869 281265 285670 48415 -111875 -275518 -251380 -229643 -58873 198948 141217 -1654
6441 -1654 -62001 -73047 62295 40931 -81203 96600 134036 206475 90010 -154461 -119373
6430 -119373 -102440 -62097 -112912 -167260 -196662 -60565 -44598 33090 149636 76344 165561
$$ packed form
6507A29190o7408j382J01544Q669p2717k17330j47200J14719Q4310j35938n1812
6496b55355K79255r388J76282L9770M483n8724J43280r3500n298j92154j80132
6485a51481j27830J90110J57662p7982K5607J9482k6531J88139o1360J5800J36028
6474B87644k2717J55227O297j25329j52926o0282N4089p2154l8366j40989R5597
6463a3909K13078o0180r638M4578J73911o396j53825M3521K4284j81508R4953
6452A68869J12396M405k37255j60290j63643K4138K1737J70770K57821n7731j42871
6441a654o0347j1046J35342k1364j22134J77803L7436P2439j16465k44471L5088
6430a19373J6933M0343n0815n4348k9402J36097J5967P7688J16546p3292Q9217
$$ plain form
6419 165561 37713 5102 -2247 -70657 52843 26048 -90704 54141 165292 -102327 -142634
6408 -142634 50530 211650 264756 209574 432011 451769 397847 301137 131613 271848 330750
6397 330750 402662 442409 367490 275123 238026 122517 96007 -11569 -49140 -35524 67737
6386 67737 -162084 -169481 -100927 -58120 -49965 -124263 -199357 -198668 -121006 134294 218294 319379
6374 319379 285481 297643 108486 -25763 -267294 -167272 -11229 148868 151286 258984
6364 258984 282165 310231 315786 358480 400627 437618 466304 586724 433562 421879 232098
6353 232098 170333 272491 284790 298442 401481 423477 592896 569442 277519 46453 125282
6342 125282 358164 347896 240579 78230 -137563 -296751 -238161 -28922 -107673 -374350
$$ packed form
6419A65561j27848l2611p349o8410J23500k6795j16752J44845J11151k67619m0307
6408a42634J93164J61120N3106n5182K22437J9758n3922r6710j69524J40235N8902
6397C30750P1912L9747p4919r2367l7097j15509k6510j07576l7571J3616J03261
6386F7737k29821p397O8554M2807Q155p4298p5094O89P7662K55300Q4000J01085
6374C19379l3898J2162j89157j34249k41531J00022J56043J60097K418J07698
6364B58984K3181K8066N555M2694M2147L6991K8686J20420j53162j1683j89781
6353B32098o1765J02158J2299J3652J03039K1996J69419k3454k91923k31066P8829
6342A25282K32882j0268j07317j62349k15793j59188N8590K09239p8751k66677
$$ plain form
6332 -374350 -281292 -213275 -98816 -38213 -174817 -246128 -192915 -114761 -141658 -128710 -365254
6321 -365254 -299947 107030 246095 49231 -190315 -160707 -133006 -180869 -325855 -333353 -378266
6310 -378266 -304923 -244013 -274868 -213105 -88874 74850 93335 105468 184462 145890 43129
6299 43129 31860 21997 -5293 -151481 -30789 -10407 -164139 -222556 -232796 -218641 57465
6288 57465 -6980 -12914 79706 -23398 -40303 69673 34009 17729 -50268 -135882 -53634 -32889
6276 -32889 -100751 79016 104762 43270 91377 163510 185974 218025 136658 35057 -35716
6265 -35716 -10693 32473 22864 -95270 -91441 -63620 164253 255004 248003 106802 -31254 -213611
6253 -213611 -166556 -125744 -98458 9664 129124 263322 365848 247331 -1091 169465
$$ packed form
6332c74350R3058O8017J14459O0603j36604p1311N3213P8154k6897J2948k36544
6321c65254O5307M06977J39065j96864k39546K9608K7701m7863j44986p498m4913
6310c78266P3343O0910l0855O1763J24231J63724J8485J2133P8994l8572j02761
6299D3129j1269r863k7290j46188J20692K0382j53732n8417j0240J4155K76106
6288E7465o4445n934R2620j03104j6905J09976l5664j6280o7997q5614Q2248K0745
6276c2889o7862J79767K5746o1492M8107P2133K2464L2051q1367j01601p0773
6265c5716K5023M3166r609j18134L829K7821K27873R0751p001j41201j38056j82357
6253b13611M7055M0812K7286J08122J19460J34198J02526j18517k48422J70556
$$ plain form
6243 169465 355476 371967 344104 421992 594393 653591 661913 783078 837213 768757 765862
6232 765862 631864 526350 611922 676707 634583 562619 346984 309837 313320 332729 444484
6221 444484 466019 334547 204682 164027 243698 -102287 -368667 -267925 -200234 -125846 -227967
6210 -227967 -320601 -333787 -129184 -90023 -250468 -216457 -161939 -167832 10867 117135 96491
6199 96491 -11757 82410 211236 243316 -102110 -280842 -344748 -218521 -404322 -717621
6189 -717621 -675630 -524810 -248025 -93379 -87308 -170192 -104753 -34607 -87710 -58470 11782
6178 11782 3447 97318 83536 -63858 -241539 -258897 -251808 -247152 46257 92694 -131101 -142588
6166 -142588 -48568 -96983 -281047 -255069 -130455 170688 438306 443929 54155 -137281 -22033
$$ packed form
6243A69465J86011J6491k7863P7888J72401N9198Q322J21165N4135o8456k895
6232G65862j33998j05514Q5572O4785m2124p1964k15635l7147L483J9409J11755
6221D44484K1535j31472j29865m0655P9671l45985k66380J00742O7691P4388j02121
6210b27967r2634j3186K04603L9161j60445L4011N4518n893J78699J06268k0644
6199I6491j08248R4167J28826L2080l45426j78732o3906J26227j85801l13299
6189g17621M1991J50820K76785J54646O071q2884O5439P0146n3103K9240P0252
6178A1782q335R3871j3782j47394j77681j7358P089M656K93409M6437k23795j1487
6166a42588R4020m8415j84064K5978J24614L01143K67618N623l89774j91436J15248
$$ plain form
6155 -22033 -48448 -112563 -190898 -144587 -134845 -192942 -126173 28830 100019 13879 -39255 -62937
6143 -62937 -44355 219621 235359 143465 226509 90520 42625 149212 197104 281777 126139
6132 126139 -4824 -153824 -329736 -439080 -96102 327342 258198 166260 348626 311997
6122 311997 301901 184796 128489 -82621 -124940 24485 138338 183880 241082 213518 -92716
6111 -92716 -78495 99208 146347 89978 168159 163011 154898 160443 305710 317148 270892 279629
6099 279629 246740 118722 -46637 -181731 -218702 -336268 -157092 -115510 -77967 -39816 35725
6088 35725 122390 194785 130484 -24477 141961 239004 -12609 -276858 -329601 -67983 33016
6077 33016 -71285 -207704 -182574 -115451 -193589 -240600 -210917 -75706 -292153 -232780 -23768
$$ packed form
6155b2033k6415o4115p8335M6311R742n8097O6769J55003P1189q6140n3134k3682
6143f2937J8582K63976J5738r1894Q3044j35989m7895J06587M7892Q4673j55638
6132A26139j30963j49000j75912j09344L42978M23444o9144r1938J82366l6629
6122C11997j0096j17105n6307k11110m2319J49425J13853M5542N7202k7564l06234
6111i2716J4221J77703M7139n6369P8181n148q113N545J45267J1438m6256Q737
6099B79629l2889j28018j65359j35094l6971j17566J79176M1582L7543L8151P5541
6088C5725Q6665P2395o4301j54961J66438R7043k51613k64249n2743K61618J00999
6077C3016j04301j36419K5130O7123p8138m7011K9683J35211k16447N9373K09012
$$ plain form
6066 -23768 68631 137060 45579 88654 45551 -36503 -170758 -70748 -149622 -180461 -273211
6055 -273211 -306979 -339178 -240897 -188913 -202556 -212216 -210908 -89642 137134 239235 70239
6044 70239 -34796 138711 233237 152598 34894 -172850 -237081 -233391 -279021 56366 313410
6033 313410 404749 231615 2483 -10569 -103244 -28221 -10290 -207717 -185697 -119630 -35625
6022 -35625 -77602 -144651 112115 128633 169462 34108 77570 213231 324840 42974 -115365
6011 -115365 61744 99986 27118 62037 131185 71000 -189038 -172439 67536 198589 126731
6000 126731 -15990 -88893 110941 137379 110916 185111 182590 49970 -21175 115891 215562
5989 215562 187115 126056 77410 -34612 52531 73072 -214073 -168050 103293 232443 207053
$$ packed form
6066b3768R2399O8429r1481M3075m3103q2054j34255J00010p8874l0839r2750
6055b73211l3768l2199R8281N1984j3643r660J308J21266K26776J02101j68996
6044G0239j05035J73507R4526q0639j17704k07744o4231L690m5630L35387K57044
6033C13410R1339j73134k29132j3052r2675P5023J7931j97427K2020O6067Q4005
6022c5625m1977o7049K56766J6518M0829j35354M3462J35661J11609k81866j58339
6011a15365J77109L8242p2868L4919O9148o0185k60038J6599K39975J31053p1858
6000A26731j42721p2903J99834K6438k6463P4195k521j32620p1145J37066R9671
5989B15562k8447o1059m8646j12022Q7143K0541k87145M6023K71343J29150k5390
$$ plain form
5978 207053 83054 35056 -41580 38865 16957 -68087 7745 -1008 -207005 -131159 -273363
5967 -273363 -520914 -276768 46942 16542 -142241 -78698 -11747 -149602 -209365 -107640
5957 -107640 131761 333408 411633 206623 -35603 -37892 -85890 -105252 -118941 -54530 -17378
5946 -17378 -122763 -108835 -231656 -330877 -328983 -384211 -61140 -170245 -263232 -301639 -182381
5935 -182381 -62701 -81960 -93563 -84560 -127142 -72272 -36668 113545 156123 68776 -134849
5924 -134849 -140160 -34689 -242351 -271098 -103561 6218 57523 138899 279189 204630 -20576
5913 -20576 -231644 -180291 -27827 33349 81235 58287 106522 -71770 -126885 10266 85386
5902 85386 -135384 -146415 8831 63415 35793 71755 271113 258976 280336 426918 322765
$$ packed form
5978B07053j23999m7998p6636Q0445k1908q5044P5832q753k05997P5846j42204
5967b73363k47551K44146L23710l0400j58783O3543O6951j37855n9763J01725
5957a07640K39401K01647P8225k05010k42226k289m7998j9362j3689O4411L7152
5946a7378j05385J3928j22821r9221J894n5228L23071j09105r2987l8407J19258
5935a82381J19680j9259j1603R003m2582N4870L5604J50213M2578q7347k03625
5924a34849n311J05471k07662k8747J67537J09779N1305Q1376J40290p4559k25206
5913b0576k11068N1353J52464O1176M7886k2948M8235j78292n5115J37151P5120
5902H5386k20770j1031J55246N4584k7622L5962J99358j2137K1360J46582j04153
$$ plain form
5891 322765 47877 -184717 -412128 -394912 -214597 -216370 -292231 -223312 -165011 -54585 -84633
5880 -84633 -323693 -332439 -179704 -35879 48164 -87694 -201710 -189544 -160788 -100318 -171563
5869 -171563 -46428 128359 -54413 -319013 -204562 -106381 23327 47413 72903 123093
5859 123093 110993 45944 23963 122506 -84184 -112645 -242365 -395953 -170932 165384 186481
5848 186481 126338 137833 158252 55082 81985 91805 78475 222184 442939 330752 219140
5837 219140 302888 312856 493689 417464 261314 209036 288805 84267 91648 190820 71061
5826 71061 -62795 -184969 -118892 -260205 -298482 -185251 -31345 25423 215826 82377
5816 82377 88779 222172 345617 320411 234289 169371 113067 30197 -147686 -98268 52715
$$ packed form
5891C22765k74888k32594k27411J7216J80315j773p5861O8919N8301J10426l0048
5880h4633k39060q746J52735J43825Q4043j35858j14016J2166K8756O0470p1245
5869a71563J25135J74787j82772k64600J14451R8181J29708K4086K5490N0190
5859A23093j2100o5049k1981R8543k06690k8461j29720j53588K25021L36316K1097
5848A86481o0143J1495K0419j03170K6903R820j3330J43709K20755j12187j11612
5837B19140Q3748R968J80833p6225j56150n2278P9769k04538P381R9172j19759
5826G1061j33856j22174O6077j41313l8277J13231J53906N6768J90403j33449
5816H2377O402J33393J23445k5206q6122o4918n6304q2870j77883M9418J50983
$$ plain form
5805 52715 177589 227441 239835 380057 276931 51913 8903 32796 58291 302474 362363
5794 362363 143712 119993 122577 84586 142886 72928 8852 -55406 -159849 -341320 -205185
5783 -205185 94757 273733 191292 51765 -113581 -136602 -64854 -84233 -297345 -271806 -109546
5772 -109546 -42808 -49613 64085 122871 129365 87503 10275 93606 54219 5503 -102462 -144050
5760 -144050 -43577 -136343 -150465 -216940 -235143 -104631 -76971 41037 64010 40784 86128
5749 86128 -23378 -107416 -33637 107315 -24172 141542 349671 265831 276534 405982 395565
5738 395565 245694 94393 -30170 -83519 17660 126897 244674 460485 395622 496712
5728 496712 692945 625900 355535 166150 166274 5485 90307 408866 417782 342108 68452
$$ packed form
5805E2715J24874M9852J2394J40222j03126k25018m3010K3893K5495K44183N9889
5794C62363k18651k3719K584l7991N8300o9958o4076o4258j04443j81471J36135
5783b05185K99942J78976q2441j39527j65346k3021P1748j9379k13112K5539J62260
5772a09546O6738o805J13698N8786O494m1862p7228Q3331l9387m8716j07965m1588
5760a44050J00473r2766j4122o6475j8203J30512K7660J18008K2973k3226M5344
5749H6128j09506q4038P3779J40952j31487J65714K08129q3840J0703J29448j0417
5738C95565j49871j51301j24563n3349J01179J09237J17777K15811o4863J01090
5728D96712J96233o7045k70365j89385J24j60789Q4822L18559Q916p5674k73656
$$ plain form
5717 68452 50078 175236 142660 73199 -59557 -382246 -312569 -152428 -97473 -106084 103133
5706 103133 338783 263805 120157 102377 68872 41728 271434 346983 376056 245016 229627
5695 229627 197729 47757 62575 76970 272086 381054 288789 230547 137478 -81833 5871
5684 5871 -55063 14345 167901 223074 -71945 -136163 -126373 -292813 -128291 -15410 -141623
5673 -141623 -163114 62872 103094 -151900 45708 48414 -28780 -96260 -293375 -164878 -254601
5662 -254601 -207381 -145358 -27655 123173 239945 162055 122679 210181 235294 229466 -24812
5651 -24812 -255890 -378479 -370330 -504363 -191106 -84498 -155686 -84436 -236344 -185242 136711
5640 136711 293109 260554 123973 58655 -105875 -85321 197297 235587 237733 321890 40460
$$ packed form
5717F8452j8374J25158l2576o9461j32756l22689O9677J60141N4955q611K09217
5706A03133K35650p4978j43648j7780l3505k7144K29706P5549K9073j31040j5389
5695B29627l1898j49972J4818J4395J95116J08968r2265n8242r3069k19311Q7704
5684E871o0934O9408J53556N5173k95019o4218R790j66440J64522J12881j26213
5673a41623k1491K25986M0222k54994J97608K706p7194o7480j97115J28497q9723
5662b54601M7220O2023J17703J50828J16772p7890l9376Q7502K5113n828k54278
5651b4812k31078j22589Q149j34033L13257J06608p1188P1250j51908N1102L21953
5640A36711J56398l2555j36581o5318j64530K0554K82618L8290K146Q4157k81430
$$ plain form
5629 40460 -37022 157354 186798 209742 100975 7312 -170636 -366706 -355597 -233805 -82014
5618 -82014 -75418 -407586 -455257 -16077 168163 262242 164356 144917 44288 -28005 51674
5607 51674 35 -148839 -52589 -3916 -107300 3493 221491 161779 208122 290475 181635
5596 181635 -29597 -185427 -43795 79079 18747 45247 -37169 -118962 -664 -33567 -145179
5585 -145179 -128817 -122665 -106806 3970 -6056 -88439 -217828 -307776 -178780 -122721 39486
5574 39486 105955 128031 96545 -82959 -109897 -164304 -67503 101208 48042 -206493 -266309
5563 -266309 -171385 -101374 -143835 -230902 -340620 -197230 -83246 -18951 -90284 -65507 37786
5552 37786 104096 97556 30065 110313 237286 264774 261810 193502 193083 125088 89171 181769
$$ packed form
5629D0460p7482J94376K9444K2944j08767r3663j77948j96070J1109J21792J51791
5618h2014O596l32168m7671M39180J84240R4079r7886j9439j00629p2293P9679
5607E1674n1639j48874R6250M8673j03384J10793K17998n9712M6343Q2353j08840
5596A81635k11232j55830J41632J22874o0332K6500q2416q1793J18298l2903j11612
5585a45179J6362O152J5859J10776j0026q2383j29389q9948J28996N6059J62207
5574C9486O6469K2076l1486j79504k6938n4407R6801J68711n3166k54535n9816
5563b66309R4924P0011m2461q7067j09718J43390J13984O4295p1333K4777J03293
5552C7786O6310o540o7491Q0248J26973K7488k964o8308m19o7995l5917R2598
$$ plain form
5540 181769 216571 126557 -239648 -169399 21063 197966 269457 267885 19500 -47778 -70376
5529 -70376 -125087 -39589 87987 65542 -11793 56471 124156 113396 -55343 -147057 -287575
5518 -287575 -130991 -203210 -365960 -304063 -182779 -224604 -580502 -656654 -501830 -272016
5508 -272016 -64126 139691 202544 57929 3403 58044 -58454 -104779 -28842 -21456 -47681
5497 -47681 -57162 23218 87828 49365 82488 29228 89858 122776 22656 -45270 164905 107849
5485 107849 12087 135410 274114 112982 17423 14196 72045 -6683 -204454 -363675 -201803
5474 -201803 -164096 -231929 -334411 -358793 -321307 -352867 -170590 -187896 -206736 -281967 -184984
5463 -184984 -122265 16734 75016 184238 203263 106301 131546 30044 71466 -11374 -62414
$$ packed form
5540A81769L4802r0014l66205P0249J90462J76903P1491j572k48385o7278k2598
5529g0376n4711Q5498J27576k2445p7335O8264O7685j0760j68739r1714j40518
5518b87575J56584p2219j62750O1897J21284m1825l55898p6152J54824K29814
5508b72016K07890K03817O2853j44615n4526N4641j16498m6325P5937P386k6225
5497d7681r481Q0380O4610l8463L3123n3260O0630L2918j00120o7926K10175n7056
5485A07849r5762J23323J38704j61132r5559l227N7849p8728j97771j59221J61872
5474b01803L7707o7833j02482k4382L7486l1560J82277j7306j8840p5231R6983
5463a84984O2719J38999N8282J09222J9025r6962K5245j01502M1422q2840n1040
$$ plain form
5452 -62414 -306936 -422204 -137011 -84389 13599 -13754 -149295 -268054 -145997 -193913 -287560
5441 -287560 -136758 -12260 109375 244180 297041 50273 -105475 -81037 44568 113107
5431 113107 199835 212079 113624 -181276 -77658 -25491 73672 224236 160616 267613 267819
5420 267819 -67153 -225487 -235874 -282930 -164443 -14116 203730 336754 407386 334348
5410 334348 -10814 -110674 -70909 181709 156322 199497 342557 442603 434886 312862 433934
5399 433934 163105 135027 206881 45685 154203 278409 250795 139139 -17450 -284595
5389 -284595 -199997 31523 23266 -175553 -99770 72704 34733 -88486 -57733 -143219 -95792
5378 -95792 -131557 -248076 -210431 -203991 -124547 -46922 -181735 -69173 54470 101014 215999
$$ packed form
5452f2414k44522j15268K85193N2622R7988k7353j35541j18759J22057m7916r3647
5441b87560J50802J24498J21635J34805N2861k46768j55748K4438J25605O8539
5431A13107Q6728J2244r8455k94900J03618N2167R9163J50564o3620J06997K06
5420B67819l34972j58334j0387m7056J18487J50327K17846J33024P0632p3038
5410C34348l45162r9860L9765K52618k5387M3175J43060J00046p717j22024J21072
5399D33934k70829k8078P1854j61196J08518J24206k7614j11656j56589k67145
5389b84595Q4598K31520q257j98819P5783J72474l7971j23219L0753q5486M7427
5378i5792l5765j16519L7645O440P9444P7625j34813J12562J23643M6544J14985
$$ plain form
5367 215999 405919 497046 343812 331863 424569 295280 108349 136411 66287 -120072 -288753
5356 -288753 -90023 130973 188746 45381 -100309 -123557 43150 -107490 -276067 -109827
5346 -109827 -78289 -141763 -120997 -31025 -33364 -87200 120133 173390 171185 30914 34847 307449
5334 307449 215887 69594 158676 113661 173455 57580 128473 134313 71971 -194779 -325194
$$ packed form
5367B15999J89920R1127j53234j1949R2706j29289j86931K8062p0124j86359j68681
5356b88753J98730K20996N7773j43365j45690k3248J66707j50640j68577J66240
5346a09827L1538o3474K0766Q9972k339n3836K07333N3257k205j40271L933K72602
5334C07449r1562j46293Q9082m5015N9794j15875P0893N840o2342k66750j30415
$$ [...]
##END NTUPLES=NMR SPECTRUM
##END=
