##TITLE=Analysis number 315879
Compound Code spb 07277
Project Code adrs
Chemist Name fudan
##JCAMPDX= 6.0         $$ Bruker NMR JCAMP-DX V2.0
##DATA TYPE= NMR SPECTRUM
##DATA CLASS= NTUPLES
##ORIGIN= Bruker BioSpin GmbH
##OWNER= NMR
$$ XWIN-NMR		Version 3.5
$$ Tue Dec  6 14:24:03 2005 GMT Standard Time (UT+0h)  MAYBRIDGE\NMR@NMR_250MHZ
##.OBSERVE FREQUENCY= 250.131544655141
##.OBSERVE NUCLEUS= ^1H
##.ACQUISITION MODE= SIMULTANEOUS (DQD)
##.ACQUISITION SCHEME= undefined
##.AVERAGES= 16
##.DIGITISER RES= 18
##SPECTROMETER/DATA SYSTEM= dpx250
##.PULSE SEQUENCE= zg30
##.SOLVENT NAME= CDCl3
##.SHIFT REFERENCE= (INTERNAL, CDCl3, 0, 16.4587)
##AUDIT TRAIL= $$ (NUMBER, WHEN, WHO, WHERE, WHAT)
$$ ##TITLE= Audit trail, XWIN-NMR		Version 3.5
$$ ##JCAMPDX= 5.01
$$ ##ORIGIN= Bruker BioSpin GmbH
$$ ##OWNER= NMR
$$ C:\u/data/dgb/nmr/ADRS/13510/pdata/1/auditp.txt
$$ ##AUDIT TRAIL=  $$ (NUMBER, WHEN, WHO, WHERE, WHAT)
(   1,<2005-12-06 14:23:39.62 +000>,<MAYBRIDGE\NMR>,<NMR_250MHZ>,
      <created by zg, POWCHK disabled, PULCHK disabled
       configuration hash MD5:
       62 19 C7 07 E1 42 D1 B7 37 6C 3D D0 77 39 F9 E6
       data hash MD5: 64K
       91 C0 82 52 70 73 E9 AB 57 A4 12 1D 3E 08 28 58>)
(   2,<2005-12-06 14:23:52.92 +000>,<MAYBRIDGE\NMR>,<NMR_250MHZ>,
      <Start of raw data processing
       ef LB = 0.3 FT_mod = 6 PKNL = 1 SI = 32K 
       data hash MD5: 32K
       A2 9C AB 57 9C 2D B1 8C 73 DA 0B B9 8D D0 68 20>)
(   3,<2005-12-06 14:23:54.88 +000>,<MAYBRIDGE\NMR>,<NMR_250MHZ>,
      <apk 
       data hash MD5: 32K
       A9 73 DB EC 46 EA 64 1F 4A 78 0A 2A FE 7C 27 DF>)
(   4,<2005-12-06 14:23:56.01 +000>,<MAYBRIDGE\NMR>,<NMR_250MHZ>,
      <abs ABSG = 5 
       data hash MD5: 32K
       93 8B 2F 97 61 93 F1 8A DF F2 7B CA 78 FC FA BC>)
$$ ##END=
$$ 
$$ hash MD5
$$ 79 E8 58 52 F7 BC FE 81 AF 6D 35 71 F6 86 5B B3
##$RELAX= 
##$RELAX= 
##$RELAX= 
##$RELAX= 
##$RELAX= 
##$RELAX= 
##$RELAX= 
$$ Bruker specific parameters
$$ --------------------------
##$DU= <C:\u>
##$EXPNO= 13510
##$NAME= <ADRS>
##$PROCNO= 1
##$TYPE= <nmr>
##$USER= <dgb>
##$AMP= (0..31)
100 100 100 100 100 100 100 100 100 100 100 100 100 100 100 100 100 100 
100 100 100 100 100 100 100 100 100 100 100 100 100 100 
##$AQSEQ= 0
##$AQ_mod= 3
##$AUNM= <au_zg>
##$AUTOPOS= <13 >
##$BF1= 250.13
##$BF2= 250.13
##$BF3= 250.13
##$BF4= 250.13
##$BF5= 500.13
##$BF6= 500.13
##$BF7= 500.13
##$BF8= 500.13
##$BYTORDA= 1
##$CFDGTYP= 0
##$CFRGTYP= 5
##$CHEMSTR= <none>
##$CNST= (0..31)
1 1 145 1 1 1 1 1 1 1 1 1 1 1 1 1 1 1 1 1 1 1 1 1 1 1 1 1 1 1 1 1 
##$CPDPRG= <>
##$CPDPRG1= <>
##$CPDPRG2= <>
##$CPDPRG3= <>
##$CPDPRG4= <mlev>
##$CPDPRG5= <mlev>
##$CPDPRG6= <mlev>
##$CPDPRG7= <mlev>
##$CPDPRG8= <mlev>
##$CPDPRGB= <>
##$CPDPRGT= <>
##$D= (0..31)
0 1 0 0 0 0 0 0 0 0.06 0 0 0 0 0 0 0.0002 0 0 0 0 0 0 0 0 0 0 0 0 0 0 
0 
##$DATE= 1133879018
##$DBL= (0..7)
120 120 120 120 120 120 120 120 
##$DBP= (0..7)
150 150 150 150 150 150 150 150 
##$DBP07= 0
##$DBPNAM0= <>
##$DBPNAM1= <>
##$DBPNAM2= <>
$$ [...]
##$SUBNAM7= <"">
##$SUBNAM8= <"">
##$SUBNAM9= <"">
##$SW= 20.6930455092707
##$SWIBOX= (0..15)
0 0 3 0 0 0 0 0 0 0 0 0 0 0 0 0 
##$SW_h= 5175.983436853
##$TD= 65536
##$TD0= 1
##$TE= 294.16
##$TE2= 300
##$TE3= 300
##$TEG= 300
##$TL= (0..7)
0 120 120 120 120 120 120 120 
##$TP= (0..7)
150 150 150 150 150 150 150 150 
##$TP07= 0
##$TPNAME0= <>
##$TPNAME1= <>
##$TPNAME2= <>
##$TPNAME3= <>
##$TPNAME4= <>
##$TPNAME5= <>
##$TPNAME6= <>
##$TPNAME7= <>
##$TPOAL= (0..7)
0.5 0.5 0.5 0.5 0.5 0.5 0.5 0.5 
##$TPOFFS= (0..7)
0 0 0 0 0 0 0 0 
##$TUNHIN= 0
##$TUNHOUT= 0
##$TUNXOUT= 0
##$USERA1= <user>
##$USERA2= <user>
##$USERA3= <user>
##$USERA4= <user>
##$USERA5= <user>
##$V9= 5
##$VALIST= <valist>
##$VCLIST= <CCCCCCCCCCCCCCC>
##$VD= 0
##$VDLIST= <DDDDDDDDDDDDDDD>
##$VPLIST= <PPPPPPPPPPPPPPP>
##$VTLIST= <TTTTTTTTTTTTTTT>
##$WBST= 1024
##$WBSW= 4
##$XGAIN= (0..3)
0 0 0 0 
##$XL= 0
##$YL= 0
##$YMAX_a= 467878
##$YMIN_a= -443220
##$ZGOPTNS= <>
##$ZL1= 120
##$ZL2= 120
##$ZL3= 120
##$ZL4= 120
##$ABSF1= 16.4587
##$ABSF2= -4.234472
##$ABSG= 5
##$ABSL= 3
##$ALPHA= 0
##$AQORDER= 0
##$ASSFAC= 0
##$ASSFACI= 0
##$ASSFACX= 0
##$ASSWID= 0
##$AUNMP= <proc_1d>
##$AZFE= 0.1
##$AZFW= 0.1
##$BCFW= 0
##$BC_mod= 0
##$BYTORDP= 0
##$COROFFS= 0
##$CY= 12.5
##$DATMOD= 1
##$DC= 0
##$DFILT= <>
##$DTYPP= 0
##$F1P= 14.0000005364418
##$F2P= -0.99999901652339
##$FCOR= 0.5
##$FTSIZE= 32768
##$FT_mod= 6
##$GAMMA= 0
##$GB= 0
##$INTBC= 1
##$INTSCL= 1
##$ISEN= 128
##$LB= 0.3
##$LEV0= 0
##$LPBIN= 0
##$MAXI= 10000
##$MC2= 0
##$MEAN= 0
##$ME_mod= 0
##$MI= 0
##$NCOEF= 0
##$NC_proc= -2
##$NLEV= 6
##$NOISF1= 0
##$NOISF2= 0
##$NSP= 0
##$NTH_PI= 0
##$NZP= 0
##$OFFSET= 16.4587
##$PC= 1
##$PHC0= 82.59114
##$PHC1= 6.132229
##$PH_mod= 1
##$PKNL= yes
##$PPARMOD= 0
##$PSCAL= 4
##$PSIGN= 0
##$REVERSE= no
##$SF= 250.130015831985
##$SI= 32768
##$SIGF1= 0
##$SIGF2= 0
##$SINO= 400
##$SIOLD= 32768
##$SREGLST= <1H.CDCl3>
##$SSB= 0
##$STSI= 32768
##$STSR= 0
##$SW_p= 5175.98343685301
##$SYMM= 0
##$S_DEV= 0
##$TDeff= 65536
##$TDoff= 0
##$TI= <Analysis number 999999
Compound Code 99
Book Reference 9
Project Code 9>
##$TILT= no
##$TM1= 0
##$TM2= 0
##$TOPLEV= 0
##$USERP1= <user>
##$USERP2= <user>
##$USERP3= <user>
##$USERP4= <user>
##$USERP5= <user>
##$WDW= 1
##$XDIM= 32768
##$YMAX_p= 338204707
##$YMIN_p= -304888
$$ End of Bruker specific parameters
$$ ---------------------------------
##NTUPLES= NMR SPECTRUM
##VAR_NAME=  FREQUENCY,     SPECTRUM/REAL,   SPECTRUM/IMAG
##SYMBOL=    X,             R,               I
##VAR_TYPE=  INDEPENDENT,   DEPENDENT,       DEPENDENT
##VAR_FORM=  AFFN,          ASDF,            ASDF
##VAR_DIM=   32768,         32768,           32768
##UNITS=     HZ,            ARBITRARY UNITS, ARBITRARY UNITS
##FACTOR=    0.157963299565203, 1,           1
##FIRST=     4116.81493661073, 0,            0
##LAST=      -1059.16850024228, 0,           0
##MIN=       -1059.16850024228, -304888,     0
##MAX=       4116.81493661073, 338204707,    0
$$ Real data points
##PAGE= N=1
##DATA TABLE= (X++(R..R)), XYDATA
$$ [...]
19173A34103k3632l2557J4151K3236N623N121n216K798K289m140K5523J3034k3775
19160A36558k1418n951o207M027J6517J0786P284k146J3630R049j9541j7406J725
19147A26907J8663J6331l803j0875j7501k633j0744l186r51j2265L223K3298J4705
19134A41169J006r377j116o21j428K6739L911M535J1242J4851j1869j0419m129
19121A64494J554P433K2102O398j6613J0666L899r145j302o841K3019J5758R257
19108B30679J5137N472j4595J1376J3003m489J0984l222p629j186J6747Q268K1531
19095C02076j582p902R521J4733K7689K4147J7231J5007l803R765J3351L4122
19083D54355M9796N1187N5030M5779L0366J3051K9904M1513N9294N0084N3327
$$ plain form
19173 134103 110471 77914 92065 115301 120924 126045 120829 123627 125916 121776 147299 160333 136558
19160 136558 115140 109189 102982 107009 123526 134312 141596 139450 153080 162129 142588 125182 126907
19147 126907 145570 161901 158098 147223 129722 127089 116345 113159 112208 99943 103166 126464 141169
19134 141169 142175 132798 131682 131061 129633 156372 160283 164818 176060 190911 179042 168623 164494
19121 164494 166048 173481 195583 201981 185368 196034 199933 190788 189486 182645 205664 221422 230679
19108 230679 245816 251288 236693 248069 261072 256583 267567 264345 256716 255530 272277 280545 302076
19095 302076 300494 292592 302113 316846 344535 368682 385913 400920 397117 406882 420233 454355
19083 454355 504151 555338 610368 656147 686513 699564 729468 770981 830275 880359 933686
19072I33686N0154N4827R0040J03095J29247J50375J09524J00376J29206J81101
19062B031631K06725K77858L69325M68411O00602Q30794J172661J768015K821203
19053A0547225M636709O742222O279543K319347j468179k867083k876301l750764
19045A9562719m279726l063039j445792j23624J125786K724203M935451O165109
19037B5601087L741739l12231k793901l119165l477864m513965m204765k818136
19029H102799j738872j097855p54393n40880l66665k44442j79205j06902r5307
19020B978278j18686j03439q0548o0845l3161k1386P719O2733O7684M1042K7739
19009B767130P4219J26440J47403J87156K76166L82159M93539P08750J027277
$$ plain form
19072 933686 983840 1038667 1128707 1231802 1361049 1511424 1620948 1721324 1850530 2031631
19062 2031631 2238356 2516214 2885539 3353950 3954552 4785346 5958007 7726022 10547225
19053 10547225 15183934 21926156 28205699 30525046 29056867 26189784 23313483 19562719
19045 19562719 15282993 12219954 10774162 10650538 11776324 14500527 19435978 25601087
19037 25601087 29342826 29030595 26236694 23117529 19639665 15125700 10920935 8102799
19029 8102799 6363927 5266072 4511679 3970799 3604134 3359692 3180487 3073585 2978278
19020 2978278 2859592 2756153 2675605 2614760 2581599 2560213 2567932 2630665 2698349 2739391 2767130
19009 2767130 2841349 2967789 3115192 3302348 3578514 3960673 4454212 5162962 6190239
19000F190239J471797K246751L643154N945660P782573N690677R18005k498748
18992C1390108l241702l425643m557272m463979k778107j097457K63064J754982
18984A3843994L827426O310430O466660K632990j597528l465703l517232m340827
18976B0160210n202721m230165k736800j718027j113570p94786n76781l72638
18968C414722k14937o9509l1724r3462j65146j83678k12105k01198k00148j98526
18958A844289j83347j66709j44221j21090r8185q5155n6737m9634n8398k1983
18948H58830j0138k1633q2767q8944n6583n3842o8382p1107l9461l4841k3374
18937C07758j7153m8309k7984m750Q120n48k782j1469j8048m7477j0221J0092
$$ plain form
19000 6190239 7662036 9908787 13551941 19497601 27280174 32970851 33888856 31390108
18992 31390108 28148406 24722763 20165491 15701512 12923405 11825948 12089012 13843994
18984 13843994 17671420 23981850 30448510 33081500 31483972 28018269 24501037 20160210
18976 20160210 14957489 10727324 7990524 6272497 5158927 4364141 3787360 3414722
18968 3414722 3199785 3130276 3098552 3005090 2839944 2656266 2444161 2242963 2042815 1844289
18958 1844289 1660942 1494233 1350012 1228922 1130737 1045582 988845 939211 880813 858830
18948 858830 848692 827059 744292 655348 598765 544923 476541 405434 365973 331132 307758
18937 307758 290605 242296 214312 209562 217682 217134 214352 202883 184835 137358 127137 137229
18925A37229N619J5311j3840m1121j7697n096J1551M579l379j6185m696o378J2994
18912G8891M944n504j9021q172k324N531K795n179j5320j3548j6887j0059K8534
18899B4681K4255l162o774o19j2443q296r22r311N623q611j03M035m895Q669J3239
18884B5366J3058O874l80N170J657J2833K3251L0327N2426P3250Q0714O2002L6756
18871D23304J0508j3063n8851q6361o6935n5100n2237n0923l1165K432J1915J5470
18859D8994M058p585j2165p175o296M948J2524L90j0834q476k994R13m102Q509
18845B0709k886j2374l616Q084O642K5135j329J1132L271r415j2955K397q319
18832B6476j2874o845n667L007J504J7775K4413O468l90J1915N3553L8853J9276
$$ plain form
18925 137229 142848 158159 144319 103198 85501 80405 91956 96535 93156 76971 72275 65897 78891
18912 78891 83835 78331 59310 51138 48814 54345 57140 51961 36641 23093 6206 -3853 24681
18899 24681 48936 45774 39000 38381 25938 17642 16720 7409 13032 4421 4318 8353 3458 12127 25366
18884 25366 38424 45298 44918 50088 51745 64578 87829 118156 170582 243832 324546 386548 423304
18871 423304 433812 420749 361898 275537 208602 153502 101265 50342 19177 21609 33524 48994
18859 48994 53052 45467 33302 26127 19831 24779 37303 37693 26859 18383 15389 16302 12200 20709
18845 20709 17823 5449 1833 9917 16559 41694 40365 51497 54768 45353 32398 34795 26476
18832 26476 13602 6757 1090 4097 5601 23376 47789 54257 53867 65782 119335 158188 177464
18819A77464R466m256j2556m2643m3528k3180k9936j1055j7565O101r539j3463
18807a4690K1397K5629j1778J3119P35Q607o249j2254j3388M565P954q666l994
18794A0987L494j0460j6J3222J6384M250Q01R674J0118l583p0j3321k7278p713
18780F489N838K4277M445j4918L014q601o177k01L435J0244m717M067K0709Q840
18766E6744J6604L8483L8239J0724k3043j4060k0428k6269l3465j9296N36p486
18754A7283j3581j9890Q924J5601J0991N819n471K581j3021P674m525o368p47
18741E270O465Q176P694N986l860o113o628L697M916o436J1330k444Q88j7697
18727A1244l964k457J0146M80K653L113k2515j1632L411Q458k940J6227J8771
$$ plain form
18819 177464 186930 182674 170118 127475 83947 60767 30831 19776 2211 8312 -1227 -14690
18807 -14690 6707 32336 20558 33677 34412 43019 36770 24516 11128 15693 23647 14981 10987
18794 10987 14481 4021 4005 17227 33611 37861 38662 48336 58454 54871 54801 41480 14202 6489
18780 6489 12327 36604 41049 26131 29145 20544 14367 14166 17601 27845 23128 27195 47904 56744
18766 56744 73348 111831 150070 160794 137751 123691 103263 76994 43529 24233 24769 17283
18754 17283 3702 -16188 -7264 8337 19328 25147 19676 22257 9236 16910 12385 6017 5270
18741 5270 11735 19911 27605 33591 29731 23618 16990 20687 25603 19167 30497 28053 28941 11244
18727 11244 7280 4823 14969 15449 18102 21215 -1300 -12932 -9521 -1063 -4003 12224 30995
18714C0995N912j5457p344k037k5014K208K4883J3078j7393j8986k070J2705J0447
18701A1927j26j706j4748j0549P313K0265N438r171j3847j2144j49j163l700M778
18687a7582K2758p76m490q057q161n366Q535J6068J2446m912M70M785J0184m721
18673B1181n262j6700k219p649J7236J2604o098k109K0802p442j4431J0460p613
18660A2760j0867J2692J5665J1452j6282j8383j528m326j0795m057J1526j4874
18648a7017L672J8227J0689Q959N584P921j6278p841l55j209j989j1156N830J905
18634F942M363j4006k244J0598r021o29L4554M173k5289k000J252j0415j3433
18621a5155L896J7082j028l452q769J4069N15j4555m085r103m465R327M21J0510
$$ plain form
18714 30995 36907 21450 14106 12069 -12945 -10737 14146 27224 9831 -9155 -11225 1480 11927
18701 11927 11801 10095 -4653 -15202 -7889 12376 17814 8643 -5204 -17348 -17497 -18660 -22360 -17582
18687 -17582 5176 4400 -90 -8147 -16308 -21674 -13139 2929 15375 10463 10933 15718 25902 21181
18673 21181 15919 -781 -3000 -10649 6587 19191 13093 10984 31786 24344 9913 20373 12760
18660 12760 1893 14585 30250 41702 25420 7037 5509 1183 -9612 -13669 -2143 -17017
18648 -17017 -13345 4882 15571 24530 30114 38035 21757 13916 13561 12352 10363 -793 5037 6942
18634 6942 11305 -2701 -4945 5653 -3368 -3997 30557 34730 9441 7441 8693 -1722 -15155
18621 -15155 -11259 5823 4795 1343 -7426 6643 7158 -7397 -11482 -20585 -25050 -15723 -15302 -4792
18607d792R542M135J9951k0186k625J0965J0272n880j4508k0717J0646p704q173
18594a9074P449J9746j874J7802Q439O293j2006j4283q656J4385k487p682P848
18581A5900k168j3580l884J3995R517R109k0686j1505Q501K8755J2445O015K7769
18568H0183M8620M5324L6591K9952L5414K1719R806l894m5404m4314l5992l1905
18556A46100m0100k5216k5277r500J98L312r601o853j4195j6062k0182K0413K1575
18543B4612O287q87P02L82j650J240r771j2954m347j72l908R39N110J6356J2143
18528C4082O198o665j2981J283J5529q09J696J894O929L7547L9940L2179K0823
18515A77645R857j5565J6973R533J0007L2767K3830K0243K5395J8465J5383j2890
$$ plain form
18607 -4792 4750 8885 28836 8650 6025 16990 27262 21382 6874 -13843 -3197 -10901 -19074
18594 -19074 -11625 8121 6247 24049 32488 38781 26775 12492 3836 18221 15734 8052 15900
18581 15900 13732 152 -3732 10263 19780 28889 8203 -3302 5199 33954 46399 52414 80183
18568 80183 128803 174127 210718 240670 276084 297803 307609 303715 258311 213997 178005 146100
18556 146100 106000 80784 55507 46007 46205 49517 39916 33063 18868 2806 -17376 3037 24612
18543 24612 30899 30012 30714 31096 29446 30686 20915 7961 3614 3442 -466 473 5583 21939 34082
18528 34082 40280 33615 20634 21917 37446 36637 38333 40227 47156 84703 124643 156822 177645
18515 177645 187502 171937 188910 198443 208450 241217 265047 285290 310685 329150 344533 331643
18503C31643k0624k9285m8385m4158m9945k6854Q57q168j5210l364j5879j7178
18491E3450j9333o917J1422J340o14M030j784j5093j2874J368n067k874o22J1855
18477A8287j0471J1722Q237k946j2927K003O771p993q349P528K7312n672M696
18464C8198L5344L7625L7323L2362o114j6092j6450k0507k7019k4550o696L368
18452F6792j86J1802L9600M1470J6296J0332M994k0148k9659k1553k9325M016
18440I4431p352l1019j5371J2482l874r221p029o988j2681J3358N780J794L628
18427C7938j836j4807k2509L789J5769R746j2599o116m343P214J1911Q318r201
18414B3274j1827k068M352k789r071j485j774j10J7894J97j7162q126j629l966
$$ plain form
18503 331643 311019 281734 233349 189191 139246 112392 113249 105081 89871 86507 70628 53450
18491 53450 34117 27200 38622 39962 39348 43378 41594 26501 13627 14995 9928 7054 6432 18287
18477 18287 7816 19538 27775 24829 11902 13905 20676 12683 4334 11862 39174 33502 38198
18464 38198 73542 111167 148490 180852 174738 158646 142196 121689 94670 70120 63424 66792
18452 66792 66606 78408 118008 159478 175774 186106 191100 170952 141293 119740 90415 94431
18440 94431 87079 56060 40689 53171 49297 40076 33047 26059 13378 26736 32516 34310 37938
18427 37938 36102 21295 -1214 2575 18344 28090 15491 9375 5032 12246 24157 32475 23274
18414 23274 11447 9379 13731 10942 1871 386 -1388 -1498 16396 16593 -569 -8695 -10324 -14290
18400a4290J70J5475J1550J58J595j0646n329l138J280r41k89J0701R842m103
18386A2035J6812k807O267J7829L091k3977j4740j4210o588J6260J3030k034j7059
18373C909Q420o787j0541n976O973R711j572j6756o566J6487K8052p40P206J7323
18359D9143R418l3187p104r122l620K246n564j0393j0115R047J008k35N900Q950
18345F372l301P458Q785n598R637j636N203m189p989N487M089J0657q161j8791
18331H023j451o845p80J454r124l374j5807l029Q689O810J9950O713P594l476
18317A5347p762N053r940r491N414Q338P425J8327J0877R251p301j7659Q221J7444
18303E3544L406j2851k297k296j958j6583j4700O145O147R950l354P071J8729
$$ plain form
18400 -14290 -14120 1355 12905 13063 14658 4012 -1317 -4455 -3175 -4116 -4405 6296 16138 12035
18386 12035 28847 26040 32307 50136 53227 29250 14510 300 -6288 9972 23002 20968 3909
18373 3909 12329 5542 -4999 -10975 -4002 5709 4137 -12619 -19185 -2698 25354 24614 31820 49143
18359 49143 58561 25374 18270 9148 5528 7774 2210 -8183 -18298 -9251 -8243 -8478 -2578 6372
18345 6372 3071 10529 19314 13716 23353 21717 26920 22731 14742 20229 24318 34975 26814 8023
18331 8023 6572 -273 -1053 401 -8723 -12097 -27904 -30933 -22244 -15434 4516 11229 18823 15347
18317 15347 7585 12638 2698 -6793 -1379 6959 14384 32711 43588 52839 45538 27879 36100 53544
18303 53544 56950 44099 41802 39506 37548 20965 6265 12410 18557 28507 25153 32224 50953
18290E0953P019j7677j2058Q765J8764P123j1102k3913j982M746m647j6888J9409
18277B8512K3761L745M2j2535J1972j5161l2412P974O875O299L975j4675k6290
18264g918J318J1658J3092J7285j20n621m928J8944O790P090j1235o473j3593
18251B6289k504k201R766J8211J060o206M528J6599j1948m652q062j2002k9961
18238a083k9508r872N544J3846K0277M6648N6037J8513M379K0211l031m000k1461
18225A16500k2893L212K324k9612k802J5679J6690J9961m101j913k2851o179K822
18212H6837N163P299M414R59J4296j1069k3099m906j60j9748K0996J6886j9102
18199G8766j2706J720L623M343J8495J4297k487p150r04r012J2232N556k486m752
$$ plain form
18290 50953 57972 40295 28237 37002 55766 62889 51787 27874 25892 30638 25991 9103 28512
18277 28512 52273 56018 56060 43525 55497 40336 7924 15898 22773 29072 33047 18372 -7918
18264 -7918 -6600 5058 18150 35435 35315 29694 24766 43710 50500 57590 46355 39882 26289
18251 26289 23785 21584 31350 49561 50621 44415 48943 65542 53594 48942 40880 28878 -1083
18238 -1083 -30591 -40463 -34919 -21073 -796 45852 101889 120402 124781 144992 141961 137961 116500
18225 116500 93607 96819 99143 69531 66729 82408 99098 119059 114958 113045 90194 84015 86837
18212 86837 92000 99299 103713 104672 118968 107899 84800 79894 79734 59986 80982 97868 78766
18199 78766 66060 67780 71403 75746 94241 108538 106051 98901 97997 88985 101217 106773 104287 99535
18185I9535j5342l449j642j1174k925k980P173K8497J3121J6002K2551K5860J8430
18172A93657J6231J6874R704j4422k6152k075l331J3107J464j0688L312k912R913
18159B04682p379j42K987k7270O992L4256J5964J0740j1790r453p393m213j046
18146B06935J0083L1314J7322J6166J3010J1395j2746o664K5401J3177M450R180
18134C39023J9428J5728K2097L0010N554J4138L2855M3947M7988L7691L1490M7038
18122F86987O8836N1615O8519J20399J42971J68416J95990K18479K80992L74885
18112B378089M85647O91230J036641J667740K983072N497684P252375L457162
18104B5449640j122416l275224k562370k955676m650285l792403k143291j228561
$$ plain form
18185 99535 84193 80744 79102 67928 65003 62023 69196 97693 110814 126816 149367 175227 193657
18172 193657 209888 226762 236466 222044 195892 193817 190486 203593 205057 194369 197681 194769 204682
18159 204682 197303 197161 200148 172878 179870 214126 230090 240830 229040 219587 212194 207981 206935
18146 206935 217018 248332 265654 281820 294830 306225 293479 286815 312216 325393 329843 339023
18134 339023 358451 374179 396276 426286 431840 445978 478833 522780 570768 608459 639949 686987
18122 686987 755823 807438 875957 996356 1139327 1307743 1503733 1722212 2003204 2378089
18112 2378089 2863736 3554966 4591607 6259347 9242419 14740103 21992478 25449640
18104 25449640 24327224 21052000 18489630 15533954 10883669 7091266 4947975 3719414
18096C719414p34521m83459l38329k24097j63200j27041j02567j07572p4593m3763
18086A320272o9440p2024n9552l7576k3573j2371Q812J0877L1282M7993M0061
18075A184761N8345K9999N0343M5343K3369L1232N3113N9175L1666M9394P1383
18064A688123O2375Q2738J03094J10566J57667K26594K76888L65391M39467N65223
18054D078126P38737R45272J276709J781525K560894L734117N242358O894668
18046B7252406P906552P807607O261987L268109p5809l388624n642663o927822
18038C6461743p179666o480879n436702m130872k959008k073861j445556j003539
18030E751660p08655n37013m21052l29403k73449k02836j58229j07272p4563o6437
$$ plain form
18096 3719414 2984893 2501434 2163105 1939008 1775808 1648767 1546200 1438628 1364035 1320272
18086 1320272 1250832 1178808 1119256 1081680 1058107 1045736 1054548 1065425 1096707 1144700 1184761
18075 1184761 1243106 1273105 1323448 1368791 1392160 1423392 1476505 1535680 1567346 1616740 1688123
18064 1688123 1750498 1833236 1936330 2046896 2204563 2431157 2708045 3073436 3512903 4078126
18054 4078126 4816863 5762135 7038844 8820369 11381263 15115380 20357738 27252406
18046 27252406 35158958 42966565 49228552 52496661 52420852 49032228 43389565 36461743
18038 36461743 29282077 22801198 17364496 13233624 10274616 8200755 6755199 5751660
18030 5751660 5043005 4505992 4084940 3755537 3482088 3279252 3121023 3013751 2939188 2872751
18020B872751o1697n7062n4862o0250o8453o7012l9083l3988k5617m0987k1344
18009B342396j3641j9565J646O586O4342J21054J70086K18948K94500M05714N29128
17998D121194O63495Q93293J215805J738198K522751L627780N014633O425484
17990B6222633P064096O793133M983423K238093q65331l676752n496242o453266
17982C0809787o364821n647584m617687l426869k435195j668501j168670q27979
17974D652481o28433m71086l73439k96189k46885k19775j72352j41910j13438
17965A988974j18773j22012j25293j07123q0281n8619o6277r2270r0743q6450
17955A041133p2749p7182q0828o9104p1388o4684p2248n3797m2842j8679j9559
$$ plain form
18020 2872751 2811054 2753992 2699130 2638880 2570427 2503415 2464332 2430344 2404727 2363740 2342396
18009 2342396 2328755 2309190 2310836 2317422 2381764 2502818 2672904 2891852 3186352 3592066 4121194
17998 4121194 4784689 5677982 6893787 8631985 11154736 14782516 19797149 26222633
17990 26222633 33286729 40079862 45063285 47301378 46436047 42759295 37263053 30809787
17982 30809787 24444966 18797382 14179695 10752826 8317631 6649130 5480460 4652481
17974 4652481 4024048 3552962 3179523 2883334 2636449 2416674 2244322 2102412 1988974
17965 1988974 1870201 1748189 1622896 1515773 1435492 1376873 1310596 1218326 1127583 1041133
17955 1041133 968384 891202 810374 741270 669882 605198 532950 479153 436311 417632 398073
17944C98073m3410k5354k7577k7703j4874j7819p942q843r470k4122j6941K210
17932A76228p142r324j3327j9317l0133p419N255n751P894K2783k794k0861k3776
17919G2316j8355M390O632P410R450p268Q249R324K629k395j0037n896r441j5186
17905E1822m712M078m731j6392m549l261j563J3492j0504k507j4006k377J1460
17892A6250j0158j7128j1600k074R146o318J4187J1662j0116P472k105j0062n941
17879a6785n731J9874J3802o520j5837K033j167j0657j230p513j084l956m849
17866c9620O807j1557j906K3849o9j2337p213j3757m444n298L0861K5107J0942
17853A365O893L247K1321K3449L360J2657o526k3076m43j9080j1329R839j8561
$$ plain form
17944 398073 354663 329309 301732 274029 259155 241336 233394 224551 215081 190959 174018 176228
17932 176228 169086 159762 146435 127118 96985 89566 94821 89070 96964 119747 116953 96092 72316
17919 72316 53961 58351 64983 72393 81843 74575 82824 92148 94777 92382 82345 76449 67008 51822
17905 51822 47110 51188 46457 30065 25516 22255 20692 34184 23680 21173 7167 4790 16250
17892 16250 6092 -11036 -22636 -24710 -15564 -21882 -7695 3967 -6149 1323 -782 -10844 -16785
17879 -16785 -22516 -2642 11160 4640 -11197 -9164 -10331 -20988 -22218 -29731 -30815 -34771 -39620
17866 -39620 -32813 -44370 -46276 -22427 -22496 -34833 -42046 -55803 -60247 -65545 -34684 -9577 1365
17853 1365 8258 11505 32826 56275 59635 72292 65766 42690 42247 23167 11838 21677 3116
17840C116j5038j5562j3523J8454j503n845N226P243P647j1404O523J4822M426
17827D582M974l7096k9470Q82J4404R781M492J1260J1491M295j1893r71J797N280
17813f192R718R981k6840j1571J875l266p981j2449o755n252J5423R153J2743
17800b1413n281l585K2502K5542Q915J8306n910n549J4903k237j4009m100m026
17787B4058K1085m678n50L617P951M933j5280j7907j3351m826P084J0538P844
17774C0518K941k458j2807K0n611n212j0551L454J3309R138N076J3438o723Q224
17760D2756O996k3048k4448j7155j0891j8698L652O330J8850K6875j3034k651
17748d466K755r551K855k20J266K068M796P694O70Q642Q837p212j9058p376Q735
$$ plain form
17840 3116 -11922 -27484 -41007 -22553 -24056 -29901 -24675 -17432 -9785 -21189 -14666 156 4582
17827 4582 9556 -27540 -57010 -56128 -41724 -31943 -27451 -16191 -4700 -405 -12298 -13269 -11472 -6192
17813 -6192 3526 13507 -13333 -24904 -23029 -26295 -34276 -46725 -53480 -58732 -43309 -34156 -21413
17800 -21413 -26694 -30279 -7777 17765 26680 44986 39076 33527 48430 46193 32184 28084 24058
17787 24058 45143 40465 39915 43532 51483 56416 41136 23229 9878 5052 12136 22674 30518
17774 30518 33459 31001 18194 18214 12603 7391 -3160 294 13603 22741 27817 41255 34532 42756
17760 42756 49752 26704 2256 -14899 -25790 -44488 -40836 -34506 -15656 11219 -1815 -4466
17748 -4466 -1711 -11262 -8407 -8627 -7361 -5293 -497 7197 7867 16509 25346 18134 -924 -8300 435
17733D35K1642J1k7247q588O711p42j5183N801J3014j286q807J649L704m589q829
17718b2304q89J7313J1335j1612l253R669r488j1778p252J7476J1434j066M736
17705D321J1266R890k7273j9906J2277L395k735J486j3911O14K0119l22M55k290
17691b614j0148O752O224l817J1085J3589N982j2351k3340J438J0117j8548j1795
17678b7426r31Q015R361N451j0151j2711J35J1958j419K427J1175J1200J2796
17665A9880l40j0101p575J72k332o9K028L966l777l149l492m295l532R150N386
17650A920J9871J451n591k714j9980j1035N623J6316J2106o966j2060r329q189
17637a8577O456K0097J5092P181j877j8766o629N509p999j4032k445J0400q851
$$ plain form
17733 435 22077 22088 -5159 -13747 -7036 -7778 -22961 -17160 -4146 -5432 -14239 -12590 -8886 -13475 -22304
17718 -22304 -23193 -5880 5455 -6157 -9410 259 -9229 -21007 -28259 -10783 651 -415 4321
17705 4321 15587 25477 -1796 -21702 -9425 -6030 -8765 -7279 -21190 -20576 -457 -779 -324 -2614
17691 -2614 -12762 -6010 214 -3603 7482 21071 27053 14702 -8638 -7200 2917 -15631 -27426
17678 -27426 -28357 -20342 -10981 -5530 -15681 -28392 -28257 -16299 -17718 -15291 -4116 7084 19880
17665 19880 19540 9439 1864 2036 -296 -365 1663 5629 1852 -1297 -4789 -9084 -12616 -3466 1920
17650 1920 21791 23242 17651 14937 -5043 -16078 -10455 5861 17967 11001 -1059 -10388 -18577
17637 -18577 -12121 7976 23068 30249 28372 9606 2977 8486 487 -13545 -15990 -5590 -14441
17624a4441j2458J8001L536M208m644N293J5916q897q733n403J294J0255Q369
17611A2296O90K4j1534j0419K290P435L987j6902Q243L568Q763l071j2347j193
17597h170J1984J3922K673J61j3838j5923j4661p612J9878J6170k50n538k977
17584d181K47Q15q096k79n757R981J4552j6139j2422J566K2875j3150j3452r03
17570b4343K5693J1321l474j8362m786J0972P44j6427L115j301J0239m636K176
17557i069L615k228M32q862o101J4474Q685O559n235j688O288j0277l720j499
17543h626l170J268J2767Q390O8K833l485O211j0012J732l049P041K2199J0145
17529D4312j3783q587j1600j806J2722J2506J8766P048L4682M4164L8941L7367
$$ plain form
17624 -14441 -26899 -8898 -5362 -1154 -5798 -505 15411 6514 -2219 -7622 -6328 3927 12296
17611 12296 12986 13010 1476 -8943 -6653 782 4769 -12133 -3890 -322 8441 5370 -6977 -8170
17597 -8170 3814 17736 20409 20570 6732 -9191 -23852 -31464 -11586 4584 4334 -1204 -4181
17584 -4181 -3934 -3119 -11215 -11494 -17251 -7270 7282 -8857 -21279 -19713 3162 -9988 -23440 -24343
17570 -24343 1350 12671 9197 -9165 -13951 -2979 -2235 -18662 -15547 -16848 -6609 -11245 -9069
17557 -9069 -5454 -7682 -7250 -16112 -22213 -7739 946 7505 2270 582 6870 -3407 -7127 -8626
17543 -8626 -11796 -10528 2239 10629 10697 13530 10045 16256 6244 7976 4927 11968 34167 44312
17529 44312 30529 21942 10342 8536 21258 33764 52530 59578 94260 138424 177365 214732
17517B14732K6246L0116M49l8829m6625n1944l4927j727j8251k4254j5856J1265
17505E0395l785M092L42j8518j8295j2283K309P298o221O799R382K489j9333j279
17491C392o740j0385j570O383K601J7405m668k83m320J1485J0199p757k446j019
17477A2277o666q73O500p265k357K5023J2864O81J954J8550J7919N036K7139N3987
17463A64769M5786L7911k611j0951p580m2191k9366k2365j5313j9938k6677j1170
17451F0304m017o967m842j9509J535O534j053n010m209J6913K4820L3525K6655
17438A24679p779j0445r025k627l0239l3500k0317j6249L469R730k4012j7142
17426c3457Q064K5371j1251O68J2033q798n263m220K731J4114N533Q974l044N930
$$ plain form
17517 214732 240978 271094 271543 232714 186089 134145 99218 97491 79240 54986 39130 50395
17505 50395 46610 50702 51044 32526 14231 1948 4257 11555 5334 12133 21515 24004 4671 3392
17491 3392 -3348 -13733 -15303 -8920 -6319 11086 6418 6135 1815 13300 23499 15742 13296 12277
17477 12277 5611 4738 11238 3973 1616 26639 39503 40184 42138 60688 78607 83643 110782 164769
17463 164769 210555 248466 245855 234904 227324 185133 155767 133402 118089 98151 71474 60304
17451 60304 56287 49320 44478 24969 26504 33038 31985 26975 22766 39679 64499 98024 124679
17438 124679 116900 106455 97430 94803 64564 31064 10747 -5502 -2033 7697 -16315 -33457
17426 -33457 -25393 -22 -11273 -10605 1428 -7370 -12633 -16853 -14122 -8 5525 14499 11455 17385
17412A7385M205n697j7076j4043J481N91L555K960p931l617m409j2800M761J0260
17398b0375J253J3680K013q71l857j4059Q334n027J927O947P759n892q030j002
17384a7200j2145j025j759O586l887J8084J4701n219j1784j3133K727l350j4336
17371d1740P112O332R693j174j1393J740r131o21K4270M921J1554N058k0702J0683
17357c398M463j0523P178K7799j3017j7730p226J0060j450p001j7160o343R822
17344b4526J885m08L356N642j5P552J0370k662j7219j1191m564L754J2266K334
17330a3426K4724l699J4354J722l811n224k931k759Q227Q506J39j4832j122M815
17316A4683r544O737n959m966Q59Q897n950j4231M025J2136j891q82o565j657
$$ plain form
17412 17385 21590 15893 -1183 -15226 -13745 -13154 -9599 -6639 -14570 -18187 -22596 -35396 -30635 -20375
17398 -20375 -19122 -5442 -3429 -4300 -8157 -22216 -13882 -18909 -16982 -10035 -2276 -8168 -16198 -17200
17384 -17200 -29345 -30370 -32129 -25543 -29430 -11346 3355 -1864 -13648 -26781 -24054 -27404 -41740
17371 -41740 -34628 -28296 -18603 -19777 -31170 -29430 -38561 -39182 -14912 -9991 1563 6621 -14081 -3398
17357 -3398 1065 -9458 -2280 25519 12502 -5228 -12454 -2394 -3844 -10845 -28005 -34348 -24526
17344 -24526 -22641 -23049 -19693 -14051 -14066 -6514 3856 1194 -16025 -27216 -31780 -28026 -15760 -13426
17330 -13426 11298 7599 21953 23675 19864 14640 11709 8950 17177 25683 25822 10990 9868 14683
17316 14683 5139 11876 5917 951 1810 10707 4757 -9474 -5449 6687 4796 3914 -2651 -4308
17302d308o887j111q156j6851m35J0995J2120k01J457l954m874n934R604J6347
17288b188p617j9382K568J9396n36j2209o053J1030R546J44j4131j1712j973J0408
17274b2709K071j864L495j2236k7168J2624K3947p161m498k109N132l13n881J55
17260c6515J7110m946j1226j267J5908J9867k225n412N583o315N046r799K826
17247a1365M804J3535j0856j4446J1391k782O794J9848l593j9950J0819L808q14
17234G193m432n992k105k466o745M099p633k702J1456J5115q516k0561o047j601
17220c0937j709L811J386M726K847n618N399J5496O686j2571k079l515j9028l991
17206c9097K4262R849j8665j5456M649J3334L695Q012J4335J3922j3039k1638
$$ plain form
17302 -4308 -11195 -12306 -20462 -37313 -37748 -26753 -14633 -14834 -13377 -17331 -22205 -28139 -18535 -2188
17288 -2188 -9805 -29187 -26619 -7223 -7759 -19968 -26021 -14991 -5445 -5301 -19432 -31144 -33117 -22709
17274 -22709 -20638 -22502 -19007 -31243 -58411 -45787 -21840 -29001 -33499 -35608 -30476 -30789 -36670 -36515
17260 -36515 -19405 -24351 -35577 -36844 -20936 -1069 -3294 -8706 -3123 -9438 -4392 -14191 -11365
17247 -11365 -6561 6974 -3882 -18328 -6937 -9719 -2925 16923 13330 -6620 4199 8007 7193
17234 7193 2761 -3231 -5336 -7802 -14547 -10448 -18081 -20783 -9327 5788 -2728 -23289 -29336 -30937
17220 -30937 -32646 -28835 -27449 -22723 -19876 -25494 -20095 -4599 2087 -10484 -12563 -16078 -35106 -39097
17206 -39097 -14835 -4986 -23651 -39107 -34458 -21124 -17429 -9417 4918 18840 5801 -15837
17194a5837j2419m198K992l287L696K0650j811r260R351J5812j429J246m51j2972
17180g917j5090k4J1422J4030k344l932J3866m946p458o119K858l760m434N441
17166h407P674q89L698j3992m980J1729l931o775q495k0293M630R523J728J3093
17152a5687J87n361l675j052r547K070L681O453K376j1512K838J7789J6793j4698
17138i345p140J1171q468K152J7467J054j6219P9q998j028O965l088j2465m082
17124c1945R674J201Q88J0836J7755K79k0132j536o591J2937Q053j216l826m400
17110h023j1613j7750o743J607J9508K787Q8j096j3233J216N622J4421m915j937
17096b0061q245q475k4201O394J1349R905J3437J0297P19j3972M360J2163q258
$$ plain form
17194 -15837 -28256 -32454 -29462 -32749 -29053 -8403 -10214 -19474 -10123 5689 4260 5506 5055 -7917
17180 -7917 -23007 -23031 -11609 2421 77 -3855 10011 5065 -2393 -8512 -5654 -9414 -13848 -8407
17166 -8407 -733 -1622 2076 -11916 -16896 -5167 -9098 -15873 -24368 -44661 -40031 -30508 -28780 -15687
17152 -15687 -15500 -20861 -24536 -25588 -35135 -33065 -29384 -22931 -20555 -32067 -29229 -11440 5353 -9345
17138 -9345 -16485 -5314 -13782 -11630 5837 6891 -9328 -9249 -18247 -19275 -12310 -15398 -27863 -31945
17124 -31945 -22271 -21070 -20182 -9346 8409 8688 -11444 -12980 -19571 -6634 1419 203 -3623 -8023
17110 -8023 -19636 -37386 -44129 -42522 -23014 -20227 -20139 -21235 -34468 -33252 -27630 -13209 -18124 -20061
17096 -20061 -28306 -36781 -60982 -54588 -43239 -33334 -19897 -9600 -8881 -22853 -18493 -6330 -14588
17083a4588j0285J4786k514l003n494l929P711j0034q661j634P643j0080J7886
17070b2196l23q795j728j4089L322J5647K665L244j322j7988J7229q082j6899
17057d9315J0536K1031J7283J0669q686l258P917j1764j1895k326Q146o60R949
17044b373j4612r511J757O140J1049R490J162M916j5043p670J7443q108k0865
17031b6225j9661O29m233k457K7094J7855j3011J7427j48J1349r422N510j5510
17018a0803k0290k2884Q259J5969K1564r347o785Q531J2471m675l580n385o56
17005a7611l227K3749Q211j7335r884P846N863q856R672M193j7037o267j0154
16992c0837J153J0127O631j113K882q949j0099M062n783J0195q482k1446J0804
$$ plain form
17083 -14588 -24873 -10087 -12601 -15604 -21098 -25027 -17316 -27350 -36011 -37645 -30002 -40082 -22196
17070 -22196 -22519 -31314 -33042 -47131 -43809 -28162 -25497 -22253 -23575 -41563 -24334 -32416 -49315
17057 -49315 -38779 -17748 -465 10204 1518 -1740 6177 -5587 -17482 -19808 -11662 -12322 -2373
17044 -2373 -16985 -26496 -24739 -18599 -7550 1940 3102 8018 -7025 -14695 2748 -5360 -26225
17031 -26225 -45886 -45257 -49490 -51947 -24853 -6998 -20009 -2582 -2730 8619 -803 4707 -10803
17018 -10803 -31093 -53977 -45718 -29749 -8185 -17532 -24317 -15786 -3315 -7990 -11570 -16955 -17611
17005 -17611 -20838 2911 11122 -6213 -16097 -8251 -2388 -11244 -1572 2621 -14416 -20683 -30837
16992 -30837 -29684 -19557 -12926 -14039 -11157 -20106 -30205 -26143 -31926 -21731 -30213 -51659 -40855
16979d0855J3305P911j305J1334J651n882Q901o187j2274j4712n910p328K2317
16966b9034K3952M196p121M687O773J0731m581p498k845j2943n913j0768p816
16953c8180M911L780l305P917J976Q104J286k701j0122J0606l871J2990p164m762
16939a8535j756Q05R331P27p378J5637N288q32j3986Q881J3238R20j4826k3732
16925b6218J2142J1826J030K423j6879O775P763L47P500Q81P014j669j7219j4376
16911a8660O598J5769k758j3502j417q641j972o365R336K0161J9321j752L463
16898A9581l903k9756P185O629M614L358n761j785N778j293p603J2198j4230l593
16884h581K44m455R249n320J4018Q343j2034j5850N630l967N372J0767N629q813
$$ plain form
16979 -40855 -27550 -19639 -20944 -9610 -7959 -13841 -4940 -11127 -23401 -38113 -44023 -51351 -29034
16966 -29034 -5082 -886 -8007 -3320 3453 14184 9603 2105 -740 -13683 -19596 -30364 -38180
16953 -38180 -33269 -29489 -32794 -24877 -22901 -14797 -13511 -16212 -26334 -15728 -19599 -6609 -13773 -18535
16939 -18535 -20291 -19486 -10155 -9428 -16806 -1169 4119 3287 -10699 -1818 11420 12340 -2486 -26218
16925 -26218 -14076 -2250 -1220 1203 -15676 -8901 -1138 -791 6709 7590 14604 12935 -4284 -18660
16911 -18660 -12062 3707 949 -12553 -13970 -22611 -24583 -30948 -21612 -1451 17870 16118 19581
16898 19581 15678 -14078 -6893 -264 4350 7708 1947 162 5940 4647 -2956 9242 -4988 -8581
16884 -8581 -8337 -12792 -3543 -8863 5155 13498 1464 -14386 -8756 -12723 -7351 3416 9045 232
16870B32j5344M342l043l190p470j205m568r239K029M26k491J5292J1596K490
16856a0143j1073r123k0411K782O007J1110J8263N332N738o629j0396K0O81N527
16842a2315j5104J8927J1387m426J2268J0351j0168o304q523L100N908P938j8133
16829e094m0462J662K644J4552K1854J0314k2626k3045M818R245J0301n427M757
16816a6507J1619O692O156k942o420q222j8912O344J6020m339j8970o231Q743
16803b6969Q44K377j2080m528j354L1588J9413r498N5j4893J253P023O777m305
16789d297j9324O469r08n247R422Q626R168O966k0306j3353j243J1879p864m743
16775b4755Q367Q776O621K489M733J1421j4030j3537P204j542r423q454K4024
$$ plain form
16870 232 -15112 -10770 -13813 -17003 -24473 -25678 -30246 -39485 -37456 -37030 -39521 -24229 -12633 -10143
16856 -10143 -21216 -30339 -50750 -47968 -41961 -30851 -12588 -7256 -1518 -8147 -18543 -18523 -17842 -12315
16842 -12315 -27419 -8492 2895 -1531 10737 21088 10920 4616 -3907 -807 5101 13039 -5094
16829 -5094 -45556 -43894 -41250 -26698 -4844 5470 -17156 -40201 -35383 -26138 -15837 -21264 -16507
16816 -16507 -4888 1804 7960 5018 -1402 -9624 -28536 -22192 -6172 -10511 -29481 -35712 -26969
16803 -26969 -26125 -23748 -35828 -40356 -41710 -10122 9291 -207 -152 -15045 -13792 -6769 8 -4297
16789 -4297 -23621 -17152 -18060 -23307 -13885 -5259 3909 10875 -9431 -22784 -24027 -12148 -20012 -24755
16775 -24755 -16388 -7612 -991 1498 6231 17652 3622 -9915 -2711 -4253 -13676 -22130 1894
16762A894M525K347P426o752p401o430q071J7570K966p913m268k767O873P487
16748G486L846j131j6236j1567O248P61R541j638m081j3689m131r748P796J8961
16734g582K2524j1505j0185O076o998j5472L730R635o860m557K037p933K2552
16721d538J5989P511j6471n780l809M963r176o694O873M824J2160m281k399J9131
16707A8303K036l538k8738Q04J0989q365k938M351J763N263m702j0204J4818K640
16693B482o123j3534j690J123N939O665j4186k4235P044l461K010K2688P734J0947
16679C403J827O024N519j4576m463J7M257J8670k112j1717L304K230J480M720
16665A8583n718j1860j988j2661j2358q002P454N494J4141L388j3237j1432J272
$$ plain form
16762 1894 6419 8766 16192 9440 2039 -4391 -12462 5108 8074 161 -4107 -6874 -1 7486
16748 7486 11332 10201 -6035 -17602 -11354 -10593 -1052 -2690 -6771 -20460 -24591 -34339 -26543 -7582
16734 -7582 14942 3437 -6748 -672 -7670 -23142 -19412 -9777 -16637 -21194 -19157 -27090 -4538
16721 -4538 11451 18962 2491 -3289 -7098 -2135 -11311 -18005 -11132 -6308 5852 1571 -828 18303
16707 18303 20339 16801 -11937 -11133 -144 -8509 -11447 -7096 -5333 -70 -4772 -14976 -158 2482
16693 2482 -3641 -17175 -18865 -17742 -11803 -5138 -19324 -43559 -36515 -39976 -37966 -15278 -7544 3403
16679 3403 5230 11254 16773 2197 -2266 -2249 2008 20678 18566 6849 10153 12383 13863 18583
16665 18583 12865 1005 -983 -13644 -26002 -34004 -26550 -21056 -6915 -3527 -16764 -28196 -26924
16652b6924K2572N685m867j3834K582J3393N044m050k2777k350K1438K5901J8846
16639D0659n454j6594j9908j9464R60n634j2714P661K7825J6903o242p180K524
16626C342l647j629j718M713N330R612j1045j2803m29M450j381q2j650M943J3566
16611A1572r011k810L408k0464O626J6915O188N356l151j7929n889n61o011K379
16597a3382J2538J1517K90k1897m04J7633P147r380k698Q202N192q280J990r351
16583h83L89P079j751n622k044L139k59m296L009k1611R756J4783j5947q21J0033
16568e046Q310J7339L568j4223q569r123M166j3309l074J2261J7585R389J157
16555B0431r121o674J1569L280n169m054l146j5353j3893J4622J6004k0124k4793
$$ plain form
16652 -26924 -4352 1333 -3534 -17368 -14786 -1393 3651 -399 -23176 -25526 -4088 21813 40659
16639 40659 35205 18611 -1297 -20761 -19801 -25435 -38149 -30488 -2663 14240 7998 818 3342
16626 3342 -305 -1934 -3652 1061 6391 16003 4958 -7845 -8274 -3824 -5205 -5287 -6937 -1994 11572
16611 11572 2561 -249 3159 -17305 -10679 6236 12424 17780 14629 -3300 -9189 -9750 -15761 -13382
16597 -13382 -844 10673 10963 -10934 -11338 6295 13442 4062 1364 9566 14758 6478 8468 -883
16583 -883 -494 6585 4834 -788 -2832 307 48 -4248 -1239 -22850 -13094 1689 -14258 -15079 -5046
16568 -5046 3264 20603 24171 9948 1379 -7744 -3578 -16887 -19961 -7700 9885 19274 20431
16555 20431 11310 4636 16205 19485 14316 10262 7116 -8237 -22130 -7508 8496 -11628 -36421
16542c6421P370K5082M166R981N268j7300j3045j4392R992J3381N55M627r18q010
16528i664j0242l201O314P140J0151p66l393L979j0461L927J3609L50j8528j8408
16514b9193J2184n033j5964O007J0715J1844J7028J575J250m767M693N546n278
16501A0607k1851n962J1452O730j2584J3002N197j4144j4110P836Q91r601j3478
16488c6015O746K246j84L2221J3221j5159k0272p924N750K1854J8357l660r662
16475G519j4160L880J0854M161N322j2934Q43j7211P821J2304q157K693o52j0187
16461g904L936j123j4884J4811J1944P321j2571o524K475l904J4115o004n700
16448d012K2659J4410q749k666n90j1192q039r734j0894o34K4054J4040R45J758
$$ plain form
16542 -36421 -29051 -3969 197 10178 15446 -1854 -14899 -29291 -19299 -5918 -5363 -736 -1654 -9664
16528 -9664 -19906 -23107 -16793 -9653 498 -268 -3661 318 -10143 -6216 7393 7743 -10785 -29193
16514 -29193 -17009 -22042 -38006 -31999 -21284 -9440 7588 9163 10413 5646 10339 15885 10607
16501 10607 -11244 -17206 -5754 976 -11608 1394 6591 -7553 -21663 -13827 -12936 -22537 -36015
16488 -36015 -29269 -27023 -27207 5014 18235 3076 -17196 -25120 -19370 2484 20841 17181 7519
16475 7519 -6641 -2761 8093 12254 17576 4642 5485 -11726 -3905 8399 242 2935 2283 -7904
16461 -7904 -3968 -5091 -19975 -5164 6780 14101 1530 -4994 -2519 -6423 7692 1688 -4012
16448 -4012 18647 33057 24308 21642 21052 9860 1821 -7913 -18807 -19441 4613 18653 19598 21356
16434B1356J5402N448k3234N430J0514o861k30k0052j2294p420k319j2279l645
16421c0184J8808l507q35j277k72n666p29l885o847l30K4170J4905L780O066o755
16406G442o341o206K5257J6131j7844j5613k7192n369J2204r30J0195O177j4592
16393a6681r779K672J8110K5141J776j4948J996j1924j0373r332Q825J7925N710
16380I118j0067p735j0937J075P684O445J3684j622j3370j9030P962J9052M104
16367F363P075N016j1536n101P692j2414r901K907k408M063Q823k706l659q045
16353a3831j4969L808k631N501M537j6700k962J668n16J3638M256P237O436j0197
16339a4725P041J3534n362R110N881n403r093o483j698Q265n83p762R225k849
$$ plain form
16434 21356 36758 42206 18972 24402 34916 28055 27825 7773 -4521 -11941 -14260 -26539 -30184
16421 -30184 -11376 -14883 -15718 -16995 -17267 -22933 -23662 -27547 -34394 -34724 -10554 4351 8131 14197 7442
16406 7442 1101 -5105 20152 36283 18439 2826 -24366 -29735 -17531 -18461 -8266 -2089 -16681
16393 -16681 -26460 -23788 -5678 19463 21239 6291 8287 -3637 -14010 -23342 -14517 3408 9118
16380 9118 -949 -8684 -19621 -18546 -10862 -4417 9267 7645 -5725 -24755 -16793 2259 6363
16367 6363 13438 18454 6918 1817 9509 -2905 -12806 -9899 -12307 -8244 579 -2127 -5786 -13831
16353 -13831 -28800 -24992 -27623 -22122 -17585 -34285 -37247 -35579 -36095 -22457 -18201 -10964 -4528 -14725
16339 -14725 -7684 5850 488 9598 15479 10076 983 -5500 -7198 1067 484 -7278 1947 -902
16325i02O02k914j5733k0219O895K6073Q977J0412j9636j2922J510J0389P602
16312A34m39r226j9950N858L5694N048p35k4199j9249r441K0976P970J172P179
16298G92J3611Q958j0921j5482n388j2368o402M98k684K0116J0514J8109j8262
16285A091k3256P345j0066M606J1595j5664j1173M042M239K11o48K866Q903j0555
16271b6464j1163J7813R608n956q700J1218L496m527j9077N007K3342P521j2843
16258a0725J0072R589J4580j0207r330j095J10m844j1485p722P621k749J8924
16245B739K49q136J4479O678N52l470k3786N098l209o586Q162J8411J7625O058
16231C4864j5926l9771j7762J1649J3317N377J882r350K625j354R809J1704j4592
$$ plain form
16325 -902 -300 -3214 -18947 -39166 -32271 -6198 2779 13191 -6445 -19367 -17857 -7468 134
16312 134 -305 -9531 -29481 -23623 12071 17119 16384 -7815 -27064 -36505 -15529 -7559 -6387 792
16298 792 14403 23361 12440 -3042 -8430 -20798 -27200 -26702 -29386 -9270 1244 19353 1091
16285 1091 -22165 -14820 -24886 -20280 -8685 -24349 -35522 -31480 -27241 -27030 -27678 -24812 -15909 -26464
16271 -26464 -37627 -19814 -10206 -16162 -24862 -13644 -10148 -14675 -33752 -28745 -5403 2118 -10725
16258 -10725 -653 8936 23516 13309 3979 2884 2994 -1850 -13335 -21057 -13436 -16185 2739
16245 2739 2988 -5148 9331 16009 16561 13091 -10695 -5597 -8806 -15392 -7230 11181 28806 34864
16231 34864 18938 -20833 -38595 -26946 -13629 -8252 -6370 -15720 -13095 -14449 -4640 7064 -7528
16218g528j0096P12J808Q0L708j1297J1347J1149R647j4048l602m453J0902p678
16204i349j0297k558J0060q756k597L32r006p900p704k58J7945J4195L941p706
16190a9658j272r316J868J1016K1771O680j1696j177r608l669J747n401J1375
16177g340Q116P153p831r838j850J2074Q828P22q998l237k731j664k313l928K2615
16162I778J2733p174o644m165K151m892j6434o300J4620J4584L714m782J0758
16149A7947P625j1605n369J086K662m360J524O26J894N76k3621r186J1603K40
16135h358Q372p712k1587J0631J2085J7570j8465p381J2794p024j690J6330K547
16122H112l000j1443o693J2508n316K319K4697R114N531R753q006k2948o098O777
$$ plain form
16218 -7528 -17624 -16912 -15104 -15024 -11316 -22613 -11266 -117 9530 -4518 -8120 -12573 -1671 -9349
16204 -9349 -19646 -22204 -12144 -20900 -23497 -23165 -32171 -40071 -47775 -48033 -30088 -15893 -11952 -19658
16190 -19658 -20930 -30246 -28378 -17362 4409 11089 -607 -1784 -11392 -15061 -13314 -18715 -7340
16177 -7340 776 7929 98 -9740 -11590 484 9312 10034 1036 -2201 -4932 -6596 -8909 -12837 9778
16162 9778 22511 15337 8693 4528 6679 1787 -14647 -20947 -6327 8257 11971 7189 17947
16149 17947 25572 13967 8598 9684 12346 7986 9510 10136 12030 12606 -11015 -20201 -8598 -8358
16135 -8358 14 -7698 -29285 -18654 -6569 11001 -7464 -14845 -2051 -9075 -10765 5565 8112
16122 8112 5112 -6331 -13024 -516 -5832 -3513 21184 30298 35829 45582 37576 14628 8530 15307
16108A5307M547q437j5234m973o405R112q160Q29lJ87l999O429j311r227q73P980
16092a4231P298q21R373R083P667k1823j3034O868J1445j0475j3411j2936J0870
16079b4127J3029O116L694q122J7965O697l027R775J1279n95j1659l803k871q704
16065E647j6528O792J1781J7960m147j8410L119p397l3391q36J7375j572N688
16052a3919r542p574J7924J2052Q039L727j2032r66J248j5787O590P925n364P59
16038f920J117j2664J050N498J0758p28R707l630O23r483p675J1068r756j6348
16024b7383M182K596P223k317K0185q082j3943q010M747j8347J0879K5917p933
16011a0286m557R600m719L74m878R391K325J83j308k118J2913J0995O304k1648
$$ plain form
16108 15307 19854 11417 -3817 -8790 -15195 -6083 -14243 -13414 -13417 -13230 -17229 -10800 -12111 -21338 -22211 -14231
16092 -14231 -6933 -7754 1619 10702 18369 -3454 -16488 -9620 1825 -8650 -22061 -34997 -24127
16079 -24127 -11098 -4982 -1288 -9410 8555 15252 12225 22000 33279 32684 21025 17222 14351 5647
16065 5647 -10881 -4089 7692 25652 21505 3095 6214 -1183 -34574 -35410 -18035 -19607 -13919
16052 -13919 -23461 -31035 -13111 -1059 6980 10707 -1325 -2291 -1043 -16830 -10240 -2315 -7679 -6920
16038 -6920 -5803 -18467 -17417 -11919 -1161 -1889 7818 4188 4811 -4672 -12347 -1279 -11035 -27383
16024 -27383 -23201 -20605 -13382 -15699 4486 -3596 -17539 -25549 -20802 -39149 -28270 -2353 -10286
16011 -10286 -14843 -5243 -9962 -9588 -14466 -5075 -2750 -2567 -3875 -5993 6920 17915 24219 2571
15997B571k736K1457M787m26J0917j2624j9715M070p815j2622Q59P932J967P743
15983F365J2153N945j5090j3088P231o701l804j568k3132R71K7164J1667Q491
15970A6604J8401j0212k1125r636J0358J0300n252K732L680k0085l355R227N674
15957G311K978J0954O131r588q638J9450j0731j6966M742N804M354r812j9922
15944a3933O483K7994Q367k8432O258m574k3051O271J1408J255J4517J1702o1
15931B4204j0579j4683L337M023P023j4783j119K4775M905j8807q174k400J0873
15918H595L094j0392L717j0217l373o459K6462J3348j967j094j2717J2848j6769
15905E076l2751P19R971R748K1205m118o036p267J0004M922L246k479k3388R083
$$ plain form
15997 2571 -165 21292 26079 25653 36570 23946 4231 8301 486 -12136 -11277 -3345 -1378 6365
15983 6365 18518 24463 9373 -3715 3516 -3185 -6989 -8557 -31689 -30718 -3554 8113 16604
15970 16604 35005 24793 3668 -5968 4390 14690 9438 12170 15850 -4235 -7590 1637 7311
15957 7311 10289 21243 27374 17786 9148 28598 17867 901 5643 11447 15801 5989 -13933
15944 -13933 -7450 20544 28911 479 6737 2163 -20888 -14617 -3209 -1954 12563 24265 24204
15931 24204 13625 -1058 2279 6302 13325 -1458 -2577 22198 27103 8296 122 -2278 8595
15918 8595 11689 1297 5014 -5203 -8576 -15035 11427 24775 22808 21714 8997 21845 5076
15905 5076 -27675 -26956 -16985 -7237 13968 9850 3814 -3453 6551 11473 14719 12240 -11148 -2065
15891b065o67o739j737N497N03J853J1230N966P523L091k425L645j2670j3308
15877c03j1015n25l538N653k636m715p105J3298J4576j2206p283Q230j0287J67
15863a7689N406J075P979J4181J8995J228j0438j9812o166j1629r549j1458R326
15850b8551L3656P503k0299j0480J0404j665l688J2233J234J036J298k735P745
15837G691j1493L39J235o135J5309J9782L091j4418k0722Q566J2140J4195M99
15824C0079j1134j1182J766l254K210m789q327P617k692O161O37Q63k059j5336
15810i440P725o41J0475j0803n919j2611J7176K0292m800L803J843k40j3832q706
15796e678K134J0647m211k471j5880K443K648j4835k755m830J0632P113R977M593
$$ plain form
15891 -2065 -2732 -9471 -11208 -5711 -5208 -3355 7875 13841 21364 24455 22030 25675 13005 -303
15877 -303 -11318 -11843 -15381 -9728 -12364 -17079 -24184 -10886 3690 -8516 -15799 -7569 -17856 -17689
15863 -17689 -12283 -11208 -3229 10952 29947 31175 20737 925 -5241 -16870 -26419 -37877 -28551
15850 -28551 5105 12608 -7691 -18171 -7767 -9432 -13120 -887 347 1383 2681 -54 7691
15837 7691 -3802 -3463 -2228 -8363 6946 26728 29819 15401 -5321 3245 15385 29580 30079
15824 30079 18945 7763 9529 6275 8485 3696 -4631 2986 294 6455 7092 7955 5896 -9440
15810 -9440 -1715 -2356 8119 -2684 -8603 -21214 -4038 16254 11454 15257 17100 16860 3028 -5678
15796 -5678 -3544 7103 2892 421 -15459 -13016 -10368 -25203 -27958 -32788 -22156 -15043 -5066 -473
15782d73j2752r132j1139K435J7118J6654l303O923P668j1280j3170M415J5803
15769I767l542o916J235J6468p749m890j83n300L109j995J0460L563p147N498
15755A2378J546k661o887j952R737L011q416n682J6087J0392n188j2011J0778
15742B1132J226j5524n510l216N462J8797j4375q783j174n608K871p129O35J0247
15728i49K607N549J2752K648L48r113n060L98O174k5490q285M691n139l658p625
15713c0152J0220p206J0247J2977Q434k897o295l210l154j3920j3003J1359J0846
15700a5754o11K586k572n121K2307J8174r998O676P634j655j4509k2327k553L217
15686a4506n16q775j3163J462R758o661J3129N283J2068J6107O75j6581q819j3412
$$ plain form
15782 -473 -13225 -22357 -33496 -31061 -13943 2711 -592 6331 13999 2719 -10451 -6036 9767
15769 9767 6225 -691 544 17012 9263 4373 4190 -1110 1999 4 10464 14027 6880 12378
15755 12378 13924 11263 4376 2424 12161 15172 6756 1074 17161 27553 22365 10354 21132
15742 21132 22358 6834 1324 -1892 3570 22367 7992 -791 -1965 -7573 -4702 -11831 -11196 -949
15728 -949 1658 7207 19959 22607 22955 13842 8782 9180 15354 -10136 -18421 -13730 -18869 -22527 -30152
15713 -30152 -19932 -27138 -16891 -3914 4520 1623 -4672 -7882 -11036 -24956 -37959 -26600 -15754
15700 -15754 -16365 -13779 -16351 -21472 835 19009 9011 15687 23321 21666 7157 -15170 -17723 -14506
15686 -14506 -15022 -23797 -36960 -35498 -25740 -32401 -19272 -13989 -1921 14186 14861 -1720 -10539 -23951
15672b3951k570M1523K4511p30P729j1150l1084j1567M617L919o790l08Q894J0130
15658A3173L0j0559k346k729j0221J1068k70J986r317m358L752J1456Q08P788
15644A0261K140J4043L349n453j4753j129L407N015k0338j5603J0445Q924P29
15631A037m040q269o813M834m493k1004O168j24k0137K223K1295J3667j148K790
15617a4014j9439m275l411N502J2176j851M190n536m283k451p29N623R849K813
15603a5836l283O7M575j1363L813Q791m15o821j6239J0639k70P374J6452j2744
15589a5260p580K1375L799p754q448K789k1366m394p050K1874J3120K1517N070
15576A7692k1266O268Q080j2643j3892K000r46m513n181R709J9361j0804K875
$$ plain form
15672 -23951 -26521 15002 39513 38783 46512 35362 4278 -7289 -2672 1247 -5543 -5851 3043 13173
15658 13173 13203 2644 298 -2431 -12652 -1584 -1854 132 -9185 -13543 -9791 1665 2473 10261
15644 10261 12401 26444 29793 24340 9587 8458 11865 16880 -3458 -19061 -8616 308 1037
15631 1037 -3003 -11272 -18085 -13251 -17744 -38748 -32580 -32704 -52841 -50618 -29323 -15656 -16804 -14014
15617 -14014 -33453 -37728 -41139 -35637 -23461 -25312 -21122 -26658 -30941 -33392 -34121 -28498 -18649 -15836
15603 -15836 -19119 -19052 -14477 -25840 -22027 -13236 -13651 -20472 -36711 -26072 -26342 -18968 -2516 -15260
15589 -15260 -22840 -1465 2334 -5420 -13868 -11079 -32445 -36839 -43889 -22015 -8895 12622 17692
15576 17692 -3574 2694 10774 -1869 -15761 -13761 -14707 -19220 -24401 -14692 4669 -6135 -3260
15563c260J6339M943m407j5028R06J5616P723P018j0295j6703k205k3737j6477
15550c9567P937J4302J3347O769P656J090o878j0857j9441O359m36n75j4322n914
15536d0530n377L2395M2226J1627j0547j3741j0492J1188O571p172r132j5168
15524h152J395J2493J3091P289J0410j9871j2503j7735l871j659Q543M718K1339
15511A5487J0766j039p130m587p924p759j9051M459N821J1188M231J26l37l492
15497G59p105j7723K827K4417J5082K6502k1257o942j0491j6724l849r64l956
15484a9424L856N261L821J5364J6490j0029j2930k1747j0429Q291J665N013J6718
15471A920N559r931j6175K2023J7212M481k91q345j516j1368l758r31j051K598
$$ plain form
15563 -3260 13079 18022 13615 -1413 -507 15109 22832 29850 19555 2852 647 -23090 -39567
15550 -39567 -31630 -17328 -3981 2788 10444 11534 4656 -6201 -25642 -19283 -19719 -20294 -34616 -40530
15536 -40530 -45907 -13512 28714 40341 29794 16053 5561 16749 23320 16148 7016 -8152
15524 -8152 -6757 5736 18827 26116 36526 16655 4152 -13583 -17454 -19113 -10570 -5852 15487
15511 15487 26253 25214 18084 13497 5573 -2186 -21237 -16778 -10957 231 4462 4588 4251 759
15497 759 -6346 -24069 -21242 3175 18257 44759 23502 16560 6069 -10655 -14504 -15468 -19424
15484 -19424 -15568 -10307 -6486 8878 25368 15339 2409 -19338 -29767 -21476 -19811 -14798 1920
15471 1920 7479 -2452 -18627 3396 20608 25089 24798 16453 14937 3569 -189 -1120 -2171 427
15457D27k994K619J7161j066p763q259k3649J262K263J328M374J8254J2713n405
15443A1265l599m264q705j3818l074J1321J3700n08r569N450Q380Q524n341j1312
15429a550N725J0742j1395j7332N475N919J871k4049k258J7536R182j177j8065
15416a9376j2236M476J5440L947L402K8j0809N741K4304R913j8812k1401j4713
15403c0096l227K3822K3557k562p068k578j2654J1548N472n744p213j3831j2841
15390c3415j4016N712J6826J6508n352O582J0399p951k847l331o792R239o105
15377a4543J5514J1316j3490m596J4464J1260P260J888j1501r307Q206J598j828
15364A6241L532r116J3921J99j2636J022O210J0768j0415j5028p726m764p139
$$ plain form
15457 427 -2567 52 17213 16147 8384 125 -23524 -22262 -19999 -18671 -14297 3957 16670 11265
15443 11265 7666 3402 -5303 -19121 -22195 -10874 2826 2318 -7251 -1801 6579 15103 9762 -1550
15429 -1550 4175 14917 3522 -13810 -8335 -2416 -545 -24594 -26852 -9316 -134 -1311 -19376
15416 -19376 -31612 -27136 -11696 -7749 -4347 -4319 -15128 -9387 14917 24830 6018 -15383 -30096
15403 -30096 -33323 -9501 14056 11494 4426 1848 -10806 742 6214 470 -6743 -20574 -33415
15390 -33415 -47431 -41719 -24893 -8385 -13737 -7155 3244 -4707 -7554 -10885 -17677 -8438 -14543
15377 -14543 971 12287 -1203 -5799 8665 19925 27185 29073 17572 8265 16471 18069 16241
15364 16241 19773 10657 24578 24777 12141 13163 19373 30141 19726 4698 -3028 -7792 -14931
15351a4931l076q054N130n189O522J7582p34p346Q908K058M905o10Q01L694p155
15336B505J3639K5204J396l0131j4953j382j963L517J561p000K290M893L128m755
15322b051K0605j4578j778L212j893J579L414Q577j2753j1124J2022P373q998
15309C607j0542J8618l144m708k539k244M474o566O64q244K726J6633j2664j0293
15295a4222P432m098q688j9978M32J5713J5991J2673L0734K0251k4923j9616j352
15282A0349J909O173j6254k2691M818M385K22N704j599j0799J1681M901J0017
15269H816M878J4858N222O48n998j9065L180l918l099R972P483j2302O339k298
15255A4716j0284o597m98L221o341L148J1608J6869k156M719N321j2752l51j202
$$ plain form
15351 -14931 -18007 -26061 -20931 -26120 -19598 -2016 -2750 -10096 -1188 870 5775 5165 5966 9660 2505
15336 2505 16144 41348 42744 12613 -2340 -3722 -5685 -2168 -607 -7607 -5317 -424 2704 -2051
15322 -2051 18554 3976 2198 5410 3517 5096 8510 17087 4334 -6790 5232 12605 3607
15309 3607 -6935 11683 8539 3831 1292 -952 3522 -3044 -2380 -10624 -7898 8735 -3929 -14222
15295 -14222 -6790 -10888 -19576 -39554 -39122 -23409 -7418 5255 35989 56240 31317 11701 10349
15282 10349 12258 18431 2177 -20514 -15696 -11311 -11089 -5385 -6984 -17783 -6102 -1201 8816
15269 8816 13694 28552 33774 34422 28424 9359 12539 8621 5522 15494 22977 10675 17014 14716
15255 14716 4432 -2165 -2663 558 -5783 -2635 8973 25842 23686 28405 33726 20974 20623 19421
15241A9421m109L709j6018m189j4297L847J6448O947R062L041q131q123j7136
15228i528%K0556Q465n192k4796O501o172j0644l231J1108K0750J3707j576q000
15214A1948n174l206l593Q24J4484j5406q151N472j4835l266J4115J253L368J1301
15200I134Q701O921L785R713j3979j4018j3335l412J2837L762k0157N59M930J3254
15186H695p599K19J2171p285j1756n539N062O933o24M310l077l205j3188j485
15172a6368l839Q987N75q399k18N195J04K2857N410o41M001o602O430o872j4748
15157d128J4502O811q010j004j8655o912J7323J3065m674o93K129J63r058q757
15143g898j2042J103O744l92o975m500J0178J8199J0660J843k185m13j7248o079
$$ plain form
15241 19421 15312 19021 3003 -1186 -15483 -11636 4812 11759 20821 23862 15731 7608 -9528
15228 -9528 -9528 11028 19493 14301 -10495 -3994 -10166 -20810 -24041 -12933 7817 21524 19948 11948
15214 11948 6774 3568 -25 799 15283 -123 -8274 -2802 -17637 -20903 -6788 -5535 -2167 9134
15200 9134 17835 24756 28541 38254 24275 10257 -3078 -6490 6347 10109 -10048 -9489 -4559 8695
15186 8695 1096 1315 13486 6201 -5555 -11094 -6032 901 277 4587 1510 -1695 -14883 -16368
15172 -16368 -20207 -11220 -10645 -19044 -19262 -14067 -13963 8894 14304 13663 17664 11062 17492 10620 -4128
15157 -4128 10374 17185 9175 8171 -10484 -17396 -73 12992 8318 7625 9754 9917 859 -7898
15143 -7898 -19940 -18837 -12093 -12485 -19460 -23960 -13782 4417 15077 16920 14735 14322 -2926 -9005
15129i005K417q617j1926j323J1202P426j72J2255l295J2002k386l388j3280Q07
15115g283K2080j1205o757J1279P526r643P504j76n584O765j3476R953q801j5811
15101a3629R785k380l108Q242J5906K627m160j381M458J645j3171o855J0659o41
15087G997K1258q803j8449j2467Q302J1370J7756n408L965N485l003j8495j539
15074G969o798l914r032n225J0124Q114m24j697j1592j1996p534L848J340m56
15060b7273o636J1794J9206J1992j1005M128m748K351J7623k382m383J9317M505
15047C4489j4547l915k1372j1571M903J4548P820j6125j9859J1341L988Q74n403
15034a4829J1317R523R918L34k718N435M797k0224j4173J193J5000j3181k330
$$ plain form
15129 -9005 -6588 -15205 -27131 -28454 -17252 -9826 -9998 2257 -1038 10964 8578 5190 -8090 -7283
15115 -7283 14797 3592 -3165 8114 15640 5997 13501 13325 7741 14506 1030 10983 2182 -13629
15101 -13629 -3844 -6224 -9332 -1090 14816 17443 13283 11902 16360 18005 4834 -2021 8638 7997
15087 7997 29255 20452 2003 -10464 -2162 9208 26964 21556 25521 31006 28003 9508 7969
15074 7969 1171 -2743 -11775 -17000 -6876 1238 814 -883 -12475 -24471 -32005 -28157 -26817 -27273
15060 -27273 -33909 -22115 -2909 9083 -1922 2206 -2542 -191 17432 15050 10667 29984 34489
15047 34489 19942 16027 -5345 -16916 -12013 2535 10355 -5770 -25629 -14288 -10300 -9426 -14829
15034 -14829 -3512 6011 15929 16263 13545 18980 23777 3553 -10620 -9427 5573 -7608 -9938
15021i938N226p888n884M661q89M804J0998p925j898J1235m579m543J6900J2779
15007B3059M266j8134p040P715n663j344R83j1611K04j555K0573K6830K1387l6522
14993B3148l6597N935J0982k620K1839l665k2901l287N646k967j4188M191p943
14980b2427l71Q290p147J2925J7577k553j9702q700N037J1710N64m11O470J2448
14966A3710j0338j740O211L529Q717r53k099M148R336J2678m899k666m484j1423
14952A9727j9843m426J2443m703p04r552J0012n466l231J8127R694P905j9524
14939A0459m779M627J4308M322j4787k564j0876k614P170j2518o664l155O646
14926a0425K0667R978j462K36Q3l3611N452J3773p823Q737p371J7405J5332j6438
$$ plain form
15021 -9938 -4712 -12600 -18484 -13823 -14712 -9908 1090 -6835 -8733 2502 -2077 -6620 10280 23059
15007 23059 27325 9191 2151 9866 4203 2859 3842 -7769 -7565 -9120 11453 38283 59670 23148
14993 23148 -13449 -7514 3468 848 22687 19022 -3879 -7166 -1520 -4487 -18675 -14484 -22427
14980 -22427 -22798 -14508 -21655 -8730 8847 6294 -13408 -22108 -17071 -5361 -4797 -5208 1262 13710
14966 13710 3372 1632 7843 11372 20089 19136 17037 21185 30521 43199 38300 35634 31150 19727
14952 19727 -116 -4542 7901 3198 2494 -7058 2954 -2512 -5743 12384 22078 29983 10459
14939 10459 5680 10307 24615 28937 14150 11586 710 -1904 5266 -7252 -13916 -17071 -10425
14926 -10425 10242 20220 18758 18994 19077 -14534 -9082 4691 -3132 5605 -1766 15639 30971 14533
14912A4533j4249k8845M568J2261O859J4763L198P294k0358K141r266N566q715
14899a0250j1134J6986K1374L840k4415j3114M450P78K4643K0954k0766j770p64
14886A0812l012o424j1471Q300O988L992M279R991l137p612o048O786R757J399
14872B4600o310r564j3909N203J5176p60L248P890j0582j1311N178P856j1495
14859E220l555K1450J9405J95j2429m3978o897J1628K5124o864j896J3013j4237
14846F179j7255M286P113L313R20k342N551j17j3569M804J9791P608j1489m044
14832A0749j70L163L14j6526j0342N405N14p2J6696O13j7662o181O257K094J9167
14817A4019l644j4800r394Q905J6614P070r994j7889P618J5247k137j4854Q540
$$ plain form
14912 14533 284 -28561 -23993 -11732 -4873 9890 13088 20382 24 2165 -7101 -1535 -10250
14899 -10250 -21384 -4398 16976 20816 -3599 -16713 -12263 -11485 13158 34112 13346 11576 10812
14886 10812 7800 1376 -10095 -1795 5193 9185 13464 23455 20318 12706 6658 13444 23201 24600
14872 24600 18290 8726 -5183 20 15196 14436 17684 25574 14992 3681 8859 16715 5220
14859 5220 1665 23115 42520 42715 30286 -13692 -20589 -8961 16163 9299 7403 20416 6179
14846 6179 -11076 -6790 323 3636 4556 2214 7765 7648 -5921 -1117 18674 26282 14793 10749
14832 10749 10579 13742 14056 -2470 -12812 -7407 -6893 -6965 9731 10344 -7318 -13499 -7242 -5148 14019
14817 14019 10375 -4425 -13819 -4914 11700 18770 8776 -9113 -1495 13752 11615 -3239 5301
14804E301q83m664J464J9678L200M665O569n591q956J328M929n487q5J6766O886
14789D5120j6730j5482n569j241J4551o070R58l194k0075J5676j167R01K58N060
14775A2996J665j5059j4581o037j373J4066O766L164p24q10o461n670J1242Q276
14761G460R727p557j7544m167J0592J8697M039q036j0906J0316J5469k8836N572
14748D826o125q381L571R711N345N867j6773j291J9212m17k65j97m473Q545j3322
14733E833j9024l371M738J5950J594m343l976M947Q039P539j4382n813P184r132
14719d217m746k328J8280Q021p280R11j665L184n195k0534j284N56j730J1659
14705f368J5069j7047j1760j1111N218L013M821L873m417N036l860M255K1708
$$ plain form
14804 5301 4418 -246 1218 20896 24096 28761 35330 29739 20783 22111 27040 21553 21468 38234 45120
14789 45120 28390 12908 7339 6098 20649 14579 15537 12343 -7732 7944 6777 7678 7936 12996
14775 12996 14661 -398 -14979 -21016 -22389 -8323 -1557 1607 883 73 -6388 -12058 -816 7460
14761 7460 17187 9630 -7914 -12081 -1489 17208 21247 13211 2305 12621 28090 -746 4826
14748 4826 -1299 -9680 -6109 3602 8947 14814 -1959 -3250 15962 15545 15280 15083 10610 19155 5833
14733 5833 -13191 -16562 -11824 4126 5720 1377 -2599 2348 10387 17926 3544 -2269 4915 -4217
14719 -4217 -8963 -11291 6989 15010 7730 8641 6976 10160 4965 -15569 -16853 -16297 -18027 -6368
14705 -6368 8701 -8346 -20106 -31217 -25999 -22986 -18165 -14292 -18709 -13673 -17533 -13278 8430
14692H430K673n089k371J0851J5154r823j9434P990P466J0701Q00j5377j0203
14679A768k428K0424J125Q902J414j755n934o543q355l0612j3585J3451J1936
14666a0192J4072k967n491L413j428r440P68J1211r669O52R861J6143n112P128
14652A8949J0935o380j6758k452q19N877l310j546o122r136l572N200M936p747
14638a1945q308m5J2171N007o105l483r331n751K279J0329K9931J1116o761j5211
14624C893K190R334j263R382N218R91j5924j8772q162J919o235J4973J3862P712
14610A9118j270M959M320q203q932M443J9458m134j7261Q65R654j3363j9226J1269
14596A697J7837j5569p507M999j096Q142O065R640J0931n883j5413J4627J8013
$$ plain form
14692 8430 11103 6014 3643 14494 29648 19825 391 8381 15847 26548 27348 11971 1768
14679 1768 -660 19764 20889 29791 31205 29450 23516 16973 8618 -21994 -35579 -22128 -10192
14666 -10192 3880 913 -4578 -1165 -2593 -12033 -11265 -54 -9723 -9071 790 16933 11821 18949
14652 18949 29884 23504 6746 4294 3475 9352 6042 4496 -1626 -10762 -14334 -9134 -4198 -11945
14638 -11945 -20253 -20298 -8127 -3120 -9225 -12708 -22039 -27790 -25511 -15182 14749 25865 19104 3893
14624 3893 6083 15417 14154 23536 28754 29745 13821 -4951 -13113 -11194 -17429 -2456 11406 19118
14610 19118 17848 22807 27127 18924 9992 14435 33893 29759 12498 13363 23017 9654 -9572 1697
14596 1697 19534 3965 -3542 1457 361 8503 14568 24208 35139 29256 13843 28470 46483
14583D6483o721J0808k2186j9263K1041K1017P07j7426k2642J1894Q429p154n199
14570A9788j5760j3149l811R742J4244j0778j1740K812J3211J2563j4171L00L512
14557F763K5339j1507j6923l832m37n22J572m819P060J5606J0781n274N294r876
14543A9225R356L444R050j7663k33L023K214j8726j6974j2892q622j244n213K171
14529c3084J8196P421n53j3333n187O522J7143O133k2344M558J8751J808L971
14516A0002q522k010m280O558K866J1386l122j1202j4905K434R674k702m613l217
14502a1653m697P222J4794k672p350L269J8496J1342r325K98o353N620n658K103
14488A5436O722j109o504M031J230N276j6619r524n433l858M911J0042j837j1358
$$ plain form
14583 46483 39762 50570 28384 9121 30162 51179 51886 34460 11818 23712 32141 24987 19788
14570 19788 4028 -9121 -12932 -3190 11054 276 -11464 -8652 4559 17122 2951 3251 6763
14557 6763 32102 20595 3672 -160 -597 -1119 453 -4366 2694 18300 29081 23807 29101 19225
14543 19225 28581 32025 41075 23412 23179 26202 28416 9690 -7284 -20176 -28798 -30042 -35255 -33084
14529 -33084 -14888 -7467 -8020 -21353 -26540 -20018 -2875 3258 -19086 -14528 4223 6031 10002
14516 10002 1480 -530 -4810 1748 4614 16000 12878 1676 -13229 -10795 -1121 -3823 -8436 -11653
14502 -11653 -16350 -9128 5666 2994 -4356 -1087 17409 28751 19426 19724 13371 18991 13333 15436
14488 15436 22158 21049 14545 18576 19806 25082 8463 -1061 -6494 -10352 -5441 4601 2764 -8594
14474h594j1547Q663L03R876L357J7064r246j2275J443j554j599J549J3553J2625
14460B3618J230k780M392J945k1966o892O501n998n999j0641r894l103K007J7871
14446i709J2487M450M892J376K386m157n749M646j833l039O313j1918o65O408
14432E888J1217j8188q183J6495J8290j5739j1109L0215L171P012k016j1809j4984
14419A0260j1669M650l240n838l621J4914J6027M201j5966K482J9030q357k1147
14406A726J647Q454R918J623j6689j3707P656J3079J8361q650p204O576J1494
14393C4284n193k9193p929K6063J6227j6982j0406k959j1574L315K736L347L602
14380E338J1019o731j5981n223R938K4318N407j0869m026J582n099j5148K035
$$ plain form
14474 -8594 -20141 -11478 -11175 -1299 2058 19122 9876 -2399 -956 -2510 -4109 -2560 10993 23618
14460 23618 24848 22068 26460 28405 6439 -453 6048 50 -5949 -16590 -26484 -29587 -27580 -9709
14446 -9709 2778 7228 12120 13496 15882 11725 5976 10622 8789 5750 12063 145 -520 5888
14432 5888 17105 -1083 -9266 7229 25519 9780 -1329 28886 32057 39069 37053 25244 10260
14419 10260 -1409 3241 1 -5837 -9458 5456 21483 25684 9718 12200 31230 22873 1726
14406 1726 3373 11827 21745 23368 6679 -7028 628 13707 32068 23418 16214 22790 34284
14393 34284 29091 -102 -8031 18032 34259 17277 6871 3912 -7662 -4347 -1611 1736 5338
14380 5338 16357 9626 -6355 -11578 -1640 22678 28085 17216 13190 14772 9673 -5475 -3440
14367c440K1278R80J540J0607J0885j1027j9649j731O640N181L285J471J2000
14354C8020M680r065n366j9745L025N755K801R238o285j3968l380j5506J0779
14341I83N723J5512M345n784J0764K635j1247N25l160k804N718k7809L49J3408
14327I158J2005K1166O248j0724j9345K912r894j9651l637J681N542J2161Q417
14314A6039j32j0785k311M039L398r977J774O071J3851j087q125L228J3098R456
14300C8537k5423n249J6799j1247j630M485N138l062j6909P8P116J459J4058J982
14286B6132P006p843p612J588Q423J6584J640m284j771j1931j3955L703M167N096
14272B6943j09K140j5717p205q48J5499p506k5285q513J6580N195Q762p224J1665
$$ plain form
14367 -3440 17838 18818 20358 30965 41850 30823 11174 9443 16083 21264 24549 26020 38020
14354 38020 42700 33635 28269 8524 11549 17304 20105 29343 23058 9090 5710 -9796 983
14341 983 6706 22218 26563 20779 31543 34178 22931 23456 20296 17492 23210 -4599 -4250 9158
14327 9158 21163 42329 48577 37853 18508 21420 11526 -8125 -11762 -10081 -4539 7622 16039
14314 16039 15907 5122 2811 6850 10248 271 2045 8116 21967 20880 12755 15983 29081 38537
14300 38537 13114 7865 24664 13417 11787 16272 21410 18348 1439 1517 8633 10092 24150 26132
14286 26132 33138 25295 17683 19271 27694 44278 45918 41634 39863 27932 13977 17680 21847 26943
14272 26943 26834 28974 13257 6052 5204 20703 13197 -12088 -20601 -4021 1174 9936 2712 14377
14258A4377O649j8867m860M576j0796N414J147P52J6869J6167j0450j2994l665
14245D319J7818J685M196L833l025j3283j4877K571R004j664o134J2617l363O649
14231B0346N135o887j5282k290K285r354l230P325O663Q774m481O526J6581j156
14217C0955K518j2152M036Q994J6376O725j1980j059j1063j6730J438q820o974
14204B264R341N25r685m618J6162M900K970L46J9754o138k1650j0534J2351K8946
14190D4934k354n149j0170N138M599q188m53l448M922O288k3526j0295Q32J0417
14176A3547R809m198j244n640j770Q461K752j6070k716n239L086J0834Q677P992
14162B8281l426j8289n897O146Q839k1046j4526M045o071J4263K4180r342p770
$$ plain form
14258 14377 21026 2159 -2701 1875 -8921 -3507 -2360 -1608 15261 31428 20978 7984 4319
14245 4319 22137 23822 28018 31851 28826 15543 666 3237 12241 10577 4443 17060 13697 20346
14231 20346 25481 18594 3312 1022 3307 -6047 -9277 -1952 4711 13485 9004 15530 32111 30955
14217 30955 33473 21321 25357 34351 50727 57452 45472 44413 33350 16620 18058 9238 2264
14204 2264 11605 12130 2445 -2173 13989 18889 21859 22205 41959 35821 14171 3637 15988 44934
14190 44934 42580 37431 27261 32399 36998 28810 28357 24909 29831 36119 12593 2298 3130 13547
14176 13547 23356 19158 17914 12274 10504 18965 21717 5647 2931 -2308 778 11612 20289 28281
14162 28281 24855 6566 669 6815 15654 -5392 -19918 -15873 -21944 -7681 16499 7157 -613
14149f13P367P091K091N45j513J2814R49N364r288j4427J7970J9585L823j6499
14135C5259j8588p165r349p914J9150J3725p031J612j913K180j978r57P047Q936
14121C3014J0485k2840j476l770k740P990k281N062n656J2800M953n317j0443
14108A9781n345j4515J448l535k085N676N567k852p35J5455J6274l902j3257j0499
14094G476j1546k329R336O160Q885N175l423j7506l420J9717M006o367L919J1201
14080C1284n791m829J2516j0600o138r564j929m426J4506M638j1404Q31j7302
14067h208R713R109j2372J5921L581l065j0427N093l76l122l029P249K7892k553
14053C5406r42J0255J09j4669j7053N27J0429q158j4927Q100J5324M750k518K686
$$ plain form
14149 -613 6754 13845 15936 16481 14968 27782 28731 34095 24807 10380 28350 47935 51758 35259
14135 35259 16671 9506 157 -7757 11393 25118 18087 19699 17786 19966 17988 17031 24078 33014
14121 33014 43499 20659 19183 15413 12673 20663 18382 23444 17788 30588 35541 30224 19781
14108 19781 14436 -79 1369 -2166 -4251 1425 6992 4140 3405 18860 35134 31232 17975 7476
14094 7476 -4070 -6399 2937 9097 17982 23157 19734 2228 -1192 18525 22531 16164 20083 31284
14080 31284 25493 20664 33180 22580 16442 6878 4949 523 15029 19667 8263 9094 -8208
14067 -8208 1505 10614 -1758 14163 17744 14679 4252 9345 8969 5847 2818 10067 37959 35406
14053 35406 34464 44719 44828 30159 13106 13633 24062 15904 977 9077 24401 29151 26633 29319
14039B9319Q521n356n498Q082j1992j61r751j1833J2771L937K865J667j1407j733
14025I431n595K878K3567k437q190j4522j2175P573J085J138M156J001M137j323
14011A0724J7259j0561j9698J5211M710j7780K85O667J881o582J3813O261q354
13998A3836l484R805J4247N920M890j1143j1780P098j3924o881Q976m288j0262
13985C010j5085l767J3816J4078N674n153O419J4618J3716n80j2835l231j8747
13972A1933o861J1467J5250j7641n942j190o948R928o074j3348L918K3112K22
13959A7826m838L065M883J3448m270q461L6j7870k435J1783J7726k555k2534k380
13945C424j0482q930L835j456J3545J6276r46N511q669P416R671j187l239j4360
$$ plain form
14039 29319 37840 32484 26986 35068 23076 22915 13164 1331 14102 18039 20904 22571 11164 9431
14025 9431 3836 6714 30281 27844 19654 5132 -7043 530 1615 2753 6909 7910 12047 10724
14011 10724 27983 17422 -2276 12935 17645 -135 150 6817 8698 2116 15929 22190 13836
13998 13836 10352 20157 34404 40324 45214 34071 22291 29389 15465 8584 17560 13272 3010
13985 3010 -12075 -15842 -2026 12052 17726 12573 18992 33610 47326 46746 33911 30680 11933
13972 11933 5072 16539 31789 14148 8206 7016 68 9996 3922 -9426 -5508 17604 17826
13959 17826 12988 16053 20936 34384 30114 21653 21689 3819 1384 13167 30893 28338 5804 3424
13945 3424 -7058 -15988 -12153 -13609 -64 16212 15266 20777 12108 19524 29195 28008 24769 10409
13931A0409J0198J4731L533R011l924j9074p565M160J176K593j3784m197L654
13918A0921L149j1633j5626p371J6262Q058j581j4687J602K1897J0098L397j2368
13905A2118k5642j900N078K742J0227J0826N439o844P183J2599p965K42o02J765
13891B5266J569P60l84Q68n69q46J8949j3140j7383p297O123J2414p082R467n158
13876B3557O585K56P653p880j9352j3111K5301O253q552p048J1975k4663j7514
13863a6540K4366J4590m508k541p380J3018J9588j2348j5250n379n128l385L246
13850B349J3669J9860p782k2190j3021K973J3781J9756K626J1529j2078p730J2652
13837C6394O49K120l559j9319O406J9355R028o598j1960j330m996q747L147m551
$$ plain form
13931 10409 20607 35338 38871 47882 43958 24884 17319 21479 22655 25248 11464 7267 10921
13918 10921 14070 2437 -13189 -20560 -4298 3760 2179 -12508 -10906 10991 21089 24486 12118
13905 12118 -13524 -15424 -10346 -7604 2623 13449 18888 12044 19227 31826 23861 24103 23501 25266
13891 25266 26835 27595 27211 28079 27510 26664 45613 32473 15090 7793 13916 26330 19248 28715 23557
13876 23557 30142 30398 38051 30171 10819 -2292 23009 29262 20710 13662 25637 974 -16540
13863 -16540 7826 22416 17908 15367 7987 21005 40593 28245 12995 7616 2488 -897 2349
13850 2349 16018 35878 28096 5906 -7115 -4142 9639 29395 32021 43550 31472 23742 36394
13837 36394 37043 39163 35604 16285 22691 42046 51074 44476 32516 31186 26190 17443 20590 16039
13823A6039j670R53N83p514J0165q594J3298r358k72j980n904m271K271j770o260
13808d284P501J2541j0839J5334J9688n807j7923j4935P211J0481R80j576m888
13795A3484N370M701l333n275j0750Q510L023j3789Q497K706l998N802k0365j5367
13781b0784R334m675p829K7574K4298q458k572j4776j2494Q608j0084P343J0306
13768E791J2121K0596P736k1899j2561j1084K687K0685J1240j2266q527J434J6053
13755C2006R860j4146k5757J0690L316N40R327n406j3007m364k935K4526L931
13742B8581o428P443O078k534L462p519J178K254J342p573j296R06J5686Q795
13728E0375o242J3360J0740k9817j6751K335l003j8806j4149Q195J6124J2972
$$ plain form
13823 16039 14369 15322 15905 8391 18556 9962 23260 13902 13630 11650 5746 1475 3746 1976 -4284
13808 -4284 3217 15758 4919 20253 39941 34134 16211 1276 8487 18968 19948 18372 13484
13795 13484 18854 23555 20222 14947 4197 12707 15730 1941 10438 13144 9146 14948 -5417 -20784
13781 -20784 -11450 -16125 -23954 3620 27918 19460 16888 2112 -10382 -1774 -11858 -4515 5791
13768 5791 17912 38508 46244 24345 11784 700 3387 24072 35312 23046 14519 15953 32006
13755 32006 41866 27720 1963 12653 15969 16509 25836 20430 7423 3059 124 24650 28581
13742 28581 22153 29596 35674 33140 36602 29083 30261 32515 33857 26284 24988 25894 41580 50375
13728 50375 44133 57493 68233 38416 21665 24000 20997 2191 -11958 -3763 12361 25333
13716B5333J1714K412p696l0077j1515J3598R012r43j0611K508J0525K553Q23
13703A7636j2779N156J1505n799j1278N536K1721R220j6659p209k238N588l346
13690A7054L828P295J8741L05j0503j538j876n997n430M054l388K3402J8646J0727
13676G5320j0893o189j8141k2325N908J0439k695o355O240j3909l924K180K2173
13663C7829j2235j2514n16J1619J7890p633N100K452k578J2742J6731j0306j2107
13650D6474j0113j4643K825l799J0302l209l652K966o263J2053M09j1582n372
13637A6396o352l175K1632J0781m456n817R399j3201J717K675q145Q618o442j1423
13623A2207o887J5123J7309P531R85L937L755j5170k00R339K277O4P914j1507
$$ plain form
13716 25333 37047 39459 31763 1686 -9829 3769 12781 11838 1227 3735 14260 16813 17636
13703 17636 4857 10013 21518 15719 4441 9977 31698 40918 24259 17050 14812 20400 17054
13690 17054 20882 28177 46918 47223 36720 35182 33306 27309 21879 25933 22545 45947 64593 75320
13676 75320 64427 58238 40097 17772 23680 34119 31424 25069 31309 17400 13476 15656 37829
13663 37829 25594 13080 12564 24183 42073 34440 39540 41992 39414 52156 68887 58581 46474
13650 46474 36361 21718 24543 20744 31046 27837 24185 27151 20888 32941 33350 21768 16396
13637 16396 10044 6869 28501 39282 34826 29009 38408 25207 26924 29599 21454 30072 23630 12207
13623 12207 5320 20443 37752 45283 46268 50205 53960 38790 38590 47929 50206 50270 58184 46677
13609D6677m05q411J0265J847o143m116j1351p948m710P8J0378J943k0063M576
13595A2617P97q935j152M663R276L130J6189J2831j7381P11Q566J0230J1311o355
13581E6498r654L90J0655J5942K823q13J789j5933r095K378o006K593j1261l0458
13567I848n401M180J6247J8630K120k0901k3597K4082J9045P505k638J49J4793
13554F4062K558k422o274o275K52J2710M388l2785M529L865R240N69j7263k9745
13540G409N227R363J6815N571O261o282O460J922J736L445N686j2326L284l100
13526E1471L988r558L082j0775j2440J0245M895j803j839J9447N819k088o006
13513E4438R232l144M233k282R070R686N605r135J668l892j2252P532j520J948
$$ plain form
13609 46677 46272 37861 48126 49973 43830 39714 28363 20415 15705 15783 26161 28104 8041 12617
13595 12617 13414 4479 3327 7990 17266 20396 36585 49416 32035 32746 41312 51542 62853 56498
13581 56498 46844 47234 57889 73831 76654 75841 77630 61697 52602 54980 48974 51567 40306 9848
13567 9848 4447 8627 24874 43504 45624 24723 1126 25208 44253 51758 49120 49269 64062
13554 64062 66620 64198 57924 51649 51901 64611 68999 36214 40743 44608 53848 54417 37154 7409
13540 7409 12636 21999 38814 44385 50646 44364 50824 52746 54482 57927 63613 51287 54571 51471
13526 51471 55459 45901 48983 38208 25768 36013 40908 39105 37266 56713 62532 60444 54438
13513 54438 63670 60526 64759 62477 71547 81233 86838 77703 79371 75479 63227 70759 69239 71187
13499G1187N546J7066L182k852r14J7606R502K6828K0795K042K9903L9857L6691
13486B76439P9537J22252J64422K67076L11542K97930K18558N5997j05704j82253
13476A505796k14820k58304k51052j90174j43036r7018n7546k7231j9589l2519
13466B14507k375r119k1319k8789j4365o644M732p284r480J441j3684k0073k918
13453H4630P350j0230k327O495j0441r792J7798M086j1202j3599M399l831Q377
13440G1713n010L735l558J956J6148J5909k801P5k086j2178j5615j1741R111J1965
13426G7623n866j1757q359K874n506n452k882Q019K3234L351j5290q25J3207N201
13412G7572j2620j4081r630o311P06n448p169J9619O020j7106k293J4555O201
$$ plain form
13499 71187 76733 93799 96981 94129 93215 110821 120323 147151 167946 169988 199891 239748 276439
13486 276439 355976 478228 642650 909726 1221268 1519198 1737756 1793753 1688049 1505796
13476 1505796 1290976 1032672 781620 591446 448410 351392 293846 266615 247026 214507
13466 214507 212132 203013 181694 152905 138540 131896 136628 129344 119864 121305 107621 87548 84630
13453 84630 91980 81750 79423 85918 75477 65685 83483 87569 76367 62768 67167 63336 71713
13440 71713 66703 70438 66880 68836 84984 100893 98092 98167 96081 83903 68288 56547 65658 77623
13426 77623 71757 60000 51641 54515 49009 43557 40675 48694 71928 75279 59989 59164 72371 77572
13412 77572 64952 50871 41241 34930 35636 30188 23019 42638 48658 31552 29259 43814 50015
13399E0015l731J2506O247n233J3044J3446J3968J3941j3439l3923j3916l023
13387D9902k3466k5313J8352J1041l220m946N163Q971j2224k200J3898K871l044
13374C5785M090k020r351J9J3206o874k218J7998P344n753m061m52k164P73l382
13359D2940n028N0m003P570J1236j5523k62J8311J0015k49n590K906n392Q794
13345F5775J2117j3147k0336k322J2058N349q608J2997O025l039j8299O25J2751
13332F1946J0948P481J1906k913p918r367K598m791j3474k356m430j4874P29L0670
13318F6155L9047J2359L391M071j4682j6642j5863r673j036J9940J4121j0216
13306I0972J720J0150m932m535J7648M790o165l629j9933j2205O643o334J188
$$ plain form
13399 50015 46284 58790 65037 59804 72848 86294 100262 114203 100764 66841 52925 49902
13387 49902 26436 1123 19475 30516 27296 22350 27513 36484 24260 22060 35958 38829 35785
13374 35785 39875 37855 28504 28523 41729 34855 32637 50635 57979 52226 48165 47713 45549 46322 42940
13359 42940 37912 37962 33959 41529 52765 37242 36980 55291 65306 65057 59467 62373 56981 65775
13345 65775 77892 64745 44409 42087 54145 59494 50886 63883 69908 66869 48570 49195 61946
13332 61946 72894 80375 92281 89368 81450 72083 74681 69890 56416 54060 49630 34756 35485 66155
13318 66155 105202 117561 120952 125023 110341 93699 77836 68163 67127 87067 101188 90972
13306 90972 92692 102842 97910 93375 111023 115813 109648 106019 86086 73881 80524 74190 75378
13293G5378K3644r871j4971M83K7439L020K637Q357O105j784p976q563L4764J5611
13279A54273M5957L8194K8904O68K2023K96k5933m1869l9045l2649q201L2304
13267A74922L695j9694o437l947j1267r305r762k0297j8172j0820J6488j24o12
13254H4668k03O181M029r154J4532l95o167r496j6061o507M582j2889k401J8536
13240F9255J0463j9633n285l28j5928q311P851M72j3944j3012j521J2620R303
13227C2002q373p210p448j2176l320q644j1404r416m885j6507k9406k0311k2689
13214a29787n9579p3872m1650P313O0750J24155J63731J28534J02791Q1780P5247
13203D39413J9328j0817k1451k1782l8660k0948j6481m04m399J027o179n602p826
$$ plain form
13293 75378 99022 89151 74180 74663 102102 105122 107759 116116 122221 120437 112461 103898 138662 154273
13279 154273 200230 238424 267328 267996 290019 290315 264382 222513 183468 150819 142618 174922
13267 174922 178617 158923 152486 148539 137272 127967 118205 97908 79736 68916 85404 85280 84668
13254 84668 84465 90646 94675 85521 100053 99658 93491 83995 67934 61427 66009 53120 50719 69255
13240 69255 79718 60085 54800 54472 38544 30233 38084 38556 24612 11600 10079 22699 32002
13227 32002 23629 16419 8971 -3205 -6525 -15169 -26573 -35989 -40874 -57381 -86787 -107098 -129787
13214 -129787 -189366 -263238 -304888 -297575 -236825 -112670 51061 179595 282386 364166 439413
13203 439413 458741 447924 426473 404691 366031 345083 328602 328198 323799 324826 318647 313045 305219
13190C05219j0747N496P164O145K0658k378j6984j2288o980Q168Q082J0569L24
13177C22448r70k14o92K3250Q892K0815L0445J5584J9732K3528j398k2773r495
13164D29152j6187k198m346q052j3734K82J6937P526K777J2881P621j0103L039
13151D25595K7077M6627J9405K3073L1572M8422J1204p719k3991l1204l6595m4744
13139D88722l9722k0360j5676L284J042Q007n062j2074p052j2912j8448m270J1024
13126C76503J6450J6725Q109P864J7829n73j103p027M727Q843Q81j88J7520L3420
13112D99980J6275K796j1364o064J234J0364J4275N882J3857K1878J4626J5757
13100E99496K4100K1563K7428K4406K1035L1312K8917l455j5725j060K4801K1883
$$ plain form
13190 305219 294472 299968 307132 313277 333935 331557 314573 302285 295305 303473 311555 322124 322448
13177 322448 321478 321264 320572 343822 352714 373529 403974 419558 439290 462818 461420 438647 429152
13164 429152 412965 410767 406421 398369 384635 384917 401854 409380 412157 425038 432659 422556 425595
13151 425595 452672 499299 518704 541777 573349 621771 632975 625256 601265 570061 533466 488722
13139 488722 449000 428640 412964 416248 417290 425297 420235 408161 401109 388197 369749 365479 376503
13126 376503 392953 409678 417787 425651 443480 442907 441804 434777 439504 448347 449228 449040 466560 499980
13112 499980 516255 519051 507687 501623 502857 513221 527496 533378 547235 569113 583739 599496
13100 599496 623596 645159 672587 696993 718028 749340 778257 774802 759077 758017 782818 804701
13088H04701K6978L8414K7160N144K8361K1288N3058M7037K7299M0939N5576O5424
13076A241379O8899N1751O3850O5919L6375K9404K5152M3852P1405O0099M1891
13065A799976L1004L9355M9173M9341N7030Q0174Q9105J04288J23049J30982J20612
13054B674089J64536J82834J81792J89824K18359K51457K53767K68446K83518
13045D668622K82228L40533M01188M97144N75102O50904P55260Q77800J057239
13036A0106020J277589J522056J825901K099029K373008K727702L293660M125263
13028B9350228N286445O970016R609119J3888755K1114986L3436925N1427092
13021A71083566O4910674N9400509L7619861N190097k2016105l9437705m7985710
$$ plain form
13088 804701 831679 870093 897253 902397 930758 952046 1005104 1052141 1079440 1120379 1175955 1241379
13076 1241379 1310278 1362029 1425879 1491798 1528173 1557577 1582729 1626581 1697986 1758085 1799976
13065 1799976 1830980 1870335 1919508 1968849 2025879 2106053 2195158 2299446 2422495 2553477 2674089
13054 2674089 2838625 3021459 3203251 3393075 3611434 3862891 4116658 4385104 4668622
13045 4668622 4950850 5291383 5692571 6189715 6764817 7415721 8170981 9048781 10106020
13036 10106020 11383609 12905665 14731566 16830595 19203603 21931305 25224965 29350228
13028 29350228 34636673 41606689 51215808 65104563 86219549 119656474 171083566
13021 171083566 235994240 295394749 333014610 338204707 316188602 276750897 228765187
13014B28765187m9257211m6927803l7454632k5028309j5946185j0408363p029106
13007C6713578m889144l560413k773477k367129k054867j865402j753951j662303
12999A5786892j552327j403867j201723j071302r43065q32944p44995o61244o02460
12990F772965n57955m91041m54381m01040l66407l33482k81899k47561k28763
12981C410436j98152j98057k05417j64738j41893j61066j71257j86823j82602
12972A800431j25301j11245j10823r8638j05348q1060p5220m5011n6364n5411
12962I36010k8751k4391j2536l7774m4374k7080j7124j2750k8850l5346l4469
12951F32565k7091m6285j8580k1298j2269j6022j9581k4909l2338k2773j0299
$$ plain form
13014 228765187 179507976 132580173 95125541 70097232 54151047 43742684 36713578
13007 36713578 31824434 28264021 25490544 23123415 21068548 19203146 17449195 15786892
12999 15786892 14234565 12830698 11628975 10557673 9614608 8781664 8036669 7375425 6772965
12990 6772965 6215010 5723969 5269588 4868548 4502141 4168659 3886760 3639199 3410436
12981 3410436 3212284 3014227 2808810 2644072 2502179 2341113 2169856 1983033 1800431
12972 1800431 1675130 1563885 1453062 1354424 1249076 1168016 1092796 1047785 991421 936010
12962 936010 907259 882868 870332 832558 788184 761104 743980 731230 702380 667034 632565
12951 632565 605474 559189 540609 519311 507042 491020 471439 446530 414192 391419 381120
12940C81120N30j8169j2051k1501p468j533N009l005l449j7509j3330j6045o729
12927B65870O080j174j3969l1632j9682K711L343K206J934k8336l0129K064p211
12914A52075j8275J1476J4748q89j2005p510j1186k4086j5358l491Q753P461J1135
12901A12848K6316o399j701L667o215q264m748k0890o028J0876J7353J2700Q38
12888A30353j9351j0097k6389o998j4142l0254j2703j9693j0798J130k580j0966
12876c2488l860j3074k2416j4322K516J551k6895l3013r369j9897J669K9687K9936
12863a09975J7662J9774O110L961n416J338N639r409j9383l6213q996K3312K3038
12850h8558K8916J0894l426j2625j9118k2046m517J0029N395p612k4167l3617
$$ plain form
12940 381120 381650 363481 351430 329929 322461 320928 325937 322932 319483 301974 288644 272599 265870
12927 265870 271950 270776 256807 225175 205493 208204 211547 213753 215687 187351 157222 159286 152075
12914 152075 133800 145276 160024 159135 147130 139620 128434 104348 88990 85499 94252 101713 112848
12901 112848 139164 132765 131064 134731 128516 120252 115504 94614 88586 99462 116815 129515 130353
12888 130353 111002 100905 74516 67518 53376 23122 10419 -9274 -20072 -18942 -21522 -32488
12876 -32488 -36348 -49422 -71838 -86160 -83644 -82093 -108988 -142001 -151370 -171267 -169598 -139911 -109975
12863 -109975 -92313 -72539 -66429 -62468 -67884 -66546 -60907 -70316 -89699 -125912 -134908 -111596 -88558
12850 -88558 -59642 -48748 -52174 -64799 -83917 -105963 -110480 -100451 -95056 -102668 -126835 -160452
12838a60452k0494o412k3856l9854k5927j734J895O3150J22947J64381J46909
12827B20553J09505O1922L6224K7295m1274p1417m9212j1542l7482m1958j9632
12816A82982l1093k8555j4758p49R289j1717j2440o166r834L140L246J7260J4419
12803A15024J778j156J275K0352P2m0613j7954R408N479j0138K494j5382j5331
12790E5308n878q49N1j5914j0031o993N359K5924N732P891j4002K504n30j2342
12776C6230N380k723J0031R933Q58o68R736j568j5452O710n972j2255k241p50
12762C7249J996Q010q146J012k94N195J3839n707j5573l584K08j0000k2380N053
12748F878J6898N810j041j2135l794k897m378J4570n993k6801Q656J8483J9471
$$ plain form
12838 -160452 -180946 -187358 -211214 -251068 -276995 -278729 -276834 -213684 -90737 73644 220553
12827 220553 330058 391980 428204 455499 414225 342808 293596 282054 244572 202614 182982
12816 182982 151889 123334 108576 107827 117116 105399 92959 86793 76959 80099 83345 100605 115024
12803 115024 116802 115646 116921 137273 137345 96732 78778 88186 93665 83527 86021 70639 55308
12790 55308 49430 48581 48632 32718 22687 15694 21053 46977 52709 60600 46598 49102 48572 36230
12776 36230 41610 38887 48918 58851 59709 59041 68777 67209 51757 58467 52495 40240 37999 37249
12762 37249 39245 47255 39109 40121 39827 45022 58861 53154 37581 33997 34205 24205 1825 6878
12748 6878 23776 29586 28545 16410 12616 9719 5341 19911 13918 -12883 -4227 14256 33727
12735C3727o294m351K269L996J289J0762k5722j6877n974J7869K1883l583j6498
12722A2496n843j4047j4411l867P120J5426J8234N851N217J0058j3849q142l938
12709A0305l1048n964l413J0756K2775J2626P693P482J6091n692j8318n865J1335
12696B8763Q159m77j533m045N463p566r323p398J201P910R48P095J996L733l018
12681C1908k212K0047J181k076j7487n566L320P536q49j3937j0810p021N248J6511
12667B5793j777q740K478J4397m461n437r652r462j1406m501J6734J2410j395
12654A4981j6225k2349R162J3965N636j1115Q63J1971l327j6169q710J7429M774
12641H86K358k338J939K695o426N991q543J9263J9886j0610r337L322j1742j5462
$$ plain form
12735 33727 27433 23082 25351 29347 30636 41398 15676 -1201 -7175 10694 32577 28994 12496
12722 12496 6653 -7394 -21805 -25672 -18552 -3126 15108 20959 26176 36234 22385 14243 10305
12709 10305 -20743 -26707 -30120 -19364 3411 16037 23730 31212 47303 41611 23293 17428 28763
12696 28763 36922 36445 34912 30867 36330 28764 19441 12043 13244 21154 22102 29197 31193 34926 31908
12681 31908 29696 49743 50924 48848 31361 25795 29115 36651 35802 21865 11055 4034 9282 25793
12667 25793 24016 15276 17754 32151 27690 22253 12601 3139 -8267 -12768 3966 16376 14981
12654 14981 -1244 -23593 -14431 -466 5170 -5945 -5082 6889 3562 -12607 -21317 -3888 886
12641 886 3244 906 2845 5540 -886 5105 -3438 15825 35711 25101 15764 19086 7344 -8118
12627h118p717n916O87K3210O150r843L985p306j6501J5209O282O694j6744j9548
12613b9476L016Q966r372R270L620O582k0222k407J6596K0997O379r106o7J0101
12599A4877j0447N528j341m125J760m915L329J0565J3107q212m865L065K584J338
12585B2248N889k0253O42l877Q461J6383m158j471q108q731j396j1762j4375J516
12571a8992J0168P110K8077J5402J3911J3260J1447j197Q050J8467K6420K9009
12559A61132K0036K8800O6498R0581J39024J78004K48771L31129L13145J76049
12549A753169K0545j04721k03245k63492k62134k29274j86720j37590r2485o1167
12539B32886m4018k4130k8530J0278K035j4961J953m573k4771k2809q427p718
$$ plain form
12627 -8118 -15835 -21751 -21064 2146 8296 -1547 2438 -4868 -21369 -6160 122 6816 -9928 -29476
12613 -29476 -26460 -17494 -26866 -17596 -13976 -7394 -27616 -30023 -13427 7570 13949 4843 4776 14877
12599 14877 4430 9958 8617 4492 6252 1337 4666 15231 28338 20126 15261 18326 20910 22248
12585 22248 28137 7884 8526 4649 13110 29493 25335 23864 15756 7025 5629 -6133 -20508 -18992
12571 -18992 -8824 -1714 26363 41765 55676 68936 80383 79186 87236 105703 132123 161132
12559 161132 181168 209968 276466 367047 506071 684075 932846 1263975 1577120 1753169
12549 1753169 1773714 1668993 1465748 1202256 940122 710848 524128 386538 294053 232886
12539 232886 188868 164738 136208 146486 148521 133560 135513 130940 106169 83360 74933 67215
12527F7215r733n814n787K598j0767p664k3870q213o039J4292J2607L161P886
12514B9872Q306j598j8429M111P145m878k1594m101J2272P364j3441l459J5065
12501A6635j4821m038J260J4097k757k1408j4059L281J6444K1903J4926N637j495
12488C5605l682r982r021k5981q290l211K7503L845o6j692L592j4234m738P331
12474c021n804l590M656k542j72m993j9511L606J6065J6743N547K955j178J253
12460A0014m735j5098j5593k365M732o772k969N309K1696R870j8501q31L498r922
12446b1667m938k567j461k2673L750k60P739k718K801J3820n68n353K94J966n762
12431c7597J026N032r345L598J4757M182L250R577J707J8217j1124k48N895n024
$$ plain form
12527 67215 57482 51668 45881 48479 37712 30048 6178 -2035 -8074 6218 18825 21986 29872
12514 29872 38178 36580 18151 22262 29407 24529 2935 -1166 11106 18470 5029 1570 16635
12501 16635 1814 -2224 -964 13133 10376 -11032 -25091 -21810 -5366 16537 31463 37100 35605
12488 35605 31923 21941 12920 -13061 -21351 -24562 2941 6786 6720 5028 8620 -5614 -10352 -3021
12474 -3021 -8825 -12415 -7759 -10301 -10473 -15466 -34977 -31371 -15306 1437 6984 9939 8761 10014
12460 10014 5279 -9819 -25412 -27777 -23045 -29817 -32786 -27477 -5781 4089 -14412 -15243 -11745 -21667
12446 -21667 -26605 -29172 -30633 -53306 -49556 -49816 -42077 -44795 -41994 -28174 -28742 -34095 -33801 -31835 -37597
12431 -37597 -36571 -31539 -40884 -37286 -22529 -18347 -15097 -5520 -3813 14404 3280 3032 8927 3903
12417C903j248k2531N30P09j904J6623p039o228l441K7093Q044j0451q948j7527
12403b2415L982J3938L508N599j1061J3032o92K703L548r93j2840m898J341J7751
12389A2503k467j9036j2728l653j77J0735j5857j5162K6357J5343o82j629k124
12376h577R698q788l292L090r603o584K2298R803r64p933L712O441m020o847j7146
12361a8712J530M635M055M614j997m695J497J2015J1277J1115j2705r928k8095
12348b5394J345K9511N505Q597q77j0035j4960q324p96j301q024o819o75j3344
12334d5591q782J3876J7251J0317K592l098P018j92p000J2249K674J251j603j2502
12320a1540j0581j527J682J0483Q692j0793L501l424o226J2915N850o104j2715
$$ plain form
12417 3903 2655 -19876 -19346 -18637 -20541 -3918 -10957 -17185 -20626 6467 14511 4060 -4888 -22415
12403 -22415 -18433 -4495 -987 4612 -6449 6583 5891 8594 12142 11149 -1691 -6589 -5248 12503
12389 12503 10036 -9000 -21728 -25381 -25558 -14823 -30680 -45842 -19485 -4142 -4824 -6453 -8577
12376 -8577 1121 -7667 -10959 -7869 -17472 -24056 -1758 8045 7081 -852 2860 9301 5281 -1566 -18712
12361 -18712 -17182 -12547 -8492 -3878 -5875 -10570 -9073 2942 14219 25334 12629 2701 -25394
12348 -25394 -24049 5462 10967 19564 18687 8652 -6308 -14632 -15428 -16729 -24753 -31572 -32247 -45591
12334 -45591 -54373 -40497 -23246 -12929 -10337 -13435 -6417 -6609 -13609 -1360 1314 2565 962 -11540
12320 -11540 -22121 -23648 -21966 -11483 -2791 -13584 -10083 -13507 -19733 -6818 -968 -7072 -19787
12307a9787P88m421J1533q119o05J9534j536p912J0362K154j2511K557m229R310
12293b882J1373n464p801o930K571m054K4568Q535j8336k332j3245n487k229L940
12279a7773k644J2685L945j1088O693J3650q927k0154J778J2578J033p588O578
12266i234J128Q219O407j2171j4965Q69J5867O76j0546j2684J4320K488L352n979
12252a2253J242K1698K338n986k1426l543m120j7328L845J0239N550O603p821
12239b0962n71n167m341J3719L011k3068O616J7237J6966L478j127J745n331m064
12225a859J2355m885j1925K751l3l137N888J2227j7496j0786l740M403l875q067
12211b8179R254J5997P348N019J5245k216J774N30k3216j4656Q241O738m038R535
$$ plain form
12307 -19787 -18999 -23420 -11887 -20006 -20611 -1077 -2613 -10525 -163 1991 -10520 -7963 -12192 -2882
12293 -2882 8491 3027 -4774 -11704 -9133 -13187 11381 19916 1580 -752 -13997 -19484 -21713 -17773
12279 -17773 -20417 -7732 -3787 -14875 -8182 5468 -3459 -23613 -21835 -9257 -8224 -15812 -9234
12266 -9234 -8106 113 6520 -5651 -20616 -19747 -3880 -3204 -13750 -26434 -12114 -9626 -6274 -12253
12252 -12253 -11011 10687 13025 7039 -14387 -17930 -22050 -39378 -35533 -25294 -19744 -13141 -20962
12239 -20962 -21533 -26700 -31041 -17322 -14311 -37379 -30763 -13526 3440 6918 5791 7536 2205 -1859
12225 -1859 10496 5611 -6314 -3563 -3596 -6733 -845 11382 -6114 -16900 -20640 -16237 -20112 -28179
12211 -28179 -18925 -2928 4420 9439 24684 22468 24242 24772 1556 -13100 -4859 1879 -2159 7376
12197G376p392j2282O410J774q519J3775n501j4224m363J651k725p961K1842K4590
12183A4451q603q670j0952J736M346j0521j1638J0331J143K2677J3628j2005l529
12170B394j3497q74j0544k490R147o982M759N200M548J8828l710p001j1283K2
12156a1483J6765R942n120j2185M149J1891J4348o509k2002K6585K5711K847l977
12143E0962Q503J5100R663J5103o093K357K3481Q89N408J7849R438n994j4322
12130A32344k801J7040O815j380m384n58J6414n494J8M299Q27Q184Q915J6102
12116A96341P192k9306l2742L735J3929j6477j8853j0287k8k8433k5K6560k092
12103A09514j7774k2843j4681k4985R7J3080l91j0654J223M186m558j570k033
$$ plain form
12197 7376 -16 -12298 -5888 -4114 -12633 1142 -4359 -18583 -22946 -21295 -24020 -31981 -10139 14451
12183 14451 5848 -2822 -13774 -12038 -7692 -18213 -29851 -19520 -18377 4300 17928 5923 2394
12170 2394 -11103 -11977 -22521 -25011 -15864 -22846 -18087 -12887 -8339 10489 6779 -222 -11505 -11483
12156 -11483 5282 15224 10104 -2081 2068 13959 28307 21798 -204 26381 52092 54939 50962
12143 50962 59465 74565 84228 99331 93238 95595 119076 119965 125373 143222 152660 146666 132344
12130 132344 129543 146583 153398 152018 147634 147076 163490 157996 158014 162313 163140 171324 180239 196341
12116 196341 203533 174227 141485 145220 159149 142672 123819 113532 113504 85071 85046 111606 109514
12103 109514 91740 68897 54216 29231 29328 42408 42017 31363 32586 36772 32214 30644 28611
12090B8611o307j2965l710n37n949p672O602m976O097L600J201J2634N323k3591
12076a639j0964l094J8625Q141q81R737R727r485j3843K664J5142J1055k0990
12063A4195l019J6068j851j5389r871j3776j601J0711k938r047k818P315Q331
12050c690N664O254j2771k418P55J1254K504j0163j6254k809k601J1676J39L603
12036h857o877j2894k144J0375J0756R594M28l993j1467p667M380r181Q352R594
12022i601M69j202p553k350n747j0371J0115O915J5662j036o412P65P05q641O89
12007a7593J9000l6j2261q426N251l876L226R229j443j0883J1127J7871m179j0639
11993c632j5220P721j328q225M925J5912l276M26R167k8428m140J0856L793J4359
$$ plain form
12090 28611 22304 9339 5629 5092 -857 -8529 -1927 -6903 -806 2794 3995 16629 21952 -1639
12076 -1639 -12603 -15697 2928 11069 10188 19925 29652 20167 6324 8988 24130 35185 14195
12063 14195 11176 27244 25393 10004 133 -13643 -15244 -4533 -7471 -16518 -19336 -12021 -3690
12050 -3690 1974 8228 -4543 -6961 -6206 5048 7552 -2611 -18865 -21674 -24275 -12599 -12460 -8857
12036 -8857 -15734 -28628 -30772 -20397 -9641 -47 381 -3612 -15079 -22746 -18366 -27547 -19195 -9601
12022 -9601 -9132 -10334 -17887 -20237 -25984 -36355 -26240 -19325 -3663 -4699 -11111 -10346 -9641 -18282 -17593
12007 -17593 1407 1371 -10890 -19316 -14065 -17941 -14715 -5486 -6929 -17812 -6685 11186 7007 -3632
11993 -3632 -18852 -11131 -12459 -20684 -15759 153 -3123 -2697 6470 -21958 -26098 -15242 -11449 2910
11979B910J0029Q87j755Q4j4678k3259q339K1227R155M366p82R827J679l0894
11965a9543l089K6959J9923o658Q988l131j2472m004n017j2363j7663J9004J2399
11952C333j0271o723J0584j0802L292j674o10L717R288n048l470j2410j3992k683
11938c7469n485l272J6188R849o576P843O715J254L704J8186J120j0477o445q656
11924a3521m061Q418J8677L971m853j280M106J023r223n757n001J1102J790o923
11910a532K0674l409l0186j2165j0291J9950J0976N118J456j1127l811P93J4066
11897E12n027R827L874R154l899J3682n958o30M930j953k1167l027o972n734j982
11882a4370q363p554J3781K967j2232n946J2216J1264l688m163k674j8272l922
$$ plain form
11979 2910 12939 13826 12071 12155 -2523 -25782 -34121 -12894 -3739 627 -155 9672 11351 -19543
11965 -19543 -22632 4327 24250 17592 26580 23449 10977 6973 1956 -10407 -28070 -9066 3333
11952 3333 -6938 -13661 -3077 -13879 -10587 -12261 -12871 -9154 134 -4914 -8384 -20794 -34786 -37469
11938 -37469 -42954 -46226 -30038 -20189 -26765 -18922 -12207 -10953 -7249 10937 12057 1580 -4865 -13521
11924 -13521 -17582 -9164 9513 13484 8631 7351 11457 12480 3257 -2500 -7501 3601 5391 -1532
11910 -1532 19142 15733 -14453 -26618 -36909 -16959 -5983 -865 591 -10536 -14347 -13554 512
11897 512 -4515 5312 9186 18340 14441 28123 22165 21535 26465 24512 3345 318 -6654 -12388 -14370
11882 -14370 -22733 -30287 -16506 -13539 -25771 -31717 -19501 -8237 -11925 -16088 -18762 -37034 -40956
11869d0956m206O080K6511J2356M035L412J2860j0171j7038j8315l991K4039k546
11856g930n360J8382k652J0379q89j7638K14P70o073Q854J6926J437j2607k5491
11842b1678q872J0300Q704j924j5838j0197M79k876J5899Q137L199J7855J214
11829D402l759K126O129J5081j113j9437j510J5564n044j232q342Q910P211n843
11815A3143J72j3927m402m077K489L859N896p86j738m055n13N65j906J0394J5992
11800B1106K1807r239q308k3249q769K741K461R61J752n886l824P929J2365r20
11786A0927j33L250j0646r647N031J1614k997o422j649j3991q368J6297J1095
11773D361O196K269P582n616j8381Q915J3727j2502o923O153o179j8004j2370
$$ plain form
11869 -40956 -45162 -39082 -12571 -215 3820 7232 20092 9921 -7117 -25432 -29423 -5384 -7930
11856 -7930 -13290 5092 2440 12819 11930 -5708 -5494 -4724 -10797 -1943 14983 16420 3813 -21678
11842 -21678 -30550 -20250 -11546 -13470 -29308 -39505 -39026 -41902 -26003 -17866 -14667 3188 4402
11829 4402 643 2769 8898 23979 22866 3429 1919 17483 12439 11207 2865 11775 18986 13143
11815 13143 13315 -612 -5014 -9091 -6602 -2743 3153 2367 629 -3426 -3939 -3374 -5280 5114 21106
11800 21106 42913 33674 25366 2117 -6652 -3911 -1450 -489 1263 -4623 -8447 -518 11847 10927
11786 10927 10794 14044 3398 -6249 -1218 10396 7399 977 -672 -14663 -23031 -6734 4361
11773 4361 10557 12826 20408 14792 -3589 5326 19053 6551 -372 5781 -398 -18402 -30772
11760c0772p340L842K415Q368k436K230J0587l619j4385J6751j0201j192J8334
11747g418O310r505M9Q241R548N593l035j3538p421o215M855o342J9353P317o230
11732A562R870L253j6518N388k36o581m910R19O586k148j0737k57J2076m825j5120
11717b1678J1097K5524K715j3941j2178k307q177r127R429K4424K2628l570j6315
11704H524j2357Q651N717P698O322j3616j1011p102j7360o559J8259L950J7873
11691H989J4290M570j6660k4236J2148R014o673q668J1307o592j3804J5090J3107
11678A1882n447j720L838j5698k2053M365J2030J0709j203l83o828M518L206q618
11664a1402j977M362k513k4436l716J1744L776J2882J5879n358k590j4949J7333
$$ plain form
11760 -30772 -38112 -34270 -31855 -23487 -25923 -23693 -13106 -16725 -31110 -14359 -24560 -25752 -7418
11747 -7418 -1108 -10613 -10564 -2323 7225 12818 9783 -3755 -11176 -17391 -12536 -18878 475 7792 1562
11732 1562 11432 14685 -1833 3555 3319 -3262 -8172 -7253 -667 -2815 -13552 -13809 -1733 -6558 -21678
11717 -21678 -10581 14943 17658 3717 -8461 -10768 -18945 -28072 -18643 5781 28409 24839 8524
11704 8524 -3833 4818 10535 18233 24555 10939 -72 -7174 -24534 -31093 -12834 -8884 8989
11691 8989 23279 27849 11189 -13047 -899 8115 1442 -7226 4081 -2511 -16315 -1225 11882
11678 11882 6435 4715 8553 -7145 -29198 -24833 -12803 -2094 -3297 -3680 -10508 -5990 -2784 -11402
11664 -11402 -13379 -9017 -11530 -35966 -39682 -27938 -24162 -11280 4599 -759 -3349 -18298 -965
11651i65J851Q06m541m910O678l224j332k369J456K388q802m612j777M60J1525
11636g368O687J674j1945j6598j0128J9144k497o03N970k213q605r74r284J0186
11622b6554N221j610N143m770J9073N212q815r11m62l301l918Q898O183k748k801
11607f160J2J410q631q606n139K637r067J1568K6645J2900l317j7723j1844L283
11593a2032J875j2680J349K0775J1666M275j1508r839o185O723J0965j418p108
11580c142r556q229O262J7610J3380R680j6237j2555O204N484K2O247j521r770
11566C879o902o636r675Q065K1362J4299L101M6o727k0476j8560j71P491o42J9047
11551G501m930j9396j1908J2846N744J554N529p52j4219l662Q672K637N205m452
$$ plain form
11651 -965 886 1692 -2849 -7759 -1081 -4305 -5637 -8006 -6550 -4162 -12964 -17576 -19353 -18893 -7368
11636 -7368 -681 993 -10952 -27550 -37678 -18534 -21031 -21634 -15664 -17877 -26482 -27456 -36740 -26554
11622 -26554 -21333 -22943 -17800 -22570 -3497 1715 -7100 -8011 -8473 -11774 -15692 -6794 -611 -3359 -6160
11607 -6160 -6148 -4738 -13369 -21975 -27114 -24477 -33544 -21976 4669 17569 14252 -3471 -15315 -12032
11593 -12032 -10157 -22837 -21488 -713 10953 15228 3720 -6119 -12304 -5581 5384 3966 -3142
11580 -3142 -12698 -20927 -14665 2945 16325 26005 9768 -2787 3417 8901 8923 15170 13649 3879
11566 3879 -3023 -9659 -19334 -11269 10093 24392 27493 27539 20812 336 -18224 -18395 -10904 -11546 7501
11551 7501 2571 -16825 -28733 -15887 -10143 -8589 -3060 -3812 -18031 -21693 -13021 -10384 -5179 -9631
11537i631L095J143j982Q150J0272L739k0042J000J223j5911r091n319q508k73
11523d2135K0013J0215n533N001J4271N262R611J1914j804j3599j0078j0982m793
11510a2637J7033M678l764l630O086j2182J8713m282j3594j3870l837J3034J4992
11497F740l088p927P767r505k359r13L624k903R202j4736l348K0320r010n885
11483a2021O243K0443J3027l410k1083k0913O904l124j0533J0168k320L01n542
11470b1860K82J82N167m04J109J925P270p859q370L53M148m285J963P138l477
11455a6718m43L81j153J1299K0132R000k076n084j8939j7069p503j002n78J2481
11441a7272K1457q886j2654P468J5447r295j4379j1742Q671J2982J6479o220j7035
$$ plain form
11537 -9631 -6536 -5393 -7375 775 11047 14786 -5256 -4256 -3033 -18944 -28035 -33354 -41862 -42135
11523 -42135 -22122 -11907 -17440 -12439 1832 7094 16705 28619 26815 13216 3138 -7844 -12637
11510 -12637 4396 9074 5310 1680 7766 -4416 14297 10015 -3579 -17449 -21286 -8252 6740
11497 6740 3652 -4275 3492 -6013 -8372 -9285 -5661 -8564 638 -14098 -17446 2874 -6136 -12021
11483 -12021 -5778 14665 27692 24282 3199 -17714 -10810 -13934 -24467 -14299 -16619 -16318 -21860
11470 -21860 -21578 -21396 -16229 -16633 -15524 -13599 -6329 -14188 -22558 -22205 -18057 -22342 -20379 -13241 -16718
11455 -16718 -17161 -16780 -17933 -6634 13498 22498 20422 15338 -3601 -20670 -28173 -29175 -29753 -17272
11441 -17272 4185 -4701 -17355 -9887 5560 -3735 -18114 -29856 -21185 -8203 8276 2056 -14979
11428a4979O639J1921j821J2713k13j4009j3459J0106J8620J6391K757n060P92
11415C0398j5328n3n517j9280J1364J7811r336k6362p56J0461O957j2302j0120
11402b2063J3522K0101R190p095M125J918m555r310M525j4313k303M325j187P903
11388D783R558k4850j7055l387J968J2338J3661j617J3861J1225J0249o948l998
11375A9788r361Q437j586j0018o182L891p283j9190n417P442J1055j4565J2117
11362a0872J8490n307M871r642Q47K6m539l686j709n077M237J4056q515k2722
11348b9542j3856J3576K1302o744q475j3627M665R292p38q567K0906K4019Q98
11335A3109j6495p22O092N343L288j224j2366j9750l794N483J119O345j1147J0017
$$ plain form
11428 -14979 -8340 3581 1760 14473 14260 251 -13208 -3102 15518 31909 34666 29606 30398
11415 30398 15070 15017 9500 -9780 1584 19395 10059 -16303 -17059 -6598 359 -11943 -22063
11402 -22063 -8541 11560 20750 13655 17780 19698 15143 5833 10358 -3955 -6258 -1933 -3120 4783
11388 4783 14341 -10509 -27564 -30951 -28983 -16645 -2984 -4601 9260 20485 30734 23786 19788
11375 19788 10427 18864 17278 7260 1078 4969 -2314 -21504 -26921 -19479 -8424 -22989 -10872
11362 -10872 7618 2311 7182 -2460 -1613 -1587 -6126 -9812 -11521 -16598 -12361 1695 -6820 -29542
11348 -29542 -43398 -29822 -8520 -15264 -23739 -37366 -32701 -23409 -24147 -32714 -11808 12211 13109
11335 13109 -3386 -4108 1984 7327 10615 9391 -2975 -22725 -26519 -21036 -19917 -13572 -24719 -14702
11321a4702q81j0481l670n72J1254Q487m406K680j1017n238N647q964L358K3173
11307e332n474r919N018L594J0469K6685j3175q396j7282Q67R575N574j9102j0087
11293b6985J1342J1363P950k575k2372j0874J5152J3590N723j197K163n006Q662
11280F936K3761j5270j3079K492j3513L716K799j017J3554j1884o608K505O4K608
11266b936K350Q033l705m715J0880l989o703m436J158j6030j690J2221L671n888
11252a1779K046L366r193M46L084J0662j7299Q029O784J6753r000j1053R467j501
11238H12Q152o486O261n367k8040q295J2051m957J1668R094J5217j7552m893m196
11224a6531L541J0397q050M693p19K1239J696j2757o110j2705L300Q321l785R350
$$ plain form
11321 -14702 -15583 -26064 -29734 -30306 -19052 -10565 -14971 -12291 -23308 -28546 -22899 -31863 -28505 -5332
11307 -5332 -10806 -20725 -15707 -12113 -1644 25041 11866 3470 -13812 -12945 -3370 2204 -16898 -26985
11293 -26985 -15643 -4280 3670 1095 -21277 -32151 -16999 -3409 2314 1117 3280 -1726 6936
11280 6936 30697 15427 2348 4840 -8673 -4957 -2158 -3175 10379 -1505 -8113 -5608 -5544 -2936
11266 -2936 -586 7447 3742 -973 9907 5918 -785 -5221 -4063 -20093 -21783 -9562 -5891 -11779
11252 -11779 -9733 -6367 -15560 -15114 -12030 -1368 -18667 -10638 -3854 12899 3899 -7154 2313 812
11238 812 8964 2478 8739 3372 -24668 -32963 -20912 -25869 -14201 -5107 10110 -7442 -12335 -16531
11224 -16531 -12990 -2593 -10643 -5950 -6669 14570 16266 3509 -2601 -15306 -12006 -3685 -7470 1880
11210A880J0659K779j4046n113P300o614j7697k3071K066J5885J2616R866q5j2715
11196a6290P551q898J271R813M714l970k0032k087l41q521l767K2285J7424L968
11182C120Q793K487n637j1542n781n494k220p428r726J556J3619k459Q488J4230
11168B006O677k764O685j4178j8135j4428r96J5581P196M741L40l24o17J1521
11154C305J397o994n329j0826K432q78j2238J7945O385r364J4368J588o271l037
11140g517n916o664J4148q82j3314n396J9326O307J0640o16j1090N967r674j4518
11126a9199J659j5763j777J6450N788q04j707QJ5425j4264o28L747j0839J6845
11112e059j1124j1154j154J0807r464j3144j161K3552J4805R244N328k448m325
$$ plain form
11210 1880 12539 15318 1272 -3841 3459 -3155 -20852 -43923 -41857 -25972 -13356 -3490 -3575 -16290
11196 -16290 -8739 -17637 -16366 -6553 -1839 -5809 -25841 -27928 -28269 -36790 -40557 -18272 -848 3120
11182 3120 11913 14400 8763 -2779 -8560 -14054 -16274 -23702 -33428 -31872 -18253 -20712 -12224 2006
11168 2006 8683 5919 12604 -1574 -19709 -34137 -35133 -19552 -12356 -7615 -7275 -7599 -8216 3305
11154 3305 4702 -2292 -7621 -18447 -16015 -16893 -29131 -11186 -4801 -14165 203 1791 -4480 -7517
11140 -7517 -13433 -20097 -5949 -6831 -20145 -25541 -6215 92 10732 10116 -974 4993 -4681 -19199
11126 -19199 -17540 -33303 -35080 -18630 -12842 -13646 -15353 -15345 80 -14184 -14812 -11065 -21904 -5059
11112 -5059 -16183 -27337 -28491 -17684 -27148 -40292 -41453 -17901 -3096 6148 11476 9028 4703
11099D703m303p170m76J655J0146r432J962K560o308l535n837j824j091j6516
11085c5466Q73Q261K4008J0280j3404j4516j3898K701J1011K388j2072K108j5109
11072d2835J5862R057j795J5126J2081k63P509n809j8970O23J211k500n508N555
11058a0656K3J7093R24j2033p776Q927J0760Q912o214N788L286j7502q766k763
11044i997m014j4844Q881J4410J270n157K986R01j5007l47K4373L044m134M62
11030B827Q193j1073J499M285k780n11q380p458j3545Q42J3896R541J7947k4750
11016i467k6366j83L5254k095j0094l357K648q331k5344k49L020J672J1084K0860
11002a0948j42O816M660m09L010N883p803j7294j1577J9310J2508J945l064M590
$$ plain form
11099 4703 400 -6770 -7246 -5591 4555 -4877 -2915 -355 -6663 -10198 -16035 -17859 -18950 -35466
11085 -35466 -34593 -26332 -2324 7956 -5448 -19964 -33862 -31161 -20150 -17762 -29834 -27726 -42835
11072 -42835 -26973 -17916 -19711 -4585 7496 7233 14742 8933 -10037 -9414 -8203 -10703 -16211 -10656
11058 -10656 -10633 6460 7384 -4649 -12425 -3498 7262 16174 9960 15748 19034 1532 -7234 -9997
11044 -9997 -14011 -28855 -19974 -5564 -4294 -9451 -6465 -5564 -20571 -20918 3455 6499 2365 2827
11030 2827 11020 -53 1446 5731 2951 2440 -5940 -13398 -26943 -26101 -12205 -2664 15283 -9467
11016 -9467 -35833 -36016 -762 -2857 -12951 -16308 -13660 -21991 -47335 -47584 -44564 -42892 -31808 -10948
11002 -10948 -11090 -4274 386 -23 2987 8870 1067 -16227 -27804 -8494 4014 5959 2895 7485
10988G485K447N981o65j3106p775j094J5061O406r780q445J58J0107o874o563
10974f657m563j3274p384Q974R057N547m509m27n468Q247P699j195O168l966p613
10959i364M648n889j8979J0899m618J9970K0903Q731k2085q131k418o361j1583
10946b4277K500Q237Q672j509n939q692k780O335p404O749J4288J9831P408j4269
10932I150k43j4845j7887n136N683k32q072P158p05q363K633R865O401j716j223
10917a7532Q131j3944j1327k073O239L664J609M731J2634j5018L436L838J3166
10904b446J4707j1707R95L177J1108K235l391j1038K147Q085n998j9182n063N554
10890a0817M844j0752j3108k443K69J7102K1375k34M037n471j5267r109Q523k958
$$ plain form
10988 7485 9932 15913 15248 2142 -5633 -6727 8334 14740 4960 -3485 -3327 6780 -94 -6657
10974 -6657 -11220 -24494 -31878 -22904 -13847 -8300 -12809 -13236 -18704 -10457 -2758 -3953 2215 -1751 -9364
10959 -9364 -4716 -10605 -29584 -18685 -23303 -3333 17570 26301 4216 -3915 -6333 -12694 -24277
10946 -24277 -21777 -13540 -4868 -6377 -12316 -21008 -23788 -17453 -24857 -18108 -3820 16011 23419 9150
10932 9150 8907 -5938 -23825 -28961 -23278 -23510 -31582 -24424 -25129 -33492 -30859 -20994 -14593 -16309 -17532
10917 -17532 -9401 -23345 -34672 -36745 -30506 -26842 -25233 -20502 -7868 -22886 -19450 -15612 -2446
10904 -2446 12261 554 1549 4726 15834 18069 14678 3640 5787 13872 7874 -11308 -16371 -10817
10890 -10817 -5973 -16725 -29833 -32276 -32007 -14905 6470 6236 10273 4802 -10465 -19574 -11051 -14009
10876a4009O514N197J684o953o084N876K547J4700Q995L320o882j8600j8026m879
10862b6600j2800l116R627O11o606J4974M800K3565M641j5475q065o034Q842n371
10848a7007j8071R798l114p978J1028J5536m969O258M235k436k352r67J0846l449
10834b642j7902n614k189J199K064J3560O329K9351J4028j7989k5170K232N594
10821B851N684O618p010p961j47J1315j5314l7619P880J5154J3222J2381k873
10808D181J1447j3097q213l148r706j2942l996J2035L2129o34r418l772n694n505
10794a6333p812J1997Q638r543q9K905M092J2070M38K048N399o864j0461n725
10780i240J281m009Q424J5775j4993q957L378J567O752M828j0350K366P66o572
$$ plain form
10876 -14009 -7495 -2298 -614 -7567 -13651 -7775 -5228 9472 18467 21787 14905 -3695 -21721 -26600
10862 -26600 -39400 -42516 -32889 -32278 -38884 -23910 -19110 4455 9096 -6379 -14444 -20478 -11636 -17007
10848 -17007 -35078 -25280 -28394 -36372 -25344 -9808 -14777 -8519 -4284 -6720 -9072 -10039 807 -2642
10834 -2642 -20544 -26158 -28347 -27148 -25084 -11524 -5195 24156 38184 20195 -4975 -2743 2851
10821 2851 8535 15153 8143 182 35 11350 -3964 -41583 -33703 -18549 -5327 7054 4181
10808 4181 15628 2531 -5682 -8830 -18536 -31478 -35474 -23439 8690 8056 -1362 -5134 -10828 -16333
10794 -16333 -24145 -12148 -3510 -13053 -13142 -10237 -6145 5925 6363 8411 13810 6946 -3515 -9240
10780 -9240 -7959 -11968 -3544 12231 -2762 -11719 -8341 -6774 -22 4806 -5544 -3178 -2412 -8984
10766h984P487R427R365j2364j0984J279l861M714N153N877n692J310j7967K826
10752a2414L734P084k691l971N338j0286p927N72k200j5487n878K4017K1573k258
10738g94r223k5R328k059N196J0963n581j2971j123N574j0801N91O821J4421Q657
10723A8974j04j7495j4366k927l107K063q653n282J5542J217N990R944q51n420
10709d475o852n950m300L090J3305N026K1830L804m938r103j1446L896J5024m326
10695A4585J5010J2055j2504j2240o501q381k981J6253m098n528n867l761m818
10682h776l2603J4426L9571j0235j5909J5181n297n815J9105j1190j883M651o621
10669e395j1513O057J2420j970k2830j3480m644j1686J0953J5998J2487j4352
$$ plain form
10766 -8984 -1497 7930 17295 4931 -6053 -4774 -8635 -3921 1232 7109 1417 2727 -15240 -12414
10752 -12414 -8680 -1596 -4287 -8258 -2920 -13206 -21133 -20561 -22761 -38248 -44126 -20109 1464 -794
10738 -794 -10017 -10042 -714 -2773 2423 13386 7805 -5166 -6289 -715 -11516 -10925 -4104 10317 18974
10723 18974 18870 1375 -12991 -15918 -19025 -16962 -25615 -30897 -15355 -14138 -8148 1796 945 -4475
10709 -4475 -11327 -17277 -21577 -18487 -5182 -156 21674 25478 20540 11437 -9 3887 18911 14585
10695 14585 29595 41650 29146 16906 10405 2024 -957 15296 11198 5670 -197 -3958 -8776
10682 -8776 -41379 -26953 12618 2383 -13526 1655 -3642 -9457 9648 -1542 -3425 1226 -5395
10669 -5395 -16908 -10851 1569 -401 -23231 -36711 -41355 -53041 -42088 -26090 -13603 -27955
10657b7955R063K1160M859l041j8669j131p839J2394J3906J486j1645p81M545
10644c648N044j807J6720j4483p596M719L790N588k268j9678j1073k551N392J2496
10630i355J1494J279L84m511j2127m965J1031J6805N982j3140j2619m835K6600
10617A2023K2702r598j1131j3738k4075M416q033J443J4411k81K014J5129Q782
10604A4064Q710j4521j5167p356o365O118J4872n964J3189N97j2622j2793J1351
10591e887J0468J3996q525o279n876j0157O909M114M124J4891n942o375R16p508
10577a131n168j244N852N12J866o613n877J2666P365P765K541j6766K105p57q109
10562d993O050k4p962M854L165j5850r445M285L323J1927L842K945K802J6672
$$ plain form
10657 -27955 -18892 2268 7127 4086 -14583 -15714 -23553 -11159 2747 4233 -7412 -8193 -3648
10644 -3648 1396 -411 16309 1826 -5770 -1051 2739 8327 6059 -13619 -24692 -27243 -21851 -9355
10630 -9355 2139 3418 3802 -709 -12836 -17801 -6770 10035 16017 2877 -9742 -14577 12023
10617 12023 34725 25127 13996 258 -23817 -19401 -27434 -25991 -11580 -11861 -9847 5282 14064
10604 14064 22774 8253 -6914 -14270 -20635 -14517 355 -5609 7580 8177 -4445 -17238 -5887
10591 -5887 4581 18577 10052 3773 -2103 -12260 -5351 -1237 2887 17778 11836 5461 6377 -1131
10577 -1131 -6299 -7543 -1691 -1179 687 -5926 -11803 863 8228 15993 18534 1768 3873 3116 -4993
10562 -4993 1057 1033 -6929 -2075 1090 -14760 -24205 -19920 -16597 -4670 -828 2117 4919 21591
10548B1591n086j1569j4837j078r731o674o961j516P709r909J1175K1274J2959
10535G347k0387Q66k738J1999Q163o285m294l967k298j1763J1387k886j3166n156
10521c3178j1147J1739Q210M022j1576k794K9418Q711m032k0002j523k616M977
10508a9791M93p116K1398O180j3701j4865N768O055J9764J039k1262k1238M929
10495c2347J6937J2552k6944l316J1652Q504l175J9588K2006k8986j3730J3658
10483c601M074P696n845r955Q994J0553j5922j1396L192J3329K534j3626o094
10470a6067J5567M547j3029l447m940J3454m931q031r04n881J039O947o887R94
10456b1569k033P709n675q438K704K858J594M016J688O357K763p935j0721P22
$$ plain form
10548 21591 16505 4936 -9901 -10979 -20710 -27384 -34345 -35861 -28152 -38061 -26886 -5612 7347
10535 7347 -13040 -12174 -14912 -2913 5250 -1035 -5329 -9296 -11594 -23357 -11970 -14856 -28022 -33178
10521 -33178 -44325 -32586 -24376 -20354 -31930 -34724 -5306 3405 -627 -20629 -22152 -24768 -19791
10508 -19791 -19298 -26414 -5016 1164 -12537 -27402 -21634 -15579 4185 5224 -16038 -37276 -32347
10495 -32347 -15410 -2858 -29802 -33118 -21466 -12962 -16137 3451 25457 -3529 -17259 -3601
10483 -3601 473 8169 2324 -7631 1363 11916 -4006 -15402 -12210 1119 3653 -9973 -16067
10470 -16067 -500 4047 -8982 -12429 -17369 -3915 -8846 -16877 -17781 -23662 -22623 -15676 -22563 -21569
10456 -21569 -23602 -15893 -21568 -30006 -27302 -24444 -22850 -18834 -17146 -10789 -8026 -15961 -26682 -25960
10442b5960N243Q303J7908J799j1800j3420J6216K0582k010j3289P863n671o792
10429a028R039n463o765J184k1292L784J6537L041j2071l025K620O822J0736N273
10415I392N842j2099p021L195r123M833o87m900J973k974m99k314j5075j2559
10401d2016Q931l524J2584J5175N261l287j0526k578O464n159J2423L124o315
10388i443R268R022m58J2799n478k1113k98p265p305J1121K1254L834j5279n488
10374d829p901o581L217J6028J394r383j4650k512j8482j2168Q709K2905O188
10361a8065j1308J686Q228J833p384m216J957J35N267R090K1925N366j8891J825
10347b552j7863j6092J241l158K514l117p64O593N368j240K4831J0868q674p983
$$ plain form
10442 -25960 -20717 -12414 5494 7293 -4507 -17927 -1711 18871 16861 3572 11435 5764 -1028
10429 -1028 8011 2548 -4217 -3033 -24325 -20541 -4004 -963 -13034 -16059 -13439 -6617 4119 9392
10415 9392 15234 3135 -3886 -691 -9814 -4981 -5668 -10568 -8595 -11569 -12068 -14382 -29457 -42016
10401 -42016 -33085 -36609 -24025 -8850 -3589 -6876 -17402 -19980 -13516 -18675 -6252 -3128 -9443
10388 -9443 -175 8847 8389 21188 15710 -5403 -5701 -12966 -20271 -9150 12104 15938 659 -4829
10374 -4829 -12730 -19311 -16094 -66 1328 -8055 -22705 -25217 -43699 -55867 -47158 -24253 -18065
10361 -18065 -29373 -27687 -19459 -17626 -25010 -29226 -27269 -27134 -21867 -12777 9148 14514 -4377 -2552
10347 -2552 -20415 -36507 -35266 -38424 -35910 -39027 -39791 -33198 -27830 -29070 -4239 6629 -2045 -10028
10333a0028R627J5436K799j0834j3925O672o264k438R417J1111J5028q939M120
10320B1782p08m900k006n617k5070j1905K3855N827J320K755K274Q255k318j7610
10306d066p763k70j1981M35N194j3441Q208P584j636l645r953Q95l780Q439K3553
10291b227J695Q1j5642j0804K934l564l593o916m962J4705J4501L912k348J377
10277a0851j5079L265M234J4128J2579q063k0973N104J7993o332J5381j4104l0931
10264c3649N509J4250P869L011P230j3830K826k442Q244K3212j8091n687N911
10251D363l582J5097N541m435j5373j3837r229K787R074j5371k3406R254J9126
10238a9991L601J780n042n341m050J5903j434r961J3979J3340n308k039j126j1457
$$ plain form
10333 -10028 -401 15035 17834 7000 -6925 -253 -6517 -8955 462 11573 26601 17662 21782
10320 21782 21074 16174 14168 8551 -16519 -28424 -4569 1258 2578 5333 7607 15862 13544 -4066
10306 -4066 -11829 -12099 -24080 -23645 -18451 -31892 -23684 -16100 -17736 -21381 -31334 -30439 -34219 -25780 -2227
10291 -2227 -532 -451 -16093 -26897 -23963 -27527 -31120 -38036 -42998 -28293 -13792 -9880 -12228 -10851
10277 -10851 -25930 -22665 -18431 -4303 8276 213 -20760 -15656 2337 -3995 11386 -2718 -33649
10264 -33649 -28140 -13890 -6021 -3010 4220 -9610 -6784 -9226 -982 22230 4139 -1548 4363
10251 4363 781 15878 21419 16984 1611 -12226 -21455 -18668 -9594 -24965 -48371 -39117 -19991
10238 -19991 -16390 -14610 -19652 -24993 -29043 -13140 -14574 -24535 -10556 2784 -2524 -4563 -5689 -17146
10224a7146k813j806M309J3776L029O318J944j394L318m912n127j029j0327j6688
10210b8548J6864Q169q387l427J674L799l756R386J1758j1714n604j897J9244
10197G561r693k0506p457j1173L794k613k653l324j0879N422P813K0785J803K7901
10183F781K6169p881j1863j049J878j7118j7910o64q73J7587N708p067j8820j1345
10169c6467N669K285l53N705R674K148O6J2242J4835J6112J1918p837k1545j9124
10155d672K196J2360k709m331k480J026J2465l473j1194j512N879n506k222p350
10141a1523J7778O226J543l880m569K465L631Q30n142J387K225n171P791J2988
10127B6579J3832n067j1892k2258J5756K3045J4453j1019j6019k7430l565K613
$$ plain form
10224 -17146 -19959 -21765 -17456 -3680 -651 5667 7611 6217 9535 4623 -504 -1533 -11860 -28548
10210 -28548 -11684 -3515 -11902 -15329 -13655 -9856 -13612 -4226 7532 -4182 -9786 -11683 7561
10197 7561 -2132 -22638 -30095 -41268 -37474 -40087 -42740 -46064 -56943 -51521 -43708 -22923 -21120 6781
10183 6781 32950 25069 13206 12157 14035 -3083 -20993 -21657 -22530 -4943 765 -6302 -25122 -36467
10169 -36467 -30798 -28513 -28866 -23161 -13487 -11339 -11273 969 15804 31916 43834 35997 14452 -4672
10155 -4672 -2476 9884 7175 2844 364 1390 13855 10382 -812 -2324 3555 -1951 -4173 -11523
10141 -11523 6255 12481 14024 10144 5575 8040 11671 12501 7359 8746 10971 5800 13591 26579
10127 26579 40411 35344 23452 1194 16950 39995 54448 43429 27410 -20 -3585 -972
10115i72q544r588J0679p92J7420Q220k126l802p077j2367Q2L934O382o31r813
10100h995j0746l344o178n203q848J1254M310M50J1305R935K713k379k711J6358
10086G921Q475o529j0372m290j5081N191j2707n843P179j5197N822K5845M711
10073d875M552L813J7741j2106k388J036R155L433r257q592Q513j2577j9061L882
10059a6731K4392J109r430m935J45L808J87P632j2634N245J4604j4603k3228J072
10045b3367J6320J934M630j4919M826o028j6691J4114R234J4533O991l049o724
10032A804r889J3730k150N161p864J3871R746j2042o576p249m054J5903K398J4401
10018B7190k197J392J915L713k255o521k1822K981n214K664J1044K4407N378q851
$$ plain form
10115 -972 -9516 -19104 -8425 -9217 8203 16423 14297 10495 3418 -8949 -8867 -4933 1449 818 -8995
10100 -8995 -19741 -23085 -29263 -34466 -43314 -32060 -27750 -27300 -15995 -6060 -3347 -5726 -8437 7921
10086 7921 16396 9867 -505 -4795 -19876 -14685 -27392 -33235 -26056 -41253 -35431 -9586 -4875
10073 -4875 -323 3490 21231 9125 6737 7773 16928 20361 11104 2512 11025 -1552 -20613 -16731
10059 -16731 7661 8770 -660 -5595 -5450 -1642 -1455 6177 -6457 -1212 13392 -1211 -24439 -23367
10045 -23367 -7047 -5113 -483 -15402 -10576 -16604 -33295 -19181 -9947 4586 11577 8528 1804
10032 1804 -8085 5645 3495 8656 792 14663 24409 12367 5791 -1458 -5512 10391 12789 27190
10018 27190 24993 26385 28300 32013 29758 23237 1415 4396 -818 1846 12890 37297 42675 33824
10004C3824j6921o047J1418L827n074l2607p000N611j0769P831K3m695r161j06
9990b9846J2033J6034r251L429K0426N705n208l2304J438J3322P821j1593L1456
9977B3462p906k7106j4959p122Q117K3042j483N331j2972L105J724k013J5331
9964F551K49j2623j9693L515o880N625J3962J4300K116M439J392l68k279o693
9950C613Q317j475L015j1561r297o139P809O676R73J585l66p147k0344j3885o90
9935c8916M356J5290R459P950K1215P500p683k933o945j0139J8919J0397j555
9922B6915m143j779j1886q586q097O645M622K041k790O119q912l538n873n474
9908a4736o87R850p673j3557P53K601R349o122j047J1998p670K491Q306q242J1987
$$ plain form
10004 33824 16903 10856 22274 26101 21027 -11580 -18580 -12969 -23738 -15907 -15884 -20579 -29740 -29846
9990 -29846 -17813 -1779 -11030 -7601 12825 18530 13322 -18982 -17544 -4222 3599 -7994 23462
9977 23462 15556 -11550 -26509 -33631 -25514 -2472 -3955 1376 -11596 -8491 -6767 -8780 6551
9964 6551 6800 -5823 -25516 -22001 -28881 -23256 -9294 5006 7122 11561 12953 12585 10306 3613
9950 3613 11930 10455 13470 1909 -7388 -13527 -5718 958 1931 3516 3150 -3997 -24341 -38226 -38916
9935 -38916 -34560 -19270 -9811 -1861 19354 26854 19171 16238 9293 -846 18073 28470 26915
9922 26915 22772 20993 9107 521 -7576 -931 3691 5732 2942 9061 149 -3389 -9262 -14736
9908 -14736 -15423 -5573 -13246 -26803 -26050 -23449 -14100 -20222 -21269 -9271 -16941 -14450 -6144 -14386 -2399
9893b399J7150q732Q16q484q138L260r67J0547q514j0530K1362J2205j5966j7883
9879a6273j2599N660P186M97L604J8555m177l235J9500K6306p262k2325j2987
9866B450l780N57J295J1571k6770l1555K4830L0126j422n831l418J1541M864k1745
9852g287m589K515j0633J449R271P454j0403N143J5588Q659m248Q226m388j2305
9838D452j0929J0185J4348L294p442j3650M368J1126J3558q090k9275l016N594
9825e477J69J0421J848K14j2709k161R545R910j5k264k168N106P547j963j8537
9810e34k0705j978J0978K5332J423q75M886m341M184J615k4501o383J1902j639
9796f36K814P05N200N891R569r759L068K517n64j592N50m321q450J20l181K414
$$ plain form
9893 -2399 14751 6019 6835 -1649 -9787 -6527 -7494 3053 -5461 -15991 5371 17576 1610 -16273
9879 -16273 -28872 -23212 -16026 -15529 -11925 6630 2453 -782 18718 45024 37762 15437 2450
9866 2450 -1330 -773 522 12093 -14677 -46232 -21402 8724 7302 1471 -1947 9594 14458 -7287
9852 -7287 -11876 -9361 -19994 -18545 -9274 -1820 -12223 -7080 8508 17167 12919 21145 16757 4452
9838 4452 -6477 3708 18056 21350 13908 258 4626 15752 29310 21220 -8055 -11071 -5477
9825 -5477 -5308 5113 6961 7175 -5534 -7695 1850 11760 11745 9481 7313 12419 19966 18003 -534
9810 -534 -21239 -23217 -12239 13093 14516 13641 18527 14186 18370 19985 -4516 -10899 1003 -636
9796 -636 2178 2883 8083 13974 23543 13784 16852 19369 18805 17213 17763 13442 4992 5112 1931 4345
9780D345P282j88j3483j3562R565o64j5793o237o741J7377J6928j0943O703M410
9766a001N02N666O180r982j1114J490J8677J3801j0706j9086j0767j134O7Q981
9752h426M414L034o315K480k44j1232J2695O99r81r331O892J893j9240j3576P175
9737c0063Q493R886o361K1268M254j0286j1356j0797O342P213J1655P677L908
9724A1833L18n443j0617j7029q032M378o58N4J8904J612N765Q797J2341j2660
9710I563k819Q972j397k824O737P340o054j2627j476O847P740j2166K438j3129
9696b855j2774J0059Q025k529J0444J9547o588j4878r230l706o682K90J3732N393
9682H248o011r508O287j2802j8565L141J6402O664J9256K457j7393n415o314j0783
$$ plain form
9780 4345 11627 11439 -2044 -15606 -6041 -6705 -22498 -28735 -35476 -18099 -1171 -12114 -5411 -1001
9766 -1001 -499 5167 11347 1365 -9749 -8259 10418 24219 13513 -5573 -16340 -17474 -17407 -8426
9752 -8426 -4012 -978 -7293 -4813 -5057 -16289 -3594 -2895 -3876 -13207 -6315 -4422 -23662 -37238 -30063
9737 -30063 -21570 -11684 -18045 3223 7477 -2809 -14165 -24962 -18620 -11407 248 7925 11833
9724 11833 12151 6708 -3909 -20938 -28970 -24592 -25250 -25196 -6292 -4680 1085 9882 22223 9563
9710 9563 6744 15716 14319 11495 18232 25572 19518 6891 5415 12262 20002 7836 10274 -2855
9696 -2855 -15629 -5570 2455 -74 10370 29917 23329 8451 -779 -4485 -11167 -10877 2855 8248
9682 8248 2237 -7271 -984 -13786 -32351 -29210 -12808 -6144 13112 15569 -1824 -7239 -13553 -24336
9668b4336O646J512N379R027J041M39K2083O144k8241J200J8988j9799j2178N597
9654f498R142R061Q479o079j3310j287j821p159l820k3574J3750M432l038M35
9640b1287J0859P745J0967K303n869j120L122R762J655L83M333L615L382p364
9626B2486o954j1833o348j292o029J3585Q699M247O916p235m470K340l519Q756
9612A9349j2267j1579J1011R674k3150j2398O380J9993K8878o819j9420K218m482
9599G388j1147o020J2663J2784m453N162k563l0526q500R899P710M940M124Q704
9585A0165Q904R634k354j3362j9575k3436l476J4288M366P932P62L515N242Q903
9571A1508N947k464j8543m740O306R712k761J45j1930l378N725k424L097P514
$$ plain form
9668 -24336 -17690 -16178 -10799 -1772 -731 -292 21791 27935 -306 894 19882 83 -12095 -6498
9654 -6498 2644 11705 20184 14105 795 -492 -2313 -9472 -13292 -36866 -23116 -18684 -21722 -21287
9640 -21287 -10428 -2683 8284 10587 4718 3598 6720 16482 18137 18520 22853 26468 29850 22486
9626 22486 15532 3699 -2649 -3941 -9970 3615 12314 16561 23477 16242 11772 14112 10593 19349
9612 19349 7082 -4497 6514 16188 -6962 -19360 -12980 7013 35891 29072 9652 11870 7388
9599 7388 -3759 -9779 2884 15668 11215 16377 13814 -16712 -25212 -15313 -7603 -2663 1461 10165
9585 10165 19069 28703 26349 12987 -6588 -30024 -33500 -19212 -14846 -6914 -6152 -2637 2605 11508
9571 11508 17455 14991 -3552 -8292 -1986 7726 4965 5110 -6820 -10198 -4473 -6897 -3800 3714
9557C714J373L33Q41J1462N374o111k0728j3185j1673P43N576P243k2804j32J4
9542c7960J0580P697J6007J6629j6812q509q56j155R341N877K835l249l575q507
9528a1657J236Q474Q714p254o893j0666K627r436j3148O586M914l484M075j1571
9514c7483j5633J5907J5761N681k774P332m150J0643l396j5239m356R104j295
9501a9898o977k910J1270K2346P009r095p336j3334n921K319J8108J7307n601
9488G287q075L895l245J282J2757q867q280O283J3972M787K413J752N21j3966
9474A2516q383q886J1362n465j5945O557K636M140k648N614N631o675q173J4561
9460F842q17j1464N803J028k126M14n882n958j5656l868J0326K7291L563j3266
$$ plain form
9557 3714 5087 5420 6261 17723 23097 16986 -3742 -16927 -28600 -27857 -22281 -15038 -37842 -37974 -37960
9542 -37960 -27380 -19683 -3676 12953 -3859 -12368 -13224 -14379 -5038 839 3674 425 -3150 -11657
9528 -11657 -10421 -1947 6767 -487 -7380 -18046 -15419 -24855 -38003 -31417 -26503 -29987 -25912 -37483
9514 -37483 -53116 -37209 -21448 -15767 -18541 -11209 -15359 -4716 -8112 -23351 -27707 -18603 -19898
9501 -19898 -26875 -29785 -18515 3831 10840 1745 -5591 -18925 -24846 -22527 -4419 12888 7287
9488 7287 -788 3107 -138 1144 13901 5034 -3246 3037 17009 21796 24209 25961 26482 12516
9474 12516 4133 -4753 6609 1144 -14801 -8244 -5608 -1468 -4116 1498 7129 454 -7719 6842
9460 6842 6025 -5439 364 1392 -734 -320 -6202 -12160 -27816 -31684 -21358 5933 9496 -3770
9446c770m263q14L470n206j0716K2696J5580M287L461L617K577j3110q735J7573
9432B6647r763j6441R77J2075j785M848O715M882L932l501j0715j2062k441J0192
9418A3560M197k378o74m973m524k258L810R523N985j3558Q275K670J2936L944
9404C6535p623p318J414j2149j8176j2788j1635N429J3617m863p402J4251N651
9391e057m651p949j0861L715K4767R819j398m844n45j253p338P65J6690O912q84
9376A7888l381j0732M46q304O20P787J0222j3318k981J2396K1798J52j9626j7656
9362d689M970J2020O061K972p916q671O037N367J2431K753m468q360L447j6106
9348E848j1665J353J7324K0627o13N061K831o946l143j4686k2794j076j7670k499
$$ plain form
9446 -3770 -8033 -8847 -5377 -10583 -21299 1397 16977 21264 24725 28342 30919 17809 9074 26647
9432 26647 16884 443 1420 13495 11710 16558 23273 28155 32087 28586 17871 5809 3368 13560
9418 13560 17757 15379 14705 9732 5208 2950 6760 16283 22268 8710 16985 19655 32591 36535
9404 36535 28912 21594 23008 10859 -7317 -20105 -31740 -26311 -12694 -17557 -24959 -10708 -5057
9391 -5057 -9708 -17657 -28518 -24803 -36 9783 8385 3541 2996 1743 -5595 -4830 11860 18772 17888
9376 17888 14507 3775 4221 -4083 -3463 4324 14546 1228 -1753 10643 32441 32593 12967 -4689
9362 -4689 281 12301 18362 21334 13418 4747 10784 16151 28582 31335 26867 18507 21954 5848
9348 5848 -5817 -4464 12860 33487 32874 37935 40766 33820 30677 15991 -6803 -7879 -25549 -28048
9334b8048J5146J4633J0829J1670m44j5010l968J8469L097K878j5346k428m006
9321G472j2973p358N336o74j567O255Q908N769M506o58j193p501l542l266j1577
9306a2063N511j7184j248J2418K5173K9424j2496k8858j8893j940K1666J3996
9294A5506q613M165r009o543J4067L180l821p867m849Q989P560l190j2837J5430
9280A2168M491j6031j526K2142k47j0315j6511M304J3027j1801J0776J2577o871
9267A6183M2q88j3583J131l408J926M426K974k61j3846o47J3500L334j5970q71
9252e958o277m238M948J8052r889m907m197O218M034N17O6k191N947k252j8121
9237a8248L88J8389R224j033J123J0330P666P56N267j5293k3720j0817R282J8583
$$ plain form
9334 -28048 -12902 1731 12560 24230 23786 8776 4808 23277 26374 29252 13906 11478 7472
9321 7472 -5501 -12859 -7523 -8197 -9764 -3509 5399 11168 15674 15016 13823 6322 2780 -486 -12063
9306 -12063 -6552 -23736 -24984 -12566 12607 42031 29535 677 -18216 -20156 1510 15506
9294 15506 6893 11058 2049 -4494 9573 12753 8932 1065 -3784 5205 12765 9575 -3262 12168
9280 12168 16659 628 -898 21244 20997 10682 -5829 -1525 11502 -299 10477 23054 16183
9267 16183 16225 15337 1754 2885 -523 1403 5829 8803 8542 -5304 -5951 7549 10883 -5087 -5958
9252 -5958 -12235 -16473 -11525 6527 -3362 -8269 -12466 -6248 -2214 -1697 -1631 -3822 2125 -127 -18248
9237 -18248 -17860 529 9753 8720 9843 20173 27839 28595 33862 18569 -5151 -15968 -6686 11897
9223A1897r802l261p75J4033L457N969Q616Q287q33J0873R068k683j3709j1923
9209B9214m196j1295N345R259M450M291K0794J5559j3083k4760k3168j1238J2507
9196A3679Q627m289j6419m973J5703K0741L111j6859n561n476m630q231n59K9885
9182B4749J5145p881j5359n024r488K768j22J7051J9731p898J2455O468k1620
9169C0975k745J5575J0491k009J309j1386J2514K357r388P014L396j457M914J0296
9155G1856J9506O856j1874n332j1570O051j687N912p38N229M847R570L172O875
9141A08673K0594Q219K723Q933J127J1119L2758K7093J5857N484J9036J7122M1275
9128C20013M2004L1562L9162N1788M3355N0394P0690J13704J17836J44087J46336
$$ plain form
9223 11897 2095 -1166 -1941 12092 15549 21518 30134 38421 37588 48461 57529 54846 41137 29214
9209 29214 25018 13723 19068 28327 32777 37068 57862 73421 60338 35578 12410 1172 13679
9196 13679 22306 18017 1598 -3375 12328 33069 36180 19321 13760 8284 3654 -4577 -5136 24749
9182 24749 39894 32013 16654 11630 2142 4910 4788 21839 41570 33672 46127 52595 30975
9169 30975 28230 43805 54296 52287 53596 42210 54724 57081 47693 54707 58103 56646 61560 71856
9155 71856 91362 98218 86344 81012 69442 75493 73806 79718 78980 84209 89056 98626 101798 108673
9141 108673 129267 137486 140209 149142 150269 161388 194146 221239 237096 242580 261616 278738 320013
9128 320013 362017 393579 432741 484529 527884 578278 648968 762672 880508 1024595 1170931
9117A170931J65354J99125K27427K04097J83417J43084O8566k734o9484j31116
9107B158667j77132j84470j86531j87386j83798j49586j23578j04354j06602p6373
9097F78857o2862o4808n8375l8305n2693k3891j7891k5251k2625j5170k3983m9590
9085B23413l1004k4675n897j1542j1256j3208k4392j5558P428J1407j5173j5164
9073G4379J2904l894m031j2269n589R00n286j386k225J1107R905k216j4098j1768
9059D6433J449P233J588j3690j6616R340K5696P371j4702j6402j4445o48R453
9046C2060j2898k416M104J3302J8254l405k0295m238k813j1910j882m368P059
9033A0554J0385kp105o703Q994J0483J6930j2427p581O819L0188k7672m079J6776
$$ plain form
9117 1170931 1336285 1535410 1762837 1966934 2150351 2293435 2362001 2359267 2289783 2158667
9107 2158667 1981535 1797065 1610534 1423148 1239350 1089764 966186 861832 755230 678857
9097 678857 615995 551187 492812 454507 401814 377923 360032 334781 312156 296986 273003 223413
9085 223413 192409 167734 161837 150295 139039 125831 101439 85881 93309 104716 89543 74379
9073 74379 87283 83389 79358 67089 61500 62400 57114 55728 53503 64610 74515 72299 58201 46433
9059 46433 47882 55115 56703 43013 26397 35737 61433 68804 54102 37700 23255 22607 32060
9046 32060 19162 16746 20850 34152 52406 49001 28706 24468 21655 9745 7863 3495 10554
9033 10554 20939 20937 13832 7129 16123 26606 43536 31109 23528 30347 60535 32863 28784 45560
9019D5560r938j7564q385N38r420R500m82j7037N991n205p150L139Q608J2441
9005A0596P319p665k689k2621N062J0887M594p043j1961J4209K1864J649r02J822
8991B5121j9987j0920n118J0855n929O853M509n447N956P211n174k568O119J1099
8977B2580M4r362m371R46q163r72J0500K2043l754j2506P858J0393j0858j6132
8963H246j0008n222m446J3375J7493j6049K070J867J9653r384j6924O750n859
8950A562K201J156j5114j5307J8986J117m543J3651l396k150P134j0819j4230
8937a9752J3026K1083n226j2146m206K208K816J0332O058N075K813j8146k121
8924A814J2011n373J601j3027j0166J0210J3805j5909q520Q450L451M813J016
$$ plain form
9019 45560 35622 18058 9673 10211 791 10291 9809 -7228 -1237 -6442 -13592 -10453 -1845 10596
9005 10596 17915 10250 7561 -15060 -9998 889 5483 -1560 -13521 688 22552 24201 23299 25121
8991 25121 5134 -5786 -10904 -49 -5978 875 5384 -63 5893 13104 7930 5362 11481 22580
8977 22580 22624 13262 8891 9837 1674 702 11202 33245 29491 16985 24843 35236 24378 8246
8963 8246 -1762 -6984 -11430 1945 19438 3389 5459 7326 26979 17595 671 7421 1562
8950 1562 3763 4919 -10195 -25502 -6516 -5399 -9942 3709 313 -1837 5297 -5522 -19752
8937 -19752 -6726 14357 9131 -3015 -7221 -5013 -2197 8135 14193 19268 22081 3935 1814
8924 1814 13825 8452 10053 -2974 -13140 -2930 10875 -5034 -13554 -5104 -1653 3160 4176
8911D176J344n381P382R274p13R855r972k1477J5383j4128M954Q851j538M592
8897A2602P061j3220r594p056J190L242p487j3664K8152K0791l043K470j1992
8884I452j8311J0196q352n687J761J1241J9454J1243j6267r592k090J9500J0401
8871C2949j0818p461m327J260j5418j1920J2671J4072M509o398P76j0107k358
8858b570n59M965n393q009l247J566J2230L645P860P770j402r894j1056n084Q518
8843f60J0548M206j7603m970j9819J0678J696q024P558j9466K052O426R988K1666
8829D276k232j904j616L492J2008N817N901M792k0420o553k052k914k0168Q646
8815a2927J0433J8031J8727j7722j8943q818L739O128J0758L99O794L48n130p945
$$ plain form
8911 4176 5520 139 7521 16795 16082 25937 15965 -5512 9871 -4257 697 9548 8010 12602
8897 12602 19663 6443 -3151 -10207 -9017 -5775 -13262 -26926 1226 22017 18974 21444 9452
8884 9452 -8859 1337 -7015 -12702 -10941 300 19754 30997 14730 5138 3048 22548 32949
8871 32949 22131 14670 10343 11603 -3815 -15735 -3064 11008 15517 9119 9895 -212 -2570
8858 -2570 -3129 1836 -3557 -11566 -14813 -13247 -1017 2628 10488 18258 16856 6962 -4094 -9178 -660
8843 -660 9888 14094 -3509 -8479 -28298 -17620 -15924 -23948 -16390 -35856 -33804 -27378 -17390 4276
8829 4276 2044 140 -1476 2016 14024 19841 25742 30534 10114 3561 1509 -1405 -21573 -12927
8815 -12927 -2494 15537 34264 16542 -2401 -11219 -7480 -1352 9406 9805 16599 16947 11817 3872
8801C872j7200J243J2305K8193n90k9560r402R351k87Q016k471j0066J2163J2688
8787A8255K4896j0029r82K325j0810k1746r129J0568o483j5573L436J0367M22
8774d483r389J0623J1506N141j0615K0111K183j5593j051N696k123j7026j411
8761f431m125J1587J1123M215j845K263n22j3516J7993J492J512j7046r547j710
8747d557k5899j3333k434J2149K4084Q438m743m594R426O327R81j9421l845J8682
8733A261K3697N883m970K674J506n599j5442j7099L942R595J822q497M071J4661
8719A7505q74L647q28j0660j2805p898J2110R661K022o353j1058J2655K456K015
8705A1595N165K857j6774l247j06l273j0775L867J3723O65j3090N397O108P119
$$ plain form
8801 3872 -13328 -12085 220 28413 27823 -1737 -11139 -1788 -2075 5941 3470 -6596 5567 18255
8787 18255 43151 33122 32140 34465 23655 1909 -7220 3348 -3135 -18708 -15272 -4905 -4483
8774 -4483 -13872 -3249 8257 13398 2783 22894 25077 9484 8433 14129 12006 -5020 -6431
8761 -6431 -10556 1031 12154 16369 14524 16787 16265 2749 20742 22234 23746 6700 -2847 -4557
8747 -4557 -30456 -43789 -46223 -34074 -9990 -1552 -6295 -10889 -1463 4864 5845 -13576 -17421 1261
8733 1261 24958 30841 25871 28545 30051 24452 9010 -8089 -4147 5448 7270 -1227 2844 17505
8719 17505 16631 20278 19450 8790 -4015 -11913 197 9858 11880 5527 -5531 7124 9580 11595
8705 11595 16760 19617 2843 -404 -510 -3783 -14558 -10691 3032 3697 -9393 -3996 2112 9231
8691I231O23k75j3501j1240r12J8113J8569P059n851j6178j0749N285K5280K565
8677B8019j1684J0857Q368j3824j1989j5804K844P83L292p378O812J1651M210
8664A6157j9r327N44l501J005P529k128R959J3064m678j2468J1445R835j0900
8650B6517q909l096j2466N329l975K16P005P979k23j279p373q811k0248j205J3715
8635f824J6926K1587J3547q12j1390Q52j2847k5207o290M081K166j4786O615J6301
8621C919P116O379j1666q148j566N543R645K771m818r709j7300L446j337K171
8607a3554P176R690l037J6627J5532k653j9365o449K273o026N180L33J433j9721
8593a2561L948N382O234L680N30R614j524q540L440J7153J8734j4071j5410l468
$$ plain form
8691 9231 9854 9579 -3922 -15162 -16074 2039 20608 27667 21816 5638 -5111 174 25454 28019
8677 28019 16335 27192 35560 21736 9747 -6057 -3213 -2430 862 -6516 296 11947 16157
8664 16157 16138 6811 7355 3854 4859 12388 10260 20219 33283 28605 16137 27582 37417 26517
8650 26517 17608 14512 2046 7375 3400 3616 10621 18600 18377 17098 9725 914 -19334 -20539 -6824
8635 -6824 10102 31689 45236 44424 33034 33886 21039 -4168 -10458 -6377 -4211 -18997 -12382 3919
8621 3919 11035 17414 5748 -2400 -3966 1577 11222 13993 9175 -534 -17834 -14388 -15725 -13554
8607 -13554 -6378 3312 275 16902 32434 29781 10416 3967 6240 214 5394 5727 7160 -12561
8593 -12561 -8613 -3231 3003 6683 7213 16827 15303 6763 10203 27356 46090 32019 16609 13141
8579A3141N399k642J0171J2002J1792Q122P321l495j2973l0608j8489M857K1299
8566B5897r27n730o260K5092O636J845j1887k7764r251r55p222K275L460l947
8552h738j0112j148J5779j0791K728J7507J8073q056k5616n728P376O760p52m458
8538g176P040J9177O671J1819j5430j8164k993O343j0525l581O601L167L055K01
8524F205M611n09J530l066K4819K555J946l753j2019j4904j0516j581J1217l015
8510C520j3556J726K378O903P28q7J423l15o957j9314J469J1009O928j544l495
8495i184q262K838J5400J4585j2541j6073m902J507q453N257J989k114K08n731
8481b5476J08P200m377Q57n1N852j0009M015J5456K0569R115j385O18R998p130
$$ plain form
8579 13141 18540 15898 26069 38071 49863 57985 65306 61811 48838 18230 -259 4598 25897
8566 25897 24970 19240 12980 38072 44708 46553 34666 6902 -2349 -3304 -10526 -8251 -4791 -8738
8552 -8738 -18850 -19998 -4219 -15010 -12282 5225 23298 15242 -10374 -16102 -8726 -1966 -2718 -7176
8538 -7176 -136 19041 25712 37531 22101 3937 944 7287 -3238 -6819 -218 2949 6004 6205
8524 6205 10816 10307 11837 8771 33590 36145 38091 34338 22319 7415 -3101 -4682 6535 3520
8510 3520 -10036 -8310 -5932 971 1699 1612 3035 2720 -4237 -23551 -22082 -11073 -4145 -5689 -9184
8495 -9184 -17446 -14608 792 15377 2836 -13237 -18139 -16632 -25085 -19828 -17839 -19953 -19745 -25476
8481 -25476 -25368 -18168 -22545 -21688 -21739 -15887 -25896 -21881 -6425 14144 23259 21874 22492 32490 25360
8466B5360j1881j2190j025R965L647j8605J0118J3356n998l278L574j2841l99
8453a97j3648N028K815J2437J0667q170n342o136k372n983P904m07J6208l141
8439I663k1988m848J1824J0112L611O904K438p220j2649k145l228q501L366J0
8425a2651n380N962j1692J2622O157l149K780l753Q884R259L106j1501N559R618
8411A5821j466n394R633j0036m608M825p333K284L731k851p48K117l571n309O323
8396C418M04K26j4792j1330n588J3155R782R299J0117M269j062m254j2160o153
8382d669j1178l173J6432J2220k39n789n775J2071P590p302l6J00j499J758M572
8367A5083L460R217q85j5705o245N855p29N706j5836R075J4549j1305n868n994
$$ plain form
8466 25360 13479 1289 264 10229 13876 -4729 5389 18745 12747 9469 13043 202 -197
8453 -197 -13845 -8817 -6002 6435 17102 8932 3590 -2546 -4918 -10901 -2997 -3404 12804 9663
8439 9663 -12325 -17173 -5349 4763 8374 15278 17716 10496 -2153 -4298 -7526 -16027 -12661 -12651
8425 -12651 -18031 -12069 -23761 -11139 -4982 -8131 -5351 -9104 -220 9039 12145 644 6203 15821
8411 15821 14355 8961 18594 8558 3950 8775 1442 3726 7457 4606 3858 5975 2404 -2905 3418
8396 3418 3822 4048 -10744 -22074 -27662 -14507 -4725 4574 14691 18960 17898 13644 1484 -4669
8382 -4669 -15847 -19020 -2588 9632 9393 3604 -2171 9900 17490 10188 10152 10252 8753 10511 15083
8367 15083 18543 27760 26875 11170 4925 10780 10051 15757 -79 8996 23545 12240 6372 378
8353C78n551j8239P366N879M679N060N960J1401J6088q089j8597N166m551o41
8339F309L406L437n04k285n121j1223n426m743J6327P286L363j4494m671M52j5243
8324b3130q53m730N389j185j8249j170L274J3661N685N211K5080K3386n0j9611
8310A2708j8663J329J1628J898Q589J0014J0289j2135j6036o914J2305J4524l856
8297B5680r460q204J373j8794j3275K3985L775P433m275J5402j341j2392j7239
8284g332J993J2900M389j437R683j2117L492J7962j1509k2333m453q147N461L711
8270g737r184P199J0567l044O792K1229N600j8458k1078r36J1586N85N178M30
8256H729P061n491R617P564J972k3117j0689Q680j3209m636r464M082q895l129
$$ plain form
8353 378 -5173 -23412 -16046 -10167 -5488 -428 5532 16933 33021 24932 6335 11501 6950 6309
8339 6309 9715 13152 12648 10363 5242 -5981 -11407 -16150 177 7463 10826 -3668 -8339 -7887 -23130
8324 -23130 -23983 -28713 -23324 -24509 -42758 -43928 -40654 -26993 -21308 -16097 8983 32369 32319 12708
8310 12708 -5955 -4626 7002 8900 17489 27503 37792 25657 9621 2707 15012 29536 25680
8297 25680 16220 8016 9389 -9405 -22680 1305 5080 12513 8238 23640 22299 9907 -7332
8284 -7332 -5339 7561 11950 10513 20196 8079 11571 29533 18024 -4309 -8762 -16909 -11448 -7737
8270 -7737 -16921 -9722 845 -2199 4593 25822 31422 12964 -8114 -9050 2536 3121 8299 8729
8256 8729 15790 10299 19916 27480 29452 6335 -4354 4326 -8883 -13519 -22983 -18901 -27796 -30925
8242c0925J4088J9232j535p253p425j4163m38J5664j685P052J629J3940p62j3747
8228f328l49M351L13J4636L01L378l459m0O943J6020k978r037M368O83M1j881
8212B6962q175L05j940j2191l820r86j063K71J775L013O532q756L934L669J2417
8197B1947m321j875q250Q457O387j8914P392J5877M740L03P885p677k8317j6783
8183a3149O374N503K381L801N064O854J471j3708Q167O490O581j0890l747J49
8169A1341l651K1603r326j1821q776L932l501J1338J7573N042o700n232O338j0285
8155A7875L02K78j952n486J2705R042N94j2006j925K741j766J0582n693m106m282
8140A6903m865k0212p400K865N233J6501j3356J0819J4658N511K587j4378R249
$$ plain form
8242 -30925 -16837 2395 860 -6393 -13818 -27981 -28419 -12755 -14440 -7388 -5759 8181 7419 -6328
8228 -6328 -6677 -2326 -2013 12623 12924 16302 12843 12803 19746 35766 32788 23751 28119 28802 28843 26962
8212 26962 18787 19092 17152 4961 1141 155 -908 -637 1138 4151 10683 1927 5861 9530 21947
8197 21947 17626 15751 7501 15958 22345 3431 10823 26700 31440 31743 39628 31951 3634 -13149
8183 -13149 -6775 -1272 1109 4910 9974 16828 18299 4591 12758 19248 25829 14939 11192 11341
8169 11341 7690 29293 19967 8146 -630 3302 -199 11139 28712 33754 27054 21822 28160 17875
8155 17875 18177 18455 16503 11017 23722 32764 33358 21352 19427 22168 20402 30984 25291 21185 16903
8140 16903 12038 -8174 -15574 -12709 -7476 9025 -4331 6488 21146 26657 29244 14866 24115
8127B4115p391J5237K688J278j4811o381O260j2123L02o842r556Q966J9582j0102
8113A1222K408R943m077K212k629j2172M434p940N368K6907l829n742J7965J0121
8099E4191j6077q10j850m401o097l2824n211Q509l370J624P464J1554N101Q637
8085B6440j22n067j5175N038o164M890q65n602m618j0563N936K106o068L940q384
8070a4278j5295M371J1301J2176P814J5267M556k274O987j4420m484K0343J5996
8057D8060j2363j9296j9739l172L0772J5512J0066M606o983j7707k6710q472L493
8044a933K109j1240L4p183K6466J4114n23j225k6084j8777R540Q001j1943j3676
8030c2320k442J1978Q565K755L328J1177K3058l653k857j623o92l431J1732J791
$$ plain form
8127 24115 16724 31961 34649 35927 21116 14735 20995 8872 9174 2332 -7224 1742 21324 11222
8113 11222 13630 23573 19496 21708 19079 6907 11341 3401 8769 35676 31847 26105 44070 54191
8099 54191 38114 37304 35454 31053 24956 -7868 -13079 -4570 -7940 -6316 1148 12702 17803 26440
8085 26440 26318 21251 6076 11114 4950 9840 8975 3373 -1245 -11808 -5872 -3766 -9834 -5894 -14278
8070 -14278 -29573 -25202 -13901 -1725 6089 21356 25912 23638 30625 16205 11721 32064 48060
8057 48060 35697 16401 -3338 -6510 24262 39774 49840 54446 47463 29756 3046 -5426 -1933
8044 -1933 176 -11064 -11030 -18213 8253 22367 21844 20619 -5465 -24242 -14702 -6701 -18644 -32320
8030 -32320 -34762 -22784 -14219 -11464 -8136 3041 26099 22446 19589 17966 17274 13843 25575 27366
8016B7366K714j1427j078n117q245M520J3078N116j4676n37o336j0714r52K951
8002c337O865j168J3449J4458O365j1276j0850q715O851J9275R935j0475j4668
7989A6709p672M039R434j046K909j9236q366J3401M959L68J2012L59k5606J215
7975C479k461j8214m175j2577R20O794K7429J3709m770j065J1618J618r113J1836
7961B5028J6466O290L425p471n592Q557j1832r231p954m953K519n149n591O008
7947A0520j1508J479J6886J6677J283j7719l6555j6456k597O295O943N94J3815
7934a0343L9075J0692q206j1969k6657O699J0300p069p616J0272K415m868k282
7921D43q70J8276q569k257L876R928O279n470L195j5827o079J6016q720r543j1018
$$ plain form
8016 27366 30080 18653 17575 12458 4213 8733 21811 26927 12251 11714 5378 -5336 -6288 -3337
8002 -3337 3528 2360 15809 30267 36632 25356 14506 5791 12642 31917 41852 31377 16709
7989 16709 9037 13076 22510 21464 24373 5137 -3229 10172 15131 15499 27511 27870 2264 3479
7975 3479 1018 -17196 -21371 -33948 -33028 -26234 1195 14904 10134 9069 20687 22305 13192 25028
7961 25028 41494 47784 51209 43738 38146 46703 34871 25640 17686 12733 15252 10103 4512 10520
7947 10520 -988 491 17377 34054 35337 17618 -18937 -35393 -37990 -31695 -24752 -24158 -10343
7934 -10343 28732 39424 31218 19249 -7408 -709 9591 2522 -5094 5178 7593 2725 443
7921 443 -427 17849 9280 7023 10899 20827 27106 21636 24831 9004 2925 18941 10221 678 -10340
7906a0340K247J1813r811R572J9727q110l430k802K2358j6552m317N42J2172j2938
7892A0131r076M021m324R794L0637P626j7869j8339l139k452k1819O448J8761
7879A0400k363J0744l16K724j239m618Q653L147p619j0952j2107N178o7q407n345
7864a2187j877r157q104N578k993J6061P573J8860J2148K567J557j6567j1411
7851B048l214o404J382M877M058M338k221n990J8432P589j4030P161O370j2613
7837A1783J7343J0096J0152l2589j3284L575q739L187k776r391j0315L646m501
7824b1813N936m292N232n084p383r974J0562J5147o166l633l517N916R877J3428
7810D236J5620j2397l346k3524p684J2899q592J0040K4632j242j4778M345m024
$$ plain form
7906 -10340 -8093 3720 -6091 3481 23208 15098 11668 8866 31224 14672 10355 10897 23069 10131
7892 10131 1055 5076 752 10546 41183 48809 30940 12601 9462 7010 -14809 -8361 10400
7879 10400 8037 18781 18465 21189 19950 15332 23985 27132 19513 8561 -3546 1632 1565 -6842 -12187
7864 -12187 -14064 -23221 -31325 -25747 -28740 -12679 -5106 13754 25902 28469 30026 13459 2048
7851 2048 -1166 -7570 -6188 -1311 2747 7085 4864 -1126 17306 24895 10865 18026 24396 11783
7837 11783 29126 39222 49374 16785 3501 7076 -1663 1524 -1252 -10643 -20958 -17312 -21813
7824 -21813 -15877 -20169 -14937 -20021 -27404 -37378 -26816 -11669 -17835 -21468 -24985 -19069 -9192 4236
7810 4236 19856 7459 4113 -19411 -27095 -14196 -22788 -12748 11884 10642 -4136 209 -3815
7797c815M984N788L492j9112j432j1885j255J4834K166P861J9954j6204j3694
7784h318O778R437P803n52l768N651K789k1079j7343P647O679r39q05k084K109
7769e995J961J1041p682j3405J5807l733k791j3038j233l822Q827K609k630J563
7755a2521k984Q41Q023K008j0008M017R087N002l01Q393o021J212j182l019j1816
7740i269K202J898k819j0630o069Q080j823O5n232j2573J611K3276K3285J936
7726A3938n934j4128K165r510L78J7266K46n670K166m730K781l051r261J0244
7712c100L610j8272K221O7j668J0316M896j6198j278K728p295o586Q822K525m025
7697b3237Q705P872q625m11J5021L088K414m886L83N97m158Q55Q298o015j1513
$$ plain form
7797 -3815 1169 6957 10449 -8663 -10095 -21980 -23235 -8401 -6235 1626 21580 5376 -8318
7784 -8318 -1540 7897 15700 15148 11380 17031 19820 -1259 -18602 -10955 -4276 -5215 -6020 -8104 -5995
7769 -5995 -4034 7007 -675 -14080 1727 -2006 -4797 -17835 -19068 -22890 -14063 -11454 -14084 -12521
7755 -12521 -15505 -14664 -6641 -4633 -14641 -10624 -1537 3465 3164 11557 5536 6748 5566 2547 -9269
7740 -9269 -7067 -5169 -7988 -18618 -24687 -16607 -18430 -18365 -23597 -36170 -34559 -11283 12002 13938
7726 13938 8004 -6124 -3959 -13469 -13091 4175 4421 -1249 917 -3813 -1032 -4083 -13344 -3100
7712 -3100 510 -17762 -15541 -15474 -17142 -6826 -1930 -18128 -19406 -16678 -23973 -30559 -21737 -19212 -23237
7697 -23237 -14532 -6660 -15285 -15696 -675 2413 4827 -59 324 921 -3237 -2382 5916 -99 -11612
7682a1612L267J4369K479j0195m16R40o580K013M593P742j3341M74j2680j6872
7668c5819J2048j524K1329J6483j5618j3303J0886o246l567k786J17K726m898
7655b0172l950Q09N627Q34K132O490Q616r060o746M852r984j3861M92j5269L0266
7640a8924J9670p572M753J0930r291j4472M735R573L749j5191K443q05L899p440
7626a3943o018L155J2240q900N792J5498J7276k0262j1920J538j3183Q994k63
7613i996L958j0031L727K524r039N624K81J4042q137l913Q174J3505P990k7466
7599h757j2433O794R672j909p77p860J0514N235J8427k962r451j5686q056O109
7585a1140J392m229J4923J0969M016j1136o783L965M82j3024K540J7213P272Q10
$$ plain form
7682 -11612 -8345 6024 8503 -1692 -2108 -1168 -7748 -5735 -1142 6600 -6741 -6267 -18947 -35819
7668 -35819 -23771 -25295 -3966 12517 -3101 -16404 -5518 -11764 -15331 -18117 -18000 -15274 -20172
7655 -20172 -24122 -23313 -17686 -16852 -14720 -8230 386 -8674 -15420 -10568 -20552 -34413 -33921 -49190 -18924
7640 -18924 746 -6826 -2073 8857 -434 -14906 -10171 -598 3151 -12040 -9597 -10402 -6503 -13943
7626 -13943 -19961 -16806 -4566 -13466 -7674 7824 25100 4838 -7082 -5544 -18727 -9733 -9996
7613 -9996 -6038 -16069 -12342 -9818 -18857 -13233 -12952 1090 -7047 -10960 -2786 10719 18709 -8757
7599 -8757 -21190 -14396 -4724 -6633 -7410 -15270 -4756 479 18906 15944 6493 -9193 -17249 -11140
7585 -11140 -9748 -13977 946 11915 15931 4795 -1988 1977 2459 -10565 -8025 9188 16460 17270
7571A7270j825j6241k5293m962K4835L138L798J1406n381j4400n70J0372k319
7558a72Q53R368j772P101K445o964j8664j0982K683N134L191k706O80p97J0068
7543e34M665j3694q795L903J0542j002k948j297K279r963P07N970O001R59L537
7528C30L166o214J4414j01N39j0078l704o257J5600P01l834n60j515j4774R682
7513b605J7538o339o602J0076j1609k6385j5992M140L0916M705r493J5979J8874
7500B3203o01j4753n691K677n13m658O292J8921P247Q112R013j2734K740P311
7486D6566o003j2588p054l668p388n868r84K0337p975j4270M585k565k4397j3457
7472c4729J2761J4848R718O660l182K867k669o245j5900j8190J3741K4619J3670
$$ plain form
7571 17270 15445 -796 -26089 -31051 -6216 -3078 720 12126 6745 -7655 -8225 2147 -172
7558 -172 681 10049 8277 15378 17823 10859 -7805 -18787 -16104 -10970 -7779 -10485 -9805 -10602 -534
7543 -534 4131 -9563 -18358 -14455 -3913 -4915 -7863 -9160 -6881 -16844 -16137 -10167 -4166 -3207 330
7528 330 3496 -2718 11696 11595 12134 2056 -1648 -7905 7695 8396 4562 4002 2487 -12287 -2605
7513 -2605 14933 8594 1992 12068 459 -25926 -41918 -37778 -6862 -2157 -11650 4329 23203
7500 23203 22602 7849 2158 4835 4322 -336 5956 24877 32124 40236 49249 36515 39255 46566
7486 46566 40563 27975 20921 17253 9865 3997 3013 23350 15375 1105 5690 3125 -21272 -34729
7472 -34729 -21968 -7120 2598 9258 6076 8943 6274 29 -15871 -34061 -20320 4299 17969
7459A7969q921j4933J346p17P454K162j2695j0584l58R918j728Q584J4280j6410
7445d633n350N518N381J5121R742j7365j0535P935J2615P962k940k8117j6989
7432b1655q141j2824J241J449K187q48J2793P600R376J839j3760j2956n43J3704
7418b0538l983N557L150j11J2424j956J3793j5069j4198M145M431P10m690k719
7404a9054J2260J8788l792M000j4204j2286O109N328M067p316J4422q090k247
7391b015j721j813m803m687l680n018l381J2225J1353Q843k961J3929O124L688
7377B6083N486p114O018j0452k4810o510p912K4761J1231l6435j9568J9223L5270
7364A5271M302M915M132j9394o571k532j0167j3485M249n0J5561J859q558N071
$$ plain form
7459 17969 9048 -5885 -4539 -5256 2198 4360 -8335 -18919 -19277 -9359 -11087 -2503 11777 -4633
7445 -4633 -9983 -4465 916 16037 25779 8414 -2121 5814 18429 26391 23451 -4666 -21655
7432 -21655 -29796 -42620 -41379 -39930 -37743 -38591 -25798 -18198 -8822 -6983 -20743 -33699 -34242 -20538
7418 -20538 -24521 -18964 -15814 -15925 -3501 -5457 8336 -6733 -20931 -16786 -12355 -11645 -16335 -19054
7404 -19054 -6794 11994 8202 12202 -2002 -14288 -8179 -2851 1216 -6100 8322 232 -2015
7391 -2015 -3736 -5549 -10352 -15039 -18719 -23737 -27118 -14893 -3540 5303 2342 16271 22395 26083
7377 26083 31569 24455 30473 20021 -4789 -11299 -19211 5550 16781 -19654 -39222 -19999 15271
7364 15271 19573 24488 28620 9226 2655 123 -10044 -23529 -19280 -19330 -3769 -1910 -10468 -5397
7350e397M536J5572L193j3171J898P189J2660j673m149M44k502J6770O649j1549
7336C0470j6604l564J4786Q741o171k2178p31L103K049Q501j2312j8162j8204
7323c0276k742l239J9985K5615N397k4410k148j414j681N148k6837j2316R469
7310c9449K2897N170J2065N831p887m532J6210M447N030j2845Q296l070j0719
7297A444j994k593r458P109m453J3476J7894o465k0110k3610L244J3072K217L712
7283f515j5886R26j0878j0039P299Q669N479J4454n513P318J1501R122r663p765
7269a491j108P041J6102r714k9867k305J0794M512q918l062J2393R742P042j1145
7255A6Q958j5796j6304N446K652R064q6M129j162j895K2399M980k0867N544L45
$$ plain form
7350 -5397 -861 14711 17904 4733 6631 13820 26480 24807 20658 21102 18600 35370 42019 30470
7336 30470 13866 10302 25088 33829 27658 5480 4749 7852 9901 18402 6090 -12072 -30276
7323 -30276 -33018 -36257 -16272 9343 14740 -9670 -11818 -13232 -14913 -9765 -36602 -48918 -39449
7310 -39449 -16552 -11382 683 6514 -1373 -5905 10305 14752 19782 6937 15233 12163 1444
7297 1444 -550 -3143 -12601 -5492 -9945 3531 21425 14960 -5150 -28760 -25516 -12444 -10227 -6515
7283 -6515 -22401 -21475 -32353 -42392 -35093 -26424 -20945 -6491 -12004 -4686 6815 15937 6274 -1491
7269 -1491 -2599 4442 20544 10830 -19037 -21342 -10548 -6036 -14954 -18016 -5623 4119 11161 16
7255 16 8974 -6822 -23126 -17680 -15028 -5964 -6050 -1921 -3083 -4978 17421 22401 1534 7078 7423
7240G423m448R139J1754k4593p201O689J921j0903j8192j0915K0080R329n382
7227a5299M096L639j2568M814J6963J9931p010J693M389q476j368J288n893j077
7213E122m810Q202M015P783j3657j3216m138J837j0043J7070P291M21K404j4047
7199e766j2119Q048J3686k352j5512J3434K0700N889j9691j3792J0031K805J4256
7186A9617N057j964k7156j12J4000L021L892j3831k604K798K1785M721j5779j4970
7172a525O454J5886o022l504N128l484j5917J36J4085K265k231m671j4371K666
7158e105K073J3541J543n894l323j9435j158o993J1736N640m912l958J3141k832
7144e936j1661j510o145Q067R692l721p752L940Q976J2996J1975M164k1586k3012
$$ plain form
7240 7423 2975 12114 23868 -725 -7926 -1237 684 -10219 -28411 -39326 -19246 -9917 -15299
7227 -15299 -11203 -7564 -20132 -15318 1645 21576 14566 16259 20648 12172 10804 12092 6199 5122
7213 5122 312 8514 12529 20312 6655 -6561 -10699 -8862 -18905 -1835 5456 5877 8281 -5766
7199 -5766 -17885 -9837 3849 1497 -14015 -581 20119 26008 6317 -7475 2556 5361 19617
7186 19617 24674 22710 -4446 -4558 9442 12463 16355 2524 -80 2718 24503 29224 13445 -1525
7172 -1525 4929 20815 14793 11289 16417 12933 -2984 -2848 11237 13502 11271 6600 -7771 -5105
7158 -5105 -3032 10509 12052 6158 2835 -16600 -17758 -24751 -13015 -7375 -12287 -16245 -3104 -5936
7144 -5936 -17597 -19107 -25252 -17185 -7493 -11214 -18966 -15026 -6050 6946 18921 23085 1499 -21513
7130b1513j1251R021R030J2870R691j1421j1612M269N718q446J4654L194q156
7117c952j8234j753J9838N641J411K3027l971o134n245j0167n793J7035L987O592
7103B2282n353j8701N498m145r305k2300L372J8905O770j1363j2208k753J1495
7090a7806K9575Q363j975j1073R732O569n19k0345k987j2219l053Q880P379J0580
7076A1101k195m91L549j4587J785O304n585O434p45Q484l468r975J5213n523j3063
7061b762p842K798k142j102J0828J8133J2217J3588j3567j504q101k0536j1642
7048a1634j3205j1336J0129Q182P530j4832o406l946J4190J090L749p935m088
7035b8512Q981Q847M934M578j9219N421K857Q189O201j2523p30j9515o578l110
$$ plain form
7130 -21513 -32764 -23743 -14713 -1843 7848 -3573 -15185 -10916 -5198 -13644 1010 4204 -3952
7117 -3952 -22186 -23939 -4101 1540 2951 25978 22007 15873 10628 461 -5332 11703 15690 22282
7103 22282 16929 -1772 3726 -419 -9724 -32024 -28652 -9747 -2977 -14340 -26548 -29301 -17806
7090 -17806 11769 20132 18157 7084 16816 23385 22866 2521 -466 -12685 -15738 -6858 521 11101
7076 11101 8906 8415 11964 -2623 -838 5466 -119 6315 5570 14054 10586 611 15824 10301 -2762
7061 -2762 -10604 -7806 -9948 -11050 -222 17911 30128 43716 30149 28645 20544 8 -11634
7048 -11634 -24839 -36175 -26046 -17864 -10334 -25166 -31572 -35518 -21328 -20238 -16489 -24424 -28512
7035 -28512 -19531 -10684 -5750 -1172 -20391 -14970 -12113 -3924 2277 -10246 -10976 -30491 -37069 -40179
7021d0179J1424J5742K2588j1433r257k536J3628Q675j1789j0367L128J093j61
7008i444K3077M86o874j1723j8624l57Q258k484Q73J5294K3432J0586p499k987
6994B2014k0982j7367K0472J8980k2L33P521j1850q741K884J488r984m345K632
6980C033L350o67j3930j292Q892N39o458l200O022j070k021J0527Q123N590J768
6965A9206m576j6294k5422p518L4l467J0206J5420k796m966J3133J1698M913J390
6951A0961l384j0143j3290K736O292j1887m055J2777R854J038j907j145j2464
6938a4617j3185J2099l336q133J5420K2120J1474n850j6209N698P12j2412n435
6925a1654l948N453J0574J7799p128j7911k7565j1011J4780J32N832Q557K240
$$ plain form
7021 -40179 -28755 -13013 9575 -1858 -11115 -13651 -23 8652 -3137 -13504 -10376 -9283 -9444
7008 -9444 13633 14119 7245 -4478 -23102 -23459 -15201 -17685 -16812 -1518 21914 32500 25001 22014
6994 22014 1032 -16335 4137 23117 23095 23428 30949 19099 10358 13242 14730 4746 401 3033
6980 3033 6383 5716 -8214 -9506 -614 -75 -6533 -9733 -3711 -4781 -6802 3725 11848 17438 19206
6965 19206 14630 -1664 -27086 -34604 -34570 -38037 -27831 -12411 -15207 -20173 -7040 4658 9571 10961
6951 10961 7577 -2566 -15856 -13120 -6828 -18715 -22770 -9993 -139 899 -1008 -2153 -14617
6938 -14617 -27802 -15703 -19039 -27172 -11752 10368 21842 15992 -217 5481 6193 -6219 -11654
6925 -11654 -15602 -10149 425 18224 11096 -6815 -34380 -45391 -30611 -30479 -24647 -16090 -13850
6912a3850q462m600J0648O633J5223N619O925p551m757q948J201L463m327J2332
6898I549M325k5382j7457J1066M044l955J1781J1132N630j1995K525j2308j7514
6885b8559o868R712K4985O506l310j975k46M585j345j107J0186M738l965m979
6871H358j4809O596M437K1928Q411k383j6989l922M189j9239k892J381N928R786
6857A0780K2178j9468k8194m356L890K436J7818L794M572R63j9894J172J3071
6844H762k813j5035n540r014L332K0738K874k056p427r71K135N682M096p09n993
6829a939R297l524k114o779r109j3188n3O816K470l351K6180L244o924P485J2851
6814B1362j9711j0096J3259o16n542m024P328m429o182J132O157k30l548j1340
$$ plain form
6912 -13850 -22312 -26912 -16264 -9631 5592 11211 18136 10585 5828 -3120 -1919 1544 -2783 9549
6898 9549 13874 -11508 -28965 -17899 -13855 -17810 -6029 5103 10733 -1262 1263 -11045 -28559
6885 -28559 -35427 -25715 -730 5776 2466 491 245 4830 3485 2378 12564 17302 13337 8358
6871 8358 -6451 145 4582 26510 34921 32538 15549 11627 15816 -3423 -6315 -4934 994 10780
6857 10780 32958 13490 -14704 -19060 -15170 -12734 5084 8878 13450 14413 -5481 -4309 8762
6844 8762 5949 -9086 -14626 -23640 -20308 430 3304 1248 -6179 -7150 -5015 667 4763 4054 -1939
6829 -1939 7358 3834 1720 -5059 -14168 -27356 -27409 -20593 -18123 -21474 4706 7950 1026 8511 21362
6814 21362 1651 -8445 4814 4198 -1344 -5368 1960 -2469 -8651 -7519 -1362 -1592 -5140 -16480
6800a6480Q57P579J3705J8968j1343O354M558o221N63j2932p235o520j4096r519
6786c1762J695j0909K0786J4479J828J0095q984L751p032q088P832O026j7303
6773a7586j0243R513K2680j13m917p558Q11Q733J8449l003M015p518q558j5137
6759a0432N659J3774j3017p563l370K662J8470M515j3946K02q916K4865J6153
6746B9056j8438j7421j7413j0258o485K5514L1956P019j547j4448l396m824R645
6733H960L0k5089l985K6452K7666k073Q027O737o257k4878Q430m666j114N037
6719B3277N190j1245j0691J1167K6910M994M078r051J7386M1485L7370N2136N6767
6706B49773L1557N650l5062l8106l6003l6558l3332k9792k7550l0434n904p107
$$ plain form
6800 -16480 -15623 -8044 5661 24629 13286 19640 24198 17977 18540 5608 -1627 -8147 -22243 -31762
6786 -31762 -30067 -40976 -20190 -5711 -3883 6212 -2772 979 -6053 -14141 -6309 -283 -17586
6773 -17586 -27829 -18316 4364 4251 -666 -8224 -7413 1320 19769 16766 20781 13263 4705 -10432
6759 -10432 -4773 9001 -4016 -11579 -14949 -12287 6183 10698 -3248 -3046 -11962 12903 29056
6746 29056 10618 -6803 -24216 -34474 -40959 -15445 16511 23530 21983 7535 4139 -685 8960
6733 8960 8990 -16099 -20084 6368 34034 31961 39988 46725 40468 15590 24020 19354 18240 23277
6719 23277 28467 17222 6531 17698 44608 49602 53680 44629 62015 103500 140870 193006 249773
6706 249773 281330 286980 251918 213812 177809 141251 107919 78127 50577 20143 14239 7132
6694G132k2569J1105r212n976J2255Q534N052Q149O106k965j4406O909o768n840
6680b494m327K157K1862n265l917J1731l691j4368M624K1637j2607m604Q72k4974
6666a3364n691K0596O870j4310l013q823O872R960q863j6625P175K9209P22o950
6652C765o631N54J9190J3002P149J983o860o031q508m505k2506j5934K083O379
6638a6870J941L875J7550P281j8751O3J6558K650q406l990n363L385O09p04J6347
6623A6175k091N03J2742J1051r298r359o589M353M138j2574j2177j0579j81P53
6609a3133j0968j1732J2193J0264j161l592p301j0488q980K9600q96R974J4143
6596G923O652N489j1012L280N231n990j2149r513J5930P726m296j4777j1215p188
$$ plain form
6694 7132 -15437 -4332 -13544 -19520 -7265 1269 6321 14470 20576 17611 3205 10114 3346 -2494
6680 -2494 -6821 -4664 17198 11933 8016 19747 16056 1688 6312 27949 15342 10738 11610 -13364
6666 -13364 -19055 1541 8411 -5899 -8912 -17735 -10863 -903 -9766 -26391 -19216 9993 10715 3765
6652 3765 -2866 -2312 16878 29880 37029 39012 32152 26121 17613 13108 -9398 -25332 -23249 -16870
6638 -16870 -14929 -11054 6496 13777 -4974 -4911 11647 14297 5891 1901 -3462 -77 532 -172 16175
6623 16175 14084 14587 27329 38380 29082 19723 13134 17487 21625 9051 -3126 -13705 -13886 -13133
6609 -13133 -24101 -35833 -23640 -13376 -14537 -18129 -25430 -35918 -44898 -15298 -16194 -6220 7923
6596 7923 14575 20064 9052 12332 17563 11573 -576 -10089 5841 13567 9271 -5506 -16721 -23909
6582b3909j324N454J1721J5244P327q093j834q199j1527J8744j81n737J0853K646
$$ plain form
6582 -23909 -25233 -19779 -8058 7186 14513 6420 4586 -3613 -15140 3604 3423 -2314 8539 11185
$$ [...]
##END NTUPLES=NMR SPECTRUM
##END=
