##TITLE=Analysis number 313890
Compound Code spb 08457
Book Reference 414/12/3
Project Code adrs
Chemist Name mattw
##JCAMPDX= 6.0         $$ Bruker NMR JCAMP-DX V2.0
##DATA TYPE= NMR SPECTRUM
##DATA CLASS= NTUPLES
##ORIGIN= Bruker BioSpin GmbH
##OWNER= NMR
$$ XWIN-NMR		Version 3.5
$$ Tue Sep 27 09:19:58 2005 GMT Daylight Time (UT+1h)  MAYBRIDGE\NMR@NMR_250MHZ
##.OBSERVE FREQUENCY= 250.131544655141
##.OBSERVE NUCLEUS= ^1H
##.ACQUISITION MODE= SIMULTANEOUS (DQD)
##.ACQUISITION SCHEME= undefined
##.AVERAGES= 16
##.DIGITISER RES= 18
##SPECTROMETER/DATA SYSTEM= dpx250
##.PULSE SEQUENCE= zg30
##.SOLVENT NAME= CDCl3
##.SHIFT REFERENCE= (INTERNAL, CDCl3, 0, 16.522)
##AUDIT TRAIL= $$ (NUMBER, WHEN, WHO, WHERE, WHAT)
$$ ##TITLE= Audit trail, XWIN-NMR		Version 3.5
$$ ##JCAMPDX= 5.01
$$ ##ORIGIN= Bruker BioSpin GmbH
$$ ##OWNER= NMR
$$ C:\u/data/dgb/nmr/ADRS/10010/pdata/1/auditp.txt
$$ ##AUDIT TRAIL=  $$ (NUMBER, WHEN, WHO, WHERE, WHAT)
(   1,<2005-09-27 09:19:39.83 +100>,<MAYBRIDGE\NMR>,<NMR_250MHZ>,
      <created by zg, POWCHK disabled, PULCHK disabled
       configuration hash MD5:
       62 19 C7 07 E1 42 D1 B7 37 6C 3D D0 77 39 F9 E6
       data hash MD5: 64K
       69 AB EF FD C6 6D 60 1E 85 E5 BE B1 F8 ED 9D E2>)
(   2,<2005-09-27 09:19:50.47 +100>,<MAYBRIDGE\NMR>,<NMR_250MHZ>,
      <Start of raw data processing
       ef LB = 0.3 FT_mod = 6 PKNL = 1 SI = 32K 
       data hash MD5: 32K
       07 2D 0E 49 E7 27 04 FD 54 DA C1 8D 7E C4 83 A3>)
(   3,<2005-09-27 09:19:53.06 +100>,<MAYBRIDGE\NMR>,<NMR_250MHZ>,
      <apk 
       data hash MD5: 32K
       AC E2 48 28 76 2E 91 29 6F 34 FE 43 0B FF 4B B1>)
(   4,<2005-09-27 09:19:53.80 +100>,<MAYBRIDGE\NMR>,<NMR_250MHZ>,
      <abs ABSG = 5 
       data hash MD5: 32K
       F6 18 F0 E5 0E 96 42 02 93 CA 78 1B 16 B1 4A 25>)
$$ ##END=
$$ 
$$ hash MD5
$$ D7 EE D9 85 19 76 26 D3 1B BB A2 AE B3 68 38 2B
##$RELAX= 
##$RELAX= 
##$RELAX= 
##$RELAX= 
##$RELAX= 
##$RELAX= 
##$RELAX= 
$$ Bruker specific parameters
$$ --------------------------
##$DU= <C:\u>
##$EXPNO= 10010
##$NAME= <ADRS>
##$PROCNO= 1
##$TYPE= <nmr>
##$USER= <dgb>
##$AMP= (0..31)
100 100 100 100 100 100 100 100 100 100 100 100 100 100 100 100 100 100 
100 100 100 100 100 100 100 100 100 100 100 100 100 100 
##$AQSEQ= 0
##$AQ_mod= 3
##$AUNM= <au_zg>
##$AUTOPOS= <5 >
##$BF1= 250.13
##$BF2= 250.13
##$BF3= 250.13
##$BF4= 250.13
##$BF5= 500.13
##$BF6= 500.13
##$BF7= 500.13
##$BF8= 500.13
##$BYTORDA= 1
##$CFDGTYP= 0
##$CFRGTYP= 5
##$CHEMSTR= <none>
##$CNST= (0..31)
1 1 145 1 1 1 1 1 1 1 1 1 1 1 1 1 1 1 1 1 1 1 1 1 1 1 1 1 1 1 1 1 
##$CPDPRG= <>
##$CPDPRG1= <>
##$CPDPRG2= <>
##$CPDPRG3= <>
##$CPDPRG4= <mlev>
##$CPDPRG5= <mlev>
##$CPDPRG6= <mlev>
##$CPDPRG7= <mlev>
##$CPDPRG8= <mlev>
##$CPDPRGB= <>
##$CPDPRGT= <>
##$D= (0..31)
0 1 0 0 0 0 0 0 0 0.06 0 0 0 0 0 0 0.0002 0 0 0 0 0 0 0 0 0 0 0 0 0 0 
0 
##$DATE= 1127809179
##$DBL= (0..7)
120 120 120 120 120 120 120 120 
##$DBP= (0..7)
150 150 150 150 150 150 150 150 
##$DBP07= 0
##$DBPNAM0= <>
##$DBPNAM1= <>
$$ [...]
##$SUBNAM7= <"">
##$SUBNAM8= <"">
##$SUBNAM9= <"">
##$SW= 20.6930455092707
##$SWIBOX= (0..15)
0 0 3 0 0 0 0 0 0 0 0 0 0 0 0 0 
##$SW_h= 5175.983436853
##$TD= 65536
##$TD0= 1
##$TE= 294.16
##$TE2= 300
##$TE3= 300
##$TEG= 300
##$TL= (0..7)
0 120 120 120 120 120 120 120 
##$TP= (0..7)
150 150 150 150 150 150 150 150 
##$TP07= 0
##$TPNAME0= <>
##$TPNAME1= <>
##$TPNAME2= <>
##$TPNAME3= <>
##$TPNAME4= <>
##$TPNAME5= <>
##$TPNAME6= <>
##$TPNAME7= <>
##$TPOAL= (0..7)
0.5 0.5 0.5 0.5 0.5 0.5 0.5 0.5 
##$TPOFFS= (0..7)
0 0 0 0 0 0 0 0 
##$TUNHIN= 0
##$TUNHOUT= 0
##$TUNXOUT= 0
##$USERA1= <user>
##$USERA2= <user>
##$USERA3= <user>
##$USERA4= <user>
##$USERA5= <user>
##$V9= 5
##$VALIST= <valist>
##$VCLIST= <CCCCCCCCCCCCCCC>
##$VD= 0
##$VDLIST= <DDDDDDDDDDDDDDD>
##$VPLIST= <PPPPPPPPPPPPPPP>
##$VTLIST= <TTTTTTTTTTTTTTT>
##$WBST= 1024
##$WBSW= 4
##$XGAIN= (0..3)
0 0 0 0 
##$XL= 0
##$YL= 0
##$YMAX_a= 469952
##$YMIN_a= -631343
##$ZGOPTNS= <>
##$ZL1= 120
##$ZL2= 120
##$ZL3= 120
##$ZL4= 120
##$ABSF1= 16.522
##$ABSF2= -4.171173
##$ABSG= 5
##$ABSL= 3
##$ALPHA= 0
##$AQORDER= 0
##$ASSFAC= 0
##$ASSFACI= 0
##$ASSFACX= 0
##$ASSWID= 0
##$AUNMP= <proc_1d>
##$AZFE= 0.1
##$AZFW= 0.1
##$BCFW= 0
##$BC_mod= 0
##$BYTORDP= 0
##$COROFFS= 0
##$CY= 12.5
##$DATMOD= 1
##$DC= 0
##$DFILT= <>
##$DTYPP= 0
##$F1P= 14.0000005364418
##$F2P= -0.99999901652339
##$FCOR= 0.5
##$FTSIZE= 32768
##$FT_mod= 6
##$GAMMA= 0
##$GB= 0
##$INTBC= 1
##$INTSCL= 1
##$ISEN= 128
##$LB= 0.3
##$LEV0= 0
##$LPBIN= 0
##$MAXI= 10000
##$MC2= 0
##$MEAN= 0
##$ME_mod= 0
##$MI= 0
##$NCOEF= 0
##$NC_proc= -2
##$NLEV= 6
##$NOISF1= 0
##$NOISF2= 0
##$NSP= 0
##$NTH_PI= 0
##$NZP= 0
##$OFFSET= 16.522
##$PC= 1
##$PHC0= -78.78114
##$PHC1= 8.049483
##$PH_mod= 1
##$PKNL= yes
##$PPARMOD= 0
##$PSCAL= 4
##$PSIGN= 0
##$REVERSE= no
##$SF= 250.13
##$SI= 32768
##$SIGF1= 0
##$SIGF2= 0
##$SINO= 400
##$SIOLD= 32768
##$SREGLST= <1H.CDCl3>
##$SSB= 0
##$STSI= 32768
##$STSR= 0
##$SW_p= 5175.98343685301
##$SYMM= 0
##$S_DEV= 0
##$TDeff= 65536
##$TDoff= 0
##$TI= <Analysis number 999999
Compound Code 99
Book Reference 9
Project Code 9>
##$TILT= no
##$TM1= 0
##$TM2= 0
##$TOPLEV= 0
##$USERP1= <user>
##$USERP2= <user>
##$USERP3= <user>
##$USERP4= <user>
##$USERP5= <user>
##$WDW= 1
##$XDIM= 32768
##$YMAX_p= 351705224
##$YMIN_p= -24591
$$ End of Bruker specific parameters
$$ ---------------------------------
##NTUPLES= NMR SPECTRUM
##VAR_NAME=  FREQUENCY,     SPECTRUM/REAL,   SPECTRUM/IMAG
##SYMBOL=    X,             R,               I
##VAR_TYPE=  INDEPENDENT,   DEPENDENT,       DEPENDENT
##VAR_FORM=  AFFN,          ASDF,            ASDF
##VAR_DIM=   32768,         32768,           32768
##UNITS=     HZ,            ARBITRARY UNITS, ARBITRARY UNITS
##FACTOR=    0.157963299565203, 1,           1
##FIRST=     4132.6476996994, 0,             0
##LAST=      -1043.33573715361, 0,           0
##MIN=       -1043.33573715361, -24591,      0
##MAX=       4132.6476996994, 351705224,     0
$$ Real data points
##PAGE= N=1
##DATA TABLE= (X++(R..R)), XYDATA
$$ [...]
15310B974O344O74K460n333M574J229r153N758M509m342m812j0131K007J831L450
15295B039P043M246N94k381M76K475K161o354o315k620K888L662j917M13m174
15280B236o757M890j579M317K574J579j241Q06J613m54l292l791n337Q95k021
15265e562n795N974O519K578k423j848j260m234n091k291R56L892M854N099L501
15250D869n64l853L17P28P46j383m076m772L49o614R08O975M886N053O960n899
15234D630o102n448l423Q847M211q98j0947n915k159J257Q010N488J408k197M191
15219I53k68o19l402L132J2545K07p955n785n91O85J59K586L819L525N354J491
15203A5836j678m670r933n732J0259K887L14n037l784k462k975q548k522J1519
$$ y = [2974, 9318, 9992, 12452, 7119, 11693, 12922, 3769, 9527, 14036, 9694, 4882, -5249, -3242, -1411, 2039, 9082, 13328, 13922, 11541, 12017, 14492, 16653, 10299, 3984, 1364, 4252, 7914, 5997, 6410, 2236, -4521, 369, -1210, 3107, 5681, 7260, 6019, 6825, 8438, 7984, 4692, 901, -4436, -3541, -5562, -11357, -5383, 1136, 3714, 1291, -557, -1817, -6051, -11142, -13433, -12477, -8585, -3731, 1368, 4869, 4305, 452, 769, 1497, 2243, 860, -3216, -7988, -7639, -14253, -13345, -6370, -1484, 3569, 10529, 4630, -1472, -6920, -10343, -1496, 2715, 1817, -9130, -15045, -17204, -15947, -7937, -2449, -1041, -3238, 953, 685, 66, -3336, -204, 12341, 12548, 4593, -1192, -1783, -1098, -939, 1647, 5466, 8991, 14345, 15836, 14158, 9488, -445, -6177, 4082, 6969, 7283, 2246, -1538, -4000, -6975, -15523, -18045, -6526]
15189f526L361l12J787L900k39L773R07J224N342K24n225m779L397J759n506L567
15173F654P800l784q318l429n168J577J349k470j774N712p92o128P7M997R33J828
15157i36K810K57n364J190q06l329o077l086P63O126K068L387Q51j662j224l867
15141h899k011K583J363k540m67O04j03M527k174k635L776Q850M363m816m203
15126a782K574j490j6j264N095P428j041K8m304j485k029k068J05j149N892L443
15110G937o955k216K925L496l605j447O97J323J299N149M239o134m592j666j423
15095i73n023M409L503K049p69l24K55n904m602K65J225N877M121M435L253N48
15079A2345o19k956K593N946J272m126m402l630K090m567K072O647J615k704k633
$$ y = [-6526, -3165, -3477, -1690, 2210, 1971, 5744, 6651, 7875, 13217, 13441, 8216, 3437, 6834, 8593, 3087, 6654, 14454, 10670, 2352, -1077, -6245, -4668, -3319, -5789, -7563, -1851, -2643, -8771, -8694, -3697, -2764, -936, 1874, 2131, -3233, -2043, -2849, -6178, -12255, -15341, -14578, -8452, -6384, -2997, -2146, -3808, -5032, -8899, -10910, -8327, -6964, -9504, -9971, -9367, -9470, -4943, -7117, -9752, -5976, 2874, 7237, 2421, -1782, 792, -698, -714, -1978, 3117, 10545, 9504, 9532, 5228, 3743, 1714, -354, -249, -1398, 4494, 7937, 982, -1234, 1691, 5187, 1582, 135, 832, 2155, 3454, 8603, 12842, 6708, 2116, 450, -973, -5996, -1587, 1916, 3965, 3196, 2872, 3127, -2777, -7379, -7114, -5889, -12, 4109, 8544, 11797, 12345, 11726, 8770, 11363, 17309, 18581, 14455, 10053, 6423, 8513, 3946, 6018, 12665, 14280, 11576, 8943]
15064H943K170N76r988l740J268Q637m071n753J1579J1375o78q463k445L702o945
15049F167l554O354m251p519M810J0637K813m052q074j156K426j73j743N346Q480
15034A6511K66o916m006m270o066o160n89O594Q959q001m638N440m261K542k17
15019d812n96J728L341L265p751K002J184M00N435l787n736N439L152J345L29
15004D938n513k042k044j005L459j670n749K406K927n55P247p028n555l884j965
14989a6033J923Q616N794J075k993J102K345O9l912M176k593r498K692O546j793
14974b484j851j515N521n078l899M230K903J874k257J684L15k132o478K319k491
14959i339K62L941J229K62K599J204M189P058J469n073q323j583M162N601J321
$$ y = [8943, 11113, 11689, 1701, -2039, -771, 7866, 3795, -1958, 9621, 20996, 20318, 11855, 9410, 13112, 6167, 2613, 8967, 4716, -2803, 2007, 12644, 15457, 11405, 3331, 2175, 4601, 4428, 2685, 8031, 16511, 16777, 9861, 5855, 1585, -4481, -10641, -11230, -4636, 4323, -3678, -8316, -2876, -7137, -4595, -4812, -5408, -3680, -339, 2926, -4825, -2823, -1639, -1239, 4196, 409, -5327, 112, 3264, 4609, 4938, -575, -2617, -4661, -5666, -2207, -3877, -9626, -7220, -4293, -4848, 2399, -4629, -10184, -14068, -16033, -14110, -5494, 300, 1375, -1618, -516, 1829, 1898, -2014, 2162, -431, -9929, -7237, -691, -2484, -4335, -5850, -329, -5407, -9306, -5076, -2173, -299, -2556, -872, -557, -2689, -9167, -6848, -9339, -9077, -5136, -3907, -3645, -1046, 158, 4347, 11405, 12874, 7801, -522, -2105, 2057, 7658, 8979]
14944H979l126L46j621n066j848J100J202j850m79K154Mm340k982m196P760J873
14928b090n952L834Q840M619n577r386k760N921K992k32l070M514K560L310K519
14913A0042j022m828k855n00K967O374k497l058j4M551L323m51q584k594K684
14898C538m963K209L962K15r24k393k945l367L854O226l135l196R34L118j800
14883A333K392m712o490j058L144K887K474k895L234N973k158l769K349k864j749
14868a909P52L614K142l973l057l409N380N879J123k981p817J2L934R901N422
14853A5013k363k151j649r488J040O146P15n810J321M573m553j984o26J070j763
14838e09L815o994L008L647K69m521j214K452K079K556o89l221j700Q62l78J0267
$$ y = [8979, 5853, 6199, 4578, -488, -2336, -1236, -34, -1884, -2363, -209, -205, -4545, -7527, -11723, -3963, -2090, -8042, -4208, 4632, 9251, 3674, -5712, -8472, -2551, 441, 209, -2861, 1653, 4213, 7523, 10042, 9020, 4192, 1337, 837, 3804, 10178, 7681, 4623, 4609, 9160, 12483, 12032, 3448, 854, 3538, -1425, 784, 4746, 4961, 4037, 1644, -1301, -4668, -814, 5412, 2277, -919, 15, 3133, 1333, 3725, -987, -7477, -8535, -5391, -2504, -30, -2925, 309, 6282, 4124, 355, 2704, -160, -1909, -1157, 2457, 4599, 626, -2431, -5840, -460, 5419, 6542, 3561, -4256, -4244, -310, 9591, 15013, 12650, 10499, 8850, -638, 402, 6548, 7263, 1453, 2774, 7347, 2794, 810, 184, 1254, -509, 3306, -3688, -680, 2967, 3236, -1285, -2499, -47, 2032, 4588, 3899, 678, -1022, -160, -538, 9729]
14822I729M12l405q005m315n17m071l65K254P160k381m141m293n625m07J1039
14807f931Q808j971k963L097n91J084j889J731m039K209M167k519j037N41l550
14792c853l873R272L392j0058J367N772J577k948j416O1M452J224m924L277N132
14777H454L152k693m622p809O38k211L50k159k154O157O191L439q918n491L207
14762d469N499L414O348L407N05j619j2098m882K640K784Q01M81l888K480r54
14747D49n760p615L465R233Q152M329p666l678J791Q99R94o042k932K447l412
14732e346k786J519K846j557j716Q177P794Q28m095m781j730J547K446j684j05
14717A357L836k795M30O072k302j271l054m947J335p63l291L240J0180J2610N301
$$ y = [9729, 10141, 6736, -1269, -5584, -6101, -10172, -10537, -8283, -1123, -3504, -7645, -11938, -17563, -17970, -6931, 1877, -94, -3057, 40, -551, 533, -1356, 375, -3664, -1455, 2712, 193, -844, -303, -3853, -7726, 1546, 4938, -5120, -3753, 2019, 3596, 648, -768, -707, 3745, 4969, 45, 3322, 8454, 11606, 8913, 4291, -3518, -2880, -5091, -4741, -6900, -9054, -2897, 3294, 6733, -2185, -7676, -4469, 1030, 4444, 10792, 14199, 14704, 13085, 987, -3895, -1255, 1529, 2330, 2811, -1077, 1403, 449, -5311, -12926, -9461, -228, 7924, 12253, 4587, 909, 2700, 3599, 4593, -1449, -4381, -1934, -5346, -8132, -6613, -3767, -5324, -7040, 1137, 8931, 9759, 5664, 883, -847, 700, 3146, 1462, 1357, 5193, 2398, 2828, 8900, 6598, 5327, 2273, -2674, -1339, -2102, -5393, -2153, 8027, 20637, 25938]
14702B5938n560j0083p939n984JJ398j702N08N437L80o136L050k02o972o515M438
14686i943L353M975M967Q42n106j888L129P820P515n221q588o05N649k213M483
14671I169L176j791J822m546j354j103j098m827n413P731O964j86r36r648m772
14656f812K952j631L899J369j294p603k672J439J838R72O942O93n052o883j278
14641a3121J571K403J612P157M768L54j025k847N19J569j323j854l269p71L108
14626a149L36J328L319k422j828o428K510N884L706q23m480n341l988j629K182
14611h823L148j539k896j961O272L312l683J55L382k651l699J080O928n64L930
14596B391M326j111j173k211J924q581k067M589N123N869j525p084p236J919J759
$$ y = [25938, 20378, 10295, 2356, -3628, -3627, -2229, -3931, -3423, 2014, 2394, -3742, -692, -894, -7866, -14381, -9943, -6590, -1615, 3352, 4194, -912, -2800, 329, 8149, 15664, 10443, 1855, 1250, 6899, 4686, 9169, 12345, 10554, 12376, 7830, 6476, 5373, 4275, -552, -5965, 1766, 8730, 8544, 7608, -2040, -6812, -3860, -5491, -1592, -223, -1517, -9120, -11792, -10353, -8515, -7543, -601, 92, -4960, -11843, -13121, -11550, -9147, -7535, -378, 4390, 4744, 3719, 872, 1391, 2960, 1637, -217, -3486, -4257, -1149, -813, 515, 3834, 1412, -416, -6844, -4334, 1550, 5256, 4433, -47, -5388, -9376, -11005, -8823, -5675, -7214, -10110, -12071, -5799, -2487, -6170, -6015, -2633, -5284, -8983, -7903, -975, -1539, 2391, 6717, 5606, 4433, 2222, 4146, -4435, -6502, -1913, 3210, 9079, 7554, 470, -6766, -4847, -3088]
14581c088J2367m786J226P196m917q690k290L721p762J96K342j417O504O274o656
14566B20K393N783p668n887N162O109m733J27M092K413m069R36L93k565n329O704
14550D081J829J922j024o594p878J4Q185M866k79m399l774m799N602J0107J965
14535I824p10q881k509l241n145R13n61K451K333L610K404j220o884M606Q741
14520E731k408L385N666n607n099n584k169M336l960l899N322O302M660p73m655
14505A248k157n215O50m614k095R356K322L075J250k003K61j438n485O636J1254
14490A3045j582m847k908J026L556L70j1112n181J965P645l617q052M761O1O145
14475A275K625p610k896n31m640l770J0386P790K31m351k315m098o383K989N602
$$ y = [-3088, 9279, 4493, 5719, 12915, 7998, -692, -2982, 739, -7023, -6827, -4485, -5902, 602, 6876, 220, 2613, 8396, 728, -5159, 3, 6112, 1379, 1506, 5598, 8011, 3942, 4878, 5271, 2706, -2623, 4081, 5910, 7832, 6808, 214, -7664, -7650, 535, 5401, 5122, 723, -3051, -7850, -2248, 7859, 9824, 9114, 233, -2276, -5517, -10662, -9749, -10310, -7859, -5526, -1916, 488, -732, -7616, -3010, 5731, 3323, 6708, 12374, 6767, 1668, -3916, -6085, -1749, -5709, -9608, -4286, 2016, 6676, 5903, 1248, -909, -6124, -5474, -10088, -12183, -2827, -505, 2570, 3820, 1817, 2078, 640, -4845, 1791, 13045, 11463, 6616, 3708, 4734, 8290, 8660, -2452, -7633, -5668, 1977, -1640, -9692, -4931, -4870, 1275, 3900, -3710, -6606, -7137, -11777, -15547, -5161, 2629, 2860, -1491, -3806, -7904, -14287, -11298, -5696]
14460e696J376J783J339k178L11o165J929P298O301k013m758j757k591J334Q18
14445b669J717K379n99j258L246M988m553K482p49K097k872n331l066J044N028
14430A884J133l264J965N331J25j895J38N913j347m768k594n13n212k127L016
14415b215L87n15L337K297J97n40o713j549K372j682L178O52o50R1L433M569k489
14398D160M251L480n805L650n493p338j911M519M175l052j110O397j598o189K155
14383B91M109M013l071m238J574J848L494N862l729p386K220O03j941k804N846
14368F691j477R35j09m235K862K394q87k662j150K746p430j611n78L279L326k093
14352Al939p93k189N032J814n51j391m355O019P344L749j507m965M073M70m886
$$ y = [-5696, -4320, -2537, -1198, -3376, -3065, -9230, -7301, -3, 6298, 4285, -473, -2230, -4821, -3487, -2669, -952, 1427, 828, -430, 2816, 7804, 3251, 5733, 4984, 7081, 4209, -1122, -4188, -3144, 1884, 3017, -247, 1718, 7049, 7174, 5279, 5417, 11330, 9983, 5215, 2621, 2108, -3104, -5231, -2215, -1828, -2343, 994, 3291, 3488, 2948, -3765, -5314, -2942, -4624, -1446, -794, -1444, -1353, 2080, 6649, 4160, 8411, 11891, 6086, 9736, 4243, -3095, -5006, -487, 3688, 636, -474, 5923, 4325, -1864, 291, 4400, 8413, 5342, 1104, 2678, 4526, 8020, 13882, 10153, 2767, 4987, 5590, 3649, 845, 6691, 5214, 6149, 6040, 1805, 4667, 7061, 6174, 3512, 2362, 5108, -2322, -3933, -4511, -1232, 2094, 1, -3938, -4731, -6920, -1888, -74, -625, -2016, -6371, -352, 6992, 10741, 9234, 4269, 8342, 8812, 3926]
14336C926q939l842l906J969Q642N224m408k602R17k168m044L139L828O957P047
14321A1740J576r955m659P044K263J534j228J705p127J78j368K915r97o182r92
14306c553M015P982J9m416n165j0282M910M530k348o74j737l14J540M963K842
14291B312m089q853P99Q602R775K907j998N71j609p450k916K678k927q915K076
14276i037N566J038M657K96K852K499o976j426L241J183j07l214m098K413L504
14261B391p60l555p173Q273J1127L478K617J363p833m560L67l020j777K648m587
14246a001p771K684M178L068r11j556N591K923l052o802k151O11j1088o15O279
14231i613O832K18j301J563J314m727l094k320Q205J0402o448q043m10Q293P1
$$ y = [3926, -5013, -8855, -12761, -10792, -2150, 3074, -1334, -3936, -3019, -5187, -9231, -6092, -2264, 4693, 11740, 13316, 3361, -1298, 5746, 8009, 9543, 8315, 10020, 2893, 3071, 1703, 4618, 3621, -2561, -3553, 462, 8444, 8463, 4047, -1118, -11400, -6490, -1960, -4308, -4982, -6719, -7033, -5493, -530, 2312, -1777, -10630, -9831, -1229, 8546, 11453, 9455, 10026, 8417, 967, -1949, 729, -2198, -11113, -9037, -3471, -2433, 2224, 2520, 5372, 7871, 895, -531, 2710, 3893, 3786, 572, -3526, -1113, 2391, 1631, -1924, -9097, -824, 10303, 13781, 16398, 17761, 9928, 5368, 5735, 2715, 938, 3586, -1001, -8772, -6088, -1910, 1158, 247, -1309, 4282, 7205, 4153, -2649, -4800, -4189, -15277, -15892, -9613, -2781, -2563, -3864, -2301, -987, -5714, -8808, -11128, -2923, 7479, 1031, -7012, -7422, 871, 942]
14216I42j11L96j087n126r795j856P316P364J943j996K654P595J506p352l684
14201a291j486M064M799kk476k772K734M042q053o930N226l587j014Q01M868J333
14185B56m709k865J694P359j963n113r80n65J526k43K39k375L082j587l643L846
14169f041L927N90p89m359K483N204N66m721r03J802N244O084n515m689N849R63
14153E695m620k320K221J74K754O73M960l578p64J965J667K477n665j726R02n925
14137a110J44K475l845o15N405M461k372l855j775P60K466L725q69k613m938o024
14121h580K483K868J443n169J164j216n251O60N007J0271Q752k897j020L323r411
14106B427r306m328J3234N758K23j484m305k429M188n52l523l220p56K262m551
$$ y = [942, 831, 1227, 140, -4986, -14781, -16637, -9321, -1957, -14, -2010, 644, 8239, 9745, 2393, -1291, -2777, 1287, 6086, 6084, 3608, 836, 3570, 7612, -441, -7371, -2145, -5732, -6746, -5945, -1077, 256, -4453, -7318, -5624, 1735, -228, -5341, -6321, -6886, -5360, -5603, -5364, -7739, -4657, -6244, -9887, -6041, -2114, -1524, -2313, -6672, -4189, 1015, 1581, -3140, -4043, -2241, 3003, 9087, 3572, -1117, 4732, 5695, 1075, -1245, 976, 1150, 3904, 4577, 9537, 5959, 5195, 7160, 8827, 11304, 5639, 3913, 4815, -1110, -966, 1509, -2336, -2951, 2454, 6915, 4543, 688, -1087, -327, 2139, 5864, 4995, 2382, -2556, -8580, -6097, -3229, -1786, -6955, -5791, -7007, -12258, -11598, -6591, 3680, 12432, 9535, 8515, 11838, 2427, -6879, -11207, 2027, 7785, 8008, 6524, 2219, -210, 3978, 3426, -97, -3317, -4073, -1811, -6362]
14091f362j384j253N84N323O740P38k572m848O909j865n810j302m093j474L435
14076g234M101l572P584O129j507l87o628n41j541M335J92N670L829N471k432
14061A3469l891o447r303l200M139M309M3Q662m628O46J540n334J641L689k847
14046B488l996l591L472O976L94K585P268k562K128j567l618l121l084l3L239
14031F978j267j637n968P73j30L683P131k277o017j0039p04N265J981J33l013
14016e108J227N961Q79n355K580K373Q97P70J395K142J538l544o441j10J836n74
14000D66l080o257L199m335k510J669O130R975k966r733L213N507N56j774l924
13985c864n471Q266L895o84j766l314m21L142J179k431M29j635j730J364M210
$$ y = [-6362, -7746, -8999, -8415, -3092, 3648, 4386, 1814, -3034, 3875, 2010, -3800, -5102, -9195, -10669, -7234, -3133, -6705, 879, 7008, 5501, 5114, -1514, -2055, -3596, 739, 931, 6601, 10430, 15901, 13469, 9578, 3131, -6172, -9372, -5233, -924, -881, 7781, 3153, 3799, 5339, 5, 1646, 5335, 2488, -1508, -5099, -1627, 5349, 5743, 8328, 15596, 13034, 15162, 13595, 9977, 6856, 3772, 3739, 6978, 5711, 4074, -1894, -1121, -1251, 2432, 9563, 7286, 1269, -8770, -9474, -4209, -2228, -2095, -5108, -3881, 2080, 2959, -2396, 184, 2557, 3454, 4224, 5619, 7761, 9299, 5755, -686, -796, 1040, 466, -2614, -8871, -5672, -10007, -12517, -10848, -4718, 5257, 2291, -7442, -4229, 1278, 1834, 60, -3864, -9335, -1069, 2826, 2142, 376, -2938, -3359, -217, 962, -1469, -1040, -2675, -4405, -3041, 1169]
13970A169k487j455L083J491K760J088l659m959N554M434M756J706k968m492o596
13955e75K702L368o304Q77k533R53L60L874l588n220O012J1197J206l493r59j424
13939F453J573p958l899q36N675j50j167O60j354k119n978K70j268L465N340m349
13923e642k876j781K323N736J717O575J18o09r86o428N88O889k692k499J982j190
13907A225M322M428J88M259J638o984n915J412P24k956m655K326N146j033J389
13892E514M94o853m275l334K817N122M416J820K988P163l537l621K979N816Q615
13877B6124q855q849J495l44J111K090o91O758Q079l532r240K25L369J566m429
13862A4877j1567p98p12R85O944M044j788k421k269q43m232l514N550L016M821
$$ y = [1169, -1318, -2773, 310, 1801, 4561, 5649, 1990, -2969, 2585, 7019, 11775, 13481, 10513, 6021, -575, 2127, 5495, -809, 68, -2465, -1512, -1152, 2722, -866, -6086, -74, 11123, 12329, 8836, 7877, 6453, 8026, 68, -3831, -4667, 1008, 858, -309, 351, -1003, -3122, -9100, -8830, -10098, -6633, -1293, -5642, -8518, -10299, -7976, -2240, -523, 6052, 6170, 5561, 4575, -1853, -1265, 5624, 2932, 433, 2415, 1225, 5547, 9975, 10163, 14422, 16060, 9076, 3161, 4573, 5297, 2341, -2314, 12, 5158, 4125, 5514, 6008, -845, -5120, -8454, -5637, -515, 3901, 5721, 8709, 15872, 12335, 8714, 11693, 17509, 26124, 17269, 8420, 9915, 9571, 10682, 12772, 12081, 18839, 26918, 23386, 14146, 14371, 17740, 19306, 14877, 3310, 2512, 1800, 2785, 9729, 13773, 11985, 9564, 7295, 6452, 2220, -1294, 4256, 7272, 12093]
13847A2093J574m122m994j792o466M940k137J449N798k47j173K8J373M859m203
13832F980m182J354l140k549J156K230K991k147j334O000R565j980j0157J457
13818F244J769k019K270l345k48J728P6k343p661j1952M425J7532O783j513k531
13803I215L818J394Q916N06n770l971l130R08J096j731m455m684j60k249Q284
13788G987P792L187n029j939O039K651m14J714O047n324l640o441k335K610L16
13773A3221l533J513N028j052k665k18L013L090P020L207P91l115J855o777j3804
13758G574J023K051K902LQ766m89l33o022o488M051K630k649p1r26J652J145j809
13741A3010k25j716n282O725M449n000j216L342K887l399m548k109L904N475L23
$$ y = [12093, 13667, 9545, 4551, 2759, -3707, 1233, -904, 545, 6343, 6096, 4923, 4951, 6324, 11183, 6980, 2798, 4152, 1012, -1537, -381, 1849, 4840, 2693, 1359, 7359, 16924, 14944, 4787, 6244, 8013, 5994, 8264, 4919, 4671, 6399, 6475, 4132, -3529, -15481, -11056, 6476, 13259, 11746, 9215, 13033, 14427, 23343, 23849, 18079, 14108, 10978, 11886, 12982, 11251, 6796, 2112, 1952, -297, 7987, 15779, 18966, 13937, 11998, 18037, 20688, 20274, 21988, 28035, 22711, 19071, 12630, 10295, 12905, 13221, 9688, 11201, 16229, 15177, 12512, 12294, 15307, 18397, 25417, 28624, 29415, 26300, 28155, 21378, 7574, 8597, 10648, 13550, 13553, 22319, 21830, 21497, 15475, 8987, 13038, 15668, 13019, 12948, 12022, 13674, 14819, 13010, 12785, 11069, 5787, 12512, 16961, 11961, 10745, 14087, 16974, 13575, 9027, 6918, 10822, 16297, 16620]
13726A6620n60N121R44n911q03J407O58K569O090N1p233l297K967P98J7J190k891
13709A7737n230j373Q49M785k118p101j594P025N130j459K165p80R07k741j904
13694A4298j187N282n54o433M042J0218j26J691L638K845M048Rk499l368o771
13679B5133j480M614r86m932q41L587K525K25Q51l351l246n61m281J442L344M031
13663B6074n061r15L396L802J0167K884n275m922K599l674n13m041l864K222R4
13648B2973L500K058J131j125M107m13o163j795J71J947O843J684l740l165L346
13633C1359N263L195L473m69k359p631l410o38L431o83K201j651n898j118R31
13618B5996K258r62J339P414J107j390p017j566k710m490M273J600J074M108j055
$$ y = [16620, 16060, 21181, 22125, 16214, 15411, 16818, 17476, 20045, 26135, 26186, 18953, 15656, 18623, 19421, 19438, 20628, 17737, 12507, 11134, 11983, 16768, 14650, 7549, 5955, 12980, 18110, 16651, 18816, 18036, 18943, 16202, 14298, 13111, 18393, 17839, 11406, 15448, 25666, 25540, 27231, 30869, 33714, 37762, 37771, 35272, 31904, 25133, 23653, 28267, 27281, 22349, 21508, 25095, 27620, 27845, 28696, 25345, 22099, 21538, 17257, 18699, 22043, 26074, 21013, 20098, 23494, 27296, 37463, 40347, 35072, 30150, 32749, 29075, 28562, 24521, 20657, 22879, 22973, 26473, 28531, 29662, 28537, 32644, 32231, 26068, 24273, 24444, 26391, 33234, 34918, 31178, 28013, 31359, 36622, 39817, 43290, 42821, 40462, 32831, 29421, 28783, 32214, 31531, 33732, 32081, 26183, 25065, 25996, 28254, 27292, 28631, 36045, 37152, 35762, 28745, 27179, 24469, 19979, 24252, 25852, 26926, 31034, 29979]
13603B9979k149K155L731K283L815o570J164o267k464k978l930L183M028M835
13589C0815r65k141N235R486o148l119Q53Q225N467k028N550L427m115m089l938
13574D2515JL525n477L929K918l29J810J932k329l324k323l620L397N300k257
13559D5668k135L13O276p41j1056o713O675O946n554j732q64O54M723J273L53
13544D4086K625K873K407L025l047k986r24M899J675L791L754R27o937r524l742
13529D2902P2J987l562K812J728R21L471p63j406J797j921L810l622j0978k42
13514C7006R695J0065N690N01j225q142o614m357J279R547M195l36n93j903K46
13499E5054l023K640O559N762K103o370N68O188m556q454j801m224j182o735l29
$$ y = [29979, 27830, 29985, 33716, 35999, 39814, 33244, 34408, 28141, 25677, 22699, 18769, 21952, 25980, 30815, 29850, 27709, 32944, 42430, 36282, 33163, 34016, 42241, 47708, 45680, 51230, 54657, 50542, 46453, 42515, 42516, 46041, 40564, 44493, 47411, 47082, 48892, 50824, 48495, 45171, 42848, 39228, 42625, 47925, 45668, 43533, 43846, 50122, 49381, 38325, 31612, 38287, 45233, 39679, 37947, 37083, 37737, 42460, 43733, 44086, 46711, 49584, 51991, 55016, 51969, 48983, 48059, 52958, 54633, 58424, 62178, 63105, 56168, 46644, 42902, 42974, 44961, 41399, 44211, 45939, 46860, 50331, 49568, 48162, 49959, 48038, 51848, 48226, 37248, 37006, 46701, 56766, 62456, 62957, 61732, 53590, 46976, 42619, 43898, 53445, 57640, 57304, 56711, 54808, 55054, 52031, 54671, 61230, 66992, 69095, 62725, 63293, 69481, 64925, 56471, 54670, 50446, 49264, 42529, 42200]
13484D2200L647Q921j000j1354o91L864K886L60K853P124K059K94p461k653M966
13469E6015N994j490k226l305J735M235K67J6j859l452n09j338m089L796N473
13454E9263P076m340r293L185N927J814p682N10M764L203Q410J549m393m336k369
13439F3288j851k691P65O889J80p650M026l404M086M331L042k161n034l871n279
13424E4666j486j1o54j200Q570P903j466n461j551j554j837M366K307k378j296
13409E8918J22L370N43k480k792l92n315q508O027N169P244n911R91J169N338
13394F3493n549l693m098M320K724O779k42M519k795K0L52j190l306r731P397
13379E9000O536l215L8M903L91k390m240L623N789R15k560O692P695j748j0005
$$ y = [42200, 45847, 54768, 53768, 42414, 41723, 45587, 48473, 48833, 51686, 58810, 60869, 61163, 53702, 51049, 56015, 62009, 60519, 58293, 54988, 56723, 60958, 61225, 61241, 59382, 55930, 55421, 54083, 49994, 53790, 59263, 66339, 61999, 52706, 55891, 61818, 63632, 55950, 56460, 61224, 64427, 72837, 74386, 69993, 65657, 63288, 61437, 58746, 59511, 66400, 66580, 58930, 62956, 59552, 63638, 67969, 71011, 68850, 63816, 59945, 54666, 53180, 53169, 52515, 51315, 59885, 67788, 66322, 60861, 59310, 57756, 55919, 60285, 62592, 60214, 58918, 59040, 62410, 62953, 60473, 57681, 57289, 51974, 43466, 49493, 54662, 61906, 55995, 56986, 58155, 63493, 57944, 54251, 50153, 54473, 57197, 63976, 63734, 68253, 65458, 65478, 65830, 64640, 61334, 51603, 59000, 65536, 62321, 62359, 67262, 67653, 65263, 61023, 64646, 70435, 71350, 68790, 75482, 83177, 81429, 71424]
13364G1424k405j213l461k271j250O738L637r559l607P235L074l35J1144l008
13350G6143K308k356m89L667j140M417K946L334O72j109r71j288j013j166o818
13335G7137Q93j446l08J313K466N531k55j915J641K600J82j494k208L682o86M989
13319I2122J671P96M632J171K622J075M884o770l671P74N632Q76j999l794O542
13304A06563J394L536M193j23j274n233J587P410O70k381k213O768l847l804O926
13289A20172N204N710J1808P962J144m899l312j88m28L518k168J229J822K375
13275A49949L08m752P139M214J233N310M098O570N138J008J569P253N076L122
13261A97235J1052O774l44o523l100l556L118N379L09M235M327j300N745J773
$$ y = [71424, 69019, 67806, 64345, 62074, 60824, 67562, 71199, 61640, 58033, 65268, 68342, 68007, 79151, 76143, 78451, 76095, 75606, 79273, 78133, 82550, 85496, 88830, 89502, 88393, 87422, 86134, 85121, 83955, 77137, 78030, 76584, 76276, 77589, 80055, 85586, 85331, 83416, 85057, 87657, 87839, 86345, 84137, 87819, 87133, 92122, 93793, 94589, 99221, 100392, 103014, 104089, 108973, 102203, 98532, 99306, 104938, 105814, 103815, 100021, 106563, 107957, 111493, 115686, 115563, 114289, 109056, 110643, 118053, 118723, 116342, 114129, 120897, 117050, 113246, 120172, 125376, 131086, 142894, 150856, 152000, 147101, 143789, 143601, 143173, 146691, 144523, 145752, 147574, 149949, 150257, 145505, 152644, 156858, 158091, 163401, 167499, 174069, 179207, 180215, 181784, 189037, 194113, 197235, 208287, 215061, 214717, 208194, 205094, 201538, 204656, 210035, 210344, 214579, 218906, 217606, 223351, 225124]
13247B25124J748J1520J6940J5878J5516K055l374q339j4450n473m19K807M630
13234B64163N412L590M0k236O480M838k889M235L936L033L855Q005K318K743M504
13219C12027L5L78M18K651J741L545N747J1618J0433O303M52N993L828J0824M572
13204C80565P291P663L686k309j47L394O012N38O835R769J1279O227N032J1670
13190D57505R184M537J1859J5792J2504P386N458O718P030J2780J7096J0414O904
13177E85167P788J1102J5726R830J4515J1981J3458J2033J2218J0391K4054J8702
13165G46965J4585J3988K5587J8844J8405J8973J9699J8912K4931K1430K0395
13154I62714K3971J6542J9231K8432K7281K3268L1429L3707L5511L2064K8964
$$ y = [225124, 226872, 238392, 255332, 271210, 286726, 288781, 285407, 277068, 262618, 257145, 256726, 259533, 264163, 269575, 273165, 273205, 270969, 277449, 282287, 279398, 283633, 287569, 290602, 294457, 302462, 304780, 307523, 312027, 312062, 312440, 312858, 315509, 317250, 320795, 326542, 338160, 348593, 354896, 355348, 361341, 365169, 375993, 380565, 387856, 395519, 399205, 396896, 396749, 400143, 406155, 406693, 413528, 423297, 434576, 440803, 445835, 457505, 466689, 471226, 483085, 498877, 511381, 518767, 524225, 530943, 537973, 550753, 567849, 578263, 585167, 592955, 604057, 619783, 629613, 644128, 656109, 669567, 681600, 693818, 704209, 728263, 746965, 761550, 775538, 801125, 819969, 838374, 857347, 877046, 895958, 920889, 942319, 962714, 986685, 1003227, 1022458, 1050890, 1078171, 1101439, 1132868, 1166575, 1202086, 1234150, 1263114]
13143A263114L3752L9927M0170L8612M0876M1095L6731M0757M2097L3405M0396
13132A690932M9179M2573M0341M5220N2252O0613N8401N5161M8693N5865N6623
13121B255853M9979N9795O3486O0241O0303O4905O6547O9653O5608O3308N6981
13110B936659O1337N9473M7194M8920N9938O0579N6097N5935N3407N7559N5912
13099C553010N3213M8626N1461M6192M1808M0397M5898M1014K4415J9841K4485
13088C990360J9261J8205J8256K6257K5637J0487J2425P886J0089Q386N372K108
13076D154729l65K360K641j95k898j3067j7056q812k3786k2742k2610k5435j4698
13063D008066r490k5747j8948j5642j8885j6735j4711k4595k8652j3870q231j5655
$$ y = [1263114, 1296866, 1336793, 1376963, 1415575, 1456451, 1497546, 1534277, 1575034, 1617131, 1650536, 1690932, 1740111, 1782684, 1823025, 1868245, 1920497, 1981110, 2039511, 2094672, 2143365, 2199230, 2255853, 2305832, 2365627, 2429113, 2489354, 2549657, 2614562, 2681109, 2750762, 2816370, 2879678, 2936659, 2997996, 3057469, 3104663, 3153583, 3213521, 3274100, 3330197, 3386132, 3439539, 3497098, 3553010, 3606223, 3654849, 3706310, 3752502, 3794310, 3834707, 3880605, 3921619, 3946034, 3965875, 3990360, 4009621, 4027826, 4046082, 4072339, 4097976, 4108463, 4120888, 4128774, 4138863, 4147249, 4152621, 4154729, 4154364, 4156724, 4159365, 4159170, 4156272, 4143205, 4126149, 4117337, 4093551, 4070809, 4048199, 4022764, 4008066, 3998576, 3972829, 3953881, 3938239, 3919354, 3902619, 3887908, 3863313, 3834661, 3820791, 3812560, 3796905]
13051C796905j8742j2940Q85j900m507j9311p298J38M78K886N109O717P766J2704
13037C768890R325J0064J4434J8916J6777J5799K3222K7866K5009K3778J8925
13026C973005J7661K4162K7311K5673K1089K8294K6206K4084K1324K0556J8848
13015D228213J9290K2032J2249J7865J4623N150N083R202O205O767M219n491j108
13002D344299p318j1159p955j0574k0086k6815k2391l0021l4562l1237l7632l5789
12990D068760l8443m1196m5707n0240n1622n5005m5776n1275n4156n7080o3122
12979C515138o4665n8819n6100o2549o9378o5370o4572n6870o0240n9826o2090
12968B834659p1622p3390o3304o4702o5301o1045o4761n9224n8890n3223n2741
$$ y = [3796905, 3778163, 3765223, 3766108, 3764208, 3759701, 3740390, 3733092, 3733230, 3733708, 3736594, 3741703, 3748420, 3756186, 3768890, 3778215, 3788279, 3802713, 3821629, 3838406, 3854205, 3877427, 3905293, 3930302, 3954080, 3973005, 3990666, 4014828, 4042139, 4067812, 4088901, 4117195, 4143401, 4167485, 4188809, 4209365, 4228213, 4247503, 4269535, 4281784, 4299649, 4314272, 4319422, 4324505, 4333707, 4339912, 4346679, 4350898, 4345407, 4344299, 4336981, 4325822, 4317867, 4307293, 4287207, 4260392, 4238001, 4207980, 4173418, 4142181, 4104549, 4068760, 4030317, 3989121, 3943414, 3893174, 3841552, 3786547, 3740771, 3689496, 3635340, 3578260, 3515138, 3450473, 3391654, 3335554, 3273005, 3203627, 3138257, 3073685, 3016815, 2956575, 2896749, 2834659, 2763037, 2689647, 2626343, 2561641, 2496340, 2435295, 2370534, 2311310, 2252420, 2199197, 2146456]
12957B146456o1799n9503n2816n3470m9562m5759n2282m2214m3075n7869n3332
12946A574775m3680m2161m1570l6541l7865l9258l0133k6023k6760l4390l3111
12935A183283l1188l0729k7497k8608k9140k2647k4215j9790j8972k5642k5448
12924H99407k2422j5010k0409j9324j5766j8992j6053j7141j5742j4588j4313
12913G09647j9220k5077r107p049j3160j7946j4113j5497p296n987j2940j1917
12901E50338j0076j1824q997o753j1776j6778l454q787r113q684q608o081j086
12888D38321k657n116j5529q795o33q391j349o739m272r121K72n547j0274p195
12874C52975r967r264l446Q2m837n199m994j0218p864K4O821n386o166m905q281
$$ y = [2146456, 2084657, 2025154, 1972338, 1918868, 1869306, 1823547, 1771265, 1729051, 1685976, 1628107, 1574775, 1531095, 1488934, 1447364, 1410823, 1372958, 1333700, 1303567, 1277544, 1250784, 1216394, 1183283, 1152095, 1121366, 1093869, 1065261, 1036121, 1013474, 989259, 969469, 950497, 924855, 899407, 876985, 861975, 841566, 822242, 806476, 787484, 771431, 754290, 738548, 723960, 709647, 690427, 665350, 656243, 649194, 636034, 618088, 603975, 588478, 581182, 575195, 562255, 550338, 540262, 528438, 519441, 512688, 500912, 484134, 480680, 471893, 462780, 454096, 445488, 439407, 438321, 435664, 430548, 415019, 406224, 405591, 397200, 395851, 389112, 384840, 375719, 375991, 370444, 360170, 352975, 343008, 333744, 330298, 330380, 325543, 320344, 315350, 305132, 297268, 297292, 304113, 298727, 292561, 287656, 279375]
12859B79375n707m816K872l323p286p977j0060m769N99k510J09R39K454N010o193
12844B38717j310j524N99j917J809l853Q47J3372P588O499L682L993M215J849
12830B74566j0894k2040k2334j1499l704n16n704r419r707o872k57J753l916m089
12816A65368o944m059n125j238R40l740l428L323M101K511j975J334Q156r0p410
12801A51724L203O930O833J6904J4681J2145J6737K4825J5412K653k077j2077
12789B57893k1047k1469k6446j7232r498k39q541j0876r333q525q808p098m345
12776A04436K683N90k057O207O053m989o401q094j0n366P2Q22M313J1234K625
12761A12118o443l053K612j504J6J2779J4784N738J1428J1974L240k273r610j3605
$$ y = [279375, 273668, 268852, 271724, 268401, 261115, 253138, 243078, 238309, 238908, 236398, 236507, 237446, 239900, 244910, 238717, 237407, 235883, 236482, 234565, 236374, 232521, 233368, 246740, 254328, 260827, 264509, 268502, 272717, 274566, 263672, 241632, 219298, 207799, 204095, 203579, 197875, 188456, 178749, 171877, 171620, 173373, 169457, 165368, 158424, 154365, 149240, 148002, 148942, 145202, 141774, 145097, 149198, 151709, 149734, 151068, 159224, 159134, 151724, 154927, 161857, 168690, 185594, 200275, 212420, 229157, 253982, 269394, 272047, 269970, 257893, 236846, 215377, 188931, 171699, 162201, 161962, 153421, 142545, 133212, 124687, 115879, 108781, 104436, 107119, 107709, 105652, 111859, 117912, 112923, 106522, 98428, 98418, 93052, 93124, 93946, 98259, 109493, 112118, 105675, 102622, 105234, 103730, 103746, 116525, 131309, 137047, 148475, 160449, 163689, 161416, 151806, 138201]
12747A38201r030m444q424r757m122p305K40r57m658m251n546q644j779K490q95
12732G1119m919m149j216N350M595j387j202N34k600k98k7p86M63j470k739j94
12716F1074j285J597n8M072J222l425j829N406k186m023K189L731L3k535M076
12701F8059P825m47p021j385N252J420O397L658m32L731m314l186j1942q728J174
12686F0061J0687J313n604n555j269m823P943K325Q635j220m18K02o20m98M787
12671G5946L200N878q6m783l430M109l83K11j476K241l356j1146k229K156M763
12656G1615L357n188p045J802L970j012O162J438m529j862Q299K189O958n617
12642H0537K66m761J079O263j316M857J597p831j888m232j987L62M126k546q086
$$ y = [138201, 129171, 124727, 116303, 106546, 102424, 95119, 95359, 94402, 89744, 85493, 79947, 71303, 69524, 72014, 71119, 66200, 62051, 60835, 66185, 70780, 69393, 68191, 68725, 66125, 65827, 65800, 65014, 65477, 64007, 61268, 61074, 59789, 61386, 61328, 65400, 66622, 63197, 61368, 66774, 64588, 60565, 62754, 66485, 66518, 63983, 68059, 75884, 75437, 68416, 67031, 72283, 73703, 80100, 83758, 83326, 87057, 82743, 79557, 67615, 58887, 60061, 70748, 72061, 66457, 60902, 59633, 54810, 62753, 65078, 73713, 72493, 72075, 72277, 71657, 71159, 75946, 79146, 85024, 84938, 80155, 76725, 80834, 80451, 80662, 79186, 81427, 78071, 66925, 64696, 66852, 71615, 74972, 69784, 62739, 64541, 68511, 67499, 73661, 75099, 70570, 68708, 77007, 79196, 86154, 80537, 80803, 76042, 77121, 83384, 82068, 86925, 88522, 80691, 78803, 74571, 72584, 72946, 77072, 74526, 66440]
12627F6440m280R152L491K001k072m531l372k15O680m792k839l221m87M608k45
12612F6318l027q354l292L106P538O307J203J576L65j350l91P549L249M629J805
12597H7231l459r815l689K141P343l407r819j985j393o635n70M927L409j869k195
12582F0215L50j139O815j910l268j337j889N986J0257K71M693L507k973j866P84
12567G8496P463N241k885Q48K564k846l690k698j526p481k574j448k278l994N599
12552F8791N750N866m806o241r044k643K067K53K932j234k629k403P218P097J020
12537G1994m749m648K623L886M074K523K1M562L468p166p775K082O895J98l488
12522G4500L73o99L490K439q56o948l916L493M801o726o531M353Q495K40J699
$$ y = [66440, 62160, 71312, 74803, 76804, 74732, 70201, 66829, 66614, 73294, 68502, 65663, 62442, 61955, 66563, 66318, 63291, 54937, 51645, 54751, 62289, 68596, 69799, 71375, 71740, 70390, 69999, 77548, 80797, 85426, 87231, 83772, 73957, 70268, 72409, 79752, 76345, 66526, 64541, 63148, 56513, 55943, 60870, 64279, 62410, 60215, 60565, 59426, 66241, 64331, 61063, 59726, 57837, 63823, 74080, 74351, 79044, 82551, 79578, 77712, 78496, 85959, 91200, 88315, 89163, 91727, 88881, 85191, 82493, 80967, 73486, 70912, 69464, 67186, 63192, 68791, 74541, 80407, 75601, 69360, 60316, 57673, 59740, 59993, 62925, 61691, 59062, 56659, 63877, 70974, 71994, 67245, 62597, 65220, 69106, 73180, 75703, 75724, 80286, 83754, 76588, 68813, 70895, 77790, 77988, 74500, 74873, 74174, 77664, 80103, 79247, 72299, 68383, 71876, 76677, 69951, 63420, 67773, 76268, 76508, 78207]
12507G8207K611K881J077m625o111O53N605k45L285P08k648l317l573j199J601
12492G4910J294J937K971M530J234m320O419N095l526M265K217p656K186O193
12478I7749L203L228J08M329l658K708K999j06o174m085N717M998n7l497m583
12463A02879j95J186j599O375J901K680L759Q956R523N36j242O966J526j238M664
12448A46677J412N032Q161O346R653L193K745L485M82J1445J0969N357M134J2277
12434B31368J2843N656L373R374L591L132J717J1363J8996J1782R522J4678J6548
12421C53943K4504K1885K6750K0222L0138L6287L4294L6929M6388N5858O6883
12410G54081O8431Q6040R8625J22858J43001J69707K00239K37758K87037L51465
$$ y = [78207, 80818, 83699, 84776, 80151, 74040, 74693, 80298, 80053, 83338, 84046, 81398, 78081, 74508, 73309, 74910, 76204, 78141, 81112, 85642, 86876, 82556, 88975, 94070, 90544, 94809, 97026, 89370, 91556, 97749, 100952, 104180, 104288, 108617, 104959, 107667, 110666, 110560, 104386, 100301, 106018, 111016, 110959, 107462, 102879, 102684, 103870, 102271, 108646, 110547, 113227, 116986, 125942, 135465, 136001, 134759, 141725, 143251, 142013, 146677, 148089, 153121, 161282, 167628, 177281, 180474, 183219, 186704, 187186, 198631, 209600, 214957, 219091, 231368, 244211, 249867, 253240, 262614, 266205, 269337, 271054, 282417, 301413, 313195, 322717, 337395, 353943, 378447, 400332, 427082, 447304, 477442, 513729, 548023, 584952, 631340, 687198, 754081, 822512, 908552, 1007177, 1130035, 1273036, 1442743, 1642982, 1880740, 2167777, 2519242]
12400B519242M49712N73749P73644J037617J385794J768712K046599J991375J441047
12391A3987491N15110n04049j334961j793448j860268j657847j355604j060548
12383D935876q04154o00752m52897l40803k54517j87297j41844j07769p6322m3401
12373A926120k0308N270L0012N9145P1055J02534J46653J89707K35574K86896
12363C032658L45120M13060N00210O17732P77519J002869J324374J774117K415129
12354A2202788L213391L989305M321903L744894K171489K8245k016961l458175
12346B4196879m044509l894766l318933k631215k001206j502496j130525q61924
12338D811305o58305n14741m07081l22705k70375k17444j74374j38662j02318
$$ y = [2519242, 2968954, 3542703, 4316347, 5353964, 6739758, 8508470, 10555069, 12546444, 13987491, 14502601, 13998552, 12663591, 10870143, 9009875, 7352028, 5996424, 4935876, 4131722, 3530970, 3078073, 2737270, 2482753, 2295456, 2153612, 2045843, 1969521, 1926120, 1905812, 1911082, 1941094, 2000239, 2071294, 2173828, 2320481, 2510188, 2745762, 3032658, 3377778, 3790838, 4291048, 4908780, 5686299, 6689168, 8013542, 9787659, 12202788, 15416179, 19405484, 23727387, 27472281, 29643770, 29672015, 27655054, 24196879, 20152370, 16257604, 12938671, 10307456, 8306250, 6803754, 5673229, 4811305, 4153000, 3638259, 3231178, 2908473, 2638098, 2420654, 2246280, 2107618, 2005300]
12329B005300p6887n1943k0878l3K9412O1491Q7149J21743J49928J94286K45388
12318B744956L18392M09405N37871P17584R67340J307522J672156J966666J988960
12309A2630852J574925P30854l06663j219763j809669k000104j865003j565746
12301F169683j243018r59420p21718n49253m21754l30873k69241k12570j75207
12292A286629j47707j27492j08826r2457q0663p2646o3780m5063l8429l8563l0498
12281D40505k6423j7579j7041k2944k2751j8072j1636j4873j4775j2480j6057
12270B45874j0594j4255j0562o770j2809j0440j652p334q417j958o447n159k565
12257A46912M265n565p374K69l741r071l859n707j0224M728m225k129j0452M323
$$ y = [2005300, 1928413, 1876470, 1855592, 1855559, 1884971, 1946462, 2033611, 2155354, 2305282, 2499568, 2744956, 3063348, 3472753, 4010624, 4728208, 5695548, 7003070, 8675226, 10641892, 12630852, 14205777, 14936631, 14629968, 13410205, 11600536, 9600432, 7735429, 6169683, 4926665, 3967245, 3245527, 2696274, 2274520, 1943647, 1674406, 1461836, 1286629, 1138922, 1011430, 902604, 810147, 729484, 656838, 593058, 547995, 509566, 471003, 440505, 414082, 396503, 379462, 356518, 333767, 315695, 304059, 289186, 274411, 261931, 245874, 235280, 221025, 210463, 203693, 190884, 180444, 178792, 171458, 163041, 161083, 154636, 149477, 146912, 151177, 145612, 138238, 138507, 134766, 125695, 121836, 116129, 105905, 110633, 106408, 104279, 93827, 98150]
12243I8150K040m467n27m895o913l70J612J914L684m24q445q454K777M473m402
12228G5753k046K504P098j852r898j928J605K033K261k609K337M114l432j3278
12214F2662o723k193J677N41P85L273M915k847m663j483q572j145P504J282P67
12199E5780k382j123R774N09r434p473n45J4352l123j627M697K614l52j926m60
12184E9281J983l500q347K571N49l583j793L315o08o833K951O135M213k157O257
12169F0434M330J5061J4584J3699J8436K7169K9294L9301L4288L7902L5684K5277
12157C55459N085j5426k5844l0285m3590m2639l4524k9747k5616j6468q645j2733
12145G5027o807k808q957o393j194r55j910m965K325k580k476K07k060m027o461
$$ y = [98150, 100190, 95723, 95196, 90301, 83388, 83018, 84630, 86544, 90228, 89804, 81359, 72905, 75682, 80155, 75753, 73707, 76211, 83309, 81457, 71559, 69631, 71236, 73269, 75530, 72921, 75258, 79372, 75940, 62662, 55939, 53746, 55423, 55964, 56749, 60022, 64937, 62090, 57427, 55944, 47372, 46227, 53731, 55013, 55780, 53398, 52275, 62049, 62558, 53124, 45651, 45106, 59458, 56335, 54708, 59405, 62019, 61667, 59741, 59281, 61264, 57764, 49417, 51988, 52537, 48954, 47161, 50476, 49868, 43035, 45986, 52121, 56334, 54177, 60434, 64764, 79825, 94409, 108108, 126544, 153713, 183007, 222308, 256596, 294498, 330182, 355459, 360544, 345118, 319274, 288989, 245399, 202760, 168236, 138489, 112873, 96405, 87760, 75027, 68220, 65412, 56455, 50062, 48868, 47913, 46003, 41038, 43363, 40783, 38307, 38514, 36454, 32427, 25966]
12130B5966m761j715J378N249K01k960k889o485j192M432Q865P199l654J833O091
12115C7558p18k40j349j01j08m455r965l959n09R925N497k058M75j791J817Mk146
12098B7877j175Q440N90j117l442q505o605J845L118m232j474K848n750o070N535
12083A1883P591r58j344o04Q172M526j192k458o894M76j25J728m73n61k2j66k999
12066A6580j716P06J759O13M666n505o275p334l405L606Q448M570n89m764j89
12051A1171K409J904j769j875J843k140n929l967J75K562k744m60L010J1768P751
12036B3709J161q48N58k088m000p520l139p710m385O399K220k300j066N31L677
12021E199P950M01l313m94m870P28M315l701J235K182J342J066j677P831J186
$$ y = [25966, 21205, 19490, 20868, 26117, 26318, 23358, 20469, 13984, 12792, 17224, 26089, 33288, 29634, 31467, 37558, 36840, 36600, 35251, 35150, 35042, 30587, 20622, 16663, 16154, 26079, 31576, 29518, 29993, 28202, 30019, 30023, 27877, 26702, 35142, 35732, 34615, 31173, 22668, 16063, 17908, 21026, 16794, 15320, 18168, 12418, 6348, 11883, 19474, 18516, 17172, 16568, 24740, 29266, 28074, 25616, 18722, 19198, 19073, 20801, 20328, 19767, 19745, 19579, 16580, 14864, 15570, 17329, 17942, 22608, 17103, 10828, 3494, 89, 3695, 12143, 16713, 16124, 11360, 11171, 13580, 15484, 13715, 11840, 13683, 11543, 5614, 1647, 1822, 4384, 1640, 1180, 4190, 15958, 23709, 24870, 24022, 24580, 22492, 18492, 10972, 7833, 123, -4262, 2137, 4357, 2057, 991, 1522, 5199, 13149, 13550, 10237, 9743, 4873, 5601, 9916, 6215, 7450, 9632, 10974, 12040, 10363, 18194, 19380]
12006A9380n315O6r4J570m064o736k796R148O093l254L141r736q735Q554N503
11991A2725L72q077k04o86N15J651m252K069M515N273n741q984M785Q835j233
11976A1563l367j754L718O971j936n385O305L410l20M61j748n938j463Q4K035
11961A2636l15l926J226M936M118J567j978k641k154j130J536k889O783J0469
11947B8238Q854Q270M677Q808J2163J2638Q484j669k206j1150j4488n614q479
11934D8526p644o655K795k523j955p650k79J363j390J773p021j1155m792O217
11920I610M771M490J889p63m683J1146L643j110J138M543P182j322o9N580J1862
11905E7907J8492J9617J3179K0872J7961J1356N324n208j9893k5337k3660j6305
$$ y = [19380, 14065, 14131, 14037, 15607, 11543, 4807, 2011, 11159, 17252, 13998, 17139, 7403, -1332, 7222, 12725, 13097, 5020, 4816, 4130, 4645, 6296, 2044, 4113, 8628, 13901, 8160, -824, 3961, 12796, 11563, 8196, 6442, 10160, 17131, 15195, 9810, 16115, 19525, 19205, 19666, 17918, 11980, 10517, 10601, 12636, 12321, 8395, 9621, 14557, 18675, 20242, 18264, 15623, 13469, 12339, 13875, 10986, 17769, 28238, 37092, 45362, 50039, 58847, 71010, 83648, 92132, 90463, 88257, 77107, 62619, 57005, 48526, 40882, 34227, 37022, 34499, 32544, 24894, 24615, 25978, 24588, 26361, 19340, 8185, 3393, 9610, 14381, 18871, 20760, 19997, 15314, 26460, 30103, 28993, 30131, 34674, 41856, 40534, 40465, 46045, 57907, 76399, 96016, 109195, 130067, 148028, 159384, 164708, 159500, 139607, 114270, 90610, 74305]
11893G4305j2084m404m403m443n483k328K571l54m782p847q91k205k546l601q188
11878A3317k650j364Q742K775j270j889L936m497j317N461N234J991J402L535
11864C3406K758N170N109R936J2667O795O274k314r597o344p707n688p647p135
11850C5683l630p339p436P857L796m331j341m426o873l409n05l63k680L293M94
11835H790j557M058N62o598M10O0k215K463K770m07M146K765k011n204j307j477
11819E248l612Q807K567J178j653j00l390m166O54N9n437J020j120j014M34K00
11803c25k61J754M007J574P82l70m988q458m409j258L791P56J549k725M017K776
11787a788L138M411k6m708r203o364P902M256j211k578J50M26k494j948l389L528
$$ y = [74305, 62221, 57817, 53414, 48971, 43488, 41160, 43731, 43377, 38595, 30748, 29857, 27652, 25106, 21505, 13317, 10667, 9303, 18045, 20820, 19550, 17661, 21597, 17100, 15783, 21244, 26478, 28469, 29871, 33406, 36164, 41334, 46443, 56379, 69046, 75841, 82115, 79801, 70204, 63860, 56153, 50465, 42818, 35683, 32053, 24714, 17278, 25135, 28931, 24600, 23259, 18833, 11960, 8551, 8046, 7683, 5003, 8296, 8790, 7233, 11291, 11853, 5255, 5665, 5725, 3510, 5973, 8743, 8336, 12482, 15247, 13236, 8032, 6725, 5248, 1636, 10443, 13010, 14188, 12535, 12435, 9045, 4879, 5533, 5592, 155, 1175, 55, -959, -525, -325, -586, 1168, 5175, 6749, 7531, 7161, 2173, -6285, -10694, -11952, -8161, -7405, -5856, -8581, -4564, -1788, 1350, 5761, 5735, 1027, -8176, -14540, -6638, -2382, -3593, -6171, -6021, -5595, -8089, -10037, -13426, -9898]
11771i898M803n881K629M772L672K581o553o984M22M012J170J576j16O2R751O665
11755A2683M41m291J568k340o314k063l151o23m788N01L763L512O23l378k358
11740f215R193K767l508o72k612n371k103P222O008N244n730l675n813K132P158
11725D025Q145K6j597m144n653L382M364j015j0410l023J164R25N801L764k014
11710C740p586N43K955P46j959n147Q19J885M038J494j830o979J435k110M205
11695c751N945J174K067o46r15l29k596q13l105n654m566L202K885j542L757M767
11679a20j116L60L533m3K142k752k474l743m007k907M254O182l490o163L079J886
11663e379L417j137N41K84Q33m948m121n612J768K511N585j840o74j155M371K256
$$ y = [-9898, -5095, -10976, -8347, -3575, 97, 2678, -3875, -10859, -10437, -6425, -5255, -3679, -3795, -3733, 6018, 12683, 13124, 8833, 10401, 8061, 1747, -316, -3467, -4090, -8878, -8377, -4614, -1102, -479, -3857, -6215, 2978, 5745, 2237, 1565, -1047, -6418, -8521, -1299, 4709, 9953, 4223, 548, -5265, -3133, 4025, 12170, 12196, 10599, 6455, 802, 4184, 8548, 7533, -2877, -5900, -4736, -3811, 1990, 5754, 3740, -3846, -3303, -348, 398, -1561, -6708, -5889, -4004, 34, 1528, -302, -7281, -5846, -7956, -3751, 2194, 3368, 5435, 4789, 3874, 3545, 949, 136, -2969, -8623, -13189, -9987, -7102, -8644, -4887, -120, -1236, -876, 2657, 2614, 4756, 2004, -470, -4213, -8220, -11127, -6873, -691, -4181, -10344, -7265, -5379, -1962, -3099, -2558, -2274, -1441, -6389, -10510, -16122, -14354, -11843, -6258, -8098, -8772, -9927, -5556, -3300]
11647c300l459J868J868O344M622l038m041K207k557P36K049O05M919M43o269
11632B997q206J68M129M416k794l666j26J0534L831r930M208L571n333j0809m081
11617a1091M246J05O988q63p563m234K479Q38L696P960N191L82p694m255R37l205
11601f083K453l681M886l391L15L470N72l29K936L53J445k65J252n846k82k462
11585d657K446M977R19M572m098j029L932L468p09q038k872k715M150J758L814
11570E918l392J060M487N628j645p503K45j175o638J114M067P495K191l725k403
11555E724O76l793k594k33R057K515m62o152n567l453J902K926J177j203P65O82
11539A967j28J79n293N78k792M243o23o059L679J310N706j488k815j115j610J051
$$ y = [-3300, -6759, -4891, -3023, 3321, 7943, 4905, 864, 3071, 514, 1250, 3299, 3904, 8823, 9266, 2997, -5209, -5041, -912, 3504, 710, -2956, -3082, 7452, 11283, 1353, 5561, 9132, 3799, -7010, -11091, -6845, -6740, 248, -615, -8178, -12412, -9933, -9095, -5399, 2561, 7752, 8134, 440, -3815, -2878, -6083, -3630, -7311, -2425, -5816, -5501, -2031, -1459, -1788, 1148, 1501, 2946, 2681, 3933, -1913, -2195, -4657, -2211, 2766, 3685, 8257, 4159, 3130, 7062, 10530, 9821, 1783, -1089, -3804, 346, 2104, 5918, 2526, 3586, 8073, 13701, 12056, 4553, 4798, 3623, -3015, -1901, 2166, 9661, 11852, 8127, 5724, 6400, 2607, 13, -220, 8837, 11352, 10890, 4738, -829, -4282, -2380, 546, 1723, 520, 1285, 1967, 1839, 2018, -3275, -2697, -5489, -1246, -1869, -7928, -4249, -2939, 2767, 1279, -1536, -2651, -4261, -3210]
11523c210P059K018L910l324n252o082m689p30R441L597K348j622L86n080m617
11508e847M621L619J685K041k541m038m068K51O20n83K251L047l818l652r29M859
11492b482O384K275r936k966K515l217k714k316N005L680J520J975J419O146J676
11477H964o091j435J986k560K592J036Q42j134P60K543N532p502r768L600L916
11462C281M130m083j911K556P062j181p986j091m482K907o319j031Q029Q041R12
11447H834o179j823o41L929M5J688j419n59M900L809m804n465o622j98K358j12
11431b259k641K978M475J561m036m037o418q09L578O133J082m636N940J0662L210
11416A4783J98o121j813K443j984o954K766L894N697O54k108o409m141j828q20
$$ y = [-3210, 3849, 5867, 9777, 6453, 1201, -4881, -9570, -10300, -859, 2738, 5086, 3464, 3850, -1230, -5847, -1226, 2393, 4078, 6119, 3578, -460, -4528, -4277, -3657, -4240, -1989, 1058, -2760, -6412, -7341, -2482, 3902, 6177, -3759, -6725, -4210, -7427, -10141, -12457, -7452, -3772, -2252, -277, 1142, 7288, 8964, 2873, 1438, 3424, 864, 3456, 4492, 5334, 4200, 4960, 7503, 13035, 5533, -4235, -635, 3281, 7411, 3328, 1417, 3973, 11035, 9854, 1868, 777, -3705, -798, -7117, -8148, -119, 7922, 8834, 2655, 832, 191, 4120, 4165, 5853, 4434, 3875, 8775, 12584, 7780, 2315, -4307, -4505, -2147, -2259, -4900, -1922, 2553, 4114, 78, -3959, -10377, -11186, -7608, -1475, -393, -5029, 911, 11573, 14783, 14981, 8860, 7047, 9490, 7506, 552, 3318, 7212, 12909, 13563, 11455, 5046, 905, -923, -1743]
11401a743P1p145J785L511R045K999k439p83l932m97J605K484L135k201J20j352
11385D663j583N67L610P4J87J174J621l310L839m470l409QM104m341N400P41k637
11368F238n289J88J726m758R04L878j221n476J041Q125J867j822m681k779M99
11353a560O378P789J746N344o851k641J668K630n62m815K297L280N475K00J953
11338B2331p78l17j562M95q1j598M859P71L439L390J135m422m018j614N735P276
11322C5041J927o655n764P18R694N325J198k562p190o474l906N904L031m921n396
11307A9970R71L515k779N67n547n943L132Q71k806k611K203J818J376q72j84j939
11291A1742n23j644n231n581n16M482J228L015O446L765P43M717p17l004K875
$$ y = [-1743, -1672, -8817, -7032, -3521, 5524, 8523, 6084, 5301, 1369, 872, 2477, 4961, 8096, 5895, 6015, 4663, 3080, 3647, 7257, 7331, 7518, 8692, 10313, 7003, 10842, 6372, 2963, 2971, 7075, 2734, 8134, 8875, 6238, 949, 1137, 2863, -1895, -991, 2887, 1666, -3810, -2769, 5356, 7223, 5401, 720, -2059, -1560, 4818, 12607, 14353, 19697, 12846, 10205, 11873, 14503, 13941, 9126, 11423, 14703, 20178, 20378, 22331, 21553, 21236, 19674, 20169, 20088, 18490, 23349, 24120, 27559, 30949, 32084, 27662, 23644, 22030, 27765, 35041, 36968, 30313, 24549, 25267, 34961, 40286, 41484, 38922, 31732, 25258, 21352, 27256, 30287, 25366, 19970, 20941, 24456, 21677, 22244, 16697, 10754, 13886, 14757, 11951, 9340, 11543, 13361, 14737, 13865, 13681, 11742, 11219, 9575, 4344, -1237, -1753, 2729, 3957, 6972, 13418, 17183, 17926, 22643, 21926, 18922, 21797]
11276B1797j859l247N45M08o689n61M230O006N537o825k635L853Q790O268Q8K186
11260C7892n42J420k794K270p40j782J100K49K601L514L030k656r50L429L702
11245D9743P01M751J13p198k221n712k722Q055J762J803O01k458j34k405m968
11230C9711ql502j666m32K026o462q05J0167M312l056o246k960M384J44j420M937
11214C9124J387j0857J374J252k960o52n018j77M73j657J811k006O000J169J656
11199C0919m376k217p40M917j785N959J0839j543p069l685p038Q01l255K160K301
11184B6188l777j517O545O342l008l547J031Q03K998Q959M414o45N591M235M700
11169E9312n904o656p422m979j818M825P145o084Q429J1086P144l109j671M035
$$ y = [21797, 19938, 16691, 17236, 17644, 10955, 10394, 14624, 20630, 26167, 19342, 16707, 20560, 29350, 35618, 35706, 37892, 37350, 38770, 35976, 38246, 37506, 35724, 36824, 37073, 39674, 43188, 46218, 43562, 42612, 46041, 49743, 50444, 55195, 55308, 48110, 45889, 40177, 37455, 45510, 47272, 49075, 49676, 47218, 47084, 44679, 39711, 39703, 36201, 34535, 34103, 36129, 29667, 28862, 39029, 43341, 40285, 34039, 31079, 35463, 35607, 34187, 39124, 40511, 29654, 31028, 32280, 29320, 28668, 23650, 23473, 23946, 22289, 24100, 22094, 28094, 29263, 30919, 26543, 24326, 23586, 28503, 26718, 32677, 43516, 41973, 34904, 31219, 24181, 24982, 21727, 23887, 26188, 22411, 20894, 27439, 33781, 30773, 27226, 28257, 29060, 32058, 41017, 45431, 44786, 50377, 54612, 59312, 53408, 46752, 39330, 34351, 32533, 37358, 44503, 38419, 46848, 57934, 65078, 61969, 60298, 64333]
11155F4333l308j494r077n354k704L014j646l247m666n04K12K408J219L630k078
11140D0738l949J0539P399m882q008J348M766j473j016N246o10o831n356n605
11126C2306L47K466j232m836n956L701L633Q77O421K989k230M786k925r120N236
11111C6463p75J812L947J1578j259j79o88n56j94l428K042R662J385q427j0465
11096D0918R26O290J634L492Q08m864p709K572L027O573j859n784J325M48K568
11081E0365o85j157M030j561M811K457K453Q28j395j664q76N84m96M56K815k391
11065E8574l201j857l131N982Q369j624L736k146O870j359p093K584Q727N287
11051G9718n055K281m036p998L408N008L062n817o493M118l338m55K654J932N243
$$ y = [64333, 61025, 59531, 50454, 45100, 42396, 45410, 43764, 40517, 35851, 35347, 35559, 37967, 39186, 42816, 40738, 36789, 47328, 54727, 49845, 41837, 43185, 47951, 46478, 45462, 50708, 50098, 43267, 37911, 32306, 32653, 35119, 33887, 29051, 23095, 26796, 30429, 31306, 37727, 40716, 38486, 43272, 40347, 31227, 36463, 35688, 37500, 41447, 53025, 51766, 51587, 50899, 50343, 50149, 46721, 48763, 58425, 59810, 51383, 40918, 41844, 48134, 49768, 53260, 54068, 49204, 41495, 44067, 47094, 53667, 51808, 46024, 47349, 47797, 50365, 49680, 48523, 52553, 50992, 55803, 58260, 60713, 61541, 60146, 58482, 57606, 58190, 57694, 58150, 60965, 58574, 55373, 53516, 50385, 56367, 64736, 63112, 66848, 64702, 71572, 70213, 63120, 65704, 74431, 79718, 74663, 76944, 72908, 64910, 68318, 73326, 76388, 70571, 64078, 68196, 64858, 64403, 67057, 68989, 74232]
11036G4232J580k265P321Q807J7k208J70M344j152L070J688k593k209L359q57
11021I3304l062m11J082M203O565N339J2319J013J35J413j817j859N352M190l680
11006A24086P733O554M090M524K691M062Q512J343R81J969j1N529M44P0N91l508
10990A69660L46N935J4812J3379M469q543k614j280K75N348O804Q465P802L668
10976B28526J191K761Q784N492P799P771J1937J1913P288L836L674O879O880O034
10962C20765J3848J1110J0057J1827R710J1382Q372J8033J4371R631J6647J3148
10950D68901P271J6083J6746J7078K3793K1257K3573L1915L1349L6997L1792K3333
10938G50088L0830L2947M0790L7860L7960M8462N2348M7613N7172O0893O7759
$$ y = [74232, 75812, 73547, 80868, 89675, 89692, 87484, 87654, 91998, 90846, 93916, 95604, 93011, 90802, 94161, 93304, 90242, 89831, 90913, 95116, 101681, 107020, 119339, 120352, 120487, 121900, 120083, 118224, 123576, 127766, 124086, 131819, 138373, 142463, 146987, 149678, 153740, 162252, 163595, 164576, 166545, 166534, 172063, 172507, 172577, 173168, 169660, 170006, 175941, 190753, 204132, 208601, 200058, 197444, 196164, 196439, 201787, 208591, 217056, 224858, 228526, 229717, 232478, 241262, 246754, 254553, 262324, 274261, 286174, 293462, 297298, 300972, 307851, 314731, 320765, 334613, 345723, 355780, 367607, 377317, 388699, 397071, 415104, 429475, 439106, 455753, 468901, 476172, 492255, 509001, 526079, 549872, 571129, 594702, 626617, 657966, 694963, 726755, 750088, 780918, 813865, 854655, 892515, 930475, 978937, 1031285, 1078898, 1136070, 1196963, 1264722]
10927A264722O2155O4422R1003Q7343R0972J03732J05020J04448J03899J19199
10917B196915J27957J23384J25070J20684J23136J22631J11198J05781R8437Q7963
10907C343156P8177P3891O0077M7313L2777K5529L1241K1571J5201J7450J1575
10896C757958O664O999n354j6072k7589l7817m7938o1578o7477p8488r0943j01835
10884C236530r6150j04472j11766j08200j05952r8994r5233q7592q2783q5715
10874B259673p4358o3502n6266m0374m2383l2644k7471k8678j9242j0602n773
10863A858380n698J0185J8787J5638J6951K5751M1620L9781M6392N9700O6897
10852B194384P3518P9397Q0463R8569J05339J09352J26231J40931J49050J61882
$$ y = [1264722, 1326877, 1391299, 1482302, 1569645, 1660617, 1764349, 1869369, 1973817, 2077716, 2196915, 2324872, 2448256, 2573326, 2694010, 2817146, 2939777, 3050975, 3156756, 3255193, 3343156, 3421333, 3495224, 3555301, 3602614, 3635391, 3660920, 3692161, 3713732, 3728933, 3746383, 3757958, 3764622, 3771621, 3766267, 3750195, 3722606, 3684789, 3636851, 3575273, 3507796, 3429308, 3338365, 3236530, 3140380, 3035908, 2924142, 2815942, 2709990, 2610996, 2515763, 2428171, 2345388, 2259673, 2185315, 2121813, 2065547, 2025173, 1982790, 1950146, 1922675, 1893997, 1874755, 1864153, 1858380, 1852682, 1862867, 1881654, 1897292, 1914243, 1939994, 1981614, 2021395, 2067787, 2127487, 2194384, 2267902, 2347299, 2427762, 2526331, 2631670, 2741022, 2867253, 3008184, 3157234, 3319116]
10842C319116J72827J77469J90771J97766J99305K08654K12844K23001K29123
10833E130876K23549K18677K04181J89004J76836J65585J54236J35452J17213
10824F715609R4790Q4082O4197N0062L2450K1914P036k423j9306l5430n4060o0947
10812F897974q1197r3000j07014j27879j42852j59416j74971j83688j90555k05569
10802E431833k15198k15691k18458k23817k19566k07250k07479j90047j80853
10793C553474j72151j68344j53218j42157j38396j22704j09793j05744q9972q3582
10783B267413o8142o9053n8194n5324n2599l3372k5617k6264j9101r476n035m524
10771A840712K414M675J1864J9365K2301K8549L6860M4379M9998N4291N8364P1570
$$ y = [3319116, 3491943, 3669412, 3860183, 4057949, 4257254, 4465908, 4678752, 4901753, 5130876, 5354425, 5573102, 5777283, 5966287, 6143123, 6308708, 6462944, 6598396, 6715609, 6810399, 6894481, 6958678, 7008740, 7041190, 7063104, 7070140, 7067717, 7048411, 7012981, 6958921, 6897974, 6816777, 6723777, 6616763, 6488884, 6346032, 6186616, 6011645, 5827957, 5637402, 5431833, 5216635, 5000944, 4782486, 4558669, 4339103, 4131853, 3924374, 3734327, 3553474, 3381323, 3212979, 3059761, 2917604, 2779208, 2656504, 2546711, 2440967, 2350995, 2267413, 2199271, 2130218, 2072024, 2016700, 1964101, 1930729, 1905112, 1878848, 1859747, 1850271, 1845236, 1840712, 1843126, 1847801, 1859665, 1879030, 1901331, 1929880, 1966740, 2011119, 2061117, 2115408, 2173772, 2245342]
10759B245342P8068Q7196R9662R5548J00169J07284J00432J01306J08309J05779
10749C229095R0266Q3397Q6129P9093O2166N4685M4178K3513J2612M764n754j3058
10737C751086j1930j6865k1511l6013m0316k9997k9318m9783o7466p8961q2857
10726C286069q8860r9209j02546j10327j23933j25921j23350j22396j20946j20951
10716B147630j20904j15784j07550r3309q9840q9011q6467q4378o8925o6914o5902
10705A158646o4734o0067m7579m6681m5708m0376l6520l4613k6128k6493l5831
10694F93916l7976l3343k8007k2273j8546j9027j6743j7648j6326k1695j4755
10683D47577j3392j0756j2140j5143j8270q174r207n030o063r704j2530q826j1022
$$ y = [2245342, 2323410, 2410606, 2510268, 2605816, 2705985, 2813269, 2913701, 3015007, 3123316, 3229095, 3319361, 3402758, 3488887, 3567980, 3630146, 3684831, 3729009, 3752522, 3765134, 3769898, 3764144, 3751086, 3739156, 3722291, 3700780, 3664767, 3624451, 3594454, 3565136, 3515353, 3447887, 3368926, 3286069, 3197209, 3098000, 2995454, 2885127, 2761194, 2635273, 2511923, 2389527, 2268581, 2147630, 2026726, 1910942, 1803392, 1710083, 1620243, 1531232, 1444765, 1360387, 1291462, 1224548, 1158646, 1093912, 1033845, 986266, 939585, 893877, 853501, 816981, 782368, 756240, 729747, 693916, 655940, 622597, 594590, 572317, 553771, 534744, 518001, 500353, 484027, 462332, 447577, 434185, 423429, 411289, 396146, 377876, 369702, 360495, 355465, 349402, 339698, 327168, 318342, 307320]
10670C07320n445q423r955j2850n376k611l821n793j1637r008p405q633J393K596
10656B20352n710j1119K583l57j488p141r102k485n34n44N253p010l699m268n557
10641A69174m090k555q076j0701o077M03N758J099o596l15j683j665o830o501
10627A21345q279m80J666J183M035o70k904m136q135k367O682m143l269M005o645
10612I7888j0145j173O474n865L128R86O388q53o984n1j898n155r365J948K562
10597G7885n82L076L769o004j00R06p998o930O62K125l2M564L909j0201n842L420
10581F2627J68o42P40j075k306N93J61L0j675l249K573J0025j358j40p994n460
10565E3018N324k651p067n2n07n065M131K578N16j266Q126o529l459k29n4l559
$$ y = [307320, 301875, 293452, 283497, 270647, 265271, 262660, 258839, 253046, 241409, 232401, 224996, 216363, 217756, 220352, 214642, 203523, 206106, 205749, 204261, 197120, 188018, 185533, 184999, 184455, 189708, 182698, 178999, 174731, 169174, 165084, 162529, 154453, 143752, 137675, 138078, 143836, 144935, 138339, 138024, 136341, 134676, 127846, 121345, 113066, 112586, 114252, 115435, 119470, 118800, 115896, 111760, 103625, 101258, 107940, 103797, 100528, 104533, 97888, 87743, 86570, 93044, 87179, 90307, 91293, 97681, 96828, 89844, 89793, 87895, 82740, 73375, 75323, 77885, 77303, 80379, 84148, 78144, 78044, 78950, 70952, 64022, 64684, 66809, 66777, 71341, 75250, 65049, 59207, 62627, 62795, 62153, 62893, 61818, 59512, 60105, 60266, 60296, 58621, 55372, 57945, 67970, 66612, 66472, 58478, 53018, 58342, 55691, 48624, 48572, 48065, 43000, 47131, 49709, 50225, 48959, 57085, 50556, 47097, 46868, 46814, 43255]
10549D3255K837O72J292l827k494p116k221L806L310J123J138Q130R262j08m970
10534E4089p075o592M162K19j1936n764j947L862R438K061p940L297K530k247
10520C6157j544L191R9K285J987M949k188o583r89J595j213n597L471N476l339
10505C7757l74O232Q45k10n8n628k861K304J632k619l121K18K614P47J0L37J132
10488C8957m573k726L721J1739j97r449r326K109N474P147L060j09k407j211K770
10473D4979k542j495l222P744J036r95l235K522r483p447L830J0073M4j188k341
10458C8280k158L919M00M82Q270n330l289L829J231m752p227L3M407j90m199l582
10442C0124M498J373l341k387R458L794o656J077l84j0293K29O139K180j116o965
$$ y = [43255, 46092, 46764, 48056, 44229, 41735, 34619, 32398, 36204, 39514, 40637, 41775, 49905, 59167, 59059, 54089, 47014, 40422, 44584, 44803, 32867, 27103, 25156, 29018, 38456, 40517, 32577, 35874, 38404, 36157, 34613, 37804, 37903, 40188, 42175, 47124, 44936, 38353, 37364, 38959, 37746, 32149, 35620, 41096, 37757, 37383, 43615, 44460, 44250, 44192, 38564, 35703, 38007, 39639, 37020, 33899, 34117, 36731, 37478, 37488, 37825, 38957, 34384, 31658, 35379, 47118, 46921, 37472, 28146, 30255, 35729, 42876, 45936, 45827, 43420, 42209, 44979, 42437, 40942, 37720, 45464, 46500, 45505, 42270, 44792, 35309, 27862, 31692, 41765, 41809, 40621, 38280, 36122, 40041, 40441, 40923, 49193, 43863, 40574, 44403, 45634, 40882, 33655, 33688, 38095, 37905, 33706, 30124, 34622, 35995, 32654, 30267, 39725, 43519, 36863, 37940, 37556, 27263, 27492, 33631, 35811, 34695, 27730]
10427B7730K073R382J649q64j731P334k147J978P019P743P688p05l74J302p78
10412F7299M279K681J853N170J4127J5260J3095K0776K4450M7353P5882J14123
10400D06348J45787J36663O0565j9198q8765j31380j25660r9839p1649m0137k9109
10389A43626j8508j0673j1493o440j3295l950n350M48M234L967n921l349N78o912
10375F6962l290K555Q38k457j98O01m42J785l109K738K740l407L764J5848K0390
10360A05318J9908K7174M1294M7653O9270Q3850Q6644O9791M5158J5246l1492
10349E79814o3032p9292r2632q2569n5583m3092l2709k5542k0791j9831n051l778
10337E5912q052l185l867o715j05l497o858L315O633N023Q12M389J916P29J67
$$ y = [27730, 29803, 39185, 40834, 39970, 38239, 45573, 43426, 45404, 52423, 60166, 67854, 67149, 66775, 68077, 67299, 71578, 74259, 76112, 81282, 95409, 110669, 123764, 144540, 168990, 216343, 292225, 406348, 552135, 688798, 749363, 730165, 641400, 510020, 384360, 284521, 212872, 172735, 143626, 125118, 114445, 102952, 96512, 83217, 79267, 73917, 74365, 78599, 82566, 76645, 73296, 73874, 66962, 63672, 66227, 67065, 64608, 64410, 65011, 64569, 66354, 63245, 65983, 68723, 65316, 69080, 84928, 105318, 125226, 152400, 193694, 241347, 310617, 394467, 481111, 550902, 596060, 611306, 579814, 516782, 437490, 344858, 262289, 206706, 163614, 130905, 105363, 84572, 64741, 59690, 55912, 47860, 44675, 40808, 34093, 33988, 30491, 23633, 26948, 33581, 38604, 39416, 43805, 45721, 46450, 46617]
10322D6617K017k53o715n147L728L89J057K901M363n310r256p052l161P184O919
10307C8281k52n803m202o691P578m763J595L532k677l619Q32P588N287p628m903
10292B4155j760j087J924j692p187L207O662N650l985m5o552o719K350L223J576
10277A9720K330K241q270j439l55L968L564j669m137L661K298m385j888p599m334
10262C706K803R943m23p829r79P931m706l086O240p317o13M851K431J310O99m741
10246A0220J355K402J679J897M402m262n389J418J762K028Q03K473M667J32N122
10231C0709n498p178j319k787J151K779p582p916k643L424N514K436K576L786
10217A7452M343N60j017j758r997o471m49M535M091n327k432L672M254J258Q468
$$ y = [46617, 48634, 48381, 41666, 36519, 40247, 40636, 41693, 44594, 48957, 43647, 34391, 27339, 24178, 31362, 38281, 38029, 32226, 28024, 21333, 28911, 24148, 25743, 29275, 26598, 22979, 23811, 31399, 36686, 29058, 24155, 22395, 21308, 23232, 21540, 14353, 17560, 24222, 29872, 25887, 25842, 19290, 12571, 14921, 18144, 19720, 22050, 24291, 16021, 14582, 14227, 18195, 21759, 20090, 15953, 19614, 21912, 17527, 15639, 8040, 3706, 6509, 16452, 16029, 8200, 7221, 15152, 10446, 7360, 13600, 6283, 5670, 10521, 12952, 14262, 14961, 10220, 11575, 13977, 15656, 17553, 21955, 17693, 12304, 13722, 15484, 17512, 18315, 20788, 25455, 25587, 30709, 25211, 18033, 16714, 13927, 15078, 17857, 10275, 2359, -284, 3140, 8654, 11090, 13666, 17452, 21795, 22355, 21338, 19580, 9583, 3112, 2663, 7198, 11289, 5962, 3530, 7202, 11456, 12714, 21182]
10202B1182O147k633n558l420K489Q846J530p717n869l517K002P87P42N042l062
10187A6991j626m871j075Q611J416J57L017L751j385k883J966R19O855l036k284
10172B6523L726L858k885j696L609O318O731O752j489K512k74K223J5907K2329
10158I4144K5106K5985L8342N4811O1495O3112N5904M5509L2555J2948j9232m0114
10146D50565n2538o1644n5000n1048n1851m8604k9011j8921j4596r182n007J444
10134E4607m597p483q431n301m342r34M176p33j732m599r00L421k43n504k402
10119A5003K882K413l612K047J31P164l365n728k704k614j965M947j505q492P08
10104E310k597m598M186P494j327Q72L23m131j275J137l091j819O078l92l236
$$ y = [21182, 27329, 24696, 19138, 15718, 18207, 27053, 28583, 20866, 14997, 11480, 13482, 14269, 15011, 20053, 16991, 15365, 10494, 9419, 18030, 19446, 19603, 22620, 26371, 24986, 22103, 24069, 24988, 31843, 28807, 26523, 30249, 34107, 31222, 29526, 33135, 39453, 46184, 52936, 51447, 53959, 53685, 55908, 71815, 94144, 119250, 145235, 183577, 238388, 299883, 362995, 418899, 464408, 496963, 509911, 490679, 450565, 398027, 336383, 281383, 230335, 178484, 129880, 100869, 81948, 67352, 58170, 53163, 54607, 50010, 42527, 34096, 28795, 24453, 23519, 27695, 26962, 25230, 20631, 19731, 23152, 22909, 17405, 15003, 17885, 20298, 16686, 18733, 18864, 26028, 22663, 16935, 14231, 11617, 9652, 14599, 13094, 4602, 5310, 2713, -1885, 2301, 9795, 8468, 9340, 9663, 5532, 4257, 5394, 2303, 484, 6562, 6170, 2934]
10089B934n486L526L649P288O699M245L094J324j228p489j0566k178K417M212
10075A2441J1652l326r483l005R673L14p278L206J125r033K604J531K416J117
10061A3954K53J201N543P183n300q671j414m932J076P988M767p052q34K936K946
10046A9644k29K166j77J413M377L307n346p654r424j329L675k842p149q94O538
10031F076K845l083O08M224n643p404K652J799N91K205N0J249J0351K040j845
10016A6715j988J137n774j093K504k128O146K813l948j015m860k032k32P33j254
10001E724q53L124k088K813J212N324k759J675L370m406J945O119J78r720L479
9986A5137M847j923j00R81J953l260m49J566n188l635K633M071l618l28J109l572
$$ y = [2934, -2552, 974, 4623, 11911, 18610, 22855, 25949, 27273, 26045, 18556, 7990, 5812, 8229, 12441, 24093, 20767, 11284, 8279, 17952, 18266, 10988, 14194, 15319, 6286, 8890, 10421, 12837, 13954, 14207, 15408, 20951, 28134, 22834, 14163, 12749, 7817, 8893, 16881, 21648, 14596, 13762, 16698, 19644, 19415, 21581, 21404, 22817, 27194, 30501, 25155, 17501, 8077, 6748, 10423, 7581, 432, -462, 6076, 8921, 5838, 6446, 10670, 5027, -2377, 275, 2074, 2665, 4870, 4920, 6169, 16520, 18560, 16715, 14727, 15864, 10090, 8997, 11501, 9373, 15519, 18332, 14384, 13369, 8509, 6477, 6245, 6978, 5724, 4871, 7995, 5907, 8720, 9932, 15256, 12497, 14172, 17542, 13136, 15081, 21200, 21378, 11658, 15137, 19984, 18061, 17961, 18942, 20895, 17635, 17186, 18752, 13564, 9929, 12562, 16633, 13015, 12687, 13796, 10224]
9970A0224n543R7M423k503k57O629l515K18K388l034M49K389N334l300r070k407
9954B522K682P336P174j346l108P503L927n006L22j986L07J722p25p65o145K537
9938A6951N335m770n00K443j273m506n536K356N667M243l009K312p400k162J041
9923A1192N00K384l14p738k990J3314M764K570m093p830j966J777Q122J0738K596
9908C3026o454K321m96m005N66M775J693r77j2196j472K24m564n245p21Q59J288
9892H622r37N495O294M797J405O465J802n647n482n367M900R042N388l568l194
9877C0015r642N524R32m543l631n985j230K201j806J476L036M477J367j08m570
9862A7513L451L483O345l672l157P90L445L549r11j707M473L868K316k314Q13
$$ y = [10224, 4681, 4778, 9201, 6698, 6441, 13070, 9555, 9773, 12161, 9127, 9576, 11965, 17299, 13999, 4929, 2522, 5204, 12540, 19714, 18368, 15260, 22763, 26690, 21684, 22006, 20020, 20327, 22049, 21324, 20559, 14414, 16951, 22286, 17516, 17016, 19459, 18186, 13680, 8144, 10500, 16167, 20410, 17401, 19713, 12313, 10151, 11192, 11692, 14076, 13762, 6024, 3034, 16348, 21112, 23682, 19589, 11759, 9793, 11570, 19692, 30430, 33026, 26572, 28893, 28397, 24392, 24958, 29733, 31426, 30449, 18253, 16781, 17005, 12441, 7196, 6475, 7334, 8622, 7685, 13180, 19474, 24271, 25676, 32141, 33943, 28296, 22814, 17447, 22347, 31389, 36777, 33209, 30015, 20373, 25897, 26829, 22286, 18655, 12670, 11440, 13641, 11835, 13311, 16347, 20824, 22191, 22083, 17513, 20964, 24447, 30792, 27120, 23963, 24753, 28198, 31747, 30836, 29129, 33602, 37470, 39786, 37472, 38285]
9847C8285L860M02K620O281L824O739m57K780M746J2015K0668J6099K3111K4968
9833A65941J9852j93j6957k5147k9922k3232j7370j0950j4675j6612q27J91K521
9820C2620J360r788n018K456M341K299J1289l030n46O431M079j944j402o172j1817
9805B5158j887O012L367K565j638n973q757K251M731J0986J655r075l022M97K62
9790B7132N694L318O133m761n553K349K95j403k982m362k490L048P181j887q878
9775B2834l337J649L722O13L531M95L463R98j374L494N463k232o435l571R25O280
9759C6518o09k798J215J296J686m38J511N74j663M988J188m896j2134q363J163
9744A9238L859L345L607j022q68R943J983O46M37j0940o011P915J717K936N99
$$ y = [38285, 42145, 42547, 45167, 51448, 55272, 62011, 61554, 64334, 69080, 81095, 101763, 117862, 140973, 165941, 185793, 185600, 168643, 143496, 113574, 90342, 72972, 62022, 47347, 30735, 29908, 30099, 32620, 33980, 24192, 19174, 21630, 25971, 28270, 39559, 36529, 35983, 42414, 46493, 44549, 43147, 36975, 25158, 23271, 29283, 32650, 35215, 33577, 27604, 18847, 21098, 25829, 36815, 38470, 29395, 26373, 26870, 27132, 32826, 36144, 42277, 37516, 31963, 34312, 34607, 33204, 30222, 25860, 23370, 26418, 33599, 31712, 22834, 19497, 21146, 24868, 25481, 29012, 29507, 32970, 33968, 32594, 36088, 41551, 39319, 32884, 29313, 30238, 36518, 35909, 33111, 34326, 35622, 37308, 36870, 38381, 38955, 37292, 42280, 43468, 38572, 26438, 18075, 19238, 23097, 26442, 30049, 29027, 28159, 38102, 40085, 40731, 41168, 30228, 24217, 32132, 33849, 36785, 37384]
9729C7384r90l917k826o64k458k430P432P016J003l53m518P011M110l527K63k787
9713C9749Q34N751L48n473m086J291j893p394L012N595L203K812j794j196O38
9698D1397O541M009m915n780j072L192L758j204o645k469K418Q58m463K468P000
9683D5093P455K126J354j640k302l999K360P680L156p221l248o093K39K958J1158
9668E9076Q022M140k423k973J922M451P811M711j442O90q017J263J739J824M975
9653H5769m842r171k785M421m300N40K286K039l006o754K938j912J163M137K312
9638G2835j55j209O4j610m533M100m749j391Q36O616K67l505K681j701J319J107
9622G0972R043J287r931j0322m623N129L598L245P53n195j733P387M486J689K12
$$ y = [37384, 36394, 32477, 29651, 28987, 26529, 24099, 31531, 38547, 39550, 39197, 34679, 41690, 45800, 42273, 42536, 39749, 40583, 46334, 46682, 41209, 37123, 38414, 36521, 29127, 32139, 37734, 40937, 43749, 41955, 40759, 41397, 47938, 51947, 47032, 41252, 40180, 43372, 47130, 45926, 39281, 36812, 39230, 40088, 35625, 38093, 45093, 52548, 54674, 56028, 54388, 52086, 48087, 50447, 58127, 61283, 54062, 50814, 44721, 44960, 47918, 59076, 67098, 71238, 68815, 65842, 67764, 72215, 80026, 84737, 83295, 83985, 75968, 77231, 78970, 80794, 85769, 80927, 71756, 68971, 73392, 69092, 69632, 71918, 73957, 70951, 64197, 67135, 65223, 66386, 70523, 72835, 72680, 71471, 71535, 69925, 65392, 69492, 64743, 63352, 64188, 70804, 71071, 67566, 70247, 68546, 69865, 70972, 80015, 81302, 71371, 61049, 56426, 61555, 65153, 68398, 69151, 63956, 62223, 69610, 74096, 75785, 75997]
9607G5997M403p67j070P510j869j5M088L093k065o311q331p53O756o95K121k081
9591H0011K705J0654J1053J309n368p09R2k278k513r831q8N531J854j712M338
9576I5048K252k759j451l218L167l611J780K668L513j322l011n573k189j807o44
9561H2843O88P402Q56m792K105l639J700Q525J515j271K112K558M910L022L144
9546A11678P78j093M261K681n362j926l828o714M097M440n972j840N536J145j879
9531A06002o377n669P59J793O421l036j809K663l782K870j93P987J883M16k227
9516A07701J975l583R737K329j733J650j487m796J925L127Q043k209j601N212
9502A26290o789k242P279P668p41K076M66P556o55o619J235J784K798j560q407
$$ y = [75997, 80400, 79633, 78563, 86073, 84204, 84189, 88277, 91370, 89305, 82994, 74663, 73910, 80666, 79971, 82092, 80011, 82716, 93370, 104423, 105732, 100364, 99655, 99747, 97469, 94956, 85125, 85037, 90568, 92422, 90710, 95048, 97300, 94541, 93090, 89872, 93039, 89428, 91208, 93876, 97389, 96067, 93056, 87483, 85294, 83487, 82843, 83531, 90933, 91789, 86997, 89102, 85463, 87163, 95688, 97203, 95932, 98044, 100602, 105512, 108534, 111678, 112456, 111363, 115624, 118305, 112943, 111017, 107189, 100475, 104572, 109012, 103040, 101200, 106736, 107881, 106002, 99625, 93956, 94715, 96508, 102929, 99893, 98084, 100747, 96965, 99835, 99642, 107629, 109512, 109928, 107701, 109676, 106093, 115830, 118159, 116426, 118076, 116589, 111793, 113718, 116845, 124888, 122679, 121078, 126290, 119501, 117259, 124538, 132206, 131465, 133541, 134007, 141563, 140908, 134289, 135524, 137308, 140106, 138546, 130139]
9487A30139K018l259J108q93o584j809m017j07Q516L14M800j197j914o020q00
9472A20295O935O077l645p436p081L013M695L582j805o64N901j019q881o55M597
9457A23909O779K729K092O791K682L756Q835N043L667R309O144m927j685j691
9443A73433k738q63j763j1420j51J392J430N978M31L244n754r057M220L069k615
9428A58836j70J930J001L36j675m539P3L614n204M77M381j94M415O700K470p75
9412A71676N196L949k5o54J0703J041p188N745J152K297J18k78J86M712j994K03
9396A96839j116K962R57P610Q796k852k134N21k804l534J461k85L422r34p432
9381B01477l40l494j190J0426R017M408O608R049O232j08P55k409J846j025l550
$$ y = [130139, 132157, 128898, 130006, 129113, 122529, 120720, 116703, 116596, 125112, 125426, 130226, 129029, 127115, 121095, 120295, 127230, 133307, 129662, 122226, 115145, 118158, 122853, 126435, 124630, 123966, 129867, 128848, 119967, 119312, 123909, 130688, 133417, 135509, 142300, 144982, 148738, 157573, 162616, 166283, 175592, 181736, 176809, 175124, 173433, 170695, 169832, 168069, 156649, 156498, 157890, 159320, 165298, 165729, 168973, 163219, 154162, 158382, 161451, 158836, 158666, 160596, 161597, 161933, 160258, 155719, 155792, 159406, 154202, 154679, 159060, 158866, 163281, 169981, 172451, 171676, 176872, 180821, 180796, 180142, 190845, 191886, 184698, 190443, 191595, 193892, 194010, 193732, 193918, 198630, 196636, 196839, 195723, 198685, 199642, 207252, 216048, 213196, 211062, 211583, 208779, 205245, 206706, 206421, 209843, 208909, 201477, 201137, 197643, 196453, 206879, 215896, 220304, 226912, 235961, 242193, 242085, 242840, 240431, 242277, 241252, 237702]
9366B37702N964J371J308J261q17O916O488N634k032n220p909j3834n454O831
9352B38209J303O911J2351J0831Q774J155K515M846O081J4422R755L953N587R383
9338C36076J1159O030Q941P660R378J1002Q02O668N726k866J149N112J0974J0579
9324D28390J4945J0931J3095J3591J8471J3498J7416L2355K7034K2858K1928L2973
9312F67485M0406L8420M4623N5292O4102O6900O9885Q3678J00786J10497J27816
9301A469890J35154J46499J53284J62617J79053J79561J98068K24330K40856K55820
9291C345132K69302K75175K69277K56394K28829J92385J63989J41805J30038J18916
9281E391242J10665J06243J17869J18202J15951J10815J10137J07680J10863J10340
$$ y = [237702, 243666, 245037, 246345, 247606, 246789, 253705, 260193, 265827, 263795, 258575, 250666, 236832, 231378, 238209, 239512, 246423, 258774, 269605, 278379, 279534, 282049, 286895, 292976, 307398, 317153, 321106, 326693, 336076, 347235, 353265, 362206, 369866, 379244, 390246, 391048, 397716, 403442, 400576, 401725, 406837, 417811, 428390, 443335, 454266, 467361, 480952, 499423, 512921, 530337, 562692, 589726, 612584, 634512, 667485, 707891, 746311, 790934, 846226, 910328, 977228, 1047113, 1130791, 1231577, 1342074, 1469890, 1605044, 1751543, 1904827, 2067444, 2246497, 2426058, 2624126, 2848456, 3089312, 3345132, 3614434, 3889609, 4158886, 4415280, 4644109, 4836494, 5000483, 5142288, 5272326, 5391242, 5501907, 5608150, 5726019, 5844221, 5960172, 6070987, 6181124, 6288804, 6399667, 6510007]
9271F510007J12401J09623J09705R8648Q6228O3338M1990K3293J2245J0671L938
9260G182087j5435l6819m3688n4068p7599q5827r4906j03558j01218j13769j23601
9249F331599j35992j51367j62993j74250j80385j84987j91676j97395k09969k03956
9239D538629j98758j89860j80242j62258j44497j19625j05758j00757q3350p0493
9229C183031n5962n6970n9176n1375m3156k9144q957K784L3646O3491P9746R7827
9217C155785J07931J03146R8467R8401J11241J11631J36432J56702J87788K14519
9207D482043K46372K87848L35649L76430M44570N18491N85884O19262N86341N15017
9197H997907M23503L20243J98498O7511o3493j57969k00807j95337j53670j03176
$$ y = [6510007, 6622408, 6732031, 6841736, 6940384, 7026612, 7089950, 7131940, 7155233, 7167478, 7178149, 7182087, 7166652, 7129833, 7086145, 7032077, 6954478, 6868651, 6773745, 6670187, 6568969, 6455200, 6331599, 6195607, 6044240, 5881247, 5706997, 5526612, 5341625, 5149949, 4952554, 4742585, 4538629, 4339871, 4150011, 3969769, 3807511, 3663014, 3543389, 3437631, 3336874, 3253524, 3183031, 3127069, 3070099, 3010923, 2959548, 2916392, 2887248, 2878291, 2881075, 2914721, 2978212, 3057958, 3155785, 3263716, 3366862, 3465329, 3563730, 3674971, 3786602, 3923034, 4079736, 4267524, 4482043, 4728415, 5016263, 5351912, 5728342, 6172912, 6691403, 7277287, 7896549, 8482890, 8997907, 9421410, 9741653, 9940151, 10007662, 9944169, 9786200, 9585393, 9390056, 9236386, 9133210]
9187I133210n9970k4624M513J1518J1177J5541O597n589j0317k1291k6639k4088
9175I010038j6127j3424K405J4434L0371N6592N7883N9989N7693M5432M0372N5736
9163I401394Q7997J58207K74541M00276M55659L89170K54147J10446L6455J4177
9153A1582469k2357j41964l20394m83859n97091o19209n85725n49728n40065n24927
9143G197150n00337m78603m38967l97877l42671k76528j95425j22845n7380J971
9133D388488O1441J06468J39792J66621J89717K11645K32357K48087K73580K75733
9123F293929K60465K50683K62828L06436L77183M25302M02632L08903J98890J16312
9113I203563R8058J24955J44016J31303R9582O6403N5650Q8756J06986P8059K0150
$$ y = [9133210, 9073240, 9048616, 9053129, 9064647, 9075824, 9091365, 9097962, 9092373, 9082056, 9060765, 9034126, 9010038, 8993911, 8980487, 8982892, 8997326, 9027697, 9084289, 9142172, 9202161, 9259854, 9305286, 9345658, 9401394, 9489391, 9647598, 9922139, 10322415, 10778074, 11167244, 11421391, 11531837, 11568292, 11582469, 11560112, 11418148, 11097754, 10613895, 10016804, 9397595, 8811870, 8262142, 7722077, 7197150, 6696813, 6218210, 5779243, 5381366, 5038695, 4762167, 4566742, 4443897, 4386517, 4388488, 4449929, 4556397, 4696189, 4862810, 5052527, 5264172, 5496529, 5744616, 6018196, 6293929, 6554394, 6805077, 7067905, 7374341, 7751524, 8176826, 8579458, 8888361, 9087251, 9203563, 9301621, 9426576, 9570592, 9701895, 9801477, 9867880, 9923530, 10012286, 10119272, 10197331, 10217481]
9102A0217481m3168n9690n5083n6368q3250j36592k07928k74340l11048l20167
9092H669847k92803k17513j27281m7494R639M7617O2869O4813P0968O7614M2198
9081H350474J7056j3119o4236j00099j02613o6319m2142j8410n440J0695J9464
9070G985311K4270N1794Q4870J35663J97579K71023L41662M07511M48554N06136
9060A0454373O09276P13400P41415O05467L30831K655l45214o74738q89473r75218
9050A0572774r57288q43477o84049n19113l95061l05071k54545k23965j98204
9041F192001j78181j87925j94656k19030k38931k52035k53185k29586j94448j64434
9031D079590j31774r5166p1739n9021l6072j9897l861K3796N3222Q7609J37373
$$ y = [10217481, 10174313, 10114623, 10059540, 10003172, 9919922, 9783330, 9575402, 9301062, 8990014, 8669847, 8377044, 8159531, 8032250, 7984756, 7994395, 8042012, 8104881, 8169694, 8240662, 8308276, 8350474, 8367530, 8354411, 8290175, 8190076, 8087463, 8021144, 7979002, 7960592, 7955152, 7965847, 7985311, 8009581, 8061375, 8146245, 8281908, 8479487, 8750510, 9092172, 9499683, 9948237, 10454373, 11063649, 11777049, 12518464, 13123931, 13454762, 13457417, 13112203, 12437465, 11547992, 10572774, 9615486, 8772009, 8087960, 7568847, 7173786, 6868715, 6614170, 6390205, 6192001, 6013820, 5825895, 5631239, 5412209, 5173278, 4921243, 4668058, 4438472, 4244024, 4079590, 3947816, 3852650, 3780911, 3721890, 3685818, 3665921, 3662060, 3685856, 3739078, 3826687, 3964060]
9020C964060K10437K96035L82887M28740M07900L15678J27298j14588l07497m30723
9010E280227m97028n03546m73851m13479l39579k64259k00278j67965j53764j26227
9000B140251r6582p7014o6980o5827o2329n0339m4259l4628l0022l2039l2412
8989A547820j9488k0680j6219j2912j2776j9045j2502n410q830j3262j1375j6736
8977A378585j3243n545j5713j1223n097q737m500J514L975Q750J3555K7571O0168
8964A430060J00024J28650R7827N0630K5053j1349n3229n3153o3634n7748l6273
8953A556858k1810j1093J2262J6990J5681J8258K5870L3502L8755N6423R1381
8942A833077J09223J02480R2741P2498O1976N2283M5535M9929N8092M7387M7015
$$ y = [3964060, 4174497, 4470532, 4853419, 5282159, 5690059, 6005737, 6133035, 6018447, 5710950, 5280227, 4783199, 4279653, 3805802, 3392323, 3052744, 2788485, 2588207, 2420242, 2266478, 2140251, 2043669, 1966655, 1899675, 1833848, 1771519, 1721180, 1676921, 1642293, 1612271, 1580232, 1547820, 1528332, 1507652, 1491433, 1478521, 1465745, 1446700, 1434198, 1428788, 1419958, 1406696, 1395321, 1378585, 1365342, 1359797, 1344084, 1332861, 1327764, 1319027, 1314527, 1316041, 1320016, 1328766, 1342321, 1369892, 1430060, 1530084, 1658734, 1756561, 1807191, 1832244, 1820895, 1767666, 1714513, 1650879, 1593131, 1556858, 1535048, 1523955, 1536217, 1553207, 1568888, 1587146, 1613016, 1646518, 1685273, 1741696, 1833077, 1942300, 2044780, 2137521, 2210019, 2271995, 2324278, 2369813, 2419742, 2477834, 2525221, 2572236]
8931B572236M6810L8667L5975N8160Q7388J17283J36123J52967J66019J82187
8921C593815K06574K39213K77628L21392L94008M74866N49875O20204O65331O99567
8911H042473P62002Q85920J083334J363661J711183K081010K500853K954549L358623
8902B4743608L586315L774986M233694N131850O809559R682402J4347763K1902200
8894I4212377L3931805N2455916P2457506O9216485K9431135j1919531l9123870
8887C00661823o0382843o2088630m8932374l4412819k3512559j6111525j1105728
8880D4115345p788794n497808l854644k830723k419789k273402k142019k024265
8872A5283901j819869j562939j319264j111776r22349p43224o08852n15661m37404
$$ y = [2572236, 2619046, 2657713, 2693688, 2751848, 2839236, 2956519, 3092642, 3245609, 3411628, 3593815, 3800389, 4039602, 4317230, 4638622, 5032630, 5507496, 6057371, 6677575, 7342906, 8042473, 8804475, 9690395, 10773729, 12137390, 13848573, 15929583, 18430436, 21384985, 24743608, 28329923, 32104909, 36338603, 41470453, 48280012, 57962414, 72310177, 94212377, 128144182, 180600098, 253057604, 322274089, 351705224, 339785693, 300661823, 240278980, 178190350, 129257976, 94845157, 71332598, 55221073, 44115345, 36326551, 30828743, 26974099, 24143376, 21723587, 19450185, 17308166, 15283901, 13464032, 11901093, 10581829, 9470053, 8547704, 7804480, 7195628, 6679967, 6242563]
8863F242563m01889l86558l73777l37990l03972k58306k08500j53442j07061p7448
8853C633620o6072o5489p3362q2672p8769p0318m8552m1018k6595j6360l4463
8842C029950n0079o6662p4992o3591n0188m2990k5139J0129L2987O0631P9494
8831B839550Q8269Q6299N5739J6224j1193k7964m1675l4054k9087k0615k5191
8820B896302l6053m4906m6529m8571n7067o3159m7615j7577L505K8240M7747N8385
8808B672702N7874M9363L9762K5609J8469L3789L2007L9231M2891N0017M3533
8797C105247K6599n622l6774o8548j03020j27614j33999j13259p4547l3336J885
8786B437012N1991Q4370J10985J12136R5497O4050K2961k2728n6533o4364o2236
$$ y = [6242563, 5840674, 5454116, 5080339, 4742349, 4438377, 4180071, 3971571, 3818129, 3711068, 3633620, 3567548, 3502059, 3428697, 3346025, 3267256, 3196938, 3148386, 3107368, 3080773, 3064413, 3029950, 2979871, 2913209, 2838217, 2774626, 2724438, 2681448, 2656309, 2666438, 2699425, 2760056, 2839550, 2927819, 3014118, 3069857, 3086081, 3074888, 3046924, 3005249, 2971195, 2942108, 2921493, 2896302, 2860249, 2815343, 2768814, 2720243, 2663176, 2600017, 2552402, 2534825, 2538330, 2566570, 2614317, 2672702, 2730576, 2779939, 2819701, 2845310, 2863779, 2897568, 2929575, 2968806, 3011697, 3061714, 3105247, 3131846, 3126224, 3089450, 3020902, 2917882, 2790268, 2656269, 2543010, 2468463, 2435127, 2437012, 2489003, 2573373, 2684358, 2796494, 2891991, 2956041, 2979002, 2956274, 2899741, 2835377, 2773141]
8775B773141n4680m5714m5483m3704l9818k8148j0896K1019O6875J13795J58160
8764B864547K12936K42468K43246J85707R0142j6441j02131j74230k21299k33614
8754C091331k12082j86514j39767r6662n1000j4291K3349N4225P0631Q3581P6235
8743B699036P3454O6245N3424L5397J9505m039k9230m2770n0756m1914j7985N054
8731B765421M6663R9603J68642K54208L43361M52242N76476O86655P74509P98122
8721F965902P21853N58782L69941K33414J91073K25273L05210L30649K50650Q4421
8711A0237168j39270l39034m87248n51579n53024n25310m87537m28541l72067
8702F353558l09347k45838j71380j18724n7147j2693L8168J12517J98526L00947
$$ y = [2773141, 2718461, 2672747, 2627264, 2583560, 2543742, 2515594, 2504698, 2525717, 2592592, 2706387, 2864547, 3077483, 3319951, 3563197, 3748904, 3839046, 3822605, 3720474, 3546244, 3324945, 3091331, 2879249, 2692735, 2552968, 2456306, 2405306, 2391015, 2414364, 2468589, 2539220, 2622801, 2699036, 2772490, 2838735, 2892159, 2927556, 2947061, 2943022, 2913792, 2871022, 2820266, 2778352, 2760367, 2765421, 2812084, 2911687, 3080329, 3334537, 3677898, 4130140, 4706616, 5393271, 6167780, 6965902, 7687755, 8246537, 8616478, 8849892, 9040965, 9266238, 9571448, 9902097, 10152747, 10237168, 10097898, 9758864, 9271616, 8720037, 8167013, 7641703, 7154166, 6725625, 6353558, 6044211, 5798373, 5626993, 5508269, 5451122, 5438429, 5476597, 5589114, 5787640, 6088587]
8692F088587M16942N08168N57267M98436L42173J29262q0143k35614l07785l06205
8682G611088k61590k05132j60460j28070j10308q9636m9605o590O2121J34339
8672F796157K21299L18730M35880N71878O49912O60672N62656L29394o288l76726
8662A0163564o77114q52455q74574p43080n21431k61380q375J85972K90920K88000
8652F990047J89242M1819j01270k07514k85106l51636m06791m56762m88015m82891
8642D441123m42120l73662k74544j79282q4534n142P1515J31315J75496J92593
8632C652758J79398J48086J04531N6282L3712M1623R1976J97843L60935N53053
8622E420197P60496R35471J009012R14308O44690K42199j81314n22909p35622
$$ y = [6088587, 6505529, 7013697, 7570964, 8069400, 8411573, 8540835, 8460692, 8225078, 7917293, 7611088, 7349498, 7144366, 6983906, 6855836, 6745528, 6655892, 6606287, 6599697, 6661818, 6796157, 7017456, 7336186, 7772066, 8343944, 8993856, 9654528, 10217184, 10546578, 10540290, 10163564, 9486450, 8633995, 7759421, 7016341, 6494910, 6233530, 6225155, 6411127, 6702047, 6990047, 7179289, 7221108, 7119838, 6912324, 6627218, 6275582, 5868791, 5412029, 4924014, 4441123, 3999003, 3625341, 3350797, 3171515, 3086981, 3081839, 3153354, 3284669, 3460165, 3652758, 3832156, 3980242, 4084773, 4141055, 4174767, 4216390, 4308366, 4506209, 4867144, 5420197, 6180693, 7116164, 8125176, 9039484, 9684174, 9926373, 9745059, 9222150, 8486528]
8613H486528p89858p39790o64244o10057n98700n91305n77131n51612m91606m05848
8603B466377l25787k59213k03416j63323j23213q5377o7063n2371l6256j9282
8593A131076K06K3230M7482O8350R9748J46398J90617K20139K25369K16719J85117
8582B554451J36650O9736q855p6721j16838j23718j03286m7185K4624R8859J22651
8571B530368R1114K1802q9235k06519k78793k95253k84580k43256j97955j47948
8561H99745j03997q5024p4269o5092n3286m5802l7237k6092k6279l0573j7674
8550C34420j8186j8241r090n030n375m40m587p898L110P568J790p840j2250k849
8536B55102j557o338j0239o338k828k081p556n945m158r92J855j273n212J700
$$ y = [8486528, 7696670, 6956880, 6292636, 5682579, 5083879, 4492574, 3915443, 3363831, 2872225, 2466377, 2140590, 1881377, 1677961, 1514638, 1391425, 1306048, 1238985, 1186614, 1150358, 1131076, 1131282, 1154512, 1201994, 1270344, 1370092, 1516490, 1707107, 1927246, 2152615, 2369334, 2554451, 2691101, 2760837, 2751982, 2675261, 2558423, 2434705, 2331419, 2284234, 2308858, 2407717, 2530368, 2621482, 2643284, 2554049, 2347530, 2068737, 1773484, 1488904, 1245648, 1047693, 899745, 795748, 710724, 636455, 571363, 518077, 472275, 435038, 408946, 382667, 352094, 334420, 316234, 297993, 288903, 283873, 278498, 278058, 273471, 265573, 268683, 276251, 278041, 270201, 257951, 255102, 253545, 247207, 236968, 230630, 227802, 225721, 218165, 212220, 208062, 207070, 208925, 207652, 202440, 204140]
8522B04140J668J782j25j852l61K099L070N107p16J31L136O886K289K999R202
8507B39455O693M009J6173J6435J3765J8750K7990L0507K9805K9916L8393N1596
8495E23487O0402P7516R6517J18223J28432J23282J12882R9300O5995J3802j7955
8484A401883n4463r2110j11791j25497j22854j09316r1909q0668o8965n6776l8194
8473D49340k1739j8905j0932n852n097m328m432j792p66l89M564L571M390J3250
8459D00883J5943J7539J7783K0562L0443L3875L0219L0218L2279M3335M9394N1782
8447G74255P2090Q7619R8670J20372J53135J81745K02099K36225K61840K79545
8437B467595K71935K27284J65820Q3265j5369q9101j45863j78705j95083j83548
$$ y = [204140, 205808, 207590, 207465, 205613, 205252, 207351, 210421, 215528, 214812, 214943, 218079, 224965, 227254, 230253, 239455, 246148, 250157, 266330, 282765, 296530, 315280, 343270, 373777, 403582, 433498, 471891, 523487, 583889, 661405, 757922, 876145, 1004577, 1127859, 1240741, 1340041, 1406036, 1419838, 1401883, 1347420, 1255310, 1143519, 1018022, 895168, 785852, 693943, 613275, 544310, 487534, 449340, 427601, 408696, 397764, 391912, 386815, 382487, 378055, 376263, 375497, 375108, 379672, 383243, 387633, 400883, 416826, 434365, 452148, 472710, 503153, 537028, 567247, 597465, 629744, 673079, 722473, 774255, 846345, 933964, 1032634, 1153006, 1306141, 1487886, 1689985, 1926210, 2188050, 2467595, 2739530, 2966814, 3132634, 3215899, 3200530, 3111429, 2965566, 2786861, 2591778, 2408230]
8427B408230j65493j54489j40184j21437q7001o6549n1045j5192J0404K8622N2463
8416A698329P9427J08912J42603J73854K07090K39532K50534K27526J90907J21979
8406C440693K3733o8501j37725j95733k17212k23787k14554j94852j78285j58855
8396A874922j42391j25475j05166q8891p6959n8647m7976l3949k4710k0222l352
8385A147184Q852J3093K0737K9326M5627N6168O2970Q3703R4983J09412J37227
8374A809282J61867J83242J96479K12291K29670K38555K44793K40052K20162K03319
8364C939712J86654J92712K12811K37618K71667K97762L10309K95882K58540K04618
8354F408285J05614K937r4810j88259k58882k95719k92783k70330k14443j60977
$$ y = [2408230, 2242737, 2088248, 1948064, 1826627, 1739626, 1673077, 1622032, 1606840, 1617244, 1645866, 1698329, 1777756, 1886668, 2029271, 2203125, 2410215, 2649747, 2900281, 3127807, 3318714, 3440693, 3464426, 3395925, 3258200, 3062467, 2845255, 2621468, 2406914, 2212062, 2033777, 1874922, 1732531, 1607056, 1501890, 1412999, 1336040, 1277393, 1229417, 1195468, 1170758, 1150536, 1147184, 1156036, 1169129, 1189866, 1219192, 1264819, 1320987, 1383957, 1467660, 1562643, 1672055, 1809282, 1971149, 2154391, 2350870, 2563161, 2792831, 3031386, 3276179, 3516231, 3736393, 3939712, 4126366, 4319078, 4531889, 4769507, 5041174, 5338936, 5649245, 5945127, 6203667, 6408285, 6513899, 6516836, 6422026, 6233767, 5974885, 5679166, 5386383, 5116053, 4901610, 4740633]
8344D740633j08644m9713P468L7879N2501O8403P0261P8402P7213Q5429J10621
8333E170453J51064J81503K11997K23854J99918J45152N5856l8412j36851k46068
8323E918466l37869l97551m40778m41907m25444l88533l51691l14143k65176k20652
8313B334722j85427j53650j17785r4725p5545n1166l4901k6818r904L899J6704
8302A605404M1375N8572P2284R6477J06351J32573J66563J83724J97796K28821
8292B889940K49470K64630K60347K46399K39239K06675J76524J46494J05452N8767
8282D843937K2591j1915l3455k9211j5484L104K0816K1851L969l9831q5638j29536
8270D571198j52805j52529j21887p1762k2415K8605Q1681J11135J32514J27279
$$ y = [4740633, 4631989, 4582276, 4589744, 4627623, 4680124, 4748527, 4818788, 4897190, 4974403, 5059832, 5170453, 5321517, 5503020, 5715017, 5938871, 6138789, 6283941, 6339797, 6301385, 6164534, 5918466, 5580597, 5183046, 4742268, 4300361, 3874917, 3486384, 3134693, 2820550, 2555374, 2334722, 2149295, 1995645, 1877860, 1783135, 1707590, 1656424, 1621523, 1594705, 1584801, 1588700, 1605404, 1646779, 1705351, 1777635, 1874112, 1980463, 2113036, 2279599, 2463323, 2661119, 2889940, 3139410, 3404040, 3664387, 3910786, 4150025, 4356700, 4533224, 4679718, 4785170, 4843937, 4866528, 4854613, 4821158, 4791947, 4776463, 4779567, 4800383, 4822234, 4826203, 4786372, 4700734, 4571198, 4418393, 4265864, 4143977, 4072215, 4049800, 4078405, 4160086, 4271221, 4403735, 4531014]
8260D531014J17533R7339O4763K9961l127m0837p1875j03192j11586j13181j06168
8249D290644q9023p3961q0500j11128j61006k18238k56237k90609k97178k82789
8239B429975k64458k33131j97275j61990j41488j17127j01393q8748o8443m7598
8229A008324l8029l8080l5283k2470j9854j8444J268L848Q307P814J4067K3263
8217H94731L7468M8528N8465O6666P5095Q9322J00551J08016J15485J28848J42935
8206A866110J12425Q6063M4859m446o2129j07611j35625j47586j46042j30283
8196A375735j05901j00329p7598n5156l5862k2022j4161O172K9810L5821M7602
8185A084111P0009P7146Q6481J01800J05400J03465J01396Q9467N8389J3572l3125
$$ y = [4531014, 4648547, 4745886, 4810649, 4840610, 4837483, 4796646, 4724771, 4621579, 4509993, 4396812, 4290644, 4201621, 4127660, 4047160, 3936032, 3775026, 3556788, 3300551, 3009942, 2712764, 2429975, 2165517, 1932386, 1735111, 1573121, 1431633, 1314506, 1213113, 1124365, 1055922, 1008324, 970295, 932215, 896932, 874462, 854608, 836164, 837432, 841280, 849587, 857401, 871468, 894731, 932199, 980727, 1039192, 1105858, 1180953, 1270275, 1370826, 1478842, 1594327, 1723175, 1866110, 1978535, 2064598, 2109457, 2105011, 2042882, 1935271, 1799646, 1652060, 1506018, 1375735, 1269834, 1169505, 1091907, 1036751, 1000889, 978867, 964706, 970878, 1000688, 1036509, 1084111, 1154120, 1231266, 1317747, 1419547, 1524947, 1628412, 1729808, 1819275, 1877664, 1891236, 1858111]
8174A858111p9658j24321j49699j57560j67558j54855j30233j13918q9717q5452
8164F05140o9301n9653n3047l5997k9292l1364l0513j9607j6877j5694j5260j1965
8152B16570j4861j3812r927j4703j0862q751m868l39J132r84L12k058r51n669
8138A30229m748j0475p097m788N281m282n034m528k677l971J698J940k400q552
8124H0596l169M129K669m222m630l495m562j229p952M534O735m4l899q990k320
8109E4151Q564p45k693N383N000J635m219l353o889J0758L418J099m100n310k698
8094F0001m900o773L263R941P22k291j077n664k841J875Q73l856n392l626O238
8079D6493K231k737k054J961K74m954P05J0144L209k482j430l384L500J945l400
$$ y = [1858111, 1778453, 1654132, 1504433, 1346873, 1179315, 1024460, 894227, 780309, 690592, 605140, 535839, 476186, 423139, 387142, 357850, 326486, 295973, 276366, 259489, 243795, 228535, 216570, 201709, 187897, 177970, 163267, 152405, 143654, 138786, 138447, 139579, 138595, 138907, 136849, 135898, 130229, 125481, 115006, 107909, 103121, 108402, 104120, 99086, 94558, 91881, 87910, 89608, 91548, 89148, 80596, 77427, 81556, 84225, 80003, 75373, 71878, 67316, 66087, 58135, 62669, 69404, 69360, 65461, 56471, 54151, 62715, 61970, 59277, 64660, 69660, 71295, 67076, 63723, 56834, 67592, 71010, 72109, 68009, 62699, 60001, 55101, 48328, 51591, 61532, 62254, 59963, 58886, 53222, 50381, 52256, 53129, 49273, 43881, 40255, 46493, 48724, 45987, 43933, 45894, 46168, 41214, 41919, 52063, 55272, 52790, 51360, 47976, 51476, 53421, 50021]
8064E0021M68n676N180O409J198K198N064J552O984m875r855k148q33L614J999
8049F1300n975o51m315n460P53N746P454L988j194L435Q724K985j6273q395M180
8034E6302r27q647k142P869j07M530K626m41o17n880J679j459j023k565K789Q55
8018E2842n62L767N090M62K286K990k028p870p26J036N808Q21r881j97L766j404
8002E6200J837K561l644q063l41k959L377R91n314l462O133J0880L741J373l725
7987E9585J965K939N562K293J125j549K08k121m347M358k778p254l38p11K458
7972F1395p649o221j684R372K243k78j255R761J122k720K70j956j754J097M237
7957F5980L41m949P84j762K165m044L024M626M035N451P329q722m987j283j76
$$ y = [50021, 50489, 44813, 49993, 56402, 57600, 59798, 64862, 66414, 73398, 68523, 58668, 56520, 55687, 59301, 61300, 55325, 54674, 50359, 44899, 45652, 51398, 58852, 62840, 61646, 65081, 73805, 76790, 60517, 52122, 56302, 55375, 46728, 44586, 52455, 52348, 56878, 59504, 59063, 58446, 52566, 54245, 52786, 51763, 49198, 51987, 52842, 52280, 56047, 61137, 61599, 63885, 66875, 64847, 56977, 56251, 57287, 63095, 63916, 54035, 53838, 57604, 56200, 58037, 60598, 56954, 48891, 48550, 45591, 48968, 49959, 44645, 41183, 47316, 58196, 61937, 63310, 59585, 61550, 64489, 70051, 72344, 73469, 71920, 72128, 70007, 65660, 70018, 67240, 59986, 59648, 58937, 61395, 53746, 47525, 45841, 55213, 57456, 57178, 55923, 65684, 66806, 64086, 64356, 62400, 60646, 61743, 65980, 66321, 61372, 62156, 60394, 62559, 58515, 61539, 66165, 70200, 75651, 82980, 74258, 69271, 67988, 67812]
7942F7812N39P86Q908O026M077k384j846k736P03N43K773J521o082r825m063j585
7926F5167m176L93l166l762O177J498n644o698m982j3l44N175l022j111m948l702
7910C6842M284Q61n78p77n33J918l946r56K738Q949M30m577k283J19k666r31N185
7893D4079j397r88P90q62O36K476M310K394J341R48K594p615n400j763Q73k468
7877C9948j811N589J956O992k157o015L250l766p054J568m52r6M798M115n653
7862D1212j1612L855P242R414k119l995J431L362q854p609N740K816J599L23k003
7847D0802j0599q632O150N627M443q571p203m089O18N559N633l313j566J528J395
7832B7782l346n092k17M739n33p124M047M064m483j268P58K691j545l40l839m752
$$ y = [67812, 68351, 69137, 78045, 84071, 88148, 85764, 83918, 81182, 81885, 82428, 85201, 86722, 80640, 70815, 66752, 65167, 60991, 61384, 58218, 54456, 60633, 62131, 56487, 49789, 44807, 44794, 44450, 49625, 46603, 45492, 40544, 36842, 41126, 41987, 41409, 40632, 40099, 42017, 38071, 37115, 39853, 48802, 49232, 44655, 42372, 42491, 39825, 38894, 44079, 42682, 41694, 42484, 41622, 42258, 44734, 49044, 51438, 52779, 53727, 56321, 48706, 43306, 41543, 42416, 39948, 38137, 43726, 45682, 52674, 50517, 44502, 47752, 43986, 36932, 38500, 38048, 37952, 42750, 46865, 41212, 29600, 33455, 40697, 50111, 47992, 43997, 45428, 48790, 39936, 32327, 38067, 40883, 42482, 42805, 40802, 30203, 21571, 27721, 33348, 37791, 29220, 22017, 17928, 18546, 24105, 29738, 26425, 24859, 26387, 27782, 24436, 19344, 19127, 23866, 23333, 16209, 20256, 24320, 19837, 18569, 19327, 22018, 20473, 20133, 16294, 11542]
7816A1542l039Q206M56l457j192N532Q198J1516k769q474n640J264p173j424L760
7801A7306K245o610P69o43J034L287m990M561j628j027L463l643p146M014R536
7786B0528Q50k559N2K528m969l043O81L49P885K077k10q853R3N941J876M410m555
7769B3081o643m312m870J606K160J658j301J942K434n978K110Q477m066q034j985
7754F279k263M017Q53p368m350K144j909M446O871l812k564O524l660j900K07
7739C515o48l976m773M951J580L728M173J082n28N691P408k710k463o212n847
7724D971J805k858l058J258K494L69J892M530M781n858m892l473m170j64M455
7709B082j154n028O493K982N42J364K528n996l660L938O409j878r903k067P435
$$ y = [11542, 8503, 16709, 17165, 13708, 12516, 18048, 26246, 37762, 34993, 26519, 20879, 22143, 14970, 13546, 17306, 19551, 12941, 13710, 13067, 14101, 17388, 12398, 16959, 15331, 14304, 17767, 14124, 6978, 10992, 20528, 21378, 18819, 18871, 21399, 16430, 13387, 14068, 14417, 22302, 24379, 24169, 15316, 15409, 21350, 23226, 27636, 23081, 16438, 12126, 7256, 8862, 11022, 12680, 11379, 13321, 15755, 9777, 11887, 20364, 16298, 8264, 6279, 4016, 8033, 8886, 1518, -2832, -688, -2597, 1849, 8720, 4908, 2344, 8868, 5208, 3308, 3515, 2867, -1109, -5882, -931, 649, 4377, 8550, 9632, 9104, 14795, 22203, 19493, 17030, 10818, 4971, 6776, 3918, 860, 2118, 4612, 4981, 6873, 11403, 16184, 10326, 5434, 1961, -2209, -2373, 2082, 928, -4100, 2393, 5375, 5917, 7281, 9809, 3813, 153, 4091, 10500, 8622, -1281, -3348, 4087]
7694D087J755q229J08j19j984l346J24O01J772L800P176L819p43j102j732L36
7678F323O491P052J399k997q802q707j18R557K968L531k080m183q542k850o301
7663g259l873N773o13M444K672k367O462L556k091r905l947N852R807j148n987
7648A376n292j12l198R18M128K851J423k260m027j25M181L981M012k498L712m58
7632H612n38J242k829n367L041N727j094l436j022J037J076K109k783p97R856
7617A4834J66k897L101P934p443l731L775L90o966m722m171k052O431N553j942
7602H260J05K215k859n407L72L700k893Q36j162l566K117N445J256l651L150K135
7586A0053k308k397o430Q342K564k581k376n590m473K500K418Q27L24J404O96
$$ y = [4087, 5842, -2387, -2279, -2398, -4382, -7728, -7604, -7003, -5231, -1431, 5745, 9564, 8821, 7719, 5987, 6323, 12814, 19866, 21265, 18268, 9466, 759, 641, 10198, 13166, 16697, 14617, 10434, 1892, -958, -7259, -11132, -5359, -5972, -1528, 1144, -1223, 5239, 8795, 6704, -3201, -7148, -1296, 8511, 7363, 1376, -3916, -4028, -7226, -6308, -2180, 671, 2094, -166, -4193, -4318, -137, 3844, 7856, 5358, 9070, 8612, 8074, 9316, 6487, 1120, 4161, 9888, 8794, 5358, 4336, 5373, 6449, 8558, 5775, 4978, 14834, 15000, 12103, 15204, 23138, 15695, 11964, 15739, 16129, 9163, 4441, 270, -1782, 4649, 10202, 8260, 8365, 10580, 7721, 2314, 2686, 6386, 3493, 4329, 3167, -399, 1718, 7163, 8419, 4768, 7918, 10053, 7745, 5348, -1082, 7260, 9824, 7243, 4867, -723, -5196, -2696, -278, 549, 873, 2277, 2973]
7571B973m926P872N286j418l778p575J342J593J503l024n80N184L687q557j831
7556b249K242N745N302L16m696n035K299K908N136l984K38K684N16J137J851J078
7540A5488k048n812p40L97k469J980N948l43J417K508o664l287L117P824n050
7525A2266p243k845m964K046O846m182K008K055J258L218r663n973M778j505k946
7510d846O477j343J669K21j371P713K598m965p016n424p15M533K790P311j02p44
7494F786j273o266K4k769k338O72R5m31N28M658pq60j310K370M516Q43m272M98
7476A464l609J222L032P853J020k107o930r614O073K800M278k351j285K937N621
7461A0404L572n591l646q66K94L14k595j276l034o378k904l446J241Q769N181
$$ y = [2973, -1953, 5919, 11205, 9787, 6009, -1566, -224, 1369, 2872, -152, -732, 4452, 8139, -418, -2249, -7, 5738, 11040, 11356, 6660, 1625, 3924, 6832, 11968, 7984, 8222, 10906, 11422, 12559, 14410, 15488, 13440, 7628, 6888, 7285, 4816, 6796, 12744, 12401, 13818, 16326, 9662, 6375, 9492, 17316, 12266, 5023, 2178, -2786, -740, 6106, 1924, 3932, 5987, 7245, 10463, 800, -5173, -395, -1900, -4846, 1631, 288, 1957, 2178, 807, 8520, 11118, 6153, -863, -6287, -7002, -2469, 321, 7632, 7530, 6786, 5513, -753, -729, -3498, -5836, -5164, -5069, -5500, -4972, -314, -321, -1181, -2491, -121, 4395, 5238, 966, 1464, -2145, -923, 2109, 9962, 10982, 8875, 1945, -7669, -1596, 1204, 5482, 3131, 1846, 4783, 10404, 13976, 8385, 4739, 3873, 4167, 4481, 1886, 610, -2424, -8802, -11706, -15152, -13911, -5142, 39]
7446C9k404l023K264j526n207M417J841k366P47j265N918L435r07l677j893J622
7430a985N471m300k403o565j449L246j133K957q09j993M444K316N04Q3O61l995
7414d950J563J33L498m68J305L409R77J651N648m93j509k915k425j447l462O390
7398F905J427l073K900k310m92J178j840M90j557j120L547P86n378k710l098K480
7382a865n120m933L816j29k340m77O649K127l105K446K102K624q97m693R90m26
7366c231k573J089L721m958k573K147J0258K052O006m49j633n243k221L424J586
7351G402k136j532L780l579l766M387P802j340p580n725k549K452N477L878L301
7336A0272L547J593o308r062m217R375j042j618r90j705J409j468j773J39l275
$$ y = [39, -2365, -5388, -3124, -4650, -9857, -5440, -3599, -5965, -5218, -6483, -565, 2870, 1963, -1714, -3607, -1985, 3486, -814, -3217, -9782, -11231, -7985, -9118, -6161, -6970, -8963, -4519, -2203, -1699, -1616, -955, -4950, -3387, -3254, 244, -224, 1081, 4490, 5467, 7118, 12766, 12273, 10764, 7849, 5424, 3977, 515, 6905, 8332, 5259, 8159, 5849, 5357, 6535, 4695, 5185, 3628, 2508, 6055, 6841, 1463, -1247, -4345, -1865, -6985, -11918, -8102, -8231, -10571, -11048, -4399, -2272, -5377, -2931, -829, 1795, 898, -3795, -2805, -3231, -5804, -4715, -994, -5952, -8525, -6378, 3880, 5932, 11938, 11489, 9856, 4613, 2392, 5816, 7402, 5266, 3734, 7514, 3935, 169, 4556, 12358, 11018, 3438, -2287, -4836, -2384, 3093, 6971, 10272, 13819, 15412, 9104, 42, -4175, 5200, 4158, 2540, 1550, -155, 1254, -214, -1987, -1848, -5123]
7321e123J778K995j907j377J909l610K113K031M69K92m872m67n40n53p53K709
7305d906J0599j737k429j832M349O034o810k968p21l599j113J752L918J951N065
7290G553k55M513r482m733O328L982L159l700l222j297Q90O621m786j1494k226
7275h149l01M407O59j667l216P657J0347P87R84r870j567M088l237r570K120M421
7259b107J439J619K511p643K618L764n107J485k686l932k584J233K763K521N381
7244A275J608l655j549l0l823K891R004j661j173m392J04O103j319P95l722n909
7228e453N010N427J658l901N62K348L878p09j818L439m640l074R09K302M083L697
7212A3718j448j1101n167M812O599%N390n912n641l848K472K071Q220N889m100
$$ y = [-5123, -3345, -350, -2257, -3634, -1725, -5335, -3222, -1191, -722, -430, -5302, -5769, -6309, -6862, -7615, -4906, 5693, 3956, 1527, -305, 4044, 10078, 3268, 300, -421, -4020, -5133, -3381, 537, 2488, 7553, 7298, 11811, 2329, -2404, 3924, 7906, 11065, 7365, 4143, 2846, 3736, 10357, 5571, -5923, -8149, -8450, -4043, -3384, -5051, -8267, -610, 9737, 10524, 11508, 1638, 71, 4159, 922, -8648, -6528, -2107, -668, 951, 3462, -4181, -1563, 2201, -2906, -1421, -4107, -8039, -10623, -9390, -6627, -4106, 1275, 2883, -772, -2321, -2351, -6174, -3283, 5721, 4060, 2887, -1505, -1401, 4702, 3383, 4178, 456, -5453, -443, 4984, 6642, 2741, 3303, 5651, 9529, 8820, 7002, 10441, 5801, 2727, 3636, 5938, 10021, 13718, 12270, 1169, -3998, 814, 7413, 7413, 12803, 6891, 1250, -2598, -126, 1945, 10165, 16054, 11954]
7197A1954p215n34M249L57J319n168J779p22m819k987j869o361O51M26K894K136
7181c910M186k544p580Q484M464K587J998j687L10n061j194L382O6k420K739l905
7165h5n701K777J0919L725p571l448m84n438j897P227o11k736O621P68K225K714
7149I005O83O25k637p591n830k008K997K561P490l743p1L359m185m937N355R169
7133A0242j091o068J034l709k141j578k372L819Q253O061q804n854k76K749j689
7118a424n086j702l75M498j553L664O110L801k025o695n508L870k454o85k621
7103h185M902L175P553N288Q42r89J404q482n190k174m596O18N973J182L079k385
7087B015j652J275J678j498n250J742Q876n653n974N44o1n159M692Q412R90K555
$$ y = [11954, 4739, 4205, 8454, 8811, 10130, 4962, 6741, 6019, 1200, -1787, -3656, -10017, -9366, -8940, -6046, -3910, 276, -2268, -9848, -1364, 3100, 5687, 7685, 5998, 6308, 1247, 53, 3435, 3501, 1081, 3820, -85, -5786, -3009, 7910, 11635, 4064, 616, 132, -5306, -7203, 24, -587, -3323, 3298, 4066, 6291, 9005, 9688, 10313, 7676, 85, -5745, -7753, -4756, -2195, 5295, 1552, 1481, 4840, 655, -4282, 1073, 10242, 9151, 3083, 4117, 408, -1733, -3311, -5683, -1864, 6389, 12450, 3646, -2208, -2484, 265, -1424, -6510, -8212, -8587, -4089, -5642, -1978, 4132, 7933, 5908, -787, -6295, -2425, -4879, -5564, -8185, -3283, -108, 7445, 12733, 13575, 12586, 13990, 5508, 318, -1856, -6452, -5834, 139, 1321, 4400, 2015, 363, 1638, 3316, 1818, -3432, -1690, 7186, 1533, -4441, -3897, -3958, -9117, -4425, 3987, 4977, 7532]
7071G532J516m260m675L881M148M255k779m454J361j93l359J171N12Q14l465j555
7055D50J736k97k829L727n885M130J0348j224m599l728o44j160k587L536L522
7040D496J997L91M96o78K151J772o656N7L957J751o179J261M954k249k881j1623
7024f983k832O367O898o007q119k626k032L557N238N11J420K579P926l72m625
7009I00n501O081J668K076J914j921j820P2O366M920j739j921p590n808M951K915
6993E563K500M724k062n675q043l083Q837K045j236L778m038o580L261k82k113
6978b404o137k591L601k810n062L705P066O510R49l097M055J929j499K754k909
6963D060k949M057K729k917j904L186L337L751l500m497p736n112M0L071M783
$$ y = [7532, 9048, 4788, 113, 3994, 8142, 12397, 9618, 5164, 6525, 6332, 2973, 4144, 4656, 5470, 2005, 450, 2186, 1889, -940, 2787, -3098, 1032, 11380, 10156, 5557, 1829, 1185, 25, -2562, 974, 4496, 6493, 6884, 7380, 6702, 8853, 10625, 3969, 4026, 7983, 9734, 3555, 4816, 9770, 7521, 4640, -6983, -9815, -3448, 3450, -2557, -10676, -13302, -15334, -11777, -6539, -6028, -4608, -2029, 5897, 5525, 900, -4601, 1480, 3148, 5224, 7138, 5217, 3397, 3469, 9835, 14755, 13016, 11095, 3505, -2303, 2648, 5563, 8063, 12787, 10725, 5050, -2993, -6076, 2761, 4806, 3570, 7348, 3310, -3270, -9, -291, -2404, -8541, -11132, -7531, -10341, -15403, -11698, -4632, 1878, 2827, -270, 3785, 5714, 4215, 6969, 4060, 1111, 5168, 7897, 4980, 3076, 6262, 9599, 13350, 9850, 5353, -2383, -7495, -7455, -4384, 399]
6948C99L102j289N321N598j947m565l905M402M358j419r345r202o416O376L690
6933d842Q21O656L697q108j939L061M586l305n357J0166Q086k383j1285l578J966
6918a758l01l422m252k689l077L677P811L49k377j224j314K459K434K940O784
6903F040J786m481l631L465k158M039k424k042N831k356l691l379l378O124n04
6888g59k769L288M452o02K850O38k166l595n270O681K442K959r40q469k526j383
6872e169R04L598L40j24J060n277M226M775j589m076l054L736O358j935L019M424
6856A1216n960m820P143K218r6N59n458J653J507j308k804L79J214N286l528k059
6840E142K448n36Qj700o288j294m526O22L715K255M452O847J629r48j134k40j115
$$ y = [399, 3501, 2212, 7533, 13131, 11184, 6619, 2714, 7116, 11474, 10055, 710, -8492, -14908, -8532, -4842, -4021, 2635, 6332, -1776, -3715, -654, 3932, 627, -4730, 5436, 13522, 11139, -146, -3724, -1758, -2059, -5481, -9733, -12422, -15499, -11822, -4011, -3662, -6039, -7263, -8577, -6118, -3684, -744, 6040, 7826, 3345, -286, 3179, 1021, 5060, 2636, 594, 6425, 4069, 378, -3001, -6379, -255, -759, -3528, -240, 4212, 3610, 6460, 7098, 4932, 1337, -3933, 2748, 5190, 8149, 7209, -1260, -3786, -5169, -4265, -667, -327, -451, 609, -4668, -442, 4333, 2744, -1332, -4386, -650, 5708, 3773, 6792, 11216, 5256, 436, 7579, 9797, 9701, 10260, 4802, 6455, 7962, 6654, 3850, 4229, 5443, 10729, 7201, 5142, 7590, 7054, 7062, 5362, -926, -2220, -6746, -6124, -2409, -154, 4298, 11145, 12774, 11826, 10692, 10452, 9337]
6823I337l584n831n216P994M723n579J862j114n797k859o342j890k696q06K860
6808a4938P672J0464L015p866l471p184J955N54o16P103Q852k230L545J502N755
6793A4112k564n948j522Q67L398k603p431J649O15l426j733M304k444j210j201
6778e137J926O075K917R24J533p387l224l86l405L872L282l606j101k918j36J219
6762e552j996M152J329k57N277j750K180q201L224K154k403p546l202n358J0048
6747g901P71N55L428M084M822J655l719m437n449m644L899K143J253J680k737
6732d597j783M218P511j023k798m556K470k63j233N311N712k506o273k678k941
6717e429n642J2862N886L914J982l738j695J441n72j907R30J557K630L971L238
$$ y = [9337, 5753, -78, -5294, 2700, 7423, 1844, 3706, 2592, -3205, -6064, -12406, -14296, -16992, -17798, -14938, -7266, 3198, 6213, -1653, -5124, -12308, -10353, -9799, -10415, -3312, 5540, 3310, 6855, 8357, 14112, 11548, 5600, 4078, 4945, 8343, 5740, -1691, -42, 573, -2853, -4586, -282, -2726, -3936, -5137, -3211, 2864, 5781, 6705, 8238, 851, -2373, -2759, -6164, -2292, 990, -2616, -3717, -6635, -6771, -5552, -7548, -3396, -2067, -2324, 2953, 1203, 3383, -4818, -1594, 560, -1843, -9389, -12591, -17949, -7901, -7130, -6575, -3147, 937, 5759, 7414, 3695, -742, -6191, -10835, -6936, -4793, -3540, -1860, -4597, -6380, -2162, 5349, 4326, 1528, -3028, -558, -821, -2054, 3257, 8969, 6463, 190, -2488, -5429, -11071, 1791, 7677, 11591, 13573, 9835, 8140, 9581, 9009, 7102, 8032, 9589, 12219, 16190, 19428]
6702A9428K4250K0160J4808j934r695n891j6385j5502j3882m795l001K145m657
6689E049l024J419O667K170K346o458j685K22n329k997K63P672o50l21q77j036
6673C431L918R305j96n604l693j900j618n552k153N682o782k860J170N048m16
6658b220j842k166o97P14P026K338n677q78j959J923J323r287o703N47M569O947
6642f042L805O875k527q691m404q710j031R753P947N416J1536j921k098n704k929
6627A275Q361J539j385m640J683K347J157J885n610j2789r64j397l518k07L524
6612h739O90Q576N391Q49k771l111n125k492K883J737m633l22M234M361m60J534
6596B602k177O12M160L803m793q754n232L63N027R849n852m622O531q59j744L793
$$ y = [19428, 43678, 63838, 78646, 76712, 67017, 61126, 44741, 29239, 15357, 10562, 7561, 9706, 5049, 2025, 3444, 10111, 12281, 14627, 8169, 6484, 6706, 1377, -1620, -1357, 6315, 5665, 5344, 4467, 3431, 7349, 16654, 16458, 10854, 7161, 5261, 3643, -1909, -4062, 1620, -5162, -8022, -6852, -1804, -2220, -4062, -6228, -6925, -6211, 815, 3153, -2524, -3402, -5361, -3438, -2115, -11402, -18105, -17558, -12989, -6042, -2237, 4638, 2111, -6580, -10984, -19694, -20725, -10972, -3025, 2391, 13927, 12006, 9908, 4204, 1275, 9636, 11175, 9790, 5150, 6833, 9180, 10337, 12222, 6612, -6177, -7141, -8538, -12056, -12263, -8739, -8049, 527, 5918, 6767, 3996, 885, -4240, -6732, -3849, -2112, -6745, -7067, -2833, 1528, 1068, 2602, 425, 1037, 5197, 9000, 4207, -4547, -9779, -9416, -4389, 5460, -392, -5014, 1517, 658, -1086, 2707]
6580B707Q90l477q83l815J832n47k827M551n860J977N443L078K751j456P04L155
6564H223K589j613m698m218L052J221k222k547L427O48L392J784n626m726o05
6549a919k907L769j887l268M659k695p419p65j605N197R386J598N387n183n835
6534c487k052J344K006j350k235l681M28l077l386J4N437L362l227K679O876j53
6518e02q853j578M186Q662j243j82l860l031J370o79j940N492N91l323m626n149
6502a4665K61L155O008M608j481q396k752o91L135n43K639l98j570R56o76J92
6486a0218N007j033L493K927q282J509J726J032L912o177Q78J279N159N006K57
6471F475k504n238j307k074J043M207L083l177l259m197j149K068M384J485k460
$$ y = [2707, 3597, 120, -763, -4578, -2746, -3293, -6120, -1569, -7429, -5452, -9, 3069, 5820, 4364, 5068, 8223, 10812, 9199, 4501, 283, 3335, 4556, 2334, -213, 3214, 3862, 7254, 9038, 3412, -1314, -1919, -4826, -1057, -2944, -6212, -1553, -4248, -11667, -12432, -14037, -8840, 546, 2144, 7531, 2348, -3487, -5539, -4195, -2189, -3539, -5774, -9455, -9027, -12104, -15490, -15476, -10039, -6677, -9904, -7225, -349, -502, -9355, -10933, -6747, 1915, 672, 490, -3370, -6401, -5031, -5710, -7650, -2158, -1567, -4890, -9516, -14665, -14404, -11249, -5241, -633, -2114, -10510, -13262, -13953, -10818, -11361, -8722, -9120, -10690, -9734, -10410, -10218, -5211, -6244, -2751, 176, -8106, -6597, -4871, -3839, 73, -6104, -5226, -3947, 1212, 6218, 6475, 3971, -1267, -2574, -4648, -3605, 602, 3685, 508, -2751, -6948, -8097, -6029, -1645, -160, -2620]
6456b620J793N979k545k813k676L8j651k844J252O714K582k545N446K620L802
6441A2532P07m759K147q287r050K21O918J878p898K87M547J372j788n756j498
6426h427j724r56P423M544j552M920l333j519k575K796O425J184l598K538K045
6411H191m078L455N49n872r035j245M648K037n8o2K161J493k387k337r38J911
6395a567M865j415m154p732o546O756J1691M079r22r331p518M662J856o779K581
6380i474O986P792K15K235l887o5k260K262l296l291l754N64j505J866j135p954
6364a4701K315N745N205N782p58q995o700N383N868J496K677M384p197o397J623
6349d270M711Q449O994n58j152l319l753j277k371m492m019K37N092L488j160
$$ y = [-2620, -827, 5152, 2607, -206, -2882, -2844, -4495, -7339, -6087, 627, 3209, 664, 6110, 8730, 12532, 13239, 8480, 10627, 2340, -6710, -6489, 429, 2307, -5591, -5304, -757, 615, -1173, -6929, -8427, -10151, -11107, -3684, 860, -692, 4228, 895, -624, -3199, -403, 6022, 7206, 3608, 6146, 8191, 4113, 7568, 8117, 2245, -6790, -8035, -3387, -1350, -1408, -1470, 691, 2184, -203, -2540, -3478, -1567, 3298, 1883, -2271, -10003, -16549, -9793, 1898, 5977, 5055, -4276, -11794, -7132, -5276, -12055, -9474, -2488, 5304, 5519, 7754, 3867, 3802, 1542, 3804, 508, -2783, -6537, -5973, -7478, -5612, -6747, -14701, -12386, -6641, -1436, 4346, 3588, -5407, -12107, -6724, -856, 640, 3317, 7701, 504, -5893, -4270, 441, 8890, 15884, 15326, 14174, 10855, 7102, 5825, 3454, -1038, -5057, -4820, 272, 3760, 2600]
6334B600k930J595J206J07n574p63k576m422m03Q001K130O764k838p458o80R00
6318d341k215L858P147M490l06L847N809p542o667k447j201N603O213k488k912
6303F848L010M94j197j0281m191M391R24P18o08j282r7J810k909p89O070L904
6287F815L638l963p283j820P954L034l499q770l27K265K70j051J38Q590M99K28
6271F718J714M39K230l843l314J909m736p090r67J393q0l685k32N384K713J901
6255D54o574n051L670Q8q365j13O38K001K774O569L721m941l04O560J805Q21K164
6238E917k844l113l683m913k202J031P22K509j993k52p89k879O93J1889M416l050
6222A459N085k973n079J679J061l772l815M295P990J943m445n869q80p53k622
$$ y = [2600, -330, 1265, 2471, 2578, -2996, -3759, -6335, -10757, -11160, -3159, -1029, 5735, 2897, -4561, -5241, -4341, -6556, -2698, 4449, 8939, 8633, 12480, 18289, 10747, 4080, 1633, 432, 6035, 12248, 9760, 6848, 9858, 10352, 9155, -1126, -5317, -926, -2, 716, 108, -1174, -1271, 539, -2370, -3159, 2911, 6815, 10453, 6490, -793, -2613, 5341, 8375, 4876, -3894, -4221, -1956, -1686, -2737, -2599, 5991, 6490, 6718, 8432, 8871, 11101, 7258, 3944, 5853, 1117, -5973, -6940, -5547, -5627, -9312, -9544, -4160, -1447, 454, -6120, -11171, -7501, -7413, -15778, -15891, -15253, -13252, -10478, -3909, -188, -5129, -5433, 1127, 2932, 3753, 5917, 3073, -40, -3723, -8636, -10838, -9807, -9085, -6576, -8569, -8821, -9610, -12489, -11796, 93, 4509, 1459, 6544, 3571, -1508, 171, 1232, -2540, -6355, -2060, 5930, 7873, 3428, -2441, -3321, -4074, -6696]
6207f696p049Q11M366j55N378O437o007k618L672n908m906L111O32j06P640M505
6191C107k073L1R295J6q538k827J681p35O213j291o638J273j563J087r83k108
6175d053L384j08j155N897K069J57m283m92l329o047J697j665n942M264O435P528
6159D357L163r810k870Q383m67j0060K152L462r08P87R551L102L728N36n078l604
6143F424M48j4083m576R252J693L663N57o825o177L023P56O86J746q534N095N775
6127a077L83o507j198O267o38R52K231L644p779l98k007m738M687N791m516n193
6111a0096j318J0855k90k16j235k57k07j5J043N495m582M89L732j949J228K772
6095E449k745p560k196m17J771l522M447L11J106J874k358J730j643N34O125L686
$$ y = [-6696, -13745, -12934, -8568, -8723, -3345, 3092, -2915, -5533, -1861, -7769, -12675, -9564, -8932, -9038, -1398, 3107, 1034, 1065, 10360, 10376, 1838, -989, 692, -43, 6170, 4879, -1759, -486, -2049, -962, -1945, -4053, -669, -777, -1932, 3965, 6034, 6191, 1908, 1416, -1913, -7960, -6263, -7928, -13870, -9606, -3171, 4357, 7520, -2290, -5160, 3223, 2756, -7304, -5152, -1690, -2598, -1811, 7740, 10842, 14570, 15106, 10028, 6424, 6872, -7211, -11787, -2535, -842, 2821, 3378, -3447, -9624, -6601, -5845, -5159, -3413, -11947, -6852, -1077, -694, -7201, -8399, -2132, -2770, -1818, 413, 4057, -3722, -4120, -6127, -10865, -6178, -387, -4903, -10096, -11414, -559, -849, -1065, -2300, -2557, -2764, -2779, -1736, 3759, -823, -334, 3398, 1449, 2677, 5449, 2704, -4856, -7052, -7469, -5698, -9220, -4773, -4462, -3356, -1482, -3840, -2110, -3753, -3219, 2906, 6592]
6079F592M61o978j1115m005K286q44N694J0197L84J033j223n812m109L613j57
6064c983n363Q771j267l127O43k756J400N471L731L815m055q923k139J931q082
6049a3933m719N473J882J647N30l798J804M160J780Q222l846p532k400K019M019
6034d692J2161J997n014l400l412J810l423J071k343K757N796j363J843l087P56
6019A457j610j959N660J844l158k817l457j671R1p05L92o51l354J584O138J655
6003e61l720M507M997N966j138j556O961k24m954l138p219j876l057k284n70K696
5987e170K469K09L636j729o387K060JN000R31l376L890n402m620RJ085J644l223
5970h973L287O678k916o943M329K065K637n251q96N482r2k450O197O472m842n652
$$ y = [6592, 7053, 75, -11040, -15045, -12759, -13603, -7909, 2288, 2672, 3705, 2482, -3330, -7439, -3826, -3983, -9346, -575, -1842, -4969, -4326, -7082, -5682, -211, 3520, 7335, 3280, -5643, -7782, -5851, -13933, -18652, -13179, -11297, -9650, -9120, -12918, -11114, -6954, -5174, 3048, -798, -8330, -10730, -8711, -4692, 7469, 9466, 4452, 1052, -2360, -550, -3973, -2902, -5245, -2488, 3308, 1945, 3788, 701, 1457, -153, -2112, 3548, 5392, 2234, -583, -4040, -5711, -5620, -6325, -5933, -6584, -9938, -8354, -2216, -561, -4281, 226, 5223, 11189, 10051, 8495, 15456, 15232, 10278, 7140, -79, -1955, -5012, -7296, -7866, -5170, -2701, -2492, 1144, -585, -6972, -4912, -4911, 89, 1020, -2356, 1534, -3868, -8488, -8479, -7394, -5750, -8973, -5686, 992, -1924, -8867, -4538, -2473, 164, -5087, -5983, -501, -593, -3043, 3154, 9626, 4784, -868]
5954h68j04m974o513j227L935J223O747r18l22M19K450m854K247M621R64L530
5938F356j114M40m923k964j503n127k001P130L132M694P76k291j570M22K294m988
5922a237m144J544M403M582n133k165J109k0j138r580L037O266L773K889Q053
5907A2239L077j501o754J390j674o049Q72j653l135l474m836k628J245N873j737
5892h745M844K295O149L190l717J479Q60P06n897j3347m50N039J0870J169l762
5877F83j69M53N71j762q76j602l008K642J992J244p39r79k338l242K013N244M35
5860E62m672l566m311K587Q448K652L634m2J151k324j755p271Q648J2552r801
5845F492p917l085R87J702n864O57O086o99k745k588J544L478M431k676J820p84
$$ y = [-868, -972, -5946, -12459, -13686, -9751, -8528, -1781, -2699, -3021, -2602, -152, -5006, -2759, 1862, 2826, 6356, 5242, 5682, 759, -2205, -3708, -8835, -10836, -3706, -574, 4120, 4896, 2605, 1035, 1457, 3751, -1237, -5381, -3837, 566, 5148, 15, -2150, -1041, -1061, -2199, -11779, -8742, -2476, 1297, 4186, 12239, 15316, 13815, 7061, 8451, 6777, 728, 1600, -53, -3188, -6662, -11498, -14126, -12881, -7008, -8745, -3901, -1606, 4543, 7733, 4016, 5495, 6355, 7061, 1164, -12183, -12633, -7594, 3276, 4445, 683, 514, 967, 1538, -224, -1100, -2702, -5710, -3068, -1076, 168, -571, -1550, -3888, -7130, -5117, 127, 562, -4110, -7676, -11987, -9400, -952, 1700, 5334, 5292, 6443, 4119, 2364, -4907, 3741, 16293, 6492, -1425, -4510, -3523, -1821, -7685, -7028, -942, -1641, -4386, -6974, -5430, -1952, 2479, -197, 1623, 839]
5829H39j712k402M843M646K096l492r964M140K384m085j784J611O882Q175q228
5814C949p417L529r85m552P1k552O696q86m770r52N987K490k53l398k293J358
5798c978L229k457J361O072j135l547m842L552m663L435L323N700l347j0065L820
5783c542L206j419j259J116Q149K577o210L453O27J318j591j665J627K700q8l853
5767E146q724L021K064K530m7J966J1202l463n750l346j103l975J936j548n02
5752e93K384j835n429J771P983k884K511O35j1426m010O099O116j56j220O002
5737E948J079j0493m530j720m420N044M471j899L520R75J265N109j567k599j295
5722a112m083O154m10m323j077m47k423N79N240K647l369K509M221K673L632q327
$$ y = [839, -873, -3275, 1568, 6214, 8310, 4818, -5146, -1006, 1378, -2707, -4491, -2880, 4002, 12177, 3949, -3468, 61, -924, -5476, -5405, -7957, -1261, -2147, -6917, -7869, -1882, 608, 355, -3043, -5336, -3978, -749, -3206, -1845, 4227, 3092, -455, -5297, -1745, -6408, -2973, 350, 6050, 2703, -7362, -3542, -336, -1755, -3014, -1898, 6251, 8828, 2618, 6071, 6698, 8016, 6425, 4760, 6387, 9087, 8999, 5146, -3578, -557, 1507, 4037, 3990, 5956, 17158, 13695, 7945, 4599, 3496, -479, 1457, -91, -593, 1791, -44, -5473, -3702, 4281, 1397, 3908, 4543, -6883, -10893, -4794, 1322, 1166, -54, 5948, 7027, -3466, -7996, -9716, -14136, -9092, -4621, -6520, -3000, -2025, -760, 4349, 2782, 183, -1112, -5195, 959, 549, -3774, -4851, -5298, -7721, -7142, -1902, 745, -2624, -115, 4106, 6779, 10411, 2084]
5706B084o46N588J892m550L053O19n380m981j529J943M443m493j316Q996j117
5691D606m287j27j658J143m779n772K126Q33O039J540k150q699J836K767J747
5676d835l788j304M323K706l3k691l370l494R191j359q207K782R35o0K162K599
5660d443K378O232k739K34l074N787R91k954p627O88N631M386K662n413J637M941
5644I317m805J0L407q1o241r903o957k439L520O440L546K750J237o35L287J884
5628D337M534m123p546l32K376K903k860k722j669j51M560O766k20r493m875K205
5612f310o26J161o453J672M407j847o489j463L175M936O133J227q58k302l228
5597f865M051O526l338j0365n612Q098oO79K070m083p48J319k227K145R137R46
$$ y = [2084, 1438, 7026, 8918, 4368, 7421, 8040, 2660, -2321, -3850, -1907, 2536, -1957, -3273, 5723, 4606, 319, 192, -1466, -323, -5102, -10874, -8748, -7915, -1876, -336, -2486, -11185, -9349, -6582, -4835, -8623, -9927, -5604, -2898, -2931, -5622, -8992, -12486, -3295, -4654, -12861, -10079, -9144, -9204, -7042, -4443, -2065, 4167, 1428, 1662, -1412, 4375, 5366, 2412, -5215, -4527, 1104, 5490, 8152, 2739, 4376, 9317, 4512, 4522, 7929, 7848, 1607, -8296, -15253, -17692, -14172, -7732, -4186, -1436, -199, -834, 2453, 4337, 8871, 4748, -2798, -3130, -754, 2149, -711, -3433, -5102, -5253, -693, 6073, 5853, -3640, -8515, -6310, -6936, -5775, -12228, -10556, -6149, -7996, -14485, -15948, -12773, -7837, -1704, -477, -1335, -3637, -6865, -2814, 3712, 374, -9991, -15603, -7505, -7511, -6832, -4762, -8845, -9593, -8274, -10501, -8356, 781, 1727]
5581A727K058M448N526l457n884j470m189L785l508j907P218R81k360j2020j701
5566a0753N387m856k2R195N769m180K121k40k084J347l864m583j111J940J051
5551d883K158L636K713l734q17k823m972K26L231Q6l41Q60k402l812J857O332
5535b685L361q66O015K459j641p041l999M586L713l975m72N259M228J451m207
5520F186p452J724J583L25m42O482N33m193r325p366Q80L116L523P046J511K407
5504F538J635k071j298j334l71K438K761M71l559m282k349j363j175n713k578
5489a2250R386K051k36k276j04J513N873K770l592q06L675o82p931q699K604Q095
5473f09P703j886m107q572m156K510J879L060J054O429j684l119l906n321N902
$$ y = [1727, 3785, 8233, 13759, 10302, 4418, 2948, -1241, 2544, -964, -2871, 4347, 5328, 2968, -9052, -10753, -5366, -10222, -10244, -1049, 4720, 540, 2661, 2421, 337, 1684, -2180, -6763, -7874, -5934, -4883, -2725, 911, 3624, -110, -927, -3750, -8722, -8496, -5265, -5179, -5520, -4660, -7062, -10874, -9017, -2685, 676, -190, 5825, 8284, 6643, -398, -4397, 189, 3902, -73, -545, 4714, 8942, 10393, 6186, -1266, 458, 2041, 2366, 1924, 8406, 8939, 4746, -4579, -11945, -11065, -7949, -4426, 2620, 4131, 6538, 8173, 6102, 4804, 3470, 3099, 5537, 8298, 8769, 5210, 928, -1421, -2784, -3959, -9672, -12250, -2864, -813, -1049, -3325, -3429, -1916, 3957, 6727, 3135, 2329, 6004, 5322, -2609, -11308, -8704, -609, 7094, 5208, 1101, -7471, -11627, -9117, -7238, -4178, -3124, 3305, 1621, -1498, -5404, -10725, -4823]
5458d823K953j692k049J114O794j19o466K50j725N093k68K798L239m976L358J108
5442D589n594p30Q42k605L056L622m43j499L35J59L214Q507m094o503p594l916
5426h654j259K11L343K840l033p363N13O460J0932M810k275j0594j918k299j336
5411i622R28J851L877P396N207k570j349m138p842k929K216K126R3N05m941l957
5395a3149L565J2678N973m329n74K332p246p248M897L817K951J094M558m433l047
5380A839k275o208R88P343O722m211k480L136K499L78l659P23k207O10k173k35
5364G90K308k05o200K81L078J120l847k347j6M640k691q465L356O726J84j827
5348c115l925q749j161Q504P273P329L279m020j1339p491r70K054O407j502P94
$$ y = [-4823, -1870, -3562, -5611, -4497, 2297, 2178, -4288, -4038, -5763, -670, -938, 1860, 5099, 123, 3481, 4589, -1005, -1735, -893, -3498, -442, 3180, 2737, 1238, 1573, 1732, 4946, 13453, 9359, 2856, -4738, -8654, -9913, -9702, -6359, -3519, -6552, -13915, -13402, -6942, 3990, 8800, 6525, -4069, -5987, -8286, -9622, -8694, -6843, -2966, 4430, 9637, 7067, 5718, 1580, -6262, -9191, -6975, -4849, -4756, -4251, -9192, -13149, -9584, 3094, 9067, 4738, 4164, 6496, -750, -7998, -3101, 716, 3667, 4761, 9319, 4886, 1839, -436, -6644, -5656, 1687, 8409, 4198, 1718, 4854, 7353, 7731, 4072, 4795, 2588, 3198, 1025, 790, 3098, 2893, -3307, -3026, 52, 1172, -2675, -5022, -5038, -398, -3089, -11554, -8198, -1472, -1288, -3115, -7040, -15789, -16950, -8446, -1173, 6156, 9435, 5415, -5924, -13415, -14385, -12331, -5924, -7426, -6632]
5333f632L653m227K790M299j954o190K205N908K683J06n479q20J436k610k740
5318g572L280K847K900Q04r04k077n065k526P343K886m216L18P323j90k727m237
5302a813l685j612k815n857l673J1742Q85r74j523N545k31n422l728K516m81M793
5286f333j087J381J965m377n949M442N623L379l614r95L726J238J300k420j649
5271c370r745J485K291J025o7J056R315j554n201j662m90J843L418n712n06j582
5255i456R921O158p786m736O503K495N483R32n425j425L158l667k287j573O045
5240D340l546m839R51L713M184o349m453J950J407J15r50o65m805l473J87L974
5224h259J623l557o047N332J653k49P755J0740k360q237j969R97J498J218K991
$$ y = [-6632, -2979, -7206, -4416, -117, -2071, -8261, -6056, -148, 2535, 2641, -2838, -3658, -2222, -4832, -7572, -4292, -1445, 1455, 2259, 1355, -722, -5787, -8313, -970, 1916, -2300, -1982, 5341, 5151, 2424, -1813, -5498, -7110, -9925, -15782, -19455, -7713, -6828, -7802, -9325, -3780, -4011, -9433, -13161, -10645, -11126, -6333, -7420, -6039, -4074, -8451, -14400, -9958, -4335, -956, -4570, -5565, -1839, -601, 699, -1721, -3370, -13115, -11630, -9339, -8314, -8381, -7325, 1990, 436, -4765, -6427, -6917, -5074, -1656, -7368, -7874, -9456, 465, 6623, -1163, -5899, 604, 3099, 8582, 9514, 4089, 2664, 5822, 2155, -132, -1705, 4340, 794, -4045, -3094, 619, 4803, -1546, -5999, -4049, -2642, -2527, -3477, -4142, -8947, -12420, -12233, -8259, -6636, -10193, -16240, -10908, -9255, -9504, -1749, 8991, 6631, -1606, -3575, -2578, -1080, 138, 3129]
5209C129L769K561l58m824j358j640J775J526m603j1157K104L012K861J961k780
5194d022k046R713k76m731k28j715m27O02M183J671j7o908m760J804J277K336
5178c544O11N682Q857M788N1N007o99j156j4981p905m69L204P85m51k024m226
5162f470k064L535K274k797L822k579k845M053l399K15P971M983o77k910Lm324
5146a209q6k171M463R479O521p575n045o754j159M194R59L757j230o581j522J832
5130b127L872J135K590o950m33k604O51J0760M416k661q243q38l540J609N852
5115C489l99k045m290J706j531m476Q784L919r019k054j070n09k852N732R53k975
5099f637R6O964L216m75j791k366kN601M288k342m5j349M04o495L561L155N538
$$ y = [3129, 6898, 9459, 9101, 4277, 2919, 1279, 3054, 4580, -23, -11180, -9076, -6064, -3203, -1242, -4022, -6068, 3645, 3369, -1362, -1590, -3305, -3732, -3130, 1053, 2724, 2707, -4201, -8961, -7157, -5880, -3544, -2933, 2749, 11606, 16394, 16445, 21452, 20753, 19597, 4616, -3289, -3758, -554, 231, -220, -2244, -6470, -8534, -4999, -2725, -5522, -1700, -4279, -7124, -3071, -6470, -6255, 1716, 6699, 6022, 3112, 3115, -1209, -1295, -3466, 997, 10476, 16997, 9422, 4377, -2377, -3536, 658, 1617, 5374, 4144, -2437, -3959, -2127, 1745, 2880, 5470, -1480, -1913, -4517, -3866, 6894, 11310, 8649, 406, -432, -3972, -2363, 3489, 3090, 1045, -3245, -1539, -3070, -7546, 1238, 5157, -3862, -5916, -6986, -7495, -10347, -4615, -3662, -6637, -6541, 423, 3639, 3164, 1373, -993, -995, 4606, 8894, 6552, 6507, 5158, 5562, -933, 2628, 5783, 11321]
5082A1321P51q052m69K596k212j621k165K892n677n25K72L028k3n254n761l367
5066a4266K660N938J958m480o493j545K435P524K935L002P96m097j023k660J824
5051e492k524J145Q3m282L216R564P565j389n025J400j115k52L315n242j058M613
5035D522N10N587m9o766r782L09K856M587J595l991K675L158J542n150m498K288
5019f07l506p582L331R946K184P81K616J157o492m744m30K509m048J250M01n51
5003c785k590K172n36j826K574N247j058q35M649Q163m312k40J033n919j826Q487
4987I398N687n475N9J478j950j700l536J61m058l352m764K655N558N085K189l5
4971G400j1550R10J244J135Q664k394k881j412n256k757N478J835j802q310O869
$$ y = [11321, 12072, 4020, 3551, 6147, 3935, 2314, 149, 3041, -2636, -3161, -2889, 139, 116, -5138, -10899, -14266, -11606, -5668, -3710, -8190, -14683, -16228, -13793, -6269, -3334, -332, 464, -3633, -4656, -7316, -5492, -8016, -6871, -6788, -11070, -7854, 1710, 9275, 7886, 2861, 4261, 3146, 2894, 6209, 967, -91, 4522, 5032, 10619, 10570, 3804, -5978, -5669, -2813, 1774, 3369, -622, 2053, 5211, 6753, 1603, -2895, -607, -4113, -11695, -8364, 1582, 3766, 4547, 7163, 8320, 1828, -2916, -3346, -837, -4885, -3635, -3234, -3785, -6375, -4203, -4739, -6565, -3991, 1256, 198, -637, 4012, 12175, 7863, 7623, 8656, 2737, 911, 9398, 15085, 9610, 9669, 11147, 9197, 7497, 3961, 4122, 64, -3288, -8052, -5397, 161, 5246, 7435, 7400, -4150, -3240, -1996, -861, 7803, 5409, 2528, 1116, -4140, -6897, -1419, 416, -1386, -9696, -2827]
4956b827M607L172J36o316k901j909n869M761M144q005j382O026K805P469L106
4941G017j032k56m155k574r50q634m076O051j129q124k065P783J2324m38p368
4926g626L663l078N014O102K136l748m672O408L515m541j942k414q243m655j948
4911a6029M542L098M873N107L7j617j0730l593K481O194M675j420k530m121k280
4896a1313N205O734j865k407O116L962L215k356n152k989N330O443K892n834r755
4881a774n892P03N020N660j753k546j347k692k38K845N420O024M186k602o770
4866D244l244J094p171k160L864j184M665P89J955K322o216L74P072K688k466
4851F626j720m357n954m875L046o928P36N843K91r86M216K341K26l302l217Q77
$$ y = [-2827, 1780, 4952, 5088, -1228, -4129, -6038, -11907, -7146, -3002, -11007, -12389, -6363, -3558, 3911, 7017, 5985, 5729, 1574, -1000, -1950, -10584, -14660, -8609, -9738, -17862, -19927, -12144, 180, -258, -7626, -3963, -7041, -2027, 4075, 6211, 2463, -2209, 4199, 7714, 3173, 1231, -1183, -9426, -14081, -16029, -11487, -8389, -3516, 1591, 1628, 11, -10719, -14312, -11831, -5637, -962, -2382, -4912, -9033, -11313, -6108, 626, -1239, -3646, 2470, 6432, 9647, 7291, 2139, -850, 4480, 10923, 13815, 7981, -1774, -7666, -6963, -1943, 3717, 1964, -582, -1929, -4621, -4859, -2014, 3406, 9430, 13616, 11014, 4244, 1000, 2094, -5077, -7237, -3373, -4557, 108, 897, 2852, 5174, -1042, -668, 6404, 9092, 6626, 4906, 549, -5405, -10280, -7234, -14162, -13426, -7583, -7292, -8278, -4062, -1721, -1495, -4797, -8014, -7137]
4835g137j83k204L055J189K155K396q730o737L276O380K993L263o562O25L907
4820b314J323j0394n140M028N033j14O93N852k978p049M18N220K980M769o945
4805d618l882m54P705R540m86j921l196j575J649l507j151m140M341o17L093j101
4789c20L150k175J604n215k479K199L477K942R22n392k920p81m690R40Q046J545
4773H53K080N12J34m987O268Q600l593o724J050m454J131l66l670m42J727M655
4757B774J74o129m316K720N612k16M586m928k587N35k002N438Q60l613q80j999
4741c971O05M229J088l25M349K327j11K360l302l397k391n157o600O122L238m76
4725a412L193j461j081J708j592L688r43K159M218m90K003q273l761l877m493
$$ y = [-7137, -7320, -9524, -6469, -5280, -3125, -729, -9459, -16196, -12920, -6540, -3547, -284, -6846, -6221, -2314, -991, -11385, -16525, -12497, -7464, -7578, -6885, -1033, -4011, -11060, -10642, -5422, -2442, 2327, -4618, -8500, -8954, -1249, 8291, 7805, 5884, 2688, 1113, 2762, -745, -1896, -6036, -1695, -2312, 781, -320, 2830, 655, 2259, -2956, -5435, -3236, 241, 3183, 4105, -1287, -4207, -4988, -9678, -8738, -692, 853, 2933, 3445, 3579, -1408, 4860, 13460, 9867, 3143, 4193, -261, 870, 504, -3166, -3608, -1881, 2774, 2948, -3181, -7497, -4777, 835, 619, 5205, 277, -2310, -1775, -3777, 1661, 2521, -1092, -1972, -3971, -3366, 863, 1951, 1626, 5975, 8302, 8191, 10551, 7249, 3852, 1461, -3696, -10296, -4174, -936, -1412, 1781, 320, -761, 947, -645, 3043, 2100, 4259, 8477, 7987, 9990, 1717, -2044, -5921, -10414]
4710a0414J856j556k981l493J96Q344R158K038p355Q3J776n838m37O271J547k771
4694c576l147M370L451N186J516k031J241j187r146m447J505L912p493j642L428
4679h060N189N744J779l080o370m102l531N805P453p133k248K444l969p36j528
4664a2343Q693N175j069M120l006k116L397l35k427K611oJ439J285k639o0n001
4648b282j580j089K120Q50k208o012k323K610P361j39K005R5l382J803Q793j21
4632F501q618n257N79M875O451k568J700k515n19N653k002L865k34j576l613L90
4616C112n309p371k197L055p105J173J19k96M916K673m57J193J305k562n044N254
4600g541N644o618l771M631L94M422l873l792m036l574J191m80p71O197M538K424
$$ y = [-10414, -8558, -10114, -13095, -16588, -16392, -8048, 1110, 3148, -4207, -4124, -2348, -8186, -8623, -2352, -805, -3576, -6723, -2353, 1098, 6284, 7800, 5769, 7010, 5823, -3323, -7770, -6265, -2353, -9846, -11488, -8060, -2871, 2873, 4652, 1572, -4798, -8900, -12431, -6626, 827, -6306, -8554, -6110, -10079, -10815, -12343, -3650, 1525, 456, 4576, 1570, -546, 2851, 2516, 89, 2700, 2694, 4133, 5418, 2779, 2719, -2282, -3862, -4951, -2831, -1981, -4189, -10201, -12524, -9914, -2553, -2692, -687, -592, -3974, -2171, 6622, 6501, -2117, -7374, -6795, -1920, 4531, 1963, 3663, 1148, 629, 6282, 4280, 8145, 7911, 6335, 2722, 3112, -2197, -9568, -11765, -8710, -15815, -14642, -14523, -14819, -9903, -7230, -7687, -6494, -5189, -7751, -12795, -7541, -1897, -8515, -12286, -7655, -7261, -2839, -6712, -10504, -14540, -18114, -16923, -17403, -18174, -11977, -7439, -5015]
4584e015k348k836k470k446P317l42P441k039M44K236J756O13q87o57J19k77K626
4567C235N16L982j827p068Q94q90N79m423K893Q039m11j722K084k258N01L261
4551G385k812o588q657o479k055M272R154M49j99M813N344Q76l213K766M526j796
4535G786n471n120N208M362J694J154l234o027R6o624j525O344O117O164l595
4520G329n998n044m087J145M155N900o81K267M438m709J227M886m708j776j281
4505C063j601m611J6J112j134m14J154O232o878p598r240N568Q325M046l835l182
4489h977J367L502Q785K705J594l347r298l133k612N81l04K583j044L005m163
4474h756J996K198j445m037L104K955q133r30O454J745K305M644j821L866m395
$$ y = [-5015, -7363, -10199, -12669, -15115, -7798, -8140, -699, -2738, -2294, -58, 1698, 2311, 1424, 767, 886, 609, 3235, 3751, 7733, 5906, -1162, -268, -1158, -579, -5002, -2109, 5930, 5519, 3797, 5881, 3623, 4124, 7385, 4573, -2015, -10672, -17151, -19206, -14934, -5780, -5331, -5530, -717, 4627, 5503, 2290, 5056, 9582, 7786, 2315, -2805, 2403, 6765, 8459, 9613, 6379, 352, 448, -6176, -7701, -1357, 4760, 10924, 7329, 1331, -3713, -7800, -6655, -2500, 3400, 2719, 4986, 9424, 4715, 5942, 10828, 6120, 4344, 3063, 1462, -3149, -3133, -2021, -3155, -3569, -2415, 3817, -3061, -10659, -19899, -14331, -6006, -1960, -5795, -8977, -7610, -4108, 4677, 7382, 8976, 5629, -3669, -6802, -9414, -8833, -9137, -6554, -7598, -4593, -8756, -6760, -4562, -6007, -10044, -6940, -3985, -12118, -13048, -6594, -4849, -2544, 2100, 279, 4145, -250]
4459b50m156J82P381l27j549j913p372L424J777q77n765L76O821M885j447K157
4443C347Rr31k885l052j753M789K431m996o309J064m84l374l775m739k42J145
4427a9755P860J0813N664l360k770K661n71J075K351K78l385r78n676l846J831
4412g808K550J175K928K20k038O392j203k334J373J557J430o508l107N653m62
4397a82n594j711L327P75j662m358n01M393J110Q64N839k748P20n38M84K871r23
4380B166k532O326K896j140m258L802l716K089m487j53k94M874K146n905m222
4365b408M74P08O088O715m071k240J910k455p973j735K049L917k954K075N80p90
4349a10m809O474Q244j759r828k274M527J868j569L798N003k973p592N26J209
$$ y = [-250, -4406, -4224, 3157, 2830, 1281, -632, -8004, -4580, -2803, -3680, -9445, -9069, -2248, 2637, 1190, 3347, 3356, 2425, -460, -3512, -5265, -476, 1955, -3041, -9350, -8286, -8770, -12144, -15919, -20658, -20900, -19755, -11895, -1082, 4582, 1222, -1548, 1113, 542, 1617, 3968, 4246, 861, -117, -5793, -9639, -7808, -5258, -4083, -1155, -935, -2973, 3419, 2216, -118, 1255, 2812, 4242, -2266, -5373, 280, -182, -5776, -7487, -4160, -3385, -5047, -9405, -9906, -5513, -4403, -3539, 2300, -448, 272, -266, 218, 3089, 2166, -366, 5960, 8856, 7716, 3458, 7260, 3544, 5633, 1146, 993, 699, 5573, 7719, 1814, -2408, -1934, -1226, 4862, 11577, 7506, 5266, 7176, 4721, -3252, -4987, -2938, 979, -1975, 100, 680, -110, -4919, 1555, 9799, 8040, -1788, -4062, 465, 2333, 764, 4562, 9565, 6592, -1000, -474, 735]
4334G35J841L631O31r316j319N884J592M539J369n086j348m369l525k700p423
4319a4864O91M372L714J355l199k799K198N79L328L191J305O10J949O053m31m274
4303C778o129n168K6J249N861j901l878M573p64J88m628l545j726L358L796n40
4287e450L265N030K752M919N01p960k885M677J274j911q93m93J913r06j593q0
4271B160j368l20J980q55N093k776R93m00n386m40N942K518m533m547M210M70
4255B741O06M032N52j407k416N202M271j142o167l246j127l961p239p27N697K03
4239d128M219N077k204p90L648J359k634L539N6L082j354k013M834P391o397r240
4223D445l093k045l859k639r28k759O447J180J022P76K015o407p492o06l353M638
$$ y = [735, 2576, 6207, 6838, -2478, -3797, 2087, 3679, 8218, 9587, 4501, 3153, -1216, -4741, -7441, -14864, -14173, -9801, -6087, -4732, -7931, -10730, -8532, -7953, -4625, -1434, -129, 481, 2430, 8483, 8052, 3778, -2351, -7519, -7493, -6244, -383, -2284, -6162, -1589, -2353, -2165, -6793, -10338, -12064, -8706, -4910, -5450, -2185, 2845, 5597, 10516, 11017, 3057, 172, 4849, 6123, 4212, 3319, 2826, 4739, 3833, 2240, 2160, 792, 472, 2452, 1597, 6690, 3914, 4907, 4507, -879, -1319, 4623, 7141, 2608, -1939, 2271, 2741, 3347, 7379, 7931, 6524, 4108, 9310, 13581, 12439, 6272, 3026, 1899, -2062, -9301, -10028, -4331, -4128, 91, 5168, 2964, 2174, 5822, 7181, 4547, 8086, 8142, 11224, 9870, 7857, 12691, 20082, 13685, 4445, 1352, -693, -4552, -7191, -8119, -10878, -4431, -3251, -2229, -1453, 562, -5845, -13337, -13943, -17296, -12658]
4207a2658R517J667j89K069k619p725K720n30j550K29N723L391L6K229L589N299
4191A1198j305p66j821l818l830M02O517J428k059l845J585q33o747l991q7K208
4175e764Q43J881l622K240N095O925k585p017J698L241K720J450k76k146m849
4160a66L869O58j0747K709L553j211J759R3M520M850o4j859n68L122O096p709
4144H905m804k144L644l214n03J603J609m488N013J805K362j244m737j676l886
4129a755k724r84M723K610J061L62j0272k429L448o23j749j008K543N823M767
4114C793o97J872J38l545q6p78j302p254K819L043k917K304n21N286k806n243
4098e894R34L353j631l954K136m757P013O681m932k963j631m39j781r15o769P307
$$ y = [-12658, -3141, -1474, -1663, 406, -2213, -9938, -7218, -7748, -9298, -9069, -3346, 45, 81, 2310, 5899, 11198, 9893, 9127, 7306, 3488, -342, 60, 6577, 8005, 5946, 2101, 3686, 2853, -3894, -7885, -7972, -5764, -4921, -3040, -6662, -4422, 673, 7598, 5013, -2004, -306, 2935, 5655, 7105, 6829, 4683, -166, 3703, 4361, -6386, -3677, -124, -1335, 424, 517, 5037, 9887, 9823, 7964, 7396, 10518, 16614, 8905, 4101, 1957, 5601, 2387, 1884, 3487, 5096, 608, 5621, 7426, 9788, 8544, 3807, 2131, -1755, -4479, -5463, -740, 1870, 2931, 3293, -6979, -9408, -5960, -6583, -8332, -9340, -6797, -974, 3793, 3096, 4968, 5106, 1561, 1475, 697, -605, -7859, -5040, -1997, -4914, -2610, -3131, 2155, -651, -5894, -4960, -1607, -3238, -7192, -5056, -9813, -2800, 3881, -1051, -4014, -5645, -6084, -7865, -8780, -15549, -8242]
4082h242L771j93k616J191n752m706L644L813K685K491L778k332k720L503O646
4067D961o096J30J186q16n047N99L114J734K647J868p186l129N99R669k453p091
4051e311K764j356J622Q035o097J715n41k826l291o08O510K568r83l713j328j0339
4035a3179Q96J2377N658M53l761o123j950j359P85L894m660j277K300J34k912
4020h724j0599q4Q996J506m155k204Q90N797K588N22J64O617R91o840J54O23J397
4003b361j120k262O00N413J435r02K778Q50m495L53J882M601N072l838k322q766
3987c082m796k173M338L161J078M578R163l495j459J751j313L227n074m848m92
3972E64R120L342k789n024K221k721J846m03n35l393K293N155k534k452n465m342
$$ y = [-8242, -4471, -4664, -7280, -6089, -11841, -16547, -12903, -9090, -6405, -3914, -136, -2468, -5188, -1685, 4961, -1135, -1005, 181, -635, -5682, -5083, -1969, -235, 2412, 4280, -2906, -6035, -5436, 4233, 1780, -5311, -2547, -3903, -2281, 5754, -343, 1372, 831, -1995, -5286, -5894, 616, 3184, 2201, -1512, -2840, -13179, -12283, 94, 5752, 6205, 2444, -3679, -5629, -6988, -6203, -2309, -6969, -8246, -5946, -5812, -8724, -19323, -19407, -10411, -8905, -13060, -15264, -14374, -8577, -5989, -5467, -5303, 1314, 2305, -4535, -4381, -3758, -2361, -3481, -5743, -5143, 270, 1705, 803, 3581, 4431, -64, 289, 2171, 6772, 11844, 8006, 5684, -3082, -7878, -10051, -5713, -2552, -1474, 3104, 12267, 8772, 7313, 9064, 7751, 10978, 5904, 1056, 564, 9684, 13026, 10237, 5213, 7434, 4713, 6559, 6156, 5621, 2228, 4521, 9676, 7142, 4690, -775, -5117]
3956e117K304K970o909k744M611k161O732M852n402o65M863L023L16N301P0n747
3940F297k363J213L509j312j748n448L275Q09j0848k862K737M205k1l52r339J570
3924a0678Q421j052l584j561M091q50n255K312L854j332k506m200l5J0203L104
3909I32l513n99k123L109O21k071q75M5L398L968J13M069Q23j0235p054J998M718
3892b676O358l280q301j457k698r57L368O227J093j706L119m446k28K119q220
3877a1685N419J617q58j468L186N163k804p391P389L805j247l967K209M774K704
3862F846L34m321j56M19j388l372n170M939M993k042O307j071m695p827p985k343
3846a6532M191J2298P134m511n629J173n194j354P621L196K567m045j0898l496
$$ y = [-5117, -2813, 157, -6752, -9496, -4885, -7046, -314, 4538, -864, -1529, 3334, 6357, 6673, 11974, 12044, 6297, 3934, 5147, 8656, 7344, 5596, 148, 3423, 4232, -6616, -9478, -6741, -2536, -2557, -2909, -12248, -10678, -2257, -3309, -6893, -8454, -4363, -5213, -10468, -8156, -4302, -5634, -8140, -12340, -12375, -2172, 932, -2581, -3180, -5303, -2194, -1573, -3644, -4519, -4474, -1076, 2892, 3005, 7074, 7897, -2338, -9392, -7394, -2676, 3682, 402, -7899, -9356, -12054, -13011, -9643, -3416, -2323, -4029, -910, -5356, -5584, -3465, -11685, -6266, -4649, -5507, -6975, -3789, 1374, -1430, -8821, -1432, 2373, 1126, -2841, -632, 4142, 6846, 7180, 2859, 2703, 3122, 1734, -1638, -6808, -1869, 3124, 1082, 7389, 6318, 1623, -6204, -14189, -16532, -12341, -43, 7091, 2580, -3049, -1876, -7070, -8424, -803, 2393, 4960, 915, -9983, -13479]
3832a3479M729O473O242n919k884J931J353K908l748n062K33q01L274J536N036
3817A822L276m879p087J94O831K127l38K229J777L677M695J391n765k602n95o506
3801B47k906L92L798K314L319o843k250J272N114k248n67J150R77j507n18p11
3785A033j747n72j394o28N93L496j388r45m242l133M68J284O831L587L591K83
3769G117k124l712L701p57N13l530n409K218l127m914m831O979O535J601j316
3754a056k472q757l154Q362K78k613J153O901L025j199N168K246j668k371p714
3739c871J211L019K696p17j009K56M151m730j732r57J132L764M789O420m388j1129
3723a095q45J85j014Q81J302J619J727K210k551l491k042K877J355K031K376L867
$$ y = [-13479, -8750, -2277, 3965, -1954, -4838, -2907, -1554, 1354, -2394, -7456, -7223, -8024, -4750, -3214, 1822, 5098, 219, -6868, -6674, 157, 2284, 1946, 4175, 5952, 9629, 14324, 15715, 9950, 7348, 6753, 247, -2659, -2267, 1531, 3845, 7164, 321, -1929, -657, 4457, 2209, 1642, 2792, 3769, 2262, 1744, 1033, -714, -1286, -2680, -3308, -2715, 781, -607, -1552, -5794, -8927, -8459, -7175, -344, 3243, 6834, 7117, 4993, 1281, 4982, 4225, 4738, 1208, -4201, -1983, -5110, -10024, -14855, -7876, -1341, 260, -1056, -3528, -12285, -15439, -7077, -6799, -9412, -8259, -1358, 1667, 468, 5636, 7882, 6214, 3843, -3871, -2660, 359, 3055, 2338, 1329, 1585, 5736, 1006, -726, -1683, -551, 3213, 8002, 14422, 10034, -1095, -1940, -1755, -2769, -1888, -586, 1033, 2760, 4970, 2419, -1072, -3114, -237, 1118, 3149, 5525, 9392]
3707I392j197o239j372l100j849m231J2194M486m013R4N427k137q801k947N360
3692A067O445o464K94o818J011K548j866J64k633m21j091K631l333M838L095j0697
3676a1230m331Q032M079l281J079l981M16M652Q963L53o74j721r055l131L679
3661f151K069j618J479L780J596l304n24M270K261p03J170l167j679p014j730
3646i265M530M252J735L373j923K471p52r471N79Q499r06r287m949P332O240k067
3630C91l975k388n079k193N256J378O605M560m938k175l533o50q85J314M182K921
3614G91j225k39j872J878O501K9m014M006j932l002r98j927K273M61l60l535N01
3597b664r30J634Q782m465o447q979N817N275m374L317J172k219L456l003J135
$$ y = [9392, 8195, 1956, 584, -2516, -4365, -8596, 3598, 8084, 4071, 4165, 9592, 7455, -1346, -4293, 1067, 7512, 1048, 1342, -5476, -4465, -1917, -3783, -3619, -6252, -6673, -7764, -5133, -8466, -3628, -533, -11230, -15561, -7529, -3450, -6731, -5652, -9633, -9217, -4565, 4398, 4751, 4077, 2356, -6699, -9830, -6151, -4082, -5700, -4221, -441, 1155, -2149, -2673, 1597, 3858, 3155, 4325, 1158, -521, -7535, -9265, -4735, -483, 1252, 4625, 2702, 5173, 4421, -5050, -4471, 4028, 3122, -6165, -11114, -3782, 2458, 391, -3584, -5972, -11051, -13244, -7988, -6610, -5, 4555, -383, -2558, -6091, -6741, -7626, -6312, -2130, 791, -434, -673, -2545, -667, 5834, 5863, 1849, 5855, 3923, 921, -77, -2004, 269, 730, 370, -3165, -2664, -3594, -1960, 6822, 2357, -4090, -13069, -7252, -1977, -6351, -3034, -1862, -4081, -625, -3628, -2493]
3582b493N082m640K969N836j532n984m375m750j926Q754j74P028Q781n612r576
3567b612m287L100K88m050l937K023J0369M168r4o50j372q249K955J147n033j509
3551g743L759N390R29P63j628J682N890l153m32L521M87k316J621r21l281L826
3535H394P16k149k088K392o08n653j643K362k333M040r82J927m779O715J30l092
3519C349J927L35k428p521L012M694K221l637l940M20j241k469q68P851P363L553
3503A2621m074M538n019p191p820l287Q211k14L95q580J99M794o525j719L951
3488i720l474q88K972K577J371J198M125R28k825k177Q59j990L127P068P341N600
3472A6092n16n136j2144r751j917j021M551N157k003j673k966P597N682p28n605
$$ y = [-2493, 2589, -2051, 918, 6754, 5222, -762, -5137, -9887, -11813, -3059, -3233, 3795, 12576, 6964, -2612, -6899, -3799, -3511, -7561, -11498, -9475, 894, 5062, 4968, 4318, 2946, -5303, -2348, -1201, -6234, -7743, -3984, 1406, 2335, 3098, 1470, 3152, 9042, 5889, 5457, 8978, 9465, 7149, 8770, 7849, 4568, 8394, 9110, 6961, 4873, 7265, 6657, 1004, -639, 1723, -610, 3430, 2448, 4375, -404, 6311, 6441, 3349, 5276, 5611, 3183, -4338, -1326, 3368, 5589, 1952, -1988, -1568, -2809, -5278, -6146, 1705, 9068, 12621, 8547, 13085, 8066, 875, -6945, -10232, -2021, -2235, -1840, -10420, -10221, -5427, -11952, -13671, -9720, -13194, -14082, -11110, -8533, -7162, -5964, -1839, -911, -3736, -5913, -5054, -7044, -3917, 3151, 10492, 16092, 15576, 10440, -1704, -11455, -13372, -14393, -9842, -4685, -6688, -8361, -11327, -3730, 1952, 1224, -4381]
3457d381l810J209L206l216r04R64O32m690P24K56L888O589L878k422n580k145
3441e802k189k693J127k237j331j982m34O628L376o219k709j362k5O80L121J512
3425a0539N294j472k483P61j395N279L589K61J972K409L998k490L443k070j759
3410D798r815m564Q13m950O72M422N028l112M828K262j194k906K155n85L448m84
3394H16r973k845L511j767L42o76L282m584N026N554P5n584K925K033K909K085
3378C129j569K376L783K062n723n390n093r749j616J2351P672N583M050j28k001
3363I737j285l796m564K659K081o050J476L704j950m39J723K190k950j4373p694
3348a9531r71N933M421j373L73M613L089Q42m510n786J672J948J014j806l142
$$ y = [-4381, -8191, -6982, -3776, -6992, -7896, -6932, -6300, -10990, -10266, -10010, -6122, 467, 4345, 1923, -3657, -5802, -7991, -10684, -9557, -11794, -13125, -15107, -15541, -8913, -5537, -11756, -14465, -15827, -15852, -15172, -12051, -10539, -5245, -6717, -9200, -8439, -9834, -4555, -966, -705, 1267, 3676, 7674, 5184, 8627, 6557, 4798, -5017, -9581, -8768, -13718, -13046, -8624, -3596, -6708, -1880, 382, -812, -3718, -1563, -2148, 1300, 816, -9157, -12002, -8491, -10258, -9916, -10592, -7310, -11894, -6868, -1314, -1239, -6823, -3898, -1865, 1044, 3129, 1560, 3936, 7719, 9781, 4058, -1332, -6425, -16174, -17790, -5439, 2233, 7816, 11866, 11738, 9737, 8452, 4656, 92, 2751, 4832, -1218, 258, 3962, 2012, 1573, 3296, 5486, 2536, -11837, -19531, -20502, -14569, -10148, -11521, -11148, -6535, -3446, -2604, -7114, -12900, -11228, -9280, -8266, -10072, -13214]
3333a3214J422j328K572M407r27O086R869K635P49p989p255J520j987r46J186
3318c200R54L319R446J561n806m512L185K200n79O14m786k592j388K473M741J570
3302G200J52m129Q6l443K263N131K616j833k020n066l783N231K123K815j878o677
3286a212M795N541j317k154k847k782L27P13M427l394l098k15j76L663R72o092
3270b849m25L351Q129J240k820n059J274P07k794M482Q25k347p691K928Q294M390
3254A1635n650k726k834K269J353j000j490o27l751p590K613R119k784o233m443
3239a2139n73N64K019M947N390R20P71J28L944L349J828l454P92o973p035K915
3223b607P865L6l005J805k74k255J526k426n492q66l35n613l50K694N226J092
$$ y = [-13214, -11792, -13120, -10548, -6141, -7068, -982, 8887, 11522, 12271, 4282, -2973, -1453, -3440, -4386, -3200, -2246, 1073, 10519, 12080, 6274, 1762, 4947, 7147, 6568, 7182, 2396, -196, -1584, 889, 5630, 7200, 7352, 3223, 3309, -134, 2129, 7260, 9876, 8043, 6023, 957, -2826, 2405, 4528, 7343, 5465, -1212, 3583, 9124, 7807, 5653, 2806, 24, 351, 1064, 5491, 2097, -1001, -1216, -1392, 2271, 3243, -2849, -3274, 77, 8206, 9446, 6626, 1567, 2841, 3548, 754, 5236, 6061, 3714, -3977, -1049, 7245, 11635, 5985, 3259, 425, 2694, 4047, 3047, 1557, 930, -2821, -10411, -7798, 1321, -1463, -7696, -12139, -12712, -12148, -10129, -5182, 208, 1128, 1899, 2027, 5971, 9320, 11148, 7694, 8486, 1513, -5522, -2607, 5258, 5294, 2289, 4094, 3820, 1565, 3091, 665, -4827, -5693, -6028, -11641, -11991, -9297, -4071, -2979]
3207b979m194P02L507k001n125J481j323M487L173P329L652p096m648J848M022
3192B835m987l133J997k553P065L338q14L375K60q157m574K238L350m43O278L148
3176I223k879k4k813j304l004O397K565l563k774R30J423k864k790k471j282k593
3160g823p29l487k516O101P619L474J577M527J567o85o141k801j479O780k197
3145C787R102M578L34k282p761q080l248K974M557R36n696o434j733j392L534
3130f824P135O145o226k480O896P55q91K293K803r98k392K781K925N3q061n277
3114a363n255n07j278k528L858J827L240R96m816k268L656L706q73J406J420R8
3098A319J882l842M263j660m884P865L520k736m619m56p681l214N766k501Q397
$$ y = [-2979, -7173, -6471, -2964, -4965, -10090, -8609, -9932, -5445, -2272, 5057, 8709, 1613, -3035, -1187, 2835, -2152, -5285, -3288, -5841, 1224, 4562, 3748, 7123, 7383, -774, -5348, -3110, 240, -203, 6075, 9223, 6344, 6320, 3507, 2203, -801, 5596, 8161, 4598, 1824, 2754, 4177, 1313, -1477, -3948, -5230, -7823, -8552, -12039, -14555, -8454, -835, 2639, 4216, 8743, 10310, 9625, 3484, 683, -796, 5984, 3787, 12889, 17467, 17801, 15519, 7758, -322, -3570, -596, 3961, 4897, -799, -7233, -8966, -10358, -6824, 311, 6456, 230, -2250, 4646, 5401, 4510, 6803, 9606, 8608, 6216, 8997, 11922, 11975, 3914, -1363, -6618, -7125, -8403, -10931, -7073, -5246, -2006, -1010, -5826, -8094, -4438, -732, -1605, -199, 1221, 1319, 3201, -641, 3622, 1962, -2922, 4943, 8463, 5727, 1108, 652, -7029, -10243, -4477, -6978, 1419]
3083A419J0638m64o450l698L603L535n049m979J760R21j336l043m756O64L065
3068d170O507L739o147J825R650k042l974N014o34k840l322o338q954k754J3050
3053a390Q767n133n308l12q98P161K64o681m665M895O579K304o237m002R98L222
3037d36j472N37K209M388o388r740K076N533K893q76j029l666J815R791k223K183
3021E595m320n435l574l766j706j003L855L826M480J236K717j45k845j010k293
3006d388L064L722j73L155R02k318n241M31J54r167m361O61J520K209k897P646
2990e081M171l088l201K444k060K933j068k461L349J849j065J363j276M907M014
2975E730m626q324o367p61j247R233J585n894K030L779P71L153j894R2N92n33
$$ y = [1419, 12057, 11593, 5143, 1445, 5048, 8583, 3534, -1445, 315, 1236, -100, -3143, -7899, -7235, -4170, 2337, 6076, -71, 1754, 11404, 9362, 5388, 10402, 9768, 6928, 3606, -2732, -11686, -14440, -1390, 7377, 2244, -3064, -3376, -4274, 2887, 3151, -3530, -8195, -3300, 3279, 5583, -654, -4656, -3658, -436, -1908, -1371, 838, 5226, -1162, -10902, -8826, -3293, -400, -1276, -2305, -5971, -4156, 5635, 3412, 5595, 1275, -4160, -7734, -11500, -13206, -14209, -10354, -6528, -2048, -812, 1905, 1760, -1085, -2095, -4388, -1324, 2398, 2225, 5380, 6282, 3964, -1277, -846, -692, -9859, -14220, -13559, -12039, -9830, -12727, -5081, -910, -3998, -7199, -4755, -6815, -3882, -4950, -7411, -4062, -2213, -3278, -1915, -3191, 1716, 5730, 1104, -7220, -13587, -14348, -15595, -6362, -4777, -10671, -8641, -4862, -4091, -938, -2832, -2740, -2148, -2681]
2959b681o57j715n727O547J1582j32l037l658q36N73K17k287P132m541n286J236
2943c270N955M66M147J931m951m196L29L809P940k362n875l118l511L243J132
2928A669o577q46O739K821M397m450J001M513L98n168m618o524j085L241j57j37
2912d783m43j529m68O461N765J325l638m464j388k702P53K276m223L42L444N828
2896B556n37j199j274l593M827M028p5j882M807k789j983j379M841L875l324k829
2880D070M593n175k034j301k004l026l259J359J709L392K17R95M045k962J733
2865B352j484J683N21k864O523j212p831K734K088j949O043L493m918r649q55
2850e325L033m966K266M204m187J116L454M179L782K23P46l18j960k932p953P5
$$ y = [-2681, -3338, -5053, -10780, -4233, 7349, 7217, 4180, 522, -314, 259, 476, -1811, 5321, 780, -4506, -3270, 2685, 3151, 7298, 9229, 4278, 82, 411, 4220, 12160, 9798, 3923, 805, -2706, 537, 1669, -4908, -5754, 985, 3806, 8203, 3753, 4754, 9267, 9665, 4497, -121, -6645, -7730, -4489, -4646, -4783, -5226, -6755, -7223, -762, 5003, 6328, 2690, -1774, -3162, -5864, -5111, -2835, -7058, -6716, -3272, 2556, 2019, 820, -454, -4047, 780, 4808, 4733, 2851, 7658, 4869, 2886, 1507, 6348, 10223, 6899, 4070, 8663, 3488, 1454, 153, -1851, -4877, -8136, -6777, -5068, -1676, -1459, -464, 3581, 619, 2352, 868, 2551, 3072, 208, 6731, 5519, -2312, 422, 2510, 561, 6604, 10097, 5179, -4470, -5325, -2292, -7258, -4992, -788, -4975, -3859, -405, 3774, 7556, 7779, 8525, 8207, 6247, 3315, -4638, -4563]
2834d563K798l430j622j046r64Q792N403m812j871K702l873j736k164O624O368
2819F606q36n21k418j710P817K659p587o777O835N923k95r100k910P334O714n20
2803A1214k186m719j2533k178R053o526p922L071N697O802N43l838p506o578K537
2788a5069P376J3379J868m015j2407l620Q148L355K781k743j463M681J681K07
2774D159K88K560K790m106j0373M446j310l710K927Q71M028M75m950J323Q344
2759G762O693l336p604k292K189j515R14M935k460j506L157K568M18Q3j308r02
2743G796Q81l149o110j512J976L780Q71l983o817n07j622p230J152R670O176k748
2727a376J0654P321k361J516j307p417n520m938j834K81M920L56J84k322k266
$$ y = [-4563, -1765, -5195, -6817, -7863, -8827, -35, 5368, 556, -1315, 1387, -2486, -4222, -6386, 238, 6606, 5770, 5249, 2831, 1121, 8938, 11597, 4010, -2767, 4068, 9991, 9696, 596, -2314, 5020, 11734, 11214, 9028, 4309, -8224, -10402, -1349, -7875, -15797, -12726, -7029, -227, 316, -3522, -11028, -17606, -15069, -7693, 5686, 7554, 3539, -8868, -12488, -4340, -985, 1796, -947, -2410, 2271, 3952, 4159, 4447, 7007, 9797, 5691, -4682, -236, -1546, -5256, -2329, -1458, 2570, 3045, -1905, -582, 7762, 14455, 11119, 3515, 1223, 3412, 1897, 2811, 7746, 5286, 3780, 6937, 9505, 9923, 10006, 8698, 7796, 8677, 5528, -582, -2094, -118, 3662, 4533, 550, -6267, -6774, -8396, -15626, -14474, -4804, 1372, -1376, 9278, 16599, 14238, 15754, 14447, 7030, 1510, -3428, -5262, -4981, -61, 295, 479, -1843, -4109]
2712d109M36l12k099J0691L361K436k681l397j652j188m169l206N547P09k651
2697b284m707K831J75M99J41L714J540k968J625l353P89l042k152K479L113K680
2681A080M92J96N01q482l403K50r72O605O549O202L085J192n48q718j959q809
2665f739o309K937J894L696j216l408L030M02m108K534k092K245O493J541k249
2650a349N409l124n087J663P405O309k570j137l922k036l75o82L474n458q281
2635i761k799N295J703M198K925N308J78p159k44J855n11R39N272k566j2079p137
2619a4583N062j368Q447N095k331L452q40q328n931P099J694L673R826k289o978
2604A700m47m55p539n866M279N588N113J539K141L783M262J510n941K453p3j2494
$$ y = [-4109, -3673, -3985, -6084, 4607, 7968, 10404, 7723, 4326, 2674, 1486, -2683, -5889, -342, 367, -2284, -6991, -4160, -3985, -3486, -3345, 369, 1909, -1059, 566, -2787, -1998, -5040, -7192, -4713, -1600, 1080, 1572, 1768, 2269, -6213, -9616, -9366, -10338, -3733, 2816, 9018, 12103, 13295, 12747, 4029, 2070, -6739, -13048, -10111, -8217, -4521, -5737, -9145, -6115, -5713, -9821, -7287, -9379, -7134, -641, 900, -1349, 4060, 936, -4151, -2488, 4917, 11226, 8656, 7519, 3597, 1561, 1186, 504, 3978, -1480, -9761, -12560, -7265, -5562, -1364, 1561, 6869, 7047, -112, -356, 1499, 988, 1927, 7199, 4633, -7446, -14583, -9521, -10889, -2442, 2653, 322, 3774, 2934, -5394, -11325, -4226, -2532, 1141, 10967, 8678, 1700, 1253, 798, -6741, -12607, -8328, -2740, 2373, 3912, 6053, 9836, 14098, 15608, 9667, 12120, 12047, -447]
2588d47k834L898k724n880M892O61l833n476P549L582M327M095L24m134n073n39
2572a612N186N832M090n29m929j820n721l374K033l97n342k772K121J424k041
2557g851M366r67K894j179j97P019k870K777n145m377L608M131j905r029J025
2542g700K116j532q40n785j358L620j675O464K531o643J150N391K534J055m070
2527d742o03Q276J432o873J66j535L656r12o753m122L597m30M50O237N467M64
2511C775M141J895o684m253l181j832j296J35K964l202J215Q510J19p83k776j820
2495c073r102m682L067L312L693P212J307m001l756l69k493K196M978L929L448
2480E666L136j89L434J689K298p095n117j1406j556K994j891n8M137K121j72K305
$$ y = [-447, -3281, 617, -2107, -7987, -3095, -2434, -6267, -11743, -4194, -612, 3715, 7810, 8134, 4000, -1073, -1612, 3574, 9406, 13496, 12967, 8038, 6218, 497, -2877, -844, -1241, -6583, -9355, -7234, -5810, -7851, -3485, -4452, -1558, -2737, -2934, 4085, 1215, 3992, -1153, -5530, -1922, 2209, 304, -8725, -7700, -5584, -7116, -7956, -13741, -15099, -11479, -13154, -6690, -4159, -10802, -9652, -4261, -1727, -672, -4742, -5345, 2931, 4363, -2510, -2344, -3879, -223, -1135, -7888, -12010, -8413, -8843, -8393, -2156, 3311, 3775, 7916, 9811, 3127, -1126, -4307, -6139, -7435, -7300, -4336, -7538, -6323, 2187, 2306, 1523, -1253, -3073, -12175, -16857, -13790, -10478, -6785, 427, 1734, -2267, -6023, -6392, -8885, -6689, -1711, 2218, 5666, 8802, 8613, 12047, 13736, 16034, 8939, 3822, -7584, -9140, -6146, -8037, -8095, -3958, -1837, -2009, 296]
2464B96n231L985P154P76k043o18m073l435l632j728K602K058j656k92P843k994
2448i88n187M08J359l160K93l939K931k156P75l710K715O400L681N56k391m006
2432f419K608N289K64P92L13M966O36L371j508n961L41k093j0559J300K812K79
2416c569L905k823l442O390K89k188J674Q881K288q288p440m700k588J84R31K282
2400h214N147K890M522j676m981J424P822J399m135K154l709N050k022J551N36
2385G758K978m05k633j863m557J70P35L225n000j819R022J550p560k060j242L779
2369B078L322M41m267L907j329n57O43K189k059J65j031O71k455m214m65n128
2353h089p98K511L875K27q89j50M14K551L776k85P63p51m603N039O673j500j195
$$ y = [296, -4935, -950, 6204, 6980, 4937, 4319, 246, -3189, -6821, -8549, -5947, -3889, -5545, -5837, 2006, -988, -6175, -5767, -4408, -7568, -7275, -11214, -8283, -10439, -9664, -13374, -10659, -4259, -578, -22, -2413, -6419, -3811, 1478, 1742, 2534, 2847, 7813, 8449, 11820, 10312, 4351, 4692, 2599, -7960, -6660, -3848, -3569, 336, -2487, -5929, 461, 750, -1438, 236, 9117, 11405, 3117, -4323, -9023, -11611, -11427, -10496, -8214, -3067, -177, 4345, 2669, -2312, -888, 6934, 8333, 4198, 6352, 2643, 7693, 5671, 7222, 7758, 10736, 10331, 7698, 5835, 1278, 1448, 2183, 5408, 408, -1411, 7611, 9161, 1601, -459, -1701, 2078, 5400, 5841, 1574, 5481, 4152, 3595, 4238, 6427, 4368, 4533, 3502, 4173, 1718, -2496, -2961, -8089, -8887, -6376, -2501, -2274, -3163, -3313, -2899, -348, 3428, 3143, 3906, 3155, -1448, 3591, 10264, 8764, 7569]
2336G569k619o681k1m891J21O283L580O09l168n413L577J305K011n406J651M15
2320a078J071R94o505N212K678l328m803k988l940M96Q180Q81N62M680l983L339
2304A468n372o451j622Q061N744l271p323n653O440R676J229j241j697n9L700
2289C629L830J39m934J227K572k508k348j899l045m320J473L297R541N932m394
2274H192m881J546K687j658q069l251K850K87J868J692j275k892l054L618k721
2259e061M995j701j0822k305J071O951L175J730m897n845K17R263J716K34M394
2244C115L374l608j851J647K172r70J557J409r632L297M639l909m999n8r504l884
2228a7205P846P103K238J919l042M460K164J740M632l203j3743j0295M720M884
$$ y = [7569, 4950, -1731, -1752, -6643, -6522, -239, 3341, 3950, 782, -4631, -1054, 251, 2262, -3144, -1493, -1078, -7, 987, -5518, -306, 2372, -956, -5759, -8747, -12687, -12191, -4011, -3130, -2568, 2112, -1871, 1468, -3904, -10355, -11977, -3916, 1828, -1443, -8766, -14419, -7979, 1697, 2926, 1685, -12, -71, 3629, 7459, 7598, 2664, 3891, 6463, 3955, 1607, -292, -3337, -7657, -6184, -2887, 6654, 12586, 8192, 3311, 4857, 7544, 5886, -2183, -5434, -2584, -2297, -429, 1263, -12, -2904, -5958, -2340, -5061, -66, -1767, -12589, -14894, -13823, -6872, -3697, -1967, -6864, -12709, -12492, -3229, -1513, -1279, 3115, 6489, 2881, 1030, 2677, 4849, 3879, 5436, 6845, -2787, 510, 5149, 1240, -3759, -3817, -13321, -17205, -9359, -2256, -18, 1901, -1141, 3319, 5483, 7223, 11855, 8652, -5091, -15386, -10666, -5782]
2214e782n481K414M952L247O73l465L069O408k06m102M004m000p633j211J606
2199e507J029M309k043l861j539J964j827j31P280j412m508k929m318Q71M27J124
2183a1071N779O688K646K43n011k741R60J87m17m522L531L395n70j151J28j288
2167c214M401L373j198k756L553O39l166j040n119l698j992N910k404k349M288
2152d772j379M022Q084j999n134J257K298O232N025n906n881k444l3L493M93l125
2136B31l340N276n792m481O917K452k64o545K169P277K17J022k052L060n53p286
2120a692m84N170j662l24K244Q79k038j72k354q16m109j252J655K455k845P926
2104B581J040m16J091j680r94m680j123j122M784K726N01L929J517l053k736j910
$$ y = [-5782, -11263, -8849, -3897, -650, 23, -3442, -373, 6035, 5829, 1727, 5731, 1731, -5902, -7113, -5507, -4478, -169, -2212, -6073, -7612, -5648, -7475, -7606, -326, -1738, -6246, -9175, -13493, -12622, -12195, -11071, -5292, 1396, 4042, 4285, -726, -3467, -2507, -2320, -2737, -7259, -3728, -333, -903, -2054, -1926, -3214, 1187, 4560, 3362, 606, 4159, 4798, 1632, 592, -4527, -8225, -10217, -4307, -6711, -9060, -4772, -6151, -2129, 5955, 3956, -1178, 79, 2377, 8609, 13634, 7728, 1847, -597, -630, 2863, 3356, 231, -3109, 2167, -3625, -8106, -1189, 1263, 999, -5546, -3377, 3900, 4117, 5139, 3087, 6147, 5594, -1692, -2176, 2994, 1332, 1008, 3252, 4131, 2093, 1921, -433, -1249, -5358, -6610, -4955, -2500, -5345, 2581, 3621, 3205, 4296, 2616, 1622, -3058, -4181, -5303, -519, 2207, 2708, 6637, 8154, 5101, 2365, 455]
2088D55p40J473K174r253o668M453J072K972J0161j26m2k98m371k603k621J749
2072b213K98k788o008l635K858p32J270J084L621K140M138J25l259q62O095M508
2056F640J730k953q662m129k371L94j801K381L913O739L747l638l822N432n23
$$ y = [455, -285, 1188, 3362, -5891, -12559, -8106, -7034, -4062, 6099, 5973, 5931, 5633, 1262, -1341, -3962, -2213, -1915, -4703, -10711, -14346, -11488, -12220, -10950, -9866, -6245, -4105, 33, 158, -3101, -3963, 2132, 6640, 8370, 5417, -3245, -7374, -9745, -9351, -11152, -8771, -4858, 1881, 5628, 1990, -1832, 3600, 3077]
$$ [...]
##END NTUPLES=NMR SPECTRUM
##END=
