##TITLE=Analysis number 315712
Compound Code ss 00044
Project Code adrs
Chemist Name mariap
##JCAMPDX= 6.0         $$ Bruker NMR JCAMP-DX V2.0
##DATA TYPE= NMR SPECTRUM
##DATA CLASS= NTUPLES
##ORIGIN= Bruker BioSpin GmbH
##OWNER= NMR
$$ XWIN-NMR		Version 3.5
$$ Tue Nov 29 14:43:26 2005 GMT Standard Time (UT+0h)  MAYBRIDGE\NMR@NMR_250MHZ
##.OBSERVE FREQUENCY= 250.131544655141
##.OBSERVE NUCLEUS= ^1H
##.ACQUISITION MODE= SIMULTANEOUS (DQD)
##.ACQUISITION SCHEME= undefined
##.AVERAGES= 16
##.DIGITISER RES= 18
##SPECTROMETER/DATA SYSTEM= dpx250
##.PULSE SEQUENCE= zg30
##.SOLVENT NAME= CDCl3
##.SHIFT REFERENCE= (INTERNAL, CDCl3, 0, 16.522)
##AUDIT TRAIL= $$ (NUMBER, WHEN, WHO, WHERE, WHAT)
$$ ##TITLE= Audit trail, XWIN-NMR		Version 3.5
$$ ##JCAMPDX= 5.01
$$ ##ORIGIN= Bruker BioSpin GmbH
$$ ##OWNER= NMR
$$ C:\u/data/dgb/nmr/ADRS/13180/pdata/1/auditp.txt
$$ ##AUDIT TRAIL=  $$ (NUMBER, WHEN, WHO, WHERE, WHAT)
(   1,<2005-11-29 14:42:35.62 +000>,<MAYBRIDGE\NMR>,<NMR_250MHZ>,
      <created by zg, POWCHK disabled, PULCHK disabled
       configuration hash MD5:
       62 19 C7 07 E1 42 D1 B7 37 6C 3D D0 77 39 F9 E6
       data hash MD5: 64K
       26 55 F1 B3 1C F4 0C DA D1 D8 BC AF 04 8C E1 8E>)
(   2,<2005-11-29 14:42:58.08 +000>,<MAYBRIDGE\NMR>,<NMR_250MHZ>,
      <Start of raw data processing
       ef LB = 0.3 FT_mod = 6 PKNL = 1 SI = 32K 
       data hash MD5: 32K
       1C 12 B2 1F 00 BC 56 9A 8A D7 32 55 92 75 1E D6>)
(   3,<2005-11-29 14:43:01.34 +000>,<MAYBRIDGE\NMR>,<NMR_250MHZ>,
      <apk 
       data hash MD5: 32K
       A6 90 F6 37 FB C9 2D 8D 59 9B EB 9D 43 0C D0 7F>)
(   4,<2005-11-29 14:43:02.67 +000>,<MAYBRIDGE\NMR>,<NMR_250MHZ>,
      <abs ABSG = 5 
       data hash MD5: 32K
       11 B2 98 73 64 0F C9 8A FC CA FA 0D D0 67 22 11>)
$$ ##END=
$$ 
$$ hash MD5
$$ 5E DA CD 2A 15 61 C5 87 C7 86 42 CD BC C0 EA 61
##$RELAX= 
##$RELAX= 
##$RELAX= 
##$RELAX= 
##$RELAX= 
##$RELAX= 
##$RELAX= 
$$ Bruker specific parameters
$$ --------------------------
##$DU= <C:\u>
##$EXPNO= 13180
##$NAME= <ADRS>
##$PROCNO= 1
##$TYPE= <nmr>
##$USER= <dgb>
##$AMP= (0..31)
100 100 100 100 100 100 100 100 100 100 100 100 100 100 100 100 100 100 
100 100 100 100 100 100 100 100 100 100 100 100 100 100 
##$AQSEQ= 0
##$AQ_mod= 3
##$AUNM= <au_zg>
##$AUTOPOS= <10 >
##$BF1= 250.13
##$BF2= 250.13
##$BF3= 250.13
##$BF4= 250.13
##$BF5= 500.13
##$BF6= 500.13
##$BF7= 500.13
##$BF8= 500.13
##$BYTORDA= 1
##$CFDGTYP= 0
##$CFRGTYP= 5
##$CHEMSTR= <none>
##$CNST= (0..31)
1 1 145 1 1 1 1 1 1 1 1 1 1 1 1 1 1 1 1 1 1 1 1 1 1 1 1 1 1 1 1 1 
##$CPDPRG= <>
##$CPDPRG1= <>
##$CPDPRG2= <>
##$CPDPRG3= <>
##$CPDPRG4= <mlev>
##$CPDPRG5= <mlev>
##$CPDPRG6= <mlev>
##$CPDPRG7= <mlev>
##$CPDPRG8= <mlev>
##$CPDPRGB= <>
##$CPDPRGT= <>
##$D= (0..31)
0 1 0 0 0 0 0 0 0 0.06 0 0 0 0 0 0 0.0002 0 0 0 0 0 0 0 0 0 0 0 0 0 0 
0 
##$DATE= 1133275353
##$DBL= (0..7)
120 120 120 120 120 120 120 120 
##$DBP= (0..7)
150 150 150 150 150 150 150 150 
##$DBP07= 0
##$DBPNAM0= <>
##$DBPNAM1= <>
##$DBPNAM2= <>
$$ [...]
##$SUBNAM7= <"">
##$SUBNAM8= <"">
##$SUBNAM9= <"">
##$SW= 20.6930455092707
##$SWIBOX= (0..15)
0 0 3 0 0 0 0 0 0 0 0 0 0 0 0 0 
##$SW_h= 5175.983436853
##$TD= 65536
##$TD0= 1
##$TE= 294.16
##$TE2= 300
##$TE3= 300
##$TEG= 300
##$TL= (0..7)
0 120 120 120 120 120 120 120 
##$TP= (0..7)
150 150 150 150 150 150 150 150 
##$TP07= 0
##$TPNAME0= <>
##$TPNAME1= <>
##$TPNAME2= <>
##$TPNAME3= <>
##$TPNAME4= <>
##$TPNAME5= <>
##$TPNAME6= <>
##$TPNAME7= <>
##$TPOAL= (0..7)
0.5 0.5 0.5 0.5 0.5 0.5 0.5 0.5 
##$TPOFFS= (0..7)
0 0 0 0 0 0 0 0 
##$TUNHIN= 0
##$TUNHOUT= 0
##$TUNXOUT= 0
##$USERA1= <user>
##$USERA2= <user>
##$USERA3= <user>
##$USERA4= <user>
##$USERA5= <user>
##$V9= 5
##$VALIST= <valist>
##$VCLIST= <CCCCCCCCCCCCCCC>
##$VD= 0
##$VDLIST= <DDDDDDDDDDDDDDD>
##$VPLIST= <PPPPPPPPPPPPPPP>
##$VTLIST= <TTTTTTTTTTTTTTT>
##$WBST= 1024
##$WBSW= 4
##$XGAIN= (0..3)
0 0 0 0 
##$XL= 0
##$YL= 0
##$YMAX_a= 430628
##$YMIN_a= -302819
##$ZGOPTNS= <>
##$ZL1= 120
##$ZL2= 120
##$ZL3= 120
##$ZL4= 120
##$ABSF1= 16.522
##$ABSF2= -4.171173
##$ABSG= 5
##$ABSL= 3
##$ALPHA= 0
##$AQORDER= 0
##$ASSFAC= 0
##$ASSFACI= 0
##$ASSFACX= 0
##$ASSWID= 0
##$AUNMP= <proc_1d>
##$AZFE= 0.1
##$AZFW= 0.1
##$BCFW= 0
##$BC_mod= 0
##$BYTORDP= 0
##$COROFFS= 0
##$CY= 12.5
##$DATMOD= 1
##$DC= 0
##$DFILT= <>
##$DTYPP= 0
##$F1P= 14.0000005364418
##$F2P= -0.99999901652339
##$FCOR= 0.5
##$FTSIZE= 32768
##$FT_mod= 6
##$GAMMA= 0
##$GB= 0
##$INTBC= 1
##$INTSCL= 1
##$ISEN= 128
##$LB= 0.3
##$LEV0= 0
##$LPBIN= 0
##$MAXI= 10000
##$MC2= 0
##$MEAN= 0
##$ME_mod= 0
##$MI= 0
##$NCOEF= 0
##$NC_proc= -5
##$NLEV= 6
##$NOISF1= 0
##$NOISF2= 0
##$NSP= 0
##$NTH_PI= 0
##$NZP= 0
##$OFFSET= 16.522
##$PC= 1
##$PHC0= 85.56358
##$PHC1= 3.336357
##$PH_mod= 1
##$PKNL= yes
##$PPARMOD= 0
##$PSCAL= 4
##$PSIGN= 0
##$REVERSE= no
##$SF= 250.13
##$SI= 32768
##$SIGF1= 0
##$SIGF2= 0
##$SINO= 400
##$SIOLD= 32768
##$SREGLST= <1H.CDCl3>
##$SSB= 0
##$STSI= 32768
##$STSR= 0
##$SW_p= 5175.98343685301
##$SYMM= 0
##$S_DEV= 0
##$TDeff= 65536
##$TDoff= 0
##$TI= <Analysis number 999999
Compound Code 99
Book Reference 9
Project Code 9>
##$TILT= no
##$TM1= 0
##$TM2= 0
##$TOPLEV= 0
##$USERP1= <user>
##$USERP2= <user>
##$USERP3= <user>
##$USERP4= <user>
##$USERP5= <user>
##$WDW= 1
##$XDIM= 32768
##$YMAX_p= 454651159
##$YMIN_p= -472244
$$ End of Bruker specific parameters
$$ ---------------------------------
##NTUPLES= NMR SPECTRUM
##VAR_NAME=  FREQUENCY,     SPECTRUM/REAL,   SPECTRUM/IMAG
##SYMBOL=    X,             R,               I
##VAR_TYPE=  INDEPENDENT,   DEPENDENT,       DEPENDENT
##VAR_FORM=  AFFN,          ASDF,            ASDF
##VAR_DIM=   32768,         32768,           32768
##UNITS=     HZ,            ARBITRARY UNITS, ARBITRARY UNITS
##FACTOR=    0.157963299565203, 1,           1
##FIRST=     4132.6476996994, 0,             0
##LAST=      -1043.33573715361, 0,           0
##MIN=       -1043.33573715361, -472244,     0
##MAX=       4132.6476996994, 454651159,     0
$$ Real data points
##PAGE= N=1
##DATA TABLE= (X++(R..R)), XYDATA
$$ [...]
22027A69755K2029k8510O4374R1681l8551L5221m5487j15571p5431j0393j1563
22016E7554n8900K2800N8008m5563J894K1173n4450j07199L5481Q5647l9868k3263
22004d6686M9538o0210l2034K3422L7600L2182o203J96224n2169q7614n6146J7679
21992A5583K8695M8440m8603l9956J10409l0068J8078l7423j38839M1848M7768
21981A5932n9733m486O7668r3290p5164Q8763R8941o9962j74325J1686N3165K6956
21969a13849Q7900j43537o7142J6861P4851L956j4453j8477j5042O3906P5933
21958d9093n3646j2953k0012P7029M7887P5404n1205N0046P2301o2584j36397
21947f3223n4289k6376M080l4144m3774O0621N2268m4604j22040j4256J03133
$$ y = [169755, 191784, 163274, 227648, 319329, 280778, 315999, 270512, 154941, 79510, 69117, 57554, -1346, 21454, 79462, 33899, 35793, 56966, 2516, -104683, -69202, 16445, -23423, -46686, 2852, -57358, -89392, -65970, -28370, 3812, -2391, 193833, 141664, 54050, -2096, 15583, 44278, 92718, 44115, 4159, 114568, 84500, 102578, 65155, -73684, -31836, 15932, -43801, -48287, 19381, -73909, -149073, -60310, 38631, -31331, -205656, -193970, -140805, -113849, -25949, -169486, -236628, -219767, -144916, -140960, -155413, -173890, -188932, -125026, -49093, -102739, -115692, -135704, -58675, -10788, 64616, 13411, 63457, 135758, 73174, -63223, -117512, -143888, -139808, -173952, -217726, -157105, -104837, -149441, -271481, -285737, -182604]
21936a82604J54575R8470L8302L2882p2537J4359k252r0381m8872j01659L3264
21925a26453m271J7145o2264o5102K688L3567Q2475R5048q636k4986j23504L8602
21913a45691P0744j0526K898O7668l3115j29000q2816O2344Q9264M5797p0252
21902a32685n9439n5777J08483K01441J9354j26960j51185r6079P7853M2175r805
21891a82624l9998L0984J5086N1696K1418J7488M0144J2114k74k542j306j43798
21879a81612N2060R4450l2728j00103l9988J86452J04162p9995k1432J2464Q5759
21868G9489j2394r2685M4653J42985r939j21521J03655m7417n8263L8532J499
21857F8594l8237p09m8719M7093Q746l3868l0888K8091Q0932j3620M8608j3627
$$ y = [-182604, -28029, 70441, 108743, 141625, 69088, 83447, 81195, -9186, -58058, -159717, -126453, -130724, -113579, -175843, -240945, -238257, -204690, -122215, -27167, -35803, -60789, -184293, -145691, -74947, -85473, -82575, -14907, -48022, -177022, -259838, -197494, -108230, -62433, -132685, -192124, -247901, -139418, 62023, 81377, -45583, -196768, -292847, -214994, -172819, -182624, -222622, -191638, -176552, -124856, -103438, -85950, -45806, -33692, -33966, -36508, -37814, -181612, -129552, -35102, -67830, -167933, -207921, -21469, 82693, 2698, -18734, -6270, 79489, 67095, -25590, 19063, 162048, 152109, 30588, 134243, 86826, 28563, 67095, 68594, 30357, 29648, -19071, 28022, 36768, 2900, -27988, 103, 81035, 67415, 116023, 102396]
21845A02396k31190j31529Q2641o838O3332M4388P3576K0963m1549L1175m9725
21834d2360j36238p4640M7269J202N7783J62843j27969q084O6487M9569J8242
21823A4104j110n9701P12L1652o2316p7686O4643J39676l7427j20549q6359Q459
21811a85902m1509j69058J19072J42984o1103J1190k8874r2258O2376J51821R7851
21800F590J6051M5871M0962N805n8322L1448m6074j21897j4442l9586P9972P5924
21788B2302K8851p9890N8873M2589r1767q894j42934J5044O983J70427J33043
21777A54627q3267J675n1844J9179n3241J715Q6500o7337o1270K3538M3917j36397
21765a22205o9569J39800J16221m0448l3766J13328J4741n4604p4544p894j12398
$$ y = [102396, -128794, -260323, -177682, -184520, -121188, -76800, -3224, 17739, -23810, 7365, -42360, -178598, -253238, -205969, -204767, -146984, 15859, -112110, -120194, -53707, -4138, 14104, 12994, -46707, -45995, -14343, -76659, -154345, -89702, 49974, 12547, -108002, -194361, -185902, -227411, -396469, -277397, -134413, -195516, -184326, -213200, -305458, -243082, -91261, 6590, 22641, 68512, 109474, 115279, 56957, 88405, 42331, -79566, -94008, -133594, -53622, 22302, 51153, -28737, 30136, 72725, -19042, -27936, -170870, -155826, -148843, 21584, 154627, 71360, 73035, 21191, 40370, -12871, -11156, 75344, 8007, -53263, -29725, 14192, -122205, -191774, -51974, 64247, 23799, -9967, 103361, 118102, 63498, -11046, -18940, -131338]
21754a31338j02445J33428P6001O6159k1922q2632p6225O7180P3984J29065K5139
21743A56394n5788q8856j69639M6978J12205J6891n8859r5947m7105Q0672N7110
21732d5944K7958k4143P1581P1243j5769k56336n6305j2754O3496J4290L114R1064
21720f8505P128o9434L3433N0743K474L556n4280N7032l9327j2721M7840N9976
21708A7915n2479K1316R7766r9946j03807J9488Q7767o6848J8451k3304J00837
21697A7156l128j6195J9364k240K8916J603n1475j23848J00000N3465j45653N447
21685a16588K7971k9962k1096M6452J03876P1948O5107o8265j68792J3928J7085
21674e8336o3714Q4328Q4186L1483p6020K120Q7715J2929o7303M537k0430R5053
$$ y = [-131338, -233783, -100355, -24354, 41805, 19883, -62749, -138974, -71794, 2190, 131255, 156394, 100606, 11750, -157889, -110911, 1294, 18185, -40674, -136621, -183726, -103054, -45944, -17986, -42129, 29452, 100695, 84926, -171410, -227715, -240469, -176973, -162683, -159569, -68505, -61377, -130811, -97378, -46635, -44161, -40605, -94885, -37853, -77180, -89901, -42061, 17915, -34564, -13248, 84518, -15428, -119235, -99747, -11980, -78828, -60377, -83681, 17156, 14028, -2167, 17197, 14957, 43873, 45476, -5999, -129847, -29847, 23618, -122035, -116588, -88617, -118579, -139675, -93223, 10653, 82601, 147708, 79443, -89349, -75421, -58336, -122050, -37722, 46464, 77947, 1927, 4047, 91762, 104691, 37388, 41925, 21495, 116548]
21662A16548J6045m5326q3014k8455j29335l8451N2417P4753L8630M518l6260
21651e7930l0550J63102Q0412l5841l6855j16796K2833P0203N0005j94641j68156
21640b54214J37423K253n2597O1494n0230p5632O1107N093J949Q397J9144M2691
21628i3122O5870Q6072L2562l6954q1484l4295L2909p4356J4517N0382Q5170N4658
21616A01929j67776j79408j10154k7210Q3293n0464M4174K13044l5191k7071O2151
21605i2683L6083J1656r304Q9197J01132p5707j55053n9812J7862N5760J33206
21594E2337o9151q173O1587O7179r864o0286o3476j05413m3829P2548J40705J8173
21582E2337p3034m3239Q7417J0343O759o8910P283N3068r5342k3946o6048l1901
$$ y = [116548, 132593, 87267, 4253, -24202, -153537, -191988, -139571, -64818, -26188, -21670, -57930, -88480, 74622, 155034, 119193, 82338, -34458, -11625, 58578, 108583, -86058, -254214, -116791, -114538, -167135, -105641, -155871, -231503, -170396, -165303, -163354, -154957, -135813, -93122, -27252, 58820, 91382, 54428, -27056, -61351, -28442, -102798, -88281, -37899, 47271, 101929, -65847, -245255, -355409, -382619, -299326, -349790, -305616, -92572, -127763, -154834, -92683, -56600, -44944, -54248, 34949, 136081, 60374, -94679, -154491, -136629, -80869, 52337, -16814, -24987, 36600, 103779, 93915, 33629, -29847, -135260, -179089, -106541, 34164, 52337, -20697, -63936, 23481, 33824, 40583, -28327, -21044, 32024, -63318, -87264, -153312, -185213]
21570a85213J4936q946J15841J37866l5116m0760j4272m0886M331q9282j4297
21559a55798l407Q4808R1519r2228M1034N1935j00603n7351O7439N5744K4477
21548G569p2844L5724j2313j09470k1378j6374q794P2675L8063k0896o9145O0491
21536a16692R6268l0561j13681r1168Q7171R1600L2600Q736j07350o1813r4974
21525b99864J6721L5106j01021J82521J28009m3938n0599L307M923N9497R6354
21514C1016j8910j25127q4130Q5464Q8623K4057J2723K7902l6256L0832M2036
21503G8230j41831r3587J12807K8518l6101j56n1423j06929L8525K7139M5680
21492i9128K4418J92094m1136n2627l7001j11478J90957L910l0161k8627n6779
$$ y = [-185213, -170277, -179223, -63382, 74484, 39368, -1392, -15664, -56550, -52219, -141501, -155798, -159205, -74397, 17122, -75106, -34072, 17863, -82740, -140091, -72652, -16908, 7569, -65275, -29551, -41864, -151334, -172712, -189086, -197880, -125205, -87142, -108038, -177183, -116692, -20424, -50985, -164666, -255834, -168663, -77063, -44463, -35727, -143077, -204890, -299864, -283143, -248037, -349058, -166537, -38528, -82466, -133065, -129758, -124835, -65338, 31016, 12106, -113021, -197151, -111687, -23064, 993, 13716, 41618, 5362, 36194, 78230, -63601, -157188, -44381, -15863, -51964, -52120, -103543, -210472, -171947, -144808, -99128, -74710, 117384, 76248, 23621, -13380, -124858, 66099, 70009, 39848, 11221, -45558]
21481d5558K4727K0087j35116j33833m1333J32946L4283L5628J6847N1059J04487
21470F4224k249r734q7422n0330k7153M2429j5501k468p6453k0957j31693j9771
21458c37078M2649j5109K4813J25728l3541M6780q403J5216J18960K4518O47O6065
21446G1245J07823p4766j68230N6389O0161r8960K2015K2142J741J59789j3919
21435A45430p0651l4253l1055j62223q7979k7261J6349R35J4133R1883J63374
21424A8682Q7203o7417q1891j27937o0762K03712O6169m713j12631M5250J7762
21413a6573P9476J9921Q7306L7618K7608J4669j96604k31238l8506j3784O6683
21402a63424J48761O9141p9221p625M7437k0877L9774J72468M5427M506P761n1941
$$ y = [-45558, -20831, -744, -135860, -269693, -311026, -178080, -143797, -108169, -91322, -40263, 64224, 61975, 52241, -35181, -85511, -112664, -70235, -85736, -88204, -164657, -185614, -317307, -337078, -294429, -309538, -284725, -158997, -192538, -145758, -154161, -138945, -19985, 4533, 5180, 71245, 179068, 104302, -63928, -7539, 52622, -46338, -24323, -2181, -440, 159349, 145430, 74779, 40526, 9471, -152752, -240731, -267992, -251643, -250708, -236575, -144692, 18682, 105885, 38468, -43423, -171360, -232122, -28410, 37759, 33046, -79585, -34335, -16573, 62903, 82824, 170130, 207748, 235356, 250025, 53421, -177817, -216323, -230107, -163424, -14663, 54478, -24743, -32368, 15069, -5808, 33966, 206434, 251861, 256367, 264128, 212187]
21390B12187j47882n1648j42153j43162Q9984Q1520j728l0755j8303L45O0117
21379i1478K2578j66657m715J97895J01993k7812n6027r681M0174k1621j1704
21368b7055k5670j3425m8610L4055P616j489k5535M0394m1998j11407O3288M7871
21356a01965M3725l1957k0655k6661J860o2169M6373R8551L3977J21061p5882
21345B6258q6186M6157P9866m9773j8854j01683L7209p095j0908p2469o2459m3988
21333b63925J36124J20752J20270M3120j74864q4304L8319J67238J713p0763j3335
21322B0345Q584n1134p8218P3249J00517J61251L8888J876L3587n2315k27422
21311B9208r5078P459L4935J3066Q5515L4573n5962m5779O8558n7209o6511R2649
$$ y = [212187, 64305, 12657, -129496, -272658, -182674, -101154, -102882, -133637, -151940, -151595, -91478, -68900, -235557, -240272, -42377, 59616, 31804, -24223, -33904, 6270, -15351, -27055, -52725, -66150, -114760, -80705, -73089, -74578, -100113, -59719, -101717, -213124, -149836, -101965, -58240, -90197, -110852, -137513, -135653, -197822, -151449, -52898, -18921, 102140, 26258, -59928, -13771, 66095, 16322, -2532, -104215, -67006, -74101, -85009, -157478, -219937, -263925, -127801, -7049, 113221, 156341, -18523, -102827, -64508, 102730, 104443, 33680, 20345, 28929, -22205, -100423, -27174, 73343, 234594, 273482, 275358, 308945, 256630, 29208, -65870, -58411, -23476, -10410, 75105, 109678, 53716, 7937, 76495, 19286, -47225, 45424]
21299D5424M0674L0192m2275j31956o3076N7596L3967J15139N4893N9622o7751
21288A32449j06005j16192L8509q4920P857J72647J8171j39521L6153l5953j43614
21277b20419M048k7682N9352J8477Q7277R5958J3412j96742M9544J0386m8763
21266a55152m3554Q7284O3071k5968j4956Q6751p724L675o5779j04918k1191J8547
21254a79914R6027Q1631L1080J74782p0170k5103j9213k6343J5956K9357q8647
21243A9443L0861n0155o098J10182j82330l4124J91312M2036j0889j43909j58935
21232a92606n4514J22871o7275j57748n5342J53997J2692r319L988k4022K3767
21221b43511J63287J09002l1732q4408j39736m7929J09136o6578k2592O9424R6332
$$ y = [45424, 86098, 116290, 74015, -57941, -121017, -63421, -29454, 85685, 140578, 200200, 132449, 26444, -89748, -51239, -136159, -128302, 44345, 62516, -77005, -40852, -76805, -220419, -216371, -244053, -184701, -166224, -78947, 17011, 30423, -166319, -116775, -106389, -155152, -198706, -111422, -48351, -74319, -89275, -2524, -10248, -6573, -72352, -177270, -198461, -179914, -83887, -2256, 28824, 203606, 133436, 108333, 89120, 62777, 78733, 108090, 19443, 50304, 149, -5949, 104233, -78097, -112221, 79091, 121127, 110238, -33671, -192606, -247120, -124249, -191524, -349272, -404614, -250617, -237925, -247244, -243256, -267278, -243511, -80224, 28778, -2954, -87362, -227098, -275027, -165891, -232469, -255061, -185637, -89305]
21210h9305J07297p0563n1917m980N8495j1526m5870j0441n6325K3354p7411m4480
21198b73672M239M5047k62O2817J30948J0989k515o475K0858l9030k5535N0137
21186b2454j385r0044L3414K9445p5463J15727o941j7923j7625R237l8872k5693
21174a08577l5063J1133K9699M0157J23343P1157j22183q2837O2540L1092K0995
21163D1456N9533p1298j27765k661L0202J8106l0221l0528O5616Q655r4956K3835
21151a10026R3336m0598J261O3310o5309j6144o853p6199J09906J14317J5187
21140H2188N5926L3861r2996j21820k7088J19222k2084j22251P2273r392J9849
21129a2312q048R3069M181k5865n4158J08136L6108L3503l7499j57545k7802q4542
$$ y = [-89305, 17992, -52571, -104488, -109468, -50973, -62499, -108369, -118810, -175135, -151781, -229192, -273672, -269433, -224386, -224648, -161831, -30883, -19894, -22409, -28884, -8026, -47056, -72591, -22454, -23839, -113883, -80469, -51024, -126487, -10760, -17701, -35624, -53249, -44012, -82884, -108577, -143640, -132507, -102808, -62651, 60692, 131849, 9666, -73171, -10631, 20461, 41456, 100989, 29691, -98074, -100735, -70533, -52427, -82648, -113176, -47560, -38905, -133861, -110026, -16690, -57288, -56027, 7283, -58026, -74170, -81023, -157222, -47316, 67001, 82188, 138114, 171975, 78979, -42841, -69929, 49293, 27209, -95042, -22769, -32161, -12312, -20360, 72709, 76890, 51025, -3133, 105003, 141111, 174614, 137115, -20430, -48232, -132774]
21117a32774m2589K0973m700J27467K0671n889k575r644j3187m8106Q9704J65931
21105A65282O0555n9685o3536r6204O4258n0090o136q5196N0681J07714p4918
21094A2725j30472j5767K4078J00138O9459L3720l7838n2710J27827p1470o2043
21083b353J682l1637j18459l3722R1524O5434K3538L107o8952j14941M4452R5066
21071d5261M8217r4873j9322K0190O5006K5411L8265K8279k6029K3240j1764n5757
21059d398k09603j31834J47497O1084P1651N1190q8530P6084M9311j9581J7707
21048B0578L6641J159k2198K3364k5878N8926j8237K1936J24155l8878j18273
21037F3295O1061P5606m6050n6596q8364q0765J8803J34318L2240j10001j9705
$$ y = [-132774, -175363, -154390, -159090, -31623, -10952, -16841, -19416, -29060, -42247, -90353, -649, 165282, 225837, 166152, 102616, 6412, 70670, 20580, 14444, -70752, -20071, 87643, 12725, -117747, -133514, -109436, -9298, 60161, 93881, 56043, 3333, 131160, 59690, -2353, -671, -32308, -150767, -184489, -92965, -27531, -3993, -886, -69838, -184779, -140327, -45261, 2956, -91917, -111239, -91049, -26043, -632, 37633, 65912, 39883, 63123, 51359, -4398, -214001, -345835, -198338, -137254, -65603, -14413, -102943, -26859, 22452, 2871, 20578, 57219, 58378, 36180, 59544, 33666, 92592, 74355, 96291, 220446, 181568, 63295, 124356, 199962, 153912, 97316, 8952, -71813, -53010, 81308, 113548, 3547, -16158]
21026a6158q245M7173m4922k2468K9052J1224Q5941J5525o4730n6233l9299j32884
21014a96024l0088o512L8075m8819l1763L6075L8679J02276N0874J1923l1623
21003f6927n7114J1642M5659L0285M6148N1834P8677m6366m5044r9602k3076j0557
20991h4441O4767N5339p3513k4935J1624L2496M9040q838M3336k8694n8911P8648
20979E5918q5934j24104j08580o1032P5786P3835N210o940J06923J26010q0849
20968b3757r4695q214L7555k5719L7560J63318k94n3326k6430J06072L3774j3647
20956A32197M6544J2347q1952p9435j42407n3272N5769J22917J6323q0561K3998
20945b7532L6996K3903P6684q8726N0247P1853o3463k1744j25180r9967p5156
$$ y = [-16158, -24403, 22770, -22152, -44620, -15568, -4344, 81597, 97122, 32392, -23841, -63140, -196024, -226112, -232624, -194549, -243368, -275131, -239056, -200377, -98101, -47227, -35304, -66927, -124041, -112399, -66740, -36455, 9693, 61527, 140204, 93838, 48794, -50808, -73884, -84441, -19674, 35665, -37848, -62783, -51159, -18663, 30377, 21539, 64875, 36181, -22730, 55918, -30016, -154120, -262700, -323732, -247946, -174111, -168901, -175841, -68918, 57092, -23757, -118452, -126666, -89111, -114830, -77270, 86048, 85754, 32428, 5998, 112070, 145844, 132197, 178741, 191088, 109136, 29701, -112706, -165978, -110209, 12708, 29031, -51530, -27532, 9464, 33367, 110051, 21325, 71572, 143425, 79962, 58218, -66962, -166929, -242085]
20934b42085J31211Q4392M9310K0730j00380j05390J09237R3134j41051j9900
20924a20792N1444m6428R1083q937j14086j06917N5234Q0467J12446J9279k2617
20913i824j24095L4266o1493n5743N7714O6285L6877P6594N0779K2856K0444Q2909
20901A97569K2420k8614r4749l2745j53586m4445R2879K7523L0582Q1330M2175
20890A40339l0601J6890o5733r5566J7026Q4395J2044q9764L0532R1189l8104
20879G2647m5244J5126J5817Q353m0681l6527p0359l2294m3898j4611Q9299J6223
20867f6149O2229m9655j6691k7689N6684L5254N8643J8073k6616K824K9624j6803
20855E9728j1356M6893L629j55409k5461j24475R3277J39182N0322j3984M8463
$$ y = [-242085, -110874, -26482, 22828, 43558, -56822, -162212, -52975, 40159, -100892, -120792, -69348, -115776, -24693, -33630, -147716, -254633, -199399, -118932, -6486, 12793, -9824, -133919, -99653, -161146, -216889, -159175, -92890, -56013, 20581, 71360, 94216, 114660, 197569, 219989, 191375, 96626, 63881, -89705, -134150, -41271, -13748, 16834, 98164, 140339, 109738, 126628, 60895, -34671, -17645, 66750, 78794, -10970, 19562, 110751, 72647, 27403, 42529, 58346, 66699, 26018, -10509, -80868, -113162, -157060, -171671, -82372, -66149, -3920, -53575, -70266, -97955, -41271, -6017, 52626, 70699, 44083, 46907, 76531, 59728, 48372, 95265, 98894, -56515, -81976, -206451, -113174, 26008, 76330, 62346, 110809]
20844A10809j06169j82318L758O1545k2905J522j6291J04861M8669P2436j21082
20833d5165j27641l5316L8759J49691R7096p6011l6041R8975p5930R645N542r1468
20821h7864Q0908N2920k8905M2173K8052o811o3790p7899m5309Q4646k1636j41510
20809a85025N5415K26978m5998n9326Q835j3985l2070j44320Q1294O7595N909
20798c4698m5994r7341O0097O5572k6748K138L4846k4648j04441J02948n5487
20787a23756r7698q132o8881J13286O3136q323k8592j1657m188J0804J06822L8865
20775a8314j02198L4751P8125m0142k952p5496L207K09097J00122J1220l8717
20764A58703o0563l1750l9410Q9019k1671n1863n1588N7221l2448l6142l7537
$$ y = [110809, 4640, -177678, -173920, -112375, -135280, -133758, -150049, -45188, 3481, 75917, -45165, -172806, -208122, -169363, -19672, 77424, 1413, -34628, 64347, -11583, -1938, 3604, -87864, -6956, 45964, 17059, 59232, 87284, 80473, 16683, -61216, -106525, -21879, -43515, -185025, -129610, 97368, 51370, -7956, 879, -13106, -45176, -189496, -108202, -40607, -34698, -80692, -178033, -117936, -52364, -79112, -76974, -42128, -66776, -171217, -68269, -123756, -221454, -229586, -298467, -185181, -122045, -130368, -158960, -170617, -174805, -164001, -57179, -18314, -120512, -85761, -7636, -47778, -50730, -126226, -123019, 86078, 186200, 197420, 158703, 98140, 66390, 26980, 115999, 94328, 42465, -9123, 48098, 15650, -20492, -58029]
20753e8029q60j43514Q4498N2802k1143P7202j0077K8423N6131O4900K7174n2334
20741A05173j93502q325O7376N7591P8544L0224p0585r2444O6983P1422r3384
20730A9073J557k8768J07338N8879q2377p1683n7359J8316k5039M7131p8235L2693
20718e8474K4865l370L4441M8673j3016l8146J16394m2958J892K840n8659p909
20706F573J12535q8513m7496J07258o674K0821m5812j39963p4151O8849K4528
20695f2045J5859P4146P8968j42654m3565O5283J01878P988q5527j15677J6875
20684h8471M6065l373J21724O535j45523l4675j4134J7429M4900m306o4712o452
20672a24993J4556J14895j43989l3072P0551J01356L6660m2474O9177N8311j36697
$$ y = [-58029, -58889, -202403, -117905, -65103, -86246, -9044, -19121, 9302, 65433, 130333, 157507, 105173, -88329, -96654, -29278, 28313, 106857, 137081, 66496, -25948, 41035, 112457, 19073, 20630, -8138, 99200, 158079, 75702, 4019, -53340, -35024, -60063, -12932, -91167, -58474, -33609, -36979, -2538, 46135, 33119, -5027, 111367, 68409, 70301, 73141, 14482, 6573, 119108, 30595, -16901, 90357, 83683, 104504, 58692, -81271, -155422, -86573, -62045, -46186, 27960, 106928, -35726, -79291, -14008, 87870, 95858, 10331, -105346, -88471, -42406, -45779, 75945, 82480, -63043, -97718, -111852, -94423, -49523, -53829, -118541, -124993, -110437, 4458, -139531, -172603, -102052, -696, 35964, -6510, 62667, 120978, -15719]
20661a5719K816L6288N0095L5301J1120M0100L7238n3006j2177p310m0550N0245
20649A34441J0504M4819m1983j9877l3171j8704L2831J30154m4087p0690n5501
20638F8736q8724l5575m8171J2401K6989J2108q1425J4958R6669k1038J49257
20627A06185K2267r453M7235K6601j08345o4943j7029o0113M0878N2182p7225
20616d1760K6169o7593k8968J08087J0856m7561M9123J72807l2736m0492O8996
20605A76928Q646R452j01249j15111l9815L9211k4776N0847M0911R9941K9572
20594A74557o2521j8291O0461p8168l2362r5007k8578o9259m8134K04190J85211
20583A92099j49397q0518L2985n0913O8605N4960m8344j35419o2744N8485m332
$$ y = [-15719, -12903, 23385, 73480, 108781, 119901, 160001, 197239, 144233, 132056, 124746, 84196, 134441, 144945, 189764, 147781, 127904, 94733, 76029, 108860, 239014, 194927, 124237, 68736, -19988, -55563, -103734, -91333, -64344, -52236, -133661, -118703, -22034, -43072, 106185, 128452, 118999, 166234, 192835, 84490, 19547, 2518, -57595, -16717, 35465, -41760, -15591, -83184, -112152, -4065, 6791, -40770, 8353, 181160, 148424, 107932, 176928, 185574, 195026, 93777, -21334, -61149, -21938, -46714, 4133, 45044, 144985, 174557, 112036, 93745, 154206, 76038, 43676, -51331, -79909, -149168, -197302, 6888, 192099, 42702, -37816, -4831, -55744, 12861, 67821, 19477, -115942, -178686, -120201, -124533]
20572a24533K0058M7397O2506N2137o7195n080K36646J5435j34085m8842q5884
20561c1440p0172j13658m8682Q6379N6879P3647n8711j3613J28302M1112M7188
20550I7231j297q1360q4046J01486L7823q0117j41102l9786J5400J7100o6541
20539b25209q883K04500J02927l2231j09357l5876L2056Q7765P2684j9572m1819
20528B6985q4024k4587j43570l024J58465J18388p4193j10227n5259J61705R6337
20517F6996n9281R7866N5349p2540o2940R8630L3242o9631j5941k0149J24684
20506A76285p0578j04166o5675J5488N4163J25815J29845p1480j35900n4007l6036
20495c6246k9698R3978K6063P5671J7777j15419k1985j7352m0481L6116j35777
$$ y = [-124533, -104475, -57078, 5428, 57565, -9630, -14710, 221936, 237371, 103286, 54444, -31440, -101612, -215270, -263952, -177573, -120694, -47047, -105758, -119371, 8931, 50043, 97231, 95934, 14574, -69472, 32014, 69837, -10280, -151382, -191168, -175768, -158668, -225209, -234092, -29592, 73335, 41104, -68253, -104129, -72073, 15692, 88376, 68804, 26985, -57039, -81626, -225196, -228220, -69755, 48633, -25560, -135787, -191046, -29341, 66996, 7715, 105581, 160930, 88390, 25450, 124080, 157322, 87691, 71750, 51601, 176285, 105707, 1541, -64134, -48646, 5517, 131332, 261177, 189697, 53797, -210, -36246, -65944, 28034, 54097, 129768, 147545, 32126, 10141, -7211, -47692, -11576, -147353]
20484a47353j15641L2260J41402k8128J6793J33127M2941n7023M5867K1724L5446
20473A21415j7695p0668m1798K2565j38459j24229M0146J14944N9884O0972m1403
20462a4326j17407r779J47027k550l7856m7940l981j78677n7237J43065J56311
20451b3350J6096J8998l0159o956r2927j23051l0449Q9866R0180J20345j5942
20440A2651j73356o0244L9299O4704k5523o1536J8316L5032J20257M7457k7762
20429a0705L7275J5922Q8110o9153j0484J1370n6469m283L065O1863m4881M1844
20417F3474J9492o1128K0733Q693P6860m3063m3774l4502o8959K1855Q3710N5384
20405I8775M6427q0886j27092K8804J4184K6661Q3566n3249n5366R7106r5884
$$ y = [-147353, -262994, -230734, -89332, -117460, -100667, 32460, 75401, 18378, 64245, 85969, 121415, 103720, 33052, -8746, 13819, -124640, -248869, -208723, -93779, -33895, 27077, -14326, -131733, -141512, 5515, 2965, -34891, -82831, -86812, -265489, -322726, -179661, -23350, -7254, 11744, -18415, -25371, -118298, -241349, -271798, -181932, -91752, 28593, 12651, -160705, -220949, -181650, -116946, -142469, -204005, -185689, -150657, -30400, 17057, -10705, 26570, 42492, 130602, 61449, 50965, 62335, 5866, 1583, 4648, 66511, 21630, 63474, 82966, 21838, 42571, 51264, 128124, 85061, 41287, 6785, -62174, -40319, 43391, 98775, 145202, 64316, -62776, -33972, -19788, 6873, 90439, 37190, -18176, 78930, -16954]
20394a6954j14905J1880o4432J0877L158K2900J816k0190p278K2222K1138J4355
20382a15413Q7860m3550m4467J8015j4006j3498j5406L5025P1833L9607m0153
20371c4153p9569M4046K7578r7048K5736L2652r7610O7250J65516j539o1494j43894
20359a52529K5359j7418J16384N2504l6259r9295j755q046P9568N4331P5350J9208
20347A07402j24524j02377J3907j8868m4728Q6434J69072N8899Q612j98664j22017
20336a66852m2382O3038P2608M1786L5008m8969j00588N8885l4074N4768K5745
20325d1027j2128o6864O7700l8156N1890K3833J498N3618L8083P9067p1821j67167
20313h1474j6891J15768J68900q5577j08743K3707m2284n0140J85537Q2074j7153
$$ y = [-16954, -131859, -119979, -184411, -173534, -170376, -147476, -145660, -165850, -173128, -150906, -129768, -115413, -27553, -71103, -115570, -97555, -111561, -125059, -140465, -105440, -33607, 6000, -34153, -113722, -69676, -42098, -139146, -113410, -80758, -178368, -111118, 54398, 52859, -8635, -152529, -127170, -144588, -28204, 24300, -11959, -111254, -113009, -121055, -41487, 12844, 88194, 107402, -17122, -119499, -105592, -124460, -169188, -82754, 86318, 145217, 153829, -44835, -166852, -209234, -146196, -73588, -31802, 3206, -45763, -146351, -87466, -121540, -66772, -41027, -53155, -120019, -52319, -90475, -38585, -14752, -13254, 40364, 78447, 157514, 85693, -81474, -98365, 17403, 186303, 100726, -8017, 15690, -26594, -76734, 108803, 190877, 173724]
20302A73724P6651m4712O2053j7045j74243j6794L905j00350o2463M2921Q7932
20291C1579M8787N5316J8461J17847n569o1153j42002j60530Q2149k5458O0061
20280A9488J35343n2353K7005L3072k0228j07208r8902k6252J62525k7005j23828
20269g8343L45R1598M700Q8567O4298n0436q4098j47421p8696P3375J16261J9122
20257A9272j01271K0333L1126J5420J04337P1716k3405k1598O7883p8729p1793
20246C3291Mk1067q7574J4378N7769N7940n6427j07224K3163O1069J3060l0185
20234d1803M6732M4784K8519k6139m0017P2336L676n5215Q9000R1059R4732j25963
20222A81701j49941P368o5557j3036l5555K8097l0142p3039J4228K1779M0781
$$ y = [173724, 250375, 205663, 267716, 250671, 76428, 59634, 63539, -36811, -99274, -56353, 31579, 80366, 135682, 154143, 271990, 266421, 205268, 63266, -97264, -15115, -40573, 19488, 154831, 102478, 129483, 162555, 142327, 35119, -63783, -90035, 72490, 45485, -78343, -77998, 13600, 18300, 106867, 171165, 120729, 36631, -110790, -189486, -116111, 150, 19272, -81999, -61666, -30540, -15120, 89217, 160933, 137528, 115930, 183813, 105084, 33291, 33295, 12228, -75346, -60968, -3199, 54741, -1686, -108910, -85747, -24678, -11618, -41803, 4929, 49713, 78232, 52093, 12076, 84412, 88088, 32873, 121873, 212932, 307664, 181701, 31760, 39128, -26429, -39465, -75020, -46923, -77065, -150104, -135876, -114097, -73316]
20211g3316L7560q8294m5807J86453M8969j5876N8418j42501L9056K685j55618
20200a48271n2942Q7316J28747q347J06023K0291n1624K2509l7697m9073M5374
20189F2306N7573M0775q2772N1512K6743J17963P2828m2737j6438j43762o7625
20178G6366j6338O2949r4459j95679J2339Q9185K4264N0503R1881Q0589m6177
20167A35423n0930r869j9102m6142o7042J480N8724J1127L4957n9579m9592l7357
20155i7902O0673J26493K1714r2824n3697K2168J00172P1417j08902J0368R5941
20144A55621n0623k1605j42315q2522J6006L9717m6398j3158n4456J2201J04893
20133h2639L7856L8478j1957J23427o883r8776o8236M3156O2493o8845j80681
$$ y = [-73316, -35756, -124050, -169857, 16596, 65565, 49689, 108107, -34394, 4662, 7347, -148271, -201213, -113897, 14850, 6503, 112526, 132817, 81193, 103702, 66005, 16932, 62306, 119879, 160654, 77882, 129394, 156137, 274100, 346928, 304191, 287753, 143991, 76366, 60028, 122977, 28518, -167161, -154822, -65637, -41373, 9130, 101011, 181600, 135423, 84493, 74624, 55522, 9380, -57662, -56182, 2542, 13669, 48626, -10953, -60545, -97902, -37229, 89264, 110978, 18154, -35543, -13375, 86797, 158214, 49312, 59680, 155621, 104998, 83393, -58922, -141444, -125438, -85721, -132119, -145277, -199733, -187532, -82639, -44783, -6305, -18262, 105165, 98282, -494, -68730, -25574, 36919, -31926, -212607]
20122b12607K9752P904K16122j2306r6616j4790k609L4608p914L7007l6556M5461
20110a2544N6862N9140R011j03741n0415n1308m3751K2953R2085K6872N1620n2518
20098D266P526K2170O462j26526j06854J47686J29080L5053p0571n7511n6807
20087f6026J97405R9913p3821j25180J7833N3695o2911r1621j92M5350L4186q8946
20075f0315n4190N4057J7712J83269J41083r3879j58974j6158k8620k8171P7624
20064C3438J27643q1696p2550J44340l5062j4902Q198j5700j28813n6694K415
20053h9383m2643L7780L301L2005K6108m4943o963l5422j7955O7516o3248p1121
20041b04968R5854K13030J3489o7641J1861O2591p1738m3437m4198q9790J4163
$$ y = [-212607, -182855, -174951, 41171, 28865, -67751, -82541, -85150, -50542, -58456, -21449, -58005, -12544, 44318, 103458, 112469, 8728, -41687, -92995, -136746, -113793, -21708, 5164, 56784, 4266, 11792, 33962, 40424, -86102, -192956, -45270, 83810, 118863, 48292, -9219, -66026, 131379, 231292, 157471, 32291, 50124, 103819, 40908, -50713, -50905, -5555, 28631, -60315, -114505, -60448, -42736, 140533, 281616, 187737, 28763, 12605, -16015, -44186, 33438, 161081, 79385, 6835, 151175, 116113, 101211, 109409, 93709, -35104, -91798, -89383, -132026, -94246, -90945, -58940, -32832, -77775, -84738, -120160, -138115, -70599, -133847, -204968, -109114, 103916, 117405, 49764, 61625, 124216, 52478, 9041, -35157, -124947, -110784]
20030a10784L5377J4381O6542n3749Q1907N2761m1540Q434k9718n4808J8045J49445
20018A36293m2547n4791j8188p0287k5199M9247K4032o895o1806p1224J0513J6583
20006a14269k6358L5681K5945M3714J0455L4948M5306k1472r0931o3040O5961
19995e4060K496k0741n3099r545k2973j584J33145N8906j84702j35376R6868M7163
19983a43502J24490Q154p9126p8158K8103O3741l2371J79960L9464j30170m5786
19972f5201L6004K9150l1437r5267L0198m0794k4425J76251J17712P1445r7127
19961A06509q7439M3709J53770J8708o7939j87566j3429Q377j03285k7968m9965
19950b06518o4863N7354J38319l9202r6627N0155J20740K8420Q9735P0134r0829
$$ y = [-110784, -75407, -61026, 5516, -48233, 33674, 86435, 44895, 53329, 23611, -31197, -13152, 136293, 93746, 38955, 20767, -49520, -74719, -25472, -1440, -8335, -70141, -141365, -130852, -114269, -140627, -104946, -79001, -35287, -24832, 10116, 55422, 33950, -56981, -120021, -54060, -51564, -72305, -125404, -134949, -157922, -159506, -26361, 32545, -152157, -287533, -190665, -143502, -19012, -10858, -89984, -168142, -140039, -76298, -108669, 71291, 110755, -19415, -65201, -29197, -47, -31484, -126751, -96553, -137347, -161772, 14479, 132191, 203636, 106509, 19070, 62779, 216549, 235257, 167318, -20248, -33677, -25300, -128585, -156553, -206518, -271381, -214027, -75708, -114910, -211537, -161382, -40642, -12222, 77513, 147647, 56818]
19939E6818m4704K7141n8338M423j4504J07601J5290M4908l541k0840o5108j03716
19927e4570k8451O0507J29110O908K2173n2656r57n4386m489J8173K4485M4458
19915A10305J5107L4212k5070n8144o3493j28556l4117J61750N1292L2708m9172
19904D6822r6753J1047N3424o9776r6106O9468j2118L4927k2220o3418o003P6785
19892g3921M4148O6849q7516k5856l7117J07909j9749O896o1557l8594k4220J6066
19880a26662J36001J74218L9699k42519m4709L4189j1470M7568K4829m0211Q1490
19869G2423N993j3530J3647k4560n1916O6702Q0328n8062o5163p095R1684l6461
19857G3990M0477m6609J837q0162p5469L4221P5655o0114p7182M122R163J46127
$$ y = [56818, 12114, 39255, -19083, -14660, -29164, 78437, 93727, 138635, 135094, 114254, 49146, -54570, -83021, -22514, 106596, 113504, 135677, 83021, 82064, 27678, 23189, 41362, 65847, 110305, 125412, 159624, 134554, 76410, 12917, -115639, -149756, 11994, 63286, 95994, 46822, -49931, -38884, 14540, -55236, -151342, -81874, -93992, -59065, -81285, -144703, -150706, -73921, -29773, 37076, -50440, -76296, -113413, -5504, -25253, -18357, -79914, -118508, -142728, -126662, 9339, 183557, 223256, -19263, -63972, -29783, -41253, 6315, 31144, -9067, 72423, 78416, 64886, 78533, 53973, 2057, 68759, 149087, 91025, 25862, 18767, 110451, 73990, 114467, 67858, 69695, -10467, -85936, -51715, 23940, -36174, -113356, -109234, -100071, 46056]
19845D6056j5434o2146O7656J9231J2516M4309n0995o396p371L9415K3115m831
19833A05125q338M1003R7967K47j49239q167O1030n3585j44507j17164r746N9133
19821a26241J7389J1586L2680n5570O8672J0106l773O3850O6767o3183n3837O6327
19809C4773L8576k0512N2864k7847k9655k9401q402N2020q3474o9046j0470K0511
19797h0063M2984Q4512m8360n8249k4734M6696n2915Q5330J80329n1087m0925
19786H3518q6469K1746p4637r4402K5421R2729Q3743j4795N2249q1486k1460P1224
19774E7381K4302J7430l8367m6962j03110P1287Q1197O0632L6255m401J2410P9621
19762B47675o8711j02507P8261M8146p9450k47351J1692M4010n0517n3035J23816
$$ y = [46056, 30622, -31524, 36132, 55363, 67879, 112188, 61193, 54797, 47426, 86841, 109956, 105125, 96787, 137790, 235757, 236004, 86765, 78598, 139628, 86043, -58464, -175628, -185374, -126241, -108852, -97266, -64586, -120156, -51484, -41378, -45151, 18699, 85466, 22283, -31554, 34773, 73349, 52837, 105701, 77854, 48199, 18798, 10396, 62416, -21058, -90104, -100574, -80063, -37079, 47433, -927, -59176, -83910, -37214, -90129, -4799, 175530, 124443, 83518, -2951, 18795, -55842, -150244, -124823, -32094, 51649, 36854, 89103, 7617, -13843, 57381, 81683, 99113, 60746, 13784, -89326, -18039, 63158, 123790, 160045, 155644, 168054, 247675, 178964, 76457, 154718, 202864, 123414, -123937, -112245, -68235, -118752, -171787, -47971]
19751d7971J32258l0287l407k2311N555P6899o4326l0472Q1455o833M16O220Q5053
19738A82249P269R0747m531K5916k7461l5321j09269o6222r3922O2618J23414
19727A55487r2479j00250J18931m709O115m0845K866j1455k707J1272n4865o087
19715a8726N4067j07966j18729J0810n5660P1300J54692M170L6650m6305q0167
19704i5864L4746j06519L0556O1369k7662J00029P3511j28333o0126K9423q197
19693i7067M4m5130Q0720J0100J0088L7275K430j15703J12808J32530k6315K7284
19681A29064R8261M2849N2803k1101m6620j22369r6859o4629m4056n7462R3074
19670c7045k6393J60317J88614r5197M5146j27767j32456p393Q927m7382O3668
$$ y = [-47971, 84287, 54000, 50593, 28282, 33837, 110736, 46410, 15938, 97393, 90560, 90976, 97196, 182249, 189518, 280265, 275734, 301650, 274189, 238868, 129599, 63377, -30545, 32073, 155487, 63008, -37242, 81689, 76980, 83095, 42250, 45116, 33661, 30954, 42226, -12639, -18726, 35341, -72625, -191354, -180544, -236204, -164904, -10212, -6042, 30608, -15697, -95864, -61118, -167637, -137081, -75712, -103374, -3345, 70166, -58167, -118293, -88870, -97067, -97023, -142153, -61433, -51333, -41245, -3970, -1540, -117243, -4435, 128095, 101780, 129064, 227325, 270174, 322977, 301876, 255256, 132887, 36028, -28601, -72657, -130119, -37045, -63438, 96879, 285493, 190296, 235442, 107675, -24781, -32174, -23247, -70629, -6961]
19659f961P4419k6596M6276K5454K2400m3413N6619n2349r6658m1564m7597J9205
19647g0765j8258o9337k8253O1002O1468m865j6179n3940L8001J41815R5554k5316
19635A10927j87064j13662J36342L2705L2430K1306L8360q2541K0652k4433m5262
19624f0240r2655Q2342J38422L5832M155m2588o6949m1580K9241J5489L4525K6920
19612F2914p1656j30766k0951J70011J64423n862K6324q0604p9379o0455k796
19601b8797L1769r6214R0764J68778K5310L5713j59465j8545O9937j2828J6031
19590A22453q8529j27481R2734J38539K9721q9916p5195n429j71544j27028J06452
19579a95223K26092J03563J34964J10208q0357p6872j7777j78051j2520o1147
$$ y = [-6961, 67458, 40862, 87138, 112592, 134992, 91579, 148198, 95849, -809, -42373, -89970, -70765, -89023, -158360, -186613, -125611, -64143, -69008, -85187, -139127, -101126, 40689, 136243, 110927, -76137, -189799, -53457, -20752, 11678, 32984, 71344, -11197, 9455, -14978, -60240, -152895, -70553, 67869, 103701, 107856, 65268, -1681, -43261, -14020, 1469, 35994, 62914, -8742, -139508, -160459, 9552, 173975, 168113, 194437, 113833, 34454, -26001, -28797, 2972, -93242, -2478, 166300, 191610, 227323, 67858, 49313, 119250, 106422, 122453, 33924, -93557, -823, 137716, 167437, 77521, 2326, -3103, -174647, -301675, -195223, 30869, 134432, 269396, 379604, 299247, 222375, 204598, 26547, 14027, -47120]
19569d7120j7894N8027J2127L858M1868p2003L937K40193Q2316k4909j7499j8807
19557B44094p1065j40900M5372Q5431P621n853K106l7882Q790l6034l5296q0262
19545a3878Q944n7855M2327J03688Q264k3048K1967k0162M774L0121m9757q8734
19533c3349J41815R4379M9449J5271j62401j34726l9238J32127j1382l1714j0875
19522I356K901o2946P494J24121O9516l0958J2090m4278k6032O9456j5241p6434
19510C9045p9682j3627Q2087L9333k3856n0870L6667o9773r752j0426L2896O1533
19498C3575l7980L590M3210R3343m6414j19764m5238o143N0975l5346m2350k8587
19486a37129R0731J23977l6362j00870m7054M5804l0587j2318n482j5442R1871
$$ y = [-47120, -65014, -6987, 5140, 8998, 50866, -21137, -17200, 222993, 305309, 280400, 262901, 244094, 173029, 32129, 77501, 162932, 170553, 164700, 166806, 128924, 137714, 101680, 66384, -13878, -4934, -62789, -20462, 83226, 91490, 68442, 90409, 70247, 75021, 105142, 55385, -33349, 108466, 202845, 252294, 267565, 105164, -29562, -68800, 63327, 51945, 20231, 9356, 12257, -50689, -43195, 80926, 150442, 119484, 131574, 87296, 61264, 130720, 115479, 39045, -40637, -54264, 27823, 67156, 43300, -7570, 29097, -40676, -50428, -60854, -27958, 33575, -4405, -815, 42395, 135738, 89324, -30440, -75678, -81821, -30846, -66192, -108542, -137129, -46398, 77579, 41217, -59653, -106707, -60903, -91490, -103808, -109290, -124732, -32861]
19475c2861r3434M5538R4540J27294o6740L6564M858M0417k040j8103k7244o0331
19463D8458l9495K5279N779l6568r7578j21802K968M7391R9390L5872K0409Q0112
19451G0215j0214r0906M0984J8210j24100P0230J08369O1556o1076P7702R5686
19440B56656P629o2540p3212N8782R6237n8315j67588Q6876O1553p1345j8389
19429A16344L3341m3809r2306j00643J20814K5697j55781k4362R8112n3732M3596
19418c2729J14499r401K1847j03684m201M2014k1356n6600L6953J05324K1228
19407A13894o8224j77330n7720R6720R8895L3333L8851j09701n1869R3425J50628
19396A60902m0938j14585k5147N8455J16388K5002j16958j5939l2010J33282M7291
$$ y = [-32861, -126295, -80757, 13783, 141077, 74337, 110901, 115759, 156176, 154136, 136033, 108789, 48458, 8963, 34242, 40021, 3453, -94125, -215927, -212959, -165568, -66178, -30306, -9897, 70215, 60001, -30905, 10079, 28289, -95811, -25581, 82788, 144344, 83268, 160970, 256656, 264285, 201745, 128533, 187315, 283552, 225237, 57649, 144525, 206078, 134733, 116344, 149685, 105876, 13570, -87073, 33741, 59438, -96343, -120705, -22593, -76325, -32729, 81770, 72369, 94216, -9468, -13669, 28345, 6989, -49611, -12658, 92666, 113894, 45670, -131660, -189380, -92660, 6235, 39568, 78419, -31282, -83151, 10274, 160902, 119964, 5379, -19768, 38687, 155075, 180077, 63119, 47180, 15170, 148452, 195743]
19385A95743j10378q4361j0769K7531J104m0892r29L3383R6638R1641Q1306j3499
19373B66518J0679P0685k5550q4249n7408O0737O4372j06561q1991J50163J3228
19362B80623j55376m7159L8999j3610M6683P162j09189o6740J99541J07643N194
19351B93771n0074L0263j6177l1154k0837j52434M7789J62828l0227J790K3255
19340B58793n2824l622k5596l4627p0532r2470j21559M6159L7515N8761J21098
19329A21096r3367l2562J70497K5525j6189j7155n1879l9444l6291R6945J3144
19318A40320O4727N1345p6920l9442n0791n1698j15781j26509J15388J52296R757
19307G2692n2516l2366M1214J56563K3857Q243L94k9893K921O2911n5598J2360
$$ y = [195743, 85365, 1004, -9765, 17766, 18870, -22022, -22951, 10432, 107070, 198711, 280017, 266518, 277197, 347882, 322332, 238083, 180675, 241412, 305784, 199223, 117232, 267395, 280623, 125247, 78088, 117087, 103477, 150160, 157322, 48133, -18607, 180934, 288577, 293771, 243697, 273960, 257783, 226629, 205792, 53358, 101147, 263975, 233748, 235538, 258793, 205969, 202347, 176751, 142124, 71592, -20878, -142437, -96278, -58763, -2, 121096, 27729, -4833, 165664, 191189, 175000, 157845, 105966, 66522, 30231, 127176, 140320, 205047, 256392, 179472, 140030, 89239, 37541, -78240, -204749, -89361, 62935, 72692, 20176, -12190, 29024, 185587, 209444, 217687, 218081, 188188, 191109, 254020, 198422, 210782]
19295B10782O5881Q101m133m7488n4547J08018J39312R7275R8207j6784J01103
19284G05727J58957K34441J11103O5808l262K7920J73896J45648O1762J18771
19274A800771L8951j24725j23005j0048r8693r7777N1689j81412j79105k63125
19264H13521k10835j19243n652j1572o3164r327O2368J38337r8815l9232m4811
19253D11575M4250O3209j09395k0588l4464j03740r1780r5944q4794O1848Q5300
19242A25477O9886m4085j62701R190J03517m4N5459M3816m5337n1910j6067o9533
19230A7668R2602M2098M7787q7030P209Q21J122J5367K5974M1476o0066r2714
19218E2314O0702o7191j1302j4419J49487J02386l6929j4130k1706o8098K294
$$ y = [210782, 276663, 284764, 280631, 233143, 178596, 286614, 425926, 523201, 621408, 604624, 705727, 864684, 1099125, 1210228, 1276036, 1272774, 1300694, 1474590, 1620238, 1682000, 1800771, 1839722, 1714997, 1591992, 1581944, 1483251, 1385474, 1437163, 1255751, 1076646, 813521, 602686, 483443, 477791, 466219, 403055, 393728, 456096, 594433, 495618, 456386, 411575, 455825, 519034, 409639, 389051, 354587, 250847, 159067, 63123, -21671, 40177, 125477, 195363, 151278, -11423, -2233, 101284, 101240, 156699, 200515, 155178, 103268, 87201, 17668, 110270, 152368, 200155, 113125, 120334, 121155, 122277, 137644, 163618, 205094, 145028, 52314, 113016, 45825, 34523, 20104, 169591, 271977, 235048, 220918, 199212, 131114, 133408]
19207A33408J1958o7590p5850k1231n0508p1385J21030Q7047N1069o6098k1176
19196C0674Q4498N0879Q5027K6717K5956P203l8678r0664q5342r7471N1745O1625
19184A12169o6166l5171K4028j8550M5970K3269q9855J6190O797N6856P5233N3407
19172B04177o5646k4985j0500j5163O7609J18216R2197q4033q3136j04189j90845
19161i6298J8094J13396N2282k0417r873q0218P096R1763J44142q5521k21797
19150h7351p0882J14537J94536R1858j16104p8604k6111N1295M5031L964N978
19139A28147O5478J61341o5149k4178N1808O4409j09259q5766j8051O4611N0981
19128B84372l5513r7013k9097R7668m8998n8399K3654j3447P5334K9532J2974
$$ y = [133408, 145366, 77776, 1926, -19305, -69813, -141198, -20168, 66879, 117948, 51850, 30674, 115172, 166051, 251078, 277795, 303751, 310954, 272276, 181612, 96270, -1201, 50544, 112169, 46003, 10832, 34860, 16310, 62280, 85549, -4306, 11884, 18681, 75537, 150770, 204177, 138531, 113546, 103046, 87883, 155492, 273708, 365905, 281872, 198736, 94547, -96298, -78204, 35192, 87474, 67057, 57184, -23034, -15938, 75825, 219967, 134446, -87351, -158233, -43696, 150840, 242698, 126594, 47990, 21879, 73174, 118205, 122169, 128147, 193625, 354966, 289817, 265639, 317447, 381856, 272597, 186831, 168780, 233391, 284372, 248859, 151846, 122749, 220417, 171419, 113020, 136674, 123227, 198561, 228093, 241067]
19117B41067j18428j9135L1690k7577k3888N2301K32742o8105l7858l7262k1054
19106B04493j39740q2220N8957J8339J8808L6771j6622k7955R182L5347O071j02061
19094A9370q7104O522Q9769m1122P6553K27004L0158j58359l5896K902j2607j04944
19082A2246k944J73593J8463j53331j23284R5371J03001N6984L8404j31952p8742
19071G809k1443J54662P8009J8811l898J01378l8756j67543j64559j12320k6907
19060a74757L6601N9107J24079P9098O5983l1833k5708j346p1261K5889J3096
19049I8948n8429r304r3853L7155K2789O1669Q9745R3355R671J8784K7329o0867
19037B36992k267l4401r3293j8770O4567R161r7039Q1856M5508r0114j28235J1508
$$ y = [241067, 122639, 103504, 135194, 107617, 83729, 136030, 368772, 300667, 262809, 225547, 204493, 64753, -17467, 41490, 59829, 78637, 115408, 98786, 70831, 80013, 115360, 121431, 19370, -67734, -61212, 28557, -12565, 63988, 290992, 321150, 162791, 126895, 129797, 117190, 12246, 9302, 182895, 201358, 48027, -75257, 20114, 123115, 180099, 218503, 86551, 7809, -13634, 141028, 219037, 237848, 233950, 335328, 296572, 129029, -35530, -147850, -174757, -138156, -79049, 45030, 124128, 190111, 158278, 132570, 131224, 59963, 85852, 98948, 40519, 31215, -62638, -25483, -2694, 58975, 148720, 242075, 251746, 270530, 297859, 236992, 234725, 200324, 107031, 88261, 152828, 161989, 64950, 146806, 192314, 102200, -26035, -14527]
19025a4527j8671R3677k489N516Q4746J2176K2668k8000J0679K0863p2193j21982
19013g537J36508L8782o9508M2112n675n6476L6231M0282K8746n8770j70515L085
19001d2735R4198K0466j8002K43157O8468q9314l6785q7988m9081M2310J44163
18990B88857n750m6704k3844r2404p3280R8844Q0610L6807r5685o5838Q1539P4484
18978B57636K7117l2343l6863m35K2017O2063L0323K1542o0060p8458O6450L8687
18966C17676Q0808k8405r7066J4574J32333o0548j16577L847R563J29702k5442
18955C60465j03105Q0982j3577j22935L3019l898J3574j5371K9721j89229j03850
18944c4204L5579J12732L8862R4688K4910j8013q8353r941M7473M0143l3899K4465
$$ y = [-14527, -33198, 60479, 57990, 63506, 148252, 160428, 183096, 155096, 165775, 186638, 114445, -7537, 128971, 167753, 98245, 140357, 134682, 78206, 114437, 154719, 183465, 124695, -45820, -42735, 51463, 71929, 53927, 297084, 365552, 276238, 239453, 151465, 102384, 144694, 288857, 283107, 236403, 212559, 120155, 46875, 145719, 226329, 263136, 167451, 101613, 183152, 257636, 284753, 252410, 215547, 215112, 237129, 299192, 329515, 351057, 290997, 212539, 278989, 317676, 398484, 370079, 273013, 287587, 419920, 359372, 242795, 246642, 256205, 385907, 360465, 257360, 338342, 324765, 201830, 234849, 230951, 244525, 229154, 258875, 69646, -34204, 1375, 114107, 152969, 247657, 272567, 254554, 166201, 156260, 203733, 243876, 209977, 234442]
18932B34442O3530J8767K0766L8641n153j11744k5880J65741J38764J6700J3358
18921E67932l9551j63729k2148O7617j4984J2832m0274k9120j7735O5662J17515
18910E04017j23088j35732J9816Q3337J82465J983q9757j05465l5665N9098l3954
18899C27055K790J32903P9712R732j57776L7573k7908R4659q0491l6196J21550
18888E03603o7560o2336R791P9405P197P6276L6865J34948l0585m3033J20294
18877G64865P94q1309q9421J2226k3912p4590J27487J35447p3982p5468j70629
18866D51508K8919P0077J20045n0510q6920l4922m8665K1670p2463J06886p7830
18855D27795k63497m1565N9102P8672O4137J3815m084O115M7996J8871q1796j10775
$$ y = [234442, 297972, 316739, 337505, 376146, 370993, 259249, 233369, 399110, 537874, 554574, 567932, 528381, 364652, 342504, 410121, 395137, 407969, 367695, 338575, 320840, 386502, 504017, 380929, 245197, 265013, 348350, 530815, 532798, 443041, 337576, 301911, 361009, 327055, 329845, 462748, 542460, 552192, 394416, 431989, 404081, 498740, 418249, 382053, 503603, 436043, 373707, 383498, 462903, 470100, 546376, 583241, 718189, 687604, 644571, 764865, 765659, 684350, 594929, 607155, 583243, 508653, 636140, 771587, 697605, 622137, 451508, 480427, 550504, 670549, 620039, 533119, 498197, 449532, 471202, 398739, 505625, 427795, 164298, 122733, 181835, 260507, 324644, 338459, 334375, 340490, 388486, 407357, 325561, 214786]
18843B14786L1629M0881k97J19590p2428p3497l3605o7670n3884K3526J67987
18832B97018l8327n0690k7493Q3511J35269K7938L6141P6218l1510j17714q3395
18821C06966j05424r9670J49247j2827j8280J1625M8711J32690K99j39889O8224
18810C41672O2716m2074l7254J0224j1611j03537j2357l392K4807N6281K3911
18799C09386R988n5707J00966J00186P0519N6628l9001N2992M8449J3316k0094
18788F47628p5577l0430l3635j2411k5523L4217L7343q7398J3887J14312L3396
18777F15809p9011K4533Q1490o6498k5511P7137J22366j1094l7238J30895J23308
18766I56186Q8957J26519L90157M20981j2047m01029m28860k78281l6606j15311
$$ y = [214786, 246415, 287296, 286999, 406589, 334161, 260664, 227059, 159389, 105505, 129031, 297018, 258691, 208001, 180508, 264019, 399288, 427226, 463367, 539585, 508075, 390361, 306966, 201542, 101872, 251119, 238292, 220012, 231637, 280348, 413038, 413337, 273448, 341672, 404388, 362314, 325060, 335284, 323673, 220136, 207779, 204387, 229194, 285475, 309386, 319374, 263667, 364633, 464819, 535338, 591966, 552965, 605957, 654406, 667722, 647628, 572051, 541621, 507986, 495575, 470052, 504269, 541612, 454214, 468101, 582413, 615809, 536798, 561331, 642821, 576323, 550812, 627949, 750315, 739221, 701983, 832878, 956186, 1045143, 1171662, 1561819, 1982800, 1970753, 1569724, 1140864, 862583, 825977, 710666]
18756G10666K2839j05048k7035K0433O5905N9952R1244P3422J02368J04320j6233
18745A102833n7414J25414J37935P117J85212P4757j19510m2395m0861l0461J4055
18734A356682J55519o908j06698n4403J15574k9831K8718J31188l6305o7857J55
18723A485834l4116j31183j60236k0760L7323j241R2021R5929j1597j05427J57020
18712A403567K04796R2503K7388L5251J04258N7680R6018J462m5927j49482n7057
18701A770457J36041P0950P255r5463P5729J6711M8199j14718n5412O2145J35976
18690B057870R9489p7111J5306J09499p852j8374R3262J35566L0871P7627R9866
18679B616019N9557n6073J54999J25037J14385N4444O6656J44111N1833P0480
$$ y = [710666, 733505, 628457, 601422, 621855, 687760, 747712, 838956, 912378, 1014746, 1119066, 1102833, 1045419, 1170833, 1308768, 1315885, 1501097, 1575854, 1456344, 1413949, 1373088, 1342627, 1356682, 1512201, 1505293, 1398595, 1344192, 1459766, 1429935, 1458653, 1589841, 1553536, 1485679, 1485834, 1451718, 1320535, 1160299, 1139539, 1176862, 1175621, 1267642, 1363571, 1351974, 1246547, 1403567, 1608363, 1700866, 1728254, 1763505, 1867763, 1925443, 2021461, 2022923, 1976996, 1827514, 1770457, 1906498, 1977448, 1984703, 1889240, 1964969, 1981680, 2029879, 1915161, 1859749, 1921894, 2057870, 2157359, 2080248, 2095554, 2205053, 2197201, 2178827, 2272089, 2407655, 2438526, 2516153, 2616019, 2675576, 2619503, 2774502, 2899539, 3013924, 3068368, 3135024, 3279135, 3330968, 3401448]
18669C401448R1846J01501K15095L22550J29604J56447K31235K70372M47983N01275
18659E869356N38146O47348P55296R19726R05830M70639O4077j9951J66867N63608
18649A0880942P24648R06159Q31591N26365M28668L78195M25898P14615J050077
18640A6867158J185671J184141J476883J913587K410039K927656L448813L953752
18632C5367700M804619N793271P514099J0045146J3898597J9272396K5821968
18625A22517796L2009756L3798913K6747429J3335961N255060R621586K1225011
18618B64511512L0053101K7753120J3994769m143922k0487252k7830859k2819576
18611B61030893j1379183l634524p356762k1193613l2983093l4807962k9375524
$$ y = [3401448, 3493294, 3594795, 3809890, 4132440, 4262044, 4418491, 4649726, 4920098, 5368081, 5869356, 6407502, 7054850, 7810146, 8729872, 9635702, 10106341, 10170418, 10150467, 10317334, 10880942, 11605590, 12511749, 13343340, 13869705, 14298373, 14676568, 15102466, 15817081, 16867158, 18052829, 19236970, 20713853, 22627440, 25037479, 27965135, 31413948, 35367700, 40172319, 45965590, 53479689, 63524835, 77423432, 96695828, 122517796, 154527552, 188326465, 215073894, 228409855, 233664915, 243286501, 264511512, 294564613, 322317733, 336312502, 332168580, 311681328, 283850469, 261030893, 249651710, 246017186, 238660424, 217466811, 184483718, 149675756, 120300232]
18604A20300232k2603138j7128752j3047835j0118730p938665o244367n096792
18597C8121953m401503l566781l023155k641460k164406j789928j562173j187698
18589A7784849j179504r87013q85754p60721q34105p43318n28358l38963m53687
18580A1073426n08774n88505o17250n70875n88496m18615l13997m68245n79550
18571F419119m65751m55190m68462l53927k70694j49707j78037l36640k63838
18562C476873j89347j52350j41884K5883K2679j55853r5935j31067j81173j51009
18552B326817j25030j858Q0023j23945j07694j76232O7651j3893k13915j83366
18542A528558l7974N8456N5548K7932P102j02669j77725K9908M1055p8565P2398
$$ y = [120300232, 97697094, 80568342, 67520507, 57401777, 49463112, 43218745, 38121953, 33720450, 30153669, 27130514, 24489054, 22324648, 20534720, 18972547, 17784849, 16605345, 15618332, 14732578, 13971857, 13137752, 12394434, 11866076, 11527113, 11073426, 10564652, 9976147, 9358897, 8788022, 8199526, 7780911, 7466914, 6998669, 6419119, 5953368, 5498178, 5029716, 4675789, 4405095, 4255388, 4077351, 3740711, 3476873, 3287526, 3135176, 2993292, 3019175, 3041854, 2886001, 2790066, 2658999, 2477826, 2326817, 2201787, 2199929, 2279952, 2156007, 2048313, 1872081, 1939732, 1925839, 1711924, 1528558, 1490584, 1549040, 1604588, 1632520, 1639622, 1536953, 1359228, 1389136, 1430191, 1351626, 1424024]
18531A424024p5970j2351j7879k4891j33718J2112j7118j21715r4460K6705O9047
18520A033786R2365q3368q8584P696J6529p2507J0877m0516o2444Q0638O3040
18509I57512j04500m1411M6324Q0124J1277p7276l1904j43453q0939o8606k3232
18498E23916J6369N676J21655L6997J1729J03963Q0720j11917r0866j061j80306
18487E16875J0654O7050n8239l1227P1061M6173r6277j5232Q6915j404k3424j3685
18475E59240l13j5609K1377j2137J64422J05850k41889n4256J49445J02469j07222
18464F71377j3136K4315J00141o973q4235j21859r4460m1311l8324q1949k9972
18453B83614m5219N6606N1688k2623J3542j6518m6562l5857O0840k1125O3570
$$ y = [1424024, 1348054, 1335703, 1317824, 1292933, 1159215, 1171327, 1154209, 1032494, 938034, 964739, 1033786, 1126151, 1042783, 954199, 961895, 978424, 905917, 916794, 876278, 813834, 894472, 957512, 853012, 811601, 857925, 938049, 949326, 872050, 840146, 696693, 615754, 547148, 523916, 540285, 545961, 667616, 704613, 716342, 820305, 901025, 789108, 698242, 697181, 516875, 527529, 594579, 536340, 505113, 576174, 622347, 526070, 510838, 597753, 596349, 572925, 559240, 558927, 543318, 564695, 552558, 716980, 822830, 580941, 526685, 676130, 778599, 671377, 658241, 682556, 782697, 775724, 691489, 569630, 475170, 433859, 395535, 313586, 283614, 238395, 295001, 346689, 324066, 337608, 321090, 274528, 238671, 299511, 278386, 341956]
18442C41956Q0556M5627J31852K742k6333N3590n6699R372o5277j2281J04238
18431F09343R8237P3696p2649N8712p516O4771j1144k7006J53859l1537q0110
18420H28656Q4697n8907J8499k2693P5569J08835j57098r3997J28726K73499K35331
18409A421117K73447J86983j05648k32524j04082j4178J17773J71297L74327M48944
18399B537456K81268k78043l71189m05424l09138l8407R2310J87455L1903j72710
18389A555481k48506k70704j44519j97972o4237m3689L0323K9608p6187n0496
18379E19102j1128N9102M9071k08402o9936R9778Q5185O1484J9604m0377j75903
18368C87580l2776J30329N5823j872J00952N0006M1692j03733r7348P2456J1414
$$ y = [341956, 422512, 468139, 599991, 602733, 576400, 629990, 573291, 582663, 517386, 505105, 609343, 707580, 781276, 708627, 767339, 759823, 824594, 813450, 786444, 940303, 908766, 828656, 913353, 854446, 872945, 850252, 925821, 1034656, 877558, 783561, 912287, 1185786, 1421117, 1694564, 1881547, 1775899, 1543375, 1439293, 1425115, 1542888, 1714185, 2088512, 2537456, 2818724, 2540681, 2169492, 1764068, 1454930, 1416523, 1508833, 1696288, 1728191, 1555481, 1306975, 1036271, 891752, 693780, 629543, 585854, 616177, 645785, 569598, 519102, 507974, 567076, 616147, 407745, 337809, 437587, 522772, 584256, 603860, 563483, 387580, 354804, 485133, 540956, 539084, 640036, 690042, 731734, 628001, 530653, 603109, 614523]
18357F14523M4513J04966j4053j05898L0864N7237j00395K5520m3971j23341O7372
18346E57337j0859n8385R946K2427N8732R9843J45801J77097J53524P9636q7952
18335A147147l945m6123K9990J1382r1532r6856k73414j98604k7864J43890K225
18324E96296q2752K880K3324M6183j6196M5409q0805j7485M3517k8070l6736M7695
18312E43260R994j0928l5444j35441P4874J88485J48294J37624J81533l310J30968
18301A229909J51923J962J01275l1869q0647j65070j53106j75767l6058J05957
18291I48509q706J8974P2367K8046N5095K9651J46515J66272K9361j1212q1984
18280A392888k39964k63828j55639l3605o476o1646j67679K7999R1780J52204
$$ y = [614523, 659036, 764002, 749949, 644051, 674915, 732152, 631757, 657277, 613306, 489965, 557337, 546478, 488093, 498039, 520466, 579198, 679041, 824842, 1001939, 1155463, 1235099, 1147147, 1143202, 1097079, 1127069, 1138451, 1046919, 950063, 676649, 478045, 450181, 594071, 596296, 513544, 516424, 539748, 585931, 569735, 615144, 534339, 516854, 560371, 532301, 495565, 543260, 553254, 542326, 506882, 371441, 446315, 634800, 783094, 920718, 1102251, 1098941, 1229909, 1381832, 1383794, 1485069, 1453200, 1372553, 1207483, 1054377, 878610, 842552, 948509, 939803, 958777, 1031144, 1059190, 1114285, 1143936, 1290451, 1456723, 1486084, 1474872, 1392888, 1152924, 889096, 733457, 699852, 693376, 631730, 464051, 492050, 583830, 736034]
18270G36034P0887q7017K8331j2412q910L1380o0011m2822n8705J08572R3253
18259G98580M2927O9365j6835n7276l4710J03456o4200k7385R4026K61386J53931
18248A323265J7600p1223j17694l7609j11449p760J00037q3852p5869p7359J6347
18237H74434j75689n9060J8934N8596L0888J4550M8257J8426J2365o16K1606q3160
18225G79531n8216N8278O6573k8485p9440q0970l4492M9860J7389O3179P1063
18214H24270Q9083J04188l8095r845k4149r7752n6464K0450j3595Q087k3479j35122
18202F47577R4920J46887R0531o8337Q8516J18994L296l2837R766L6570o4981
18191A070902j13587Q561K2046M7402J89849j1821L9250m0392j1054O1891P6662
$$ y = [736034, 806921, 719904, 748235, 735823, 726913, 758293, 698282, 655460, 596755, 705327, 798580, 841507, 910872, 894037, 836761, 802051, 905507, 841307, 813922, 907948, 1169334, 1323265, 1340865, 1269642, 1151948, 1114339, 1002890, 995130, 1095167, 1011315, 935446, 858087, 874434, 698745, 639685, 658619, 717215, 748103, 762653, 810910, 829336, 841701, 841085, 862691, 779531, 721315, 779593, 846166, 817681, 738241, 657271, 622779, 672639, 690028, 753207, 824270, 913353, 1017541, 979446, 969601, 945452, 847700, 791236, 811686, 798091, 806178, 782699, 647577, 742497, 889384, 979915, 911578, 1000094, 1119088, 1122384, 1089547, 1099313, 1135883, 1070902, 957315, 965876, 987922, 1035324, 1225173, 1213352, 1252602, 1212210, 1201156, 1263047, 1339709]
18180A339709J33950L6752L5561K9231J07258j4436j23567j81967N10j3413P1474
18169A421062p7559J4815P7470K2035k972O3336Q8462j28103N0980j1503l121
18158A514902M0504k4787j05401L0796J1121M4449k9917R932J8161R8459J00651
18147A708870L4464J23123J95718J71296J04364P7281J46504J70754J31838n1744
18137B812468l9452L2458K56322L68317L00828Q6734Q4727j5585n3358P5406K62107
18126D170972L27082L09021L46410M32984M91040N59977L55116N13215Q81882
18117H387699J140598J333210J589454K061878K533981L369352N010012P824411
18109C3250595J3180689K2879199M0834360O6428651O7744460n260780p1790763
$$ y = [1339709, 1473659, 1510411, 1545972, 1575203, 1682461, 1668025, 1544458, 1362491, 1363001, 1349588, 1421062, 1343503, 1358318, 1435788, 1457823, 1454851, 1518187, 1606649, 1478546, 1529526, 1518023, 1514902, 1555406, 1530619, 1425218, 1456014, 1467135, 1511584, 1481667, 1491599, 1509760, 1608219, 1708870, 1743334, 1866457, 2062175, 2233471, 2337835, 2415116, 2561620, 2732374, 2864212, 2812468, 2773016, 2805474, 3061796, 3430113, 3730941, 3817675, 3902402, 3886817, 3833459, 3908865, 4170972, 4498054, 4807075, 5153485, 5586469, 6077509, 6637486, 6992602, 7505817, 8387699, 9528297, 10861507, 12450961, 14512839, 17046820, 20416172, 25426184, 33250595, 46431284, 69310483, 110144843, 176573494, 244317954, 239057174, 167266411]
18102A67266411o1917326l4749836j8985908j1228225p311777m972689l215967
18095B4884683k292678k052913j685816j196242j006915q33048n91103k53479
18087A4972489L9173k8935k28629k29093j27716L150K83717M06025N75334N32834
18077A6198349M83119M80321M56151P60106J199401J717489K109269K437948K997608
18068B8839761L963192N133846O954242R560076J3728526K0336177K9934108M1306096
18060A59756024M6878498L3727962N655819p698846M409403K7764087M5573540
18053C16066487M2831528K0176448p378173l4013769m4203546k9734094n814349
18046B57930532R398102M27172k8904848m7916403m4779171l3175707k3052126
$$ y = [167266411, 105349085, 70599249, 51613341, 40385116, 33073339, 28100650, 24884683, 22592005, 20539092, 18853276, 17657034, 16650119, 15817071, 15225968, 14972489, 15011662, 14982727, 14754098, 14525005, 14397289, 14400439, 14684156, 15090181, 15665515, 16198349, 16681468, 17161789, 17617940, 18378046, 19577447, 21294936, 23404205, 25842153, 28839761, 32802953, 37936799, 44891041, 54451117, 68179643, 88515820, 118449928, 159756024, 206634522, 240362484, 246018303, 238319457, 242728860, 270492947, 316066487, 358898015, 379074463, 371696290, 337682521, 293478975, 263744881, 257930532, 267328634, 267755806, 238850958, 190934555, 146155384, 112979677, 89927551]
18039H9927551j6096981j1906471r053218p306508o050176m848450m060037l308517
18031B7297193k948837k572624j972737j510346j321529j272410r97975q85035
18023A3815700p37319n38808l75666m37589m85196m74489n26653n96162m24506
18014I219312l28762k85261l45146m77813n32700m28883l00214j45242j10191
18005F265100j67646l09650l57876j75869Q9393l3525j34760n5721k8969k47902
17995D842575k50778k37676j30167P0106K0172p7390k01315k11891j23120J02676
17985C803192J76654K15388K21613J52246J55746Q4006Q4010K61344J33587l5017
17975E252769Q935M9628k5758j62994k22076k31544n4874r9346j93216l29190
$$ y = [89927551, 73830570, 61924099, 52870881, 45564373, 39514197, 34665747, 30605710, 27297193, 24348356, 21775732, 19802995, 18292649, 16971120, 15698710, 14700735, 13815700, 13078381, 12539573, 12163907, 11726318, 11241122, 10766633, 10239980, 9643818, 9219312, 8890550, 8605289, 8260143, 7782330, 7249630, 6820747, 6520533, 6375291, 6265100, 6097454, 5787804, 5429928, 5254059, 5343452, 5309927, 5175167, 5119446, 5090477, 4842575, 4591797, 4354121, 4223954, 4294060, 4314232, 4236842, 4035527, 3823636, 3700516, 3803192, 3979846, 4195234, 4416847, 4569093, 4724839, 4808845, 4892855, 5154199, 5287786, 5252769, 5261704, 5311332, 5285574, 5122580, 4900504, 4668960, 4614086, 4514740, 4321524, 3992334]
17965C992334k79850k25894j71674j18120l1212J22792K14383K01581K74463K12593
17955D191396K55119L14242K84039R2757k0254q3483k94926k78489k60987j59927
17945D039487k63164k9053j5055K4955J5058j20260j72790m0236r7499J3796J38079
17934C493318N7427j14667K8477N610l2768J19472L3475P7882K23616J17369Q3942
17923D093153L1108R2874p054O922K66446J69364K17047l715l30508m22746l75641
17912C737250k63727k18100j37446j58116Q480K1549j16818K8902Q6147O7031
17902C055152J49145M2327Q7137J05168K13114J52829j12605k95984j82792j41275
17892C072216j18718P7922J39533l4620j88921r2927j5102j41910l4703J08015
$$ y = [3992334, 3712484, 3486590, 3314916, 3196796, 3165584, 3288376, 3502759, 3704340, 3978803, 4191396, 4446515, 4760757, 5044796, 5137553, 5117299, 5033816, 4738890, 4460401, 4199414, 4039487, 3776323, 3747270, 3732215, 3757170, 3772228, 3651968, 3479178, 3438942, 3341443, 3355239, 3493318, 3550745, 3436078, 3464555, 3470165, 3437397, 3556869, 3590344, 3668226, 3891842, 4009211, 4093153, 4124261, 4217135, 4210081, 4217003, 4483449, 4652813, 4869860, 4866145, 4535637, 4112891, 3737250, 3473523, 3255423, 3117977, 2959861, 2968341, 2989890, 2873072, 2901974, 2988121, 3055152, 3204297, 3246624, 3333761, 3438929, 3652043, 3804872, 3692267, 3396283, 3213491, 3072216, 2953498, 3031420, 3170953, 3136333, 2947412, 2854485, 2839383, 2697473, 2662770, 2770785]
17882B770785J39614L13279J11862K3013r585L3315N7151Q2484L8694Q9805K08614
17871C859031J77775J26473L26338L94351L76252L64279M30486M64997L51768
17862F871750K57720M18501L94641K872l89291n42381l75557l6320J90621K08615
17852G001171K28137J77320K27601M00079M77734O66114P28459M44542L68121
17843A0719278N31308P59170J207385J751626K356976K612324K460769K540061
17835B4938897L684290N815476R085985J3843671K0597108K7324527K6361915
17828A31651869J3193880J668517K66446n306554j9555996k5640656k0478091
17821G5799415j3069089p861545m433969k380737o04169J105833K823535N279581
$$ y = [2770785, 2910399, 3223678, 3335540, 3358553, 3348968, 3382283, 3439434, 3521918, 3560612, 3650417, 3859031, 4036806, 4163279, 4489617, 4883968, 5260220, 5624499, 6054985, 6519982, 6871750, 7129470, 7547971, 7942612, 7945484, 7556193, 7013812, 6638255, 6601935, 6792556, 7001171, 7229308, 7406628, 7634229, 8034308, 8512042, 9178156, 9906615, 10351157, 10719278, 11250586, 12009756, 13217141, 14968767, 17325743, 19938067, 22398836, 24938897, 28623187, 34438663, 43524648, 57368319, 77965427, 105289954, 131651869, 144845749, 146514266, 146780712, 141474158, 121918162, 96277506, 75799415, 62730326, 54868781, 50434812, 48054075, 47449906, 48555739, 51379274, 56658855]
17813E6658855Q589461J2634499J8294884K7249674M1146275N2973816M0876305
17806B58423769j099335k9598202k2009434J766472K9440125O0495318Q5944435
17799C83363148P1288011n124937p1425892o9311724l3826546K164054K8713431
17792C05839545L6409525K0058867j4803940m2437353m3967039m1953255m3231435
17785A75914915l6964162k6103129j6871721j0110172m679787M50994O566356
17778H8203294J4044589K2107870K6409155J8678374M547358r364l022621j7632397
17770A53326258l0802902k9130599k0988727j3900375r461872o894943n435996
17763C6710844m409485l558440k865823k023359j760617j517212r94002q95551
$$ y = [56658855, 65248316, 77882815, 96177699, 123427373, 164573648, 217547464, 258423769, 257324434, 227726232, 205716798, 207483270, 236923395, 297418713, 383363148, 454651159, 449526222, 378100330, 308788606, 274962060, 277126114, 305839545, 342249070, 362307937, 347503997, 305066644, 261099605, 219146350, 175914915, 138950753, 112847624, 95975903, 85865731, 81185944, 81636938, 88203294, 102247883, 124355753, 150764908, 169443282, 173990640, 173981276, 170958655, 153326258, 122523356, 93392757, 72404030, 58503655, 49041783, 42146840, 36710844, 32301359, 28742919, 25877096, 23853737, 22093120, 20575908, 19581906, 18686355]
17755A8686355p22659l64452M281K03222N23926Q36264J303508J960024K957708
17746B5388177M255284O371454J0054459J5375200K1902355K4952947J7336630
17739A25636506K083010l581816L591614Q034923l184538k1615159k7496252k2045262
17731F1423026j5085822j0067050o846359m878302l491053k826455k298262j731107
17723A4198616j299051p34327n61298k64714L26755J010618J169337J61724j169174
17714A2838486j992767j707210j317596q57723p24717o58938m26687m53502k82384
17705D416962l94733k41374j50192k03555k33286j73326j10125P3083J5703k06895
17695B792262k53332j79672k35415k99157j87171j31897n9148J15218j7644n6036
$$ y = [18686355, 17963696, 17599244, 17603525, 17806747, 18330673, 19166937, 20470445, 22430469, 25388177, 29643461, 36014915, 46069374, 61444574, 83346929, 108299876, 125636506, 127719516, 124137700, 127729314, 135764237, 132579699, 110964540, 83468288, 61423026, 46337204, 36270154, 29423795, 24545493, 21054440, 18227985, 15929723, 14198616, 12899565, 12165238, 11603940, 11339226, 11665981, 12676599, 13845936, 14007660, 12838486, 10845719, 9138509, 7820913, 6963190, 6238473, 5579535, 5152848, 4699346, 4416962, 4022229, 3780855, 3630663, 3427108, 3193822, 3020496, 2910371, 2983454, 2999157, 2792262, 2538930, 2359258, 2123843, 1824686, 1637515, 1505618, 1446470, 1561688, 1544044, 1488008]
17685A488008j06015n7524m8229j32583n7716j8575J6671J23411M343n9729l9111
17674A112951P7686k0748J3363j354q8429k53026l5148Q5351J4351j7899k9713
17663H57385l3457N6428J42910p2138k61719N404P6752M8542p1660K328N6567
17652H07342m0371K6522L8088K0956q1284r9945O6025P8560p7915o0417K1321
17641F98882R2369P8477J21427J1509n5640O6468J04227p6852l4234o002m0363
17630I60268r8727O4683j6482n9178n4363J3348K8770j7736J7301j46476k12726
17619D78682l7147O5161m3690L5170Q0930J13795M0874r6499k750k5397R174N8629
17607F76932q430q8709k1697j06139k6623P7242m3588k5334K21371J29818j8190
$$ y = [1488008, 1381993, 1324469, 1276240, 1143657, 1085941, 1067366, 1084037, 1207448, 1211791, 1152062, 1112951, 1190637, 1169889, 1183252, 1181898, 1093469, 840443, 805295, 890646, 904997, 887098, 857385, 823928, 880356, 1023266, 951128, 689409, 694813, 771565, 820107, 748447, 750775, 807342, 766971, 793493, 831581, 852537, 771253, 671308, 737333, 815893, 737978, 677561, 698882, 791251, 869728, 991155, 1002664, 947024, 1013492, 1117719, 1040867, 1006633, 1000631, 960268, 861541, 926224, 909742, 850564, 796201, 809549, 838319, 820583, 837884, 691408, 478682, 441535, 506696, 463006, 498176, 579106, 692901, 733775, 637276, 634526, 609129, 618303, 676932, 668502, 579793, 558096, 451957, 425334, 502576, 458988, 433654, 655025, 784843, 766653]
17596G66653O1747r9139m491q2201j61557O8407J8011q1995Q16O9329J06477q7361
17584E74696K6741K2517j18739q6048k0448k8131Q1510K8483P638O7885j51061
17573D05043n7468k6019K3281j750N3304k0526j18309l9303K3107r2483K814J64399
17561C16090J39772r8605m0353l8543Q4271Q8389r1906r9878L5048O2086N6948
17550D13319j07681L0605j1557R3915K13172N3338J11960l7026q4123j06080j75412
17539C94430k4044m8349K0629N8859J52605L1304q1984m631J4858l3375n4144
17528D26158k761o9236j10555N9893P734q1059l4494m4407r421j0490r0240j3476
17516B7646J4006m4064Q3211R9340J1455N5906K5411P1345k8474j44078p9658
$$ y = [766653, 828400, 729261, 724770, 642569, 481012, 549419, 567430, 485435, 486251, 555580, 662057, 574696, 601437, 623954, 505215, 419167, 398719, 370588, 452098, 480581, 488219, 556104, 405043, 347575, 321556, 344837, 343087, 396391, 375865, 257556, 218253, 241360, 148877, 151691, 316090, 455862, 357257, 316904, 278361, 362632, 451021, 359115, 259237, 294285, 356371, 413319, 305638, 336243, 324686, 418601, 631773, 685111, 797071, 760045, 675922, 569842, 394430, 370386, 322037, 342666, 401525, 554130, 585434, 503450, 498819, 513677, 480302, 426158, 423397, 354161, 243606, 303499, 311233, 230174, 195680, 151273, 141852, 131362, 41122, 27646, 41652, -2412, 80799, 180139, 191594, 247500, 272911, 344256, 315782, 171704, 92046]
17505I2046O1309Q1816p4196j26713J36846Q0964o9998J11093J9291J4299j14299
17494B12458n0320k1607n4396K7393K10187J27587M4128M5293o7393o9580J01445
17483E05195J38680K11193K73458Q2955k1189N6052j44716j66719L6773m6984
17473I24698j8451P885J89072O3647j00070n9169p9028J31554R7117J01944R9525
17462A358724J16805p8716k67442j7340L1423l6981P1071K44374L77827L20761
17452B120506J42840M035o7249j26941K87586K12963L7228L390o2289n7364o0420
17441B434285q0966K54103L52091Q2118n07610o63885m33882k18638j60919j81264
17431H75433j78407r9788q309m422M5953R2031Q508J3818K9448J78451K92768
$$ y = [92046, 153355, 235171, 160975, 34262, 171108, 252072, 182074, 293167, 312458, 326757, 212458, 162138, 140531, 86135, 113528, 323715, 451302, 495430, 540723, 473330, 403750, 505195, 643875, 855068, 1128526, 1211481, 1190292, 1246344, 1101628, 934909, 971682, 924698, 906247, 914132, 1103204, 1166851, 1066781, 1007612, 928584, 1060138, 1157255, 1259199, 1358724, 1475529, 1396813, 1129371, 1112031, 1143454, 1106473, 1177544, 1421918, 1799745, 2120506, 2263346, 2267381, 2200132, 2073191, 2360777, 2573740, 2610968, 2614358, 2552069, 2494705, 2434285, 2353319, 2607422, 2959513, 3041631, 2534021, 1870136, 1436254, 1217616, 1056697, 875433, 697026, 597238, 588929, 584507, 630460, 722491, 730999, 744817, 774265, 952716, 1245484]
17420A245484J47547J24297J88701J21770P5007j70709k97753l15484l74823j35336
17410F08701K2634J20117p9124M5435J61629J73392K52291K57419K24938R0917
17400A878349J59966L9556j43864k51304k77597k81782j93443j70119k08620k01244
17390C49898j22994q613M5295L2740q5820j1110J1878O3525L337q1782J3087J56142
17378C65583n0242q8686r8768J07898O461P103N7528l7431j23116M7667J03045
17367B97042J16793J25089O6697j95427j51020l7095K5149L6237j79598M8068
17357A51935P4140j71334M6127J66209J43920O8377r561J09024M8936j1385k402
17346F13986j02503r4973j0418k1880q9137j31899n5889j67431q3247J56466J40947
$$ y = [1245484, 1393031, 1517328, 1706029, 1827799, 1902806, 1732097, 1434344, 1118860, 744037, 608701, 631335, 751452, 672328, 717763, 879392, 1052784, 1305075, 1562494, 1787432, 1878349, 2038315, 2077871, 1934007, 1682703, 1405106, 1123324, 929881, 759762, 551142, 349898, 226904, 218291, 263586, 296326, 210506, 199396, 211274, 274799, 278136, 196354, 209441, 365583, 315341, 226655, 127887, 235785, 242246, 249349, 306877, 269446, 146330, 193997, 297042, 413835, 538924, 605621, 410194, 259174, 222079, 247228, 283465, 103867, 151935, 226075, 54741, 100868, 267077, 410997, 479374, 469813, 578837, 627773, 616388, 613986, 511483, 416510, 406092, 384212, 295075, 163176, 107287, -60144, -143391, 13075, 154022]
17335A54022Q987O3843j4332P1689r784j02947J368M3105l177J4622R0871N1521
17323C69788L8685K5003k3957J12218j6744k0847N8117J03652Q2327N6238j03850
17312F80630Q7392J44830O3131q2265j79557j66885l5719J5881j5051n1396o7207
17301C93784J0780L6230M3942j21881n0706J9550O0465Q1702R3034K21854J66795
17290I55549J35207J37311J07362R8981j53356j46013j74257p3428j3987M8008
17280I21377J8038J16010J44990N859k5941K03344K91309Q3054J79827J53o1565
17269A876455k54592k43318k34482j33689j53491M6843J48402R0323N2000J24212
17259A318663J9902k0707J1977j80317j89776j65080j32861k6444p7261k9042
$$ y = [154022, 163009, 226852, 212520, 284209, 274425, 171478, 172846, 215951, 212774, 227396, 318267, 369788, 408473, 433476, 409519, 521737, 504993, 484146, 542263, 645915, 728242, 784480, 680630, 768022, 912852, 975983, 893718, 714161, 547276, 511557, 527438, 512387, 460991, 393784, 404564, 440794, 484736, 362855, 312149, 331699, 392164, 473866, 566900, 788754, 955549, 1090756, 1228067, 1335429, 1434410, 1281054, 1135041, 960784, 887356, 873369, 921377, 939415, 1055425, 1200415, 1206274, 1180333, 1383677, 1674986, 1758040, 1937867, 1938020, 1876455, 1621863, 1378545, 1144063, 1010374, 856883, 903726, 1052128, 1142451, 1194451, 1318663, 1338565, 1317858, 1329835, 1149518, 959742, 794662, 661801, 635357, 558096, 529054]
17249E29054m8048k194m035L6O8174l7150P0524j64239l6335L9474l018l1669
17237C80574m4854K607k9063L5404J59906J82305L7341O7748J50328J88359K84025
17226A414680L58605K93150J56390l8342q1706j28020j32257k68201l12743r5055
17216A166501j39069j14830j8619j44426n1708K8741J60451K08603K41739L26009
17206A663392K90050M2721l1756l1963J161O461L2062j3881k5932j88963j58378
17195A584974l8584J50702K28694L06927K05703j80049l22885l03155j66258p6423
17185A389646l3094m0100J20343j2614j49936j57774k37255k2219n6476j5028
17175G85493k2640q7197l9303J5279r0425o8622N417M6625m9529K3647l4000o8856
$$ y = [529054, 481006, 478812, 474777, 474813, 542987, 505837, 576361, 412122, 375787, 415261, 412243, 380574, 335720, 338327, 309264, 344668, 504574, 686879, 724220, 791968, 942296, 1130655, 1414680, 1773285, 2066435, 2222825, 2184483, 2102777, 1974757, 1842500, 1574299, 1261556, 1166501, 1027432, 912602, 893983, 749557, 697849, 726590, 887041, 1095644, 1337383, 1663392, 1953442, 1996163, 1964407, 1932444, 1933605, 1940066, 1972128, 1958247, 1932315, 1743352, 1584974, 1546390, 1697092, 1925786, 2232713, 2438416, 2258367, 1935482, 1632327, 1466069, 1389646, 1356552, 1316452, 1436795, 1424181, 1274245, 1116471, 879216, 856997, 800521, 785493, 762853, 675656, 636353, 651632, 561207, 492585, 498002, 544627, 495098, 518745, 484745, 415889]
17163D15889k5200K4334M346j6533m6457K0060J24023P5254l0044m8067L148J05057
17151F05810J85383K00466J40927J63158K45267K16934L10388J04602j11059j74392
17141A887484k40906l30494j35629j55168m6561j97998k10220j03817r444M6833
17131E04080J19637J41964L73666J88448N0887K1866j41308k33907j19210o3621
17121H42502p7046M4759q3266J841r3627k3768j880N0528R6703j4004m4504M6834
17109G45072r2571L1597J6622p2447j39528o6641J50686J88750J70590J88654
17099A120784J35011K08147K18934J07706M6415j3964j60717L6064L6658n5309
17089A679729j50126j47161j13933K5761K0480n3083M341L1089J52992J40242
$$ y = [415889, 390689, 415023, 419369, 402836, 356379, 376439, 500462, 575716, 545672, 497605, 500753, 605810, 791193, 991659, 1132586, 1295744, 1541011, 1757945, 2068333, 2172935, 2061876, 1887484, 1646578, 1316084, 1180455, 1025287, 978726, 780728, 570508, 466691, 457247, 504080, 623717, 765681, 1139347, 1327795, 1378682, 1400548, 1259240, 1025333, 906123, 842502, 765456, 810215, 726949, 728790, 635163, 611395, 609515, 660043, 756746, 742742, 698238, 745072, 652501, 684098, 700720, 628273, 488745, 422104, 572790, 761540, 932130, 1120784, 1255795, 1463942, 1682876, 1790582, 1836997, 1823033, 1662316, 1698380, 1735038, 1679729, 1529603, 1382442, 1268509, 1294270, 1314750, 1261667, 1266008, 1297097, 1450089, 1590331]
17079A590331J62825J41039J93279J23337K1177J22720N5201j17549j88480k19666
17069A884214k77221j14418j38748o7607j05208q2254k7478P2327M4535M269m8872
17058A143539q6218K6246K5236k5127R8117L387k0337M2358N7131R0603m4129
17047A310806k0426O0285K5708J54583N1014J58243J58331M2361j53435k19103
17037A568367j63694k2864j3172L0789J00948j14507J26247J30834M0822O061
17027A689831P0306J67366K25875J31174M8728j6925o4022n5663Q84J62717J9405
17016B379676m0652k1465p6380l7916J8006Q8572R2756m4805j0385N8180J93204
17005B598791J79500K48587J54147J70434J19864J31071J91845L04193K96626
$$ y = [1590331, 1753156, 1894195, 2087474, 2210811, 2231988, 2354708, 2409909, 2292360, 2103880, 1884214, 1606993, 1492575, 1353827, 1286220, 1181012, 1098758, 1071280, 1143607, 1188142, 1192411, 1143539, 1057321, 1083567, 1108803, 1083676, 1181793, 1185180, 1164843, 1207201, 1264332, 1354935, 1310806, 1290380, 1350665, 1376373, 1530956, 1581970, 1740213, 1898544, 1940905, 1787470, 1568367, 1404673, 1381809, 1368637, 1399426, 1500374, 1385867, 1512114, 1642948, 1683770, 1689831, 1760137, 1927503, 2153378, 2284552, 2333280, 2316355, 2252333, 2196670, 2197554, 2360271, 2379676, 2339024, 2317559, 2241179, 2203263, 2221269, 2309841, 2402597, 2357792, 2347407, 2405587, 2598791, 2778291, 3026878, 3181025, 3351459, 3471323, 3602394, 3794239, 4098432, 4395058]
16996D395058K75837K45191L06538M37017L65925M93594N54226P73379N25655
16987H372420O93168J016498J175677J517930J875096K498434L542668N262895
16979B5954786Q331384J2937886J7973001J8409326J1039381P820354J0409942
16972A12876060J372045j7216039k2870186j6302172r144889m240452o21417K365785
16964D6218735N702664J0556651J8323822L0544030M4580756M5928393J8732152
16957B20587203p855284p003181r659665l1077864m0526739l1174796j9309687
16950G3979987j1163611o008254k295710J648199O657208J4013230K5070907L7852901
16942A39754857L6929347K939056l5399934m0196899k7999786j7417516j0836276
$$ y = [4395058, 4670895, 4916086, 5222624, 5659641, 6025566, 6519160, 7073386, 7846765, 8372420, 9065588, 10082086, 11257763, 12775693, 14650789, 17149223, 20691891, 25954786, 34286170, 47224056, 65197057, 83606383, 94645764, 102466118, 112876060, 114248105, 97032066, 74161880, 57859708, 48714819, 44474367, 43852950, 46218735, 51921399, 62478050, 80801872, 111345902, 155926658, 201855051, 220587203, 212731919, 205728738, 196069073, 164991209, 124464470, 93289674, 73979987, 62816376, 56808122, 54512412, 56160611, 62817819, 76831049, 101901956, 139754857, 176684204, 179623260, 144223326, 104026427, 76026641, 58609125, 47772849]
16935D7772849o938052m996067l431759j955238q35915L15735J748217M105008
16927C5784778P797734J2408186J3939701M568345r879445j3751199r648741n244070
16919C5975289k095985P753J869750M699146Q336088J0262442P526283L898160
16911G0478926P429559J5190305J5501999r31608j7414028j7408359j0089898
16904F2756896l764052P74351M867987R702047J6903299K8589165M4711001N4801854
16896B19342548L6458836r16298p638330J8530801M5819630N0533482L3760296
16889C95890965k052748n1086381p9256563p2583261n0362674l2389416k1396853
16882H6763069j4538538j0078668o674472m064873j917471L42933L151460P727790
$$ y = [47772849, 40834797, 35838730, 32406971, 30451733, 29615818, 29931553, 31679770, 35784778, 43582512, 55990698, 69930399, 74498744, 64619299, 50868100, 41219359, 35975289, 33879304, 33887057, 35756807, 40455953, 48792041, 59054483, 66580766, 70478926, 77908485, 93098790, 108600789, 107669181, 90255153, 72846794, 62756896, 58992844, 59767195, 64635182, 74337229, 91240528, 119829693, 164540694, 219342548, 255801384, 254885086, 247246756, 265777557, 311597187, 362130669, 395890965, 393838217, 342751836, 263495273, 190912012, 140549338, 108159922, 86763069, 72224531, 62145863, 55471391, 51406518, 49489047, 49831980, 52983440, 60711230]
16874F0711230J4500449K1552776K1488899O553432j7042158k7410960k1822167
16867E8531501j4213805r196345o113462m298097k962686j951258j605283j415893
16859A6774672j161681q55112r71749q07859m97959m12567k08662j74825j06492
16850A1577766J5058k7111L86850P06355J114050J747252K812543M334442O849711
16841B9516916J0949154J7821381K7386368L1582012J2432427k0449435l1270138
16834G7968685k3256578j4239851q679152n587306l625630k147411j020829J50489
16826A9562417J158237K612656N133490R104146J4630364J8305924J0182085r822304
16818G0867015j9507563j5823837r993534o199190m128891k809244k032249j512123
$$ y = [60711230, 75211679, 96764455, 118253354, 124806786, 107764628, 80353668, 58531501, 44317696, 35121351, 29007889, 24709792, 21747106, 19795848, 18190565, 16774672, 15612991, 14757879, 13786130, 12978271, 12480312, 12067745, 11859083, 11684258, 11577766, 11592824, 11565713, 11952563, 12658918, 13772968, 15520220, 18332763, 22667205, 29516916, 40466070, 58287451, 85673819, 117255831, 129688258, 109238823, 77968685, 54712107, 40472256, 31793104, 26205798, 22580168, 20432757, 19411928, 19562417, 20720654, 23333310, 28466800, 37570946, 52201310, 70507234, 80689319, 70867015, 51359452, 35535615, 25542081, 19342891, 15214000, 12404756, 10372507, 8860384]
16810H860384r81113o63604l58159l29406o82038p10640n21315m24072n04301
16801C685736l85616l74187l19770q0253j86521k41866j75442p4851k0479n8917
16791A767834M8970k6142j04384j54290j07170j49542j59450o0225k4970j60869
16781H69762j32367k1293r478q7014j01830n2397O7787J35659J16858j5385l1495
16770G38807l0461R2594p7051p8108r5966p1111j92916j02393q099m0269l2126
16759A02901J03538Q0218o986o1091M5578P1057O634j6466r1924O2518J90934
16748D86911P6457r7674q7400O0011p2513k0740M0685q0722o1720j8689l7404
16737A87202J4531O2828q1144j71632j1157j5807J5416P4203N4284R1539J262
$$ y = [8860384, 7879271, 7215667, 6857508, 6528102, 5846064, 5135424, 4614109, 4190037, 3685736, 3300120, 2925933, 2606163, 2525910, 2339389, 2097523, 1922081, 1847230, 1826751, 1767834, 1816804, 1790662, 1686278, 1531988, 1424818, 1275276, 1115826, 1055601, 1030631, 869762, 737395, 716102, 706624, 619610, 517780, 465383, 533170, 668829, 785687, 770302, 738807, 708346, 800940, 723889, 645781, 549815, 478704, 285788, 183395, 175296, 135027, 102901, 206439, 286657, 279671, 218580, 264158, 335215, 341849, 325383, 233459, 295977, 486911, 563368, 465694, 378294, 438305, 365792, 345052, 385737, 305015, 243295, 224606, 187202, 201733, 264561, 183417, 11785, 628, -15179, 237, 74440, 128724, 220263, 221525]
16726B21525O497l3577P1166M629M3866J6640p5066k5553M69j002m7748K2654
16714B04500J08419K8221j10138j21338p6198K9873q01J61951O011j58268r367
16703F2865N0503Q4188Q6894m7627q5072n4907R9530j5407k6315O4824l5692k09303
16691b5519j20224L6830J83500O8465l0609j04196R963m1642N8239J40458L2882
16680B08147p0106q9116J3268J08166M0457r8820q2480M985J8289L4277N821r7224
16668d336q7475p7200J0660J16966K18645M1641o5035j29338k3848o5938K8111
16657c7147J20998j8502j21488k2900q7469Q3172k4549L5531j5328q7448J01726
16646g3404K34579N0165q542R5273j2471j6554o3906M8671m9395j27019j28088
$$ y = [221525, 228022, 194445, 265611, 270240, 314106, 330746, 255680, 230127, 230596, 229594, 181846, 204500, 312919, 341140, 231002, 109664, 33466, 63339, 62538, 224489, 230500, 72232, 62865, 113368, 197556, 284450, 236823, 151751, 96844, 196374, 180967, 154652, 219476, 183784, -25519, -145743, -108913, 74587, 143052, 112443, 8247, 18210, -23432, 34807, 175265, 208147, 138041, 48925, 62193, 170359, 210816, 111996, 29516, 34501, 52790, 87067, 92888, -4336, -91811, -169011, -158351, -41385, 177260, 218901, 153866, 24528, 680, -65258, -37147, 83851, 65349, -56139, -79039, -166508, -83336, -107885, -72354, -87682, -175130, -73404, 161175, 211340, 202798, 298071, 285600, 269046, 205140, 253811, 204416, 77397, -50691]
16635e0691j14511J02732J19040K1355R018M1683o4029m5339K7555n5749l7768
16624d6704m2563M6005o0417l6794R5400O987j33873l7016p3190J30843j3655
16613a64977J06657J19506m8720j85282p0450O7460q8617K2132K79443j1371j47138
16602a21357j533l0108K2119N9351j8099m4471k5959k8068R6903k2375l4451N5710
16590i2338N3823q5166P588N0441K2811R928j9569n811M3510J37379N1488j00823
16578G3261q4637m6978n9673O0076R1136l3364j17204j33611o1045P1158J48935
16567i1946J27084M9982l2737m8046j17203n2092j5239k9009R0066R6285j06063
16556a28918n8149J2610m0281J00567J61410l7261j78204P5162O4836k4458j3690
$$ y = [-50691, -165202, -62470, 56570, 77925, 86943, 128626, 64597, 19258, 46813, -8936, -46704, -89267, -43262, -103679, -140473, -45073, -38086, -171959, -208975, -282165, -151322, -164977, -58320, 61186, 12466, -172816, -243266, -175806, -264423, -242291, 37152, 25781, -121357, -122890, -152998, -130879, -71528, -89627, -134098, -160057, -188125, -91222, -113597, -148048, -92338, -38515, -123681, -116093, -65652, -42841, -32913, -52482, -58293, -14783, 122596, 174084, 73261, -11376, -58354, -118027, -57951, 33185, -179, -117383, -250994, -312039, -240881, -91946, 35138, 85120, 52383, 4337, -112866, -164958, -180197, -209206, -119140, -22855, -128918, -187067, -174457, -214738, -114171, 47239, 9978, -168226, -93064, -28228, -52686, -66376]
16545f6376J00720K7352j24817o2764M4991o8040J2771R0222p3984J4928P5350
16534b9647K563N3789J8162j14433o9982J7232J04724k4565j02914j0676N4637
16523a01110K0338N4605Q8618o9783l9991n7095J2836J10424M2116p2441j2188
16512b3671m7114J01510Q4727N0195j2292k6584k8779m4871r0861j25561j7888
16501a81189P0859j5637O3292P1597l3282n1219N2696l0173p0493K8926K6092
16490f8531k0188R4212L1872l4671J7171P0026l0346j9410M9147P7553K6101l4881
16478A58055J607J44578P4709j77468j65841m9469J16223R4309r6094m8254m1266
16467A1089k3558L0194K6739J38070J79133K70346K73577Q4208j13050j85905
$$ y = [-66376, 34344, 61696, -63121, -125885, -80894, -148934, -136163, -45941, -119925, -104997, -29647, -27084, 26705, 44867, -69566, -139548, -122316, -17592, -42157, -145071, -155747, -101110, -80772, -26167, 62451, -7332, -47323, -104418, -91582, 18842, 60958, -11483, -23671, -70785, 30725, 115452, 165647, 153355, 126771, 97992, 53121, -37740, -163301, -181189, -110330, -125967, -62675, 8922, -24360, -75579, -22883, -53056, -123549, -94623, -68531, -88719, 5493, 37365, 2694, 19865, 89891, 59545, 40135, 89282, 166835, 192936, 158055, 159662, 304240, 378949, 201481, 35640, -13829, 102394, 196703, 100609, 52355, 11089, -12469, 17725, 44464, 182534, 361667, 632013, 905590, 989798, 876748, 690843]
16457F90843j44158m6654r2655r4849j38144j05850j23424J08232K55093J34532
16447D42966O3086N0757J38680Q1708K8017N0883j83954k90321j25134m3441j21971
16436I1276k2313J7835J03769J5835r7100o5999j02560m6447j7824l2803p8912
16425b35243l9457j0751J16761j1334q7773J02822Q4325M4307j04718N8972J42670
16414F0581N8979K05262J24059J35216q0627j42444L2284j22010j28253j50417
16404g370l4219J44030K04706l312M4479K26692K78460J82881j1091Q1321p912
16393A098665k07313j36540j51826k67970j20860j36668J8051O1066O9337J61957
16383C87899N3245J31105J94592K10980O2082j20383j35819j96224k25653q5461
$$ y = [690843, 546685, 500031, 407376, 312527, 174383, 68533, -54891, 53341, 308434, 442966, 506052, 556809, 695489, 777197, 805214, 856097, 672143, 381822, 256688, 213247, 91276, 68963, 86798, 190567, 206402, 109302, 43303, -59257, -105704, -123528, -156331, -235243, -274700, -285451, -168690, -180024, -267797, -164975, -80650, -36343, -141061, -82089, 60581, 119560, 324822, 448881, 584097, 503470, 361026, 393310, 271300, 143047, -7370, -41589, 102441, 307147, 303835, 348314, 575006, 853466, 1036347, 1025256, 1106577, 1098665, 891352, 754812, 602986, 335016, 214156, 77488, 95539, 156605, 225942, 387899, 441144, 572249, 766841, 977821, 1039903, 919520, 783701, 587477, 361824, 276363]
16373B76363m1702R155M4918k5035j72947j3646N2118N7091J307j5153K9743J37830
16361C40042L04643J74739Q5847j20957R833q1074k23245J0143Q8209j17293j03074
16350C67813p5321J3829j18109Q452P3354P2861J48821K14375n6872n9410J17796
16339G07589J37135k0947k27808j29865j89185j14265n5371k0904o5613J4979
16329C5745l860j2767j04241p3998m9204n2181M7437M2249J0468j1031J96944
16318B5561l2521n9899j16198k0817K8839R7687J6452J18365l357Q6967J26453
16307B67532K09292L905K6418q8362j07943j53650K452K9380J9664n563r5678
16296A07447J1937Q5992o0387j374J23005Q5885J21758R2777L4264j61905j03942
$$ y = [276363, 234661, 243816, 288734, 263699, 90752, 77106, 129224, 186315, 187622, 172469, 202212, 340042, 644685, 819424, 905271, 784314, 794147, 713073, 489828, 499971, 588180, 470887, 367813, 292492, 306321, 188212, 196664, 270018, 342879, 491700, 706075, 649203, 589793, 707589, 844724, 823777, 595969, 466104, 276919, 162654, 107283, 86379, 20766, 35745, 31885, 19118, -85123, -159121, -208325, -260506, -213069, -170820, -160352, -171383, 25561, -6960, -66859, -183057, -203874, -175035, -77348, -60896, 57469, 54112, 141079, 267532, 476824, 480729, 507147, 418785, 310842, 157192, 159644, 189024, 208688, 203125, 107447, 119384, 205376, 144989, 143615, 266620, 352505, 474263, 567040, 601304, 439399, 335457]
16285C35457j02367j44283j11882m5571j1196n7744J7391N5249L7990J13647l6161
16274E0530j12401J3713k5757n8350o6070J06375J05334j09663r9405L622q5067
16263b77139J24744J10141J29423J7933m7880j4592n2348J849L2891j7423O2328
16252F9927N609N8959l7377J9760q3529j00548p8864K8723n6521q0864N6520O7731
16240a30474l1907m7409n1473L4941p0535L7451l9194j2615j1213J16125P7145
16229a29158l0942k8669k7614r5468O4472P7643J0793n2264k7633o9598O7257
16218b41181P2730J79438J3359K0560Q2799r9526p6080k5917J3733k8772N3247
16207c5610O5681j19296j60583Q1687J16907J3191M0639p8987j12962p8180Q6156
$$ y = [335457, 233090, 88807, -23075, -68646, -79842, -137586, -120195, -64946, -26956, 86691, 50530, -61871, -48158, -73915, -132265, -198335, -91960, 13374, -96289, -195694, -192072, -277139, -152395, -42254, 87169, 105102, 57222, 42630, -9718, -7869, 25022, 7599, 69927, 75536, 134495, 97118, 116878, 33349, -67199, -146063, -117340, -173861, -254725, -198205, -130474, -162381, -209790, -261263, -226322, -296857, -259406, -298600, -311215, -322428, -206303, -129158, -160100, -188769, -216383, -311851, -247379, -169736, -158943, -211207, -238840, -308438, -241181, -168451, 10987, 24346, 44906, 127705, 28179, -47901, -73818, -60085, -88857, -35610, 30071, -89225, -249808, -168121, -51214, -38023, 2616, -76371, -189333, -267513, -181357]
16196a81357J99068O9433O8508M3139o0750j1274o3764q8642J9063J1500o0158
16185e5234l1970k6729K2479o2931n7835N5190J9115Q7260R5385r37k6346l3312
16173a5865q0947J543k6934J3967L0084R0277M4390j06669J8056P6177l8615j35720
16161a30256L8634l6349o5023J25163J2256L9993k9291p9380J15238O052p7791
16150h0754l3438q1250m2524M5517O9041p93M8136N8132q1925q7308o294k5843
16138b19303n4281J26183R5033Q473N5322r3916q8280j3684O120L7150m1910L9081
16126a44012J07939J6823L1543j8302r513l7442l686K7473m4278k4874L2638m329
16114g0020j61252k8314O0535J21493J01569q8281m4159O6346K7564o9080j00285
$$ y = [-181357, 17711, 87144, 155652, 198791, 138041, 126767, 63003, -25639, -6576, 4924, -55234, -87204, -113933, -91454, -154385, -212220, -157030, -137915, -50655, 44730, 43793, 17447, -15865, -96812, -95269, -122203, -108236, -78152, 12125, 56515, -50154, -32098, 44079, 5464, -130256, -91622, -127971, -192994, -67831, -55575, -15582, -44873, -124253, -9015, -2963, -80754, -114192, -195442, -237966, -192449, -123408, -124201, -76065, -17933, -99858, -187166, -193460, -219303, -273584, -147401, -52368, -43895, 11427, -82489, -170769, -184453, -178333, -141183, -183093, -144012, -36073, -19250, 12293, -6009, -15522, -52964, -56650, -29177, -73455, -98329, -65691, -70020, -231272, -259586, -199051, -77558, 24011, -64270, -108429, -42083, -14519, -83599, -183884]
16103a83884p6193L5393K4086J8737m8029l4702K17375l4143K421l5519K4504
16092h9954m4263j4477J14101N7293j40075O0335K9170q3273R8560r2958j5267
16081a20808O4061K7893N2554j6197K8251O1758M0768j0132K5337p1577l7085
16070D4823q9314j56722N273k8452j8555P5980l1346J2306Q2939Q7503L8927N256
16058B8618n6779k2477l5300M5833m8089J8632p6287K8170J8073k2201M6847Q5166
16046A0206q5756j0681Q7831Q349L5400n4727k0422J3043J08878O1895j4628o8063
16034G1325Q248j6131o4629Q732J1887k009m6862M783j17280j30235p304O7025
16022b12450Q5765J0840n0884r8502p1678J63001J69842N1431o480J26415M3199
$$ y = [-183884, -260077, -224684, -200598, -181861, -229890, -264592, -47217, -81360, -78939, -114458, -89954, -134217, -148694, -34593, 22700, -117375, -57040, -27870, -111143, -12583, -105541, -120808, -56747, -28854, 23700, 7503, 35754, 97512, 138280, 128148, 153485, 81908, 44823, -44491, -201213, -195940, -224392, -242947, -166967, -198313, -186007, -103068, -15565, 23362, 28618, -28161, -50638, -85938, -40105, -88194, -69562, -145849, -117679, -99606, -121807, -74960, 10206, -75550, -86231, 1600, 9949, 45349, -9378, -29800, -16757, 92121, 154016, 139388, 71325, 79573, 63442, -1187, 7545, 19432, 17423, -29439, -24656, -141936, -272171, -279475, -212450, -126685, -115845, -166729, -265231, -336909, -173908, -4066, 47365, 40885, 167300, 210499]
16011B10499j22727q4431J857J58947J94990O8822k5666m4599q5393R8100K07501
16000E77900j9857K8443J09330J68266O4684J66840J60045J84755P1463p124J94611
15989A699356J27694j08592p9795K5033l1472J44001Q1160M362l4897p0591k52413
15978A503846j43367j72223k14211l0482j38222r161J324n8981q1006j90485j00898
15967C66134l1969K7579N152q2049O3283N3902j37160j91372p5689J480l2081
15956c2790K7834N1150K3170l9245j2516Q5199J7460j9427n6141L557L7343r9381
15944a3787K0005P8826n4183M871n6543P0389K6131J06109k7198q4994p9215m8928
15932e8517Q8992p4574j15125j16816j7871J15655R9538L5022k2034J897L7591
$$ y = [210499, 87772, 3341, 5198, 164145, 359135, 427957, 402291, 357692, 272299, 370399, 577900, 558043, 586486, 695816, 864082, 928766, 1095606, 1255651, 1440406, 1511869, 1504745, 1699356, 1827050, 1718458, 1638663, 1663696, 1632224, 1776225, 1857385, 1861747, 1826850, 1756259, 1503846, 1360479, 1188256, 974045, 943563, 805341, 796180, 797504, 738523, 657517, 467032, 366134, 334165, 361744, 366896, 284847, 348130, 402032, 264872, 73500, -2189, -709, -32790, -4956, 46194, 69364, 30119, 17603, 102802, 120262, 100835, 44694, 48251, 85594, -13787, 6218, 85044, 30861, 35732, -20811, 49578, 75709, 181818, 154620, 69626, -9589, -58517, 30475, -44099, -159224, -276040, -293911, -178256, -78718, -43696, -65730, -63833, -26242]
15921b6242j0890j00412p1154L266L8025O5660J4367J5381L3405p2827n9634j4442
15909a85497m7113k6992P7206o3261J2974J79428q0801j04988Q7067L9219k1259
15898a34017l8749j38985l7234J87342K04337j00966j28478j3055O7552K2054
15888a10199J35598N5320j12006j15486l5610l5013O8021j9877P8259m4N6698
15877c4339j0804M7246M4231j18952j8072R3008Q0358l8711j99401k5436J06011
15866g4861J52078Q6914n7384j01943J1166o1457J24337K6447j99247N702P1909
15855a6339K6037J0561o8820p1836L2459J67864k0821j7317r7941j28385L5112
15844a49426O7844J27529r172p0662j01486l0902l7230J04999J65969O2764J0354
$$ y = [-26242, -37132, -137544, -208698, -205432, -167407, -101747, -87380, -71999, -38594, -111421, -171055, -185497, -232610, -259602, -182396, -245657, -232683, -53255, -134056, -239044, -151977, -112758, -134017, -172766, -311751, -348985, -161643, 42694, -58272, -186750, -199805, -132253, -110199, 25399, 80719, -31287, -146773, -182383, -217396, -149375, -169252, -90993, -91037, -34339, -45143, 2103, 46334, -72618, -90690, 2318, 82676, 43965, -155436, -180872, -74861, 77217, 164131, 106747, 4804, 15970, -45487, 78850, 105297, -93950, -88248, -16339, 9698, 20259, -48561, -120397, -87938, 79926, 59105, 41788, -56153, -184538, -149426, -81582, 45947, 36775, -33887, -135373, -166275, -203505, -98506, 67463, 130227, 140581]
15833A40581n9452n8132J018P982K7504J9187o6326l8336k5334Q6303K4082j69958
15821a10881j18427J6068j6459l2854K9757L0446J6907J152K8698R4379M3398
15810a7816k7287k8117k700O7181j662O3620o7853j8566Q3089r7841o2011j55183
15798b65146j03443k7447J60671J94493P9001M9079L4068n2778k8359j12298k1568
15787i3727l302M5209J8497J40008M2981L533O8742J6446k5262j13376j18812
15776a9063J3826M0477j4942J3927o0734o5541O359J5952j8056p3072l4500O0145
15764a35222n9612K2238P3915k5468m4966m70J44554L5985q5888j15097M6967
15753a43064J145l2402N8938M7906M5754j7140q5435L841m0361J00761J56186
$$ y = [140581, 81129, 22997, 24015, 31997, 59501, 78688, 12362, -25974, -51308, 34995, 59077, -110881, -229308, -213240, -229699, -262553, -232796, -202350, -185443, -184291, -155593, -61214, -17816, -45103, -73220, -75920, -8739, -10401, 53219, -14634, -33200, 49889, -47952, -109963, -265146, -368589, -396036, -235365, -40872, 38129, 87208, 121276, 68498, 40139, -72159, -93727, -97029, -51820, -33323, 106685, 149666, 153199, 221941, 238387, 213125, 99749, -19063, -5237, 35240, 20298, 34225, -26509, -92050, -85691, -69739, -87795, -160867, -195367, -135222, -194834, -172596, -98681, -124149, -169115, -169585, -25031, 10954, -74934, -190031, -143064, -141919, -174321, -115383, -67477, -21723, -38863, -124298, -120457, -160818, -60057, 96129]
15742I6129m7132j30269r7500L3127m4738J5749O436M2807k0802q4731k7697K3410
15730b35211K2083O9573Q253j8914M7648J1437j04565j5042O9915O7760r1777
15719a68840R441J9323o5080l7520K8154N207j3076K5577q6293j08808Q397J72207
15707b11311O9891L7743j4503m583J19757P3141N841j03056j44718O1603L5349
15696g4846Q7991r3930o9151P175o4414j31114k8237J74893p276p0839O057J51695
15684a11996J07704N5942J76584p1478k4007m9217J6618O4600l71j25148n8109
15673a8878J9130r3795o4019O4200q1207l0214q86J09335J26712o4109q9982N1392
15661g2321o1414j27074N3505M4578o6141J4390n327j7307K1244J00924J49147
$$ y = [96129, 48997, -81272, -178772, -145645, -190383, -174634, -168198, -125391, -146193, -230924, -258621, -235211, -213128, -143555, -135302, -154216, -106568, -95131, -199696, -214738, -144823, -77063, -168840, -159399, -140076, -205156, -242676, -214522, -209315, -222391, -196814, -283107, -391915, -383518, -211311, -141420, -103677, -118180, -122763, -3006, 70135, 75976, -27080, -171798, -110195, -74846, 13145, -80785, -149936, -142761, -207175, -338289, -366526, -191633, -198909, -269748, -263691, -111996, -4292, 51650, 228234, 156756, 132749, 83532, 100150, 164750, 164379, 39231, -18878, 252, -93543, -157562, -93362, -174569, -204783, -205669, -96334, 30378, -33731, -123713, -72321, -133735, -260809, -207304, -162726, -228867, -214477, -219804, -237111, -215867, -114943, 34204]
15650C4204K5479r0923r8025q2068j27203J32203J48617m5399m3223R670M0108
15639i6560r0301o3523J12488O9764P7544K5680m0911M1222L7714j16852r2645
15628a36380J22666N4842k6291o3929j9357Q9020q5874p9159K1379K50612J05746
15617B33275k9950j79560o9700n5771K121P6822q1936j66874Q3322J48443R291
15606c0517q2012P3823L083k7796o1704k8219N3699L849J20493J4453n6106j05270
15594a22224n4848q1232l6132O788L1217J07938P4132M6186J3958m0714k290k7408
15582h4629L3546K15717l0520k50138l147J1779L7193l9198M1178k862L5887p4364
15570a09558q7107k8575L2130J47310J8049j06171j09130J84594J26632k9131
$$ y = [34204, 59683, -31240, -129265, -211333, -338536, -206333, -57716, -103115, -146338, -136668, -96560, -186861, -250384, -137896, -68132, 9412, 35092, -5819, 35403, 73117, -43735, -136380, -13714, 41128, 14837, -49092, -68449, 20571, -65303, -144462, -123083, 127529, 233275, 203325, 23765, -45935, -101706, -99585, -22763, -104699, -271573, -188251, -39808, -30517, -112529, -38706, -35623, -63419, -125123, -153342, -99643, -95794, 24699, 39152, -16954, -122224, -177072, -258304, -294436, -287648, -256431, -148493, -74361, -28175, -14217, -54931, -57221, -84629, -51083, 164634, 134114, -116024, -119171, -107392, -70199, -109397, -68219, -71081, -35194, -109558, -196665, -225240, -193110, -45800, -27751, -133922, -243052, -58458, 68174, 39043]
15560C9043n8142j08106m295J73781M557j27058p2640O7237O7685J6166j7989
15549a9761j45613n8163M1842p0931l0967Q7508j439l9650j7891q5265Q5964J28555
15537a25811R5828J3978l2119j00439o620K570r093R6957L8178p7041o1692l015
15525a68319n2375J9727Q1546J5260m8748K9873M5220k1714J8684k8959n3761
15514a63566J19831m337K9442J83464j94897j63619K2564o0561O993J6230J5341
15503a93115m8916N2680N2338Q3035J53632l6019j88144j6629j8922P507R6836
15492e5717j91081m2336j9652K92288K23204j11528j20200R315N519J12476n5398
15481D6890l2684K2648J08864q7618j33412P5632M8903Q2430j738k0675j02856
$$ y = [39043, -19099, -127205, -131500, 42281, 46838, -80220, -152860, -85623, -17938, -1772, -19761, -165374, -223537, -181695, -252626, -283593, -196085, -197524, -237174, -255065, -340330, -254366, -125811, -29983, -16005, -48124, -148563, -155183, -152613, -161706, -64749, -26571, -103612, -165304, -168319, -220694, -200967, -119421, -104161, -152909, -123036, -77816, -99530, -80846, -109805, -163566, -43735, -48072, -18630, 164834, -30063, -193682, -171118, -231679, -224686, -208456, -193115, -242031, -189351, -137013, -53978, 99654, 63635, -124509, -141138, -160060, -152553, -55717, -246798, -289134, -308786, -16498, 206706, 95178, -25022, -15707, -10188, 102288, 46890, 14206, 36854, 145718, 58100, -75312, 320, 49223, 131653, 129915, 109240, 6384]
15470F384J6409L9834Q6318R6896o5545j5088p2303q2045j77967o86P6103K6922
15458f4768P923L5076o7062K2171J9462m3599Q405J95603J0190j01044J9408m4747
15446b982k4658L798o5747N1556O4697O0502Q4625J07496q6428m7617r7357K5953
15434G3838o7171j24971j02815J15802J17243N4923k0912N9537Q4516j1273k3456
15423A55261M8655J02999j73655j34900j51418q574Q1194o553O68M5804J0388
15412c0131m0812K1492n3742P2830l6669r2006l7521O0487N8068J5063p1950j1486
15400a46377o3626l0086Q2515J00899M1837Q7906l452j28665K2201P1790l3700
15389A242q8059k3178P6449N7636q0316j24431M5127J1N658j1972j1581j8620
$$ y = [6384, 22793, 62627, 148945, 245841, 180296, 165208, 92905, 10860, -167107, -167793, -91690, -64768, -56845, -21769, -88831, -66660, -47198, -90797, -82392, 113211, 123401, 22357, 41765, -2982, -27640, -23842, -89589, -38033, 26664, 87166, 171791, 279287, 192859, 145242, 47885, 73838, 6667, -118304, -221119, -105317, 11926, 66849, 45937, 105474, 189990, 178717, 155261, 203916, 306915, 133260, -1640, -153058, -161632, -80438, -86991, -86323, -40519, -30131, -70943, -49451, -103193, -30363, -67032, -159038, -196559, -136072, -78004, -62941, -134891, -146377, -210003, -240089, -157574, -56675, -14838, 73068, 69616, -59049, -36848, 34942, 1242, -86817, -109995, -33546, 24090, -56226, -180657, -135530, -135519, -129861, -141833, -153414, -172034]
15377a72034m1241O897N8336O0889J6226r1167l3636J05181j34318n6057j07477
15366c88401K8723J23892J79801j0738p6801M4903K7751j30110N3133Q8200R4268
15355C4621r7174r2315N3710j7048k5506r811r264o1371l4099j6706L2110O7083
15343a75770J9797K8577r5742R7603P8580P7864P2119o0046J2984m6212m1217
15332c1463K3259p3219l3411L0380K4410L8933O3551o7588r5966j01321k1000
15321b43435J74092J69350J26802P5009r6479k5327p5429n0575p337N885J4902
15310F7458q6381m4848L8172L7308j00609q3829l2621J00237P0316j02775N2697
15299h4875K2809L775p4783M9146n021j4312M1888l4774j32313K89N4503O6766
$$ y = [-172034, -213275, -206378, -148042, -87153, -70927, -162094, -195730, -90549, -224867, -280924, -388401, -359678, -235786, -55985, -66723, -143524, -98621, -70870, -200980, -147847, -59647, 34621, -62553, -154868, -101158, -118206, -143712, -153523, -162787, -224158, -258257, -274963, -242853, -175770, -155973, -127396, -223138, -125535, -46955, 30909, 103028, 42982, 55966, 9754, -31463, -8204, -81423, -114834, -84454, -60044, -21111, 42440, -25148, -121114, -222435, -243435, -69343, 100007, 226809, 301818, 205339, 180012, 104583, 54008, 46671, 52556, 67458, -18923, -63771, -25599, 11709, -88900, -172729, -205350, -105113, -34797, -137572, -84875, -62066, -58291, -133074, -83928, -88949, -103261, -61373, -96147, -228460, -228171, -173668, -106902]
15287a06902j19275n917P525J03241O8314k5428m7598L2122K1984J00694J6176
15276D4936j04192L9548r4315l0555R0558M8302j4189K0749p9313m1175m3196
15265a62842J1787N4701L7524M582L1444m4061m5520Q728o242J06373N5546m8875
15253C145q1966j00436r2289j0338K07041K14663J88697j9178j08722j12562l4290
15242E3765n3689M9945j3581l2903M6574R150K2698j4376m9160K7544K7621J01135
15230A74723o8306l4337m1834r5656n2788l0232M124O5217n2455j07798k5432
15219b64774J33068P8196J6811p655m1482K0902J29044O8853j8104p5308j22883
15208h3332m502O786j34805o6392J30708Q8813p5803O951J31073l7213j5802K07197
$$ y = [-106902, -226177, -232094, -224569, -121328, -53014, -78442, -126040, -93918, -71934, 28760, 44936, -59256, -19708, -114023, -144578, -54020, -5718, -19907, 842, -78471, -119646, -162842, -151055, -96354, -58830, -54248, -22804, -66865, -112385, -103657, -109899, -3526, 52020, 3145, -78821, -179257, -271546, -281884, -74843, 139820, 328517, 309339, 200617, 88055, 53765, 76, 50021, 36440, 3537, 50111, 59261, 81959, 67583, 18423, 45967, 73588, 174723, 106417, 72080, 30246, -65410, -118198, -148430, -144306, -79089, -131544, -239342, -264774, -131706, -53510, -36699, -44354, -85836, -64934, 64110, 132963, 114859, 39551, -83332, -87834, -81048, -215853, -282245, -151537, -62724, -138527, -131576, -503, -37716, -53518, 153679]
15196A53679O2751L0755m7134j24664l1777K3274r246J35494M3810n6658r1322
15185H8962p464p6164m9159o2444p2989r0773j38863O6877J42719N5555O0695
15174h3048R1603M890M3755k3987j42485J1814R5981P4717l0092m6177o6450K8736
15162d0743M8583P3214L5872n3122m0948r4602j8206N1904n5493m9418J901L6188
15150a04870q4366p0631J36899k9767K8239N8560N8497K3566o7244K9714N8213
15139C6810p547j51386j35205R1833P8472Q3917K0816J8617L7793o0580p315n3763
15127d7538m6963r6569P1721M5382m5866j5974J8705P8566r0733K5530L9015m520
15115f9244O3208p8632l1634m3098o2383J6755n9481Q6679K08297m7113q1584
$$ y = [153679, 216430, 247185, 200051, 75387, 43610, 66884, 57638, 193132, 236942, 180284, 88962, 81498, 5334, -43825, -106269, -179258, -270031, -408894, -342017, -199298, -143743, -83048, 8555, 13445, 57200, 33213, -109272, -97458, -1477, 73240, 43148, -3029, -69479, -40743, 7840, 81054, 116926, 63804, 22856, -71746, -89952, -38048, -93541, -142959, -141058, -104870, -189236, -259867, -122968, -152735, -124496, -65936, -7439, 16127, -51117, -21403, 36810, 29263, -122123, -257328, -165495, -87023, -3106, 17710, 36327, 74120, 13540, 6225, -47538, -94501, -191070, -119349, -73967, -119833, -135807, -117102, -38536, -129269, -103739, -64724, -69244, -6036, -84668, -116302, -159400, -221783, -205028, -264509, -177830, 30467, -16646, -98230]
15104i8230k2039M1686J3833M9461Q3386j47821j21635p46p799J5459j3604K9767
15092a78282J23118p3581j49932o112P7321Q0470K1665k8526J11354J4619j12885
15081a20771j2887P3415O3468L8886j48903K9166J32624M0927o1581l5946j07453
15070a09055o378Q8003J3202l7710k1393j12289p380J13530J4351j5098J05945
15059B5728N4231m7488j57044q0972J34507N1042r1274l6973M0237O2129J3014
15048c2863o8673J23329R6833R5348j04676j44303p0265L0308R7859O200p1952
15037d2855j01057J3537K10238L0936p6738j55613K0434P3639j4475q3831J4511
15026a11274L734P8253L7168n9777J625k0932M7120J6270o3497n0148O7421n5734
$$ y = [-98230, -120269, -78583, -64750, -15289, 68097, -79724, -201359, -202105, -209904, -194445, -208049, -178282, -55164, -128745, -278677, -284789, -207468, -126998, -105333, -133859, -22505, -7886, -120771, -133658, -60243, 3225, 42111, -106792, -77626, 54998, 95925, 34344, -1602, -109055, -115433, -27430, -14228, -51938, -73331, -185620, -193000, -79470, -65119, -80217, 25728, 79959, 32471, -124573, -205545, -71038, -19996, -111270, -148243, -108006, -45877, -32863, -101536, 21793, 118626, 213974, 109298, -35005, -105270, -74962, 22897, 29097, -42855, -143912, -130375, 79863, 110799, 34061, -121552, -101118, -27479, -41954, -125785, -111274, -107540, -29287, 7881, -51896, -50271, -71203, -24083, -7813, -71310, -121458, -54037, -109771]
15014a09771j08793J7610R1234J29517j4954j11766p7582O6513M4486Q9781m295
15003A1980j53091N9167J06908j15205j09882M0377P4934J1825N6041J8681k7753
14992b6018p8980L4125J5145k1516R2618j2414K873o8455k5018J9030j29226m9657
14980b47493M5947M8338q665P2339p410n1434N5122p578J11542K7976L3833p0857
14968A660o6141o7077q0632L6849J11354J34604j7772k3459k2271J254l011J020
14956F378k3164j05609k6307M9536p0099l2672J04337P3089R4718N6852K0417
14945A47476Q1364Q5415o3258m4423n3542k9367j5900m7007p7631K6118L8070
14934D7315L1558j35688r2636k393N570p2596m1252J9324J11784Q3832J9597L5980
$$ y = [-109771, -218564, -200954, -109720, 19797, 4843, -106923, -184505, -117992, -73506, 16275, 11980, -141111, -81944, 24964, -90241, -200123, -159746, -84812, -72987, -16946, 1735, -26018, -104998, -70873, -55728, -77244, 15374, 2960, 5833, -62622, -87640, -68610, -197836, -247493, -201546, -153208, -161873, -89534, -96944, -148378, -93256, -100834, 10708, 38684, 72517, 1660, -64481, -131558, -212190, -175341, -63987, 70617, 52845, 29386, 7115, 8369, 5358, 6378, -16786, -122395, -148702, -99166, -169265, -201937, -97600, -24511, 70207, 127059, 147476, 228840, 314255, 250997, 206574, 153032, 123665, 107765, 60758, -16873, 9245, 47315, 78873, -56815, -149451, -151844, -146274, -218870, -260122, -240798, -129014, -45182, -25585, 10395]
14922A0395j0289L7272r680n3853L6417M9338k2934r5571R8290O841r5918j2392
14910f2084j14065K5488L5993J00198K6148q9038j06370J00212Q2924p9383M4698
14899c5279J14372j22269O1570L074o4844j3876J41981P218o6832k4723j68201
14888a67809j77693J24896N9083M215Q6265N9535r0265M645J39781N482j35435
14877h7300o3009N0672j18832O0640J66362P911N8064l4090q1259r5738J7743
14866a18836P631L155l4340M284N5490m4207L6614K5091j02547k9088N7571Q0213
14854e8969J53443k7886r4483M6459n0834k5648J01912M0054n5895j26159J2384
14843h5622J26629j0706j25576m6485K43880J82905n6613l8761k275l7934l7960
$$ y = [10395, 106, 37378, 27698, -26155, 10262, 59600, 36666, -58905, 39385, 46226, -49692, -62084, -176149, -150661, -114668, -14470, 11678, -77360, -183730, -83518, -594, -79977, -35279, 79093, -43176, 18394, 21468, -43376, -57252, 84729, 91947, 25115, 392, -167809, -345502, -220606, -161523, -157308, -71043, -11508, -101773, -97128, 42653, 48135, -87300, -150309, -99637, -218469, -157829, 8533, 16444, 74508, 40418, -40841, -136579, -118836, -111205, -108050, -142390, -138106, -82616, -126823, -90209, -65118, -167665, -196753, -139182, -58969, 94474, 66588, -27895, 18564, -32270, -57918, 43994, 84048, 28153, -98006, -85622, 41007, 30301, -95275, -141760, 102120, 285025, 228412, 189651, 187376, 149442, 111482]
14832A11482j5787O0051m2329j02451j08514l7624R0499R0909m1365r3893M685
14821h4337N6999P1811K0321l6092l8072q6998K9810J02993J0482N4228Q6641
14810A87786j722j1059r1772r1199K8681P2632N2534p7068o4599J63148R6019
14799B63381M4134j07234p9046n7482K6452m3033q9230j1509M9456L6739m9464
14788a6836L7376k8805P0675q1761J1161L6627p5889R9534J02481Q3739m1191
14777A97111l7333l4215j95523p6840O3899J39912O1074l0601O700j6305J1015
14766H8894O9443m2470R920o1947j02005m6234N0265R3795n5541K0809J2847L6049
14754G3825O6839l3202l9884k0216q0173j16437j49300n8668M7009J06787O7728
$$ y = [111482, 95695, 155746, 113417, 10966, -97548, -135172, -44673, 46236, 4871, -89022, -84337, -27338, 44473, 64794, 28702, -9370, -96368, -66558, 36435, 46917, 101145, 187786, 186064, 175005, 83233, -7966, 20715, 93347, 145881, 68813, 4214, 167362, 263381, 307515, 200281, 121235, 63753, 90205, 47172, -42058, -53567, -4111, 32628, -16836, 20540, -8265, 62410, -19351, -8190, 28437, -47452, 52082, 154563, 238302, 197111, 159778, 125563, -69960, -146800, -82901, 57011, 118085, 87484, 94184, 77879, 88894, 158337, 115867, 125787, 63840, -38165, -84399, -34134, 59661, 4120, 24929, 37776, 73825, 140664, 107462, 67578, 47362, -32811, -149248, -298548, -357216, -310207, -203420, -135692]
14743a35692M655L5968n0558j1864k5518R3464J32122J24070M2194K4138q0376
14732A52603j4680j45497p1079O5646M8279r3316l153j5568L1827J2327P0268
14721C7657J5223M0703P85l5651k3269R0855L0378n4431o5946m1463l2427o1203
14709i8789K3937l2463O0117P1703J6493O2737j08145o2636j420J54222k14m8900
14697C6642j70836M8396m449J1772l8168K9579L1598l2719L091L623J11811L8908
14685F9248l7685l582l8781L6791m4466q0500j26243j2766O4480O7483j836n6562
14673a64419k4066J7650N5029n928j15246L4466R0695R1432J04217R268n946L4058
14661A21210r8975N0768q253M7965N6273q8559K5144K7612J2009l406J36701j10202
$$ y = [-135692, -131037, -95069, -145627, -157491, -183009, -89545, 42577, 166647, 208841, 232979, 152603, 137923, -7574, -78653, -13007, 35272, -58044, -61197, -76765, -44938, -32611, 37657, 52880, 93583, 94368, 58717, 35448, 126303, 156681, 102250, 36304, -5159, -37586, -98789, -74852, -107315, -47198, 24505, 40998, 103735, -4410, -67046, -68466, 85756, 85542, 36642, -134194, -85798, -90247, -78475, -116643, -87064, -55466, -88185, -85094, -81471, 30340, 69248, 31563, 27981, -10800, 25991, -18475, -98975, -225218, -237984, -173504, -106021, -107857, -164419, -188485, -170835, -115806, -121734, -236980, -202514, -111819, -20387, 83830, 93098, 87152, 121210, 22235, 73003, 64750, 112715, 168988, 80429, 105573, 133185, 145194, 141788, 278489, 168287]
14649A68287j10613O0135p5460j72390l6554J0616J7874J2946Q4669P076K1206
14638a2208k6776O0783N3078L0154o7087O8215L4961P2605n2999j03458j07711
14627e0443j9450P7676N2464L8295m385j21667J5827J00042p1824r1881O7573
14616g773Q58M5040L3496j33172j11636J07699J83779K6933p9589j92739J3592
14605a13512J15194P3938n8542J9201K5592J728n3042p6815O983K7857r1879K9439
14593i3858O7799J46289N8066L9807j05100j66174j1764q8854m0583Q6426J70602
14582F2656p1505j37424J489M9218k2575J0824J28489k831j18572l0435M3737
14571h6929M9688m8088o6210l1743R7231M9997q408J9545P2837r773l0449P064
$$ y = [168287, 57674, 117809, 42349, -130041, -166595, -155979, -138105, -125159, -40490, -33414, -12208, -38984, 21799, 74877, 105031, 37944, 106159, 141120, 213725, 160726, 57268, -50443, -69893, 7783, 60247, 98542, 94157, -27510, -11683, 88359, 16535, -75346, -7773, -6915, 38125, 71621, -61551, -173187, -65488, 118291, 145224, 65635, -127104, -113512, 1682, 75620, 17078, 36279, 61871, 63599, 10557, -66258, -59275, -31418, -123297, -93858, -26059, 120230, 178296, 218103, 113003, -53171, -64935, -153789, -194372, -107946, 62656, -8849, -146273, -144784, -95566, -118141, -107317, 21172, 18341, -100231, -130666, -86929, -37241, -85329, -151539, -183282, -86051, -36054, -44462, -24917, 47920, 38147, 7698, 14762]
14559A4762O4956q5664j07338R4191J23013L30j46980n0019J32826K6016Q0151
14548A46244R2766N2586J3434p2983j28331l2388K0329M6355K4953O9023m982
14537B27006p4884m7672M0315k0386N8434M570q4808k6489N0232l54m063j2128
14525A09773q455l0294n6076q5600k893r620k5413r3426m23J02463Q9814J21243
14513A11093k7015q9339j1249L27j5254K0359J6443L2588m784l8315M5928J04095
14501A44877j93827j50598P5513M3170o8805Q596J01967m4294J3769Q4275O0457
14490G5100O103q0735q7453K4531j0539K2546k3636K8461K9867O4437K05818O3037
14478C17537k20333j13023j0413m799R6412n4641p5193l8935J15536l1977j1187
$$ y = [14762, 79718, -5946, -113284, -19093, 103920, 104250, -42730, -92749, 40077, 66093, 146244, 239010, 291596, 305030, 232047, 103716, 71328, 91657, 138012, 162965, 231988, 227006, 152122, 104450, 144765, 124379, 182813, 187383, 102575, 76086, 126318, 125964, 121901, 109773, 101318, 71024, 14948, -70652, -73545, -83165, -108578, -202004, -202427, -99964, -10150, 111093, 84078, -5261, -16510, -16183, -31437, -11078, 5365, 37953, 33169, -5146, 40782, 144877, -48950, -199548, -124035, -80865, -149670, -141074, -39107, -83401, -69632, 14643, 75100, 81203, 468, -86985, -62454, -72993, -50447, -74083, -45622, -15755, 48682, 254500, 317537, 97204, -15819, -26232, -31031, 65381, 10740, -64453, -103388, 12148, -19829, -31016]
14467c1016J23344k2381n7417q4593P5427M7594l4577m6900Q3242L2170j33477
14456d8584L5764N134p4925N4118K6202p2823l9145k7890R4121J43464k2276j49311
14444g6151R3257R3705j18985p8461m9144l7250N2414J80880n6219m0297j11510
14433a47761J06407M1611p927p9478J1057O2040O9347n691N0055r4343l2681M0250
14421A2886M8506p3041K521P4732J58107m3361k4125j04832j65036n0826j4656
14410a79125J09847J34751l8458j00839j24879P1983R449R1296R5808l7469m6076
14399a3712J6720J7853J4723k3029p5970o4848K1950R3089J05754p094K9712Q1137
14387A96285N0864j096j13042q5297M4625K927O5869O9266p9888o8840m533J0049
$$ y = [-31016, 92328, 69947, 12530, -72063, 3364, 50958, 16381, -30519, 52723, 84893, -48584, -12820, -7686, -82611, -28493, -2291, -75114, -114259, -142149, -48028, 95436, 73160, -76151, 17106, 110811, -8174, -86635, -135779, -173029, -120615, 60265, 4046, -36251, -147761, -41354, 257, -7670, -87148, -76091, -14051, 55296, 49605, 99660, 5317, -27364, 12886, 61392, -11649, -9128, 65604, 223711, 180350, 156225, 51393, -113643, -164469, -179125, -69278, 65473, 27015, -73824, -198703, -126720, -117271, -25975, 69833, 32364, -13712, 3008, 20861, 35584, 12555, -63415, -128263, -106313, -13224, 92530, 85436, 115148, 196285, 247149, 246053, 133011, 47714, 92339, 95266, 161135, 230401, 150513, 81673, 77140, 87189]
14375H7189O9322m6093j57550o6618m983Q7903J10639R7330m7987O3020k1709
14364A70463j67206o833o7464P405N1918M1289Q0407Q0740k8430n4787O222k3502
14352I0222m3090O3228N7301m9400j26376j38548K7672n573p1262J02210K5342
14341f8274l579N8127O9067L8842j2655O0888o3238j50826R9214J9429j09497
14330f2502O3775N2559Q4598N46k02303l7885q9206p6026l7223J13833K2752l8817
14318b05899N1019P0569J0081j17335P9619O0743k036m5535O59R1843J1216L3690
14306C8634L6620r0498J16895p1851l6728K0293o6407L0372J64489M9131j13440
14295G7510p6199Q0087N2121J9723l9022n0873n4523j39099m2290J3470j1458
$$ y = [87189, 156511, 110418, -47132, -113750, -118733, -30830, 79809, 177139, 129152, 192172, 170463, 3257, -3576, -71040, -63635, -11717, 29572, 109979, 190719, 162289, 107502, 113724, 90222, 47132, 110360, 167661, 118261, -8115, -146663, -118991, -124564, -195826, -93616, -68274, -71853, -13726, 55341, 94183, 81528, 142416, 79178, -71648, 27566, 46995, -62502, 1273, 53832, 138430, 138976, -63327, -101212, -190418, -266444, -303667, -189834, -167082, -205899, -154880, -84311, -74230, -191565, -111946, -51203, -53239, -98774, -98115, -6272, 4944, 38634, 75254, -15244, 101651, 29800, -6928, 13365, -53042, -22670, 141819, 190950, 77510, 1311, 81398, 133519, 153242, 114220, 63347, 8824, -130275, -172565, -159095, -170553]
14284a70553O6120J03532L0775m4685j1746O198Q8780K6819N5097k3970l3141
14273I3226j04761J8486j2388O3817R7157J36082P2279q5176q7774q3772j30064
14262b2888m7626o5582P4611j01126Q5867J03760n4572l1466M5683J17982K6153
14251A30796M1739k6305j59464J108J50277R0439r3526j12530K7574j5744N9515
14240I3879J5582L8372L658j4595j08457k3824k2672J3114M3606O0762Q0475n3963
14228A25937l7891m8159q1311j25828L9163Q2743R7198l268j64388J0692K53159
14217A48047M4043k4570j79765j4763J72236j0136p5115q797l9153K3651J32425
14206A68103L8010j47685k8615O4392J16522J9601J3476o9879j30717J0307M709
$$ y = [-170553, -104433, -901, 29874, -14811, -26557, -20359, 68421, 95240, 150337, 126367, 93226, -11535, 6951, -5437, 58380, 155537, 291619, 363898, 278722, 190948, 107176, -22888, -70514, -136096, -61485, -162611, -76744, 27016, -27556, -59022, -13339, 104643, 130796, 172535, 146230, -13234, -12126, 138151, 228590, 135064, 22534, 50108, 34364, 93879, 109461, 147833, 151491, 136896, 28439, 4615, -18057, -4943, 38663, 99425, 179900, 125937, 88046, 39887, -41424, -167252, -128089, -45346, 51852, 48584, -115804, -105112, 148047, 192090, 167520, -12245, -27008, 145228, 135092, 59977, 51180, 12027, 35678, 168103, 206113, 58428, 29813, 94205, 210727, 230328, 243804, 173925, 43208, 53515, 58224]
14195E8224j46262j4738l3576J38936k1045j11439M9931l3567o0709L1453P6007
14184f6785L5846r1763j3479J81137Q0448J4405j44965o1768N9744k0684k4285
14173e2149l7935j7564l4802M1746R7196N9729m6315O917r8365Q9839O1018K3456
14161I2771j07217m6886K0453m6627o4544O2474R9166P6581n9305K9976R6652
14150A53494j9961J14909j23182K8627R4657r8401p6562j03496O341N2423m7643
14139a8794l5509k1682n2183L2548M7840j4780l8839M7662J19187J59869K8831
14128B54150l2457o9485j57189j86330N7721O6285k6044N4869P0551j4385j20456
14117a02770M3762P1968K8276M627l3351L6032n1442o7070J7157Q482J3928K4298
$$ y = [58224, -88038, -102776, -136352, 2584, -18461, -129900, -79969, -113536, -174245, -142792, -66785, -30939, -122702, -136181, 44956, 125404, 139809, -5156, -66924, -7180, -27864, -52149, -90084, -107648, -142450, -100704, -3508, 56221, 9906, 16823, -81542, 8297, 69315, 92771, -14446, -61332, -40879, -87506, -152050, -89576, 9590, 86171, 26866, 56842, 153494, 133533, 248442, 125260, 153887, 248544, 150143, 73581, -29915, -23574, 28849, -18794, -54303, -75985, -128168, -95620, -47780, -62560, -101399, -53737, 65450, 225319, 254150, 221693, 152208, -4981, -191311, -133590, -67305, -93349, -38480, 32071, 17686, -102770, -59008, 12960, 41236, 45863, 12512, 48544, -2898, -69968, -52811, -44329, -30401, -6103]
14105f103K9216m2525J5438j17857p074m7224j7040O5748J53246O8059J0101k4333
14093G9652p3845k5438k3200J570K690R0356J53513M2422O8426j08920m6881n0405
14081A09940j76803j44108R4054J09220n6089l9088Q4085J01437p8125p9970J41155
14070F5708N7594m1168p434J761L9630Q0378m7786o1185K9855j3794P9059m4309
14058A38309N102k3105j36584n3007k2969J31266N6889l3433M9007L049m3413
14047G1111N3365K1720M1422n95j52137K1747J23055L8719j40923n0617l2687
14036e820O2742k9609N5255K5897O6336q0776r4760j6344q9797O1078N9115N6006
14024F9323J04001j8617k3996q3743N7087n4460q0600m3757L4552L7470L6017
$$ y = [-6103, 23113, -19412, -3974, -121831, -128905, -176129, -193169, -127421, 25825, 93884, 103985, 79652, 5807, -19631, -42831, -41261, -38571, 51785, 205298, 247720, 316146, 207226, 160345, 109940, -66863, -210971, -116917, -7697, -63786, -102874, -18789, 82648, 4523, -75447, 65708, 123302, 82134, 74700, 76461, 116091, 196469, 148683, 87498, 117353, 103559, 182618, 138309, 143411, 120306, -16278, -69285, -92254, 39012, 95901, 62468, 111475, 114524, 71111, 124476, 146196, 187618, 187023, 34886, 56633, 179688, 218407, 77484, 26867, -5820, 56922, 27313, 82568, 108465, 174801, 94025, -735, -17079, -106876, -45798, 13317, 69323, 173324, 154707, 130711, 46968, 104055, 49595, -31005, -74762, -40210, -2740, 33277]
14013C3277m0080M7409K0204L6080N6132J5715p2678n8798N361k1550L3879M0075
14001I5026N038j00770n7208N0643Q8094N5390q8292o908K5746N6018k1962M9665
13989A50480o8812l8078O1051j5632o0793P6982P6850n6799K9676K5563j1219
13978A69269j17098M5633L5710m1648m6071j58528l891J32431J7295o7814O8167
13967C3455Q1296K6708L0084N2325j2764L1149o3782o471N1137q8612o9609o0966
13955C950j5240O4400k9764Q9693L2461m3781J0362k6857j42735m4657Q4588M264
13943a3316j08938o921Q3214R9177O0250j10514k5247j2850O3642J2342k4071
13932A6768k2510O4669K1517o632R5143r88n357o823M072j00678O2985P5234n5229
$$ y = [33277, -6803, 40606, 60810, 96890, 153022, 168737, 96059, 37261, 42622, 21072, 54951, 95026, 100064, -706, -57914, -7271, 80823, 136213, 47921, 41013, 66759, 122777, 100815, 150480, 81668, 43590, 104641, 89009, 28216, 105198, 182048, 125249, 154925, 180488, 169269, 52171, 97804, 133514, 91866, 45795, -112733, -116624, 15807, 33102, -34712, 33455, 114751, 141459, 171543, 223868, 211104, 242253, 178471, 172000, 223137, 134525, 64916, 3950, -11290, 53110, 23346, 113039, 145500, 101719, 112081, 85224, -57511, -102168, -17580, -13316, -122254, -129175, -45961, 53216, 113466, 2952, -22295, -35145, 28497, 40839, 16768, -5742, 58927, 80444, 73812, 168955, 167967, 162610, 155787, 159859, 59181, 122166, 197400, 142171]
13919A42171k7452j6995N8981R6180j1772j05118j06063K2859j7017p3947O4016
13908B5843J11392L23p8138k873K3194L4861q067J21411P5012j6620N3352N7378
13896C97068k9861l1163J4836Q4736q8734o4149m9348N3507q1322M5535j28277
13885A22828q2472L5775j53404m904K04622N6354j46697q8428P0193K11981j0234
13874B15614k12427n0450m8449m6821J6173Q5344j0550R0005L4286m4767l9468
13863a1510M8388J74574J49953k2089j11622o7619o1514L1159k4163j9463n9951
13852B6143o5407L4458K3053L4889R0446l4819q3188o8956O6294L6685j13612
13841e4014j03698J24534O7436n7780j4349J47208J28646q8692K9427k8561j19028
$$ y = [142171, 114719, 97724, 156705, 252885, 241113, 135995, 29932, 52791, 35774, -38173, 25843, 137235, 137558, 59420, 56547, 79741, 114602, 106535, 227946, 302958, 286338, 339690, 397068, 367207, 336044, 350880, 435616, 346882, 282733, 233385, 286892, 205570, 251105, 122828, 40356, 76131, -77273, -82177, 122445, 178799, 32102, -56326, 13867, 225848, 215614, 3187, -47263, -95712, -142533, -126360, -41016, -51566, 38439, 72725, 27958, -11510, 36878, 211452, 361405, 339316, 227694, 160075, 98561, 129720, 105557, 86094, 26143, -39264, -4806, 18247, 53136, 143582, 108763, 25575, -43381, 22913, 59598, -54014, -157712, -33178, 34258, -23522, -37871, 109337, 237983, 149291, 178718, 150157, 31129]
13830C1129m7479L4534l1888l7461j37091Q8896K8775L4013J58891L6191Q5255
13819B43765L3370j07562M6270p0013p7788j9379p4430K7267l1455M481R5592
13808G0118l5773L5485M0646o8793m1954L0838Q1276R0908K0862L435k8497m9714
13796A48837j29283l1731K1912O2592l0326l7830M9506Q6758J06908n8310L5723
13785B24756j7992j4049l2072o9623k1893J27850k0110o2377O1102p4092o6058
13774C5442P5480J0954J2877R0404L8764O5046l8894q7637k7069o9236K0398j5161
13762A11368P5356J40959K6375q9711p6293n4363p016j16777J07349j4027p5939
13751B7281r6269N9761J37527o2369q4173R8722O2178l0177m118L2010K5350M939
$$ y = [31129, -16350, 18184, -13704, -51165, -188256, -99360, -70585, -36572, 122319, 158510, 243765, 277135, 169573, 215843, 145830, 68042, 48663, -25767, 1500, -29955, -25474, 70118, 34345, 69830, 110476, 41683, -271, 30567, 111843, 202751, 223613, 227048, 198551, 148837, 19554, -12177, 9735, 72327, 42001, 4171, 53677, 140435, 247343, 189033, 224756, 206764, 192715, 160643, 91020, 69127, 196977, 176867, 114490, 175592, 101500, 35442, 110922, 121876, 134753, 225157, 263921, 328967, 290073, 202436, 175367, 106131, 126529, 111368, 186724, 327683, 354058, 264347, 188054, 133691, 126675, 9898, 117247, 103220, 27281, -68988, -9227, 128300, 65931, -18242, 80480, 142658, 112481, 108363, 140373, 165723, 170662]
13739A70662m4005j9078k930K7895k5468J2946N8325p9592n3035N2767J02455
13728B00942Q7938N7145k7618q8592j00107l2830J63192M3135j60281q0464r5030
13717c2570n2112J00864J76902J02848M3412j47988n8972q2075J17395O6416j64760
13706F9360Q3643o64O4743K1779k3478q9573O1252N3525o3597Q433n1206Q7186
13694B21403j9404r7714m1196n9894P6049Q7134J152q9040o182j0326k9066k5113
13682G803j0047J08708J08977M2111j3816j9381R9442M0643J031J47170k2313
13671D90328j89281j82801j43427k5509J48980P2112n1347m3429n8152K7686L8792
13660H3952m1408K47905J11294j27543P0305l3385j40527J283J41516O5474j24339
$$ y = [170662, 126657, 107579, 104649, 132544, 107076, 120022, 178347, 98755, 45720, 98487, 200942, 288880, 346025, 318407, 229815, 129708, 96878, 260070, 303205, 142924, 62460, -32570, -84682, 16182, 193084, 295932, 339344, 191356, 132384, 50309, 167704, 234120, 69360, 153003, 152339, 217082, 238861, 215383, 125810, 187062, 240587, 176990, 185423, 134217, 221403, 201999, 104285, 63089, 3195, 79244, 166378, 167530, 78490, 72308, 61982, 32916, 7803, -2244, 106464, 215441, 257552, 243736, 224355, 323797, 364440, 365471, 512641, 490328, 301047, 118246, -25181, -50690, 98290, 170402, 119055, 75626, 17474, 45160, 83952, 42544, 290449, 401743, 274200, 344505, 311120, 170593, 171876, 313392, 378866, 254527]
13649B54527p168k5465k8784M4487J12934n324j09988j49563n6000N3972N3703
13638A37331k0861L9100l837j10804Q4178J26960K6102q2868p8432p8591O0603
13627I8881R2339J10812j7303k1050k4712m9920J570J14262K8897j33707q2781
13616A17288N4321J54533o5487K6452L8665m8151m1614j7371n2211o9593m6136
13605E0696l5403J17063J28609N5666j2653l0929J9303N4396n7275p146R07L6615
13593C19849r4279j5440R5219J21255k3779J5606j49328p3829j6383n002M534
13582A78423M2902l0707N6615r220J5948J73377k7796m7193M7211l6114j8253
13571C45193k0602k20233p6535M5058O1373Q3082n2529n0176n8010J3476J95517
$$ y = [254527, 247359, 221894, 193110, 237597, 350531, 345207, 235219, 85656, 29656, 83628, 137331, 116470, 155570, 151733, 40929, 125107, 252067, 278169, 195301, 116869, 38278, 98881, 191220, 302032, 284729, 263679, 238967, 189047, 190617, 304879, 333776, 200069, 117288, 171609, 326142, 260655, 287107, 325772, 277621, 236007, 218636, 166425, 96832, 50696, 15293, 132356, 260965, 316631, 303978, 273049, 292352, 346748, 289473, 282327, 283234, 319849, 225570, 210130, 305349, 426604, 402825, 418431, 269103, 195274, 178891, 173889, 178423, 221325, 190618, 247233, 238013, 253961, 427338, 399542, 352349, 399560, 363446, 345193, 324591, 104358, 27823, 72881, 134254, 217336, 164807, 114631, 56621, 70097, 265614]
13560B65614O6176k1608J6109j20707J0377M6924p9897l0724j9405P5093k1569
13549A86383N9989Q2130R1192n6928K967J4845K5639n5791Q2254J9789j25013
13538C27456j77483K0067L4329M3582Q8759r1632p1196n1635J1300j51780l9192
13527e7425Q657J15877L5638J17538P4923p3400j2052k9159K0227Q3031R2771
13516C76626n0882m8941m1480N435j5246J7771R1294K9038o9229n1437M4056N1446
13504C38451q1574K9433M1370j6287r8830K0395O6951l0946K3007l0849r7785
13493A63336n2075O673P7049J11420L2565Q087P9143l8001j72083L6241O514n1945
13481B06924k651j4075n5341l9569m2140O8528J60583R8853N9434K8171k6541
$$ y = [265614, 331790, 310182, 326291, 205584, 215961, 262885, 182988, 152264, 132859, 207952, 186383, 246372, 328502, 419694, 362766, 365733, 380578, 406217, 350426, 432680, 452469, 327456, 149973, 170040, 204369, 247951, 336710, 245078, 173882, 122247, 133547, -18233, -57425, -48768, 67109, 102747, 220285, 295208, 221808, 209756, 180597, 200824, 283855, 376626, 325744, 276803, 235323, 240758, 225512, 243283, 334577, 363615, 294386, 242949, 287005, 338451, 256877, 286310, 327680, 311393, 212563, 232958, 299909, 268963, 291970, 261121, 163336, 111261, 117934, 194983, 306403, 338968, 347055, 426198, 388197, 216114, 252355, 258869, 206924, 204273, 190198, 134857, 95288, 53148, 121676, 282259, 381112, 440546, 468717, 442176]
13470D42176l6939P4697K9902j86584j27023m024K3643K8171O2039J9137j34807
13459A90388O5460M0453R952N6105J2544l4153R9754r1488q4669L4115q9538Q1839
13447B90762J05199J10802K0550j02982l5567P054j15571l1755K3422L4729J0464
13436C17107P8262N9751p7929N8986J41357o3100j20230l714k3259m8424M1845
13425C60652M1282J9001L0730Q1001p3665q8967P0887K6875P4097p4746L6682
13414E03829J7002p7933q0764l2340R603M6135N7880m5649q2765J6197O593m550
13402C33238M6475L542O847m6722O6206N1893l9934L6153k6118p6810k2141Q923
13390C41552N782k6639N0760l5710j04642j8824N8519j3158m4799O6324N9065
$$ y = [442176, 405237, 479934, 509836, 323252, 196229, 192205, 215848, 244019, 306058, 325195, 190388, 255848, 296301, 306253, 362358, 374902, 340749, 440503, 349015, 264346, 298461, 208923, 290762, 395961, 506763, 527313, 424331, 388764, 395818, 280247, 248492, 271914, 306643, 317107, 395369, 455120, 377191, 436177, 577534, 514434, 394204, 390490, 367231, 318807, 360652, 401934, 420935, 451665, 532666, 459001, 370034, 440921, 467796, 541893, 467147, 503829, 520831, 442898, 362134, 329794, 339397, 385532, 443412, 397763, 314998, 331195, 337788, 333238, 379713, 383255, 390102, 343380, 409586, 461479, 421545, 457698, 431580, 354770, 332629, 341552, 347334, 320695, 371455, 335745, 231103, 212279, 270798, 257640, 212841, 279165, 338230]
13379C38230O9989J95362J410j45790P4626o7963k4941q4560m7331o6846O0150
13368C02336J27187l0684J0750J9265K7693J7432l8290k205p6674Q7485o0314
13357C83981K1710l5460m7325j46279l8111J23834N8498J0551Q6959J21912O3315
13346F03585p2990k53757k7639Q2478K5340j7631Q2342P6839q1167j89308l1875
13335A96217P8342L1113m867J21752m7932M0750J11616P6529r6053K918k9512
13324D80873k26945L5103K8716J00562M5439L3815j9055N7082q1520j15615N7956
13313C96411m6725J8941n0728k6158J03080Q7982m2459K9832l8355n4260J08859
13302D86420J8137q0377j27117o2286n2383J09086o9345j8356R8567J12839p8538
$$ y = [338230, 408219, 603581, 604991, 459201, 533827, 465864, 440923, 356363, 309032, 242186, 302336, 429523, 398839, 409589, 428854, 456547, 473979, 435689, 433484, 356810, 444295, 383981, 405691, 370231, 322906, 176627, 138516, 262350, 320848, 331399, 418358, 540270, 603585, 530595, 276838, 249199, 331677, 357017, 339386, 421728, 498567, 417400, 228092, 196217, 274559, 305672, 300805, 422557, 374625, 415375, 526991, 603520, 507467, 510385, 480873, 253928, 289031, 317747, 418309, 463748, 497563, 478508, 535590, 454070, 338455, 396411, 349686, 368627, 317899, 291741, 394821, 482803, 440344, 470176, 431821, 377561, 486420, 504557, 424180, 297063, 234777, 182394, 291480, 222135, 203779, 302346, 415185, 336647]
13291C36647k12910m5274J33282J89440J6918k058Q4366j545J33739j00059k8504
13280E04042L0486j19978m1295J04567l2737p5477P1857N776r5280j6235P4901
13269D10627P1796N6893o17N349M4247Q3106j5496j00544j68691k3045J43970
13258E07595Q330l1712J25792J07187l5559p4101K1443O3896j20668p1697J19823
13247F20329K0621j00698Q655P3712l0401O2534O48j8373j4477J0129M4091J06842
13235G83612N32M8506L8944q4730l6391j07885p1271M0292K3027q0514J6077R6199
13223F66398J9011L9564o0096r9468n5749J07268j0265J09282J4766M655j9947
13212G15419p90j12153m8850K1814J58507J06548n5029M0523J09175j52325j3339
$$ y = [336647, 123737, 78463, 211745, 401185, 418103, 416045, 500411, 498866, 632605, 532546, 504042, 534528, 414550, 373255, 477822, 445085, 369608, 441465, 447241, 351961, 335726, 410627, 482423, 539316, 538699, 544048, 588295, 671401, 655905, 555361, 386670, 363625, 507595, 515925, 484213, 610005, 717192, 681633, 607532, 628975, 692871, 572203, 500506, 620329, 640950, 540252, 548907, 622619, 592218, 654752, 655400, 637027, 622550, 632679, 676770, 783612, 784144, 832650, 871594, 786864, 750473, 642588, 571317, 611609, 634636, 554122, 570199, 666398, 685409, 724973, 664877, 565409, 509660, 616928, 606663, 715945, 730711, 735366, 715419, 714629, 602476, 553626, 575440, 733947, 840495, 785466, 825989, 935164, 782839, 769500]
13201G69500j2273l7314K2493N7482m9880m4353n0337m4381r3365l5731J54589
13190F36430N4111J12720N4041K2184P7729L2698J7983j19176q4816J27102K26564
13179A157570k5083k04861m8835J4595K741q8948N9851n6310j3383r65q3971O6560
13167G78961L5816m6479P5444l2869p6935M8083l0882P9436k9891m7500J04428
13156H57612M4149r6159J5899N6389J05307M5527q6203m3711m846k9668k1115
13145H43181p6335J4737J35686J66541J76509J55114O0900q3559j60973j58324
13135A073477j0816M6896J08344l1110j52397j27819m5523L1822O7330j00068
13125H60136q667j18925l2430r7002K9372J5767P6488R2123N7666L1898J7718
$$ y = [769500, 757227, 719913, 742406, 799888, 750008, 705655, 655318, 610937, 517572, 481841, 636430, 690541, 803261, 857302, 879486, 957215, 989913, 1007896, 888720, 803904, 931006, 1157570, 1132487, 927626, 878791, 893386, 896127, 807179, 867030, 810720, 797337, 796372, 712401, 778961, 814777, 768298, 843742, 810873, 733938, 782021, 751139, 830575, 800684, 753184, 857612, 901761, 805602, 821501, 877890, 983197, 1028724, 942521, 898810, 893964, 864296, 843181, 766846, 781583, 917269, 1083810, 1260319, 1415433, 1476333, 1392774, 1231801, 1073477, 1062661, 1109557, 1217901, 1186791, 1034394, 906575, 861052, 892874, 960204, 860136, 851469, 732544, 700114, 603112, 632484, 648251, 724739, 816862, 874528, 906426, 924144]
13114I24144K9148O0147n4272o2126n1065O2884J35223Q0340J41500J04266k8846
13103A341343j11625O901o2749N6657J7722n5225R2852J63900J91554R2121q6617
13092A646834j10311j27410j67632j33150j9959j2223m1973k5161m2184J06341
13082A073172J12949N8908j9824m2093Q303K6977P8188o0025j91772k5468R1711
13071A111026J7231L928m822n2401p7081k585M9327J90070J42716o3576o1494
13060A252339l6537N6901o9723L6166K50152J26592l7340L3538j4076J31494n1888
13049A677618o5366p0422j05360J12107Q3864q2679j07907m2126j8706j6850N7548
13038A421721O4886m4489J2259J8543K1459k7892j13663j56856J7270J38549J39121
$$ y = [924144, 953292, 1013439, 959167, 897041, 845976, 908860, 1044083, 1124423, 1265923, 1370189, 1341343, 1229718, 1236619, 1173870, 1230527, 1248249, 1193024, 1285876, 1449776, 1641330, 1733451, 1646834, 1536523, 1409113, 1241481, 1108331, 1088372, 1076149, 1034176, 1009015, 966831, 1073172, 1186121, 1245029, 1225205, 1183112, 1191415, 1218392, 1296580, 1236555, 1044783, 1019315, 1111026, 1128257, 1132185, 1127363, 1074962, 997881, 995296, 1044623, 1234693, 1377409, 1313833, 1252339, 1215802, 1272703, 1202980, 1239146, 1489298, 1615890, 1578550, 1612088, 1598012, 1729506, 1677618, 1612252, 1541830, 1436470, 1548577, 1632441, 1549762, 1441855, 1399729, 1381023, 1364173, 1421721, 1486607, 1442118, 1454377, 1472920, 1494379, 1466487, 1352824, 1195968, 1213238, 1351787, 1490908]
13027A490908O2593R8330j04730q3680o9172O5190J04443r4926m3728P5854J3712
13016A514794M8352J44490K179k5835k4321l1803M0049N6834L4408K098k0527
13005A740718j6646o6452j27348l301O7639N3315M5758R8581O047R4813k7971
12994A865153k241j3594J35907P4374k0258q5622J01496j9145j76191k3861L9661
12983A875679Q6484k6374O0000P1470N8436l7905R8493o6076j33267m0662K948
12972A949226J05743J43286N313P3361J36245L8998l3889L8938o3890l4546r0925
12961B267860j07173j3846N6997J68402Q9860q09N5093j9588j0860j6912m5727
12950B423297J25603L6P7375K6843n7086P9596J62968N0255r6495O4640K15887
$$ y = [1490908, 1553501, 1651831, 1547101, 1463421, 1394249, 1459439, 1563882, 1468956, 1425228, 1501082, 1514794, 1563146, 1707636, 1709815, 1683980, 1659659, 1627856, 1667905, 1724739, 1759147, 1761245, 1740718, 1724072, 1657620, 1530272, 1526971, 1594610, 1647925, 1693683, 1792264, 1798311, 1893124, 1865153, 1862912, 1849318, 1985225, 2059599, 2039341, 1953719, 2055215, 2036070, 1859879, 1836018, 1875679, 1962163, 1935789, 1995789, 2067259, 2125695, 2087790, 2186283, 2120207, 1986940, 1946278, 1949226, 2054969, 2198255, 2203568, 2276929, 2413174, 2452172, 2418283, 2457221, 2393331, 2358785, 2267860, 2160687, 2146841, 2203838, 2372240, 2462100, 2461291, 2516384, 2496796, 2485936, 2469024, 2423297, 2548900, 2548936, 2626311, 2653154, 2596068, 2675664, 2838632, 2888887, 2792392, 2857032, 3072919]
12939C072919K77919N0986j66822n338K965O9561J71524O0575Q6556P7158M763
12928C702766N5244J15276P2881q4182j62927j48952j25345M5570J08954n9347
12918C519938n4457J6868J0100P8720j24490L420K7596k8006O9248L5035R447
12907C563419J8263M5340J0699J70435N6308j30016p4642K4286J07941J01635
12897C893668l1375M2154k9601j7556m0585k9799Q2466N7929J07582J05962j8455
12886D122390l7867J9249P8603J87185Q5960J4904m5877l490M8020l9325N0504
12875D480256J19423J26569J5586R1397K0257k2108l8696J3144K3692J36611J71775
12864E137906R5059l0913M8338N4n5012J12777J32473P8055m8342M2346K6697
$$ y = [3072919, 3350838, 3401824, 3235002, 3229664, 3232629, 3302190, 3473714, 3534289, 3620845, 3698003, 3702766, 3758010, 3873286, 3946167, 3861985, 3699058, 3550106, 3424761, 3470331, 3579285, 3519938, 3465481, 3482349, 3492449, 3571169, 3446679, 3450099, 3477695, 3449689, 3518937, 3553972, 3563419, 3581682, 3627022, 3637721, 3808156, 3864464, 3734448, 3659806, 3684092, 3792033, 3893668, 3862293, 3904447, 3874846, 3857290, 3816705, 3786906, 3869372, 3927301, 4034883, 4140845, 4122390, 4084523, 4103772, 4182375, 4369560, 4455520, 4470424, 4424547, 4421057, 4469077, 4429752, 4480256, 4599679, 4726248, 4741834, 4833231, 4853488, 4831380, 4792684, 4805828, 4829520, 4966131, 5137906, 5232965, 5202052, 5250390, 5250444, 5195432, 5308209, 5440682, 5518737, 5470395, 5512741, 5539438]
12853E539438M5754J29826J70044N1551J03987J01562k8896j24810k355P4781
12843F060882l219J04326J08554Q2836k791k7787l0715J1324J29400J54979J16425
12832F704214o546J16423N728J09252J35346k3322r123J17684J96017J95349Q9810
12821G630832K8483m4616P0807K29134P3790M8809Q9640J33969Q0601K24817O7191
12810H633457L2357P8243J84543K28775L1541n5528K05430L05539J61141J14125
12800I919623O5995M7571J1667N9134J25790L18714J64862N9431J64414J32999
12790A1070200R0856K17347K05898J85499K19331K19274K25333J83166J95872
12781A2812776J40225K35500K61734J51370J58001K24416K98482L50216K71545
$$ y = [5539438, 5585192, 5715018, 5885062, 5936613, 6040600, 6142162, 6113266, 5988456, 5986101, 6060882, 6057663, 6161989, 6270543, 6353379, 6350588, 6322801, 6292086, 6303410, 6432810, 6587789, 6704214, 6697668, 6814091, 6819819, 6929071, 7064417, 7041095, 7031972, 7149656, 7345673, 7541022, 7630832, 7659315, 7614699, 7685506, 7914640, 7988430, 8037239, 8126879, 8260848, 8341449, 8566266, 8633457, 8665814, 8744057, 8928600, 9157375, 9188916, 9133388, 9338818, 9644357, 9805498, 9919623, 9985618, 10033189, 10044856, 10103990, 10229780, 10548494, 10713356, 10772787, 10937201, 11070200, 11161056, 11378403, 11584301, 11769800, 11989131, 12208405, 12433738, 12616904, 12812776, 12953001, 13188501, 13450235, 13601605, 13759606, 13984022, 14282504, 14632720, 14904265]
12772A4904265J89212K18406L41625J24338R1506J37644L26493M46829L94093
12763A7174411K92476P6223J72292M21919L46555L00605L12344K26766L55858
12754A9679449N03394L59949K98106M97815N44890M61992L45589M79047N06381
12745B3676612L73545M41761M28872N18027O47746N32334M11551M42241N04355
12736B7977044O43581O48956Q35939Q36568P01505P31594P36567P29740O43303
12727C4484797P50773P47242P32010P25305Q70607R33058J056630R98249R30815
12718D2229486J078246J134960J114809J065260J211762J261849J218495J167770
12710E1482637J177902J336440J373540J427075J524004J429196J417842J477643
$$ y = [14904265, 15093477, 15311883, 15653508, 15777846, 15869352, 16006996, 16333489, 16780318, 17174411, 17466887, 17543110, 17715402, 18137321, 18483876, 18784481, 19096825, 19323591, 19679449, 20182843, 20542792, 20840898, 21338713, 21883603, 22345595, 22691184, 23170231, 23676612, 24050157, 24491918, 24920790, 25438817, 26086563, 26618897, 27030448, 27472689, 27977044, 28620625, 29269581, 30105520, 30942088, 31643593, 32375187, 33111754, 33841494, 34484797, 35235570, 35982812, 36714822, 37440127, 38310734, 39243792, 40300422, 41298671, 42229486, 43307732, 44442692, 45557501, 46622761, 47834523, 49096372, 50314867, 51482637, 52660539, 53996979, 55370519, 56797594, 58321598, 59750794, 61168636, 62646279]
12702F2646279J535692J530261J690215J719226J734491J822695J652478J754241
12694G6085578J868741J756983J836601J868909J916048J958590J846986J885693
12686I1024129J897909J722615J651104J783167J784812J655180J618408J611748
12678A04749072J486044J325767J288342J167116J247198J038919Q28146P88313
12670A13918917O98541O63999L38639P1527M4296L4822j91233l81106m69613n90631
12660A14138158o48056q05171q27371r89112j032554j275862j465482j465344
12652A05629206j526442j706865j663363j550438j546472j877119j900754j918036
12644I1939717j959695j906334j860187j775946j702289j696417j866627j993683
$$ y = [62646279, 64181971, 65712232, 67402447, 69121673, 70856164, 72678859, 74331337, 76085578, 77954319, 79711302, 81547903, 83416812, 85332860, 87291450, 89138436, 91024129, 92922038, 94644653, 96295757, 98078924, 99863736, 101518916, 103137324, 104749072, 106235116, 107560883, 108849225, 110016341, 111263539, 112302458, 113130604, 113918917, 114617458, 115281457, 115620096, 115691623, 115735919, 115770741, 115579508, 115198402, 114728789, 114138158, 113490102, 112684931, 111857560, 110868448, 109835894, 108560032, 107094550, 105629206, 104102764, 102395899, 100732536, 99182098, 97635626, 95758507, 93857753, 91939717, 89980022, 88073688, 86213501, 84437555, 82735266, 81038849, 79172222, 77178539]
12636G7178539j913056j738802j811242j768657j591720j610750j605179j540033
12628F3599100j508832j545231j537531j447725j271807j337937j492076j315364
12620E2142597j286224j237411j103641j254776j376248j119060j131032j124290
12612D2509915r36862p26697j017277q48151q73344r09323q86922r40211q04037
12603C4567091p04010p53342q15114o51099n80204o46625p15314o97613o75603
12594B8328167n90751o59543n48065n48253n42164n33973m32245n23019n14028
12585B3436126n89591m77776l59703l86772l65768m32363m21311l92064l97617
12576A9613161k61099l18532m16175m12548m75336k99245l11192l72056l80301
$$ y = [77178539, 75265483, 73526681, 71715439, 69946782, 68355062, 66744312, 65139133, 63599100, 62090268, 60545037, 59007506, 57559781, 56287974, 54950037, 53457961, 52142597, 50856373, 49618962, 48515321, 47260545, 45884297, 44765237, 43634205, 42509915, 41573053, 40846356, 39829079, 38980928, 38107584, 37198261, 36311339, 35371128, 34567091, 33863081, 33109739, 32294625, 31643526, 31063322, 30416697, 29701383, 29003770, 28328167, 27737416, 27077873, 26529808, 25981555, 25439391, 24905418, 24473173, 23950154, 23436126, 22846535, 22368759, 22009056, 21622284, 21256516, 20824153, 20402842, 20010778, 19613161, 19352062, 19033530, 18617355, 18204807, 17729471, 17430226, 17119034, 16746978, 16366677]
12567A6366677k15994j99096l21598l14107j59515j93642k60626l32077k33739
12558A4136283l40453j69134j31453j64364k22782l05975l19819k75886j29201
12549A2077216r5516k8846j92888l34122j98276L5327j00124p7921k00373j80560
12539A0703917j68820j99662m8908k06667j73934q0399l25892k93410j29030j23673
12529H953522j90744j9959J19109o6582j96303k02875j55457l7516m8790j03327
12519H051078l0687k9778j07366j41258j06603o3786m0502k48071j98397K0344
12509G104974l7132n7834j79783o9464r8849O6019j06802l1151q6581j43914j25661
12498F233822l4378j1322j11131j21390N78j8853k7505o4233j1822r4295j71697
$$ y = [16366677, 16150683, 15951587, 15629989, 15315882, 15156367, 14962725, 14702099, 14370022, 14136283, 13795830, 13626696, 13495243, 13330879, 13108097, 12802122, 12482303, 12206417, 12077216, 11981700, 11952854, 11759966, 11425844, 11227568, 11262895, 11162771, 11084850, 10884477, 10703917, 10535097, 10335435, 10286527, 10079860, 9905926, 9825527, 9499635, 9206225, 9077195, 8953522, 8762778, 8742819, 8861928, 8795346, 8599043, 8396168, 8240711, 8203195, 8154405, 8051078, 8020391, 7990613, 7883247, 7741989, 7635386, 7571600, 7531098, 7283027, 7084630, 7104974, 7067842, 7010008, 6830225, 6760761, 6661912, 6727931, 6621129, 6589978, 6503397, 6359483, 6233822, 6199444, 6188122, 6076991, 5955601, 5956179, 5937326, 5909821, 5845588, 5833766, 5739471, 5567774]
12487E567774k16937j64355o5325o7533J35594K8390m7896j12297p8736r4417
12477D884262j33231p1849M1988K1436n0063j86304k3524k4342o5949o5235q6591
12466D240598Q3144j08376p3739n0096M020J21718r4292j16883k8735q604j07241
12455C861514L53k540k344J23739L6558l8124q5973r184j74345n9007k7113j68237
12443C455297L345J06753o5467n3725J7995r1181J5019q4693r0744o8179J219
12432C145639j3023J67263J05393N455r2568k45793n0765R7084L3071q9027j11818
12421B950911J09558o5697j01787m326R0763L7068j370J24848M5373j3199K7129
12410C199271K0169M7928r4795N853j9351n7684L9604J12458k8576j9482q1412
$$ y = [5567774, 5350837, 5186482, 5121157, 5053624, 5189218, 5217608, 5169712, 5057415, 4978679, 4884262, 4751031, 4679182, 4721170, 4742606, 4692543, 4506239, 4482715, 4458373, 4392424, 4327189, 4240598, 4323742, 4215366, 4141627, 4091531, 4095551, 4217269, 4122977, 4006094, 3977359, 3968755, 3861514, 3861867, 3859327, 3856983, 3980722, 4017280, 3979156, 3893183, 3883999, 3709654, 3650647, 3623534, 3455297, 3458642, 3565395, 3499928, 3446203, 3464198, 3373017, 3388036, 3303343, 3212599, 3144420, 3145639, 3132616, 3299879, 3405272, 3410727, 3318159, 3072366, 3021601, 3118685, 3151756, 3062729, 2950911, 3060469, 2994772, 2892985, 2888659, 2979422, 3016490, 3015120, 3139968, 3185341, 3172142, 3199271, 3219440, 3267368, 3172573, 3178426, 3159075, 3101391, 3140995, 3253453, 3224877, 3205395, 3123983]
12399C123983p3722p7806p7142O5409R7549k8403j75269j5527j98762k44998j13540
12388B281772M4789J26564o234o2705J19667l3642j33481o455J10009o5986j73812
12377B200486Q925O6465j19556p0128J2608j04997l7751J8418J8653K8294o0459
12366A960958j31994Q9720L9840q9485j04760R0096Q7010o2682j7019J4884K0385
12355A896953p8912L6065J5278j00641j21688M7578P1456O3962j9423r8578k4291
12344A687759Q179q710p6220q5632K4280M8931M4073L5188j45360j03875n7397
12333A371216M2395J05342P3955J32672j5595o7432l2889q5735j10010q4057J27141
12322A457003J70151L1052l9485l2972j23997O2866j3473P7309p7978J2630j8862
$$ y = [3123983, 3050261, 2972455, 2895313, 2960722, 3058271, 3029868, 2854599, 2839072, 2640310, 2395312, 2281772, 2326561, 2453125, 2446891, 2384186, 2503853, 2470211, 2336730, 2330275, 2440284, 2374298, 2200486, 2209411, 2275876, 2156320, 2086192, 2098800, 1993803, 1956052, 1974470, 1993123, 2021417, 1960958, 1828964, 1918684, 1958524, 1869039, 1764279, 1854375, 1941385, 1878703, 1861684, 1876568, 1896953, 1818041, 1854106, 1869384, 1768743, 1647055, 1694633, 1766089, 1830051, 1810628, 1712050, 1687759, 1695938, 1687228, 1611008, 1525376, 1549656, 1598587, 1642660, 1677848, 1532488, 1428613, 1371216, 1413611, 1518953, 1592908, 1725580, 1709985, 1642553, 1609664, 1523929, 1413919, 1329862, 1457003, 1627154, 1658206, 1618721, 1585749, 1461752, 1524618, 1511145, 1588454, 1510476, 1523106, 1504244]
12311A504244m2702j57137j0746J0826j2843n7084m0870J4344M4876M1895k241
12300A292562J1662n0826M3832O9579j16715K0815M7814l3059J60034l9709q5161
12289A320828m0227l3565M996j13195n7817J49136O6604p3722j19370l8773J4328
12278A079223J8435j03122m4643J10196P7735J40899j9422p2514p5438M7861J13806
12267A273016K9486j65036p9273q7066L5043j8709P1656K6229o1693k604J2288
12256A033337Q108J7676M4296j8230L0761m2549k4341Q4546o6031j69831k9856
12245H67886K606L8978L8624k2892p9942p0844O0491P2487q2611q440J29439o2615
12233H83167N7352p640o9601o2786L636j1828J15131Q6227n8273k3477M2421M4420
$$ y = [1504244, 1461542, 1304405, 1293659, 1304485, 1291642, 1234558, 1193688, 1208032, 1252908, 1294803, 1292562, 1304224, 1253398, 1297230, 1366809, 1250094, 1270909, 1318723, 1285664, 1445698, 1405989, 1320828, 1280601, 1247036, 1252032, 1138837, 1081020, 1230156, 1296760, 1223038, 1103668, 1064895, 1079223, 1097658, 994536, 949893, 1060089, 1137824, 1278723, 1259301, 1186787, 1111349, 1159210, 1273016, 1302502, 1137466, 1058193, 971127, 1006170, 987461, 1059117, 1085346, 1023653, 1021049, 1033337, 1041445, 1059121, 1103417, 1085187, 1115948, 1073399, 1049058, 1133604, 1067573, 897742, 867886, 870492, 909470, 948094, 925202, 845260, 774416, 834907, 907394, 824783, 816343, 945782, 883167, 940519, 932879, 863278, 800492, 804128, 792300, 907431, 993658, 935385, 911908, 954329, 998749]
12221I98749r4482j86325n4740K2671P5087n3224l7269L4867J28909N7885M9526
12210I41654m9836j43218j51427M3184K091m0659J15685Q6957o981j8234M919
12199G84135j2950l1273P3831M7917j8223j35575l0346R9628j03862m3206J0027
12188F40103L7360r0265o8865J08887J79620j64931k32350J03756J33426J34769
12178G81510o27l3496m7249p3117q907M3240j801j28923M2105k5159J07725L2368
12166F87669j0719k7773m7339O0930l6515m3682j1099L1458Q7131q051P4520o08
12154G55922j49306k2171m0794o7827j11615j74007j3962R8068M7129K30706J35410
12143F87553n57L9138J03594l6505q8401q1494j48853k4607J5270P8142J9717
$$ y = [998749, 904267, 717942, 663202, 685873, 760960, 707736, 670467, 705334, 834243, 892128, 941654, 891818, 748600, 597173, 640357, 642448, 601789, 717474, 804431, 797450, 779216, 784135, 771185, 739912, 813743, 861660, 843437, 707862, 677516, 777144, 673282, 630076, 640103, 677463, 587198, 518333, 627220, 806840, 641909, 409559, 513315, 646741, 781510, 780883, 747387, 700138, 627021, 618114, 661354, 659553, 530630, 572735, 547576, 655301, 687669, 676950, 649177, 601838, 662768, 626253, 582571, 571472, 602930, 690061, 682010, 756530, 755922, 606616, 584445, 543651, 475824, 364209, 190202, 176240, 274308, 321437, 552143, 687553, 686996, 726134, 829728, 793223, 704822, 623328, 474475, 449868, 465138, 543280, 562997]
12132E62997n7346J9775L2031J22444J21658n0828j68195j16293Q2495J21797
12122F70535L5283r3844l4873R8295m6626k04701j5640L3160L8387J10741j30393
12111D60324q2107O4721L0390k3906L2685l6596k339o1479P249O3737m4340j09945
12099B98394p3864n5408J6992P7652P3497J00717K4682L5227M4811j2768r96k9054
12087D99882j02157m3246q6501P3160N2822K0142P036R5493R210j54549q6299
12076B84993P7364Q6587m9930J0373N9864N9902j60073K7438P8267o3015j16353
12065B95417N3163J26519m2397p7995L8732m6047L3268J00835K4014Q067r9593
12054D13983j67835j19168M0985J14731J53161J9819K5616j85104p6074J31536
$$ y = [562997, 505651, 525426, 557457, 679901, 801559, 750731, 582536, 466243, 548738, 670535, 705818, 611974, 577101, 675396, 628770, 424069, 408429, 441589, 479976, 590717, 460324, 378217, 442938, 473328, 449422, 482107, 445511, 443172, 381693, 388942, 452679, 408339, 298394, 224530, 169122, 186114, 263766, 337263, 437980, 462662, 497889, 542700, 529932, 528936, 499882, 397725, 354479, 267978, 341138, 393960, 414102, 421138, 516631, 525841, 371292, 284993, 362357, 448944, 399014, 409387, 469251, 529153, 369080, 396518, 474785, 411770, 295417, 348580, 475099, 432702, 354707, 393439, 347392, 380660, 481495, 505509, 513576, 413983, 246148, 126980, 167965, 282696, 435857, 455676, 481292, 296188, 220114, 351650]
12044C51650J00645k7126l3970N5456n6098r5842p4367n686l1222j8269r1650
12033G3521P0682J8741k1047N1489M7655n435q1114J7093J16938j3370j46268
12022A28885J2317J24776M2937O9102N4816l1372j30021k8115M1940O6119k5448
12011C25936o9708j03239j0959L8193j3417O2664P210O2688J08720n6353j0678
12000C41057P4244j30092p9221M8713O8135N712j5127J34860m8202j45018m316
11989B50745O5981P7158N9164j14663k5921K9756p6756j14102j2653J33809m5251
11978B27267p9925l384p4406N1316Q052R2468n152M3218M8309o3696o8479L4077
11966B09665J9564o5094J27807M1866J19040J18118j18400j91972q1109j5906
$$ y = [351650, 452295, 425169, 391199, 446655, 390557, 294715, 220348, 214662, 183440, 165171, 73521, 144203, 162944, 141897, 193386, 241041, 235606, 154492, 171585, 288523, 275153, 128885, 141202, 265978, 308915, 378017, 432833, 401461, 271440, 243325, 285265, 351384, 325936, 256228, 152989, 142030, 180223, 166806, 229470, 236680, 299368, 408088, 351735, 341057, 415301, 285209, 205988, 254701, 322836, 328548, 313421, 448281, 400079, 255061, 250745, 316726, 393884, 453048, 338385, 312464, 342220, 265464, 151362, 138709, 272518, 227267, 147342, 143958, 69552, 120868, 128920, 221388, 216236, 259454, 307763, 244067, 175588, 209665, 229229, 164135, 291942, 333808, 452848, 570966, 452566, 260594, 179485, 163579]
11956A63579J9408m316q1822r8525J8915N3918O9913K7759m8920j02093r5310
11945g7494l8746J07618J18300L580M7788J1731p9072N2466J02660j49565p555
11934I1711N2337M3914m102o2815K5145R8859O3402K0081r5485q4788m393m3784
11922A00082K9584J46018o811p6675P0521l516P7973M7796j43360n6566n9126
11911A25920P4629J35962M4512l7541k726O6576l6506j17509k8653M1242p7441
11900A88465j7314K6338o4724j71380q356Q4085J27696l338n5650P8241O9834
11889B53897N0533j3337j5568R1816j5203l8731m7797j26965m5669J5936J844
11878A10756j4844J1253J27923O7559j01675m4676n591p4579p267K9775o797J42738
$$ y = [163579, 182987, 178671, 96849, -1676, 17239, 71157, 141070, 168829, 119909, 17816, -77494, -116240, -8622, 109678, 113258, 161046, 172777, 93705, 146171, 248831, 99266, 91711, 144048, 187962, 183860, 121045, 146190, 245049, 308451, 328532, 233047, 148259, 143866, 100082, 129666, 275684, 268873, 192198, 262719, 259203, 337176, 384972, 241612, 185046, 125920, 200549, 336511, 381023, 343482, 340756, 407332, 370826, 253317, 224664, 265906, 188465, 171151, 197489, 132765, -38615, -46971, 37114, 164810, 161472, 105822, 184063, 253897, 304430, 291093, 275525, 367341, 352138, 313407, 265610, 138645, 92976, 108912, 110756, 95912, 107165, 235088, 302647, 200972, 156296, 150705, 76126, 68859, 98634, 91837, 234575]
11866B34575J8580l6711M1768o6947j32245J09006M5872n8509R206o5618m7791
11855E1186o8764P2047J30013j7228l5269P4556R3049M0276m1991j805o0457j18310
11843A17303m41O0543N1542K9645n1439m315L1725O0251J2029Q1628r5654j34446
11831A58371l0975Q0091q7546O5919J43456J36016n3396r9064J6329j12457L2304
11820B49048P7647j11622m7624K4276M23k9848l953m2564j42939M070l8442M1451
11808b0077j7203R3876J8308M0990L4887l3400K0515j90626o3131K0643o8727
11797a63945L3579J98970P4312r8980P5764J28622j13269r2255L5168l3096m784
11786D0086M4838j41k1081N1539o2619n2349J36313n8692o1900K1717j30939K6096
$$ y = [234575, 253155, 216444, 258212, 191265, 59020, 168026, 213898, 155389, 164595, 98977, 51186, -17578, 54469, 184482, 167254, 131985, 206541, 299590, 339866, 297875, 296070, 235613, 117303, 116862, 177405, 228947, 258592, 207153, 202838, 234563, 294814, 306843, 388471, 292817, 158371, 127396, 207487, 119941, 185860, 329316, 465332, 411936, 312872, 329201, 216744, 249048, 326695, 215073, 167449, 191725, 192148, 162300, 158347, 115783, -27156, -23086, -61528, -20077, -37280, 56596, 74904, 115894, 150781, 117381, 137896, -52730, -115861, -95218, -163945, -130366, 68604, 142916, 43936, 119700, 248322, 135053, 42798, 77966, 44870, 40086, 84924, 84783, 63702, 115241, 52622, 273, 136586, 77894, 15994, 37711, -93228, -67132]
11774f7132J10691Q1830k2362j24946M1387P3806J8842o5486N2645p5997j5615
11763G663J62876K19390l3202m6671j6219n6201n8676l6861r9797q406M3075J4868
11751I1839m4568K9520J7369M2217m9088N0880R2918J5769o0272o2152M722Q8830
11739B17984k5584j41252j0065l3963m0139O9184j1516k6702m4257N0248L9932
11728D3870j8536k470q2664k160R7949p6926k3606l1023o7528J09694O170L1795
11716a5435Q2493L6881l5524K7696K3885K20486l3947j30898L344k8094r6692
11705E4195k1118R9073M5073j41631Q4947J2147r0137J2450P1099J480n0848q9957
11693a3227j25573O156J11010K16970L889j32051q0548m732j07671M6194J74260
$$ y = [-67132, 43559, 125389, 103027, -21919, 19468, 93274, 112116, 46630, 99275, 23278, 7663, 170539, 389929, 356727, 310056, 293837, 237636, 178960, 142099, 42302, 33896, 76971, 91839, 47271, 76791, 94160, 136377, 87289, 138169, 231087, 246856, 186584, 124432, 129154, 217984, 192400, 51148, 41083, 7120, -33019, 36165, 24649, -2053, -46310, 3938, 43870, 25334, 22864, -59800, -61960, 35989, -40937, -64543, -95566, -163094, -53400, -47230, -15435, 67058, 103939, 68415, 96111, 119996, 340482, 306535, 175637, 178981, 150887, 54195, 33077, 132150, 177223, 35592, 120539, 132686, 42549, 54999, 126098, 127578, 76730, -13227, -138800, -132644, -21634, 195336, 199225, 67174, -13374, -18106, -125777, -79583, 94677]
11682I4677J48966n8072r0037q1506J9415P9992J11367L9903n0186m427M6472
11671B56564k2511l4543k3678q0673q7999l7661J5248K1096J50970n9326r6044
11660A443J53829J30927p2092o6777k3891R5021n2189j32398j06425r702K5893
11649e6361J6271K2659K5854j04638n5711J08663J08028M8761M0745M1978j15245
11638H1004K8661J22388k6438j15379o0220M907Q7219M0242q5527j4986j23534
$$ y = [94677, 243643, 185571, 95534, 14028, 33443, 113435, 224802, 264705, 214519, 210092, 256564, 234053, 199510, 175832, 95159, 7160, -30501, -15253, 5843, 156813, 97487, 1443, 155272, 286199, 214107, 147330, 123439, 218460, 166271, 33873, -72552, -82254, -56361, -40090, -17431, 8423, -96215, -151926, -43263, 64765, 113526, 154271, 196249, 81004, 109665, 232053, 205615, 90236, 30016, 34923, 122142, 162384, 76857, 61871, -61663]
$$ [...]
##END NTUPLES=NMR SPECTRUM
##END=
