##TITLE=Analysis number 315696
Compound Code tl 00142
Project Code adrs
Chemist Name endeavour
##JCAMPDX= 6.0         $$ Bruker NMR JCAMP-DX V2.0
##DATA TYPE= NMR SPECTRUM
##DATA CLASS= NTUPLES
##ORIGIN= Bruker BioSpin GmbH
##OWNER= NMR
$$ XWIN-NMR		Version 3.5
$$ Tue Nov 29 12:03:19 2005 GMT Standard Time (UT+0h)  MAYBRIDGE\NMR@NMR_250MHZ
##.OBSERVE FREQUENCY= 250.131544655141
##.OBSERVE NUCLEUS= ^1H
##.ACQUISITION MODE= SIMULTANEOUS (DQD)
##.ACQUISITION SCHEME= undefined
##.AVERAGES= 16
##.DIGITISER RES= 18
##SPECTROMETER/DATA SYSTEM= dpx250
##.PULSE SEQUENCE= zg30
##.SOLVENT NAME= CDCl3
##.SHIFT REFERENCE= (INTERNAL, CDCl3, 0, 16.522)
##AUDIT TRAIL= $$ (NUMBER, WHEN, WHO, WHERE, WHAT)
$$ ##TITLE= Audit trail, XWIN-NMR		Version 3.5
$$ ##JCAMPDX= 5.01
$$ ##ORIGIN= Bruker BioSpin GmbH
$$ ##OWNER= NMR
$$ C:\u/data/dgb/nmr/ADRS/13140/pdata/1/auditp.txt
$$ ##AUDIT TRAIL=  $$ (NUMBER, WHEN, WHO, WHERE, WHAT)
(   1,<2005-11-29 12:02:56.53 +000>,<MAYBRIDGE\NMR>,<NMR_250MHZ>,
      <created by zg, POWCHK disabled, PULCHK disabled
       configuration hash MD5:
       62 19 C7 07 E1 42 D1 B7 37 6C 3D D0 77 39 F9 E6
       data hash MD5: 64K
       D0 FF D9 99 AF B1 D5 27 C3 B5 26 00 48 AC 20 F0>)
(   2,<2005-11-29 12:03:09.25 +000>,<MAYBRIDGE\NMR>,<NMR_250MHZ>,
      <Start of raw data processing
       ef LB = 0.3 FT_mod = 6 PKNL = 1 SI = 32K 
       data hash MD5: 32K
       F7 AB C3 16 E3 C7 D3 4D 10 FE 36 EC D1 43 58 CC>)
(   3,<2005-11-29 12:03:11.28 +000>,<MAYBRIDGE\NMR>,<NMR_250MHZ>,
      <apk 
       data hash MD5: 32K
       1F C3 49 C2 58 0A E0 7E 98 E8 DC 52 C0 6A D2 3C>)
(   4,<2005-11-29 12:03:12.04 +000>,<MAYBRIDGE\NMR>,<NMR_250MHZ>,
      <abs ABSG = 5 
       data hash MD5: 32K
       4C 83 52 5A DD E1 BE EF 36 43 31 F6 12 2A BA 3D>)
$$ ##END=
$$ 
$$ hash MD5
$$ 7C 99 9A 50 E0 79 53 EB B1 20 CB F4 0F DF B9 61
##$RELAX= 
##$RELAX= 
##$RELAX= 
##$RELAX= 
##$RELAX= 
##$RELAX= 
##$RELAX= 
$$ Bruker specific parameters
$$ --------------------------
##$DU= <C:\u>
##$EXPNO= 13140
##$NAME= <ADRS>
##$PROCNO= 1
##$TYPE= <nmr>
##$USER= <dgb>
##$AMP= (0..31)
100 100 100 100 100 100 100 100 100 100 100 100 100 100 100 100 100 100 
100 100 100 100 100 100 100 100 100 100 100 100 100 100 
##$AQSEQ= 0
##$AQ_mod= 3
##$AUNM= <au_zg>
##$AUTOPOS= <52 >
##$BF1= 250.13
##$BF2= 250.13
##$BF3= 250.13
##$BF4= 250.13
##$BF5= 500.13
##$BF6= 500.13
##$BF7= 500.13
##$BF8= 500.13
##$BYTORDA= 1
##$CFDGTYP= 0
##$CFRGTYP= 5
##$CHEMSTR= <none>
##$CNST= (0..31)
1 1 145 1 1 1 1 1 1 1 1 1 1 1 1 1 1 1 1 1 1 1 1 1 1 1 1 1 1 1 1 1 
##$CPDPRG= <>
##$CPDPRG1= <>
##$CPDPRG2= <>
##$CPDPRG3= <>
##$CPDPRG4= <mlev>
##$CPDPRG5= <mlev>
##$CPDPRG6= <mlev>
##$CPDPRG7= <mlev>
##$CPDPRG8= <mlev>
##$CPDPRGB= <>
##$CPDPRGT= <>
##$D= (0..31)
0 1 0 0 0 0 0 0 0 0.06 0 0 0 0 0 0 0.0002 0 0 0 0 0 0 0 0 0 0 0 0 0 0 
0 
##$DATE= 1133265775
##$DBL= (0..7)
120 120 120 120 120 120 120 120 
##$DBP= (0..7)
150 150 150 150 150 150 150 150 
##$DBP07= 0
##$DBPNAM0= <>
##$DBPNAM1= <>
##$DBPNAM2= <>
$$ [...]
##$SUBNAM7= <"">
##$SUBNAM8= <"">
##$SUBNAM9= <"">
##$SW= 20.6930455092707
##$SWIBOX= (0..15)
0 0 3 0 0 0 0 0 0 0 0 0 0 0 0 0 
##$SW_h= 5175.983436853
##$TD= 65536
##$TD0= 1
##$TE= 294.16
##$TE2= 300
##$TE3= 300
##$TEG= 300
##$TL= (0..7)
0 120 120 120 120 120 120 120 
##$TP= (0..7)
150 150 150 150 150 150 150 150 
##$TP07= 0
##$TPNAME0= <>
##$TPNAME1= <>
##$TPNAME2= <>
##$TPNAME3= <>
##$TPNAME4= <>
##$TPNAME5= <>
##$TPNAME6= <>
##$TPNAME7= <>
##$TPOAL= (0..7)
0.5 0.5 0.5 0.5 0.5 0.5 0.5 0.5 
##$TPOFFS= (0..7)
0 0 0 0 0 0 0 0 
##$TUNHIN= 0
##$TUNHOUT= 0
##$TUNXOUT= 0
##$USERA1= <user>
##$USERA2= <user>
##$USERA3= <user>
##$USERA4= <user>
##$USERA5= <user>
##$V9= 5
##$VALIST= <valist>
##$VCLIST= <CCCCCCCCCCCCCCC>
##$VD= 0
##$VDLIST= <DDDDDDDDDDDDDDD>
##$VPLIST= <PPPPPPPPPPPPPPP>
##$VTLIST= <TTTTTTTTTTTTTTT>
##$WBST= 1024
##$WBSW= 4
##$XGAIN= (0..3)
0 0 0 0 
##$XL= 0
##$YL= 0
##$YMAX_a= 470605
##$YMIN_a= -456533
##$ZGOPTNS= <>
##$ZL1= 120
##$ZL2= 120
##$ZL3= 120
##$ZL4= 120
##$ABSF1= 16.522
##$ABSF2= -4.171173
##$ABSG= 5
##$ABSL= 3
##$ALPHA= 0
##$AQORDER= 0
##$ASSFAC= 0
##$ASSFACI= 0
##$ASSFACX= 0
##$ASSWID= 0
##$AUNMP= <proc_1d>
##$AZFE= 0.1
##$AZFW= 0.1
##$BCFW= 0
##$BC_mod= 0
##$BYTORDP= 0
##$COROFFS= 0
##$CY= 12.5
##$DATMOD= 1
##$DC= 0
##$DFILT= <>
##$DTYPP= 0
##$F1P= 14.0000005364418
##$F2P= -0.99999901652339
##$FCOR= 0.5
##$FTSIZE= 32768
##$FT_mod= 6
##$GAMMA= 0
##$GB= 0
##$INTBC= 1
##$INTSCL= 1
##$ISEN= 128
##$LB= 0.3
##$LEV0= 0
##$LPBIN= 0
##$MAXI= 10000
##$MC2= 0
##$MEAN= 0
##$ME_mod= 0
##$MI= 0
##$NCOEF= 0
##$NC_proc= -4
##$NLEV= 6
##$NOISF1= 0
##$NOISF2= 0
##$NSP= 0
##$NTH_PI= 0
##$NZP= 0
##$OFFSET= 16.522
##$PC= 1
##$PHC0= 83.49303
##$PHC1= 5.60512
##$PH_mod= 1
##$PKNL= yes
##$PPARMOD= 0
##$PSCAL= 4
##$PSIGN= 0
##$REVERSE= no
##$SF= 250.13
##$SI= 32768
##$SIGF1= 0
##$SIGF2= 0
##$SINO= 400
##$SIOLD= 32768
##$SREGLST= <1H.CDCl3>
##$SSB= 0
##$STSI= 32768
##$STSR= 0
##$SW_p= 5175.98343685301
##$SYMM= 0
##$S_DEV= 0
##$TDeff= 65536
##$TDoff= 0
##$TI= <Analysis number 999999
Compound Code 99
Book Reference 9
Project Code 9>
##$TILT= no
##$TM1= 0
##$TM2= 0
##$TOPLEV= 0
##$USERP1= <user>
##$USERP2= <user>
##$USERP3= <user>
##$USERP4= <user>
##$USERP5= <user>
##$WDW= 1
##$XDIM= 32768
##$YMAX_p= 333979386
##$YMIN_p= -247628
$$ End of Bruker specific parameters
$$ ---------------------------------
##NTUPLES= NMR SPECTRUM
##VAR_NAME=  FREQUENCY,     SPECTRUM/REAL,   SPECTRUM/IMAG
##SYMBOL=    X,             R,               I
##VAR_TYPE=  INDEPENDENT,   DEPENDENT,       DEPENDENT
##VAR_FORM=  AFFN,          ASDF,            ASDF
##VAR_DIM=   32768,         32768,           32768
##UNITS=     HZ,            ARBITRARY UNITS, ARBITRARY UNITS
##FACTOR=    0.157963299565203, 1,           1
##FIRST=     4132.6476996994, 0,             0
##LAST=      -1043.33573715361, 0,           0
##MIN=       -1043.33573715361, -247628,     0
##MAX=       4132.6476996994, 333979386,     0
$$ Real data points
##PAGE= N=1
##DATA TABLE= (X++(R..R)), XYDATA
$$ [...]
18535E4226507K58479R46890J152430J110633P99434O72158N47602K71527k49751
18526E9735909p30437R975Q70687R83690J102095J621651K287515K511267K486422
18517G0878774J967235K332374K545909J716045K240216L766420M676607M513188
18509I4636768N829751Q168554O639787L561204L916309L202537j177133k961274
18501A21816503j202212n05782j098430K82421M288357O954180O306083O846579
18493A43687699Q815295P472698L149603J416504M81324k128608n114109n456447
18485A52323959m696752m271529l463797j755199l90313p34808j235651k606484
18477A33169426n285485p856684p596285p464738r148133j0209972r263382p831815
$$ plain form
18535 54226507 54484986 55431876 56584306 57694939 58494373 59166531 59714133 59985660 59735909
18526 59735909 59005472 59015447 59886134 60869824 61971919 63593570 65881085 68392352 70878774
18517 70878774 72846009 75178383 77724292 79440337 81680553 85446973 90123580 94636768
18509 94636768 100466519 108635073 115274860 118836064 122752373 125954910 124777777 121816503
18501 121816503 120614291 120108509 119010079 119292500 123580857 130535037 136841120 143687699
18493 143687699 152502994 159975692 163125295 164541799 165023123 162894515 157780406 152323959
18485 152323959 147627207 143355678 139891881 138136682 137746369 137011561 135775910 133169426
18477 133169426 127883941 120027257 112430972 104966234 95818101 85608129 76344747 68512932
18469F8512932p179155o411476n383529m438664l973286l663486l241228k989194
18461C1232914k810315k615208k310258j996021j736790j441437j128464p95997
18453A6398424n01755k57302M7813M36478Q81566J481771K378994L694032N294435
18444B9854456O835515P971448R602589J2280515J4196641J2940818R836838Q646670
18436A12165490Q979338P594541K392569k794353l967923m677651q539483j2472809
18428I8679719j2888864j1268524j0539228j0350088r074317o949710n031164
18421C2577824l829963k816190j607103m44496J34398r8620l36727J39560Q39629
18412B4558312P03343l52127j073320q03638k56082m10533j128471j352973q64941
$$ plain form
18469 68512932 61333777 54922301 49538772 45100108 41126822 37463336 34222108 31232914
18461 31232914 28422599 25807391 23497133 21501112 19764322 18322885 17194421 16398424
18453 16398424 15896669 15639367 15687180 16123658 17005224 18486995 20865989 24560021 29854456
18444 29854456 36689971 44661419 54264008 66544523 80741164 93681982 103518820 112165490
18436 112165490 121144828 128739369 131131938 128337585 124369662 119692011 111152528 98679719
18428 98679719 85790855 74522331 63983103 53633015 44558698 37608988 32577824
18421 32577824 28747861 25931671 24324568 23880072 24014470 23915850 23579123 23718683 24558312
18412 24558312 25261655 24909528 23836208 23032570 22776488 22365955 21237484 19884511 19019570
18403A9019570k32583L04967P13212J263064J952131K794047L978406N103324
18395C4896138N496656N177734N318651O135310O658533N480080L154590J665833
18387G3983525J579782J254098j049375l946866n177181m823121m909192o096465
18379E0815205o835271o320269n246747m627075m250062l608198k748436j957924
18371A5221223j387616r76154o07655k79226r1658m5095l5520o7356j79775k89909
18361A1261259m22733n70953o69902o75103o57792n56793m60014k91194l2557
18352F924218K92909O52711R71270J182132J413868J678419K017332K353629K260999
18343A9747487K013500K073580K028097J223534N7115n53990o90938j043577j948393
$$ plain form
18403 19019570 18786987 19091954 19805166 21068230 23020361 25814408 29792814 34896138
18395 34896138 40392794 45570528 50889179 57024489 63683022 69163102 72317692 73983525
18387 73983525 75563307 76817405 75768030 71821164 66643983 61820862 56911670 50815205
18379 50815205 43979934 37659665 32412918 27785843 23535781 19927583 17179147 15221223
18371 15221223 13833607 12857453 12249798 11970572 11878914 11833819 11798299 11730943 11551168 11261259
18361 11261259 10838526 10267573 9597671 8922568 8264776 7707983 7247969 6956775 6924218
18352 6924218 7217127 7869838 8841108 10023240 11437108 13115527 15132859 17486488 19747487
18343 19747487 21760987 23834567 25862664 27086198 27143313 26589323 25898385 24854808 22906415
18334B2906415k531472k580124k339191k216130k220090k037325j704481j319552
18326E958050j033197p91258o38584m99844l67661k61718k18635j80837j34082
18317A832234r7024j20193r2950p6138r8526j00903p7078o6703r1227p0634o4796
18306H76062m5200o6784k5092k3609k4098l4256k0843p427k3468N272j2048j8684
18294E79825o514j1156k330j3666j1416l3386J3852M36j1220P534l2336n5908
18282D23715l9107m1074j4369n542M124l9014m0109k4462k0309j289K575r232
18270A95907J2452j7333K859J8213J5058J8942m721N0090M0933k7499l4750r994
18258B60157j7626l8130j7848M4072K6822K7524k1291m1808j329L3926J2188k4261
$$ plain form
18334 22906415 20374943 17794819 15455628 13239498 11019408 8982083 7277602 5958050
18326 5958050 4924853 4133595 3495011 2995167 2627506 2365788 2147153 1966316 1832234
18317 1832234 1735210 1615017 1522067 1445929 1347403 1246500 1169422 1102719 1011492 940858 876062
18306 876062 830862 764078 738986 715377 691279 657023 636180 628753 605285 610557 598509 579825
18294 579825 573311 562155 559825 546159 534743 501357 515209 515645 504425 511959 479623 423715
18282 423715 384608 343534 329165 323623 327747 288733 248624 224162 203853 202564 205139 195907
18270 195907 208359 191026 193885 212098 227156 246098 241377 291467 332400 304901 270151 260157
18258 260157 242531 204401 186553 230625 257447 284971 263680 221872 220543 254469 266657 242396
18246B42396l2001j7382L548L2824J9135r012j7763J3126J8445n079m405J731
18234B45563k1794j9068j4085j6620j0443q26m6568k0676K0828k6029J377j0425
18222H1234j088K2344J3192P633j6029k5530L825k801K8674K883L77J045J7572
18209A33331J5295J7810P177l7212L2092N830m3773k8614K98P68M493N778N163
18196A18436J9104K9616O798j1204J659j6029k9123J8922k3138j5387R510N337
18184A14501k3382j3058j8483J2466J0402O799k4709j0148J5079l175j386K7931
18172I2837J7014l1925p353p862P936J8321j1447J4766J5506k9089L787L1005
18160A13496J313K1154K4871J281j710L3304L4131k177j8261k5832K4455K1671
$$ plain form
18246 242396 210395 193013 196561 229385 248520 239508 221745 234871 253316 248237 243832 245563
18234 245563 223769 204701 190616 173996 163553 162727 116159 95483 116311 90282 91659 81234
18222 81234 80146 102490 115682 123315 107286 81756 85581 82780 111454 114337 114714 115759 133331
18209 133331 148626 166436 173613 136401 168493 174323 130550 101936 102234 103002 107495 113273 118436
18196 118436 137540 167156 173954 162750 164409 148380 119257 138179 115041 99654 109164 114501
18184 114501 91119 78061 59578 72044 82446 89245 64536 54388 69467 66292 64906 92837
18172 92837 109851 77926 70573 62711 70647 88968 77521 92287 107793 78704 82491 113496
18160 113496 114809 135963 160834 162115 160405 193709 227840 225663 207402 181570 206025 227696
18148B27696J3558L7468J6487R534O6487O7809M7880M3007K6164P5066N6708K6189
18136G14053K5727L7847O4309J4030N2315J03275Q9620O7625N3208M6231N6823
18125A325063O2211J9672M5077M7074O4532P4949J18784J57251K11787K70677
18115B397077K96156L84125N43227Q61542J204106J763590L025399N857422J1841270
18106B8173914J5574645R10833q694241n551248k450755n007176p594852n493634
18098I867486k986098j692116j067939o91347n04302l75872k94395k79570k48199
18089A727648j82127j46476j41459j10466j24617r1887q8720p7369k4273m4179
18079F96075p7136m6762j6973m4209o3580j3341k794r873m104l9632k2261K67
$$ plain form
18148 227696 241254 278722 295209 304743 371230 439039 486919 529926 556090 631156 687864 714053
18136 714053 739780 777627 841936 855966 908281 1011556 1101176 1168801 1222009 1268240 1325063
18125 1325063 1387274 1406946 1452023 1499097 1563629 1638578 1757362 1914613 2126400 2397077
18115 2397077 2693233 3077358 3620585 4482127 5686233 7449823 10475222 16332644 28173914
18106 28173914 43748559 44659392 35965151 30413903 27963148 22955972 15361120 9867486
18098 9867486 6881388 5189272 4121333 3429986 2925684 2549812 2255417 1975847 1727648
18089 1727648 1545521 1399045 1257586 1147120 1022503 930616 841896 764527 740254 696075
18079 696075 618939 572177 555204 510995 447415 434074 431280 421407 417303 377671 355410 355677
18067C55677j7159l1425k6377m91o061j0831J2636j203q345j5851l3348N793K9659
18054B52674L0815L471j9927J5824L1455L0031K5182L6428K9980L4122J6974K4230
18042E11259K0480J0634J0321J0703J0918K534q94j672n002j3019j5140j8182
18030E22940N96J218l4409k1835o101j6266q505l4436n7804k5924K7183L8809
18018C85466J8524o480J7096j3892k7441J6888K3423L4558K0335N5974O7806K7266
18006F19523K3875J0720K2638K3858K8143K8546N119J9493k999M456r396j4153
17994G59823J1090J664q927K085n48p58m0508p1067j8863l3274p6190l2111K2118
17981E14534l8970o6214l1550O88J5415n814k2685l6829n0307j9227M52J18j3262
$$ plain form
18067 355677 338518 307093 280716 280225 274164 263333 275969 274766 266421 250570 217222 223015 252674
18054 252674 283489 286960 267033 282857 314312 344343 369525 405953 435933 470055 487029 511259
18042 511259 531739 542373 552694 563397 574315 576849 575955 574283 569281 556262 541122 522940
18030 522940 523536 524754 490345 468510 462409 446143 437638 403202 345398 319474 346657 385466
18018 385466 403990 397510 414606 400714 373273 390161 413584 448142 468477 524451 592257 619523
18006 619523 643398 654118 676756 700614 728757 757303 762422 781915 778916 783372 773976 759823
17994 759823 770913 772577 763650 765735 765187 764429 723921 652854 633991 600717 524527 492416 514534
17981 514534 475564 409350 377800 378488 393903 388089 365404 328575 278268 259041 259493 259611 246349
17968B46349J1849L3421K1919J1991P956K0507J0777K9680N7230L714l7854q883
17956D08656J8541J5745Q422r886j7991L006j8582n2091k9843j5087j8060L321
17944B96151q736q684q072l0323j7483Q814J6683J0162J0299K5719K4326M859
17932C23715J9637L8582M737J0292M053M888p665j4044O988N204k5498l6103k7237
17919C07549m3900m2420m0837l1361j8070n357J5740k9041l7191k9194j6562K2892
17907E2248J7884J4345J2782K556k1410J094J9868q659o104J2327K0582l4672
17895H2841q887K3982K9098K2279R309j2979K2466M4613L9435M0228N0906N6881
17883D00172O8590K6610K3446N3828N5898N706j6276j8937l1074k3135k8156k4698
$$ plain form
17968 246349 258198 291619 313538 325529 333485 353992 364769 394449 451679 455393 417539 408656
17956 408656 427197 442942 451364 441478 423487 426493 407911 355820 325977 310890 292830 296151
17944 296151 287415 278731 270659 240336 222853 231667 248350 258512 268811 294530 318856 323715
17932 323715 343352 381934 386671 396963 401016 405904 398239 384195 391183 396387 370889 334786 307549
17919 307549 263649 221229 180392 149031 130961 125604 141344 112303 75112 45918 29356 52248
17907 52248 70132 84477 97259 99815 78405 79499 99367 90708 84604 96931 117513 82841
17895 82841 73954 97936 127034 149313 158622 145643 168109 212722 252157 292385 343291 400172
17883 400172 468762 495372 518818 572646 628544 634250 617974 599037 567963 544828 516672 491974
17871D91974m4851n1441n4372n2620n3292l97j0808p152j4339j7142o6841j1137
17859A07582K1090k7315P193l14p104j3287R986K3472n1067j2454o386J0606R174
17846G1176j3334k3174j9816j4339J9654J2224N3091K9734L1639J7265J6008R976
17834A90104o462J4991J6356J7112K1617N421K921n03l4081Q886K4166j4574m1881
17821B04073k6758n0147K579r127q839k3583k9853k4859k6540J8466M4364j0523
17809E9253k4634m281J1634R304J122J3759k3387j9255r16r452r59k1095q565
17796a7472O866j2207M416J2354j3699J8053J2030q19J5867l083K3288J707j3229
17783C4072r438j4241L317k176j0990m1932J2740M0426m748q821n535K8708K2675
$$ plain form
17871 491974 447123 395682 341310 288690 235398 235001 224193 217041 202702 185560 118719 107582
17859 107582 128672 101357 108550 108236 101132 87845 97831 121303 70236 57782 51396 62002 71176
17846 71176 57842 34668 14852 513 20167 32391 85482 115216 146855 164120 180128 190104
17834 190104 183642 198633 214989 232101 253718 259139 262060 261557 227476 236362 260528 245954 204073
17821 204073 177315 127168 129747 120620 111781 88198 58345 33486 6946 25412 69776 59253
17809 59253 34619 30338 41972 51276 52398 66157 42770 23515 22599 13147 12188 -8907 -17472
17796 -17472 -10606 -22813 -18397 -6043 -19742 -1689 10341 9522 25389 22306 45594 47301 34072
17783 34072 24634 10393 13710 11534 544 -41388 -28648 11778 7030 -1791 -7326 21382 44057
17770D4057N007j0154L5381k0548j1443p900k943K0028J2148j9446m6113j0888
17758a2814o678R822j0527o378J9811n381j1092k02J7009J7085J945n360K607
17745I847K36j6665r351J033J2926q232j0962p625l3072k9869J2775L5312K2396
17732b1251J9070K9075k9888j5195N428j5206j4952M208K3283K9716j4390k7283
17720b7385l066J9650J3490J3428J8744j738J2267J6232j1579p353m1644j4390
17708a3344j6271O943j5043M602Q800k7222O975L4104q028K0729p106j693J1002
17695D448J9664k186k3871j2891k7108j751L6282o286p609l982K8564K3843n874
17682B1243Q332J3258k4695o461k1440j1129n746M602j2968N261j3209k7591j8314
$$ plain form
17770 44057 49064 38910 74291 53743 42300 34400 31457 51485 63633 44187 -1926 -12814
17758 -12814 -19492 -9670 -20197 -26575 -6764 -12145 -23237 -23439 -6430 10655 12600 7240 9847
17745 9847 10083 -6582 -15933 -14900 -1974 -10206 -21168 -28793 -61865 -91734 -78959 -43647 -21251
17732 -21251 -2181 26894 -2994 -18189 -12761 -27967 -42919 -38711 -15428 14288 -102 -27385
17720 -27385 -30451 -10801 2689 16117 34861 33123 45390 61622 50043 42690 1046 -13344
17708 -13344 -29615 -22672 -37715 -33113 -24313 -51535 -44560 -10456 -18484 2245 -4861 -6554 4448
17695 4448 24112 21926 -1945 -14836 -41944 -43695 -7413 -13699 -21308 -25290 3274 27117 21243
17682 21243 29575 42833 18138 11677 -9763 -20892 -26638 -22036 -35004 -29743 -42952 -70543 -88857
17669h8857L0451K7620O332R479J7393l029N213j3415r811j8998j7901K3122M7121
17656A4720K1240m621j9886k417j4859J2723j4660L835m027j6070K3507O670R38
17643G093J173K0875J043l578L881J2141J5602j4537j2443l110k3314j2445r321
17630a6940J1866k0591K2284J7606J3937q842j3134k227J763k527J1197k8520
17618a4128l3933n772J0290K9874Q816o826j167k8129J0705L279m913k188j330
17605c5422p810k2205j304J2024K1568J5932r112J3492j203j301j1568P35J5561
17592a0613K1001o811o034j2873l9342N654J0921K1896K4131j2882n283p734j9799
17579c7768j1876J3034L5875L5821k0774m2407M743J8035n192K4795L2402m517
$$ plain form
17669 -88857 -58406 -30786 -24454 -14975 2418 -611 4602 -8813 -18624 -37622 -55523 -32401 14720
17656 14720 35960 31339 11453 9036 -5823 6900 -7760 -3925 -7952 -24022 -515 6155 7093
17643 7093 8266 29141 30184 26606 30487 42628 58230 43693 31250 28140 4826 -7619 -16940
17630 -16940 -5074 -25665 -3381 14225 28162 19320 6186 3959 5722 3195 14392 -14128
17618 -14128 -48061 -53833 -43543 -13669 -4853 -11679 -12846 -40975 -30270 -26991 -31904 -34092 -35422
17605 -35422 -43232 -65437 -66741 -54717 -33149 -17217 -26329 -12837 -14040 -15341 -26909 -26174 -10613
17592 -10613 10388 3577 -2457 -15330 -54672 -49018 -38097 -16201 7930 -4952 -10235 -17969 -37768
17579 -37768 -49644 -36610 -735 35086 14312 -28095 -23352 -5317 -10509 14286 46688 42171
17567D2171J7611j8360n1784N922j2647m1802p124J8308K5134J9399j1387P57
17555a3802l1782k0380J7168K5570J6537M965j2370M70j1473j7638j4232J1606
17543d5361L4047J9172o457J076L97j3812j2777M361l355j1499k3600K0656K7332
17530i820R58j0843j6144j9983j1361J00L0346q972J7215j3945j1697O737l373
17517e0782j6431K7366L6343K8493J4762j5007l3626k5634M914J341j9451r973
17505e7685O506K1242J2529j693K735K8688j5732j4066n84J174K093j6331j6384
17492d7508J8725j1335j3693j3180L622L5662L5539J9427j3998j9546j5794k418
17480b4497J2576J0761K3929M520m848k3155l3745l342j7386j9512K625L0925
$$ plain form
17567 42171 59782 41422 -10362 -4440 -17087 -58889 -66013 -47705 -22571 -3172 -14559 -13802
17555 -13802 -45584 -65964 -48796 -23226 -6689 -1724 -14094 -13624 -25097 -42735 -56967 -45361
17543 -45361 -11314 7858 1401 2477 2874 -10938 -23715 -19354 -22709 -34208 -57808 -37152 -9820
17530 -9820 -8862 -19705 -35849 -55832 -67193 -67093 -36747 -45719 -28504 -42449 -54146 -47409 -50782
17517 -50782 -67213 -39847 -3504 24989 39751 24744 -8882 -34516 -29602 -28261 -47712 -57685
17505 -57685 -51179 -29937 -17408 -19101 -16366 12322 -3410 -17476 -18060 -16886 -14793 -31124 -47508
17492 -47508 -28783 -40118 -53811 -66991 -63369 -27707 7832 27259 13261 -6285 -22079 -24497
17480 -24497 -11921 -1160 22769 27289 22441 -714 -34459 -37801 -55187 -74699 -72074 -41149
17468d1149P91L9458n282m5334J5020L2147n036n089m590L2375k0481K649J5463
17455A0942j4610l9327j2447R841K2185J4423K183r499M718J0204L8158K941K4509
17442F4221O1474M7093M7139N217l9528n5808k8129k1103m2152k4239k3667j5593
17430b5075J2951R445l356R19L1876L5724q195j2786l6217j9027J2226n660j001
17417h176J7469l6039j3346o486J0959L610J0696K9662R009m780l3108J1297K0122
17404A0889J0280J7032j2801l5933k4626J2494L0841j98j2685J4202j4567L397
17392a675k146k0969K3607L759P476M927p613r602j8108j4881O229j5801J7932
17379b6865L3027O1o838r200M187J9071L525k2324p617q664l6330Q10O2840L1422
$$ plain form
17468 -41149 -40358 -900 -6182 -51516 -36496 -4349 -9385 -14474 -19064 13311 -7170 -4521 10942
17455 10942 -3668 -42995 -55442 -45601 -23416 -8993 -6810 -16309 -11591 -1387 36771 39712 64221
17442 64221 125695 172788 219927 225144 185616 129808 101679 80576 38424 14185 -9482 -25075
17430 -25075 -12124 -2679 -6035 -5116 26760 62484 54289 41503 5286 -13741 -1515 -7175 -8176
17417 -8176 9293 -26746 -40092 -46578 -35619 -32009 -21313 8349 17358 12578 -20530 -9233 10889
17404 10889 21169 38201 25400 -10533 -35159 -22665 8176 7978 -4707 9495 -5072 -1675
17392 -1675 -3821 -24790 -1183 2576 10052 14979 7366 -2236 -20344 -35225 -28996 -44797 -26865
17379 -26865 6162 6223 -615 -9815 -5628 13443 16968 -5356 -12973 -21637 -57967 -57157 5683 37105
17365C7105O661l1839m732j4603q382J9234K5265j0747J3655j1951j4739K2968
17353B7895j87r145j5423j1839j9547L6362K2646j0953j5617J0898m700k6533
17341a6143k9672r234n39k455P293O270J0863L013l677L4514K1485k270j2414
17328G034j4567m04K9165K376l5586j1480J8915J4775J9255q861l2892j6433p902
17315c6605J5874O633Q867j259k6446J1525M666l179j266j1341j2157J5410L0045
17302G67M418j1820K124K5140R055J2775p777l9734n253r110L563n260l233k867
17288b7212L330J2048J1148k3882j8707k380k6379k1815N4529K4418L0420K8028
17276D3546q380k1384j3225r399j62N957J464k5289J2263O06m897Q222J3734k6
$$ plain form
17365 37105 43766 11927 7195 -7408 -15790 3444 28709 17962 31617 19666 4927 27895
17353 27895 27708 18563 3140 -8699 -28246 8116 30762 19809 4192 15090 10390 -16143
17341 -16143 -45815 -55049 -55588 -58043 -50750 -44480 -33617 -30604 -34281 233 21718 19448 7034
17328 7034 -7533 -7937 21228 23604 -11982 -23462 -4547 10228 29483 20622 -12270 -28703 -36605
17315 -36605 -20731 -14098 -5231 -6490 -32936 -21411 -16745 -19924 -21190 -32531 -44688 -29278 767
17302 767 5185 -6635 -4511 20629 29684 42459 34682 -5052 -10305 -19415 -15852 -21112 -24345 -27212
17288 -27212 -23882 -11834 -686 -24568 -43275 -45655 -72034 -93849 -39320 -14902 15518 43546
17276 43546 35166 13782 557 -8842 -9004 -3047 -1583 -26872 -14609 -14003 -18900 -10678 3056 3030
17262C030n876j6569m331M018M335p812k682J8930K6106J2778k6721k3730K528
17249a5996j5107m602m833j3286O721P139K7914k5092L921J3832J4517k3862P862
17236b0872L752J0603K382l86k5262K2820L3208k6809l162L624J7703j9948l3155
17223c5502m158L1040J7447m4930j0474j677L438K1983R385K8510l267k4164J304
17210a1065l5194j9158J4790K7547r864j899J3016M3j8759J1735L753lj6776L1741
17196a0093J869k700L12k7014k9390P037J7431O869K3165L6855J5390l3743l6784
17183c0796R561P395k798J5795m251k1464l856q890J2632L1664K2659j4784k7000
17170a4133J2831J3149l1229q571m383J0228j760j660Q984L0235J5862k3825p152
$$ plain form
17262 3030 -2846 -19415 -23746 -19728 -15393 -23205 -25887 -6957 19149 31927 5206 -18524 -15996
17249 -15996 -31103 -35705 -40538 -53824 -47103 -39964 -12050 -37142 -33221 -19389 -4872 -28734 -20872
17236 -20872 -17120 -6517 -4135 -4521 -29783 -6963 26245 -564 -3726 -102 17601 -2347 -35502
17223 -35502 -39660 -8620 8827 -36103 -46577 -48254 -44816 -22833 -13448 15062 11795 -12369 -11065
17210 -11065 -46259 -65417 -50627 -23080 -32944 -34843 -21827 -21784 -40543 -28808 -25055 -25058 -41834 -10093
17196 -10093 -8224 -10924 -10612 -37626 -67016 -59979 -42548 -35679 -12514 24341 39731 5988 -30796
17183 -30796 -21235 -13840 -16638 -843 -5094 -26558 -30414 -39304 -26672 4992 27651 12867 -14133
17170 -14133 -1302 11847 -19382 -27953 -32336 -22108 -23868 -25528 -16544 13691 29553 5728 -1424
17157a424O902m8474m1657L310M3744K5228J5841J1746j1016J0289j2923l3156
17145c1590k23j3080k0632J3431j5614p509N0704P698J3661P447j8306j2507J8677
17132g843J4126J7898J3418k8906l4201J3535l409k0808P59O966M15L4568J5474
17119B1992p844R352L601m1407k8376J3883j8146k322K5966J7594q736J3944j9493
17106a9992m400J4834J3292k2834n779j3157l042J6568M554k287K205J774k1874
17093d0138O580p298j6755n426L0731J4722p245l057R629J8137p925o016o085
17080b0146j3529r453P602l773J0307j3599J2045O109K3882J2882R86j4771n375
17067f833j2318P960R552j4890o228J6638K8894j531R752j1334l2981p084R713
$$ plain form
17157 -1424 5478 -42996 -84653 -81343 -37599 -12371 3470 15216 4200 14489 1566 -31590
17145 -31590 -31813 -44893 -65525 -52094 -67708 -75217 -24513 -16815 -3154 4293 -14013 -26520 -7843
17132 -7843 6283 24181 37599 8693 -25508 -11973 -15382 -36190 -35431 -28465 -28050 6518 21992
17119 21992 14148 23500 27101 -14306 -42682 -28799 -46945 -49267 -23301 -5707 -14443 -499 -19992
17106 -19992 -24392 -9558 3734 -19100 -24879 -38036 -41078 -24510 -19956 -22243 -20038 -18264 -40138
17093 -40138 -33558 -40856 -57611 -63037 -32306 -17584 -24829 -27886 -18257 -120 -8045 -14061 -20146
17080 -20146 -33675 -43128 -35526 -39299 -28992 -42591 -30546 -24437 -555 12327 13313 -1458 -6833
17067 -6833 -19151 -11191 -1639 -16529 -22757 -6119 22775 21244 30996 19662 -13319 -20403 -10690
17054a0690p863K0413J697j0273j0716k2370L260K8063N131Q712Q526K183m7652
17041c1579M219k8561R664K5201j194O000k0204J494Q390M517P409K7590j5286
17028b340j5581J2907J2615j7679r020L0238Q66q127q546j7004L359J5365J7261
17015A4314q49k4729l8939q068K8153K6599K366M476r715j970J3246J4208j0132
17002H960k8186j7169K531J2379J8833Q037j899j6880k9662K3139m588k1635k3104
16989f9244O771J2105J3964P455O647n136j5488j4256n723J8585M3371j0875K3100
16976A1276O424j4509Q645j4773m84K074k3491P874k031l812j568J5296k629Q781
16962b927R240o499J2715m164k8873J0397J5585j4639k628J1676R866j1564L448
$$ plain form
17054 -10690 -18553 1860 3557 -6716 -17432 -39802 -36542 -8479 -3348 5364 13890 16073 -31579
17041 -31579 -27360 -55921 -46257 -21056 -22250 -16250 -36454 -34960 -26570 -22053 -14644 12946 -2340
17028 -2340 -17921 -5014 7601 -10078 -19098 11140 12006 3879 -4667 -21671 -18312 -2947 14314
17015 14314 13465 -11264 -50203 -58271 -30118 -3519 -1153 3323 -6392 -8362 4884 19092 8960
17002 8960 -19226 -36395 -33864 -21485 -2652 5385 3486 -13394 -43056 -19917 -24505 -46140 -69244
16989 -69244 -62473 -50368 -36404 -28949 -22302 -27438 -42926 -57182 -62905 -44320 -949 -11824 11276
16976 11276 17700 3191 11836 -2937 -3421 -1347 -24838 -16964 -18995 -22807 -24375 -9079 -11708 -2927
16962 -2927 6313 -186 12529 8365 -20508 -10111 5474 -9165 -11793 -117 9749 -1815 1633
16949A633k742N329L188P258j5327j7934K46M7563Q535n8341J097K0285J8658
16936A9448L931J5006j061j3520K941R072j3107j5169K076M6l7998k1445k4771
16923g4551P193N9747L3646P369l6157q904j0628m0448Q7M4155L383J5144q447
16910h411j9336o443p604J5536l892m183q405M0826N061k0011J4166j2980J791
16897a3885Q74J2536K925l145l419Q38j449k2535k7685k0720J3770J2581N289
16884d4025J4944l56J5979L0907k732j0016k151j6839l2436O355L1703p304k9679
16871d5650Q827L747r757J9889J4133r844j7093K0744J2141j2285j5933p967Q695
16858c0353J2119L9066j5390j9925J1454R641j167j7880l065k3325k1573J9462
$$ plain form
16949 1633 -1109 4220 7408 14666 -661 -18595 -18349 29214 37749 -20592 -19495 790 19448
16936 19448 23379 38385 37324 23804 26745 35817 22710 7541 9617 9663 -28335 -49780 -74551
16923 -74551 -67358 -7611 26035 33404 -2753 -11657 -22285 -62733 -62646 -18491 -15108 36 -8411
16910 -8411 -27747 -34190 -41794 -26258 -30150 -34333 -42738 -1912 3149 -16862 -2696 -15676 -13885
16897 -13885 -13011 -475 2450 -695 -4114 -3276 -4725 -27260 -54945 -75665 -61895 -49314 -44025
16884 -44025 -29081 -29437 -13458 17449 14717 4701 2550 -14289 -46725 -40370 -8667 -15971 -45650
16871 -45650 -36823 -33076 -42833 -22944 -8811 -18655 -35748 -15004 -2863 -15148 -31081 -39048 -30353
16858 -30353 -18234 20832 5442 -14483 -3029 6612 5445 -12435 -15500 -38825 -60398 -40936
16846d0936J8996K9843r306k0540k2989L448K0252K5736q868N419M773m545O221
16833G504j507K1728j1985j8266n9K0365q353j0801K807k7002m852p252n379Q419
16819c4633J9631N454O943J6065J1149k5465m5618j9844K936L439l15J6657k388
16806d5989j5454M539L3460R590J5812j4373j2311N624m147J9555Q437o589q350
16793a0196K524j1308L1777K166k4863o18j3431J434J9968J893m058J3542m791
16780D039k974l273n568k3305n541j1331j754K3358Q179J7764l2959j3847K4391
16767b2821j6333L571K1925N351J7827J339J7155R774l0474l9224K3701M977P998
16754D766j7174M12K5319l413j0991j4646j5410j3883J6559L0638J5889k0488
$$ plain form
16846 -40936 -21940 7903 -1403 -21943 -44932 -41484 -21232 4504 -4364 1055 5828 1283 7504
16833 7504 5997 27725 15740 -2526 -2585 17780 9427 -1374 1433 -25569 -30421 -37673 -43052 -34633
16819 -34633 -15002 -9548 -2605 13460 24609 -856 -46474 -66318 -63382 -59943 -60258 -43601 -45989
16806 -45989 -61443 -56904 -23444 -13854 1958 -12415 -24726 -19102 -23249 -3694 4743 -1846 -10196
16793 -10196 -7672 -18980 12797 14963 -9900 -10518 -23949 -22515 -2547 -654 -4712 8830 4039
16780 4039 1065 -2208 -7776 -31081 -36622 -47953 -49707 -26349 -18170 -406 -33365 -47212 -22821
16767 -22821 -39154 -35583 -13658 -8307 9520 10859 28014 37788 7314 -31910 -8209 -3232 4766
16754 4766 -12408 -11996 13323 9910 -1081 -15727 -31137 -45020 -28461 2177 18066 -2422
16742b422j1991j482J3865r707L557R963K5729m299p416j4454j2346l996o164
16729b1163j2532J34p148l0776j0155J5170L4094K1833K619j2043J2265L282j2199
16716a6619K0153J1283J6089J0318k2645j7254m8j59P414N775l0737l3028j297
16703e0755j373l677p286K703p186j1520J2590K6860L3305J6529J0796m762j4979
16690A245j7205j5382K0014o484r382J7984J5807k9058k9559L1576J6638j2904
16678a6710k1536j6519O944K0522P096J0376k9709j5932j2427j0692K6571J9585
16666c2431J8936L0200k5042k0547k111j1396m992J2637J3393J8574K883q559
16654h455Q273K3587R846l3744j5473O991k828K1701L360l400J141l2109j7238
$$ plain form
16742 -2422 -14413 -15895 -2030 -11737 -8180 1783 27512 23213 15797 1343 -11003 -14999 -21163
16729 -21163 -33695 -33561 -40709 -71485 -81640 -66470 -32376 -10543 -7924 -19967 -7702 -4420 -16619
16716 -16619 3534 14817 30906 41224 18579 1325 1277 1118 8532 14307 -16430 -49458 -50755
16703 -50755 -52128 -55805 -63091 -60388 -67574 -79094 -66504 -39644 -6339 10190 20986 16224 1245
16690 1245 -15960 -31342 -11328 -17812 -27194 -9210 6597 -22461 -52020 -20444 -3806 -16710
16678 -16710 -38246 -54765 -47821 -27299 -20203 -9827 -39536 -55468 -67895 -78587 -52016 -32431
16666 -32431 -13495 16705 -8337 -28884 -30995 -42391 -47383 -34746 -21353 -2779 104 -8455
16654 -8455 -182 23405 33251 -493 -15966 -8975 -11803 9898 13258 9858 10999 -21110 -38348
16641c8348K684o434q903j3690J4262K300J6682J3359P376l589j4863Q157q164
16628b9171j3742P664J1749j0238k656j7087j0502J3707J3758P003J1576j5256
16616c3195L6153L45k3487R288o996j7078j5485r722K0077L6740Q39M061K55J789
16602C584p796k0375Q096J1144J3224J543m454J2079j2979l2348j735J9961J3122
16589C066j4707o307J8670K773Q834j267j750j1478j0853j880J4728J4735m034
16576A0530O809n590j0397j4486k1348J3166K5325j0490r29K369Q187n547j6435
16563a8836m257R309J0934m241q816J3026n576j9938k1113k852J1633J8218N005
16550a7504k4655N372j0830O944k875J6631M934m414Q082J8645j4264p388L344
$$ plain form
16641 -38348 -35664 -42098 -51001 -64691 -50429 -48129 -31447 -18088 -10712 -14301 -29164 -21007 -29171
16628 -29171 -42913 -35249 -23500 -33738 -36394 -53481 -63983 -50276 -36518 -29515 -17939 -33195
16616 -33195 2958 3303 -20184 -10896 -17892 -34970 -50455 -60177 -40100 -3360 -2521 1540 1795 3584
16602 3584 -4212 -24587 -16491 -5347 7877 9420 4966 17045 4066 -28282 -30017 -10056 3066
16589 3066 -11641 -17948 722 3495 12329 11062 9312 -2166 -13019 -14899 -171 14564 10530
16576 10530 17339 11749 1352 -13134 -34482 -21316 4009 -6481 -7410 -5041 3146 -2401 -18836
16563 -18836 -23093 -13784 -2850 -7091 -15907 -2881 -8457 -28395 -49508 -52360 -40727 -22509 -17504
16550 -17504 -42159 -36787 -47617 -40673 -43548 -26917 -21983 -26397 -18315 330 -13934 -21322 -17978
16537a7978K1710j938r869K913J9676j3441p512M508p859Q938J4677k2235k0186
16524b8596J2413j000J8341j797R254k1166l585p93R211q59J0421J0672j3099
16511e83k6294J302O9762K9540j8419o300k3864j2739R035P273j8153r087j6523
16498a5050J2583r102m479j7283L84L491K0321K6136r208m467j7188J2091L581
16485A810k1232j5711K4775m195k101J8446K0383j7147k1126k310k2296j5418
16473e6122J4079L0000o884R135J9475O853k3717P323j7545P577L494J893k2520
16460b6959P242k703R921J707Q383K4215J5757j0160j0445k8657j0501j5805j868
16447c9873J173N011J3243K9158n270m322k0977J1354j4270j2972k657j2387R857
$$ plain form
16537 -17978 3732 1794 -8075 -5162 14514 1073 -6439 -1931 -9790 -852 13825 -8410 -28596
16524 -28596 -16183 -17183 1158 -639 8615 -12551 -16136 -16929 -7718 -8577 1844 12516 -583
16511 -583 -26877 -25575 44187 73727 55308 49008 25144 12405 21440 28713 10560 1473 -15050
16498 -15050 -2467 -11569 -16048 -33331 -32947 -29456 -9135 17001 7793 3326 -13862 -1771 1810
16485 1810 -19422 -35133 -10358 -14553 -16654 1792 22175 5028 -16098 -18408 -40704 -56122
16473 -56122 -42043 -12043 -18927 -9792 9683 16536 -7181 142 -17403 -9826 -6332 -4439 -26959
16460 -26959 -19717 -22420 -12499 -10792 -2409 21806 37563 27403 16958 -11699 -22200 -38005 -39873
16447 -39873 -38700 -33689 -20446 8712 3442 -880 -21857 -10503 -24773 -37745 -40402 -52789 -42932
16434d2932K0970k4978J3556R012K3760O111K0788l196m134M642M030j3659k7968
16421a3998k0171P793j0965k059L5564L5129j3986l607j8545j4670l960J4037
16409i438N710k6873Q630K5174k2697J2099K294l143K3257J2567r932j8703P502
16396F447O484j8610J891j5047J5601J1603r643k5933j9454L0341M5780R292J4662
16383E3414K608J7O332l5549k3022j1988k3135R725P232k708J8884J0344r880
16370B274l9983m1582j491M5104M7015o09j2114R565J9748k713o327k234k3055
16357f402l7849j8015q44m118J886M0902J3667J2682K582p597o577j2239J4354
16344g568O071j2631k2497J2647j6897K090k257M8946K8231q653p166n173k3458
$$ plain form
16434 -42932 -21962 -46940 -33384 -24372 -612 5499 26287 23091 18957 23599 27629 13970 -13998
16421 -13998 -34169 -26376 -37341 -39400 -3836 31293 17307 13700 -4845 -19515 -23475 -9438
16409 -9438 -3728 -30601 -21971 3203 -19494 -7395 -5101 -8244 15013 27580 17648 -1055 6447
16396 6447 12931 -5679 -3788 -18835 -3234 8369 -1274 -27207 -46661 -16320 29460 38752 53414
16383 53414 56022 56039 62371 26822 3800 -8188 -31323 -21598 -14366 -17074 1810 12154 2274
16370 2274 -37709 -79291 -80782 -35678 11337 10728 -1386 8179 27927 25214 18887 16653 -6402
16357 -6402 -44251 -62266 -63110 -67228 -65342 -24440 -10773 1909 4491 -3106 -9683 -21922 -7568
16344 -7568 -1497 -14128 -36625 -23978 -40875 -38785 -41042 7904 36135 27482 20316 15143 -8315
16331h315l1231r556J5822J0913R731J5923J947j0738p406J0826j00j21K411o1128
16317f1022j2037K5262J8055J8769k182j3580j0601n125J6801L2192J9043k0224
16305E351J3910L870J6600k306p801j5500o777K1222L0408r433m9729l727J831
16292b081n433k4534K933J894L2539k60J3105J8090q176k3879k3657N233K873
16279a1353M3222k065r73j3468k1528l5577n799L2698k535N423j6519J6644J6922
16266E092j3979O806K1604O166k6392j4431j397l227m1225l0489K3723L8433K4884
16253d432P496J2963J4347q767p223j0209j0548O194J9630K7380O525J1568J6508
16240H1432l1187l6366L354J4784o410j5117J0302k4747l1757l3171j887K7673
$$ plain form
16331 -8315 -39546 -49102 -33280 -22367 -12636 3287 5234 -5504 -12910 -2084 -2184 -2305 106 -61022
16317 -61022 -73059 -47797 -29742 -10973 -13155 -26735 -37336 -42461 -25660 6532 25575 5351
16305 5351 19261 23131 39731 37425 29624 14124 7347 28569 58977 49544 -185 -3912 -2081
16292 -2081 -7514 -32048 -29115 -27221 5318 5058 18163 36253 28077 4198 -19459 -14226 -11353
16279 -11353 31869 29804 28831 15363 -6165 -41742 -47541 -14843 -17378 -11955 -28474 -11830 5092
16266 5092 -8887 -2081 19523 25689 -703 -15134 -16531 -19758 -60983 -91472 -67749 -29316 -4432
16253 -4432 3064 16027 30374 21607 14384 4175 -6373 -179 19451 46831 53356 64924 81432
16240 81432 50245 13879 17233 32017 25607 10490 20792 -3955 -35712 -68883 -70770 -43097
16228d3097J1179J5775n595m237J661l4132l295q397k257M402J4212K6293l818
16215c1306j3429q063m699J3101j418P775J4876k3027K043L7983J191q117Q681
16202d409O273N851N410k6418k2823K162J806j763J3611J856k7684J9155Q666
16189a8307k5022L152L3790K1700k8881j5699k1246j022l054K685L471Q772O631
16176c3030K6828q456J2865Q38o485o419R963L1808j0034l7297J7394K698j9139
16163a8466J7883k684N748q485k517n01k059J0964r313j2322J2555K2916n87K067
16149A5199r035J649L566m071j0623K5325J3012k6782o652K5670j6737r494k614
16136a587j276K128q613J1656J8971p644n883k4704j5367K9853J1287k4005o088
$$ plain form
16228 -43097 -31918 -16143 -21738 -25975 -24314 -58446 -61741 -70138 -72395 -67993 -53781 -27488 -31306
16215 -31306 -44735 -52798 -57497 -44396 -45814 -38039 -23163 -46190 -44147 -6164 -4973 -13090 -4409
16202 -4409 1864 7715 13125 -13293 -36116 -33954 -32148 -33911 -20300 -18444 -46128 -26973 -18307
16189 -18307 -43329 -40177 -6387 15313 -13568 -29267 -50513 -51535 -54589 -51904 -48433 -39661 -33030
16176 -33030 -6202 -14658 -1793 -955 -7440 -13859 -3896 27912 17878 -19419 -2025 673 -18466
16163 -18466 -583 -3267 2481 -6004 -8521 -9022 -11081 -117 -9430 -21752 -9197 13719 13132 15199
16149 15199 6164 7813 11379 7308 -3315 22010 35022 8240 1588 27258 10521 1027 -1587
16136 -1587 -2863 -735 -9348 2308 21279 13635 7752 -16952 -32319 -2466 8821 -15184 -21272
16123b1272j4560J6411J3280j6435j9777Q231Q005r29J2050O126j1230J4192N109
16110g99J726J8939q190j8824l0326q9K0292K4208J748K2432j2446j0679k0830
16097a2838l7357j4047Q833r398J1950L9953J4505p133k4355P411m306j6749l486
16084d7017J4114Q450Q983J1835K6714j6042m1511Q713K440J6115j6845j1188
16072c5239P724N137q628L2107J2277j0958M96J3168n767J0442n022J0511k7694
16059a446l3923j6743j4189K4033j1485L2938j2716q66R205J4867R682J6065k6638
16046a1216r35r733M088R192j4809k8095K8317K085O110j011K3368j7834q831
16033a9304j620L862P420Q702o467j3946N952k06k7100P500J3819J262j7082o784
$$ plain form
16123 -21272 -35832 -19421 -6141 -22576 -42353 -34122 -26117 -27046 -14996 -8870 -20100 -5908 -799
16110 -799 927 19866 11676 -7148 -37474 -37563 -17271 6937 8685 31117 18671 7992 -12838
16097 -12838 -50195 -64242 -55409 -64807 -52857 -12904 1601 -5532 -29887 -22476 -26782 -43531 -47017
16084 -47017 -32903 -24453 -15470 -3635 23079 7037 -34474 -25761 -23321 -7206 -24051 -35239
16072 -35239 -27515 -22378 -31006 1101 13378 2420 2916 16084 10317 20759 15737 26248 -1446
16059 -1446 -35369 -52112 -66301 -42268 -53753 -20815 -33531 -34397 -25192 -10325 -643 15422 -11216
16046 -11216 -12151 -21884 -17796 -8604 -23413 -51508 -23191 -21106 -14996 -16007 7361 -10473 -19304
16033 -19304 -20924 -17062 -9642 -940 -7407 -21353 -15401 -15607 -42707 -35207 -21388 -20126 -37208 -43992
16019d3992J4757q746p544Q746j6864R168L552L7436K6740k0031j5799k5312P367
16006c0522k53n362L94J0659Q734O126J3109j6640Q77K6801j532j0243m0189J45
15992c7896K6056J3327l4305l2587K348K0059M3313M7279J3462k5942k0202k0967
15980f055r990q175N4469K1244m846q35J0846Q53J3237p694L30k7036j6294J2130
15966C2184k147N098k9606j1012N575r687R577J288J9411R050j3913k0070j1936
15953a6188r284J3843R219J9504J4310P301l1158j3166J1470k992l0437N186J3965
15940h427r91j2676J4518J112J2719Q952J9872L767J3008Q940K3803j6571l6528
15927C1498j8297m66j7166j2275O372m251j6922J2293K2287l759P371K8100m283
$$ plain form
16019 -43992 -29235 -37981 -45525 -36779 -53643 -44475 -40923 -3487 23253 3222 -12577 -37889 -30522
16006 -30522 -30775 -36137 -35743 -25084 -16350 -10224 2885 -13755 -12878 13923 12391 2148 -38041 -37896
15992 -37896 -11840 1487 -32818 -65405 -63057 -42998 315 47594 61056 35114 14912 -6055
15980 -6055 -16045 -24220 30249 51493 46647 45812 56658 57511 70748 63054 63384 36348 20054 32184
15966 32184 30037 35135 5529 -5483 92 -9595 -18 1270 20681 29731 15818 -4252 -16188
15953 -16188 -25472 -11629 -2410 17094 31404 38705 7547 -5619 5851 2859 -27578 -22392 -8427
15940 -8427 -9418 -22094 -7576 -6464 6255 15207 35079 38846 51854 60794 84597 68026 31498
15927 31498 13201 12735 -4431 -16706 -10334 -14585 -31507 -19214 3073 -686 6685 34785 30502
15914C0502m2221j248N279o391k3688L940J0214j2168k4220j6081M4773J2666
15902a8643o31J1443O502L18Q383j630k3563n409L4600j204J7762j571k9522j8796
15888b1961k6219J4797L1762K6428o64n1581Q354M6075N46l8268j8674k3557Q130
15875d4832L1419K2203n623N552j1391j4186J0677K3641j6499l6715J6378J9060
15863c16K71q968j3088L674K0906K6212p110k7293l2667j5987K3487J3676J9292
15850B089L24j8418J8366O048k8468q537J1413K2290j2024J6193K6184j9102k4869
15837h511k9104j0394J4973J362L7211J3202q104J5193j2193j8082o668J5292
15825D177J7353j6856j8874j7126p276j1637k164j47K7734K5465J462p94R599
$$ plain form
15914 30502 -11719 -12967 -7688 -14079 -37767 -33827 -23613 -35781 -60001 -76082 -31309 -18643
15902 -18643 -19274 -7831 -1329 -1011 7372 5742 -17821 -23230 11370 10166 27928 26357 -3165 -21961
15888 -21961 -48180 -33383 -1621 24807 24143 -27438 -19084 26991 27537 -10731 -29405 -52962 -44832
15875 -44832 -13413 8790 3167 8719 -2672 -16858 -6181 17460 961 -35754 -19376 -316
15863 -316 -45 -9013 -22101 -18427 2479 28691 21581 -5712 -38379 -54366 -30879 -17203 2089
15850 2089 2413 -16005 2361 8409 -20059 -28596 -17183 5107 -6917 9276 35460 16358 -8511
15837 -8511 -37615 -48009 -33036 -31674 5537 18739 10635 25828 13635 -4447 -11115 4177
15825 4177 21530 4674 -14200 -31326 -38602 -50239 -52403 -52550 -24816 649 2111 1317 10916
15812A0916J2778J7577N311L977j6316j6766o820j5990M95J7490j3403j4121L9025
15799B4153n441n162j7841j8930j0707J810j0740J9862L0893j2931J1713j0049
15787c370Q824j0417r562m0157J4344K4209m293r266J3012L9047L615j4719n247
15774F020j6764Q259P385n579M491j8362k2292K1340P688K1446j07j9108n368
15761a0951j4346j5250J675K128J7396r85j3830p80j6528J4688N3873J7400K0440
15748E4930L505j5863J1991j4105J4731J2121l3021k6116j4016l578j7956l1875
15736e9252j5106L5450N347P390L2425K2497l180k4087j4630R502K7601k2486
15724A471k4562k9994O327L9141q56k338j4881K0581K3113P698j8555p359l6099
$$ plain form
15812 10916 23694 41271 46582 50559 34243 17477 10657 -5333 -4838 12652 -751 -14872 24153
15799 24153 18712 13550 -4291 -23221 -33928 -32118 -42858 -22996 7897 -5034 6679 -3370
15787 -3370 5454 -4963 -14525 -54682 -40338 -16129 -20422 -29688 -16676 22371 25986 11267 6020
15774 6020 -10744 -2485 4900 -679 3812 -14550 -36842 -15502 -7814 13632 13525 -5583 -10951
15761 -10951 -25297 -40547 -38872 -36744 -19348 -20333 -34163 -34943 -51471 -36783 17090 34490 54930
15748 54930 58435 42572 54563 40458 55189 67310 34289 8173 -5843 -9421 -27377 -59252
15736 -59252 -74358 -38908 -33561 -26171 6254 28751 25571 1484 -13146 -3644 23957 1471
15724 1471 -23091 -53085 -46758 -7617 -8473 -10811 -25692 -5111 18002 25700 7145 -214 -36313
15711c6313K2268J2753r370k6421J575M3826j3165j1084K7143R449j1092q744
15699H25J2200J8102K353J0843m6932l853n014j9438k6322j2762J7171J6108o35
15686c7354J1641J8548K3445P255j4845j3001j0104m934o748n680k2158R534L0073
15673a4328J3021l200m737j057j6393l4773J898L8544Q198k273J3150q579q514
15660a9043L0839K3870l570N907k8446l575j686j5689n865j2851M677p924j3290
15647d6646q96P721K7550O344K8071J3705r015J3730j1011k9446j9815j1334K2832
15634h210J5328n584j0844j0079J8404K9822j6555j0165K7072O294j8783k7867
15622a1167j2231r92L395K5017o322k3066k3288j7816K9777K333J3174N816O48
$$ plain form
15711 -36313 -14045 -1292 -10662 -37083 -35508 8318 -4847 -15931 11212 20661 9569 825
15699 825 13025 31127 33480 44323 -2609 -6462 -11476 -30914 -57236 -69998 -52827 -36719 -37354
15686 -37354 -25713 -7165 16280 23535 8690 -4311 -14415 -19349 -26097 -31777 -53935 -44401 -14328
15673 -14328 -1307 -4507 -9244 -10301 -26694 -61467 -59569 -21025 -12827 -15100 -1950 -10529 -19043
15660 -19043 11796 35666 32096 38003 9557 5982 4296 -11393 -17258 -30109 -25432 -33356 -46646
15647 -46646 -47542 -39821 -12271 -5927 22144 35849 26834 40564 29553 107 -19708 -31042 -8210
15634 -8210 7118 1534 -9310 -19389 -985 28837 12282 2117 29189 35483 16700 -11167
15622 -11167 -23398 -24390 -20995 4022 -2300 -25366 -48654 -66470 -36693 -34360 -21186 -15370 -14722
15609a4722K110l391o098J0272N545m7k604j6859n123N1412k9671j2648K2887
15596A063J8919J0889l1140l6762J311J2125L164J3892j4867j5841j6481J0008
15584d3720J5047r0o583n648k87J2586K3487J6805K3823j2352k65j923k5065j4770
15570a8955J207K713J7633j6445k4188M3145L6295k313k8279m2551k776J2087
15558b2427K3766j6J668j2381l493k0168J2447K3786j9100o937P747l1693K0337
15545b6464P704l378m599J1054n591Q310L34J8108J3431j83k3612J6223N1384
15532F2721J0270k3713j2738L539m3200j6237J3431J8984o640m11J5257k0356
15520I07j8441O125M039P398K103j2914j6747J6017J0817l892Q88m800l161n169
$$ plain form
15609 -14722 -12612 -16003 -22101 -11829 -6284 -6331 -8935 -25794 -30917 20495 -9176 -21824 1063
15596 1063 19982 30871 -269 -37031 -35720 -23595 -20431 -6539 -21406 -37247 -53728 -43720
15584 -43720 -28673 -28763 -35346 -40994 -41281 -28695 -5208 11597 35420 23068 22803 20880 -4185 -18955
15570 -18955 -17748 -15035 2598 -13847 -38035 5110 41405 39092 10813 -31738 -34514 -22427
15558 -22427 1339 1323 2991 -9390 -12883 -33051 -20604 3182 -15918 -22855 -15108 -46801 -26464
15545 -26464 -18760 -22138 -26737 -15683 -21274 -12964 -12630 5478 18909 18726 -4886 11337 62721
15532 62721 72991 49278 36540 40079 -3121 -19358 -5927 13057 6417 6006 21263 907
15520 907 -17534 -11409 -7370 28 2131 -10783 -27530 -11513 -696 -4588 -3700 -8500 -11661 -16830
15506a6830k0939j0517n118J0941L9038J7327k2482N32k034k067J3713k5065k9611
15493e3112J5666L460q827J3251J182L963K7400l35j5008j964R623n010j8896
15480b8607K6149J6430J3539j7787l319p377j8526J7064Q305J3197q692n630j1742
15467f996K3098J9417k0675k1058k3650O259o704k2299M023L3656J1902R844n344
15454A473L4432L9563j8829k9745m4042k7036o788k1477J2506L9342J8273j5n020
15441g363N243N80J4113m271J292o8q151k7582N095L2234q918J8386P022j4224
15427A3388k7817l6118k345M0465K1096k766M550J965K357R403j4356q283J1272
15414A2811M302o242j5915J559J0162j849L182L682k864R644R725j4230k9711
$$ plain form
15506 -16830 -37769 -48286 -53404 -42463 -3425 13902 -8580 -8048 -10082 -12149 1564 -23501 -53112
15493 -53112 -37446 -33986 -42813 -29562 -28380 -24417 2983 2648 -12360 -14324 -4701 -9711 -28607
15480 -28607 -2458 13972 27511 9724 6405 -972 -19498 -2434 5871 19068 10376 4746 -6996
15467 -6996 16102 35519 14844 -6214 -29864 -23605 -30309 -52608 -48585 -14929 -3027 6817 1473
15454 1473 35905 75468 56639 26894 -17148 -44184 -50972 -72449 -59943 -20601 -2328 -2343 -7363
15441 -7363 -2120 -1540 12573 8302 9594 9526 1375 -26207 -21112 11122 2204 20590 27612 13388
15427 13388 -14429 -50547 -52892 -12427 8669 5903 10453 12418 14775 24178 9822 1539 12811
15414 12811 17113 10871 -5044 -3485 6677 4828 8010 11692 8828 18472 28197 13967 -15744
15401a5744j5017j1419J1017K9043j3039j5989l004J1463j0431j04K1950J5107
15389C833j8750R972j3070k7135Q481N502L31j1031J8350K6763K1107K801j1660
15376A5494J0936J0837J3709j3888l7251N53P225L286o026j9363j4786j9349j2462
15363f1085K9755K8941j859j9757j0684l2179J5795K062J0659M256J5597J9372
15351H73J3773R723j6098p236k0757j8746L320J363n133j5006K5590L1663j0396
15338g067j5357o544J2124K8101j1969k5960q396K9982l190n773p203O686k344
15325a6910J502N549L2302r845j2770k958J7949l273j9066j1210J708q420O877
15312a8565Q933R27l6706q293J7987K0606L460P272p829m849L613k6989k6611
$$ plain form
15401 -15744 -30761 -42180 -31163 -2120 -15159 -31148 -34152 -22689 -33120 -33224 -11274 3833
15389 3833 -14917 -4945 -18015 -45150 -36669 -31167 -30836 -41867 -23517 3246 24353 27154 15494
15376 15494 26430 37267 50976 37088 -163 390 7615 10901 4875 -14488 -29274 -48623 -61085
15363 -61085 -31330 -2389 -4248 -24005 -34689 -66868 -51073 -49011 -38352 -34096 -18499 873
15351 873 14646 24369 8271 1035 -19722 -38468 -35148 -33785 -38918 -53924 -28334 3329 -7067
15338 -7067 -22424 -28968 -16844 11257 -712 -26672 -35068 -5086 -8276 -14049 -21252 -14566 -16910
15325 -16910 -15408 -9859 22443 12598 -172 -3130 14819 11546 -7520 -18730 -17022 -25442 -18565
15312 -18565 -9632 -8705 -45411 -53704 -35717 -15111 -11651 -4379 -12208 -17057 -13444 -40433 -67044
15299f7044O067N290p290N379J1196J3117K623J0862M4090J1443k5550j674p430
15286A079n163l1962r532J9657J2176j9865j1670M3881L5701J8010j6910j5751
15274A9651k0842n549Q11K8115j261L158j2189n6694l1022Q076M1976L2059L3204
15261C9493j5700j4104k797K233Q811L5485o062l4381l7945n081K2668J8643N993
15248A7256k4822k694J6822L556p869j7748m723K6226l783j5550K2832j5592J3682
15235G593K0301j2755p429n519j5329k5460o94M5034k127m0144k2871r923m874
15222g4197J6378K1539Q893K2174k0807m990J2970n94O968N657K0554j990p569
15209D986J1863N24j9694k4604J438O022K0110J779l8916j8640J7986J8321J630
$$ plain form
15299 -67044 -60977 -55687 -62977 -57598 -46402 -33285 -30662 -19800 24290 35733 10183 8509 1079
15286 1079 -4084 -36046 -45578 -25921 -13745 -33610 -45280 -1399 34302 52312 35402 19651
15274 19651 -1191 -6740 -5929 22186 20925 24083 11894 -44800 -75822 -67746 -25770 6289 39493
15261 39493 23793 9689 6892 9125 17936 53421 47359 12978 -24967 -30048 -7380 11263 17256
15248 17256 -7566 -10260 6562 10118 2249 -15499 -20222 6004 2221 -13329 9503 -6089 7593
15235 7593 27894 15139 7710 2191 -13138 -38598 -39292 5742 3615 -36529 -59400 -69323 -74197
15222 -74197 -57819 -36280 -27387 -5213 -26020 -31010 -18040 -18634 -11666 -6009 14545 12555 4986
15209 4986 16849 17373 -2321 -26925 -25487 -19465 645 2424 -36492 -55132 -37146 -18825 -17195
15196a7195P498J2016j817j0570n380M275Q883O334L839k8977k2798k262o247
15183e2401J9348j947J4581K4128P517j0930l906n57L792j892J697r968J9616
15170I078O212j4850P349n789J0677K8184j5200n0947J9479K7196k7245J0285
15158D429K2342L750p801j5351j7474j8171J2586N209K221J6095J1107L138q134
15145A3946m4368J3832j2495o409K229J3728J5830r427j0214k6683Q97M441J0946
15132c3747K1293K012j9923j7750J819m218J8689l199Q004J5411K5973J1986j5171
15119A1179l4885j7279J8450P878r386L832L1379L2203M289j1301k0861p607j1921
15106d030k649q340M127l832o404N345K0775K0909l7187j8367O437J2466p085
$$ plain form
15196 -17195 -9697 2319 502 -10068 -15448 -11173 -2290 4044 7883 -21094 -43892 -46154 -52401
15183 -52401 -33053 -35000 -20419 3709 11226 296 -3610 -4167 -375 -2267 -570 -10538 9078
15170 9078 15290 440 7789 2000 12677 40861 25661 -25286 -5807 21389 -5856 4429
15158 4429 26771 30521 22720 7369 -10105 -28276 -15690 -10481 -8260 7835 18942 22080 13946
15145 13946 -30422 -16590 -29085 -35494 -33265 -19537 -3707 -13134 -23348 -50031 -49134 -44693 -33747
15132 -33747 -12454 -10442 -30365 -48115 -46296 -50514 -31825 -35024 -27020 -11609 14364 26350 11179
15119 11179 -23706 -40985 -22535 -14657 -24043 -20211 11168 43371 47660 36359 15498 7891 -4030
15106 -4030 -6679 -15019 -10892 -14724 -21128 -15783 4992 25901 -11286 -29653 -23216 -10750 -17835
15093a7835J882L5349k3579N631j2828Q25J5948m424k4298l0953K219J0193K7502
15080a4368k486j1085q123K453K4770K659J0951L760j437m553J1929O490r353
15067A1607k771j41J3485O518M572r150n829M33J5488o272j6773J3874m54l449
15053B1138j1233k7737K117J6384J1918Q521K660j36j5300N058R356P941P422
15040C8109N43j1003j6742k6498r358j8259j3575P157M1416K9225m862q537k423
15027E193j6979M887K831J3576N385J1121j8903j8832r614L0219J6888M802J493
15014C2067j9933j2748J252J5792j2304k1526j871J3546J1402K156J0430J2986
15002C1249K8746P327j0338n986J3498j0920k0566o510J2416m058r888J903j409
$$ plain form
15093 -17835 -15953 19396 -4183 1448 -11380 -10555 5393 969 -23329 -54282 -52063 -41870 -14368
15080 -14368 -16854 -27939 -36062 -33609 -8839 -6180 4771 8531 7094 2541 14470 20960 11607
15067 11607 8836 8695 22180 28698 33270 24120 18291 18724 34212 27940 11167 25041 24587 21138
15053 21138 9905 -17832 -15715 669 12587 21108 23768 23632 8332 13390 22746 30687 38109
15040 38109 38652 27649 10907 -15591 -24949 -43208 -56783 -49626 -8210 21015 16153 7616 5193
15027 5193 -11786 -6899 -4068 9508 14893 26014 7111 -11721 -21335 8884 25772 30574 32067
15014 32067 12134 -614 638 16430 4126 -17400 -19271 -5725 5677 7833 18263 31249
15002 31249 59995 67322 56984 50998 64496 53576 33010 26500 38916 34858 24970 26873 25464
14989B5464k9661q630K4562K4886q868k4301l750J1615l713J1269o364k373K498
14976A2634k7065K3175J3875j7930Q323J2842k2991J5309j3377j4872Q532J3287
14964A1742J4359L904J2652o838j8225l3664o842j3481K3933K7537O167l3777
14952a2533m954K1691N032M919j3128M716O973q382j2095m549L985J2288J4935
14939A8898M531j1310Q011j1241j2442L368K4239j0357j2302M288K7306l594k4274
14926E121k1266P726j793j6844J1979J7558K3794M000j1756j3043j4518l317k0071
14913c2430L0490Q589l0237n843K5354r041m179o952J6239L0306j3006j9232j7041
14900b6983J1076K2475K826J4412k9828k2381n122L6849J3423m488R115q13n176
$$ plain form
14989 25464 -4197 -12827 11735 36621 27753 3452 -298 11317 7604 18873 12509 10136 12634
14976 12634 -14431 8744 22619 4689 13012 25854 2863 18172 4795 -10077 -1545 11742
14964 11742 26101 30005 42657 35819 17594 -16070 -22912 -36393 -12460 15077 21244 -12533
14952 -12533 -17487 4204 9236 14155 1027 5743 12716 4334 -7761 -12310 -8325 3963 18898
14939 18898 23429 12119 20130 8889 -3553 -185 24054 13697 1395 5683 32989 29395 5121
14926 5121 -16145 -8419 -10212 -27056 -15077 2481 26275 30275 18519 5476 -9042 -12359 -32430
14913 -32430 -1940 6649 -23588 -29431 -4077 -13118 -17297 -24249 -8010 22296 9290 -9942 -26983
14900 -26983 -15907 6568 9394 23806 -6022 -28403 -33525 3324 16747 12259 21374 20561 15385
14887A5385M373P968j9474l8128l2033j8236M121K3467J7717R046K1862M3551
14875C9619l699m4098l2170r822J0051O996n597o915L4950L8108J368k2470K2544
14862B8865J32l4639j8824J4762m952R423k4485P321K6569M0328j348l4246j7115
14849h209j0269n802L2191K7464j0913k11k5513j1730O444J0832r533r922p323
14836b2494J1269K850K2535K0887m652q332p049r06J3216k215q78o882R13K0791
14822C9053j6560k5238K2454J1366K171k1549k2838J8559j6512k0889K3808j871
14810h046l1536j0811M2069o176L903r253L5008O492k9289l3476m456K2530l243
14797b6284K74L34L728R949K9363J3967K2505J511j7779j7789k56O441q2m956
$$ plain form
14887 15385 19758 27726 8252 -29876 -61909 -80145 -76024 -52557 -34840 -25794 -3932 39619
14875 39619 35920 -8178 -40348 -50170 -40119 -33123 -38720 -45635 -10685 27423 28791 6321 28865
14862 28865 28997 -5642 -24466 -9704 -14656 -5233 -29718 -22397 4172 44500 43152 8906 -8209
14849 -8209 -18478 -24280 7911 35375 24462 24251 -1262 -12992 -6548 4284 -5249 -15171 -22494
14836 -22494 -11225 -8375 14160 35047 30395 22063 15014 14108 27324 25109 24231 17349 18262 39053
14822 39053 22493 -2745 19709 31075 33246 11697 -11141 7418 -9094 -29983 -6175 -8046
14810 -8046 -39582 -50393 -8324 -14500 -10597 -19850 15158 21650 -7639 -41115 -45571 -23041 -26284
14797 -26284 -26010 -25676 -21948 -11999 17364 31331 53836 55347 37568 19779 19523 25964 25882 20926
14783B0926m9584k8394P493K4929k006O151J2735J0411J1964Q748p308p275j8320
14770i530k6194m575J4265L9210L921j7040k196M226J0347N53j0073M359J4644
14757B1917m7052o054J6132j9556M312Q342k1854Q222J9984J3868j0886M034Q25
14744g766K153J2745K977p587j7461j3183J4169k489N303K5095j3988m3194m724
14731d7950P140r27J5013K2291p976J7128O09P891j496j0695l428n587o926k0625
14717c5538l479N783n784R515J0345J4262J8672j7547n005O237P846K882K1621
14704B9810j8585k3905J1695M5992Q25j2558l5498K8259L0657k1536k2955l1121
14692a8920L4937j2142k7835K243J3613L106J8395k2507l0753J1185J1097K9030
$$ plain form
14783 20926 -28658 -57052 -49559 -24630 -26636 -20485 -7750 2661 14625 23373 16065 8790 -9530
14770 -9530 -35724 -40299 -26034 13176 17097 57 -2139 2087 12434 12987 2914 7273 21917
14757 21917 -25135 -31189 -15057 -34613 -30301 -21959 -43813 -35591 -15607 -1739 -12625 -8591 -7766
14744 -7766 -5613 7132 10109 2522 -14939 -28122 -13953 -16442 -11139 13956 -32 -43226 -47950
14731 -47950 -40810 -41737 -26724 -4433 -12409 4719 5328 13219 11723 1028 -2400 -7987 -14913 -35538
14717 -35538 -39017 -33234 -39018 -29503 -19158 -4896 13776 -3771 -8776 -2539 5307 8189 29810
14704 29810 11225 -12680 -985 45007 45832 33274 -2224 26035 56692 35156 12201 -18920
14692 -18920 16017 3875 -23960 -21717 -8104 -4998 13397 -9110 -39863 -28678 -17581 11449
14680A1449P164K488R090k542k2102l6437J8843K8679R126p542l6543L2152O143
14667A9968j7897l1864m393l704j312J1843q683j956J0375J5599M970n840R420
14654c474j9395j4925K1408J6895M329j8782k4299j1602R5J7787J8019m03j2700
14641b7047L5746j3356k8525L592K4468m354N831k0398K908J4551L498N077j1963
14628i972k4089L4787J441J826N72q240L3037J0250k2364j0826Q994n090n480
14615D846J0151J0330k533O321K8367o921J1872j5082l2227j2072J1982R371j3406
14602A0999j0234j6455m230K4339p054J6719n335O734K135j254J5793k2779r74
14589H404J5362k7922l713p928J0917p940j5195Q991K5379J4476L819L0200K0159
$$ plain form
14680 11449 18613 21101 30191 27649 5547 -30890 -12047 16632 25758 18216 -18327 13825 19968
14667 19968 2071 -29793 -34186 -37890 -39202 -27359 -36042 -37998 -27623 -12024 -7054 -12894 -3474
14654 -3474 -22869 -37794 -16386 509 4838 -13944 -38243 -49845 -49750 -31963 -13944 -14347 -27047
14641 -27047 8699 -4657 -33182 -29590 -5122 -9476 -3645 -24043 -21135 -6584 -3086 1991 -9972
14628 -9972 -34061 726 2167 3993 4565 -3675 29362 39612 17248 6422 15416 10326 4846
14615 4846 14997 25327 22794 29115 57482 50561 62433 47351 15124 3052 15034 24405 10999
14602 10999 765 -15690 -19920 4419 -2635 14084 8749 15483 17618 16364 32157 9378 8404
14589 8404 23766 -4156 -7869 -15797 -4880 -12820 -28015 -19024 6355 20831 24650 54850 75009
14576G5009l2442j1752J5776j8526l0638k4269j6677r405j0807J344K8670O705
14564b7012J1621J3932N82j6066k5167l216J2822l481j6900L2194Q429j6113L538
14551b4837N60j9372p989j8783J6237J6317j7384J6963j191R789J095j8100L7617
14538i078K1141q36k281k1541o826L8389j2490k3487Q144J0323p211p068P750
14525e071j8367J1909O304j8492J9177n876K1l734j1712J1617O702n08P612J821
14511A403r666o401k70n913K3440K1966P296j4512j7479j962K1992J2497j8097
14498A4294R526j6931j6904O342J9279M404l5622j134j7784m968K029M961L6036
14485C528J3642k154K1055k4952q449J0624o002J7138N413q822j8909J23j3659
$$ plain form
14576 75009 42567 30815 46591 28065 -2573 -26842 -43519 -52924 -63731 -62387 -33717 -27012
14564 -27012 -15391 -1459 -877 -16943 -42110 -45326 -32504 -35985 -52885 -20691 -12262 -28375 -24837
14551 -24837 -24277 -43649 -51638 -70421 -54184 -37867 -55251 -38288 -39479 -29690 -28595 -46695 -9078
14538 -9078 12063 11227 8946 -12595 -19421 18968 6478 -17009 -8865 1458 -5753 -12821 -5071
14525 -5071 -23438 -11529 -5225 -23717 -4540 -10416 -10395 -14129 -25841 -14224 -7522 -8030 -418 1403
14511 1403 -8263 -14664 -14934 -20847 2593 24559 31855 17343 -136 -2098 19894 32391 14294
14498 14294 23820 6889 -10015 -3673 15606 20010 -15612 -16746 -34530 -39498 -37469 -32508 3528
14485 3528 17170 15016 36071 11119 2670 13294 7292 24430 29843 21021 2112 2235 -11424
14472a1424j0392m436J0058j3069j4607K0015L7723q436j2976o979l482k4712
14460d2717J842L9259R320K016K1782n174j3755j9911k5169l16j19K896K6376
14447c670n884q995J5581j5433r320J9336n292N714M0566j2461o17J91k2190k4253
14433b6727J8097Q434K273L7238j4151k7850l97j0179Q565j1621M055m185k0872
14420c7320q831J4904L6255J3513j1624k8422N011m948n962j6602L869j063N160
14407c6060K76j7126L1979J9361l433L8353J4283k748l6234l6497N961N72J1377
14394i936J3965l835K0816p704k0079n483k048J1934K1652J458M915n461L225
14381B3419j4599k881j2592J2889J993r229L250J9483r952P18R54j2896l3125
$$ plain form
14472 -11424 -21816 -26252 -16194 -29263 -43870 -23855 13868 5432 -7544 -14523 -18005 -42717
14460 -42717 -40875 -1616 7704 9720 31502 26328 12573 -7338 -32507 -32823 -32942 -30046 -3670
14447 -3670 -9554 -18549 -2968 -18401 -27721 -8385 -13677 -7963 32603 20142 19525 19716 -2474 -26727
14433 -26727 -8630 -196 2077 39315 25164 -2686 -3083 -13262 -4697 -16318 -12263 -16448 -37320
14420 -37320 -46151 -31247 5008 18521 6897 -21525 -16514 -21462 -27424 -44026 -40157 -41220 -36060
14407 -36060 -35784 -52910 -20931 -1570 -5003 33350 47633 44885 8651 -27846 -21885 -21313 -9936
14394 -9936 4029 194 21010 13306 -6773 -12256 -14304 -2370 19282 20740 25655 20194 23419
14381 23419 8820 5939 -6653 6236 8229 -1000 2250 21733 11781 12499 13453 557 -32568
14368c2568K195Q861M264j604L624K9454k6158j6536Q023J0123j4074j3811K6528
14355a1679L5048r305l0494P022l4100Q077L8132M339j4242j2138R833P315j4740
14342a6932K068K5091J1573m246j8043L284j8384J4059J6020n396l991N303M947
14329A5353m616J9191N458k718J5365L076l1396k765j3517j5074j6266p889j0923
14316d6721N905L7748k1830j0730L0622j8509j0684L5216l697Q214J4655j8124
14304B065j6150n786r890J0551O587J827R356N711o460J1534J4938r654k0497
14291e868J0013J2183M740r562o051Q377L6411l359j7956k0052r48m53m026j3729
14277a0280M943J8257K0430K340j1336l3140q311J0938j485p727L2893K3119M13
$$ plain form
14368 -32568 -30373 -21512 -17248 -18852 -15228 14226 -11932 -28468 -20445 -10322 -24396 -38207 -11679
14355 -11679 23369 14064 -16430 -9408 -43508 -35431 2701 7040 -7202 -19340 -9507 -2192 -16932
14342 -16932 -14864 10227 21800 17554 -489 2795 -15589 -1530 14490 9094 5103 10406 15353
14329 15353 10737 29928 35386 32668 48033 51109 19713 16948 3431 -11643 -27909 -35798 -46721
14316 -46721 -40816 -3068 -24898 -35628 -5006 -23515 -34199 1017 -2680 5534 20189 2065
14304 2065 -14085 -19871 -29761 -19210 -12623 -10796 -1440 4271 -2189 9345 24283 14629 -5868
14291 -5868 4145 16328 21068 11506 5455 13832 50243 46884 28928 8876 7928 7475 3449 -10280
14277 -10280 -5337 12920 33350 35690 24354 -8786 -17097 -6159 -7644 -15371 17522 40641 41054
14264D1054k4868j6102J1386j3741j4120P374M3538J598M57K5446o217r215k2243
14251B4347O395L411N743j1534k3751Q248J847k015k486O826J7857O394k5059
14238A6223j3938j0373L870J676K3392j8655l586J10J0596j6325o728N221K0700
14225A2183j901l304j0979L0387L012J4198j04k9834k2974j3819k639J6529Q42
14212h403K2576N031Q028K1706k0663k2922l442k756k9464j0995P11L6195K9394
14199B4996L6918L1922q754j1341l675k2158r473K7014L0363J3628j0267j0002
14187H9171P669k5330q930k3437q693n088n823M928m393O000m899K726j4807j5217
14173f123j1938R379p932P814n923k0791J8949J4980J0418J927J2893n16J1088
$$ plain form
14264 41054 16186 84 11470 -2271 -16391 -9017 34521 36119 36576 62022 55805 46590 24347
14251 24347 30742 34153 39896 28362 4611 12859 14706 12691 10205 17031 34888 41282 16223
14238 16223 2285 -8088 -4218 -2542 20850 2195 -1391 -1281 9315 -7010 -13738 -8517 12183
14225 12183 10282 6978 -4001 26386 29398 43596 43492 13658 -9316 -23135 -25774 -9245 -8403
14212 -8403 14173 19204 27232 48938 28275 5353 1911 -845 -30309 -41304 -40593 -4398 24996
14199 24996 61914 93836 85082 73741 70066 47908 38435 65449 95812 109440 99173 89171
14187 89171 96840 71510 62580 39143 30450 25362 19539 24467 20074 26074 21175 23901 9094 -6123
14173 -6123 -18061 -8682 -16614 -8800 -14723 -35514 -16565 -1585 8833 10760 23653 23137 34225
14160C4225J2085J5574K1277J335k768o995o468m3708j2139j425q83j072N862
14147A4900j675l3949j3568M1654K1068o161k647J5155L388r008m45O071P404
14134D2187j7424J1651k918K8435L726l5041M687o074j3957J5872O587j3234k0411
14121D086L371k0184k4293J3079n073L5687K3974j6781k2836q153Q960J7354P298
14108A6489k0534K0258K9785l241n544L1885j4628q565k7861O480L3994k46l2118
14095B6154j9025j6255k4432q09K3644L2184K2497l3447r887k223K046L501o72
14082C276J4495j597j7893M100O680J2763k8688K1394J4582k4500L261L3067r106
14069C1834l3492k1122J8994J6193M947J5339Q317P04r177j7250J2727j782j1870
$$ plain form
14160 34225 46310 61884 83161 84496 81728 74733 68265 24557 12418 10993 10110 9038 14900
14147 14900 13225 -20724 -34292 7362 28430 22269 19622 34777 38165 29157 28712 34783 42187
14134 42187 24763 36414 33496 61931 65657 30616 35303 29229 15272 31144 37731 24497 4086
14121 4086 7457 -12727 -37020 -23941 -29014 6673 30647 13866 -8970 -17123 -8163 9191 16489
14108 16489 -4045 16213 45998 42757 37213 69098 54470 45905 18044 24524 58518 58272 26154
14095 26154 7129 -9126 -33558 -34367 -10723 21461 43958 10511 624 -1599 447 3948 3276
14082 3276 17771 16174 -1719 2381 9061 21824 -6864 14530 29112 4612 7873 40940 31834
14069 31834 -1658 -22780 -3786 12407 17354 32693 41010 41714 32537 15287 28014 26232 14362
14056A4362n457O542J4016J919K888M949n1813j343L9589L544R173J52l7736k6351
14042b5566J4186j931m347Q268K3758K570K5551j514j0813k2847j3089k3244J7115
14029a1903J8807P268J2971j3741l6064q765P258J7159q350O751K7164k3385n0538
14016e5368j8859J2206Q289J6538M0777K5743j676m288j8790K1755Q911k0377
14004A4861J3045K1778o104k0411K8473L2426j1792k9725j3409J9889j2265k6752
13992A0014l3999k9015j0092L1036J7294n358J697J2336j0794o350j699q620L1237
13979b313L3566J7409j806k1665m1781r976k0661M037J4602L6208Q984k1407k9668
13966c4471P365J4186Q516L689J5391j0795K024J7741L479j0202P344n878J1348
$$ plain form
14056 14362 8905 15447 29463 31382 34270 39219 -12594 -13937 25652 29196 38369 38521 785 -25566
14042 -25566 -11380 -13311 -17658 -9390 14368 16938 42489 40975 30162 7315 -5774 -29018 -11903
14029 -11903 6904 14172 27143 13402 -22662 -31427 -24169 -7010 -15360 -8609 18555 -4830 -55368
14016 -55368 -74227 -62021 -53732 -37194 3583 29326 27650 23362 4572 26327 35238 14861
14004 14861 27906 49684 43580 23169 51642 84068 72276 42551 29142 49031 36766 10014
13992 10014 -23985 -53000 -63092 -32056 -14762 -20120 -18423 -6087 -16881 -23231 -24930 -33550 -2313
13979 -2313 31253 48662 46856 25191 -16590 -26566 -47227 -43190 -28588 7620 16604 -4803 -34471
13966 -34471 -27106 -12920 -4404 -715 14676 3881 5905 23646 27125 16923 24267 18389 29737
13953B9737L1215n395k6996q041j7628j7981O960M810K4670r153j3961j6405k553
13940b0721O671j7916K182J9897K2152L1966J2280O013L0879n700n243n1592n393
13927B5475O789K0716m142k4370j1598O227K2491p959K4942O014Q928j4778k8836
13914B9899M83J0883J9665l0018j5176R70r15n172J1467k571l520k622K1497K6633
13900F1503j1273k7774m194K1126J1983j7930r613k0839l1546N491K2715K1173
13888B0822R504J011L509j1960q703L264L433l93r130J2293J921N490P735j7598
13874B1198j013J8896p879l215K5152p248L761k4966j3714j1201J724r40j640
13861a085L1126J1253k4041J9010K7603O161n592J7199q588l4765j2535O749K0866
$$ plain form
13953 29737 60952 55557 28561 20520 2892 -15089 -8129 -3319 21351 12198 -1763 -18168 -20721
13940 -20721 -14050 -31966 -29784 -9887 12265 44231 56511 62524 93403 87703 82460 30868 25475
13927 25475 32264 52980 48838 24468 12870 19097 41588 33629 58571 64585 73513 58735 29899
13914 29899 30382 41265 60930 30912 15736 16706 15791 10619 22086 19515 15995 13373 34870 61503
13900 61503 50230 22456 18262 39388 51371 33441 23828 2989 -28557 -23066 -351 20822
13888 20822 30326 31337 34846 22886 14183 17447 20880 20487 11357 23650 25571 31061 38796 21198
13874 21198 20185 39081 31202 27987 53139 45891 49652 24686 10972 -229 1495 555 -1085
13861 -1085 30041 41294 17253 36263 63866 70027 64435 81634 73046 38281 25746 32495 53361
13848E3361L527k2144k548K8035K143O794K6489J3824k4780j2766J4719J2441
13836I9095K5987K2270K3982M1853O1243Q1101J57171J71228J79962J98485K18448
13825A280825J80778J54819J47844R7647r230o6968p7977j40245k13599j81678
13815A172216j92833k17807j52215j14634j04110q1632k1108j5010m032l8008
13805B30827l9230l5138j1711l2847j4702Q398o07k588l10n0872l2809j764J1661
13792B8308J1908K1515l922j9065q204P359r125q481P765n500o295R525L1078
13779E6866J572m0434J0423Q037K850p361q649K6j3173K8839J1908k0060R55M220
13765C6019q948j0880n132j9338M5348M7744K465j3643Q447J0054n17O12L2272
$$ plain form
13848 53361 56888 34744 32196 60231 62374 69168 95657 109481 84701 71935 86654 99095
13836 99095 125082 147352 171334 213187 274430 355531 512702 683930 863892 1062377 1280825
13825 1280825 1461603 1616422 1764266 1861913 1852683 1785715 1707738 1567493 1353894 1172216
13815 1172216 979383 761576 609361 494727 390617 308985 287877 272867 268835 230827
13805 230827 191597 156459 144748 111901 97199 105597 104990 102402 102092 51220 18411 16647 28308
13792 28308 40216 61731 57809 38744 30540 37899 28774 20293 28058 22558 16263 25788 56866
13779 56866 58438 18004 28427 36464 39314 31953 23304 23330 10157 38996 50904 30844 31799 36019
13765 36019 27071 16191 11059 -8279 37069 84813 87278 73635 82082 92136 91619 92231 124503
13752A24503P600l860m561l4080l6769m314K8373J6508k032l6507j9716O497n58
13739D1084k2199o161j743n747P646o061l149p327J5080J100j2173r449L76L1946
13725B3223j3468k2291Q725k144p070N120j2754p841K5112K6729j998j167o874
13712A3302J1520k1676k3659J2168K7430J9629L6631p720m3850l4596O202q114
13700a2733p408J2545M190q974J1012j0297M961k833P172R264L1713J0418J0277
13687E9307j4666k3327J142J6858J4544j9250l0302o644J2159p42L1556L008j7433
13674B6210l3748j5147P57J0600o303J188K4099l963j2559J2775J2701n278J0101
13661B1433m417j204J5219K2918l4502p553J6459K0035k3696q173j3208j8993
$$ plain form
13752 124503 132103 128243 123682 89602 52833 48519 76892 93400 91368 54861 35145 41642 41084
13739 41084 18885 12724 10981 5234 12880 6819 3670 -3657 11423 12523 350 -9099 -8723 23223
13725 23223 9755 -12536 -3811 -5955 -13025 -7905 -20659 -28500 -3388 23341 21343 20176 13302
13712 13302 24822 3146 -20513 -8345 19085 38714 75345 67625 23775 -10821 -4619 -12733
13700 -12733 -20141 -7596 -3406 -12380 -1368 -11665 -6704 -9537 -2365 6899 38612 49030 59307
13687 59307 44641 21314 22456 39314 53858 34608 4306 -2338 9821 9079 40635 43643 26210
13674 26210 -7538 -22685 -21928 -11328 -17631 -16443 7656 3693 -8866 3909 16610 11332 21433
13661 21433 17016 15812 31031 53949 19447 11894 28353 48388 24692 16519 3311 -15682
13649a5682l3498o134J0698M4197J7214K6753j0220l6789Q585J8000m30r764L402
13636A6332K191Q995O845j2440K6491J8740J898L394j0761k9044k7608M888n557
13623D364K5544P448j8091L579J4562J389r133J6358J1976k6876N721K4384j094
13610F0131R914P631j7104k172o403P418j2160K7737N728o372l8034k3662k9200
13597a6548J5917O850m538k907J0201J0633j1386R282K4792j1868R802j7606j0403
13584A2221j0740p552J4608m822J0184J4449p426Q175O409N900R272J3075K845
13571F6598K754n59k4108j4844P361J0926m272k20l487k609J9030k2757p007J4714
13557D1520j7832k8266J0463J2790Q334j2852N16K0606Q07q87n995M844Q625P070
$$ plain form
13649 -15682 -49180 -55314 -44616 -419 16795 43548 33328 -3461 5124 23124 22694 12930 16332
13636 16332 18523 27518 34363 21923 48414 67154 69052 72446 61685 32641 5033 9921 4364
13623 4364 29908 37356 19265 22844 37406 38795 29662 46020 57996 31120 36841 61225 60131
13610 60131 70045 77676 60572 58400 51997 59415 47255 74992 80720 74348 36314 12652 -16548
13597 -16548 -631 6219 1681 -1226 8975 19608 8222 17504 42296 30428 40230 22624 12221
13584 12221 1481 -6071 8537 3715 13899 28348 20922 29097 35506 41406 50678 63753 66598
13571 66598 69352 68793 44685 29841 37202 48128 43856 43636 40149 37540 56570 33813 26806 41520
13557 41520 23688 -4578 5885 18675 27009 14157 14673 35279 36086 35199 29204 34048 42673 49743
13543D9743j3383R695o07k1969o708K4280m434p220R806J4659j4417M52O086j0448
13529C5535r069R492j0269l8321j228L6217L8131k9611j2278J2933J4689j4149
13517C2072J1221K802k2719j2468J7379p087o003l435J9445n364j5783m799M217
13504I478J7608K0065K9086j0623m3345m505K5051J1007k4030j7715R786J3808
13492C5671k9696J3389p80j7377j9841j1208m425M2166J2734m541l3923J2550
13480e281P171j9839n38N460K354n322L3845L4488j6113r120j1233l793K149K7628
13466D1856J5392j5466J3375J8870j8614p14K7834J221n1766k4621K3284J1143
13454D1794j2615l0238q342K2895K0754j2448l737L316K4835P971j1886j9243
$$ plain form
13543 49743 36360 46055 45448 23479 16771 41051 36617 29397 39203 53862 39445 39897 45983 35535
13529 35535 26466 35958 25689 -12632 -13860 22357 60488 30877 18599 31532 46221 32072
13517 32072 43293 46095 23376 10908 28287 21200 15197 11762 31207 25843 10060 5261 9478
13504 9478 27086 47151 76237 65614 22269 17764 42815 53822 29792 12077 21863 35671
13492 35671 5975 19364 18584 1207 -18634 -29842 -34267 7899 20633 16092 -17831 -5281
13480 -5281 1890 -17949 -18487 -13027 -10673 -15995 17850 52338 36225 27105 15872 12079 14228 41856
13466 41856 57248 41782 55157 74027 55413 54699 82533 83754 31988 7367 30651 41794
13454 41794 29179 -1059 -9401 13494 34248 21800 18063 21379 46214 54185 42299 23056
13442B3056p819o614J4413J8684L703q621r237j5929j857J1383j1945J7625J0207
13429C7049k1379J3166L2117R699M711j5523j5018k2183j330l055O694j6518r577
13416a147j0320J919M035L764J7475J1887R387J1338o039j7575j2544l499j3242
13403d561O895M105k2158J0482Q239J2765j5299n292J0117M519j3799O694J7233
13390A9940J0176j2095K949K9630P817j452R85Q583k8572p887J6861J1185J69
13377E8289o944j4742N026J4527j8638k3375K0532N1802j0747m0401j7339Q542
13365B6532j036L948n335k7905j2493K7963K7733k1102J9619L1765j098j5131
13353E3460J9764K577Q569n269p830k0650l900K5699J9992P597M733k1146o579
$$ plain form
13442 23056 15237 8623 23036 41720 45423 36802 27565 11636 9779 21162 9217 26842 37049
13429 37049 15670 28836 60953 70652 75363 59840 44822 22639 21309 18254 24948 8430 -1147
13416 -1147 -11467 -9548 -5513 -1749 15726 27613 37000 48338 42299 24724 12180 8681 -4561
13403 -4561 2334 6439 -15719 -5237 3002 15767 468 -4824 5293 9812 -3987 2707 19940
13390 19940 30116 18021 20970 50600 58417 56965 57950 66533 37961 30074 46935 58120 58289
13377 58289 51345 36603 41629 56156 37518 14143 34675 86477 75730 35329 17990 26532
13365 26532 25496 29444 24109 -3796 -16289 11674 39407 18305 37924 69689 68591 53460
13353 53460 73224 75801 84370 79101 71271 50621 46721 72420 92412 100009 104742 83596 77017
13340G7017l6165l3803k40J7498L7587J7638j7246k3609j748N449p936j265p090
13327B6087q455J8544J0024J154j1050q510q642j247K3737J3954j981j5429j5432
13314B2754o648j9981J2237l862m075r357K023k265j1441j7303k0224R818N0641
13301B317J3298L020k057J8491J6899n212k0044l0007J5847K3499L312j0017n279
13288B4067l125J8455l961n106J0212R664K1740k502p344j8916k3728N503j6330
13275H629R196M0157r632K696J665J7922p214m9407k5093J7687J6533J9048L1339
13262G3526J1507l4379J4689P946j0094k38j5049l0090j7335M695K4362J2335
13250D1875J7195R608R584o884l6630n050k1386K993K230j561j92p906K090K2513
$$ plain form
13340 77017 40852 7049 6809 24307 61894 79532 62286 38677 36929 42378 34442 33177 26087
13327 26087 17632 36176 46200 47354 36304 27794 19152 17905 41642 55596 53615 38186 22754
13314 22754 16106 -3875 8362 4500 425 -8932 -6909 -9174 -20615 -37918 -58142 -48324 2317
13301 2317 15615 18635 16578 35069 51968 46756 26712 -3295 12552 36051 39363 29346 24067
13288 24067 20942 39397 35436 30330 40542 50206 71946 69444 62100 43184 19456 24959 8629
13275 8629 17825 57982 48350 51046 52711 70633 63419 14012 -11081 6606 23139 42187 73526
13262 73526 85033 50654 65343 73289 63195 62957 47908 17818 483 5178 29540 41875
13250 41875 59070 68678 78262 71378 34748 29698 8312 11305 13535 11974 11782 3876 5966 28479
13236B8479o21k0345j2525J0064J6105j8456J4219L1437o258o211J8817j5228
13224C9477j3602k3386j53K0873J8039j2913m9572K013K2503J1005L4740M2903
13212I1927R997k4876k2983k3062L951L3751K9455j6427j5450j5320k1030Q717
13200C8650m021k5136j662L3719n93p415k2733k8619M170J5529L0180J7185K9474
13187G8728L413k4426j0527k1835J379r610j7368l989K9925Q876j4867J9001Q754
13174D7454k1998N189J7527K7182J6488L6543K8979m015j4885k3784j3366q34
13162A00480n012l2789j7394K6679J9184K804K3122q381j0324k4287j1457k2458
13150D0167r448k7035K3472m715q505M390J9642K1146K7629O380n321k6234J4885
$$ plain form
13236 28479 27858 7513 -5012 5052 21157 2701 16920 48357 42099 35888 54705 39477
13224 39477 25875 2489 2336 23209 41248 28335 -21237 -19224 3279 14284 49024 91927
13212 91927 101924 77048 54065 31003 34954 68705 98160 81733 66283 50963 29933 38650
13200 38650 34629 9493 7831 41550 40957 33542 10809 -17810 -13640 1889 32069 49254 78728
13187 78728 82141 57715 47188 25353 26732 17122 -246 -4235 25690 34566 19699 38700 47454
13174 47454 25456 30645 48172 75354 91842 128385 157364 153349 138464 114680 101314 100480
13162 100480 95468 62679 45285 71964 91148 93952 117074 108693 98369 74082 62625 40167
13150 40167 30719 3684 27156 22441 13936 18326 37968 59114 86743 93123 87802 61568 76453
13137G6453j174l9887j0080K1772J4780R74N072M2176O576j5844R276j106j0979
13124I8009O059K8906J2296Q985p26Q527q74k3857l0880k8884j5288K57K1156
13111H3686N852n472o005J4615K2401l378j7935K8904K4790J8962p768j1778J7958
13098A64832M246K9439k146Q790L4819R256K5185N252O896P3211J17164J30060
13086F07004J71281K10448K14478K20836J92658J54158M7292m4250q9424j68918
13076A515563k41942k21310j96275j79254j22783j08497j00869n747l5041l3287
13066B70558j6719k1193l8925l132o30k2544k7620J015K0812N137k7331l7470
13054A01958k273L5894J6410J1149L743o325L2751K4019O425K3748N822M065M2547
$$ plain form
13137 76453 75279 35392 25312 47084 61864 62838 67910 110086 116662 100818 110094 108988 98009
13124 98009 104068 132974 145270 154255 153529 162056 161182 137325 106445 77561 62273 62530 83686
13111 83686 89538 84066 78061 92676 115077 111699 93764 122668 147458 166420 158652 146874 164832
13098 164832 169078 198517 196371 205161 239980 249236 274421 279673 286569 359780 476944 607004
13086 607004 778285 988733 1203211 1424047 1616705 1770863 1818155 1773905 1684481 1515563
13076 1515563 1273621 1052311 856036 676782 553999 445502 344633 338886 303845 270558
13066 270558 253839 232646 193721 190589 189959 167415 139795 140810 161622 166759 139428 101958
13054 101958 99685 135579 151989 163138 166881 160556 193307 217326 223751 247499 253321 257386 299933
13041B99933M7722M3005J11677J81692J95270K03017K07681K24151K10103J17542
13031A841793K3743p5819j10976j61020k11460k19227k14167j95822j25932j14011
13021D37102r5493k4950n4682q365j0369K2493k7624k6926J6207j888j2198k397
13009B10910k0425k0665j1315l343O778P39l1536l1113M186J2840J5083N46j3490
12996A19195q952k5388j393j3716K3344J6825O92k0058J0805m189M837J0943k6174
12983H6771j2709j4231m228j0396j6151J1256j8242n232J8191J5897K1020j5941
12971E6005L011L7034N821j7173j896j1274k534j4003j7804P643K661J6886L8680
12958A03057j0410l2666M630j157O655K9766Q585l620N81k3301L2858L0162q930
$$ plain form
13041 299933 347655 390660 502337 684029 879299 1082316 1289997 1514148 1724251 1841793
13031 1841793 1865536 1789717 1678741 1517721 1306261 1087034 872867 677045 551113 437102
13021 437102 341609 316659 261977 253612 243243 265736 238112 211186 227393 225505 213307 210910
13009 210910 190485 169820 158505 155162 161940 162679 131143 100030 104216 117056 132139 132685 119195
12996 119195 110243 84855 83462 69746 93090 109915 110607 90549 101354 97165 102002 112945 86771
12983 86771 74062 59831 55603 45207 29056 40312 22070 16838 35029 50926 71946 56005
12971 56005 59016 96050 101871 84698 82802 71528 68994 54991 37187 44830 47491 64377 103057
12958 103057 92647 59981 64611 63454 70109 99875 108460 104840 105421 82120 114978 145140 136210
12945A36210k3453J4583J221n487J9730L78k7003j5027Q97J3122J5110j183l2032
12932I7066k641J3581j71K9679K4176Q780J8761J0253J0459j5310k5523j3434
12920A55676j4256k1329l1859j4570N18K0760K2745J7092L0502O917l8636k1027
12908A12533K4214J8289L2008P978l4672j2817L3564M0099K0323j0307R889M9667
12896B90768N0506L1352L9418R999m341o370k0837K6764K187m0532j7178j6697
12884C45039k7761k9218O460N537m3770k2855j8047j1115r804o333R263K98Q880
12871B06574R282k4589k2010J666j6392o162l397L2888J6391J1670J1713O403
12859B24037P183l3901j4357K1591M5722K6548J5424k557r613p868K8103L829
$$ plain form
12945 136210 112757 127340 128561 123074 142804 143182 116179 101152 102049 115171 130281 129098 97066
12932 97066 94425 108006 107835 137514 161690 170470 189231 199484 209943 194633 169110 155676
12920 155676 141420 120091 88232 73662 74180 94940 117685 134777 165279 172196 133560 112533
12908 112533 136747 155036 187044 195022 160350 147533 181097 221196 241519 231212 241101 290768
12896 290768 341274 372626 412044 422043 417702 411332 390495 417259 419446 378914 361736 345039
12884 345039 317278 288060 294520 300057 256287 233432 215385 204270 194466 188133 197396 197694 206574
12871 206574 215856 191267 169257 170923 154531 148369 144972 177860 194251 205921 217634 224037
12859 224037 231220 197319 182962 204553 250275 276823 292247 289690 280077 272209 300312 304141
12847C04141K6823O7772M5403J2515q25j0196q52j0886L1057J7104k1510n3604
12835D06942n4291K9206K1086Q246J9413K869j544l246l8510j4577J1718J8267
12823D05579Q72j4878j622J153k7918l2741n962L645L8146L0664J5522K1326m464
12810D29322P014K1346K80J9357M5528K9794J8098L7136Q0642O7075O9637Q2142
12798I07371O2847O9138P7266M1105j680m2436l0449m2065m9656p5116o2991p1657
12786G81677k7714k9545k4756k8962l2656j8361k2866P867n5166o9091l5037k7598
12774D17792Q632J7440M7030K7985M012N0822L4247L9963N1038L4288L1938K3834
12762G89021n783o31l545m7358j5876K2333j6299P832J520K6334O0079Q3411O7479
$$ plain form
12847 304141 330964 398736 444139 456654 455829 445633 444781 433895 464952 482056 460546 406942
12835 406942 352651 381857 402943 411189 430602 433471 431927 428681 390171 375594 387312 405579
12823 405579 406451 391573 389951 391104 363186 330445 324483 328128 366274 396938 412460 433786 429322
12810 429322 436336 457682 457962 477319 522847 552641 570739 607875 688517 755592 825229 907371
12798 907371 970218 1039356 1116622 1157727 1156047 1113611 1083162 1041097 991441 916325 853334 781677
12786 781677 753963 724418 699662 670700 638044 619683 596817 604684 549518 480427 445390 417792
12774 417792 426424 443864 490894 518879 522891 573713 607960 647923 698961 733249 765187 789021
12762 789021 783238 782607 779062 731704 715828 738161 721862 729694 731214 757548 817627 901038 968517
12749I68517Q0707O0100P7632P6256J6215k0327l5260m5802q5661m5346k3042
12738A023989l4276n1815m7920j5920k7691m8089m9120k1038j6685m8867k5753
12727F36815J9668L057l0458j8292K4360o707k556K0970N243M5138M8222O3516
12715H08976P0794J8078J0438P548l3768k9962m9806m4483J1955J5211j6950l3547
12703G34484J028N2934N1258K4293p87L5139J7341k8523J1802O0339L1565K6881
12691A017754M6536O3579P3252N2821Q918O2975M1610N1713Q3684M9703O7380
12680A619925Q0190N8600M9986J21599J39738J21987J42640J35828J15849J27153
12670B713495J53146J70618J99602K44702K46556L12046L91285M48297N13006
$$ plain form
12749 968517 1049224 1109324 1186956 1263212 1279427 1259100 1223840 1178038 1092377 1047031 1023989
12738 1023989 989713 937898 889978 874058 846367 798278 749158 728120 711435 662568 636815
12727 636815 656483 659540 629082 610790 635150 628443 625887 646857 652100 697238 745460 808976
12715 808976 879770 897848 908286 915834 882066 852104 802298 757815 769770 784981 768031 734484
12703 734484 735512 788446 839704 863997 863210 898349 915690 887167 898969 959308 990873 1017754
12691 1017754 1064290 1127869 1201121 1253942 1262860 1325835 1367445 1419158 1502842 1552545 1619925
12680 1619925 1700115 1758715 1808701 1930300 2070038 2192025 2334665 2470493 2586342 2713495
12670 2713495 2866641 3037259 3236861 3481563 3728119 4040165 4431450 4879747 5392753
12661E392753O25239P84019R59428J111740J310672J511801J629471J734726J854164
12652A6914013J997955K207981K619495L362243M593190O695230J0248995J5906726
12644F4545828K3039215K9845132L6116773M1610926M3238409L9068100K9864733
12637C07329116J5841652n39395j5451698k6913187l5418632m0634403m0365047
12630A63848406l5158077k8428560k2177125j6539365j1447457p440376m907331
12623C7750115l484283k769396k376317k182519k148040k033278j928582j790038
12615A9037662j516151j182884q51031n43831j96138J62373M82513P46704R78467
12606A7117684J198278J374023J529758J682916J926883K376749L079358M293131
$$ plain form
12661 5392753 6017992 6802011 7761439 8873179 10183851 11695652 13325123 15059849 16914013
12652 16914013 18911968 21119949 23739444 27101687 31694877 38390107 48639102 64545828
12644 64545828 87585043 117430175 153546948 195157874 238396283 277464383 307329116
12637 307329116 323170768 322631373 307179675 280266488 244847856 204213453 163848406
12630 163848406 128690329 100261769 78084644 61545279 50097822 42657446 37750115
12623 37750115 34265832 31496436 29120119 26937600 24789560 22756282 20827700 19037662
12615 19037662 17521511 16338627 15487596 14943765 14747627 14910000 15392513 16139217 17117684
12606 17117684 18315962 19689985 21219743 22902659 24829542 27206291 30285649 34578780
12598C4578780O310665R755695J5224288K2441846K9606241L6086344M1960171
12591A95964030M4494020M0804859L2109663J8854912J751902j4309298k6317415
12584B93352673l5239996m1385975m2228745l7359909l0404256k3914406j8070302
12577F4749084j2642519q348629n527691l914716l057533k664772k505495k448740
12569B3638989k368965k303778k189512j981741j735346j456421j242332j071451
12561I289443q71336p26839o66619n75115m89842m30677l84623l55794l26169
12552D462429k85752k86144k73438k45391j91244j69759j43047j31265q7528o7172
12542B581689r9598r0971r3116q9307p0405q1219q1631j05565r5086j08995j07754
$$ plain form
12598 34578780 40889445 50645140 65869428 88311274 117917515 154003859 195964030
12591 195964030 240458050 281262909 313372572 332227484 333979386 319670088 293352673
12584 293352673 258112677 216726702 174497957 137138048 106733792 82819386 64749084
12577 64749084 52106565 43757936 38230245 34315529 31257996 28593224 26087729 23638989
12569 23638989 21270024 18966246 16776734 14794993 13059647 11603226 10360894 9289443
12561 9289443 8418107 7691268 7024649 6449534 5959692 5529015 5144392 4788598 4462429
12552 4462429 4176677 3890533 3617095 3371704 3180460 3010701 2867654 2736389 2648861 2581689
12542 2581689 2482091 2391120 2298004 2208697 2138292 2057073 1975442 1869877 1774791 1665796 1558042
12531A558042r4275p2405m6144l8552m2121l8746k2063l1883l2947j5554k8455
12520A094897r603L112l5114j0996M48k5826o347R48k0540r26L2297N0485p02
12507A072133J1126J3449k6403M8077R5824J32353K00473K57379L13621L81908
12497B499940M00696L85573K93632J55191R47j89738k94221l67036m06649l93540
12487B084795l50841k88778k50841k05987j72659j47604j07425p7409q8500n9880
12477C34871o4524p8375l2894m244N200k091J6686M1819K7938r618k5652l2575
12465A76541J9001j4491j5186L079J8661k4797N640J4629j5174j8830J1324L576
12453A63973j6076j3183j2844j7998j2866L188k169j3004o222P241l877J7614
$$ plain form
12531 1558042 1463767 1391362 1345218 1306666 1264545 1225799 1203736 1171853 1138906 1123352 1094897
12520 1094897 1085294 1088406 1053292 1042296 1042744 1016918 1010571 1011519 990979 990053 1022350 1072835 1072133
12507 1072133 1083259 1096708 1070305 1118382 1214206 1346559 1547032 1804411 2118032 2499940
12497 2499940 2900636 3286209 3579841 3735032 3735979 3546241 3252020 2884984 2478335 2084795
12487 2084795 1733954 1445176 1194335 988348 815689 668085 560660 483251 394751 334871
12477 334871 270347 191972 159078 154834 160034 157943 174629 216448 244386 234768 209116 176541
12465 176541 195542 181051 165865 168944 187605 162808 168448 183077 167903 149073 160397 163973
12453 163973 147897 134714 121870 103872 91006 94194 92025 79021 72799 80040 76163 93777
12441I3777M4229K5688L6518j713p756k2814j2395k6897p5737p8683q2293q8153
12429a96229n1399L704k475J1346L5499R724K1751N2376K5176j643N727K3349
12417f3094j8166l191L6936J799P743m398o075O703m553j1785m930J1670q047
12404e9388j9332j4884M541l553j1867j5725l2389J2892L8638J3272q335k1302
12392a17432j513J1013K6243J5933K2204p103j3461L4204L2728Q817Q121j8333
12380A421k2384j9262K0868J7034K0619j896k6330K1752k318m5281l0602K1257
12368d5122J0376L210K3892K702l59L631J4678K1619l919j830L340n868O23m773
12354B2200L2704l189k8253l0488m63O654Q651J3179o333K8007N3087Q6666Q0096
$$ plain form
12441 93777 138006 163694 200212 198499 190743 167929 155534 128637 52900 -25783 -108076 -196229
12429 -196229 -247628 -243924 -246399 -235053 -199554 -189830 -168079 -115703 -90527 -92170 -86443 -63094
12417 -63094 -81260 -84451 -47515 -45716 -37973 -42371 -48446 -41743 -46296 -58081 -63011 -51341 -59388
12404 -59388 -78720 -93604 -89063 -92616 -104483 -120208 -152597 -139705 -101067 -87795 -96130 -117432
12392 -117432 -118945 -107932 -81689 -65756 -43552 -50655 -64116 -29912 2816 11633 19754 1421
12380 1421 -20963 -40225 -19357 -2323 18296 16400 -9930 11822 9504 -35777 -66379 -45122
12368 -45122 -34746 -31536 -7644 -4942 -5301 -1670 13008 34627 30708 28878 32218 26350 26973 22200
12354 22200 54904 51715 23462 -7026 -7489 -835 7816 20995 14662 42669 95756 182422 262518
12341B62518O0773J1356m8060l2733l0042l9329p2714o1182k763j8976k0259K6601
12329C5190j1028n0490j7892K7818K8445k854K175J2691k897l224J0832K1493
12317E0259J1420L536l54j7266k2029K656K1600M937p608K5681L0002N1112J508
12304A55454j8525P361L9969N2996J09303J45318K26671K74304J01443r0680j23881
12293H79733j06070j50462j78861j25887o8505p9982m2114q171j3170k4614r752
12282G2145K0268j3104k0948l789j2633J1738J3468L570j1382M104j1224J4356
12270F6569J2645J3290O239J2196m377Q597P111J0095L0873M4890P190R791K6747
12257B51856K1528L6660J15363K48960L08220J69216o0286j35249j19097p8949
$$ plain form
12341 262518 323291 334647 286587 253854 223812 184483 111769 50587 47824 28848 8589 35190
12329 35190 24162 -26328 -44220 -16402 12043 9189 11364 24055 21158 17934 28766 50259
12317 50259 61679 65215 64861 47595 25566 28222 49822 54759 47151 72832 102834 153946 155454
12304 155454 136929 144290 184259 237255 346558 491876 718547 992851 1094294 1003614 879733
12293 879733 773663 623201 444340 318453 249948 169966 127852 119681 106511 81897 72145
12282 72145 92413 79309 58361 54572 41939 53677 67145 70715 59333 63437 52213 66569
12270 66569 79214 92504 98743 110939 106562 115159 122270 132365 163238 208128 215318 225109 251856
12257 251856 273384 310044 425407 674367 982587 1151803 1091517 956268 837171 758222
12247G58222j43452j72194j15779n1543k3988l1691k9667m8797j3766M107k0306
12236A11146K2055k027j3191j1841k1592O323p510N280r809j4700j2536j0994
12224D0604k6822J9207M7637L67N468r464p212N734M300K7150L0101K4075Q181
12211A69326O1192O6264Q7749Q1359j752j5824l7585m1834m6604j3889j6839l3355
12199B58208J3832k412Q120N6443J03047J20637J31433J55437K03973K47502J67542
12188A463762J29522J05175k523q1299j46290j81177k05987k05856j93428j20458
12178E61441j04725p8147p3827n0880k8818k6391j5151j2937j0823j1266J4649
12167A63125J5430j9526L346l6467m100J5671J4023j2094k8472l1519K7185L1044
$$ plain form
12247 758222 614770 442576 326797 275254 251266 219575 189908 141111 127345 131452 111146
12236 111146 133201 131174 117983 106142 84550 90873 83363 88643 78834 64134 51598 40604
12224 40604 13782 32989 80626 80993 86461 76997 69785 75519 79819 106969 137070 161145 169326
12211 169326 230518 296782 384531 465890 464138 448314 410729 368895 322291 308402 291563 258208
12199 258208 272040 269628 277748 334191 437238 557875 689308 844745 1048718 1296220 1463762
12188 1463762 1593284 1698459 1695936 1614637 1468347 1287170 1081183 875327 681899 561441
12178 561441 456716 378569 304742 253862 225044 198653 183502 170565 159742 148476 163125
12167 163125 178555 159029 162375 125908 121808 137479 151502 139408 110936 79417 106602 137646
12155A37646r96o044R657K1204J5814J1386M542K8499M2752P1999J25656J63484
12143F25599K04293K43771K49858J81538J91535J12934N4112p4636j42613k23152
12133A423239k42894k15293j76133j67022j09175q7715q2723o2722n7264o03l7420
12122A84275j9327n155m1880l4750J0984J2245N145k1634m2492p448j3160J3871
12110D0674J6154n268K2882k6412l0404J034Q835k2274o282l638j4178j4252R436
12097b3693K5920L6310R006j7415r702N108j165J5162O105J3744j4417J9209l086
12084F1086k6991J1475j7175K2476J5636j9547r130j165q408n088J6090K561j575
12071D0245K012j670k7960o238N246j3784o202P143J6069m181j586k2062K2743
$$ plain form
12155 137646 136650 130606 140263 161467 177281 188667 193209 221708 264460 336459 462115 625599
12143 625599 829892 1073663 1323521 1505059 1696594 1809528 1863640 1789004 1646391 1423239
12133 1423239 1180345 965052 788919 621897 512722 425007 342284 279562 222298 221695 184275
12122 184275 164948 159793 117913 83163 94147 106392 111537 89903 47411 39963 26803 40674
12110 40674 56828 51560 74442 48030 17626 18660 27495 5221 -1061 -4699 -18877 -33129 -23693
12097 -23693 2227 38537 47543 30128 20426 25534 24369 39531 45636 59380 44963 64172 61086
12084 61086 34095 45570 28395 50871 66507 46960 37830 36665 28257 23169 39259 41820 40245
12071 40245 42257 40587 12627 6389 11635 -2149 -8351 -1208 14861 10680 9094 -12968 9775
12058I775q669N98K2329J4413j3536j9212M996K7471L9894Q477n775k1529k4461
12045C4771j1765j975k7163J0040K2558J109N683J0707M282O8056O3637L9808
12033B19748Q841k0212l7652j8527l7208m5586j6403k0325l5137m151p123Q907
12021d828K5255L5406K4373P8k7223k827J2844n600K8048p100J1898p30l2136
12008E7458k6160M335J7452j9190Q64m323j5629n89K98Q255N589j5902o552O167
11994A2073N42q388J3635J5400l7435k5333J6078J2667O881P436j5727l5465k3813
11981f1449J472O627L5777P448K1625J1096J4368k3214M910j2446J5588j4239
11969G563N033q965R078L4660K662k1815j1370j8560P51O075M484L811K0101J4509
$$ plain form
12058 9775 1106 1704 24033 38446 24910 5698 10694 38165 78059 86536 80761 59232 34771
12045 34771 23006 21031 -6132 3908 26466 27575 33258 43965 48247 116303 179940 219748
12033 219748 228589 208377 170725 152198 114990 69404 53001 32676 -2461 -6612 -13735 -4828
12021 -4828 20427 55833 80206 80284 53061 50234 63078 57478 85526 78426 90324 89594 57458
12008 57458 31298 35633 53085 33895 34759 30436 14807 14218 14516 22771 28360 12458 5906 12073
11994 12073 12615 4227 17862 33262 -4173 -29506 -13428 -761 6120 13556 -2171 -37636 -61449
11981 -61449 -59977 -53350 -17573 -10125 11500 22596 36964 13750 18660 6214 21802 7563
11969 7563 12596 3631 12709 47369 50031 28216 16846 -1714 -963 5112 9596 13407 33508 48017
11955D8017J0958P117k1846q116j6815j4570j0727j1121Q35k8781q596k604K0048
11942c6201J083K1923J7633J5620k99k7055j3334J671J1914l1197j2316j7362
11930f7920K8126L1117N911J6584r863K999q27Q575O442k4244k589K2486k3941
11917g144j1825M0157J0006l223j9953k2275k0239q762M399J8018K3973J1759
11905A4891m6765l5058j3886K3302K6129M1835K1220j7574K025J6214j2199l4502
11893a4368k7233J2084M1526j4422o824q897J8468j0393k940J8363J7106l3869
11881a1399j0415J0042L0789J3902K887J6310J1402m0162l9705J264o484J4942
11869f627j5670j325J9587j5131K554J6344j7488k3694P760j997K944J2749Q525
$$ plain form
11955 48017 58975 66092 44246 36130 19315 4745 -5982 -17103 -16268 -45049 -53645 -56249 -36201
11942 -36201 -35118 -13195 4438 20058 19759 -7296 -20630 -18959 -7045 -38242 -50558 -67920
11930 -67920 -39794 -8677 -2766 13818 3955 6954 6127 14702 21144 -3100 -5689 16797 -7144
11917 -7144 -18969 21188 31194 27971 8018 -14257 -34496 -43258 -38859 -20841 3132 14891
11905 14891 -31874 -66932 -80818 -57516 -31387 10448 31668 14094 16119 32333 20134 -14368
11893 -14368 -41601 -29517 12009 -2413 -9237 -18134 334 -10059 -12999 5364 22470 -11399
11881 -11399 -21814 -11772 19017 32919 35806 52116 63518 23356 -16349 -15085 -21569 -6627
11869 -6627 -22297 -23622 -4035 -19166 -16612 -268 -17756 -41450 -33690 -35687 -32743 -19994 -11469
11856a1469k4811k3070J5666K5414k3249m553Q898J5151L2298K2884j3995k0875
11844a711m372j670j5701j4672j2923m26K4601L0386J1711L621q395M275J1514
11831B6238k677r13j072k166j7655J291m707l6452j7316L8126K4901p797J724
11818A525J6115J3197q177l240q568m1377q738J3550L0410R597j343K1897j2686
11805B2162l9801j0223J9098j4488j0645R414K479p44K6101k932l0160p215J4598
11792b2356M350j5947j1541J0458J6041k0531j1359r643L113P384N094k734J7036
11779c0635L4068J358O081j6562n66R11P907J0287k9860p031k661q794J2686J6355
11765f456p09L920M880Q339j1226l9341j3282N886n656K0717L0695K1859n646
$$ plain form
11856 -11469 -36280 -59350 -43684 -18270 -41519 -46072 -37174 -22023 10275 33159 19164 -1711
11844 -1711 -6083 -7753 -23454 -38126 -51049 -51475 -26874 3512 15223 18844 10449 14724 26238
11831 26238 23561 22648 21576 19410 1755 3046 -1661 -38113 -55429 -17303 7598 -199 1525
11818 1525 17640 30837 22660 19420 10852 -30525 -39263 -25713 4697 14294 12951 34848 22162
11805 22162 -17639 -27862 -8764 -23252 -33897 -24483 -22004 -22748 3353 421 -29739 -36954 -22356
11792 -22356 -18006 -33953 -45494 -35036 -18995 -39526 -50885 -60528 -57415 -50031 -44937 -47671 -30635
11779 -30635 3433 4791 10872 -5690 -6256 -5345 2562 12849 -17011 -24042 -26703 -35497 -22811 -6456
11765 -6456 -7165 -3245 1635 9974 -1252 -40593 -53875 -47989 -53645 -32928 -2233 19626 13980
11752A3980k3467k4916j8541j8758L113O459n663K3424P061p077J2787K2392k996
11739a2202k1415r228j3951K6586L0210j7812k2173R904J3803P054M582k1573
11727b6215k21L110R3r423J6448k331q111J0996K5218J835l3878k3301j2435R847
11713d8368j061p691n867J0006K2184k522J2261Q292J8844J72M716k4096j8849
11700c1979j6381J0224K8143N488P994R661p091j1576R564L2145k952M701q558
11687B9383j996l235k8688j8932M6031J8199n798k7649L2762M7147j0847p1941
11675D436o732J1989K0255J54m5438n69Q416j221Q951k0395O873J9754o814m635
11661d976m05k920N786k680j3155Q723l0797m939k2169m109K3085K2309M199J8830
$$ plain form
11752 13980 -9487 -34403 -52944 -71702 -68589 -62130 -67793 -44369 -37308 -44385 -31598 -9206 -12202
11739 -12202 -33617 -42845 -56796 -30210 0 -17812 -39985 -30081 -16278 -9224 -4642 -26215
11727 -26215 -26436 -23326 -23233 -32656 -16208 -18539 -26650 -15654 9564 11399 -22479 -45780 -58215 -48368
11713 -48368 -49429 -57120 -62987 -52981 -30797 -33319 -21058 -12766 6078 6250 10966 -13130 -31979
11700 -31979 -48360 -38136 -9993 -4505 3489 13150 6059 -5517 4047 36192 33240 37941 29383
11687 29383 27387 24152 -4536 -23468 22563 40762 34964 7315 40077 87224 76377 4436
11675 4436 -2296 9693 29948 30102 -15336 -15905 -7489 -8710 241 -20154 -13281 6473 -341 -4976
11661 -4976 -5381 -8301 -2515 -5195 -18350 -9627 -40424 -45363 -67532 -71641 -48556 -26247 -22048 -3218
11647c218j045K912j4938l4914Q225j222P696J7622J3646m0K733j6774j0768J5019
11633a5066J2282j805K7515K0292j9528j7251K7391m535l5762k3409l393n883
11621c9152K7809q599k876l633J5125k544K1450J6509j4389k3140j9262J769j1812
11608d2745M481N5007N767j482j4189j7547j8822q206j0532O684J3938J2978R477
11595e191j0482J2347K842l238J8647m45m27J2049j7736q877K748L0855K4331
11582E7423j670l9808k4633l380Q093j2906J8929J1604j1198k0412R312p549K4994
11569H799J3567o911q242J2895M503p341j5749o702j3816O785r686Q398L3931
11556B0431J5288P260j808k9426p267L291j2080J8476J9566k1223k4216j472J420
$$ plain form
11647 -3218 -4263 -1351 -16289 -51203 -42978 -44200 -36504 -18882 -5236 -5276 -2543 -19317 -30085 -15066
11633 -15066 -2784 -4589 22926 43218 23690 6439 33830 29295 -6467 -29876 -33269 -39152
11621 -39152 -11343 -19942 -22818 -26451 -11326 -13870 7580 24089 9700 -13440 -32702 -30933 -42745
11608 -42745 -38264 16743 22510 21028 6839 -10708 -29530 -37736 -48268 -41584 -27646 -14668 -5191
11595 -5191 -15673 -3326 -484 -3722 14925 14480 14053 26102 8366 -511 2237 33092 57423
11582 57423 55753 15945 -8688 -12068 -3975 -16881 2048 13652 2454 -17958 -8646 -16195 8799
11569 8799 22366 15455 7213 20108 24611 17270 1521 -5181 -18997 -12212 -21898 -13500 20431
11556 20431 35719 42979 41171 11745 4478 7769 -4311 14165 33731 12508 -11708 -13180 -11760
11543a1760r211q82K1718j9470N193k4411J6856R609j7381O446J4264J681p621
11530a4969r140p707O327K2359r142K463r136Q928j8324J3003n852K1135q575
11517h630j8557L498R597L977N834n987n0706O09M7073K7587j8819j2985J8542
11504A033J2949j0233l2287m311k564J1449Q489j2906j0671J2597M8182N130l0718
11491c861l9986k278J39k169l850o735k629L527J5160n584J3406L1367J0890k295
11477E102r136J7998l5059k4807m03N644J3442J1493L6770L852j5498j5477k65
11464f344J9586J3641j60J8150J3169l517l9302m2421O646m004j7625k0256K8658
11451c3779J1234k5910K465J9068k988L1733J0450m680L032J6678n466j6195j5855
$$ plain form
11543 -11760 -20971 -21853 -135 -19605 -14412 -38823 -21967 -12358 -29739 -23293 -9029 -7348 -14969
11530 -14969 -24109 -31816 -25489 -3130 -12272 -9809 -18945 -10017 -28341 -15338 -21190 -55 -8630
11517 -8630 -27187 -23689 -14092 -10115 -4281 -10268 -60974 -60365 -13292 14295 -4524 -17509 1033
11504 1033 13982 3749 -28538 -32849 -35413 -23964 -15475 -28381 -39052 -26455 21727 26857 -3861
11491 -3861 -43847 -46125 -45986 -48155 -52005 -58740 -61369 -57842 -42682 -48266 -34860 -3493 7397 5102
11477 5102 -4034 13964 -21095 -45902 -46305 -40661 -27219 -15726 21044 24896 9398 -6079 -6344
11464 -6344 13242 26883 26723 44873 58042 54525 15223 -27198 -20552 -24556 -42181 -62437 -33779
11451 -33779 -22545 -48455 -45990 -26922 -29910 1823 12273 7593 10625 27303 21837 5642 -10213
11438a0213k4633j3552J1209J2496J4569K2714k6257k9894R875K1628M04Q61J230
11425i563K032m067L244J2135J4550o211k0195j7932o254j31K2853n313j6840
11412c1692m584O3K1410l909k4753K2440K0136K3237J7081k946k0469j3353j2253
11399i592R317L2338j4368q453l852k0432j5776Q150j5680r105K1793j0449o531
11386d2640J3897l368K1650L1722N549n1678k2444M982K6796J4362o181L999k049
11373e403k0900P564J6960q403J7199m816m527p379j9556q722N715K8087K4938
11360B0757K1270J6469O01k1234l7399j4058j1051q378j7300o463Q163L7211l525
11347a4937j298J9378J393J3377j5091k4693K3826K5513m0203r539J8213O809
$$ plain form
11438 -10213 -34846 -48398 -37189 -24693 -10124 12590 -13667 -43561 -33686 -12058 -11654 -10793 -9563
11425 -9563 -7531 -11598 -8354 3781 18331 12120 -8075 -26007 -32261 -32392 -9539 -14852 -31692
11412 -31692 -36276 -36213 -14803 -18712 -43465 -21025 -889 22348 39429 36483 16014 2661 -9592
11399 -9592 -275 32063 17695 9242 5390 -15042 -30818 -22668 -38348 -47453 -25660 -36109 -42640
11386 -42640 -28743 -32111 -10461 21261 26810 -24868 -47312 -42330 -15534 -1172 -7353 -3354 -5403
11373 -5403 -26303 -18739 -1779 -10182 7017 2201 -2326 -9705 -29261 -37983 -32268 -4181 20757
11360 20757 42027 58496 59097 37863 464 -13594 -24645 -33023 -50323 -56786 -48623 -11412 -14937
11347 -14937 -16235 3143 4536 17913 2822 -21871 1955 27468 -12735 -22274 -4061 2748
11335B748k0546J592J4294N7076p450l4823k3303k3068Q652Q741k9974k8525k82
11322g4868L5334N4286O344p558K1836j154j8973j4373j971r852N37J7592j8158
11309a0978j3393J1408J204p935J6796L352j6430J1439O026K408j6552J1017J2435
11296A0797K1523j9151j0245K3122k6515k6718K0695K9448K022j5179j785k5571
11284a7557j9086q113l326J4003K1013l6501K648m307J5424N744R561k583O934
11271a6146k282l0599k4159n254k7437J9478P7148J1899K3456m0163j5859m009
11259c3927j4913j5735J3877K4710P167P113k955n722J7900P081J9216p566P478
11246B3724l507j2526J029P14j7943k6897M184K6919J1186K04j6790l5458j1943
$$ plain form
11335 2748 -17798 -16206 -1912 55164 47714 12891 -10412 -33480 -24828 -16087 -46061 -74586 -74868
11322 -74868 -39534 14752 21096 13538 35374 34220 15247 874 -1097 -10949 -10412 7180 -10978
11309 -10978 -24371 -12963 -11759 -19694 -2898 454 -15976 -4537 1489 3897 -12655 -1638 10797
11296 10797 32320 13169 2924 26046 -469 -27187 -6492 22956 24978 9799 8014 -17557
11284 -17557 -36643 -44756 -48082 -34079 -13066 -49567 -46919 -51226 -35802 -30058 -20497 -23080 -16146
11271 -16146 -18428 -49027 -73186 -78440 -105877 -86399 -9251 2648 26104 -14059 -29918 -33927
11259 -33927 -48840 -64575 -50698 -25988 -18821 -11708 -14663 -20385 -2485 4596 23812 16246 23724
11246 23724 20217 7691 8720 9434 -8509 -35406 -31222 -4303 6883 7087 -9703 -45161 -57104
11233e7104j3548l184N059L8022K8467J5273j5136j1135j211l502J2807J1576
11221F384j7873m13J1816L729r48J4145k669L081P851p201k0941k9734L565J5808
11207a3400K0152j4234K70Q739j5935J4436J3980K396q112k913o352j8249k9406
11194d8628l433p321K823O257j464J5376M903J2216O587p37R829j4885n752J1359
11180a2870J9650J5110K358k7719J0831k1147p514P614N929J9790L1999J6283
11168F0314K671m0315k1083j963K0929l0215k6311K8704J164J8892K3372R565
11156D5724k7600J1315o991j8527M855j6559J1620J0861n636m486j7385m755p774
11143b5338R523J0237J087J9335j1869K039p092j218J7722k9966J5853J5650k6948
$$ plain form
11233 -57104 -70652 -73836 -68777 -30755 -2288 12985 -2151 -13286 -14497 -17999 -5192 6384
11221 6384 -11489 -11902 -86 3643 2695 16840 14171 17252 25103 17902 -3039 -32773 -29208 -13400
11207 -13400 6752 -7482 -7212 1527 -14408 28 14008 16404 8292 5379 -973 -19222 -48628
11194 -48628 -52061 -59382 -56559 -50302 -51766 -36390 -31487 -19271 -12684 -13421 -3592 -18477 -24229 -12870
11180 -12870 6780 21890 24248 -3471 7360 -13787 -21301 -13687 -7758 12032 44031 60314
11168 60314 62985 22670 1587 -376 20553 -9662 -35973 -7269 -6105 12787 36159 45724
11156 45724 18124 29439 22448 3921 8776 -7783 3837 14698 9062 4576 -12809 -17564 -25338
11143 -25338 -15815 -5578 -4491 14844 2975 5014 -2078 -3296 14426 -15540 313 15963 -10985
11130a0985Q455k80j6692R225q535n520Q440J4444L1852k4259k6479L0608J6082
11117B6356k0676o008k0852L0743M961j0517p231j6995l038P334J9824J4856k3084
11104d327J4986j0455j6447P058J6776j4847l391l046K780Q589J3405L1084m906
11091C7259l5616j9690J3925J6176O894K1583K6328j273j0128o953k140J53l658
11078D2860j8980j1497j4863l0299r780N092N128J4456J7072J1352q223j8420
11066a6102P840l326j2330j3550J972J0590j4608k12P2502j4174k9451j2990j8504
11053d2343Q685K2482K1019K961l2745p836J3071Q256N967J2107J8668k0179n229
11040D884j456k1110K742O401j2602J2991N280J7878r540j394K381J6731j4002
$$ plain form
11130 -10985 -2530 -2810 -19502 -10277 -18812 -24332 -15892 -1448 30404 6145 -20334 10274 26356
11117 26356 5680 -328 -21180 9563 14524 4007 -3224 -20219 -23257 -15923 3901 18757 -4327
11104 -4327 10659 204 -16243 -9185 7591 -7256 -10647 -13693 -10913 -2324 11081 42165 37259
11091 37259 1643 -18047 -4122 12054 18948 40531 66859 65586 55458 48505 46365 46518 42860
11078 42860 23880 12383 -2480 -32779 -42559 -37467 -32339 -17883 -811 10541 2318 -16102
11066 -16102 -8262 -11588 -23918 -37468 -35496 -24906 -39514 -39726 32776 18602 -10849 -23839 -42343
11053 -42343 -33658 -11176 9843 12804 -19941 -27777 -14706 -6450 -483 11624 30292 10113 4884
11040 4884 3428 -17682 -14940 -8539 -21141 -8150 -2870 15008 5468 4074 6455 23186 9184
11027I184k2607J8129Q58l958j8758n94M540J0567R315q360k887l455M251K5717
11013B1942j7755j2695j7456k3776L2720N0757j9528m4480j8209o369J0475p881
11001e2255J0445K8410O9201Q886m147l2777n50R617M429J457k0021l2780P250
10988b835K0615k798J4671O051o084l4406J39M1502n46J6221n264k2478m2224
10975a7436Q517N110j864j8586K30k007k3635p917M9768K7853k3407p199M2602
10962C2029m261j5914M4J1361J0187R33j4057j1025K217M361J1072j7872j7226
10949h151L9550J3554k9670l7432k5033J0652k7578j9202K9262L9052L664L2462
10937B1130J3271j5488J3536j2747k8423k7620K748L2963L1441R16k1030j5442
$$ plain form
11027 9184 -13423 4706 5564 1606 -17152 -17746 -13206 -2639 6676 -1684 -4571 -8026 -3775 21942
11013 21942 4187 -8508 -25964 -49740 -17020 33737 14209 -30271 -48480 -54849 -44374 -52255
11001 -52255 -41810 -13400 55801 64687 60540 27763 27213 36830 41259 42716 22695 -10085 -2835
10988 -2835 17780 14982 29653 35704 29620 -4786 -4647 36855 36309 52530 47266 24788 -17436
10975 -17436 -8919 -3809 -5673 -24259 -24029 -26036 -49671 -57588 -7820 20033 -3374 -10573 32029
10962 32029 27768 11854 11898 23259 33446 34379 20322 9297 11514 15875 26947 9075 -8151
10949 -8151 31399 44953 15283 -22149 -47182 -36530 -64108 -83310 -54048 -14996 -11332 21130
10937 21130 34401 18913 32449 19702 -8721 -36341 -33593 -630 30811 31727 10697 -4745
10925d745l2651m774K0057J516J3558L3393l4442j4743j7382m337p528j9018J9592
10912e1504K2983J3843M182j9910J2215N345k1807P765K8996j7728j9941o410
10900d1971K1646J5329k0036K129J1456p193P032J2474J3628K1460J4999l4042
10888A6911j4413L685J9314k0090j5645j7312L039L8410j2424j2335n011j1812
10876b7683O677K473p30m63O465K2345K6183p91k2646j0416k597K4041J1895J5764
10862E0517J8497k8994l8593k4785J0434K3956o444q170J362J6029k1548O37N60
10849f542J6478K8462j5201j3103m54J2756p806j2702J8530J7118j508m1853j6524
10836b2349L380J5303K0543j4539k9146q641n789K0562J5135j6559k737K8881
$$ plain form
10925 -4745 -37396 -42170 -22113 -20597 -7039 26354 -8088 -22831 -40213 -44550 -52078 -71096 -51504
10912 -51504 -28521 -14678 -10496 -30406 -18191 -12846 -34653 -26888 2108 -15620 -35561 -41971
10900 -41971 -20325 -4996 -25032 -22903 -11447 -18640 -11608 866 14494 35954 50953 16911
10888 16911 2498 6183 25497 5407 -10238 -27550 -24511 13899 1475 -10860 -15871 -27683
10876 -27683 -21006 -18533 -19263 -19726 -13261 9084 35267 34476 11830 1414 -1183 22858 34753 50517
10862 50517 69014 40020 1427 -23358 -12924 11032 4588 -3582 -2220 13809 -7739 -7102 -6542
10849 -6542 9936 38398 23197 10094 9640 22396 14590 1888 20418 37536 36028 -5825 -22349
10836 -22349 -18969 -3666 16877 2338 -26808 -35449 -41238 -20676 -5541 -22100 -24837 4044
10824D044j5138j7247J3623J3564L337p850J1854j899L191l264k2300l812J4356
10811g541P095k0414m078K1044K5243j007J2579o921l505j1181R558j1992l3k3815
10797a4968j1466j0912j9854O239Q615M741K5799J7140l817Q05k33O946J7768
10784B6803j4896j0886k3506k4254R281L3579K7408j679k6924n075k0260N497
10772b4912L0634P281p765k202j7602J4507K356q039O159J9084k1281K7788J8140
10759D4148j8822j2743k6149k694m112o453J8946Q355Q74j0673O036j1884J2669
10746b502J920l536L5906l299k2308K842L794j1643K484r204K5221P520j4577
10733A2618q301O261m508o645j414M245r354N987K6387q811J3911j7387k8854
$$ plain form
10824 4044 -11094 -28341 -14718 -1154 2183 -5667 6187 4288 7479 4215 -18085 -21897 -7541
10811 -7541 -446 -20860 -24938 -3894 21349 20342 32921 26000 22495 11314 20872 8880 8847 -14968
10797 -14968 -26434 -37346 -57200 -50961 -42346 -37605 -11806 5334 1517 2322 2089 9035 26803
10784 26803 11907 1021 -22485 -46739 -37458 -3879 23529 21850 -5074 -10149 -30409 -24912
10772 -24912 5722 13003 5238 3036 -14566 -59 2297 -5742 417 19501 -1780 26008 44148
10759 44148 25326 12583 -13566 -16260 -20372 -26825 -7879 476 1350 -9323 -3287 -15171 -2502
10746 -2502 -582 -4118 31788 28489 6181 9023 12817 1174 3658 -5546 19675 27195 12618
10733 12618 4317 10578 6070 -575 -1989 2256 -7098 -1111 25276 16465 30376 12989 -15865
10720a5865L779l553M3735J8926j5195m506P573j7074l0639j1836r677L4410K7649
10707B7727n45l3517P309j60J5807j1508j6796M324J9310J2529J3149l700k7714
10694F215k3127J9785J567j5045n328p410J6261L6689P928K3230J2457P084j1708
10681F8598L1548r12l5623k1010J7481O783k0141P670k296k1813k7781O725k0232
10668a1003O711J1114J484K0633O94k1105J147J0152j5308P706K6020p408j8069
10655A2768k4658k236K4190J4440k0772J5771J7920J5046k046J5446l388P17K3233
10642H6431J3061K2231K1296K7440J0987P288J5022K3768p989K0102L5716j5884
10630B59469k9415k0229n1257o8149o1706J348J8387q528j352J1560L6904J6050
$$ plain form
10720 -15865 -12086 -15639 28096 47022 31827 27321 34894 17820 -12819 -24655 -34332 78 27727
10707 27727 27182 -6335 974 814 16621 5113 -11683 -7359 11951 24480 37629 33929 6215
10694 6215 -16912 2873 4440 -10605 -15933 -23343 -7082 29607 37535 60765 73222 80306 68598
10681 68598 100146 99234 63611 42601 60082 66865 46724 54394 52098 30285 2504 9229 -11003
10668 -11003 -4292 6822 8306 28939 29633 8528 9675 19827 4519 12225 38245 30837 12768
10655 12768 -11890 -14126 10064 24504 3732 19503 37423 52469 50423 65869 62481 63198 86431
10642 86431 99492 121723 143019 170459 181446 188734 203756 227524 219535 239637 275353 259469
10630 259469 230054 209825 158568 90419 28713 30061 48448 39920 38568 50128 87032 103082
10618A03082l5436k2521j1231l5155K479J6203n249J8489n558m2404J5487J8889
10606A7075n116n7K879r123P65J726j854K923K7641K6783k0301K5170K2496N7208
10592A48215O0544M0653M8528L0145L650O474l9426m2555k8448J98k8623o4106
10580A35249m8673m2477k4431J7987J5093P88k0398L878j62K0693p90j4517j9417
10567B2823j034k9813r533K9536K8534J2532k6913l5698o23o737j0505J1234L8184
10554B1987O313n223K045j242o868l016M072M999K0693L3261K8846Q710K7391
10541A41968L4272k4720j2283j3943j9945q475l5028k9783j334m55N563P812k5347
10528A8302j8422M298o789J190K8830L333l641Q244r785o105m4770j3269K1577
$$ plain form
10618 103082 67646 45125 33894 -1261 1218 17421 12172 30661 25103 -17301 -1814 17075
10606 17075 11959 11902 14781 5658 6423 8149 6295 9218 36859 63642 43341 68511 91007 148215
10592 148215 208759 249412 297940 328085 331735 338209 298783 256228 227780 227978 199355 135249
10580 135249 86576 44099 19668 37655 52748 53536 33138 37016 36854 57547 56757 42240 22823
10567 22823 21789 -8024 -17557 11979 40513 53045 26132 -9566 -10189 -16926 -27431 -16197 21987
10554 21987 28300 23077 25122 23880 17012 13996 18068 23067 43760 77021 105867 114577 141968
10541 141968 176240 151520 139237 125294 105349 96874 61846 32063 30729 30274 35837 43649 18302
10528 18302 -120 4178 -2611 -1421 27409 30742 27101 35345 25560 19455 -25315 -38584 -17007
10515a7007K1095k025j8302k5575Q20L094M9689J8196q398J699n128j8654n51
10502a047r094J4483K0114O0254J5846m254j7392j932k5712k5491k7470l9636
10490d1331k2348K6924K8588M7225L4265j7185l2034k6950r011J5219k348j078
10478f4M1629L630k7813k1022j1886J1813k392n686J4700j0260K1212j2528j4023
10465a2690j456k409r342o275n976J0229J8067m103k4367j5099J402M1565O2116
10452E1662M3573K3606l454l9652j8276K671m285l0026k1189m582j8116k819L4115
10439A3228Q753k6311J6164m047l0013L922m186R810R052l497k3445k330l932
10426c6832M3616M5053N151j0990k7917k0884J254m34o011l789j073j6511J3594
$$ plain form
10515 -17007 4088 2063 -16239 -41814 -40994 -37900 11789 29985 21587 23286 18158 -496 -1047
10502 -1047 -10141 4342 24456 84710 100556 96302 78910 76978 51266 25775 -1695 -41331
10490 -41331 -63679 -36755 -8167 39058 73323 56138 24104 -2846 -11857 3362 1014 -64
10478 -64 41565 45195 17382 -3640 -15526 -3713 -6105 -11791 2909 -7351 13861 1333 -12690
10465 -12690 -14146 -16555 -25897 -32172 -38148 -27919 -9852 -13955 -38322 -53421 -52019 -10454 51662
10452 51662 95235 118841 115387 75735 57459 60130 55845 25819 4630 48 -18068 -20887 13228
10439 13228 21981 -4330 11834 7787 -22226 -18304 -22490 -12680 -3628 -7125 -30570 -32900 -36832
10426 -36832 6784 51837 56988 45998 18081 -2803 -1549 -1983 -7994 -11783 -12856 -29367 -15773
10413a5773Q006Q735n689j8045L050J9198P265j6543L0530K4858q730k0340j7511
10400i89N055K3351k209O86O669J3041P665k3630k651J1974k1314j2868n540l0913
10386c1673q587N545n768J4863J5876k8866K4798J7235J9934L253n680j816k488
10373A6626m233p997j4515j1075J0844O946J8j5634q450Q148K4729k1541j1962
10360b8096J731M0072L304J8341J0978k4530J5065J5546j5721P951k3645m7366
10348b6370p561O12K19N233J2940J1043k6281j9977L5559J214J0942j33J8851
10335A6291j2982j4034K2086J3014n834Q880M034O868p214P181j7406j787j2003
10322G094Q746j7453k29L052L527M160k7748m997J2415Q438l913K7266L533n526
$$ plain form
10413 -15773 -7767 968 -4721 -22766 -19716 -518 6747 -9796 20734 45592 36862 16522 -989
10400 -989 4066 27417 25208 25894 32563 45604 53269 29639 26988 38962 17648 4780 -760 -31673
10386 -31673 -40260 -34715 -40483 -25620 -9744 -38610 -13812 3423 23357 26610 20930 19114 16626
10373 16626 12393 4396 -10119 -21194 -10350 -3404 -3386 -19020 -27470 -19322 5407 -16134 -28096
10360 -28096 -26365 13707 17011 35352 46330 21800 36865 52411 36690 44641 20996 -26370
10348 -26370 -33931 -33319 -33100 -27867 -14927 -3884 -30165 -50142 -14583 -13369 -2427 -2560 16291
10335 16291 3309 -10725 11361 24375 18541 27421 31455 38323 31109 38290 20884 19097 7094
10322 7094 15840 -1613 -1842 1210 4737 8897 -18851 -23848 -11433 -2995 -6908 20358 23891 18365
10308A8365J3125j3134p075J2237J117L0805N4956l053j8142r965k3330P52j1060
10295D5598l1562J1583Q521P357Q269J8898J2492J7845k600k5320L9549L6679
10283A47309N525m499n559l355k0509k9820j1758j3729r596k51L966P30m053p661
10269D6740m878O451M223J5814q395n961j4423n038K2934N805j5982k1873P44
10256B6161L4240j8279l1299K1265Q070j7128J6062p441j5342M2193K0296L831
10244H2629n823K5318M0616n631k48Q349K086r889j1469k2307o496l9560k7594
10231B9981K3784J3702j9533j4756K304N736K6108K637J9532j5075m8947k7755
10219b282J1093J2371j6701O481k380K3277K6081p189m78K124q723k7226k2114
$$ plain form
10308 18365 31490 18356 11281 23518 24635 55440 110396 107343 89201 79236 55906 56658 45598
10295 45598 14036 25619 34140 41497 49766 68664 81156 99001 96401 71081 110630 147309
10283 147309 152834 148335 142776 139421 118912 89092 77334 63605 54009 53758 57724 58454 54401 46740
10269 46740 41862 48313 52536 68350 59955 53994 39571 34533 57467 63272 47290 25417 26161
10256 26161 60401 42122 10823 32088 40158 23030 39092 31651 16309 58502 78798 82629
10244 82629 76806 102124 142740 137109 136861 145210 147296 137407 125938 103631 97135 57575 29981
10231 29981 53765 67467 47934 33178 35482 41218 67326 69963 89495 74420 25473 -2282
10219 -2282 8811 21182 4481 10962 8582 31859 57940 50751 50273 52397 43674 16448 -5666
10206e666j5688q283J6186k2530j347M3839J8002J7894K7810k354k4755J0870
10194E3978J3170j4238j5833l68P403j8858j7585j6083J4968L861l837m836n133
10181c391j1477l343n225J8989J8527L5455J1426j4984k7124k1014p306m785K5662
10168A1410R767J385R306J7522j7086j2471j673j044L58N541Q967j3788k6343
10155h149k1299J7113J2139l994k118K1449j7585k1234k181K0720J0321j0132
10143d950J598R153M363L3511O134j8581r19j9497R066J6262r571k540l1149j2044
10129a9164J4050j0120j055N541J801o010m45J3520M639M483L871K2028l0157
10116B982k2215J0146m005J1652K038L215J5506n794K858j1494j8314L2795m208
$$ plain form
10206 -5666 -21354 -29637 -13451 -35981 -37328 6511 24513 42407 70217 67863 43108 53978
10194 53978 67148 52910 37077 36709 44112 25254 7669 -8414 6554 10415 6578 1742 -3391
10181 -3391 -14868 -18211 -23436 -4447 14080 49535 60961 45977 18853 -2161 -9467 -14252 11410
10168 11410 21177 22562 31868 49390 32304 19833 18160 17116 17474 23015 31982 18194 -8149
10155 -8149 -29448 -12335 -196 -4190 -6308 15141 -2444 -23678 -25859 -5139 5182 -4950
10143 -4950 -3352 5801 10164 43675 49809 31228 30309 10812 19878 36140 26569 24029 -7120 -19164
10129 -19164 -5114 -15234 -16289 -10748 -8947 -14957 -15402 -1882 2757 7240 11111 33139 2982
10116 2982 -19233 -9087 -13092 -1440 598 3813 19319 13525 16383 4889 -13425 19370 15162
10103A5162k6519j3260J355J0601K0308J8679J2830k574j1947P466K040j2135
10091B2006j042q841n813p328J5013J069l630j1328M160l941R091l615j449j952
10077B400k0117k1097L4202J4327j2983j401O438q75K416J4451p106k4664J0452
10064c557K0981o05J852l6162M301J949J7077K680k0332J3416M0553n689q98L3618
10050F9184O984j7532q650k2080j4151j0493R182J7385l541J470P675p532k1356
10037F545K0591J5628R402J2292J178j1816K1920N303k542j881J2651m0065J9648
10024F8854K7273p324m7849o912J8029M944j6138l021p920Q47M293J5748J1023
10011F1847l691l1525k7140K982J9123K9576r228k7632r998O194r259q452L0525
$$ plain form
10103 15162 -11357 -24617 -23262 -12661 7647 26326 39156 36582 24635 32101 34141 22006
10091 22006 20964 12123 6310 -1018 13995 15064 11434 106 4266 325 9416 5801 4352 2400
10077 2400 -17717 -38814 -4612 9715 -3268 -4669 1769 894 3310 17761 10655 -14009 -3557
10064 -3557 17424 16819 18671 -17491 -13190 -11241 5836 8516 -11816 1600 42153 36464 35566 69184
10050 69184 76168 58636 49986 27906 13755 3262 12444 29829 26288 27758 35433 27901 6545
10037 6545 27136 42764 52166 64458 65636 53820 75740 81043 78501 76620 89271 49206 68854
10024 68854 96127 88803 40954 34042 52071 57015 40877 37856 29936 30783 35076 50824 61847
10011 61847 58156 26631 -509 2473 21596 51172 41944 14312 4314 10508 1249 -7203 23322
9998B3322k4606j7648k3721K4706M4421N983K568P925O646P102l980J2571J7316
9985H2605L603m61n749K3176L5293Q2402N7609O3898J03295L8125k2513j0705
9973D50578j0465l9495p6430m9982m9514o9301k7629k3067k1443K2314k3932M902
9961H6536K3204l4560j2194K207O160l7211p536J1104k4909k4774l326L5744L5368
9948E5813J3067k8011q87K6004J7550j0247J6292L0856J0623j9790o447M691k5198
9935H4316r660J5492P083q450r417j7812j8639J0665J692k1762N205M293q629
9922C4377r553J24N777J2406N991l7683j8710J2424L1239K6751p388r944m075
9909D1736q621l032j066k3174j0685q808m86L0162K220j2760Q812P011l305k5311
$$ plain form
9998 23322 -1284 -18932 -42653 -17947 26474 32457 35025 42950 49596 56698 52718 65289 82605
9985 82605 86208 85747 79998 103174 138467 220869 278478 342376 445671 483796 461283 450578
9973 450578 440113 400618 324188 274206 224692 155391 127762 104695 83252 105566 81634 86536
9961 86536 109740 75180 62986 65193 71353 34142 26606 37710 12801 -11973 -15299 20445 55813
9948 55813 68880 40869 39982 65986 83536 73289 89581 120437 131060 111270 104823 109514 84316
9935 84316 74656 90148 97231 88781 79364 61552 42913 53578 55270 33508 38713 43006 34377
9922 34377 24824 24948 30725 43131 49122 11439 -7271 5153 36392 63143 55755 45811 41736
9909 41736 33115 30083 29017 5843 -4842 -13650 -14136 16026 18246 5486 14298 21309 18004 -7307
9895g307K7477K7525J2706M1299K590n0309l0702L0300J0386K830K111j0801j0007
9882D8098j4266p040j7014N940j079J1023K0921N555J3348k5291R019M023k437
9869E0800o02J9654K335j8989j8329l396k371K1262O402J2630j6204l483K4380
9856G4089K5633N859m2675k6498R185M989L109R133J3769p031k2487q03K884K4099
9842G3255J4358k1338l1063K8516K3322M283k8330l9296j965O431K4521l1415
9830B1279l743J5768L0854Q340J628l899l8765l1673J193L9104K2528J8431l445
9817G7600l679L3794m61j6589l0407j7123r081k783J1491K6903J5095K9208J2068
9804A26036m803l957o703j7175K2711J2225j2077j3450o725J9844M2081L5324
$$ plain form
9895 -7307 20170 47695 60401 101700 104290 53981 23279 53579 63965 66795 68906 58105 48098
9882 48098 33832 26792 9778 15718 14639 25662 46583 52138 65486 40195 49214 53237 50800
9869 50800 50198 69852 72187 53198 34869 31473 29102 50364 56766 69396 53192 49709 74089
9856 74089 99722 105581 62906 36408 45593 50582 53691 62824 76593 69562 47075 46272 49156 73255
9842 73255 87613 66275 35212 63728 87050 91333 63003 23707 21742 28173 52694 21279
9830 21279 17536 33304 64158 72498 74126 70227 31462 -211 982 40086 62614 81045 77600
9817 77600 73921 107715 107254 90665 60258 43135 34054 31271 42762 69665 84760 113968 126036
9804 126036 121233 117276 110573 93398 116109 128334 116257 102807 96082 115926 158007 193331
9792A93331O2060M8737L8985N6521P9123N7054P2506J41606J88057K46508L93681
9781A578169O59743J173125J979771J903263J91399j030812r32440o77520q87423
9772C957275j126296q85825n57597l39019j82267j18928p2435p4018p4404p0364
9762D56122l3596l5398l2716m1618j7156l0088m1398l7087m5106j9689K094M600
9750A28964K1038L6311L1205P990j5648l3744k020j1990r878J2424N168J6400
9738A86220L5975J009n569J5813L7523N2877j7847k7076j6578j2540n566Q057
9726B52298j6239k9211k0702k138Q987J019N069j6629L610K3229k3597l16J6612
9713B01992j8426l2819p098j7243q294M510J0922J1288n672m087K847k119M460
$$ plain form
9792 193331 255391 304128 343113 399634 478757 535811 608317 749923 937980 1184488 1578169
9781 1578169 2237912 3411037 5390808 7294071 7485470 6454658 5522218 4844698 3957275
9772 3957275 2830979 1945154 1387557 1048538 866271 747343 674908 600890 526486 456122
9762 456122 422526 387128 354412 312794 295638 265550 224152 187065 141959 122270 124364 128964
9750 128964 150002 186313 217518 225508 209860 176116 174096 162106 152228 164652 169820 186220
9738 186220 222195 223204 217635 233448 270971 323848 306001 278925 262347 249807 244241 252298
9726 252298 236059 206848 186146 184008 192995 194014 199083 182454 186064 209293 185696 185380 201992
9713 201992 183566 150747 143649 126406 118112 122622 133544 144832 139160 135073 137920 135801 140261
9700A40261j9026L853K524K1216L1272K7433j7362J3722J5847M2458P8084J42186
9688D82468J02611k335j9538q323R033r1407j20364p2093m2357l4829j6961j2906
9676A72999l1033k5038K5912K5052K1441l947q233N0206P00r708j8815j9630l4196
9663A45710m145r30o506J3736L2213L4306J642J3887P456q44L0969M5837K0921
9650C34252m829k6494n6315l7077Q601K9582K4215J9236K0460k868O0445J29245
9638D98453J63656K44719J82584k8991k01697j87045j15418j44107j43108q3835
9628A85211j5644M1174R759r430k2369j0416r520j3009J8718K7298J4008j4115
9616B01665k0815j5537L9118R575k5359J1688M0477L0642O733P013K3912L4723
$$ plain form
9700 140261 121235 125088 127612 148828 180100 207533 190171 203893 219740 262198 340282 482468
9688 482468 585079 582744 563206 554883 563916 472509 352145 280052 237695 202866 185905 172999
9676 172999 141966 116928 142840 167892 189333 185386 177153 227359 228059 218351 199536 179906 145710
9663 145710 141565 140635 134129 147865 180078 214384 216026 229913 237369 236525 267494 313331 334252
9650 334252 329423 302929 246614 209537 218138 247720 271935 291171 311631 308763 369208 498453
9638 498453 662109 906828 1089412 1060421 858724 671679 556261 412154 269046 185211
9628 185211 169567 210741 220500 211070 188701 178285 168765 155756 174474 201772 215780 201665
9616 201665 180850 165313 204431 214006 188647 200335 240812 271454 278187 285200 309112 343835
9604C43835L9475M8157K8782k9126p8224n2697j3239k671R383J4910p397K7165
9592C28353J3340R486J9224M4950P4738R8285Q8380N1793n8006o8794m5542l2770
9580E23437l6064l2273o3335k4344L3888O0044j9756k5752j261J8854L2233N7838
9568E23509K6628r225J4060P1373L1715m013J3658J5682N9659Q1760M5157Q4037
9556I54000R5238P0818M3128O5725J01654R9129R4348J08878J67079J81137J87694
9545B168828J88569K16085K80733L40223M77697O16454Q05502J062420J343520
9536G500031J582094J927409K823224M072065N899652R503033J7823329L3566749
9528H4697586L9013014J617000k1330989j4607577q143975j4774157k0339571
$$ plain form
9604 343835 383310 431467 460249 431123 352899 300202 286963 284292 293675 308585 301188 328353
9592 328353 341693 351179 370403 415353 490091 588376 676756 728549 670543 601749 556207 523437
9580 523437 487373 455100 391765 367421 401309 461353 441597 415845 414584 433438 465671 523509
9568 523509 550137 540912 554972 626345 658060 654047 667705 683387 743046 824806 869963 954000
9556 954000 1049238 1120056 1163184 1228909 1330563 1429692 1524040 1632918 1799997 1981134 2168828
9545 2168828 2357397 2573482 2854215 3194438 3672135 4288589 5094091 6156511 7500031
9536 7500031 9082125 11009534 13832758 17904823 23804475 33307508 51130837 84697586
9528 84697586 123710600 125327600 103996611 89389034 81245059 66470902 46131331
9521D6131331j4942791q265661m784390l278033k329413j614002j234305j099786
9513H582950r60764p60296n53058m25605l39706j38686R9943N154k67092k18039
9503E024801l8643n9246j13352n6263R2688K31823K70686K55982K87387L69090
9493F264953N30933P65614J039598J445335J897223K431289K822191L591666N124890
9484B5913692P306089J0551202J7142029L2698855O3869749P5598838J0524349
9477B43604803l6868035k9764693j7080846k7843824l8640477l0422449j7666382
9470D5318097j0160284o814998m786977l349506k573524k272889j964091j569222
9462A1826606j210863r67564p46203l97554j002j14291o19550o15973m27916m01134
$$ plain form
9521 46131331 31188540 22922879 18138489 14860456 12531043 10917041 9682736 8582950
9513 8582950 7622186 6861890 6308832 5883227 5543521 5404835 5504778 5509932 5242840 5024801
9503 5024801 4986158 4926912 4813560 4757297 4849985 5081808 5352494 5608476 5895863 6264953
9493 6264953 6795886 7561500 8601098 10046433 11943656 14374945 17197136 20788802 25913692
9484 25913692 33219781 43770983 60913012 93611867 157481616 233080454 243604803
9477 243604803 206736768 176972075 159891229 132047405 93406928 62984479 45318097
9470 45318097 35157813 28342815 23555838 20206332 17632808 15359919 13395828 11826606
9462 11826606 10615743 9648179 8901976 8504422 8503420 8389129 7769579 7153606 6725690 6324556
9452F324556n11932m74178k70861j23154r8780o705L5435R4118J79650K35031
9442E383180L64278N60574Q18905J070902J330801J632346K370123L417402M876946
9433B1825457P578624J3763288K6541804L9081111J3731150j8286407j7116946
9426H7118081q463261j1312855j8945454j6203734r333758n182086l412590k458153
9418A1806190j725527j306497j168232r93078q00724o05985m77724m13521l07754
9409D007148o5622k0960k89618l87538k74265k35420k79536l07063k15849j37489
9399A793788j39447j31985r7174n8550p7180j55800j18035k4864j6498l6575q3824
9388H53856q3985n9979m1436R965r280j5604p186n2119o508N5163J7195o7141
$$ plain form
9452 6324556 5812624 5338446 5067585 4944431 4845651 4838946 4874381 4968499 5148149 5383180
9442 5383180 5747458 6308032 7126937 8197839 9528640 11160986 13531109 16948511 21825457
9433 21825457 29404081 43167369 69709173 108790284 122521434 104235027 87118081
9426 87118081 78654820 67341965 48396511 32192777 22859019 17676933 14264343 11806190
9418 11806190 10080663 8774166 7605934 6612856 5812132 5206147 4728423 4314902 4007148
9409 4007148 3941526 3920566 3630948 3243410 2969145 2733725 2454189 2147126 1931277 1793788
9399 1793788 1654341 1522356 1425182 1366632 1289452 1133652 1015617 990753 974255 937680 853856
9388 853856 769871 709892 668456 678421 669141 653537 646351 594232 587724 642887 660082 592941
9376E92941q1776l1655p700l4102p7085l3756k1568j7780j3011k0492q170j9901
9364B25945l422K2957R107J98L7784J0959j8319n3017j6092N523O092r852P186
9351B25049J6632M357K1688k8035R352r408k3819j118k078o458k9263j7598k2124
9338A37177l7879R724M8649L692p619J8644L7435M910k5275m0973N589L6617L3294
9325B23985k172n9745j03425q0061m1121j5481j8374k3391M3554L1093n390J5928
9313c4600N785Q251J9790O334J1925K9036Q233R747K339r988m2333o518L8985
9300D6986k1118k6262j7813K6746J5806J5964q773j49O98k4576r236l2723l910
9287c8360M0431j3358m2094J8017L2278K1535l66L577M1219K8453k0978l35J544
$$ plain form
9376 592941 511165 479510 471810 437708 360623 326867 305299 287519 274508 254016 245846 225945
9364 225945 222523 245480 254587 254785 292569 303528 285209 232192 216100 221623 227715 217863 225049
9351 225049 241681 246038 267726 239691 249043 239635 215816 214698 212620 206162 176899 159301 137177
9338 137177 99298 109022 157671 161363 153744 172388 209823 214733 189458 148485 154074 190691 223985
9325 223985 221813 162068 58643 -21418 -62539 -78020 -96394 -119785 -76231 -45138 -50528 -34600
9313 -34600 -28815 -20564 -774 5560 17485 46521 54754 64501 66840 56852 14519 8001 46986
9300 46986 25868 -394 -18207 8539 24345 40309 31536 31387 32085 7509 -1727 -34450 -38360
9287 -38360 2071 -11287 -53381 -35364 -3086 18449 18083 21660 62879 91332 70354 70019 71563
9274G1563n6364m9133j0280K691j1913O28k2786J6737K7553N3990K5875N244J169
9261E4974J6899k895k063k5191l5392j0266k039P473j5138K1176J6163M20J5939
9248D0060L3750N879j7841o694l659k6377j5759k2193j5636J3898p993j3114J4048
9235b1631Q840L538P183j8079M747M451K3637l995j2451J1290j39l7082K3638
9222f053K847Q14J228K8682q09m426K1022L0431j3081l186Q215K6614R262K746
9208A04306k3717o203J2610M432k363o384p662K275L038q250O895k5470j5277
9195C8230K1451L8366j2930k864P510j3398K0785N837j7570k9297j5415k252J9190
9182E7643J5895k0207K345L245j5832k965K592P253R613L0658p913j6691K0501
$$ plain form
9274 71563 15199 -33934 -44214 -41523 -53436 -52808 -75594 -58857 -31304 22686 48561 53805 54974
9261 54974 71873 68978 66915 41724 6332 -3934 -5973 1500 -13638 7538 23701 24121 40060
9248 40060 73810 79689 61848 55154 51495 25118 9359 -12834 -28470 -14572 -22565 -35679 -21631
9235 -21631 -12791 -9253 -2070 -20149 -15402 -10951 12686 8691 -3760 7530 7391 -29691 -6053
9222 -6053 -3206 -2392 -1164 27518 26709 22283 43305 73736 60655 57469 65684 92298 101560 104306
9208 104306 80589 74386 86996 91428 89065 82681 75019 77294 80332 72082 78977 53507 38230
9195 38230 59681 98047 85117 82253 89763 76365 97150 102987 85417 56120 40705 38453 57643
9182 57643 73538 53331 55676 58921 43089 40124 42716 49969 59582 90240 82327 65636 86137
9169H6137m521J5481N0661M9577L3430k9006m4822o813J6776J4644N826k2631
9157A64739m711j5319j0910J6206K8721N646o5814j1435M884l4667J2216K3035
9145A12591K0792K468q029q043j9516k903m029k5207J3949K7452k6497m3313j6028
9132B3687L427K3684J4829J967q234r36J7829J4100l465J2483M0737K9292k4571
9119A44829j3730J4128J5944J2639J7308k1325m1048j3083O867M4628j562r532
9107A56063j8187j8249k187J690j016k649j7524k6436j412K6933L2567O606o43
9094A35556j441j5800l369N827J013K7608M5097K3530j656L34J4867L2119K5671
9081B89356M8914N1638O6262Q1287R7244J00555J50368J93568K93768M12180O03875
$$ plain form
9169 86137 81616 97097 147758 197335 230765 201759 156937 150124 166900 181544 187370 164739
9157 164739 160028 144709 133799 150005 178726 184372 118558 107123 112007 77340 89556 112591
9145 112591 133383 135851 127822 119779 100263 97360 93331 68124 82073 109525 83028 39715 23687
9132 23687 27114 50798 65627 67594 59360 58424 76253 90353 86888 99371 140108 169400 144829
9119 144829 131099 145227 161171 173810 191118 169793 128745 115662 122529 167157 165595 156063
9107 156063 137876 119627 117440 119130 118114 115465 97941 71505 70093 97026 129593 136199 135556
9094 135556 134115 118315 114946 120773 121786 149394 194491 218021 216365 216699 231566 263685 289356
9081 289356 338270 389908 456170 537457 634701 735256 885624 1079192 1372960 1785140 2389015
9070B389015J039157J968444L577292L747272k60514k219503j380442q51003j546637
9061F463081k017111j467236q38233n23799l41452k01630j49332j13044j01772
9052G09472q0220p5966q5491m5264l1388o5885n4332k6182k5307k3205o402K202
9040A92032J0352L617l288m5295m4060L787Q197K2602k0173q48r658l387k3847
9027I0031j6071k5420K969K5874J7645k0203r080Q579r13j6365j4022r817j1070
9014B2137j3773j1774K9499P977j10j506K3823O875J4863j8326o65j9562j7220
9001B2238J3345l828j2460K8360J3463j5795j5748M310R084p578k8489j0818L4210
8988C0294M0145k0971j9862Q991J530p085J0487j6241j9388j1395J6679j4697
$$ plain form
9070 2389015 3428172 5396616 8973908 12721180 12460666 10241163 8860721 8009718 6463081
9061 6463081 4445970 2978734 2140501 1616702 1275250 1073620 924288 811244 709472
9052 709472 629252 553286 467795 422531 391143 325258 270926 244744 219437 196232 189830 192032
9040 192032 202384 206001 202713 157418 113358 117145 125342 147944 127771 126923 117265 113878 90031
9027 90031 73960 48540 51509 77383 95028 74825 65745 74324 73411 57046 43024 33207 22137
9014 22137 8364 -3410 26089 34066 33956 32450 56273 63148 78011 59685 59020 39458 22238
9001 22238 35583 31755 19295 47655 61118 45323 29575 33885 42969 35391 6902 -3916 30294
8988 30294 70439 49468 29606 38597 40127 33042 43529 27288 7900 -3495 13184 -1513
8976a513r941J2073M097m722M05Q186j2672L877J0580m6472J41O213K6663L5686
8962C2601k9135k717J6898q014k4274l7405J6010K0612j8950n867L000K0840J6603
8949B02q878k3515J2049J0592Q210Q474k0295m3347J2363L3415K3831J382J0626
8936B5109O122K4479k2187q675O900k0394j4763p09K812j7454j9248L8267p280
8923g021J3573O502R524J5147m139k2661l7844Q540K8692K2552r1j4838l0845
8910a2909r823K0K1696J6617j521K43P029k2991R03M0716J3924j1443j4586j1333
8896A6542J1921j7015q394K6757N070j6952N126M3918j0891k5720J9082j3044
8884C6400j9763O06J8902L2555K3123J885l3987k0085L69M729j9138q549J2612
$$ plain form
8976 -1513 -11454 619 4716 -6 399 8585 -4087 -210 10370 -36102 -35961 -29748 -3085 32601
8962 32601 3466 749 17647 9633 -14641 -52046 -36036 -15424 -34374 -40241 -37241 -16401 202
8949 202 -8676 -32191 -20142 -9550 -1340 7134 -13161 -56508 -44145 -10730 13101 14483 25109
8936 25109 31231 55710 33523 24848 31748 11354 -3409 -4118 -1306 -18760 -38008 259 -7021
8923 -7021 6552 13054 22578 37725 33586 10925 -26919 -18379 10313 32865 32774 17936 -12909
8910 -12909 -22732 -22712 -1016 15601 14080 14323 21352 -1639 -736 39980 53904 42461 27875 16542
8896 16542 28463 11448 3054 29811 34881 17929 23055 66973 56082 30362 49444 36400
8884 36400 16637 17243 36145 68700 91823 93708 59721 39636 40005 44734 25596 17047 29659
8871B9659K7171K6624j4969k7069J0812n966J2714k868J603R945j213K3331K7149
8858A16923J7408l7133j8878N491O901J4986J7116L175K790m771k6108m6841M740
8845E5799J2147J3572q530m4968K6655M0821q437j0618j6065J311K2230j0736
8833G3181N002J1806k4482l0384K1423L6182L0623q552l751J0038r442L745j834
8820A13555j0851r618L299n837Q314P6974J9125l0170K562M297j3758j6541r141
8807A32210j2551l454j3605k8261K8504J9187k8777j5488J8520R494L4373M217
8795A44369J1380P366l1510r807k705m8M950j4877J2713j4619j3705j9060j4457
8782E9990N66r695j1867K7296N6714L8801K9326L9844K385k9753k9286l8552k7453
$$ plain form
8871 29659 56830 83454 68485 41416 52228 46262 58976 56108 57711 67656 66443 89774 116923
8858 116923 134331 97198 78320 83811 90712 105698 122814 125989 128779 124008 97900 51059 55799
8845 55799 67946 81518 72988 28020 54675 95496 87059 76441 60376 61687 83917 73181
8833 73181 78183 89989 65507 35123 56546 92728 123351 114799 111048 121086 111644 115389 113555
8820 113555 102704 93086 96385 90548 98862 175836 194961 164791 167353 171650 157892 141351 132210
8807 132210 119659 116205 102600 74339 102843 122030 93253 77765 96285 105779 140152 144369
8795 144369 155749 163115 131605 121798 119093 119045 123995 109118 121831 107212 93507 74447 59990
8782 59990 60556 50861 38994 66290 123004 161805 191131 230975 233360 203607 174321 135769 108316
8769A08316n674j9329l6739j2251J5963p537J314J7014L7501o503P436n959J2006
8756A05558j5862J817L082o369Q584N094Q993j4001J7625j978L610j4492l6040
8743F5621J363L1056o99R453n825m6649m161K1662K6466Q797J8934K2122J1995
8730A60135J2337N4205O0002O1647J3634l7901j4675k0670k2175m6831n2723j4130
8718A52855j288Q206P335l734k4424k4115j738K0148n062R346r007k0551r841
8705I8130l650o688Q822j1033J0471J7429M634J8699K0705J1908J4059r162k9272
8692A45052j2495J7951L7407K3434J0003K740L585J960L2907K6123m088M593J6981
8679C06153N5890O1039O4776J6132K1143K7335J16698K03498L35235K37365l5307
$$ plain form
8769 108316 102642 83313 46574 34323 50286 42749 44063 61077 98578 92075 99511 93552 105558
8756 105558 89696 91513 94595 88226 96810 101904 110897 96896 114521 112543 116153 101661 65621
8743 65621 66984 98040 97341 106794 100969 54320 50159 71821 98287 107084 126018 148140 160135
8730 160135 172472 226677 286679 348326 361960 324059 309384 288714 266539 219708 166985 152855
8718 152855 151567 159773 167108 163374 138950 114835 113097 133245 128183 137529 128522 107971 98130
8705 98130 94480 87792 96614 85581 96052 113481 118115 136814 157519 169427 183486 174324 145052
8692 145052 132557 150508 187915 211349 221352 224092 227677 229637 262544 288667 284579 289172 306153
8679 306153 362043 423082 487858 503990 525133 552468 669166 872664 1207899 1445264 1409957
8668A409957j23463r0616j17098j49333j86892j72586j26744q1210j3999k2499
8658C25517j4344P616n232J9343J1450J1289R677n572m246l2611m5948l0268M026
8645B50697K2659J9798j1152l6138p865Q714K1920K4368K2293r981j0012J7550
8633C12851O3356M3018O4985J11306J44232L45763O20844O73870J11250l08801
8623B182674k39869j59369k41145l51304k95624j89649j44239p0585n9547m0967
8613C90376l0361j3201q065N0176O3557K2267o6372m2671j5324p8569l1675j514
8601B38624m1039k2186o781k781K882q445r937L736m74j0062j3342K0905K1145
8588A72245J6341k565K6726P3711J72095K48910K76895J61032p1173j27146j11725
$$ plain form
8668 1409957 1286494 1195878 1078780 929447 742555 569969 443225 362015 348016 325517
8658 325517 311173 318789 313557 332900 344350 355639 365316 359744 355498 322887 276939 246671 250697
8645 250697 273356 293154 282002 245864 237999 246713 268633 293001 315294 305313 295301 312851
8633 312851 376207 419225 484210 595516 739748 1085511 1706355 2380225 2491475 2182674
8623 2182674 1942805 1783436 1542291 1190987 895363 705714 561475 490890 431343 390376
8613 390376 360015 346814 338749 388925 452482 474749 408377 365706 350382 271813 240138 238624
8601 238624 197585 175399 168618 165837 168719 160274 150337 154073 153599 143537 130195 151100 172245
8588 172245 188586 186021 212747 286458 458553 707463 984358 1145390 1074217 947071 835346
8577H35346j12266j01235o4011l8334o7877n5766m6417m3422m6224n8008m0166
8566A61620K6283j7178q221J6011j8357j7081l4465k1048k9235l8723j3079K9344
8554C5871K6668r934j1780L192j2822p773k890k26N755J4327j1195L104J9825
8541E2122M699l2786j8581j434J4K6273J3585k2567l352K4107J1705Q69K8617
8528H3271L2684j3757j5311j7236k5460P034j2953J4742N408l5691k0996q486
8516f751Q609O184n485K9836j81j306m846j2130j1857l491J8377J4368j651k7967
8502A709j5445k3355j1407J2753K8306P211J7857k2954k5325l216L0880K6800
8490B3814k190K038j6870J6272J7254k2489k1777P276q32k906j2634P683L565
$$ plain form
8577 835346 723080 621845 557834 519500 451623 395857 349440 306018 259794 201786 161620
8566 161620 187903 170725 162504 178515 160158 143077 108612 87564 58329 19606 6527 35871
8554 35871 62539 52605 40825 44017 31195 23422 20532 20306 26061 40388 29193 32297 52122
8541 52122 56821 24035 5454 4020 4034 30307 43892 21325 17973 42080 53785 54654 83271
8528 83271 115955 102198 86887 69651 44191 51225 38272 53014 58422 22731 1735 -6751
8516 -6751 1858 8042 2557 32393 32212 30906 26060 13930 2073 -1418 16959 31327 29676 1709
8502 1709 -13736 -37091 -48498 -35745 -7439 -228 17629 -5325 -30650 -33866 -2986 23814
8490 23814 21624 23662 6792 23064 40318 17829 -3948 3328 2496 -410 -13044 -5361 -1796
8477a796l0393r467N1018M3152j7914k1313J0751p511k0504k538j2555j1209o718
8464c6997k2677K4227M5682P187j0152m343o340k5634j4491L731K3604k995L0783
8451A1585K930k2093N663O960K4751J413j0091k3066M874K3664N567J6509R519
8438E8185j2686m650L7318J2607j3536l6660q192j569J6511M264q335k1620j0413
8425A1224J4439o629J023k4548j4680L2855k002j7167k326K1714R56R63j6086
8412b64k9536m153J1965J9210L455q517Q952m168j5770O948K9293K5374J2002
8399E4791K992k2411j6656j3757r47J5624J6995j6561k0287L200l0430k3428j4382
8386f5257K3413N1672l147j3346l0479J9010L7886P277J939k0306j9270L199j0387
$$ plain form
8477 -1796 -32189 -41656 9362 52514 34600 13287 24038 16527 -3977 -6515 -19070 -30279 -36997
8464 -36997 -59674 -35447 10235 17422 7270 2927 -3413 -29047 -43538 -39807 -16203 -19198 11585
8451 11585 14515 -7578 -1915 5045 29796 31209 21118 -1948 2926 26590 32157 48666 58185
8438 58185 45499 40849 78167 90774 77238 40578 32386 30817 47328 51592 43257 21637 11224
8425 11224 25663 19034 20057 -4491 -19171 13684 11682 -5485 -7811 13903 14859 15822 -264
8412 -264 -29800 -33953 -21988 -2778 677 -7840 1112 -3056 -18826 -11878 17415 42789 54791
8399 54791 57783 35372 18716 4959 4012 19636 36631 20070 -217 2983 -27447 -50875 -65257
8386 -65257 -41844 9828 6681 -6665 -37144 -18134 19752 27029 28968 8662 -10608 -7409 -17796
8373a7796O900K374j5717L4791n187k191p274j4662J2793K3047l071l9663l4553
8360f0209K9739l472M46J806N541M427L7999k0636k4837Q402M04q760L724J1186
8346a4240l056j4201j2743q340K72R351K5929J4348n741L468K8468J3404J0932
8333D7851l8767n061J922m194K246k5359l9922J3818K8469j874L830n58q146N740
8319b0005K2493k353q412q694J2299l2277k4834K2438P057q338Q457J8344k1923
8306c5748q985J9418j640l419L697k568o72L1461L0506j1236j1355J0939k2979
8293b581K6496p608k7926n309J986J4368J2994L4334j5560m021M764M357N709
8280D2003l2249k4161L517P257r219J1480K64l312k528n810K0779j612k494P00
$$ plain form
8373 -17796 -10896 -8522 -24239 10552 5365 3174 -4100 -18762 -5969 17078 14007 -25656 -60209
8360 -60209 -30470 -33942 -33496 -31690 -26149 -21722 16277 -4359 -29196 -20794 -20390 -29150 -25426 -14240
8346 -14240 -17296 -31497 -44240 -52580 -52308 -42957 -17028 -2680 -8421 -4953 23515 36919 47851
8333 47851 9084 4023 5945 1751 3997 -21362 -61284 -47466 -18997 -20871 -17041 -17599 -25745 -20005
8319 -20005 2488 135 -8277 -16971 -4672 -36949 -61783 -39345 -32288 -40626 -32169 -13825 -35748
8306 -35748 -44733 -25315 -26955 -30374 -26677 -29245 -29917 1544 32050 20814 9459 20398 -2581
8293 -2581 23915 16307 -11619 -16928 -14942 -574 12420 46754 31194 27173 31937 36294 42003
8280 42003 9754 -14407 -10890 -3633 -12852 -1372 -1108 -4420 -6948 -12758 8021 6409 3915 4615
8266D615K8012J7962k4154l0483j0716l804J7501L723k6681k9161k922K761k068
8253e5415J1389L904K3999O710l0172J2855K9457k5388k2920j2032q61Q976l379
8240e2877K5616J8498Q737n4048O769M0904K9169r011k5354K46o220j8858k3717
8227f0146o665J2406Q853J4167J7973J6385K652j1665M430L1036J454l9234k0178
8214b8532M217L0065K0213k0003r254j2100M59j6520J1073j5606P659K4537P569
8201C777l0458j30J6546J4713J959L624J1966k958j9695j2145J4472K5083J482
8188B8236k2000l387k0153O791R292n795J4530o369K216P238R491J2151L091o455
8174B8877l0626j1106R007L033j3295J1189L1244O501k1535m575K441K4797o576
$$ plain form
8266 4615 32627 50589 26435 -4048 -14764 -18568 -1067 2656 -24025 -53186 -56108 -53347 -55415
8253 -55415 -44026 -40122 -16123 -9413 -39585 -26730 2727 -22661 -45581 -57613 -58474 -49498 -52877
8240 -52877 -27261 -8763 -26 -54074 -47305 -6401 22768 13757 -11597 -11351 -17571 -36429 -60146
8227 -60146 -66811 -54405 -45552 -31385 -13412 2973 5625 -6040 -1610 29426 30880 -8354 -28532
8214 -28532 -24315 5750 25963 5960 -3294 -15394 -14935 -31455 -20382 -35988 -28329 -3792 3777
8201 3777 -26681 -26811 -10265 4448 6407 10031 21997 19039 -656 -12801 1671 26754 28236
8188 28236 6236 2849 -17304 -10513 -1221 -7016 7514 1145 3361 10599 20090 32241 35332 28877
8174 28877 -1749 -12855 -3848 -815 -14110 -2921 28323 34824 13289 8714 11155 35952 29376
8161B9376m5275j9020k842Q702M2724L0414j3651p312J9667j735k1870j4951l5162
8148c0935o978k5762J7247K8464J7432J5620L412j7927k9091j1022K0340L1843
8136A2643L3895k81Q763L638K1801R388j1311P385k51m001j287r607j3029j6453
8122D1293o248J3800p995O04l3822k239M0436P578J2277j1275k225Q138k2598
8109C7724k6989K407k5043J663N5128K7823j666K1448L8460K5084N7548Q5494
8097B99081J46189J40556q875o1489k9674o1387q4898m4543n5745m1053l0837
8086A67325L2263K4176K5419k5466n1154k6707k2252k8391k2257p563J9483N928
8074I0804K7831K3945M4984M1944N456R853L640l513k465k0294j7126l903j432
$$ plain form
8161 29376 -15899 -34919 -37761 -29059 13665 44079 30428 23116 42783 41048 19178 4227 -30935
8148 -30935 -37913 -63675 -46428 -17964 -532 15088 18500 573 -28518 -39540 -19200 12643
8136 12643 46538 46257 55020 58658 80459 89847 78536 85921 85670 81669 80382 70775 57746 41293
8122 41293 35045 48845 40850 41454 7632 5393 45829 53407 65684 54409 52184 60322 37724
8109 37724 10735 13142 -11901 -10238 44890 72713 71047 92495 130955 156039 213587 299081
8097 299081 445270 585826 576951 515462 485788 424401 339503 294960 239215 198162 167325
8086 167325 199588 223764 249183 223717 172563 145856 123604 95213 72956 65393 84876 90804
8074 90804 118635 142580 187564 229508 234964 244817 248457 244944 242479 222185 205059 201156 199724
8061A99724O172M2772M1564K3709K5522P0849J39401R3633k0100r1458l0096o1196
8049D40496j02989j01348o7985l0067N946J0668P866J2799J4044J1178k2319j7486
8037A60803K0426q348j59J2186K2053K2598L1799M5337M5576O3235N7704K1961
8025D95171m2234n7490l6489o3910p1616n6146K16j3620l9306j4884M426J6814
8013A20932Q038L206l9698k4943P687K4507J4746M618J0080K6377m339k7218j2945
8000A11048k1785k4150J9515K4181k458k2764p914K4644L783J2422J305j2781
7988A05046j3614L070M4523K0823J3525P505R899K2445j5630j048k8045k2992
7976A45507m0376k0105p220j7238R777j5688K687k548J5346J4199k680j6606j0203
$$ plain form
8061 199724 205896 248668 290232 313941 339463 410312 549713 643346 623246 531788 501692 440496
8049 440496 337507 236159 168174 138107 144053 154721 162587 175386 189430 200608 178289 160803
8037 160803 181229 172881 172722 184908 206961 229559 261358 306695 352271 415506 473210 495171
8025 495171 452937 395447 358958 295048 223432 167286 167502 153882 114576 99692 104118 120932
8013 120932 128970 132176 92478 67535 75222 99729 114475 119093 129173 155550 151211 123993 111048
8000 111048 89263 65113 84628 108809 106351 83587 75673 100317 104100 116522 117827 105046
7988 105046 91432 94502 139025 159848 173373 180878 190777 213222 197592 196544 168499 145507
7976 145507 105131 85026 77806 60568 70345 54657 57344 54796 70142 84341 81661 65055 54852
7963E4852j4330q009o440k516J0978O896r386j7255j742K4296J3467m0078k9195
7950a8462j3001l3250L5108N0928j0516j4948J0034L7402Q471k2792R76O536k1380
7937A5106k0119r620J0657K1311K5820J5813l1665l9606q025k233j985J0374P647
7924f525q748J185J3442p663q432J0785P181j0872j292L4927L23k201o376q639
7910G095O386j578j9220j2050K3815Q978k0229P579J9540J3526R013P036j3371
7897C6520K864J4479Q75O658j8337q600K418J14k1826j1449J082R172k557J4612
7883B6025M964k1333j8890K6623l1318m1414l872J3306K3119M6238J2244o070
7871B9622l0114j5774r465J0655J179M120j0992k967K4955J8125q632j7610k3815
$$ plain form
7963 54852 40522 32513 26073 23557 34535 41431 32045 14790 13048 37344 50811 10733 -18462
7950 -18462 -31463 -64713 -29605 21323 10807 -4141 5893 43295 51766 28974 29950 36486 15106
7937 15106 -5013 -14633 -3976 17335 43155 58968 27303 -12303 -20328 -22561 -24546 -14172 -6525
7924 -6525 -15273 -14088 -646 -8309 -16741 -5956 1225 -9647 -10939 23988 24311 22110 15734 7095
7910 7095 13481 11903 -7317 -19367 4448 13426 -6803 776 20316 33842 42855 49891 36520
7897 36520 39384 53863 54738 61396 43059 34459 36877 36991 15165 3716 4798 13970 11413 26025
7883 26025 30989 9656 -9234 17389 -13929 -55343 -59215 -45909 -22790 23448 35692 29622
7871 29622 -492 -16266 -25731 -15076 -13897 -9777 -20769 -23736 1219 19344 10712 -6898 -30713
7858c0713J904K7381J23j8387l40J6694p709o197J73K1325k858l2730j8223M148
7844d5409N5389K9505j9455o446j1707j5319Q93L2608j2476k0355J2031J7092
7832A6351K2118k454j1714j6885n570j0588O53J504K9976K4394p006l5582M825
7819A0022Q070J5869m760m734k3045j3844J5764J4609k0647j0612n447J0499J4853
7806F597q397l1988L7512J3940r177j6694j7841K7948J4758P422O657k6695l1442
7793b7400O284K1946Q30j2170q988Q24J2390o522j8445J0907J4875O603J6734
7780A7868K7638J541J129k3955j8654r886k131J6434L997k7522l2532P97J0197
7767c5079o778n294K2472K9655Q740j0040k8853j5296p802K9794L2534K418k1540
$$ plain form
7858 -30713 -28809 -1428 -1305 -19692 -20032 -3338 -11047 -17244 -17071 4254 1396 -31334 -49557 -45409
7844 -45409 9980 39485 20030 13584 1877 -13442 -12549 20059 7583 -12772 -741 16351
7832 16351 38469 36015 24301 7416 1846 -8742 -8089 -6585 23391 47785 40779 5197 10022
7819 10022 18092 33961 29201 24467 1422 -12422 3342 17951 -2696 -13308 -18755 -8256 6597
7806 6597 -1800 -33788 3724 17664 8487 -8207 -26048 1900 16658 24080 30737 4042 -27400
7793 -27400 -21116 830 1660 -10510 -19498 -18674 -6284 -12806 -31251 -20344 -5469 1134 17868
7780 17868 45506 47047 48176 24221 5567 -4319 -6450 9984 13981 -13541 -46073 -45276 -35079
7767 -35079 -41857 -47151 -24679 4976 13716 3676 -25177 -40473 -48275 -18481 14053 16471 -5069
7754e069M846j81q30K4927J0776R709j4150m1602Q258J2314q673j8013Q89j5713
7740c2512P567M0101K4772l5054m727j2257J7354N4400J2275r650k5175k1994
7728A5100N292L878j2105m1794M772K2720m92j0483p375P537R193j2518O619j1632
7714b1288K3400O27l378k0933O885K577J9412N158m591k481k8328K1213R476j4276
7700f527o593j542J7087J1716P240o292n075J2756j2938k906L21k5037J5963J8515
7686A6688j0413p131Q369O702Q098o211k5342p242P572P660o182O927J965J4642
7672A6102q630l2329K1264K3374j2998J706m047j8483k6088L773J4618K5560J7206
7659B1028l5570J8121K019o4346k7114K3161L6872J6961j5201j4779p279R729
$$ plain form
7754 -5069 -223 -404 -1234 23693 34469 44178 30028 -11574 -3316 8998 325 -17688 -16799 -32512
7740 -32512 -24945 15156 39928 4874 147 -12110 5244 59644 71919 62269 37094 15100
7728 15100 20392 24270 12165 -29629 -24857 -2137 -2629 -13112 -20487 -12950 -3757 -16275 -9656 -21288
7714 -21288 2112 2739 -639 -21572 -14687 -12110 7302 12460 7869 5388 -22940 -1727 7749 -6527
7700 -6527 -13120 -14662 2425 14141 21381 15089 10014 22770 9832 6926 7247 -17790 -1827 16688
7686 16688 6275 -856 7513 14215 22313 16102 -9240 -16482 -8910 -1250 -7432 -505 1460 16102
7672 16102 7472 -24857 -3593 19781 6783 8489 4442 -14041 -40129 -36356 -21738 3822 21028
7659 21028 -14542 3579 5598 -58748 -85862 -62701 -25829 -8868 -24069 -38848 -46127 -36398
7647c6398J3822q425J907P191Q175J6492J0084j2997M420K3575p914k6822q123
7634a5013j8657L677L1690N234l166j053j0837k0560q164J2565q466r235J3862
7621b8123J9269p921K538J7401K0070L904r321o790L319j7587k8339L6800o782
7608a562m31J5214J0492l1479l4701J1659K4755K3704j1089q240J6193p034O390
7595A3871K4127j0757k1995r741K61r660j3762J1067l145J8846J1947l1563j7547
7582c8051L439j0116M902R888q469Q16N61k9769J9530J8213O16J8464k707k633
7568a5316K0272o268j0518J8648m555l584K2116m918j228p571m815M0433N981
7555D8677K479j8035k135p678J7027l6546j8753J2947K3438k953P084j701k2497
$$ plain form
7647 -36398 -22576 -31001 -29094 -21903 -13728 2764 12848 -149 4271 27846 19932 -6890 -15013
7634 -15013 -33670 -29993 1697 6931 3765 2712 -8125 -28685 -36849 -24284 -32750 -41985 -28123
7621 -28123 -8854 -16775 -14237 3164 23234 27138 17817 11027 14346 -3241 -31580 5220 -1562
7608 -1562 -1993 13221 23713 -7766 -42467 -30808 -6053 17651 6562 -1678 14515 7481 13871
7595 13871 37998 27241 5246 -4495 -4234 -13894 -27656 -16589 -19734 -888 11059 -20504 -38051
7582 -38051 -34612 -44728 -39826 -29938 -38407 -37591 -37030 -66799 -47269 -29056 -28440 -9976 -12683 -15316
7568 -15316 4956 -1312 -11830 6818 2263 -1321 20795 15877 14649 7078 2263 42696 48677
7555 48677 51156 33121 30986 23308 40335 3789 -14964 -2017 21421 18468 25552 23851 1354
7542A354k2662L8407M0486k6240k0376r878J8200K465o932q737p530r894o272
7529a7609p754K2549K5380Q602O296J294j7213j2139k3474p182K7857O95N956
7516A3258N404m621l3556j1749K1432J3665j9796l865n702J2075J8096K5739J6268
7503D6648q839k3654J0643k0325k0401k1648K8937J0516N412Q935K427l789J936
7490A6798J639J591k0582j623O641k3410j1935J1372Q664K591J6530O10l0650
7477b1764K222K3179J3285j0176q84L192K4252k9022R765p71J2879k379M912n
7463B8685k107k6655j9338J6880K872m284L75k3238Q410M322K7571j9842l0311
7450c6660L206j74M904Q006M4695k361k2016j2216O776R166P851j4990j975J966
$$ plain form
7542 1354 -21308 17099 57585 31345 10969 1091 19291 21756 14824 6087 -1443 -11337 -17609
7529 -17609 -25363 -2814 22566 31168 37464 38758 21545 9406 -14068 -21250 6607 7302 13258
7516 13258 18662 14041 -19515 -31264 -9832 3833 -15963 -19828 -25530 -13455 4641 30380 46648
7503 46648 37809 14155 24798 4473 -15928 -37576 -8639 1877 7289 16224 18651 14862 16798
7490 16798 18437 20028 -554 -2177 4464 -18946 -30881 -19509 -10845 -8254 8276 8886 -21764
7477 -21764 -19542 3637 16922 6746 5862 9054 33306 4284 14049 13278 26157 23778 28690 28685
7463 28685 26578 -77 -19415 -2535 337 -3947 -3572 -26810 -18400 -14078 13493 -6349 -36660
7450 -36660 -33454 -33628 -28724 -20718 23977 21616 -400 -12616 -5840 3326 11177 -3813 -5788 -3822
7436c822j0031k1515q322N3962J0761j2758m667j4115P908J3174l179j3936P116
7423E76J432N175k4034k5720Q863J7469Q263J3393K2792J775k0331j0143J0443
7410I953J4559K933L814n35l9809Q322j1320K3906J5072L594l302j0166l2511
7397a5490j0416K1637l888l0051k2529K2479l74N6R933o844k4653K3298J4725
7384b2117o439O12n668k7728J0139K7475p887m753j2575K4154J7662L200m346
7371h271J7547L6086Q118l0207k4636k0828j8664J3326p91J9917j2805Q492K8695
7358A5979K207k1050k2327J7815j1553j292J3399K1669p222M09J307R546J522
7345B0409q751J102J0950k764q882j069K3481K433k8631l769J2693j067n327J2831
$$ plain form
7436 -3822 -13853 -35368 -43690 10272 21033 8275 3608 -10507 -2599 10575 7396 -6540 576
7423 576 2008 7183 -16851 -42571 -33708 -16239 -7976 5417 28209 29984 9653 -490 9953
7410 9953 24512 27445 31259 30724 -9085 -763 -12083 11823 26895 30489 27187 17021 -15490
7397 -15490 -25906 -4269 -8157 -38208 -60737 -38258 -38632 -38576 -28643 -35487 -60140 -36842 -22117
7384 -22117 -28556 -27944 -33612 -61340 -51201 -23726 -31613 -36366 -48941 -24787 -7125 -3925 -8271
7371 -8271 9276 45362 53480 23273 -1363 -22191 -40855 -27529 -28320 -8403 -21208 -12716 15979
7358 15979 18186 -2864 -25191 -7376 -18929 -20221 -6822 14847 7625 8034 9341 18887 20409
7345 20409 11658 12760 23710 20946 12064 10995 34476 36909 8278 4509 17202 16135 10808 23639
7331B3639j8575k3024J3920j4861j0076J5134J9123k1195n057J9494K4112J1019
7319C3653O59j7948k7343j2621p310K0781M4059N461l0604j8381N746M8800J9068
7306F4020j7718j9057k6100K3204K2339k5423k124p494l299r9P61K5482J4479
7293D8971P79K622j8108L617J8786k5078k1684L2158p471M67j572k1772l8829
7280b7114J4366J1569J2730J3133n907J1191j5219j0081p756J6756L6142k008
7268D7802p857j532n922j5050l8311k0838J061L0617J3849J5390o201j8878m694
7255a0564r954J4744J4072k4175l7524L5228K6790P357k0259J7713M030j4201
7243C257O410K5751o966J1719J679k6353m6989M777j2760P479L418j818k6593
$$ plain form
7331 23639 5064 -17960 -4040 -18901 -28977 -13843 5280 -15915 -20972 -1478 22634 33653
7319 33653 34312 16364 -10979 -23600 -30910 -10129 33930 39391 8787 -9594 -3848 44952 64020
7306 64020 46302 27245 1145 24349 46688 21265 19141 11647 8348 8249 9010 34492 48971
7293 48971 49750 52372 34264 37881 56667 31589 9905 42063 34592 35059 33487 11715 -27114
7280 -27114 -12748 -1179 11551 24684 18777 29968 14749 4668 -3088 13668 49810 47802
7268 47802 39945 38413 32491 17441 -20870 -41708 -40647 -10030 3819 19209 13008 -5870 -10564
7255 -10564 -20518 -5774 8298 -15877 -53401 -18173 8617 15974 -4285 13428 17458 3257
7243 3257 9667 35418 28452 40171 41850 15497 -31492 -26715 -39475 -31996 -28578 -30396 -56989
7230e6989n33J0510J6471J2666k4505j2351M792K5349J2878l6914J3242K3508
7218a1876k0787P540P227J5801K3905J1383r603j3116j2006J0948R211j3504k0952
7205a5829j3817j3693o728J7278R850j662J741j3053R087J3916j6253j0679k831
7192d2673J4968j1641n273K3384J0784j0646n91R851l868K932N286k2898P423
7179b2962J3153l3700j7366o040J1846J8750L0384l909m0771P68K0280k1955j6782
7166f8304K0493J6856J6811q053p727l1192J1153L4368J9037q120k0490J140p634
7153c1662j3232L757R889K206J8470J2901K26j0729j9802j8534j2531K002L3765
7140b3274J1158J5809k4743k8950q736K1226N398K802J6444k635j1558K3663p46
$$ plain form
7230 -56989 -57522 -47012 -30541 -17875 -42380 -54731 -49939 -24590 -11712 -48626 -35384 -11876
7218 -11876 -32663 -25123 -17896 -2095 21810 33193 23590 10474 -1532 9416 18627 5123 -15829
7205 -15829 -29646 -43339 -50067 -32789 -22939 -24601 -22860 -35913 -26826 -12910 -29163 -39842 -42673
7192 -42673 -27705 -39346 -44619 -21235 -10451 -21097 -21688 -11837 -15705 -12773 -7487 -30385 -22962
7179 -22962 -9809 -43509 -60875 -66915 -55069 -36319 -5935 -9844 -50615 -49847 -29567 -51522 -68304
7166 -68304 -47811 -30955 -14144 -22197 -29924 -61116 -49963 -15595 3442 -4678 -25168 -24028 -31662
7153 -31662 -44894 -41137 -31248 -29042 -10572 2329 2555 -8174 -27976 -46510 -59041 -57039 -23274
7140 -23274 -12116 3693 -21050 -50000 -58736 -37510 -32112 -29310 -12866 -15501 -27059 -3396 -4142
7127d142J126K2399j703l2270q285K2107K5535j2257k2212J3628j4367N809K694
7114a938j8684k0726L558J2596l169j1238o601K1240j6370J5892K0590l265K839
7101e276k415J0058j4273k973O160l535K3354M131j4507J129r409N517r53J4976
7087A1984Q065k4073l330j7451j611L0058k4932r945L5548n130R603o263M643
7074G166K273j501j3674J2801K5149j8753j5056j1266j132k1995J5670J0899n933
7061a5352l3576j9473J2922k32l48j1492L7241K3584J3793K1678k0563j2719J4079
7048I542Q903j6488N61K3147r225j3176J1188N95r869j6084q897R291j315J4288
7034B461J8202m006l6122n663J0996J6143j0590j0860J4186j7320l527j2058L720
$$ plain form
7127 -4142 -3016 19383 17680 -14590 -22875 -768 24767 12510 -9702 3926 -10441 -4632 -1938
7114 -1938 -20622 -41348 -37790 -25194 -28363 -39601 -46202 -24962 -41332 -25440 -4850 -8115 -5276
7101 -5276 -7691 2367 -11906 -14879 -8719 -12254 11100 15231 724 1853 -7556 -2039 -2992 11984
7087 11984 20049 -4024 -7354 -24805 -26416 3642 -21290 -31235 4313 -817 8786 2523 7166
7074 7166 9439 7938 -5736 7065 32214 13461 -1595 -12861 -13993 -35988 -20318 -9419 -15352
7061 -15352 -48928 -68401 -55479 -55711 -56059 -67551 -30310 -6726 7067 28745 8182 -4537 9542
7048 9542 18445 1957 2518 25665 16440 3264 14452 15047 5178 -10906 -19803 -10512 -11827 2461
7034 2461 20663 16657 -19465 -25128 -14132 2011 -8579 -19439 -5253 -22573 -26100 -38158 -34438
7021c4438L3519j4575j5423J1273K4552j3170Q26m193o432j3371j51K0533J5543
7008D493K3670p85j4000j4167j3939k3924M678L8963J2779k7168p981J8884P920
6995I423q754l690J036N663M762q982k0915j4550k0992m157J1797J2147K2718
6982a4494j4070j961j4069K6437J3146k2102J6549l213M728l606k4696O333K004
6969b9014j1475J3608j9626P327K9985l406K580J8898P79j1840j3739o696O557
6956a6062p981J9027K5883j9185l5969o730l076O326J6223k1249j0005L323L2174
6943a7301L0658j516R125j266j0247k8495j3408j844r948O928O218O65r304k4726
6929f4461n684M133q27K7921J9147J6174o552K4568K2424J0772o049j9884J5919
$$ plain form
7021 -34438 -919 -15494 -30917 -19644 4908 -8262 -7436 -11629 -18061 -31432 -31583 -11050 4493
7008 4493 28163 27378 13378 -789 -14728 -38652 -33974 4989 17768 -9400 -17381 1503 9423
6995 9423 669 -3021 -1985 3678 8440 -542 -21457 -36007 -56999 -61156 -49359 -37212 -14494
6982 -14494 -28564 -30525 -44594 -18157 -5011 -27113 -10564 -13777 -9049 -12655 -37351 -31018 -29014
6969 -29014 -40489 -26881 -46507 -39180 -9195 -12601 -10021 8877 9656 -2184 -15923 -22619 -16062
6956 -16062 -24043 -5016 20867 1682 -34287 -41017 -44093 -37767 -21544 -42793 -52798 -49475 -17301
6943 -17301 13357 11841 20966 19700 9453 -19042 -32450 -34294 -44242 -37314 -31096 -30431 -39735 -64461
6929 -64461 -70145 -66012 -66839 -38918 -19771 -3597 -10149 14419 36843 47615 41566 21682 37601
6916C7601k2773j8853j5543K153L0480J4286j3278l513j8283p671M565j4827k1237
6903d6893J103J3373K5783J5220l130l8913q208P131Q879J6654k1221j4581L5584
6890i219J6721j6282j3541k7328j4472J5285J2243J771K0270O942j04K0042j6759
6877d431j7056k5564J3663J7520k7846k8694J4356M5684J3150j2538K634Q562
6865e60j6227l632n755L1614J9188j298j3609k688o553J6195J9559j2866l197
6852B0171k88k818j2125J5394J8728R594k6083k7063j2234p156O830n998J8603
6839d445j1805J2646J6760J2985O493j6199m4365m5829J348K4497K0577j0468
6827c7805O060j3171L864M540k658K108n532K0103J9882L665o667m3538R922L8822
$$ plain form
6916 37601 14828 -4025 -19568 -17415 13065 27351 14073 10560 -7723 -15394 -10829 -25656 -46893
6903 -46893 -45790 -32417 -6634 8586 5456 -33457 -41665 -34534 -25655 -9001 -30222 -44803 -9219
6890 -9219 7502 -8780 -22321 -49649 -64121 -48836 -36593 -34822 -14552 -7610 -7714 12328 -4431
6877 -4431 -21487 -47051 -33388 -15868 -43714 -72408 -58052 -12368 782 -11756 -9122 -560
6865 -560 -16787 -20419 -26174 5440 24628 23330 9721 7033 480 16675 36234 23368 20171
6852 20171 19883 17065 4940 20334 39062 48656 22573 -4490 -16724 -23880 -17050 -23048 -4445
6839 -4445 -16250 -3604 13156 26141 32634 16435 -27930 -73759 -72411 -47914 -27337 -37805
6827 -37805 -31745 -44916 -41052 -36512 -39170 -37062 -42594 -22491 -2609 1056 -5611 -49149 -39227 -405
6813d05P258J9897L284p705o795j5066j1131j6669j7396R733J6120L139J0829
6800d907J0200k7378L6380L7919J3948o367j5131M920p599r063k8122J424P151
6787A3375m316K6327j6608l2722m0972j6667l095J0465P562M428N96J0203L1473
6774i951K0703j5692N954K1453J0224n304k6488j5513J2336J0179J322j2691r861
6761a3329N958k814k2446j6958R11k6421j0358L6730L4535M5569L49k5230n625
6748H71j5135J2J482m172l195K4300K7944J151o233J1603q178R9l0006p525J6777
6733I795k49q285q011j1401j8443r057J3956R792Q643J5301L059J8447M206k2278
6719E475k2102m947K9600j2868j7483J8721J5520J98K57L0847O254k1169j1459
$$ plain form
6813 -405 6853 26750 30034 22329 15534 468 -10663 -27332 -44728 -34995 -18875 -15736 -4907
6800 -4907 5293 -22085 14295 52214 66162 59795 44664 49584 41985 32922 4800 6224 13375
6787 13375 9059 35386 18778 -13944 -54916 -71583 -74678 -64213 -56651 -52223 -51627 -41424 -9951
6774 -9951 10752 -4940 1014 22467 32691 27387 899 -14614 -2278 7901 9223 -3468 -13329
6761 -13329 -7371 -10185 -32631 -49589 -48678 -75099 -85457 -48727 -14192 31377 31726 6496 871
6748 871 -14264 -14252 -12770 -16942 -20137 4163 32107 33258 27025 38628 30450 30549 543 -6982 9795
6733 9795 9546 1261 -6750 -18151 -36594 -45651 -31695 -21903 -13260 2041 5100 23547 27753 5475
6719 5475 -16627 -21574 8026 -4842 -22325 -3604 11916 12114 12371 43218 49472 28303 16844
$$ [...]
##END NTUPLES=NMR SPECTRUM
##END=
