##TITLE=Analysis number 319309
Compound Code tl 00154
Project Code adrs
Chemist Name avocado
##JCAMPDX= 6.0         $$ Bruker NMR JCAMP-DX V2.0
##DATA TYPE= NMR SPECTRUM
##DATA CLASS= NTUPLES
##ORIGIN= Bruker BioSpin GmbH
##OWNER= nmr
$$ XWIN-NMR		Version 3.5
$$ Wed May 10 13:47:46 2006 GMT Daylight Time (UT+1h)  MAYBRIDGE\nmr@NMR_250MHZ
##.OBSERVE FREQUENCY= 250.131544655141
##.OBSERVE NUCLEUS= ^1H
##.ACQUISITION MODE= SIMULTANEOUS (DQD)
##.ACQUISITION SCHEME= undefined
##.AVERAGES= 16
##.DIGITISER RES= 18
##SPECTROMETER/DATA SYSTEM= dpx250
##.PULSE SEQUENCE= zg30
##.SOLVENT NAME= CDCl3
##.SHIFT REFERENCE= (INTERNAL, CDCl3, 0, 16.522)
##AUDIT TRAIL= $$ (NUMBER, WHEN, WHO, WHERE, WHAT)
$$ ##TITLE= Audit trail, XWIN-NMR		Version 3.5
$$ ##JCAMPDX= 5.01
$$ ##ORIGIN= Bruker BioSpin GmbH
$$ ##OWNER= nmr
$$ C:\u/data/dgb/nmr/ADRS/4040/pdata/1/auditp.txt
$$ ##AUDIT TRAIL=  $$ (NUMBER, WHEN, WHO, WHERE, WHAT)
(   1,<2006-05-10 13:47:11.39 +100>,<MAYBRIDGE\nmr>,<NMR_250MHZ>,
      <created by zg, POWCHK disabled, PULCHK disabled
       configuration hash MD5:
       84 BC 41 DB A1 6E 1D 46 DA 25 12 A5 C1 ED C5 3A
       data hash MD5: 64K
       3D D7 87 C5 73 BC B1 25 23 7E 01 4B 76 AE 72 CB>)
(   2,<2006-05-10 13:47:27.84 +100>,<MAYBRIDGE\nmr>,<NMR_250MHZ>,
      <Start of raw data processing
       ef LB = 0.3 FT_mod = 6 PKNL = 1 SI = 32K 
       data hash MD5: 32K
       7C C2 D1 B7 C3 E9 7A 2B B7 FF 7C E4 48 4A B8 F2>)
(   3,<2006-05-10 13:47:32.08 +100>,<MAYBRIDGE\nmr>,<NMR_250MHZ>,
      <apk 
       data hash MD5: 32K
       66 98 3B AB 47 04 C1 F7 4D BF 77 73 61 91 DF 14>)
(   4,<2006-05-10 13:47:33.54 +100>,<MAYBRIDGE\nmr>,<NMR_250MHZ>,
      <abs ABSG = 5 
       data hash MD5: 32K
       6A 2F 7F CE 84 0A AE BF 0B FA F3 48 68 A3 1B 6C>)
$$ ##END=
$$ 
$$ hash MD5
$$ 51 06 BB C7 49 8C 6B 66 14 FE E4 D4 34 97 1D E3
##$RELAX= 
##$RELAX= 
##$RELAX= 
##$RELAX= 
##$RELAX= 
##$RELAX= 
##$RELAX= 
$$ Bruker specific parameters
$$ --------------------------
##$DU= <C:\u>
##$EXPNO= 4040
##$NAME= <ADRS>
##$PROCNO= 1
##$TYPE= <nmr>
##$USER= <dgb>
##$AMP= (0..31)
100 100 100 100 100 100 100 100 100 100 100 100 100 100 100 100 100 100 
100 100 100 100 100 100 100 100 100 100 100 100 100 100 
##$AQSEQ= 0
##$AQ_mod= 3
##$AUNM= <au_zg>
##$AUTOPOS= <36 >
##$BF1= 250.13
##$BF2= 250.13
##$BF3= 250.13
##$BF4= 250.13
##$BF5= 500.13
##$BF6= 500.13
##$BF7= 500.13
##$BF8= 500.13
##$BYTORDA= 1
##$CFDGTYP= 0
##$CFRGTYP= 5
##$CHEMSTR= <none>
##$CNST= (0..31)
1 1 145 1 1 1 1 1 1 1 1 1 1 1 1 1 1 1 1 1 1 1 1 1 1 1 1 1 1 1 1 1 
##$CPDPRG= <>
##$CPDPRG1= <>
##$CPDPRG2= <>
##$CPDPRG3= <>
##$CPDPRG4= <mlev>
##$CPDPRG5= <mlev>
##$CPDPRG6= <mlev>
##$CPDPRG7= <mlev>
##$CPDPRG8= <mlev>
##$CPDPRGB= <>
##$CPDPRGT= <>
##$D= (0..31)
0 1 0 0 0 0 0 0 0 0.06 0 0 0 0 0 0 0.0002 0 0 0 0 0 0 0 0 0 0 0 0 0 0 
0 
##$DATE= 1147265229
##$DBL= (0..7)
120 120 120 120 120 120 120 120 
##$DBP= (0..7)
150 150 150 150 150 150 150 150 
##$DBP07= 0
##$DBPNAM0= <>
##$DBPNAM1= <>
##$DBPNAM2= <>
$$ [...]
##$SUBNAM7= <"">
##$SUBNAM8= <"">
##$SUBNAM9= <"">
##$SW= 20.6930455092707
##$SWIBOX= (0..15)
0 0 3 0 0 0 0 0 0 0 0 0 0 0 0 0 
##$SW_h= 5175.983436853
##$TD= 65536
##$TD0= 1
##$TE= 295.16
##$TE2= 300
##$TE3= 300
##$TEG= 300
##$TL= (0..7)
0 120 120 120 120 120 120 120 
##$TP= (0..7)
150 150 150 150 150 150 150 150 
##$TP07= 0
##$TPNAME0= <>
##$TPNAME1= <>
##$TPNAME2= <>
##$TPNAME3= <>
##$TPNAME4= <>
##$TPNAME5= <>
##$TPNAME6= <>
##$TPNAME7= <>
##$TPOAL= (0..7)
0.5 0.5 0.5 0.5 0.5 0.5 0.5 0.5 
##$TPOFFS= (0..7)
0 0 0 0 0 0 0 0 
##$TUNHIN= 0
##$TUNHOUT= 0
##$TUNXOUT= 0
##$USERA1= <user>
##$USERA2= <user>
##$USERA3= <user>
##$USERA4= <user>
##$USERA5= <user>
##$V9= 5
##$VALIST= <valist>
##$VCLIST= <CCCCCCCCCCCCCCC>
##$VD= 0
##$VDLIST= <DDDDDDDDDDDDDDD>
##$VPLIST= <PPPPPPPPPPPPPPP>
##$VTLIST= <TTTTTTTTTTTTTTT>
##$WBST= 1024
##$WBSW= 4
##$XGAIN= (0..3)
0 0 0 0 
##$XL= 0
##$YL= 0
##$YMAX_a= 440217
##$YMIN_a= -571196
##$ZGOPTNS= <>
##$ZL1= 120
##$ZL2= 120
##$ZL3= 120
##$ZL4= 120
##$ABSF1= 16.522
##$ABSF2= -4.171173
##$ABSG= 5
##$ABSL= 3
##$ALPHA= 0
##$AQORDER= 0
##$ASSFAC= 0
##$ASSFACI= 0
##$ASSFACX= 0
##$ASSWID= 0
##$AUNMP= <proc_1d>
##$AZFE= 0.1
##$AZFW= 0.1
##$BCFW= 0
##$BC_mod= 0
##$BYTORDP= 0
##$COROFFS= 0
##$CY= 12.5
##$DATMOD= 1
##$DC= 0
##$DFILT= <>
##$DTYPP= 0
##$F1P= 14.0000005364418
##$F2P= -0.99999901652339
##$FCOR= 0.5
##$FTSIZE= 32768
##$FT_mod= 6
##$GAMMA= 0
##$GB= 0
##$INTBC= 1
##$INTSCL= 1
##$ISEN= 128
##$LB= 0.3
##$LEV0= 0
##$LPBIN= 0
##$MAXI= 10000
##$MC2= 0
##$MEAN= 0
##$ME_mod= 0
##$MI= 0
##$NCOEF= 0
##$NC_proc= -3
##$NLEV= 6
##$NOISF1= 0
##$NOISF2= 0
##$NSP= 0
##$NTH_PI= 0
##$NZP= 0
##$OFFSET= 16.522
##$PC= 1
##$PHC0= 166.1395
##$PHC1= 5.773341
##$PH_mod= 1
##$PKNL= yes
##$PPARMOD= 0
##$PSCAL= 4
##$PSIGN= 0
##$REVERSE= no
##$SF= 250.13
##$SI= 32768
##$SIGF1= 0
##$SIGF2= 0
##$SINO= 400
##$SIOLD= 32768
##$SREGLST= <1H.CDCl3>
##$SSB= 0
##$STSI= 32768
##$STSR= 0
##$SW_p= 5175.98343685301
##$SYMM= 0
##$S_DEV= 0
##$TDeff= 65536
##$TDoff= 0
##$TI= <Analysis number 999999
Compound Code 99
Book Reference 9
Project Code 9>
##$TILT= no
##$TM1= 0
##$TM2= 0
##$TOPLEV= 0
##$USERP1= <user>
##$USERP2= <user>
##$USERP3= <user>
##$USERP4= <user>
##$USERP5= <user>
##$WDW= 1
##$XDIM= 32768
##$YMAX_p= 432089216
##$YMIN_p= -122406
$$ End of Bruker specific parameters
$$ ---------------------------------
##NTUPLES= NMR SPECTRUM
##VAR_NAME=  FREQUENCY,     SPECTRUM/REAL,   SPECTRUM/IMAG
##SYMBOL=    X,             R,               I
##VAR_TYPE=  INDEPENDENT,   DEPENDENT,       DEPENDENT
##VAR_FORM=  AFFN,          ASDF,            ASDF
##VAR_DIM=   32768,         32768,           32768
##UNITS=     HZ,            ARBITRARY UNITS, ARBITRARY UNITS
##FACTOR=    0.157963299565203, 1,           1
##FIRST=     4132.6476996994, 0,             0
##LAST=      -1043.33573715361, 0,           0
##MIN=       -1043.33573715361, -122406,     0
##MAX=       4132.6476996994, 432089216,     0
$$ Real data points
##PAGE= N=1
##DATA TABLE= (X++(R..R)), XYDATA
$$ [...]
##PAGE= N=2
##DATA TABLE= (X++(I..I)), XYDATA
17715a992520M6312N8863K4740M9617O7860J5572K1780L6455L1382K025O443J0760
$$ -1992520 -1946208 -1887345 -1862605 -1812988 -1745128 -1729556 -1707776 -1671321 -1639939 -1637914 -1631471 -1620711
17703a620711J900L5107N0160M9199M8769J0845l4130J5001L1580M9512M0988
$$ -1620711 -1618811 -1583704 -1533544 -1484345 -1435576 -1424731 -1458861 -1443860 -1412280 -1362768 -1321780
17692a321780L9415L7561n477M7102N6342J2427q013P168J6778K272M78P602o76
$$ -1321780 -1282365 -1244804 -1250281 -1203179 -1146837 -1134410 -1142423 -1135255 -1118477 -1116205 -1115727 -1108125 -1108801
17679a108801M5491N1687O4662L9035L1260K1789j581L6755J5716r065K1007K0190
$$ -1108801 -1063310 -1011623 -946961 -907926 -876666 -854877 -856458 -819703 -803987 -813052 -792045 -771855
17667g71855L4982K9236K3786K6245O1457K3816K9835K2950K5884M9614K3896
$$ -771855 -736873 -707637 -683851 -657606 -596149 -572333 -542498 -519548 -493664 -444050 -420154
17656d20154J0116K2138K8761M479K6867M4381K5702K1544O3898O0429L4048L1020
$$ -420154 -410038 -387900 -359139 -354660 -327793 -283412 -257710 -236166 -172268 -111839 -77791 -46771
17644d6771m033M4631K6497l0300L0087N7094M7827K8470O408p615L4208K2766
$$ -46771 -50804 -6173 20324 -9976 20111 77205 125032 153502 159910 152295 186503 209269
17632B09269N3003J7550m616L8933L7479J9304N0681O5824K6829R152O4135Q5633
$$ 209269 262272 279822 275206 314139 351618 370922 421603 487427 514256 523408 587543 673176
17620F73176J5735J1396J5340q8L268N1881M8336M3083O6128K5563L1145M2419
$$ 673176 688911 700307 715647 715559 718827 770708 819044 862127 928255 953818 984963 1027382
17608A027382L9500O9184P891J3257L4159K3071J6638L3008L1766P1431N2075
$$ 1027382 1066882 1136066 1143957 1157214 1191373 1214444 1231082 1264090 1295856 1367287 1419362
17597A419362P3071N5331O0437K2969J8138K6467M7742O0440N8987O0572N5876
$$ 1419362 1492433 1547764 1608201 1631170 1649308 1675775 1723517 1783957 1842944 1903516 1959392
17586A959392M1770O6587M9205M6877N2323L3777N2727R1768P8945M5788O4480
$$ 1959392 2001162 2067749 2116954 2163831 2216154 2249931 2302658 2394426 2473371 2519159 2583639
17575B583639M9319N2246N1597K3283K4597M3971R7116P7857O2012N5744O4845
$$ 2583639 2632958 2685204 2736801 2760084 2784681 2828652 2925768 3003625 3065637 3121381 3186226
17564C186226Q4554P9072O1417Q5344R1626N6423O9050O0723Q1042Q9853Q5384
$$ 3186226 3270780 3349852 3411269 3496613 3588239 3644662 3713712 3774435 3855477 3945330 4030714
17553D030714R5056P7626P7715J14102R8313J09357J11856J29566Q9053R8387
$$ 4030714 4125770 4203396 4281111 4395213 4493526 4602883 4714739 4844305 4933358 5031745
17543E031745J70248J64964J52931J44838J54012J38085J45002J47295J68954
$$ 5031745 5201993 5366957 5519888 5664726 5818738 5956823 6101825 6249120 6418074
17534F418074J92627J98989K04674K07113K17370K01256K00376K14417K47868
$$ 6418074 6610701 6809690 7014364 7221477 7438847 7640103 7840479 8054896 8302764
17525H302764K27354K10597K27790K45825K54746K54260L21281L19052L28316
$$ 8302764 8530118 8740715 8968505 9214330 9469076 9723336 10044617 10363669 10691985
17516A0691985L68587M21494M98627N62063N73303O27745O96061P65455Q82624
$$ 10691985 11060572 11482066 11980693 12542756 13116059 13743804 14439865 15205320 16087944
17507A6087944J019987J183887J379139J597427J782555J649603M69267j715455
$$ 16087944 17107931 18291818 19670957 21268384 23050939 24700542 25169809 23454354
17499B3454354k847342l168663k889073q93997M33929l57826k235707k777077
$$ 23454354 20607012 17438349 14549276 13655279 14089208 13731382 11495675 8718598
17491H718598l127074k289345m7756J446224K124046K033382N91050j622176k514297
$$ 8718598 5591524 3302179 3254423 4700647 6824693 8858075 9449125 7826949 5312652
17482E312652k894485k254993l80873L12254j007427k742200l173700l574631
$$ 5312652 2418167 163174 -217699 94555 -912872 -3655072 -6828772 -10403403
17474a0403403k348261m07705O56923J120337J259560J204265J143064J009821
$$ -10403403 -12751664 -13159369 -12502446 -11382109 -10122549 -8918284 -7775220 -6765399
17466f765399Q66973P79875P52947P65769Q03212Q42939Q11588Q53442Q96776
$$ -6765399 -5898426 -5118551 -4365604 -3599835 -2796623 -1953684 -1142096 -288654 608122
17457F08122J014877J126017J259186J428717J595691J615141J054694o48450
$$ 608122 1622999 2749016 4008202 5436919 7032610 8647751 9702445 9053995
17449I053995k195418k520908k622381j364351J81754J76766j250822k139796
$$ 9053995 6858577 4337669 1715288 350937 532691 709457 -541365 -2681161
17441b681161k431120k359446p27367Q50950J638553J801199J076149q01270k003300
$$ -2681161 -5112281 -7471727 -8199094 -7348144 -5709591 -3908392 -2832243 -3633513 -5636813
17432e636813k374792k379875r32710J97057l27863j910826k551716k887827k486899
$$ -5636813 -8011605 -10391480 -11324190 -11127133 -11454996 -13365822 -15917538 -18805365 -21292264
17423b1292264q68305K60967P55072R26284Q85273P78134O83527N89593M88541
$$ -21292264 -22160569 -21899602 -21144530 -20218246 -19332973 -18554839 -17871312 -17281719 -16793178
17414a6793178M79111M28554L89325L46607K96224K75403K39479K50936K44698
$$ -16793178 -16314067 -15885513 -15496188 -15149581 -14853357 -14577954 -14338475 -14087539 -13842841
17405a3842841K42888K33146K10099K05938J98068J65216J71750J55322J76564
$$ -13842841 -13599953 -13366807 -13156708 -12950770 -12752702 -12587486 -12415736 -12260414 -12083850
17396a2083850J66696J85076J64103Q0905J11490J45335J42885J43706J05959
$$ -12083850 -11917154 -11732078 -11567975 -11487070 -11375580 -11230245 -11087360 -10943654 -10837695
17387a0837695O2629N8315J30834J42285J00110R9768Q8382P5871Q6471P0881
$$ -10837695 -10775066 -10716751 -10585917 -10443632 -10343522 -10243754 -10155372 -10079501 -9993030 -9922149
17377i922149O2674Q6250P7586P7506P6272L3578O0353N2498K5048P4941J03989
$$ -9922149 -9859475 -9773225 -9695639 -9618133 -9541861 -9508283 -9447930 -9395432 -9370384 -9295443 -9191454
17366i191454P8433N5401Q9970P8511M8686M2999O9093P1207O8246M5874K0807
$$ -9191454 -9113021 -9057620 -8967650 -8889139 -8840453 -8797454 -8728361 -8657154 -8588908 -8543034 -8522227
17355h522227M9570J00066R7021L1016L9461Q0342R6572O1532M0783L6844O4931
$$ -8522227 -8472657 -8372591 -8275570 -8244554 -8205093 -8124751 -8028179 -7966647 -7925864 -7889020 -7824089
17344g824089O3102N2442P652L5661O1933K8200J3539N5946Q9018N6384M2347
$$ -7824089 -7760987 -7708545 -7700893 -7665232 -7603299 -7575099 -7561560 -7505614 -7416596 -7360212 -7317865
17333g317865K7873O3911P8155M336o878L7457M6474N4135J6258K7532O7098L1861
$$ -7317865 -7289992 -7226081 -7147926 -7143590 -7150468 -7113011 -7066537 -7012402 -6996144 -6968612 -6901514 -6869653
17321f869653M3719L1826L9906L7438N1221L9731M6895K2702M1098K9618L436
$$ -6869653 -6825934 -6794108 -6754202 -6716764 -6665543 -6625812 -6578917 -6556215 -6515117 -6485499 -6482063
17310f482063N1341M6727N5019K9329L832K7221K0771K0471l595K4139M0606L2494
$$ -6482063 -6430722 -6383995 -6328976 -6299647 -6295815 -6268594 -6247823 -6227352 -6230947 -6206808 -6166202 -6133708
17298f133708M0604N8624j4771K6188M6029M5777N0558L7865M0595M7956J380
$$ -6133708 -6093104 -6034480 -6049251 -6023063 -5977034 -5931257 -5880699 -5842834 -5802239 -5754283 -5752903
17287e752903J8453L3217L993J2477M7015K2374R722J8808J1564N7570M9854k795
$$ -5752903 -5734450 -5701233 -5697240 -5684763 -5637748 -5615374 -5605652 -5586844 -5575280 -5517710 -5467856 -5470651
17275e470651J4267K6460K1016J2199L6234L4891M1772J4450N884K1058M0667
$$ -5470651 -5456384 -5429924 -5408908 -5396709 -5360475 -5325584 -5283812 -5269362 -5263478 -5242420 -5201753
17264e201753L1639M233M2849O0957L29j719M3680N2824Q009o391L7377L3987
$$ -5201753 -5170114 -5165881 -5123032 -5062075 -5061746 -5063465 -5019785 -4966961 -4958952 -4965343 -4927966 -4893979
17252d893979J8591K7787R541l622M0212p489J0496K1740L6306M4793K8406M0843
$$ -4893979 -4875388 -4847601 -4838060 -4841682 -4801470 -4808959 -4798463 -4776723 -4740417 -4695624 -4667218 -4626375
17240d626375K927m82K3297K6855K5775K1957q507O311M131Q018K0814K6443J6397
$$ -4626375 -4623448 -4623930 -4600633 -4573778 -4548003 -4526046 -4534553 -4528242 -4524111 -4516093 -4495279 -4468836 -4452439
17227d452439L4766K9007K6554O87J0286M0739O283k5821K6560N3190J3277M194
$$ -4452439 -4417673 -4388666 -4362112 -4361425 -4351139 -4310400 -4304117 -4329938 -4303378 -4250188 -4236911 -4232717
17215d232717n908K760Q587k3710K7066M8473L0418P684j1084l482M2281L5376
$$ -4232717 -4238625 -4235865 -4227278 -4250988 -4223922 -4175449 -4145031 -4137347 -4148431 -4151913 -4109632 -4074256
17203d074256J3417J1457K7211J2195k0433k3390O370K4586L7794K6677l861L3494
$$ -4074256 -4060839 -4049382 -4022171 -4009976 -4030409 -4053799 -4047429 -4022843 -3985049 -3958372 -3962233 -3928739
17191c928739K9993K3379P014L1980N814K5225K4266Q428j3155j9956j7566K5168
$$ -3928739 -3898746 -3875367 -3868353 -3836373 -3830559 -3805334 -3781068 -3772640 -3785795 -3805751 -3823317 -3798149
17179c798149L9633L0161M4929L1697j73j5489k2049J0906L3057L8661L2991P93
$$ -3798149 -3758516 -3728355 -3683426 -3651729 -3651902 -3667391 -3689440 -3678534 -3645477 -3606816 -3573825 -3573032
17167c573032l0628l356N6391M4703l871L372k9007J182L8580K6277j0511J1940
$$ -3573032 -3603660 -3607016 -3550625 -3505922 -3509793 -3506421 -3535428 -3534246 -3495666 -3469389 -3479900 -3467960
17155c467960J8596O482J435l407J1386K8113K5289M9732L301K7298J2498j6373
$$ -3467960 -3449364 -3442882 -3441447 -3444854 -3433468 -3405355 -3380066 -3330334 -3327033 -3299735 -3287237 -3303610
17143c303610j2394j3784n7365P886L1633j8065N407R206M2016K0978j8892K9
$$ -3303610 -3316004 -3329788 -3387153 -3379267 -3347634 -3365699 -3360292 -3351086 -3309070 -3288092 -3306984 -3306955
17131c306955J0567j0860L4897K7964k501K7644L9226r259k1770j0795O14J4586
$$ -3306955 -3296388 -3307248 -3272351 -3244387 -3246888 -3219244 -3180018 -3189277 -3211047 -3221842 -3221228 -3206642
17119c206642K1015K2798J776p951L3173K1539L033J0204J5886K1555K7377j2734
$$ -3206642 -3185627 -3162829 -3161053 -3169004 -3135831 -3114292 -3111259 -3101055 -3085169 -3063614 -3036237 -3048971
17107c048971p721n104L0834L3910p193L280r101N293q119M192M8K1011N25O133
$$ -3048971 -3056692 -3061796 -3030962 -2997052 -3004245 -3000965 -3010066 -3004773 -3012892 -3008700 -3008652 -2987641 -2987116 -2980983
17093b980983M3137M2288M365K3857N668l8236k9867k658k3812k8303k9494J3808
$$ -2980983 -2937846 -2895558 -2891193 -2867336 -2861668 -2899904 -2929771 -2932429 -2956241 -2984544 -3014038 -3000230
17081c000230M5864J0096p508J5926N4245L8928L9440J0912M964m854n728P106
$$ -3000230 -2954366 -2944270 -2951778 -2935852 -2881607 -2842679 -2803239 -2792327 -2787363 -2792217 -2797945 -2790839
17069b790839j3005j6377N006J9603J9847J3460o904K619M736K7741L0582p73
$$ -2790839 -2803844 -2820221 -2815215 -2795612 -2775765 -2762305 -2769209 -2766590 -2761854 -2734113 -2703531 -2704304
17057b704304J3903q797o046P890K6993Q104l987K413J1949K5931J3015J6397
$$ -2704304 -2690401 -2699198 -2705244 -2697354 -2670361 -2662257 -2666244 -2663831 -2651882 -2625951 -2612936 -2596539
17045b596539l0423p460K0785p066K7037j5615P633L6056K5663j1673o314j6434
$$ -2596539 -2626962 -2634422 -2613637 -2620703 -2593666 -2609281 -2601648 -2565592 -2539929 -2551602 -2557916 -2574350
17033b574350J0138L0986L0187J5888k0738N124K1230K7608k0462m023L9613R268
$$ -2574350 -2564212 -2533226 -2503039 -2487151 -2507889 -2502765 -2481535 -2453927 -2474389 -2478412 -2438799 -2429531
17021b429531P199k0911J1266k331M2733L9520j0998R136j4895q35Q041n478L8689
$$ -2429531 -2422332 -2443243 -2431977 -2434308 -2391575 -2352055 -2363053 -2353917 -2368812 -2369647 -2361606 -2367084 -2328395
17008b328395L7670k878j0180j0605J2733K8360K6191p615k9240l190k2025K019
$$ -2328395 -2290725 -2293603 -2303783 -2314388 -2301655 -2273295 -2247104 -2254719 -2283959 -2287149 -2309174 -2307155
16996b307155K5099k7948j8568J4678l2949J0304M968J8360J1854q516j7288j1568
$$ -2307155 -2282056 -2310004 -2328572 -2313894 -2346843 -2336539 -2331571 -2313211 -2301357 -2309873 -2327161 -2338729
16984b338729J7700K7021M576j833N544p907M354J861k0464j9234j3477P713P747
$$ -2338729 -2321029 -2294008 -2289432 -2291265 -2285721 -2293628 -2289274 -2287413 -2307877 -2327111 -2340588 -2332875 -2325128
16971b325128P515R922J3534q086N2503J8587Q295P869J9936j7507o980M3082
$$ -2325128 -2317613 -2307691 -2294157 -2302243 -2249740 -2231153 -2222858 -2214989 -2195053 -2212560 -2219540 -2176458
16959b176458j732J08K4989J8754K6802M9374K3415J037l2104o682j0250m419
$$ -2176458 -2178190 -2178082 -2153093 -2134339 -2107537 -2058163 -2034748 -2033711 -2065815 -2072497 -2082747 -2087166
16947b087166O322l7345l2985l712j5625j9068j4879J7981J2454l831K1293L0320
$$ -2087166 -2080844 -2118189 -2151174 -2154886 -2170511 -2189579 -2204458 -2186477 -2174023 -2177854 -2156561 -2126241
16935b126241K7347K495j2701k2036k8674k7435K0191J2203J0033l402m369j798
$$ -2126241 -2098894 -2096399 -2109100 -2131136 -2159810 -2187245 -2167054 -2154851 -2144818 -2148220 -2152589 -2154387
16923b154387R608P01k8881j3049L0736M7301j5924n736L9856L9701p600K0252
$$ -2154387 -2144779 -2144078 -2172959 -2186008 -2155272 -2107971 -2123895 -2129631 -2089775 -2050074 -2057674 -2037422
16911b037422j704k009P45K6011j5826j0407k3892r783K5780J7453P704J3834
$$ -2037422 -2039126 -2041135 -2040390 -2014379 -2030205 -2040612 -2064504 -2074287 -2048507 -2031054 -2023350 -2009516
16899b009516J9732J9117L614j6576j1833J296R60R532K572q671o557Q052P654
$$ -2009516 -1989784 -1970667 -1967053 -1983629 -1995462 -1994166 -1993206 -1983674 -1981102 -1989773 -1996330 -1988278 -1980624
16886a980624L7603L560l5432o318K4228P903L918l073j4302J8760K6670J9235
$$ -1980624 -1943021 -1939461 -1974893 -1981211 -1956983 -1949080 -1945162 -1948235 -1962537 -1943777 -1917107 -1897872
16874a897872j2329j7866r320l0265r050K2085K1146J2048L8629J4537J0693j661
$$ -1897872 -1910201 -1928067 -1937387 -1967652 -1976702 -1954617 -1933471 -1921423 -1882794 -1868257 -1857564 -1859225
16862a859225j4102l3069k066M9421J2654j688J7069Q456m2363l2788K1662K7331
$$ -1859225 -1873327 -1906396 -1908462 -1859041 -1846387 -1848075 -1831006 -1822550 -1864913 -1897701 -1876039 -1848708
16850a848708q187N463J939K6171L1865J6012k6853j0501q952q595k6222J1003
$$ -1848708 -1856895 -1851432 -1849493 -1823322 -1791457 -1775445 -1802298 -1812799 -1821751 -1830346 -1856568 -1845565
16838a845565J2516k55l274K0071J6471R459j3363q398J1386J2862L2064Q553
$$ -1845565 -1833049 -1833304 -1836578 -1816507 -1800036 -1790577 -1803940 -1812338 -1800952 -1788090 -1756026 -1747473
16826a747473k9532j9677K6696J9767j9404j0421L0386K4798j0244l923M0842
$$ -1747473 -1777005 -1796682 -1769986 -1750219 -1769623 -1780044 -1749658 -1724860 -1735104 -1739027 -1698185
16815a698185m306j8625R968N720K5130J7490M756j084q201J8649K181n3K0917
$$ -1698185 -1702491 -1721116 -1711148 -1705428 -1680298 -1662808 -1658052 -1659136 -1667337 -1648688 -1646507 -1646560 -1625643
16802a625643m66j4315k6726q100k6423J3798o509N5909R761J245K7535r000j0549
$$ -1625643 -1626109 -1640424 -1667150 -1675250 -1701673 -1687875 -1694384 -1638475 -1628714 -1627469 -1599934 -1608934 -1619483
16789a619483r716L967J4843o332j1311J9489L477k94q568K1819J5862j0430j5635
$$ -1619483 -1629199 -1625232 -1610389 -1616721 -1628032 -1608543 -1605066 -1605360 -1613928 -1592109 -1576247 -1586677 -1602312
16776a602312r738l445k326J0797k1351j2385L5281J1102J7301k3647J2040O001
$$ -1602312 -1612050 -1615495 -1617821 -1607024 -1628375 -1640760 -1605479 -1594377 -1577076 -1600723 -1588683 -1582682
16764a582682N1667P720k7041o374N292L849J8648j0954j6481O495O237L400J7765
$$ -1582682 -1531015 -1523295 -1550336 -1556710 -1551418 -1547569 -1528921 -1539875 -1556356 -1549861 -1543624 -1540224 -1522459
16751a522459K267j3143L30J5609j0123J7797J4541K116j1273k7043P258Q047
$$ -1522459 -1520192 -1533335 -1533005 -1517396 -1527519 -1509722 -1495181 -1493065 -1504338 -1531381 -1524123 -1516076
16739a516076J5083J2613Q90j9563j7185K4188M0666O5210L823k0711r150j2859
$$ -1516076 -1500993 -1488380 -1487490 -1507053 -1524238 -1500050 -1459384 -1394174 -1390351 -1411062 -1420212 -1433071
16727a433071j1135k863J5106k607j0510J4079J1019j5148J9174j5304p999M6241
$$ -1433071 -1444206 -1447069 -1431963 -1434570 -1445080 -1431001 -1419982 -1435130 -1415956 -1431260 -1439259 -1393018
16715a393018L371J7309j1226m8252j2207P009K1366l163k0750J0042L5792Q284
$$ -1393018 -1389647 -1372338 -1383564 -1431816 -1444023 -1437014 -1415648 -1418811 -1439561 -1429519 -1393727 -1385443
16703a385443J2453K9620k1864k2587j0649M691q698k0299m620M12Q00J9751L1770
$$ -1385443 -1372990 -1343370 -1365234 -1387821 -1398470 -1393779 -1402477 -1422776 -1427396 -1426984 -1426184 -1406433 -1374663
16690a374663J4059J4422k161J8560k640J1633J126M84Q475k2266k1201j4725
$$ -1374663 -1360604 -1346182 -1348343 -1329783 -1332423 -1320790 -1319664 -1319180 -1310705 -1332971 -1354172 -1368897
16678a368897Q339K6247P234O237q676K558J2846k6366q601P950L8565J6746k664
$$ -1368897 -1360558 -1334311 -1327077 -1320840 -1329516 -1326958 -1314112 -1340478 -1349079 -1341129 -1302564 -1285818 -1288482
16665a288482J051p407k7331k3267M0242K0603J0278J0951j1769l728L9732K3068
$$ -1288482 -1287431 -1294838 -1322169 -1345436 -1305194 -1284591 -1274313 -1263362 -1275131 -1278859 -1239127 -1216059
16653a216059l6527k6332J2759K6580K2323M421l910j4541k7273m811k8238p263
$$ -1216059 -1252586 -1278918 -1266159 -1239579 -1217256 -1212835 -1216745 -1231286 -1258559 -1263370 -1291608 -1298871
16641a298871K4299K372R467q68R002K7820r49k1530J349n099k4816K8170K1488
$$ -1298871 -1274572 -1272200 -1262733 -1263601 -1254599 -1226779 -1227728 -1249258 -1247909 -1253008 -1277824 -1249654 -1228166
16628a228166j652K461k230k5882k8752M3596N3800l0975j6941j1048k8886K1363
$$ -1228166 -1229818 -1227357 -1229587 -1255469 -1284221 -1240625 -1186825 -1217800 -1234741 -1245789 -1274675 -1253312
16616a253312K5668K4603o856j3882q883k794N707j8551l280o168K309K5284n425
$$ -1253312 -1227644 -1203041 -1209897 -1223779 -1232662 -1235456 -1229749 -1248300 -1251580 -1257748 -1255439 -1230155 -1235580
16603a235580p801K0091J9120O53Q573L6172K220J5926P94j6706J177J019N680
$$ -1235580 -1243381 -1223290 -1204170 -1203517 -1194944 -1158772 -1156552 -1140626 -1139832 -1156538 -1155361 -1154342 -1148662
16590a148662q352k082K3830J5808J1523k7075r352j9652k952j547K2516M3301
$$ -1148662 -1157014 -1159096 -1135266 -1119458 -1107935 -1135010 -1144362 -1164014 -1166966 -1168513 -1145997 -1102696
16578a102696j3571J3662J0458n040L359J8890l9081r429J4427J7756J5431k9807
$$ -1102696 -1116267 -1102605 -1092147 -1097187 -1093828 -1074938 -1114019 -1123448 -1109021 -1091265 -1075834 -1105641
16566a105641l450P754o970K2154n475j1567O282j315p206J3945O132L325l146
$$ -1105641 -1109091 -1101337 -1108307 -1086153 -1091628 -1103195 -1096913 -1098228 -1105434 -1091489 -1085357 -1082032 -1085178
16553a085178K1387R901j8079p037q927J2511J701J0816m860k0567K401J8915
$$ -1085178 -1063791 -1053890 -1071969 -1079006 -1087933 -1075422 -1073721 -1062905 -1067765 -1088332 -1085931 -1067016
16541a067016k2707M348O439J2382J6256k3812R190L6117J860k2170k837P658
$$ -1067016 -1089723 -1085375 -1078936 -1066554 -1050298 -1074110 -1064920 -1028803 -1026943 -1049113 -1051950 -1044292
16529a044292q426j2904o135M910J1957J5832K4631m900J1308J0530K2872n719
$$ -1044292 -1052718 -1065622 -1071757 -1066847 -1054890 -1039058 -1014427 -1019327 -1008019 -997489 -974617 -980336
16517i80336m0613Q558N269L275Q661l859Q879q096j7236k235r06K8472L0150
$$ -980336 -1020949 -1012391 -1007122 -1003847 -995186 -999045 -990166 -998262 -1015498 -1017733 -1018639 -990167 -960017
16504i60017j5073l9717k983K2265k0060l535J5269p298K4549L8084j1363l3042
$$ -960017 -975090 -1014807 -1017790 -995525 -1015585 -1019120 -1003851 -1011149 -986600 -948516 -959879 -992921
16492i92921q669L1776J1542m842J7452m717m2121m7309j5709L3993J2108K00
$$ -992921 -1001590 -969814 -958272 -963114 -945662 -950379 -992500 -1039809 -1055518 -1021525 -1009417 -1009217
16480a009217L0698M8621N332j1452j7737K0242J0564j3901l7531K444K9904J3591
$$ -1009217 -978519 -929898 -924566 -936018 -953755 -933513 -922949 -936850 -974381 -971937 -942033 -928442
16468i28442j1657p19k002N825N440Q852l989J3653N696q560k6633n0875n300
$$ -928442 -940099 -940818 -942820 -936995 -931555 -922703 -926692 -913039 -907343 -915903 -942536 -993411 -998711
16455i98711J7575J7211L720L0213L578K2671J028j5589J1122j5155J0302K5005
$$ -998711 -981136 -963925 -960205 -929992 -926414 -903743 -902715 -918304 -907182 -922337 -912035 -887030
16443h87030K2674j3292J7495j6058o719O236j1906j040L311K942n517Q698j4037
$$ -887030 -864356 -877648 -860153 -876211 -882930 -876694 -888600 -889640 -886329 -883387 -888904 -880206 -894243
16430h94243j637K152k714N213J5836N438M956J0039l170k2817J116p338m500
$$ -894243 -895880 -893728 -896442 -891229 -875393 -869955 -864999 -854960 -858130 -880947 -879831 -887169 -891669
16417h91669L4925L4991k1160M21J2535l9105M334k562J3187K810M743k0375q722
$$ -891669 -856744 -821753 -842913 -842492 -829957 -869062 -864728 -867290 -854103 -851293 -846550 -866925 -875647
16404h75647L7006R848m7086j8997K3205K3375P59j1075j7950j465J0576L6036
$$ -875647 -838641 -828793 -875879 -894876 -871671 -848296 -847537 -858612 -876562 -878027 -867451 -831415
16392h31415J6346l506M855o025q726l444m782j329j2304L3427K3734l273L40
$$ -831415 -815069 -818575 -813720 -819745 -828471 -831915 -836697 -838026 -850330 -816903 -793169 -796442 -796102
16379g96102m841L859j7950j9705J2525K228O273J2438k0125P362J5084L197J1445
$$ -796102 -800943 -797084 -815034 -834739 -822214 -819986 -813713 -801275 -821400 -814038 -798954 -795757 -784312
16366g84312r78q121Q800P138Q713P099q888k7283K0680L054Q484J0126k8421
$$ -784312 -785290 -793411 -784611 -777473 -768760 -761661 -770549 -797832 -777152 -774098 -765614 -755488 -783909
16353g83909R55k204J5781M1285M2334j077n3264m1752j3714K0025m941N47K2682
$$ -783909 -782954 -785158 -769377 -728092 -685758 -686835 -740099 -781851 -795565 -775540 -780481 -779934 -757252
16340g57252K8653K5773J2469M129n7065l7715L0501J150j1259j2729o434M1839
$$ -757252 -728599 -702826 -690357 -686228 -743293 -781008 -750507 -749357 -760616 -773345 -779779 -737940
16328g37940K3451l80J8336o502L710J0149L3384k5136n073j207r120n140n263
$$ -737940 -714489 -714869 -696533 -703035 -699325 -689176 -655792 -680928 -686001 -687208 -696328 -701468 -706731
16315g06731N153J6790m374k0620r129l36K225j6651O086O790j0972j3842P393
$$ -706731 -701578 -684788 -689162 -709782 -718911 -719247 -717022 -733673 -727587 -720797 -731769 -745611 -738218
16302g38218J3880J4130R324K582J7211L0967M238j5034l3211k0558O243m781
$$ -738218 -724338 -710208 -700884 -698302 -681091 -650124 -645886 -660920 -694131 -714689 -708446 -713227
16290g13227J7221k10J8808P381R27j1927R217J672J7157j1387j9540K0810J4429
$$ -713227 -696006 -696216 -677408 -670027 -669100 -681027 -671810 -670138 -652981 -664368 -683908 -663098 -648669
16277f48669J8749k964k3293J4274j210m0778P237Q746N889L981N790j219J1816
$$ -648669 -629920 -632884 -656177 -641903 -643113 -683891 -676654 -667908 -662019 -658038 -652248 -653467 -641651
16264f41651l308K727K3551L571n949j7310Q432l1704l7290R652K9469J4883m400
$$ -641651 -644959 -642232 -618681 -615110 -621059 -638369 -629937 -661641 -698931 -689279 -659810 -644927 -649327
16251f49327k8309j9464K1978L0860N457j5651j0461J937J4372K6224J6984L3643
$$ -649327 -677636 -697100 -675122 -644262 -638805 -654456 -664917 -662980 -648608 -622384 -605400 -571757
16239e71757q120m7503l7484K984K2363J3576R005P442q525J3530J4363n786R446
$$ -571757 -579877 -627380 -664864 -661880 -639517 -625941 -616936 -609494 -618019 -604489 -590126 -595912 -586466
16226e86466N710j6104J5047m763r408j3105k937J1804j301j6491k624L481q880
$$ -586466 -580756 -596860 -581813 -586576 -595984 -609089 -612026 -600222 -601523 -618014 -620638 -617157 -626037
16213f26037O496R779j4751n790K0793J8663J1253O760j165k851m996j766K4008
$$ -626037 -619541 -609762 -624513 -630303 -609510 -590847 -579594 -572834 -573999 -576850 -581846 -583612 -559604
16200e59604j1551k5062R534J9660J0165N358n17j7765j0812J3522M546J3768
$$ -559604 -571155 -596217 -586683 -567023 -556858 -551500 -552017 -569782 -580594 -567072 -562526 -548758
16188e48758J9771j6914k2308K8526j2593k4145K0089K5795K107j7923m405J904
$$ -548758 -528987 -545901 -568209 -539683 -552276 -576421 -556332 -530537 -528430 -546353 -550758 -548854
16176e48854J5021j0677J3717J7528P090n762j7253K09J6301J9724K0285k7279
$$ -548854 -533833 -544510 -530793 -513265 -506175 -511937 -529190 -528981 -512680 -492956 -472671 -499950
16164d99950l8649j6318j1091K3098M0638j1544j853J1817j4022j10J317j3801
$$ -499950 -538599 -554917 -566008 -542910 -502272 -513816 -515669 -503852 -517874 -517984 -516667 -530468
16152e30468o957L5438j0780l054j902J6184K538P950j8716l1167j3285Q69K0466
$$ -530468 -537425 -501987 -512767 -515821 -517723 -501539 -499001 -491051 -509767 -540934 -554219 -553350 -532884
16139e32884J5012J0723r926J8903L631m227J9628K1558m1039k3799J1341o06
$$ -532884 -517872 -507149 -517075 -498172 -494541 -498768 -479140 -457582 -498621 -522420 -511079 -511685
16127e11685K724j2022K2845L0159j2807k0545N823k2666j3904L3471K9435o770
$$ -511685 -508961 -520983 -498138 -467979 -480786 -501331 -495508 -518174 -532078 -498607 -469172 -475942
16115d75942k6684K2903M868K3635k5862o440J6022L569P426k709J0253L2108
$$ -475942 -502626 -479723 -474855 -451220 -477082 -483522 -467500 -463931 -456505 -459214 -448961 -416853
16103d16853K1486k7550m4750L096L8292J4648J1431k657q630k9382j1806J2494
$$ -416853 -395367 -422917 -467667 -464571 -426279 -411631 -400200 -402857 -411487 -440869 -452675 -440181
16091d40181k3312O283K839J1613J4472n062j1291j0186q447K591n392o402k0190
$$ -440181 -463493 -457210 -454371 -442758 -428286 -433348 -444639 -454825 -463272 -460681 -466073 -472475 -492665
16078d92665J5951N0665L0843k7322j1958q71Q324J2818K5932k3507j8980l4051
$$ -492665 -476714 -426049 -395206 -422528 -434486 -435357 -427033 -414215 -388283 -411790 -430770 -464821
16066d64821J9567J3133j295K8046K819J2236j3870K584L001j0182J9193K5640
$$ -464821 -445254 -432121 -433416 -405370 -402551 -390315 -404185 -401601 -398600 -408782 -389589 -363949
16054c63949M074r114m2844q558M523j41o40O317p232L2802M4305j059k4805j3434
$$ -363949 -359875 -368989 -411833 -420391 -415868 -416009 -416649 -410332 -417564 -384762 -340457 -341516 -366321 -379755
16040c79755o313k800K0616K5553j0253O293k1034l5271O478M4057K8988j0054
$$ -379755 -386068 -388868 -368252 -342699 -352952 -346659 -367693 -402964 -396486 -352429 -323441 -333495
16028c33495k4062J888m575J4186k8499q125N261K565L2081J3978m724J7106P026
$$ -333495 -357557 -355669 -360244 -346058 -374557 -382682 -377421 -374856 -342775 -328797 -333521 -316415 -309389
16015c09389j2880j0240j3207j3529l1811j420K9959J9645k9821k5536J2416J9298
$$ -309389 -322269 -332509 -345716 -359245 -391056 -392476 -362517 -342872 -372693 -398229 -385813 -366515
16003c66515J1685J8238N587k893o885R550j7768m3819J3501l56p514q36k398
$$ -366515 -354830 -336592 -331005 -333898 -340783 -331233 -349001 -392820 -379319 -379675 -387189 -388025 -390423
15990c90423Q903P061j8140r577J8784K2513K3929K5511J7888j1531j4252j1276
$$ -390423 -381520 -374459 -392599 -402176 -383392 -360879 -336950 -311439 -293551 -305082 -319334 -330610
15978c30610P732l3180j3121M0363J5696j8924l0166J7535K2226K7561K2072j6071
$$ -330610 -322878 -356058 -369179 -328816 -313120 -332044 -362210 -344675 -322449 -294888 -272816 -288887
15966b88887l2086j8970J3092K9833N419j2732r724j1416j2751P179K8478K5101
$$ -288887 -320973 -339943 -326851 -297018 -291599 -304331 -314055 -325471 -338222 -331043 -302565 -277464
15954b77464L477j3888j4448j0311p642M166Q299K1170N048j2156j4826J7036
$$ -277464 -273987 -287875 -302323 -312634 -320276 -316110 -307811 -286641 -281593 -293749 -308575 -291539
15942b91539n51k0204k3975J3660K1694l724N496J2873q154J6250K4841J5183
$$ -291539 -292090 -312294 -336269 -322609 -300915 -304639 -299143 -286270 -294424 -278174 -253333 -238150
15930b38150j4393k5324k6484j0705j152J9307J0255J2786n714l3083j6851k461
$$ -238150 -252543 -277867 -304351 -315056 -316208 -296901 -286646 -273860 -279574 -312657 -329508 -331969
15918c31969n716R348k12K267K1054q712L260R661M0035J242k4611o771j7165
$$ -331969 -337685 -328337 -328549 -326282 -305228 -313940 -310680 -301019 -260984 -259742 -284353 -291124 -308289
15905c08289K4829j0902r731K8384M3410K8881J3404j3571l7041J5077K8413M651
$$ -308289 -283460 -294362 -304093 -275709 -232299 -203418 -190014 -203585 -240626 -225549 -197136 -192485
15893a92485j6771k5537j1737J5475Q812o68J7677j9448l1698k055J1503R541
$$ -192485 -209256 -234793 -246530 -231055 -222243 -222911 -205234 -224682 -256380 -258435 -246932 -237391
15881b37391j512n221N230K8990j0K7080o505O196R120j8877k7869n018K9484
$$ -237391 -238903 -244124 -238894 -209904 -209914 -182834 -189339 -183143 -174023 -192900 -220769 -225787 -196303
15868a96303k0065K383J8804j3527j8767k161K8102j8710l0750J6656L993k8764
$$ -196303 -216368 -213985 -195181 -208708 -227475 -229636 -201534 -220244 -250994 -234338 -230345 -259109
15856b59109N982K4832o304N227K1309J8633m86J0857J8729K559l398n447q677
$$ -259109 -253127 -228295 -234599 -229372 -208063 -189430 -189916 -179059 -160330 -157771 -161169 -166616 -175293
15843a75293k2537k3517K630J7398K6908o179k0425m0254j1086K1470k8114P900
$$ -175293 -197830 -221347 -218717 -201319 -174411 -180590 -201015 -241269 -252355 -230885 -258999 -251099
15831b51099K1868J3827N0240L2551j7424j2865J3014L1079J0018k5435j2634
$$ -251099 -229231 -215404 -165164 -132613 -150037 -162902 -149888 -118809 -108791 -134226 -146860
15820a46860K4731p335k101o374j251l446j5643K5331J2946j2679k9228n220r79
$$ -146860 -122129 -129464 -131565 -137939 -139190 -142636 -158279 -132948 -120002 -132681 -161909 -167129 -168108
15807a68108L066J2030o181R493J3882j712n247N168P191l1699N48J7887j1642
$$ -168108 -165042 -153012 -159193 -149700 -135818 -137530 -142777 -137609 -130418 -162117 -161569 -143682 -155324
15794a55324q346J4508L4005q283J1216N927q510l5073K828q726o783P51J9498
$$ -155324 -163670 -149162 -115157 -123440 -112224 -106297 -114807 -149880 -147052 -155778 -162561 -161810 -142312
15781a42312K436k5519P87K577J3688j066K403J5798J2774j4324j2347L016J0336
$$ -142312 -139876 -165395 -164608 -162031 -148343 -149409 -147006 -131208 -118434 -132758 -145105 -142089 -131753
15768a31753j2692J5385Q800j7086j1737K2509O598J0324k2463k5256l415q336
$$ -131753 -144445 -129060 -120260 -137346 -149083 -126574 -119976 -109652 -132115 -157371 -160786 -169122
15756a69122k50K9702M2521j1222l3075k718J4895J2638N594k0239l51n905J2045
$$ -169122 -169372 -139670 -97149 -108371 -141446 -144164 -129269 -116631 -111037 -131276 -131627 -137532 -125487
15743a25487Q040J0384K4163P518k689O249J6499L631l2583Q105J6221J918j2128
$$ -125487 -117447 -107063 -82900 -75382 -78071 -71822 -55323 -51692 -84275 -76170 -59949 -58031 -70159
15730g0159k8449p482K3593K4618K4652l4880k9227k9154K2525K8951P469k7858
$$ -70159 -98608 -106090 -82497 -57879 -33227 -68107 -97334 -126488 -103963 -75012 -67543 -95401
15718i5401R25j2637j5927Q985J4188K1414L9596k674l6782k3026N940J2164J5700
$$ -95401 -94476 -107113 -123040 -114055 -99867 -78453 -38857 -41531 -78313 -101339 -95399 -83235 -67535
15705f7535N584K2756j8347n241M2637j2304j8962L278j0985j1850J7847j4387
$$ -67535 -61951 -39195 -57542 -62783 -20146 -32450 -51412 -48134 -59119 -70969 -53122 -67509
15693f7509j4513R112k3135J091M0027Q560Q879K597n392j3225k336J7443P170
$$ -67509 -82022 -72910 -96045 -94954 -54927 -46367 -37488 -34891 -40283 -53508 -55844 -38401 -31231
15680c1231O718j7826l4448n0198K8381N2347J1048R469k4163J6812K2341k732
$$ -31231 -24513 -42339 -76787 -126985 -98604 -46257 -35209 -25740 -49903 -33091 -10750 -13482
15668a3482r514N318k2380o123L2777q202j2415K3086J8460J3076q242j9299j5908
$$ -13482 -22996 -17678 -40058 -46181 -13404 -21606 -34021 -10935 7525 20601 12359 -6940 -22848
15655b2848j2120m201j0566n899m957J9702R635Q573J4889l599J7974p757q643
$$ -22848 -34968 -39169 -49735 -55634 -60591 -40889 -31254 -22681 -7792 -11391 6583 -1174 -9817
15642i817j4683q609l7110L6223K3017r626l9620J7481L7964r062k4678J0989
$$ -9817 -24500 -33109 -70219 -33996 -10979 -20605 -60225 -42744 -4780 -13842 -38520 -27531
15630b7531J2979l693L22J5949J0862l537j4845K2106J7878k1729m835l714J7812
$$ -27531 -14552 -18245 -17923 -1974 8888 5351 -9494 12612 30490 8761 3926 212 18024
15617A8024L6432M825l3101m1269n005K9340J2666l4378j2937M4582L0503q145
$$ 18024 54456 59281 26180 -15089 -20094 9246 21912 -12466 -25403 19179 49682 41537
15605D1537l602j567J6761l501j7926k2388k9430m707N858L4527M8514K3746K586
$$ 41537 37935 36368 53129 49628 31702 9314 -20116 -24823 -18965 15562 64076 87822 90408
15592I0408k9116K725k9924R306j1642k7150J2794K4748K3150j0062k7819J4453
$$ 90408 61292 64017 34093 43399 31757 4607 17401 42149 65299 55237 27418 41871
15580D1871O173j909J0334r340j6397K3600N253m4417l656K5847J64k3717l1186
$$ 41871 48044 46135 56469 47129 30732 54332 59585 15168 11512 37359 37523 13806 -17380
15567a7380J4772R636K9393Q366j0355o904M942J9750p763L2828L9266k867j3675
$$ -17380 -2608 7028 36421 44787 34432 27528 32470 52220 44457 77285 116551 113684 100009
15554A00009q652J3522K307m067r853J9590K4580q01k7925K64P926j2461J8521
$$ 100009 91357 104879 107186 103119 93266 112856 137436 136635 108710 108974 116900 104439 122960
15541A22960O377j4967l325O663l0549j3908j658q979K4755K2203K079l2086l7259
$$ 122960 129337 114370 111045 117708 87159 73251 71593 62614 87369 109572 111651 79565 42306
15528D2306N96K3530K0678K2509l183k0917K0015N202P539J0728k6258r032R230
$$ 42306 42902 66432 87110 109619 106436 85519 105534 110736 118275 129003 102745 93713 102943
15515A02943k234j8840k2516N153r855Q813J6971L4495r002k7853Q980J8503J3352
$$ 102943 100709 81869 59353 64506 54651 63464 80435 114930 105928 78075 87055 105558 118910
15502A18910j7410r875n090K2776j7276j9839J2040J4601K6598R055k408j2965
$$ 118910 101500 91625 86535 109311 92035 72196 84236 98837 125435 134490 132082 119117
15490A19117k5774J2739J8474l256n336j7816k8839K4213L3818n455m906p06j2882
$$ 119117 93343 106082 124556 121300 115964 98148 69309 93522 127340 121885 116979 116273 103391
15477A03391K7839K4239k2975k2551j7468N916J4572K0359N788K5733L9709k2808
$$ 103391 131230 155469 132494 109943 92475 98391 112963 133322 139110 164843 204552 181744
15465A81744m1955j7013J8715J6588K4931k863l4110l152J8821K4057q94j1965
$$ 181744 139789 122776 141491 158079 183010 180147 146037 142885 161706 185763 184869 172904
15453A72904n089l9942l7019K2833N1265q870m859Q693k8858l2553L793J6981
$$ 172904 167815 127873 90854 113687 164952 156082 151223 159916 131058 98505 102298 119279
15441A19279J6148n309O257J1123k598J2779J0003Q129p078j6521J108K1823J5984
$$ 119279 135427 130118 136375 147498 144900 157679 167682 175811 168733 152212 153320 175143 191127
15428A91127Q134O843P765j4023l1336P28J3352j710k3631m052P085P247K1686
$$ 191127 199261 206104 213869 199846 168510 169238 182590 180880 157249 153197 160282 167529 189215
15415A89215J2124l972J0593K4096M510j2359j6466p308k2011j1920J3485o30
$$ 189215 201339 197367 207960 232056 236566 224207 207741 200433 178422 166502 179987 179357
15403A79357O43K5227j3979j763o453K1334K7134k3765l518R140k3347N2474N4225
$$ 179357 180000 205227 191248 189485 183032 204366 231500 207735 204217 213357 190010 242484 296709
15390B96709k0918k5750M233J2004n939l1115j4954K4639J0838j6369j0541J8536
$$ 296709 275791 250041 254274 266278 260339 229224 214270 238909 249747 233378 222837 241373
15378B41373j8623m5770Q634M3000M242R842M978l3633l5681J3735o49k121N458
$$ 241373 222750 176980 185614 228614 232856 242698 247676 214043 178362 192097 191448 189327 194785
15365A94785K7278J4112M6486K1274k7703j5876L383k1943Q727M468J5547n597
$$ 194785 222063 236175 282661 303935 276232 260356 263739 241796 250523 254991 270538 264941
15353B64941k0376J3838K5113K776j0186j3565J951o424l8600K218J0139q37K4764
$$ 264941 244565 258403 283516 286292 276106 262541 264492 258068 219468 221686 231825 230988 255752
15340B55752J0427k221j7531P951k78j0588O115o131k3760j0323j2712K8506J930
$$ 255752 266179 263958 246427 254378 254100 243512 249627 243496 219736 209413 196701 225207 227137
15327B27137J0220M1678L4249l5895k7853K8537r676l8314j2331j8931K5119O940
$$ 227137 237357 279035 313284 277389 249536 278073 268397 230083 217752 198821 223940 230880
15315B30880L136q156K607L9444J0866r118J5451P63j7011l911L215l15j4529
$$ 230880 234016 225860 228467 267911 278777 269659 285110 285873 268862 264951 268166 267851 253322
15302B53322K8001J4819K412p131k0163K2725k0809j1039o241j8082P832N677
$$ 253322 281323 296142 298554 291423 271260 293985 273176 262137 255896 237814 245646 251323
15290B51323L820n445k734L0107J2746j0660k8133K0729K1968J1430j734J1574
$$ 251323 255143 249698 246964 277071 289817 279157 251024 271753 293721 305151 303417 314991
15278C14991R672L602J0905j8992m6507J712J1939p572J6299K7624J9535k7702
$$ 314991 324663 328265 339170 320178 273671 275383 287322 279750 296049 323673 343208 315506
15266C15506l0686L2834J1268P330L5662k8875k6454k4008K770J0848Q137k4712
$$ 315506 284820 317654 328922 336252 371914 343039 316585 292577 295347 306195 314332 289620
15254B89620M519K4321M8508J8170j3935r153k6380r284o608r398L1737L6884
$$ 289620 294139 318460 366968 385138 371203 362050 335670 326386 319778 310380 342117 379001
15242C79001j6196k0226J0334L3310N142j6732P472o408j5060l0361N196l08M443
$$ 379001 362805 342579 352913 386223 391365 374633 382105 375697 360637 330276 335472 335164 339607
15229C39607L3676K2445j5032k1160j1302K8446j1666j4307R478J2106L567k2015
$$ 339607 373283 395728 380696 359536 348234 376680 365014 350707 360185 372291 375858 353843
15217C53843O917J2602k02K3124R414k2269k0639k0939J6748J3239j0132L5565
$$ 353843 360760 373362 373160 396284 405698 383429 362790 341851 358599 371838 361706 397271
15205C97271L0698N342K1665P215j866k9649k3310l2955k0831p867r666q534J6377
$$ 397271 427969 433311 454976 462191 460325 430676 407366 374411 353580 345713 336047 327513 343890
15192C43890J8901J3182j7478K0710J1921l8435K3675P397K979K7681Q688J4165
$$ 343890 362791 375973 358495 379205 391126 352691 376366 383763 386742 414423 423111 437276
15180D37276r782l820k8856k2536k5938o098J8263L9169J71R245L540j5878n26
$$ 437276 427494 423674 394818 372282 346344 340246 358509 397678 397849 407094 410634 394756 394230
15167C94230j0766K8834J6955P47o817l748q674m3954l5117k146M6599L5552k5891
$$ 394230 383464 412298 429253 430000 423183 419435 410761 366807 331690 329544 376143 411695 385804
15154C85804r27J2679K3056j9658J1344J0431m859K2372Q269p688j8480k1013
$$ 385804 384877 397556 420612 400954 412298 422729 417870 440242 448511 440823 422343 401330
15142D01330j6128J3530o421q637L235J1769j0191m09K364N34J4124L098r617
$$ 401330 385202 398732 392311 383674 386909 398678 388487 388078 390442 390976 405100 408198 398581
15129C98581j4633J3704L4380R172k8763j4502J6369J8392k5354O218L6804K5823
$$ 398581 383948 397652 432032 441204 412441 397939 414308 432700 407346 413564 450368 476191
15117D76191P891q481j2698p969j2896j8494j1826K5363L9224q534k2701k5527
$$ 476191 484082 475601 462903 454934 442038 423544 411718 437081 476305 467771 445070 419543
15105D19543K2621J6596j8398J0150K5334l1443l134K0866L2626Q762j6298o224
$$ 419543 442164 458760 440362 450512 475846 444403 441269 462135 494761 503523 487225 481001
15093D81001K516N011J1276j0575J181j7796L3569L1067k1871l7500R638O386
$$ 481001 483517 488528 499804 489229 490410 472614 506183 537250 515379 477879 487517 493903
15081D93903M46J5572J11j1181n792n404L592p80J8746K1897m221k5537K788J9776
$$ 493903 494349 509921 510032 498851 493059 487655 491247 490467 509213 531110 526889 501352 504140 523916
15067E23916R520L099o488K8193K4702j135q750l1733n940J3157O699J0734m886
$$ 523916 533436 536535 530047 558240 582942 581807 573057 541324 535384 548541 555240 565974 561088
15054E61088K681j7929j911k0615j7607M539k9405q403L8899K0169L681J8839
$$ 561088 563769 545840 543929 523314 505707 510246 480841 472438 511337 531506 535187 554026
15042E54026k554k0647l560J3928J0743J8030k8130M793M7334l945l903j476k0948
$$ 554026 551472 530825 527265 541193 551936 569966 541836 546629 593963 590018 586115 584639 563691
15029E63691j4769N073N853k977Q533Q225M311l613K028j1411j6203j2582J4537
$$ 563691 548922 553995 559848 556871 565404 573629 577940 574327 576355 564944 548741 536159 550696
15016E50696J0741P503L933j5561j1549K4432K5606J8303j2238N823J3860K0294
$$ 550696 561437 568940 572873 557312 545763 570195 595801 614104 601866 607689 621549 641843
15004F41843K2978L814K5137K3223K3204K509K6597L3465N1438m4858j39480j25081
$$ 641843 664821 668635 693772 716995 740199 742708 769305 802770 854208 809350 669870 544789
14992E44789j29226r0112j2888K3916K4064L3590K8949L8052j8345j9309J2240
$$ 544789 415563 325451 312563 336479 360543 394133 423082 461134 442789 423480 435720
14981D35720K133o394l828K8098M3376J702K9558J3156p888J3318L584j847o328
$$ 435720 437853 431459 427631 455729 499105 500807 530365 543521 535633 548951 552535 550688 544360
14968E44360J584j3773j3895J4835L1018L6917M486j1122l5469k0201r580O481
$$ 544360 545944 532171 518276 533111 564129 601046 605532 594410 558941 538740 529160 535641
14956E35641J9494Q022K0452M2330r497Q665L0425j879n4747l0782j3304l010
$$ 535641 555135 563157 583609 625939 616442 625107 655532 653653 598906 568124 554820 551810
14944E51810N180l1891K3238J2200j6142K1279K7687j909n444K1746L354K475
$$ 551810 556990 525099 548337 560537 544395 565674 593361 591452 586008 607754 611108 613583
14932F13583k1626k3246L867j6623n940k112L2982O511m453p515j5820k096K8282
$$ 613583 591957 568711 572578 555955 550015 547903 580885 587396 582943 575428 559608 557512 585794
14919E85794J896J1401p643j8779k0145L1898L6151R787n468L842j0763j0626
$$ 585794 587690 599091 591448 572669 552524 584422 620573 630360 624892 628734 617971 607345
14907F07345n062J5357J1683j681m78j7888n462J506j0094R401K2973L5287K1071
$$ 607345 602283 617640 629323 627642 627164 609276 603814 605320 595226 604627 627600 662887 683958
14894F83958l0022l7766J8899R558r368j6905M158J6526R642J6959R376K4613
$$ 683958 653936 616170 635069 644627 635259 618354 622512 639038 648680 665639 675015 699628
14882F99628q856m1164k1910j4435k6305j5684L8858L6131L926J707J3209l3968
$$ 699628 690772 649608 627698 613263 586958 571274 610132 646263 650189 651896 665105 631137
14870F31137m658k186J6041K0695L878j2707r896L1603N41n657M356J5115k522
$$ 631137 626479 624293 640334 661029 664907 652200 642304 673907 674448 668791 673147 688262 685740
14857F85740j9533l7196P166K0152k846j2498J2482M307K1466J8937j3918l6819
$$ 685740 666207 629011 636177 656329 653483 640985 653467 657774 679240 698177 684259 647440
14845F47440j8790M058J1249L7718L2822k0414j4030l8432k2090M181p255K9209
$$ 647440 628650 632708 643957 681675 714497 694083 680053 641621 619531 623712 616457 645666
14833F45666K7153M145K0208P61J2386k92k0495j4116k8610L6138J565k471R595
$$ 645666 672819 676964 697172 697933 710319 710027 689532 675416 646806 682944 684509 682038 691633
14820F91633N081r634J1111M026L156M645J5214j1818R697N660m522o78k5840
$$ 691633 696714 687080 698191 702217 705373 710018 725232 713414 723111 728771 724249 723571 697731
14807F97731L910K8172L0166j6758j5583j8206J0580j0192m033k2328J7332J4096
$$ 697731 701641 729813 759979 743221 727638 709432 720012 709820 705787 683459 700791 714887
14795G14887l316J7311K9468j1854m8032O754L0253L1704j5088K1458K5172j9035
$$ 714887 711571 728882 758350 746496 698464 705218 735471 767175 752087 773545 798717 779682
14783G79682l848q262j7820J68K4007K0889J4146j9071j6811l725j0417Q099J7971
$$ 779682 775834 767572 749752 749920 773927 794816 808962 789891 773080 769355 758938 767037 785008
14770G85008P973N528k489n562K2094j8714j7382j1800K6731R538k1568J9297
$$ 785008 792981 798509 796020 790458 812552 793838 776456 764656 791387 800925 779357 798654
14758G98654k0884l8763K3353J6053O518K456R320K1239q668r267k7641L608K8364
$$ 798654 777770 739007 762360 778413 784931 787387 796707 817946 809278 800011 772370 775978 804342
14745H04342K8778n169P88l3236j0162O862R715j5314J5989L4913j5392k9735
$$ 804342 833120 827951 828739 795503 785341 792203 801918 786604 802593 837506 822114 792379
14733G92379K4255J8273L599k0857J0389r71k1828l2263J0003K0502N172j5136
$$ 792379 816634 834907 838506 817649 828038 827067 805239 772976 782979 803481 808653 793517
14721G93517J7097l1846R6K0647P519k3605p481K874K5579q518J8261J4833j525
$$ 793517 810614 778768 778864 799511 807030 783425 775944 778818 804397 795879 814140 828973 827448
14708H27448m656Q783J4202P118J379k0367j9210J7539q315J416N922N191j1218
$$ 827448 822792 831575 845777 852895 854274 833907 814697 832236 823921 825337 831259 836450 825232
14695H25232j7820j0498J4307M2512J4467k4881J4736n258k0935J58k5652M3953
$$ 825232 807412 796914 811221 853733 868200 843319 858055 852797 831862 832020 806368 850321
14683H50321J2472k5015Q676J9430j9137Q243J7491j1061J5170J0209j2634k0571
$$ 850321 862793 837778 846454 865884 846747 854990 872481 861420 876590 886799 874165 853594
14671H53594p695J1442l377j5922m1251J5042J0220J8975k486j1182j730Q870
$$ 853594 845899 857341 853964 838042 796791 811833 822053 841028 838542 827360 825630 834500
14659H34500K5975n058r543j2995n051J5673J2667m242J1220K2792k5632P489
$$ 834500 860475 855417 845874 832879 827828 843501 856168 851926 863146 885938 860306 867795
14647H67795J8133K579J6353R567J2987q333l697J0900k9078j3895j018J5616
$$ 867795 885928 888507 904860 914427 927414 919081 915384 926284 897206 883311 882293 897909
14635H97909J7274k237j0775M332k558r023J5396L5047R771m2191j4141L5671
$$ 897909 915183 912946 902171 906503 903945 894922 910318 945365 955136 912945 898804 934475
14623I34475M831m299j4434J1732q088O995J3771J3707O791M491m4078l0670q008
$$ 934475 939306 935007 920573 932305 924217 931212 944983 958690 965481 969972 925894 895224 887216
14610H87216J1048J880M512K0064Q687l690J4538q307Q823J4367J8946j2862j0706
$$ 887216 898264 900144 904656 924720 933407 929717 944255 935948 944771 959138 978084 965222 954516
14597I54516m327k0150L600J4684m127J143K2203K2149k6658o889O118j5345K1812
$$ 954516 950189 930039 933639 948323 944196 945339 967542 989691 963033 956144 962262 946917 968729
14584I68729J1809m0231k1697Q143J57k108l5663K0821L3568J4516J6312q529
$$ 968729 980538 940307 918610 926753 926910 924802 889139 909960 943528 958044 974356 965827
14572I65827k5542l934J5480p007J4319J2166l7597R252L4557k937j6694k0910
$$ 965827 940285 936351 951831 944824 959143 971309 933712 942964 977521 974584 957890 936980
14560I36980J5174P780K0162K2955M412Q378l7170p964O546O321J4075K7741j878
$$ 936980 952154 959934 980096 1003051 1007463 1015841 978671 970707 977253 983574 997649 1025390 1023512
14547A023512l1833j3542L843o774p39n178J3868J4805M099L091K1582K944j5180
$$ 1023512 991679 978137 981980 975206 974467 969289 983157 997962 1002061 1005152 1026734 1029678 1014498
14534A014498j4250L1255O30j3102j4566K60J7464P651l203R543M559L1431L064
$$ 1014498 1000248 1031503 1032133 1019031 1004465 1004725 1022189 1029840 1026637 1036180 1040739 1072170 1075234
14521A075234O794j7027k4577m478k4437k5313J7131M0898J5312J3361j4676k9414
$$ 1075234 1082028 1065001 1040424 1035946 1011509 986196 1003327 1044225 1059537 1072898 1058222 1028808
14509A028808r670M005K7591M1244J170m4949j1429k084K3874Q935k0045k2353
$$ 1028808 1019138 1023143 1050734 1091978 1093148 1048199 1036770 1034686 1058560 1067495 1047450 1025097
14497A025097K503k664P397l78K5210r999j6129k5035l5939J9525O0037M3986
$$ 1025097 1027600 1024936 1032333 1031955 1057165 1047166 1031037 1006002 970063 989588 1049625 1093611
14485A093611R426j8823l0783P65L2137M0667k1361o060Q168p926k042J5100p149
$$ 1093611 1103037 1084214 1053431 1054196 1086333 1127000 1105639 1099579 1107747 1099821 1097779 1112879 1105730
14472A105730p447J0114K4499O497o752p710k2049p448J2134P049M272K5354j9312
$$ 1105730 1098283 1108397 1132896 1139393 1132641 1124931 1102882 1095434 1107568 1114617 1118889 1144243 1124931
14459A124931j1045O791J1120M544j3112k5273J2282J1735J9753M725J136m464
$$ 1124931 1113886 1120677 1131797 1136341 1123229 1097956 1110238 1121973 1141726 1146451 1147587 1143123
14447A143123j3472p118k754j6436k2956J4124M07P123J3145j9418K716n156O669
$$ 1143123 1129651 1122533 1119779 1103343 1080387 1094511 1094918 1102041 1115186 1095768 1098484 1093328 1099997
14434A099997L5036O715L433K6400L51r910K206J5556l9817j2208O022J5943j2493
$$ 1099997 1135033 1141748 1145181 1171581 1171932 1162022 1164228 1179784 1139967 1127759 1133781 1149724 1137231
14421A137231j2718k6292J2611L2964J8113N500N901J1208q162L522M2184j3846
$$ 1137231 1124513 1098221 1110832 1143796 1161909 1167409 1173310 1184518 1176356 1179878 1222062 1208216
14409A208216l3801k1282J1746L065m400m396M3266M315k0164l3212M532k9081
$$ 1208216 1174415 1153133 1164879 1167944 1163544 1159148 1202414 1206729 1186565 1153353 1157885 1128804
14397A128804k227K1181J581J2446o322J9962J7959k312q277J6295o649J982k4996
$$ 1128804 1126577 1147758 1149339 1161785 1155463 1175425 1193384 1191072 1182795 1199090 1192441 1194423 1169427
14384A169427j1051O291q372J5737K0098K2800K402k6528J927Q415K7445L783
$$ 1169427 1158376 1164667 1156295 1172032 1192130 1214930 1217332 1190804 1192731 1201146 1228591 1232374
14372A232374l72J6137m3599k1270J4457K6917J0255l4609J0954J2753J5355K7268
$$ 1232374 1232002 1248139 1204540 1183270 1197727 1224644 1234899 1200290 1211244 1223997 1239352 1266620
14360A266620k8364j6849j002k7730k2566R18O255L5337p599k9024K8173K6207
$$ 1266620 1238256 1221407 1220405 1192675 1170109 1171027 1177282 1212619 1205020 1175996 1204169 1230376
14348A230376J2576J5218p879p721j1911K3435R801p100K0237q353k1414n807
$$ 1230376 1242952 1258170 1250291 1242570 1230659 1254094 1263895 1256795 1277032 1268679 1247265 1241458
14336A241458J3755K1817J0882N539J3244l8146P023L1027J0594k2883k4126j2500
$$ 1241458 1255213 1277030 1287912 1293451 1306695 1268549 1275572 1306599 1317193 1294310 1270184 1257684
14324A257684O453l281R532L9869L3009n192j9575k4740j072k424K1301K6502
$$ 1257684 1264137 1260856 1270388 1310257 1343266 1338074 1318499 1293759 1292687 1290263 1311564 1338066
14312A338066l7156m8777j7861M340K4902M8204J8427l7003k7846q436K717Q829
$$ 1338066 1300910 1252133 1234272 1238612 1263514 1311718 1330145 1293142 1265296 1256860 1259577 1268406
14300A268406K2451J4577j5125o716K0484Q473K217o103P141J4330N472j2986
$$ 1268406 1290857 1305434 1290309 1283593 1304077 1312550 1314767 1308664 1315805 1330135 1335607 1322621
14288A322621L461J0452j994p065m817N81J0226K6430J1448j8389m2884J5794
$$ 1322621 1326082 1336534 1334540 1327475 1322658 1323239 1333465 1359895 1371343 1352954 1310070 1325864
14276A325864L5904p277j9127j913j921l630K3490j1667K3815L5585J913k0417
$$ 1325864 1361768 1354491 1335364 1333451 1331530 1327900 1351390 1339723 1363538 1399123 1401036 1380619
14264A380619R401P378n04m7949J4259M7128j0451k9434K2012Q704j8414L510
$$ 1380619 1390020 1397398 1396894 1348945 1363204 1410332 1399881 1370447 1392459 1401163 1382749 1386259
14252A386259O776p550j0105o148m643J9443l135J1993J9429J3379k456L3093
$$ 1386259 1393035 1385485 1375380 1369232 1364589 1384032 1380897 1392890 1412319 1425698 1423242 1456335
14240A456335o184j0139l3653R291L4793j9610Q949Q261j6024n8568J9155L4086
$$ 1456335 1450151 1440012 1406359 1415650 1450443 1430833 1439782 1448043 1432019 1373451 1392606 1426692
14228A426692K0568r308j9149J8111K4789k9526J8783n729P149J9641J8077k6795
$$ 1426692 1447260 1437952 1418803 1436914 1461703 1432177 1450960 1445231 1452380 1472021 1490098 1463303
14216A463303m3037n607L6918L2286N18j0826j2307k2465j726J5468j061j443
$$ 1463303 1420266 1414659 1451577 1483863 1484381 1473555 1461248 1438783 1437057 1452525 1451464 1450021
14204A450021r043Q289J8142O560K3190m121K281L10j4385K0995L5205j7653k7541
$$ 1450021 1440978 1449267 1467409 1473969 1497159 1493038 1495319 1495629 1481244 1502239 1537444 1519791 1492250
14191A492250J0884j0328p477l470J3093J879j0690J079J6810J7492L6233J0408
$$ 1492250 1503134 1492806 1485329 1481859 1494952 1496831 1486141 1487220 1504030 1521522 1557755 1568163
14179A568163j3508j6589P266j8945q117J2508K7548k483j5011K8416k6377j2260
$$ 1568163 1554655 1538066 1545332 1526387 1518270 1530778 1558326 1555843 1540832 1569248 1542871 1530611
14167A530611p796k005J3144K1374m107j81J8002l8820P386L0123J7663L523J3119
$$ 1530611 1522815 1520810 1533954 1555328 1551221 1551040 1569042 1530222 1537608 1567731 1585394 1588917 1602036
14154A602036J1526m5636l457J5667K6885q646j5123N739O466J6756J4765m9062
$$ 1602036 1613562 1567926 1564469 1580136 1607021 1598375 1583252 1588991 1595457 1612213 1626978 1577916
14142A577916m0448R60J4319N124l419K1509j1769J3605N458n295J99P812K2955
$$ 1577916 1537468 1538428 1552747 1557871 1554452 1575961 1564192 1577797 1583255 1577960 1578159 1585971 1608926
14129A608926j4032j8241L2417J4124k8108l416J6945l359l1425j4037j1053M367
$$ 1608926 1594894 1576653 1609070 1623194 1595086 1591670 1608615 1605256 1573831 1559794 1548741 1553108
14117A553108K6721l218J3604N169p059K3903q050L6827J7902n894j6306k8972
$$ 1553108 1579829 1576611 1590215 1595384 1588325 1612228 1604178 1641005 1658907 1653013 1636707 1607735
14105A607735J9277L9897K2542P52N602o888j2081K6522l0496m0405O059N3386
$$ 1607735 1627012 1666909 1689451 1690203 1695805 1688917 1676836 1703358 1672862 1632457 1638516 1691902
14093A691902J8756k5029l3571J838L1592J0798o80L3054l5326l8342J225P347
$$ 1691902 1710658 1685629 1652058 1653896 1685488 1696286 1695606 1728660 1693334 1654992 1656217 1663564
14081A663564J8892P354K998l8964m460j8599J2023J0705J3945P665j964j5619
$$ 1663564 1682456 1689810 1692808 1653844 1649384 1630785 1642808 1653513 1667458 1675123 1673159 1657540
14069A657540J8504m586M019r003K8251J6556k9374J4449K8257O6j6550J6696
$$ 1657540 1676044 1671458 1675477 1666474 1694725 1711281 1681907 1696356 1724613 1724679 1708129 1724825
14057A724825M153j8275o795l345K5031Q10M2923K2013p501N085j0124j8108k8105
$$ 1724825 1728978 1710703 1703908 1700563 1725594 1726404 1769327 1791340 1783839 1788924 1778800 1760692 1732587
14044A732587p669J5080J0363M44R465j7801j4792k883J8764o286j5698k336J4777
$$ 1732587 1724918 1739998 1750361 1750805 1760270 1742469 1727677 1724794 1743558 1737272 1721574 1719238 1734015
14031A734015Q992j1237J5834K9405o5q730k0162k6490J1934L1922j3145J110
$$ 1734015 1743007 1731770 1747604 1777009 1776944 1768214 1748052 1721562 1733496 1765418 1752273 1753383
14019A753383J9129J2475K2775m819j8186q166J1205J5817n1J843M819K2752k766
$$ 1753383 1772512 1784987 1807762 1802943 1784757 1776591 1787796 1803613 1803562 1805405 1810224 1832976 1830210
14006A830210K2850K141j510q425M216j9533l4320J0386R797N962l01j2829k803
$$ 1830210 1853060 1855201 1853691 1845266 1849482 1829949 1795629 1806015 1815812 1821774 1821473 1808644 1805841
13993A805841J1872L563J0754l874J5064R304l548J705K2960L3432R19k1565J2907
$$ 1805841 1817713 1821276 1832030 1828156 1843220 1852524 1848976 1850681 1873641 1907073 1907992 1886427 1899334
13980A899334j1328J5927r721l7909J8572L6111K6489j2445k0975n403Q683R330
$$ 1899334 1888006 1903933 1894212 1856303 1874875 1910986 1937475 1925030 1904055 1898652 1907335 1916665
13968A916665K7000J8316l2163k4522Q607j5931J4622J2874j7608J1603Q303m272
$$ 1916665 1943665 1961981 1929818 1905296 1913903 1897972 1912594 1925468 1907860 1919463 1927766 1923494
13956A923494j8162p835P339J2463q724k413M4417M8082m460p381l00K736j8555
$$ 1923494 1905332 1897497 1904836 1917299 1908575 1906162 1950579 1998661 1994201 1986820 1986520 1989256 1970701
13943A970701k5687k0469J6924r19l425j4554n497L311K5669r00j3484L44N754
$$ 1970701 1945014 1924545 1941469 1940550 1937125 1922571 1917074 1920385 1946054 1945154 1931670 1932014 1937768
13930A937768P089K3881K5538j8716m643J9486J1772M0J9392m718K7424J6614
$$ 1937768 1944857 1968738 1994276 1975560 1970917 1990403 2002175 2002215 2021607 2016889 2044313 2060927
13918B060927l7012l5225N941J5155K2012j5829n1861J0201J1394L0731K1641
$$ 2060927 2023915 1988690 1994631 2009786 2031798 2015969 1964108 1974309 1985703 2016434 2038075
13907B038075J4502J6032q737Q582l969o085j4642o55J959j1928o956J0399q560
$$ 2038075 2052577 2068609 2059872 2068454 2064485 2058400 2043758 2043103 2045062 2033134 2026178 2036577 2028017
13894B028017K8326J1159K005J36K554q51J4447j638M915n592k4264J1979J7737
$$ 2028017 2056343 2067502 2069507 2069643 2072197 2071346 2085793 2084155 2089070 2083478 2059214 2071193 2088930
13881B088930K6686K6024N921j2815N725j9186K108O2277K8081m6368k4412n599
$$ 2088930 2115616 2141640 2147561 2134746 2140471 2121285 2123393 2185670 2213751 2167383 2142971 2137372
13869B137372Q482j1982j4006L5636L4862K7180r433j4788k7386o679J7840J9144
$$ 2137372 2145854 2133872 2119866 2155502 2190364 2217544 2208111 2193323 2165937 2159258 2177098 2196242
13857B196242k2197k532k2746O74L017R08j0918J0529N8961L578j7456q160O756
$$ 2196242 2174045 2171513 2148767 2149441 2152458 2153366 2142448 2152977 2211938 2215516 2198060 2189900 2196656
13844B196656j4924J9840L6773k5701k985J1122n090j229j700L8380M8166j6401
$$ 2196656 2181732 2201572 2238345 2212644 2209659 2220781 2215691 2214462 2212762 2251142 2299308 2282907
13832B282907m4293j4735J6801j5176K1248J4080k323o174L3505R386j2078l6381
$$ 2282907 2238614 2223879 2240680 2225504 2246752 2260832 2258509 2252335 2285840 2295226 2283148 2246767
13820B246767J3659K2130n985k5764j0032q106J5177M1905J7696j2800J0573k2180
$$ 2246767 2260426 2282556 2276571 2250807 2240775 2232669 2247846 2289751 2307447 2294647 2305220 2283040
13808B283040J4095K6362j0826K0747J4805J6000k973N703j2115k3154l0753j8507
$$ 2283040 2297135 2323497 2312671 2333418 2348223 2364223 2361250 2366953 2354838 2331684 2300931 2282424
13796B282424J2030l812O58J5821O817K0230O010J6052j6355P624j65j597j5370
$$ 2282424 2294454 2290642 2291300 2307121 2313938 2334168 2340178 2356230 2339875 2347499 2347334 2345737 2330367
13783B330367j1061Q499J8369J1939K5121n860o745k1499J2543L8970j5638P715
$$ 2330367 2319306 2327805 2346174 2358113 2383234 2377374 2370629 2349130 2361673 2400643 2385005 2392720
13771B392720q365J0164K9033j0881R735j3147Q413K5267m3543j6567K0761R762
$$ 2392720 2384355 2394519 2423552 2412671 2422406 2409259 2417672 2442939 2399396 2382829 2403590 2413352
13759B413352K9520K134j3973J9311L6034J5732m7015l8128K4181J7474J1624
$$ 2413352 2442872 2445006 2431033 2450344 2486378 2502110 2455095 2416967 2441148 2458622 2470246
13748B470246K3392p374m7475l952J7786J5345L1645O000j8130j6419j548K6992
$$ 2470246 2493638 2486264 2438789 2434837 2452623 2467968 2499613 2505613 2487483 2471064 2469516 2496508
13736B496508r09j7882M793J9001L3641K7457o004n796p943l0740J4201J9018
$$ 2496508 2495599 2477717 2482510 2501511 2535152 2562609 2556605 2550809 2542866 2512126 2526327 2545345
13724B545345Q328l8527j4775K2416N5341J5361L85j2576p091O496p658j7669
$$ 2545345 2553673 2515146 2500371 2522787 2578128 2593489 2593874 2581298 2574207 2580703 2573045 2555376
13712B555376J1802J3921J1202J146J119N660m003k391J1628M5398J5579k5303
$$ 2555376 2567178 2581099 2592301 2593447 2594566 2600226 2596223 2593832 2605460 2650858 2666437 2641134
13700B641134J6462L1L542k5526r117J3527K7258M424l1631J38J8549J0119L831
$$ 2641134 2657596 2657627 2661169 2635643 2626526 2640053 2667311 2671735 2640104 2640242 2658791 2668910 2672741
13687B672741L624q244j6957K1785K97J4372J155J2577j5112R735J2775J3608
$$ 2672741 2676365 2668121 2651164 2672949 2673246 2687618 2688773 2701350 2686238 2695973 2708748 2722356
13675B722356J106O648j9628K5618L663m986J0419j0795j3556j3850K4173K9499
$$ 2722356 2723462 2730110 2710482 2736100 2739763 2734777 2745196 2734401 2720845 2706995 2731168 2760667
13663B760667M314L489J9621O942k3881r462L136k1923K4131M4464J9784p67n534
$$ 2760667 2764981 2768470 2788091 2795033 2771152 2761690 2764826 2742903 2767034 2811498 2831282 2830515 2824981
13650B824981M627k3966j3027J1428O447j5185j0607J9000n292J7264M3355q844
$$ 2824981 2829608 2805642 2792615 2804043 2810490 2795305 2784698 2803698 2798406 2815670 2859025 2850181
13638B850181P477K1160K2609J261k9951j1415m307J4759P137m039j053j648P981
$$ 2850181 2857658 2878818 2901427 2902688 2872737 2861322 2857015 2871774 2878911 2874872 2873819 2872171 2880152
13625B880152L8177J6743q044j5901k6504K8849J6705j8545L4373J5321l0325
$$ 2880152 2918329 2935072 2927028 2911127 2884623 2913472 2930177 2911632 2946005 2961326 2931001
13614B931001P361J2379M982J4746k4820K643K4662J4808k1700k908M6195R810
$$ 2931001 2938362 2950741 2955723 2970469 2945649 2948292 2972954 2987762 2966062 2963154 3009349 3019159
13602C019159j2859q552k8016k6776K7136K6537m055K1523N551j4389J1431K5586
$$ 3019159 3006300 2997748 2969732 2942956 2970092 2996629 2992574 3014097 3019648 3005259 3016690 3042276
13590C042276K875L685l438K53O755m412J5851J8341k195L0726R547k1203L865
$$ 3042276 3045151 3048836 3045398 3045651 3052406 3047994 3063845 3082186 3079991 3110717 3120264 3099061 3102926
13577C102926Q381J9436j585O002J8514Q66l6657k7730N884L1173j5726K1326
$$ 3102926 3111307 3130743 3129158 3135160 3153674 3154540 3117883 3090153 3096037 3127210 3111484 3132810
13565C132810M689l4307N422J9122L7412N947l566J0850K1470M599N898K8114
$$ 3132810 3137499 3103192 3108614 3127736 3165148 3171095 3167529 3178379 3199849 3204448 3210346 3238460
13553C238460k785m0050R574K7239N017N138P25K7221L6944o451J5138k0946n597
$$ 3238460 3235675 3195625 3205199 3232438 3237455 3242593 3243318 3270539 3307483 3301032 3316170 3295224 3289627
13540C289627J4099P389j2376o416j17K7298K1315L670l2610N338K7270o365j3748
$$ 3289627 3303726 3311115 3298739 3292323 3292206 3319504 3340819 3344489 3311879 3317217 3344487 3338122 3324374
13527C324374k5615K0797J1037R272K94M171j2404K0069J7606L991P477l130j4740
$$ 3324374 3298759 3319556 3330593 3339865 3340159 3344330 3331926 3351995 3369601 3373592 3381069 3377939 3363199
13514C363199n588K6281L9671k575k0025j4885r005J4187N097J1098P573m248
$$ 3363199 3357611 3383892 3423563 3420988 3400963 3386078 3377073 3391260 3396357 3407455 3415028 3410780
13502C410780L4869M4281J4324j9689m322K4498l0342O508J4759j2046O83O496
$$ 3410780 3445649 3489930 3504254 3484565 3480243 3504741 3474399 3480907 3495666 3483620 3484303 3490799
13490C490799J1325J6749J5973J2776j251L062j9279r725N3650L2431j3880J0005
$$ 3490799 3502124 3518873 3534846 3547622 3546371 3549433 3530154 3520429 3574079 3606510 3592630 3602635
13478C602635K2668k4451j783R418K6234j0305P958M3960K021k6852k3286K591
$$ 3602635 3625303 3600852 3599069 3608487 3634721 3624416 3632374 3676334 3678355 3651503 3628217 3630808
13466C630808J4008l802P0587J3486o616J844J5409k9296j1709L0702K4581j3972
$$ 3630808 3644816 3641014 3711601 3725087 3718471 3720315 3735724 3706428 3694719 3725421 3750002 3736030
13454C736030P848q323j7520j0766N06L436J4153k021j898L0020L2899L9812J5780
$$ 3736030 3743878 3735555 3718035 3707269 3707775 3711211 3725364 3723343 3721445 3751465 3784364 3824176 3839956
13441C839956k556r110J2794m689k263k9388N960K8617p888j7787j8776L6382
$$ 3839956 3837400 3828290 3841084 3836395 3834132 3804744 3810704 3839321 3831433 3813646 3794870 3831252
13429C831252M814K8127j6019J0456L8316L3190K6879n028j6086K347j7632q9
$$ 3831252 3836066 3864193 3848174 3858630 3896946 3930136 3957015 3951987 3935901 3938248 3920616 3920527
13417C920527N226j904p099L4904K3627o40K935k787K976J4888M781J0837J1171
$$ 3920527 3925753 3923849 3916750 3951654 3975281 3974641 3977576 3974789 3977765 3992653 3997434 4008271 4019442
13404D019442r161K622j1246L1375J0802j1263P325J4732K4435P94j4409P632
$$ 4019442 4010281 4012903 4001657 4033032 4043834 4032571 4039896 4054628 4079063 4079857 4065448 4073080
13392D073080J3382M7406K5500n1939j3643J0824j897J0998J2135k551N841K9307
$$ 4073080 4086462 4133868 4159368 4107429 4093786 4104610 4102713 4113711 4125846 4123295 4129136 4158443
13380D158443L4319j3429l1414L530J7736J5231L1009L4070J5645P261Q215K1542
$$ 4158443 4192762 4179333 4147919 4151449 4169185 4184416 4215425 4249495 4265140 4272401 4280616 4302158
13368D302158L42j5392J2392R686N455r036j36K4241O379P64n48M8769J573l0810
$$ 4302158 4302500 4287108 4299500 4309186 4314641 4305605 4305469 4329710 4336089 4336853 4336305 4385074 4386647 4355837
13354D355837J768o661j2546K9472L7762J4238J4165N389j4176k795K9917R102
$$ 4355837 4357605 4350944 4338398 4367870 4405632 4419870 4434035 4439424 4425248 4422453 4452370 4461472
13342D461472O3788K3742j9827j6810j6100m283k5506J5743M7424M5199m090j9099
$$ 4461472 4525260 4549002 4529175 4512365 4496265 4491982 4466476 4482219 4529643 4574842 4570752 4551653
13330D551653j8342K7289L4971P9p469J455J8936K9280J3855R203J5273J7175
$$ 4551653 4533311 4560600 4595571 4595650 4588181 4589636 4608572 4637852 4651707 4660910 4676183 4693358
13318D693358k3718k5086j170L2365L8284J7076k3338K0620J2332j517n533P68
$$ 4693358 4669640 4644554 4643384 4675749 4714033 4731109 4707771 4728391 4740723 4739206 4733673 4734441
13306D734441K6818K4834L5155L1646P952J2222J1239p968j466Q876q401P128
$$ 4734441 4761259 4786093 4821248 4852894 4860846 4873068 4884307 4876339 4874873 4883749 4875348 4882476
13294D882476J7018R660j2250m543L3351L2174L4088K5313j0958o291O576N97
$$ 4882476 4899494 4909154 4896904 4892361 4925712 4957886 4991974 5017287 5006329 5000038 5006614 5007211
13282E007211L1070K3906K9311P643M3535O846K0921q976j9463J4622K1825k3995
$$ 5007211 5038281 5062187 5091498 5099141 5142676 5149522 5170443 5161467 5142004 5156626 5178451 5154456
13270E154456J8079O6276O3767j4456j2637J9228J1233n525J0944J8142J1352
$$ 5154456 5172535 5238811 5302578 5288122 5275485 5294713 5305946 5300421 5311365 5329507 5340859
13259E340859R722K7243J2151k762N8250L3127K0188N3016K1071j0651r717J0998
$$ 5340859 5350581 5377824 5389975 5387213 5445463 5478590 5498778 5551794 5572865 5562214 5552497 5563495
13247E563495K8357M7976J5302L8637N3998L4607L2163N009L6631L680L6685L8595
$$ 5563495 5591852 5639828 5655130 5693767 5747765 5782372 5814535 5819544 5856175 5859855 5896540 5935135
13235E935135M4462P5412J05065P9615J03870J13688J75170J81047J15939j29106
$$ 5935135 5979597 6055009 6160074 6239689 6343559 6457247 6632417 6813464 6929403 6800297
13225F800297m72518n52918o44481m76980r6735N5041P5904J13325J57399R4708
$$ 6800297 6327779 5774861 5130380 4653400 4556665 4611706 4687610 4800935 4958334 5053042
13215E053042K8126K3496L0605L5238L9036K620J4492M9646M8052K6301K1080
$$ 5053042 5081168 5104664 5135269 5170507 5209543 5212163 5226655 5276301 5324353 5350654 5371734
13204E371734N3735K0860k171J7973J9432L4122M1366J3107k6845Q090J8447L0166
$$ 5371734 5425469 5446329 5444158 5462131 5481563 5515685 5557051 5570158 5543313 5551403 5569850 5600016
13192E600016J8544K9704N1354L22K3395J3025k3772M7309N7498J5943p852l743
$$ 5600016 5618560 5648264 5699618 5699940 5723335 5736360 5712588 5759897 5817395 5833338 5825486 5821743
13180E821743N9822O4149K8347p967j0353n408L8610J7764J8695K4131K5279M1788
$$ 5821743 5881565 5945714 5974061 5966094 5955741 5950333 5988943 6006707 6025402 6049533 6074812 6116600
13168F116600J4177j1180j5926K6206N0752N4808J756j5019j4808R253L1746K7254
$$ 6116600 6130777 6119597 6103671 6129877 6180629 6235437 6237193 6222174 6207366 6216619 6248365 6275619
13156F275619K8997P778K053O612K6003L7501L4774J4673O146J3084O434L1065
$$ 6275619 6304616 6312394 6314447 6321059 6347062 6384563 6419337 6434010 6440156 6453240 6459674 6490739
13144F490739L8266Q715K5773K6488j138q934M9476J2714J3550M1815J4822P570
$$ 6490739 6529005 6537720 6563493 6589981 6588843 6579909 6629385 6642099 6655649 6697464 6712286 6719856
13132F719856J9010K8719j2032o400J2119J456K2640K8647P411L2463M3468l982
$$ 6719856 6738866 6767585 6755553 6749153 6761272 6762728 6785368 6814015 6821426 6853889 6897357 6893375
13120F893375J3117M8454J2819j7885J7754M1125L4724j1400P844N1007L6458
$$ 6893375 6906492 6954946 6967765 6949880 6967634 7008759 7043483 7032083 7039927 7090934 7127392
13109G127392j2358k477M2831K9583L0528J5206K5458N6423M0060L8725L8895
$$ 7127392 7115034 7112557 7155388 7184971 7215499 7230705 7256163 7312586 7352646 7391371 7430266
13098G430266J7822q224K6187J0481j775K8003M0579K9814L079K3668O927l890
$$ 7430266 7448088 7439864 7466051 7476532 7474757 7502760 7543339 7573153 7576232 7599900 7606827 7602937
13086G602937j5946J0205L7875L0538M5545P8500N5991O31O467K1550p722n556
$$ 7602937 7586991 7597196 7635071 7665609 7711154 7789654 7845645 7846276 7852743 7874293 7866571 7861015
13074G861015K6240M2145M4804M8469M7219L6812M0524K8183L4578J3548J0097
$$ 7861015 7887255 7929400 7974204 8022673 8069892 8106704 8147228 8175411 8209989 8223537 8233634
13063H233634k6822L444K5419K5535J1615M4196J183J7235N9133M5008L5186N9135
$$ 8233634 8206812 8210256 8235675 8261210 8272825 8317021 8318204 8335439 8394572 8439580 8474766 8533901
13051H533901J8331K8771J7142J0586J6419M3103M685O875M5682M7863M5383J9941
$$ 8533901 8552232 8581003 8598145 8608731 8625150 8668253 8672938 8679813 8725495 8773358 8818741 8838682
13039H838682K4666M0304K9307J2146K2861L4270N1698N6830L6144O415L3798
$$ 8838682 8863348 8903652 8932959 8945105 8967966 9002236 9053934 9110764 9146908 9153323 9187121
13028I187121J3075N8477P0147P489P78n902M5657O0467Q2173J6814J0550J8748
$$ 9187121 9200196 9258673 9328820 9336309 9337087 9331185 9376842 9437309 9519482 9536296 9546846 9565594
13016I565594J7795P2372M3413O250n142N7391K3856K4376j1835q857J1051M9126
$$ 9565594 9583389 9655761 9699174 9705424 9700282 9757673 9781529 9805905 9794070 9785213 9796264 9845390
13004I845390M9932N8874O4429J7755K304L6158O3817M8597K9453P9520O5884
$$ 9845390 9895322 9954196 10018625 10036380 10038684 10074842 10138659 10187256 10216709 10296229 10362113
12993A0362113J8853L1359K7298M4456M3697M0034M3950M7774L0718L2616P2174
$$ 10362113 10380966 10412325 10439623 10484079 10527776 10567810 10611760 10659534 10690252 10722868 10795042
12982A0795042M9776M2973L2591L5959L4337L2792P8653L4700K5362M9013N9345
$$ 10795042 10844818 10887791 10920382 10956341 10990678 11023470 11102123 11136823 11162185 11211198 11270543
12971A1270543M9526N9960O2756L2099Q2955P1638N4075K7113L0138N8551K5523
$$ 11270543 11320069 11380029 11442785 11474884 11557839 11629477 11683552 11710665 11740803 11799354 11824877
12960A1824877M9617N5422R9662J12202J01900P7730J00109J20035Q8995L6488
$$ 11824877 11874494 11929916 12029578 12141780 12243680 12321410 12421519 12541554 12630549 12667037
12950A2667037k4337J7060N551N0182N3806N4173O1021M3554O5961J2077O7169
$$ 12667037 12642700 12659760 12665311 12715493 12769299 12823472 12884493 12928047 12994008 13006085 13073254
12939A3073254O9423M4124N0524R2566J38758N0401M7804Q2835O8576R7221J04487
$$ 13073254 13142677 13186801 13237325 13329891 13468649 13519050 13566854 13649689 13718265 13815486 13919973
12928A3919973O8896Q0551P2940N669N718J2418L8031L6833R2857J27787J41819
$$ 13919973 13988869 14069420 14142360 14148029 14153747 14166165 14204196 14241029 14333886 14461673 14603492
12917A4603492J01584R7142R1726O6335L2198J3342O6326R9796P7175P4814J08892
$$ 14603492 14705076 14802218 14893944 14960279 14992477 15005819 15072145 15171941 15249116 15323930 15432822
12906A5432822R2458R8605R3959J07368J22935J13869Q1012J01250J16475R2390
$$ 15432822 15525280 15623885 15717844 15825212 15948147 16062016 16143028 16244278 16360753 16453143
12896A6453143Q6275J43256J46998J01006J09218R6512P3669P3084M4951j5507
$$ 16453143 16539418 16682674 16829672 16930678 17039896 17136408 17210077 17283161 17328112 17312605
12886A7312605K33O7981P8955O9110J14419J71251K14550K27416J81440J69526
$$ 17312605 17312838 17380819 17459774 17528884 17643303 17814554 18029104 18256520 18437960 18607486
12876A8607486J75038J57738J65385J55716J82503J49997J58999J96507J60038
$$ 18607486 18782524 18940262 19105647 19261363 19443866 19593863 19752862 19949369 20109407
12867B0109407J71829K06502J66636J59239J89442J89567J48002J41093J12172
$$ 20109407 20281236 20487738 20654374 20813613 21003055 21192622 21340624 21481717 21593889
12858B1593889J15674J33050J83258J89578K07060K31840K13189K32708K38246
$$ 21593889 21709563 21842613 22025871 22215449 22422509 22654349 22867538 23100246 23338492
12849B3338492K15569K44781K47450K47410K39332K42449K42387K33969K49886
$$ 23338492 23554061 23798842 24046292 24293702 24533034 24775483 25017870 25251839 25501725
12840B5501725K71032K48499K72647L23421K96779K71272L11655L77539L66742
$$ 25501725 25772757 26021256 26293903 26617324 26914103 27185375 27497030 27874569 28241311
12831B8241311L49155L82395L86847L74974L88073L87168L82149M03938L81886
$$ 28241311 28590466 28972861 29359708 29734682 30122755 30509923 30892072 31296010 31677896
12822C1677896M04940M09936M40893M81094N04137N61150N32598M98934M84001
$$ 31677896 32082836 32492772 32933665 33414759 33918896 34480046 35012644 35511578 35995579
12813C5995579N22242O19483O72893O67650O76589P19573Q27559Q60958Q75672
$$ 35995579 36517821 37137304 37810197 38477847 39154436 39874009 40701568 41562526 42438198
12804D2438198R08395R31953R64579R71019J041362J084292J126392J187406J288454
$$ 42438198 43346593 44278546 45243125 46214144 47255506 48339798 49466190 50653596 51942050
12795E1942050J344716J347317J403252J489465J616894J728972J884767J969308
$$ 51942050 53286766 54634083 56037335 57526800 59143694 60872666 62757433 64726741
12787F4726741K119599K268937K496515K757217L061478L385007L681647M054509
$$ 64726741 66846340 69115277 71611792 74369009 77430487 80815494 84497141 88551650
12779H8551650M592603N261475N881634O331635O963590P832152Q913875J0935245
$$ 88551650 93144253 98405728 104287362 110618997 117582587 125414739 134328614 145263859
12771A45263859J3380997J6530614K0529308K5561834L0113746K7733104q093901
$$ 145263859 158644856 175175470 195704778 221266612 251380358 279113462 271019561
12764B71019561q4552929j02196576j14183934j09222081m2022525k472720J2946315
$$ 271019561 186466632 84270056 -29913878 -139135959 -181158484 -183631204 -170684889
12757a70684889J7908692J7688192J4947311J2030798R455191P009880N253169
$$ -170684889 -152776197 -135088005 -120140694 -108109896 -98654705 -91644825 -86391656
12750h6391656M314806L565209L367051L322874L338751L218871L087996K858982
$$ -86391656 -82076850 -78511641 -75144590 -71821716 -68482965 -65264094 -62176098 -59317116
12742e9317116K642972K446667K255937K033426J803567J607776J449742J386655
$$ -59317116 -56674144 -54227477 -51971540 -49938114 -48134547 -46526771 -45077029 -43690374
12734d3690374J358464J262404J169650J126985J089226J053975J032730R90297
$$ -43690374 -42331910 -41069506 -39899856 -38772871 -37683645 -36629670 -35596940 -34606643
12726c4606643R60665R09988Q93806Q21075P18385O74678O69526O64437N58494
$$ -34606643 -33645978 -32735990 -31842184 -31021109 -30302724 -29628046 -28958520 -28294083 -27735589
12717b7735589N00773N00385N30290M90096M36257M52114M75921M60038M75624
$$ -27735589 -27234816 -26734431 -26204141 -25714045 -25277788 -24825674 -24349753 -23889715 -23414091
12708b3414091M03020L15374L01820L09867L06278M07785M75367M63012M90205
$$ -23414091 -23011071 -22695697 -22393877 -22084010 -21777732 -21369947 -20894580 -20431568 -19941363
12699a9941363M55008M50430L99083L39570L25340L12273L03004L28042L37335
$$ -19941363 -19486355 -19035925 -18636842 -18297272 -17971932 -17659659 -17356655 -17028613 -16691278
12690a6691278L45629L37034L56502L62637L59516L56678L73488L38672L45110
$$ -16691278 -16345649 -16008615 -15652113 -15289476 -14929960 -14573282 -14199794 -13861122 -13516012
12681a3516012L60331L16479L03867K59744K61160K47780K61978K34375K79361
$$ -13516012 -13155681 -12839202 -12535335 -12275591 -12014431 -11766651 -11504673 -11270298 -10990937
12672a0990937K96539L01513K68751L04590L18685L13726L15997K90005K73682
$$ -10990937 -10694398 -10392885 -10124134 -9819544 -9500859 -9187133 -8871136 -8581131 -8307449
12663h307449K86849K54372K36502K44858K72301K80420K42867K29237K34945
$$ -8307449 -8020600 -7766228 -7529726 -7284868 -7012567 -6732147 -6489280 -6260043 -6025098
12654f025098K50854K42567K09066K37846K51416K26448K19608K19485K12228
$$ -6025098 -5774244 -5531677 -5322611 -5084765 -4833349 -4606901 -4387293 -4167808 -3955580
12645c955580J64487J57650J45279J32284J45111J59100K53237L07184K62409
$$ -3955580 -3791093 -3633443 -3488164 -3355880 -3210769 -3051669 -2798432 -2491248 -2228839
12636b228839K31597K03656J56660J60692J92210J49268J43453J45958J73401
$$ -2228839 -1997242 -1793586 -1636926 -1476234 -1284024 -1134756 -991303 -845345 -671944
12627f71944J74355J35916R1660L0406O1660N3759K2488M2758M199l0270n5041
$$ -671944 -497589 -361673 -270013 -239607 -177947 -124188 -101700 -58942 -54743 -85013 -140054
12616a40054j12594j06673j03357j48476j95053k27263k50334k61229l09793l45209
$$ -140054 -252648 -359321 -462678 -611154 -806207 -1033470 -1283804 -1545033 -1854826 -2200035
12606b200035l51050l67579l64074m52366n07262m60137m70414m96499n14954
$$ -2200035 -2551085 -2918664 -3282738 -3735104 -4242366 -4702503 -5172917 -5669416 -6184370
12597f184370n55122n71707n38804n84865o13384n97801o30617o30356o43654
$$ -6184370 -6739492 -7311199 -7850003 -8434868 -9048252 -9646053 -10276670 -10907026 -11550680
12588a1550680o16062o22553n68468n81587n90708n66358n80252n34178n04120
$$ -11550680 -12166742 -12789295 -13357763 -13939350 -14530058 -15096416 -15676668 -16210846 -16714966
12579a6714966m81509m63306m23682l38674k77298k80879l35052m52595m02593
$$ -16714966 -17196475 -17659781 -18083463 -18422137 -18699435 -18980314 -19315366 -19767961 -20170554
12570b0170554l35946l21491k81346k21476k30343k15582j62047j77772j51203
$$ -20170554 -20506500 -20827991 -21109337 -21330813 -21561156 -21776738 -21938785 -22116557 -22267760
12561b2267760r4124j45797r5462j08302p2972o0630p9726n6711m1239l0050L181
$$ -22267760 -22361884 -22507681 -22603143 -22711445 -22784417 -22845047 -22924773 -22981484 -23022723 -23052773 -23049592
12550b3049592k053M295l470J0602J7393L1528L4931J8812N6481L9303M3172M6074
$$ -23049592 -23051645 -23047350 -23050820 -23040218 -23022825 -22991297 -22956366 -22937554 -22881073 -22841770 -22798598 -22752524
12538b2752524N6816L0404M9478N3046K8695O6290N6800M9153J03468R7286P3199
$$ -22752524 -22695708 -22665304 -22615826 -22562780 -22534085 -22467795 -22410995 -22361842 -22258374 -22161088 -22087889
12527b2087889P5383O3641O4823Q5739R5740P3954Q3193P3621O6856R5630Q4428
$$ -22087889 -22012506 -21948865 -21884042 -21798303 -21702563 -21628609 -21545416 -21471795 -21404939 -21309309 -21224881
12516b1224881R1451J13036N1519R4674R7790J04230M9139O2869R1800P9947Q3045
$$ -21224881 -21133430 -21020394 -20968875 -20874201 -20776411 -20672181 -20623042 -20560173 -20468373 -20388426 -20305381
12505b0305381Q1812Q9266Q4935Q5825Q9678R3532J20042R7156P5273O6253O7450
$$ -20305381 -20223569 -20134303 -20049368 -19963543 -19873865 -19780333 -19660291 -19563135 -19487862 -19421609 -19354159
12494a9354159Q2178O6786N7153Q1215O7254P9790Q6201Q0306P2802J07812R9513
$$ -19354159 -19271981 -19205195 -19148042 -19066827 -18999573 -18919783 -18833582 -18753276 -18680474 -18572662 -18473149
12483a8473149O6892N0644N4572O9239R4224J13300R6019R2719N2081M9775R1270
$$ -18473149 -18406257 -18355613 -18301041 -18231802 -18137578 -18024278 -17928259 -17835540 -17783459 -17733684 -17642414
12472a7642414Q5784O2087P3369J04447L9677N0193N9551P2189Q2249Q1846N8619
$$ -17642414 -17556630 -17494543 -17421174 -17316727 -17277050 -17226857 -17167306 -17095117 -17012868 -16931022 -16872403
12461a6872403N3928P8088N7420Q2752J30444R1269L6562O3790L0925R3116Q5937
$$ -16872403 -16818475 -16740387 -16682967 -16600215 -16469771 -16378502 -16341940 -16278150 -16247225 -16154109 -16068172
12450a6068172P4876P3365P6013M9253N8467N8318N2836M7868P7060O5432Q2171
$$ -16068172 -15993296 -15919931 -15843918 -15794665 -15736198 -15677880 -15625044 -15577176 -15500116 -15434684 -15352513
12439a5352513J10823Q0266O8887N2182M7352M6319P8219P1011O2246N4190O8752
$$ -15352513 -15241690 -15161424 -15092537 -15040355 -14993003 -14946684 -14868465 -14797454 -14735208 -14681018 -14612266
12428a4612266P3363P4212K9078J7575L5205P2468R7092P1199M5171K2716N3731
$$ -14612266 -14538903 -14464691 -14435613 -14418038 -14382833 -14310365 -14213273 -14142074 -14096903 -14074187 -14020456
12417a4020456Q2004P2338M0817M7061L0950N1672M7194N3929P5079P1491N9230
$$ -14020456 -13938452 -13866114 -13825297 -13778236 -13747286 -13695614 -13648420 -13594491 -13519412 -13447921 -13388691
12406a3388691L4793L2359O2851P8999N0525K0454K6265O3917J01999N7186J3725
$$ -13388691 -13353898 -13321539 -13258688 -13179689 -13129164 -13108710 -13082445 -13018528 -12916529 -12859343 -12845618
12395a2845618L3084L1269N3550M4664N7276M5066J6845O4147N4602N2854M4443
$$ -12845618 -12812534 -12781265 -12727715 -12683051 -12625775 -12580709 -12563864 -12499717 -12445115 -12392261 -12347818
12384a2347818K4813L8682M8485M9143O5119Q5109M8330J3228O0579N4856L3121
$$ -12347818 -12323005 -12284323 -12235838 -12186695 -12121576 -12036467 -11988137 -11974909 -11914330 -11859474 -11826353
12373a1826353L4382N989J4677O3587M7286O0074N4861N0866M0624K7205J1994
$$ -11826353 -11791971 -11785982 -11771305 -11707718 -11660432 -11600358 -11545497 -11494631 -11454007 -11426802 -11414808
12362a1414808L3809J7535M1675N2182N5950M4111N3951N9085M6428J7792N162
$$ -11414808 -11380999 -11363464 -11321789 -11269607 -11213657 -11169546 -11115595 -11056510 -11010082 -10992290 -10987128
12351a0987128L2638M3434M0964K0175L5610J1285N0753J7269L5185O6690P0868
$$ -10987128 -10954490 -10911056 -10870092 -10849917 -10814307 -10803022 -10752269 -10735000 -10699815 -10633125 -10562257
12340a0562257L4153K6619N7049L3014N1115K2829J5463K3069L3985K0562K1642
$$ -10562257 -10528104 -10501485 -10444436 -10411422 -10360307 -10337478 -10322015 -10298946 -10264961 -10244399 -10222757
12329a0222757K5665N6189P2909L2871L9481L4115M8183N0594N3010L7512J4825
$$ -10222757 -10197092 -10140903 -10067994 -10035123 -9995642 -9961527 -9913344 -9862750 -9809740 -9772228 -9757403
12318i757403J0801N0509L8219J9788P8160P2880O7279M2219L6875N1634O2431
$$ -9757403 -9746602 -9696093 -9657874 -9638086 -9559926 -9487046 -9419767 -9377548 -9340673 -9289039 -9226608
12307i226608L0822O1655O9551N9850Q2187R7476J12469J46772J53609J82353
$$ -9226608 -9195786 -9134131 -9064580 -9004730 -8922543 -8825067 -8712598 -8565826 -8412217 -8229864
12297h229864K11953P839m02702n08220n41969n47913k43533k785Q4894J02435
$$ -8229864 -8017911 -8010072 -8412774 -8920994 -9462963 -10010876 -10254409 -10257194 -10172300 -10069865
12287a0069865Q3036P4902J10626R7935O7669P1868N7349M0602J6331L6279N6976
$$ -10069865 -9986829 -9911927 -9801301 -9703366 -9635697 -9563829 -9506480 -9465878 -9449547 -9413268 -9356292
12276i356292L1326L2193M4070O4908M7735K5897K7234K2153L4714M0363M6846
$$ -9356292 -9324966 -9292773 -9248703 -9183795 -9136060 -9110163 -9082929 -9060776 -9026062 -8985699 -8938853
12265h938853K4645j0619Q87J2167L4206L3400L4595J8979L7292K7897K5709N9293
$$ -8938853 -8914208 -8924827 -8923940 -8911773 -8877567 -8844167 -8809572 -8790593 -8753301 -8725404 -8699695 -8640402
12253h640402M0440L397K0073J9371J5276m28M2583M8741M1676j6461J2601L7542
$$ -8640402 -8599962 -8596565 -8576492 -8557121 -8541845 -8542273 -8499690 -8450949 -8409273 -8425734 -8413133 -8375591
12241h375591K3018J4246P4855K3126q357n100N738L6333L2475M6747O410J9948
$$ -8375591 -8352573 -8338327 -8263472 -8240346 -8248703 -8253803 -8248065 -8211732 -8179257 -8132510 -8126100 -8106152
12229h106152j3258j0252N7684N8225K5189L5268J0419L1131J6748n838J8301
$$ -8106152 -8119410 -8129662 -8071978 -8013753 -7988564 -7953296 -7942877 -7911746 -7894998 -7900836 -7882535
12218g882535K6485Q70K918n349L9717J223j8056J5452O1470P9024R616j3575
$$ -7882535 -7856050 -7855180 -7852262 -7857611 -7817894 -7816671 -7834727 -7819275 -7757805 -7678781 -7669165 -7682740
12206g682740J9574n244J5766L5866J6896j3412j0819K4386N2708L9333L0070
$$ -7682740 -7663166 -7668410 -7652644 -7616778 -7599882 -7613294 -7624113 -7599727 -7547019 -7507686 -7477616
12195g477616K3107J0051N776L7991K6943k2627q618j290R396J8068J3368L8081
$$ -7477616 -7454509 -7444458 -7438682 -7400691 -7373748 -7396375 -7404993 -7406283 -7396887 -7378819 -7365451 -7327370
12183g327370R83J8027J4416K9396N7693J4767r806q975j667L4533K2196J0353
$$ -7327370 -7326387 -7308360 -7293944 -7264548 -7206855 -7192088 -7201894 -7210869 -7212536 -7178003 -7155807 -7145454
12171g145454P531K2833J4387M470K3311K0661M6839K3073j5654N107K4673M0603
$$ -7145454 -7137923 -7115090 -7100703 -7096233 -7072922 -7052261 -7005422 -6982349 -6998003 -6992896 -6968223 -6927620
12159f927620K9184k5850j9059n889O847L5283J1732K1058O135L9954R689K7454
$$ -6927620 -6898436 -6924286 -6943345 -6949234 -6942387 -6907104 -6895372 -6874314 -6868179 -6828225 -6818536 -6791082
12147f791082N7004K6212L254J7517J2722K3167J2429q309j1791R982K2584L604
$$ -6791082 -6734078 -6707866 -6704612 -6687095 -6674373 -6651206 -6638777 -6647086 -6658877 -6648895 -6626311 -6622707
12135f622707j1314P680j0157J3913K1821k1483m314N1251N8717rl70r246O602
$$ -6622707 -6634021 -6626341 -6636498 -6622585 -6600764 -6622247 -6626561 -6575310 -6516593 -6516602 -6516972 -6526218 -6519616
12122f519616K2534L0244L0874K4622K6994R616K2540J8274r551J608K5113O527
$$ -6519616 -6497082 -6466838 -6435964 -6411342 -6384348 -6374732 -6352192 -6333918 -6343469 -6341861 -6316748 -6310221
12110f310221m2K5219k4066J4623O514O34K6846M3353j7550j8406M7235L8681
$$ -6310221 -6310263 -6285044 -6309110 -6294487 -6287973 -6287339 -6260493 -6217140 -6234690 -6253096 -6205861 -6167180
12098f167180N91O558P345L9393K2054j8924K624p553K8582N0017J1996m363k4905
$$ -6167180 -6166589 -6160031 -6152686 -6113293 -6091239 -6110163 -6107539 -6115092 -6086510 -6036493 -6024497 -6028860 -6053765
12085f053765l931p787K593K6575j728K0557J5446K9631L4303L4091J8650J5806
$$ -6053765 -6057696 -6065483 -6062890 -6036315 -6038043 -6017486 -6002040 -5972409 -5938106 -5904015 -5885365 -5869559
12073e869559q451j8691K0490K332J2926j393J8958K1828l1224r479J2943J8895
$$ -5869559 -5878010 -5896701 -5876211 -5873879 -5860953 -5862346 -5843388 -5821560 -5852784 -5862263 -5849320 -5830425
12061e830425K9849J7718J1475K3125J1682K8013J225N409k9445l3108m982J0903
$$ -5830425 -5800576 -5782858 -5771383 -5748258 -5736576 -5708563 -5707338 -5701929 -5731374 -5764482 -5769464 -5758561
12049e758561J2183j801K264M0083J6743J9569K8311l298J0056L1268M0749R181
$$ -5758561 -5746378 -5748179 -5745915 -5705832 -5689089 -5669520 -5641209 -5644507 -5634451 -5603183 -5562434 -5553253
12037e553253K93m5275j6361K9663J2249L666M2223J8223q74M6336K5784l4764
$$ -5553253 -5552960 -5598235 -5614596 -5584933 -5572684 -5569018 -5526795 -5508572 -5509446 -5463110 -5437326 -5472090
12025e472090J1073K9173M656P977L2232r730j3528k983K6849j4406j7719M3244
$$ -5472090 -5461017 -5431844 -5427188 -5419211 -5386979 -5396709 -5410237 -5413220 -5386371 -5400777 -5418496 -5375252
12013e375252k648K184O180j5372J7472J8150k296K2206j507j0532K0183K0835
$$ -5375252 -5377900 -5375716 -5369536 -5384908 -5367436 -5349286 -5351582 -5329376 -5330883 -5341415 -5321232 -5300397
12001e300397K8675J5688j7484j833n142j5108K069K5394J4800K2353L3793L7644
$$ -5300397 -5271722 -5256034 -5273518 -5275351 -5280493 -5295601 -5293532 -5268138 -5253338 -5230985 -5197192 -5159548
11989e159548R429J786n575l13o416l02J486O993j5945j665J4919K6235L4384
$$ -5159548 -5150119 -5148333 -5153908 -5154221 -5160637 -5160939 -5159453 -5152460 -5168405 -5170070 -5155151 -5128916 -5094532
11976e094532l127j7074J387J8964p646J2219J8673J7200n41K7434j2972K808
$$ -5094532 -5097659 -5114733 -5113346 -5094382 -5102028 -5089809 -5071136 -5053936 -5054477 -5027043 -5040015 -5037207
11964e037207J7217k455k5493J9052N672J3904K5458Q652L991J2418Q228r401
$$ -5037207 -5019990 -5022445 -5047938 -5028886 -5023214 -5009310 -4983852 -4975200 -4971209 -4958791 -4950563 -4959964
11952d959964q323k7096l1297O0427N1940L0221J3643J1223P4p333j5142M736
$$ -4959964 -4968287 -4995383 -5026680 -4966253 -4914313 -4884092 -4870449 -4859226 -4859152 -4866485 -4881627 -4876891
11940d876891L3474R214J2880j1484R28K5256J6052J4584k495k3934j084K9458
$$ -4876891 -4843417 -4834203 -4821323 -4832807 -4831879 -4806623 -4790571 -4775987 -4778482 -4802416 -4803500 -4774042
11928d774042j2q081p481k4026k28J6936P424M2234K1150Q589R774J7322J6761
$$ -4774042 -4774054 -4782135 -4789616 -4813642 -4813870 -4796934 -4789510 -4747276 -4726126 -4717537 -4707763 -4690441 -4673680
11915d673680O145P347k1446n446j873j0044M571J8658Q246L1255K0820Q095j0880
$$ -4673680 -4667535 -4660188 -4681634 -4687080 -4688953 -4698997 -4694426 -4675768 -4667522 -4636267 -4615447 -4607352 -4618232
11902d618232p362K8287K7787j347k7923l5953j6817O968J6804L5476j804J1356
$$ -4618232 -4625594 -4597307 -4569520 -4570867 -4598790 -4634743 -4651560 -4644592 -4627788 -4592312 -4594116 -4582760
11890d582760J5249J5852p350R525K5702P661q369J0779L7329K8517j6266m394
$$ -4582760 -4567511 -4551659 -4559009 -4549484 -4523782 -4516121 -4524490 -4513711 -4476382 -4447865 -4464131 -4468525
11878d468525j8772l4935K1605J9486K0134J4721J5373k711J2942K713j5278K2656
$$ -4468525 -4487297 -4522232 -4500627 -4481141 -4461007 -4446286 -4430913 -4433624 -4420682 -4417969 -4433247 -4410591
11866d410591j825K0465P560q852j6251l422J3105L1017K1308k959j6072K0294
$$ -4410591 -4412416 -4391951 -4384391 -4393243 -4409494 -4412916 -4399811 -4368794 -4347486 -4350445 -4366517 -4346223
11854d346223M5487K3353O725j5414j5462j6760k6398k3290n951Q655k1N0282
$$ -4346223 -4300736 -4277383 -4270658 -4286072 -4301534 -4318294 -4344692 -4367982 -4373933 -4365278 -4365299 -4315017
11842d315017L0974K8742j1491R420K970J1163j8061L717k021j5109j2608P595
$$ -4315017 -4284043 -4255301 -4266792 -4257372 -4254402 -4243239 -4261300 -4257583 -4259604 -4274713 -4287321 -4279726
11830d279726J4357P101J4791K6405j5161J4906P803R730L425R777r695l9523
$$ -4279726 -4265369 -4258268 -4243477 -4217072 -4232233 -4217327 -4209524 -4199794 -4196369 -4186592 -4196287 -4235810
11818d235810l140K0456K3774K5522j0407J3309J1634k516L7338J2012N854j2969
$$ -4235810 -4238950 -4218494 -4194720 -4169198 -4179605 -4166296 -4154662 -4157178 -4119840 -4107828 -4101974 -4114943
11806d114943j9728m594L272P200j2017J1729J1732O210q227l6895l331K0111
$$ -4114943 -4134671 -4139265 -4135993 -4128793 -4140810 -4129081 -4117349 -4111139 -4119366 -4156261 -4159592 -4139481
11794d139481L3731K3959J1423r493j5274J1484J0249J2159L8024J5579J177j5410
$$ -4139481 -4105750 -4081791 -4070368 -4079861 -4095135 -4083651 -4073402 -4061243 -4023219 -4007640 -4006463 -4021873
11782d021873j0060L4714l5527m286p76J1658J8198L912o644o680J0197K6459
$$ -4021873 -4031933 -3997219 -4032746 -4037032 -4037808 -4026150 -4007952 -4004040 -4010684 -4017364 -4007167 -3980708
11770c980708J5682j953Q622J830R924J6138p473K1104Q198j348L489J8558j082
$$ -3980708 -3965026 -3966979 -3958357 -3956527 -3946603 -3930465 -3937938 -3916834 -3908636 -3909984 -3906495 -3887937 -3889019
11757c889019J4131R279P607N47K1953K8l5278q760j5779L2830R525R348k5410
$$ -3889019 -3874888 -3865609 -3858002 -3857455 -3835502 -3835474 -3870752 -3879512 -3895291 -3862461 -3852936 -3843588 -3868998
11744c868998J3442Q134j9198j8012l883J9783P514m591J340K2293K7726l74k4303
$$ -3868998 -3855556 -3847422 -3866620 -3884632 -3888515 -3868732 -3861218 -3865809 -3864469 -3842176 -3814450 -3814824 -3839127
11731c839127k2562K671J4736L594j7K352n040K9086L8111J533J8434J1702j6659
$$ -3839127 -3861689 -3859018 -3844282 -3840688 -3840705 -3838353 -3843393 -3814307 -3776196 -3774663 -3756229 -3744527 -3761186
11718c761186k8709k581J7034p240J8760K1779L7730Q104k1214J083J2113J710
$$ -3761186 -3789895 -3792476 -3775442 -3782682 -3763922 -3742143 -3704413 -3696309 -3717523 -3716440 -3704327 -3702617
11706c702617k3605j8989J1379j4975R688L321K0486K6312k481L686K9430N28
$$ -3702617 -3726222 -3745211 -3733832 -3748807 -3739119 -3735798 -3715312 -3689000 -3691481 -3687795 -3658365 -3657837
11694c657837j0394k884J4580Q942L1747k2364k6884K2547L8100j1094j7714M76
$$ -3657837 -3668231 -3671115 -3656535 -3647593 -3615846 -3638210 -3665094 -3642547 -3604447 -3615541 -3633255 -3632779
11682c632779j8675J1613R826o916l618K841J8756M2345k6287m1332l753L6719
$$ -3632779 -3651454 -3639841 -3630015 -3636931 -3640549 -3637708 -3618952 -3576607 -3602894 -3644226 -3647979 -3611260
11670c611260l713l504K5948N95K3084K318O195J3846R994K3630q859l2067j7261
$$ -3611260 -3614973 -3618477 -3592529 -3591934 -3568850 -3566532 -3560337 -3546491 -3536497 -3512867 -3521726 -3553793 -3571054
11657c571054j0404J8004J1113J5424k553j4784J4781R205K248j3013R464L2848
$$ -3571054 -3581458 -3563454 -3552341 -3536917 -3539470 -3554254 -3539473 -3530268 -3528020 -3541033 -3531569 -3498721
11645c498721J2651k2801k1289K029j2567j8066K3744Q11l985K5206J474Q332
$$ -3498721 -3486070 -3508871 -3530160 -3528131 -3540698 -3558764 -3535020 -3534209 -3538194 -3512988 -3511514 -3503182
11633c503182r041J2742o887J614K4390P803J3953n962q85K949j2242j2905M972
$$ -3503182 -3512223 -3499481 -3506368 -3504754 -3480364 -3472561 -3458608 -3464570 -3465455 -3462506 -3474748 -3487653 -3482681
11620c482681J1041M1209K1100J4820j2402n549K2698j0909O219j009L697J4416
$$ -3482681 -3471640 -3430431 -3409331 -3394511 -3406913 -3412462 -3389764 -3400673 -3394454 -3395463 -3391766 -3377350
11608c377350j938j717j9651m916Q333J4985n050l822L0918J6444j9179J0877
$$ -3377350 -3379288 -3381005 -3400656 -3405572 -3397239 -3382254 -3387304 -3391126 -3360208 -3343764 -3362943 -3352066
11596c352066j8799j8841J0470J2107K6734K7419J0105M419P335o302j2759k6326
$$ -3352066 -3370865 -3389706 -3379236 -3367129 -3340395 -3312976 -3302871 -3298452 -3291117 -3297419 -3310178 -3336504
11584c336504M406L89j0816R987L1425Q222j1646J129l7675k7450L9180J5216
$$ -3336504 -3332098 -3331709 -3342525 -3332538 -3301113 -3292891 -3304537 -3303408 -3341083 -3368533 -3329353 -3314137
11572c314137J085j4766L5160L3545j0103Q819j5141J3885M301j3976j3055K4634
$$ -3314137 -3313052 -3327818 -3292658 -3259113 -3269216 -3260397 -3275538 -3261653 -3257352 -3271328 -3284383 -3259749
11560c259749K0259j127j2818r388k970L601j4901J9896P910K7356J7433N297
$$ -3259749 -3239490 -3240617 -3253435 -3262823 -3265793 -3262192 -3277093 -3257197 -3249287 -3221931 -3204498 -3199201
11548c199201j7908k4717m6981L2869L4011J6143K685j1390k1737n292J8174m859
$$ -3199201 -3217109 -3241826 -3288807 -3255938 -3221927 -3205784 -3203099 -3214489 -3236226 -3241518 -3223344 -3228203
11536c228203J6932O1803J1632l7751j1519J4520L6897l192j1146k1765j3384
$$ -3228203 -3211271 -3149468 -3137836 -3175587 -3187106 -3172586 -3135689 -3138881 -3150027 -3171792 -3185176
11525c185176o917K505L1470Q490J9357K0721j255j4901k168J515j439j5832k7005
$$ -3185176 -3192093 -3189588 -3158118 -3149628 -3130271 -3109550 -3110805 -3125706 -3127874 -3126359 -3127798 -3143630 -3170635
11512c170635O503J5810N373R553J3969J5725l867l489P160j7195k8991L662K4016
$$ -3170635 -3164132 -3148322 -3142949 -3133396 -3119427 -3103702 -3107569 -3111058 -3103898 -3121093 -3150084 -3146422 -3122406
11499c122406K1294J8478M603k1710k1573j5322J7091K4328J7308p746J5449L1244
$$ -3122406 -3101112 -3082634 -3078031 -3099741 -3121314 -3136636 -3119545 -3095217 -3077909 -3085655 -3070206 -3038962
11487c038962J921j2255j5922R166J3821J0396K7746J3016j5926n100o019m1031
$$ -3038962 -3037041 -3049296 -3065218 -3056052 -3042231 -3031835 -3004089 -2991073 -3006999 -3012099 -3018118 -3059149
11475c059149J9575l96m983M7847K8328k0361o1291k2591P986n471L3967J9429
$$ -3059149 -3039574 -3039970 -3044953 -2997106 -2968778 -2989139 -3050430 -3073021 -3065035 -3070506 -3036539 -3017110
11463c017110L234J5366J3138J1040j6146k9207n460Q585M5867N692j4534J1601
$$ -3017110 -3013876 -2998510 -2985372 -2974332 -2990478 -3019685 -3025145 -3016560 -2970693 -2965001 -2979535 -2967934
11451b967934O228M639k1901k565k480p576J7317J7592j7141r931J4097R363k2049
$$ -2967934 -2961706 -2957067 -2978968 -2981533 -2984013 -2991589 -2974272 -2956680 -2973821 -2983752 -2969655 -2960292 -2982341
11438b982341n203j3778K3209K2551J3307j0022j3571J2918N875K2885j0349j3838
$$ -2982341 -2987544 -3001322 -2978113 -2955562 -2942255 -2952277 -2965848 -2952930 -2947055 -2924170 -2934519 -2948357
11426b948357J0606L0364r798J0527n918O446J1773K7319L1020m4851l1215O229
$$ -2948357 -2937751 -2907387 -2917185 -2906658 -2912576 -2906130 -2894357 -2867038 -2836018 -2880869 -2912084 -2905855
11414b905855j0746j0686K0499L1010K8852R113j6542j5653J8966J7987J1130
$$ -2905855 -2916601 -2927287 -2906788 -2875778 -2846926 -2837813 -2854355 -2870008 -2851042 -2833055 -2821925
11403b821925m830k4830P374k7451J555J7546m079j4054M0812o900J438J4747
$$ -2821925 -2826755 -2851585 -2844211 -2871662 -2870107 -2852561 -2856640 -2870694 -2829882 -2836782 -2835344 -2820597
11391b820597K7280J2137k5086k9753J0618K0172J7024j2421k0571l3385N1196
$$ -2820597 -2793317 -2781180 -2806266 -2836019 -2825401 -2805229 -2788205 -2800626 -2821197 -2854582 -2803386
11380b803386k732j7686M921j2920q084K5989J3909J8424L520O872L069J9948
$$ -2803386 -2806118 -2823804 -2818883 -2831803 -2839887 -2813898 -2799989 -2781565 -2778045 -2771173 -2768104 -2748156
11368b748156j4960m0214o016J916J8597L5072J6458l4182l3463K2109J7471r575
$$ -2748156 -2763116 -2803330 -2809346 -2807430 -2788833 -2753761 -2737303 -2771485 -2804948 -2782839 -2765368 -2774943
11356b774943K359r670l493j4115L899l433j226m852L8819K1671J9913O524J9238
$$ -2774943 -2772584 -2782254 -2785747 -2799862 -2795963 -2799396 -2800622 -2805474 -2766655 -2744984 -2725071 -2718547 -2699309
11343b699309j55j903m802r557l271k8390l5873L4850K2934k0356j1336j852p352
$$ -2699309 -2699464 -2701367 -2706169 -2715726 -2718997 -2747387 -2783260 -2748410 -2725476 -2745832 -2757168 -2759020 -2766372
11330b766372J5882J4541L8071M303J9489j0745j5197k7499j063M357M3009J1805
$$ -2766372 -2750490 -2735949 -2697878 -2693575 -2674086 -2684831 -2700028 -2727527 -2728590 -2724233 -2681224 -2669419
11318b669419j1410k340O69K3485K1910l133k2750n968J5972P648j1533N452P79
$$ -2669419 -2680829 -2683169 -2682500 -2659015 -2637105 -2640238 -2662988 -2668956 -2652984 -2645336 -2656869 -2651417 -2650638
11305b650638n6617J0017J1726L2808K5344k358l524J9267j9584j7420M258L229
$$ -2650638 -2707255 -2697238 -2685512 -2652704 -2627360 -2629718 -2633242 -2613975 -2633559 -2650979 -2646721 -2643492
11293b643492n77l2937j4742k106K7459L2551J0926K8356r98P479p663J6991n04
$$ -2643492 -2644069 -2677006 -2691748 -2693854 -2666395 -2633844 -2622918 -2594562 -2595560 -2588081 -2595744 -2578753 -2579257
11280b579257k1900l429j2763k8776J1954K2655K7277j992k8868j4557J3741L2849
$$ -2579257 -2601157 -2604586 -2617349 -2646125 -2634171 -2611516 -2584239 -2586231 -2615099 -2629656 -2615915 -2583066
11268b583066K3501k4855k7926L0101N998R407k7273J2591J8214p612l8582j5892
$$ -2583066 -2559565 -2584420 -2612346 -2582245 -2576247 -2566840 -2594113 -2581522 -2563308 -2570920 -2609502 -2625394
11256b625394J4828K5560j129j7970J5794j2387j7858L5133N2543K8145J3642
$$ -2625394 -2610566 -2585006 -2586135 -2604105 -2588311 -2600698 -2618556 -2583423 -2530880 -2502735 -2489093
11245b489093j7252J6444l2296j679L2488l4826j3543N048k2058q488m888k2600
$$ -2489093 -2506345 -2489901 -2522197 -2523876 -2491388 -2526214 -2539757 -2534709 -2556767 -2565255 -2570143 -2592743
11233b592743o67L4718L6679j2696n568K6169K6381j7737m7005J9987J9156K773
$$ -2592743 -2593410 -2558692 -2522013 -2534709 -2540277 -2514108 -2487727 -2505464 -2552469 -2532482 -2513326 -2510553
11221b510553K0058K2625N30J0764Q413k0119l054q729n56J8871K0089N715j5989
$$ -2510553 -2490495 -2467870 -2467340 -2456576 -2448163 -2468282 -2471336 -2480065 -2480621 -2461750 -2441661 -2435946 -2451935
11208b451935k3043M1499M7240J6665j0377k8914j7364n339P181j4182o167M7114
$$ -2451935 -2474978 -2433479 -2386239 -2369574 -2379951 -2408865 -2426229 -2431568 -2424387 -2438569 -2444736 -2397622
11196b397622M8730k8000l2358j936K0096K1922M848M310l639N045K9054q824
$$ -2397622 -2348892 -2376892 -2409250 -2411186 -2391090 -2369168 -2364320 -2360010 -2363649 -2358604 -2329550 -2338374
11184b338374k9657m606K0555K5072j2389j0252J4542L194m687q261O1J2370N403
$$ -2338374 -2368031 -2372637 -2352082 -2327010 -2339399 -2349651 -2335109 -2331915 -2336602 -2344863 -2344802 -2332432 -2327029
11171b327029O521M5933K0893J8569Q808L0140L031j8621L9795L9667L4728O789
$$ -2327029 -2320508 -2274575 -2253682 -2235113 -2226305 -2196165 -2193134 -2211755 -2171960 -2132293 -2097565 -2090776
11159b090776L2332L9611l966R551m600j6292J1488j3012l6637j06242j36037
$$ -2090776 -2058444 -2018833 -2022799 -2013248 -2017848 -2034140 -2022652 -2035664 -2072301 -2178543 -2314580
11148b314580r2444r7104r8969p5459m1275j7418J0099L1207L9917j0120J773
$$ -2314580 -2407024 -2504128 -2603097 -2678556 -2719831 -2737249 -2727150 -2695943 -2656026 -2666146 -2664373
11137b664373J8801K5418j2j6138K983J698K8253K4370k1761N675L5844O30k489
$$ -2664373 -2645572 -2620154 -2620166 -2636304 -2633321 -2631623 -2603370 -2579000 -2600761 -2595086 -2559242 -2558612 -2561101
11124b561101L975j4269J999R567q282j1422K4561k230L820K2215M4495R280m0508
$$ -2561101 -2557126 -2571395 -2569396 -2559829 -2568111 -2579533 -2554972 -2557202 -2553382 -2531167 -2486672 -2477392 -2517900
11111b517900k4383K8660J1364P129K6723J8291p37k7803l599J8693P655J177
$$ -2517900 -2542283 -2513623 -2502259 -2495130 -2468407 -2450116 -2450853 -2478656 -2482255 -2463562 -2455907 -2454730
11099b454730l5444J645J9286K9033k7725K158p919n296J7777K3912P174L525
$$ -2454730 -2490174 -2488529 -2469243 -2440210 -2467935 -2465777 -2473696 -2478992 -2461215 -2437303 -2430129 -2426604
11087b426604j0505M868j0039n768L0093l449n790K1800O96J1078m335j0182P279
$$ -2426604 -2437109 -2432241 -2442280 -2448048 -2417955 -2421404 -2427194 -2405394 -2404698 -2393620 -2397955 -2408137 -2400858
11074b400858K0234k7338j3090J2142k1732K2129K487o484J5799M3996j9478j2114
$$ -2400858 -2380624 -2407962 -2421052 -2408910 -2430642 -2408513 -2406026 -2412510 -2396711 -2352715 -2372193 -2384307
11062b384307K1334K653j5726Q999j7303l3200m062J6109m943K2968J8821Q900
$$ -2384307 -2362973 -2360320 -2376046 -2367047 -2384350 -2417550 -2421612 -2405503 -2410446 -2387478 -2368657 -2359757
11050b359757J8224K116q094O926l9566N587j7489p921J4392J1426J0054J4035
$$ -2359757 -2341533 -2339417 -2347511 -2340585 -2380151 -2374564 -2392053 -2399974 -2385582 -2374156 -2364102 -2350067
11038b350067K0339p261l3715j5637k407n232K6075K0355n599R360K5437q710
$$ -2350067 -2329728 -2336989 -2370704 -2386341 -2388748 -2393980 -2367905 -2347550 -2353149 -2343789 -2318352 -2327062
11026b327062j263L7963N035j4821M5710n178k4489q041K4754K636l1215L919
$$ -2327062 -2328325 -2290362 -2285327 -2300148 -2254438 -2259616 -2284105 -2292146 -2267392 -2264756 -2295971 -2292052
11014b292052k896J2538j3280m721K35L44J8204k796l3911J4638M421K3998J8593
$$ -2292052 -2294948 -2282410 -2295690 -2300411 -2300176 -2299832 -2281628 -2284424 -2318335 -2303697 -2299276 -2275278 -2256685
11001b256685o653j887j4129j4670J2648J2823k2710J28J0855J0410L5992m074
$$ -2256685 -2263338 -2265225 -2279354 -2294024 -2281376 -2268553 -2291263 -2291135 -2280280 -2269870 -2233878 -2237952
10989b237952q848k8329k2235K376J7994J5135q022J3321L0999k4446J3272L2505
$$ -2237952 -2246800 -2275129 -2297364 -2294988 -2276994 -2261859 -2269881 -2256560 -2225561 -2250007 -2236735 -2204230
10977b204230m272q575j0996j9092j3147J5878Q234j4994p133r976j4371j7305
$$ -2204230 -2208502 -2217077 -2228073 -2247165 -2260312 -2244434 -2236200 -2251194 -2258327 -2268303 -2282674 -2299979
10965b299979L8136K3038O387j988J2284J7849j4378n502L144k012j7876M456
$$ -2299979 -2261843 -2238805 -2232418 -2234406 -2222122 -2204273 -2218651 -2224153 -2221009 -2223021 -2240897 -2236441
10953b236441J446K6373R573J4088J1090J5590R935k9252p484K610J0163o59n991
$$ -2236441 -2234995 -2208622 -2199049 -2184961 -2173871 -2158281 -2148346 -2177598 -2185082 -2182472 -2172309 -2172968 -2178959
10940b178959k9963j063L4054J0156l532j0752k568L3030k776j0007l571P610
$$ -2178959 -2208922 -2209985 -2175931 -2165775 -2169307 -2180059 -2182627 -2149597 -2152373 -2162380 -2165951 -2158341
10928b158341k839O987N469J3566J2297Q041M268m1778o267L761M2503N686j2531
$$ -2158341 -2161180 -2154193 -2148724 -2135158 -2122861 -2114820 -2110552 -2152330 -2158597 -2154836 -2112333 -2106647 -2119178
10915b119178L7558J7430k1246O888O725k9519l5744l9836Q904L3339K814n035
$$ -2119178 -2081620 -2064190 -2085436 -2078548 -2071823 -2101342 -2137086 -2176922 -2168018 -2134679 -2131865 -2136900
10903b136900q833K3455J0491j1086L508j9906J762k702p853J2281J8548p267
$$ -2136900 -2145733 -2122278 -2111787 -2122873 -2119365 -2139271 -2137509 -2140211 -2148064 -2135783 -2117235 -2124502
10891b124502M333J847m369j359L11K7145J3375m826j9121K553k4164Q748M323
$$ -2124502 -2120169 -2118322 -2122691 -2124050 -2123739 -2096594 -2083219 -2088045 -2107166 -2104613 -2128777 -2120029 -2115706
10878b115706Q609K824m976n676r586M599k403J2036O87P795Q231j7544k3856
$$ -2115706 -2107097 -2104273 -2109249 -2114925 -2124511 -2119912 -2122315 -2110279 -2109592 -2101797 -2093566 -2111110 -2134966
10865b134966M920N2132K1027l5298m0301j7329M051N0156J5770Q111j0886j5904
$$ -2134966 -2130046 -2077914 -2056887 -2092185 -2132486 -2149815 -2145764 -2095608 -2079838 -2071727 -2082613 -2098517
10853b098517J293N081O355K8916K4947P096N624j9934l3321P706r912m6145J316
$$ -2098517 -2097224 -2092143 -2085788 -2056872 -2031925 -2024829 -2019205 -2039139 -2072460 -2064754 -2074666 -2120811 -2119495
10840b119495J4737O0264j2882k5910p935r820J3760L0414n997k1109J6383O093
$$ -2119495 -2104758 -2044494 -2057376 -2083286 -2091221 -2101041 -2087281 -2056867 -2062864 -2083973 -2067590 -2061497
10828b061497k7897K1207K9370Q850m3336k0478K1264R506L449J0887K434j4731
$$ -2061497 -2089394 -2068187 -2038817 -2029967 -2073303 -2093781 -2072517 -2063011 -2059562 -2048675 -2046241 -2060972
10816b060972J4010M9727K3039j7902l0143L492K4587J8847K398m036m1803k9679
$$ -2060972 -2046962 -1997235 -1974196 -1992098 -2022241 -2018749 -1994162 -1975315 -1972917 -1976953 -2018756 -2048435
10804b048435o260L1718R929o242J491P281K471J1969o051k0928k2437k2802J0663
$$ -2048435 -2054695 -2022977 -2013048 -2019290 -2017799 -2010518 -2008047 -1996078 -2002129 -2023057 -2045494 -2068296 -2057633
10791b057633L8758J3024k5687Q395K6753J0378j2532r210j278J073J8212K9730
$$ -2057633 -2018875 -2005851 -2031538 -2023143 -1996390 -1986012 -1998544 -2007754 -2009032 -2007959 -1989747 -1960017
10779a960017J5842Q05l3565L620J1743J9135J185l3884j5693J2764J0488j3570
$$ -1960017 -1944175 -1943370 -1976935 -1973315 -1961572 -1942437 -1941252 -1975136 -1990829 -1978065 -1967577 -1981147
10767a981147n032m842j650m002k605M967q432k652K2433N927j490k1789J8657
$$ -1981147 -1986179 -1991021 -1992671 -1996673 -1999278 -1994311 -2002743 -2005395 -1982962 -1977035 -1978525 -2000314 -1981657
10754a981657L836J9910p245j2399N765K7719k3699j1667j5929J9500L324O92
$$ -1981657 -1977821 -1957911 -1965156 -1977555 -1971790 -1944071 -1967770 -1979437 -1995366 -1975866 -1972542 -1971850
10742a971850K8481N005j744j4365m2515j9245j4535L6084L5722O32k3394K1064
$$ -1971850 -1943369 -1938364 -1940108 -1954473 -1996988 -2016233 -2030768 -1994684 -1958962 -1958330 -1981724 -1960660
10730a960660J7264j9432K0782L3994j1545K152J8352K1180k7622l1492j95L2925
$$ -1960660 -1943396 -1962828 -1942046 -1908052 -1919597 -1917445 -1899093 -1877913 -1905535 -1937027 -1937222 -1904297
10718a904297J5310L8664j5014k7257j0412R404p976K65J1528l7818l6200j9251
$$ -1904297 -1888987 -1850323 -1865337 -1892594 -1903006 -1893602 -1901578 -1901313 -1889785 -1927603 -1963803 -1983054
10706a983054J3480N987J4381k987M1314M7960r615k5257q393l256J2705k0844
$$ -1983054 -1969574 -1963587 -1949206 -1952193 -1910879 -1862919 -1872534 -1897791 -1906184 -1909440 -1896735 -1917579
10694a917579J9561J1186j0128k4915J2397O942k278J1676J7699j1022l6063j0274
$$ -1917579 -1898018 -1886832 -1896960 -1921875 -1909478 -1902536 -1904814 -1893138 -1875439 -1886461 -1922524 -1932798
10682a932798K6741J4512k2720o512n78n216p349k3513J7057Q406M325J8316L894
$$ -1932798 -1906057 -1891545 -1914265 -1920777 -1921355 -1926571 -1933920 -1957433 -1940376 -1931970 -1927645 -1909329 -1905435
10669a905435J1779J9910k185P031K417j0541l665L6320K9147Q55R98j5818J5754
$$ -1905435 -1893656 -1873746 -1875931 -1868900 -1866483 -1877024 -1880689 -1844369 -1815222 -1814367 -1813369 -1829187 -1813433
10656a813433l0131m2870k1385j413N880J8712K6493P230O477K6116K2868p238
$$ -1813433 -1843564 -1886434 -1907819 -1909232 -1903352 -1884640 -1858147 -1850917 -1844440 -1818324 -1795456 -1802694
10644a802694K06q01o415l8333m183j6818J8483K31J8934J7150j2113k2009m6424
$$ -1802694 -1802488 -1803289 -1809704 -1848037 -1852220 -1869038 -1850555 -1850324 -1831390 -1814240 -1826353 -1848362 -1894786
10631a894786J3525K986j746m302r786J4146M114K956K7433O71K8537K5565q994
$$ -1894786 -1881261 -1878275 -1880021 -1884323 -1894109 -1879963 -1875849 -1872893 -1845460 -1844789 -1816252 -1790687 -1799681
10618a799681j4995K8863j1615j6916K0293J1029j0655k7101k7544k9326O60J6823
$$ -1799681 -1814676 -1785813 -1797428 -1814344 -1794051 -1783022 -1793677 -1820778 -1848322 -1877648 -1876988 -1860165
10606a860165L2057k343k882k9997N346J7302J4579L6013L0101q197k3421j934
$$ -1860165 -1828108 -1830451 -1833333 -1863330 -1857984 -1840682 -1826103 -1790090 -1759989 -1768186 -1791607 -1793541
10594a793541L40n688q028j1453J8141L8561K479J9103K242J7559l859k2016j9076
$$ -1793541 -1793201 -1798889 -1806917 -1818370 -1800229 -1761668 -1759189 -1740086 -1737844 -1720285 -1724144 -1746160 -1765236
10581a765236Q86j9885k568j5819k606L825J2038J4168j6545n706j8091J761R675
$$ -1765236 -1764350 -1784235 -1786803 -1802622 -1805228 -1801403 -1789365 -1775197 -1791742 -1797448 -1815539 -1813778 -1804103
10568a804103K4277o859j89J061l541n102J5891K358K033R696J9740k844L242
$$ -1804103 -1779826 -1786685 -1786874 -1785813 -1789354 -1794456 -1778565 -1776207 -1774174 -1764478 -1744738 -1747582 -1744340
10555a744340k1403j4985j870K873L580J0598R092M872J3774K7209K5726J6956
$$ -1744340 -1765743 -1780728 -1782598 -1779725 -1776145 -1765547 -1756455 -1751583 -1737809 -1710600 -1684874 -1667918
10543a667918j0599l9211J0742jl0583n098r083l148L500N309q685Q696J7624
$$ -1667918 -1678517 -1717728 -1706986 -1706987 -1737570 -1742668 -1751751 -1754899 -1751399 -1746090 -1754775 -1746079 -1728455
10530a728455N58K7740n341N574J4574k231k7822l0580J8224K0850M800R745r363
$$ -1728455 -1727897 -1700157 -1705498 -1699924 -1685350 -1687581 -1715403 -1745983 -1727759 -1706909 -1702109 -1692364 -1701727
10517a701727m216j2542k1512n153J5444k284L2842j7082m4384J6089K7844K5086
$$ -1701727 -1705943 -1718485 -1739997 -1745150 -1729706 -1731990 -1699148 -1716230 -1760614 -1744525 -1716681 -1691595
10505a691595j1412j518J5727K818k5837K9754J4331p946j1125j908J4455k492
$$ -1691595 -1703007 -1704525 -1688798 -1685980 -1711817 -1682063 -1667732 -1675678 -1686803 -1688711 -1674256 -1676748
10493a676748j3635l3554k4676j4441Q755K6745K6037M9823L6678k819r014j8348
$$ -1676748 -1690383 -1723937 -1748613 -1763054 -1754299 -1727554 -1701517 -1651694 -1615016 -1617835 -1626849 -1645197
10481a645197k694p355j627J9193j3944Q812j2843n682J1522n335K2204J5161
$$ -1645197 -1647891 -1655246 -1656873 -1637680 -1651624 -1642812 -1655655 -1661337 -1649815 -1655150 -1632946 -1617785
10469a617785k2323J7438J2629K0897o747J5533r854p618k6376k6734j5830J3566
$$ -1617785 -1640108 -1622670 -1610041 -1589144 -1595891 -1580358 -1590212 -1597830 -1624206 -1650940 -1666770 -1653204
10457a653204K2189k146O616l843P326K4908K2416j6019Q8M220J6619j420k5197
$$ -1653204 -1631015 -1633161 -1626545 -1630388 -1623062 -1598154 -1575738 -1591757 -1591669 -1587449 -1570830 -1572250 -1597447
10444a597447K476j556k7672k3436l7655p752J6322j2583m384q904k786J5071
$$ -1597447 -1594971 -1596527 -1624199 -1647635 -1685290 -1693042 -1676720 -1689303 -1693687 -1702591 -1705377 -1690306
10432a690306k026J1062L6493K569K696J7329P645L789N261J1198J1668k371o38
$$ -1690306 -1692332 -1681270 -1644777 -1642208 -1639512 -1622183 -1614538 -1610749 -1605488 -1594290 -1582622 -1584993 -1585631
10419a585631J5241O832l309k3096l0479J0774j521P372j0283j2696J0740J9067
$$ -1585631 -1570390 -1563558 -1566867 -1589963 -1620442 -1609668 -1611189 -1603817 -1614100 -1626796 -1616056 -1596989
10407a596989O269k2861p039j6860q453Q547Q10L0729j4946k1005J3904K7630
$$ -1596989 -1590720 -1613581 -1620620 -1637480 -1645933 -1637386 -1636576 -1605847 -1620793 -1641798 -1627894 -1600264
10395a600264K8615Q249K4308j5187k2882r324O109J823j768Q856j3262k1441
$$ -1600264 -1571649 -1563400 -1539092 -1554279 -1577161 -1586485 -1580376 -1578553 -1580321 -1571465 -1584727 -1606168
10383a606168k6390M0135L3071M3130l0584l4629R19j921M32q072K198j701L1088
$$ -1606168 -1632558 -1592423 -1559352 -1516222 -1546806 -1581435 -1580516 -1582437 -1582005 -1590077 -1587879 -1589580 -1558492
10370a558492M443p406K4459j4695p962n0785k4229M0422K6328J1392J637j0161
$$ -1558492 -1554049 -1561455 -1536996 -1551691 -1559653 -1610438 -1634667 -1594245 -1567917 -1556525 -1554888 -1565049
10358a565049k3154p65k3848J9645K3797N125J3221j3793j235N874O185o543m106
$$ -1565049 -1588203 -1588968 -1612816 -1593171 -1569374 -1564249 -1551028 -1564821 -1566056 -1560182 -1553997 -1560540 -1564646
10345a564646j1981J7588K8853J4984k56J3472P8j2638k2677J562N332q465M513
$$ -1564646 -1576627 -1559039 -1530186 -1515202 -1515458 -1501986 -1501908 -1514546 -1537223 -1535661 -1530329 -1538794 -1534281
10332a534281Q766O423J1315m262N069K074o94k3921j1118k292J723J893j8901
$$ -1534281 -1525515 -1519092 -1507777 -1512039 -1506970 -1504896 -1505590 -1529511 -1540629 -1542921 -1541198 -1539305 -1558206
10319a558206J5575L0299Q707n69N77j6342j7468j6100L4533K430O28K6291J0149
$$ -1558206 -1542631 -1512332 -1503625 -1504194 -1503617 -1519959 -1537427 -1553527 -1518994 -1516564 -1515936 -1489645 -1479496
10306a479496o827R57n766J5417K4570L871l4777k0572L1520M0106p35k2113j3026
$$ -1479496 -1486323 -1485366 -1491132 -1475715 -1451145 -1447274 -1482051 -1502623 -1471103 -1430997 -1431732 -1453845 -1466871
10293a466871K106K8114k3632j3442J4721J4472k4094p364j0097R128l19q754
$$ -1466871 -1464765 -1436651 -1460283 -1473725 -1459004 -1444532 -1468626 -1475990 -1486087 -1476959 -1477278 -1486032
10281a486032q234J0804R58J8491K4487J2284k424k9297j8921J32R365q913q623
$$ -1486032 -1494266 -1483462 -1482504 -1464013 -1439526 -1427242 -1429666 -1458963 -1477884 -1477752 -1468387 -1477300 -1485923
10268a485923j3507p511K6230L8538J1350K640j9003k101N527J1068j0929P885
$$ -1485923 -1499430 -1506941 -1480711 -1442173 -1430823 -1428183 -1447186 -1449287 -1443760 -1432692 -1443621 -1435736
10256a435736N22l2293k197Q139J6730p552R172K5261l46n675P52j1500J1132
$$ -1435736 -1435214 -1467507 -1469704 -1461565 -1444835 -1452387 -1443215 -1417954 -1418300 -1423975 -1423223 -1434723 -1423591
10243a423591J7314j8745k0870n819k7008m231J6782L2876N481j7459J6033j4130
$$ -1423591 -1406277 -1425022 -1445892 -1451711 -1478719 -1482950 -1466168 -1433292 -1427811 -1445270 -1429237 -1443367
10231a443367J5301J7736N610j0505J4149J4482k222N132O429J8420j6212j2669
$$ -1443367 -1428066 -1410330 -1404720 -1415225 -1401076 -1386594 -1388816 -1383684 -1377255 -1358835 -1375047 -1387716
10219a387716j1259M237J2356j6454l0322K352J7713J2776J3889p667q577J1607
$$ -1387716 -1398975 -1394738 -1382382 -1398836 -1429158 -1426806 -1409093 -1396317 -1382428 -1390095 -1398672 -1387065
10207a387065J4544q345L660L4049J0105l056J4806P403k1005j8863p849K3806
$$ -1387065 -1372521 -1380866 -1377206 -1343157 -1333052 -1336108 -1321302 -1313899 -1334904 -1353767 -1361616 -1337810
10195a337810J0918k382m095R821j0091K6200Q515L696O118R290J1878J347K2276
$$ -1337810 -1326892 -1329274 -1333369 -1323548 -1333639 -1307439 -1298924 -1295228 -1289110 -1279820 -1267942 -1266595 -1244319
10182a244319j4632r067l963q063j3219P65j297J2163K6828J7484m477J2217L621
$$ -1244319 -1258951 -1268018 -1271981 -1280044 -1293263 -1292498 -1293795 -1281632 -1254804 -1237320 -1241797 -1229580 -1225959
10169a225959k0449k9038k4020K1960R964O822q135K4533J5766K2509J3445M565
$$ -1225959 -1246408 -1275446 -1299466 -1277506 -1267542 -1260720 -1268855 -1244322 -1228556 -1206047 -1192602 -1188037
10157a188037r280J0584j4060k2969K5684l4J1302K1443q088k2535J7569O0014
$$ -1188037 -1197317 -1186733 -1200793 -1223762 -1198078 -1198112 -1186810 -1165367 -1173455 -1195990 -1178421 -1118407
10145a118407L136j9679k6625q234r865N999J7794L5919j6622j2440k6864k6359
$$ -1118407 -1115271 -1134950 -1161575 -1169809 -1179674 -1173675 -1155881 -1119962 -1136584 -1149024 -1175888 -1202247
10133a202247J0207M9946K1004k0436r003o861K6642M9854J2728J0497K8140J2714
$$ -1202247 -1192040 -1142094 -1121090 -1141526 -1150529 -1157390 -1130748 -1080894 -1068166 -1057669 -1029529 -1016815
10121a016815j1874j4712o023K7672J4112L78J1321j2056K5092M6120J4814l9867
$$ -1016815 -1028689 -1043401 -1049424 -1021752 -1007640 -1007262 -995941 -1007997 -982905 -936785 -921971 -961838
10109i61838j5844K371J9559M0744M3309M16m070J4267K3633J13k039k008j9312
$$ -961838 -977682 -975311 -955752 -915008 -871699 -871283 -875353 -861086 -837453 -837340 -839379 -841387 -860699
10096h60699L3613J7486K332J7087J5650M9765K3946k1366n320M4146K0657L0945
$$ -860699 -827086 -809600 -807268 -790181 -774531 -724766 -700820 -722186 -727506 -683360 -662703 -631758
10084f31758J3165J7605K8470J3111j8284L3370K0794L6974P2313L6307J0902
$$ -631758 -618593 -600988 -572518 -559407 -577691 -544321 -523527 -486553 -414240 -377933 -367031
10073c67031N2261L4111L4866K1002J7341L3770O5412N4458K4646J2618P1267
$$ -367031 -314770 -280659 -245793 -224791 -207450 -173680 -108268 -53810 -29164 -16546 54721
10062E4721R2171O6063Q2821P1393J41553J59486J63620J62601J80756J91037
$$ 54721 146892 212955 295776 367169 508722 668208 831828 994429 1175185 1366222
10052A366222K60042L24961L63411M28865N51408P31847Q44297M99834j369639
$$ 1366222 1626264 1951225 2314636 2743501 3294909 4026756 4871053 5370887 4001248
10043D001248k676829k547956l299487j594549j40959L28889M60414M44184M02210
$$ 4001248 1324419 -1223537 -4523024 -6117573 -6258532 -5929643 -5469229 -5025045 -4622835
10034d622835L32645K58749J68145J48294J09971J15456J17303Q5718P7474O4319
$$ -4622835 -4290190 -4031441 -3863296 -3715002 -3605031 -3489575 -3372272 -3286554 -3209080 -3144761
10024c144761P6473O2044K0816K0169R1182Q1972N8980L4277J7357K6525K0325
$$ -3144761 -3068288 -3006244 -2985428 -2965259 -2874077 -2792105 -2733125 -2698848 -2681491 -2654966 -2634641
10013b634641K1205N1556L6334K1416K2026N305K4109L6008J9435j221J7594K3984
$$ -2634641 -2613436 -2561880 -2525546 -2504130 -2482104 -2476799 -2452690 -2416682 -2397247 -2398468 -2380874 -2356890
10001b356890J0491L6759K2993n15j0470J8932J6793J0539J990j7575j279K3615
$$ -2356890 -2346399 -2309640 -2286647 -2287162 -2297632 -2278700 -2261907 -2251368 -2249378 -2266953 -2268232 -2244617
9989b244617L2533L9390K1689l3282K948J7291Q814J3621L0184K1942j3282J3675
$$ -2244617 -2212084 -2172694 -2151005 -2184287 -2181339 -2164048 -2155234 -2141613 -2111429 -2089487 -2102769 -2089094
9977b089094M012j585k459j7440k078J1866K8224L2451K0128J2501L844j1053
$$ -2089094 -2085082 -2086667 -2089126 -2106566 -2108644 -2096778 -2068554 -2036103 -2015975 -2003474 -1999630 -2010683
9965b010683J168k481j4637J3191J5899K7269M259K0091K0652l1146l3379Q063
$$ -2010683 -2009515 -2011996 -2026633 -2013442 -1997543 -1970274 -1966015 -1945924 -1925272 -1956418 -1989797 -1981734
9953a981734P030L0797M7745o560j1019J5150j4233l3950J1162N422K00Q665M2295
$$ -1981734 -1974704 -1943907 -1896162 -1902722 -1913741 -1898591 -1912824 -1946774 -1935612 -1930190 -1929990 -1921325 -1879030
9940a879030l625M55j9514L3627j2357j0354L1096J7197J2868n941l4304L459
$$ -1879030 -1882655 -1882200 -1901714 -1868087 -1880444 -1890798 -1859702 -1842505 -1829637 -1835578 -1869882 -1866423
9928a866423K8809Q59J2697k064M4501L011j8274m0761j3530M750M6411N719Q859
$$ -1866423 -1837614 -1836755 -1824058 -1826122 -1781621 -1778610 -1796884 -1837645 -1851175 -1846425 -1800014 -1794295 -1785436
9915a785436L1478O88j5154l6149j0778K7780J7179o0j6776j2330k0134r720L1875
$$ -1785436 -1753958 -1753270 -1768424 -1804573 -1815351 -1787571 -1770392 -1770452 -1787228 -1799558 -1819692 -1829412 -1797537
9902a797537M1397J6535M985L0880l1160l6267J7580J4114J8314K8161m670k3086
$$ -1797537 -1756140 -1739605 -1734620 -1703740 -1734900 -1771167 -1753587 -1739473 -1721159 -1692998 -1697668 -1720754
9890a720754J2696p93n078j9860J3852J5923j757j0418K9130K3377P753j3546
$$ -1720754 -1708058 -1708851 -1713929 -1733789 -1719937 -1704014 -1705771 -1716189 -1687059 -1663682 -1655929 -1669475
9878a669475n510p77j1818J714R357k44l132J556j4354j6325n322K1115o527K5631
$$ -1669475 -1674985 -1675762 -1687580 -1685866 -1676509 -1676753 -1679885 -1678329 -1692683 -1709008 -1714330 -1693215 -1699742 -1674111
9864a674111J8178J0915J0138J3872k2042k4525J2217o089P344J3964L1161J1254
$$ -1674111 -1655933 -1645018 -1634880 -1621008 -1643050 -1667575 -1655358 -1661447 -1654103 -1640139 -1608978 -1597724
9852a597724j9276M720m3764l3057K3655O921j4717j0404J4884p921l6167J6825
$$ -1597724 -1617000 -1612280 -1656044 -1689101 -1665446 -1658525 -1673242 -1683646 -1668762 -1676683 -1712850 -1696025
9840a696025L8659K0742K2164K3633K043m266K7831j3753k2516J566j8949j0690
$$ -1696025 -1657366 -1636624 -1614460 -1590827 -1588784 -1593050 -1565219 -1578972 -1601488 -1599922 -1618871 -1629561
9828a629561L536J4681j0954J4839J0504J1179M978l7448k2882K3970L6198J0973
$$ -1629561 -1626025 -1611344 -1622298 -1607459 -1596955 -1585776 -1580798 -1618246 -1641128 -1617158 -1580960 -1569987
9816a569987l1472j8008K2069J6632J4211J6791k850j6006k3918K8935J2359p404
$$ -1569987 -1601459 -1619467 -1597398 -1580766 -1566555 -1549764 -1552614 -1568620 -1592538 -1563603 -1551244 -1558648
9804a558648O822j4285j5696m180N311M755J7836M19L288J2991R041j4156n370
$$ -1558648 -1551826 -1566111 -1581807 -1585987 -1580676 -1575921 -1558085 -1557666 -1554378 -1541387 -1532346 -1546502 -1551872
9791a551872k980L129m48J504K1446J7360k0172J279K2765L962j3358J5809k7755
$$ -1551872 -1554852 -1551723 -1552171 -1550667 -1529221 -1511861 -1532033 -1530754 -1507989 -1504027 -1517385 -1501576 -1529331
9778a529331J157R806m699K02L1319r968N366p600m665k1724N793m815J871J5046
$$ -1529331 -1528174 -1518368 -1523067 -1522865 -1491546 -1501514 -1496148 -1503748 -1508413 -1530137 -1524344 -1529159 -1527288 -1512242
9764a512242R635K112j6183J9847J6878k8575j8999J0945K2039O347J8485j0980
$$ -1512242 -1502607 -1500495 -1516678 -1496831 -1479953 -1508528 -1527527 -1516582 -1494543 -1488196 -1469711 -1480691
9752a480691j2738K0046L6639k1176m5042O154p722m354L400k0545l7887j0834
$$ -1480691 -1493429 -1473383 -1436744 -1457920 -1502962 -1496808 -1504530 -1508884 -1505484 -1526029 -1563916 -1574750
9740a574750K8851K1621K311K7541N3717J7727l1515k9496K2672o565j1181J9831
$$ -1574750 -1545899 -1524278 -1521967 -1494426 -1440709 -1422982 -1454497 -1483993 -1461321 -1467886 -1479067 -1459236
9728a459236K7903p330l329Q624j1946j5929J3242k0131R106P988j4434J7563
$$ -1459236 -1431333 -1438663 -1441992 -1433368 -1445314 -1461243 -1448001 -1468132 -1459026 -1451038 -1465472 -1447909
9716a447909L09k044J5645R506j5993Q322K1501l083K6933j680r903o467k4660
$$ -1447909 -1447600 -1449644 -1433999 -1424493 -1440486 -1432164 -1410663 -1413746 -1386813 -1388493 -1398396 -1404863 -1429523
9703a429523j7165K152K1606L934j6606J3874J5023m1325k2611L6450K3424q312
$$ -1429523 -1446688 -1444536 -1422930 -1418996 -1435602 -1421728 -1406705 -1448030 -1470641 -1434191 -1410767 -1419079
9691a419079p990q196l058J5882J9948K6928o704m3308j6222K5256L3550L674
$$ -1419079 -1427069 -1435265 -1438323 -1422441 -1402493 -1375565 -1382269 -1425577 -1441799 -1416543 -1382993 -1379319
9679a379319q85K0373j0852M197K4744q632k9955j6347m770K1077J7600l1691
$$ -1379319 -1380204 -1359831 -1370683 -1366486 -1341742 -1350374 -1380329 -1396676 -1401446 -1380369 -1362769 -1394460
9667a394460o460J4721K2598K2830k2480L518K6018j8255l2489N705N447J1723
$$ -1394460 -1400920 -1386199 -1363601 -1340771 -1363251 -1359733 -1333715 -1351970 -1384459 -1378754 -1373307 -1361584
9655a361584J8318j1866l875j3524Q636J2690K288q115q365K093R16M6281K1376
$$ -1361584 -1343266 -1355132 -1359007 -1372531 -1363895 -1351205 -1348917 -1357032 -1365397 -1363304 -1362388 -1316107 -1294731
9642a294731r135K9671N58l2415j4214j5758r767j5858k1232j5498K6347j0905
$$ -1294731 -1303866 -1274195 -1273637 -1306052 -1320266 -1336024 -1345791 -1361649 -1382881 -1398379 -1372032 -1382937
9630a382937j3258q52J4443L574O001j1608l185J7294P985k2790j8084K3117m471
$$ -1382937 -1396195 -1397047 -1382604 -1379030 -1373029 -1384637 -1387822 -1370528 -1362543 -1385333 -1403417 -1380300 -1384771
9617a384771l5155j2105K4848K9682k011K376L0292K4848K4293j5141r504K79
$$ -1384771 -1419926 -1432031 -1407183 -1377501 -1379512 -1377136 -1346844 -1321996 -1297703 -1312844 -1322348 -1322069
9605a322069j1631j8192J4687l549q98J5913k232O433o641o913J5944o129k5368
$$ -1322069 -1333700 -1351892 -1337205 -1340754 -1341652 -1325739 -1327971 -1321538 -1328179 -1335092 -1319148 -1325277 -1350645
9592a350645L943K8544o154k534j5812J2417L1110j840o851n83n67R995j8981
$$ -1350645 -1346702 -1318158 -1324312 -1326846 -1342658 -1330241 -1299131 -1300971 -1307822 -1308405 -1308972 -1298977 -1317958
9579a317958k865q542r585J9004l356k943O295j100K1120L9547J5070j0369n872
$$ -1317958 -1320823 -1329365 -1338950 -1319946 -1323302 -1326245 -1319950 -1321050 -1299930 -1260383 -1245313 -1255682 -1261554
9566a261554k2227R410Q712j6908q595L0536J6545m334J6803J8341k9667j0000
$$ -1261554 -1283781 -1274371 -1265659 -1282567 -1291162 -1260626 -1244081 -1248415 -1231612 -1213271 -1242938 -1252938
9554a252938l3480K8187K1705j912K967j6476k3301M648n473k5561j899j5928
$$ -1252938 -1286418 -1258231 -1236526 -1238438 -1235471 -1251947 -1275248 -1270600 -1276073 -1301634 -1303533 -1319461
9542a319461n629J7228k212K631n106j4146k3776Q554M7241L3523j241P968O032
$$ -1319461 -1325090 -1307862 -1310074 -1307443 -1312549 -1326695 -1350471 -1341917 -1294676 -1261153 -1262394 -1254426 -1248394
9529a248394J5867J4225K3764m4081k1001J5851o80J2559J0985J7334k3001j6973
$$ -1248394 -1232527 -1218302 -1194538 -1238619 -1259620 -1243769 -1244449 -1231890 -1220905 -1203571 -1226572 -1243545
9517a243545L0532O480j6108M981N266J0608l67l0233M959J6819k703O402p682
$$ -1243545 -1213013 -1206533 -1222641 -1217660 -1212394 -1201786 -1202153 -1232386 -1227427 -1210608 -1213311 -1206909 -1214591
9504a214591k0847M041j476J4633L0406L4815l6818k2070j9998j1685l38K7891
$$ -1214591 -1235438 -1231397 -1232873 -1218240 -1187834 -1153019 -1189837 -1211907 -1231905 -1243590 -1243928 -1216037
9492a216037J7730r002l8060p680K2128K5513N911k4969k9541K9750Q79J1333
$$ -1216037 -1198307 -1207309 -1245369 -1253049 -1230921 -1205408 -1199497 -1224466 -1254007 -1224257 -1223378 -1212045
9480a212045K8948j5028M766j1046J8197J3359k0636j2080J3790l114r099L2784
$$ -1212045 -1183097 -1198125 -1193359 -1204405 -1186208 -1172849 -1193485 -1205565 -1191775 -1194889 -1203988 -1171204
9468a171204J475P959L35n2l3053P919L4347k109l6392j4078K9354J769k4204
$$ -1171204 -1169729 -1161770 -1161435 -1161487 -1194540 -1186621 -1152274 -1154383 -1190775 -1204853 -1175499 -1173730 -1197934
9455a197934K7992L7959K4729n632j0860k28n478N306L4248k5812k7080Q987O835
$$ -1197934 -1169942 -1131983 -1107254 -1112886 -1123746 -1123974 -1129452 -1124146 -1089898 -1115710 -1142790 -1133803 -1126968
9442a126968J1448R512m9651m3573K3791N4763Q772l1378K013Q977k7271r055
$$ -1126968 -1115520 -1106008 -1155659 -1199232 -1175441 -1120678 -1111906 -1143284 -1141271 -1132294 -1159565 -1168620
9430a168620R217k673o262K9819q457J3901k3878J9068O59j6042M862L362L9916
$$ -1168620 -1159403 -1162076 -1168338 -1138519 -1146976 -1133075 -1156953 -1137885 -1137226 -1153268 -1148406 -1145044 -1105128
9417a105128J0338j0317j8015K102Q66j0925j3421m659l266m116M906K9875k188
$$ -1105128 -1094790 -1105107 -1123122 -1121020 -1120154 -1131079 -1144500 -1149159 -1152425 -1156541 -1151635 -1121760 -1123948
9404a123948O377q013J9612J9431j2813r87q32j6107p517O3407K3132J3364k3663
$$ -1123948 -1117571 -1125584 -1105972 -1086541 -1099354 -1100341 -1101173 -1117280 -1124797 -1061390 -1038258 -1024894 -1048557
9391a048557o567K0537j9127K3567K8570o063j5593j0517J4406J6553j4457k0160
$$ -1048557 -1055124 -1034587 -1053714 -1030147 -1001577 -1007640 -1023233 -1033750 -1019344 -1002791 -1017248 -1037408
9379a037408j215j397k536r091J5835q34N932K3200K5332K7497m41j9620P895
$$ -1037408 -1038623 -1040020 -1042556 -1051647 -1035812 -1036646 -1030714 -1007514 -982182 -954685 -955126 -974746 -966851
9366i66851n9125l3658K1069M0047l76k6948k5269K809J9156J6021q590J367P893
$$ -966851 -1025976 -1059634 -1038565 -998518 -998894 -1025842 -1051111 -1048302 -1029146 -1013125 -1021715 -1020348 -1012455
9353a012455J1186J6135j8742j9357L5805O137Q368J2065J6509J4957L616p230
$$ -1012455 -1001269 -985134 -1003876 -1023233 -987428 -981291 -972923 -960858 -944349 -929392 -925776 -933006
9341i33006M624l3188j239m901J07p249l760J9527N449m420n585k7200L6786J2636
$$ -933006 -928382 -961570 -962809 -967710 -967603 -974852 -978612 -959085 -953636 -958056 -963641 -990841 -954055 -941419
9327i41419j1647J4830K1467J5789J5766P582K2552O500k2414J5289J627l1486
$$ -941419 -953066 -938236 -916769 -900980 -885214 -877632 -855080 -848580 -870994 -855705 -854078 -885564
9315h85564k4532j1614j0608J2799N258M2374L6846j016k8856j9964p376N4912
$$ -885564 -910096 -921710 -932318 -919519 -914261 -871887 -835041 -836057 -864913 -884877 -892253 -837341
9303h37341l456j1622Q620J3635n713j9254l942J5972K3419J2003J4391L9533
$$ -837341 -840797 -852419 -843799 -830164 -835877 -855131 -859073 -843101 -819682 -807679 -793288 -753755
9291g53755O12L656K821k1217R202L3365N663q089K349k4062m270L073J4789R588
$$ -753755 -753143 -749487 -746666 -767883 -758681 -725316 -719653 -727742 -725393 -749455 -753725 -750652 -735863 -726275
9277g26275M323M0833L0257P082j2480l0277j2434l986m44K5957J6526R51P075
$$ -726275 -721952 -681119 -650862 -643780 -656260 -686537 -698971 -702957 -703401 -677444 -660918 -659967 -652892
9264f52892M907R685J8454J1646K1727K947J0191K5721J1915L615Q750j6298l5177
$$ -652892 -647985 -638300 -619846 -608200 -586473 -583526 -573335 -547614 -535699 -532084 -523334 -539632 -574809
9251e74809N453L4943M2083K9165L5850l658K1753L128j1471M1353K3963K0824
$$ -574809 -569356 -534413 -492330 -463165 -427315 -430973 -409220 -406092 -417563 -376210 -352247 -331423
9239c31423j3074j5035J8836L549l9163K4163M9249M0811O014K0452K2930p268
$$ -331423 -344497 -359532 -340696 -337147 -376310 -352147 -302898 -262087 -256073 -235621 -212691 -219959
9227b19959M610K8185J6599J4954M3377m480J524L6500J0098p164n890L7188L6625
$$ -219959 -215349 -187164 -170565 -155611 -112234 -116714 -115190 -78690 -68592 -75756 -81646 -44458 -7833
9214g833M63j5875K9395M5408N267j3714k7962p781L8383J6624o863l9803n6270
$$ -7833 -7370 -23245 6150 51558 56825 43111 15149 7368 45751 62375 55512 15709 -40561
9201d0561m0363q539k6553m9779n0032n0491p9952p7066r2112r2765r8296j14188
$$ -40561 -80924 -89463 -116016 -165795 -215827 -266318 -346270 -423336 -515448 -608213 -706509 -820697
9189h20697r6771r1134r1590r8488j02029j09727j16938q6071q8338q1322m0244
$$ -820697 -917468 -1008602 -1100192 -1198680 -1300709 -1410436 -1527374 -1613445 -1701783 -1783105 -1823349
9178a823349m6018n2208m1555n5376k8134l1287l0295k4479l0681j7784j1116
$$ -1823349 -1869367 -1921575 -1963130 -2018506 -2046640 -2077927 -2108222 -2132701 -2163382 -2181166 -2192282
9167b192282m7356j8330j946j5060l470R120j544o026m891m334r292N77J6129
$$ -2192282 -2239638 -2257968 -2259914 -2274974 -2278444 -2269324 -2270868 -2276894 -2281785 -2286119 -2295411 -2294834 -2278705
9154b278705J6427J664m177K0021L6364j5964l3780k0875K4398M0880L3072K8308
$$ -2278705 -2262278 -2260614 -2264791 -2244770 -2208406 -2224370 -2258150 -2279025 -2254627 -2213747 -2180675 -2152367
9142b152367K4294j1844P697j5495j0052q269J2136M4281J7901M189q409l6347
$$ -2152367 -2128073 -2139917 -2132220 -2147715 -2157767 -2166036 -2153900 -2109619 -2091718 -2087529 -2095938 -2132285
9130b132285Q338K8115l594k6934J1240K2099j7629N878L7037R347K1947Q762
$$ -2132285 -2123947 -2095832 -2099426 -2126360 -2115120 -2093021 -2110650 -2104772 -2067735 -2058388 -2036441 -2027679
9118b027679K2738R694j0884K793K0528K2113k8329j7772k302R91P587Q131K4008
$$ -2027679 -2004941 -1995247 -2006131 -2003338 -1982810 -1960697 -1989026 -2006798 -2009100 -2008109 -2000522 -1992391 -1968383
9105a968383J1466J7687j3335q695R258J3049j2936K101J182J1854L1240K0098
$$ -1968383 -1956917 -1939230 -1952565 -1961260 -1952002 -1938953 -1951889 -1949788 -1948606 -1936752 -1905512 -1885414
9093a885414K8412J6690J9162J4876q189L554J281L0077O062k2965K903p149j8647
$$ -1885414 -1857002 -1840312 -1821150 -1806274 -1814463 -1810909 -1809628 -1779551 -1773489 -1796454 -1793551 -1800700 -1819347
9080a819347O407J0578l780n21K4072J3872J2645j4017L311J692l360p714m540
$$ -1819347 -1812940 -1802362 -1806142 -1806663 -1782591 -1768719 -1756074 -1770091 -1766780 -1765088 -1768448 -1776162 -1780702
9067a780702j6459j7284K342K8274o251j2830J7195K751q227m77q314J7177O572
$$ -1780702 -1797161 -1814445 -1812103 -1783829 -1790080 -1802910 -1785715 -1782964 -1791191 -1791668 -1799982 -1782805 -1776233
9054a776233J1407p990J2163J4879L4795J8609k1654j8111J3849K96J1151K545
$$ -1776233 -1764826 -1772816 -1760653 -1745774 -1710979 -1692370 -1714024 -1732135 -1718286 -1717990 -1706839 -1704294
9042a704294n226J0223L037K1850q90j7380R000J8014M4999j169k0695k9065N621
$$ -1704294 -1709520 -1699297 -1696260 -1674410 -1675300 -1692680 -1683680 -1665666 -1620667 -1621836 -1642531 -1671596 -1665975
9029a665975K7918k7497j9139n085R334K8158k2057k1985r390K023K3602J7511
$$ -1665975 -1638057 -1665554 -1684693 -1689778 -1680444 -1652286 -1674343 -1696328 -1705718 -1703695 -1680093 -1662582
9017a662582L1203P253K9666j4166l1598L3437K5262J044J047k1682j0245Q266
$$ -1662582 -1631379 -1624126 -1594460 -1608626 -1640224 -1606787 -1581525 -1580481 -1579434 -1601116 -1611361 -1603095
9005a603095L5452J034o406j6506j5911j5307Q97J5274M7875J2714p900r198N433
$$ -1603095 -1567643 -1566609 -1573015 -1589521 -1605432 -1620739 -1619842 -1604568 -1556693 -1543979 -1551879 -1561077 -1555644
8992a555644m79j3608J3516J4724J697J6405P772j5737j7465o012J1795r523o217
$$ -1555644 -1556123 -1569731 -1556215 -1541491 -1539794 -1523389 -1515617 -1531354 -1548819 -1554831 -1543036 -1552559 -1558776
8979a558776L537o732p099J3119j3237R365J5079J6171O409j4620J8506L135j4022
$$ -1558776 -1555239 -1561971 -1569070 -1555951 -1569188 -1559823 -1544744 -1528573 -1522164 -1536784 -1518278 -1515143 -1529165
8966a529165k0j0035j1147j1560l134J4269R979P038j360J281K5878L5258k8606
$$ -1529165 -1529185 -1539220 -1550367 -1561927 -1565061 -1550792 -1540813 -1533775 -1535135 -1533854 -1507976 -1472718 -1501324
8953a501324J5269M278J9224K9584q147L793Q303J2594J2031k4546j4748k9853
$$ -1501324 -1486055 -1481777 -1462553 -1432969 -1441116 -1437323 -1429020 -1416426 -1404395 -1428941 -1443689 -1473542
8941a473542M421j2687m468j909K539Q358j1094j9743J6287M7853J5948K4303
$$ -1473542 -1469121 -1481808 -1486276 -1488185 -1485646 -1477288 -1488382 -1508125 -1491838 -1443985 -1428037 -1403734
8929a403734p078j7299M424K2277j3499m9460J538J7778J1992J1857o446l152
$$ -1403734 -1410812 -1428111 -1423687 -1401410 -1414909 -1464369 -1462831 -1445053 -1433061 -1421204 -1427650 -1430802
8917a430802J752j2325k1149j3526l833O66J4020L2849J5891l0984P862J6234
$$ -1430802 -1429050 -1441375 -1462524 -1476050 -1479883 -1479217 -1465197 -1432348 -1416457 -1447441 -1439579 -1423345
8905a423345p472j533r198k8483l436L7806L3583P886j7662j1454K380k785n073
$$ -1423345 -1430817 -1432350 -1441548 -1470031 -1473467 -1435661 -1402078 -1394192 -1411854 -1423308 -1420928 -1423713 -1428786
8892a428786r782j9540K330r051M122K6077k077p391K9496J3401J6495j3812o878
$$ -1428786 -1438568 -1458108 -1455778 -1464829 -1460707 -1434630 -1436707 -1444098 -1414602 -1401201 -1384706 -1398518 -1405396
8879a405396j6097q228J5027J397N813k8175r300o189J9980r101Q688L1634l992
$$ -1405396 -1421493 -1429721 -1414694 -1413297 -1407484 -1435659 -1444959 -1451148 -1431168 -1440269 -1431581 -1399947 -1403939
8866a403939J1030j4789q238K2217J3358m823j1807J8381P522j1604q995K0208
$$ -1403939 -1392909 -1407698 -1415936 -1393719 -1380361 -1385184 -1396991 -1378610 -1371088 -1382692 -1391687 -1371479
8854a371479J2927j3465k7036n969M367J9092l668j5182O088J1753R8j2271k137
$$ -1371479 -1358552 -1372017 -1399053 -1405022 -1400655 -1381563 -1385231 -1400413 -1394325 -1382572 -1382474 -1394745 -1396882
8841a396882L309k7636Q870J4837R557j052Q597K3438L85J739M061p874J3342
$$ -1396882 -1393573 -1421209 -1412339 -1397502 -1387945 -1388997 -1380400 -1356962 -1356577 -1354838 -1350777 -1358651 -1345309
8828a345309m239q021m195j403J3845J6290J8079j3713j1303r53O893K719j6188
$$ -1345309 -1349548 -1357569 -1361764 -1363167 -1349322 -1333032 -1314953 -1328666 -1339969 -1340922 -1334029 -1331310 -1347498
8815a347498j1403K757j750K7912J9387m29o474J876k1355q489L4355k9689K328
$$ -1347498 -1358901 -1356144 -1357894 -1329982 -1310595 -1311024 -1317498 -1315622 -1336977 -1345466 -1311111 -1340800 -1338472
8802a338472K2575J215j4016m9976K852J2053L2821L1977k029k1780P346k9674
$$ -1338472 -1315897 -1314682 -1328698 -1378674 -1375822 -1363769 -1330948 -1298971 -1301000 -1322780 -1315434 -1345108
8790a345108k1869L335K1681k2074O831j710K419j6344L445K6542K257J897k7614
$$ -1345108 -1366977 -1363642 -1341961 -1364035 -1357204 -1358914 -1356495 -1372839 -1369394 -1342852 -1340595 -1338698 -1366312
8777a366312j2064J4311K0268P634P472j1024k0328J2117Q666J0682J5339J9037
$$ -1366312 -1378376 -1364065 -1343797 -1336163 -1328691 -1339715 -1360043 -1347926 -1339260 -1328578 -1313239 -1294202
8765a294202J1137q902j9640P065K6682Q535l4266j9904k107J290L8644L198j3933
$$ -1294202 -1283065 -1291967 -1311607 -1304542 -1277860 -1269325 -1303591 -1323495 -1325602 -1324312 -1285668 -1282470 -1296403
8752a296403N95q364J4678K5628k6513j3638J7543J1665O228k6570m7022J3015
$$ -1296403 -1295808 -1304172 -1289494 -1263866 -1290379 -1304017 -1286474 -1274809 -1268581 -1295151 -1342173 -1329158
8740a329158K9128J1610J201k6789O2K490K6017J9290K1547k1932r460o914l7184
$$ -1329158 -1300030 -1288420 -1287219 -1314008 -1313946 -1311456 -1285439 -1266149 -1244602 -1266534 -1275994 -1282908 -1320092
8727a320092j102L8686J3621J4173j4858m664j5846o172K0814Q055J0404K898
$$ -1320092 -1321194 -1282508 -1268887 -1254714 -1269572 -1274236 -1290082 -1296254 -1275440 -1267385 -1256981 -1254083
8715a254083k3089l437L5982L5439l184l8269k2289K8853N560j6868o481p84r83
$$ -1254083 -1277172 -1280609 -1244627 -1209188 -1212372 -1250641 -1272930 -1244077 -1238517 -1255385 -1261866 -1262650 -1263633
8702a263633j0687J6402J5722l9012q775n245k729j0996O83J3941P507R373j5101
$$ -1263633 -1274320 -1257918 -1242196 -1281208 -1289983 -1295228 -1297957 -1308953 -1308270 -1294329 -1286822 -1277449 -1292550
8689a292550j78K6363J8343J417r293K4604J8663J1033k6010l6172o173l932K7669
$$ -1292550 -1292728 -1266365 -1248022 -1246605 -1255898 -1231294 -1212631 -1201598 -1227608 -1263780 -1269953 -1273885 -1246216
8676a246216Q110J305j5047r920K914j4779N346J7312J5656j099j5679m220J0079
$$ -1246216 -1238106 -1236801 -1251848 -1261768 -1258854 -1273633 -1268287 -1250975 -1235319 -1236418 -1252097 -1256317 -1246238
8663a246238J9020j0882O816J2209J9826j0N796l8j8876j8946M1629l451k1523
$$ -1246238 -1227218 -1238100 -1231284 -1219075 -1199249 -1199259 -1193463 -1193501 -1212377 -1231323 -1189694 -1193145 -1214668
8650a214668N48j3536m212R278M8428p961j4508j7571K1136J5996k2784k4522
$$ -1214668 -1214120 -1227656 -1231868 -1222590 -1174162 -1182123 -1196631 -1214202 -1193066 -1177070 -1199854 -1224376
8638a224376j0755j5207Q615j069O512K3019l619j5116M987J0029J6840l7225
$$ -1224376 -1235131 -1250338 -1241723 -1242792 -1236280 -1213261 -1216880 -1231996 -1227009 -1216980 -1200140 -1237365
8626a237365n764L603J7222M425J6430J2805l071l62O165J7509l2692j6565J5809
$$ -1237365 -1243129 -1239526 -1222304 -1217879 -1201449 -1188644 -1191715 -1192077 -1185912 -1168403 -1201095 -1217660 -1201851
8613a201851J7680J5895L4713m2828o5094Q101J1424L3238J3990k8552p75J6024
$$ -1201851 -1184171 -1168276 -1133563 -1176391 -1241485 -1233384 -1221960 -1188722 -1174732 -1203284 -1204059 -1188035
8601a188035J6636J2794J877l11k9146r258k904K2094j3760j8571j003M539j897
$$ -1188035 -1171399 -1158605 -1156728 -1157039 -1186185 -1195443 -1198347 -1176253 -1190013 -1208584 -1209587 -1205048 -1206945
8588a206945l5859j3800K1328O882j8025r808R197L4148M7996q236k7616L716
$$ -1206945 -1242804 -1256604 -1235276 -1228394 -1246419 -1256227 -1247030 -1212882 -1164886 -1173122 -1200738 -1197022
8576a197022k1977j7627k5392K9904J8552J975J1968j6563q304l590K714j6366
$$ -1197022 -1218999 -1236626 -1262018 -1232114 -1213562 -1211587 -1199619 -1216182 -1224486 -1228076 -1225362 -1241728
8564a241728J8276L0281J919k4336k0182O352Q596J6849m337P113k2916j5405
$$ -1241728 -1223452 -1193171 -1191252 -1215588 -1235770 -1229418 -1220822 -1203973 -1208310 -1201197 -1224113 -1239518
8552a239518N299J0512q666p386J7901R479k5329J1821J0724j342M848J2003J8790
$$ -1239518 -1234219 -1223707 -1232373 -1239759 -1221858 -1212379 -1237708 -1225887 -1215163 -1216505 -1211657 -1199654 -1180864
8539a180864n23j5303j8764M334k1552j1994r563J7167j5916O687P134K9041L1470
$$ -1180864 -1181387 -1196690 -1215454 -1211120 -1232672 -1244666 -1254229 -1237062 -1252978 -1246291 -1239157 -1210116 -1178646
8526a178646K7482J501j0072K1883l543l0763j6467n609R017o516M681J450k9484
$$ -1178646 -1151164 -1149663 -1159735 -1137852 -1141395 -1172158 -1188625 -1194234 -1185217 -1191733 -1187052 -1185602 -1215086
8513a215086n149j532p498O936L2165j2682j5002j4817l855K3464K9010l841R667
$$ -1215086 -1220235 -1221767 -1229265 -1222329 -1190164 -1202846 -1217848 -1232665 -1236520 -1213056 -1184046 -1187887 -1178220
8500a178220L137N352j2978p4J486j6682J7391K6090J4359m3887k1024Q378K5859
$$ -1178220 -1175083 -1169731 -1182709 -1182783 -1181297 -1197979 -1180588 -1154498 -1140139 -1184026 -1205050 -1196672 -1170813
8487a170813K397j1506j536L1102J0765j6340j699j9098l5229K4344K0899M97
$$ -1170813 -1168416 -1179922 -1181458 -1150356 -1139591 -1155931 -1157630 -1176728 -1211957 -1187613 -1166714 -1166217
8475a166217r581L293m597J7540k3097Q208J1746O124n165N51k4446P237k3251
$$ -1166217 -1175798 -1172505 -1177102 -1159562 -1182659 -1174451 -1162705 -1156581 -1161746 -1161195 -1185641 -1178404 -1201655
8462a201655o611M3775J2139L3329J27j64q560k1987J1905R953m8167K339J6866
$$ -1201655 -1208266 -1164491 -1152352 -1119023 -1118896 -1119060 -1127620 -1149607 -1137702 -1127749 -1175916 -1173577 -1156711
8449a156711j5928j2805M518J2167J6728o797j7683j3040R466L7799k677k9367
$$ -1156711 -1172639 -1185444 -1180926 -1168759 -1152031 -1158828 -1176511 -1189551 -1180085 -1142286 -1144963 -1174330
8437a174330k2408q680K0579K8524j0741j5152K266l0598j7731J4012K3294K8683
$$ -1174330 -1196738 -1205418 -1184839 -1156315 -1167056 -1182208 -1179942 -1210540 -1228271 -1214259 -1190965 -1162282
8425a162282K0468N642k3198p881L550J2418M540j0022Q577K4738l070l1750P017
$$ -1162282 -1141814 -1136172 -1159370 -1167251 -1163701 -1151283 -1146743 -1156765 -1148188 -1123450 -1126520 -1158270 -1151253
8412a151253J6271L444j9151j6603L879J6471n034J8573j8616l7740j0003L869
$$ -1151253 -1134982 -1131538 -1150689 -1167292 -1163413 -1146942 -1151976 -1133403 -1152019 -1189759 -1199762 -1195893
8400a195893l978m732k2929J8449K1948l3753j0901K2603J0708j5933J72M3348
$$ -1195893 -1199871 -1204603 -1227532 -1209083 -1187135 -1220888 -1231789 -1209186 -1198478 -1214411 -1214239 -1170891
8388a170891K468j4808o291n784J818J9526M0529J6272o2058l3693m590K9623
$$ -1170891 -1168423 -1183231 -1189522 -1195306 -1193488 -1173962 -1133433 -1117161 -1179219 -1212912 -1217502 -1187879
8376a187879M439k0188L0148K2943r102L8803j0160m9211J4228L7094J996n561
$$ -1187879 -1183440 -1203628 -1173480 -1150537 -1159639 -1120836 -1130996 -1180207 -1165979 -1128885 -1126889 -1132450
8364a132450K419q873J8449J9535J8188k5473k3807j569K287J7487k6932j3821
$$ -1132450 -1130031 -1138904 -1120455 -1100920 -1082732 -1108205 -1132012 -1133581 -1131294 -1113807 -1140739 -1154560
8352a154560K8722K5128j4796k5516J3728k6237l6541Q804J3425O440K0628k094
$$ -1154560 -1125838 -1100710 -1115506 -1141022 -1127294 -1153531 -1190072 -1181268 -1167843 -1161403 -1140775 -1142869
8340a142869j0947J4439J0093r237k3322k4601m337M231L0461P149j3996k5724
$$ -1142869 -1153816 -1139377 -1129284 -1138521 -1161843 -1186444 -1190781 -1186550 -1156089 -1148940 -1162936 -1188660
8328a188660J3356L3092l824J676o090r201J074K4834l6122o37J4790j2245k5758
$$ -1188660 -1175304 -1142212 -1146036 -1144360 -1150450 -1159651 -1158577 -1133743 -1169865 -1170502 -1155712 -1167957 -1193715
8315a193715M444L1571j219j1288K3206L9723K2834n0550M324L4149j9908p044
$$ -1193715 -1189271 -1157700 -1158919 -1170207 -1147001 -1107278 -1084444 -1134994 -1130670 -1096521 -1116429 -1123473
8303a123473j5240l684j6594o249J6386J595L2414J3344p874N851L693J2989R750
$$ -1123473 -1138713 -1142397 -1158991 -1165240 -1148854 -1147259 -1114845 -1101501 -1109375 -1103524 -1099831 -1086842 -1077092
8290a077092l0430l1623j7940N605O839M591l317K4572O831p814k8815j3509r164
$$ -1077092 -1107522 -1139145 -1157085 -1151480 -1144641 -1140050 -1143367 -1118795 -1111964 -1119778 -1148593 -1162102 -1171266
8277a171266K2462L542q989r94J4718J8726K8494N396j0162l4274K2743l647m074
$$ -1171266 -1148804 -1145262 -1154251 -1155245 -1140527 -1121801 -1093307 -1087911 -1098073 -1132347 -1109604 -1113251 -1117325
8264a117325j137K4985K9658l517q999j4919r298m895R781j5449K736l24p771
$$ -1117325 -1118462 -1093477 -1063819 -1067336 -1076335 -1091254 -1100552 -1105447 -1095666 -1111115 -1108379 -1108703 -1116474
8251a116474r988K388r252n544M127Q386N167Q430J2407j4383k930N997P90m115
$$ -1116474 -1126462 -1124074 -1133326 -1138870 -1134743 -1126357 -1121190 -1112760 -1100353 -1114736 -1117666 -1111669 -1110879 -1114994
8237a114994m1324j0537K6814J6615K232J3682L0461K3267j7913l7157J3372J5529
$$ -1114994 -1156318 -1166855 -1140041 -1123426 -1121194 -1107512 -1077051 -1053784 -1071697 -1108854 -1095482 -1079953
8225a079953O856J3868j8332j0443J9337k0827k1449j522l8395l513M825K6338
$$ -1079953 -1073097 -1059229 -1077561 -1088004 -1068667 -1089494 -1110943 -1112465 -1150860 -1154373 -1149548 -1123210
8213a123210K3699n529O535p866M309k7362O257L3233M99l1798k5080J1729K4703
$$ -1123210 -1099511 -1105040 -1098505 -1106371 -1102062 -1129424 -1123167 -1089934 -1089435 -1121233 -1146313 -1134584 -1109881
8200a109881R933m787L249L5420K071o127j3257m092J6490j3656k9643j3229J2706
$$ -1109881 -1099948 -1104735 -1101486 -1066066 -1063995 -1070122 -1083379 -1087471 -1070981 -1084637 -1114280 -1127509 -1114803
8187a114803L4488L3812j2017k3337L778l95k6903j1542J0726J4039J2889R038
$$ -1114803 -1080315 -1046503 -1058520 -1081857 -1078079 -1078474 -1105377 -1116919 -1106193 -1092154 -1079265 -1070227
8175a070227J5160m120q626o087M757q402J506r334J0941J4377k5823k3643J602
$$ -1070227 -1055067 -1059187 -1067813 -1073900 -1069143 -1077545 -1076039 -1085373 -1074432 -1060055 -1085878 -1109521 -1107919
8162a107919j330Q172n78p964r126J0094M940O207J6607k1296L966J5522n775
$$ -1107919 -1109249 -1101077 -1101655 -1109619 -1118745 -1108651 -1103711 -1097504 -1080897 -1102193 -1098227 -1082705 -1088480
8149a088480J898j191J8526j7482n948P494Q004j0655N281J758j698N696k1509
$$ -1088480 -1086582 -1087773 -1069247 -1086729 -1092677 -1085183 -1077179 -1087834 -1082553 -1080795 -1082493 -1076797 -1098306
8136a098306k297L0448J3370K518J847n309k5279l033K8143j7523p665J9652j0802
$$ -1098306 -1100603 -1070155 -1056785 -1054267 -1052420 -1057729 -1083008 -1086041 -1057898 -1075421 -1083086 -1063434 -1074236
8123a074236j5824l17J0423j9086o4627J6084M3418J9422K1372j0301j8864L4124
$$ -1074236 -1090060 -1090377 -1079954 -1099040 -1163667 -1147583 -1104165 -1084743 -1063371 -1073672 -1092536 -1058412
8111a058412l68K972j9976J8197J7811Q824K143J1660l3454p126r366j5264j7732
$$ -1058412 -1058780 -1055808 -1075784 -1057587 -1039776 -1030952 -1028809 -1017149 -1050603 -1057729 -1067095 -1082359 -1100091
8098a100091J6316k5031p891M2747K8584m553m422P645n828j9741l175l2670j5287
$$ -1100091 -1083775 -1108806 -1116697 -1073950 -1045366 -1049919 -1054341 -1046696 -1052524 -1072265 -1075440 -1108110 -1123397
8085a123397K8827L160k3738N928J72J5563J8244J846j4748j3337p033L681j912
$$ -1123397 -1094570 -1091410 -1115148 -1109220 -1109048 -1093485 -1075241 -1073395 -1088143 -1101480 -1108513 -1104832 -1106744
8072a106744k10Q749J2332J4543p65j5291j4003r726J7654K8033J2331n186k7345
$$ -1106744 -1106954 -1098205 -1085873 -1071330 -1072095 -1087386 -1101389 -1111115 -1093461 -1065428 -1053097 -1058283 -1085628
8059a085628J57J4183K5029N300j7983m877J0132k419P062r197o651J9832K801
$$ -1085628 -1085471 -1071288 -1046259 -1040959 -1058942 -1063819 -1053687 -1056106 -1049044 -1058241 -1064892 -1045060 -1042259
8046a042259o784j3484j400L297J5970j8936j807p77k1767k6082n258l340R02
$$ -1042259 -1049043 -1062527 -1063927 -1060630 -1044660 -1063596 -1065403 -1066180 -1087947 -1114029 -1119287 -1122627 -1121725
8033a121725R091L2210K4687J9866L308k6601q655N789N172r613o948N507J6309
$$ -1121725 -1112634 -1080424 -1055737 -1035871 -1032563 -1059164 -1067819 -1062030 -1056858 -1066471 -1073419 -1067912 -1051603
8020a051603J3599K3571k079l6293k1854J3734r240J310K729l784R188K8181j6481
$$ -1051603 -1038004 -1014433 -1016512 -1052805 -1074659 -1060925 -1070165 -1068855 -1066126 -1069910 -1060722 -1032541 -1049022
8007a049022J8774K11j0559k6159J3392O793j734O972k0483j9205L4931J0552
$$ -1049022 -1030248 -1030037 -1040596 -1066755 -1053363 -1046570 -1048304 -1041332 -1061815 -1081020 -1046089 -1035537
7995a035537N030K5779j3174k7153k4826J1334N1108j0568j9160oP432Q231P147
$$ -1035537 -1030507 -1004728 -1017902 -1045055 -1069881 -1058547 -1007439 -1018007 -1037167 -1037173 -1029741 -1021510 -1014363
7982a014363P599k8041k7850O356K6735J2382J75k845o469r935O908M889J7121
$$ -1014363 -1006764 -1034805 -1062655 -1056299 -1029564 -1017182 -1017007 -1019852 -1026321 -1036256 -1029348 -1024459 -1007338
7969a007338j4498r119Q048j2619j3327Q620K6566K4188k5093j5742P784L7399
$$ -1007338 -1021836 -1030955 -1022907 -1035526 -1048853 -1040233 -1013667 -989479 -1014572 -1030314 -1022530 -985131
7957i85131p296k4363l7304l08J5705M12K6929m6220k3106R359J9927N8530R974
$$ -985131 -992427 -1016790 -1054094 -1054402 -1038697 -1038285 -1011356 -1057576 -1080682 -1071323 -1051396 -992866 -982892
7944i82892m290k3340q222O632o519r92P736k7179l071L0063J4861J707N14K1915
$$ -982892 -987182 -1010522 -1018744 -1012112 -1018631 -1019623 -1011887 -1039066 -1042137 -1012074 -997213 -995506 -994992 -973077
7930i73077j3951j4670j0866k7781J5155j4998o167M880J0309o39j2961q35k2485
$$ -973077 -987028 -1001698 -1012564 -1040345 -1025190 -1040188 -1046355 -1041475 -1031166 -1031805 -1044766 -1045601 -1068086
7917a068086l7450J9646K0554J3459k93K4761m519l5025o136J6479K5101K6980
$$ -1068086 -1105536 -1085890 -1065336 -1051877 -1052170 -1027409 -1031928 -1066953 -1073089 -1056610 -1031509 -1004529
7905a004529q026J2258L587p585p527l0965j4762R103L3311L3520j801p975J9272
$$ -1004529 -1012555 -1000297 -996710 -1004295 -1011822 -1042787 -1057549 -1048446 -1015135 -981615 -983416 -991391 -972119
7892i72119l209j1604j750k7083r489r214K1984j1634j0566r587J0361J5419p740
$$ -972119 -975328 -986932 -988682 -1015765 -1025254 -1034468 -1012484 -1024118 -1034684 -1044271 -1033910 -1018491 -1026231
7879a026231n78j1895K5002K8096L670k2280j0761K463N965k2222q674O65J6016
$$ -1026231 -1026809 -1038704 -1013702 -985606 -981936 -1004216 -1014977 -1012514 -1006549 -1028771 -1037445 -1036780 -1020764
7866a020764j3541k2161K0386K1283J0688R875P129k4773o059J9013r545j9447
$$ -1020764 -1034305 -1056466 -1036080 -1014797 -1004109 -994234 -987105 -1011878 -1017937 -998924 -1008469 -1027916
7854a027916J1769K2885k784r123j795j7918P563j6361o002J5478N458j933j7763
$$ -1027916 -1016147 -993262 -996046 -1005169 -1006964 -1024882 -1017319 -1033680 -1039682 -1024204 -1018746 -1020679 -1038442
7841a038442J0631L5998J1150j4699r18j414L3698j195m7518j5916m3654l751
$$ -1038442 -1027811 -991813 -980663 -995362 -996280 -997694 -963996 -965191 -1012709 -1028625 -1072279 -1076030
7829a076030K7364L5996N290k1511j2267L9222L2544j5365j5273K530l83o966
$$ -1076030 -1048666 -1012670 -1007380 -1028891 -1041158 -1001936 -969392 -984757 -1000030 -997500 -997883 -1004849
7817a004849q922L3566j5217M12K9553J1015j0957k3942j7537J655j00j5599l7801
$$ -1004849 -1013771 -980205 -995422 -995010 -965457 -954442 -965399 -989341 -1006878 -1005223 -1005323 -1020922 -1058723
7804a058723J4978L2835L5703m2349j2566o4997k2814M6313L6233L066O957j4022
$$ -1058723 -1043745 -1010910 -975207 -1017556 -1030122 -1095119 -1117933 -1071620 -1035387 -1032321 -1025364 -1039386
7792a039386L657r192Q251K0361K3682J2057j3464r934j9797j084L243J1099N023
$$ -1039386 -1035729 -1044921 -1036670 -1016309 -992627 -980570 -994034 -1003968 -1023765 -1024849 -1021606 -1010507 -1005484
7779a005484l659J6926J5041K6066J2193l5100j8883O447j8012J3695j5554k6075
$$ -1005484 -1009143 -992217 -977176 -951110 -938917 -974017 -992900 -986453 -1004465 -990770 -1006324 -1032399
7767a032399J799K4318j4294o525p491J9420K9149j8916p967N654j046k605j2276
$$ -1032399 -1030600 -1006282 -1020576 -1027101 -1034592 -1015172 -986023 -1004939 -1012906 -1007252 -1008298 -1010903 -1023179
7754a023179Q952J5363K964l959R941J8076r159K7273J528j0037p893j7869j6947
$$ -1023179 -1014227 -998864 -995900 -999859 -989918 -971842 -981001 -953728 -952200 -962237 -970130 -987999 -1004946
7741a004946k0659J5253J3006k309L7034k454O346k9460m1823j6021K755J6745
$$ -1004946 -1025605 -1010352 -997346 -999655 -962621 -965075 -958729 -988189 -1030012 -1046033 -1043278 -1026533
$$ [...]
##END NTUPLES=NMR SPECTRUM
##END=
