##TITLE=Analysis number 313641
Compound Code tl 00214
Book Reference 397/82/2
Project Code adrs
Chemist Name brucer
##JCAMPDX= 6.0         $$ Bruker NMR JCAMP-DX V2.0
##DATA TYPE= NMR SPECTRUM
##DATA CLASS= NTUPLES
##ORIGIN= Bruker BioSpin GmbH
##OWNER= NMR
$$ XWIN-NMR		Version 3.5
$$ Thu Sep 15 12:33:00 2005 GMT Daylight Time (UT+1h)  MAYBRIDGE\NMR@NMR_250MHZ
##.OBSERVE FREQUENCY= 250.131544655141
##.OBSERVE NUCLEUS= ^1H
##.ACQUISITION MODE= SIMULTANEOUS (DQD)
##.ACQUISITION SCHEME= undefined
##.AVERAGES= 16
##.DIGITISER RES= 18
##SPECTROMETER/DATA SYSTEM= dpx250
##.PULSE SEQUENCE= zg30
##.SOLVENT NAME= CDCl3
##.SHIFT REFERENCE= (INTERNAL, CDCl3, 0, 16.522)
##AUDIT TRAIL= $$ (NUMBER, WHEN, WHO, WHERE, WHAT)
$$ ##TITLE= Audit trail, XWIN-NMR		Version 3.5
$$ ##JCAMPDX= 5.01
$$ ##ORIGIN= Bruker BioSpin GmbH
$$ ##OWNER= NMR
$$ C:\u/data/dgb/nmr/ADRS/9530/pdata/1/auditp.txt
$$ ##AUDIT TRAIL=  $$ (NUMBER, WHEN, WHO, WHERE, WHAT)
(   1,<2005-09-15 12:32:40.46 +100>,<MAYBRIDGE\NMR>,<NMR_250MHZ>,
      <created by zg, POWCHK disabled, PULCHK disabled
       configuration hash MD5:
       62 19 C7 07 E1 42 D1 B7 37 6C 3D D0 77 39 F9 E6
       data hash MD5: 64K
       19 BE 97 C6 13 82 99 E6 71 C7 B9 28 A1 30 0C 92>)
(   2,<2005-09-15 12:32:52.69 +100>,<MAYBRIDGE\NMR>,<NMR_250MHZ>,
      <Start of raw data processing
       ef LB = 0.3 FT_mod = 6 PKNL = 1 SI = 32K 
       data hash MD5: 32K
       2A DF 72 69 08 5F E7 80 8E 3F 16 E8 E6 53 12 36>)
(   3,<2005-09-15 12:32:54.52 +100>,<MAYBRIDGE\NMR>,<NMR_250MHZ>,
      <apk 
       data hash MD5: 32K
       AF B5 05 35 28 18 B8 6C D7 17 16 FB 2D D7 85 69>)
(   4,<2005-09-15 12:32:55.38 +100>,<MAYBRIDGE\NMR>,<NMR_250MHZ>,
      <abs ABSG = 5 
       data hash MD5: 32K
       55 9A EC AE 51 40 A8 21 51 E2 66 82 2A 4A 7E 5A>)
$$ ##END=
$$ 
$$ hash MD5
$$ 8E 35 AD 09 33 9A 5F 24 0A 1A 27 9A BF 07 39 22
##$RELAX= 
##$RELAX= 
##$RELAX= 
##$RELAX= 
##$RELAX= 
##$RELAX= 
##$RELAX= 
$$ Bruker specific parameters
$$ --------------------------
##$DU= <C:\u>
##$EXPNO= 9530
##$NAME= <ADRS>
##$PROCNO= 1
##$TYPE= <nmr>
##$USER= <dgb>
##$AMP= (0..31)
100 100 100 100 100 100 100 100 100 100 100 100 100 100 100 100 100 100 
100 100 100 100 100 100 100 100 100 100 100 100 100 100 
##$AQSEQ= 0
##$AQ_mod= 3
##$AUNM= <au_zg>
##$AUTOPOS= <18 >
##$BF1= 250.13
##$BF2= 250.13
##$BF3= 250.13
##$BF4= 250.13
##$BF5= 500.13
##$BF6= 500.13
##$BF7= 500.13
##$BF8= 500.13
##$BYTORDA= 1
##$CFDGTYP= 0
##$CFRGTYP= 5
##$CHEMSTR= <none>
##$CNST= (0..31)
1 1 145 1 1 1 1 1 1 1 1 1 1 1 1 1 1 1 1 1 1 1 1 1 1 1 1 1 1 1 1 1 
##$CPDPRG= <>
##$CPDPRG1= <>
##$CPDPRG2= <>
##$CPDPRG3= <>
##$CPDPRG4= <mlev>
##$CPDPRG5= <mlev>
##$CPDPRG6= <mlev>
##$CPDPRG7= <mlev>
##$CPDPRG8= <mlev>
##$CPDPRGB= <>
##$CPDPRGT= <>
##$D= (0..31)
0 1 0 0 0 0 0 0 0 0.06 0 0 0 0 0 0 0.0002 0 0 0 0 0 0 0 0 0 0 0 0 0 0 
0 
##$DATE= 1126783959
##$DBL= (0..7)
120 120 120 120 120 120 120 120 
##$DBP= (0..7)
150 150 150 150 150 150 150 150 
##$DBP07= 0
##$DBPNAM0= <>
##$DBPNAM1= <>
$$ [...]
##$SUBNAM7= <"">
##$SUBNAM8= <"">
##$SUBNAM9= <"">
##$SW= 20.6930455092707
##$SWIBOX= (0..15)
0 0 3 0 0 0 0 0 0 0 0 0 0 0 0 0 
##$SW_h= 5175.983436853
##$TD= 65536
##$TD0= 1
##$TE= 295.16
##$TE2= 300
##$TE3= 300
##$TEG= 300
##$TL= (0..7)
0 120 120 120 120 120 120 120 
##$TP= (0..7)
150 150 150 150 150 150 150 150 
##$TP07= 0
##$TPNAME0= <>
##$TPNAME1= <>
##$TPNAME2= <>
##$TPNAME3= <>
##$TPNAME4= <>
##$TPNAME5= <>
##$TPNAME6= <>
##$TPNAME7= <>
##$TPOAL= (0..7)
0.5 0.5 0.5 0.5 0.5 0.5 0.5 0.5 
##$TPOFFS= (0..7)
0 0 0 0 0 0 0 0 
##$TUNHIN= 0
##$TUNHOUT= 0
##$TUNXOUT= 0
##$USERA1= <user>
##$USERA2= <user>
##$USERA3= <user>
##$USERA4= <user>
##$USERA5= <user>
##$V9= 5
##$VALIST= <valist>
##$VCLIST= <CCCCCCCCCCCCCCC>
##$VD= 0
##$VDLIST= <DDDDDDDDDDDDDDD>
##$VPLIST= <PPPPPPPPPPPPPPP>
##$VTLIST= <TTTTTTTTTTTTTTT>
##$WBST= 1024
##$WBSW= 4
##$XGAIN= (0..3)
0 0 0 0 
##$XL= 0
##$YL= 0
##$YMAX_a= 404557
##$YMIN_a= -519137
##$ZGOPTNS= <>
##$ZL1= 120
##$ZL2= 120
##$ZL3= 120
##$ZL4= 120
##$ABSF1= 16.522
##$ABSF2= -4.171173
##$ABSG= 5
##$ABSL= 3
##$ALPHA= 0
##$AQORDER= 0
##$ASSFAC= 0
##$ASSFACI= 0
##$ASSFACX= 0
##$ASSWID= 0
##$AUNMP= <proc_1d>
##$AZFE= 0.1
##$AZFW= 0.1
##$BCFW= 0
##$BC_mod= 0
##$BYTORDP= 0
##$COROFFS= 0
##$CY= 12.5
##$DATMOD= 1
##$DC= 0
##$DFILT= <>
##$DTYPP= 0
##$F1P= 14.0000005364418
##$F2P= -0.99999901652339
##$FCOR= 0.5
##$FTSIZE= 32768
##$FT_mod= 6
##$GAMMA= 0
##$GB= 0
##$INTBC= 1
##$INTSCL= 1
##$ISEN= 128
##$LB= 0.3
##$LEV0= 0
##$LPBIN= 0
##$MAXI= 10000
##$MC2= 0
##$MEAN= 0
##$ME_mod= 0
##$MI= 0
##$NCOEF= 0
##$NC_proc= -2
##$NLEV= 6
##$NOISF1= 0
##$NOISF2= 0
##$NSP= 0
##$NTH_PI= 0
##$NZP= 0
##$OFFSET= 16.522
##$PC= 1
##$PHC0= 126.6194
##$PHC1= 6.470292
##$PH_mod= 1
##$PKNL= yes
##$PPARMOD= 0
##$PSCAL= 4
##$PSIGN= 0
##$REVERSE= no
##$SF= 250.13
##$SI= 32768
##$SIGF1= 0
##$SIGF2= 0
##$SINO= 400
##$SIOLD= 32768
##$SREGLST= <1H.CDCl3>
##$SSB= 0
##$STSI= 32768
##$STSR= 0
##$SW_p= 5175.98343685301
##$SYMM= 0
##$S_DEV= 0
##$TDeff= 65536
##$TDoff= 0
##$TI= <Analysis number 999999
Compound Code 99
Book Reference 9
Project Code 9>
##$TILT= no
##$TM1= 0
##$TM2= 0
##$TOPLEV= 0
##$USERP1= <user>
##$USERP2= <user>
##$USERP3= <user>
##$USERP4= <user>
##$USERP5= <user>
##$WDW= 1
##$XDIM= 32768
##$YMAX_p= 406587495
##$YMIN_p= -264756
$$ End of Bruker specific parameters
$$ ---------------------------------
##NTUPLES= NMR SPECTRUM
##VAR_NAME=  FREQUENCY,     SPECTRUM/REAL,   SPECTRUM/IMAG
##SYMBOL=    X,             R,               I
##VAR_TYPE=  INDEPENDENT,   DEPENDENT,       DEPENDENT
##VAR_FORM=  AFFN,          ASDF,            ASDF
##VAR_DIM=   32768,         32768,           32768
##UNITS=     HZ,            ARBITRARY UNITS, ARBITRARY UNITS
##FACTOR=    0.157963299565203, 1,           1
##FIRST=     4132.6476996994, 0,             0
##LAST=      -1043.33573715361, 0,           0
##MIN=       -1043.33573715361, -264756,     0
##MAX=       4132.6476996994, 406587495,     0
$$ Real data points
##PAGE= N=1
##DATA TABLE= (X++(R..R)), XYDATA
$$ [...]
19352A0069083k458669j750314j215876q54534o27340m71069l68075k72050j93347
19343A857809j48463j23693j04214j02815j09106j14322j10926j04835r1484q1675
19333G66276p3474o4132n4732m1610l4637k8951k1021j1895r071j3219j6051j7939
19321C79544j5891j1701j5006p682n244k627J507L740l304o298k659j758M859
19308C17480P914J4531J7941K2856K3695K2291K8111L8637N9976J14788K11581
19297H79801K70959J10633j19041j56705p9812J8274J47746K85034K54757N7588
19287A669234J0063k0300j86260k39259j62967o4557M9980J81757K22502J7216
19277A477409j86170j86839j12729n0514J80K7645M7635N5047P0315Q0893R4218
$$ y = [10069083, 7610414, 5860100, 4644224, 3789690, 3162350, 2691281, 2323206, 2051156, 1857809, 1709346, 1585653, 1481439, 1378624, 1269518, 1155196, 1044270, 939435, 847951, 766276, 692802, 628670, 573938, 532328, 497691, 468740, 447719, 435824, 426753, 413534, 397483, 379544, 363653, 351952, 336946, 329264, 324020, 321393, 322900, 326640, 323336, 317038, 314379, 312621, 317480, 325394, 339925, 357866, 380722, 404417, 426708, 454819, 493456, 553432, 668220, 879801, 1150760, 1261393, 1142352, 985647, 905835, 924109, 1071855, 1356889, 1611646, 1669234, 1679297, 1658997, 1472737, 1233478, 1070511, 1005954, 1055934, 1237691, 1460193, 1477409, 1291239, 1104400, 991671, 941157, 941337, 968982, 1016617, 1071664, 1141979, 1222872, 1317090]
19266A317090J14174J22576J25427J31546J57802J97117K54000L46771M86441
19257C252944P28675J177622J967927K933256L309456K688824O57163j088558
19249A5627309j517774q07625O89111K177387L186875L406188J961293L46409
19241B5069173j062114k704113l333620l001907j800641l49111Q49005J359826
19233A5026498O83414j161050k229676k507017k233354j783382j286943q66424
19225C642066n75828l71837k43089j53366q5410m6537j4985J1436M3533O4571
19215B270554O8987P5294R8415J49135K26559L37953M97630P65082J237771K091830
19205G819210L134538L566857K909291O79615j315851j909217j220255N37341
$$ y = [1317090, 1431264, 1553840, 1679267, 1810813, 1968615, 2165732, 2419732, 2766503, 3252944, 3981619, 5159241, 7127168, 10060424, 13369880, 16058704, 16715867, 15627309, 14109535, 13301910, 13991021, 16168408, 19355283, 22761471, 24722764, 25069173, 24007059, 21302946, 17969326, 14967419, 13166778, 12817667, 13666672, 15026498, 15709912, 14548862, 12319186, 9812169, 7578815, 5795433, 4508490, 3642066, 3066238, 2694401, 2451312, 2297946, 2212536, 2165999, 2151014, 2162450, 2205983, 2270554, 2339541, 2414835, 2513250, 2662385, 2888944, 3226897, 3724527, 4489609, 5727380, 7819210, 10953748, 14520605, 17429896, 18109511, 16793660, 14884443, 13664188, 14201529]
19197A4201529K433033L646502L852551K324842M62202j310377l263864l859599
19189A8486819l407788k023780j70867J281098J747995Q23128j363985k747950
19181A2624670l126486k593370j805228j203585q01343n58684m02078k97785k20436
19172A615675j71443j41909j20568j04326r0319p5211p1143o2078o4606o4178
19162F49894n6800l7514k4355l0511l4277l8624l9454k9615k5116j9181j4917
19151B99530j3601r302n372o254n368m55K052M049P271K829j231j621l875J245
19137B69897J896P621J0265M985Q441L425j281k272l340r52M158k62j2548q660
19123B81373k338l305j1575q856j2485j0194q311j0565j5485q818j3835j4198
$$ y = [14201529, 16634562, 20281064, 24133615, 26458457, 26920659, 25610282, 22346418, 18486819, 15079031, 13055251, 12884384, 14165482, 15913477, 16736605, 15372620, 12624670, 9498184, 6904814, 5099586, 3896001, 3094658, 2535974, 2133896, 1836111, 1615675, 1444232, 1302323, 1181755, 1077429, 987110, 911899, 840756, 778678, 714072, 649894, 593094, 555580, 531225, 500714, 466437, 427813, 388359, 358744, 333628, 314447, 299530, 285929, 276627, 271255, 265001, 259633, 259178, 261230, 265279, 272550, 275379, 274148, 272527, 268652, 269897, 271793, 279414, 289679, 294664, 303105, 306530, 305249, 302977, 299637, 298685, 302843, 302581, 290033, 281373, 279035, 275730, 264155, 255299, 242814, 232620, 224309, 213744, 198259, 189441, 175606, 161408]
19111A61408j0733m826m099k30O163K785n114j493K124k874p452n519L00N620
19097A36060J1145J6690J4505J1047P323k682l964o964n884M057R505L239o98
19084A93379K045K118r95j899o670J391R73j962l325o405n556o260j1355n694
19070A49785j948q521j4023q777j3138q821m684o448o676p60K813J627N43j622
19056G9350j803q76l522o035j788l047n875j202M067L124M301j733l16L590k552
19041F5683n769j837k546r420p665l863j103J574L291N633M30j931m482p724l114
19026B7157L85j796L850L662j838j410q9l547m337J445N7m93J186J795L949K621
19010C2597K57L26l108k581L479j483L06K177N012M150J397M580N896M16J162
$$ y = [161408, 150675, 145849, 141750, 141520, 147683, 150468, 145354, 143861, 145985, 143111, 135659, 130140, 130440, 136060, 147205, 163895, 178400, 189447, 196770, 194088, 190124, 183160, 177276, 181333, 190838, 194077, 193379, 195424, 197542, 196547, 194648, 187978, 189369, 190342, 188380, 185055, 178650, 173094, 166834, 155479, 149785, 147837, 139316, 125293, 116516, 103378, 94557, 89873, 83425, 76749, 75989, 78802, 80429, 80972, 79350, 77547, 76671, 73149, 67114, 65326, 62279, 56404, 55202, 59269, 62393, 66694, 64961, 64645, 68235, 65683, 59914, 58077, 55531, 46111, 38446, 34583, 33480, 35054, 38345, 43978, 44408, 42477, 37995, 30271, 27157, 27542, 25746, 29596, 33258, 31420, 30010, 29921, 26374, 22037, 23482, 23539, 23046, 24232, 26027, 29976, 32597, 32854, 33180, 30072, 27491, 30970, 29487, 29793, 31970, 36982, 41132, 42529, 47109, 53005, 53421, 54583]
18995E4583L795L643L742L990M741M547M195Q51O545M857M779P000L700P725J4288
18980A32981K0051K7271L6582O4997J19056J84329J76845Q6559K6838p2774j11386
18969F91349l7841P2662J37018Q4006L6645k3006o5102J0740M8279J6312j8213
18958I52849j00544j27106n5858M4505J00395N5385m599q4588j67398j53041j08678
18947C51322o6951m5265l1933j8181r882p227o900n846o477m827J593N813O607
18934A61846P576J0588J2659J8141K5343L7894N7633R4980J71819K34338J73266
18923A006083Q4671p048j30363j11931M171J19586J48370P8738K9247m3435k8342
18912A149747P0023O0996K240p0216j81384j61091n2003O1758R6485K7121l5631
$$ y = [54583, 58378, 62021, 65763, 69753, 74494, 79041, 83236, 84087, 90632, 95489, 100268, 107268, 110968, 118693, 132981, 153032, 180303, 216885, 281882, 400938, 585267, 762112, 848671, 875509, 802735, 691349, 653508, 726170, 863188, 947194, 983839, 960833, 895731, 906471, 954750, 971062, 952849, 852305, 725199, 669341, 713846, 814241, 869626, 865027, 780439, 613041, 460000, 351322, 284371, 239106, 207173, 188992, 179110, 171883, 164983, 159137, 152660, 147833, 149426, 155239, 161846, 169422, 180010, 192669, 210810, 236153, 274047, 331680, 426660, 598479, 832817, 1006083, 1090754, 1083706, 953343, 841412, 845583, 965169, 1113539, 1192277, 1221524, 1178089, 1149747, 1219770, 1280766, 1283006, 1212790, 1031406, 870315, 818312, 880070, 976555, 1003676, 968045]
18901I68045j43574k04930j64544j13742p3279m9350l3613k8673j7641j0294q218
18890A20187r972q776m086k212j158L49l108n901n470k683L60K418P05K926L129
18875H6708O98K806K501O200J7510K5292K5888L9683M7342M9522M4328K9055L678
18862C81211n879j0121j6913k2463j9407n894r55M737L568n975k1623k1203k7884
18849B31199k6962j8813j2055l37K264J820j475n97n592j3591j6517j1179j5518
18836A12647j1440p498k949n554o786o660k586r20K113O0m719o198l114J578L311
18821F1285J0261Q520P477J6579K1702K0417J2936P353L625J454k903j8012k1247
18808A29447j9870j3301o752m110p923j432L659l031p005r132k605m055p293r03
$$ y = [968045, 824471, 619541, 454997, 341255, 267976, 218626, 185013, 156340, 138699, 128405, 120187, 110215, 101439, 97353, 95141, 93983, 94332, 91224, 85323, 79853, 77170, 77530, 79948, 80653, 83579, 86708, 87406, 90212, 92713, 98913, 116423, 141715, 167603, 207286, 254628, 304150, 348478, 377533, 381211, 375332, 365211, 348298, 325835, 306428, 300534, 299579, 304316, 307884, 301909, 280286, 259083, 231199, 204237, 185424, 173369, 173032, 175296, 177116, 175641, 175044, 169452, 155861, 139344, 128165, 112647, 101207, 93709, 90760, 85206, 78420, 71760, 69174, 68254, 70367, 70427, 65708, 59510, 56396, 57974, 61285, 71546, 80066, 87543, 104122, 125824, 146241, 159177, 166530, 170155, 171609, 168706, 150694, 129447, 109577, 96276, 89524, 85414, 77491, 76059, 79718, 76687, 69682, 60550, 57945, 53890, 46597, 45694]
18794D5694k624L581P435K582n119l829j945Q18j704J488m04j991j8L029M27j55
18778D7265l11L560K720L199M525K567J75m621o48Q274J1070J6216K5902K1063
18764A40956K015K730l629j7825k1296m945L437P83K347Q795j600j4598j4482
18751H2688j2476j0130q916m870K021l690m035Q58K938R97K970J146L920M390
18737E7811N824M523N94N717J1484J5182J4416J0832N194J999m103j438R764J4341
18723A52140J8420J5452Q893K184M338J129J214N774M546n223o875r131r785q811
18709A74265p947p328m096j4411j4974j3739j1155k594o021n358m26K433K959
18696I1608R765R276R592M512j65L000L657K841Q850R294P323J0907K1435K2062
$$ y = [45694, 43070, 46651, 54086, 56668, 51549, 47720, 45775, 46593, 44889, 46377, 45973, 43982, 43964, 46993, 47420, 47265, 46954, 50514, 53234, 56433, 60958, 63525, 63700, 59079, 58431, 66705, 77775, 93991, 119893, 140956, 142971, 145701, 142072, 124247, 102951, 98006, 101443, 102226, 104573, 113368, 111768, 97170, 82688, 70212, 60082, 51166, 46296, 48317, 44627, 40592, 41450, 44388, 45385, 48355, 49501, 53421, 57811, 63635, 68158, 68752, 74469, 85953, 101135, 115551, 126383, 131577, 133576, 129473, 128035, 137799, 152140, 170560, 186012, 194905, 197089, 201427, 202556, 203770, 209544, 214090, 208867, 201992, 192861, 183076, 174265, 166318, 158990, 154894, 140483, 125509, 111770, 100615, 98021, 92000, 86642, 86216, 88649, 91608, 101373, 110649, 120241, 124753, 124588, 127588, 131245, 134086, 142936, 152230, 159553, 170460, 191895, 213957]
18682B13957K4510K0255O690n636O68M922J9685L5014M1021L5973L1042K3231
18670D51332J5479J1573J4806K4185L2181M0928M8214O0513N6781M9941N3821
18659H59754O5879O6125P0507Q3301R9254J07912J26383J63041K18915K93355
18649B154426M15381O53605J095637J667733J886782J837870J851026O78679m68399
18640A1772740m81127l67027K69911R02065J376912J946017J195794L17978J08611
18631A7041874j72119j048691j797943j497723j168607m91168K03977N40628Q50806
18622A2461034j59918j364092j529343j819633j759489j300080q78614n68759
18614C081106l65919k39755j40892p1316j5274P052L6884P0440R3188J15788J59061
$$ y = [213957, 238467, 258722, 265412, 259776, 260444, 265366, 285051, 320065, 361086, 397059, 428101, 451332, 466811, 478384, 493190, 517375, 549556, 590484, 638698, 699211, 755992, 805933, 859754, 925633, 991758, 1062265, 1145566, 1244820, 1352732, 1479115, 1642156, 1861071, 2154426, 2569807, 3223412, 4319049, 5986782, 7873564, 9711434, 11562460, 12241139, 11772740, 11291613, 10924586, 11194497, 12096562, 13473474, 15419491, 16615285, 16933263, 17041874, 16869755, 15821064, 14023121, 12525398, 11356791, 10865623, 11069600, 11610228, 12461034, 12301116, 10937024, 9407681, 7588048, 5828559, 4528479, 3649865, 3081106, 2715187, 2475432, 2334540, 2263224, 2247950, 2255002, 2291886, 2362326, 2455514, 2571302, 2730363]
18603B730363K22831L09971M52495O98894J153533J907268K660058K740643K808183
18594A5684239K396038J93728q53318q08502n65769M60515J264526K172413K557490
18585B2501360J327217N70625L05990k57100j950840k600499k127219j702836
18577A6066698o03880K08468P98245Q18107j005615k068284k311596k697358k350709
18568F854076j684220j164206q04303n74962m23413l09569k30890j81653j46227
18559A334633j18094r8992q9279q0992o9344o9434o7774n4326m7536m5935n0344
18548E42583m0696l5810l4023l1440k9530k3958j4981j2963j1180j2999q730r359
18536B76914j3173p295l475m867n303K979O920O134J771j225M105R236J5674J4078
$$ y = [2730363, 2953194, 3263165, 3715660, 4414554, 5568087, 7475355, 10135413, 12876056, 15684239, 18080277, 18274005, 17420687, 16612185, 16046416, 16506931, 17771457, 19943870, 22501360, 23828577, 24399202, 24705192, 24448092, 22497252, 19896753, 17769534, 16066698, 15462818, 15671286, 16469531, 17287638, 16282023, 14213739, 11902143, 9204785, 6854076, 5169856, 4005650, 3201347, 2626385, 2202972, 1893403, 1662513, 1480860, 1334633, 1216539, 1117547, 1028268, 947276, 877932, 808498, 740724, 686398, 638862, 592927, 542583, 501887, 466077, 432054, 400614, 371084, 347126, 332145, 319182, 308002, 295003, 286273, 276914, 263741, 256446, 252971, 248104, 242801, 245780, 252700, 258834, 260605, 259380, 263485, 272721, 288395, 302473]
18522C02473j35k201N454Q369j310j2775k8011l0473k5899j0687o976p558q097
18509A82174j288k122m566m048j404l585q403n822n05L363M543K868L269P004
18495A71478L265J538m210l861K727J462R006Q886J0283R483R714J4905J8277
18482B52953K9752L9419L4832K7340L6718O5425J12071J95338K85310K73370J87044
18471A539572J11958L7504o1826j76577k87948k91920k17959j46434q9287n8523
18461C58560l9666k6909k0995j1037q307j1439j1823j2706o347l524K958J0801
18449B19566J1097J1158Q505N280M375m39j329M089J0737K0556K5591K5983K3973
18436C69142K4917K4623L3759M0143M2722M8852O0423R0617J33072K09113L29799
$$ y = [302473, 302338, 300137, 305591, 313960, 312650, 299875, 271864, 241391, 215492, 204805, 197829, 190271, 182174, 180886, 178764, 174198, 170150, 168746, 165161, 156758, 150936, 150431, 153794, 158337, 161205, 164474, 171478, 174743, 176281, 172071, 168210, 170937, 172399, 181405, 190291, 200574, 210057, 219771, 234676, 252953, 282705, 322124, 356956, 384296, 421014, 486439, 598510, 793848, 1079158, 1352528, 1539572, 1651530, 1689034, 1627208, 1450631, 1162683, 870763, 652804, 506370, 417083, 358560, 318894, 291985, 270990, 259953, 251646, 240207, 228384, 215678, 209331, 205807, 208765, 219566, 230663, 241821, 250326, 255606, 259981, 259542, 258213, 262302, 273039, 293595, 319186, 345169, 369142, 394059, 418682, 452441, 492584, 535306, 584158, 644581, 735198, 868270, 1077383, 1407182]
18425A407182N01866N76148M50871L03348J42354k8437k10024l98402m69615l37854
18415A937437j85655p2732j996M9906Q6362J12488J52042K07510L01253M44070
18405C030685O61808J021183J669657K810458M266835N144517M677443K685857
18397B5968443J158419J66607j354172l668417m848785m673614l581379k452709
18389F714393j641961j111270p80588n69490m20573l03107k09749j41683q4288
18380A451684l4314K1177Q1524J75254K79071L52500K99036K03287J18136K3913
18370B971268p8707j67370k26047j68261n7177K7900R1149J34478J75638K09871
18360B912742K63333L57317M97269P25152J092382J707941K811906M697503O889434
$$ y = [1407182, 1909048, 2485196, 2936067, 3239415, 3381769, 3353332, 3143308, 2744906, 2275291, 1937437, 1751782, 1679050, 1677054, 1726960, 1813322, 1925810, 2077852, 2285362, 2586615, 3030685, 3692493, 4713676, 6383333, 9193791, 13460626, 18605143, 23282586, 25968443, 27126862, 27293469, 25939297, 22270880, 17422095, 12748481, 9167102, 6714393, 5072432, 3961162, 3180574, 2611084, 2190511, 1887404, 1677655, 1535972, 1451684, 1417370, 1438547, 1520071, 1695325, 1974396, 2326896, 2625932, 2829219, 2947355, 2971268, 2892561, 2725191, 2499144, 2330883, 2273706, 2301606, 2392755, 2527233, 2702871, 2912742, 3176075, 3533392, 4030661, 4755813, 5848195, 7556136, 10368042, 15065545, 21954979]
18351B1954979P966434O791964L661740J515111q0647k729821o126041p542686
18343B5411033p020714n265890l592666k414561j649071j166106q54856o34382
18335B812787m65518l45737k53705j77763j27108q2559l4916J7644N4832O6770
18325A464727N4012K1765p441k8377o0895q5699p5490n0111j6436J4071L0112
18314A260238M0078M3867O4471R5515J30720J99758L02335M66078P42620J235238
18304D580918K056957K925975L248637K558180J255003M87721j98710j446786
18296A5467895k741164l106312k735234j976983j331111q91204o10014m37041
18288A638832l23950k34354j71517j30591r5581o4100m9879l9196k2735m552J0463
$$ y = [21954979, 29921413, 36713377, 40375117, 41890228, 41809581, 39079760, 32953719, 25411033, 18390319, 13124429, 9531763, 7117202, 5468131, 4302025, 3447169, 2812787, 2347269, 2001532, 1747827, 1570064, 1442956, 1360397, 1325481, 1343125, 1397957, 1464727, 1518739, 1540504, 1533063, 1504686, 1443791, 1358092, 1282602, 1232491, 1216055, 1230126, 1260238, 1300316, 1344183, 1408654, 1504169, 1634889, 1834647, 2136982, 2603060, 3345680, 4580918, 6637875, 9563850, 12812487, 15370667, 16625670, 17113391, 16914681, 15467895, 12726731, 9620419, 6885185, 4908202, 3577091, 2685887, 2075873, 1638832, 1314882, 1080528, 909011, 778420, 682839, 618739, 568860, 529664, 506929, 502377, 512840]
18277E12840J6334P894j888l514j1919l0731m2910m6527m3070l9883l5292k4682
18265B56652j7961k0264j6229j7159j2767j2018j0299l396J481n758o501j517
18253A34264k702l106k468k970n040j868l424j025O64m305p06j195m462q073k897
18238I0687K426N724K919m23n835j972J448P32J243P308J1455P142P147N500J650
18223A37151M01o860l452m326j0127j6979j6002j0344k605J590K258n550j883
18210F3272j066o71k184l075j057j120l298m416L218L415K573j227L404L02k945
18195E5125m275j292J615L54l379j262k52p399l528R65K820j653J575M945L098
18180D7457J003J487j93L663O938j267Q68j707m758n29l370o881j762n28J330
$$ y = [512840, 529174, 537068, 535180, 531666, 519747, 489016, 446106, 399579, 356509, 316626, 281334, 256652, 238691, 218427, 202198, 185039, 172272, 160254, 149955, 146559, 148040, 142282, 135781, 134264, 131562, 128456, 125988, 123018, 117978, 116110, 112686, 111661, 112325, 108020, 107314, 106119, 101657, 93584, 90687, 93113, 98837, 101756, 101333, 95498, 93526, 94974, 95706, 96949, 104257, 115712, 122854, 130001, 135501, 137151, 137552, 130692, 127240, 122914, 112787, 95808, 79806, 69462, 66857, 68447, 70705, 65155, 63272, 62206, 61535, 59351, 56276, 55219, 54099, 50801, 46385, 49603, 53018, 55591, 54364, 57768, 58070, 55125, 50850, 49558, 51173, 51527, 48148, 46886, 46634, 39235, 35707, 36672, 39492, 37839, 39414, 44359, 47457, 48460, 49947, 49754, 53417, 60355, 59088, 59956, 58249, 53491, 52962, 49592, 42711, 40949, 40421, 41751]
18165D1751J201l010n577K599J304m897j635J869M062k168n407n51M300O280L119
18150D3240M195J717N40N305M798l93j958j909L560j528J005L802K809O357O970
18135G8510P416J3614J4440J8206J7525J4955P171N676J1548J9463K6050L3357
18123B67931L6824L3240K8523K0298J5163K1964J9940K5752L6245O1183R9909
18112F66972J57727K65735M87224R99353K155810L155284N76258k405243k133047
18103C926073j400519q48552m98740l10469k02272j40870j08227p8697o0413m7651
18093B29663l8168k3185j6239j4191p242n472o737l918j586O068Q44M771l12o243
18079A18053n950m674j516q52O837Q122Q512K344N89m501q366j2317j7208r805
$$ y = [41751, 42952, 39942, 34365, 36964, 38268, 33371, 31736, 33605, 37667, 35499, 30092, 29541, 33841, 40121, 43240, 47435, 49152, 49692, 54997, 59795, 59402, 57444, 55535, 59095, 57567, 58572, 62374, 65183, 71540, 78510, 85926, 99540, 113980, 132186, 149711, 164666, 171837, 177513, 189061, 208524, 234574, 267931, 304755, 337995, 366518, 386816, 401979, 423943, 443883, 469635, 505880, 567063, 666972, 824699, 1090434, 1577658, 2577011, 4732821, 7888105, 8464363, 6059120, 3926073, 2525554, 1677002, 1178262, 867793, 665521, 524651, 416424, 337727, 277314, 229663, 191495, 168310, 152071, 137880, 130638, 125166, 118429, 114511, 112925, 118993, 119837, 124608, 124296, 118053, 112103, 107429, 105913, 105061, 111898, 120020, 128532, 130876, 131465, 126964, 118598, 106281, 89073, 79268]
18065G9268k052N120L113O225O42o858r903j0660q360o336o246m076m668j362
18051C3847l397j187J282J865j057j756n814m336k328r19K574M32K311j221P06
18036B1002J435k389j544k452l758j212K680K606n4j412l313R0J604K127K7K945
18020A8382L393K27j463j078j074j973o278l500L247N198J406k303p28k030m30
18005A0996J259K330K218K036l391k196N327Q87j349j656k201j339J399N49m021
17990A0848o027k972K702O195r84n359J039K672J846L630L444j426n214K8K111
17975A2533l505j968O37o75k946L845j623K584L764L661L190j267n367n32K640
17960A4971k102k685K813J512M74Q33j83L37J983K4r69j477j002q26L604j237
$$ y = [79268, 77216, 82336, 85449, 91674, 92316, 85458, 75555, 64895, 56535, 50199, 43953, 39877, 35209, 33847, 30450, 29263, 30545, 32410, 31353, 29597, 23783, 19447, 17119, 16200, 18774, 19206, 21517, 20296, 21002, 22437, 20048, 18504, 16052, 12294, 11082, 13762, 16368, 16314, 14902, 11589, 11679, 13283, 15410, 15437, 18382, 21775, 22002, 20539, 19461, 18387, 16414, 10136, 6636, 9883, 15081, 16487, 14184, 13456, 11426, 10996, 12255, 14585, 16803, 18839, 15448, 13252, 18579, 19466, 18117, 16461, 14260, 12921, 14320, 14869, 10848, 4821, 1849, 4551, 10746, 9762, 4403, 5442, 8114, 9960, 13590, 17034, 15608, 10394, 10422, 12533, 9028, 7060, 7697, 7022, 4076, 7921, 6298, 8882, 12646, 16307, 19497, 18230, 12863, 12331, 14971, 12869, 10184, 12997, 14509, 14983, 15816, 15633, 15970, 17953, 17977, 17008, 15531, 14529, 13703, 17307, 16070]
17944A6070j821m387l665k226k222r60J493J808J843Q61K467K779m635m944N029
17929G490J113k789J588M188L478p68n86j408j672m032N46J669j189j296R86K934
17913A0252JK337O344L082j981k838n300J862M496M842K483r55j856k329k372
17898A8068J082L533j415J493O45N12P8M571L219K945l09P365J6106K3924K3267
17883A05084J6644O090j579m281j4936k2027j7121j6376j2935m070o703q893m89
17870A8408J163q50k545n138l888K442M12J534m63j798J688R08K116j438J95K937
17854A5683Q1L451J707J496J625k128k341n24J119M670J955k27K585P256J1805
17839D8213J7367K0761K9041L8092L6467K3895J1621L302r758k8552l7831l6587
$$ y = [16070, 14249, 9862, 6197, 3971, 1749, 789, 2282, 4090, 5933, 6794, 9261, 12040, 7405, 2461, 7490, 8603, 5814, 7402, 11590, 15068, 14300, 13714, 12306, 10634, 6602, 7148, 8817, 7628, 6332, 7318, 10252, 10253, 12590, 18934, 22016, 20035, 17197, 11897, 13759, 18255, 23097, 25580, 24625, 22769, 20440, 18068, 19150, 22683, 21268, 22761, 23406, 23918, 23996, 28567, 31786, 34731, 34422, 41787, 57893, 81817, 105084, 121728, 127818, 126239, 121958, 107022, 84995, 67874, 51498, 38563, 34493, 27790, 18897, 18408, 19571, 18721, 16176, 11038, 7150, 9592, 10004, 11538, 11075, 9277, 10965, 11873, 13989, 12551, 12746, 15683, 15764, 19215, 20922, 22418, 24043, 21915, 19574, 19050, 20169, 24839, 26794, 26567, 29152, 36408, 48213, 65580, 86341, 115382, 153474, 189941, 213836, 225457, 228759, 219001, 190449, 152618, 116031]
17827A16031l0433k2061j3662r111q504m309p952o525k219M39j290j202N86k794
17813F994j295K911J860n64k08o60l142l246N230M891J112m226R06J191l957k416
17797E381Q45K240O02l49N908M999p11N261J2754J1797J8239J7960Q967M746J676
17782A00315l410j3793j4476j4720j5977j4370q455k902J630k947j335k103o717
17769G40j527J846j193l55K657L248K577J696j741L42L684p64p74m562j356J832
17753F350K891Q10M14j963l718j376J962O992O816M425N65j062j541m065l105
17738A4395R75j970l574l023m3k324k617M16J020j395Q40L338P47N69k988m646
17722b80N08K393M13l94M429R45k383k78l747N9L152J487K146K726K027k934j643
$$ y = [116031, 85598, 63537, 49875, 40764, 32260, 27951, 19999, 13474, 11255, 11694, 10404, 9202, 9788, 6994, 5699, 8610, 10470, 9906, 9698, 9038, 5896, 2650, 7880, 12771, 13883, 9657, 10563, 11754, 7797, 5381, 6226, 8466, 9068, 8719, 14627, 19626, 18915, 24176, 36930, 48727, 66966, 84926, 93893, 98639, 100315, 96905, 83112, 68636, 53916, 37939, 23569, 15114, 12212, 13842, 10895, 9560, 7457, 740, -787, 1059, -134, -489, 2168, 5416, 7993, 9689, 7948, 8290, 11974, 11210, 10436, 5874, 4518, 6350, 9241, 10051, 10465, 8502, 4784, 3408, 5370, 12362, 19178, 23603, 24168, 23106, 21565, 17500, 14395, 15370, 13400, 9826, 6803, 6760, 4436, 1819, 2235, 3255, 1860, 2700, 6038, 6785, 7354, 4366, -280, 228, 2621, 3034, 2640, 7069, 8014, 5631, 5353, 1606, 1665, 4817, 6304, 8450, 11176, 13203, 10269, 8626]
17705H626n810k598J194k797J296O61j526m01O56L129Q3j758j744l618J267N121
17689A781P97J055J010K134k098m518l447j64k82O676K848J417j282l089k720
17674A18N17n44m79L826K501m941n946M80O673J749k507l683O771M519k070k599
17658D385n172N2j447j233L079J931l639l5j172M203J656p69l653l40J889L026
17642B761J4k142k67J904k91o97l01m825Q53J319K344j176o56m33L690j043l60
17625F94O3k472k794J573K411k466j333K120L351P03L81k260Q17J081J153M304
17609G326l492j971J842M536k572j330P09K85l738J167J75l915j631j257m034
17594g900J501M674m34K167K213k573j069J857N779L513Q05l23k638j247k841
$$ y = [8626, 2816, 218, 1412, -1385, -89, 572, -954, -1355, -699, 2430, 2513, 755, -989, -4607, -3340, 1781, 2578, 3633, 4643, 6777, 4679, 161, -3286, -3450, -3732, 2944, 5792, 7209, 5927, 2838, 118, 635, 91, -388, 3438, 5939, 998, -4948, -4468, 2205, 3954, 1447, -2236, 4535, 9054, 6984, 4385, -787, -735, -2182, -3415, -336, 1595, -2044, -2079, -3251, 952, 2608, 1839, -1814, -2154, -265, 2761, 2775, 633, 366, 2270, 1979, 1282, 981, -3844, -2991, -1672, 672, -504, -1160, -1593, 2097, 1054, 694, 757, -1715, -4509, -2936, -525, -2991, -4324, -2204, 1147, 1850, 2231, -29, 788, 1869, 3022, 7326, 3834, 1863, 3705, 8241, 5669, 4339, 5048, 5333, 1595, 2762, 2937, -978, -2609, -3866, -7900, -6399, -1725, -2159, 8, 2221, -352, -1421, 436, 6215, 9728, 10533, 10210, 7572, 6325, 3484]
17579C484J196j977j648l01N9k491l79N25j274Q00N29o63j462M22l785k794R45
17562h814J429L371O928J893l087k353K609q16j914k888j673M226L288r14m404
17547c119L473M591K71n327k014L995k130Q91K524O98r54J675L235j85L33n882
17531B075j350k189n89J530M252l356L229Q07R43J506p74n416m020J570O182K572
17515F972j839k064j889J838M884n878m226j324n08K638J051l694J092K345k50
17500h52p83K921N36l558m252j804K352J948k287k678O0N226M028L382Q75r92
17484D122j759Q6J152j328j125j682j534j619K461K179k66l274j559J839N76M9
17468a682j203L912K315j219p96Q05K76k295Q49m51l26J572l785l278L561L980
$$ y = [3484, 4680, 2703, 1055, 754, 813, -1678, -2057, -1532, -2806, -2006, -1477, -2140, -3602, -3180, -6965, -9759, -8814, -7385, -4014, 2914, 4807, 1720, -633, 1976, 1160, -754, -3642, -5315, -1089, 2199, 1285, -3119, 354, 4945, 5216, -111, -2125, 1870, -260, 631, 3155, 3853, 2899, 4574, 7809, 7624, 7957, 2075, 725, -1464, -2053, -523, 3729, 373, 3602, 4409, 5352, 6858, 6084, 668, -3352, -1782, 4400, 6972, 5133, 3069, 1180, 3018, 7902, 2024, -2202, -3526, -4034, -1396, -345, -4039, -2947, -602, -852, -1635, 1286, 1822, -1736, -5988, -7792, -5440, -3492, -5779, -8457, -8397, -3171, 857, 4239, 5114, 4122, 2363, 2449, 3601, 2273, 1148, -534, -2068, -3687, -1226, 953, 687, -2587, -4146, -2307, -1731, -1682, -2885, 1027, 3342, 2123, 1327, 2132, 2408, 113, 962, 511, 185, 1757, -2028, -5306, -1745, 2235]
17452B235M385P506n206m548j186L054k267n32p4k769O264J6098J7527L9j1324
17437B9202j0721p122p235l277L407L998r71n639j363l918K240K475K038K031
17423E145j739l890j422J159K671Q92K188k182J533K98l087k401q36Q44J787P79
17407A739l790j074J79M526k996l201K793P91j783K025L459J556L501n34k243
17392D948k561j260j255K311n59j194m152M59j092l65j649J10r02P32q38k181
17376i448L914K361J480P94j754K41M39k559J005n53n43K85K980k911l60M370
17360b59l326j40J056K375L34J095M372N673k215l062k049o29n34o45k363k803
17344c120n52k09k44L195j098p3l27n41K56K49O45j364J887N03L106K811K638
$$ y = [2235, 6620, 14126, 8920, 4372, 3186, 6240, 3973, 3441, 3367, 598, 6862, 22960, 40487, 40526, 29202, 18481, 11359, 4124, 847, 4254, 8252, 7281, 1642, 279, -3639, -1399, 1076, 3114, 5145, 3406, -484, -1906, -747, 1924, 2816, 5004, 2822, 4355, 4653, 1566, -835, -1671, -827, 960, 1739, -2051, -3125, -2946, 1580, -1416, -4617, -1824, -1033, -2816, -791, 2668, 4224, 7725, 7191, 4948, 2387, 1127, -128, 2183, 1624, 430, -3722, -3263, -4355, -4720, -6369, -6259, -7161, -6429, -7267, -9448, -5534, -3173, -1693, -899, -2653, -2412, -1973, -4532, -3527, -4080, -4623, -4338, -1358, -4269, -4629, -259, -3585, -3725, -2669, -294, 40, 1135, 5507, 11180, 8965, 5903, 3854, 3225, 2691, 2046, -317, -3120, -3672, -3881, -4125, -930, -2028, -2101, -2428, -2969, -2713, -2464, -1819, -3183, -1296, -793, 2313, 5124, 7762]
17327G762n6j023j130m225m38j62K36J543K111J507j91L59K354M87j708O58P40
17310H824l358q434o095j547L35J859K942K843M146o07l85K166j30m667j674j799
17294e581L355M842l498k073L802j950J986L336J871P52J588K313m107l125j92
17279C319j128j000l401K066J639P36k445M25J037q75M045j091l604K049K669
17264D441j435K028j652k762o42J76K365J738n49K32K782M20j5L454k31l150j978
17247E222K338j230N17N90j700k140K804M53l661o10j361r63J855p56k679L750
17231B429K622J434l579N66N597N452q54M417L505K839J410m68j550R16J156J342
17215B7234J711J411K265P201J555N87K661M694P389O818P089O579N797Q933J2093
$$ y = [7762, 7706, 6683, 5553, 1328, 890, 728, 964, 2507, 4618, 6125, 5934, 6293, 8647, 9134, 7426, 8084, 8824, 5466, -2968, -9063, -10610, -10275, -8416, -5474, -2631, 1515, 908, 523, 2689, 2559, -2108, -3782, -5581, -2226, 2616, -882, -2955, 847, -1103, 883, 4219, 6090, 6842, 8430, 10743, 6636, 3511, 3319, 2191, 1191, -2210, -144, 1495, 2231, -214, 211, 1248, 373, 4418, 3327, -277, 1772, 4441, 3006, 5034, 3382, 620, -22, 154, 2519, 4257, 3708, 3940, 6722, 7142, 7127, 10581, 10350, 7200, 5222, 7560, 6330, 6847, 7437, 5737, 3597, 6401, 6854, 3193, 2583, 1222, 259, 2114, 1358, -1321, 2429, 5051, 6485, 2906, 3472, 9069, 14521, 13667, 18084, 21589, 24428, 25838, 25370, 23820, 24736, 25892, 27234, 28945, 30356, 32621, 39822, 41377, 41964, 44625, 49319, 56708, 63526, 70615, 77194, 82991, 91924, 104017]
17200A04017K2227L2503L7710L3892L1485K7092J9020J6248J8946K3042M1285
17189D07467O2946J03700J74323L15764N65871Q61391J056760J127114P82243
17180E457579K44335l26658q77131j029582r94620p74987n16565l34068k19782
17171F28521j44637j00587p1050m5836k6912k1407k0607k0061k3825k1904j7917
17160A13778j5587j1334o676r512j0560q785r450l102J730k442n76j370k617k802
17146C0695p794j817k646Kj452l112N004O295Q53l156l668l220j678n37K313L776
17130A9858n65l563n543m98k61j804k328J21L767r85R29k517J370k1r60J484J001
17113I485k071j876K661M6J043L033m86k649j466l218l503j060m05l6K71J360
$$ y = [104017, 126244, 158747, 196457, 230349, 261834, 288926, 307946, 324194, 343140, 366182, 407467, 470413, 574113, 748436, 1064200, 1630071, 2491462, 3548222, 4675336, 5457579, 5701914, 5375256, 4498125, 3468543, 2473923, 1698936, 1182371, 848303, 628521, 483884, 383297, 312247, 266411, 239499, 218092, 197485, 177424, 153599, 131695, 113778, 98191, 86857, 80181, 70669, 60109, 51324, 41874, 38772, 40502, 38060, 37484, 36114, 33497, 30695, 22901, 21084, 18438, 18440, 16988, 13876, 18880, 25175, 26028, 22872, 19204, 15984, 14306, 13769, 16082, 19858, 19293, 15730, 10187, 9689, 9428, 7624, 5296, 5417, 9184, 8199, 9128, 6611, 7981, 7960, 7000, 8484, 9485, 7414, 5538, 8199, 8245, 9288, 12321, 11835, 9186, 7720, 4502, 999, -61, -466, -502, -231, 1129]
17097A129L192J403n5n157j644q3K010K110L965k266l631R96K346n60k540J679
17081B894L9L13K301J556o529K46L50O31L11o75L508J801J966j23m911j023N333
17064G988m16k036j318p06o89M417J059J078K868j725n546j416k771o33j059k362
17048c267o75K232j032J773p86n15j545K312K355p25j670j432J358K422j850J875
17032H30K12P35l90k521K861k18j40L525K018J106m049p339k77J478K058L688
17016C577J301l939m37P225M700o136l356K213k625k957m082j27L645l71K889
17001A520L586j856j177n33J448K000j598n672j779p85l580N75J275J467K304
16986b805M037K639r81o08m516J69J545M122m18p135o84K476L119L9m962j710
$$ y = [1129, 4321, 5724, 5669, 512, -1132, -1215, 795, 2905, 6870, 4604, 973, 1969, 4315, 3755, 1215, 2894, 2933, 3246, 5547, 7103, 574, 820, 1170, 1801, 2112, 1437, 4945, 6746, 8712, 8589, 3678, 2655, 7988, 7572, 5536, 4218, 3512, 2823, 7240, 8299, 9377, 12245, 10520, 4974, 3558, 787, 154, -905, -3267, -3942, -1710, -2742, -969, -1755, -2270, -3815, -1503, 852, 127, -1543, -2975, -1617, 805, -1045, 830, 1042, 1777, 1387, -1134, 1727, 1509, 1369, 4894, 6912, 8018, 3969, -3370, -3647, -2169, -111, 3577, 4878, 939, 502, 7727, 12427, 6291, 2935, 5148, 2523, -434, -4516, -4643, -998, -1369, 1520, 5106, 3250, 2073, 1540, 2988, 4988, 3390, -2282, -4061, -4846, -8426, -7851, -6576, -5109, -2805, 1232, 3871, 2890, 2282, -2234, -2065, -520, 3602, 3184, -3951, -4635, -2159, 960, 999, -3963, -5673]
16970e673j455L76J150M894k354l460k703j327J696L875K747J034j345K377O94
16955E26K89O17j153j93k404J000L705r8K85k992j027P30R73L06M056k039L98
16938B979J114m796k949l184l050J959K710J262k889K53K525k252j91j344K934
16923d919N791N48l77J437M63L49J86j995k579J354P88J665k534k682l96J527
16907a374m08J920J333m256k995J578k8O28J780k71j0N25K332K053n590J290L026
16890A533l44k612n77j305q79K074k178k263K203J930O45J328L13K641k154j753
16874a398k404n661n48J733l81J227L571L04j454j419j959o89N404j537j67L7
16858e341j484J402N008K837m855k966J106K966K514P18k373j824k147k713K021
$$ y = [-5673, -7128, -6752, -5602, -708, -3062, -6522, -9225, -10552, -8856, -4981, -2234, -1200, -2545, -168, 526, 815, 1432, 279, 86, -2318, -1318, 2387, 2289, 2574, -418, -1445, -715, 258, 564, 4620, 2581, 2979, 4093, -703, -3652, -6836, -9886, -7927, -5217, -3955, -6844, -6591, -4066, -6318, -6509, -7853, -4919, 872, 1420, 1043, 2480, 2943, 3292, 3478, 1483, -1096, 258, 1046, 2711, 177, -2505, -2901, -1374, -1782, 138, 1471, -2785, -5780, -4202, -4230, -3602, -1822, -2093, -2103, -1578, 754, 2807, -2783, -1493, 1533, 1189, -1423, -2000, -3305, -4184, -2110, -4288, -6551, -4348, -2418, -1773, -445, -132, 2509, 355, -1398, -3802, -9463, -10011, -8278, -8659, -7432, -3861, -3557, -5011, -6430, -8389, -9078, -3674, -5211, -5378, -5341, -6825, -5423, -415, 2422, -2433, -5399, -4293, -1327, 1187, 1905, -468, -2292, -4439, -7152, -5131]
16843e131K529j83l1J756p84k189k742J727J408R32o74L590K780j989p40R57k634
16826a418N51j47n21j242J102L808m194k267L460j61j897r51j900j295O33M680
16810a759R9l788J508J53j283l13J718o92L035J643K93j231K33o48j111j520k564
16793f227J826J902M048J721o579l425J239J140K535p11p55J048j74M110r02k247
16777a451L918j704o68L740l059l367j369K388J6j644m11L817O81j219n219k5
16761e576J610J569m74j822L63K474K857j134O92L292k655l661L23J193K143k379
16745a185k875k119k284j882K787N014j09r24K06l696K247O755K597J014l74k747
16729B425j411k03J283j426o596k743K099J493J058K32k528K057K67m647l953
$$ y = [-5131, -2602, -2785, -2816, -1060, -1844, -4033, -6775, -5048, -3640, -2708, -3382, 208, 2988, 999, 259, 1216, -1418, -867, -1014, -1535, -2777, -1675, 2133, -2061, -4328, -868, -1029, -2926, -3877, -5777, -7072, -6439, -1759, -1660, -5448, -3940, -3787, -5070, -5383, -3665, -4357, -1322, 321, 614, -617, -384, -1032, -2143, -3663, -6227, -4401, -2499, 1549, 3270, -3309, -6734, -5495, -4355, -1820, -2531, -3286, -2238, -2412, 1698, 796, -1451, 2467, 763, 95, 3835, 776, -2591, -3960, -1572, -1556, -3200, -3611, 206, 887, -332, -5551, -5576, -3966, -2397, -2871, -4693, -4330, -1856, 1001, -133, 559, 3851, 1196, -2465, -2142, -949, 1194, -1185, -4060, -6179, -8463, -10345, -7558, -2544, -2653, -3577, -3371, -7067, -4820, 1935, 4532, 5546, 5172, 2425, 1014, 811, 2094, 668, -5928, -8671, -6572, -5079, -4021, -3789, -6317, -4260, -3993, -8640, -12593]
16714a2593J913M614J139r28J649K912K756j152J707l22n90m119j159k639O22
16699f190O516L674k173k232l439L51K448j782J083L987L285K680k91j206k297
16684D414L014j191m188J118K097n02n81n73L446j088m849L066K322j175k431
16669B899R03r52k544J49l793J809J81P75q49N12M48J599M878K481j388R59n096
16652B971k194M80p18K765L007k790m514k923k655k841J867K946N242K14k009
16637a152J254j625k154l62n16L148J238J996k668M5N18k842K881j10k292M416
16621A775l80n177j733M504L407K598J767N689M905M244K084K705K827k251r031
16606A7933n154m976j78n666l630J284rj125R15L508O16j411j808q4Q88K103p13
$$ y = [-12593, -10680, -6066, -4927, -5855, -4206, -1294, 1462, 310, 2017, 1695, 1105, -3014, -4173, -6812, -6190, 326, 4000, 1827, -405, -3844, -3493, -1045, -2827, -1744, 2243, 5528, 8208, 7917, 6711, 4414, 7428, 6237, 2049, 3167, 5264, 4762, 4181, 3608, 7054, 5966, 1117, 4183, 6505, 5330, 2899, 3802, 2850, 306, 455, -3338, -1529, -1348, -573, -1422, -910, -462, 1137, 6015, 8496, 7108, 8067, 2971, 777, 1257, 539, 3304, 6311, 3521, -993, -3916, -6571, -9412, -7545, -4599, 643, 857, -1152, 102, -1523, -3677, -4039, -4555, -1407, -169, 1827, -841, -796, -278, -3120, -239, -349, -2641, 1775, 1395, -3782, -5515, -1011, 2396, 4994, 6761, 12450, 17355, 21599, 23683, 26388, 29215, 26964, 17933, 12779, 7803, 7625, 1959, -1671, -387, -396, -1521, -606, 2902, 3518, 2107, 299, 215, 1103, 3206, 2493]
16589B493l729l326K10N57j826J165n59j079l83j474L327J835J909J167M457P418
16573A2162m355m418k699l088N29J061K459K630N72k039k021l149O519K349n181
16558A331n003J803O166O225k271o346l415k442r37j896N150L965K477K108o269
16543F46n522J144k40K21Q97M359K723j063m492m086R86j229l018J264M349r94
16527d055k399J408n57M71j34L054Q87k254L20L684M038Q48n671l371l51M785
16511G03K145j302k731j353K580K644J810j163o593m04N96J61l464K62K277J433
16495b399j774J81M956k497R58K21K16M513K33r365k011J098L992L694J53n183
16479c014m56J028K274N63L330o54J486K05N50k236k948j134L514j67l426q41
$$ y = [2493, -1236, -4562, -4352, -3795, -5621, -4456, -5015, -6094, -6477, -7951, -4624, -2789, -880, 287, 4744, 12162, 7807, 3389, 690, -2398, -1869, -808, 1651, 4281, 4853, 2814, 793, -2356, 4163, 6512, 1331, -3672, -1869, 4297, 10522, 8251, 1905, -1510, -3952, -4889, -6785, -1635, 2330, 4807, 6915, 646, -4876, -3732, -3972, -3751, -2854, 1505, 4228, 3165, -1327, -5413, -4427, -5656, -8674, -7410, -3061, -4055, -6454, -5046, -5603, -5132, -5266, -2212, -1325, -3579, -3259, 425, 4463, 5311, -360, -3731, -4082, 703, 2848, 1546, -1185, -2538, 42, 2686, 4496, 3333, -3260, -3664, -3068, -2907, -6371, -6109, -3832, -2399, -4173, -3992, 964, -1533, -575, -354, -138, 4375, 4608, -4757, -6768, -5670, -1678, 2016, 2169, -3014, -3470, -2442, -168, 395, 3725, 3071, 4557, 4762, 5312, 3076, 128, -1006, 2508, 2341, -1085, -1926]
16463a926J104O02N857N144M67k333k947j396K114j147l166k187l051k284k89
16448e438p56k397J188K771R57J195J454q42K199J918p26m281N55Q42J18J961
16432G18J445l169k695J780K183j371N39j044k715K83l185k904K236k665l237
16417a3801k100K020M521O940L618P12k084j908n64M463P010N39p01j856l910
16402B899L71l262l14j638l570L285J058j948K824L944j165K220L549L65m838
16387C780l347j898r00J057N15J303l112m202k983J461Q403l78j208k791k919
16372g219J552K93m59K387P68k061M245L264N74j893r29n78k553K795K234j049
16356A371k938k17L267Q30l070k276k209k921R44N968L965j21o35k515n772n55
$$ y = [-1926, -822, -220, 5637, 10781, 11248, 8915, 5968, 4572, 6686, 5539, 2373, 186, -2865, -5149, -5438, -6194, -8591, -7403, -4632, -3675, -2480, -1026, -1868, 331, 2249, 1523, -2758, -2203, -1361, -1243, 718, 2163, -1006, -3701, -1921, 262, -1109, -570, -1614, -4329, -4046, -7231, -10135, -7899, -10564, -13801, -15901, -13881, -9360, -2420, 1198, 1910, -174, -2082, -2646, 1817, 8827, 9366, 8665, 6809, 2899, 3270, 8, -306, -1944, -5514, -2229, -1171, -3119, -295, 3649, 2484, 4704, 8253, 8618, 3780, 433, -1465, -2365, -1308, -793, 510, -2602, -6804, -9787, -8326, 77, -301, -1509, -4300, -7219, -5667, -5374, -5833, -3446, -2678, -4739, -494, 2770, 3344, 1451, 522, -56, -2609, 186, 2420, 1371, -1567, -1784, 1483, 2313, -757, -3033, -5242, -8163, -7219, -1251, 2714, 2593, 1958, -557, -6329, -6884]
16340f884J924O02L26J649O20K571m554O89k340j597N46J83j848n723M217M746
16324d873K009K290m815p42j070j015j697l00r35j576L102O798M685P11m627j010
16308c065N078J597O37k573k723M48j835J454J825j666l012K645J187k210j762
16293c975O9J465K584K241q59n9J921k160l407m179k370O49M183P51K739O838
16277F431j803m452k811k936K047K93m522K182K155J089r79J318J697k283r92
16262c566K609L668n47r20p96K158j910l129k895R1j885N86k171Q12q54L032K546
16245c171M522J081j165m393k709J746p86M525o17j495L997j715n184n99J102
16230d861j841J62P83k76J025M190J071j406L85k240K018P085Q31l836l215m203
$$ y = [-6884, -4960, -4358, -4032, -2383, -1763, 808, -3746, -3057, -5397, -6994, -6448, -6265, -8113, -13836, -9619, -4873, -2864, -574, -5389, -6131, -7201, -8216, -9913, -10213, -11148, -12724, -9622, -2824, 1861, 2572, -2055, -3065, 2013, 3610, 4247, 1674, -1049, -601, -2436, -982, 843, -823, -3835, -1190, -3, -2213, -3975, -3906, -2441, 143, 2384, 1525, 1466, 3387, 1227, -2180, -6359, -8729, -8080, -3897, -3146, -407, 6431, 4628, 176, -2635, -5571, -3524, -3231, -7753, -5571, -3416, -2327, -3306, -1988, -291, -2574, -3566, -957, 2711, 2164, 1244, 448, 2606, 696, -2433, -5328, -5237, -7122, -6536, -8707, -7895, -8749, -5717, -3171, 1351, 2432, 1267, -3126, -5835, -4089, -4875, -350, -967, -2462, 1535, -180, -5364, -5963, -4861, -6702, -6540, -5757, -6033, -5008, -818, 253, -1153, -768, -3008, -990, 6095, 6926, 3090, -125, -4328]
16214d328p89l690j894L762M347J417n07k767l524L67J737j184J969m81l959L581
16198e943Q1j263N217M50k350l73p42N71M035M24l008k387N29j184K337K98N061
16181A753K886J013l262j075L645K599K249m715m388j471P44J358l94k457P89
16166g26K376l297j727J538r81j772k70k532P83J372R14j570j311K44Q81m389
16150a0467K119K95M64K14k38K340J032n83K116J186o92M81l82m500j932l452
16134a1999m378K429N350M536P06m87j164l424L407J398o77k43K821K310M97n506
16118d424j568N692N169l632l632m578j274K252L805M181o14k067j253l198j618
16103f759L148m874j364J511K041J379K859Q22l13n6m858l855K410L586K0R81
$$ y = [-4328, -5117, -8807, -10701, -6939, -2592, -1175, -1682, -4449, -7973, -7606, -5869, -7053, -5084, -5565, -9524, -5943, -5862, -7125, -1908, -1458, -3808, -4181, -4923, -4352, -317, 107, -2901, -5288, -4759, -5943, -3606, -3308, 1753, 4639, 5652, 2390, 1315, 4960, 7559, 9808, 5093, 705, -766, -22, 1336, 942, -1515, -726, 1650, -1647, -3374, -1836, -2817, -4589, -4859, -7391, -6608, -5236, -4322, -5892, -7203, -6959, -6078, -10467, -8348, -8053, -7589, -7375, -7613, -5273, -4241, -4824, -2708, -1522, -2214, -1733, -2115, -6615, -8547, -11999, -16377, -13948, -8598, -4062, -3356, -3843, -5007, -8431, -5024, -3626, -4303, -4546, -1725, 585, 1082, -4424, -5992, -300, 4869, 1237, -2395, -6973, -8247, -5995, -2190, 1991, 1377, -690, -1943, -5141, -6759, -3611, -8485, -9849, -8338, -6297, -4918, -2059, -1237, -1550, -1606, -6464, -10319, -7909, -4323, -4303, -3322]
16087c322J587k957p09n73p08K590p64n63J989J037K480k785M920P85n674k403
16071e070j063J389j003K935J134J877j494l411j340j561K245J495J877L580k012
16056d22m160j931j348p99K70P47j377M75N599K367O45J151l020P15k219j698
16040e005k016M45M63J403J469J958o22j236j575O46J28J469k591j727M568M88
16024a735k281m70l19j110p3j797n96O894K470l242m081k354k39l59K842M258
16008b192K094J392K012n085K095J452k139o414j397j498M90N503L437j495q88
15993b633k970r57L612j99m64L220m831Q63L491n72l25k022k185k647m71q90L741
15976f239M343L400p72j496n08l429k621j697K797M359L239J28Nn85k66k301k216
$$ y = [-3322, -1735, -4692, -5401, -5974, -6682, -4092, -4856, -5419, -3430, -2393, 87, -2698, 2222, 3007, -2667, -5070, -6133, -4744, -5747, -2812, -1678, 199, -1295, -4706, -6046, -7607, -5362, -3867, -1990, 1590, -422, -4582, -6513, -7861, -8660, -8390, -7643, -9020, -8545, -2946, -579, 66, 1217, -1803, -1088, -3307, -5005, -7021, -6576, -6113, -4710, -3241, -1283, -1905, -3141, -4716, -4070, -3942, -2473, -5064, -6791, -2223, -1735, -4016, -4486, -4805, -5915, -5988, -7785, -8381, -1487, 983, -2259, -6340, -8694, -8933, -9292, -6450, -2192, -98, 1294, 3306, -1779, 316, 1768, -371, -6785, -8182, -9680, -9190, -3687, -250, -1745, -2633, -5603, -6560, -2948, -3147, -3611, -391, -5222, -4359, -868, -1440, -1765, -3787, -5972, -8619, -9090, -9980, -6239, -1896, 1504, 732, -764, -1272, -4701, -7322, -9019, -6222, -1863, 1376, 1504, 1509, 924, 658, -1643, -3859]
15959c859j342J489M378L291l873j932M758j638p557l56K865L780N52m917l03
15944d664J384k444J864K981k400j889K571k28P657m88m245j141J273l954l074
15929f797r95K867R69K372l050O38K769k712k840J142J872j245J316p51J980K089
15913c76r5l185k704k420j794N700J568q95m73J175J268n03Q48j966r87J898K688
15896b53k407l278K59K642k863J902R28n672K853N937N583J217m366l442K101
15881A141j815k912r04j008j304Q86K153K435K293K65m651k75k217l379M03R66
15865g923J715K240R12j44m27K419J941p53l066RJ419P29r06j299K420j839l089
15848e642l60m08L783J748P51m00M21N06q80M73J810n36k873k033M33j662n21
$$ y = [-3859, -5201, -3712, 666, 3957, 84, -1848, 2910, 1272, -6285, -6641, -3776, 4, 556, -4361, -4664, -3280, -5724, -3860, -879, -3279, -5168, -2597, -2825, 4832, 4344, 99, -1042, 231, -3723, -6797, -7792, -4925, -3956, -1584, -4634, -3996, -1227, -3939, -6779, -5637, -3765, -5010, -3694, -4445, -2465, -376, -471, -3656, -6360, -8780, -10574, -4874, -3306, -4201, -4674, -3499, -2231, -2734, -1886, -3852, -4839, -2941, -253, -2660, -5938, -5679, -3037, -5900, -3998, -3070, -8742, -5889, 48, 5631, 6848, 2482, -960, 1141, -674, -3586, -4490, -5498, -6802, -5916, -3763, -1328, 965, 1230, -3421, -3696, -5913, -9292, -8889, -7923, -6208, -3968, -3056, -3200, -3627, -1208, 733, -20, -3086, -3077, -1658, -929, -1835, -3134, -714, -2553, -5642, -6002, -6410, -2627, -879, -128, -528, -107, 399, -481, -8, 1802, 1266, -1607, -3640, -3207, -4869, -5390]
15831e390K516J872P61J768l738j100k468L695K156q79o196J910k298J746L453
15816b192j039k933J814j443k168L002M907j162j013K168J912o64j235k86j400
15801a732l569j752J296J829j173j353o2m414R31L255K793o83J851J823m911r42
15785f813k1N11j36k832K440L545K375j333L19J688m88k388j373l293N95L17K067
15768d820M62q31J980J345k054m39n4k989J658L903J020J524K264n02k094L41
15752G14k042j951j469k049J134J711j057j252L094J015k327m02R83R02J077j023
15736b942Q74j006P21L884k089n492m242P189N437k71O13J561K40m150l578m907
15720h158M555J755o86l888j046J426k99j179L32J298Q66P51j316p485j338k56
$$ y = [-5390, -2874, -1002, -241, 1527, -2211, -3311, -5779, -2084, 72, -807, -7003, -5093, -7391, -5645, -2192, -3231, -6164, -4350, -5793, -7961, -4959, -52, -1214, -2227, -59, 1853, 1189, -46, -332, -1732, -5301, -7053, -5757, -3928, -5101, -6454, -6516, -10930, -9999, -6744, -3951, -4634, -2783, -960, -5871, -6813, -6834, -6323, -6459, -9291, -6851, -3306, -931, -2264, -1945, -257, -745, -3133, -4506, -7799, -7204, -6887, -4820, -4358, -5189, -3209, -1864, -3918, -4357, -4411, -7400, -5742, -1839, -819, 705, 2969, 2467, 373, 714, -1328, -3279, -4748, -6797, -5663, -3952, -5009, -6261, -3167, -2152, -4479, -4881, -3898, -2996, -1919, -2942, -2068, -3074, -2353, 1531, -558, -6050, -10292, -3103, 2334, 2063, 2676, 4237, 4477, 327, -3251, -8158, -3603, -1848, -2534, -6422, -7468, -6042, -6341, -7520, -7188, -5890, -5024, -4273, -5589, -13074, -14412, -14668]
15704a4668M659N578K301K69N58j461m731r12L829J431k083K460R37l410j847
15689g090K480L226p31l451K147L032j796m19K303k916o4j42M43O69L70O78J238
15672b3L27j869m363j770K390K850N170L835q8m676m923O57K735M860l205l267
15656a360k159j511k120p37J607N4N468K201K882k530p032P22K797j581J216l304
15640e387l217L055M140K613q15n22j311J499j716l392j8L336M305j336o862j571
15624g199J467j515l803N53M341P26j115k305k009J479m46K521M076K956L435
15609C162J362m448j463j496p13J223K140J893n4L202k763q747n339j109j277
15594a4427N471M314N79l04N19J487M532j400m910M84J615k080o376L70M300K143
$$ y = [-14668, -10009, -4431, -2130, -1861, -1303, -2764, -7495, -8407, -4578, -3147, -5230, -2770, -1833, -5243, -7090, -4610, -1384, -2115, -5566, -3419, -387, -2183, -2602, -299, -3215, -3279, -3421, -2978, -2309, -1939, -1261, -23, 304, -1565, -5928, -7698, -5308, -2458, 2712, 6547, 6459, 1783, -3140, -2483, 252, 5112, 1907, -1360, -3519, -5030, -7150, -7887, -6280, -6226, -758, 1443, 4325, 1795, -5237, -4515, -1718, -3299, -2083, -5387, -8604, -5549, -1409, 1204, 389, -133, -1444, 55, -1661, -5053, -5071, -1735, 2570, 1234, -5628, -7199, -5732, -7247, -11050, -10497, -6156, -5430, -6545, -8850, -10859, -9380, -9826, -7305, -3229, -273, 3162, 4524, 76, -1387, -2883, -3596, -2373, -233, 1660, 1606, 4808, 2045, -6702, -12041, -13150, -14427, -8956, -4642, -4063, -4367, -3848, -2361, 2171, 771, -4139, -3655, -2040, -4120, -10496, -10126, -5826, -3683]
15578c683L441O44K52Q30J678k709l283k533Q63K991J95K149j88J224J460j701
15562A630n69k225k177Q00J116L035Q30q50k348m983l422K699M096j957k027K09
15546f143k932N749M212K88j514r26m919j532J814L61J09K317K941o68q86K172
15530D43o17j456L542O41k087l82O53J510J771m854k830K450J502j171M49j365
15514a801j542J367L760J89j378J766m55R07J85k471k470j177N005L243j099n88
15498C441k728k180j370k69j191J993M413J332J42K857q40k563j156K66j469K01
15482H79j509m105k417K78K148L598j37J226N123j298j690J00k655k112O03J321
15466f47q26j074K499j892l325m54M376K914q682l217J943K053J689K831J19M73
$$ y = [-3683, -242, 402, 654, 1484, 3162, 453, -2830, -5363, -4500, -1509, -1314, 835, 647, 1871, 3331, 1630, 1061, -1164, -3341, -2541, -1425, 1610, 2440, 1590, -758, -5741, -9163, -6464, -2368, -4325, -6352, -6143, -9075, -3326, 886, 1174, -340, -1266, -6185, -7717, -5903, -5542, -5433, -3116, -175, -843, -1729, 443, -174, -1630, 1912, 2553, 466, 84, 737, 2247, 4018, -836, -3666, -1216, 286, -885, -436, -1801, -3343, -1976, 1784, 1973, 595, 2361, 1906, 2813, 2998, 527, -1943, -3120, 1885, 5128, 4029, 3441, 713, -1467, -2837, -3106, -4297, -2304, 2109, 3441, 3583, 6440, 5600, 3037, 1881, 2147, 678, 879, -630, -4735, -7152, -6874, -4726, -1128, -1265, -39, 5084, 3786, 2096, 2196, -459, -2571, -1968, -647, -1473, -2547, -48, -1940, -5265, -5719, -1343, 1571, -7111, -10328, -8385, -6332, -4643, -1812, -1693, -1220]
15450a220J866l236k045K816K961l696j778k067Q08J994K538o91J311j411M40
15435a410l134j360M883K174j543n061j178k533q92N740M129r75O59M025j270
15420B254n199j828j312J880n2r29K024J672l421j298m15m757K189J137k328k317
15404a2700k66M8K730K675j004l317K418n44M185L399j035J113q33J500K288j942
15388a285k295n03O77l710l036r55J235L818j197q35j258K672O38P54J624l102
15372f758J94K832M67j346J236L696K105r22l332k766k94J03n34L188K783J068
15356A720j189k669J644J02m127k649K500K688j331l362J419Q39O862L326l680
15341B093l133l151K52R40j999J636k247l085j317K653K890J449k824j939N375
$$ y = [-1220, 646, -2590, -4635, -1819, 1142, -2554, -4332, -6399, -5591, -3597, -1059, -1750, -439, -1850, -1410, -4544, -5904, -1021, 1153, -390, -5451, -6629, -9162, -10054, -4314, -185, -1160, -501, 3524, 2254, -2945, -4773, -6085, -4205, -4257, -5186, -3162, -1490, -4911, -6209, -6624, -11381, -9192, -8055, -10383, -12700, -12966, -12918, -10188, -7513, -8517, -11834, -9416, -9960, -5775, -2376, -3411, -2298, -3131, -1631, 657, -1285, -3580, -4083, -3406, -7116, -10152, -11107, -9872, -6054, -7251, -8086, -9344, -6672, -6034, -5280, -3656, -6758, -6564, -3732, -3265, -4611, -3375, 321, 2426, 1504, -1828, -4594, -4888, -4785, -5319, -2131, 652, 1720, 531, -2138, -494, -392, -4519, -7168, -4668, -1980, -3311, -6673, -5254, -4415, 2447, 5773, 2093, -1040, -4191, -3939, -2999, -4998, -3362, -5609, -8694, -10011, -7358, -4468, -3019, -5843, -7782, -2407]
15326b407K188M59J412m344q37k006j845L163L771j105q01J075L33K645k257K821
15310B265L081k111m582M38M83K207k508J844J540K232p20l575m006J397R34l517
15294d598r9k759q27J351J668l08L472M008j663K2m76j806O26k6k244M195j80
15277C56O34N95n422l464K108P90K910N93j064L226J767k019J814K885q76o500
15261a667k698j018j726k692l21K953L426N7K346P16l84L051k586n508p61K827
15245c985L333L75o93K92Q67N15j068j946o43L115K385k244k720k415l223l6k78
15228h369J698L260K254O370j142k989l33j417k127k895k6M32N123J137n071m98
15212d593j53k18J581j128j042J347N57M552J477l565p48L718j133j592L804J933
$$ y = [-2407, -219, 240, 1652, -2692, -3529, -5535, -7380, -4217, -446, -1551, -2352, -1277, -944, 1701, -556, 2265, 5346, 3235, -1347, -909, -426, 1781, -727, 1117, 2657, 4889, 4169, 594, -3412, -2015, -1081, -4598, -4697, -7456, -8283, -6932, -5264, -5572, -2100, 1908, 245, 267, -209, -2015, -1389, -1415, -3659, 536, 356, 990, 1585, -3837, -7301, -5193, -4403, -1493, -900, -1964, 1262, 3029, 1010, 2824, 5709, 4833, -1667, -4365, -5383, -7109, -9801, -10122, -7169, -3743, -3686, -1340, -624, -1008, 2043, -543, -6051, -6812, -3985, -652, -277, -970, -678, 189, 704, -364, -2310, -2953, 162, 2547, 303, -2417, -4832, -8055, -8091, -8369, -6671, -3411, -1157, 5213, 4071, 1082, 749, -668, -2795, -5690, -5716, -5284, -161, 976, -4095, -4593, -4746, -4964, -3383, -4511, -5553, -4206, -3649, 903, 2380, -1185, -1933, 1785, 652, -940, 2864, 4797]
15196D797k984q91j446j268l119p322J62M799M800J360l454J007L145k316J359
15181a371K973k833l25K814l47k629j833K666n77l476l77J25M962N052q10m484
15165d70k091N141L70k843k865N13j977K338L146l02K97N37j866r61j866k570
15149e469l02M48O91J490m15Q86J627M556j020m266j886K305j394j126K602K76
15133i97k735n930K11L648L585R77K927j327n481r01R01j200m577l042k41O16
15117a3566L378M044K0j543L968N54K199J875J971J036j884m722K563L197n43
15102B547p56K032k284m185o5J834k407J93K829J739k183k965J145N054K057o65
15086C920M645K595p130m279j640J658j079r09m50m33J543K302N41l451m768J961
$$ y = [4797, 1813, 922, -524, -1792, -4911, -12233, -12071, -7272, -2472, -1112, -4566, -3559, -414, -2730, -1371, 1602, -1231, -1556, 1258, 911, -1718, -3551, -885, -1462, -4938, -5315, -5190, -228, 4824, 4014, -470, -2561, 2580, 2950, 107, -2758, -2245, -4222, -1884, 1262, 960, 1257, 1794, -72, -1033, -2899, -5469, -5771, -5323, -4632, -3142, -3557, -2671, -1044, 3512, 2492, -1774, -3660, -1355, -2749, -3875, -1273, -997, -3732, -9662, -9451, -5803, -2218, -1241, 1686, 359, -5122, -6023, -5122, -6322, -10899, -13941, -14182, -13566, -10188, -6144, -6124, -7667, -3699, -3145, -946, 929, 2900, 3936, 2052, -2670, -107, 3090, 2547, 1791, 3823, 1539, -2646, -2711, -877, -3284, -3091, -262, 1477, -706, -3671, -2526, 2528, 4585, 3920, 8565, 11160, 4030, -249, -1889, -231, -1310, -2219, -2669, -3102, -1559, 743, 1284, -2167, -6935, -4974]
15070d974L983M629k795m275q25M066J741J126N548L71n268j109k536r12L881
15055B651p24K575K839j072r40l342L688O5l506J165Q57J265j747k373J563j931
15039A033J07J565M306J088K408L328L941N507Q77o97j571K623O998P943M598
15024D4054R307K3016K6868L3703L2848K9689L1507L2429K2622J4241M296n051
15012B99529j5062k9370k9697k7324k7118l0007l5725l2482j6286j2659j4611
15001B9188r896o31R68n559m977q83j000m807n32l33m765J394o03j86R51l147
14985d818l237M702N716J955m320n649j150K133M959P077k90l151k495j386J04
14970A50r84k296n760n71K107J522Q68K402M125M96j456J334P47K065l814k523
$$ y = [-4974, -991, 3638, 843, -3432, -4257, -191, 1550, 2676, 8224, 8595, 3327, 2218, -318, -1230, 2651, 1927, 4502, 7341, 6269, 5329, 1987, 5675, 5740, 2234, 3399, 4256, 5521, 3774, 1401, 2964, 1033, 1140, 2705, 7011, 8099, 10507, 13835, 17776, 23283, 24160, 23463, 21892, 24515, 31513, 39456, 44054, 53361, 76377, 103245, 136948, 169796, 199485, 230992, 263421, 286043, 300284, 304580, 299529, 284467, 255097, 225400, 198076, 170958, 140951, 105226, 72744, 56458, 43799, 29188, 19292, 18661, 19629, 14070, 9093, 8210, 7210, 2403, 1871, 1538, -3227, -1833, -2436, -2622, -1671, -4818, -8055, -3353, 2363, 4318, -2, -5651, -6801, -4668, 291, 7368, 7078, 3927, 1432, 46, 150, -834, -3130, -8890, -9461, -7354, -5832, -4964, -2562, 1563, 2059, 603, 1937, 2684, 4749, 935, -1588]
14954a588m802J195k264J676K476J981j809M802M915J253n283p825j086L387q98
14939c870j979j540K248j778J494J947j159M51J173K498j484p53J661K362J882
14924C153n11j316k254k270L010j256k595O3O72k636k323N02L991M161n99j236
14908a444J484j006r82l643O17J353n45j357M568K745K182j15n341j820J851j970
14892c423q0J97J730K819J299l538m01K26j029j208l874J362N428L487k00m350
14876a555j51K500k159K687N850M544m470n896k93J505Q14K144j536P58m28k368
14860A946J975l155m116K383J984n507k846J184L060l63n67K30J29k994j223M5
14844g835K225L772J517p87j557J791K7k411j49J751j037j106o65K06N655K091
$$ y = [-1588, -6390, -5195, -7459, -5783, -3307, -1326, -3135, 1667, 6582, 7835, 2552, -5273, -6359, -2972, -3870, -5849, -7389, -5141, -6919, -5425, -3478, -4637, -4186, -3013, -515, -1999, -2752, -1091, 1271, 3153, 2642, 1326, -928, -3198, -188, -1444, -4039, -3976, -3304, -5940, -8263, -7761, -3770, 391, -208, -1444, 40, -966, -1948, -5591, -4974, -3621, -4166, -5523, -955, 1790, 3972, 3857, -1484, -3304, -1453, -3423, -3503, -3306, -1576, 1243, 2542, -996, -1397, -1171, -2200, -3408, -7282, -5920, -492, 2995, 2795, -1555, -1706, 794, -1365, 1322, 7172, 11716, 7246, 1350, 1057, 2562, 3376, 5520, 3984, 4742, 4314, 1946, 3921, 766, -3350, -967, 1017, -4490, -7336, -6152, -3092, -3455, -4022, -3792, -3663, -6657, -7880, -7835, -5610, -1838, -321, -1108, -2665, -874, -847, -3258, -3407, -1656, -2693, -3799, -4464, -4258, 1397, 3488]
14828C488k397j773k424k052j303M00L004K852l940K37J751m436N82j027K048
14813d990O65J794Q51j505K080j6k554l795K30J091N228o8j459k312n622q26M467
14796f741N470K012j921k686J984J368L827m2j051k632m305J637L7p73J912j528
14780c432K580L901O11k568o04J8j105j525M175L069J6P71J543p35j028m261j362
14763F4O24n137m51K245k255J019L605J524j6J356O23j22M28k591j81k667j255
14746c187K861j158p23m94K007j154m683L26O380J387J414M47k984p285o43M600
14730b889J894p20m902N259O924r48k630l672K847J974k965M62K735K134j747
14715C756J851k457o064k648L662N543j944n453j208M955J488n759J99J00J185
$$ y = [3488, 1091, -682, -3106, -5158, -6461, -6061, -3057, -205, -4145, -3908, -2157, -6593, -6011, -7038, -4990, -4325, -2531, -1680, -3185, -1105, -1121, -3675, -7470, -7240, -6149, -921, -989, -2448, -4760, -10382, -11208, -6741, -1271, 741, -1180, -3866, -1882, -514, 3313, 3271, 2220, -412, -4717, -3080, -3043, -3816, -1904, -3432, -852, 3049, 3660, 1092, 488, 506, -599, -2124, 2051, 5120, 5136, 5907, 7450, 6715, 5687, 1426, 64, 688, -4449, -4900, -2655, -4910, -3891, -286, 1238, 1222, 2578, 3201, 3079, 3507, 916, 735, -1932, -3187, -326, -1484, -2207, -2701, -694, -1848, -6531, -6205, 175, 1562, 2976, 3423, 439, -6846, -7489, -2889, -995, -1715, -6617, -1358, 5566, 4618, 1988, -1684, 1163, 3137, 172, 634, 3369, 5503, 3756, 5607, 3150, -2914, -5562, -1900, 3643, 1699, -3754, -4962, -7, 1481, -4278, -4079, -3979, -2794]
14700b794K738l010m48jr8N09k07N035M074j836m014M4j616K87O44J022j433L259
14682B155J780K665l260o77M243J861k679l290k721J756J167J48l586m354j111
14667e903K009j326k013J514L182J556j58k343j983j366J0J163j98K788J916J703
14651E51n19k17P31M182K303J364m952l197P94k407r32K899J328M2k30J694n056
14634a622o360M409N192L481q92K149K569k547k183R82j861j288K765k127n858
14619c191k91K879J654l979l922j559L11M549K624L548l94n051n848K823N919
14604G2n36m055m67o92K233K666j700j00j844n75K624J62K613K47R57J132k059
14587F78jn72j906K677L540j538o97J382k252L8j865N14K764k361p71j55K895
$$ y = [-2794, -56, -3066, -3514, -3515, -3613, -3104, -3311, 1724, 5798, 3962, -52, -8, -1624, -1337, -693, 329, -1104, 2155, 3935, 6600, 3340, 2663, 6906, 8767, 6088, 2798, 77, 1833, 3000, 3148, -438, -4792, -5903, -3894, -5220, -7233, -5719, -2537, -981, -1139, -3482, -5465, -6831, -6821, -5658, -5856, -3068, -1152, 551, 32, -185, 546, 4728, 7031, 8395, 3443, 246, 1040, -1367, -2299, 600, 1928, 1970, 1740, 3434, -1622, -7982, -3573, 1619, 5100, 4208, 6357, 8926, 6379, 4196, 5178, 3317, 2029, 4794, 2667, -3191, -3482, -603, 1051, -2928, -6850, -8409, -8098, -3549, -925, 2623, 2229, -2822, -8670, -5847, 72, -464, -4519, -4986, -5678, -3445, -779, -2479, -2579, -4423, -4998, -2374, -2212, 401, 648, 1605, 2737, 678, 677, 105, -1801, 876, 4416, 2878, 2181, 3563, 1311, 1349, -516, -2, 2762, 401, -370, -525, 2370]
14570B370K129j235n034j858n279J427J731L400J253J391J296l39R54j776r34
14555e04J096L363N03k084L50L94K301L839M73m34K693k463m170O1K19K400K157
14538A0194k141k333j937l981O27M88K299L43m311K21j473J088K942R27m419j704
14522c170P14M93J860J893J282l378J931J753J059n10J548O79J075p58j943o42
14506C886L523r48l077l190p446L47M456M601L447M97l433j009j684j907k737
14491d674P82J626n56R49L128k991p49m269M398P581j595J407O292p21q082m359
14475a833k41M70o23k673k275J263M1R85K242K878k165O05L679j325j265l635
14459c872k544J86N548L199j968Q19L274K78l732p32j254n73N84M121K157j776
$$ y = [2370, 4499, 3264, -1770, -3628, -8907, -7480, -5749, -2349, -1096, 295, 1591, 1252, 2206, 430, -504, 592, 3955, 4458, 2374, 2724, 3118, 5419, 9258, 9731, 9297, 11990, 9527, 5357, 5418, 5637, 8037, 10194, 8053, 5720, 3783, -198, 429, 917, 3216, 3559, -752, -531, -2004, -916, 2026, 2953, -1466, -3170, -2456, -1963, -103, 1790, 3072, -306, 1625, 3378, 4437, 3927, 5475, 6154, 7229, 6471, 4528, 3886, 7409, 6461, 3384, 194, -7252, -6905, -2449, 2152, 5599, 6096, 2663, 1654, -30, -1937, -4674, -3892, -2266, -2822, -1873, 1255, -1736, -2485, -6754, -2356, 5225, 3630, 5037, 11329, 10608, 2526, -1833, -2074, -1604, -2227, -4900, -7175, -5912, -5871, -4886, -2644, 234, -1931, -1326, 2353, 1028, -237, -3872, -6416, -6230, -682, 2517, 549, 1368, 4642, 4920, 1188, 456, -798, -1371, -787, 3334, 5491, 3715]
14443C715n85k49L613L733r62J083j312L826l018l814K796J289L99q390l460M171
14427B835j06p43Q64k86l113l693J406J591K171K192K183N50j932k436R68K148
14411D599K704m407k186j163K057m47k69N102J087k621K501k110l81l353q264
14396g151k368K717J195J073M116J585J968j21l31M156J274K68J695j212p89J650
14380I725l717p746j171K226J568L389J626p65J042q47j961k973r84N33j144J204
14364EO016k608o243R22j398K290J131J396j358M796J399j168j371n78K086o167
14348h50l210J184K028r64P99L480K504L229j169o137o101J887k210k137M250
14333c417R55J731L332N21K898J757Q39J03j380R74l748m966K48N120J773P1Q86
$$ y = [3715, 3130, 2881, 6494, 10227, 9265, 10348, 9036, 12862, 9844, 6030, 8826, 10115, 10514, 2124, -1336, 2835, 2729, 1986, 2850, 2564, -549, -4242, -2836, -1245, 926, 3118, 5301, 5851, 3919, 1483, 2451, 4599, 7303, 2896, 710, -453, 1604, 1157, 888, 5990, 7077, 4456, 6957, 4847, 4466, 1113, -7151, -9519, -6802, -5607, -4534, -418, 1167, 3135, 3014, 2683, 6839, 8113, 8381, 10076, 8864, 8075, 9725, 6008, -1738, -2909, -683, 885, 4274, 5900, 5135, 6177, 5330, 3369, 396, -588, -55, -1199, 5, 6021, 3413, -2830, -1908, -3306, -1016, 115, 1511, 153, 4949, 6348, 5180, 3809, 3231, 5317, -850, -4060, -2876, -848, -1812, -1013, 2467, 4971, 8200, 7031, 894, -5207, -3320, -5530, -7667, -3417, -2462, -731, 2601, 3122, 6020, 7777, 8616, 8719, 7339, 8313, 4565, -401, -153, 4967, 6740, 6811, 7697]
14316G697o410j592P99J367Q06K278J267j315m213l256O43J439Q72K479j327J31
14300A665K699J987J280l646j468J361l618J439Q521r21l125K00j545l28l375
14285A126p73o48n195Q8M118K064m72L27N82R35q5m597L059L822L768L708k473
14268I354p75r78P79M720j745p29L155N79M74J586J661Q23K96L081K132l74m047
14251A9992P92p63k412O882O609K724N251K676L077M228M820P087Q171L375o1
14236G2448N360P269O421J0942J5077L1168N5611Q3133J14857J43849J52964J31599
14224H30698Q5726J7678n3566j12582j43318j47905j29099r4643o0042m2555k7852
14213A22540k1439j3412o440n396o260n31o934r410n895m865j0799k425r8o95
$$ y = [7697, 1287, -305, 494, 1861, 2667, 4945, 6212, 4897, 684, -2572, -1929, -490, 382, 2861, 1534, 1665, 4364, 6351, 7631, 3985, 2517, 3878, 260, 1699, 10220, 9299, 6174, 6374, 4829, 4501, 1126, 353, -295, -5490, -5402, -1284, 780, 308, 635, 1217, 2152, 2067, -2530, 529, 4351, 8119, 11827, 9354, 8579, 7601, 8380, 13100, 11355, 10626, 13781, 14360, 14834, 16420, 18081, 18904, 19200, 22281, 24413, 24039, 19992, 20784, 20021, 17609, 24491, 31100, 33824, 39075, 41751, 44828, 49056, 53876, 60963, 69134, 72509, 72448, 77808, 85077, 91498, 102440, 117517, 148685, 204296, 287429, 402286, 546135, 699099, 830698, 916424, 934102, 880536, 767954, 624636, 476731, 347632, 252989, 192947, 150392, 122540, 101101, 87689, 81249, 75853, 69593, 69062, 62128, 52718, 46823, 41958, 31159, 28734, 28636, 27941]
14199B7941J141l471k836J74k074j406J782R73k835l390j910o367l793O87o1K034
14183F589j299k359R39k567k075O18L406J210L199P90k976k400K079J292l404
14168C042J09J229j180K121j366k219K785L229l425o64M236L151J96J576l907
14153H913j391J117j925J048J782j045L97K929L911K34k512j318l978m323r43
14138B896K136K664O500n07r57p73J482L22J121J99L2m233k153n227K182P327
14122A3011j066p0J823M13n317k581J325L875k792K722L450L843M297J206j114
14107B3025j978N6J740j324k530k263J762n24k046l92K80m895j780K985M753J941
14091A8810J295l413m097j147P42K589K53q90l725o64p9M05l55J029K83K297N59
$$ y = [27941, 29082, 25611, 22775, 22949, 20875, 19469, 21251, 22224, 19389, 15999, 14089, 7722, 3929, 4616, 4555, 6589, 5290, 2931, 3870, 1303, -772, -154, 3252, 4462, 7661, 8451, 5475, 3075, 5154, 6446, 3042, 3151, 4380, 3200, 5321, 3955, 1736, 4521, 7750, 4325, 3661, 7897, 11048, 11244, 12820, 8913, 7522, 8639, 6714, 7762, 9544, 8499, 8896, 11825, 15736, 15970, 13458, 12140, 8162, 3839, 2896, 5032, 7696, 14196, 13689, 12732, 11959, 13441, 13763, 14884, 15083, 15115, 10882, 8729, 3502, 5684, 13011, 11945, 11875, 13698, 14111, 8794, 6213, 7538, 11413, 8621, 11343, 14793, 18636, 22933, 24139, 23025, 21047, 21103, 22843, 21519, 18989, 16726, 18488, 17964, 15918, 15526, 15806, 10911, 9131, 12116, 16869, 18810, 20105, 16692, 12595, 11448, 12190, 14779, 15032, 14142, 10417, 9753, 9674, 10079, 9724, 10753, 11036, 13333, 13892]
14074A3892K931k485K308j672m013O35L544j125j81L821K612l909k644k419n70
14059A0725l884N26J734J050j116K449J391M94J328L803J428K733k38K946N209
14044C0578J612p80n735l171O94k244m241m688k287j548l085m705N01M369M526
14029I796M879O341N096K875L617K19k896k430n129l412j374p87R7K559n00K737
14013B1688l965l068j302p8L443k065K356L139M983M830P190O088J1769K5547
13999H0555K3356J6587J0197M750o586j0099j3290j6282j6801j5659j0501o271
13987C9956m051l600L543K400L856N10l195k241k010m340m008O89O94k123L378
13972B9458P58P36K048K314J887J623L450QK405N35n7Q50l51l39R78K914R69k522
$$ y = [13892, 16823, 14338, 16646, 14974, 10961, 11596, 15140, 14015, 13834, 17655, 20267, 16358, 13714, 11295, 10725, 6841, 7367, 9101, 10151, 9035, 11484, 12875, 13369, 14697, 18500, 19928, 22661, 22423, 25369, 30578, 32190, 31410, 25675, 22504, 23198, 20954, 16713, 12025, 9738, 8190, 5105, 400, 901, 5270, 9796, 14675, 21016, 26112, 28987, 32604, 32823, 29927, 27497, 22368, 18956, 17582, 16795, 16892, 19451, 18951, 21688, 17723, 14655, 13353, 13275, 16718, 14653, 17009, 20148, 25131, 29961, 37151, 43239, 55008, 80555, 103911, 120498, 130695, 135445, 128859, 118760, 105470, 89188, 72387, 56728, 46227, 39956, 35905, 32305, 35848, 38248, 42104, 42614, 39419, 37178, 35168, 30828, 26820, 27509, 28203, 26080, 29458, 30216, 30952, 33000, 35314, 37201, 38824, 42274, 42282, 44687, 45222, 45165, 46015, 45664, 45325, 46303, 49217, 50186, 47664]
13954D7664j240k103n808p834l324m492m123l871L726M359J142K040Q438R167
13940D3741K846K619N146P817K023K442J929j852m861n038p517k433o128o626
13926C4108n127K410R969O172P132L953N759L800j563k448P14J947L497M340M516
13911G9179J3330R648L974K866J430J094j011n782m858m973p112j4077j0043p537
13897E6128n991n995l652l421O150J3541J0543O346N883O03K32j984m897J64J157
13882G4807J31O266J2842J2413J5338J9450J7120J5138K439j4666l3900m4042
13870H3336n1639n1326l9596k2233j824P348J4409J5580J3114J4131M986P91L43
13857a2580M636Q329L393N85l483P524M506O241N993J791O771P452R156O823P016
$$ y = [47664, 46424, 44321, 38513, 30679, 27355, 22863, 18740, 14869, 18595, 22954, 24096, 26136, 34574, 43741, 46587, 49206, 54352, 62169, 64192, 66634, 68563, 66711, 61850, 56812, 49295, 46862, 40734, 34108, 28981, 31391, 41360, 47532, 54664, 58617, 64376, 68176, 66613, 64165, 64879, 66826, 70323, 74663, 79179, 92509, 102157, 106131, 108997, 110427, 111521, 110510, 104728, 99870, 94897, 87785, 73708, 63665, 56128, 50137, 44142, 40490, 37069, 43219, 56760, 67303, 73649, 79532, 80135, 80367, 78383, 73486, 73650, 74807, 74938, 81204, 94046, 106459, 121797, 141247, 158367, 173505, 175944, 161278, 127378, 83336, 31697, -19629, -59225, -81458, -83282, -75934, -61525, -45945, -32831, -18700, -13714, -12923, -12580, -7944, 385, 3778, 4363, 880, 8404, 12910, 19151, 25144, 26935, 33706, 41158, 50314, 57137, 64153]
13842F4153P857O166M995M440J541L399n31l053j322O809J335J877K703Q919J1760
13827A21048P206O401K740N706L555J0463P236Q427J2880J0065J2214J1320O312
13814B25573K044k142J800L992J2990J9835J8585J6686K0439K2588K0016J8078
13802C80484J2986R729N076N313M474J556L311P927J4034J7464J8388K2437L2631
13789E35810L8125M3243N0331N3212N2251N5715N3853N8525N3675N1294O2445
13778A108479P8061R1491J05716J13181J25254J38392J53312J65132J86354K14721
13768B480093K63604L25205M24735N54865P01621Q59648J001833J069241J080409
13759H761254J037209R51961R10365R25845J030323J273521J699977K468460L825668
$$ y = [64153, 72010, 78176, 83171, 87611, 89152, 92551, 92020, 88967, 87645, 94454, 95789, 97666, 100369, 109288, 121048, 128254, 134655, 137395, 143101, 146656, 157119, 164355, 172782, 185662, 195727, 207941, 219261, 225573, 227617, 225475, 227275, 231267, 244257, 264092, 282677, 299363, 319802, 342390, 362406, 380484, 393470, 403199, 408275, 413588, 418062, 419618, 422929, 430856, 444890, 462354, 480742, 503179, 535810, 573935, 617178, 667509, 720721, 772972, 828687, 882540, 941065, 994740, 1046034, 1108479, 1186540, 1278031, 1383747, 1496928, 1622182, 1760574, 1913886, 2079018, 2265372, 2480093, 2743697, 3068902, 3493637, 4048502, 4750123, 5609771, 6611604, 7680845, 8761254, 9798463, 10750424, 11660789, 12586634, 13616957, 14890478, 16590455, 19058915, 22884583]
13750B2884583O320552J0806593J7286438K3437006K8360995K8618749K2439192
13743A60154108J3015031j071203j3286617k2451474k7363505k6398140k2550773
13736F0047427j6666666j1331813p600399n150960l576612k534437j843279j357394
13728I985867j043969q52367p56020p34348p19667p03683o54770n72988m81099
13719C466956l86651l08363k49755k12429j78191j45821j21146j03375r4572q6922
13709A579731r3226r3759r6264j00989r4188q2466o6816n6257m4010m0261k5415
13698G86080k4631k4818j6542j1141j7740k5103k0718k2917k9518l5047l4953
13687E22952l4199l2497k8061k1976j4931j3563j2324o238K147K618L681l141
$$ y = [22884583, 29205135, 40011728, 57298166, 80735172, 109096167, 137714916, 160154108, 173169139, 172097936, 158811319, 136359845, 108996340, 82598200, 60047427, 43380761, 32048948, 24448549, 19297589, 15720977, 13186540, 11343261, 9985867, 8941898, 8089531, 7333511, 6599163, 5879496, 5175813, 4521043, 3948055, 3466956, 3080305, 2771942, 2522187, 2309758, 2131567, 1985746, 1864600, 1761225, 1666653, 1579731, 1486505, 1392746, 1296482, 1195493, 1101305, 1018839, 952023, 895766, 851756, 811495, 786080, 761449, 736631, 720089, 708948, 691208, 666105, 645387, 622470, 592952, 557905, 522952, 488753, 456256, 428195, 406219, 391288, 377725, 365401, 359163, 361310, 363928, 367609, 364468]
13675C64468n370n685q586j4015j0082j1249j0806q251o198l945m662j650l99
13662B73570j795j166p153k402P37o099l560k659r89p38l422r343j0043q311j759
13647B14868m051j306Q6k179p459l038N941O211J509L411J702K699N808M745O052
13632B34999J261q23M036K788P16N50J418J696N797J5844K2270K8424L2642K9992
13618C81610J7184K435j1905l9988m8444n1557n0106l3655j9493j1908M030Q268
13606A46471Q07J960o544q569p598r636q540q508j0185j802L325K369Q65J149
13592I5564R737M857o143r110r466p370j3579q796p222l231p87K876M563L252
13578E5145p36k038m68K022N670M93j654o538l664k58l050l278r76P084R018K1313
$$ y = [364468, 359098, 353413, 344827, 330812, 320730, 309481, 298675, 290424, 284226, 280281, 275619, 273969, 273570, 271775, 270609, 263456, 261054, 261791, 255692, 252132, 249473, 248484, 247746, 244324, 234981, 224938, 216627, 214868, 210817, 209511, 209597, 207418, 199959, 196921, 202862, 209073, 210582, 213993, 215695, 218394, 224202, 228947, 234999, 236260, 235437, 239473, 242261, 242977, 243527, 244945, 246641, 252438, 268282, 290552, 318976, 351618, 381610, 398794, 401229, 389324, 349336, 300892, 249335, 199229, 165574, 146081, 134173, 138203, 146471, 147278, 149238, 142694, 134125, 126527, 116891, 108351, 99843, 89658, 87856, 91181, 93550, 94415, 95564, 105301, 110158, 104015, 94905, 85439, 78069, 64490, 55694, 48472, 45241, 44454, 47330, 51893, 55145, 54409, 52371, 51903, 53925, 59595, 60088, 58434, 51896, 48232, 47974, 44924, 41646, 40670, 47754, 56772, 78085]
13562G8085K1390P068q053r725p383j2227j2038j1662o309l103q859k498K113
13549B6799K228m33J507Q5K621M613K542K677N386P929P13l41n825m260m937l959
13533C7345m259m621o55j38j377j452k045m62o29k477k190O749N128K790J0628
13518D2335J4522J6964R864p165j4783r968j0147p08l58L090o89l924n506m498
13504B9029o401L64K438j202P82M573M372l23Q31M170J103P49L786O71p38j153
13488D3051q50o671l866j335K892K940L729N129P13k317j225j417J781J620M026
13473D8200k12n01J21k591o416J455J404m557k747j698m839m554m398l934m235
13458A0498l89K123N572O652O703J917j894n186k713l24l441p147l622J544L25
$$ y = [78085, 99475, 106543, 98490, 88765, 81382, 69155, 57117, 45455, 39146, 36043, 27184, 24686, 26799, 29027, 28594, 30101, 30186, 32807, 37420, 39962, 42639, 48025, 55954, 56667, 56326, 50501, 46241, 41304, 37345, 33086, 28465, 27810, 27672, 26295, 24843, 22798, 22336, 21707, 19230, 17040, 23789, 28917, 31707, 42335, 56857, 73821, 83685, 76520, 61737, 51769, 41622, 40914, 40556, 43646, 42957, 39033, 33527, 29029, 22628, 22992, 25430, 24228, 25010, 29583, 33955, 33632, 34463, 38633, 39736, 40485, 44271, 44942, 44204, 43051, 42201, 35530, 31664, 30329, 33221, 36161, 39890, 45019, 45732, 43415, 42190, 40773, 42554, 44174, 48200, 47988, 47487, 47608, 45017, 38601, 40056, 41460, 36903, 34156, 32458, 27619, 23065, 18667, 14733, 10498, 10109, 12232, 17804, 24456, 31159, 33076, 31182, 25996, 23283, 22959, 19518, 12371, 8749, 10293, 10618]
13443A0618l37k871J016O528O446r54O65l26k965N32K599M901J134j285J61M796
13427C0658k867l427l656m340l838j968j836O027J721M089K431k104l768m785
13413A2337L29O849K584j905o64n21n576k218K080M304N352L652k230o844j764
13398A5765j717L422K094L909K111o609q044P69K723J989m093j694K739m64k540
13383A0360K090M90Q55r66k522l542k946L29R46J020M921J068O012K026k56L32
13367B0217m6J162J454K279k673l482J157k38j025j791k929N96j56k166q63J28
13351A1624K946J467j707K47p98O214K699k687j677m46m724p45O532J481o84j17
13335A9625k790L267J447j151l437k058J703J626N458M55K090N14o87N66J598
$$ y = [10618, 10281, 7410, 8426, 14954, 21400, 20446, 21111, 20785, 17820, 18352, 20951, 25852, 26986, 25701, 25862, 30658, 27791, 24364, 20708, 16368, 12530, 10562, 8726, 14753, 16474, 20563, 22994, 20890, 17122, 12337, 12666, 19515, 22099, 20194, 19530, 19009, 13433, 11215, 13295, 17599, 22951, 26603, 24373, 17529, 15765, 14048, 17470, 19564, 23473, 25584, 18975, 10931, 11700, 14423, 16412, 12319, 10625, 13364, 12900, 10360, 12450, 12940, 13795, 12829, 10307, 6765, 3819, 4148, 5094, 6114, 11035, 12103, 18115, 20141, 19885, 20217, 20171, 21333, 22787, 25066, 22393, 18911, 20068, 19830, 18805, 17014, 14085, 14681, 14525, 12359, 11496, 11624, 14570, 16037, 14330, 14577, 13779, 19993, 22692, 20005, 18328, 17882, 13158, 12413, 18945, 20426, 19742, 19625, 16835, 20102, 21549, 20398, 16961, 14903, 16606, 18232, 23690, 24145, 26235, 26749, 26062, 26628, 28226]
13320B8226J303q79K897K770P99J402j600j394k491K564L809N425L336K161L810
13305E2138J420k847n6j943n99J758O400O420J5013K7262L9022J3831k7254k6230
13291A04335j3540o381j761j753L290N464O613O812R297L386P885P417O952J1334
13277A49350J6725K8827M7122O6602R3238J52421K82575N17998P13091K79821
13267B347770m39586n51567m03481k59127j50947p2767j4071M3394R1939J25363
13257G16920J34148J06698N7084j3328q1608j29991j51448j47000j27763r0590
13247B73122o1149m4820l2165k1023j1994o543m726p166r749m296m911m873n860
13234E3847m574q769o359m29j900l599q47k1J644n874M7J211K101M174K937L366
$$ y = [28226, 29529, 28650, 31547, 34317, 35116, 36518, 34918, 33524, 31033, 33597, 37406, 42831, 46167, 48328, 52138, 53558, 50711, 50655, 48712, 48113, 49871, 56271, 62691, 77704, 104966, 143988, 157819, 130565, 104335, 90795, 84414, 82653, 80900, 84190, 89654, 96267, 103079, 112376, 115762, 123647, 131064, 138016, 149350, 166075, 194902, 242024, 308626, 401864, 554285, 836860, 1354858, 2067949, 2347770, 1908184, 1356617, 953136, 694009, 543062, 470295, 456224, 499618, 591557, 716920, 851068, 957766, 1014850, 1001522, 919914, 789923, 638475, 491475, 363712, 273122, 211973, 167153, 134988, 113965, 101971, 95428, 90702, 83536, 73787, 69491, 64580, 59707, 53847, 49273, 40504, 34145, 33716, 31816, 28217, 27370, 27349, 28993, 23119, 23166, 24377, 26478, 30652, 33589, 36955]
13218C6955l497l962K723r24k376k365k601k087n69J726n68L971n75k576k377
13203B0898L787N019n64m418j28K984k185l51Q27j582l450k096j703n94J657P04
13187A8805K974K139l758j596M6Q52m269k775J107o64L245K607P896R427P547
13172D3583K457j349k289l056q748l878L49J310K785j144M84J635R27p207n026
13157B0833k216l238J709L522O943L851q07k573N09n979o632j152J736L781L980
13142B4267N676M499r23n012j792m408J558k363o09J638k939K324L300M544M553
13127C4313K300k778k439m194k781k523l281K474P41J146Q834J1026O487n990
13113D3335p309J811J22P241J491j271O52l450m142J038Q94j451l764n529o718
$$ y = [36955, 33458, 29496, 32219, 31295, 28919, 26554, 23953, 21866, 21297, 23023, 22455, 26426, 25851, 23275, 20898, 24685, 29704, 29140, 24722, 24594, 27578, 25393, 25042, 25869, 24287, 20837, 18741, 17038, 16444, 18101, 18805, 21779, 23918, 20160, 18564, 18610, 19462, 15193, 12418, 13525, 12861, 16106, 18713, 26609, 36036, 43583, 46040, 44691, 42402, 39346, 30598, 26720, 27069, 28379, 31164, 30020, 30504, 32139, 33066, 25859, 20833, 18617, 15379, 17088, 20610, 27553, 31404, 30597, 28024, 28533, 22554, 15922, 14770, 16506, 20287, 24267, 29943, 34442, 33519, 28507, 26715, 22307, 23865, 21502, 20893, 22531, 19592, 21916, 25216, 29760, 34313, 36613, 33835, 31396, 27202, 24421, 21898, 18617, 21091, 21832, 22978, 31812, 42838, 49325, 43335, 36026, 37837, 37959, 45200, 46691, 45420, 46072, 42622, 38480, 39518, 40412, 38961, 35197, 29668, 22950]
13098B2950o686q140o79M807K983Q417J0932J6283J0138k480l396m724m325j966
13084D4114n269m681K603k953l473r16K13L910O41j034j358k493n23K013M198
13069C4992R89J990N253K568K253J7997M7621P6178M5794J5337R611m2545m3810
13056A74228m5531l3184j2760n226k349m492n407o01j533K865q18l647l36R68
13042F2177Q27k942m439n734j84k966k606J374R855N620M542P188j675N81K703
13027G4321J590k221M773j991n628M474J0194L195l251n765m322n394q946j2203
13013D8826r995j268p771j2078r498M484J4938K4996J5713m620q007J161P811
13000F4692J5922K3398K2268L705j7958m368q526j9908j5708n074R325l534j1333
$$ y = [22950, 16264, 8124, 7445, 12252, 15235, 23652, 34584, 50867, 61005, 58525, 55129, 50405, 46080, 44114, 38845, 34164, 36767, 33814, 30341, 29425, 29638, 33548, 34189, 33155, 31797, 29304, 28781, 30794, 34992, 35981, 37971, 43224, 45792, 48045, 66042, 113663, 189841, 235635, 250972, 260583, 218038, 174228, 128697, 95513, 82753, 77527, 75178, 70686, 65279, 64678, 63145, 66010, 65192, 61545, 61209, 62177, 63004, 60062, 55623, 49889, 49705, 46739, 44133, 45507, 55362, 60982, 65524, 72712, 71037, 71618, 74321, 75911, 73690, 78463, 76472, 70844, 75318, 85512, 88707, 85456, 79691, 75369, 69975, 61029, 48826, 38831, 37563, 29792, 17714, 8216, 12700, 27638, 52634, 68347, 63727, 55720, 56881, 64692, 80614, 104012, 126280, 129985, 112027, 107659, 99133, 79225, 63517, 58443, 67768, 64234, 52901]
12987E2901L204K3273K4193K494r079L981Q682k272n967n562m676q846q286K805
12973G6845j444j207N528Q042J0618R453R886R170Q750J1640N921k4693m1407
12960H7102k7332k1690k4390J860K8689L1414K5601J4815K132k013j315l625j0173
12947A01075n859l586J08Q054J9807K9128L4549L5528K9139L1790M1843M9124
12935C70700J497j78080l04368j54505K9729O0323N0725M2563L0285K1203N732
12924b4196Q805l064q39Q782P959K028o81m817K913J2222J2261J6357K0702J2811
12910G1243J1587J0560J0279J1621P672M260J1080P124p08K176O102N732k07k822
12896A55699R93j374L756J8727K0581J8627J4889K202l144O827J8045K0159K0908
$$ y = [52901, 56105, 79378, 103571, 106065, 96986, 100967, 109649, 107377, 101410, 95848, 91172, 82326, 74040, 76845, 75401, 74194, 79722, 87764, 98382, 107835, 117721, 126891, 135641, 147281, 153202, 128509, 87102, 59770, 38080, 13690, 15550, 44239, 75653, 101254, 116069, 118201, 116188, 114873, 111248, 101075, 95216, 91630, 91738, 99792, 119599, 148727, 183276, 218804, 247943, 279733, 321576, 370700, 372197, 194117, -110251, -264756, -235027, -174704, -123979, -81416, -51131, -29928, -24196, -15391, -18455, -19294, -10512, -2553, -525, -1206, -6023, -3110, 9112, 21373, 37730, 58432, 71243, 82830, 93390, 103669, 115290, 122962, 127222, 138302, 145426, 144718, 146894, 152996, 158728, 158521, 155699, 156692, 155318, 159074, 177801, 198382, 217009, 231898, 234100, 230956, 237783, 255828, 275987, 296895]
12883B96895J7061K6568K0775J6318K1218K6072K3703K3877M4792Q3725P1095
12872F72099J39r300K5518L6730J5622L805J1193J1955J4049J4274K8457K3985
12860H48526P578Q504K9135M8469O8790P1161P2468R0765J40931J77525J91355
12849A755207K30751L11938M53410O72487Q27504L54924k95788l13493p9944J94862
12839D111858M06070N30989Q19217J393681K486910M720585P786895N922243k789826
12830B5388622o111701m532236k760832j334825l42894L28018Q11733J094165
12822A2540050J197257J359049J662959J982340J977169J441262J594008K569042
12814B6323136M146423O412872R869155J6052160K7969618N2069495R5492453
$$ y = [296895, 313956, 340524, 361299, 377617, 398835, 424907, 448610, 472487, 517279, 601004, 672099, 672238, 662938, 688456, 725186, 740808, 744613, 755806, 767761, 781810, 796084, 824541, 848526, 856104, 864608, 893743, 942212, 1011002, 1082163, 1154631, 1245396, 1386327, 1563852, 1755207, 1985958, 2297896, 2751306, 3423793, 4251297, 4606221, 4310433, 3996940, 3916996, 4111858, 4517928, 5048917, 5868134, 7261815, 9748725, 14469310, 22256205, 28178448, 25388622, 19276921, 14744685, 11983853, 10649028, 10306134, 10634152, 11445885, 12540050, 13737307, 15096356, 16759315, 18741655, 20718824, 22160086, 23754094, 26323136, 30469559, 36882431, 46751586, 62803746, 90773364, 142842859, 238335312]
12807B38335312J25101731M3150452p6596872r6271675p3227275m9951044l1826119
12800G8714510k0519115j3722119r640331p057222n070261l364446k326815k385791
12792A4628410k266769j854953j495978j131518q99177p27593n70713m86916m40780
12783D754013l73029l10589k58817k57417k87087k89950k63284k02154j44928
12774B366758j09615j00864j11581j03874j04850j27094j41281j23214p3690m3266
12764A327429l6149m6915l7084j6054j3542k8534l8293l1309k4496l5326m1831
12753I77896n8935o2532n1945l8093m3832m7979m3785l0602j6230j4759N633J5663
12741E90500R431L527J421j1965k4650l3329k8935j1308r118j5931j3451r5l449
$$ y = [238335312, 363437043, 406587495, 329990623, 233718948, 160491673, 110540629, 78714510, 58195395, 44473276, 34832945, 27775723, 22705462, 19341016, 17014201, 14628410, 12361641, 10506688, 9010710, 7879192, 6980015, 6252422, 5681709, 5194793, 4754013, 4380984, 4070395, 3811578, 3554161, 3267074, 2977124, 2713840, 2511686, 2366758, 2257143, 2156279, 2044698, 1940824, 1835974, 1708880, 1567599, 1444385, 1370695, 1327429, 1291280, 1244365, 1207281, 1191227, 1177685, 1149151, 1110858, 1079549, 1055053, 1019727, 977896, 918961, 856429, 804484, 766391, 722559, 674580, 630795, 600193, 583963, 569204, 574837, 590500, 599931, 603458, 604879, 592914, 568264, 534935, 506000, 494692, 485574, 469643, 456192, 456097, 452648]
12728D52648m650N10R1l521r443k1372p227L439O840R954j59j1785j2719r646
12714C92960j1356q461p526j1964m930q3O341O140j118m364j1519q473k189L665
12700C37123M954P806J0940R561R798J993j832O877J3962M000l953p946J467N324
12686D00074P465J3902L3849O1575J17921J62645Q8107j35803k84994j44593o5863
12675B54285l1571k1896j2917k052P019J6890J2148L944o476j0843k0045j8606
12663A69880j1783m077j2940j7814l068J1993J6186K2707J3735j20j121j4474
12651A69104l3870l5337j7686n447L988o42M544O72j938M922P016L133K25m28
12637I8256j27l04j0666j0686r184m642K538Q56n445m559R972K1708R225o030
$$ y = [452648, 447998, 448508, 448599, 445078, 435635, 414263, 407036, 410475, 417315, 427269, 427110, 415325, 402606, 392960, 381604, 373143, 365617, 353653, 348723, 348640, 354981, 361121, 360003, 355639, 344120, 335647, 333458, 337123, 342077, 349883, 360823, 370384, 380182, 382175, 380343, 387220, 401182, 405182, 401229, 393283, 394750, 400074, 407539, 421441, 455290, 516865, 634786, 797431, 885538, 749735, 464741, 320148, 254285, 222714, 200818, 187901, 185849, 192868, 209758, 221906, 225850, 219374, 208531, 188486, 169880, 158097, 154020, 141080, 123266, 120198, 132191, 148377, 171084, 184819, 184699, 183578, 169104, 135234, 99897, 82211, 76764, 80752, 80110, 84654, 85326, 83388, 88310, 95326, 98459, 98684, 98256, 98129, 97825, 87159, 76473, 67289, 62647, 65185, 66041, 60596, 56037, 66009, 87717, 96942, 90912]
12623I0912j69J0316j430j0199j2982m923k533k3217k4644k230R702R839P217
12610D5659R412J193n100P521J8206J2290P979P852J013r114j0822o491q163j4428
12596E7007r047o700o252j606j817L79k945l254k608L68L172M057O684M96R85
12581C8919K200K678P953R713K773k571j286p378o298J714J77k10J680L363j414
12566E2013o184O39k95N34N19k442J00P500O768J3121J2924K496l145l519o057
12551G4972j1188o539j374M441R291L755m370p554n851o3K808R23K91k932l133
12536E3477N69j936m481l620l447Q69J283J96O54n59m172p533p375j3472n449
12521E004R587J2393R001N013L684J681j143k252m34k240j0602o865J547Q95r46
$$ y = [90912, 90743, 101059, 99629, 89430, 76448, 71525, 68992, 45775, 21131, 18901, 28603, 38442, 45659, 55071, 56264, 51164, 58685, 76891, 89181, 97160, 105012, 106025, 96911, 86089, 79598, 71435, 57007, 47960, 41260, 35008, 33402, 31585, 31964, 29019, 25765, 23157, 23525, 26697, 30754, 37438, 37934, 38919, 41119, 43797, 51750, 61463, 64236, 61665, 60379, 53001, 46703, 48417, 48594, 48384, 50064, 53427, 52013, 45829, 46468, 46173, 46707, 47226, 44784, 44884, 52384, 59152, 72273, 85197, 87693, 84548, 81029, 74972, 63784, 57245, 55871, 60312, 69603, 73358, 68988, 61434, 55583, 55520, 58328, 59251, 59542, 56610, 53477, 54046, 52110, 47629, 44009, 40562, 41431, 42714, 42910, 43564, 43005, 38833, 31300, 23925, 10453, 5004, 14591, 26984, 35985, 40998, 44682, 46363, 45220, 42968, 42534, 40294, 29692, 22827, 24374, 25269, 24323]
12506B4323k147l957l856q58J441K029K208p91m128R86J0428P872j020l174m912
12491B4444j435O101K904j082k960p409O83M223M506J259l999k288N95R29P74
12476B7245k245l153QK655Q8K097O41k270M50Q60J7k304o429k381k256j356O129
12459A7796N758L645k26l701j862m38J429J50j515M98k194m634k843K67q45k70
12443A1015n268l188n424K58P339J0000L149K604p20L515N148N119r90K639l287
12428C1909o116j222J510L102k19N120K616p025n656m116k273K966J774J341K299
12413B6010J972o145n671k583M608L613O95L97M05L836K691j268j129O35K88k897
12397B5457k562J771m72n018L14K308J486Q69p86K075K318n13k851j95l109o88
$$ y = [24323, 22176, 18219, 14363, 13505, 14946, 16975, 19183, 18392, 14264, 15250, 25678, 33550, 32530, 29356, 24444, 23009, 29110, 32014, 30932, 27972, 20563, 21246, 25469, 29975, 31234, 27235, 24947, 25542, 26471, 27245, 25000, 21847, 21855, 24510, 24598, 26695, 27336, 25066, 25516, 26376, 26393, 24089, 17660, 15279, 13023, 11667, 17796, 23554, 27199, 26973, 23272, 21410, 20972, 22401, 22551, 21036, 21534, 19340, 14706, 11863, 12130, 11285, 11015, 5747, 2559, -2865, -2607, 4732, 14732, 17881, 20485, 19765, 23280, 28428, 33547, 32557, 35196, 31909, 25793, 24571, 26081, 29183, 28964, 34084, 36700, 29675, 24019, 19903, 17630, 20596, 22370, 23711, 26010, 27982, 21837, 16166, 13583, 18191, 21804, 22499, 22896, 23301, 27137, 29828, 28560, 27431, 28066, 28354, 25457, 22895, 24666, 24194, 19176, 19490, 21798, 23284, 24153, 23367, 25442, 27760, 27247, 24396, 24201, 21092, 20404]
12381B0404N312N543m60J334K758N200O732O610j863r048l0N220J618L816N143
12366E8289L129J3149J9819K6190L0478L355k6541k6258j3404p996q771N47J552
12353G3538P295P784R304J1115J4274P041l74P524R747J6648K8605N3931Q3424
12340C29856J46741K78223N18531P17731K76401m44621n48995m02595k69620j69055
12330D32597j10059p5023n4672l4913k6442j3356j0363j3830j2407p727q371o636
12318E8798m324j009m298n302m792j892l452l505j773j044m1k58J739J994l788
12303B7053m901m644O56K57J945L742K459k863m733l597K369J271k97K83N46J500
12287B1046k959J520L315j653o82L405n50j524p551n305Q91K284j441l455J965
$$ y = [20404, 25716, 31259, 30799, 32133, 34891, 40091, 46823, 53433, 51570, 42522, 42492, 47712, 49330, 53146, 58289, 61418, 74567, 94386, 120576, 151054, 154409, 127868, 101610, 88206, 80210, 71439, 71986, 73538, 80833, 88617, 97921, 109036, 123310, 130351, 129977, 137501, 147248, 163896, 192501, 246432, 329856, 476597, 754820, 1273351, 1991082, 2267483, 1822862, 1273867, 871272, 601652, 432597, 322538, 247515, 192843, 157930, 131488, 118132, 107769, 93939, 81532, 73805, 65434, 58798, 54474, 53465, 49167, 43865, 39073, 37181, 33729, 30224, 28451, 27407, 27366, 27108, 28847, 30841, 27053, 22152, 17508, 18164, 18421, 20366, 24108, 26567, 23704, 18971, 15374, 17743, 19014, 18717, 19000, 19546, 21046, 18087, 19607, 22922, 21269, 20587, 23992, 23442, 21918, 14367, 9062, 9953, 12237, 10796, 7341, 9306]
12272I306M256M160r91n39K925k029k532J042j774M075K452m36j021l854m252
12257A0788m495r56r02Q63M926M659l00j266J293O78j26L195J70r69N62m653m166
12240I301j46K700N636k227k560q79k910m427l742L354M991K972N79j918m194
12225F530j322j85J915q21J306N509r65l495k191L247M005k445K635K603p58k421
12209A3147j779J629K737j047l913j225N586K146j012k048J880l56l523j786L48
12194A0784L339J240N4M05j283k230K50J560J870K78n184j112n25J926j059m667
12178E646l492J137K033P718O3j60k754j790L022J049j094k512k658j212j04L411
12162H303O51j990l414l011O69O397K421j857k077k211j79j534M80K935k81J548
$$ y = [9306, 13562, 17722, 16731, 16192, 19117, 17088, 14556, 15598, 13824, 17899, 20351, 19915, 18894, 15040, 10788, 6293, 5337, 4435, 5298, 10224, 14883, 14583, 13317, 14610, 15288, 15162, 18357, 18527, 17558, 18120, 13467, 9301, 9155, 11855, 17491, 15264, 12704, 11825, 8915, 4488, 746, 4100, 9091, 12063, 12642, 10724, 6530, 5208, 5023, 6938, 6117, 7423, 12932, 11967, 8472, 6281, 9528, 13533, 11088, 13723, 16326, 15568, 13147, 11368, 12997, 15734, 14687, 10774, 9549, 15135, 17281, 16269, 14221, 16101, 15745, 12222, 10436, 10784, 14123, 15363, 15417, 15822, 14539, 12309, 12559, 14119, 15989, 16267, 11083, 9971, 9446, 11372, 10313, 5646, 2154, 3291, 5324, 13042, 13105, 12945, 10191, 8401, 11423, 12472, 11378, 8866, 6208, 4996, 4892, 8303, 8954, 6964, 3550, 539, 1208, 7605, 10026, 8169, 6092, 3881, 3702, 2168, 2648, 5583, 5302, 6850]
12146F850j887n167j552M388P732M014j804n329P96M7Q78J083j200k108J839M311
12130A2891M227j597j081j675K170l123n02j12M72J412L725K774j376m451k815
12115A0939j926k119j060j308N64m29K002k696q23J779K655J257K918m93R34k184
12099A0010k63m51L270J506j043j56n62l706k784J44K999J574J563r74M46j69
12083A1404k132j422J508J694k19M087J031p67m56l333k184n51k917j138N209
12068I814L656k437n273m04J230j287L420k35l694J330K103K552j029l337J159
12053G568L124j988m059J793J904M242k058j485K181m05l009m029j2K421k884
12038C304m331J900K439L665o02J554K304j749j388L170K71p85n358k292K25k10
$$ y = [6850, 4963, -204, -1756, 2632, 10364, 14378, 12574, 7245, 8041, 8088, 8966, 10049, 8849, 6741, 8580, 12891, 17118, 15521, 14440, 12765, 14935, 11812, 11310, 11198, 11670, 13082, 16807, 19581, 18205, 13754, 10939, 9013, 6894, 5834, 4526, 5090, 4661, 6663, 3967, 3144, 4923, 7578, 8835, 11753, 11260, 12194, 10010, 9747, 9296, 12566, 14072, 13029, 12873, 12311, 8605, 5821, 5965, 8964, 10538, 12101, 11127, 11573, 11404, 9272, 7850, 9358, 11052, 10833, 14920, 15951, 15184, 14728, 11395, 9211, 8660, 5743, 4605, 9814, 13470, 11033, 5760, 5356, 6586, 5299, 8719, 8484, 4790, 6120, 8223, 10775, 9746, 6409, 7568, 10692, 8704, 4645, 6438, 8342, 12584, 10526, 9041, 11222, 10817, 7808, 3779, 3767, 6188, 3304, -1027, 873, 3312, 6977, 6375, 7929, 10233, 8484, 7096, 10266, 10537, 9752, 4394, 2102, 2327, 2117]
12022B117k676m16K715K249L046P37n573J647J251j243k515L861K712j574L140
12007I478L99j207l674p97m45Q47J030l844m110K385K13N984L224q07K127K795
11991A3598m017n809m714j682L086K412L92k053j209J122M398lK844J610J711
11976A1686l081Q75L411o60q647m538P182N787K018k32m083j27n008m839L872
11961C616M624l398k988K805L952k094K6O44M192k992k758m890j819L880M31l789
11945e58J537J394O079L364J575k057k842J638J409M204m837j630K493l308n025
11930C436N17r74l220j390R8M42K139J737K677L744o15k247j229L290K396l661
11914G140k084r04J90K219J578j708J134j387l80l259m69J504L095N305L18j685
$$ y = [2117, -559, -975, 1740, 3989, 7035, 7772, 2199, 3846, 5097, 3854, 1339, 5200, 7912, 6338, 9478, 9877, 8670, 4996, 4199, 3754, 4601, 5631, 1787, -2323, 62, 275, 6259, 9483, 8676, 10803, 13598, 9581, 3772, -942, -2624, 462, 2874, 3266, 1213, 4, 1126, 5524, 5521, 8365, 9975, 11686, 8605, 9480, 12891, 12231, 3584, -954, 6228, 12015, 14033, 13801, 9718, 9591, 4583, -256, 3616, 8240, 4842, 1854, 4659, 8611, 6517, 6543, 7187, 11379, 8387, 5629, 739, -1080, 2800, 3231, -558, 979, 2373, 8452, 11816, 13391, 11334, 8492, 10130, 11539, 15743, 10906, 9276, 11769, 8461, 3436, 3953, 2979, -241, -1631, -1533, -1091, 1048, 2785, 5462, 9206, 8591, 6344, 5115, 8405, 10801, 7140, 5056, 4152, 4342, 6561, 8139, 6431, 7565, 6178, 5798, 2539, 2070, 3574, 6669, 11974, 12292, 10607]
11898A0607m311m889j550L151K540J757o354j139J873K053L430K837P75K137L63
11883A3280J409m766m08r63j515m137m468K898L400R329R477O951O237K233j775
11868C7182p909l906m525r497q793m314J15j810J495K241Q09L338L092k040l82
11853E096n0k871O11M922k291m227j051K302o81j027O34j810k195L8N432L509
11837F341N85j40p49q02N67J126M68n27J119j333K621K401j666o77k440j123p71
11820E000m40p07m672N7M591K794J13o360q95P3J438M347J105J868j614L0P42
11803G470l335l787j353J354M220l066j324O094L48m709o20J15n66n06J30m414
11787c949Q1J889J834P366P619m137m487k950n77K208k335n338k613J776O95P70
$$ y = [10607, 6296, 1407, -143, 3008, 5548, 7305, 951, -188, 1685, 3738, 7168, 10005, 10780, 12917, 13280, 14689, 9923, 9515, 8552, 7037, 2900, -1568, 1330, 4730, 14059, 23536, 30487, 36724, 38957, 37182, 29273, 25367, 20842, 11345, 2552, -1762, -1647, -3457, -1962, 279, 1088, 4426, 7518, 5478, 5096, 5046, 2175, 2786, 7708, 5417, 1190, 139, 2441, 1760, 733, 1367, -443, -2638, -2600, 2832, 6341, 6926, 6786, 6037, 5235, 5802, 6928, 7396, 6869, 7988, 6655, 9276, 11677, 10011, 9334, 6894, 5771, 5000, 4560, 3853, -819, -762, 3829, 6623, 6736, 376, -519, -446, 992, 5339, 6444, 8312, 6698, 6728, 7470, 4135, 348, -1005, 349, 4569, 1503, 179, 6273, 6621, 1912, 1292, 1407, 841, 335, 465, -3949, -3868, -1979, -145, 7221, 14840, 10703, 6216, 3266, 2689, 4897, 2562, -2776, -5389, -3613, -2918, -2148]
11771b148k617q89K876K190J096j196j931K519J541j197k286J723N574L69j515
11756D109k549k817R98J789l946q63L140J169n53j304K933k079L5L854K961j41
11740F736K209l869k977p79j770M71J625J229k448j29L208J019m16L9M047K489
11724A0684j575J749j95R07k629k697o30j723j995j361j950J55k220P8L465J275
11708A338j62p97J237K953j537J146p27k799j711J192J340k106l708J698m58j741
11692d842K630N718J554l257K704j217P79j810O49K659L115L07l118k407l865
11677d01l220O81M12J751J108L6k185J735J868K38J410J477J171m8m618K35p58
11660H92k439n65J605%j336l55j399O056O56p31L372J162L49l627l514J741J447
$$ y = [-2148, -4765, -5654, -2778, -588, 508, -688, -2619, -100, 1441, 244, -2042, -319, 5255, 5624, 4109, 1560, -1257, -259, 1530, -2416, -3279, -139, 1030, 477, -827, 2106, 27, 62, 3916, 6877, 6736, 8945, 5076, 2099, 1320, -450, 21, 1646, 2875, 427, 298, 3506, 4525, 4109, 4148, 8195, 10684, 9109, 10858, 10663, 11570, 8941, 6244, 5614, 3891, 1896, 535, -1415, -1260, -3480, -3402, 63, 1338, 1176, 379, 1616, 4569, 3032, 4178, 3451, 652, -1059, 133, 1473, -633, -4341, -2643, -3101, -4842, -2212, 3506, 5060, 1803, 4507, 3290, 4069, 2259, 2908, 5567, 8682, 8989, 5871, 3464, -401, -3621, -2940, -2528, -777, 331, 367, -1818, -83, 1785, 2023, 3433, 4910, 6081, 6033, 1415, 1650, 892, -1547, -2112, -507, -507, -1843, -2198, -3597, 2459, 3115, 2384, 5756, 6918, 7267, 3640, 126, 1867, 3314]
11643C314l308l09J368l752Q64M593K464j402j834J144L202k306j494k22k61n309
11627c248R8J183j423N422J662K552J592o32j047K178R93j934k410j953k511l814
11611c292j885M922J30j306J016M82O34J72N352K58m673K15J723j268J063j11
11595C432M428J823j513l041k130L351p94j67j209O78r81j663j775O94L398K975
11579G506J804j299l590o778l220j104M861N802J431N009j151l204k363J177j277
11564C604l26j256J002K275M14l262j617K77R17k698l26K140r07j121L064J796
11548C976J512J653j668J31Ok691N23k815j75M48R44K809j13J803j780J88j546
11531C205J254L755j231p586l410o94M507N174j541l256l130J887L290O77K89
$$ y = [3314, 6, -303, 1065, -2687, -1823, 2770, 5234, 3832, 1998, 3142, 6344, 4038, 2544, 2322, 2061, -3248, -3150, -1967, -3390, 2032, 3694, 6246, 7838, 7206, 6159, 8337, 9330, 7396, 4986, 3033, 522, -3292, -5177, -255, -125, -1431, -415, 67, 701, 873, 6225, 6483, 1810, 2025, 3748, 2480, 3543, 3432, 7860, 9683, 8170, 5129, 2999, 6350, 5556, 5389, 4180, 4858, 3877, 2214, 439, 1133, 4531, 7506, 9310, 8011, 4421, -2357, -5577, -6681, -1820, 3982, 5413, 10422, 9271, 6067, 3704, 4881, 3604, 3278, 2022, 3024, 5299, 5713, 2451, 834, 1111, 2028, -670, -996, 1144, 237, -884, 2180, 3976, 5488, 7141, 5473, 5604, 5610, 2919, 3442, 627, 452, 900, 1844, 4653, 4540, 6343, 4563, 4751, 3205, 4459, 8214, 6983, -603, -4013, -4707, -200, 4974, 3433, 177, -2953, -1066, 2224, 2901, 3190]
11516C190k439k496j316J180M325J471l069J00l334P29M357K935k261j5r47m277
11500a867n79L011M055l156j521L008j498k394r34Q99J73m98j021J116l646k642
11484g494M265k75l231n39L950N275j168j064k33O442N601j760k991l203J260
11469D835k99j519q06l537p520j94N016j014J074p39K212M192n03J754L492L702
11453A0146k468l041J285J575j268j417k599J919J739J62L2J99L42k752j874m871
11437b891J57J973j234j695k466J299L749K195K025J11j946j705l55MK01N354
11421D776J801o879n415L959o37J52L331P33l067K23K417j512l938K5M63L986
11405D18K693P70K355l022K295O643k924k082J298l38l687r43p64J914q5r54m098
$$ y = [3190, 751, -1745, -3061, -1881, 2444, 3915, 846, 946, -2388, -1659, 2698, 5633, 3372, 3357, 2410, -1867, -2446, 565, 4620, 1464, -57, 2951, 1453, -941, -1875, -976, -803, -1301, -2322, -1206, -4852, -7494, -3229, -3504, -6735, -7274, -3324, 1951, 783, -281, -514, 5928, 11529, 9769, 6778, 3575, 4835, 4536, 3017, 2211, -1326, -8846, -9040, -4024, -5038, -3964, -4703, -2491, 1701, 1198, 2952, 6444, 10146, 7678, 4637, 5922, 7497, 6229, 4812, 2213, 4132, 5871, 6033, 6065, 6264, 6606, 3854, 1980, -2891, -2734, -761, -1995, -3690, -6156, -4857, -1108, 1087, 3112, 3223, 1277, -428, -783, -779, -578, 4776, 6577, -302, -5717, -1758, -2395, -2243, 1088, 1821, -1246, -1023, 1394, -118, -4056, -4031, -3568, 418, 3111, 3881, 6236, 3214, 5509, 12152, 9228, 7146, 8444, 8106, 4419, 3476, 2712, 4626, 4541, 3587, -511]
11388e11j570K397K17j275k249p4K615K585j934j988O32k306L27N13J371o77R64
11371i63J21j689J99L543l41o273K310j75O36j642L249L405J6k452K085K489J0
11354D528j991J682k770o98M04p2O133j043m702R68j73k240l729j318R71Q131
11338D081P934L688k179o765m668k712J221k109k519L162K49O25l12J495J946
11323C137j787j205m348l930K099j308J960N160N416j46j311l376k77L869K498
11308F451j225O23m181l153K297J774k413K303j129j020N18M91l515J762j07J598
11292A074l484j956m56j580R64M270M610P77j560j159J801NJ196k227n072l216
11276f013J725j143J149P98Q496N377m072l912L95j742p70M86q09j234K193K261
$$ y = [-511, -2081, 316, 533, -742, -2991, -3065, -450, 2135, 201, -1787, -1155, -3461, -3134, -2621, -1250, -1927, -963, -842, -2531, -2332, 1211, 870, -5403, -3093, -3268, -2632, -4274, -1025, 2380, 2396, -56, 2029, 4518, 4528, 2537, 4219, 1449, 751, 1155, 1083, 7216, 6173, 1471, 2439, 2266, 26, -3703, -5021, -4050, 4081, 12015, 15703, 13524, 6759, 2091, -621, 600, -1509, -4028, -866, -617, 8, -304, 1191, 3137, 1350, 145, -4203, -8133, -6034, -7342, -5382, -222, 5194, 5048, 3737, 361, 84, 3953, 6451, 5226, 5849, 1668, -1485, 812, 2586, 173, 2476, 1347, 327, 845, 1336, -2179, -417, -524, 1074, -2410, -4366, -4822, -6402, -5438, -1168, 3442, 4219, 2659, 1500, 3301, 3306, 4502, 2275, -2797, -6013, -4288, -5431, -4282, -3484, 5012, 10389, 6317, 2405, 2800, 1058, 288, 774, -35, -1269, 924, 3185]
11260C185k228j010J619j711l16K483k870l06J659K82J768j658K107K552m860
11245F96j817K639j078k734k563j983J0422M776k076j160j241n797k067J144J957
11230h82J137m03L999p00o080k158N842L921K867k719l915j015O49m55p19J884
11214A253l115l277J133J006N39l30O09J235q86j538J245L201P75R29j88K756
11198E347m75M18O4J0k94j483N76J622Ql640J162k445n933p01K204J258m91J076
11180a717J705J717J480K8k378J957R29j165M56n8j618K950Q91k746m038K393
11164G86O04l027j278mL604K140j647J814j679j422M854j789n001k310m48M352
11148d51R80n91j153m362J240L410J558M274r34k097j183l312O84J196M23m262
$$ y = [3185, 957, -53, 1566, -145, -461, 2022, -848, -1154, 505, 787, 2555, 897, 3004, 5556, 696, -1121, 1518, 440, -2294, -4857, -6840, 3582, 8358, 6282, 5122, 3881, -1916, -3983, -2839, -882, 255, -148, 3851, 3151, -2929, -5087, 755, 4676, 7543, 4824, 909, -106, 543, 88, -631, 1253, -1862, -5139, -4006, -3000, -2461, -2791, -2182, -947, -1833, -3371, -2126, 1075, 1850, 2779, 2591, 5347, 4872, 5290, 5354, 5364, 5070, 3587, 4163, 5785, 5793, 2153, 3315, 870, -5063, -5764, -3560, -2302, -2793, -1717, -12, 1705, 3185, 3213, 835, 2792, 3721, 2556, 3012, 2954, 1336, 4286, 5177, 2431, -1607, 786, 1390, -1637, -2915, -2919, 685, 2825, 1178, 2992, 1313, -109, 4745, 2956, -2045, -4355, -4803, -451, 529, -62, -1215, -5577, -4337, -927, 631, 4905, 3971, 1874, 691, -2621, -1937, -741, -318, -4580]
11132d580J368J332L823M50l038K45L587L754R00j728R83K021J461p169o360k1
11116b972J024m47q73L542p37J445m65J998L48r1l279n769o64M497J085K225J859
11099B726k819l106L353J093M01Q97l539j174j760J077J003l798k726J901K243
11084d228L523L508k052n36l526P85K49n66K640M463P620J823k498n622k81j762
11068C540l052j914j677L381N51N94O30k628n747K47J855o9L716m17K864L596
11052E470j486l269O14L022K444L770l656k161j108o61k486j453k103J02j646
11037d607J200O216M175o93k555j125n01k979l650J42N91J51J394K771r93q5k17
11020g65J71j364j71M498J059J673j690j171Q49J78M48j829k360k196J586k683
$$ y = [-4580, -3212, -1880, 1943, 2393, -645, -400, 3187, 6941, 7841, 6113, 7096, 9117, 10578, 3409, -2951, -2972, -1948, -2395, -3268, 274, -463, 982, 517, 2515, 2863, 2772, -507, -6276, -6940, -2443, -1358, 867, 2726, -93, -3199, 154, 1247, 1648, 2545, -994, -2168, -3928, -2851, -1848, -5646, -8372, -6471, -4228, -705, 2803, 751, 215, -3311, -2526, -2277, -2843, -203, 4260, 11880, 13703, 11205, 5583, 5302, 3540, 488, -1426, -3103, 278, 829, 1423, 2053, -575, -6322, -6075, -4220, -4289, -573, -990, 1874, 5470, 3984, 715, 1329, 4351, 6795, 10565, 6909, 4748, 3640, 2979, 493, -960, -3063, -2961, -4607, -3407, 2809, 6984, 6291, 3736, 2611, 2110, -869, -4519, -4377, -3786, -3635, -2241, 530, -463, -548, -765, -594, -1958, -2129, 2369, 3428, 5101, 3411, 2240, 3089, 3267, 3715, 1886, -474, -2670, -1084, -3767]
11004c767L43n57J770J203N6n71K176J625K05l569m034L123O736L788k807j616
10988D104M40k354p49j165l611k469K314L329J667K349O60J66M315k611n551n25
10972C09J168q01j240J080K060q93j928j665J082J787J468N152K039k344k728
10957D546j069m418j571j628j535j413J639P612j29k113J01J762L678j201Q57
10942E118N641q1j1290m607j309l649R97n778q00J784L840Q68N35j008J740K269
10926e730N241L716l0k5j660j94J495q84K864L352l342p227k565J174j436N05
10910d746L53J672L459J924qK426K74k70n48o213j864r17P8Q34P135K205o42j039
10892D113kp98m756Q73K385K144K16J86k034j33R38j450K154j199m539J009p13
$$ y = [-3767, -3424, -3981, -2211, -1008, -952, -1523, 653, 2278, 2483, -1086, -5120, -1997, 4739, 8527, 5720, 4104, 4544, 2190, 1441, 276, -3335, -5804, -3490, -161, 1506, 3855, 4515, 4681, 8996, 6385, 834, 309, 1477, 676, -564, 516, 2576, 1683, -245, -1910, -828, 959, 2427, 7579, 9618, 7274, 4546, 3477, -941, -2512, -4140, -5675, -7088, -5449, 2163, 2034, -79, 22, 1784, 5462, 4261, 5118, 10759, 10678, -612, -5219, -6528, -10177, -9180, -14958, -15758, -13974, -10134, -9266, -8731, -9739, -7999, -5730, -489, 3227, 3197, 3172, 1512, 1318, 2813, 1929, 4793, 8145, 4803, -2424, -4989, -3815, -5251, -4746, -4393, -2721, 738, 2662, 2654, 5080, 5354, 5084, 4536, -1677, -3541, -4458, -4380, -3546, 3589, 5794, 5152, 4113, 4111, 3313, -1443, -570, 1815, 3959, 4175, 4361, 2327, 2194, 3132, 1682, 3836, 2637, -1902, -893, -1606]
10875a606K231J622Q78k436o33l45M529k323L93j54P8l269j689R69p30J391q75
10858a969m644j87J292j022q22J301M233O82j600j237l536o92K157K975N29j420
10842c960K944K175K60o65k322K661K925k664Q7k54k390L050j53m952j05J596
10826a767J793J711k117j942l364K357K253n36k775J867K23K207L517k58j619
10811A550n021N96K276j211J008R4Q60L217K246m448J60J802m218n596L165K114
10795a406M653K489K7q50m434K062K103l864k590O28L20J323O553O921M286j583
10779A6638j022l935m603q63k361k912j792n01r80M790K736j163l102J428j729
10764F29j800j298K818k334j965q30l900L636N467L554n09l410j662M875P89k252
$$ y = [-1606, 625, 2247, 3125, 689, 56, -289, 4240, 1917, 2310, 2156, 2234, -1035, -2724, -1755, -2485, -1094, -1969, -6613, -6800, -5508, -6530, -7352, -6051, -1818, -1136, -2736, -3973, -7509, -8201, -6044, -3069, -2540, -3960, -1016, 1159, 1419, 754, -1568, 1093, 4018, 1354, 1441, 1187, -1203, 1847, 1694, -3258, -3363, -1767, 26, 1737, -380, -2322, -5686, -3329, -1076, -1612, -4387, -2520, -2297, -90, 3427, 3169, 1550, -3471, -2875, -599, -1810, -802, -708, 152, 3369, 5615, 1167, 1327, 3129, -1089, -6685, -3520, -1406, 3247, 5736, 5763, 4913, 479, 2541, 4644, 780, -1810, -1182, -862, 461, 7014, 13935, 18221, 16638, 15616, 11681, 7078, 6215, 3854, 942, -850, -1351, -2331, 2459, 5195, 4032, 930, 2358, 629, -1171, -2469, 349, -1985, -3950, -4780, -8680, -5044, 423, 3977, 3468, 58, -1604, 3271, 4060, 1808]
10748A808N35J209R4P80L319o29l122l460k367K162j45m30O17l24Q34M555M187
10731I623l903j401K883j792j780j255K02k349m269J371J1O62L380J755L317j93
10715F262j794l078q25L067p19p48k770J272K44j513l589K406O4j041N769L064
10699F071k723j157J744M053L389N65k309l187J56m988k104L83j994N494K303
10684E696k372J207j621l135r30p56j735J737L69Q76j351K580l083k090L020L218
10668A630l06k886J144l064k059K795m91j001J227R24j171J274P406N545j714
10653I253R0m103m286M096L195J975j293k362m378j208O10q09m73k466j463j43
10637c765P3L44J614r44j927P55N147K089j623J2o05j534n502l99L505j654J166
$$ y = [1808, 2343, 3552, 3646, 4426, 7745, 7116, 3994, 534, -1833, 329, 184, -246, 371, 47, 881, 5436, 9623, 5720, 4319, 7202, 5410, 3630, 2375, 2577, 228, -4041, -2670, -2659, -1997, 1383, 3138, 6455, 6262, 4468, 1390, 565, 3632, 2913, 2165, -605, 667, 911, -602, -4191, -1785, -1721, -2762, 3007, 6071, 3348, 2191, 3935, 7988, 11377, 11942, 9633, 6446, 6602, 1614, -490, -107, -2101, 3393, 5696, 3324, 4531, 2910, -225, -1155, -1911, -3646, -1909, -1540, -664, -2015, 565, -2518, -4608, -1588, 1630, 1324, -1562, -418, -3482, -5541, -2746, -3237, -4238, -3011, -2087, -3258, -1984, 5422, 10967, 9253, 9343, 5240, 954, 5050, 8245, 10220, 8927, 6565, 2187, 979, 1589, 780, 307, -2159, -3622, -3765, -3692, -3348, -1734, -2678, -4605, -3850, 1297, 3386, 1763, 1775, 1170, -364, -5866, -6265, -2760, -4414, -3248]
10620c248L389J383k734m413L688M642j84l13k774j943J73r74m639J063j059J496
10604f447K241k850m598N44N239l76O72K857J440n559L230L743j435R92J775j250
10588B18j658K91J665l904J793J834K336K510l044J39J002j505k7j684l802J762
10572b074R22J642J183j351k540O359M92m34K402J507K09j461n413l540J774K552
10556B229j225J011L463l705m36K5M19o15k818l87L300Q36J235M5j950j370j671
10539a614q13J118L744J692K042M60l152j847J841K889L074K708n994m339K895
10524D704L1M42N5n925J567J31j119q00K760M170O92m06l380l514m21N86J726
10507A299J398J196J38l252q9k707j967M289K919l99j6l364o427J691K691M01
$$ y = [-3248, 141, 1524, -1210, -5623, -1935, 2707, 2523, 2210, -564, -2507, -2334, -3308, -7947, -6884, -7943, -6447, -4206, -7056, -11654, -11110, -5871, -6247, -5575, -2718, -1278, -6837, -3607, 136, -1299, -307, 1468, 218, -1440, -1149, 516, -3388, -1595, 239, 2575, 5085, 2041, 2180, 3182, 1677, 1650, -34, -3836, -2074, -1152, 490, 1673, 322, -2218, 4141, 4633, 4199, 6601, 8108, 8317, 6856, 1443, -2097, -323, 2229, 1004, 2015, 5478, 1773, 1337, 1362, 1781, 1166, -1652, -2039, 1261, 2097, 3332, 3377, 1427, 57, -1614, -2427, -1309, 2435, 4127, 6169, 6629, 3477, 1630, 3471, 6360, 9434, 12142, 6148, 1809, 4704, 4735, 5177, 5232, -693, 874, 1005, -114, -914, 1846, 6016, 6708, 6302, 2922, -592, -1013, -427, 1299, 2697, 3893, 4031, 779, 690, -2017, -3984, 305, 3224, 2825, 2809, -555, -6982, -5291, -2600, -2199]
10491b199N128J141n644K0N219J181l179l050m129K9L632L429r31K187K487K11
10475E532n243m197M14J488K184M702k866k578q3K693N277k227K54j467K954J053
10459G890J144k035n155l17K565K059j32k393J730K407O71l245j909J380r65k785
10443I10k829r1q56l069K997M747j985m731L60L437J727j269j173j387L176P126
10427G090M760or19l496m151m033m044J23j114M039K564l19K20k46J595J204l001
10410B66n552L673N678L792K364L475J005j033J283K574l573m487n210K192q10
10395E637n52K750k459r42K569l91j282K804J616l168J817M782j503N54O04j759
10379A1077J221j324k036j967j052m05l978j992K291K514l532j168N32k702O07
$$ y = [-2199, 2929, 4070, -1574, -1554, 3665, 4846, 1667, -1383, -5512, -5483, -1851, 1578, 647, 2834, 5321, 5532, 289, -3908, -3494, -2006, 178, 4880, 2014, -564, -647, 2046, 7323, 5096, 5350, 3883, 6837, 7890, 9034, 6999, 1844, 1527, 4092, 6151, 6019, 3626, 5356, 7763, 8434, 5189, 3280, 4660, 3695, 910, -1919, -2010, -2866, -5935, -2938, 1809, -176, -4907, -4547, -1110, 617, -652, -1825, -3212, -36, 7090, 11850, 11844, 10925, 7429, 3278, -755, -4799, -4676, -5790, -1751, 813, 494, 714, 468, 2063, 3267, 266, -5286, -1613, 4065, 7857, 10221, 13696, 14701, 13668, 14951, 17525, 13952, 9465, 4255, 6447, 5637, 5085, 7835, 5376, 4434, 7003, 6612, 5330, 8134, 9750, 6582, 8399, 13181, 11678, 12232, 12836, 11077, 12298, 10974, 8938, 6971, 5919, 5514, 1536, -456, 1835, 4349, 817, -351, 181, -2521, -1914]
10364a914O026M746rj764k330k074J221j679j990k3j417R04l526K793J366k925
10348b595j104O74L898k115K94M632M247m455r42m76M901q9l906j742k845J589
10332c4J064J372J861K907l90m389J067N53j527j114k732L511J449J250J262j620
10316D490k859J091K39N52j728J336J327P65l703m222j612n95L880L320J940k476
10300A745J64K22Q7o43j447k039k134M335J31n282j610M28m798L034K792l37J474
10283c878K444r92M98J90j74N56j596J716J694R90N99L687p73j393j428k147N62
10266E55L783L983j884l246n643L93J50L788O58m010J535J491K232m546q03L464
10250A900L531k438n496L013J841L74j16m794K67P088K717k19m119l520k419j487
$$ y = [-1914, 4112, 8858, 8849, 7085, 4755, 2681, 3902, 2223, 233, 210, -1207, -303, -3829, -1036, 330, -2595, -3699, -3025, 873, -1242, -948, 3684, 7931, 3476, 2534, 2058, 6959, 6870, 2964, 1222, -1623, -34, 1030, 2402, 4263, 7170, 6780, 2391, 3458, 4011, 2484, 1370, -1362, 2149, 3598, 4848, 6110, 4490, 1631, 2722, 2961, 3513, 1785, 3121, 4448, 5213, 1510, -2712, -4324, -4919, -1039, 2281, 4221, 1745, 1909, 2131, 2218, 1575, 128, -1911, -4045, 290, 421, -4861, -6471, -6043, -10841, -7807, -5015, -5352, -3878, -1434, -2426, -1928, -1738, -1912, -1356, -2952, -1236, 458, 1448, 2047, 5734, 4961, 3568, 2140, -7, 555, 4338, 8321, 6437, 3191, -2452, -2059, -1909, 1879, 2537, -1473, 62, 1553, 3785, -761, -1564, 1900, 5431, 2993, -2503, 510, 2351, 2725, 2609, -2185, -1918, 5170, 7887, 7668, 3549, 29, -2390, -3877]
10234c877J199m45n98p15K453K997L74k534J728J504l976n83J544j045m735p71
10218g480P02R25J562j9p18K461j3l584R83L432L759q68j189l270K56l19K125
10201a255K848l860J670N5R62j389j903o81K247m62j6j146N068K566j844R58l062
10184G56l588n89L507o34l84q37r06J066K816j536j930m59K158M387J06J596p82
10167D747j052q5k495k309J740M841n066r54k978j109J82J374L652K776k831J60
10151E93L966K299L39k363k975k441K127N454k272k81R4j640N2R70o09j128k059
10134A26q05L085M29o664j960K675K591J039k324j96N721K158m049k58K131n66
10118C133Q41p48j543j597K993M18n047P47M352O31k733p90k289n595q39M754
$$ y = [-3877, -2678, -3123, -3721, -4436, -1983, 1014, 1388, -1146, 582, 2086, -1890, -2473, -929, -1974, -6709, -7480, -6778, -5853, -4291, -4310, -5028, -2567, -2580, -6164, -5181, -1749, 2010, 1142, -47, -3317, -3061, -3380, -1255, 1593, -2267, -597, -542, 420, -969, -2872, -3553, -1306, -1768, -1784, -2930, 2138, 4704, 2860, 3818, 756, -2832, -3421, 86, -548, -932, -1769, -2675, -1609, 1207, -329, -2259, -2718, -560, 3827, 3933, 5529, 4747, 3695, 3610, 1115, -1194, 546, 5387, 321, -633, -3611, -4720, -4538, -3164, 488, 3264, 433, 593, 4559, 6858, 7197, 4834, 1859, -582, 1545, 6999, 4727, 4446, 4540, 2900, 2952, 3922, 3313, 2185, 126, -679, 2406, 2835, -3829, -5789, -3114, -523, 516, -1808, -2004, 3717, 5875, 1826, 1568, 3699, 3133, 3974, 3226, 1683, 86, 3079, 3497, -1550, -803, 3549, 4180, 1447, 657, -1632, -7227, -8066, -3312]
10102c312J361N093J818l066j816J279J405j044j689j833k664K29j035K966L060
10087G52J460o12k096k94M08L620Q40j647R45j007m940j851L348p85j516o81M938
10070H82M313j451l497l103J889J080n848N97k29K029j312J174N950R97M27k741
10054A157l078Q54K675K354O42j434K642k310l700k984j090j591%J531O20m21
10038d133J00K810L246L307m069p07J338J60O92m110j017L744M8k069l689l324
10022g673R20j062L324K004r4m93J851Q81m125p95J715J623K301j639m97M643
10006B884J225l845K351p01l799j073L302K463j474j509K608l62O38J797k184
9991B321l428j581j281J205J94K351O910o98l598J265k136j893J700q30q09J05
$$ y = [-3312, -1951, 3142, 4960, 1894, 78, 1357, 2762, 1718, 29, -1804, -4468, -4239, -5274, -2308, 752, 2212, 1600, -496, -790, -382, 3238, 4078, 2431, 3376, 2369, -2571, -4422, -1074, -1859, -3375, -4056, 882, 5195, 3744, 247, -2856, -967, 113, -5735, -5138, -5367, -3338, -4650, -3476, 2474, 3471, 3898, 1157, -1921, -1067, 1608, 3962, 4604, 3170, 5812, 3502, -198, -3182, -4272, -5863, -5863, -4332, -3712, -4133, -4033, -1223, 2023, 5330, 1261, 554, 1892, 2052, 2744, -1366, -2383, 1361, 1409, -660, -4349, -7673, -6753, -7815, -4491, -2487, -2581, -3074, -1223, -342, -4467, -5262, -3547, -1924, 377, -1262, -1759, 2884, 4109, 264, 2615, 1914, -1885, -2958, 344, 2807, 1333, -176, 2432, 2070, 2708, 4505, 2321, -1107, -2688, -3969, -2764, -2570, -219, 6691, 5993, 2395, 3660, 1524, -369, 1331, 501, -308, -203]
9975b03K250p35N91j309l665K41k162K243O68P38K548k919J115j876J236J921
9959F82j286k996J973K544k84m218J16l320l719k836L450M633K670J60O07k502
9943d326L185K197j811O30L785K782k018L607j972k265K926J348l78k051k788
9928B851L43N15P18k78m688O67K859L92o9k93k121j097K632K434p70N82j134l438
9910A05k322K163l040j028K579R64l354l095L339M602J900L57l670j002K282K003
9894B783j694k853k34L897o63k880l114J052J92j385L475L652Q6j263j98L60k159
9877i46J898k073M00J161J415N62O18k426L201J063K886P04j252l393L21L318
9861G457p68j266l305k704j342J0J42K471J937j305l377K22j683J112N65O016
$$ y = [-203, 2047, 1312, 1903, 594, -3071, -2830, -4992, -2749, -2081, -1343, 1205, -1714, -599, -2475, -1239, 682, -604, -3600, -1627, 917, 633, -3585, -3469, -6789, -10508, -13344, -9894, -5261, -2591, -2431, -1824, -4326, -1141, 1056, -755, -125, 3660, 6442, 4424, 8031, 6059, 3794, 6720, 8068, 7690, 5639, 2851, 3194, 3709, 4427, 4149, -539, 128, 2987, 3379, 3310, 3017, 896, -201, 2431, 4865, 4095, 4677, 3543, 105, -2217, -54, -3094, -4122, -1543, -579, -3933, -7028, -3689, 913, 2813, 3170, -500, -1502, 780, 2783, 1089, -1764, -1998, 1899, 1236, -1644, -4758, -3706, -3514, -4899, -1424, 2228, 2314, 1051, 853, 1213, -946, 952, -1121, -721, 440, 1855, 2417, 3035, 609, 3810, 4873, 7759, 8463, 7211, 3818, 4139, 7457, 6689, 5423, 2118, -586, -1928, -1918, -1776, 695, 2632, 1327, -2050, -1828, -3511, -2399, -1834, 4182]
9845D182N292k502l572R01n298j230L329k501K91J949Q95k123j004j757k273K044
9829c377L621K733M063L786M72n631k494O87m48k956k798N456O854n37l468K80
9813F243k383J032m76k131J902J292R74j324m741q41J572O64q44k3m93J066l332
9796a843n161L622n12J572k105m944J713K799K436M456M52l246P3N24J003M426
9780E265J424l98R04l30K02N19j537r63k547m435m404K645M878k551l248K553
9764b023L39l637R45P956L120k605M17j776K827J835m420n726k690J990K870O47
9748F9K488N479l417m462k354j110j008k915M889M180j275K612L414K461o158
9733B893j269J75J898K143l555m559J561K134J463Q36J718l261k143L459l083
$$ y = [4182, 9474, 6972, 3400, 4301, -997, -2227, 1102, -1399, -1108, 841, 1736, -387, -1391, -3148, -5421, -3377, 244, 2977, 7040, 10826, 11298, 5667, 3173, 3860, 3412, 456, -2342, 3114, 9968, 9431, 5963, 6243, 3860, 4892, 4416, 2285, 4187, 5479, 6453, 5129, 388, -453, 1119, 1783, 939, 916, 423, 1489, -1843, -7004, -3382, -3894, -2322, -4427, -9371, -7658, -4859, -2423, 2033, 2485, -761, -688, -164, 839, 5265, 6689, 6291, 7195, 6865, 7067, 7586, 6049, 5086, 2539, -1896, -6300, -3655, 1223, -1328, -4576, -2023, -1684, -5321, -4376, 3580, 6700, 4095, 4512, 2736, 5563, 7398, 2978, -2748, -5438, -3448, -578, 69, 2557, 8036, 4619, 157, -2197, -3307, -4315, -7230, -2341, 1839, 564, 3176, 6590, 9051, 2893, 1624, 1799, 3697, 5840, 2285, -2274, -713, 1421, 2884, 3720, 5438, 2177, 34, 3493, 410]
9718D10K831K318q11j304Q48J374Q13O94J266M99j967j821l109J41l87n395l794
9701g394J195N040M01l43k893j99j121L254M050l715q79l46o07J170j41J250J561
9684B83j015l7J320j1l404J090K214J341J786k071M870L604m016n087j88O04p39
9667E44r24J926J395n356K073P183m125m242J552J363j706J46k33P05k03N51n7
9650E92k671L825M487P3k064k758l30j021n0j33L729M02j184k830M256J011Q03
9633F137J399J693m696l946j100j099L14m62L626J763k467J409K461j110N50p02
9617C770k298K732L470J922O439L543n216r671m991L36M445L280j535p80J876
9602G322m80j49Q33K339p13j623k062j590K568j185J12n764m828J459M586K863
$$ y = [410, 3241, 5559, 4748, 3444, 4292, 5666, 6479, 7173, 8439, 8938, 6971, 5150, 2041, 2182, 1795, -3600, -7394, -6199, -1159, -758, -1101, -3994, -4193, -5314, -2060, 1990, -1725, -2604, -2950, -3557, -2387, -2528, -1278, 283, -732, -769, 551, 540, -2864, -1774, 440, 1781, 3567, 1496, 6366, 9970, 5954, 867, 679, 1283, 544, -380, 1546, 2941, -2415, -342, 6841, 2716, -1526, 26, 1389, -317, -171, -404, 301, 98, 649, 592, -2079, 1746, 6233, 6306, 4242, 1484, 1154, 133, 83, -50, 3679, 4081, 2897, 67, 4323, 5334, 6137, 7536, 9229, 4533, 587, -513, -1612, -1298, -1760, 1866, 3629, 1162, 2571, 5032, 3922, 4472, 3770, 1472, 4204, 7674, 9596, 16035, 19578, 14362, 4691, -300, 36, 4481, 7761, 6226, 5446, 7322, 6842, 6693, 7526, 9865, 9152, 7529, 5467, 3877, 6445, 5260, 5372, -392, -5220, -3761, 825, 3688]
9586C688L612q07j815K544j746O69p70j604J907n92K178k238k731o8j770J092
9570A549n35P57K598r77j82L60K417K796L27m19k792k073l69K381q16j591n169
9553a738l188K158K362J566J207L66j111j537K787K180m48m25J511J95o28J221
9537F478Q04j517l872j205l49K455M605k882l987J078L291Q08K77k279J001j7
9521D689J012M576m26M04k050l580j865j038r88L161O133M271j942o238k982k683
9505D54K756N183M210J467k634l611j116J198K893n080m201J768K361P35K906
9490I289J775J552R46P9j340o367l296L635r25K007N693m74N64J614j829J448
9474A4371n6k475Q46J857P81L53l312j240K809M79l790j10o469n356K221N097
$$ y = [3688, 7300, 6493, 4678, 7222, 5476, 6145, 5375, 3771, 5678, 5086, 7264, 5026, 2295, 2227, 457, 1549, 1014, 1771, 4369, 3392, 3210, 3570, 5987, 8783, 9110, 8691, 5899, 3826, 3457, 5838, 5022, 3431, -1738, -4926, -2768, -406, 1160, 2367, 2733, 1622, 85, 2872, 5052, 4604, 4179, 5690, 5885, 5257, 6478, 7282, 5765, 1893, 688, 339, 2794, 7399, 4517, 530, 1608, 4899, 5707, 5984, 3705, 4706, 4689, 5701, 10277, 9851, 10255, 8205, 4625, 2760, 1722, 734, 3895, 10028, 14299, 12357, 6119, 3137, 454, 3210, 8393, 12603, 14070, 11436, 7825, 6709, 7907, 10800, 5720, 1519, 3287, 5648, 6383, 9289, 11064, 12616, 13562, 13641, 12301, 5934, 2638, 6273, 5348, 7355, 13048, 12574, 13138, 14752, 12923, 14371, 14315, 11840, 12686, 14543, 15324, 15677, 12365, 11125, 13934, 14413, 10623, 10513, 4044, -1312, 909, 6006]
9458F006J537q70l66K244M124j310J306L383k908n01J129M939L444L88k502j770
9442A8273K085J996l224j071J652J728r04Q34K799n09k07p95k576J493j579L10
9426B0305K437J383L509l66k288K903K823P01k364j000n61J223L51J605N457L84
9410C6502r79K03K027L716K173k291K535k55K481L145K511l429r53J089J014N117
9394E4606o85m75M456J635k88N413O49q29K632j60l57M223N031j235J885Q914
9378H5415O614N873M449M923N463L702L011K983O722M014M093P157J0169O328
9364A60916Q741J0331P135J0411Q990J6606J3268R710J2576J5304J5158J6362
9352C05508K1348J7167J7724K5230K4067K5826K2207L1679L9192L6732L4214L3075
$$ y = [6006, 7543, 6673, 6307, 8551, 12675, 11365, 12671, 16054, 13146, 12645, 13774, 18713, 22157, 22545, 20043, 18273, 20358, 22354, 19130, 18059, 19711, 21439, 20535, 21369, 24168, 23659, 23452, 22657, 20081, 21574, 19995, 20305, 22742, 24125, 27634, 27268, 24980, 27883, 30706, 31407, 29043, 28043, 27482, 28705, 29056, 30661, 36118, 36502, 35523, 35726, 37753, 41469, 43642, 41351, 43886, 43631, 46112, 49257, 51768, 48339, 47386, 48475, 49489, 54606, 53921, 53446, 57902, 59537, 59249, 64662, 65311, 64482, 67114, 66954, 66597, 70820, 75851, 74616, 76501, 85415, 92029, 97902, 102351, 107274, 112737, 116439, 119450, 122433, 129155, 133169, 137262, 144419, 154588, 160916, 169657, 179988, 187123, 197534, 206524, 223130, 236398, 246108, 258684, 273988, 289146, 305508, 326856, 344023, 361747, 386977, 411044, 436870, 459077, 490756, 529948, 566680, 600894, 633969]
9340F33969M3198M2427M3832M6558M6901N2291M5689M3659M0811L6392L2397K1066
9328A129190R767L909o129j8602k5558k7366l6300m2551n1510m8385m8708m4449
9316G93308m9296m5757m6315m5732l8719l1255k9846l2152k9420k6671k6996k3786
9304C67363k0998k1524j8783j5636j6035j7235j5124j3290j1144n967j2279j0008
9292A89340p797n183q055j1299r160l805k655n970o469r093p245l642o540m604
9278I7823k180J264l987j686j806j429n620r25k332m681l331l538J273l948m213
9263F0684l470n423K718J419m176r68j411j747l670R45j142o603k139K806K263
9248D0086K50o180k989J834J815q46l118k602K137j859J820J037J681p99m072
$$ y = [633969, 677167, 719594, 763426, 809984, 856885, 909176, 954865, 998524, 1039335, 1075727, 1108124, 1129190, 1138957, 1142866, 1136737, 1118135, 1092577, 1065211, 1028911, 986360, 934850, 886465, 837757, 793308, 744012, 698255, 651940, 606208, 567489, 536234, 506388, 474236, 444816, 418145, 391149, 367363, 346365, 324841, 306058, 290422, 274387, 257152, 242028, 228738, 217594, 211627, 199348, 189340, 181543, 176360, 168305, 157006, 147846, 144041, 141386, 135416, 128947, 119854, 112609, 108967, 102427, 97823, 95643, 96907, 92920, 91234, 89428, 87999, 82379, 81454, 79122, 74441, 71110, 67572, 68845, 64897, 60684, 57214, 51791, 54509, 55928, 51752, 50784, 49373, 47626, 43956, 44901, 43759, 37156, 35017, 37823, 40086, 40336, 34156, 31167, 33001, 34816, 33970, 30852, 28250, 30387, 28528, 30348, 31385, 33066, 32267, 28195]
9233B8195l833L581M313J513l570J820M63n770l042j958O46N796M655J765j895
9218C2679l540j445m421k908k772K113j341J348L354J507K722j915l167L39j175
9203B1378k334R75k330o96l065o06j252L373L886J035n994j977J691Q00qq5L387
9186A8178P98l443l691J452R06m914n87j130k477l128m93k37K248Q168N988j692
9170A5946l894J08j494q84j925J106M67l37Q54o64K20k225m106q16Q118K881k836
9153A0519j04O71l591j414J377M44m181N185L227k901l142k63J628L921J047k344
9137A0079j27k211m996J847k531k027R33J400p74P81l686q47K585n89j599K596
9121H34o36Q5N918j174j452j093j901L180L590R90K742k641p308j842o05K454
$$ y = [28195, 24362, 27943, 32256, 33769, 30199, 32019, 32482, 26712, 23670, 21712, 22358, 28154, 32809, 34574, 32679, 29139, 27694, 23273, 20365, 17593, 19706, 18365, 19713, 23067, 24574, 27296, 25381, 22214, 22553, 21378, 19044, 20019, 17689, 16993, 13928, 13322, 12070, 15443, 19329, 20364, 14370, 12393, 14084, 14884, 14876, 14791, 18178, 18976, 15533, 11842, 13294, 14200, 9286, 8699, 7569, 5092, 1964, 1471, 1234, 3482, 11650, 17638, 15946, 12052, 12160, 10666, 9782, 7857, 8963, 9430, 9093, 9947, 9283, 9503, 7278, 3172, 2356, 10474, 13355, 10519, 10415, 11086, 7495, 6081, 7458, 7902, 3721, 8906, 12133, 9232, 6090, 5827, 7455, 11376, 12423, 10079, 9952, 7741, 2745, 4592, 2061, 34, 967, 2367, 1593, 2374, -1312, -2159, 426, -163, -1762, 834, 198, 283, 6201, 5027, 3575, 2482, 581, 3761, 7351, 8341, 11083, 8442, 1134, -708, -1313, 1141]
9105A141P604N737k868o102k023p13J440Q20K200J605m489k699O67Q37M83L436
9089G076k862k545l829k442P93R29O536O606l882n734p4R41L216J304k09J443
9073G267j78j132P14j85j128J858k667l965j021j514L312N585J004k499q23k49
9057D379R39K537M544m822o60m061J474K36K26k256n00r12K428K404o56J454j711
9040E043n578j700J29K25L589J068j084O79L54j63J731R87K091k934l475p7o56
9023B29J469K434L040k229j292L25M51l144J388J370r9K739K88j634k392k356
9007E87k339k064Q14J817L063j027j824K920K981j021k348J299N43J245K537l708
8991C475m536j517K407J146j67K888m927K41L025L438m526o728n31J788M766Q05
$$ y = [1141, 8745, 14482, 11614, 5512, 3489, 2776, 4216, 5036, 7236, 8841, 4352, 1653, 2320, 3157, 3640, 7076, 4214, 1669, -2160, -4602, -3809, -2880, 3656, 10262, 6380, 646, 572, 1513, 4729, 6033, 5824, 7267, 7089, 5957, 6671, 6486, 5358, 7216, 4549, 584, -437, -1951, 1361, 6946, 7950, 5451, 4628, 4379, 5318, 7855, 12399, 7577, 6917, 2856, 4330, 4566, 4792, 2536, 2036, 1124, 3552, 5956, 5300, 6754, 5043, -535, -2235, -2106, -1881, 1708, 2776, 1692, 2371, 2725, 2562, 4293, 5280, 7371, 4437, 962, 885, 229, 1698, 4132, 7172, 4943, 3651, 3976, 4427, 1283, 2671, 4041, 3942, 6681, 6969, 5335, 2943, 587, -1752, -3816, -3002, -1185, 1878, 851, -973, 1947, 4928, 3907, 1559, 2858, 3401, 4646, 7183, 3475, -1061, -2578, -171, 975, 808, 3696, -1231, -990, 2035, 5473, 947, -5781, -6312, -4524, 242, 1047]
8975A047J601o59m77p16O98L869L33k827k29L281l125n497P7K566J632L073n62
8958D085j368K084K36j112m760k30K921K588n87n022k864p87j174Q60l706J295
8942g541K385L290J156P94j549J102k01j978K66L780K476j209k915O60j460K109
8926A165M057m825n807j399K233K295l360l371J311J526L885K706L609N77m20
8911D182j039j075k445j271j944M12K009L750k874k156L71K192j878l083rq25
8895e683J490M317J03M4j638l202M027k031m5J183j191r15j450L371J693M125
8879D198K233J114k230l114J921j54q02K349k488M626J725j27k413m885N509N714
8863A3176q43p00N036Q410J4695J4466K104q616j1986j0775r615o295m437l437
$$ y = [1047, 2648, 1989, 1512, 796, 1494, 5363, 5696, 2869, 2640, 5921, 2796, -2701, -2624, -58, 1574, 4647, 4085, 2717, 4801, 5037, 3925, -835, -1065, 1856, 4444, 3857, -1165, -4029, -4816, -5990, -5130, -8836, -7541, -5156, -1866, -710, 84, -1465, -363, -564, -2542, -2276, 1504, 3980, 2771, -144, 516, -944, 1165, 5222, 397, -5410, -6809, -4576, -2281, -5641, -9012, -7701, -6175, -2290, 416, 4025, 4602, 4182, 3143, 2068, -377, -1648, -3592, -3180, -1171, 2579, -295, -2451, -2080, 112, -1766, -4849, -4858, -5683, -4193, 124, 227, 271, -1367, -4569, -542, -2573, -2618, -1435, -2626, -3541, -4991, -1620, 73, 4198, 6431, 7545, 5315, 2201, 4122, 3968, 3166, 5515, 3027, 7653, 9378, 9251, 6838, 1953, 7462, 13176, 12333, 11633, 16669, 25079, 39774, 54240, 56344, 47728, 35742, 24967, 15352, 9057, 4620, 1183]
8849A183j907M792M634m040j485M556j160j203m894l799K01K948j08k018M867
8834B567J868j061k617K116K893J423K306l159Q09r25n046M09M523J440k154P63
8818F155Q841N591N579J9457L6606L8366K385k7424k8086k2862j2974j0675p383
8805A3576q422l892k019K872O16l585Q40Q02K733R93m051l735R64k04p9r79K638
8788i32K379L155o40k503J950M45m93j027L670L70o09j858J065L386Q72m94K822
8771A1558L004P997J5168J6156L843j1371j1569p291q741l068n317m705p9l784
8757A801j141J258j345N92k339P20M920k99o30j140j193p72k571J50O6r40K501
8740c62N738L514m386k952L011k709j754K169p22j336Q67L83k96q62J156K157
$$ y = [1183, -724, 4068, 8702, 4662, 3177, 7733, 6573, 5370, 476, -3323, -3122, -174, -282, -2300, 2567, 4435, 3374, 757, 2873, 5766, 7189, 9495, 6336, 7145, 6220, 1174, 1583, 6106, 7546, 5392, 6155, 14996, 20587, 26166, 45623, 82229, 120595, 122980, 95556, 67470, 44608, 31634, 20959, 13576, 5154, 1262, -757, 2115, 2731, -854, -14, 788, 3521, 4514, 463, -3272, -2308, -2512, -2591, -3570, -932, 1447, 4602, 3962, 1459, 3409, 3854, 3361, 2334, 6004, 6374, 5765, 3907, 4972, 8358, 9230, 8736, 11558, 14562, 22559, 37727, 53883, 57726, 46355, 34786, 27495, 18754, 15686, 10369, 5664, 5585, 1801, 660, 1918, 573, 1165, -1174, -454, 4466, 4167, 3537, 2397, 1204, 432, -2139, -1989, -1923, -2863, -362, 5376, 8890, 4504, 1552, 4563, 1854, 100, 2269, 1547, 211, 1078, 1461, 1165, 303, 1459, 3616]
8724C616K386n452k436k576L36K53o92J958J371o77P04L489j223j098M101J416
8708E476O63l389q97q67K315M96k951q00K499N322j60m64k206l268j419J502j255
8691E97J009k923K224M485P76K720k159o031l336K28K593P17k640J228L521P0
8675C079L433j593k751j927m821l558J483L062L894K91l22L848p30k140m26J8
8659H40l59K823J02K655J539l594M595K939j330k470l835j827m05J721o17J37
8643B914J536j511M868o43k462j055K012K211J123j631n37q38o24n932k122O31
8627b060J241r5k408k096j247K927L324j253l966J377J516l990J159N617m25l970
8611d349L033R93N71K286k408j994K007J883q45N67J585k949o51M560J108k943
$$ y = [3616, 6002, 550, -1886, -4462, -4126, -3873, -4565, -2607, -1236, -1913, -1209, 2280, 1057, -41, 4060, 5476, 6139, 2750, 1853, 986, 3301, 3797, 846, 46, 2545, 7867, 7707, 7243, 5037, 1769, 350, 1852, 597, 1606, -1317, 907, 5392, 6168, 8888, 6729, 698, -2638, -2410, 183, 900, -1740, -512, 3009, 3079, 6512, 4919, 2168, 241, -4580, -8138, -6655, -3593, 301, 592, 270, 4118, 3388, 1248, 822, 840, 481, 3304, 3406, 6061, 7600, 4006, 8601, 11540, 10210, 7740, 3905, 2078, 1673, 3394, 2777, 2914, 4450, 2939, 7807, 7164, 4702, 3647, 5659, 7870, 8993, 7362, 6825, 5987, 5363, -569, -2691, -2060, -819, -914, -3322, -5418, -6665, -3738, -414, -1667, -5633, -4256, -2740, -6730, -5571, 46, -379, -4349, -1316, -323, 248, 2534, 126, -1868, 139, 2022, 1177, 1744, 3329, 380, -271, 4289, 5397, 2454]
8595B454k34L200q7J364Q49K276L443j631R30K611j282k376k533K027P36j523
8579A0224j122j861j924j797m52Q27q27j472m166J645K026m226j236k837K966
8564d232N238L573k588J23l200LK533j38j015K07N70j692J9K551q1k719k19m05
8546a472J298K731m717l708M980M570k110p80o26J362j051J72J219k08J940K048
8530E648k10m353k517j344L67L171J861k44j10P30j467j591j273K089q06Q77o91
8513A37K765l061j650K883J223j483j561q63j51K19m552o30K765j576k856O3M371
8496c957L936N572j169m34p43p97J041o4k174n055k01L391m26K234k38K421M47
8479C784l452J4P342K18K47L388m76k946k334k915k713j091K700L334l195p91
$$ y = [2454, 2220, 5420, 5333, 6697, 7546, 9822, 13265, 11634, 12564, 15175, 13893, 11517, 8984, 11011, 11747, 10224, 9102, 7241, 5317, 3520, 3068, 3895, 3068, 1596, -2570, -925, 1101, -3125, -4361, -7198, -4232, 1006, 4579, 1991, 2114, -1086, -1083, 1450, 1312, 297, 504, 1074, -618, -599, 1952, 1871, -848, -1067, -1472, -174, 2557, -2160, -5868, -888, 3682, 1572, 792, 166, 1528, 477, 649, 1868, 1660, 3600, 5648, 5438, 1085, -1432, -2776, -2409, 762, 2623, 2379, 2269, 2999, 1532, -59, -1332, 757, -49, 828, 137, 2902, -159, -1809, 1074, 2297, 814, -747, -1610, -1761, -1542, -6094, -6724, -3959, -5535, -8391, -8328, -3957, -21, 5551, 4382, 3948, 3205, 2408, 3449, 3385, 1211, -3844, -4045, -654, -1080, 1154, 916, 3337, 3784, 332, 346, 7688, 7906, 8153, 11541, 11065, 8119, 5785, 2870, 157, -934, 1766, 5100, 1905, 1114]
8463A114J542k237K035M889J828k305k669l877N97j703J348K751O6k945r09M792
8447D317m093m0K334j034l586L152K21k997n62j854o24j767M799M400O01K737
8431F004O27n558k965j254K060N49k21l366j382j575K98R88L916P824M283K320
8415A2548l40k979K70k112l837k955J945k991l210n3K039j074j114J164j581p32
8399e012P24m9L649R84l37J901J668k243j366k929m224q24L454O286K313k44J377
8382E128j235l996k511K232p64K597K292l701p77J924N324L112k002J141k358
8367F406m027j945P60j320L818O62J179K521j842j685K31K874L179m94m146k849
8351C322j379J780J02J031j268j356l065J112k794j836k25J458K155O07j45j244
$$ y = [1114, 2656, 419, 2454, 7343, 9171, 6866, 4197, 320, 917, -786, 562, 3313, 3379, 434, -475, 4317, 224, 184, 2518, 1484, -2102, 1050, 1271, -1726, -2288, -4142, -4766, -6533, -1734, 2666, 3267, 6004, 6631, 1073, -1892, -3146, -1086, -537, -758, -4124, -5506, -7081, -6783, -5795, -1879, 5945, 10228, 12548, 12208, 9229, 9499, 7387, 3550, 595, 2540, -451, -3661, -3714, -1675, -2749, -3863, -2699, -4280, -5012, -4288, -4337, -688, 296, -41, 1860, 3528, 1285, -81, -3010, -7234, -8058, -4604, 1682, 3995, 3751, 5128, 3893, -103, -2614, -382, -1146, 1451, 3743, 42, -735, 1189, 6513, 9625, 7623, 8764, 6406, 2379, 434, 1194, -126, 3692, 4354, 5533, 8054, 6212, 4527, 4758, 7632, 10811, 10317, 6171, 3322, 1943, 3723, 3825, 4856, 3588, 2232, -833, 279, -2515, -4351, -4576, -3118, -963, -356, -501, -1745]
8335a745M95m09J229M210M792k213n92m01k01K318J431k372l941l542K02j355
8319b094K332j250K018J05q06J618L256L85R68j581p432j880K032M602l58J180
8303C095K652J76l383j393K81M48L046J714n668k725P29J952K536j487j781L903
8287D095k472p1r04J066L70k296j351J868K300p98k779m82q06j308j978K684L586
8270G24M753L287j261J343L336J579j380l866r43O07n7l348k125K450l666J156
8254B589J522jJ052Q74j857l17l424k84L973l220m344k016J905M876L675j641
8238C362m416N4j355l95L704J3j977K831J963L177K738l866k962m936J053J345
8222C33Q4N830m6p42R51j873l015J679j418J088K30m945l332J382J909L334J192
$$ y = [-1745, -1250, -1659, -430, 3780, 8572, 6359, 5767, 5366, 5165, 7483, 8914, 6542, 2601, -941, -739, -2094, 238, -1012, 1006, 1111, 305, 1923, 5179, 5564, 6532, 4951, -2481, -4361, -2329, 2273, 1915, 3095, 5747, 5923, 2540, 1147, 1428, 1876, 4922, 6636, 968, -1757, -1028, 924, 3460, 1973, 192, 4095, 1623, 1552, 648, 1714, 2084, -212, -1563, 305, 2605, 1807, -972, -1454, -2260, -3568, -5546, -2862, 724, 5477, 8764, 7503, 8846, 12182, 13761, 12381, 8515, 7572, 8179, 8122, 4774, 2649, 5099, 1433, 2589, 4111, 4110, 5162, 6036, 4179, 3862, 438, 154, 4127, 907, -3437, -5453, -3548, 1328, 5003, 3362, -1054, -1000, -2355, -2750, 954, 967, -1010, 1821, 3784, 6961, 9699, 5833, 2871, -2065, -1012, 333, 417, 6247, 6201, 5459, 6410, 4537, 1522, 3201, 1783, 2871, 3101, -1844, -5176, -3794, -1885, 1449, 2641]
8205B641p79r49J545J562L729J85l002m706r34M25K782p22J66j706J681K406j730
8188B594l079k110k325K344J87M728L149l029n077J131L25k637q23L01L041M37
8172h43K329q10O33l62O26N65k621o14o241k627J0218K296p47O62M27j552J348
8155B687J048j416m316J178k038m27M843J777k369m171K418k243q66j666k719
8140h280j484j471M579K264M516M316K97n276l123J782K719m043k385K854J347
8125a388j162j023N1K14K146n4J047q89o90M131N01q87n569k429K437n13N092
8108A015L180K037J704L49n563m288M329K55J18j027J196L058k356k618j881r01
8092a393P75J001J127j112q66J684K054L251j024k466j945j196m01l459J26J169
$$ y = [2641, 1862, 913, 2458, 4020, 7749, 7934, 4932, 226, -708, -283, 2499, 1777, 1943, 237, 1918, 4324, 2594, -485, -2595, -4920, -2576, -2389, 2339, 5488, 2459, -2618, -1487, -1162, -3799, -4622, -4321, -1280, -843, 1486, 676, 1309, 947, 1573, 2138, -483, -1097, -7338, -9965, 253, 2549, 1802, 2464, 2891, 1339, 2687, 3735, 2319, -1997, -819, -2857, -3284, 1559, 3336, 967, -3204, -786, -3029, -3895, -5561, -8280, -9764, -11235, -6656, -4392, 124, 4440, 4737, -539, -3662, -1880, 839, -3204, -5589, -2735, -1388, -2550, -3573, -3522, -3308, -1162, -1216, -169, -1058, -1748, 2383, 2884, 1997, -3572, -6001, -3564, -4077, 1015, 4195, 6232, 7936, 8285, 2722, -1566, 2763, 3018, 3136, 2109, 3305, 6363, 4007, 1389, -492, -1393, -618, 383, 1510, 398, -468, 1216, 3270, 6521, 5497, 3031, 1086, -110, -511, -3970, -3844, -2675]
8076b675L358J704j849L920J766J261L91j320n316m828J157O934J234J325q99
8061F163J801r77n756r47M35j576k250M987J659m082l289j721K631O102K833k157
8045C856J950L372l819l736j197k558O94J536q1O03k313J19J899J650m000k321
8029d346L711L485J402O458p54o930l532j64j480J196o54P4J412J186m473J480
8013a929P887l577n456K450n87k488J264K400J766j678o13N52k443J709L873n7
7997C073P23r27J659m47j745j804k079K036L07j514o5K954N369O15n87k904n322
7980f58Q70M237J617R44K334J90o14j322j284k741k486m337o92M557O89j827J2
7963e11M163L185J383N63l517j246K21k899j793L190L069r02m584j892j437q32
$$ y = [-2675, 683, 2387, 538, 4458, 6224, 7485, 7876, 6556, 1240, -3588, -2431, 4503, 5737, 7062, 6163, 7964, 6987, 1231, 284, 719, -857, -3107, 1880, 3539, -543, -3832, -5553, -2922, 3180, 6013, 3856, 5806, 9178, 5359, 1623, 426, -2132, -1438, 98, 17, 620, -1693, -1574, 325, 1975, -2025, -4346, -635, 2850, 4252, 10710, 9956, 3026, -506, -670, -2150, -954, -1608, -1534, -122, 1064, -3409, -1929, 5958, 2381, -3075, -625, -1212, -3700, -2436, -36, 1730, 52, -561, -9, -2452, -743, 3130, 3073, 3796, 2869, 4528, 4081, 2336, 532, -1547, 489, 796, -718, -783, 2171, 7540, 8155, 7568, 4664, -658, 212, 4449, 6066, 7010, 9344, 9534, 8920, 7598, 6314, 3573, 1087, -3250, -3942, 615, 1304, -523, -511, 3652, 6837, 8220, 8783, 5266, 4020, 4241, 1342, -451, 2739, 5808, 4906, 322, -1570, -3007, -3839]
7947c839J310K450K411J704M48J409j789R68P72k785J363K722P71l726k641l42
7931A206n474N32L653L056K549K429K809l989l243J100K656j983l111P04J109
7916D003k54k530K207L742j713m829j410K439R45n60k8J872j006m125P73p3O41
7899I4j265l870O8M502K315J531km947J39N729O07j087r33l442K71p5m437J61
7881d641K439L145J36K081j582k109l967k782j554R1j368K881J240k335j027J474
7865g878J948K803L126L028j254j708j841K974q00j422r07k251O18M966K652P71
7849D825j974J486n83k854l125K527K845n74j636k316L1O74j39J226K271k101
7833E83j982j471k89J606M353M409M08n491l0L73L42r61j978l976j91K812J49
$$ y = [-3839, -2529, -79, 2332, 4036, 4484, 5893, 4104, 5072, 5844, 3059, 4422, 7144, 7915, 4189, 1548, 1206, -4268, -3736, -83, 2973, 5522, 7951, 10760, 6771, 3528, 4628, 7284, 5301, 2190, 2894, 4003, 3749, 1219, 3426, 7168, 5455, 626, -784, 1655, 2600, 2040, 2012, 3884, 2878, -1247, -474, -547, 94, -1171, -5041, -4973, -471, 1844, 3375, 3373, -1574, -1435, 4294, 4901, 3814, 2881, -561, -290, -365, -4802, -4641, -2202, 943, 1079, 3160, 1578, -531, -4498, -7280, -8834, -8743, -10111, -7230, -5990, -8325, -9352, -7878, -5930, -3127, -1, 3027, 1773, 65, -1776, 1198, 398, -1024, -1931, -4182, -3564, 1402, 4054, 4825, 2851, 4337, 3754, 900, -2225, 302, 3147, 2573, 937, -1379, -1348, -674, -813, 413, 2684, 583, -1399, -2870, -3159, -1553, 2800, 7209, 7617, 2126, 2096, 2469, 2811, 1850, -128, -4104, -4295, -1483, -1334]
7816a334J685M95k601K597K225m002k103q53K694J866r99J439K71p58p52m512
7800d642K51K816j991J446N150O96j133Q72l41k014j732K842J131j271j271N4
7784H63k267j831J742P79j222l962l310N540J190J098k549j450K49K021L199r94
7768i04n105j909K240J393j313L767J781P36p64K771k541o09J061p30k716l278
7752f120J752k59j567J81L666K190k61j087k687K652K761l58k458j851K73O97
7736b476J644J797p3l039l472j798L574L460k382nq17R54n75k461l100rK395M938
7718a445J58l287k902k834M042J845J097J307p65l015r94L426M61R3L681j93q76
7701b01M849j934l554j299m77o6L889M94m730P38O43j12K255k439Q91p17J514
$$ y = [-1334, 351, 846, -1755, 842, 3067, -935, -3038, -3891, -1197, 669, -330, 1109, 1380, 622, -130, -4642, -4391, -1575, -3566, -2120, 3030, 3726, 2593, 3465, 3124, 1110, -622, 2220, 3351, 2080, 809, 863, -1404, -3235, -1493, -714, -1936, -5898, -9208, -3668, -2478, -1380, -3929, -5379, -5130, -3109, 90, -904, -6009, -7918, -5678, -4285, -5598, -1831, -50, 686, -78, 2693, 152, -457, 604, -126, -2842, -6120, -4368, -4627, -6194, -6013, -2347, -157, -418, -1505, -4192, -1540, 1221, 863, -1595, -3446, -3173, -2476, -832, 965, 892, -2147, -5619, -7417, -3843, -383, -2765, -2770, -3587, -2633, -3208, -5669, -8769, -8778, -6383, -1445, -1287, -4574, -7476, -10310, -6268, -4423, -3326, -2019, -2784, -5799, -6793, -3367, -2906, -2813, 868, 675, -201, 4648, 2714, -840, -2139, -2616, -2682, 1207, 1701, -3029, -2291, -1648, -1760, 495, -1944, -1053, -1770, -256]
7684b56J684k717N21p06K377Q58q44j425K373J080l84K076K475k543q37J888m754
7667H66k807l979N25l59J980M831q78m73L62J509J01R96j023j32P75N70l585m568
7649e289p07r34J353K739M147J036j415k882K677R03j336m692p26J871L581m152
7633c826L590r27j09K516M16l576j86K785M469p39j845m158M759j733m190M97
7617b257J581l323J460j564N10K070j889l187l111K450O383J647J111l272J052
7602c39n97k406l64L81p66P28n08M061M22l739l337k067N500K112l098l681l814
7585a1512j579L504L933l146k68M486K988J845P45j190k476m50j621m193J420
7570g514J878M453J957J84J621K237r73j642r85k290L17l26J704J566O50o55k022
$$ y = [-256, 1428, -1289, -768, -1474, 903, 1761, 917, -508, 1865, 2945, 2561, 4637, 7112, 4569, 3732, 5620, 866, -1941, -5920, -5395, -5754, -3774, 1057, 179, -294, 68, 1577, 1678, 2674, 1651, 1519, 2294, 2864, -721, -5289, -5996, -6930, -5577, -2838, 1309, 2345, 930, -1952, 725, 1628, 292, -4400, -5126, -3255, 326, -3826, -236, -1163, -1272, 1244, 1660, -1916, -2102, 683, 5152, 4413, 2568, -1590, 3169, 1436, -2754, -2257, -676, -3999, -2539, -4103, -3593, -1523, -3412, -6599, -9710, -7260, -877, 770, 1881, -1391, -339, -936, -3342, -3706, -3325, -4091, -3363, -3871, 190, 612, -3127, -6464, -8531, -3031, -919, -4017, -7698, -11512, -13091, -9587, -5654, -8800, -9068, -4582, -1594, 251, 996, -194, -2670, -3120, -4741, -8934, -7514, -5636, -1183, 774, 958, 2579, 4816, 3843, 2201, 1216, -1074, -757, -1083, 621, 2187, 2837, 2182, 160]
7553A60j815K889q23n164k450K298K612K408J854O52l397r31J127L998j396j019
7537A003m86k205k146R47R68m289J76N40k429j65L436L818M41l303N03L942p76
7520b5j96k107J510n422k371J747q80L721K075J210K06k258K951O615J994m284
7504D486p401j189K227J326K535J616J59J134m109M5J182k787j703j954k915K097
7488e251K600p74l338q00K561K715K975N21m31l492K471J13n75K148j842n727
7472f126j187PR71M383J792M109l250J840L529K227o359k510J320j631k412k0
7456c317J348J909j189j882m52J183l18K003j933Q4L993J414l568J919Q57O23
7440B674j700k876j812J819J515m806l983N85j299M10o3K204K567L690L452k558
$$ y = [160, -1655, 1234, 411, -4753, -7203, -4905, -2293, 115, 1969, 2621, -776, -1707, -580, 3418, 2022, 1003, 517, -1688, -3834, -2887, -1919, -6208, -6032, -5492, -7921, -8086, -4650, -832, -391, -3694, -3191, 751, -25, -221, -2328, -818, -6240, -8611, -6864, -7744, -4023, -1948, -738, -532, -2790, 161, 6776, 8770, 4486, -2915, -4104, -1877, -551, 1984, 3600, 3759, 4893, 784, 829, 2011, -776, -2479, -4433, -7348, -5251, -2651, -3425, -6763, -7563, -5002, -2287, 688, 1209, 778, -2714, -243, -130, -705, 1443, -399, -6126, -7313, -7306, -6335, -1952, -160, 3949, 699, 2539, 6068, 8295, 1936, -574, 746, -885, -3297, -3317, -1969, -60, -1249, -3131, -3583, -2400, -2718, -715, -2648, -2564, 1429, 2843, -725, 1194, 2051, 2674, 974, -1902, -3714, -1895, -380, -5186, -9169, -8584, -9883, -9473, -9536, -7332, -4765, -1075, 2377, -181]
7424a81q483k756N221M426l661N5R86M768J296p196j675J609K073j824R04L091
7408a347J009O85K07k690J823j119m449M033J706L934J22q642k19K841P94J611
7392B99N29j213O23k44J569p02q81j490p6j342j565K449p54n01j832K413j005
7375c723j980k352J586LN426J29j03J688o13k36M259L613j421k726q797j585j338
7358h170N361N074j31j418J34K253M97l679l102l546M079K493O94j429N06J86
7342a98L28n73k739l066K872K21o30J120j754J229j243j870l80j258K048L877
7326b016K141N8m120m435j79M880J431J768L054l024l156K726o66N70L859L839
7310F730j145k37M37r86l406m456j783J323j930J741N203k719m341L230K190k612
$$ y = [-181, -8664, -11420, -6199, -1773, -5434, -5379, -4393, 375, 1671, -5525, -7200, -5591, -3518, -5342, -4438, -1347, -338, 347, 554, -2136, -313, -1432, -5881, -1848, -142, 3792, 3914, -4728, -4947, -2106, -1312, 299, 828, -385, 238, -6, 1563, 861, -20, -1510, -1586, -2928, -4493, -2044, -2798, -3299, -5131, -2718, -3723, -5703, -8055, -6469, -6466, -1040, -911, -1014, 674, 61, -175, 4084, 7697, 6276, 3550, -5247, -6832, -8170, -2809, 2265, 2134, 716, 850, 3103, 3600, -79, -3181, -6727, -2648, -155, 539, -890, -384, -198, 130, -443, -3182, -6248, -3376, -3155, -3785, -2665, -4419, -3190, -4433, -6303, -6683, -7941, -5893, -2016, 125, 183, -3937, -8372, -8551, -3671, -2240, -472, 2582, -442, -3598, -872, -1538, -968, 2891, 6730, 5585, 5348, 5785, 4799, 1393, -3063, -4846, -3523, -5453, -3712, 1491, -1228, -5569, -2339, -149, -2761]
7294b761l648K034M928m63j676L213M775j227n330l974k99L722K904j967J452
7279A683j728q466j997Q63r57M121L562R33J351l207k441L389L661J928O97J368
7263D760j031m270l886m314L10K423J021k869O32r66k883J854L169j606m41J498
7247f599k84R01Q04j170L154J069K478l99r43q22M549L774r17o07l889r37M47
7230F09J960L49o730k751L434Q90j815o42K416j15L851P84J30L862M424l74j663
7213H619r40r38k692l394K65L374J839m621m721K689Q85j061m318L14k98N51M289
7196a58J53J137k290O76J178J985p78K91M658J971k177n360m605K226L743j535
7180A115j656P13P21m819j957M285L348J703k581M45J717J018j417l445J01j511
$$ y = [-2761, -6409, -4375, 553, 90, -1586, 1627, 6402, 5175, -155, -4129, -4428, -706, 2198, 231, 1683, -45, -8511, -10508, -9645, -10602, -6481, -2919, -1986, -635, -3842, -6283, -2894, 767, 2695, 3392, 4760, 3729, -541, -4427, -8741, -8431, -6008, -4987, -7856, -7224, -8190, -11073, -9219, -6050, -7656, -8097, -6599, -6883, -5982, -5178, -6348, -3194, -2125, 353, -46, -989, -1811, 2738, 6512, 5595, 4988, 1099, 162, 609, 2569, 2918, -3812, -6563, -3129, -2239, -4054, -4696, -2280, -2395, 1456, 2240, 2370, 6232, 10656, 10282, 8619, 7679, 6741, 4049, 655, 920, 4294, 6133, 1512, -3209, -520, 365, -696, -5014, -4700, -4998, -4447, -158, -5, 1132, -1158, -482, 696, 2681, 1903, 2194, 6852, 8823, 6646, 1286, -3319, -1093, 2650, 1115, -541, 172, 893, -3926, -5883, -1598, 1750, 3453, 872, 1317, 3034, 4052, 2635, -810, -709, -2220]
7164b220k245M4n58m67K941M468l33N14J097j762m84k999l449J039J667k375N071
7147e1M201J16l331j964k99n19l260j044M46J593P86O73j649L28k116j991L574
7130d507k09k8J439j472q14K068L890N55r64l01L61J236K003j564o53J498K383
7113D921l063k531j239l75j6J908O52j272l474l997k572M836L698K175j375J99
7097a525k778l641J565l589J826K820J570K012k083m493J340M095M92K874K19
7082G04n50k53r41j943m954M29K895M204N426M479l647l819L46K499j750n326
7066b201l508O654J866l502N50n01l668k788r09k477M374Q458J300j764j604N87
7050H67j585J814j157k563J71K536j94o310j680M075O318J499k74j792k292o86
$$ y = [-2220, -4465, -4421, -4979, -5446, -2505, 1963, 1630, 2144, 3241, 1479, 995, -2004, -5453, -4414, -2747, -5122, -51, 4150, 4266, 935, -1029, -1328, -1847, -5107, -6151, -5705, -4112, -3326, -2653, -4302, -3974, -6090, -8081, -4507, -4716, -4744, -3305, -4777, -5591, -3523, 367, 922, -42, -343, 18, 1254, 3257, 1693, 1040, 2538, 4921, 1858, -673, -1912, -2287, -2303, -395, 257, -1015, -4489, -8486, -11058, -6222, -2524, -349, -1724, -1525, -4303, -7944, -6379, -9968, -8142, -5322, -3752, -1740, -3823, -8316, -6976, -2881, -2389, 485, 704, 154, -99, -1040, -2983, -7937, -7508, -4613, -409, 5017, 9496, 5849, 2030, 2376, 4875, 3125, -2201, -5709, 945, 2811, -691, -141, -642, -4310, -7098, -8007, -10484, -6110, 2348, 3648, 1884, 280, 867, -718, 1096, -61, -2624, -2453, 83, -111, -6421, -8101, -4026, 2292, 3791, 3517, 1725, -567, -1253]
7034a253K360K303l56j96o99k799j162j487J138n57k019k885k603L284M831M316
7018B216K581J68k714m12O40q02m635K669K105m220K914L014J731m202o76o26
7002b49P60o6m151l475J207J423k780j303L380K192J937O75k390l51J509M25l187
6985d444M61k463K332O461Q93M84M074j4m612k713l021j894k564K387n20J123
6969d030M461j352j797k529k240J033L611j042r06M81J614K397K43m900m00k587
6953g943K209R96J861L654r84j867J389L206l7l382j187Q34k830j136K12M206
6937g99J678k11J889K166M65j561k228k996R97l930j987R70P53M431K551j07K582
6920D663l483o079r99j94L377M29j553k764m14K997o66k378j215Q88M78l403J090
$$ y = [-1253, 1107, 3410, 3054, 2858, 2159, -640, -1802, -3289, -2151, -2708, -4727, -7612, -10215, -6931, -2100, 2216, 4797, 4965, 2251, 1839, 2479, 1677, -2958, -289, 1816, -2404, 510, 3524, 5255, 1053, 377, -249, 511, 445, -3706, -7181, -5974, -4551, -7331, -8634, -5254, -3062, -1125, -450, -2840, -3191, -1682, -1257, -4444, -3983, -6446, -4114, 2347, 3240, 3724, 7798, 7784, 3172, 459, -2562, -4456, -7020, -4633, -5153, -4030, 431, -921, -2718, -5247, -7487, -6454, -2843, -3885, -4791, -4310, -2696, -299, -56, -4956, -5356, -7943, -5734, -4738, -2877, 777, -207, -2074, -685, 2521, 2484, -898, -2085, -1251, -4081, -5217, -5005, -799, 879, 668, 2557, 4723, 5188, 3627, 1399, -1597, -600, -4530, -6517, -5547, -4794, -363, 2188, 2081, 4663, 1180, -4899, -5898, -6092, -2715, -2286, -3839, -6603, -7017, -4020, -4686, -7064, -8279, -7391, -6913, -10316, -9226]
6903i226K520K050L663J700M478n33n654l371k379M90K992J516j612oM579M37
6887A644m556j95j019J340K502k724m470j412K265K203j589L38L9l386M790O643
6871B413j268l62j571K617L461j923j823p33j587l836M089%k212j286k167l685
6855i873J31j485j004J646L760Q181J168L971k179j0288j386M227L864N42K398
6840C673m78l843n99n13k375k014J357k810j249q39l047J569O273L149j901j67
6824c814J368n65k284R95J927k801L42J060J008J399N85l04J586j79m898J434
6808c141J493L768L944l639l43J696m91o447l033Q10r79M85J206M029K352o522
6792d812m925K047P72L777R15l254l01N669N55k14j7j246l259L91J075L15j587
$$ y = [-9226, -6706, -4656, -993, 707, 5185, 4652, -1002, -4373, -6752, -6262, -3270, -1754, -3366, -3372, 1207, 1644, -2912, -3107, -4126, -2786, -284, -3008, -7478, -8890, -6625, -4422, -6011, -5673, -5634, -9020, -4230, 2413, 1145, 783, -788, 1829, 5290, 3367, 1544, 811, -776, -4612, -523, -523, -2735, -4021, -6188, -9873, -9742, -11227, -12231, -10585, -6825, 1356, 2524, 6495, 4316, -5972, -7358, -3131, 733, 1275, 3673, 3195, -648, -1247, -1760, -4135, -6149, -4792, -7602, -8851, -9690, -12737, -11168, -4895, -1746, -3647, -3814, -2446, -3011, -5295, -4300, -2373, -5174, -4832, -3772, -2764, -1365, -780, -1084, 502, 323, -4575, -3141, -1648, 2120, 6064, 2425, 2082, 3778, 3287, -3160, -6193, -5383, -6362, -5877, -4671, -642, 1710, -4812, -9737, -7690, -6918, -3141, -2226, -5480, -5781, -112, 443, 229, 212, -1034, -4293, -3902, -2827, -2512, -4099]
6775d099k256R61O28j15K669l66j218M185p08k54N49j19O06K678K03L86J134K181
6757G045j471j4O945N021k722k607j662n170o289K94K617J917q99m220o07j633
6741c455k844k37j141O49j823J406L566K588P83K267J788J677k46P82j102j919
6725B739k29m152l21j779p018Q75J244J116K284J208l9J972m7L528j787m343j764
6708f513j974M455L807N53j20J758n410n30j978q72O1K685k911Q43J027K308k99
6691c110L690J522l079K036m31P7M141M610j076l774l97p553p93L302L210m055
6675a680l807N29P09O79r71k960j819K408M554M296m67j521j619n20k12L3q12
6658c180k106J859J183L656j141j780l244k746K872o66k131L882O18M01r63K557
$$ y = [-4099, -6355, -5394, -4766, -4881, -2212, -2578, -3796, 389, -319, -573, -24, -143, 463, 3141, 3344, 3730, 4864, 7045, 5574, 5560, 12505, 17526, 14804, 12197, 10535, 5365, -924, -630, 1987, 3904, 3005, -1215, -1822, -3455, -6299, -6536, -7677, -7028, -8851, -7445, -3879, -1291, -508, 1759, 3547, 5224, 4978, 5760, 4658, 2739, 2510, -1642, -1963, -3742, -10760, -9885, -8641, -7525, -5241, -4033, -4072, -2100, -2147, 1381, -406, -4749, -6513, -8487, -4032, -225, 328, 208, 1966, -3444, -3974, -5952, -6824, -6763, -4078, -6989, -6146, -5119, -2811, -3110, 580, 2102, -977, 1059, 628, 705, 4846, 9456, 8380, 4606, 4209, -3344, -4137, -835, 2375, -1680, -5487, -4958, -4249, -3570, -4541, -7501, -9320, -6912, -2358, 1938, 1471, -50, -1669, -2189, -2401, -2368, -3180, -5286, -3427, -2244, 1412, 271, -1509, -4753, -7499, -4627, -5293, -7424, -3542, -2924, -2523, -3486, -929]
6642i29k309k781K381J152k713k704J190J602M117k6J507L41J458k069J24j802
6626a461J255J907k64j973J612J329l767M819J90o912N96O018R56J155k509k06
6610B745k910L493l062j683K164n56k181K650j85k639k342M44l048K66M667J701
6594d76j178o12Q14pJ436P60j459j667l120q5M587J540m06k607n39J66J039r8
6576a912L001J006J211k45l346l44P30q34j012K134J35L938Q59j039l119j811
6560f48o38q28L818L56l232R87L228J175j946o16j260j061k287j199J534o10p26
6543c953o204k081l144K347N225L089R76K560k171l957K009n34K462r4n17j448
6527e435q53p20K412o62K13J320r43J158J98K990K6m819K635L145K361J9J36R98
$$ y = [-929, -3238, -6019, -3638, -2486, -5199, -7903, -6713, -5111, -994, -1020, 487, 828, 2286, 217, 341, -1461, -206, 1701, 1437, -536, 1076, 2405, -1362, 3457, 3647, -3265, -2669, 3349, 4305, 5460, 2951, 2745, -165, 3328, 266, -1417, 747, 191, -1990, 660, 475, -2164, -4506, -4062, -7110, -6844, -2177, -476, -1654, -2266, -1452, -1459, -23, 737, -722, -2389, -5509, -5594, -1007, 533, 127, -2480, -3019, -2853, -1814, -1912, 1089, 2095, 3306, 3061, -285, -629, 101, -733, -1745, 389, 524, 4462, 5321, 4282, 1163, -648, -1286, -2114, 1704, 2060, -1172, -185, 3043, 4218, 2272, 1656, 396, -665, -2952, -4151, -2617, -3227, -3953, -10157, -12238, -15382, -13035, -7810, -4721, -3745, -1185, -3356, -7313, -5304, -5838, -3376, -3470, -3987, -5435, -6288, -7008, -4596, -5258, -5045, -3725, -4668, -3510, -3312, -322, -296, -5115, -2480, 665, 3026, 3045, 3181, 4179]
6509D179L53m147l042m622j691p5O45K863j082J904L829J834k46l889N10N472
6493B795j106n070m399M58R00K640K822K892K53m972j018L176M42K17J632k679
6477a017l065K009j769n467K845M561j18O3J91K324l899m68J299K646R22J726
6461B783n82j764l894o30M209K333o03k21k406j282K956J444Q54j552j820l423
6445c598n81Q98M240J777K117q36k306l722o77l347m95K806j197l444J723M305
6429b337K667k590J128M47K29J240O53J338K31l408j268J559Rk783k504J236K503
6412a650P67K816j293o07l42m40l427j585N129L945Q07k704j311j632M674M5o235
6395c043O71j376j461j397R49M383l584l085J897k30j527K533L811L125q6k695
$$ y = [4179, 4532, 385, -2657, -7279, -8970, -9045, -8400, -5537, -6619, -4715, -886, 948, 702, -3187, -2677, 2795, 1689, -3381, -7780, -7322, -6422, -3782, -960, 1932, 2185, -2787, -3805, -629, -187, 30, 1662, -1017, -4082, -2073, -3842, -9309, -6464, -1903, -2021, -1958, -1767, 557, -3342, -3810, -2511, 135, 1057, 2783, 2201, 437, -3457, -4087, 122, 2455, 1852, 1631, -775, -2057, 899, 2343, 3197, 1645, -175, -3598, -4179, -3281, 959, 2736, 4853, 4017, 1711, -2011, -2688, -6035, -6530, -3724, -4921, -8365, -6642, -2337, 330, -2260, -1132, -685, -456, 784, 1437, 2775, 3006, -402, -1670, -111, -102, -2885, -5389, -4153, -1650, -883, 1933, 640, 33, -309, -749, -4176, -5761, -632, 3313, 4120, 1416, 105, -1527, 3147, 3192, -3043, -2372, -3748, -5209, -6606, -5657, -1274, -4858, -7943, -6046, -6276, -7803, -5270, -1459, 1666, 1580, -1115]
6379a115j872Q78L78L117r78m135j023K73K056L395l047j572K40j226q46k41M626
6362a092O235m41j969r91P61j928K07j275R16L14n039j471M644L334j970m476
6346d241K492O78m672m76J542L004M027J03j11j347k91l47M662L99p018n966j506
6329i068K236L539l759k315J987L438J149r94L610J691n62J908k389R44m8l344
6313a977K338j185k831r80k981L440M559k45J086J010o40j98k097l06m85l350
6297d842R88j93K018Q03n92M29k534k086L19L302k580j243N22O662m52j43K23
6280F01l392m226K938l827k363N5N485L566J605K45K05P4M19l736Q69q42J76K119
6262b9k759k380L785J937j1K720K353J583l0J164N17l365n006k690k73k611L154
$$ y = [-1115, -2987, -2109, -1731, 1386, 408, -3727, -4750, -4477, -2421, 974, -2073, -3645, -3405, -4631, -5477, -5718, -1092, 5143, 4702, 2733, 1742, 2503, 575, 782, -493, 423, 737, -4302, -5773, -1129, 2205, 235, -4241, -1749, -1071, -5743, -6219, -4677, -1673, 2354, 2457, 2346, 999, 708, 361, 5023, 5422, -1596, -7562, -9068, -6832, -3293, -7052, -9367, -7380, -3942, -2793, -3787, -177, 1514, 952, 2860, 471, 1415, 1367, -1977, 361, -824, -3655, -4635, -7616, -4176, 383, 138, 1224, 2234, 1594, 1396, -701, -1007, -1492, -4842, -3854, -4047, -2029, -1226, -1818, -1389, -3923, -6009, -5690, -2388, -4968, -6211, -5689, 973, 521, 378, 601, -2791, -7017, -4079, -7906, -10269, -10214, -4729, -1163, 442, 687, 892, 966, 1385, -2351, -1482, -2324, -2148, -29, -2788, -5168, -1383, 554, 543, 3263, 5616, 7199, 7169, 8333, 8850, 5485, 479, -2211, -2484, -5095, -1941]
6245a941L459K163m99k913J573J708N0l548r40k912k492K304L518J432Q90r36
6229I16J644K510j289n401O2l562N60O195J225j738J157J096l182m041K06P33
6213b909j196O85l84k94Q16R01J581L123j414n215j419j365R74L256m96L482J814
6196A940L52p52n62j594O74j997j267j792n93Q02L130L695k284j749N19j069J004
6179a543m67k298l786q11L407K620M16l076j245J827j051N186J379j937n24J04
6163a799o65l406k482Q30L6M15K850N341j775k646L043L977j428k654j330J160
6147e33J541q28K9J339j53J911K074n226n551p71M287P51J644J497j310j194k146
6130b639m664j378j037K283J72j586O276M70q34J504j287n61J739K99J367M32
$$ y = [-1941, 1518, 3681, 3182, 269, 1842, 3550, 3600, 52, -888, -3800, -6292, -3988, -470, 962, 1852, 916, 2560, 5070, 3781, -1620, -1558, -5120, -4560, 1635, 2860, 1122, 2279, 3375, 193, -3848, -3642, -2909, -4105, -3420, -3804, -4098, -3282, -2381, -800, 2323, 909, -4306, -5725, -7090, -6116, -2860, -3356, 126, 1940, 2292, 1540, 978, -616, 58, -1939, -3206, -4998, -5591, -4789, -1659, 2036, -248, -1997, -1478, -2547, -1543, -2010, -4308, -8094, -8905, -5498, -2878, -2462, -5538, -6783, -4956, -6007, -821, 558, -1379, -1903, -1799, -2464, -5870, -8352, -7522, -7486, -7071, -4221, 1120, -655, -3301, -258, 3719, 2291, -363, -1693, -533, 1008, 180, 209, 1548, 1395, 3306, 5380, 154, -5397, -6168, -1881, -1130, 514, 2011, 701, -493, -2639, -7303, -8681, -9718, -7435, -7263, -8849, -2573, -2103, -2937, -1433, -2720, -3281, -1542, -1243, 124, 556]
6114E56j417J140j504k391m3L140J480k036o329j454R04J959M7k150L30k718P0
6097a0416N095P56l929j273M191P41J221J919K635n42l926K92K357k89j775n65
6081c508L73J204j476J337l99k898K018J289K372O33l516l82j807K174M503j034
6065H83J250O35L005p82j526K859K269l153k326p90R99m542n19N92l38L17r46
6048b113P4R58l077J262K311j633K542M01K393J656l507m907k818k80L227P20
6032b791J193q31m31J423J675K971K11l567m29j136k76K386M653k32l165o168
6016d514j946O887M415k775k11J220L22m185k951R57j935o36J283J517R68l20
6000a904j647l280J174M421N21n12j474N69j374L029p03l42K53l84J600j520j671
$$ y = [556, -861, 279, -1225, -3616, -3659, -519, 961, -1075, -7404, -8858, -7954, -5995, -5948, -8098, -7768, -10486, -10416, -5321, -4565, -8494, -9767, -5576, -4835, -3614, -1695, 940, 398, -3528, -3236, -879, -1168, -2943, -3508, -3135, -1931, -3407, -2070, -2469, -5367, -3349, -2060, 312, 945, -2571, -2953, -4760, -2586, 1917, 883, 2133, 2768, 5773, 4991, 3465, 6324, 8593, 5440, 3114, 2324, 3323, -1219, -1738, -1146, -1484, -1167, -2113, -2039, -1081, -4158, -2896, -585, -2218, 324, 725, 3118, 4774, 1267, -3640, -6458, -6738, -3511, -2791, -1598, -2429, -2860, -1437, 238, 3209, 3420, -147, -576, -1712, -1988, 398, 5051, 4819, 1654, -4514, -6460, 427, 4842, 2067, 1856, 3076, 3398, -787, -3738, -2781, -4716, -5352, -4069, -2552, -1584, -1904, -3551, -6831, -5657, -1236, -715, -1227, -2701, -2132, -3506, -477, -1180, -1522, -1269, -1653, -53, -1573, -3244]
5983c244m319K780J274k6l059o13K495L255k1j465k655l059J645j619r30L469
5967f092L741M040L398o25k844l341J790O33l71j138J148l07JK611O44k827k146
5950a685l036K666K202n215K318L809J218m281J11L236J937J769k571n00o021
5935d043J878P32l31R04l54j177k604K09j153p81J442K484l693J451J538O42L967
5918A111N79j586k297M00j195j838N649L151o64j336o593J529L670M269j849q135
5902e135p85M767J4k457m454J113K140N535k438k567J364m255J337L390k129n139
5886i699J185j544j50O39O18O71N003J907m56l755J803L071J50k60M13j17m15
5869i36l818L105L156n127l830Q90J28P13K494P940k6m317l496k588K586j71j460
$$ y = [-3244, -7563, -4783, -3509, -3535, -6594, -7207, -4712, -1457, -1478, -2943, -5598, -8657, -7012, -8631, -9561, -6092, -2351, 1689, 5087, 4462, 1618, -1723, 67, 700, 329, -809, 339, 32, 33, 2644, 3288, 461, -1685, -4721, -2055, 147, -5068, -2750, 1059, 2277, -2004, -1893, 1343, 3280, 5049, 2478, 1978, -4043, -2165, -1433, -1764, -860, -1214, -2391, -4995, -4786, -5939, -6720, -5278, -2794, -6487, -5036, -3498, -2856, 1111, 1690, 104, -2193, -1793, -2988, -4826, 823, 3974, 3310, 1974, -4619, -3090, 580, 4849, 3000, -5135, -5920, -1153, -1139, -3596, -8050, -6937, -4797, 738, -1700, -4267, -2903, -7158, -5821, -2431, -4560, -9699, -8514, -10058, -10208, -9569, -8951, -8280, -3277, -1370, -1826, -5581, -3778, -707, -557, -817, -404, -521, -936, -4754, -1649, 1507, -3620, -7450, -6560, -6432, -5719, -3225, 4715, 4689, 372, -3124, -5712, -3126, -3297, -4757]
5852d757K198J395k894J941p86Q3J194J091j224j450N36K711P40l439n03l301
5836f465m77J596j031J726r18K260K013k619n900j838K702K927M329K846j382
5821b31k408j956J298O652K541j562m042K31K23r13o191l77R94J739QK175L379
5804A560L101L585p71m846l460k633k584P15K88j180J478l262J609L591J407P28
5788f74n75j431m83q28K272l201l468K521K917M055M557p74K15J084k377k95l03
5771C212J159K759r62l411j465j473K37n15j733l012J730J131M04K05r39j723
5755d396j645j232Q58L376L164l004k109l05J370L83k124j831J778K250q44P7
5739d234J587L692p02m635o90K603O725K10l138n501P38K140N118J797P35k9m155
$$ y = [-4757, -2559, -1164, -4058, -2117, -2903, -2820, -1626, -535, -1759, -3209, -2673, 38, 778, -2661, -3164, -6465, -6942, -5346, -6377, -4651, -5569, -3309, -1296, -3915, -9815, -11653, -8951, -6024, -1695, 1151, -231, -2639, -4595, -3297, 3355, 5896, 4334, 292, 523, 746, -167, -6358, -6735, -5741, -4002, -3994, -1819, 1560, 4661, 8246, 7475, 2629, -831, -3464, -6048, -5333, -5045, -6225, -4747, -8009, -6400, -2809, -1402, -674, -1249, -2680, -3163, -3991, -1719, -4920, -8388, -5867, -2950, 1105, 5662, 4888, 5103, 6187, 3810, 3515, 3212, 4371, 7130, 6168, 2757, 1292, -181, 56, -459, -2192, -5204, -3474, -2343, -1939, -1734, -2673, -4396, -6041, -7273, -6415, -3039, 125, -2879, -4988, -5293, -3923, -3540, -5664, -7495, -5717, -3467, -4311, -4234, -2647, 1045, 343, -4292, -4982, -2379, 4346, 4556, 1418, -4083, -3345, -1205, 3913, 5710, 6445, 6416, 2261]
5722B261j716k264k71J182l95Q95J660J296m804l728N632K603k300J572O37j174
5706A086J128N03k684o46k906j055K335j220j031J143J316L962k954l191k048
5691f262j048K311l07J501N897J44n105J43K754J094j693j40J27q99q74K529M540
5674D712q2m609m803R08K712M91k736J192j637k125J80P04J42J110J763R54N88
5657e36J548J087m361o812j698K186j304M116L726j956J563L482p54m26l666j787
5641e592L487J844J223K323k310K3o53k032n875L524O734K541m213k149k157n747
5625i029L048L847L76R79J152O45M3j072j477k018K312K995j107M52Q98j836k774
5608b566j285J038R30L798K60k72J33J737m519p210j796K255K961M18j747J706
$$ y = [2261, 545, -1719, -1990, -808, -1203, -308, 1352, 2648, -2156, -5884, -252, 2351, 51, 1623, 2260, 1086, 2214, 2717, 33, -613, -3519, -4574, -2239, -3459, -4490, -3347, -2031, 1931, -1023, -4214, -6262, -7310, -4999, -5306, -3805, 2092, 2236, -2869, -2726, 28, 1122, -571, -711, -584, -1483, -2357, 172, 4712, 4630, 21, -4782, -3874, -1162, -671, -3407, -2215, -3852, -5977, -5797, -5093, -4951, -3841, -2078, -1124, -536, 1012, 2099, -2262, -9074, -10772, -8586, -9890, -5774, -2048, -4004, -2441, 1041, 287, -139, -3805, -5592, -2105, -261, 962, 3285, 975, 998, 345, -1687, -7562, -4038, 2696, 5237, 1024, -1125, -3282, -9029, -5981, -2134, -1758, -779, 373, 1018, 1061, -11, -1488, -3506, -1194, 1801, 694, 1146, 2044, 208, -2566, -3851, -2813, -1883, 1915, 2175, 1903, 2036, 3773, -746, -7956, -9752, -7497, -4536, -4118, -5865, -4159]
5592d159M154r87j400J816O3p29n13M111K825k613j160j469j166j455j720L829
5576e73J469k253k824k252R94K714O67J027j719L711L48r59k775l422R76P60N44
5559c567K430j379m308j428L297K78K775J810k295j577m259J851O177O19p13P91
5543E02j528j728j991p18j544J401J388L699J076J510q82l822J969M219m236j987
5527b672j278j998K428k95K404k879j464K664L857J665j596L112J381j796k498
5512A035j4k929o64K206K321j345j034m694j595K360K560M602K782m283m936L22
5496c306j926R52j540l50J345k44p32l198J495N581K422K878k083m310p74k147
5480e937l110O48L225J592K678j450j699K24J360P39M526K014K980K182l740k944
$$ y = [-4159, -5, -992, -2392, -576, -513, -1242, -1755, 2356, 5181, 2568, 1408, -61, -1227, -2682, -4402, -573, 896, -1357, -4181, -6433, -5439, -2725, -2058, -1031, -2750, 961, 1309, 350, -2425, -5847, -4871, -4111, -3567, -1137, -2516, -6824, -8252, -4955, -4677, -1902, -92, -2387, -3964, -8223, -6372, -195, 424, -289, 502, -1026, -2754, -4745, -5463, -7007, -5606, -4218, -519, 557, 2067, 1185, -2637, -668, 3551, -685, -2672, -3950, -5948, -3520, -3815, -1411, -4290, -5754, -3090, 767, 2432, 836, 3948, 5329, 3533, 1035, 1021, -1908, -2572, -366, 1955, 610, -424, -5118, -6713, -4353, -1793, 2809, 5591, 1308, -3628, -3306, -5232, -4280, -5820, -6170, -4825, -5069, -5801, -8999, -7504, -1923, 499, 3377, 1294, -3016, -3790, -5937, -9047, -8399, -5174, -3582, -904, -2354, -4053, -3829, -2469, -1730, 2796, 4810, 7790, 9972, 6232, 3288]
5464C288j416M40m105LK950n51j242J181L8L445L751n714n274J836J483k662k749
5447e298j114j569J447J791M444k227P88K498j041l157J909j411m53n17j545L70
$$ y = [3288, 1872, 2312, -1793, -1790, 1160, 609, -633, 548, 586, 4031, 7782, 2068, -3206, -1370, 113, -2549, -5298, -6412, -7981, -6534, -4743, -299, -2526, -1738, 760, -281, -3438, -1529, -2940, -3393, -3910, -5455, -5085]
$$ [...]
##END NTUPLES=NMR SPECTRUM
##END=
