##TITLE=Analysis number 317258
Compound Code tl 00329
Project Code adrs
Chemist Name fudan
##JCAMPDX= 6.0         $$ Bruker NMR JCAMP-DX V2.0
##DATA TYPE= NMR SPECTRUM
##DATA CLASS= NTUPLES
##ORIGIN= Bruker BioSpin GmbH
##OWNER= nmr
$$ XWIN-NMR		Version 3.5
$$ Tue Feb 14 09:35:04 2006 GMT Standard Time (UT+0h)  MAYBRIDGE\nmr@NMR_250MHZ
##.OBSERVE FREQUENCY= 250.131544655141
##.OBSERVE NUCLEUS= ^1H
##.ACQUISITION MODE= SIMULTANEOUS (DQD)
##.ACQUISITION SCHEME= undefined
##.AVERAGES= 16
##.DIGITISER RES= 18
##SPECTROMETER/DATA SYSTEM= dpx250
##.PULSE SEQUENCE= zg30
##.SOLVENT NAME= CDCl3
##.SHIFT REFERENCE= (INTERNAL, CDCl3, 0, 16.522)
##AUDIT TRAIL= $$ (NUMBER, WHEN, WHO, WHERE, WHAT)
$$ ##TITLE= Audit trail, XWIN-NMR		Version 3.5
$$ ##JCAMPDX= 5.01
$$ ##ORIGIN= Bruker BioSpin GmbH
$$ ##OWNER= nmr
$$ C:\u/data/dgb/nmr/ADRS/15980/pdata/1/auditp.txt
$$ ##AUDIT TRAIL=  $$ (NUMBER, WHEN, WHO, WHERE, WHAT)
(   1,<2006-02-14 09:34:42.70 +000>,<MAYBRIDGE\nmr>,<NMR_250MHZ>,
      <created by zg, POWCHK disabled, PULCHK disabled
       configuration hash MD5:
       84 BC 41 DB A1 6E 1D 46 DA 25 12 A5 C1 ED C5 3A
       data hash MD5: 64K
       E2 83 09 82 1E AA 63 97 02 0B F0 EC 12 EA 21 5C>)
(   2,<2006-02-14 09:34:55.08 +000>,<MAYBRIDGE\nmr>,<NMR_250MHZ>,
      <Start of raw data processing
       ef LB = 0.3 FT_mod = 6 PKNL = 1 SI = 32K 
       data hash MD5: 32K
       ED 0C 6F 94 C2 52 94 CD 57 B7 74 57 A1 9C 05 81>)
(   3,<2006-02-14 09:34:57.05 +000>,<MAYBRIDGE\nmr>,<NMR_250MHZ>,
      <apk 
       data hash MD5: 32K
       13 7A 43 90 8F 81 3C B7 7F 22 EB 51 40 45 93 C2>)
(   4,<2006-02-14 09:34:57.76 +000>,<MAYBRIDGE\nmr>,<NMR_250MHZ>,
      <abs ABSG = 5 
       data hash MD5: 32K
       50 D7 42 7B A8 C7 E6 46 4D 99 47 5C DD 06 A5 D1>)
$$ ##END=
$$ 
$$ hash MD5
$$ 4E 7A 33 CD 8D C7 F2 C3 5C BB 77 D0 1D 37 6B E6
##$RELAX= 
##$RELAX= 
##$RELAX= 
##$RELAX= 
##$RELAX= 
##$RELAX= 
##$RELAX= 
$$ Bruker specific parameters
$$ --------------------------
##$DU= <C:\u>
##$EXPNO= 15980
##$NAME= <ADRS>
##$PROCNO= 1
##$TYPE= <nmr>
##$USER= <dgb>
##$AMP= (0..31)
100 100 100 100 100 100 100 100 100 100 100 100 100 100 100 100 100 100 
100 100 100 100 100 100 100 100 100 100 100 100 100 100 
##$AQSEQ= 0
##$AQ_mod= 3
##$AUNM= <au_zg>
##$AUTOPOS= <9 >
##$BF1= 250.13
##$BF2= 250.13
##$BF3= 250.13
##$BF4= 250.13
##$BF5= 500.13
##$BF6= 500.13
##$BF7= 500.13
##$BF8= 500.13
##$BYTORDA= 1
##$CFDGTYP= 0
##$CFRGTYP= 5
##$CHEMSTR= <none>
##$CNST= (0..31)
1 1 145 1 1 1 1 1 1 1 1 1 1 1 1 1 1 1 1 1 1 1 1 1 1 1 1 1 1 1 1 1 
##$CPDPRG= <>
##$CPDPRG1= <>
##$CPDPRG2= <>
##$CPDPRG3= <>
##$CPDPRG4= <mlev>
##$CPDPRG5= <mlev>
##$CPDPRG6= <mlev>
##$CPDPRG7= <mlev>
##$CPDPRG8= <mlev>
##$CPDPRGB= <>
##$CPDPRGT= <>
##$D= (0..31)
0 1 0 0 0 0 0 0 0 0.06 0 0 0 0 0 0 0.0002 0 0 0 0 0 0 0 0 0 0 0 0 0 0 
0 
##$DATE= 1139909681
##$DBL= (0..7)
120 120 120 120 120 120 120 120 
##$DBP= (0..7)
150 150 150 150 150 150 150 150 
##$DBP07= 0
##$DBPNAM0= <>
##$DBPNAM1= <>
##$DBPNAM2= <>
$$ [...]
##$SUBNAM7= <"">
##$SUBNAM8= <"">
##$SUBNAM9= <"">
##$SW= 20.6930455092707
##$SWIBOX= (0..15)
0 0 3 0 0 0 0 0 0 0 0 0 0 0 0 0 
##$SW_h= 5175.983436853
##$TD= 65536
##$TD0= 1
##$TE= 294.16
##$TE2= 300
##$TE3= 300
##$TEG= 300
##$TL= (0..7)
0 120 120 120 120 120 120 120 
##$TP= (0..7)
150 150 150 150 150 150 150 150 
##$TP07= 0
##$TPNAME0= <>
##$TPNAME1= <>
##$TPNAME2= <>
##$TPNAME3= <>
##$TPNAME4= <>
##$TPNAME5= <>
##$TPNAME6= <>
##$TPNAME7= <>
##$TPOAL= (0..7)
0.5 0.5 0.5 0.5 0.5 0.5 0.5 0.5 
##$TPOFFS= (0..7)
0 0 0 0 0 0 0 0 
##$TUNHIN= 0
##$TUNHOUT= 0
##$TUNXOUT= 0
##$USERA1= <user>
##$USERA2= <user>
##$USERA3= <user>
##$USERA4= <user>
##$USERA5= <user>
##$V9= 5
##$VALIST= <valist>
##$VCLIST= <CCCCCCCCCCCCCCC>
##$VD= 0
##$VDLIST= <DDDDDDDDDDDDDDD>
##$VPLIST= <PPPPPPPPPPPPPPP>
##$VTLIST= <TTTTTTTTTTTTTTT>
##$WBST= 1024
##$WBSW= 4
##$XGAIN= (0..3)
0 0 0 0 
##$XL= 0
##$YL= 0
##$YMAX_a= 370327
##$YMIN_a= -373405
##$ZGOPTNS= <>
##$ZL1= 120
##$ZL2= 120
##$ZL3= 120
##$ZL4= 120
##$ABSF1= 16.522
##$ABSF2= -4.171173
##$ABSG= 5
##$ABSL= 3
##$ALPHA= 0
##$AQORDER= 0
##$ASSFAC= 0
##$ASSFACI= 0
##$ASSFACX= 0
##$ASSWID= 0
##$AUNMP= <proc_1d>
##$AZFE= 0.1
##$AZFW= 0.1
##$BCFW= 0
##$BC_mod= 0
##$BYTORDP= 0
##$COROFFS= 0
##$CY= 12.5
##$DATMOD= 1
##$DC= 0
##$DFILT= <>
##$DTYPP= 0
##$F1P= 14.0000005364418
##$F2P= -0.99999901652339
##$FCOR= 0.5
##$FTSIZE= 32768
##$FT_mod= 6
##$GAMMA= 0
##$GB= 0
##$INTBC= 1
##$INTSCL= 1
##$ISEN= 128
##$LB= 0.3
##$LEV0= 0
##$LPBIN= 0
##$MAXI= 10000
##$MC2= 0
##$MEAN= 0
##$ME_mod= 0
##$MI= 0
##$NCOEF= 0
##$NC_proc= -2
##$NLEV= 6
##$NOISF1= 0
##$NOISF2= 0
##$NSP= 0
##$NTH_PI= 0
##$NZP= 0
##$OFFSET= 16.522
##$PC= 1
##$PHC0= 98.14649
##$PHC1= 6.183856
##$PH_mod= 1
##$PKNL= yes
##$PPARMOD= 0
##$PSCAL= 4
##$PSIGN= 0
##$REVERSE= no
##$SF= 250.13
##$SI= 32768
##$SIGF1= 0
##$SIGF2= 0
##$SINO= 400
##$SIOLD= 32768
##$SREGLST= <1H.CDCl3>
##$SSB= 0
##$STSI= 32768
##$STSR= 0
##$SW_p= 5175.98343685301
##$SYMM= 0
##$S_DEV= 0
##$TDeff= 65536
##$TDoff= 0
##$TI= <Analysis number 999999
Compound Code 99
Book Reference 9
Project Code 9>
##$TILT= no
##$TM1= 0
##$TM2= 0
##$TOPLEV= 0
##$USERP1= <user>
##$USERP2= <user>
##$USERP3= <user>
##$USERP4= <user>
##$USERP5= <user>
##$WDW= 1
##$XDIM= 32768
##$YMAX_p= 466344857
##$YMIN_p= -171892
$$ End of Bruker specific parameters
$$ ---------------------------------
##NTUPLES= NMR SPECTRUM
##VAR_NAME=  FREQUENCY,     SPECTRUM/REAL,   SPECTRUM/IMAG
##SYMBOL=    X,             R,               I
##VAR_TYPE=  INDEPENDENT,   DEPENDENT,       DEPENDENT
##VAR_FORM=  AFFN,          ASDF,            ASDF
##VAR_DIM=   32768,         32768,           32768
##UNITS=     HZ,            ARBITRARY UNITS, ARBITRARY UNITS
##FACTOR=    0.157963299565203, 1,           1
##FIRST=     4132.6476996994, 0,             0
##LAST=      -1043.33573715361, 0,           0
##MIN=       -1043.33573715361, -171892,     0
##MAX=       4132.6476996994, 466344857,     0
$$ Real data points
##PAGE= N=1
##DATA TABLE= (X++(R..R)), XYDATA
$$ [...]
17189C2469P68j7430k0166j597K567M419m503K2314m334j5940n954q155q092m948
17175b8582R408M50p197R330L645n095q042J1163K878K195J5033P824n434j5496
17161g920o96J1132n972n759L443k98K78J3008m140j5168J831J94N75o110q628
17146b4230j803K573O735N042K804J1934N23L099q834j2699J0177n220J59J0729
17132I89l914j2841k875J6744J7857o166q710M62K237j1781Q1J4758M759M831
17118A6431j5539p680k652J3292J092L882M244Q83j1130n491K17R240j641K629
17104G777l45m190L37j2954p732r689L480l201k67J4404J3615J242J14o655q305
17089a2369O825j0675m566N039P43j126p452r403o937L750J7224R366o061j0352
$$ y = [32469, 33237, 15807, -4359, -5956, -3389, 1030, -3473, 18841, 14507, -1433, -7387, -15542, -23634, -28582, -19174, -18724, -25921, -16591, -12946, -18041, -26083, -14920, -12042, -9847, 5186, 13010, 7576, -7920, -8616, 2516, -3456, -9215, -5772, -6070, -5792, 7216, 3076, -12092, -10261, -10067, -9492, -15602, -24230, -26033, -23460, -16725, -11683, -8879, 3055, 3578, 6677, -2157, -14856, -4679, -9899, -9740, 989, -2925, -15766, -18641, -1897, 15960, 9794, 1084, 1546, 3783, -7998, -7917, 6841, 11600, 16431, 892, -6788, -9440, 3852, 4944, 8826, 13070, 13953, 2823, -2668, -2451, 6789, 5148, 7777, 7432, 3242, 3579, -9375, -17107, -26796, -23316, -26517, -26784, -12380, 1235, 2477, 2591, -4064, -12369, -5544, -16219, -20785, -15746, -15003, -16129, -23581, -32984, -39921, -36171, -18947, -9581, -15642, -25994]
17075b5994n453L696J1434K627mJ3920k302j9493k421O953J3745q211k557k144
17061a6204j1620L393J09P001J271J4762J1093r773l212n314j044O693o198J5592
17047F549J6298j3257k0394k355P076J1567j2363r437j1881q665j3432J0605J6815
17034b2874L359L236K830M894J6251k244j6892L957Q016l943p96J9287o587j4775
17020f281P605K0727o792j2073p924n676j970O14L840J9125J309m616J44j20j6192
17005h280j9002J5713Q230p550j0932l750Q793J1849j1884k943N415J2843n329
16992f827o293o307P976R433l960r945J1560J9201p45n748P295j687j3009p543
16978f599P162m639k201j657J2320m530m227M305N248n893O777j723K461m358
$$ y = [-25994, -31447, -27751, -16317, -13690, -13694, 226, -2076, -21569, -23990, -17037, -3292, -11503, -14060, -16204, -27824, -24431, -24322, -17321, -16050, -1288, 9805, 32, -3180, -8494, -9538, -2845, -9043, 6549, 22847, 9590, -10804, -13159, -6083, 5484, -6879, -16316, -28197, -36862, -50294, -39689, -22874, -19515, -16279, -13449, -8555, 7696, 5452, -11440, -7483, 533, -3410, -4206, 15081, 8494, -6281, 1324, 22051, 15259, 3186, -4738, -10414, -12384, -11770, -7930, 11195, 12504, 7888, 8032, 7912, -8280, -27282, -11569, -3339, -10889, -21821, -25571, -16778, -4929, -16813, -19756, -14341, -1498, -6827, -13120, -19427, -11451, -2018, -5978, -15923, -4363, 14838, 14093, 8345, 15640, 13953, 944, -6599, 563, -4076, -6277, -7934, 4386, -144, -4371, -66, 5182, -711, 6066, 4343, 6804, 2446]
16964B446o477q065j975J5978Q703l306j012J424j0744p140L894l571q703J502
16950a7046Q387M109N463r9k961O185n791m053K557j332J169Q789L74j8657j464
16935a4370M512j7161N099K0585Q084j3036l818k956l32J1621O397m20k85j622
16921B298M258n258L802q27Q537n955j3231K310J990K710m301p607k344J250k883
16906a5251K10J1970k399k175N302J112k216K405p050l141q339O679R798J481
16892a614L477j5273j882q52q313Q213l443L226J4555J115o794l91n534j3004
16878b6514J900J7379Q274P710P020p36O206q172q910j0964j0661L897l247r66
16864a7784k68J053n058m693R35J0589o227k43J4386Q498j116j1795r780p873
$$ y = [2446, -4031, -12096, -14071, 1907, 10610, 7304, 6292, 7716, -3028, -10168, -6274, -9845, -18548, -17046, -8659, -4550, 913, 814, -2147, 4038, -1753, -5806, -3249, -4581, -3412, 5377, 5751, -12906, -14370, -9858, -27019, -21920, -1335, 6749, -6287, -10105, -13061, -13393, -1772, 4625, 4205, 3920, 2298, 6556, 1298, 5100, 4273, 12810, 6855, -6376, -4066, -2076, 634, -3667, -11274, -13618, -12368, -15251, -15041, -3071, -5470, -7645, -2343, -1231, -3447, -1042, -8092, -11233, -19572, -12893, -3095, -1614, 1863, -13410, -15292, -16144, -24457, -16244, -19687, -16461, -1906, -791, -7585, -7976, -13510, -26514, -24614, -7235, 1039, 8749, 15769, 15033, 21239, 13067, 4157, -6807, -17468, -13571, -16818, -17784, -18052, -16999, -22057, -26750, -25815, -15226, -21453, -21696, -7310, 1188, 72, -11723, -21503, -29376]
16850b9376Q195J8375L219M520q299j1128o702K138m191P851J7197J2237J1274
16837B5310n747k698j0860p909j0250o263J715J0475R085l124j3724k0072q790
16824d2852J4136K3156m206q714M760M281j856m411k708J2994o881k0044M984
16811b7361R138r36J0531K285j1406r776k501J2248J077L954O968j416j7011J7428
16797f778Q369k044l01j3737m339J5217Q08K499O746l855j0907o381L667Q204
16783b832k666q59j2139m469P370J4702P753j2981Q214O184l387O332P679J0172
16769B9073P1j2457q087O623J54m434o291l143Q081l47l35m483n462m56J691j040
16753h42J57m974J823p516o926M943j953m643L299J0406M98r081p737o371R939
$$ y = [-29376, -21181, -2806, 413, 4933, -3366, -14494, -21196, -19058, -23249, -15398, 1799, 14036, 25310, 19563, 16865, 6005, -1904, -12154, -18417, -16702, -6227, 2858, -266, -13990, -34062, -42852, -28716, -5560, -9766, -18480, -13720, -9439, -11295, -15706, -18414, -5420, -12301, -32345, -27361, -18223, -19159, -8628, -6343, -17749, -27525, -30026, -17778, -16701, -12747, -5779, -7195, -24206, -6778, 1591, -453, -754, -14491, -18830, -3613, -2805, -306, 6440, 2585, -8322, -14703, -11036, -2832, -5498, -6357, -18496, -22965, -15595, -893, 6860, -6121, 2093, 8277, 4890, 11222, 18901, 29073, 29144, 16687, 8600, 15223, 15377, 10943, 4652, 1509, 9590, 9243, 8908, 4425, -1037, -1493, 198, -842, -685, -5659, -3836, -11352, -18278, -13335, -15288, -19931, -16632, -6226, -5728, -14809, -22546, -28917, -18978]
16738a8978K5263Q338o470j1977P713J2686j5522k0497j5410M45O171J4991l403
16725a6650p308q337m913K0686Q012j3095P949J3456l927j2257J2990P320o643
16712b717j3182J439j713J0098K753j1112O071o68J4037k955p516q289n89J871
16698a2472O064K73M843k860J342o509k89N47J843j330m901J362P961L140J8530
16683A7544J2082l896j9498p318M339j4543m076L935l89K434Q12l83O966j963
16669c954n972M186J7037k510q876M220p996l711J3476n650j9229n834q28K714
16655b2927J2179J0989r74J2057J8331j2711j5425l239o410J0532P515j1142M954
16642C729P325J3055k755m573P66m259r249N646m938J1850J155n528k040o858
$$ y = [-18978, 6285, 14623, 8153, -3824, 3889, 16575, 1053, -19444, -34854, -34409, -28238, -13247, -16650, -23958, -32295, -37208, -16522, -8510, -21605, -13656, -200, -4127, -16384, -3394, 3926, -2717, -15899, -14460, -16173, -6075, -3322, -14434, -8363, -9031, 5006, 2051, -5465, -13754, -14343, -12472, -6408, -6135, -1292, -4152, -2810, -9319, -9608, -9061, -7218, -8548, -13449, -12087, -4126, -986, 17544, 29626, 25730, 6232, -1086, 3253, -11290, -15366, -11431, -11820, -9386, -8574, -8957, -1991, -3954, -9926, -5740, 11297, 8787, -89, 4131, -3865, -7576, 5900, 250, -18979, -24813, -25641, -22927, -10748, 241, -733, 11324, 29655, 16944, 1519, -1720, -8130, 2402, 9917, -1225, 3729, 11054, 24109, 21354, 16781, 17547, 13288, 4039, 9685, 4747, 16597, 17752, 12224, 10184, 3326]
16628C326j6955m829L447J0307n870L142P201r560j7309J3381K7542k457j7094
16615e728m118l006j685J8566M40j2442P841K723j260K250J1242N325j0029j1579
16601a460j087l059P8K239k057Q3L394m339M546J4293o052j7100n329O640J8658
16586I448J29q220o327j4822k551J5556J4530r5r002L961L51P33K848J44p09J983
16570G957j345m181k123J3011O602j2961n975N184J538j3132n763O284J607j925
16556e222m797r192Q15O012K5624O01j4050j2100j0744K610J1970J2207l813k478
16542b557q461j1315q374J4518J1307J3637Q787M40N023j579L962j1773j3869
16529b54j148j6647j9170J1500O431P2q960J1371J3473J080j9128j7209J4394
$$ y = [3326, -13629, -18458, -15011, -4704, -10574, -7432, -231, -9791, -27100, -13719, 13823, 11366, -5728, -9846, -12852, -14537, 4029, 4469, -7973, -132, 2591, 1331, 3581, 14823, 20148, 10119, -1460, -2547, -5606, -5528, -3289, -5346, -5263, -1869, -6208, -1662, 12631, 6579, -10521, -15850, -9210, 9448, 9577, 1357, -4970, -19792, -22343, -6787, 7743, 7648, -1354, 2607, 2958, 3691, 6539, 6683, 5974, 7957, 6612, 2431, 308, 13319, 19921, 6960, 985, 6169, 7707, -5425, -11188, -4904, -3297, -5222, -10019, -19211, -18396, -12384, 13240, 13841, -209, -12309, -23053, -20443, -8473, 3734, -79, -2557, -11018, -22333, -30707, -16189, -4882, 8755, 17542, 17982, 23005, 21426, 25388, 13615, -254, -1402, -18049, -37219, -25719, -19288, -19216, -28176, -16805, -3332, -2252, -21380, -38589, -24195]
16516b4195O905o521j362O980R037j924o510n946M047O438J7294R044N946J3L92
16501A9638j2985k4370j6065O282O082O811k926j3102j1767Q324J1418J5987o631
16488a3304n141p66R347M4L142P200o660K999j744m467K846m316j2940j342L59
16473b4743J4350J3270J2488k471j9622j955J6805R722p506j6825k3535J2167
16461a7855l332J302K434k494M320K1152O24j6660J484j2132J789L333q464K285
16447b2214J8964J337l081O185O747k751k980n05m808J336j7226j2894l26J2648
16433a9568J7272n75r600o512J7759P65p272l220o412J947r14J4402R891K804
16419A0767k194j869j6138p43R358K1872n62j3857j8852j0165L313J5758j0251
$$ y = [-24195, -17290, -23811, -25173, -18193, -9156, -11080, -17590, -23536, -19489, -13051, 4243, 13287, 19233, 19246, 19638, 6653, -17717, -33782, -27500, -21418, -14607, -17533, -30635, -42402, -34078, -22660, -6673, -13304, -18445, -19211, -9864, -9820, -6678, 522, -6138, -3139, -4883, -9350, -6504, -10820, -23760, -25102, -24743, -10393, 2877, 15365, 12894, -6728, -8683, 8122, 17844, 10338, -6487, -30022, -17855, -21187, -19885, -17451, -19945, -15625, 5527, 6151, -10509, -9025, -21157, -19368, -16035, -24499, -22214, -3250, -1913, -4994, 1191, 7938, 5187, 2207, 1702, -3106, -1770, -18996, -31890, -32216, -19568, -2296, -2871, -12471, -18983, -1224, -459, -7731, -10951, -17363, -15416, -16330, -1928, 7963, 10767, 8573, 6704, -9434, -10177, -819, 21053, 20491, 6634, -12218, -22383, -19070, -3312, -13563]
16406a3563O08J2545n169O264O510r165J6268p425j3224n621j47R478P957o716
16392a400K974o361o863m75K1748M059N373N0j4270J1202k464j3053q771K391
16378e860j230r012Q56p561l640K290k953N57J718Q5Q356J006p813J738l328j2681
16362c7472j96J0720O146j2835P314L3503J0971k945j3930k249J2938J535j2947
16349E53r252M780L843P318l957N931m822j0790K568P778O586p272o236N668L93
16334C089j4210Q137J6238m380r670O437J0015l145j4742m38O414J4234N541o320
16320A7200j2880m935k256j0625q266j360M329J2147J6860J536j1466o33j3882
16307a4231l264L557j0473l791k188p585p50Q812J4369R777l20J4784J568O090
$$ y = [-13563, -12955, -410, -5579, 685, 7195, -1970, 14298, 6873, -6351, -11972, -12119, -2641, 5316, -1400, 1574, -4787, -11650, -12125, 9623, 13682, 19055, 19105, 4835, 16037, 13573, 520, -8251, -5860, -7090, -16102, -15246, -22807, -26447, -24157, -27110, -26553, -24835, -24750, -16394, -15388, -23201, -21463, -24791, -37472, -37668, -26948, -20802, -33637, -26323, 7180, 18151, 15206, 1276, -973, 11965, 13500, 553, -8699, -3919, -76, 7242, 3285, 9216, 4394, -6396, -3828, 3950, 10536, 3264, -2972, 2696, 3089, -11121, -2984, 13254, 8874, -796, 5641, 15656, 12511, -2231, -2669, 3745, 17979, 23520, 17200, 4320, -615, -2871, -13496, -21762, -23122, -18793, -6646, 10214, 11750, 284, -349, -14231, -17495, -13938, -24411, -28202, -30390, -37975, -38725, -29913, -15544, -5767, -6087, 8697, 10265, 16355]
16293A6355m091j2236j0736N612J874m194J2155R216N036q193j6384o131m116
16280a5833J6901J6073n959r095n503J053m140j2495l78J8294P873j4182J1531
16267D140J1327k827j5550j5386j4851m218L872R126J3871l927j641O382K148
16254g534P799J1176n087j758j748q486M187k337j3119o151R56O749Q120M799
16240b434Q300O681M453O482j9552j6089J0956J0184R01j156j4897m671J0437
16227d05J0572J419j088q158r397Q016M772j1156r315J0138P961O362J1486k061
16213A9146l212l755n095m078R180p835j969q695N732K874p115j1236M790K1495
16199A0227k853J830J745p348j9108o347K1746j0217n334M078l762k681J32N004
$$ y = [16355, 12264, 28, -10708, -5096, -3222, -7416, 4739, 13955, 18991, 10798, -5586, -11717, -15833, 1068, 17141, 11182, 2087, -3416, -2363, -6503, -18998, -19376, -1082, 6791, -7391, 4140, 15467, 12640, -2910, -18296, -33147, -37365, -33493, -24367, -10496, -14423, -16064, -9682, -7534, 265, 11441, 6354, 4596, 2848, -5638, -1451, -3788, -16907, -23058, -22102, -15353, -7233, -2434, 5866, 12547, 17000, 23482, 3930, -12159, -1203, 8981, 9882, 8726, -6171, -10842, -405, 10167, 11586, 10498, 2340, -7057, 959, 5731, -5425, -14740, -4602, 3359, 9721, 21207, 19146, 15934, 12179, 7084, 3006, 12186, 4351, 2382, -6313, -581, 2293, -4822, -16058, -11268, 10227, 7374, 9204, 10949, 3601, -15507, -21854, -108, -10325, -15659, -11581, -15343, -18024, -17892, -12888]
16185a2888J6923k720M02P067o066R712p292Q240Q540n013j2457o517J0147M017
16171A2095N710o536r767j9620l833p016N042O834M497K1529r638j1661N924J0487
16157D047P188j1334j0663p377j3615j5474n575K5324J3420R919k704k514m649
16144a4007l233r672J00J2795m01k659j7525p908J8050J0955j569K968j1982p600
16130c1688N824K3061O747q201p76R070p285j559J134N907j699j2639n618J3876
16116c846Q304k413q949Q374L879l336n177j1056q78m627m000J360P324o345O822
16101a4564N694J4231J2743J855q70k899R96j4997r086J332O007l980j638J7217
16087A2041k674m941l18m776L749J0091p72J139j2121P674J505k574j1493M12
$$ y = [-12888, 4035, 1315, 1717, 8784, 2718, 12430, 5138, 13378, 21918, 16905, 4448, -2069, 8078, 12095, 17805, 11269, 1502, -18118, -21951, -28967, -23925, -17091, -12594, 8935, -703, -12364, -6440, 4047, 11235, -99, -10762, -18139, -31754, -47228, -52803, -27479, -14059, -4140, -6844, -9358, -14007, -17240, -26912, -26812, -14017, -14418, -17077, -34602, -42510, -24460, -13505, -15074, -12106, -24088, -31688, -25864, -2803, 3944, -4257, -5033, 4037, -3248, -4807, -3673, 2234, 535, -12104, -17722, -3846, 4458, 2045, -6904, 1470, 5349, 2013, -3164, -14220, -15098, -19725, -23725, -22365, -15041, -21386, -14564, -8870, 5361, 18104, 19959, 19089, 16190, 17186, 2189, -6897, -5565, 442, -3538, -5176, 12041, 9367, 4426, 4108, -668, 3081, 13172, 12400, 13539, 1418, 9092, 10597, 8023, -3470, -3058]
16073c058o680M63J211R807K96J5388m594Q28j1334j840j1770O172J0626p547
16059b032r932J0997J3624J2211j8065l255n589L299k698k2956k420L535J852
16046b1429P903K1641j712l710N63r82n063L650J552J1937j9752k4141R305R07
16032a9331J2097m82n281K417J1593m884o683J0216p511P175N001O89k692o25
16018A699k182Q494J3138q132r756M815j796r761n908l299J7430K464o401j1720
16004a0915R335O063R078Q27p980K261o565j4214p480M295p51Q858J7160P193
15990A7165O739j4932q638j4638j7255P946N635J0149k04n873J93l920O138L1665
15976B0170O86j3634j0087j1609l160M552O966O94r123J6779m339r135K3066J2966
$$ y = [-3058, -9738, -9275, -8064, 1743, 2039, 17427, 12833, 13661, 2327, 487, -11283, -5111, 5515, -2032, -11964, -967, 12657, 24868, 6803, 3548, -2041, 1258, -1440, -24396, -26816, -23281, -21429, -13526, 8115, 6403, 2693, 3256, 2274, -2789, 861, 2413, 14350, -5402, -29543, -20238, -19331, -7234, -7716, -12997, -10580, 1013, -3871, -10554, -338, -7849, -674, 4327, 5016, 2324, 1699, -483, 8011, 21149, 13017, 3261, 8076, 6280, -3481, -9389, -12688, 4742, 7206, 805, -10915, -1580, 4483, 13561, 14388, 6408, 8669, 2104, -12110, -19590, -15295, -16046, -7188, 9972, 17165, 23904, 8972, 334, -14304, -31559, -23613, -17978, -7829, -8033, -13906, -13713, -17633, -11495, 20170, 20856, 7222, -2865, -14474, -17634, -13082, -6116, -5422, -14545, 2234, -2105, -11240, 11826, 24792]
15962B4792J54j37R482r887j4727q362Q71N163j2112m999J2528P525n648j8503
15948a3860m346r705J0444O091j3k367M377N657K125j0806j9642O045J5419K6516
15934A5935n610k875N776j54p569q271P759J849p401n135J4611j2864j3676J1778
15920e847j961K350J122L257k232Q63j4023Q06N13J2605L496k633p800K0565J0323
15905B1404R319N730r071k0340j4341j1167j3015j7123n932K4200J6329q41J3118
15892a730j0953q377J0843J2593m959j18j3278P001R450M977Q070j4092r41j5146
15878a6660l830L367J7686J8848J0266j3393j9181k329J6274N440p701P99l750
15865E836l809r420j194Q413L048o581r530N859l165P592K8863j070j4090j126
$$ y = [24792, 24946, 24809, 34291, 24404, 9677, 1315, 2186, 7349, -4763, -9762, 2766, 10291, 4643, -13860, -18206, -27911, -17467, -11376, -11389, -13756, -9379, -3722, -1597, -12403, -32045, -26000, -10581, 15935, 10325, 7450, 13226, 13072, 5503, -2768, 4991, 6840, -561, -5696, 8915, -3949, -17625, -5847, -7808, -5458, -4336, -1079, -3311, -2448, -16471, -15665, -15152, -2547, 949, -1684, -9484, 11081, 21404, 30723, 36453, 27382, 7042, -7299, -18466, -31481, -48604, -54536, -30336, -14007, -14848, -1730, -12683, -21060, -10217, 2376, -2583, -2701, -15979, -8978, 472, 5449, 13519, -573, -1514, -16660, -20490, -17123, 563, 19411, 29677, 16284, -2897, -5226, 11048, 16488, 8787, 9586, 5836, 2027, -7393, -8587, -174, 2874, -3707, -13237, -7378, -10543, -2951, 25912, 24842, 10752, 9626]
15851I626j0168J3998J4721K324m986n161j2283o452P793n000l073m779j3123
15838a6563m832q399n507J0352J2108O841m790o188K673J2882P191n311p601k057
15824i201K535M665q899P555J6387q553j4548j684m421M32MP912J0396k513r036
15809h969J4387J9242M638p565r039N775m91n969J030L530j994n626r687J803
15795A065K0468j129q969o89j9015l310q57N15Q650p121j2042R17R658K2419P358
15780A7918p405N79N134J190P8K874q042j5155q312P710K8945J118l0300k0383
15766b4051P397p494J608j863N652L580R40P472m835l727o267j3795m71J0874
15752b4980J8925J3965L267k624m153r814k836J2160K765o059N478l968k6508
$$ y = [9626, -542, 13456, 28177, 30501, 25515, 20354, 8071, 1619, 9412, 4412, 1339, -3440, -16563, -21395, -29794, -35301, -24949, -12841, -6000, -10790, -16978, -14305, -1423, 5768, 457, -7144, -9201, -6666, -2001, -10900, -3345, 13042, 4489, -10059, -11743, -16164, -15732, -15728, -7816, 2580, 67, -8969, 5418, 24660, 29298, 21733, 12694, 18469, 17978, 12009, 13039, 16569, 14575, 8949, -738, 1065, 21533, 20404, 11435, 10746, -8269, -11579, -12436, -11921, -3271, -10392, -22434, -21517, -11859, 10560, 17918, 10513, 11092, 16226, 17416, 17494, 20368, 12326, -2829, -11141, -3431, 25514, 26632, -3668, -24051, -16654, -24148, -22540, -24403, -18751, -15171, -14231, -6759, -11594, -15321, -21588, -35383, -35854, -24980, -6055, 7910, 11177, 8553, 4400, -5414, -8250, 3910, 6675, 616, 6094, 2126, -24382]
15739b4382o591Q427o911l1r26J8795J6567j696n071N437j4593j2973R789R379
15725d780j6100q11M980j0521O458J588n92K3788K795m486j3929j909k313Q09
15711a5023K2918J5373j1395K449M144n918k2593j2841K635j792K2306R851j508
15698H606K584o20k2037j0452J0733O154L854J0078k164P674j6569j1536o184
15685a9879m86J8789M636J7090r40m074n259J327o134R856J3051j3144j0901r097
15671e165j5168j1210M375j435P611J0766j0264j5442P67K0965J9883J975j9659
15658a2001n012J0493K199r16p751P291l86o21N568P996L60n853n624P320l333
15643b70j5149j6372N756L392J4185N14l054j077j3685N734j368j3240r109N937
$$ y = [-24382, -30973, -22546, -29457, -29488, -30414, -11619, 4948, 3252, -1819, 3618, -10975, -23948, -14159, -4780, -20880, -21691, -16711, -27232, -20774, -19186, -19778, 4010, 6805, 2319, -11610, -13519, -15832, -15023, 7895, 23268, 11873, 14322, 18466, 12548, -10045, -22886, -20251, -22043, 263, 10114, 8606, 11190, 10570, -11467, -21919, -11186, -5032, -1178, 8900, 6736, 14410, -2159, -13695, -19879, -20365, -1576, 3060, 20150, 19210, 15136, 9877, 11204, 5070, 14926, 27977, 14833, 3932, -5165, -20333, -31543, -27168, -28603, -20992, -10226, -20490, -35932, -35165, -14200, 5683, 7658, -12001, -17013, -6520, -4321, -5237, -12988, -5697, -6083, -6704, -1136, 6860, 7220, 1367, -4257, 3063, -270, -15419, -31791, -26035, -22643, -8458, -7944, -10998, -12075, -25760, -20026, -21394, -34634, -43743, -37806]
15629c7806Q683r037M593N797J0506k290p588o24j441J3853O17j1033p316j145
15615c4231O489O026K987J3370J719o288J332M698l130O30L393K840N04k511K632
15600D60n48N033J4633j2850J570K392J2602K876j9717m935R006J2434j1930q062
15586B964n061m532L459q995o283K1260P664m975p399M423j150j0244j0070j37
15572a9076p333J5585O684Q972K557j3356O035m807M539O192j378J1554L048j5090
15558D126K983N402m058N699o195m834J682J646q054M094O309O373P819Q339N311
15543C6642N761j5577r242q329l553J491n26r211K176n782n534J665j070J1063
15529b6p140O477K018P864J3499p444j4099k349j3884j0763L711K843Q128J7874
$$ y = [-37806, -29123, -38160, -33567, -27770, -17264, -19554, -27142, -27766, -29207, -15354, -14737, -25770, -33086, -34231, -27742, -21716, -18729, -5359, -3640, -9928, -8596, -3898, -7028, -6398, -3005, -165, 339, -2172, 460, -88, 4945, 19578, 6728, 8298, 10690, 23292, 26168, 6451, 1516, 10522, 22956, 11026, 2964, -2097, -6629, -3170, -12165, -18448, 2812, 10476, 5501, -1898, 2525, 1375, -8869, -18939, -19076, -26409, -10824, -4140, 4832, 7389, -5967, 68, -4739, -200, 5992, 4614, 16168, 19216, 4126, 7109, 12511, 8453, 14152, 7957, 3123, 4805, 6451, -1603, 2491, 8800, 15173, 22992, 31331, 36642, 42403, 26826, 17584, 9255, 5702, 7193, 6667, -2544, -368, -6150, -11684, -10019, -11089, -26, -7166, -689, 1329, 9193, 22692, 15248, 1149, -1200, -15084, -25847, -22136, -19293, -11165, 6709]
15515F709J225o64m411K689Q191q911J279J1091Q251J1922j2159p666J4805j1394
15501B0957l17r701p586L735o583J0557k54r963N931l892j0327P604o655m754
15487a1248M905Q525J88l236J475M376j0238P50M394L266k2517j3638J1031P304
15473a4663K227M530n540j1802O776J0525O192P355N771k2073Q664k403j7246
15460b1687Q737Q990J0715j610o73k471l575j2581j0938L748k573J6083Q909j686
15446f12J1192j074j564j4676J1900M685q89n237J426p675q278l540P070k067
15432i339N128J5103J3716q711k241L326o411k334Q485m01O026O182q702r109
15418A0718n855r252j777J4789J5792n032j7791j1691J509J4935P160j846r48
$$ y = [6709, 7934, 7270, 2859, 5548, 13739, 4828, 6107, 17198, 25449, 37371, 25212, 17546, 32351, 20957, 20640, 10939, 3353, 7088, 505, 11062, 10808, 845, 6776, 2884, -7443, 161, -6494, -11248, -6343, 2182, 2370, -866, 609, 4985, -5253, -4503, -109, 3157, -19360, -32998, -21967, -14663, -12436, -7906, -13446, -25248, -18472, -7947, -1755, 5600, 11371, -10702, -2038, -4441, -21687, -12950, -3960, 6755, 5145, 4472, 2001, -1574, -14155, -25093, -21345, -23918, -7835, 1074, -612, 10580, 9506, 7942, -6734, 5166, 9851, 8962, 3725, 5151, -2524, -10802, -14342, -7272, -9339, -4211, 10892, 24608, 15897, 13656, 16982, 10571, 8237, 16722, 16321, 22347, 28529, 19827, 10718, 4863, -4389, -6166, 8623, 24415, 19383, 1592, -10099, -8590, 6345, 13505, 11659, 10711]
15405A0711o87j1662n090L172l443J040J329J6549l091j2184j4892J0641J8958
15392A1351J0733q892p169k150n498j0348J411K2465J4718P713j445j664j2210
15379A9015j0789p944r47R917J426l091j4863m233R588J3635J6932j8564k370
15366G712j3109j0712M678O596J6455J5308Q757j8682l3072J626J4924J7894k558
15353A5817j0336Q562n931O30K291q087k484n295k646M326R857N102j472l209
15339G125l342o70M006j340q621M36P688J5731R482p426j8403j2106J1630o702
15325b512m633J1370M718o427j272r003K661j0612j3065j81N089R752M12K568
15311a1135P816J2343j836j1201J3053J3674q249r210J725K15j4375N760L383
$$ y = [10711, 10024, -1638, -6728, -3556, -6999, -5959, -4630, 11919, 8828, -3356, -18248, -7607, 11351, 22084, 13192, 6023, 3873, -1625, -11973, -10562, 11903, 26621, 34334, 32889, 31225, 19015, 8226, 282, -665, 9252, 10678, 7587, -7276, -11509, -1921, 11714, 28646, 10082, 7712, -5397, -16109, -11431, -4835, 11620, 26928, 35685, 17003, -16069, -14443, 481, 18375, 15817, 5481, 14043, 8112, 8742, 11033, 2946, 462, -4833, -7479, -3153, 6704, 11806, 10334, 7125, 3783, 3113, 7119, 5779, -2842, -2406, 5282, 21013, 30495, 23069, 4666, -7440, 4190, -2512, -7145, 4225, 8943, 2516, 1244, -7759, -5098, -15710, -28775, -28956, -23867, -14115, -13703, -11135, -3319, 9024, 7188, -4013, 9040, 22714, 14465, 5255, 6980, 7195, -7180, -1420, 1963]
15298A963k915q562q279m776j0826m555J0062J1227J3807j2888o148N062o391
15285b3219M450N017J979j1183P696R780k0028r773J3236J3162P732J1761l649
15272F961k0816m723j668K36N942n943J086L225R799j5200p137J6668K2817K885
15258A4132j5378m624n433j079R451J2435L094q628j9653j542L502K4447K897
15245A3621j1467n341k642J1886p710k435m071k205Q860L565J548K971q371j1559
15231a3350n919q636j0293Q765J1353l200O681n829Q845Q65N431N639j127R024
15217H249M057M419K341j0827j9730L161l057k814p642n948P132J6347L080j5044
15203a6276J865Q041l673q054J6207M070n405q302j1588r819q787K557O559R171
$$ y = [1963, -952, -9514, -17793, -22569, -33395, -37950, -27888, -16661, -2854, -15742, -21890, -16828, -23219, -18769, -13752, -11773, -22956, -15260, -5480, -25508, -35281, -22045, -8883, -1151, 10610, 6961, -13855, -18578, -20246, -20010, -14068, -20011, -18925, -15700, -5901, -21101, -28238, -11570, 11247, 14132, -1246, -5870, -11303, -12382, -2931, 9504, 12598, 3970, -15683, -17225, -13723, 10724, 13621, 2154, -3187, -5829, 6057, -1653, -4088, -8159, -10364, -1504, 2061, 3609, 6580, -1791, -13350, -19269, -27905, -38198, -29433, -18080, -21280, -14599, -20428, -11583, -10718, -5287, 352, -775, 8249, 12306, 16725, 19066, 8239, -11491, -8330, -11387, -14201, -21843, -27791, -20659, -4312, -1232, -16276, -14411, -6370, -10043, -18097, -1890, 2180, -3225, -11527, -23115, -32934, -41721, -39164, -32605, -23434]
15189b3434K3939K436K998j8305O559Q160J961O175k48Q873J1141J496j9699k6188
15175a4136q379M695K1181n712q681J472P522m133r266j1357j259J9712M014m500
15161h827J201O39N645Q965L54J860q803N97j8553k0325M43J7839j870K1038J1291
15146A1494j2794j197R566m161q907L957M989K778J0178N758J1510j4012j7197
15133A962R059K564Q35j819j6520j7686p893J2555J5654M436Q653L447j1601N19
15119D165O06l615K880L341p289p661P381J5311j6344p425j813l219P529J1043
15105D890O199m972j4364q69n91N384J0825j141k760j0299r61Q770J4083j0700
15091C494j4695K624Q550j0553Q649k654r127o419J3493J1285o133k0839p251
$$ y = [-23434, 505, 2941, 5939, -12366, -5807, 2353, 4314, 10489, 10241, 19114, 30255, 31751, 12052, -14136, -22515, -17820, 3361, -2351, -11032, -9560, -2038, -6171, -15437, -26794, -28053, -8341, -4327, -8827, -7626, -6987, -1342, 7623, 7977, 9837, 1034, 1631, -16922, -37247, -36804, -18965, -20835, 203, 11494, -1300, -2497, 7069, 2908, -5999, -2042, 2947, 5725, 15903, 21661, 33171, 19159, 1962, 11021, 13585, 14420, 12601, -3919, -21605, -29498, -16943, -1289, 3147, 11800, 15247, 3646, 4165, 4771, 1156, 4036, 7377, 88, -7573, -192, 15119, -1225, -8650, -10463, -13682, -6153, 4890, 11089, 6117, -8247, -9116, -9707, -4323, 6502, 5361, 2601, -7698, -8659, 111, 14194, 3494, -11201, -8577, -27, -10580, -1931, -4585, -13712, -20131, -6638, 4647, -1486, -22325, -29576]
15078b9576J0883m591O276N436o949r12K739J5077P287O203k495j7030m238q134
15064b0024l448n86J0126J374N725J9429n500k1217J550L984k783j883K6639m131
15050I255m047J1445O406k991k713n581j0544P912J8793N027p584m457K088r485
15036A3524P602j3689J62J2132n28j915O206j146j9383j8184m19M45L423L946
15022g824J0078J1534J490j7949P290j6689k526J9347N591m658k157k701J110
15009A936l320j0124o667R725M824K2k467j85N737M044j316k308J3109J2522j3675
14994A1857l286Q52l836n016k376o163k1345Q356J3139O957J3529l658j3635j1484
14980a6109r089J7978n835k0422m4O091M702O48R968O576N919L820l399p902N989
$$ y = [-29576, -18693, -23284, -17008, -11572, -18521, -19433, -16694, -1617, 5670, 11873, 9378, -7652, -11890, -20024, -23472, -24058, -13932, -12558, -6833, 12596, 7096, -14121, -12571, -8587, -11370, -13253, 13386, 9255, 5208, 16653, 23059, 20068, 17355, 11774, 1230, 9142, 27935, 32962, 25378, 20921, 23009, 13524, 21126, 7437, 7599, 19731, 19203, 17288, 23494, 22348, 2965, -15219, -15638, -15193, -11770, -7824, 2254, 13788, 15278, -2671, 4619, -12070, -14596, 4751, 10342, 5684, 3527, 826, 1936, -1384, -11508, -18175, -8450, -3626, -3604, -6071, -6256, -519, 3525, 2209, -99, 13010, 25532, 11857, 8571, 9423, 5587, 571, -1805, -7968, -29313, -20957, -7818, -861, 12668, 9010, -4625, -16109, -25198, -7220, -13055, -33477, -33521, -27430, -22728, -22080, -12112, -5536, 383, 4203, 804, -7098, -1109]
14965a109j721j7647j0111O687O203l782j0531K07J7945N110l514L673P89j035
14951h836M855l625m268m909L146J42O956j6834J943O528j900J2779J2405J2319
14937B0701o872j0263q240j1248N085n685J1506j542m822J9176R546j9092k219
14924c969O016r752O432O167o069m670R667o869O235J3156J412L961j6055j6945
14910a1283Q89o515L320M070K340N858L504l903L719Q901j1284m746O963l33J2698
14895A4198J3642j9315j0825N282j467p878N451j2790k717M302N663r639M962
14882a1131J0477k040l238L281J9726K854m557j4009q574O350N587P108l863j1702
14868c731M765R715J2117K420n865J2422o564r422j3425j4448j117j6126J9094
$$ y = [-1109, -2830, -20477, -30588, -23901, -17698, -21480, -32011, -31804, -13859, -8749, -12263, -8590, -7801, -8836, -3981, -7606, -11874, -16783, -13637, -13495, -6539, -23373, -21430, -14902, -16802, -4023, 8382, 20701, 13829, 3566, -4674, -15922, -10837, -16522, -5016, -6558, -11380, 7796, 17342, -1750, -3969, 2047, -7705, -1273, 4894, -1175, -5845, 3822, -3047, 3188, 16344, 17756, 21717, 5662, -11283, -10394, -16909, -13589, -9519, -7179, -1321, 2183, -1720, 1999, 10900, -384, -5130, 1833, 1500, 14198, 27840, 8525, -2300, 2982, 1515, -6363, -912, -13702, -16419, -12117, -6454, -16093, -11131, -654, -2694, -5932, -2651, 17075, 19929, 15372, 1363, -7211, -861, 4726, 11834, 7971, -3731, 1034, 10749, 22866, 25286, 19421, 31843, 25279, 15857, 2432, -12016, -13133, -29259, -10165]
14855a0165J5880M243j613M777L323p02P55K948o479j1289r997O984o801O19J926
14840e591J123L693p098r855o716P226J3466J288J7554r385n529j2641k2966j4605
14826e0036l173N381J9425J8056Q239K0434K847r203k0327N857O959l681O996
14813G774j0795j1905J1166Q869p315J352J0698j3385r973j6704q50r13K187L070
14799b6724R094J0311o081L556K142O733R690J319j266k108p641O994O353j0552
14785A820J1244N961n489j3203N025p464j2695J4531L40n320Q631j3207k12m01
14771a0439j996J997J2865j570j7642Q943J2817J993k017j1683j3138P368J786
14758a0716J0724k565j925l213K262j391M825J362j352m994O091J4072L199j8536
$$ y = [-10165, 5715, 9958, 8345, 13122, 16445, 15743, 16498, 19446, 12967, 1678, -8319, -1335, -8136, -7517, -5591, -4468, -775, -7873, -17728, -24444, -17218, -3752, -2464, 15090, 5705, 176, -12465, -35431, -50036, -53209, -47828, -28403, -10347, -2108, 18326, 21173, 11970, -8357, -2500, 4459, 778, 7774, -3021, -14926, -3760, 5109, -2206, -854, 9844, -3541, -13514, -30218, -31068, -31981, -29794, -26724, -17630, -7319, -13400, -9844, -7702, -969, 8721, 10040, 8774, 6666, -975, 6019, 12372, 1820, 13064, 19025, 13536, 333, 5358, -2106, -14801, -270, 70, -5250, 3381, -9826, -10038, -10439, -12435, -10438, 2427, 857, -16785, -7842, 4975, 6968, 4951, -6732, -19870, -12502, -10716, 8, -2557, -4482, -7695, -5433, -6824, -1999, -637, -1989, -6983, -892, 13180, 16379, -2157]
14744b157j0639L271l272J2107N184n512j0538J136L289n882j481J3693m944j2053
14730a7798J2353n096j5597J6514J4157P859r981j3566o842j1174R805J1656p981
14717a5691n019L548J166j785j197P708J2377K95K216N179J031r30K571j4928
14703c459j4814J137K09J2899k507N035J2862K2812J2213n193j9480j3024k773
14690E917j6582o609J1376Q897K705P748r882n906K2600R489j6510M755L071m55
14676B0614o601m320M173L858j2792k7353q981P95O261K505J6083l295p078n859
14662b1990n282l509P134J9745J2285j32r175k060P929P526q3j395L077n122J4754
14647B3702N050j0643p803j0093O071K608K717j021j4299L348O956o451l129l00
$$ y = [-2157, -12796, -9525, -12797, -690, 4494, -1018, -11556, -10420, -7131, -13013, -14494, -801, -5745, -17798, -5445, -10541, -26138, -9624, 4533, 12392, 2411, -11155, -17997, -29171, -19366, -7710, -15691, -20710, -17162, -15996, -17781, -18978, -11270, 1107, 1402, 3618, 8797, 9828, 8898, 11469, -3459, -18273, -17136, -16927, -4028, -6535, -1500, 11362, 34174, 46387, 41194, 21714, 8690, 5917, -10665, -17274, -5898, 2999, 5704, 13452, 3570, -2336, 20264, 29753, 13243, 17998, 21069, 20614, 14013, 9693, 13866, 17724, 4932, -22421, -31402, -30607, -24346, -21841, -5758, -9053, -16131, -21990, -27272, -30781, -23647, -3902, 8383, 8251, -924, -2984, 4945, 12471, 12388, 10993, 14070, 8948, 23702, 28752, 18109, 10306, 213, 6284, 8892, 11609, 10588, -3711, -363, 6593, 142, -2987, -3287]
14633c287o52Q812O61Q766p734k656K190j1171j4106n942M784J3821q054L827
14619a0741J1745O786j6775R58o827J294K562J3316J6357j7967j1002m547J3011
14606a830K3953P438l35q794q117J0956O936j1761o185J3798q291K188o275j6333
14592b652o671J05l863n764n8L785k032K497j1119J0170J9407J1171O704P936
14578B9616j561k2582n593P717j451J719n477p123J1295J1668p9j1982r459O393
14564C101K061j2786P003m237N135Q68o456k768J4415r294m469l402o100J4817
14550b112m574J701N439J4861L115j67k552q438Q586p213M807O605L121L447j2063
14535A4563j0974p432J0302J1321o112m622k679p85K777J3501M076k1498j5056
$$ y = [-3287, -3939, 4873, 5534, 14300, 6566, 3910, 6100, -5071, -19177, -25119, -20335, -6514, -14568, -10741, 1004, 7790, -8985, -8027, -14854, -13560, -10998, 2318, 18675, 708, -10294, -14841, -1830, 22123, 29561, 29226, 20432, 12315, 23271, 30207, 18446, 12261, 26059, 17768, 19956, 13681, -2652, -9323, -9218, -13081, -18845, -18903, -15118, -17150, -14653, -25772, -15602, 3805, 14976, 21680, 29616, 28055, 5473, -120, 7597, 6146, 7865, 2388, -4735, 6560, 18228, 18149, 6167, -3292, 3101, 5162, -7624, -621, -4858, 277, 1145, -5311, -8079, 6336, -2958, -7427, -10829, -16929, -2112, -6686, -4985, 454, 15315, 18430, 18263, 15711, 7273, 15859, 8646, 13453, 20058, 23179, 26626, 14563, 3589, -3843, 6459, 17780, 11668, 7046, 4367, 3582, 6359, 19860, 23936, 2438, -12618]
14522a2618N949R469o920q821J1340j0427k108n000O285o661l145O048r74K934
14508a4649n067J9385Q983j4609j7111P794M126L935R013N085P470J8885j0190
14495B3050j8208J117Q886J8749K977j6162j3041n751K05M021J653J337J5482
14482B4315J3992l410J382l480j7259j533J108K80j6968N513J3657N542m63o346
14468A6330j0566k2029j0894J9583L776J778J4889O340k433j607r691l732J0195
14455A1939k321l0415j4771R075J249R491M746J606N738j263L299M663p783r348
14441a4095L091J229K0139N526r660k33p474q728O299J291J2218O178r209r414
14427b842q015J2772J5377m843N167n208j4541p069K730Q476j1735J7180p736
$$ y = [-12618, -6669, 2800, -4120, -12941, -1601, -12028, -14136, -19136, -12851, -19512, -22657, -16609, -17583, -14649, -19716, -331, 8652, -5957, -23068, -15274, -11148, -7213, 1800, 6885, 14355, 33240, 23050, 4842, 5959, 14845, 33594, 36571, 20409, 7368, 1617, 1822, 5843, 7496, 8833, 24315, 38307, 34897, 36279, 32799, 15540, 14007, 15115, 15395, -1573, 3940, 17597, 23139, 22676, 16330, 5764, -16265, -27159, -7576, -3800, -2022, 12867, 19207, 16774, 15167, 5476, 1744, 11939, 9618, -20797, -35568, -26493, -25244, -15753, -11007, -9401, -3663, -4926, -1627, 3036, -4747, -14095, -11004, -9775, 10364, 15890, 6230, 5997, -1477, -10205, -3906, -2615, 9603, 15781, 6572, -2842, -10857, 1915, 17292, 12449, 17616, 12408, -2133, -9202, -6472, 2004, -9731, 7449, -287]
14414b87j0959J4192J0109N728j5469j7002J4219m355L638K714r854L822K808
14401f96m211n094K720o419Q425J2566J712r105K175q519j51L726J582k071P16
14386b644n844j2342m286L096j479N473J4300K0721J2164K612j6j419K826j3147
14372B0015r744j645J626n408n376J2821M431q835j3285o428J7327J4037J984
14359B1520K760o631j4167L391R77j0336j0632j210j0111N090m45j153O642L469
14345a0836O788J6782l487j5272K315m286k6589n023K6101J2056o142j8624m051
14332c0268J2579J3674J651j5514q45J1577K1282N666j9313l576M65N237J6092
14319A8707n897j4843L848K07K96q543n645R969P233p491m645p779j0018K452
$$ y = [-287, -11246, 2946, 13055, 18783, 3314, -13688, 531, -3824, -186, 2528, -7326, -3504, -696, -4907, -10001, -7281, -13700, -5275, 7291, 9003, -102, 2073, -6446, -6597, -2871, -1289, -3360, -2644, -8488, -20830, -25116, -22020, -23499, -18026, -3726, 16995, 29159, 31771, 31755, 30336, 33162, 20015, 10271, 8626, 10252, 4844, -532, 12289, 16720, 7885, -5400, -11828, 5499, 19536, 21520, 24280, 17649, 3482, 6873, 7850, -2486, -13118, -14328, -24439, -19349, -19794, -20947, -14305, -10836, -4048, 12734, 9247, -6025, -3710, -7996, -34585, -39608, -13507, -1451, -7593, -26217, -30268, -17689, -4015, -2364, -17878, -18723, -7146, 14136, 19802, 489, -3087, -2622, 2615, 18707, 12810, -2033, 1815, 2022, 2318, -6225, -11870, -1901, 5332, -2159, -6804, -14583, -24601, -22149]
14305b2149K352N51r35k932Q911L273j905r227j209K3017J9584n343j7984m754
14291h750k577j188Q055n143J0042R033J3962J2741j2831r148p392j9531K356
14278a0371J080P72m524J2580N51J2871k219j1267N294R187L837O397K939o58
14264B6469j5147k5214j1145O346J0690j803n257Q955J1985j0107m790J1305J1922
14251A4209n190k6629r476J0598J1951J7403j2904M860j3052j6600P155L335Q979
14238e361P562p484m23l750j474p584p12M2q77R17J705J3105K868K418n756m301
14222i105L328R904N196j1287P057k493n65J04n949J3008M941o936Q967K7526
14208D3696k834j0128p598r990j6137k531Q571J8640j2465j0972J2121J3552K939
$$ y = [-22149, -19797, -19246, -20181, -23113, -14202, -10929, -12834, -22061, -23270, -253, 19331, 13988, -3996, -8750, -11327, -12515, -4460, -9603, 439, 9472, 23434, 36175, 23344, 14196, 6804, -12727, -10371, -9291, -8519, -13043, -463, 88, 12959, 10740, -527, 4767, 13954, 17791, 24188, 27127, 26469, 11322, -13892, -25037, -18691, -8001, -9804, -15061, -6106, 5879, -4228, -9018, 2287, 14209, 9019, -17610, -27086, -16488, -4537, 12866, -38, 4822, -8230, -24830, -17675, -14340, -5361, 2201, -5283, -5706, -9456, -10930, -18514, -19226, -19184, -20061, -19144, -17439, -4334, -1466, 952, -4804, -9105, -5777, 4127, 9323, -1964, 5093, 2600, 2035, 2139, -3810, 9198, 14139, 7203, 16170, 43696, 40862, 30734, 23136, 13146, -2991, -5522, 3049, 21689, 9224, -1748, 10373, 23925, 26864]
14195B6864n533k5762m338L758O09M602O78J0569J468k354k778j2136n426q601
14181a8380q44J6956j266M039J4483N452j7392j8934m769O570J0344N551J357
14168C167l907j6198J5476O285m499j032m497K342J0203q391l197K477j516J2701
14154I414P668L630j5683k913J2092j7826j4131M470m927m308j946Q623R946P609
14140A718n696r581j571Q448k551j6933M501J2988J1151P19q03M400o448j3911
14126a3569r403N620J2865J9353P44j7546r106N649R306l965m986O547k631M233
14112C111r036n843p702M877K513N418K591L592l54j600j4684k475Q103P950k452
14097e991o649j029K698O260J0440j1544K254K8705J068n514J240j4931M628o437
$$ y = [26864, 21331, -4431, -8769, -5011, -4402, 200, 878, 11447, 12915, 10561, 7783, -4353, -9779, -18380, -19224, -2268, -3534, 505, 14988, 20440, 3048, -15886, -20655, -14085, -3741, 1810, 3167, -740, -16938, -1462, 4823, 324, -708, -5205, -2863, 7340, -1051, -4248, -1771, -3287, 9414, 17082, 20712, 5029, 2116, 14208, -3618, -17749, -13279, -18206, -22514, -24460, -15837, -5891, 1718, -3978, -13559, -15130, -6682, -9233, -26166, -21665, -8677, 2474, 3193, 2390, 6790, 342, -13569, -22972, -17352, -4487, 14866, 15610, -1936, -11042, -5393, 3913, -52, -5038, 1509, -1122, 3111, -5925, -11768, -19470, -14593, -12080, -6662, -4071, -479, -833, -2433, -17117, -19592, -11489, -3539, -5991, -12640, -13669, -10971, -4711, 5729, -5815, -3561, 25144, 26212, 20698, 21938, 7007, 11635, 5198]
14083E198R031l847K579J794m925m767m677K841J1644r739j5076R371N345P170
14069A1942J0412j2993j2980J2956P3N876O076l743M080n923j0157p682J2701
14056A0638J0206p035j7474j6746J349J2303J296k010Q912O298k756M477R09K641
14042A3008j999L115q485J2634N890j8056L341O766n791n958P612N781L128o989
14028A3997j7537l139L674k367k945l051J484O990k325O583J0596J9316q476j9781
14014C019j6730j6168L185O155J6849Q057M617N483j4791K285P922j3311r425
14001a2853J6557J3302O82J0420J095l0153L05J603o825J1420K0009j793j0408
13988A3361k1008j2078K963N331q637m421O525J401J613J601J4172q263r163L319
$$ y = [5198, 14229, 10382, 12961, 14755, 9830, 5063, 386, 3227, 14871, 5132, -9944, -573, 4772, 11942, 22354, 9361, -3619, 9337, 9410, 15286, 21362, 17619, 21699, 15776, 5619, -2063, 10638, 20844, 13809, -3665, -20411, -19062, -6759, -5463, -7473, 1439, 7737, 4981, 9458, 10367, 13008, 11009, 14124, 5639, 18273, 24163, 6107, 9448, 16214, 10423, 4465, 12077, 17858, 20986, 13997, -3540, -6679, -3005, -5372, -8317, -11368, -9884, -2894, -5219, 1364, 11960, 31276, 22800, 3019, -13711, -29879, -26694, -20539, -3690, 4367, 8984, 14467, -324, 1961, 9883, -3428, -12853, 3704, 17006, 17688, 28108, 29203, -950, -645, 958, -5867, 5553, 25562, 23769, 13361, -7647, -19725, -16762, -11431, -20068, -24489, -17964, -16563, -14950, -13349, 823, -7440, -16603, -13284]
13974a3284J0740M327j1969J1699K2770m267j2653k2256o792j225J5377J0589
13962C056P021O795p536p266k645p41r574R86J1265M816j0400m870Q92J5046o762
13947H3k078p60K0204O201l97J542L97j0441n216j7072j3494J4671P061k021K457
13932A137J7231N116m686m15k411n343n540K795n765r915r708l058k195r633J4017
13917a8373J1099n697J866L930k89p9K2679n037j0891j4991p269P099M044M397
13903g512L004J2223J284p59Q932J0497j2091q764M714K544J0470p329j0676l792
13889B745k3462r397J2960O577n805J987K1584J0351k1443j5456J5132L640j82
13876g69J824n513j555K014j406R418j0759l292R082N910k553p236l375O254L457
$$ y = [-13284, -2544, 1783, -10186, 1513, 24283, 20016, 7363, -14893, -21685, -22910, -7533, 3056, 10077, 16872, 9336, 2070, -575, -1316, -10890, -9904, 1361, 6177, -4223, -9093, -8201, 6845, 83, -1995, -2755, 17449, 23650, 23253, 24795, 25192, 14751, 9535, -7537, -21031, -6360, 701, -1320, 1137, 18368, 23484, 18798, 18383, 15972, 10629, 5089, 7884, 2119, -7796, -17504, -20562, -22757, -32390, -18373, -7274, -12971, -11105, -7175, -7464, -7543, 15136, 10099, -792, -15783, -23052, -15953, -11909, -7512, -4508, 7715, 8999, 8240, 17172, 27669, 15578, 6814, 11528, 14072, 24542, 17213, 6537, 2745, -20717, -30114, -17154, -10577, -16382, -14395, 7189, 17540, -3903, -19359, -4227, -587, -769, 1055, -4458, -6013, -3999, -5405, 4013, -6746, -10038, -956, 4954, 2401, -4835, -8210, -1956, 1501]
13861A501j990o213j1266Q490k105n947p695J7111k578J1043M770L969j0401o281
13847g592Q8l158O1Q748O879q909m938O563J1120L687M026N415m250K832J7564
13832C8136K559p174j0377j2752r293k0399J0920j214q417K980L342J2578j745
13819h56N555J2510m42j1826p018j7314J5J3340J1006P103r934J0075l388j3906
13805e080L696M401M597j2245N655m72P870k111l982J2538L933J68k025j200r521
13790F222R527K263J0699j3728j8919K544L356N482j1162J257N812j613M608J0815
13776A7163P257l136J0675q716R94q721j7626K065M302J0002R50L112N720K132
13762B6173r818l070j5246m04J5967K642j168j0124Q708P256k481j8719k420N194
$$ y = [1501, -489, -6702, -17968, -9478, -11583, -17530, -25225, -8114, -10692, 351, 5121, 9090, -1311, -7592, -7504, -10662, -10601, -1853, 5026, -3883, -8821, -2258, 8862, 12549, 16575, 21990, 17740, 20572, 38136, 40695, 33521, 23144, 10392, 1099, -19300, -8380, -9594, -18011, -15031, -11689, 889, -856, 4699, 17209, 16767, 4941, -2077, -19391, -19376, -6036, 4970, 12073, 2139, 12214, 8826, -5080, -1384, 3017, 7614, -4631, 1024, 552, 8422, 6311, 2329, 14867, 18800, 18968, 16943, 15743, 6222, 15749, 18012, 28711, 14983, -3936, -1392, 1964, 7446, -3716, -2459, 3353, 1740, 6348, 17163, 24420, 21284, 31959, 23243, 24237, 15516, -2110, -45, 4257, 14259, 15209, 18321, 24041, 26173, 16355, 13285, -1961, -2365, 13602, 16244, 15076, 4952, 13660, 20916, 18435, -284, -2704, 2490]
13748B490j635j287n824J1053l72p797J920L157k952l451P563n814o24m636R260
13733A051p509J061L471j100n725p490n091r468r040P882O655p014J0354m67P107
13718a5323M277J1464L30l995J3643r028j2290J0345p000j863Q430L054J3488
13705A5532l151j0999K195r892o898j501J444n152l194M373N316J7154j897j450
13691A880O474P259j4049j0977o396K142J1277K846J3757l373k5180j060J5313
13678h7O568L152K230N145J02j4511J0401M386O366j4713j1114Q445J2548M934
13664B3852k0412r316J3132J0771m275r206o349o89O116j996r967j838R768O774
13650F365J286j8490r767o262J660K011j039K1735M358M248k328j4338J7263J7573
$$ y = [2490, 855, -432, -6256, 4797, 4425, -3372, -1452, 1705, -1247, -4698, 2865, -2949, -3573, -8209, 1051, -6458, -5397, -1926, -3026, -8751, -16241, -21332, -30800, -39840, -31958, -25303, -32317, -21963, -22430, -15323, -11046, 418, 748, -3247, 10396, 1368, -10922, -577, -7577, -9440, -1010, 2044, 15532, 12381, 1382, 3577, -6315, -13213, -14714, -13270, -18422, -21616, -17243, -11927, 5227, 3330, 1880, 8354, 15613, 1564, -9413, -15809, -13667, -2390, 456, 14213, 10840, -14340, -15400, -87, 6481, 9633, 11863, 17008, 17110, 2599, 13000, 17386, 23752, 9039, -2075, 6370, 18918, 23852, 3440, -5876, 7256, 18027, 13752, 4546, -1803, -2492, 3624, 1628, -8339, -10177, -409, 6365, 7651, -10839, -20606, -26868, -25208, -23197, -24236, -2501, 1857, 6105, 3777, -10561, 6702, 24275]
13636B4275J475r480j6191j5584R516L567j2544k1390O406R198J1617Q785r6J80
13622b66j585m050K000j0255L31q316n329l582q34J3404J123O451P835q672l285
13607a5030K308J6648q344o475q777j0754J806l18o95m900j0538o451K8325L1180
13593G985L550N048L058k3372j533J3330q515R8O351j627j584j0213o927K965
13579a1386n338N067lM114J0089J495N134J1354J3344j1679j8046j3317j0772
13566a9944J2695J6407J4621l175k9502j2177J1174P931k968n800l213R951M376
13553C76O703l598K042O88l635p677j1415O574n051p058L159J1431J6254m401
13539D392j750j2091J798O657K880n384J5103n96q161K970O131l729o79O738L153
$$ y = [24275, 25750, 16270, 79, -15505, -5989, -2422, -14966, -36356, -29950, -20752, -9135, -350, -446, -266, -1851, -5901, -3901, -14156, -13825, -22141, -27470, -31052, -31886, -18482, -17359, -10908, -3073, -11745, -15030, -12722, 3926, -4418, -10893, -19670, -30424, -28618, -28936, -29631, -34531, -45069, -51520, -23195, 7985, 11535, 16583, 19641, -3731, -5264, 8066, -449, -351, 6000, 4373, 2789, -7424, -14351, -11386, -16724, -11657, -11660, -7546, 2543, 4038, 9172, 20526, 33870, 22191, 4145, -9172, -19944, -7249, 9158, 23779, 20604, -8898, -21075, -9901, -1970, -4938, -10738, -13951, -4000, 376, 7079, 3481, 5523, 6211, 2576, -5101, -16516, -9942, -14993, -22051, -18892, -7461, 8793, 4392, 2642, -9449, -7651, -994, 1886, -3498, 11605, 11009, 2848, 5818, 11949, 8220, 7541, 14279, 17432]
13524A7432Q167j0060j6769K364J666J361r786j3930l377J5836J2233J3161j2661
13511E637j2570J0810n524p951O071J6773m139j1742j947J4173o17j3792P761
13498B943l540k632J912l417j677M876r08o016K372O880J6227J4974j7196j1651
13484C147J4654L740L903L529r279q710k0068R660J4054J620l122M454K61o881
13470A0962o146o608j3201k046o421n073J4419M317j1443M290J6253j158o022
13457g877Q191q349J238P690j1861J0620O317j4036l955M590j1781J9924K7510
13444B8221P386P642j8903o587L516k942k2J3489j148j5552j7581l148n032j2670
13430b3331J2018R872J2116j1059R0o811q321N522R267n921Q025k089l852J3069
$$ y = [17432, 25599, 15539, -1230, 1134, 2800, 4161, -5625, -19555, -22932, -7096, 5137, 18298, 5637, -6933, 3877, -1647, -9598, -3527, 13246, 9107, -2635, -4582, 9591, 8974, -4818, 2943, -597, -3229, -1317, -4734, -6411, -1535, -2443, -8459, -6087, 793, 17020, 31994, 14798, 3147, 17801, 21541, 25444, 28973, 19694, 10984, -9084, 576, 14630, 16250, 13128, 17582, 17843, 10962, 4816, -1792, -14993, -17039, -23460, -28533, -14114, -9797, -21240, -16950, -697, -1855, -7877, 314, -8035, -6797, 893, -10968, -348, 5969, -8067, -12022, -7432, -19213, 711, 28221, 35607, 43249, 24346, 17759, 21275, 18333, 18311, 31800, 30652, 15100, -2481, -5629, -10661, -23331, -11313, -1441, 10675, -384, -294, -7105, -15426, -9904, -637, -6558, 1467, -622, -4474, 8595]
13416H595N178R202k0211J678J1290P851r838j0882j3093j026l391J0908R898
13403F159q243J292L845R513K466J571l540j278n331j1957M333J1095q382o633
13389e090J916j679r934J1965Q798K0627P740j5405o848O16j2672j7797k0811
13376c8574Q473K8930O738O733q542j8171L966J6937K992j5950r251J1519J7542
13363A3342m323j2265J1052n345n914l845r840n373L454m203K011J3081J862o370
13349a2676k3896J1393J6147M344P29J159O363P854m594j0117o713j3023J7842
13336e188J6178j2682R637M526j0272m104P332J8761j374j6692j4778K2105J0150
13323B3599j8989j2585k822j563l713j145J3459J0391j0310l750J0881m342m936
$$ y = [8595, 13773, 22975, 2764, 4442, 15732, 23583, 13745, 2863, -10230, -11256, -14647, -3739, 6159, -2084, -792, 3053, 12566, 15032, 16603, 13063, 11785, 6454, -5503, -1170, 9925, 1543, -5090, -3174, -4853, -14787, -2822, 5976, 26603, 34343, 18938, 12090, 12706, 34, -17763, -38574, -30101, -1171, 5567, 12300, 3758, -14413, -10447, 6490, 9482, -6468, -15719, -4200, 13342, 9019, -3246, 7806, 2461, -3453, -7298, -17138, -22511, -19057, -23260, -21249, -8168, -6306, -12676, -36572, -25179, -9032, -4688, -3959, -2800, 3563, 11417, 6823, -3294, -10007, -23030, -5188, 10990, -1692, 7945, 12471, 2199, -1905, 5427, 24188, 22814, 6122, -8656, 13449, 23599, 4610, -7975, -10797, -12360, -16073, -17218, -3759, 6632, -3678, -7428, 3453, -889, -5825]
13310e825R916M059j84Q44P75K345m918J083J8200P446j1919j8146K302Q105o027
13295H056k4247j606J3937J1864o478k901L253n214j745J0257n816r118q70M601
13281f027j1346R85K4263J6094n104K704P654j1960j9053q933P078M832j19K213
13267C281J2141J466K395l255l34J3126m920p14q007r199P2j855M684J4776K158
13252B5815p03j0558N216J0023N947l544q627k227l6j9184o700Q134N080M514
13238A3150k0147m568J1411j0207O958M951L250k075M244J3273q217n208K457
13225I272q767p521J39p641j5202k326J0364J9472l940l661M150P049J8850P700
13211B7938M14j1000p700l228Q088O330m940j0383q007o965J0092J7221J3655
$$ y = [-5825, 4091, 8150, 7966, 8810, 9585, 11930, 7012, 8095, 26295, 33741, 21822, 3676, 5978, 14083, 8056, -16191, -17797, -3860, 8004, 1526, -1375, 1878, -3336, -5081, 5176, -640, -9758, -10628, -6027, -17373, -16388, 7875, 23969, 18865, 21569, 29223, 17263, -1790, -10723, -3645, 1187, 1068, 3281, 15422, 16888, 19283, 16028, 15694, 28820, 23900, 23186, 15179, 5980, 6052, 4197, 8881, 23657, 25815, 25112, 14554, 19770, 29793, 35740, 32196, 23569, 21342, 21306, 2122, -4578, 3556, 8636, 13150, -6997, -11565, -154, -10361, -3403, 1548, 4798, 2723, 6967, 20240, 12023, 6815, 9272, 505, -7016, -6877, -14518, -29720, -32046, -21682, -2210, -6150, -9811, -5661, 1388, 20238, 27938, 28352, 17352, 9652, 6424, 14512, 20842, 15902, 5519, -2488, -9453, 639, 17860, 31515]
13198C1515j0442j3941r707r870o193J0880K4649j3177L879l542N632Q23j2692
13185b186J360O248k533p274O680N331l700J0781P618q965k329M671r976j2825
13171g099P022K0910P430K176R108L76L676j6466r420K804n303j521j3930l627
13157c864J006R371J5443k064r948o349j131k4128m529M641m074J2756n46J3416
13143@n436M737K995j3027k695n927P82M239p630J3973P444p274K210q100L759
13128i950J0762j3743P043On782m404J0495J0750p452q988O987J667j9592k268
13114b4469J277M676O027K191J2017k373J952J838m493M029L969j42J558J885
13100I942m134J613m711j2959j0660m577L190R463J0591r666L865k592P356O982
$$ y = [31515, 21073, 7132, -2575, -12445, -18638, -7758, 16891, 3714, 7593, 4051, 9683, 10506, -2186, -826, 5422, 2889, -4385, 2295, 7626, 3926, 14707, 22325, 13360, 11031, 15702, 5726, -7099, -77, 20833, 28263, 30439, 39547, 39923, 43599, 27133, 17713, 20517, 15214, 13693, -237, -3864, -2858, 6513, 21956, 19892, 9944, 3595, 2464, -21664, -26193, -21552, -25626, -12870, -13416, 0, -5436, -699, 2296, -10731, -13426, -19353, -18571, -14332, -21962, -7989, -545, -7819, -5609, -13709, -9950, 812, -12931, -5888, -5882, -11664, -16068, -5573, 5177, -2275, -11263, -4276, -2609, -22201, -24469, -23192, -18516, -12489, -10298, 1719, -654, 1298, 3136, -1357, 2672, 6641, 6499, 8057, 9942, 5808, 7421, 2710, -10249, -20909, -25486, -22296, -12833, -2242, -11908, -8043, -10635, -3279, 3703]
13086C703Q273q546j5531j4661J2092K2361J8200j2547n841n830J189P852j3683
13073b969q872o037L77j659p97l79r044J020o328J2011J5563m435J612L558p416
13058a3795K919M784l283m103q421P409J8132k694m586p319L865J9056J4662n562
13044B1064m291j8213p411j168P434O949L292o882P118m635L7K962n464J4059
13030A4851J5120o182j0119n694m654o228Q269K7945J2516O832j5858k7406n622
13017C770k071k424m108j85j0117j0987O163J7955m444l776J283O93P770O918
13003F440r87l149r801o680Q756L36P623q697j3728J2777J4154L059j3529n652
12989i078r185n10J2770l916N347l835j6411P883J8935N533n477J333n905j1861
$$ y = [3703, 11976, 3430, -12101, -26762, -14670, 7691, 25891, 13344, 7503, 1673, 2862, 10714, -2969, -11841, -17878, -17501, -19160, -19957, -20336, -29380, -28360, -34688, -22677, -7114, -11549, -9937, -6379, -13795, -10876, -6092, -9375, -13478, -21899, -14490, 3642, 948, -3638, -10957, -7092, 11964, 26626, 21064, 16773, -1440, -8851, -10019, -2585, 4364, 7656, 774, 7892, 3257, 3294, 6256, 792, 14851, 29971, 23789, 13670, 7976, 3322, -2906, 5363, 33308, 45824, 52656, 36798, 9392, 3770, 1699, -725, -4833, -5018, -15135, -26122, -19959, -2004, -6448, -10224, -8941, -8248, -478, 6440, 5453, 2304, -7497, -14177, -5421, -5085, 2538, -6159, -19887, -7110, 7044, 10103, -3426, -9078, -18263, -18773, -6003, -9919, -4572, -8407, -24818, -16935, 2000, 7533, 2056, 3389, -2516, -14377]
12975a4377O189J8028J2423j570n148q129j6896k797K924J639l962M175J7034
12962I533k900J94J6010j3633o394k34r459k300J0116J650M884J1125k1498n774
12948h680J0453J2985j5963j2376j6099O986Q930J1923J8184P895k276j4151o823
12935I88J208R38n647R580J0943r347k4117n819J5518j0248k659P88J971Q267
12921g636k36q29j2057J4379J8912Q966o015j166n043r145K454J4066j0610p844
12907a804r448l525R603Q406J9409L233j3143N32M094n613j4567j1796L163R190
12893b266P464Q687q429k515K834N100j4214r243l736j10P15k386J0938J0895
12879C734k288j2305m243L035o995L567J5973K560o048p180l165k277J2972J3069
$$ y = [-14377, -8188, 9840, 22263, 20693, 15545, 7416, -9480, -12277, -9353, -7714, -11676, -7501, 9533, 6633, 6827, 22837, 9204, 2810, 2576, -6883, -9183, 933, 2583, 7467, 18592, -2906, -8680, 1773, 14758, -1205, -13581, -29680, -22694, -13764, -1841, 16343, 24238, 21962, 7811, 988, 2196, 3134, -2513, 7067, 18010, 8663, -15454, -21273, -5755, -16003, -18662, -17874, -15903, -7636, -7872, -8701, -20758, -6379, 12533, 21499, 15484, 14318, 9275, 130, 2584, 16650, 6040, -1804, -11252, -14777, -5174, 3232, 22641, 25874, 12731, 13263, 17357, 11744, -2823, -14619, -11456, -2266, 5198, 13885, 5456, 2941, 5775, 10875, -3339, -12582, -16318, -16428, -15713, -18099, -7161, 3734, 1446, -10859, -15102, -12067, -19062, -15495, 478, 3038, -3010, -10190, -13355, -15632, -2660, 10409]
12865A0409J404k3280r747P843N74j0399p434J3659R551j3154K490P390k225M692
12851h227J2251j391q34M549K736l309j5326J4020J4475l491j991j3033k224j4834
12837a6629p271j1435P361J2868K071R104l082q008K175q882J4863L852j3463
12824a6476j6453l675N113J8773O175P917M359M100k251m624p724j8637Mj46k427
12809b5972J0995N697j7635m783R756o842K391N444L342K2262K133M698J2454
12796B3940j3253k9816k371Q697l980K2920K7898p141j4325j1634L691k466L412
12783E572M734l475n714q312r293N048p477L096R92m929k12R735J1210R151j4582
12768d456j627R722j678p11Q093k458K179j3336j8372Q22R042k197m171N302J2749
$$ y = [10409, 11813, -11467, -21214, -13371, -12797, -23196, -30630, -16971, -7420, -20574, -18084, -10694, -12919, -8227, 4024, 2633, 1799, 6348, 9084, 5775, -9551, 4469, 18944, 15453, 13462, 429, -1795, -16629, -23900, -35335, -27974, -15106, -13035, -3931, -7013, -15021, -12846, -21728, -6865, -3013, -16476, -32929, -36604, -31491, -12718, -6543, 1374, 5733, 9833, 7582, 2958, -4766, -23403, -23399, -23545, -25972, -14977, -9280, -26915, -31698, -21942, -28784, -26393, -20949, -17607, 4655, 6788, 11486, 23940, 10687, -19129, -21500, -12803, -16783, 6137, 34035, 26894, 12569, 935, 4626, 2160, 5572, 10306, 6831, 1117, -7195, -16488, -11440, -18917, -15821, -14829, -19758, -19970, -10235, 975, 10126, -4456, -6083, 3639, 1961, 1250, 9343, 6885, 9064, -4272, -22644, -21822, -12780, -14977, -19148, -13846, -1097]
12753a097q353O827M828O123q72O290m604j2972P343O205J1919j60L986P737L252
12738C6452l653j3145m431p166l747k0416k396l691P725J7464N704j5922m593
12725a1815m869Q215J386P110r086j012J0852m293j3884J5966K0497l539K653
12712A8181j659j1863n167p148J91O298N831M218R55j5164m776N986j568J5356
12698I671N718P814q397j2183O754j423L161j368r631R869q633j5834J262J2222
12684i98J6028j1177O228N390J851m157j0603l505j0891K357j522j52q453j661
12670b1265R214R260N237p986J955M807M353N508j340N43J800o247m599L478m314
12655D04Q500j0089o431Q229L956J3352n440j2343j104p333r078K2922J9074n211
$$ y = [-1097, -9450, -2623, 2205, 8328, 7456, 13746, 9142, -3830, 3513, 9718, 21637, 21477, 25463, 33200, 36452, 32799, 19654, 15223, 8057, 4310, -16106, -18502, -22193, -14468, 2996, 8700, -7222, -11815, -16684, -8469, -7083, 27, -9059, -10071, 781, -3512, -17396, -1430, 19067, 15528, 18181, 16522, 4659, -508, -7656, -7465, -1167, 4664, 8882, 9837, -5327, -10103, -4117, -5685, 9671, 15389, 23203, 14806, 2623, 9377, 7954, 11115, 9747, 116, 9985, 1352, -14482, -13220, -998, 15030, 3853, 10081, 15471, 17322, 13165, 2562, -943, -11834, -9477, -10999, -11151, -19604, -21265, -12051, -2791, 2446, -5540, -3585, 1222, 5575, 11083, 9743, 10286, 12086, 5839, 1240, 4718, 404, 8904, -1185, -7616, 613, 4569, 17921, 12481, 138, -966, -8299, -17377, 5545, 24619, 19408]
12641A9408j0437O631O922j0707k954K5J1892j3031k0385K620J4197K302Q64n94
12627F753K03n295l616R10O493l980l346n319k068J0082q215J188J894j3149Q145
12612i320J0173Q432O382J0255O990q687n920j409m486J328j1741j047J0647M769
12598A6366j0276J538k569k4350j8648O054P81N699Q601Q152n612l14j832N068
12584a1342O403J090J0420r6k005j31q88K83m94j8787j87n754o621J898J3926
12569a2285l757K874K672P747M406J3960K0307p777j2610O870P412l991K21N108
12555C1157j6215j0655L985L418P141j2310k7456k675j3315k700P763L524J5473
12542a2865L881K376M536K239N946r044J892R384m438K550p293r347R109P47j4171
$$ y = [19408, 8971, 15602, 22524, 11817, 8863, 8888, 20780, 7749, -12636, -10016, 4181, 6483, 7347, 6753, 6956, 1661, -1955, -1045, 5448, 1468, -1878, -7197, -9265, 817, -7398, -6210, -4316, -17465, -9320, 853, 9285, 15667, 25922, 32912, 24225, 18305, 16896, 12410, 13738, 1997, 950, 11597, 16366, 6090, 7628, 5059, -19291, -37939, -31885, -31104, -25405, -16804, -8652, -14264, -14578, -16410, -11342, -4939, -3849, 6571, 6475, 4470, 4339, 3451, 3734, 3240, -15547, -15734, -21488, -28109, -26211, -12285, -16042, -13168, -10496, -2749, 1657, 15617, 35924, 28147, 15537, 22407, 29819, 25828, 26049, 31157, 14942, 4287, 8272, 11690, 18831, 6521, -20935, -23610, -36925, -39625, -31862, -28338, -12865, -8984, -6608, -2072, 167, 6113, -2931, -1039, 8345, 3907, 6457, -836, -10183, -1074, -327, -14498]
12527a4498j29p958P452L0003Q314j0266j3957J218K6079j0218p775R094r105
12514H254o785J858J988P251l018L850k76J4550J0231p259p146o208k957J2033
12500B6366J1843m903L40j6470p005l953N314j413J192j9143L219j606j053n358
12486a2630N851J5028j3564K391O127J4462J8194p229j5141R015N550O409j345
12473C3118j5298j0406m071K836j969J17j116k870n407Pn234R345k973P903R381
12458A3363n557L945o206k0862r047R96O639Q25p268P956J0060l857j734Q369
12444b378K242N308o073r397J7659R116j3799K72J3356j2363r698q216n81M523
12430a0029J1932N229M85l903M189k0507m179M673P151K133j152J6165O295j4823
$$ y = [-14498, -14627, -22585, -15133, 14870, 23184, 12918, -1039, 179, 26258, 16040, 8265, 17359, 8254, 1469, 3327, 5315, 12566, 9548, 13398, 13122, 27672, 37903, 30644, 23498, 17290, 14333, 26366, 38209, 33306, 33646, 17176, 10171, 6218, 11532, 10119, 11311, -7832, -4613, -6219, -7272, -12630, -6779, 8249, -5315, -2924, 3203, 17665, 35859, 28630, 13489, 22504, 28054, 34463, 33118, 17820, 7414, 3343, 6179, 4210, 4327, 3211, 341, -5066, -5059, -10293, -948, -3921, 3982, 13363, 7806, 11751, 5545, -15317, -24364, -23368, -16729, -15904, -23172, -15216, -5156, -9013, -10747, -2378, -136, 5172, -901, -10298, 7361, 16477, 2678, 2950, 16306, 3943, -5755, -13971, -14552, -10029, 1903, 7132, 7617, 3714, 7903, -12604, -16783, -12110, -4959, -2826, -3978, 12187, 18482, 3659]
12416C659K601J1390j545k724n967J8403K440P853L622N106R68N899j2014j7593
12402B2098n79R934M450j5951j0543j6M426R5M212P418k446j626j3944j213O987
12387A3302J0995q632r511L667M406P475J3775j3266q347R775n172j3869p462
12374b864O114R817J0117r733L316L133J07J22r924p36l697r0L006J0911M043
12359B3642R24j2850N800m373k2317O496J7588j123j1668m494p612n217J5446
12346B42J2473J3425j040j0592j1637J649L953l268l096N451j0825L033J1328
12333A1096J3518K074j728j7978j4568J8617R750m048j6674o844n071n103M389
12320a2570N694P258R047J0225j9955o575J738m470R532l258k417M199j3687J2254
$$ y = [3659, 6260, 17650, 16105, 13381, 7414, 25817, 28257, 36110, 39732, 44838, 45806, 51705, 39691, 22098, 21519, 31453, 35903, 19952, 9409, 9393, 13819, 13914, 18126, 25544, 23098, 21472, 7528, 6315, 13302, 24297, 15665, 6154, 9821, 14227, 21702, 35477, 22211, 13864, 23639, 18467, 4598, -2864, 3250, 13067, 23184, 13451, 16767, 19900, 20007, 20129, 10205, 9469, 5772, 5682, 8688, 19599, 23642, 24566, 11716, 17516, 13143, -9174, -2678, 14910, 13787, 2119, -2375, -9987, -15204, 242, 12715, 26140, 25100, 14508, 2871, 4520, 8473, 5205, 2109, 7560, -3265, -232, 11096, 24614, 26688, 24960, 6982, -7586, 11031, 20781, 16733, 59, -6785, -11856, -16959, -12570, -6876, 382, 9429, 19654, -301, -6876, -5138, -9608, -76, -3334, -5751, -1552, -15239, -2985]
12306b985Q781O274P849j0441K058R483j0226P218M518j6892j1594L341l2l020
12292e668J2078K904k65j803N049J2228M444O455r523j7451o808P040N367j113
12278A2934j170M725j0657r804J1538O761j062l937Q663J832j0701j2187R623
12265F558Q613k965J0372O221m960m173P024p134r476r734M157j219P540J3046
12251B3870n212l476J49j7317j4175O515M739K531N033J004L264N80K482M887
12237A4874K0544M549r433p596n139j420K472j1723r342J283O956P405J260m057
12223A0633P886Q224m20j5401r086j8078p791P494Q498J7350J3898n224j0810
12210G173j7168J275K9690L442j2654K3943P11j3122r599l151O596O822j1310
$$ y = [-2985, 5796, 12070, 19919, 9478, 11536, 21019, 10793, 18011, 22529, 5637, -5957, -2616, -2648, -5668, 6410, 9314, 9049, 7246, 12295, 24523, 28967, 35422, 25899, 8448, 1640, 8680, 14047, 12934, 11764, 16489, 5832, -3972, 7566, 14327, 13265, 9328, 17991, 19823, 9122, -3065, 6558, 15171, 12206, 22578, 28799, 23839, 19666, 26690, 19556, 10080, 346, 4503, 3284, 10824, 23870, 18658, 15182, 15331, -1986, -16161, -9646, -4907, -2376, 2657, 3661, 6925, 7505, 9987, 14874, 35418, 39967, 30534, 22938, 17799, 16379, 18851, 7128, -2214, -931, 6025, 13430, 14690, 10633, 18519, 26743, 26323, 10922, 1836, -16242, -24033, -16539, -8041, 9309, 23207, 17983, 7173, -9995, -8720, 20970, 24412, 11758, 35701, 36412, 23290, 13691, 10540, 17136, 23958, 12648]
12197A2648j1163L14P810l81J697l964P150K798q092J3429j504l731j0738r386
12183c113N819Q553K956o113j0316J1732J4140o155Q725M339Q041M181k30m785
12169C7774k815r262K225R04K121J2621r171j4261r594J226R483l7r175r904O412
12154H547J0082l88o207p00j8086k615J1658N234J378N621Q747R265P025r208
12140C0353o166J2971J1630j3761q251K433j3566j2563q22J9770k301j807j0894
12127G026l645L633K781l206l092m707M99k523L460L056O768j3463k030J0731
12113E288O111J3166j5568r006J3461j7072n582M011J308J210M05k377M44o854
12099a1055J365L598M70J7296Q090O16j0459J3484R100j1284j3129j4702j7938
$$ y = [12648, 1485, 1799, 9609, 9228, 10925, 6961, 14111, 16909, 8817, 22246, 20742, 17011, 6273, -3113, 2706, 11259, 14215, 8102, -2214, 9518, 23658, 17503, 26228, 30567, 38608, 42789, 42559, 37774, 34959, 25697, 27922, 28826, 30947, 43568, 34397, 20136, 10542, 11768, 21251, 21214, 12039, 2135, 8547, 18629, 18241, 12034, 11334, -6752, -9367, 2291, 7525, 8903, 14524, 23271, 32536, 39561, 30353, 24187, 37158, 48788, 35027, 26776, 29209, 15643, 3080, 2258, 22028, 19727, 17920, 7026, 3381, 7014, 9795, 6589, 3497, -1210, -711, -3234, 226, 3282, 10050, -3413, -5443, 5288, 11399, 24565, 8997, -9, 13452, -3620, -9202, -5191, -3883, -2673, -2268, -4645, -4201, -11055, -9690, -6092, -5622, 11674, 19764, 20380, 9921, 23405, 32505, 21221, 8092, -6610, -24548]
12086b4548k328J5234P66M255J7227L220j1916k985J4875p638n403J0614p19J4561
12072B5215r291j7099r900L842K372O359n227R27K087L318o67N497p313j0130
12058a0010l449J117J2137J5033j561p173J445k2896J943J7524J8067o391r908
12045E878r736k542J2707N781J241l795j0093m197j049N155K0086M295j6170j6036
12031h475j0933M907J1661Q810K945p031m514m850M201n673N752J4348j2032l881
12017d765J4855J1200r190q292r253j1395R689R136J442n491m320P588M504o165
12003d57l995r039n716l201M282K27J0397K1443J9617k273P068p345o914k997
11989B1097q456n949j4137K08J5022J0803l193m677K243n560n380p152J0752O644
$$ y = [-24548, -26876, -11642, -10876, -6621, 10606, 13826, 1910, -1075, 13800, 6162, 759, 11373, 10654, 25215, 15924, -1175, -11075, -7233, -4861, 1498, -3729, -2802, -715, 2603, 1936, 7433, 120, -10010, -13459, -12342, -205, 14828, 13267, 6094, 7539, -15357, -13414, 4110, 22177, 15786, 5878, -3858, -6400, 6307, 12088, 13329, 9534, -559, -4756, -5805, -650, 19436, 23731, 7561, -8475, -19408, -14501, -2840, 5970, 8915, 1884, -2630, -7480, -3279, -8952, -3200, 11148, -884, -4765, 10090, 21290, 12100, 3808, -5445, -16840, -7151, 1985, 3427, -2064, -6384, 1204, 5708, -457, -4452, -13491, -19207, -22408, -18126, -17899, -7502, 13941, 33558, 31285, 38353, 31008, 24094, 21097, 12641, 6692, -7445, -7237, 7785, 18588, 15395, 10718, 12961, 7401, 2021, -5131, 5621, 12265]
11975A2265O449n096o026p044O761N835M850J1388N996j0417l219j3187j3099
11962d544J6175J3990r241j4478J052O872k501m194J2033Q363k496l96m487m814
11948A1334j0843K172J185j033n247m603K240Q360J2280R286l305j3446p540j5606
11934a4766J953r980L467R067K706j5055q140l782m281J8897Q181n654J3607K270
11920a510J48n847j3132k186Q955P167J7271O956Q661j9345o692P201O002L481
11906A7130l37j4731j2250Q682J0272j1397m095N689q853k054M107Q106M406L399
11892H074J253R34p407M968Q817L7j2230l297L0684o97r017l000j0889j8612N696
11877d686J3000k367P329p05p759l592O607O732r294L585m335n476q091J2412
$$ y = [12265, 18714, 13618, 7592, 548, 7309, 13144, 17994, 29382, 35378, 24961, 21742, 8555, -4544, 11631, 25621, 16380, 1902, 2954, 9826, 7325, 3131, 15164, 23527, 21031, 20635, 16148, 11334, 491, 2663, 3848, 2815, -2432, -7035, -4795, 3565, 15845, 25131, 21826, 8380, 840, -14766, -12813, -22793, -19326, -10259, -7553, -22608, -30748, -34530, -38811, -19914, -11733, -17387, -3780, -1510, -1362, -7209, -20341, -22527, -13572, -6405, 10866, 17822, 26483, 7138, 446, 7647, 13649, 17130, 16793, 2062, -10188, -1506, 8766, -2631, -6726, -1037, -9890, -11944, -7837, 269, 4675, 8074, 9327, 10261, 2854, 7822, 16639, 16676, 4446, 1149, 31833, 31136, 22119, 19119, 8230, -10382, -4686, 8314, 5947, 13276, 12571, 4812, 1220, 7827, 14559, 5265, 8850, 4515, -961, -9052, 3360]
11863C360N030j148M479o065l840K01j1106K121N434j84J1127j320k2700O983
11849g628K6606Q829p011o315k399m137o825L593J105l171p607j1707M458J1741
11835d68O278o111P775j1095q299K3730K0375k825j0303O452J295n172r235o32
11821A1765M308J3563j1138K469J1515l464l379j9248J4105J631r281M260k614
11808A4492l268J0123N463m570k4570m720J5468Q777J217o867j610k737O40j965
11794E873M639O709n195j2213n680rk615J6792n624q270k068R420N442R47J2699
11779B0847j0835n791M974j0000Q191P725l830L743l450j5711N544P184J5751
11766B4342J148o505j948J2196J4726m650j8604j2563K646k844m760j2762R002
$$ y = [3360, 8390, 7242, 11721, 5656, 1816, 2017, -9089, -6968, -1534, -1718, 9409, 8089, -14611, -7628, 18978, 27807, 20796, 14481, 12082, 7945, 1120, 4713, 5818, 2647, -4960, -16667, -12209, -468, 5810, -301, 7474, -3621, -11920, 11810, 32185, 29360, 19057, 25509, 26804, 21632, 12397, 11765, 16073, 29636, 18498, 20967, 32482, 29018, 25639, 6391, 20496, 22127, 12846, 17106, 14492, 11224, 21347, 26810, 22240, -2330, -7050, 8418, 17195, 18412, 11545, 9935, 7198, 7838, 5873, 10512, 17221, 12026, -187, -5867, -5876, -8491, 8301, 2677, -5593, -7661, 1759, 7201, 8148, 20847, 10012, 4221, 9195, -805, 7386, 15111, 11281, 15024, 11574, -4137, 1407, 8591, 24342, 25490, 18985, 17037, 29233, 43959, 39309, 20705, 8142, 10788, 7944, 3184, -9578, -576]
11753e76j630l55J329j259J1471N505J566j4529p823J3233j0642K522R618L727
11739A2157M461q607M254J51j5824J658J5107p255K779N636r979j0970K636P143
11725C347j1459J4853K4032k1744n211P103J732J2185J9478q179j1618K797j3345
11712A3971o058Q025O708P423j2887p204K537P357L672L916k608o426j3554j2353
11698g481L713J6422q030j9275L296m288Q029N587m75K750q38Q323r25j6847j139
11683a1178J4401J8100J0114q617q858K702l216j1192j135O499j797j212Q26O836
11669A2273M171k725L055K034k30j392K265j6352j5892p361R018m0J3320J2877
11655A5021k543n179J072Q8L92J1774J955J808o97L411n666l36N69l370j7804
$$ y = [-576, -2206, -2561, -1232, -2491, 8980, 14485, 16051, 1522, -6301, 6932, -3710, -1188, 8430, 12157, 16618, 8011, 12265, 12416, -3408, -1750, 13357, 6102, 8881, 14517, 4538, -6432, -3796, 3347, -8112, 6741, 30773, 9029, 3818, 10921, 12653, 24838, 44316, 36137, 24519, 27316, 13971, 7913, 15938, 22646, 30069, 17182, 9978, 12515, 19872, 23544, 27460, 24852, 18426, 4872, -7481, -3768, 12654, 4624, -14651, -11355, -15643, -7614, -2027, -2502, 248, -590, 7733, 6808, -10039, -11178, 3223, 21323, 31437, 22820, 13962, 16664, 13448, 2256, 1121, 7620, 5823, 4611, 5437, 12273, 16444, 13719, 16774, 18808, 18578, 17186, 19451, 3099, -12793, -20154, -11136, -11176, 2144, 15021, 12478, 7299, 8371, 8459, 8851, 20625, 22580, 24388, 23691, 27102, 21436, 21100, 21669, 18299, 495]
11640D95K707M365Q350j4500j4293J114q200M680J7619J4634J4054k165j1798
11627A7062r449k756q901N57N643J0253m953k918P556R33L858n850j0958Q454
11613H531K882q317J146Q563j1225j5512l430l376q803J3011K0564L685l179m211
11599C29L421q773r426J2601J524J0095L679j6099j2877N397K4708R599r545k806
11585A1827o793n456R43O842J0941K271j1468j3186n024Q502K0053L553q257k564
11571A2184J929K050M253p508p422m555J855J0768K588j5290j7430K062L006o452
11557a7962o16J7330J0972J098J468q51j2325J0863K0668R543k794o486r2M883
11543C5699o368N745o376k1093R248j076Q65l028q67o602k3085J1960K3315M293
$$ y = [495, 3202, 7567, 15917, 1417, -12876, -11762, -19962, -15282, 2337, 16971, 31025, 28860, 17062, 7613, 4857, -4044, -3487, 2156, 12409, 7456, 4538, 12094, 13027, 16885, 11035, 77, 8531, 11413, 3096, 4242, 12805, 1580, -13932, -17362, -20738, -29541, -16530, 4034, 7719, 4540, 329, 3750, -5023, -14449, -1848, -324, 9771, 13450, -2649, -15526, -10129, 14579, 24178, 14633, 11827, 5034, -422, 521, 7363, 18304, 20575, 9107, -4079, -9103, -601, 19452, 23005, 14748, 12184, 14113, 16163, 20416, 12908, 5486, 931, 2786, 13554, 16142, 852, -16578, -14516, -11510, -17962, -18578, -1248, 9724, 10822, 12290, 11439, -886, 9977, 30645, 40188, 37394, 30908, 30816, 35699, 29331, 35076, 28700, 7607, 16855, 15779, 16644, 13616, 12749, 6147, -16938, -4978, 18337, 22630]
11529B2630q964j3126j4009K684J2608J6576o171l83K211Q028J2127N496j1148
11516B8559p688n912m942K517Q259j978l194K812o538m397j3798J2210J4976J15
11502B1001o119n397j5120j1868J2612J2255j115J984j185j058P528p547j4377
11489h406k57O08K512P552q775L317R887K338Q94Pm714N478J3047k521r139j2523
11473f95k984J4455J7449j478l620J014K125j5795j6230L117k347R221J9172J4560
11459C7964j2440k1284j4545r014p74m692J4646R317J8525J8630M01o241m839
11446B5654l630n990J0816J5475n29k5038j1305N32O211O261R998m236K159q541
11432A7837r970o307J0809R646O291o507j4355n307O200K3600J361k5842J374
$$ y = [22630, 13666, 540, -13469, -10785, 1823, 18399, 12228, 11845, 14056, 22084, 34211, 39707, 28559, 20871, 14959, 10017, 12534, 20793, 18815, 15621, 18433, 11895, 7498, -6300, 5910, 20886, 21001, 14882, 9485, -5635, -17503, -4891, 7364, 6249, 8233, 7048, 5990, 13518, 5971, -8406, -8663, -8055, -5543, 2009, -6766, -3449, 6438, 8776, 9670, 9677, 4963, 10441, 23488, 20967, 11828, -695, -3679, 10776, 28225, 26747, 23127, 24141, 26266, 10471, -5759, -2642, -4989, 4232, 23404, 37964, 25524, 4240, -10305, -19319, -20093, -24785, -10139, -822, 17703, 36333, 36734, 30493, 25654, 22024, 16034, 26850, 42325, 41796, 16758, 5453, 5985, 12196, 18457, 28455, 24219, 26378, 17837, 7867, 1560, 12369, 22015, 28306, 21799, 7444, 2137, 8337, 31937, 33298, 7456, 8830]
11419H830M621j356N522O022l672N049N798r771m207p513q379j6929l823J1767
11405h041L630J493R786L835j0223r91q533j787J1356L48j4798J3679P450l85
11391F819j443p327Q48j0111N005Q188J3659k41O116K102q431r648l12k720k075
11376D29O265n201N62p20l79J760K399k682k037m72q922J4536Q074n425m16O695
11360A4466J4964J075q317n988N466q433j4166o445R178p575J643J0047n953k450
11346b488K860j01J2062R162M403o772O393O698J555Q293k449j0209j7933r126
11332B348M903k1153K070K3354J1426l94L610n717p2j2060k229J0611M998j0459
11318A1236l33P077R858j5102Q119m446n127j546r754J6302O668K881N093q336
$$ y = [8830, 13451, 12095, 17617, 23639, 19967, 25016, 30814, 21043, 16836, 9323, 944, -15985, -19808, -8041, -4411, -2918, 6868, 10703, 480, -511, -9044, -10831, 525, 873, -13925, -246, 7204, 6819, 5376, -1951, -1103, -11214, -6209, 1979, 15638, 15397, 21513, 23615, 15184, 5536, 5224, 2504, 429, 6694, 1493, 2055, 1335, 956, 2716, 5115, 2433, 396, -76, -8998, 5538, 13612, 8187, 7771, 14466, 29430, 30505, 22188, 16200, 21666, 13233, -933, -7378, 1800, -5775, -4132, 5915, -38, -2488, 372, 271, 12333, 21495, 25898, 19126, 25519, 32217, 33772, 42065, 39616, 29407, 11474, 2348, 7251, -13902, -11832, 11522, 22948, 22554, 26164, 20447, 20375, 8315, 6086, 16697, 21695, 11236, 10903, 17980, 27838, 12736, 20855, 16409, 11282, 9736, -18, 16284, 22952, 25833, 30926, 22590]
11304B2590p799j0426k489p102J6644L357m862K800j2099M197j098K0280K2028
11291D6021n86L41n854q342k469O437J832K19j8890j048k524q401M416O250N3
11276A7455j023P055O580j6747m925J7019R049q906J31j0491j125o395Q780m782
11262A1675o304J0691K5252Q24p450j5074n00M324j1077q853K3310N212j5011
11249A7019m062m864l210l381R724j639J8320N054j5100J612J0925M531N069r367
11235C0631J987L624p568q268j5646o944j106O266J7838J0408j171J0875N40j1653
11221B9813l953O305l834J1988k935k0391o403J1623l898J3123K8692P898j4237
11208E3791l959j0692m647l411q997m066J1954l993j5893o3J3733K586J454O660
$$ y = [22590, 14791, 4365, 1876, -5226, 11418, 14775, 9913, 12713, 614, 4811, 3713, 23993, 46021, 45435, 45776, 39922, 31580, 29111, 35548, 37380, 37599, 18709, 17661, 15137, 6736, 11152, 17402, 17455, 16432, 23487, 30067, 13320, 8395, 25414, 34463, 25557, 25688, 15197, 14072, 7677, 16457, 11675, 5371, 16062, 41314, 42138, 34688, 19614, 19114, 23438, 12361, 3508, 26818, 32030, 17019, 12957, 8093, 4883, 1502, 11226, 9587, 27907, 32961, 17861, 19473, 30398, 34929, 39998, 30631, 32618, 36242, 28674, 20406, 4760, -2184, -3290, 2976, 20814, 31222, 30051, 40926, 41466, 29813, 25860, 32165, 28331, 40319, 37384, 16993, 10590, 22213, 18315, 31438, 60130, 68028, 53791, 49832, 39140, 34493, 31082, 22085, 18019, 29973, 25980, 10087, 10024, 23757, 26343, 27797, 34457]
11194C4457Q727O560L072r584J0033j0531R01m90P038M785R915j8016n029o500
11180C5338j8638J1150J1943J5240Q327m695k402J7877j2397l6382k9160n924
11168i723R342J1519k427l19K340J1227J3596O393j3788j2290L739N651P992J2267
11154D5519J25j3221k9766l636J881R354Q931J3391K84j0400O173O650M84J011
11140C6780n149o2N545j7301J066O375J0183j167o046j190l063r413J2133J9354
11126D8045L411n706J3644J2643J239j859O011J365J4913K1456Q233K7938L3876
11113A85209M0664R6704J49110K67260M97218P91066M83030j71747m67955n66501
11103A304058m34253k55957j41264r8035p1497m9519k8053k0081j5234k9916j3890
$$ y = [34457, 43184, 49744, 52816, 43232, 53265, 42734, 43635, 43145, 50183, 54968, 64883, 46867, 41838, 35338, 16700, 27850, 39793, 55033, 63360, 58665, 56263, 74140, 61743, 25361, -3799, -9723, -381, 11138, 8711, 8392, 10732, 21959, 35555, 41948, 28160, 15870, 19609, 25260, 33252, 45519, 45644, 32423, 2657, -979, 902, 10256, 19187, 32578, 32862, 22462, 28635, 35285, 35769, 36780, 31631, 31569, 37114, 19813, 20879, 27254, 37437, 36270, 30224, 29034, 25971, 16558, 28691, 48045, 51456, 45750, 59394, 72037, 73276, 71417, 77428, 78793, 93706, 115162, 123395, 151333, 185209, 225873, 322577, 471687, 738947, 1236165, 2027231, 2510261, 2338514, 1870559, 1304058, 869805, 613848, 472584, 374549, 303052, 253533, 225480, 205399, 190165, 160249, 146359]
11092A46359j291j2553r712Q7n733n228k0405p604j1717p418M648j1773j4053
11079D3607n594O544J1766q237n890r427J0441J7991M868n475r51J469P161n034
11065F3239J2406J1892P501j9439j6675j9296O780J3797m436J1601J0385r172
11053F8583j2347J619J2194k1365K645p228j1992j374k924j0684k93O630K1131
11040D4595M800l749n232l742M134j5411p144L336Q671k951k813J7269R370j483
11026D9650p650J0119j615n957m605L761k053N902P5O155k956L909k974j8756
11012C3005j2710J4981J6072O059Q836o94m071j4019K505J9689J0720M899j195
10999H4077j8308j8783Q959J4251J1028q473k8253j4964r002J8595K7435O423
$$ y = [146359, 145068, 132515, 122803, 122890, 117157, 111929, 91524, 83920, 72203, 64785, 69433, 57660, 43607, 38013, 44557, 56323, 48086, 42196, 32769, 43210, 61201, 66069, 60594, 59643, 61112, 68273, 63239, 75645, 87537, 95038, 75599, 58924, 39628, 46408, 60205, 55769, 67370, 77755, 68583, 56236, 57855, 70049, 48684, 51329, 44101, 32109, 30735, 27811, 17127, 16834, 23464, 44595, 49395, 45646, 40414, 36672, 40806, 25395, 18251, 21587, 30258, 27307, 24494, 41763, 51133, 49650, 42000, 52119, 50504, 44547, 39942, 43703, 41650, 47552, 47627, 53782, 50826, 54735, 51761, 33005, 20295, 35276, 51348, 57407, 66243, 65549, 61478, 47459, 49964, 69653, 80373, 85272, 84077, 65769, 46986, 55945, 70196, 81224, 72751, 44498, 29534, 20532, 39127, 66562, 72985]
10987G2985j8635K15O908J4633k4387j5598O167J2303J8386Q220n931l30N524
10974H0460j660o849N380J3078J8433n315k4132j663k905N463J8109O7805P0677
10961B36881M0700j221N0058Q3055k0014j72701r2293J1849m683k9452j6061p775
10949G8343K497J3451o638j7557j7987K915Q747o660L095R327J0611K3656Q177
10936A11977m024l669K039O366J3709r48j7590O314P800Q108K6143O115k1326
10923A41014j5510k1129k9571k0769j2351J5288P346r807J3710O797j6689q523
10911D9806N001J2318K7162n047J6038Q489L1859N5487N6744K4672J7678j5583
10899B84624k7137l9631k1695j0923o7788m2421l3082m2030k8867O031K5314K3009
$$ y = [72985, 54350, 54565, 61473, 76106, 51719, 36121, 42288, 54591, 72977, 81197, 75266, 74936, 80460, 78800, 71951, 77331, 90409, 108842, 103527, 79395, 77732, 74827, 80290, 98399, 166204, 236881, 277581, 276360, 326418, 409473, 389459, 216758, 124465, 136314, 131631, 102179, 86118, 78343, 80840, 94291, 87653, 70096, 52109, 55024, 63771, 57111, 60206, 69533, 80144, 103800, 111977, 107953, 104284, 106323, 112689, 126398, 125450, 107860, 114174, 121974, 130082, 156225, 162340, 141014, 125504, 104375, 74804, 54035, 41684, 56972, 64318, 54511, 68221, 75018, 58329, 49806, 54807, 67125, 94287, 89240, 105278, 113767, 145626, 201113, 257857, 282529, 300207, 284624, 257487, 217856, 196161, 185238, 117450, 75029, 41947, -83, -28950, -22919, 2395, 25404]
10887B5404L524J7709L0501Q763o328J1612L645j4864k956q933j1315k3454p557
10874B5751j4622k6390o293J7428N55O689J0917J8023N175r59K2444J3044P169
10861G8931K5924M2251L9224K0978O897m647o593l4504n0276l4779j1854j362
10849G0190K958Q910l299j8299j7065l969l602o488J2026J806j3261j9174j773
10836H960J4089m444L059Q7827J86246N9018k2993j8822l6736l2391j3234M480
10824B35059j726p568K666K174Q499K159M377l935J2025P904O112R490Q312K87
10810B85835m742o445j0649j8351P236K1537N2461J11678J75857K57325J27549
10799I99291m9894j28753j76105j28124p5899l9296j7483j822J5035K3332J6375
$$ y = [25404, 28928, 46637, 77138, 85901, 79573, 91185, 94830, 79966, 77010, 68077, 56762, 33308, 25751, 11129, -15261, -21554, -4126, -3571, 3118, 14035, 32058, 37233, 36274, 58718, 71762, 78931, 104855, 147106, 186330, 207308, 214205, 209558, 202965, 168461, 118185, 83406, 71552, 70190, 73148, 82058, 78759, 60460, 43395, 39426, 35824, 29336, 41362, 43168, 29907, 10733, 8960, 23049, 18605, 21664, 109491, 295737, 354755, 331762, 312940, 276204, 243813, 230579, 235059, 233333, 225765, 228431, 230605, 239104, 241263, 245640, 241705, 253730, 261634, 267746, 277236, 285548, 285835, 281093, 274648, 263999, 245648, 252884, 274421, 326882, 438560, 614417, 871742, 999291, 949397, 820644, 644539, 516415, 440516, 401220, 383737, 381915, 396950, 420282, 436657]
10788D36657J0833m217l1532k9344L679r636p818k3488j5260Q632o807l146P051
10775C35604J8526M9240N5388P1560M7551K4769n748j913Q544k5070j7236j9582
10763E41633k3948R25K3611L753o033R257J2895l087j6471J9154O9801Q4726N1162
10750G67378K1451K5209J0011O423L1670R0862J07177R2423P6137Q5656R8592
10739A412989N8402K2273O411M9075J22198J77311J80144J83035J26777R8715
10729B437330J55539K45827M04933O81005J015867J254081P29683K98344K27020
10720G449629M33363P39148R49131J235181J591538K173615L133185M685325O801734
10711B9191849J0298649J6478658K7525973M9451629R4639235J49504053Q9254811
$$ y = [436657, 447490, 443273, 411741, 382397, 386076, 376440, 368622, 345134, 329874, 338506, 331699, 328553, 335604, 354130, 403370, 458758, 530318, 577869, 602638, 596890, 594977, 603521, 578451, 561215, 541633, 517685, 518610, 542221, 545974, 539941, 549198, 562093, 559006, 542535, 561689, 631490, 716216, 767378, 788829, 814038, 824049, 830472, 862142, 953004, 1060181, 1152604, 1228741, 1314397, 1412989, 1471391, 1493664, 1500075, 1549150, 1671348, 1848659, 2028803, 2211838, 2338615, 2437330, 2592869, 2838696, 3243629, 3924634, 4940501, 6194582, 6924265, 7222609, 7449629, 7882992, 8622140, 9571271, 10806452, 12397990, 14571605, 17704790, 22390115, 29191849, 39490498, 55969156, 83495129, 132946758, 227585993, 377090046, 466344857]
10704D66344857l1573913q6946344j06877198q4238515n1301878k9949358j8398913
10697E7058738j1878611q292211o195790m846326l972480l296652k587435j927936
10689A4061297j352592r20877m69507q1088m62493r50393j130613j114840r35160
10680F643734p67185o37573n21429m08597k89322j94907k08807k42032k57723
10671C116159k48433k21135j80237j46858j47154j08390j12620j32972j18267
10662A700093j29375j58588j29431j01866o3295m5610l4085m0086o8078q6831
10652H42848o6524l6583l9376n2777m6655j4309k0741l2820m7087m2899n0145
10641C92932o4604m5214k6471O041L5913K2007K3243K5550J9976j170j0545j7354
$$ y = [466344857, 434770944, 347824600, 240947402, 156708887, 105407009, 75457651, 57058738, 45180127, 36887916, 30692126, 25845800, 21873320, 18576668, 15989233, 14061297, 12708705, 11787828, 11318321, 11237233, 10774740, 9824347, 8693734, 7578894, 6643734, 5876549, 5238976, 4717547, 4308950, 4019628, 3824721, 3615914, 3373882, 3116159, 2867726, 2646591, 2466354, 2319496, 2172342, 2063952, 1951332, 1818360, 1700093, 1570718, 1412130, 1282699, 1180833, 1117538, 1071928, 1037843, 997757, 929679, 842848, 776324, 739741, 700365, 647588, 600933, 586624, 565883, 533063, 485976, 443077, 392932, 328328, 283114, 256643, 262684, 298597, 320604, 343847, 369397, 389373, 388203, 377658, 360304]
10629C60304m1024n1059k1828j5244l2258k3380k9650j0303J6343J7685J4223
10618A83809O151j3098J0644O903L800N26M204M432J0421K2437K5953J255j8823
10605B48614k0722j7637j9069k0128k4777l9880j7759j5228p854Q982J5251p594
10593H2199o548n113K39n626R095P927j855k697J8271L863m573k015j8943j3826
10579F0398k4978N5708J24891M5412J3724J2951j5398k3346j9469k0078k2138
10568A87677n232J0530Q817n419k2388j0339j0188j1737L027M75j6879l0717k0176
10555G7451k9332m4291l930n341j9280O030O0999M1619J5702K2651Q937j4905
10543A16310p571p205K174J6100P070J4796K441m479j2261j3945j1975j0768j0336
$$ y = [360304, 319280, 268221, 246393, 231149, 198891, 175511, 145861, 135558, 151901, 169586, 183809, 189960, 176862, 187506, 194409, 198209, 198735, 202939, 207371, 217792, 240229, 266182, 267437, 248614, 227892, 210255, 191186, 171058, 146281, 106401, 88642, 73414, 65560, 74542, 89793, 82199, 75651, 70538, 70777, 65151, 74246, 82173, 80318, 77621, 95892, 99755, 95182, 93167, 74224, 60398, 35420, 91128, 216019, 261431, 275155, 288106, 272708, 249362, 229893, 209815, 187677, 182445, 192975, 201792, 196373, 173985, 163646, 153458, 141721, 144748, 145223, 128344, 97627, 77451, 48119, 3828, -102, -5443, -24723, -18693, 42306, 83925, 99627, 122278, 131215, 116310, 108739, 101534, 103708, 119808, 126878, 141674, 144115, 139636, 127375, 113430, 101455, 90687, 80351]
10530H0351k5315j1851L154P291L687P534M566k657Q427J9196J5055J8700K2260
10517A50398j4990o9422o3503k7373k3560n804j0865l8331l4618j8137j5687K5129
10505a46763O9538N0059K2115K4783K846l362O855J661P18n83o18K773K22n135
10491B5109Q473J0359P78j0662k3350k1465j5858j4630k352M007K2250L8210j211
10478A9658j2058n352j7930k8198j5055J2424K3464K4930O897K6397J2232o399
10466D1010k8981j0811J1710J2463M362P77j3250J1116k48n140j1457p105J2590
10453A7036J2630L8496J3988k6055k6123k8304j675j4149M367O04j1344K682R18
10440a6929o123O244J099L126M130L840O523P225j790j1036J0580J0840j0664
$$ y = [80351, 55036, 43185, 46339, 53630, 57317, 64851, 69417, 66760, 75187, 94383, 109438, 128138, 150398, 135408, 65986, 2483, -24890, -48450, -54254, -65119, -103450, -138068, -156205, -171892, -146763, -77225, -27166, -5051, 19732, 22578, 19216, 26071, 27732, 28450, 27867, 27249, 30022, 30244, 25109, 33582, 43941, 44719, 34057, 10707, -10758, -26616, -41246, -43598, -39591, -17341, 20869, 19658, 7600, 2248, -15682, -43880, -58935, -46511, -23047, 1883, 8780, 35177, 47409, 41010, 12029, 1218, 12928, 25391, 29753, 30530, 17280, 28396, 28148, 23008, 11551, 4446, 17036, 29666, 68162, 82150, 56095, 29972, 1668, -7, -14156, -9789, -9185, -20529, -17847, -16929, -23052, -16808, -15709, -12583, -8453, -4613, 1910, 9135, 7345, -3691, 6889, 17729, 7065]
10427G065j8257m890J7765J7440r739j3833P67n052J8601q78j9015j4306N924
10414a8408N825J8540J0459j5801r717J850O132k787p285k712J9971J556L731
10401A1354m277J1393K0192j301l0422j5810j1923O333o412k0178O592J4748Q699
10388a1012k926J72R31L333q32K605n136n33J9967J6793J1944O796N819n439j6951
10373B5531k3476L002m076k388J742N922K986m944R989n555m94j0518n37j0839
10359a3655o761r6J6466J5735j5904n460O656l421J4572K5505j5580m425p589
10346F043j5215J643N695N612J350J5693J215j2253M688M358l656K257n134O344
10332A8640Q021J2644q5k024M694j4008Q977P923O178k653m754J565j9703p264
$$ y = [7065, -11192, -16082, 1683, 19123, 9384, -4449, -3682, -8734, 9867, 8989, -10026, -24332, -18408, -12583, 5957, 16416, 615, -9102, -7252, -1120, -3907, -11192, -13904, 6067, 7623, 11354, 7077, 18470, 38662, 37361, 6939, -8871, -20794, -14461, -20873, -41051, -34459, -19711, -11012, -13938, -13766, -12835, -9502, -10334, -7729, -12865, -13398, 6569, 23362, 35306, 42102, 47921, 42482, 25531, 2055, 5057, 981, -1407, 335, 6257, 9243, 4299, 14288, 8733, 8239, -2279, -2816, -13655, -20416, -20512, -4046, 11689, -4215, -9675, -3019, -6440, 8132, 33637, 18057, 13632, 6043, -9172, -7529, -1834, 3778, 5128, 20821, 22036, 9783, 14471, 18829, 15173, 17430, 12296, 18640, 26661, 39305, 39220, 37196, 41890, 27882, 36859, 44782, 50960, 48307, 43553, 45118, 25415, 18151]
10318A8151j843r56R312p136K255L791N595K4180K4289N909R103J6986Q360K7148
10304A45144M7292R2983J43864K18913M23551P36259O40932j6365m16977n72770
10294A442826n02988l12939k00788j24595o6548l5208k8671j5582k2938l9185
10284I3384j3084j6702o264M089j685K755K0847K643j2384k3829o438j1201J0502
10271D2633Q769n282m051k2985M478o406K438K594L927M648l766l07P988Q589
10257D3267q483p456j9259k911P050l80n939K554j0758r635L059m81m221J4953
10243A360O904J6248L6016P121j4878k1067k3579j8663j0593J16j2344j923J535
10230c3747L395k067n289K4641J9181R615p902q992j3516r534o106r034n690j541
$$ y = [18151, 16308, 15352, 24664, 17528, 19783, 23574, 29169, 53349, 77638, 83547, 92650, 109636, 117996, 145144, 192436, 285419, 429283, 648196, 1071747, 1808006, 2448938, 2432573, 2015596, 1442826, 939838, 626899, 426111, 301516, 234968, 199760, 171089, 155507, 132569, 93384, 80300, 63598, 57334, 61423, 59738, 62493, 83340, 85983, 73599, 49770, 43332, 32131, 42633, 51402, 46120, 42069, 19084, 23562, 17156, 19594, 22188, 26115, 30763, 26997, 26690, 34678, 43267, 34784, 27328, 8069, 5158, 12208, 11828, 5889, 8443, -2315, -11950, -8891, -9372, -13593, 1360, 8264, 24512, 60528, 67649, 52771, 31704, 8125, -10538, -21131, -21015, -33359, -35282, -33747, -30352, -32419, -37708, -13067, 6114, 15729, 7827, -1165, -14681, -24215, -30321, -39355, -45045, -46586]
10216d6586J1520N749M188o579K1358J2739P330j0804l705o825R389N242r765
10203f749p304l194r520q734J908K1233J145m267R363J5912j0990j4772P825q18
10189h962K628K662k5178K868J3750o286k978P872M926J0702J5998o835r157k429
10175d19r335k150J1438j5734r860o167J4201J6601O000J733K705k447M234q235
10161B565j4029L614P306q332J604M322K481j0951q103J155n099P102K117j3311
10147b7559N28K2553J4879r040j4859M927n937n616O314N600j4027Q505r71o089
10133b0792j3732o592n403K6362K2548j4442j514K3310r306j3312o124O599Q590
10120c808J1637Q438M24j462j1897j021O088K190k352n739j0116k885R630o203
$$ y = [-46586, -35066, -29317, -25129, -31708, -10350, 2389, 9719, -1085, -4790, -11615, -2226, 3016, -6749, -14053, -17247, -26767, -35501, -33593, -12360, -11215, -15482, -6119, 9793, -1197, -15969, -8144, -8962, -6334, -3672, -28850, -25982, -12232, -18518, -21496, -13624, -8698, 2004, 18002, 11167, 2010, -419, -9754, -11904, -466, -16200, -26060, -32227, -18026, -1425, 4575, 6308, 9013, 6566, 10800, 2565, -11464, -7850, -544, -8876, -7272, -2950, -469, -11420, -19523, -18368, -23467, -16365, -14248, -27559, -27031, -4478, 10401, 1361, -13498, -8571, -14508, -20124, -13810, -8210, -22237, -13732, -14703, -20792, -34524, -41116, -46519, -20157, 2391, -12051, -13565, 9745, 439, -12873, -18997, -12398, -3808, 7829, 16267, 16691, 15229, 3332, 2311, 8399, 10589, 8237, 2498, -7618, -10503, -873, -7076]
10106g076J98J2420J783j2113j0866K264N339J3580J2691j6786J481K668q945
10093c362n305J0317N858O851k092j0586J754L179o57j1357q476O510P672j065
10079g59j4289j551o715M879J3187n102k241K595j1951O399J2671K317k219p943
10065a0722q395j6733J1093P776n379R827J2828P739L630j534j8421p910Q953
10052g248J1299J688k636J960k685o139J6228J5771m729p900r594J6638q17k4945
10038c109j8541N078J3837M890p860N154n607k1492J1231Q489p374J329J3575
10025d00O677Q938q703j0788j6954p726M487J2487J7600P536j2081J321j1754
10012i360K035J3120K306J5395m699k0802j2379M872J5259J1790l821k1704l161
$$ y = [-7076, -6878, 5542, 7325, -4788, -15654, -13390, -8051, 5529, 18220, 1434, 2915, 5583, -3362, -8667, 1650, 7508, 14359, 12267, 1681, 3435, 6614, 5957, -5400, -13876, -7366, 306, -759, -15048, -16599, -23314, -18435, -5248, -10350, -12591, -9996, -21947, -15548, -2877, -560, -2779, -10722, -19117, -35850, -24757, -16981, -22360, -12533, 295, 8034, 11664, 10130, -8291, -16201, -7248, 4051, 5739, 3103, 5063, 2378, -3761, 12467, 28238, 23509, 15609, 6015, 22653, 21836, -3109, -21650, -16572, -2735, 2155, -5705, -551, -6158, -27650, -16419, -7930, -15304, -13975, -400, 6277, 15215, 6512, -4276, -21230, -28956, -24469, -11982, 5618, 13154, 1073, 2394, -9360, -7325, 5795, 8101, 23496, 18797, -2005, -14384, -9512, 5747, 17537, 13716, -7988, -11149]
9999a1149J241J026J2399P77j295O388M691r796j6254J154M762L50R252j371l858
9984a683j2693k1532o611J0514K2043J8931k608N282n57J546p337N917L217n121
9970I308J899p61k939P451J967l826p238j213J3215M142K219p119o222r311m930
9955c358Q778p765J2368O897j287n498j034k254P69J4663j605j1185m181j3423
9941h115k684J4605m386n927P960j826Q07q936p41J149j329m300L619J1302n834
9926d636j6422k856J6857N373p86K40o54L021Q943j1544p524J7645J4383j2068
9912I972r413j863L882J2217j3171k067q261K923J169O013J2295o047j931R201
9898A4919J6668j4189j7876m962o64J370R73M563J2555J6612K531k1781p038j3391
$$ y = [-11149, -9908, -8882, 3517, 4294, 2999, 9387, 14078, 4282, -11972, -10818, -6056, -5706, 3546, 2175, -1683, -14376, -35908, -42519, -32005, -9962, 8969, 6361, 11643, 11086, 12632, 5295, 11212, 14429, 9308, 11207, 10446, 7507, 14958, 16925, 13099, 5861, 4648, 17863, 22005, 24224, 17105, 10883, 1572, -3358, 5420, -2345, 10023, 16920, 15633, 10135, 9101, 6847, 7616, 22279, 20674, 9489, 5308, -8115, -10799, 3806, -580, -6507, 1453, -373, 434, -8502, -9243, -8094, -9423, -13723, -10104, 1198, -4636, -21058, -23914, -7057, -1684, -2470, -2230, -2884, 137, 9080, -2464, -9988, 7657, 22040, 9972, 559, -1304, 2578, 14795, 1624, -443, -8704, -5781, -4612, 1401, 13696, 7649, 5718, 14919, 31587, 17398, -478, -5440, -6104, -4734, -3761, 802, 13357, 29969, 32500, 10719, 3681, -9710]
9884i710J781J6956L248j4395O962K983l562m825o714K47P318R462M697K097k1272
9869d727q381O502J34m557P087J919K745K329J1352J2417j4575j4265J0503j750
9855F733m296j27k501l341J142J585J0208j415L620l946j099j4574j7996L34L3882
9840H209J6658j1464o021j1211j4343r730M099K0315L654L665r675r583j144o032
9826b2603j0166J3549K8983O336n271O87j4075j945O589p917K990P449j402J2264
9812A5468j3726O156N090l591q796q88k065L351L214k953J2811J9865M346j4002
9798B4280q926j021J3154m659j6643J839j764m356l397M760J0231j2941n834O259
9784I82j7741n601q99L62j353N375K0228J1820J1929Q065n415r608q281R61M009
$$ y = [-9710, -7929, 9027, 12275, -2120, 4842, 7825, 4263, -562, -7276, -7029, 289, 9751, 14448, 16545, -4727, -13108, -6606, -6472, -11029, -3942, -2023, 722, 3051, 14403, 26820, 12245, -2020, 8483, 6733, 2437, 2310, -191, -3532, -2390, -805, 9403, 7988, 11608, 7662, 6563, -8011, -26007, -25673, 8209, 24867, 13403, 7382, -3829, -18172, -27902, -23803, -3488, 166, 3831, -5844, -15427, -16571, -22603, -32769, -19220, 9763, 16099, 10828, 11515, -2560, -4505, 2084, -5833, -2843, 4606, 3204, 15468, 1742, 7898, 12988, 9397, 601, -287, -2352, 999, 4213, 1260, 14071, 33936, 38282, 24280, 15354, 14333, 27487, 22828, 6185, 8024, 6260, 1904, -1493, 3267, 13498, 557, -5277, 982, -16759, -22360, -23259, -22897, -24250, -18875, 1353, 13173, 25102, 33167, 27752, 18144, 9863, 10824, 14833]
9769A4833j1673j3943O806J2097j0235j5435J4501k531q205n53j718J2008P526
9756C478J0881k29k3469L905p029j0824R929n754R70K2920J5382J7833q29j0358
9742B6806j8175l337K192O851o018j1068j460N776n084m017j0002L59J1383k729
9728h523j0855L487k78n99K904N254P945L732K230r460o756N145L750M3k2P408
9712E405j984r333M513Q089J4605q51n917q603J976j6294n449K841l616r693N096
9697a9215K850o788k588J2043q059m505J931R665N324J912m24m076j214J6289
9683C145L534K811M119m245j2359J818k632J82o455q49j612K2162p947J619r884
9668f593o958P829M391j0862l446J555Q388J0796o096j2791Q386P318j0990R118
$$ y = [14833, 3160, -10783, -3977, 8120, -2115, -17550, -3049, -5580, -13785, -14338, -16056, -4048, 3478, 14359, 14130, -9339, -5434, -12463, -23287, -13358, -19112, -18142, 4778, 20160, 37993, 37164, 26806, 8631, 5294, 7486, 14337, 8319, -2749, -4209, 1567, -3517, -7534, -17536, -17177, -5794, -8523, -19378, -15891, -16169, -16768, -13864, -8610, -665, 3067, 5297, -4163, -10919, -5774, -2024, -1981, -2003, 5405, 3421, -5912, -1399, 6690, 21295, 20444, 14527, 5924, 7900, -8394, -13843, -11002, -14618, -24311, -19215, -16365, -23153, -25741, -13698, -21757, -26262, -24331, -14666, -9342, -7430, -7854, -11930, -13144, 3145, 6679, 9490, 13609, 9364, -2995, -1177, -3809, -3627, -10082, -10931, -12543, 9619, 1672, 3291, -6593, -13551, -5722, -1331, -12193, -15639, -14084, -5696, 5100, -996, -13787, -5401, 1917, -9073, 45]
9654D5K5538J2506j1682j1559R99q554j2972n453J3928j0792l527M200L534J3434
9640I645Q539k453j7088q454o228q21O818M769J1007l486K983N423k242p298R627
9625A0741r937o669Q865J0749l518K058J3576K990m077j0707K816l835k287n34
9611A0231o165j5347j4795N255l420K747J5308j156J1730q639p835J7797M537
9598A0248o980o097j9664m088J0090K633j1590m950M455J8920J1957M068j245
9585G757o007L485Q067j5023L78L883q841N301M393P827j0096j2571K2278N739
9571A6570Q921j2876j6744L486k504J6380L95J883O733n892p513q57j6634j1001
9557a9653p52o110k283J8493R065k805q845L87P406l437n031J95L132O969K453
$$ y = [45, 25583, 38089, 26407, 14848, 15847, 7293, -5679, -11132, 2796, -7996, -11523, -7323, -3789, 9645, 18184, 15731, -1357, -9811, -16039, -16860, -10042, -5273, 5734, 2248, 5231, 10654, 8412, 1114, 10741, 804, -5865, 3000, 13749, 10231, 12289, 25865, 28855, 24778, 14071, 16887, 13052, 10765, 10231, 4066, -11281, -26076, -20821, -24241, -21494, -6186, -7342, 4388, -4251, -12086, 5711, 10248, 3268, -2829, -22493, -26581, -16491, -13858, -25448, -30398, -25943, -7023, 4934, 9002, 7757, 1750, 5235, 13302, -1721, -1343, 2540, -6301, -1000, 3393, 11220, 1124, -11447, 10831, 16570, 25491, 12615, -4129, -643, -3147, 13233, 13628, 15511, 22244, 16352, 8839, 7982, -8652, -19653, -20405, -26515, -28798, -10305, -1240, -4045, -12890, -12503, -5097, -8534, -13565, -13370, -10238, -3269, -816]
9542h16m56j2817k262J0659P826o846o446p614J0636J1478J0312m917j2556n120
9528h939M714J9074k624n957p079j0504l065q772n258R700J0692j530l861R100
9514d309R753r696J923J0943M851j424j5970l868j399m272l644J3763o213r313
9500a8875P505Q57Q025J5182J17k7751P197N082M0l423j6858o637M33J0772O855
9485a1479K818j3135k722J2453j0998p787R616j151Q829R599J980o51P101J846
9471F319k809P295j187L321j5178p615r541k361J0293J9005J5254o358p469k646
9457F323m421m165J4001O156j8734j5290K523J966q186P644J928O208O939j3864
9443a0972j3232J3344P680q447K03N212N815N988J630j877J58m889o505r273r68
$$ y = [-816, -1272, -14089, -16351, -5692, 2134, -4712, -11158, -18772, -8136, 3342, 13654, 8737, -3819, -8939, -4225, 14849, 12225, 6268, -811, -11315, -14380, -23152, -28410, -18710, -8018, -9548, -13409, -4309, 5444, -4252, -2329, 8614, 13465, 12041, -3929, -7797, -9196, -13468, -17112, -3349, -9562, -18875, -11370, -10513, -2488, 12694, 12811, -14940, -7743, -2661, -2621, -6044, -22902, -29539, -29106, -18334, -11479, -8661, -21796, -24518, -12065, -23063, -30850, -21234, -22385, -13556, -3957, -1977, -2628, 4473, 6319, 3510, 10805, 9618, 12939, -2239, -9854, -19395, -21756, -11463, 7542, 22796, 16438, 8969, 6323, 1902, -2263, 11738, 17894, -840, -16130, -13607, -11641, -19827, -12183, -10255, -4047, 2892, -10972, -24204, -10860, -3180, -11627, -11424, -6212, -397, 5591, 7221, 5344, 5502, 613, -5892, -15165, -16133]
9428a6133m703R661K1834l377q55j0660K241k32l88O806N291O891j1487j1044
9414f155J1697K481j771M274J443k5825N80J7574N104j0652j1068k807l525J964
9400a6686J1232J0770J1136l133K448j4931n539J0491J985J3982M408l2809m401
9387a1047J3242j0455l366J4982J5600Q910l306o617j1016j7309Q1J088J4655
9374E442M575K434j077q85q30k116j552L210m016J832J136J696N830r141o335
9359B03k389j86l596k6267j2219J6210J9420J0805O986k136N927L408R657O500
9345C2323n664j3753j7036J588k907m403k739J5069J3404r306K29o781l113l328
9331f417l863m053J172J6012j0957L327P179P449K414p017j4484k894n331P43
$$ y = [-16133, -20836, -11175, 10659, 7282, 6427, -4233, -1992, -2224, -2612, 4194, 9485, 16376, 4889, -6155, 5542, 8023, 6252, 10526, 11969, -13856, -13276, 4298, 9402, -1250, -12318, -15125, -18650, -16686, -5454, 5316, 16452, 13319, 15767, 836, -4703, 5788, 7773, 21755, 26163, -6646, -11047, 2195, -8260, -11626, 3356, 18956, 27866, 24560, 17943, 6927, -10382, -10301, -9213, 5442, 10017, 12451, 11374, 10489, 9659, 7543, 5991, 9201, 5185, 7017, 8153, 9849, 15679, 6538, 203, -2186, -2372, -5968, -32235, -44454, -28244, -8824, 1981, 8967, 6831, 12758, 16166, 25823, 32323, 26659, 12906, -4130, -2542, -5449, -9852, -12591, 2478, 15882, 6576, 6805, 24, -3089, -6417, -10280, -14333, -13161, 2851, -8106, -4779, 2400, 9849, 12263, 5246, -9238, -12132, -17463, -16720]
9317a6720Q987N364l426J7878Q386Q67j0574o437J356m392J0244J4178N988l486
9303B8213j7284j2076j131o844J0317J906J506N673J1921J7216k4200j4517n630
9290d930q63M245J2023l664j4354k5513K1701J367j32P569R332j0226n525J8408
9276I438N033j7821j2535J7292O585o2k946n192r497J8718J808Q478K322p522
9262A4099j986p959j0780n039K371l14J1086O179N535J01j2420m803k537j2591
9248a9058l574K5033J3611l277j6036j448j48k124Q511M366Q896L737l741k601
9234A2147M606O329j1611p314m918J4855P373j2203J423n348p7N211N249j0271
9220E451n581O486P830L284j3594j2016J1828J8005R982n986j5533r491K825N115
$$ y = [-16720, -7733, -2369, -5795, 12083, 20469, 21336, 10762, 4325, 5681, 1289, 11533, 25711, 31699, 28213, 10929, -1147, -2278, -9122, 1195, 3101, 4607, 10280, 22201, 39417, 15217, 700, -4930, -5793, -1548, 10475, 6811, -7543, -33056, -11355, -9988, -10120, -2551, 6781, -3445, -8970, 9438, 14471, -3350, -15885, 1407, 7992, 7930, 4984, -208, -9705, 9013, 10821, 19299, 21621, 14099, 12113, 4154, -6626, -11665, -9294, -9608, 1478, 7657, 13192, 13293, 873, -3930, -6467, -19058, -22632, 2401, 16012, 12735, -3301, -4749, -4897, -7021, 1490, 5856, 14752, 18489, 14748, 12147, 16753, 23082, 11471, 4157, -761, 14094, 21467, 9264, 10687, 5339, 5262, 10473, 15722, 5451, -130, 6356, 14186, 17470, 3876, -8140, 3688, 21693, 31675, 25689, 10156, 665, 3490, 8605]
9206H605l693k516L442J6351O084J497M616J1161p286k5470p581P243J2169L738
9192B8360L135J0735L658p445r051l450p371J50K945J717k06j1389j0794l426
9178b432k495J9276J5302L576J581j02j0365P639J4022P659K2014K6039J0211
9165A11925l113P285K5039J0067J8540L8616M8655N9638P8576J14028J74362L39004
9153A022622O41496J273934K493298K309876k06410j378669j885616j590084r39032
9144A741415n14701k88375j81004j37234j07726p4559o0094o3206n6919m0181
9134B17416k7596J325r2l7469j6948j2723r125o694k939M425j1054j2039j5518
9121G0969k002n14L000j8768l393j4706m490N355J469R782P435n627n383j1500
$$ y = [8605, 4912, 2396, 5838, 22189, 28273, 29770, 34386, 45547, 38261, 12791, 5210, 12453, 24622, 28360, 31495, 42230, 45888, 38443, 29392, 25942, 18571, 18721, 21666, 23383, 23177, 11788, 994, -2432, -4927, 14349, 29651, 33227, 34808, 34706, 24341, 31980, 46002, 53661, 75675, 101714, 111925, 108812, 116097, 141136, 151203, 169743, 208359, 257014, 316652, 395228, 509256, 683618, 1022622, 1664118, 2938052, 5431350, 7741226, 7534816, 6156147, 4270531, 2680447, 1741415, 1226714, 938339, 757335, 620101, 512375, 437816, 377722, 314516, 257597, 217416, 189820, 191145, 191053, 153584, 136636, 123913, 114788, 108094, 105155, 109580, 98526, 86487, 70969, 68967, 68453, 71453, 52685, 49292, 34586, 30096, 35451, 36920, 46702, 54137, 48510, 43127, 31627]
9107C1627l169Q392j4652J464M763Q49j309l8K772j8303p697J3094o390M95o975
9092D923R873J6935k217n286l618O343k500j7481r019n087n364k150J444N912
9078g292J5660L43J833j2744n827J2262j432J0336l627j8002j1149O010K1942
9065H313J3300j0901j0332o750O370p755l225K895J003l96K880O144o518j4738
9051a9710m735M135M807q139p392O952K678n98p428N784K903J3993l228n262J1964
9036c276K129o760l332N511J5308j0751l795L607O697N471j419m043l157O537
9022H727q682k832J2022J2407O952p725j3528j2318J3973J2652j0224k421J598
9009A0601j0129J105l068p598J631k280K600J119j2061j5442j0738J2582J4468
$$ y = [31627, 28458, 36850, 22198, 23662, 28425, 29274, 27965, 27927, 30699, 12396, 4699, 17793, 11403, 11898, 4923, 14796, 31731, 29514, 24228, 20610, 26953, 24453, 6972, -2047, -7134, -12498, -14648, -13204, -7292, 8368, 8711, 10544, -2200, -8027, 4235, 2803, 13139, 9512, -8490, -19639, -13629, 8313, 21613, 10712, 380, -6370, 0, -7755, -10980, -8085, -7082, -7478, -4598, 1546, -4972, -19710, -24445, -20310, -15503, -23642, -31034, -24082, -21404, -22002, -29430, -23646, -20743, -6750, -9978, -15240, -3276, -1147, -7907, -11239, -5728, 9580, -1171, -4966, -1359, 5338, 10809, 9390, 5347, 2190, 8727, 45, -2787, 9235, 21642, 28594, 20869, 7341, -4977, 8996, 21648, 11424, 9003, 10601, 472, 1577, -1491, -9089, -7458, -9738, -7138, -6019, -18080, -33522, -44260, -31678, -17210]
8996a7210O194J0037N031m389J9347J8069J0882j0593j905j2022p360j3331Q479
8983A1229J0746j3900l375q583j3483p991r723o707K4451J6493J4084l909L852
8970A3184j0714J0223k633o334o595j441l562l084J0952j0338q047J4372J1813
8957G796r668p185j2914J5791k494l42k26J0240K596r649j0252n83j10R970O311
8942g19k593j369J0966R643M476j6046j4126J832j640J1791j3947l598P552L572
8928d206J035m922N832Q945J06Q67j2407m320k990o678L551n449J9618M389J1071
8913A4442l252j1067N45J4588J8457m098j5568k0478N936J7117k157m46m223M672
8899A4468P125j2532J093O464k426j0340l651J2470R3k6430r2J6161j488J3289
$$ y = [-17210, -11016, -979, 4052, -337, 19010, 37079, 47961, 37368, 35463, 23441, 16081, 2750, 11229, 21975, 8075, 4700, -3883, -17366, -25357, -35080, -41787, -17336, -843, 13241, 9332, 13184, 2470, 12693, 10060, 3726, -2869, -4310, -7872, -10956, -4, -10342, -18389, -4017, 7796, -1872, -9057, -21971, -6180, -8674, -9016, -9242, 998, 3594, -6055, -16307, -16890, -17000, -7030, -719, -3312, -4681, 6285, 15928, 20404, 4358, -9768, -7936, -9576, 2215, -11732, -15330, -7778, -4206, -3171, -8093, -2261, 6684, 6790, 7657, -4750, -9070, -12060, -18738, -15187, -20636, -1018, 3371, 14442, 11190, 123, 668, 15256, 33713, 29615, 14047, -6431, -495, 16622, 14465, 14019, 9796, 14468, 21593, 9061, 10154, 16618, 14192, 3852, 201, 12671, 12764, -13666, -13758, 2403, 915, 14204]
8885A4204j1954j3524L8O267Q35m272o470J1367q049m397P195N746j3269n846
8871b2129J0104K466j0538j490K211O186J2550K119p381m983p674j4880J3393
8858b0046J8768J8653m81j8375r971r309j22M134J285o806j714N16j442J0765
8844a4145N658j05J7997J2553o835k0431m986J0318P128P584M431j0586j4017
8831e436o56L300K0520j4096q561N816j0057j0559K797J5638R784m230l752L287
8817C795J2764j078m179j3307j5784L528P637J9082K024j4720j543j0109J3065
8804A175J6798J154o490J8879M75k6639k2939J3507J0482Q897J756k4819l528
8791a1292m037J2841J0788l770l399j2743K598p293o011Q687k103n447j2267R518
$$ y = [14204, 2250, -11274, -11236, -4969, -4134, -8406, -14876, -3509, -11558, -15955, -8760, -3014, -16283, -22129, -12025, -9559, -20097, -21587, -19376, -13190, -640, 1479, -5902, -10885, -18559, -33439, -20046, -1278, 17375, 16894, -1481, -11452, -20761, -20883, -16749, -15464, -22270, -23984, -23468, -24910, -14145, -8487, -8592, 9405, 21958, 15123, -5308, -10294, 24, 7152, 14736, 19167, 8581, -5436, -6092, -2792, 17728, 3632, -4929, 887, -9170, -19729, -16932, -1294, 8490, 4260, 508, 3795, 16559, 15481, 11302, -2005, -17789, -14261, -6624, 12458, 14482, -238, -1781, -11890, 1175, 17973, 19127, 12637, 31516, 31991, 5352, -17587, -4080, 6402, 15299, 17055, -7764, -11292, -15329, -2488, 8300, 4530, 1131, -11612, -9014, -16307, -22318, -13631, -15734, -21181, -33448, -23930]
8777b3930L163J259M435J9722l418N504K180j0885Q464j579m296m987q383n640
8763a8391R141J1991L876Q382p17j2258M334K548Q418m099j0421r250L366Q526
8749E446k604r525N165p641k077N021m429J985J3205M016O78m991J470J2451O544
8734B4714j2737j1195o005K680M633K060L764j4642q693J0443Q349p374j0661
8721a4664R098J2597J901j6083j2209L862l401J456l897J4388J2236l542l977
8708b235j644J10N143K233l238J0651j108j261l323m264J0774J0607r624r014
8694C807J4382Q686j0429j2114p905J2576N242k5685j0257J6627J9012J34j1335
8681B741p374j535L225k543Q312o245k65l742Q726r815K33j108P49M770M269P738
$$ y = [-23930, -20767, -19508, -15073, 4649, 1231, 6735, 8915, -1970, 6494, 4915, 619, -4368, -12751, -18391, -9250, 2741, 6617, 14999, 14282, 2024, 6358, 8906, 17324, 13225, 2804, -6446, -3080, 5446, 2842, -6683, -1518, -9159, -11236, -6215, -10644, -8659, 4546, 8562, 9240, 4249, 5719, 18170, 24714, 11977, 782, -5223, -2543, 2090, 4150, 7914, -6728, -15421, -4978, 3371, -4003, -14664, -5566, 7031, 8932, -7151, -19360, -15498, -18899, -17443, -21340, -6952, 5284, 1742, -2235, -3879, -3769, 1374, 3607, 369, 11020, 9912, 8651, 5328, 1064, 11838, 22445, 12821, 3807, 18189, 26875, 16446, 4332, -3573, 9003, 14245, -11440, -21697, -5070, 13942, 14076, 2741, -4633, -6168, -2943, -5486, 2826, -3419, -3684, -7426, 1300, -8515, -8282, -9390, -8641, -3871, 398, 8136]
8665H136p092q736p405r414J0706J1981k125M146J8152m905o819j5364j2464J6779
8651d424J4345j3828j3259J276K1091O474j4206J711J5168l676p24k793p105K740
8637B790j1777q270N795O265O698J5984k0438k0247k53l387N882j343J16j0348
8623c2533O426J9962J1652J0194j1785j0043J1454R263M56j2284r123N409q681
8610i633m435O005m216j5568k1J1135M424l354J0867K608o871J36J2341K1954
8596B5372P898j5430l1669j768R321O324J7722J389o052k217J1053P064N267j6201
8582A8073j5831K678J3257N231m782R72o789Q855J4133j2060n955M1J205o719
8568A2309Q16O433l114p30n797j3845r888j1558O275J0956J488j890L673J7744
$$ y = [8136, 1044, -7692, -15097, -24511, -13805, -1824, -3949, 197, 18349, 13444, 6625, -8739, -21203, -4424, 9921, -3907, -17166, -15890, 5201, 11675, -2531, -820, 14348, 10672, 9948, 7155, 50, 2790, -8987, -17257, -11462, -5197, 1501, 17485, -2953, -23200, -23453, -26840, -20958, -22301, -22185, -32533, -26107, -6145, 5507, 15701, 3916, -6127, 5327, 14590, 15046, 2762, -6361, -952, -9633, -14068, -8063, -12279, -27847, -27868, -16733, -12309, -15663, -4796, -2188, -9059, -8923, 3418, 25372, 33270, 17840, -13829, -15597, -6276, 48, 17770, 19159, 13107, 10890, 21943, 29007, 34274, 18073, 2242, 4920, 18177, 23408, 18626, 19598, 12809, 21664, 35797, 23737, 17782, 17823, 19028, 12309, 13125, 19558, 16444, 15714, 9917, -3928, -13816, -25374, -19099, -8143, -6655, -8545, -4872, 12872]
8554A2872P924k1956j4858q04J4665N874j197o146j091K2663o629p401j3420q029
8540a7533k402J1185j1373K916K5570J4640N049n165l977K555O963q253j1176
8527H999q707q464J6153n514j7370m24k0254N910J5517J0389j0423N108l168N801
8513f447K2364J260k158N674j2076j2205r803r373j345j1010N511J2528K3312
8500F232j2033p966k337l749j482q905Q309J5444N821k578Q75j0945j1650M07
8486b4557P409K080L869K488M248M859q045j2921N429L794J095R8L946P262L864
8471D918L282M12L427q213k2540K745O129o204o909o474M306k5j0971Q506J1754
8456a5857l305K503n797q837k15N983K260J2778P903n642l168R901R851q332L225
$$ y = [12872, 20796, -1160, -16018, -16822, -2157, 3717, 2520, -3626, -4717, 17946, 11317, 3916, -9504, -17533, -19935, -8750, -20123, -17207, 8363, 23003, 28052, 22887, 18910, 21465, 28428, 20175, 8999, 292, -8172, 7981, 2467, -14903, -15327, -35581, -29671, -14154, -3765, -14188, -9080, -12248, -6447, 15917, 17177, 15019, 20693, 8617, -3588, -13391, -22764, -24109, -35119, -29608, -17080, 6232, -5801, -13767, -16104, -19853, -21335, -30240, -21931, -6487, -666, -3244, -2369, -13314, -24964, -24557, -17148, -15068, -11199, -8711, -4463, 396, -7649, -20570, -15141, -11347, -10252, -10154, -6208, 1054, 4918, 8200, 8612, 12039, 3826, -18714, -15969, -9840, -16044, -22953, -29427, -25121, -25146, -36117, -27611, -15857, -19162, -16659, -22456, -31293, -31508, -25525, -23265, -10487, -2584, -8226, -11394, -1493, 8358, 26, 3251]
8441C251k771j2211L107p38q218N617L965M841O474N003K295L224k882o502k1391
8426a6936o962M04J6940O343j9127N023J9070N495l507j708j4776j6087N631J1339
8412h858K468j653M536J3135O424l996n056n296j6725L329K6461k667J3815o05
8398B5312o811m260K685r788J887m454J066l815l457j1781P020O884N040Q218
8384A3746p079j15j2210J5245K368o519N405p271n578j32p805p769n54r32J0086
8369i114J0832J3734Q809P121R068q499k5431j1694j097m349o444N814P543j519
8355e226N019P831Q491j2746l667P291K1217M318q515j1706j4042q985k081J1223
8341a578J483l068R368L914J083N088J3525J025k3785n180K3990R212j5152M1
$$ y = [3251, 480, -11731, -8624, -9362, -17580, -11963, -7998, -3157, 3317, 8320, 10615, 13839, 10957, 4455, -16936, -23898, -23494, -6554, -211, -19338, -14315, 4755, 10250, 6743, 5035, -9741, -25828, -20197, -8858, -6390, -8043, -3507, 9628, 16052, 12056, 7000, 1704, -15021, -11692, 14769, 12102, 25917, 25312, 18501, 14241, 16926, 7138, 9025, 4571, 5637, 1822, -1635, -13416, -6396, 488, 5528, 13746, 6667, 6552, -5658, 9587, 11955, 5436, 10841, 3570, -2008, -2140, -9945, -17714, -18268, -19200, -9114, 1718, 15452, 24261, 31382, 40450, 31951, 6520, -5174, -6271, -10620, -17064, -11250, -3707, -5226, -207, 7624, 16115, 3369, -298, 6993, 28210, 32528, 24013, 12307, -1735, -10720, -12801, -1578, -95, -3163, 6205, 10119, 11202, 16290, 29815, 30840, 7055, 1875, 25865, 35077, 19925, 19966]
8327A9966L93j1411q395m65J5352j8430j2456K502P138R502m86j140M276M372
8313A0718N092r21j3674K500K2278K982k3040j1489M523p756o85r102m534K778
8299b0330J1176j2453r344J4431J3494J0290j0435r475P913P544k686L225n923
8286b573j5735j1937M655P091M461M265j2816j2133J0644L028o10o192M157J9466
8272d229j572p240J502j186J513O0q551m95L847q113m495P945J2577o084k456
8257a6977k609J762m697K503J8887R85J536m433o091n998M290J6530J366j2663
8243e609Q01k359L149Q357j6098O756J498j5404p0N741J5935P537M882n429l485
8228F202L459j1159k016q667K475K0035M731q441R566m735j793J2792n807J1033
$$ y = [19966, 20359, 8948, 553, 88, 15440, -2990, -15446, -12944, -5806, 3696, 3210, 2070, 6346, 10718, 15810, 14889, 1215, 3715, 25993, 28975, 5935, -5554, -1031, -8787, -9472, -18574, -23108, -20330, -9154, -21607, -30951, -16520, -3026, 7264, -3171, -12646, -4733, 2811, 125, 3350, -2573, -18308, -30245, -25590, -18499, -14038, -9773, -22589, -34722, -24078, -21050, -21660, -27852, -23695, -4229, -5801, -13041, -11539, -12725, -11212, -11152, -19703, -20198, -16351, -24464, -28959, -21014, -8437, -14521, -16977, -19586, -17824, -22521, -20018, -1131, -146, 1390, -3043, -9134, -15132, -10842, 5688, 7054, -5609, -4808, -7167, -4018, 4339, -11759, -5003, -3505, -18909, -18979, -13238, 2697, 10234, 15116, 9687, 6202, 9661, -1498, -3514, -12181, -9706, 10329, 15060, 6619, 16185, 11450, 9657, 22449, 16642, 27675]
8214B7675J314o67j8040l074p910j4815m083O601q977J2609N565k766O484O980
8200F896j8741j6176n883R662O408N166R188R736P207m077q497N716r108J514
8186i89Q933j099o385j560k954m922m092j3548J2880J6784J3010P752l216L376
8172B3970L50j9411J5341O069k627j6547m373Q000O909j352k2815j294K299n357
8158a0838N042J2727J0155l929q551l959j0682o748O739M071P130l52o422n657
8144a1274L348q992k032J7039J0312L864J6258l0l008O429l383j6754k460j2465
8130c148L916Q327l289o817J0099J684k646l021L191o481P693l785k3185j0053
8116b7515O369K4386O301j0242q59J996J2144k584j8828j8043J0912m058J347
$$ y = [27675, 28989, 28322, 10282, 7208, -702, -15517, -19600, -12999, -21976, -9367, -3802, -6568, -84, 6896, -11845, -28021, -33904, -24242, -17834, -12668, -3480, 6256, 13463, 9386, 889, 6605, -2503, -989, 7944, 6845, 460, -1100, -4054, -8976, -13068, -26616, -13736, 3048, 16058, 23810, 20594, 23970, 24320, 4909, 20250, 26319, 23692, 7145, 2772, 10772, 17681, 16329, -6486, -7780, -5481, -10838, -5796, 6931, 17086, 13157, 4606, 647, -10035, -16783, -10044, -5973, 1157, 805, -5617, -11274, -7926, -16918, -18950, -1911, 8401, 12265, 28523, 28493, 25485, 31914, 28531, 11777, 9317, -3148, 768, 9095, 5806, -1011, 9088, 10772, 8126, 5105, 8296, 1815, 9508, 5723, -17462, -27515, -21146, 3240, 9541, -701, -1560, 436, 12580, 9996, -8832, -26875, -15963, -20021, -18674]
8103a8674n79J2470J7433l076j8982n997P550Q622J2874J3445M457j4223n244
8090A0076J0205r667j0538M7R162J1842j4402r356j1949P299J3742N53j0914j496
8076e396m358N379j1667M467O456j6023p514J0014l502K028O577m056M136j0777
8062b4236J3541O362j09J3858N75L757M341j1335p39N640L16j188m377j3743l799
8047a1136K361K0056N796j0184r666L865l099K211r196r35R14k703l289N971O154
8032b880p553j3771k1224M800J5638J800p361q211q384J3545J2018J1684J8182
8019H283j802r225N541J629J410L597N01m475M740K150m96J2876L875j1985p264
8004I355n141q40M324J355R645N753k5100k0315J2582J557J5873R018q837M24
$$ y = [-18674, -19253, -6783, 10650, 7574, -11408, -17405, -9855, -1233, 11641, 25086, 29543, 15320, 10076, 20281, 10614, 76, 123, 9285, 21127, 6725, -2631, -14580, -7281, 6461, 7014, -3900, -5396, -9754, -4375, -16042, -11575, -5119, -21142, -28656, -18642, -22144, -20116, -13539, -17595, -13459, -24236, -10695, -4333, -4442, 9416, 9991, 13748, 18089, 6754, 6015, 11655, 11971, 10783, 6406, -7337, -11136, -8775, 11281, 17077, 6893, -2773, 1092, -2007, 204, -8992, -9927, -9013, -11716, -15005, -9034, -2880, -10433, -24204, -45428, -40628, -24990, -23190, -30551, -38762, -47146, -33601, -21583, -9899, 8283, 6481, -2744, 2797, 4426, 5836, 9433, 9934, 5459, 10199, 12349, 11853, 24729, 28604, 16619, 9355, 4214, 3374, 7698, 9053, 18698, 24451, -649, -20964, -8382, -6825, 9048, 18066, 9229, 9653]
7990I653K828l311r975J3133m926q548j858j224l917m188L754o89L052R01n385
7975a0700L409J451p540J0767L1717M15k1447j3088J3814J1432K724l608J0446
7962B9792J5081N769n491k1202l0749n641J3623J7146k4580k2577p041Q135Q525
7949a9210K603R110M361m693N457O725J839p466m993L635P136j968j2301J3872
7935D107J1440n370J1136q07q776j8851o519K515J4786j119j6395N782p631q947
7921b4649J1617J3060L658j5851L71j475q431j1706N441J1180K6586N784q069
7908G516O150j2089J810r133J952J7855q463j413J769J2226k213L870p525p788
7894D524k3432o123R400J7047K4484q162n206N338o257o966N185n753q129K203
$$ y = [9653, 12481, 9170, -805, 12328, 7402, -1146, -3004, -4228, -8145, -12333, -8579, -9268, -6216, -5315, -10700, -7291, -5840, -13380, -2613, 29104, 29519, 8072, -5016, 8798, 20230, 22954, 19346, 29792, 44873, 50642, 45151, 23949, -6800, -12441, 1182, 18328, -6252, -28829, -35870, -27735, -19210, -16607, -7497, -3136, -7829, -2372, 4353, 6192, -1274, -6267, -2632, 4504, 2536, -9765, 4107, 15547, 10177, 21313, 20506, 11730, -7121, -13640, -11125, 3661, 2542, -13853, -8071, -15702, -24649, -13032, 28, 3686, -12165, -11794, -13269, -21700, -33406, -27965, -16785, 9801, 15585, 7516, 13666, 1577, 3387, -5746, -3794, 14061, 5598, 4185, 5954, 18180, 15967, 19837, 12312, 4524, -18908, -25031, -15631, 1416, 25900, 17738, 12532, 17870, 11613, 4647, 9832, 4079, -4050, -1847]
7880a847J3220O030J435j2387j5703o595o03K10J903K0687P073Q278m494K676
7866A9883j486k2606K901J4095n499l915q90r208n990P080J1276k597n137p354
7852i447J6054L939k853J4649N402n536j8990m806N363K516L408j1249q557P159
7838b948l675p833n215q137Q48J803l119P489K3123k157L869O133j0268j176l76
7823a639l368P354p524r769Q14J0469J7931P840n55p79q938J290p669q34Q370
7808A2993N615o156j0403M717k386j683L453k899o454K114L891m569J0602K1504
7794C0339J994j4667j5695n639n609k705L849J0293N557m408k0146l105J6411
7781c531L607l478j1783j790q055n033J3327Q806J0067P943J0477r497j9002n955
$$ y = [-1847, 11373, 17403, 18838, 6451, -9252, -15847, -16450, -16240, -14337, 6350, 13423, 21701, 17207, 19883, 18397, -4209, -1308, 12787, 7288, 3373, 2483, -6725, -12715, -5635, 5641, 3044, -2093, -9447, 6607, 10546, 7693, 22342, 27744, 22208, 3218, -1588, 3775, 6291, 9699, -1550, -10107, -2948, -6623, -14456, -19671, -27808, -26960, -25157, -28276, -20787, 2336, 179, 4048, 10181, -87, -1263, -1639, -5007, 2347, -5177, -14946, -14132, -3663, 14268, 22108, 21553, 20774, 11836, 13126, 5457, 4623, 12993, 18608, 12452, 2049, 6766, 4380, 2697, 6150, 3251, -3203, -1089, 2802, -1767, 8835, 30339, 32333, 17666, 1971, -3668, -9277, -11982, -8133, 2160, 7717, 3309, -16837, -19942, -3531, 76, -3402, -15185, -16975, -25030, -30063, -16736, -7930, 2137, 10080, 20557, 11060, -7942, -13897]
7767a3897J9885J424m810j3086j438q741J1389n17J880L937K466Q14J4432J2918
7753B6656L453j7840k5822j6212L967K1253J6054L600j0381k2238m093J6345J6527
7740A1269n802j2641k338J2673l228n524R895j821k395j8836j1594l381K1019
7727a2704J8860J037k2672P17J0036j07l247m477P721K2901j549J0761J0605k471
7713C5411j7935j0887j0031j4780m231J2443N249n585o855M084J2991K516m88
7700A902p912N312M764k656l237j0553o169l972k238J7702J9354J5425k370p842
7686A7510j4792m045p492J551P496J2447n27j1191j4549k252j288Q675J6988o509
7672B022m161r067l021P647r417l424p189R940k709R425O354L47j5840J584Q965
$$ y = [-13897, 5988, 7412, 2602, -10484, -11922, -20663, -9274, -9791, -7911, -3974, -1508, -694, 13738, 26656, 30109, 12269, -13553, -29765, -25798, -4545, 11509, 15109, 4728, -17510, -21603, -5258, 11269, 5467, -7174, -9512, 3161, -67, -5591, 4304, 2483, 88, -18748, -30342, -33723, -12704, 6156, 7193, -15479, -14762, -4726, -4833, -8080, -12557, -4836, 18065, 16516, 27277, 37882, 35411, 17476, 6589, -3442, -18222, -22453, -10010, -4761, -10346, -17201, -13117, -126, 2390, 1902, -6010, -698, 4066, 1410, -1827, -12380, -18549, -22521, -24759, -7057, 12297, 27722, 25352, 17510, 2718, -1327, -8819, -7268, 228, 12675, 12148, 957, -13592, -15844, -17132, -8457, 8531, 2022, -2139, -11206, -14227, -6580, -15997, -19421, -26610, -16670, -19379, -9954, -3600, -3253, -19093, -17509, -8544]
7657h544J1572j438n132O582K938j0888o62o687L48q447K528L552k172M135K814
7642i501m157o902L950M240r73M828L829Q998j5730N030J2908k438j7697L806
7628i809L164k371O914J2227R064M090j1453P983J409q998j0052P62j759K116
7614C287p009L044K349K836j270J21q924q803n709j498J4739q040M789J6274P282
7599A3468j406j2609m666N353N516N778J115j1853P371k390l723J013J166N753
7585I886n50j2448J1512k16K738J5842Q013j441j303j6767j8950l190o700K488
7571a1086O417J8061Q461P082r791q288k528K359p146n975J2191j655j7933Q266
7557a565J931J81J419P153P769O064m137n877j3261m151k1123l35l2J5826N950
$$ y = [-8544, 3028, 1590, -3542, 3040, 5978, -4910, -5572, -12259, -11911, -20358, -17830, -14278, -16450, -12315, -9501, -13658, -20560, -16610, -12370, -13343, -8515, -4686, 4312, -11418, -6388, 6520, 4082, -13615, -9809, -6645, -9016, -2102, 10125, 19189, 23279, 11826, 19809, 21218, 12220, 2168, 2930, 1171, 3287, -3722, -678, 1671, 4507, 3237, 3358, -5566, -14369, -20078, -21576, -6837, -14877, -10088, 6186, 13468, 12062, -547, -5213, 140, 5656, 11434, 12549, 696, 8067, 5677, 1954, 2967, 4133, 9886, 9336, -3112, 8400, 8184, 10922, 26764, 34777, 33336, 32033, 15266, -3684, -6874, -13574, -11086, -4669, 13392, 21853, 28935, 19144, 10856, 8328, 10687, 3541, -2434, 9757, 8102, -9831, -1565, 366, 547, 1966, 9119, 16888, 22952, 18815, 12938, -323, -4474, -25597, -25932, -25964, -10138, -4188]
7542d188L658J0523O28O857M755j0543j4360O137O805m357k872K0050q5J315R526
7527C3849o027j4963k369n521K987J0696n319m063J5852j5251k5854P783J1176
7514B976K368l702j9267M771J0930J1982P050j087J999P775j3847J607r092j5521
7500a1058l677n419K911L1132L126j1679k054r47j1843L362n914O442R42p164
7486a1840o606N320o084n856J7360l554n449P28J5613O749m423K163K74P35j959
7471C171q172q460R346o688L424r09J0436P703n38j0821j4065M237K134N628K432
7456a142j675R54m487M426o328j2991o840L492J2865K0824Q260j4479j2375J6668
7442G172m491j1222J112P577J5830L505j4166o113k705N55j8898J1103K0768N038
$$ y = [-4188, -530, 9993, 10621, 17478, 22233, 11690, -2670, 3467, 10272, 5915, 3043, 23093, 23008, 24323, 33849, 27822, 12859, 10490, 4969, 7956, 18652, 13333, 9270, 25122, 9871, -15983, -8200, 2976, 5344, 1642, -17625, -12854, -1924, 10058, 17108, 16021, 18020, 25795, 11948, 13555, 4463, -11058, -14735, -20154, -17243, 13889, 17015, 5336, 3282, 2335, -9508, -6146, -12060, -5618, -4676, -11840, -18446, -13126, -19210, -25066, -7706, -11260, -16709, -15981, -368, 6381, 1958, 4121, 4395, 5130, 3171, -5001, -13461, -4115, -10803, -7379, -8288, 2148, 9851, 9313, -1508, -15573, -11336, -9202, -3574, -1142, -2817, -1863, -6350, -1924, -8252, -21243, -28083, -24591, -11726, 9098, 17358, 2879, -9496, 7172, 2681, -8541, -7429, 148, 15978, 19483, 5317, -796, -3501, -2946, -21844, -10741, 10027, 15065]
7428A5065p600l369j0911K923K702j3018N425J1756N663n777N745L28p072j0543
7414h683Q732J742m348L152P736M032o528R157r983o774J4526K4946J3087o551
7400D4243k2273k938O703m204l951m832J3210q963q26j5623K05R2j3941P00j488
7385a3886Q694q11j1270J728O353m01M822K110J4883J6508L182k5471k5142J3238
7371e463J8095K038j1353j1273m70k642j2753j94J4888K1504L2150N526j6489
7358C3564j7743j0826N880n569p268J369M467P863J3508j707j5386l733j0187
7345e768j9363l7J4848M831k1879k488J2495J2417J6320J4372J2374r794Q070
7332C6398q539j4729r006r260r477J2272r217q519j400p146J736M762l951J909
$$ y = [15065, 7465, 4096, -6815, -3892, -1190, -14208, -8783, 2973, 8636, 2859, 8604, 8932, 1860, -8683, 49, 1791, -2557, 595, 8331, 12363, 5835, 14992, 5009, -1765, 12761, 37707, 50794, 44243, 21970, 19032, 25735, 21531, 17580, 12748, 25958, 16995, 16169, 546, 751, 843, -13098, -12398, -13886, -5192, -6003, -17273, -15545, -9192, -9593, -4771, -2661, 12222, 28730, 31912, 6441, -18701, -5463, 12632, 14670, 3317, -7956, -8426, -11068, -23821, -24015, -9127, 12377, 44527, 50053, 33564, 15821, 4995, 10875, 5306, -1962, -593, 3874, 11737, 25245, 23538, 8152, 4419, -5768, -25131, -25168, -10320, -5489, -27368, -29856, -17361, -4944, 11376, 25748, 38122, 28328, 36398, 27859, 13130, 4124, -5136, -14613, -2341, -11558, -20077, -21477, -28623, -26887, -22125, -26076, -24167]
7318b4167l30R837K0085L772p677r957J1546m805j0548P065p877J5970o301J2427
7304I040L293N758K836k846K059O8j9182L419J9384j3618p654M383q339m316l676
7289i391j4895O777J0138m061m967r056r368n608J5095J2495Q15J534J895P75
7275g822J3143o352q060M644P592J432j6957j548J8734n22j4428p315N67K0946
7261D054R236r745j5269K155j3970k3462q617J6997L3477J9765K0614L048k0861
7248A7422j498j0622j4537j872p862Q603J1268N852L307Q406L966m426O735j2083
7234A2659p990K364k636j3172R003O514O92J998J0607J3838k4073j8574m875L640
7220a0005J5394k64j330k685N307K554Q671q159j3946k564J244m520N835K732
$$ y = [-24167, -24497, -14660, 5425, 9197, 1520, -8437, 3109, -1696, -12244, -5179, -13056, 2914, -3387, 9040, 12333, 18091, 20927, 18081, 20140, 20208, 1026, 4445, 23829, 10211, 2557, 6940, -1399, -5715, -9391, -24286, -17509, -7371, -11432, -16399, -25455, -34823, -40431, -25336, -12841, -12026, -10492, -8597, -7822, 5321, -1031, -9091, -4447, 3145, 4577, -12380, -13928, 4806, 4284, -10144, -17459, -16892, 4054, 13290, 3545, -11724, -9569, -23539, -47001, -55618, -38621, -5144, 14621, 35235, 38283, 17422, 15924, 5302, -9235, -11107, -18969, -10366, 902, 6754, 10061, 18467, 22433, 18007, 24742, 12659, 4669, 7033, 4397, -8775, 228, 6742, 7434, 9432, 20039, 33877, 9804, -8770, -13645, -10005, 5389, 5125, 3795, 1110, 6417, 8971, 17642, 9483, -4463, -7027, -5783, -10303, -4468, -1736]
7206a736o733r438j1942R019J2587J3144J3735n306J786l947o755R709J1402j5679
7192I846j4048k981J5751R173j2100j7249K358J2406q18m833P854M454P130j0325
7178F618k0573j4786O477K2430M058j2428k986O620M202Q053p094r504j3843O003
7164a6753Q170K946J249K247K1499k540k136M482k5546j9104K0136R112j1130
7151g368p369J3345n656l024l359J0196r71o970o266J6111K094L481q733j6703
7137b1192o674n162K172J3718L379m284K864L105K5774J5251l2073j5834P788
7124a1168J1395P475M495J2839j561j3721o38l51l902j2456j1167k379n305J0644
7110a5800J7860K523j3209M452M736P185O79L779o456j3011L475K7170r364P80
$$ y = [-1736, -8469, -17907, -29849, -20830, -8243, 4901, 18636, 13330, 15116, 11169, 4414, 14123, 25525, 9846, -4202, -7183, 8568, 17741, 5641, -11608, -9250, 3156, 2338, -2495, 5359, 9813, 16943, 6618, -13955, -28741, -22264, 166, 4224, -8204, -11190, -4570, -368, 7685, 591, -8913, -22756, -16753, -8583, -5637, -4388, -2141, 19358, 16818, 14682, 19164, -6382, -25486, -5350, 3762, -7368, -14737, -1392, -7048, -10072, -13431, -3235, -4206, -11176, -17442, -1331, 763, 4244, -4489, -21192, -27866, -33028, -30856, -17138, -13759, -18043, -15179, -12074, 13700, 28951, -3122, -18956, -11168, 227, 7702, 12197, 25036, 23475, 9754, 9116, 8765, 4863, -7593, -18760, -21139, -26444, -15800, 2060, 4583, -8626, -4174, 562, 7747, 8426, 12205, 5749, -7262, -3787, 23383, 14019, 14799]
7096A4799q189J766m497p114J0486J0766n339p915j3184P41R04M770J5209P240
7082B0443q921O99j048l119j7451j2636K376J3195K3122N44n354m523j5358J1608
7068C577J7245N53j8847q280m33p030k147j2063n89q96J7911j79M523m700j7441
7053b8796j1000J9234Q804j7619M073K2624j7751k1120J0948J5940k384J579N374
7040a0094r585J0554P329j908J5504Q541l256m627j3319l092k840n405O860k1051
7026b6389J202J4286j4892N59J8590l174j0116Q111J0130m648M571N486Q339m836
7012G219j0151j9783m415R109O005k283J052Q239P933j720K264p661r932l217
6998a7341p761J6242J734M598r55o45J272P160J1150j2082M047M709j1372q006
$$ y = [14799, 6610, 8376, 3879, -3235, 7251, 18017, 12678, 4763, -8421, -7680, -6776, -2006, 13203, 20443, 11522, 12221, 11173, 8054, -9397, -22033, -19657, -6462, 16660, 17204, 11850, 7327, -8031, 3577, 20822, 21375, 2528, -5752, -6185, -13215, -15362, -27425, -28014, -28910, -10999, -11178, -6655, -11355, -28796, -39796, -20562, -11758, -29377, -25304, -2680, -20431, -41551, -30603, -14663, -17047, -15468, -10094, -19679, -9125, -1796, -3704, 11800, 20341, 17085, 12458, -861, -3953, -6793, -12198, -5338, -26389, -25187, -10901, -25793, -25234, -6644, -9818, -19934, -11823, -1693, -6341, -1770, 3716, 12055, 7219, -2932, -22715, -27130, -18021, -12016, -14299, -13247, -5008, 2925, 1205, 3469, -4192, -14124, -17341, -25102, -8860, -7126, -2528, -3483, -4128, -2856, 4304, 15454, 3372, 7419, 12128, 756, -7250]
6984g250j128O731L459N038j412O659k810j288l810J6694J2838j3027k1619q471
6970i396J283k613j3369O336N483O677J1001j7262j908K3477r986k3864L063J3471
6956g607L787p596j2934O978J480K47J354M744M634L75J1626J6764R377j0657
6942B2572n072j0627j0116l595l356J1751J4527p582q662O258J5679J716k433
6929B1060o431q473j3095O217j75p693k012R620Q692P650o375j0131J4870P687
6915B1411K881j3783j8502j0076J408J3919N206j3358j6437o382K277Q833M064
6902a8539L414q22r102n586J2783k357P31J183L778K2211N209j4190n218O471
6888c4N988J433k014p164k022L374j28J3054L028q154j2263J4865p060j1611q951
$$ y = [-7250, -8378, -1647, 1812, 6850, 5438, 12097, 9287, 7999, 4189, 20883, 33721, 20694, -925, -9396, -8113, -10726, -24095, -17759, -12276, -5599, 5402, -11860, -13768, 9709, -277, -24141, -21078, -7607, -3820, -11416, -24350, -17372, -15892, -15645, -14291, -9547, -4913, -4538, 7088, 23852, 33229, 22572, 17500, 6873, -3243, -6838, -10194, 1557, 16084, 8502, -160, 6098, 21777, 23493, 21060, 14629, 6156, -6939, -722, -897, -8590, -10602, -982, 7710, 15360, 8985, -1146, 13724, 21411, 24292, 10509, -7993, -18069, -16661, -2742, 2464, -10894, -27331, -33713, -31436, -22603, -18539, -15125, -15947, -25049, -30635, -17852, -20209, -19478, -18295, -14517, 7694, 12903, -1287, -6505, -34, 5954, 7387, 5373, -1791, -3813, -439, -567, 12487, 15515, 7361, -4902, 9963, 2903, -8708, -17659]
6873a7659q583J338J2339n893l245N095J0777J8698J1341P770q198j0039j0769
6860B972q81J2393j2971r792J1946l245O205J5159q416j2060n249J1978j667j0344
6846c972k25m195m71R732M043q600O615J5571K881j1827k0218J1464N292q489
6832b399j1285N280q211k608J8440N267L462j957j216j6999o304R006l503j0607
6818b3634m126J6384O400J2704l308n657N215P236P429r59j4299j9958j5464L237
6804b8800J6335l336J204n132j4147J3719K2349J0145j0202O960L161o496n53
6791E207r679j0306O237O116l232M222j013p989m261j3981M109J3724q827j5502
6777c5175n539J9401N413J862P678k339l402P825M924j9307k65q167j1880R627
$$ y = [-17659, -26242, -24904, -12565, -18458, -21703, -16608, -5831, 12867, 24208, 31978, 23780, 13741, 2972, 2091, 14484, 1513, -8279, 3667, 422, 6627, 21786, 13370, 1310, -3939, 8039, 6372, -3972, -4197, -8392, -8863, 869, 4912, -3688, 2927, 18498, 21379, 9552, -10666, 798, 6090, -2399, -13684, -8404, -16615, -19223, -783, 4484, 7946, 5989, 4773, -12226, -18530, -9524, -13027, -23634, -27760, -11376, -4976, 7728, 4420, -1237, 3978, 11214, 18643, 17684, 3385, -16573, -32037, -28800, -12465, -15801, -14597, -19729, -33876, -20157, 2192, 12337, 2135, 9095, 12256, 5760, 5207, -4472, -14778, -8541, -2425, -5657, -1435, -2448, -10437, -14698, -28679, -24570, -10846, -19673, -35175, -40714, -21313, -15900, -14038, -6360, -8699, -12101, -4276, 648, -18659, -18924, -27091, -38971, -29344]
6763b9344J4117j595J3825N648k35J1894r08K88j5831q801rM01p838q112j205
6748b7705K0058J2945J279K07j2579j4888j082J6940M642j355L136p009j2252
6735a7663n273L84k608J8492J4586J4216o725l421j147p815p707J4860N270q948
6721F501n181m049O348J0419L14j1725j1986L775J1858K157J1987K774j0867q307
6707D018K743k51N428Q275M121j6152O032q741j5020q11q932N666j880k3578K401
6692c6681L732J0304J0384O57J769m647q301l721J2089J3624n727J5169q376l619
6678c344q374j515J0874O151M333L051l012j2366J0916N008l108p899K51L534
6664D500Q826j54M909J1242l31k0145r179Q775o969R127M683J515j563j258p551
$$ y = [-29344, -15227, -16822, -2997, 2651, 2416, 14310, 13402, 13690, -2141, -10942, -10951, -10550, -18388, -26500, -27705, -7647, 5298, 6577, 6784, -5795, -20683, -21765, -4825, -183, -1538, 1598, -5411, -17663, -22936, -22552, -25160, -6668, 7918, 22134, 15409, 11988, 10841, 3026, -4681, 10179, 15449, 6501, 1320, -2729, 3619, 14038, 14352, 2627, -9359, -5584, 6274, 8431, 20418, 23192, 12325, 4018, 6761, 6510, 11938, 20213, 24334, 8182, 14214, 5473, -9547, -10358, -19290, -13624, -15504, -39082, -36681, -32949, -22645, -12261, -11604, -9835, -14482, -22783, -26504, -14415, -791, -6518, 8651, 275, -3344, -11718, -13233, -2359, 3792, 8125, 11176, 8164, -4202, 6714, 11722, 8614, 715, 966, 4500, 13326, 13172, 18081, 29323, 28992, 8847, -332, 8443, 1474, 10601, 15284, 16799, 15236, 13978, 6427]
6649F427M01j1104j1617o585k200J1465J2729J0003L215p501q543k346M641P610
6635F595p139K497K3193J2659j0595k6124q761j4974j5942J1028N492J5125J0719
6622C773M661r514j550J6092q060j4063K3M1p088K1692L355j4036L148J0689p041
6607B122l1140q551P904L561O118J3745J061l290q256j1382J4778O157K950J3547
6593I324J5969k4416j9933j1561K866J9314N81j1885Q458r9P321m701K335j0945
6579a7372j0662L618j923N259O526Q095o073M499n276J92P529J486Q415q654n839
6564a0180l99O469K8875N447p64j5266j5190j9436j1778O177J0455J5950R710
6551A0070K943L488k89j4132p481R297j090M212M374J6195J6095l639r696q776
$$ y = [6427, 6828, -4276, -15893, -22478, -24678, -13213, -484, 9519, 12734, 5233, -3310, -5656, -1015, 6595, -544, 1953, 25146, 37805, 27210, 1086, -7675, -22649, -38591, -27563, -22071, -6946, 3773, 8434, -1080, -2630, 13462, 5402, -8661, -8638, -8597, -15685, 6007, 9362, -4674, -1526, 9163, 2122, -29018, -37569, -29665, -26104, -19986, -6241, -5180, -8470, -16726, -28108, -13330, -7173, -4223, 9324, 25293, 877, -19056, -30617, -27751, -8437, -7856, -19741, -11283, -11382, -4061, -8762, -6427, -17372, -28034, -24416, -26339, -21080, -14554, -6459, -12532, -8033, -13309, -13117, -5588, -4102, 4313, -4341, -10180, -10579, -4110, 24765, 30212, 29448, 14182, -1008, -20444, -32222, -26045, -15590, 360, 10070, 13013, 16501, 16212, 2080, -5401, 3896, 2806, 7018, 11392, 27587, 43682, 40043, 30347, 21571]
6537B1571n509m513R58Q724m949r453k917J1740O192L343N870r352o127o027k2272
6522a2721L40J1610K504j6271k310N468p313Q557J0554k865j3950J1226J4018
6509H847j955O80n620q155j5546n156J549k134L246J0740J8600J8366m168j1054
6495H240j4095j459K699J1636O131j0210j4238O706m217k937R388q54M505k522
6481a227J0418K872j0838r839L659K831P690L83j1305Q638r907P829J2469J19
6467A3792l318j5700k189q27N900K234N203j3239l13M202N516L160k080k394p553
6452g606o488m301O327J1553k438k713p122J956J5409K827j4080k989Q29j6234
6438b5070k1222Q695L1490J7572J2959p370r806m976o335Q97q443r492j54P847
$$ y = [21571, 16062, 11549, 12507, 21231, 16282, 6829, 3912, 15652, 21844, 25187, 31057, 21705, 15578, 9551, -12721, -12381, -771, 1733, -14538, -16848, -11380, -18693, -10136, 418, -2447, -16397, -5171, 8847, 6892, 7572, 1952, -6203, -21749, -26905, -25356, -27490, -24244, -13504, 5096, 23462, 19294, 8240, -5855, -7314, -4615, 7021, 13152, 2942, -11296, -4590, -8807, -11744, -2356, -3210, 1295, -1227, 9191, 12063, 1225, -8614, -4955, -2124, 5566, 5949, -5356, 3282, -6625, 1204, 13673, 13792, 10474, -5226, -7415, -8242, -2342, -108, 5095, -8144, -8457, -4255, 1261, 4421, 2341, -53, -7606, -14094, -18395, -12068, -515, -2953, -5666, -12788, -10832, 4577, 7404, -6676, -9665, -8836, -25070, -46292, -37597, -6107, 11465, 24424, 17054, 7248, 2272, -4063, -3166, -11609, -21101, -21255, -13408]
6424a3408N777J2117J53k0894K569J4385o577K245O033M32l455K360q393j1274
6410a7930L659L824J5150K824K779l861j4529J298M069l195j6532K722k812m305
6396b6839J0107J2255N22L638M298Q853k065m288J4707l011L668r44r876N546
6382A6571j7927J2082m884l406m930j7551R57n479L965O399Q626P185K969J524
6368F101k91p73m816l612L785K667M184M321M432j6007j1263q863O499P452p046
6353a3230O292M83O94L588l352M777Q31Q689q719j0670J393O835J0356l493n735
6338a261L698O828j7722J2177L710m237J0466j610j0822O573Q587Q026j0475k2056
6324h118j5327L294M142R146J696N768j3002k581n85r791l638Q670J8527q63J0271
$$ y = [-13408, -7631, 4486, 4639, -16255, -13686, 699, -5878, -3633, 2400, 2832, -623, 1737, -6656, -17930, -14271, -10447, 4703, 7527, 10306, 6445, -8084, -6786, -2717, -5912, -22444, -19722, -22534, -26839, -16732, -4477, -3955, -317, 3981, 12834, 10769, 6481, 21188, 18177, 21845, 20901, 11025, 16571, -1356, 10726, 5842, 2436, -2494, -20045, -19088, -24567, -20602, -14203, -5577, 1608, 4577, 6101, 5810, 5037, 221, -3391, 394, 3061, 7245, 11566, 15998, -9, -11272, -20135, -13636, -6184, -13230, -6938, -6455, -5761, -2173, -5525, -748, 83, 8772, 53, -10617, -9224, -2389, 7967, 4474, -1261, 2437, 9265, -8457, 3720, 7430, 3193, 13659, 12049, 1227, 7800, 16387, 24413, 13938, -8118, -23445, -20151, -16009, -6863, -5167, 601, -12401, -14982, -15567, -25358, -28996, -20326, -1799, -2662, 7609]
6309G609J3427m292P64r055p823M298M916l504K195j0015L163o82P8J83M804j565
6293D501R562J7515m104m996r830j2589j5422J2910N047q793K844K7714J4318
6280C8677r220j7550j2697m960j6541l109j572P331m349k429R281O442J0636n557
6266e617l925Q775J6502L765r326M734L102k3369n601J535l296O388j10j8549
6252b4992J549j234k16J7734l73j1694J3350j644k615R327J8389J215J907j6083
6238D620j5185M579K385l329O856l938o795N343p303m068m958N400K756K309q763
6223b0091P100J2354J11N014J1839N689j6086j3022N695j1281Q03Q607p702j267
6209a2237P507R155N669q350q267K335k976l085J824J744L413J245k0851J527
$$ y = [7609, 21036, 16744, 17508, 8453, 630, 4928, 9844, 6340, 8535, -1480, 1683, 1001, 1079, 1262, 6066, 4501, 14063, 31578, 27474, 22478, 12648, 59, -15363, -2453, 2594, -6199, -3355, 24359, 38677, 29457, 11907, -790, -5750, -22291, -25400, -26972, -19641, -23990, -26419, -17138, -10696, -60, -5617, -9542, -767, 15735, 19500, 10174, 14908, 18010, -5359, -10960, -9425, -12721, -6333, -6443, -24992, -23443, -24677, -24893, -7159, -7532, -19226, -5876, -7520, -10135, -808, 17581, 18796, 20703, 4620, -10565, -5986, -3601, -6930, -74, -4012, -10807, -5464, -12767, -16835, -21793, -16393, -13637, -11328, -20091, -12991, -637, -526, 4488, 16327, 22016, 5930, -7092, -1397, -12678, -11875, -3268, -10970, -12237, -4730, 4425, 10094, 1744, -6523, -4188, -7164, -10249, -8425, -6681, -3268, -2023, -22874, -21347]
6195b1347l623J5688L630j4094J7796K6535o916r621p937k972p465j1053J9032
6182b347O044R513j0758m618J2491m198n10J6403J140j6983k250n481k8901M674
6168b5781K5843L0906o325q808l742p859o82o333J0579L240L636Q921P266q060
6154B2801l086k6531P849L237j1197q134J560j0875N569J4583k270O315J2475
6141A2296N62J106j1014j6268O768J320N117P023q336j646R095J100p732q212
6127h821p379q382J2924J8682J324j4407o359M824Q252j0661l157n285j983j047
6113b1475J940l518m23J18O466k29m238M570J2181k262o361Q937K415n611J348
6098f142J6655K681j158m681j6159M855O627k287o404r938M512L579r198k177
$$ y = [-21347, -24970, -9282, -5652, -19746, -1950, 24585, 17669, 8048, 111, -2861, -10326, -21379, -2347, 3697, 13210, 2452, -2166, 10325, 6127, 5617, 22020, 23160, 6177, 3927, -1554, -30455, -25781, 62, 30968, 24643, 15835, 12093, 4234, 3552, -2781, 7798, 11038, 14674, 23595, 30861, 22801, 19715, -6816, 1033, 4270, -6927, -15061, -13501, -24376, -18807, -4224, -6494, -179, 12296, 12858, 13964, 2950, -13318, -6550, -5230, -113, 6910, -1426, -3072, 6023, 7123, -609, -8821, -16200, -24582, -11658, 7024, 8348, -6059, -12418, -7594, 658, -10003, -13160, -18445, -20428, -21475, -19535, -23053, -23476, -23358, -16892, -17121, -21359, -16789, -4608, -6870, -13231, -4294, -1879, -7490, -6142, 10513, 13194, 12036, 7355, -8804, -3949, 2678, 391, -6013, -15951, -11439, -7860, -17058, -19235]
6084a9235r427M086R622m599k828P445J0266J6099J283q097l021p154o075K524
6070i111K794j1060R948J2784p275j1305Q465N846l099j2451r483O006J0525R160
6056A744M471M2p560j589K409N011q909q934o654P709O654k944p391q695j609
6041b6245N228R672o968o562L012J0267m452K071P385J777j417J5390J1666k656
6027A8168J737j2408l607R529M674n969j1204r901L581K619r596O978L734L713
6013B048J1895P595M463j8458n803j0712j4295K323K7561Q215j2874K906J615
6000F479o940J1709J1179Q67j3258o270j920n632j0427J153j708m912J5018N061
5986C99J873k941p48J6236M726L406Q294k201j3964j4655r789Q223k594j3642
$$ y = [-19235, -28662, -24576, -14954, -19553, -22381, -14936, -4670, 11429, 12712, 4615, 1594, -5560, -11635, -9111, -6317, -17377, -7429, 5355, -1920, -13225, -4760, 1086, -2013, -14464, -23947, -17941, -7416, 1744, 6215, 6257, -1303, -2892, -483, 4528, -4381, -13315, -19969, -12260, -5606, -8550, -15941, -24636, -26245, -21017, -11345, -18313, -24875, -21863, -11596, -16048, -13977, -6592, -4815, -6232, 9158, 20824, 18168, 19905, 7497, 3890, 13419, 18093, 12124, 920, -8981, -5400, -2781, -12377, -5399, -1665, 2048, 13943, 21538, 26001, 7543, 1740, -8972, -23267, -20944, 6617, 14832, 1958, 4864, 6479, -461, 11248, 22427, 23294, 10036, 3766, 1846, -3786, -14213, -13060, -14768, -19680, -4662, 399, 2272, -669, -1417, 14819, 19545, 22951, 31245, 29044, 15080, 425, -9364, -1141, -3735, -17377]
5972a7377m203J9115J7785L443n694p923Q194M004k42l717q100j9720n956N899
5958a4492L103k105p888r342J2529J1701J0534p230k8541o989J5956N683J0991
5945f090J955Q56L188j6676j2309J1195O119j2637J722N849m133J2392J1736p092
5931c925n003n614j0730q319L685J3703L599P070J5279J0031R951p130k4447p968
5917i818N708J2962k927n624N215o050o218N769O833n664L79n243j4913P434k761
5902a4918J0382R751L301j730m656L070r667j803j300j0546J1238L123j655J756
5888c654M665p358q222Q072M463j452m85K709O508L889k514Q45J205j447k1519
5873a4295P334P675l452L19K9197J6302n355k0020j1018m561j5279M992J8550
$$ y = [-17377, -21580, -2465, 15320, 18763, 13069, 5146, 13340, 17344, 17102, 13385, 5285, -14435, -20391, -14492, -11389, -13494, -21382, -30724, -18195, -6494, 4040, -3190, -31731, -38720, -22764, -17081, -6090, -4135, -3279, -91, -16767, -29076, -17881, -11762, -24399, -22677, -16828, -20961, -8569, 3167, -3925, -8928, -14542, -25272, -33591, -29906, -16203, -12604, -5534, 9745, 19776, 29727, 22597, -1850, -9818, -4110, 8852, 5925, 301, 5516, -534, -6752, -983, 5850, 186, 565, -4678, -19591, -12157, -14918, -4536, 5215, 8516, 6786, 2130, 5200, -4467, -6270, -7570, -18116, -6878, -3755, -5410, -3654, 1011, -6347, -14569, -6497, -2034, -3486, -3971, -1262, 5246, 9135, 6621, 7466, 8671, 7224, -14295, -6961, 714, -2738, -2419, 26778, 43080, 37725, 17705, 6687, 2126, -13153, -8161, 10389]
5860A0389L843Q31k0381q812L609P713P129J8396L311j2059j0518q032J1267J397
5846H083l395M456j2572q161o137k532q84N004K1664L467p536O731j703q386J0493
5831H592r855o409K004j485J0353J5852Q900K30n905k1130j1662L872M108o617
5817i152M348k950q251R948J1690N373R958j003j2705j5979q26R828J361l336
5803a696R914P16N054O703K976j1334o362n147L719P223m672j0953j8475J454
5789b0880M691M118j806K488N754J1210l846J6136K0980Q191j9890j2784M37m217
5775A0582l310o715j0314j2389K731J5847L400J3600J6535j364j1575m46Q445
5762B5027p392j0832J2861n8K43N041n229M578j7715j6828J2420J4398p6l550
$$ y = [10389, 14232, 15063, -5318, -14130, -10521, -2808, 4321, 22717, 26028, 13969, 3451, -4581, 6686, 8083, 4688, 9144, -3428, -11589, -17726, -20258, -21142, -16138, 5526, 8993, 1457, 8188, 6485, -1901, 8592, -1263, -7672, -5668, -7153, 3200, 19052, 27952, 28182, 22277, 1147, -10515, -6643, -2535, -9152, -4804, -7754, -16005, -6057, 5633, 11006, 20964, 19961, 7256, -8723, -9549, 279, 1640, -1696, 8218, 8934, 13988, 20691, 23667, 12333, 5971, 824, 4543, 11766, 7094, -3859, -22334, -20880, -16189, -12071, -13877, -11389, -5635, 5575, 1729, 17865, 38845, 47036, 27146, 14362, 14799, 10582, 7272, 557, -9757, -22146, -19415, -3568, -168, 13432, 29967, 28603, 17028, 16582, 25027, 17635, 6803, 19664, 19606, 19849, 24890, 19661, 24239, 6524, -10304, 2116, 16514, 16438, 12888]
5748A2888j9113K184J2536J0673r256m77J8994J4718k382j859r79k2354k454N962
5734A9081Q424o259j0448J942o123j0687M406K0416O81k3380q427l730P977J1691
5720E564N60r483N846O298j197o430J2148R52j1616m079J343p796O831r229l263
5705a3551M590l522k0093p926J2627Q472M910l641j262J4514K1247k274q030O667
5691A2728P11j1955j0916P580J3576Q194N907K9J2276m9n535j5018k268M35n713
5676I982m411p50k008M360K963m724k184o267r24J1346O573q267J0869K613j025
5661A8146k946p26j9463o429J2204L716M981J7091l699k0280m678J486M264j069
5647B598m71J1975J810l191m125Rj613j1138n294r227Q224j66r778j652P340R764
$$ y = [12888, -6225, -4041, 8495, 19168, 9912, 9435, 28429, 43147, 40765, 38906, 37927, 15573, 13119, 19081, 27505, 21246, 10798, 12740, 6617, -4070, 336, 20752, 21433, -1947, -10374, -14104, -6127, 5564, 6124, -3359, 2487, 8785, 7588, 1158, 13306, 14258, 2642, -1437, -94, -7890, -1059, -10288, -13551, -8961, -12483, -32576, -40502, -27875, -19403, -14493, -18134, -19396, -4882, 16365, 14091, 6061, 12728, 13439, 1484, -9432, -1852, 11724, 19918, 25825, 25854, 38130, 38081, 32546, 17528, 15260, 15695, 9982, 5571, 4821, 2813, 7173, 10136, 5412, 3228, -3039, -3963, 7383, 13956, 5689, 16558, 19171, 18146, 15200, 14474, -4989, -11418, 786, 4502, 9483, 26574, 22875, 2595, -2083, -597, 3667, 2598, 2127, 14102, 15912, 12721, 8596, 8605, 6992, -4146, -9440, -18667, -10443, -10609, -20387, -22039, -14699, -4935]
5631d935j288j8104J573J9209j2984k305K1508J6079j0958j1876o194j060M444
5618f891n971L274J3427q43j9113Q549J7612j91k637P93m33j6329p663J0792q97
5603f521O177J1435M299n685r70n286L460k199K485r100j0010j3370J0748J8776
5589D239J3835n450j3772l297q401P779J0264j8932j8809l244O722O372K0935
5576a759J8548M824L507J909j105j6106k2941j4723J7278J4879R605K756j2469
5563D203j587R696j640L892j259o490N940j0887j1792J443M685q561j625R058
5549d924J3828J0687o378m258j4948l121R907R735j0905J191KP619K566J702O864
5534A9567R257J2875j0805k0959l710j946j636P856K119n794j1330L531J1304
$$ y = [-4935, -6223, -24327, -22754, -3545, -16529, -18834, 2674, 18753, 7795, -4081, -10275, -11335, -6891, -12862, -9588, 3839, 2996, -16117, -7568, 10044, 9853, 7216, 8009, 7576, -8753, -16416, -5624, -6521, -344, 11091, 15390, 9705, 8735, 3449, 6909, 4710, 7195, -1905, -11915, -25285, -14537, 4239, 18074, 12624, -1148, -4445, -12846, -5067, 5197, -13735, -32544, -35788, -29066, -22694, -1759, 16789, 21613, 25120, 27029, 25924, 9818, -13123, -27846, -10568, 4311, 13916, 16672, 4203, 2616, 12312, 10672, 14564, 13305, 6815, 12755, 1868, -9924, -8481, -3796, -12357, -13982, -4924, 8904, 19591, 13213, 8955, -5993, -9114, 793, 10528, -377, 814, 816, 8435, 11001, 12703, 19567, 28824, 41699, 30894, 9935, 6225, 4279, 2643, 10499, 12618, 6824, -4506, -975, 10329]
5521A0329r013n96L729p756j2156R334K0460l377M162Q559k3251m925J3635P536
5507A6670O213J429j1802n865M993o88j7393n738R148p77j099J0484M747o591
5493C731P624P103n741L891r120j1863j164O301K656j5691p907P14l222L259j683
5478b1112P530J2909J0353l585j2357j5610J618J2486K264K050M526j3596P630
5465d894J2511j0157q508j045j6107k1625n173N632J5504J2162J5242N755P652
5452F949K2443R878j0388k635N032o132j6153j172N445j1910j2697j2258P662
5439a5936J4792J4112J4776n347l996M971n713j7753q28J0626q712j4286n136
5426a8430L491R777k247N283m543K352o340l542J7656l88L430J0137q663k1788
$$ y = [10329, 1316, 720, 4449, -3307, -15463, -6129, 14331, 10954, 15116, 23675, 424, -4501, 9134, 16670, 22883, 24312, 12510, 6645, 11638, 10950, -6443, -12181, -3033, -3810, -4909, 5575, 10322, 3731, 11355, 18458, 12717, 16608, 7488, -4375, -5539, 762, 3418, -12273, -20180, -19466, -22688, -19429, -21112, -13582, -673, 9680, 6095, -6262, -21872, -20254, -7768, -5504, -3454, 1072, -12524, -4894, 7617, -2540, -11048, -12093, -28200, -49825, -54998, -49366, -33862, -21700, -6458, -703, 6949, 29392, 39270, 28882, 26247, 31279, 25147, 8994, 7822, 13267, 1357, -11340, -23598, -15936, -1144, 12968, 27744, 22397, 18401, 23372, 17659, -94, -922, 9704, 992, -13294, -18430, -14939, -5162, -7409, -2126, -6669, -4317, -10657, -14199, 3457, 3069, 6499, 16636, 7973, -13815]
5412a3815N089j7689k222J2309Q339K626j8139K2595Q325L340L096n018k789q550
5398b503j1402R435J5490L140m63r62k748R54n122R949J107j1743o669O435J1012
5383A5910n146q475o306n081R507p144j9627P013J1313k512q516J3047Q497P826
5369A0306j188j4179m693l153K71J8416K77K280K070K14m39j5424m227o11J8697
5354H617J5246m930k2143r503L972j885P789J1216J2897n190m148k340j3824q525
5340a2751o741K979Q128j0279n833J7182P519r352m410k713M330M744q385j2210
5326b7792J8938J3250M69j0001n723J1993J0328p494p879K66l74k974R518j1686
5312i161p287J2902J1935p99j567m546O325L005n612M542N537j3131l26M190L150
$$ y = [-13815, -8726, -26415, -28637, -16328, -7989, -5363, -23502, -907, 7418, 10758, 13854, 8836, 6047, -2503, -13905, -4470, 11020, 14160, 13697, 12735, 9987, 10941, 5819, 15768, 16875, 5132, -1537, 4898, 15910, 10764, 2289, -4017, -9098, 409, -6735, -26362, -19349, -8036, -10548, -19064, -6017, 2480, 10306, 9118, -5061, -9754, -12907, -12636, 5780, 6057, 8337, 10407, 10621, 10182, -5242, -9469, -10080, 8617, 23863, 18933, -3210, -12713, -8741, -10626, -2837, 8379, 21276, 16086, 11938, 9598, -4226, -12751, -19492, -16513, -8385, -18664, -24497, -7315, 204, -9148, -13558, -16271, -11941, -7197, -15582, -27792, -8854, 4396, 4865, -5136, -10859, 1134, 11462, 3968, -3911, -3645, -4019, -6993, 2525, -9161, -16448, -3546, 8389, 7590, 6023, 1477, 7802, 10807, 5195, 9737, 15274, 2143, 1817, 6007, 9157]
5297I157J3371R857J1729m724j5221l220l733j3921j7434p81J1891J0268O791
5284A4030k0111k6535Q540J1974j618m356R984J0942J0447K278j6932k420r69
5271d746q898k783O478J535k304l498J0100J6031J5444K2113J012l4004j1808
5258D672j0928j0461q60R732R017J0318n345p75L945N821j0349j3211N912j832
5244d344k489J0329K2547l090j5106j0167J2281p316j401r689k274q776L22P642
5230a1531N092J2609R996m804j882o489j393J990P840N105L692j1100k98r717
5216h90N316m136j4334L619P971p706R706j043q803j5934p704J4060N223R27L941
5201i787l0N662L022K635p155q513Q990P020L74j6504Q921M353O498N267p278
$$ y = [9157, 22528, 32385, 44114, 39390, 24169, 20949, 17216, 3295, -14139, -14920, -3029, 7239, 14030, -6081, -32616, -24076, -12102, -13720, -18076, -8092, 2850, 13297, 15575, -1357, -3777, -4746, -13644, -16427, -9949, -8414, -10718, -14216, -4116, 11915, 27359, 49472, 50484, 16480, 4672, -6256, -16717, -17577, -7845, 1172, 11490, 6145, 5370, 9315, 15136, 4787, -8424, -2512, -4344, -6833, 3496, 26043, 22953, 7847, -2320, 9961, 2645, 1244, -8445, -10719, -19495, -19173, -11531, -6439, 6170, 16166, 11362, 9480, 2991, 1598, 3588, 11428, 16533, 20225, 9125, 8827, -890, 4426, 290, -14044, -10425, -2454, -10160, -454, -1497, -10300, -26234, -33938, -19878, -14655, -13728, -9787, -9817, -4155, -1133, 1502, -5653, -14166, -5176, 1844, 2218, -14286, -5365, -1012, 5486, 10753, 3475]
5186C475j7340m665O711P599j557J2564J1728j3189n858n014m106N328L206k074
5172c192q125O383Q803J855k437o288K148l538k718j0319J2300J7326j4029o638
5158h469J5397n040k126J1946N739j9761M725J434j464Q186l545j3158l267n436
5144a4839n117J2006K657J0188j104j3630L004r539K167M195J1709K629j1501
5131g175J0474j6351j0214P610m87k013K473J85P285J1790N735j602J1472j6631
5117B551j193k796J1505O399l951o832J052j0873j1553K135K1388J6322k385l419
5103A8350l676r797K184k244N823K850N848O076l301N505K002K873j7924j3640
5089I29j0679j186R780j052L781m370j7737Q427R755J3563R334j1149j0929n491
$$ y = [3475, -13865, -18530, -11819, -4220, -5777, 6787, 18515, 5326, -532, -5546, -9652, -4324, -1118, -3192, -11317, -4934, 3869, 5724, 3287, -3001, -853, -4391, -7109, -17428, -5128, 12198, -1831, -8469, 6928, 1888, -238, 11708, 17447, -2314, 2411, 3845, 2381, 10567, 7022, -6136, -9403, -14839, -19956, -7950, -5293, 4895, 3791, -9839, -6835, -16374, -14207, -10012, 1697, 4326, -7175, 3299, -13052, -23266, -15656, -16143, -18156, -15683, -15498, -8213, 3577, 9312, 7710, 19182, 2551, 1358, -1438, 10067, 16466, 12515, 5683, 6735, -4138, -15691, -13556, 7832, 24154, 21769, 18350, 14674, 4877, 7061, 4817, 10640, 13490, 19338, 25414, 22113, 27618, 29620, 32493, 14569, 929, -9750, -10936, -1156, -2208, 1573, -2797, -20534, -12107, -2352, 11211, 20545, 9396, -1533, -7024]
5075g024P329J2178l028k2925n929J5635J9334m374j5751K289N746q662N00J860
5061b822N043l427j7512J1579K2395J2469J0868l532q163j6049j314K12l009j2561
5047e823j387K451P798R619r18j0619j0169o01K829O332K3319O014k7924j3019
5033a2098K167k846m313Q19j1609Q659P054n279l464j451n079R051R705J0331
5019A647N602N817R039M322n527K66P907n314p742M901K1586k404l723q062j0164
5004A8151j6517j6350j023l855P375Q801J032j9350m548R802J9714j087M677l628
4990C194j4739R175p22m260j086n662P392J280p958J676K373O55R717K62L513
4975D810L153m831j1729l516k102j2137J1091K4194l452n989J3874m167j2300
$$ y = [-7024, 305, 12483, 9455, -13470, -19399, -3764, 15570, 11196, -4555, -2266, 3480, -5182, -4682, -2822, 2221, -1206, -18718, -7139, 15256, 27725, 38593, 35061, 26898, 10849, 9535, 9747, 6738, -5823, -7210, -4759, 3039, 12658, 11740, 1121, -9048, -9649, -6820, -488, 22831, 28845, 921, -12098, -9931, -12777, -17090, -16271, -27880, -19221, -12167, -17446, -20910, -22361, -27440, -18389, -8684, 1647, 7249, 13066, 22105, 26427, 20900, 21166, 29073, 23759, 16017, 20918, 42504, 40100, 36377, 28315, 18151, 1634, -14716, -15739, -19594, -12219, -3418, -2386, -21736, -26284, -16482, 3232, 2145, 6822, 3194, -11545, -2370, -3092, -7352, -8438, -14100, -6708, -5428, -13386, -11710, -9337, -8682, 1035, 1297, 4810, 7963, 3132, -8597, -12113, -14215, -26352, -15261, 8933, 5481, -508, 13366, 9199, -3101]
4962c101L980J0197P615L565K664m551q624m360j0422q860k188J4025J3181K2127
4948C5248m000o504p157M168j2064j824K51n600o941j2889q59Q749N403J0233
4934F214M172k0514k1238j66Q657m871j5630J0582Q14N282J7177M471N163M784
4920D897N645p812j4937j695J6456N164j3699L879J1748Q171n755l849R775m228
4906A3760j5706o217Q373q161n757Q840M379J600Q392N934r550j6676J157P991
4892a641j0444o957K5796Q884j3509l776P126k1222Q314J2205N071j3718l72P711
4878C468n299r850j0164K267R556O324L175Q067Q879j615q961Q244o950q341Q205
4863G005J1224r541o527L395Q888O151n919n835q39J051P17J8583P927R023k863
$$ y = [-3101, 879, 11076, 18691, 22256, 24920, 20369, 11745, 7385, -3037, -11897, -14085, -60, 13121, 35248, 31248, 24744, 17587, 21755, 9691, 7867, 8118, 2518, -4423, -17312, -18171, -9422, -4019, 6214, 10386, -10128, -31366, -31532, -22875, -27746, -43376, -32794, -31980, -26698, -9521, -5050, 113, 4897, 10542, 2730, -12207, -13902, 2554, 7718, -5981, -2102, 9646, 17817, 12062, 8213, 17988, 13760, -1946, -8163, 210, -7951, -13708, -4868, -489, 1111, 9503, 15437, 5887, -10789, -9632, -1641, -12085, -19042, 6754, 15638, 2129, -1647, 5479, -15743, -7429, 4776, 9847, -3871, -4243, 3468, -1831, -11681, -21845, -19578, -10022, -3698, -523, 7544, 16423, 14808, 5847, 14091, 7141, -1200, 7005, 18229, 8688, 2161, 5556, 14444, 20595, 14676, 8841, 8002, 9053, 9770, 28353, 36280, 45303, 42440]
4848D2440j2149k2476j5507J5365J4868K243k0402r930K132J7310N245q197l497
4835G445o989j3130M82L237m103k551J2787J3030q929L956p28p498j0575J3404
4821a62M761j2199M795P71q391J5648J7225j3757l70j225n304J008q140K354K706
4806b80O763J9347k619j6929m696j3373O875J5719L222j5837p490l41Q26K208
4792f605j0481N091K7892J525q158m796m601p778L149J7478l314j6017O047N139
4778D571K391n079l501O338J1386L245J2655O405r634j361j656k605l159r204
4764A0792j4252Q849J0260j4747j0485L270Q522m959K018Q956j484j3200k618
4751i078J127p047N568K28n439l484J2018J6336J5003q564j319J0103o083J4124
$$ y = [42440, 30291, 7815, -7692, 7673, 22541, 24784, 4382, -5548, -3416, 13894, 19139, 10942, 7445, 456, -12674, -12192, -8955, -13058, -15609, -2822, 10208, 1279, 5235, 4507, -2991, -13566, -162, 4599, -7600, -2805, -2034, -10425, 5223, 22448, 8691, 8321, 7096, 1792, 2800, -5340, -2986, -280, 6483, 25830, 23211, 6282, 1586, -11787, -4912, 10807, 14029, -1808, -9298, -9639, -8813, -6605, -17086, -11995, 15897, 17422, 9264, 4468, -133, -7911, -4762, 12716, 9402, -6615, -568, 4571, 6962, 1883, -1618, 4720, 16106, 19351, 32006, 38411, 28777, 27416, 25760, 23155, 19996, 10792, -3460, 5389, 15649, 902, -9583, -6313, 2209, -2750, -732, 8224, 6740, -6460, -9078, -7951, -14998, -9430, -9202, -14641, -18125, -6107, 10229, 25232, 16668, 15349, 25452, 19369, 33493]
4737C3493r745p608O720n624o748k862m366k3384k300K3949P628O358m538j7915
4723f942o660P253L457Q446k545r636L984L095j1943J2165J2256L546L172R05
4709B0553K434p167l696L497J3128k893j6360j6085l226p057m143K1649k518l854
4695e738J2291R487M514K240j750l648N147N348k8891j3851J1793J374j141q196
4681a1021M897J5616K288k1303m948J2495O206N849r893N609L302p700l920o983
4667i506l708N492R251j2872m699j988j631R851L329J2462R801j4805M7q794n528
4652a3298l629j100k112j068N998q49j1011O90p622J0552J6609L132j2313R346
4638f675J6441j532j1795J6622P130N12p537j0421n237N996j100Q630O050k0541
$$ y = [33493, 23748, 16140, 22860, 17236, 10488, 7626, 3260, -20124, -22424, 1525, 9153, 15511, 10973, -6942, -13602, -6349, -2892, 5554, 3009, -6627, -2643, 452, -11491, 674, 12930, 16476, 19648, 20553, 22987, 15820, 12124, 15621, 28749, 25856, 9496, -6589, -9815, -16872, -21015, 634, -1884, -5738, 6553, 16040, 20554, 22794, 21044, 17396, 22543, 27891, -1000, -14851, -3058, -1684, -2825, -11021, -6124, 9492, 11780, -9523, -14471, -1976, 4230, 10079, 186, 5795, 9097, 1397, -2523, -9506, -13214, -7722, 1529, -11343, -16042, -18030, -19661, -9810, -6481, 5981, 15782, 977, 1024, -7770, -13298, -16927, -18027, -20139, -21207, -15209, -16058, -27069, -26379, -34001, -23449, -6840, -3708, -16021, -6675, 9766, 8234, -3561, 13061, 20191, 20703, 13166, 2745, -2492, 3504, 2404, 11034, 17084, -3457]
4624c457j1315J7901M693L44k919l297j3770M737J4810r525J643J0538L291j2004
4610A670o290m573j1754k03K806J3560K269j1474R497J1925K393K600m989m053
4596C384J586M489M304q857q709p31N371l094L265J8639J688m675j4038L89p529
4581d518p147j0514Q07Q397l436j2008N47K075J156J775J76M838L210j840J3532
4566b950J4960j2093m750l634P454j1708n035M845M126n835N259J2577M62J657
4552E335J3319P30j2662n407k791J749k231J939O065n052n705J8181J5596j0597
4538A8469J477r849p88n583o246o975j0069Q725p05l252J2552L249j51J512J0059
4523A2425K722r533p117p14L620p988k123q908L118Q330Q261p045j3044k321r21
$$ y = [-3457, -14772, 3129, 7822, 8166, 5247, 1950, -11820, -7083, 7727, -1798, -155, 10383, 13674, 1670, -4620, -9193, -20947, -21150, -18344, -4784, -2515, -13989, -4492, 7433, 9826, 12426, 7437, 3384, 4970, 9459, 13763, 4906, -3803, -4534, 837, -2257, 1008, 19647, 21335, 16660, 2622, 3011, -4518, -11665, -22179, -21372, -12975, -16411, -28419, -27872, -25797, -24641, -22866, -22690, -17852, -14642, -16482, -2950, 12010, -83, -4833, -8467, -1013, -12721, -17756, -12911, -8785, -14620, -9361, 3216, 3678, 5335, 18654, 19384, 6722, 1315, -1476, 273, -1958, -19, 6046, 994, -4711, 13470, 29066, 18469, 19946, 10097, 9309, 3726, -2520, -9495, -19564, -10839, -11544, -14796, -2244, 1005, 854, 2366, 12425, 15147, 5614, -1503, -2217, 1403, -6585, -8708, -17616, -14498, -6168, 2093, -4952, -17996, -20317, -21238]
4508b1238N4R536J7312n728o158J0930K232p356k102J247m334J72K6645R364l539
4493B7037K195n957j3795j79n008k993K155M147O353P368J370M279J0678j1771
4479B5879k4058j0103o243m963j6904R143N489o93k135n654J0739k099Q669J7112
4465D179J1097j2334j2757p981N705K045J0548L212r080O318K738j3158l118p092
4451a9678k707O166N634N166K898J1781j7638m34J0745N719J0553L801o520r02
4437A4584K338k0270m946J2329J7418k676j1953k2183j969K531M147Q143J171
4424a336Q356J891L633K015p100p148o545m992n567L713R891P341N809L97k532
4409G826l73j2127J6123q628j0922L1O575r423l221j0671j2441K890R828J8920
$$ y = [-21238, -21184, -11648, 5664, -64, -6222, 4708, 6940, -416, -2518, -1271, -5605, -5433, 21212, 30576, 27037, 29232, 23275, 9480, 9301, 4293, 1300, 3455, 7602, 13955, 21323, 22693, 26972, 37650, 25879, 1821, -8282, -14525, -19488, -36392, -27249, -21760, -22453, -24588, -30242, -19503, -21602, -12933, 4179, 15276, 2942, -9815, -17796, -12091, -10046, 502, 3714, -5366, 952, 3690, -9468, -12586, -19678, -22385, -16219, -10585, -5419, -2521, 9260, -8378, -8812, 1933, 7652, 18205, 22006, 15486, 14584, 16922, -3348, -8294, 4035, 21453, 18777, 6824, -15359, -17328, -14797, -10650, -2507, -1336, 7020, 8911, 12544, 14559, 7459, 311, -6234, -11226, -16793, -13080, -3189, 4152, 9961, 10358, 7826, 7453, -4674, 11449, 2821, -8101, -8070, -1495, -10918, -14139, -24810, -37251, -34361, -24533, -5613]
4395e613J6594K774l819l486p477K178n607R020j1175j304P4k372N717m54P949
4380B999P342k581j4417n088p995O207N427P803j719q669O650Q769L749o234n972
4365c729Q920O12q601J5268M24j1020J099N528j1258l29O314N463K591o285j250
4350C747K4007J1489j1234m50q391j2952l709o124J272J0175J7039r534j5358
4337b3k730P347K0418l14j3867o303J6656o000j5259j1674j175M251N18j0587
4323a8742k966Q532J1138P222k714l668O513r488n808K619j1948M321l81q514
4309b3884j033j167M141J8143k487r313j0001J2550J491L843P096K1346m279r640
4295F806J2476m234q028q155j2718k273j177q972O582J9696J3057l191n282J4239
$$ y = [-5613, 10981, 13755, 9936, 6450, -1027, 1151, -4456, 4564, -6611, -7915, -7841, -10213, -4496, -4950, 2999, 10341, 7760, -6657, -11745, -19740, -13533, -8106, -303, -2022, -10691, -4041, 4728, 8477, 2243, -3729, 5191, 5803, -2798, 12470, 12894, 1874, 2973, 8501, -2757, -3086, 3228, 8691, 11282, 4997, 3747, 27754, 39243, 28009, 27559, 19168, 6216, 2507, -3617, -2345, 7830, 24869, 15335, -23, -2753, 4594, 25012, 24698, 10831, 4528, 21184, 15184, -75, -11749, -12924, -8673, -8155, -18742, -21708, -13176, -2038, 5184, 2470, -1198, 5315, -4173, -9981, -7362, -19310, -14989, -15370, -23884, -24917, -26084, -21943, -3800, -6287, -15600, -25601, -13051, -11560, -7717, -621, 20725, 16446, 6806, 19282, 15048, 7020, -1135, -13853, -16126, -17303, -26275, -19693, 3, 13060, 9869, 4587, 18826]
4281A8826J9315N34j5511m462N219o990j331J2927j2936k0179K383J404L12R57
4267D68j458O644J2390j3707j1517m566N137M009n89k384r492o41r381M197j271
4252b2161R014J3217J3102J5852K430N763j0330j1754j6066l0588J5059O681k941
4239a2722q87J849J2608L227J6623M189L721j400M094L365j9643j0132M09O45
4225E946p051L227l481j0078J2112Q796k993r594L696j5780p443J1887M599n236
4211a1393o27O184M124n68n335o582L165P540j322j4069J302L104L076J8471J4648
4196B1718q830j6597l308N066L908J165k610J3650l627r478k0004N721J2123J399
4182B96R968K424k576N880o149k2905j5454r539L342N268j003Q921J2972N945
$$ y = [18826, 38141, 38675, 23164, 18702, 23921, 16931, 15600, 28527, 15591, -4588, -2205, -801, -489, 468, -990, 5654, 18044, 4337, -7180, -11746, -6609, -2600, -3189, -5573, -15065, -15706, -25087, -20890, -22161, -13147, 70, 13172, 29024, 31454, 37217, 26887, 15133, -933, -31521, -16462, -9781, -12722, -13609, -11760, 848, 4075, 20698, 24887, 28608, 27208, 31302, 34667, 15024, 4892, 5301, 5946, -1105, 2122, -1359, -11437, 675, 9471, 6478, -3116, 580, -15200, -22643, -10756, -6157, -11393, -12020, -5836, -1712, -2280, -7615, -14197, -11032, -3492, -4814, -18883, -17581, -14477, -11401, 7070, 21718, 12888, -3709, -7017, -1951, 1957, 3122, 512, 14162, 10535, 1057, -18947, -13226, -1103, 296, 10264, 12688, 10112, 15992, 9843, -13062, -28516, -38055, -34713, -29445, -30448, -21527, -8555, -2610]
4168b610R472J4506J929J612r130j5509k922P792n868K5P42k302R979j0256j7835
4153b0375j2060O00J6352J4842J6882j0299j7638K242p093Q807j377k92P689N242
$$ y = [-2610, 6862, 21368, 23297, 24909, 15779, 270, -2652, 5140, -728, -703, 39, -2263, 7716, -2540, -20375, -32435, -31835, -15483, -641, 16241, 5942, -11696, -9454, -16547, -7740, -9117, -9409, -1720, 3522]
$$ [...]
##END NTUPLES=NMR SPECTRUM
##END=
