##TITLE=Analysis number 318928
Compound Code tl 00574
Project Code adrs
Chemist Name fudan
##JCAMPDX= 6.0         $$ Bruker NMR JCAMP-DX V2.0
##DATA TYPE= NMR SPECTRUM
##DATA CLASS= NTUPLES
##ORIGIN= Bruker BioSpin GmbH
##OWNER= nmr
$$ XWIN-NMR		Version 3.5
$$ Tue Apr 25 11:07:30 2006 GMT Daylight Time (UT+1h)  MAYBRIDGE\nmr@NMR_250MHZ
##.OBSERVE FREQUENCY= 250.131544655141
##.OBSERVE NUCLEUS= ^1H
##.ACQUISITION MODE= SIMULTANEOUS (DQD)
##.ACQUISITION SCHEME= undefined
##.AVERAGES= 16
##.DIGITISER RES= 18
##SPECTROMETER/DATA SYSTEM= dpx250
##.PULSE SEQUENCE= zg30
##.SOLVENT NAME= CDCl3
##.SHIFT REFERENCE= (INTERNAL, CDCl3, 0, 16.522)
##AUDIT TRAIL= $$ (NUMBER, WHEN, WHO, WHERE, WHAT)
$$ ##TITLE= Audit trail, XWIN-NMR		Version 3.5
$$ ##JCAMPDX= 5.01
$$ ##ORIGIN= Bruker BioSpin GmbH
$$ ##OWNER= nmr
$$ C:\u/data/dgb/nmr/ADRS/2910/pdata/1/auditp.txt
$$ ##AUDIT TRAIL=  $$ (NUMBER, WHEN, WHO, WHERE, WHAT)
(   1,<2006-04-25 11:07:09.36 +100>,<MAYBRIDGE\nmr>,<NMR_250MHZ>,
      <created by zg, POWCHK disabled, PULCHK disabled
       configuration hash MD5:
       84 BC 41 DB A1 6E 1D 46 DA 25 12 A5 C1 ED C5 3A
       data hash MD5: 64K
       61 3C B9 32 ED 18 E7 5E 13 B0 BF 0E 34 34 1B 0E>)
(   2,<2006-04-25 11:07:22.03 +100>,<MAYBRIDGE\nmr>,<NMR_250MHZ>,
      <Start of raw data processing
       ef LB = 0.3 FT_mod = 6 PKNL = 1 SI = 32K 
       data hash MD5: 32K
       C1 E2 B0 7E 22 8F AE 69 77 64 AF 8C CD CF 74 A7>)
(   3,<2006-04-25 11:07:23.75 +100>,<MAYBRIDGE\nmr>,<NMR_250MHZ>,
      <apk 
       data hash MD5: 32K
       45 92 0B 51 8A 22 7C 1F 0F 88 0F 06 9A 53 D4 57>)
(   4,<2006-04-25 11:07:24.56 +100>,<MAYBRIDGE\nmr>,<NMR_250MHZ>,
      <abs ABSG = 5 
       data hash MD5: 32K
       AA 8B 66 88 31 A2 1C 01 5E D5 DF 01 EB C4 4F 73>)
$$ ##END=
$$ 
$$ hash MD5
$$ 08 EE 3F 87 A4 CE 81 DD 46 D0 FE 16 A3 A1 1E 5D
##$RELAX= 
##$RELAX= 
##$RELAX= 
##$RELAX= 
##$RELAX= 
##$RELAX= 
##$RELAX= 
$$ Bruker specific parameters
$$ --------------------------
##$DU= <C:\u>
##$EXPNO= 2910
##$NAME= <ADRS>
##$PROCNO= 1
##$TYPE= <nmr>
##$USER= <dgb>
##$AMP= (0..31)
100 100 100 100 100 100 100 100 100 100 100 100 100 100 100 100 100 100 
100 100 100 100 100 100 100 100 100 100 100 100 100 100 
##$AQSEQ= 0
##$AQ_mod= 3
##$AUNM= <au_zg>
##$AUTOPOS= <19 >
##$BF1= 250.13
##$BF2= 250.13
##$BF3= 250.13
##$BF4= 250.13
##$BF5= 500.13
##$BF6= 500.13
##$BF7= 500.13
##$BF8= 500.13
##$BYTORDA= 1
##$CFDGTYP= 0
##$CFRGTYP= 5
##$CHEMSTR= <none>
##$CNST= (0..31)
1 1 145 1 1 1 1 1 1 1 1 1 1 1 1 1 1 1 1 1 1 1 1 1 1 1 1 1 1 1 1 1 
##$CPDPRG= <>
##$CPDPRG1= <>
##$CPDPRG2= <>
##$CPDPRG3= <>
##$CPDPRG4= <mlev>
##$CPDPRG5= <mlev>
##$CPDPRG6= <mlev>
##$CPDPRG7= <mlev>
##$CPDPRG8= <mlev>
##$CPDPRGB= <>
##$CPDPRGT= <>
##$D= (0..31)
0 1 0 0 0 0 0 0 0 0.06 0 0 0 0 0 0 0.0002 0 0 0 0 0 0 0 0 0 0 0 0 0 0 
0 
##$DATE= 1145959628
##$DBL= (0..7)
120 120 120 120 120 120 120 120 
##$DBP= (0..7)
150 150 150 150 150 150 150 150 
##$DBP07= 0
##$DBPNAM0= <>
##$DBPNAM1= <>
##$DBPNAM2= <>
$$ [...]
##$SUBNAM7= <"">
##$SUBNAM8= <"">
##$SUBNAM9= <"">
##$SW= 20.6930455092707
##$SWIBOX= (0..15)
0 0 3 0 0 0 0 0 0 0 0 0 0 0 0 0 
##$SW_h= 5175.983436853
##$TD= 65536
##$TD0= 1
##$TE= 295.16
##$TE2= 300
##$TE3= 300
##$TEG= 300
##$TL= (0..7)
0 120 120 120 120 120 120 120 
##$TP= (0..7)
150 150 150 150 150 150 150 150 
##$TP07= 0
##$TPNAME0= <>
##$TPNAME1= <>
##$TPNAME2= <>
##$TPNAME3= <>
##$TPNAME4= <>
##$TPNAME5= <>
##$TPNAME6= <>
##$TPNAME7= <>
##$TPOAL= (0..7)
0.5 0.5 0.5 0.5 0.5 0.5 0.5 0.5 
##$TPOFFS= (0..7)
0 0 0 0 0 0 0 0 
##$TUNHIN= 0
##$TUNHOUT= 0
##$TUNXOUT= 0
##$USERA1= <user>
##$USERA2= <user>
##$USERA3= <user>
##$USERA4= <user>
##$USERA5= <user>
##$V9= 5
##$VALIST= <valist>
##$VCLIST= <CCCCCCCCCCCCCCC>
##$VD= 0
##$VDLIST= <DDDDDDDDDDDDDDD>
##$VPLIST= <PPPPPPPPPPPPPPP>
##$VTLIST= <TTTTTTTTTTTTTTT>
##$WBST= 1024
##$WBSW= 4
##$XGAIN= (0..3)
0 0 0 0 
##$XL= 0
##$YL= 0
##$YMAX_a= 383748
##$YMIN_a= -281855
##$ZGOPTNS= <>
##$ZL1= 120
##$ZL2= 120
##$ZL3= 120
##$ZL4= 120
##$ABSF1= 16.522
##$ABSF2= -4.171173
##$ABSG= 5
##$ABSL= 3
##$ALPHA= 0
##$AQORDER= 0
##$ASSFAC= 0
##$ASSFACI= 0
##$ASSFACX= 0
##$ASSWID= 0
##$AUNMP= <proc_1d>
##$AZFE= 0.1
##$AZFW= 0.1
##$BCFW= 0
##$BC_mod= 0
##$BYTORDP= 0
##$COROFFS= 0
##$CY= 12.5
##$DATMOD= 1
##$DC= 0
##$DFILT= <>
##$DTYPP= 0
##$F1P= 14.0000005364418
##$F2P= -0.99999901652339
##$FCOR= 0.5
##$FTSIZE= 32768
##$FT_mod= 6
##$GAMMA= 0
##$GB= 0
##$INTBC= 1
##$INTSCL= 1
##$ISEN= 128
##$LB= 0.3
##$LEV0= 0
##$LPBIN= 0
##$MAXI= 10000
##$MC2= 0
##$MEAN= 0
##$ME_mod= 0
##$MI= 0
##$NCOEF= 0
##$NC_proc= -3
##$NLEV= 6
##$NOISF1= 0
##$NOISF2= 0
##$NSP= 0
##$NTH_PI= 0
##$NZP= 0
##$OFFSET= 16.522
##$PC= 1
##$PHC0= 11.61446
##$PHC1= 7.095648
##$PH_mod= 1
##$PKNL= yes
##$PPARMOD= 0
##$PSCAL= 4
##$PSIGN= 0
##$REVERSE= no
##$SF= 250.13
##$SI= 32768
##$SIGF1= 0
##$SIGF2= 0
##$SINO= 400
##$SIOLD= 32768
##$SREGLST= <1H.CDCl3>
##$SSB= 0
##$STSI= 32768
##$STSR= 0
##$SW_p= 5175.98343685301
##$SYMM= 0
##$S_DEV= 0
##$TDeff= 65536
##$TDoff= 0
##$TI= <Analysis number 999999
Compound Code 99
Book Reference 9
Project Code 9>
##$TILT= no
##$TM1= 0
##$TM2= 0
##$TOPLEV= 0
##$USERP1= <user>
##$USERP2= <user>
##$USERP3= <user>
##$USERP4= <user>
##$USERP5= <user>
##$WDW= 1
##$XDIM= 32768
##$YMAX_p= 319461465
##$YMIN_p= -34943
$$ End of Bruker specific parameters
$$ ---------------------------------
##NTUPLES= NMR SPECTRUM
##VAR_NAME=  FREQUENCY,     SPECTRUM/REAL,   SPECTRUM/IMAG
##SYMBOL=    X,             R,               I
##VAR_TYPE=  INDEPENDENT,   DEPENDENT,       DEPENDENT
##VAR_FORM=  AFFN,          ASDF,            ASDF
##VAR_DIM=   32768,         32768,           32768
##UNITS=     HZ,            ARBITRARY UNITS, ARBITRARY UNITS
##FACTOR=    0.157963299565203, 1,           1
##FIRST=     4132.6476996994, 0,             0
##LAST=      -1043.33573715361, 0,           0
##MIN=       -1043.33573715361, -34943,      0
##MAX=       4132.6476996994, 319461465,     0
$$ Real data points
##PAGE= N=1
##DATA TABLE= (X++(R..R)), XYDATA
$$ [...]
17457E8131L3j798k286k9Q45K532l376P62m867n930q95j484k379L856j49J610
17441D4576K990J071L184N911N992N667m437j4799o644m963l739k745j112L152
17427C4104L719j210l441j663K362L928P238K270j637n165n285J676M317R37l127
17412C9023k698o046k008K356Q87k979r28l97n0J735O667K766N416N971K837L280
17396E5832p763n69L570m512j2580j9j164m455k279l053k935M27L736k322n318
17381A6596k560J157j946l075K240l771j2O98K443M225L457J093k073j209K276
17366A9539L735m42j885k787j786k305j219p09r40J291J350L052N215j748n065
17351A5296n296j30L729j244m822L20M951R58m328p371L85O828M247J16k825R77
$$ y = [58131, 58164, 56366, 54080, 54051, 54896, 57428, 54052, 54814, 49947, 44017, 43122, 41638, 39259, 43115, 42966, 44576, 47566, 48637, 51821, 57732, 63724, 69391, 64954, 50155, 43511, 38548, 34809, 32064, 30952, 34104, 37823, 36613, 33172, 31509, 33871, 37799, 45037, 47307, 45670, 40505, 35220, 36896, 41213, 42150, 39023, 36325, 30279, 28271, 30627, 31514, 28535, 27607, 27210, 27160, 28895, 35562, 38328, 43744, 49715, 52552, 55832, 48069, 47500, 51070, 46558, 33978, 33959, 32795, 28340, 26061, 23008, 20073, 20500, 24236, 21914, 16596, 14036, 15193, 13247, 10172, 12412, 8641, 8629, 9327, 11770, 15995, 19452, 20545, 18472, 17263, 19539, 23274, 22832, 20947, 18160, 16374, 14069, 12850, 12141, 11201, 12492, 13842, 16894, 22109, 20361, 15296, 10000, 9870, 13599, 12355, 7533, 7853, 12804, 13762, 9434, 2063, 2448, 9276, 13523, 13639, 10814, 11791]
17335A1791R54R32N398R025O338Q371M132j785j607n057J984j144p713p310n373
17320A8936m229j735k299o873m478K052N018J489n3k142J470R31J257O73J345
17305A1362N20j477o99J862L309L68j155M220L634K537l830o196M708N526J78
17290B4867N159M608Q639R549L589l106n752n14k844n851p900q625l963m530J729
17275A5055J521J224r39l216k308m200r41M097M361j373J14k903n298J846M413
17260A1453K389J297J00J808k196j922k001Q33L722k851l514j595P55M593m720
17245H151j699k90l644L729O531Q90n196n909L773M452j175j506k889n884l618
17230d284M390M292p68k5L727N356P85M637L437k079O759P466L895J873N912Q18
$$ y = [11791, 12745, 13677, 19075, 28100, 34438, 42809, 46941, 45156, 43549, 38492, 40476, 39332, 31619, 24309, 18936, 14707, 12972, 10673, 3800, -678, 1374, 6392, 7881, 7828, 5686, 7156, 8087, 9344, 10017, 11362, 11882, 10405, 9706, 11568, 14877, 15245, 14090, 18310, 21944, 24481, 20651, 14455, 19163, 24689, 24867, 30026, 34634, 43273, 52822, 56411, 53305, 47553, 47039, 44195, 38344, 30444, 21819, 17856, 13326, 15055, 16576, 17800, 16861, 13645, 11337, 7137, 6196, 10293, 14654, 13281, 13395, 10492, 5194, 7040, 11453, 13842, 15139, 15239, 17047, 14851, 12929, 10928, 11761, 15483, 12632, 9118, 7523, 8278, 12871, 8151, 6452, 6162, 2518, 6247, 12778, 13668, 8472, 2563, 6336, 10788, 9613, 8107, 5218, -666, -4284, 106, 4398, 3630, 3605, 7332, 12688, 13473, 18110, 21547, 19468, 26227, 33693, 37588, 39461, 45373, 46191]
17214D6191m120p177l613k625l252o432k116J719L081k677L991J171r500r171
17200E470j850M78j943m037n47q29k591K332j113k308K566L065P056J037l117
17185C669k344K26m784l495M214L705J575J92K3j310l61j573M184m370k577l763
17169f789L795L247K798J621j19j979j093J677K207q3o92k699l104R69O378o36
17153E498k953n754K395K382Q60n920l644M775M720O516J842p412j449R46r31
17138A871K124k781l588j143L591O764j807l529M28K424J533k073K915j811m609
17123C09J566j494o32k302m90N167j402N87L474L860m747j928j041j473m483l478
17107h507J210L491R150M030m204o576l058l487j25J219L61O55k696P22K14L471
$$ y = [46191, 42071, 34894, 31281, 28656, 25404, 18972, 16856, 18575, 21656, 18979, 22970, 24141, 14641, 5470, 3620, 4098, 2155, -1882, -2429, -3258, -5849, -3517, -4630, -6938, -4372, -1307, 5749, 6786, 3669, 1325, 1551, -3233, -6728, -2514, 1191, 2766, 2958, 2981, 1671, 1310, -263, 3921, -449, -3026, -6789, -2994, 253, 3051, 4672, 4553, 2574, 1481, 3158, 5365, 5282, 4590, 1891, -1213, -244, 6134, 5498, 2545, -3209, -814, 1568, 2428, -3492, -7136, -2361, 2359, 8875, 10717, 3305, 1856, 2802, 1871, 3995, 1214, -2374, -3517, 74, 6838, 5031, 1502, 1930, 4354, 5887, 3814, 6729, 4918, 309, 1875, 381, -251, -2553, -3043, 2124, 722, 1309, 4783, 8643, 3896, 1968, 927, -546, -5029, -8507, -7297, -3806, 5344, 9374, 5170, -1406, -4464, -7951, -8076, -6857, -6496, -5841, -8537, -7815, -7601, -4130]
17091d130K000p70l471k7K849N411L353p920O13L046j294j855N62J363j752K253
17075B31K880M16K178O40L888K82o20m659k760l254P76j20j998j624m07j873J974
17058d050N625K835K584m467n904P923J415l605p171j991M394L376k61k434l360
17043e091K771N475Q72j449R80l489l125J863L658L382L692l326k839m437K162
17028A099K10j260j624m227L144K399Q3J032K158P17l613l350m034L312N192j566
17012c28m780k168J256P703O748k439o548N4P993o25r529j733P243J826j606m376
16996a309l930l715n292J608N667K421J658M649J230n896j492L585j206m351k061
16981h434J247O48k293M698K693n233j267M251K054M091P938k420q633n579l655
$$ y = [-4130, -2130, -2900, -6371, -6398, -3549, 1862, 5215, -2705, -2092, 954, -340, -2195, -1633, -270, -2022, 231, 3111, 3527, 5705, 6345, 10233, 10515, 9895, 5236, 2476, -778, -2, -122, -2120, -3744, -4151, -6024, -4050, 1575, 4410, 6994, 2527, -3377, 4546, 5961, 2356, -4815, -6806, -2412, 964, 703, -1731, -5091, -2320, 3155, 4027, 2578, 3558, 69, -3056, -1193, 2465, 5847, 9539, 6213, 3374, -1063, 1099, 1309, 49, -1575, -5802, -2658, -259, -176, 856, 3014, 3731, 118, -3232, -7266, -3954, 1238, -328, -5108, -7276, -6020, 1683, 8431, 5992, -556, -502, 7491, 6866, -2663, -4396, 2847, 4673, 3067, -1309, -5239, -8954, -14246, -12638, -6971, -4550, -2892, 1757, 2987, -2909, -4401, -816, -2022, -6373, -8434, -7187, -6539, -8832, -4134, -1441, -6674, -7941, -3690, -1636, 2455, 10393, 7973, -660, -6239, -9894]
16966i894o98M957L872N205M806l364k820k390k783M99K733K053k011L868L334
16951G367r01k750n723n701j625M050n47K069M055K554j747j544J693k435k61
16936a446m359m619j96J601J180k050j515n58K575K417o515j906M934M701M77
16921e279j562J799L769Q54L300j355k720L123m212l170M70k288R68L16l598l222
16905a2807O155M055p72j82M778M388n20k431K96m925n846R95M783j030n770O
16889h827K935J831K43N006M27J801k627o663J211m666J545L495l733j55O35M933
16873b609j048L32O351j505J368j599M513J555l993l977m480j876J829J564k341
16858e916l906J289j810j070J188R077K596l080K295j622j282J235j286K540j609
$$ y = [-9894, -10592, -5635, -1763, 3442, 8248, 4884, 2064, -326, -3109, -2610, 123, 2176, 165, 4033, 7367, 6466, 3716, -2007, -7708, -9333, -5283, -5830, -3761, 294, 2848, 1101, -443, 1250, -1185, -1446, -5805, -10424, -10620, -9019, -7839, -9889, -11404, -11962, -9387, -6970, -13485, -15391, -10457, -5756, -5279, -6841, -5042, -1273, -419, 2881, 1526, -1194, 1929, -2283, -5453, -4983, -7271, -6303, -5987, -9585, -12807, -6652, -2597, -3369, -3551, 1227, 5615, 5095, 2664, 2960, -1965, -7811, -6816, -2033, -3063, -8833, -8827, -5892, -4061, -3818, 1188, 1615, 3416, 789, -5874, -4663, -9329, -7784, -4289, -8022, -8177, -7542, -2609, -3657, -3325, 3026, 1521, 2889, 1290, 5803, 7358, 3365, -612, -5092, -6968, -5139, -3575, -5916, -9822, -8533, -10343, -11413, -10225, -1148, 1448, -1632, 663, -959, -2241, -1006, -2292, 248, -1361]
16843a361M160L941k858n182J406K604l106M10k483m515L441N085K589J452K488
16828H071J211j661k33k611K59l768m912J456J147L837R61k870L468L72j557K328
16812E498L760J276O88l790j831j858J43R05j638l021o527n621N888P189m3p00
16796C18P15k850n198m313K550M874m22L70K632k127k994J874m183j244J516O161
16780b321L109j970p88q08J00k012J800M71j779j715j480K969J864J316M434p34
16764B456k948J702L333q03k834k815m516n75J254k068l165K007J20O175Q434
16749E757n878m830j152j132p6j85m553j711L205p59K031O940K94k971j376l843
16733a0239j556K342K572J645j649J329k008K256J709K465R2M342J394J468L84
$$ y = [-1361, 2799, 6740, 3882, -1300, 106, 2710, -396, 14, -2469, -6984, -3543, 1542, 4131, 5583, 8071, 9282, 7621, 7388, 4777, 5036, 1268, -3644, -2188, -1041, 2796, 3757, 887, 4355, 4727, 3170, 5498, 9258, 10534, 11222, 7432, 5601, 3743, 3886, 4791, 3153, 132, -6395, -12016, -6128, 1061, 1018, 318, 1033, -1817, -7015, -11328, -8778, -3904, -4326, -3956, -1324, -3451, -6445, -4571, -8754, -9998, -8482, -2321, 788, -1182, -1970, -2778, -2678, -4690, -2890, -2419, -4198, -5913, -7393, -4424, -2560, -1244, 3190, 2456, -492, 1210, 4543, 3740, 906, -1909, -6425, -7000, -5746, -7814, -10979, -8972, -8852, -2677, 5757, -121, -4951, -6103, -7235, -7311, -7496, -12049, -13760, -10555, -11314, -9283, -2343, -2049, -5020, -6396, -10239, -11795, -9453, -6881, -5236, -6885, -5556, -7564, -5308, -3599, -1134, -1042, 3300, 4694, 6162, 6546]
16718F546p057l61J32j306O055J102J127l762o342l498j120K161O123N254l023
16703B031l370P00j309l201K833k689l512j972R54K703M537K569m23J323M066
16688E240j323l584L444L021k467M60L127n550n676q39M435J590P57m840n131
16673g336M57n44q40J372J106M374O34o91J04j243K374N407l242k327k375o41
16657c411N210M687o808j925K188K775N01j826K903m998j882j176r07k021O493
16642a97L535j877j467L243K916k642L696O363l414q772l317k126j394m826r29
16627a1208J56j857L507N711N071J957m072j481m309l149m07o13P40N643L190
16612a121j884j772K776K387j519m672M072Q94l072L656n137j15L328o50k629
$$ y = [6546, -511, -872, -740, -2046, 4009, 5111, 6238, 2476, -3866, -7364, -8484, -6323, -200, 5054, 2031, -1339, -639, -1948, -5149, -2316, -5005, -8517, -10489, -9535, -6832, -2295, 274, -149, 1174, 5240, 3917, 333, 3777, 6798, 4331, 4791, 7918, 2368, -3308, -4147, 288, 1878, 2635, -2205, -7336, -6879, -7423, -8263, -6891, -5785, -1411, -777, -1468, -1364, -2607, -233, 5174, 1932, -395, -2770, -3411, 1799, 6486, -322, -2247, -59, 2716, 3217, 1391, 4294, -704, -2586, -3762, -4669, -6690, -197, 3338, 1461, -6, 3237, 6153, 3511, 7207, 13570, 10156, 1384, -1933, -4059, -5453, -10279, -11208, -11052, -12909, -9402, -3691, 1380, 3337, -735, -2216, -6525, -9674, -10081, -10694, -9954, -4311, -1121, -3005, -4777, -2001, 386, -1133, -5805, -1733, -839, -3911, -255, -5392, -5507, -2179, -2829, -5458]
16597e458M560N950n82j040m765m736k422k019M838J640J694N193K589j564j396
16582B482m758j11N073O502K813m357m718l444K916J097J11o978o165K951J324
16567e262J095l293N71L718p42m505k309K885j645J742L123m99L650j381k455
16552e307J404J716j406K145j257m689k103M476J349n149j567Q50M029J863j219
16537d865m18l151M828O15J555q84P30J208J519M734K94n32k775j921k213Q26
16521d50k469N20k667M511N760J18n063o816o013m45M199L948L294K385N6k844
16505a976l592J879Q34q84L183L023j844O64k513N62J586j663q987J74L225Q75
16489e454n202l949K949P512M890q68r72j944k012k436n185K228O143L344J375
$$ y = [-5458, -898, 5052, 4470, 3430, -1335, -6071, -8493, -10512, -5674, -4034, -2340, 2853, 5442, 3878, 2482, -2276, -2387, 2686, 9188, 12001, 7644, 2926, -518, 2398, 3495, 3606, -3372, -9537, -6586, -5262, -4167, -7460, -6889, -3171, -3913, -8418, -10727, -7842, -9487, -7745, -4622, -5121, -1471, -2852, -5307, -3903, -2187, -3593, -1448, -2705, -7394, -9497, -5021, -3672, -8821, -10388, -9538, -5509, -3646, -4865, -5283, -8434, -3606, -2991, -1436, -2320, -1590, -382, 1137, 5871, 6165, 5633, 2858, 937, -1276, -450, -2919, -2399, -5066, -555, 5205, 5323, 260, -6556, -12569, -13014, -8815, -4867, -1573, 812, 868, -1976, -5568, -3689, -2855, -3739, -556, 2467, 623, 1287, -1226, -664, 922, -741, -9728, -9554, -6329, -5454, -10656, -14605, -11656, -4144, 746, -122, -1094, -3038, -5050, -7486, -12671, -10443, -4300, -956, 419]
16474D19J935L837J631l144j085O25n217j836k093j603q04j387k532L529N171
16459b554M86k741j473Q76j165j783j057K192J536m02L960J485M71r7m55j893
16443b614m609n080K322L746J926M563K647L263j94m457R78K392n509k09k080
16428b915k809K762o08j355P03L918j084m941l027k66j998Q00q06P218j214L607
16412b015L147K331k370k741J056n78k37o14l787J238R35k73J772o55j41M17j065
16395c580J897M59j854k884O213j76l43K26p21J119j962n457q61M53M22M812L464
16378A227K030K541L531L289p4p936n421l613L668q1J39J553L51q11L647J298
16362E338o875J843M977k037m385m648M499j173k617J113m40N482M179PN115K146
$$ y = [419, 2354, 6191, 7822, 4678, 3593, 4218, -999, -2835, -4928, -6531, -7335, -8722, -11254, -7725, -2554, -2068, -4809, -6282, -5406, -6571, -8354, -9411, -7219, -5683, -6085, -2125, -640, -169, -266, -721, -2614, -7223, -12303, -9981, -6235, -4309, 254, 2901, 6164, 5970, 1513, 2491, 4883, -626, -835, -2915, -5724, -2962, -3570, -4925, -4222, -304, -1388, -6329, -9356, -9622, -11620, -10820, -11626, -4408, -5622, -2015, 1132, 3463, 1093, -1648, -592, -1170, -1407, -2021, -5808, -4570, -3635, -3908, -2136, -2791, -2932, -2515, -3580, -1683, -1224, -3078, -5962, 251, 75, -268, -42, -763, 356, -1606, -7063, -7924, -7471, -7049, -2237, 1227, 3257, 5798, 9329, 12618, 12544, 4608, -813, -4426, -758, -839, -700, 853, 1204, 393, 4040, 5338, -1537, 306, 5283, 3246, -1139, -5787, -1288, -2461, -5078, -3965, -4405, 1077, 5256, 5263, 10378, 12524]
16346A2524j246o783l158m894k564R18L284L4K384L583l09K059j678K165J986
16331H305l0l224m139J807R58R05M05p58j530K088J044k974n98j868L459K104
16315E954L92L330j236k994J438k965J570L083M16k541N46om486m670J884l13
16299e98l821J167m73j578K581k877n18K439K212k487l242k150j170Q26J663r38
16283h964J163K45N250J642k052l202J074j81j273L816K497Q87r42n61j855m56
16267b912M374L202J46n608m481k500J377M40L261j326M97K469J174M033l105
16252A041n194J396n00L059L973K206O35K876l394m479r40K615j364l821q0M59
16236a512k284K172r95M67J467m612k100K433L740K840j115J12J113j842M507
$$ y = [12524, 11278, 4495, 1337, -3557, -6121, -5203, -1919, -1885, 499, 4082, 3773, 5832, 4154, 6319, 8305, 8275, 5051, 912, 2719, 3677, 4582, 4987, 4229, 2699, 4787, 5831, 2857, 2259, 391, 3850, 5954, 6346, 9676, 8440, 5446, 6884, 3919, 5489, 8572, 8988, 6447, 6993, 6987, 2501, -2169, -285, -598, -4419, -3252, -3725, -5303, -2722, -5599, -6117, -3678, -1466, -3953, -7195, -9345, -10515, -9689, -8026, -8964, -7801, -7556, -2306, -664, -2716, -5918, -4844, -5025, -6298, -2482, 15, 902, -40, -601, -2456, -2912, 1462, 4664, 4810, -798, -5279, -7779, -6402, -5962, -2701, -4027, -3530, -1061, 113, 4146, 1041, -4153, -2757, -3257, -198, 3775, 5981, 6616, 9492, 6098, 1619, 679, 3294, 1930, -1891, -1971, -1512, -3796, -1624, -2619, -2152, -685, -5297, -7397, -4964, -1224, 1616, 501, 613, 1726, -116, 4391]
16221D391o40n428l807M817L283j582k628k731O633J086k824k010O799k477J594
16206D476N208J476l392m169l324J992K038nN113J892j4304j2718p94P842R328
16191F59O00k96k507o439l04k343L095k348n80O279n083o138L256J341K211L603
16175d994K31j861j214K45J214K312o979m143K059N298J250j987k047M498N356
16160g62j603q47m78K32j809n89k993L484N810L158q1J729m246l467k836J022
16144d276K987M107o9p559l523J071N161k712n754r32P741M457M94n836k81K106
16128b818n90O27M598o6q90J102q30L73k344M26l033n58M22J493q36J432l328
16111d820l280j232k025O477J985L583J135J663L199j668l483j470l778J257N97
$$ y = [4391, 3751, -1677, -5484, -667, 2616, 1034, -1594, -4325, 2308, 3394, 570, -1440, 5359, 2882, 4476, 9684, 11160, 7768, 3599, 275, 2267, 4305, 4300, 9413, 11305, -2999, -15717, -16511, -8669, 659, 1259, 963, -1544, -7983, -8287, -10630, -7535, -9883, -10463, -4184, -9267, -15405, -12149, -10808, -8597, -4994, -4763, -6624, -7838, -7593, -6379, -4067, -11046, -15189, -13130, -7832, -6582, -8569, -10616, -6118, -762, -2365, -3212, -3690, -3458, -5267, -5856, -8849, -5365, 445, 3603, 3522, 5251, 1005, -2462, -5298, -4276, -1289, 2818, 2749, -4810, -8333, -7262, -2101, -4813, -10567, -11499, -3758, 699, 1193, -4643, -4924, -2818, -3408, -2781, 1817, 1751, 861, 1963, 1133, 1506, -838, -412, -3445, -4003, -3581, -2088, -2924, -1492, -4820, -8100, -9332, -11357, -4880, -2895, 688, 1823, 3486, 6685, 5017, 1534, 64, -3714, -2457, -1860]
16096a860j059l605j54M975k862r85L162k173k121O173R24k726n341J953L54J163
16080d182K764k320l309q93P66J686O185n3j980l699j899O739m131o249K252K647
16064e676L371o106m034K321M175N15J801O723m352m150N79J073L424j25l763
16049d224K640k628R01k251l94M639L7l588l746M110l739P7R718JK801N70J427
16032F351N453M460L0k236o079m523m016M877L660k386k050J441M035j376k918
16017D723N9J495j516m585N70J422k671o86L859l268m676O159M808L918o49L96
16001I358n762k329n043P97O194j26J489K061L749M00k106k776j166k804K34N834
15985H004J161k785l30P45k544j121K565K462N774L902q37K979k402k109l997
$$ y = [-1860, -2919, -6524, -6678, -1703, -4565, -5550, -2388, -4561, -6682, -509, 415, -2311, -7652, -5699, -5345, -4182, -1418, -3738, -7047, -7940, -7174, -5488, 697, 644, -1336, -5035, -6934, -195, -4326, -10575, -8323, -5676, -2305, -8411, -12445, -10124, -5949, -5434, -3633, 3090, -1262, -5412, -4833, -3760, -336, -461, -4224, -1584, -4212, -3311, -5562, -5956, -1317, -1280, -4868, -8614, -4504, -8243, -8166, 1552, 1553, 4354, 4924, 6351, 11804, 16264, 16294, 14058, 7979, 3456, -560, 4317, 7977, 5591, 3541, 4982, 9017, 7641, 4723, 4782, 6277, 4761, 176, 746, 2168, -503, -1189, 2670, -598, -5274, 885, 5693, 9611, 8962, 9358, 3596, 1267, -3776, -2979, 3215, 3089, 4578, 6639, 10388, 10788, 8682, 5906, 4740, 1936, 2170, 8004, 9165, 6380, 6050, 6795, 4251, 3130, 5695, 8157, 13931, 17833, 16996, 19975, 17573, 15464, 11467]
15970A1467l068N00M778L642L835J2017J1534R269K0019K5875K6207L0294K4225
15957A80594J6534R568m955p060j8873k6485k6498j8188j5798j2039q204n630
15945F2966n346l319j196P72l165L23k422L000J786Q32O368L693J08l73k288M132
15929F5871M581M83j092N489P585J7843J9226K6991M5395O4046Q0118Q7776R1948
15916E16260P9811N3790K1050j5289m4698o6085p6758p9878p6292n5537m2281
15905B14093l1857j9421j1458q886o472l561k079M139J3798K1896K1501J6088
15893B07781Q333j412n032m004j2163j8953j6529j3919j0948q55J0713J5528K3018
15880A81558L0014M7390O2228Q1793Q9120Q9844P1412M1524J1168k0253o0954
$$ y = [11467, 8399, 8899, 13677, 17319, 21154, 33171, 44705, 53974, 73993, 99868, 126075, 156369, 180594, 197128, 206696, 201741, 194681, 175808, 149323, 122825, 104637, 88839, 76800, 68596, 62966, 57620, 54301, 53105, 53877, 50712, 51035, 48613, 51613, 53399, 54231, 60599, 64292, 64400, 64027, 61739, 65871, 70452, 70935, 69843, 75332, 82917, 100760, 119986, 146977, 192372, 256418, 336536, 424312, 516260, 596071, 649861, 670911, 655622, 610924, 544839, 468081, 388203, 311911, 256374, 214093, 182236, 162815, 151357, 142471, 135999, 132438, 130359, 134498, 148296, 170192, 191693, 207781, 216114, 214702, 209670, 205666, 193503, 174550, 158021, 144102, 133154, 132299, 143012, 158540, 181558, 211572, 258962, 321190, 402983, 492103, 581947, 653359, 694883, 706051, 685798, 624844]
15869F24844q2785q4812p8204o7710n9303l6908j9819j5574j7955j2762l230o775
15857A39007j0776l951k547q930o639l640l521l947r251l875K395l705K73O31
15843H1524J399M077O469N382P711J2196J3036J9605K2171K3106K5694J8702J9586
15830B60658N124j2596k5021k8039k7391k6262k4752j8850j2553m132o580p000
15818G2606n116l569l90O77o267p783l120k864k449m711j514L422k781j671k285
15803C2185r79j494r50L118q48o533k105Q57N949P001K382j132k641k102P99M910
15787C8417Q084R287J0124Q175J6410Q908M378K286l531n642r841j3772j6594
15774E6689j0314p168J657K125l332l434l246r04R1l596k140J379K271J1p343
$$ y = [624844, 542059, 457247, 379043, 311333, 252030, 215122, 195303, 179729, 161774, 149012, 145782, 139007, 128231, 124280, 121733, 112803, 106164, 102524, 99003, 95056, 85805, 81930, 84325, 80620, 80893, 81524, 82923, 87000, 93469, 98851, 106562, 118758, 131794, 151399, 173570, 196676, 222370, 241072, 260658, 265782, 253186, 228165, 200126, 172735, 146473, 121721, 102871, 90318, 86186, 79606, 72606, 67490, 63921, 63531, 64208, 57941, 50158, 47038, 44174, 41725, 37014, 35500, 38922, 36141, 34470, 32185, 31206, 29712, 28762, 31880, 31032, 24499, 22394, 23251, 29200, 36201, 38583, 37451, 34810, 32708, 33507, 38417, 46501, 55788, 65912, 74087, 90497, 99405, 103783, 106069, 102538, 96896, 87055, 73283, 56689, 46375, 39207, 40864, 42989, 39657, 36223, 32977, 32073, 32164, 28568, 26428, 27807, 30078, 30089, 22746]
15759B2746l049M353M15k980m346J49M310m011k315m0K349M549J147m82j114k706
15743A8975j079j827J077L525o37j437k036K538l166k234j981J072p78K010L569
15728A7591J244k893l395Q2Lq06j033n289q03j656J237N208M898N83j987L346
15712A6330j483J141K06k463K445j37n316n418K205K125K291n274o73K528k721
15697E786l469k026k631J251K234J653mp55L126J96k435j975m667n481M150L131
15681a916K468L155l71J42N97j13j798m986M507L185k825k951J936K498q03j010
15665A715j31k591m784N667L069n227n849L168L617k455r85N995N163L95o246
15650E21m632Q24J145Q87J72K079K035l344m06m521l160o99J9N997M008M503P07
$$ y = [22746, 19697, 24050, 24465, 21485, 17139, 17288, 21598, 17587, 15272, 15232, 17581, 22130, 23277, 22795, 21681, 18975, 17896, 16069, 17146, 20671, 20034, 18597, 16561, 19099, 15933, 13699, 11718, 12790, 12012, 14022, 17591, 18835, 15942, 12547, 12629, 12632, 11826, 10793, 5504, 4701, 3045, 4282, 9490, 14388, 14971, 12984, 16330, 14847, 15988, 16194, 13731, 16176, 16039, 10723, 5305, 7510, 9635, 11926, 6652, 5979, 8507, 5786, 2317, 291, -2340, -1089, 1145, 2798, 2794, 2039, 5165, 5361, 2926, 951, -3716, -9197, -5047, -1916, 552, 3707, 3336, 3478, 4075, 3962, 2164, -2822, 1685, 4870, 2045, -906, 1030, 3528, 2725, 1715, 1584, -1007, -5791, -124, 2945, -2282, -8131, -4963, -1346, -3801, -4786, 1209, 6372, 6767, 521, -4111, -3287, -2142, -1255, -1083, 996, 3031, -313, -719, -5240, -8400, -9099, -9080, -3083, 925, 5428, 6135]
15633F135L322j488r06j516k156n33O55M01p130m687P84M486j701P51K75j437
15617d745J728J245j845J923p32n302l58O937K40m72m362n782K860R17j396N168
15601c976j844M024p21j362r19M53K933N897M701o739j888J171k483J190n551
15586e114m3K814R25o54Q62o035m426M251K425J677m05o19k47O972R91J8M997
15569H389J66l747j798o158n881K467k765m07N219L736n657J435O403Q56l64j676
15553B18R73K767J79j154n76k189p665k712j755k626K218K93K896K659k195L737
15537d932O021J511k853j211K403J148j11K555N5L541k892l028k293l002Q82r74
15521c180j251L749k990N29p57l788R61O056q31l230k253k801O05n92N80J129
$$ y = [6135, 9457, 7969, 7063, 5547, 3391, 2858, 3513, 3914, -3216, -7903, -7119, -2633, -4334, -3583, -3308, -4745, -3017, -1772, -3617, -1694, -2426, -7728, -8086, -1149, -909, -1381, -5743, -11525, -8665, -7748, -9144, -3976, -5820, -1796, -2517, -3879, -4798, -4345, -1412, 4485, 9186, 2447, 559, 1730, -753, 437, -5114, -5157, -2343, -1418, -2072, -1210, -7245, -11671, -7420, -4995, -3318, -3723, -4342, -4589, 2383, 3374, 3392, 8389, 8555, 4808, 3010, -3148, -9029, -6562, -9327, -9734, -4515, -779, -6436, -5001, 1402, 2258, 1894, 218, 1191, 3958, 4137, 2983, 2407, 218, -7447, -10159, -11914, -14540, -12322, -12029, -9133, -6474, -8669, -4932, 1089, 2600, -253, -1464, 939, 2087, 1976, 4531, 4586, 8127, 5235, 2207, -86, -3088, -2206, -3180, -4431, -682, -3672, -3143, -3900, -7688, -6727, -671, -1502, -4732, -6985, -9786, -9181, -9773, -9193, -8064]
15505h064k787M682K028L582J430j250k345J998Q21j462j455L337M485k668k9
15490B303k985o887r42J831N23L433J372p97j006m793l930P23K404L38L191k59
15474e481J612L18N514J203k796l228L155l224n084n123L838M769j693l981J74
15459a0027k85N060P515J470l780k193q07l441l0N836J408m636l721J649N253
15444g29m788k149L336M184k743l463N842N688L006R81l952n984L90K212M225
15429F056o061m045m212m50l702p36M244R40j731p3l333j006J808K229M291J025
15413d756K419j971o78M301l379j461M942l359J403M205o93M63J045p12o024k797
15397g052K489m74l248k600N558K88k607q39k500R03L722j479L365l09k154k88
$$ y = [-8064, -10851, -6169, -4141, -559, 871, -379, -2724, -726, 95, -1367, -2822, 515, 5000, 2332, 2303, -682, -7569, -8511, -6680, -6157, -2724, -1352, -2149, -3155, -7948, -11878, -11155, -8751, -8413, -5222, -5481, -3869, -3551, 1963, 3166, 370, -2858, 297, -2927, -8011, -13134, -9296, -4527, -6220, -10201, -10027, -10312, -5252, 2263, 3733, -47, -2240, -3047, -6488, -6518, -682, 726, -3910, -7631, -5982, -729, -5517, -7666, -4330, -146, -2889, -6352, -510, 5178, 8184, 9165, 5213, -771, -381, 1831, 6056, -5, -4050, -8262, -8712, -12414, -13150, -8906, -7966, -9697, -9770, -13103, -14109, -12301, -10072, -5781, -4756, -2337, -4308, -4986, -685, -4064, -5525, -583, -3942, -2539, 1666, 973, 1436, 2481, 1769, -4255, -7052, -4563, -5037, -8285, -10885, -5327, -5039, -7646, -8485, -10985, -10082, -6360, -7839, -4474, -4783, -6937, -7225]
15381g225k800j786m781r17J855L991J278L735j328k142O18j197P836M965l175
15366a073J073L630J937l833j596L304j788K30K093n232r654J391L921M751J916
15351A070l132m953L314K083lm803N590N103l699j056k076P4j358O9k290J177
15335d890K573J256k345K68O918j696l435k233m18j725o123n218j1N923N543J020
15319d593J303N566O321K814n523n888m14J892n47l580L53J807k966j27L15n553
15303h820m055O90k481k439N480J316K962J85N70O89Q70L502K810m877p100L722
15287f976P088K174l491p458m995L957O565j088p30K465k92j084M80J198M886
15272B699N730N814P245Q343N299K107J593K374l398n720n223n640p654n278l815
$$ y = [-7225, -10025, -11811, -16592, -17509, -15654, -11663, -10385, -6650, -7978, -10120, -9502, -10699, -2863, 2102, -1073, 0, 3630, 5567, 1734, 138, 3442, 1654, 1884, 3977, -1255, -10909, -9518, -5597, -846, 1070, -2062, -7015, -3701, -1618, -1621, -6424, -834, 4269, 570, -486, -2562, -2488, -3846, -3777, -6067, -4890, -2317, -1061, -3406, -3138, 3780, 2084, -1351, -3584, -4002, -5727, -11850, -17068, -17079, -11156, -5613, -4593, -3290, 2276, 8597, 11411, 5888, 0, -414, 1478, 931, -2649, -2296, -489, -3455, -3582, -3267, -8820, -12875, -12185, -14666, -17105, -11625, -10309, -7347, -7162, -6592, -5903, -5033, -1531, 1279, -3598, -10698, -6976, 112, 2286, -1205, -8663, -13658, -9701, -3136, -4224, -4954, -2489, -2781, -3865, -3385, -2187, 2699, 8429, 14243, 21488, 29831, 35130, 37237, 38830, 41204, 37806, 32086, 26863, 21223, 13569, 8291, 4476]
15257D476k707L408K395k023n331K37L273K096n68m750j556j395L340J160n513
15242c458m601M074M105Q03j977r9o32P20n79r18L034J269M132j221k019J512
15226D145l455O718O10r7j07k860K122j842J47k917m448m032l761k261k170K271
15210a1937L636Q719O132j687l918l282Q09N434o72j288L36j829J413N245j903
15195E208o90m404k462O85L48j372o175r54R09n70m78j179P53j547M682l42R21
15178f667L868j081J692K592P99j108j208m660J158j347p720R27J684K733J735
15163f603p50k816J541R97j515J915N10L596M320P03k611p22j69J310q07l20r98
15146b419J725l478k820n73m886l536J208J017K4M106N127M414k256l495k891
$$ y = [4476, 1769, 5177, 7572, 5549, 218, 455, 3728, 5824, 5256, 506, -1050, -2445, 895, 2055, -3458, -8059, -3985, 120, 923, -1054, -1153, -1785, -1065, -1644, -2562, 472, 1741, 5873, 4652, 2633, 4145, 690, 7408, 8018, 7921, 7814, 4954, 7076, 5234, 5381, 2464, -1984, -6016, -9777, -12038, -14208, -11937, -8301, 418, 6550, 4863, 945, -2337, -1528, 3906, 3234, 1946, 2282, 453, 1866, 7111, 5208, 4518, 114, -2348, -1663, -1315, -2687, -8862, -9816, -8907, -9477, -9955, -11134, -10381, -11928, -7246, -7588, -6667, -2799, -3880, -2188, 404, 1203, 95, -1113, -5773, -4615, -5962, -13682, -12755, -11071, -8338, -6603, -7353, -10169, -8628, -7631, -9146, -7231, -6721, -3125, 1195, 1898, -713, -1435, -1604, -294, -1101, -1421, -2419, -694, -4172, -6992, -7565, -12451, -15987, -14779, -13762, -13738, -9632, -4505, -91, -2347, -5842, -8733]
15131h733N809Q172j381m851k043J13l403K196N864j015n265p31K860n700J788
15116f320K294l049j513N692K495J65O2l997k837L262L491K97j369k380K746L770
15100B809j265k067O4J41j333L32r50n39P5R821J5113J2802J6435K2755P337L136
15084H4666R18j177o648p193q863j2095j2436q507o108n056o843q886l623J800
15070e1K948M962K162l953l188J091J094Q03m475n898J966K576K440R60j182j2
15054B243j976p67l299L307K021l792l125K397J029k07k738K246l204j491K722
15039d634P507Q391n114r460n35L831L466m068k109k343k09L869j81n15J597P031
15023F524O042N651Q142R079J0491J5321J0678J1035J244m90m53n303j5935j6229
$$ y = [-8733, -2924, 5248, 3867, -984, -3027, -2914, -6317, -4121, 1743, 728, -4537, -5268, -2408, -8108, -6320, -4026, -7075, -8588, -2896, -401, -236, -174, -4171, -7008, -3746, -255, 42, -1327, -3707, -961, 2809, 1544, -523, -459, -318, -1651, -1319, -2269, -2808, -2733, 7088, 22201, 35003, 51438, 74193, 81530, 84666, 85584, 84407, 77759, 70566, 61703, 49608, 37172, 28665, 22557, 17501, 10658, 1772, -1851, -51, 2897, 7859, 10021, 6068, 2880, 3971, 5065, 5868, 1393, -4505, -2539, 37, 2477, 3437, 2255, 2243, 267, -500, -3799, -492, 1529, -2263, -5388, -2991, -1962, -2169, -4907, -2661, -5865, -7356, -4634, 2873, 11264, 6150, -3310, -3845, -14, 3452, -616, -2725, -5068, -5277, -1408, -1589, -2104, -507, 6524, 12566, 18217, 26359, 35438, 45929, 61250, 71928, 82963, 84207, 83717, 83264, 77961, 62026, 45797]
15009D5797j4709q261n655l079j128o44L34J29n9k485M68L111l466J121J420p652
14993E242m490n902l316Q45O965k176k857N976O717R332j76m922m915l629k301
14978C93k041k039K351J58k146Q45j713k073J147N923P197K546k384p596r20R82
14962F30m27O16J965N165J824k748n275k535K02l26J913L397k735j816K006J542
14946C398P855p271j2342j5926j0657J1276J2135p28M214J5246J428o073k376
14933A79n40L386K097m511o864j027L985J532j179r41M715K05J151l593k11K41
14917a375l716Q80L051l492j060J031j240n99L333K588L266J653K765n491N38
14902B132j543JK823N79l022n941j643o332o914N308P489m680j891P693K314m763
$$ y = [45797, 31088, 22827, 17172, 14093, 12965, 12321, 12655, 12784, 12725, 10240, 10708, 13819, 10353, 11474, 12894, 5242, 752, -5150, -8466, -7621, -656, -2832, -5689, 287, 7004, 16336, 16160, 11238, 6323, 2694, 393, -1648, -3687, -1336, -1178, -3324, -2479, -4192, -6265, -5118, 805, 8002, 10548, 8164, 568, -352, 630, 203, 819, 2784, 7949, 9773, 7025, 1750, -785, -583, -909, 1004, 4401, 1666, -150, 1856, 3398, 11253, 3982, -8360, -24286, -34943, -23667, -11532, -12260, -8046, 7200, 8628, 2555, 179, -361, 3025, 5122, 611, -6253, -7280, -3295, -1763, -2942, -3883, 832, 1037, 2188, -1405, -1616, -1375, -5091, -4211, -1160, -4652, -5712, -4681, -5921, -6520, -3187, -599, 2667, 4320, 7085, 1594, 2132, 589, 590, 3413, 3992, 970, -4971, -6614, -12946, -19860, -14552, -7063, -11743, -13634, -5941, -3627, -8390]
14886h390J561p26k642l760l975K654J0744R52K030Q58J354m191r430M07K640
14871i914Q497J0013k010o638l896j350p72L059n068j741J842L371J589j89l18
14856c525m098m728L273L184m05l0k406p4O967M444K639r87m66O72l448k591n132
14839f711j355O09M854n71n016M469L484k310l751L35n521J639O893J797N027
14824C872k561K081j66K34K110n78l533K708L570K75n852m958Q02M479p75Q4J902
14807C694j953k913J611m546J186J628j46l420o011K688J691o84N462L167j315
14792A39p410K884O493j208M411l461k894m001k410j987n342o04r00P04P89K493
14776a2304O80j386K462k989J98J010j407k371M762L563M493O539o402k634Q31
$$ y = [-8390, -6829, -7555, -10197, -13957, -17932, -15278, -4534, -3582, -1552, -694, 660, -3531, -12961, -12554, -9914, -1417, 8596, 6586, -52, -3948, -5298, -6070, -3011, -8079, -9820, -7978, -4607, -3018, -3207, -3525, -7623, -12351, -9078, -5894, -6299, -6329, -8735, -8809, -1842, 2602, 5241, 4254, 3788, 4460, 1012, -1579, -6711, -8066, -7457, -2603, -3174, -8190, -3721, -237, -2547, -6298, -5963, -11484, -9845, -2952, -1155, 3872, 1311, 3392, 3226, 3460, 5570, 4992, 1459, 4167, 7737, 8012, 2160, -2798, -1996, 2483, 1708, 1792, 3694, 1741, -1172, 439, -4107, -2921, -1293, -1439, -4859, -10870, -8182, -6491, -7175, -1713, 1454, 139, -7271, -4387, 2106, 898, 5309, 1848, -1046, -5047, -7457, -9444, -14786, -15390, -16290, -15586, -14797, -12304, -11624, -13010, -10548, -13537, -13339, -12329, -13736, -16107, -11345, -7782, -3289, 3250, -3152, -5786, -4955]
14761d955K8L589k428L33k179J94M712J904l093m15l937R7J563p21j423k91j851
14744h873L340N594N492K078l504j241j201J749l401m763l838j473j964O930L46
14729d729m048J252K644m445l81L200K085K344J675k611k111q988Q40N397N86
14714g290N796J235j588k19k148K45p73l138k182L038M723k298j77K260j145L24
14698c337J246k626j308N01k041j523N801K967k442n21L274k01M26K075l840l158
14682d707J006k296K332L835M22k194n475k943k175N33M187m731m81K400L323
14667f964j89J496K199o29R03p281k811L292L597K573K799l660J205n381j145
14652i996L755k273J810M596n9Q30l275l98n59l005k09J057L123j874P98J303
$$ y = [-4955, -4927, -1338, -3766, -3433, -5612, -5418, -706, 1198, -1895, -2310, -6247, -6150, -4587, -5308, -6731, -7022, -8873, -5533, 61, 5553, 7631, 4127, 2886, 1685, 3434, 33, -4730, -8568, -10041, -12005, -5075, -4729, -8777, -7525, -4881, -9326, -9707, -6507, -4422, -2078, -403, -3014, -5125, -14113, -13273, -7876, -7290, -1494, -259, -1847, -2066, -4214, -3969, -4742, -7880, -10062, -7024, -2301, -4599, -4776, -2516, -3661, -3337, -2091, -4717, -6025, -5524, -7565, -9088, -3287, -320, -2762, -3283, -9, -210, 216, 2291, -1549, -4707, -3701, -5997, -3665, 170, 592, -1602, -7077, -10020, -12195, -11662, -7475, -12206, -12687, -10287, -6964, -7153, -5657, -3458, -4087, -3184, -10465, -13276, -9984, -6387, -3814, -1015, -4675, -3470, -8851, -9996, -6241, -8514, -6704, -2108, -2167, -1337, -4612, -5010, -5569, -8574, -8783, -7726, -4603, -6477, -5679, -4376]
14636d376lq78J742j441l435l397J540O54Q52k504r43M33J121k232o63J433O439
14619e658N855J664m202r67n64J05J27l918j80L122K507p38j233k748o61P620
14603A31J728j613q26j874R98L492M951n671l962K883J04l835K132K087p71k197
14587b243k260J988L713j158k605q31J69L419J14K007j718k493J202P28N878j96
14571E714p445j733l193J645K281p251q173K810M708J034K065N104n578l655J652
14556a0015K525K623M967O663o533n239l791J740R16j778K798M930l166j200j277
14541e837K200J246j343j449m1M565L37n885P24N483P163r11l477P95l718q163
14525h311n124l024O326N016L702L567o961n628J166J0800O88k789k855m815J017
$$ y = [-4376, -4379, -5257, -3515, -4956, -8391, -11788, -10248, -9594, -8742, -11246, -12189, -11756, -10635, -12867, -13530, -12097, -5658, 197, 1861, -2341, -3308, -3872, -3767, -3640, -7558, -7738, -4616, -2109, -2847, -4080, -6828, -7489, 131, 1859, 246, -580, -2454, -1456, 2036, 6987, 1316, -2646, 237, 341, -3494, -1362, 725, -46, -2243, -4503, -2515, 1198, 40, -2565, -3396, -3227, 192, 306, 2313, 595, -1898, -696, 32, 5910, 5714, -1731, -3464, -6657, -5012, -2731, -9982, -18155, -15345, -10637, -9603, -7538, -2434, -8012, -11667, -10015, -7490, -4867, 100, 6763, 230, -5009, -8800, -7060, -6144, -7922, -5124, -194, -3360, -4560, -5837, -3637, -2391, -3734, -5183, -5224, -659, -322, -6207, -5483, 0, 7163, 6252, 2775, 3570, -148, -8311, -13435, -16459, -10133, -5117, -1415, 2152, -4809, -10437, -9271, 1529, 2217, -572, -3427, -8242, -7225]
14510g225L775l870l902K255N675l482J300L024P24L550j560l18j74N41k857J251
14494a293L912N103p025n334p43K700J670l137l219j551k777M514M978m24m30
14479c056k913K678M16O15j329L776J61j468j840k352m24k052m648k016K82M517
14463i653J794j03l47m162M555N531N278K040m281m006M01K577j239m88O961P077
14447A1935l323l025l036n577o70J400L521l47m138n852j259L354M448O816J749
14432E996n926R22l714j999K191L046M92k854P70M71n652l55j357Q80O276Q27
14416A4N13j70M093L875q22o035j402l537j16L753j851j5J47L708k774n75N337
14399D143j951k410l316N91L999M5J254m415k394J782k959j603L338k97J611k061
$$ y = [-7225, -3450, -7320, -11222, -8967, -3292, -6774, -5474, -2450, -1726, 1824, 264, -54, -228, 313, -2544, -1293, 2619, 7722, 697, -4637, -5380, -2680, -1010, -4147, -7366, -8917, -11694, -7180, -2202, -2626, -3056, -5969, -3291, -2875, -2260, -3589, 187, 348, -1120, -2960, -5312, -5736, -7788, -12436, -14452, -14170, -9653, -7859, -7962, -8309, -12471, -7916, -2385, 2893, 4933, 652, -3354, -2953, -376, -1615, -2103, 4858, 11935, 8612, 5587, 2551, -3026, -3696, -2296, 1225, 878, -3260, -9112, -10371, -7017, -2569, 4247, 5996, 70, 992, -2722, -4721, -2530, 516, 1008, -1846, -1076, -605, -6257, -6612, -7969, -7089, -813, 14, 527, 357, 4450, 8325, 7503, 1468, 66, -3471, -3587, 166, -1685, -1700, -1553, 2155, -619, -1194, 4143, 2192, -218, -3534, -2943, 1056, 1101, 2355, -2060, -4454, -2672, -5631, -7234, -3896, -4193, -2582, -4643]
14383d643m675L033P786p22m156k451J004L587L568J779K613K114K68R66k11q052
14367A808n914L755M281p124m254M106P08L8K478K042j889k261k689R17M443O386
14351F831J579M84K03k934J01k731l337k284K538j447L658J208o78p970o10P291
14335A902N552r15m158m070L845M919N983n88j399j394o72j990m123l641m148
14320d897J113j372M51K249J60N411J503k48K323M696o857k989R47Q72L127j607
14304D882k286l957k887k668L29L399M286q56M71J200L251q70l50k963n166k081
14288f266J856O935J108j616L200K228L914q722j350k969k431j557P20K541J254
14273a155K4j69L994J197J158P69k045j259P41j837l164L005N181K70p103m425
$$ y = [-4643, -9318, -6285, 1501, 779, -3377, -5828, -4824, -1237, 2331, 4110, 6723, 8837, 9105, 10071, 9860, 1808, -4106, -351, 3930, -3194, -7448, -3342, -2634, -2596, -118, 1924, 35, -2226, -4915, -3998, 445, 6831, 8410, 8894, 9097, 6163, 6264, 3533, 196, -2088, 450, -997, 2661, 3869, 3191, -4779, -5389, 1902, 7454, 6539, 2381, -1689, 2156, 7075, 13058, 12470, 11071, 9677, 9005, 7015, 2892, -749, -4897, -3784, -5156, -4705, -2456, -2296, 3115, 4618, 4370, 6693, 11389, 4532, 1543, 2490, 3362, 6489, 4882, 2596, -1361, -4248, -6916, -6587, -3188, 1098, 242, 713, 1913, 5164, 4294, 3944, 981, -4185, -6266, -4410, 2525, 3633, 2017, 5217, 7445, 11359, 2637, 1287, -1682, -4113, -5670, -4950, -2409, -1155, -1131, -1300, 2694, 3891, 5049, 5818, 3773, 2514, 3255, 1418, -1746, 1259, 6440, 6710, -393, -4818]
14257d818n277J876K436O43J473j304K045N769j113n192k613K253q49O05O668
14242B602J109o108k592L127j185k773k538J144M080Q51K751j152m676l262n07
14227i129o314j822j84l220k60O050L320L421P07j582o416L803M416n69J914k918
14211h783J194l24K769L253l273j874n855k616J037N800J322L95J384J60o848
14196a2259p694N032J373K076L413K088L497p90L343J401m447r25p370k841J695
14181a2408L184K999K392m97j232J832j282l811K143J712r339K94M351Q67P07
14166h088N026J685K364k070J109j469n511n141Q4K616L987J934M110P57J351
14151B744o27n753J061M838l790n294J83J970nq36n37k573j413L658j413l269
$$ y = [-4818, -10095, -8219, -5783, -5140, -3667, -4971, -2926, 2843, 1730, -3462, -6075, -3822, -4671, -4066, 2602, 3711, -2397, -4989, -1862, -3047, -5820, -8358, -7214, -3134, -2283, 468, -684, -5360, -8622, -9129, -15443, -17265, -17449, -20669, -20929, -14879, -11559, -8138, -7431, -9013, -15429, -11626, -7210, -7779, -5865, -8783, -7589, -7913, -5144, -1891, -5164, -7038, -12893, -15509, -14472, -8672, -7350, -6955, -5571, -5411, -12259, -19953, -14921, -13548, -11472, -8059, -5971, -2474, -3264, 79, 1480, -2967, -3892, -11262, -14103, -12408, -9224, -6225, -3833, -4330, -5562, -3730, -5012, -8823, -6680, -4968, -14307, -14013, -9662, -8795, -8088, -3062, -1377, 987, -1083, 26, -1443, -6954, -12095, -12011, -9395, -5408, -3474, 636, 1393, 2744, 2117, -3636, -2575, 2263, -1527, -6821, -6638, -4668, -4673, -5509, -6046, -8619, -10032, -6374, -7787, -11056]
14135a1056O38m02k6L519M338j825j791m005K120k366o566J924O748N283M65N4
14119b948l977j172M12K379Q41n180j313M935M97j622n00J587K325O473K340j758
14103C319R96n111j0345j415J182k626o49m562l205O348P645K338K041K19P120
14088C295J993k163n853n980o480m540M671R382N660q9j697k841j706N50l33J786
14072d345m681r26N047J646L54J099K304n033r22J262k339l8j772k817N323J465
14056d373j788o290m776J156K565O170J769J86k310k446K565k456J027j880j388
14041a2269P060Q72l984n687j933L015O118M761n75J403l498l20M794J421n451
14026d273o99M391k235m640o01K081K68q10k210p98l555j632L349Q587P04l000
$$ y = [-11056, -10418, -10820, -10846, -7327, -2989, -4814, -6605, -10610, -8490, -10856, -17422, -15498, -8750, -3467, -3002, -2948, -6925, -8097, -7685, -5306, -4465, -9645, -10958, -6023, -5526, -7148, -7648, -6061, -3736, 2737, 5077, 3319, 4315, -796, -11141, -12556, -11374, -14000, -14649, -19211, -22416, -16068, -8423, -6085, -4044, -3825, 3295, 5288, 3125, -2728, -8708, -15188, -19728, -15057, -5675, -15, -104, -1801, -4642, -6348, -5798, -6131, -4345, -9026, -9952, -4905, -3259, -2905, -1806, 498, -4535, -5457, -4195, -6534, -6572, -8344, -11161, -5838, -4373, -6161, -12451, -17227, -16071, -13506, -7336, -5567, -5381, -7691, -10137, -7572, -10028, -9001, -10881, -12269, -5209, -4337, -8321, -14008, -15941, -12926, -6808, -2047, -2622, -1219, -4717, -5037, -243, 1178, -4273, -4972, -581, -2816, -7456, -8057, -5976, -5708, -6518, -8728, -9526, -13081, -14713, -11364, -2777, -2073, -5073]
14010e073k478k933J816M414J270M02M320l753k964k477J783Q99j173N872m04
13995d79k342l749l441L927K244M32L072K82j700K333k824k407K645J500l972
13980d479N17k741l049K290J915J732J389K879J282o844j206q65k451L00O555
13965b776Q928N377J373n02P845J0576j815J853j459n517j4684o328K480Q66m20
13950E797K167O061N723P71n778l136k48n606o442o743m28j083L526k319p30j796
13934a0264K03K404J462J963J992k730J57P62J975J977J505j259o06P36J637L130
13918E044O153L98j073q154k217M286Q829P226J382M43l417m124j1358l739K337
13903B016j269N874M274m180m929M416M160l733j651j134j994m19l467j955P77
$$ y = [-5073, -7551, -10484, -8668, -4254, -2984, -2582, 1738, -2015, -4979, -7456, -5673, -4774, -5947, -75, -479, -2821, -6570, -10011, -6084, -3840, -3408, -336, -54, -1754, 579, -2245, -4652, -2007, -507, -4479, -3962, -6703, -9752, -7462, -5547, -3815, -2426, 453, 1735, -5109, -6315, -7180, -9631, -9331, -2776, 6152, 11529, 12902, 12400, 20245, 30821, 29006, 30859, 29400, 23883, 9199, 2871, 5351, 6217, 5797, 7964, 14025, 19748, 20519, 14741, 11605, 11357, 5751, -691, -7434, -7862, -8945, -5419, -7738, -8468, -10264, -10061, -7657, -6195, -4232, -2240, -4970, -4813, -4051, -2076, -99, 1406, 147, -459, 277, 1914, 5044, 11197, 11595, 10522, 2368, 151, 4437, 13266, 20492, 21874, 22317, 18900, 14776, 3418, -321, 2016, 747, 6621, 10895, 6715, 1786, 6202, 10362, 6629, 4978, 3844, 1850, 1431, -2036, -3991, -3214]
13888c214o579j091N21K682O05O65K746R93p061m258J847L828J152j93l307L553
13872g111Q048K956L342O67l596j713M96m018J130J436J420J766L419l235l864
13857A143o53J267j237j082M447n433n676J030j025n4M937J174m270j900K252
13842e080j07N632j478k558L08O079k685k839J316m336J293l069K118K376N30
13827b500m82L65l01l521l770j131r36M432P1m280k259K187J151j336J455j60
13811a1015J155K434L076J007k348j859l70k495K75N86M333L478K955j241j887
13796a916J931l668j057J748j975k313l37M458J737J870j558r94l898J463k185
13781f694p27L434k545J980L358J121M38m11k743K381o60n222n814K046K085j071
$$ y = [-3214, -9793, -10884, -10363, -7681, -7076, -6411, -3665, -2672, -9733, -13991, -12144, -8316, -7164, -7357, -10664, -7111, 937, 3893, 7235, 7902, 4306, 2593, 3089, -929, 201, 1637, 3057, 4823, 8242, 5007, 1143, 490, 1757, 520, -562, 3885, -1548, -7224, -6194, -7219, -7273, -2336, -1162, -5432, -7332, -5080, -5187, 445, -1033, -3591, -3283, 2796, 111, -2728, -1412, -5748, -4455, -7524, -5406, -3030, -2500, -2982, -2617, -2918, -6439, -10209, -11340, -12276, -7844, -7773, -12053, -14312, -12125, -10974, -12310, -10855, -11015, -9860, -7426, -4350, -3343, -5691, -7550, -7920, -10415, -10140, -9554, -5221, -1743, 1212, -29, -1916, 15, -3653, -4710, -2962, -4937, -7250, -7587, -3129, -1392, 478, -1080, -2074, -5972, -4509, -6694, -7421, -3987, -6532, -4552, -1194, -73, 365, -46, -2789, -408, -1068, -6290, -12104, -10058, -7973, -9044]
13765i044L40K372K033N47J686R03Q4K544o738k210J170j0297K475N423K493N260
13749i59L215j321J571l761m004l84j483N202N291J385m84o910p125r02L509l6
13733g196k566J872M384j875L189K890o35k47l66o405j208k346k858N481N680
13718b206p45j674k39l407p66O97n73J517l513j368J311lj077o56k151O803L495
13701d555m559K065k216j0100K660L450L249O251j466l457m199j158k705J487
13687a5253J603L664L721j48n609j439J019K743L275k39j302k937m036L840L854
13672g244k062k173j709j540k305l270J123L435k40j41R537M020k453o144K93
13657a0873J475p08K756m823k289m71N276J435n459J174L991K799m61L170M62
$$ y = [-9044, -8704, -6332, -4299, -3752, -2066, -1163, -1079, 1465, -5273, -7483, -6313, -16610, -14135, -8712, -6219, -959, 2256, 935, 2506, -1255, -5259, -5643, -7126, -1924, 3367, 4752, 4268, -2642, -9767, -10669, -7160, -7196, -9762, -7890, -3506, -5381, -2192, 698, 63, -184, -550, -6955, -8163, -10509, -13367, -7886, -2206, -2951, -4625, -4864, -8271, -9037, -8340, -8913, -7396, -10909, -12277, -10966, -10969, -12046, -12702, -14853, -8050, -4555, -9114, -7049, -9265, -19365, -16705, -13255, -10006, -3755, -5221, -8678, -12877, -14035, -16740, -15253, -13650, -9986, -6265, -6413, -12022, -13461, -12442, -9699, -6424, -6663, -7965, -10902, -14938, -11098, -7244, -9306, -11479, -13188, -14728, -17033, -20303, -19180, -15745, -15985, -16126, -6589, -2569, -5022, -11166, -10873, -9398, -10106, -7350, -12173, -14462, -14933, -9657, -8222, -13681, -12507, -8516, -5717, -6178, -3008, -2546]
13642b546j912l661N07o97J146J956rn841k924j6K802L939l516J3k262k440O88
13625a4773N535J402P36M134L096K64L310l664k826k484j568q75j921l979K743
13610a0870N029q83r96J567j483l72K350K737j164n15r71l488m582M122M366K179
13594b974M095n470r63j792J50J351j018o634J955O759M65k807O49l507j639J234
13578a0146K424K33j15m165n835L988Q369R85J151k675k339K397K761K487l011
13563c491K93L581m096m25k929n253p87K542m36J15O91O92M097O447l166m246
13547f371l012j097K660l082m17K725j523j840M124j250P79L603K392K961o158
13532e506j342L92j538j062K56M626K461j366l851l834K498k861J656J455l62
$$ y = [-2546, -4458, -8119, -7612, -8309, -7163, -5207, -5216, -11057, -13981, -13997, -11195, -7256, -10772, -10759, -13021, -15461, -14773, -9238, -7836, -7100, -2966, 130, 394, 3704, 40, -2786, -5270, -6838, -7713, -9634, -13613, -10870, -5841, -6724, -7720, -6153, -7636, -8008, -5658, -2921, -4085, -4600, -5571, -9059, -13641, -9519, -5153, -2974, 1121, -4349, -5312, -7104, -6954, -5603, -6621, -13255, -11300, -4541, -4076, -6883, -6234, -9741, -11380, -10146, -7722, -7489, -7604, -11769, -17604, -13616, -5247, -4262, -3111, -5786, -8125, -5728, -2967, -480, -3491, -3198, 383, -3713, -4138, -7067, -12320, -13107, -10565, -11001, -10886, -10195, -9503, -5406, 1041, -2125, -6371, -9383, -10480, -7820, -10902, -11319, -8594, -10117, -11957, -7833, -9083, -8304, -4701, -2309, 652, -5506, -6848, -6456, -7994, -9056, -8800, -4174, -1713, -3079, -6930, -10764, -8266, -11127, -9471, -8016, -8378]
13517h378r56M55j900q84K201L026n92n895j533K263m62J800j691K356K248n327
13501a3269l470M824K011O836r94l966k589r16n744k612K644J616n2P12J900K154
13485a0915L591l881m851K881J599J346m33M447n54p697n998p95K187l632m430
13470b7135M342L752J459L459j956L93L830L632j033q594L305L691O44L825L528
13455b858k091j905j761l160K4J588L034K850L959J510n78j937j05j569J280j330
13439c049m941J34j993k20Q51L103Q12l412n331k188n28j344L317P548L43k593
13423i491J612K598m743k865p53M693L637J733m550n36J444k435j23l453j504
13408a4736L814K218J849o1M64m865r36m77R13J085M72j309R51L915l8l936k32
$$ y = [-8378, -9334, -8879, -10779, -11663, -9462, -6436, -7028, -12923, -14456, -12193, -12655, -10855, -12546, -10190, -7942, -13269, -16739, -11915, -9904, -3068, -4062, -8028, -10617, -11533, -17277, -19889, -17245, -15629, -15681, -14969, -13069, -10915, -7324, -11205, -16056, -13175, -11576, -10230, -10663, -6216, -6770, -14467, -20465, -21260, -19073, -22705, -27135, -22793, -19041, -17582, -14123, -16079, -15686, -11856, -8224, -9257, -17851, -14546, -10855, -10211, -6386, -2858, -4949, -6854, -8615, -11775, -11751, -10163, -7129, -4279, -320, 1190, 612, -1325, -1430, -2999, -1719, -3049, -7990, -7856, -9849, -10069, -9218, -6115, -5303, -8715, -14046, -16234, -16762, -18106, -14789, -7241, -6898, -9491, -7879, -5281, -10024, -12889, -13642, -8949, -5312, -3579, -8129, -8665, -7221, -9656, -9779, -13232, -14736, -10922, -8704, -6855, -6916, -6452, -11317, -12253, -12730, -11817, -10732, -10260, -11569, -10618, -6703, -6741, -10677, -10909]
13391a0909j522n3k704J387K669P53N03n02J569J592L649J050l998j440K517N122
13375c17K977j529o964l293o96m12p95N747M836O5j329J779l315k144k444L261
13359d573J733j020j542k157m839K040M468J415L012M28k614Q00R4N019J14l273
13343h95o285l977j5J573K342l974P49K768p47J695M256n48n403k483k008K1M227
13326h704j055k992O341N255L356K809M412l384l650n119l254J845J945k286k889
13311g370K934k047j714l310P1J837N961L6J590K942m791L82J314n340l664K407
13295h762J982K545k8o937J293J854J024j574J881J069K694M447M562O62k684
13280D028n400j640J587m402l136N86O943Q010K597k874r878j161M686L072j294
$$ y = [-10909, -12431, -12484, -15188, -13801, -11132, -10379, -9876, -10378, -8809, -7217, -3568, -2518, -6516, -7956, -5439, -317, 2660, 1131, -5833, -9126, -9822, -10234, -11029, -5282, -446, -381, -1710, 69, -3246, -5390, -7834, -4573, -2840, -3860, -5402, -7559, -12398, -10358, -5890, -4475, -1463, -1035, -3649, -2849, -2755, 2264, 2378, -895, -7180, -11157, -11172, -9599, -7257, -11231, -10482, -7714, -8461, -6766, -2510, -3058, -8461, -10944, -12952, -12931, -8704, -9759, -12751, -6410, -1155, 2201, 5010, 9422, 6038, 2388, -2731, -5985, -4140, -2195, -4481, -7370, -4436, -6483, -8197, -11507, -11436, -9599, -3638, -3602, -2012, 930, -3861, -3479, -2165, -7505, -11169, -8762, -6780, -4235, -4263, -11200, -9907, -8053, -7029, -8603, -6722, -5653, -2959, 1488, 6050, 6712, 4028, -1372, -3012, -1425, -5827, -8963, -8377, -1434, 6576, 9173, 6299, -3579, -4740, -54, 3018, 1724]
13265A724K06m476k401O766J280j897n824K61K767K009O38P48j012m25N239l409
13249B194p00j580l910J93L256k56m38L187J064M90M05m708o552m276K070l213
13233a2774K818M296O09MM684N579L101R743J1676J0766Q262M054j4p217j0982
13218C4605r696q705q710N939O685k385L21P044O72o51Q74K158N395J1999O673
13203E2218P652j571n964n910k638j1869j0335l795n794j237K853J605p58o69
13189A3788P436O8k724J243P15N64M955M268J1172K4104L7378L8253K9487j263
13175A69444k1652l1150k1361j9208j2322o471o229k340j118k406j440K109J4173
13162F0029J9250J9515K2927K9250K6873P279q346j6586k8046l0093k6396j2717
$$ y = [1724, 1930, -2546, -4947, 1819, 3099, 1202, -4622, -4361, -1594, 415, 1053, 1801, 789, 364, 5603, 2194, 1494, -86, -3996, -3803, -547, -803, -1241, 1946, 3010, 3500, 3905, -803, -7355, -11631, -9561, -12774, -9956, -5660, -5051, -5047, -363, 5216, 8317, 18060, 29736, 40502, 48764, 52818, 52804, 45587, 34605, 24909, 16204, 7494, 13433, 20118, 17733, 18054, 25098, 25770, 25119, 25993, 28151, 33546, 45545, 52218, 59870, 58299, 52335, 46425, 43787, 31918, 21583, 17788, 11994, 10757, 13610, 15215, 14457, 13788, 21224, 21292, 18568, 19811, 20526, 21090, 26045, 30313, 41485, 65589, 102967, 141220, 170707, 169444, 147792, 116642, 95281, 76073, 63751, 57280, 51051, 48711, 47593, 45187, 43747, 45856, 60029, 79279, 98794, 121721, 150971, 177844, 185123, 176777, 160191, 132145, 102052, 75656, 62939]
13150F2939n977k258m613m455r08m354k698L355L281J0N029O536N939R371J8450
13135H9647K5139L7694L6378L0783K2328J0657n6J8589M6853O4688P0116N8210
13123E11026J3671l5197p6833q0734o6734m2812j6816O86J6443K6427K1662R513
13111B80302q832k0670l0288l3546k4598j5742o943p445m937k809m831K475K491
13098A24627m877l181L54N037R985J3041K0834L3715M5854O2009R4197J30875
13086E32470J57175J47900J00760K7144o3540j34221j50144j29245j00151o4900
13076C23248l6053k1661j6217j1838N42L627o50j562k803q301j2802j8944j4191
13063A82395j2068p901p430m006q618K470k080l551L182J601L526P460J7373K6706
$$ y = [62939, 56962, 54704, 50091, 45636, 44728, 40374, 37676, 41031, 44312, 44322, 49351, 55887, 61826, 71197, 89647, 114786, 152480, 188858, 219641, 241969, 252626, 252570, 271159, 318012, 382700, 452816, 511026, 524697, 489500, 412667, 331933, 265199, 222387, 205571, 206257, 222700, 249127, 270789, 280302, 271470, 250800, 220512, 186966, 162368, 146626, 139683, 132238, 127301, 124492, 119661, 122136, 124627, 119750, 116569, 116923, 121960, 131945, 144986, 165820, 199535, 245389, 307398, 401595, 532470, 689645, 837545, 938305, 965449, 901909, 767688, 617544, 488299, 388148, 323248, 287195, 265534, 249317, 237479, 238021, 241648, 240998, 239436, 236633, 228332, 215530, 196586, 182395, 170327, 162426, 154996, 150990, 142372, 144842, 142762, 139211, 142393, 143994, 147520, 154980, 172353, 199059]
13049A99059L9356N6835P1799P1070N0256J9780k3053o6063q0749o7156n5916
13038B15218l1297j4862q659j3743j0686n215k662m280J451L327j296p411r850
13025A10035p247m785o661r753p775l253p001o045j233J564k257n077L224k433
13011E1303l568j737J964J89O991O341j095M131J791l479p488p247n929n591M08
12996C6984n5J375j811j505q05l200Q76k933m991L737K138r25J959N635K328L007
12980D1814M501J305k673r559m550l275j860o424r789k672L343K233n9M76J478
12965A4289K553K408j9l987j487q46J994j865J182m03P05R37l758j624M81L410
12949A3970K102q7l459m074l287j219K53L015k925l13l364Q67j078N11j27M168
$$ y = [199059, 238415, 295250, 367049, 438119, 488375, 508155, 485102, 419039, 338290, 271134, 215218, 183921, 169059, 160400, 146657, 135971, 130756, 128094, 123814, 125265, 128592, 127296, 119885, 110035, 102788, 98003, 91342, 81589, 73814, 70561, 63560, 57515, 56282, 57846, 55589, 50512, 53736, 51303, 47735, 45998, 47962, 48151, 55142, 61483, 60388, 64519, 66310, 62831, 55343, 48096, 42167, 36576, 36984, 36929, 38304, 36493, 34988, 34183, 30983, 31859, 28926, 23935, 27672, 29810, 28885, 30844, 36479, 38807, 41814, 46315, 47620, 44947, 35388, 30838, 27563, 25703, 19279, 9490, 6818, 10161, 12394, 12335, 12811, 14289, 16842, 19250, 19231, 15244, 13757, 12911, 14905, 13040, 14222, 13819, 14524, 15461, 11703, 10079, 10560, 13970, 16072, 15985, 12526, 8452, 5165, 3946, 4199, 7214, 4289, 3976, 612, 1479, 401, 912, 785, 4953]
12933D953q29K352P057j00J505j999r237q995r525m19M251N566Q042O618m972
12918D268n754l854L647L692K84K260l414N97K494j755K91J105K039O59M546j990
12902I115k702m652n316l983j133J144M097M19Q43l045n02L783M73j923m778K822
12886e338O01o465j365Q65M244r55M67N236R505J6397m03q233r066j1590j2328
12871a8428k021N088N801L555L941q36M999J973l122m863J15j696l340k895K44
12856a1485N426J427j163j207J129M500l88k541J209n586j040K963l33M966J40
12841a983J199k015k370k543J768l127o346L844m57j2343K0649L0970L5001K4102
12827H6349k7965k8262j6623l8356q637J6709R511L240k981m60K429n027n347
$$ y = [4953, 4124, 6476, 13533, 13433, 14938, 12939, 3702, -5293, -14818, -15237, -10986, -5420, 2622, 9240, 4268, -1486, -5340, -1693, 1999, 2283, 4543, 1129, 1726, 4220, 2465, 2756, 3861, 5900, 6559, 11105, 9115, 6413, 1761, -3555, -7538, -8671, -7527, -3430, -3011, -2168, -5213, -5715, -1932, -1459, -3382, -8160, -5338, -4737, -11202, -12567, -11702, -7458, -8413, -7946, -2710, 6795, 23192, 22789, 14556, 5490, -6100, -18428, -20449, -15361, -9560, -6005, -2064, -2900, 2099, 4072, 950, -3913, -3798, -5494, -8834, -11729, -11485, -6059, -4632, -5795, -7002, -5873, -1373, -1761, -4302, -3093, -8679, -9719, -6756, -7089, -2123, -1983, -784, -2799, -5169, -7712, -5944, -9071, -15417, -11573, -12030, -24373, -3724, 27246, 62247, 86349, 58384, 30122, 13499, -24857, -33494, -16785, -7274, -4034, -7015, -7475, -5046, -10073, -15420]
12814a5420n377J640M384j672N093J463l365K724L900O880J426m357n748N35K704
12799e190n863k437J761J358o74L145k293K643K566k011k949J62l906Q95L76l673
12783a6090O321R106J1154J1866l683q771q403j3985l046M203M573K084J144m706
12769h233k127J392J52J843K283m478k620N083K196k430j664n792l71Q024P938
12754A196j693m571k449o227r509K110L250J142K830L753N12L627k842j900m52
12739a1223l47J359L497J275o151p376l964k30L366K611M478N373L084O68l416
12724f996K219J021k876m315K266P16J05j514q97j53N174%M136K14k489j472k695
12707g556K000M509K185k545n883j164P45K807j678k540j105j712L163J208q924
$$ y = [-15420, -20797, -19157, -14773, -16445, -11352, -9889, -13254, -10530, -6630, 250, 1676, -2681, -8429, -7894, -5190, -11053, -13490, -11729, -10371, -11045, -7900, -10193, -7550, -4984, -6995, -9944, -9782, -13688, -12793, -12417, -16090, -9769, -663, 10491, 22357, 18674, 9903, 1500, -12485, -15531, -11328, -6755, -4671, -3527, -8233, -10360, -8968, -8816, -6973, -4690, -9168, -11788, -6705, -4509, -6939, -8603, -14395, -14766, -6742, 1196, -497, -5068, -7517, -13744, -23253, -21143, -17893, -16751, -13921, -10168, -9656, -6029, -8871, -10771, -11223, -11570, -10211, -6714, -5439, -11590, -18966, -22930, -23160, -19794, -17183, -12705, -7332, -4248, -3580, -6996, -4777, -3756, -6632, -10947, -8681, -7965, -7860, -9374, -10271, -10424, -5250, -5250, -1114, -900, -3389, -4861, -7556, -5556, -1047, 1138, -1407, -7290, -8454, -7709, -4902, -6580, -9120, -10225, -11937, -8774, -7566, -16490]
12692a6490N246R625J784M345J332j21j438l514l611n873J77n139l4Q10k683R4
12676a5490J0028J721n227l022J938Q05K069L590M7p8K634K267M172m092l871
12661b509J914k500M51K26l23l856j274j75j831k021J759N180J798j645K929p5
12645a952k97j28l79p269m189K482j700l241N369M445K68K070l116p807J8O659
12629h767K083J745J725o336n875l938J72k483q51J0571R024j452l987K001M206
12614b162J375p135m758r40M818J969K213L127K000j031n09O444N65k531m364
12599i19j986K5j659m621m141K67J882K326N577j678k205K464k154J60m71n221
12583a2354K157J281J126j539j219o84l526r49K593K787K742L733K852j236K756
$$ y = [-16490, -11244, -1619, 165, 4510, 5842, 5721, 4283, 769, -2842, -8715, -8538, -13677, -13711, -12901, -15584, -15490, -5462, -3741, -8968, -11990, -10052, -9247, -7178, -3588, -3541, -3619, -985, 1282, 5454, 1362, -2509, -595, -3095, -2644, -2418, -2741, -6597, -7871, -8046, -9877, -11898, -10139, -4959, -3161, -4806, -1877, -1952, -2249, -2377, -2756, -10025, -14214, -11732, -13432, -16673, -11304, -6859, -6591, -4521, -7637, -15444, -15426, -8767, -6684, -4939, -3214, -9550, -15425, -19363, -19191, -21674, -22525, -11954, -2930, -4382, -8369, -6368, -2162, -787, -7922, -12680, -13620, -8802, -6833, -4620, -1493, 507, -524, -1033, 5411, 5976, 3445, -919, -2905, -2880, -4539, -9160, -13301, -13034, -11152, -8826, -3249, -4927, -7132, -4668, -6822, -6662, -7133, -12354, -10197, -8916, -7790, -9329, -10548, -11232, -14758, -15707, -13114, -10327, -7585, -3852, -1000, -2236, 520]
12568E20O93J74j775Q40k857P56o38J357J124m982l556k571L212J889L11M718
12552g85k112k517m887l455J375N085K617R60n47p01L53R22j643P611L903j880
12536D299k813m068k094K295j32k169q45J584j846l749r47K497j203M963P524
12521C296J0754L114J1935M367n174j0676p381o828R07o22r52K4r59L903J778
12506G486n236l286q68m67k661K709j511k145j615j905m16p08n99J269m40J72
12490a0221M345L315l93K650j762n140m783O086M047O179M244m040n224q175l332
12475a2204l344j8L12K460M778R10M407J260R02J771K528Q17j762l86l982l758
12459e309L596L277p08l072m093k653j77j790O04o82p49K214o34j503N12j868
$$ y = [520, 1213, 1387, -388, 452, -2405, -1649, -2287, -930, 194, -4788, -8344, -10915, -7703, -5814, -5503, -785, -2897, -5414, -10301, -13756, -12381, -7296, -4679, -3719, -4266, -4967, -4614, -3692, -5335, 2276, 6179, 4299, 1486, -2582, -4676, -2381, -2513, -4682, -5527, -3943, -5789, -9538, -10485, -7988, -9191, -4228, 3296, 14050, 17164, 29099, 33466, 28292, 17616, 10235, 3407, 4314, 3692, 2740, 2764, 1805, 5708, 7486, 2250, -1036, -1904, -2371, -5032, -2323, -3834, -5979, -7594, -9499, -9915, -10623, -11222, -9953, -10393, -10221, -5876, -2561, -2954, -304, -2066, -7206, -11989, -5903, -1856, 4323, 8567, 4527, -697, -8872, -12204, -15548, -15566, -15254, -12794, -8016, -7106, -2699, -1439, -537, 1234, 3762, 4579, 2817, 2431, -1551, -5309, -1713, 1564, 856, -2216, -6309, -8962, -9139, -10929, -10325, -11007, -11756, -9542, -10176, -11679, -11167, -13035]
12443a3035oL489P016J004k839J350k454o667O71P161l178l074J263J571M122
12428c606k104j495J766k448m488M655N134J003n2l828l762K298R309M65l864
12413a017O74o24l984o98K193p43j877J726Q89k869o82m740N208l469k517L501
12397i029k71N72N086J694J370J0640J1217M316o126l014l853p890j01o919k315
12382d623j803j394O073M193k029m208n568N135M271j573n64l989k789l987K129
12367a0726O143M256j168k159K650K041l345o73J74m85k446m68n085r59k544j22
12351a4916K544M135O447Q969P738P467N359P014j965l801o788n556L89l420q497
12336E119J633k165m704k503j204J205K592k694j342n468l09K526j156N58L684
$$ y = [-13035, -13041, -9552, -2536, -1532, -4371, -3021, -5475, -12142, -11471, -4310, -7488, -10562, -9299, -7728, -3606, -5710, -7205, -5439, -7887, -12375, -7720, -2586, -1583, -1635, -5463, -9225, -6927, 2382, 2847, -1017, -343, -967, -4951, -5649, -3456, -4199, -6076, -4350, -3461, -6330, -7012, -11752, -6544, -10013, -12530, -9029, -9300, -8728, -3642, -1948, -578, 10062, 21279, 25595, 19469, 16455, 12602, 4712, 4611, -2308, -4623, -6426, -7820, -1747, 2446, 417, -3791, -9359, -4224, 47, -1526, -2090, -6079, -8868, -12855, -10726, -4583, -327, -1495, -3654, -1004, 1037, -2308, -2981, -2807, -3292, -5738, -6206, -11291, -12250, -14794, -14916, -12372, -8237, -1790, 7179, 14917, 22384, 27743, 34757, 32792, 28991, 22203, 16647, 17036, 13616, 5119, 6752, 4587, -117, -2620, -3824, -2619, -27, -2721, -4063, -9531, -9840, -7314, -8470, -7912, -4228]
12321d228N107N00L570M82j382M416m847n741m47l083l885K086J801j706K009
12306e348O617j617m568K243O873M784k993J217L865J925K157J836L284m343r931
12291F001p250K329J823j990M34J364J056o414j741N986j398m36J368M818j796
12276D154L445M455M604M892l372r510m901M946k824q58K89n348o056k687N676
12261c095L318k396N166J486k841l705m699m79R724O638l283m196l618P73j447
12246b654j607m089M217j871q92P17J588Q60L509N476J802R24n39k27J368N992
12230A4574M388J48K462M16o424n651j939L207N212M966J068l341L01K182K111
12215B3680K549R72o076l717n608m353n176m462o773k646J555M444L177K109M62
$$ y = [-4228, 879, 1379, 4949, 5431, 4049, 8465, 3618, -2123, -2570, -5653, -9538, -7452, -5651, -7357, -5348, 1269, -348, -4916, -2673, 4200, 8984, 5991, 7208, 11073, 12998, 15155, 16991, 20275, 15932, 6001, -1249, 1080, 2903, 913, 1347, 2711, 3767, -2647, -4388, 1598, 200, -236, 1132, 5950, 4154, 7599, 12054, 16658, 21550, 18178, 8668, 3767, 8713, 5889, 5031, 5320, -28, -6084, -8771, -3095, 223, -2173, 2993, 4479, 1638, -2067, -6766, -7245, 2479, 9117, 5834, 1638, -1980, -1207, -2654, -4261, -8350, -4133, -6004, -6896, -6179, -4591, -3731, -222, 5254, 7056, 7980, 7441, 7214, 8582, 14574, 18962, 19110, 21572, 21988, 15564, 9913, 7974, 11181, 16393, 21359, 22427, 19086, 19387, 21569, 23680, 26229, 27201, 21125, 17408, 11800, 7447, 2271, -2191, -8964, -11610, -10055, -5611, -2434, -325, 137]
12200A37J645o3J162K568M629K955L07j0188P50O90l077R85j497J193J259P275
12184A0730M926p01L644L672K732N206N468N790n50o823n130j43q51O211M126
12169C8307m38n808n349o091o707k827j719o202n864J118P088K326j74J734R08
12154A0302m129J932l351l177k386m075m678m289k452O283O813N366n45J376R63
12139C953N147M862K536O605R816Q174K410L595m29j3213r825oM598k55o675r03
12123B0390m312n387l5l775k938k045L331M233n293k589n0l027K534q11k177M654
12107B703K171J549j046l226L789J596J62L031K630k960r96K734J583l224k29
12092A0267O408O018Q995K500q53N123k169J398M573R548R718J4545K2478K7645
$$ y = [137, 1782, 1719, 2881, 5449, 10078, 13033, 13340, 3152, 3902, 4592, 1515, 2500, 1003, 2196, 3455, 10730, 15656, 14955, 18599, 22271, 25003, 30209, 35677, 41467, 40917, 34094, 28964, 28821, 27970, 34181, 38307, 37869, 32061, 26712, 20621, 13914, 11087, 9368, 3166, -2698, -1580, 5508, 7834, 7660, 9394, 10302, 6173, 8105, 4754, 1577, -809, -4884, -9562, -13851, -16303, -10020, -3207, 2159, 1614, 2990, 3953, 9100, 13962, 16498, 23103, 32919, 41093, 43503, 47098, 46669, 33456, 23631, 23625, 28223, 27968, 21293, 20390, 16078, 10691, 10656, 6881, 3943, 1898, 5229, 9462, 4169, 1580, 1530, -1497, 1037, 226, -1951, 2703, 4874, 6423, 5377, 2151, 5940, 7536, 7698, 10729, 13359, 10399, 9403, 12137, 13720, 10496, 10267, 16675, 22693, 31688, 34188, 33335, 38458, 36289, 37687, 42260, 51808, 61526, 76071, 98549, 126194]
12078A26194M5163P2448Q3346P4338L8091j6769o9890p4851n4615l2427l1479
12067A59549k6766j6411p045l114o931p317o482m581J727J154l303p841o637m80
12053F5522n106j617O09M589R725L028N940J1523P532O658N470J1720K1939L3365
12039A80897O3862R6782J45683J76457J73091J36673N0584q9939j91695j80992
12029E61403j39366r2212n2130m0790k5044k1713j7217j3570r236q159n985j1086
12017A24895p096L207k760r153m401o791n720l932j267L694m027l854K072K162
12003H7029k265P025J5713J7147J6765K0795L2201N5496Q5315J05146J03561P0160
11991F14088O379p2717j18886j10905p4805m7560k7655j8441j4765j1366j1589
$$ y = [126194, 171357, 243805, 327151, 401489, 439580, 422811, 352921, 278070, 223455, 191028, 159549, 132783, 116372, 109327, 106213, 99282, 91965, 85483, 80902, 82629, 83783, 80480, 72639, 66002, 65522, 60416, 58799, 59408, 63997, 73722, 76750, 82690, 94213, 101745, 108403, 113873, 125593, 147532, 180897, 244759, 341541, 487224, 663681, 836772, 973445, 1024029, 934090, 742395, 561403, 422037, 329825, 277695, 236905, 211861, 190148, 172931, 159361, 150125, 141966, 135981, 124895, 117799, 121006, 118246, 109093, 104692, 97901, 92181, 88249, 86982, 90676, 86649, 82795, 84867, 87029, 84764, 91789, 107502, 124649, 141414, 162209, 194410, 249906, 335221, 440367, 543928, 614088, 620467, 547750, 428864, 317959, 243154, 195594, 167939, 149498, 134733, 123367, 111778]
11980A11778q061n443l819n779p985n455l307j43N305j891r489l061j684q295
11966E2671n928M87L393K086o98j204l323L505L928K179K915P412L390K344k014
11951G1143r649n228l558p711m242l550k72L961l27m59O694N281j361q203p978
11936C4541m408j498J644k472N21l072n1l398m907J942O185O267j430j299n233
11921B3332j833k67M13L229K667o356l838L895p65k571O37J103l66J598l59j536
11905A8983o07r48o333J43M9j012L239K298N886O042J321j482l744p473m196K749
11889A4915L154j144K62J258j513m338k309L339K110j853j046o405l875K109M423
11874I087o02j480L810L739n93j735L452L894K834J453K236M088N584P056K0776
$$ y = [111778, 103717, 98274, 94455, 88676, 80691, 75236, 71929, 71786, 77091, 75200, 65711, 62650, 60966, 52671, 46743, 47230, 50623, 52709, 52011, 50807, 47484, 50989, 54917, 57096, 60011, 67423, 70813, 73157, 71143, 61494, 56266, 52708, 44997, 40755, 37205, 36933, 40894, 40567, 40108, 46802, 52083, 50722, 42519, 34541, 30133, 28635, 30279, 27807, 28328, 25256, 25205, 21807, 16900, 18842, 25027, 31294, 29864, 28565, 23332, 21499, 21232, 21645, 24874, 27541, 21185, 17347, 21242, 20477, 17906, 18543, 19646, 19280, 20878, 20519, 18983, 18376, 17428, 11095, 11238, 11287, 10275, 13514, 15812, 21698, 27740, 29061, 27579, 23835, 16362, 12166, 14915, 18069, 16925, 17187, 18445, 16932, 12594, 10285, 13624, 15734, 13881, 12835, 6430, 2555, 4664, 9087, 8485, 7005, 10815, 14554, 13961, 12226, 15678, 19572, 22406, 23859, 26095, 30183, 35767, 42823, 63599]
11859F3599M9213P5840R0646P9715O2896j7924j13818j06832o0779k9819j8467
11848G4270j0302j1178r204n668j958K220j377l823q318m022n42K107M015n440
11834B0780k279N33N10k698J272k830k294j925L235M314J400J136J51J061j326
11819B1040k502k353m226l982L947L094L517J253m114q287l149k355N16j328K737
11804C808j808J601K470j840k385o777R46N871K094Q65l762j422l962J584J869
11789h48K273j700j292n57L903M797K751j768K763J577k428k628l408m082n237
11774e884R9M651P755K421p204q829P76L167L155L438k171j960N415L759j212
11759G376l516k560J31m516j525M807O69n008k427m024o083J870R95R33M029L249
$$ y = [63599, 112812, 188652, 279298, 359013, 421909, 403985, 290167, 183335, 122556, 92737, 74270, 63968, 52790, 43586, 37918, 35960, 38180, 36803, 32980, 24662, 20640, 20098, 22205, 26220, 20780, 18501, 19034, 19544, 16846, 18118, 15288, 12994, 11069, 14304, 18618, 20018, 21154, 21305, 22366, 21040, 18538, 16185, 11959, 7977, 11924, 15018, 18535, 19788, 15674, 7387, 4238, 1883, 2399, 1071, 3808, 2000, 3601, 6071, 4231, 1846, -4931, -3985, 1886, 3980, 4845, 1083, -339, -4301, -2717, -848, 1425, -275, -1567, -2124, 1779, 6576, 9327, 7559, 10322, 11899, 9471, 6843, 3435, -647, -5884, -5785, -1134, 6621, 9042, 1838, -6991, -6215, -3048, 107, 3545, 1374, -586, 4829, 8588, 7376, 3860, 1300, 1431, -3085, -4610, 197, 866, -4142, -6569, -10593, -16676, -14806, -13811, -12878, -8849, -5600]
11743e600J458l375QN122L397k009J915J292k755o090J28N681J010J331M401l49
11727E565J85n010j217M59J590K795j817R92M714j029o02N68J812l12L30q48k264
11710E911R22j612l622N40r75J348K624k526J87j064j404J659O120r70j344l818
11694A976k89Q31M402j679k94J119M295j736O22P633M569o057m922n305P56P566
11678A3487P282L779q01K637L488o461n071J766R12J564j941M944N949J2034J4402
11663E7970J3399K8619N6813J09696J70530J74457J38878J11340r0994k65955
11653E04753j91379r5074n0059l3477k2349j3092m139k892m328k863n574l756
11641G5771l82r039r335j603L782L503J058N845J164q81p797q724o212m638j16
$$ y = [-5600, -4142, -7517, -7509, -2387, 1010, -999, 916, 2208, -547, -6637, -6509, -828, 182, 1513, 5914, 5565, 5750, 740, -477, -18, 1572, 4367, 2550, 3542, 8256, 7227, 6625, 7193, 9005, 8693, 9023, 8175, 5911, 6833, 5221, 1599, 2139, 1164, 2512, 5136, 2610, 2797, 1733, 329, 1988, 8108, 7138, 5794, 1976, 1687, 2518, 6920, 5241, 4947, 6066, 10361, 8625, 9247, 16880, 21449, 15392, 10470, 5165, 5921, 13487, 20769, 24548, 23747, 26384, 29872, 23411, 18340, 20106, 21018, 22582, 20641, 25585, 31534, 43568, 57970, 71369, 99988, 156801, 266497, 437027, 611484, 750362, 861702, 770708, 504753, 313374, 218300, 168241, 134764, 112415, 99323, 95184, 92292, 87964, 85101, 79527, 75771, 75389, 66350, 57015, 55412, 59194, 62697, 63755, 69600, 70764, 69883, 62086, 53362, 47150, 42512, 42396]
11626D2396n406m426L787O76R52K811j755j560p931o055L940L846r62l042o551
11611B0720n91L526P91O00K83Q24O74k885k213m822m327N3j527O649J538k824
11595A6469j577k184l654k857L982O339M744n98l655K61J085J563n172l118q423
11580C205q12L085K710J788j085L241k01j146m069k833K87L177O32J615O870M696
11564B1160j323J168m16n427n047m757l56P624p81M75L17K235kL599K527P64m098
11547A7662l147l37j030o535J816o120o53N820N405J610j480j441r45m503N00
11532F622L463L84j324k786n348j338J752j191J035N341j562p40K095K997k310
11517G090K064J343P35l233L30l294q946K5O77L189P104L166J249j175K365l425
$$ y = [42396, 36990, 32564, 36351, 37027, 37979, 40790, 39035, 37475, 29544, 23489, 27429, 31275, 30313, 27271, 20720, 20129, 23655, 24446, 25046, 25329, 26153, 26827, 23942, 21729, 16907, 12580, 12633, 11106, 17755, 19293, 16469, 14892, 12708, 9054, 6197, 10179, 16518, 21262, 20664, 17009, 17270, 18355, 19918, 14746, 11628, 3205, 2393, 5478, 8188, 9976, 8891, 12132, 11931, 10785, 6716, 3883, 4170, 7347, 7979, 9594, 16464, 21160, 19837, 21005, 20589, 15162, 10115, 5358, 5002, 12626, 11845, 12320, 12637, 14872, 14870, 18469, 20996, 21760, 17662, 14515, 14178, 13148, 6613, 8429, 2309, 1656, 7476, 12881, 14491, 13011, 11570, 10625, 6122, 6622, 10085, 10469, 9145, 6359, 1011, -327, 1425, 234, 1269, 6610, 5048, 4308, 6403, 9400, 7090, 9154, 10497, 11232, 7999, 8329, 5035, -3911, -3886, -3209, -20, 7084, 10250, 11499, 10324, 12689, 9264]
11501I264m792l775l68o01J89J196Q40K817L29k369k170m267L402K843Q21j215
11485B144L317q29l931k574k697K934q22K52N363P775K186m35m943o88J20K459
11469I631K239p05l487k192p39j198J869k405j377K988N03J114M886j441l810
11454E876M007K037l024L499j70k241l209k625j210O713M315p59j210J382o47
11439A2734k708J256k140o909K460j244n212j352L251K285J522P616L626L123
11425A8308jl27m932k540R758M501k914k646m260l405J0j591o40J234M0k954k539
11408E102J143L908P239k086K51P573k06n147R98K976l971l369J420L978N272
11393B5081J885j372o168k508J43K558p598m876j244k54o255P546K522L666j355
$$ y = [9264, 4472, 697, 329, -272, -83, 1113, 1953, 4770, 5099, 2730, 560, -3707, -305, 2538, 3359, 2144, 5461, 4632, 701, -1873, -4570, -1636, -2458, -2206, 3157, 10932, 13118, 12683, 7740, 7052, 7172, 9631, 11870, 11165, 7678, 5486, 4747, 3549, 5418, 3013, 1636, 4624, 5127, 6241, 11127, 9686, 5876, 9883, 11920, 8896, 12395, 12225, 9984, 6775, 4150, 2940, 9653, 13968, 13209, 11999, 13381, 12734, 10026, 11282, 9142, 2233, 4693, 3449, -1763, -3115, 136, 2421, 3943, 11559, 15185, 18308, 18307, 17980, 13048, 10508, 20266, 24767, 21853, 19207, 14947, 11542, 11552, 9961, 9321, 10555, 10595, 7641, 5102, 6245, 10153, 17392, 15306, 15557, 23130, 22924, 17777, 18775, 21751, 17780, 14411, 15831, 19809, 25081, 26966, 25594, 19426, 16918, 17061, 19619, 12021, 7145, 5901, 5647, -608, 6938, 9460, 13126, 11771]
11378A1771K225N143N721L158k20K138K550o55L389J403M73P485P153L199L774
11363E8707J1823Q848J1791Q258P81k895O33j633j1821q135q637q091p249m354
11349D8026J967l018o750m135m469p826p179n67M187J632k628K78n481q976l16
11334D745M846P89j574L879K165J967N178N507l2L0J472J589Q800Q842R952J7745
11318G5900J8527K3514K5577L1942L1734K9535K0949J1968p423j3709j3806k7863
11306B06845k8371k5460k1286k3693j7148j3279p375n989p695n942J041Nj259
11293E0394L734J817l514l742o25k005n186m423k490O789K289K954J750p13L426
11278E0455K212l565L520O422K146O970J6419J3361P929J7485K6656K8411L1078
$$ y = [11771, 13996, 19139, 24860, 28018, 27798, 29936, 32486, 31831, 35220, 36623, 37096, 44581, 51734, 54933, 58707, 70530, 79378, 91169, 99427, 100208, 97313, 97946, 96313, 84492, 76357, 67720, 59629, 52380, 48026, 49993, 46975, 40225, 36090, 31621, 23795, 16616, 16049, 20236, 21868, 19240, 19518, 14037, 5061, 4745, 9591, 10380, 8806, 12685, 14850, 16817, 21995, 27502, 27470, 27500, 28972, 30561, 39361, 48203, 58155, 75900, 94427, 117941, 143518, 175460, 207194, 236729, 257678, 269646, 262223, 248514, 234708, 206845, 178474, 153014, 131728, 108035, 90887, 77608, 70233, 64244, 56549, 50607, 51648, 51653, 50394, 54128, 55945, 52431, 48689, 48064, 46059, 40873, 36450, 33960, 40749, 43038, 45992, 47742, 47029, 50455, 52667, 49102, 52622, 59044, 61190, 68160, 84579, 97940, 105869, 123354, 150010, 178421, 209499]
11265B09499L3494K4804J3809l627j1634j4567k3593k9561l1368l0046k7034j0502
11253I9674r935k962k030k331q604L16K819n920m260R45j128o76k23k913m737
11238E8035o815L909N101O3n207l95O030R5Q31N404J2325Q021L967L346O663Q951
11222A10324O000O475O329P952N611M197N20o696j145L344k351j2251j1850p013
11208A09446j0005o825m801q34J75m047l393k723K139K714K543k101n418n153
11194G1717r133j4441j1436j3394j4565l841K792M913K621O11M905P53p236o346
11180G920J3478J7964K9095L6008J9569J1597O071k971k777o556j418k817m541
11167A20622j501j116M429l198N95p078m288k776m888J990L239J47l386j490j374
$$ y = [209499, 242993, 267797, 281606, 277979, 266345, 251778, 228185, 198624, 167256, 137210, 110176, 99674, 89739, 86777, 84747, 82416, 73812, 74128, 76947, 71027, 66767, 67712, 66584, 65908, 65685, 62772, 58035, 51220, 55129, 60230, 60293, 55086, 54691, 60721, 60816, 61647, 67051, 79376, 87397, 91364, 94710, 101373, 110324, 116324, 122799, 129128, 137080, 142691, 146888, 147408, 140712, 139567, 142911, 140560, 128309, 116459, 109446, 99441, 92616, 87815, 86981, 87156, 83109, 79716, 76993, 79132, 81846, 84389, 82288, 76870, 71717, 62584, 48143, 36707, 23313, 8748, 4907, 7699, 12612, 15233, 15844, 20749, 21502, 14266, 7920, 21398, 39362, 68457, 104465, 124034, 135631, 141702, 138731, 135954, 129398, 127980, 125163, 120622, 119121, 118005, 122434, 119236, 119831, 112753, 108465, 105689, 100801, 102791, 106030, 106177, 102791, 101301, 99927]
11152I9927n551p543j0218j0835j0185o73M593p20l0l248l185p50O152K103N09
11137F0346K163O14J948J2683J9974K1115K3298K4496J2249P428P007M847O309
11124B04477J0033J6334K9810M6010P6383J43167K62157L77603L43849K73963
11114A783786J39038l39689n38697l31327j67580r3412n5238m0486k8326k2288
11104C05781j7722j0230q616j1453j6077j7066p666p289n551l426m836J003J798
11091A98650N087J0985J0291R105L428R916O886L057l782j2152o239j0739j2565
11078B11928j3813k399L747M672O323K208M799L556j796m238k181k909p787o330
11064A95780o687l308m497l071n157K224M210j706L000M180Q857K547K624O99
$$ y = [99927, 94376, 86833, 76615, 65780, 55595, 54922, 59515, 58795, 58765, 55517, 52332, 51582, 57734, 59837, 60346, 62509, 63123, 65071, 77754, 97728, 118843, 142141, 166637, 178886, 186314, 193321, 198168, 204477, 214510, 230844, 260654, 306664, 383047, 526214, 788371, 1165974, 1509823, 1783786, 1922824, 1583135, 1044438, 713111, 545531, 452119, 396881, 356395, 328069, 305781, 288059, 277829, 269213, 257760, 241683, 224617, 216951, 209662, 204111, 200685, 195849, 196852, 198650, 203737, 214722, 225013, 234118, 237546, 247462, 254348, 257405, 253623, 241471, 235232, 224493, 211928, 198115, 195716, 199463, 204135, 210458, 212666, 217465, 221021, 219225, 214987, 212806, 209897, 202110, 195780, 189093, 185785, 181288, 178217, 173060, 175284, 179494, 177788, 180788, 184968, 193825, 196372, 198996, 199695]
11050A99695j503k2k92R082J7296J7178K2137L1492L4517L1553L1395J9519O779
11037D18826k788l794j5643k1400j8975k0613j3420j0491j1049l009n671r371
11025B82602m553l319p445l703m403j489o199n528K102N63n518n523j66j297J57
11010B36281P976K849k041R939O782R5p93P91K501R995J5978J7551J6951J8074
10996C42929L1986L9157M6175L4733K9118L4524K4820R110L683j004k8O863J0976
10983F13042K0088L7551M5318N4120Q8583J08942R9294R1451R2093J02068J28915
10972A481465J71065L03922N03632P47718J014111J285420J596459J809457J871798
10963A0785047J823600J543457R04448N8332n93139j024930j435145j707871j773372
$$ y = [199695, 198192, 198170, 197878, 206960, 224256, 241434, 263571, 295063, 329580, 361133, 392528, 412047, 418826, 416038, 412244, 396601, 375201, 356226, 335613, 322193, 311702, 300653, 297644, 291973, 282602, 278049, 274730, 267285, 263582, 259179, 257690, 251491, 245963, 248065, 248628, 243110, 237587, 237421, 236124, 236281, 244257, 247106, 245065, 255004, 261786, 261881, 261088, 261879, 264380, 274375, 290353, 307904, 324855, 342929, 374915, 414072, 460247, 494980, 524098, 558622, 583442, 592552, 596235, 595231, 595203, 602066, 613042, 633130, 670681, 715999, 770119, 858702, 967644, 1066938, 1158389, 1250482, 1352550, 1481465, 1652530, 1956452, 2460084, 3207802, 4221913, 5507333, 7103792, 8913249, 10785047, 12608647, 14152104, 15056552, 15114884, 14521745, 13496815, 12061670, 10353799, 8580427]
10954H580427j616567j324640r55006o27992m13505k77382j91428j38788j06692
10945B928427q7253p2976o8030o1568o9146p6680p2320l0088J262K8605O4390
10934B484623J00441J28983J55285J77229J85303J94239J98889K06768K60607
10925D092367L63265N40784Q33870J293065J960431K803029L724045M703153N568209
10916B5882218N899225N632331N041014L646960Q22457j647606l009639m090527
10908C8176433n196842n550469n220553m585279l323689k082098j333541r90121
10900I893841p38452n46741m21904l52703l16738k89205k76948k64893k63276
10891F422981k55792k26773j88177j41281p9668j6529M0557Q4840J24002J54335
$$ y = [8580427, 6963860, 5639220, 4684214, 4056222, 3642717, 3365335, 3173907, 3035119, 2928427, 2841174, 2768198, 2700168, 2638600, 2569454, 2492774, 2420454, 2390366, 2391628, 2420233, 2484623, 2585064, 2714047, 2869332, 3046561, 3231864, 3426103, 3624992, 3831760, 4092367, 4455632, 4996416, 5830286, 7123351, 9083782, 11886811, 15610856, 20314009, 25882218, 31781443, 37413774, 42454788, 46101748, 46924205, 45276599, 42266960, 38176433, 32979591, 27429122, 22208569, 17623290, 14299601, 12217503, 10883962, 9893841, 9155389, 8608648, 8186744, 7834041, 7517303, 7228098, 6951150, 6686257, 6422981, 6167189, 5940416, 5752239, 5610958, 5531290, 5514761, 5555318, 5640158, 5764160, 5918495]
10881E918495J84945K03350K24750K65360L56162N11302P65141J191802J845125
10872A1466432K689658L598262M545485N484527N988255N837737N273363M041927
10864D8925646J373025j363752l015769m195612n251159n794699n546735n028415
10856B0102530l848433k478300j582348j071794p61301n70828m40049l50651l12191
10847H686635k94923k69499k11404r8966M4809R6208k9949j28289j70390k90174
10837G334058l18374k58941j18650l1716K7966J04718J79267K25910K40328K49537
10827G634103K75261L49704N00221P13564R75497J292782J599295J782410J835567
10818A6958404J717275J233780M24203m19323j052760j501533j829447k018122
$$ y = [5918495, 6103440, 6306790, 6531540, 6796900, 7153062, 7664364, 8429505, 9621307, 11466432, 14156090, 17754352, 22299837, 27784364, 33772619, 39610356, 44883719, 48925646, 50298671, 48934919, 45919150, 41723538, 36472379, 30677680, 25130945, 20102530, 16254097, 13775797, 12193449, 11121655, 10360354, 9789526, 9349477, 8998826, 8686635, 8391712, 8122213, 7910809, 7811843, 7856652, 7952860, 7922911, 7794622, 7624232, 7334058, 7015684, 6756743, 6638093, 6606377, 6634343, 6739061, 6918328, 7144238, 7384566, 7634103, 7909364, 8259068, 8759289, 9472853, 10448350, 11741132, 13340427, 15122837, 16958404, 18675679, 19909459, 20333662, 19914339, 18861579, 17360046, 15530599, 13512477]
10810A3512477k011993j817710j440974j003420o74311m74675l60932k77928k17413
10801E233121j81418j68914j60364j40386j30481j15278j03130r3413q7349r7688
10791C954700r4443n9528k6542j1618J2347L8871P5404J45465J87281J98754J91041
10780D611732J60143J00982K5044n4264j35249k03715k53412k79403k64951k34720
10770C472187k14793j73897j24317r1323n1079j2404O440J1070K926m7099r2839
10759B684872j06521q0854n7986l9524k5992k7770n3571m8464j5274L0295M5456
10748B304667O3254P1982J09670J48998J58472K01375K82176L08827K46075K27097
10738D122593J38683l414J88977N71336Q06367P44560P15632N18723k7847k6847
$$ y = [13512477, 11500484, 9682774, 8241800, 7238380, 6564069, 6089394, 5728462, 5450534, 5233121, 5051703, 4882789, 4722425, 4582039, 4451558, 4336280, 4233150, 4139737, 4052388, 3954700, 3860257, 3800729, 3774187, 3762569, 3774916, 3813787, 3889191, 4034656, 4221937, 4420691, 4611732, 4771875, 4872857, 4897901, 4843637, 4708388, 4504673, 4251261, 3971858, 3706907, 3472187, 3257394, 3083497, 2959180, 2867857, 2816778, 2804374, 2810814, 2821884, 2824810, 2777711, 2684872, 2578351, 2497497, 2439511, 2399987, 2373995, 2346225, 2292654, 2244190, 2228916, 2259211, 2304667, 2367921, 2439903, 2549573, 2698571, 2857043, 3058418, 3340594, 3649421, 3895496, 4122593, 4261276, 4257862, 4446839, 5018175, 5824542, 6569102, 7284734, 7803457, 7775610, 7748763]
10728G748763L60680O97072R99640J514338K158990L002902M166035O031818R379143
10719C6059381J6072883L0075494N4201898O9280098N3587997M3621119J6562595
10712C19461465o8692789r0440157n3206650k7680144j6027920j0353684p178408
10705D5881713n208902l817874k967449k600455k236555j869400j596330j222184
10697B4362564r04858p69859o82346n61577r16890j267153j056610q54886p94164
10688A6554221p18435o29864n30069m38147l60507k97237k50232k69273l47828
10679A2712629l59560m47390n08818m53570l89388l33700l18063l05802k56074
10670I340264k29444k40965k51725k33609j95967j79002k00832k14056k03975
$$ y = [7748763, 8109443, 8806515, 9806155, 11320493, 13479483, 16482385, 20648420, 26680238, 36059381, 52132264, 82207758, 136409656, 205689754, 259277751, 302898870, 319461465, 250768676, 160328519, 107121869, 79441725, 63413805, 53060121, 45881713, 40672811, 36854937, 33887488, 31287033, 29050478, 27181078, 25584748, 24362564, 23457706, 22687847, 22005501, 21443924, 20527034, 19259881, 18203271, 17348385, 16554221, 15835786, 15205922, 14675853, 14237706, 13877199, 13579962, 13329730, 13060457, 12712629, 12353069, 11905679, 11396861, 10943291, 10553903, 10220203, 9902140, 9596338, 9340264, 9110820, 8869855, 8618130, 8384521, 8188554, 8009552, 7808720, 7594664, 7390689]
10661G390689j90869j92881j77678j73839j71273j56569j48319j44967j53761
10652E880533j56453j33415j05061j07285j09964r0617q3101q5704r0569j01286
10642D817078j02694j21232j32494j19853j04249j02230j06215r4641p8615o7962
10632C786893o3810o8455p0989q0719r3415p8195p7143q5273q7938q4390p8535
10621B918031p1123n9112m7189m7488n9873o5782n7506n4712m9734m8777m0103
10610B316632l1407l2863l4710k7244l6476m2900l5828k5599j9597j8397j8811
10599A992800j7224j6393n301M853J9157M5715R6499J97166L24509L16933J82342
10588C141056O4548j3853j53852k23278j76017j05215o8985o0524o5994o6029
$$ y = [7390689, 7199820, 7006939, 6829261, 6655422, 6484149, 6327580, 6179261, 6034294, 5880533, 5724080, 5590665, 5485604, 5378319, 5268355, 5177738, 5094637, 5008933, 4918364, 4817078, 4714384, 4593152, 4460658, 4340805, 4236556, 4134326, 4028111, 3933470, 3854855, 3786893, 3723083, 3654628, 3583639, 3502920, 3409505, 3331310, 3254167, 3168894, 3080956, 2996566, 2918031, 2846908, 2787796, 2740607, 2693119, 2633246, 2567464, 2509958, 2455246, 2405512, 2356735, 2316632, 2285225, 2252362, 2217652, 2190408, 2153932, 2111032, 2075204, 2049605, 2030008, 2011611, 1992800, 1975576, 1959183, 1953882, 1958735, 1977892, 2023607, 2120106, 2317272, 2641781, 2958714, 3141056, 3205604, 3191751, 3037899, 2814621, 2638604, 2533389, 2464404, 2403880, 2337886, 2271857]
10578B271857o9332q2353p4321o5645n9630m3722k9345l0311l7151l6562l9172
10567A704313m9255m0956j8058j0856j8288j8547k8010n0346n3264n6557l9261
10556A320915j8861k9214k5310j8702j7680j8279j6858k3355l8407m0242k7034
10545A046973k2158k5123k2320j7373j4511j6668j6231j6272k1670k2571j7572
10534H34504j4928j4320j3117k5630l7710m5629n9400p2132l8192o232K2387M9444
10522E79045J8629J2585R104R710R513K3019K5542J6253L643p913j2855q451L280
10509F81104K703j950P422k227k3250l2117k0871j6716k5371k3967k1467j5679
10497E07614m254q554j4104j4468j2793k032J641p192j3490o387n812j3181p036
$$ y = [2271857, 2202525, 2120172, 2045851, 1980206, 1920576, 1876854, 1847509, 1817198, 1780047, 1743485, 1704313, 1655058, 1614102, 1596044, 1585188, 1566900, 1548353, 1520343, 1469997, 1416733, 1360176, 1320915, 1302054, 1272840, 1247530, 1228828, 1211148, 1192869, 1176011, 1152656, 1114249, 1074007, 1046973, 1024815, 999692, 977372, 959999, 945488, 928820, 912589, 896317, 874647, 852076, 834504, 819576, 805256, 792139, 766509, 728799, 683170, 623770, 551638, 513446, 507214, 529601, 579045, 597674, 610259, 619363, 629073, 638586, 661605, 687147, 703400, 707043, 699130, 686275, 677824, 681104, 683807, 681857, 689279, 687052, 663802, 631685, 610814, 594098, 568727, 544760, 523293, 507614, 503360, 494806, 480702, 466234, 453441, 451409, 453050, 445858, 432368, 425981, 420169, 406988, 399952]
10484C99952l986O63Q547l086j4838j1956m315o38j008o861q382q257j1411j4412
10470C20012j4787o168Q120J8278K6030K6414K2122K2071J7259J9662J3453P748
10458D80214o86j0453k3697l3899l9133k2657j7023j7201J0807J2934J891o7L502
10445C44532n34j0462n406j747j738j617m695n055r322j0143p385n594r46k369
10431B77519l059j0805r452o250r66L418J759k822K957K573O551O658J6700J1186
10417B95967K784J0691J2646K055j51L459l724j3589j6119j7849j8520j4055k2618
10404B20977j8837r640m401j627j846k828M963M873j610N161K232j502n619j5413
10390A74883j5083j2301n306J041M348K245O196N798P817K597n757q316n613n044
$$ y = [399952, 395966, 396629, 405176, 402090, 387252, 375296, 370981, 370343, 369335, 362474, 354092, 345835, 334424, 320012, 305225, 299057, 307177, 325455, 351485, 377899, 400021, 422092, 439351, 459013, 472466, 480214, 479528, 469075, 445378, 411479, 372346, 349689, 332666, 315465, 326272, 339206, 341097, 341030, 344532, 343998, 333536, 328130, 326383, 324645, 323028, 318333, 313278, 303956, 293813, 286428, 280834, 279888, 277519, 274460, 263655, 254203, 247953, 246987, 250405, 252164, 249342, 252299, 254872, 261423, 268081, 284781, 295967, 298751, 309442, 322088, 324143, 323992, 327451, 323727, 310138, 294019, 276170, 257650, 243595, 220977, 202140, 192500, 188099, 186472, 184626, 181798, 186761, 191634, 190024, 195185, 197417, 195915, 190296, 174883, 159800, 147499, 142193, 143234, 147582, 149827, 156023, 161821, 169638, 172235, 166478, 158162, 152549, 147505]
10376A47505l749o420k532p84n013k234k60L805k272r505q015p872l604o926q040
10361H4084L91k064j754r213n405P283l65j919M626J1078K4439J4713J0402L352
10347A39648M378m5o265m252o326j616l88n43l528N084O965O901L495k592q988
10332A31928p211n565p054J14K873r69j884m121m670k039j045M714J1961R938
10318A26970Q858J8357J7274K7825M5788P8707J54537K91235L86446L25845K67585
10307A749427Q4717m10455n07336k91140j45431q5061n1253l6980l0462j7348
10297B58678q296p712r867j7240j4199q453q032m525o581m699n93O171L973J959
10283A80584K925K534q460r475q861j2191q008k592j187r014q119n769l648n949
$$ y = [147505, 143756, 137336, 134804, 134020, 129007, 126773, 126513, 130318, 128046, 118541, 110526, 102654, 99050, 92124, 84084, 84475, 82411, 80657, 71444, 66039, 73322, 72957, 71038, 75664, 86742, 111181, 125894, 136296, 139648, 144026, 143981, 137716, 133464, 127138, 125522, 125134, 124591, 121063, 126147, 133112, 140013, 143508, 140916, 131928, 124717, 119152, 112098, 112212, 115085, 114116, 112232, 108111, 103441, 101402, 100357, 105071, 117032, 126970, 135828, 154185, 171459, 199284, 245072, 323779, 478316, 769551, 1155997, 1481842, 1749427, 1834144, 1423689, 916353, 625213, 479782, 394721, 343468, 306488, 276026, 258678, 250382, 242670, 232803, 215563, 201364, 192911, 184879, 180354, 173773, 169074, 168481, 174652, 178625, 180584, 183509, 186043, 177583, 168108, 159247, 147056, 139048, 136456, 135269, 126255, 118136, 112367, 108719, 102770]
10269A02770q692r83J710J955M495K333n510j193j526L518O92k636M3L07L966
10254A01249J867M914L621Q446J4418K1547K7780m090j8301j024Q163J2803J2474
10241A93867k602j675l092k413j362k366Q110J1533K4858L3222N0479P5634J06720
10228D90913J68371K95635N87486J105604J393551J081537R59472R1283j789505
10219D384347j712583q78581m31510k46201j65188j19183q8034o1249m7294m2547
10209E91977l9412l1306j9913j8935k9495k8564k1880j6055p977p606p282p027
10197C56525j9881k4461j3115n520j0571j1252p546o677j1377j1821o301J076
10185B29079l167o647o143n030k441q065j0334k6j026m334r642k876j896l169
$$ y = [102770, 94078, 93095, 94805, 96760, 101255, 103588, 98078, 96885, 95359, 98877, 99569, 96933, 96976, 97283, 101249, 103116, 108030, 111651, 120097, 134515, 156062, 183842, 179752, 161451, 160427, 168590, 181393, 193867, 191265, 189590, 186498, 184085, 182723, 180357, 188467, 200000, 224858, 258080, 308559, 384193, 490913, 659284, 954919, 1542405, 2648009, 4041560, 5123097, 6082569, 6173852, 4384347, 2671764, 1793183, 1361673, 1115472, 950284, 831101, 743067, 681818, 634524, 591977, 552565, 521259, 501346, 482411, 452916, 424352, 402472, 386417, 378440, 370834, 363552, 356525, 336644, 312183, 299068, 293548, 282977, 271725, 264179, 257502, 246125, 234304, 228003, 229079, 225912, 219265, 213122, 208092, 205651, 197586, 187252, 187226, 186200, 181866, 172224, 169348, 167452, 164283]
10171A64283m767k459j48m391j2589n044O20l200L88k067q65l1j583l631k970
10156A21546k425m163j324l638m123l754k842K719k112N05J526R77l168k412j645
10141I5667o299j935j320o672n607J821r91o525l171M905P111L765k292k276p59
10126G5422K33J11j419n424K52k451k361k350M382j865m912l088l681K962j473
10111E4338L64j528m8N106M462M289j7n409K283K048J35q48O464Q387P697L138
10095I0861l522n838j4019p410K195kk810j378r19l065M749N465k869n850L431
10080E9019O151l685L422M700M501M106O259J4103J9770L7160M9486O6994P3733
10067C45719M4088K2380k753n2929o0808o4133n7123l7366j6271q965l848j3362
$$ y = [164283, 159516, 157057, 156909, 152518, 139929, 134885, 135505, 132305, 132693, 130626, 129761, 129730, 128147, 124516, 121546, 119121, 114958, 113634, 109996, 105873, 102119, 99277, 101996, 99884, 100389, 101915, 102892, 99724, 97312, 95667, 89368, 87433, 86113, 79441, 73834, 75655, 74664, 68139, 64968, 69873, 76984, 80749, 78457, 76181, 75422, 75655, 75766, 74347, 68923, 69175, 66724, 64363, 62013, 66395, 64530, 59618, 56530, 52849, 55811, 54338, 54702, 53174, 53126, 58232, 62694, 66983, 66966, 61557, 63840, 65888, 66023, 65175, 71639, 80026, 87723, 90861, 87339, 81501, 67482, 60072, 62267, 62265, 59455, 58077, 57158, 54093, 58842, 64307, 61438, 55588, 59019, 65170, 61485, 64907, 69607, 74108, 78214, 84473, 98576, 118346, 155506, 204992, 271986, 345719, 389807, 412187, 409434, 356505, 295697, 231564, 174441, 137075, 120804, 111839, 107991, 94629]
10055I4629n554j123j15r879m541J6l941l175n357K533j256k419k018k982m088
10040E0730n989r2M593J40J40J262L100O094j228o359k187l221N589R006k202
10025E9376K630K142p311r975K688L797j514o212l422P78p08k514N901N099j98
10010E0557K21N844R26j626K897L599O449Q457N642j280r535p106l333Q57l885
9995E8684r404j205j429L409O855R37R11Q512L334k155L991M742M029L893M474
9980H9578p113q465j0204p247K241J293L140L371j405l747n241k879N28m948J154
9965E0056K944O370n65n732o405l144K555K571J139L209R41K163j750m399l025
9950D6928Q79k267k67r01M84Q803K136m30K163J586l980l910n505p830O251N103
$$ y = [94629, 89075, 87952, 87837, 77958, 73417, 73433, 69492, 66317, 60960, 63493, 62237, 59818, 57800, 54818, 50730, 44741, 44649, 49242, 49382, 49522, 50784, 53884, 59978, 58750, 52391, 50204, 46983, 52572, 61578, 59376, 62006, 64148, 56837, 46862, 49550, 53347, 51833, 45621, 42199, 42977, 42269, 39755, 45656, 50755, 50557, 50778, 56622, 57548, 55922, 58819, 62418, 68867, 77324, 82966, 81686, 72151, 65045, 61712, 62569, 58684, 49280, 48075, 46646, 50055, 56910, 57847, 58758, 67270, 70604, 68449, 72440, 77182, 81211, 85104, 89578, 82465, 74000, 63796, 56549, 58790, 60083, 63223, 66594, 65189, 61442, 56201, 53322, 53850, 48902, 50056, 53000, 59370, 58805, 53073, 46668, 43524, 46079, 48650, 49789, 52998, 53939, 56102, 54352, 49953, 46928, 47807, 45540, 45273, 44372, 44856, 53659, 55795, 55365, 57528, 59114, 55134, 51224, 45719, 37889, 44140, 49243]
9934D9243n453n282L23O673K735m90r26J280M622K780K972k494l258L479N64j390
9918E5378k47M301J01j103J928k221l613K598L541n83k01l447j528N094N179N980
9902G1157Q928J0653J1759J4371J7170J9793J5442L988p268j19R698J3285J2915
9889B01772J9552K3930L7814N8115Q1245J07788J54608K38438M15844Q05209J529245
9878C673560K110417J799945J493541N51442k214550k812351j588881p81815m30561
9869A800747k74452j86666j28192r4749p5686o9517n6151m7908l1905j1785m808
9858H18928R67Q620l913P133L6345Q6720J59510L13114N55522P43557P47568N64058
9846D038129R3435o08919r45922p62426m43243k36355j43168r9008o8883n0150
$$ y = [49243, 43790, 38508, 38831, 45504, 48239, 47749, 46823, 48103, 52725, 55505, 58477, 55983, 52725, 56204, 56768, 55378, 55131, 59432, 59533, 58430, 60358, 58137, 54524, 57122, 60663, 60080, 59879, 56432, 54904, 59998, 65177, 71157, 80085, 90738, 102497, 116868, 134038, 153831, 169273, 173261, 165993, 165874, 175572, 188857, 201772, 221324, 245254, 283068, 341183, 422428, 530216, 684824, 923262, 1339106, 2144315, 3673560, 5783977, 7583922, 9077463, 9628905, 7414355, 4602004, 3013123, 2231308, 1800747, 1526295, 1339629, 1211437, 1116688, 1041002, 971485, 915334, 867426, 835521, 823736, 818928, 819895, 828515, 824602, 831735, 868080, 954800, 1114310, 1427424, 1982946, 2726503, 3474071, 4038129, 4131564, 3522645, 2576723, 1814297, 1371054, 1134699, 991531, 892523, 823640, 773490]
9836G73490m6939l7779l6059l3885l2804l6159k5868j9367j8865j0928r849q763
9824D56225p667o817j5010j6759j4527j6702j4990j4020j0322n529j3143r741
9812C10998k924K862M537M13j885o929j4250j3364j1951j1664j0170r010r116
9799B27547o846k186n847l953O21m558j719l655m298K095m102r62j74m947p200
9784A79816j3348o858l402l431P79j0614p795j404l058k72k226K60l946o852O37
9769A18286K312O61M862N730J2859P837M409n302r831o383J527j87J811O422K119
9754A47132L393L530O43J624L512k310o801q350q055l277o021q467j585K727L242
9739A20937M02n821p32p603m021K368L505M555M031N404R747M014Q289K2757K3378
$$ y = [773490, 726551, 688772, 652713, 618828, 586024, 549865, 523997, 504630, 485765, 474837, 464988, 456225, 448558, 441741, 426731, 409972, 395445, 378743, 363753, 349733, 339411, 333882, 320739, 310998, 308074, 310936, 315473, 315886, 314001, 307072, 292822, 279458, 267507, 255843, 245673, 236663, 227547, 220701, 218515, 212668, 208715, 209336, 204778, 203059, 199404, 195106, 197201, 193099, 192137, 191963, 187016, 179816, 166468, 159610, 156208, 152777, 153556, 142942, 135147, 133743, 130685, 130413, 128187, 128447, 124501, 117649, 118286, 120598, 121259, 126121, 131851, 144710, 152547, 156956, 151654, 141823, 135440, 136967, 136780, 138591, 145013, 147132, 150525, 154055, 154698, 156322, 159834, 157524, 150723, 142373, 134318, 131041, 125020, 116553, 114968, 117695, 120937, 121339, 115518, 114786, 107183, 103162, 105530, 109035, 113590, 117621, 123025, 132772, 136786, 145075, 167832, 191210]
9724A91210L0782K5750J1319m998o517j2456j8596j1822M01R014J4711J0191L219
9711B42208j2704k5728k7933k3598j7252p206p368j588Q1Q32L134L494J4556J5190
9697A56118J9848J3896L176j3317j4212j2195r997o700n529p218M680J5623J6544
9684A60717K6467L4304L5449K4733J7319N353j2332k9873k7813k1449q581J2509
9672B16803K1984K8592K7885J8723Q070l151k3878k4860k0588k0602k0385j3953
9660A94640j6224o499M920J2956K1989J3623J2240n751j1609j9609j8411j1116
9648A71149j0999o448J010J476K710R724Q570Q689N182M780m198o258q684p481
9634A69222j841P2M359J5660L6789N1351N4146M4914K3549k5180n7377m7468l0351
$$ y = [191210, 221992, 247742, 259061, 254063, 247546, 235090, 216494, 204672, 205073, 214087, 228798, 238989, 242208, 229504, 203776, 175843, 152245, 134993, 127787, 120419, 118831, 118912, 119744, 122878, 126372, 140928, 156118, 175966, 189862, 193038, 179721, 165509, 153314, 143317, 136617, 131088, 123870, 128550, 144173, 160717, 187184, 221488, 256937, 281670, 298989, 304342, 292010, 262137, 234324, 212875, 204294, 216803, 238787, 267379, 295264, 313987, 322057, 318906, 295028, 270168, 249580, 228978, 208593, 194640, 178416, 171917, 176837, 189793, 211782, 225405, 237645, 231894, 220285, 200676, 182265, 171149, 160150, 153702, 154712, 156188, 158898, 168622, 177192, 185881, 191063, 195843, 191645, 185387, 176703, 169222, 167381, 167453, 171812, 187472, 224261, 275612, 329758, 374672, 398221, 373041, 315664, 268196, 237845]
9621B37845k4179j5370q621j0700k313j255p387R59K007O277q22j0130o144L97
9607A60564L217m576q978l800l649j0666j794k91M31k417k239l234r264p168k603
9592A03533N399J5389J3151J3778J9829J6906R122n094j9062j8659j3743m646
9580A35903k340O902O518K130p474j3738j4852j1865l575l603n782q77l473P58
9566H4632K278k649m258p618l191K015l166m886l686m62k78J953P664L628q48
9551G1128o065l543l796J899K753J63K421N459L182N135k244n538o658j0058k825
9536E1413M06N527J705P3L47L427N104J1712J3324J1215J0123P447l145q88n140
9521A12650r23L818J1690J3778J4737O141l17q408j9799k3204j6444q076r640
$$ y = [237845, 213666, 198296, 189675, 178975, 176662, 175407, 168020, 168979, 170986, 177263, 176441, 166311, 160167, 160564, 163781, 159205, 150227, 146427, 142778, 132112, 130318, 130027, 130458, 128041, 125802, 122568, 113304, 106136, 103533, 108932, 124321, 137472, 151250, 171079, 187985, 197107, 192013, 172951, 154292, 140549, 135903, 133563, 140465, 146983, 149113, 141639, 127901, 113049, 101184, 97609, 94006, 88224, 87347, 83874, 84632, 86910, 84261, 80003, 72385, 69194, 71209, 68043, 63157, 59471, 59009, 58731, 60684, 68348, 71976, 71128, 65063, 61520, 57724, 59623, 62376, 62539, 64960, 70419, 73601, 78736, 76492, 70954, 64296, 54238, 51413, 51819, 57346, 59051, 59124, 59471, 62898, 68002, 79714, 93038, 104253, 114376, 121823, 118678, 117790, 112650, 111727, 115545, 127235, 141013, 155750, 161891, 161574, 153166, 133367, 110163, 93719, 85643, 76003]
9508G6003p638k554k156J7N876P450P946J0402J1900O778L030K888Q265J3225
9494A41432J5811J3959J0213J0819M277L857O316P618R900J1015J9418L5251M5164
9481C35050O7478P7455P7222Q3400Q5885R9161J78627L83004P09242Q66003O94326
9470C656853N70755q2227j109687j020367n51043k84239j76167j20696r8214q4697
9460G00271o5204m6723m0287k9091k4295j5440k406K802m234l296p81j2567k0774
9447D37975j9416j9589l999N499O629J3313P047J0009R561J5018J4377P405L129
9434D86958L998q805k9611m0916l5923j5906K858J3005J1527J1563K765o461j9839
9421C75213l1504k0687j7363j8819j8927j4091j1800m087L301O813L577R46p926
$$ y = [76003, 68365, 65811, 63655, 63672, 69548, 76998, 84944, 95346, 107246, 114024, 117054, 119942, 128207, 141432, 157243, 171202, 181415, 192234, 196511, 200368, 206684, 214302, 224202, 235217, 254635, 289886, 335050, 402528, 479983, 557205, 640605, 726490, 825651, 1004278, 1387282, 2096524, 2962527, 3656853, 4227608, 4145381, 3035694, 2015327, 1464284, 1180045, 1003878, 883182, 784968, 700271, 635067, 588344, 548057, 518966, 494671, 479231, 476825, 479627, 475393, 472097, 471316, 458749, 437975, 418559, 398970, 394971, 400470, 407099, 420412, 427459, 437468, 447029, 462047, 476424, 483829, 486958, 490956, 482151, 452540, 411624, 375701, 359795, 362653, 375658, 387185, 398748, 401513, 395052, 375213, 343709, 323022, 305659, 286840, 267913, 253822, 242022, 237935, 241236, 248049, 251626, 252572, 244646]
9408B44646q845j1367q973m589m313n548o562r866k17P230J7319J7384J9910K6390
9394B72599K0924L123m706j3348j6393o040r06N738P725J917K401k529p173j3709
9380B49623j3474j9372l1145k1787j1343j0190j1085q105n098j566l159m023k965
9367A06311j0269j0299j298O519l54k910j615m40O21J687K156Q368Q397O113P426
9352A20413K708M895P104M447m402j510n44L66j708l54L378k85o126j2522j6630
9337I9230p911p798n507j899m832k750K494J455k710j735r09j063K194J602j107
9322F8754n368j3262N56O939J660m521k073k633m975J091J428k789N54J520l729
9307D3152j0K417M94N46J205j79K182j094k311k292J317r33J803k604n577k287
$$ y = [244646, 235801, 224434, 215461, 210872, 206559, 201011, 194449, 184583, 184366, 191596, 208915, 226299, 246209, 272599, 293523, 296646, 291940, 278592, 262199, 256159, 255253, 260991, 268716, 270633, 273034, 270505, 263332, 249623, 236149, 216777, 185632, 163845, 152502, 142312, 131227, 123122, 118024, 116458, 113299, 109276, 106311, 96042, 85743, 84445, 90964, 90610, 87700, 86085, 85645, 86266, 87953, 90109, 98477, 106874, 112987, 120413, 123121, 128016, 135120, 139567, 135165, 133655, 133111, 133477, 131769, 131415, 134793, 134508, 128382, 115860, 99230, 91319, 83521, 78014, 76115, 71283, 68533, 71027, 72482, 69772, 68037, 67128, 66065, 68259, 69861, 68754, 63386, 50124, 50680, 57619, 59279, 54758, 52685, 50052, 45077, 46168, 47596, 44807, 45361, 46881, 43152, 43142, 45559, 46053, 46599, 47804, 47625, 49807, 48713, 46402, 44110, 45427, 44494, 46297, 43693, 38116, 35829]
9291C5829M034J371n664j742j891k902m204p42M09m807J309P612P374K462k654
9276C5794k889N860J473j463j542J762j469k685l042Q57q71n049P45K855k420
9261B7916J912J358q98l417j682k79J967R346L967J202n661o512J497q00l989
9246B5927j967n56J166k90j95N949K627l775n03k123l814j323J220J246k380J650
9230B2859K423R0L318L719O031K23j377k561l791l306j350p406n622p4rM820P927
9213B5914K294k363n723n096j503L578K437J605L363l54k169l112J245p45m154
9198A5217j334K049j843j588K539j662K280k268N179K279L924K395l67q182l056
9183A5562J721k967P76Q966J600p103o9K772N052J813Q62J147k130R963J247l974
$$ y = [35829, 39863, 41234, 35570, 33828, 31937, 29035, 24831, 24089, 24498, 19691, 21000, 28612, 35986, 38448, 35794, 32905, 38765, 40238, 38775, 37233, 38995, 37526, 34841, 31799, 32656, 31785, 26736, 27481, 30336, 27916, 29828, 31186, 30288, 26871, 25189, 24910, 26877, 36223, 40190, 41392, 35731, 29219, 30716, 29916, 25927, 23960, 23404, 24570, 24280, 24085, 30034, 32661, 28886, 28383, 26260, 22446, 21123, 22343, 23589, 21209, 22859, 25282, 25372, 28690, 32409, 38440, 38663, 37286, 34725, 30934, 27628, 26278, 18872, 13250, 13176, 13167, 17987, 25914, 28208, 25845, 20122, 15026, 13523, 17101, 19538, 21143, 24506, 24152, 21983, 18871, 20116, 19371, 15217, 13883, 15932, 14089, 12501, 15040, 13378, 15658, 13390, 18569, 20848, 24772, 27167, 26800, 18618, 15562, 17283, 14316, 15092, 24058, 25658, 18555, 18486, 21258, 26310, 28123, 28985, 30132, 28002, 37965, 39212, 35238]
9167C5238m004M036K479o795l263K590Q61J248J049K999n619m035P75L940R29
9152C2428j081k416j213l410k516J957Q09K569l011k678L724J296Q44J224n477
9137B3049M10K422J423M899L931N429j250O343N123j807p06o132m417l715j006
9122C3996k279l825O45L607m927p947m379j032N140M617J1686M642N1j522j537
9107C6936l561J250K051L276r87l416M017K394l318q32K703m744l509L403M955
9092D0618n128N66L184Q46j007m838j835J905j885M84Q68K075J956R89j907l023
9076C3868k932L385k601p45M377Q175J281n383l810K668N208J6380K1230K1739
9062A02840J8160J3011J6019K1065K4040K9101L4228M0963N5391P4752J16385
$$ y = [35238, 31234, 35270, 37749, 30954, 27691, 30281, 31142, 32390, 33439, 36438, 30819, 26784, 27559, 31499, 32428, 31347, 28931, 27718, 24308, 21792, 23749, 24558, 27127, 24116, 21438, 25162, 26458, 27302, 28526, 23049, 23459, 25881, 27304, 32203, 36134, 41563, 40313, 46656, 51779, 49972, 49266, 43134, 38717, 35002, 33996, 31717, 27892, 28537, 32144, 27217, 19270, 14891, 13859, 18999, 23616, 35302, 39944, 39995, 38473, 36936, 33375, 34625, 36676, 39952, 38965, 35549, 39566, 41960, 38642, 37810, 40513, 35769, 32260, 35663, 40618, 35490, 36056, 39240, 40086, 39079, 34241, 32406, 34311, 32426, 32910, 33778, 35853, 37809, 38798, 36891, 33868, 30936, 34321, 31720, 30975, 35352, 43527, 44808, 39425, 35615, 38283, 43491, 59871, 81101, 102840, 121000, 134011, 150030, 171095, 195135, 224236, 258464, 299427, 354818, 429570, 545955]
9051E45955J67198K45886L42481M48552O01123P47514O63755M16984J38600m36502
9041C881546r15030q03828m81268k48352j31786q1107o7817j04803j31963j08124
9031H07468p0224n5135m3886m1036m3948m2032l1631k2051j2081j0334j2064m641
9019D18405J247K669J0351K3241K5610L4224L8986M2799O4867R9879J42366K00960
9007A105604K86830L92705N77077P48523O99103N58943L09710l31708p58403o59821
8997B928563n50659m96174l85827k60610j72138j12367p4043n2677l8767l6153
8987G49148l9679l9815l6984m0491m0120k8910k3093j7047k0995j6178j1869j7024
8975D16943j9053j2459p902r727q252q920j0220m348j530l553j721K277O402J4320
$$ y = [545955, 713153, 959039, 1301520, 1750072, 2351195, 3098709, 3762464, 4179448, 4318048, 3881546, 2966516, 2162688, 1681420, 1433068, 1301282, 1220175, 1152358, 1047555, 915592, 807468, 737244, 682109, 638223, 597187, 553239, 511207, 479576, 457525, 445444, 435110, 423046, 418405, 419652, 422321, 432672, 455913, 481523, 515747, 554733, 597532, 662399, 762278, 904644, 1105604, 1392434, 1785139, 2362216, 3110739, 3809842, 4368785, 4678495, 4346787, 3588384, 2928563, 2377904, 1881730, 1495903, 1235293, 1063155, 950788, 876745, 824068, 785301, 749148, 709469, 669654, 632670, 592179, 552059, 523149, 500056, 483009, 462014, 445836, 433967, 416943, 397890, 385431, 377529, 367802, 359550, 350630, 340410, 336062, 334532, 330979, 329258, 331535, 337937, 352257]
8961C52257J6278J5225K1662J7227L016j958j2607J0195M2867N4772N3265K8812
8949F01011j3886o8837r4815p7477m6394k5157j7799j5800j1879n650r305r951
8937B04061l017n951q603l01l69p90o824k951j377k743o245p999l703j122l870
8922A48196k243J212j857K203L409o24l970p023J018M362M105j26q914k24l113
8907A36411m667j667J518J5188J4091N140o94n768p554o531n576j0489o818M275
8893A26859J715n133j2938j1525o783l434P25P06N21M672o330k127n172p96J517
8878H2477m841J524j819j596j040l741L534m030m087o80m00n934J165J2575J1802
8863H4909L78R512J1047O475P72M312J7426K8362L0832K1271K1202J8844J8810
$$ y = [352257, 368535, 383760, 405422, 422649, 425665, 423707, 411100, 421295, 464162, 518934, 572199, 601011, 587125, 518288, 423473, 345996, 299602, 274445, 256646, 240846, 228967, 223317, 214012, 204061, 201044, 195093, 186490, 186189, 185820, 185030, 178206, 175255, 173878, 171135, 164890, 156891, 153188, 152066, 148196, 145953, 147165, 145308, 147511, 150920, 150296, 146326, 139303, 140321, 144683, 148788, 148662, 139748, 139524, 136411, 131744, 130077, 131595, 146783, 160874, 166014, 165320, 159552, 151998, 145467, 139891, 129402, 122584, 126859, 128574, 123441, 110503, 98978, 92195, 88761, 89486, 90192, 90713, 95385, 89055, 86928, 81756, 80960, 82477, 77636, 79160, 77341, 75745, 74705, 70964, 74498, 70468, 66381, 65701, 65301, 59367, 60532, 73107, 84909, 85287, 94799, 105846, 112321, 113093, 117405, 134831, 163193, 194025, 215296, 236498, 255342, 274152]
8850B74152J8842J7374J4563J2079j1001m9442o0312m4702k3390j1886o551L333
8838A33059J6340J4179r979k0308j5966j5266j0199q682n828j369M74o546q21
8825F9088O07L322K460J546O064Q997J215o105J437Q3K92P028J4708L0183L8449
8810A79374N3465O2841N4384K5819k3575m3789l4455l4189l9574l3973k1600j3019
8798A31709n339R940J2942Q504J815k804K584J0318K0861K7616l760k4633k8792
8785A60961k1282j3700n61N619J6069K0827L9736O7973Q8681P2556M5140J9987
8773E02006j3568m4649n5269m3779l0354j7319j1076r106J167j279M472M515l768
8760B81993k553j334j905K086L870j1373k0799j6406m679j754L390O638R517O846
$$ y = [274152, 292994, 310368, 324931, 337010, 326009, 276567, 216255, 171553, 148163, 136277, 129726, 133059, 149399, 163578, 153599, 133291, 117325, 102059, 91860, 83178, 77350, 75981, 76455, 69909, 69088, 69695, 73017, 75477, 77023, 83087, 92084, 93299, 87194, 88631, 88714, 89006, 96034, 110742, 140925, 179374, 232839, 295680, 350064, 375883, 352308, 308519, 274064, 239875, 200301, 166328, 144728, 131709, 126370, 136310, 149252, 157756, 159571, 156767, 159351, 169669, 190530, 218146, 214386, 189753, 160961, 139679, 125979, 125418, 131037, 147106, 167933, 207669, 275642, 364323, 436879, 482019, 502006, 488438, 443789, 388520, 344741, 314387, 297068, 285992, 276886, 278053, 276774, 281246, 285761, 281993, 279440, 278106, 276201, 278287, 282157, 270784, 249985, 233579, 228900, 227146, 230536, 237174, 246691, 253537]
8746B53537M40M09L072q34O283J6401O71j3609j6724o782m025O973P913J4089
8732B67814L3491O8227J25108J76891J63996R3877L9177k3251q0245j04802q9653
8721F70630o4294m8028l9035j8111p85Q576N503k083p728k027M86r607q012J695
8707D87180K069n902j2209j2458m626L387R825J911Q49L799J0117J3461M769o81
8693E01491k206k900k508j054M29l293r573m914K634K4739M5947P4466J07892
8680G31150J16573Q7142M9299K5536m094k5777k9530k2351l537K4411O9136J20910
8668A138868J65859J96581K25248K53747K78779K83447K45648K20581K68047L78216
8658C655021N82676Q70294J284267J971445L252501N797276J0082943J4523921
$$ y = [253537, 253977, 254386, 257458, 256624, 262907, 279308, 279979, 266370, 249646, 242864, 238839, 245812, 253725, 267814, 301305, 369532, 494640, 671531, 835527, 929404, 968581, 945330, 865085, 760283, 670630, 606336, 558308, 519273, 501162, 500377, 508953, 514456, 512373, 504645, 502618, 503104, 493497, 485485, 487180, 489249, 483347, 471138, 458680, 454054, 457441, 467266, 469177, 470026, 473825, 483942, 497403, 502172, 501491, 499285, 496385, 493877, 492823, 493252, 489959, 480386, 475472, 478106, 502845, 548792, 623258, 731150, 847723, 934865, 984164, 1009700, 1005606, 979829, 950299, 927948, 924411, 948822, 1017958, 1138868, 1304727, 1501308, 1726556, 1980303, 2259082, 2542529, 2788177, 3008758, 3276805, 3655021, 4237697, 5107991, 6392258, 8363703, 11616204, 17413480, 27496423, 42020344]
8650D2020344J5623437J3058781O953941n694447j7348267j7432026j1070914
8643B6110849o164650l647224k380899j694835j264403r28926o76209n06758l84204
8634H462741l07664k65378k92867l71313l70506l02014k36529j98676j72556j60924
8624E784314j42257q7100Q829J22487K17805L25292M79390O45046Q19014Q84857
8614I057677P14713M76813J79397N8868M38674J127282J948918L105532N160683
8605B2268557R441618J8050637K8915131L1256539K6540689J9679179q228894
8598A47923456l6253697l5907061k2555868j2558896p527241m963955l489649
8591B4667089k505656j810297j356596j013907p60360o27956n31374o41992q95466
$$ y = [42020344, 57643781, 70702562, 77656503, 71962056, 54613789, 37181763, 26110849, 19946199, 16298975, 13918076, 12223241, 10958838, 10029912, 9353703, 8846945, 8462741, 8155077, 7889699, 7596832, 7225519, 6855013, 6552999, 6316470, 6117794, 5945238, 5784314, 5642057, 5554957, 5563786, 5686273, 5904078, 6229370, 6708760, 7353806, 8172820, 9057677, 9772390, 10249203, 10428600, 10487468, 10926142, 12053424, 14002342, 17107874, 22268557, 31710175, 49760812, 78675943, 109932482, 136473171, 156152350, 147923456, 111669759, 75762698, 53206830, 40647934, 33120693, 28156738, 24667089, 22161433, 20351136, 18994540, 17980633, 17220273, 16592317, 16060943, 15418951, 14523485]
8582A4523485q95085o71457n10076m87589m82408m76564m23017l35306k36083
8573A0005900j24651j4825Q0460K07827M62463P85351Q88779P95451N40371l02064
8563A3325062r32477p07666r5613N14459J175105K184588M048296P488083J2141803
8554C9141640J4896856J3644945R712041J49532j3493682j8364309j3380144p624305
8546B4682574m376857k792383j947885j411821j017185p63494n99594m76355l94706
8537A0902294l54787l50410m11859m20473l38919k35571j87797k99396m01706
8528G901376l57250k49054j42847p0113m6321n4582o8655j5723J05115J99830
8518G201776J98516J01653j72485n21505o21644m83280l38287k61487j93184j28196
$$ y = [14523485, 13628400, 12956943, 12446867, 11959278, 11476870, 11000306, 10577289, 10241983, 10005900, 9881249, 9866424, 9946884, 10154711, 10617174, 11402525, 12291304, 13086755, 13627126, 13325062, 12392585, 11684919, 11589306, 12103765, 13278870, 15463458, 19511754, 26999837, 39141640, 54038496, 67683441, 77395482, 77545014, 64051332, 45687023, 32306879, 24682574, 20305717, 17513334, 15565449, 14153628, 13136443, 12372949, 11773355, 11297000, 10902294, 10547507, 10197097, 9785238, 9364765, 9025846, 8790275, 8602478, 8303082, 7901376, 7544126, 7295072, 7152225, 7082112, 7035791, 6981209, 6912554, 6896831, 7001946, 7201776, 7400292, 7501945, 7329460, 6807955, 6186311, 5703031, 5364744, 5103257, 4910073, 4781877]
8508D781877q0387j3909Q2486J68954J73867J11976n1233l13828m33328l48670
8498D077805k30819j70306j43285j22666j02883q8152q4183p3288o1217m4574
8488B956432k7381j4513K12J4284J6241L267l8062q3655p7659j2804O9009J11063
8476B916434R3851K4539l0719p7487j17580j23212r0680o4450o5362p3254p6761
8465B315319p3316o3679o4472n1662k8048j1129q833p873l5198q1114q7177p5565
8453A727253n6211l4048k2156k8385k9004l4404m5819n1712m5714l9968k8904
8442A310928j5483j7126j7933j5323j1276m786K102L856J7293L5302L6882M4568
8430A369004L9554K4365J846N47j2746l3482m8341n9863m9967m0341k6598k1180
$$ y = [4781877, 4701490, 4687581, 4770067, 4939021, 5112888, 5224864, 5173631, 4859803, 4426475, 4077805, 3846986, 3676680, 3533395, 3410729, 3307846, 3219694, 3135511, 3062223, 3001006, 2956432, 2929051, 2914538, 2914750, 2929034, 2945275, 2948542, 2910480, 2826825, 2749166, 2736362, 2805371, 2916434, 3010285, 3034824, 3004105, 2926618, 2809038, 2685826, 2595146, 2530696, 2465334, 2392080, 2315319, 2242003, 2178324, 2113852, 2062190, 2034142, 2023013, 2014180, 2006307, 1971109, 1889995, 1802818, 1727253, 1671042, 1636994, 1614838, 1586453, 1557449, 1523045, 1477226, 1425514, 1379800, 1339832, 1310928, 1295445, 1278319, 1260386, 1245063, 1233787, 1229001, 1231103, 1234959, 1252252, 1287554, 1324436, 1369004, 1408558, 1432923, 1434769, 1435316, 1422570, 1389088, 1340747, 1280884, 1230917, 1190576, 1163978, 1142798]
8418A142798j9306j4518j7789k8144m1532m7860m8974l8989j2516p648j1147j8915
8406H35460j7334j3529p164q8p632q517j5342l3978k9951j7329j994J5094L3271
8393G30967L6678K6062k772l5933m8178l3181l0260k4891j2920m364q830j4586
8381E77792j5223j3822p678p563k195n481n992j0028j3046q951m435q147k730
8368D72501j3264j7065k8007k8000j3664q000K175P186P672q79r351j0199j2298
8355C48807n510j401L300n562r598j2949j8017j5062m782l878j303L779K441o06
8341B79659Q97M436O7r43J995O629l494n552P05j888n132n756k431O89J282P09
8325B71872J271r08k017r943j0476q695n014r630j2454o874n317k616k832l88
$$ y = [1142798, 1123492, 1108974, 1091185, 1063041, 1021509, 973649, 924675, 885686, 873170, 865522, 854375, 835460, 818126, 804597, 797433, 797345, 789713, 781196, 765854, 731876, 701925, 684596, 682602, 697696, 730967, 767645, 793707, 790935, 755002, 706824, 673643, 643383, 618492, 605572, 601208, 592378, 577792, 562569, 548747, 541069, 533506, 531311, 525830, 519838, 509810, 496764, 487813, 483378, 475231, 472501, 459237, 442172, 414165, 386165, 372501, 364501, 366676, 373862, 381534, 380655, 371304, 361105, 348807, 343297, 341896, 345196, 339634, 330036, 317087, 299070, 284008, 279226, 275348, 274045, 277824, 280265, 279659, 280556, 284992, 285059, 284116, 286111, 292740, 289246, 283694, 284399, 282511, 277379, 271623, 269192, 269881, 271163, 271872, 273143, 272235, 270218, 260275, 249799, 241104, 236090, 226460, 214006, 207132, 201815, 199199, 196367, 195979]
8311A95979l87n69N20n864n041q97k70k512k031j13r27q050n563N87L060k195
8295A65727j632m574l100K524Q45l49N014L217K198m11l416m081m681j519q126
8280A47636q636P22l967J055K661k895n130o420l039l587j084m956j889j490K788
8265A11769N471n601m366P201K884M93m33Qj68O919N903j194l346K365J3566J4929
8249A56400L3102N2946P6136Q0757O4424L4680l8833j01964r1570n9766l5775
8238A70537j7933j5808r518o140K972j884l676K430J826m381n285l196o099r086
8224I4759p273l885N170L735O52r61P47j036p0J344N76Q71L515L236L263M945
8208A09588R45l956L001K451Q849K4282K9379N3083R9398J58239J69622J45386
$$ y = [195979, 195592, 195023, 195543, 189679, 184638, 183741, 183471, 180959, 178928, 178815, 177888, 169838, 164275, 164862, 167922, 165727, 164095, 159521, 156421, 158945, 159790, 159441, 164455, 167672, 169870, 169459, 166043, 161962, 157281, 155762, 147636, 139000, 139722, 135755, 136810, 139471, 136576, 131446, 125026, 121987, 118400, 117316, 112360, 110471, 108981, 111769, 117240, 111639, 107273, 114474, 117358, 117851, 117418, 117426, 117258, 124177, 130080, 128886, 125540, 127905, 141471, 156400, 189502, 242448, 318584, 399341, 463765, 498445, 459612, 357648, 266078, 206312, 170537, 152604, 136796, 127278, 121138, 124110, 122226, 118550, 120980, 122806, 118425, 113140, 109944, 103845, 94759, 87486, 83601, 88771, 92506, 93158, 92197, 92944, 91908, 91838, 93182, 93758, 94629, 98144, 101380, 104643, 109588, 110533, 106577, 109578, 112029, 120878, 145160, 174539, 227622, 327020, 485259, 654881, 800267]
8196H00267R4641p2871k10176j83288j08131o4952m2667k4742j7579j0854j0414
8185A49234k164J231l60L225K70j0182j1128o840j520l759M012j121o118m826
8171A09954n735J231J390n681l782M816O326K080O844N908m156j2418m993k95
8157A01489n370j783J1369J8507K3396M4165O8399P7359O9612M3986j0913q3788
8145C56428r4624o8886m2774k1287p964p468m995j217J649P544J5574M227j2750
8132A23457j1701q362L712P27k128j086j984m203p447p043k434p7L169l38r113
8117G5149j393l08r61J726o570o185m900k335j098m005k776k669K680J505J292
8102D9152M161L228N968l822j686l595m952l708k545k658M62J651J785L455L813
$$ y = [800267, 894908, 822037, 611861, 428573, 320442, 255490, 212823, 188081, 170502, 159648, 149234, 147070, 148301, 147941, 151166, 151436, 141254, 130126, 123286, 121766, 118007, 122019, 120898, 114780, 109954, 104219, 105450, 106840, 101159, 97377, 102193, 108519, 110599, 117443, 123351, 119195, 106777, 101784, 101489, 96119, 94336, 105705, 124212, 147608, 191773, 260172, 337531, 407143, 451129, 440216, 356428, 261804, 192918, 150144, 128857, 120893, 113425, 108430, 107213, 108862, 116406, 131980, 136207, 123457, 111756, 103394, 107106, 107833, 105705, 104619, 102635, 98432, 90985, 83942, 81508, 81431, 84600, 84262, 75149, 73756, 73448, 72487, 74213, 67643, 61458, 56558, 54223, 53125, 49120, 46344, 43675, 46355, 47860, 49152, 53313, 56541, 62509, 58687, 57001, 53406, 48454, 44746, 42201, 39543, 40005, 41656, 43441, 46896, 50709]
8087E0709Q966j76j28l822m820N95J236R05k126l91J225j721n022k142L370r34
8071D5724p67l655l532o633p59L320k748j835N637L35M056K173Q56J839l308o193
8055C4510k596n84L241J432j794Q489M46k022l679l939l55Q11J860j695m732j519
8039B7874L323J116N410J697O46k982m159j756J863K008J055j846m693K425L918
8024C5899J889j080q19J859K884j214l123R80K4r91k564M17K346j935l060N54
8008C2066M380J066K454J237n522K702R01k318K017j373J000L925n85Q71L076
7993D5897k630J078l367o741p061J834Q614O443n329L30k077M556L095J837o637
7978C9842n145K557l897m681k642j48M664M875k50l601j176l388l027N796l026
$$ y = [50709, 59675, 59499, 59371, 55549, 50729, 51324, 52560, 53465, 51339, 50948, 52173, 50452, 45430, 43288, 46658, 45724, 44957, 41302, 37770, 31137, 30378, 33698, 30950, 29115, 34752, 35087, 39143, 41316, 42172, 44011, 40703, 34510, 31914, 31330, 34571, 36003, 34209, 42698, 43144, 41122, 37443, 33504, 33149, 33960, 35820, 34125, 29393, 27874, 31197, 32313, 37723, 39420, 40066, 37084, 32925, 31169, 33032, 35040, 36095, 34249, 29556, 31981, 35899, 37788, 36708, 35889, 37748, 40632, 39418, 36295, 37275, 37299, 36308, 33744, 34161, 36507, 34572, 31512, 32066, 36446, 37512, 39966, 41203, 35681, 38383, 39284, 36966, 38983, 37610, 38610, 42535, 41950, 42821, 45897, 43267, 44345, 40978, 34237, 27176, 29010, 37624, 44067, 38738, 39068, 36991, 41547, 44642, 46479, 39842, 34697, 37254, 33357, 28676, 26034, 25886, 30550, 35425, 35175, 31574, 30398, 27010, 23983, 29779, 26753]
7963B6753m498L040M318k112j273q14M901L796L339j272q38J316k608k077K14
7948C2185j831K724M83p32Q31J481k883k257n42J785N429r19o468k076L744J304
7932C2258K04o050m76L780q85J012K225l305k032K692j413k578R04j03j281L14
7916B5266n119k429L038L833L018k816j185j205p44M111m328l742k41J84j840
7901A5801P890J472k929P08J216k734l035j234L066l35N767J503l805r44J64l078
7885A9493m36M834N116n298l974Q11j911K371k740m41j052M36M924l64n017o05
7869A6147j78o23J889m24L759j260p218o23J2R09j90l234Q003O142q43j445j188
7852A9635l0Q07k266l737m204k103J382p316l101K754P536N345L234K720J314
$$ y = [26753, 22255, 25295, 29613, 27501, 26228, 25414, 30315, 34111, 37450, 36178, 35340, 36656, 34048, 31971, 32185, 30354, 33078, 33561, 32829, 33660, 35141, 32258, 30001, 29459, 31244, 36673, 35754, 29286, 27210, 30954, 32258, 32462, 26412, 25936, 29716, 28831, 29843, 32068, 28763, 26731, 29423, 28010, 25432, 26336, 26233, 24952, 25266, 20147, 17718, 20756, 24589, 27607, 24791, 23606, 22401, 21657, 25768, 21440, 17698, 17457, 17641, 15801, 23691, 25163, 22234, 22942, 24158, 21424, 18389, 17155, 20221, 19886, 25653, 27156, 23351, 22407, 22571, 19493, 19057, 23891, 29007, 23709, 19735, 20546, 18635, 21006, 18266, 17825, 16773, 17209, 22133, 21769, 16752, 16147, 15969, 15346, 17235, 16811, 20570, 19310, 12092, 11469, 11481, 12390, 12200, 8966, 16969, 23111, 22268, 20823, 19635, 19605, 20412, 18146, 14409, 10205, 8102, 9484, 2168, -933, 1821, 9357, 14702, 17936, 20656, 21970]
7837B1970j091m873J560j447n161n65K434K745n80l452p43L608K448o72k917m001
7821I263n54J29J639r59k428Q16L780M51j140M158k092J769L429p486J431M235
7805A6441P63j21l817o73K558j336k748K02L111J255K696K270m599O05k396l934
7789A0277j625k910K678o14j450l174J488J717L66q1k742K185M840j925j571P50
7773H209O0M400O92k223N49n038o095q89P017K274Q056K479k693o287o926M32
7757D017K059n41N695P21k75J010m30j470K025M71o37l63o08l351j000R97n748
7740B572l731O775L589L02K928Q95J906J094j010r48j295K555N413k458j0106
7725H481r30M149M6L488j720o602l028p79k077J97J057k93L228O094L040m088
$$ y = [21970, 20879, 16006, 17566, 16119, 10958, 10393, 12827, 15572, 14992, 11540, 10797, 14405, 16853, 16181, 13264, 9263, 8709, 8838, 10477, 9518, 7090, 7906, 11686, 12137, 10997, 15155, 13063, 14832, 18261, 10775, 12206, 16441, 17204, 17083, 13266, 12593, 15151, 13815, 11067, 11269, 14380, 15635, 18331, 20601, 16002, 16607, 14211, 10277, 8652, 5742, 8420, 7806, 6356, 3182, 4670, 6387, 6753, 6672, 3930, 6115, 10955, 9030, 7459, 8209, 8269, 12669, 13361, 11138, 11687, 6649, 554, -335, 6682, 8956, 17012, 19491, 16798, 10511, 3585, 4017, 6076, 5535, 11230, 11951, 11676, 12686, 12256, 10786, 12811, 13282, 12645, 12282, 11674, 8323, 7323, 8320, 2572, -1159, 5616, 9205, 9507, 12435, 13330, 15236, 16330, 15320, 14372, 13077, 15632, 21045, 18587, 8481, 7551, 11700, 11746, 15234, 13514, 6912, 3884, 3105, 1028, 1225, 2282, 1989, 5217, 11311, 14351, 10263]
7709A0263n672J851Q096j333p651j354k064J482L841m238n423M64j172K245L357
7694B692J910L514K004Q84M11M894j926k421M410R84k845K76m243K438N226o107
7678A2101l343J510j623P91M76j727J138o8k024N932P83n252j702k248j437J36
7662C443k53M227j043N289J884l837k029m789j281J380k056L177M645M891j295
7647A2353o48n88J789J153J90j693k886k305l034J278J556j329k942j294J955
7632C555N875k698j955M137L542m487N65l303m335O04N572K070L43q109j103Q01
7616A074J122N29j710K822k223K72M933M531m478L465j607P73m582J481M982N191
7600A6575o67l880n950l609j029K117P149L24J85j496k801j468k61L216j038m06
$$ y = [10263, 4591, 6442, 14538, 13205, 5554, 4200, 2136, 3618, 7459, 3221, -2202, -1738, -2910, -665, 2692, 4602, 8116, 10120, 11004, 11415, 16309, 14383, 11962, 16372, 17356, 14511, 14787, 10544, 12982, 18208, 12101, 8758, 10268, 8645, 9436, 9912, 8185, 9323, 9255, 7231, 13163, 13946, 8694, 6992, 4744, 3307, 3443, 3190, 7417, 6374, 11663, 13547, 9710, 7681, 2892, 1611, 2991, 935, 4112, 8757, 13648, 12353, 11705, 11117, 12906, 14059, 14249, 12556, 9670, 7365, 4331, 5609, 7165, 5836, 2894, 1600, 3555, 9430, 6732, 4777, 8914, 12456, 7969, 8534, 5231, 896, 1500, 7072, 9142, 9485, 1376, 273, 1074, 2196, 2725, 1015, 3837, 1614, 1886, 6819, 11350, 6872, 10337, 8730, 9503, 4921, 6402, 11384, 16575, 15908, 12028, 6078, 2469, 1440, 3557, 10706, 11030, 11215, 9719, 6918, 5450, 5189, 8405, 7367, 6961]
7584F961L837O58j619K633j205m562p768l981N250O401J718k720j399l863n68
7569b27J812m29P18r9k21j495O071N497P59J587K261p310o217k023l171l470K880
7552c077P453J051j431r4P0J994L716j820k993L09j21j991N157j916K280J096
7536I683j550j291N45j523l322j639N366K459l474J368k653n487K8j559J17L145
7520B13M677l260j37J383m27K80P35p53j216L964N012m33n151k299j008K455K045
7503F080J832j379j845K507M071L467j064o805j788O74P62L601N47J891j856n55
7487A0140j476Q45J532M028l364m085J129n226k889J755L926P80m17o49R12k728
7471D213n483J302N820J625m04K062k566m976k848j469K70M66K009K302N604k565
$$ y = [6961, 10798, 11456, 9837, 12470, 11265, 6703, -1065, -5046, 204, 6605, 8323, 5603, 4204, 341, -227, 1585, 1156, 1874, 1775, 1554, 59, 6130, 11627, 12386, 13973, 16234, 8924, 2707, 684, -2487, -5957, -3077, 4376, 5427, 3996, 3902, 3972, 5966, 9682, 7862, 4869, 5178, 5057, 3066, 8223, 6307, 8587, 9683, 8133, 6842, 7387, 5864, 2542, 903, 6269, 8728, 5254, 6622, 3969, -1518, -1490, -3049, -2932, 213, 4890, 1630, 1493, 2876, 2449, 2729, 3464, 2711, 1495, 5459, 10471, 10038, 4887, 2588, 1580, 4035, 6080, 7912, 6533, 4688, 7195, 11266, 14733, 13669, 6864, 5076, 5750, 6512, 10113, 10660, 12551, 10695, 10140, 8664, 9509, 11041, 15069, 11705, 7620, 8749, 3523, 634, 2389, 6315, 7095, 6678, 6029, 6941, 4213, -1270, 32, 5852, 7477, 7073, 9135, 6569, 1593, -1255, -2724, -2454, -1988, 21, 2323, 7927, 5362]
7455E362j497j083l10j148J157j134m385J837K687L37M704j815O47k027J317L946
7439H595n565m746K485L953M388j817M34k263K737m612k462k35J314N690k295
7424E601o66j018m513j585K61J772L512L79K522M955J094r109k129K094j970l08
7408H92o03j893P11N278J676K256K21K90o03j664k146k894M80K56L142N304J681
7391A2384p976N9j031J267m749m120N045Q130N71K979K478p097k817R97j072l21
7375D727p18l534n735K993L657L81K81j071L288q51k913J142L366j153r4J538
7359E304K633k69J866n900q112L283N673K927j613o90R08K769l148K53K03k012
7343D075K23N068P336l961o446j706n270k093M221j28l80p79J651M053J067K600
$$ y = [5362, 3865, 2782, 2472, 1324, 2481, 1347, -3038, -1201, 1486, 1823, 6527, 4712, 5359, 3332, 4649, 8595, 3030, -1716, 769, 4722, 9110, 7293, 7727, 5464, 8201, 3589, 1127, 892, 2206, 7896, 5601, 4935, 3917, -596, -2181, -1920, -148, 3364, 3743, 6265, 11220, 12314, 3205, 1076, 3170, 1200, 892, 289, -1604, -893, 4385, 6061, 8317, 8538, 8828, 8225, 6561, 4415, 1521, 2001, 2257, 5399, 10703, 12384, 4408, 4467, 3436, 4703, -46, -4166, 879, 9009, 9580, 12559, 15037, 7940, 5123, 6120, 5048, 4727, 4009, 475, -5260, -2267, 1390, 1771, 2052, 981, 4269, 3418, 505, 1647, 5013, 3860, 3766, 5304, 7937, 7668, 9534, 3634, -4478, -1195, 4478, 7405, 5792, 5102, 6010, 8779, 5631, 5884, 6087, 4075, 4298, 9366, 16702, 12741, 6295, 4589, -681, -2774, 1447, 1319, 939, 160, 1811, 5864, 6931, 9531]
7327I531o75l147J627O58J015l161j289n41L43Q62m149m774M819L119L136o32
7311F742p78L935j961n251l116J166L568K448k64j355q00M903P54M0O55l479J214
7294H421m020k509K444O055j617k087m0l298l088R35L185j584q208k40L354L346
7278A049K874K308j975p34K543K974j186K396n000o751J040M798R97j084j263
7263B986q46L289K222k580j926j343J055k28j177K113K944O57k883n345J781Q266
7247H985j200J190j324k661l425k136L149L296l77l258k420K548J106m71L563
7232F565q633j717P932L569k011R64O63l266J7l679j590K886J924K608m982J915
7216C165l562m025J826K538J890m493j236L002J904k219L168L369M490j523m806
$$ y = [9531, 8856, 5709, 7336, 7994, 9009, 5848, 4559, 4018, 4361, 5223, 1074, -3700, 1119, 4238, 7374, 6742, 5964, 9899, 7938, 2687, -429, 737, 4305, 6753, 6489, 5134, 4334, 9237, 9991, 10031, 10686, 7207, 8421, 4401, 1892, 4336, 10391, 8774, 6687, 6647, 3349, 261, 1196, 4381, 2797, -5411, -5651, -2297, 1049, 3923, 6231, 4256, 3522, 6065, 9039, 7853, 10249, 5249, -1502, -462, 4336, 5333, 4249, 2986, 2140, 5429, 7651, 5071, 3145, 1802, 2857, 2629, 1452, 3565, 6509, 7166, 4283, -1062, 719, 8985, 7785, 8975, 7651, 4990, 1565, -571, 2578, 5874, 5497, 2239, -181, 2367, 3473, 3002, 6565, -2068, -3785, 4147, 7716, 5705, 6669, 7332, 4066, 4083, 404, -1186, 1700, 3624, 6232, 1250, 3165, -397, -4422, -2596, -58, 1832, -2661, -3897, -895, 1009, -1210, 1958, 5327, 9817, 8294, 3488]
7201C488J418J840j04r06j276m422q45J285R28k19L968l973J961J672Q28p1m450
7184A122o3L949R25m310k086R84l71L096O25J763m68o902m661J051J968J477m1
7167a942p33M79M244k874J787j258K08n893J345N593j864l169k195j452O261O830
7151E367L958l271l167K667k503n918K102J375k427J029O113K657p191q061n095
7136a2365M706Q552M162k408k624m063j164N636R66r66m00Q89K508K353M959n552
7120E189o060M969J026j216J180l200L56n61m96J422j844L382j276k958K242N165
7104G320O187j32j0097m814k055O207N419l483l896M91J268n96k093L042k164
7089F04l458L512J342J35n68J66L013K239j737M29L798k875j470K884R71k131
$$ y = [3488, 4906, 6746, 6642, 5736, 4460, 38, -807, 478, 1406, 1187, 5155, 1182, 3143, 4815, 5643, 5572, 1122, 1059, 5008, 5933, 1623, -463, 521, 150, 3246, 3871, 5634, 5166, -1736, -6397, -5346, -3378, -1901, -1942, -2675, -2196, 2048, -826, 961, -297, -89, -5982, -4637, 956, -908, -4077, -6272, -7724, -1463, 5367, 9325, 6054, 2887, 5554, 3051, -2867, -765, 610, -1817, -788, 5325, 7982, 791, -7270, -12365, -7659, 893, 5055, 2647, 23, -4040, -5204, 432, 1398, 432, 32, 921, 3429, 5782, 10741, 5189, -871, 4098, 5124, 3908, 5088, 1888, 2244, 1683, 1187, 2609, 765, 4147, 2871, -87, 2155, 7320, 13507, 13375, 3278, -1536, -3591, 2616, 8035, 4552, 656, 1147, 2415, 1819, -274, 2768, 604, -2854, 658, 2000, 2135, 1567, 1733, 4746, 6985, 5248, 5677, 9475, 6600, 5130, 8014, 8985, 6854]
7073F854l290j157l603j592j0K835M321m834J67j496L283l438K053J843j050K422
7057C308j622r31K338n32l035m17j162K812M983M25K576L545j096l656j012K294
7041H818r17K673j580l974j307l638l244L712l271m35M598r94m178L378j77j074
7025a610J939L314P620L699j0032n336k589j993Q06o767P7J540j109J465Q110
7010h66O089j085k421j656K150k194n918O4K266L085O40k154j209j518R92M558
6994H23N919J21m238l498L412O660O78r46q69l876j511j012K288k617J141o46
6978A829l331J578m23r80p93J119K978J270k315k842p69J003p79M818N7n43J247
6961C124m46J871L877L94l384j593l082l799m989R34J06o99K729L299R24n95k827
$$ y = [6854, 3564, 2407, -1196, -2788, -2798, 37, 4358, -476, -309, -1805, 1478, -1960, 93, 1936, 886, 3308, 1686, 755, 3093, 2561, -474, -891, -2053, 759, 5742, 6167, 8743, 12288, 11192, 7536, 6524, 8818, 7901, 10574, 8994, 5020, 3713, 75, -3169, 543, -2728, -3163, 1435, 441, -3737, -359, -536, -1610, 329, 3643, 11263, 14962, 4930, -406, -2995, -4988, -4182, -10949, -10872, -9332, -10441, -8976, -866, 5223, 4138, 1717, 61, 2211, 17, -5901, -5837, -3571, -486, 154, -2000, -3209, -4727, -3735, 823, 6742, 6863, 2625, -873, 2539, 9199, 9877, 8931, 8062, 4186, 2675, 1663, 3951, 1334, 2475, 1829, -1502, 76, -347, -1327, -2120, -1001, 1977, 3247, 932, -1910, -2679, -1676, -2455, 2363, 2420, 1877, 3124, 2678, 4549, 8426, 8820, 5436, 3843, 761, -3038, -8027, -7093, -6987, -7686, -4957, -1658, -734, -1329, -4156]
6944d156o93R38L156j603o34N1k107K271M371N237J839m317j094k79J325Q82m67
6927D720l29l222j714L276j540m666k378M335K998J53j682L089N67j82O41J979
6911F045j9k144o5J517m742P40k149j466O125N505L895l769n507o741l392n788
6895a1955r0N912M772j931Q21L255M366J418J040J866j877k659J337J905Oj630
6879F556k310K362O987k525n360l075K66j160J053M872K533K072J274n534p635
6864C76K325Q447p235m590K771n10R56K575q32k35n285j950K548K887k193m393
6848d338j607M988K881L476M78j072n359l404M167K414M034M236k852O12M108
6833A2762M692k153m509j615l567r410n010j385N181P992k32N67J354L998R60
$$ y = [-4156, -4849, -3911, -755, -2358, -2992, -2941, -5048, -2777, 1594, 6831, 8670, 4353, 3259, 2980, 4305, 5187, 4720, 4391, 1169, -545, 2731, 1191, -3475, -5853, -1518, 1480, 1633, -49, 3040, 3607, 3425, 4066, 6045, 6026, 3882, 3817, 5334, 592, 1332, -817, -2283, 3842, 9347, 13242, 9473, 3966, -2775, -6167, -11955, -12045, -6133, -1361, -3292, -2471, 784, 5150, 6568, 7608, 9474, 7597, 4938, 6275, 8180, 8186, 6556, 4246, 6608, 13595, 11070, 5710, 2635, 2901, 1741, 2794, 7666, 10199, 12271, 13545, 8011, 376, 2701, 11148, 3913, -677, 2094, 1584, 2540, 5115, 4283, 4048, -1237, -3187, -639, 2248, 55, -4338, -5945, -957, 1924, 5400, 5878, 4806, -553, -3957, 210, 2624, 6658, 10894, 8042, 8654, 12762, 17454, 15301, 10792, 9177, 5610, -3800, -8810, -10195, -5014, 2978, 2746, 3313, 4667, 8665, 9625]
6818I625j600j040j130m031l530K276M122M90l416k113q39m70l984J152l22J605
6802c205P252p75j177j591K146q52J297P614R78m8j820q06J270m982K272L032
6786A0605J171J047j1855m505L898J60m536q28r61K460L549M075k04k724K12Q19
6770B383j674J09j92J766M666K952l905l513R61j486J173N705j728k506K799k474
6754E036J241m164O34N034n36l767k76l757J42R72J030l21K335N80J136l17n552
6737e50k792K754P27K178L498K906J890l044n731p695M56N805Q223L405j670n371
6721D989m824L722M411j885m586n71j788m213P534N789L95k652k578N60j214O61
6705C750L206l886l175J526J67l547k631L37Q358R97j051K37l147j250J593J363
$$ y = [9625, 8025, 6985, 5855, 1824, -1706, 570, 4692, 5182, 1766, -347, -1186, -1656, -5640, -4488, -4810, -3205, 4047, 3272, 2095, 504, 2650, 1798, 3095, 10709, 11687, 11639, 9819, 9013, 10283, 5301, 7573, 10605, 11776, 12823, 968, -3537, 361, 521, -4015, -4843, -5804, -3344, 205, 4280, 4076, 1352, 1564, 2383, 709, 818, 626, 2392, 7058, 10010, 6105, 2592, 3553, 2067, 3240, 8945, 7217, 4711, 7510, 5036, 6277, 2113, 2747, 7781, 7245, 3478, 3202, -555, -413, 559, 1589, 1268, 3603, 4183, 5319, 5002, -550, -3342, -588, 139, 2317, 5815, 8721, 10611, 7567, 1836, -5859, -5403, 402, 8625, 12030, 10360, 4989, 165, 3887, 8298, 6413, 1827, 1256, -532, -4745, 2789, 8578, 8973, 6321, 3743, 4303, 3089, 3750, 6956, 3070, -105, 1421, 1588, -1959, -4590, -4253, 4105, 5102, 4051, 4288, 1141, -109, 1484, 2847]
6689B847o966j498O852J287r307m604K428L127k272L133M897p81o04K226l9k242
6673a516j278m5L266J581q39m40j628J752M719L144M329m815k799k728l551p72
6657a620k910k639k940l086M40K200N258J979q5K436K580J623o979L266K034P94
6641B351j992m921n224l14j381o53J25Q055L239r06n208k327K345J486l990j386
6625a0701j059L944J776j12J682L224P7L922K078j926K004P71K620p205m885J674
6609b116K744L843o52j640P1n3M4R81L64K836j304n62J878k507o43M04m240l380
6591c932k035j345o29J307k218N447O659K073J137P82k2m206m120k810q95p84
6575e591n36K949k080K205P031p834l216k574K272j19k387L620K650J607O893
$$ y = [2847, -4119, -5617, 1235, 2522, -6785, -11389, -8961, -5834, -8106, -4973, -76, -857, -1461, 765, 726, -1516, -2794, -2839, 427, 2008, 1169, 729, -899, 853, 5572, 8716, 13045, 8230, 5431, 2703, -848, -1620, -4530, -7169, -10109, -13195, -12755, -10555, -5297, -3318, -3403, -967, 1613, 3236, -3743, -477, 1557, 2351, 359, -4562, -9786, -10100, -11481, -12134, -12009, -3954, -715, -1621, -6829, -9156, -6811, -5325, -9315, -10701, -11760, -7816, -6040, -6152, -4470, -1246, -1169, 2753, 4831, 2905, 4909, 5680, 8300, 1095, -3790, -2116, 628, 4471, 3819, 2179, 2250, 2197, 2241, 3222, 3586, 6422, 5118, 4556, 6434, 3927, 3284, 3688, -552, -3932, -5967, -7312, -7941, -6634, -8852, -3405, 3254, 5327, 6464, 7246, 7224, 3018, -1102, -3912, -4807, -5591, -6127, -3178, -5258, -3053, 3978, -3856, -7072, -9646, -7374, -7493, -9880, -6260, -3610, -2003, 4890]
6560D890K205N22n446k640N32J212K934n27J847O118l47n626m113L592L963k582
6544F534n179j425P56j889n094l96M851J1018Q686J0146Q7p927j7659o662L989
6529a64K24k48k685N120K982k89m072k199j755j532J643K903q73m17k26L164m330
6512b754L17M347j38l657L681m39o673k586m03N278j094L464P17L867K30r291
6496e134N09O28L311L039j521J385N958M725J2934J4388J421j3810k1607l960
6482B266L375K320q62N19j45o329k003M014K759r89l273l731m099k01J90L312
6466b877K520j373J391J970j892l639j797J462J953m600l031M9J706O660L384
6451A886L911N700j007o795j453J866J305M684o308m023L501R186J1121Q499r196
$$ y = [4890, 7095, 7617, 2171, -469, 63, 1275, 4209, 3682, 5529, 11647, 11300, 5674, 1561, 5153, 9116, 6534, 1355, -70, 686, -1203, -6297, -6693, -1842, 9176, 17862, 28008, 28095, 20168, 2509, -4153, -164, 60, -188, -2873, 2247, 5229, 4940, 868, -1331, -3086, -4618, -2975, -72, -945, -1362, -1588, 1576, -2754, -2437, 1910, 1772, -1885, 1796, 1357, -5316, -7902, -8305, -3027, -4121, -657, 60, 3927, 4157, -5134, -4625, -3997, -686, 2353, 832, 2217, 8175, 12900, 25834, 40222, 41643, 27833, 6226, 2266, 5641, 7961, 7099, 7618, 7473, 1144, -859, 3155, 5914, 4925, 1652, -2079, -6178, -6379, -6189, -2877, -357, -1730, -339, 1631, -261, -3900, -5697, -4235, -2282, -6882, -9913, -9864, -8158, -1498, 1886, 5797, 11497, 10490, 3695, 2242, 4108, 5413, 10097, 3789, -234, 3267, 12453, 23574, 32073, 22877]
6436B2877j8891p088p81K964J856M84m131l337L448L408K877m059k14k52K94J495
6420I50l089K23L454o84M070J16J074j820m89J101j292O93m540j958K19j881J66
6403c687K140J128O291M779j558n673m977l111j625J250P497L936M521K755k070
6388A1596l884j708m552m27K72P89k056K264J385K16L180N089n438l911k442K499
6372B872J630l225l135K824M526k598o517J048K283n101m74N21l82k313J524J577
6356d940O922J78m60J160m451l657K834J270J658j126N540O85k898o872j967N828
6340b96L659k918K843J912m94K473j647m95p87n365L822O481O72k034k247j138
6324D441K233L791J216m161l012J391l334j418N218P60k982n660l481M300M111
$$ y = [22877, 3986, -3102, -3883, -919, 937, 1421, -2710, -6047, -2599, 809, 3686, -373, -587, -839, -545, 950, -2139, -1916, 1538, 854, 4924, 5040, 6114, 4294, 3805, 4906, 3614, 4307, -233, -2191, -1972, -3853, -3687, -1547, -419, 5872, 10651, 9093, 3420, -1557, -4668, -6293, -5043, 2454, 6390, 10911, 13666, 11596, 7712, 6004, 1452, 1025, 1297, 2086, 30, 2294, 3679, 3895, 7075, 12164, 6726, 2815, 373, 2872, 4502, 1277, -1858, 966, 5492, 2894, -3623, -2575, -292, -5393, -5867, -5346, -5728, -8041, -6517, -4940, 1982, 2160, 1700, 2860, -1591, -5248, -2414, -1144, 514, -612, 4928, 5613, 2715, -4157, -6124, -296, 3363, 445, 3288, 5200, 4706, 7179, 5532, 5037, 4250, -1115, 2707, 9188, 9860, 7826, 5579, 4441, 6674, 10465, 11681, 7520, 4508, 5899, 2565, 1147, 6365, 7125, 4143, -1517, -4998, -698, 3413]
6309C413K284l716K936j1l402J174J004j72k451J409N756L77q690k397K03k406
6293d689L179M268l580j852l447L277K302j902j07j126M07M486M494l943n442
6278c675n64m86K420K692K440L398O36j056k596k386r45l057Q103O53l382J303
6262C498K109n487k833k855L673J189k609K72K265p85j972j388p51M65K287L495
6246E73L705j525j231l85N59k403K311Q90L894J000l641J877K156L802k095m756
6230D731j836j911q366L42M074K535L970K475j708n754k232K196K432J280P97
6215C025j085R466J25q946o495m930J24M499K479L488j007m145j184L285p01n028
6199g030J14l817J802K994K879J914k982L008p70k101n09M554l391p22L829L613
$$ y = [3413, 5697, 1981, 4917, 4906, 1504, 2678, 3682, 3510, 1059, 2468, 8224, 8601, -89, -2486, -2283, -4689, -1510, 2758, -822, -2674, -6121, -2844, -542, -2444, -2551, -3677, -3270, 1216, 5710, 1767, -3675, -4239, -4725, -2305, 387, 2827, 6225, 6861, 5805, 3209, 823, -122, -3179, 4924, 5577, 2195, 3498, 5607, 120, -2713, -5568, -1895, -706, -3315, -3043, -778, -1563, -3535, -4923, -5674, -5209, -2922, 573, 4278, 2753, 1522, 1137, 1696, -707, 1604, 2494, 6388, 7388, 3747, 5624, 7780, 11582, 9487, 4731, 2895, 984, -7382, -7040, -2966, -431, 3539, 6014, 4306, -1448, -3680, -1484, 948, 2228, 3025, 1940, 11406, 11531, 2585, -3910, -8840, -8716, -4217, -1738, 1750, 743, -3402, -4586, -1301, -2002, -7030, -6916, -10733, -8931, -5937, -3058, -1144, -4126, -1118, -1888, -3989, -4498, 56, -3335, -4057, -228, 3385]
6183C385j365j354j607O040n91n721k094k931J707j478q6j950K232j814l553M050
6167g130L268p52J330j146o073o50O129M961l830O9N630L946k731m240m640P16
6151e143j210J653K683N04Q494j582k254K243l517k536N877m837n432O69K194
6136b194L471j376J549K879m844k602N786m0J881J532J850K516R56N57m270n092
6120B559n052K285q4K933L079K762p78k881k396j571l43Ql944n833P02O580P625
6103E651J895j233k238j713L447K129l523k785l26k751l48R30K617K469m822j237
6087a838j807J341j269K632J812p06oj66K049J286N66L779P10n259j760M5K008
6070C417J994J549n084m238R64k88r59Q58n69N94j44J582L253O95j862K755n502
$$ y = [3385, 2020, 666, -941, 5099, 4508, -1213, -3307, -6238, -4531, -6009, -6095, -8045, -5813, -7627, -11180, -7130, -3862, -4614, -3284, -4430, -10503, -11153, -5024, -63, -3893, -3824, 1806, 5752, 3021, -1219, -5859, -5143, -6353, -4700, -2017, -1513, 6981, 5399, 3145, 5388, 1871, -665, 5212, 375, -5057, -4388, -2194, 1277, -99, 1450, 4329, -515, -3117, 2669, 2629, 4510, 6042, 7892, 10408, 11364, 11921, 7651, 2559, -2493, -208, -292, 2641, 5720, 8482, 7704, 4823, 2427, 856, 513, 521, -3423, -9256, -8554, -1974, 5651, 7546, 6313, 4075, 2362, 5809, 7938, 4415, 1630, 1304, -1447, -1795, -865, 1752, 4221, -601, -1838, -3645, -2304, -3573, -941, 871, 165, 159, -7, 2042, 3328, 3894, 7673, 8383, 3124, 1364, 1409, 3417, 5411, 6960, 1876, -2362, -1398, -1686, -2645, -1787, -2356, -1762, -1906, -324, 2929, 3624, 1762, 4517, -985]
6053i85r486L077m36J452O001r49L2J293j087K770j433n141k113j381l015N891
6037e510M926M062M300K513k282n552o333j163N967O50j156k054J325M16n307
6022e198o637J475j331L795L849N901Q05l108j703K340k420M879K581m741o104
6007e617j881N473J989N51J450j69k42k374r26L943n178l548L971R593J693l008
5991E720M32n70n97R79m019M055m48o89j570k547k086m29K097L69j660q12J035
5974g40O18k863j181J506j384n010J453J874m235j048J192P110L825o715o85J521
5958d762m307J415J675K962L641j634J526n79m741j404K660k11K964k002j050
5943c847Q88l902p92K428J441M603M215K707k722n343L200J162n384j055J369
$$ y = [-985, -10471, -7394, -7830, -6378, -377, -1326, -1294, -1, -1088, 1682, 249, -4892, -7005, -8386, -11401, -5510, -584, 3478, 7778, 10291, 8009, 2457, -3876, -5039, 928, 1578, 422, -1632, -307, 109, -5198, -11835, -10360, -11691, -7896, -4047, 1854, 2659, -449, -2152, 188, -2232, 2647, 5228, 487, -5617, -7498, -2025, -36, 515, 1965, 1796, 1554, -820, -1746, 2197, -2981, -6529, -2558, 7035, 8728, 5720, 6152, 5582, 4985, 5964, 1945, 6000, 5552, 4863, 3293, 746, -1340, -1769, 328, 697, -963, -1775, -740, -122, -2985, -4166, -2660, -4044, -9054, -7601, -5727, -9962, -11010, -9818, -2708, 1117, -5598, -6283, -4762, -9069, -7654, -5979, -3017, 624, -1010, 516, -63, -4804, -6208, -3548, -3759, -795, -2797, -3847, -2959, -6861, -7653, -5225, -3784, 819, 5034, 7741, 5019, -324, 2876, 4038, -1346, -2401, -1032]
5928a032j934r36M847j809j042O7J312L29j46Q43J258k418J678l515m819K130
5912e187K070m35M644j708n167O18K252K68l5r16m295L279O792R07l338K622K367
5895D738n134j887k225j316j693L513K529L644k45n90K276n370n54K120k076j330
5879c600M100M417r9l039j411K873N93J645j47M095l038l167n512k394K922J423
5863c39j199k895J195J96o25l3M894L554k000j462R30k960j256L872J129j340
5847A661N59n234l492K917J994L730K586j0337k799J693K484N410m84o147l27
5832e786Q38J16P537K074l55m248l684l698n74J477J600k70R26r6n4o74k74M604
5814e41K156m825l211J752M291M33K165N420o510l289j570J6l876L636K964J53
$$ y = [-1032, -2966, -3902, 945, -864, -1906, -1839, -527, -198, -344, 499, 1757, -661, 1017, -2498, -7317, -5187, -3117, -3552, 1092, -616, -5783, -5165, -2913, -2645, -2680, -3596, -7891, -4612, 2180, 3087, -251, 2371, 4738, -396, -2283, -4508, -5824, -7517, -4004, -1475, 2169, 1924, 1334, 3610, -1760, -2314, -194, -2270, -3600, 500, 4917, 4818, 1779, 368, 3241, 3834, 5479, 5332, 9427, 6389, 3222, -2290, -4684, -1762, -339, -1538, -4433, -3238, -3042, -3667, -3700, 1194, 4748, 2748, 1286, 2216, -744, -2000, 1872, 3001, 1661, 2220, -3014, -6506, -3589, -1595, 2135, 4721, -5616, -8415, -6722, -4238, 1172, 688, -5459, -5786, -4948, -4832, 2705, 4779, 4424, 176, -3508, -7206, -7780, -6303, -4703, -4973, -4047, -4143, -4197, -4871, -5145, -541, 1615, -3210, -6421, -4669, -378, 55, 2220, 7640, 1130, -2159, -3729, -3713, -7589, -3953, -989, -836]
5798h36n417K489l40l90j645K588J568J883l334j249K153P538N6q880m508m22
5782h746J299N607J744j652J561K119k718m671j360m06L188M121j469J305J932
5767A854k327l998k18J470K626n469K565J458RL126J867l956L475N01n10J040
5751C513R90m839m230J12m18P64K871M681L025J299r99j733o670o73K575J798
5735B066j460m122k322J632P208N866J109m274m588k549j746K889n43l858L15
5720d377N634N63q616j278K827O689J781k153r36k934l8R321l712m164r92K218
5704a67K047M990p383n638j852J043N320K777o59k722j037j53j003n23M645r84
5688a299m967R6J624N470M072j269K78q20J021j422N33J969r52m82k071K316K754
$$ y = [-836, -6253, -3764, -4104, -4494, -6139, -3551, -1983, -100, -3434, -4683, -2530, 5008, 5064, -3816, -8324, -8746, -7447, -1840, -96, -1748, -187, 1932, -786, -5457, -6817, -7223, -4035, 86, -1383, -78, 1854, -473, -4471, -4689, -3219, -593, -6062, -3497, -2039, -2030, 1096, 2963, -993, 2482, 2983, 2473, 3513, 4503, -336, -4566, -4454, -4872, -4108, -1237, 3444, 6469, 7768, 6769, 5036, -1634, -2307, 268, 2066, 606, -3516, -5838, -4206, 3002, 8868, 9977, 5703, 1115, -1434, -3180, -291, -834, -4692, -4377, 1257, 1820, -6796, -8074, -5247, 1442, 3223, 1070, 134, -2800, -2838, 6483, 2771, -1393, -2385, -167, 1880, 6870, -513, -6151, -8003, -6960, -1640, 1137, 478, -2244, -3281, -3434, -4437, -4960, -315, -1299, -6266, -6170, -4546, 924, 4996, 3727, 4005, 3185, 4206, 2784, 3317, 5286, 4334, 3852, 1781, 4097, 6851]
5671F851l757m409O224J919l984J364K761k316Q55j65n599j186p94j539j598J515
5655c858L209M348m938j583J563L138q25j531K818J394n644j05l612O68J760L928
5639G30o42m152J459M4J512j445j388P95L201J745ml727j279P92J269l015J122
5622b983K28M202N19L771m617l443J045L879L395R61o295j636J150P43P33m794
5606c142k410L801K731K658k187N43j597n151l439N780N936N071K385q992o465
5591d478J94k016p8M332k893m477J908K572L408k159m185J802r1p1K507O24k528
5574e629m091K163Q750J063j159L01k214J669l478l028K058j08j673j292p64M36
5558f996K675K755j119j580l48l285M303K251j464L927j275l161Q92j524j374
$$ y = [6851, 3094, -1315, 4909, 6828, 2844, 4208, 6969, 4653, 5508, 5343, -256, -1442, -2236, -3775, -5373, -3858, -649, 3699, -1239, -2822, -1259, 1879, 1054, -477, 2341, 3735, -1909, -2014, -5626, -4958, -3198, 730, 88, -4064, -2605, -2561, -1049, -2494, -3882, -3087, 114, 1859, 1855, -1872, -3151, -2359, -1090, -4105, -2983, -2755, 1447, 1966, 5737, 1120, -2323, -1278, 2601, 5996, 6957, 662, -974, 176, 919, 1652, -3142, -5552, -1751, 980, 3638, 1451, 1994, 397, -4754, -8193, -2413, 3523, 8594, 10979, 1987, -4478, -4284, -6300, -6378, -2046, -4939, -9416, -7508, -4936, -1528, -3687, -7872, -6070, -6161, -6232, -3725, -3101, -5629, -9720, -7557, 1193, 2256, 1097, 1398, -816, 853, -2625, -5653, -3595, -3703, -5376, -6668, -7432, -6996, -4321, -1566, -2685, -4265, -4613, -7898, -3595, -1344, -2808, 1119, -156, -3317, -2425, -3949, -5323]
5543e323L019m47l60J376k592K063M480M343P5l022o105l925o47P18L558O32K322
5526A65J224l750o284k952N058N494M98p079j98K639P92M813R27M065J809K896
5510A0117j959k794j851o53k44k373k268k963J908M766q88K021J861k100M161
5495F741J023p62L68k892m643l110M2N046k362Q46l761L22K474J905l627J277
5479a113J595o923l511J355P663J124j609jK62L092k374r25L265l54m247m41K62
5462b880K392J490j575j299J09j833l054J799O98M242l826m066P738J684n493
5447c874k523L068M160m216j87K552k307j232m749Q72P9O899J710J2m02l362l918
5430g418j761L813KM05k32Q13k3K642N552L265K518l740l397Q56J086j75m308
$$ y = [-5323, -2304, -2751, -3111, -1735, -4327, -2264, 2216, 6559, 6634, 3612, -2493, -6418, -7065, -6347, -2789, -2157, 165, 1389, -2361, -8645, -11597, -6539, -1045, -547, -7626, -7824, -5185, -4393, 420, 1347, 5412, 7221, 10117, 8158, 5364, 3513, 2860, 2616, 243, -2025, -4988, -3080, 1686, 798, 2819, 4680, 2580, 6741, 7764, 7002, 7370, 4478, -165, -3275, -3233, 1813, -549, 297, -3464, -3142, -668, 1237, -2390, -1113, 482, -6441, -9952, -8597, -934, 190, -1419, -1420, -1158, 1934, -440, -1365, 1900, 1546, -2701, -3142, -2880, -488, 1002, -573, -1872, -1763, -3596, -6650, -4851, -4153, 89, -3737, -7803, -65, 1619, -3874, -6397, -3329, 831, -3385, -3572, -1020, -3327, -4559, -9308, -8436, -8357, -1458, 252, 264, -138, -3500, -7418, -9179, -5366, -5364, -4959, -5191, -4378, -4401, -1759, 3793, 7058, 9576, 5836, 2439, 3295, 4381, 4206, -102]
5413a02k903l371M26k840J477Q264K939Q64J906N079l759r717k502j207K32o33
5397e847R74n79K393k775K302J947K257K69m324k680k148k066K758j82K668q01
5381e834o331j188K511M202L429M496j026l754n551j444j362L284K786J973K190
5366a619J008k675N57m04m064L102N672P3j083K046l422l048k780j691M578N063
5350A313L94k174J312m80m738r04j153l94M753O147k803j845j807p850l860R430
5334d659j609l91j479k881j001Q28Q324R17k086L4K685l391j776L73N308k384
5318c188J8K915l85J714l822j048Q79J22O885L065j759n95K340M3N62n939m268
5301b461l413j882k76K478P98p35r21l2o53j467m02L129M878J803M567k399l945
$$ y = [-102, -3005, -6376, -5950, -8790, -7313, 951, 3890, 4754, 6660, 11739, 7980, -1737, -4239, -5446, -5214, -5847, -4873, -5452, -3059, -5834, -3532, -1585, 672, 941, -3383, -6063, -8211, -10277, -7519, -7701, -5033, -5834, -12165, -13353, -10842, -6640, -3211, 1285, 259, -3495, -9046, -10490, -11852, -8568, -5782, -3809, -1619, -611, -3286, -2729, -3133, -7197, -4095, 1577, 1650, 567, 2613, -809, -3857, -6637, -8328, -3750, 1313, 1707, -467, 845, 365, -4373, -5277, -6430, -6824, -2071, 4076, 1273, -572, -2379, -10229, -14089, -4659, -6268, -6659, -8138, -11019, -12020, -11192, -2868, -1951, -4037, -4003, -1318, -4709, -6485, -6112, -804, -3188, -3170, -255, -640, 1074, -2748, -3796, -2917, -2795, 4090, 7155, 5396, 4801, 7141, 7184, 7746, 1807, -2461, -5874, -7756, -8032, -5554, -4756, -5491, -6412, -6444, -7097, -8564, -8966, -5837, -959, 844, 5411, 3012, -933]
5284i33n542Mm2k909o70O12K900N650R01n486o376N333J718k560K451K356L84
5267b209j245J419J649k597L300M430k883O75M67k740m33O88j433o43P04l141
5251c992K363L292L19k742n107Q89M757N68m615M82L126n326J381j444j818R035
5235A168N2m307L160o425p736M430N861q53n52K719M455Q93j588o381J798M229
5219I23l528K575M091j042k150N343k763n057o96K684L976L015K708k162k899
5204E018J8j276k365L731k93j103j448l457K140P61n99p24K25J179J864j096j
5187B574r99k51R88k734k129j039K398M128J105M85J450J243L082k347J55n289
5171B820l399J439K208q56J782N830M9m663k224M870K105K775m288l755Q1m811
$$ y = [-933, -6475, -6471, -6513, -9422, -10092, -9480, -6580, -930, -29, -5515, -11891, -6558, -4840, -7400, -4949, -2593, -2209, -3454, -2035, -386, -2983, 317, 4747, 1864, 2539, 3006, 266, -167, 521, -912, -1555, -851, -3992, -1629, 1663, 1982, -760, -5867, -4978, -221, 347, -4268, -3786, -660, -5986, -4605, -6049, -7867, 1168, 1220, -3087, 73, -6352, -14088, -9658, -3797, -4650, -5202, -2483, 1972, 2865, 1277, -5104, -3306, 923, -2605, -30, 4061, 3019, 869, 6212, 3449, -1608, -2304, 380, 4356, 7371, 10079, 7917, 5018, 5036, 3760, 1395, 5126, 4833, 3730, 2282, -1175, 965, 1726, 1127, 403, 628, 1807, 3671, 2575, 2574, 1575, 1324, 2312, -422, -2551, -3590, -1192, 2936, 4041, 4526, 5976, 7219, 10301, 7954, 8109, 2820, -579, 860, 3068, 2212, 3994, 9824, 9873, 5210, 2986, 7856, 9961, 12736, 8448, 4693, 4774, -37]
5155c7r01O19j452l303L227N603O48l872P35L855O266l578k312K675m725K499
5139E947j194n88K485n78n613n299p09l175j332j256M632j592M854N353R33o71
5123B197M737Q66j234j78j273j531l011m189m823r81L147P507M265j478r45r57
5107B119m212K99J575K46J845j569o610J451j169N239K276K053o15M40k800K417
5091B985L803m955n447N67J60q13P92K089J439j030j198R14L139L329K133Q89
5075H796n333l632J295J069k610k892K571O53K651K120N994N69m957n375j057
5060a38k16Q43j439l473l696K33N461L600J473k671r35k211N33j557j528M993
5044g28K821P02n90p25M77J685M670l231n092o45j894K680l033j399J882K041
$$ y = [-37, -938, -319, -1771, -5074, -1847, 3756, 4404, 532, 1267, 5122, 11388, 7810, 5498, 8173, 3448, 5947, 4753, 4165, 6650, 6072, 459, -4840, -5549, -8724, -10056, -11312, -6680, -8272, -3418, 1935, 2868, 2197, 6934, 7800, 6566, 6388, 5115, 3584, 573, -3616, -8439, -9420, -6273, 1234, 5499, 4021, 3076, 2119, -2093, -1794, -219, 27, 1872, 303, -6307, -4856, -6025, -786, 1490, 3543, 2928, 3368, 568, 2985, 6788, 1833, -3614, -3047, -2887, -3700, -2908, -819, 620, -410, -1608, -694, 2445, 5774, 7907, 8796, 3463, -169, 1126, 2195, -415, -3307, -736, -83, 2568, 4688, 10682, 11251, 6294, 919, -138, -354, 489, -950, -4423, -8119, -7886, -2425, 1175, 2648, -23, -958, -3169, -2636, -4193, -5721, -728, 2093, 2795, 2205, 1480, 1957, 3642, 8312, 5081, -11, -656, -2550, 130, -2903, -4302, -2420, -379]
5028c79P76R96J737j89m379j382l87L870k563K92o46j272j054L92J313Q16l618
5011e677M09K023P20J971J90k302m439L066K379L343J502m32K698K855j662n522
4995A122k458L641J910R49m399m525m325M150m910j238N999L901l012Q0Q35k405
4979d685n796p24J0581M217m667j298L406j920l958l620j480k267P0J256O102
4964d783o2q66q75M731J123k017l52j542K995j213k916l802R64N412K947k21R95
4947E18k051j204M603j50J266K446j313m070n283k331M62K698L3L691L01l045
4931c429p15K040o20k571k062R94r62n450R31J086J806j581L930K260q65j442
4915f650N934N622K806n92l577L40m063n46N034j508m90J509k146j739j206K15
$$ y = [-379, 397, 1393, 3130, 2941, -1438, -2820, -3207, 663, -1900, -1608, -2254, -3526, -4580, -4188, -2875, -2059, -5677, -5268, -3245, -2525, -554, -364, -2666, -7105, -4039, -1660, 1683, 3185, 2753, 5451, 8306, 6644, 1122, -1336, 2305, 4215, 5164, 765, -3760, -8085, -3935, -8845, -10083, -4084, -183, -3195, -3115, -2280, -4685, -10481, -11205, -624, 3593, -1074, -2372, 1034, -886, -4844, -8464, -9944, -12211, -12141, -10885, -4783, -4845, -5711, -6586, -1855, -732, -2749, -3101, -4643, -1648, -2861, -5777, -9579, -8615, -3203, -256, -477, 518, -1533, -2737, 1866, 1716, 2982, 5428, 4115, 45, -5238, -7569, -7107, -4409, -4376, -685, -384, -3429, -4144, -2104, -2724, -5295, -7357, -6363, -7325, -12775, -11844, -10758, -8952, -10533, -6603, -4343, -5208, -6650, -716, 4906, 7712, 7120, 3543, 3883, -180, -726, 4308, 2800, 2310, 3819, 1673, -66, -1272, -1057]
4899a057l761k407l607j552K777O362M359k191J091n12k228L317j03l723m393
4884g628L384L06K0Q956J183j518k815l019N081K8l032l576k789L956Q098J270
4868G905k317o506l782n337K526N603K260n997O3L204M090n439l182K25J355Q96
4852d433q72k683K749N098k168J579J372K607k873o10L25l550l877r90o85L491
4836e520N180q27j932N40O36o773L507K587K854L829j238r3Q47m034m436J079
4820c794J220L92l675n43L751j188O42o443j5L998K603K756M901J795o869l482
4804c951J227K806L07O065K349k216l015m608l519K124M95k464J916r06j98R38
4788b650k594p74J46l572j35O508m96j376M425J789j499M6l888l119Q13o831j563
$$ y = [-1057, -4818, -7225, -10832, -12384, -9607, -3245, 1114, -1077, 14, -498, -2726, 591, 488, -3235, -7628, -4244, -3938, -3918, 5038, 6221, 4703, 1888, -1131, 3950, 3978, 946, -2630, -5419, -1463, 6635, 7905, 5588, -918, -4700, -10037, -7511, -1908, 352, -5645, -5582, -2378, 1712, -3727, -6909, -6684, -5329, -4433, -5305, -7988, -5239, -141, -2309, -730, 642, 3249, 376, -234, 91, -3459, -7336, -8326, -9011, -5520, -340, -1167, -3099, -2559, -1923, -8696, -5189, -2602, 252, 4081, 2843, 2750, 3597, -437, -4873, -3794, -2574, -2182, -5857, -6400, -2649, -3837, -3195, -9638, -9653, -5655, -3052, -296, 4605, 6400, -469, -3951, -2724, 82, 389, 6454, 8803, 6587, 3572, -1036, -4555, -2431, -1936, -4400, -2484, -3390, -3588, -2650, -5244, -6018, -5872, -9444, -9579, -3071, -3567, -4943, -518, 1271, -228, -182, -4070, -7189, -6376, -13207, -14770]
4771a4770O253M341j741k030q03N46p17J315o62k77q68K904M748L262M41L92J323
4754C657l019n09K714j112j793r43j042j011k821n734K448J292m51k120K22j544
4738a1766J959Q249K918K586k001l038l012J254N446L155j364k666L695j440m485
4723e10k661j924R88N97n47k3J468N137j603n1l765k317j02j910r37J164K945
4706d051N682J657p27k897L576l776j533M563K995o21j030L06M924m508m400K33
4690C93N309N67l228L08N33K32J945R26M04l844j857J291j128K189j452j625k882
4673a919k389P02J02J446q46j26L551K580J092n311l513J312l95p31n935K102
4657h278J370k308k229K326N61L194L909q98l201J346J756N247K824r45o92k159
$$ y = [-14770, -8517, -4176, -5917, -7947, -8750, -8204, -8921, -7606, -8268, -8545, -9413, -6509, -1761, 1501, 1942, 2334, 3657, 638, 129, 2843, 1731, -62, -1005, -2047, -3058, -5879, -11613, -9165, -7873, -8324, -10444, -10222, -11766, -9807, -1558, 1360, 3946, 1945, -1093, -4105, -2851, 2595, 5750, 4386, 1720, 5415, 3975, -510, -3171, -5095, -4107, -3510, -4057, -4080, -2612, 2525, 922, 871, -2894, -5211, -5313, -7223, -8160, -6996, -4051, 1631, 3288, 2561, -336, 3240, -536, -2069, 2494, 5489, 4868, 3838, 4144, 9068, 4560, 160, 393, 5702, 6269, 3041, 3349, 3882, 4114, 6059, 6985, 7389, 3545, 1688, 2979, 1851, 4040, 2588, 963, -1919, -4308, -3606, -3504, -2058, -2904, -3030, 521, 3101, 4193, -1118, -4631, -3319, -3714, -4445, -10380, -8278, -6908, -9216, -11445, -9119, -8558, -5364, -1455, -2353, -5554, -4208, -2452, 2795, 5619, 4674, 3982, 1823]
4641A823j558j884L612l371J060N087l995o230L83N902P3m965q83J012M820l65
4625E21L321J106K675n91o014j320P38J656q16m515K505q78m049L495M208q01
4609A241J589j268q753j749L189Q58k491L415Q638j26l262J802L574L63k783n968
4593a731l243J970K369L952l775n694m07m01K443j241J051J881q76L049O649L442
4577I438k628l42k321m000N242K299n134R4j437q373K22M321l131k984j933M690
4561e977N273M278J004k241K662j844J621p03j763N253m36m240j178o53p11j989
4545a644k88k222M253j829p214j857K928L836M937J92j277k296J808p1l633n346
4529i723o951k165O046J938L655N294N695j890l146J42J693j394k936j847J657
$$ y = [1823, 265, -1619, 1993, -1378, -318, 4769, 774, -5456, -5073, 829, 902, -4063, -4946, -3934, 886, 521, 3842, 4948, 7623, 7032, 1018, -302, 436, 2092, 1276, -3239, -734, -1612, -5661, -2166, 2042, 1241, 2830, 1562, -7191, -8940, -5751, -4893, -7384, -3969, 4669, 4543, 1281, 3083, 6657, 7020, 4237, -1731, -4974, -3004, -635, 3317, -458, -6152, -6559, -6960, -4517, -5758, -4707, -2826, -3702, -653, 5996, 9438, 6810, 6468, 4147, 147, 5389, 7688, 2554, 2648, 1211, -7162, -6940, -2619, -5750, -8734, -10667, -5977, -704, 3574, 4578, 2337, 4999, 3155, 4776, 4073, 2310, 7563, 7127, 2887, 1709, 1056, 345, -1644, -1932, -4154, 99, -1730, -8944, -10801, -7873, -4037, 900, 1092, -185, -2481, -673, -744, -4377, -9723, -16674, -18839, -12793, -10855, -7200, -1906, 3789, 1899, -1247, -1105, 588, -806, -3742, -5589, -3932]
4514c932L6P98J080K154J406l098M50j506K300n06j730k467J64N77l20n934J737
4497h791N025j249L01j701L351K567L770l849L429N47l222j521o339J573J464
4482d645K645N6J636j625K429L363L789L93K381r330m016J269J332k626q39l67
4466d155l318j393J851M087J303R59p94J566j738L31L29J559O360j633j063k456
4450A795p44o45k600J18p151n317O320J190L9l587l212L035L877P78J823j520
4434e801J493L47M676K648J426p54j33k59j73j880o034o352j918M463P398p46
4418a599l899J619K238j910l874M23J886K617l187m254j624O552J449K664p69
4403a668j447J533L467J449n746n142M84K155r22m833Q04p23p0j564L481N796
$$ y = [-3932, -3896, -3098, -2018, 136, 1542, -1556, -1106, -2612, -312, -818, -2548, -5015, -4851, -4274, -4594, -10528, -8791, -3766, -5015, -4714, -6415, -3064, -497, 3273, -576, 2853, 3400, 178, -1343, -7682, -6109, -4645, -2000, -1944, -308, -1933, 496, 3859, 7648, 8041, 10422, 1092, -2924, -1655, -323, -2949, -3788, -4155, -7473, -8866, -7015, -2928, -1625, -666, -1460, 106, -1632, -1301, -972, 587, 6947, 5314, 4251, 1795, 1051, 406, -2194, -2076, -9227, -14544, -8224, -7034, -6995, -10582, -13794, -10759, -6882, -6104, -4281, -5801, -4308, -3961, 715, 3363, 4789, 4035, 3902, 3643, 3470, 1590, -4444, -10796, -12714, -8251, -853, -1599, -5498, -3879, -1641, -3551, -7425, -7002, -5116, -2499, -5686, -9940, -11564, -5012, -3563, -899, -1668, -3115, -1582, 1885, 3334, -2412, -7554, -7070, -4915, -5837, -10670, -9866, -10589, -10659, -12223, -8742, -2946]
4387b946q84K495J495k82K607N00k715l583j255m33L135k473k609k661o69K147
4371h131L665O38L081k44j836K304k937n70O361j215m832l685K228K701M692k64
4355A956J569l14o406N53N207M049r03m263p81p857l963Pp39M544K612j630k897
4338i256m410L891J042L083r17N359K613l027j163m69j498K113n073j781j581
4323a1074p169N706J4872N143n395m412M17r3J054l15l219l095K116L146j208
4308c526O332K643J412J748J465p732n508l504N106l33l449r26K947j083P11l27
4292d024L414M251j115k422K439K396K3j304R26m972j411m19J145k147m370k549
4276a0139K100R55k045K941q73l110J030L155J271J063l583l254o25n80l641L535
$$ y = [-2946, -3830, -1335, 160, -122, 2485, 2985, 270, -3313, -4568, -5001, -1866, -4339, -6948, -9609, -10278, -8131, -4466, -3828, -747, -991, -2827, -523, -3460, -4030, 2331, 1116, -3716, -7401, -5173, -2472, 2220, 1956, 3525, 3211, -3195, -2642, 2565, 6614, 5711, 1448, 667, -7190, -11153, -11146, -11885, -7341, -4729, -6359, -9256, -13666, -9775, -8733, -5650, -6567, -1208, 1405, -1622, -2785, -3254, -4752, -2639, -7712, -9493, -11074, -18243, -12537, 2335, 7478, 2083, -2329, -1912, -2005, -951, -1266, -4485, -7580, -5464, -2318, -3526, 2806, 5449, 6861, 8609, 10074, 2342, -3166, -6670, -1564, -1897, -5346, -6272, -3325, -4408, -3697, -4024, -610, 3641, 2526, 104, 2543, 4939, 4962, 3658, 4584, -388, -1799, -2218, -1073, -3220, -7590, -10139, -8039, -7084, -9129, -6188, -7061, -10171, -9141, -5986, -4715, -3652, -7235, -10489, -11114, -11694, -15335, -11800]
4260a1800O796N711N188J572l00k896k313k30J89k207j940J203M881K77R35j961
4244C105k673k31l39j915j680q87M518Q27J588R65l136j223N64M441K128J74j170
4227E056l662l737n73P850K702m689r330K072J68j169j498k651o23M590M381L878
4211B765m166n844M357M061L042k94j134K360O65o77m09k881j779J09O821L618
4195A0614k196m996J628l79j436m704j200j18M44k4j363q43j331J412L137j049
4179b404l223k182R42o59J377M040L718K246l417m171m44K397k559q36o34J221
4163d588k725L618k62l560K79K000M597n07O15J07j82Q83l269k867K173K954M117
4146C383k732n002k22P14K931M368l002o373J788K976m23L404n106n860J137M690
$$ y = [-11800, -5004, 707, 5895, 7467, 7167, 4271, 1958, 1728, 1917, -290, -2230, -1027, 3854, 4131, 5066, 3105, 432, 201, -138, -2053, -3733, -4620, -102, 725, 2313, 3278, 142, -1081, -517, 3924, 6052, 6226, 5056, 1394, -2343, -2916, 4934, 7636, 2947, -6383, -4311, -4143, -5312, -6810, -9461, -10084, -5494, -1113, 2765, -1401, -7245, -2888, 1173, 4215, 3921, 2787, 5147, 5812, 5135, 4726, 1845, 66, 175, 6996, 10614, 8418, 3422, 5050, 4671, 3235, -1469, -2669, -2787, -2343, -2367, -3730, -4573, -5904, -4492, -1355, -2404, -5627, -7809, -6867, -7526, -6149, -2109, 1609, 3855, 438, -3733, -4177, -1780, -4339, -5175, -5809, -4588, -7313, -3695, -3957, -7517, -7238, -5238, -641, -1148, -533, -426, -608, 275, -2994, -5861, -3688, -734, 3383, 651, -4351, -4573, -3859, -928, 3440, 438, -5935, -4147, -1171, -1594, 1810, -3296, -9156, -8019, -3329]
4130c329K545K816j428n28j368L766M69j290J295j344p040N17N797J62k544k076
4114c580k662O555J321M536M581n559k772n625J10K619L88K383k92K455K312o70
4098F100k674M315j460n333l551O09j313M56M346J019j43k604j712l27j452l104
4082f828P62m2j424N993J164L419O36l437M213M288p77k104k215l166m559j531
4066e608R13P134J994J095L064n557k14o51l749j540L828M788J775k496m146n81
$$ y = [-3329, -784, 2032, 604, 76, -1292, 2474, 2943, 1653, 2948, 1604, -5436, -4919, 878, 1040, -1504, -3580, -6242, 313, 1634, 6170, 10751, 5192, 2420, -3205, -3095, -476, -88, 2295, 2003, 4458, 6770, 6100, 3426, 7741, 6281, 948, -2603, -1994, -3307, -2851, 1495, 2514, 2371, -233, -1945, -2272, -3724, -6828, -6066, -6108, -7532, -1539, -375, 3044, 3680, 243, 4456, 8744, 7967, 5863, 3648, 482, -4077, -5608, -4695, 2439, 4433, 5528, 8592, 3035, 2821, 2170, -1579, -3119, 709, 5497, 7272, 4776, 630, 49]
$$ [...]
##END NTUPLES=NMR SPECTRUM
##END=
