##TITLE=Analysis number 318697
Compound Code tl 00698
Book Reference 461/199/10
Project Code adrs
Chemist Name toml
##JCAMPDX= 6.0         $$ Bruker NMR JCAMP-DX V2.0
##DATA TYPE= NMR SPECTRUM
##DATA CLASS= NTUPLES
##ORIGIN= Bruker BioSpin GmbH
##OWNER= nmr
$$ XWIN-NMR		Version 3.5
$$ Mon Apr 10 13:23:40 2006 GMT Daylight Time (UT+1h)  MAYBRIDGE\nmr@NMR_250MHZ
##.OBSERVE FREQUENCY= 250.131544655141
##.OBSERVE NUCLEUS= ^1H
##.ACQUISITION MODE= SIMULTANEOUS (DQD)
##.ACQUISITION SCHEME= undefined
##.AVERAGES= 16
##.DIGITISER RES= 18
##SPECTROMETER/DATA SYSTEM= dpx250
##.PULSE SEQUENCE= zg30
##.SOLVENT NAME= CDCl3
##.SHIFT REFERENCE= (INTERNAL, CDCl3, 0, 16.522)
##AUDIT TRAIL= $$ (NUMBER, WHEN, WHO, WHERE, WHAT)
$$ ##TITLE= Audit trail, XWIN-NMR		Version 3.5
$$ ##JCAMPDX= 5.01
$$ ##ORIGIN= Bruker BioSpin GmbH
$$ ##OWNER= nmr
$$ C:\u/data/dgb/nmr/ADRS/2420/pdata/1/auditp.txt
$$ ##AUDIT TRAIL=  $$ (NUMBER, WHEN, WHO, WHERE, WHAT)
(   1,<2006-04-10 13:23:19.31 +100>,<MAYBRIDGE\nmr>,<NMR_250MHZ>,
      <created by zg, POWCHK disabled, PULCHK disabled
       configuration hash MD5:
       84 BC 41 DB A1 6E 1D 46 DA 25 12 A5 C1 ED C5 3A
       data hash MD5: 64K
       92 22 4B 1B 3C FD 7B EA EE 82 35 E4 25 F2 C5 41>)
(   2,<2006-04-10 13:23:31.92 +100>,<MAYBRIDGE\nmr>,<NMR_250MHZ>,
      <Start of raw data processing
       ef LB = 0.3 FT_mod = 6 PKNL = 1 SI = 32K 
       data hash MD5: 32K
       24 5A B5 4B C5 48 D5 5A 91 B9 89 FD A0 11 BF 7B>)
(   3,<2006-04-10 13:23:33.53 +100>,<MAYBRIDGE\nmr>,<NMR_250MHZ>,
      <apk 
       data hash MD5: 32K
       0F 86 59 86 BB 0D B4 D5 1A 87 C4 83 83 18 3D 7E>)
(   4,<2006-04-10 13:23:34.37 +100>,<MAYBRIDGE\nmr>,<NMR_250MHZ>,
      <abs ABSG = 5 
       data hash MD5: 32K
       87 33 CC F8 22 E7 1F EB 76 89 CA 5E 79 83 92 96>)
$$ ##END=
$$ 
$$ hash MD5
$$ 6B DF EE 6B 22 0A F6 A0 9F 3D 91 3E CE BA 91 D5
##$RELAX= 
##$RELAX= 
##$RELAX= 
##$RELAX= 
##$RELAX= 
##$RELAX= 
##$RELAX= 
$$ Bruker specific parameters
$$ --------------------------
##$DU= <C:\u>
##$EXPNO= 2420
##$NAME= <ADRS>
##$PROCNO= 1
##$TYPE= <nmr>
##$USER= <dgb>
##$AMP= (0..31)
100 100 100 100 100 100 100 100 100 100 100 100 100 100 100 100 100 100 
100 100 100 100 100 100 100 100 100 100 100 100 100 100 
##$AQSEQ= 0
##$AQ_mod= 3
##$AUNM= <au_zg>
##$AUTOPOS= <46 >
##$BF1= 250.13
##$BF2= 250.13
##$BF3= 250.13
##$BF4= 250.13
##$BF5= 500.13
##$BF6= 500.13
##$BF7= 500.13
##$BF8= 500.13
##$BYTORDA= 1
##$CFDGTYP= 0
##$CFRGTYP= 5
##$CHEMSTR= <none>
##$CNST= (0..31)
1 1 145 1 1 1 1 1 1 1 1 1 1 1 1 1 1 1 1 1 1 1 1 1 1 1 1 1 1 1 1 1 
##$CPDPRG= <>
##$CPDPRG1= <>
##$CPDPRG2= <>
##$CPDPRG3= <>
##$CPDPRG4= <mlev>
##$CPDPRG5= <mlev>
##$CPDPRG6= <mlev>
##$CPDPRG7= <mlev>
##$CPDPRG8= <mlev>
##$CPDPRGB= <>
##$CPDPRGT= <>
##$D= (0..31)
0 1 0 0 0 0 0 0 0 0.06 0 0 0 0 0 0 0.0002 0 0 0 0 0 0 0 0 0 0 0 0 0 0 
0 
##$DATE= 1144671798
##$DBL= (0..7)
120 120 120 120 120 120 120 120 
##$DBP= (0..7)
150 150 150 150 150 150 150 150 
##$DBP07= 0
##$DBPNAM0= <>
##$DBPNAM1= <>
$$ [...]
##$SUBNAM7= <"">
##$SUBNAM8= <"">
##$SUBNAM9= <"">
##$SW= 20.6930455092707
##$SWIBOX= (0..15)
0 0 3 0 0 0 0 0 0 0 0 0 0 0 0 0 
##$SW_h= 5175.983436853
##$TD= 65536
##$TD0= 1
##$TE= 295.16
##$TE2= 300
##$TE3= 300
##$TEG= 300
##$TL= (0..7)
0 120 120 120 120 120 120 120 
##$TP= (0..7)
150 150 150 150 150 150 150 150 
##$TP07= 0
##$TPNAME0= <>
##$TPNAME1= <>
##$TPNAME2= <>
##$TPNAME3= <>
##$TPNAME4= <>
##$TPNAME5= <>
##$TPNAME6= <>
##$TPNAME7= <>
##$TPOAL= (0..7)
0.5 0.5 0.5 0.5 0.5 0.5 0.5 0.5 
##$TPOFFS= (0..7)
0 0 0 0 0 0 0 0 
##$TUNHIN= 0
##$TUNHOUT= 0
##$TUNXOUT= 0
##$USERA1= <user>
##$USERA2= <user>
##$USERA3= <user>
##$USERA4= <user>
##$USERA5= <user>
##$V9= 5
##$VALIST= <valist>
##$VCLIST= <CCCCCCCCCCCCCCC>
##$VD= 0
##$VDLIST= <DDDDDDDDDDDDDDD>
##$VPLIST= <PPPPPPPPPPPPPPP>
##$VTLIST= <TTTTTTTTTTTTTTT>
##$WBST= 1024
##$WBSW= 4
##$XGAIN= (0..3)
0 0 0 0 
##$XL= 0
##$YL= 0
##$YMAX_a= 518783
##$YMIN_a= -488047
##$ZGOPTNS= <>
##$ZL1= 120
##$ZL2= 120
##$ZL3= 120
##$ZL4= 120
##$ABSF1= 16.522
##$ABSF2= -4.171173
##$ABSG= 5
##$ABSL= 3
##$ALPHA= 0
##$AQORDER= 0
##$ASSFAC= 0
##$ASSFACI= 0
##$ASSFACX= 0
##$ASSWID= 0
##$AUNMP= <proc_1d>
##$AZFE= 0.1
##$AZFW= 0.1
##$BCFW= 0
##$BC_mod= 0
##$BYTORDP= 0
##$COROFFS= 0
##$CY= 12.5
##$DATMOD= 1
##$DC= 0
##$DFILT= <>
##$DTYPP= 0
##$F1P= 14.0000005364418
##$F2P= -0.99999901652339
##$FCOR= 0.5
##$FTSIZE= 32768
##$FT_mod= 6
##$GAMMA= 0
##$GB= 0
##$INTBC= 1
##$INTSCL= 1
##$ISEN= 128
##$LB= 0.3
##$LEV0= 0
##$LPBIN= 0
##$MAXI= 10000
##$MC2= 0
##$MEAN= 0
##$ME_mod= 0
##$MI= 0
##$NCOEF= 0
##$NC_proc= -2
##$NLEV= 6
##$NOISF1= 0
##$NOISF2= 0
##$NSP= 0
##$NTH_PI= 0
##$NZP= 0
##$OFFSET= 16.522
##$PC= 1
##$PHC0= 169.3923
##$PHC1= 4.988358
##$PH_mod= 1
##$PKNL= yes
##$PPARMOD= 0
##$PSCAL= 4
##$PSIGN= 0
##$REVERSE= no
##$SF= 250.13
##$SI= 32768
##$SIGF1= 0
##$SIGF2= 0
##$SINO= 400
##$SIOLD= 32768
##$SREGLST= <1H.CDCl3>
##$SSB= 0
##$STSI= 32768
##$STSR= 0
##$SW_p= 5175.98343685301
##$SYMM= 0
##$S_DEV= 0
##$TDeff= 65536
##$TDoff= 0
##$TI= <Analysis number 999999
Compound Code 99
Book Reference 9
Project Code 9>
##$TILT= no
##$TM1= 0
##$TM2= 0
##$TOPLEV= 0
##$USERP1= <user>
##$USERP2= <user>
##$USERP3= <user>
##$USERP4= <user>
##$USERP5= <user>
##$WDW= 1
##$XDIM= 32768
##$YMAX_p= 346369726
##$YMIN_p= -25315
$$ End of Bruker specific parameters
$$ ---------------------------------
##NTUPLES= NMR SPECTRUM
##VAR_NAME=  FREQUENCY,     SPECTRUM/REAL,   SPECTRUM/IMAG
##SYMBOL=    X,             R,               I
##VAR_TYPE=  INDEPENDENT,   DEPENDENT,       DEPENDENT
##VAR_FORM=  AFFN,          ASDF,            ASDF
##VAR_DIM=   32768,         32768,           32768
##UNITS=     HZ,            ARBITRARY UNITS, ARBITRARY UNITS
##FACTOR=    0.157963299565203, 1,           1
##FIRST=     4132.6476996994, 0,             0
##LAST=      -1043.33573715361, 0,           0
##MIN=       -1043.33573715361, -25315,      0
##MAX=       4132.6476996994, 346369726,     0
$$ Real data points
##PAGE= N=1
##DATA TABLE= (X++(R..R)), XYDATA
$$ [...]
19474A8125O859J1307l74n341L260J400j865k774M852k743n111J2244N815o912
19460C8742k491M626K946j775M232n021q706k037O244O74n183n631N090N992L26
19445C8028P41L839m918l257P027J447j678n098n75K601m54o619J683N474L396
19430D1637p349N12j022K051M533J739J945j312m767l281j535l581L209M943N477
19415D3199M604j572j07N933P42n990m793j22J836k772k147M835O652N037P156
19400F2491L860j107j0223l820l881j527k089N080m9o244j238J5457P880j016
19386F3574n442K032N015P327n873p282l045K689J692J1603O969R41L577L228
19372H7005Q555K4004J4007L038N44J874L061j929j6581j1599m604j330N38J684
$$ plain form
19474 18125 24984 36291 35917 30576 33836 35236 33371 30597 35449 32706 27595 39839 45654 38742
19460 38742 36251 40877 43823 42048 46280 41259 32553 30516 36760 37434 32251 26620 31710 37702 38028
19445 38028 38769 42608 37690 34433 41460 42907 41229 36131 35556 38157 37703 31084 32767 38241 41637
19430 41637 34288 34800 33778 35829 40362 42101 44046 42734 37967 34686 33151 29570 32779 37722 43199
19415 43199 47803 46231 46124 52057 52799 46809 42016 41894 43730 40958 38811 43646 50298 55335 62491
19400 62491 66351 65244 55021 51201 47320 45793 43704 48784 48735 42491 41253 56710 64590 63574
19386 63574 58132 60164 65179 72506 66633 59351 56306 58995 60687 72290 79259 80200 83777 87005
19372 87005 95560 119564 133571 136609 137153 139027 142088 140159 123578 111979 107375 106045 106583 108267
19358A08267M471j500J1145K0997k732k310O083j261J118o23k814K078M898k320
19344A45497O493J2106J3476J488k101m576R030J509k520K688O529O091O553J132
19330B03395R343J213J6o397j2664j06P416j261l257m428r73M541J4766K0468
19316B32072J3874K0983L3014K6457J0523L953m111r198j2964k1627j9484n731
19304B67761l775n544k190r47k018P741O741R276J5370J3503J6877J0051q5n435
19290C27326L187Q521J2692J3966J5410J8834P548J7320K9254L9926O9888J08430
19278F72302J38213J12463M5577L3295K9846n5498j06185o9698j3635K1414O4736
19267H72830Q8826J07653J92905L21578M46453M26828L0934m12599l59018j79116
$$ plain form
19358 108267 112738 111238 122383 143380 140648 138338 144421 143160 144278 143655 140841 142919 147817 145497
19344 145497 151990 164096 177572 179060 176959 172383 181413 182922 180402 183090 189619 195710 202263 203395
19330 203395 212738 213951 213967 207570 194906 194800 202216 200955 197698 193270 192297 196838 211604 232072
19316 232072 245946 266929 299943 326400 336923 340876 336765 327567 314603 292976 273492 267761
19304 267761 263986 258442 256252 255305 253287 261028 267769 277045 292415 305918 322795 332846 332761 327326
19290 327326 330513 339034 351726 365692 381102 399936 407484 424804 454058 493984 563872 672302
19278 672302 810515 922978 968555 1001850 1031696 976198 870013 800315 786680 808094 872830
19267 872830 961656 1069309 1262214 1583792 2030245 2457073 2488007 2075408 1716390 1537274
19257A537274o9952r829J389K0139O6409J09005J54302K21686L25073M92451P80847
19246C628794J292805K155742L251288L886363K813272N22582M07635K15139k616345
19237A5557275m083774k858548j599597q91846n08019k13890P5754M24064R06312
19228F807731J580641K306392K366149Q36341r31865k218268k044310j116003
19220G586808m55991L3802N10195J027812J579408K102285K478080K092439P87595
19211A7742433k50175k35090K52570k92560m20106l66863p22332N02762J768002
19202A7978641J214668j569280l303221k578015j546756r19089n57752k73812
19194H445384j7348K86960O42772J109799J906051L236988N122581O933453P021461
$$ plain form
19257 1537274 1467322 1457493 1458882 1479021 1545430 1654435 1808737 2030423 2355496 2847947 3628794
19246 3628794 4921599 7077341 10328629 14214992 17028264 17550846 17958481 18173620 15557275
19237 15557275 11473501 8614953 7015356 6123510 5615491 5401601 5477355 5901419 6807731
19228 6807731 8388372 10694764 13060913 13897254 12965389 10747121 8702811 7586808
19220 7586808 7130817 7164619 7674814 8702626 10282034 12384319 14862399 16954838 17742433
19211 17742433 17492258 17257168 17509738 17217178 16797072 16430209 15707877 16210639 17978641
19202 17978641 19193309 17624029 14320808 11742793 10196037 9276948 8719196 8445384
19194 8445384 8428036 8714996 9357768 10467567 12373618 15610606 20733187 27666640 34688101
19185C4688101M742066J421896k99785j596111n016927p739613o246370l823938
19177A6129319k333911j512426r72349n89186k86586K7646L97194R29959J688689
19168A3478349K580488K881638J322249j865635k425652q01750Q09917J709698
19160A7689302J461763J014203J708652J564133k404j783320l115251k630392
19152A5906686j694474j251709j032781r44463n98792q3511N03388J257640K042967
19143A4104951K230754R44569n13754j570166k623545j938448j046476m85965
19135I101920j07401K63885P57714J532514K723816M130428M763771L070301J67741
19126B6404689q36637j110604l196518m568097l617753k236958j384785r21659
$$ plain form
19185 34688101 39430167 40852063 40552278 38956167 33939240 26199627 19953257 16129319
19177 16129319 13795408 12282982 11310633 10721447 10434861 10462507 10859701 11789660 13478349
19168 13478349 16058837 18940475 20262724 18397089 15971437 15169687 15979604 17689302
19160 17689302 19151065 20165268 21873920 23438053 23435649 21652329 18537078 15906686
19152 15906686 14212212 12960503 11927722 10983259 10384467 10300956 10804344 12061984 14104951
19143 14104951 16335705 17280274 16766520 15196354 12572809 10634361 9587885 9101920
19135 9101920 8994519 9258404 10016118 11548632 14272448 18402876 23166647 26236948 26404689
19126 26404689 25568052 24457448 21260930 16692833 13075080 10838122 9453337 8531678
19118H531678o45832m73852l58837k82719k52670k25806j74604j35402q1766L4446
19108E934636K07052L89035M52180J29270n52327p50912n46213l49914k30233
19099D682574j66403j13441l9565M0010N2080o1901j69214j04891o4118j66895
19089C888236k60253k10085j38732j00791q6636q7523p7493o7843o5929o6535
19079B726416o2461n7526o7480o6376o3105o1937o5022n8562n3528m7155m8551
19068B074713l9153m0651l6681l0605k7302j6737j7574o993o520o274n107n410
19056A835706l0014m0979n0411n3363n7327n6301m3578k9751k6552l2194k3485
19045A391751k0394j8678j1020j4066k0008k0879j4901j8387k1753j7581j3841
$$ plain form
19118 8531678 7885846 7411994 7053157 6770438 6517768 6291962 6117358 5981956 5900190 5934636
19108 5934636 6141688 6530723 6982903 7112173 6559846 5808934 5262721 4912807 4682574
19099 4682574 4516171 4402730 4363165 4403175 4455255 4393354 4224140 4119249 4055131 3888236
19089 3888236 3627983 3417898 3279166 3178375 3091739 3004216 2926723 2858880 2792951 2726416
19079 2726416 2663955 2606429 2538949 2472573 2409468 2347531 2282509 2223947 2170419 2123264 2074713
19068 2074713 2035560 1994909 1958228 1927623 1900321 1883584 1866010 1859017 1852497 1846223 1841116 1835706
19056 1835706 1805692 1764713 1714302 1660939 1603612 1547311 1503733 1473982 1447430 1415236 1391751
19045 1391751 1371357 1352679 1341659 1327593 1307585 1286706 1271805 1253418 1231665 1214084 1200243
19034A200243n307j974p974j7360j7632j5713j6104k4500l2047l3337k7084k2753
19022I78458j9881j3901j1298n645m455K896j2684j5379k0078j6686k1007k0402
19010H19938j3891j0003j0259j3192j918K723j521O890J0881q62j2819j8097j9231
18997G38639k1233k3940k5724j4342l361n983r875q944o250p466j0551j1773r364
18984E79833j4519j5480q278J808k072r672l535m694k945j3478j8527j2159r628
18971D66654r618l850l826j9017j5722K593J82m460q695o715M50M510j0575p584
18957C84327m445P39N2j1803j2686J801K635l931j975j229j4868j4609r911n068
18943C09029n757q145p423p750l402R176L543l434L927N433j762p38k063r046
$$ plain form
19034 1200243 1194936 1192962 1184988 1167628 1149996 1134283 1118179 1093679 1061632 1028295 1001211 978458
19022 978458 958577 944676 933378 927733 923278 926174 913490 898111 878033 861347 840340 819938
19010 819938 806047 796044 785785 772593 770675 773398 771877 778767 789648 788786 775967 757870 738639
18997 738639 717406 693466 667742 653400 650039 644056 634181 625237 618987 611521 600970 589197 579833
18984 579833 565314 549834 541556 543364 541292 531620 528085 523391 520446 506968 488441 476282 466654
18971 466654 457036 453186 449360 430343 414621 417214 417396 412936 404241 397526 397976 402486 391911 384327
18957 384327 379882 380621 380673 368870 356184 357985 360620 356689 354714 353485 338617 324008 314097 309029
18943 309029 303272 295127 287704 279954 276552 285728 289271 285837 289764 295197 293435 292697 290634 281588
18929B81588j5078q380J554J785r20N62l12M458J103j0786l288p384p040p362
18915B30500p115k015R86J63r490j715o296p246l893L265O435Q801l554p461o385
18900A94980l59N87J768N287J1234R633Q463k193m528m191m448l358j2938q700
18886A91237k897n313m300j815l084M085N799Q38O63M717m112m715n848q76J161
18871A75540M312L175K997J2226Q933J9138K3301K2005K6077K5360K0621K2299
18859C65984P367r131j6178l0647l2617j7677m770l725M836P772O079P148P243
18846B91684Q786P875J307R065k557r138n885N757N910M041K0800K4855J0601
18833C73101K85j5259j2010K349P219k837j467L029J943j4393l419O307J2597
$$ plain form
18929 281588 266510 258130 259684 261469 260549 261111 260799 265257 266360 255574 252286 244902 237862 230500
18915 230500 223385 221370 222356 222519 213029 211314 205018 197772 193879 197144 203579 212380 208826 201365 194980
18900 194980 194621 195208 196976 202263 213497 223130 231593 229400 224872 220681 216233 212875 199937 191237
18886 191237 188340 183027 178727 176912 173828 177913 183712 184550 185213 189930 185818 181103 175255 174379 175540
18871 175540 179852 183027 186024 198250 207183 226321 249622 271627 297704 323064 343685 365984
18859 365984 373351 364220 348042 317395 284778 267101 262331 258606 263442 271214 277293 284441 291684
18846 291684 300470 308345 309652 318717 316160 307022 301137 306894 312804 316845 337645 362500 373101
18833 373101 373386 358127 346117 348466 355685 352848 351381 354410 356353 341960 338541 344848 357445
18820C57445Q732O072J2717Q34j0038o910J646K085j767K012J171N09J8444J6662
18806D09614J5949K0705J8299J6719K5652J2409k1201k5987j6885j4017j0610
18795D30647l269M336O138O222J8333K0584J9778L7345M0687N5771R0367J34263
18783H61202J48626O3640o2032n7120n0731p8687m2972j657L7757O3687P0235
18772I51948J01651J74567K95763M83688P42909R55644Q20349Q0177k59799J16866
18762D463763K08993l89371q41601n66163j92292J13644L78824N47208L90865
18753D113870j89448n54641l86561j45500J2607P2571R7365J60295K40669L21921
18743C743148M35308O20391Q95509J333213K109269L425281N153986O499760O147047
$$ plain form
18820 357445 366177 372249 384966 385800 375762 368852 370498 372583 370816 372828 373999 374508 392952 409614
18806 409614 425563 446268 464567 481286 506938 519347 498146 472159 455274 441257 430647
18795 430647 427378 431714 437852 444074 462407 482991 502769 540114 580801 636572 726939 861202
18783 861202 1009828 1073468 1011436 954316 903585 824898 781926 780269 818026 881713 951948
18772 951948 1053599 1228166 1523929 2007617 2750526 3706170 4526519 4606696 4346897 4463763
18762 4463763 4672756 4283385 3441784 2875621 2683329 2796973 3175797 3723005 4113870
18753 4113870 3924422 3369781 2983220 2837720 2850327 2922898 3020263 3180558 3421227 3743148
18743 3743148 4178456 4798847 5694356 7027569 9136838 12562119 17716105 24215865 30362912
18734C0362912M706757N488392M717293l76694n852337q772621p692512m727334
18726A7853856k610510j370293n70960P1889R44832K053916K798557K317148J71001
18717B1659436n94885O33483P92825j290070k681966j575538J8585J801605L986247
18708B2749722N879770N487202Q76512l800007l024492n7321J245094m4070j062547
18699B8249863l90371j356715l506189l071571j330604L73104K161340L954255
18691B5083112M418410J308053m567361n515397l473457j870258r63941m76381
18683A3942780k16902J91263R54511K106332L617626N237483O146844N474104
18675C7454041N086893K895944m334132r382320q142738n027905k980550j885707
$$ plain form
18734 30362912 35069669 40558061 45275354 44898660 39046323 30273702 22581190 17853856
18726 17853856 15243346 13873053 13302093 13373982 14318814 16372730 19171287 21488435 21659436
18717 21659436 21064551 21698034 22490859 21200789 18518823 16943285 16961870 18763475 22749722
18708 22749722 28629492 34116694 34993206 31193199 28168707 28111386 29356480 29312410 28249863
18699 28249863 27859492 26502777 22996588 19925017 18594413 18967517 21128857 25083112
18691 25083112 29501522 30809575 26242214 20726817 17253360 15383102 14419161 13942780
18683 13942780 13725878 13917141 14871652 16977984 20595610 25833093 31979937 37454041
18675 37454041 42540934 45436878 41102746 31720426 23577688 18549783 15569233 13683526
18667A3683526j312520r76120p79265o30689n23874m39182l63409k87949k17196
18658H153322j55565j08515q4688q9404j36055k02062j33379j08991k25409k14522
18648F694732n3840J26617M13737P65939Q55063J74088j096616j207756p66342
18639E905622m67111l24974k43931j91741j54004j13796r8258p2557m9854j3322
18629D176074K7408N9726K0624j32963k49977k40734j80886j26252r6280r4338
18619C162402q7704q3228o8183o4374p2378n9209n2362m4406l8897k6027j6613
18608B549021j0066j2125k7293m0556n2409o5241p2847p7257o3820m4291l5258
18597B047858l0814l6878l0009k6003k2860k0141k2799k7984k7523l8602l4615
$$ plain form
18667 13683526 12371006 11394886 10615621 9984932 9461058 9021876 8658467 8370518 8153322
18658 8153322 7997757 7889242 7804554 7715150 7579095 7377033 7243654 7134663 6909254 6694732
18648 6694732 6640892 6767509 7181246 7947185 8802248 8976336 7879720 6671964 5905622
18639 5905622 5438511 5113537 4869606 4677865 4523861 4410065 4311807 4239250 4189396 4176074
18629 4176074 4203482 4263208 4283832 4150869 3900892 3660158 3479272 3353020 3256740 3162402
18619 3162402 3074698 2991470 2923287 2858913 2786535 2727326 2674964 2630558 2591661 2565634 2549021
18608 2549021 2538955 2526830 2499537 2458981 2406572 2341331 2268484 2191227 2127407 2083116 2047858
18597 2047858 2017044 1980166 1950157 1924154 1901294 1881153 1858354 1830370 1802847 1764245 1729630
18586A729630l7010l0734j8670j7963j0457j387p306j5841k4266k8407k6682j3640
18574A497267j6300j8646k4445k7719k5281k6536k6966k2532j7258j4284j2451
18563A264849j8670k6416l5749k4438k0746j8736j9685j7915k2373r656l542P988
18551A054911J7015P093N703q6j6234l0036m5172n1562m3053k4293j6468j6877
18539H40941j1926n681q606j1020j0380j6714k3819k0809j9493j5093j3042p957
18527F76401n836r643r552p491o011l977j3570j7933j2986m809l218p057j4165
18514E60153j0075p957r640q814j0055j1639j1300o078l763o234j0021l979l418
18501D57180j7627k138k599r894q950q45m057k983r110j1907m584j3137j0982
$$ plain form
18586 1729630 1692620 1661886 1643216 1625253 1614796 1613409 1606103 1590262 1565996 1537589 1510907 1497267
18574 1497267 1480967 1462321 1437876 1410157 1384876 1358340 1331374 1308842 1291584 1277300 1264849
18563 1264849 1246179 1219763 1184014 1159576 1138830 1120094 1100409 1082494 1060121 1050465 1046923 1054911
18551 1054911 1071926 1079019 1084722 1084636 1068402 1038366 993194 941632 898579 874286 857818 840941
18539 840941 829015 823334 814728 803708 793328 776614 752795 731986 712493 697400 684358 676401
18527 676401 670565 660922 651370 643879 637868 633891 620321 602388 589402 584593 581375 574318 560153
18514 560153 550078 542121 532481 523667 513612 501973 490673 484595 480832 474598 464577 460598 457180
18501 457180 439553 437415 434816 424922 415972 415127 411070 408087 398977 387070 382486 369349 358367
18488C58367l097m420l015j0766k448J68M657Nn651j0763p363j3608q568l485
18474B90013J82o29m029r421n217l925m944K18K532k907o810n199j285o569k587
18459B39423p251j3166J49J21q3j729L671n011k935l793n144o39k106l155r044
18444A89308N529M667j118J04m918j0105K495O805n418m621m460j2954j3934l029
18430A48351Q059N690J771l21q518m752N768K167q062p806J069nm224q872m942
18415A25373m775p322O828L847J416k876l311J508l058o265j1738j287N40m071
18401I4809k908O718K528o28K03n948r71N623o722m110o305Q4M395Q139J182j014
18385I5075k126J370K764l837p52q525q191p922r50P725P519J372l306o261j815
$$ plain form
18488 358367 355270 350850 347835 337069 334621 334789 339446 339451 333800 323037 315674 302066 293498 290013
18474 290013 290195 289566 285537 276116 270899 266974 262030 262248 264780 261873 255063 249864 248579 242010 239423
18459 239423 232172 219006 219155 219276 219193 217464 221135 216124 213189 209396 204252 203613 201507 198352 189308
18444 189308 194837 199504 198386 198490 193572 183467 185962 192767 187349 182728 178268 165314 151380 148351
18430 148351 156410 162100 163871 163550 155032 150280 156048 158215 150153 142347 143416 143411 139187 130315 125373
18415 125373 120598 113276 120104 123951 125367 122491 119180 120688 117630 111365 99627 98340 98880 94809
18401 94809 91901 98619 101147 100519 100722 94774 93803 99426 92704 88594 82289 82373 86768 94907 96089 95075
18385 95075 92949 94319 97083 93246 92494 83969 75778 67856 66906 74631 82150 83522 80216 73955 72140
18370G2140L421q9J500j275j0803m689k195m425o554n82N790r47M131J88n671
18355D9940M10L887K509J1893K121r416j0492J548J455j739j660n473j597l408
18341C9978M21o539K429j692j205j554k086q81J274L738L995N274K274J672J702
18326D8800p43m852k060M648n251o846K22L606j041J203j620l240P78j64J88l535
18310C0093j929N524j103p017k101N366J495O45p321P89N028L385O596L730j547
18295D1633l009l497q917q42j145j278k291p51J2420l219o526Q106j272p897j09
18280B1406R012K863l505J175L398J997J387n658k242o70L10o119k207L888L29
18265B5364K442j952m351m61q21M423J066j70L560N701J016o409n01k064J155
$$ plain form
18370 72140 75561 75472 76972 75697 64894 60205 58010 53585 47031 46449 52239 51292 55423 55611 49940
18355 49940 50350 54237 56746 68639 70760 61344 50852 52400 53855 52116 50456 44983 43386 39978
18341 39978 40399 33860 36289 34597 33392 31838 29752 28871 30145 33883 37878 43152 45426 47098 48800
18326 48800 48057 43205 41145 45793 40542 33696 33918 37524 36483 37686 36066 32826 33604 33440 33628 30093
18310 30093 28164 33688 32585 25568 23467 28833 30328 30973 23652 24441 29469 32854 39450 43180 41633
18295 41633 38624 35127 26210 25368 24223 22945 20654 19903 32323 29104 22578 30684 29412 21515 21406
18280 21406 30418 33281 29776 30951 34349 36346 37733 32075 29833 29163 29473 23354 21147 25035 25364
18265 25364 27806 25854 21503 21042 20221 24644 25710 25540 29100 34801 35817 29408 28907 26843 27998
18250B7998L559Q101J3505R172O413J646j612Q560J2866J4451M052M045K099l517
18236A11338p82J2578J7404K532j1231J026Q437j409j3326j9506j2028j507N839
18223I9365R517J6582J0792m448j4328j7775j5733j6081r598L378l146k739M922
18210F0708N44l945n637N800L813n700m809m52J3232K0874J6644K5182J5431N232
18196A46917J702L434R662Q662M022l073k845P434j097p112j215J0271J1499J8219
18182B06480P856m92j7796j8975k4613r794M10J4945K0502J3071L76j0270j5585
18169A66115l1522l1137j8663o151J3P1o246n119O08K097L064k314q612k796P921
18154F7329M519j992j97O662K579L422N016j484L259L254O252O264J4055O615
$$ plain form
18250 27998 31557 39658 53163 62335 68748 70394 68782 77342 90208 104659 108711 112756 114855 111338
18236 111338 110556 123134 140538 143070 131839 132865 141302 139893 126567 107061 95033 93526 99365
18223 99365 108882 125464 136256 131808 117480 99705 83972 67891 58293 61671 58525 55786 60708
18210 60708 61252 57307 51670 57470 61283 55583 50774 50322 63554 84428 101072 126254 141685 146917
18196 146917 148619 152053 161715 170377 174399 171326 168481 175915 174818 167706 166491 176762 188261 206480
18182 206480 214336 213844 196048 177073 152460 142666 143076 158021 178523 191594 191970 181700 166115
18169 166115 134593 103456 84793 78642 78655 78726 72480 67361 67969 70066 73130 70816 62204 59408 67329
18154 67329 71848 69856 69659 76321 78900 82322 87338 85854 89113 92367 98619 104883 118938 125553
18140A25553p425o458P847P410R03N373R155J3055j456r812j0367p580K908Q610
18126A37716J2580K1168K0172M642j607J5254K4421L2796L6586M7899P1810J01310
18114E24747J38480K11031L41426N80519J084223J895943K663769K261777q90490
18105H811425l159629k071182j053480n68042l52955k41971j69932j23195r6118
18096I74921p0621n3562m9740n5182l8275m0889l8671k3128k1395l6764k9134
18085E17560k8219k4401j7529p318r694j4412k0597j8325k4305j8753k888l017
18073C28102l181m567o072j3181p383n822j5074r692k027m350k223o353j839k536
18059B43802j7648n421n264r451m176j5678l844L319m06m871n913r406m683M839
$$ plain form
18140 125553 118128 111670 119517 126927 127830 133203 142358 155413 153957 144145 133778 126198 129106 137716
18126 137716 150296 171464 191636 196278 194671 209925 234346 267142 303728 351627 423437 524747
18114 524747 663227 874258 1215684 1796203 2880426 4776369 7440138 9701915 8811425
18105 8811425 5651796 3580614 2527134 1959092 1606137 1364166 1194234 1071039 974921
18096 974921 904300 850738 800998 745816 707541 666652 627981 604853 583458 546694 517560
18085 517560 489341 464940 447411 440093 430399 415987 395390 377065 352760 334007 331119 328102
18073 328102 324921 320354 314282 301101 293718 287896 272822 263130 261103 256753 254530 248177 246338 243802
18059 243802 226154 220733 215469 206018 201842 186164 182320 185639 185233 180362 174449 165043 160360 165199
18045A65199j464r41k998o789O225n741o005j076m318l894K616L223p299n631
18031A31107j527j815o091l62m773q812o935N21L146K208o268l674O956K222l798
18016A02105n837m497j012M402k590o266k306P642J2528k325p095o399l593k031
18002H2726j314l411m539L803r271p705J737J86L235J464l379k706l783n563J801
17987E3281M844L356k10R767J2164N803P978N231p190j4649p925q368j1L800k427
17972F5444j726l34k689k964J203q369m228r222m059L222P244K122j444j406m034
17957C8760n59K508O279J683J730o110k777j311k895K471K798M185k775r880o553
17942B7554N025N429n072q795k13N854Q60q601m748j426J737P683O050k822J714
$$ plain form
18045 165199 163735 162794 159796 153007 159232 153491 147486 146410 142092 138198 140814 144037 136738 131107
18031 131107 129580 127765 121674 121312 116539 107727 100792 101313 104459 106667 100399 96725 103681 105903 102105
18016 102105 96268 91771 90759 95161 92571 86305 83999 91641 104169 101844 94749 88350 84757 82726
18002 82726 81412 78001 73462 77265 67994 60289 62026 62212 65447 66911 63532 60826 57043 51480 53281
17987 53281 58125 61481 61271 71038 83202 89005 96983 102214 95024 80375 72450 64082 64071 67871 65444
17972 65444 63718 63384 60695 57731 58934 50565 46337 37115 33056 36278 43522 45644 44200 42794 38760
17957 38760 38201 40709 46988 48671 50401 44291 41514 40203 37308 39779 42577 46762 43987 34107 27554
17942 27554 32579 38008 32936 24141 23928 29782 30642 22041 17293 15867 17604 25287 31337 28515 30229
17927C0229k709K277o47l594M035k519l556p376o433j768j399Q324O723N712p77
17912B6522l965m252n962J711m378k329L349M236K69k286O401n241p976L597N611
17897A5307J628K114m62M332N638L453L77Q35j244p230l0J166n872r240J420J2350
17881B4542N864j486n035o700m910k031L217L685K54l827l603L907J364m283L656
17866A4614L58m548k623M846M85L875P25J981l21k046L560N927q9n662k685k108
17850A6289k064l447j789L814O435J592J130q103k078k181k691k734P181P153
17836A8507m954n454R28K79j05m952K83R847M656l774l26M00R58k203K945K504
17820A9539J15j670J693p357n534r17L023L46L855l260r446O357J620p949o951
$$ plain form
17927 30229 27520 29797 29150 25556 29591 27072 23516 16140 9707 7939 6540 14864 21587 27299 26522
17912 26522 22557 18305 12343 14054 9676 7347 10696 14932 15201 12915 19316 14075 6099 9696 15307
17897 15307 16935 19049 18587 22919 28557 32010 32387 33222 31978 24748 24718 25884 20012 10772 12192 24542
17881 24542 30406 28920 23885 17185 12275 10244 13461 17146 17400 13573 9970 13877 15241 10958 14614
17866 14614 14972 10424 7801 12647 13132 17007 17732 19713 19392 17346 20906 26833 26744 21082 18397 16289
17850 16289 14225 10778 8989 12803 19238 20830 21960 13857 11779 9598 6907 4173 11354 18507
17836 18507 13553 8099 9027 9306 9201 4249 4532 14379 19035 15261 14935 15335 16293 14090 17035 19539
17820 19539 19654 17984 19677 12320 6786 5869 8892 9238 13093 9833 387 6744 8364 415 -6536
17805f536J695P911N920n150k91L821O751J805j309n612o178l817n28R29j656
17790b245M031M169k274m348J831n10j347R54M309O913P95k583k265J237L041
17775A1708m623J998L796p184k093j274J499Q70k089K804m581O34Q262K295k720
17760I302n47J85n428k904q74Q32O48Q05M876P203J851j902L344j778J83k895
17744A2901l593o521n713L002N352L243L386l194M764J38r062m907K784L207j0431
17729d644o409K158l057J262R494M182M17l833k339p49j614j578p38P827J262
17714A641n755m143l652k569O674J167Q914R509j460k556j659p539j198N814J279
17699D467q130m180M575R048M310k424m099o184L649P13r91l600N594N585m291
$$ plain form
17805 -6536 -4841 3070 8990 3840 3549 7370 14121 15926 14617 9005 2827 -990 -1518 -589 -2245
17790 -2245 1786 5955 3681 -667 1164 654 -693 261 4570 11483 12278 9695 7430 8667 11708
17775 11708 7085 9083 12879 5695 3602 2328 3827 4697 2608 5412 831 1465 9727 12022 9302
17760 9302 8755 8940 3512 608 -266 566 1214 2019 6895 14098 15949 14047 17391 15613 15796 12901
17744 12901 9308 2787 -2926 76 5428 8671 12057 8863 13627 13765 4703 -204 2580 5787 -4644
17729 -4644 -11053 -8895 -11952 -10690 -1196 2986 3403 -430 -2769 -3518 -5132 -6710 -7448 379 1641
17714 1641 -4114 -8257 -11909 -14478 -7804 -6637 2277 11786 10326 7770 6111 -1428 -2626 3188 4467
17699 4467 -3663 -7843 -3268 5780 10090 7666 3567 -2617 1032 1745 754 -2846 2748 8333 4042
17684D042j511M45Q87L766M861L943L11p921J261M43n742M30j762P00M105p331
17668I27k809L296L257K01M945l278n423j32M830J92j334M466k972K515l965n325
17652f09L274Q75o559o47j685k296j040L022Q156O952j725l422K104N215j1263
17637C52J197O747J536k018k266J664O72j334L204k50L780r143r14j438m391m160
17621f762j048M25k747o91J072J2579L981m377n828J864J305l585K03m46J691
17606b364J253K286m91Q14l3l191K286k251J571j383l903k090L944Q371j125r410
17590e716m005Q679M415P11n88j974M832J841k246k908r6n301J070N486l09N738
17574I629M417P94n328j042J290N659J905K668k210j0748o791L85l538J769l395
$$ plain form
17684 4042 2531 2976 3863 7629 12490 16433 16744 8823 10084 10527 4785 5215 3453 4153 8258 927
17668 927 -1882 1414 4671 4872 9817 6539 1116 984 5814 6006 4672 9138 6166 8681 4716 -609
17652 -609 2665 3540 -3019 -3666 -5351 -7647 -8687 -5665 2491 9443 7718 4296 6400 11615 352
17637 352 1549 8296 9832 7814 5548 7212 7884 6550 9754 9504 13284 4141 3227 1789 -2602 -6762
17621 -6762 -7810 -7385 -10132 -10823 -9751 2828 6809 2432 -3396 -1532 -227 -3812 -3609 -4055 -2364
17606 -2364 -1111 1175 684 1498 1465 -1726 560 -1691 -120 -1503 -5406 -7496 -3552 4819 3694 -5716
17590 -5716 -9721 -1042 3373 4084 3496 1522 6354 8195 5949 3041 2945 -2356 -1286 4200 3891 9629
17574 9629 14046 14840 9512 8470 9760 15419 17324 19992 17782 7034 243 628 -2910 -1141 -4536
17559d536M78o28N812j929O299K489j838k241Q6n779l796k671l218K631J0879
17544B038l560K905l433m135O211K096j717j211R72l33K158j74K283M898n140
17529C858L55L55m633r74L214R801o395r096L856L788K623j581r45J786J998K794
17513A0804K050j724R492j307m381k977j107J729m154K587n539p75R37j367n861
17498a593m531j290M868L790l75j234k126o062j648P7K257O050N170n110k913
17483d670O414L033n324n624O41n72j92N512K327M412j378J897K210o52j928J774
17467G880L487j2349o325O999J4082k071o612l273R75j1m49k26j288L077j322
17452B574J558Q44K5P981l42K923J528n012m712K327J6372K2512J3544j2049k2113
$$ plain form
17559 -4536 -4058 -4686 1126 -803 5496 7985 6147 3906 3992 -1787 -5583 -8254 -11472 -8841 2038
17544 2038 -1522 1383 -2050 -6185 26 2122 405 -806 166 -167 1991 1817 4100 8998 3858
17529 3858 4213 4568 -65 -1039 2175 11976 5581 -3515 341 4129 6752 5171 4226 6012 8010 10804
17513 10804 12854 11130 20622 19315 14934 11957 10850 12579 8425 11012 5473 4698 5635 4268 -1593
17498 -1593 -6124 -7414 -2546 1244 869 -365 -2491 -8553 -10201 -10124 -7867 -1817 3353 -1757 -4670
17483 -4670 1744 4777 -547 -6171 -5530 -6102 -6294 -782 1545 5957 4579 6476 8686 8034 6106 7880
17467 7880 11367 -982 -7307 -308 13774 11703 5091 1818 2793 2782 2333 2107 819 3896 2574
17452 2574 4132 4976 5001 12982 12640 15563 17091 12079 7367 9694 26066 48578 62122 50073 27960
17437B7960j3734o01k743j0024k781K635N778K090p34k917j123M314l580m603
17423f3l371l812O667K439m063J603O39K229J234l883o918J590J0411j954j374
17408A374O39j88j0662r297P553J2284k720P795M20p198o512j46M953L948P653
17393I896K40o719J683n114J982J0964P456p123j0910n132M703M24l413K932o70
17378A199P31O44J603K297q339O64O7j217K273Q598M027p084k379j830j945J951
17362A260O156O812m654J211o147l720J807r071L89L417L962k079l486L618J785
17347A260r18j229Q01r43K622k587N46M263k063k673m209j551J271j057n67q15
17331g849N467M15O333N190q654m047L34K898L030L411j450J087K778k693l08
$$ plain form
17437 27960 14226 13625 10882 858 -1923 712 6490 8580 7846 4929 3806 8120 4540 -63
17423 -63 -3434 -7246 -579 1860 -2203 -600 39 2268 3502 -381 -7299 -5709 4702 2748 1374
17408 1374 2013 1825 -8837 -18134 -10581 1703 -1017 6778 7198 0 -6512 -6658 -1705 2243 9896
17393 9896 10136 3417 5100 -14 1968 12932 20388 13265 2355 -2777 1926 2350 -1063 1869 1199
17378 1199 1930 2574 4177 6474 -1865 -1201 -1134 -2351 -78 8520 12547 5463 3084 1254 -691 1260
17362 1260 7416 14228 9574 10785 4638 918 2725 -6346 -5957 -2540 1422 -657 -4143 -525 1260
17347 1260 342 -887 -86 -1029 1593 -994 -448 3815 1752 -921 -5130 -6681 -5410 -6467 -7034 -7849
17331 -7849 -2382 -1967 4366 9556 902 -3145 -2811 87 3117 6528 5078 6165 8943 6250 5942
17316E942O768L597n849r285O61N211k211M332J0326p629o686O410l85M708q692
17301G218l946m175k627j792p34O389K774N70r66j281q219L318K538M455R38j153
17285C307n339l295j0588o63R410M990j676M45K920m217j442l202N525M803n433
17270d455J203k02k886k630K114j948k230N381L874m263N24L595K488k495k907
17255d837K460j681l419N198N51j1919n606O486J69L828R97m202r477j051O284
17240a6219Q031K631J044K953J777j042j779L890k910k975l488N35J540L866O22
17225a524K576K178K159L80p595J562j040M547N643p78p672o974j536R535Q2m771
17209c228Q735R614l941p36L849j004L098l61p359q620k839P759P000j230r869
$$ plain form
17316 5942 12710 16307 10458 1173 1834 7045 4834 9166 19492 11863 5177 11587 11202 15910 7218
17301 7218 3272 -903 -3530 -5322 -6056 333 3107 3677 2711 1430 -6789 -3471 -933 3522 4460 3307
17285 3307 -2032 -5327 -15915 -16578 -7168 -2178 -3854 -3409 -489 -4706 -6148 -9350 -3825 978 -4455
17270 -4455 -3252 -3454 -6340 -8970 -6856 -8804 -11034 -5653 -1779 -6042 -5518 -1923 565 -1930 -4837
17255 -4837 -2377 -4058 -7477 -2279 -1728 -13647 -19253 -12767 -12598 -8770 -7773 -11975 -21452 -22503 -16219
17240 -16219 -8188 -5557 -4513 -1560 217 -825 -2604 1286 -1624 -4599 -8087 -7552 -6012 -2146 -1524
17225 -1524 1052 3230 5389 5769 -1826 -264 -1304 3243 8886 8108 436 -6538 -8074 1461 1543 -3228
17209 -3228 5507 15121 11180 10444 14293 13289 16387 16026 8667 47 -2792 4967 11967 10737 868
17194H68o588m216L246N170p30K872K977K471q677m079L623L935j566k114K32
17179b576n86L295K456n948j273r57k700J275N259L674P43l17q2m794n111n627
17163a3269J899P87j173K560O043M68k478R34M014N199k705p92q4N120k217R98
17147E304n366l009o030p14j832J83K244N983K918m267k795L211j549n578M588
17132f709P884k472k454L024p57l331j259P878Q95k965L842q550p728K083P642
17117b977l127M452K032J891M038K799m71p597j708J628N551M592k224n620j313
17102A946M040P9n614L787J548J348R74j690j935k453l625l767M143r00K365j933
17086a687l920q075L787J6829j439l241k362K384k135l986k750k399R214Q194
$$ plain form
17194 868 -5720 -9936 -6690 -1520 -2250 622 3599 6070 -2607 -6686 -3063 872 -694 -2808 -2576
17179 -2576 -3162 133 2589 -3359 -4632 -5589 -8289 -7014 -1755 1919 2662 2345 2263 -2531 -7642 -13269
17163 -13269 -11370 -10583 -11756 -9196 -3153 -2685 -5163 -4229 -215 4984 2279 1487 1403 6523 4306 5304
17147 5304 -62 -3071 -9101 -9815 -11647 -11464 -9220 -3237 -319 -4586 -7381 -4170 -5719 -11297 -6709
17132 -6709 1175 -1297 -3751 -727 -1484 -4815 -6074 1804 2699 -266 3576 -4974 -12702 -10619 -2977
17117 -2977 -6104 -1652 380 2271 6309 9108 8637 1040 -668 960 6511 11103 8879 3259 1946
17102 1946 5986 6065 451 4238 5786 7134 8108 6418 4483 2030 -1595 -5362 -1219 -2119 246 -1687
17086 -1687 -5607 -13682 -9895 6934 5495 2254 -108 2276 141 -3845 -6595 -8994 220 8414
17072H414n322j1861o304Q547J2826O758l408o113q788K255J608J899j73L12M197
17057D847k644j349l416l479k53M4K107P873R09J480k578P62j30J51n811m33M106
17040B186j564m562j997n24J306K21n068L489J54P267J773p6L945q20m168j273
17024B89Q127p5m1n517K23M509n72J053J303j0078q883P488P554J562Q61k668
17008E135K46m186k242O689J0273k427n173l445K232M656j161n008N7K562M90
16993H698m356j565r32L740m713j629J965Q94n171j694L881J799P51Q411M767
16978A4846m672O4K768N024N261l198p095p991o474O862O748m008p397k172k18
16963a652o328m495M016Q85R360O26m509j62k047K963n518J824M720K735j81L93
$$ plain form
17072 8414 3092 -8769 -15073 -6526 6300 13058 9650 3537 -5251 -2996 -1388 511 338 650 4847
17057 4847 2203 854 -2562 -6041 -6294 -6250 -4143 3730 4639 6119 3541 4303 4173 4324 -1487 -1920 2186
17040 2186 622 -3940 -5937 -6461 -5155 -4934 -10002 -6513 -6359 908 2681 2605 6550 5730 1562 289
17024 289 8416 8341 8300 2783 3006 7515 6943 7996 9299 -779 -9662 -2174 5380 6942 7803 5135
17008 5135 5381 1195 -1047 5642 15915 13488 8315 4870 7102 11758 10597 5589 5646 8208 8698
16993 8698 4342 2777 1845 5585 872 -757 1208 2102 -3069 -4763 -882 917 1668 10079 14846
16978 14846 10174 10238 13006 18030 23291 20093 12998 5007 -1467 5395 12143 8135 738 -1434 -1652
16963 -1652 -7980 -12475 -8459 -7574 1786 2412 -2097 -2259 -4306 -1343 -6861 -5037 -317 2418 2237 2630
16947B630K112Q20k29O826o62m321R17L669m081k019N622J938l271j817j61l516
16931D457o049M659P870l879k646m43l026l073L312l866r01p74j914P740K108
16916C575o836k670J509K055l704k046K436l040m131L760K489M743O50p060k463
16901a0733J273J911J729k656L60K740N429M000o607o595M480K975M2O101M68
16886D917q757n557p24M159M406p53K245m907L283L755O449L329N162L265j100
16871A9172r231r495q481l69O650k984K214P43K855m59N430r26j253K096R74k917
16855D019q60P036J055j0062q06L976n58K542k131k142m906l701O959k042n668
16840g289l924J1078J0118l234K072J582l889p950k383K497q0O06j921J601K55
$$ plain form
16947 2630 4742 5562 5333 12159 11497 7176 8093 11762 7681 5662 11284 13222 9951 8134 7973 4457
16931 4457 -1592 3067 10937 7058 4412 3969 943 -2130 1182 -2684 -3585 -4359 -6273 1467 3575
16916 3575 -3261 -5931 -4422 -2367 -6071 -8117 -5681 -8721 -12852 -9092 -6603 -1860 -1210 -8270 -10733
16901 -10733 -9460 -7549 -5820 -8476 -8116 -5376 53 4053 -2554 -9149 -4669 -1694 -1652 4449 4917
16886 4917 -3840 -9397 -10121 -5962 -1556 -2309 -64 -4971 -1688 2067 8516 11845 17007 20272 19172
16871 19172 9941 446 -8035 -8404 -1754 -4738 -2524 -1781 1074 615 6045 5119 3866 5962 6936 4019
16855 4019 3159 10195 11250 1188 382 4358 3800 6342 4211 2069 -2837 -6538 421 -1621 -7289
16840 -7289 -11213 -135 9983 6749 8821 10403 6514 -1436 -3819 -1322 -1402 -796 -2717 -1116 -861
16825h61n63M805L065O27r29O042K796q364j1130p966j910J40R650R127l44k467
16809A718K346k613l903n76o045L543O595M229K223p7P94k819j2780m177J788
16794i754K885J66K754j512k671k238L445L23n754O447N868K23N743M521l858
16779F588m642M67j402j861p55n386L07K304l690J232K842J915J529j680j128
16764c360l782N37K84m52N299P105L029M534o126r011l426O97M644M490M148q518
16748I2p950m813N688K842k541m898q502J031P873j780j333K800p23L259L798
16733e157M061L959J007j372n592J943P103l453N608J359n108o103n957l515k42
16718a1459m56L825m555J939k915p459N63M719K626L982M807L381M007O87J156
$$ plain form
16825 -861 -1424 3381 6446 7073 6144 12186 14982 6618 -4512 -12478 -14388 -14248 -4598 4529 4185 1718
16809 1718 4064 1451 -2452 -3028 -9073 -5530 1065 5294 7517 7440 8234 5415 -7365 -11542 -9754
16794 -9754 -6869 -6703 -3949 -5461 -8132 -10370 -6925 -6602 -12356 -5909 -41 182 5925 10446 6588
16779 6588 1946 2413 1011 -850 -1605 -6991 -6684 -4380 -8070 -6838 -3996 -2081 -552 -2232 -3360
16764 -3360 -7142 -6605 -6321 -6773 -1474 5631 8660 13194 7068 -1943 -5369 -4672 -28 4462 8610 92
16748 92 -7858 -12671 -6983 -4141 -6682 -11580 -20082 -19051 -11178 -12958 -14291 -11491 -12214 -8955 -5157
16733 -5157 -1096 2863 3870 2498 -3094 -1151 5952 2499 8107 9466 4358 -1745 -7702 -11217 -11459
16718 -11459 -11915 -8090 -12645 -10706 -13621 -21080 -20517 -15798 -13172 -9190 -4383 -1002 3005 3692 4848
16703D848k911m710J257N352k376q89K281k45J188K500J966o699n294j211M706
16688b37o92r04R232m386p458P37J166j541j135L674O66N29L748n366j262o366
16672i595j786L919J534l656M800Q169O188j727p283K190k298n890o64J299J136
16657c664J974J780l044j105K233O955n099l163Q187N066m063m104m969p790m95
16642a1301L850O236M127P206l971K684l966o703l243M145m897p091P999L697
16628a228M02O784K067j662N77l319o18l205n889K437j935N131k28o348k047m353
16612a3434k826J0716K004p700J906R277P309j753m282o340j513N475J014k739
16598b886r81K505J816j918r417K783M803R635j158n236r52L610K216K366l9m735
$$ plain form
16703 4848 1937 -2773 -1516 3836 1460 571 2852 2607 3795 6295 8261 1562 -3732 -4943 -237
16688 -237 -929 -1833 7399 3013 -4445 -3708 -2542 -4083 -5218 -1544 -878 -349 3399 -1967 -3229 -9595
16672 -9595 -11381 -7462 -5928 -9584 -4784 3385 9573 7846 563 2753 455 -5435 -6099 -4800 -3664
16657 -3664 -1690 90 -2954 -4059 -1826 5129 30 -3133 5054 10120 6057 1953 -3016 -10806 -11301
16642 -11301 -7451 -1215 2912 10118 6147 8831 4865 -1838 -5081 -936 -5833 -12924 -4925 -1228
16628 -1228 -826 5958 8025 6363 6940 3621 3003 -202 -6091 -3654 -5589 -458 -686 -7034 -9081 -13434
16612 -13434 -16260 -5544 -3540 -11240 -9334 -57 7252 5499 1217 -5123 -6636 -1161 -147 -2886
16598 -2886 -3867 -1362 454 -1464 -10881 -8098 -3295 6340 5182 -54 -1006 2604 4820 7186 7147 2412
16582B412o13J8632R403K854M465Q369k282k182L406M88j0870k638m74p511N304
16567B8763J437k961m818p390p421m586o186L623j248l70Q586K205l43p35o527
16552B029n287P775K762L79R74J152k737n124k713J104J895J704J568m53n705
16537f77n291K957K435M20K94K188L28J916o86k18l140K48k633n665K630L793
16521a101O66J922L274n535k539N189K705O38L624J96M848l27j105L159l916n850
16505E848k512q061j70J955N247L116O479J876o033o95M097l026j0790l631Q270
16490A970M632n281n674O31N90k265n10K788O782J904N023k112p257k217L944
16475B948n240m088J813N336r094J057L591J777n94L809m154j510N994J728P4
$$ plain form
16582 2412 1799 20431 29834 32688 37153 45522 43240 41058 44464 44952 34082 31444 30970 23459 28763
16567 28763 30200 27239 22421 15031 7610 3024 -3162 461 -787 -1157 7429 9634 9291 8556 2029
16552 2029 -3258 4517 7279 7658 8632 9784 7047 1923 -790 314 2209 3913 5481 5028 -677
16537 -677 -5968 -3011 -576 -156 138 2326 2654 4570 3884 3666 526 774 -1859 -7524 -4894 -1101
16521 -1101 -435 1487 4761 -774 -3313 1876 4581 5219 8843 9039 13887 13560 12455 15614 11698 5848
16505 5848 3336 -4725 -4895 -2940 2307 5423 11902 13778 7745 7050 11147 8121 -2669 -6300 1970
16490 1970 6602 1321 -4353 -3722 -3132 -5397 -5907 -3119 3663 5567 10590 8478 1221 -996 2948
16475 2948 -2292 -6380 -4567 769 -8325 -7268 -3677 -1900 -2494 1315 -2839 -4349 1645 3373 3447
16460C447N537J600l37j897j1627p577M498J2274j717J81J93j975k521N8p53O300
16444E684R41o730j490j793M88R81l468r18L675Q750j763j0540k449K638L026
16429b968J0308N027k123m498k46L253K580j246K73m8n047r84m411m481K722N69
16413a320j973k195M230O23J230L44n50M693M823n020m406k664L123L273M78l447
16397A242N368Q198J628m647N12j0003r410j805K369L490J774k431J351j296l831
16382g491l458P524L617o419l360j437l149k46R036M165l825l222M999J2581l863
16367E452j351j369k566L594k464K517K292o97n112k127j089o552l24L187O976
16352C67M100o11n803l16O586K218o34r414k093N125K67J344L884m32n416m683
$$ plain form
16460 3447 8984 10584 10247 8350 -3277 -10854 -6356 5918 4201 4382 4575 2600 79 137 -616 5684
16444 5684 6625 -105 -1595 -3388 -2900 -1919 -5387 -6305 -2630 6120 4357 -6183 -8632 -5994 -2968
16429 -2968 7340 12367 10244 5746 5500 8753 11333 10087 10360 10312 5265 4281 -130 -4611 -1889 -1320
16413 -1320 -3293 -5488 -1258 -635 595 939 389 5082 9905 4885 479 -2185 938 4211 4689 1242
16397 1242 6610 14808 16436 11789 12301 2298 -7112 -8917 -6548 -3058 -1284 -3715 -2364 -3660 -7491
16382 -7491 -10949 -3425 192 -6227 -9587 -11024 -14173 -14419 -5383 -1218 -5043 -8265 -3266 9315 5452
16367 5452 4101 2732 166 3760 1296 3813 6105 5408 296 -1831 -2920 -9472 -9796 -6609 367
16352 367 4467 3856 -1947 -2263 4323 6541 5907 -3507 -5600 -475 -208 1136 5020 4588 -828 -5511
16336e511L843l037k123M698M591M408K189l488l796L91l50j88m88O094N473m126
16320H580r495O11L380J137O01m985k463N340k512l642j377Q070O291o886p915
16305e265O70m0Q39n312L911J606R74p069j0128n149J646P327N124M175K486J907
16289b298J368o61K059l002J874M43n698n888J297M847L352j414k440m966l386
16274a4513k641J186N723O698j563M67j349P382K003m033k859j427J375Q99K83
16259b369L36k176P092M131l74n511l707m893K535M506o46j392O267N716j413
16244H102q647m254n01J377M923r23Q374K702o359l373j319k770n819p182K026
16229a3643N581K578J552J081k650K628n831K158M951k354L056K335n083K733
$$ plain form
16336 -5511 -1668 -4705 -6828 -2130 2461 6869 9058 5570 1774 2165 1815 1627 1139 7233 12706 8580
16320 8580 -915 -304 3076 4213 4814 -171 -2634 2706 194 -3448 -4825 3245 9536 2650 -5265
16305 -5265 -4595 -4635 -3796 -9108 -5197 -3591 -2617 -9686 -19814 -24963 -23317 -15990 -10866 -6691 -4205 -2298
16289 -2298 -930 -1591 468 -2534 -660 -217 -5915 -11803 -10506 -5659 -2307 -3721 -6161 -11127 -14513
16274 -14513 -17154 -15968 -10245 -3547 -5110 -4643 -5992 1390 3393 -640 -3499 -4926 -3551 -2652 -2369
16259 -2369 -2033 -4209 2883 7014 6640 1129 -2578 -7471 -4936 -430 -1076 -2468 3799 9515 8102
16244 8102 -545 -4799 -5300 -3923 1000 77 8451 11153 4794 1421 102 -2668 -8487 -15669 -13643
16229 -13643 -8062 -5484 -3932 -2851 -5501 -2873 -8704 -6546 -1595 -3949 -893 1442 -3641 -908
16215i08N785k449r155O124L868k611J722J544k410p364m367M360K775K096K476
16200A486K332o08m087K220L098K15R23o697j3943K103R887j309J39K242J558
16185d41k860j186o93l851P81k84L367k554L534l824k412J677K065J271k517k767
16169a0694K700k385N80p85J978r24L041K442k390K596k92k526k699n24m128J428
16153a2582K249L485j290N814J458L605k766l329M27K748J32K568q291m816P258
16138c330J0007M322M846k413p666k615N022l939j0850N551N060L936n72p930
16124e71p488j382K277K654R48l828J816J708P370K949k354p465n373O45M461
16109c633K767k337O518n955n933Q755L474k828n976K622M969J792l879k992k339
$$ plain form
16215 -908 4877 2428 -6727 -603 3265 654 2376 3920 1510 -5854 -10221 -5861 -3086 -990 1486
16200 1486 3818 3210 -877 1343 4441 4656 5579 -1118 -15061 -12958 -3071 -4380 -4241 -1999 -441
16185 -441 -3301 -4487 -5180 -9031 -8250 -8534 -5167 -7721 -4187 -8011 -10423 -8746 -6681 -5410 -7927 -10694
16169 -10694 -7994 -10379 -9799 -10584 -8606 -9530 -6489 -4047 -6437 -3841 -4133 -6659 -9358 -9882 -14010 -12582
16153 -12582 -10333 -6848 -8138 -2324 -866 2739 -27 -3356 -2929 -181 -49 2519 -5772 -10588 -3330
16138 -3330 6677 10999 15845 13432 5766 3151 8173 4234 -6616 -1065 3995 7931 7359 -571
16124 -571 -8059 -9441 -7164 -4510 -3562 -7390 -5574 -3866 3504 6453 4099 -3366 -8739 -8094 -3633
16109 -3633 -866 -3203 3315 -2640 -8573 182 3656 828 -5148 -2526 2443 4235 356 -2636 -4975
16094d975K558n275n836K531K295q54K037N631L192M96j509q16m49r98o746k963
16078a1681M275M93M055Q914M7j1824L464O850n852M16M391O670l826l695l349
16063f52k621j670k781j805k447J010K164Q065N018j747k530o960n299L465J092
16048g698m018L820N223J121j4j299L85L455J004M404K676m252j433k087J714
16033C001L514n775o827L10L649J944M990n568o733n166N427N225M121Q95k051
16018I56l001l650L454J520J443J577j994N66j104J400m88N019k71o875L22J1087
16002I961Q31r272l624n385L108M596M63k131J606P981L528m181Q10j719q816
15987b244M97N881M14o06J1k192m415l983l34O40M380J978L4n287j532l700O31
$$ plain form
16094 -4975 -2417 -7692 -13528 -10997 -8702 -9556 -7519 -1888 1304 1800 291 -525 -974 -1972 -8718 -11681
16078 -11681 -7406 -6913 -2858 6056 6103 -5721 -2257 4593 -1259 -843 3548 10218 6392 2697 -652
16063 -652 -3273 -4943 -7724 -9529 -11976 -10966 -8802 -737 4281 2534 4 -6956 -12255 -8790 -7698
16048 -7698 -11716 -7896 -2673 -1552 -1566 -2865 -2480 975 1979 6383 9059 4807 3374 1287 3001
16033 3001 6515 740 -6087 -5777 -2128 -184 4806 -762 -7495 -12661 -7234 -2009 2112 3007 956
16018 956 -2045 -5695 -2241 -721 722 2299 305 871 -233 1167 679 5698 5427 -1448 -1126 9961
16002 9961 10792 1520 -2104 -7489 -4381 215 678 -1453 153 8134 11662 7481 8291 6572 -2244
15987 -2244 -1747 4134 4548 3942 3953 1761 -2654 -6637 -6971 -6331 -1951 27 61 -5226 -6758 -10458 -9827
15970i827j622j498n2J719L41L537N098M432n641o104m899J375P75K360J152M818
15954d036j167n250j629K632O532j597M916L520K044Q480j603o063j275n029p772
15939g297j056Q478J604O01j936l55L863P818k378m81K40j478q114k767k106n187
15923a0551L389j440m640o32N395P448K310J817j1156j874J1100m97j01K438R96
15908D002K477J115o063o836j238k56q607l153L94N067M392m77K039K26L728N565
15892B375K834j814j390j088n822m936M441k51K994M055L648j064J55l351K787
15877C573j041n524m45O709J617m736l961j868l160j3379M801J0868j762j441
15863i749j50O94O050O557m313m625j080J107O91P028J629k475m023p520k321
$$ plain form
15970 -9827 -11449 -12947 -12999 -11280 -10939 -7402 -2304 2128 -3513 -9617 -14516 -13141 -12366 -10006 -8854 -4036
15954 -4036 -5203 -10453 -12082 -9450 -2918 -4515 401 3921 5965 14445 12842 6779 5504 475 -7297
15939 -7297 -8353 125 1729 2330 394 39 3902 11720 9342 8861 9101 7623 -491 -3258 -5364 -10551
15923 -10551 -7162 -8602 -13242 -13874 -8479 -1031 1279 3096 -8060 -9934 1166 669 568 3006 4002
15908 4002 6479 7594 1531 -5305 -6543 -6799 -15406 -18559 -18165 -13098 -8706 -9183 -7144 -6918 -3190 2375
15892 2375 5209 3395 2005 917 -4905 -9841 -5400 -5651 -2657 1398 5046 3982 4137 786 3573
15877 3573 2532 -2992 -3437 3272 4889 153 -3808 -5676 -8836 -22215 -17414 -6546 -8308 -9749
15863 -9749 -9899 -9205 -3155 3402 -911 -5536 -6616 -5509 -4818 2210 3839 1364 -2659 -10179 -12500
15848a2500N145N822r144o789J898J786Q043J072k662L101K525J057k071o814
15834i531K306L271j233l803M314P758l541k626L410k88k901r424l971L545K877
15819i837M408N356n172K273N389M684K392j08j617m3k552m901l90L062J042J453
15803E439Q36k64J71l560l793O87k241l782K505r12j632O01L02l820K887K760
15787c816j780R1q91l410J041Q848Q54j124N325m451o188N59K124K858J806J187
15771C033k488l889J878K766L355J221o803m797N861K542n84l24L813M009n445
15756D148M21n824k893K390l404k402J76l65M335K095k755p8L777P114J055n286
15740B504p882m60J731K98J619M230J177p376K107M230j267l140o570N07M313
$$ plain form
15848 -12500 -7355 -1533 -10677 -17466 -15568 -13782 -5739 -4667 -7329 -4228 -1703 -646 -2717 -9531
15834 -9531 -7225 -3954 -5187 -8990 -4676 3082 -459 -3085 325 37 -2864 -12288 -16259 -12714 -9837
15819 -9837 -5429 -73 -5245 -2972 2417 7101 9493 9385 7768 7725 5173 272 -118 2944 3986 5439
15803 5439 6275 6011 6182 2622 -1171 -484 -2725 -6507 -4002 -4914 -6546 -5945 -5643 -9463 -6576 -3816
15787 -3816 -5596 -5505 -6396 -9806 -8765 83 937 -187 5138 687 -5501 -4942 -2818 40 1846 3033
15771 3033 545 -3344 -1466 1300 4655 5876 -927 -5724 137 2679 2095 1771 5584 9593 4148
15756 4148 4569 -1255 -4148 -1758 -5162 -7564 -7388 -7753 -3418 -1323 -4078 -4156 -379 6735 7790 2504
15740 2504 -5378 -5838 -4107 -3809 -2190 2040 3217 -4159 -2052 2178 911 -2229 -8799 -8292 -3979
15725c979J14M346P789j581k046j373L898J197p844m328L18L392K664K278M98
15710E343J630k815o616k650Q98M108j779j960J778L830l359Q59M702L286j626
15695E629k359l287Q08j615j0520k177K582j116J257N96J466O272P036m719j400
15680a547n337q030k876k905n78P262K739P590N835M905n137p229l77K423K851
15665d11J863m470k146K761l079n262J68P633O057J623l442k330k949O59L646
15650C21l637j650k963K424Q291k273l874k043P527M450L10o43o097j390M103
15635B856J238q833r08P62L013m923K638P652P934n071n4j65m574j436k980J835
15619a016J109j0237n174K855N910k264l921O22L073O215j487M629R794m990n680
$$ plain form
15725 -3979 -3865 481 8270 6689 4643 3270 7168 8365 521 -3807 -3489 -97 2567 4845 5343
15710 5343 6973 4158 -2458 -5108 -4210 -102 -1881 -3841 -2063 1767 -1592 -733 3969 7255 5629
15695 5629 3270 -17 791 -824 -11344 -13521 -10939 -12055 -10798 -10202 -8736 -2464 4572 -147 -1547
15680 -1547 -6884 -14914 -17790 -20695 -21273 -14011 -11272 -3682 2153 7058 1921 -5308 -5685 -3262 -411
15665 -411 1452 -3018 -5164 -2403 -5482 -10744 -10576 -2943 3114 4737 1295 -1035 -3984 -3325 321
15650 321 -3316 -4966 -7929 -5505 2786 513 -3361 -5404 2123 6573 6883 6240 143 -1247 2856
15635 2856 4094 -4739 -5647 -4885 -1872 -6795 -4157 3495 11429 6358 6304 6139 1565 129 -2851 -1016
15619 -1016 93 -10144 -15318 -12463 -6553 -8817 -12738 -12116 -9043 -2828 -4315 314 10108 5118 -562
15604e62P76P113n012o605n404k806Q061J0296r91j3n8k764q69P610K016m654
15588F134k025J814M9O53j860p216k412L360j727n314L815L348p62P84M010m62
15572B189m184l054l329J073L105K155J683j016m964k166M632N274k142P49l310
15557c305j232L983o576J056P53j917k031N05K850r107l135L731k684O78N256
15542a1175q35o167m686l2k420L520N995O897N92N4M90L003j577J934M777L78
15526G48l393P93j957n221Q048M410j087p6p349J362j084n351M02k138r07N742
15510g058K483L893J312J273P093j481o253j043p21O359J38n181j1278l723Q143
15495f044O693m897n553O511R526P367O82j0813n765j41J419j538j687k45P315
$$ plain form
15604 -562 214 7327 2315 -4290 -9694 -12500 -4439 5857 4866 4853 4795 2031 1162 8772 10788 6134
15588 6134 4109 5923 5972 6625 4765 -2451 -4863 -1503 -3230 -8544 -4729 -1381 -2143 -1359 2651 2189
15572 2189 -1995 -5049 -8378 -7305 -4200 -2045 -362 -1378 -6342 -8508 -3876 1398 -744 5 -3305
15557 -3305 -4537 -554 -7130 -6074 -5321 -7238 -9269 -8764 -5914 -15021 -18156 -14425 -17109 -16431 -11175
15542 -11175 -12010 -18177 -22863 -22895 -25315 -21795 -15800 -8903 -8311 -8257 -7767 -4764 -6341 -4407 370 748
15526 748 -2645 -1852 -3809 -9030 -982 3428 2341 2265 -5084 -3722 -4806 -10157 -9755 -11893 -12800 -7058
15510 -7058 -4575 -682 630 1903 8996 7515 1262 219 -502 5857 5995 814 -10464 -14187 -6044
15495 -6044 649 -4248 -9801 -3290 6236 13603 14285 3472 -2293 -2434 -1015 -2553 -4240 -4485 2830
15480B830M719k410o181j854k821J491N346l592k534k420r98O287M625R04j653
15465A739K087L28k136J679n711j467K737m716p586M260P885M516J547J996k284
15450D874p584o128l818L863Q86Q48Q89N333J927k595p888J923j565P914N150
15435D029N30J141m995p300L388j275p165p127L418J061J819O766L649N786k921
15420H04m750k169r787m987P201q57j177P049P439L291J475j996P80j308j695
15405f87L203K80n057m623l141k233J656M930N162J806k534L867p728j513m797
15390a1409j780L242N820q106l634L588K759J458o18L333N244O652J508j417L121
15375I761p95k931l993M938O2q8l962m727L285L633m27j736J44L910k496o584
$$ plain form
15480 2830 7549 5139 -1042 -2896 -5717 -4226 1120 -2472 -5006 -7426 -8424 -2137 2488 3392 1739
15465 1739 3826 4154 2018 3697 -2014 -3481 -744 -5460 -13046 -8786 -901 3615 5162 7158 4874
15450 4874 -2710 -8838 -12656 -8793 -7907 -7059 -6170 -837 1090 -1505 -9393 -7470 -9035 -1121 4029
15435 4029 4559 5700 705 -6595 -3207 -4482 -11647 -18774 -15356 -14295 -12476 -5710 -2061 3725 804
15420 804 -3946 -6115 -15902 -20889 -13688 -14545 -15722 -8673 -1234 2057 3532 1536 2316 1008 -687
15405 -687 2516 2796 -2261 -6884 -10025 -12258 -10602 -5672 -510 1296 -1238 2629 -5099 -6612 -11409
15390 -11409 -13189 -9947 -4127 -12233 -15867 -12279 -9520 -8062 -8680 -5347 -103 6549 8057 6640 9761
15375 9761 8966 6035 2042 6980 7042 6954 2992 -1735 1550 5183 4756 3020 3164 7074 4578 -2006
15359b006j53k304m417J895O941M272M806l114p928M333R175j496m896l904n221
15344d017j29K31J734J002k634l556j471K577K701J131M441j964J016j192J619
15329A489l224q938L072j763o18Q37k756l927M881P537l144L917O016J185l861
15314G03p522j188m86J65J0889m81o039l374m971m7l049K240K381l069P738K891
15298c219j571K883K519L67m210j779N440k93J931k098k849K136L322q686m991
15283a1098N286N091j328o261k559N214K098K812O271N666o280j067N593l054
15269F384q715m278k836Q71j455L607K758P077r85n926J826Q419M142r67j0577
15254f55q60J430J234j314L273O43q129K528p54J626l224N547L62k44p46L867
$$ plain form
15359 -2006 -2159 -4463 -8880 -6985 -44 4228 9034 5920 -2008 2325 11500 10004 5108 1204 -4017
15344 -4017 -4146 -3915 -2181 -1179 -3813 -7369 -8840 -6263 -3562 -2431 2010 46 1062 -130 1489
15329 1489 -1735 -10673 -7601 -9364 -9982 -9145 -11901 -15828 -10947 -3410 -6554 -2637 3379 4564 703
15314 703 -6819 -8007 -8493 -8328 2561 2080 -3959 -7333 -12304 -12351 -15400 -13160 -10779 -13848 -6110 -3219
15298 -3219 -4790 -1907 612 979 -3231 -5010 430 137 2068 -30 -2879 -743 2579 -6107 -11098
15283 -11098 -5812 -721 -2049 -8310 -10869 -5655 -3557 -745 5526 11192 4912 3845 9438 6384
15269 6384 -2331 -6609 -9445 -8574 -10029 -6422 -3664 3413 2428 -3498 -1672 6747 10889 9922 -655
15254 -655 -1515 -85 1149 -165 3108 3751 -4378 -1850 -2604 -978 -4202 1345 1707 1463 717 4584
15238D584l223J35l18K440j892q739k95L763o65r91j468k497P008n460j859M624
15222d853m796j0056J340M765j354N036l33P548j263K191O7J622o79n573m84L27
15206f495n280o8M258O249k106j216P866l02K899L247J407p202j2257m727k947
15191a6674Q52P572O494L260R75k796O09L23j871l44j461K891L132N363O64p271
15175A718q328r53O58M540j056p141M545N316J029p537r128n928O692Q078N237
15160b258K273l797o286p98J1919J573K118j69k707M0N442K757J95l30q45l77
15144H750m220m172k071r292l877P716N249K666j765o056q144P525P375M626m665
15129c55J697M658J872j097k626n674P430O45l746N373M656n99o196k313l537
$$ plain form
15238 4584 1361 1496 1178 3618 1726 -7013 -7308 -3545 -4210 -5201 -6669 -9166 -2158 -7618 -9477 -4853
15222 -4853 -9649 -19705 -18365 -13600 -14954 -9918 -10251 -2703 -3966 -1775 -1708 -86 -765 -6338 -6822 -6495
15206 -6495 -11775 -11843 -7585 -1336 -3442 -4658 3208 2906 5805 9052 10459 3257 -9000 -13727 -16674
15191 -16674 -15822 -8250 -1756 1504 2479 -317 292 615 -1256 -1600 -3061 -170 2962 8325 8989 1718
15175 1718 -6610 -7563 -6905 -2365 -3421 -10562 -6017 -701 328 -7209 -16337 -22265 -15573 -7495 -2258
15160 -2258 15 -3782 -10068 -10866 1053 2626 4744 4575 1868 1908 7350 10107 10302 9972 9127 8750
15144 8750 4530 358 -1713 -11005 -14882 -7166 -1917 749 -1016 -7072 -15216 -7691 -316 4310 -355
15129 -355 1342 6000 7872 6775 4149 -1525 5905 6550 2804 8177 12833 12234 6038 3725 188
15114A88k449n410o776J585K495P802j880j478n207k308N25Q6L756P211R210j642
15098E708j312m651r004J721J1038O234n285k517p44m360N428o71r06j087n596
15083f004J645m14L629M032L91o106L142N718l606N33K053l578K123O222k125
15068G655r889M059M415k29l637j199M982m629m90O968J209m58J167o876p121
15053d073R22Q088Q140k087K119p362l079J162J151l651j763l919j110L207L524
15038A269l41m83J307l572k241m689K810R563O545n172r272R85O199L884j716
15023E076j136j119L889J910j73rK91M223k359n215r23o27m910n141L91M26o715
15006a2121j265L175o76L081M763n238n132Q94O321P859j496l739K518m72j599
$$ plain form
15114 188 -2261 -7671 -14447 -12862 -10367 -2565 -4445 -5923 -11130 -13438 -12913 -12827 -9071 -1860 7350 5708
15098 5708 4396 -255 -9259 -7538 3500 9734 4449 1932 1188 -3172 2256 1585 679 -408 -6004
15083 -6004 -4359 -4773 -1144 2888 3279 -2827 315 6033 2427 2960 5013 1435 3558 9780 7655
15068 7655 -2234 1825 6240 6011 2374 1175 6157 1528 1038 8006 9215 8757 9924 3048 -4073
15053 -4073 -3151 4937 13077 10990 13109 5747 2668 3830 4981 1330 -433 -4352 -5462 -2255 1269
15038 1269 928 445 1752 -1820 -4061 -8750 -5940 3623 10168 4996 -4276 -3291 2908 6792 5076
15023 5076 3940 2821 6710 8620 8447 8438 8729 12952 10593 5378 4455 3828 -1082 -6223 -5832 -5406 -12121
15006 -12121 -13386 -10211 -10887 -7806 -3043 -8281 -13413 -12519 -6198 1661 165 -3574 -1056 -1528 -3127
14991c127k414K691K644m239n636K419L253J501k12J569K137j519M739M812K803
14976A1421m825j448L66j453o787k86j818o230m399K124Q460L737L901R450J279
14961A3492p021l066l233n735m100P893J2451K551p158j1250J377M493M423p34
14947D383k131k397n646L758P371j273l416m073K20p87m0m006l977J058Q796K853
14931F93m629N356O609j5m649p976K32N413L476p10L157n66o279j438J612k810
14915b524j82M380l927l599r47J464M442j286m078j171P742L987j477n526K363
14900c39L89j0172k880L558K776K985Q161K244j093J51R27k762L818K776q574
14885A965Q88k674n846K820n279l68K880K4l856n284L726J0346Q262k72j568k618
$$ plain form
14991 -3127 -5541 -2850 -206 -4445 -10081 -7662 -4409 -2908 -3120 -1551 586 -933 3806 8618 11421
14976 11421 6596 5148 5514 4061 -2726 -3012 -4830 -11060 -15459 -13335 -4875 -1138 2763 12213 13492
14961 13492 6471 3405 172 -5563 -9663 -1770 10681 13232 6074 -5176 -3799 694 5117 4383
14947 4383 2252 -145 -5791 -2033 5338 4065 649 -3424 -3204 -3991 -4031 -8037 -12014 -10956 -2160 693
14931 693 -3936 1420 8029 8014 3365 -4611 -4379 1034 4510 3800 6957 6391 112 -1326 286 -2524
14915 -2524 -2706 1674 -2253 -5852 -6799 -5335 -893 -2179 -6257 -7428 314 4301 2824 -2702 -339
14900 -339 50 -10122 -13002 -9444 -6668 -3683 4478 6722 5629 5780 6707 3945 7763 10539 1965
14885 1965 2853 179 -5667 -2847 -8126 -8494 -5614 -5590 -9446 -14730 -11004 -658 7604 7332 5764 3146
14869C146m204k104p24J718K199j90n777k266l655P629N835j257q842j562j81
14854a0235O445P308L93k384l590L493m611n499R296K959J089L441j489n616k370
14839a370J310M836O678J209q389l713l857O869N458k712k278j980K755J107J546
14824G469j966o781k61l32J238P561j819k948J103O29Po110o81J01L06J295m18
14807a607J314o426m625N546N137J396Q20m993j162K216k467L757K733K815m6
14792D408r989m023Q048Q418L085n503q754k182o98J411P335K571j1660l816J334
14777a0015m23j507J0941M884k597n988m106J530K631L817J2457M744r381p764
14763g77k372j32O62N74j731K469O977L920k223k592Q11L433j060j082k481o86
$$ plain form
14869 3146 -1058 -3162 -3886 -2168 31 -159 -5936 -8202 -11857 -4228 1607 350 -8492 -10054 -10235
14854 -10235 -3790 3518 3911 1527 -2063 1430 -3181 -8680 616 3575 4664 8105 6616 1000 -1370
14839 -1370 -60 4776 11454 12663 4274 561 -3296 3573 9031 6319 4041 2061 4816 5923 7469
14824 7469 5503 -1278 -1539 -1871 -633 6928 5109 2161 3264 3893 3900 -2210 -2891 -2790 -2484 -1189 -1607
14807 -1607 -293 -6719 -11344 -5798 -661 735 1555 -3438 -4600 -2384 -4851 -1094 1639 4454 4408
14792 4408 -5581 -9604 -1556 6862 9947 4444 -4310 -6492 -7190 -5779 1556 4127 -7533 -11349 -10015
14777 -10015 -10438 -11945 -1004 3880 1283 -4705 -8811 -7281 -4650 -833 11624 16368 6987 -777
14763 -777 -3149 -3281 -2619 -2045 -3776 -1307 5670 9590 7367 4775 5586 9019 7959 6877 4396 3710
14747C710k786p34l995j139L465L596J710L840m274r805L192K126K261J042p798
14732e589k607k201O405r47j856K17Q300l224m849K963N46R98Q475k343m517J581
14716A352l842l230j993K299m686k762K939K101l38r08N068M592L357J782L933
14701I664m91n234k947k278R111N487M36l551K024m228K980k572q203J801J140
14686C139k446L03R27K637K718o82J025J235k81M61Q83j621l419j849p982R63
14670c989M274j860k806l350j626n045K302M055L968j141n895M33L413L111j466
14655e622L533L654J892j067n170l028O43L930J2311L109K39n741j1065N41k22
14640b063j456J265j468N84l315m769q74P923k107q98L278j156M253j957j102
$$ plain form
14747 3710 924 190 -3805 -4944 -1479 2117 3827 7667 3393 -6412 -3220 -1094 1167 2209 -5589
14732 -5589 -8196 -10397 -3992 -4939 -6795 -6578 1722 -1502 -6351 -3388 -2842 -1844 6631 4288 -229 1352
14716 1352 -2490 -5720 -7713 -5414 -10100 -12862 -9923 -7822 -8160 -9068 -4000 592 3949 5731 9664
14701 9664 9173 3939 992 -1286 7825 13312 13748 10197 12221 7993 10973 8401 198 1999 3139
14686 3139 693 996 1923 4560 7278 6596 7621 8856 8575 9036 9919 8298 4879 3030 -4952 -3989
14670 -3989 285 -1575 -4381 -7731 -9357 -14402 -12100 -8045 -4077 -5218 -11113 -10680 -7267 -4156 -5622
14655 -5622 -2089 1565 3457 2390 -2780 -5808 -5165 -1235 11076 14185 14424 8683 -2382 -1841 -2063
14640 -2063 -3519 -2254 -3722 -3138 -6453 -11222 -12096 -4173 -6280 -7178 -3900 -5056 -803 -2760 -3862
14625c862R98L138K789Q61j245L319N08n801K142j521j58K38M700k955J603Q521
14609A3275l658n876N81k196j715L453r81q317N28O716J0545K295p126r921m85
14594b882L544L418J831k517k470k385L584N246m245q243m595j763R471K618q447
14579g835p909L292J3380J590n365j995q65L122p42n252j157j000l35P738j182
14564d515J213o46j44k868j062M598Q39j0929r83K729M648Q16l481k372j606J905
14548a1858L883l982Q282O304J849k042K443L247o87n234j886k170K869j807m650
14533e439j356q17l083O503Q477j332j0901p47K107j373M811n731l95J258k590
14518a0608P01l578K43M04m616R50J636J9435M818k670l750j843r54l712l850
$$ plain form
14625 -3862 -2864 274 3063 3924 2679 5998 6506 705 2847 1326 1168 1406 6106 3151 4754 13275
14609 13275 9617 3741 4322 2126 411 3864 2883 -5434 -4906 1810 12355 14650 7524 -2397 -2882
14594 -2882 662 4080 5911 3394 924 -1461 2123 7369 3124 -5119 -9714 -11477 -2006 612 -7835
14579 -7835 -15744 -12452 928 2518 -2847 -4842 -5707 -2585 -3327 -8579 -9736 -10736 -11071 -3333 -4515
14564 -4515 -3302 -3948 -4092 -6960 -8022 -3424 -2585 -13514 -14497 -11768 -7120 -6304 -9785 -12157 -13763 -11858
14548 -11858 -7975 -11957 -3675 2629 4478 2436 4879 8126 7439 2205 319 -1851 1018 -789 -5439
14533 -5439 -6795 -7612 -10695 -4192 4285 2953 -7948 -8695 -6588 -7961 -3150 -8881 -9276 -8018 -10608
14518 -10608 -9907 -13485 -13242 -12838 -17454 -16504 -14868 4567 9385 6715 2965 1122 168 -3544 -7394
14503g394m272K949P022N615j001r736m9Q984J927J500j064l045J777o175j184
14488d146L508l2K066J39O81j829P43J171j223j575M31q886j648R412N421k839
14472A394o022J876j706L157n83r76M618l127O84J060l456m504r119N252N476
14457e976K883N64M170K33n241K077M476k945j839J416N477m73o141q348Q173
14442a494N422N634J528o467l225o718j941P004K285l037O999k877n169n227o054
14427a3337M641O808m055o841n61J850R230O656n135j501Q840L33J248j838k892
14412C446k041M296m590K317l41n575k018M97N051o916j708M452L823J776j63
14397B306P37P037m981k845j599P79N042k122m710L93l232p189K157N215K786
$$ plain form
14503 -7394 -11666 -8717 -1695 3920 2919 -6817 -6866 2118 4045 5545 4481 1436 3213 -2962 -4146
14488 -4146 -638 -670 1396 1535 2216 387 1130 2301 1078 -497 -66 -8952 -10600 -1188 4233 1394
14472 1394 -4628 -2752 -4458 -1301 -1884 -2860 1758 -1369 -685 375 -3081 -7585 -16704 -11452 -5976
14457 -5976 -3093 -2529 1641 1874 -3367 -1290 3186 241 -1598 -182 5295 4822 -1319 -9667 -1494
14442 -1494 3928 9562 11090 4623 1398 -5320 -7261 -257 2028 -1009 5990 3113 -2056 -7283 -13337
14427 -13337 -8696 -1888 -5943 -12784 -13345 -11495 -2265 4391 -744 -2245 6595 6928 8176 6338 3446
14412 3446 1405 5701 1111 3428 3087 -2488 -4506 -4009 1042 -5874 -7582 -3130 693 2469 2306
14397 2306 3043 10080 5099 2254 655 1434 6476 4354 -356 37 -3195 -10384 -8227 -3012 -226
14382b26o213K737J830N403J689L204j016l316k077k932l619L412Q68L134L176
14367F054k262J136k77q788o097K6J111L98m489l087k949L131N635j79j634P962
14351d309L34q036K449K304k166M877M228P92J476K62l689n074j032Q100N427
14336E943J222R347j01j3455j0163K651L914j502l450j203R707L666q352M729
14322B953K328R22k06K359N972L045r516m646j50L484l302j0058j719J947L37
14307f250l288j557m57Q572L922Q4Q09O77J03Q66J488j282j2793k936j270r5o94
14290a4101K307J0949k180k597J223P60o816L441R326j915j732l499J977P073
14276D216o728N86n60l558M492j709n585m566k142j985N205K028M272M627k523
$$ plain form
14382 -226 -6439 -3702 -1872 3531 5220 8424 7408 4092 2015 -917 -4536 -1124 -256 2878 6054
14367 6054 3792 4928 4651 -4137 -10234 -10208 -9097 -8699 -13188 -16275 -19224 -16093 -10458 -10637 -12271 -4309
14351 -4309 -3975 -12011 -9562 -7258 -9424 -4547 -319 473 1949 2211 -1478 -6552 -7584 516 5943
14336 5943 7165 16512 16411 2956 -7207 -4556 -642 -2144 -5594 -6797 2910 6576 -1776 2953
14322 2953 5281 6203 5997 8356 14328 17373 7857 3211 3061 6545 3243 -6815 -8534 -6587 -6250
14307 -6250 -9538 -11095 -11552 -2980 942 1026 1835 2512 2615 3481 4969 3687 -9106 -12042 -13312 -13407 -14101
14290 -14101 -11794 -845 -3025 -5622 -4399 -3639 -10455 -7014 2312 397 -1335 -4834 -2857 4216
14276 4216 -2512 -1926 -2486 -6044 -1552 -3261 -8846 -13412 -15554 -17539 -12334 -10306 -6034 -1407 -3930
14261c930L11l825j373J323O899n753Q61N660K352J393l769L610K631J8N219J862
14245A3489L899k422k096M869k355o394n438k772j90J582L791M480L735j222M45
14230A3401o461j722K260K260L65p370j215O707O766J680k136m268q525m43k371
14215a072m047l027J138O642m324j371J575k254k920k298N978J383k777L895K636
14200h43P541n5n671k668k67n436M039M628K065p515l000O210O269j427r319n90
14184f039O344O060N233n832n391p02M974m171J266o36n2m214m645L719K373k081
14168c794l941N414L682M012m039k030K446l519O58O94N36N17r546l895N847N752
14152a206l545O64L417J64k327n307j683L163L961k375l868j186N275n483L986
$$ plain form
14261 -3930 -3619 -7444 -8817 -7494 -595 -6348 -5487 173 2525 3918 149 3759 6390 6408 11627 13489
14245 13489 17388 14966 12870 17739 15384 8990 3552 780 590 2172 5963 10443 14178 12956 13401
14230 13401 6940 5218 7478 9738 10103 2733 1518 8225 14991 16671 14535 10267 1742 1299 -1072
14215 -1072 -5119 -8146 -7008 -366 -4690 -6061 -4486 -6740 -9660 -11958 -5980 -4597 -7374 -3479 -843
14200 -843 6698 6643 972 -1696 -1963 -7399 -3360 1268 3333 -4182 -7182 -972 5297 3870 -5449 -6039
14184 -6039 305 6365 11598 5766 375 -327 4647 476 1742 1106 1054 -3160 -7805 -4086 -1713 -3794
14168 -3794 -7735 -2321 1361 5373 1334 -696 1750 -1769 -1111 -417 119 636 -8910 -12805 -6958 -1206
14152 -1206 -4751 -4087 -670 -506 -2833 -8140 -9823 -6660 -2699 -5074 -8942 -10128 -4853 -10336 -6350
14137f350K950J214J223k018J655o939j657N962o440R75j688J1123J889j097k022
14122a220K873J82j633m59J568J0136K751q391n031m192L252J837J88N90O64j888
14106A227o243l594N60M243l7R2l133l436K809Q81K063m414M658M922M152k799
14090A951M758j318l549P858M793n251q328n685l23l335K421K981K414n213j555
14075g381N487J112L602k272n307k757L69L214p65o175o36M616J1697N561j94
14060A0171q213r08k94n354l531J755R82L74L025r58l171p202P572N365m49m356
14044e192l971J6P02o64l11N83m181K185P272O343M93k386k907r72j45j193L624
14027g04N445K420n467M46P37m519j049m31k257J085N61n81k25O244P871P45L307
$$ plain form
14137 -6350 -3400 -2186 -963 -2981 -1326 -8265 -9922 -3960 -10400 -9425 -11113 10 1899 802 -1220
14122 -1220 1653 1835 202 -257 1311 11447 14198 5807 776 -3416 -164 1673 1861 2451 3115 1227
14106 1227 -5016 -8610 -8050 -3807 -3844 -3752 -6885 -10321 -7512 -6631 -4568 -8982 -4324 598 4750 1951
14090 1951 6709 5391 1842 9700 14493 9242 914 -4771 -5094 -8429 -6008 -3027 -613 -5826 -7381
14075 -7381 -1894 -782 2820 548 -4759 -7516 -7147 -3933 -4698 -10873 -11509 -6893 4804 10365 10171
14060 10171 1958 1050 756 -4598 -8129 -6374 -5392 -5018 -1993 -2951 -6122 -13324 -5752 -387 -836 -5192
14044 -5192 -9163 -9147 -8445 -9109 -9420 -8837 -13018 -10833 -3561 2782 3275 889 -2018 -2990 -3135 -4328 -704
14027 -704 4741 7161 1694 2140 2877 -1642 -2691 -3122 -5379 -4294 -3733 -4314 -4539 1705 9576 10321 13628
14010A3628l145K669K584p926k865j925j0162L23Q517L111o00k881m182L17l33
13995b870j820J47N576L265l232J699J310o407K34K385L872K197k764k288N340
13980F644J566k528J161l593m779k048N29L466l082o688m157J69Q200k493O714
13965i19L878M190j688n618N36N769J539K493N0m942P555j280m984q440o56L003
13949D86N191K092n206n784K384J025M692p22m943P22O950q598k664Q050M388
13934H063K498j139O98m104k382n97o840p252l018K971P960N955p677L349N109
13919C594K910K62p874k995J426M955p67K372o03j607j880K39J599r90o644m925
13903a0928L510K476N982L930k008J78K829j141J251l387l61k573q753K466N047
$$ plain form
14010 13628 10483 13152 15736 7810 4945 3020 -7142 -6819 1698 4809 4209 1328 -2854 -2537 -2870
13995 -2870 -4690 -4543 1033 4298 1066 2765 4075 -2332 -2098 287 4159 6356 3592 1304 6644
13980 6644 8210 5682 6843 3250 -1529 -3577 -3048 418 -2664 -9352 -13509 -13340 -5140 -7633 -919
13965 -919 2959 7149 5461 -157 379 6148 7687 10180 10230 5288 12843 11563 6579 -1861 -2517 486
13949 486 5677 7769 2563 -3221 -837 188 4880 4158 -785 -63 6887 -1711 -4375 3675 8063
13934 8063 10561 9422 10120 6016 3634 3037 -3803 -11055 -14073 -11102 -3142 2813 -4864 -1515 3594
13919 3594 6504 6766 -1108 -4103 -2677 2278 1511 3883 3280 1673 -207 32 1631 641 -6003 -10928
13903 -10928 -7418 -4942 1040 4970 2962 3140 5969 4828 6079 2692 2331 -242 -8995 -6529 -1482
13888a482k173j630J46l348Q257N561m640m393o059M677Q155L111K260J523O819
13873A6784J116l928p568n785k982J524L139L907l233j2J880l320m110P330R802
13858A4544k306n931k224p429J929L617K115N649n421L964M040J648k206p056
13844D933K420N926J948K118k000p87m604l69n230k809r781l838J837O525j380
13829e091O320o59L104l18m404R262J0k208k674o41J08m422j626N10N574N30M242
13812G617N361q019L51m723K378M484L020q66l883J134m479o103K055l103j810
13797f586M11L835J792K717p95k149p92R903J375q582j10J45P71l514l03k455
13781d337l312K799L103M631P08k777l808L6k132j696J22j502O923m43r106O358
$$ plain form
13888 -1482 -3655 -5285 -5139 -8487 -230 5331 691 -3702 -9761 -5084 3071 6182 8442 9965 16784
13873 16784 17900 13972 6404 619 -2363 -839 2300 6207 2974 2962 4842 1522 -2588 4742 14544
13858 14544 12238 6307 4083 -3346 -1417 2200 4315 9964 4543 8507 12547 14195 11989 4933
13844 4933 7353 13279 15227 17345 15345 14558 9954 9585 4355 1546 -8235 -12073 -10236 -3711 -5091
13829 -5091 1229 570 3674 3356 -1048 8214 8224 6016 3342 2701 2809 -1613 -3239 -2729 2845 3375 7617
13812 7617 12978 4959 5310 587 2965 7449 10469 9603 5720 6854 2375 -3728 -1673 -4776 -6586
13797 -6586 -6175 -2340 -548 2169 1374 -775 -1567 8336 9711 1129 1019 1164 1935 -1579 -1882 -4337
13781 -4337 -7649 -4850 -1747 2884 3592 815 -2993 -2957 -5089 -6785 -6663 -8165 -1242 -1685 -10791 -4433
13765d433l111j717N214k839m984j672N161O278R746J919n716o165J108K934R509
13750A1232m475o168M361p32J36k631O93j038L570n308J94m134O313J100o043
13735b930j0030L197N555Q60J369Q832M447M172N710n115o025j533l402o689R00
13720f82J905L535j819j751P33M636l001l408M084m956o326K674M587R218J051
13705A0480m397j390J862L906J450M538L151k093p156n327m751J561k06R34m414
13690a852k183L086R530O858n897k460l578L62m671K512K404J39L789K060j022
13675I077o633o092k65O388j84J52j282J134M158K460k696j0032k233Q858j543
13660A267J785K411K000P20n085p821j566j46L338M540L122N654o60r13j90m655
$$ plain form
13765 -4433 -7544 -9261 -4047 -6886 -11870 -13542 -8381 -2103 7643 9562 3846 -2319 -1211 1723 11232
13750 11232 6757 589 4950 4218 4354 1723 2416 1378 4948 -360 -166 -4300 2013 3113 -2930
13735 -2930 -12960 -9763 -4208 -3348 -1979 6853 11300 15472 21182 16067 10042 8509 5107 -1582 -682
13720 -682 1223 4758 2939 1188 1921 6557 3556 148 4232 -724 -7050 -4376 211 9429 10480
13705 10480 6083 4693 6555 10461 11911 16449 19600 17507 10351 5024 273 1834 1628 2562 -1852
13690 -1852 -4035 -949 8581 15439 9542 7082 3504 3866 -805 1707 4111 4250 8039 10099 9077
13675 9077 2444 -3648 -3913 2475 2291 2443 1161 2295 6453 8913 6217 -3815 -6048 2810 1267
13660 1267 3052 5463 7463 8183 3098 -4723 -6289 -6435 -3097 1443 4565 10219 9559 8646 8456 3801
13644C801n946p99k156N558P106k627k894K139m257L977L95O224L440M723k184
13629A6500l582k558o85P137J56k910m234N939k949O46l284N250j896j352n558
13614F620n449N608J451L302n791q837l829n69O902N502M527N365J452l458m119
13599H677n595K373Q41K137J736l721L273n81J980K418k060l45K36k962L017N156
13583A6580N090O76j502n779P76m086n190M162J819k997m109l690l29O125N002
13568A2548j474n594q176j3K586Q229K394j592j889K949p78l135L702P023J626
13553A8406O959Q54o423n304l698p414J467O253K817O592K768n974l367k43r92
13538A2701J360O106R006K567p822j2742r499J930R819Q10j526k709P090O300
$$ plain form
13644 3801 -2145 -2944 -5100 458 7564 4937 2043 4182 -75 3902 4297 10521 13961 18684 16500
13629 16500 12918 10360 9675 16812 16968 14058 9824 15763 12814 13460 10176 15426 13530 12178 6620
13614 6620 1171 6779 8230 11532 5741 -3096 -6925 -7494 -592 4910 9437 14802 16254 12796 8677
13599 8677 3082 5455 6296 8433 10169 6448 9721 9140 11120 13538 11478 11133 11369 8407 11424 16580
13583 16580 21670 22346 20844 15065 15841 11755 6565 10727 12546 9549 5440 1750 1421 7546 12548
13568 12548 11074 5480 -2696 -2709 -123 8106 10500 8908 7019 9968 9190 6055 9757 16780 18406
13553 18406 25365 26219 19796 14492 10794 3380 4847 11100 13917 20509 23277 17303 13936 13693 12701
13538 12701 14061 20167 29173 31740 23918 11176 1677 3607 13426 14236 12710 10001 17091 23391
13524B3391o237j63p07r01M317j352p97j986J392L024L441O11N275P856p633j0106
13508A9425n485m728o135N09N310N333J727J770l386J012J80K314n810o851N31
13493E716K749r72K799J0081O670m284n465m962M55J693J801j024k565K871l42
13478A5221j061j174k735j351k754p11Q420K191J2168j588l960m859k314j626
13464A3867o198m129N184N888N467L300m714n596l60O137K737m162m819l402M151
13449A3351L18k203J423K124Q56K065N895K154n558l899k190M09R697J11m201
13434B0352k532m66R41O282M430l349o334J474J309K849j74l306j876j322j861
13419A6417q94o460q36J37p98K769o014l400J822M035L131l941K363K317N531
$$ plain form
13524 23391 17154 16991 16284 15383 19700 18348 17551 15565 16957 19981 23422 24033 29308 37164 29531 19425
13508 19425 13940 9212 3077 3586 8896 14229 15956 17726 14340 15352 15532 17846 12036 5185 5716
13493 5716 8465 7493 10292 20373 27043 22759 17294 12332 12787 14480 16281 15257 12692 15563 15221
13478 15221 14160 12986 10251 8900 6146 5435 13855 16046 28214 26626 22666 17807 15493 13867
13464 13867 7669 3540 8724 14612 20079 23379 18665 13069 12709 18846 21583 17421 12602 9200 13351
13449 13351 13669 11466 12889 15013 15869 17934 23829 25983 20425 16526 14336 14745 24442 24553 20352
13434 20352 17820 17354 18295 24577 29007 25658 19324 20798 22107 24956 24782 21476 19600 18278 16417
13419 16417 15523 9063 8227 8364 7566 10335 4321 921 2743 6778 9909 5968 8331 10648 16179
13404A6179P667N304L77j0056r159j721M348P247J190j871j1296j140L432j517
13390H984k655O812J856L460j007J726P693M220r41l013J065j257m48k774n306
13375A8415M479K844n96O307P749J794J344M996N657n309J906L476N308P345J6534
13360H2249L2256K7335L0964M9873R5930J85514L14037M38094M29618O6516m52455
13349A299931m41252k58226j49453q7543n9567l8954k1014j4386k0355j3521j2097
13338A83563j5370j2255p325l357n596p134k000l63q236p696K67L818l82o630
13324A11304o753p068K687M49q926m642N4J169l346k048n39j419k023r13J2136
13309I0122k605o708l343M289Q41q918o726n133l443K053J100M761K234n049o119
$$ plain form
13404 16179 23846 29150 29527 19471 10312 8591 12939 20186 21376 19505 8209 7069 10501 8984
13390 8984 6329 13141 14997 18457 17450 19176 26869 31089 30148 27135 28200 26943 26495 23721 18415
13375 18415 22894 25738 25142 31449 39198 40992 42336 47332 52989 47680 49586 53062 58370 65715 82249
13360 82249 114505 141840 172804 222677 318607 504121 818158 1256252 1685870 1752386 1299931
13349 1299931 858679 600453 451000 363457 303890 264936 243922 229536 209181 195660 183563
13338 183563 168193 155938 148613 145256 139660 132526 130526 130163 121927 114231 114498 118316 117934 111304
13324 111304 104551 97483 100170 100619 91693 87051 87105 88274 84928 82880 82341 80922 78899 77986 90122
13309 90122 87517 80809 77466 81755 82596 73678 66952 61819 58376 60429 61529 66290 68524 63475 57356
13294E7356l409k769o725O539J6219M093J979K992l658p456N926k61j416o703
13280F2707q62P08l489l150l758k396m125j3686L21P548M480M914N326M584P316
13265F6438o239j9219r202N809J779L383M940J759P080J794j910q926l226m874
13251C9386n972N2P833P705J0008J971N97l399n843n972j25n765j404M955L564
13236D7591P79p766J16O091K764J187l458j822n588J829R9n141j003m632K579
13221C3625Q180K327j459N079J315r846r421m158L346j226j654j474J960n034
13207B1560n748q29Q22J0179N907J437M724L312O144R123O719N075j744m773N087
13192F6995P027Q353q30k225j845q580q156J024O120o803k5521k2427j5251l19
$$ plain form
13294 57356 53947 51178 44453 50992 67211 71304 73283 76275 72617 65161 71087 70826 69410 62707
13280 62707 61845 62553 59064 55914 52156 49760 45635 31949 32270 39818 44298 49212 54538 59122 66438
13265 66438 60199 40980 31778 37587 39366 42749 47689 49448 56528 58322 56412 47486 44260 39386
13251 39386 33414 33466 41299 49004 59012 60983 61580 58181 52338 46366 46241 40476 39072 44027 47591
13236 47591 48370 40604 40720 46811 49575 50762 47304 45482 39894 41723 41822 36681 35678 31046 33625
13221 33625 41805 44132 42673 47752 49067 39221 29800 25642 28988 27762 26108 24634 26594 21560
13207 21560 15812 14983 15805 25984 31891 33328 38052 41364 47508 56631 63350 68425 66681 61908 66995
13192 66995 74022 82375 81545 79320 77475 68895 60739 61763 67883 61080 35559 13132 -2119 -2438
13178b438J3621J0312O588J017M675j782J542l111l186J033O506J0143n37l157
13164D1226P795J211K648N166k947K179m258r678J161Q255N701p782J539J0995
13150F3211K9066M5083M8303M1492K3172m2228q1692o2144J1696K8446j6964J4810
13138A02251J6148j7043q176q723j0224M877J0952O3n783o822K44K537m808n404
13124G0089R09l267N713J2479O152M728j1389j6647j6418j0619j1882Q189J0787
13111D8824J3397J5021R902q360j93O035j594j8709j1601M26J0181K52n204r085
13097D9292l91M270P740J2186L421j0338p89q633q905m577l837P336R013K968
13083E8756q693m426J5479L7500L8399M5881M4969j1960k2598j4730r247j1542
$$ plain form
13178 -2438 11183 21495 28083 29100 33775 31993 33535 30424 27238 28271 34777 44920 44383 41226
13164 41226 49021 50232 52880 58046 55099 57278 53020 43342 44503 52758 58459 50677 52216 63211
13150 63211 92277 137360 185663 227155 250327 208099 126407 64263 75959 104405 87441 102251
13138 102251 118399 101356 93180 84457 74233 79110 90062 90125 84342 77520 77764 80301 75493 70089
13124 70089 70998 67731 73444 85923 92075 96803 85414 68767 52349 41730 29848 38037 48824
13111 48824 62221 77242 87144 78784 78591 84626 83032 64323 52722 53148 63329 63581 58377 49292
13097 49292 48901 53171 60911 73097 76518 66180 65391 56758 47853 43276 39439 46775 55788 58756
13083 58756 50063 45637 61116 98616 137015 182896 227865 215905 193307 178577 169330 157788
13071A57788j0794r657j1123r940k0594k2209j490J1092O483P540l553L369R809
13058A06721J1683J2455R315L568P19J523N009o37n421L312j708n463j592n331
13044A34153j3134j0021k811N691J511J466J1917J1299O676Q747J3646R096L385
13031A81621J3047J9803N215n05K133J2424R485K9115M9510O5806O9568Q4326
13019E41548J19150J71786K69236K89692J61156j51239l25327k12189q7137m6623
13009G30053n2120n3602k9671q914l513O318J3685Q917R329o018k2098k7541l2056
12996E32769k4555m846O534j378L285o812j2660o520j384L204j4450k0126r753
12983D43308p945R237K4683M0586K8989n197j8998m811L915J3443K4292L2076
$$ plain form
13071 157788 146994 137337 126214 116274 95680 73471 71981 83073 89556 97096 93543 96912 106721
13058 106721 118404 130859 140174 143742 144461 145984 150993 150356 144935 148247 146539 141076 139484 134153
13044 134153 121019 110998 108187 113878 115389 116855 128772 140071 146747 155494 169140 178236 181621
13031 181621 194668 214471 219686 219181 221314 233738 243223 272338 321848 387654 457222 541548
13019 541548 660698 832484 1101720 1391412 1552568 1401329 1076002 863813 776676 730053
13009 730053 677933 624331 594660 585746 582233 588551 602236 611153 620482 614464 592366 564825 532769
12996 532769 508214 503368 509902 508524 511809 504997 492337 485817 484433 487637 473187 453061 443308
12983 443308 435363 444600 469283 509869 538858 533661 514663 509852 513767 527210 551502 583578
12971E83578K3301m458j3620p038L128j1891j5299j6974p676q102O4J2631O119
12958E43763K011N327J9072J8424p344p367q112k0299k4123q151K0074J5175r916
12945E38534l584K2693K8578K1568K325j9263k8101l1102k2625q385J4138L1387
12933E46163N7051N0022K9559L5498N6637Q1543J03678R0176Q2276Q0418Q2189
12922A295210J19335J36336J12054J00905R0435Q7911J01649J30465J69556K03115
12912B546971J46472J00762J01599J53131K47220M11657N54948O72460P75535
12903E710755J016517J424404J786844J918239J716662J925446K917834M299670
12895B2716371O202299R323882J4752255K4789735M3334170P0044590Q9033270
$$ plain form
12971 583578 606879 602421 588801 581763 584891 573000 557701 540727 533051 524949 525013 537644 543763
12958 543763 545774 551101 570173 588597 581253 573886 565774 545475 521352 513201 533275 548450 538534
12945 538534 534950 557643 586221 607789 610114 590851 562750 531648 509023 500638 514776 546163
12933 546163 603214 653236 682795 718293 774930 856473 960151 1050327 1132603 1213021 1295210
12922 1295210 1414545 1550881 1662935 1763840 1854275 1942186 2043835 2174300 2343856 2546971
12912 2546971 2693443 2794205 2895804 3048935 3296155 3707812 4262760 4935220 5710755
12903 5710755 6727272 8151676 9938520 11856759 13573421 15498867 18416701 22716371
12895 22716371 28918670 38242552 52994807 77784542 121118712 191163302 280196572
12888B80196572O6173154l0649214j00045513p2954315m0541831k2902995j4307553
12881F4968305r811140p174627n106126l588737k550943j962285j863432k242943
12873C0668072k302770j938450j606744j338111j100363j028128j008635r71053
12865A9373818q76828p58892o03611n13538n70532p01206p02563o10685n15090
12856A3520873m15129l74210l61858l26216l33530l13031k51728k19102k30191
12847A0695878k39349k56016k61448k60758k57066k53114k49663k44099k32890
12838H441475k35901k52982k60269k33594j80647j43028j22158j36850j74825
12829F701221j78325j52643j40855j49982j60296j83883j73694j27517j05570
$$ plain form
12888 280196572 346369726 315720512 215674999 142720684 102178853 79275858 64968305
12881 64968305 55157165 47982538 42876412 39287675 36736732 34774447 32911015 30668072
12873 30668072 28365302 26426852 24820108 23481997 22381634 21353506 20344871 19373818
12865 19373818 18496990 17738098 17134487 16620949 16050417 15349211 14646648 14035963 13520873
12856 13520873 13105744 12731534 12369676 12043460 11709930 11396899 11145171 10926069 10695878
12847 10695878 10456529 10200513 9939065 9678307 9421241 9168127 8918464 8674365 8441475
12838 8441475 8205574 7952592 7692323 7458729 7278082 7135054 7012896 6876046 6701221
12829 6701221 6522896 6370253 6229398 6079416 5919120 5735237 5561543 5434026 5328456
12820E328456p7429o1396p3109r1948j16038j08029j04983j19704j15751j14016
12810D346053j07189q5312o6002m9388m4678m5004o1434q9391j15863j15408j01597
12799C464787r0184q2712o3927m5629l3473l4267m1291l9183l7530m8618m5457
12788B902516l5819k9716l9363m9240m1418l7109l5781m5333n9662q0782q6803
12777B361490p6735n8745l4257j3133l521j3179j6016j9965j3031M218K0025O0419
12765B197570J57889K37744K64564K46727J38776l6528k92059l48192k50880j39609
12755B176002o6870m8081n1696m9150l8370m2853m2092m1506l8694m1063l3405
12744A682222l9991l8704k6602k1178j7791j7387k4367j7473j5615j8076l1712
$$ plain form
12820 5328456 5251027 5189631 5116522 5024574 4908536 4800507 4695524 4575820 4460069 4346053
12810 4346053 4238864 4153552 4087550 4038162 3993484 3948480 3887046 3797655 3681792 3566384 3464787
12799 3464787 3374603 3291891 3227964 3182335 3148862 3114595 3073304 3034121 2996591 2947973 2902516
12788 2902516 2866697 2836981 2797618 2748378 2706960 2669851 2634070 2588737 2529075 2448293 2361490
12777 2361490 2284755 2226010 2191753 2178620 2175099 2161920 2145904 2125939 2112908 2117126 2137151 2197570
12765 2197570 2355459 2593203 2857767 3104494 3243270 3206742 2914683 2566491 2315611 2176002
12755 2176002 2109132 2061051 2009355 1960205 1921835 1878982 1836890 1795384 1756690 1715627 1682222
12744 1682222 1642231 1603527 1576925 1555747 1537956 1520569 1496202 1478729 1463114 1445038 1413326
12733A413326k5886k6493l7376m6698k6021k9789l1243l3585l2801l0803j8519
12722A074112j0629q291j3694j7682j4511p361j4065j3816j6014j9443j2404r769
12710I16433k0690l9790l5670k2377k0439j2464r329l0576l2920l1083k3896j9675
12698F17524j6304J1358M9242L6709J0849q277o676n472K247l689j3524k0408
12686F53579k8228l2500j0039o097j6275o742N866m662o202j4175k1139r107l054
12673E01225o558j1958r651j5912j5323p744n985r896q420J8693J6803P4j0865
12660D34483j9637k0025j8222j2118o592n928J857L089O782l001o604q849j0626
12647C34609j5283l977J177J625M222m013m759L586R493J3813K1192K965r932
$$ plain form
12733 1413326 1387440 1360947 1323571 1276873 1250852 1221063 1189820 1156235 1123434 1092631 1074112
12722 1074112 1063483 1055192 1041498 1023816 1009305 1001944 987879 974063 958049 938606 926202 916433
12710 916433 895743 855953 820283 797906 777467 765003 755674 725098 692178 661095 637199 617524
12698 617524 601220 612578 661820 698529 709378 701101 694425 688953 691200 687511 673987 653579
12686 653579 625351 592851 582812 576715 560440 553698 559564 554902 548700 534525 513386 504279 501225
12673 501225 494667 482709 473058 457146 441823 434079 428094 418198 409778 428471 445274 445348 434483
12660 434483 414846 394821 376599 364481 357889 351961 353818 356907 363689 360688 354084 345235 334609
12647 334609 319326 315349 316526 318151 322373 318360 313601 317187 326680 340493 361685 364650 354718
12634C54718o075o412l4628n2718l4504k869O475J1071J1956P700L613k151k0561
12621B35615j3281n67n694m728l182J971q007l841k283J558l090p62O067J0670
12607B10446j209l976P305l723q035k395j049o9J972N370L957j0753q949j9718
12593A69174j2413k974K737J198p698k5388j6241l737J1315J2947o08k271q166
12580A17875j7548J283P745n994o350Q984R093N367Q055l145N53K065o346q648
12566A12989K204M786K962j784o457n445p000j2328n143L977L164k158K877K887
12552I5531p92l009L057M983n102r712j1259l469r040j551L024N028K505J006
12538G1200j579k968j397N054n673j4632q746m376L321k515J483J0001N744N348
$$ plain form
12634 354718 348643 342231 307603 254885 220381 217512 223987 235058 247014 254714 258327 256176 235615
12621 235615 222334 221767 216073 211345 208163 210134 202127 198286 196003 197561 194471 193709 199776 210446
12607 210446 209237 205261 212566 208843 200808 198413 197364 197295 199267 204637 208594 197841 188892 169174
12593 169174 156761 153787 156524 157722 150024 124636 108395 104658 115973 128920 128312 126041 117875
12580 117875 100327 101610 109355 103361 97011 105995 115088 120455 128510 125365 125918 127983 121637 112989
12566 112989 115193 119979 122941 121157 114700 109255 102255 89927 84784 88761 91925 89767 92644 95531
12552 95531 94739 91730 94787 99770 94668 84956 73697 70228 61188 59637 62661 67689 70194 71200
12538 71200 69621 66653 65256 70310 64637 50005 41259 36883 40204 37689 39172 49173 54917 60265
12524F0265j306k307j194j2162N99N562Q557J0479N554m644M025p046j1091j3085
12510D2206n334P78J4478J289L57r47n673r627j3748n646N941M816O049L683K842
12495D1464l506l450r352k350O837k600o538M918J242l684L271Q264N990k582
12481C7924p97m85o693M158J32L853k518r007k392J625k855l060R120M46M001
12466C3452n043r458r55N050K285l021n079J673K592J193l143p93k432j009O129
12451B1441L171L68l457K870n174j305M374R759J976L517O50N64J315l268N46
12436C7347P651L2M07N130m012K68J0296J2278N75J506N983K0355M9894M7353
12422A95063M8398R2340J66147K67276L94396M45765K09324l49288m77274l05042
$$ plain form
12524 60265 58959 56652 55458 43296 43895 49457 58014 68493 74047 69403 73428 66382 55291 42206
12510 42206 36872 37650 52128 53417 53774 52827 47154 37527 23779 18133 24074 28890 34939 38622 41464
12495 41464 37958 34508 25156 22806 29643 27043 20505 25423 26665 22981 26252 34516 40506 37924
12481 37924 37127 36642 29949 34107 34239 38092 35574 26567 24175 25800 22945 19885 29005 29451 33452
12466 33452 28409 18951 17996 23046 25331 22310 17231 18904 21496 22689 19546 18753 16321 15312 21441
12451 21441 24612 24980 21523 24393 19219 17914 22288 32047 34023 37540 38190 38754 40069 36801 37347
12436 37347 44998 45030 45437 50567 46555 46823 57119 69397 69972 71478 77461 97816 147710 195063
12422 195063 243461 335801 501948 769224 1163620 1609385 1818709 1469421 992147 687105
12412F87105j73091j03440o7461n4927l0585j9957j9233q113j4267j2941r329
12401A73761j2129j0359p115m045n083r380j1242o092m636N022L453l755q583
12388I9817j1962p080k577m24J81m07J815M081P46J349R90l416r303j1022O60
12373F3448l032k045N342L1n03k975j351N50L638k015L29k969L163R049L228m146
12357F9742p122j0032l489M381P115J0117P251J2462J7616M765m945J2567L1815
12344A52243N8416P4572O3163k3147r0684o8818m0568j6984q970l874j1302j0617
12332G3430j899r134o312j597k565m482P00L724J769J364m312m104m8p244o212
12317C3078q94M995p3M372K064o697n028J952n094K591R636p073l44M161q7M258
$$ plain form
12412 687105 514014 410574 343113 288186 257601 237644 218411 210298 196031 183090 173761
12401 173761 161632 151273 144158 140113 135030 125650 114408 108316 103680 108702 112155 108400 99817
12388 99817 87855 80775 78198 77774 77955 77548 79363 83444 84190 85539 86529 83113 73810 62788 63448
12373 63448 60416 58371 63713 63744 63241 60266 58915 59465 63103 61088 61417 58448 61611 70660 73888 69742
12357 69742 62620 52588 49099 53480 60595 70712 77963 90425 108041 112806 107861 120428 152243
12344 152243 210659 285231 348394 325247 234563 165745 125177 108193 99223 95349 84047 73430
12332 73430 71531 62397 56085 54488 51923 47441 48141 51865 53634 54998 50686 46582 46534 39290 33078
12317 33078 32184 37179 37106 41478 43542 36845 31817 33769 28675 31266 40902 33829 33485 37646 37559 41817
12301D1817k480j0842J035J477J674N569l175o315q555j46P265n58o52J906o257
12286B1763n84K529r557L205o67m031l228O331O098R413L919o280k960L194J328
12271C0473j820n310l599j721P17n707r528n153J10j179J0226J0828N913j536
12257B2714n159l75L889K307L347r26J213K958K366o65p275m670L1K459J840m790
12241A9264o039J301k309l803p55o120n280N074j263O475M319N381n187q757j80
12226B121N763O918o767m415k819N147J766r11N65J36J798L937O659M333j777
12211B2454l7j0836k481j338L252j584o951J3542P421k658p909j673J638N872
12197A8712K421M536r126L065j747o65J578k65M306M03p565o165L08K082n406
$$ plain form
12301 41817 39337 28495 29530 31007 32681 38250 35075 28760 20205 20059 27324 26766 26114 28020 21763
12286 21763 21179 23708 14151 17356 16689 12658 9430 15761 21859 31272 35191 28911 25951 29145 30473
12271 30473 28653 23343 19744 18023 18740 13033 3505 -1648 -1538 -2717 7509 18337 24250 22714
12257 22714 17555 17180 21069 23376 26723 25797 27010 29968 32334 31669 24394 19724 19755 22214 24054 19264
12241 19264 13225 14526 12217 8414 7659 1539 -3741 1333 70 6545 10864 16245 11058 2301 2121
12226 2121 7884 14802 8035 3620 801 5948 7714 6803 7368 7504 9302 13239 19898 24231 22454
12211 22454 22417 11581 9100 7762 11014 9430 2479 16021 23442 20784 12875 11202 12840 18712
12197 18712 21133 25669 16543 19608 17861 17196 18774 18509 22815 23218 15653 9488 9796 11878 6472
12182F472K933L561L179n61J405O50r90J896O98l915n048J22L720M546J4547J015
12166C4230j5153j1572M412M590o716r189N635J823L388O47n727k578q566m585
12152i361J553K440m378J878P625m88j113N237j029l871N78o040l404N827m032
12137h578K04J0622Q937J809K683j461j3010j0198j500J697M339O65L655P662
12123G526r1L294j447l148k421o18K650L62k125m461K781K856o89R74p92m613
12107C8K177l75J107O431Q256k56P078M517o201j0006l712J126k528j0606j493
12092d447O593M107m96r58m238P945J006k330l050q78m948M36M003o41j83j638
12076B83k638M330k45M490j323j346M294J352l449l472l95L516K000k951L768
$$ plain form
12182 6472 9405 12966 16145 15584 16989 17639 16649 18545 19243 15328 10280 10402 14122 18668 33215 34230
12166 34230 19077 7505 11917 16507 9791 602 6237 8060 11448 12095 6368 3790 -4776 -9361
12152 -9361 -7808 -5368 -9746 -7868 -243 -731 -1844 3393 2364 -1507 -929 -6969 -10373 -4546 -8578
12137 -8578 -8374 2248 11185 12994 15677 14216 1206 -8992 -10492 -8795 -4456 -3791 -136 7526
12123 7526 7435 10729 9282 6134 3713 3095 5745 6107 3982 -479 2302 5158 4469 5443 4651 38
12107 38 2215 1840 2947 9378 17634 17378 24456 28973 22772 12766 9054 10180 7652 -2954 -4447
12092 -4447 2146 6253 5757 4799 561 8506 9512 7182 4132 3254 -1694 -1258 2745 2104 1921 283
12076 283 -2355 1975 1730 6220 4897 3551 7845 9197 5748 2276 1881 5397 7397 4446 8214
12061H214ol025j329J063r94j873n121L349n10L290k017k626M348J987n827n547
12045f624j253K286M148O111l409n205N58k968K295L383L820M518M160K033p222
12030F631l695l799j601n45N66L647N257J913J28j853k65l094j44m13q83K754
12014D604o384k730M915p42l780P03K979M103L271L896n303m642o573J911j227
11999d999l823J577K193L912n197K353M155m298J101Q082Q05k327j0149j725M854
11984c486O426K42j315k246k517j376K504P766N938M38k132k969k703o606j178
11969c214o49N15J332M50M546k584j814J678L702k726q82j112K65k245j435K057
11953b116J488L206l183k988M02Q778l236k261p6K73j882J661k092q23M275Q015
$$ plain form
12061 8214 8208 5183 3854 4917 3923 2050 -3071 278 -232 3058 1041 -1585 2763 4750 -1077 -6624
12045 -6624 -7877 -5591 -1443 4668 1259 -3946 -3388 -6356 -4061 -678 3142 7660 11820 13853 6631
12030 6631 2936 -863 -2464 -3009 -2443 1204 6461 8374 8502 6649 6384 3290 3146 2733 1850 4604
12014 4604 -1780 -4510 405 -337 -4117 -3414 -435 3668 6939 10835 5532 890 -5683 -3772 -4999
11999 -4999 -8822 -7245 -5052 -1140 -6337 -3984 171 -4127 -3026 5056 5861 3534 -6615 -8340 -3486
11984 -3486 2940 3182 1867 -379 -2896 -4272 -1768 5998 11936 12374 10242 7273 4570 -2036 -3214
11969 -3214 -3863 -3348 -2016 -1566 2980 396 -1418 260 3962 1236 354 -758 -493 -2738 -4173 -2116
11953 -2116 -628 2578 -605 -3593 -3191 5587 2351 90 14 287 -1595 66 -2026 -2849 1426 9441
11937I441L311p571o580K526L64L753m499O357O537k691p29p965j00K721l4k516
11921B325k161j230k380M794M259N228o306n200o67q18j861L215M552K050J34
11906E934L510j739J359k02p222n38P818J176o018J126l008j85o72k103L584L231
11890F051n233O7J164m163L584M066q22M64l771J970K056j043n634J013l450J73
11874c508K974K708R682J89m092l708k266L226k800j880L141J06k043k13R43k223
11858B36o1J169l086m32l67o092n519N633j161k606K333p28J006J934Q422N201
11842E882k376L001n289k677N551J397l928q279L512M020j953N369k35R53n32
11827D416l123k864m338J824K726l660j415p519O508J193j248L455N881m48j079
$$ plain form
11937 9441 12752 5181 -1399 1127 1491 5244 745 7102 13639 10948 10219 2254 2154 4875 4841 2325
11921 2325 164 -1066 -3446 1348 5607 10835 4529 -671 -1338 -2156 -4017 -802 3750 5800 5934
11906 5934 9444 7705 9064 8862 1640 1102 8920 10096 4078 5204 2196 2011 1339 -764 2820 6051
11890 6051 818 885 2049 -2114 1470 5536 4714 5178 1407 3377 5433 4390 -1244 -231 -3681 -3508
11874 -3508 -534 2174 11856 12045 7953 4245 1979 5205 2405 525 3666 3772 1729 1516 2459 236
11858 236 175 1344 -1742 -2174 -2541 -8633 -14152 -8519 -9680 -12286 -9953 -10681 -9675 -7741 681 5882
11842 5882 3506 6507 1218 -1459 4092 5489 1561 -6718 -3206 814 -1139 4230 3995 4948 4416
11827 4416 1293 -1571 -5909 -4085 -1359 -5019 -6434 -13953 -7445 -6252 -7500 -4045 1836 1388 309
11812C09l236m177j0000j04J4734L02J884L428q47j297l401j858Q252L282m553
11797B718r320j874R892O258k3M165J571k464l600j585N820j364n563q949qO847
11781B521n017j500J789J1517L437p323j5108R67j469M263Q465R518k70o285o213
11766g08l565Q92o197P489K135N266m561p718o393O766M259J835O522K630q005
11751F47p931R697O226o133l758j120M96m71k875L157J230J997j778k612K276
11736i52j732r5p69M73l270p18N146J3455p33p871m318m596j609L429k46L036
11720a370N186m314j957L240N72N158K184p31L683M310K607r41n272n781p972
11705a398q74k915p3K051M860l26N479M440o910j0880n848J755J089J34L755J738
$$ plain form
11812 309 -2927 -7104 -17104 -17208 -2474 -2172 -288 3140 2293 996 -2405 -4263 3989 7271 2718
11797 2718 -6602 -8476 1416 7674 7651 11816 13387 10923 7323 5738 11558 10194 4631 -4318 -4326 2521
11781 2521 -2496 -3996 -2207 9310 12747 5424 -9684 -8717 -10186 -5923 2542 12060 11790 5505 -708
11766 -708 -4273 -3381 -9578 -2089 46 5312 751 -6967 -13360 -6594 -2335 -500 6022 8652 647
11751 647 -7284 2413 8639 2506 -1252 -2372 -1876 -2347 -5222 -2065 -835 1162 -616 -3228 -952
11736 -952 -2684 -2779 -3548 -3075 -6345 -7063 -1917 11538 10805 2934 -1384 -5980 -7589 -4160 -4406 -1370
11720 -1370 3816 -498 -2455 785 1357 6515 8699 7968 11651 15961 18568 17627 12355 6574 -1398
11705 -1398 -2272 -5187 -5260 -3209 1651 1325 6804 11244 4334 -6546 -12394 -10639 -9550 -9416 -5661 -3923
11689c923M427J387n407o079L344j777j049N972K093m196L111l437j409N383P0
11674a490l926O84m16L901K139p89l365l63l194L838J451K673O860L338m666o630
11658D5K499P650K368k55q194m57k378m559o220m181L727K357M811K321M962j51
11642D345q59m24m185j208q30j405N59L757l0L389M266k685l802l639k346l454
11626h551L080K399Q45m694r526R497J3025M459j133l254j466l207R38n096j284
11611c968o611M618Q243N648J053K501O08l184m384p209p09M742O035K400l634
11596F149p06m06J013l807k152Q63L986M250l416m076l195m389L882M337m166
11581a833n083L638k925j427L015m34o819N818l477k422R25N145N546k483K648
$$ plain form
11689 -3923 504 1891 -3516 -9595 -6251 -8028 -9077 -3105 -1012 -5208 -2097 -5534 -6943 -1560 -1490
11674 -1490 -5416 -4732 -5148 -1247 892 103 -3262 -3625 -6819 -2981 -1530 1143 8003 11341 6675 45
11658 45 2544 10194 12562 12307 4113 3656 1278 -3281 -9501 -13682 -9955 -7598 -2787 -466 4496 4345
11642 4345 3486 3062 -1123 -2331 -3161 -4566 -4007 -250 -280 3109 7375 4690 888 -2751 -5097 -8551
11626 -8551 -5471 -3072 -2227 -6921 -16447 -6950 6075 10534 9401 6147 4681 1474 2412 -2684 -3968
11611 -3968 -10579 -5961 2282 7930 8983 11484 12092 8908 4524 -2685 -3394 1348 7383 9783 6149
11596 6149 5443 5037 6050 2243 91 954 4940 9190 5774 1698 -1497 -5886 -2004 2333 -1833
11581 -1833 -6916 -3278 -6203 -7630 -4615 -5049 -11868 -6050 -9527 -11949 -11024 -5879 -333 -2816 -168
11566a68M390R88R33j282o077L836P40m083J191j947j323K765o429j023M481Q919
11550E911k023q117N115M840N436P932j791r849q32J536k828K881k643p152j84
11535a768q411J282R505m430r74J426L784O327Q318k346l702l261k130O30M566
11520H816n094m481L387k350o363J373O287M875kl24n500m855L946l247m448L044
11504d936J0111O490n777L68k067n79L57p16p869p60N722L128O35M47M155m407
11488D302n947l450L58J828q527M860R924j268K797J165j085l473K00P49k391
11473D2m846L264r73n254K714M278P395q61l273n489J641n203j677m41L478j667
11457f872K250o42L639Q837r987j810O184M748K263l971p85l62N33Q8k759j0423
$$ plain form
11566 -168 4222 5210 6143 4861 -1216 2620 3360 -723 468 -1479 -2802 -37 -6466 -7489 -3008 5911
11550 5911 3888 -4229 886 5726 11162 19094 17303 7454 6622 8158 5330 8211 5568 -1584 -1768
11535 -1768 -10179 -8897 608 -3822 -4796 -3370 414 6741 15059 12713 9011 5750 3620 4250 8816
11520 8816 3722 -759 2628 278 -6085 -4712 1575 6450 6448 6124 624 -4231 -285 -3532 -7980 -4936
11504 -4936 5175 11665 5888 6256 4189 3610 3967 3251 -4618 -5378 344 3472 4107 4554 8709 4302
11488 4302 -1645 -5095 -4737 -2909 -11436 -6576 3348 2080 4877 6042 4957 1484 1684 2433 42
11473 42 -4804 -1540 -2513 -7767 -5053 -775 6620 5759 2486 -3003 -1362 -6565 -8242 -8683 -5205 -6872
11457 -6872 -4622 -5264 -1625 7212 -2775 -4585 1599 6347 8610 4639 3854 3492 4025 4113 1354 -9069
11441i069J912P014J047k319j034K954J472N929J715R62k844L76M192n209p023
11426G5M462j797r272o944M576P955M862k164j221m3n330M655O748j183o006L99
11410b28q98P7L8k82n80k274K19l69L363m693J279O44k398O02K696p27M473q17
11392A25M80R26J244M692J564J334n606o66l77m072o194k307N116K325R21J983
11376A488N218K07j4j775p207j714J908L810p26L074k438j1377N474J0645K522
11361I095l743q271l275L122K584L783P09l428L161l312o089P814M157l177l177
11346d7k474k224j558p31J726J2167J2680m348q361p525J175l10L07o086l106
11331h715J550o3K94j775p70j26K041M695M225P72J794M93j356o495J723L16P47
$$ plain form
11441 -9069 -7157 -143 904 -1415 -2449 505 1977 7906 9621 10583 7739 8115 12307 7098 75
11426 75 4537 2740 -6532 -13476 -8900 -945 3917 1753 532 489 -4841 -186 6562 5379 -627 -228
11410 -228 -1126 -1049 -1011 -1293 -1873 -4147 -3928 -4297 -934 -5627 -4348 -3704 -6102 -5500 -2804 -3531 942 125
11392 125 605 1531 2775 7467 9031 10365 4759 4093 3716 -356 -6550 -8857 -3741 -1416 -495 1488
11376 1488 6706 6913 6899 5124 -2083 -3797 -1889 1921 1195 4269 1831 -9546 -4072 6573 9095
11361 9095 5352 -2919 -6194 -3072 -488 3295 4004 576 3737 425 -5664 2150 6307 3130 -47
11346 -47 -2521 -4745 -6303 -7034 -5308 6859 19539 15191 6830 -695 480 170 477 -5609 -8715
11331 -8715 -7165 -7228 -6934 -8709 -9479 -9605 -7564 -2869 1356 2128 3922 4415 3059 -3436 -1713 -1397 -650
11314f50l766o356P698M07r79J347P59m007p51M757j382k054n53K520O616n06
11298C100j085j13m649N04L924K790k736P9K499k658n582j278q7L065M919K086
11282D778k161k320l295K699m40j0993j962P364K492o330m750Q16R042J100M085
11267A25j588q37L847K041l572p148n875P415M602n94R69l153l98J602J617l152
11251d099n335L399K074k980K792K087M0m868k732j888k991j315L445O842K040
11236c489j314K508J229K724L635l37m610R28N597L644l568p558M578L382n119
11221B230p272M784N756l436L020K281K47O132j118r606l443k923L312L024m654
11206a666k972K385j668O611N410N499r351r660q32O920N289j749o192m785q97
$$ plain form
11314 -650 -4416 -10772 -3074 -2667 -3646 -2299 -1540 -5547 -6298 -1541 -2923 -4977 -5530 -3010 3606 3100
11298 3100 2015 1902 -2747 -2243 1681 4471 1735 1814 4313 1655 -3927 -5205 -5292 -2227 2692 4778
11282 4778 2617 297 -2998 -299 -739 -11732 -13694 -6330 -3838 -10168 -14918 -14102 -5060 -3960 125
11267 125 -1463 -2300 1547 3588 16 -7132 -13007 -5592 -990 -1584 -615 -3768 -4166 -2564 -947 -4099
11251 -4099 -9434 -6035 -3961 -6941 -4149 -2062 -2022 -6890 -9622 -11510 -14501 -15816 -12371 -5529 -3489
11236 -3489 -4803 -2295 -1066 1658 5293 4956 346 1274 6871 10515 6947 -611 3967 7349 2230
11221 2230 -5042 -258 5498 2062 5082 7363 7610 13742 12624 3018 -425 -3348 -36 2988 -1666
11206 -1666 -4638 -2253 -3921 2690 8100 13599 4248 -5412 -6244 676 5965 4216 -1976 -6761 -7658
11191g658j830K232K055m398R48L232P473k739j043K010m856l388L062l721M894
11176c727K998J347j1j805j029j274l187L197k023k059N147O466P371K146m689
11161H868k116n01L982m23J3433J795j1119j1760m32p394R1L38L907K116P039
11146G824O017j122r010q8m22k509r4p418K852P583N434k800n772n417J184L543
11130b15N211L86k462k66r36k205L558K687m984p038j481M075N357j028j53j798
11114a292l489n66l01j898l768J587J663p672o0P851k030K660N140Q023K451Q48
11098I147n204n925n81Q894K76K82p498j060K087J484j453p627l036m52j689K043
11082a0312M947M844j350M418K051K015K266J017k066l958Q21J700J480m321M71
$$ plain form
11191 -7658 -9488 -7256 -5201 -9599 -8651 -5419 2054 -685 -1728 282 -4574 -7962 -4900 -8621 -3727
11176 -3727 -729 618 607 -1198 -2227 -3501 -6688 -3491 -5514 -7573 -2426 4040 11411 13557 8868
11161 8868 6752 6251 10233 9810 23243 25038 13919 2159 1727 -5667 -5576 -5238 -1331 785 7824
11146 7824 13841 12719 3709 3621 3199 690 596 -6822 -3970 3613 9047 6247 475 -4942 -3758 -215
11130 -215 4996 5382 2920 2654 1718 -487 3071 5758 774 -6264 -7745 -3670 1687 659 506 -1292
11114 -1292 -4781 -5347 -5648 -7546 -11314 -9727 -8064 -15736 -15796 -7945 -9975 -7315 -2175 5848 8299 9147
11098 9147 3943 -1982 -2563 6331 6607 6889 -609 -1669 418 1902 449 -7178 -10214 -10666 -12355 -10312
11082 -10312 -5365 -521 -1871 2547 4598 6613 8879 9896 7830 3872 4693 6393 7873 3552 4023
11067D023M958M763R34l719p490k18r31J379P38n793m395K442j076J295L860J005
11051A775q47n65L265M011k40k33J585N558j105k524k410n889q822L636O387Q84
11035D466L001k922l754l162l396q56k259j887K074J550j707k596J266Q550j526
11020c158k268K676J336m705m093O606N189J13m078l690m968K345O852N947m734
11005f30m497k498n558Q094J446J143J340M270n603p470M636J0118M604O193j001
10990A4587n316l101J450j456J423q125j030Q593J594r816j261L478L900k429
10976B491j969J761j304l364L997o01j194N534P101r786m615Q687k156o613J675
10961c56J012r53J839l114l811L498j845N91J550q35l642K146M21J370R421J719
$$ plain form
11067 4023 8981 13744 14678 10959 3469 3251 2320 3699 4437 -1356 -5751 -3309 -4385 -3090 770 1775
11051 1775 928 363 3628 7639 7399 7166 8751 14309 13204 10680 8270 2381 -6441 -2805 3582 4466
11035 4466 7467 4545 791 -2371 -5767 -6623 -8882 -10769 -8695 -7145 -8852 -11448 -10182 -1632 -3158
11020 -3158 -5426 -2750 -1414 -6119 -10212 -3606 1583 1696 -2382 -6072 -11040 -8695 -1843 4104 -630
11005 -630 -5127 -7625 -13183 -5089 -3643 -2500 -1160 3110 -2493 -9963 -5327 4791 9395 15588 14587
10990 14587 9271 6170 7620 6164 7587 -538 -1568 7025 8619 -1197 -2458 1020 4920 2491
10976 2491 522 2283 979 -2385 1612 1011 -183 5351 12452 2666 -1949 6738 4582 -2031 -356
10961 -356 656 -297 1542 -1572 -5383 -1885 -3730 -3139 -1589 -2424 -6066 -3920 -3499 -2129 7292 9011
10945I011p806q539J132K955k89m683J111K480n1M271M926k403n10m499P87n345
10929g452J939M895k437K48r03L435O693p350q042n922M380J8052M664m597l152
10914D451M30l89R8j717o678j560l372N14K340O188j408m509l905M342R368N173
10898I366J087L28k694r43N235M828m458m315l835o372l2J313j960K130K711m46
10882A943p87l26P351O613r248n567N621J930n916L044J39J738m228k874n98j378
10866b543l471N08M189P849L002n164k698j575j804q77k453R08J473p204r9o76
10850a0635l678J0666O241j960L774J829J800j038M785Q33n101r734r513n288
10836a7019k02M891J319k996j691Q548M137L267L728j060J382k362k169P97M590
$$ plain form
10945 9011 1205 -7334 -6202 -3247 -3536 -8219 -7108 -4628 -4679 -408 4518 2115 1605 -2894 -2107 -7452
10929 -7452 -5513 -618 -3055 -2807 -3710 -275 6418 -932 -8974 -14896 -10516 7536 12200 7603 4451
10914 4451 4881 4492 4590 2873 -3805 -5365 -8737 -8223 -5883 305 -1103 -5612 -9517 -5175 4193 9366
10898 9366 10453 10781 8087 7144 12379 17207 12749 8434 4599 -1773 -1805 -492 -2452 -322 2389 1943
10882 1943 1156 830 8181 14794 5546 -21 5600 7530 1614 4658 4797 6535 2307 -567 -1165 -2543
10866 -2543 -6014 -5506 -1317 6532 9534 4370 1672 97 -1707 -2584 -5037 -4129 -2656 -9860 -9959 -10635
10850 -10635 -14313 -3647 2594 634 4408 6237 8037 6999 11784 12617 7516 -2218 -11731 -17019
10836 -17019 -17221 -12330 -11011 -14007 -15698 -7150 -3013 254 3982 2922 4304 1942 -227 570 5160
10821E160K490l448J989K603K57M03K164p298m591o004p859L552P121L576l463
10806c348J542N927N012L173n606n45m111j179P392n49N142K820o028O14P1r72
10790I355l482p913j1484k531L145m91J714P087j195j897O550N654O31L951m925
10775D169j204K803M743L150O87L370n138Q842R917J0414N953R920J7201K3621
10761I8448K2403K4318J9208O667k190j681j0452j2852j3042k1623k0443j6991
10749G1770j2944j2105p156r67l597m111R12N11K112O20o39k664p475Q23M707
10734B9797n302l692o00m786p753l514k12L072K349M015m569m901M111K361J584
10719A1960m46k157M242o012j356J052m110K7l995J592m66n767K336J03n129J1201
$$ plain form
10821 5160 7650 4202 6191 8794 9051 9454 11618 4320 -271 -6275 -14134 -10582 -3461 115 -3348
10806 -3348 -1806 4121 9133 12306 6700 6155 2044 865 8257 7708 12850 15670 9642 10256 10327 9355
10790 9355 5873 -2040 -13524 -16055 -12910 -13401 -11687 -4600 -5795 -7692 -1142 4512 5143 9094 4169
10775 4169 2965 5768 10511 13661 14348 17718 12580 21422 31339 41753 47706 57626 74827 98448
10761 98448 120851 145169 164377 171044 168854 167173 156721 143869 130827 109204 88761 71770
10749 71770 58826 46721 39565 38598 35001 30890 31802 32313 34425 35045 34406 31742 24267 25090 29797
10734 29797 24495 20803 20203 15417 7664 4150 3938 7010 9359 13374 8805 3904 8015 10376 11960
10719 11960 11514 9357 13599 7587 6231 7283 3173 3200 -795 797 331 -5436 -3100 -2997 -8126 3075
10703C075J0303o710o206O3l46m656O62J85R75L311k25K075K816R89r448k104
10687e241Q864K622M432J74j078p249k708M157O43o88n209j0692L200O529N581
10672C337J473l831K223Q37k756k469M44Q12M029L540n99m504L398k375K224j606
10656D177l840K620k057l65j108j800j586J540M490m371n064r95K853n344L624
10641g226M134O03l520J812p76O339M039n543K160N081K230L253k321k270N72
10626H567j092p7m52o476o192j299L324l395k743k137R061r30J438P473m514l954
10610c398J880Q8K222K696P86j2722R55Q251j448K319P53k967l212J116N360L65
10594C044P93q143o037l921O13O364K728k24j578O174m12R07J068n848J162p085
$$ plain form
10703 3075 13378 6668 462 525 179 -4477 -3815 -3630 -2655 656 431 2506 5322 6311 -3137 -5241
10687 -5241 3623 6245 10677 10851 9773 2524 -184 3973 4616 3928 -1281 -11973 -8773 -2244 3337
10672 3337 4810 979 3202 4039 1283 -1186 -742 70 4099 7639 7040 2536 5934 3559 5783 4177
10656 4177 337 2957 900 535 -573 -2373 -3959 -2419 2071 -2300 -7364 -8359 -5506 -10850 -7226
10641 -7226 -3092 -2489 -6009 -4197 -4973 1366 5405 -138 2022 7103 9333 12586 10265 7995 8567
10626 8567 7475 7398 6946 470 -5722 -7021 -3697 -7092 -9835 -11972 -2911 -3841 -2403 5070 556 -3398
10610 -3398 -1518 -1430 792 3488 4274 -8448 -7493 758 -690 1629 2382 -585 -3797 -2681 2679 3044
10594 3044 3837 -4306 -10343 -14264 -13651 -7287 -4559 -4783 -6361 -187 -599 308 1376 -4472 -3310 -10395
10578a0395m442L293J0664k06J858L734j004l891j430N089q90n874o588M881N194
10563gk671k878l484K943O115j873J098N170m355J95K156J852j881j563o881j178
10547g242K259P404k419k619K792R62n36p254j179R57J324L048L537L793K830
10532G657l662m778P06N81J851j03k030M586L606k634n344l030j062j278J739
10517c195J071L674J493o428j419L715J433l413k768p654O173N697M344J618J050
10502E391J45m427l25K081M126p32r12m978n28l108K325K99L742K5o20K44q694
10485e946m37K447J063q08J03M067j568j678P029L067k343l952j410j153l357
10470d876m199P907J2685J441l36N888o210r045k893j403O577J926M50L069n456
$$ plain form
10578 -10395 -14837 -11544 -880 -1086 772 4506 3502 -389 -1819 3270 2380 -3494 -10082 -5201 -7
10563 -7 -2678 -5556 -9040 -6097 18 -1855 -757 4413 58 253 2409 4261 2380 817 -6064 -7242
10547 -7242 -4983 2421 2 -2617 175 1137 601 -6653 -7832 -6875 -5551 -2503 1034 4827 7657
10532 7657 3995 -783 -77 504 2355 2252 222 4808 8414 5780 436 -2594 -3656 -4934 -3195
10517 -3195 -2124 1550 3043 -3385 -4804 -1089 344 -3069 -5837 -13491 -7318 -1621 2723 4341 5391
10502 5391 5536 1109 784 2865 6991 6259 5347 369 -159 -3267 -942 -643 3099 3124 2504 2748 -5946
10485 -5946 -6383 -3936 -2873 -3681 -3578 489 -1079 -2757 4272 7339 4996 1044 -366 -1519 -4876
10470 -4876 -9075 -1168 11517 12958 12622 18510 12300 3255 362 -1041 5536 7462 7912 10981 5525
10455E525J305M296M987L479K070r272o186k103k532O391P19j402Q468K0504J7118
10440E3367K2186K8355Q620j3512k5286k6171k3109j3082p943m64M342n581k147
10427d25O176L475k882q133l198K574L808M846O60j694K758j944l310m420r2r39
10411b740k317K215K506m48Q20J757j593J000L418j928l783k634j112K998q52
10396b693L339L583r11n429M136L065M804l306m530k799l763L746k529Q34o90
10381c143p15m133N062P85L188J97J899k815K75N769j030n507M079N019j529o904
10365D97l900L958n460M93p7j268j048J844k88N653N120j461j280j061m097m478
10349f853k063n393l04M821L287K938L822K896o356l127M727k013K410p150J584
$$ plain form
10455 5525 6830 11126 16113 19592 21662 12390 6204 4101 1569 7960 8679 7277 15745 36249 53367
10440 53367 75553 103908 112528 99016 73730 47559 24450 11368 3425 2961 7303 1722 -425
10427 -425 5751 9226 6344 -1789 -4987 -2413 1395 6241 6901 5207 7965 6021 2711 -1709 -1801 -2740
10411 -2740 -5057 -2842 -336 -784 36 1793 200 1200 4618 2690 -1093 -3727 -4839 -1841 -2693
10396 -2693 646 4229 3318 -2111 2025 5090 9894 6588 2058 -741 -4504 -758 -3287 -2453 -3143
10381 -3143 -3858 -7991 -2929 -2144 1044 1241 3140 325 600 6369 5339 -168 3911 8930 7401 497
10365 497 -3403 555 -4905 -4412 -4489 -5757 -6805 -4961 -5249 404 5524 4063 2783 1722 -2375 -6853
10349 -6853 -8916 -14309 -14613 -9792 -6505 -3567 255 3151 -3205 -6332 -1605 -3618 -1208 -8358 -6774
10334f774K942L577q1K230M472K802l162P84J262j632p460o457o930J380p86M035
10318i798K294K037RL946J951l70o134r621L765O455O304Q565O85R37m181J735
10302H579k44r298l309R4n120K137Q564M573M82j286o587m431P975l45n904k576
10286f696K079K163J440j229m338p187L200R960P439L34l430m082O180J434J870
10271I137n247m812K040p73p177k875N445n111J289L132L422n863o670P833J510
10256d720k17k141j75L234RO286k242q252j961j658K321J799m13o52N327O90K346
10239d19M031l769o373l594N104K670O72j138j782l70N422o65k273J409J273k66
10223f8K253N402j504n699J569N562o534J296K815m271n529n899J209M854O695
$$ plain form
10334 -6774 -3832 -255 -336 1894 6366 9168 6006 6790 8052 6420 -1040 -7497 -14427 -13047 -13833 -9798
10318 -9798 -7504 -5467 -5458 -1512 439 69 -6065 -15686 -11921 -5466 838 9403 10088 11025 6844 8579
10302 8579 8335 -963 -4272 -4178 -9298 -7161 1403 5976 6458 5172 -1415 -5846 2129 1784 -4120 -6696
10286 -6696 -4617 -2454 -1014 -2243 -6581 -13768 -10568 -608 6831 7165 3735 -347 5833 7267 9137
10271 9137 3890 -922 1118 345 -6832 -9707 -4262 -9373 -8084 -4952 -1530 -7393 -14063 -6230 -4720
10256 -4720 -4937 -7078 -7253 -4019 -4010 2276 34 -8218 -10179 -11837 -9516 -7717 -8130 -8782 -3455 -2765 -419
10239 -419 3612 -157 -6530 -10124 -5020 -2350 -1678 -2816 -4598 -4968 454 -211 -2484 -1075 198 -68
10223 -68 2185 7587 6083 384 1953 7515 981 2277 5092 821 -4708 -10607 -9398 -4544 2151
10208B151m841j64M621n618m429P198J308m246k289j798J523N22O071R277n104
10193D182l986j903K611j662J935M622j505l887n679p851M356N46rO739K243K091
10177B843J275L181M500l22l878m082l385L291q834m237K052L176J308m03N704
10162B189K568Q58m070l411M335J444J534o379o565j096K674L057K606m361l049
10147g666P848P154K986j460o243n210k483j006l357j984Q536O329p633j0843
10133a5032m663K787O839M817l460L905P293M542J193n188n517l814k058L227
10119e129J0040o061p640l342m54K175N502k127J208m137j935N321O250j571l400
10104e300j939j99M724N351M955J915O84o66k49k274j850m176l412L612J267J56
$$ plain form
10208 2151 -2690 -2854 1767 -3851 -8280 -1082 226 -4020 -6309 -8107 -6584 -6062 9 9286 4182
10193 4182 196 -1707 904 -758 1177 5799 4294 407 -5272 -13123 -8767 -8221 -8230 -1491 752 2843
10177 2843 4118 7299 11799 11477 7599 3517 132 3423 -5411 -9648 -7596 -4420 -3112 -3515 2189
10162 2189 4757 5615 1545 -1866 2469 3913 5447 -932 -7497 -8593 -5919 -2862 -256 -4617 -7666
10147 -7666 182 7336 10322 8862 2619 -2591 -5074 -6080 -9437 -11421 -2885 3444 -4189 -15032
10133 -15032 -19695 -16908 -10069 -5252 -8712 -4807 2486 7028 8221 3033 -2484 -6298 -8356 -5129
10119 -5129 4911 -1150 -8790 -12132 -12586 -10411 -4909 -7036 -5828 -9965 -11900 -6579 -329 -1900 -5300
10104 -5300 -7239 -7438 -2714 2637 7592 9507 10191 9525 9276 7002 5152 976 -2436 1176 2443 2599
10088B599J312j837j0393n109N061j357n722n15J787M061m475k810j313Q210P929
10073b572M583P53k568j90l311m416J02L020K201O578K928M387n564k809k201
10058I21k738m792N96J160J259j155Q242M46j009Q366K045k059l40L642L779M609
10042B2972p45Q003R973K5374L2167L9686M7656M2449L3867L1108J4901m4866
10030B62545m1913l1778l7102l4723k8367j4109q930o673r035q336J021j022j163
10017D0415r889n994L115p557Q19J2084M747n193r781l62m503Q51P95K146L680
10002B5373p131j880j705M89j950J450r25K446l979j417R69o92O67R67J825J063
9986A5570p672k133l683J125N696L711L537j1061m093L811n079j653N106j277
$$ plain form
10088 2599 3911 2074 -8319 -13428 -8367 -9724 -15446 -15961 -14174 -10113 -14588 -17398 -18711 -10501 -2572
10073 -2572 2011 2764 196 6 -3305 -7721 -7619 -4599 -2398 4180 7108 11495 5931 3122 921
10058 921 -1817 -6609 -6013 -4853 -3594 -4749 3493 3939 2930 11296 13341 11282 10942 14584 18363 22972
10042 22972 22227 30230 40203 65577 97744 137430 185086 227535 261402 292510 307411 262545
10030 262545 220632 188854 151752 117029 88662 74553 65623 58950 49915 41579 42600 41578 40415
10017 40415 30526 24532 27647 20090 20909 32993 37740 32547 22766 22404 17901 18752 19547 21693 25373
10002 25373 18242 16362 14657 15146 13196 14646 13721 16167 12188 10771 11740 11048 11715 12682 14507 15570
9986 15570 7898 5765 2082 3207 8903 12614 16151 5090 997 4808 -271 -1924 3182 1905
9972A905l91L080J302M8j080m528q03L783l848N14J375m148j3252l840Q396P690
9956c797J511j614J269N951j529k019J670L144N304M077K50j913q622m781o335
9941g434j389J872P99J04N251O851l763J55N089J881k96l679K2K05p141o081L973
9924c581P508M770L402m778m754R7m462K857K416K754k309m897p276m156M345
9909h064M259L059K940J192l99J639p978l87N190L291K914M24r02l683J404j018
9893C881l468m951r2o055O780M133l263p544k104L55N39O005J358l99N590m796
9877d031l276k967l716M500O62j171l536L39K865L266O44J764K455L17L511L874
9861E500M519j72j3309o705L00j014J0780O669m80k206o17P105j800q745k76K991
$$ plain form
9972 1905 1514 4594 5896 5944 4864 336 -467 3316 -532 -18 1357 -2791 -16043 -19883 -11487 -3797
9956 -3797 -2286 -3900 -2631 3320 1791 -228 1442 4586 9890 13967 14217 12304 3682 -1099 -7434
9941 -7434 -8823 -6951 -6152 -6048 -797 6054 2291 2446 7535 9416 9120 5441 5463 5668 -1473 -7554 -3581
9924 -3581 3927 8697 12099 7321 2567 2664 -1798 1059 3475 6229 3920 -977 -8253 -12409 -8064
9909 -8064 -3805 -746 2194 3386 2987 4626 -3352 -3739 1451 4742 7656 8080 7178 3495 4899 3881
9893 3881 413 -4538 -4630 -10685 -3905 228 -3035 -10579 -12683 -12328 -11789 -5784 -4426 -4825 765 -4031
9877 -4031 -7307 -10274 -13990 -9490 -8828 -9999 -13535 -13196 -10331 -7065 -6421 -4657 -2202 -1885 1626 5500
9861 5500 10019 9847 -3462 -10167 -9867 -10881 -101 6568 6088 3882 3265 10370 8570 -175 -451 2540
9845B540k971J095M224L386k176n547n803j982J562L364N419q90k031K849P187
9830A0226j696r473J296K51P047o43m820J488m492m300k506K451N233M262J271
9815E595N197n07J542o06l980p492k34j015p768j128K910K696l245R08L364L736
9799b7j94k21p93k282N64m53K683n980o574J612L298N557k677O579M93l442k101
9782c958K52K957K363J899K636m329r144l371N445O538M350L28M753j015o972
9767B732J526l366O814j200j2233K873R467L025k207L199r196r449k014J0173
9753A44j66m317m489J490j861o18L803R544j724L608N959l7l110j08k096k420
9737C602q874n079o357K388M596Q374J779k328q720p822K821L676N537P377j227
$$ plain form
9845 2540 -431 664 4888 8274 6098 551 -5252 -7234 -5672 -2308 3111 2221 190 3039 10226
9830 10226 8530 -943 353 604 7651 7008 2188 3676 -816 -5116 -7622 -5171 62 4324 5595
9815 5595 10792 10285 11827 11221 7241 -251 -485 -1500 -9268 -10396 -7486 -4790 -8035 -7127 -3763 -27
9799 -27 -221 -442 -1235 -3517 -2953 -3406 -723 -6703 -13277 -11665 -8367 -2810 -5487 1092 1585 -1857 -3958
9782 -3958 -3706 -749 1614 3513 6149 1820 -7324 -10695 -5250 1288 5638 5966 10719 9704 2732
9767 2732 4258 892 7706 6506 -5727 -2854 6613 9638 7431 10630 1434 -8015 -10029 144
9753 144 -22 -4339 -8828 -7338 -9199 -9817 -6014 3530 1806 5414 11373 11336 8226 8118 6022 3602
9737 3602 -5272 -10351 -16708 -14320 -9724 -1350 429 -1899 -10619 -18441 -15620 -11944 -6407 970 -257
9722b57L338N178p450M80M142K96n792l96J609L749L23M034J997k151K032k77
9706A0855n199r579n460J1121R38j983L853l353n075P20J469k439k88k00j91k086
9690f897k137k237N066P629L460q589J629J025j322L830L114l401J558l064L8
9675b98J823k252K023K122l915L55k697K911J297k729p398J705R256J0569m889
9660G883n705j0197k021P768q3p36L293m917l898n530N103P854K802Q85L130L359
9644H990l752k428O400J1956l233j3312m300k313P84K146l465m562k843J0444
9630E12L960k513j485k007n62M248o566n039L491l052m800K60O247Q898j483N028
9614E137J745Q1n681m567l04Q237j332l333m887L487K174m301L186J736m187l688
$$ plain form
9722 -257 3081 8259 809 1289 5431 5727 -65 -461 1148 4897 5220 9254 11251 9100 11132 10855
9706 10855 5656 -3923 -9383 1738 2676 693 4546 1193 -3882 -3162 -1693 -4132 -4420 -4620 -4811 -6897
9690 -6897 -9034 -11271 -6205 1424 4884 -3705 -2076 -1051 -2373 1457 4571 1170 2728 -336 -298
9675 -298 1525 -727 1296 3418 -497 -142 -2839 72 1369 -1360 -8758 -7053 2203 12772 7883
9660 7883 2178 -8019 -10040 -2272 -2355 -3091 202 -4715 -8613 -14143 -9040 -1186 1616 2501 5631 8990
9644 8990 5238 2810 9210 21166 17933 4621 321 -1992 -1208 938 -2527 -7089 -9932 512
9630 512 4472 1959 474 -1533 -2095 2153 -4413 -9452 -5961 -9013 -13813 -13553 -7306 1592 109 5137
9614 5137 6882 6963 1282 -3285 -3589 4648 3316 -17 -4904 -1417 757 -3544 -358 1378 -2809 -6497
9598f497L299l17k317r978p20N751P02N556M070l374J98q25P251Q90j3157J938
9582g530J232Q178K016n096o631L944N53k041K24L834Q605Q46q32J148R88L839
9566A3277L53n479p185n592k822J37L961O003j986l773K036K911p74N604O247
9551A2918O711m976j0227j0996l869R172J0578M628l614P7r179J417M080j957
9537D763n555J330M000k369j58j861N334J378n00k017R6k413m112j473K35n045
9521h367K626m25Q034K472J824L096l706j449J123J366J714l833l773J089k447
9506f56L856L167O278n899l012K928J933K534o83j151N215k075p982O049j368
9491I134j434k641o074l058K037P54k114M492L304m865k534q45m90K304l485j06
$$ plain form
9598 -6497 -3198 -3515 -5832 -15810 -16530 -10779 -10077 -4521 -451 -3825 -3627 -4452 2799 3689 -9468 -7530
9582 -7530 -6298 1880 3896 -1200 -7831 -3887 -3334 -5375 -5151 -1317 7288 8134 7302 8450 9438 13277
9566 13277 13630 8151 966 -4626 -7448 -7311 -3350 2653 667 -3106 -1070 1841 1067 6671 12918
9551 12918 19629 14653 4426 -6570 -10439 -1267 9311 13939 10325 10402 1223 2640 6720 4763
9537 4763 -792 538 4538 2169 2011 150 5484 6862 6362 4345 4441 2028 -2084 -3557 -3322 -8367
9521 -8367 -5741 -6166 1868 4340 6164 9260 5554 4105 5228 6594 8308 4475 702 1791 -656
9506 -656 3200 6367 12645 6746 3734 6662 8595 11129 10446 9295 14510 12435 4453 10502 9134
9491 9134 7700 5059 -1015 -4073 -2036 -1282 -3396 1096 4400 -465 -2999 -3844 -4334 -2030 -5515 -5621
9475e621O345j105J949N911O162O934K77M50O26k014m191m381N01M174p349o294
9459B374J746O240m96L275K195m115j0395q65j518J0200O846K086N535j208l958
9444A7942K947l378j922J236j005n875o123j611l24O10K618L050J86j134O379
9429A3596j405Q22J048k371k753L155L695j103n459L700M509n412j113M32o94
9414A0647K812l686M539j625m002j622o414M862l205J24J2585L19n166j603L537
9399A2102O085m30R77J740K56l435o911M972P664J994j0556L200K824O74N676
9384B6832M112p314m966P548M408l258k786m817M443Q247k64N945k979l359j1133
9369B0659j1656N601J4023O756M492j843p740j848Q960R931L550K338k445L097
$$ plain form
9475 -5621 724 -381 1568 7479 13641 20575 20852 21302 21928 19914 15723 11342 11843 16017 8668 2374
9459 2374 4120 10360 9864 13139 15334 11219 824 -41 -1559 8641 15487 17573 23108 21900 17942
9444 17942 20889 17511 15589 16825 15820 9945 3822 2211 1887 2497 5115 8165 8351 7217 13596
9429 13596 12191 13013 14061 11690 8937 12092 15787 14684 9225 12925 17434 12022 10909 11341 10647
9414 10647 13459 9773 14312 12687 8685 7063 649 5511 2306 2430 15015 15334 10168 8565 12102
9399 12102 18187 17757 18734 20474 20730 17295 10384 15356 23020 25014 14458 17658 20482 21156 26832
9384 26832 30944 23630 18664 26212 30620 27362 24576 19759 24202 32449 32185 38130 35151 31792 20659
9369 20659 9003 14604 28627 35383 39875 38032 30292 28444 37404 47335 50885 53223 50778 53875
9355E3875J257K339R18j735K735M710J831R66K20j565J125Q458J276N583Q830
9340I0823P245j678m788K140L674L749Q822N659J839O874O172J0505N620l744
9326A42912N25R688Q447O64J0633J7852M95L580l290N875L690o78J400O227J480
9311B09500L984N084O507j057n912K765j464r695j359l185j0311l547J779k142
9297A90947j721L261j3756j5252j0946j0266j718K917r16j422n504O94m548M52
9283A32222m7l422o940n616k777n525o576K210N964J978j0084p524m688P172O501
9268A02848m243j2973m069L295l420l456m498n052K096j589l914m17k008M13O368
9253F9381n66l24m904j0790j746k54J504R21k426l861J567l433l177j424n309
$$ plain form
9355 53875 55132 57471 58389 56654 59389 64099 65930 66896 67116 65551 66676 75134 76410 81993 90823
9340 90823 98068 96390 91602 93742 97416 101165 109987 115646 117485 124359 130531 141036 146656 142912
9326 142912 143437 153125 161572 162236 172869 190721 191216 194796 191506 197381 201071 200393 201793 208020 209500
9311 209500 213484 218568 225075 224018 218106 220871 219407 209712 208353 205168 194857 191310 193089 190947
9297 190947 189226 192487 178731 163479 152533 142267 140549 143466 142550 141128 135624 136318 131770 132222
9283 132222 132175 128753 121813 116197 113420 107895 101319 103529 109493 111471 101387 93863 89175 96347 102848
9268 102848 98605 85632 81563 84858 81438 77982 73484 68432 70528 68939 65025 64608 62600 63013 69381
9253 69381 68815 68491 63587 52797 51051 50797 52301 53222 50796 46935 48502 45069 41892 40468 35159
9238C5159L79Q26k61J351N954M145n282m672q24N351N98m963k015p47L039l727
9222C4311L641L480J874n395m971p18o316J925L291J86m797p39K071P94O682N25
9206C5844l683q224m142O045O388r72m125l025O016L569p251p995M067Q185M679
9191C5376o257n178m442l001K850l161n883p31J0923j25m63N734n8j4150l526
9176G908P069J799l792m84l75Q91k01P549L698p694k076K371N241j412k257k123
9160A6112j019k028l414n747M140M126M88K649L947P30j459K007L551q9r032j2113
9144B849J814M175L399p2k014k943o903M009M449O46j091l463k599k991K680L012
9128D957L680m164n211J194K417l508j282N421j140n165k305L697O865p32j89
$$ plain form
9238 35159 35538 36364 36103 37454 43408 47553 42271 37599 36775 42126 42724 37761 35746 34999 38038 34311
9222 34311 37952 41432 43306 37911 32940 32222 25906 27831 31122 31308 26511 25772 27843 28637 35319 35844
9206 35844 32161 23937 19795 25840 32228 31256 27131 24106 30122 33691 26440 18445 22512 30697 35376
9191 35376 29119 23941 19499 16498 19348 16187 10304 9573 20496 20371 19908 25642 25584 11434 7908
9176 7908 14977 16776 12984 12500 12125 13016 12815 20364 24062 16368 14292 16663 21904 20492 18235 16112
9160 16112 15093 13065 9651 3904 8044 12170 12658 15307 19254 19984 18525 20532 24083 23994 14962 2849
9144 2849 4663 8838 12237 12165 10151 7208 305 4314 8763 9409 8318 4855 2256 -735 1945 4957
9128 4957 8637 4473 -738 456 2873 -635 -1917 3504 2364 -2801 -5106 -1409 5456 4724 4535
9113D535O20q532j853J2491J456l922l247K176P120P009L051p381q343q106P79
9098b147J2294N189j295k047K039J712p514m069P934J51j1264k249o11o305J605
9083f577O791j129k356q2K318J119k934N157r33l793j530P213l340q003K812O710
9067A443l741J60O207O751n050m830k330j051Q523N860q09K485k987j755k076
9052F800J127L816J315k08k961Q24k60k699M8m829Q65j928j96K169J914o38k38
9035D921J25m795l201N436M983j359J812M359K034m772l149m393n975p77o389
9020a1140M747P593l53L19M647m386o819n364k810P151J2348j687l843K705l020
9005H8j516N41O236K2l615l686j201K553j040o86o392n91k525O646j083m167L040
$$ plain form
9113 4535 5155 -3377 -5230 7261 8717 4795 1548 3724 10844 17853 20904 13523 5180 -2926 -2147
9098 -2147 10147 15336 14041 11994 14033 15745 8231 4162 12096 12247 983 -1266 -1877 -8182 -6577
9083 -6577 214 -915 -3271 -3353 -1035 84 -2850 2307 1374 -2419 -3949 3264 -76 -8079 -5267 1443
9067 1443 -2298 -2138 4069 10820 5770 940 -1390 -2441 6082 11942 11133 13618 10631 8876 6800
9052 6800 7927 11743 13058 12850 9889 10713 10453 7754 7802 2973 3838 1910 1714 3883 5797 5159 4921
9035 4921 5046 251 -2950 2486 7469 6110 7922 12281 14315 9543 6394 2001 -3974 -4751 -11140
9020 -11140 -6393 1200 847 1166 5813 1427 -5392 -10756 -13566 -6415 5933 4246 403 3108 88
9005 88 -1428 -887 5349 5371 1756 -1930 -3131 -578 -1618 -2304 -8696 -9287 -11812 -5166 -6249 -10416 -7376
8988g376M427r00M145L732P78l685n18j959k848o26J413M159j890O776N063K100
8972A2791P45p280J986m923n323L347K030J601m721k803L264l859k636P111K228
8957C558m500K417P328K642p19m899J298J743n528m522L475K218L63L124k65o02
8941G131P01m651J26K380J454L952n750m141J72k008M400M983N044n442p146m362
8925c157J0974m436R17L002m812q44j073l462J300k319N897p66p128m21N088j008
8909b248J049N703k531k964L275m83k726M1j657l0J09J641o354n005L566M863
8893c751J818l392K920P165p981k743O072j3j195j043L670m493n76L998M468m423
8877E01L55L995P54j0905o200L489K867M114M915k795n098K000K832Q34j31j692
$$ plain form
8988 -7376 -2949 -3849 296 4028 4806 1121 603 -1356 -4204 -4830 -3417 742 -1148 5628 10691 12791
8972 12791 13536 6256 8242 3319 -2004 1343 3373 4974 253 -2550 714 -3145 -5781 1330 3558
8957 3558 -942 1475 8803 11445 10726 5827 7125 8868 3340 -1182 2293 4511 4874 7998 7733 7131
8941 7131 7832 3181 3307 5687 7141 11093 5343 1202 1374 -634 3766 8749 13793 8351 1205 -3157
8925 -3157 7817 3381 4298 7300 2488 1644 571 -2891 -1591 -3910 1987 1221 -5907 -6328 -1240 -2248
8909 -2248 -1199 4504 1973 -991 2284 1801 -925 -884 -2541 -2571 -2462 -821 -7175 -12180 -8614 -3751
8893 -3751 -1933 -5325 -2405 4760 -3221 -5964 108 95 -1100 -2143 1527 -2966 -3542 456 4924 501
8877 501 856 4851 5605 -5300 -11500 -8011 -5144 -1030 3885 1090 -4008 -2008 824 1658 1527 -165
8861a65l932r73J629p85n64j265L149j528k13n9P057K937P585m74k871m046r17
8844D565L394j665j704m092o637k403p7n73N281M939J288o535J524P66Q80k770
8828c819P19N555q18l499p002K985K076j688l088J54K037k599o081O660J2061
8813C653m289K160O154j783K714Q461n678p577m043m704L052K775K060MK785N639
8797A1383j802K636J2338n536n825l677J341l105K131P686n591j762K827o122
8783F922r440m492J277K384N846N443Q3l823q155m20j750J973l5j773K940J795
8767a225M662o224q995K961N137O223Q63j058n209k015k746K352Q837R111l534
8752I140m862N02k813k911k178k765L168q37K668M024k077m995j397j15K997k38
$$ plain form
8861 -165 -4097 -5070 -3441 -4226 -4790 -6055 -2906 -4434 -4647 -4706 2351 5288 12873 12399 9528 5482 4565
8844 4565 7959 6294 4590 498 -6139 -8542 -8619 -9192 -3911 1028 2316 -4219 -2695 -1929 -1049 -3819
8828 -3819 -3100 2455 1637 -1862 -8864 -5879 -3803 -5491 -8579 -8425 -6388 -8987 -15068 -8408 3653
8813 3653 -636 1524 7678 5895 8609 17070 11392 3815 -228 -4932 -1880 895 2955 2959 5744 11383
8797 11383 9581 12217 24555 19019 13194 9517 10858 7753 9884 17570 11979 10217 13044 6922
8783 6922 -2518 -7010 -5733 -3349 2497 7940 8023 4200 -3955 -4375 -6125 -4152 -4187 -5960 -3020 -1225
8767 -1225 3437 -2787 -11782 -8821 -3684 2539 3402 2344 -2865 -4880 -7626 -5274 3563 12674 9140
8752 9140 4278 4780 1967 -944 -3122 -5887 -2719 -3556 -888 3136 1059 -3936 -5333 -5448 -2451 -2689
8736b689l80O7n009M042R514R09O636r88k368l824J387m764j348K987Lm051k544
8719b420R46P01Q780P114L012p168o995l102M220N17n380j067J466p945j41J0766
8703C304N290n60J57K35m218r438k969L852J0427M774j391m101l841j352j870
8688a701m128j541k844J492N93J056K181J438L776J4P098J520K187m517J10k636
8672D098l788l022r72J842m03K785J726o17o199N999K516J013k366j234J0180
8657A1558P559Mo639l155K25K051k035r151p724J651L329M125J690j15L625M90
8641G488N356R201M7j2140j84N804N172r699j140K365m780L271L496J894J785
8626A7936l276r291m683K233m91k916K338N152Q867O77m817j1543K659M759J278
$$ plain form
8736 -2689 -3069 -3002 -8011 -3969 5545 6454 13090 12102 9734 5910 7297 2533 1185 4172 4175 124 -2420
8719 -2420 -1474 -773 8007 15121 18133 10965 3970 868 5088 5605 225 -842 624 -7321 -7462 3304
8703 3304 8594 8034 8191 8426 4208 -5230 -8199 -4347 6080 10854 9463 5362 1521 169 -1701
8688 -1701 -5829 -7370 -10214 -8722 -8129 -7073 -4892 -3454 322 336 7434 8954 11141 6624 6734 4098
8672 4098 310 -2712 -3684 -1842 -2245 540 2266 1649 -4550 1449 3965 4978 2612 1378 11558
8657 11558 19117 19121 12482 9327 9552 11603 9568 417 -7307 -5656 -2327 1798 3488 3373 6998 7488
8641 7488 12844 22045 22092 9952 9768 15572 20744 11045 9905 12270 7490 10761 14257 16151 17936
8626 17936 14660 5369 686 2919 2428 -488 1850 7002 15869 16546 11729 186 2845 7604 8882
8611H882q68k122N41N435K178m325l903j11l255L996M668N862K198k416N767J314
8595B3841l307J2185J1378K0240K1285J2377j4761j7771o573l925l598n787k47
8582D5337Q699N506P670m760O620J4697J8548K3902M6074Q2585J20696J55644
8570E31218J44973O3212n7961j32046j40859j12811p1890m3096k4493j5505p950
8559A32792j5598j1485M90n586r287r398j1232n554n450J712K427k018l99q204
8545E3210r966k993K149J286j95q23K579l292j0797n775J520o303L61J815N110
8530B7886M307J846N399m461k048q178o712p29k460O991l666M0J176k22O70Q883
8514B8722K058k241k011l249l207k985k26M816R27j272m931q917q05k062O31L623
$$ plain form
8611 8882 8014 5892 6433 11868 14046 9721 5818 5707 2452 6448 11116 16978 19176 16760 22527 23841
8595 23841 20534 32719 44097 64337 85622 97999 83238 65467 58894 54969 51371 45584 45337
8582 45337 54036 59542 67212 62452 69072 83769 102317 126219 172293 254878 375574 531218
8570 531218 676191 739403 681442 549396 408537 295726 223836 180740 156247 140742 132792
8559 132792 117194 105709 106199 100613 91326 81928 70696 65142 59692 61404 63831 61813 61414 53210
8545 53210 43244 40251 42400 43686 43491 42668 45247 41955 31158 25383 26903 20600 20961 22776 27886
8530 27886 32193 34039 39438 34977 32929 24751 18039 17310 14850 21841 18175 18215 19391 19169 19839 28722
8514 28722 30780 28539 26528 23279 20072 17087 16861 21677 22604 21332 16401 7484 6679 4617 5248 8871
8498H871J093L99J111N29L422n058l812L924N632o445m880R38K29k878j494l34
8482A247N361M889k328n999P434K612J302J21r925k132p41j068k808Q336k978
8467C323o010M069P388M083M281L451o450p958r520k155M691N610n00L923L349
8452A1575m770n856M185k167j552L108K354m815K922q32L888Q976k27o115J956
8437A2630m633m24O291N886J740m782l487m590k469K107n010l393J597K331j552
8422B242o478n545M238Q385N575o18J479k221M83r84N236n496p85j205L825M518
8406A2649r69o871l841l0J97Q97o90m06M627M380m337n832j086j202N944M661
8390H091k759q180p177M741r50L109P543q73q243n69O967j27r07M39m006M375
$$ plain form
8498 8871 9964 10363 11474 12003 15425 10367 6555 10479 16111 9666 4786 5724 5953 3075 1581 1247
8482 1247 6608 11497 9169 3170 10604 13216 14518 14639 4714 2582 1841 773 -2035 6301 3323
8467 3323 -2687 1382 8770 12853 17134 20585 14135 6177 -3343 -5498 -807 4803 4303 8226 11575
8452 11575 6805 949 5134 2967 1415 4523 6877 2062 4984 4152 8040 17016 16789 10674 12630
8437 12630 7997 7573 13864 19750 21490 16708 13221 8631 6162 8269 3259 -134 1463 3794 2242
8422 2242 -4236 -9781 -5543 2842 8417 7799 9278 7057 7540 6556 11792 6296 5511 4306 8131 12649
8406 12649 11680 4809 968 938 1135 2032 1342 936 5563 9943 5606 -226 -1312 -2514 3430 8091
8390 8091 5332 -2848 -10025 -5284 -6234 -3125 4418 3545 -4698 -5267 1700 1573 666 1105 -2901 1474
8374A474L68R42M444j980j569n626Q261K401n743L57j961J197M379P642k578P75
8358A2783j700l820l963p33l776j717k151n867K784Q951O74O457j613j257k782
8343B270j209R73k110n196k41N28P39K390J611J535l806k543M851J574N352L21
8327G039J046l541m917k360J073L119n157M763J010k715k545p671N593L856l78
8312a785N205K545j638l805o002n335L041P417L432R15p962k232o139O800N935
8297C92M772L114o087q713m715Q39N553L538L369r80j07k721l406o308K386N996
8281c078L141J026o320o846J543l162P424J4135K185r655J606M079r74l782l63
8266I59L01o899o60m724J378L525P941m52J297k01j962L165k497l284m383j978
$$ plain form
8374 1474 1842 2784 7228 5248 3679 -1947 6314 8715 2972 3329 1368 2565 6944 14586 12008 12783
8358 12783 11083 7263 3300 2567 -1209 -2926 -5077 -10944 -8160 791 1465 7922 6309 5052 2270
8343 2270 1061 2034 -76 -5272 -5513 -4985 -4246 -1856 -245 1290 -2516 -5059 -208 1366 6718 7039
8327 7039 8085 4544 -373 -2733 -1660 1459 -3698 1065 2075 -640 -3185 -10856 -5263 -1407 -1785
8312 -1785 3420 5965 4327 522 -5480 -10815 -7774 -357 3075 3990 -3972 -6204 -12343 -5543 392
8297 392 5164 8278 2191 -6522 -11237 -10398 -4845 -1307 2062 1082 975 -1746 -5152 -11460 -9074 -3078
8281 -3078 63 1089 -5231 -12077 -10534 -13696 -6272 7863 10048 393 1999 6078 5104 1322 959
8266 959 1260 -5639 -6299 -11023 -9645 -6120 1821 1369 2666 2465 503 3668 1171 -2113 -6496 -8474
8250h474K680K961L280k609n941N552R292J111p773m236M961L412J514J575k050
8235E255j31K124k836K558L991R26l670nl490o364j607k6K404J278m512q600R40
8218a1765R037M644J521K64k16N435o051n942j352J899O950J226n685m418N837
8203A384O501J917k074N59P59l375o189M356L988q693K028L120q86K07N17K415
8187F534L434o321J627m664J148m129l203Q81O577L006k68k506K028M313l501
8172D956j756k728l85l350K07J760j557O978L312k895m124M057L148L990m248
8157G365m809J613K557j442j0384N78N008l258J218k99M771q76j91j534p32k511
8141b926m674q9N562P432m639l724j089L418r763j1213N338J3430Q102l727J258
$$ plain form
8250 -8474 -5794 -2833 447 -2162 -8103 -2551 6741 7852 79 -4157 804 4216 5730 7305 5255
8235 5255 5124 7248 4412 6970 10961 11887 8217 8212 4722 -1642 -3249 -3275 -871 407 -4105 -12705 -11765
8218 -11765 -2728 1916 3437 3701 3485 8920 2869 -3073 -4425 -2526 4424 5650 -35 -4453 1384
8203 1384 7885 9802 7728 8287 9046 5671 -518 3838 7826 -867 1161 4281 3395 3602 4119 6534
8187 6534 9968 3647 5274 610 1758 -2371 -5574 -4693 1884 4890 4622 2116 4144 8457 4956
8172 4956 3200 472 87 -3263 -3056 -1296 -2853 4125 7437 4542 418 4475 7623 11613 7365
8157 7365 2556 4169 6726 5284 -5100 -4522 486 -2772 -1554 -1853 2918 2042 1851 317 -415 -2926
8141 -2926 -7600 -7689 -2127 5305 666 -3058 -4147 -729 -10492 -21705 -16367 -2937 5165 1438 2696
8126B696j142M610n618k994p63J489M354N038p635r543O67K501r9o561k829R33
8110a4896N678k528m562J514K849j988K100N537J1682N455o439l540K92m746j469
8095e061k285L749N636J258k432m222k159N329N615j993j638P470k173j907l518
8080A669j08q69p573p435K952N812Q452J191r962j2962O898M987J314J846J891
8065a897l451k35l530L499L356j017J53L213K254K554M419p320n84M787p699n566
8049g064J330J786J472K67j938R70j96L469M946J711k37j0028k497R605Q061j730
8033I927m270P27l770K161l954j887L178N128j784r050L442K592n670r549J297
8018a1482R345J277M4N166k944M90j266l351M217M428l982l352n143m876L54M666
$$ plain form
8126 2696 1554 6164 546 -2448 -3211 -1722 2632 7670 35 -9508 -8841 -6340 -6439 -13000 -15829 -14896
8110 -14896 -9218 -11746 -16308 -14794 -11945 -13933 -11833 -6296 5386 10841 4402 862 1154 -3592 -5061
8095 -5061 -7346 -3597 2039 3297 865 -3357 -5516 -187 5428 3435 1797 9267 7094 5187 1669
8080 1669 1561 692 -6881 -14316 -11364 -5552 2900 4091 -5871 -18833 -11935 -6948 -5634 -3788 -1897
8065 -1897 -5348 -5583 -9113 -5614 -2258 -3275 -3122 91 2345 4899 9318 1998 1414 6201 -1498 -7064
8049 -7064 -5734 -3948 -2476 -2209 -4147 -3177 -3373 96 5042 6753 6516 -3512 -6009 3596 11657 9927
8033 9927 5657 6384 2614 4775 821 -1066 2112 7240 5456 -3594 -152 2440 -3230 -12779 -11482
8018 -11482 -2137 -860 -816 4350 1406 1896 630 -2721 1496 5924 1942 -1410 -6553 -11429 -11075 -6409
8002f409o183L074O778O013l403j955L97m212m329L773J104K814N368K274M62
7987E566O845J308L396m372n131o95j472p378l343K269N416j604n363j399Q677
7972B720P450R17q943m421N558N865P768K250n406l787q607n567N50M617P574
7957H538r38p377O573j23l360r88L197m717l277M982P589k263j2880o637R173
7942b508R784K114o427K233r79n617p468L902K374n127p528j859K266J5154L091
7927C405M460N216p994K635L684m081K165n38o320L28O375k423J734k986L15L627
7911I602J857N527k53p830J618L90l012N784K888n640N01j502r679l664M350M713
7895E650J343j724P6k346J608O574Q88k607j668j446o022K637N967L327L41L657
$$ plain form
8002 -6409 -12592 -9518 -2740 3273 -130 -2085 -1688 -5900 -10229 -6456 -5352 -2538 2830 5104 5566
7987 5566 12411 13719 17115 12743 7612 6917 5445 -1933 -5276 -3007 2409 805 -4558 -5957 2720
7972 2720 10170 11087 2144 -2277 3281 9146 16914 19164 13758 9971 1364 -4203 -3653 964 8538
7957 8538 7600 223 6796 6673 3313 2325 5522 805 -2472 2510 10099 7836 -5044 -11681 -2508
7942 -2508 7276 9390 2963 5196 4217 -1400 -8868 -4966 -2592 -7719 -15247 -17106 -14840 314 3405
7927 3405 7865 13081 5087 7722 11406 7325 9490 8952 2632 2960 9335 6912 8646 5660 5975 9602
7911 9602 11459 16986 16733 8903 10521 10911 7899 13683 16571 10931 11432 9930 251 -3413 937 5650
7895 5650 6993 5269 5345 2999 4607 11181 12069 9462 7794 6348 326 2963 8930 12257 12598 16255
7879A6255m419m021j205L201n87m284r422J249J433n58M514m408l554k79N515
7864e70O306Q96l798p737n459M53K663P703K706J434k512N336L616N34Q86q420
7848D037p957L589j550J709J787n194o002k3J498L200m875K716M936N397k537
7833G31J64k948p724J477L467L377k063K033m501l027M173L481K377L473o263
7818a773n825J162m844m10J0154M952R6j161L407l580j56l836j870R97j956K710
7802a933N149J767m128L177J288j978n088J181O027m201l129k541J969K854p73
7787c59M640O85o14P1K031J13j261m859K780O363l007q570j0828P072Q920P22
7771C899k562n1o767o995M280P500L220n69p732L029O089J427p658J16P702p431
$$ plain form
7879 16255 11836 7815 6610 9811 9224 4940 -4482 -3233 -1800 -2358 2156 -2252 -5806 -6085 -570
7864 -570 5736 6632 2834 -4903 -10362 -9909 -7246 457 3163 4597 2085 7421 11037 11571 12457 4037
7848 4037 -3920 -331 -1881 -172 1615 -3579 -9581 -9604 -8106 -4906 -9781 -7065 -2129 3268 731
7833 731 895 -2053 -9777 -8300 -4833 -1456 -3519 -1486 -5987 -9014 -4841 -1360 1017 4490 -1773
7818 -1773 -7598 -6436 -11280 -11690 -1536 3416 3512 2351 5758 2178 2022 -1814 -3684 -2687 -4643 -1933
7802 -1933 3216 4983 855 4032 5320 3342 -1746 -565 5462 1261 -1868 -4409 -2440 414 -359
7787 -359 4281 4966 4352 4423 6454 6567 5306 447 3227 9590 6583 -1987 -12815 -5743 3177 3899
7771 3899 1337 1286 -5481 -12476 -8196 -696 2524 1955 -5777 -2748 3341 4768 -2890 -2774 4928 -2503
7755b503l120n086P38J1518N509k862q762m7l772P737N701r7L201J338L077j848
7739A0722n420n39l686j611M08j492K303K129j098L516n19J117k614k421k29J058
7723A624K216J868k284K476Q03l997m206L49R64k479o545R84M712L199k576N70
7707b322m714n37n050n958L227N921N92L909l67k216l743K540O781M045l858n047
7691f797k475L153M717O786L298o433l69K182J376l853J689O881M025m529o086
7676C565n173j169k042m516n35N235P914K19M412l894n226r09j173m54M524K332
7660C110n071q21r57L847L43j312n928m191L441K672o76k179J668J1009j056k137
7644A762J293k017K964J123l708J609m564N025n174r600p70R486n623m112J988
$$ plain form
7755 -2503 -5623 -10709 -9971 1547 7056 4194 -4568 -4615 -8387 -650 5051 4954 8155 9493 12570 10722
7739 10722 5302 4763 1077 -534 -126 -1618 685 2814 1716 5232 4713 5830 3216 795 566 1624
7723 1624 3840 5708 3424 5900 6703 2706 -1500 -1151 -187 -2666 -9211 -8227 -3515 -316 -2892 -2322
7707 -2322 -7036 -7573 -12623 -18581 -15354 -9433 -8841 -4932 -5299 -7515 -11258 -8718 -1937 2108 -1750 -6797
7691 -6797 -9272 -6119 -1402 5384 8682 2249 1880 4062 5438 1585 3274 10155 14180 9651 3565
7676 3565 -1608 -2777 -4819 -9335 -9870 -4635 3279 3498 7910 4016 -1210 -2119 -3292 -3746 778 3110
7660 3110 -1961 -2782 -3739 108 451 -861 -6789 -10980 -7539 -4867 -5543 -7722 -6054 4955 3899 1762
7644 1762 3055 1038 4002 5125 1417 3026 -1538 3487 -1687 -11287 -12057 -2571 -8194 -12306 -10318
7629a0318J618l89L626N248K985J62m057O793n01r029q93N209P3n639N909O356
7613G153r93j1160p544R578P618O80k723o195J528p116p187N275R234N272K19
7598C639l223k361K1l609M8L696Q67K170L001M73K851q34J773k426k279m549q018
7581h760j397L528O947N170M96r154l791J1213j058n87j09L13L604j010m834k308
7565a737q99l653L988N629N6n284k526J603J644M645J472l394l402p200m856O856
7549g058P860k905n721j75k049m841N361O364Q13k497j648j45m454M782K002n923
7533a0234k595M823N243l284k671p133j682l121O957Q488K478k468o058o585o31
7518a8473M704N855R576K107l2j415p841o587o038M072J0305P485l47n320L181
$$ plain form
7629 -10318 -8700 -9089 -5463 -215 2770 2932 -1125 5668 5167 -3862 -4755 454 527 -5112 797 7153
7613 7153 6160 -5000 -12544 -2966 4652 5332 2609 -3586 -2058 -9174 -16361 -11086 -1852 3420 3639
7598 3639 416 -1945 -1924 -5533 -5485 -1789 -922 1248 4249 4722 7573 6739 8512 6086 3807 -742 -8760
7581 -8760 -10157 -6629 318 5488 5984 -3170 -6961 4252 3194 2607 2498 2811 6415 5405 571 -1737
7565 -1737 -2636 -6289 -2301 3328 3384 -1900 -4426 -2823 -1179 3466 4938 1544 -1858 -9058 -13914 -7058
7549 -7058 802 -2103 -7824 -7999 -10048 -14889 -9528 -3164 -2351 -4848 -6496 -6641 -11095 -6313 -4311 -10234
7533 -10234 -12829 -8006 -2763 -6047 -8718 -15851 -17533 -20654 -13697 -5209 -2731 -5199 -11257 -17842 -18473
7518 -18473 -13769 -7914 1662 3769 3737 2322 -5519 -12106 -18144 -14072 -3767 3718 3371 -1949 1232
7503A232N63l13K049M451l304j329m955o966R51K445r27L517N050m541n823q070
7487a5970P309J1019J123p227n934J015k662r155m337O557J0473K706M440J424
7473G81n726j741j635K083Q685r70o240n79M151J620O401j692p171k166J31K423
7457a645P96m066j748N438n542j862O735O067o254n995Q346Q111Q12p977j2120
7442a0904k047L786J189K020m415l423l207M981P938K891J537k248k576m274q56
7427i608p36O05j184n21L749J128N86N36N609o477n869K222M889k215l856L728
7411g414M173p042M36N477k97M659M194j446o418m156N469j591m659K296j898
7396h217k678q78N157J604P63n34N62m454O59M557l966j266M527m587K742M99
$$ plain form
7503 1232 1795 1482 3531 7982 4678 3349 -1606 -8572 -7621 -5176 -6103 -2586 2464 -2077 -7900 -15970
7487 -15970 -8661 2358 3481 -3746 -9680 -8665 -11327 -20482 -24819 -18262 -7789 -5083 -643 781
7473 781 -4945 -6686 -8321 -6238 2447 1477 -4763 -5342 -1191 429 6830 5138 -2033 -4199 -4068 -1645
7457 -1645 -849 -4915 -6663 -1225 -6767 -8629 -1894 4173 -2081 -8076 270 8381 9193 1216 -10904
7442 -10904 -12951 -9165 -7976 -5956 -10371 -13794 -17001 -12020 -4082 -1191 346 -1902 -4478 -8752 -9608
7427 -9608 -10344 -9739 -10923 -11444 -7695 -6567 -5981 -5445 164 -6313 -12182 -9960 -5071 -7286 -11142 -7414
7411 -7414 -3241 -10283 -9847 -4370 -4667 -8 4186 2740 -3678 -7834 -2365 -3956 -8615 -6319 -8217
7396 -8217 -10895 -11773 -6616 -5012 -4249 -4783 -4221 -8675 -8016 -3459 -7425 -8691 -4164 -8751 -6009 -5510
7380e510J215K411k876K11n999k600J1876K571n294J389m352k676K507r78k26
7365h331m962J562L271l41L606J229j236K634J0664M644J556l910n697o63N575
7350I601M551l277M91o634n991J181K513j282k024j169K467N518n17k866k713
7335a51k676l21J2j056J060n852n624N527Q016Q511M204M22j741l904j462k111
7319B854K62O187O973m407r582o231o31L283Q950N371o552o126j870M257j166
7304A572K275J583l079J46O365l63o835p915M783O369J893k332K701k209p220
7289b266J02K906l438l809L119m24M047L358K513j01l509j233L90p242l836L147
7273f276o50N041P080j739K003J088j679k85n863j339K291j199j103P40L375j191
$$ plain form
7380 -5510 -4295 -1884 -4760 -4549 -10548 -13148 -1272 1299 -3995 -2606 -6958 -9634 -7127 -8105 -8331
7365 -8331 -13293 -11731 -8460 -8801 -5195 -3966 -5202 -2568 8096 12740 14296 10386 4689 4026 9601
7350 9601 14152 10875 11366 4732 -1259 -78 2435 1153 -871 -2040 427 5945 5428 2562 -151
7335 -151 -2827 -3148 -3136 -4192 -3132 -8984 -14608 -9081 -1065 7446 11650 12072 10331 6427 4965 2854
7319 2854 3116 9303 16276 11869 2287 -3944 -4575 -1292 7658 13029 6477 351 -1519 2738 1572
7304 1572 3847 5430 2351 2497 8862 8499 1664 -6251 -1468 4901 6794 4462 7163 4954 -2266
7289 -2266 -2164 742 -2696 -6505 -3386 -3810 237 3595 6108 6007 2498 1265 1655 -5587 -9423 -6276
7273 -6276 -6926 -1885 5195 3456 5459 6547 4868 4583 -1280 -2619 -328 -1527 -2630 -1890 1485 294
7257B94K60m21L263k158o785q565M89L803O206K843j654m49L385J00k886j133
7241c408J551J008o337j164P054M460j721j31J341J428R44p636p512J752K89m982
7225a3064k028K397J387J065R58m968N517R069l002j237k926K599l53l487q111
7210a6184Q531R16j860J770k107L387J616o932j253O584m76o476J526N161M636
7195a161o736l40k90j904O26P735K733L209o168l132L520Q47M03R129k290p247
7179a066m727k42j830M27l355N878J578N647L088J164k172L698M873m980k568
7164E413L074J006n105p730M821m460j813k688M760j214o809k563j914k173M150
7149a3245l72K587J0783K059p402m876j603l795k043P206N792O893l412p277K014
$$ plain form
7257 294 554 133 3396 1238 -5547 -14112 -13623 -9820 -3614 -771 -2425 -2874 511 611 -2275 -3408
7241 -3408 -1857 -849 -7186 -8350 -1296 3164 1443 1312 2653 4081 5025 -2611 -10123 -8371 -8082 -13064
7225 -13064 -15092 -12695 -11308 -10243 -9285 -14253 -8736 333 -2669 -3906 -6832 -4233 -4586 -8073 -16184
7210 -16184 -7653 -6737 -8597 -6827 -8934 -5547 -3931 -10863 -12116 -5532 -6008 -12484 -10958 -5797 -1161
7195 -1161 -7897 -8237 -8527 -10431 -9805 -2070 663 3872 -2296 -5428 -1908 -1061 -658 8471 6181 -1066
7179 -1066 -5793 -6035 -7865 -7438 -10793 -4915 -3337 2310 5398 6562 4390 8088 12961 7981 5413
7164 5413 8487 9493 4388 -3342 1479 -2981 -4794 -7482 -2722 -3936 -10745 -13308 -15222 -17395 -13245
7149 -13245 -13617 -11030 -247 1812 -5590 -10466 -12069 -15864 -17907 -10701 -4909 1984 -1428 -8705 -6691
7134f691m33P348L634j715m824l638j308P21m39L282M968M21L289l699n407N047
7118E56L940j750p34l272L236O202j581k647q721J767M117r529n26N286Q251O754
7102A1349Q476o984l869k694o600n634J235m693K357n83Q90K665O169K633K559
7087G276K681N199n047o894o414p76K757j849P644K054q75M607M282o610k085
7072E950q009j687Q537J302k730q644L0K783n098m256O821R77j143m729P37j862
7056a1021n277k50K235O243M958o44K68m782j35L301R307Jn241J465l426k710
7040e708O51o548l63O783N227k830m282N145J718K065k666L88m332J429L979q43
7024a87M264Q203Kq00j1713o365J755J308n512L778k472n35N80Q36K417R40k718
$$ plain form
7134 -6691 -7124 224 3858 2143 -2681 -6319 -7627 -6906 -7345 -4063 905 1326 4615 916 -4491 556
7118 556 4496 2746 2012 -1260 1976 8178 6597 3950 -4771 -3004 1113 -8416 -8942 -3656 4595 11349
7102 11349 19825 12841 8972 6278 -322 -5956 -4721 -9414 -7057 -7640 -6750 -4085 2084 4717 7276
7087 7276 9957 15156 10109 3215 -3199 -3975 -1218 -3067 4577 6631 5756 10363 14645 8035 5950
7072 5950 -2059 -3746 4791 6093 3363 -5281 -5251 -2468 -7566 -11822 -5001 -4024 -5167 -9896 -9159 -11021
7056 -11021 -16298 -16548 -14313 -8070 -3112 -3756 -3488 -8270 -8405 -5104 4203 4204 -1037 428 -2998 -5708
7040 -5708 -5057 -11605 -11968 -5185 42 -2788 -7070 -1925 -207 1858 -808 -420 -4752 -3323 656 -187
7024 -187 4077 12280 12282 11482 -231 -6596 -4841 -3533 -9045 -5267 -7739 -8274 -7694 -6858 -4441 -3501 -6219
7007f219L072o528L269P529M256p164o851N05L453k291M549P137P693l004n964
6992C442q72J054k67r292p434L527Q003O361J465L87n592m005J361J645n712j80
6976f109k788L34N940R105O243J06m22q223p981J797L382j34L625Q06j0864m803
6960i986J1779L509l073J936n772n123J291M63m580m771N66K014R503K909o173
6945e508J208M074j564K025J047m56p89j079p24Q951M506m945j996r71J451r453
6929d223n055o54L671J866L278L275K969l650L347m033j0507P19k73Q506L166
6914B402m166P14J956K860L971l156m77m904O55r57p346k751j087K605l730Q31
6898a2580N861R498M214j683m105q382k56N463P005M022k394l468j4011k697K498
$$ plain form
7007 -6219 -3147 -9675 -6406 1123 5379 -1785 -8636 -8131 -4678 -6969 -2420 4717 12410 9406 3442
6992 3442 2570 3624 3357 -5935 -13369 -9842 -1839 4522 5987 6374 782 -3223 -1862 -217 -5929 -6109
6976 -6109 -8897 -8563 -2623 6482 12725 12831 12409 4186 -3795 -1998 1384 1250 4875 5681 -5183 -9986
6960 -9986 1793 5302 2229 4165 -1607 -6730 -5439 -4976 -9556 -14327 -13761 -11747 -2244 665 -5508
6945 -5508 -4300 -226 -1790 235 1282 826 37 -1042 -1766 7185 11691 6746 4750 3779 5230 -4223
6929 -4223 -9278 -9932 -6261 -4395 -1117 2158 5127 1477 4824 791 -9716 -8997 -9270 -764 2402
6914 2402 -1764 -1050 906 3766 7737 4581 4104 -800 -145 -1102 -8448 -11199 -12286 -9681 -13411 -12580
6898 -12580 -6719 2779 6993 5310 1205 -7177 -7433 -1970 5035 9057 6663 3195 -10816 -13513 -11015
6883a1015k156n867M029K709K643N19L284O894l629p990J072J416j475q15M661
6868e720K009N30M534j55k544m861M519K349K692L92J795N696j738q64m1j949
6852F644p291l92L330p257J70Q479O281J219N95p752n043k09j625m972j568m18
6836i809j454M557J4235M636k618O72n673m901M966o196l098J460Qj427n740j751
6820a2133P062L237K042j523L30l996k398M946n628k371j758o64J0552K920n378
6805d760j049k199J591K107L104Q389n753m657l380O155Q70K55j388k503K932
6790b86K971l763m06K140j111P47j367o022j508R9m02L075L943l73o076j368J309
6773h398L963P794J126o440q07J893J3513J564q85N801k965M740o8j0259o758
$$ plain form
6883 -11015 -13171 -19038 -15009 -12300 -9657 -9138 -5854 1040 -2589 -10579 -9507 -8091 -9566 -10381 -5720
6868 -5720 -3711 -3181 1353 1198 -1346 -6207 -1688 661 3353 3745 5540 11236 9498 8634 8593 6644
6852 6644 -647 -1039 2291 -4966 -4796 3683 9964 11183 11778 4026 -1017 -1226 -2851 -7823 -9391 -9809
6836 -9809 -11263 -6706 7529 12165 9547 10219 4546 -355 4611 -1585 -4683 -3223 -3215 -4642 -10382 -12133
6820 -12133 -5071 -1834 208 -1315 -985 -4981 -7379 -2433 -8061 -10432 -12190 -12854 -2302 618 -4760
6805 -4760 -5809 -8008 -6417 -4310 -1206 7183 1430 -3227 -6607 -452 418 673 -715 -3218 -286
6790 -286 2685 -1078 -1484 656 -455 292 -1075 -7097 -8605 -8506 -8908 -5833 -1890 -2263 -8339 -9707 -8398
6773 -8398 -4435 3359 4485 -1955 -2762 -869 12644 14208 13323 19124 16159 20899 20831 10572 3814
6758C814m652m517o345j481N576L322m75K42K871M51M032Q027k849o63n496R13
6742B770n628n839L623l332O74L573j512k607j854J978J080J113K195K508n245
6727f503kk121k120J732M508N981J035j910L924R099k018m193J296l338n791K604
6711B183L580j858m858P374J2442K527j0522o706j169j722N280K296l177K97l330
6696B637L637K603m567k490R17q379l332K926K698M495n206j688K350l076k944
6681i419M781K722K222n868L857J737M275Q723r06p023r362K057M283M860M79
6666G418o393k940K461L299L560n286m835j57L160K515M829k606J236j117J1752
6651A6896l903j608l362m636L315l26r410n686j160p466o933K798N989L331J746
$$ plain form
6758 3814 -838 -5355 -11700 -13181 -7605 -4283 -4758 -4516 -1645 -1194 2838 10865 8016 7353 1857 2770
6742 2770 -2858 -8697 -5074 -8406 -7732 -4159 -5671 -8278 -10132 -8154 -7074 -5961 -3766 -1258 -6503
6727 -6503 -6505 -8626 -10746 -9014 -4506 1475 2510 600 4524 13623 11605 7412 8708 5370 -421 2183
6711 2183 5763 3905 -953 6421 18863 21390 10868 4162 2993 1271 6551 8847 5670 5967 2637
6696 2637 6274 8877 4310 1820 2737 -5642 -8974 -6048 -3350 1145 -4061 -5749 -3399 -6475 -9419
6681 -9419 -4638 -1916 306 -5562 -1705 32 4307 13030 12124 5101 -4261 -2204 2079 6939 7418
6666 7418 1025 -1915 546 3845 7405 2119 -2716 -2873 287 2802 7631 5025 6261 5144 16896
6651 16896 12993 11385 8023 3387 6702 6376 -3034 -8720 -9880 -17346 -24279 -21481 -15492 -12161 -10415
6636a0415P80J997k595K507o4m183K052J1K12l765K403J0388J1094l280n709J460
6620B893q249j0657m808k331Q524P140N08L809K368k496l921N187l91j33M63q00
6604b894m873m785N24J903K534J968P883O161j350N156K886o189l790N294l513
6589F915p904k988J277l777l976J763N527k238q822O167L180L934K062L800M997
6574I917P543m126j0975p384k936j354P678l679n832O09K368L870M486k871j875
6559d561K972Q065l364j2303r244K446R343J1493o26j681K315o761O01l542J10
6544d737K300k520L012O4j906O344L803K131J355o614l899m991k129J632M263
6529a892L744Q035L801j926q453l247j809l296K466j760k181Jk234L769J2473
$$ plain form
6636 -10415 -9635 -7638 -10233 -7726 -7790 -11973 -9921 -9910 -9698 -13463 -11060 -672 10422 7142 1433 2893
6620 2893 -5356 -16013 -20821 -23152 -14628 -7488 -6980 -3171 -803 -3299 -7220 -2033 -2424 -2557 -2094 -2894
6604 -2894 -7767 -12552 -12028 -10125 -7591 -5623 2260 8421 7071 12227 15113 8924 5134 10428 6915
6589 6915 -989 -3977 -2700 -6477 -10453 -8690 -3163 -5401 -14223 -8056 -4876 -942 1120 4920 9917
6574 9917 17460 13334 2359 -5025 -7961 -9315 -1637 -5316 -11148 -10539 -8171 -4301 185 -2686 -4561
6559 -4561 -1589 6476 3112 -9191 -18435 -15989 -6646 4847 4221 2540 4855 -1906 -1305 -4847 -4737
6544 -4737 -2437 -4957 -1945 -1881 -3787 2557 6360 8491 9846 3232 -667 -5658 -7787 -6155 -1892
6529 -1892 1852 9887 13688 11762 3309 62 -1747 -5043 -2577 -4337 -6518 -6517 -8751 -4982 7491
6514G491l040n250n429l859K018m756M473J66R478J0519O19m690n229P41o578
6499c326n022l447J690M909j388r269N289L526M085Q606N09R69j069J042m815
6484B289p529n075J696M335j165K829n81K614J127K491M722m862k634M987J045
6469F289j7k366m467n142j614R30N112L273Q774L983j503j1294q014K263K126
6454a667K163L396R91m794o49l558p01J378N47M705l76j140J089K22j432L230
6438C404o09L991l940j388l747j199M281R86O420Q73l526K338L45L88k711n984
6422g8n146j558j501K964O121k532K21N118P312L978j202l964m463k358l446P59
6406B25L275J97K196l293l833O15k043K983L447N440j232l478m243k045N481K839
$$ plain form
6514 7491 4451 -799 -6228 -10087 -8069 -12825 -8352 -8186 1292 11811 12430 7740 2511 3252 -3326
6499 -3326 -8348 -11795 -10105 -5196 -6584 -15853 -10564 -7038 -2953 5653 6162 7131 6062 7104 2289
6484 2289 -5240 -10315 -8619 -4284 -5449 -2620 -3201 -587 540 3031 7753 2891 257 5244 6289
6469 6289 6272 3906 -561 -5703 -7317 -6387 -1275 1998 10772 14755 13252 1958 -6056 -3793 -1667
6454 -1667 496 3892 4883 89 -560 -4118 -4819 -3441 -2894 1811 1435 295 1384 1606 174 3404
6438 3404 2795 6786 2846 1458 -2289 -3488 793 1779 8199 9072 5546 7884 8229 8617 5906 -78
6422 -78 -5224 -6782 -8283 -5319 802 -1730 -1509 3609 10921 14899 13697 9733 5270 2912 -534 225
6406 225 3500 3697 5893 2600 -1233 -618 -2661 322 3769 9209 7977 4499 256 -1789 3692 6531
6390F531K754L473j610p872j2061J443J0653Q579j225m540n45o172m498J032m208
6375h266O795L644n844p333l108L862M801L819Q08m055l342n649l125N284R51
6360a0758P468M64q836L263j381k330K899R62l025N818M350K395j832k673o47
6345c863j517o964p44M72l549K812M531O207J367l877l301N023N657m350k453
6330d549k453m453M931L736O99P493j265n096k790L231m422K484k126j679P456
6315A197n43m591n229j840M717m57p563L696K907P731L210l146N97O944J096l305
6299E421L061k561r617m819j251R11M20M241L554N369L297l306n184K283J1108
6284A2927K274l86n368o591k566n51L565N80K441o762m549J852L926p02k30R1
$$ plain form
6390 6531 9285 12758 11148 3276 -8785 -7342 3311 11890 10665 6125 5580 -592 -5090 -4058 -8266
6375 -8266 -1471 2173 -3671 -11004 -14112 -10250 -5449 -1630 -822 -4877 -8219 -13868 -16993 -11709 -10758
6360 -10758 -3290 -2826 -11662 -8399 -9780 -12110 -9211 -8249 -11274 -5456 -1106 1289 -543 -3216 -3863
6345 -3863 -5380 -12344 -13088 -12616 -16165 -13353 -8822 -2615 -1248 -5125 -8426 -3403 2254 -2096 -4549
6330 -4549 -7002 -11455 -6524 -2788 -2089 5404 4139 -957 -3747 -516 -4938 -2454 -4580 -6259 1197
6315 1197 654 -3937 -9166 -11006 -6289 -6746 -14309 -10613 -7706 25 3235 89 686 7630 8726 5421
6299 5421 8482 5921 -3696 -8515 -9766 -8855 -8435 -4194 -640 4729 8026 4720 -464 1819 12927
6284 12927 15201 14815 9447 2856 290 -261 3304 3884 6325 -437 -4986 -3134 792 90 -140 -49
6268d9k746J111J156O96j566J708n073j3444L43O373L555k942L762K514n079K079
6252g602P895N638J238n69l702k613m527L7P683n282r289n943M141R329J0542
6237F976k472n849m1K145l521N0N00j489k931q404k764P532k246j036L749K468
6221g333R05m733j310L251K223O688Q029K464J179n68J288o479P43L852l153p072
6205b6K409M252p83n989N67l555m560K634P603K159n472j23n954l5J2757Q153
6189A4037l226n303j883m559j622K541K601l0m153K472O31M239q442n655l370
6174a1722k526Q057P463j826J06N66R48K683m225m325p15Q09O654r81o727j833
6158g594J249k58P42N985J2L225N951L071o881j0445n591J106J1002m28j146k685
$$ plain form
6268 -49 -2795 -1684 -528 168 -1398 310 -4763 -18207 -17864 -11491 -7936 -10878 -7116 -4602 -9681 -7602
6252 -7602 293 5931 7169 6600 2898 285 -4242 -4205 3478 -1804 -11093 -17036 -12895 -3566 6976
6237 6976 4504 -1345 -1386 759 -2762 -2712 -2212 -3701 -6632 -15036 -17800 -10268 -12514 -13550 -9801 -7333
6221 -7333 -6428 -11161 -12471 -9220 -6997 -309 7720 10184 11363 10795 12083 5604 6347 10199 7046 -26
6205 -26 2383 6635 5852 -137 430 -3125 -7685 -5051 2552 4711 -761 -884 -6838 -6873 5884 14037
6189 14037 10811 5508 3625 -934 -2556 -15 2586 2556 -1597 875 1506 5745 -2697 -8352 -11722
6174 -11722 -14248 -6191 1272 -554 -448 118 1066 3749 -476 -4801 -5516 -4707 1947 966 -5761 -7594
6158 -7594 -6345 -6603 -5861 124 136 3361 9312 12383 5502 -4943 -10534 -9428 1574 1146 0 -2685
6142b685j653K062K189l570m74N565l81k390l37O24k45m897J334M568M190J288
6126E188k718j747j491K019j869m563M010L226J225j664J284j651r187q919k232
6111a9089M776Q132P976K840p470m534j2428j611R266J1200Q386o28p853l187
6097d224N69J17R19K398J226o120J498M889J848k125j486K139m060k037j464M24
6081e489J099l465j392K309q99P198O460N151K92k425L101k664o845m110K021
6066C42m780l840O074N86J268m11J38l313k584o96l900K857P983K578l983N7P312
6049E688L327k907o90o410j199N898M219p357l993Q98m445k71J413L171l384q20
6033f862L758l815l414K209m55l517J139J420K429P219N405o295q268M964Q578
$$ plain form
6142 -2685 -4338 -2276 -87 -3657 -4131 1434 1053 -1337 -1674 -1050 -1295 -6192 -4858 -290 3900 5188
6126 5188 2470 723 -768 1251 -618 -5181 -1171 2055 3280 1616 2900 1249 -7938 -16857 -19089
6111 -19089 -14313 -6181 1795 4635 -2835 -7369 -19797 -21408 -12142 -942 7444 6816 -1037 -4224
6097 -4224 -3655 -3538 -2619 -221 1005 -5115 -3617 1272 3120 995 -491 1648 -2412 -4449 -5913 -5489
6081 -5489 -4390 -7855 -9247 -6938 -7837 -639 5821 10972 11264 8839 11940 9276 2431 -1679 342
6066 342 -4438 -8278 -2204 -1618 -350 -761 -623 -3936 -6520 -7216 -11116 -8259 -276 2302 -1681 -1624 5688
6049 5688 9015 6108 5418 -992 -2191 3707 7926 569 -3424 -2526 -6971 -7242 -5829 -2658 -6042 -6862
6033 -6862 -3104 -6919 -10333 -8124 -8579 -12096 -10957 -9537 -7108 111 5516 -779 -9047 -4083 4495
6018D495j297r56l755p555j259l210K177M145k630l516N212Q724j495n083K043
6003c960M11m003j019M894J87p67J233l315R107L793l485O120o10k413l803k024
5987C46K956l488m773m452J606N151J945j956k033R4m389k737K764Q167O150q79
5971D472j859j867p96K990l951J17j563m7l033L320M222M56m62n688n253j243
5955a0185j310k47M852J0018L876j649n554m647k059l16l974L399M118j991L87
5940e282j261l138L529N290P531N210n299q170p34p35J029k687J474K791R059
5925H607L317k569p671P99J1236L298q030r360m225j117K85J113N298M273j193
5910D061j675j825O736L630n429l138m130j832r81o929K363J891M975j290M66
$$ plain form
6018 4495 3198 2242 -1513 -9068 -10327 -13537 -11360 -7215 -9845 -13361 -8149 575 -920 -6003 -3960
6003 -3960 -3549 -7552 -8571 -3677 -3490 -4257 -3024 -6339 2768 6561 3076 9196 8586 6173 2370 346
5987 346 3302 -186 -4959 -9411 -7805 -2654 -709 -2665 -4698 -4604 -8993 -11730 -8966 -799 5351 4472
5971 4472 2613 746 -50 2940 -1011 -894 -2457 -2504 -5537 -2217 2005 2461 1999 -3689 -8942 -10185
5955 -10185 -11495 -11742 -6890 3128 7004 5355 -199 -4846 -6905 -7221 -11195 -7796 -3678 -5669 -5282
5940 -5282 -6543 -9681 -6152 -862 6669 11879 6580 -1590 -2324 -3059 -2030 -4717 -3243 -452 8607
5925 8607 11924 9355 1684 2483 13719 17017 8987 -373 -4598 -5715 -5430 -4317 981 5254 4061
5910 4061 2386 561 7297 10927 5498 2360 -1770 -3602 -4583 -11512 -9149 -7258 -2283 -3573 -3107
5895c107M694M866m08q1m445k009P009m539P27j134l297M2k99P9m197J366R11
$$ plain form
5895 -3107 1587 6453 6045 5964 1519 -490 6519 1980 2707 1573 -1724 -1682 -1981 -1902 -6099 -4733 -3822
$$ [...]
##END NTUPLES=NMR SPECTRUM
##END=
