##TITLE=Analysis number 319078
Compound Code tl 00797
Project Code adrs
Chemist Name mariap
##JCAMPDX= 6.0         $$ Bruker NMR JCAMP-DX V2.0
##DATA TYPE= NMR SPECTRUM
##DATA CLASS= NTUPLES
##ORIGIN= Bruker BioSpin GmbH
##OWNER= nmr
$$ XWIN-NMR		Version 3.5
$$ Fri Apr 28 13:17:12 2006 GMT Daylight Time (UT+1h)  MAYBRIDGE\nmr@NMR_250MHZ
##.OBSERVE FREQUENCY= 250.131544655141
##.OBSERVE NUCLEUS= ^1H
##.ACQUISITION MODE= SIMULTANEOUS (DQD)
##.ACQUISITION SCHEME= undefined
##.AVERAGES= 16
##.DIGITISER RES= 18
##SPECTROMETER/DATA SYSTEM= dpx250
##.PULSE SEQUENCE= zg30
##.SOLVENT NAME= DMSO
##.SHIFT REFERENCE= (INTERNAL, DMSO, 0, 16.522)
##AUDIT TRAIL= $$ (NUMBER, WHEN, WHO, WHERE, WHAT)
$$ ##TITLE= Audit trail, XWIN-NMR		Version 3.5
$$ ##JCAMPDX= 5.01
$$ ##ORIGIN= Bruker BioSpin GmbH
$$ ##OWNER= nmr
$$ C:\u/data/dgb/nmr/ADRS/3450/pdata/1/auditp.txt
$$ ##AUDIT TRAIL=  $$ (NUMBER, WHEN, WHO, WHERE, WHAT)
(   1,<2006-04-28 13:16:42.86 +100>,<MAYBRIDGE\nmr>,<NMR_250MHZ>,
      <created by zg, POWCHK disabled, PULCHK disabled
       configuration hash MD5:
       84 BC 41 DB A1 6E 1D 46 DA 25 12 A5 C1 ED C5 3A
       data hash MD5: 64K
       80 B8 72 16 27 BC 6E 0D 1E 06 AA 8B 88 5F 37 9A>)
(   2,<2006-04-28 13:17:01.02 +100>,<MAYBRIDGE\nmr>,<NMR_250MHZ>,
      <Start of raw data processing
       ef LB = 0.3 FT_mod = 6 PKNL = 1 SI = 32K 
       data hash MD5: 32K
       95 7C 5E 28 74 A8 88 7E 38 45 3A C3 7C 56 46 2D>)
(   3,<2006-04-28 13:17:02.60 +100>,<MAYBRIDGE\nmr>,<NMR_250MHZ>,
      <apk 
       data hash MD5: 32K
       7F 23 80 D9 77 B6 A7 B4 9F 3B 46 B0 DD 2A 8D 61>)
(   4,<2006-04-28 13:17:03.60 +100>,<MAYBRIDGE\nmr>,<NMR_250MHZ>,
      <abs ABSG = 5 
       data hash MD5: 32K
       4C 29 ED 93 B4 38 DC 24 F0 9B A3 19 94 61 B7 50>)
$$ ##END=
$$ 
$$ hash MD5
$$ F0 83 3F B1 89 5D 60 12 83 C6 6B 62 00 57 FC 88
##$RELAX= 
##$RELAX= 
##$RELAX= 
##$RELAX= 
##$RELAX= 
##$RELAX= 
##$RELAX= 
$$ Bruker specific parameters
$$ --------------------------
##$DU= <C:\u>
##$EXPNO= 3450
##$NAME= <ADRS>
##$PROCNO= 1
##$TYPE= <nmr>
##$USER= <dgb>
##$AMP= (0..31)
100 100 100 100 100 100 100 100 100 100 100 100 100 100 100 100 100 100 
100 100 100 100 100 100 100 100 100 100 100 100 100 100 
##$AQSEQ= 0
##$AQ_mod= 3
##$AUNM= <au_zg>
##$AUTOPOS= <32 >
##$BF1= 250.13
##$BF2= 250.13
##$BF3= 250.13
##$BF4= 250.13
##$BF5= 500.13
##$BF6= 500.13
##$BF7= 500.13
##$BF8= 500.13
##$BYTORDA= 1
##$CFDGTYP= 0
##$CFRGTYP= 5
##$CHEMSTR= <none>
##$CNST= (0..31)
1 1 145 1 1 1 1 1 1 1 1 1 1 1 1 1 1 1 1 1 1 1 1 1 1 1 1 1 1 1 1 1 
##$CPDPRG= <>
##$CPDPRG1= <>
##$CPDPRG2= <>
##$CPDPRG3= <>
##$CPDPRG4= <mlev>
##$CPDPRG5= <mlev>
##$CPDPRG6= <mlev>
##$CPDPRG7= <mlev>
##$CPDPRG8= <mlev>
##$CPDPRGB= <>
##$CPDPRGT= <>
##$D= (0..31)
0 1 0 0 0 0 0 0 0 0.06 0 0 0 0 0 0 0.0002 0 0 0 0 0 0 0 0 0 0 0 0 0 0 
0 
##$DATE= 1146226601
##$DBL= (0..7)
120 120 120 120 120 120 120 120 
##$DBP= (0..7)
150 150 150 150 150 150 150 150 
##$DBP07= 0
##$DBPNAM0= <>
##$DBPNAM1= <>
##$DBPNAM2= <>
##$DBPNAM3= <>
$$ [...]
##$SUBNAM7= <"">
##$SUBNAM8= <"">
##$SUBNAM9= <"">
##$SW= 20.6930455092707
##$SWIBOX= (0..15)
0 0 3 0 0 0 0 0 0 0 0 0 0 0 0 0 
##$SW_h= 5175.983436853
##$TD= 65536
##$TD0= 1
##$TE= 295.16
##$TE2= 300
##$TE3= 300
##$TEG= 300
##$TL= (0..7)
0 120 120 120 120 120 120 120 
##$TP= (0..7)
150 150 150 150 150 150 150 150 
##$TP07= 0
##$TPNAME0= <>
##$TPNAME1= <>
##$TPNAME2= <>
##$TPNAME3= <>
##$TPNAME4= <>
##$TPNAME5= <>
##$TPNAME6= <>
##$TPNAME7= <>
##$TPOAL= (0..7)
0.5 0.5 0.5 0.5 0.5 0.5 0.5 0.5 
##$TPOFFS= (0..7)
0 0 0 0 0 0 0 0 
##$TUNHIN= 0
##$TUNHOUT= 0
##$TUNXOUT= 0
##$USERA1= <user>
##$USERA2= <user>
##$USERA3= <user>
##$USERA4= <user>
##$USERA5= <user>
##$V9= 5
##$VALIST= <valist>
##$VCLIST= <CCCCCCCCCCCCCCC>
##$VD= 0
##$VDLIST= <DDDDDDDDDDDDDDD>
##$VPLIST= <PPPPPPPPPPPPPPP>
##$VTLIST= <TTTTTTTTTTTTTTT>
##$WBST= 1024
##$WBSW= 4
##$XGAIN= (0..3)
0 0 0 0 
##$XL= 0
##$YL= 0
##$YMAX_a= 292867
##$YMIN_a= -466643
##$ZGOPTNS= <>
##$ZL1= 120
##$ZL2= 120
##$ZL3= 120
##$ZL4= 120
##$ABSF1= 16.522
##$ABSF2= -4.171173
##$ABSG= 5
##$ABSL= 3
##$ALPHA= 0
##$AQORDER= 0
##$ASSFAC= 0
##$ASSFACI= 0
##$ASSFACX= 0
##$ASSWID= 0
##$AUNMP= <proc_1d>
##$AZFE= 0.1
##$AZFW= 0.1
##$BCFW= 0
##$BC_mod= 0
##$BYTORDP= 0
##$COROFFS= 0
##$CY= 12.5
##$DATMOD= 1
##$DC= 0
##$DFILT= <>
##$DTYPP= 0
##$F1P= 14.0000005364418
##$F2P= -0.99999901652339
##$FCOR= 0.5
##$FTSIZE= 32768
##$FT_mod= 6
##$GAMMA= 0
##$GB= 0
##$INTBC= 1
##$INTSCL= 1
##$ISEN= 128
##$LB= 0.3
##$LEV0= 0
##$LPBIN= 0
##$MAXI= 10000
##$MC2= 0
##$MEAN= 0
##$ME_mod= 0
##$MI= 0
##$NCOEF= 0
##$NC_proc= -4
##$NLEV= 6
##$NOISF1= 0
##$NOISF2= 0
##$NSP= 0
##$NTH_PI= 0
##$NZP= 0
##$OFFSET= 16.522
##$PC= 1
##$PHC0= 164.2618
##$PHC1= 4.450634
##$PH_mod= 1
##$PKNL= yes
##$PPARMOD= 0
##$PSCAL= 4
##$PSIGN= 0
##$REVERSE= no
##$SF= 250.13
##$SI= 32768
##$SIGF1= 0
##$SIGF2= 0
##$SINO= 400
##$SIOLD= 32768
##$SREGLST= <1H.DMSO>
##$SSB= 0
##$STSI= 32768
##$STSR= 0
##$SW_p= 5175.98343685301
##$SYMM= 0
##$S_DEV= 0
##$TDeff= 65536
##$TDoff= 0
##$TI= <Analysis number 999999
Compound Code 99
Book Reference 9
Project Code 9>
##$TILT= no
##$TM1= 0
##$TM2= 0
##$TOPLEV= 0
##$USERP1= <user>
##$USERP2= <user>
##$USERP3= <user>
##$USERP4= <user>
##$USERP5= <user>
##$WDW= 1
##$XDIM= 32768
##$YMAX_p= 302564216
##$YMIN_p= -657002
$$ End of Bruker specific parameters
$$ ---------------------------------
##NTUPLES= NMR SPECTRUM
##VAR_NAME=  FREQUENCY,     SPECTRUM/REAL,   SPECTRUM/IMAG
##SYMBOL=    X,             R,               I
##VAR_TYPE=  INDEPENDENT,   DEPENDENT,       DEPENDENT
##VAR_FORM=  AFFN,          ASDF,            ASDF
##VAR_DIM=   32768,         32768,           32768
##UNITS=     HZ,            ARBITRARY UNITS, ARBITRARY UNITS
##FACTOR=    0.157963299565203, 1,           1
##FIRST=     4132.6476996994, 0,             0
##LAST=      -1043.33573715361, 0,           0
##MIN=       -1043.33573715361, -657002,     0
##MAX=       4132.6476996994, 302564216,     0
$$ Real data points
##PAGE= N=1
##DATA TABLE= (X++(R..R)), XYDATA
$$ [...]
15822B3764j24183k1192J47278j297N3984n7231k52036p7651J21241N5932J90098
15811E8707K55070P7716l11680k15381m9085L2399j5548N4915K1135j18272j03178
15800c13202n287K5076P5122R3551O8156P2622J87289R5065k91822k47349o8800
15789c09579Q2529J19841K7095J3967N407o2678J58279P7894m7713j04157P597
15778c1518j23812o8588Q3612j0092J07900J14222k9697m2957K2567J6508Q0746
15767A18891m9344P9789k5497q9443R6932j05882p3847J61474L8527m2921o1410
15756D7269N6858N3911p7780K247O7502p3130p6867l0210K0232K3434j68022J9785
15744a34771Q570q3408Q9727j4780j15498N799J30946L205k4678n7690m6490L8503
$$ plain form
15822 23764 -100419 -121611 25667 24370 78354 21123 -230913 -308564 -187323 -131391 58707
15811 58707 313777 391493 79813 -135568 -184653 -152254 -167802 -112887 -91752 -210024 -313202
15800 -313202 -318489 -293413 -218291 -124740 -56584 16038 203327 298392 6570 -240779 -309579
15789 -309579 -227050 -107209 -80114 -66147 -60740 -123418 34861 112755 65042 -39115 -31518
15778 -31518 -155330 -223918 -140306 -150398 -42498 71724 42027 -930 21637 38145 118891
15767 118891 69547 149336 123839 34396 131328 25446 -48401 113073 151600 108679 47269
15756 47269 104127 158038 80258 82505 150007 76877 10 -30200 -9968 13466 -154556 -134771
15744 -134771 -126201 -209609 -119882 -134662 -250160 -244361 -113415 -110210 -134888 -192578 -239068 -200565
15732b00565J22229M458p5686N7793J06539o5051L37k9147p3214m5855Q8314p2476
15720a82324L6640K2754N5369J13411N7503q8538j06059p4612J66266l1877r1695
15709a23162P0691J23297k6201j1359o5360Q196r1779M5833j2386J5424L8952
15698b7854l658M0153n2146n3841k4730J6572J32394J99589r6093k40309J17178
15687G255R6119k7029K81688r7337p2303m0427R9598P8360k8165L0353j1184j26736
15675A90192J990p0482J18848J5280k12521j05119O7021J00999K757R4848K0053
15664B23866K0203M8973j0804N4661l0268K8399m8904M8760o4870j78085j63322
15653g1391J06196M4156r9037q803R12O3576N0375M811r328j98226j16881R6994
$$ plain form
15732 -200565 -78336 -73878 -149564 -91771 14768 -50283 -49946 -79093 -152307 -198162 -109848 -182324
15720 -182324 -145684 -122930 -67561 45850 103353 14815 -91244 -165856 410 -31467 -123162
15709 -123162 -52471 70826 44625 33266 -32094 -23898 -115677 -69844 -82230 -66806 -27854
15698 -27854 -31512 8641 -43505 -97346 -122076 -105504 26890 226479 130386 -109923 7255
15687 7255 103374 76345 358033 260696 188393 147966 247564 325924 297759 328112 316928 190192
15675 190192 192182 121700 240548 255828 43307 -61812 5209 106208 108965 203813 223866
15664 223866 244069 293042 282238 336899 306631 335030 286126 334886 270016 91931 -71391
15653 -71391 34805 78961 -20076 -28879 -27967 35609 85984 90795 81467 -116759 -233640 -136646
15641a36646r212l8178J18297R7868j16824L8405J07237q5934K0919j8727K1571
15630a224l6550J13709k2652j4563o8721n2887k3067P291j4616J87754K4049q3996
15618A4527j69750J0950M9010P8251K06117j43687j50619o4157j38063N6003J89157
15607f2261k9397n2811K2246J44156p3096o1856J76381L7769j18809Q429K0429
15596A1180k9900j3528J31266M2465j00639j21760J48904n5j28175Q7541K5389
15585E2688n5561r0928q909j3623M7841J63052O6363J20484m3262k19852p5103
15574e6810L434m0274j52487Q8188P6529J1160n7006m8894m3700p25K00400J24379
15562A04194K0435N2008R025j64845k10231M934j0533M8701q599K10572N682j37002
$$ plain form
15641 -136646 -145858 -184036 -65739 32129 -84695 -46290 60947 -24987 -4068 -22795 -1224
15630 -1224 -37774 75935 53283 38720 -30001 -82888 -105955 -98664 -113280 74474 98523 14527
15618 14527 -155223 -144273 -95263 -17012 189105 45418 -105201 -169358 -307421 -251418 -62261
15607 -62261 -91658 -144469 -122223 21933 -51163 -113019 63362 101131 -17678 -9249 11180
15596 11180 -18720 -32248 99018 141483 40844 -80916 67988 67933 -60242 27299 52688
15585 52688 -2873 -93801 -102710 -116333 -68492 94560 160923 281407 238145 18293 -56810
15574 -56810 -53376 -93650 -246137 -157949 -81420 -70260 -127266 -176160 -219860 -220585 -20185 104194
15562 104194 124629 176637 185662 20817 -189414 -184480 -195013 -146312 -154911 55661 61343 -75659
15550g5659p0477N6855P3521n3463r59k6822k4552o2465J0506R7794m1279n8582
15538a75582q878p456J65303L46674k832k01995k0621r434m7964P9380o3805m1923
15526A0867J07120J12630J4166o4240j29243m8923L0486J17183o7631j76785m2603
15515a36973M6437n7250L3730M1361K35992R8125p0033j05362j47650k0733m0658
15504a23014l2106o0800p5623l1463K4794K4888P1172J31127N8778l8302k8011
15493g8560n3750j01169J50019j6978k0163J51489J1029K5447M4294N8060M2465
15482B12183J2792o4961j46828r2934Q7298M1110M5074j09639l7624J25241m1584
15471C0128K11181l060l01363q1306M9107J87862L4382J59240K0942j33722j49876
$$ plain form
15550 -75659 -146136 -89281 -15760 -69223 -70182 -97004 -121556 -184021 -173515 -75721 -117000 -175582
15538 -175582 -184460 -191916 -26613 320061 317229 115234 94613 85179 37215 116595 52790 10867
15526 10867 117987 230617 244783 180543 51300 2377 32863 150046 82415 -94370 -136973
15515 -136973 -90536 -147786 -114056 -72695 163297 261422 191389 86027 -61623 -82356 -123014
15504 -123014 -155120 -215920 -291543 -323006 -298212 -273324 -202152 -71025 -12247 -50549 -78560
15493 -78560 -132310 -233479 -83460 -100438 -120601 30888 41917 67364 111658 169718 212183
15482 212183 224975 160014 13186 -79748 7550 48660 93734 -15905 -53529 71712 30128
15471 30128 241309 238249 -63114 -144420 -95313 92549 126931 286171 307113 173391 23515
15460B3515j4570O1573j31712j5886j18441o8011K6235J86876J85009O5961j17536
15449H3013r2033L4856k0006L9675J29197j76632j28839l3326J33129M7804P4188
15438I1026M7455r5153j06873J6630P3427J89759j9564k04306k15825J12608J76843
15427F6027l0562k2212J36582P5267j57799j81269r8155R3002J04652J38300K15983
15416C39816j04516j30661k4682L2051n2578k48508j27576J49720n610L9676K28298
15405I5430j09758j02185J23986J69519J86623o4117k81294j48054l0555J1563
15395a48842J39978J48337j71690M8305p2192N958J4627p8986k3554J65166l947
15384B3160j01854n0159l8621P6687Q1006j83502j21799R8646o0784O4311R8422
$$ plain form
15460 23515 8945 70518 -61194 -77080 -195521 -263532 -237297 -50421 134588 200549 83013
15449 83013 -9020 25836 5830 45505 174702 -1930 -130769 -164095 -30966 16838 91026
15438 91026 138481 43328 -63545 -46915 26512 216271 196707 -7599 -223424 -110816 66027
15427 66027 35465 13253 149835 225102 67303 -113966 -212121 -119119 -14467 123833 339816
15416 339816 235300 104639 79957 112008 59430 -189078 -316654 -166934 -172544 -132868 95430
15405 95430 -14328 -116513 7473 176992 363615 299498 18204 -129850 -160405 -148842
15395 -148842 -8864 139473 -32217 16088 -56104 -50146 -35519 -114505 -138059 27107 23160
15384 23160 -78694 -128853 -167474 -90787 -9781 -193283 -315082 -216436 -277220 -212909 -114487
15373a14487j3384M3823Q2393J7796N7988K1879K3781O5608r1008j54398R9840
15362C9831r552J8632j31835j42810o0765R8097m275r475P0520J49407Q485k1864
15350D396Q646R8446o3606n4021J08093J3458p1209Q2953m7768j67779j18221
15339b06612N7748o2973n4632Q6164P9605q4250k5117J01830k1512m8109J38880
15328c8978j0238m0656J75847J6932P5002L7450j98480j36653K8709N2920M4591
15317F446k123j672K4013J42845K21376R2938j86868o1355j28566q1959k2513
15306B562J8662n8432k1572K9045n4623J7090L4741l9636K27624N7008m6259Q513
15294A74723J40005k3923j44273j56011L7121n1866p3285K8357n1437k5964M9474
$$ plain form
15373 -114487 -127871 -84048 -1655 16141 74129 96008 119789 185397 94389 -60009 39831
15362 39831 30279 48911 -82924 -225734 -286499 -188402 -192677 -202152 -131632 17775 26260 4396
15350 4396 13042 111488 47882 -6139 101954 115412 44203 127156 79388 -88391 -206612
15339 -206612 -148864 -211837 -266469 -180305 -100700 -184950 -210067 -108237 -129749 -177858 -38978
15328 -38978 -49216 -89872 85975 102907 177909 215359 16879 -119774 -91065 -38145 6446
15317 6446 4323 2651 26664 169509 390885 483823 296955 235600 107034 25075 2562
15306 2562 21224 -37208 -58780 -29735 -84358 -67268 -32527 -72163 155461 212469 166210 174723
15294 174723 314728 290805 146532 -9479 27642 -24224 -97509 -69152 -120589 -146553 -97079
15283i7079M1256O3558J8395m7901o198j27867k21013J27602K02708N3743n6362
15272d9158p023N6459k7464j09171P901L1753l2363J01261L0540M2629j16132
15261g0768j26280q5274J06745j08328j3232j2211P7021J47498J2632o6551J01215
15250c7533K3591j82710m5924K71736P0980j6247L035j6424q7438m5825j58827
15239b21586n465J10501P5983J01279n2188k84805R7789J01709O6718O169p6935
15228h0831n1467M5541r407p0386j10057k62106j7149J57001Q0281K18454J25282
15217B5156n8295L8593J31319N9109j23112j9335R2859Q3921J5340Q0620j04177
15206B21998l74796q1770j0222k8180k77L3188M1048Q347j6498R2516j03161J05150
$$ plain form
15283 -97079 -55823 7735 26130 -21771 -27969 -155836 -376849 -249247 -46539 7204 -49158
15272 -49158 -56181 278 -27186 -136357 -128456 -96703 -129066 -27805 2735 45364 -70768
15261 -70768 -197048 -282322 -175577 -283905 -297137 -309348 -232327 -84829 -72197 -138748 -37533
15250 -37533 -13942 -196652 -242576 29160 100140 83893 86928 70504 -16934 -62759 -221586
15239 -221586 -227051 -116550 -40567 60712 8524 -276281 -178492 -76783 -10065 -3896 -80831
15228 -80831 -132298 -86757 -96164 -166550 -276607 -538713 -555862 -398861 -318580 -100126 25156
15217 25156 -33139 5454 136773 195882 72770 53435 146294 230215 245555 326175 221998
15206 221998 -152798 -234568 -244790 -272970 -273247 -240059 -199011 -190664 -207162 -114646 -217807 -112657
15194a12657Q6217q6286l2534K36470l4767j06394m1235K3946r4164j15902J21016
15183a56290J90937K9229k5517M8647N6428r4859j43688J7582P035J51103J19833
15172B00440N0141j09175K0681j25118O737J24801l2440q2039k7197k5676m2974
15161d1819l0679r7038O7269J1304M5857k6682K1169L8425N6850J1985l3304l4048
15149a0711r8659O4152m7511J9406K9711k14309j38134J27213R9764L6264J59576
15138B6762R6424j35139j56463l6357m1577R532J28947k2660k06074Q5743J84350
15127f6512p1998m9186J49469J8855j709M4738J09965j87222j84064j42846K6601
15116c53909J73266L2858N3887M1627P3275N2031j56029p1525N6819l5826n2109
$$ plain form
15194 -112657 -26440 -112726 -145260 91210 56443 -49951 -91186 -67240 -161404 -277306 -156290
15183 -156290 34647 63876 38359 87006 143434 48575 -95113 -77531 -70496 80607 200440
15172 200440 250581 141406 162087 36969 43706 168507 136067 54028 26831 1155 -41819
15161 -41819 -72498 -169536 -102267 -90963 -45106 -71788 -50619 -12194 44656 56641 23337 -10711
15149 -10711 -109370 -45218 -92729 -73323 -43612 -257921 -396055 -268842 -169078 -132814 26762
15138 26762 123186 -11953 -168416 -204773 -246350 -236818 -107871 -130531 -336605 -250862 -66512
15127 -66512 -138510 -187696 -38227 -19372 -21081 23657 133622 -53600 -237664 -380510 -353909
15116 -353909 -180643 -147785 -93898 -52271 21004 73035 -82994 -154519 -97700 -133526 -185635
15105a85635k9342p5660j11639n3473J20293n4290O0496J25537J21277J6735j51656
15094b17357o1553J77018J25944K3936J21840j82550k29728l2566R3475J36754
15084d4787M1534M3941k29784L6564J58221M5706j1677J89147J30474r6610r3312
15073A69417k87610j05410j7061J07319J55119r142r9972n4244m459m3427K08142
15062A8672J27094r7911k79079j38495J96327J97251o2117j7840O8047L6456J47954
15051A96359Q9532k13885j07931P475O052o3860J3210L2635n5775k3658K8455
15040i1391l9109j33410J5718l7351M3333Q9919q2907r1082J32215K39065l4481
15029A0519k5171K2935J41583O601j63032m40k3160J26483K28532J40222j52206
$$ plain form
15105 -185635 -214977 -290637 -402276 -455749 -335456 -389746 -329250 -203713 -82436 -65701 -217357
15094 -217357 -278910 -101892 24052 47988 169828 -12722 -242450 -275016 -181541 -44787
15084 -44787 -3253 40688 -189096 -152532 5689 51395 39718 228865 359339 262729 169417
15073 169417 -118193 -223603 -240664 -133345 21774 12632 -87340 -141584 -146043 -189470 18672
15062 18672 145766 47855 -231224 -369719 -173392 23859 -38258 -56098 11949 48405 196359
15051 196359 285891 72006 -35925 -28450 -22398 -86258 -73048 -40413 -96188 -119846 -91391
15040 -91391 -130500 -263910 -248192 -285543 -242210 -152291 -235198 -326280 -194065 45000 10519
15029 10519 -14652 8283 149866 156467 -6565 -7005 -30165 96318 324850 465072 312866
15018C12866L0637K2521q7989m7145j77381j87522K17510K07122r5690j2690j2109
15007A70130L2624j1093j56098r8898k0249Q9229M5426P4911Q7412n6835r1074
14996F5485r5510r6557N4187J55996j28503k1381K30551K02797m8973p9845k00972
14985C7275j70480J14577M415m6338j03946j804J61769J55486O8152j09860p9754
14974B9492Q2211O8001p1515J20303m6288m3014J00428J36894r0934o0711O8363
14963B93230L6594j5930n8676J7811p2499p0122k2083n4574o2754q42K595O4712
14951E7462R0651q9655j11193o8231K9985k2074R8005J63125j18353k40912j63217
14940c74407j6140J38990j8003R657Q6054M8022R338J18132O2564Q952P5446j1921
$$ plain form
15018 312866 343503 366024 278035 230890 53509 -134013 83497 290619 194929 182239 170130
15007 170130 202754 191661 35563 -63335 -83584 5645 51071 125982 213394 156559 65485
14996 65485 -30025 -126582 -72395 83601 -44902 -66283 164268 367065 318092 238247 37275
14985 37275 -133205 -18628 -14213 -60551 -164497 -166301 -4532 150954 219106 109246 29492
14974 29492 111703 179704 108189 228492 182204 139190 239618 376512 285578 224867 293230
14963 293230 329824 313894 255218 273029 200530 130408 108325 53751 -9003 -9845 -7250 57462
14951 57462 148113 58458 -52735 -120966 -90981 -113055 -15050 148075 29722 -211190 -374407
14940 -374407 -390547 -251557 -269560 -259903 -173849 -125827 -116489 1643 64207 73159 148605 136684
14928A36684O2704p4932n9845k7663j32639M1300j25411M2948K08143r2800k28789
14917b50300J35211J32718j32623o6302O4496l5071k340j04970K16182R3964j83469
14906a32504k28485N5672K24425R0475J26537L7561p8171J49820N3229k34600
14896F3959m7726M3384P5412j77817N1069O0489j16501j51292k535J3242j38284
14885c26600k5396J84565J12055j0255N1553J57198k8032k9400J18551L2623o905
14874B29957j5628l6132k9640j70121j47948j1762J71230k5526j50619J12716
14864g3473Q5406p5883k323l0977K3915k0264O5133L6284j54774p4897J32881
14853h8972R8118l0909N2674J282j1965J25714L4401j70196L8064m3006j52233
$$ plain form
14928 136684 199388 124456 64611 36948 -95691 -54391 -179802 -136854 71289 -21511 -250300
14917 -250300 -115089 17629 -114994 -181296 -116800 -151871 -154211 -259181 -42999 50965 -132504
14906 -132504 -360989 -305317 -80892 9583 136120 173681 95510 245330 298559 63959
14896 63959 16233 59617 135029 -42788 8281 68770 -47731 -199023 -201558 -188316 -326600
14885 -326600 -351996 -167431 -55376 -65631 -14078 143120 115088 85688 204239 236862 229957
14874 229957 214329 178197 148557 -21564 -169512 -181274 -10044 -35570 -186189 -73473
14864 -73473 11933 -63950 -66273 -97250 -73335 -93599 -28466 7818 -146956 -221853 -88972
14853 -88972 9146 -21763 30911 32193 20228 145942 180343 10147 48211 5205 -147028
14842a47028k9962K07200Q6103o1380k9976l0258K8085J14489j00264K9124j39257
14831g3124r9948l13855j8632K47071J95350N0895j27205O684r9145Q0825j3609
14820a64693m4923q5472l6936K39671J51570o3700J07525O387r2504j23003j17312
14809b23390J33541J20590O417j07346j68221j7594P6853P0376N4471Q1622J57460
14798A84779K8658J08203l2723q7210L1165j15184k11304L7600J30912M5770n0467
14787G0199N0389l7622o194p8149n9818j5770j3002n6796J746M6457J62086o7752
14775d226j21105m0116P1461O7046P7391N6915J77317k5206l70676O1731k2920
14764g2388j35930L0477J35630k7689M6833n5747j9563N5029N5189O8474l7041
$$ plain form
14842 -147028 -176990 30210 116313 54933 24957 -5301 22784 137273 37009 66133 -73124
14831 -73124 -173072 -486927 -505559 -258488 -63138 -12243 -139448 -132764 -231909 -151084 -164693
14820 -164693 -209616 -295088 -332024 -92353 59217 -4483 103042 109429 16925 -106078 -223390
14809 -223390 -89849 30741 37158 -70188 -238409 -256003 -179150 -108774 -54303 27319 184779
14798 184779 213437 321640 288917 201707 232872 117688 -93616 -56016 74896 120666 70199
14787 70199 120588 82966 76772 -1377 -61195 -76965 -89967 -146763 -145017 -98560 63526 -4226
14775 -4226 -125331 -165447 -93986 -26940 50451 107366 284683 259477 -111199 -49468 -72388
14764 -72388 -208318 -177841 -42211 -69900 -23067 -78814 -98377 -43348 11841 80315 43274
14753D3274m7949K60139L554k73993m6097r9225K8372q0152l4793K87583J89072
14742B29785M8438P6763m9106p6073j41756N3169J43242j06476k16624K14819
14732A76181O6980j96923p1292o116J37349Q0716j17039N6378j01018P0565J42310
14721B38091L6267p0075j87761j46223j53162K1989K20238J73295J37295P3744
14711C43698p4571m4261p8729R1070o5579k6352j30959O8787K6816N2091J5841
14700A77852n5518J8477j52414N818J1783l8707M4546j5011q0755L6441P2094
14689B4606P2719q9841J16796P8954j42322r792l2596k8211k0901J64679M7720
14678A81811O7862o388j35313j37943k9023P2658M9068J0998Q9556j11856n7503
$$ plain form
14753 43274 -4675 255464 259018 -14975 -61072 -160297 -131925 -212077 -246870 40713 229785
14742 229785 278223 354986 305880 229807 88051 141220 284462 177986 -38638 176181
14732 176181 243161 46238 -25054 -31170 106179 186895 69856 126234 25216 95781 238091
14721 238091 274358 204283 16522 -129701 -282863 -260874 -40636 132659 269954 343698
14711 343698 269127 224866 146137 237207 171628 145276 14317 83104 109920 162011 177852
14700 177852 122334 140811 -11603 -5785 5998 -32709 11837 -3174 -83929 -47488 24606
14689 24606 97325 7484 124280 203234 60912 51120 18524 -9687 -30588 134091 181811
14678 181811 249673 243285 107972 -29971 -58994 13664 62732 73730 163286 51430 -6073
14667f073J24699Q1104L9510k46675l78539q0230P2185K24689J00937J39680j1434
14656E9853j9011J40217j04138K5241P1786l7490k47247Q9878n1745q9163O2663
14645i9156K185L0118q1364O6003N2635Q2847M546j10929j95095k55587J33608
14634c70189J25357J03817J33953J04816M0928l717L9674j62390r9917k7152M840
14623a09980Q6447Q6561O3771l7586q2401O4213K06453k671K3614j16590k00145
14612a8314N6303N309m4595k2921o8737j2725J06323P9040j0705n4512M7411M7446
14600A09323j5881k11710P7670K00916l607L2639j22268O5567J9415q4798J44953
14589B12219k4204l4295o0814k04637q0299Q1329P5972l8575j30386M5928J14733
$$ plain form
14667 -6073 118626 199730 239240 -7435 -385974 -466204 -394019 -169330 -68393 71287 59853
14656 59853 40842 181059 76921 102162 173948 136458 -110789 -20911 -72656 -161819 -99156
14645 -99156 -96971 -66853 -148217 -82214 -29579 53268 57814 -53115 -248210 -503797 -370189
14634 -370189 -244832 -141015 -7062 97754 138682 134965 174639 12249 -87668 -114820 -109980
14623 -109980 -23533 63028 126799 89213 6812 71025 277478 274807 298421 181831 -18314
14612 -18314 37989 43298 -1297 -24218 -92955 -105680 643 79683 68978 14466 61877 109323
14600 109323 93442 -118268 -40598 160318 156711 189350 67082 132649 152064 67266 212219
14589 212219 188015 153720 92906 -111731 -192030 -110701 -34729 -73304 -203690 -157762 -43029
14578d3029l7244j5223j0713l6946n6665L0394P1552m5722l0327M1657R4420l8448
14566g6294r2423J05677r4204p2914J38272K15483l6857p4815j61584K1039Q7272
14555d1348J08480n643r0455k0413M2820O4122J5216Q5704O1342j5926M525J75777
14543C84201j50076j84863j05008j5751J5938j50408p8078k1205J73620M8403
14533h3227j8777O640O0793M3963l6115J36257j4696n0972q8144J2089l3130n1992
14521a17311p9815M4806j38916r1698O1518J36668m4630l8805J15416O0604j1250
14510a03413K3510Q9822P1039K1826R0707k2937j39015r8756k29597o1907p9746
14499d38467J85709J12979O2237P2841J26552m218k3794K8871j48379N8478L6214
$$ plain form
14578 -43029 -80273 -95496 -106209 -143155 -199820 -169426 -97874 -143596 -173923 -132266 -37846 -76294
14566 -76294 -168717 -63040 -157244 -230158 -91886 123597 86740 11925 -149659 -128620 -41348
14555 -41348 67132 61489 -28966 -49379 -6559 57563 72779 158483 219825 203899 208424 384201
14543 384201 234125 49262 -55746 -71497 -55559 -205967 -284045 -305250 -131630 -83227
14533 -83227 -102004 -95364 -34571 9392 -26723 109534 94838 43866 -44278 -32189 -65319 -117311
14521 -117311 -197126 -152320 -291236 -382934 -321416 -184748 -229378 -268183 -152767 -92163 -103413
14510 -103413 -79903 9919 80958 102784 193491 170554 31539 -67217 -296814 -358721 -438467
14499 -438467 -252758 -139779 -77542 -4701 121851 117633 93839 122710 -25669 32809 69023
14488F9023k5530K7195n4615j11597j56022j04940J78167K55642q9271j1914Q6644
14477F2782j600j22859j33452J68611J34217j31600j84197j40154l99J60401J25769
14466f2481J10195j50526m2529K61122N5867j22098n6423n0701R2560p6802q041
14455d9857K8540k1502P789k8802m8734R1851J11285p2745j26254j2631k2016
14444a43076K40290J2165j08003j13577q4216O4726J66105Q4132J1616N3020q0586
14433A02596j88047M4744l4013M3565O1981r9089n1710j00064j42890j39814J16384
14422c86357P2018J01580R7960r049P6321R4451J25724R7123J01197j59867j49879
14411F1222j57166J5965j3138K0095k3484R624J04331J81416J86475P4458q7471
$$ plain form
14488 69023 43493 70688 16073 -95524 -251546 -356486 -178319 77323 -11948 -23862 62782
14477 62782 61182 -61677 -195129 -26518 107699 -23901 -208098 -348252 -348651 -188250 -62481
14466 -62481 47714 -102812 -145341 115781 171648 49550 -6873 -57574 34986 -41816 -49857
14455 -49857 -21317 -42819 -35030 -63832 -112566 -20715 90570 17825 -108429 -121060 -143076
14444 -143076 97214 109379 1376 -112201 -196417 -131691 34414 118546 130162 183182 102596
14433 102596 -85451 -40707 -74720 -31155 30826 -68263 -119973 -220037 -362927 -502741 -386357
14422 -386357 -314339 -212759 -114799 -123848 -47527 46924 172648 269771 370968 211101 61222
14411 61222 -95944 -79979 -93117 -73022 -96506 -86882 17449 198865 385340 459798 372327
14400C72327k63629j53652k7252N3426j12710J59623j7120j7518r3817k4948N623
14389a19647J19769J00883p1794K2929J04060l5022k8936j53364j55389j5871
14379b32382R0121k1466O2790J23887R3468P2287N216p4408j43850q7755M584
14368a07508j381R8173J44558N7743K9121M5932q2885n2099p7157j11842n2654
14357a09999p5471Q4163K26706J02900j2054l1153Q0714J50379k40773k59611
14347h4199j42980l9680J39930L8072Q2747q4298j29262r3533q6781K07899J30794
14336f1291j79235j13137J43091N8089J35404n5356Q1385L0145j06006J04715
14326C7804J21220j53185q6254r1446J7977l277m8874l6186K05780J81295l0742
$$ plain form
14400 372327 108698 -44954 -72206 -18780 -131490 28133 11013 -6505 -100322 -125270 -119647
14389 -119647 122 101005 29211 52140 156200 121178 92242 -61122 -216511 -232382
14379 -232382 -142261 -163727 -100937 22950 116418 188705 193921 119513 -24337 -112092 -107508
14368 -107508 -108889 -10716 133842 191585 220706 266638 183753 131654 54497 -57345 -109999
14357 -109999 -185470 -101307 125399 228299 216245 185092 265806 416185 175412 -84199
14347 -84199 -227179 -266859 -126929 -88857 -6110 -90408 -219670 -313203 -399984 -192085 -61291
14336 -61291 -240526 -353663 -210572 -152483 -17079 -72435 8950 39095 -66911 37804
14326 37804 159024 5839 -80415 -171861 -153884 -157161 -206035 -242221 -36441 144854 114112
14315A14112Q576m6344k12194J04907N4165L5010j75458j00079J85164O2998K8790
14304E9647o5556j57306j15937R6408J71251m0725j27919j59648k7526J61763
14294b05548K6949J53971l2487q4066n9934J89753J12890m2081j48998j37045
14284b26596m1683K12060J68894j74086j63543R5533N9503j17545j65987p069
14274c60519Q4269j13169M9419L37233J54856j40654L8759j44350r0769P5775
14264a09150q3715J20792Q7062p014j16494j13128k3653Q1008K0197J95983j29845
14253g7957j10307R1009K96334Q4418j64571l2356n5071O7718M5977n9402q9227
14242c435j63239L904K19296L3088j13550j24572n4730P3905j30535J2062J06370
$$ plain form
14315 114112 122688 76344 -135850 -30943 23222 58232 -117226 -217305 -32141 30857 59647
14304 59647 -5909 -163215 -279152 -182744 -11493 -52218 -180137 -339785 -367311 -205548
14294 -205548 -178599 -24628 -57115 -141181 -201115 -11362 101528 59447 -89551 -226596
14284 -226596 -268279 -56219 112675 -61411 -224954 -129421 -69918 -187463 -353450 -360519
14274 -360519 -276250 -389419 -340000 -2767 152089 11435 50194 -94156 -184925 -109150
14264 -109150 -192865 -72073 14989 7975 -108519 -221647 -245300 -164292 -144095 51888 -77957
14253 -77957 -188264 -97255 199079 283497 118926 86570 31499 99217 145194 85792 -3435
14242 -3435 -166674 -162770 56526 89614 -23936 -148508 -203238 -129333 -259868 -247806 -141436
14231a41436M6566j06294k2139k4469J74706J43813O0651p8601n1189l7245q6116
14220a21753P4343J42698j13893k4943J64602m2043j21401J14154k13143n3796
14210a95175L1271m6513P1188K00306K84276r9367j03214j37381j40134Q7029
14200d7714J37358P2846o1143j3818J05338j10748j56624j14536p0746J33272
14190a26515R5039Q9410J76181J01597m0504n21J151l0412j39201k3639K3691
14179A26277R9362P2919J23941l3266j96425k10646j63787M7374P0608l5059J59457
14168F0755j30173n6056j12050j56696R6008J41348J18490j25662M7242J43365
14158B6571r6766k02963R4430K9251J2412R493J11508J610l5161j00095q046k3079
$$ plain form
14231 -141436 -94870 -201164 -223303 -247772 -73066 70747 131398 52797 1608 -35637 -121753
14220 -121753 -47410 95288 -18605 -43548 121054 79011 -42390 71764 -141379 -195175
14210 -195175 -163904 -210417 -139229 61077 345353 245986 142772 5391 -134743 -47714
14200 -47714 89644 162490 101347 87529 192867 82119 -74505 -189041 -259787 -126515
14190 -126515 -31476 57934 234115 335712 295208 294687 295838 265426 126225 102586 126277
14179 126277 225639 298558 422499 389233 192808 -17838 -181625 -134251 -63643 -98702 60755
14168 60755 -69418 -125474 -237524 -394220 -298212 -156864 -38374 -164036 -116794 26571
14158 26571 -70195 -273158 -178728 -149477 -137065 -127572 -16064 -14454 -49615 -149710 -157756 -180835
14146a80835j31908L3763J49743J38182n9622j06259l0885N4092K50575Q0202
14136A97048o2586j9064j08271k5267J9650J14053M5679n3090R4306L6520j61562
14125G7416j32543J21946n054j70613l8734N4826m3811K32244J44273n8265r9816
14114H1869k60507k20790p292J0001K01181M6884j8867n7310m28l5953K7015j655
14102b35852J49752L4888O243N7856M6864n7483l3690r4429K558M7627m7359N0175
14090g2850j5524n3361q324K29976k4105j45555k18944J2499l8866l3873k3482
14079c92409k442J13864J07634M1935p2186p8123O5241J66475p0526O936K25034
14068A11433N3795n943j30090l6796n0535j4343o798k2223L8493K526K9702n2457
$$ plain form
14146 -180835 -312743 -278980 -129237 8945 -50677 -156936 -187821 -133729 116846 197048
14136 197048 134462 115398 7127 -18140 1510 115563 161242 108152 202458 238978 77416
14125 77416 -55127 66819 61765 -108848 -147582 -92756 -136567 95677 239950 181685 81869
14114 81869 -178638 -399428 -406720 -396719 -195538 -148654 -167521 -224831 -225259 -261212 -234197 -235852
14102 -235852 -86100 -51212 -44969 12887 59751 2268 -31422 -125851 -123293 -75666 -123025 -72850
14090 -72850 -88374 -141735 -150059 79917 55812 -89743 -308687 -296188 -335054 -368927 -392409
14079 -392409 -394851 -280987 -173353 -131418 -203604 -281727 -216486 -50011 -120537 -113601 111433
14068 111433 165228 159285 29195 -7601 -58136 -72479 -79277 -101500 -63007 -60481 -30779 -83236
14056h3236J9943J29281J5571L4239q6183p4748N6996L9151J4191o1265K1J01991
14044A05952j57942r0243o4586j67157J37916O5780j09462j1804O1795J40282
14034h9469R2715J8692J06206J55631n3278j12894L7280o6690j44736k9610J29693
14023D3540m6142r0788J39259J60890n5695r9698k8291m2868K884p0537r5882
14012a83328P1876P1956J5793p6321o325M0125L0036M8088k0565r0040p290O6651
14000c9344J66900J24343k21645j27390r628l6653O943K3434q3787K6326O391
13989a64110J18623J42360j89451q1526K0211o7807q0656m7222p6809J20509J14248
13978a91630k9806J80888K2699j91316p8685n0416O5596J80711r8260j35421J60928
$$ plain form
14056 -83236 -63293 65988 81559 115798 29615 -45133 11863 51014 65205 3940 3961 105952
14044 105952 -51990 -142233 -206819 -373976 -236060 -170280 -279742 -291546 -229751 -89469
14034 -89469 3246 21938 128144 283775 230497 117603 154883 88193 -56543 -86153 43540
14023 43540 -2602 -93390 45869 206759 151064 51366 23075 -19793 -16909 -87446 -183328
14012 -183328 -111452 -39496 -23703 -100024 -106349 -66224 -36188 11900 -8665 -98705 -105995 -39344
14000 -39344 127556 251899 30254 -97136 -106764 -143417 -136474 -113040 -196827 -170501 -164110
13989 -164110 -45487 96873 -92578 -174104 -153893 -221700 -302356 -349578 -426387 -305878 -191630
13978 -191630 -221436 -40548 -17849 -209165 -287850 -338266 -272670 -91959 -190219 -325640 -164712
13967a64712J15646o5046N4572Q9642R874p5340O6701M7799J02522O9405j50847
13956A00216j7565k0884q1657l7798J39950J32407j1178j3105N6509j6594j14115
13945A16186j61115J70675Q8991o8320j68684k5265J38689R4728j915L0163l02073
13934h7940j6608r5068k9436j935n9427M9908j9586l6400K12009O1310r0903j05129
13922b19205J16492K83308j25124k03890P3580j8679j21J77777j4738K3223j38581
13911d5958j75568K01788O6612j31855k3400J8506L5943O5273Q5587r729q715
13900G8484j60648k7287J89850J0756J12395R3172j7471j80313j65407p0721r223
13889a46413p6382n4653O2300q865N0730P840q4364Q7942J24748R3126Q9651j56570
$$ plain form
13967 -164712 -49066 -114112 -59540 30102 39976 -35364 31337 79136 181658 251063 100216
13956 100216 82651 61767 -19890 -57688 82262 214669 203491 190386 246895 230301 116186
13945 116186 -44929 125746 214737 146417 -22267 -47532 91157 185885 183970 214133 -87940
13934 -87940 -104548 -199616 -229052 -230987 -290414 -240506 -260092 -296492 -84483 -23173 -114076 -219205
13922 -219205 -102713 180595 55471 -148419 -74839 -93518 -93639 84138 69400 92623 -45958
13911 -45958 -221526 -19738 46874 -84981 -108381 -89875 -53932 11341 96928 87199 78484
13900 78484 -82164 -109451 80399 91155 203550 296722 279251 98938 -66469 -137190 -146413
13889 -146413 -222795 -277448 -215148 -224013 -173283 -165443 -249807 -161865 -37117 56009 145660 -10910
13877a0910P6160O5885q7290j47018R4993J03374j46051j28181O9121M9215k0213
13866h0915l5903O7939k0639o859K1471m1413j43908j09206M3755J6463K6523
13855b62692n3843J35607J33079J6588J00364j8399j70487j5733n4300k9084k327
13844b21227N3525k6270K7660J63772Q8626J10440J4455k93272k357o9804p7501
13833b31953K01236n0850q3147n3085J2259J29169n77R2082j24866m0250k4533
13822a74515J67929M0999J0701o1216n820q1061M4994j22047L1856J64974J17090
13811A33884o1903q8032L4670Q9461O8347N459j6388k2709P5832j15112j72771
13800f9262P0953L2093j54579q7812J14521K8110j41205p0136J88328J59440k5924
$$ plain form
13877 -10910 65250 131135 43845 -103173 -8180 95194 -50857 -179038 -109917 -60702 -80915
13866 -80915 -116818 -48879 -69518 -76377 -54906 -96319 -240227 -349433 -305678 -289215 -262692
13855 -262692 -316535 -180928 -47849 -31261 69103 50704 -119783 -135516 -189816 -218900 -221227
13844 -221227 -167702 -193972 -166312 -2540 86086 196526 210981 -82291 -84648 -154452 -231953
13833 -231953 -30717 -81567 -164714 -217799 -205540 -76371 -76948 15134 -109732 -149982 -174515
13822 -174515 -6586 34413 45114 -16102 -21922 -102983 -57989 -180036 -148180 16794 133884
13811 133884 71981 -16051 18619 108080 176427 181886 165498 142789 218621 103509 -69262
13800 -69262 1691 33784 -120795 -208607 -94086 -65976 -207181 -277317 -88989 70451 44527
13789D4527L6213j7442l6243l5802j22054R0975N3922m4204J1177r5276m8420
13778a62627o9283J02684M6488J18367j44964k99589j4376J23483K25366K41527
13768A67076m8633j47581M3175J57553L1050K6054q7846j01575q0070J3837m0819
13757f7779q1179q2789K20606J29588N9950J72601J246j98905K1883j20195r0488
13746c5461r8811R7008J63296O5648o539j47851r2882n6280J02957M2473Q7277
13735A20835Q1354o2646L897j38592j00125m5422K18389K9838K8148J77370l5393
13724B77653l3713j13711L348k7891L325O2555J00684l7655J6292j11443j89157
13713d9713p1894p2116k4315J00398N3014L5860J36264J97648j39548r0380n3581
$$ plain form
13789 44527 80740 63298 27055 -8747 -130801 -39826 14096 -30108 -18931 -114207 -162627
13778 -162627 -231910 -129226 -82738 35629 -109335 -408924 -423300 -299817 -74451 167076
13768 167076 118443 -29138 14037 171590 202640 228694 140848 39273 -40797 -26960 -67779
13757 -67779 -148958 -231747 -11141 118447 178397 350998 352244 153339 175222 55027 -35461
13746 -35461 -134272 -37264 126032 191680 185141 37290 -55592 -111872 -8915 33558 120835
13735 120835 202189 139543 143440 4848 -95277 -140699 77690 107528 135676 313046 277653
13724 277653 243940 130229 133577 105686 109011 171566 272250 234595 250887 139444 -49713
13713 -49713 -121607 -193723 -218038 -117640 -64626 -28766 107498 305146 165598 75218 21637
13702B1637J668J8079m9253J9944m2585m6526P62j48448j69485o1039J01166K90039
13690f4041J7910j69932L4828L793m2301J7613O9855K8033j08653j02464j1275
13679c26634P1937R3678K21140K571k3623J8276J31934K11627n6002k14890j91861
13668f1847O000L2954P06r8621R7710j0728j11644k4328J75300K4383k23677R3279
13656a00513M30282J8325k48536l9325J1939Q8872J34815j31685l2880j00594
13646C0700N8638q9534j64552o8398K91801P7830j90307k42622j07902L4964O8214
13635c01168K490j8844K5719J58422J30450O7809n6065l123Q7557p2947q0656
13624f0356J39465j9165j7181N1587J49762j65703j33370R8694J05440o9905k1615
$$ plain form
13702 21637 23305 41384 -7869 12075 -30510 -77036 -76274 -224722 -394207 -455246 -354080 -64041
13690 -64041 -46131 -216063 -181235 -177442 -219743 -202130 -132275 -104242 -212895 -315359 -326634
13679 -326634 -254697 -161019 60121 62692 39069 57345 189279 400906 344904 130014 -61847
13668 -61847 -55847 -22893 -22187 -120808 -23098 -33826 -145470 -169798 5502 29885 -193792 -100513
13656 -100513 329769 348094 99558 60233 72172 161044 295859 164174 131294 30700
13646 30700 89338 -196 -164748 -233146 58655 136485 -53822 -296444 -404346 -369382 -301168
13635 -301168 -298678 -317522 -291803 -133381 -2931 64878 8813 5690 93247 20300 -60356
13624 -60356 79109 59944 42763 94350 244112 78409 -54961 43733 149173 79268 57653
13613E7653P2237N2575J79378q7909k65271j20058k0268J06767K5314J7381j3634
13602D165o4130M170R575J17881j10964l46421O6741J90401J11748P5105o2351
13591d080M3880k6630l2739R3855o1095P9238n6697k59390j83104K70344J87586
13580E1168k37749N1867Q0905J62433n1969L1029k0204j45937j30471J20297P5183
13569a3448N5922J34306k5235N6790j16357n1527j88701j69821j0415R5136J38742
13558i4608m7392R2355p0819K39291J64549j06655k91626j40437L0954N7033M1872
13547a25483P687K8205k3745J14583N0660l3316j59757p3104K873J5617J12324
13536h3456r939J41913N0311l0484r5983Q929o7880J39551K1296j23211j09132
$$ plain form
13613 57653 129890 182465 361843 273934 8663 -111395 -131663 -24896 418 17799 4165
13602 4165 -59965 -55795 -46220 71661 -39303 -385724 -318983 -128582 -16834 58271 -4080
13591 -4080 39800 13170 -19569 74286 13191 92429 35732 -223658 -406762 -136418 51168
13580 51168 -186581 -134714 -53809 108624 56655 87684 67480 -78457 -208928 -88631 -13448
13569 -13448 42474 176780 151545 208335 91978 40451 -148250 -318071 -328486 -233350 -94608
13558 -94608 -142000 -49645 -120464 118827 283376 176721 -114905 -255342 -224388 -167355 -125483
13547 -125483 -117796 -89591 -113336 1247 51907 18591 -141166 -214270 -211397 -195780 -83456
13536 -83456 -93395 48518 98829 68345 -27638 -18709 -86589 52962 74258 -48953 -158085
13525a58085o5808p321R6310p3346J14210J11671k18311k32362L5580L22333J60086
13514H4957n2931j0561j56232j44666O8597k4163L9025J10708J36129r7717j86415
13503b33269j8435J29062L0157J5893J6201L7404j48889n1366J14882q9052j01039
13492b98451j50275m3272k7501J33969j999Q8100L05406J05296L4450m2103j92352
13481h8732n1434J52788J01796O6156q7870m0625M3505j28085j39230m0350O3306
13470a48775P0788N9342P2035n2585j3875j13649o8966J91809k2096o9490L8486
13459e6976J5056r1759o144Q2514K4432P9463L9439K2436K7440J1071M9159N9832
13447B55963Q3806j33163o0165J104O2521K1732j26934j2192Q2661O466j42132
$$ plain form
13525 -158085 -223893 -231214 -134904 -208250 -94040 17631 -200680 -433042 -397462 -75129 84957
13514 84957 32026 21465 -134767 -279433 -210836 -234999 -195974 -85266 50863 -46854 -233269
13503 -233269 -251704 -122642 -92485 -76592 -60391 -22987 -171876 -223242 -108360 -197412 -298451
13492 -298451 -448726 -491998 -519499 -385530 -387529 -299429 5977 111273 145723 103620 -88732
13481 -88732 -140166 12622 114418 180574 92704 52079 95584 -32501 -171731 -212081 -148775
13470 -148775 -77987 -18645 53390 805 -13070 -126719 -195685 -3876 -25972 -95462 -56976
13459 -56976 -41920 -133679 -139823 -57309 -32877 46586 86025 108461 135901 146972 196131 255963
13447 255963 339769 206606 146441 147545 210066 231798 104864 92672 175333 181799 39667
13436C9667L40O5849j08273r240L6474j23918j75897K592Q9089r357J1106J40454
13424d1114J47745j30037j88763R0915q8500m4422J19449o7825J69389K06372
13414A73209K635j00546J6965J69889m5286j16670J49975L1343k4614l3458j4263
13403B09179o4766M382m3690j68237N0304J3126q969l0588j67030k8771l9590
13392b74650J35717K38752J05626l0942l5582M1440O0281k2776j94296k14366
13382a90796J7534K07781Q7132j01775M777Q37j09577j36135J44395K10800M352
13371A39325j47917q6470P2902Q5753N9033J02096J42187o1525j71072q6578p9608
13360c1874N771l4176J1964R6592P1782J44412J60347j25715j55405q1567n3682
$$ plain form
13436 39667 40007 105856 -2417 -11657 24817 -99101 -274998 -272406 -183317 -192674 -181568 -41114
13424 -41114 106631 -23406 -212169 -121254 -209754 -254176 -134727 -202552 -33163 173209
13414 173209 175844 75298 92263 262152 216866 100196 250171 281514 256900 223442 209179
13403 209179 144413 148795 105105 -63132 -12828 298 -8671 -39259 -206289 -235060 -274650
13392 -274650 -138933 99819 205445 174503 138921 180361 240642 217866 23570 -190796
13382 -190796 -173262 34519 121651 19876 24653 25490 -84087 -220222 -75827 134973 139325
13371 139325 -8592 -95062 -22160 63593 122626 224722 366909 305384 134312 47734 -31874
13360 -31874 -26103 -60279 -48315 48277 120059 264471 424818 299103 143698 62131 8449
13349H449o6618o6547j02795J39558j5689k5520J09854Q3431Q8507O353j26790
13338C2193j22864R3520L6445n1972K0762j26362j16123m2433J92438J6376k46578
13327c14598k35403K12151J02342P5275l255p8765R1403J18422q7926j55163J13203
13316a62314j19990n447Q6077K67140R9109j1101o5372q6700r316r3831j8486
13305a20231q2576J13606j25449q2415J67995O8371P4045n7022K5016r6471j5902
13294a31033o3869j42772r8327Q6425L0668K15481Q7672J01363J3897j29956J18056
13283H7605O6099r3366j7191R9905N7332j20317L0014l9432L0714L6898M9148
13272A87409r8093L1014k18670k86832q158k0388J41716K16067O9676K1501P4560
$$ plain form
13349 8449 -58169 -124716 -227511 -87953 -103642 -129162 -19308 64123 152630 158983 32193
13338 32193 -90671 2849 39294 -12678 8084 -118278 -234401 -276834 -84396 -68020 -314598
13327 -314598 -550001 -337850 -235508 -160233 -163488 -242253 -150850 -32428 -120354 -275517 -162314
13316 -162314 -282304 -287751 -201674 65466 164575 153474 88102 1402 -7914 -101745 -120231
13305 -120231 -202807 -89201 -214650 -297065 -129070 -60699 13346 -43676 -18660 -115131 -131033
13294 -131033 -194902 -337674 -436001 -349576 -318908 -103427 -15755 85608 99505 -30451 87605
13283 87605 153704 60338 43147 143052 200384 80067 110081 70649 101363 138261 187409
13272 187409 89316 120330 -98340 -385172 -393330 -413718 -272002 -55935 13741 35242 109802
13261A09802J04199j60357k67349o8138k4247p170J55151J51100k607k48803r9830
13250c58249J77066O4989l8802k8555n7090J13853J94529Q1933p4557r4447r7715
13239a17045m0085n870j4134k4449J50642p9342k1192J31084J77158j01209r4469
13228c8911j15508j41856J50208k9066p2534N9570k579J70812J03114K29977n1050
13217B62177o2885m9764K43432l2997j47918j82598J6451J53957J6569j290j9290
13206A95844m6642r1570J0235J10989k0247l8353j7519k1397P5675n6911j51984
13195e1880J12392N6099k67603l0231J13410J5566l9340j11636J64637l851J71500
13184A29063J51697j29757j16250K1850j39245r3432O9287L2603p1203R9698o8154
$$ plain form
13261 109802 214001 53644 -213705 -281843 -306090 -313260 -158109 -7009 -9616 -258419 -358249
13250 -358249 -181183 -116194 -154996 -183551 -240641 -126788 67741 149674 75117 -19330 -117045
13239 -117045 -157130 -163000 -177134 -201583 -50941 -130283 -151475 -20391 156767 55558 -38911
13228 -38911 -154419 -296275 -146067 -175133 -247667 -188097 -190676 -19864 83250 313227 262177
13217 262177 199292 149528 392960 359963 212045 29447 45898 199855 216424 215134 195844
13206 195844 149202 57632 67867 178856 158609 120256 102737 81340 157015 100104 -51880
13195 -51880 60512 116611 -150992 -181223 -67813 -52247 -91587 -203223 -38586 -42437 129063
13184 129063 280760 151003 34753 56603 -82642 -176074 -106787 -74184 -145387 -45689 -113843
13173a13843r2950P7300P0217l2727J41257N4395l7231j97934r6334J00159N4913
13162g2778J07614p3456Q06k08642L3829J26387M5853n667P1697J3868o9047j05664
13150a35200P0950o8874j7029k0806J29031J34782r281k857j01917j92477o5948
13139b79626Q9504l8025N5646J51759J54610J15332q5388k04380J08875R2359
13129A60666K7065p0340k611P2613j3030J34548k4016J8453M1007j2284o6154
13118B65917j60433j01406r5360m6624J66712j47681k8740O944J62510J52153
13108A73992J8959r3728L4755q5209J4290r2535j68900o3675K20259J10652j10349
13097d1489j34720L3132K73203J99053o7756l3982r0283o7990p4479j2870O7041
$$ plain form
13173 -113843 -206793 -129493 -59276 -92003 49254 103649 66418 -131516 -227850 -127691 -72778
13162 -72778 34836 -38620 -37814 -246456 -212627 -86240 -40387 -46054 25643 39511 -29536 -135200
13150 -135200 -64250 -133124 -150153 -170959 -41928 92854 83573 80716 -21201 -213678 -279626
13139 -279626 -190122 -228147 -172501 -20742 133868 249200 163812 -40568 68307 160666
13129 160666 187731 117391 114780 187393 174363 308911 284895 303348 344355 332071 265917
13118 265917 105484 4078 -91282 -137906 28806 -118875 -147615 -140671 21839 173992
13108 173992 192951 99223 133978 48769 63059 -29476 -198376 -262051 -41792 68860 -41489
13097 -41489 -176209 -143077 130126 329179 261423 227441 137158 69168 -5311 -18181 48860
13086D8860O9519n3602k51965j7351J61656l4240j60751J2491J9360K28264J08616
13075A30857j04469k770J0698j0418L0214q2255j07119j38755l7909J43859J69246
13064A179o5033j7486p3386m2011j4175M5451M9671O7736N0774l6681j36805j01897
13052b72663J38720R6460Q351J45634J53821q1153j33388p6910J29031m53j13059
13041e609O474l830q9636j2365j51906J43211K02554N3599P3836m9424j19935
13030D6969k1968O1618l3961j7836Q014l3991N4691j08899m6628j95852J51464
13019a36379J46097J3291J3051J269p3416k6183J47503J10364p1312j1519j5675
13008I7091K2026R9809p1734m9797q5789J36766O156J64226l9914k17958j47578
$$ plain form
13086 48860 118379 64777 -187188 -204539 -42883 -77123 -237874 -225383 -206023 22241 130857
13075 130857 26388 23618 34316 23898 54112 -28143 -135262 -274017 -311926 -168067 1179
13064 1179 -63854 -81340 -154726 -196737 -210912 -165461 -115790 -48054 2720 -33961 -170766 -272663
13052 -272663 -133943 -37483 -29132 116502 270323 189170 55782 -21128 107903 107450 -5609
13041 -5609 865 -2965 -92601 -104966 -256872 -113661 88893 142492 216328 166904 46969
13030 46969 25001 86619 52658 34822 42836 8845 63536 -45363 -91991 -287843 -136379
13019 -136379 9718 23009 36060 37329 -36087 -62270 85233 195597 124285 112766 97091
13008 97091 119117 218926 147192 97395 11606 148372 154528 318754 278840 60882 -86696
12997h6696l0932J12629n063J07708R3272l8890j83011j67842Q0309R5109J43105
12986A19698l8801J2245m1404j45299j09636P8265J09058K05964L7870p1860j7131
12975A38969M9165K33377r6001k5932N164R581j14422j87609m0086Q9007M7694
12964A08907n7465j61308J9087O559J5038j49785j06992L5786K50208k2879J4742
12953d8102J48079j29528k88829o5000M0279n7263m0909J3544J85944J62807M0819
12942c8159j66603j02334J53221L8541P8741n1363j06320K2713J2580J65228J14227
12931A20472J43354K1865j06193m8919m0342k47260L240K68338r0534j26527l481
12920a05987j28429J40133J33013J5972j49331L5419k13111j6723Q8176P4804
$$ plain form
12997 -86696 -117628 -4999 -10062 97646 190918 152028 -30983 -198825 -118516 -23407 119698
12986 119698 80897 93142 51738 -93561 -203197 -124932 -15874 190090 227960 156100 138969
12975 138969 188134 421511 325510 299578 304742 314323 199901 12292 -27794 61213 108907
12964 108907 51442 -109866 -90779 -84220 -69182 -218967 -325959 -290173 -39965 -62844 -48102
12953 -48102 99977 -29551 -318380 -383380 -343101 -400364 -441273 -427729 -241785 -78978 -38159
12942 -38159 -204762 -307096 -153875 -115334 -36593 -87956 -194276 -171563 -158983 6245 120472
12931 120472 263826 285691 179498 130579 90237 -157023 -153783 114555 24021 -102506 -105987
12920 -105987 -234416 -94283 38730 54702 -94629 -59210 -272321 -289044 -200868 -126064
12910a26064J69645R0102j39412j94125j98362K7192J07017P2418J08727J68184
12900H5322J8782q7158k49502J29252J46783r9707p8826N3400J49264K9440K6124
12889A23174p8511J84668m9315j38446o0316j02325q6330j3093Q8813j19113q2928
12878c33722J17346k5687K02952J91769J24699j08925j1029j51802o3483N2229
12868e653J65613n1110m074j88260K9448R3976M9152J77972q9067j62638j51935
12857a36576m8849P3082J51776K17207j62j10753J7915l4176J02853J4800j02187
12846A44930j87762j0578k7749R6640J03974O6269j94035k0971n1022J36959R4778
12835A51433k44197j69368L9857N2488K4512J53075J59855j53865N2285L5017
$$ plain form
12910 -126064 43581 133683 -5729 -199854 -398216 -371024 -264007 -191589 -82862 85322
12900 85322 104104 16946 -232556 -103304 43479 -56228 -135054 -81654 67610 97050 123174
12889 123174 44663 229331 180016 41570 -18746 -121071 -207401 -220494 -131681 -250794 -333722
12878 -333722 -216376 -242063 -39111 152658 277357 168432 157403 5601 -57882 -5653
12868 -5653 159960 108850 104776 -83484 -54036 39940 89092 267064 177997 15359 -136576
12857 -136576 -185425 -112343 39433 256640 256478 145725 163640 129464 232317 247117 144930
12846 144930 -42832 -53410 -81159 15481 119455 185724 -8311 -29282 -80304 56655 151433
12835 151433 -92764 -262132 -222275 -169787 -145275 7800 167655 13790 66075 101092
12825A01092m9519Q7770N1885Q012p341j0630j68686q0865l3913J61697L3135
12814I2637q5744j04100M1794p7713j43513o4189M8649J23507J28558R1363q8334
12803c7085n872N3876k3430j78024o3341R0651J20878j4588k805Q5727L485k6525
12791B947q6174o630J14992J93711p6592J0478J49093P1895l019k3522k3507L4846
12779C58518q1713q9016j17887P4675r3866j1809p555L02602J19998j36612j32774
12768A84561j55203r9796O5627r6069L8202J20969o5697k27705k2770J39217j2539
12757a31203q7849m3152J51795j5932k6944o9745j2060M6698J44812J52405r6571
12746A2254j89743J612J88659n6016l7793J14337K0998q5209q5223q3193L6208
$$ plain form
12825 101092 51573 139343 191228 199240 191899 181269 12583 -68282 -102195 59502 92637
12814 92637 6893 -97207 -55413 -133126 -276639 -340828 -292179 -168672 -40114 51249 -37085
12803 -37085 -42957 10919 -12511 -190535 -253876 -163225 -42347 -56935 -59740 25987 29472 2947
12791 2947 -83227 -89857 25135 218846 142254 152732 301825 373720 370701 347179 323672 358518
12779 358518 276805 187789 69902 144577 50711 38902 31347 333949 453947 317335 184561
12768 184561 29358 -70438 -4811 -100880 -62678 58291 -7406 -235111 -257881 -118664 -131203
12757 -131203 -219052 -262204 -110409 -126341 -153285 -223030 -235090 -188392 -43580 108825 12254
12746 12254 -177489 -175877 12782 -43234 -81027 33310 54308 -30901 -116124 -199317 -163109
12735a63109J8436J49105k5953k3649J20169n2370j14542l8223Q0783J15462j21586
12724e5477K1806O0883L6872P0090L4944l8092q9831j35523M6877J5749o4410
12713i6112Q3627N5312j34434m4049n1292k3039j21651K40062K63334L0921j0418
12702A92261j14458m543m6690j23542j26170J4576J81240L0278p1244Q2046j948
12691A1806j01799j74710K7307K03366R496k1512O2213j0506q1185M6476K29676
12680B00628J39515k54157k04658m1137n724J10236l0683j46124q9245N0815J32203
12669a38331K6002M3702n6820K09099R5259J3160r1316m2463j54407n6885J53318
12658C18l1126q0692l5661M8283J40406k795N0073r7781k5134O9394Q3193j23150
$$ plain form
12735 -163109 -144673 4432 -21521 -45170 74999 22629 -91913 -130136 -49353 66109 -55477
12724 -55477 -33671 27212 64084 134174 169118 131026 41195 -94328 -47451 -31702 -96112
12713 -96112 -12485 42827 -91607 -135656 -186948 -209987 -331638 -91576 171758 202679 192261
12702 192261 77803 73260 26570 -96972 -223142 -208566 -27326 2952 -68292 13754 11806
12691 11806 -89993 -264703 -237396 -34030 -24534 -46046 16167 5661 -75524 -29048 200628
12680 200628 340143 85986 -118672 -159809 -165533 -55297 -85980 -232104 -321349 -270534 -138331
12669 -138331 -112329 -68627 -125447 83652 178911 192071 100755 58292 -96115 -153000 318
12658 318 -30808 -111500 -147161 -98878 41528 38733 88806 -8975 -34109 35285 118478 -4672
12646d672p1528o8049r8936O4863P7442P2047L8984L0472J20323p4742l0196J27495
12634A83503O1013j08135p1102Q2323Q7070j15673p8279o8538R0555l8492J58146
12623A82391q1645n3703m990M0050L1092j4162o3703n4943J94919L6471P871n8245
12611A61403n3158j43803j89526k03407J5825L8003J67497K24902l1079q5813
12601i9156N0177N0328q0687j23895J8089N2498q5899n1112M2136Q1999J41743
12590c779N8821Q7774m8251j39926o5540J7055J17661J65995l7700k48050L8090
12579e7850J07712J27525j317o6180J08270j22784J6879N9628N9868j39085j00083
12568g417M8627P9014j17596P2194Q6361j2053n3556o7079k3082r3063R6547j46589
$$ plain form
12646 -4672 -76200 -144249 -243185 -178322 -100880 -28833 10151 40623 160946 86204 56008 183503
12634 183503 244516 136381 65279 147602 234672 118999 40720 -27818 62737 24245 182391
12623 182391 100746 47043 42053 82103 113195 99033 35330 -19613 175306 211777 219648 161403
12611 161403 108245 -35558 -225084 -428491 -412666 -374663 -207166 17736 -13343 -99156
12601 -99156 -48979 1349 -79338 -203233 -185144 -132646 -218545 -269657 -227521 -145522 -3779
12590 -3779 55042 142816 94565 -45361 -110901 -93846 23815 189810 152110 -95940 -57850
12579 -57850 49862 177387 176070 109890 218160 95376 112255 171883 231751 92666 -7417
12568 -7417 41210 120224 2628 74822 161183 149130 95574 28495 5413 -87650 8897 -137692
12556a37692p1982j26235J72256R6556p5835K678N0629K6957n5878L8369J35662
12545E5485N6950J00962n7169k6578q1037J05321K6924l6546r179J241J67437
12534C03811J85325j24301k49015j16152q1166J14467O652K1129M0498o6374j2051
12523B2823j47j89773m2960N3407M6596K09433m5900p3194N1757k4132j68131
12512a60221j5858N6605J06617L6731l7943j1306j31432J3425K7264J09944j17652
12501a23826j44631O7975J11565q6529o9291j12513K0120J03295J76473j42402
12491a99764j30574J26813J94491n6847j71440l7712J40078L9866p0409m0951
12481b06449J43636O4836j7044j33908O9461P723M0654Q9956l9329j23068R5077
$$ plain form
12556 -137692 -209674 -335909 -163653 -67097 -142932 -140254 -89625 -62668 -118546 -80177 55485
12545 55485 112435 213397 156228 129650 48613 153934 180858 144312 135133 136374 303811
12534 303811 489136 364835 115820 -332 -81498 32969 39621 60750 101248 34874 22823
12523 22823 22676 -167097 -210057 -156650 -110054 99379 53479 -19715 32042 7910 -160221
12512 -160221 -176079 -119474 -12857 23874 -14069 -25375 -156807 -143382 -116118 -6174 -123826
12501 -123826 -268457 -200482 -88917 -175446 -244737 -357250 -337130 -233835 -57362 -199764
12491 -199764 -330338 -203525 -9034 -65881 -237321 -275033 -134955 -95089 -165498 -206449
12481 -206449 -62813 2023 -15021 -148929 -79468 -71745 -31091 58865 19536 -103532 -8455
12470h455n7217J7007O1844J96413K3412k34392r5499n7876M1765R681L5380o9302
12458a37239M2964m5145j33857P3843R9272J21394J18893n6777p914R1429o9883
12447I6980M6365p0655L2131J38794k18802j63381J5107n1596j3511o846K0507
12436a74907O8112J30706P8882j15961j14629j2862J62213L26912M4931j35745
12426B57652j79255q1815k8604r0969m055J5175l2781J04621o9799p2554o3292
12415b45676O3333K66453J36589l7169j00953k20878j19006J73578J27435o1666
12405a7960r5275L9819J48474r317N807j39046j67408J08787J44007R6508N0643
12394A65039j84848j02988Q9488Q4587L4791j89127j8811r988r2928k1158K382
$$ plain form
12470 -8455 -65672 -48665 13179 209592 233004 -1388 -96887 -154763 -112998 -103317 -67937 -137239
12458 -137239 -94275 -139420 -273277 -199434 -100162 21232 140125 83348 75434 166863 96980
12447 96980 143345 72690 104821 243615 24813 -138568 -123461 -175057 -188568 -195414 -174907
12436 -174907 -106795 23911 102793 -13168 -127797 -140659 21554 348466 393397 257652
12426 257652 78397 -3418 -32022 -122991 -127046 -111871 -144652 -40031 -109830 -182384 -245676
12415 -245676 -182343 84110 220699 183530 82577 -138301 -257307 -83729 43706 -17960
12405 -17960 -113235 -73416 75058 65741 71548 -67498 -234906 -126119 17888 114396 165039
12394 165039 -19809 -122797 -33309 51278 86069 -103058 -121869 -131857 -224785 -245943 -243561
12383b43561K04789J51152o9538j18169J7878O3089n985j26358K3731m8496k9904
12372a81372p396J40247P1878o4626j17364J0116P4171J31523O041m5611J04881
12361A22488l464m4459R0218k1836j67071r6290o1031R0668O3774J04579k4168
12350E3408o9160l0370j04556M4129O9623J44Q591j9751O4665m2133j16146m0093
12338a81649O0721j5944K6224o1912J49006j2874j31345J60007l6124J47332J26621
12327B30063k60023j42438Q9650N6743p9733j55097J90598k2701R6781P8126J11563
12316A93532L8102q1957K0598J13108q4734q1819R00j68755K3502R431Q583J21848
12304A12339N1014K6371k1000p6082j74830J02617R7365j98960j59184K12342
$$ plain form
12383 -243561 -38772 112380 42842 -75327 -57449 5640 -345 -126703 -102972 -151468 -181372
12372 -181372 -188768 -48521 23357 -41269 -158633 -148517 -74346 57177 63218 17607 122488
12361 122488 119024 74565 164783 142947 -24124 -120414 -181445 -90777 -27003 77576 53408
12350 53408 -15752 -46122 -150678 -106549 -36926 -36782 -28191 -47942 16723 -25410 -141556 -181649
12338 -181649 -120928 -136872 -110648 -172560 -23554 -36428 -167773 -7766 -43890 103442 230063
12327 230063 -29960 -172398 -82748 -26005 -105738 -260835 -70237 -92938 3843 81969 193532
12316 193532 231634 149677 170275 283383 198649 116830 117730 -51025 -27523 -18092 -9509 112339
12304 112339 163353 189724 168724 92642 -82188 20429 117794 -81166 -240350 -28008
12294b8008P7180j17602n5525N8829Q2325J65870M8471p1293j34534j59076K3978
12283a09385J99903j5241j10327j21638L7169J6681M8678K0237N2300J73556O622
12272A98555k74641j22419R5156J2726R0872Q4662P902j15393N188m3604j13186
12261a74182J58919K63459O835j72431r8308k4090L0052R378J10398K186k05507
12250i3291J746J06713n1946m6176P2863K0672R2140l0730N9943p0212o6844q2404
12238h7526N2369m7737R9827Q189k3213k4364K8009K4132m6139J8924Q5573q2203
12226E841K5447J44184L7088l6221l2947R7848K1822j88735L5645J00100k8065
12215A82007K9601J1998k9912O329n0632l1400k8912n6479N6205K4884p7997p6046
$$ plain form
12294 -28008 49172 -68430 -123955 -65126 17199 183069 231540 160247 25713 -133363 -109385
12283 -109385 90518 75277 -35050 -156688 -119519 -102838 -54160 -33923 18377 191933 198555
12272 198555 -76086 -198505 -103349 -90623 249 84911 92813 -22580 -17392 -60996 -174182
12261 -174182 -15263 248196 255031 82600 -15708 -39798 -9746 -368 110030 112216 -93291
12250 -93291 -91545 15168 -36778 -82954 -10091 10581 102721 71991 131934 61722 -5122 -87526
12238 -87526 -35157 -82894 16933 25122 1909 -22455 5554 29686 -16453 2471 88044 5841
12226 5841 31288 175472 212560 176339 143392 241240 263062 74327 109972 210072 182007
12215 182007 211608 223606 193694 200023 149391 117991 89079 32600 88805 113689 35692 -40354
12203d0354M1527n6490j21339L6020L1913l7123j1842K1416J47523Q4863J39474
12192B35588m5551k18602N7429J39552Q3295j4579m2932l7116p1771M046k5544
12181F3815N7222j1995k30817j03024j12759k5305L0951J11673R2366R6461O2760
12170C1348L3674m2991J54277J1466M3696q313k1385L9645J1791J960m9733n8008
12158A47427n9060J14755J15696J03196K2514j53166k4989P4621N6801q6692j49538
12147A61565n7604J527O6063r0289j85362J06320J69840k9584J45328J35362R7199
12136E20365p9545j30976j91053j18378r8046J01091Q9377q6854k9043n7538r3937
12125a74537k7009R9636J97685j38182o8135j25783n1237P5094J86251N8778K2062
$$ plain form
12203 -40354 1173 -55317 -176656 -140636 -108723 -145846 -157688 -136272 11251 96114 235588
12192 235588 190037 -28565 28864 168416 251711 237132 194200 157084 85313 89359 63815
12181 63815 121037 109042 -121775 -224799 -337558 -362863 -331912 -220239 -127873 -31412 31348
12170 31348 65022 22031 176308 187774 231470 223157 201772 241417 253208 255168 205435 147427
12158 147427 88367 203122 318818 422014 444528 291362 266373 340994 397795 311103 161565
12147 161565 103961 105488 171551 81262 -104100 2220 172060 142476 287804 423166 520365
12136 520365 440820 309844 118791 413 -97633 3458 92835 5981 -23062 -80600 -174537
12125 -174537 -201546 -101910 95775 -42407 -110542 -236325 -287562 -212468 -26217 32561 54623
12114E4623K8614J72216L6602k260o4869j11779o9166j30044j7741P5259J44785
12103A16240j5707k05363o0778J18429J29834j81975k23209O6301J59460j81648
12093b78416j49907p983j71284l5328J35598J09730J68035Q3565Q8684J84375
12083A27069J71448n626j05597j83234K3583l2957O7417j4163M0842j1604r4100
12072a6922R3254J3147J52752j04167j29970J41076J09535K0755k64901R5089
12062A09648O2802p010J12409j8480L0792P8626q2583m5921p9828n4118n4911
12051E1426K380j47747Q2373J57031m976J52975r652L471k6327Q6911K02599n7529
12039D92935J0483J24752r6090L977R1423Q3843p5366M1802K65167L25158M89585
$$ plain form
12114 54623 83237 255453 292055 289795 224926 113147 43981 -86063 -103804 -28545 116240
12103 116240 100533 -104830 -165608 -47179 82655 -99320 -322529 -256228 -96768 -278416
12093 -278416 -428323 -436306 -607590 -642918 -507320 -397590 -229555 -145990 -57306 127069
12083 127069 298517 292891 187294 4060 27643 -5314 62103 47940 88782 77178 -16922
12072 -16922 76332 89479 242231 138064 8094 149170 258705 279460 14559 109648
12062 109648 172450 165440 277849 259369 290161 368787 286204 240283 160455 106337 51426
12051 51426 53806 -93941 -11568 145463 140487 293462 283810 287281 260954 347865 550464 492935
12039 492935 503418 628170 532080 536057 627480 711323 635957 677759 942926 1268084 1757669
12028A757669N06898M68010J47589m4963j46207l93408m68365l19265k35805k87452
12018I84701m7114m3569k69729j61779N5701J32073n9090k25364m7400J32846
12008D51276M5312P2243j3642j6686O0589r5394o9541J43223O5785P0233L7100
11997G50498o1572q3718k7509p9658N4075J11189N0373p763L2932P2929J07844
11986I19620o7092m1662q142k62967j39294n561K24910n7963j37877k1338J87536
11975E90170R5489L0468M017o087J05598K9678M7916j30555j26310m2630J76821
11964G74575m0358j54955P0786N5403j0286Q950J33656Q44m5188J8462j00751
11953G11138j61787M7966K29598P2024J99775j16427P1208J64816K10482J52905
$$ plain form
12028 1757669 2264567 2732577 2880166 2835203 2688996 2295588 1827223 1507958 1272153 984701
12018 984701 937587 894018 624289 462510 518211 650284 591194 365830 318430 451276
12008 451276 496588 568831 555189 538503 599092 503698 434157 577380 643165 713398 750498
11997 750498 688926 605208 577699 498041 552116 663305 713678 705915 738847 811776 919620
11986 919620 852528 810866 802724 539757 400463 394902 619812 561849 423972 402634 590170
11975 590170 685659 716127 720144 714057 819655 849333 897249 766694 640384 597754 774575
11964 774575 734217 579262 650048 705451 695165 704115 837771 838615 793427 811889 711138
11953 711138 549351 597317 826915 898939 1098714 982287 1053495 1218311 1428793 1581698
11943A581698o4480K7291Q8225l6371R920K18062J79447Q3585K4585R2392P5422
11932B279776l4300J68224J92921J48634J75112K26273N1162J37650L31796K57684
11922C934932M02649M03356N65472P45286N79796P31198J032653J296838J555970
11913A1248150J771855K087453K748791L638105M933521O914853J0428938J6127416
11905E9899082K6362480M1410591N2965127M7369261K9207644K1017969J8728021
11898B96960175N108447k9587742o3010544o0617592m0092211k4168886j5600301
11891F8991346j0420154p453458n724989m217617l322665k861674k455878k071955
11883C0462956j736696j781759j379932j261726q76336j033057r66048p99329
$$ plain form
11943 1581698 1517218 1544509 1632734 1596363 1606283 1824345 2003792 2087377 2111962 2204354 2279776
11932 2279776 2245476 2413700 2606621 2755255 2930367 3156640 3207802 3345452 3677248 3934932
11922 3934932 4337581 4740937 5306409 6051695 6631491 7362689 8395342 9692180 11248150
11913 11248150 13020005 15107458 17856249 21494354 26427875 33342728 43771666 59899082
11905 59899082 86261562 127672153 180637280 228006541 257214185 278232154 296960175
11898 296960175 302068622 272480880 209470336 148852744 108760533 84591647 68991346
11891 68991346 58571192 51117734 45392745 41175128 37852463 34990789 32534911 30462956
11883 30462956 28726260 26944501 25564569 24302843 23426507 22393450 21427402 20628073
11875B0628073o13488q32309p12946n45396l56001o14040o03262n85433m93921
11866A5271277l71341k58501l32301k80570l34974l73278m12872l49232k31981
11857A2326227j57995l96536k26242j80452n00903n55393m73295n06479m43938
11848H884994j38811l12595k66117r6424m33057n09509k90181j66940j50277j88045
11838F333038j9853o0299k8831m2792k15981k69618r6522k17047j51996j89488
11828E040611l13554q7532n1914l16665K2793M4666J51746j26752l02472j97325
11818C863602r6631n0250o230m5360q5398j85773n9915p5454k9172q1906n9882
11807C087631J25245j02356q5190m1460j12165n4276n1427j88821j52840j3704
$$ plain form
11875 20628073 20014585 19182276 18469330 17923934 17567933 16953893 16350631 15765198 15271277
11866 15271277 14899936 14641435 14309134 14028564 13693590 13320312 12907440 12558208 12326227
11857 12326227 12168232 11771696 11545454 11365002 10864099 10308706 9835411 9328932 8884994
11848 8884994 8746183 8433588 8167471 8071047 7637990 7128481 6838300 6671360 6521083 6333038
11838 6333038 6313185 6252886 6224055 6181263 5965282 5695664 5599142 5382095 5230099 5040611
11828 5040611 4727057 4639525 4587611 4270946 4293739 4338405 4490151 4363399 4060927 3863602
11818 3863602 3766971 3716721 3710491 3665131 3579733 3393960 3334045 3258591 3229419 3147513 3087631
11807 3087631 3212876 3110520 3025330 2983870 2871705 2817429 2766002 2577181 2424341 2410637
11797B410637o5711l1226k6871O907M0897j916q0031j58415j18757R8817N8200
11786B132531L5278K9493J5596J32817n6947j11672P2166J10826J33352J86445
11776B679885J05453L11519K45030K82925K23218N7604l8720l7725j45075l13422
11766C370692m72427l20775k50440k19565j99323j29547k9218N5720k5904O5664
11756A844877j4519j05704K3042j38852q8846j80711k99542P5811M4175j72845
11746I86886K30895P167j71086m017l8421l5573j8731M7846o2495k0421r3977
11735H28073N8454J07745p7629j30589J50268k15153k37261q1755Q9797Q9533
11725E81483J91121N6435j40207R7796J23077r5439O342k28704o7058K4373J02272
$$ plain form
11797 2410637 2344926 2313700 2286829 2293736 2334633 2332717 2252686 2094271 1975514 2074331 2132531
11786 2132531 2167809 2197302 2212898 2345715 2288768 2177096 2249262 2360088 2493440 2679885
11776 2679885 2785338 3096857 3341887 3624812 3848030 3905634 3866914 3829189 3684114 3370692
11766 3370692 2898265 2577490 2327050 2107485 1908162 1778615 1749397 1805117 1779213 1844877
11756 1844877 1830358 1724654 1747696 1608844 1519998 1339287 1039745 1115556 1159731 986886
11746 986886 1217781 1224948 1053862 1049845 1011424 975851 957120 1004966 942471 922050 828073
11735 828073 886527 994272 916643 786054 936322 721169 483908 402153 491950 581483
11725 581483 772604 829039 688832 786628 909705 814266 820608 591904 524846 549219 651491
11714F51491P3421k3460j0733Q7273J23621J18089J36960l53o8678j71559j72633
11703G43439O3855J6416k3636n27o2470k2602j62465r7371q7989J63302m4924
11692D85028k15612l5796L01109J02235l6362M2602j30009P7110j58190j13599
11682C18516M5597J1789J25410J14671J7556k16851r2740J45155o4537j22482
11672B82084p5141j0213J10101j5702L6429M2735M9420q4608m853k2000M4091
11661C52343m0928l1679m6466l7989Q4831q652n8368j0643p0467J8812k9428K3693
11649A45059j12900l4167o2924Q3023O6069K4449Q9995J08866n7452J24688r6170
11638B78536m6686J53924j45856k5911K5534P9679R5444q5220k0161j82668K3090
$$ plain form
11714 651491 724912 701452 690719 777992 901613 1019702 1156662 1156309 1087631 916072 743439
11703 743439 807294 823710 800074 799547 737077 714475 552010 454639 366650 529952 485028
11692 485028 269416 233620 534729 636964 600602 643204 513195 590305 432115 318516
11682 318516 364113 375902 501312 615983 633539 416688 323948 469103 404566 282084
11672 282084 206943 196730 306831 291129 327558 370293 419713 335105 330252 308252 352343
11661 352343 311415 279736 233270 195281 280112 271460 213092 202449 131982 150794 121366 145059
11649 145059 32159 -2008 -64932 18091 84160 108609 198604 307470 250018 374706 278536
11638 278536 231850 385774 239918 214007 239541 319220 414664 329444 309283 126615 149705
11627A49705J0250K8199N393J52736M9592R3862J67643K2397k79597o9419m6680
11616B84081j06805n0725j8832J0689r2483O5611J6841j17356j9625N835o423
11605b9192n1457Q6250J60926K8224L163O7721O3185Q1195m044p6775j37172k0996
11593A71028O4598o6973m2401p95m4160P8543J3209j09833Q9109K5736J3822j84502
11581G381j61532J04086K6774N6513j265k5736Q9708M0643q2753K2052q5703o8310
11569g8142K54210K49068Q21j55086j02969p7384q3935J10082J27395J52588k6804
11558C69844j25938k12654l8395K83506J47999l8321Q170m9116m8179j35533j13381
11547D8002K9726K7711k29873q1569J12562J36224k806p2368K2801Q5996J3859
$$ plain form
11627 149705 159955 188154 193547 346283 395875 489737 657380 679777 400180 330761 284081
11616 284081 177276 126551 107719 118408 25925 91536 108377 -8979 -28604 -22769 -29192
11605 -29192 -80649 5601 166527 194751 197914 265635 328820 410015 405971 329196 192024 171028
11593 171028 235626 168653 126252 125457 81297 159840 173049 63216 152325 178061 191883 7381
11581 7381 -154151 -50065 -23291 33222 31957 6221 95929 136572 53819 75871 -9832 -78142
11569 -78142 176068 425136 425957 270871 167902 90518 6583 116665 244060 396648 369844
11558 369844 243906 31252 -7143 276363 424362 386041 394211 345095 296916 161383 48002
11547 48002 77728 105439 -124434 -206003 -93441 42783 39977 -32391 -9590 76406 90265
11536I0265J65891p8778j96139l8153n8831m2398R2820n1698J46956Q4834K4843
11525A39612m1078J41760J68771j05115p062j209j15502r6634r0079P516n3838
11514e2858J44837K9113q4621j52336Q1735K6828J48435J11052q9131j34701J8180
11503D6533p3110L3169k1005N1038J06979N1921j33472r0724o5155M4292n570
11492e5104J22507Q5350K74717O4005k50117j07697q3073k3804k55855n2333j23327
11481d04731o4846J26618J24736O5116K7980K7018o9721J17058K07741P7720l1558
11470B03131j90038m142o9436M1984Q9464q5896l8712J46137p4763j97665r0255
11459b70191J34702J72114M5535l1891l50278R575J89304N6395j0772O0479O3174
$$ plain form
11536 90265 256156 177378 -18761 -56914 -115745 -158143 -65323 -117021 29935 114769 139612
11525 139612 98534 240294 409065 303950 296888 295679 180177 83543 -6536 980 -52858
11514 -52858 91979 121092 36471 -115865 -34130 -7302 141133 252185 163054 28353 46533
11503 46533 -26577 6592 -14413 36625 143604 195525 62053 -28671 -93826 -49534 -55104
11492 -55104 67403 152753 427470 491475 241358 133661 50588 26784 -229071 -281404 -404731
11481 -404731 -469577 -342959 -218223 -153107 -125127 -98109 -167830 -50772 156969 234689 203131
11470 203131 13093 8951 -60485 -18501 70963 -14933 -53645 92492 17729 -179936 -270191
11459 -270191 -135489 36625 82160 50269 -300009 -290434 -101130 -44735 -55507 4972 68146
11448F8146q7894o0475o8621p1324k5318M6274J78974J91635R3323j48462O7775
11437A84033l1883K8984o9593m1155m9965l0368p9509n9849J73876j6111o1141
11426e2681J12016J40563N2076P074J2372J06853J05715K1835j47158j54386k5462
11415A78817j28266L8072K15813j74617k30442J28190j0187p6547j25870R7020
11405h8017J16807J69918k6982k0400O5183r8805k09085J34185N7211p3725j9387
11394F903r704l2445k9610J5972l9929M2616r049M7560M5409p6342k01087o0267
11382b99973K22361n5832j7307M1106J6312P8303j72167J51749K21871J3053K9901
11371B29377j20645j24756L3547M8587j29634M1842R5083K5807o4997m7257M2070
$$ plain form
11448 68146 -19748 -80223 -148844 -220168 -245486 -199212 -20238 171397 264720 116258 184033
11437 184033 152150 181134 111541 70386 20421 -9947 -89456 -149305 24571 8460 -52681
11426 -52681 59335 199898 251974 259048 271420 378273 483988 505823 358665 204279 178817
11415 178817 50551 88623 304436 129819 -100623 27567 17380 -59167 -185037 -88017
11405 -88017 28790 198708 171726 151326 216509 117704 -91381 42804 100015 26290 6903
11394 6903 -2801 -35246 -64856 -48884 -88813 -46197 -55246 -7686 37723 -38619 -239706 -299973
11382 -299973 -77612 -133444 -150751 -109645 -93333 -15030 -187197 -35448 186423 199476 229377
11371 229377 108732 -16024 17523 66110 -63524 -21682 73401 99208 34211 -13046 29024
11360B9024J7493j32728n7195N7934L4985N1463Q5349N9739Q4168p5204r8027
11349E7001r0454j55816j33040K02624Q3120K30748J51888j57945r2123M0507
11339A36510J32729O3289j19731N32n3813k31037K664J57502J4403N2942K27263
11328C83253m8341r8680j15808l1746j0599p8756m0208M3003J50131N0496j19199
11317H3546j26437K33971J7585j78359n8063J43342K6592P3755N1027r3350l63244
11306a89635j13170K11349J41555j61320q6393j980Q9048J02852Q8409m8485m7313
11295a5083k25421J08173K50551M8230k6576O8429J38552j36373m3379J13672
11285B80775K2366J8374q5921o3808j24469j3293p9453j00355J55321J84330J80485
$$ plain form
11360 29024 46517 -86211 -143406 -85472 -50487 976 86325 146064 230232 155028 57001
11349 57001 -33453 -189269 -322309 -119685 -36565 194183 346071 188126 96003 136510
11339 136510 269239 332528 212797 213329 159516 -71521 -68857 88645 103048 155990 383253
11328 383253 334912 236232 120424 88678 78079 -677 -40885 2118 152249 202745 83546
11317 83546 -42891 191080 208665 30306 -27757 115585 142177 215932 266959 173609 -189635
11306 -189635 -302805 -91456 50099 -111221 -197614 -199594 -110546 -7694 80715 32230 -15083
11295 -15083 -240504 -132331 118220 166450 139874 208303 346855 210482 167103 280775
11285 280775 303141 321515 235594 171786 47317 34024 -45429 -145784 9537 193867 374352
11274C74352j15476M298j9631M9050Q5148j49950j09991k80554r2543L8334l7208
11263b54171j9645J83379R3708Q0763l5684j55936L655r0129O707J94375J65418
11252A72440O1573p6440J31877K41359j5851k07731j20813j25627j24792J59261
11242I5256N0530N0492N3919j45431J20785p9707k27240j73262R8183K62749Q9709
11231A95983k3541J4236n1090q9128p1273J8435L6835J04832J55564l9201j68909
11220H2743m5945k010o975J01454J58027r7151j9152p5416j75749l9282L2690
11209h6766J69376J15341J092N6245r3347k6610j35697N0394j03517j4944M412
11198f4021P5533O4389m5113J1666Q3387P0007Q677p0376R0572J22001n6959l8700
$$ plain form
11274 374352 258876 263174 243543 292593 377741 227791 117800 -162754 -255297 -216963 -254171
11263 -254171 -273816 -90437 3271 84034 48350 -107586 -103931 -194060 -187353 7022 172440
11252 172440 234013 157573 289450 530809 514958 307227 186414 60787 -64005 95256
11242 95256 145786 196278 250197 104766 225551 145844 -81396 -254658 -156475 106274 195983
11231 195983 172442 186678 135588 46460 -24813 -6378 30457 135289 290853 251652 82743
11220 82743 36798 34788 27813 129267 287294 190143 170991 95575 -80174 -119456 -86766
11209 -86766 82610 197951 199043 255288 161941 135331 -366 50028 -53489 -68433 -64021
11198 -64021 11512 75901 30788 42454 125841 195848 204525 134149 224721 346722 289763 251063
11186B51063J4624J887L3846j67709K7902k9687j36578L4772J3574j68304P9266
11175d5344K11164J43078j11351q0381j05755j07204P6496P072J02461N2326J9886
11164A62448J08470K6937n2657O3253J11132j08041j25324q5789n6758j02243
11154e8572q904J18424J34936o8721j54065j15910K2287O8124J53994j30618j09089
11143a48114Q6280q3682o3049R3106O1901L5936L0342k8233K13191L7287M1566
11132B76531J5565J5538p7528Q1032J8980j65629o9035k33773o9872J82389J4632
11121a1170j02958n386o3506j2631P1675K22281J31246L6066k62175R6177n0526
11110D9093l135J08622r565J29447k0978j06230r0905j5401N3737j23694M3248
$$ plain form
11186 251063 265687 267574 301420 133711 161613 131926 -4652 30120 43694 -124610 -45344
11175 -45344 165820 308898 197547 117166 11411 -95793 -19297 -12225 90236 142562 162448
11164 162448 270918 297855 245198 308451 419583 311542 186218 100429 43671 -58572
11154 -58572 -67476 50948 185884 117163 -36902 -152812 -130525 -62401 91593 -39025 -148114
11143 -148114 -61834 -145516 -208565 -115459 -53558 -17622 12720 -15513 197678 234965 276531
11132 276531 292096 307634 230106 311138 330118 164489 95454 -138319 -208191 -25802 -11170
11121 -11170 -114128 -119514 -183020 -195651 -123976 98305 229551 265617 3442 99619 49093
11110 49093 45958 154580 145015 274462 253484 147254 56349 40948 94685 -29009 14239
11099A4239j5516K91545J58425l6667L144P0646n5905p0257k13151k29098m9530
11088a32125m3384L8971K1016P0312N3355K5082j5139P6580J5523J0014R352j69667
11076d0110J4427j3584K5368P5991K16378k0353j80529n3757J06848j1309q5225
11065C4145K70O3178j10767q5893K2408Q1925Q3001q427o2731j58047m2164l0125
11053b13227L1613J86299J08952J87839P3029j65515j00061J12135J1355K6065
11043B58484j68589l6661O7973P8802l2480R3654P8851J26965J34427O7262J0302
11032F78990j02297J68806R4887P2836K08260J67163J44263l9740m2510J79022
11022A529680n234j47014J2553k3020L2787M2667p5581J87777J90679L5787L8642
$$ plain form
11099 14239 -1277 290268 448693 412026 415170 485816 429911 359654 146503 -82595 -132125
11088 -132125 -175509 -136538 -115522 -45210 8145 33227 18088 94668 110191 120205 129557 -40110
11076 -40110 -25683 -39267 -13899 62092 278470 258117 77588 23831 130679 119370 34145
11065 34145 34415 97593 -13174 -99067 -76659 5266 88267 79840 17109 -140938 -183102 -213227
11053 -213227 -181614 4685 113637 301476 374505 208990 108929 221064 232419 258484
11043 258484 89895 53234 121207 200009 167529 261183 340034 466999 601426 668688 678990
11032 678990 576693 745499 840386 913222 1121482 1288645 1432908 1393168 1350658 1529680
11022 1529680 1524446 1377432 1389985 1366965 1399752 1442419 1366838 1554615 1745294 1781081 1819723
11011A819723p867l04367k94571j05551Q9973J11230m9288J78374J02066j34569
11001A405153r4217j40201j55256j16722j04323j095O6740J08700R903j16287
10991H62395J4192o042Q4586k00855m7408q7477j10693r7426o0177J93324J77640
10980G22059o9697j00592j82278k11801J40659K88333J56140j68611j29088j8188
10970D26936j19728K1628K6598o1792n7000K3131q5155j3829O7624j3592O3237
10959B78058n993L5995q2629J023M0638l06179j10596R9298J381n8286K11273
10948A03983J18197m9098j6911O388K19768k2542l3161n5393k1352k40681k51996
10937b42798n3656L5979n556j5043l5623Q9277J08892M0837J85540J37005j68499
$$ plain form
11011 1819723 1811856 1507489 1212918 1107367 1197340 1308570 1259282 1437656 1539722 1405153
11001 1405153 1310936 1170735 1015479 898757 794434 793339 860079 968779 978682 862395
10991 862395 876587 870545 955131 754276 706868 619391 508698 411272 351095 544419 722059
10980 722059 652362 551770 369492 157691 298350 586683 742823 574212 445124 426936
10970 426936 307208 328836 355434 293642 236642 259773 174618 160789 228413 214821 278058
10959 278058 272065 308060 225431 226454 267092 -39087 -149683 -50385 -49004 -107290 103983
10948 103983 222180 173082 156171 162559 382327 359785 326624 271231 249879 9198 -242798
10937 -242798 -296454 -260475 -266031 -281074 -316697 -227420 -118528 -77691 107849 244854 76355
10926G6355O380J4124k2137q5486j26193J93735j094N2200j4746P9351p111J13502
10914B78880j5083j95789q9802m6923P1824J06930J18752o8996o4804J02215p5224
10903A21980j33813L42O1814j02692n678K5541j60712k9137J11185k6568K380
10892a35358j9942j7756K6256J39698n2160j61645m033P8043o9452O9696K72858
10881A26205Q1075j50774j58116K0227J35590O2089p3898j22837k8792J61855
10871E2624J73426k9105J6890J6744l5431k1555m5741J32428J00244j0846p4652
10860B75026m1833K9624L6628r3860j23895j93019N3223O5103J23540j7605j23530
10849a0598q8946J5754l1077L9297K5551K03552J48315M7526n966n1855J983M537
$$ plain form
10926 76355 82735 96859 74722 -10764 -136957 56778 55684 107884 93138 172489 165378 278880
10914 278880 263797 68008 -21794 -68717 3107 110037 228789 159793 94989 197204 121980
10903 121980 -11833 -11491 50323 -52369 -58047 -32506 -193218 -222355 -111170 -137738 -135358
10892 -135358 -155300 -173056 -146800 -7102 -59262 -220907 -224940 -146897 -216349 -146653 126205
10881 126205 207280 56506 -101610 -81383 54207 116296 42398 -80439 -109231 52624
10871 52624 226050 196945 213835 230579 195148 173593 127852 260280 360524 349678 275026
10860 275026 233193 262817 299445 205585 81690 -111329 -58106 6997 130537 112932 -10598
10849 -10598 -99544 -83790 -114867 -75570 -50019 153533 301848 349374 343408 291553 293536 298073
10837B98073k01634J8652R7677L8962P1466J9504p7736n6251J1484O4916r1307
10826A93806L6429J00060p3360r6634n050m6626n5853J0593q9823k135J81907
10815A53314R6304j02538k17918P6577R4672q0461N6694m3637M9215l992k0437
10804E7793q2582k2496n4152j06227l7157j194j48614P1320q7053K0821K20893
10793a68648J98442K15607n4839R7434J9814l21257l10276n4070o2611N9456J03919
10782b77029R5578K23893N4013J7615M5314k59144j89839J1458O9911J5511R2411
10771a00308J77700J75484J52j36980j10593j28166n221J73120j60679j38042
10761b53533O0501J89597J79089J61750Q4696j04899q7639j74357l9416J33910
$$ plain form
10837 298073 96439 115091 212768 251730 323196 342700 264964 208713 220197 285113 193806
10826 193806 230235 330295 256935 160301 155251 108625 52772 63365 -26458 -28593 153314
10815 153314 249618 147080 -70838 5739 100411 19950 76644 33007 82222 78230 57793
10804 57793 -24789 -47285 -101437 -207664 -244821 -246015 -394629 -323309 -410362 -389541 -168648
10793 -168648 29794 245401 190562 287996 307810 -13447 -323723 -377793 -440404 -380948 -277029
10782 -277029 -181451 42442 96455 114070 159384 -99760 -289599 -278141 -208230 -192719 -100308
10771 -100308 77392 252876 253028 116048 5455 -122711 -127932 45188 -115491 -253533
10761 -253533 -193032 -3435 175654 337404 422100 317201 229562 55205 15789 149699
10751A49699O6130n8926j6706n4410J00768J10752N2185N4398k32844j05329J78220
10740B43937K15510J67854N2271O7743J40117P1175J3181J03484p561K810r2364
10729I78157J73808J13048p273J23604K55188J94090J26628m5776m0470m4554
10719A826450m4533n2835m1339K28660J42026o5174J14196K47124K22903K25624
10709B803102J99828k03202j44041l7544q0648k53676J12501K8145p1650J47442
10699B500257J78109J21031r7092k23223j93515j59578L5475R4656k37906j56452
10689A861762K75981J88657j59913p1948Q8445L0093k39272k43517p0774J854
10679A661368q4777k0827l4584J8440j57056p9277J12553N8330j25041j42795
$$ plain form
10751 149699 215829 156903 140197 85787 186555 297307 349492 403890 171046 65717 243937
10740 243937 459447 627301 679572 747315 887432 958607 971788 1075272 1067711 1070521 978157
10729 978157 1151965 1265013 1257740 1381344 1636532 1830622 1957250 1911474 1871004 1826450
10719 1826450 1781917 1729082 1687743 1916403 2058429 1993255 2107451 2354575 2577478 2803102
10709 2803102 3002930 2799728 2655687 2618143 2537495 2283819 2396320 2424465 2352815 2500257
10699 2500257 2678366 2799397 2702305 2479082 2285567 2125989 2161464 2256120 2018214 1861762
10689 1861762 2137743 2326400 2166487 2094539 2182984 2213077 1973805 1730288 1659514 1661368
10679 1661368 1576591 1555764 1521180 1539620 1382564 1303287 1415840 1474170 1349129 1206334
10669A206334J93508j27442Q2568J40545k2187j11031J050j18379m9917K10349
10659A405398J85613L2357L2568O1308r7219j71634k07461J80940J90053J06437
10649A718360J39980J94755K75790J41261K99626K59829J41714n9303K2269n510
10639C128771J07904L2701l7032j22098m1968J69733K58263K49233M19383N19743
10629D684633N10073P08580Q04786P53818P76741Q65538Q46255P55014O90723
10620A1396161N94988Q77985J499078J928558K779054L828789N249504O925611
10612C5079728Q659947J0568487J1257102J0641902R250001P987325O220651L352254
10604A03017397P41986j58165J819207O444250J2498076J8112821K0426320J8835507
$$ plain form
10669 1206334 1399842 1272400 1354968 1495513 1473326 1362295 1363345 1244966 1195049 1405398
10659 1405398 1591011 1623368 1655936 1717244 1620025 1448391 1240930 1421870 1611923 1718360
10649 1718360 1858340 2053095 2328885 2470146 2769772 3029601 3171315 3112012 3134281 3128771
10639 3128771 3236675 3269376 3232344 3110246 3068278 3238011 3496274 3745507 4164890 4684633
10629 4684633 5194706 5903286 6708072 7461890 8238631 9104169 9950424 10705438 11396161
10620 11396161 11991149 12869134 14368212 16296770 19075824 22904613 28154117 35079728
10612 35079728 43739675 54308162 65565264 76207166 85457167 93444492 99665143 103017397
10604 103017397 103759383 103601218 105420425 111864675 124362751 142475572 162901892 181737399
10596A81737399J5256476J2102229P402690O7548p981778j0896884o361084K706036
10588A94032632J3260075K1430947K4408346K1332840J5843656J0091659K164061
10581C02564216j0234494k2557429k7016514k1563551j1347633q92128O478248
10574B15430715R372670P554182M258675N81526n197919j3335503k1108185k2998739
10566A74557422j8642342j1934885n851721j710697p2369m99633j806531l548887
10558A30490357o325580r707169j2245031j2963272j1375301r256050o902680
10551F1715274n257028m090771l279321k885297k527694k016233j657585j448795
10543C8552550j530789j482011j254303j197878j203967j008933q44940r77906
$$ plain form
10596 181737399 196993875 209096104 216498794 216566342 208584564 197687680 191326596 194032632
10588 194032632 207292707 228723654 253132000 274464840 290308496 300400155 302564216
10581 302564216 292329722 269772293 242755779 221192228 209844595 208952467 215430715
10574 215430715 224803385 232357567 236616242 237197768 231999849 218664346 197556161 174557422
10566 174557422 155915080 143980195 138128474 136417777 136345408 135845775 134039244 130490357
10558 130490357 124164777 114457608 102212577 89249305 77874004 68617954 61715274
10551 61715274 56458246 52367475 49088154 46202857 43675163 41658930 40001345 38552550
10543 38552550 37021761 35539750 34285447 33087569 31883602 30874669 30029729 29051823
10535B9051823r55623q60017p25846o77642n29537r04465p20544m66786o92833
10526B2518530p74126n91964n21006n54930l51357l95001m09260n58628n64192
10517A7798066l83296k31351m14638m92928k37042k37899m49580o88117m31408
10508A4231807k73435l57529o60584m15322j76879k24136k72306j85593j86932
10499A1479091j08101j67981l20303m88476k42770j98188r6581j87623k58041
10490I411027k70030M2258l1351q8494k03851r5656n6836o0270k20543n7672j14742
10479H253840n9679l4133o1562N1623Q543k3760j14496r2870l6438q7890N9845
10468G863023J10104n3368J6328n8584k75901j67812l6384J78621j0158j3422
$$ plain form
10535 29051823 28096200 27236183 26510337 25832695 25303158 24398693 23678149 23211363 22518530
10526 22518530 21744404 21152440 20631434 20076504 19725147 19330146 18920886 18362258 17798066
10517 17798066 17414770 17183419 16768781 16275853 16038811 15800912 15351332 14663215 14231807
10508 14231807 13958372 13600843 12940259 12524937 12348058 12123922 11851616 11666023 11479091
10499 11479091 11370990 11203009 10882706 10394230 10151460 9953272 9856691 9669068 9411027
10490 9411027 9140997 9183255 9151904 9063410 8859559 8763903 8707067 8646797 8426254 8368582 8253840
10479 8253840 8194161 8160028 8098466 8150089 8158632 8134872 8020376 7927506 7891068 7803178 7863023
10468 7863023 7973127 7919759 7936087 7877503 7601602 7433790 7397406 7576027 7565869 7552447
10458G552447q5596R7503L6611j59234l9109q2780q0008k48095k22340q7513j36923
10447F544963j92204l07939k13668o9538P0032r4605j03614q4426j35960k14618
10437E198423M0383j21690k32970k40210k3031l2926n5061j33964j32290j87375
10427D079289k52866j92186j40524j3557n0588n0080j30843j13194o325p5385
10417C053741M7460K1863o0866J01059j18210j38491K5494j50375j49180l1023
10407B601472M1759j08510o4247j7756L9431J6108r1671j61449j84169Q5682J64605
10396B321255O6952j3249j01972Q2512J18880R5357r6693p8565q5634p2161o9903
10385B166779p7433J34633P4915j15141j76760l5013P1657n382o2511J7673p9100
$$ plain form
10458 7552447 7466851 7564354 7600965 7441731 7402622 7319842 7239834 6991739 6769399 6681886 6544963
10447 6544963 6352759 6044820 5831152 5761614 5831646 5737041 5633427 5549001 5413041 5198423
10437 5198423 5238806 5117116 4884146 4643936 4620905 4587979 4532918 4398954 4266664 4079289
10427 4079289 3826423 3634237 3493713 3480156 3429568 3379488 3248645 3135451 3129126 3053741
10417 3053741 3101201 3123064 3062198 3163257 3045047 2906556 2932050 2781675 2632495 2601472
10407 2601472 2643231 2534721 2470474 2452718 2492149 2508257 2416586 2255137 2070968 2156650 2321255
10396 2321255 2388207 2374958 2272986 2355498 2474378 2569735 2473042 2394477 2308843 2236682 2166779
10385 2166779 2089346 2223979 2298894 2183753 2006993 1971980 2043637 2038255 1975744 1993417 1914317
10374A914317k29355j22720k2085Q3977J81169o549j16440j05644j29716N4456
10364A501410J77278L1833j71722j59944J59971P7895k69031j70453j164L8071
10354A214144J36613K27816q2348j43241N1260Q6711j0250k07775r0579j31845
10344A050506j03318j19751K4043J4740K48878p2489m9684o0219L6855J04254
10334A073815j36655k03844p4208J19694K85724j29359r6456Q0649j81853K620
10324G40127K04798K3582o9952o3518j64723l6047O2756J23237p1446n1810m8471
10313F48533j86423k4984Q4436N5250l995M5325N5562j42393l8643L4941j37587
10302C90022j20628J21458J51947O1382N0130J1101O4642m3996n9020Q4616K12166
$$ plain form
10374 1914317 1684962 1562242 1540157 1624134 1805303 1798754 1682314 1576670 1446954 1501410
10364 1501410 1678688 1710521 1538799 1378855 1538826 1616721 1347690 1177237 1176073 1214144
10354 1214144 1350757 1578573 1496225 1352984 1404244 1490955 1480705 1272930 1182351 1050506
10344 1050506 947188 827437 851480 866220 1115098 1042609 992925 932706 969561 1073815
10334 1073815 937160 733316 659108 778802 1064526 935167 838711 919360 737507 740127
10324 740127 944925 968507 898555 835037 670314 634267 697023 820260 748814 697004 648533
10313 648533 462110 437126 521562 576812 572817 618142 673704 531311 492668 527609 390022
10302 390022 269394 390852 542799 604181 654311 665412 730054 686058 627038 711654 923820
10291I23820j76520o5709J04444j15356j39332n5742k2939J25512Q7400J11844
10281G77422k10582o3121k8138J765O507j8517J16630O3873J61749J28535K8779
10270I64902K13341L20317J52869N3058J10956K69239K83324K31522o6765p1060
10260B461703k35227k15146k93696k56845j65068l29584p0575l7939j6784o9211
10250G71628K804j77508j74262q6549L2151M9620O2390L8898j0792k06197k254
10239B99929J22612P81o7803k9074J00725o257l36753j52872O0125K03972m2142
10228A53243m2429J23855K95898J87005j43620k17943r885j08711J32572M480
10218C74465o3885J0444J3538J20060R7038n6375r2425j83416l969J67222J6154
$$ plain form
10291 923820 747300 681591 786035 670679 531347 475605 452666 578178 665578 777422
10281 777422 566840 503719 475581 477346 483853 465336 581966 645839 807588 936123 964902
10270 964902 1178243 1498560 1651429 1704487 1815443 2084682 2368006 2599528 2532763 2461703
10260 2461703 2226476 2011330 1717634 1460789 1295721 966137 895562 857623 840839 771628
10250 771628 774432 596924 422662 336113 368264 417884 480274 519172 508380 302183 299929
10239 299929 422541 423322 355519 326445 427170 420913 84160 -68712 -8587 195385 153243
10228 153243 110814 234669 530567 717572 573952 356009 346124 237413 369985 374465
10218 374465 310580 321024 334562 454622 551660 495285 402860 219444 215475 382697 398851
10207C98851j6976p2385K2170j21355J9555J00600M0982q3558j25189J08904L4339
10196C05938j84118M6543Q37j45561O5365K434m809J30144J26219l2683k13709
10185I6600K3453J13182m717K2778p0065O2343n875L671J36819p5535q932L50268
10173F43990J09423k4310q4559J68646J75045P97L3995j09043q7723J73073r4830
10162I04504j4872L6642J72741J53566R4757J36844k91606j15135l755Q324L14640
10151A396650J46393J53853N1007j56286J09206R4011N1888J09938l8374k12789
10141A705497j72040j55845m0597J8140J37630N9015q6964r178p399k9968j71900
10130A246391n0444j08687k32880Q071J5201j43225l6573O3608P1791Q4213P541
$$ plain form
10207 398851 381875 309490 331660 210305 229860 330460 371442 287884 162695 271599 305938
10196 305938 121820 168363 169200 23639 89004 91438 86629 216773 342992 310309 96600
10185 96600 120053 233235 228518 251296 181231 243574 237699 241370 378189 302654 293722 643990
10173 643990 753413 729103 644544 813190 988235 989032 1023027 913984 826261 999334 904504
10162 904504 889632 926274 1099015 1252581 1347338 1484182 1192576 1077441 1073686 1082010 1396650
10151 1396650 1543043 1696896 1747903 1591617 1700823 1794834 1846722 1956660 1918286 1705497
10141 1705497 1533457 1377612 1337015 1355155 1492785 1551800 1464836 1455658 1448259 1418291 1246391
10130 1246391 1195947 1087260 854380 862451 877652 734427 697854 761462 833253 917466 925007
10119I25007r3726q5333o9702p1518k25449K3608J18387J06696j38276m8089j03149
10108C38456j01113j40547N2092M4064M3866n8558j81454M5611N8565K6534q0376
10097D7140J44835n7585j24685k0949k2485K44025K8784j3760o3587n0830L5991
10086A46894J07243j53852R6805J01511J3529k11463p9046R7388M7973J0344N2958
10075B30284J1041J04186P4653k12949q5846J4239M6437o6103o4820j26364j11462
10064a86704Q4425J57403P0115j0620L3641j00665M3199O8708J16388M5657k5157
10053B96390j40789j16022m9105J03245J02625k5941k2468j24147r8549K2621
10043e2140P8407Q2766P2534j10274k4777J5124P5246J60141J40736j41496o4418
$$ plain form
10119 925007 831281 745948 676246 604728 379279 402887 521274 627970 489694 441605 338456
10108 338456 237343 96796 148888 192952 236818 178260 -3194 42417 100982 127516 47140
10097 47140 191975 134390 9705 -11244 -33729 210296 239080 225320 161733 110903 146894
10086 146894 254137 100285 197090 298601 312130 100667 21621 119009 166982 177326 230284
10075 230284 241325 345511 420164 207215 121369 135608 182045 115942 51122 -75242 -186704
10064 -186704 -102279 55124 125239 114619 148260 47595 90794 159502 275890 321547 296390
10053 296390 155601 39579 -9526 93719 196344 170403 147935 23788 -74761 -52140
10043 -52140 26267 109033 181567 71293 46516 61640 136886 297027 437763 296267 231849
10032B31849o3455J9342j34123j95133Q5406R1638J79514J25424L4100L354k952
10021C74964K4471p118k17663R0717p8421k0992R582J37695Q3807j27448j13500
10010A56094J62897K9493n1323P612j65047j28182J87192L6239J7343l4069O4741
9999B82990O3970P6176l8321K7191J10570j63914j99110o7845J2913o3698n2334
9988a1412P3128k5372J58665K35161l5319m9183r6705j73567M676N1376O1912
9977A93360Q7935l843k22361k23L4683j29313l9065J9132R2124O0443l9759j13848
9965f0735m0073p9342j9295J02660N1107j39801J18025l966k350J14450N4048
9954I4728j51041k3348K6880j05821m0703M631l8428J11023K55880J49122k42067
$$ plain form
10032 231849 168394 187736 53613 -141520 -56114 35524 215038 340462 374562 377916 374964
10021 374964 399435 392317 174654 265371 186950 165958 175540 313235 397042 269594 156094
10010 156094 318991 348484 297161 304773 139726 11544 198736 234975 252318 218249 282990
9999 282990 346960 423136 384815 412006 522576 358662 159552 91707 104620 40922 -11412
9988 -11412 61716 36344 195009 430170 394851 345668 248963 75396 80072 131448 193360
9977 193360 281295 277452 55091 54868 89551 -39762 -78827 -59695 32429 92872 53113 -60735
9965 -60735 -100808 -180150 -199445 -96785 -45678 -185479 -67454 -71420 -73770 40680 94728
9954 94728 -56313 -79661 -52781 -158602 -199305 -194674 -233102 -122079 133801 282923 40856
9943D0856k03769J23135K20749m4112n2401p7511L8720r0348j40483m8127j1611
9932b44902J10900P3340o045N1156j247P9360j9905L2155J22051j60765J6777
9921E2875j16646r439j3415J14403K6402q1700k16050o1498J52608O9613j43244
9910b26091M4838J9859L7485P5513O5626J24718o1626k7899j22352K5837J29018
9899H4926k933p8189M7804O5106J11101J8625k01040k13003j33793L9975K5412
9888b36009J06477J24462N8916J21395k6930n3173J2973j91528R6124j53252m7796
9877a88341K6603j47331J24982K15601L63051K18137l78619k03624K9627L96M7895
9866A08377q1123L1299J1562J27169o4426j1627j43353K8282J32071q2674j27871
$$ plain form
9943 40856 -162913 -39778 180971 136859 84458 6947 45667 -44681 -185164 -233291 -244902
9932 -244902 -134002 -60662 -66707 -15551 -16798 62562 42657 74812 196863 36098 52875
9921 52875 -63771 -73210 -86625 27778 54180 -27520 -243570 -305068 -152460 -82847 -226091
9910 -226091 -181253 -161394 -123909 -48396 17230 141948 80322 52423 -69929 -44092 84926
9899 84926 81993 3804 51608 116714 227815 246440 45400 -167603 -301396 -261421 -236009
9888 -236009 -129532 -5070 53846 175241 148311 95138 108111 -83417 12707 -140545 -188341
9877 -188341 -161738 -309069 -184087 31514 394565 612702 234083 30459 60086 60482 108377
9866 108377 27254 58553 70115 197284 132858 121231 -22122 6160 138231 55557 -72314
9855g2314k88366p949K17810J55921J14437j35046j52074J46013K27609J26595
9845C32636p5740j00022J30383j70361j0416n4570R702J41049L2652k04321p8989
9834d7997j5014m3552O8612k3493K2401n2010M0967q391j49675O0455j12579p9902
9822c40178K5624J37602m386J1681j1179K5434N2122O1917J10095k109M4360K2485
9810A33468N3380k41868j86132R536J79278J79503L2648p9663J09553K41443j82330
9799B48816j25332L8760J9429j37654j34706J30077J10728P2416j51978r1999
9789b1443m4900m0677m6314q8523J17913N9845O4823q6020j23246N5350r8779
9778b51971J06557m9206m7656J78708p1831p8718K7117j1548O1345J34614J62692
$$ plain form
9855 -72314 -360680 -368629 -150819 5102 119539 -15507 -167581 -21568 206041 332636
9845 332636 256896 156874 287257 116896 106480 51910 61612 202661 235313 30992 -47997
9834 -47997 -63011 -106563 -37951 -61444 -39043 -91053 -50086 -58477 -208152 -147697 -260276 -340178
9822 -340178 -314554 -176952 -181338 -169657 -180836 -155402 -103280 -41363 68732 66623 110983 133468
9810 133468 186848 -55020 -241152 -231616 -52338 127165 159813 80150 189703 431146 248816
9799 248816 123484 162244 181673 44019 -90687 39390 150118 222534 70556 -21443
9789 -21443 -66343 -107020 -153334 -241857 -123944 -64099 724 -85296 -208542 -153192 -251971
9778 -251971 -145414 -194620 -242276 -63568 -135399 -214117 -187000 -198548 -137203 -2589 160103
9767A60103J6063o660L6314O2848L4391o261j76424r9578Q037k59943p2666J96349
9755a07427J83733R7178O2294n8079j31174j46522M591M2641J72857L829k54805
9744a30884j23764O854K15846K1258n2399J18401J11583k525p7742L2852k1869
9733I7611P7115J3018j01839j74889J23831O5486k7916j08997P214O6890M8274
9722H5798j49147o9162j03778o747Q2137J76016N4718p0820q8053m8242j58837
9711b96117o7183J12755J44925K8619J79595P1458n7373l7289L3257j68010o0744
9700a16107Q2955Q7482p5597j66301l5213J31269o8714N6248R550J612m884M7720
9688d9980k3578j6515R5849J04507J26034J9204k07873j43459q979N707j9800
$$ plain form
9767 160103 176166 169506 205820 268668 303059 296798 120374 20796 28833 -231110 -303776 -107427
9755 -107427 76306 173484 235778 177699 46525 -99997 -95406 -52765 120092 123921 -130884
9744 -130884 -254648 -247794 -31948 -10690 -63089 55312 166895 164370 86628 119480 97611
9733 97611 174726 187744 85905 -88984 34847 100333 72417 -36580 -29366 37524 85798
9722 85798 -63349 -132511 -236289 -243036 -160899 15117 69835 -985 -89038 -137280 -296117
9711 -296117 -363300 -250545 -105620 -77001 102594 174052 116679 79390 112647 -55363 -116107
9700 -116107 -33152 54330 -21267 -187568 -222781 -91512 -160226 -103978 -94428 -92816 -97700 -49980
9688 -49980 -73558 -90073 5776 110283 236317 255521 47648 -95811 -104790 -99083 -118883
9677a18883N0788L04477p5606o8802M4897p1180r44K02358K6375M5339j1162j59248
9665A68409o9190J9723J41436r0061k62919M0478J78794j11247j25840j8431J06658
9654b2190o8464J13745p4871P0431J07100M4187J72983J23277O5910Q6790J33295
9643G52193O4515L6814k39230k99362j4943l135j59864k09629j63802n2932J28531
9632a60844K26447P2428j0908M9286j55456J00422K06494j13467j74123l2016
9622H263j16138J92135P4219k82732J7984L50328P1763r2471r1588n4639j0493
9611F6631j08690m5372J93555J27493p2186j56671R1316J90763j37765l12937
9601a63863n2849J39910K26456Q1860L3635j41107m743J33330q4458J09372K2356
$$ plain form
9677 -118883 -68095 236382 160776 91974 136871 65691 64747 267105 293480 338819 327657 168409
9665 168409 99219 118942 260378 170317 -92602 -52124 126670 15423 -110417 -128848 -22190
9654 -22190 -90654 23091 -51780 18651 125751 169938 342921 466198 532108 618898 752193
9643 752193 816708 853522 614292 314930 299987 296852 136988 -72641 -236443 -289375 -160844
9632 -160844 65603 138031 127123 176409 20953 121375 327869 214402 40279 8263
9622 8263 -107875 84260 158479 -124253 -106269 244059 315822 223351 131763 77124 66631
9611 66631 -42059 -87431 106124 233617 161431 4760 96076 286839 149074 -163863
9601 -163863 -216712 -76802 149654 231514 265149 124042 119299 252629 168171 277543 299899
9590B99899j5040j62205k74188J5878Q2631P8299L5874P1203j46762j99380J3716
9579b00075O88Q6293j249R1196M7480K5727n8652N9188J58709j22724Q1618p608
9567A60591k20109o9777P5243J17296P5101L9808q8250j02558k01656Q1944J42578
9556A0211J04465J25643k59428p5456Q5329K23720p4301o0893m846K5318j7906
9545H1856o1338J5948j48796k45107n16L11193K51925R3046j37522j93165n3006
9534h5482o4570j32199j5643J03569L5424O8260K8603j08683K611J70843J28515
9523A31248N5800J7675Q8329p442O6095j03889n4181p5132m2821n7605K7396M7944
9511I3417K9912J58210J69025k32838j89276J51585N1530N8399L8911J07543L1932
$$ plain form
9590 299899 284859 122654 -151534 -135656 -53025 25274 61148 132351 -14411 -213791 -200075
9579 -200075 -199387 -113094 -114343 -23147 24333 50060 -8592 50596 209305 86581 168199 160591
9567 160591 -59518 -129295 -54052 63244 138345 178153 89903 -12655 -214311 -132367 10211
9556 10211 114676 240319 -19109 -94565 -9236 214484 140183 79290 74444 99762 81856
9545 81856 20518 36466 -112330 -357437 -357953 -46760 205165 298211 160689 -32476 -85482
9534 -85482 -150052 -282251 -297894 -194325 -158901 -90641 -62038 -170721 -168110 2733 131248
9523 131248 187048 204723 293052 285610 351705 247816 193635 118503 75682 18077 45473 93417
9511 93417 123329 281539 450564 217726 28450 180035 231565 289964 328875 436418 468350
9500D68350o0095o6568k33329k1760P387n350j12860j61769P5955K68375Q6925
9489B45261j41958j80807l3440O5767K20649J56794j83792j94108K938M9885J31061
9478A38250J21242n9270j10792r3914N8486L6789K0565P0496J52270J6041M123
9467C54286j77450q6507j06815j62134K8463J38618J33540P1560n0839K1925O7710
9456B32357J12304m2882R424j4728k5973j43252j39685l6752L0236l8390N0278
9445g063k20840k9097K08094M9879R6701q3763q7329O5364O6378O7354L8750r5578
9433F8850q8267p559o8298J21488M7212l5298J60657k1316j60957J05788K40106
9422C62406j91765k8354p5141q6880L4588L770J17487J14199p6237j30325j07785
$$ plain form
9500 468350 408255 341687 108358 86598 93985 88635 -24225 -185994 -110039 158336 245261
9489 245261 103303 -77504 -110944 -45177 175472 332266 148474 -45634 -42696 7189 138250
9478 138250 259492 200222 89430 -4484 54002 90791 111356 181852 334122 350163 354286
9467 354286 176836 90329 -16486 -178620 -150157 -11539 122001 193561 142722 164647 232357
9456 232357 344661 301779 311203 296475 270502 127250 -12435 -49187 -18951 -57341 -7063
9445 -7063 -227903 -257000 -48906 973 97674 13911 -73418 -8054 58324 125678 164428 68850
9433 68850 -19417 -26976 -95274 26214 73426 38128 198785 177469 16512 122300 362406
9422 362406 170641 142287 67146 -19734 14854 18624 136111 250310 174073 43748 -64037
9411f4037q3492K2850J23168L8217J08626J9765j64792J0681j8787k0718N13L5002
9399F996j5073O5816P168O6532j09028k3537K4433L334n3837k5302L4602N0128
9387C2232n180l2874n728P8556j95132j77627P0008J7060J54972J70253J25609
9376B32149m6423m7680m2277j12945n6152j20859j6047J55954J62521N9268p4193
9365I3316J328j9523L8847j36051p9012J20987l8960r9783L6763J26957M7347
9354I2216J18381j40515k163J9560j228j53599j12509k0580m4130o4951R5591
9343b13927J66757M0409P585j0557j9053j13627l2720J8141j8800k368J26139
9332e2021J51886J6713j21440J21818K22934M8538j01887k12970J28439Q2112
$$ plain form
9411 -64037 -147529 -124679 -1511 36706 145332 165097 305 10986 -7801 -28519 -28006 6996
9399 6996 -8077 57739 64907 131439 22411 -1126 23307 26641 -27196 -52498 -17896 32232
9387 32232 27052 -5822 -11550 67006 -128126 -305753 -235745 -218685 -63713 106540 232149
9376 232149 185726 138046 95769 -17176 -73328 -194187 -210234 -54280 108241 167509 93316
9365 93316 94644 75121 113968 -22083 -101095 19892 -19068 -118851 -82088 44869 92216
9354 92216 210597 70082 67919 87479 86251 -67348 -179857 -200437 -244567 -309518 -213927
9343 -213927 -47170 -6761 824 -9733 -28786 -142413 -175133 -156992 -175792 -178160 -52021
9332 -52021 99865 116578 -4862 116956 339890 388428 286541 73571 202010 284122
9322B84122j76406q3104l4412J0861j82818q0793Q8869R7936R5471O5913L3974
9311A19613N7120M4j14249j55289o7176L6014J07879J6467K11441R4097j58477
9300A47484j28306j24175J00265J16094J3836P7295K171j24760l8916o0464q1915
9289a01391l1395q0786J50979J38867N7639N8546j76544r3902J29089P4204m5668
9278G9638M2150R1509o8699m1660K572q728k15007k25553P4757Q0478J56477o129
9266c8195n9606M0908o311o2818J10034m4441K6348j30513j19237R6534J43850
9255d3447J40197o9624p6361P1364J22440M1078P142n8063j240j44462o1126P2335
9243B33L7634j06719P0795J11751p6886J21102j4151p513P943k35112j41730K5563
$$ plain form
9322 284122 107716 24612 -9800 1061 -181757 -262550 -173681 -75745 19726 85639 119613
9311 119613 176733 176777 62528 -92761 -159937 -123923 -16044 423 211864 305961 147484
9300 147484 19178 -104997 -4732 111362 125198 202493 204664 79904 40988 -19476 -101391
9289 -101391 -132786 -213572 -62593 76274 133913 192459 15915 -77987 51102 125306 79638
9278 79638 121788 213297 144598 102938 105510 96782 -118225 -343778 -269021 -188543 -32066 -38195
9266 -38195 -97801 -56893 -63204 -126022 -15988 -60429 -34081 -164594 -283831 -187297 -43447
9255 -43447 96750 27126 -49235 22129 144569 185647 192789 134726 133486 -10976 -72102 233
9243 233 37867 -68852 1943 113694 36808 157910 143759 136246 144189 -90923 -232653 -207090
9231b07090k3452j33120P9984J29667j16045n6873Q7520J78395J84908m4017J599
9220H1476M4457j1603j546j16728r0707P315Q0756J42015R3332m356j81437j59971
9208a16997j59921J34688L17920Q7009q0611j7192k0152n5785R0795Q9789k7755
9197B41788j35240j18065J21640j2227j89919j40213K0761k9892J86387J55774
9187A00794O9751j01823j20981k06589J5069R2522j3234Q1571Q8840j74208k6672
9176a94960M9370M957J10327J61866Q6619R3986j74185n7834l5756l6315R6244
9165A04319o8202j99561J10393J00784j08481l6880J55357J8317J71383K4361
9155B71790j06382K2467J5416j35537O8819o3785P4750j28117k03164N9722K13677
$$ plain form
9231 -207090 -230542 -363662 -283678 -154011 -270056 -326929 -239409 -61014 123894 79877 81476
9220 81476 125933 114330 112784 -3944 -94651 -87336 -6580 135435 228767 224411 42974 -116997
9208 -116997 -276918 -142230 175690 262699 182088 164896 144744 88959 179754 269543 241788
9197 241788 106548 -11517 110123 97896 -92023 -232236 -211475 -241367 -54980 100794
9187 100794 170545 68722 -52259 -258848 -243779 -151257 -164491 -82920 5920 -168288 -194960
9176 -194960 -145590 -140633 -30306 131560 218179 312165 137980 80146 44390 8075 104319
9165 104319 36117 -163444 -53051 47733 -60748 -97628 57729 76046 247429 271790
9155 271790 165408 187875 203291 67754 136573 72788 147538 19421 -183743 -124021 89656
9144H9656J95412J62622r1867l08322r4106R8914O6737m5115l4636J9083k46993
9133a88615j25058J10287J28289K20455q596k15596K3344p9620r252L41983L3837
9122B31458j80j48795k06433m647Q9255J8378M5417m165o009L6680j1116J30267
9110A70110p1095o9267q5772j31243o3984K5226M0364P8641J12746J49602J11484
9099B66812L2234L7002k7321j66874j12674j13253j65920L7213J24383J23252
9089C4854j72419r4642O9643K5910k1870r7535L8797q403n1027K4008K4358J36132
9077i2194M3666O2108K8884o5411L926J12420M8829k03691L6528J58377k4764
9066A08678r0541o1488R5600J50067L3284m6163J75909R9954r3936n4011l6414
$$ plain form
9144 89656 285068 447690 355823 47501 -46605 52309 119046 73931 39295 58378 -188615
9133 -188615 -313673 -203386 -75097 145358 136762 -78834 -55490 -135110 -144362 197621 231458
9122 231458 231278 82483 -123950 -128597 -39342 -20964 24453 20288 14279 50959 39843 170110
9110 170110 99015 29748 -56024 -187267 -251251 -226025 -185661 -107020 5726 155328 266812
9099 266812 299046 336048 308727 141853 29179 -84074 -249994 -212781 -88398 34854
9089 34854 -137565 -232207 -162564 -136654 -158524 -256059 -217262 -225665 -276692 -252684 -228326 -92194
9077 -92194 -48528 13580 42464 -22947 -19021 93399 142228 -61463 -24935 133442 108678
9066 108678 18137 -43351 52249 202316 235600 189437 365346 465300 371364 317353 280939
9055B80939j85328q1906O5131M5573N5991q1479j7431l5071R635n6642p5291J51990
9043G6111J38058k5010k39317j45392P2403K5729m5645m8505r5545k0582O4621
9032b43074J00744Q8398k895P1856j40895k39880J13512J56011K37874N9221l4888
9021A65984M0893j40741j00990P8916n2788L6378j62391r9499K4264o7467J6073
9010b61368j07905j13743n521K77523J59291o7246m0636j45451Q2190K4248j29043
8999c27661K23080J29103O7242O8652m1109j5371o2138l3599j55605P74K10462
8988F3830j10451j80036J2531j50981J0498K42441O5435J87407o3437k17495M2538
8977i7720J59799M1558N0823J4892o9546n376l157P0619P3773j5344m7759p0233
$$ plain form
9055 280939 95611 13705 78836 124409 180400 98921 81490 46419 56054 -588 -75879 76111
9043 76111 214169 189159 -50158 -195550 -123147 -97418 -143063 -191568 -287113 -307695 -243074
9032 -243074 -142330 -53932 -56827 15029 -125866 -365746 -252234 -96223 141651 200872 165984
9021 165984 206877 66136 -34854 44062 -8726 27652 -134739 -234238 -209974 -277441 -261368
9010 -261368 -369273 -483016 -488537 -211014 -51723 -118969 -159605 -305056 -222866 -198618 -327661
8999 -327661 -104581 24522 91764 160416 119307 103936 41798 8199 -147406 -146632 63830
8988 63830 -46621 -226657 -214126 -365107 -354609 -112168 -46733 140674 77237 -140258 -97720
8977 -97720 62079 103637 154460 169352 99806 94430 91273 161892 235665 220321 172562 102329
8965A02329m2833j43543K6473J17417j7961J54531N6485o9690N4413o0930j02801
8954G3890j37470j13183J36281J19280R48j71522j11882l0554N1140o8898j30860
8943c82830J35449N5305K9767p3867l464k6200J4605L2299P5147r3985N1233L7284
8931a49257J07997j00396j12238j60795J9630J68233O1587N9448J14271N3855
8921F2335o2918p8834J19820J70890P599J804j94107n8241J52402l684j32865
8910a5799J5918J00200j7216n7712n7473p2571p0291j35502L5647J25541j7187
8899a66445Q7626j3359M8038J83961J54107j51726j30630R4681j26141m3400q5972
8888a49260j29512N6588N6908K312m2394M8479L9948J5818M0009o0660L3543j23049
$$ plain form
8965 102329 59496 -84047 -57574 59843 41882 196413 252898 183208 237621 176691 73890
8954 73890 -63580 -176763 -40482 78798 79746 -91776 -203658 -234212 -183072 -251970 -382830
8943 -382830 -247381 -192076 -162309 -236176 -239640 -265840 -251235 -218936 -143789 -237774 -186541 -149257
8931 -149257 -41260 -141656 -253894 -414689 -395059 -226826 -165239 -105791 8480 62335
8921 62335 -583 -79417 40403 211293 218892 220696 26589 -31652 120750 117066 -15799
8910 -15799 119 100319 83103 25391 -32082 -104653 -174944 -310446 -274799 -149258 -166445
8899 -166445 -78819 -92178 -44140 139821 293928 142202 11572 106253 -19888 -63288 -149260
8888 -149260 -278772 -222184 -165276 -162964 -205358 -156879 -116931 -101113 -61104 -121764 -88221 -211270
8876b11270J19137K8777K921J24390J26753N6509q1325q1450q2391O0142m8427
8865A3766K5540K1935O706J42768J4044o8584n0447O0045M928j41545l20819j45395
8853d37058M6347Q1562J01661J33961j44600m1822J78329R9217N0078J1633p5271
8842D037J43734l4042j1327J11576j09442J24582j03942q8177k0055L4909K6326
8831G8179k13528O2025Q169J14120J11528o7657J2833J22883L4291j68863j76145
8820h2165q8816Q7769R6357r1999J1043R8888j8561j34201R6939J36140p5591
8809C5803J91L7074Jj4924j65440j09058j9386K08825J4721q3998l90Q9610n6719
8796f3690O0473O5628J39113j74784r3262o5085j11949j04314K4930N9849M3865
$$ plain form
8876 -211270 -92133 -63356 -60435 63955 190708 247217 165892 84442 2051 62193 13766
8865 13766 39306 61241 67947 210715 224759 156175 105728 165773 170701 29156 -291663 -437058
8853 -437058 -390711 -309149 -207488 -73527 -218127 -259949 -81620 17597 67675 79308 4037
8842 4037 147771 113729 102402 213978 104536 229118 125176 36999 16944 51853 78179
8831 78179 -135349 -73324 -65155 48965 160493 92836 105669 228552 262843 93980 -82165
8820 -82165 -170981 -83212 13145 -78854 -67811 31077 12516 -121685 -24746 111394 35803
8809 35803 35994 73068 73069 58145 -107295 -216353 -235739 -26914 -12193 -96191 -96581 -6971 -63690
8796 -63690 -3217 62411 201524 26740 -66522 -131607 -243556 -347870 -322940 -263091 -219226
8785b19226M1155J47586K3572R6540o7199j03635J10186J80453n4523m8868q756
8774I7285N2142J16546j46494p1235R1114Q7954l3727J5568o6712J9487j54045
8763G883o9067o5358p2644J18802P7819o7615j09850l4722j05157J11378J66376
8752d2155J18357J01294m1645Q218o8388Q1182J2391n1610m5251o7794j02966
8741i8367r1548J42996L9312j05485j20430K41663K2167j20577m3606n087R9713
8730c9249j36587k4099K37809K0963j94039m7027L272K0849p9485J5536O0432
8719a61625Q4718Q3598M8939R5709N3929j3604k461o4650N1N7898l1474L7255
8707A88283Q1999j28689l3412l6521M9234M7554j372k32477j83867k8655R1397
$$ plain form
8785 -219226 -178071 -30485 -6913 89627 22428 -81207 28979 209432 154909 106041 97285
8774 97285 149427 265973 119479 48244 139358 227312 193585 209153 142441 161928 7883
8763 7883 -61184 -126542 -199186 -80384 -2565 -70180 -180030 -214752 -319909 -208531 -42155
8752 -42155 76202 177496 135851 144069 75681 156863 169254 117644 72393 4599 -98367
8741 -98367 -189915 -46919 -7607 -113092 -233522 8141 30308 -90269 -133875 -138962 -39249
8730 -39249 -175836 -199935 37874 58837 -135202 -182229 -178957 -158108 -237593 -222057 -161625
8719 -161625 -76907 6691 55630 151339 205268 191664 189203 124553 124604 182502 151028 188283
8707 188283 270282 141593 108181 71660 120894 168448 167076 -65401 -249268 -277923 -186526
8696a86526L0009J28201R238j12002j07340L1620k12220j04927J90019K78270
8686e5658j7445r6172n2181K9128N5972J55539m0963j11445p115O0358j20543
8675b00525o2534O6405J34144J18369K7415J2431j60331m5473J05127q845p680
8664b1497P0024L853Q5428L8693J7455n9514o7507J01735J81489J0120k09371
8653A50908k43873n7566l7318J76620R1573J0128m448m8815j7880N7446l0837
8642D5938P9187R0935j60713L2960K15114M9877j13423j10810j5807j82066M3118
8631b5690L5333J09042j24627n8517J05977K8937j1606J9707j11690J9049j02637
8620a16722J50617J54434O2060j67990R2668N7751r5544q5211N8998n0967m9212
$$ plain form
8696 -186526 -156517 -28316 -19078 -131080 -238420 -206800 -419020 -523947 -333928 -55658
8686 -55658 -73103 -169275 -221456 -192328 -136356 19183 -21780 -133225 -140340 -79982 -200525
8675 -200525 -263059 -196654 -62510 55859 83274 95705 -64626 -110099 -4972 -13817 -21497
8664 -21497 48527 52380 137808 176501 193956 134442 66935 168670 350159 360279 150908
8653 150908 -92965 -150531 -187849 -11229 80344 90472 86024 37209 19329 76775 45938
8642 45938 125125 216060 55347 88307 303421 353298 239875 129065 113258 -68808 -25690
8631 -25690 9643 118685 -5942 -64459 41518 70455 58849 78556 -33134 -14085 -116722
8620 -116722 33895 188329 250389 82399 175067 232818 137274 52063 111061 60094 10882
8609A0882Q6342l0846j21935l2807J44660j6233m5838L0085l1665J86025K07401
8598C86071j55196j09608K2244j57259n1707j0729R4301Q3646k8464Q5914m0453
8587A18760j44097O5535J27740M4413k6738N3475K33663j13639k54313j30617
8577b5818j3565J11821L73J0134J50675J12566O8528j02786j65178j48937j66592
8566a68779K70J55482J34789J1272j22938k775J0675j42263P4471O2809P9243
8555I2256j6247j28628j35681n6149p781J66467P2807K7791q9387l0337r5573
8544b00462J11867J42975J47431p512k26064j66463K36734J5919R017J17507K3741
8533B04690N9493R7992j67812j81358l8999K6735J97777J44526J9737j12453J01441
$$ plain form
8609 10882 97224 66378 -55557 -88364 56296 40063 -5775 24310 -7355 178670 386071
8598 386071 230875 121267 143511 -13748 -65455 -76184 18117 101763 73299 159213 118760
8587 118760 -25337 40198 167938 212351 185613 239088 472751 359112 104799 -25818
8577 -25818 -39383 72438 72811 82945 233620 346186 414714 311928 146750 -2187 -168779
8566 -168779 -168509 -13027 121762 133034 10096 7321 17996 -124267 -49796 13013 92256
8555 92256 76009 -52619 -188300 -244449 -252230 -85763 -12956 14835 -74552 -104889 -200462
8544 -200462 -88595 54380 201811 194299 -31765 -198228 38506 54425 63442 180949 204690
8533 204690 264183 362175 194363 13005 -25994 741 198518 343044 362781 250328 351769
8522C51769J3916k13451j90532m4319k3855M2726R3751m394N6673J1105k17510
8511a24121l1374J28302J6761j2845o5821k3934N9861k8730o6999M4042N1053
8500e3805j42502o8704n0640N0594J98261K30074Q9991J27154k3022k01929j67043
8489a1571J53658J68145q3356j59594o0344P540j62877j281K5976J5126R7746
8478a0832J6017k2744J41762J93436j4863j49001l6511N5563m1559p9274r1169
8467c9175O9220l299k05988J34602J22928q9947j20803j7699q6471L2416Q7490
8456a16726L0112Q3114j90691j67425J65957K28592M1963j04212j03184K01855
8446F9355M36542n1194k14797j60646j55701K7321N5088l9821O0973J01953K5597
$$ plain form
8522 351769 365685 152234 -38298 -82617 -106472 -63746 30005 25611 82284 93389 -124121
8511 -124121 -155495 -27193 -10432 -23277 -89098 -113032 -53171 -81901 -148900 -104858 -53805
8500 -53805 -196307 -265011 -315651 -265057 -66796 163278 253269 380423 357401 155472 -11571
8489 -11571 142087 310232 226876 67282 6938 14478 -148399 -149680 -123704 -108578 -10832
8478 -10832 5185 -17559 124203 317639 302776 153775 117264 172827 131268 51994 -39175
8467 -39175 30045 26746 -179242 -44640 78288 -11659 -132462 -150161 -236632 -204216 -116726
8456 -116726 -86614 -3500 -194191 -361616 -195659 32933 74896 -29316 -132500 69355
8446 69355 505897 454703 239906 79260 -76441 -49120 5968 -33853 27120 129073 154670
8435A54670n1361N5989j37061k463K0331L0101k3215J86892m9033k01761j2572
8424b9483N1083n6950j04822O6359j7146k0622J13335J23955o0855N0807j0374
8413A05287M7362M8408M3832j82989o1389q8515l9493N5677J12566O3534m8949
8402E5331N3792k4254m8232J00398P6002p5094j37107k3438J10267J17290K02729
8391D07684O8757j11327J1467K8772K027r8421j15555q4604O5791N6775J0373
8380B41739R092m4225m0206J74236o0769l980m8132j44627O0544L628q4276O0141
8368A23165J3655k21923j84371J27226J43693q3498j68918j58150m3517Q3733
8358c68905J79771J92096P6473K2920j0414q1029j61681o9331k6822P8747Q15
$$ plain form
8435 154670 103309 159298 22237 19774 40105 70206 46991 233883 184850 -16911 -29483
8424 -29483 21600 -35350 -140172 -73813 -90959 -111581 1754 125709 64854 115661 105287
8413 105287 152649 201057 244889 61900 511 -88004 -127497 -71820 40746 104280 55331
8402 55331 109123 84869 36637 137035 213037 137943 836 -22602 87665 204955 407684
8391 407684 476441 365114 376581 405353 407380 308959 193404 108800 174591 231366 241739
8380 241739 250831 206606 166400 340636 279867 275887 227755 83128 143672 147300 63024 123165
8368 123165 136820 -85103 -269474 -142248 1445 -82053 -250971 -409121 -452638 -368905
8358 -368905 -189134 2962 79435 102355 91941 10912 -150769 -220100 -246922 -168175 -167360
8347a67360K5494J25616p5201r071Q4857N604j51114o4310L299Q9769m8872J3665
8335a67624j06015n5757Q7642M27752K20935j86064j04268r9759p3182m8843M9800
8324e5383r4968j63623m177Q2553m0413M6697K6578N8055R8916K6105P2086j00978
8312d8552q0265j8334L890J02174P2916J07264O8636Q7638J95501J0421j94869
8301C06420k69109j62542j5300k3212N9794l1324r5555L9539K912K09891R7838
8290A19352k6362j02430n183o0834l8280N8913J82989m1386j7429j54984M4052
8279d1582Q537j56992j14744K04781K18811J11815J025j73868j88981K9042P7725
8268b4431J8498N8427l4319j13N9080J07635r0642j53481J07037J8681j091Q9905
$$ plain form
8347 -167360 -141866 -16250 -91451 -100522 -15665 -10061 -161175 -225485 -222186 -132417 -181289 -167624
8335 -167624 -273639 -329396 -241754 185998 406933 220869 116601 16842 -56340 -105183 -55383
8324 -55383 -150351 -313974 -318151 -235598 -276011 -229314 -202736 -144681 -45765 -19660 52426 -48552
8312 -48552 -128817 -147151 -143261 -41087 31829 139093 207729 295367 490868 501289 306420
8301 306420 37311 -125231 -140531 -163743 -103949 -135273 -230828 -191289 -188377 21514 119352
8290 119352 92990 -9440 -14623 -75457 -113737 -54824 128165 86779 69350 -85634 -41582
8279 -41582 -33045 -190037 -304781 -100000 118811 230626 231651 57783 -131198 -102156 -24431
8268 -24431 -5933 52494 18175 18062 77142 184777 94135 -59346 47691 66372 65281 155186
8256A55186l1544n8829O2102k38577j27316J31905O6831p7313l0120r3189J86255
8245e4609j7321l4512Q9457O3375k5024M7429o0051r575j8278j50074r2248L0825
8233b30606J76051J2503j33655o1916P3163j4407L3541M401K8549O3406J21164
8222G2194P439r1088J62873o290j31020r3287j78463j1654K9230M5389K6719J04461
8210f3497n3252l7881O3486m8407j23962J6558J63115Q0657J54108J77333r2285
8199B35973j71973O321r9560j18503L1671P122P0692M3299o1050M7414R5186n6716
8187B9876K87j841R0377K1697o2959m0421j899q4073r9867K1881j28430J28271
8175a27101M1517J04069N3190Q8069Q2842m2946j64248j15110k1354j2781k6053
$$ plain form
8256 155186 123642 64813 126915 -111662 -238978 -107073 -40242 -117555 -147675 -240864 -54609
8245 -54609 -71930 -106442 -16985 46390 21366 68795 8744 -831 -19109 -169183 -261431 -230606
8233 -230606 -54555 -42052 -175707 -237623 -164460 -178867 -145326 -140925 -112376 -48970 72194
8222 72194 79633 -11455 151418 145128 14108 -79179 -257642 -269296 -240066 -194677 -167958 -63497
8210 -63497 -116749 -154630 -91144 -139551 -263513 -246955 -83840 -3183 150925 328258 235973
8199 235973 64000 70321 -29239 -147742 -116071 -108949 -38257 5042 -56008 -8594 86592 29876
8187 29876 30163 28322 118699 140396 77437 37016 35117 -48956 -148823 -126942 -255372 -127101
8175 -127101 -85584 18485 71675 159744 242586 199640 35392 -79718 -101072 -113853 -139906
8164a39906R3852J2344J5930m7404p2588r5661P8952J11177l9227J32842P6020
8153A26331k08326P2504L5559p0393O9772O2271K9078l1498j48650m7452Q2616
8142b8188J6635k43973k9176P7310J71476J84848P631o229l4398r2573p2057j24162
8130a72856K0603N0889l010J25471J36664J02550L7197j3549j76074k02179P1670
8119b2624j1884K4440J08789K5084n4216m7276J77927L2328p5622m6262l3745
8108G6939J7703k9672r2122J6161M2062J1780N9318J85175J04648j00467n8216
8097B33309j3700K980k96965j23594J19522J54656P9262j13604M0118J01675J09732
8086B93391j05762j53091l8672k3138J4293N7239J3769K9412j7754j23709J12891
$$ plain form
8164 -139906 -46054 -33710 -17780 -65184 -137772 -233433 -154481 -43304 -82531 50311 126331
8153 126331 -81995 -9491 26068 -44325 25447 87718 116796 85298 -63352 -110804 -28188
8142 -28188 -11553 -255526 -284702 -207392 -35916 148932 156563 150334 115936 23363 -48694 -172856
8130 -172856 -152253 -101364 -104374 21097 157761 260311 297508 283959 107885 -94294 -22624
8119 -22624 -34508 -10068 98721 123805 69589 22313 200240 232568 156946 110684 76939
8108 76939 94642 64970 -27152 -10991 31071 42851 102169 287344 391992 291525 233309
8097 233309 219609 222589 -74376 -197970 -78448 76208 155470 41866 81984 183659 293391
8086 293391 187629 34538 -4134 -27272 -12979 44260 58029 87441 69687 -54022 58869
8075E8869k9565Q8990q3384k40778J22580M3500k04j14478L4460l1956R5707J19893
8063F3634J75500n7030N8964p6514j44459P60j18039l3781l3467J118J75458J38704
8051A50848r0893q1157R425P8410J2737j28477j27641j9314N4960J27308P6600
8040F2806K37756k154k38650j34924J07054K04729j66321k05801L1214J44723
8030D0432P382j2963o7670j9667l1351J76682J03423p3923k5273J36793O5131
8019B98996p7812j20282r8664j3599n3107Q409O5179m7782Q895p5693J27125J07581
8007A29246j20473Q4272J08845j59738j09146P8273L6155L6605L0942p0068m6893
7996a980j03195l7687P5226J32766q534j2633k4100N8898J46108k7123j1482j84106
$$ plain form
8075 58869 29304 118294 34910 -205868 -83288 -39788 -39992 -154470 -120010 -151966 -56259 63634
8063 63634 239134 182104 241068 164554 20095 20855 -97184 -130965 -164432 -163314 12144 150848
8051 150848 59955 -21202 -11777 66633 79370 -49107 -176748 -196062 -141102 -13794 62806
8040 62806 300562 298408 59758 -75166 31888 236617 70296 -135505 -104291 40432
8030 40432 47814 34851 -32819 -52486 -83837 92845 196268 122345 97072 233865 298996
8019 298996 221184 100902 2238 -11361 -64468 -56059 9120 -38662 -29767 -105460 21665 129246
8007 129246 8773 93045 201890 42152 -66994 11279 47434 84039 114981 44913 -1980
7996 -1980 -105175 -142862 -67636 65130 56596 43963 19863 78761 224869 197746 186264 2158
7984B158o2467q0156j02330J8898m4249k86065j1486J48782J31809k1304Q00K24837
7972h0773J34180j7929r6510r0144J51123P5737j161j19096j29926Q9470K4425
7961f0604k9368L8692K5352o3316J2626P3760K65310J17095j06869k34835j8228
7950A9615j7978m3359l4647J14445J31785j06169r5241n4186r9253q5525R3192
7939a77321N5915N3777j1004J05361K3427j55130j18921Q5936R3752o9288j01837
7928b15333J71028p7408L2078r1848k3416J12102M2976m5454P1343R4996J30434
7917B01498l7574n4915m8407j46015k6000O4454M7613M5072J08643n0012q2202
7906B2155n3902J51641m9754m4271J2336k5314J0650J2838o512L8842o0458N6360
$$ plain form
7984 2158 -60309 -140465 -242795 -223897 -268146 -554211 -565697 -416915 -285106 -306410 -305610 -80773
7972 -80773 53407 35478 -61032 -151176 -53 75684 74523 -44573 -174499 -85029 -60604
7961 -60604 -89972 -51280 -25928 -89244 -76618 -2858 262452 379547 272678 37843 19615
7950 19615 1637 -41722 -76369 38076 169861 63692 -31549 -85735 -184988 -270513 -177321
7939 -177321 -121406 -67629 -78633 26728 50155 -104975 -223896 -137960 -44208 -113496 -215333
7928 -215333 -44305 -121713 -89635 -181483 -204899 -92797 -49821 -95275 -23932 71064 201498
7917 201498 163924 109009 60602 -85413 -111413 -46959 654 45726 154369 104357 22155
7906 22155 -31747 119894 70140 25869 38205 12891 23541 36379 29867 68709 8251 64611
7894F4611J8090o9010j35053N4353l9608N0913J88763J4415j25882r2564m6670
7883a17642K2294J42244Q550r5935o8348J9336J06476m113k41382j07179O5987
7872b69712K3528J03338L0122o5490j10355j28182N9854J16495p5144n665J42876
7861a78335J045l2658J90604O2332m6545J5854L3594j38765j68127o91L5198O3802
7849a62692K37425J5585j88723l3106N6198N7521L6305P5088J24009J31689k18401
7838A30898p1854N4880M130K16335R7704r274j43630r9811k11165m4540m3773
7827a20100o9130N5691K09315O7401n6198m5942q105M176r2942m5847m2038J59752
7815A6033K12674r5299n0253q6457q2737j5874J34850j07949m1477j57916L8940
$$ plain form
7894 64611 82701 13691 -121362 -67009 -106617 -55704 133059 147474 21592 -70972 -117642
7883 -117642 -95348 46896 55446 -40489 -108837 -89501 16975 12862 -228520 -335699 -269712
7872 -269712 -246184 -142846 -112724 -178214 -288569 -416751 -356897 -240402 -315546 -321211 -178335
7861 -178335 -177290 -209948 -19344 42988 -3557 12297 45891 -92874 -261001 -261692 -226494 -162692
7849 -162692 74733 90318 -98405 -131511 -75313 -17792 18513 93601 217610 349299 130898
7838 130898 59044 113924 118054 334389 432093 422819 279189 179378 -31787 -76327 -120100
7827 -120100 -189230 -133539 75776 143177 86979 41037 32932 37108 -55834 -101681 -143719 16033
7815 16033 228707 133408 83155 -3302 -86039 -101913 32937 -75012 -116489 -274405 -235465
7804b35465J71975o4230M8007J98526Q5167r9158j72115k96881Q4238K18341L53438
7793B91843J18877p5491j15411k78296P8551O7304k8875P851M8057o0887o1796
7782h273N3440Q5902N8264K3897j50965p3588J06764J57157j2151J2915q555j07175
7770A37632K5769L3257j37693q5916J78409K3793j41013j40693j45610O6864J1960
7759a73241r063o1717J6524M7354n5432j58224J41801Q0340r4002K3398J42299
7748i9963J28146J66666j2651M2651p57j04329q1931p0924J0651l09n1485J13407
7736C9172K7868J0214j03733p7081Q7628J33070q3105k39922J05865K24439N2974
7725A77389j3319L3711k07963j03191R0182L5237j57392k80413m9952K55143R7966
$$ plain form
7804 -235465 -63490 -127720 -79713 118813 203980 104822 -67293 -364174 -279936 -61595 291843
7793 291843 410720 335229 219818 -58478 20073 87377 58502 66353 114410 53523 -8273
7782 -8273 45167 131069 189333 213230 62265 -11323 95441 252598 240447 253362 244807 137632
7770 137632 163401 196658 58965 -26951 151458 175251 34238 -106455 -252065 -185201 -173241
7759 -173241 -182304 -244021 -227497 -180143 -235575 -393799 -251998 -171658 -265660 -242262 -99963
7748 -99963 28183 194849 182198 224849 224092 119763 37832 -33092 -22441 -22750 -74235 39172
7736 39172 67040 77254 -26479 -103560 -15932 117138 34033 -205889 -100024 124415 177389
7725 177389 164070 197781 -10182 -113373 -23191 12046 -145346 -425759 -475711 -220568 -122602
7714a22602k13535q1073J34077J12154J49944L6495r9904k327P1345n6333P3038
7703A279J6999o8003j43485N6555K443J26857J34071J00037r139N1872q6564l4676
7691A48246l2670n9385j54933L1946o7623j2227J7161L5802J51481j4715n8764
7680a5681r641p085k07109K10434J97174Q2750j76667l03839L0391N9773N8799
7669h0701M9623M4696P8226j52070j46109l7602q1967J8943M9266j095j6690q863
7657b84343k5587J52980J36593Q8629l1987O8157L9431J7208j69479j06561p7534
7646a92493O0781J08827Q816J4453N3515j3820m752q9991m8579J8499j38756k5278
7634b48778P4782J22915r8770K3617J39969M8728j78076j54632l267J76804L8897
$$ plain form
7714 -122602 -336137 -417210 -283133 -170979 -21035 15460 -84444 -86771 -15426 -71759 1279
7703 1279 18278 -49725 -193210 -136655 -134212 -7355 126716 226753 217614 269486 182922 148246
7691 148246 115576 56191 -98742 -66796 -134419 -146646 -129485 -93683 57798 43083 -15681
7680 -15681 -25322 -32407 -239516 -29082 168092 250842 74175 -229664 -199273 -139500 -80701
7669 -80701 -31078 13618 91844 -60226 -206335 -243937 -325904 -306961 -257695 -258790 -275480 -284343
7657 -284343 -309930 -156950 -20357 68272 36285 104442 143873 161081 -8398 -114959 -192493
7646 -192493 -131712 -22885 -14069 384 53899 40079 35327 -54664 -103243 -84744 -223500 -248778
7634 -248778 -173996 -51081 -149851 -126234 13735 62463 -115613 -270245 -273512 -96708 -57811
7623e7811j2629j29725J36745J9098O5445r7130j8894M233M1549J55146j30479
7612b4452k4330L6983o8293o9517K2594j3595p9022P4533J39248J13994J09187
7601B17330o3481m6242k448j37178m6072N5822k0064O8175n2390o3353O6877J72776
7589A49752K457q32O0031M3795k05119M1968l236r9091L7221K43128O1388k70657
7577F0805j90909o1544J72676P6671r3064O4590R2719q8134O3482o5772j63789
7566a32269o079M7446j26261k0164J30710Q1500J21508j02862K4094J64426k0660
7555A61389q0172J2928J0362j46609k22198m7828J85072J04827j6538j98888J28017
7544a09638J60310N9335O2674j47875j10763M3763J01329P3541K2999m3078J9091
$$ plain form
7623 -57811 -70440 -200165 -63420 -44322 21123 -76007 -94901 -90668 -49119 106027 -24452
7612 -24452 -48782 -11799 -80092 -149609 -127015 -140610 -219632 -145099 -5851 108143 217330
7601 217330 153849 107607 105159 -32019 -78091 -22269 -42333 25842 -26548 -89901 -23024 149752
7589 149752 152209 151377 211408 255203 50084 92052 88816 -10275 26946 270074 331462 60805
7577 60805 -130104 -191648 -18972 57699 -35365 29225 121944 33810 97292 31520 -132269
7566 -132269 -138348 -90902 -217163 -237327 -106617 -25117 96391 -6471 17623 182049 161389
7555 161389 81217 94145 104507 -42102 -264300 -312128 -127056 -22229 -38767 -237655 -109638
7544 -109638 50672 110007 172681 24806 -85957 -42194 59135 132676 155675 112597 131688
7533A31688j02786r5176Q6674k7930N0946k3759m5913J09874R8933l6437N8291
7522B04405l7464j21171J23080j68269k14172j725r3029Q8854N5192k5116P1855
7511a17560N2375J02399K0038k8593r7370Q5804r803j59140N6751J18932p2785
7500d8952O5240J94990P7574K3017r8290o1926J536M1009q3976J22246J70330
7489D02798k03536l4958L8325r7688r2039P6730J16841k33076p7509R3799N9010
7478D8697L9177j08568n818k7521j33824L9563P3707J44047o0200j32424o9474
7467a92638O3065J99635Q0196Q9586J1700j35387o072q1931n2708Q675l5069n9705
7455a10653j20870q737j0873J07230J39425m506k94627m0589K05844P3522N5671
$$ plain form
7533 131688 28902 -66274 20400 -7530 43416 19657 -26256 83618 182551 146114 204405
7522 204405 166941 45770 168850 581 -213591 -215316 -308345 -219491 -164299 -189415 -117560
7511 -117560 -65185 37214 57252 28659 -68711 17093 7290 -151850 -95099 23833 -48952
7500 -48952 16288 211278 288852 311869 213579 151653 153189 194198 110222 232468 402798
7489 402798 199262 164304 202629 104941 12902 89632 206473 -26603 -104112 -10313 48697
7478 48697 87874 -20694 -26512 -54033 -187857 -148294 -74587 69460 9260 -123164 -192638
7467 -192638 -129573 70062 150258 239844 251544 116157 110085 28154 -24554 -15879 -50948 -110653
7455 -110653 -231523 -240260 -251133 -143903 -4478 -8984 -303611 -344200 -138356 -64834 -9163
7444i163M3664Q974q0155j28943O1531Q2220N9701Q4873j00831M7733O5830O575
7432A42009j43001k6592L0774r6919j0570j7017K1215J06819P5124m8766k7403
7421E673J25380k3389l6837Q6500M5665k5023j73418J08497l1604L5999j1704
7410A05739k88985j21570K09014L748M3096J42555l8794m8391l2502k16111j99037
7399d41238M2008K44282N8547j4237o4337k3339J17924K10857O3895j12470j54600
7388g2708j66425j41099J86048K40799p052j88565n8691J02308n723K8708L6353
7377d6047m9334L1094O5260j70674j82446J41226L5914M5821Q8360J24423l8812
7366D4785j0670L7174j44090m1574K15171J86503p9232J8803j50079M2850K2475
$$ plain form
7444 -9163 34501 43475 -36680 -165623 -104092 -21872 37829 122702 21871 69604 135434 142009
7432 142009 -992 -27584 3190 -93729 -104299 -121316 -100101 6718 81842 33076 5673
7421 5673 131053 107664 70827 157327 202992 177969 4551 113048 81444 117443 105739
7410 105739 -183246 -304816 -95802 -92054 -48958 93597 54803 6412 -26090 -242201 -441238
7399 -441238 -399230 -154948 -96401 -110638 -174975 -198314 -80390 130467 194362 81892 -72708
7388 -72708 -239133 -380232 -194184 46615 39563 -149002 -207693 -105385 -111108 -82400 -46047
7377 -46047 -95381 -64287 973 -169701 -352147 -210921 -175007 -129186 -40826 83597 44785
7366 44785 34115 71289 -72801 -114375 100796 287299 208067 226870 76791 119641 142116
7355A42116l23722R5802J32918L2317R1105j20770r4348Q238J02351N5991j53814
7344c1816o6730K3735k3753J746M1380L9359J04775N124J32387J43073n3155o2967
7332B53158j88915K2107q9327q0744o1016K1696M3945N5148m043o8788q7970J22033
7320f2716J32429L8126n940n895q8622j08054q4829J304K0331j60935k60367R9674
7308d85494K60794J59953P5653l7914o2221K0963P3818R7647j18313k25996j784
7297b42894O1397J7714m2498J34957J33598j5193j24969L7494Q1084j60263m1446
7286a61019p1756q1252L9167K9392J58059J03866p6567j90325j21675p8497J96348
7275b54259J97909N2334j6116J00109j25748L9761M3760j16513J3922J60248M3248
$$ plain form
7355 142116 -181606 -85804 47114 79431 170536 49766 -44582 -36344 66007 121998 -31816
7344 -31816 -98546 -74811 -98564 -96818 -55438 -16079 88696 93820 226207 369280 316125 253158
7332 253158 64243 86350 -2977 -83721 -144737 -123041 -79096 -23948 -27991 -96779 -184749 -62716
7320 -62716 69713 107839 101899 96004 7382 -100672 -185501 -184197 -163866 -324801 -585168 -485494
7308 -485494 -224700 -64747 10906 -27008 -89229 -68266 5552 103199 -15114 -241110 -242894
7297 -242894 -181497 -163783 -206281 -71324 62274 47081 -77888 -40394 40690 -119573 -161019
7286 -161019 -232775 -314027 -274860 -245468 -87409 16457 -60110 -250435 -372110 -450607 -254259
7275 -254259 -56350 -4016 -20132 79977 -45771 -6010 37750 -78763 -64841 95407 138655
7264A38655j61303m5281n0125q5004J91424J25848j9696j77975r7774K04447J05481
7253A28697L8533m6455j26813n1416m8556J60632P234j81096j39336r9402Q1378
7242b76600J00036N1722n3536n917N3058k4797l2841Q0249J15302p7314O3975
7231f663k9078O8153J17588R5953R762k05982k12448k4181J12562O7510K5546
7220A8722J4803O2899l2869j40657J60377J70210j23859k18175n7919J38091J40619
7209A32242l5458j62258L9241J73979m2491J33570k07075j03369k01751j60590
7199d33960J52554k3085q4505J97807K79496J99233p1101q2575p9692J07791m7068
7188A14895l1056k3022M5429J23775k28368k20043j68407O9819J61771R9525j34869
$$ plain form
7264 138655 -22648 -67929 -118054 -203058 -11634 114214 94518 -83457 -181231 23216 128697
7253 128697 167230 120775 -6038 -57454 -106010 54622 61856 -119240 -258576 -357978 -276600
7242 -276600 -176564 -124842 -178378 -184295 -131237 -156034 -188875 -108626 6676 -70638 -6663
7231 -6663 -35741 32412 150000 245953 255715 49733 -162715 -186896 -74334 -6824 18722
7220 18722 33525 96424 63555 -77102 83275 253485 129626 -88549 -146468 -8377 132242
7209 132242 96784 -65474 -26233 147746 105255 238825 31750 -71619 -273370 -433960
7199 -433960 -281406 -304491 -388996 -191189 88307 287540 216439 133864 54172 161963 114895
7188 114895 83839 60817 106246 230021 1653 -218390 -386797 -316978 -155207 -55682 -190551
7177a90551o8141L7635J29489L7847J40010j0405L3899j8585j84907l736n6283
7166a53728J90211J38169j47520n5773n7248J12429q2664j38183j67955j6805
7156c79067J37318L16839m0428K0528L4195P2025Q0782j48715J0816R8941j32991
7145G0243m8786Q4365K8951l0589j59219k88407l469L0924K0745J4518M0824K6232
7133b13668Q576J00481j037j56264j8139O3757j4934J31992J5493N2746Q9789
7122E8792n6729j27238j95174J9606J79676j8114l3718o7252K9917k9263K0271
7111b19226l324K466j3682J5252J02210N1324Q7518M1367P3610r6076J09695J34242
7099B85376J36814j31577k22744K6241J09149o5482j23661R1230j97436q3617
$$ plain form
7177 -190551 -258692 -221057 -91568 -53721 86289 75884 109783 91198 -93709 -97445 -153728
7166 -153728 36483 174652 27132 -28641 -85889 26540 -56124 -194307 -362262 -379067
7156 -379067 -241749 75090 34662 55190 89385 161410 242192 93477 104293 203234 70243
7145 70243 21457 105822 134773 104184 -55035 -343442 -346911 -315987 -295242 -280724 -239900 -213668
7133 -213668 -205092 -104611 -105648 -261912 -280051 -216294 -231228 -99236 -83743 -30997 58792
7122 58792 2063 -125175 -320349 -300743 -121067 -139181 -172899 -240151 -210234 -239497 -219226
7111 -219226 -222550 -220084 -233766 -218514 -116304 -64980 22538 63905 137515 41439 151134 285376
7099 285376 422190 290613 67869 94110 203259 137777 14116 105346 -92090 -175707
7089a75707K08948n4532k7015O6710j01877n184K20741q9349j69701O1620O1464
7078c882M3868j7925n2286q0238J01248O6533K0576j27144o7213L5357Q0295J24793
7066A23982q5350j28535J09616Q9494k08797o826J06245o8099k0445o8593K32119
7055G4811M409m8215J55472l3374j72340o4991J52602o9675l0683J4743o538m1526
7043f5305l8178P1436j7981L7114K9053R2024k2451j79567j18056j10661J55061
7032a67511J62023J93763Q2985O3149M8503o4844j44131m0844J54117q985k92438
7021a4213M2658P7565N5158n2731j67288j46188O6709m0224k2247Q3691L4376
7010h2734j6950J95845R806j10225m5065N9272r9117L180R9596l5771j62480M424
$$ plain form
7089 -175707 33241 -21291 -48306 18404 -83473 -88657 132084 42735 -126966 -65346 -3882
7078 -3882 39986 22061 -30225 -110463 -9215 57318 77894 -49250 -116463 -81106 -811 123982
7066 123982 38632 -89903 19713 109207 -99590 -106416 -171 -68270 -88715 -157308 74811
7055 74811 79220 31005 186477 153103 -19237 -84228 68374 -1301 -31984 -17241 -23779 -65305
7043 -65305 -103483 -32047 -50028 -12914 16139 108163 85712 -93855 -211911 -322572 -167511
7032 -167511 -5488 188275 271260 334409 382912 318068 173937 133093 287210 278225 -14213
7021 -14213 28445 106010 161168 108437 -58851 -205039 -138330 -178554 -200801 -117110 -82734
7010 -82734 -99684 96161 105967 -4258 -49323 9949 -89168 -85988 13608 -22163 -184643 -180219
6998a80219M9922j31123j14651L9622M2911L13199M4223M8567q884K1407O9311
6987A94285p4741j01509j15478n3423P8802J8864j09819p2796j0187N5473M2838
6976a47691J05816m8238K47824M7069k03068j61080l7502J7742L7052J14233N2458
6965B4615J05563M9029M3007j17780o5692M7299j04834j01654J73065K48400j3446
6954B87572j35780j96420j02655L4285R7375J32783J94834N014j41256L2215J00473
6943C08440P822J58717o0339j28508q2762n7107q7131J04745R5874K54402J66990
6932F81143l51411k87448r3872J30328J65828p1286O7431N4470r5187j46524m9444
6921D028Q9222N8030L0892M9524j42817K4947N3871R0553K4528k59189Q7935N644
$$ plain form
6998 -180219 -130297 -261420 -376071 -336449 -293538 19661 63884 112451 103567 124974 194285
6987 194285 119544 18035 -97443 -150866 -72064 -53200 -163019 -235815 -246002 -190529 -147691
6976 -147691 -41875 -90113 157711 204780 1712 -159368 -196870 -179128 -142076 -27843 24615
6965 24615 130178 179207 222214 104434 38742 86041 -18793 -120447 52618 301018 287572
6954 287572 151792 -44628 -147283 -112998 -15623 117160 311994 317008 175752 207967 308440
6943 308440 316262 474979 414640 286132 203370 146263 59132 163877 259751 514153 681143
6932 681143 329732 42284 -51588 78740 244568 173282 240713 295183 199996 53472 4028
6921 4028 93250 151280 182172 231696 88879 113826 167697 258250 282778 23589 111524 117168
6909A17168j11344Q0402J8593J2365Q6488R0609j01530m1709j08899q1023J4419
6898b4461J49328p9115n0811Q8388M587o6477R4486M6736n7973m0769l0324N5350
6886H8945p4911n9212j02531o4590O7654R6070Q9509L9998l2560o4828j24551
6875a41007q0074O622o1250Q5097L8091J97645o8967j29651P1966j1646P888J01035
6863A5749J85186N000Q9583j2712o3810k17905j09314J50200q678j20859m5973
6852a33533O8102J1529L3904N9397o5504j37608j24524K5073L8016j7029O773
6841b35404P3343Q3288j5314O0672r7575P1382J25159J62594M7301M5902R5498
6830D16846j13146J38597j53154j87240j50536M1988K4209j92898j77659K10315
$$ plain form
6909 117168 5824 86226 104819 117184 203672 294281 192751 151042 42143 -38880 -24461
6898 -24461 124867 45752 -5059 83329 87916 21439 115925 162661 104688 63919 33595 88945
6886 88945 14034 -45178 -147709 -212299 -144645 -48575 40934 80932 48372 -16456 -141007
6875 -141007 -221081 -214459 -275709 -190612 -152521 45124 -23843 -153494 -81528 -93174 -85286 15749
6863 15749 200935 205935 295518 282806 218996 1091 -108223 41977 33299 -87560 -133533
6852 -133533 -65431 -53902 -19998 39399 -26105 -163713 -288237 -263164 -225148 -242177 -235404
6841 -235404 -162061 -78773 -94087 -33415 -130990 -59608 65551 228145 275446 321348 416846
6830 416846 303700 442297 289143 101903 -48633 -6645 17564 -175334 -352993 -142678
6820a42678K39328P2823K9387P8055j94328k11502j3455j9337O0223l2693L0495
6809a03682J82615L5967L432j52946J17336Q675o9747K0858R3788J04301p2462
6798A68135m3670K08030j75072k15877m9498M3430O5553O0458M9244l1554k00170
6787a20991l1316O7643n9620K9403o1809n7808L6727O0246J95679J47947j25948
6776H0153j19200N5727J8870K4034n3932j00188n5173p2810L1923J62736J0443
6765a7417k8076J6150j16792j06867O7936J50548R893j3649Q8762n8343P4494
6754F6639J05889j03108j51145p9342o6158Q7414J87672j8754J28165P7842J37452
6743C72566J5934j85416l282j36734J0158o7173r1725J2979p0840n6517M062J38706
$$ plain form
6820 -142678 96650 169473 198860 276915 82587 -128915 -142370 -161707 -101484 -134177 -103682
6809 -103682 78933 114900 118332 -34614 82722 91397 21650 42508 136296 240597 168135
6798 168135 124465 332495 157423 -58454 -107952 -64522 1031 61489 110733 79179 -120991
6787 -120991 -152307 -84664 -144284 -114881 -176690 -234498 -197771 -137525 58154 206101 80153
6776 80153 -39047 16680 35550 59584 5652 -94536 -149709 -222519 -190596 -27860 -17417
6765 -17417 -45493 -29343 -146135 -253002 -185066 -34518 -24625 -38274 50488 -7855 66639
6754 66639 172528 69420 -81725 -161067 -227225 -139811 47861 29107 157272 235114 372566
6743 372566 388500 203084 199802 63068 73226 6053 -85672 -72693 -143533 -200050 -195988 -57282
6731e7282l9258k1408K3265o9404K91799J87854J05676O6500j57673j93007k18157
6720h1095J3217P9845j09977j42831J14075M3682K9090J30761J15924K0669k74780
6709f1420j06581O8284J06753K4203N874k63541L1482J58539o6129m0813K8816
6698a14533n9100l188m2299j08363q6896P3300J24245R0729O4419Q6524K9566
6687E4404q840R1665m4564j09651j8296j01673l5522n9590l8787l4962q0105N9626
6675c26295P6881J01723M3309K1800j17281m1165k2419j059J70627J23519j64615
6664a34975j009N8483L0630N5977K4493J04794N2881n9615k51390K4442J21202
6653B5913j39975O1573j09121J3502J36178P5467q4704j148J36009L9714j03360
$$ plain form
6731 -57282 -96540 -117948 -94683 -164087 127712 315566 421242 487742 330069 137062 -81095
6720 -81095 -67878 11967 -98010 -240841 -126766 -83084 -53994 76767 192691 213360 -61420
6709 -61420 -168001 -99717 7036 31239 37113 -226428 -194946 -36407 -102536 -143349 -114533
6698 -114533 -173633 -176821 -219120 -327483 -414379 -341079 -216834 -126105 -61686 24838 54404
6687 54404 45564 137229 92665 -16986 -35282 -136955 -172477 -232067 -270854 -305816 -385921 -326295
6675 -326295 -249414 -147691 -104382 -82582 -199863 -241028 -263447 -264506 -93879 29640 -134975
6664 -134975 -135984 -77501 -46871 9106 33599 138393 191274 131659 -119731 -95289 25913
6653 25913 -114062 -52489 -161610 -148108 -11930 63537 -21167 -22315 113694 153408 50048
6642E0048j53150l4083j0920M4111j0172M8422O1932j70258l4730J69474o7150
6631a06476L9112J45133K9253k1675l5647j18783R8296N1171R660Q7140J37237
6620C14421O8833j74573l7533j70878j05417Q3281o740N2401q0417J10556r0592
6609c6658q7517J76162J02333n9420K7609l1684j8022k7273L7242P6352p4239
6598H4885j53266l1884k7773j81924l5172Q4462J74527K01402K8489q8000K40642
6587B96388K35565p8101o5191j01355j07473L5266M4153k4636j85077j56910M9178
6576e8193L0469M3974j7683n0348J11921J3633L2513n7563Q3668q9557l9619O307
6564I522P3059q5935j06266N5506O2068O7997n8036j73747k6573K7304M3559q9893
$$ plain form
6642 50048 -103102 -137185 -148105 -103994 -114166 -65744 -3812 -174070 -208800 -39326 -106476
6631 -106476 -67364 77769 107022 85347 49700 -69083 29213 80384 90044 177184 314421
6620 314421 383254 208681 171148 270 -105147 -21866 -28606 23795 -56622 53934 -36658
6609 -36658 -124175 51987 154320 94900 122509 90825 72803 45530 82772 159124 84885
6598 84885 -68381 -100265 -128038 -309962 -345134 -260672 -86145 115257 143746 55746 296388
6587 296388 531953 453852 388661 287306 179833 215099 259252 234616 49539 -107371 -58193
6576 -58193 -27724 16250 -1433 -51781 60140 73773 106286 48723 132391 42834 3215 9522
6564 9522 82581 -3354 -109620 -54114 7954 75951 17915 -155832 -182405 -155101 -111542 -201435
6552b01435P90J80292j23960K7930Q2358n707j68898L784P7105K05332m5217k30283
6540a97909M2694J29073J36422Q2543p2099R3663J42279o1783o6350j23339L4321
6529A39515L0439M0281p6107k23862m6413M0538M4904J09853R4097o6499j53149
6518f6403r2790M3596J8084P7973P990j51291J97318J60718O37R2263k6368m6868
6506B14859j96875L1632L7528j22055k267q258m9952n9408J58030K31733o4411
6495A70556k50206J27798J37899j47053k62590J43210J64214R2604r9360o797
6485G0275K9577n4464L2761n378J43640J34360j07342k9368l8996l2014q0853
6474F2198p2106r6789j5288J32602J54529p0811m0680L1609j0541J57271o824
$$ plain form
6552 -201435 -200645 -20353 -144313 -116383 -34025 -39732 -208630 -204846 -127741 77591 32374 -197909
6540 -197909 -155215 -26142 110280 192823 120724 214387 356666 294883 228533 105194 139515
6529 139515 169954 210235 134128 -89734 -136147 -95609 -50705 59148 153245 86746 -66403
6518 -66403 -159193 -115597 -97513 -19540 -11550 -162841 34477 195195 195832 288095 261727 214859
6506 214859 17984 49616 87144 -34911 -37178 -45436 -95388 -154796 3234 234967 170556
6495 170556 -79650 48148 186047 38994 -223596 -80386 83828 176432 77072 70275
6485 70275 99852 45388 78149 72771 216411 350771 243429 214061 175065 143051 62198
6474 62198 -9908 -106697 -121985 10617 165146 94335 53655 85264 74723 231994 225170
6463B25170k45994m7943M2787o7805M5403J9866r4159q7330k5931J51667J90258
6452A05989N7388j04786j04474r6925L3403Q4790N5098j71594P045P0384K2319
6441d1363O7478J2464q9748J45655P0052j37774l1572O8982n5716q2672j61471
6430b35685p0198P7971j9358N8923P2879j77074k7873L77151K1942j01528Q8417
6419F5567K2037j59310p8293J31262J18837j6034O025n300j41162j44251J43817
6408e6805n7267k20856m3201J09135J51720P9192q379k0898m3331K5226J13404
6397B7940K04197j50183j41701N163J0965M6267J61805J06874j5009j32030j51691
6386b7403j1924j20888q7943L0295K7349P2279p2494m0990J73203N2794P5183
$$ plain form
6463 225170 -20824 -68767 -25980 -93785 -48382 -28516 -122675 -210005 -235936 -84269 105989
6452 105989 163377 58591 -45883 -142808 -109405 -24615 30483 -141111 -134066 -63682 -41363
6441 -41363 26115 38579 -51169 94486 164538 26764 -4808 64174 8458 -74214 -235685
6430 -235685 -305883 -227912 -247270 -188347 -115468 -292542 -320415 56736 78678 -22850 65567
6419 65567 87604 -71706 -149999 -18737 100100 84066 90091 84791 -56371 -200622 -56805
6408 -56805 -114072 -334928 -378129 -268994 -117274 -38082 -46461 -67359 -110690 -85464 27940
6397 27940 232137 81954 -59747 -54584 -43619 2648 164453 271327 256318 124288 -27403
6386 -27403 -39327 -160215 -248158 -217863 -190514 -118235 -190729 -231719 -58516 -5722 69461
6375F9461K50910J09003j83962j08726r340J24155j56366r9501J02601n4569j26739
6364h3073J29627m0349p9964J2331Q5862J8065N7078r8111k56233j96652Q2342
6353c69077J78502J79650m4173j06533k13970K393J31772j7738K11258l5287O369
6342g6834m3888N749O2284Q1529j77813o5901M1923j0072L0661J5115J78263J25447
6330A66463P8804J2324j07687j06959q3344M0537j44505P2822o3769j43668J16369
6319a62613J77453J30999j22752m7615j4822m1214J62285r0656k21320m2205P3188
6308a99272J55646Q5380p4143J4731P7954M4260J0325P7468p3765j11534J29305
6297A36355J6497k4919O041q2424j0697L1947Q0797n8713N1090O8361q7396j15073
$$ plain form
6375 69461 320371 429374 245412 136686 127346 251501 95135 -4366 98235 43666 -83073
6364 -83073 46554 6205 -73759 -61428 24434 42499 99577 1466 -254767 -451419 -369077
6353 -369077 -190575 -10925 -55098 -161631 -375601 -373208 -241436 -259174 -47916 -83203 -76834
6342 -76834 -120722 -114973 -52689 28840 -148973 -214874 -172951 -183023 -152362 -137247 41016 166463
6330 166463 245267 257591 149904 42945 -40399 138 -144367 -71545 -135314 -278982 -162613
6319 -162613 14840 145839 23087 -24528 -39350 -80564 81721 -8935 -230255 -272460 -199272
6308 -199272 -43626 41754 -32389 -17658 60296 104556 114881 192349 118584 7050 136355
6297 136355 152852 127933 133974 51550 40853 72800 153597 94884 145974 214335 126939 11866
6285A1866R187K5354L9252Q6749K0206q6338j10263P5754K3063l4836j11746P3327
6273B1575r8139r5910m7851q7666J22299K1790K34990O9096R0451J01403k10612
6262A21426j66543Q0059m2528k3135O0383l2112j15701M5460M1941j2280P6654
6251C3624L5633j10352p2032q790o5159N1940J43759r766r7353P6197k4004J9883
6239b6420k15151R7013J90954N0984j36456k01503j2606J75463N7859K734j6197
6228c3326r7990p43J03760J8025Q6658L095m4620o519L2306J827q2012j0314J2539
6215a7314p6128O2370j23828N679K57816P6404j17429q8355J11602J50148N1397
6204B92362K3858j98281n0326O6447j17976P7354k75932K8986J00381j10246K9982
$$ plain form
6285 11866 21053 46407 85659 172408 192614 106276 -3987 71767 94830 59994 -51752 21575
6273 21575 -76564 -172474 -220325 -307991 -185692 -163902 71088 140184 230635 332038 121426
6262 121426 -45117 34942 -7586 -30721 29662 -2450 -118151 -72691 -30750 -43030 33624
6251 33624 69257 -41095 -113127 -121917 -187076 -135136 8623 -1143 -98496 -22299 -46303 -26420
6239 -26420 -241571 -144558 46396 97380 -39076 -240579 -253185 -77722 -19863 -17129 -33326
6228 -33326 -131316 -132059 -28299 -10274 76384 79479 34859 28340 60646 62473 -19539 -29853 -17314
6215 -17314 -93442 -31072 -154900 -149221 108595 184999 67570 -20785 90817 240965 292362
6204 292362 316220 117939 67613 134060 16084 93438 -182494 -153508 -53127 -163373 -133391
6193a33391o8872o7255K7159J65966L4099J4045q6156l1810o8709J06261M3001
6182f5662j60461l0509n0848J36608P9466J08125l8791N0876j22908J26848N1763
6171H4507o8314j2660p8924k22178j39078L30322K02669o942j06260Q2998N3042
6160A19182n9178r1375m0307k8066j6550m3200P2377N7367Q9322J8716j49430
6149g1142J05843J06734n2820L465k1346k5046q3016o1714o4306M0973J70855
6138D8480L6181J26247j61701j04272L4815l8929n3276l3585J24791L0304K57
6127I312K1784m7103M538R617K2739m5648m190n1040j2736O3166J53674J66786
6115B90899l9253j19292J05185j27177j50751J40932P475j29135q6297O7095m4910
$$ plain form
6193 -133391 -202263 -269518 -242359 -76393 -42294 -28249 -114405 -146215 -214924 -108663 -65662
6182 -65662 -226123 -256632 -307480 -170872 -91406 16719 -22072 28804 -94104 32744 84507
6171 84507 16193 3533 -75391 -297569 -436647 -106325 96344 89402 -16858 66140 119182
6160 119182 60004 -31371 -71678 -99744 -116294 -159494 -87117 -29750 59572 78288 -71142
6149 -71142 34701 141435 88615 92080 70734 45688 -37328 -99042 -163348 -122375 48480
6138 48480 84661 210908 49207 -55065 -20250 -59179 -112455 -146040 -21249 9055 9312
6127 9312 31096 -16007 -11469 -1852 20887 -24761 -28951 -79991 -92727 -29561 124113 290899
6115 290899 251646 132354 237539 110362 -40389 100543 108018 -21117 -107414 -40319 -85229
6104h5229p7233k9455L0615p4960O5045L5494J52389N3624J34674L0877o4103
6093A71738q6293j1888o0470Q4115l7300p1582P6622q4957j53847P8594k9390
6082a24658j23671q137J07426J77358k1037k34551P3354J86389j7458j51293l9394
6071a75672L334N6921Q084k4767K24411k9314j06423J03285N1887j34905j18571
6060a41730k21476m9098J94413R4049L7171K02341Q4975p5110m5105k3859k0503
6049C6068j01134j97269j9665N1641l4194J27891N1572j05508Q2535l0706N8749
6038h0020k9094J98163K2935q3903P1012m9945j06881m1104N3715K31140Q8917
6027B74935q400n8541j40135O0711J16135L3037m8646R468j810N0706p6840j82573
$$ plain form
6104 -85229 -162462 -191917 -161302 -236262 -171217 -135723 16666 70290 204964 235841 171738
6093 171738 85445 73557 13087 97202 59902 -11680 64942 -20015 -173862 -95268 -124658
6082 -124658 -248329 -256466 -149040 28318 7281 -227270 -153916 32473 15015 -136278 -175672
6071 -175672 -172338 -115417 -107333 -132100 92311 62997 -43426 59859 111746 -23159 -141730
6060 -141730 -363206 -412304 -217891 -123842 -86671 115670 200645 125535 80430 56571 36068
6049 36068 -65066 -262335 -282000 -230359 -264553 -136662 -85090 -190598 -108063 -138769 -80020
6038 -80020 -109114 89049 111984 28081 99093 49148 -57733 -98837 -45122 186018 274935
6027 274935 266535 207994 67859 128570 244705 277742 229096 238564 236754 287460 210620 28047
6015B8047r9267l1456q310Q3969m2959J77639J25102J6388J29658J3272J39542
6004E31625k06819j82775m7349K8210J5895J38535J19353j05598j54866p8297
5994E7914Q1775j53360j35367K8662R8219J25350Q6129j58622j46880K9602n5850
5983a42428l5610j1698J54702O1884R8676J35934P325k06979j76867n5092K6059
5972a44094J09590o452o1650K8611J21482p0362k52486L6519k0207M6810L04609
5961I2370J41521m6176n80N3086k9250j09919j9274o6775j1692N7324J72374N859
5949B38868n2675q7894k5432o2825p0963M6802J99050N0156o244j4362p424k30377
5937b3320j23256O7315q8721P2961K17426J04759j47911p1295k6686Q7293J3967
$$ plain form
6015 28047 -71220 -102676 -110986 -27017 -69976 107663 232765 249153 378811 392083 531625
6004 531625 324806 142031 94682 122892 138787 277322 396675 291077 136211 57914
5994 57914 139689 -13671 -149038 -120376 -22157 103193 189322 30700 -116180 -86578 -142428
5983 -142428 -178038 -189736 -35034 26850 125526 261460 268785 61806 -115061 -170153 -144094
5972 -144094 -34504 -40956 -102606 -73995 47487 -22875 -275361 -238842 -259049 -212239 92370
5961 92370 233891 187715 187135 240221 210971 101052 81778 15003 3311 60635 233009 238868
5949 238868 186193 98299 72867 10042 -60921 -14119 184931 235087 228843 214481 207057 -23320
5937 -23320 -146576 -79261 -167982 -95021 122405 227164 79253 7958 -18728 68565 82532
5926H2532n9342j27325J37755j00631j03605K13548O2622j31767q7102N3581R105
5915e0629J22643o052p9208K03159N8391R9358K8193q0828K467j14618r2420n8815
5903C1641o6470p7943O6807O3281j25482j9715R5225M8883J95448R0442j99827
5892A02290j34571k1143L212J7800m2363j8138m566O7608Q477j13582p6288O8176
5880a43088l7667q8928m9889k503Q5822J9976L1643J9302r751J39540K16055J68894
5868C49406l4670j28192j71596j47017M4698K78727J28092N110j22865j34233
5858F7460j02532j046J65242m7389l1300M3968k6612N4622J12964p5407k37875
5847g7905R415J74216P3001q1872k8771K09331J131n1785k2150J5515n1502n7217
$$ plain form
5926 82532 23190 -104135 33620 -67011 -170616 42932 105554 -26213 -113315 -59734 -50629
5915 -50629 72014 65962 -13246 189913 248304 347662 375855 295027 297494 182876 90456 31641
5903 31641 -34829 -112772 -45965 17316 -108166 -127881 -32656 16227 211675 302117 102290
5892 102290 -32281 -53424 -50212 -32412 -74775 -92913 -97479 -29871 -21394 -134976 -211264 -143088
5880 -143088 -180755 -269683 -319572 -322075 -236253 -216277 -184634 -165332 -175083 -35543 180512 349406
5868 349406 314736 186544 14948 -132069 -87371 191356 319448 324558 201693 67460
5858 67460 -35072 -36118 129124 81735 50435 94403 67791 122413 235377 159970 -77905
5847 -77905 -68490 105726 178727 96855 68084 277415 278546 226761 204611 220126 168624 111407
5835A11407k26562n7732O0632P7646J8893P7856J25959o8640p7476l8971P8915
5824H1927M4188r2702j27717l8403K7496J04062J23608R4537r7823K831j1383
5813A10621O2302j50680k79020o9098J21968J26638p0194L4810M7627j39869M6675
5802a58220J51030J7541O2379q5787K8633J6272o4851j33208O9189N5532N2099
5791A0609M4575m0842p5346j13688p128m4079J56761l9728P6792N0690j43287
5780a24671K19876m5198k30820j48636K6577m5490N6362J67344J55222K22070
5770B52636r8556p7336J44443M1891k0219N0403j29244o5650O9407p9243l894
5759H4638O5709j30823l0911J20003J58776N0884j05237j73298j54401m642N951
$$ plain form
5835 111407 -115155 -172887 -112255 -34609 -15716 62140 188099 119459 41983 3012 81927
5824 81927 126115 33413 -94304 -132707 -105211 -1149 122459 216996 119173 122004 110621
5813 110621 172923 22243 -256777 -325875 -203907 -77269 -147463 -112653 -65026 -204895 -158220
5802 -158220 -7190 10351 72730 -13057 15576 31848 -33003 -166211 -97022 -41490 10609
5791 10609 55184 14342 -61004 -174692 -181820 -225899 -69138 -108866 -32074 18616 -124671
5780 -124671 95205 50007 -180813 -329449 -302872 -348362 -292000 -124656 30566 252636
5770 252636 154080 76744 221187 263078 242859 293262 164018 98368 167775 88532 84638
5759 84638 150347 19524 -11387 108616 267392 318276 213039 39741 -114660 -119302 -113351
5748a13351J52225J01013J05460N2359J7891K0378M9500k04294j41019n4704o9470
5737h4012p5159n8613r3490k9627P3141N7227K741J73934N9514m5023m7488o0425
5725a27280l3616p6799K42969N942j55755l0652K6629P8998J54737J55333j3178
5714B27328k6451k00078M827J68807l5628p1953p4002o2021j009Q518j0821N384
5702f7099n7230j23638Q2078J301k8319Q5562N8548N2958M4619P797m6062J75115
5690A85630K5775j40117J2279P7152k31292k3101J43876R5678j72153J333J9811
5679e129O6331j3272K8588q3453K4631j1870o040J88927N5921j5615j883k32975
5667e839k47113N1464J01796j15837n6262J60011Q9247q0556l1242j11456Q120
$$ plain form
5748 -113351 38874 139887 245347 297706 315597 335975 385475 181181 40162 -14542 -84012
5737 -84012 -159171 -217784 -311274 -340901 -267760 -210533 -207792 -33858 25656 -19367 -66855 -127280
5725 -127280 -160896 -237695 5274 11216 -144539 -175191 -148562 -69564 85173 240506 227328
5714 227328 200877 799 5626 174433 138805 66852 -7150 -69171 -70180 -61662 -72483 -67099
5702 -67099 -124329 -247967 -165889 -164588 -192907 -107345 -48797 4161 48780 56577 10515 185630
5690 185630 211405 71288 83567 160719 -70573 -93674 50202 145880 -26273 -24940 -5129
5679 -5129 61202 47930 76518 -6935 17696 5826 -214 188713 244634 229019 227136 -5839
5667 -5839 -252952 -201488 -99692 -215529 -271791 -111780 -22533 -103089 -134331 -245787 -237667
5656b37667J39161M4186k4019j38834M7133K79154J02118j12771k0244p5472j75453
5645a72708J45O5690o1004j28275O0164M1191N30k0371n8939K8689K60148N8038
5633G3298j42152j61875q1549O7504J88711O483j19169l3946n0959J03375J28448
5622b1831r8295j01569L9023J48501n7740k8754P4433R420j50073K5525R0953
5611g0407K15739O1325j28379n5298O42j05160J25123o480M2502K0416j3141j00317
5599a3435J06577O2001k81251j31276l5615K17605J65431j17196p7009J05248
5589A080l7382j12882j45391q020K01971R2643P4315M08j6732p4925k5222j28606
5577a78743N9097m9208P2790L4061p1176P3482j6077l5750l3416m7456Q6154J46684
$$ plain form
5656 -237667 -98506 -54320 -78339 -217173 -170040 109114 211232 98461 78217 2745 -172708
5645 -172708 -172563 -106873 -167877 -296152 -235988 -194797 -194267 -214638 -273577 -244888 15260 73298
5633 73298 -68854 -230729 -312278 -244774 -56063 -49580 -168749 -202695 -253654 -150279 -21831
5622 -21831 -120126 -221695 -182672 -34171 -91911 -120665 -46232 -36812 -186885 -161360 -70407
5611 -70407 145332 206657 78278 22980 23622 -81538 43585 37105 79607 100023 86882 -13435
5599 -13435 93142 155143 -126108 -257384 -292999 -75394 90037 -27159 -104168 1080
5589 1080 -36302 -149184 -294575 -302595 -100624 -7981 66334 66742 50010 -24915 -50137 -178743
5577 -178743 -119646 -168854 -96064 -62003 -133179 -59697 -75774 -111524 -144940 -192396 -106242 40442
5565D0442p7747p0579k04961l8267K20721j6379J42036J80105J07838j54861k00448
5554g2100k8187N0606k1878J56209q5040j3205j419j21060N4737J41392J43198
5543B03253j14737m1827m4027R2225n3847j49553j73404L8059K42123J88017K6758
5532B13040r6753j52419j07077Q8707M5412k6652q2251J44370N8141j16507O3550
5521C1561J33149O7487J45262j06286j28850K5088j11826j24680r4955R4306o4029
5510a33773k64779O7118L33368m4018q7715q2314l0157J5142J39187J15040l0952
5499c853j04759L6609P7058J51033K9317M5509k197j25546r7393Q3125K3454m7644
5487F4713q1890M7876K2898k0974j64310l2022j6560q4845K4469K09293L4122
$$ plain form
5565 40442 -37305 -107884 -312845 -351112 -130391 -146770 -4734 175371 283209 128348 -72100
5554 -72100 -100287 -49681 -71559 84650 -390 -13595 -15014 -136074 -81337 60055 203253
5543 203253 88516 46689 2662 94887 41040 -108513 -281917 -243858 -1735 186282 213040
5532 213040 116287 -36132 -143209 -54502 -9090 -35742 -117993 26377 84518 -31989 31561
5521 31561 164710 232197 377459 271173 142323 167411 55585 -69095 -164050 -69744 -133773
5510 -133773 -398552 -331434 1934 -42084 -129799 -212113 -242270 -227128 -87941 27099 -3853
5499 -3853 -108612 -72003 5055 156088 185405 230914 228717 103171 5778 88903 112357 64713
5487 64713 -17177 30699 53597 32623 -131687 -163709 -180269 -265114 -240645 -31352 2770
5476B770K650n1247O0747J74495J38274N747k22351k20174M480J29618N4155o8165
5464A0999j1092k2116l5813N4351j8632j49118J7532J55732J72295R3734k9873
5453B37999j73495O0212K9605k44763j00720J03337K26679o8974j44132j25849
5443b00101Q7963M3342R9745J03653k7489L7097K8151j60461r1678M4177K0052
5432a5549j99995M4082J36461q1122m846J79455O0646N9603j7147r0853m2141
5421B8594J45257O5097j12769j24599j7026J15962k3591p7390J9376j39253j62865
5410b83207j23064P4456J15868J10947J6640M4548J93405q3831M3064j61663j0210
5399f3047J08430m164N5323J06173q1810k02307l6536j75216J10607K29598R0560
$$ plain form
5476 2770 5420 -45827 14920 189415 327689 333436 111085 -109089 -104609 25009 79164 10999
5464 10999 -93 -22209 -58022 -3671 -22303 -171421 -153889 1843 174138 267872 237999
5453 237999 64504 124716 154321 -90442 -191162 -87825 138854 69880 -74252 -200101
5443 -200101 -112138 -68796 30949 134602 107113 144210 172361 11900 -79778 -35601 -15549
5432 -15549 -215544 -171462 -35001 -116123 -120969 58486 119132 178735 161588 70735 28594
5421 28594 173851 238948 126179 1580 -15446 100516 76925 -465 18911 -120342 -283207
5410 -283207 -406271 -331815 -215947 -105000 -88360 -43812 149593 65762 108826 -52837 -63047
5399 -63047 45383 41219 96542 202715 120905 -81402 -117938 -293154 -182547 47051 137611
5388A37611j64233j09094M5305J21710n7870r0602P913q0820Q9620p873j27086
5377b35419K0540p220k7783K4854j199J28257J7718j9034o1872O7182J21480N4028
5365H1532n1992N8022J12442K1577k51879j10332K9725O0177n3146j13584N9319
5354a58139R1187P2729K8588j05148n2601l9800M4910J22564N5029n2906O6657
5343G3070N6545K3307j81421q8135R1569J25118m2122j6550R7894P1208M2854
5332B53337j71413k59950J06660K37435N1631K6159P2996K3452n4600j28985p2546
5321H4176k6801j8297p0498l1540l3940n8562J04567K7807L3178j50026p0296
5310b10232J81970J15051n3042r0172L6108l1172l5388K7343J26575m2895n8126
$$ plain form
5388 137611 -26622 -135716 -90411 31299 -26571 -117173 -109260 -190080 -100460 -108333 -235419
5377 -235419 -214879 -222099 -249882 -225028 -226227 -97970 -80252 -99286 -161158 -93976 27504 81532
5365 81532 29540 87562 200004 221581 -30298 -140630 -110905 -50728 -103874 -217458 -158139
5354 -158139 -66952 5777 34365 -70783 -123384 -163184 -118274 4290 59319 6413 73070
5343 73070 129615 152922 -28499 -116634 -25065 100053 57931 41381 139275 210483 253337
5332 253337 81924 -178026 -71366 166069 217700 243859 316855 340307 285707 156722 84176
5321 84176 57375 39078 -31420 -62960 -96900 -155462 -50895 -23088 10090 -139936 -210232
5310 -210232 -28262 86789 33747 -56425 -20317 -51489 -86877 -59534 67041 24146 -33980
5299c3980j36069k14957O2008J22642O6761J5724k3778J05866M1984l99o4283
5288e8481j32266j24745K9407J59491J16886l0119q6035Q0079R3540J34011L2224
5277B13992k24194j55574J346K00810N0286p7636j23610p9752k7903K71504O2782
5266A12051K4673p8860q8205j0633j18867l9628K54071k6475K70401J67887j91330
5255B75085j99057n2067M3395p6188m8528K732m1150L2083O6970l4302j96390
$$ plain form
5299 -33980 -170049 -385006 -322998 -200356 -133595 -117871 -141649 -35783 6201 5802 -58481
5288 -58481 -190747 -315492 -286085 -126594 -9708 -39827 -125862 -45783 47757 181768 213992
5277 213992 -10202 -165776 -164430 36380 86666 9030 -114580 -194332 -222235 49269 112051
5266 112051 136724 57864 -30341 -40974 -159841 -199469 54602 28127 298528 466415 275085
5255 275085 76028 23961 67356 -8832 -57360 -54628 -95778 -63695 3275 -31027 -227417
$$ [...]
##END NTUPLES=NMR SPECTRUM
##END=
