##TITLE=Analysis number 318470
Compound Code tl 00799
Project Code adrs
Chemist Name endeavour
##JCAMPDX= 6.0         $$ Bruker NMR JCAMP-DX V2.0
##DATA TYPE= NMR SPECTRUM
##DATA CLASS= NTUPLES
##ORIGIN= Bruker BioSpin GmbH
##OWNER= nmr
$$ XWIN-NMR		Version 3.5
$$ Wed Mar 29 15:59:51 2006 GMT Daylight Time (UT+1h)  MAYBRIDGE\nmr@NMR_250MHZ
##.OBSERVE FREQUENCY= 250.131544655141
##.OBSERVE NUCLEUS= ^1H
##.ACQUISITION MODE= SIMULTANEOUS (DQD)
##.ACQUISITION SCHEME= undefined
##.AVERAGES= 16
##.DIGITISER RES= 18
##SPECTROMETER/DATA SYSTEM= dpx250
##.PULSE SEQUENCE= zg30
##.SOLVENT NAME= DMSO
##.SHIFT REFERENCE= (INTERNAL, DMSO, 0, 16.522)
##AUDIT TRAIL= $$ (NUMBER, WHEN, WHO, WHERE, WHAT)
$$ ##TITLE= Audit trail, XWIN-NMR		Version 3.5
$$ ##JCAMPDX= 5.01
$$ ##ORIGIN= Bruker BioSpin GmbH
$$ ##OWNER= nmr
$$ C:\u/data/dgb/nmr/ADRS/1780/pdata/1/auditp.txt
$$ ##AUDIT TRAIL=  $$ (NUMBER, WHEN, WHO, WHERE, WHAT)
(   1,<2006-03-29 15:59:29.25 +100>,<MAYBRIDGE\nmr>,<NMR_250MHZ>,
      <created by zg, POWCHK disabled, PULCHK disabled
       configuration hash MD5:
       84 BC 41 DB A1 6E 1D 46 DA 25 12 A5 C1 ED C5 3A
       data hash MD5: 64K
       3C 07 EC A1 D8 12 6C C7 3A 76 00 4F 54 51 05 87>)
(   2,<2006-03-29 15:59:42.50 +100>,<MAYBRIDGE\nmr>,<NMR_250MHZ>,
      <Start of raw data processing
       ef LB = 0.3 FT_mod = 6 PKNL = 1 SI = 32K 
       data hash MD5: 32K
       DB 1B 2C BE 1B 86 F0 8A CE 15 AC B4 90 4C 56 7F>)
(   3,<2006-03-29 15:59:44.05 +100>,<MAYBRIDGE\nmr>,<NMR_250MHZ>,
      <apk 
       data hash MD5: 32K
       D4 B6 F5 9D 34 95 89 1D 82 25 3B E7 67 DC 19 76>)
(   4,<2006-03-29 15:59:44.99 +100>,<MAYBRIDGE\nmr>,<NMR_250MHZ>,
      <abs ABSG = 5 
       data hash MD5: 32K
       15 B0 C4 DB D8 2D CD F7 61 B8 DC CC A4 D8 BD C4>)
$$ ##END=
$$ 
$$ hash MD5
$$ CF D7 70 DA B7 3E 07 C8 B9 F2 F2 72 55 AE F5 82
##$RELAX= 
##$RELAX= 
##$RELAX= 
##$RELAX= 
##$RELAX= 
##$RELAX= 
##$RELAX= 
$$ Bruker specific parameters
$$ --------------------------
##$DU= <C:\u>
##$EXPNO= 1780
##$NAME= <ADRS>
##$PROCNO= 1
##$TYPE= <nmr>
##$USER= <dgb>
##$AMP= (0..31)
100 100 100 100 100 100 100 100 100 100 100 100 100 100 100 100 100 100 
100 100 100 100 100 100 100 100 100 100 100 100 100 100 
##$AQSEQ= 0
##$AQ_mod= 3
##$AUNM= <au_zg>
##$AUTOPOS= <49 >
##$BF1= 250.13
##$BF2= 250.13
##$BF3= 250.13
##$BF4= 250.13
##$BF5= 500.13
##$BF6= 500.13
##$BF7= 500.13
##$BF8= 500.13
##$BYTORDA= 1
##$CFDGTYP= 0
##$CFRGTYP= 5
##$CHEMSTR= <none>
##$CNST= (0..31)
1 1 145 1 1 1 1 1 1 1 1 1 1 1 1 1 1 1 1 1 1 1 1 1 1 1 1 1 1 1 1 1 
##$CPDPRG= <>
##$CPDPRG1= <>
##$CPDPRG2= <>
##$CPDPRG3= <>
##$CPDPRG4= <mlev>
##$CPDPRG5= <mlev>
##$CPDPRG6= <mlev>
##$CPDPRG7= <mlev>
##$CPDPRG8= <mlev>
##$CPDPRGB= <>
##$CPDPRGT= <>
##$D= (0..31)
0 1 0 0 0 0 0 0 0 0.06 0 0 0 0 0 0 0.0002 0 0 0 0 0 0 0 0 0 0 0 0 0 0 
0 
##$DATE= 1143644367
##$DBL= (0..7)
120 120 120 120 120 120 120 120 
##$DBP= (0..7)
150 150 150 150 150 150 150 150 
##$DBP07= 0
##$DBPNAM0= <>
##$DBPNAM1= <>
##$DBPNAM2= <>
$$ [...]
##$SUBNAM6= <"">
##$SUBNAM7= <"">
##$SUBNAM8= <"">
##$SUBNAM9= <"">
##$SW= 20.6930455092707
##$SWIBOX= (0..15)
0 0 3 0 0 0 0 0 0 0 0 0 0 0 0 0 
##$SW_h= 5175.983436853
##$TD= 65536
##$TD0= 1
##$TE= 295.16
##$TE2= 300
##$TE3= 300
##$TEG= 300
##$TL= (0..7)
0 120 120 120 120 120 120 120 
##$TP= (0..7)
150 150 150 150 150 150 150 150 
##$TP07= 0
##$TPNAME0= <>
##$TPNAME1= <>
##$TPNAME2= <>
##$TPNAME3= <>
##$TPNAME4= <>
##$TPNAME5= <>
##$TPNAME6= <>
##$TPNAME7= <>
##$TPOAL= (0..7)
0.5 0.5 0.5 0.5 0.5 0.5 0.5 0.5 
##$TPOFFS= (0..7)
0 0 0 0 0 0 0 0 
##$TUNHIN= 0
##$TUNHOUT= 0
##$TUNXOUT= 0
##$USERA1= <user>
##$USERA2= <user>
##$USERA3= <user>
##$USERA4= <user>
##$USERA5= <user>
##$V9= 5
##$VALIST= <valist>
##$VCLIST= <CCCCCCCCCCCCCCC>
##$VD= 0
##$VDLIST= <DDDDDDDDDDDDDDD>
##$VPLIST= <PPPPPPPPPPPPPPP>
##$VTLIST= <TTTTTTTTTTTTTTT>
##$WBST= 1024
##$WBSW= 4
##$XGAIN= (0..3)
0 0 0 0 
##$XL= 0
##$YL= 0
##$YMAX_a= 387844
##$YMIN_a= -504339
##$ZGOPTNS= <>
##$ZL1= 120
##$ZL2= 120
##$ZL3= 120
##$ZL4= 120
##$ABSF1= 16.522
##$ABSF2= -4.171173
##$ABSG= 5
##$ABSL= 3
##$ALPHA= 0
##$AQORDER= 0
##$ASSFAC= 0
##$ASSFACI= 0
##$ASSFACX= 0
##$ASSWID= 0
##$AUNMP= <proc_1d>
##$AZFE= 0.1
##$AZFW= 0.1
##$BCFW= 0
##$BC_mod= 0
##$BYTORDP= 0
##$COROFFS= 0
##$CY= 12.5
##$DATMOD= 1
##$DC= 0
##$DFILT= <>
##$DTYPP= 0
##$F1P= 14.0000005364418
##$F2P= -0.99999901652339
##$FCOR= 0.5
##$FTSIZE= 32768
##$FT_mod= 6
##$GAMMA= 0
##$GB= 0
##$INTBC= 1
##$INTSCL= 1
##$ISEN= 128
##$LB= 0.3
##$LEV0= 0
##$LPBIN= 0
##$MAXI= 10000
##$MC2= 0
##$MEAN= 0
##$ME_mod= 0
##$MI= 0
##$NCOEF= 0
##$NC_proc= -5
##$NLEV= 6
##$NOISF1= 0
##$NOISF2= 0
##$NSP= 0
##$NTH_PI= 0
##$NZP= 0
##$OFFSET= 16.522
##$PC= 1
##$PHC0= 162.8448
##$PHC1= 7.38192
##$PH_mod= 1
##$PKNL= yes
##$PPARMOD= 0
##$PSCAL= 4
##$PSIGN= 0
##$REVERSE= no
##$SF= 250.13
##$SI= 32768
##$SIGF1= 0
##$SIGF2= 0
##$SINO= 400
##$SIOLD= 32768
##$SREGLST= <1H.DMSO>
##$SSB= 0
##$STSI= 32768
##$STSR= 0
##$SW_p= 5175.98343685301
##$SYMM= 0
##$S_DEV= 0
##$TDeff= 65536
##$TDoff= 0
##$TI= <Analysis number 999999
Compound Code 99
Book Reference 9
Project Code 9>
##$TILT= no
##$TM1= 0
##$TM2= 0
##$TOPLEV= 0
##$USERP1= <user>
##$USERP2= <user>
##$USERP3= <user>
##$USERP4= <user>
##$USERP5= <user>
##$WDW= 1
##$XDIM= 32768
##$YMAX_p= 482874675
##$YMIN_p= -939514
$$ End of Bruker specific parameters
$$ ---------------------------------
##NTUPLES= NMR SPECTRUM
##VAR_NAME=  FREQUENCY,     SPECTRUM/REAL,   SPECTRUM/IMAG
##SYMBOL=    X,             R,               I
##VAR_TYPE=  INDEPENDENT,   DEPENDENT,       DEPENDENT
##VAR_FORM=  AFFN,          ASDF,            ASDF
##VAR_DIM=   32768,         32768,           32768
##UNITS=     HZ,            ARBITRARY UNITS, ARBITRARY UNITS
##FACTOR=    0.157963299565203, 1,           1
##FIRST=     4132.6476996994, 0,             0
##LAST=      -1043.33573715361, 0,           0
##MIN=       -1043.33573715361, -939514,     0
##MAX=       4132.6476996994, 482874675,     0
$$ Real data points
##PAGE= N=1
##DATA TABLE= (X++(R..R)), XYDATA
$$ [...]
$$ plain form
15654 -313360 -281901 -84103 100142 88203 263007 141496 -100414 68449 5831 -191024
15644 -191024 -406814 -580851 -524608 -601422 -550596 -284029 -45073 180611 119613 5388
15634 5388 -19084 10716 104576 302173 142023 -70341 -19830 79440 102123 113944 163766
15623 163766 -47506 -151687 -209644 -123667 -108260 -126645 -67438 -52651 -101648 -204462 -139894
15612 -139894 -45233 -102439 5966 -105050 -247998 -170736 -103338 -154129 -123150 -146781 -246277
15601 -246277 -347538 -378192 -202280 -164640 -123076 97424 17241 -21619 -139739 243761
15591 243761 385323 415063 537764 174021 -25948 -136422 -22658 113271 128784 114960
15581 114960 -2932 -23665 137052 -52858 -280641 -163853 -107895 -166495 -120234 -334380
$$ packed form
15654c13360L1459J97798J84245j1939J74804j21511k41910J68863o2618j96855
15644a91024k15790j74037N6243p6814N0826K66567K38956K25684o0998j14225
15634E388k4472K9800R3860J97597j60150k12364N0511R9270K2683J1821M9822
15623A63766k11272j04181n7957Q5977J5407j8385N9207J4787m8997j02814O4568
15612a39894R4661n7206J08405j11016j42948P7262O7398n0791L0979k3631r9496
15601b46277j01261l0654J75912L7640M1564K20500q0183l8860j18120L83500
15591B43761J41562K9740J22701l63743j99969j10474J13764J35929J5513j3824
15581A14960j17892k0733J60717j89910k27783J16788N5958n8600M6261k14146
$$ plain form
15571 -334380 -470976 -319783 5113 68366 -131002 -204297 -159495 -129875 -172442 -104161 -128676
15560 -128676 -210206 -203231 -32788 -125607 -197418 -197777 -176124 -160794 -14237 181144 239164
15549 239164 200051 4720 -215885 -128026 -63525 44191 -58255 -142613 -134872 -162602 -85029
15538 -85029 64793 12692 -120280 -171541 50025 176039 -64170 -217181 -61527 -10711
15528 -10711 60319 48462 -7544 -155348 -137328 -194665 -55185 19061 22144 -233309 -360572
15517 -360572 -366906 -232143 -42219 22722 196969 453923 199231 -134782 -267890 -116705
15507 -116705 110354 248141 116358 -198499 -204930 -56137 163390 165259 351514 384596
15497 384596 153203 175970 96685 96415 -7774 -76920 2660 11086 44553 -41231 -64873 -51442
$$ packed form
15571c34380j36596J51193L24896O3253j99368p3295M4802K9620m2567O8281k4515
15560a28676q1530O975J70443r2819p1811l59K1653J5330J46557J95381N8020
15549B39164l9113j95331k20605Q7859O4501J07716j02446q4358P741k7730P7573
15538h5029J49822n2101j32972n1261K21566J26014k40209j53011J55654N0816
15528a0711P1030j1857n6006j47804J8020n7337J39480P4246L083k55453j27263
15517c60572o334J34763J89924O4941J74247K56954k54692l34013j33108J51185
15507a16705K27059J37787j31783l14857o431J48793K19527J869J86255L3082
15497C84596k31393K2767p9285k70j04189o9146P9580Q426L3467q5784k3642J3431
$$ plain form
15485 -51442 62443 186076 26599 -13411 107231 -38694 -232447 -249844 -266402 -179005
15475 -179005 -292530 -234363 -206352 -215109 -273032 -287777 -167494 -163046 -196410 -253972 -427190
15464 -427190 -256596 -11182 224286 254715 219968 303651 169300 -244726 -296478 -292526 -219903
15453 -219903 -90738 -127495 78755 32350 -174015 -168779 -263894 -193701 -66141 -182968 -228244
15442 -228244 -241366 -60582 222438 352793 315088 234449 309936 456705 391097 77249
15432 77249 -21489 -36457 -103685 -115547 -78641 119908 170206 -24172 -46933 -9411 -126057
15421 -126057 -221247 -168677 -211563 -57621 68524 8724 -13623 22023 -138698 -133258 -103149
15410 -103149 -323736 -410155 -352012 -224058 -74815 12726 92424 90369 109506 64332 -122151
$$ packed form
15485e1442J13885J23633j59477m0010J20642j45925j93753j7397j6558Q7397
15475a79005j13525N8167K8011q757n7923j4745J20283M448l3364n7562j73218
15464d27190J70594K45414K35468L0429l4747Q3683j34351m14026n1752L952P2623
15453b19903J29165l6757K06250m6405k06365N236r5115P0193J27560j16827m5276
15442b28244j3122J80784K83020J30355l7705q0639P5487J46769o5608l13848
15432G7249r8738j4968o7228j1862L6906J98549N0298j94378k2761L7522j16646
15421a26057r5190N2570m2886J53942J26145n9800k2347L5646j60721N440L0109
15410a03149k20587q6419N8143J27954J49243Q7541P9698k055J9137m5174j86483
$$ plain form
15399 -122151 -46104 -124725 -268140 -217094 61501 124897 86168 91042 280300 331978 348019
15388 348019 202638 209204 58007 -232115 -218744 -101703 -122475 -184480 -208310 -185443 269381
15377 269381 420302 401673 345157 223097 138117 37018 43946 38037 91424 248608 302017
15366 302017 164034 -300225 -399415 17472 339742 231595 193424 84242 159713 235706
15356 235706 269566 -72957 -156366 81271 42555 -46814 -74400 -113406 -232524 -86803 79601
15345 79601 46512 -103379 -243951 -178919 -10635 16699 96581 128798 98662 140672 116416
15334 116416 103125 41227 -101671 -163321 -222429 -120854 -265387 -233859 -196635 -234419 -247762
15323 -247762 -178233 -77763 -161192 -168967 -124474 -198384 -259049 -93620 -8891 14790 -1157
$$ packed form
15399a22151P6047p8621j43415N1046K78595O3396l8729M874J89258N1678J6041
15388C48019j45381O566j51197k90122J3371J17041k0772o2005k3830K2867M54824
15377B69381J50921j8629n6516j22060q4980j01099O928n909N3387J57184N3409
15366C02017j37983m64259r9190M16887L22270j08147l8171j09182P5471P5993
15356B35706L3860l42523q3409K37637l8716q9369k7586l9006j19118J45721J66404
15345G9601l3089j49891j40572O5032J68284K7334P9882L2217l0136M2010k4256
15334A16416j3291o1898j42898o1650n9108J01575j44533L1528L7224l7784j3343
15323b47762O9529J00470q3429p775M4493p3910o0665J65429Q4729K3681j5947
$$ plain form
15312 -1157 31747 18258 -150419 -220463 -149345 -173438 -101111 -35771 -24317 -158620 -278681
15301 -278681 -377538 -459675 -334923 -199862 -85668 -214908 -122058 -102143 -15820 142701
15291 142701 113073 -77071 -178893 -153108 -211554 -165888 -189032 -209296 -235318 -229123 -236471
15280 -236471 -343268 -354183 -289704 -225881 -91509 -228691 -188360 449 201505 99638
15270 99638 26790 45594 6763 -277993 -279419 -155871 -194854 -239088 -197248 -263430 -152204
15259 -152204 -22294 115120 227629 252920 120245 -53542 13291 -81862 -137976 1577
15249 1577 56953 -57627 19596 141723 102152 32136 -171410 -211296 -193580 -249455 -187549
15238 -187549 52606 165895 375448 398576 29677 -20594 70790 161295 48261 -86525
$$ packed form
15312a157L2904j3489j68677p0044P1118k4093P2327O5340J1454j34303j20061
15301b78681r8857q2137J24752J35061J14194j29240R2850J9915Q6323J58521
15291A42701k9628j90144j01822K5785n8446M5666k3144k0264k6022O195p348
15280b36471j06797j0915O4479O3823J34372j37182M0331J88809K01056j01867
15270I9638p2848J8804l8831k84756j426J23548l8983m4234M1840o6182J11226
15259a52204J29910J37414J12509K5291j32675j73787O6833r5153n6114J39553
15249A577N5376j14580P7223J22127l9571p0016k03546l9886J7716n5875O1906
15238a87549K40155J13289K09553K3128l68899n0271R1384R0505j13034j34786
$$ plain form
15228 -86525 -164527 -67846 -16773 98384 349681 416871 374896 175856 161291 127761 -51918
15217 -51918 -338396 -375297 -362375 -186151 50567 25330 -138942 -282653 -511513 -267963
15207 -267963 -106920 25402 99654 -80445 -219267 -302736 -296611 -516836 -432115 -238383
15197 -238383 -248829 -291809 -178228 -149316 -223843 -234467 -85887 73333 370028 453680 301531
15186 301531 231636 271093 356693 328901 221374 111458 61463 102485 -4044 -80111 -191451
15175 -191451 -156591 -64782 -54760 65302 191709 148344 251673 115847 85958 159892 290004
15164 290004 325919 272450 -38079 -204800 -310163 -338466 -270807 -137778 -40554 -85783 -245592
15153 -245592 -161312 -221784 -22160 198309 447323 349090 185726 278160 278517 351319 347414
$$ packed form
15228h6525p8002R6681N1073J15157K51297O7190m1975j99040j4565l3530j79679
15217e1918k86478l6901J2922J76224K36718k5237j64272j43711k28860K43550
15207b67963J61043J32322P4252j80099j38822q3469O125k20225Q4721J93732
15197b38383j0446m2980J13581K8912p4527j0624J48580J59220K96695Q3652j52149
15186C01531o9895L9457Q5600k7792j07527j09916m9995M1022j06529p6067j11340
15175a91451L4860R1809J0022J20062J26407m3365J03329j35826k9889P3934J30112
15164B90004L5915n3469l10529j66721j05363k8303O7659J33029R7224m5229j59809
15153b45592Q4280o0472J99624K20469K49014r8233j63364R2434L57P2802l905
$$ plain form
15142 347414 298119 149377 103865 -158939 -237681 -185785 -102314 87585 188325 139572 197282
15131 197282 98474 -56016 -227745 14311 267153 315599 60218 -133183 -273725 -339414
15121 -339414 -34377 29330 152943 87348 -171834 -281030 -112204 66377 -184186 -537395
15111 -537395 -515278 -196532 -34458 -78458 -304497 -383728 -280881 -176699 -246581 -165004
15101 -165004 -154243 -121014 85651 60096 35375 -17373 -25535 41216 -2694 -11302 -24367 73839
15089 73839 144538 280924 297170 183981 139790 145061 159011 195439 -117163 -220751 -182372
15078 -182372 -109432 78092 163567 -39909 -254027 -159952 -114041 -308035 -184851 -19858
15068 -19858 -148109 -41144 -35426 -69367 -97828 -310092 -454520 -432952 -91291 108538 161501
$$ packed form
15142C47414m9295j48742m5512k62804p8742N1896Q3471J89899J00740m8753N7710
15131A97282r8808j54490j71729K42056K52842M8446k55381j93401j40542o5689
15121c39414L05037O3707J23613o5595k59182j09196J68826J78581k50563l53209
15111e37395K2117L18746J62074m4000k26039p9231J02847J04182o9882Q1577
15101a65004J0761L3229K06665k5555k4721n2748q162O6751m3910q608j3065R8206
15089G3839P0699J36386J6246j13189m4191N271J3950L6428l12602j03588L8379
15078a82372P2940J87524Q5475k03476k14118R4075M5911j93994J23184J64993
15068a9858j28251J06965N718l3941k8461k12264j44428K1568L41661J99829N2963
$$ plain form
15057 161501 203330 142301 57408 -16691 24911 23286 -31429 -174591 -216074 -90458 -146931
15046 -146931 126582 149605 35060 36351 203152 277363 302328 180926 56117 -522 172244
15035 172244 177890 78278 -246056 -91300 -92071 -1257 -8006 -19968 171495 262313 415007
15024 415007 545694 272691 -27968 -242060 -396186 -175527 198192 218850 141071 88331
15014 88331 64169 94759 149134 67619 6190 3655 41412 121194 92221 224442 97145
15003 97145 2085 -15842 25426 79531 108851 70641 -12482 117535 271611 245697 94578
14992 94578 -117403 -177829 -209047 -175333 -335163 -206278 -43519 -77386 71476 60391 196344
14981 196344 440582 570890 567893 616572 574750 497751 329705 295273 299544 302481 356898
$$ packed form
15057A61501M1829o1029q4893p4099M1602j625n4715j43162m1483J25616n6473
15046a46931K73513K3023j14545J291J66801P4211K4965j21402j24809n6639J72766
15035A72244N646r9612l24334J54756p71R0814o749j1962J91463R0818J52694
15024D15007J30687k73003l00659k14092j54126K20659L73719K0658p7779n2740
15014H8331k4162L0590N4375q1515o1429k535L7757P9782k8973J32221j27297
15003I7145r5060j7927M1268N4105K9320l8210q3123J30017J54076k5914j51119
14992I4578k11981o0426l1218L3714j59830J28885J62759l3867J48862j1085J35953
14981A96344K44238J30308k997M8679m1822p6999j68046l4432M271K937N4417
$$ plain form
14970 356898 278876 279521 278010 92989 171528 277395 185977 363006 372198 145237 115127
14959 115127 44084 -244491 -243489 -254763 -201053 -213700 -80845 -73223 -138932 24763 210981
14948 210981 298299 183629 -36674 -16285 210328 451048 232885 -26466 -2305 45719
14938 45719 85280 58035 59552 12867 -68630 20402 218068 269604 -85023 -443457 -168599
14927 -168599 5623 21955 -58138 -188105 -211826 -197879 -99925 -67433 -36901 -23326 22965
14916 22965 104394 67968 94813 -44417 91411 179495 105498 17071 -169020 -281340 -299720
14905 -299720 -263807 -203265 -313241 -264883 -136578 -60099 -38346 -175515 -169501 -87016 -133231
14894 -133231 189623 258763 103262 28520 16285 19892 32877 -13460 102446 212723 186189
$$ packed form
14970C56898p8022O45j511j85021P8539J05867r1418J77029R192k26961l0110
14959A15127p1043k88575J002j1274N3710j2647J32855P622o5709J63695J86218
14948B10981Q7318j14670k20303K0389K26613K40720k18163k59351K4161M8024
14938D5719L9561k7245J517m6685q1497Q9032J97666N1536l54627l58434K74858
14927a68599J74222J6332q0093j29967k3721J3947R7954L2492L0532J3575M6291
14916B2965Q1429l6426K6845j39230J35828Q8084p3997q8427j86091j12320j8380
14905b99720L5913O0542j09976M8358J28305P6479K1753j37169O014Q2485m6215
14894a33231L22854O9140j55501p4742j2235L607J2985m6337J15906J10277k6534
$$ plain form
14883 186189 299315 137841 162914 266131 -42336 -133900 -83784 159600 200186 53267
14873 53267 -21737 105438 -111515 -318481 -239278 -288367 -346395 -320824 -150868 157601 226405
14862 226405 284186 231821 76420 2102 231401 208553 -23356 20233 121700 -76852
14852 -76852 -51903 -19300 -16897 95522 278630 427161 398896 330313 272294 199892 88074
14841 88074 261327 364107 330155 200270 312813 143722 129168 -1938 -57036 34320
14831 34320 209335 212631 -88695 -11429 130577 -102957 -142497 -154771 -114910 -84857 37043
14820 37043 -28838 15693 -8520 206929 436929 480001 463195 537694 615655 644520 552899
14809 552899 448607 478515 379924 172073 128178 330132 312231 118058 54710 91192 444197
$$ packed form
14883A86189J13126j61474K5073J03217l08467r1564N0116K43384M0586j46919
14873E3267p5004J27175k16953k06966P9203m9089n8028K5571J69956L08469O8804
14862B26405N7781n2365j55401p4318K29299k2848k31909M3589J01467j98552
14852g6852K4949L2603K403J12419J83108J48531k8265o8583n8019p2402j11818
14841H8074J73253J02780l3952j29885J12543j69091j4554j31106n5098R1356
14831C4320J75015L296l01326P7266J42006k33534l9540j2274L9861L0053J21900
14820C7043o5881M4531k4213K15449K30000M3072j6806P4499P7961K8865r1621
14809E52899j04292K9908r8591k07851m3895K01954j7901j94173o3348L6482L53005
$$ plain form
14798 444197 535479 563302 429527 236083 239335 324822 195900 -116091 -324961 -196515
14788 -196515 -28883 -31497 -155938 -160134 -289568 -362801 -90861 204719 231915 93544 85860
14777 85860 247287 345331 214799 145667 29629 -22217 42061 146672 247623 215507 216450
14766 216450 246123 227503 192528 53038 -13505 -56386 145019 197510 156132 -13014 -177827
14755 -177827 -157000 -135929 -282785 -220296 -84637 -43728 149526 379152 211757 146065
14745 146065 188319 285918 268213 176335 140328 315354 333105 397798 378870 -40807 -173570
14734 -173570 -20929 27259 -111955 40171 209158 230643 171480 -83159 -151426 -28448
14724 -28448 107062 43317 2710 -60740 19390 -104571 -98681 69337 55612 -48607 3081
$$ packed form
14798D44197R1282K7823j33775j93444L252Q5487j28922l11991k08870J28446
14788a96515J67632k614j24441m196j29434p3233K71940K95580K7196j38371p684
14777H5860J61427R8044j30532o9132j16038n1846O4278J04611J00951l2116R43
14766B16450K9673j8620l4975j39490o6543m2881K01405N2491m1378j69146j64813
14755a77827K0827K1071j46856O2489J35659M0909J93254K29626j67395o5692
14745A46065M2254R7599j7705r1878l6007J75026J7751O4693j8928m19677j32763
14734a73570J52641M8188j39214J52126J68987K1485n9163k54639o8267J22978
14724b8448J35510o3745m0607o3450Q0130j23961N890J68018j3725j04219N1688
$$ plain form
14713 3081 217440 266684 211326 198875 164647 207779 79304 186582 232080 188984 80314
14702 80314 -8331 -156514 -252075 -257920 -352085 -123371 151745 233036 335874 413578 417787
14691 417787 420741 135021 -7690 -18550 -156832 -208448 -148607 -43553 31385 -54920 140486
14680 140486 275415 272435 162849 307290 396292 117050 -18173 192110 72896 31547
14670 31547 54453 120605 234843 -145115 -313930 -255214 -32629 67524 -22066 61406 206235
14659 206235 23310 7073 -5298 70720 -8897 36211 -82968 70815 410155 495269 429614
14648 429614 253558 4914 -105883 -115632 -31925 -56625 153097 315348 148695 97164
14638 97164 235772 402394 341225 344564 333729 447434 363728 231024 246879 264497 29988
$$ packed form
14713C081K14359M9244n5358j2451l4228M3132j28475J07278M5498m3096j08670
14702H0314q8645j48183r5561n845r4165K28714K75116Q1291J02838P7704M209
14691D17787K954k85720j42711j0860j38282n1616N9841J05054P4938q6305J95406
14680A40486J34929k980j09586J44441Q9002k79242j35223K10283j19214m1349
14670C1547K2906O6152J14238l79958j68815N8716K22585J00153q9590Q3472J44829
14659B06235j82925j6237j2371P6018p9617M5108j19179J53783L39340Q5114o5655
14648D29614j76056k48644j10797r749Q3707k4700K09722J62251j66653n1531
14638I7164J38608J66622o1169L339j0835J13705q3706j32704J5855J7618k34509
$$ plain form
14627 29988 -31295 157916 254235 -56726 -135572 28201 155020 157559 127403 -5707 -210691
14616 -210691 -217162 -133216 -153398 -25990 202640 162847 180133 77688 29055 86957 388521
14605 388521 653594 479743 232874 -165672 -299056 -413052 -369168 -211534 24382 112656
14595 112656 213164 369937 414936 251104 183057 199277 57806 -107611 77211 280394
14585 280394 212962 191220 342235 218218 203122 89431 94777 259802 164429 130896 113055
14574 113055 160369 273687 266615 289238 96176 166403 25081 68658 221155 353645 489671
14563 489671 259385 31269 33938 -29726 -87015 -46047 -92523 30382 95289 147855 130816
14552 130816 8080 2841 162850 114130 -235957 -264729 -179156 -80935 52120 22579 -71012
$$ packed form
14627B9988o1283J89211R6319l10961p8846J63773J26819K539l0156j33110k04984
14616b10691o471Q3946k0182J27408K28630l9793J7286j02445m8633N7902L01564
14605C88521K65073j73851k46869l98546j33384j13996M3884J57634K35916Q8274
14595A12656J00508J56773M4999j63832o8047J6220j41471j65417J84822K03183
14585B80394o7432k1742J51015j24017j5096j13691N346J65025r5373l3533j7841
14574A13055M7314J13318p072K2623j93062P0227j41322M3577J52497J32490J36026
14563D89671k30286k28116K669o3664n7289M0968m6476J22905O4907N2566j7039
14552A30816j22736n239J60009m8720l50087k8772Q5573R8221J33055k9541r3591
$$ plain form
14541 -71012 64402 130833 132342 -46888 -23527 120316 214160 237686 354006 279227 -35156
14530 -35156 -52567 -50168 15211 -79132 170420 382582 533456 423774 377121 267747 228411
14519 228411 -16492 -15138 63310 104084 238578 96593 65038 329415 517054 342066
14509 342066 246594 274562 400624 437066 350635 151607 80230 121781 53952 260002 120937
14498 120937 33707 -9306 38446 91821 144739 212687 24534 161495 130303 123100 78679
14487 78679 -90100 -4294 122402 136533 56404 -103986 -128608 66429 341932 407106 341584
14476 341584 296518 396320 218377 233746 215956 80364 25058 -183333 -194863 -51292 280654
14465 280654 235478 113790 141615 72642 14605 104643 206837 308751 377601 369878 537470
$$ packed form
14541g1012J35414O6431J509j79230K3361J43843R3844K3526J16320p4779l14383
14530c5156j7411K399O5379r4343K49552K12162J50874j09682m6653j09374l9336
14519B28411k44903J354P8448M0774J34494j41985l1555K64377J87639j74988
14509C42066r5472K7968J26062L6442q6431j99028p1377M1551o7829K06050j39065
14498A20937q7230m3013M7752N3375N2918O7948j88153J36961l1192p203m4421
14487G8679j68779Q5806J26696J4131q0129j60390k4622J95037K75503O5174o5522
14476C41584m5066R9802j77943J5369j7790j35592n5306k08391j1530J43571L31946
14465B80654m5176j21688K7825o8973n8037R0038J02194J01914O8850p723J67592
$$ plain form
14454 537470 635583 535079 353344 62150 -179342 -71581 21851 37223 48977 20291
14444 20291 21097 266863 423072 412306 178478 134281 315330 312153 294871 255175 103400
14433 103400 108843 221635 378890 217724 106424 -40955 -114762 23298 -2844 93419
14423 93419 87071 266101 316180 481206 468849 363839 248198 11943 -55946 98602 170754
14412 170754 186938 96107 51389 46508 176300 220975 186010 217493 245574 351331 479105
14401 479105 432418 354864 369896 316038 483207 452505 387741 367675 190606 175699 239271
14390 239271 149688 190132 366576 459809 266765 165977 230332 290775 327610 455439 414302
14379 414302 401816 499590 494921 390656 563992 565505 242340 300234 370051 364957 327124
$$ packed form
14454E37470R8113j00504j81735k91194k41492J07761R3432J5372J1754k8686
14444B0291Q06K45766J56209j0766k33828m4197J81049l177j7282l9696j51775
14433A03400N443J12792J57255j61166j11300j47379p3807J38060k6142R6263
14423I3419o348J79030N0079J65026j2357j05010j15641k36255o7889J54548P2152
14412A70754J6184r0831m4718m881J29792M4675l4965L1483K8081J05757J27774
14401D79105m6687p7554J5032n3858J67169l0702o4764k0066j77069j4907O3572
14390B39271q9583M0444J76444R3233j93044j00788O4355O0443L6835J27829m1137
14379D14302j2486R7774m669j04265J73336J513l23165N7894O9817n094l7833
$$ plain form
14368 327124 208582 144455 157403 37911 245392 351606 371467 524587 428720 322974
14358 322974 362967 636601 603040 509993 385506 518389 530387 610963 771156 642154
14348 642154 258827 180179 202629 260670 289212 311709 223207 368013 473967 423342 324667
14337 324667 385642 395878 404888 290604 216540 260594 414113 538342 594140 501245 558458
14326 558458 545802 654068 825148 780746 565404 502058 397701 209025 109020 311390
14316 311390 424148 516712 611962 803723 728514 515318 480823 415990 308676 319904 351014
14305 351014 409940 355392 402082 415738 600904 695632 502693 556008 508956 650727 699403
14294 699403 731664 584304 454714 694460 641050 448528 401112 376598 569961 756014
$$ packed form
14368C27124j18542o4127J2948j19492K07481J06214J9861J53120r5867j05746
14358C22974L9993K73634l3561r3047j24487J32883J1998Q0576J60193j29002
14348F42154l83327p8648K2450N8041K8542K2497q8502J44806J05954n0625r8675
14337C24667O0975J0236R010j14284p4064M4054J53519J24229N5798r2895N7213
14326E58458j2656J08266J71080m4402k15342o3346j04357j88676j00005K02370
14316C11390J12758R2564R5250J91761p5209k13196l4495o4833j07314J1228L1110
14305C51014N8926n4548M6690J3656J85166R4728j92939N3315m7052J41771M8676
14294F99403L2261j47360j29590K39746n3410j92522m7416k4514J93363J86053
$$ plain form
14284 756014 620217 594185 709370 702985 502885 433721 567374 759948 829296 706054
14274 706054 478643 469769 608841 664496 720400 619185 520373 386352 512969 601381 734622
14263 734622 858191 685166 757112 1074636 1181009 948813 864149 981629 960523 925768
14253 925768 866998 993596 1012853 852325 693808 718531 653522 798714 797866 861467 811206
14242 811206 870534 852235 794817 647286 606594 705048 964616 876426 899817 777680 760483
14231 760483 793477 754594 781249 781048 791328 767606 568747 496663 789412 894430 789464
14220 789464 746275 852704 851574 792261 1081118 1242963 1091213 933130 992792 1261417
14210 1261417 1362790 1095527 1003372 951863 963113 1087454 1159460 1387673 1334530 1382018
$$ packed form
14284G56014j35797k6032J15185o385k00100o9164J33653J92574O9348j23242
14274G06054k27411q874J39072N5655N5904j01215r8812j34021J26617Q8412J33241
14263G34622J23569j73025P1946L17524J06373k32196q4664J17480k1106l4755
14253I25768n8770J26598J9257j60528j58517K4723o5009J45192q48O3601n0261
14242H11206N9328j8299n7418j47531m0692R8454K59568q8190K3391j22137j7197
14231G60483L2994l8883K6655k01J0280k3722j98859p2084K92749J05018j04966
14220G89464m3189J06429j130n9313K88857J61845j51750j58083N9662K68625
14210A261417J01373k67263r2155n1509J1250J24341P2006K28213n3143M7488
$$ plain form
14200 1382018 1225954 967820 858940 745092 812437 800593 857978 1196015 1134545 841361
14190 841361 888722 1142473 939589 802685 771599 922432 932605 1036245 1182982 1316255
14180 1316255 1362775 1483224 1310964 1359299 1440538 1370311 1449479 1330018 1307487 1446094
14170 1446094 1492355 1529111 1564712 1330034 1122083 1197481 1203237 1351124 1291871 1491675 1444046
14159 1444046 1488629 1418656 1363991 1151335 1224661 1316427 1416685 1569372 1652620 1574119 1397641
14148 1397641 1385070 1197776 1243058 1230183 1419542 1566832 1480010 1403246 1459444 1731627
14138 1731627 1900991 1935041 1677187 1629218 1583730 1698776 1525428 1357151 1412884 1445257
14128 1445257 1504962 1616228 1718901 1670478 1536160 1385771 1448951 1568429 1591049 1521110
$$ packed form
14200A382018j56064k58134j08880j13848O7345j1844N7385L38037o1470k93184
14190H41361M7361K53751k02884j36904l1086J50833J0173J03640J46737J33273
14180A316255M6520J20449j72260M8335Q1239p0227P9168j19461k2531J38607
14170A446094M6261L6756L5601k34678k07951P5398N756J47887n9253J99804m7629
14159A444046M4583o9973n4665k12656P3326R1766J00258J52687Q3248p8501j76478
14148A397641j2571j87294M5282j2875J89359J47290q6822p6764N6198K72183
14138A731627J69364L4050k57854m7969m5488J15046j73348j68277N5733L2373
14128A445257N9705J11266J02673m8423j34318j50389O3180J19478K2620o9939
$$ plain form
14118 1521110 1693666 1779982 1840374 1689945 1592827 1791296 1697128 1683975 2064831 2302012
14108 2302012 2150020 2029912 1999665 2210486 2246189 2314990 2456959 2081535 1937881 2188088
14098 2188088 2343074 2531288 2649153 2725463 2571569 2605680 2430471 2306543 2282430 2093243
14088 2093243 2112746 2203640 2245300 2184352 2510598 2662493 2530533 2417083 2485462 2615284
14078 2615284 2807214 2561628 2466505 2637070 2761232 2592888 2397741 2474912 2550433 2692007
14068 2692007 2878544 3190642 3324561 3235467 3307023 3367992 3151282 3281686 3486817 3515895
14058 3515895 3510928 3651207 3735973 3717620 3774083 3956305 4094221 4269719 4078704 3766527
14048 3766527 3841418 4165211 4279357 4247055 4119378 4289745 4377713 4451527 4523661 4549343
$$ packed form
14118A521110J72556Q6316O0392j50429r7118J98469r4168j3153L80856K37181
14108B302012j51992j20108l0247K10821L5703O8801J41969l75424j43654K50207
14098B188088J54986J88214J17865P6310j53894L4111j75209j23928k4113j89187
14088B093243J9503R0894M1660o0948L26246J51895j31960j13450O8379J29822
14078B615284J91930k45586r5123J70565J24162j68344j95147P7171P5521J41574
14068B692007J86537L12098J33919q9094P1556O0969k16710J30404K05131K9078
14058C515895m967J40279Q4766j8353N6463J82222J37916J75498j91015l12177
14048C766527P4891L23793J14146l2302j27677J70367Q7968P3814P2134K5682
$$ plain form
14038 4549343 4422510 4392055 4393199 4394864 4697125 4975812 5229793 5158764 5265693 5324545 5285669
14027 5285669 5263198 5400901 5466006 5554912 5655724 5818957 5912349 5928323 5830445 5831751 5773410
14016 5773410 5947749 6058527 6133908 6424515 6713207 6912198 6883159 6923896 6969407 7099068
14006 7099068 7300670 7491480 7584837 7429932 7598182 7837391 7830567 8045203 8150214 8331957
13996 8331957 8522554 8667205 8852769 8952594 9106921 9183460 9322924 9493615 9527153 9682633
13986 9682633 9842460 10118699 10346488 10621911 10993317 11384183 12001656 12395540 12555897
13977 12555897 12833578 12896408 12936353 13285393 13672312 13663071 13772483 14219715 14759564 15214886
13967 15214886 15861054 16417145 16591652 16744823 17360103 17973328 18343723 18853627 19418834
$$ packed form
14038D549343j26833l0455J144J665L02261K78687K53981p1029J06929N8852l8876
14027E285669k2471J37703O5105Q8906J00812J63233R3392J5974r7878J306n8341
14016E773410J74339J10778P5381K90607K88692J98991k9039M0737M5511J29661
14006G099068K01602J90810R3357j54905J68250K39209o824K14636J05011J81743
13996H331957J90597J44651J85564R9825J54327P6539J39464J70691L3538J55480
13986I682633J59827K76239K27789K75423L71406L90866O17473L93884J60357
13977A2555897K77681O2830L9945L49040L86919r241J09412M47232N39849M55322
13967A5214886O46168N56091J74507J53171O15280O13225L70395N09904N65207
$$ plain form
13958 19418834 20022246 20916465 21551666 21982048 22554398 23409574 24269200 25062952 25738516
13949 25738516 26403132 27188315 28104134 29214533 30367482 31451983 32497648 33636647
13941 33636647 34964944 36147313 37307635 38667873 40360063 41915524 43473292 45271975
13933 45271975 47100965 49002971 50899178 53104352 55581959 58060491 60676502 63596854
13925 63596854 66546864 69605218 72672688 75900565 79480536 83293816 87528271 92158197
13917 92158197 96690745 101324482 106270258 111647622 117434465 123181094 129285094 135761717
13909 135761717 142340889 148917692 155455798 162129059 168773331 175345394 181708113 187890539
13901 187890539 193735496 199169459 203838889 207670687 210677168 213114499 214596997 215125896
$$ packed form
13958A9418834O03412Q94219O35201M30382N72350Q55176Q59626P93752O75564
13949B5738516O64616P85183R15819J110399J152949J084501J045665J138999
13941C3636647J328297J182369J160322J360238J692190J555461J557768J798683
13933D5271975J828990J902006J896207K205174K477607K478532K616011K920352
13925F3596854K950010L058354L067470L227877L579971L813280M234455M629926
13917I2158197M532548M633737M945776N377364N786843N746629O104000O476623
13909A35761717O579172O576803O538106O673261O644272O572063O362719O182426
13901A87890539N844957N433963M669430L831798L006481K437331J482498N28899
$$ plain form
13893 215125896 214579296 213106963 210634641 207572092 203504265 198645659 193438545 187826724
13885 187826724 182025270 175961515 169676284 163069142 156526147 150167565 144176942 138069460
13877 138069460 131733561 125883151 120585932 115278628 110137974 105083077 100399995 96013420
13869 96013420 91795885 87932475 84106209 80578659 77007417 73678018 70444189 67439862
13861 67439862 64815239 62257190 59660969 57266866 54785134 52395476 50197622 48253310
13853 48253310 46436785 44639366 42867082 41560670 40125083 38756394 37467478 36270598
13845 36270598 34800121 33490366 32376265 31133011 30030537 29153045 28328537 27344703
13837 27344703 26283952 25441168 24921868 24356491 23481743 22700953 22139657 21602077 20924419
$$ packed form
13893B15125896n46600j472333k472322l062549m067827m858606n207114n611821
13885A87826724n801454o063755o285231o607142o542995o358582n990623o107482
13877A38069460o335899n850410n297219n307304n140654n054897m683082m386575
13869I6013420m217535l863410l826266l527550l571242l329399l233829l004327
13861F7439862k624623k558049k596221k394103k481732k389658k197854j944312
13853D8253310j816525j797419j772284j306412j435587j368689j288916j196880
13845C6270598j470477j309755j114101j243254j102474q77492q24508r83834
13837B7344703j060751q42784n19300n65377q74748p80790n61296n37580o77658
$$ plain form
13828 20924419 20188164 19563474 19037683 18548720 18044181 17569016 17098061 16636281 16145253
13819 16145253 15734820 15328971 14909781 14655769 14260173 13971370 13629452 13246645 12953400
13810 12953400 12870440 12559761 12283711 11933123 11751187 11302176 11131778 10764499 10453085
13801 10453085 10192899 10209048 10037442 9971686 9963766 9624085 9196078 8936205 8647631 8586008
13791 8586008 8425979 8222889 8048955 7986841 7952856 7684895 7403407 7138857 7002348 6864512
13781 6864512 6844257 6700503 6584072 6496876 6492736 6377055 6130208 5677778 5582134 5793642
13771 5793642 5717090 5724344 5791338 5547246 5365285 5127375 5029411 4877964 4916731 4963254 5024071
13760 5024071 4840179 4603182 4645295 4474739 4508462 4525091 4412523 4364628 4376493 4229203
$$ packed form
13828B0924419p36255o24690n25791m88963n04539m75165m70955m61780m91028
13819A6145253m10433m05849m19190k54012l95596k88803l41918l82807k93245
13810A2953400q2960l10679k76050l50588j81936m49011j70398l67279l11414
13801A0453085k60186J6149j71606o5756p920l39681m28007k59873k88574o1623
13791H586008j60029k03090j73934o2114l3985k67961k81488k64550j36509j37836
13781F864512k0255j43754j16431q7196m140j15681k46847m52430r5644K11508
13771E793642p6552P254O6994k44092j81961k37910r7964j51447L8767M6523O0817
13760E024071j83892k36997M2113j70556L3723J6629j12568m7895J1865j47290
$$ plain form
13750 4229203 4049959 4125238 4203870 4226591 3886553 3847942 3964326 4075520 3926148 3645682
13740 3645682 3591980 3595636 3586062 3827781 4087943 4051144 3594152 3333797 3409226 3573345 3511514
13729 3511514 3649556 3688592 3624644 3253474 3038568 2942132 2931075 3046634 3015303 2987735
13719 2987735 3220436 3266433 2960315 2819494 3041746 3095747 3005214 2790009 2629669 2549831
13709 2549831 2675799 2682994 2616386 2742705 2852959 2701926 2801953 2895617 3109346 3193629
13699 3193629 3098025 3062061 2995449 2894004 2985538 2883683 2618330 2603561 2481699 2397145
13689 2397145 2369119 2188218 2181862 2175061 2297070 2195070 1997492 2188619 2371921 2426648
13679 2426648 2313040 2063327 1872204 1807516 1783785 1680903 1879318 2069006 1914162 1956043
$$ packed form
13750D229203j79244P5279P8632K2721l40038l8611J16384J11194j49372k80466
13740C645682n3702L656r574K41719K60162l6799m56992k60355P5429J64119o1831
13729C511514J38042L9036o3948l71170k14906r6436j1057J15559l1331k7568
13719B987735K32701M5997l06118j40821K22252N4001r0533k15205j60340p9838
13709B549831J25968P195o6608J26319J10254j51033J00027R3664K13729Q4283
13699C193629r5604l5964o6612j01445R1534j01855k65353j4769j21862q4554
13689B397145k8026j80901o356o801J22009j02000j97578J91127J83302N4727
13679B426648j13608k49713j91123o4688k3731j02882J98415J89688j54844M1881
$$ plain form
13669 1956043 2058220 2194260 2158307 2104183 2056397 2062412 1909306 1803972 1763402 1787293 1850576
13658 1850576 1834090 1723434 1455445 1396202 1466975 1625291 1766034 1815807 1639250 1538967
13648 1538967 1625161 1589261 1562910 1653533 1721023 1624391 1463531 1237878 1209819 1242130 1408058
13637 1408058 1432956 1439476 1558300 1512752 1375111 1324060 1284903 1257358 1215582 1386038 1365471
13626 1365471 1075356 1130396 1453107 1554849 1479859 1505342 1364860 1163518 1019016 1148347
13616 1148347 1177259 1240060 1350378 1561186 1453560 1379931 1174289 1063210 1169857 1173748
13606 1173748 1164392 1237763 1108340 1046771 1023277 1130010 1179002 1235544 1157363 1115298 1125995
13595 1125995 1231159 1213761 1070516 1042694 1016054 873506 907856 928191 930022 852670 727689
$$ packed form
13669A956043J02177J36040l5953n4124m7786O015j53106j05334m0570K3891O3283
13658A850576j6486j10656k67989n9243P0773J58316J40743M9773j76557j00283
13648A538967Q6194l5900k6351R0623O7490r6632j60860k25653k8059L2311J65928
13637A408058K4898O520J18824m5548j37641n1051l9157k7545m1776J70456k0567
13626A365471k90115N5040L22711J01742p4990K5483j40482k01342j44502J29331
13616A148347K8912O2801J10318K10808j07626p3629k05642j11079J06647L891
13606A173748r356P3371j29423o1569k3494J06733M8992N6542p8181m2065J0697
13595A125995J05164j7398j43245k7822k6640j42548L4350K0335J831p7352j24981
$$ plain form
13584 727689 740207 763398 594357 594191 797677 968055 1069465 934444 732833 626673
13574 626673 635666 646192 717163 797953 742169 565421 513287 523565 581988 679494 870242
13563 870242 702536 745580 829539 1023796 970880 884801 703199 588374 546521 622007 660514
13552 660514 715004 813674 709906 684560 699888 510819 532466 430398 556275 651762 665536
13541 665536 647908 564592 544635 545853 462417 642198 716300 784598 606535 571778 843141
13530 843141 749840 596777 596361 516342 451104 330783 294465 337488 501622 592539 468479
13519 468479 517660 608974 511218 532147 713649 775521 482706 523383 477358 577206 792649
13508 792649 660914 519138 399399 612530 563665 469158 627982 662009 439409 190908
$$ packed form
13584G27689J2518K3191j69041j66K03486J70378J01410j35021k01611j06160
13574F26673Q993J0526P0971Q0790n5784j76748n2134J0278N8423R7506J90748
13563H70242j67706M3044Q3959J94257n2916q6079j81602j14825m1853P5486L8507
13552F60514N4490R8670j03768k5346J5328j89069K1647j02068J25877R5487J3774
13541F65536j7628q3316j9957J218q3436J79781P4102O8298j78063l4757K71363
13530H43141r3301j53063m16q0019o5238j20321l6318M3023J64134R0917j24060
13519D68479M9181R1314r7756K0929J81502O1872k92815M0677m6025R9848K15443
13508G92649j31735j41776j19739K13131m8865r4507J58824L4027k22600k48501
$$ plain form
13498 190908 237849 485094 450690 452285 259399 406317 432891 359061 366019 283292 170654
13487 170654 200072 59970 147623 272965 113131 99836 46166 87911 71760 44692 32998
13476 32998 -78955 -77799 -89685 45149 96457 192413 303381 375629 263868 194951 280292
13465 280292 115651 -50399 62594 328106 346888 255199 155925 82773 170777 288099
13455 288099 478917 549495 528683 530920 348736 301100 223215 295177 243182 135728 71038
13444 71038 153501 379586 545804 645859 751542 541243 235078 180137 218882 310745
13434 310745 313818 363695 249661 162516 57176 96099 149295 191794 266209 289571 419032
13423 419032 677535 596510 289702 262791 286358 127690 -71084 -85325 10109 156749
$$ packed form
13498A90908M6941K47245l4404J595j92886J46918K6574p3830O958q2727j12638
13487A70654K9418j40102Q7653J25342j59834j3295n3670M1745j6151k7068j1694
13476C2998j11953J156j1886J34834N1308R5956J10968P2248j11761o8917Q5341
13465B80292j64641j66050J12993K65512J8782r1689r9274p3152Q8004J17322
13455B88099J90818P0578k0812K237j82184m7636p7885P1962n1995j07454o4690
13444G1038Q2463K26085J66218J00055J05683k10299l06165n4941L8745R1863
13434C10745L073M9877j14034q7145j05340L8923N3196M2499P4415K3362J29461
13423D19032K58503q1025l06808k6911K3567j58668j98774j4241R5434J46640
$$ plain form
13413 156749 296390 263005 302600 239449 188486 212645 240619 313855 142250 27141 204064
13402 204064 324582 302420 159852 55301 91342 221325 298583 268456 257550 236696 190999
13391 190999 154343 35619 35089 195343 161588 113668 31979 293362 458565 370566 345459
13380 345459 489855 346875 296668 337335 142461 49285 23001 86939 155309 194665 160734
13369 160734 286306 223560 -85580 -134303 -25074 141877 194027 240315 222242 293272 274921
13358 274921 98073 80227 -53007 154042 287461 420294 412202 348787 163647 -6204
13348 -6204 130846 302604 380295 241789 203071 208663 328739 282766 194359 152289 34680
13337 34680 105315 115516 37466 72260 156450 182822 77491 232076 267167 436265 240140
$$ packed form
13413A56749J39641l3385L9595o3151n0963K4159K7974P3236j71605j15109J76923
13402B04064J20518k2162j42568j04551L6041J29983P7258l0127j0906k0854m5697
13391A90999l6656j18724n30J60254l3755m7920q1689K61383J65203q7999k5107
13380C45459J44396j42980n0207M0667j94874r3176k6284O3938O8370L9356l3931
13369A60734J25572o2746l09140m8723J09229J66951N2150M6288j8073P1030j8351
13358B74921j76848j7846j33234K07049J33419J32833q092o3415j85140j69851
13348f204J37050J71758P7691j38506l8718N592J20076m5973q8407m2070j17609
13337C4680P0635J0201p8050L4794Q4190K6372j05331J54585L5091J69098j96125
$$ plain form
13326 240140 235763 276867 213479 266327 149397 140643 -5444 -119013 -167169 -88838 -2545
13315 -2545 128268 251355 166022 229305 187175 250777 158383 2914 167705 342065 235389
13304 235389 209442 292539 280231 240272 213454 209211 267028 102377 44716 -51323 243525
13293 243525 136146 -81768 72317 188278 205259 217797 372835 389460 115793 89570
13283 89570 167635 323004 466026 542233 378129 495076 608159 591528 540977 456342 377104
13272 377104 295121 299832 308966 193327 91914 37044 -41139 -57600 -143423 -31680 51095
13261 51095 164131 158807 307753 394296 441949 388400 195273 234725 278465 365947 429938
13250 429938 408952 200806 130722 316626 341889 220945 169009 312115 349613 257704 239775
$$ packed form
13326B40140m377M1104o3388N2848j16930q754j46087j13569m8156P8331Q6293
13315b545J30813J23087q5333O3283m2130O3602r2394j55469J64791J74360j06676
13304B35389k5947Q3097j2308l9959k6818m243N7817j64651n7661r6039K94848
13293B43525j07379k17914J54085J15961J6981J2538J55038J6625k73667k6223
13283H9570P8065J55369J43022P6207j64104J16947J13083j6631n0551q4635p9238
13272C77104q1983M711R134j15639j01413n4870p8183j6461q5823J11743Q2775
13261E1095J13036n324J48946Q6543M7653n3549j93127L9452M3740Q7482O3991
13250D29938k0986k08146p0084J85904K5263j20944n1936J43106L7498r1909j7929
$$ plain form
13239 239775 116071 -116406 -215549 -119416 -66890 19133 226810 200816 84452 101287 192288
13228 192288 77634 62169 60456 109167 -6402 61675 181133 73693 200767 361979
13218 361979 176868 79095 271799 455253 359855 221140 203957 485090 499650 287085
13208 287085 142398 172842 80667 48988 -165865 -50392 86286 241813 254155 149834
13198 149834 39867 120236 -11466 -56346 21722 44729 146377 286767 142960 261066
13188 261066 155823 150527 -16592 -109758 123054 87591 111536 166259 90170 186987 281092
13177 281092 328850 458534 366435 191389 50520 120413 24396 143439 145788 95484 75988
13166 75988 209426 215677 123964 -20704 -99401 -30927 142745 391881 492051 390815 309792
$$ packed form
13239B39775j23704k32477r9143R6133N2526Q6023K07677k5994j16364J6835R1001
13228A92288j14654j5465j713M8711j15569O8077J19458j07440J27074J61212
13218C61979j85111r7773J92704J83454r5398j38715j7183K81133J4560k12565
13208B87085j44687L0444r2175l1679k14853J15473J36678J55527J2342j04321
13198A49834j09967Q0369j31702m4880P8068K3007J01648J40390j43807J18106
13188B61066j05243n296j67119r3166K32812l5463K3945N4723p6089R6817R4105
13177B81092M7758J29684r2099j75046j40869O9893r6017J19043K349n0304j9496
13166G5988J33438O251r1713j44668p8697O8474J73672K49136J00170j01236q1023
$$ plain form
13155 309792 112837 31764 112224 191934 188031 -39537 -166527 -122547 94593 189031 361716
13144 361716 380711 317832 157377 205243 111033 142956 234234 170972 251039 107433 11869
13133 11869 13130 20480 165852 111056 135629 281520 433740 424013 373431 489100 429717
13122 429717 249496 95936 -40700 -135139 -118837 -69322 48368 124252 224780 218909 120444
13111 120444 7888 -26221 130207 440508 467708 373071 260006 249211 262780 239130 76712
13100 76712 89144 154231 295216 277094 238175 243385 138309 140519 281869 379190 271196
13089 271196 251712 88960 29378 -46655 -25604 -102227 -240855 -305782 -209235 -89399 46011
13078 46011 91405 74507 -1373 132690 117936 -81771 -240932 -168135 -123987 84667 -46120
$$ packed form
13155C09792j96955q1073Q0460P9710l903k27568j26990M3980K17140R4438J72685
13144C61716J8995o2879j60455M7866r4210L1923R1278o3262Q0067j43606r5564
13133A1869J261P350J45372n4796K4573J45891J52220r727n0582J15669n9383
13122D29717j80221j53560j36636r4439J6302M9515J17690P5884J00528n871r8465
13111A20444j12556l4109J56428L10301K7200r4637j13065j0795J3569k3650j62418
13100G6712J2432O5087J40985j8122l8919N210j05076K210J41350R7321j07994
13089B71196j9484j62752n9582p6033K1051p6623j38628o4927R6547J19836J35410
13078D6011M5394j6898p5880J34063j4754j99707j59161P2797M4148K08654j30787
$$ plain form
13067 -46120 -180718 -238613 -114548 112359 133354 165183 186406 180487 165861 115592 132437
13056 132437 235781 111216 285884 342541 112911 1107 12400 24357 182142 240167
13046 240167 252017 202068 235636 264997 225519 304576 358551 415959 287025 288960 108672
13035 108672 -139341 -50567 119153 147768 87181 -19515 -83814 -204526 -217753 -264900 -71546
13024 -71546 19541 85197 -45004 -270289 -351196 -201118 148259 303418 162494 80103
13014 80103 -33141 -38765 46398 84459 203452 186602 222722 252467 134248 -9084 3128
13003 3128 8990 -3323 -89067 -246255 -344020 -199028 -182652 -84650 132798 264656 367839
12992 367839 291896 155896 25317 19079 73122 206199 458872 508002 440272 397970 320113
$$ packed form
13067d6120j34598n7895J24065K26907K0995L1829K1223n919j4626n0269J6845
13056A32437J03344j24565J74668N6657k29630j11804J1293J1957J57785N8025
13046B40167J1850m9949L3568K9361l9478P9057N3975N7408j28934J935j80288
13035A08672k48013Q8774J69720K8615o0587j06696o4299j20712j3227m7147J93354
13024g1546R1087O5656j30201k25285q0907J50078L49377J55159j40924q2391
13014H0103j13244n624Q5163L8061J18993j6850L6120K9745j18219j43332J2212
13003C128N862j2313q5744j57188r7765J44992J6376R8002K17448J31858J03183
12992C67839p5943j36000j30579o238N4043J33077K52673M9130o7730m2302p7857
$$ plain form
12981 320113 218830 223898 -2211 71638 -17042 -97611 -129260 -164866 -301225 -290776 -263012
12970 -263012 -131417 -116329 -172310 -125135 -222160 -270669 -92406 -36483 -13965 69494 113654
12959 113654 44438 -37141 20924 230837 243158 34895 -148100 -16155 201173 314179
12949 314179 186379 86541 119907 115895 207487 143333 117262 -15408 31432 53507 -106199
12938 -106199 -86503 -95957 -202450 -202988 -16674 93716 69405 205100 243999 293417 236162
12927 236162 130469 -60772 -102075 52459 -1858 209508 37216 21389 89949 5196
12917 5196 -116917 -35986 -25369 -154021 -130054 137654 332338 361524 222174 231478 136793
12906 136793 121045 118068 222520 265487 165409 110162 152580 153113 13893 83613 16210
$$ packed form
12981C20113j01283N068k26109P3849q8680q0569l1649l5606j36359J0449K7764
12970b63012J31595J5088n5981M7175r7025m8509J78263N5923K2518Q3459M4160
12959A13654o9216q1579N8065K09913J2321k08263j82995J31945K17328J13006
12949C14179j27800r9838L3366m012R1592o4154k6071j32670M6840K2075j59706
12938a06199J9696r454j06493n38J86314J10390k4311J35695L8899M9418n7255
12927B36162j05693j91241m1303J54534n4317K11366j72292j5827O8560q4753
12917E196j22113Q0931J0617j28652K3967K67708J94684K9186j39350R304r4685
12906A36793j5748k977J04452M2967j00078n5247M2418N33j39220O9720o7403
$$ plain form
12895 16210 -51147 108445 140354 -30070 62520 100928 341327 616117 391294 178492
12885 178492 223601 316465 137063 185370 136442 287784 201609 149727 120280 137877 222458
12874 222458 157399 -46739 -152892 -219014 -242851 -66411 118616 207773 124250 68659 -48755
12863 -48755 -254309 -187657 -263371 -352525 -202715 -187374 -156428 -97011 -87216 -53650 81749
12852 81749 292290 70457 -52098 1968 116135 232608 151950 162465 95210 27898 -173
12841 -173 55017 -84782 -195914 -187322 -167546 -35082 -74400 -3879 -25602 -213720 -150526
12830 -150526 161149 322018 321545 418421 661398 637006 254797 223309 222245 109042 -39680
12819 -39680 -89353 -80580 69582 130489 271781 220947 192718 128291 2237 -70598 -210460
$$ packed form
12895A6210o7357J59592L1909j70424R2590L8408K40399K74790k24823k12802
12885A78492M5109R2864j79402M8307m8928J51342q6175n1882k9447J7597Q4581
12874B22458o5059k04138j06153o6122k3837J76440J85027Q9157q3523n5591j17414
12863d8755k05554O6652p5714q9154J49810J5341L0946N9417R795L3566J35399
12852H1749K10541k21833j22555N4066J14167J16473q0658J0515o7255o7312k8071
12841a73N5190j39799j11132Q592J9776J32464l9318P0521k1723j88118O3194
12830a50526L11675J60869m73R6876K42977k4392l82209l1488j064j13203j48722
12819c9680m9673Q773J50162O0907J41292n0834k8229o4427j26054p2835j39862
$$ plain form
12808 -210460 -267487 -157505 -79116 -281600 -191124 4924 84747 141577 -39283 -204358
12798 -204358 -131913 -189394 -21857 153168 315557 403349 323276 79083 -93127 -374107
12788 -374107 -390422 -184163 -111523 30985 178964 76059 -77327 -214240 -145099 -130442
12778 -130442 -419874 -307500 -91849 -54175 -82348 -252639 -313943 -45514 -79653 69021
12768 69021 215272 259357 25348 -213090 -204896 69219 26691 213716 235529 102222 -30461
12757 -30461 -16218 69059 29272 100724 179929 334902 348379 335785 397628 267187 273262
12746 273262 180074 56586 -3291 -85699 -216 191805 180574 2574 -46072 -114731 -33153
12735 -33153 -43008 -44145 -75818 -127564 -73770 -24468 116128 331355 429248 465152 401426 279496
$$ packed form
12808b10460n7027J09982P8389k02484R0476J96048P9823N6830j80860j65075
12798b04358P2445n7481J67537J75025J62389Q7792q0073k44193j72210k80980
12788c74107j6315K06259P2640J42508J47979j02905j53386j36913O9141J4657
12778a30442k89432J12374K15651L7674k8173j70291o1304K68429l4139J48674
12768F9021J46251M4085k34009k38438Q194K74115m2528J87025K1813j33307j32683
12757c0461J4243Q5277l9787P1452P9205J54973J3477j2594O1843j30441O075
12746B73262r3188j23488n9877q2408Q5483J92021j1231j78000m8646o8659Q1578
12735c3153r855j137l1673n1746N3794M9302J40596K15227R7893L5904o3726j21930
$$ plain form
12723 279496 189792 146934 179362 209441 214273 430628 530320 573466 233927 93278 181606
12712 181606 249481 146145 252422 390337 239392 188936 203699 110418 -20822 -98166
12702 -98166 -109164 -86701 -134162 -98035 64336 307524 246048 292760 445201 292257 153366
12691 153366 246761 386689 183149 -27486 35086 105203 -44273 -87814 62700 21236
12681 21236 -40203 10634 119648 226239 181464 112698 102621 162767 129932 -32984 55441
12670 55441 142384 74522 417854 691010 653104 404614 158024 207866 167524 123733 299151
12659 299151 403235 246116 -22375 72875 253716 137420 48603 11123 -69270 -14608
12649 -14608 148918 72313 -95927 -145816 -173245 -76611 114694 72792 -235413 -410303 -183059
$$ packed form
12723B79496q9704m2858L2428L0079M832K16355R9692M3146l39539j40649Q8328
12712A81606O7875j03336J06277J37915j50945n0456J4763r3281j31240p7344
12702i8166j0998K2463m7461L6127J62371K43188o1476M6712J52441j52944j38891
12691A53366R3395J39928k03540k10635O2572P0117j49476m3541J50514m1464
12681B1236o1439N0837J09014J06591m4775o8766j0077O0146l2835j62916Q8425
12670E5441Q6943o7862L43332K73156l7906k48490k46590M9842m0342m3791J75418
12659B99151J04084j57119k68491R5250J80841j16296q8817l7480q0393N4662
12649a4608J63526p6605j68240m9889k7429R6634J91305m1902l08205j74890K27244
$$ plain form
12638 -183059 36507 163031 22778 -113306 -232691 -330293 -327698 -308680 -325052 -127106
12628 -127106 71336 189145 381951 414597 464867 280097 33671 -67156 147483 117603
12618 117603 182115 136977 57830 79378 13993 56767 49012 17233 31639 37832 4585 97484
12606 97484 -29031 -36107 54 -95853 -242774 -236208 -266627 -82613 -6637 36749 -81678
12595 -81678 -113137 -10551 -94248 -190207 -32860 26276 81238 32378 -77262 -30293 -25549
12584 -25549 -33911 74887 35843 54215 271921 305007 -36850 -21142 104756 73251 23089
12573 23089 45983 105684 254587 237728 278467 508750 229671 -119853 13266 -200560
12563 -200560 -322968 -167382 -44603 -160174 -255629 -230425 -255233 -324765 -371869 -159505
$$ packed form
12638a83059K19566J26524j40253j36084j19385r7602K595J9018j6372J97946
12628a27106J98442J17809J92806L2646N0270j84770k46426j00827K14639k9880
12618A17603O4512m5138p9147K1548o5385M2774p755l1779J4406O193l3247R2899
12606I7484j26515p076L6161r5907j46921O566l0419J84014P5976M3386j18427
12595h1678l1459J02586q3697r5959J57347N9136N4962m8860j09640M6969M744
12584b5549q362J08798l9044J8372K17706L3086l41857J5708J25898l1505n0162
12573B3089K2894N9701J48903j6859M0739K30283k79079l49524J33119k13826
12563b00560j22408J55586J22779j15571r5455K5204k4808o9532m7104K12364
$$ plain form
12553 -159505 -72226 9353 107323 37755 -49842 174879 215734 104948 89930 113983 -20938
12542 -20938 -167762 -98834 59493 282331 349591 133052 169728 305618 141768 56910
12532 56910 149369 117024 113023 86742 116239 22039 -29815 334383 338316 225549 329063
12521 329063 146499 48298 -55454 -79208 144448 225687 310129 311584 7260 -29364 -105358
12510 -105358 26354 229316 374406 230545 170237 147196 117120 -40841 54631 -66202
12500 -66202 -41758 96035 55057 -29611 -70105 -123071 -143203 -179598 -237605 -121306 -71175
12489 -71175 -45832 31994 112050 98004 164764 213495 42832 30214 183920 246192 274826
12478 274826 217152 231952 65487 -28605 -62715 -29671 207132 255433 59705 72499 -30233
$$ packed form
12553a59505Q7279Q1579R7970o9568q7597K24721M0855j10786j5018K4053j34921
12542b0938j46824O8928J58327K22838O7260k16539L6676J35890j63850q4858
12532E6910R2459l2345m001k6281K9497r4200n1854L64198L933j12767J03514
12521C29063j82564r8201j03752k3754K23656Q1239Q4442J455l04324l6624p5994
12510a05358J31712K02962J45090j43861o0308k3041l0076j57961R5472j20833
12500f6202K4444J37793m0978q4668m0494n2966k0132l6395n8007J16299N0131
12489g1175K5343P7826Q0056j4046O6760M8731j70663j2618J53706O2272K8634
12478B74826n7674J4800j66465r4092l4110L3044K36803M8301j95728J2794j02732
$$ plain form
12467 -30233 66161 18909 63796 69213 -99062 -1724 175219 349895 269825 313316 247111
12456 247111 174342 132289 258363 86252 47910 44267 -15618 -126604 -355957 -203112 -139246
12445 -139246 -156977 -47177 119060 55079 -3755 -126906 -299445 -452766 -411489 -272089
12435 -272089 -296615 -383476 -438922 -296644 -173992 -302873 -240899 -373530 -254562 77560
12425 77560 86477 150790 155055 140164 8422 -63782 -189357 -190087 -41731 42965 -93623 -182560
12413 -182560 -125362 -86111 21238 102477 -122556 -176634 -56548 11049 21560 116471 135960
12402 135960 166441 73234 63147 217799 357417 171763 1851 61631 157739 218648 51362
12391 51362 -12524 -7230 87983 -44316 -163899 5645 -194642 -114802 -87858 21884 141089
$$ packed form
12467c0233R6394m7252M4887N417j68275R7338J76943J74676q0070M3491o6205
12456B47111p2769m2053J26074j72111l8342l643n9885j10986k29353J52845O3866
12445a39246j7731J09800J66237o3981n8834j23151j72539j53321M1277J39400
12435b72089k4526q6861n5446J42278J22652j28881O1974j32631J18968L32122
12425G7560Q917O4313M265j4891j31742p2204j25575p30J48356Q4696j36588q8937
12413a82560N7198L9251J07349Q1239k25033n4078J20086O7597J0511R4911J9489
12402A35960L0481r3207j0087J54652J39618j85654j69912N9780R6108O0909j67286
12391E1362o3886N294R5213j32299j19583J69544k00287P9840K6944J09742J19205
$$ plain form
12380 141089 87129 186922 91689 -130511 -146382 -241980 -520386 -455662 -291788 -128430 -110264
12369 -110264 -61577 -72707 67410 35618 101560 112176 -34337 -23389 93848 102530 155406
12358 155406 220108 314030 208300 244112 458480 352471 169159 256324 291544 253483 147560
12347 147560 -52519 -96398 -16932 30926 -59923 -65094 48354 193925 166401 20633 -198265
12336 -198265 -279262 -13803 103308 118360 -62031 -175343 -156763 -350405 -252613 -32878
12326 -32878 194189 311357 144367 -99370 -272920 -329824 -251003 -187848 -199085 21913
12316 21913 221497 310752 128820 -102962 -165938 -156874 106439 79594 -60491 -2939 43844
12305 43844 -96357 -84494 -122096 -197184 -136567 -173139 -85263 172729 179927 205838 217646
$$ packed form
12380A41089n3960R9793r5233k22200j5871r5598k78406O4724J63874J63358J8166
12369a10264M8687j1130J40117l1792O5942J0616j46513J0948J17237Q682N2876
12358A55406O4702R3922j05730L5812K14368j06009j83312Q7165L5220l8061j05923
12347A47560k00079m3879P9466M7858r0849n171J13448J45571k7524j45768k18898
12336a98265q0997K65459J17111J5052j80391j13312J8580j93642R7792K19735
12326c2878K27067J17168j66990k43737j73550n6904P8821O3155j1237K20998
12316B1913J99584Q9255j81932k31782o2976R064K63313k6845j40085N7552M6783
12305D3844j40201J1863l7602p5088O0617l6572Q7876K57992P198K5911J1808
$$ plain form
12294 217646 357447 329817 277658 345530 452211 724382 612219 229053 137747 97382
12284 97382 -36280 -51358 83250 70961 131799 -20966 93465 341231 172130 -30442
12274 -30442 10542 -32963 -108831 10098 19410 -242446 -194661 -194935 -140947 -169002 -360585 -127952
12262 -127952 67553 -188279 36982 61808 65174 119143 177909 250355 354538 46032 54038
12251 54038 241593 262624 299905 423576 451383 488782 337023 153874 -59564 -84455 -42198
12240 -42198 186466 102882 8407 123741 93398 145978 64652 154137 288504 455775 526664
12229 526664 492876 450085 262191 82939 203151 153892 137520 20334 171955 177751 218193
12218 218193 -11234 -92022 -88660 -316178 -303800 -23696 203660 234700 284939 154853 88328
$$ packed form
12294B17646J39801k7630n2159O7872J06681K72171j12163l83166r1306m0365
12284I7382j33662j5078J34608j2289O0838j52765J14431K47766j69101k02572
12274c0442M0984m3505p5868J18929R312k61856M7785k74N3988k8055j91583K32633
12262a27952J95505k55832K25261K4826L366N3969N8766P2446J04183l08506Q006
12251E4038J87555K1031L7281J23671K7807L7399j51759j83149k13438k4891M2257
12240d2198K28664q3584r4475J15334l0343N2580q1326Q9485J34367J67271P0889
12229E26664l3788m2791j87894j79252J20212m9259j6372j17186J51621N796M0442
12218B18193k29427q0788L362k27518J2378K80104K27356L1040N0239j30086o6525
$$ plain form
12207 88328 145875 -3664 164801 474543 394776 206140 148559 113861 232209 344477
12197 344477 180869 100351 196919 193978 402881 542292 365945 318797 311087 160957 -264960
12186 -264960 -266350 -140002 -39042 51705 350657 228837 152848 84762 170980 267598 269503
12175 269503 349305 477965 428926 310067 287195 255262 148860 143202 329921 431438 538660
12164 538660 639868 540737 204237 19140 78960 165011 321167 377274 515324 553524
12154 553524 437757 332515 56469 37201 45065 171155 132778 148986 213247 223381 187962
12143 187962 360454 374284 273875 415924 469880 345181 160673 14611 -105833 66990
12133 66990 93014 130544 160463 136084 124404 112712 118666 63466 51526 -15920 25385 69716
$$ packed form
12207H8328N7547j49539J68465L09742p9767j88636n7581l4698J18348J12268
12197C44477j63608q0518R6568k941K08903J39411j76347m7148p710j50130m25917
12186b64960j390J26348J00960R0747K98952j21820p5989o8086Q6218R6618J905
12175B69503P9802J28660m9039j18859k2872l1933j06402n658J86719J01517J07222
12164E38660J01208r9131l36500j85097N9820Q6051J56156N6107J38050L8200
12154E53524j15767j05242k76046j9268P864J26090l8377J6208O4261J0134l5419
12143A87962J72492J3830j00409J42049N3956j24699j84508j46062j20444J72823
12133F6990K6024L7530K9919k4379j1680j1692N954n5200j1940o7446M1305M4331
$$ plain form
12121 69716 83336 132446 -36211 -79497 -91244 113443 144434 -1631 206182 551916 573506
12110 573506 272203 197017 295059 453232 376450 332409 561519 398835 302661 318577 498517
12099 498517 362372 466425 575036 741557 718699 606762 340990 193579 231180 327603
12089 327603 339755 288864 315235 248631 246096 104834 205433 396543 323944 297127 344080
12078 344080 405127 481705 564292 595233 598430 593080 475705 582111 699807 761262 583603
12067 583603 633310 775039 694424 684130 662240 671692 687093 768493 882488 697573 683286
12056 683286 627363 694050 640389 637500 473392 429976 582272 570626 618813 714470 812562
12045 812562 784438 970160 1192889 1302716 1189960 989627 1185652 1218912 1144524 1140655
$$ packed form
12121F9716J3620M9110j68657m3286j1747K04687L0991j46065K07813L45734K1590
12110E73506l01303p5186R8042J58173p6782m4041K29110j62684r6174J5916J79940
12099D98517j36145J04053J08611J66521k2858j11937k65772j47411L7601R6423
12089C27603J2152n0891K6371o6604k535j41262J00599J91110p2599k6817M6953
12078C44080O1047P6578Q2587L0941L197n350j17375J06406J17696O1455j77659
12067E83603M9707J41729q0615j0294k1890R452J5401Q1400J13995j84915j4287
12056F83286n5923O6687n3661k889j64108m3416J52296j1646M8187R5657R8092
12045H12562k8124J85722K22729J09827j12756k00333J96025L3260p4388l869
$$ plain form
12035 1140655 1059614 1059850 1206049 1140276 1191041 1153484 1142251 1268515 1080300 982790 1096161
12024 1096161 1186520 1343788 1189234 997781 920200 895882 1065500 1285816 1273957 1427612
12014 1427612 1679530 1631158 1382973 1183857 1194963 1126772 1113429 1106066 1234883 1457876
12004 1457876 1563561 1575685 1508947 1510556 1656331 1705957 1790530 1781304 2086491 2234685 2256776
11993 2256776 2362215 2357602 2346549 2378921 2448911 2308862 2272817 2236799 2575279 2858214 3027632
11982 3027632 2993790 3031394 3041823 3037457 2930622 2817569 3008210 3341612 3550215 3895381
11972 3895381 4120876 4247783 4441022 4702825 5003780 4997781 4969702 5006675 5168521 5275113
11962 5275113 5343029 5609516 5822396 6105794 6292455 6534798 6863615 7304982 7616277 7885219
$$ packed form
12035A140655q1041K36J46199o5773N0765l7557j1233J26264j88215r7510J13371
12024A096161R0359J57268j54554j91453p7581k4318J69618K20316j1859J53655
12014A427612K51918m8372k48185j99116J1106o8191j3343p363J28817K22993
12004A457876J05685J2124o6738J609J45775M9626Q4573r226L05187J48194K2091
11993B256776J05439m613j1053L2372O9990j40049l6045l6018L38480K82935J69418
11982C027632l3842L7604J0429m366j06835j13053J90641L33402K08603L45166
11972C895381K25495J26907J93239K61803L00955n999k8079L6973J61846J06592
11962E275113O7916K66487K12880K83398J86661K42343L28817M41367L11295K68942
$$ plain form
11952 7885219 8128797 8711843 9101602 9432647 9961517 10478114 11036444 11599361 12579769
11943 12579769 13643788 14642713 15472628 16622455 17915383 19290282 20592179 22466711
11935 22466711 24544730 26732160 29089432 32078623 35545402 39258574 43534362 48728997
11927 48728997 54560234 61594317 70153075 80530326 92667316 107154126 124652581
11920 124652581 145598010 169800514 197349761 227113189 256840847 283028655 301590036
11913 301590036 309959581 307021187 293230663 271154126 244336267 216281093 189332690
11906 189332690 164639529 143019229 124743020 109086252 96037557 84897444 75374563
11899 75374563 67198224 60268028 54417427 49286272 44840670 40941468 37622368 34788204
$$ packed form
11952G885219K43578N83046L89759L31045N28870N16597N58330N62917R80408
11943A2579769J064019R98925Q29915J149827J292928J374899J301897J874532
11935B2466711K078019K187430K357272K989191L466779L713172M275788N194635
11927D8728997N831237P034083Q558758J0377251J2136990J4486810J7498455
11920A24652581K0945429K4202504K7549247K9763428K9727658K6187808J8561381
11913C01590036Q369545k938394j3790524k2076537k6817859k8055174k6948403
11906A89332690k4693161k1620300j8276209j5656768j3048695j1140113r522881
11899G5374563q176339o930196n850601n131155m445602l899202l319100k834164
$$ plain form
11891 34788204 32128781 29756713 27493126 25578690 23977418 22599856 21231708 19866740
11883 19866740 18703757 17598258 16501756 15546067 14698587 13830222 13048855 12592181 12211861
11874 12211861 11609872 10805594 10257143 9928126 9648907 9145954 8688420 8314320 7860759
11865 7860759 7448357 6990362 6737967 6525768 6161880 5962395 5813109 5572014 5319099
11856 5319099 5113860 4793486 4547038 4385250 4072097 3931762 3993403 3961502 3856365 3821599
11846 3821599 3671484 3463527 3304312 3313812 3336746 3199106 3177717 3129272 2829169 2515788
11836 2515788 2413648 2125758 1913518 2006871 1904756 2123195 2251726 2125695 2049657 1759942
11826 1759942 1470307 1303297 1468920 1781262 1793472 1607335 1697176 1641304 1612577 1538719
$$ packed form
11891C4788204k659423k372068k263587j914436j601272j377562j368148j364968
11883A9866740j162983j105499j096502r55689q47480q68365p81367m56674l80320
11874A2211861o01989q04278n48451l29017k79219n02953m57534l74100m53561
11865G860759m12402m57995k52395k12199l63888j99485j49286k41095k52915
11856E319099k05239l20374k46448j61788l13153j40335O1641l1901j05137l4766
11846C821599j50115k07957j59215R500K2934j37640k1389m8445l00103l13381
11836B515788j02140k87890k12240R3353j02115K18439J28531j26031p6038k89715
11826A759942k89635j67010J65623L12342J2210j86137Q9841n5872k8727p3858
$$ plain form
11816 1538719 1411995 1207408 1392533 1443094 1541420 1199617 1053724 1142767 1217692 1240745
11806 1240745 1183512 1193582 1218043 1061340 1011920 936765 941612 980614 934784 801920 643585
11795 643585 602558 637972 653015 427477 333925 426112 515267 531173 659571 492868 511936
11784 511936 424252 469878 647748 738799 535090 670032 808513 760925 581260 612904
11774 612904 625419 594100 443561 193880 301938 419381 363056 285312 74500 64007
11764 64007 46726 216082 325256 212507 87287 190142 278480 337746 571156 721312
11754 721312 427253 261233 358998 432008 536956 781215 777539 654112 489078 459581
11744 459581 565748 529843 546348 749302 598217 392241 320032 413991 661116 701863
$$ packed form
11816A538719j26724k04587J85125N0561R8326l41803j45893Q9043P4925K3053
11806A240745n7233J0070K4461j56703m9420p5155M847L9002m5830j32864j58335
11795F43585m1027L5414J5043k25538r3552R2187Q9155J5906J28398j66703J9068
11784E11936q7684M5626J77870R1051k03709J34942J38481m7588j79665L1644
11774F12904J2515l1319j50539k49681J08058J17443n6325p7744k10812j0493
11764F4007j7281J69356J09174j12749j25220J02855Q8338N9266K33410J50156
11754G21312k94059j66020R7765P3010J04948K44259l676j23427j65034k9497
11744D59581J06167l5905J6505K02954j51085k05976p2209R3959K47125M0747
$$ plain form
11734 701863 584975 657846 702472 704228 524563 375033 277821 171459 217171 36451 -145235
11723 -145235 89253 179425 176245 85735 -45471 -50231 27821 91300 270916 432750 310200
11712 310200 323430 406067 252872 108654 102171 190579 159464 36273 -26139 181256 375382
11701 375382 362908 168647 88750 350921 343559 280312 338316 282974 147480 233382 186797
11690 186797 210270 65870 66077 75997 -26587 135693 355389 276211 250497 38845 -54279
11679 -54279 -8016 -43240 -67766 -142364 171376 189528 227914 131823 145178 348563 564398
11668 564398 579368 577868 380024 177164 219796 255963 454343 451883 358397 430240 422133
11657 422133 357326 346112 444679 382066 484263 521319 532866 513298 411478 219461 69495
$$ packed form
11734G01863j16888P2871M4626J756j79665j49530r7212j06362M5712j80720j81686
11723a45235K34488R0172l180r0510j31206m760P8052O3479J79616J61834j22550
11712C10200J3230Q2637j53195j44218o483Q8408l1115j23191o2412K07395J94126
11701C75382j2474j94261p9897K62171p362o3247N8004n5342j35494Q5902m6585
11690A86797K3473j44400K07R920j02584J62280K19696p9178k5714k11652r3124
11679e4279M6263l5224k4526p4598L13740J8152L8386r6091J3355K03385K15835
11668E64398J4970j500j97844k02860M2632L6167J98380k460r3486P1843q107
11657D22133o4807j1214R8567o2613J02197L7056J1547j9568j01820j92017j49966
$$ plain form
11646 69495 -39453 -142199 -38347 -156874 -134917 141821 227579 75379 -18890 -142066
11636 -142066 -207388 -165738 -149202 -210272 -195703 -25340 47373 21825 35997 -36317 -98908
11625 -98908 -17656 -59194 -33743 -25394 -66526 -134737 -112420 -120222 -12862 -56088 -24594 -109297
11613 -109297 -308234 -303677 -191937 -133647 -188582 -134563 -34881 -51263 248345 215406 13459
11602 13459 23356 46744 -170607 -312261 -183553 -390596 -432365 -228799 110898 194324 90914
11591 90914 148496 98685 24745 67347 16866 155613 150725 72053 -3716 -27163 -10663 -16300
11579 -16300 -32089 30316 -37566 -27174 73968 429636 424399 335919 315457 144738 157805
11568 157805 181363 79194 165953 161461 107782 -82591 -104775 28439 -136232 -242853 -225409
$$ packed form
11646F9495j08948j02746J03852j18527K1957K76738Q5758j52200r4269j23176
11636a42066o5322M1650J6536o1070J4569J70363P2713k5548J4172p2314o2591
11625i8908Q1252m1538K5451Q349m1132o8211K2317p802J07360m3226L1494q4703
11613a09297j98937M557J11740N8290n4935N4019R9682j6382K99608l2939k01947
11602A3459R897K3388k17351j41654J28708k07043m1769K03566L39697Q3426j03410
11591I0914N7582m9811p3940M2602n0481J38747m888p8672p5769k3447J6500n637
11579a6300j5789O2405o7882J0392J01142L55668n237q8480k0462j70719J3067
11568A57805K3558j02169Q6759m492n3679j90373k2184J33214j64671j06621J7444
$$ plain form
11557 -225409 -120928 -138291 -178820 20327 161358 196128 211615 92649 -50157 -205445
11547 -205445 -359758 -329434 -88935 45147 -2024 -35609 -118519 -149286 39435 247509
11537 247509 133520 31345 39864 -130123 -255168 -176413 -110306 -114827 -141649 -162515 -144903
11526 -144903 -223772 -335171 -431727 -316661 -187831 -121882 55812 287315 330702 169558
11516 169558 97876 -55981 -113252 68955 381221 437667 285267 207948 65230 -21831
11506 -21831 144077 220330 276957 252441 275947 471419 546594 523809 419754 170965 -55316
11495 -55316 -139262 40506 148483 90025 27475 185882 281876 141696 191606 278633 180458
11484 180458 10524 40870 145599 149895 85964 57505 235442 258269 209861 65351 66557
$$ packed form
11557b25409J04481j7363m0529J99147J41031L4770J5487j18966j42806j55288
11547b05445j54313L0324K40499J34082m7171l3585q2910l0767J88721K08074
11537B47509j13989j02175Q519j69987j25045P8755O6107m521k6822k0866J7612
11526a44903p8869j11399r6556J15066J28830O5949J77694K31503M3387j61144
11516A69558p1682j53857n7271J82207L12266N6446j52400p7319j42718q7061
11506b1831J65908P6253N6627k4516K3506J95472P5175k2785j04055k48789k26281
11495e5316q3946J79768J07977n8458o2550J58407R5994j40180M9910Q7027r8175
11484A80458j69934L0346J04729M296o3931k8459J77937K2827m8408j44510J206
$$ plain form
11473 66557 209587 280772 162512 162144 141897 153748 117878 122739 82435 9295 -19666 14098
11461 14098 177949 345672 271632 -18219 -10297 -76788 -185953 -157279 -219720 -239123 -74768
11450 -74768 -263152 -546584 -406446 -154826 -160948 -56387 3656 -95503 -246145 -331003 -187715
11439 -187715 -114884 -139035 -154192 -205824 -173059 -51466 -80760 -4427 117430 177104 -33113
11428 -33113 -270835 -117068 171135 261008 135505 27199 -56088 -22031 128797 174005
11418 174005 236105 341604 338208 13210 49120 115890 227066 99619 31600 -47894 -128807
11407 -128807 -245077 -150556 -183460 -336237 -171585 -29658 -15782 110231 70244 68359 -15187
11396 -15187 -14433 87103 43827 -36797 -44548 10466 -43868 17381 101192 121012 96346 -114325
$$ packed form
11473F6557J43030P1185j18260l68k0247J1851l5870M861m0304p3140k8961L3764
11461A4098J63851J67723p4040k89851P922o6491j09165K8674o2441j9403J64355
11450g4768j88384k83432J40138K51620o122J04561O0043r9159j50642q4858J43288
11439a87715P2831k4151j5157n1632L2765J21593k9294P6333J21857N9674k10217
11428c3113k37722J53767K88203Q9873j25503j08306q3287L4057J50828M5208
11418A74005O2100J05499l396l24998L5910O6770J11176j27447o8019p9494q0913
11407a28807j16270R4521l2904j52777J64652J41927J3876J26013l9987j885q3546
11396a5187P54J01536m3276q0624p751N5014n4334O1249Q3811J9820k4666k10671
$$ plain form
11384 -114325 43522 283271 121196 -311235 -455953 -319414 -153656 -162097 -152290 -219990
11374 -219990 -208445 -112922 81298 273805 165000 -79729 -190866 -239852 -319151 -237003
11364 -237003 -262832 -117151 -4567 -67533 77142 163219 75136 -70874 -211180 -131327
11354 -131327 -116473 -124868 -160577 -164679 -283432 -489122 -502378 -31198 191357 3294 -13346
11343 -13346 -49874 -91151 75 17480 -183813 -264743 -145780 -236754 -250746 -258002 -116852
11332 -116852 -28743 -24888 -156788 -311283 -179796 -19285 -199879 -295622 -328240 -185597
11322 -185597 29374 162343 212890 114239 -98014 -140047 -106598 -190069 -177548 -80234 -84170
11311 -84170 -285126 -225382 -127061 -240454 -216365 -48909 -34223 -118914 2372 -22169 11229
$$ packed form
11384a14325J57847K39749j62075m32431j44718J36539J65758q441R807o7700
11374b19990J1545R5523J94220J92507j08805k44729j11137m8986p9299Q2148
11364b37003k5829J45681J12584o2966J44675Q6077q8083j46010j40306P9853
11354a31327J4854q395l5709m102j18753k05690j3256M71180K22555j88063j6640
11343a3346l6528m1277R1226J7405k01293q0930J18963r0974j3992p256J41150
11332a16852Q8109L855j31900j54495J31487J60511j80594r5743l2618J42643
11322a85597K14971J32969N0547r8651k12253m2033L3449q3471J2521R7314l936
11311h4170k00956N9744R8321j13393K4089J67456J4686q4691J21286k4541L3398
$$ plain form
11300 11229 -96702 -57256 -78410 38040 100389 -3824 24453 52641 -72617 -46566 69821
11289 69821 59691 123062 178363 97923 45002 94826 102599 146956 111805 63581 -90629 -22963
11277 -22963 -95145 -105501 -65687 -97307 -129836 -85686 -42768 -135267 -369383 -428594 -219590
11266 -219590 -204930 -155294 41346 -116731 -177149 -120176 -148622 -163732 49927 -69161 -159802
11255 -159802 -172833 -106993 167990 39328 45054 65589 91999 -14862 -68241 -17382 200667
11244 200667 336239 159414 36856 -8034 -99140 -148397 -92869 -162503 -244203 -492954 -380588
11233 -380588 -223169 -111437 -57389 -108607 -742 9812 -176066 -385790 -216338 -53005
11223 -53005 111217 25161 -83757 -254125 -363445 -354633 -316821 -395184 -624181 -650322 -332031
$$ packed form
11300A1229j07931L9446k1154J16450O2349j04213K8277K8188j25258K6051J16387
11289F9821j0130O3371N5301q0440n2921M9824P773M4357l5151m8224j54210O7666
11277b2963p2182j0356L9814l1620l2529M4150M2918r2499k34116n9211K09004
11266b19590J4660M9636J96640j58077o0418N6973k8446j5110K13659j19088r0641
11255a59802j3031O5840K74983j28662N726K0535K6410j06861n3379N0859K18049
11244B00667J35572j76825j22558m4890r1106m9257N5528o9634q1700k48751J12366
11233c80588J57419J11732N4048n1218J07865J0554j85878k09724J69452J63333
11223e3005J64222q6056j08918j70368j09320Q812L7812p8363k28997k6141L18291
$$ plain form
11212 -332031 -131253 -69139 74815 -114382 -135776 -62067 104206 340384 204972 -23556
11202 -23556 -64016 -184028 -320441 -175223 107514 49785 -30068 42467 -35013 -22095 -488
11191 -488 -36540 -186722 -168326 572 22189 -36213 -35249 221136 286371 304606 322554 347207
11179 347207 263244 119612 -56106 -160367 -168764 -97138 -197870 -131190 -318440 -95883
11169 -95883 -30183 -86206 42629 -39329 -152181 1067 104500 62289 -11971 -75667 -208784
11158 -208784 -242817 -88653 161314 192910 53762 -71419 -263405 -221924 -102902 -134444
11148 -134444 -339432 -430241 -412559 -182445 -43212 60419 -65241 -162800 -32331 78974
11138 78974 -59069 -312782 -454614 -442408 -541395 -505486 -268546 -34671 51115 -32417 3729
$$ packed form
11212c32031K00778O2114J43954j89197k1394P3709J66273K36178j35412k28528
11202b3556m0460j20012j36413J45218K82737n7729p9853P2535p7480J2918K1607
11191d88l6052j50182J8396J68898K1617n8402R64K56385O5235J8235J7948K4653
11179C47207q3963j43632j75718j04261q397P1626j00732O6680j87250K22557
11169i5883O5700n6023J28835q1958j12852J53248J03433m2211p4260o3696j33117
11158b08784l4033J54164K49967L1596j39148j25181j91986M1481J19022l1542
11148a34444k04988r0809J7682K30114J39233J03631j25660r7559J30469J11305
11138G8974j38043k53713j41832J2206r8987L5909K36940K33875Q5786q3532L6146
$$ plain form
11127 3729 113530 7065 -164351 -230629 -256302 -197981 37027 283159 335692 304178 107981
11116 107981 -81533 -371070 -379982 -138374 -126732 -214941 -224365 -207482 -217752 195367 344475
11105 344475 184216 85976 -136081 -35717 30676 40961 -134386 38455 191581 319401
11095 319401 290983 199729 15750 -101705 -84523 -174959 -91551 -28920 92604 -21561 -178044
11084 -178044 -239376 -299674 -293556 -306965 -33569 89449 -71435 -110136 -116313 -49973 -44749
11073 -44749 40723 99396 109085 240627 -34679 -28750 164360 133277 24805 73308 153594
11062 153594 258673 58551 -154190 -250435 -290263 -226549 -152925 39576 -126802 -163736
11052 -163736 -168980 -107795 -88572 -69753 97222 78117 310295 393535 280801 407879 336613
$$ packed form
11127C729J09801j06465j71416o6278k5673N8321K35008K46132N2533l1514j96197
11116A07981j89514k89537q912K41608J1642q8209r424J6883j0270M13119J49108
11105C44475j60259r8240k22057J00364O6393J0285j75347J72841J53126J27820
11095C19401k8418r1254j83979j17455J7182r0436Q3408O2631J21524j14165j56483
11084a78044o1332o0298O118j3409K73396J23018j60884l8701o177O6340N224
11073d4749Q5472N8673R689J31542k75306N929J93110l1083j08472M8503Q0286
11062A53594J05079k00122k12741r6245l9828O3714P3624J92501j66378l6934
11052a63736n244O1185J9223J8819J66975j9105K32178Q3240j12734J27078p1266
$$ plain form
11041 336613 175256 339591 641793 896710 1132356 1061754 981330 852027 713744 600426
11031 600426 673302 876909 999125 1140426 1554699 1914229 2066550 1932734 1782110 1642495
11021 1642495 1503967 1551733 1699848 1588166 1773705 2066149 2248545 2604724 2860671 2613462
11011 2613462 2443685 2288302 1953587 1742884 1537596 1320994 1472822 1728012 1757350 1849807
11001 1849807 2123302 2068821 1702003 1489623 1333859 1035658 976005 973145 846882 823917
10991 823917 871647 993002 924928 841478 914735 832247 539588 341988 319352 196062 46054
10980 46054 -142 26344 55620 18082 -22154 19102 176394 332689 310785 433121 388699
10969 388699 459911 223366 200158 227766 206283 249933 224399 93462 179951 22454 38022
$$ packed form
11041C36613j61357J64335L02202K54917K35646p0602q0424j29303j38283j13318
11031F00426P2876K03607J22216J41301M14273L59530J52321j33816j50624j39615
11021A642495j38528M7766J48115j11682J85539K92444J82396L56179K55947k47209
11011B613462j69777j55383l34715k10703k05288k16602J51828K55190K9338R2457
11001A849807K73495n4481l66818k12380j55764k98201n9653k860j26263k2965
10991H23917M7730J21355o8074q3450P3257q2488k92659j97600k2636j23290j50008
10980D6054m6196K6486K9276l7538m0236M1256J57292J56295k1904J22336m4422
10969C88699P1212k36545k3208K7608k1483M3650k5534j30937Q6489j57497J5568
$$ plain form
10958 38022 297514 358517 220827 255734 109827 180721 401735 433807 186130 -61535
10948 -61535 76071 126636 73752 1855 216430 319386 296960 298312 287099 236275 266914
10937 266914 290945 117483 -20120 16324 -111602 -242394 -177795 -252977 -168141 76882
10927 76882 37989 -87922 -310690 -185872 39472 89061 118788 100415 124781 141593 46876
10916 46876 -55696 -64091 -77185 -191041 -54841 193150 173500 231108 142271 49160 -4636
10905 -4636 10202 2933 89956 -16713 149177 218188 150874 103479 216595 161543 168518 69200
10893 69200 84 196225 174998 35383 83328 87687 155904 159847 324940 416385 381758
10882 381758 368783 270977 90170 65297 87154 -31525 164010 318188 117625 1045
$$ packed form
10958C8022K59492O1003j37690L4907j45907P0894K21014L2072k47677k47665
10948f1535J37606N0565n2884p1897K14575J02956k2426J352j1213n0824L0639
10937B66914K4031j73462j37603L6444j27926j30792O4599p5182Q4836K45023
10927G6882l8893j25911k22768J24818K25344M9589K9727j8373K4366J6812r4717
10916D6876j02572q395j3094j13856J36200K47991j9650N7608q8837r3111n3796
10905d636J4838p269Q7023j06669J65890O9011o7314m7395J13116n5052O975r9318
10893F9200o9116J96141k1227j39615M7945M359O8217L943J65093R1445l4627
10882C81758j2975r7806j80807k4873K1857j18679J95535J54178k00563j16580
$$ plain form
10872 1045 -20158 51570 87022 181122 47859 -93201 -172670 -125946 -105191 -46983 -143823
10861 -143823 -117334 -57544 122708 492547 276011 213245 157012 117551 287671 322503 292629
10850 292629 141664 86408 282885 368927 532097 501645 488391 494306 225308 99713 40089
10839 40089 174452 143423 299076 289789 175452 290282 314042 159542 95877 66368 113660
10828 113660 67885 200485 311391 109690 149355 190063 57892 -124048 -141591 -38556
10818 -38556 -33497 -170016 -215984 28089 182534 37481 -11391 45617 141312 95254 -30218
10807 -30218 -53030 -173897 -269469 -287544 -236292 -106859 84812 248021 216975 165836 95462
10796 95462 256791 231871 159272 -63819 -301294 -517720 -504490 -590523 -521960 -487323 -506177
$$ packed form
10872A045k1203P1728L5452R4100j33263j41060p9469M6724K0755N8208r6840
10861a43823K6489N9790J80252L69839k16536o2766n6233l9461J70120L4832k9874
10850B92629j50965n5256J96477Q6042J63170l0452j3254N915k68998j25595n9624
10839D0089J34363l1029J55653r287j14337J14830K3760j54500o3665k9509M7292
10828A13660m5775J32600J10906k01701L9665M0708j32171j81940j7543J03035
10818c8556N059j36519m5968K44073J54445j45053m8872N7008R5695m6058j25472
10807c0218k2812j20867r5572j8075N1252J29433J91671J63209l1046n1139p0374
10796I5462J61329k4920p2599k23091k37475k16426J3230q6033O8563L4637j8854
$$ plain form
10785 -506177 -384513 -223472 -190339 -185507 5664 76010 -88594 -334659 -117131 -64166
10775 -64166 -179388 -135385 -50064 -173611 -30440 -55144 -49158 -43479 -160365 20718 124507
10764 124507 15476 56616 44564 351132 356315 95804 -30896 11698 125366 147277 145135
10753 145135 174016 20333 -83309 -199948 -66286 418562 504217 502178 362161 463696
10743 463696 267831 35957 72851 341696 415910 352702 526573 836171 791132 633483
10733 633483 615624 778277 744340 616418 431648 432479 585359 790159 911013 1006070 876274
10722 876274 624553 417670 457996 730888 788837 1034921 820881 571739 458535 605471
10712 605471 549768 671291 938093 939202 774866 843271 701704 639922 584499 712946 977623
$$ packed form
10785e06177J21664J61041L3133M832J91171P0346j64604k46065K17528N2965
10775f4166j15222M4003Q5321j23547J43171k4704N986N679j16886J81083J03789
10764A24507j09031M1140j2052L06568N183k60511j26700M2594J13668K1911k142
10753A45135K8881j53683j03642j16639J33662M84848Q5655k039j40017J01535
10743D63696j95865k31874L6894K68845P4214o3208J73871L09598m5039j57649
10733F33483j7859J62653l3937j27922j84770Q31J52880K04800J20854R5057j29796
10722H76274k51721k06883M0326K72892N7949K46084k14040k49142j13204J46936
10712F05471n5703J21523K66802J109j64336O8405j41567o1782n5423J28447K64677
$$ plain form
10701 977623 997435 935145 790791 494205 553493 578269 567749 825163 848775 702997 704836
10690 704836 765998 504746 420016 532178 368562 246016 156313 424052 563762 670866
10680 670866 729528 615167 565596 664849 692013 655399 808294 944349 852292 798229 706157
10669 706157 755664 867490 990615 989637 806915 794691 721794 834375 666451 783778 847732
10658 847732 781809 689003 877678 1209697 1225606 1385554 1416419 1307968 1264124 1352531 1579971
10647 1579971 2187335 2840639 3073614 3450082 3722165 3990281 4437629 4368730 4107826 3967339
10637 3967339 3461287 3115540 3113383 3373052 3701703 3840489 4015831 4525651 5268522 5932561
10627 5932561 7106328 8707453 10507198 12370097 13710241 14615694 15137193 15364167 15712707
$$ packed form
10701I77623J9812o2290j44354k96586N9288K4776j0520K57414K3612j45778J839
10690G04836O1162k61252q4730J12162j63616j22546q9703K67739J39710J07104
10680F70866N8662j14361m9571R9253K7164l6614J52895J36055r2057n4063r2072
10669G06157M9507J11826J23125r78j82722j2224p2897J12581j67924J17327O3954
10658H47732o5923r2806J88675L32019J5909J59948L0865j08451m3844Q8407K27440
10647A579971O07364O53304K32975L76468K72083K68116M47348o8899k60904j40487
10637C967339n06052l45747k157K59669L28651J38786J75342N09820P42871O64039
10627E932561J173767J601125J799745J862899J340144R05453N21499K26974L48540
$$ plain form
10618 15712707 16641947 18620927 21167602 25019932 30845099 38707681 48847550 61809121
10610 61809121 78551227 99113253 120710124 139667660 152699183 158136399 156455691
10603 156455691 151216512 146833135 147436907 156100729 174707880 204914033 246032783 290050150
10595 290050150 325102393 343044985 342144154 323958715 296684149 272782583 260922174
10588 260922174 264763049 286105414 325372034 379409144 434704445 472522958 482874675
10581 482874675 464804419 422324908 368087982 319706520 286898974 271562440 273042303
10574 273042303 289783249 317061432 344047174 357937267 352839132 329015982 290162518
10567 290162518 246030442 207930070 181418717 166148042 160326731 162032236 167717726
$$ packed form
10618A5712707R29240J978980K546675L852330N825167P862582J0139869J2961571
10610F1809121J6742106K0562026K1596871J8957536J3031523N437216j680708
10603A56455691n239179m383377O03772Q663822J8607151L0206153M1118750M4017367
10595B90050150L5052243J7942592r00831j8185439k7274566k3901566j1860409
10588B60922174L840875K1342365L9266620N4037110N5295301L7818513J0351717
10581D82874675j8070256m2479511n4236926m8381462l2807546j5336534J479863
10574B73042303J6740946K7278183K6985742J3890093n098135k3823150l8853464
10567B90162518m4132076l8100372k6511353j5270675n821311J705505N685490
$$ plain form
10560 167717726 172599242 172171073 163859542 147795677 126346458 103575151 83147008
10553 83147008 67093029 54934039 45913379 39224647 34215220 30237101 26862265 24425259
10545 24425259 22356047 20413192 18556548 16766642 15234387 14128739 13215865 12115441
10537 12115441 11224271 10544439 9891888 9407391 8989006 8283199 7468142 7104407 6939421
10528 6939421 6617230 6372076 6137542 5812508 5429148 5005235 4638339 4266425 4081633
10519 4081633 4212001 4049481 3600487 3519847 3373092 3082863 2952747 2945319 2939115 2888488
10509 2888488 2820624 2505743 2348478 2296450 2405290 2259962 2025213 1926181 1979486 1897657
10499 1897657 1796152 1829011 1777686 1808709 1665654 1667037 1626256 1413720 1410568 1172793 983319
$$ packed form
10560A67717726M881516m28169q311531j6063865k1449219k2771307k0428143
10553H3147008j6053979j2158990r020660o688732n009427l978119l374836k437006
10545B4425259k069212j942855j856644j789906j532255j105648r12874j100424
10537A2115441q91170o79832o52551m84497m18385p05807q15057l63735j64986
10528F939421l22191k45154k34534l25034l83360m23913l66896l71914j84792
10519D081633J30368j62520m48994q0640j46755k90229j30116p428o204n0627
10509B888488o7864l14881j57265n2028J08840j45328k34749r9032N3305q1829
10499A897657j01505L2859n1325L1023j43055J383m0781k12536l152k37775j89474
$$ plain form
10488 983319 790991 790369 701492 930356 939376 852554 871168 880291 737134 560638 583130
10477 583130 644057 633798 765595 756228 685984 691658 708680 696355 630099 452337 369273
10466 369273 168973 91812 114525 268014 410058 512272 628959 686747 402264 266002
10456 266002 356010 321982 212162 -56654 153608 291405 335300 318168 198208 59613
10446 59613 -73966 -99493 -208632 -222450 -238974 -168505 -64958 -64199 13784 185980 166004
10435 166004 153193 55303 -152396 -124716 79411 35199 51356 122374 142380 -25633 -25526
10424 -25526 -44914 -45410 161603 152734 109877 232821 273404 263291 78030 157316 314489
10413 314489 451505 584346 625056 683590 768282 693447 519215 568645 641138 778931 575499
$$ packed form
10488I83319j92328o22q8877K28864R020q6822J8614R123j43157j76496K2492
10477E83130O0927j0259J31797r367p0244N674J7022j2325o6256j77762q3064
10466C69273k00300p7161K2713J53489J42044J02214J16687N7788k84483j36262
10456B66002R0008l4028j09820k68816K10262J37797M3895j7132j19960j38595
10446E9613j33579k5527j09139j3818j6524P0469J03547P59P7983J72196j9976
10435A66004j2811r7890k07699K7680K04127m4212J6157P1018K0006j68013J07
10424b5526j9388m96K07013q869m2857J22944M0583j0113j85261P9286J57173
10413C14489J37016J32841M0710N8534Q4692p4835j74232M9430P2493J37793k03432
$$ plain form
10402 575499 264882 291846 417354 642243 666874 553970 537982 513765 602838 556061 382944
10391 382944 454719 505168 399340 252537 213221 166135 134013 234527 140458 134024 247580
10380 247580 164742 253376 260663 209656 305649 353915 205907 105443 353860 541811 497554
10369 497554 658604 702910 449871 471378 605136 652516 466198 250456 258693 309528 345413
10358 345413 237264 130062 257942 349609 327806 236363 285560 335504 617086 546415 229026
10347 229026 112182 339119 595946 559242 581976 540138 315559 419052 454455 515811
10337 515811 346533 388652 468793 372814 273539 278219 462524 471063 294042 204579 249388
10326 249388 421979 273107 100961 150319 313991 467290 554029 570684 487586 370966
$$ packed form
10402E75499l10617K6964J25508K24889K4631j12904j5988k4217Q9073m6777j73117
10391C82944P1775N0449j05828j46803l9316m7086l2122J00514r4069o434J13556
10380B47580q2838Q8634P287n1007R5993M8266j48008j00464K48417J87951m4257
10369D97554J61050M4306k53039K1507J33758M7380j86318k15742Q237N0835L5885
10358C45413j08149j07202J27880R1667k1803r1443M9197M9944K81582p0671l17389
10347B29026j16844K26937K56827l6704K2734m1838k24579J03493L5403O1356
10337E15811j69278M2119Q0141r5979r9275M680J84305Q539j77021q9463M4809
10326B49388J72591j48872j72146M9358J63672J53299Q6739J6655q3098j16620
$$ plain form
10316 370966 469374 437223 259223 361875 344021 377078 425565 327236 107031 54249 -65560
10305 -65560 -229228 -115703 61356 -204203 -206810 172110 226703 217458 211928 71018 -71891
10294 -71891 156890 299302 265947 392499 330910 248288 106754 -104233 -50716 81140
10284 81140 123540 192552 71895 -30987 -102079 -35190 -176376 -101388 5837 -7738 -153075
10273 -153075 -137702 -151454 -177882 -203404 -160269 -51017 -50659 -141735 -108190 121302 291237
10262 291237 333836 269582 273499 197129 -579 48024 135221 292197 274338 205167 -39963
10251 -39963 -150629 -6450 -77116 -105140 -136339 -98338 134299 136776 -82932 -293376 -215097
10240 -215097 -141247 104288 297745 315365 95238 112110 132257 62175 78706 265699 147262
$$ packed form
10316C70966R8408l2151j78000J02652j7854L3057M8487r8329k20205n2782j19809
10305f5560j63668J13525J77059k65559k607L78920N4593r245n530j40910j42909
10294g1891K28781J42412l3355J26552o1589q2622j41534k10987N3517J31856
10284H1140M2400O9012j20657j02882p1092O6889j41186P4988J07225j3575j45337
10273a53075J5373j3752k6428k5522M3135J09252L58r1076L3545K29492J69935
10262B91237M2599o4254L917p6370j97708M8603Q7197J56976j7859o9171k45130
10251c9963j10666J44179p0666k8024l1199L8001K32637K477k19708k10444P8279
10240b15097P3850K45535J93457J7620k20127J6872K0147p0082J6531J86993j18437
$$ plain form
10229 147262 214605 227562 117489 258337 341872 394588 295848 46149 -175496 -68835
10219 -68835 6403 -208993 -158967 84180 93041 320405 375267 149047 57567 26980 68542
10208 68542 51423 156180 131503 39188 234708 290831 193469 -1294 -61594 142119 231495
10197 231495 231815 64833 36477 193943 122736 -56395 -12677 113183 116318 68296 30793
10186 30793 365 67051 -36464 16892 -36823 -34462 216512 327548 308749 192638 312595
10175 312595 430817 542635 663500 823341 978148 996592 1031489 1043416 988767 948372
10165 948372 1075217 1247552 1206760 1347990 1383097 1570537 1869394 1891471 1825282 1865318
10155 1865318 1616046 1687820 1608651 1392788 1375655 1589558 1868537 2110137 2538303 2758047
$$ packed form
10229A47262O7343J2957j10073J40848Q3535N2716r8740k49699k21645J06661
10219f8835P5238k15396N0026K43147Q861K27364N4862k26220r1480l0587M1562
10208F8542j7119J04757k4677r2315J95520N6123r7362j94763o0300K03713Q9376
10197B31495L20j66982k8356J57466p1207j79131M3718J25860L135m8022l7503
10186C0793l0428O6686j03515N3356n3715K361K50974J11036j8799j16111J19957
10175C12595J18222J11818J20865J59841J54807J8444L4897J1927n4649m0395
10165I48372J26845J72335m0792J41230L5107J87440K98857K2077o6189M0036
10155A865318k49272P1774p9169k15863j7133K13903K78979K41600M28166K19744
$$ plain form
10145 2758047 2775289 2689842 2562794 2211306 1873950 1693967 1639687 1754815 1944121 2098432
10135 2098432 2176407 2141518 2061245 2041002 1818166 1298312 1021999 1006425 1136738 1208333
10125 1208333 1100003 1102326 1070115 926964 1053438 800997 743735 646820 533429 360701
10115 360701 243883 188090 105845 129289 30260 28219 76938 298091 261816 126524 71227
10104 71227 90636 99449 7661 -16557 -44616 -75982 27887 219507 271578 359067 507456
10093 507456 357781 216053 113473 -17921 -3622 -154061 -226656 -150022 -279498 -312562
10083 -312562 -338545 -279630 88530 216030 69068 -162384 -63922 48980 127232 253317
10073 253317 302954 267992 331956 249412 218784 232087 252567 45490 -45393 64027 243644
$$ packed form
10145B758047J7242q5447j27048l51488l37356j79983n4280J15128J89306J54311
10135B098432P7975l4889q0273k0243k22836n19854k76313j5574J30313P1595
10125A208333j08330K323l2211j43151J26474k52441n7262r6915j13391j72728
10115C60701j16818n5793q2245K3444r9029k041M8719K21153l6275j35292n5297
10104G1227J9409Q813r1788k4218k8059l1366J03869J91620N2071Q7489J48389
10093E07456j49675j41728j02580j31394J4299j50439p2595P6634j29476l3064
10083c12562k5983N8915L68160J27500j46962k31452R8462J12902P8252J26085
10073B53317M9637l4962O3964q2544l0628J3303K0480k07077r0883J09420J79617
$$ plain form
10062 243644 213614 57407 -130397 -254019 -245399 62029 162004 -103283 98233 73693
10052 73693 -292953 -374367 -212745 -207537 -248541 -179006 -155420 39105 189565 266364 343956
10041 343956 337061 138759 43893 -40641 -67235 -72622 186613 326873 288089 82723 -126850
10030 -126850 -97823 -75211 -99241 -131320 -72677 -105674 -130379 -152530 29527 144030 66213
10019 66213 -2448 -11782 5575 -83766 24294 -111436 -101196 -62832 80645 120055 39676
10008 39676 -17493 -261804 -376412 -10002 159219 176384 147404 -84841 -165273 -49615
9998 -49615 -84542 -259029 -44708 -8124 -104754 -166377 -232962 -128178 -171123 -14957 95968
9987 95968 77876 939 -72550 -13450 52081 -15908 15375 -9995 -132005 -179514 -125430 -32800
$$ packed form
10062B43644l0030j56207j87804j23622Q620L07428R9975k65287K01516k4540
10052G3693l66646q1414J61622N208m1004O9535K3586J94525J50460P6799P7592
10041C43956o895j98302r4866q4534k6594n387K59235J40260l8784k05366k09573
10030a26850K9027K2612k4030l2079N8643l2997k4705k2151J82057J14503p7817
10019F6213o8661r334J7357q9341J08060j35730J0240L8364J43477L9410q0379
10008C9676n7169k44311j14608L66410J69221J7165k8980k32245q0432J15658
9998d9615l4927j74487K14321L6584r6630o1623o6585J04784m2945J56166J10925
9987I5968j8092p6937p3489N9100O5531o7989L1283k5370j22010m7509N4084R2630
$$ plain form
9975 -32800 95658 82585 239599 174848 -6525 3296 182646 196351 268674 240533 174186
9964 174186 376966 303467 439934 532218 402798 138894 23463 26285 42926 16888 9062
9953 9062 20389 106635 130939 111372 50308 -41555 -55047 20697 191601 277233 383291 392836
9941 392836 106314 136745 221465 174289 -154406 -58435 207878 332502 205861 -169432
9931 -169432 -273420 -155126 -265227 -118582 241298 537297 556491 764171 1237443 2330352
9921 2330352 2871537 2702917 2632881 1927063 1016506 371818 136618 -39791 -106298 43402
9911 43402 321802 409090 367443 224892 8311 -88874 93793 195774 160510 28344 -103425
9900 -103425 -145194 -134730 -188622 -301953 -221536 160334 67801 201271 327099 546086 457280
$$ packed form
9975c2800J28458j3073J57014o4751j81373R821J79350J3705P2323k8141o6347
9964A74186K02780p3499J36467R2284j29420k63904j15431K822J6641k6038p826
9953I062J1327Q6246K4304j9567o1064r1863j3492P5744J70904Q5632J06058R545
9941C92836k86522L0431Q4720m7176l28695R5971K66313J24624j26641l75293
9931a69432j03988J18294j10101J46645L59880K95999J9194K07680M73272J092909
9921B330352N41185j68620p0036p05818r10557o44688k35200j76409o6507J49700
9911D3402K78400Q7288m1647j42551k16581r7185J82667J01981l5264j32166j31769
9900a03425m1769J0464n3892j13331Q0417L81870r2533J33470J25828K18987q8806
$$ plain form
9889 457280 343505 5686 -197055 -178179 -122737 -226135 -378454 -340788 -275305 -85861
9879 -85861 -163548 -96290 -74248 -24436 -91311 -186046 -182383 -238409 -235315 -224333 -41887 70579
9867 70579 41551 21439 150378 149835 134866 215659 12136 -170695 -164207 -109977 29299 10440
9855 10440 175481 382429 460079 487441 647859 677772 538607 279398 118002 284579
9845 284579 425484 398980 286644 204603 170120 39264 -419 -112409 -140863 -16168 69054
9834 69054 79534 -70971 -41689 151288 168367 120750 311835 166669 8962 62277 116200
9823 116200 169938 57675 2514 -18792 33056 175414 197506 63010 -154673 -342977 -427798
9812 -427798 -388931 -79209 -92455 -124248 13968 143238 102609 358253 443644 332020 349732
$$ packed form
9889D57280j13775l37819k02741J8876N5442j03398j52319L7666O5483J89444
9879h5861p7687O7258K2042M9812o6875r4735L663n6026L094J0982J82446J12466
9867G0579k9028k0112J28939n43j4969Q0793k03523j82831O488N4230J39276j8859
9855A0440J65041K06948P7650K7362J60418K9913j39165k59209j61396J66577
9845B84579J40905k6504j12336q2041l4483j30856l9683j11990k8454J24695Q5222
9834F9054J0480j50505K9282J92977J7079m7617J91085j45166j57707N3315N3923
9823A16200N3738j12263n5161k1306N1848J42358K2092j34496k17683j88304q4821
9812d27798L8867L09722j3246l1793J38216J29270m0629K55644Q5391j11624J7712
$$ plain form
9801 349732 252532 -5651 62848 120951 -35398 -112925 -217179 -117691 -195836 -165192 20787
9790 20787 21032 63915 14209 80071 6872 -22172 -107439 -252960 -73347 143949 111319 -27907
9778 -27907 -129855 -275939 -301251 -387714 -274851 -74064 -120694 -209790 -113666 58520 96042
9767 96042 -97869 -138220 18976 -229032 -553097 -527217 -420541 -246778 18697 100259
9757 100259 -40053 -145270 -182742 -140406 -170518 -149595 -2463 -66283 9161 -42060 -64171
9746 -64171 -190560 -180511 -223392 -77322 -129612 -105389 -225037 -180811 6228 -13079 54513
9735 54513 158566 102833 41148 58428 197711 247593 100888 89853 297891 357528 63705
9724 63705 -127234 -134349 -169276 -141314 -22473 -73892 -152261 -248779 -293499 -364986 -371373 -190803
$$ packed form
9801C49732r7200k58183O8499N8103j56349p7527j04254R9488p8145L0644J85979
9790B0787K45M2883m9706O5862p3199k9044q5267j45521J79613K17296l2630j39226
9778b7907j01948j46084k5312q6463J12863K00787m6630q9096R6124J72186L7522
9767I6042j93911m0351J57196k48008l24065K5880J06676J73763K65475Q1562
9757A00259j40312j05217l7472M2336l0112K0923J47132o3820P5444n1221k2111
9746f4171j26389J0049m2881J46070n2290K4223j19648M4226J87039j9307O7592
9735E4513J04053n5733o1685J7280J39283M9882j46705j1035K08038N9637k93823
9724F3705j90939p115l4927K7962J18841n1419p8369r6518m4720p1487o387J80570
$$ plain form
9712 -190803 24450 116049 13543 -29252 63490 156781 169925 54134 -7991 38831 39244
9701 39244 -118177 -156653 42548 71770 126597 119752 261066 338715 330738 499007 452767
9690 452767 165256 -162357 -279696 -347392 -310921 -192328 -148402 -99300 -11126 111520 -63244
9679 -63244 -232239 -220036 -35254 -46304 89125 483967 574271 524201 306828 178153 321278
9668 321278 67608 -128683 -56173 -87816 -65996 -157107 -178556 172891 386879 448487 446389
9657 446389 370315 238238 350299 308600 97714 181080 34695 66269 350538 435434 335709
9646 335709 364720 272811 407829 580461 873354 1405622 1851056 2111100 1908405 1438891
9636 1438891 965716 704247 678875 538855 364256 252226 132927 326891 387887 289621
$$ packed form
9712a90803K15253R1599j02506m2795R2742R3291J3144j15791o2125M6822M13
9701C9244j57421l8476J99201K9222N4827o845J41314P7649p977J68269m6240
9690D52767k87511l27613j17339o7696L6471J18593M3926M9102Q8174J22646j74764
9679f3244j68995J2203J84782j1050J35429L94842R0304n0070k17373j28675J43125
9668C21278k53670j96291P2510l1643K1820r1111k1449L51447K13988O1608k098
9657D46389p6074j32077J12061m1699k10886Q3366j46385L1574K84269Q4896r9725
9646C35709K9011r1909J35018J72632K92893N32268M45434K60044k02695m69514
9636A438891m73175k61469k5372j40020j74599j12030j19299J93964O0996r8266
$$ plain form
9626 289621 418458 323597 193908 179451 177638 75004 14851 -32808 -65656 -169892 -86395
9615 -86395 -264664 -381957 -606014 -680544 -460059 -382674 -391950 -252939 -182389 -113362 -50430
9604 -50430 7390 -107959 -237049 -428142 -250968 -57663 -1928 113688 128769 -51252
9594 -51252 -110809 -60101 -216713 -280337 -114690 100895 2832 -3562 169615 262718 183740
9583 183740 189236 239327 148736 221203 388142 375738 243116 166216 268039 186674 -7134
9572 -7134 -133950 -75288 38142 -90848 -241586 -153814 -14797 155992 309536 159158
9562 159158 86089 40203 -56596 -155946 -194278 -135373 -203441 -203780 -54391 -67686 -212513 -95330
9550 -95330 -141814 -187913 -151386 -114976 10045 166203 144650 -65778 -31602 -120780 -131805
$$ packed form
9626B89621J28837r4861j29689j4457j813j02634o0153m7659l2848j04236Q3497
9615h6395j78269j17293k24057p4530K20485P7385r276J39011P0550O9027O2932
9604e0430N7820j15349j29090j91093J77174J93305N5735J15616J5081j80021
9594e1252n9557N0708j56612o3624J65647K15585r8063o394J73177R3103p8978
9583A83740N496N0091r0591P2467J66939j2404j32622p6900J01823q1365j93808
9572g134j26816N8662J13430j28990j50738Q7772J39017J70789J53544j50378
9562A59158p3069m5886r6799r9350l8332N8905o8068l39J49389j3295j44827J17183
9550i5330m6484m6099L6527L6410J25021J56158k1553k10428L4176q9178j1025
$$ plain form
9539 -131805 -106814 -228674 -203546 -125249 64855 135426 -53609 -260797 -284220 -336909 -391830
9528 -391830 -314850 -47243 46056 5106 -75855 -74955 -157568 -333534 -216128 -55639 10343
9517 10343 -12207 -21862 -50133 -214970 -229925 -3791 -44966 -261586 -357483 -315103 -277199
9506 -277199 -257677 -284502 -107634 43968 -117953 37114 39354 -36887 -252920 -414627 -310902
9495 -310902 -231213 -243041 -313087 -228586 -321453 -211526 -202333 -283555 -365723 -263514 -215264
9484 -215264 -134735 -63737 -50723 -44334 23388 196147 258246 314172 196068 59043 42436
9473 42436 -174956 -345935 -211636 20504 36800 -93991 -156337 1166 77579 313779
9463 313779 361414 369592 364845 440414 369047 206968 235248 105418 13487 -169360 -81844
$$ packed form
9539a31805K4991j21860K5128P8297J90104P0571j89035k07188k3423n2689n4921
9528c91830P6980K67607R3299m0950q0961R00q2613j75966J17406J60489O5982
9517A0343k2550r655k8271j64837j4955K26134m1175k16620r5897M2380L7904
9506b77199J9522k6825J76868J51602j61921J55067K240p6241k16033j61707J03725
9495c10902P9689j1828p0046Q4501r2867J09927R193q1222q2168J02209M8250
9484b15264Q0529P0998J3014O389O7722J72759O2099N5926j18104j37025j6607
9473D2436k17392j70979J34299K32140J6296j30791o2346J57503P6413K36200
9463C13779M7635Q178m747P5569p1367j62079K8280j29830r1931j82847Q7516
$$ plain form
9452 -81844 50846 33138 28914 93872 62846 252141 194257 77265 -195266 -404365 -547885
9441 -547885 -642575 -558093 -267759 -188166 -171622 47217 136747 89494 -38656 -196342 -283282
9430 -283282 -427743 -337381 -216174 -153157 -30442 116027 191935 132362 315923 323422 178055
9419 178055 168007 107571 3621 203979 541440 503184 361073 197995 107184 201220 413076
9408 413076 561024 495320 477427 475924 345275 167676 49320 -69278 33461 90227 45272
9397 45272 -80545 115729 115733 -82902 -164188 -61657 -2901 25500 114996 280130 265260 229954
9385 229954 44561 -115839 -73906 18614 -185742 -214084 -259859 -174879 -160758 -214194 -280433
9374 -280433 -206810 -108454 -111828 -6857 -72123 -39392 -11323 50616 8751 93481 -62962
$$ packed form
9452h1844J32690j7708m224O4958l1026J89295n7884j16992k72531k09099j43520
9441e47885r4690Q4482K90334P9593J6544K18839Q9530m7253j28150j57686q6940
9430b83282j44461R0362J21207O3017J22715J46469P5908n9573J83561P499j45367
9419A78055j0048o0436j03950K00358L37461l8256j42111j63078r0811R4036K11856
9408D13076J47948o5704j7893j503j30649j77599j18356j18598J02739N6766m4955
9397D5272j25817J96274Mj98635q1286J02531N8756K8401Q9496J65134j4870l5306
9385B29954j85393j60400M1933R2520k04356k8342m5775Q4980J4121n3436o6239
9374b80433P3623R8356l374J04971o5266L2731K8069O1939m1865Q4730j56443
$$ plain form
9363 -62962 -172582 -196344 -115279 -57300 -72626 -239840 -264253 -517628 -642520 -433624 -220142
9352 -220142 -284106 -545415 -564164 -282624 30577 142326 100534 26089 121073 21724 83951
9341 83951 71822 -14537 -156879 -150324 -155476 -95226 -12880 -105519 -351726 -321141 -152892 -47542
9329 -47542 -31539 -3739 224468 341604 104875 97117 146430 -33686 80100 62368 100860
9318 100860 159998 32863 -162561 -162902 -74775 25803 -46674 -222202 -413054 -450223 -413171
9307 -413171 -418273 -192611 -45545 -108559 65637 167094 276937 163269 142547 20470
9297 20470 186068 251159 -22961 -178634 -85472 -46460 124283 67307 22802 -131697 -332347
9286 -332347 -123892 -134512 -142916 -106869 -140802 -57131 -15333 -299781 -488274 -429748 -425809
$$ packed form
9363f2962j09620k3762Q1065N7979j5326j67214k4413k53375j24892K08896K13482
9352b20142o3964k61309j8749K81540L13201J11749m1792p4445R4984r9349O2227
9341H3951j2129q6359j42342O555n152O0250Q2346r2639k46207L0585J68249J05350
9329d7542J6003K7800K28207J17136k36729p758M9313j80116J13786j7732L8492
9318A00860N9138j27135j95424l41Q8127J00578p2477j75528j90852l7169L7052
9307d13171n102K25662J47066o3014J74196J01457J09843j13668k0722j22077
9297B0470J65598O5091k74120j55673R3162L9012J70743n6976m4505j54499k00650
9286c32347K08455j0620q404L6047l3933Q3671M1798k84448j88493N8526L939
$$ plain form
9275 -425809 -313328 -211883 -152439 23203 54930 49442 24676 137651 99173 27682 110207
9264 110207 162570 -20406 -100128 -101369 -29005 -105795 -367594 -391728 -14527 127054 95591
9253 95591 74290 42275 -210546 -121295 -171314 -105115 -10140 -123987 -219471 -111007 88653
9242 88653 58561 152674 43189 29727 121136 191307 399137 352205 165600 265216 416346
9231 416346 332756 145091 -96444 -83665 142957 240272 287237 342119 153566 24433 23307
9220 23307 -2604 -64688 -148390 -41805 50017 234432 216410 168459 374457 516986 399484
9209 399484 283490 262746 198417 127179 128148 -71846 95077 342311 262450 298859 315942
9198 315942 336927 552126 531201 559623 360949 207641 357173 286826 151483 182699 245575
$$ packed form
9275d25809J12481J01445N9444J75642L1727n488k4766J12975l8478p1491Q2525
9264A10207N2363j82976p9722j241P2364p6790k61799k4134L77201J41581l1463
9253I5591k1301l2015k52821Q9251n0019O6199R4975j13847r5484J08464J99660
9242H8653l0092R4113j09485j3462R1409P0171K07830m6932j86605R9616J51130
9231D16346q3590j87665k41535J2779K26622R7315M6965N4882j88553j29133j126
9220B3307k5911o2084q3702J06585R1822J84415j8022m7951K05998J42529j17502
9209C99484j15994k0744o4329p1238R69j99994J66923K47234p9861L6409J7083
9198C15942K0985K15199k0925K8422j98674j53308J49532p0347j35343L1216O2876
$$ plain form
9187 245575 175288 -146391 12811 135505 60848 -100841 125511 350006 482694 416396
9177 416396 149641 -56975 32184 -974 -12777 231505 283363 189175 89145 116552 235153
9166 235153 106695 -174252 -362156 -275143 -58075 -39848 -1409 186722 154480 213717 196864
9155 196864 -1370 -257811 -201703 15332 41659 89245 86755 -20192 -153382 33377 18325
9144 18325 -189117 27616 292177 484559 445943 224856 142086 97778 71361 243045 301035
9133 301035 83975 85988 66863 8782 -59867 -215852 -159294 -69496 -48643 -53438 -194707
9122 -194707 -240121 -340233 -340369 -320137 -281647 -255687 -109888 79521 21643 39490 52017
9111 52017 -75297 -48051 50665 113770 62057 25788 183133 202149 292328 325357 350444
$$ packed form
9187B45575p0287l21679J59202J22694p4657j61689K26352K24495J32688o6298
9177D16396k66755k06616Q9159l3158j1803K44282N1858r4188j00030K7407J18601
9166B35153j28458k80947j87904Q7013K17068J8227L8439J88131l2242N9237j6853
9155A96864j98234k56441N6108K17035K6327M7586k490j06947j33190J86759j5052
9144A8325k07442K16733K64561J92382l8616k21087q2770m4308k6417J71684N7990
9133C01035k17060K013j9125n8081o8649j55985N6558Q9798K0853m795j41269
9122a94707m5414j00112j36K0232L8490K5960J45799J89409n7878J7847J2527
9111E2017j27314K7246R8716O3105n1713l6269J57345J9016R0179L3029K5087
$$ plain form
9100 350444 203780 -17311 -19198 -31032 56660 -30595 -328436 -220084 69304 127298 155989
9089 155989 -80598 -69740 61439 -179807 -371082 -145508 153410 179897 53608 125631
9079 125631 262097 238535 79695 146896 149362 -47737 -245039 -229429 -302230 -148121 -266132
9068 -266132 -193046 -36082 83911 52451 -26272 -96268 -224581 -339219 -214762 12778
9058 12778 -38640 -169459 51704 140294 -98042 -98911 62180 95177 111576 185802 111213
9047 111213 -70756 -14287 -80092 -159382 34104 136948 38842 -27796 -83404 -44842 196755
9036 196755 180617 55709 183164 210716 155015 8502 -266847 -468238 -310546 -133862
9026 -133862 -132239 -198469 -321243 -171291 90471 29350 -158283 -267187 -339741 -300357 -153897
$$ packed form
9100C50444j46664k21091j887j1834Q7692q7255k97841J08352K89388N7994K8691
9089A55989k36587J0858J31179k41246j91275K25574K98918K6487j26289P2023
9079A25631J36466k3562j58840O7201K466j97099j97302J5610p2801J54109j18011
9068b66132P3086J56964J19993l1460p8723o9996j28313j14638J24457K27540
9058A2778n1418j30819K21163Q8590k38336q69J61091L2997J6399P4226p4589
9047A11213j81969N6469o5805p9290J93486J02844r8106o6638n5608L8562K41597
9036A96755j6138j24908J27455K7552n5701j46513k75349k01391J57692J76684
9026a33862J623o6230j22774J49952K61762o1121j87633j08904p2554L9384J46460
$$ plain form
9015 -153897 -132123 -108837 -162981 -33006 86023 28421 -95063 -282685 -441767 -193805
9005 -193805 -129139 -108339 -150608 -327551 -488331 -497501 -352558 -54495 -17031 134930 99048
8994 99048 26484 101120 269926 193289 3209 -101536 -354294 -248902 -50117 31270 124950
8983 124950 289507 53806 9958 71758 274821 127336 -153366 -263051 -158844 122540
8973 122540 221858 222561 88017 -113330 -43836 137733 292792 453755 547715 362888 140033
8962 140033 45178 5742 21615 -70840 -91187 -161228 -125103 -163475 -192623 -188146 -69248 -84662
8950 -84662 -14762 -226288 -329621 -115049 42971 -117341 -136695 -50196 134183 239491
8940 239491 112018 58619 1482 -88704 -196567 -237826 -115045 -63652 57631 126967 -16078
$$ packed form
9015a53897K1774K3286n4144J29975J19029n7602j23484j87622j59082K47962
9005a93805O4666K0800m2269j76943j60780r170J44943K98063L7464J51961l5882
8994I9048p2564P4636J68806p6637j90080j04745k52758J05392J98785Q1387R3680
8983A24950J64557k35701m3848O1800K03063j47485k80702j09685J04207K81384
8973A22540R9318P03j34544k01347O9494J81569J55059J60963R3960j84827k22855
8962A40033r4855l9436J5873r2455k0347p0041L6125l8372k9148M477J18898j5414
8950h4662O9900k11526j03333K14572J58020j60312j9354Q6499J84379J05308
8940B39491j27473n3399n7137r0186j07863m1259J22781N1393J21283O9336j43045
$$ plain form
8929 -16078 -63373 45128 68050 119648 33933 -111175 -166819 -141332 -88270 -114731 58052
8918 58052 91120 -129958 -268348 -157217 -107873 -250151 -77202 113267 -22302 -77699
8908 -77699 -5828 120498 75823 -46687 -104389 -138792 -187674 -483817 -477181 -339521 -228416
8897 -228416 -279195 -303083 -149413 -204034 -304415 -167549 -117033 -98441 6289 56815 46669
8886 46669 78480 158421 16158 -177547 -103572 -83326 -43867 56288 236944 350942 344795
8875 344795 57810 -107302 50982 44511 23471 -102576 -203792 -225160 -156310 -98841 130221
8864 130221 413600 554344 498745 303444 173414 78569 6185 -6849 47166 219289 152229
8853 152229 74713 44538 -137784 -86938 113486 352518 146186 32101 160094 212054
$$ packed form
8929a6078m7295J08501K2922N1598q5715j45108n5644K5487N3062k6461J72783
8918E8052L3068k21078j38390J11131M9344j42278J72949J90469j35569n5397
8908g7699P1871J26326m4675j22510n7702l4403m8882k96143O636J37660J11105
8897b28416n0779k3888J53670n4621j00381J36866N0516J8592J04730N0526j0146
8886D6669L1811P9941j42263j93705P3975K0246L9459J00155J80656J13998o147
8875C44795k86985j65112J58284o471k1040j26047j01216k1368O8850N7469K29062
8864A30221K83379J40744n5599j95301j30030r4845p2384j3034N4015J72123o7060
8853A52229p7516l0175j82322N0846K00424K39032k06332j14085J27993N1960
$$ plain form
8843 212054 109379 211784 237113 262568 196630 155825 41641 31540 86439 -50128 -28247
8832 -28247 190611 131906 -132224 -111628 -55074 -73858 99449 137722 398288 576631 579025
8821 579025 672907 485003 409551 416171 167868 21352 54495 192802 313383 71948 62350
8810 62350 285064 429731 405236 423970 352207 375806 193793 -18327 57988 187650 84964
8799 84964 -89920 -89016 -43444 -34531 8448 58421 105367 29865 -8320 -14186 110712 221617
8787 221617 -49539 -121145 -265952 -443833 -455498 -207732 -92818 -143130 -263093 -71328
8777 -71328 -18333 -95530 -80512 -64027 109903 12048 -94204 -271182 -364637 -239236 -211275
8766 -211275 -330002 -178445 23841 194569 123445 111767 20222 53343 22781 -99207 -92333
$$ packed form
8843B12054j02675J02405K5329K5455o5938m0805j14184j0101N4899j36567K1881
8832b8247K18858n8705k64130K0596N6554j8784J73307L8273K60566J78343K394
8821E79025R3882j87904p5452O620k48303j46516L3143J38307J20581k41435r598
8810F2350K22714J44667k4495J8734p1763K3599j82013k12120P6315J29662j02686
8799H4964j74884R04M5572Q913M2979M9973M6946p5502l8185n866J24898J10905
8787B21617k71156p1606j44807j77881j1665K47766J14914n0312j19963J91765
8777g1328N2995p7197J5018J6485J73930r7855j06252j76978r3455J25401K7961
8766b11275j18727J51557K02286J70728p1124j1678r1545L3121l0562j21988O874
$$ plain form
8755 -92333 -161480 -189178 -153887 -162357 -62156 187607 124330 -100878 -13096 104678 272071
8744 272071 98587 47651 -11003 153910 171348 -29389 15050 150555 186460 135117 111933
8733 111933 308732 296554 172859 25025 216423 341140 48766 -287566 -254103 -123769
8723 -123769 -28573 107623 48038 -103123 -44007 -156976 -311402 -138973 46975 258652
8713 258652 146115 82192 191732 -21909 -193968 -51904 101765 44923 136706 104532
8703 104532 309287 418882 456320 492332 381426 412139 413557 253948 129393 224524 313905
8692 313905 246461 152564 110980 51828 -58175 -158357 -137056 -42053 86850 24088 -48067
8681 -48067 17228 259230 281514 171993 363833 420669 390722 419790 247455 -147081 -280416
$$ packed form
8755i2333o9147k7698L5291q470J00201K49763o3277k25208Q7782J17774J67393
8744B72071j73484n0936n8654J64913J7438k00737M4439J35505L5905n1343k3184
8733A11933J96799j2178j23695j47834J91398J24717k92374l36332L3463J30334
8723a23769R5196J36196n9585j51161N9116j12969j54426J72429J85948K11677
8713B58652j12537o3923J09540k13641j72059J42064J53669n6842R1783l2174
8703A04532K04755J09595L7438L6012j10906L0713J418j59609j24555R5131Q9381
8692C13905o7444r3897m1584n9152j10003j00182K1301R5003J28903o2762p2155
8681d8067O5295K42002K2284j09521J91840N6836k9947K9068j72335l94536j33335
$$ plain form
8670 -280416 48514 13942 -96416 -182202 -32707 120090 115723 53848 -20616 -142182 -342111
8659 -342111 -188085 74691 354298 272115 214934 136944 167085 313669 365710 372750 187165
8648 187165 -42342 -30114 26588 -42864 59825 308 -3161 -20797 -87726 -266240 -307851
8637 -307851 -240195 -264378 -68715 63816 231252 236371 175548 67392 -152919 -225204 -189083
8626 -189083 -169974 -146763 -26177 -67807 -77206 107877 312058 366002 255148 128684 -19248
8615 -19248 56831 45158 112313 17965 -97124 11206 105691 116479 -41684 57104 -137064
8604 -137064 -306811 -415166 -344331 -339646 -364455 -111922 76536 80668 71555 -6166 -52815
8593 -52815 11659 234904 388315 322093 148618 -60627 -227509 122389 202151 40255
$$ packed form
8670b80416L28930l4572j10358q5786J49495J52797m367o1875p4464j21566j99929
8659c42111J54026K62776K79607q2183n7181p7990L0141J46584N2041P040j85585
8648A87165k29507J2228N6702o9452J02689n9517l469j7636o6929j78514m1611
8637c07851O7656k4183J95663J32531J67436N119o0823j08156k20311p2285L6121
8626a89083J9109K3211J20586m1630r399J85083K04181N3944j10854j26464j47932
8615a9248P6079j1673O7155r4348j15089J08330R4485J0788j58163R8788j94168
8604a37064j69747j08355P0835M685k4809K52533J88458M132r113p7721m6649
8593e2815O4474K23245J53411o6222j73475k09245j66882L49898P9762j61896
$$ plain form
8583 40255 -30579 -50069 -107220 -123187 -194693 -184337 -53515 -99273 -215220 -182757 -57584
8572 -57584 10426 148106 220396 88614 176120 67608 -34326 45121 82017 120386 307510
8561 307510 358183 324018 328011 345874 309675 229970 180094 202008 365163 375227 195524
8550 195524 9882 93192 141678 120083 -26234 -158693 -92377 -136724 -251919 -250185 83360
8539 83360 181055 152192 170717 158073 100499 104600 117914 36485 85610 59409 103825 149744
8527 149744 232627 124854 -39796 -142732 -136335 -20870 56256 224685 170765 287514 208762
8516 208762 136761 17047 136940 224847 207476 295873 293958 163942 33960 -94875 19318
8505 19318 199846 128975 -91241 -211122 27806 156808 77984 166073 294376 237221 280533
$$ packed form
8583D0255p0834j9490n7151j5967p1506J0356J30822m5758j15947L2463J25173
8572e7584O8010J37680P2290j31782Q7506j08512j01934P9447L6896L8369J87124
8561C07510N0673l4165L993J7863l6199p9705m9876K1914J63155J0064j79703
8550A95524j85642Q3310M8486k1595j46317j32459O6316m4347j15195J734L33545
8539H3360R7695k8863J8525j2644n7574M101J3314q1429M9125k6201M4416M5919
8527A49744Q2883j07773j64650j02936O397J15465P7126J68429n3920J16749p8752
8516B08762p2001j19714J19893Q7907j7371Q8397j915j30016j29982j28835J14193
8505A9318J80528p0871k20216j19881K38928J29002p8824Q8089J28303n7155M3312
$$ plain form
8494 280533 298027 236104 385141 293405 44083 -260182 -468305 -419886 -249901 -155332 -270310
8483 -270310 -350339 -147342 19018 -6901 -51452 -29556 -6284 -119182 -53942 199591 302958
8472 302958 228533 129385 65662 104784 163868 180964 192401 217961 123335 171096 199446 299235
8460 299235 306371 105689 -1300 168731 298039 217775 252703 175439 88998 49646 -10241
8449 -10241 -247445 -81176 47890 -142428 -303377 -147888 64445 -1145 127023 142099
8439 142099 174344 230068 138967 104117 29788 -91007 11137 80199 -40467 -123671 -24648
8428 -24648 12546 50063 193336 340519 327262 342769 71990 116108 157777 40451 -218007
8417 -218007 -430710 -358467 -47970 70849 98251 67173 -103009 -270158 -136187 198279
$$ packed form
8494B80533J7494o1923J49037r1736k49322l04265k08123M8419J69985R4569j14978
8483b70310q0029K02997J66360k5919m4551K1896K3272j12898O5240K53533J03367
8472C02958p4425r9148o3723L9122N9084J7096J1437K5560r4626M7761K8350R9789
8460B99235P136k00682j06989J70031J29308q0264L4928p7264q6441l9352n9887
8449a0241k37204J66269J29066j90318j60949J55489K12333o5590J28168J5076
8439A42099L2245N5724r1101l4850p4329j20795J02144O9062j20666q3204R9023
8428b4648L7194L7517J43273J47183j3257J5507k70779M4118M1669j17326k58458
8417b18007k12703P2243L10497J18819K7402l1078j70182j67149J33971L34466
$$ plain form
8407 198279 459581 465553 303669 170499 -83586 -253585 -136399 196384 311248 421971
8397 421971 483810 293854 44343 -126275 10442 21434 111147 228991 212029 196373 121771
8386 121771 -167445 -192538 -129784 91771 213035 454934 536709 284339 2126 -240513
8376 -240513 -318133 -231376 -111676 -34647 178597 190040 295313 374789 357047 357735 245385
8365 245385 290474 400307 282131 -15846 -75342 11431 -126501 -273346 -99613 -91345 35773
8354 35773 -20047 81352 157370 125473 68324 98919 65873 11552 18445 71645 -90747 -223958
8342 -223958 -97346 163240 22986 30070 75085 151345 244192 124372 50081 74049 204254
8331 204254 254006 199436 120055 62730 -62714 -177220 -195689 -235931 -214822 -174809 -25206
$$ packed form
8407A98279K61302N972j61884j33170k54085j69999J17186L32783J14864J10723
8397D21971O1839j89956k49511j70618J36717J0992Q9713J17844j6962j5656p4602
8386A21771k89216k5093O2754K21555J21264K41899Q1775k52370k82213k42639
8376b40513p7620Q6757J19700P7029K13244J1443J05273P9476j7742O88j12350
8365B45385M5089J09833j18176k97977n9496Q6773j37932j46845J73733Q268J27118
8354C5773n5820J01399P6018l1897n7149L0595l3046n4321O893N3200j62392j33211
8342b23958J26612K60586j40254P084M5015P6260R2847j19820p4291K3968J30205
8331B04254M9752n4570p9381n7325j25444j14506j8469m0242K1109M0013J49603
$$ plain form
8320 -25206 -66977 -202227 -147499 -178389 -121502 -71528 25389 -9758 154367 56533 -246916
8309 -246916 -223616 -128770 31671 -113048 -73827 -189552 -84207 283169 269758 189675 107167
8298 107167 119378 138278 46401 47201 194651 212356 254500 254985 119671 -14539 -157029 -293842
8286 -293842 -320807 -470018 -399043 -45593 -52498 -115408 -390722 -378547 -133186 51564 -61453
8275 -61453 -37687 -37732 20050 -66923 -119145 -53111 42781 93413 18489 275421 261344 163135
8263 163135 183397 143194 82693 55306 184657 274040 190413 -45589 3613 100209 167396
8252 167396 252495 295503 435703 301297 269180 121136 -8586 -37650 -361595 -426375 -227943
8241 -227943 -39424 -87509 -121162 43624 -87902 -39325 -20080 -143717 -106532 -291168 -317327
$$ packed form
8320b5206m1771j35250N4728l0890N6887M9974R6917l5147J64125r7834l03449
8309b46916K3300R4846J60441j44719L9221j15725J05345L67376j3411q0083q2508
8298A07167J2211J8900r1877Q00J47450J7705M2144M85j35314j34210j42490j36813
8286b93842k6965j49211P0975L53450o905o2910k75314J2175K45361J84750j13017
8275f1453K3766m5N7782q6973n2222O6034R5892N0632p4924K56932j4077r8209
8263A63135K0262m0203o0501k7387J29351Q9383q3627k36002M9202R6596O7187
8252A67396Q5099M3008J40200j34406l2117j48044j29722k9064l23945o4780J98432
8241b27943J88519m8085l3653J64786j31526M8577J9245j23637L7185j84636k6159
$$ plain form
8230 -317327 -192680 -82384 -209964 -191481 66439 298298 249079 231709 229432 76383 -5268
8219 -5268 29868 162134 136855 -102107 -376232 -206187 20375 -4586 -228462 -298114 -408269
8208 -408269 -270852 29042 -10954 -195437 -132919 65317 131121 118399 64872 160377 -8962
8197 -8962 -73814 -94346 78930 188391 162295 98281 35564 29126 29918 -36719 -125805 -25055
8185 -25055 171057 107876 174829 177023 114197 -57511 125817 79875 50583 -129024 -191107
8174 -191107 -307623 -444012 -551874 -508064 -426175 -406544 -452624 -226139 -37413 -66180 -90373
8163 -90373 84604 135526 16401 -86692 -59084 19005 77519 28113 -132432 -80639 44027
8152 44027 200072 282326 61996 -274369 -262628 -173048 82790 48326 -28113 -46337 -121467
$$ packed form
8230c17327J24647J10296j27580J8483K57920K31859m9219j7370k277j53049q1651
8219e268L5136J32266k5279k38962k74125J70045K26562k4961k23876o9652j10155
8208d08269J37417K99894l9996j84483O2518J98236O5804j2722n3527R5505j69339
8197h962o4852k0532J73276J09461k6096o4014o2717o438P92o6637q9086J00750
8185b5055J96112o3181O6953K194o2826j71708J83328m5942k9292j79607o2083
8174a91107j16516j36389j07862M3810Q1889J9631m6080K26485J88726k8767k4193
8163i0373J74977N0922j19125j03093K7608P8089N8514m9406j60545N1793J24666
8152D4027J56045Q2254k20330l36365J1741Q9580K55838l4464p6439j8224p5130
$$ plain form
8141 -121467 -329825 -437708 -501177 -545702 -415241 -344744 -384105 -226955 -25489 9010 -93495
8130 -93495 -305097 -289299 -98557 168998 61417 -203581 -211316 -172177 -161987 48339 7606
8119 7606 -125820 -44076 22878 71077 109346 207757 264436 54222 -120823 -138384 -100511
8108 -100511 -25800 3926 -73162 -121760 -175454 -182443 -263599 -299712 -156483 -135144 -132061 -218113
8096 -218113 -290331 -57336 53280 -31757 -212777 -273157 -147768 -45055 37141 10663 56452
8085 56452 -58684 -19427 88446 112771 34914 -99875 -185990 -311467 -420617 -297344 -116239
8074 -116239 -74693 -35812 -58336 -11575 104359 -2503 -47665 -101297 18933 65714 18695
8063 18695 164056 139693 49636 99327 -59637 -196702 -53619 209226 165845 45926 206199
$$ packed form
8141a21467k08358j07883o3469m4525J30461P0497l9361J57150K01466L4499j02505
8130i3495k11602J5798J90742K67555j07581k64998p735L9139J0190K10326m0733
8119G606j33426Q1744O6954M8199L8269R8411N6679k10214j75045j7561L7873
8108a00511P4711K9726p7088m8598n3694o989q1156l6113J43229K1339L083q6052
8096b18113p2218K32995J10616q5037j81020o0380J25389J02713Q2196k6478M5789
8085E6452j15136L9257J07873K4325p7857j34789q6115j25477j09150J23273J81105
8074a16239M1546L8881k2524M6761J15934j06862m5162n3632J20230M6781m7019
8063A8695J45361k4363r0057M9691j58964j37065J43083K62845m3381j19919J60273
$$ plain form
8052 206199 143546 -203907 -293672 -293814 -129177 117227 131704 86717 15129 17482 102973 138917
8040 138917 -169379 -309943 -348793 -268139 -218845 101529 273835 132533 16563 100304
8030 100304 66972 -143938 -75680 -228783 -364737 -424878 -365502 -156368 -149135 -10673 68176
8019 68176 89339 -6417 27425 106424 120632 127941 131949 201687 171604 144689 169365 -32237
8007 -32237 168844 223031 75920 -45912 -28757 -34822 -76125 -213400 -84723 74619 186882
7996 186882 121141 51366 -42895 30961 244132 119698 -240849 -249753 -83307 229298 406156
7985 406156 475310 345913 422577 451358 191356 155506 82212 131243 297460 151379 1259
7974 1259 -20833 -58547 108256 80511 -34693 -59305 -207015 -169161 -115789 -115141 -19266 109136
$$ packed form
8052B06199o2653l47453q9765j42J64637K46404J4477m4987p1588K353Q5491L5944
8040A38917l08296j40564l8850Q0654M9294L20374J72306j41302j15970Q3741
8030A00304l3332k10910O8258j53103j35954o0141N9376K09134P233J38462P8849
8019F8176K1163r5756L3842P8999J4208P309M008O9738l0083k6915K4676k01602
8007c2237K01081N4187j47111j21832J7155o065m1303j37275J28677J59342J12263
7996A86882o5741o9775r4261P3856K13171j24434l60547q904J66446L12605J76858
7985D06156O9154j29397P6664K8781k60002l5850p3294M9031J66217j46081j50120
7974A259k2092l7714J66803k7745j15204k4612j47710L7854N3372O48R5875J28402
$$ plain form
7962 109136 -9829 -45693 -274429 -218111 13478 198042 94243 235845 289270 -87562
7952 -87562 -414793 -338503 -327391 -301346 -313571 -210687 -332970 -313381 -140755 -47832 -88202
7941 -88202 -166640 -153701 99980 55312 37930 106015 59118 200096 287722 248273 43620
7930 43620 -309513 -534874 -358855 -227858 -219131 -350770 -245809 -13941 91165 144462
7920 144462 229702 204354 129214 63083 -94316 -170527 -7285 291752 402449 143008 125531
7909 125531 247577 315910 146607 -31372 4297 187748 178886 -48425 -235403 -245324 -195350
7898 -195350 -76606 119937 149854 24151 -87219 -198086 -141545 25862 38580 24745
7888 24745 -78056 143386 41637 -284889 -295732 -46591 -11010 15023 29947 58137 60200
$$ packed form
7962A09136j18965l5864k28736N6318K31589J84564j03799J41602N3425l76832
7952h7562l27231P6290J1112K6045j2225J02884j22283J9589J72626R2923m0370
7941h8202p8438J2939K53681m4668j7382O8085m6897J40978Q7626l9449k04653
7930D3620l53133k25361J76019J30997Q727j31639J04961K31868J05106N3297
7920A44462Q5240k5348p5140o6131j57399p6211J63242K99037J10697k59441j7477
7909A25531J22046O8333j69303j77979L5669J83451q862k27311j86978r921M9974
7898a95350J18744J96543K9917j25703j11370j10867N6541J67407J2718j3835
7888B4745j02801K21442j01749l26526j0843K49141L5581K6033J4924K8190K063
$$ plain form
7877 60200 50391 109442 -70308 -119206 29670 185704 237142 159787 -46378 49110 86269
7866 86269 -239643 -466631 -643236 -502893 -196615 -116354 -23016 15408 95075 167002 116623
7855 116623 35839 69694 221290 96656 65306 163280 214021 178631 87743 -239798 -359195
7844 -359195 -350201 -264177 -130578 39880 189457 302662 270671 1124 -156587 6221
7834 6221 36684 -39700 -59419 59168 -71866 -113228 62738 223285 248314 254370 204409
7823 204409 7321 71393 -172158 -471169 -520420 -462898 -204908 -48434 -233198 -166201
7813 -166201 -51081 88214 -71774 -119658 -106751 54383 140758 244812 252027 135145 165996
7802 165996 172499 340099 597226 491275 372652 123401 -105086 -207140 -251541 -254475 -289542
$$ packed form
7877F0200r809N9051j79750m8898J48876J56034N1438p7355k06165R5488L7159
7866H6269l25912k26988j76605J40343L06278Q0261R3338L8424P9667P1927n0379
7855A16623q0784L3855J51596j24634l1350R7974N0741l5390r0888l27541j19397
7844c59195Q994Q6024J33599J70458J49577J13205l1991k69547j57711J62808
7834F221L0463p6384j9719J18587j31034m1362J75966J60547K5029O056m9961
7823B04409j97088O4072k43551k99011m9251N7522K57990J56474j84764O6997
7813a66201J15120J39295j59988m7884J2907J61134Q6375J04054P215j16882L0851
7802A65996O503J67600K57127j05951j18623k49251k28487j02054m4401k934l5067
$$ plain form
7791 -289542 -255467 -385995 -389812 -318490 -113547 115844 175023 315104 258457 315765 123003
7780 123003 50920 105754 108202 106672 186067 213413 185523 97111 157262 60272 12113 63528
7768 63528 -3444 -26250 -81067 -11319 6035 -115923 -142256 -157928 -231338 -228931 -265218 -127938
7756 -127938 325773 327378 194713 143379 63466 -184816 -365041 -583399 -595514 -440255 -295926
7745 -295926 -296638 -331709 -487430 -504404 -547779 -233132 -56920 -206419 -263499 -139931 -143378
7734 -143378 -109577 -210793 -379466 -469401 -187215 -45132 -131169 -70934 -62721 -148959 -209483
7723 -209483 52944 279609 257425 201708 102376 161701 90795 -50878 -135308 -340879 -447451
7712 -447451 -115696 118520 79863 44781 -2974 44193 205271 84889 3741 85195 -151811
$$ packed form
7791b89542L4075j30528l817P1322K04943K29391N9179J40081n6647N7308j92762
7780A23003p2083N4834K448j530P9395K7346k7890q8412O0151r6990m8159N1415
7768F3528o6972k2806n4817O9748J7354j21958k6333j5672p3410K407l6287J37280
7756a27938M53711J605j32665n1334p9913k48282j80225k18358j2115J55259J44329
7745b95926p12l5071j55721j6974m3375L14647J76212j49499n7080J23568l447
7734a43378L3801j01216j68673q9935K82186J42083q6037O0235Q213q6238o0524
7723b09483K62427K26665k2184n5717r9332N9325p0906j41673q4430k05571j06572
7712d47451L31755K34216l8657l5082m7755M7167J61078j20382q1148Q1454k37006
$$ plain form
7701 -151811 -305594 -323014 -520470 -515316 -280765 -355231 -284098 -221488 -96978 -16903 14580
7690 14580 -76753 -272259 -141946 21306 120337 -32043 -42769 -130875 -137583 5843 6335
7679 6335 -40835 113321 6672 -71739 27254 64730 95010 245007 106619 -50316 -176920
7668 -176920 -208075 -170464 -110319 -257492 -211686 -194117 -231904 -158693 -64298 -81466 -193316
7657 -193316 -336818 -411850 -348368 -237588 -237969 -266960 -215534 -266075 -157991 -314090 -317606
7646 -317606 -217895 -253284 -406051 -294853 -245341 -229185 -107782 -132931 1514 299989 384503
7635 384503 205179 206058 79963 -10053 31726 43430 -162317 -181981 -170603 -104399 57033
7624 57033 295652 359695 169981 -16173 -123145 -31142 37038 -44163 -133303 36326 -83107
$$ packed form
7701a51811j53783j7420j97456N154K34551p4466P1133O2610J24510Q0075L1483
7690A4580r1333j95506J30313J63252R9031j52380j0726q8106o708J43426M92
7679F335m7170J54156j06649p8411R8993L7476L0280J49997j38388j56935j26604
7668a76920l1155L7611O0145j47173M5806J7569l7787P3211R4395j7168j11850
7657a93316j43502p5032O3482J10780l81k8991N1426n0541J08084j56099l516
7646c17606R9711l5389j52767J11198M9512J6156J21403k5149J34445K98475Q4514
7635C84503j79324Q79j26095r0016M1779J1704k05747j9664J1378O6204J61432
7624E7033K38619O4043j89714j86154j06972R2003O8180q1201q9140J69629j19433
$$ plain form
7613 -83107 -185786 -98383 -48611 -69904 -456590 -525315 -242302 -212514 -73704 17689 207510
7602 207510 132116 100259 88128 -1800 -26376 -177835 -89296 -64793 -8318 -122050 -348696
7591 -348696 -264682 -32664 16108 -119116 -94590 -25281 -24375 41822 29573 -224612 -173854
7580 -173854 34872 192274 165285 35922 81046 -41787 -177525 -77814 -40073 -86478 -127974
7569 -127974 -357315 -432531 -113482 62198 -62569 -17131 95380 -6284 98781 138348
7559 138348 91801 211996 163940 -67353 -222839 -198916 -342387 -178605 19401 -92003
7549 -92003 -101980 24489 16730 -1048 -52626 18477 -2821 -156875 -190491 -152350 -92053 50005
7537 50005 304819 466634 431512 378365 -36040 -493753 -565592 -512082 -606092 -431920 -189783
$$ packed form
7613h3107j02679Q7403M9772k1293l86686o8725K83013K9788J38810R1393J89821
7602B07510p5394l1857j2131q9928k4576j51459Q8539K4503N6475j13732k26646
7591c48696Q4014K32018M8772j35224K4526O9309R06O6197j2249k54185N0758
7580a73854K08726J57402k6989j29363M5124j22833j35738R9711L7741m6405m1496
7569a27974k29341p5216L19049J75680j24767M5438J12511j01664J05065L9567
7559A38348m6547J20195m8056k31293j55486K3923j43471J63782J98006j11404
7549i2003r977J26469p759j7778n1578P1103k1298j54054l3616L8141O0297J42058
7537E0005K54814J61815l5122n3147m14405m57713p1839N3510r4010J74172K42137
$$ plain form
7526 -189783 -242498 -435199 -408833 -181852 -12417 265028 251780 -16636 -132035 -115309
7516 -115309 159284 328735 352833 387876 196252 15004 -1660 80867 28045 45826 30316
7505 30316 122381 278382 151200 -5552 -186698 -170294 -179821 -66373 -143429 -243190 -82829
7494 -82829 -132686 -320020 -347268 -161531 -1603 -185786 -228557 -115429 -162379 -11779 -36173
7483 -36173 -89551 -44707 -116766 -319917 -278798 -210083 -260403 -94254 107518 34437 -7647
7472 -7647 1861 -74046 -92276 -31184 -134457 -231001 -163639 57931 99948 -2189 -87834 117562
7460 117562 104229 14179 -79138 3099 88920 43101 35058 -29429 146083 81710 41769 -26305
7448 -26305 -15648 40515 151315 150074 43924 181207 142162 -131919 -33781 350051 433199
$$ packed form
7526a89783n2715j92701K6366K26981J69435K77445j3248k68416j15399J6726
7516a15309K74593J69451K4098L5043j91624j81248j6664Q2527n2822J7781j5510
7505C0316R2065J56001j27182j56752j81146J6404r527J13448p7056r9761J60361
7494h2829m9857j87334k7248J85737J59928j84183m2771J13128m6950J50600k4394
7483c6173n3378M4844p2059k03151M1119O8715n0320J66149K01772p3081m2084
7472g647R508p5907j8230O1092j03273r6544O7362K21570M2017j02137q5645K05396
7460A17562j3333r0050r3317Q2237Q5821m5819q043o4487J75512o4373l9941o8074
7448b6305J0657N6163J10800j241j06150J37283l9045k74081R8138L83832Q3148
$$ plain form
7437 433199 328273 157741 102427 91492 -6750 -154288 -47460 -4176 150419 152046 119680
7426 119680 -22341 -119109 -150482 -177492 -39722 -8706 33081 168996 84510 -77749 -88472
7415 -88472 62488 22055 -87619 -59807 -42417 3209 -96611 -182115 -184885 -98763 56470
7404 56470 -13828 -158329 -104316 35493 74412 165570 -49416 -113838 33507 -48546 -159259
7393 -159259 -83243 87059 -164852 -147179 -174651 -260526 -268724 -165520 -141886 -53812 -16152
7382 -16152 5750 28971 11070 -126321 -185137 -100618 21433 -86593 94827 205945 35278
7371 35278 -7479 -54471 18270 2749 -96762 -42629 271390 214809 234879 248479 315694 355724
7359 355724 242760 75529 -236395 -203687 -183174 -97097 -195829 -197820 39695 77066 -12516
$$ packed form
7437D33199j04926j70532n5314j0935r8242j47538J06828M3284J54595J627l2366
7426A19680j42021r6768l1373k7010J37770L1016M1787J35915q4486j62259j0723
7415h8472J50960m0433j09674K7812J7390M5626r9820q5504k770Q6122J55233
7404E6470p0298j44501N4013J39809L8919R1158k14986o4422J47345q2053j10713
7393a59259P6016J70302k51911J7673k7472q5875q198J03204K3634Q8074L7660
7382a6152K1902K3221j7901j37391n8816Q4519J22051j08026J81420J11118j70667
7371C5278m2757m6992P2741j5521r9511N4133L14019n6581K0070J3600O7215M0030
7359C55724j12964j67231l11924L2708K0513Q6077r8732j991K37515L7371q9582
$$ plain form
7348 -12516 124947 128997 69339 118444 4726 -98901 -223992 -172324 -360472 -308819 -12787
7337 -12787 315189 328867 13646 -30170 204061 453230 552080 439321 227960 108127
7327 108127 191981 192640 21023 129079 4941 -115567 -163504 4750 -35483 108030 102416
7316 102416 -53984 -145217 -172491 -172221 -96478 73785 224629 420077 273345 214945 201805
7305 201805 -34729 -6472 -44160 -53531 -200493 -174803 214215 296914 162767 181502 139055
7294 139055 9637 118643 93200 -105317 13995 76037 -141126 -238508 -113720 23968
7284 23968 80255 -67116 -155508 -221721 -157298 23208 181933 183359 195641 373831 271038
7273 271038 140393 252689 302538 78785 -101326 -33673 77505 71158 40806 4056 58654
$$ packed form
7348a2516J37463M050n9658M9105j13718j03627j25091N1668j88148N1653K96032
7337a2787L27976J3678l15221m3816K34231K49169R8850j12759k11361j19833
7327A08127Q3854O59j71617J08056j24138j20508m7937J68254m0233J43513n614
7316A02416j56400r1233k7274K70P5743J70263J50844J95448j46732n8400j3140
7305B01805k36534K8257l7688r371j46962K5690L89018Q2699j34147J8735m2447
7294A39055j29418J09006k5443j98517J19312O2042k17163r7382J24788J37688
7284B3968N6287j47371q8392o6213O4423J80506J58725J426J2282J78190j02793
7273B71038j30645J12296M9849k23753j80111O7653J11178o347l0352l6750N4598
$$ plain form
7262 58654 57567 -115608 -236282 -354524 -250991 23678 130850 92222 -129992 -390710
7252 -390710 -181203 268042 444061 398215 302092 153623 119214 90084 -37687 -22769 38060
7241 38060 47730 119773 148015 180697 -53368 -212527 -247645 -177566 -112347 -31713 146714
7230 146714 158667 171275 254130 206921 10066 -45240 -109607 -178361 -194366 -297833 -51630
7219 -51630 19699 172189 277708 137025 36680 92203 -100134 -300334 -233144 -293082 -240636
7208 -240636 -113789 -59926 -45642 -18981 94635 -61557 -43080 -4923 74520 -107821 -159635
7197 -159635 -63834 -58533 -174526 -251850 -362227 -311802 -355601 -470490 -383140 -249426 -53787
7186 -53787 124468 160868 -42005 -195131 -243178 -178166 -50043 78511 130892 12452 -67474
$$ packed form
7262E8654j087j73175j20674j18242J03533K74669J07172l8628k22214k60718
7252c90710K09507M49245J76019m5846r6123j48469l4409k9130j27771J4918O0829
7241C8060R670P2043K8242L2682k34065j59159l5118P0079O5219Q0634J78427
7230A46714J1953J2608Q2855m7209j96855n5306o4367o8754j6005j03467K46203
7219e1630P1329J52490J05519j40683j00345N5523j92337k00200O7190n9938N2446
7208b40636J26847N3863J4284K6661J13616j56192J8477L8157P9443j82341n1814
7197a59635R5801N301j15993p7324j10377N0425m3799j14889Q7350J33714J95639
7186e3787J78255L6400k02873j53126m8047O5012J28123J28554N2381j18440p9926
$$ plain form
7175 -67474 -81115 -134038 -140743 -7957 -43971 -116985 -327490 -446266 -360055 -252758 -64653
7164 -64653 146275 -11304 -272713 -475911 -360596 -28604 150002 20220 54111 85604
7154 85604 86295 155913 131938 2911 -62123 1060 13224 155607 72824 -169652 -186905 -86722
7142 -86722 -106048 -91985 -181202 -245963 -390024 -293358 -144067 -153189 -122837 -149366 -252813
7131 -252813 -219103 -77151 190406 273960 135074 -98591 -86583 7529 -201845 -335180
7121 -335180 -154342 -96377 -122270 -144239 -72329 -194391 -49173 111419 -11901 -77730 113709
7110 113709 125905 181889 203991 7789 -48610 -6071 197179 205198 107257 35388 184602
7099 184602 290963 205158 138018 49426 111610 101243 60036 210921 282934 322981 322515 204458
$$ packed form
7175f7474j3641n2923o705J32786l6014p3014k10505j18776Q6211J07297J88105
7164f4653K10928j57579k61409k03198J15315L31992J78606j29782L3891L1493
7154H5604O91O9618k3975j29027o5034O3183J2164J42383q2783k42476j7253J00183
7142h6722j9326J4063q9217o4761j44061R6666J49291r122L0352k6529j03447
7131b52813L3710J41952K67557Q3554j38886k33665J2008R4112k09374j33335
7121c35180J80838N7965k5893k1969P1910j22062J45218J60592j23320o5829J91439
7110A13709J2196N5984K2102j96202n6399M2539K03250Q019r7941p1869J49214
7099A84602J06361q5805o7140q8592O2184j0367m1207J50885P2013M0047m66j18057
$$ plain form
7087 204458 -7517 -102931 -156863 79407 265725 132920 216002 249910 296557 321188 176448
7076 176448 84373 40609 147151 102361 -74324 -127839 -111736 -70493 -103810 -76524 -108166
7065 -108166 -192159 -262580 -186231 5926 97554 -2366 39389 121107 -71219 -150306 7169
7054 7169 38474 35 -86970 -157669 -197508 -159226 -228958 -8140 43478 -111208 -170556 -207470
7042 -207470 -490699 -472327 -341543 -252199 -127230 -55675 -88718 -211206 -79818 63636
7032 63636 18441 17760 459 -115521 -111164 77181 181426 126403 34572 -50885 -251594 -409961
7020 -409961 -323644 -165323 -43470 87896 117781 165486 164343 39106 71054 46664 103769
7009 103769 97278 165431 188660 106580 -11491 126568 76781 140500 182037 285206 219166
$$ packed form
7087B04458k11975r5414n3932K36270J86318j32805Q3082L3908M6647K4631j44740
7076A76448r2075m3764J06542m4790j76685n3515J6103M1243l3317K7286l1642
7065a08166q3993p0421P6349J92157R1628r9920M1755Q1718j92326p9087J57475
7054G169L1305l8439q7005p0699l9839L8282o9732K20818N1618j54686n9348l6914
7042b07470k83229J8372J30784Q9344J24969P1555l3043j22488J31388J43454
7032F3636m5195o81j7301j15980M357J88345J04245n5023r1831q5457k00709j58367
7020d09961Q6317J58321J21853J31366K9885M7705j143j25237L1948k4390N7105
7009A03769o491O8153K3229q2080j18071J38059m9787O3719M1537J03169o6040
$$ plain form
6998 219166 140599 219063 1832 -124761 -170412 -189973 -329157 -420283 -257297 -238844 -275345
6987 -275345 -194245 -58138 49435 172953 491439 460437 364984 360981 198238 20025 -36837
6976 -36837 -77656 -46157 -101837 -138338 -126846 -216432 6367 132673 69403 -133564 -124635
6965 -124635 -235375 -370234 -355900 -110698 55256 -129142 -68634 37269 -122534 -189617
6955 -189617 -94268 111695 67229 -182226 -287068 -229167 -169982 -129324 -146606 -119067 -409905
6944 -409905 -412322 -383119 -213384 10409 -54495 24171 -197446 -200953 -238812 -224400 -1388
6933 -1388 213963 174917 137817 117127 111898 150892 183598 101824 55204 225660 198189 94439
6921 94439 105352 157337 -206011 -303589 -97005 318229 251593 -1825 12546 -11534 -231359
$$ packed form
6998B19166p8567P8464k17231j26593m5651j9561j39184r1126J62986J8453l6501
6987b75345Q1100J36107J07573J23518L18486l1002r5453m003j62743j78213n6862
6976c6837m0819L1499n5680l6501J1492q9586K22799J26306o3270k02967Q929
6965a24635j10740j34859J4334K45202J65954j84398O0508J05903j59803o7083
6955a89617R5349K05963m4466k49455j04842N7901N9185M0658j7282K7539k90838
6944d09905k417K9203J69735K23793o4904P8666k21617l507l7859J4412K23012
6933a388K15351l9046l7100k0690n229L8994L2706q1774m6620J70456k7471j03750
6921I4439J0913N1985l63348r7578K06584M15234o6636k53418J4371k4080k19825
$$ plain form
6910 -231359 -359932 -410146 -228093 49125 16429 -159021 -211693 -34410 23294 15659 52494
6899 52494 -74617 -327392 -287669 -121720 -96669 -22074 140255 80108 150711 226252 106326
6888 106326 -23737 23391 54514 103113 -92053 -222337 -197517 -141253 -222890 -84126 -138783
6877 -138783 63043 -34367 -235626 -369204 -372498 -98724 -275769 -279221 -126950 -60135 -229024
6866 -229024 -44107 55752 32006 50030 159484 239490 295904 278740 412167 256900 263951
6855 263951 206053 -44272 -244158 96542 233516 76236 30649 -64207 33146 140736
6845 140736 107059 -9857 -42235 -149378 -36470 309395 300187 246634 13701 29621 95209
6834 95209 82030 79517 -81272 -33164 99395 -70505 -330056 -404076 -300322 -317408 -357974
$$ packed form
6910b31359j28573n0214J82053K77218l2696j75450n2672J77283N7704p635L6835
6899E2494j27111k52775L9723J65949K5051P4595J62329o0147P0603P5541j19926
6888A06326j30063M7128L1123M8599j95166j30284K4820N6264q1637J38764n4657
6877a38783K01826r7410k01259j33578l294K73774j77045l452J52271O6815j68889
6866b29024J84917R9859k3746J8024J09454Q0006N6414j7164J33427j55267P051
6855B63951n7898k50325j99886L40700J36974j57280m5587r4856R7353J07590
6845A40736l3677j16916l2378j07143J12908L45865r208n3553k32933J5920O5588
6834I5209j3179k513j60789M8108J32559j69900k59551p4020J03754j7086m0566
$$ plain form
6823 -357974 -192215 5718 -62868 -172241 -239907 27847 47180 34529 50542 243025 430259
6812 430259 501181 252835 215750 307376 230532 204215 56024 -46224 -170411 -347186 -273208
6801 -273208 -79102 76712 276730 281734 144663 14315 34330 59402 94465 -50546 -202845
6790 -202845 -124490 -31271 -87283 -241396 -233254 -169188 -20 8549 -36345 -228074 -223295 -74746
6778 -74746 5210 106818 42198 12033 -115763 -265166 -377361 -272267 -220959 -298464 -332724
6767 -332724 -418931 -342391 -268080 -34681 8622 -15051 3072 253178 318326 243445 80584
6756 80584 -151948 -159720 -51660 80816 134754 -14545 -124753 -104265 -154850 -252679 -193173
6745 -193173 -64620 -126571 -18709 -37969 -115625 -256361 -255776 -201019 -248512 -203282 -175434
$$ packed form
6823c57974J65759J97933o8586j09373o7666K67754J9333j2651J6013J92483J87234
6812D30259P0922k48346l7085R1626p6844k6317j48191j02248j24187j76775P3978
6801b73208J94106J55814K00018N004j37071j30348K0015K5072L5063j45011j52299
6790b02845P8355R3219n6012j54113Q142O4066J69168Q569m4894j91729M779J48549
6778g4746P9956J01608o4620l0165j27796j49403j12195J05094N1308p7505l4260
6767c32724q6207P6540P4311K33399M3303k3673J8123K50106O5148p4881j62861
6756H0584k32532p772J08060J32476N3938j49299j10208K0488n0585r7829N9506
6745a93173J28553o1951J07862j9260p7656j40736N85N4757m7493M5230K7848
$$ plain form
6734 -175434 -110452 185131 111371 -104228 -140364 -226113 -124973 147765 225756 47277 -115212
6723 -115212 -192777 -54350 146316 93668 -21292 -1848 -25646 75201 -136092 -339211
6713 -339211 -270981 -376198 -556272 -559926 -505309 -267881 -121601 -232081 -269221 -199346 -117659
6702 -117659 -59925 -130852 -308245 -343920 -268583 -319864 -238862 -174418 -155629 -61667 93193
6691 93193 -88232 -11746 140896 48013 -52578 -105792 -259984 48478 408686 574375
6681 574375 385834 55606 -153429 -154260 -57228 42363 -106346 -151022 -186748 -76480 181191
6670 181191 137573 -6571 12224 -58490 -143132 -19160 166379 239093 274601 96498 11212
6659 11212 -8221 32689 -126193 -112583 -208496 -517844 -323022 -163310 22603 15034 -139355
$$ packed form
6734a75434O4982K95583p3760k15599l6136q5749J01140K72738P7991j78479j62489
6723a15212p7565J38427K00666n2648j14960J9444k3798J00847k11293k03119
6713c39211O8230j05217j80074l654N4617K37428J46280j10480l7140O9875Q1687
6702a17659N7734p0927j77393l5675P5337n1281Q1002O4444J8789R3962J54860
6691I3193j81425P6486J52642r2883j00591n3214j54192L08462L60208J65689
6681E74375j88541l30228k09035q31R7032R9591j48709m4676l5726J10268K57671
6670A81191m3618j44144J8795p0714q4642J23972J85539P2714L5508j78103q5286
6659A1212j9433M0910j58882J3610r5913l09348J94822J59712J85913p569j54389
$$ plain form
6648 -139355 -153354 -181380 -14160 6733 -61546 -157994 -125607 -254531 -488308 -433181 -96231
6637 -96231 -39 4207 -119912 -122921 5829 -56688 -90600 -299987 -339436 -191282 -155386
6626 -155386 -285518 -262152 -81912 -260853 -150996 168769 242352 234888 246641 137247 77659
6615 77659 112904 161722 29207 -158450 -328378 -203615 137064 202586 180214 215557 259459
6604 259459 147213 159558 299453 295442 281116 189671 276401 287304 312586 -12488 38368
6593 38368 114957 118510 -145421 -250572 -218544 -292925 -345271 -211208 -16396 53893 -27197
6582 -27197 38379 126432 221565 98791 43468 43220 29245 42325 35344 -39085 7870 -175301
6570 -175301 -411976 -177710 159291 21355 -112892 -266943 -295342 -276024 -140665 -65177
$$ packed form
6648a39355j3999k8026J67220K0893o8279r6448L2387j28924k33777N5127L36950
6637i6231R6192M246j24119l009J28750o2517l3912k09387l9449J48154L5896
6626a55386j30132K3366J80240j78941J09857L19765P3583p464J1753j09394n9588
6615G7659L5245M8818j32515j87657j69928J24763L40679O5522k2372L5343M3902
6604B59459j12246J2345J39895m011j4326r1445Q6730J0903K5282l25074N0856
6593C8368P6589L553k63931j05151L2028p4381n2346J34063J94812P0289q1090
6582b7197O5576Q8053R5133j22774n5323k48j3975J3080o981p4429M6955j83171
6570a75301k36675K34266L37001j37936j34247j54051k8399J9318J35359P5488
$$ plain form
6560 -65177 -133256 -127640 -155592 -67244 104831 93772 117312 229145 35024 33194 -33816 -69220
6548 -69220 -86692 -45519 -125561 -147573 -168943 -303660 -543830 -383090 -249156 -272400 -109172
6537 -109172 -36763 -107397 -58986 66264 -128467 -256829 -351619 -291014 -115253 -41762 153882
6526 153882 245818 491988 345960 225098 140568 -123556 -100018 152430 422084 419936 320716
6515 320716 177726 184574 195082 -85611 -137162 -61298 -48086 -24221 -92509 -107374 -155115
6504 -155115 -156989 -271806 -310881 -358386 -153795 -37300 -42127 -44561 129305 399264 239401
6493 239401 55517 -23616 -7704 183518 206123 291947 258111 -77959 -23380 -131799 -86397
6482 -86397 68752 84818 14951 58999 32966 -210899 -342574 -287698 -317316 -274975 -28113
$$ packed form
6560f5177o8079N616k7952Q8348J72075j1059K3540J11833j94121j830o7010l5404
6548f9220j7472M1173q0042k2012k1370j34717k40170J60740J33934k3244J63228
6537a09172P2409p0634M8411J25250j94731j28362r4790O0605J75761P3491J95644
6526A53882R1936K46170j46028j20862q4530k64124K3538K52448K69654k148r9220
6515C20716j42990O848J0508k80693n1551P5864J3212K3865o8288j4865m7741
6504a55115j874j14817l9075m7505K04591J16495m827k434J73866K69959j59863
6493B39401j83884p9133J5912J91222K2605Q5824l3836l36070N4579j08419M5402
6482h6397J55149J6066o9867M4048k6033k43865j31675N4876k9618M2341K46862
$$ plain form
6471 -28113 -137562 -126516 7533 48092 122502 -25111 -312771 -312219 -112975 -110874 -69097
6460 -69097 -4303 61319 118174 125941 -66948 72601 25754 120121 158047 231919 216626 341925
6448 341925 198109 220180 445741 305887 188970 13395 -140163 -36979 -25458 123722
6438 123722 114460 -26093 -97553 -63144 75726 -90043 -115961 -217391 -128641 -118326 -22751
6427 -22751 -132803 -373054 -276950 52431 239085 125627 118644 144165 237947 42697 -202334
6416 -202334 -188753 -403352 -464663 -402887 -345211 -149263 -201070 -259502 -178055 -33433 -31097
6405 -31097 -109589 -232649 -415995 -267862 -142296 -276625 -289943 -214186 -96485 -121130 -143612
6394 -143612 -28283 -126338 -130737 -167337 -116715 -206481 -225452 -288959 -211531 45925 68140
$$ packed form
6471b8113j09449J1046J34049M0559P4410j47613k87660N52J99244K101M1777
6460f9097O4794O5622N6855P767j92889J39549m6847R4367L7926P3872j5293J25299
6448C41925j43816K2071K25561j39854j16917j75575j53558J03184J1521J49180
6438A23722r262j40553p1460L4409J38870j65769k5918j01430Q8750J0315R5575
6427b2751j10052k40251R6104L29381J86654j13458o983K5521R3782j95250k45031
6416b02334J3581k14599o1311O1776N7676J95948n1807n8432Q1447J44622K336
6405c1097p8492j23060j83346J48133J25566j34329j3318P5757J17701k4645k2482
6394a43612J15329r8055m399l6600N0622q9766j8971o3507P7428K57456K2215
$$ plain form
6383 68140 248268 284971 133481 -149344 -107544 66916 -154821 83224 162166 59453
6373 59453 -154359 -140115 54224 281545 301538 47547 219879 424456 410063 189438
6363 189438 37622 294735 445886 411333 350674 503483 388248 198346 -13709 -40910
6353 -40910 52521 85404 -15786 -7148 -17162 -58093 -116622 -301698 -535062 -317459 -240498
6342 -240498 -300657 -233812 -173422 -140858 3538 212665 359184 142441 -12634 -188137
6332 -188137 -171120 2836 -17234 50410 142809 135159 136322 326400 244917 321665 258666 -116347
6320 -116347 -163020 -8176 -3563 -11416 -108099 -421211 -376078 -356632 -280705 -289060 -343166 -336931
6308 -336931 -301689 -467855 -514120 -320998 -176639 -46787 65067 288505 373113 247584
$$ packed form
6383F8140J80128L6703j51490k82825M1800J74460k21737K38045P8942j02713
6373E9453k13812J4244J94339K27321J9993k53991J72332K04577j4393k20625
6363A89438j51816K57113J51151l4553o0659J52809j15235j89902k12055k7201
6353d0910R3431L2883j01190Q638j0014m0931n8529j85076k33364K17603P6961
6342b40498o0159O6845O0390L2564J44396K09127J46519k16743j55075j75503
6332a88137J7017J73956k0070O7644R2399p650J163J90078q1483P6748o2999l75013
6320a16347m6673J54844M613p853r6683l13112M5133J9446P5927q355n4106O235
6308c36931L5242j66166m6265J93122J44359J29852J11854K23438Q4608j25529
$$ plain form
6298 247584 188202 187867 210328 294409 557052 579047 331124 25006 98139 55230 183705
6287 183705 64739 30541 129490 112095 124312 74300 -38862 -8090 34657 200634 48232
6276 48232 -3958 20791 -39148 -106699 -81111 -98926 -202440 -191037 -85923 34168 177295
6265 177295 181337 2097 -161312 -73239 57491 49812 92554 152792 13247 -105308 -40753
6254 -40753 -149325 -146872 -149553 -145173 -192219 -356355 -305065 -213638 -209400 -125029 53797 -134069
6242 -134069 -302598 -257467 -144511 -238874 -115208 -200808 -244155 -277191 -177744 -150560 -437176
6231 -437176 -582100 -575434 -407720 -180953 14279 59661 121169 105235 -33720 133332 127773
6220 127773 218472 403791 223500 115576 131253 317720 169902 63241 -98387 -156263
$$ packed form
6298B47584n9382l35K2461Q4081K62643K1995k47923l06118P3133m2909J28475
6287A83705j18966l4198R8949j7395J2217n0012j13162L0772M2747J65977j52402
6276D8232n2190K4749n9939o7551K5588j7815j03514J1403J05114J20091J43127
6265A77295M042j79240j63409Q8073J30730p679M2742O0238j39545j18555O4555
6254d0753j08572K453k681M380m7046j64136N1290R1427M238Q4371J78826j87866
6242a34069j68529M5131J12956r4363J23666q5600m3347l3036R9447K7184k86616
6231d37176j44924O666J67714K26767J95232M5382O1508j5934j38955J67052n559
6220A27773R0699J85319j80291j07924J5677J86467j47818j06661j61628n7876
$$ plain form
6210 -156263 -7763 101200 178827 217971 292846 309270 237705 197180 169916 211063 27930
6199 27930 -226489 -51942 102005 45826 60794 -40014 -256228 -179752 -68715 -70809 -148220
6188 -148220 -98686 89756 -71897 -276678 -155828 29832 138469 147741 31786 -84412
6178 -84412 -4268 278641 -77480 -199615 74082 241918 293485 -24958 -22469 1663 -210188
6167 -210188 -425822 -152059 83846 -1098 -18624 68139 98677 -15960 -72731 -19035 -737
6156 -737 -79749 -79406 -137236 -44050 60946 204229 177688 247979 70778 160049 46893 -237954
6144 -237954 -278639 -57325 52273 -59896 -259210 -293527 -296725 -271214 -298866 -160486 119571
6133 119571 152507 -133430 -64513 39931 16051 -47122 98415 335064 148541 -23330
$$ packed form
6210a56263J48500J08963P7627L9144P4875J6424p1565m0525k7264M1147j83133
6199B7930k54419J74547J53947n6179J4968j00808k16214P6476J11037k094p7411
6188a48220M9534J88442j61653k04781J20850J85660J08637R272j15955j16198
6178h4412Q0144K82909l56121j22135K73697J67836N1567l18443K489K4132k11851
6167b10188k15634K73763K35905q4944j7526Q6763L0538j14637n6771N3696J8298
6156g37p9012L43n7830R3186J04996J43283k6541P0291j77201Q9271j13156k84847
6144b37954m0685K21314J09598j12169j99314l4317l198K5511k7652J38380K80057
6133A19571L2936k85937O8917J04444k3880o3173J45537K36649j86523j71871
$$ plain form
6123 -23330 -201576 -325976 -70522 87036 95691 -46427 -225102 -108335 -40943 -4736 -310739
6112 -310739 -272381 -87549 -199676 -285840 -343714 -261592 -132339 -167221 -128743 -202914 -294139
6101 -294139 -117773 341449 437531 276363 231257 70216 26450 119025 -92609 -182442 -71078
6090 -71078 14163 43933 37441 -281633 -159964 -161218 -97569 -78159 -62993 35925 -32703 -50987
6078 -50987 -45566 128704 69704 45077 109416 -9075 31202 106874 114355 -3889 -144922
6067 -144922 37875 -55998 -276263 -291293 -149659 68602 206442 120478 -32641 -82070
6057 -82070 12229 -74789 -167611 -324872 -412928 -276430 -15031 50317 103798 209785 156005
6046 156005 -211523 -335622 -51802 202641 51921 -132284 -110712 59726 220690 49011
$$ packed form
6123b3330j78246j24400K55454J57558Q655j42118j78675J16767O7392L6207l06003
6112c10739L8358J84832j12127q6164n7874Q2122J29253l4882L8478p4171r1225
6101b94139J76366M59222R6082j61168m5106j61041m3766R2575k11634q9833J11364
6090g1078Q5241K9770o492l19074J21669j254O3649J9410J5166R8918o8628j8284
6078e0987N421J74270n9000k4627O4339j18491M0277P5672P481j18244j41033
6067a44922J82797r3873k20265j5030J41634K18261J37840q5964j53119m9429
6057h2070R4299q7018r2822j57261q8056J36498K61399O5348N3481J05987n3780
6046A56005l67528j24099K83820K54443j50720j84205K1572J70438J60964j71679
$$ plain form
6036 49011 -233932 -309155 -456139 -412858 -413951 -328488 -110800 72308 41684 -125684 -218507
6025 -218507 -309572 -436220 -421034 -280014 -242776 -252377 -196435 -100920 18865 -32504 -120322
6014 -120322 -94244 883 130448 345680 305888 231576 86928 164970 188925 21123 -91168
6003 -91168 -102815 -56768 -33879 -99571 -37686 42385 76299 -82672 -32405 -30498 66961 342451
5991 342451 81545 13835 -39966 -47652 -93011 4754 -218424 -290189 -365718 -196580 -69104
5980 -69104 -357190 -328437 -225807 -195632 -242412 -279358 -223473 -218956 63992 359188 250285
5969 250285 276797 224002 24237 47996 116803 198042 308776 298463 255183 243565 370887
5958 370887 299395 184245 78582 111980 202893 322302 380180 379908 396100 309992 363810
$$ packed form
6036D9011k82943p5223j46984M3281j093Q5463K17688J83108l0624j67368r2823
6025b18507r1065j26648J5186J41020L7238r601N5942R5515J19785n1369q7818
6014a20322K6078R5127J29565K15232l9792p4312j44648P8042K3955j67802j12291
6003i1168j1647M6047K2889o5692O1885Q0071L3914j58971N0267J907R7459K75490
5991C42451k60906o7710n3801p686m5359R7765k23178p1765p5529J69138J27476
5980f9104k88086K8753J02630L0175m6780l6946N5885M517K82948K95196j08903
5969B50285K6512n2795j99765K3759O8807Q1239J10734j0313m3280j1618J27322
5958C70887p1492j15150j05663L3398R0913J19409N7878k72J6192q6108N3818
$$ plain form
5947 363810 52153 -168489 -204840 -197377 -177932 -176131 -29206 74752 237672 28507 65882
5936 65882 200718 168668 -23583 -206584 -20156 -973 -117804 -156354 8201 164839
5926 164839 115593 54017 59320 87220 54271 120618 161243 142930 145566 -8482 14041 86253
5914 86253 -45268 -183484 -69557 -61799 -303084 -135464 -13433 16143 -90935 41898
5904 41898 81418 127916 160397 119261 130247 -9364 -65898 -93995 -155021 -113550 68814
5893 68814 236840 107477 -119457 -138902 28878 167895 230434 180702 157274 90327 -3005
5882 -3005 10517 155134 143108 53237 -119886 -83817 -43863 -55019 48688 253908 305863
5871 305863 372749 180709 113812 132574 183877 1559 -149475 -117281 -55489 -118337 7477
$$ packed form
5947C63810l11657k20642l6351P463J9445J801J46925J03958J62920k09165L7375
5936F5882J34836l2050j92251j83001J86428J9183j16831l8550J64555J56638
5926A64839m9246o1576N303K7900l2949O6347M0625j8313K636j54048K2523P2212
5914H6253j31521j38216J13927P758k41285J67620J22031K9576j07078J32833
5904D1898L9520M6498L2481m1136J0986j39611n6534k8097o1026M1471J82364
5893F8814J68026j29363k26934j9445J67780J39017O2539m9732k3428o6947r3332
5882c005J3522J44617j2026q9871j73123L6069L9954j1156J03707K05220N1955
5871C05863O6886j92040o6897J8762N1303j82318j51034L2194O1792o2848J25814
$$ plain form
5860 7477 193930 50782 -178156 -239675 -106109 46706 169953 414537 443616 157092
5850 157092 2712 -120817 -130655 -170927 -80703 -7857 -170936 -128938 88360 298892 126362
5839 126362 179733 40015 -209828 -210375 -255813 -229362 -202356 -163693 -139030 -115613 -198748 -111589
5827 -111589 118925 316331 453816 277725 173025 250565 131376 -3957 -75859 -139243
5817 -139243 -7657 39363 -57844 -71855 58983 22108 -146415 -165369 -40691 -3834 -225105
5806 -225105 -330395 -258176 -322965 -301845 -304030 -331493 -277761 -169145 -91086 -30255 167170
5795 167170 52002 -40131 58950 -120429 -147365 -114849 -238821 -446814 -549610 -440724
5785 -440724 -364529 -213726 -125736 -206259 -220558 -417903 -331225 -108524 -86474 -138837 94766
$$ packed form
5860G477J86453j43148k28938o1519J33566J52815J23247K44584K9079k86524
5850A57092j54380j23529r838m0272R0224P2846j63079M1998K17298K10532j72530
5839A26362N3371j39718k49843n47m5438K6451K7006L8663K4663K3417q3135Q7159
5827a11589K30514J97406J37485j76091j04700P7540j19189j35333p1902o3384
5817a39243J31586M7020r7207j4011J30838l6875j68523j8954J24678L6857k21271
5806b25105j05290P2219o4789K1120k185k7463N3732J08616P8059O0831J97425
5795A67170j15168r2133R9081j79379k6936L2516j23972k07993j02796J08886
5785d40724P6195J50803Q7990q0523j4299j97345Q6678K22701K2050n2363K33603
$$ plain form
5774 94766 241571 423881 370432 319915 118229 -20304 -60516 -35641 -129549 -99483 5808
5763 5808 -55107 -189814 -102157 -8707 -105371 90218 111923 -2189 -19831 -221597 -43473
5752 -43473 -69697 -179206 -86434 138966 198005 -12663 -236761 -155003 105521 330248 195798
5741 195798 119203 24805 -241197 -427163 -319564 -131253 20427 127315 85168 -75457
5731 -75457 -269787 -304866 -28265 155395 79543 219640 200640 -112564 -329655 -211477
5721 -211477 -49284 87907 -55507 -113508 -236840 -221100 -153955 -142385 -76954 20129 60974
5710 60974 -30562 -77456 -207852 -174528 -37441 25190 129981 6904 116308 266728 260553
5699 260553 158047 -64525 -111548 20815 -65727 -189565 -82552 -133541 -76068 -32604 45770
$$ packed form
5774I4766J46805J82310n3449n0517k01686j38533m0212K4875r3908L0066J05291
5763E808o0915j34707Q7657R3450r6664J95589K1705j14112j7642k01766J78124
5752d3473k6224j09509R2772K25400N9039k10668k24098Q1758K60524K24727j34450
5741A95798p6595r4398k66002j85966J07599J88311J51680J06888m2147j60625
5731g5457j94330l5079K76601J83660p5852J40097j9000l13204k17091J18178
5721b11477J62193J37191j43414n8001j23332J5740O7145J1570O5431R7083M0845
5710F0974r1536m6894j30396L3324J37087O2631J04791j23077J09404J50420o175
5699B60553j02506k22572m7023J32363q6542j23838J07013n0989N7473M3464P8374
$$ plain form
5688 45770 136516 280074 137567 -112039 -130044 -95479 -157706 -136367 -159952 -259340 -232541
5677 -232541 -348424 -387628 -94006 222110 69184 -277201 -272785 -120495 -6046 181134
5667 181134 114381 -31770 4052 27106 -4901 -13707 -194269 -287620 -166713 -119596 -37136
5656 -37136 187382 130603 7098 -55740 -31631 7218 -114795 -274894 -199612 -109989 -160212
5645 -160212 -57798 160328 187629 8811 -220132 -259113 2498 172066 228279 96166
5635 96166 79174 125001 64128 -5737 -43017 -75050 -103122 -254461 -471522 -395229 -343109
5624 -343109 -241391 -147810 -93507 -304325 -332830 -184103 -100001 34340 -5317 -44972 -130052
5613 -130052 -9327 119976 202390 100463 113776 214817 194287 29293 21421 21563 107033
$$ packed form
5688D5770R0746J43558j42507k49606j8005L4565o2227K1339k3585r9388K6799
5677b32541j15883l9204K93622L16116j52926l46385M416J52290J14449J87180
5667A81134o6753j46151L5822K3054l2007q806j80562r3351J20907M7117Q2460
5656c7136K24518n6779j23505o2838K4109L8849j22013j60099P5282Q9623n0223
5645a60212J02414K18126K7301j78818k28943l8981K61611J69568N6213j32113
5635I6166j6992M5827o0873o9865l7280l2033k8072j51339k17061P6293N2120
5624c43109J01718R3581N4303k10818k8505J48727Q4102J34341l9657l9655q5080
5613a30052J20725J29303Q2414j01927J3313J01041k0530j64994p872J42Q5470
$$ plain form
5602 107033 70395 36038 30776 85143 18707 -143798 -139977 27803 181202 238820 162245
5591 162245 180024 227323 433223 403386 164235 73007 -16498 -64175 170514 342693 326741
5580 326741 152951 31959 -67483 -32601 -166573 -183619 -284160 -371497 -140730 -31417
5570 -31417 -49716 -74934 -72327 -113050 -17699 -9449 -24492 -3078 102150 165744 143589 -12616
5558 -12616 -220344 -37814 230308 276373 128807 2448 -11488 110262 132609 -24652
5548 -24652 -209101 -270127 -70152 31103 32959 92327 180804 187082 13421 -24995 -66576
5537 -66576 -49074 -167092 -291567 -229048 -140267 -93057 -62989 -35242 -43956 42918 122749 -58368
5525 -58368 -199770 -160631 -226616 -243013 -162644 -29648 -116517 -161398 -87490 183014 441423
$$ packed form
5602A07033l6638l4357n262N4367o6436j62505L821J67780J53399N7618p6575
5591A62245J7779M7299K05900k9837k39151r1228q9505m7677K34689J72179j5952
5580C26741j73790j20992r9442L4882j33972j7046j00541q7337K30767J09313
5570c1417j8299k5218K607m0723R5351Q250j5043K1414J05228O3594k2155j56205
5558a2616k07728J82530K68122M6065j47566j26359j3936J21750K2347j57261
5548b4652j84449o1026J99975J01255J856N9368Q8477O278j73661l8416m1581
5537f6576J7502j18018j24475O2519Q8781M7210L0068K7747q714Q6874P9831j81117
5525e8368j41402L9139o5985j6397Q0369J32996q6869m4881P3908K70504K58409
$$ plain form
5514 441423 367041 221791 98564 31524 33474 -31756 -4858 200984 311403 349938 252689
5503 252689 419062 251794 123413 -56799 -17828 87805 69065 -34420 -84213 -12388
5493 -12388 27533 87687 85365 -812 -862 114465 -45191 -156173 -177677 -59717 -152346 -310022
5481 -310022 -357609 -271804 -432861 -578510 -552934 -478219 -300843 32309 121508 123895 -47213
5470 -47213 -140764 -31556 -3738 -140438 -270012 -359392 -198334 47288 -17076 -60613 -145843
5459 -145843 -10443 20494 -282636 -558484 -438537 -396973 -430058 -416148 -233622 110894
5449 110894 359762 240209 4258 -125760 -3317 154483 90916 -96179 -109792 -209365
5439 -209365 -169241 -95570 -123154 -35603 87644 42220 14830 157028 271802 31778 -186149
$$ packed form
5514D41423p4382j45250j23227o7040J950o5230K6898K05842J10419L8535r7249
5503B52689J66373j67268j28381j80212L8971J05633j8740j03485m9793P1825
5493a2388L9921O0154k322q6177n0J15327j59656j10982k1504J17960r2629j57676
5481c10022m7587Q5805j61057j45649K5576P4715J77376L33152Q9199K387j71108
5470d7213r3551J09208K7818j36700j29574q9380J61058K45622o4364m3537q5230
5459a45843J35400L0937l03130k75848J19947M1564l3085J3910J82526L44516
5449A10894K48868j19553k35951j30018J22443J57800o3567j87095j3613r9573
5439b09365M0124P3671k7584Q7551J23247m5424k7390J42198J14774k40024k17927
$$ plain form
5428 -186149 90701 265154 -35844 82914 329279 330845 330926 192264 -63848 -250175 -136559
5417 -136559 -167443 -16088 83874 80346 3228 69630 222107 8215 26659 121905 -155463
5406 -155463 -297280 -105576 -7342 -26650 -185837 -125120 -214529 -202899 -80542 51019 -171279
5395 -171279 -216677 -247709 -194510 69818 215367 186753 208963 168532 137291 182371 276629
5384 276629 174131 -19086 -189339 -99644 -572 109327 -102324 -84287 -30718 -71160 -172009
5373 -172009 -222416 -54528 129265 252982 231690 51767 -180317 -406203 -419303 -222296
5363 -222296 -56019 75950 97967 -16914 -50753 31132 89429 -64112 -186170 -86214 108372
5352 108372 107379 -33087 36617 65378 234505 310210 285175 354972 318780 402412 126059
$$ packed form
5428a86149K76850J74453l00998J18758K46365J566Q1j38662k56112j86327J13616
5417a36559l0884J51355R9962l528p7118O6402J52477k13892J8444R5246k77368
5406a55463j41817J91704R8234j9308j59187O0717q9409J1630J22357J31561k22298
5395a71279m5398l1032N3199K64328J45549k8614K2210m0431l1241M5080R4258
5384B76629j02498j93217j70253Q9695R9072J09899k11651J8037N3569m0442j00849
5373a72009n0407J67888J83793J23717k1292j79923k32084k25886j3100J97007
5363b22296J66277J31969K2017j14881l3839Q1885N8297j53541j22058R9956J94586
5352A08372r93j40466O9704K8761J69127P5705k5035O9797l6192Q3632k76353
$$ plain form
5341 126059 -113122 -180267 -148219 -66699 80986 -13661 32466 94098 41461 -1664 -16245
5330 -16245 95790 232190 215936 -50697 -181419 -144992 -189391 -98222 -145979 -270694 -319424
5319 -319424 -363871 -371545 -340752 -250971 -196132 -99150 -126179 -172791 -350902 -320034 -33605
$$ packed form
5341A26059k39181o7145L2048Q1520J47685r4647M6127O1632n2637m3125j4581
5330a6245J12035J36400j6254k66633j30722L6427m4399R1169m7757j24715m8730
5319c19424m4447p674L0793Q9781N4839R6982k7029m6612j78111L0868K86429
$$ [...]
##END NTUPLES=NMR SPECTRUM
##END=
