##TITLE=Analysis number 315878
Compound Code tl 00951
Project Code adrs
Chemist Name fudan
##JCAMPDX= 6.0         $$ Bruker NMR JCAMP-DX V2.0
##DATA TYPE= NMR SPECTRUM
##DATA CLASS= NTUPLES
##ORIGIN= Bruker BioSpin GmbH
##OWNER= NMR
$$ XWIN-NMR		Version 3.5
$$ Tue Dec  6 14:16:06 2005 GMT Standard Time (UT+0h)  MAYBRIDGE\NMR@NMR_250MHZ
##.OBSERVE FREQUENCY= 250.131544655141
##.OBSERVE NUCLEUS= ^1H
##.ACQUISITION MODE= SIMULTANEOUS (DQD)
##.ACQUISITION SCHEME= undefined
##.AVERAGES= 16
##.DIGITISER RES= 18
##SPECTROMETER/DATA SYSTEM= dpx250
##.PULSE SEQUENCE= zg30
##.SOLVENT NAME= DMSO
##.SHIFT REFERENCE= (INTERNAL, DMSO, 0, 16.522)
##AUDIT TRAIL= $$ (NUMBER, WHEN, WHO, WHERE, WHAT)
$$ ##TITLE= Audit trail, XWIN-NMR		Version 3.5
$$ ##JCAMPDX= 5.01
$$ ##ORIGIN= Bruker BioSpin GmbH
$$ ##OWNER= NMR
$$ C:\u/data/dgb/nmr/ADRS/13500/pdata/1/auditp.txt
$$ ##AUDIT TRAIL=  $$ (NUMBER, WHEN, WHO, WHERE, WHAT)
(   1,<2005-12-06 14:15:25.46 +000>,<MAYBRIDGE\NMR>,<NMR_250MHZ>,
      <created by zg, POWCHK disabled, PULCHK disabled
       configuration hash MD5:
       62 19 C7 07 E1 42 D1 B7 37 6C 3D D0 77 39 F9 E6
       data hash MD5: 64K
       80 C1 3D FE 09 37 11 F7 EB B8 C1 93 66 C0 96 81>)
(   2,<2005-12-06 14:15:41.88 +000>,<MAYBRIDGE\NMR>,<NMR_250MHZ>,
      <Start of raw data processing
       ef LB = 0.3 FT_mod = 6 PKNL = 1 SI = 32K 
       data hash MD5: 32K
       C1 A3 C4 79 A4 0A 4A 9B F1 7F 1E A0 74 40 2E 41>)
(   3,<2005-12-06 14:15:44.09 +000>,<MAYBRIDGE\NMR>,<NMR_250MHZ>,
      <apk 
       data hash MD5: 32K
       04 02 27 03 E0 83 3C A2 69 96 A3 36 B4 AF B0 84>)
(   4,<2005-12-06 14:15:44.81 +000>,<MAYBRIDGE\NMR>,<NMR_250MHZ>,
      <abs ABSG = 5 
       data hash MD5: 32K
       45 34 27 3F B7 68 AF 8B F5 D1 2E 99 99 7E 11 0D>)
$$ ##END=
$$ 
$$ hash MD5
$$ 20 5C C4 72 48 9A 2D CF 78 E2 DD C7 83 DB EB 17
##$RELAX= 
##$RELAX= 
##$RELAX= 
##$RELAX= 
##$RELAX= 
##$RELAX= 
##$RELAX= 
$$ Bruker specific parameters
$$ --------------------------
##$DU= <C:\u>
##$EXPNO= 13500
##$NAME= <ADRS>
##$PROCNO= 1
##$TYPE= <nmr>
##$USER= <dgb>
##$AMP= (0..31)
100 100 100 100 100 100 100 100 100 100 100 100 100 100 100 100 100 100 
100 100 100 100 100 100 100 100 100 100 100 100 100 100 
##$AQSEQ= 0
##$AQ_mod= 3
##$AUNM= <au_zg>
##$AUTOPOS= <12 >
##$BF1= 250.13
##$BF2= 250.13
##$BF3= 250.13
##$BF4= 250.13
##$BF5= 500.13
##$BF6= 500.13
##$BF7= 500.13
##$BF8= 500.13
##$BYTORDA= 1
##$CFDGTYP= 0
##$CFRGTYP= 5
##$CHEMSTR= <none>
##$CNST= (0..31)
1 1 145 1 1 1 1 1 1 1 1 1 1 1 1 1 1 1 1 1 1 1 1 1 1 1 1 1 1 1 1 1 
##$CPDPRG= <>
##$CPDPRG1= <>
##$CPDPRG2= <>
##$CPDPRG3= <>
##$CPDPRG4= <mlev>
##$CPDPRG5= <mlev>
##$CPDPRG6= <mlev>
##$CPDPRG7= <mlev>
##$CPDPRG8= <mlev>
##$CPDPRGB= <>
##$CPDPRGT= <>
##$D= (0..31)
0 1 0 0 0 0 0 0 0 0.06 0 0 0 0 0 0 0.0002 0 0 0 0 0 0 0 0 0 0 0 0 0 0 
0 
##$DATE= 1133878523
##$DBL= (0..7)
120 120 120 120 120 120 120 120 
##$DBP= (0..7)
150 150 150 150 150 150 150 150 
##$DBP07= 0
##$DBPNAM0= <>
##$DBPNAM1= <>
##$DBPNAM2= <>
$$ [...]
##$SUBNAM6= <"">
##$SUBNAM7= <"">
##$SUBNAM8= <"">
##$SUBNAM9= <"">
##$SW= 20.6930455092707
##$SWIBOX= (0..15)
0 0 3 0 0 0 0 0 0 0 0 0 0 0 0 0 
##$SW_h= 5175.983436853
##$TD= 65536
##$TD0= 1
##$TE= 294.16
##$TE2= 300
##$TE3= 300
##$TEG= 300
##$TL= (0..7)
0 120 120 120 120 120 120 120 
##$TP= (0..7)
150 150 150 150 150 150 150 150 
##$TP07= 0
##$TPNAME0= <>
##$TPNAME1= <>
##$TPNAME2= <>
##$TPNAME3= <>
##$TPNAME4= <>
##$TPNAME5= <>
##$TPNAME6= <>
##$TPNAME7= <>
##$TPOAL= (0..7)
0.5 0.5 0.5 0.5 0.5 0.5 0.5 0.5 
##$TPOFFS= (0..7)
0 0 0 0 0 0 0 0 
##$TUNHIN= 0
##$TUNHOUT= 0
##$TUNXOUT= 0
##$USERA1= <user>
##$USERA2= <user>
##$USERA3= <user>
##$USERA4= <user>
##$USERA5= <user>
##$V9= 5
##$VALIST= <valist>
##$VCLIST= <CCCCCCCCCCCCCCC>
##$VD= 0
##$VDLIST= <DDDDDDDDDDDDDDD>
##$VPLIST= <PPPPPPPPPPPPPPP>
##$VTLIST= <TTTTTTTTTTTTTTT>
##$WBST= 1024
##$WBSW= 4
##$XGAIN= (0..3)
0 0 0 0 
##$XL= 0
##$YL= 0
##$YMAX_a= 516620
##$YMIN_a= -428659
##$ZGOPTNS= <>
##$ZL1= 120
##$ZL2= 120
##$ZL3= 120
##$ZL4= 120
##$ABSF1= 16.522
##$ABSF2= -4.171173
##$ABSG= 5
##$ABSL= 3
##$ALPHA= 0
##$AQORDER= 0
##$ASSFAC= 0
##$ASSFACI= 0
##$ASSFACX= 0
##$ASSWID= 0
##$AUNMP= <proc_1d>
##$AZFE= 0.1
##$AZFW= 0.1
##$BCFW= 0
##$BC_mod= 0
##$BYTORDP= 0
##$COROFFS= 0
##$CY= 12.5
##$DATMOD= 1
##$DC= 0
##$DFILT= <>
##$DTYPP= 0
##$F1P= 14.0000005364418
##$F2P= -0.99999901652339
##$FCOR= 0.5
##$FTSIZE= 32768
##$FT_mod= 6
##$GAMMA= 0
##$GB= 0
##$INTBC= 1
##$INTSCL= 1
##$ISEN= 128
##$LB= 0.3
##$LEV0= 0
##$LPBIN= 0
##$MAXI= 10000
##$MC2= 0
##$MEAN= 0
##$ME_mod= 0
##$MI= 0
##$NCOEF= 0
##$NC_proc= -2
##$NLEV= 6
##$NOISF1= 0
##$NOISF2= 0
##$NSP= 0
##$NTH_PI= 0
##$NZP= 0
##$OFFSET= 16.522
##$PC= 1
##$PHC0= 74.80455
##$PHC1= 2.19527
##$PH_mod= 1
##$PKNL= yes
##$PPARMOD= 0
##$PSCAL= 4
##$PSIGN= 0
##$REVERSE= no
##$SF= 250.13
##$SI= 32768
##$SIGF1= 0
##$SIGF2= 0
##$SINO= 400
##$SIOLD= 32768
##$SREGLST= <1H.DMSO>
##$SSB= 0
##$STSI= 32768
##$STSR= 0
##$SW_p= 5175.98343685301
##$SYMM= 0
##$S_DEV= 0
##$TDeff= 65536
##$TDoff= 0
##$TI= <Analysis number 999999
Compound Code 99
Book Reference 9
Project Code 9>
##$TILT= no
##$TM1= 0
##$TM2= 0
##$TOPLEV= 0
##$USERP1= <user>
##$USERP2= <user>
##$USERP3= <user>
##$USERP4= <user>
##$USERP5= <user>
##$WDW= 1
##$XDIM= 32768
##$YMAX_p= 351910913
##$YMIN_p= -82024
$$ End of Bruker specific parameters
$$ ---------------------------------
##NTUPLES= NMR SPECTRUM
##VAR_NAME=  FREQUENCY,     SPECTRUM/REAL,   SPECTRUM/IMAG
##SYMBOL=    X,             R,               I
##VAR_TYPE=  INDEPENDENT,   DEPENDENT,       DEPENDENT
##VAR_FORM=  AFFN,          ASDF,            ASDF
##VAR_DIM=   32768,         32768,           32768
##UNITS=     HZ,            ARBITRARY UNITS, ARBITRARY UNITS
##FACTOR=    0.157963299565203, 1,           1
##FIRST=     4132.6476996994, 0,             0
##LAST=      -1043.33573715361, 0,           0
##MIN=       -1043.33573715361, -82024,      0
##MAX=       4132.6476996994, 351910913,     0
$$ Real data points
##PAGE= N=1
##DATA TABLE= (X++(R..R)), XYDATA
$$ [...]
14982d907J1J520N928o953j565M167r515o286J1461N082K72n330q37P190Q290
$$ -4907 -4896 -3376 2552 -4401 -5966 -1799 -11314 -17600 -6139 -1057 -785 -6115 -6952 238 8528
14967H528O805n326j7785OP213J317r218m82R129j0805q108P115J1549j355m194
$$ 8528 15333 10007 -7778 -7772 -559 758 -8460 -8942 187 -10618 -18726 -11611 -62 -1417 -5611
14952e611N797k518j14q808j703Q558M348r27j7355K094J5034J1559J254j461
$$ -5611 186 -2332 -2446 -11254 -12957 -4399 -51 -978 -18333 -16239 -1205 10354 11608 10147
14938A0147m381o404o143j193j747j436k469L399J1090K189n298o615M422R950
$$ 10147 5766 -638 -6781 -7974 -9721 -11157 -13626 -10227 863 3052 -2246 -8861 -4439 5511
14924E511k091J456m867J591q62l355N131l785o286M219M266J586K467J833L430
$$ 5511 3420 4876 9 1600 738 -2617 2514 -1271 -7557 -3338 928 2514 4981 6814 10244
14909A0244P80P58j6467o7j777M0J513J224j416m388J451M089Q298N762n718k499
$$ 10244 11024 11782 -4685 -4752 -6529 -6489 -4976 -3752 -5168 -9556 -8105 -4016 4282 10044 4326 1827
14893A827r163j231M086k974k864k665k951J70k275m812N179M165M972m224m743
$$ 1827 -7336 -8567 -4481 -7455 -10319 -12984 -15935 -15765 -18040 -22852 -17673 -13508 -8536 -12760 -17503
14878a7503K2o699P614K906j419P986Q145O083M72M016l986k579K602r16o992
$$ -17503 -17481 -24180 -16566 -13660 -15079 -7093 1052 7135 7607 11623 7637 5058 7660 6744 -248
14863b48r477j269n45j239l267K689O992N428j438J914J013l777l404k195L29
$$ -248 -9725 -10994 -11539 -12778 -16045 -13356 -6364 -936 -2374 -460 553 -3224 -6628 -8823 -8494
14848h494L110R969R993p21j3553k484O935N799O98k765l084m239K625P017K125
$$ -8494 -5384 4585 14578 13857 304 -2180 4755 10554 11252 8487 5403 1164 3789 10806 12931
14833A2931q327J778L193k443j063j885m006K409j1714n058J0548L380k694L136
$$ 12931 4604 6382 9575 7132 6069 4184 178 2587 -9127 -14185 -3637 -257 -2951 185
14819A85k14m824p137M047K851k854M720l75o56l974J935P714q835J531L231J099
$$ 185 -29 -4853 -11990 -7943 -5092 -7946 -3226 -3601 -4257 -8231 -6296 1418 -7417 -5886 -2655 -1556
14803a556l338j816J1178L41J234l750O233K040o717o807o500Q461O490r394R00
$$ -1556 -4894 -6710 4468 4809 6043 2293 8526 10566 3849 -2958 -9458 -997 5493 -3901 -3001
14788c001L29q928N15N610K582k224Q68J974j4608j0851J2729J0038m62m146n055
$$ -3001 -2672 -11600 -11085 -5475 -2893 -5117 -4249 -2275 -16883 -27734 -15005 -4967 -5429 -9575 -14630
14773a4630j1081R08R783J4404N838q691K2J413L201k066J700L111J155m418m137
$$ -14630 -25711 -24803 -15020 -616 5222 -3469 -3447 -2034 1167 -899 801 3912 5067 649 -3488
14758c488M678L153p514o502q983R44O418J684q228K979N781N843P245m392O436
$$ -3488 1190 4343 -3171 -9673 -18656 -17712 -11294 -9610 -17838 -14859 -9078 -3235 4010 -382 6054
14743F054k781m948O402O516n933j4590J81K174Kj48O357n660k817M986k956k24
$$ 6054 3273 -1675 4727 11243 5310 -9280 -9099 -6925 -6923 -7071 -714 -6374 -9191 -4205 -7161 -7385
14727g385K191Q268m79m405j3868r78R573J082L5l599j271J97k378l320M02N587
$$ -7385 -5194 3074 2595 -1810 -15678 -16656 -7083 -6001 -5966 -9565 -10836 -10639 -13017 -16337 -15935 -10348
14711a0348Q688K465r67J556m981j708P437N375r237j0192P04J035O173K36o211
$$ -10348 -1660 805 -162 1394 -3587 -5295 2142 7517 -1720 -11912 -11208 -10173 -4000 -3764 -9975
14696i975j563l322K466K984Q384O686l628p332l01q034j752J6425J049j927k068
$$ -9975 -11538 -14860 -12394 -9410 -1026 5660 2032 -5300 -5601 -13635 -15387 1038 2087 160 -1908
14681a908k887p930j089L030j354R6o49l51m217r70K505R650O109M259l854m605
$$ -1908 -4795 -12725 -13814 -10784 -12138 -12042 -12691 -13042 -17259 -18229 -15724 -6074 35 4294 440 -4165
14665d165m236q51P876J118l559p140K681P816N416r579j751L454n048m156N667
$$ -4165 -8401 -9252 -1376 -258 -3817 -10957 -8276 -460 4956 -4623 -6374 -2920 -7968 -12124 -6457
14650f457m381J263k266O393q6r890n174L573O941n47K684J6734M753o522j3575
$$ -6457 -10838 -9575 -11841 -5448 -5534 -15424 -20598 -17025 -10084 -10631 -7947 8787 13540 7018 -6557
14635f557o517m497J023k12k846k78J0825L351J347k449q603o835o290R928N693
$$ -6557 -13074 -17571 -16548 -16760 -19606 -19884 -9059 -5708 -4361 -6810 -15413 -22248 -28538 -18610 -12917
14620a2917L788R736M4m764j067j445l246K049O424K442J0301o083p551r976M16
$$ -12917 -9129 607 651 -4113 -5180 -6625 -9871 -7822 -1398 1044 11345 5262 -2289 -12265 -11849
14605a1849O122M522r194j0379N790Q220J3063m18m549p303p229Q184N338P596
$$ -11849 -5727 -1205 -10399 -20778 -14988 -6768 6295 5877 1328 -5975 -13204 -5020 318 7914
14591G914K411j492j1146l87J00n875m328J0470j436j0953J697k73J93M499K966
$$ 7914 10325 8833 -2313 -2700 -2600 -8475 -12803 -2333 -3769 -14722 -13025 -13298 -13105 -8606 -5640
14576e640l064j0020N73Q19L885J3820P373m09P44l980o805M29o176q352N284
$$ -5640 -8704 -18724 -18151 -17332 -13447 373 7746 7337 8081 4101 -2704 -2275 -8451 -16803 -11519
14561a1519L506l032j271k842r179J753J1261R426J3134P006j286r429j1639l336
$$ -11519 -8013 -11045 -12316 -15158 -24337 -22584 -11323 -1897 11237 18243 16957 7528 -4111 -7447
14547g447k292o127J853O627P187N012m980n979l947L187m620J078O948l224n406
$$ -7447 -9739 -15866 -14013 -7386 -199 4813 -167 -6146 -10093 -6906 -11526 -10448 -3500 -6724 -12130
14532a2130O73M67N563J2727l629m591m960P142l376n966j2173J928k868K915
$$ -12130 -11457 -10990 -5427 7300 3671 -920 -5880 1262 -2114 -8080 -20253 -18325 -21193 -18278
14518a8278p13p218O539N271k869p454J2265Q099L560l991m046o203J532J811
$$ -18278 -18991 -26209 -19670 -14399 -17268 -24722 -12457 -4358 -798 -4789 -8835 -15038 -13506 -11695
14504a1695J341J697K944j217N148K213J462n435Q097N937q321j0662r266r469
$$ -11695 -10354 -8657 -5713 -6930 -1782 431 1893 -3542 4555 10492 2171 -8491 -17757 -27226
14490b7226Q04n293O888N982R64o514K668j926L165N856Q000L590l208m82R980
$$ -27226 -26422 -31715 -24827 -18845 -17881 -24395 -21727 -23653 -20488 -14632 -6632 -3042 -6250 -6732 3248
14475C248O87P586j1064m99j089K852P947J023L229j0296J484J070r274j6019
$$ 3248 3935 11521 457 -42 -1131 1721 9668 10691 13920 3624 5108 6178 -3096 -19115
14461a9115M827N038J164Q01O754l857J763j378p25j952o37l949J474j988j630
$$ -19115 -14288 -9250 -8086 -7285 -531 -4388 -2625 -4003 -4728 -6680 -7317 -11266 -9792 -11780 -13410
14446a3410M517L967N89R106N22K640J047j9754j1877L46J1649r16j927K514N61
$$ -13410 -8893 -4926 -4337 4769 5291 7931 8978 -10776 -22653 -22307 -10658 -11574 -13501 -10987 -10426
14431a0426m391L230j5k122R77K718l166j727k33q790J312O315P69j53N814Q762
$$ -10426 -14817 -11587 -11602 -13724 -12747 -10029 -13195 -14922 -15155 -23945 -22633 -16318 -15549 -15702 -9888 -1126
14415a126O581K41o256m680O38q021o481j00J922l102L061J0361o354m980M123
$$ -1126 5455 5696 -560 -5240 -4602 -12623 -19104 -19204 -17282 -20384 -17323 -6962 -13316 -18296 -14173
14400a4173O026K560J39J202K38j426j1779J4986O721j068K820j0934p292k703
$$ -14173 -8147 -5587 -5448 -4246 -4008 -5434 -17213 -2227 4494 3426 6246 -4688 -11980 -14683
14386a4683j485j656j20K225J0630P47M626l742p505M764N057J205l938j894l146
$$ -14683 -16168 -17824 -17944 -15719 -5089 -4342 284 -3458 -10963 -6199 -1142 63 -3875 -5769 -8915
14371h915M694p412q274K672M700L849L05J169N265J9J411M133q904j965q45j5297
$$ -8915 -4221 -11633 -19907 -17235 -12535 -8686 -8381 -7212 -1947 -1928 -517 3616 -5288 -7253 -8098 -23395
14355b3395l60J2693R318k72k777q950O364k58L028N392J1308J2061n250p290
$$ -23395 -23755 -11062 -1744 -2016 -4793 -13743 -7379 -7637 -4609 783 12091 24152 18902 11612
14341A1612o603K59q568j838m254M391O546J0207j23m850K75r500j5888p520P480
$$ 11612 5009 5268 -3300 -5138 -9392 -5001 1545 11752 11629 6779 7054 -2446 -18334 -25854 -18374
14326a8374J0527l810L633L530K431n635O174l160n33k5l199M619M024j194k130
$$ -18374 -7847 -11657 -8024 -4494 -2063 -7698 -1524 -4684 -5217 -5242 -8441 -3822 202 -992 -3122
14311c122O225m863j1109q097k518J4222j053k627J634L837n930j81p62j2189
$$ -3122 3103 -1760 -12869 -20966 -23484 -9262 -10315 -12942 -11308 -7471 -13401 -13582 -14344 -26533
14297b6533O016Q798J1454l010n842l355O100M628r192n225J4001L876q669n442
$$ -26533 -20517 -11719 -265 -3275 -9117 -12472 -6372 -1744 -10936 -16161 -2160 1716 -6953 -12395
14283a2395J135m127N177m54n407L604R211j063p239n88P739N578O028o483k923
$$ -12395 -11260 -15387 -10210 -10664 -16071 -12467 -3256 -4319 -11558 -12146 -4407 1171 7199 716 -2207
14268b207k672o473O352N304n302q290L149P323Q420q262j5230n714k593J0189
$$ -2207 -4879 -11352 -5000 304 -4998 -13288 -10139 -2816 5604 -2658 -17888 -23602 -26195 -16006
14254a6006J0630m446k071O51j071Q285N13p86l344L311N850n124j6373n443R433
$$ -16006 -5376 -9822 -11893 -11242 -12313 -4028 -3515 -4301 -7645 -4334 1516 -3608 -19981 -25424 -15991
14239a5991R897l58n393r736L714O014N313O65l768r174n094O423M135J6579M694
$$ -15991 -6094 -6452 -11845 -21581 -17867 -11853 -6540 -5875 -9643 -18817 -23911 -17488 -13353 3226 7920
14224G920q739j5250m81J2865M125K332M266l512n313K261j225j140k742J782
$$ 7920 -819 -16069 -16550 -3685 440 2772 7038 3526 -1787 474 -751 -1891 -4633 -2851
14210b851n789J138J0049N668p027N26O591k442m036R51l801K696R253o071j4339
$$ -2851 -8640 -7502 2547 8215 1188 1714 8305 5863 1827 2778 -1023 1673 10926 4855 -9484
14195i484j150Q921J2875N545o104n114l075m57q49o48j411O879r24q69J620L206
$$ -9484 -10634 -1713 11162 16707 10603 5489 2414 1957 1108 460 -951 5928 5004 4135 5755 8961
14179H961m171j7580J369L07N953j539L947n58O68q495l261K40J031p511N423
$$ 8961 4790 -12790 -11421 -11114 -5161 -6700 -2753 -3311 -2643 -11138 -14399 -14159 -13128 -20639 -15216
14164a5216P282l419n786J1943J2803L977j3973o127L766P374J007p187n676L6
$$ -15216 -7934 -11353 -17139 -5196 7607 11584 -2389 -8516 -4750 2624 3631 -3556 -9232 -9196
14150i196J464p76J401m266K042R897P3n223K297P345O811m449q601J545m852
$$ -9196 -7732 -8508 -7107 -11373 -9331 566 639 -4584 -2287 5058 11869 7420 -1181 364 -4488
14135d488j3752J586Q505P663o67j7831L303J0637M614J365k575m309K920p062
$$ -4488 -18240 -16654 -8149 -486 -1153 -18984 -15681 -5044 -430 935 -1640 -5949 -3029 -10091
14121a0091m431Q83k490K282j408o689M823J3080J1231m868p048o9J415L17j807
$$ -10091 -14522 -13639 -16129 -13847 -15255 -21944 -17121 -4041 7190 2322 -4726 -4795 -3380 -3063 -4870
14106d870N107l212L64M279r59K901J916k134J0227L403n156o109o057j277j052
$$ -4870 237 -2975 -2611 1668 709 3610 5526 3392 13619 17022 11866 5757 -300 -1577 -2629
14091b629K437j1647j76m123M407j491J878P455M264l824l142p502r335p41Q601
$$ -2629 -192 -11839 -12015 -16138 -11731 -13222 -11344 -3889 375 -3449 -6591 -14093 -23428 -24169 -15568
14076a5568J0601rl201k31l415l182N206K316J4980N830j1389j8356L077N859
$$ -15568 -4967 -4976 -8177 -8408 -11823 -15005 -9799 -7483 7497 13327 1938 -16418 -13341 -7482
14062g482J750J0148J54r042q107M600J882J668M83k900n729k342N16M392K893
$$ -7482 -5732 4416 4570 -4472 -12579 -7979 -6097 -4429 -3946 -6846 -12575 -14917 -14401 -10009 -7116
14047g116k340q14J448L247L757K946l317o659k366j34j2009P794M675L525P029
$$ -7116 -9456 -10270 -8822 -5575 -1818 1128 -2189 -8848 -11214 -11348 -23357 -15563 -10888 -7363 -334
14032c34M754k863J646K110J781l0k425l84m935q348J632o360q209K990J1747
$$ -334 4420 1557 3203 5313 7094 7064 4639 4255 -680 -9028 -7396 -13756 -21965 -18975 -7228
14017g228R458m966j1124q259N7Q510J1060k954l16J0334j2863l440J0437J7151
$$ -7228 2230 -2736 -13860 -22119 -22062 -13552 -2492 -5446 -5762 4572 -8291 -11731 -1294 15857
14003A5857J14r081k128q900n36l448n44J552N883M111r480J502Q033m793m154
$$ 15857 15971 6890 4762 -4138 -4674 -8122 -8666 -7114 -1231 2880 -6600 -5098 2935 -1858 -6012
13988f012m765O266k88K51j124O817R091j286N6l35M42j278m013l029M177j262
$$ -6012 -10777 -4511 -4799 -4548 -5672 1145 10236 8950 9006 8671 9113 7835 3822 793 4970 3708
13972C708K060l963N040K061p207k464L02L914n633r424R014L987j626m439r499
$$ 3708 5768 1805 6845 8906 1699 -765 -463 3451 -2182 -11606 -2592 1395 -231 -4670 -14169
13957a4169m875j4080J143O508O540j418N942K126j117k520M029N218N322q832
$$ -14169 -19044 -33124 -31981 -25473 -18933 -20351 -14409 -12283 -13400 -15920 -11891 -6673 -1351 -10183
13943a0183q52o812K886N553l612o772o495L599M901M684R128n22L324M534n006
$$ -10183 -11035 -17847 -14961 -9408 -13020 -19792 -26287 -22688 -17787 -13103 -3975 -4497 -1173 3361 -1645
13928a645m354n538l0K6k862O849p863M84o363J99M540J1330K373m478J710m279
$$ -1645 -5999 -11537 -11567 -11541 -14403 -7554 -15417 -14933 -21296 -21097 -16557 -5227 -2854 -7332 -5622 -9901
13912i901l713j572K402O074L9n008m493J496O443P682J1706q58o926j064Q76
$$ -9901 -13614 -15186 -12784 -6710 -6671 -11679 -16172 -14676 -8233 -551 11155 10297 3371 2307 3183
13897C183n148k618j182R92l144j549L986J928k779k40R169K161j0996m009M890
$$ 3183 -1965 -4583 -5765 -4773 -7917 -9466 -5480 -3552 -6331 -6571 2598 4759 -6237 -10246 -5356
13882e356M406O354N07o847L8K067N790R20l395p461p504j213J942p279m467J796
$$ -5356 -950 5404 5911 -936 -898 1169 6959 7879 4484 -2977 -10481 -11694 -9752 -17031 -21498 -19702
13866a9702J9563R604j1131j5574O660J0007j053j291j3006O050K442n599N52
$$ -19702 -139 9465 -1666 -17240 -10580 -573 -1626 -2917 -15923 -9873 -7431 -13030 -12478
13853a2478L025n001J492J2802k418k62P663j130K830o087J953J4143n990r490
$$ -12478 -9453 -14454 -12962 -160 -2578 -2840 4823 3693 6523 436 2389 16532 10542 1052
13839A052n167j686p113P483L802k199N074K233L547l9L347m581p433j807j251
$$ 1052 -4115 -5801 -12914 -5431 -1629 -3828 1246 3479 7026 6987 10334 5753 -1680 -3487 -4738
13824d738L709J27r174k052l197R736R261r729k034J402n482l081j22N937O315
$$ -4738 -1029 -902 -10076 -12128 -15325 -5589 3672 -6057 -8091 -6689 -12171 -15252 -15374 -9437 -3122
13809c122M176m462k969P975L415k907j3108o905J519K471K806O889L496p306
$$ -3122 1054 -3408 -6377 1598 5013 2106 -11002 -17907 -16388 -13917 -11111 -4222 -726 -8032
13795h032p107P935O054r71m006J802M303M253o277p166K89k083K98J5647N273
$$ -8032 -15139 -7204 -1150 -2121 -6127 -4325 -22 4231 -2046 -9212 -8923 -11006 -10708 4939 10212
13780A0212K724J599j3836r492J043k633p239qJ813J463J128M825Q751r14r945
$$ 10212 12936 14535 699 -8793 -7750 -10383 -17622 -17630 -15817 -14354 -13226 -8401 350 -564 -10509
13765a0509m667L295O747L063m042K139P705J1k01o287j804l042J478n228m200
$$ -10509 -15176 -11881 -5134 -2071 -6113 -3974 3731 3742 3541 -2746 -4550 -7592 -6114 -11342 -15542
13750a5542p71O567K484K695k924k734k873N82N31M579l24m175M54J0493L774
$$ -15542 -16313 -9746 -7262 -4567 -7491 -10225 -13098 -12516 -11985 -7406 -7730 -11905 -11451 -958 2816
13735B816K170j1470j25j940L694p159j0456M090L95n871J0419r98K96J1246O392
$$ 2816 4986 -6484 -6609 -8549 -4855 -12014 -22470 -18380 -17985 -23856 -13437 -14435 -14139 -2893 3499
13720C499J0229k055j1590o614p360P79M64M665j380n461N115L064M501k269o885
$$ 3499 13728 11673 83 -6531 -13891 -13112 -12648 -7983 -9363 -14824 -9709 -6645 -2144 -4413 -11298
13705a1298n795m411M110L003R100O024o580k103L619p437q898p481M800N024
$$ -11298 -17093 -21504 -17394 -14391 -5291 733 -5847 -7950 -4331 -11768 -20666 -28147 -23347 -18323
13691a8323J2237O710j0442p02N431Q18q95j098l785K772q87k522k437m499l201
$$ -18323 -6086 624 -9818 -10520 -5089 -4271 -5166 -6264 -10049 -7277 -8164 -10686 -13123 -17622 -20823
13676b0823R273L509K440K739p591k372O59j496n090K144m859Q083O399J181k244
$$ -20823 -11550 -8041 -5601 -2862 -10453 -12825 -12166 -13662 -18752 -16608 -21467 -13384 -6985 -5804 -8048
13661h048j3515L499Q700n89l217M680L94J105k700l85j434N844o13l230K506
$$ -8048 -21563 -18064 -9364 -9953 -13170 -8490 -8096 -6991 -9691 -10076 -11510 -5666 -6279 -9509 -7003
13646g003p746k545N584L496j170N479l253k006k8q577n988N307M346j603M481
$$ -7003 -14749 -17294 -11710 -8214 -9384 -3905 -7158 -9164 -9192 -17769 -23757 -18450 -14104 -15707 -11226
13631a1226R504M868m056l350n352M67q08O018M979N724J885n940j3584p994n148
$$ -11226 -1722 3146 -910 -4260 -9612 -9145 -9953 -3935 1044 6768 8653 2713 -10871 -18865 -24013
13616b4013M271N847r77O844P913Q144q971p413r222J342K958L890L069j963j704
$$ -24013 -19742 -13895 -14872 -8028 -115 8029 -942 -8355 -17577 -16235 -13277 -9387 -6318 -8281 -9985
13601i985l312M926L997q05j153q229l897J1720N001M596o62J277o200L084J158
$$ -9985 -13297 -8371 -4374 -5179 -6332 -14561 -18458 -6738 -1737 2859 2197 3474 -2726 358 1516
13586A516q184k308J986N416m895q674l642K400N768L111Q328p880j2016l143
$$ 1516 -6668 -8976 -6990 -1574 -6469 -15143 -18785 -16385 -10617 -7506 822 -7058 -19074 -22217
13572b2217P582j884J0855J4123l58l509m62p36l792j317q81O716m678j0317o194
$$ -22217 -14635 -16519 -5664 8459 8101 4592 4130 3394 -398 -1715 -2596 4120 -558 -10875 -17069
13557a7069K506L23q364L561Q789O47O036j73N654R86p361r460J072J1349N108
$$ -17069 -14563 -14240 -22604 -19043 -10254 -9607 -3571 -3744 1910 2896 -4465 -13925 -12853 -1504 3604
13542C604j517M171L886o157j2864n520n041R307O613J1095L191q562j3814r621
$$ 3604 2087 6258 10144 3987 -8877 -14397 -19438 -10131 -3518 7577 10768 2206 -11608 -21229
13528b1229n696m470K132L50l691L685J5383N939p373M095k42k898j56j469K341
$$ -21229 -26925 -31395 -29263 -28913 -32604 -28919 -13536 -7597 -14970 -10875 -11117 -14015 -14171 -15640 -13299
13513a3299N844L858q229n536q028K045J3507Q065m142l690M060J813K46j896
$$ -13299 -7455 -3597 -11826 -17362 -25390 -23345 -9838 -1773 -5915 -9605 -5545 -3732 -3486 -5382
13499e382l228o834j954M696j952o247P813O139P103k688k029K026r071j3867
$$ -5382 -8610 -15444 -17398 -12702 -14654 -20901 -13088 -6949 154 -2534 -4563 -2537 -11608 -25475
13485b5475K480Q26O638K577M604M018M429K914P349j426r383j0295o302N773
$$ -25475 -22995 -22169 -15531 -12954 -8350 -4332 97 3011 10360 8934 -449 -10744 -17046 -11273
13471a1273M458k23J929L358M103r577k555k861l012j100P8K870K630Q258l719
$$ -11273 -6815 -7038 -5109 -1751 2352 -7225 -9780 -12641 -15653 -16753 -16675 -13805 -11175 -2917 -6636
13456f636o166o038L64J952n02L856l256j8004k783J3029J018K333J0679M61p395
$$ -6636 -12802 -18840 -18476 -16524 -17026 -13170 -16426 -34430 -37213 -24184 -23166 -20833 -10154 -9693 -17088
13441a7088k55k262J0062L055j771N218l67N091P655j4515n010K631k997m298
$$ -17088 -17343 -19605 -9543 -6488 -8259 -3041 -3408 1683 9338 -5177 -10187 -7556 -10553 -14851
13427a4851N76J6J392J1303K687r209J0376J2158Q02l604j2716j4113R252k6p41
$$ -14851 -14275 -14259 -12867 -1564 1123 -8086 2290 14448 15250 11646 -1070 -15183 -5931 -5957 -6698
13412f698k434K635l849j312K628P42O121K105M45k653p317J088OL580j202m136
$$ -6698 -9132 -6497 -10346 -11658 -9030 -8288 -2167 -62 383 -2270 -9587 -8499 -8493 -4913 -6115 -10251
13396a0251l342L455J204J830J301j0771o494K188O57K703J0157J1237k826r982
$$ -10251 -13593 -10138 -8934 -7104 -5803 -16574 -23068 -20880 -20223 -17520 -7363 3874 1048 -8934
13382h934k944K168r92o634M123N060o753J475J1719J0844l937j185k414j242
$$ -8934 -11878 -9710 -10702 -17336 -13213 -8153 -14906 -13431 -1712 9132 5195 4010 1596 354
13368C54n450p22J0271J2463N495m956p994j6681m31J354J0330Q72R958L577M413
$$ 354 -5096 -5818 4453 16916 22411 17455 9461 -7220 -7651 -6297 4033 4905 14863 18440 22853
13353B2853j87o569J48L427M490P93n197m681m119K403m83J230o2K64M136q248
$$ 22853 22666 16097 16245 19672 24162 24955 19758 15077 10958 13361 12878 14108 14046 14310 18446 10198
13337A0198P342L802k857q373P97K242O642P343n413O739k944R38q17j522M066
$$ 10198 17540 21342 18485 10112 10909 13151 19793 27136 21723 28462 25518 26456 25639 24117 28183
13322B8183L249R88R61O86q89J1349K980j0004o778k397p2n559K562L376L53M452
$$ 28183 31432 32420 33381 34067 33178 44527 47507 37503 30725 28328 28256 22697 25259 28635 28988 33440
13306C3440L097m339P662N088m993L404p621p358l701l926n33j103M199P184l799
$$ 33440 36537 32198 39860 44948 39955 43359 35738 28380 24679 20753 20220 19117 23316 30500 26701
13291B6701l61J0785m05o028j120p089K243J2153k97K571J665J593L293J045k766
$$ 26701 26340 37125 36720 30692 29572 22483 24726 36879 36582 39153 40818 42411 45704 46749 43983
13276D3983K850L591M341J467J407l670j2833o043M94L469k296j1887k250J679
$$ 43983 46833 50424 54765 56232 57639 53969 41136 35093 35587 39056 36760 24873 22623 24302
13262B4302j18P312J0729o048k539l863k793M498J883j608J57j0140k458J1096
$$ 24302 24184 31496 42225 36177 33638 29775 26982 31480 33363 31755 31912 21772 19314 30410
13248C0410R000M057j933r189J202Q799m370o226N152K420j0981n029q14M675
$$ 30410 39410 43467 41534 32345 33547 42346 37976 31750 36902 39322 28341 23312 22498 27173
13234B7173J740N053J1188p242j2930L941J8339n820j4756L140K0379Q418r520
$$ 27173 28913 33966 45154 37912 24982 28923 47262 41442 26686 29826 50205 58623 49103
13221D9103N87K595j0071n435M265K604n523o663N519P525m092r93r535j1627
$$ 49103 49690 52285 42214 36779 41044 43648 38125 31462 36981 44506 40414 39421 29886 18259
13207A8259j281N603J302R080L123K522l975q418k028J491n271k373J0698k665
$$ 18259 16978 22581 23883 32963 36086 38608 34633 26215 24187 25678 20407 18034 28732 26067
13193B6067r142l580Q238O383J384j2965p978O111J412K450j3257p113K760M01
$$ 26067 16925 13345 21583 27966 29350 16385 8407 14518 15930 18380 5123 -1990 770 1171
13179A171P10k615J948r477P45J4853P850k942n935O727O13K363q838J006N21
$$ 1171 1881 -734 1214 -8263 -7518 7335 15185 12243 6308 13035 13648 16011 7173 8179 8700
13164H700R451K969K006Q485l230l745o943j572o924r404q52L565K933Q292Q192
$$ 8700 18151 21120 23126 31611 28381 24636 17693 16121 9197 -207 -1059 2506 5439 13731 21923
13149B1923P506K179q521n383R90q982O674j52l465j654K63L904J73k752O96n10
$$ 21923 29429 31608 23087 17704 18694 9712 16386 16234 12769 11115 11378 15282 15455 12703 13399 12889
13133A2889j709M304Q569N724o624j693J64P030J533q681q776k243N025J2724
$$ 12889 11180 15484 24053 29777 23153 21460 21624 28654 30187 21506 12730 10487 15512 28236
13119B8236J2210j0132r750L264l927J179m626L102M110o60N091J686K384N581
$$ 28236 40446 30314 20564 23828 19901 21080 16454 19556 23666 23006 28097 29783 32167 37748
13105C7748j0358n435k2O571K333k289j2175J846P010M466L722J642J0203n354
$$ 37748 27390 21955 21933 28504 30837 28548 16373 18219 25229 29695 33417 35059 45262 39908
13091C9908l553o317k355N225J599o227Q996N851K021l430p200r526P984k638
$$ 39908 36355 30038 27683 32908 34507 28280 37276 43127 45148 41718 34518 24992 32976 30338
13077C0338j1133k12P692O199M877Q18J571J0844p49J550K433r454l200r101l835
$$ 30338 19205 18993 26685 32884 37761 38579 40150 50994 50245 51795 54228 44774 41574 32473 28638
13062B8638P38K601J937M928P426P635J1041l603j0813r258J469J0694M928r352
$$ 28638 29376 31977 33914 38842 46268 53903 64944 61341 50528 41270 42739 53433 58361 49009
13048D9009K273O261l790l206J756Q219j466m628M8N896M561k045p721L283K026
$$ 49009 51282 57543 53753 50547 52303 60522 59056 54428 54476 60372 64933 62888 55167 58450 60476
13033F0476J0347O871O17r379m267m115o609Q591R97n343l788n959N585L962J881
$$ 60476 70823 77694 78311 68932 64665 60550 53941 62532 63529 58186 54398 48439 54024 57986 59867
13018E9867P224J423m738n370J881Q884P257m781M209M17M068P256J294J454M572
$$ 59867 67091 68514 63776 58406 60287 69171 76428 71647 75856 76273 80341 87597 88891 90345 94917
13003I4917p58N071J2091M343m152j802k092o183k701J06J706K88o83j337o329
$$ 94917 94159 99230 111321 115664 111512 109710 107618 101435 98734 98840 100546 100834 100151 98814 92485
12988I2485R195O025j132J354J195J415J4213J7155J0070L180q568n521j964L77
$$ 92485 101680 107705 106573 107927 109122 110537 124750 141905 151975 155155 146587 141066 139102 139479
12974A39479j0441N753J1418K86K626M020P377J4171J0964m070M822J8847P948
$$ 139479 129038 134791 146209 146495 149121 153141 160518 174689 185653 181583 186405 205252 213200
12961B13200J5855K278l722j0100Q021J7526J2377Q681L491R96M743R468N947
$$ 213200 229055 231333 227611 217511 225532 243058 255435 264116 267607 268603 273346 282814 288761
12948B88761k469M145Q594P116R205Q098J9783K1355J0304J7084J4607p829N224
$$ 288761 286292 290437 299031 306147 315352 323450 343233 364588 374892 391976 406583 398754 403978
12935D03978K4501J8945J1706J5247K2280J3785P519K7003L0311J9513K5401K0233
$$ 403978 428479 447424 459130 474377 496657 510442 517961 544964 575275 594788 620189 640422
12923F40422K3021K2205M4464L8799L7793M3259M1862L5224M0716M2678N4060
$$ 640422 663443 685648 730112 768911 806704 849963 891825 927049 967765 1010443 1064503
12912A064503N8056O0558N8700P0380P8023Q4404Q0835Q1047R1328J01787J20440
$$ 1064503 1122559 1183117 1241817 1312197 1390220 1474624 1555459 1636506 1727834 1829621 1950061
12901A950061J18303J25142J34086J30286J39509J50193J62105J56985J57227
$$ 1950061 2068364 2193506 2327592 2457878 2597387 2747580 2909685 3066670 3223897
12892C223897J58074J56476J57565J64472J56796J45949J43756J41955J42145
$$ 3223897 3381971 3538447 3696012 3860484 4017280 4163229 4306985 4448940 4591085
12883D591085J40383J37415J26838J22688J36092J23887J16530J24522J28225
$$ 4591085 4731468 4868883 4995721 5118409 5254501 5378388 5494918 5619440 5747665
12874E747665J32469J28800J19986J05235J16157J17331J16175R9240R2409O8021
$$ 5747665 5880134 6008934 6128920 6234155 6350312 6467643 6583818 6683058 6775467 6843488
12864F843488M9799M0073K6533R202k0763l3929n5090n6308o6474p7111o8296
$$ 6843488 6893287 6933360 6959893 6969095 6948332 6914403 6859313 6803005 6736531 6659420 6591124
12853F591124q4019p9174o9434r2121r4643q1275q5389q7498r2420q9003p8267
$$ 6591124 6507105 6427931 6358497 6266376 6171733 6090458 6005069 5917571 5825151 5736148 5657881
12842E657881r3124q8254j00108j01522j13270j21321j14029j11838j14943j16969
$$ 5657881 5564757 5476503 5376395 5274873 5161603 5040282 4926253 4814415 4699472 4582503
12832D582503j18942j07207j10318j12376r4893q4535p1835n6911n7018l5830
$$ 4582503 4463561 4356354 4246036 4133660 4038767 3954232 3882397 3825486 3768468 3732638
12822C732638k0054q180K833J6923L9215M9734O2587O7753Q2820Q8693J14644
$$ 3732638 3712584 3704404 3707237 3724160 3763375 3813109 3875696 3943449 4026269 4114962 4229606
12811D229606J20800J27063J22200J20958J30249J33791J36107J25764J29041
$$ 4229606 4350406 4477469 4599669 4720627 4850876 4984667 5120774 5246538 5375579
12802E375579J25306J11935J06267J07105J03121J04491J02204R9821J00910J00468
$$ 5375579 5500885 5612820 5719087 5826192 5929313 6033804 6136008 6235829 6336739 6437207
12792F437207J10717J14392J11453J01941J01474J07050J06272R7131P7258O5948
$$ 6437207 6547924 6662316 6773769 6875710 6977184 7084234 7190506 7287637 7364895 7430843
12782G430843N0878M0247J9314J2483q860l0972m9299m8294p4620q5516r7700
$$ 7430843 7481721 7521968 7541282 7553765 7544905 7513933 7464634 7416340 7341720 7256204 7158504
12771G158504j15096j23829j18610j24940j21043j20682j23718j26174j20240
$$ 7158504 7043408 6919579 6800969 6676029 6554986 6434304 6310586 6184412 6064172
12762F064172j24145j30606j38270j37778j42638j47778j53303j52667j60779
$$ 6064172 5940027 5809421 5671151 5533373 5390735 5242957 5089654 4936987 4776208
12753D776208j58746j54415j73509j78084j72026j75948j76834j64884j56700
$$ 4776208 4617462 4463047 4289538 4111454 3939428 3763480 3586646 3421762 3265062
12744C265062j63942j63144j59360j44131j38077j28204j20573j11588j04713
$$ 3265062 3101120 2937976 2778616 2634485 2496408 2368204 2247631 2136043 2031330
12735B031330r9973r3990q8930q5602p2983o9365p3108p1497o3963n5156m5206
$$ 2031330 1931357 1837367 1748437 1662835 1589852 1520487 1447379 1375882 1311919 1256763 1211557
12724A211557m7425m6056m4039m0116m5487l9495k7539m2009l4464l0231l3153
$$ 1211557 1164132 1118076 1074037 1033921 988434 948939 921400 879391 844927 814696 781543
12713G81543l2833l4315k2540p291j9007j8378k8796j9959j9104j9298j6168j8206
$$ 781543 748710 714395 691855 684564 665557 647179 618383 598424 579320 560022 543854 525648
12701E25648j4944j9962j4497j6474j9129j3293p639p658j4175j3142r95q504
$$ 525648 510704 490742 476245 459771 440642 427349 419710 412052 397877 384735 383740 375236
12689C75236n006q208q519k196n058N676j2190k1364j2048k345O151N99r077m028
$$ 375236 370230 362022 353503 351307 346249 351925 339735 318371 306323 303978 310129 310728 301651 297623
12675B97623l790l444k749j5641j1984j104J255j0730o422o292r467M518R250
$$ 297623 293833 290389 287640 271999 260015 258911 260166 249436 243014 236722 227255 231773 241023
12662B41023j2147o604k257k695q623j7010k438J9067Q07l164j5638l222l119
$$ 241023 228876 222272 220015 217320 208697 191687 189249 208316 209123 205959 190321 187099 183980
12649A83980n171p838j2127J553N709j369n427K865j346p129m079Q72J542N755
$$ 183980 178809 170971 158844 160397 166106 164737 159310 162175 160829 153700 149621 150493 152035 157790
12635A57790l048q360n010o785n850O921R557p5k61n927q420p896n54Q763o144
$$ 157790 154742 146382 141372 134587 128737 135658 145215 145140 144879 138952 130532 122636 122082 130845 124701
12620A24701j9300j123Q442Q035K859m231l807p30J84p612o419L917n620L005
$$ 124701 105401 104278 112720 120755 123614 119383 115576 114846 115030 107418 100999 104916 99296 102301
12606A02301q341n084j737J563M087m785j1281m828J4473m963k749P982J09r537
$$ 102301 93960 88876 87139 88702 92789 88004 76723 71895 86368 81405 78656 86638 86747 77210
12592G7210m181L397Q82L02P454L411n569j1732o514J261R054J140l495j850m193
$$ 77210 73029 76426 77308 77610 85064 88475 82906 71174 64660 65921 74975 76115 72620 70770 66577
12577F6577j2011n875N543N538M069K699k245o314k421M642j648l528m998n498
$$ 66577 54566 48691 54234 59772 63841 66540 64295 57981 55560 60202 58554 55026 50028 44530
12563D4530M155P083j735l097J612Q47P028L041o393k81l943l805p665o268J418
$$ 44530 48685 55768 54033 50936 52548 53395 60423 63464 57071 56790 52847 49042 41377 35109 36527
12548C6527J675K324P391o599q357q371nN530m518l546m837Q674N254J10k879
$$ 36527 38202 40526 47917 41318 32961 24590 24585 30115 25597 22051 17214 25888 31142 31252 28373
12533B8373K121k206j4573L696N220j966P948M787M66l468P922K120M819k204
$$ 28373 30494 28288 13715 17411 22631 20665 28613 33400 33866 30398 38320 40440 45259 43055
12519D3055m617L183j123j1850n454J1400J916o964l038O165J61k789r112o802
$$ 43055 38438 41621 40498 28648 23194 34594 36510 29546 26508 32673 32834 30045 20933 14131
12505A4131J192K633L116R554K928l965j735N946o222L648N256K082K608j1188
$$ 14131 15323 17956 21072 30626 33554 29589 27854 33800 27578 31226 36482 38564 41172 29984
12491B9984j3317O645P579M445o808l567K469J0879l118o875k856j315n465N084
$$ 29984 16667 23312 30891 35336 28528 24961 27430 38309 35191 28316 25460 24145 18680 23764
12477B3764n41J617M512J083n17p963J4780O617k120Q018K992j447m618j1068
$$ 23764 23223 24840 29352 30435 29918 21955 36735 43352 41232 49250 52242 50795 46177 35109
12463C5109q118P403q22J371M100Q325q428m591K914m690j1029p565J796M048
$$ 35109 26991 34394 33572 34943 39043 47368 38940 34349 37263 32573 21544 13979 15775 19823
12449A9823N956O969K823m125o732J786L101J1090M039p978k029J2067O735j917
$$ 19823 25779 32748 35571 31446 24714 26500 29601 40691 44730 36752 34723 46790 53525 51608
12435E1608j4769q240Q74J31M188L480j174Q070J230P252l20j5285n104K835N457
$$ 51608 36839 28599 29473 29604 33792 37272 36098 44168 45398 52650 52330 37045 31941 34776 40233
12420D0233o179q82K708M635q452j243N032L258r734L983N605k298o246p268L573
$$ 40233 34054 33172 35880 40515 32063 30820 35852 39110 29376 33359 38964 36666 30420 23152 26725
12405B6725Q623J0078K08M623k069r639r531n544k638M701J4459M93K114k546
$$ 26725 35348 45426 45634 50257 48188 38549 29018 23474 20836 25537 39996 40489 42603 40057
12391D0057N519N490j0612M53L768l818n729j327K906M769o441j0023r851n65
$$ 40057 45576 51066 40454 40907 44675 40857 35128 33801 36707 41476 35035 25012 15161 14596
12377A4596j492l306L756O537J863j94j932k410J2429m5P69J608m716q563J934
$$ 14596 13104 9798 13554 20091 21954 21760 19828 17418 29847 29802 30571 32179 27463 18900 20834
12362B0834O241R679N777M237M278m757J184K676K89m008l561Q701k508j1584
$$ 20834 27075 36754 42531 46768 51046 46289 47473 50149 50438 46430 42869 51570 49062 37478
12348C7478n253M211N013j407n748p774J243J4913j50L457j901l089J1471l771
$$ 37478 32225 36436 41449 40042 34294 26520 27763 42676 42526 45983 44082 40993 52464 48693
12334D8693L404l253L847j421n667m702L438L498L950p130l80o772N460J0459
$$ 48693 52097 48844 52691 51270 45603 40901 44339 47837 51787 44657 44277 37505 42965 53424
12320E3424m46o111m854r783n17J353R79L439J3067K356o66n868m395J865r095
$$ 53424 52978 46867 42013 32230 31713 33066 34045 37484 50551 52907 52241 46373 41978 43843 34748
12305C4748o978M081L393l70l951n271j755k542l362n25j962K279l693l572M7
$$ 34748 27770 31851 35244 34874 30923 25652 23897 21355 17993 17468 15506 17785 14092 10520 10567
12290A0567q01M527N534N017p298l512p680k47N403M734J998o620o350M42P020
$$ 10567 9766 14293 19827 24844 17546 14034 6354 6107 11510 16244 18242 11622 5272 5714 12734
12275A2734m506j535k815L621L911m423q248L23R02o269l712j185O111M347L082
$$ 12734 8228 6693 3878 7499 11410 6987 -1261 -938 -36 -6305 -10017 -11202 -5091 -744 2338
12260B338L284l620L751L06l215n417j0857L000P325J4028j040o961P091Q697
$$ 2338 5622 2002 5753 6059 2844 -2573 -13430 -10430 -3105 10923 9883 2922 10013 18710
12246A8710J097P144J546j3151m416O023K692j2783l382k180k931P373K137j3119
$$ 18710 19807 26951 28497 15346 10930 16953 19645 6862 3480 1300 -1631 5742 7879 -5240
12232e240l867O709M26o65P073J51K057J262N880J89j3391o245o823J0653K749
$$ -5240 -9107 -2398 -1972 -2637 4436 4587 6644 7906 13786 13975 584 -5661 -12484 -1831 918
12217I18o546j070j466m203O268J8864O737k288q89L431J823q29l927j518M926
$$ 918 -5628 -6698 -8164 -12367 -6099 12765 19502 17214 16325 19756 21579 20750 16823 15305 20231
12202B0231j0267j0449n414NO85j330J0854l971l359L784n9N897k096Q04M495
$$ 20231 9964 -485 -5899 -5894 -5209 -6539 4315 344 -3015 769 710 6607 4511 5315 9810
12187I810j906r3o557n215p917M446R934K577j145O902r654m047P093P598J864
$$ 9810 7904 7811 1254 -3961 -11878 -7432 2502 5079 3934 10836 1182 -2865 4228 11826 13690
12172A3690q484R785J0907L382k538k1714l947K167P487J109l504n627L329L330
$$ 13690 5206 14991 25898 29280 26742 5028 1081 3248 10735 11844 8340 2713 6042 9372
12158I372R21j417p49k776n475p550p229M087Q882j243K635N197J476J508M945
$$ 9372 10293 8876 8127 5351 -124 -7674 -14903 -10816 -1934 -3177 -542 4655 6131 7639 12584
12143A2584N74q888M507n310M300m418L666J951p682m265J378L241N830J0181
$$ 12584 13158 4270 8777 3467 7767 3349 7015 8966 1284 -2981 -1603 1638 7468 17649
12129A7649J666n800m931n55P22l49P65P763j816o115K848k181L797R935P598
$$ 17649 19315 13515 8584 8029 8751 8402 9167 16930 15114 8999 11847 9666 13463 23398 30996
12114C0996J270j114k249R76n200O417J1949K391k145j1161j8254j2196m942l345
$$ 30996 32266 31152 28903 29879 24679 31096 43045 45436 43291 32130 13876 1680 -3262 -6607
12100f607O222p873n126j711l20J3011J2630n792j4126j2434J136J0571k892P598
$$ -6607 -385 -8258 -13384 -15095 -15415 -2404 10226 4434 -9692 -22126 -20990 -10419 -13311 -5713
12086e713J2233P501Q96j1989L17J4582K507q658M975n839l410n10j052N786P881
$$ -5713 6520 14021 14917 2928 3245 17827 20334 11676 16651 10812 7402 6892 5840 11626 19507
12071A9507J237m674o650P14p162q803j566j76O138P548K321k990N546N282Q575
$$ 19507 20744 16070 9420 10134 2972 -5831 -7397 -7573 -1435 6113 8434 5444 10990 16272 24847
12056B4847j1809k3882J412J1458M194M238k18P566N667L87M770K928k622K993
$$ 24847 13038 -10844 -9432 2026 6220 10458 10240 17806 23473 23860 28630 31558 28936 31929
12042C1929o522l106m399l998k775r590N71k114n437r482M411P904j240R444K831
$$ 31929 25407 22301 17902 13904 11129 1539 2110 -4 -5441 -14923 -10512 -2608 -3848 5596 8427
12027H427j50j317m786m966j173Q939N824j885l096R122N072K709L757j1448p420
$$ 8427 8277 6960 2174 -2792 -3965 4974 10798 8913 5817 14939 20011 22720 26477 15029 7609
12012G609j548j1851P35J0259P004k796r855p486K134M867P290L230Q008M848
$$ 7609 6061 -5790 -5055 5204 12208 9412 -443 -7929 -5795 -928 6362 9592 17600 22448
11998B2448M676K546m073L195L832k109n097J287l413J638Q658j35O025M885N208
$$ 22448 27124 29670 25597 28792 32624 30515 25418 26705 23292 24930 33588 33453 39478 44363 49571
11983D9571J4024N39l869J142N283L240O424J1733J87l746L356N593P451J1698
$$ 49571 63595 64134 60265 61407 66690 69930 76354 88087 88274 84528 87884 93477 100928 112626
11969A12626R536J461J2653J0716l774q555J288q284j1696j1199r262j8354r654
$$ 112626 122162 123623 136276 146992 143218 134663 135951 127667 115971 104772 95510 77156 67502
11956F7502k1974j3115k4575j7523k4676l1529j6134P896L0162L3290M4121N4748
$$ 67502 45528 32413 7838 -9685 -34361 -65890 -82024 -74128 -43966 -10676 33445 88193
11944H8193O1020O0228N6450N5877N1438M5580L6888L9994L2542L9677M7483M9560
$$ 88193 149213 209441 265891 321768 373206 418786 455674 495668 528210 567887 615370 664930
11932F64930O7600P8165R3470J18985J51501J92498K25672K80743L71221M88156
$$ 664930 732530 810695 904165 1023150 1174651 1367149 1592821 1873564 2244785 2732941
11922B732941O60566R30781J328468J992663L050917M656049O472820O139270
$$ 2732941 3393507 4324288 5652756 7645419 10696336 15352385 21825205 27964475
11914B7964475J579727k595454l519125l514713l970839l965613l098548k120342
$$ 27964475 29544202 26948748 23429623 19914910 15944071 11978458 8879910 6759568
11906F759568j433417r95106p34802n47261m10198l29727k68436k26742j96946
$$ 6759568 5326151 4331045 3596243 3048982 2638784 2309057 2040621 1813879 1616933
11897A616933j59534j40485j24886j18206r9614q4212o5455o7745n3246l1416
$$ 1616933 1457399 1316914 1192028 1073822 974208 889996 824541 756796 703550 672134
11887F72134j4709o226l163K4651M6799M7936N1404L3383Q981j6110k7758l9382
$$ 672134 657425 651199 648036 672687 719486 767422 818826 852209 861190 845080 817322 777940
11875G77940n9575n2458m9742n7760o4292n5269n4886n6279m7747l0644l5452
$$ 777940 718365 665907 616165 558405 494113 438844 383958 327679 279932 249288 213836
11864B13836l4882l4466k0799j1800k0742j8731j6125p356j6456N95Q098Q668
$$ 213836 178954 144488 123689 111889 91147 72416 56291 48935 32479 33074 41172 49840
11852D9840Q041O803q388K131J8547J1514J0948P679m013M833N144K195M912p356
$$ 49840 57881 64684 56296 58427 76974 88488 99436 107115 103102 107935 113079 115274 120186 112830
11838A12830q236j0351j7224o667L845M736j335n878j2165n33L737q807q134l492
$$ 112830 104594 94243 77019 70352 74197 78933 77598 71720 59555 59022 62759 53952 45818 42326
11824D2326m317k489o32M557k260L668J0069r258j0494K723Q631n928j779O848
$$ 42326 38009 35520 34888 39445 37185 40853 50922 41664 31170 33893 42524 36596 34817 41665
11810D1665K352o241l356R640J2010p091q613P913P757J94j016j707j0561r117
$$ 41665 44017 37776 34420 44060 56070 48979 40366 48279 56036 56230 55214 53507 42946 33829
11796C3829l4L016P988N780l009j098P841O287J946l293j641o580r676m481j496
$$ 33829 33795 36811 44799 50579 47570 46472 54313 60600 62546 59253 57612 51032 41356 36875 35379
11781C5379q107j367k69J913j0q826k707P350r60J162L055J2178J2330k060r024
$$ 35379 27272 25905 25636 27549 27539 18713 16006 23356 22396 23558 26613 38791 51121 49061 40037
11766D0037k249j773L57o3j1677M692M569P292J1560M132k0130j0952L760P83
$$ 40037 37788 36015 36372 36309 24632 29324 33893 41185 52745 56877 36747 25795 29555 30338
11752C0338O359K852l913o021l077n127p811N380M202p3M098J1855M229P75r232
$$ 30338 36697 39549 35636 29615 26538 21411 13600 18980 23182 23109 27207 39062 43291 44066 34834
11737C4834q327L161N646o195m287M782l106K318p75K126L439l533N862l416j4703
$$ 34834 26507 29668 35314 29119 24832 29614 26508 28826 28051 30177 33616 30083 35945 32529 17826
11722A7826j6530o434n132j0039J1860L883o12J144O901J75L608r77n80R71K232
$$ 17826 1296 -5138 -10270 -20309 -8449 -4566 -5178 -4034 2867 3042 6650 5673 5093 6064 8296
11707H296K469o224j88L597l652l34Q008k742o936n675o361l02J950Q788J2415
$$ 8296 10765 4541 4353 7950 4298 3964 11972 9230 2294 -3381 -9742 -10044 -8094 694 13109
11692A3109m616j501m431j557K17L772j359n023o63m747l116N318l812m489o62
$$ 13109 8493 6992 2561 1004 1221 4993 3634 -1389 -2052 -6799 -9915 -4597 -8409 -12898 -13560
11677a3560O748K837o78O332M664j046N4k26P360j2493q629J0860P444O181L567
$$ -13560 -6812 -3975 -4653 1679 6343 5297 5351 5125 12485 -8 -8637 2223 9667 15848 19415
11662A9415Q456k73n282n582p247k880k340P499m2N430k406j0569l42k579j116
$$ 19415 27871 27598 22316 16734 9487 6607 4267 11766 11724 17154 14748 4179 3837 1258 142
11647A42Q569Q471m170l234j017l597r467l547R313R182L760j450N300n391j388
$$ 142 8711 17182 13012 9778 8761 5164 -4303 -7850 1463 10645 14405 12955 18255 12864 11476
11632A1476J249L275j888L235o231L661J759J802q052r840R27j269P340O308P404
$$ 11476 12725 16000 14112 17347 11116 14777 16536 18338 10286 446 1373 104 7444 13752 21156
11617B1156L234o684J0609K609j195n262p02j0661k994p28k327m263Q198M872
$$ 21156 24390 17706 28315 30924 29729 24467 23765 13104 10110 9382 7055 2792 10990 15862
11603A5862L593l312n300q183j028r05p226N559N884N859L789J156l489m538K969
$$ 15862 19455 16143 10843 2660 1632 727 -6499 -940 4944 10803 14592 15748 12259 7721 10690
11588A0690j376r80J911M74j0074l632K198P399L359p58L880R926J194j4434j038
$$ 10690 9314 8334 10245 10719 645 -2987 -789 6610 9969 9211 13091 23017 24211 9777 8739
11573H739M759m278L192P9o5L972l605J490L613J436K273k05k545r165j0284n188
$$ 8739 13498 9220 12412 12491 12426 16398 12793 14283 17896 19332 21605 21400 18855 9690 -594 -5782
11557e782N641J072P010R241J442k952R77k282j3064J928K788k094J454p396L65
$$ -5782 -141 931 7941 17182 18624 15672 16649 14367 1303 3231 6019 3925 5379 -2017 -1652
11542a652M026J7559Q719j1586j0093N528K975k345N09K978M099j568M280Jq297
$$ -1652 2374 19933 28652 17066 6973 12501 15476 13131 13640 16618 20717 19149 23429 23430 15133
11527A5133o070M102j0273j767j670R869l870p571P728R308J115n967m135k0487
$$ 15133 9063 13165 2892 1125 -545 9324 5454 -2117 5611 14919 16034 10067 5932 -14555
11513a4555m48J2836J6711L317n033p735j112K168K405M849l824j089M121M434
$$ -14555 -15003 -2167 14544 17861 12828 5093 3981 6149 8554 13403 9579 8490 12611 17045
11499A7045p902p550L665n052N989K581J964o558p120K691O183N197N119l767
$$ 17045 9143 1593 5258 206 6195 8776 10740 4182 -2938 -247 5936 11133 16252 12485
11485A2485O164K540l664p335m532Q33J4253J628j0019k155l678L991n330k749
$$ 12485 18649 21189 17525 10190 5658 6491 20744 22372 12353 10198 6520 10511 5181 2432
11471B432l193P586Q644L853Q129K2p098p347j0077M75J0002m137j372k168J1456
$$ 2432 -761 6825 15469 19322 27451 27473 20375 13028 2951 3426 13428 9291 7919 5751 17207
11456A7207N124J80m320p135p194L664k279M608M825J879J678L617k735K437K113
$$ 17207 22331 22511 18191 11056 3862 7526 5247 9855 14680 16559 18237 21854 19119 21556 23669
11441B3669L686L077o442l04J742J710m6n78j983k167l794n218j0220j2223N91
$$ 23669 27355 30432 23990 23686 25428 27138 27092 26514 24531 22364 18570 13352 3132 -9091 -8500
11426h500n054J3147J1668M91N893M217l051j968m35N80k304Q118P519k842q479
$$ -8500 -13554 -407 11261 11752 17645 21862 18811 16843 16408 16988 14684 22802 30321 27479 19000
11411A9000l331N054J926q59j636n796k443M954N319N40o939J245K892o146r67
$$ 19000 15669 20723 22649 21790 20154 14358 11915 16869 22188 22728 15789 17034 19926 13780 12813
11396A2813J1335N057M958O160j677O88o133k666o459L22M740R325J346j688p24
$$ 12813 24148 29205 34163 40323 38646 39334 33201 30535 24076 24398 29138 38463 39809 38121 37397
11381C7397l49j402n350k571r960k495J223Q031J5222R527j266l408m624k701
$$ 37397 37048 35646 30296 27725 17765 15270 16493 24524 39746 49273 48007 44599 39975 37274
11367C7274M540j8N236k408o85M58p702o951P484J609M997k933L40k782m171k56
$$ 37274 41814 41796 47032 44624 43939 44397 36695 29744 37228 38837 43834 40901 41241 38459 34288 34032
11351C4032m67M868K906N559J379r393j4493l025O73L902J2301k463j973R276
$$ 34032 33565 38433 41339 46898 48277 38884 24391 21366 22039 25941 38242 35779 33806 43082
11337D3082J2384j3017o825M592J0450P1m329Q704P774m618J473J010m545j4365
$$ 43082 55466 42449 35624 40216 50666 50737 46408 55112 62886 58268 59741 60751 56206 41841
11323D1841j474J0543J2695K985o181j5521K82N782j593j043n045L4O327m278
$$ 41841 40367 50910 63605 66590 60409 44888 45170 50952 49359 48316 43271 43305 49632 45354
11309D5354K215O619O896j131L512k905j3110m034J861l84k108O531R131N208
$$ 45354 47569 54188 61084 59953 63465 60560 47450 43416 45277 44893 42785 49316 58447 63655
11295F3655j1734p826J860Q09o003r43N021P762R230k569o762p130r33O365k616
$$ 63655 51921 44095 45955 46764 40761 39818 44839 52601 61831 59262 52500 45370 44437 50802 48186
11280D8186M661R395j177n741O953J491J19l764Q784P901K168l230j926L913l54
$$ 48186 52847 62242 61065 55324 62277 63768 63887 60123 68907 76808 78976 75746 73820 77733 77379
11265G7379q382O386Q1p55n017Q368K691l264o427J30P202n938j5049l896J2767
$$ 77379 68997 75383 75464 74709 69692 78060 80751 77487 71060 71190 78392 72454 57405 53509 66276
11250F6276O870j0689L492J9153K341n622O33K902m689M505K241O960m80l150
$$ 66276 73146 62457 65949 85102 87443 81821 82454 85356 80667 85172 87413 94373 93893 90743
11236I0743j061j1792q365k056L630K457j317P181M06Q125N23k217k63j2R24n148
$$ 90743 89682 77890 69525 67469 71099 73556 72239 79420 79826 87951 88474 86257 85994 85982 86906 81758
11220H1758j155N31Q217R349J482J609K64l963m963p08m137L378p815o220Q703
$$ 81758 80603 81134 89351 98700 100182 101791 102055 98092 93129 92421 88284 91662 83847 77627 86330
11205H6330P546L041O45O93r5O673O969M551m62K656N698L151l37K258L273k981
$$ 86330 93876 96917 97562 98255 98160 104833 111802 116353 115891 118547 124245 127396 127059 129317 132590 129609
11189A29609q823o48n096p619O67P893k009L251j097m284J232N189M859J1807
$$ 129609 120786 120138 115042 107423 108090 115983 113974 117225 116128 111844 113076 118265 123124 134931
11175A34931K347J209P120k46j533J852l058K313M409q89o736R026P620k071l436
$$ 134931 137278 138487 145607 145361 143828 145680 142622 144935 149344 148455 141719 150745 158365 156294 152858
11160A52858M959K668K651L625p736M57O031L78O014J991J1394R298N295m756
$$ 152858 157817 160485 163136 166761 159025 159482 165513 165891 171905 173896 185290 194588 199883 195127
11146A95127o272j968L746J3591Q530o102o564J3383L735J2136O150n064k659
$$ 195127 188855 186887 190633 204224 212754 206652 200088 213471 217206 229342 235492 230428 227769
11133B27769M524J86k128l651L779K0220R514l512o358K493J40O748k523O515
$$ 227769 232293 232479 230351 226700 230479 250699 260213 256701 250343 252836 252976 259724 257201 263716
11119B63716Q743P419K521L885Q947q80N322J0938O02p349k376R908K048J3671
$$ 263716 272459 279878 282399 286284 295231 294351 299673 310611 311213 303864 301488 311396 313444 327115
11105C27115K169O394Q919J729J855l092M675O225N369J0544R931J1142J1112
$$ 327115 329284 335678 344597 346326 348181 345089 349764 355989 361358 371902 381833 392975 404087
11092D04087R618j57J2520J597r216Q251J0137J2740J1931N412Q190O315k848
$$ 404087 413705 413548 426068 427665 418449 426700 436837 449577 461508 466920 475110 481425 478577
11079D78577Q747J0169J0608Q654J4381J3376P625O302J602M881J9039J4856J1986
$$ 478577 487324 497493 508101 516755 531136 544512 552137 558439 560041 564922 583961 598817 610803
11066F10803J6327J5607J3224J6113J3569Q788Q473J6991J3886J0747J2309J6383
$$ 610803 627130 642737 655961 672074 685643 694431 702904 719895 733781 744528 756837 773220
11054G73220J8751R693J9567J3519J4756J6642J8245J1115J7529K1113K8013K5489
$$ 773220 791971 801664 821231 834750 849506 866148 884393 895508 913037 934150 962163 987652
11042I87652K1228J7363J7661K1763J7549K8893L8614K1941K0156K3055J5659
$$ 987652 1008880 1026243 1043904 1065667 1083216 1112109 1150723 1172664 1192820 1215875 1231534
11031A231534K6212K7728K1242K5598M0972L6969L1871J8094J8880K6216K8751
$$ 1231534 1257746 1285474 1306716 1332314 1373286 1410255 1442126 1460220 1479100 1505316 1534067
11020A534067L3812M4117L8976K6492K8281M8113L7646L7803K8758M0271L6581
$$ 1534067 1567879 1611996 1650972 1677464 1705745 1753858 1791504 1829307 1858065 1898336 1934917
11009A934917L2866K5096L4360M6402M0491K7403K8651L9784L9227K5734K8655
$$ 1934917 1967783 1992879 2027239 2073641 2114132 2141535 2170186 2209970 2249197 2274931 2303586
10998B303586M2352L6237K3042L2975L1652L3513L1108K9050L6993L9368K8365
$$ 2303586 2345938 2382175 2405217 2438192 2469844 2503357 2534465 2563515 2600508 2639876 2668241
10987B668241K8109K1948J7967K1404K3271K7792L1517K9576J3301K2126K1250
$$ 2668241 2696350 2718298 2736265 2757669 2780940 2808732 2840249 2869825 2883126 2905252 2926502
10976B926502K5569K1309J6069J5227J9943K1599K2619J9877R852K0880K6310
$$ 2926502 2952071 2973380 2989449 3004676 3024619 3046218 3068837 3088714 3098566 3119446 3145756
10965C145756J5051J9471J2787J4894J1901J3758J9687J8029J6083J2940J0889
$$ 3145756 3160807 3180278 3193065 3207959 3219860 3233618 3253305 3271334 3287417 3300357 3311246
10954C311246K3587J9361Q450K76R817J9011K1648K5723K0642J8003J6852K3437
$$ 3311246 3334833 3354194 3362644 3362920 3372737 3391748 3413396 3439119 3459761 3477764 3494616 3518053
10942C518053L1274L2641K7679K7881K8042J5342K8926L2708K1965K9788K9579
$$ 3518053 3549327 3581968 3609647 3637528 3665570 3680912 3709838 3742546 3764511 3794299 3823878
10931C823878K8507L7509L1279L6108K9124L0206L4360L7160L2945K5508K8836
$$ 3823878 3852385 3889894 3921173 3957281 3986405 4016611 4050971 4088131 4121076 4146584 4175420
10920D175420L3241L4527K7462L1297K0852L0510L2392L8747L5077L5441K7135
$$ 4175420 4208661 4243188 4270650 4301947 4322799 4353309 4385701 4424448 4459525 4494966 4522101
10909D522101J9551J5451J9356J6380J8434J0149L597J3739J5533J3645M947J974
$$ 4522101 4541652 4557103 4576459 4592839 4611273 4621422 4625019 4638758 4654291 4667936 4672883 4674857
10897D674857k107j0354j3531J248l721j4296j0222j0816j2568r465j6455j7410
$$ 4674857 4672750 4662396 4648865 4650113 4646392 4632096 4621874 4611058 4598490 4589025 4572570 4555160
10885D555160k6956k2680j0514k7613l8381k2294k1119l7192m1970l1662k6222
$$ 4555160 4528204 4505524 4495010 4467397 4429016 4406722 4385603 4348411 4306441 4274779 4248557
10874D248557k7245k1632l1043k7789l8463l4752l7134l8567l1279l2348l5381
$$ 4248557 4221312 4199680 4168637 4140848 4102385 4067633 4030499 3991932 3960653 3928305 3892924
10863C892924l0811l1946l2134l5441k9773j5031k5123l0672k9640j5661k1466
$$ 3892924 3862113 3830167 3798033 3762592 3732819 3717788 3692665 3661993 3632353 3616692 3595226
10852C595226j4278k2167k9737k3899j9134j7866j4283j1604j5619k1964j518
$$ 3595226 3580948 3558781 3529044 3505145 3486011 3468145 3453862 3442258 3426639 3404675 3403157
10841C403157j0634j4053j1265k6626j7818p570j4284j6567j1581j6710j1778
$$ 3403157 3392523 3378470 3367205 3340579 3322761 3315191 3300907 3284340 3272759 3256049 3244271
10830C244271q972j8581k6220k1946j3510j0733j3221j6704j7288k1733j7732
$$ 3244271 3235299 3216718 3190498 3168552 3155042 3144309 3131088 3114384 3097096 3075363 3057631
10819C057631k4383k8774k4182j0641j8053k4303k2407k8999k5125k5517k0853
$$ 3057631 3033248 3004474 2980292 2969651 2951598 2927295 2904888 2875889 2850764 2825247 2804394
10808B804394l3121l7498k8915j9645l5364m1926l2951l8814l7302k9783l1999
$$ 2804394 2771273 2733775 2704860 2685215 2649851 2607925 2574974 2536160 2498858 2469075 2437076
10797B437076l1746l6439k4579m0411l9217l1562k9657l1501l6330k8795k7079
$$ 2437076 2405330 2368891 2344312 2303901 2264684 2233122 2203465 2171964 2135634 2106839 2079760
10786B079760l4719m1356m6502m4052m3815l5973k9121k8437l1853k5118k9989
$$ 2079760 2045041 2003685 1957183 1913131 1869316 1833343 1804222 1775785 1743932 1718814 1688825
10775A688825l5966l8759l6345k8657l4973l6900l8487l0592j8743j1167k3599
$$ 1688825 1652859 1614100 1577755 1549098 1514125 1477225 1438738 1408146 1389403 1378236 1354637
10764A354637k4733k7555k5118k5118k5306k0670k4812k7865l4173k4220k2255
$$ 1354637 1329904 1302349 1277231 1252113 1226807 1206137 1181325 1153460 1119287 1095067 1072812
10753A072812j1191k1780j7507j6937j9055j7813k5365j6067p715j3454j9699
$$ 1072812 1061621 1039841 1022334 1005397 986342 968529 943164 927097 919382 905928 886229
10742H86229j8783r863j1936j8821j7407j9144j4910j7944p713j0182j9421m359
$$ 886229 867446 857583 845647 826826 809419 790275 775365 757421 749708 739526 720105 715746
10730G15746p222j3622j5742j2293j1841j9741j6212l609n880j6966j5492j0015
$$ 715746 708524 694902 679160 666867 655026 635285 619073 615464 609584 592618 577126 567111
10718E67111n136n155Q143j6161j2438q225j958j1601m554p361q371j0896k678
$$ 567111 561975 556820 564963 548802 536364 528139 526181 514580 510026 502665 494294 483398 480720
10705D80720j079m145j9026j1730K231j940j8764L41q378p958l073l763k750q358
$$ 480720 479641 475496 456470 444740 446971 445031 426267 426608 418230 410272 407199 403436 400686 392328
10691C92328j2775j3534p794q082j3369l22P742l722r224j442J593j1597j2743
$$ 392328 379553 366019 358225 350143 336774 336452 344194 340472 331248 329806 331399 319802 307059
10678C07059k985N493l086j432K487n525J328M251r897q195o27j058K031L700
$$ 307059 304074 309567 306481 305049 307536 302011 303339 307590 297693 289498 288871 287813 289844 293544
10664B93544k533j1422m479Q599Q841j899o725j1493L882N316M592n213K884N87
$$ 293544 291011 279589 275110 283709 292550 290651 283926 272433 276315 281631 286223 281010 283894 284481
10650B84481L265m914j1062Q493Q122K709j3157m438k3J843K881k596r030J0146
$$ 284481 287746 282832 271770 280263 288385 291094 277937 273499 273476 275319 278200 275604 266574 276720
10636B76720P093Q054k310l216l874m803k480p18J0006J3640J7194K0521K2232
$$ 276720 283813 291867 289557 286341 282467 277664 275184 274466 284472 298112 315306 335827 358059
10623C58059K7518K0867K6688L1221K9523M4090M7594P0078R6824J41622J92013
$$ 358059 385577 406444 433132 464353 493876 537966 585560 655638 752462 894084 1086097
10612A086097K66364L50967M50663N59087O00922M93620K76803Q5480l095l7763
$$ 1086097 1352461 1703428 2154091 2713178 3314100 3807720 4084523 4170003 4166908 4129145
10602D129145k8240P4065K53785M97392P95379J085053J174381Q53810K68910
$$ 4129145 4100905 4174970 4428755 4926147 5721526 6806579 7980960 8834770 9103680
10593I103680j70108l71897m34025m05812k15264J26517N36132R97084J374181
$$ 9103680 8933572 8561675 8127650 7721838 7506574 7633091 8169223 9166307 10540488
10584A0540488J396014Q08246q0145o77309r27669j022331j007881p94350m27867
$$ 10540488 11936502 12744748 12664603 11987294 11059625 10037294 9029413 8235063 7807196
10575G807196j9883L72361O52473O42857K03848l77300p44250q82157q94776q40260
$$ 7807196 7787313 8159674 8812147 9455004 9658852 9281552 8537302 7655145 6760369 5920109
10565E920109o71330m34481j97188p034J08790Q5540r8559l12805m54249m98881
$$ 5920109 5248779 4814298 4617110 4610076 4718866 4804406 4705847 4393042 3938793 3439912
10555C439912n06091m73871m07598l28302k51904j85930j49604j23348r7427q0254
$$ 3439912 2933821 2459950 2052352 1724050 1472146 1286216 1136612 1013264 915837 835583
10545H35583p5125o5282n4260m4027m0150l7289l3554k1459k2002k5330l3550
$$ 835583 760458 695176 640916 596889 556739 519450 485896 464437 442435 417105 383555
10534C83555j9801j4950l2937k0551o082K968r999j2171k0217k0141j1562k383
$$ 383555 363754 348804 315867 295316 289234 292202 282203 270032 249815 229674 218112 215729
10522B15729o927m610j4700n122j0487j8124j3538M298Q483J862j473m608q639
$$ 215729 208802 204192 189492 184370 173883 155759 142221 146519 155002 156864 155391 150783 142144
10509A42144p975k420n069K994R537L493n911o800r969L936J0097K531o482k103
$$ 142144 134169 131749 126680 129674 139211 142704 136793 129993 120024 123960 134057 136588 130106 128003
10495A28003J649m475j421N390K23j747l184j072M736J169l971k95n448p624M050
$$ 128003 129652 125177 123756 129146 129369 127622 124438 123366 128102 129271 125300 125005 119557 111933 115983
10480A15983K905Q673m48m80J703j651k941j0096j457N616M270P02m812Q674k531
$$ 115983 118888 127561 127113 126633 128336 126685 123744 113648 112191 117807 122077 122779 117967 126641 124110
10465A24110j729j0151n277O790m425R372L320j0086q566J0247N284o030j113
$$ 124110 122381 112230 106953 113743 109318 118690 122010 111924 103358 113605 118889 112859 111746
10452A11746q66l061n64K537r030O915Q896m080m209K569Q46j0644K068K676j7
$$ 111746 110880 107819 107255 109792 100762 107677 116573 112493 108284 110853 111699 101055 103123 105799 105782
10437A05782l416l713q474j334o124o390k424J466K828Q215L715k688k172O824
$$ 105782 102366 98653 90179 88845 82721 76331 73907 75373 78201 86416 90131 87443 85271 92095
10423I2095M14l736l839k200l555l690J878l128j0023k689J5837J0361o186q253
$$ 92095 92509 88773 84934 82734 79179 75489 77367 74239 64216 61527 77364 87725 81539 73286
10409G3286l916q610j806k823l592o626Q19J5727J2403o184j5200l763J692Q613
$$ 73286 69370 60760 58954 56131 52539 45913 46732 62459 74862 68678 53478 49715 51407 60020
10395F0020P919J648k366k534r271o584N931n714p504r08N510M51m230k526P538
$$ 60020 67939 69587 67221 64687 55416 48832 54763 49049 41545 40637 46147 46598 42368 39842 47380
10380D7380P56k473P86r60j241k903J736o84N125o21K168N273l26n558m982r632
$$ 47380 48136 45663 46449 45489 44248 41345 43081 42397 47522 46901 49069 54342 54016 48458 43476 33844
10364C3844j1614J499K756Q960P378L437p402Q17p634l232P792L252M419K146
$$ 33844 22230 23729 26485 35445 42823 46260 38858 39675 32041 28809 36601 39853 44272 46418
10350D6418l992M113p248q42m051P456L533K569N36m048j0232l432J595J1752
$$ 46418 42426 46539 39291 38449 34398 41854 45387 47956 48492 44444 34212 30780 32375 44127
10336D4127K414j1727o510R242p495r92K041M571O479P906M861J136q349k153
$$ 44127 46541 34814 28304 37546 30051 29059 31100 35671 42150 50056 54917 56053 47704 45551
10322D5551j119k476N169J262Q647N680L041q506J763R20j2081r109p24L836m680
$$ 45551 44432 41956 47125 48387 57034 62714 65755 57249 59012 59932 47851 38742 38018 41854 37174
10307C7174k154J669R214N956l113n1M670Q620J3399j1771q208l004Q230L363
$$ 37174 35020 36689 45903 51859 48746 48695 53365 61985 75384 63613 55405 52401 60631 63994
10293F3994K385l813l278M480m068M519o098K706O037P368L738M101J3136O851
$$ 63994 66379 62566 59288 63768 59700 64219 58121 60827 66864 74232 77970 82071 95207 102058
10279A02058L621Q349J061L096J286P334N522J0268J2776J1022m06N515J0294
$$ 102058 105679 114028 115089 118185 119471 126805 132327 142595 155371 166393 165987 171502 181796
10266A81796J4884J9956K6808M4577M0866M2652O1279O5887P9090R0391J01340
$$ 181796 196680 216636 243444 288021 328887 371539 432818 498705 577795 668186 769526
10255G69526J07224J27379J27476J02291Q2356N6648K1680j9363n6439o1817n4142
$$ 769526 876750 1004129 1131605 1233896 1316252 1372900 1394580 1375217 1318778 1256961 1202819
10244A202819n9953n2607l0043k8019j1879J3400L2620M1848P4671J07344J40333
$$ 1202819 1142866 1090259 1060216 1032197 1020318 1033718 1066338 1108186 1182857 1290201 1430534
10233A430534J65372J93824K17095K32590K32813K11617J66482Q8792p048r1565
$$ 1430534 1595906 1789730 2006825 2239415 2472228 2683845 2850327 2939119 2932071 2840506
10223B840506j56114k02763k19262k10214j84348j70682j41580j12427q5084o7316
$$ 2840506 2684392 2481629 2262367 2052153 1867805 1697123 1555543 1443116 1358032 1290716
10213A290716m8745j2863J5774L2050O3708Q4507J02582J14839J20440J00134
$$ 1290716 1241971 1229108 1244882 1276932 1340640 1425147 1527729 1642568 1763008 1863142
10203A863142P6276M3777j5983p0052r1245j17515j26911j18321j13266q8568
$$ 1863142 1939418 1983195 1967212 1897160 1805915 1688400 1561489 1443168 1329902 1241334
10193A241334n5686l2661j6787J511K4348M6586Q2318J16353J51925J87750K27550
$$ 1241334 1185648 1152987 1136200 1137711 1162059 1208645 1290963 1407316 1559241 1746991 1974541
10182A974541K71063K91124L03874K75256K02640J22442J1501p0503j23002j65913
$$ 1974541 2245604 2536728 2840602 3115858 3318498 3440940 3452441 3381938 3258936 3093023
10172C093023j94087j87330j65623j26925r0597m9427l044M6889R8193J57699
$$ 3093023 2898936 2711606 2545983 2419058 2328461 2279034 2275990 2322879 2421072 2578771
10162B578771K18203K91667L72624M46671N21221N69060N83577N12144L67146
$$ 2578771 2796974 3088641 3461265 3907936 4429157 4998217 5581794 6093938 6461084
10153F461084J93400j9331k17053l64433m56904n04608n06505m78083m17556l41458
$$ 6461084 6654484 6635153 6418100 6053667 5596763 5092155 4585650 4107567 3690011 3348553
10143C348553k70490k08512j50882j08948n7626m315L9370J03636J43430J81055
$$ 3348553 3078063 2869551 2718669 2609721 2552095 2547780 2587150 2690786 2834216 3015271
10133C015271K09512K12446J91126J28826M7218m0097j30831k02311k48405k67873
$$ 3015271 3224783 3437229 3628355 3757181 3804399 3764302 3633471 3431160 3182755 2914882
10123B914882k79425k61977k46038k14614j74141j38111j00556o9949m6720k2690
$$ 2914882 2635457 2373480 2127442 1912828 1738687 1600576 1500020 1430071 1383351 1360661
10113A360661M0K8133N9192J05442J33166J53344J62503J54134J22618O5533Q274
$$ 1360661 1360701 1388834 1448026 1553468 1686634 1839978 2002481 2156615 2279233 2344766 2353040
10102B353040o0181j09675j35595j48131j47400j26644r7885o5540m0901j1706
$$ 2353040 2292859 2183184 2047589 1899458 1752058 1625414 1527529 1461989 1421088 1409382
10092A409382N498M4321Q2607J13610J48065J94109K40008K84463L05829L17559
$$ 1409382 1414880 1459201 1541808 1655418 1803483 1997592 2237600 2522063 2827892 3145451
10082C145451K86104K15144J11294r3j11413k12392k66759k97926k97279k79661
$$ 3145451 3431555 3646699 3757993 3757900 3646487 3434095 3167336 2869410 2572131 2292470
10072B292470k36652k01776j53174j21259q8915n4478l7069j6737J9612L8599
$$ 2292470 2055818 1854042 1700868 1579609 1490694 1436216 1399147 1382410 1402022 1440621
10062A440621N9547Q6740R4132R7442R0026N8413K3005j9382o7618j10242j43091
$$ 1440621 1500168 1586908 1681040 1778482 1868508 1926921 1949926 1930544 1862926 1752684 1609593
10051A609593j47094j45166j52176j33049j11285r5403q8819p3476o6935o0870
$$ 1609593 1462499 1317333 1165157 1032108 920823 825420 736601 663125 596190 535320
10041E35320m9625l1327l4647m1813k9523k8188k7441l3941k6368j0618r820j8757
$$ 535320 485695 454368 419721 377908 348385 320197 292756 258815 232447 221829 212009 193252
10029A93252j2172L560j1946j1204n155n168n695o633j463l827o205r293r299
$$ 193252 181080 184640 172694 161490 156335 151167 145472 138839 137376 133549 127344 118051 108752
10016A08752m473K25j591j905l379j044n166q869n753J255J0306K251j9300j1628
$$ 108752 104279 104504 102913 101008 97629 96585 91419 82550 76797 78052 88358 90609 71309 59681
10002E9681Q419O685L431k731J809l550j314j280m202k028K088K734j505q643
$$ 59681 68100 74785 78216 75485 77294 73744 72430 71150 66948 64920 67008 69742 68237 59594
9988E9594l904J382K326m817k811p943m822l99j913K669R554L468m703k745N711
$$ 59594 55690 57072 59398 54581 51770 43827 39005 38606 36693 39362 48916 52384 47681 44936 50647
9973E0647N05K032o139j0360o960J1622M544p110N03K775r23l561m727O051Q575
$$ 50647 51152 53184 47045 36685 29725 41347 45891 38781 39284 42059 41136 37575 32848 38899 47474
9958D7474P113n241q685j520L081J711o095p119N605P254p799j4497K554R789
$$ 47474 54587 49346 40661 39141 42222 43933 37838 30719 36324 43578 35779 21282 23836 33625
9944C3625L617L58N0J901p3J665L358p37p668O925P030j3050p154m075j529O909
$$ 33625 37242 37600 37650 39551 39478 41143 44501 43764 36096 43021 50051 37001 29847 25772 24243 31152
9928C1152k510m192N280j55k215j1218n24K425j694J0210J3185K987q471J00j789
$$ 31152 28642 24450 29730 29575 27360 16142 15618 18043 16349 26559 39744 42731 34260 34360 32571
9913C2571J396J936m444n009o744n194J994M007R46Q332J1n203p942L304J04k149
$$ 32571 33967 35903 31459 26450 19706 14512 16506 20513 21459 29791 29802 24599 16657 19961 20065 17916
9897A7916n282p156P665N682N812J064j0422o615m137L955P314L185N665k751
$$ 17916 12634 5478 13143 18825 24637 25701 15279 8664 4527 8482 15796 18981 24646 21895
9883B1895o517j578j812k999n550L236n80j0791K092Q142N394J2206M202n537
$$ 21895 15378 13800 11988 8989 3439 6675 6095 -4696 -2604 5538 10932 23138 27340 21803
9869B1803q624o288K834O381l802J004L526J301q779p480o088J0310n656J609
$$ 21803 13179 6891 9725 16106 12304 13308 16834 18135 9356 1876 -4212 6098 442 2051
9855B051P744M634K151k128J537Q895Q135J446R839N54m476j3001j5672p609o63
$$ 2051 9795 14429 16580 14452 15989 24884 33019 34465 44304 44858 40382 27381 11709 4100 3437
9840C437k428O431R473m77r21J3908M529r648k647P025j65L26j264j0227K738
$$ 3437 1009 7440 16913 16436 15515 29423 33952 24304 21657 28682 28517 28843 27579 17352 20090
9825B0090J8063R477j247l136M097Q779o230r773q829M017M989p306o915m843
$$ 20090 38153 47630 46383 43247 47344 56123 49893 40120 31291 35308 40297 32991 26076 21233
9811B1233O5K670J5908K346o643o262N802Q215p036q343m510N126K657j0817J352
$$ 21233 21298 23968 39876 42222 35579 29317 35119 43334 36298 27955 23445 28571 31228 20411 21763
9796B1763J4088L720q703m391L158J258J0200j1996o360K931o649K323n26o496
$$ 21763 35851 39571 30868 26477 29635 30893 41093 29097 22737 25668 19019 21342 20816 14320
9782A4320N074J3308P656p068o327l740k569j889m452J277R036O851M380J0606
$$ 14320 19394 32702 40358 33290 26963 23223 20654 18765 14313 15590 24626 31477 35857 46463
9768D6463J526m489k452k951k527j570P77K985L331n471q818j239M772J8626R073
$$ 46463 47989 43500 41048 38097 35570 34000 34777 37762 41093 35622 26804 25565 30337 48963 58036
9753E8036r232r733P662J1085l642n0l203J030j894m083o964N121l401j2345k087
$$ 58036 48804 39071 46733 57818 54176 54126 50923 51953 50059 45976 39012 44133 40732 28387 26300
9738B6300M879j094n96J0685R32k216l229J306M958J257L47O71q30k717M775L021
$$ 26300 31179 30085 29489 40174 41106 38890 35661 36967 41925 43182 43529 44200 43370 40653 45428 48449
9722D8449K796K537k767r177l567l522o539k241M582J1199M155j221j0156j031
$$ 48449 51245 53782 51015 41838 38271 34749 28210 25969 30551 41750 45905 44684 34528 33497
9708C3497M012L979N84M336M875J0987N464J082l247J0976n804j0730o445j6l627
$$ 33497 37509 41488 42072 46408 51283 62270 67734 68816 65569 76545 70741 60011 53566 53550 49923
9693D9923K314J947J1503m291l451p568L88Q653K814k46n304K468k884p353O85
$$ 49923 52237 54184 65687 61396 57945 50377 50765 59418 62232 61986 56682 59150 56266 48913 49598
9678D9598R404J2685K711l270k800j645M831J1832p805j4101k799M518k849m246
$$ 49598 59002 71687 74398 71128 68328 66683 71514 83346 75541 61440 58641 63159 60310 56064
9664E6064o367m824M414L810L084o205j4124O57O016N145o758l286M013N133r3
$$ 56064 49697 44873 49287 53097 56181 49976 35852 36509 42525 47670 40912 37626 41639 46772 46679
9649D6679M983r318m555l353J2006J3472J7193J760l752n031p906P06j711n154
$$ 46679 51662 42344 37789 34436 46442 59914 77107 78867 75115 70084 62178 62884 61173 56019
9635E6019j7154J694O377m802l880R925O909K530J754L032Q158K83k995j316M70
$$ 56019 38865 40559 46936 42134 38254 48179 55088 57618 59372 62404 70562 70845 67850 66534 67004
9620F7004P823k367k63j351o648P868M140K149J28j753n556N56k894M3l587N855
$$ 67004 74827 72460 72197 70846 64198 72066 76206 78355 78483 76730 71174 71730 68836 68879 65292 71147
9604G1147K122L148j964j4823K508J2562P206n449j052J271N985m856J142J647
$$ 71147 73269 76417 74453 59630 62138 74700 81906 76457 75405 76676 82661 77805 78947 80594
9590H0594q432o579k584j256K428P68N840O738N316q408r343o672M832J913R767
$$ 80594 72162 65583 62999 61743 64171 64939 70779 77517 82833 74425 65082 58410 63242 65155 74922
9575G4922n8j3421k831M8l410n893r891P511l01o276j792k168k5Q636l123k02
$$ 74922 74864 61443 58612 58660 55250 49357 39466 46977 46676 40400 38608 36440 36415 45051 41928 41726
9559D1726r71j265j127J786K402j843m480O546m641r48R246L386j185J821L937
$$ 41726 40755 39490 38363 40149 42551 40708 36228 42774 38133 37185 46431 49817 48632 50453 54390
9544E4390L721o161j0051n954K308K616R3J098j8K945k185K656J825J2697j817
$$ 54390 58111 51950 41899 35945 38253 40869 40962 42060 42042 44987 42802 45458 47283 59980 58163
9529E8163l575P631l662j0024q212M340m989n198n82M455N59O431P86L220k547
$$ 58163 54588 62219 58557 48533 40321 44661 39672 34474 33892 38347 38906 45337 46123 49343 46796
9514D6796l061n5J0780R82R6j819K83o101l948P25N90K623p59P310J936o374L114
$$ 46796 43735 43680 54460 55442 55538 53719 54002 47901 43953 44678 45268 47891 47132 54442 56378 50004 53118
9497E3118R593N816k26k168j2502k749M210l43j653L984p908j0939n738O80k683
$$ 53118 62711 68527 68301 66133 53631 50882 55092 54749 53096 57080 49172 38233 32495 33175 30492
9482C0492J0488K3916L851k790j5319j0309K373K620j3M693J1124q36m576o21
$$ 30492 40980 64896 68747 65957 50638 40329 42702 45322 45309 50002 61126 60290 55714 55093
9468E5093M300J600k499q608O481J559n777J357K279J0108L794p7l885k719L121
$$ 55093 59393 60993 58494 49886 56367 57926 52149 53506 55785 65893 69687 69610 65725 63006 66127
9453F6127J2515J0286j1092q421j383j737P737P750J849m452j3429l233M848K898
$$ 66127 78642 88928 77836 69415 68032 66295 74032 81782 83631 79179 65750 62517 67365 70263
9439G0263L359M66k890K10J228J177N540M634o857l968k354J98j4377l550K850
$$ 70263 73622 74088 71198 71408 72636 73813 79353 83987 77130 73162 70808 71006 56629 53079 55929
9424E5929P614K095L022O172M884l256J166k841n523k897m056N307P954Q547N859
$$ 55929 63543 65638 68660 74832 79716 76460 77626 74785 69262 66365 62309 67616 75570 84117 89976
9409H9976P0j278J367J018o882k09J781N918l839j394J789L13L348K557m571j719
$$ 89976 90046 88768 90135 91153 84271 84062 85843 91761 87922 86528 88317 88630 91978 94535 89964 88245
9393H8245N316J910J244j245p803j950M251J577L76m942j211N606Q736N466N644
$$ 88245 93561 95471 96715 95470 87667 85717 89968 91545 91921 86979 85768 91374 100110 105576 111220
9378A11220l284L217R016m973p346K511J170q159j518M542J4702N600N389N076
$$ 111220 107936 111153 120169 115196 107850 110361 111531 103372 101854 106396 121098 126698 132087 137163
9364A37163K452k287k619L202N734p36K663Q554r56j606L591M275R485J4474J5133
$$ 137163 139615 137328 134709 137911 143645 142909 145572 154126 153170 151564 155155 159430 168915 183389 198522
9349A98522O998R810O623l770R283J8811J3529K0184J0902J5767N842J7023K1644
$$ 198522 205520 215330 221953 218183 227466 246277 259806 279990 290892 306659 312501 329524 351168
9336C51168K1989K6715L6430L6644K2440L6748M2654N2681P3836Q8969Q7191R4572
$$ 351168 373157 399872 436302 472946 495386 532134 574788 627469 701305 790274 877465 972037
9324I72037J20448J40980J41076J38082J42922J51559J55503J48375J34263J27304
$$ 972037 1092485 1233465 1374541 1512623 1655545 1807104 1962607 2110982 2245245 2372549
9314B372549J29966J34596J40981J35896J32695J32820J41956J45047J71638K08833
$$ 2372549 2502515 2637111 2778092 2913988 3046683 3179503 3321459 3466506 3638144 3846977
9304C846977K41839K82888L05655L20720L28912L17589K84915K28500J95975J66328
$$ 3846977 4088816 4371704 4677359 4998079 5326991 5644580 5929495 6157995 6353970 6520298
9294F520298J33918R6521P6531N3890J8495j6409n7210p8858p6581o7835n8137
$$ 6520298 6654216 6750737 6827268 6881158 6899653 6883244 6826034 6747176 6670595 6602760 6544623
9283F544623j8815J0015M4810P5325R6689J13115J05850R4707Q6574N8651J2121
$$ 6544623 6525808 6535823 6580633 6655958 6752647 6865762 6971612 7066319 7152893 7211544 7223665
9272G223665l6278q8194j30682j66860k01939k31738k42909k61318k71422k84834
$$ 7223665 7187387 7099193 6968511 6801651 6599712 6367974 6125065 5863747 5592325 5307491
9262E307491k60473k36174k06307j71410j53130j38546j31778j32077j33615j24948
$$ 5307491 5047018 4810844 4604537 4433127 4279997 4141451 4009673 3877596 3743981 3619033
9252C619033j14684r4617p8538n6569n6879m0571m7884k9375j6679j1161Q556
$$ 3619033 3504349 3409732 3331194 3274625 3217746 3177175 3129291 3099916 3083237 3072076 3080632
9241C080632M1501Q2901R7335J26229J27380J20680J31096J26829J45281J74198
$$ 3080632 3122133 3205034 3302369 3428598 3555978 3676658 3807754 3934583 4079864 4254062
9231D254062J79377K01155K18162K35388K46066K51085K58904K93801L23762L65654
$$ 4254062 4433439 4634594 4852756 5088144 5334210 5585295 5844199 6138000 6461762 6827416
9221F827416M12687M51980M57334M35059L92949L55341L11106K65129K30983J76576
$$ 6827416 7240103 7692083 8149417 8584476 8977425 9332766 9643872 9909001 10139984 10316560
9211A0316560J26293R1589L5432k3005q0017j19047j60437j94397j83867j55244
$$ 10316560 10442853 10534442 10569874 10546869 10466852 10347805 10187368 9992971 9809104 9653860
9201I653860j30441r8389m9146j0696K3077N8195P3887O6668N2482J0282j7669
$$ 9653860 9523419 9425030 9375884 9365188 9388265 9446460 9520347 9587015 9639497 9649779 9632110
9190I632110l0394n3922q3826j28820j61582k14901k93776l52749l78428m07647
$$ 9632110 9601716 9547794 9463968 9335148 9173566 8958665 8664889 8312140 7933712 7526065
9180G526065m13990m16524l84536l47954l10613k62571k41700k24720k16590j99739
$$ 7526065 7112075 6695551 6311015 5963061 5652448 5389877 5148177 4923457 4706867 4507128
9170D507128j97960j85751j87393j89505j85201j89581j94659j92260k04703k13154
$$ 4507128 4309168 4123417 3936024 3746519 3561318 3371737 3177078 2984818 2780115 2566961
9160B566961k08672k02544j86730j69478j61781j43411j17703j03343j00995q7514
$$ 2566961 2358289 2155745 1969015 1799537 1637756 1494345 1376642 1273299 1172304 1084790
9150A084790p5406o8166o1944m2897l6816m2238m3081l8084m4827m1759l0787
$$ 1084790 1009384 941218 879274 836377 799561 757323 714242 676158 631331 589572 558785
9139E58785k5403k2643k2033j1437j7236l622j821k4271j3814q846p824l459l045
$$ 558785 533382 510739 488706 477269 460033 456411 454590 430319 416505 407659 399835 396376 393331
9126C93331k2085k1974o029q046j1046k0983j2926N338O83j810O682j235M512
$$ 393331 371246 349272 343243 335197 324151 303168 290242 295580 296263 294453 301135 299900 304412
9113C04412N950n415j2188j6778j2237N377K007j191j2036j14o431n841p721j308
$$ 304412 310362 304947 292759 275981 263744 269121 271128 269937 257901 257787 251356 245515 237794 236486
9099B36486J889n30J70j827n243J1737O04J1395K166N7l546J0078Q674J0601O620
$$ 236486 238375 237845 238015 236188 230945 242682 243286 254681 256847 256904 253358 263436 272110 282711 289331
9084B89331m415j1576n050M992N817k047L325J1743J7900L9424L8134J4057J523
$$ 289331 284916 273340 268290 273282 279099 277052 280377 292120 310020 349444 387578 401635 403158
9071D03158o814p800q943j3697j2774r214m082j1007k4916k1715j4237j177j8658
$$ 403158 396344 388544 379601 365904 353130 343916 339834 328827 303911 282196 267959 266782 248124
9058B48124j0387m303j614r63j1917k431q110J788j0297k429Q226J4892J1567
$$ 248124 237737 233434 231820 230857 218940 216509 208399 210187 199890 197461 205687 220579 232146
9045B32146J5206J1983j672l708o21Q772Q16j1720q303K77J7155J1684J114o254
$$ 232146 247352 259335 257663 253955 253334 262106 262922 251202 242899 243176 260331 272015 273129 266875
9031B66875J03o237p465J842m003J0565K3870K2152J9449J9240J3016J54Q499
$$ 266875 266978 260741 253276 255118 251115 261680 285550 307702 327151 346391 359407 359561 368060
9018C68060L2055L8206K8324J5922J0287N36l9257q5885j16766j05309o9382m1218
$$ 368060 400115 438321 466645 482567 492854 493390 454133 368248 251482 146173 76791 35573
9006C5573l0664n148K4027l893k276R307l316n935P943J0504Q594J3578Q094J7835
$$ 35573 4909 -239 23788 19895 17619 26926 23610 17675 25618 36122 44716 58294 66388 84223
8992H4223J1779J4339J1244o098l390J3067J6805R143o876Q39K784O360J521q274
$$ 84223 96002 110341 121585 115487 112097 125164 141969 151112 144236 145075 147859 154219 155740 147466
8978A47466j5536j9996O967R725L715J0508M403l535J656Q638J8003J7311P070
$$ 147466 131930 111934 118901 128626 132341 142849 147252 143717 145373 154011 172014 189325 196395
8965A96395J3113J9427J9890J5358J1748J5397J3368J5512J788N848J6063K7955
$$ 196395 209508 228935 248825 264183 275931 291328 304696 320208 321996 327844 343907 371862
8953C71862K4973K7176L4241L5501K2240O033j8777o138N9136J16274Q0460m3758
$$ 371862 396835 424011 458252 493753 515993 522026 503249 497111 556247 672521 752981 709223
8941G09223p9370m3675k5642k1557l0945l3352k5970k6374k4935q887M923k853
$$ 709223 629853 586178 560536 538979 508034 474682 448712 422338 397403 388516 393439 390586
8929C90586M38K1877K1907J2949K9384L6372K3567J7738N933J0393O151O759R226
$$ 390586 391024 412901 434808 447757 477141 513513 537080 554818 560751 571144 577295 584054 593280
8916E93280J8988J3950K2286K3536K6141L0397L0158M3897O6597P3142P7590R5417
$$ 593280 612268 626218 648504 672040 698181 728578 758736 802633 869230 942372 1019962 1115379
8904A115379J18942J33725J49417J70731K09573K49095K86407L27075L60807L69376
$$ 1115379 1234321 1368046 1517463 1688194 1897767 2146862 2433269 2760344 3121151 3490527
8894C490527L73824L39838K77341J85246Q8316j0532p6385j25255j49205j50920
$$ 3490527 3864351 4204189 4481530 4666776 4755092 4744560 4668175 4542920 4393715 4242795
8884D242795j37810j10804r6218o8087k8236J331K3771O1551R7940J13709J48887
$$ 4242795 4104985 3994181 3897963 3829876 3801640 3802971 3826742 3888293 3986233 4099942 4248829
8873D248829J79070K04814K28833K36010K63701K60983K37981J83246R3701l0520
$$ 4248829 4427899 4632713 4861546 5097556 5361257 5622240 5860221 6043467 6137168 6106648
8863F106648j59631k82703l71292m60799n28737n48689m72127l25423j14770R9834
$$ 6106648 5947017 5664314 5293022 4832223 4303486 3754797 3282670 2957247 2842477 2942311
8853B942311K97019M62693N90752O87930P39917P45926P45575P29965P19901P36916
$$ 2942311 3239330 3702023 4292775 4980705 5720622 6466548 7212123 7942088 8661989 9398905
8843I398905P52079Q21409R37680J076764J277293J509425J828115K204652K638429
$$ 9398905 10150984 10972393 11910073 12986837 14264130 15773555 17601670 19806322 22444751
8834B2444751L095819L561682L987559M599855N689947P399724R927843J3678020
$$ 22444751 25540570 29102252 33089811 37689666 43379613 50779337 60707180 74385200
8826G4385200J9238234K7423689L9139600N4048217O5472945N5470100J6732928
$$ 74385200 93623434 121047123 160186723 214234940 279707885 335177985 351910913
8819C51910913k0115296l4482555l8483681m2760914m3345590l6714492k7399413
$$ 351910913 331795617 297313062 258829381 216068467 172722877 136008385 108608972
8812A08608972j9564124j4022469j0268875p751587o032424m923981m338318m002333
$$ 108608972 89044848 75022379 64753504 57001917 50969493 46045512 41707194 37704861
8804C7704861l666561l318743k995859k655909k274348j913857j578563j266080
$$ 37704861 34038300 30719557 27723698 25067789 22793441 20879584 19301021 18034941
8796A8034941r75117o87598m11858j65084L4069J99630K98757L38228K99634J79297
$$ 18034941 17059824 16372226 15960368 15795284 15829353 16028983 16327740 16665968 16965602 17144899
8786A7144899k7391k96085n63647p81213q95746r34184r43648r64855r71351r47028
$$ 17144899 17117508 16821423 16257776 15476563 14580817 13646633 12702985 11738130 10766779 9819751
8776I819751r29740q91268q30267p55068o70199n87501n09568m40758l90031l34555
$$ 9819751 8890011 7998743 7168476 6413408 5743209 5155708 4646140 4205382 3815351 3480796
8766C480796k70053k18330j77727j39080j09219o9644l1321l764K2052N5301Q1604
$$ 3480796 3210743 2992413 2814686 2675606 2566387 2496743 2465422 2461658 2483710 2539011 2620615
8755B620615J01789J27705J41840J76704J99666K14982K29182K45858K76794L08384
$$ 2620615 2722404 2850109 2991949 3168653 3368319 3583301 3812483 4058341 4335135 4643519
8745D643519L38711L58756L64699L46567K98772K53315K17667J98579J75490J67480
$$ 4643519 4982230 5340986 5705685 6052252 6351024 6604339 6822006 7020585 7196075 7363555
8735G363555J32320Q4838K4658n6906j19870j86581k68447l22114l49267l65117
$$ 7363555 7495875 7580713 7605371 7548465 7428595 7242014 6973567 6651453 6302186 5937069
8725E937069l44913k95618k26813j52307q1594J2611J02544J80601K54409L18089
$$ 5937069 5592156 5296538 5069725 4917418 4835824 4848435 4950979 5131580 5385989 5704078
8715E704078L55286L43361K95084K25192J61779R9372O6422L8216K324n9407j20221
$$ 5704078 6059364 6402725 6697809 6923001 7084780 7184152 7250574 7288790 7291114 7231707 7111486
8704G111486j96107k54387l29985l66350l99666m06026m14439l80738l62325l41052
$$ 7111486 6915379 6660992 6331007 5964657 5564991 5158965 4744526 4363788 4001463 3660411
8694C660411l24454l01584k60221k41740k14487k01891j76421j38666j19787r5408
$$ 3660411 3335957 3034373 2774152 2532412 2317925 2116034 1939613 1800947 1681160 1585752
8684A585752q2563o5457m6517m8806l5553j9994j1753k4773l083L37J1090J8294
$$ 1585752 1503189 1437732 1391215 1342409 1306856 1286862 1275109 1250336 1247253 1247590 1258680 1276974
8672A276974J7508J6229L6147M3178N7462P1841R2457R9046J15885J37597J58270
$$ 1276974 1294482 1310711 1346858 1390036 1447498 1519339 1611796 1710842 1826727 1964324 2122594
8661B122594J71571J74830J85572J74457J30081N9290k9473j02413j49841j89521
$$ 2122594 2294165 2468995 2654567 2829024 2959105 3018395 2988922 2886509 2736668 2547147
8651B547147k10690j94975j63315j52828j16536q4165o3722l6895j8115n580P182
$$ 2547147 2336457 2141482 1978167 1825339 1708803 1624638 1560916 1524021 1505906 1500326 1507508
8640A507508J9097L6250O0283Q9063J29728J39356J45930J46505J21531Q1387
$$ 1507508 1526605 1562855 1623138 1712201 1841929 1981285 2127215 2273720 2395251 2476638
8630B476638J4648m0497j01058j37309j66177j75855j71443j70895j70447j64807
$$ 2476638 2491286 2450789 2349731 2212422 2046245 1870390 1698947 1528052 1357605 1192798
8620A192798j34423j14476j01155p9700n3060m4805l8954l3943l8024l8490m0728
$$ 1192798 1058375 943899 842744 763044 709984 665179 626225 592282 554258 515768 475040
8609D75040l7889l8350j6496k1876j5124r934o519j3565k1188k0427j1689j5028
$$ 475040 437151 398801 382305 360429 345305 335371 328852 315287 294099 273672 261983 246955
8597B46955r627j5218m338J2473J1161O275P228m438m718N585K796p83q070j2113
$$ 246955 237328 222110 217772 230245 241406 247681 254909 250471 245753 251338 254134 253351 245281 233168
8583B33168j2800j1108M420J1227J2491o778j2341n399M218M894N296m080m945
$$ 233168 220368 209260 213680 224907 237398 230620 218279 212880 217098 221992 227288 223208 218263
8570B18263M269M466p658q891K842p435q295o925r248r620q913j4670M145J479
$$ 218263 222532 226998 219340 210449 213291 205856 197561 190636 181388 171768 162855 148185 152330 153809
8556A53809j8003p732k582L757k436l773n482j58L463j470Q840K372L706P517
$$ 153809 135806 128074 125492 129249 126813 123040 117558 117400 120863 119393 128233 130605 134311 141828
8542A41828L451k598j758k940m917m249K138k227p328m161k569J4605k301j863
$$ 141828 145279 142681 140923 137983 133066 128817 130955 128728 121400 117239 114670 129275 126974 125111
8528A25111L222K643r235M531k623L19J7958j405j4542o329r385k086Q365p095
$$ 125111 128333 130976 121741 126272 123649 123968 141926 140521 125979 119650 110265 108179 116544 109449
8514A09449p823l534q279l527J0820O285o296K687J1613J7087k240l984r90o695
$$ 109449 101626 98092 89813 86286 97106 103391 97095 99782 111395 128482 126242 122258 121268 114573
8500A14573K740J8411l651j2919m450j760M637L96j2687j1212k346m902j2085
$$ 114573 117313 135724 132073 119154 114704 112944 117581 117977 105290 94078 91732 86830 74745
8487G4745N770J4287R820N438j735m049m054k433j441P644P763K223l892N110
$$ 74745 80515 94802 104622 110060 108325 104276 100222 97789 96348 103992 111755 113978 110086 115196
8473A15196J210j2808j4750n907K575R38R322Q763j4533k369L573Q51K177k129
$$ 115196 116406 103598 88848 82941 85516 86454 95776 104539 90006 87637 91210 92061 94238 92109
8459I2109r15j912J0994K658L841l642J766L752M100R318q81M652N436o940L604
$$ 92109 91194 89282 100276 102934 106775 103133 104899 108651 112751 122069 121188 125840 131276 124336 127940
8444A27940M978N225j857L269o613k059O346Q123N544J7753J8294J8725J9840
$$ 127940 132918 138143 136286 139555 132942 130883 137229 145352 150896 168649 186943 205668 225508
8431B25508J5863K6945K8665M6440M7430N8332Q2293Q7779J05282J15874J24915
$$ 225508 241371 268316 296981 343421 390851 449183 531476 619255 724537 840411 965326
8420I65326J17639J06601P9754L8856N849k7002n5349r0122j21197j20763j09942
$$ 965326 1082965 1189566 1269320 1308176 1314025 1287023 1231674 1141552 1020355 899592 789650
8409G89650r1988o8024p1139p6624o6719m5005l0181k7450j7277k1926k5759j2802
$$ 789650 697662 629638 558499 481875 415156 370151 339970 312520 295243 273317 247558 234756
8397B34756j2186k4770j5284j1560j0693m314j1266k840K134J941Q028K459N525
$$ 234756 222570 197800 182516 170956 160263 155949 144683 141843 143977 145918 153946 156405 161930
8384A61930l158l901n713J3830K1890L5210P3035J25045J17027k4606p3452m9912
$$ 161930 158772 154871 149158 162988 184878 220088 293123 418168 535195 510589 437137 387225
8372C87225m4903o6351o1323l6860k2930k6415j5119k095p474l975N24O539m258
$$ 387225 342322 275971 214648 177788 154858 128443 113324 111229 103755 99780 100304 106843 102585
8359A02585n337j5596n324o162M766O511k132j5383j2921K345M539j109J662R609
$$ 102585 97248 81652 76328 70166 74932 81443 79311 63928 51007 53352 57891 56782 58444 68053
8345F8053j789J440P440O177j1482r027M47l889J152Q047J669J1721N015j737
$$ 68053 66264 67704 75144 81321 69839 60812 61259 57370 58522 66569 68238 79959 84974 83237
8331H3237o70j749m316M829N962M545j1518j8389N114L515k25M000J531N184l840
$$ 83237 82567 80818 76502 81331 87293 91838 80320 61931 67045 70560 70335 74335 75866 81050 77210
8316G7210k725l464j077L160m81l272k632k892M999J1932M91j577k602m056o727
$$ 77210 74485 71021 69944 73104 72623 69351 66719 63827 68826 80758 81249 79672 77070 73014 66287
8301F6287N512P508l870L947Q343L944l782o010L416O350J0723j1502j9462j3018
$$ 66287 71799 79307 75437 79384 87727 91671 87889 81879 85295 91645 102368 90866 71404 58386
8287E8386P779K069j3188J25q45m815j542r666L40O037k74O227R384J723q202
$$ 58386 66165 68234 55046 55171 54326 49511 47969 38303 38643 44680 44406 50633 60017 61740 53538
8272E3538K55q220K691k258k425J099j452q108n544P791n739j0659P05k515J0196
$$ 53538 53793 45573 48264 46006 43581 44680 43228 35120 29576 37367 31628 20969 21674 19159 29355
8257B9355J2099R40N726K540l392K231J808k408r222p60Q781K933J917K21P76
$$ 29355 41454 42394 48120 50660 47268 49499 51307 48899 39677 38917 47698 50631 52548 52769 53545
8242E3545L664k364q246o741p712p622o267l581R855O880R680J301J861J475J369
$$ 53545 57209 54845 46599 39858 32146 24524 18257 14676 24531 31411 41091 42392 44253 45728 47097
8227D7097k140j0267j1525o625L296O212k002m429n527Q869O922j423L104O09
$$ 47097 44957 34690 23165 16540 19836 26048 24046 19617 14090 22959 29881 28458 31562 32171
8213C2171l52p248m816l688N161l269K303m478m270M415J974P865L089Q996j088
$$ 32171 31819 24571 19755 16067 21228 17959 20262 15784 11514 15929 17903 25768 28857 37853 36765
8198C6765p322N54j0645j0116J509M993j624M104J43j238n257N970m847m378R719
$$ 36765 29443 29997 19352 9236 10745 15738 14114 18218 18361 17123 11866 17836 12989 8611 18330
8183A8330L278q821M189O356Q047m093N45Q140j994o373p609q315j812l875j377
$$ 18330 21608 12787 16976 23332 31379 27286 27831 35971 33977 27604 19995 11680 9868 5993 4616
8168D616R283P337L254j3855k252O295N519M17q30N970M803n618l56J121J1056
$$ 4616 13899 21236 24490 10635 8383 14678 20197 20614 19784 25754 30557 24939 24583 25704 36760
8153C6760J911j0081j0163L31O781K461k076J529p455o528l512p018J616j150
$$ 36760 38671 28590 18427 18758 25539 28000 25924 27453 19998 13470 9958 2940 4556 3406
8139C406j868L110P021L256l37P47M617l005n474L090K374M833k137K649J535
$$ 3406 1538 4648 11669 14925 14588 15335 19952 16947 11473 14563 16937 21770 19633 22282 23817
8124B3817L714N716l792l813L2M771N364m299r77o356k760l135k010n465q160
$$ 23817 27531 33247 29455 25642 25674 30445 35809 31510 30533 24177 21417 18282 16272 10807 2647
8109B647K847P765O776m562j331j0550p828L600O777M972L718q39l302N545N151
$$ 2647 5494 13259 20035 15473 14142 3592 -4236 -636 6141 11113 14831 13992 10690 16235 21386
8094B1386j519n497J846n85o796K275J4683J0589o340k720L865o216l867R787
$$ 21386 19867 14370 16216 15631 8835 11110 25793 36382 30042 27322 31187 24971 21104 30891
8080C0891L858m95o037j673L048o920m208k952J862R407l131k534M730O394M127
$$ 30891 34749 34254 28217 26544 29592 22672 18464 15512 17374 26781 23650 21116 25846 32240 36367
8065C6367K402k292q151j912l00R237N96p020j0382L252j48k479P792J2330q607
$$ 36367 38769 36477 28326 26414 26114 35351 35947 28927 18545 21797 21649 19170 26962 39292 30685
8050C0685j1422k168k65p924j424j685J624M926P705L941j6247o868k606r67N858
$$ 30685 19263 17095 16830 8906 7482 5797 7421 12347 20052 23993 7746 878 -1728 -2695 3163
8035C163M4J413L497N259N717P839Q116n953j5514j3729K230L43O3J3065p46P638
$$ 3163 3207 4620 8117 13376 19093 26932 35048 29095 13581 -148 2082 2425 2488 15553 14807 22445
8019B2445J470j497J152M392l628P567Q741J179J979n963N279M024l766m120r285
$$ 22445 23915 22418 23570 27962 24334 31901 40642 41821 43800 37837 43116 47140 43374 39254 29969
8004B9969o469k946j74K206M732q616k623N66J13n19k90J150p349j715o986j623
$$ 29969 23500 20554 20380 22586 27318 18702 16079 16645 16758 16239 15949 17099 9750 8035 1049 -574
7988e74Q878l719J475J3497P407j0952O111N997k781k841Q551N600q784j5485
$$ -574 8304 4585 6060 19557 26964 16012 22123 28120 25339 22498 31049 36649 27865 12380
7974A2380k895M116k466l844J131M408J2946J3631J495o450M768m777r535k311
$$ 12380 9485 13601 11135 7291 8422 12830 25776 39407 40902 34452 39220 34443 24908 22597
7960B2597L259n92J0914P408j3913q632j578J57l266n356n51J0624L105J399N460
$$ 22597 25856 25264 36178 43586 29673 21041 19463 19620 16354 10998 10447 21071 24176 25575 31035
7945C1035m430k806q197p53m285L906k296R9Q642R255r250o611P647l495j679
$$ 31035 26605 23799 15602 14849 10564 14470 12174 12273 20915 30170 20920 14309 21956 18461 16782
7930A6782l124l41k700j773K671L752K415N963j172n989m951L603O685q869L979
$$ 16782 13658 13317 10617 8844 11515 15267 17682 23645 22473 16484 11533 15136 21821 12952 16931
7915A6931K651N825J083q411o563J916j610P31m402O721L625P91m557M23K647
$$ 16931 19582 25407 26490 18079 11516 13432 11822 12553 8151 14872 18497 19288 14731 15154 17801
7900A7801k223o068j946k259m431K491j015K498k10O041P073j1723J398N889L992
$$ 17801 15578 9510 7564 5305 874 3365 2350 4848 4638 10679 17752 6029 7427 13316 17308
7885A7308j1695p099M44M863O373q374K159J6359K50j0355N877P569j183K298
$$ 17308 5613 -1486 -1042 3821 10194 1820 3979 20338 20588 10233 16110 23679 22496 24794
7871B4794Q498K788p311r214k246j0604K002l560p910J947P109O667J256M576
$$ 24794 33292 36080 28769 19555 17309 6705 8707 5147 -2763 -816 6293 12960 14216 18792
7857A8792M403P115k61l470k26o47m468j0525O3R08M433m868k857k782o52p03
$$ 18792 23195 30310 30049 26579 26353 25706 21238 10713 10776 11684 16117 11249 8392 5610 4958 4255
7841D255k060Q220Q086m551j2001Q63M904Q987m454n168O867J396r001n05k582
$$ 4255 2195 10415 18501 13950 1949 2812 7716 16703 12249 7081 13948 15344 6343 5838 3256
7826C256L771O406N596o90j745K551l925N155o433j1278l398l465O563o94q04
$$ 3256 7027 13433 19029 18339 16594 19145 15220 20375 13942 2664 -734 -4199 2364 1670 866
7811H66J26r76Om212J792J3157L925l750j2396r007JL226P812M971K493o967m429
$$ 866 992 16 22 -4190 -2398 10759 14684 10934 -1462 -10469 -10468 -7242 570 5541 8034 1067 -3362
7794c362j555n40N846m668L01Q465N615P001k603K399p13l979M67J951k955m159
$$ -3362 -4917 -5457 389 -4279 -3978 4487 10102 17103 14500 16899 16186 12207 12674 14625 11670 7511
7778G511q153J0167O966m934q167l319m848K162P449O891m816l145L095K964n30
$$ 7511 -642 9525 16491 11557 3390 71 -4777 -2615 4834 11725 6909 3764 6859 9823 9293
7763I293j236n792K809M105o702k849M404m746o192l932N842K211L487N032K594
$$ 9293 8057 2265 5074 9179 2477 -372 4032 -714 -6906 -10838 -4996 -2785 702 5734 8328
7748H328o911J917R697L672l138p311q380Q991L283K484j575k979N313L066o210
$$ 8328 1417 3334 13031 16703 13565 6254 -2126 6865 10148 12632 11057 8078 13391 16457 10247
7733A0247m549L9n512O37q00J0662J2613k486j0622k493k257N24j59L606R080
$$ 10247 5698 5737 225 862 62 10724 23337 20851 10229 7736 5479 6003 5844 9450 18530
7718A8530k062j2235l731L935N831N125k388j6245n848L342J3665K306j3747J486
$$ 18530 16468 4233 502 4437 10268 15393 13005 -3240 -9088 -5746 7919 10225 -3522 -2036
7704b036O835n51J387q33j971J434j786m492R87L559k263L180R03P09J534L554
$$ -2036 4799 4248 5635 4802 2831 4265 2479 -2013 -1026 2533 270 3450 4353 5062 6596 10150
7688A0150k835p890K47N39L867L215N97O506q025j0251J367j712o521J0129J1192
$$ 10150 7315 -575 -328 211 4078 7293 7890 14396 6371 -3880 -2513 -4225 -10746 -617 10575
7673A0575k256q457M91j716L114J4706P779q107q054J541p837J441J0263r21j3292
$$ 10575 8319 -138 353 -1363 1751 16457 24236 16129 8075 9616 1779 3220 13483 12562 -730
7658g30J123l336N72L688m569p566k774J7476R748M817q256K871R51j3207l440
$$ -730 393 -2943 -2371 1317 -3252 -10818 -13592 3884 13632 18449 10193 13064 14015 808 -2632
7643b632m926o322K568O773J1029n262j3609L228L78J692P853P746m27M225n867
$$ -2632 -7558 -13880 -11312 -4539 6490 1228 -12381 -9153 -8775 -7083 770 8516 8089 12314 6447
7628F447j866m999k655j548j672K978M342J768l579R07m412M053N218J2192K886
$$ 6447 4581 -418 -3073 -4621 -6293 -3315 1027 2795 -784 123 -4289 -236 4982 17174 20060
7613B0060j4331j2691j673M038O992O680k4r224n908L964P740o208m112K045K371
$$ 20060 5729 -6962 -8635 -4597 2395 9075 9051 -173 -6081 -2117 5623 -585 -4697 -2652 -281
7598b81O121q012j831Q528O532j154m547K688k724L281L860M666R242J04l943
$$ -281 5840 -2172 -4003 4525 11057 9903 5356 8044 5320 8601 12461 17127 26369 26473 22530
7583B2530m741j1191l348o927j673K902m27N268R700j245P42j937M95m179q54
$$ 22530 17789 6598 3250 -3677 -5350 -2448 -2875 2393 12093 10848 11590 9653 10148 5969 5115
7568E115K437J183N141m887p775M219J52m290l49l61K8P301P443q68p878n698
$$ 5115 7552 8735 13876 8989 1214 5433 5585 1295 946 585 613 7914 15357 14489 6611 913
7552I13K798N575L159k97o942J571k634j508o291J395O794l655K001L833O885
$$ 913 3711 9286 12445 12148 5206 6777 4143 2635 -3656 -2261 4533 878 2879 6712 13597
7537A3597N736p570k432J718L335Q037r91q122j1088M318Q81p516L803R363J965
$$ 13597 19333 11763 9331 11049 14384 22421 21430 13308 2220 6538 7419 -97 3706 13069 15034
7522A5034n952m319O428O051o854J699O78p0p302p338o543j865N089N474j530
$$ 15034 9082 4763 11191 17242 10388 12087 12765 12695 5393 -1945 -8488 -10353 -5264 210 -1320
7507a320M566L326k818K623O767m766n865m112R204J576l549P749J385r752j2695
$$ -1320 3246 6572 3754 6377 13144 8378 2513 -1599 7605 9181 5632 13381 14766 5014 -7681
7492g681P86m109O22q16J704N138R101J0034j762p878p784o410j0545L818J4481
$$ -7681 -6895 -11004 -10382 -11198 -9494 -4356 4745 14779 13017 5139 -2645 -9055 -19600 -15782 -1301
7477a301M921J432k642J9j343O088O965N24N461k91j903M276l270k417m781j1095
$$ -1301 3620 5052 2410 2429 1086 7174 14139 14663 20124 19833 17930 22206 18936 16519 11738 643
7461F43l563m102M21N112P948l229M776l449j669N566O145j2073j3491p98J1054
$$ 643 -2920 -7022 -6601 -1489 6459 3230 8006 4557 2888 8454 14599 2526 -10965 -11763 -709
7446g09Q828j541R51l303m054m34M676J982j317j528L247L252j0540o194K695
$$ -709 8119 6578 7529 4226 172 -262 4414 6396 5079 3551 6798 10050 -490 -6684 -3989
7431c989M259K972N944k802j0774n02J473J01o328n65M168J73k82J673N645m88
$$ -3989 270 3242 9186 6384 -4390 -4892 -3419 -3318 -9646 -10211 -6043 -5870 -6152 -4479 1166 678
7415F78o58J1147k560n917r324K52P698K400O263K324k381J701K861k455k376
$$ 678 20 11167 8607 2690 -6634 -6382 1316 3716 9979 12303 9922 11623 14484 12029 9653
7400I653K110N029P93r197j3450j1086R391M611N63k639l839n042n479J1228J3247
$$ 9653 11763 16792 17585 8388 -5062 -16148 -6757 -2146 -1583 -4222 -8061 -13103 -18582 -7354 5893
7385E893R109p22n195o951o197L015Q659l2j2305j0502Q269K211j660O754r04
$$ 5893 15002 14280 9085 2134 -4063 -1048 7611 7579 -4726 -15228 -6959 -4748 -6408 346 -558
7370e58N490Q772o386m605l01O474M490K095p539q780r136J521R182K657k352
$$ -558 4932 13704 7318 2713 2412 8886 13376 15471 7932 -848 -9984 -8463 719 3376 1024
7355A024J289l051q656r41k100j712j1359k109l861O230J2765M580Q342J2872
$$ 1024 2313 -738 -9394 -10335 -12435 -14147 -25506 -27615 -31476 -25246 -12481 -7901 441 13313
7341A3313J0359l51j684j0478p285j259J71l474j108Q710J236R47k758j0219j365
$$ 13313 23672 23321 21637 11159 3874 2615 2786 -688 -1796 6914 8150 9097 6339 -3880 -5245
7326e245R212j239l780K925P882p76j386o17Q616J386m415m969J82n625o845l496
$$ -5245 3967 2728 -1052 1873 9755 8979 7593 6976 15592 16978 12563 7594 7776 2151 -4694 -8190
7310h190N100O092l409K586l990J368n960J2296O363q098l659J711M292m919j1083
$$ -8190 -3090 3002 -407 2179 -1811 -443 -6403 5893 12256 4158 499 2210 6502 1583 -9500
7295i500N363N873N588j63p23K708K473N438K160n170l012J086r707Q3J1108k777
$$ -9500 -4137 1736 7324 7161 6438 9146 11619 17057 19217 14047 11035 12121 2414 2497 13605 10828
7279A0828r481m542l852J195L498q21k868l31R426L005o517j299K639M662L510
$$ 10828 1347 -3195 -7047 -5852 -2354 -3175 -6043 -6374 3052 6057 -460 -1759 880 5542 9052
7264I052J167l292J067N7O95l447L056J037n483L190k217l175m425n940L180L010
$$ 9052 10219 6927 7994 8051 8746 5299 8355 9392 3909 7099 4882 1707 -2718 -8658 -5478 -2468
7248b468k210m7P741j544R17k84J198o591q52JK934O01l758L348n647j8839k702
$$ -2468 -4678 -4725 3016 1472 2389 2105 3303 -3288 -4140 -4139 -1205 -604 -4362 -1014 -6661 -25500 -28202
7231b8202M593j118P265N944k341L154J7790P110M542q626m608r729M087K080
$$ -28202 -23609 -24727 -17462 -11518 -13859 -10705 7085 14195 18737 10111 5503 -4226 -139 1941
7217A941r74J701N757o183j859j040L868k957m428k921K550K624M914O363n241
$$ 1941 967 2668 8425 2242 383 -657 3211 254 -4174 -7095 -4545 -1921 2993 9356 4115
7202D115K073L069j1969p525o11m12J899k393l731M715N727J019j395J017j3058
$$ 4115 6188 9257 -2712 -10237 -10848 -11260 -9361 -11754 -15485 -10770 -5043 -4024 -5419 -4402 -17460
7187a7460o728l825j287P547J1205P120o750J927J745m911L022L700j776P25J247
$$ -17460 -24188 -28013 -29300 -21753 -10548 -3428 -10178 -8251 -6506 -11417 -8395 -4695 -6471 -5746 -4499
7172d499M833R859m291r08R93P3K7m462j674K493N89o198m82M753J0125j1169
$$ -4499 334 10193 5902 4994 5987 6060 6087 1625 -49 2444 3033 -3165 -3647 1106 11231 62
7156F2j1374k074J0958Q608O39M27L669N67j0585j229J0942p706K490p33m065
$$ 62 -11312 -13386 -2428 6180 6819 7246 10915 11482 897 -332 10610 2904 5394 4661 596
7141E96N974J731q26l62o072j661r595K60P110k844K36M5N637J021J929o982k397
$$ 596 6570 8301 7475 7113 1041 -620 -10215 -9955 -2845 -5689 -5453 -5408 229 1250 3179 -3803 -6200
7124f200m913n611J547L783m240M431Q868O149M795r342k051J815O457N832l730
$$ -6200 -11113 -16724 -15177 -11394 -15634 -11203 -2335 3814 8609 -733 -2784 -969 5488 11320 7590
7109G590n143m274q28K922J513M368j259Q55l807Q10m12o457r184O172N634L131
$$ 7590 2447 -1827 -2655 267 1780 6148 4889 5744 1937 2747 2335 -4122 -13306 -7134 -1500 1631
7093A631O145M341m062j0449k21O73Q717L315J018p67m816n717M518k10r901l933
$$ 1631 7776 12117 8055 -2394 -2615 -1942 6775 10090 11108 10341 5525 -192 4326 4116 -5785 -9718
7077i718J674R71J162n839J124R255O52k727N959l620r226L6k097m172L256P308
$$ -9718 -8044 -7073 -5911 -11750 -10626 -1371 -719 -3446 2513 -1107 -10333 -10297 -12394 -16566 -13310 -6002
7061f002l023J2126J2276K356j0192q371l177K518L117j291r905m877o44N285
$$ -6002 -9025 3101 15377 17733 7541 -830 -4007 -1489 1628 337 -9568 -14445 -15089 -9804
7047i804l263J576M92j91k624l540N007M544m5k145o695l123j541j224l032J1405
$$ -9804 -13067 -11491 -10999 -11190 -13814 -17354 -12347 -7803 -7848 -9993 -16688 -19811 -21352 -22576 -25608 -14203
7031a4203Q833J301J877R439j235o085m590L829K172k146L824L096j213n017k255
$$ -14203 -5370 -4069 -2192 7247 6012 -73 -4663 -834 1338 -808 3016 6112 4899 -118 -2373
7016b373P20N074K608o74j1891j383L881m192l755O497M972L211p73J889O919
$$ -2373 -1653 3421 6029 5355 -6536 -7919 -4038 -8230 -11985 -5488 -516 2695 1922 3811 10730
7001A0730j002j733k346o41M629j3673o928K518O355l265K139l748j365N23L07
$$ 10730 9728 7995 5649 5008 9637 -4036 -10964 -8446 -2091 -5356 -3217 -6965 -8330 -7807 -7500
6986g500N796m30q256r456P587J5721R580l478J169j7p746j952j961O680j695
$$ -7500 -1704 -2134 -10390 -19846 -12259 3462 13042 9564 10733 10716 2970 1018 -943 5737 4042
6971D042j5540L070M969L495O273o980r930q642R213K925N349M67P51M994O99
$$ 4042 -11498 -8428 -3459 36 6309 -671 -10601 -19243 -10030 -7105 -1756 -1289 -538 4456 5155
6956E155j794j312PL168o317l878R662n23L006j0898n286N921J460M53M941k353
$$ 5155 3361 2049 2056 5224 -1093 -4971 4691 4168 7174 -3724 -9010 -3089 -1629 -1176 3765 1412
6940A412q866M846J0919O367j4447n593R876N201k561l052J845R66n369o808n36
$$ 1412 -7454 -2608 8311 14678 231 -5362 4514 9715 7154 4102 5947 6913 1544 -5264 -5800
6925e800P739p84o181n11M64q737K75M257N30P408n11j362O504M792K476q225
$$ -5800 1939 1155 -5026 -5537 -5073 -13810 -13535 -9278 -8748 -1340 -1851 -3213 3291 8083 10559 2334
6909B334m712K768m348l770m101Q33J3788j02j1922J806Q85K3M884K050K499N357
$$ 2334 -2378 390 -3958 -7728 -11829 -10996 2792 2690 -9232 -7426 -6541 -6518 -1634 416 2915 8272
6893H272J006q000n48O182R488j358m465q402r710j108Q28k707J798P516N502
$$ 8272 9278 1278 730 6912 16400 15042 10577 2175 -7535 -8643 -7815 -10522 -8724 -1208 4294
6878D294n044k496q377j561L600J3026r68o113j424M536L618l898%K093J481Q35
$$ 4294 -750 -3246 -11623 -13184 -9584 3442 2474 -3639 -5063 -527 3091 -807 -807 1286 2767 3602
6862C602O595O526K533o720K031L176K878j0667r183J661N234j0400l103K82J762
$$ 3602 10197 16723 19256 12536 14567 17743 20621 9954 771 2432 7666 -2734 -5837 -5555 -3793
6847c793o587k110Q237J72l119K467N656R354j3823j4901l476J6880M315m583
$$ -3793 -10380 -12490 -4253 -4081 -7200 -4733 923 10277 -3546 -18447 -21923 -5043 -728 -5311
6833e311j2108j361M348l241R966M304k385M534m843j6514M208J1700J43N445
$$ -5311 -17419 -18780 -14432 -17673 -7707 -3403 -5788 -1254 -6097 -22611 -18403 -6703 -6560 -1115
6819a115P400Q219o322r230L081n183Q78K304m034O847L656r827Q47P153k394
$$ -1115 6285 14504 8182 -1048 2033 -3150 -2272 32 -4002 2845 6501 -3326 -2479 4674 2280
6804B280r797p540M267N009m820l789J179o285J1308k715O822J3641r40j3533
$$ 2280 -7517 -15057 -10790 -5781 -10601 -14390 -13211 -19496 -8188 -10903 -4081 9560 8620 -4913
6790d913j621j978J3180N622K743O393L737r91k842j0608q314j2900k75P250O164
$$ -4913 -6534 -8512 4668 10290 13033 19426 23163 22172 19330 8722 408 -12492 -12767 -5517 647
6775F47J93l976K245K887o109K86L89j567r61k144K874J365K871J503L3K475j818
$$ 647 840 -3136 -891 1996 -4113 -3827 -3438 -5005 -5966 -8110 -5236 -3871 -1000 503 536 3011 1193
6758A193j461M983o186Q335l829o028N702Q597k89k211J525K05l681j1389j148
$$ 1193 -268 4715 -1471 6864 3035 -2993 2709 11306 11017 8806 10331 10536 6855 -4534 -5682
6743e682K553k185M757O907j000l952m951N391Q104R759r841M104R24M776q789
$$ -5682 -3129 -5314 -557 6350 5350 1398 -3553 1838 9942 19701 9860 13964 14888 19664 10875
6728A0875n140K61N508q474n354L163j392l962R39Q266M640o890n947j499N452
$$ 10875 5735 5996 11504 3030 -2324 839 -553 -4515 -3576 4690 9330 2440 -3507 -5006 446
6713D46J3462P819j942q931Q224M073n529m95m819L24Q213p109J288k610N414
$$ 446 13908 21727 19785 10854 19078 23151 17622 17127 12308 12632 20845 13736 15024 12414 17828
6698A7828k641K633p585n436L124L210r094k719N915p79n202J057l012m397K024
$$ 17828 15187 17820 10235 4799 7923 11133 2039 -680 5235 4456 -746 311 -2701 -7098 -5074
6683e074N077j781l612o792k351M421J0077O332m541p322N02l962m09P843L977
$$ -5074 3 -1778 -5390 -12182 -14533 -10112 -35 6297 1756 -5566 -5064 -9026 -9435 -1592 2385
6668B385o27k954M821N800l369l487p932j520J951J0140l141r531l311K0206K820
$$ 2385 1758 -1196 3625 9425 6056 2569 -5363 -6883 -4932 5208 2067 -7464 -10775 9431 12251
6653A2251j0435J099M467Q867j0985n236q10l211K402j801PO814j735M371O974
$$ 12251 1816 2915 7382 16249 5264 28 -782 -3993 -1591 -3392 -3385 3429 1694 6065 13039
6638A3039k705O621P293m606q74j793q47q866l578L174R83r700N138K428n226
$$ 13039 10334 16955 24248 19642 18768 16975 16128 7262 3684 6858 7841 -1859 3279 5707 481
6623D81l862j2j135N203L066N79k208p049O742J239K75j1910n883J422O234R284
$$ 481 -3381 -3393 -4528 675 3741 4320 2112 -4937 1805 3044 3319 -8591 -14474 -13052 -6818 2466
6607B466j827o622j243R85N009n451l610n66R843J0665r177r564l17K977N743
$$ 2466 639 -5983 -7226 -6241 -1232 -6683 -10293 -10859 -1016 9649 472 -9092 -9409 -6432 -689
6592f89L514k141L173R114m079q937j128P851Q468M703n999r787N492M476Q246
$$ -689 2825 684 3857 12971 8892 -45 -1173 6678 15146 19849 13850 4063 9555 14031 22277
6577B2277o789r240J105q358J968Q228N267l430j4261r018O235j111N109n494
$$ 22277 15488 6248 7353 -1005 963 9191 14458 11028 -3233 -12251 -6016 -7127 -2018 -7512
6563g512o930Q384M523R70m318M929K63J416m503l205J0402N518r86j649K104
$$ -7512 -14442 -6058 -1535 -565 -4883 46 309 1725 -2778 -5983 4419 9937 8951 7302 9406
6548I406p346j118P773l515j550J1308k158j2581K986J9028J6297j009j3806r172
$$ 9406 2060 942 8715 5200 3650 14958 12800 219 3205 22233 38530 37521 23715 14543
6534A4543N96J977j1382p631J37m74r52M528L511n734p62L666k30Q10L966n254
$$ 14543 15139 17116 5734 -1897 -1760 -2234 -3186 1342 4853 -881 -1643 2023 1793 2603 6569 1315
6518A315N2L976P055O482N164k615j0388m409L596L069P28l102l822p537L389
$$ 1315 1367 5343 12398 18880 24044 21429 11041 6632 10228 13297 14025 10923 7101 -436 2953
6503B953Q298j2570l376K318O144j052n617L066n213r01J0970m166L612Q634l515
$$ 2953 11251 -1319 -4695 -2377 3767 2715 -2902 164 -5049 -5950 5020 854 4466 13100 9585
6488I585p435M471k181j873j930k717M44J193J896P101J581j6180K03O117j511
$$ 9585 2150 6621 4440 2567 637 -2080 -1636 -443 1453 8554 10135 -6045 -5842 275 -1236
6473a236N337K536n489M492K876k214p695p261m722K662r302O786R958M661N778
$$ -1236 4101 6637 1148 5640 8516 6302 -1393 -8654 -13376 -10714 -20016 -13230 -3272 1389 7167
6458G167Q299K815o4r960j3673o523O611K764j52P565j151q333p98K590m950M266
$$ 7167 15466 18281 18217 8257 -5416 -11939 -5328 -2564 -2716 4849 3698 -4635 -5433 -2843 -7793 -3527
6442c527O029O159q18j832j499n368J986J678j70n641R3j142J881K394o23l703
$$ -3527 2502 8661 7843 6011 4512 -856 1130 2808 2638 -3003 -2910 -4052 -2171 223 -400 -4103
6426d103N376J793N915p456k127K299j08l45k944l586N60N504q206m796n441P181
$$ -4103 1273 3066 8981 1525 -602 1697 1589 1244 -1700 -5286 -4726 778 -7428 -12224 -17665 -10484
6410a0484O109L232M361o472q052j73N538J1474K191M418L397j4760k783N944
$$ -10484 -4375 -1143 3218 -3254 -11306 -11479 -5941 5533 7724 12142 15539 779 -2004 3940
6396C940l806n983j0675k019L521l20J096O693p21j48J807J653J396R028m83j246
$$ 3940 134 -5849 -16524 -18543 -15022 -15342 -14246 -7553 -8274 -8422 -6615 -4962 -3566 5462 4979 3733
6380C733j0161J02P758n104j1994j1117P451L029Q388M868j4J662l022R450r48
$$ 3733 -6428 -6326 1432 -3672 -15666 -26783 -19332 -16303 -7915 -3047 -3061 -1399 -4421 5029 4081
6365D081m212m416L520k713q39P365R462K027j7198j840k416j092k84n642R543
$$ 4081 -131 -4547 -1027 -3740 -4579 2786 12248 14275 -2923 -4763 -7179 -8271 -8555 -14197 -4654
6350d654P673M353n184o047L846l480l815rL709k447l508M028J0815k567o254
$$ -4654 3019 7372 2188 -3859 -13 -3493 -7308 -7317 -3608 -6055 -9563 -5535 5280 2713 -3541
6335c541K450M820L001J310J037n202p037r838j584P342Q037j3346L158O219M00
$$ -3541 -1091 3729 6730 8040 9077 3875 -3162 -13000 -14584 -7242 795 -12551 -9393 -3174 -2774
6320b774K274K038j420m190l03K237L606l014k065k49q83K183L489J872J50L190
$$ -2774 -500 1538 118 -4072 -4375 -2138 1468 -1546 -3611 -3860 -4743 -2560 929 2801 2951 6141
6304F141j39j1853j1957R727N26K746k261n78K753l008m369Q784l457o807k898
$$ 6141 6002 -5851 -17808 -8081 -7555 -4809 -7070 -7648 -4895 -7903 -12272 -3488 -6945 -13752 -16650
6289a6650K281L909K282o31J9074p07o899n941j112n741J550L92j071j770k0J113
$$ -16650 -14369 -10460 -8178 -8809 10265 9558 2659 -3282 -4394 -10135 -8585 -8193 -9264 -11034 -11054 -9941
6273i941L070N353j678j700O92l593J715l112m37m740l814j680J922J5320J017
$$ -9941 -6871 -1518 -3196 -4896 -4204 -7797 -6082 -9194 -9631 -14371 -18185 -19865 -17943 -2623 -1606
6258a606o001p993L162J419K469J1395M684m305k407j0570m199l162K779O611
$$ -1606 -7607 -15600 -12438 -11019 -8550 2845 7529 3224 817 -9753 -13952 -17114 -14335 -7724
6244g724N990J712j155j0337l442O108m101J998p017J806J0150l825n434M846
$$ -7724 -1734 -22 -1177 -11514 -14956 -8848 -12949 -10951 -17968 -16162 -6012 -9837 -15271 -10425
6230a0425L732l184L487K40l909L505J2631k188m109l818J903M646l059N99L615
$$ -10425 -6693 -9877 -6390 -6150 -10059 -6554 6077 3889 -220 -4038 -2135 2511 -548 51 3666
6215C666K659l941k174n074k153j701J712N893l75j4104J189Q789M596N432j781
$$ 3666 6325 2384 210 -4864 -7017 -8718 -7006 -1113 -1488 -15592 -14403 -5614 -1018 4414 2633
6200B633j1639o07J901j3446M17Q460M155k60O501P832j3983k868k109n661L473
$$ 2633 -9006 -9613 -7712 -21158 -20741 -12281 -8126 -8386 -1885 5947 -8036 -10904 -13013 -18674 -15201
6185a5201Q86N670L502J813o501o953M423J3184j490m930L960N026K084k250P882
$$ -15201 -14315 -8645 -5143 -3330 -9831 -16784 -12361 823 -667 -5597 -1637 3389 5473 3223 11105
6170A1105L349j4748j815m65J214J3768Q015p972l004j713r966q844j318K321
$$ 11105 14454 -294 -2109 -2574 -1360 12408 20423 12451 9447 7734 -2232 -11076 -12394 -10073
6156a0073R62O881Q298L179n378p929M677L712L697J974J107N70K814J230m322
$$ -10073 -9111 -2230 6068 9247 3869 -4060 617 4329 8026 10000 11107 11677 14491 15721 11399
6141A1399k758L007P465q560r412j832m377m388J0k432N986J1114J0388n059n725
$$ 11399 8641 11648 19113 10553 1141 -691 -5068 -9456 -9446 -11878 -5892 5222 15610 10551 4826
6126D826r26k409k228r067J1007J169j5001N684N239K294J0253j019p424m405
$$ 4826 3900 1491 -737 -9804 1203 2372 -12629 -6945 -1706 588 10841 9822 2398 -2007
6112b007M566o122j1921n167j059k475L157P330P971L284K31K968m222o774m73
$$ -2007 2559 -3563 -15484 -20651 -21710 -24185 -21028 -13698 -5727 -2443 -2212 756 -3466 -10240 -10713
6097a0713J078j08K779L493L359l944K656P36k993m906O733M151L572n35Q44n628
$$ -10713 -9635 -9743 -6964 -3471 -112 -4056 -1400 -664 -3657 -8563 -1830 2321 5893 5358 6202 574
6081E74l354l392n311m739J896Q578j099r346j186J215r10j318J7133r36j2530
$$ 574 -2780 -6172 -11483 -16222 -14326 -5748 -6847 -16193 -17379 -16164 -17074 -18392 -1259 -2195 -14725
6066a4725N069Q324J922O77L381K335J658O341N72l216O24L58M346q962r884j7481
$$ -14725 -9656 -1332 590 1267 4648 6983 8641 14982 15554 12338 12962 13320 17666 8704 -1180 -18661
6050a8661K046K682Q57L680M844L178N946O120m484j460k03O307o956q289p477
$$ -18661 -16615 -13933 -13076 -9396 -4552 -1374 4572 10692 6208 4748 4545 10852 3896 -4393 -11870
6035a1870k90K927J666L446O87Q700m366r588j2572L683R380l433M959M798k976
$$ -11870 -12160 -9233 -7567 -4121 -3434 5266 900 -8688 -21260 -17577 -8197 -11630 -6671 -1873 -4849
6020d849J079N924M818j903L450j1643m010K527n308j856K881J1360J067J322
$$ -4849 -3770 2154 6972 5069 8519 -3124 -7134 -4607 -9915 -11771 -8890 2470 3537 4859
6006D859l138l628n354j018J268k140R327M796O494P45k03p760N129J2820J338
$$ 4859 1721 -1907 -7261 -8279 -7011 -9151 176 4972 11466 12211 12008 4248 9377 22197 23535
5991B3535r135q787o574j911M825P586o472j5391m748M446L312Q33R223j0384
$$ 23535 14400 5613 -961 -2872 1953 9539 3067 -12324 -17072 -12626 -9314 -8481 742 -9642
5977i642k257N114k204J1415P539l714m419j21L529P96J015m713m929r22J711
$$ -9642 -11899 -6785 -8989 2426 9965 6251 1832 1711 5240 6036 7051 2338 -2591 -3513 -1802
5962a802j22O250L189J617j2550n429P892J737R179o819q951j5321o856K314K440
$$ -1802 -1924 4326 7515 9132 -3418 -8847 -955 782 9961 3142 -5809 -21130 -27986 -25672 -23232
5947b3232Q893J6052J8137j856j3215j3589J408j063J2901Q693p497j619j560
$$ -23232 -14339 1713 19850 17994 4779 -8810 -7402 -8465 4436 13129 5632 4013 2453
5934B453p619q520m694N152j263l26P137R603j636j541p540M295r2L678J511n985
$$ 2453 -5166 -13686 -18380 -13228 -14491 -14817 -7680 1923 287 -1254 -8794 -4499 -4591 -913 598 -5387
5918e387k22M870K410N160O009j708l185l814L897j3587o485P434L258j568K684
$$ -5387 -5609 -739 1671 6831 12840 11132 7947 4133 8030 -5557 -12042 -4608 -1350 -2918 -234
5903b34M329K105K787q338K524o457m715p73N668R10j788J1174N301n784O51J327
$$ -234 4095 6200 8987 649 3173 -3284 -7999 -8772 -3104 -2194 -3982 7192 12493 6709 7360 8687
5887H687q398P76j059l043M0N41m92l688K56J1604N33m794n160o084q765n288
$$ 8687 289 1065 6 -3037 -2997 -2456 -2948 -6636 -6380 5224 5757 963 -4197 -10281 -19046 -24334
5871b4334M948M069J26j236j573Q25M717R466J643m331J648K05k603M914r72k041
$$ -24334 -19386 -15317 -15191 -16427 -18000 -17175 -12458 -2992 -1349 -5680 -4032 -3827 -6430 -1516 -2488 -4529
5855d529K69K818j568J057M315r08l096l518l36o903l820J919M245L559q819p12
$$ -4529 -4260 -1442 -3010 -1953 2362 1454 -1642 -5160 -5496 -12399 -16219 -14300 -10055 -6496 -15315 -16027
5839a6027n387J762O083j30l902J0080R730J251j868l467O685M188j134j1164
$$ -16027 -21414 -19652 -13569 -13699 -17601 -7521 2209 3460 1592 -1875 4810 8998 7864 -3300
5825c300j1814L925O375R78k230j480K148o973r189J001N308l891K357J1478j539
$$ -3300 -15114 -11189 -4814 -3836 -6066 -7546 -5398 -12371 -21560 -20559 -15251 -19142 -16785 -5307 -6846
5810f846n816n480O6l807m669M032P327L928O10O751j934k287O354L51l697R40
$$ -6846 -12662 -18142 -18076 -21883 -26552 -22520 -15193 -11265 -10655 -3904 -5838 -8125 -1771 -1420 -5117 -4177
5794d177k231m674O47j911J5284J1549p745j7319k188K718M150N291o082n523
$$ -4177 -6408 -11082 -10435 -12346 2938 14487 6742 -10577 -12765 -10047 -5897 -606 -6688 -12211
5780a2211M609P887m01k238P681N118n952o689n999m558M517N693N058m783k647
$$ -12211 -7602 285 -116 -2354 5327 10445 4493 -2196 -8195 -12753 -8236 -2543 2515 -2268 -4915
5765d915n57o105K719J3887P573n646j0045m129l448m586K753k471N970Q8o435
$$ -4915 -5472 -11577 -8858 5029 12602 6956 -3089 -7218 -10666 -15252 -12499 -14970 -9000 -8912 -15347
5750a5347q06N108l332l010l892N964R587p89K418q177p760M062P466Q48N878
$$ -15347 -16153 -11045 -14377 -17387 -21279 -15315 -5728 -6517 -4099 -12276 -20036 -15974 -8508 -7660 -1782
5735a782M044m00j368r543Q50N57O606O162R06k505On303J46J329N194k081o541
$$ -1782 2262 1862 494 -9049 -8199 -7642 -1036 5126 6032 3527 3533 -1770 -1624 -295 4899 2818 -3723
5718c723l125j800j395N825R95L776o7o452K877R35M891j756m136n777L88m25
$$ -3723 -6848 -8648 -10043 -4218 -3223 553 486 -5966 -3089 -2154 2737 981 -3155 -8932 -8544 -8969
5702h969J827N314L061l553J473L469O743M740k888j2410j2339o230M273R044
$$ -8969 -7142 -1828 1233 -2320 -847 2622 9365 14105 11217 -1193 -13532 -19762 -15489 -6445
5688f445J413q662L066K121k565p658Q46l511P494j397j593N56J1324R135p393
$$ -6445 -5032 -13694 -10628 -8507 -11072 -18730 -17884 -21395 -13901 -15298 -16891 -16335 -5011 4124 -3269
5673c269o747j362O735K668q788q876K663p94J256J2200N291P925L818j508q81
$$ -3269 -10016 -11378 -4643 -1975 -10763 -19639 -16976 -17770 -16514 -4314 977 8902 12720 11212 10331
5658A0331m412o283o885L771k4J764N57j4702J2549J0582r396j2509k706J2358
$$ 10331 5919 -364 -7249 -3478 -3502 -1738 -1181 -15883 -3334 7248 -2148 -14657 -17363 -5005
5644e005Q829K422K369p808j2143l215Q635K274l243L815M980p573j8099J411
$$ -5005 3824 6246 8615 807 -11336 -14551 -5916 -3642 -6885 -3070 1910 -5663 -23762 -22351
5630b2351R171J97k770N160R776J22M20M686p875o311n521j297N239P677M017
$$ -22351 -13180 -12983 -15753 -10593 -817 -695 -275 4411 -3464 -9775 -15296 -16593 -11354 -3677 340
5615C40p988j25N779j480m560N107L050m79J622n143J552J889N940P056r856j1636
$$ 340 -7648 -7773 -1994 -3474 -8034 -2927 123 -356 1266 -3877 -2325 -436 5504 12560 2704 -8932
5599h932N465M331m728N056K234r140k216K150J05K125n416k416J927R60R395
$$ -8932 -3467 864 -3864 1192 3426 -5714 -7930 -5780 -5675 -3550 -8966 -11382 -9455 -8495 900
5584I00M322k324J450j645O050O958P7r071j551O142j170L606k760o046j0277
$$ 900 5222 2898 4348 2703 8753 15711 15788 6717 5166 11308 10138 13744 10984 4938 -5339
5569e339k579Q651K561l074J766M60L459m228j690j0396O693L724k692k885l963
$$ -5339 -7918 733 3294 220 1986 2446 5905 1677 -13 -10409 -3716 8 -2684 -5569 -9532
5554i532j113K769N478m363k828j923K432M654j947j728n203K826J427j40m58
$$ -9532 -10645 -7876 -2398 -6761 -9589 -11512 -9080 -4426 -6373 -8101 -13304 -10478 -9051 -9191 -9649
5539i649l790q353j673M546j189k73m313J1601J1873l483Q54M658o79n747q52
$$ -9649 -13439 -21792 -23465 -18919 -20108 -20381 -24694 -13093 -1220 -4703 -3849 809 130 -5617 -6469
5524f469L829N628K326r372p66Q458O897o061p61L158j0584j0656k215j990L871
$$ -6469 -2640 2988 5314 -4058 -4824 3634 10531 4470 3709 6867 -3717 -14373 -16588 -18578 -14707
5509a4707J4215N909j0856l591o341n854L646N417Q727J3422L440k330j732j1073
$$ -14707 -492 5417 -5439 -9030 -15371 -21225 -17579 -12162 -3435 9987 13427 11097 9365 -1708
5495a708n378N404J245Q22l34m504O346J31n339q027o341M29L580N587M99N76
$$ -1708 -7086 -1682 -437 385 51 -4453 1893 2024 -3315 -11342 -17683 -17254 -13674 -8087 -7588 -7012
5479g012L485p51j323K044O463j481l118n324P26Q370n816o927K708J4951N543
$$ -7012 -3527 -4278 -5601 -3557 2906 1425 -1693 -7017 -6291 2079 -3737 -10664 -7956 6995 12538
5464A2538k287j1654k495J542M199k414J268N705M657o401m579O034k811L14k418
$$ 12538 10251 -1403 -3898 -2356 1843 -571 697 6402 11059 4658 79 6113 3302 3616 1198
5449A198Q887M189q485j091p365Q64M709j688n355m318k676q796j74O289Q399
$$ 1198 10085 14274 5789 4698 -2667 -1803 2906 1218 -4137 -8455 -11131 -19927 -20101 -13812 -5413
5434e413J0833M34K485n847k80N032l927o373o055Q839R285j2494K351M711J384
$$ -5413 5420 5854 8339 2492 2212 7244 3317 -3056 -9111 -272 9013 -3481 -1130 3581 4965
5419D965r302K340j2142j590N661Q30P573K292k327m985n550l83K737J782k981
$$ 4965 -4337 -1997 -14139 -15729 -10068 -9238 -1665 627 -1700 -6685 -12235 -12618 -9881 -8099 -11080
5404a1080l157j04Q18N171M078p693n410J2370J028j1485m438N136Q193Q306k597
$$ -11080 -14237 -14341 -13523 -8352 -4274 -11967 -17377 -5007 -3979 -15464 -19902 -14766 -6573 1733 -864
5389h64M091M402K829l803l589K350K764l700l733k209j008M530J27P732r074
$$ -864 3227 7629 10458 6655 3066 5416 8180 4480 747 -1462 -2470 2060 2187 9919 845
5374H45k0534k833N455l78L479O967R716M044k18L80J925o791L246M715q720n749
$$ 845 -19689 -22522 -17067 -17445 -13966 -6999 2717 6761 6543 6923 8848 2057 5303 10018 1298 -4451
5358d451K741M940J1538n65o996m944n038p745k388L366P984L731j548o495M930
$$ -4451 -1710 3230 14768 14203 7207 2263 -2775 -10520 -12908 -9542 -1558 2173 625 -5870 -940
5343i40j692o903k198N299L37O297M46m458m261p109M467O159L280L70k686N49
$$ -940 -2632 -9535 -11733 -6434 -6097 200 646 -3812 -8073 -15182 -10715 -4556 -1276 -906 -3592 -3043
5327c043l31O829j5322n681J4267J446N161O087J784l777j399L074J038k0569
$$ -3043 -3374 3455 -11867 -17548 -3281 -1835 3326 9413 11197 7420 6021 9095 10133 -10436
5313a0436j737l738o542K193N174l552o391k301L253K580J4802Q331J58J0639
$$ -10436 -12173 -15911 -22453 -20260 -15086 -18638 -25029 -27330 -24077 -21497 -6695 1636 1794 12433
5299A2433j081j0570k60l219l595P040o886p803q79j644N324L191k571m340J921
$$ 12433 11352 782 522 -2697 -6292 748 -6138 -13941 -14820 -16464 -11140 -7949 -10520 -14860 -12939
5284a2939K612l488m445k064M821L947P954L93l831N252N104K533q88l339l109
$$ -12939 -10327 -13815 -18260 -20324 -15503 -11556 -3602 -3209 -7040 -1788 3316 5849 4961 1622 -1487
5269a487n738O258j021r824l119K001J881L896K549K825K342q000N795O339N689
$$ -1487 -7225 -967 -1988 -11812 -14931 -12930 -11049 -7153 -4604 -1779 563 -7437 -1642 4697 10386
5254A0386J979M644m464k691p109n028k560P410l54r494m807r44M380K483O486
$$ 10386 12365 17009 12545 9854 2745 -2283 -4843 2567 2213 -7281 -12088 -13032 -8652 -6169 317
5239C17l748r637n513m390m886J0559J0301o84l857M672j000P610n24N5j281l427
$$ 317 -3431 -13068 -18581 -22971 -27857 -17298 -6997 -7681 -11538 -6866 -7866 -256 -780 -725 -2006 -5433
5223e433j461m951k751N14N414P04j674M711Q489o200j860q380O20M999m628K952
$$ -5433 -6894 -11845 -14596 -14082 -8668 -7964 -9638 -4927 3562 -2638 -4498 -12878 -12258 -7259 -11887 -8935
5207h935P558n951l953j533K95N490O910P85k894K322O58k222Q472P851n532k500
$$ -8935 -1377 -7328 -11281 -12814 -12519 -7029 -119 666 -2228 94 752 -1470 7002 14853 9321 6821
5191F821j669k92P54p005j7824n454O341j013o0j511R100N932P00R815N860p767
$$ 6821 5152 4860 5614 -1391 -19215 -24669 -18328 -19341 -19401 -20912 -11812 -5880 -5180 4635 10495 2728
5175B728n86q607J297Q121M274p5j0198j894n51L637l117k714l365L537N367m873
$$ 2728 2142 -6465 -5168 2953 7227 7152 -3046 -4940 -5491 -1854 -4971 -7685 -11050 -7513 -2146 -7019
5159g019R05J918r23r09K98O349P998K121O707l787o166o20j973J877J772k697
$$ -7019 -6114 -4196 -5119 -6028 -5730 619 8617 10738 17445 13658 7492 6872 4899 6776 8548 5851
5143E851k876o64p401j787k384P198J2689N50j5125l326q607p705j594Q274J034
$$ 5851 2975 2311 -5090 -6877 -9261 -2063 10626 11176 -3949 -7275 -15882 -23587 -25181 -16907 -15873
5128a5873p10N464K464l617j921k106P246J533j987k574n266m604M45M300M77
$$ -15873 -16583 -11119 -8655 -12272 -14193 -16299 -9053 -7520 -9507 -12081 -17347 -21951 -21506 -17206 -16729
5113a6729M88J1097Q560k57L976O400M14l974m120l398p14j6373l551M842Q647
$$ -16729 -16241 -5144 3416 3159 7135 13535 13949 9975 5855 2457 1743 -14630 -18181 -13339 -4692
5098d692k343N43k904L902N537N134L424q825K071m231k0928M22Q969N209m52
$$ -4692 -7035 -6492 -9396 -5494 43 5177 8601 -224 1847 -2384 -23312 -22890 -13921 -8712 -9164
5083i164M972N077M183l85K209k758J244K03L398p086N37M709j465n060L121K026
$$ -9164 -4192 885 5068 4683 6892 4134 5378 5581 8979 1893 2430 7139 5674 614 3735 5761
5067E761l487j1306J771J3384L330m37K607o877j1900M708Q532k964m29o374m903
$$ 5761 2274 -9032 -7261 6123 9453 9016 11623 4746 -7154 -2446 6086 3122 2693 -3681 -8584
5052h584l310M911O715n856q832L970N890N12M485M361K356Q246M266o022q828
$$ -8584 -11894 -6983 -268 -6124 -14956 -10986 -5096 -4584 -99 4262 6618 14864 19130 13108 4280
5037D280k658n247j874k937l797M030J027M56K956N535L821K168m797J011J132
$$ 4280 1622 -3625 -5499 -8436 -12233 -8203 -7176 -6720 -3764 1771 5592 7760 2963 3974 5106
5022E106j0157o216k760L477P718P072j0897j0959j931N941N896J4405J0721n327
$$ 5106 -5051 -11267 -14027 -10550 -2832 4240 -6657 -17616 -19547 -13606 -7710 6695 17416 12089
5008A2089j2158L554J783l240j745j530j557j2219q65R326k751J94L356n390l896
$$ 12089 -69 3485 5268 2028 283 -1247 -2804 -15023 -15888 -6562 -9313 -9119 -5763 -11153 -15049
4993a5049M076l354m222Q830M688k218J725J043M231M116K041j9262j3112J1325
$$ -15049 -10973 -14327 -18549 -9719 -5031 -7249 -5524 -4481 -250 3866 5907 -13355 -26467 -15142
4979a5142J1388k179J649q208O419o412r425P455K794j551r718L184K74K310Q402
$$ -15142 -3754 -5933 -4284 -12492 -6073 -12485 -21910 -14455 -11661 -13212 -22930 -19746 -19472 -17162 -8760
4964h760K361q685m451M285Q726M055L508n642k42M535q61k133P560j441J222
$$ -8760 -6399 -15084 -19535 -15250 -6524 -2469 1039 -4603 -4845 -310 -1171 -3304 4256 2815 4037
4949D037m929k271k918J797K74l703o493n58J0172N183l38j2645N003P63m18K047
$$ 4037 -892 -3163 -6081 -4284 -4010 -7713 -14206 -14764 -4592 591 253 -12392 -7389 -6626 -7044 -4997
4933d997J012k854q099j1901J127N553Q134k834J903L888r52L314o905j985R933
$$ -4997 -3985 -6839 -14938 -26839 -25712 -20159 -12025 -14859 -12956 -9068 -10020 -6706 -13611 -15596 -5663
4918e663J957k780n104J2678J000k467j973j677m988K178J3916O544q404j5918
$$ -5663 -3706 -6486 -11590 1088 2088 -379 -2352 -4029 -9017 -6839 7077 13621 5217 -10701
4904a0701n645N899J2525j544P434j035m262j334j784M7n453j144L575p770L435
$$ -10701 -16346 -10447 2078 534 7968 6933 2671 1337 -447 -400 -5853 -6997 -3422 -11192 -7757
4889g757M897N078m325k635p40J789l052l748L186R029J0731M198j0507r151j1017
$$ -7757 -2860 2218 -2107 -4742 -5482 -3693 -6745 -10493 -7307 1722 12453 16651 6144 -3007 -14024
4874a4024N573J764k634K848J2888J259R39O38q88p265J018n819m45j156j148
$$ -14024 -8451 -6687 -9321 -6473 6415 7674 8613 9251 8363 1098 2116 -3703 -4148 -5304 -6452
4859f452N176k8J088o386K493j253K966q50J778K242R580r361p999p703P505J0567
$$ -6452 -1276 -1304 -216 -6602 -4109 -5362 -2396 -3246 -1468 774 10354 993 -7006 -14709 -7204 3363
4843C363N68k121M14J467L409p618o519K912k981N463R185j724j859R163m332
$$ 3363 3931 1810 2224 3691 7100 -518 -7037 -4125 -7106 -1643 7542 5818 3959 13122 8790
4828H790o650j0283n595r66J400Q610O257l955q121j02J549O955L673K620j0482
$$ 8790 2140 -8143 -13738 -14704 -13304 -4694 1563 -2392 -10513 -10615 -9066 -2111 1562 4182 -6300
4813f300M117l146q33K99l799Q081j0163K269J2116M002l347r498J349m028J344
$$ -6300 -2183 -5329 -6162 -5863 -9662 -1581 -11744 -9475 2641 6643 3296 -6202 -4853 -8881 -7537
4798g537R199M553P961Q03q972l812m906k702J470r47m461J40R662j758r399N64
$$ -7537 1662 6215 14176 14979 6007 2195 -2711 -5413 -3943 -4890 -9351 -9211 451 -1307 -10706 -10142
4782a0142J1015O290l003m674o406K684r153O245L867n41P520J109Q77m737n529
$$ -10142 873 7163 4160 -514 -6920 -4236 -13389 -7144 -3277 -3818 3702 4811 5688 951 -4578
4767d578m584m467J5712J1318j0037l206K651O187O047J670p214q772j0202p37
$$ -4578 -9162 -13629 2083 13401 3364 158 2809 8996 15043 16713 9499 727 -9475 -10212
4753a0212m555Q01Q702L252O848p69p28N952o23M910o698l535o44M321k423m229
$$ -10212 -14767 -13966 -5264 -2012 4836 4067 3339 9291 8668 13578 6880 3345 2701 7022 4599 370
4737C70o547k045P887K420j431k086m347k346J2939Q470j3572k909N351L926K040
$$ 370 -6177 -8222 -335 2085 654 -1432 -5779 -8125 4814 13284 -288 -3197 2154 6080 8120
4722H120o169P10Q32k2n224q101Q06l440K599P471k678j893l028Q37L873j176
$$ 8120 1951 2661 3493 3471 -1753 -9854 -9048 -12488 -9889 -2418 -5096 -6989 -10017 -9180 -5307 -6483
4706f483l015l076J27L878n814p10Q251J3019J117M260j1286j2784m864J0696
$$ -6483 -9498 -12574 -12447 -8569 -14383 -15093 -6842 6177 7294 11554 268 -12516 -17380 -6684
4692f684M784J386l801k019K963R477m074m004K778j705j695l302l56P973o269
$$ -6684 -1900 -514 -4315 -6334 -3371 6106 2032 -1972 806 -899 -2594 -5896 -6252 1721 -4548
4677d548l089K326n365M011P295L145o660J539R168L901o020j637l898n896L480
$$ -4548 -7637 -5311 -10676 -6665 630 3775 -2885 -1346 7822 11723 5703 4066 168 -5728 -2248
4662b248k508r483j510L799k921n510n456J791O962R968J0747J2443j862p694
$$ -2248 -4756 -14239 -15749 -11950 -14871 -20381 -25837 -24046 -17084 -7116 3631 16074 14212 6518
4648F518r054K044M390J595J909l437r268m695M935o431M641Q341Q674n914j1981
$$ 6518 -2536 -492 3898 5493 7402 3965 -5303 -9998 -5063 -11494 -6853 1488 10162 4248 -7733
4633g733m411N36j2126J507J028R489J024k730M283K514L879n028r925J451P425
$$ -7733 -12144 -11608 -23734 -22227 -21199 -11710 -10686 -13416 -9133 -6619 -2740 -7768 -17693 -16242 -8817
4618h817N729O123l263j0801Q192L586N97n423l598J0976P800n37n359L664M544
$$ -8817 -3088 3035 -228 -11029 -2837 749 1346 -4077 -7675 3301 11101 10564 5205 8869 13413
4603A3413P21j9064o540o01L954M553r32n229r124J090N138R377j264n955m96
$$ 13413 14134 -4930 -11470 -12071 -8117 -3564 -4496 -9725 -18849 -17759 -12621 -3244 -4508 -10463 -10959
4588a0959N608J192j302M828K692J562q628J378j2311k232J7080M32o848L421
$$ -10959 -5351 -4159 -5461 -633 2059 3621 -5007 -3629 -15940 -18172 -1092 -660 -7508 -4087
4574d087N456K424r038n612P344J207m800k900M280n692O226J0428n783q255l385
$$ -4087 1369 3793 -5245 -10857 -3513 -2306 -7106 -10006 -5726 -11418 -5192 5236 -547 -8802 -12187
4559a2187J962N967J673j2192l616p4M215O024L237j0683j1518M051O412Q586
$$ -12187 -10225 -4258 -2585 -14777 -18393 -18467 -14252 -8228 -4991 -15674 -27192 -23141 -16729 -8143
4545h143l061n133N265L65J258M096j620P84l038N674M262n588j844L335L195
$$ -8143 -11204 -16337 -11072 -10707 -9449 -5353 -6973 -6189 -9227 -3553 709 -4879 -6723 -3388 -193
4530a93P849j1235j2888J1372Q323k775l993L937j906k337m524m711J438L268
$$ -193 7656 -3579 -16467 -5095 3228 453 -3540 397 -1509 -3846 -8370 -13081 -11643 -8375
4516h375O486O504N779k519o950r590m423o207j035j145J3788Q2n731P607R426
$$ -8375 -1889 4615 10394 7875 925 -8665 -13088 -19295 -20330 -21475 -7687 -7605 -13336 -5729 3697
4501C697p84K794J779l026m054m795J180m976m189M744k214n285P674L552n994
$$ 3697 2913 5707 7486 4460 406 -4389 -3209 -8185 -12374 -7630 -9844 -15129 -7455 -3903 -9897
4486i897o630k591R737J0601n949l053M694m068m799M473K602L302m22m408j527
$$ -9897 -16527 -19118 -9381 1220 -4729 -7782 -3088 -7156 -11955 -7482 -4880 -1578 -2000 -6408 -7935
4471g935P472R567L082j1699l596j594O296m174l686n266j6741M434Q270J010
$$ -7935 -463 9104 12186 487 -3109 -4703 1593 -2581 -6267 -11533 -28274 -23840 -15570 -14560
4457a4560L713l809r23k021O642J677k125O545Q685N7O093J455L784o677l589
$$ -14560 -10847 -14656 -15579 -17600 -10958 -9281 -11406 -4861 3824 3881 9974 11429 15213 8536 4947
4442D947j2857o723K585L601j55Q780P081l25o100o87K961q402K468L303p386
$$ 4947 -7910 -14633 -12048 -8447 -8602 178 7259 6934 834 147 3108 -5294 -2826 477 -6909
4427f909P566M037M9O50J471K0252n89j2349n739J270O47j704l909n310M005j3989
$$ -6909 657 4694 4743 5393 6864 27116 26527 14178 8439 9709 10356 8652 4743 -567 3438 -10551
4411a0551j1913M721O149l79r48L455J340L163K782Q575K761K764j0006j3830
$$ -10551 -22464 -17743 -11594 -11973 -12921 -9466 -8126 -4963 -2181 6394 9155 11919 1913 -11917
4397a1917J107M824J1583L376p342r520R490L531M628l281k588L084K024k289
$$ -11917 -10810 -5986 5597 8973 1631 -7889 1601 5132 9760 6479 3891 6975 8999 6710
4383F710R406N636j5682p347L646l458q539P047q71J323N749K88l794P44n149
$$ 6710 16116 21752 6070 -1277 2369 -1089 -9628 -2581 -3452 -2129 3620 3908 114 858 -4291
4368d291j327K980m276k359r603L351K983M361j314O997M238m239J135j017p588
$$ -4291 -5618 -2638 -6914 -9273 -18876 -15525 -12542 -8181 -9495 -2498 1740 -2499 -1364 -2381 -9969
4353i969K084J1828j152o634O456k135L37P195p00M115j0560o750n859j592L108
$$ -9969 -7885 3943 2791 -3843 2613 478 815 8010 7310 11425 865 -5885 -11744 -13336 -10228
4338a0228m158p009L267M769J876m099O38N26N210P618q143m024J317J597K801
$$ -10228 -14386 -21395 -18128 -13359 -11483 -15582 -14944 -14418 -9208 -1590 -9733 -13757 -12440 -10843 -8042
4323h042P502j76O532m042n693M941k667j519P133K613j4043q25O779j353o568
$$ -8042 -540 -716 5816 1774 -3919 1022 -1645 -3164 3969 6582 -7461 -8286 -1507 -2860 -9428
4308i428L578M837N221m931q968L207P602N764q852n146M254Q57O143R32o950
$$ -9428 -5850 -1013 4208 -723 -9691 -6484 1118 6882 -1970 -7116 -2862 -2005 4138 5070 -1880
4293a880M242p099l143J677P5M373p511m013o450k91M997M036N379N427M070j608
$$ -1880 2362 -4737 -7880 -6203 -6128 -1755 -9266 -13279 -19729 -20020 -15023 -10987 -5608 -181 3889 2281
4277B281k855n967r485q812R768k23K629P495N517J494m623n180l273K322l343
$$ 2281 -574 -6541 -16026 -24838 -15070 -15293 -12664 -5169 348 1842 -2781 -7961 -11234 -8912 -12255
4262a2255o701m573M587J0157m859m417K102J3003J024p82l371J758M041o67p628
$$ -12255 -18956 -23529 -18942 -8785 -13644 -18061 -15959 -2956 -1932 -2714 -6085 -4327 -286 -953 -8581
4247h581m034o2K456J2583P186j2148k554L315M134l814O599k667q705j12P987
$$ -8581 -12615 -12677 -10221 2362 9548 -2600 -5154 -1839 2295 -1519 5080 2413 -6292 -6404 1583
4232A583J578L21k656j478m76o444n848m007Q09J47J21k587J2519K428R46L025
$$ 1583 3161 3482 826 -652 -1128 -7572 -13420 -17427 -16618 -16471 -16350 -18937 -6418 -3990 -3044 -19
4216a9l962n687K776K278j691L062P93K940l634o332j732k26k160l645k712N906
$$ -19 -3981 -9668 -6892 -4614 -6305 -3243 -2450 490 -3144 -9476 -11208 -11434 -13594 -17239 -19951 -14045
4200a4045O951P34J0507O540j786p917K257j712j1985J974O289N422m937n728
$$ -14045 -7094 -6360 4147 10687 8901 984 3241 1529 -10456 -8482 -2193 3229 -1708 -7436
4186g436N035l475k607P045L928j0741l163Q770l549J836k068l932L096J1971
$$ -7436 -2401 -5876 -8483 -1438 2490 -8251 -11414 -2644 -6193 -4357 -6425 -10357 -7261 4710
4172D710l37p021n719j089M273O752r196j0416L866R738L537Q954M160o099l396
$$ 4710 4373 -2648 -8367 -9456 -5183 1569 -7627 -18043 -14177 -4439 -902 8052 12212 6113 2717
4157B717K393j999P512J0272l846o539n977J785O692p663q975j868K004j353M152
$$ 2717 5110 3111 10623 20895 17049 10510 4533 6318 13010 5347 -3628 -5496 -3492 -4845 -693
4142f93O93j596n040l291j928J998Q636L021l236R77N805N808j0276m6M978k177
$$ -693 0 -1596 -6636 -9927 -11855 -9857 -1221 1800 -1436 -459 5346 11154 878 832 5810 3633
4126C633p080j196J1131L49n275r350l377O997J1547M607r69j1059O103K258m853
$$ 3633 -3447 -4643 6488 6837 1562 -7788 -11165 -4168 7379 11986 11017 -42 6061 8319 3466
4111C466m363M20J0848K980p366L75m276l338k797j199p305j975J815L62k715
$$ 3466 -897 -477 10371 13351 5985 6360 2084 -1254 -4051 -5250 -12555 -14530 -12715 -12353 -15068
4096a5068J422K019j341p012P503J1587O833o554M309J4626r938l337J311j3523
$$ -15068 -13646 -11627 -12968 -19980 -12477 -890 5943 -611 3698 18324 8386 5049 6360 -7163
4082g163J590K816o141k415M888O758o498L014L821j516n904K977K450N629O825
$$ -7163 -5573 -2757 -8898 -11313 -6425 333 -6165 -3151 670 -846 -6750 -3773 -1323 4306 11131
4067A1131J125n594j4844o21J0408M070O26p5J502o089p787Q84O48k763K538o84
$$ 11131 12256 6662 -8182 -8803 1605 5675 6301 6226 7728 1639 -6148 -5264 -4616 -7379 -4841 -5525
4051e525L155q94j47P523P88L38L412L152l203R513L476p502o817m248n123J467
$$ -5525 -2370 -3264 -3411 4112 4900 5238 8650 11802 8599 18112 21588 14086 7269 3021 -2102 -635
4035f35r695n818J802n086o262R650O972J285o415l76J2164P688L486m469j0146
$$ -635 -10330 -16148 -14346 -19432 -25694 -16044 -9072 -7787 -14202 -14578 -2414 5274 8760 4291 -5855
4020e855M07K438M423L832n879K951Q925p362n787J926j5349M95Q398M235K97
$$ -5855 -5448 -3010 1413 5245 -634 2317 11242 3880 -1907 19 -15330 -14835 -6437 -2202 -1905
4005a905P41K271q035o337L894L312k935Q324K214J7j532n85o688q345j906P706
$$ -1905 -1164 1107 -6928 -13265 -9371 -6059 -8994 -670 1544 1561 29 -556 -7244 -15589 -17495 -9789
3989i789N67j204K959L163O107k275q63K909k069l404K555n750J644m96M024j098
$$ -9789 -9222 -10426 -7467 -4304 1803 -472 -1335 1574 -495 -3899 -1344 -7094 -5450 -5946 -1922 -3020
3973c020q020K270L688l273k556O096O293J173n093R15K149N638r71J0878j681
$$ -3020 -11040 -8770 -5082 -8355 -10911 -4815 1478 2651 -2442 -1527 622 6260 5289 16167 14486
3958A4486k678p417j0514j768P161n88M3o132l743P20P985J288n48M966M470q958
$$ 14486 11808 4391 -6123 -7891 -730 -1318 -1275 -7407 -11150 -10430 -2445 -1157 -1705 3261 7731 -1227
3942a227r226J132o071o545P452K032l809K110J689p80N257J388m990N694L507
$$ -1227 -10453 -9321 -15392 -21937 -14485 -12453 -16262 -14152 -12463 -13243 -7986 -6598 -11588 -5894 -2387
3927b387r996n661J726J004M80M419j149p21P103N089l111J785l933l61K995l823
$$ -2387 -12383 -18044 -16318 -15314 -14834 -10415 -11564 -12285 -5182 -93 -3204 -1419 -5352 -5713 -2718 -6541
3911f541m564O909M817K521k280m013K400J353j529k215L660O825k917o425N647
$$ -6541 -11105 -4196 621 3142 862 -3151 -751 602 -927 -3142 518 7343 4426 -1999 3648
3896C648R19l421l892J405L785m9l383L060J875L445K241j0927q779K827j646
$$ 3648 4567 1146 -2746 -1341 2444 2395 -988 2072 3947 7392 9633 -1294 -10073 -7246 -8892
3881h892j374K230q380n45P726N408o759j109m164J982R0k236rO421J3775L267
$$ -8892 -10266 -8036 -16416 -16961 -9235 -3827 -10586 -11695 -15859 -13877 -13787 -16023 -16032 -9611 4164 7431
3865G431m002p704j0674m048R545P298j833k914j158P2j0796Q35P696K483p16
$$ 7431 3429 -4275 -14949 -18997 -9452 -2154 -3987 -6901 -8059 -7987 -18783 -17948 -10252 -7769 -8485
3850h485L901k568k861J4974J0686K612n046j2632m283P219l682N263k500P36
$$ -8485 -4584 -7152 -10013 4961 15647 18259 13213 581 -3702 3517 -165 5098 2598 3334
3836C334k410l625J91P311J701j360q118l45K389N992j484m897r86M629l401L896
$$ 3334 924 -2701 -2510 4801 6502 5142 -2976 -3321 -932 5060 3576 -1321 -2307 2322 -1079 2817
3820B817K894J22k919J785L648m295k592o032l564P691J1338m835p08j271k86
$$ 2817 5711 5833 2914 4699 8347 4052 1460 -4572 -8136 -445 10893 6058 5350 4079 3793
3805C793K632m856O053P955q955p487r686M767R190n488M61P623L488l668m504
$$ 3793 6425 1569 7622 15577 6622 -865 -10551 -5784 3406 -2082 -1621 6002 9490 5822 1318
3790A318J555m202l474r81K56k473l091j45N204j026l167K828Q041p331m63P866
$$ 1318 2873 -1329 -4803 -5784 -5528 -8001 -11092 -11237 -6033 -7059 -10226 -7398 643 -6688 -7151 715
3774G15Q224j1095o100J65j947L821P402J0606l887p560J524l56k043j928L986
$$ 715 8939 -2156 -8256 -8091 -10038 -6217 1185 11791 7904 344 1868 1512 -531 -2459 1527
3759A527K09O92K674j0771n22P510J607l139j437n586J287n704K335K597N147
$$ 1527 1736 2428 5102 -5669 -6191 1319 2926 -213 -1650 -7236 -5949 -11653 -9318 -6721 -1574
3744a574L16k213l356J644O06O04k928P275n980P372r70n797N405j230J326J675
$$ -1574 -1258 -3471 -6827 -5183 -4577 -3973 -6901 374 -5606 1766 796 -5001 404 -826 500 2175
3728B175p689o897N070M004Q43P37P272j735K566j96j693R73N62k613p466M09
$$ 2175 -5514 -12411 -7341 -3337 -2494 -1757 5515 3780 6346 6150 4457 5430 5992 3379 -4087 -3678
3712c678P401L625j3895o604r132n3J1936O948p04j690M89P773J2366m934j2057
$$ -3678 3723 7348 -6547 -13151 -22283 -22336 -10400 -3452 -4156 -5846 -5357 2416 14782 9848 -2209
3697b209K945K646L212Q470k954m665l554o726r625L210J216j233q90O94N948
$$ -2209 736 3382 6594 15064 12110 7445 3891 -2835 -12460 -9250 -8034 -9267 -10157 -9463 -3515
3682c515k724p176m553O724j672n345L900K110M622J7112L25k216K938k733m80
$$ -3515 -6239 -13415 -17968 -11244 -12916 -18261 -14361 -12251 -7629 9483 9808 7592 10530 7797 7317
3667G317J328r37n95m429j110o041o229K423K796L140O38J836J373R375p061K430
$$ 7317 8645 7708 7113 2684 1574 -4467 -10696 -8273 -5477 -2337 -1699 137 1510 10885 3824 6254
3651F254K406j043q63k539o45j392n497J572r599N075L615p246M360J738K364
$$ 6254 8660 7617 6754 4215 3570 2178 -3319 -1747 -11346 -6271 -2656 -9902 -5542 -3804 -1440
3636a440M15J128j227J281p083l997J137J196Q441l811P882M192Q552k931j490
$$ -1440 -1025 103 -1124 157 -6926 -10923 -9786 -8590 -149 -3960 3922 8114 16666 13735 12245
3621A2245j0404m508J729k384N153J793j054J021k273j98k140n46j0643P851j0499
$$ 12245 1841 -2667 -938 -3322 1831 3624 2570 3591 1318 1120 -1020 -1566 -12209 -4358 -14857
3606a4857M79R590L393l137P045j1852q386M559K440l522J622J0536M254k946
$$ -14857 -14378 -4788 -1395 -4532 2513 -9339 -17725 -13166 -10726 -14248 -12626 -2090 2164 -782
3592g82p618L501j440K759K693l654o38N288l242r898m006M217j363N576J615
$$ -782 -8400 -4899 -6339 -3580 -887 -4541 -5179 109 -3133 -13031 -17037 -12820 -14183 -8607 -6992
3577f992l124L421o25k41N437J0259m334l249n890n412o031J2646P188j602p182
$$ -6992 -10116 -6695 -7320 -7561 -2124 8135 3801 552 -5338 -10750 -16781 -4135 3053 1451 -5731
3562e731k130j39O610j882p793R599L034j283p490o535L714K943r96K053P14n755
$$ -5731 -7861 -8000 -1390 -3272 -11065 -1466 1568 285 -7205 -13740 -10026 -7083 -8079 -6026 -5312 -11067
3546a1067J607J509K655L812J2457j2288k830Q31p445o900J840M028L489J738
$$ -11067 -9460 -7951 -5296 -1484 10973 -1315 -4145 -3314 -10759 -17659 -15819 -11791 -8302 -6564
3532f564N335O131m872o623O781P099K066q201K085j51o437J034L300q707m153
$$ -6564 -1229 4902 30 -6593 188 7287 9353 1152 3237 3086 -3351 -2317 983 -7724 -11877
3517a1877n713O391J1257n212K190J4782k708q302j0726J084J0648l139O54k799
$$ -11877 -17590 -11199 58 -5154 -2964 11818 9110 808 -9918 -8834 1814 -1325 -671 -3470
3503c470m304J056J1563K799L02k715k27o833l768n616M213R089O045k612l461
$$ -3470 -7774 -6718 4845 7644 7946 5231 5004 -1829 -5597 -11213 -7000 2089 8134 5522 2061
3488B061j6164L374J702j606l220M464L730m483K388J9763K455l015j1042l225
$$ 2061 -14103 -10729 -9027 -10633 -13853 -9389 -5659 -10142 -7754 12009 14464 11449 407 -2818
3474b818J07N851l576M28M104K24M28q71n898n19L813J740j1694O03O548j213
$$ -2818 -2711 3140 -436 -8 4096 4320 4748 3877 -2021 -2540 1273 3013 -8681 -8078 -1530 -2743
3458b743O568k505p565j0891K634J1632J2817j962l273L629M380o12l576j882
$$ -2743 3825 1320 -6245 -17136 -14502 -2870 9947 7985 4712 8341 12721 12109 8533 6651
3444F651n873r85M91O017L101j819n399J0163L812j4102r063M436J639q356m403
$$ 6651 778 -207 284 6301 9402 7583 2184 12347 16159 2057 -7006 -2570 -931 -9287 -13690
3429a3690M194P819n30P466j484j2447K833P077Q17J376o952k762L663M515l35
$$ -13690 -9496 -1677 -2207 5259 3775 -8672 -5839 1238 2055 3431 -3521 -6283 -2620 1895 1560
3414A560M044l456l202k374J713O944N108j0051Q78M898j300j3915j192K868m298
$$ 1560 5604 2148 -1054 -3428 -1715 5229 10337 286 1164 6062 4762 -9153 -10345 -7477 -11775
3399a1775j4611n77J2290P903P667R26m093M68J423j195k024J833O070L709j189
$$ -11775 -26386 -26963 -14673 -6770 897 1823 -2270 -1802 -379 -1574 -3598 -1765 4305 8014 6825
3384F825r272k49L336p998J781M846l697M942J483N024m871j5428K831J353J667
$$ 6825 -2447 -2696 640 -7358 -5577 -731 -4428 514 1997 7021 2150 -13278 -10447 -9094 -7427
3369g427Q633k78K139l094n081k713K180j891K38l983j16P049l914Q109Q184j332
$$ -7427 1206 928 3067 -27 -5108 -7821 -5641 -7532 -7294 -11277 -11393 -4344 -8258 -149 8035 6703
3353F703P0M328l799J731q38J930K901o491n818r62n550l790K876J345l830K241
$$ 6703 6773 11101 7302 9033 8195 10125 13026 6535 717 -245 -5795 -9585 -6709 -5364 -9194 -6953
3337f953J253r51q540O063L057K208Q335R581M809o562J849k707n481n686o301
$$ -6953 -5700 -6651 -15191 -9128 -6071 -3863 4472 14053 18862 12300 14149 11442 5961 275 -6026
3322f026m629P486K25l588L218J650k003N362L066L119J498J862n725n006l184
$$ -6026 -10655 -3169 -2944 -6532 -3314 -1664 -3667 1695 4761 7880 9378 11240 5515 509 -2675
3307b675j0867k308M902J349o44r33L424k414M229R827n125j0281j298K267J689
$$ -2675 -13542 -15850 -10948 -9599 -10243 -11176 -7752 -10166 -5937 3890 -1235 -11516 -12814 -10547 -8858
3292h858M475K872r487M430Q264l137L422p845j1784O057R088j633P556P692p525
$$ -8858 -4383 -1511 -10998 -6568 1696 -1441 1981 -5864 -17648 -11591 -2503 -4136 3420 11112 3587
3277C587M596L634P93p789N3m218j1206M628J997N559M638q05n145n947J688o323
$$ 3587 8183 11817 12610 4821 4874 656 -10550 -5922 -3925 1634 6272 5467 322 -5625 -3937 -10260
3261a0260L133J2396N028l166j0562j4732M188J3248P864j082l633n572K69l082
$$ -10260 -7127 5269 10297 7131 -3431 -18163 -13975 -727 7137 6055 2422 -3150 -2881 -5963
3247e963N947J0849O096m677k531r922p764J293r32J503J0950L356L121k730l347
$$ -5963 -16 10833 16929 12252 9721 -201 -7965 -6672 -7604 -6101 4849 8205 11326 8596 5249
3232E249o744k346r435m261O852J3989N366q016k185Q417L374l78o630p161J906
$$ 5249 -1495 -3841 -13276 -17537 -10685 3304 8670 654 -1531 6886 10260 9882 3252 -3909 -2003
3217b003J529M079k868P139O12M134q138M42M367J895q539p587R161K045q267
$$ -2003 -474 3605 737 7876 8488 12622 4484 4926 9293 11188 2649 -4938 4223 6268 -1999
3202a999J075m448O532m459j129M706K740j501o384p342j283J912j432M774K769
$$ -1999 -924 -5372 1160 -3299 -4428 278 3018 1517 -4867 -12209 -13492 -11580 -13012 -8238 -5469
3187e469l42O400P719j932p09k487n378N81o589k564k754P687k09j041L26o21
$$ -5469 -5811 589 8308 6376 5667 3180 -2198 -1617 -8206 -10770 -13524 -5837 -6046 -7087 -6761 -7382
3171g382J414l884l303J314R171M507P22J956J1240L810m544m337l787j1010l751
$$ -7382 -5968 -9852 -13155 -11841 -2670 1837 2559 4515 15755 19565 15021 10684 6897 -4113 -7864
3156g864l417o971L443P211N803m52K752n228J577M413J0942O123l229l68j0008
$$ -7864 -11281 -18252 -14809 -7598 -1795 -2247 505 -4723 -3146 1267 12209 18332 15103 14735 4727
3141D727o355N647J84k232q179j608J0694O095L441K842J91o585q887o062j3372
$$ 4727 -1628 4019 4203 1971 -6208 -7816 2878 8973 12414 15256 15447 8862 -25 -6087 -19459
3126a9459R20R103Q674O822l58j014m846k818j099l663k579J916R10J0747m176
$$ -19459 -18539 -9436 -762 6060 5702 4688 -158 -2976 -4075 -7738 -10317 -8401 -7491 3256 -920
3111i20p165k170n914N49M094j492M29L970M09M550L336L264k960m564o237k613
$$ -920 -8085 -10255 -16169 -15620 -11526 -13018 -12589 -8619 -8210 -3660 -324 2940 -20 -4584 -10821 -13434
3095a3434N233j015J682N979k663k555m904r77L629Q591M020m071o78j705j794
$$ -13434 -8201 -9216 -7534 -1555 -4218 -6773 -11677 -12654 -9025 -434 3586 -485 -1163 -2868 -4662
3080d662P733k395q991Q376J4633P254r093j4076n261L679O790M928j069l755
$$ -4662 3071 676 -8315 61 14694 21948 12855 -1221 -6482 -2803 3987 8915 7846 4091
3066D091k478J1791K548l509m001l328o553m989N655p968q256N529P33O86l424
$$ 4091 1613 13404 15952 12443 8442 5114 -1439 -6428 -773 -8741 -16997 -11468 -10735 -10049 -13473
3051a3473j843P095n264O553r57Q830M365O922Q624q477q729L582N285p508n704
$$ -13473 -15316 -8221 -13485 -6932 -7889 941 5306 12228 20852 12375 3646 7228 12513 5005 -699
3036f99r077o460j333M539l979J114M660k636R495j579L054O777j288j824J2071
$$ -699 -9776 -16236 -17569 -13030 -17009 -15895 -11235 -13871 -4376 -5955 -2901 3876 2588 764 12835
3021A2835J19j3303o836O008O240m513p783K993K430P64N737m123j515l024q243
$$ 12835 12954 -349 -7185 -1177 5063 550 -7233 -4240 -1810 -1046 4691 568 -947 -3971 -12214
3006a2214M088J0570J542J456r456L83O188j288P62J1845K645o020p191q270j1391
$$ -12214 -8126 2444 3986 5442 -4014 -3631 2557 1269 2031 13876 16521 10501 3310 -4960 -16351
2991a6351m975J5296J2946M185l12n206k6j617r853Q422Q646p887k631j999R40
$$ -16351 -21326 -6030 6916 11101 10789 5583 5557 3940 -5913 2509 11155 3268 637 -1362 -422
2976d22k652J078J1057K250j0418j996n531j470l3k153M311j429q015Q50Q400
$$ -422 -3074 -1996 9061 11311 893 -1103 -6634 -8104 -8137 -10290 -5979 -7408 -15423 -14573 -6173
2961f173M226n00k506K267J0247n183q171P602L577j568L632l796K626J504K37
$$ -6173 -1947 -2447 -4953 -2686 7561 2378 -5793 1809 5386 3818 7450 3654 6280 7784 8021
2946H021J06K490m324k358M08j621n330n227O03P063J565L934K606Q394O503j1967
$$ 8021 8127 10617 6293 3935 4343 2722 -2608 -7835 -7232 -169 1396 5330 7936 16330 22833 10866
2930A0866q581q811M221J802r786J153N588j858n170J2412O359p358L164N844
$$ 10866 2285 -6526 -2305 -503 -10289 -9136 -3548 -5406 -10576 1836 8195 837 4001 9845
2916I845Q073m539m104M294N519l364j5898q74O49M908m627r169J283M353M839
$$ 9845 17918 13379 9275 13569 19088 15724 -174 -1048 -399 4509 -118 -9287 -8004 -3651 1188
2901A188J79j716n163k578Q479Q588j3597R062O421P967K83n845j0686L670J368
$$ 1188 1367 -349 -5512 -8090 389 8977 -4620 4442 10863 18830 19113 13268 2582 6252 7620
2886G620k266k181q630K240L203l112N057J0304p274j0927R88R112P364n229J110
$$ 7620 5354 3173 -5457 -3217 -14 -3126 1931 12235 4961 -5966 -4978 4134 11498 6269 7379
2871G379J533M457L06n968l105L81l387L554M322l403r503o503L268K870N272
$$ 7379 8912 13369 13675 7707 4602 4983 1596 5150 9472 6069 -3434 -9937 -6669 -3799 1473
2856A473M200m891K996j744K198P144j1468q349L713p027n706P56O882Q639k661
$$ 1473 5673 782 3778 2034 4232 11376 -92 -8441 -4728 -11755 -17461 -16705 -9823 -1184 -3845
2841c845N22N27J998L564K282m592q72o219j0357j687Q94J2399J0314P973M530
$$ -3845 -3323 -2796 -798 2766 5048 456 -416 -6635 -16992 -18679 -17785 -5386 4928 12901 17431
2826A7431o607j5791n723l551r12O867N107o75K669n880R05o561K391N838J231
$$ 17431 10824 -4967 -10690 -14241 -15153 -8286 -3179 -3854 -1185 -7065 -6160 -12721 -10330 -4492 -3261
2811c261n075M793O233P40o96M894L173r141n882j664j205l533J1444R534L351
$$ -3261 -8336 -3543 2690 3430 2734 7628 10801 1660 -4222 -5886 -7091 -10624 820 10354 13705
2796A3705P518l209j5309j1789j356J2074P266N417J780j0559q236M988p88J178
$$ 13705 21223 18014 2705 -9084 -10440 1634 8900 14317 16097 5538 -2698 2290 1502 2680
2782B680m402M11M028O086j859k600j228r822j311J3090L957r657J530L317j408
$$ 2680 -1722 -1311 2717 8803 6944 4344 3116 -6706 -8017 5073 9030 -627 903 4220 2812
2767B812Q636P689l716k560l237o048n795J125o802q58k298N594o748J647n10
$$ 2812 11448 19137 15421 12861 9624 3576 -2219 -1094 -7896 -8754 -11052 -5458 -12206 -10559 -11069
2752a1069n90J963L454J2164J1011m310n784o783P898K660m784K303k313q0O654
$$ -11069 -11659 -9696 -6242 5922 16933 12623 6839 56 7954 10614 5830 8133 5820 5740 12394
2737A2394J533j030M356K761o113j1118j2832k576L2M364N410O63l758k008Qj184
$$ 12394 13927 12897 17253 20014 13901 2783 -10049 -12625 -12593 -8229 -2819 -2156 -5914 -7922 -7914 -9098
2721i098k324N222P710L368M31M878O061L164r774l504j3312q93M205L771o239
$$ -9098 -11422 -6200 1510 4878 5309 10187 16248 19412 9638 6134 -7178 -8071 -3866 -95 -6334
2706f334r189M841R599Q72k384n914n459P430N785J1911k253o607j383m3J307
$$ -6334 -15523 -10682 -1083 -211 -2595 -8509 -13968 -6538 -753 11158 8905 2298 915 872 2179
2691B179l532M616k503p469M963R601r707o79M803M129j738Q715n741M77R429
$$ 2179 -1353 3263 760 -6709 -1746 7855 -1852 -2531 2272 6401 4663 13378 7637 8114 17543
2676A7543K767O47l522p813k969J788o179L494N5n87L042q879J440m431m913J2121
$$ 17543 20310 20957 17435 9622 6653 8441 2262 5756 5811 5224 8266 -613 827 -3604 -8517 3604
2660C604P727L396k978n180l283j700K539l20J879j0465n228j518N495L418p260
$$ 3604 11331 14727 11749 6569 3286 1586 4125 3805 5684 -4781 -10009 -11527 -6032 -2614 -9874
2645i874R838Q905r96L525r389n320N311j657l713R78J5138J153q566j1505l578
$$ -9874 -36 8869 7873 11398 2009 -3311 2000 343 -3370 -2392 12746 13899 5333 -6172 -9750
2630i750Q110O40j2n354r356N629m376J6970K812q297r640n420j57N401L471L247
$$ -9750 -1640 -1000 -1012 -6366 -15722 -10093 -14469 2501 5313 -2984 -12624 -18044 -18201 -12800 -9329 -6082
2614f082J1965Q194j1208l908R605k985Q32J1537J3403m20j8441m823N707m822
$$ -6082 5883 14077 2869 -1039 8566 5581 6413 17950 31353 30933 12492 7669 13376 8554
2600H554o092j0176j1238L296J726o447k649P640N300j510M080M349R157P229
$$ 8554 2462 -7714 -18952 -15656 -13930 -20377 -23026 -15386 -10086 -11596 -7516 -3167 5990 13219
2586A3219m415n058l880M294J0216m951m82L749L207k636j0342J66m974n080r31
$$ 13219 8804 3746 -134 4160 14376 9425 8943 12692 15899 13263 2921 3087 -1887 -6967 -7898
2571g898m071n716K548P375P602l83p86o193k204Q186r88n976q362N821L888m357
$$ -7898 -11969 -17685 -15137 -7762 -160 -543 -1329 -7522 -9726 -1540 -2528 -8504 -16866 -11045 -7157 -11514
2555a1514O177P00J612J961n472O415j691j2210n808j123M584k9k511K445Q622
$$ -11514 -5337 -4637 -3025 -1064 -6536 -121 -1812 -14022 -19830 -20953 -16369 -16398 -18909 -16464 -7842
2540g842l467L38P481O420l068q153L208M726l210o647p93J1786J332l392n184
$$ -7842 -11309 -10971 -3490 2930 -138 -8291 -5083 -357 -3567 -10214 -11007 779 2111 -1281 -6465
2525f465l091N737N146n733j193O706L631M78P80j903m147R4R711O237k445r394
$$ -6465 -9556 -3819 1327 -4406 -5599 1107 4738 5216 5996 4093 -54 40 9751 15988 13543 4149
2509D149l11K0p778m108Q285J61r722P261K732L73J117k562m984j160N271M037
$$ 4149 3838 3858 -3920 -8028 257 418 -9304 -2043 689 1062 2179 -383 -5367 -6527 -1256 2781
2493B781j430l253j757P154J859j0131l850o12l453j688O977R65k824P533M908
$$ 2781 1351 -1902 -3659 3495 5354 -4777 -8627 -9239 -12692 -14380 -7403 -6438 -9262 -1729 3179
2478C179N59o128m841Q241P103j396j873l649k864M816n438j1704J798r203J0594
$$ 3179 3738 -2390 -7231 1010 8113 6717 4844 1195 -1669 3147 -2291 -13995 -12197 -21400 -10806
2463a0806J5178K809m267o247K737J1867j282j3453N147N148q721L412M459J2384
$$ -10806 4372 7181 2914 -3333 -596 11271 9989 -3464 1683 6831 -1890 1522 5981 18365
2449A8365j799k43l691k337N193K402o565j1807p177J355Q338p015k725j02l40
$$ 18365 16566 16323 12632 10295 15488 17890 11325 -482 -7659 -6304 2034 -4981 -7706 -7808 -8148
2434h148J0731K995m71n120l735J381l529o935O858Q118J3697J505K26q798j774
$$ -8148 2583 5578 5107 -13 -3748 -2367 -5896 -12831 -5973 2145 15842 17347 17573 8775 7001
2419G001n14j507q511O630L091O979M164k132l480m614n699k382j953k592L068
$$ 7001 6487 4980 -3531 3099 6190 13169 17333 15201 11721 7107 1408 -974 -2927 -5519 -2451
2404b451J2015j108j1316K329O661j991r826m410k221R286p278l52M842N198N831
$$ -2451 9564 8456 -2860 -531 6130 4139 -5687 -10097 -12318 -3032 -10310 -10662 -5820 -622 5209
2389E209m224m56l941j912J04j232Q74j077J0884J903j642k895j480L684K626
$$ 5209 985 529 -3412 -5324 -5220 -6452 -5578 -6655 4229 6132 4490 1595 115 3799 6425
2374F425R476J311j2672o757O908l012J55j373j4156N660M580p654j870R385P276
$$ 6425 15901 17212 4540 -2217 4691 1679 1834 461 -13695 -8035 -3455 -11109 -12979 -3594 3682
2359C682m861L453P590N100l978j6214l25j629n554M776J505j409j221j353L357
$$ 3682 -1179 2274 9864 14964 10986 -5228 -5553 -7182 -12736 -7960 -6455 -7864 -9085 -10438 -7081
2344g081M989k146q842j882K412M046O051K571m954r137q84P267L147O145L17
$$ -7081 -2092 -4238 -13080 -14962 -12550 -8504 -2453 118 -4836 -13973 -14857 -7590 -4443 1702 2019
2329B019M192P41k500O75Q37n311J0318J108J750K229j1638j634o583J1043Q644
$$ 2019 6211 6952 4452 5127 5964 653 10971 12079 13829 16058 4420 2786 -3797 7246 15890
2314A5890R214l032j4435n844r893N025M853k24L017o345q781N35K336O075j247
$$ 15890 25104 22072 7637 1793 -8100 -3075 1778 1554 4571 -1774 -10555 -10020 -7684 -1609 -2856
2299b856q547K255M264L772O747J066o258k728P959j88m239q750O094j796j1043
$$ -2856 -11403 -9148 -4884 -1112 5635 6701 443 -2285 5674 5486 1247 -7503 -1409 -3205 -14248
2284a4248M969Q572K726K040r306j621k159M602M929Q762j162o066J528k349K721
$$ -14248 -9279 -707 2019 4059 -5247 -6868 -9027 -4425 504 9266 8104 2038 3566 1217 3938
2269C938j0K734P27k30j2325r913k86J4361Q478m134o759J353N07K914P006k035
$$ 3938 3928 6662 7389 7159 -5166 -15079 -15365 -1004 7474 3340 -3419 -2066 -1559 1355 8361 6326
2253F326o128j141o142j162M378K968n233n00n81p511m738J0640O204N43l853
$$ 6326 198 -943 -7085 -8247 -3869 -901 -6134 -6634 -7215 -14726 -19464 -8824 -2620 -2077 -5930
2238e930n72K324L555n699J367L503m754L082M893m154l428J984Q901J0227R81
$$ -5930 -6502 -4178 -623 -6322 -4955 -1452 -6206 -3124 1769 -2385 -5813 -3829 5072 15299 16280
2223A6280L767l076q894q244j0676N984J6294L544p138q35m66N860l55k271j583
$$ 16280 20047 16971 8077 -167 -10843 -4859 11435 14979 7841 7006 6540 12400 12045 9774 8191
2208H191n202P164m12K480j302j2457K654R366m49q81j1727M90N018o698J953
$$ 8191 2989 10153 9741 12221 10919 -1538 1116 10482 10033 9152 -2575 -2085 2933 -3765 -1812
2193a812L722P40K151M126J460j188l918N569j892j0502m813j036k933j504J0652
$$ -1812 1910 2650 4801 8927 10387 9199 5281 10850 8958 -1544 -6357 -7393 -10326 -11830 -1178
2178a178O951j460K334P04N08K558p766j2981n809k700O678P495j943L486M453
$$ -1178 5773 4313 6647 7351 7859 10417 2651 -10330 -16139 -18839 -12161 -4666 -6609 -3123 1330
2163A330n900j182n051l395j80J0299o445n581O051l254O832P546L642j565l658
$$ 1330 -4570 -5752 -10803 -14198 -14378 -4079 -10524 -16105 -10054 -13308 -6476 1070 4712 3147 -511
2148e11j0856k969J0647J5285Q186n01j271j516q697j0109j811Q640J6n296p552
$$ -511 -11367 -14336 -3689 11596 19782 19281 18010 16494 7797 -2312 -4123 4517 4533 -763 -8315
2133h315q734J948M825O40L611M691m932p215k67O285J0643k738J411J637r836
$$ -8315 -17049 -15101 -10276 -9636 -6025 -1334 -6266 -13481 -13748 -7463 3180 442 1853 3490 -6346
2118f346N959J4026M712k001l386n458L551J65o874L15k179J901l531j0633O168
$$ -6346 -387 13639 18351 16350 12964 7506 11057 11222 4348 4663 2484 4385 854 -9779 -3611
2103c611O405p302n278m107l370J979P917N231l613N033L274o828l117N673o871
$$ -3611 2794 -4508 -9786 -13893 -17263 -15284 -7367 -2136 -5749 -716 2558 -4270 -7387 -1714 -8585
2088h585K99J865R403L064m972J123p728l071O144j0255O047k280k878M39K090
$$ -8585 -8286 -6421 2982 6046 1074 2197 -5531 -8602 -2458 -12713 -6666 -8946 -11824 -11385 -9295
2073i295o016O99P155o77j3237k123N599J4211J2885N017l282n458j1812J184
$$ -9295 -15311 -14612 -7457 -8134 -21371 -23494 -17895 -3684 9201 14218 10936 5478 -6334 -5150
2059e150M025o295J263N887p22k505n247K657m060L442J854o9k203j114n068J999
$$ -5150 -1125 -7420 -6157 -270 -992 -3497 -8744 -6087 -10147 -6705 -4851 -4920 -7123 -8237 -13305 -11306
2043a1306k76j193J678L653J5372R200l216n468j3532l577P041J832K381q8o235
$$ -11306 -11582 -12775 -11097 -7444 7928 17128 13912 8444 -5088 -8665 -1624 208 2589 2501 -3734
2028c734l531m698R575K264L01n626L538m091j901N274L142p618j483J0692P287
$$ -3734 -7265 -11963 -2388 -124 177 -5449 -1911 -6002 -7903 -2629 513 -7105 -8588 2104 9391
2013I391M983K034j1317m26j210j667l491P352Q575K666n340j1147q929J290J0954
$$ 9391 14374 16408 5091 4665 3455 1788 -1703 5649 14224 16890 11550 403 -8526 -7236 3718
$$ [...]
##END NTUPLES=NMR SPECTRUM
##END=
