##TITLE=Analysis number 318454
Compound Code tl 01020
Project Code adrs
Chemist Name fudan
##JCAMPDX= 6.0         $$ Bruker NMR JCAMP-DX V2.0
##DATA TYPE= NMR SPECTRUM
##DATA CLASS= NTUPLES
##ORIGIN= Bruker BioSpin GmbH
##OWNER= nmr
$$ XWIN-NMR		Version 3.5
$$ Wed Mar 29 12:12:16 2006 GMT Daylight Time (UT+1h)  MAYBRIDGE\nmr@NMR_250MHZ
##.OBSERVE FREQUENCY= 250.131544655141
##.OBSERVE NUCLEUS= ^1H
##.ACQUISITION MODE= SIMULTANEOUS (DQD)
##.ACQUISITION SCHEME= undefined
##.AVERAGES= 16
##.DIGITISER RES= 18
##SPECTROMETER/DATA SYSTEM= dpx250
##.PULSE SEQUENCE= zg30
##.SOLVENT NAME= CDCl3
##.SHIFT REFERENCE= (INTERNAL, CDCl3, 0, 16.522)
##AUDIT TRAIL= $$ (NUMBER, WHEN, WHO, WHERE, WHAT)
$$ ##TITLE= Audit trail, XWIN-NMR		Version 3.5
$$ ##JCAMPDX= 5.01
$$ ##ORIGIN= Bruker BioSpin GmbH
$$ ##OWNER= nmr
$$ C:\u/data/dgb/nmr/ADRS/1650/pdata/1/auditp.txt
$$ ##AUDIT TRAIL=  $$ (NUMBER, WHEN, WHO, WHERE, WHAT)
(   1,<2006-03-29 12:11:42.28 +100>,<MAYBRIDGE\nmr>,<NMR_250MHZ>,
      <created by zg, POWCHK disabled, PULCHK disabled
       configuration hash MD5:
       84 BC 41 DB A1 6E 1D 46 DA 25 12 A5 C1 ED C5 3A
       data hash MD5: 64K
       95 DD 90 2D 9D E5 46 69 C9 41 E3 1A CD 0E 9B 4A>)
(   2,<2006-03-29 12:11:57.81 +100>,<MAYBRIDGE\nmr>,<NMR_250MHZ>,
      <Start of raw data processing
       ef LB = 0.3 FT_mod = 6 PKNL = 1 SI = 32K 
       data hash MD5: 32K
       75 21 2F 31 4B 58 11 36 DA E8 DB 84 A0 69 26 59>)
(   3,<2006-03-29 12:12:00.99 +100>,<MAYBRIDGE\nmr>,<NMR_250MHZ>,
      <apk 
       data hash MD5: 32K
       7B F0 BF 00 97 80 F1 2A E3 32 36 EE 45 05 E0 1E>)
(   4,<2006-03-29 12:12:01.97 +100>,<MAYBRIDGE\nmr>,<NMR_250MHZ>,
      <abs ABSG = 5 
       data hash MD5: 32K
       36 2B 16 8E 63 5E F3 1F 33 A3 4D D3 8A 0A 82 8F>)
$$ ##END=
$$ 
$$ hash MD5
$$ 01 D4 17 0B 71 D1 58 47 A3 03 B3 2F 41 12 0F 6E
##$RELAX= 
##$RELAX= 
##$RELAX= 
##$RELAX= 
##$RELAX= 
##$RELAX= 
##$RELAX= 
$$ Bruker specific parameters
$$ --------------------------
##$DU= <C:\u>
##$EXPNO= 1650
##$NAME= <ADRS>
##$PROCNO= 1
##$TYPE= <nmr>
##$USER= <dgb>
##$AMP= (0..31)
100 100 100 100 100 100 100 100 100 100 100 100 100 100 100 100 100 100 
100 100 100 100 100 100 100 100 100 100 100 100 100 100 
##$AQSEQ= 0
##$AQ_mod= 3
##$AUNM= <au_zg>
##$AUTOPOS= <19 >
##$BF1= 250.13
##$BF2= 250.13
##$BF3= 250.13
##$BF4= 250.13
##$BF5= 500.13
##$BF6= 500.13
##$BF7= 500.13
##$BF8= 500.13
##$BYTORDA= 1
##$CFDGTYP= 0
##$CFRGTYP= 5
##$CHEMSTR= <none>
##$CNST= (0..31)
1 1 145 1 1 1 1 1 1 1 1 1 1 1 1 1 1 1 1 1 1 1 1 1 1 1 1 1 1 1 1 1 
##$CPDPRG= <>
##$CPDPRG1= <>
##$CPDPRG2= <>
##$CPDPRG3= <>
##$CPDPRG4= <mlev>
##$CPDPRG5= <mlev>
##$CPDPRG6= <mlev>
##$CPDPRG7= <mlev>
##$CPDPRG8= <mlev>
##$CPDPRGB= <>
##$CPDPRGT= <>
##$D= (0..31)
0 1 0 0 0 0 0 0 0 0.06 0 0 0 0 0 0 0.0002 0 0 0 0 0 0 0 0 0 0 0 0 0 0 
0 
##$DATE= 1143630701
##$DBL= (0..7)
120 120 120 120 120 120 120 120 
##$DBP= (0..7)
150 150 150 150 150 150 150 150 
##$DBP07= 0
##$DBPNAM0= <>
##$DBPNAM1= <>
##$DBPNAM2= <>
$$ [...]
##$SUBNAM7= <"">
##$SUBNAM8= <"">
##$SUBNAM9= <"">
##$SW= 20.6930455092707
##$SWIBOX= (0..15)
0 0 3 0 0 0 0 0 0 0 0 0 0 0 0 0 
##$SW_h= 5175.983436853
##$TD= 65536
##$TD0= 1
##$TE= 294.16
##$TE2= 300
##$TE3= 300
##$TEG= 300
##$TL= (0..7)
0 120 120 120 120 120 120 120 
##$TP= (0..7)
150 150 150 150 150 150 150 150 
##$TP07= 0
##$TPNAME0= <>
##$TPNAME1= <>
##$TPNAME2= <>
##$TPNAME3= <>
##$TPNAME4= <>
##$TPNAME5= <>
##$TPNAME6= <>
##$TPNAME7= <>
##$TPOAL= (0..7)
0.5 0.5 0.5 0.5 0.5 0.5 0.5 0.5 
##$TPOFFS= (0..7)
0 0 0 0 0 0 0 0 
##$TUNHIN= 0
##$TUNHOUT= 0
##$TUNXOUT= 0
##$USERA1= <user>
##$USERA2= <user>
##$USERA3= <user>
##$USERA4= <user>
##$USERA5= <user>
##$V9= 5
##$VALIST= <valist>
##$VCLIST= <CCCCCCCCCCCCCCC>
##$VD= 0
##$VDLIST= <DDDDDDDDDDDDDDD>
##$VPLIST= <PPPPPPPPPPPPPPP>
##$VTLIST= <TTTTTTTTTTTTTTT>
##$WBST= 1024
##$WBSW= 4
##$XGAIN= (0..3)
0 0 0 0 
##$XL= 0
##$YL= 0
##$YMAX_a= 545089
##$YMIN_a= -480722
##$ZGOPTNS= <>
##$ZL1= 120
##$ZL2= 120
##$ZL3= 120
##$ZL4= 120
##$ABSF1= 16.522
##$ABSF2= -4.171173
##$ABSG= 5
##$ABSL= 3
##$ALPHA= 0
##$AQORDER= 0
##$ASSFAC= 0
##$ASSFACI= 0
##$ASSFACX= 0
##$ASSWID= 0
##$AUNMP= <proc_1d>
##$AZFE= 0.1
##$AZFW= 0.1
##$BCFW= 0
##$BC_mod= 0
##$BYTORDP= 0
##$COROFFS= 0
##$CY= 12.5
##$DATMOD= 1
##$DC= 0
##$DFILT= <>
##$DTYPP= 0
##$F1P= 14.0000005364418
##$F2P= -0.99999901652339
##$FCOR= 0.5
##$FTSIZE= 32768
##$FT_mod= 6
##$GAMMA= 0
##$GB= 0
##$INTBC= 1
##$INTSCL= 1
##$ISEN= 128
##$LB= 0.3
##$LEV0= 0
##$LPBIN= 0
##$MAXI= 10000
##$MC2= 0
##$MEAN= 0
##$ME_mod= 0
##$MI= 0
##$NCOEF= 0
##$NC_proc= -3
##$NLEV= 6
##$NOISF1= 0
##$NOISF2= 0
##$NSP= 0
##$NTH_PI= 0
##$NZP= 0
##$OFFSET= 16.522
##$PC= 1
##$PHC0= 41.88961
##$PHC1= -32.54039
##$PH_mod= 1
##$PKNL= yes
##$PPARMOD= 0
##$PSCAL= 4
##$PSIGN= 0
##$REVERSE= no
##$SF= 250.13
##$SI= 32768
##$SIGF1= 0
##$SIGF2= 0
##$SINO= 400
##$SIOLD= 32768
##$SREGLST= <1H.CDCl3>
##$SSB= 0
##$STSI= 32768
##$STSR= 0
##$SW_p= 5175.98343685301
##$SYMM= 0
##$S_DEV= 0
##$TDeff= 65536
##$TDoff= 0
##$TI= <Analysis number 999999
Compound Code 99
Book Reference 9
Project Code 9>
##$TILT= no
##$TM1= 0
##$TM2= 0
##$TOPLEV= 0
##$USERP1= <user>
##$USERP2= <user>
##$USERP3= <user>
##$USERP4= <user>
##$USERP5= <user>
##$WDW= 1
##$XDIM= 32768
##$YMAX_p= 476583488
##$YMIN_p= -166199
$$ End of Bruker specific parameters
$$ ---------------------------------
##NTUPLES= NMR SPECTRUM
##VAR_NAME=  FREQUENCY,     SPECTRUM/REAL,   SPECTRUM/IMAG
##SYMBOL=    X,             R,               I
##VAR_TYPE=  INDEPENDENT,   DEPENDENT,       DEPENDENT
##VAR_FORM=  AFFN,          ASDF,            ASDF
##VAR_DIM=   32768,         32768,           32768
##UNITS=     HZ,            ARBITRARY UNITS, ARBITRARY UNITS
##FACTOR=    0.157963299565203, 1,           1
##FIRST=     4132.6476996994, 0,             0
##LAST=      -1043.33573715361, 0,           0
##MIN=       -1043.33573715361, -166199,     0
##MAX=       4132.6476996994, 476583488,     0
$$ Real data points
##PAGE= N=1
##DATA TABLE= (X++(R..R)), XYDATA
$$ [...]
19173d533m307o55m505L256N634R08M14R61K016K983M674r99l729m0j631n236
19157d789n23m95j6J238M447M203m889m052j49k14j275j959k498Q42L957N130
19141a042L405k768l507K170Q85K8r09k779j80j728k677J843j801K193L373j470
19125d964M703m26l837N57N269P61j614j681k505j437R96j26K888l995j483J378
19109e516p11P45j14R08K794Q10q84o557Q77N441J266J779J833K212l484p482
19093f083mL198j754J2o47q7J673J066o42K059L75M329l221j775L679L223j092
19076D309l275L237l50M85J728m119l262j975m95J261k067P14J645l527L55J707
19060c629O04k726o46J484l73P03N830p13j167Q52k391l171m755k692O270M260
$$ plain form
19173 -4533 -8840 -9495 -14000 -10744 -5110 -4202 -3788 -2827 -811 2172 6846 5847 2118 2078 447 -4789
19157 -4789 -5312 -5807 -5823 -4585 -138 4065 -824 -4876 -5025 -5239 -6514 -8473 -10971 -10129 -6172 -1042
19141 -1042 2363 -405 -3912 -1742 -857 -829 -1738 -4517 -4697 -6425 -9102 -7259 -9060 -6867 -3494 -4964
19125 -4964 -261 -687 -4524 -3967 1302 2063 449 -1232 -3737 -5174 -4178 -4304 -1416 -5411 -6894 -5516
19109 -5516 -6227 -5482 -5596 -4688 -1894 -1084 -1968 -8525 -7648 -2207 -941 838 2671 4883 1399 -6083
19093 -6083 -6087 -2889 -4643 -4631 -5278 -5365 -3692 -2626 -3268 -1209 -834 3495 274 -1501 2178 5401 4309
19076 4309 1034 4271 3921 4406 6134 2015 -1247 -3222 -3717 -2456 -4523 -3809 -2164 -5691 -5336 -3629
19060 -3629 -3025 -5751 -6397 -4913 -5286 -4583 1247 534 -633 219 -2172 -5343 -10098 -12790 -6520 -2260
19044b260q61l439j889jO79K399J43J709R48J856M120M177j113n647l091N72j481
19027c179R73k156n232O63K289j71K155K144K161L573p72l60m178k556o22L943
19011a325L779j047M43K847l506j629j464R48l873q78p95j562K899J004N39m128
18995g748p38J075m06j771O715J476l020k05J68M933J312l146r54o75n73n84p75
18978d916M160O45m524J055M527o73n936J834K039N578M067m644k489j292R68
18963C99J51K70J925K591K036n938n090j233j041o36m272J12K684L368J576K445
18947f53m45K532j896L523K052m989j809J558n159j233L21M223J074o15n6n34
18931b106l69L359n72m427l345J195M228k244n55J550N451l572m049O62J571k804
$$ plain form
19044 -2260 -3121 -6560 -8449 -8450 -7771 -5372 -5229 -3520 -2572 -716 3404 7581 6468 821 -2270 -1698 -3179
19027 -3179 -2206 -4362 -9594 -8931 -6642 -6813 -4658 -2514 -353 3220 2448 2088 -2090 -4646 -5268 -1325
19011 -1325 2454 1407 1850 4697 1191 -438 -1902 -954 -4827 -5705 -6500 -8062 -5163 -4159 -3620 -7748
18995 -7748 -8486 -7411 -7817 -9588 -2873 -1397 -4417 -4622 -4454 479 1791 -1355 -2309 -2984 -3557 -4141 -4916
18978 -4916 -756 -111 -4635 -3580 947 274 -5662 -3828 -1789 3789 7856 3212 723 -569 399
18963 399 550 820 2745 5336 7372 1434 -3656 -4889 -5930 -6566 -10838 -10726 -8042 -4674 -3098 -653
18947 -653 -1098 1434 -462 3061 5113 124 -1685 -127 -5286 -6519 -6198 -1975 -901 -1516 -1572 -2106
18931 -2106 -2475 884 312 -4115 -7460 -6265 -2037 -4281 -4836 -3286 2165 -1407 -5456 -4794 -3223 -6027
18915f027j60L214L744K175m58q65L686K495n942l476j895Q22L536J292j331l558
18899b748l102j335m72K156J316j664p28k224M276L571k035l122m53O411O74j528
18883a007j550n370l211P22p48o66J580O848j282o74K401k175l081k679J778N032
18867d082N543M456k751n984n62J137p99j678l135J744o00l066n50K815L206J000
18851c306l185j133k966J546M775J695k4J245N3K323K492j728K399L59n045l819
18835d319m832J147L510N22L71k603J382k254L69Q29O06J560L11R17K940J284
18819A740l074j971j454K429K555j227k09k505j542L731J174m375P37J729k742
18804e004k840n064k302n35L244M239M068N13L896o234k667O000K293l21J837
$$ plain form
18915 -6027 -6187 -2973 771 2946 2488 1623 5309 7804 1862 -1614 -3509 -2687 849 2141 810 -2748
18899 -2748 -5850 -7185 -7657 -5501 -4185 -5849 -6577 -8801 -4525 -954 -2989 -6111 -6564 -153 521 -1007
18883 -1007 -2557 -7927 -11138 -10416 -11164 -11830 -10250 -3402 -4684 -5358 -2957 -5132 -8213 -10892 -9114 -4082
18867 -4082 1461 5917 3166 -2818 -3380 -2243 -3042 -4720 -7855 -6111 -6711 -9777 -10327 -7512 -4306 -3306
18851 -3306 -6491 -7624 -10590 -9044 -4269 -2574 -2598 -1353 -1300 1023 3515 1787 4186 4545 -500 -4319
18835 -4319 -9151 -8004 -4494 -3972 -3601 -6204 -4822 -7076 -6707 -5878 -5272 -3712 -3401 -2484 456 1740
18819 1740 -1334 -3305 -4759 -2330 225 -1002 -1211 -3716 -5258 -1527 -353 -4728 -3991 -2262 -5004
18804 -5004 -7844 -12908 -15210 -15745 -12501 -8262 -4194 -3681 215 -6019 -8686 -2686 -393 -714 1123
18789A123m5q087J448P63k725K139k075L729J634J870k380K502k032m325k693
18774i154K968J984K386Q17n395j876P382P571J758N975J2345Q114M894q362j0662
18759B0745n463m265k570n076p95J032k55o571K76J133j112j184j347l719m324
18744a3495J876L293L852j08M568K836j880m311n729L60k919R14O115L630j272
18729b270J16m907K577L131R64J541N33k203k16k077L498K554R41j276n772n420
18713h286r78m06M069L710Q92J45n326J635N816m401o937n413K839K258J036K352
18697f995J982j068j708p62L860J44n521m029L682N49M177K489j688l879k474
18682a1241P361P037j272n993j306P04O320K811k849l640j113n805m355J572k51
$$ plain form
18789 1123 1078 -7009 -5561 -4798 -7523 -5384 -7459 -3730 -2096 -226 -2606 -104 -2136 -6461 -9154
18774 -9154 -6186 -4202 -1816 -999 -6394 -8270 -888 6683 8441 14416 26761 34875 39769 31407 20745
18759 20745 15282 11017 8447 3371 2576 3608 3353 -3218 -2942 -1809 -2921 -4105 -5452 -9171 -13495
18744 -13495 -11619 -8326 -4474 -4582 -14 2822 942 -3369 -9098 -8738 -11657 -10743 -4628 -998 -2270
18729 -2270 -2154 -7061 -4484 -1353 -389 1152 1685 -518 -734 -2811 687 3241 4182 2906 -2866 -8286
18713 -8286 -9264 -9670 -5601 -1891 -999 -854 -6180 -4545 1271 -3130 -10067 -15480 -12641 -10383 -9347 -6995
18697 -6995 -5013 -6081 -7789 -8551 -4691 -4547 -10068 -14097 -10415 -9866 -5689 -3200 -4888 -8767 -11241
18682 -11241 -3880 3157 1885 -4108 -5414 -4710 1610 4421 1572 -2068 -3181 -8986 -13341 -11769 -12020
18667a2020N071K286j729l310n5P51M97K404K108L638N561J537p434K605n69m772
18651c431m986K969M912N495k367l002j105k438m9O652M04q559k569K093O03k725
18635h103j367K201L158O43J798n9n930l31k384K00M21j967q34R67m047j95k41
18618a6070O557N627J284K853m414n12j897k402J15J807J09O515j353l817k629
18603h227j83K838l63L288N140k479J52k566k077J225k17J605n674l858J636R882
18587A22j263p331J540J93j765o119j388L701N989j230k336J645j084k611N341
18572f596K00Q84l277J834J237k010L307j565j23k176K798L227p16j19J075j075
18556c095l015o24k434m518L017M367m81Q01J311m36j881J916m97o9k31k850J016
$$ plain form
18667 -12020 -6949 -4663 -6392 -9702 -9757 -9006 -8509 -6105 -3997 -359 5202 6739 -695 1910 1341 -3431
18651 -3431 -8417 -5448 -536 4959 2592 -410 -1515 -3953 -4002 2650 3054 -5505 -8074 -5981 -5378 -8103
18635 -8103 -9470 -7269 -4111 -3468 -1670 -1729 -7659 -7990 -10374 -10174 -9753 -11720 -12554 -11587 -15634 -15829 -16070
18618 -16070 -9513 -3886 -2602 251 -4163 -4675 -6572 -8974 -8859 -7052 -6943 -428 -1781 -5598 -8227
18603 -8227 -8410 -5572 -5935 -2647 2493 14 166 -2400 -4477 -3252 -3469 -1864 -7538 -11396 -9760 122
18587 122 -1141 -8472 -6932 -6739 -8504 -14623 -16011 -12310 -6321 -7551 -9887 -8242 -9326 -11937 -6596
18572 -6596 -6396 -5512 -8789 -6955 -5718 -7728 -4421 -5986 -6109 -8285 -5487 -2260 -2976 -3095 -2020 -3095
18556 -3095 -6110 -6734 -9168 -13686 -10669 -6302 -6783 -5982 -4671 -5107 -6988 -5072 -5569 -5638 -5869 -8719 -7703
18539g703J575m393p75j67L487P024l331j752k356k301J258J257L868K151L171
18524A013K515j610P98n395l253L423L656r86m615j859L014j351m31m621l237
18509a2939l007k069J920J05K973P23O33L089K969k802k797q56P91K328K203O022
18493g14k026j767J543k943J318J555p0m840K59L22l006J146L561M553k42M439
18477C088J222l990m945m053N3L122K043k735o626l51M419l7K454n843k815m563
18461a9557J998Q62M178J63l16k403k109L395N586J847M759J158n23n213m222
18446a0397j398j130L117L573j966l587K939J965l928j312k246j240J609P967
18432f034M04o40L692l79K289R63K23m171p867J96J085k71q30L16J188m071K569
$$ plain form
18539 -7703 -6128 -10521 -11296 -11463 -7976 -952 -4283 -6035 -8391 -10692 -9434 -8177 -4309 -2158 1013
18524 1013 3528 1918 2716 -2679 -5932 -2509 1147 161 -4454 -6313 -3299 -4650 -5081 -9702 -12939
18509 -12939 -15946 -18015 -16095 -15990 -13017 -12294 -11661 -8572 -5603 -8405 -11202 -12058 -11267 -8939 -6736 -714
18493 -714 -2740 -4507 -2964 -5907 -4589 -3034 -3104 -7944 -7685 -7363 -10369 -9223 -5662 -1109 -1351 3088
18477 3088 4310 320 -4625 -8678 -8625 -5503 -3460 -6195 -12821 -13172 -8753 -8790 -6336 -12179 -14994 -19557
18461 -19557 -17559 -16697 -12519 -12356 -12672 -15075 -17184 -13789 -8203 -6356 -1597 -439 -962 -6175 -10397
18446 -10397 -11795 -12925 -9808 -6235 -8201 -11788 -8849 -6884 -10812 -12124 -14370 -15610 -14001 -6034
18432 -6034 -5630 -6270 -2578 -2957 -668 295 518 -3653 -11520 -11324 -10239 -10510 -11340 -11024 -9836 -13907 -11338
18415a1338N655j655J33L33l78L631P52N37O02L330l007n069k156K166j377l641
18399a1482O07J128j32R330P092j500n880o825l220L421N550j57n626l627p602
18384a8923o35L570O065K08j180M175J087m960l870J728O6J217o81O051K176J900
18368b006m202k101m372n258K009M433o29j70j846L712J054q03p621J321L826
18353a2653N317J038K185o76m741J846P41k000M6J72j216j110J149k31K712L518
18337c903J018M80m61q17j387j819J032k461o851j584N54M348j206J843K070k783
18321a1927j599K400L56n087k496m054L113m187m402K520L741M552K65p99J694
18306a5910J93l552j689M005j046J225L792j112j802m580k178N332R33j071n43
$$ plain form
18415 -11338 -5683 -7338 -7205 -6872 -7250 -3619 -2867 -2330 -1728 1602 -1405 -6474 -8630 -6464 -7841 -11482
18399 -11482 -10875 -9747 -9879 -549 6543 5043 -837 -7662 -10882 -7461 -1911 -2068 -7694 -11321 -18923
18384 -18923 -19558 -15988 -9923 -9715 -10895 -6720 -5633 -10593 -14463 -12735 -12669 -11452 -12133 -6082 -3906 -2006
18368 -2006 -6208 -8309 -12681 -17939 -15930 -11497 -12126 -12296 -14142 -10430 -9376 -10179 -17800 -16479 -12653
18353 -12653 -7336 -6298 -4113 -4789 -9530 -7684 -6943 -8943 -8897 -8725 -9941 -11051 -9902 -10133 -7421 -3903
18337 -3903 -2885 -2405 -2866 -3683 -5070 -6889 -5857 -8318 -15169 -16753 -16199 -11851 -13057 -11214 -9144 -11927
18321 -11927 -13526 -11126 -10770 -15857 -18353 -22407 -19294 -23481 -27883 -25363 -21622 -17070 -16805 -17604 -15910
18306 -15910 -15717 -19269 -20958 -16953 -17999 -16774 -12982 -14094 -15896 -20476 -22654 -17322 -16389 -17460 -18003
18291a8003K503K061K435P846L688k929l871n345j678r18M15k353j283J390j518
18276a7560L045N69L870J412l669l274K146M42J200j545K0K576q27K065R88l391
18260a1933p347k567k885K106K29J300k407P30J358J358m212l251K458N137j32
18245b0058k170j490K03l179L171N541K90q35K997k53m368k279m968M719L391
18230a9288J133J053j845J365J237l83j104l625l05k026J443L929M527o970l506
18215b4365j790O088K332k764k006J658L062j465K369K724Q19l170l276o844L194
18200b3434o71N67p72q69j836n550J465J630k305J724m74J293K215K489Q17M332
18184a9379m196j012L996p92j879l580r729N14L773k732m399M864o57j108K839
$$ plain form
18291 -18003 -15500 -13439 -11004 -3158 530 -2399 -6270 -11615 -13293 -14211 -13796 -16149 -17432 -16042 -17560
18276 -17560 -14515 -13946 -10076 -8664 -12333 -15607 -13461 -13019 -11819 -13364 -13344 -10768 -11595 -9530 -8542 -11933
18260 -11933 -19280 -21847 -24732 -22626 -22397 -21097 -23504 -22774 -21416 -20058 -24270 -27521 -25063 -19926 -20058
18245 -20058 -22228 -23718 -23515 -26694 -23523 -17982 -17692 -18527 -15530 -15783 -20151 -22430 -27398 -22679 -19288
18230 -19288 -18155 -17102 -18947 -17582 -16345 -16728 -17832 -21457 -21762 -23788 -22345 -18416 -13889 -20859 -24365
18215 -24365 -26155 -20067 -17735 -20499 -22505 -20847 -17785 -19250 -16881 -14157 -13338 -16508 -19784 -26628 -23434
18200 -23434 -24105 -23538 -24310 -25179 -27015 -32565 -31100 -29470 -31775 -30051 -30525 -29232 -27017 -24528 -23711 -19379
18184 -19379 -23575 -24587 -20591 -21383 -23262 -26842 -36571 -36057 -32284 -35016 -39415 -34551 -35208 -36316 -33477
18169c3477k34O81o372o307j19J781L233k226j075L841J350M839J62n845l087
18154d2855r13j102k70O19N98r66J143n131N0P61l83j841M615J89j544p148j104
18137e5282m97n293l14m080M232J452m727K274l432l107L344J165n74J311j44
18122f3672l046P65K977K658m933k195N357J4220J9980K0400L3319N1484Q8612
18109A65926J59635K98695N76297J216777K392477K259824M95492n93434j835664
18100E136025j716423j043974o09491l82039k56759j86251j40691j01333q0590
18091F18474o7232n1027n0868m6353l4447l3281k2930k1510k4823j8020j0961
18080B37022j5430j4603r715q457r285j0550j0260m006r600r023J351j248p820
$$ plain form
18169 -33477 -33711 -33030 -39402 -45709 -45828 -44047 -40814 -43040 -44115 -40274 -38924 -34085 -33923 -39768 -42855
18154 -42855 -43768 -44870 -45140 -44521 -43923 -44889 -43746 -48877 -48827 -48066 -48449 -50290 -45675 -45486 -47030 -54178 -55282
18137 -55282 -55779 -61072 -61386 -65466 -61234 -59782 -64509 -62235 -65667 -68774 -65430 -64265 -64839 -63528 -63672
18122 -63672 -66718 -65953 -62976 -60318 -65251 -67446 -62089 -47869 -27889 -7489 25830 77314 165926
18109 165926 325561 624256 1200553 2417330 4809807 7069631 7565123 6971689 5136025
18100 5136025 3419602 2375628 1766137 1384098 1127339 941088 800397 699064 618474
18091 618474 551242 500215 449347 402994 368547 335266 312336 290826 266003 247983 237022
18080 237022 221592 206989 197274 188817 179532 168982 158722 154716 145116 136093 137444 136196 128376
18067A28376q536l612L261j656j2658m599m111o035l203l617j297j226l312k061
18053G5714l269q42q244l665K208J280M747L786l997p527l612L045L83q72j98
18038E8937j920o251n270l055k742K212j18m257p740m14M027o45j00k505l583
18023B6576R209J898J485m269m443j760m63L385l282k724K863J657l513K747M336
18008C3702O566p91p141m443R35l107p523J928Q89K245L764O684M265j970l824
17993C2179j60J604N261m36q035q298j288R13r7P97K324L733m353l991q003j312
17977A0838L933N614N316L196J156L391K32O38k824n186n428j805J758R21L9k17
17961B1572K748l075K697j202m538l134L366N186J902r93m931K619M351L366k519
$$ plain form
18067 128376 119840 116228 119489 117833 105175 100576 96465 90430 87227 83610 82313 81087 77775 75714
18053 75714 72445 71603 63359 59694 61902 63182 67929 71715 67718 60191 56579 59624 60007 59135 58937
18038 58937 57017 50766 45496 42441 39699 41911 41793 37536 29796 29382 33409 32764 32664 30159 26576
18023 26576 35785 37683 39168 34899 30456 28696 28233 31618 28336 25612 28475 30132 26619 29366 33702
18008 33702 40268 39477 32336 27893 28828 25721 18198 20126 21015 23260 27024 33708 37973 36003 32179
17993 32179 32019 33623 38884 38448 30413 22115 20827 21740 21643 22440 24764 28497 24144 20153 12150 10838
17977 10838 14771 20385 25701 28897 30053 33444 33676 34314 31490 26304 20876 19071 20829 21750 21789 21572
17961 21572 24320 21245 23942 22740 18202 15068 18434 23620 25522 24529 19598 22217 26568 29934 27415
17946B7415o536n387j876Q23K14L480k72j112m359j504P56K434O53m551l411L334
17930A0101J766L113l384P08R38k257k566j624O24j648m54p66M816j801k920q17
17914C829N901O535L531J696l27Q45m876l139q75K716j350m760j561K595pr66
17898I787L541P99J618j362n396J425J402k768o867k484K979k568k788M275L034
17883D627J197j82O58J883j310L26n18J332L351j257n628j73L304J279m151j53
17867D585K596Q37l402k741J641K318J961k735K51K952j568j973m525L655M295
17852H147L261L420m969k269L650l49l229J53j55k778L289j547n649o46K752L013
17836F094Q75k699j548Q68Q031N99l527m405N82m98J59J075L749M906r6k180k510
$$ plain form
17946 27415 20879 15492 13616 14439 14653 18133 17861 16749 12390 10886 11642 14076 14729 10178 6767 10101
17930 10101 11867 14980 11596 12304 13242 10985 8419 6795 7419 5771 5317 4551 9367 7566 4646 3829
17914 3829 9730 16265 19796 21492 21165 22010 17134 13995 13120 15836 14486 9726 8165 10760 10753 9787
17898 9787 13328 14127 15745 14383 8987 10412 11814 9046 2179 -305 2674 106 -2682 1593 4627
17883 4627 5824 5642 6300 8183 6873 7199 6681 8013 11364 10107 4479 4306 7610 8889 4738 4585
17867 4585 7181 8018 4616 1875 3516 5834 7795 5060 5311 8263 6695 4722 197 3852 8147
17852 8147 11408 14828 9859 7590 11240 10891 7662 7815 7660 4882 8171 6624 975 329 3081 6094
17836 6094 6969 4270 2722 3590 11621 12220 8693 4288 4870 4372 4531 5606 9355 14261 14165 11985 9475
17819I475J312k69K704q09j691k450l739j762j141R31Q167l20l840J373K902J192
17803A2035m870l793M520l349m048N62L009J852L899j005m816m453P67L192n254
17788a752L074K472n628M73K468K143K881N01j791k590K237J88J193j597k628
17773A644O46O664M372l13j198K738o623k321k105k171j715K743J516K38K148
17758F263l885j619M903j879k093K824N634j465n366L245l409J614j553n593O014
17743C635K172j309k064j6O18K496M258l715l843l002m02O26o27k06J216J626
17727A463l780l777K491K815o80l344k06P680K67L056m432J211J641J047k054
17712C398k332k821P78k119J263K154j722J402l237k397P25j593k950L5M398k5
$$ plain form
17819 9475 10787 10518 13222 12413 10722 8272 4533 2771 1630 2561 10728 10408 6568 7941 10843 12035
17803 12035 7165 3372 7892 4543 495 1057 4066 5918 9817 8812 3996 -457 310 3502 -1752
17788 -1752 1322 3794 -1834 -1361 1107 3250 6131 6632 4841 2251 4488 4676 5869 4272 1644
17773 1644 2290 8954 13326 13013 11815 14553 7930 5609 3504 1333 -382 2361 3877 4115 6263
17758 6263 2378 759 5662 3783 1690 4514 10148 8683 3317 6562 3153 4767 3214 -2379 3635
17743 3635 5807 4498 2434 2418 3036 5532 9790 6075 2232 -770 -1172 -546 -1173 -1379 -163 1463
17727 1463 -2317 -6094 -3603 -788 -1468 -4812 -5018 2662 2929 5985 1553 2764 4405 5452 3398
17712 3398 1066 -1755 -977 -3096 -1833 321 -1401 1 -3236 -5633 -4908 -6501 -9451 -9416 -5018 -5043
17696e043N55L37Q99L48M5R56J211R0L5K116j937R2L55l467o90L10K443n27n66
17677b438l153J257L314j215K72K861p58j408L332L407l351p354l369J281M068
17662c254J305L106l928j010L064J164Q12j850k188j800K725k902l966P42M074
17647c906j395J24M872o36k127Q30M265Q32o144j177q69l86n65l309J987O259
17631a345N022L170N474L042P907J1230K2658M6642P9107R8686P1611L9677M2155
17618D35036P3476J29450R1238m657n8042q5545m1425j4257l9852o3235r0294
17607C31893q4603n6294l0304k0392j8482j3055j2723q813p492j0776m34J38O15
17594F9278O936N269m003L578J061n647q328r662j0242l827R41n792o282n346
$$ plain form
17696 -5043 -4488 -4151 -3252 -2904 -2859 -1903 -692 -602 -567 1549 -388 -296 59 -3408 -4098 -3788 -1345 -1872 -2438
17677 -2438 -5591 -4334 -1020 -2235 -1963 898 140 -1268 2064 5471 2120 -5234 -8603 -7322 -3254
17662 -3254 -1949 1157 -2771 -3781 -717 447 1259 -591 -2779 -4579 -1854 -4756 -8722 -7980 -3906
17647 -3906 -5301 -5177 -305 -941 -3068 -2238 2027 2859 -3285 -4462 -5331 -5717 -6282 -9591 -7604 -1345
17631 -1345 3677 6847 12321 15363 23270 34500 57158 103800 182907 281593 353204 392881 435036
17618 435036 508512 637962 729200 724543 666501 580956 539531 525274 485422 422187 331893
17607 331893 247290 190996 160692 140300 121818 108763 96040 87227 79735 68959 68525 68663 69278
17594 69278 76214 81483 77480 81058 82119 76472 68144 58482 48240 44413 45354 39562 33280 27934
17580B7934l67P434J518n334o133P01M72J915l317k479o763l289L155K951q79
17565A7519j024N88K171n23k044l473j463p53M78M011o63m11r76J147l768k384
17549H432O3K457J438j860N66r71m585l567L790j524K312P30j117M184M6m372
17533F022N09J284P008k7n440q30l42o2K458K76k462k612l577L949j662k677L00
17516B115K306K106L801j291o937J949p0l548L53m056j952N598Q239q02q32J501
17500H480q25L089J849L850m107m924q53j016L437M63n000J167k482j491K257
17485C894J272k210J286N20p7l767j145K866O75j403l87J447j457p72oL652J642
17468F030K255j442J727n86J102o54n16j829J093L092K025J373o265j734M773
$$ plain form
17580 27934 27567 35001 36519 31185 25052 25753 26225 28140 24823 22344 15581 12292 15447 18398 17519
17565 17519 16495 17083 19254 18731 16687 13214 11751 10998 11476 15487 14824 14413 13437 14584 10816 8432
17549 8432 8495 10952 12390 10530 11096 10125 5540 1973 5763 4239 6551 7281 6164 10348 10394 6022
17533 6022 6531 7815 14823 14796 9356 8526 8184 8122 10580 10856 8394 5782 2205 6154 4492 1815 2115
17516 2115 4421 6527 10328 9037 2100 4049 3979 431 784 -3272 -5224 374 8613 7811 6979 8480
17500 8480 7655 10744 12593 16443 12336 7412 6559 5543 8980 9443 4443 5610 3128 1637 3894
17485 3894 5166 2956 4242 4762 4685 918 -227 2639 3314 1911 1524 2971 1514 742 736 4388 6030
17468 6030 8285 6843 8570 7984 9086 8432 7916 6087 7180 10272 12297 13670 7405 5671 10444
17453A0444k484O95k438K074J844l846j894J567l231l90L985J059k776J684P505
17438A3798N084J0516Q417j9R31l2p845j1253o11M536k348q281k529n39l736m706
17422A383L810K19l453L394O647o65k356m057k030j473l61n044r29M864O082J943
17406G974l009j62O068m594p044J932n51m621j78m228L567M197M344O75j521l964
17390a115J169k820j41K96j792K664j74L030l174N14L53l791l114K971K277Q415
17374E568m68o772l902K648N042K933N10o55J069J158J648p27n148K107L19l322
17358B008k838P628L623k462l879k322l73K589j124j594K162K168j432J692j109
17343D737l733k573p25j416N606N947l79L92j023n314k438q29k324K577N379l119
$$ plain form
17453 10444 7960 8655 6217 8291 10135 6289 4395 5962 2731 2341 6326 7385 4609 6293 13798
17438 13798 18882 29398 37815 37796 38727 38695 30850 19597 18986 23522 21174 12893 10364 9825 6089 1383
17422 1383 5193 5412 1959 5353 12000 11335 8979 4922 2892 1419 1058 -3986 -4915 -51 6031 7974
17406 7974 4965 4803 10871 6277 -767 1165 614 -4007 -4185 -8413 -4846 -649 3695 4370 2849 -1115
17390 -1115 54 -2766 -2907 -2611 -4403 -1739 -1913 1117 -2057 -1543 -1190 -4981 -8095 -5124 -2847 5568
17374 5568 5100 -1672 -5574 -2926 2116 5049 5559 4904 5973 7131 8779 8052 2904 5011 5330 2008
17358 2008 -830 6798 10421 7959 4080 1758 1385 3974 2850 1256 3418 5586 4154 5846 4737
17343 4737 1004 -1569 -2294 -3710 1896 7843 7464 7856 6833 1519 -919 -1748 -4072 -1495 3884 765
17327G65p069O22P524k003K227M556M47o625l227j037O70L822J853K866Q75k959
17311C307o025l118L749J949K580J079k419P82N565J415k966k540n028k37K313
17296D06J596Q22J360j548o53L092N355l84l370R40R5L856R96o179k07O67j009
17279E835k366J77m929K403P144L965l551l359j159j441K57k800M85K880r851
17264f310j752K478O020j368P76L582k672L229l230k299k223L574K525j450N77
17249A457J165K140k145K625L248j238l772l87L363j714L11p25k290k508K989
17234B519K521n089n258o76k72l18J34N356j741k716o08j383l441J089J450N220
17218c213L589r74l949R94K977J757p31k781J427K972L505M60L424L666l469j851
$$ plain form
17327 765 -6304 -5682 1842 -161 2066 6622 7069 444 -2783 -3820 -3150 672 2525 5391 6266 3307
17311 3307 -2718 -5836 -2087 -138 2442 3521 1102 1884 7449 8864 5898 3358 -1670 -1907 406
17296 406 2002 2824 4184 2636 1983 5075 10430 10046 6676 7616 7711 11567 12563 6384 6177 6844 5835
17279 5835 3469 3646 -1283 1120 8264 12229 8678 5319 4160 2719 2976 176 661 3541 -6310
17264 -6310 -8062 -5584 436 -932 -156 3426 754 3983 753 -1546 -3769 -195 2330 880 1457
17249 1457 2622 4762 2617 5242 8490 7252 3480 3093 6456 4742 5053 4328 2038 -470 2519
17234 2519 5040 -49 -5307 -5983 -6255 -6573 -6439 -1083 -2824 -5540 -6148 -7531 -10972 -9883 -8433 -3213
17218 -3213 376 -598 -4547 -3553 -576 1181 450 -2331 -904 2068 5573 6033 9457 13123 9654 7803
17202G803o00j233r88l060K071m809l516O583j593l275q12K872K108R21K13j148
17186A537j499J416o55K740M335k034l672p10M640o89J17m685k050k463J634P212
17170E174L949K566J973k266j817k295l726l392M88K604j935o93j814o060J369
17155e875R639L240k513k868r43k442r03L072K115k349M431l224n688l956O339
17140a925O902Q7j129j398P19j49J526K659p96N1j482m617j322j833L525J733
17124B551m080j076Q72j713j275j867P78j630j73M440J63J132k568J597J332j946
17108c463o616M213J464R72l13K32N712J569K628M514k226j957J399j650o44r8
17092E736K913N04l664l818l716M122J264K206M63M044o23k413m497M85J160k999
$$ plain form
17202 7803 7203 5970 4982 1922 3993 -816 -4332 2251 658 -2617 -3429 -557 1551 2472 2685 1537
17186 1537 38 1454 799 3539 7874 5840 2168 1458 6098 5409 5526 841 -1209 -3672 -2038 5174
17170 5174 9123 11689 13662 11396 9579 7284 3558 166 654 3258 1323 630 -1184 -7244 -5875
17155 -5875 3764 7004 4491 1623 680 -1762 -2665 407 2522 173 4604 1380 -4308 -8264 -1925
17140 -1925 4977 5064 3935 2537 3256 3107 4633 7292 6496 6547 5065 448 -874 -2707 818 2551
17124 2551 -1529 -2605 -1733 -3446 -4721 -6588 -5810 -7440 -7613 -3173 -3010 -1878 -4446 -2849 -1517 -3463
17108 -3463 -10079 -5866 -4402 -3430 -3743 -3511 2201 3770 6398 10912 8686 6729 8128 6478 5834 5736
17092 5736 8649 9153 5489 1671 -2045 2077 3341 5547 6010 10054 9431 7018 2521 3006 4166 1167
17076A167l392M272M057J014n00O289J849j478n152j689M228j300m8o78k651k191
17060C797K564N368M981l817o413o068q33K083M801o81l329N97N37j384r45m64
17044G94j31l320l781M025K417L679J273k753k478N08j085J693j786R20r40p89
17028a754l772L223L59K452O94j517r41j146N66L602J766L937l80o500k921m56
17012b788K151K118n99m629j898q54N164Q28j692j168P63J210j852Q09M434L517
16996E514j001l175q82j949j978k238j760L084J573j398p54M0L64J948o4LM74
16979b199P42M191P19L485M813k095n466o221n72k88L060K759J030j41J551q273
16963b905m475k222P781M675K441q61M29n923j857o31j596l40n603J226R229M450
$$ plain form
17076 1167 -2225 2047 6104 7118 6618 12907 14756 13278 8126 6437 10665 9365 9317 8639 5988 3797
17060 3797 6361 11729 16710 12893 6480 412 -421 1662 6463 5782 2453 3050 3587 2203 1258 794
17044 794 663 -2657 -6438 -2413 4 3683 4956 2203 -275 233 -852 841 -945 -25 -965 -1754
17028 -1754 -5526 -2303 -1944 508 1202 -315 -1256 -2402 -1836 1766 3532 7469 7089 589 -2332 -2788
17012 -2788 -637 1481 882 -3747 -5645 -6499 -1335 -507 -2199 -3367 -2604 -1394 -3246 -2437 1997 5514
16996 5514 4513 1338 456 -1493 -3471 -5709 -7469 -4385 -2812 -4210 -4964 -4924 -4560 -2612 -2676 -2673 -2199
16979 -2199 -1457 2734 3453 6938 11751 9656 4190 -2031 -2603 -2891 169 2928 3958 3817 5368 -2905
16963 -2905 -7380 -9602 -1821 2854 5295 4434 4863 -1060 -2917 -3548 -5144 -5484 -11087 -9861 -632 3818
16947C818k485L800J417o587o495j885k836r36k844L808N954K557J625L827J450
16932D188l227K173j818r54K529K31l655m329q41P451M066l030J256l146R24Q244
16916A0062K392m336m35K5k237J232k000k417n645N0J206L212q56L15J516l610
16900a526j774K692j107k578J249K86j196j591j487k961K500K306M903k361m918
16885g563J722K736L045k864L243M131K793r41O61l162j640k783J757K323J041
16870D499l092k460q78J84M16K842j079j129j497k420L886O899J55l010l195J481
16854A602J004j353N97k0Q95L917N314l2m888l787m228M74k570O97l378l03K334
16837c725q11K76Q23J628K337l37Q87o33K868o0l278j227l983K173J70j524k729
$$ plain form
16947 3818 1333 5133 6550 -37 -6532 -8417 -11253 -12189 -15033 -11225 -5271 -2714 -1089 2738 4188
16932 4188 961 3134 1316 362 2891 3122 -533 -4862 -5703 1748 5814 2784 4040 894 1818 10062
16916 10062 12454 8118 7683 7708 5471 6703 4703 2286 -3359 -3309 -2103 1109 253 568 2084 -1526
16900 -1526 -3300 -608 -1715 -4293 -3044 -2758 -3954 -5545 -7032 -9993 -7493 -5187 -284 -2645 -7563
16885 -7563 -5841 -3105 -60 -2924 319 4450 7243 6302 6963 3801 2161 -622 1135 3458 4499
16870 4499 1407 -1053 -1931 -1747 -1331 1511 432 -697 -2194 -4614 -728 6171 6326 3316 121 1602
16854 1602 2606 1253 1850 1830 2725 6642 11956 11924 7036 3249 -979 -505 -3075 -2378 -5756 -6059 -3725
16837 -3725 -4536 -4260 -3437 -1809 528 191 1078 445 3313 3253 -25 -1252 -5235 -3062 -2892 -4416 -7145
16820g145o37J588J106l754N064M3l231L100L309K503k637o55K062r03L99M036
16804D248j642j641M471K815n706o235Q41R58l29j657m2M815R32L66j641K187
16788B740l27n54j240j561K673k211j968j000p76K024J3M01J500J231m381l822
16772g258l944J567J578M08q52J11J820P297M705r82j369l910R24k130n264m406
16756a1705k292O096M033k224K075J312j162j485J200N093l866j241l282r0l01
16741g839J010M523j373k092k716J219J635J778k69o59L309j048L112K592q65
16726B317l296k02J30J543j653P11j682m384M553K411r98r82R55j208K970K761
16710C946l011K710m132l028K549N419J172l34l687J155L659K484k904k459J488
$$ plain form
16820 -7145 -7782 -6194 -5088 -8842 -3778 -3735 -6966 -3866 -557 1946 -691 -1346 716 -187 212 4248
16804 4248 2606 965 5436 8251 2545 -3690 -2849 -1891 -2220 -3877 -3919 896 1828 2194 553 2740
16788 2740 2413 1859 619 -942 1731 -480 -2448 -3448 -4224 -2200 -2187 -1786 -286 945 -3436 -7258
16772 -7258 -11202 -9635 -8057 -7649 -8501 -8390 -6570 727 5432 4450 3081 -829 95 -2035 -7299 -11705
16756 -11705 -13997 -7901 -3868 -6092 -4017 -2705 -3867 -5352 -4152 941 -2925 -4166 -7448 -7538 -7839
16741 -7839 -6829 -2306 -3679 -5771 -8487 -7268 -5633 -3855 -4124 -4783 -1474 -2522 590 3182 2317
16726 2317 -979 -1181 -1051 492 -1161 -450 -2132 -6516 -1963 448 -550 -1532 -577 -1785 1185 3946
16710 3946 935 3645 -487 -3515 -966 4453 5625 5291 1604 2759 6418 8902 5998 3539 5027
16695E027l912p744K340O62N629k20n478n88O647N701K883Q78O02m388j986k164
16679C889m326L81L194k507n39j455l043p52L939K256K006R46k973K086j54O65
16663C613j459k70L783o861m040K371M229R70k302r56N756O713K961l139k293
16648I076n06k237J784J916K472N13n196P39l250j176P97j46k887k345j766M046
16632A834J719J685K228k914K089m2J131l680m635k425p45N35q12j808L345O101
16616C606r74J778K357k129J43j99P64K837k167o034k461J630k41k063j746k376
16600g275P76J839k38J496j216P86Q8n410K268K599K381l651J398O655Q22k371
16584I47p1j144j969j582m533j987L655K246K359M240k492O24k96K677J766j186
$$ plain form
16695 5027 1115 -6629 -4289 -3627 2002 1782 -3696 -4284 2363 8064 10947 11825 12427 8039 6053 3889
16679 3889 -437 -56 3138 631 92 -1363 -4406 -5158 -1219 1037 3043 3989 1016 3102 2948 3613
16663 3613 2154 1884 5667 -1194 -5234 -2863 1366 2336 34 -922 4834 11547 14508 11369 9076
16648 9076 8570 6333 8117 10033 12505 13018 7822 8561 5311 4135 4932 4786 1899 -446 -2212 1834
16632 1834 3553 5238 7466 4552 6641 6599 7730 4050 -585 -3010 -3755 -3220 -4032 -5840 -2495 3606
16616 3606 2632 4410 6767 4638 4781 4582 5346 8183 6016 -18 -2479 -849 -1090 -3153 -4899 -7275
16600 -7275 -6499 -4660 -4898 -3402 -4618 -3832 -3744 -9154 -6886 -4287 -1906 -5557 -4159 2496 3318 947
16584 947 876 -268 -2237 -3819 -8352 -10339 -6684 -4438 -2079 2161 -331 293 -3 2674 4440 3254
16568C254p98n007j06M083k290m38J897M159j224k788Q77k760j476k66K079M025
16552C221j249k87q663l629M448K315j012J251K878KN51k368L490K745l762m554
16536d623M806L528J922o25m98j70l615k776j047L942M953N06m1l596K73L744
16520F683K02o344j426K132n217p727q22K243N603J855K259K01q22l534n674M763
16504e625J396Q89L646J063o663K725m42j797j621k253M996j432j995k498K542
16489g069K86O565L483l596l765K027J243n30l44K202m26M265P461J526j415l978
16473G935o222K40k662j34Q79O22k44L309p61k67L013l083J981M862j621m998
16457B849l506k39Q38l737M42K04M443n812j40L806m473m594J673K875J623J976
$$ plain form
16568 3254 2456 -2551 -2657 1426 -864 -1302 595 4754 3530 742 1619 -1141 -2617 -2883 -804 3221
16552 3221 1972 1685 -6978 -10607 -6159 -3844 -4856 -3605 -727 -725 -174 -2542 948 3693 -69 -4623
16536 -4623 183 3711 5633 5008 4510 4340 725 -2051 -3098 844 5797 6303 6262 2666 2939 6683
16520 6683 6885 541 -885 1247 -3970 -11697 -12519 -10276 -4673 -2818 -559 -358 -1180 -4714 -10388 -5625
16504 -5625 -4229 -3340 306 1369 -5294 -2569 -3011 -4808 -6429 -8682 -3686 -5118 -7113 -9611 -7069
16489 -7069 -6783 -218 3265 -331 -4096 -2069 -826 -1356 -1700 502 76 4341 11802 13328 11913 7935
16473 7935 1713 1953 -709 -843 36 658 414 3723 2962 2695 5708 2625 4606 9468 7847 2849
16457 2849 -657 -896 -58 -3795 -3353 -3149 1294 -4518 -4658 -852 -5325 -9919 -8246 -5371 -3748 -1772
16441a772M78K636k23N401J2437J3489J0376L859J608k597j0187j2234j1269o796
16427E206N418q93o654j339P02K721j416l918L291q30j368n157j236o190j75M433
16411g405M597K567J356k697k533j407m48J618N267L788J704M43o105k695k190
16396d140k557L365P728J2579J3487J1396N990R07n055q449j1009q299o664r00
16382H379n6j511K016K077j622l523j66l941k603P72m42j257j658J959o48J838
16366c86N076l074L28L416K112o413r392K538K736l478J657K399K754K638o7o27
16350B217j037O193O608L766J335j508K77J0282R042K267n905j2175j4778l638
16336B946j57L15N212J169j641L207k896n123l322m77m88L086M261L727j462l75
$$ plain form
16441 -1772 -1294 1342 1119 6520 18957 32446 42822 46681 48289 45692 35505 23271 12002 5206
16427 5206 10624 9731 3077 1738 2440 5161 3745 -173 3118 2288 920 -4237 -5473 -11663 -11838 -7405
16411 -7405 -2808 -241 1115 -1582 -4115 -5522 -5970 -4352 915 4703 6407 6850 745 -1950 -4140
16396 -4140 -6697 -3332 4396 16975 30462 41858 47848 48755 43700 35251 24242 15943 9279 8379
16382 8379 8323 6812 8828 10905 9283 5760 5594 1653 -950 -178 -620 -1877 -3535 -1576 -2224 -386
16366 -386 4690 1616 1944 5360 7472 1059 -8333 -5795 -3059 -6537 -4880 -2481 273 2911 2844 2217
16350 2217 1180 7373 13981 17747 19082 17574 17851 28133 37175 39442 33537 21362 6584 2946
16336 2946 2789 3104 8316 9485 7844 11051 8155 3032 -290 -767 -1255 1831 6092 9819 8357 7982
16320G982l061q95m521p23Q3Q45J643J533k051l777K606m48L661L442P855J553
16304A5727R78N686R252J3353K4426L3022J4500j921j7642j8897k0091j2723q600
16291C7070o594k923q341n371o393l346k918J877l84l03O054L676l701j0339r306
16276a1242k479l045k185r4O200J0035N164L483K686J479j489L911M621j470o11
16261A4964r42O032M997J3651K2611L3124K1175r47j2951j8745j9801j9869j0832
16248C2467o589r11j652m714m118j361m529n869K218M082Q12m282R28j989m338
16233A55j015J149J052Q85J540j079J469L423J931j291l125J406L051L436m35
16218A2552j537Q44L554O646P297N467O518K787P74n491n844j3n002j905Q90Q35
$$ plain form
16320 7982 4921 4026 -495 -1218 -1135 -290 1353 2886 835 -2942 -336 -784 2877 6319 14174 15727
16304 15727 16705 22391 31643 44996 69422 102444 116944 115023 97381 78484 58393 45670 37070
16291 37070 30476 27553 19212 13841 7448 4102 1184 3061 2677 2374 8428 12104 8403 -1936 -11242
16276 -11242 -13721 -16766 -18951 -19045 -12845 -2810 2354 5837 8523 10002 8513 12424 17045 15575 14964
16261 14964 14022 20054 25051 38702 61313 94437 115612 114665 101714 82969 63168 43299 32467
16248 32467 25878 24967 23315 18601 14483 13122 8593 2724 4942 9024 9836 5554 6482 4493 155
16233 155 -860 289 1341 2226 3766 2687 4156 7579 9510 8219 5094 6500 9551 12987 12552
16218 12552 11015 11859 15413 22059 29356 34823 41341 44128 44902 39411 33567 33554 28552 26647 27537 28372
16202B8372m84k242n153n572q63o84k598l287k453P46k242l802L587K461qo85
16186E093j298K12P94L172l433r16J20k04k264m642K899j639m243L667k88J256
16170a714M20p41M984m934l657K288r22l623L677L948J835K297M148J121j944
16155G183m62m543q095k868L368J886Q36N27n58J6P51Q44K906l378m285N169K022
16138A319k153k628j440m24J831k65K057J879j151L717l724j223R9K423j894k498
16122d075k456j552L903j912J938n48o27M424k949l267l185J508L758J282j664
16107e422J340K906j777l705J374M018o82L763O250K592k170n049k490l892r04
16092c848L339K881l593m358J867K970k511K6J329N722o849n014j301M429M950
$$ plain form
16202 28372 27888 25646 20493 14921 14058 13374 10776 7489 5036 5782 3540 -262 3325 5786 5778 5093
16186 5093 3795 4007 4801 7973 4540 3624 3744 3540 1276 -3366 -467 -2106 -6349 -2682 -2970 -1714
16170 -1714 -1294 -2035 2949 -1985 -5642 -3354 -4276 -7899 -4222 -274 1561 3858 8006 9127 7183
16155 7183 6721 2178 -5917 -8785 -5417 -3531 -2695 -2168 -2726 -2710 -1959 -1115 1791 -1587 -5872 -703 1319
16138 1319 -834 -3462 -4902 -5326 -3495 -3760 -1703 176 -975 2742 -982 -2205 -2106 317 -1577 -4075
16122 -4075 -6531 -8083 -4180 -6092 -4154 -4702 -5329 -905 -3854 -7121 -10306 -8798 -5040 -3758 -5422
16107 -5422 -4082 -1176 -2953 -6658 -5284 -1266 -1948 1815 8065 10657 8487 3438 948 -2944 -3848
16092 -3848 -509 2372 -1221 -5579 -3712 -742 -3253 -3227 -1898 3824 -3025 -8039 -9340 -4911 39
16077C9J228m409k471M853K261L400N89n119o548P6p1j69J487N42J568r53k638
16060f335K38L284J877K385m119p620P017R341p43l471J05m132k365K592K377
16045D31N8K5L515k835J221L931L803J19j120l671j293J129j01o121l670K340
16029b239O952P81k126P35j318l776m028J305p30O83L45q91J206O074p31j280
16013I62L844k997n4M87Q75q11K392l895j318l356J995R781J051m408n457n291
15997f200j739j81J783R28J439m970L111P695N581k110K184M459j474k024L23
15982H805j146m008m704l582L140O355k061K324M71K06J306J939J543j493m088
15967E007J581m008R39M986N015M032K077q303l03l655l132K973N151j265n341
$$ plain form
16077 39 1267 -3142 -5613 -760 1501 4901 5490 371 -6177 -6101 -6172 -6341 -4854 -4312 -2744 -3697 -6335
16060 -6335 -6097 -2813 -936 1449 -2670 -10290 -3273 6068 5325 1854 1959 -2173 -4538 -1946 431
16045 431 489 514 4029 1194 2415 6346 10149 10268 9148 5477 4184 5313 5212 -909 -4579 -2239
16029 -2239 4713 5494 3368 4103 2785 -991 -5019 -3714 -4444 -3761 -3416 -4307 -3101 2973 2242 962
16013 962 4806 1809 1755 2242 3117 2306 4698 803 -515 -3871 -1876 7905 8956 4548 -909 -6200
15997 -6200 -7939 -8120 -6337 -5409 -3970 -8940 -5829 1866 7447 5337 7521 11980 10506 8482 8805
15982 8805 7659 3651 -1053 -4635 -1495 4860 2799 5123 5594 5800 7106 9045 10588 9095 5007
15967 5007 6588 2580 3519 8505 13520 17552 19629 11326 11023 7368 4236 7209 12360 11095 5754
15952E754l848p47M745j167k243k410k518j703N4j261N607k293k148j728M583
15937a323L636l772n11O093N107J694k367p76K733l94M595k139l664n340m228
15922f56j885j288K02q54J0306L053m518m543l183O31K191M934j162m74n49n652
15906c447M153M686l453l953L886J323m454K749o43j882L296K958J450l818J059
15891C910K72L557K143k551l194L50K348k128l957j358j594l844o742j529N845
15876h472N358J954K170N80J287m118q90k657j294N104K856P49n9J842L420L488
15860A1318j63r037o184J857j768n755r03K664M26K720P855P101N10k690J604
15845I555m663p892l583q44L324J636j405J207L987J636l817m708J308L147K975
$$ plain form
15952 5754 1906 1159 5904 4737 2494 84 -2434 -4137 -4083 -5344 263 -2030 -4178 -5906 -1323
15937 -1323 2313 -1459 -1970 4123 9230 10924 8557 7781 10514 10120 14715 12576 8912 3572 -656
15922 -656 -2541 -3829 -3627 -4481 5825 8878 4360 -183 -3366 -2735 -544 4390 3228 2754 2205 -3447
15906 -3447 706 5392 1939 -2014 1872 3195 -1259 1490 847 -1035 2261 5219 6669 2851 3910
15891 3910 4182 7739 9882 7331 4137 4487 6835 4707 750 -608 -2202 -6046 -12788 -14317 -8472
15876 -8472 -3114 -1160 1010 1590 2877 -1241 -2131 -4788 -6082 -978 1878 2627 2568 4410 7830 11318
15860 11318 11155 2118 -4066 -2209 -3977 -9732 -10635 -7971 -7545 -4825 3030 10131 10641 7951 9555
15845 9555 4892 -3000 -6583 -7427 -4103 -2467 -3872 -2665 1322 2958 -859 -5567 -4259 -1112 1863
15830A863J22K83j717K506J124K43j356j72J906K332K494m477n54m07k205j316
15814F69K390l90J151M091N706K120j848k670n057P99j604l699k418P56J860N161
15798G017L597j373n282l937k791J414J436q67M098N967J402n596l766K125M361
15783G805j44K397k253n065k492m003k439K069N704k892k659P94J512l53N06N76
15767i37J488l71k157k340L788r24K596K550k083K825K90r16n535l337o43N93
15751e113J856L272J015K69r41K136M352l082J586m207p501J185o82J474M470
15736H9K386K9J706l96o079l172L308K115J623m351j227M833R4J878K41N98k61
15719C414K212m360K676O57l978l017K073Q39o89j214k272L94L647k348p01k506
$$ plain form
15830 1863 1985 2268 551 3057 4181 4424 3068 2896 4802 7134 9628 5151 4597 4190 1985 669
15814 669 3059 2669 3820 7911 13617 15737 13889 11219 6162 6961 5357 1658 -760 -4 1856 7017
15798 7017 10614 9241 3959 22 -2769 -1355 81 -786 3312 9279 10681 5085 1319 3444 7805
15783 7805 7661 10058 7805 2740 248 -3755 -6194 -4125 1579 -1313 -3972 -3178 -1666 -2019 -1513 -937
15767 -937 551 180 -1977 -4317 -529 -1453 1143 3693 1610 4435 4725 3809 -1726 -5063 -5706 -5113
15751 -5113 -3257 15 1030 1299 358 2494 6846 3764 5350 1143 -6358 -5173 -5855 -4381 89
15736 89 2475 2504 4210 3814 -2265 -5437 -2129 -14 1609 -2742 -3969 864 958 2836 3077 3675 3414
15719 3414 5626 1266 3942 4599 621 -2396 -323 516 -173 -1387 -3659 -3265 382 -1966 -2667 -5173
15703e173l774L76N638K126k992k246L032M96K949k720k209N632J092o105K168
15688a710k80K66L902J80k127k574J305k54j428l950J523K649P99j85J571l82
15672f95k028K83K096j553j776o69oK094j115M73k088l204j030K307K941P96m50
15655c624j622j123J941K991K898j200K53N153L122m258l826j593k613q76J870
15640b507R74j634n770k444j023N227N801k17k48j85O397J016J809m402o348O58
15624b896M624m466n88M085j549j256n932n0Q898p00M21m09J840J701q08L399
15608F314K250n782q31Q44Q10n329L035N317p089j0828j634N976n128J566O521
15593c988M64Jr43M02J812m497J516r27j486J449N203j590l106n84J980J61M37
$$ plain form
15703 -5173 -8947 -8571 -2933 -807 -3799 -6045 -3013 -2517 432 -2288 -4497 1135 2227 -3878 -1710
15688 -1710 -1990 -1724 2178 2358 231 -2343 -1038 -1292 -2720 -6670 -5147 -2498 -1699 -1884 -313 -695
15672 -695 -2723 -2440 -344 -1897 -3673 -4342 -4348 -2254 -3369 -2896 -4984 -8188 -9218 -6911 -3970 -3174 -3624
15655 -3624 -5246 -6369 -4428 -1437 1461 261 514 5667 8789 4531 705 -888 -3501 -4377 -2507
15640 -2507 -1533 -3167 -8937 -11381 -12404 -7177 -1376 -1593 -1841 -2026 4371 5387 7196 2794 -3554 -2896
15624 -2896 1728 -2738 -3326 759 -790 -2046 -7978 -8028 870 170 591 182 2022 3723 2915 6314
15608 6314 8564 2782 1951 2795 3605 -1724 1311 6628 -461 -11289 -12923 -6947 -12075 -10509 -3988
15593 -3988 -3524 -3523 -4466 -4064 -2252 -6749 -5233 -6160 -7646 -6197 -994 -2584 -5690 -6274 -4294 -4133 -3696
15576c696m850n268P39K575K53R51M618O990K00l657q40k715j424k636P71K382
15560e607J288N406R05N63J858l902l327L489Q12l844l67r78L81l02l51K356J369
15543b51J065l588n430k831M118L705k0k181P85M566L207M468j542l52m78J75
15527E416P95n684k109L815k524l456m477p98R961J403p557j806M461l98L403
15512D45J106k042j170k11l68l447l049K556L836L601K472L7p396K813L225n189
15496b781K083j283K383L547O491J1366Q709k540l285q074m408j940n342J245
15482F171l155n003l616j393J250O03j212J795M740O91l102q01Q79k567L39K093
15466b288k121J136L010J64k67L804K05o56R26J861l664m323l23N679L775L672
$$ plain form
15576 -3696 -8546 -13814 -13075 -10500 -10247 -9296 -4678 2312 2512 -1145 -1985 -4700 -6124 -8760 -7989 -5607
15560 -5607 -4319 1087 1992 2555 4413 511 -2816 673 1485 -2359 -2726 -3704 -3323 -3625 -3976 -1620 -251
15543 -251 814 -2774 -8204 -11035 -6917 -3212 -3232 -5413 -4628 -62 3145 7613 6071 5719 5241 5416
15527 5416 6211 527 -1582 2233 -291 -3747 -8224 -9022 939 2342 -5215 -7021 -2560 -2958 445
15512 445 1551 -491 -1661 -1872 -2240 -5687 -8736 -6180 -2344 1257 3729 3766 -3630 -817 2408 -2781
15496 -2781 -698 -1981 402 3949 10440 21806 30515 27975 24690 16616 12208 10268 4926 6171
15482 6171 3016 -1987 -5603 -6996 -5746 -5143 -6355 -4560 180 871 -2231 -3032 -2153 -4720 -4381 -2288
15466 -2288 -4409 -3273 -263 -99 -366 3438 3643 2987 3913 5774 2110 -2213 -2536 3143 6918 10590
15450A0590K357O69m338q41l001J319n263l672L474R47J503J245n350o955j511
15435h827M337O2k414M197j370q64K433J268j605M095j906k585J193L838Q62m092
15419a378j021J350j493o59M18J283k06P32n801k083L217J504k842j590j93L80
15403h382M781o96m96M172k236l967P15k22J869L264L354L388j300K630J710J947
15387A0531l147r55j064k2J065l864K95M884K26m60k45k256m334P04o27m209L98
15370c080l68J130J990J405l935n102j798J639m63n64J793J90j925K476K663K932
15354a017j080L998l576j796L272q19J687p62j407j179n916J026O556P275n019
15339A243o567L592N524K986n336m694n63m011m42L805L046Q26l671r66l219J403
$$ plain form
15450 10590 12947 13616 9278 8437 5436 6755 1492 -2180 1294 2241 3744 4989 -361 -7316 -8827
15435 -8827 -4490 -4428 -6842 -2645 -4015 -4879 -2446 -1178 -2783 1312 -594 -3179 -1986 1852 2714 -1378
15419 -1378 -2399 -1049 -2542 -3201 -2783 -1500 -1706 -974 -6775 -8858 -5641 -4137 -6979 -8569 -8762 -8382
15403 -8382 -3601 -4297 -4793 -621 -2857 -6824 -6109 -6331 -4462 -1198 2156 5544 4244 6874 8584 10531
15387 10531 7384 6429 5365 5343 6408 2544 2839 7723 7949 7489 7244 4988 654 1358 731 -3478 -3080
15370 -3080 -3448 -2318 -328 1077 -2858 -7960 -9758 -8119 -8582 -9146 -7353 -7163 -9088 -6612 -3949 -1017
15354 -1017 -2097 1901 -1675 -3471 -199 -1018 669 -93 -1500 -2679 -8595 -7569 -1013 6262 1243
15339 1243 -5324 -1732 3792 6778 1442 -3252 -3815 -7826 -8268 -4463 -1417 -591 -4262 -5228 -8447 -7044
15323g044O36K412J681J333n190J153K452m60K076M72k110j251Q66j125l511m157
15307a1767J555P639k603Q11m310p20k888R26L995P1k352L550K571K976r56j250
15291b752m758k451M232L355k905m321J031L324o82L155N736K268J171p075m124
15276d796r73P610K6k968j33m206J073M807j026j661j416l701m306L894N239n012
15260g549o47j719K635K895L602J542j200o98O03J205j023R21m939p398P45P125
15244c900j695k930M780k147k998K878L538J894k695j107N550Q34l345k361K617
15229a087l423o337J131M097K079k233J11M36N776K51k565k774N50j170L28M153
15213f77J128j64l19l975n058k218M323K813K181l63K501o420j540K085M52j991
$$ plain form
15323 -7044 -6408 -3996 -2315 -982 -6172 -5019 -2567 -3027 -951 -479 -2589 -3840 -2974 -4099 -7610 -11767
15307 -11767 -10212 -2573 -5176 -4365 -8675 -9395 -12283 -11357 -7362 -7291 -9643 -6093 -3522 -546 -1502 -2752
15291 -2752 -7510 -9961 -5729 -2374 -5279 -9600 -8569 -5245 -5927 -2772 2964 5232 6403 -672 -4796
15276 -4796 -5769 1841 1867 -1101 -1234 -5440 -4367 440 -586 -2247 -3663 -7364 -11670 -7776 -2537 -7549
15260 -7549 -8196 -9915 -7280 -4385 -783 759 -441 -1139 -536 669 -354 567 -4372 -11770 -11025 -3900
15244 -3900 -5595 -8525 -3745 -5892 -8890 -6012 -2474 -580 -3275 -4382 1168 2002 -1343 -3704 -1087
15229 -1087 -4510 -10847 -9716 -5619 -3540 -5773 -5662 -5226 550 801 -1764 -4538 -3988 -5158 -4830 -677
15213 -677 451 287 -32 -4007 -9065 -11283 -6960 -4147 -1966 -2329 172 -6248 -7788 -5703 -5251 -7242
15197g242K22K614O481M590j370k851L71k783K637l201j249k65J981K2j748o882
15181h673R73K950J586n57J108r44l63jK16j500o87L176l806n714j949M028k14
15164a0371L883R14k193k868k625k197N183M060M341J486k603J690L607j067K85
15149A525k086n895m8m829J255J844J479J97N720K183l278k829k170m673o34J5
15133a2224P15R13R84l582P75Q0l065l234N240M789L089J089N002L83O71J809
15117C434K078n407p989j549K086K223J618j976k682R10J722L013o2j199l013
15102f793k327P031j391j336N778m3n182j476J916M79J824q053m852M496L147
15087f782m13k195L124J760K836m197l76K033L80n80m30j760k260J364o476J267
$$ plain form
15197 -7242 -7020 -4406 2075 6665 5295 2444 2815 32 2669 -532 -1781 -2046 -65 -43 -1791 -8673
15181 -8673 -7700 -4750 -3164 -3721 -2613 -3557 -3920 -3921 -3705 -5205 -5892 -2716 -6522 -12236 -14185 -10157 -10371
15164 -10371 -6488 -5574 -7767 -10635 -13260 -15457 -10274 -6214 -1873 -387 -2990 -1300 2307 1240 1525
15149 1525 -561 -6456 -6504 -11333 -10078 -8234 -6755 -6558 -838 1345 -1933 -4762 -6932 -11605 -12239 -12224
15133 -12224 -11509 -10596 -9612 -13194 -12419 -12339 -15404 -18638 -13398 -8609 -5520 -4431 571 954 1625 3434
15117 3434 5512 105 -7884 -9433 -7347 -5124 -3506 -5482 -8164 -7254 -5532 -2519 -2581 -3780 -6793
15102 -6793 -9120 -2089 -3480 -4816 962 919 -4263 -5739 -3823 -3344 -1520 -9573 -14425 -9929 -6782
15087 -6782 -7195 -9390 -6266 -4506 -1670 -5867 -6243 -4210 -3830 -4410 -4840 -6600 -8860 -7496 -13972 -12705
15071a2705P315M756J108j337o52L415N85N57K098l87J03J297J944k538q761k27
15055c429J476J03J37m33n01J36J201m54k700m364O1M111M105M16j009j738q70
15038c752J233P50k096J499L356O48l263k581R07j125P98o623n867N047O295P219
15022B445K59m41k021o24l583j45L393K310J841q45n975k187rK076k661J395L902
15005h70Q99K20o30k936r181l65M180p66m801k592m151N676N713O554L450M97
14989H97j242J050N071L272m542K32K916J185M955O56N317Q206J1888Q197M733
14974E2791Q06m655j3050r594r093o595j849j831J383J049l048k651n124m766
14960f227k781L049M539k71p087j737M584j53j20J840O030J688J362Q99l450n804
$$ plain form
15071 -12705 -5390 -634 474 -863 -1515 1900 2485 3042 5140 4753 4856 6153 8097 5559 -3202 -3429
15055 -3429 -1953 -1850 -1713 -2146 -2647 -2511 -1310 -1764 -4464 -8828 -8767 -4656 -551 -135 -1144 -2882 -3752
15038 -3752 -2519 -1769 -3865 -2366 990 1638 -1625 -4206 -3299 -4424 -3626 -10249 -16116 -11069 -4774 2445
15022 2445 2704 2263 242 -382 -3965 -4110 -717 1593 3434 2589 -3386 -5573 -5582 -3506 -6167 -4772 -870
15005 -870 29 249 -381 -3317 -12498 -12863 -8683 -9449 -14250 -16842 -20993 -15317 -9604 -3050 400 897
14989 897 -345 705 5776 9048 4506 4738 7654 8839 13794 14450 19767 27973 39861 48058 52791
14974 52791 53597 48942 35892 26298 17205 10610 8761 6930 8313 9362 6314 3663 -1461 -6227
14960 -6227 -9008 -5959 -1420 -1691 -8778 -10515 -5931 -6084 -6204 -4364 1666 3354 4716 5615 2165 -3639
14944c639n020K30J770N068J0676J4725R394K3712M1287M2060J8299j815k4492
14931A32255l0660k7259j9699j7023p385p499m118R23k835l863k85k530J310j087
14917A0245k037N011J716j723J555r92j473J598j784k721l253n561P99O365L245
14902A0990K038N069L121N076P819J3272L0361L7595K8952J7392n471l1573k9899
14889I4742k1050j9433j3179m842l967k209n891o612j841n379l064N138J707n813
14875H307m183j371j375M448N407k812n86K722M186k227l130M478K625j052p03
14860A4734k438L039P335J670N716J5398K7290K9219L6307L0870K3947j507l1844
14847A59736m2133l4705k8619j8696p138l724o523j106j460o048j11m97J337N80
$$ plain form
14944 -3639 -8659 -8429 -6659 -1591 9085 23810 33204 56916 98203 140263 158562 156747 132255
14931 132255 101595 74336 54637 37614 30229 22730 18612 19535 16700 12837 12552 10022 11332 10245
14917 10245 8208 13219 14935 13212 14767 13775 12302 13900 12116 9395 6142 581 1380 7745 10990
14902 10990 13028 18097 21218 26294 34113 47385 77746 115341 144293 161685 156214 124641 94742
14889 94742 73692 54259 41080 36238 32271 30062 24171 17559 15718 10339 7275 12413 14120 8307
14875 8307 4124 2753 1378 5826 11233 8421 7835 10557 14743 12516 9386 13864 16489 15437 14734
14860 14734 12296 15335 22670 24340 30056 45454 72744 101963 138270 169140 193087 191580 159736
14847 159736 117603 82898 54279 35583 28445 24721 18198 17092 15632 9584 9473 8976 10313 10893
14833A0893k657j035j377J172j525J47K439L683m460p271l573R33L673j945L02
14818f01j391o6K26m641n199J709Q23O6K492L439M991r82l717q268p82J0157M700
14801B956r7L480J294l522P243K2090K6323J6036Q946r55r174j8365j9018j1619
14787B5618m289l867O36j977j867j339M534k697L063L019n075J652j46m036k314
14772A0915O186K477l014k057L334J399q497J251j464k521k887j979k654M596
14758E085J608m769J967O27L381J305k364K547L470J168n854n132L106k356k369
14743A420L161K612n71L710K473r92n245m703P14K613k303j096J20O25l578l024
14727d064PL45pJ422R70O303P955K432k69k060k812r59N03j993l111j279K448
$$ plain form
14833 10893 8236 7201 5824 6996 5471 5618 8057 11740 7280 9 -3564 -2631 1042 -903 -601
14818 -601 -1992 -2058 -1832 -6473 -11672 -9963 -9140 -9074 -6582 -3143 1848 866 -2851 -11119 -11901 -1744 2956
14801 2956 2859 6339 7633 4111 11354 33444 59767 75803 84749 83794 74620 56255 37237 25618
14787 25618 21329 17462 18098 16121 14254 12915 17449 14752 17815 20834 15759 17411 17265 13229 10915
14772 10915 17101 19578 16564 14507 17841 19240 10743 11994 10530 8009 5122 3143 489 5085
14758 5085 6693 1924 3891 4518 7899 9204 6840 9387 12857 14025 8171 3039 6145 3789 1420
14743 1420 4581 7193 6622 10332 12805 11813 6568 1865 2579 5192 2889 1793 1913 2538 -1040 -4064
14727 -4064 -4057 -3712 -3719 -2297 -1327 4976 12931 15363 15094 13034 10222 9263 9766 7773 4662 3383 5831
14710E831J976j41K106j75r49L941n86k356l431l223L14k48n131o99j047N270
14694A452q66M22L325J712K743l526n116L408J826k135k044J420j628o244l643
14679h894l0o23Q252J816k698j403o559m105M79J813P273N466m86Q007O409j764
14663A2953o293k119N9j970l769N206K829m081l804R41K973P7N904m286n458j676
14647b514n075j747J921N429J173L778Q306J1630J0311K181o986n723r946k13
14633A2525j674j900K827l065m813J628j448o50L140j292k174K917l153k913k255
14618b300l07k01j224M78K429n479k367J82J248L067N011L115k575R70k779k206
14602b938m98R87L0o16K246n097n637k623M182P034Q6K821l826K340q98k061l570
$$ plain form
14710 5831 7807 7666 9772 9597 8648 12589 12003 9647 6216 2993 3307 3059 -2072 -2771 -3818 1452
14694 1452 586 1008 4333 6045 8788 5262 146 3554 5380 3245 1201 2621 993 -5251 -8894
14679 -8894 -8924 -9547 -1295 521 -2177 -3580 -10139 -14244 -13765 -11952 -4679 787 301 8308 14717 12953
14663 12953 6660 4541 4600 2630 -1139 4067 6896 2815 -989 -48 2925 3002 8906 4620 -838 -2514
14647 -2514 -7589 -9336 -7415 -1986 -813 2965 11271 22901 33212 35393 28407 22684 12738 12525
14633 12525 10851 8951 11778 8713 3900 5528 4080 3430 6570 5278 3104 6021 2868 -45 -2300
14618 -2300 -2607 -2808 -4032 -3554 -1125 -6604 -8971 -8789 -7541 -4474 537 3652 1077 2047 -732 -2938
14602 -2938 -3436 -2449 -2419 -3035 -789 -5886 -11523 -14146 -9964 -2930 -2844 -23 -3849 -1509 -2407 -4468 -8038
14585h038r24L545Q35p12J44R40Q197m89j838n19P5L236P19m215o168l6M279O30
14567c39l82k19R69K575J648K582l004o403p217P47K806K762L453N283J053q14
14551E500l476L160Q69o769n781l799O11N883Q252M469L780L727N538J411l572
14536A9803l009p840j4518o506k307j041p17K101L408O187J591M00j312J802P450
14521E492L990j46P49j159p322m985J454N112n603k603k423J194O990P106j443
14506F403k235j670K30j188j669o132j000o78n41P11L584K216P61l628k563K008
14490e391l59p250J358J518K620M076O92K315l030l867L631Q580L94l494m59k161
14474h27j146O31k913k071k312l16J984O180L274M323L347N211J0853J6771J4351
$$ plain form
14585 -8038 -8962 -5417 -4582 -5294 -5150 -4210 3987 3498 1660 1141 1216 4452 5171 956 -5212 -5248 -969 -339
14567 -339 -721 -940 29 2604 4252 6834 3830 -2573 -9790 -9043 -6237 -3475 -22 5261 6314 5500
14551 5500 2024 5184 6053 -716 -6497 -10296 -9685 -3802 4450 8919 12699 16426 21964 23375 19803
14536 19803 16794 8954 -5564 -12070 -14377 -15418 -16135 -14034 -10626 -4439 -2848 -2448 -3760 -1958 5492
14521 5492 9482 9336 10085 8926 1604 -3381 -1927 3185 -2418 -5021 -7444 -6250 740 7846 6403
14506 6403 4168 2498 2728 1540 -129 -6261 -7261 -7939 -8480 -7769 -4185 -1969 -1208 -4836 -7399 -5391
14490 -5391 -5750 -13000 -11642 -10124 -7504 -3428 -2736 -421 -3451 -7318 -3687 4893 5287 1793 1334 -827
14474 -827 -1973 -1342 -4255 -6326 -8638 -8954 -6970 -790 2484 6807 10154 15365 26218 42989 57340
14459E7340K1068J2356J1019L516k371j1050j6464j4572j4504j2231n312k252
14447B6543p709o740m657l618M408k93j9j60l447m360m04N406N058N672K344o53
14431A7371l083J507r74k267n027l073K113M888l413k843l176J672j741j049k46
14416F59m56J033n53j263j093J867l519K873K577J25k033l66O42O38l616K533
14400D8M690k18l062k814n703k518K519L974k74k484M35K175J336p64O53K912
14384I05j930j068m322k946K043k963Q2K989m97P68P49K60j462l911j32K141M662
14367d632K354M60m204m369J781O258l158j589J658L996K951p67k428Q30K102
14352A243p8N445M333J676j219j728k155J449J521M5K16j531j337m526l026l171
$$ plain form
14459 57340 78408 90764 101783 105299 102928 91878 75414 60842 46338 34107 28795 26543
14447 26543 18834 12094 7437 3819 8227 7934 7915 7755 4308 -52 -456 4950 10008 15680 18024 17371
14431 17371 14288 15795 14821 12554 7527 4454 6567 11455 8042 5199 2023 3695 1954 905 659
14416 659 203 1236 683 -580 -1673 194 -3325 -452 2125 2250 217 -149 493 1131 -2485 48
14400 48 4738 4520 1458 -1356 -7059 -9577 -7058 -3084 -3358 -5842 -5407 -3232 -1896 -2660 -2007 905
14384 905 -1025 -2093 -6415 -9361 -7318 -10281 -10199 -7210 -7707 -6939 -6190 -5930 -7392 -11303 -11435 -9294 -4632
14367 -4632 -2278 -1818 -6022 -10391 -8610 -2352 -5510 -7099 -5441 -1445 1506 739 -1689 -859 1243
14352 1243 1165 6610 10943 12619 11400 9672 7517 8966 10487 10532 10748 9217 7880 3354 328 -2843
14336b843j424k42J2595l88q889l473M779l121o144Q72j467j68M512J224K160
14321b017j756L09M22m275P156P227l677l965m169m029L01L291L717l286k851
14306g602J470L739j088j541k451m540P67K069L062J029L182j53l40R9j379k729
14290f406l462n126n31K890L485Q70O605l16J662N50l67p49J6j534j346J861l36
14273b234j226J498M483J71k195l012n42J403L52j220j355k632l387L463J833
14258d600K89M694J659Q48J41O0j556l925n52m967r53j487o34p14o60N600L58
14241f399L69l602k942L167K320k946M021M738j310KJ362k16J453O574k15n378
14225I98m694M427R07o255j229K288K494p9K281k043j565j520j919j301k761P64
$$ plain form
14336 -2843 -4267 -4509 8086 7698 -1191 -4664 115 -3006 -9150 -8278 -9745 -9913 -5401 -4177 -2017
14321 -2017 -3773 -3464 -3042 -7317 -161 7066 3389 -576 -4745 -8774 -8473 -5182 -1465 -4751 -7602
14306 -7602 -6132 -2393 -3481 -5022 -7473 -12013 -11246 -9177 -6115 -5086 -1904 -2057 -2397 -2298 -3677 -6406
14290 -6406 -9868 -14994 -15525 -12635 -9150 -8280 -1675 -1991 -329 221 -146 -895 -879 -2413 -3759 -1898 -2234
14273 -2234 -3460 -1962 2521 2692 497 -2515 -3057 -1654 -1302 -2522 -3877 -6509 -9896 -6433 -4600
14258 -4600 -4311 383 2042 2890 3031 3091 1535 -2390 -2942 -7909 -8862 -10349 -10983 -11697 -12357 -6757 -6399
14241 -6399 -6030 -9632 -12574 -9407 -7087 -10033 -6012 -1274 -2584 -2582 -1220 -1436 17 6591 6376 998
14225 998 -3696 731 1638 -4617 -5846 -3558 -1064 -1143 1138 -905 -2470 -3990 -5909 -7210 -9971 -9207
14209i207L126J886j686m739M153N607j866q39J477j636l795K901L45N93o5j101
14193d846j499L801O589N85j884R13q67l182n42R92j951m775M982l400l303m389
14177a2776K938L476K966k07j618M841k595m752M940N744l950n624r50K983M197
14162c87L62L375M787J957j528q027j620k167J716j195l214L97j681j170L027
14147e368M108L705L626k702n822l399m390J29n237j336j501O902J4853L201k721
14132D048j179J51J904m857j9343j0016N497O779K684L321J8925K3343R227k355
14118C8129n752q204j4834j9566j5083r028K689N830R266K943P79R424M718K692
14104D003J52M058N265L367l28q538o692j977m777r406k593j557K452L874M252
$$ plain form
14209 -9207 -6081 -4195 -5881 -10620 -6467 -860 -2726 -3565 -2088 -3724 -7519 -4618 -4273 -3680 -3745 -4846
14193 -4846 -6345 -2544 4045 4630 2746 3659 2792 -390 -932 60 -1891 -6666 -1684 -5084 -8387 -12776
14177 -12776 -9838 -6362 -3396 -3603 -5221 -380 -2975 -7727 -2787 2957 -993 -6617 -7567 -4584 -387
14162 -387 -25 3350 8137 10094 8566 539 -1081 -3248 -1532 -2727 -5941 -5544 -7225 -8395 -5368
14147 -5368 -1260 2445 6071 3369 -2453 -5852 -10242 -10113 -15350 -16686 -18187 -11285 3568 6769 4048
14132 4048 2869 3020 4924 67 -19276 -29292 -23795 -17016 -14332 -11011 7914 31257 40484 38129
14118 38129 32377 24173 9339 -10227 -25310 -34338 -31649 -25819 -16553 -13610 -12831 -3407 1311 4003
14104 4003 4155 8213 13478 16845 16517 7979 1287 -690 -5467 -14873 -17466 -19023 -16571 -12697 -8445
14089h445M017l46j744N99j428j396J296m66j185j320L36K413M890J654n94j538
14073c257k436l356l970J344L401k812K173N884O22m881m431N326L456K200j457
14058b194l158k795j858Q991O061J005p42o736n332K75O72J611O587P48K260j015
14042D380n396L038n264p261J235l153k984R79K577N828M228J901P38m177J22
14027c209l09k692L936Q02L768J4j553m007k939J21n339M670K83j929l655O46
14011a1392Q224J246p84k372m103j66J340l45k87K842K753O04M96m146l904J270
13995h724K676J993N35k986j945j974K486Q25o20M143P384K039k440O68l902k81
13979a23L299l344m043r97k818K264J477L151L824k612n341L667J101j436k568
$$ plain form
14089 -8445 -4428 -4774 -6518 -5919 -7347 -8743 -7447 -7913 -9098 -10418 -10082 -7669 -2779 -1125 -1719 -3257
14073 -3257 -5693 -9049 -13019 -11675 -8274 -11086 -8913 -3029 -2407 -7288 -11719 -6393 -2937 -737 -2194
14058 -2194 -5352 -8147 -10005 -1014 5047 6052 5310 -1426 -6758 -6483 -5811 -4200 2387 3135 5395 4380
14042 4380 -1016 2022 -3242 -10503 -9268 -12421 -15405 -14426 -11849 -6021 -1793 108 846 -3331 -3209
14027 -3209 -3518 -6210 -2274 -1472 2296 2310 757 -3250 -6189 -6068 -11407 -6737 -6454 -8383 -12038 -11392
14011 -11392 -3168 -1922 -2706 -5078 -9181 -9347 -8007 -8352 -8639 -5797 -3044 -2440 -1944 -6090 -9994 -8724
13995 -8724 -6048 -4055 -3520 -6506 -8451 -10425 -7939 -7114 -7734 -3591 3793 5832 3392 4060 158 -123
13979 -123 3176 -168 -4211 -5208 -8026 -5762 -4285 -1134 2690 78 -5263 -1596 -495 -1931 -4499
13964d499M40j015J646J810N166q14j373K042n58l356p93J471j186l831j103M140
13948a813J472J791q88o63l781l367k898J565O030k09p49l670k436r74K31L006
13932g353q59K622K56k041l089J969K602l650j525K440K702J697J558k176J694
13917c153J235O526J391o82j768k125P063J8173K4123J8957J5977M958o743j5786
13903F8146k0656j4607q529n037Q75o914j2060j1869k149J948O418M811K11o910
13889f322j648L869j078J530j840K18L88J702k46R54Q04m20K947M061L618M63
13873I000J606K06L533R095J6095K3729L7908O0754P0185N5902J4635k8656n5155
13860B18837o2005m5755k8650j5173j0843j2263j0790j2824l790k719k287K989
$$ plain form
13964 -4499 -4059 -5074 -3428 -1618 3548 2734 1361 3403 2845 -511 -1304 167 -1019 -4850 -5953 -1813
13948 -1813 -341 1450 562 -101 -3882 -7249 -10147 -8582 -2552 -2761 -3510 -7180 -9616 -10590 -10359 -7353
13932 -7353 -8212 -5590 -5334 -7375 -10464 -8495 -5893 -9543 -11068 -8628 -5926 -4229 -2671 -4847 -3153
13917 -3153 -1918 4608 5999 5317 3549 1424 8487 26660 50783 69740 85717 90675 83932 68146
13903 68146 47490 32883 24354 19317 20192 13278 1218 -10651 -12800 -10852 -4434 377 588 -6322
13889 -6322 -7970 -4101 -5179 -3649 -5489 -5271 -4883 -3181 -3427 -2473 -1669 -2089 858 4919 8537 9000
13873 9000 10606 10812 14345 23440 39535 63264 101172 161926 232111 288013 302648 273992 218837
13860 218837 156832 111077 82427 67254 56411 44148 33358 20534 16744 14025 11738 14727
13848A4727K551o481q69k584o629J172M112J264p33K27N18J99r22q23J479j81
13832G027K201J611N483P449P482M184Q411J9579M4208O9761P1652M7600L585
13819C00233l7521n9014n7714m3354k7837j6513o126o881p248j0875q091l111
13807A5948k490l800j827n362k335M73L988J437J778j32m921r131j217L837K158
13792a596K867k334j543K192R92K542O699K640J935N720J0199J5110K4518K2921
13778I2862J1259n39j7210j7977k0821j5614j0227p475k950p482J01R52k941J832
13764C770J311j373L81K168m4j662k062M036l373K427n32l404l348j010j497J215
13748b997l278k241K883N626k13l364l694k04k576l431l098P887N42j519R99R6
$$ plain form
13848 14727 17278 10797 9928 7344 715 1887 5999 7263 6530 6757 7275 7474 6552 5729 7208 7027
13832 7027 9228 10839 16322 23771 31253 35437 43848 63427 107635 177396 249048 296648 300233
13819 300233 262712 203698 145984 102630 74793 58280 52154 45273 38025 27150 19059 15948
13807 15948 13458 9658 7831 2469 134 607 4595 6032 7810 7678 2757 -6374 -7591 -3754 -1596
13792 -1596 1271 -1063 -2606 -414 578 3120 9819 12459 14394 20114 30313 45423 69941 92862
13778 92862 104121 103582 86372 68395 47574 31960 21733 14258 11308 3826 3927 4879 1938 3770
13764 3770 5081 3708 4089 6257 6213 4551 2489 6525 3152 5579 5047 1643 -1705 -2715 -4212 -2997
13748 -2997 -6275 -8516 -5633 -7 -220 -3584 -7278 -7482 -10058 -13489 -16587 -8700 -8158 -9677 -8678 -8582
13732h582p40k2K581J814K592n274j783N680L054J177L878k160J651O413j89r53
13716I137p972n696j26R26L063M300j86j038k438j429n76p382n981j410o001J988
13700b0821k469m590L417J1250k01k131L896P640J295m125o174N7L991K308K377
13685d280J593o34p61k99K356o447o285r8K669O343N242m993k041j810M280j005
13669f170j358j626o07M444j653j662j881L166L998k28q98m169o06J920m7J450
13653e927l45j190N445k22J067O63N345j431j465m86N955l93p7L541N227R11p471
13636I147l696p50j477J078o72o066o977j144K539l357m394J881J949L480k64
13621h723k1l045j442N094L498L102M36p551p83J486k06l545M735Q038L197N219
$$ plain form
13732 -8582 -9322 -9344 -6763 -4949 -2357 -7631 -9414 -3734 -680 497 4375 2215 3866 10279 10090 9137
13716 9137 1165 -4531 -4657 -3731 -668 3632 3446 2408 -30 -1459 -2035 -9417 -15398 -16808 -22809 -20821
13700 -20821 -23290 -27880 -24463 -13213 -13414 -15545 -11649 -4009 -2714 -6839 -13013 -12956 -8965 -6657 -4280
13685 -4280 -2687 -3321 -4082 -4381 -2025 -8472 -14757 -14855 -12186 -5843 -601 -5594 -7635 -9445 -5165 -6170
13669 -6170 -7528 -9154 -9761 -5317 -6970 -8632 -10513 -7347 -3349 -3577 -4475 -8644 -9250 -7330 -7377 -5927
13653 -5927 -6272 -7462 -2017 -2239 -1172 -509 4836 3405 1940 1454 7409 7016 6939 10480 15707 16618 9147
13636 9147 5451 4701 3224 4302 3630 -2436 -9413 -10557 -8018 -11375 -15769 -13888 -11939 -8459 -8723
13621 -8723 -8744 -11789 -13231 -8137 -4639 -1537 -1101 -8652 -9435 -7949 -8155 -11700 -6965 1073 4270 9489
13605I489P30j676M471Q745M646K767L400k107p23k016j900o89o918k377o80o185
13589H977k496J674n493o669l401M875m58j834J535J868P93J89p15L912M37m130
13573i36l306K622J293M27M980J1575J1654J6700J5488J5321O557r495j3272q673
13559E0935m150m277J197J19k346j259L041l87o596k029k713J0p963j567n601
13544A6414n242p071n265j296O264L636J69l320j187k914K819j046J341J771O65
13529E738L152K890P97J769N756P920J8645L4219M6273N1787L5402q00k6865m1188
13515A45495m4046k6284j2912j1437p191R44R85n712n766n615p967o421K198J982
13501A8253m214p128m17j155k374j516p053j595M006Q272K858K187M206n1l540
$$ plain form
13605 9489 10219 8543 13014 21759 26405 29172 32572 30465 29742 27726 25826 25137 18219 15842 15162 8977
13589 8977 6481 8155 2662 -4007 -7408 -2533 -2991 -4825 -3290 -1422 -629 -440 -1155 2757 3194 -936
13573 -936 -4242 -1620 -327 100 5080 16655 28309 45009 60497 75818 82375 72880 59608 50935
13559 50935 46785 42508 43705 43824 41478 40219 43260 42873 36277 34248 31535 31545 23582 22015 16414
13544 16414 11172 4101 -1164 -2460 3804 7440 7609 4289 3102 188 3007 1961 3302 5073 5738
13529 5738 8890 11780 12577 14346 20102 28022 46667 80886 127159 178946 214348 213548 186683 145495
13515 145495 101449 75165 62253 50816 43625 44569 45554 39842 34076 28461 20494 14073 16271 18253
13501 18253 14039 6911 6494 5339 2965 1449 -5604 -7199 -3193 5079 7937 10124 14330 14279 10739
13486A0739k61n28o83J158L675L678k69N363K2959L5465M7325M7996M3922J3519
13472B34058l0667m1617l7831l4943k3919j6606j4649p606j132m8k11l053j211
13459B0565l885n111k308Q60O805R279N557J816n574m929p102o524n8L953j642
13444A1702m056J311r12n371k015j846J052q59j667M183N176P825J0979J5736
13430D1238J5509J2269N396o829j1154j2462p064o152o641o421m363M14l041j757
13416H942n77J314J686M063k545q026n621J207K355M773N657O003O399J1527K924
13401D0081o350m617l538k677p699p199l672L945K143k793l428n674q572k40M814
13386e476M051p15k681L972R27P23K276K585n045k055K198L463j716j0314m14
$$ plain form
13486 10739 10478 9950 9267 10425 14100 17778 17509 22872 45831 81296 128621 176617 220539 234058
13472 234058 203391 161774 123943 89000 65081 48475 33826 26220 25088 25040 24829 21776 20565
13459 20565 16680 11569 9261 10121 16926 26205 31762 33578 28004 23075 15973 9449 9391 13344 11702
13444 11702 7646 8957 8045 2674 659 -1187 -135 -994 -2661 1522 6698 14523 25502 41238
13430 41238 56747 69016 74412 67583 56429 43967 36903 30751 24110 17689 13326 13740 10699 8942
13416 8942 8365 9679 11365 15428 12883 4857 -764 443 2798 7571 13228 19231 25630 37157 40081
13401 40081 33731 29114 25576 22899 15200 8001 4329 8274 10417 7624 4196 -1478 -10050 -10290 -5476
13386 -5476 -1425 -2140 -4821 -849 78 801 3077 5662 617 -1438 760 4223 2507 -7807 -8221
13371h221M882J943K182R02l57L30L65k330q129k46M273R79J543K236L11k687
13355b024K123L118q8j918M303J691l910l384r483q77K982J127k030K310J426
13340d634M695k539o06M336J056m682q12K253k023m218k609l33k501j225j760
13325a5602O720Q183M388M061J978n831o095l611K85q66j246K528K27j554Q13
13310e622M396J965m630m379M169Lj225k660K516m938l744n68r13K474J955K805
13294h396K333J98J255L527N551j287K453L913q19l956l808l622j085K678R03
13279a62m085m895Q21Q137J491o151q8J32k420j200k05K842N747o85k872r04m191
13262h688k929K412p64L603K088k560j284n10K836Q529N614K733K958q60K338
$$ plain form
13371 -8221 -3339 -1396 786 1688 1331 1661 2026 -304 -8433 -8679 -4406 -3427 -1884 352 663 -2024
13355 -2024 99 3217 3129 1211 5514 7205 3295 -89 -9572 -10449 -7467 -6340 -8370 -6060 -4634
13340 -4634 61 -2478 -3084 1252 2308 -2374 -3186 -933 -2956 -7174 -9783 -10116 -12617 -13842 -15602
13325 -15602 -8882 -699 3689 7750 9728 3897 -2198 -5809 -5524 -6390 -7636 -5108 -4881 -6435 -5622
13310 -5622 -1226 739 -3891 -8270 -4101 -4098 -5323 -7983 -5467 -10405 -14149 -14717 -15630 -13156 -11201 -8396
13294 -8396 -6063 -5865 -4610 -1083 4468 3181 5634 9547 8728 4772 964 -2658 -3743 -1065 -162
13279 -162 -4247 -9142 -8321 -184 1307 -4844 -4932 -4800 -7220 -8420 -8625 -5783 -36 -721 -3593 -4497 -8688
13262 -8688 -11617 -9205 -9969 -6366 -4278 -6838 -8122 -8632 -5796 2733 8347 11080 14038 13178 15516
13247A5516M146m778p924l592L421L492o516r81K236n870k694k875j94m589R91
13232a0211j309m330L62Q976R795J143m138J307N163O075R614Q473M646O139p34
13217D0971o553r983q990p05K594M879O283k197o780q58M174J783m521M634P15
13202B5446n165K337K837J773M319n94r537l949J949n715m472N543M64j562N546
13187A9220J3927J6000K1947L2940L9665K8524M889j4095j6923n910J5920K5169
13175A81273J8877o611k3612l2690k9187j7476j5092o418j112n941k309j963l138
13162E4601k912j5r56K931L565M906Q298J3126J5033K4310M7167Q0274J40656
13149C90984K48131L92048M57241L29380N7441k05554l53564l32547k16036r1211
$$ plain form
13247 15516 19662 14884 6960 3368 6789 10281 3765 2784 5020 -850 -3544 -6419 -6613 -11202 -10211
13232 -10211 -11520 -15850 -15488 -6512 3283 4426 288 1595 6758 12833 22447 30920 35566 41705 40971
13217 40971 34418 24435 15445 14740 17334 22213 28496 26299 19519 18661 22835 24618 20097 24731 25446
13202 25446 20281 22618 25455 27228 31547 30953 21416 17467 19416 13701 9229 14772 15236 13674 19220
13187 19220 33147 49147 71094 104034 143699 172223 177112 163017 146094 140184 156104 181273
13175 181273 200150 193539 169927 137237 108050 90574 75482 69064 67952 62011 59702 57739 54601
13162 54601 51689 51674 50718 53649 57214 62120 70418 83544 98577 122887 170054 250328 390984
13149 390984 639115 1031163 1488404 1817784 1875225 1669671 1316107 983560 767524 676313
13139F76313k41M5957L3342k4148p4486j09478r6815o1709k4163o007j9793m0616
13127B98156m2127m1709l0655k6948k5224j6402j3620q771r244j1559k498j701
13115F7698q911j0641q268J04L020J709L687J0659P301j450K528P475O613k96
13101H1228K068N523M193Q034R971K5928N0690Q6934J16215R7980K7595m5052
13089D71307r3884r5445o1404l2636k8869k1011p823j9038j8279j4046j4018p846
13077E7008q757q390l907p995p728L410O67j754n769m030j270o50k414m369M270
13062H322M346K011L263l864n180M436L207m624k084N021O116P205J7411L0773
13048G6359L9702L3586J5180m139k8863l3687l4126k2356j2722j0153l715m833
$$ plain form
13139 676313 676072 722029 755371 731223 656737 547259 450444 388735 364572 358565 338772 298156
13127 298156 256029 214320 183665 156717 131493 115091 101471 92700 83456 71897 69399 67698
13115 67698 58787 48146 39878 39982 43002 44711 48398 59057 66358 64908 67436 74911 81524 81228
13101 81228 83296 88819 93012 101046 111017 136945 187635 274569 390784 488764 516359 471307
13089 471307 377423 281978 220574 187938 159069 138058 130235 111197 92918 78872 64854 57008
13077 57008 48251 39861 35954 27959 20231 23641 24308 22554 16785 12755 11485 10835 8421 4052 8322
13062 8322 12668 14679 17942 14078 8898 13334 16541 11917 9833 14854 20970 28175 45586 76359
13048 76359 116061 149647 164827 160688 131825 98138 64012 41656 28934 18781 15066 10233
13036A0233m82O3J49j40J986l704l556k320m290m098M400N729j929q342K12K942
13020c147m508n089J767J902j480J839L488m7K740l109j615L225n12l073L018
13005d601M87j055k75K365N69J194q57m905j719M187o53n568P21L451o80n13o032
12988a3884K022O149Q211O935J132J092M94j12m104n317o738j533K171l117l170
12973i769j041p46K30N353N965J84k934l690M242M585j93N536L022q285l203K473
12957A729K859m389k662N171M321o19r114l766Q43n830k030k238o209n056k495
12942b9485L056l043M967R145Q399O126k882l433m06j273m281m449l433k546n7
12927b3595J319N530M672k727k729n511M867R210M150K078K246R96k043l730k705
$$ plain form
13036 10233 9751 9814 9963 9823 11809 8105 4549 2229 -2061 -6159 -1759 3970 2041 -6301 -6089 -3147
13020 -3147 -7655 -12744 -10977 -9075 -10555 -8716 -5228 -5275 -2535 -5644 -7259 -4034 -4546 -7619 -4601
13005 -4601 -4114 -5169 -5444 -3079 -2510 -1316 -2173 -7078 -8797 -4610 -5263 -10831 -10110 -6659 -7339 -7852 -13884
12988 -13884 -11862 -5713 2498 9433 10565 11657 12151 12039 7935 2618 -4120 -5653 -3482 -6599 -9769
12973 -9769 -10810 -11556 -11326 -5973 -8 176 -2758 -6448 -2206 2379 2186 7722 10744 2459 -744 1729
12957 1729 4588 199 -2463 2708 7029 6410 -2704 -6470 -5627 -11457 -13487 -15725 -21934 -26990 -29485
12942 -29485 -26429 -29472 -24505 -15360 -6961 -835 -3717 -7150 -7556 -8829 -13110 -17559 -20992 -23538 -23595
12927 -23595 -22276 -16746 -12074 -14801 -17530 -23041 -18174 -8964 -4814 -2736 -490 506 -1537 -5267 -7972
12912g972k492J912M190N844j7K557R255L492M81L335l215M428M387J0m151l470
12896A8574l679Q71P35j21r491m707M283K583M79j705P127N496L697L032K374
12881B9548K272l2J967K173n310r643p574M1O804N221l978p307j454J452j018
12866A3162N283K937P035j46M562Q858O456N065J2087J9953J7140K0756L3607
12853A56755N6024Q8136J44874K45348M14542O03509O28976L31774q1403m29573
12843B158962n62100m83375l31016k06579j29848q4340o3791m4614l7104l0650
12833A85545k3404k0263k1955j7971j7765j3234j642J967M777M203j396k128r247
12820F7487j3168j1951j0859m790j525K640j862o451J157k019M865J0899R542
$$ plain form
12912 -7972 -10464 -8552 -4362 1482 1465 4022 13277 16769 17250 20585 17370 21798 26185 26195 22044 18574
12896 18574 14895 15766 16501 16380 6889 2182 6465 9048 9527 7822 14949 20445 24142 27174 29548
12881 29548 31820 31788 33755 35928 30618 20975 13401 13442 20246 25467 21489 14182 12728 14180 13162
12866 13162 18445 21382 28417 28271 32833 41691 48147 53212 65299 85252 102392 123148 156755
12853 156755 212779 300915 445789 691137 1105679 1709188 2338164 2669938 2588535 2158962
12843 2158962 1596862 1113487 782471 575892 446044 361704 297913 253299 216195 185545
12833 185545 162141 141878 119923 101952 84187 70953 69311 71278 76055 80258 78862 76734 67487
12820 67487 54319 42368 31509 26719 25194 27834 25972 19521 20678 18659 23524 34423 43965
12807D3965J3656N828N087J1966J447q201j735o232j3890j0882k565j726o042
12794C0676M235R116N380j112N476Q216Q488P037N473R592J6312J6593K7698M4674
12780A97854N7888Q4955J14383J42376J56790J58730J27811P8497K5775k7579
12770A117480q7802j26627j29493j29289j26125j00694q0212o1134m5034l2770
12760A98300k0663j7251j6937r209r472r713j1233j210O972K627K991K617n389
12747A12430r547j2193j0595j1121p973p116k014J666J447N095M209J088j344
12734F4032q453r77k993n908m119n029k337L197K065N45P902L678M089P395R924
12719G3011Q654R941K5197N2455Q8245J10811M3871j2230o6426q6339n9400l0187
$$ plain form
12807 43965 57621 63449 68536 80502 81949 73748 72013 65781 51891 41009 38444 36718 30676
12794 30676 34911 44027 49407 48295 53771 61987 70475 77512 82985 92577 108889 125482 153180 197854
12780 197854 255742 340697 455080 597456 754246 912976 1040787 1119284 1145059 1117480
12770 1117480 1029678 903051 773558 644269 518144 417450 337238 276104 231070 198300
12760 198300 177637 160386 143449 134240 124768 115055 103822 102612 109584 112211 115202 117819 112430
12747 112430 102883 90690 80095 68974 61001 53885 51871 53537 54984 60079 64288 65376 64032
12734 64032 55579 54602 51609 45701 41582 36553 34216 37413 39478 40023 47925 51603 55692 63087 73011
12719 73011 81665 91606 116803 169258 257503 368314 412185 399955 333529 247190 187790 157603
12707A57603k0996j3736o120j085n457p458J273P395J7282J9893J0212p923k2918
12694A27965l6218k8473j4233m226O901J2183J6320J9784K3062K7217K5412K1264
12682A96958K3379L6255N7933O7730N0670L373m2588o0083o8406n6758l7444k0972
12670A50047J960K0374M4691P7934J43813K49870L36178J74391k9137j88832k69253
12659G12036k00091j07268n6134l8803l0601k7234j9849o103K434J0470L1451
12648B70308O5755J19120K00156L39541M41512K52098o431k06263l38258k80019
12638H57519j86990j24164p6633k8577n488M440j2620l0369m8689m3319k5924
12627B79186k2481j7508k398Q427J2768J4208O264m464r012j4119j2957j4512
$$ plain form
12707 157603 136607 122871 116751 115666 110209 102751 104024 111419 128701 148594 158806 150883 127965
12694 127965 91747 63274 49041 44815 51716 63899 80219 100003 123065 150282 175694 196958
12682 196958 220337 256592 314525 382255 432925 436298 393710 333627 265221 208463 171019 150047
12670 150047 152007 172381 217072 295006 438819 688689 1024867 1199258 1170121 981289 712036
12659 712036 511945 404677 348543 309740 279139 251905 232056 225953 228387 238857 270308
12648 270308 336063 455183 655339 994880 1436392 1688490 1682059 1475796 1137538 857519
12638 857519 670529 546365 469732 441155 435667 440107 427487 397118 348429 305110 279186
12627 279186 256705 239197 236799 245226 257994 272202 278466 274002 264990 250871 237914 223402
12615B23402j1197P545L0134N7346Q0411P5019Q2214J01985N0679k9554q1383
12604E86601j24503j09955p1189m4165k2922p928r483j7035k5240k1383k5459
12593A07339j9083q617j2588q581j1910o242m782l134J304P739K2870L4991L6568
12580A35874M6830O9123P5292N0106o817o3314q2162o8376k9867J6315M0377K8448
12568B11829N208j9684k7913l8603m0391l0636k0706r946K947M094P754J6889
12556F0842J0859J5977K3113M4076O9077P1184P6263P9559N2340J1263k4080n6563
12544D33910p4036r5102j27802j43718j07044n2407J7753Q9030J28063J44012
12534B12659J64643J98075K14437J81397J14578L8589Q270J8996J3733l4140j10511
$$ plain form
12615 223402 212205 219750 249884 307230 387641 462660 544874 646859 697538 667984 586601
12604 586601 462098 352143 280954 236789 213867 205939 196456 179421 154181 132798 107339
12593 107339 88256 79639 67051 58470 46560 40318 35536 32402 33706 41445 64315 99306 135874
12580 135874 182704 251827 327119 377225 370408 307094 224932 156556 126689 143004 183381 211829
12568 211829 217037 197353 169440 130837 90446 59810 39104 29158 32105 36199 43953 60842
12556 60842 71701 87678 110791 154867 223944 295128 371391 450950 503290 514553 490473 433910
12544 433910 359874 264772 136970 -6748 -113792 -166199 -148446 -59416 68647 212659
12534 212659 377302 575377 789814 971211 1085789 1124378 1132648 1151644 1165377 1131237 1020726
12523A020726j85917k07936j90472j36617r0793q3407q7349r1134o8295R018J18424
12512F248J90204J87928J33817N6279k7613o4757n3142j4850M6702J21143J98878
12501G80837L43085N68917P05915M82668K2958l96200o20407n54631l56351j93335
12491G83456j11141o6743n1446m6005m8895m6741l4868k8176j6066p732J0078
12480C35721J7678L2098N1970N7098M9638N8112Q7535J56784J91762J16854N1646
12469A206896k7716p9601q4334r3637q7889n8928k7783J259L2904Q0604J37661
12458I99436K28996L81601O16747P69546N93813J53875k83913n27467m76130k53100
12448B203404m9527M7770N8706N0870O8002J08427J77130L29657N63874O65025
$$ plain form
12523 1020726 834809 626873 436401 299784 208991 125584 38235 -52899 -121194 -112176 6248
12512 6248 196452 384380 518197 574476 546863 482106 428964 414114 460816 581959 780837
12501 780837 1123922 1692839 2398754 2881422 2904380 2508180 1887773 1333142 976791 783456
12491 783456 672315 605572 554126 508121 459226 412485 377617 349441 333375 325643 335721
12480 335721 353399 385497 437467 494565 544203 602315 689850 846634 1038396 1155250 1206896
12469 1206896 1179180 1099579 1015245 921608 833719 774791 747008 748267 781171 861775 999436
12458 999436 1228432 1610033 2226780 2996326 3590139 3744014 3460101 2932634 2456504 2203404
12448 2203404 2153877 2201647 2260353 2311223 2379225 2487652 2664782 2994439 3558313 4223338
12438D223338M54480N6287l60175n35244m39127l00127k52317k56301k63154j99239
12428B128421q1073M490K5194M4800Q5417J89785L73083O40907Q15376O93731
12418D920131K54951j94442m83799m77816k94601q3090O7760J76813K68816L69346
12408D524069M50648M83460M88466M86002N17344O22331P90977J056373J425322
12399A0844992J935359K505540K965402L226968L578765M355119N948263Q706451
12391D4066859J3340321K1222140L4969197N8875349R0776468J07734499Q2103196
12384D53088029K3495459l4000731p9988391r3247004p6512734n0777218l1514472
12377A10542938j9563015j1714382n640425N5236O008733J2233731J8292947K3651905
$$ plain form
12438 4223338 4677818 4734105 4373930 3838686 3399559 3099432 2847115 2590814 2327660 2128421
12428 2128421 2047348 2051838 2077032 2121832 2207249 2397034 2770117 3411024 4226400 4920131
12418 4920131 5175082 4980640 4496841 4019025 3724424 3641334 3709094 3885907 4154723 4524069
12408 4524069 4974717 5458177 5946643 6432645 6949989 7572320 8363297 9419670 10844992
12399 10844992 12780351 15285891 18251293 21478261 25057026 29412145 35360408 44066859
12391 44066859 57407180 78629320 113598517 172473866 263250334 370984833 453088029
12384 453088029 476583488 442582757 362594366 269347362 192834628 142057410 110542938
12377 110542938 90979923 79265541 73625116 73680352 79689085 91922816 110215763 133867668
12369A33867668K7029331K6668430K2432794J4963147N130018n489503j5475903
12362B09125982k3135350k7324042k7847899k5297360k1088015j6438973j2203962
12355E5790381q876316o535482m959967l883908l108642k535087k070735j701399
12347B2118845j437277j239166j093230r91896r37773r01904q73287q61772q44888
12338A2937652q24031q08745p91706p48173o96310o37479n65838m76042m02922
12329F986406l52235l11456k75519k37004k16413k14454k25229k33462k37302
12320D683332k23943k07698j84272j70178j53214j34246j23348j13829j06183
12311C266421j03390r9937r2572r7301r7141r1640r1764r2193r3499q9941q5740
$$ plain form
12369 133867668 160896999 187565429 209998223 224961370 230091388 224601885 209125982
12362 209125982 185990632 158666590 130818691 105521331 84433316 67994343 55790381
12355 55790381 46914065 40378583 35418616 31534708 28426066 25890979 23820244 22118845
12347 22118845 20681568 19442402 18349172 17357276 16419503 15517599 14644312 13782540 12937652
12338 12937652 12113621 11304876 10513170 9764997 9068687 8431208 7865370 7389328 6986406
12329 6986406 6634171 6322715 6047196 5810192 5593779 5379325 5154096 4920634 4683332
12320 4683332 4459389 4251691 4067419 3897241 3744027 3609781 3486433 3372604 3266421
12311 3266421 3163031 3063094 2970522 2873221 2776080 2684440 2592676 2500483 2406984 2317043 2231303
12300B231303p8013o4415m1828k3821o73J3630N113l1170n7098p0621p2315o4762
12288A745330o4681o1480o5559o5291n6640m8701m3419l3313k5961j8863j6000
12277A245422j6015j2487j2254l735L546k677j2978j6159q950K788J5288L0903
12265A212692K7048J6826q738o1766j23695j63043j20572k070J14778K02695J83239
12254A277394P5847m3439p9054l9752L6287J14401J49296J12271K9116o5795j18627
12243A447945j26962r7045n8834k5210j3316j831J170k246p867o835J1653M4614
12231A165236O6617N4740j1105n6687q3346o3030p587N5742P4604L2833l6789
12220A191228q8508r8509p6807n3838l6179j5276j3362j1865n480o900r970j8718
$$ plain form
12300 2231303 2153290 2088875 2047047 2023226 2022553 2036183 2041296 2010126 1953028 1882407 1810092 1745330
12288 1745330 1680649 1619169 1553610 1488319 1431679 1382978 1339559 1306246 1280285 1261422 1245422
12277 1245422 1229407 1216920 1204666 1200931 1204477 1201800 1188822 1172663 1163713 1166501 1181789 1212692
12265 1212692 1239740 1256566 1247828 1186062 1062367 899324 778752 776682 891460 1094155 1277394
12254 1277394 1353241 1309802 1230748 1190996 1227283 1341684 1490980 1603251 1632367 1566572 1447945
12243 1447945 1320983 1223938 1165104 1139894 1126578 1124747 1125917 1123671 1115804 1108969 1120622 1165236
12231 1165236 1231853 1286593 1275488 1218801 1135455 1072425 1064838 1120580 1195184 1228017 1191228
12220 1191228 1102720 1004211 927404 873566 837387 822111 808749 796884 791404 784504 774534 755816
12208G55816k2995l4190m1551m1737m4937m3919l5142k4958j7994P655N0753Q7705
12196E94506J12830R0876M4588L195l7981o1512o2231m4906k6359o263r109k602
12184E95032j4148j4543r929k233R325J1254J2632K2434J7515J703j4398j8121
12172E96523k8755k9837k3131j4883j3863j6166j0745n824k681j17l515n016q75
12159D41115k503j447p25k479o627j1575j1876n621j4600j4197K936M580k36M832
12145C81577N435j73K348L235M603R61J31N214L839k227j2894j4198q878q292
12131C60681q690L612n72k135n417k234M147R784J1537P217M039L774j516j0827
12117C73400j0752r131n841K819M032K432j435p798j1074j4058j0596l270j103
$$ plain form
12208 755816 732821 698631 657080 615343 570406 526487 491345 466387 448393 456048 506801 594506
12196 594506 707336 798212 842800 845995 808014 746502 684271 639365 613006 606743 597634 595032
12184 595032 580884 566341 556412 554179 563504 574758 587390 609824 627339 629042 614644 596523
12172 596523 567768 537931 514800 499917 486054 469888 459143 453319 450638 450521 447006 441990 441115
12159 441115 438612 437165 436440 433961 427334 415759 403883 398262 383662 369465 372401 376981 376745 381577
12145 381577 387012 386839 389187 392422 397025 397986 398117 403331 407170 404943 392049 377851 368973 360681
12131 360681 351991 355603 355031 352896 347479 345245 349392 359176 370713 377930 381969 385743 384227 373400
12117 373400 362648 353517 347676 350495 354527 356959 355524 347726 336652 322594 311998 308728 307625
12104C07625M6J1849J4936J2985K2624L3085L5494K5534M974j7693l8814m3719
12092C68926l3536k0230q307m24j415K120Qm068n523r531j895P041Q707R981Q926
12077C20780M705j5131l6700m6701l7665j8672M320J3978J6145J6343R862L297
12065B34561L858L346K957M636P421Q041J164J293O571J0557J6181K2342K3549
12052C46477J1219j79k1015k7035j5800j3173r782N397L053L572j194L333k378
12039B82495n287k209m415n701n754o361R55j93K39k344K000P928R584L55l36
12024B70956m127p141j2294j0609p891n90K242P280Q014M099K888K108P374P633
12010B69942J3638J3776Q467J336L609R519K1808M2934O6777P8388P9954O2913
$$ plain form
12104 307625 307671 319520 334456 347441 370065 403150 438644 464178 469152 451459 412645 368926
12092 368926 335390 315160 306853 306429 305014 307134 307142 303074 297551 288020 286125 293166 301873 311854 320780
12077 320780 325485 310354 273654 226953 189288 170616 174936 188914 205059 221402 231264 234561
12065 234561 238419 241765 244722 249358 256779 264820 265984 267277 273848 284405 300586 322928 346477
12052 346477 357696 357517 336502 309467 293667 280494 270712 276109 279162 282734 281540 284873 282495
12039 282495 277208 274999 270584 264883 259129 252768 253723 253530 253769 251425 253425 261353 270937 271292 270956
12024 270956 266829 259688 247394 236785 228894 228304 230546 237826 245840 249939 252827 254935 262309 269942
12010 269942 283580 297356 305823 307159 310768 320287 342095 385029 451806 530194 610148 673061
11998F73061J5904k3185n8193o8035o5319n3301l1085j7717r688J60J373O750
11986C70725K6359M5199O2458J03876J67235L06955N99649J090070J032485J69519
11976C974530l58846r13219q62752n16091k90441j78627j20168p2248n0627m1963
11966E69548k4849q069p357n311J6944K9865N0336P7122J03726J31121J49912
11955A082988J43650J16997O5413P577m9089j01440j38487j57197j50247j31823
11945F88342r6557p1788m4535k7161k4836j6102o701p690q549l922o014j2900
11933C61587j3689j3636p892l679R788J4498J1863J3992J7266J9770L4997N6571
11921E01436Q3927J33022K22734L90891N90825O40505L71948m3876m09592n62941
$$ plain form
11998 673061 688965 665780 607587 539552 474233 420932 389847 372130 362442 362602 363975 370725
11986 370725 397084 442283 504741 608617 775852 1082807 1682456 2772526 3805011 3974530
11976 3974530 3615684 2702465 1839713 1323622 1033181 854554 734386 662138 611511 569548
11966 569548 544699 536630 529273 523962 540906 570771 621107 698229 801955 933076 1082988
11955 1082988 1226638 1343635 1409048 1416625 1367536 1266096 1127609 970412 820165 688342
11945 688342 591785 519997 475462 448301 423465 407363 400662 392972 384423 380501 374487 361587
11933 361587 347898 334262 326370 322691 332479 346977 358840 372832 390098 409868 444865 501436
11921 501436 585363 718385 941119 1332010 1922835 2563340 2935288 2891412 2481820 1918879
11911A918879n10074l53559k13625j30724r6268o7868m6318k7805k8188k9729
11901D14721k4495j7972j6977j5709j2339o937o970j5151r352n288n041p575q378
11888B62537k908j3367q470L68n739k212L712K417M110M208L52O29R999K1485
11874B77121J8923L664m878j2202j8290j3000p205p238q529l543m182m326J388
11861B17703O015j191q09N796L111J0609J1386n08p164r899q197m20J164q20k222
11846B24554l355L603K833M914J3210Q672L409p721p681o271p518m296J269K571
11832B28193P331K58k874L601N087j809N791Q007p96J71q836p143l622j515m465
11817B27379m065l116J627K187J802R485O649K339O008N430J2421K6846M3271
$$ plain form
11911 1918879 1408805 1055246 841621 710897 614629 546761 500443 472638 444450 414721
11901 414721 390226 372254 355277 339568 327229 320292 313322 298171 288819 283531 278490 270915 262537
11888 262537 259629 246262 237792 238160 232421 230209 233921 236338 240448 244656 245008 245637 255636 277121
11874 277121 296044 299708 294830 282628 264338 251338 244133 236895 228366 224823 220641 216315 217703
11861 217703 223718 222527 221718 227514 230625 241234 252620 252112 244948 235049 226852 226432 227596 226776 224554
11846 224554 221199 224802 227635 232549 245759 254431 257840 250119 242438 236167 228649 224353 225622 228193
11832 228193 235524 235782 232908 236509 241596 239787 245578 253585 252789 252960 244124 236981 233359 231844 227379
11817 227379 223314 220198 221825 224012 225814 235299 241948 244287 250295 255725 268146 294992 338263
11804C38263K3944n672k0217l9997l2242j4295p254m124n075m486j446M052N346
11791B36797n209n3P792m19l550m599L270O459L296O324J648q37j655m149k626
11776B42489O7j098L355J478J324j63L85q70j245Q13P24K386Q508N398M602L175
11760B71328P079O569L129L339J3268K3267K8023M2874P1181J23530K05442L44093
11748A143122M42311K26293m3222k72666l80708k80712j74161j01007o5184n2447
11738D41619l2450j6554j4800j1470o566n894n553l365r998r598q345n477k476
11725C09073p846j808K73k799l964N49M232k117L63q20p958m923j680j040K873
11710B82408J683o65M444K252k216j962L846J911K056o420R66J789J440K386L791
$$ plain form
11804 338263 362207 356535 336318 296321 264079 249784 242530 238406 233331 228845 227399 231451 236797
11791 236797 231588 231535 239327 238908 235358 230759 234029 240488 243784 250108 251756 250919 249264 245115 242489
11776 242489 242556 241458 244813 246291 247615 247452 247837 246967 245722 246535 247259 249645 258153 263551 268153 271328
11760 271328 278407 284976 288105 291444 304712 327979 356002 398876 470057 593587 799029 1143122
11748 1143122 1585433 1811726 1768504 1495838 1115130 834418 660257 559250 494066 441619
11738 441619 409169 392615 377815 366345 359779 353885 348332 344967 334969 325371 317026 311549 309073
11725 309073 301227 299419 299692 296893 292929 293478 297710 295593 295956 295136 287178 282255 280575 279535 282408
11710 282408 284091 283426 287870 290122 287906 285944 289790 291701 293757 287337 288303 290092 291532 293918 297709
11695B97709j429N074Q585K735k710p746p744l103N90K323M788L957R48M144K253
11680C10374k065k060R43L722M088M640k169l22k651r38K149M775N979L338Q030
11665C37833N240m2N00J5440L2948M0917J1117j0338k7653l0932j9482j5964j3546
11652C26038o151j943m419o80M156N277J005k603j780k720j592K790M177L611
11638C25166k840k096k874J423k239k907j482o477p300K865L889m43L328L089
11624C11102K003m838n558q5M98p42K198L011J673j940l918p72l832o900M0L447
11608B95387K374n085j752L053k864J999r60k127J897j714k304K325m63o223o222
11593B77321K815J187p963l532l404k769k102J934M86J249J592J595N64M397J369
$$ plain form
11695 297709 296280 301354 309939 312674 309964 302218 294474 291371 291961 294284 299072 303029 303977 308121 310374
11680 310374 308309 306249 307192 310914 315002 319642 317473 317151 314500 313562 315711 320486 326465 329803 337833
11665 337833 343073 343031 343531 358971 391919 432836 443953 433615 405962 375030 355548 339584 326038
11652 326038 319887 317944 313525 312845 317001 322278 323283 320680 318900 316180 314588 317378 321555 325166
11638 325166 322326 320230 317356 318779 316540 313633 312151 305674 298374 301239 305128 304685 308013 311102
11624 311102 313105 308267 302709 302624 303122 302380 304578 307589 309262 307322 303404 302632 298800 291900 291940 295387
11608 295387 297761 292676 290924 293977 291113 293112 292152 290025 291922 290208 287904 290229 289766 283543 277321
11593 277321 280136 281323 273360 269828 266424 263655 261553 263487 263973 265222 266814 268409 268973 273370 274739
11578B74739j117k149o81j703k916k389L787O644K693K518R60j509r32j441K03
11563B76707L41k808k798l541L62J193p95m445J378m92n796j313N20m219r20M952
11547B58326k446j0008J017K174k46n68P920M097k390l360m994j178j086J861
11533B49119M084M398Q343J3145N508k574n373j2522r962p100n068m642l475j160
11519B32721k781J972J86o89j96M942Q512J823N25o822k422K607J076q65l25l970
11503B36294q461m237L99J186J875k875j436K897lJ194p27p72j363k269j05L5
11487B21632K537K095J0182P921Q515J8130J1948L440n390j3861j9000q105q663
11474B31381n321q56m275j1111m407k18j21l422l275M365m413j135M465j170j887
$$ plain form
11578 274739 273622 271473 270792 269089 266173 263784 267571 274215 276908 279426 280386 278877 277945 276504 276707
11563 276707 277048 274240 271442 267901 268263 269456 268661 264216 265594 265102 259306 257993 258513 254294 253374 258326
11547 258326 255880 245872 246889 249063 248817 248249 256169 260266 257876 254516 249522 248344 247258 249119
11533 249119 253203 257601 265944 279089 284597 282023 276650 264128 254166 247066 241998 237356 233881 232721
11519 232721 229940 231912 232098 231409 231213 236155 244667 246490 247015 240193 237771 240378 241454 240589 240264 236294
11503 236294 227833 223596 223995 225181 227056 224181 222745 225642 225639 226833 226106 225334 223971 221702 221597 221632
11487 221632 224169 226264 236446 244367 252882 271012 282960 286400 281010 267149 248149 240044 231381
11474 231381 226060 225204 220929 209818 205411 205193 205072 201650 198375 202740 198327 197192 201657 200487 198600
11459A98600j538n522p26j613K321M907l231J00N664o1m89o26k255n692K619M372
11443A96830Q55m873j958J1584Q811O682P916J0972J6004J4463Q659J006r263
11430B67688j8849j2483j4866j5994m919p13K587j746j269o77P5l109p462o09
11416A87654M249K080l206j336p9K779k99n661K072K542l298J095P01J507N18
11401A91318J15o60M455Q873O947K659P857O442M836N999j027l869p73k991J504
11386B31685J318k815p601j4361o030P15m239l123l440j428j136j710J649l426
11372A86058m859m379j815l378j243k893k866j134N586k910k251K54l89l06J972
11357A65447k853j28N187K385J91k344n82j029M188m9M01j192K306P6K074l065
$$ plain form
11459 198600 197062 191540 190814 189201 191522 196429 193198 193298 198962 198901 198412 197786 195531 189839 192458 196830
11443 196830 197685 192812 190854 202438 211249 217931 225847 236819 252823 267286 275945 276951 267688
11430 267688 248839 236356 221490 205496 200577 199864 202451 200705 199436 198759 198834 195725 188263 187654
11416 187654 191903 193983 190777 189441 189362 192141 191842 186181 188253 190795 187497 188592 189293 190800 191318
11401 191318 191433 190773 195228 204101 211048 213707 221564 228006 232842 238841 237814 233945 233172 230181 231685
11386 231685 233003 230188 222587 208226 202196 202911 198672 195549 192109 190681 189545 187835 189484 186058
11372 186058 181199 176820 175005 171627 170384 167491 164625 163491 169077 166167 163916 164170 163781 163475 165447
11357 165447 162594 162466 167653 170038 170229 167885 167303 166274 170462 170413 170814 169622 171928 172004 174078 171013
11341A71013k895j294K385R10l055l164J239M344J829l370m69J64l102K089j870
11326A64754k237j63J655K309N483L692o31r78k153J834l078k57j839o02J406
11311A69195O0o80p64j88k195L553m23n203J691J402m531J491J966N189N837N514
11295A81914m763q960r50j24k150J122M58m033l335j568K713J530r94k315J846
11280A60391J610j24l509L591L708J025J765J780L4J446J14L433L890K505n515
11265A76144n541k057K100M773O324q25l220k237p06o25P011j776p672r29R03
11250A71667O441k868m021R8M301K793l109J961M09K507L032K100o240o5K050
11235A81056K796l065n81m554l879J819M58N90P598k727k294M07N773J185q951
$$ plain form
11341 171013 168118 166824 169209 170119 167064 163900 165139 169483 171312 167942 167473 167637 164535 166624 164754
11326 164754 162517 162354 164009 166318 171801 175493 174862 173884 171731 173565 170487 170230 168391 167789 169195
11311 169195 169255 168575 167811 167623 165428 168981 168558 163355 165046 166448 161917 163408 165374 170563 176400 181914
11295 181914 177151 168191 167241 167117 164967 166089 166547 162514 159179 157611 160324 161854 160860 158545 160391
11280 160391 162001 161877 158368 161959 165667 166692 168457 170237 170271 171717 171831 175264 179154 181659 176144
11265 176144 170603 168546 170646 175419 181743 180918 177698 175461 174755 174130 181141 179365 171693 170764 171667
11250 171667 178108 175240 171219 171317 175618 178411 175302 177263 177672 180179 183211 185311 179071 179006 181056
11235 181056 183852 180787 180206 175652 171773 173592 174050 174640 182238 179511 177217 177624 183397 184582 175631
11220A75631m921l121k90k254J449k857m578r06O561k235k246j080L243L903J136
11205A67435L996m456q32K949M403j027J936L730N816k546K296l67p36Q48l036
11190A80409n161k491L39O296J620j715l022m615p13N557K737j618J036P154K638
11175A88451l695j310J165m33J509j004J805l84m73q3l8j200l159q88K473L68
11159A83104p389J843m146l597M486L929J724L585K337K266j686P26k292j128
11145A83762J493k34j563P76j238k277L24q44J801P694M668J813P134N0j67p0
11129B03122L812k152l439j562l299l873r57J59l672m062N29L055K905J25j870
11114A88821k179q285p783o774L128L366K356L622j630M422J259J540K085K717
$$ plain form
11220 175631 170710 167589 167299 165045 166494 163637 159059 158153 164714 162479 160233 159153 162396 166299 167435
11205 167435 171431 166975 166143 169092 173495 172468 174404 178134 183950 181404 183700 183333 182597 183445 180409
11190 180409 175248 172757 173096 179392 181012 179297 176275 171660 170947 176504 179241 177623 178659 185813 188451
11175 188451 184756 183446 184611 184178 185687 184683 186488 186104 185631 185548 185510 184310 181151 180263 182736 183104
11159 183104 175715 177558 173412 169815 174301 178230 179954 183539 185876 188142 186456 187182 184890 183762
11145 183762 185255 185021 183458 184234 182996 180719 181043 180199 182000 189694 194362 196175 203309 203359 203192 203122
11129 203122 206934 204782 201343 199781 196482 192609 191652 191811 188139 184077 184606 187661 190566 190691 188821
11114 188821 186642 178357 170574 163800 166928 170294 172650 176272 174642 179064 180323 181863 183948 186665
11100A86665M203J716K088K390j780o433J142O758J0094Q546O221j878L444M099
11086B27275J263M886J497j685k033j440l050R37Q248K133K444k77M178P585O398
11071B58359J0862K4388J4533J5110L5939N0556P1419J13048J61113K02642K43398
11060A201367K84399K63096J78651J27754N1278q4256j58135k29842k71113k43165
11050A120034k06223j71779j23086q5564o1315m8284l4494k3976j8542j6278j4128
11039C16365m131q1j580n299o007l649m64o31k053o138m980m918o78n173l825
11024B66758m976k864m501q45q99L111L581N439L777J348k223l511m397q746j45
11009B50907R6J141J164l722p13n79r74N101O34n554j914K108j94J959j541p741
$$ plain form
11100 186665 190868 192584 194672 197062 195282 188849 189991 196749 206843 215389 221610 219732 223176 227275
11086 227275 228538 233424 234921 233236 231203 229763 226713 227650 235898 238031 240475 240198 244376 251961 258359
11071 258359 269221 293609 308142 323252 359191 409747 481166 594214 755327 957969 1201367
11060 1201367 1485766 1748862 1927513 2055267 2106545 2022289 1864154 1634312 1363199 1120034
11050 1120034 913811 742032 618946 533382 472067 423783 389289 365313 346771 330493 316365
11039 316365 312234 312153 310573 305274 299267 295618 295154 294523 292470 286332 281352 276434 275756 270583 266758
11024 266758 261782 258918 254417 253572 252673 255784 259365 264804 268581 269929 267706 264195 259798 251052 250907
11009 250907 251003 252144 253308 249586 248873 248294 247320 252421 253055 247501 245587 247695 247501 249460 247919 240178
10993B40178o93P072k20J518k417n428r12J417j932k22l627P22N843M448N715
10978B51462J959N897R874N238Q67N688L553M35l479k158N6M058K497K101O243
10963B94291O296m320j2306n851l857j2535j3661r209q35M416L452O613O294J0086
10949B68874K003L814J946k622K794P248M328n81j939p55L4k915n40o84k845k837
10933B75323j534K695N237o68J780O97o02j554o946n555L918K972O62J550N578
10918B83553N063O279N963J1058J7672K6309J8957J2428Q578R391K0171K3314
10906D48736P358M202R841n72k454l705j0957r102K00j1001j3622o022j3928j8409
10892C80565j3727l680o703j0397l836p154p020O95m187L853N714P177O14m122
$$ plain form
10993 240178 239485 246557 246337 247855 245438 240010 239098 240515 238583 238361 234734 235456 241299 245747 251462
10978 251462 253421 259318 269192 274430 275297 280985 284538 284973 281494 279336 279392 283450 285947 288048 294291
10963 294291 300587 296267 283961 278110 274253 261718 248057 238848 238013 242429 245881 252494 258788 268874
10949 268874 270877 274691 276637 274015 276809 284057 288385 287804 285865 285110 285144 282229 281689 281005 278160 275323
10933 275323 273789 276484 281721 281053 282833 283530 282928 281374 274428 268873 272791 275763 276425 277975 283553
10918 283553 288616 294895 300858 311916 329588 355897 374854 387282 395860 405251 425422 448736
10906 448736 456094 460296 470137 469565 467111 463406 452449 443347 443547 432546 418924 412902 398974 380565
10892 380565 366838 363158 356455 346058 342222 335068 328048 328743 324556 328409 334123 341300 341914 337792
10878C37792q448o848N81J1236O563O022O206N470O289J2248J0181N457n64m16
10864C91769N359K60m959O45J209j07l393J130K380Q831O047J2677K8367M8124
10850D98339P7815J40277K55700L86190L29605M6119j63803l47511l46903k15201
10840F60627j21857o7099j8706O333J0608J9213J9292K2270K0985L0546N0243
10829F32455P5216J25646K23688L15157J81125q130j59902k50348j94666j19609
10819H20632o3987l2944k3080p733mM25m451l116m608j1308j0943j5075j3690
10806F30118k5792n5639o8502n8364m4867j6375J9241L0404L5392M8302M8632
10795E42550M7556O4234R6124J60686K83440M92327Q17192R36833N49426O5480
$$ plain form
10878 337792 329344 322496 323077 334313 340876 346898 353104 358574 364863 377111 387292 392749 392185 391769
10864 391769 397128 397388 392429 393074 394283 394176 390783 391913 394293 403124 409171 421848 450215 498339
10850 498339 576154 716431 972131 1358321 1687926 1734045 1570242 1222731 875828 660627
10840 660627 538770 471671 452965 459298 469906 489119 508411 530681 551666 582212 632455
10829 632455 707671 833317 1057005 1372162 1553287 1545157 1385255 1134907 940241 820632
10819 820632 756645 723701 700621 692888 692884 693309 688858 685742 681134 669826 658883 643808 630118
10806 630118 604326 548687 480185 421821 376954 360579 379820 410224 445616 493918 542550
10795 542550 590106 654340 750464 911150 1194590 1686917 2504109 3440942 3990368 4055848
10785D055848m61185p37984o61553m91967l23103j91857j10114o9950n4739k0544
10775I32852k1159l3179k5709l1536m6886k9084K564L5826Q0279R3226M0405k4913
10763I72686o0114p5021n4146l4991j7253N195K0033L8273N2170O5107M0916N933
10751I58788k6010m5537m4331l1069j8544j5024o111o436k992L415J2012J3100
10739G91261J2581J2161J4701K1744J9598J4928J5735J1865N352ol231o647o679
10726I03363N024R693J3176J1586J1697K2511L1253L0247K5293K4010J6759J0722
10714A115334J722O951Q197J986J5939K3015K9133L3605M1755N0669O0144Q1855
10702A470305O8863M2924L6522K6490K3587L2992N2763N6535N8722N9435O8951
$$ plain form
10785 4055848 3594663 2856679 2195126 1703159 1380056 1188199 1078085 1008135 953396 932852
10775 932852 911693 878514 852805 821269 774383 745299 747863 783689 863968 957194 997599 972686
10763 972686 912572 837551 783405 748414 731161 736356 756389 794662 846832 911939 952855 958788
10751 958788 932778 887241 842910 811841 793297 778273 772162 765726 762734 766149 778161 791261
10739 791261 803842 816003 830704 852448 872046 886974 902709 914574 919926 919920 916689 910042 903363
10726 903363 908387 918080 931256 942842 954539 977050 1008303 1038550 1063843 1087853 1104612 1115334
10714 1115334 1117056 1124007 1132204 1134190 1150129 1173144 1202277 1235882 1277637 1328306 1388450 1470305
10702 1470305 1539168 1582092 1618614 1645104 1668691 1701683 1754446 1810981 1869703 1929138 1998089
10691A998089P3771Q3326R7928J01343J06967J15220J21111J39860J61144J78769
10681C177528K05816K55020L08474L81590M54391N12292O00068O37120N77226
10672G109525N65750N41514M84363M93193N31659O41419Q65102J174987J572228
10663A3979740K094272K770163L693197N077164P158397J0490077J6042770K4369791
10655H5675571L2731948L7530438M4432784M9785590L7129571K3202339J6532304
10648C27020545q81797j8987907k8279378m0333758m4554424l9759480l4700324
10641A19523477k8235981k0389293j4122846r995221p366642n684585m506855
10634B9222054l636336l008803k503451k065912j695252j383392j088148r02892
$$ plain form
10691 1998089 2071860 2155186 2253114 2354457 2461424 2576644 2697755 2837615 2998759 3177528
10681 3177528 3383344 3638364 3946838 4328428 4782819 5295111 5895179 6532299 7109525
10672 7109525 7675275 8216789 8701152 9194345 9726004 10367423 11232525 12407512 13979740
10663 13979740 16074012 18844175 22537372 27614536 34772933 45263010 61305780 85675571
10655 85675571 118407519 155937957 200370741 250156331 287285902 310488241 327020545
10648 327020545 326138748 307150841 278871463 238537705 193983281 154223801 119523477
10641 119523477 91287496 70898203 56775357 46780136 39413494 33728909 29222054
10634 29222054 25585718 22576915 20073464 18007552 16312300 14928908 13840760 12937868
10626A2937868q35777p35522p06870p46982p37698p45306p37896o67208n88256
10617F436353n08421m25626l55823k99589k70911k53140k38979k35898k31013
10608C616953k03913j81657j62958j42207j22193j18058j19343j08933j02914
10599B354777r6080j05120r7609j06616r3968q6073p2982o8028n5393m9712n6149
10588A467047n8659o1434n7977n0495n0932m2271k6880j8178J0540M7857J10116
10577A268734K11195L94634O58750P36084K96065j66796n53507o79730n00008
10568A665421l17553j99057j38168j08038r5686q1707o1908m8892l5905k1863
10558E56644k013J6108L5042L0635m519l1954n5247n3348l2738k3285j3655r814
$$ plain form
10626 12937868 12102091 11366569 10659699 9912717 9175019 8429713 7691817 7024609 6436353
10617 6436353 5927932 5502306 5146483 4846894 4575983 4322843 4083864 3847966 3616953
10608 3616953 3413040 3231383 3068425 2926218 2804025 2685967 2566624 2457691 2354777
10599 2354777 2258697 2153577 2055968 1949352 1855384 1769311 1696329 1628301 1572908 1523196 1467047
10588 1467047 1408388 1346954 1288977 1238482 1187550 1145279 1118399 1100221 1110761 1158618 1268734
10577 1268734 1479929 1874563 2533313 3269397 3565462 3398666 2845159 2165429 1665421
10568 1665421 1347868 1148811 1010643 902605 806919 725212 663304 614412 578507 556644
10558 556644 554631 570739 605781 636416 631897 599943 544696 491348 458610 435325 421670 411856
10546D11856j0010q265l273K324o092o400j615r62o549j2020n059l731J192J3194
10532C64590J2600J5306J0322o606j4276j7239l2336j6753K1030J9577L2411M7920
10520D36546K4399K8481L6010K4494Q744n982k1321l8855n3522l5721j5011q258
10508C80004q845j57K229k973P59J0528J3768J1058K0830K6645L6314M3151L5870
10495E69181J7117J4428K911k1888l4071m6832n3632m6975l8879k9776m713p109
10483C19762q937J576m318p708o300o114j0741n621q050p078l863m393p060n861
10469B35294m147m731q296M304J2052L0666M0434M4094L1080L0139L0589J8795
10457D60273l368j1336k0824k4480j6656k0445j0112K269P256P761J40n658o188
$$ plain form
10546 411856 401846 393581 390308 392632 386540 380140 378525 377563 371014 358994 353935 350204 351396 364590
10532 364590 377190 392496 402818 396212 381936 364697 332361 315608 336638 356215 388626 436546
10520 436546 460945 489426 525436 549930 558674 552692 531371 492516 438994 403273 388262 380004
10508 380004 371159 371002 373231 370258 371017 381545 395313 406371 427201 453846 490160 533311 569181
10495 569181 586298 600726 603637 581749 547678 500846 447214 400239 361360 331584 326871 319762
10483 319762 310825 312401 308083 300375 294075 287961 277220 271599 263549 256471 252608 248215 241155 235294
10469 235294 231147 226416 218120 222424 234476 265142 305576 349670 380750 410889 441478 460273
10457 460273 456905 445569 424745 400265 383609 363164 353052 355321 362577 370338 370478 364820 358632
10444C58632j0262j4774j7140k5973k7443k3358k0961j7761j3685r209j1342r145
10432A57579l215l457n523k415k551n659j5818j6117j0725q174l142K606O04J0679
10418I4672J9331K2261K3883K8043K3304K1353J0288J1630J0782R400J1044P870
10406B93861K581O058R917N244J4332J0907J1206J5963O898M580J8857R343l042
10393D06705o610j1853k2744l5666l9922m7586m0748m1848l3072j4509j1027l315
10381I7805K3025K5358K2047K3581K1665J4331K1487J2411M978m87J971J32o21
10368B67683l224n389o816j0776o528J552R938R349K6733L4724K1611L0917K9614
10355C99388J6743J6395J1157j0653j6634j1336j3491p88J0236R631R891J1639
$$ plain form
10444 358632 348370 333596 316456 290483 263040 239682 218721 200960 187275 178066 166724 157579
10432 157579 154364 150907 145384 142969 140418 134759 118941 102824 92099 83925 80783 83389 83993 94672
10418 94672 114003 136264 160147 188190 211494 232847 243135 254765 265547 274947 285991 293861
10406 293861 296442 302500 312417 317661 331993 342900 354106 370069 376967 381547 400404 409747 406705
10393 406705 400095 388242 365498 329832 289910 242324 201576 159728 126656 112147 101120 97805
10381 97805 120830 146188 168235 191816 213481 227812 249299 261710 266688 266201 268172 268304 267683
10368 267683 264459 259070 252254 241478 234950 236502 246440 255789 282522 317246 338857 369774 399388
10355 399388 416131 432526 443683 433030 416396 405060 391569 390781 401017 410648 420539 432178
10343D32178J4849J5606O371m780L363P850P019K826Q649J5571J2201J2423J6541
10330E50667J5608J1918O597J1652J2175J7190J8296J4169K1682K2924K3943K3667
10318G50488K6850J5782K1661K1592J1469P507J0366J3092J7388J9824K3269L5339
10306I74627M3367N4734P5515J19175J98775L36906N89575P43752L49162q0590
10296C404998m44460n95514m34501k49004j38908q0078n2529l2078m911K0416
10286A393431M7578M3150L2894K3290J4269K1854L3796L9661M7466N2385N3408
10275A803182O6228O0658O5418P3555Q0735R3782R5153J08811J19547J28424J38368
10264B833861J53165J74507J91529K28298K69140L14502L74501M52146N21508
$$ plain form
10343 432178 447027 462633 469004 464224 467587 475437 482456 485282 493931 509502 521703 534126 550667
10330 550667 566275 578193 584790 596442 608617 625807 644103 658272 679954 702878 726821 750488
10318 750488 777338 793120 814781 836373 847842 855349 865715 878807 896195 916019 939288 974627
10306 974627 1017994 1072728 1148243 1267418 1466193 1803099 2392674 3136426 3485588 3404998
10296 3404998 2960538 2365024 1930523 1681519 1542611 1462533 1410004 1377926 1373015 1393431
10286 1393431 1441009 1484159 1517053 1540343 1554612 1576466 1610262 1649923 1697389 1749774 1803182
10275 1803182 1869410 1930068 1995486 2069041 2149776 2243558 2338711 2447522 2567069 2695493 2833861
10264 2833861 2987026 3161533 3353062 3581360 3850500 4165002 4539503 4991649 5513157
10255E513157N90949O69789P48781P82232Q40735R33474R66419J065836J256083
10246A3367455J432877J745004K268488K995089M132263N983085Q852244J2815697
10238E3592202J7400459K3257929L0552101L3949241L4136154L6859321L1678683
10231B61426090J9181669J3617494L002540j2505202j9317865k7029917l4184896
10224B04189913l3686611l2016387k9277461k3627608j8162115j3744659j0000526
10217D3674546p198321n289454l988813l120721k525730k083445j730531j512270
10209A6225261j398971j281947j184067j110594j010390r29061q61626p78736
10201G669869o96189o19363n46114m68226l94826l53559l05422k69341k41815
$$ plain form
10255 5513157 6104106 6773895 7522676 8304908 9145643 10079117 11045536 12111372 13367455
10246 13367455 14800332 16545336 18813824 21808913 25941176 31924261 40776505 53592202
10238 53592202 70992661 94250590 124802691 158751932 192888086 229747407 261426090
10231 261426090 280607759 294225253 297227793 284722591 265404726 238374809 204189913
10224 204189913 170503302 138486915 109209454 85581846 67419731 53675072 43674546
10217 43674546 36476225 31186771 27197958 24077237 21551507 19468062 17737531 16225261
10209 16225261 14826290 13544343 12360276 11249682 10239292 9310231 8448605 7669869
10201 7669869 6973680 6354317 5808203 5339977 4945151 4591592 4286170 4016829 3775014
10192C775014k17231k05546k02729j90172j73363j63459j63966j52355j39951
10183B166242j26083j23719j08582r3847p9676o2574n5983n0009l3819l2081j9544
10172A380325L625r724k2843o2558j13379j17772j07725q8712o5093m8391l3675
10161G14078k6564k4646k9094m4202n0228m8324m8754l5191l6818l9409l5758
10150B95090l1003l1924k9536k8935k7218j8436j2307p285l658j276n090J94J4626
10137A13242J4882K1008J4580L655n086k3146k8762k6999k0093j1748l525M90
10125D8498M621J3453N685p83j775m421j943P72L529J2269J4550J4460O000J73
10111A15088n903j0535j4811j5453j7247j6807J835l742j101K1303K3056O925
$$ plain form
10192 3775014 3557783 3352237 3149508 2959336 2785973 2622514 2458548 2306193 2166242
10183 2166242 2040159 1916440 1807858 1714011 1634335 1571761 1515778 1465769 1431950 1399869 1380325
10172 1380325 1383950 1374226 1351383 1288825 1175446 1057674 949949 861237 796144 747753 714078
10161 714078 687514 662868 633774 589572 539344 491020 442266 407075 370257 330848 295090
10150 295090 264087 232163 202627 173692 146474 128038 115731 108446 104788 103512 98422 98616 113242
10137 113242 128124 149132 163712 167367 162281 139135 110373 83374 63281 51533 48008 48498
10125 48498 53119 66572 72257 71474 69699 65278 63335 64107 67636 79905 94455 108915 114915 115088
10111 115088 109185 98650 83839 68386 51139 34332 36167 32425 31324 52627 75683 82608
10099H2608J7358J8533j697m974J272k195o734j1733q940n803n700k577M822L337
10085G7577R337J3259J7117J7948K1345J8356J8728K9176M2564K7817J7702r30
10073C09996m6639o7630p4821p6203o3265m9630l8300k5904j2257j1970o33J0585
10061a46671N524N91M928Q897Q32M136J2632M310j194L988K684J155oQ481J4712
10046g5001K4869L2151L1456L5026L4361K6831K1369J4061M848J578n181j2708
10034A33660j7316k4974k5893j8308j3149o076o744j911M010Q539P932J1449J7463
10021F8682J4786O385l90m026p322j1687k1253k7768k7686k1535j4797r392j3197
10008f9200p682m963J584M36K125M404N818M040M392K313J961L19J3N651L970
$$ plain form
10099 82608 99966 118499 116802 111828 113100 110905 104171 92438 83498 77695 71995 69418 74240 77577
10085 77577 86914 100173 117290 135238 156583 174939 193667 222843 265407 293224 310926 309996
10073 309996 263357 195727 120906 44703 -18562 -68192 -106492 -132396 -144653 -156623 -157256 -146671
10061 -146671 -141147 -140556 -135628 -126731 -125899 -121763 -109131 -104821 -106015 -102027 -99343 -98188 -98194 -89713 -75001
10046 -75001 -50132 -17981 13475 48501 82862 109693 131062 145123 149971 151549 146368 133660
10034 133660 116344 91370 65477 47169 34020 27944 21200 19289 23299 31838 39770 51219 68682
10021 68682 83468 89853 89463 85437 78115 66428 45175 17407 -10279 -31814 -46611 -56003 -69200
10008 -69200 -76882 -81845 -80261 -79825 -77700 -73296 -67478 -63438 -59046 -56733 -54772 -54453 -54440 -48789 -44819
9993d4819J2718J6365J3198J7972J8413P599q93j7374j7749j6883j7708j0535
9981c9696j3143n263j712q390o805J284j977o952N9j104n036j973L56j221j006
9966i2579K385P06L083K936O563O733O026j949p151k490k904J943J83J258J050
9951g4207J427J955J444m328o636o835L07m063L89K586j159o010j306k781l425
9936a02642L502O280k48N359R203L49J57K556N321n28j967R98L380M565L209l294
9920f3800j2224p662j1567j2505p213m957j175P005M565N003N190J808L845M551
9906h9136L772M360k933P888Q394l088L707k44J256K642P171O082L060q6k761
9891d9916k069j683J232J475K129K045L647K242k064n557n668k145N764R824L194
$$ plain form
9993 -44819 -32101 -15736 -2538 15434 33847 41446 40553 23179 5430 -11453 -29161 -39696
9981 -39696 -52839 -58102 -59814 -68204 -75009 -73725 -75702 -82654 -82595 -83699 -88735 -90708 -90352 -91573 -92579
9966 -92579 -90194 -89488 -86405 -83469 -76906 -70173 -64147 -66096 -73247 -75737 -78641 -76698 -76515 -75257 -74207
9951 -74207 -72780 -70825 -69381 -73709 -80345 -87180 -86873 -90936 -90547 -87961 -89120 -95130 -96436 -99217 -102642
9936 -102642 -99140 -92860 -93108 -87749 -78546 -78197 -78040 -75484 -70163 -70691 -72658 -71660 -68280 -63715 -60506 -63800
9920 -63800 -76024 -83686 -95253 -107758 -114971 -119928 -121103 -114098 -109533 -104530 -99340 -97532 -93687 -89136
9906 -89136 -85364 -81004 -83937 -76049 -67655 -70743 -67036 -67280 -66024 -63382 -56211 -50129 -47069 -47155 -49916
9891 -49916 -51985 -53668 -52436 -50961 -48832 -46787 -43140 -40898 -42962 -48519 -54187 -56332 -50568 -40744 -37550
9876c7550J359o73q204p506m202p869k342R77K918L647K585o585n582m863K704
9861g1186K024j79L435Q031K795Q21O296J672J4987J9005Q580l238p004j0265
9847b4226m858k91k533K052L109K234L187M200o33L154L911K119P094L857N226
9832G602Q674N730J6622K4012L9517N8201P7836J01620J39338J76865J94329K12012
9820A062358K18932J73737J16683O7779j7971r1154j41587j86562j91399j81507
9810H29309j62878j23605r0868m3526J6253N5586P0585K2671m4348r2346j11053
9799C25780r6597p1225n2255l3436k6686j9046j0885j2843j1333o107k522n884
9787b3039m163j88J990Q420O373M024l83L94L463N79K029J936N351P883O249N972
$$ plain form
9876 -37550 -36191 -36864 -45068 -52574 -56776 -64645 -66987 -66010 -63092 -59445 -56860 -63445 -69027 -73890 -71186
9861 -71186 -69162 -69341 -65906 -57875 -55080 -54259 -47963 -46291 -31304 -12299 -3719 -6957 -13961 -24226
9847 -24226 -29084 -29375 -31908 -29856 -26747 -24513 -21326 -17126 -17759 -14605 -10694 -8575 -1481 2376 7602
9832 7602 16276 22006 38628 62640 102157 160358 238194 339814 479152 656017 850346 1062358
9820 1062358 1281290 1455027 1571710 1639489 1621518 1530364 1388777 1202215 1010816 829309
9810 829309 666431 542826 451958 408432 424685 480271 550856 573527 529179 436833 325780
9799 325780 229183 157958 105703 72267 45581 26535 15650 2807 -8526 -14633 -17155 -23039
9787 -23039 -27202 -27390 -25400 -16980 -10607 -6583 -6966 -6572 -3109 -2530 -501 1435 6786 14669 20918 26890
9771B6890R193J0482J5295L0837N4890Q4750P5061L8949L1497K9063N4148L5322
9759D96377k2552p8209j00225r0423o4777m3819l3116k2685j5660j2812p681j0060
9747e642r395l777j686q776m149k760l353k765K685k444m967m016K237j499n127
9732e5434m355j093M899L368K536N532M1m185n05K642K46j261j607M847N457J741
9716c7131L68L90K30J769k703n525L646J326k372l943K269m65K166P915L715O89
9700b7656M391J058m079k988m18R05l723L072O058J3726J6126Q555L083j044j4835
9685B231j4638o540n654k296k062j919k05L052N091J0653J0220N565N166P88j978
9670G474J235R166P125J0017O809P337m53j0866j3720r136j0466j2222q928J061
$$ plain form
9771 26890 36083 46565 61860 92697 147587 232337 307398 346347 377844 406907 461055 496377
9759 496377 473825 395616 295391 204968 140191 96372 63256 40571 24911 12099 4418 -5642
9747 -5642 -15037 -18814 -20500 -29276 -33425 -36185 -39538 -42303 -39618 -42062 -47029 -51045 -48808 -50307 -55434
9732 -55434 -59789 -60882 -55983 -52615 -50079 -44547 -44506 -48691 -49196 -46554 -46308 -47569 -49176 -44329 -38872 -37131
9716 -37131 -36763 -36373 -36143 -34374 -37077 -42602 -38956 -37630 -40002 -43945 -41676 -42141 -39975 -32060 -28345 -27656
9700 -27656 -23265 -22207 -26286 -29274 -29692 -28787 -32510 -29438 -23380 -9654 6472 15027 18110 17066 2231
9685 2231 -12407 -18947 -24601 -26897 -28959 -30878 -31083 -28031 -22940 -12287 -2067 3498 8664 9452 7474
9670 7474 8709 17875 25000 35017 41826 49163 48710 37844 24124 14988 4522 -7700 -16628 -15567
9656a5567J25r902l630O945J152n723J129j800q254k547j359J329J97l965j5l143
9640d5028J935k533k696j526j620L799M775K437J0828O114M316J1165N168l187
9626f053K00r045m739J724l142q576m099p67J417l635j715M508P557K475N189
9611a8701n033r358m958J115R83L124p91o525j493K130K826Q604J501R07M412
9596b1257L677M767r36L667M560J895K261P461N069N268P302J0212J4253K8201
9582G6400M2656Q0259J38973K53180L34264J69153m5518k17726k88247k09695
9572C33699j15440o4854l9768k8944k2462j6229j4859j1666r148m851n963o673
9560g158K98l446k380o06P76m751r972m816J689L872N62j199k359k659N497k948
$$ plain form
9656 -15567 -15442 -25344 -28974 -22029 -20877 -26600 -25471 -27271 -35525 -38072 -39431 -38102 -37905 -41870 -41885 -45028
9640 -45028 -43093 -45626 -48322 -49848 -51468 -47669 -42894 -40457 -29629 -23515 -19199 -8034 -2866 -6053
9626 -6053 -5853 -14898 -19637 -17913 -21055 -29631 -33730 -34497 -33080 -36715 -38430 -33922 -26365 -23890 -18701
9611 -18701 -23734 -33092 -38050 -36935 -35952 -32828 -33619 -40144 -41637 -39507 -36681 -28077 -26576 -25669 -21257
9596 -21257 -17580 -12813 -13749 -10082 -5522 -3627 -1366 6095 11164 16432 23734 33946 48199 76400
9582 76400 119056 199315 338288 591468 925732 1094885 1049367 831641 543394 333699
9572 333699 218259 153405 113637 84693 62231 46002 31143 19477 10329 5478 -485 -7158
9560 -7158 -6860 -10306 -12686 -13292 -12516 -17267 -27239 -32055 -30366 -26494 -25932 -27131 -29490 -32149 -26652 -29600
9544b9600p497J489J745J106l451M89j969m453J34J547O032J856j677j72R91L37
9528c3093m0J227r81j394M555L760J9j841j662p61L750k669P73m95m662L407P392
9511b2715J444M157N679P397j36j390j580R090P537m905k501r234j2868J613j848
9496b0260j349k508n561P732L948M172J2738J1897L594o791q129p337m451K884
9482i421k669n928m606M580k855n310M43N939l66j803K09J30l57J871L318L429
9466a3396J308M011n934l064R243J2094M721J922M112J0712J6243K2135L9796
9453A03903N4534L8163K512k9993m9851m0250k8831k1081j2901r148m607L79m319
9440a490l658j951k313m846j680k869j230K474P47O831N815R639J4237J0035n408
$$ plain form
9544 -29600 -37097 -35608 -33863 -32757 -36208 -35719 -37688 -42141 -42007 -40460 -34428 -32572 -34249 -34421 -33430 -33093
9528 -33093 -33133 -31906 -32887 -34281 -29726 -25966 -25947 -27788 -29450 -30211 -26461 -29130 -28357 -28852 -33514 -30107 -22715
9511 -22715 -21271 -17114 -11435 -4038 -4174 -5564 -7144 1946 9483 4578 2077 -7157 -20025 -18412 -20260
9496 -20260 -21609 -24117 -29678 -21946 -17998 -13826 -1088 10809 14403 7612 -517 -7854 -12305 -9421
9482 -9421 -12090 -18018 -22624 -18044 -20899 -26209 -25766 -19827 -20193 -21996 -21787 -21657 -22014 -20143 -16825 -13396
9466 -13396 -12088 -8077 -14011 -17075 -7832 4262 8983 10905 15017 25729 41972 64107 103903
9453 103903 158437 196600 199112 169119 119268 79018 50187 29106 16205 7057 2450 2829 -1490
9440 -1490 -5148 -7099 -9412 -14258 -15938 -18807 -20037 -17563 -16816 -9985 -4170 5469 19706 29741 24333
9425B4333j0247n772p409m311p727K46L295O126M165o8j409M758J3067J7015K8666
9410F4728N0535O0245L2910q328l7498n0958m2211k6900j8944o535l473m227k408
9397F936o304o255J035n24O035P296K105r6o334o618l542l120k843m391k30K493
9381a4357J387l366K507L287j722l616K160N753J251l524K287M353j933m539k749
9366a2821N47M318o97P43K705M024P255K532N517O483J1462N872O729N932L632
9351E4233M89R42J3581K7483L2604N4672R2781J48703K52974L75568K81050K4569
9339A359649j74643l23256k88570j80423j08639p6002m6043k2490j4292j4348
9329A10943K997K1805K6017M6595L4836N249k2442l9869m2230l6085k3661j3832
$$ plain form
9425 24333 14086 8314 905 -3406 -11133 -10887 -7592 -1466 2699 2631 1222 5980 19047 36062 64728
9410 64728 115263 175508 208418 200090 162592 111634 69423 42523 23579 17044 13571 9344 6936
9397 6936 632 -5623 -4588 -5112 923 8219 10324 10228 3894 -2724 -6266 -9386 -12229 -16620 -16850 -14357
9381 -14357 -12970 -16336 -13829 -10542 -12264 -15880 -13720 -7967 -6716 -10240 -7953 -3600 -5533 -10072 -12821
9366 -12821 -12274 -7956 -8653 -7910 -5205 -1181 6074 8606 14123 20606 32068 37940 44669 50601 54233
9351 54233 54722 55664 69245 96728 129332 184004 276785 425488 678462 1054030 1335080 1359649
9339 1359649 1185006 861750 573180 392757 284118 208116 162073 139583 125291 110943
9329 110943 113940 135745 161762 208357 243193 248442 226000 186131 143901 107816 84155 70323
9317G0323n822q028m30K22K081Q500J163K909O91K477J0324J4496K4571K6758
9303A50235N7708J00404J63283K76449L76807K22232k6229k14032l24989k61503
9293E20365j58473r5989o2769l8166k4142k2830r539J078J0176J9815L1161L7196
9281B07883K4558o362l3578m7453m6183l2940k2116j5624o607k913n425j144K163
9268A4259m454k913P11o10o3l890k838N03o131l992O13j043J806R88J193o96R81
9251e576j379J735L040J147K057p23q278m643N55L885K462J056M608L391k19o588
9235c470m024K679L93J386P16L114m445o077l510L885j144k793j154L426P27K588
9219g703L556N43o065m217m137N130l967n686m507K749R984L424m893k922l152
$$ plain form
9317 70323 64501 56473 56043 56265 58346 66846 68009 70918 71609 74086 84410 98906 123477 150235
9303 150235 207943 308347 471630 748079 1124886 1347118 1320889 1106857 781868 520365
9293 520365 361892 265903 203134 164968 140826 117996 108457 109535 119711 139526 170687 207883
9281 207883 232441 226079 192501 145048 98865 65925 43809 28185 21578 18665 13240 12096 14259
9268 14259 9805 6892 7603 6993 6930 3040 202 705 -5426 -9418 -8805 -9848 -8042 -7054 -5861 -6557 -5576
9251 -5576 -6955 -5220 -2180 -1033 1024 301 -7977 -12620 -12065 -8180 -5718 -4662 -54 3337 3118 -3470
9235 -3470 -7494 -4815 -4422 -3036 -2320 794 -3651 -9728 -13238 -9353 -10497 -13290 -14444 -11018 -10291 -7703
9219 -7703 -4147 -3604 -9669 -13886 -18023 -12893 -16860 -22546 -27053 -24304 -14320 -10896 -15789 -18711 -21863
9204b1863q48L655J290l270l90J041M808M139L014l613l141k53L87N318K441J235
9188f050L615k695p722j731L52M01j50K148O17K721k895q57K579k791J154J857
9172i447k154j48j400N1L939M004J67J482R42l253m225o50N89J479R80J640R61
9155e043q98j998o778m985l61L341M723O525K725l3Q86R1N231P329R038R302J6955
9138D6050J8072J2806P502k197j3770j6101j5550j0192p381m227m365N42l058
9125H131k434M191O798O15m966m207J096J902m662n9J898J600o197j287j697k16
9109E06J676j365j013j66j048J122K555L081n086K756M76K516K635O773R468J3082
9093C7968K0266J7987J1264r674j5266j5634j3896q800j752L24K53O15M105j777
$$ plain form
9204 -21863 -22711 -19056 -17766 -21036 -21426 -20385 -15577 -11438 -8424 -12037 -15178 -15431 -15044 -9726 -7285 -6050
9188 -6050 -2435 -5130 -12852 -14583 -14231 -13830 -13980 -11832 -11215 -8494 -11389 -12246 -9667 -12458 -11304 -9447
9172 -9447 -11601 -11749 -13149 -13098 -9159 -5155 -4988 -3506 -2564 -5817 -10042 -10692 -10103 -8624 -7644 -6004 -5043
9155 -5043 -5941 -7939 -14717 -19702 -20063 -16722 -11999 -5474 -2749 -2782 -1896 -1805 3426 10755 19793 29095 46050
9138 46050 64122 76928 84430 82233 68463 52362 36812 26620 19239 15012 10647 11189 8131
9125 8131 5697 9888 16686 17301 12335 8128 9224 11126 6464 6405 8303 9903 3706 2419 722 506
9109 506 2182 817 -196 -362 -1410 -288 2267 5348 262 3018 3494 6010 8645 15418 24886 37968
9093 37968 58234 76221 87485 77811 62545 46911 33015 24215 22463 22787 23040 23655 27760 25983
9079B5983m822p334o201o179j584p8p717o60O125L824k503k080L835J834N080
9064G523J616o58R09k339l302Q10l372k331K929J684k78K655L814M872J07m415
9048A0224m351J100l259k155j066k159J164j275N69r55L791N71n916J744L058
9033A085j507K49l590k197m559m074N098M161M489P694J637k125k639J772M163
9018I657K331k461j865K248K262P68j52J890M518K178p238L303P785L445k009
9003B6660n206m878n70J773L052L353J859N0k441k349k070K767m404j359K597
8988A8834K658K730K493n254p68O560M456j356k013J091P80k519J812l94K7K804
8972C1941L156m272q83L822k689L911N212N159l493J745Q524O517J0193J3314
$$ plain form
9079 25983 21161 13827 7626 1447 -137 -215 -7932 -8592 -2467 1357 -1146 -3226 609 2443 7523
9064 7523 9139 8481 9390 7051 3749 4559 1187 -1144 1785 3469 3191 5846 9660 14532 14639 10224
9048 10224 5873 6973 3714 1559 493 -1666 -502 -1777 -1208 -2163 1628 2199 -3717 -1973 1085
9033 1085 -422 -173 -3763 -5960 -10519 -14593 -9495 -5334 -845 6849 8486 6361 3722 5494 9657
9018 9657 11988 9527 7662 9910 12172 12940 12788 14678 19196 21374 14136 17439 25224 28669 26660
9003 26660 21454 16576 16006 17779 20831 24184 26043 26093 23652 21303 19233 22000 17596 16237 18834
8988 18834 21492 24222 26715 21461 20693 27253 31709 30353 28340 29431 30211 27692 29504 29110 29137 31941
8972 31941 35097 30825 29942 33764 31075 34986 40198 45357 41864 43609 52133 58650 68843 82157
8958H2157O690m183M32M907L538N568J6119J7097J5773J2957J0653J5966K5830
8945B13504J0093o425j5120j7152L277P468K320m384o225q843j2272j6516j6035
8932A33690n490L243J429O467O289Q597J0675J8078K6251K6782K7492L7789O1909
8919C63201J04105J45254J39790N7062m3340j19069j36525j12448p9087m3321
8909B75622k3473o37N911m996j0008j1725j1375o720j342J9984K4564J6922Q007
8896B80734m404k2117k4557k6660j9209r271m855n409k517K869O053R279K5426
8883B05362L6278L0825L0912M1698O3197J02065J49044J32419M2896n1909j21734
8872F61053j41726j14401q5427o3925m1987k6524j7876j5766m397p20J0432R730
$$ plain form
8958 82157 88847 84664 85096 90003 93541 99109 115228 132325 148098 161055 171708 187674 213504
8945 213504 223597 217172 202052 184900 188177 195645 197965 193581 187356 178513 166241 149725 133690
8932 133690 128200 131443 132872 139339 145628 154225 164900 182978 209229 236011 263503 301292 363201
8919 363201 467306 612560 752350 809412 766072 647003 510478 398030 318943 275622
8909 275622 252149 251512 257423 252427 242419 230694 219319 212599 211257 231241 255805 272727 280734
8896 280734 276330 254213 229656 202996 183787 174516 169661 164252 161735 164604 170657 179936 205362
8883 205362 241640 272465 303377 345075 408272 510337 659381 791800 834696 782787 661053
8872 661053 519327 404926 319499 255574 213587 187063 169187 153421 149024 148304 158736 168466
8860A68466J06j807L933R158J4806L2634M5624N3537M4126M979m1470o6203o3761
8847B04128m3242k5273j4158q299q783k899O250N495L246J1941J2532J5896J6636
8834A73470J6448J8847K2047J3225J54n963K759J1299Q448K221r216j2319q753
8821B32667o999k03M959J0843K6235L6609L7799L5457N1144P4410J27187K09750
8809H39858K74348J97390P983j63433k67819k50479j72458j07332o6665l3508
8799B57885k9480j9220n251k51J155p85k768j652J341k936j282j949j013M143
8785A97937K917J1465J2500J3891P977l706m426j2929m909K677R407J9779K5756
8772B78336L2069K3346R183J0850K8532N1207R5607J56147K16638J89373L8650
$$ plain form
8860 168466 168572 166765 170698 179856 194662 227296 272920 326457 370583 375562 334092 267889 204128
8847 204128 160886 135613 121455 113156 104373 101474 107724 113219 116465 128406 140938 156834 173470
8834 173470 189918 208765 230812 244037 244191 238228 240987 252286 260734 262955 253739 241420 232667
8821 232667 225668 225465 230424 241267 267502 304111 341910 377367 428511 502921 630108 839858
8809 839858 1114206 1311596 1319579 1156146 888327 637848 465390 358058 291393 257885
8799 257885 228405 209185 203934 203683 204838 204053 201285 199633 200974 198038 196756 194807 193794 197937
8785 197937 200854 212319 224819 238710 246687 242981 238555 225626 220717 223394 232801 252580 278336
8772 278336 310405 333751 342934 353784 382316 433523 529130 685277 901915 1091288 1129938
8761A129938j05242k10120k14631j51570q3666m1584k1653k458L0048P1056J21724
8750E21842J42105O4206l2292j12226j46244j15924o7747m1301k9740k3878j7047
8739A41754q997j2812j1623p532M47N595O082k530j203m951l169N479K32p143
8725I9629o441o787o547k960m360o718j105M696K735M835Q37k416L292J3998J8932
8710A11620K6500M9109P1074J21180J38515O1138j9910r3450j24475r8474o5139
8699A77688m0382k2655j4792j2542r654q204o215k325k455N61J267J156j188J1153
8685G1413O479o654j6064r950r568q436m479r14k307l427l529r62Q5J128K432
8670A5247L612J122N411Q467K843n145N293l899q094q695q031j491j963j953L667
$$ plain form
8761 1129938 1024696 814576 599945 448375 364709 323125 301472 299014 329062 400118 521842
8750 521842 663947 728153 695861 583635 437391 321467 253720 212419 182679 158801 141754
8739 141754 132757 119945 108322 100790 101237 106832 112914 110384 109181 104230 101061 106540 106772 99629
8725 99629 93188 86401 79854 76894 72534 65816 64711 69407 72142 76977 77814 75398 78690 92688 111620
8710 111620 138120 187229 258303 379483 517998 579136 559226 465776 341301 242827 177688
8699 177688 137306 114651 99859 87317 77663 69459 63244 60919 58464 59025 60292 61448 60260 71413
8685 71413 77892 71238 55174 45224 35656 27220 22741 21827 19520 16093 12564 11602 11687 12815 15247
8670 15247 18859 19981 25392 33859 36702 31557 36850 32951 24857 16162 8131 6640 4677 2724 6391
8655F391M345L145N432J431J276l72n625O57O137n744J776M826M251Q04R88K541
8639C2259K931j928o879m923L509J869L805P168P782j265l559n629r85p10m296
8624B9149L291O513P81l297M035N58n855l983L14K759Q451O651K38k980p581r676
8608B9368l872M667k225j035N977O798j607q74J546n495l599J66K039P197M912
8593D3963M910J631N891J3170J4821J9668K9825L2477J9478R281J0383J3153L0156
8580B48807J6812q767l0333m6039m2388k5378j5531o738j577O195q28j938M933
8567I7230J3144J9931J0384M668O570P219J9524M3880Q9160J36054J30306M0914
8555F18984m7606j14289j14986q1629m9418l2481k0506j0076l399m764k127r60
$$ plain form
8655 6391 10736 13881 19313 20744 22020 21648 16023 16680 22817 17073 18849 23675 27926 28730 29718 32259
8639 32259 35190 33262 26383 21460 24969 26838 30643 37811 45593 44328 40769 35140 34155 33445 29149
8624 29149 32440 38953 39734 36437 40472 41030 35175 31192 31506 34265 42716 49367 49605 46625 39044 29368
8608 29368 25496 30163 27938 26903 32880 39678 38071 37197 38743 33248 29649 29815 31854 39051 43963
8593 43963 48873 50504 56395 69565 84386 104054 133879 166356 185834 195115 205498 218651 248807
8580 248807 265619 256852 226519 180480 138092 112714 97183 90445 88868 95063 94235 92297 97230
8567 97230 110374 130305 140689 145357 151927 159146 178670 222550 311710 447764 578070 618984
8555 618984 571378 457089 342103 260474 211056 178575 158069 147993 144594 139830 137703 136743
8543A36743P141J6546K4801M7477Q0162R9083R2534R7530L8044l9767q3644j17659
8531C98991r8523n8861l2908j5629p920n842K027Q300Q632J6746J8168J9784K3761
8518B76726M0711N2958P3062J08141J73681K86016L18289J20194n5003k01241
8508A193534k39392j70106j16747r8892q4089p1255o0496m0226l3559k9260j6601
8497B32911q105j3988m490M810Q546L7564N9805M3362P498k9597o4670p5244n6937
8484A41465l3901j9962j9635r230p25j577l253m679m247j058N818J5639K2600
8471H7255L3753M4794O6037J14053J40417O6482k7132r1068j18788r6990o2738
8460A56075l7619k8402j8451p512J543O96m304j1912j0024r608m007K984l445
$$ plain form
8543 136743 143884 160430 185231 232708 312870 411953 504487 602017 640061 600294 516650 398991
8531 398991 300468 241607 208699 193070 185150 179308 181335 189635 198267 215013 233181 252965 276726
8518 276726 317437 370395 443457 551598 725279 1011295 1329584 1449778 1394775 1193534
8508 1193534 954142 784036 667289 568397 484308 413053 352557 312331 278772 249512 232911
8497 232911 224806 210818 206328 211138 219684 257248 317053 360415 367913 338316 273646 198402 141465
8484 141465 107564 87602 67967 58737 58012 56435 53182 48503 44256 43198 49016 64655 87255
8471 87255 121008 165802 231839 345892 486309 552791 525659 434591 315803 218813 156075
8460 156075 118456 90054 71603 64091 65634 66330 62026 50114 40090 30482 26475 29459 26014
8447B6014n834j751K253p174m979K50J728m329j664o17O173L104m436o419l304
8432i85K206m689q434o611n08L9N821O929M283L470o06m161J891J12J990k970
8416b223o547l847J063J930N76L814P661O328J019k817r35M776J782l140n643
8401C797l426K934m48n326n78J721L4M185L249J569P56p148N38M275n39k095l499
8384ao541m200K731M939L166K663m257o792m328M09j115k166N856L533J702k374
8368f775j831J882N614M217O09K207k15l167l083l1O84m79N90M421K324l465K800
8351F302j866K58L174L192O56K818k544j623n003N56n789r956k511L532N476J717
8335a611k47J244j964m774l895j46R92J109J080K761J586j870k453O34Q58K189
$$ plain form
8447 26014 20180 18429 20682 13508 8529 8779 10507 6178 4514 3897 10070 13174 8738 2319 -985
8432 -985 1221 -3468 -11902 -18513 -19021 -18982 -13161 -6232 -1949 1521 915 -3246 -1355 -1243 747 -2223
8416 -2223 -8770 -12617 -11554 -9624 -9048 -5234 2427 8755 9774 6957 6022 10798 12580 9440 3797
8401 3797 371 3305 2857 -2469 -3047 -1326 -1292 2893 6142 7711 8467 1319 1857 6132 5593 3498 -1
8384 -1 -6542 -10742 -8011 -3072 94 2757 -1500 -8292 -12620 -12211 -13326 -15492 -9636 -6103 -4401 -6775
8368 -6775 -8606 -6724 -1110 3107 3716 5923 5708 2541 -542 -573 111 -368 222 4643 6967 3502 6302
8351 6302 4436 4694 7868 11060 11716 14534 11990 10367 5364 5920 131 -9825 -12336 -8804 -3328 -1611
8335 -1611 -1858 -614 -2578 -7352 -11247 -11393 -10401 -9292 -8212 -5451 -3865 -5735 -8188 -7554 -6696 -4507
8319d507m629K27N035J244n394K792K330O383L129l810k205K216R32k749M098
8304E092O911K039J159N593l720r042r56O38l498o318M62J269l80m091l862J668
8288g036M527O063J435L712N670R437J2407J5983L3109N2218M4213J2286j3780
8275A80244l6571m5163l7441j9206j0383j0171j0266m787m630j662K880K930m725
8262A049k428N029L716l544j60j269O411N659K07k996K87J090K95p60M85K934
8246A6005k391n837l259J220N743M724J0127J0794J0175J4723J7342L5930O6299
8233A81595J02908Q2514J6752l9954q8047q6555n2956l3665k2326j3122j1967
8222C5177r083k081k979l652o426m195K227K232j294J124m694J163K704m345l558
$$ plain form
8319 -4507 -9136 -8909 -3874 -2630 -8024 -5232 -2902 3481 6610 2800 595 2811 3743 994 5092
8304 5092 12003 14042 15201 20794 17074 8032 7076 7714 4216 -2102 -1640 -371 -751 -4842 -8704 -7036
8288 -7036 -2509 3554 4989 8701 14371 23808 36215 52198 85307 137525 181738 194024 180244
8275 180244 143673 98510 61069 41863 31480 21309 11043 6256 1626 -36 2844 5774 1049
8262 1049 -1379 3650 7366 3822 3662 2393 8804 14463 14670 11674 11961 13051 13346 12586 13071 16005
8246 16005 13614 7777 4518 5738 11481 16205 26332 37126 47301 62024 79366 115296 181595
8233 181595 284503 367017 383769 343815 255768 169213 116257 82592 60266 47144 35177
8222 35177 26094 24013 21034 17382 10956 6761 8988 11220 9926 11050 6356 7519 10223 5878 2320
8207B320m011j9J267P01R32k104J491P34r62K426N345o95n907J369O247N041R558
8190B3733R690J7691L2489M7855L9977R227j8863l4115m5363l4808k4438q607
8178A4468k378P97J008n558m005o321o104M532K469j640Q7K185J807o28J011p559
8162e829m784K998O204L345l007n379J434J410j366O01J793p75K733K102O52j02
8146B030l906k958o35L132j482l112J942K01r56k040m28J285l788p26L597O399
8130a445p38n716k724L87M154J17L748j072l666N920j705L387M475l306m093n678
8114g955j275O374J805k213o14j25j249Q28J198K947L181j575K00j575j760P39
8098a069l163m866M712K293k349k05l563j614j971M845K339N708K11m119m30m70
$$ plain form
8207 2320 -1691 -1710 -443 258 1190 -914 577 1311 349 2775 8120 7425 1518 2887 9134 14175 23733
8190 23733 33423 51114 83603 131458 171435 180662 161799 127684 82321 47513 23075 14468
8178 14468 12090 12887 13895 8337 4332 -1989 -8093 -3561 -1092 -2732 -2645 -460 1347 719 1730 -5829
8162 -5829 -10613 -7615 -1411 1934 -1073 -6452 -5018 -3608 -4974 -4373 -2580 -3355 -622 1480 2132 2030
8146 2030 -1876 -4834 -5469 -2337 -3819 -6931 -4989 -4788 -5744 -7784 -8212 -6927 -10715 -11441 -7844 -1445
8130 -1445 -2183 -7899 -10623 -10236 -6082 -5965 -2217 -3289 -6955 -1035 -2740 647 5122 1816 -2277 -7955
8114 -7955 -9230 -2856 -1051 -3264 -3878 -4003 -5252 -4424 -3226 -279 2902 1327 1527 -48 -1808 -1069
8098 -1069 -4232 -9098 -4386 -2093 -4442 -4647 -8210 -9824 -11795 -6950 -4611 1097 1308 -2811 -3241 -3711
8082c711n49O1j405K878P17m929j604O9m365k690j50O009M194L584j964k77n500
8065i632J151J219K461j568Q88J726P27K388k114j102O55K095J218J114j351M370
8049D245N16k591k665j0008m286N026M628K901m452n706J247P15K091j127m571
8034a4037j870L189j238J342J393J459P091J608l230m31j379J799K065m15j377
8019d031j529J7n25k996j802j892j427L167k967l82K031L451K745l569k230j503
8003a3442K63P924L858J65P05l890l041m56J462J930J563j171j9J133J882J154
7987B0j829K670L04l777k545o05L099j002n405p22M668L115r12j85m251l768M434
7970f691O878J939j048J000L425K857j550n013n748j932l99J428L423K853L839
$$ plain form
8082 -3711 -4260 -4199 -5604 -2726 -2009 -6938 -8542 -8473 -12838 -15528 -15678 -9669 -5475 -1891 -3855 -4132 -9632
8065 -9632 -8481 -7262 -4801 -6369 -5481 -3755 -3028 -640 -2754 -3856 -3201 -1106 112 1226 -125 4245
8049 4245 4761 2170 -495 -10503 -14789 -9763 -5135 -2234 -6686 -12392 -11145 -10430 -8339 -9466 -14037
8034 -14037 -15907 -12718 -13956 -12614 -11221 -9762 -2671 -1063 -4293 -4724 -6103 -4304 -2239 -2654 -4031
8019 -4031 -5560 -5543 -6068 -9064 -10866 -12758 -14185 -11018 -13985 -14367 -12336 -8885 -6140 -9709 -11939 -13442
8003 -13442 -13179 -5255 -1397 -1232 -527 -4417 -7458 -7914 -6452 -4522 -2959 -4130 -4149 -3016 -1134 20
7987 20 -1809 861 1165 -2612 -5157 -5762 -2663 -3665 -9070 -9792 -5124 -2009 -2921 -3106 -7357 -11125 -6691
7970 -6691 187 2126 1078 2078 5503 8360 6810 1797 -3951 -5883 -6282 -4854 -1431 1422 5261
7955E261k472J884J618o24L874J000K350J512k862j322j024k210k190j875R17
7940C837o51J043L469J806P427J168k695K658l069m775j175J985l286m770j803
7925A169O084K249k040P30K475R81K22j474K4M2k08O517R442M497J396R310O050
7908D7466L137j712n339l326n386r691l405K269k028j209m900l742l716p9K623
7893A0962L318k081M96q22l56J840O62m573K109O20n21K089J355k429l943K418
7877A1144M577N943P01k703N13j38J116L898l700j829N202K617j611N36K520O72
7861B9458p647p68L552k633r205m907r41L535L610M46r549p722Q48J619j678Q35
7845a147N645J540k063n38k076J503K206P82n394M600M752J951j843o91l305q02
$$ plain form
7955 5261 2789 4673 6291 5667 9541 10541 12891 14403 11541 10219 9195 6985 4795 2920 3837
7940 3837 3186 4229 7698 9504 16931 18099 15404 18062 14993 10218 9043 11028 7742 2972 1169
7925 1169 7253 9502 7462 8192 10667 11648 11870 10396 10420 10462 10254 16771 26213 30710 32106 41416 47466
7908 47466 50603 48891 43552 40226 34840 25149 21744 24013 21985 20776 15876 12134 8418 8339 10962
7893 10962 14280 12199 12695 11873 11517 13357 14019 9446 11555 12175 11654 13743 15098 12669 8726 11144
7877 11144 15721 21664 22365 19662 20175 20037 21153 25051 21351 19522 24724 27341 25730 26266 28786 29458
7861 29458 21811 21043 24595 21962 12757 7850 6909 10444 14054 14500 4951 -2771 -1923 -304 -1982 -1147
7845 -1147 4498 6038 3975 3437 1361 2864 5070 5852 458 5058 9810 11761 9918 9227 5922 5120
7829E120j302M86M044Q52Q7J60K759J792K121k95K675m188o212k347M284J21j612
7812H545n365k436K508K186K072m616q477r65K683o127R19R519M636o62p93m809
7796a182j755p27j099k803JM401O256M356P54o412P40L112L70L125p990J329m885
7779b409k249M890P79L39l283m070K408K253K585j272k64j862k189K58J071m07
7763c422q17j93N033k453p318o26q79k142P91m44L517J4172K333n089o269k844
7747f650j970L528p63O87O089k387n204j025O64l044o444O17L868r42K926L063
7731f987L142L793k75k841l457j987j024J481j381Rj749k112q95q27J47J687M637
7714h639O805K564l419J871k655m148K870L238j42l414N72L935J177O21l893O73
$$ plain form
7829 5120 3818 4304 8348 9200 9287 9447 12206 13998 16119 15824 18499 14311 8099 5752 10036 10157 8545
7812 8545 3180 744 3252 5438 7510 2894 -5583 -6548 -3865 -9992 -9073 446 5082 4420 3627 -1182
7796 -1182 -2937 -3664 -4763 -7566 -7565 -3164 3092 7448 8202 1790 2530 5642 6012 9137 1147 2476 -2409
7779 -2409 -4658 232 1011 1350 -1933 -6003 -3595 -1342 1243 -29 -293 -2155 -4344 -4086 -3015 -3422
7763 -3422 -4239 -4432 601 -1852 -9170 -9796 -10675 -12817 -12026 -12470 -8953 5219 7552 2463 -3806 -6650
7747 -6650 -8620 -5092 -5855 -5168 921 -1466 -6670 -7695 -7031 -10075 -16519 -15902 -12034 -12976 -10050 -6987
7731 -6987 -3845 -52 -327 -3168 -6625 -8612 -9636 -8155 -9536 -9527 -11276 -13388 -14283 -15110 -14963 -13276 -8639
7714 -8639 -1834 730 -2689 -818 -3473 -7621 -4751 -1513 -1655 -5069 -4497 -562 615 1236 -2657 -1984
7698a984J58J891K86k246o65k078k791M38m097J0M750M730L403k024l068p125
7682a0412j784K910L128J638k737m83k068K130K21J529L199j394Q62J100k221
7667d382J042R85n662m490k045J277O780L548q764K24Q03l519n18n442J369N654
7651a3140M905l174J97J00j38O990n020l240N643K717k819l133L828J051k652
7636g885J396K255k451L61j216o80K070j293J20l661m49k674j566K309O43M161
7620h560q3K222M74j30j765O26k617k688J731L557L745J380k886J473L429m864
7604d956M94M91L073l08n242l227O042J094L796m947m362J074m767K09J147m08
7588a0797j4K079n912Q50K635L934M769m603j923O71J54J036k297L193l066l306
$$ plain form
7698 -1984 -1826 65 351 -1895 -2560 -4638 -7429 -6991 -11088 -11078 -6328 -1598 1805 -219 -3287 -10412
7682 -10412 -12196 -9286 -6158 -4520 -7257 -7740 -9808 -7678 -7457 -5928 -2729 -4123 -3261 -2161 -4382
7667 -4382 -3340 -2355 -8017 -12507 -14552 -13275 -6495 -2947 -11711 -11487 -10684 -14203 -14721 -20163 -18794 -13140
7651 -13140 -8235 -11409 -11212 -11112 -11250 -4260 -9280 -12520 -6877 -4160 -6979 -10112 -6284 -5233 -7885
7636 -7885 -6489 -4234 -6685 -6324 -7540 -8220 -6150 -7443 -7323 -10984 -11433 -14107 -15673 -13364 -12721 -8560
7620 -8560 -8643 -6421 -5947 -6077 -7842 -7216 -9833 -12521 -10790 -7233 -3488 -2108 -4994 -3521 -92 -4956
7604 -4956 -4462 -3971 -898 -1206 -6448 -9675 -3633 -2539 1257 -3690 -8052 -6978 -11745 -11536 -10389 -10797
7588 -10797 -10811 -8732 -14644 -13794 -11159 -7225 -2456 -7059 -8982 -8311 -8157 -7121 -9418 -6225 -9291 -12597
7572a2597j862M114J422Q351R23n271k087K92j866Q07J028k266J609L82o548o065
7556a9634P84o10j342J648K041k528K54j894N172O029m849J976L555N784k232
7541e846l277N199K835k85j325j759J075M26m349J120K99j563J674m138k338K761
7525i491J008j974Q86k448j859N344K402N13M6J181p568k448L450o09m290j913
7509a7770O65J407N101O49M85P034L29q404j195O566l98k586l709L477K192M117
7493b040J625o568j796p14M278j060k701j645L955J15j502N089J150p205j448
7478a0467P41J079J425L75q070j994R46O265J378j175j352p17q25J40j639r35
7462a4825k093K818K635o77k991O000q33k354L223M257L30l794l954J10L118P566
$$ plain form
7572 -12597 -14459 -10345 -8923 -572 351 -4920 -7007 -6715 -8581 -7774 -6746 -9012 -7403 -7021 -13569 -19634
7556 -19634 -18850 -19460 -20802 -19154 -17113 -19641 -19387 -21281 -16109 -10080 -14929 -12953 -9398 -3614 -5846
7541 -5846 -9123 -3924 -1089 -1374 -2699 -4458 -3383 -2957 -7306 -6186 -5887 -7450 -5776 -9914 -12252 -9491
7525 -9491 -8483 -10457 -9571 -12019 -13878 -8534 -6132 -5619 -5573 -4392 -11960 -14408 -10958 -11567 -15857 -17770
7509 -17770 -17105 -15698 -10597 -9948 -9463 -2429 -2100 -10504 -11699 -5133 -5531 -8117 -11826 -8349 -6157 -2040
7493 -2040 -415 -6983 -8779 -9493 -5215 -6275 -8976 -10621 -6666 -6551 -8053 -2964 -1814 -9019 -10467
7478 -10467 -9726 -8647 -7222 -6847 -14917 -16911 -15965 -9700 -8322 -9497 -10849 -11566 -12391 -12251 -13890 -14825
7462 -14825 -16918 -14100 -11465 -12142 -15133 -9133 -9966 -12320 -9097 -4840 -4510 -8304 -12258 -12148 -9030 -1464
7446a464j216l662n037j132j002k791J267P332J826O53r52m697J456K266K685
7431d468J942J957K538l246k018m88l549K213k196J427N625P22k473N24m540l433
7415i463M489l186q99j539K571J173J704K061O03J267o379p08K269J906j178j079
7399f388n53j203J771J015Q09j864K296L358k07k648J814l229J121J625o86n25
7383c494K637J69l617J341N988l24r34n788n81P44J841j354J201k250o34O01j159
7366e613l529j189K081O80K398L786N10j448ML767k3l60J420q07j900j688k273
7349d184o002l010K688J083J817k112j528k006J556N047Q67l182K09j670J677
7334h750r78K857p02J236o93P737j487j829K120R6l302n353K1K949J200J293K385
$$ plain form
7446 -1464 -2680 -6342 -11379 -12511 -13513 -16304 -15037 -7705 -5879 -5226 -6178 -10875 -9419 -7153 -4468
7431 -4468 -2526 -569 1969 -1277 -3295 -3783 -7332 -5119 -7315 -5888 -263 459 -2014 -1490 -6030 -9463
7415 -9463 -4974 -8160 -9059 -10598 -8027 -6854 -5150 -3089 -2486 -1219 -7598 -8306 -6037 -4131 -5309 -6388
7399 -6388 -6941 -8144 -6373 -5358 -4549 -6413 -4117 -759 -966 -3614 -1800 -5029 -3908 -2283 -2969 -3494
7383 -3494 -857 -688 -4305 -2964 3024 2700 1766 -4022 -4603 -3859 -2018 -3372 -2171 -4421 -5055 -4454 -5613
7366 -5613 -9142 -10331 -8250 -7570 -5172 -1386 -876 -2324 -2320 1447 1424 1064 2484 1677 -223 -1911 -4184
7349 -4184 -10186 -13196 -10508 -9425 -7608 -9720 -11248 -13254 -11698 -6651 -5784 -8966 -8757 -10427 -8750
7334 -8750 -9728 -6871 -7573 -6337 -7030 707 -780 -2609 -489 -393 -3695 -9048 -9027 -6078 -4878 -3585 -1200
7317a200k326j154N86K220O721l788o299l398L05j607l374k222O321M751L31j098
7301e231o68M24k457L55M860l37Q22J275J639l66n344M266M008J641l190j139
7285E58k016l225K232k85m865k855r80j334r23j451K416j5j022J1k307J569M822
7268i670Q001J488o520n805J967j255k629k077J526L273M78L153P12j034Q93J477
7252f022K340O94l15l68j140J377L634m127l056K369N313K646J572m528l270K761
7236a20k617l638J948j413J0K353j859J915l144q833j167M268K428J809o056J674
7220a2442O58l772L895L612P37J355L6l63J92J55J337k704K190l16j47o91Q38
7203e430p85k47K339L278M32L724N978N14j0755m291K523K141M900L44n136l048
$$ plain form
7317 -1200 -3526 -4680 -4094 -1874 4847 1059 -5240 -8638 -8333 -9940 -13314 -15536 -9215 -4464 -4133 -5231
7301 -5231 -5899 -5475 -7932 -7577 -2717 -3054 -2232 -957 682 316 -5028 -762 3246 4887 1697 558
7285 558 -1458 -4683 -2451 -2736 -7601 -10456 -11436 -12770 -13693 -15144 -12728 -12743 -13765 -13754 -16061 -14492 -9670
7268 -9670 -1669 -181 -6701 -12506 -10539 -11794 -14423 -16500 -14974 -11701 -11223 -8070 -7358 -8392 -7499 -6022
7252 -6022 -3682 -2988 -3303 -3671 -4811 -3434 200 -3927 -6983 -4614 699 3345 4917 389 -2881 -120
7236 -120 -2737 -6375 -4427 -5840 -5830 -3477 -5336 -3421 -6565 -15398 -16565 -12297 -9869 -8060 -14116 -12442
7220 -12442 -11784 -15556 -11661 -8049 -7312 -5957 -5921 -6284 -6092 -5937 -4600 -7304 -5114 -5430 -5577 -6268 -5430
7203 -5430 -6215 -6462 -4123 -845 -413 3311 9289 9803 -952 -5243 -2720 -579 4321 4665 -471 -3519
7187c519m59K205j563j422p7K837J08M036J277O77o933o474O649M282l244j155
7171b775O77l205o569j548K419L835k271K95L37l63k861j837l12O101L443J674
7155b960M90j370K75J331P72O19k786Q0M810k686k530k74O643J196k979l354j250
7138c973L153o26K862j99j685m885m359p43K371J940R09J863K61j658N84n70J325
7121c430N4J40J765K572j365k23L008J989P78k881m654l930K083l11J523K838
7105d4k694l700k614O253M792M935k93n204N01L713k695n819l862l591J88K373
7089g761P5J573j15L83O449J643l13k176k360l189K658L734J573J135p838q07
7073e336k507n901M866R350M341j469p9k124j276m109J938o364N96M590k638m6
$$ plain form
7187 -3519 -3978 -1773 -3336 -4758 -4835 -1998 -1890 2146 3423 4100 -2833 -9307 -2658 1624 -1620 -2775
7171 -2775 -2098 -5303 -11872 -13420 -11001 -7166 -9437 -9142 -8805 -9168 -12029 -13866 -14178 -8077 -4634 -2960
7155 -2960 -2470 -3840 -3565 -2234 -1462 -843 -3629 -3549 1261 -1425 -3955 -4229 2414 3610 631 -2723 -3973
7138 -3973 -820 -1446 1416 1217 -468 -5353 -9712 -10455 -8084 -6144 -5235 -3372 -3111 -4769 -4185 -4755 -3430
7121 -3430 -3376 -3236 -1471 1101 -264 -487 2521 4510 5288 2407 -2247 -6177 -4094 -4405 -2882 -44
7105 -44 -2738 -6438 -9052 -2799 1993 6928 6635 1431 1932 5645 2950 -2869 -6731 -10322 -10134 -7761
7089 -7761 -7686 -6113 -6228 -5845 604 2247 1934 -242 -2602 -5791 -3133 601 2174 3309 -4529 -5336
7073 -5336 -7843 -13744 -8878 472 4813 3344 3265 1141 -135 -4244 -2306 -8670 -8074 -3484 -6122 -6168
7057f168K212L797J433l570n374l209k369J673L740o4J461M268J724j206n71m536
7041f759j082Q74O75R3N07J092r32P0K849R35n291k6M517L973p92o16k873l304
7023f090J991K112K026L848l178o088P210M65m630n170j428l077j744O261O534
7008i58n23r93n36L780Q27k179n309k361m37L821L559k886l374J337n222k000
6992a3454k80L240J862K119M618m38m52R24l788q06K765J893J1J429J264l999
6976c092j563J455k113j762P05q32N494m135j192m46J580L911J927k845l369k50
6960f527J726K866K063p87j587N800l26j473Q92j963J565L075J076p435n299K844
6944c490L332j448j567J970K272j592p20p71j306J099J512J049m869k481J671
$$ plain form
7057 -6168 -3956 -159 1274 -2296 -7670 -10879 -13248 -11575 -7835 -7899 -6438 -2170 -446 -1652 -2223 -6759
7041 -6759 -7841 -6967 -6292 -6199 -5692 -4600 -5532 -5462 -2613 -1678 -6969 -6995 -2478 1495 703 87 -2786 -6090
7023 -6090 -4099 -1987 39 3887 709 -5379 1831 2296 -2334 -7504 -8932 -12009 -13753 -7492 -958
7008 -958 -1481 -2474 -3010 770 1597 -582 -5891 -8252 -8689 -4868 -1309 -4195 -7569 -6232 -11454 -13454
6992 -13454 -13734 -10494 -8632 -6513 -1895 -2333 -2785 -1861 -5649 -6455 -3690 -1797 -1786 -357 907 -3092
6976 -3092 -4655 -3200 -5313 -7075 -6370 -7202 -1708 -5843 -7035 -7481 -5901 -1990 -63 -2908 -6277 -6527
6960 -6527 -4801 -1935 128 -659 -2246 3554 3228 1755 2647 684 2249 5324 6400 -1035 -6334 -3490
6944 -3490 -158 -1606 -3173 -1203 1069 -523 -1243 -2014 -3320 -2221 -709 340 -4529 -7010 -5339
6929e339k96j136j586K065R12K564j199o808r89k79l264j024K773K958J707j254
6913a0195j637J847n50P043M156K709m892l564K481j30l231L39J554J796n40o14
6897c428K518J03N01J70j89N152l87j393j291l329J774j743j511R38j993l371
6881g479P102p95K145J892m81k112j960N808N457K721j216m144p568k790k510
6866e930L126J709n196k526L922L189n07K880K799L899K5n651n241L347K882K260
6850D987k423J050j270k935l274R5m68k83L566J206m046l887k637L710M113N466
6834B970k916m918j271L268J76j345m204k349N258N108N610K523l397j528K651
6819E636m579n947j941N83L07m037J646L714N65K03n72l871L33j435L75K079P467
$$ plain form
6929 -5339 -5635 -6771 -8357 -6292 -5380 -2816 -4015 -10823 -11812 -12091 -15355 -16379 -13606 -10648 -8941 -10195
6913 -10195 -11832 -9985 -10535 -3492 664 3373 -1519 -5083 -2602 -2732 -5963 -5624 -4070 -2274 -2814 -3428
6897 -3428 -910 -807 -306 -136 -325 4827 4440 3047 1756 -1573 201 -1542 -3053 -2115 -4108 -7479
6881 -7479 -377 -1172 973 2865 2384 272 -1688 4120 9577 12298 11082 6938 -630 -3420 -5930
6866 -5930 -2804 -1095 -6291 -8817 -4895 -1706 -2213 667 3466 7365 7390 1739 -3502 -155 2727 4987
6850 4987 2564 3614 2344 -591 -3865 -3770 -4238 -4521 -955 251 -3795 -7682 -10319 -6609 -2496 2970
6834 2970 54 -4864 -6135 -2867 -2691 -4036 -8240 -10589 -5331 -223 5387 7910 4513 2985 5636
6819 5636 1057 -4890 -6831 -6248 -5941 -9978 -8332 -4618 -4053 -3850 -4422 -8293 -7960 -9395 -9020 -6941 526
6802E26L483j548j281j262l67l22j624L534M065K045K930l114m476p35j810m374
6786d330p585N20K245j485q68J469J404J998R14j717k384n277l261J1090K207
6771e060K8m778o31L820J787L056O48q49J26l109o724q00L094m529P18L712O91
6754h800J302L46J922N377K4J533k299L72l111J961O268l063K02M551L99n89n1
6737F344l726m401m754M158K34l182M40M236K986j750j953J754k60L021K293R36
6721F376J038m489m125q42j731l760K623k174K005K144j792l75N53o88j683l254
6705a0174l58N326N858L437P0l841k559j891L748o16l148j289J412R85p68o28
6689d436K672r45K189k349l191J089j192l268n375J564P561N176k688j880j049
$$ plain form
6802 526 4009 2461 1180 -82 -449 -771 -2395 1139 5204 7249 10179 7065 2589 1854 44 -4330
6786 -4330 -11915 -11395 -9150 -10635 -11503 -10034 -8630 -6632 -5718 -7435 -9819 -15096 -18357 -7267 -5060
6771 -5060 -5032 -9810 -10441 -6621 -4834 -1778 -1130 -1979 -1853 -4962 -11686 -12486 -9392 -13921 -13203 -9491 -8800
6754 -8800 -7498 -7152 -5230 147 171 1704 -595 -223 -3334 -1373 4895 1832 2034 6585 6984 6395 6344
6737 6344 2618 -1783 -6537 -2379 -2145 -5327 -4887 -651 2335 585 -1368 386 126 3147 5440 6376
6721 6376 7414 2925 -1200 -2042 -3773 -7533 -4910 -7084 -5079 -2935 -4727 -5102 -4549 -5237 -6920 -10174
6705 -10174 -10532 -5206 652 4089 4159 318 -2241 -4132 -384 -1000 -4148 -5437 -4025 -3040 -3808 -4436
6689 -4436 -1764 -2709 -520 -2869 -6060 -4971 -6163 -9431 -14806 -13242 -5681 -505 -3193 -5073 -6122
6674f122J272N44J256j417K220j493J119J343N666K452k243m229q308k36M114
6659d062M693K524j123q35L144j223o195m951j94Q05L439O6q97N380L122K454
6643F147o613o757l705M710P222K199k531j125o143j845L889M082J011l79j672
6628a510J04N04l48J959j212j845o936j182N131n23J436L149p09O16R79J205l715
6611b897k282K024j664o14K401J283n044J99L18j977L367J217r17m97J188l112
6595g007k616M794K126j182J839L113k51J747L869R61P93k722m877j050k582O31
6579b414N56Q04R72K464K586m396m398j622j21j343k991O675L10j102L689L847
6563C516l461l92O064J194K72n371K697m851k718M056Q00J565j857J62p33r19
$$ plain form
6674 -6122 -4850 -4306 -3050 -4467 -2247 -3740 -2621 -1278 4388 6840 4597 368 -7940 -8176 -4062
6659 -4062 631 3155 2032 1197 4341 3118 -3077 -8028 -8222 -7417 -3978 -3912 -4809 571 3693 6147
6643 6147 -466 -7223 -10928 -6218 1004 3203 672 -453 -6596 -8441 -4552 -470 541 162 -1510
6628 -1510 -1406 -902 -1250 709 -503 -2348 -9284 -10466 -5335 -5858 -4422 -1273 -1982 -1366 -387 818 -2897
6611 -2897 -5179 -3155 -4819 -5433 -3032 -1749 -6793 -6594 -6276 -8253 -4886 -3669 -4586 -5083 -3895 -7007
6595 -7007 -9623 -4829 -2703 -3885 -2046 1067 816 2563 6432 7393 8186 5464 587 -463 -3045 -2414
6579 -2414 -1858 -1054 -82 2382 4968 572 -3826 -5448 -5569 -6912 -9903 -3228 -2918 -4020 -331 3516
6563 3516 55 -337 5727 6921 7193 1822 4519 -332 -3050 1006 1806 3371 1514 1676 943 24
6547B4m669o765o137L362P603o67M106J360L42j115k329J020k519Q16M307J289
6531B8j982K882m94L43j251J609L73l235L90q52J254o147M028J0224M335m775
6515F730n270n345l198Q28L23n68K924l37j052q13N24j414N73p73J457M223j457
6498b645p92N368K775l053R95l376m048J37K529m450J72j397o59L448L752J24
6482a120L652j638j258O1k334J955M04J427M096l168o002M188K448k569l368m367
6466g593k480M729O686J869j448K225j65j703l156l519K592N36l00M249M176n655
6450A043k722l861L000O625k861N302P86l804m413l74j799j512N45L492J383L152
6434C982j215j59j581m58k964O29K552l074K912J686L868L622m629n717m586j8
$$ plain form
6547 24 -4645 -11410 -17547 -14185 -6582 -7249 -3143 -1783 -1441 -2556 -4885 -3865 -6384 -5568 -1261 28
6531 28 -1954 928 434 777 -474 1135 1508 -1727 -1337 -2189 -935 -7082 -3054 7170 11505 6730
6515 6730 1460 -3885 -7083 -6255 -5932 -6500 -3576 -3913 -4965 -5778 -5254 -6668 -6095 -6868 -5411 -1188 -2645
6498 -2645 -3437 1931 4706 1653 2648 -728 -4776 -4639 -2110 -6560 -6388 -7785 -8444 -4996 -1244 -1120
6482 -1120 2532 894 -364 -303 -2637 -682 -278 1149 5245 2077 -3925 263 2711 142 -3226 -7593
6466 -7593 -10073 -5344 1342 3211 1763 3988 3823 2120 -1036 -4555 -1963 -1427 -1727 2522 6698 1043
6450 1043 -1679 -5540 -2540 4085 1224 6526 7312 3508 -905 -1279 -3078 -4590 -4045 -553 830 3982
6434 3982 2767 2608 1027 569 -2395 -1766 786 -2288 624 2310 6178 9800 5171 -546 -5132 -5150
6418e150K457R525K150L347K291n2n366n609l613l096K35j513m55j174r77K929
6402d071j710M62N233J344l675m760j774K496M13K060L495J340J170l062l725
6387d764j478K092k755P53o99n344L302L522K186J258M588L39R38K362q18k129
6371C353J91J512k971m842j142M290k747k480m116j674J878L893j497j056J257
6356f151J178m70M240J899k788k423L11j465L826L587j09j821m569q051n612L707
6340a4711N815K693J772j415J120k782K704O200Q031L041o303n00L295K309l946
6325G323J882J992j140l635j555n91l32L828L797q03r200p111N84K524j614k447
6309f498M378O63M039o0J007k837l511k965l320N85K534R64J219J937J605M678
$$ plain form
6418 -5150 -2693 6832 8982 12329 14620 14568 9202 3593 -20 -3116 -2881 -4394 -4849 -6023 -7000 -4071
6402 -4071 -5781 -5319 -86 1258 -2417 -7177 -8951 -6455 -6042 -3982 -487 853 2023 -1039 -4764
6387 -4764 -6242 -4150 -6905 -6152 -6851 -12195 -8893 -5371 -3185 -1927 2661 3000 3938 6300 5482 3353
6371 3353 3544 5056 2085 -2757 -3899 391 -2356 -4836 -8952 -10626 -8748 -4855 -6352 -7408 -6151
6356 -6151 -4973 -5443 -1203 696 -2092 -4515 -4204 -5669 -1843 1744 1635 -186 -4755 -12806 -18418 -14711
6340 -14711 -8896 -6203 -4431 -5846 -4726 -7508 -4804 1396 9427 12468 6165 5665 8960 11269 7323
6325 7323 9205 11197 10057 6422 4867 4276 3944 7772 11569 10766 1566 -5545 -4961 -2437 -4051 -6498
6309 -6498 -2120 -1457 2582 2522 3529 692 -2819 -5784 -9104 -8519 -5985 -5021 -3802 -1865 -260 4418
6293D418K790o910n798m412N49N138k00o21L197o481m465J639M056l79Q627K556
6277C704j800j353l041j273q22J970J665l1M976J511n068n412K000O01l348R29
6261d792k304j261m581j84M183o36O100K736N129K33o806k717O102J506k123K240
6245B825r2o057j641L215K70j296k580J100N446M218q32o321k578J996p57K857
6229b27K853L767m972n823l192J871P352l360m715L945K688j935k289L79K472
6214a186J377L481ql847l644K587nk809M372J144k121j320K747j057j466j775
6198c530j47k180J349K219K532K648K703p12J36J504k60n692n205k874P879L142
6182C512m955j906k242J763k962n445o05K546M755K858m33m615l116K073L840
$$ plain form
6293 4418 7208 298 -5500 -9912 -9363 -4225 -4425 -5046 -1849 -8330 -12795 -11156 -7100 -7479 1148 3704
6277 3704 1904 551 -2490 -3763 -4585 -2615 -950 -981 3995 5506 438 -4974 -2974 -2373 -5721 -4792
6261 -4792 -7096 -8357 -12938 -13122 -8939 -9575 -3475 -739 4390 4623 -2183 -4900 1202 2708 585 2825
6245 2825 2733 -3324 -4965 -1750 -1480 -2776 -5356 -4256 1190 5408 4576 -1745 -4323 -2327 -3084 -227
6229 -227 2626 6393 1421 -4402 -7594 -5723 1629 -1731 -6446 -2501 187 -1748 -4037 -3658 -1186
6214 -1186 191 3672 3664 -183 -3827 -1240 -1245 -4054 318 1462 -659 -1979 768 -289 -1755 -3530
6198 -3530 -3677 -5857 -4508 -2289 243 2891 5594 4882 5018 6522 6262 570 -4635 -7509 370 3512
6182 3512 -1443 -3349 -5591 -3828 -6790 -12235 -12840 -10294 -5539 -2681 -3114 -7729 -10845 -8772 -4932
6167d932J88J508K865k916k75J077l20M628O851L953n50p576n273j478J089J119
6151d2l361l140M031m406n33L718K652L18k664L958M041p84k088J125J893K441
6135G159O41J86k03m186q542M021L08J550M736K182l991o941J26L088K039p76
6119A397m282Q04n013k581j46L192J102K144L981k718j539J267J21J11q94l652
6103f706l5L915M650p32j083L64N27J842N414k463n663j780j781p59L53J846o6
6086b157q73N9J932k035j12Q67n69j566L982K812L26J467L072k563R24M87j045
$$ plain form
6167 -4932 -4744 -3236 -371 -3287 -3562 -2485 -2805 1823 8674 12627 12077 4501 -772 -2250 -1161 -42
6151 -42 -3403 -6543 -2512 -6918 -7451 -3733 -1081 -763 -3427 531 4572 3788 1700 2825 4718 7159
6135 7159 7800 7986 7783 3597 -4945 -924 -616 934 5670 7852 3861 -3080 -2954 134 2173 1397
6119 1397 -2885 -2081 -7094 -9675 -9821 -6629 -5527 -3383 598 -2120 -3659 -2392 -2271 -2160 -3054 -6706
6103 -6706 -6741 -2826 1824 1092 9 373 900 2742 8156 5693 30 -1750 -3531 -4290 -3937 -2091 -2157
6086 -2157 -3030 -2971 -1039 -3074 -3186 -2319 -2888 -4454 -472 2340 2666 4133 7205 4642 5566 6053 5008
$$ [...]
##END NTUPLES=NMR SPECTRUM
##END=
