##TITLE=Analysis number 315156
Compound Code tl 01033
Project Code adrs
Chemist Name ugmt
##JCAMPDX= 6.0         $$ Bruker NMR JCAMP-DX V2.0
##DATA TYPE= NMR SPECTRUM
##DATA CLASS= NTUPLES
##ORIGIN= Bruker BioSpin GmbH
##OWNER= NMR
$$ XWIN-NMR		Version 3.5
$$ Wed Nov  9 12:57:46 2005 GMT Standard Time (UT+0h)  MAYBRIDGE\NMR@NMR_250MHZ
##.OBSERVE FREQUENCY= 250.131544655141
##.OBSERVE NUCLEUS= ^1H
##.ACQUISITION MODE= SIMULTANEOUS (DQD)
##.ACQUISITION SCHEME= undefined
##.AVERAGES= 16
##.DIGITISER RES= 18
##SPECTROMETER/DATA SYSTEM= dpx250
##.PULSE SEQUENCE= zg30
##.SOLVENT NAME= DMSO
##.SHIFT REFERENCE= (INTERNAL, DMSO, 0, 16.522)
##AUDIT TRAIL= $$ (NUMBER, WHEN, WHO, WHERE, WHAT)
$$ ##TITLE= Audit trail, XWIN-NMR		Version 3.5
$$ ##JCAMPDX= 5.01
$$ ##ORIGIN= Bruker BioSpin GmbH
$$ ##OWNER= NMR
$$ C:\u/data/dgb/nmr/ADRS/12090/pdata/1/auditp.txt
$$ ##AUDIT TRAIL=  $$ (NUMBER, WHEN, WHO, WHERE, WHAT)
(   1,<2005-11-09 12:57:20.02 +000>,<MAYBRIDGE\NMR>,<NMR_250MHZ>,
      <created by zg, POWCHK disabled, PULCHK disabled
       configuration hash MD5:
       62 19 C7 07 E1 42 D1 B7 37 6C 3D D0 77 39 F9 E6
       data hash MD5: 64K
       E0 BC BE 9A BD 16 9E 2F 04 2F E2 F8 3A 94 34 D5>)
(   2,<2005-11-09 12:57:34.64 +000>,<MAYBRIDGE\NMR>,<NMR_250MHZ>,
      <Start of raw data processing
       ef LB = 0.3 FT_mod = 6 PKNL = 1 SI = 32K 
       data hash MD5: 32K
       50 06 0E A2 66 0E 8B 60 EB 13 48 40 A9 11 C4 88>)
(   3,<2005-11-09 12:57:36.63 +000>,<MAYBRIDGE\NMR>,<NMR_250MHZ>,
      <apk 
       data hash MD5: 32K
       3E B8 BC 4F E0 C3 31 62 F6 40 83 52 33 27 3B D2>)
(   4,<2005-11-09 12:57:37.68 +000>,<MAYBRIDGE\NMR>,<NMR_250MHZ>,
      <abs ABSG = 5 
       data hash MD5: 32K
       63 37 D9 E2 02 50 F2 BE C0 1A 48 9C 3F 78 2E AB>)
$$ ##END=
$$ 
$$ hash MD5
$$ B1 28 AB FD B1 85 FA 6A E1 5F 65 9D 5F AA 37 77
##$RELAX= 
##$RELAX= 
##$RELAX= 
##$RELAX= 
##$RELAX= 
##$RELAX= 
##$RELAX= 
$$ Bruker specific parameters
$$ --------------------------
##$DU= <C:\u>
##$EXPNO= 12090
##$NAME= <ADRS>
##$PROCNO= 1
##$TYPE= <nmr>
##$USER= <dgb>
##$AMP= (0..31)
100 100 100 100 100 100 100 100 100 100 100 100 100 100 100 100 100 100 
100 100 100 100 100 100 100 100 100 100 100 100 100 100 
##$AQSEQ= 0
##$AQ_mod= 3
##$AUNM= <au_zg>
##$AUTOPOS= <32 >
##$BF1= 250.13
##$BF2= 250.13
##$BF3= 250.13
##$BF4= 250.13
##$BF5= 500.13
##$BF6= 500.13
##$BF7= 500.13
##$BF8= 500.13
##$BYTORDA= 1
##$CFDGTYP= 0
##$CFRGTYP= 5
##$CHEMSTR= <none>
##$CNST= (0..31)
1 1 145 1 1 1 1 1 1 1 1 1 1 1 1 1 1 1 1 1 1 1 1 1 1 1 1 1 1 1 1 1 
##$CPDPRG= <>
##$CPDPRG1= <>
##$CPDPRG2= <>
##$CPDPRG3= <>
##$CPDPRG4= <mlev>
##$CPDPRG5= <mlev>
##$CPDPRG6= <mlev>
##$CPDPRG7= <mlev>
##$CPDPRG8= <mlev>
##$CPDPRGB= <>
##$CPDPRGT= <>
##$D= (0..31)
0 1 0 0 0 0 0 0 0 0.06 0 0 0 0 0 0 0.0002 0 0 0 0 0 0 0 0 0 0 0 0 0 0 
0 
##$DATE= 1131541039
##$DBL= (0..7)
120 120 120 120 120 120 120 120 
##$DBP= (0..7)
150 150 150 150 150 150 150 150 
##$DBP07= 0
##$DBPNAM0= <>
##$DBPNAM1= <>
##$DBPNAM2= <>
##$DBPNAM3= <>
$$ [...]
##$SUBNAM7= <"">
##$SUBNAM8= <"">
##$SUBNAM9= <"">
##$SW= 20.6930455092707
##$SWIBOX= (0..15)
0 0 3 0 0 0 0 0 0 0 0 0 0 0 0 0 
##$SW_h= 5175.983436853
##$TD= 65536
##$TD0= 1
##$TE= 295.16
##$TE2= 300
##$TE3= 300
##$TEG= 300
##$TL= (0..7)
0 120 120 120 120 120 120 120 
##$TP= (0..7)
150 150 150 150 150 150 150 150 
##$TP07= 0
##$TPNAME0= <>
##$TPNAME1= <>
##$TPNAME2= <>
##$TPNAME3= <>
##$TPNAME4= <>
##$TPNAME5= <>
##$TPNAME6= <>
##$TPNAME7= <>
##$TPOAL= (0..7)
0.5 0.5 0.5 0.5 0.5 0.5 0.5 0.5 
##$TPOFFS= (0..7)
0 0 0 0 0 0 0 0 
##$TUNHIN= 0
##$TUNHOUT= 0
##$TUNXOUT= 0
##$USERA1= <user>
##$USERA2= <user>
##$USERA3= <user>
##$USERA4= <user>
##$USERA5= <user>
##$V9= 5
##$VALIST= <valist>
##$VCLIST= <CCCCCCCCCCCCCCC>
##$VD= 0
##$VDLIST= <DDDDDDDDDDDDDDD>
##$VPLIST= <PPPPPPPPPPPPPPP>
##$VTLIST= <TTTTTTTTTTTTTTT>
##$WBST= 1024
##$WBSW= 4
##$XGAIN= (0..3)
0 0 0 0 
##$XL= 0
##$YL= 0
##$YMAX_a= 550426
##$YMIN_a= -455191
##$ZGOPTNS= <>
##$ZL1= 120
##$ZL2= 120
##$ZL3= 120
##$ZL4= 120
##$ABSF1= 16.522
##$ABSF2= -4.171173
##$ABSG= 5
##$ABSL= 3
##$ALPHA= 0
##$AQORDER= 0
##$ASSFAC= 0
##$ASSFACI= 0
##$ASSFACX= 0
##$ASSWID= 0
##$AUNMP= <proc_1d>
##$AZFE= 0.1
##$AZFW= 0.1
##$BCFW= 0
##$BC_mod= 0
##$BYTORDP= 0
##$COROFFS= 0
##$CY= 12.5
##$DATMOD= 1
##$DC= 0
##$DFILT= <>
##$DTYPP= 0
##$F1P= 14.0000005364418
##$F2P= -0.99999901652339
##$FCOR= 0.5
##$FTSIZE= 32768
##$FT_mod= 6
##$GAMMA= 0
##$GB= 0
##$INTBC= 1
##$INTSCL= 1
##$ISEN= 128
##$LB= 0.3
##$LEV0= 0
##$LPBIN= 0
##$MAXI= 10000
##$MC2= 0
##$MEAN= 0
##$ME_mod= 0
##$MI= 0
##$NCOEF= 0
##$NC_proc= -5
##$NLEV= 6
##$NOISF1= 0
##$NOISF2= 0
##$NSP= 0
##$NTH_PI= 0
##$NZP= 0
##$OFFSET= 16.522
##$PC= 1
##$PHC0= 75.96604
##$PHC1= 2.853735
##$PH_mod= 1
##$PKNL= yes
##$PPARMOD= 0
##$PSCAL= 4
##$PSIGN= 0
##$REVERSE= no
##$SF= 250.13
##$SI= 32768
##$SIGF1= 0
##$SIGF2= 0
##$SINO= 400
##$SIOLD= 32768
##$SREGLST= <1H.DMSO>
##$SSB= 0
##$STSI= 32768
##$STSR= 0
##$SW_p= 5175.98343685301
##$SYMM= 0
##$S_DEV= 0
##$TDeff= 65536
##$TDoff= 0
##$TI= <Analysis number 999999
Compound Code 99
Book Reference 9
Project Code 9>
##$TILT= no
##$TM1= 0
##$TM2= 0
##$TOPLEV= 0
##$USERP1= <user>
##$USERP2= <user>
##$USERP3= <user>
##$USERP4= <user>
##$USERP5= <user>
##$WDW= 1
##$XDIM= 32768
##$YMAX_p= 514717653
##$YMIN_p= -642171
$$ End of Bruker specific parameters
$$ ---------------------------------
##NTUPLES= NMR SPECTRUM
##VAR_NAME=  FREQUENCY,     SPECTRUM/REAL,   SPECTRUM/IMAG
##SYMBOL=    X,             R,               I
##VAR_TYPE=  INDEPENDENT,   DEPENDENT,       DEPENDENT
##VAR_FORM=  AFFN,          ASDF,            ASDF
##VAR_DIM=   32768,         32768,           32768
##UNITS=     HZ,            ARBITRARY UNITS, ARBITRARY UNITS
##FACTOR=    0.157963299565203, 1,           1
##FIRST=     4132.6476996994, 0,             0
##LAST=      -1043.33573715361, 0,           0
##MIN=       -1043.33573715361, -642171,     0
##MAX=       4132.6476996994, 514717653,     0
$$ Real data points
##PAGE= N=1
##DATA TABLE= (X++(R..R)), XYDATA
$$ [...]
24335C67371r8316j01438j03138j44265p9954L7182n6874J06908J25583J70666
24325B23725R8039l3215M683N9342j21498O858P6571j07744l10877j88089O8329
24314b23876m5799k2024J78649J29797K5209j34932k21689J24765L01024J21301
24304B32425R5873o3103j33735j95130M3406M2515j01920p1558m4985J07719K12596
24293A24103R8250j53603Q0995J53758o0012k6980L7112O4538j7877j00995j53218
24282D6071m5651n0081O3579J77038r173M0430J6231j33667j99492j28101Q9298
24271a33518J80576L8610N3828l7354J1503j11171j18819m6557N8191P2796Q0660
24260D8745m3452L8647n2959l0136j4785J20822J5506r8998p3351J06659K12987
$$ y = [367371, 269055, 167617, 64479, -79786, -159740, -122558, -179432, -72524, 53059, 223725, 321764, 288549, 293232, 352574, 231076, 237934, 314505, 206761, -104116, -292205, -223876, -269675, -291699, -113050, 16747, 41956, -92976, -314665, -189900, 111124, 232425, 328298, 265195, 131460, -63670, -20264, 22251, -79669, -151227, -196212, -88493, 124103, 222353, 68750, 149745, 303503, 243491, 216511, 253623, 318161, 300284, 199289, 46071, 420, -49661, 13918, 190956, 181783, 222213, 238444, 104777, -94715, -222816, -133518, 47058, 85668, 139496, 102142, 113645, 2474, -116345, -162902, -104711, -31915, 48745, 5293, 43940, -9019, -39155, -53940, 66882, 82388, -16610, -89961, 16698, 229685]
24249B29685r4245o5039J1186j30652j08445M5742k9134p2122q3130O0099L26093
24238I0038R9693l1782P5199j44281j74159j83846Q5067P8733O9062N7217q4764
24227f3823j19976m6427R5907J38279P9018M2114q9603j06845j38600J5909J12129
24216h1918N6275N3761j03050L8219L0236M3040o6090j04126J75459R4272L1220
24205A67298n6881J595n7529k11201l64534O0747J53442J67678J66356j48546
24195a21575M2330Q7746Q090M2220L8937j35817K3090J38362j39873o8419j9105
24184a04014R6808R4141K0262l8095j17253O1542J3171P7023J27607j20309q0917
24173B9966m1307n1144J5792R1573M3270J06294L2158j75842j06817j3598O5044
$$ y = [229685, 135440, 70401, 81587, -49065, -157510, -111768, -140902, -213024, -296154, -236055, 90038, 189731, 157949, 233148, 88867, -85292, -269138, -184071, -105338, -36276, 20941, -63823, -183799, -230226, -134319, 3960, 82978, 125092, 35489, -71356, -209956, -194047, -81918, -25643, 28118, -74932, -36713, -6477, 36563, -29527, -133653, 41806, 136078, 167298, 110417, 112012, 54483, -156718, -521252, -460505, -307063, -139385, 26971, -121575, -79245, 8501, 16591, 58811, 97748, -38069, -14979, 123383, -16490, -84909, -104014, -7206, 86935, 107197, 69102, -48151, 13391, 26562, 103585, 231192, 110883, 29966, -11341, -62485, -46693, 44880, 88150, 194444, 226602, 50760, -56057, -69655, -4611]
24162d611k9866J14810J9349r9999R3507k0135j11153j10760m3869p3688J9791
24151b46624P4690J46933J06793j0989j03383Q3104M9786l3897j3404j75373j01802
24140b24166J52966J38349o2527K8109M0602j38268m8797p4229l805k9762J28402
24129i3126K02187n1591J7306K395o6699J7516n6811n1813j0288N0792J1627n2864
24117h1369J48355M395k4340l6107O6833K8777k7380k5363r0494J18922l5001
24106D7228j78170l522P6467O8316j34518k54360l9630K11936J62057o6386N2112
24095e8470j5407P7331N6524M9813j71114k29435l3525J54648R5205J45282J33744
24084B04596j27072l06214J07831M3820r4790O6018N2770k1918L0497k985p6280
$$ y = [-4611, -34477, 80333, 99682, -317, 93190, 73055, -38098, -148858, -192727, -266415, -246624, -171934, -25001, 81792, 70803, -32580, 50524, 100310, 66413, 53009, -122364, -224166, -71200, 67149, 4622, 32731, 73333, -64935, -113732, -187961, -191766, -221528, -93126, 109061, 57470, 74776, 77171, 10472, 27988, -28823, -80636, -90924, -40132, -28505, -81369, 66986, 71381, 47041, 10934, 77767, 106544, 79164, 53801, -36693, 82229, 47228, -130942, -134464, -57997, 10319, -124199, -378559, -418189, -206253, -44196, -110582, -58470, -73877, 3454, 59978, 109791, -61323, -290758, -324283, -169635, -74430, 70852, 204596, 77524, -228690, -120859, -77039, -171829, -105811, -53041, -74959, -44462, -47447, -123727]
24073a23727J21327L3612j17493K4509J24719p8585m453O8334o760J15525J7551
24062A74559o5998q7845N6964L7111J3718j66040M1780N3090P4462o3430j27460
24051e9089j55189j52616O3920Q5091R821k15847Q9483K92722J27536l4983p9871
24040b9022m4991O1527O6035o264j22944r6880Q2817q9696p2830K50500J92307
24029A90559p3477j26165j21905j61261k3822J95362J35572q4641Q5722P5118
24019I1062L1592n6909r4456j02004j01829j31779L2053J78277N3107k1004j2832
24008a34722M6370r849p5877o1304K56804K12772J58783k02287k26372k6141r4383
23997a56206N4511J67388L7016K9209J1649k20177l6811k5314p4407J98760O3753
$$ y = [-123727, -2400, 31212, -86281, -61772, 62947, -15638, -20091, 48243, 41483, 157008, 174559, 108561, 20716, 77680, 114791, 128509, -37531, 4249, 57339, 131801, 68371, -59089, -214278, -366894, -302974, -217883, -208062, -423909, -334426, -41704, 85832, 50849, -29022, -74013, -12486, 53549, 47285, -75659, -172539, -89722, -179418, -252248, -1748, 190559, 117082, -9083, -130988, -292249, -316071, -120709, 14863, -69778, 15944, 91062, 122654, 65745, -28711, -130715, -232544, -364323, -332270, -153993, -100886, -121890, -134722, -88352, -98201, -174078, -235382, 21422, 234194, 392977, 190690, -35682, -61823, -156206, -101695, 65693, 102709, 131918, 143567, -76610, -113421, -138735, -213142, -14382, 49371]
23986D9371J0377J03234j54765k22182J0743M597N9012J82528K05222Q250j03967
23975A52420q5468J1772R0017J09638R631j20529P831o8477k27313O1487j06711
23964a65702l5862P3316Q1598l3962k16157l8270L07119Q5477j44241J29153J27759
23953A70228j42719j07314P7484J26986l7357m0321j81361n3854q802R5635M3230
23942e8165P3745J7627l2732q0675m5758J09892J11920p0521Q4323J34739j57268
23931H7127j36115M5253q2248J18166J5090j49731O0094J46369q0574R5794J09371
23920B28596m9177j89581K6326j6970l6969j2089O2690k1896R5258N1322q9236
23909D8274J10727J11635J8941k0210j61515P4698L4904m5940l9233j93069N6611
$$ y = [49371, 59748, 162982, 8217, -213965, -203222, -198625, -139613, 42915, 248137, 256387, 152420, 66952, 78724, 168741, 278379, 288010, 167481, 175312, 106835, -120478, -58991, -165702, -201564, -128248, -46650, -80612, -296769, -335039, -27920, 57557, -86684, 42469, 170228, 27509, -79805, -2321, 124665, 87308, 46987, -134374, -188228, -197030, -101395, -58165, 15580, 33207, 475, -80200, -125958, -16066, 95854, 25333, 109656, 244395, 87127, -48988, -3735, -85983, 32183, 47273, -102458, -42364, 104005, 23431, 119225, 228596, 179419, -10162, 16164, -806, -37775, -49864, 12826, -9070, 86188, 137510, 48274, 159001, 270636, 289577, 269367, 107852, 182550, 217454, 171514, 132281, -60788, -4177]
23898d177J6957K9523J32175L1194j45111J13495J26837K9814j56828j85677j18012
23887a29810k5330N3442K27819N8797m6141p3133N01j52231j19065P256O7777
23876a30118J7383Q1404j3421L9854J4619N2779P636M9428J57209o9926j44218
23865F2629j96434m6417J35859J29873N8881o7202J7116J736j56760l2882O8103
23854b5498K42955n2209j40337L0640O7169O2512N9977l1443j37306j91665q0551
23843a95756K9028J19528k8752j25546N1803N8815K4712o5960J40940k468J88861
23832A95205L425J4084j11750j99489J06080M6022o3483J49904J23914M6020J0884
23821C20816J6302p0047q6122r1474k2066l9552j85419j2249J45085J60234J92767
$$ y = [-4177, 12780, 42303, 174478, 205672, 60561, 174056, 300893, 330707, 173879, -11798, -129810, -155140, -101698, 126121, 184918, 138777, 65644, 66145, -86086, -205151, -197895, -130118, -112735, -31331, -44752, -4898, 9721, 62500, 70136, 119564, 276773, 206847, 62629, -133805, -180222, -44363, 85510, 144391, 77189, 94305, 96041, -60719, -93601, -25498, 217457, 165248, 24911, 55551, 122720, 185232, 245209, 213766, 76460, -115205, -195756, -166728, -47200, -75952, -201498, -149695, -90880, -66168, -132128, 8812, 6344, 195205, 198630, 212714, 100964, -98525, 7555, 53577, -9906, 139998, 263912, 309932, 320816, 337118, 267071, 180949, 89475, 67409, 27857, -157562, -169811, -24726, 135508, 328275]
23810C28275k21495k143R070j50564K9755O2676o870N3670J41189j6699j65501
23799F1363J4460J03558Q0524k3062o8090p2078l3871p3014J43479j26924j26662
23788a20317q0018n147j44145j02154R250R4574J72958Q6528j1539J10882K61441
23777B72313J13530j2100j51452P7080j68115j53225J0210N048K0405p5367k5971
23766h7644Q3507p4996l5468J32598N1145q3636l3507q8785J22735J35300j6094
23755A05155q5935p7596p8094j26408Q4617J44812k0676j49333L9154K8327o3608
23744a99585Q6975K77611j08327j19241J47097J65800K7235l2210K2369j67719
23734A00005j55659n0491L2863j07615R2718J53823n362J1282j21848m4886J28925
$$ y = [328275, 106780, 104637, 113707, -36857, -7102, 55574, 48704, 102374, 243563, 226864, 61363, 75823, 179381, 259905, 236843, 168753, 96675, 62804, -10210, 133269, 6345, -120317, -200335, -205482, -349627, -451781, -442531, -347957, -174999, -88471, -100010, 10872, 272313, 385843, 373743, 222291, 299371, 131256, -21969, -11759, -6711, 13694, -61673, -87644, -4137, -79133, -114601, 17997, 69142, -14494, -48001, -136786, -14051, 121249, 105155, 19220, -58376, -136470, -262878, -178261, -33449, -54125, -203458, -164304, -135977, -199585, -112610, 165001, 56674, -62567, 84530, 250330, 277565, 245355, 267724, 100005, -55654, -106145, -73282, -180897, -88179, 65644, 60282, 71564, -50284, -95170, 33755]
23723C3755n066r3658J87678j00977m2688O8737J02977j41341m6498J90959j710
23712A52168J43105J64127l9208j27637O838J05158M2886j42631j32724p4767
23702I7315j59308J06064q3675j91394J8586O5526Q8114J96071R9264j69973q7114
23691b0524Q580M0256j0781J74007J2297k76492Q5108K2739m6892p942k1083J87336
23679A46609k0151j81940N0975P3545L1319j26912R112L2008L2086k1992l2043
23668g384J0464J1916j3497j46267j86168J29970J62232J04451l1406n3326p9472
23657i8487P9702N5133q1477j4624M1369j06745m8547J56163J25097Q2187K82314
23646D72085P2372j35016m9323j13796l5332K2543p2062j66265M5019J4290r8771
$$ y = [33755, 28689, -64969, 122709, 21732, -20956, 47781, 150758, 9417, -37081, 153878, 152168, 295273, 459400, 420192, 292555, 299393, 404551, 447437, 304806, 172082, 97315, -61993, 44071, -39604, -230998, -212412, -146886, -58772, 137299, 236563, 66590, -20524, -11944, 28312, 17531, 191538, 203835, -72657, 12451, 35190, -11702, -19644, -40727, 146609, 126458, -55482, -4507, 69038, 100357, -26555, -17443, 14565, 46651, 24659, -7384, 3080, 14996, 1499, -144768, -330936, -200966, -38734, 65717, 34311, -19015, -98487, -18785, 36348, -45129, -59753, -18384, -125129, -173676, -17513, 107584, 189771, 472085, 544457, 409441, 360118, 246322, 210990, 233533, 161471, -4794, 40225, 54515, -44256]
23635d4256o5276m720m3805M0755Q5004L9162l4923J2283M2460j66154r673J37528
23623a1615L4945K55904J10363j7559j03759j73832j01331p5708K0837L4530r4835
23612a22060J1715P4837j56940R1274R4775j66428J19240J87964j6522q6504m4961
23601a3610J16078J15733Q744j0273k8660J26831m0359j18594m3001n3335Q733
23590F8287J9036j27421j54438K5924R0983o1684N3243l7035j57714j02413J49533
23579b33699J80656P7223J35762k323j15331o7861P7879m2372m068J53659J07481
23568B67006j81833n7350n2744j1198R8182Q1963j4714o7425j38661n5601J02202
23557c0173J20516O5666j08157J52266p9941j88091n7224J42271K34985Q6453
$$ y = [-44256, -109532, -114252, -158057, -117302, -32298, 6864, -28059, -15776, 26684, -139470, -149143, -11615, 23330, 279234, 389597, 372038, 268279, 94447, -6884, -82592, -61755, -27225, -122060, -110345, -35508, -192448, -101174, -6399, -172827, -53587, 134377, 117855, 31351, -13610, 102468, 218201, 226945, 216672, 188012, 314843, 274484, 155890, 112889, 59554, 68287, 87323, -40098, -194536, -168612, -77629, -139313, -86070, -123105, -280819, -383232, -233699, -53043, 24180, 159942, 157619, 42288, -25573, 52306, 9934, 5866, 159525, 267006, 85173, 27823, -24921, -36119, 62063, 144026, 129312, 61887, -76774, -132375, -30173, 90343, 156009, 47852, 200118, 120177, -67914, -125138, 17133, 252118, 338571]
23547C38571m3499j77452p7260n0681O7797j1063j32028p9764K3727J57772J0235
23536B6355j85521n825r6163l7632P7655L9593j06732M6767N5559k75J36079J02387
23524E2247J0164k8767j36099K4828p9335n5857N0724m687n6649R6960N620j2539
23512a33390J85180R6149J3119k53159k35039K4396J39251M4139J08982N0902
23502D0530l2425N216Q3455N6858P049R4361K1249j51543p8744Q757q1715l9762
23490f6714J49777p1797j32912O2970o0021p667M6309l0469L9221r2774J22502
23479d1575l0076j57196Q1028J3381J09666J67014p571o6861J28783j2234j4113
23468A70246n2228M3036p0391O6397M8032p3367j72352k239l3772o4251Q3788
$$ y = [338571, 295072, 117620, 40360, -10321, 57476, 46413, -85615, -165379, -141652, 16120, 26355, -159166, -164991, -261154, -298786, -221131, -181538, -288270, -241503, -185944, -186219, -50140, 52247, 62411, 33644, -102455, -77627, -156962, -212819, -162095, -166782, -223431, -126471, -120851, -133390, 51790, 147939, 161058, -92101, -327140, -302744, -163493, -119354, -10372, 40530, 8105, 13321, 96776, 153634, 160683, 255044, 276293, 124750, 46006, 54763, -26952, -66714, 83063, 11266, -121646, -58676, -118697, -126364, -80055, -110524, -71303, -164077, -41575, -71651, -228847, -147819, -134438, -24772, 142242, 134671, 67810, 196593, 184359, 170246, 118018, 161054, 90663, 157060, 205092, 131725, -40627, -42866, -76638, -140889, -57101]
23457e7101K5800N634J02393L4815j29144j64950l4236M4024O9090O2958J56329
23446A15612l1072j90653o8393K2979O4197j08137m3879R3837K0985p4268R2307
23435a06485m2417m4385N7226J59790n2070O548l863j34967M645M2464J2120K7427
23423g3967p3961m6768p431L6421J65470L5951l5361O2014J11410n1278J04023
23412B26523j45110j79396L6702P3639P0015j5788l1747q3897P834k2921Q8756
23401B4610Q1769o7014o961o5991j0428J0427O8636K0490Q739K5311m8643L3618
23389G4563J23838l5746j69932j16574r9450J33818K43562J6393J01285m2069
23379B29688R957j98459r939J59413n4957k41997n1755r4314j36680J07183M9413
$$ y = [-57101, -31301, -25667, 76726, 111541, -17603, -182553, -216789, -172765, -103675, -40717, 115612, 84540, -106113, -174506, -151527, -87330, -195467, -239346, -145509, -124524, -198792, -106485, -148902, -193287, -136061, 23729, -28341, -21793, -25656, -160623, -155978, -113514, -101394, -73967, -147928, -194696, -202127, -165706, -236, 35715, 354, 62368, 173778, 122500, 226523, 81413, -97983, -61281, 12358, 82373, 66585, 34838, -49059, -41225, -64146, 24610, 106379, 39365, 32404, -33587, -44015, -33588, 35048, 55538, 64277, 89588, 40945, 74563, 198401, 162655, -7277, -123851, -223301, -89483, 154079, 170472, 271757, 229688, 239645, 41186, 31247, 190660, 135703, -106294, -158049, -252363, -389043, -281860, -232447]
23368b32447m3577J45716J72862j03164j93540J28200J09534J12371J45006j68099
23358G2862k8498R6516j67474l6070Q5813o0582M2655o8118M8978J67281J122
23347A54485n1492N0391j08070j30030O6284j29852q6659p8980Q2858M9661l2456
23336b13860j5951K45023N7725k7728K7412k65380K0645L04633j8375j34724L3637
23325A3057P6698k6149p3072R3069J48978L9341n1871n512j59154k088o3668j48877
23313a59248O8465p2973j08829M6615M1470J89187J44230K321q7178q9764J31112
23302A05408K5527r4893k22278K5143J09350J79414n4515j2827k5966n2113j3301
23291c1051k1690L8273m5576M1901K4098p8478n3783J34480K00938p7804q2940
$$ y = [-232447, -276024, -130308, 42554, -60610, -254150, -125950, -16416, 95955, 240961, 72862, 44364, 140880, -26594, -62664, 23149, -37433, 5222, -62896, -13918, 153363, 154485, 102993, 153384, 45314, -84716, -18432, -148284, -234943, -313923, -231065, -181404, -213860, -229811, 15212, 72937, 45209, 72621, -192759, -172114, 132519, 114144, -20580, 13057, 89755, 63606, -9466, 83603, 232581, 271922, 220051, 214539, 55385, 53297, -10371, -159248, -90783, -163756, -272585, -225970, -184500, 4687, 148917, 151238, 64060, -25704, 105408, 130935, 36042, -186236, -161093, -51743, 127671, 73156, 60329, 34363, -17750, -31051, -52741, -14468, -60044, -18143, 5955, -72523, -126306, 8174, 209112, 131308, 48368]
23280D8368j05337R2231n3524k7802N9559Q4871j19243K2212j601n9060j03598
23269a62924J00890J29474M4270n8314j13657l4004P1399R1115p1717N8993O7633
23258A23158p3928k21570r5250q4962L8039N8611J86503J36324k48655n3175O3332
23247a71573M502K2939o5574J3206k2211J8259l3518Q6917J81676R4213M4987
23236A73823j28866j90993q9067J9858K6858P692R7094J65913P9146L0q6962m093
23224G0433o3805K08218j76j19766q3750R163M4948l6357j333r9207j0173J00180
23212A8375K47585J20840k32713k28524M612J23274j23022n100m8533L010j43413
23201b63609K0574R0335L25789k1464j94405k4453l2983Q3320m3724r5866J82923
$$ y = [48368, -56969, 35262, -18262, -46064, 13495, 98366, -20877, 1335, -266, -59326, -162924, -62034, 67440, 111710, 53396, -60261, -94265, -22866, 68249, -3468, 55525, 123158, 49230, -172340, -267590, -352552, -314513, -255902, -69399, 66925, -181730, -234905, -171573, -167071, -144132, -209706, -196500, -218711, -200452, -233970, -147053, 34623, 128836, 173823, 44957, -146036, -235103, -215245, -188387, -180695, -83601, 82312, 161458, 161488, 74526, 70433, 6628, 214846, 214670, 94904, 11154, 20317, 65265, 28908, 27575, -71632, -81805, 18375, 265960, 386800, 154087, -74437, -69825, 53449, -69573, -74673, -123206, -120196, -263609, -243035, -152700, 173089, 151625, -42780, -67233, -100216, -16896, -60620, -156486, 26437]
23190B6437J39458j20096n0255J8657p4692K9460r387J23667P5834k01921j36981
23179a79819J04348j48345M9421K78264N4149K4394l7831p6167L0492n3151Q8099
23168A33854n3285j0249n5305l9971P2103P8909k3327m4897K08J84302m8805k04815
23156a1278L1131q439L064l5493o2507j0337K6793O9445m645j20049o6437J55370
23144c3382K02845m8228j45182k7446q5107N1688o5537j26015J15314Q9223n6826
23133a28653r2003m9080L9169p9193j24763J38996J07674j227P9223J02766q565
23122a5656k5419K8739L533l0353L2749n79P4352j3714J4471N7240J2904K0319
23110A58586j28502j04189j21284O5827j4663L9364J16880J90793L2162m6323
$$ y = [26437, 165895, 45799, -4456, 14201, -60491, -31031, -40418, 83249, 159083, -42838, -179819, -75471, -223816, -174395, 103869, 158018, 182412, 144581, 68414, 98906, 45755, 133854, 80569, 70320, 15015, -24956, 47147, 126056, 102729, 57832, 58040, 242342, 193537, -11278, 19853, 11414, 14478, -21015, -83522, -93859, -67066, 2379, -2266, -122315, -188752, -33382, 169463, 121235, -23947, -51393, -136500, -84812, -150349, -276364, -161050, -71827, -128653, -220656, -269736, -230567, -309760, -434523, -295527, -187853, -189080, -109857, -7091, -15656, -41075, -12336, -8803, -39156, -6407, -6986, 67366, 53652, 68123, 125363, 138267, 158586, 30084, -74105, -195389, -129562, -144225, -104861, 12019, 202812, 234974, 188651]
23100A88651j47598J29227J27709l9660J12730j15032j80549n2721j52109l2870
23090a62222J85560n5356m0432J48000r3335j37674J1656J05677K32084J5990
23080B09948k21798K0743q3545j30583K5963N418q2737N7630L5826P2300J21659
23069C0824K532M1183j14931P206O5634k8255J46668j36413j24578l6175O1425
23058h4880J30343q8728j46995J26545K60r2151j32452j85887Q9051J56566q965
23047b37293q0863K68238P0770K1582O4567J20010o4320L162L8080k12770q1919
23036i0756j33626k70101J34447K16336J01532j60752j5538J35327M8704J8397
23026a6030p6228o6114J18123r4204n0697J21690P3426J7604p4053P7124R8696
$$ y = [188651, 41053, 170280, 297989, 258329, 371059, 256027, 75478, 22757, -129352, -162222, 23338, -32018, -72450, 75550, -17785, -155459, -143803, -38126, 193958, 209948, -11850, 8893, -74652, -205235, -179272, -173854, -256591, -198961, -163135, -90835, 30824, 33356, 74539, -40392, -33186, 32448, 4193, 150861, 14448, -110130, -146305, -84880, 45463, -43265, -190260, -63715, -63455, -155606, -288058, -473945, -384894, -228328, -237293, -318156, -49918, 20852, 42434, 107001, 227011, 162691, 165853, 203933, -8837, -90756, -224382, -494483, -360036, -143700, -42168, -202920, -218458, -83131, -34427, -16030, -92258, -158372, -40249, -134453, -185150, -63460, 9966, 27570, -46483, 30641, 129337]
23015A29337j9655p0262J51521j07522m6092o2229j15153k7084J40382Q4414J3578
23004G1235j65356k25933J75459J30080r4070j9696J5617N9197J68445R6973j72561
22993C9390r1517J5688O5351K4955l4263j55991L9736o9732l4518N3727J87021
22982C9847R9554n3249O2012J5732j03607j84269q3855q4957J20648R387R18K20674
22970E8835l7133j6667j4160j54150J26109J40870M8465j39136k07820j7948l6937
22959b49672J03117J17459O432o2373j38280L2686J34539R6840m8811j934K0554
22948A0557k30213M7644J21512K7910L0029J2036J5526M4957j13765j70037q8559
22937b92403M9030m849m8620N5784M9771K0399J16404P4648K2400q2477J1326
$$ y = [129337, 109682, 39420, 190941, 83419, 37327, -24902, -140055, -167139, -26757, 57657, 71235, -94121, -320054, -144595, -14515, -108585, -128281, -112664, -53467, 114978, 211951, 39390, -52127, -36439, 28912, 53867, 19604, -136387, -96651, -166383, -200901, -147174, 39847, 139401, 86152, 148164, 163896, 60289, -123980, -207835, -292792, -172144, -162757, -161839, 58835, 21702, 5035, -9125, -163275, -37166, 103704, 152169, 13033, -194787, -212735, -249672, -146555, -29096, -22664, -85037, -223317, -190631, -56092, 40748, -8063, -9997, 10557, -219656, -172012, -50500, -22590, 7439, 19475, 35001, 79958, -33807, -203844, -292403, -243373, -248222, -296842, -241058, -191287, -170888, -54484, 20164, 42564, -39913, -28587]
22926b8587o2369N6432J35284o4067o6212N9282m2581j5826j52069Q4786J44505
22915D8578j11997l4884r8836j08433K00778J14730J24091o0004j52900O339P357
22904f5181O603n3614Q3095M760o521N9511M2730J09916j73873j07322M765K41891
22892A46760j19598J19993P8736k7208j56220j9180k1855j52718J12812P5149
22882C6671M8532o2079k18853J04518Q9432J3392q6142M9843M7927R0394r2770
22871B0865J370K5735l5830p2228R9862n198M405j07458Q83k9487n4811J01773
22859e0119K1758j56985n0054J6323l3046J39957K3527p1364N0446l0458m3418
22848a83433L000J32355J03209j30248n1792n8040o7230M9790K08531K07594l4492
$$ y = [-28587, -90956, -34524, 100760, 36693, -29519, 29763, -12818, -28644, -180713, -95927, 48578, -63419, -98303, -197139, -305572, -104794, 9936, 134027, 74023, -78877, -72538, -65181, -58578, -112192, -29097, -24337, -30858, 28653, 71383, 181299, 7426, -99896, -95131, 146760, 27162, 147155, 225891, 198683, 42463, 23283, 1428, -151290, -38478, 36671, 85203, 23124, -195729, -91211, -1779, 11613, -74529, -24686, 23241, 113635, 20865, 22235, 47970, 12140, -60088, 39774, 34576, 38981, -68477, -67594, -97081, -151892, -50119, -28361, -185346, -235400, -219077, -252123, -112166, -88639, -160003, -109557, -140015, -183433, -180433, -48078, 55131, -75117, -126909, -184949, -252179, -202389, 6142, 213736, 179244]
22837A79244k5775j2654R4302n2410j86131o2832J51045J08972l4088p8524n0559
22826C0590j60991p466J24980Q2353L7805p1864j2788l9065r1312N8950M3153
22815e655k3980o5236L5434N0932J8663J3153j7797R0064l6971k78803k16681
22804d36877J57772K73842M2910M308j4686Q538J1562j94859q6925j00494N069
22793c29840Q8395P1581K9734J43398k1446j11429O3158p7129q3351q0339R7415
22782b09853O1607j4372o3329J01329m1069q4705K21088J70301l2453k26466P3515
22771d4407J31234k9242j05850j00548k4353K10082N0299k5554j21336j020J21080
22760F0385M4487r5923j06587L8801L9573J11851N897l5003l7682o643J01994
$$ y = [179244, 153469, 140815, 235117, 182707, -3424, -66256, 84789, 193761, 159673, 81149, 30590, -130401, -137867, -12887, 69466, 107271, 35407, 22619, -16446, -107758, -48808, -5655, -29635, -94871, -59437, -8505, 10158, 23311, 5514, 95578, 58607, -220196, -436877, -279105, -5263, 37647, 41955, 27269, 35807, 47369, -147490, -234415, -334909, -329840, -241445, -169864, -140130, 3268, -18178, -129607, -66449, -143578, -226929, -307268, -209853, -148246, -162618, -225947, -124618, -165687, -250392, -29304, 140997, 108544, -117922, -44407, 86827, 57585, -48265, -148813, -173166, 36916, 87215, 61661, -59675, -60695, 60385, 104872, 8949, -97638, -58837, -19264, 92587, 98484, 63481, 25799, 19156, 121150]
22749A21150j11432N6070n3005j6088N0431J70051j14873j40086N5422M9909j56513
22738h8964l9910n42N9856k0008k8976l7579K4618K52269J348p5810j0523j63547
22726a27768Q8259J56519o5989l2630K56279k7329k64336r572J51767R8718N698
22715B29616k3163k07923p7355P0021J81389J26446j49677j84583j32276K24194
22705E6689j5247p7966J20272k4467O702N3880j89344p1977M4752l1357J07038
22694b1025J973P8523n3785M1930R2057M1353m2981P142j11358l2092J137j52248
22682a49374p8741M8760K51740K0193j78024k6599J87895J00713j07695k14278
22672a45410J9820J44224r0377n6516n0729l8943J44420k8879r990j0306r0783
$$ y = [121150, 9718, 65788, 12783, -3305, 47126, 217177, 102304, -37782, 17640, 67549, -88964, -128874, -129416, -69560, -89568, -118544, -156123, -131505, 120764, 122112, 46302, 35779, -127768, -39509, 117010, 51021, 18391, 274670, 247341, -16995, -26567, 125200, 223918, 229616, 206453, -1470, -78825, -8804, 172585, 299031, 149354, -35229, -167505, 56689, 41442, -36524, 83748, 59281, 65983, 119863, -69481, -141458, -96706, -128063, -21025, -19052, 59471, 5686, 47616, 139673, 181026, 138045, 145187, 33829, 1737, 2874, -149374, -228115, -179355, 72385, 92578, -85446, -112045, 75850, 176563, 68868, -145410, -125590, 18634, -71743, -128259, -178988, -217931, -73511, -102390, -112380, -122686, -213469]
22661b13469n4505m8988J18326m8696J53518R2449L9137j28794p9313L600o0334
22650b27069L4837l1010l3221J36489N3347j76081J5409J94935K03147J44842
22640C15625o0064l4323J88162L2402q1720j62923k75387j1398o556N10k01302
22629b96974p264j3357m3149K30180J41392J27476M7377j34239k5998l497n5907
22618c3960L8184Q5442o5453n5911O0390J6704r5827r6160r3217J84585J77061
22607A21838o7372J79669L272j0738J0404q3111j54761j63229M4963m9420R5603
22596g2882M8351Q906J5429l3369J66200J5433O9883J6586K3475o8667j14172
22585G5173J5518r5990J7159p6315o2112J56906R1920K4218r5848n1850J15495
$$ y = [-213469, -267974, -316962, -198636, -247332, -93814, -1365, 37772, -91022, -170335, -166735, -227069, -192232, -223242, -256463, -119974, -66627, -242708, -227299, -32364, 170783, 315625, 255561, 221238, 409400, 441802, 360082, 197159, -78228, -89626, -96182, -95672, -296974, -304238, -317595, -360744, -130564, 10828, 138304, 185681, 51442, 25444, 21947, -33960, 4224, 89666, 24213, -31698, 28692, 45396, -50431, -146591, -239808, -55223, 121838, 54466, 234135, 237407, 226669, 237073, 153962, -799, -164028, -119065, -168485, -72882, -24531, -15625, -196, -33565, 132635, 148068, 217951, 234537, 258012, 189345, 75173, 90691, -5299, 11860, -64455, -126567, 30339, 122259, 146477, 50629, -1221, 114274]
22574A14274J60220m1850M933k1325L5352j70072j78666k8609K4017q1324p7550
22563b60600L2106L8444P7736N3322q4505q3964J67651m7757j6730J8795N0931
22552e4571N1087n3917k9527p9243J55471J05519R9985k24736M0780J93076n2317
22541A51607J3546K4065O0488m2368l7895P602j28342j05993L1902N9734j1489
22530B2857J11132N8690m2159j31220L8477J8590Q609L6693O8121J22553p1417
22519B40926j24573j45502n4424l8142J63926J35410k03828o5178P6857o5043
22509g9571N8348N0213q027K3611R1791R7504n0348L1248m7055L4982M4090j81536
22497F5250q5198J2498j04139k6405n4852n500J10201J519r5845n8550M42J30309
$$ y = [114274, 274494, 232644, 237577, 216252, 251604, 81532, -97134, -125743, -101726, -183050, -260600, -228494, -190050, -112314, -58992, -143497, -227461, -59810, -107567, -124297, -105502, -54571, -3484, -57401, -86928, -166171, -10700, 94819, 194804, -29932, 10848, 203924, 151607, 165153, 189218, 249706, 207338, 169443, 177045, 48703, -57290, -25388, 34346, 22857, 133989, 192679, 150520, 19300, 57777, 76367, 84976, 121669, 189790, 312343, 240926, 116353, -29149, -83573, -121715, 42211, 177621, -26207, -91385, -14528, -79571, -21223, 28990, 20963, 44574, 136365, 233869, 183521, 214769, 167714, 202696, 246786, 65250, -19948, -7450, -111589, -137994, -192846, -198346, -88145, -86626, -182471, -241021, -240579, -110270]
22485a10270J56296k8859j3858M8693k8022j5584p5921r7393l6954l3997O8917
22474a66952L129K04208N5249J7433j8090k20583p8706P310J34896p305j09491
22463a78902J54204Q3105L3738r6267j34449J64974o3369k5160n2697J34349J55983
22452A75509m4718q6791q8611L2763J9297j89007o6918Q1288k7074L0113j6209
22441a80358J85691l2843o0062Q1347Q9827P3228j8872M7823r5132L3661N4799
22430A79109m6787k228j7036J0612r0698n1227r3588j68488O248M8211O8362n738
22418a63248k633m895n6403K5017J29887J0245J03034k11976p9580R4012J24214
22407c2326J63884j64376q0862L2202P216J7113k15933j0525P6145J15938l6240
$$ y = [-110270, 46026, 17167, 3309, 52002, 23980, 8396, -67525, -164918, -201872, -235869, -166952, -163823, 40385, 95634, 113067, 94977, -125606, -204312, -197002, -62106, -69411, -178902, -24698, 58407, 92145, -4122, -138571, 26403, -36966, -62126, -114823, 19526, 175509, 130791, 44000, -44611, -11848, 7449, -181558, -248476, -167188, -194262, -164149, -180358, 5333, -27510, -87572, -6225, 83602, 156830, 137958, 185781, 90649, 124310, 179109, 132322, 130094, 113058, 123670, 32972, -18255, -111843, -280331, -274083, -225872, -157510, -163248, -165881, -170776, -227179, -202162, -72275, -62030, 41004, -170972, -250552, -156540, -32326, 131558, -32818, -113680, -81478, -74262, -57149, -273082, -283607, -207462, -91524, -127764]
22396a27764k4983k0523J43050n1228k7002K27002o289j11119J20659J09545q9051
22385A42297M8783k7092j44819O440M0683j09242j13187k6827K05108R0948j49780
22374c6688q2938J8750J34523J34156J9051n5109j72980j44334N4613P9458l6877
22363h8375j50685K3889J85374J85277k0613q6778J8744o7876L8817n5985J02777
22352H4566n9009n3561o782K0716R6745N9642r9588l02318j37072J53954P5926
22341a66781l6841J14128K4518N1630l6859j1381j15119r4737J63328J82441Q266
22330H2593j64333p0188K1773k1378K67567J10856k25943j17948R6592J37814
22320A17405l8507j47045Q382p7278o2143J7227J72883J44628r0073m279J2306
$$ y = [-127764, -152747, -173270, -30220, -81448, -108450, 118552, 112263, 1144, 121803, 231348, 142297, 191080, 163988, 19169, 25609, 66292, -42950, -156137, -182964, 22144, 113092, -36688, -119626, -100876, 33647, 167803, 186854, 131745, -41235, -185569, -130956, -51498, -88375, -239060, -215171, -29797, 155480, 134867, 48089, 66833, -1043, 37774, -18211, 84566, 25557, -28004, -34786, -14070, 82675, 142317, 42729, -259589, -396661, -242707, -166781, -203622, -89494, -64976, -13346, -50205, -61586, -176705, -271442, -108114, 74327, 82593, -81740, -151928, -130155, -151533, 116034, 226890, 947, -117001, -20409, 117405, 78898, -68147, -59765, -137043, -199186, -181959, -9076, 135552, 45479, 41200, 53506]
22309E3506j46484K6268m8987M8031P627j8204k5469L0415M6254R7797J17236
22298A87990j18558o6437O8111N3358n8661J26330j20007j42550J226l0500j26090
22287b25788K1776O1537J11022P73J07413N9281k60645j45317J98058Q4126l8798
22276b6562L7523J39232p515j9941O5243k03247j40165j0929J70835J27989q0309
22265E2154K4457K3389p6435R556j0703L9425k1159N323j04444o8702N7396O4760
22253d983j4200r3016L2955m9496L3833J29291J13516L6367j89928q0675k0803
22242a07139L2392J10801j23799k09654J09832P8644J77602P0983j95133r7037
22232a52508K07219M6776l1807o9529N2581j07506j27462k8508K72787K42783
$$ y = [53506, -92978, -66710, -115697, -67666, -60039, -78243, -103712, -73297, -27043, 70754, 187990, 69432, 2995, 71106, 124464, 65803, 192133, 72126, -70424, -69198, -99698, -225788, -204012, -142475, -31453, -30680, 76733, 136014, -124631, -269948, -71890, 12236, -26562, 10961, 150193, 142678, 122737, 187980, -15267, -155432, -166361, 4474, 132463, 52154, 76611, 100000, 23565, 33121, 22418, 61843, 40684, 46007, -58437, -127139, -69743, -4983, -19183, -112199, -79244, -128740, -94907, 34384, 147900, 184267, -5661, -86336, -107139, -74747, 36054, -87745, -297399, -187567, -108923, 68679, 139662, -55471, -152508, 54711, 101487, 69680, 151, 52732, -54774, -182236, -210744, 62043, 304826]
22222C04826n5354q5345o6501n3291R7383N416o3733m7563j7186P386o7921K3022
22210a8861l9192Q0593L3291Q9808j78001j71042J13635L889K1000n9866j18974
22199b43720P8310N4766J57526Q5914k65291j01528R0696K6384K06404l9009j85430
22188a34978p9466m105K7786J08098O6907n1328N2651J3322J26806j7560q30K09929
22176C17232r2832k01255J0747k4688P3561O6541p4700r8252j17886R0298m8592
22165i9826r2225j2617n3162J23056K8532l5882j0581N6392j2689j4115J5984
22154a07133J67364j9544O4163J7929P2809j45419k03261K0888J07551j52875
22144a77528p7953M6845R2153K0774Q9888J74162j71643k86527R0153l2480L0149
$$ y = [304826, 249472, 164127, 97626, 44335, 141718, 147134, 83401, 35838, 18652, 26038, -41883, -18861, -58053, 22540, 55831, 145639, -32362, -203404, -89769, -85880, -64880, -124746, -243720, -165410, -110644, 46882, 132796, -132495, -234023, -143327, -116943, 89461, 50452, -134978, -214444, -218549, -190763, -82665, -15758, -67086, -14435, -1113, 125693, 108133, 107303, 317232, 224400, 23145, 33892, 9204, 82765, 149306, 74606, -23646, -141532, -51234, -99826, -192051, -204668, -257830, -134774, -106242, -142124, -152705, -96313, -109002, -123117, -107133, 60231, 40687, 104850, 122779, 195588, 50169, -153092, -132204, -24653, -177528, -255481, -208636, -116483, -95709, -5821, 168341, -3302, -289829, -199676, -232156, -202007]
22133b02007J13163K4796L9601L067J11801J51900M0722q8017q6379K3178K24718
22122C56543J5629k39738j17213J8033N7513m1351M6365n1947j5030M2432j42457
22111g1221k20770o3165P6598J92297Q1781J44161j01219r6908j8626Q3176n9718
22100e3614J72228q3349K8753P9752r8616j06980j53048l9891J13537P2822m6555
22089a14961J8064l2540p6994N0172J46024J21907K17761k2688j31396k4772j5020
22078A35557j8436O7949k05887j93876q6106L33161Q4188j50847J05902K09540
22068B81145K05545k14089j25496j04036J20705J21425j00017j93308j56682n4788
22058b19596n0242P2111l7950J07952M00716Q5375j01044q8882k02446r9336J07660
$$ y = [-202007, -88844, -64048, -24447, -21380, 90421, 242321, 283043, 195026, 108647, 131825, 356543, 372172, 132434, 15221, 33254, 90767, 49416, 95781, 43834, 28804, 71236, -71221, -291991, -355156, -278558, -86261, -4480, 139681, 38462, -58446, -77072, 6104, -53614, 118614, 35265, 64018, 143770, 45154, -61826, -214874, -254765, -141228, -68406, -114961, -96897, -129437, -206431, -156259, -10235, 111672, 329433, 306745, 175349, 150577, 135557, 117121, 185070, -20817, -214693, -300799, 32362, 116550, -34297, 71605, 281145, 486690, 272601, 147105, 43069, 163774, 285199, 185182, -8126, -164808, -219596, -269838, -197727, -235677, -127725, 272991, 358366, 257322, 168440, -34006, -133342, -25682]
22047b5682J67324q1307j7970q2609K2208N5777O8535j2608j38377N1402l1912
22036b5219r1818o6391m5733J55093J9483k995R9367P4787Q3926R2172o4747o7087
22024A60838n1483P0418l4324j35478k0399J35274j0498l7195k08713l0189J47235
22013a4514N3186j58933j61169J44008J96044R7418j01091q0502k72332N8217
22003b39668L37139J2667M4521N7218m8449q3132K5224j04062M0664o4702P2969
21992E0389N9447m9752j68692k0702Q8248N6172N1231m0250J23129l9778n9598
21981D9844j21319o2877J1214J70057J19710m790J569o2003l4823q408k8995r317
21969A9862q8843R7323l4312J25949R7595r2597r2484R320M476J07112l9970J89771
$$ y = [-25682, 141642, 60335, 42365, -40244, -18036, 37741, 106276, 93668, -44709, 6693, -25219, -117037, -183428, -229161, -74068, -54585, -57580, 41787, 116574, 200500, 292672, 227925, 160838, 109355, 179773, 145449, 9971, -10428, 124846, 114348, 77153, -131560, -161749, -14514, 38672, -120261, -281430, -137422, 58622, 156040, 54949, -25553, -297885, -239668, 97471, 110138, 154659, 211877, 163428, 80296, 105520, 1458, 42122, -22580, 50389, 109836, 60084, -108608, -129310, -41062, 15110, 66341, 26091, 149220, 109442, 49844, -71475, -134352, -123138, 46919, 166629, 161839, 163408, 101405, 66582, 58174, 29179, 19862, -68981, 28342, -5970, 119979, 217574, 124977, 32493, 41813, 46289, 153401, 113431, 303202]
21957C03202J8009J7164k06702j06202K3475m4253R3052p6055O4961R6307q6648
21946I6310p7210j55935K3908K4208O8629O0608N96N9075J81675p5533j32121
21935G4210L0595j02448j39484L0565J82145j63818j03741K658K29352K6195p819
21924E8410o1497J1213N5524l6061R3164m7419N8879J63863j42477k70793q348
21913a25542J25019J31919O8322K9325q845J17688j28381p9940j33383j7661J0370
21902a1109q1983Q4489O9471j03868L7231J94141K8158J86491Q3791m3044L1398
21891D75166j30397k89472j20131M3993J36228N3317r7538j35832k3457J40193
21881E2070J0454P6086N7236n5971J7237j04760j17280R3573o7077N7674R5894
$$ y = [303202, 321211, 338375, 131673, 25471, 48946, 4693, 97745, 21690, 86651, 182958, 96310, 19100, -136835, -112927, -88719, -20090, 40518, 41114, 100189, 281864, 206331, 74210, 104805, 2357, -137127, -106562, 75583, -88235, -191976, -189318, 40034, 66229, 58410, -3087, 8126, 63650, 27589, 120753, 73334, 132213, 296076, 153599, -117194, -125542, -523, 131396, 199718, 229043, 220198, 337886, 209505, 129565, -3818, -21479, -11109, -93092, -8603, 60868, -43000, -5769, 188372, 216530, 403021, 486812, 443768, 475166, 344769, 55297, -64834, -20841, 115387, 168704, 71166, -64666, -88123, 52070, 62524, 138610, 195846, 139875, 157112, 52352, -64928, 28645, -38432, 19242, 115136]
21870A15136j30989L710Q1682q4070o2833Q1092M0730m5155q1520o5015p0464
21859b17696L9537J11371J7652k9432J56021l1145k05271J38127J6555L7567J08695
21848A41981p8554o3030Q1358N7813j69894j12670j9327J61677o4691n7371n8795
21837a81503O5915J2186J10552K417j19177J41060Q6245Q2018j3863q129j98656
21826b0935n6555n819L0790J35215p9277p2186M6273Q7348p4318K0261n8309K7418
21814b0094r8382k7894N4007p2094L0756P8024Q683r0000j18362Q4047L7554N4115
21802g9640p8654R6348K05918o2690j13333j33058q2418N4241J53673K1358N5420
21791C7165P7641P5466j03163j32529k9612J02221P5670l23534j40346O4980n4914
$$ y = [115136, -15853, -12143, 69539, -14531, -77364, 3728, 44458, -697, -82217, -147232, -217696, -178159, -66788, -49136, -78568, 77453, 46308, -158963, -20836, -4281, 33286, 141981, 63427, 397, 81755, 139568, -30326, -142996, -162323, -646, -65337, -122708, -181503, -115588, -103402, 7150, 9567, -109610, 31450, 117695, 199713, 185850, 177721, -20935, -77490, -83309, -52519, 82696, 3419, -68767, -22494, 64854, -9464, 10797, -47512, -20094, -118476, -146370, -92363, -164457, -133701, -55677, -46994, -136994, -255356, -171309, -133755, -79640, -158294, -61946, 143972, 81282, -32051, -165109, -247527, -193286, -39613, -18255, 37165, 114806, 190272, 87109, -45420, -75032, 27189, 102859, -220675, -361021, -296041, -350955]
21780c50955Q7388J66040J28093M6590M1744n3344N6308L9630K7648Q3654j27666
21769A45130j64465j03261r3972n9577k4820M0538n6472J20131M2934J14183j8532
21758e8183R727N5666k29155j52745N4433O6203J34162K2884q2120n5687p8707
21747c13522L8418M1313j32M1310O6230J79317l3146k0833M2709M4270n9344k3645
21735B945P0700n6570K7736n4303j2753P7527j17548j51211j16427n8305n6780
21724d44989r102J92327J31498Q8795j2705j8811J34112j772j16030l2125l515
21713i2317P4476K0103o0811O4464n7538J16817m7105K6020L7396j956R5559j97927
21701b2819j51276j5494J47162J18796L0135l6205N238J1594o88j13832p9061
$$ y = [-350955, -263567, -97527, 30566, 77156, 118900, 65556, 121864, 161494, 189142, 272796, 145130, -19335, -122596, -216568, -276145, -300965, -260427, -316899, -196768, -153834, -39651, -58183, -48456, 7210, -221945, -374690, -320257, -254054, -119892, -97008, -179128, -234815, -313522, -275104, -233791, -233923, -192613, -126383, 52934, 19788, -1045, 41664, 85934, 26590, 2945, 73645, 17075, 44811, -9492, -22245, 55282, -62266, -213477, -329904, -388209, -444989, -454091, -261764, -130266, -41471, -54176, -72987, 61125, 59353, -56677, -88802, -92317, -17841, 2262, -58549, 5915, -51623, 65194, 18089, 44109, 81505, 79549, 175108, -22819, -174095, -189589, -42427, 76369, 106504, 70299, 75537, 87131, 86443, -27389, -106450]
21690a06450J04839j5162j0415N1475j51046j2800K38292J95356J8238k06720
21680A05607j40061j9176k9018l6577J50287K12741m5408j99046J50044M4072
21670A93465M45k7202o0936n039m1072N3275l4283Q9619m1125k7469P7765K5553
21658B02996j64838p6121J13892J00733k0865j99468j14925N2352M6431K2456
21648c7357P0362j1230l9311j58266P44K7229J6118J00960L9100J31325M7542
21637A87216k6295k40421r8755J30514N1400r1816k3622J12144J4289K8765J73895
21626B17314Q3306l6510r2622O549q992O1765o5559N7074J16864L7453k9922j45329
21614B01391j41919p2026j09216j1454P911m464Q567M3132Q784J15014Q042j71841
$$ y = [-106450, -1611, -16773, -27188, 24287, -126759, -139559, 98733, 294089, 312327, 105607, -34454, -53630, -82648, -119225, 31062, 243803, 198395, -651, 149393, 193465, 193910, 166708, 105772, 100733, 59661, 112936, 78653, 168272, 127147, 99678, 177443, 202996, 38158, -37963, 75929, 176662, 155797, -43671, -158596, -106244, -59813, -37357, 33005, 21775, -17536, -175802, -175058, -147829, -131711, -30751, 8349, 139674, 187216, 160921, -79500, -178255, -47741, 3659, -88157, -111779, 365, 14654, 43419, 217314, 300620, 264110, 171488, 178037, 169045, 230810, 165251, 222325, 339189, 376642, 346720, 201391, 59472, -12554, -121770, -133224, -125313, -129777, -121210, -78078, -69294, 45720, 53762, -118079]
21602a18079j58274K13653O612l4147j57728k7150R628j24732J67264J36311M0516
21591d6126j15370R995P1756N0386m6944p3509L6289Q2089p838j24966r9923K89604
21579B5443P8813j27225r9459r1181Q9661j7956L3182Q4581R3540j70552J8398
21568h2755j53815o3300J86976n9086N0516J17084J07661q5049J3910j28934J7766
21557g9026J16040j55912M1700P0149M9059n1857j21462P9193L5051Q8702J61036
21546B32673j0031k56116q6380M5288K4855P4756J04308Q2207J71295O5539K4074
21535D72468m5151p8398k23043k40853k20078P0504J46789J19597l6121M8406
21525A4120p097o3785O4802j53877j13882n497J18229l8634K2936O7766O5039
$$ y = [-118079, -276353, -62700, -56088, -90235, -247963, -275113, -265485, -390217, -222953, -86642, -46126, -161496, -151501, -79745, -29359, -76303, -149812, -113523, -31434, -39272, -164238, -264161, 25443, 104256, -22969, -122428, -213609, -123948, -141904, -108722, -24141, 69399, -101153, -82755, -236570, -299870, -112894, -171980, -121464, -4380, 103281, 18232, 32142, -96792, -79026, 37014, -118898, -77198, -7049, 42010, -9847, -131309, -52116, -17065, 71637, 232673, 222642, -33474, -119854, -74566, -49711, 25045, 129353, 211560, 382855, 448394, 472468, 427317, 348919, 125876, -114977, -335055, -264551, -117762, 1835, -34286, 14120, 7023, -56762, 8040, -145837, -259719, -265216, -146987, -185621, -162685, -94919, -29880]
21514b9880J51834o718j16109j88241m6871p6750J16218P5880k4951J7177L7089
21503i1322J7868K0093m5868M7365P1451k8822K9527p9834j1586J04478O9254
21492A02604l6728r6744j48255N0965r2293m2003J48409J15929l8748j35796J673
21481a70987J30512j7122r0123P3856P796j12393Q0056J74463k6961q5974Q1195
21470D4318N2682j2048R2774n7262o1233N469j02403j71965J86795J79339O1216
21459B17682k49106j9418J83176P3970j30787k20233P5311o1439M3672J47425
21449F0253j15275m3608J85692J13643N6322q011o8940q0702O0967N0295M065
21438B14701O139o9685r6675q2423p4029r0354J58909N3301r4235J86937K25165
$$ y = [-29880, 121954, 115236, -873, -189114, -235985, -312735, -196517, -120637, -145588, -128411, -91322, -73454, -53361, -99229, -51864, 19587, -9235, 20292, -59542, -71128, 33350, 102604, 65876, -30868, -179123, -128158, -220451, -262454, -114045, 1884, -36864, -172660, -170987, -40475, -57597, -147720, -73864, -66068, -178461, -98405, 76058, 49097, -36877, 44318, 97000, 84952, 177726, 120464, 59231, 64700, -37703, -209668, -22873, 156466, 217682, -31424, -50842, 132334, 206304, 75517, -144716, -69405, -130844, -87172, 60253, -55022, -98630, 87062, 200705, 257027, 249016, 180076, 99374, 160341, 210636, 214701, 220840, 151155, 54480, -27943, -101972, -192326, -33417, 19884, -74351, 112586, 337751]
21427C37751k29651k23134k2288R6652j25770J09041J34405j32057k43328Q3409
21417b14970J54954j24519N7573R5221L4978n4592L2688M2498N4119k29505J42124
21406i431O7383j79775o1610k1764L9916J12888K5507O9019q9996M170L2478m8597
21394e9812j54582r2516Q4271J11092J59510m2485q4411j57719q0859j23659P8151
21383c63019J46601J05688L4858J50446J12762j26433q3641Q34l1381L1019M2297
21372B0031j59613N0563K1202l3542K9463o5148J42598Q0552J35938M2387q385
21361B56046n7393l2225r8718m9166l9353l782q7497o2577M2747M2531K00J21980
21349C2793r6272J6902J37915O5835j57976q3596J8591m05j10959J04894J24448
$$ y = [337751, 108100, -115034, -137322, -40670, -166440, -57399, 77006, -55051, -298379, -214970, -60016, -184535, -126962, -31741, 3237, -51355, -18667, 23831, 77950, -151555, -9431, 57952, -121823, -183433, -205197, -165281, -52393, -26886, 42133, -47863, -43693, -11215, -59812, -214394, -306910, -222639, -111547, 47963, 5478, -78933, -236652, -317511, -441170, -363019, -216418, -110730, -75872, 74574, 187336, 60903, -22738, -21904, -53285, -22266, 20031, -139582, -89019, -67817, -101359, -71896, -137044, 5554, 86106, 222044, 264431, 256046, 198653, 166428, 67710, 18544, -20809, -24591, -112088, -174665, -131918, -89387, -89187, 32793, -63479, -46577, 91338, 157173, -803, -84399, -65808, -66213, -177172, -72278, 52170]
21338E2170n8649q1636p7444J65692J73582l6149Q7336j49315k30800j40954O4052
21327b32115J06864K0199K5616j8464L1968J38569p1175o5100L7199J04003j6205
21316F1359n7308n2727M4670k5993N907m0453j1738j22194O0882P3730j4939O4040
21304a4764n4335j384J33663J64724J00139N2037k07793q6574K0370j7827m7676
21293D0580m7458n6558r9529O8738r6773k9688J14187J61981M0843N3862p9231
21282G0954m3881m3639q2394J66484j9451j73203J1439J12111j6633l3050j34170
21271a85433m2212J7416l16l6090K3842j11443j4232J87107L7292O366L9166N6613
21259b1924j94012M4944K0708k190L376n6044J86320J20900l1761L5126r5003
$$ y = [52170, -6479, -88115, -165559, 133, 173715, 137566, 224902, 75587, -155213, -296167, -232115, -125251, -105052, -79436, -97900, -65932, 72637, 1462, -63638, -26439, 77564, 61359, 4051, -48676, -4006, -29999, -24092, -64545, -76283, -198477, -137595, -63865, -78804, -14764, -69099, -70483, 63180, 227904, 328043, 380080, 172287, 85713, 106083, 88256, 40580, -6878, -63436, -162965, -94227, -191000, -220688, -106501, 55480, 96323, 150185, 70954, 27073, -16566, -98960, 67524, 48073, -125130, -113691, -1580, -18213, -51263, -185433, -227645, -210229, -210545, -246635, -222793, -334236, -348468, -161361, -124069, -117703, -78537, -21924, -215936, -170992, -150284, -152474, -149098, -205142, -18822, 102078, 70317, 105443, 10440]
21248A0440r1083j5847J12806j17746L6523k8137J73352j5165k8707K2293L6804
21237I5533q620j42093L4385l1356l0597m6577o9967M1580m0095P5872J96093
21226G4158R5501j7544q3339p9565l2353J62371R1498o960j94819o401j2716m3309
21214e3478j29055Q095N6045J41379K7784j14796J0866K24572O3267n2840O6893
21203B48732M8714k61356r7793j02357L8027Q2442j4471L9447K0011K852n944
21192a696n4698K682l6834j16159q6703o2266P4886P558J22300J58792l2474p7117
21180a01729N9283J48554j52041k78172J79238J65359k12756n2813J32828O3556
21170d8693j30734J82290P7487j39606j23773n0657O7831J6828J7995j2495n459
$$ y = [10440, -80643, -96490, 16316, -101430, -64907, -93044, 80308, 65143, 36436, 58729, 95533, 86913, -55180, -20795, -52151, -82748, -129325, -199292, -157712, -197807, -121935, 74158, 169659, 152115, 68776, -10789, -43142, 119229, 210727, 203767, 8948, 2547, -10169, -53478, -182533, -174438, -118393, 22986, 50770, -64026, -53160, 171412, 234679, 181839, 248732, 297446, 36090, -61703, -164060, -126033, -43591, -58062, -18615, 1396, 4248, -1696, -56394, -53712, -90546, -206705, -293408, -355674, -280788, -273230, -150930, 7862, -24612, -101729, -42446, 106108, -45933, -324105, -144867, 20492, -192264, -245077, -112249, -48693, -179427, 2863, 80350, -59256, -183029, -233686, -165855, -149027, -131032, -143527, -148986]
21159a48986P3035K2814j08419O3441L4796n3691r3055L204O8845m1383R9996
21148g9403K22646P4830j11119k60632j29641j1166J20952k8960P5623M9249J6073
21137f1548j4495R0565O276j22571n8559J30221K5425Q4442N4344j48599n7790
21126g2289N8864J67010J44251J6909j02033r2231q8917J03159L5989J05563J7442
21115B93717k88872j60484l1015j15104K08887Q3719j85899j06781o6332Q1561
21105b86603M4594M9581j23630L6422n7963r7743N4299J6741J15976L12973J73592
21094B38239j40093j9570j79476L7413n4965j59171q9397J66767J15668J96836
21084A12251j10106k3363p9511L5817J7784j5750j28979K3702l1600j22997j41544
$$ y = [-148986, -75951, -53137, -161556, -98115, -63319, -117010, -210065, -206861, -138016, -179399, -79403, 143243, 218073, 106954, -153678, -283319, -294485, -173533, -202493, -126870, -77621, -61548, -76043, 14522, 20798, -101773, -160332, -30111, -4686, 79756, 134100, -14499, -72289, -13425, 153585, 297836, 314745, 212712, 120481, 31564, 134723, 170712, 276275, 293717, 4845, -155639, -186654, -301758, -92871, -9152, -195051, -301832, -368164, -286603, -242009, -192428, -316058, -279636, -337599, -435342, -381043, -364302, -248326, 64647, 238239, 98146, 78576, -100900, -63487, -118452, -277623, -367020, -200253, -84585, 112251, 2145, -21218, -100729, -64912, -47128, -62878, -191857, -168155, -199755, -322752, -464296]
21073d64296K7114N7329J65740k0987j8226J19446K4358K02791p8800p6003K337
21062e9197J09123L496j3033r5367j70339L1175J72806J37070j69718j93097k065
21051b49146N128J87775J39376J319o8320j76144j28471j83953K22451J42954
21041a07031M1531p2292K1442o1191j32104J0573J33981k1386Q1164L8563n0190
21030a16940o4623n109R6278K6099P6957j6621o6480p5086K0619J24653J34858
21019A34605j19944r1658k9384j83179l8600K9335J21204R6046K79854k3293k03730
21008b8744j47616q6129O8625Q8420m0797n2354R3736N0794M2983J08952j3287
20997H4583Q2361O714q1357j24299j26950J39785R0591j11085r0022N3276l1025
$$ y = [-464296, -437182, -379853, -214113, -235100, -253326, -133880, -109522, 93269, 14469, -61534, -59197, 49926, 53422, 40389, -54978, -225317, -194142, -21336, 115734, -53984, -247081, -249146, -244018, -56243, 83133, 84452, 16132, -160012, -288483, -472436, -249985, -107031, -65500, -137792, -116350, -177541, -309645, -299072, -165091, -186477, -105313, -66750, -116940, -181563, -186672, -90394, -64295, 12662, -3959, -70439, -145525, -124906, -253, 134605, 14661, -76997, -106381, -289560, -328160, -298825, -177621, -81575, 198279, 174986, -28744, -176360, -262489, -193864, -105444, -146241, -198595, -104859, -54065, -11082, 97870, 84583, 166944, 173658, 92301, -31998, -158948, -19163, 71428, -39657, -129679, -76403, -107428]
20986a07428p785M4586J17832J84707O9882o5798k29019r6414k752J91829O6850
20975A66490j44097j44455l0981J03220O6956K31122Q6345k46463j94890K1161
20965h5592n076J16942J28910O0049o3018j49981J61395j42943k07187R3133J26405
20954C3037l0825r2077j084p165j2919P2191l9473K1894J76956R3783j8751j09397
20942H6170j10694r2326L0491m7750j4863J55755m3957N5108M108j40665N6024
20931f2599L8317J28787K8650j27226j10090R801K43750j8584j89538j57461J52652
20920f3541K59320j3627k40934m2120K48305j05170k5992j6640k30779j26166
20910c57344N8165J68490l5681p5116J9230P6720R1871l6211K5522J99254p5314
$$ y = [-107428, -115213, -70627, 47205, 231912, 301794, 235996, 6977, -89437, -92189, 99640, 166490, 22393, -122062, -153043, -49823, 17133, 248255, 334600, 88137, -106753, -85592, -90668, 26274, 155184, 215233, 152215, 2234, 163629, 20686, -186501, -93368, 33037, 2212, -89865, -90949, -98114, -111033, -38842, -78315, -56421, 120535, 214318, 195567, 86170, -24524, -116850, -86359, -134109, -148972, 6783, -37174, 17934, 22042, -118623, -62599, -24282, 104505, 133155, 5929, -104161, -94360, 149390, 130806, -58732, -216193, -63541, 195779, 182152, -58782, -100902, 147403, 42233, 16241, -399, -231178, -357344, -299179, -130689, -166370, -241486, -222256, -145536, -53665, -89876, -64354, 134900, 59586]
20899E9586r5851J599M9763L6711K1545k05538r4001j94362O5534L7418J28742
20888a88854J12498L14l0182N1097Q3653o381M7492M1232j11877j85801j07587
20877b94396J24160L0369J6055K4798N0953k166K9436L9572p598j2834n0623P0536
20865A8262j1326j3014j0044j16041K4222l8808J10387N1048j39195j09937L4104
20854b00342J02805J4034o4447o5599p8632m2432J06035K16289k0336J25397j71195
20843g8423n1413J02165l5578J9946M5358m3423M1288k33461N4866J85814O2232
20832F9371N3487P0163j85518l6881j5267l005J73214K6285m9473L8184o2586
20821G7974j10454p9636J93169n7654j35823q8827J49291M0740j05987j37283
$$ y = [59586, -36265, -34666, 15097, 51808, 73353, -132185, -226186, -420548, -355014, -317596, -188854, -76356, -76042, -106224, -55127, 28526, 22145, 69637, 110869, -1008, -186809, -294396, -170236, -139867, -123812, -99014, -48061, -50227, -20791, 18781, 11183, -1651, -52274, 18262, 6936, -6078, -16122, -132163, -107941, -146749, -36362, 14686, -124509, -234446, -200342, -97537, -83503, -147950, -213549, -292181, -334613, -228578, -12289, -32625, 92772, -78423, -129836, -27671, -63249, -43303, 2055, -41368, -80, -233541, -178675, 7139, 69371, 122858, 193021, 7503, -29378, -44645, -47650, 125564, 151849, 102376, 140560, 77974, -32480, -112116, 81053, 23399, -112424, -201251, -51960, -11220, -117207, -254490]
20811b54490J28510k7971k9883m9090L6346J36163Q4878j94816p5740M1592o587
20800b11088p2105j12597q3222J36779K14017K5665J7556J06843J09998r6837
20790C5009j32102r204j06258j27882J20367L4225p1476J44347K01208n5077j38914
20779a05757j4334j79589o5262N8522r9531J65158J93690O2646q6868n6187L3107
20768i4405J71047n0586j81288J4884Q0105J53970J59054l5228j55318j30029
20758f7794j8918J09586j54295p0506O8703L6818n5840p2218N7127j08486J8884
20747b56939L8235L4563r0107J08554J77474m2172j35546q2721N7486k7620o6294
20736b85087j5878J13366J51564M5987j07279j662q1262N5678k9297Q3134q392
$$ y = [-254490, -125980, -153951, -183834, -232924, -196578, -60415, 24463, -170353, -246093, -204501, -211088, -283193, -395790, -479012, -342233, -128216, -102551, -84995, 21848, 131846, 35009, -97093, -106297, -212555, -340437, -220070, -185845, -257321, -112974, 88234, 33157, -105757, -120091, -299680, -364942, -306420, -405951, -240793, -47103, 15543, -71325, -127512, -94405, 76642, 26056, -155232, -140348, -60243, 93727, 252781, 217553, 62235, -67794, -86712, 22874, -131421, -201927, -133224, -96406, -152246, -224464, -167337, -275823, -256939, -218704, -184141, -274248, -165694, 11780, -30392, -165938, -248659, -191173, -218793, -285087, -300965, -187599, -36035, 9952, -97327, -98989, -180251, -124573, -153870, -70736, -79128]
20725g9128J04311k0448l0395J09540o0876j54028k20035O2854n4416P3224K37677
20714c1720J28690Q5226r3229N6403J45027K0641j19996O2703M3302j67377j95507
20703f5837j36330R7765J23509j01632O9010P3810l6748p7832j09923j0316J54766
20692a9758M7841j53295q0826N8278k1935K6825L5419M3969L6264l4787m5145
20681a07150j7168m2109n5972o2788O6372m0807p5368O9261J75163J57215J03707
20670A70356n18j51808j76138p8688N3427M8461m0145J27692Q8680M0244j18331
20659c6768o1851P94Q0601n4127O5889O6777K2684m4936j98990q1472N5961m7051
20647b32489n7756k7150P9371k888n7303R200l2415J16881O539j27870j02078
$$ y = [-79128, 25183, 4735, -25660, 83880, 23004, -131024, -351059, -288205, -342621, -269397, -31720, 96970, 182196, 88967, 145370, 290397, 311038, 191042, 253745, 297047, 129670, -65837, -202167, -104402, 19107, -82525, -13515, 60295, 23547, -54285, -164208, -174524, -19758, 28083, -125212, -206038, -147760, -169695, -142870, -107451, -63482, -27218, -62005, -107150, -124318, -166427, -222399, -285187, -218815, -259622, -334990, -265729, -90566, 66649, 170356, 169838, 18030, -158108, -236796, -183369, -134908, -175053, -47361, 41319, 81563, -36768, -98619, -97825, -17224, -71351, -5462, 61315, 83999, 39063, -159927, -241399, -185438, -232489, -290245, -317395, -238024, -240912, -298215, -289015, -321430, -204549, -198010, -325880, -427958]
20636d27958O1241K19727J28688K2057j06659K00822k178k43123M7029K21257
20626A20903p2311O028j27016k6992R3430O487K3899j69488O2742R9104p6961
20615f0175p7663J25580R6955n407k55182m2408R1404J779r5682J21019k6298
20604a26078J5375J27652K4902j83773r8732K08599J22141J16725M0543j76911
20594G0443j75109M1285J08205j0493k59082k8551J44667p129q951j05022j13897
20583c43634M0870K37094L7210M1322l9412j11863M0145N2535k07569m7756P3771
20572b27287L4798M3882M2176P0678J03093R7548L682k8890l0394j65621k400
20561e8735r6762n4537n8965L9616l0087K10935R6079j04945m5530Q6431P527
$$ y = [-427958, -366717, -146990, -18302, 3755, -102904, 97918, 95740, -147383, -100354, 120903, 48592, 54620, -72396, -99388, -5958, 529, 24428, -145060, -82318, 16786, -60175, -137838, -12258, 84697, 79290, -175892, -218300, -126896, -125117, -220799, -99780, -126078, -110703, 16949, 41851, -141922, -240654, -32055, 90086, 206811, 247354, 70443, -104666, -63381, 44824, 34331, -224751, -253302, -108635, -115764, -124715, -229737, -343634, -302764, -65670, -28460, 12862, -26550, -138413, -98268, -45733, -253302, -301058, -227287, -192489, -148607, -106431, -35753, 67340, 164888, 168570, 139680, 109286, -56335, -58735, -155497, -210034, -268999, -229383, -259470, -48535, 47544, -57401, -102931, -16500, -8973]
20550h973K7674N9343q4049m9501l952q0025P6919J56180q5961j24753J29826
20539A2728j70579r7323m1751Q7426Q2424m2041K678J93174K31409j40773j33677
20528a6305R7523m6035m0952J71153P3860n4874q4389q2399M2471l2050L6655
20517F4658J11234q8558J1154K05233j2578J627j53918k28252r6986J14509K16458
20506A44581P9842j45763J1965k2934j55504m135n0545L7464J3634P5216o4869
20495h1048m6774J40629K14599J65234p6648j99852j46764p7497Q0004k4682k00332
20484b53131j8948m285k6542l4299O3979J05719N9496Q8459Q0891O556N9079r8115
20472B8859j52788J68707P2531j51371m8829r9484O5897j7190K12091J24769Q2189
$$ y = [-8973, 18701, 78044, -6005, -55506, -59458, -139483, -62564, 93616, 7655, -117098, 12728, -157851, -255174, -296925, -209499, -127075, -169116, -166438, 26736, 258145, 117372, -16305, 81218, 35183, -5769, 165384, 239244, 184370, 99981, 17582, 60053, 28003, 64658, 175892, 87334, 98488, 303721, 291143, 292770, 138852, -89400, -186386, -71877, 144581, 224423, 78660, 90625, 67691, -87813, -91948, -142493, -105029, -91395, -16179, -81048, -127822, 12807, 227406, 392640, 315992, 116140, -30624, -108121, -28117, -52799, -253131, -272079, -276364, -302906, -337205, -273226, -167507, -108011, -19552, 61339, 67895, 126974, 28859, -123929, 44778, 117309, -34062, -82891, -182375, -116478, -133668, 78423, 203192, 285381]
20461B85381k02212j89160j60362N7768M6172J57028J53482o6970j02598M6146
20451B4675J03478j50189N7932Q9547O5565o4628n3267j63281J13458J72380o0723
20440A34947k32544k11336N1457O2013K1393J33222R4752M3552j37320l1979J6061
20429e5782J19154m0768M6045L2532j59111j25031k9183o3576J723J0325K7428
20418b36244O7255J74073N3194Q0103j08850j66849j08896Q6266L9935n2231J8314
20407a53930J46548Q5865q1578j65593q3300Q8466L7616O6995n9863m6701q7912
20396b53387J31186J40987j2450l6797j43j53010L3893J05597P9881L0609O1465
20385A27831r7069N9664p2851j15718R2112J84738J117k44228j86544J40191R7932
$$ y = [285381, 83169, -105991, -266353, -208585, -162413, -5385, 148097, 81127, -21471, 24675, 128153, -22036, 35896, 125443, 191008, 126380, 73113, -90168, 23290, 195670, 134947, -97597, -308933, -257476, -195463, -174070, -40848, 53904, 97456, -39864, -71843, -55782, 63372, 22604, 68649, 101181, -57930, -182961, -212144, -275720, -273997, -263672, -236244, -168989, 5084, 58278, 138381, 29531, -137318, -246214, -159948, -120013, -172244, -153930, -7382, 78483, -3095, -168688, -251988, -163522, -125906, -58911, -118774, -165475, -253387, -122201, 18786, 6336, -30461, -30604, -183614, -149721, -44124, 35757, 66366, 127831, 30762, 90426, 17575, -98143, -6031, 178707, 179824, -64404, -250948, -110757, -12825]
20374a2825J9448J03365J8394n8716O1033R8730k147k6590r6414j276m7752l7565
20362A7685j26755Q8779J06862n9232j004P2500L5053N1726k55112o4037J87605
20351E4070J80042O9726J5013L1530R040j89346J972r9503q1557J11169m4216
20340E7940o1979m6444J40674q355j67992N8402M9507j6375k5731j52499j52023
20329c24875R7922L3130J51759M1783n9691J6615J60480J5518Q8128j480l7958
20318A81331j22336q7992L7977l796j46055J10818J52457J49871P7563k0988j63591
20307A65259m3782Q4743o6287m285J47280L8745o1299j00206m1445j68482q9050
20296a38809M5099J8036m1186p4004J5664J06742K65075J01939m9108o2466K4978
$$ y = [-12825, 6623, 109988, 128382, 69666, 130699, 229429, 227282, 200692, 104278, 103002, 55250, 17685, -109070, -20291, 86571, 27339, 26335, 98835, 133888, 185614, -69498, -133535, 54070, 234112, 303838, 318851, 350381, 359421, 170075, 172047, 72544, -9013, 102156, 57940, -4039, -50483, 90191, 81836, -86156, -27754, 21753, 5378, -20353, -172852, -324875, -226953, -193823, -42064, -281, -59972, -43357, 117123, 132641, 220769, 219289, 181331, 58995, -28997, 8980, 5184, -140871, -30053, 122404, 272275, 349838, 328850, 165259, 121477, 206220, 139933, 135648, 282928, 321673, 260374, 160168, 118723, -49759, -138809, -93710, -75674, -116860, -190864, -175200, -68458, 196617, 298556, 249448, 186982, 211960]
20285B11960J4177R4922l1578l431j70615n2569j56485q8430J00296n7590r9036
20274b38379R8348J84005J35754K9418J8292j06436M3410J4937P6830k2162j63423
20263G0594m0495L4854p3014p7113N3942K4055M9044J04592K4529J06571p0099
20252B07460p6090L940k8586p380R3828j14346L1784n2465j52784m7914L9764
20241a02789J78543K37956R5186J3694R24j70636o3289M9654j04120r2478j05617
20230f2972K6515o9218m4118L9842k0816m7855N5337J59339J15955n8704R6701
20219A90006j35911l6856N2870J15626K6297j33350k37952j18590K07002P4802
20209C944j99217P0829J20156Q5610j6497O6856N4879O5236k1819j40551k174
$$ y = [211960, 226137, 321059, 289481, 286050, 115435, 62866, -93619, -182049, -81753, -139343, -238379, -140031, 43974, 179728, 209146, 227438, 121002, 164412, 179349, 256179, 234017, 70594, 30099, 64953, -8061, -85174, -31232, -7177, 41867, 146459, 170988, 277559, 207460, 131370, 135310, 106724, 99344, 193172, 78826, 110610, 58145, -94639, -142553, -102789, 75754, 313710, 408896, 422590, 423514, 252878, 189589, 239243, 135123, 42645, -62972, -36457, -105675, -149793, -109951, -130767, -178622, -123285, 36054, 152009, 93305, 190006, 54095, 17239, 70109, 185735, 212032, 78682, -159270, -277860, -70858, 3944, -195273, -124444, -4288, 81322, 64825, 131681, 186560, 251796, 229977, 89426, 87252]
20198H7252o1445l9654J7665j66691K2454N5487j3335j7409k6975O8889n9519
20187a33281J904J23121J75526m4015j68826j07845J7060M8772r8465N7491R3309
20176c5249q8851q773r7517M8634J7611k7532o5000M2984K18361l2590r04R5889
20164F7063J70971l678m8734m6849r5532J1453j13838J33037L490O6148m1463
20153A02068Q5614n9853k8551j39116J13461j68643k16352j9622K03297J23616
20143d081J52432N8949o3611K3966j02605q8864o6261J188p0163j42141P9199
20132b21992J42096K38443r5528k05734l3467j4762P1722M1993m6723K2076L7997
20121f3879K00883Q1019j29851k58299k2202J50862m1154K6046M3004N5362m4062
$$ y = [87252, 25807, -13847, 3818, -162873, -140419, -84932, -98267, -115676, -142651, -73762, -133281, -131377, -8256, 167270, 123255, -45571, -153416, -136356, -87584, -186049, -128558, -35249, -124100, -132873, -230390, -181756, -164145, -191677, -256677, -213693, 4668, -27922, -28826, 67063, 238034, 234356, 185622, 138773, 43241, 54694, -59144, 73893, 77383, 143531, 102068, 187682, 127829, 99278, -39838, 73623, -95020, -311372, -330994, -127697, -4081, 148351, 207300, 143689, 167655, 65050, -23814, -90075, -88887, -159050, -301191, -221992, -79896, 158547, 63019, -142715, -176182, -190944, -119222, -77229, -123952, -101876, -63879, 137004, 218023, 88172, -170127, -192329, -41467, -82621, -56575, -13571, 41791, -2271]
20110b271M5662k5441N0589m975J31887L4943m5897K0102k33415L1638J91807
20099A94629j32488l8758K1468N2285n9504j31804J40839M030K2521K9460K05453
20088C08131k1972j03246j93029j69487J67056J48883N297K4311n3313L2080J49296
20077B94007J2230j84413r2209p0128k540J63062J3418k03611J33581N9380M6674
20066A69451Q7364l9725J401O8552M784L6416O2045J01756l3939Q1995J11897
20055F51997j11626p0141K4953n7742k3800P6723M6811m4457K0656J2385n1112
20044D74647j4402m6762K4876n9779m0869l4866r8038j19429J15671O1204J3076
20033B75329O818K45032J90461l5859K5490n9525Q6026j0783o2252l3528L4234
$$ y = [-2271, 43391, 17950, 68539, 63564, 195451, 230394, 184497, 204599, -28816, 2822, 194629, 62141, 23383, 44851, 97136, 37632, -94172, 46667, 50697, 73218, 102678, 308131, 286159, 182913, -10116, -179603, -12547, 136336, 141633, 165944, 112631, 144711, 294007, 306237, 121824, 29615, -40513, -43053, 120009, 133427, -70184, 63397, 122777, 169451, 256815, 217090, 218491, 287043, 291827, 328243, 390288, 492044, 458105, 540100, 651997, 540371, 470230, 495183, 437441, 413641, 490364, 537175, 492718, 513374, 525759, 474647, 460245, 413483, 438359, 378580, 337711, 302845, 204807, 85378, 201049, 262253, 275329, 282147, 527179, 717640, 681781, 707271, 647746, 733772, 722989, 660737, 627209, 661443]
20022F61443O6861K07250J22414J25525n845Q9494n5494l8283K7547r8455n2170
20011A050287k1938o8035K6703j30148j76673J30964R0598J21310j12796j98895
20001G11377j14852R1066l6966l3231r3233p7324J77056J25639j7452k20138j73405
19990C38537J43843Q4483R1105J2539L5766j67547l0297J00618j8528J41578j102
19979G30995O7196J23681k4113p6830o5407l0053j52134L6098O8087r6966m7279
19968E33275j6142L5965J40939p8152R7465l8106k26838J02201Q3512K1376j17067
19957E38428j25908r2914L0287n3668m4996j27275o7831J76975K4272k1931l7363
19946A98076l5130j81113M0811N5275k8450q0989o4984k5782j29687L9719J02221
$$ y = [661443, 728304, 935554, 1057968, 1183493, 1177648, 1267142, 1211648, 1173365, 1200912, 1102457, 1050287, 1028349, 960314, 987017, 856869, 680196, 811160, 901758, 1023068, 910272, 711377, 596525, 687591, 650625, 617394, 524161, 446837, 623893, 749532, 732080, 511942, 338537, 482380, 566863, 657968, 670507, 706273, 538726, 508429, 609047, 590519, 732097, 730995, 798191, 921872, 897759, 820929, 755522, 725469, 573335, 609433, 677520, 580554, 533275, 517133, 553098, 694037, 615885, 713350, 675244, 448406, 550607, 634119, 655495, 538428, 412520, 319606, 349893, 296225, 251229, 123954, 56123, 233098, 257370, 235439, 198076, 162946, -18167, 22644, 77919, 49469, -31520, -96504, -122286, -251973, -212254, -110033]
19935a10033L45100R3235j69747j37769K6288Q5673M179j16452j09818R907L2180
19924d7257J09884J54364j19234l61060j49778J21897J29005J22578J25284J09613
19914A95296M8024P15P5818k04707N5920p0192j77516P8918K8852r1399M6084
19903a4187R8609r5817j02683J51697P6486o9822J8787j12089j60607p6035K16764
19892f8897O7665j16592l6972o5221J12136J90376O3581p354L5157m5337l06016
19881a77474q7122J15755j46422Q7914J26255J45846J37494r3827o2013m4815
19871A591J03892J91417j94164j19611K491o3645R899J11537L0673n0116o7638
19860d3674j865q5649j19277m4270J23953R4419m9656j4129J16416k1009P9575
$$ y = [-110033, 235067, 328302, 158555, 20786, 47074, 132747, 136926, 20474, -89344, -79437, -47257, 62627, 216991, 97757, -263303, -413081, -291184, -162179, -39601, 85683, 195296, 243320, 244035, 319853, 115146, 171066, 100874, -76642, 2276, 31128, -60271, -14187, 84422, -11395, -114078, 37619, 114105, 44283, 63070, -49019, -209626, -285661, -68897, -1232, -117824, -154796, -220017, -107881, 82495, 146076, 138722, 173879, 128542, -177474, -264596, -148841, -295263, -207349, -81094, 64752, 202246, 108419, 46406, 1591, 105483, 296900, 102736, -16875, -14384, -78029, -68130, 43407, 74080, 23964, -43674, -45539, -131188, -250465, -294735, -170782, -76363, -126019, -140148, -23732, -44741, 34834]
19849C4834N8284j66522p7791J09269o945j8581q3933J13983P5295j57809p6232
19838a96148j07066L9455j40773L0226M6101j02091J05237P8696N3227J936J24611
19827f6589J17360L4541j26693l3184m8076L500j12845R3657R0865R8652L4933
19816H6121r719n6979K1078j09648k1869J75795r9415j8544R8361j01025k13764
19805b49608j17390j50813J09803K08223Q0901O8702Q4435M9216L1114j7361n8680
19794C8542o4314Q7605J03913r4366k29061j91905m0981J18888J22675J1631J44763
19783G390L620k48110j49068q0686L1596J01397J07391O2063Q3385M1978n1354
19772i0398j76407k20073j6058K02985J1483j809M9204o6079J4256Q702J13960
$$ y = [34834, 93118, -73404, -151195, -41926, -48871, -67452, -151385, -37402, 37893, -119916, -196148, -303214, -263759, -404532, -374306, -328205, -430296, -325059, -246363, -193136, -191200, -66589, 50771, 85312, -41381, -74565, -122641, -119141, -231986, -138329, -47464, 51188, 86121, 76402, 19423, 40501, -69147, -91016, 84779, -14636, -33180, 65181, -35844, -249608, -366998, -517811, -408008, -199785, -118884, -50182, 34253, 83469, 114583, 97222, 38542, -25772, 61833, 165746, 71380, -157681, -349586, -390567, -271679, -149004, -137373, 7390, 11010, -237100, -386168, -466854, -435258, -333861, -226470, -164407, -81022, -39044, -90398, -266805, -486878, -502936, -299951, -288468, -290277, -241073, -307152, -292896, -284194, -170234]
19761a70234N1204l6960L8585j5945K2336M0653J44738q8937M73J1973j30867
19750a32981q7054Q9179M0518q641k136j4093k6585M222J28247J8756k02692J80015
19738a3245N1517k31860r1744J05074M6248J14212K6423j33493k18850J10427
19728b35291J06646R3803K8164m9180n5596r4982j01785q2470K9604L4470J51157
19717a75460J74780J02425k2516j06677j6142L3676Q460M8332j40784j60224J17560
19706a36570N0995n5826L5229j4172q2774M4254L2341Q3336j60244q2501K5392
19695b60540R8006Q0332O9586k9350J59378p8636j04320j90774j7625J33975r667
19684a49635l3446k4398j6204n5418l6535O3755J23147m1809n5741q8385j55410
$$ y = [-170234, -119030, -155990, -117405, -133350, -111014, -70361, 74377, -14560, -14087, -2114, -132981, -220035, -130856, -90338, -98979, -101115, -115208, -141793, -137571, -9324, 9432, -193260, -13245, 38272, -193588, -285332, -180258, -134010, -19798, 6625, -126868, -345718, -235291, -128645, -34842, -6678, -55858, -111454, -206436, -308221, -390691, -361087, -326617, -175460, -680, 101745, 79229, -27448, -43590, -9914, -1454, 46878, -93906, -254130, -136570, -85575, -141401, -106172, -120344, -203118, -158864, -126523, -43187, -203431, -285932, -260540, -162534, -82202, -12616, -41966, 117412, 38776, -65544, -256318, -273943, -139968, -149635, -183081, -207479, -223683, -279101, -315636, -251881, -128734, -170543, -226284, -314669, -470079]
19673d70079j26905P8782M3285J7888J22897R305K04996L1072K5795q6402K5780
19662a23586n7192O7285J10977j5823j9437q1354q6673J83852P4241L6473J47261
19651B36024L4423Q6540l810m1635p456J8131k1226j8947J83111N6845Q521N3565
19639E84086Q9407q5375j22072J5807P606M7300O5414O4727k58428j73781o5450
19628A69241p5770l7848j40306N177Q917J62920R4856K41041J25973J09129J5538
19617F78868K46570K41463m4683N269K789j62365l2784N0989j95898n3154j54534
19606E82530k52139K5298M8726K2902K35779J97237j51105p6573o4202J01213
19596F69666j5232j52088q7076P5748J39021j41207n8190J28512l8332j64399
$$ y = [-470079, -596984, -518202, -474917, -457029, -334132, -324827, -119831, -88759, -62964, -149366, -123586, -180778, -113493, -2516, -18339, -37776, -119130, -205803, -21951, 52290, 88763, 236024, 270447, 356987, 353177, 311542, 304086, 322217, 300991, 282044, 465155, 522000, 530521, 584086, 673493, 588118, 466046, 481853, 489459, 536759, 602173, 666900, 408472, 234691, 169241, 93471, 55623, -84683, -79506, -70589, 92331, 187187, 428228, 554201, 663330, 678868, 925438, 1166901, 1122218, 1127487, 1130276, 967911, 935127, 986116, 790218, 737064, 582530, 330391, 355689, 404415, 427317, 663096, 860333, 709228, 632655, 568453, 669666, 654434, 502346, 415270, 491018, 630039, 488832, 430642, 559154, 520822, 356423]
19586C56423j68017r8578m9182P1897o6791p3381J0419J19534J78395o252n0180
19575B24287l8502J48799J32960o2203p873L0754J98011J29566N4702M9438k3505
19564H36434J82176p174j16054J35826j23604j26615j37648p1018N329J86313
19554G63965o3779k02339o7590l93249k01808J06423M5091O6379O9108j66836
19544d4635o6841J2523l405k2765J44665P4177N5573N8816j04255q3295j9904
19533F54l8610J2756K3917q8049p9106P9673m5376p4848j4228K17848K08312N9371
19521B62314J31026J10850j57538j5393j49795r6122O8824j2793k003n450l2522
19510A01398O3093L2463j0053o6100k12157j8897R6773o9420J36335P4184o1050
$$ y = [356423, 188406, 89828, 40646, 112543, 45752, -27629, -17210, 102324, 280719, 274467, 224287, 185785, 334584, 467544, 405341, 397468, 428222, 626233, 755799, 810501, 859939, 836434, 1018610, 1011436, 895382, 1031208, 907604, 780989, 643341, 572323, 577652, 763965, 700186, 497847, 430257, 37008, -164800, -58377, -13286, 53093, 122201, -44635, -111476, -98953, -102358, -125123, 19542, 93719, 149292, 208108, 103853, 20558, 654, -37956, -25200, -1283, -89332, -168438, -88765, -134141, -208989, -223217, -5369, 202943, 262314, 393340, 504190, 346652, 331259, 181464, 85342, 154166, 141373, 139370, 133920, 101398, 164491, 196954, 186901, 120801, -91356, -110253, -13480, -82900, 53435, 127619, 66569]
19499F6569n1764N0648m5714J07602j87414r4282P5807n835k6442k5144j5029
19488a50998P2219L8784j45028j8615k573m890m2431N2783L8456Q437L6449J40808
19476B3401r2509l6351k4745j16349n6025K4505k4307R8402K8323l7321q4438
19465b97414r9337J11510J5698M0158J31744j26551o3159K7922j6250n1230K1185
19454c05724O5122J1416q323J14292k0380J70900n8877j5926O5316M6600k07831
19443a43415l48046Q9056N4712l4808N6494m838L2983k9076j24213R4632M0204
19432c16315R1901J54066J00017k0412j17024m4560l3165N1306j3968M3084l9831
19421a44901J13103l3681r5691l5357L8353j57085j12036J3031J05997L412l6344
$$ y = [66569, 14805, 65453, 19739, 127341, -60073, -154355, -78548, -84383, -110825, -135969, -150998, -78779, -39995, -185023, -203638, -206211, -211101, -253532, -200749, -162293, -153856, -117407, 23401, -69108, -105459, -130204, -246553, -302578, -278073, -302380, -203978, -175655, -212976, -297414, -396751, -285241, -269543, -229385, -97641, -224192, -287351, -259429, -275679, -326909, -305724, -240602, -229186, -237509, -123217, -143597, 27303, -31574, -47500, 17816, 64416, -143415, -491461, -402405, -347693, -382501, -326007, -330845, -297862, -326938, -451151, -356519, -316315, -224414, -70348, 29669, 9257, -107767, -152327, -185492, -134186, -148154, -105070, -144901, -31798, -65479, -161170, -196527, -158174, -315259, -427295, -414264, -308267, -304855, -341199]
19410c41199J27565N434j82391j6181P7116K20356J58888r0413j48817L3132j1417
19399a67927l4968l3661m9442J76023J46472k1671o9124n6605j06914j55479M41
19388c72855j7178N8500J10082k819j87180k1704j2167O301J29003J1018Q951
19377b90048k96J6473l8001N3690M0026o6099o2271J5187k8763k0671R7255J05579
19365a77939J25887M0276M1275m6938p5248K6067j57993j08118O0023n0064n7335
19354c80107m6597K1689K12644j45443J8134P3449R0098O2712Q2385J14n5318
19343f6240j59058q9324P488Q999N6419k0062J10584k2494l0224O369P8306N7237
19331f2000k0242P2579r7660j60926k0977j10469j00477J9500P2776R2592J21372
$$ y = [-341199, -213634, -208200, -390591, -406772, -329656, -109300, 49588, -40825, -189642, -156510, -167927, -202895, -236556, -285998, -109975, 36497, 14826, -54298, -110903, -217817, -373296, -372855, -390033, -331533, -221451, -224270, -411450, -433154, -445321, -439020, -310017, -298999, -290048, -290344, -273871, -311872, -258182, -218156, -284255, -346526, -331339, -360102, -380773, -283518, -177939, -52052, -11776, 29499, -17439, -92687, -66620, -224613, -332731, -272708, -322772, -380107, -426704, -405015, -192371, -337814, -319680, -246231, -156133, -93421, -11036, -10922, -66240, -225298, -314622, -307134, -298135, -241716, -261778, -151194, -173688, -203912, -197543, -119237, -62000, -82242, -9663, -107323, -268249, -289226, -399695, -500172, -480672, -407896, -315304, -193932]
19320a93932Q0271O254J29671K0184J77404n4268k433N0984j18458q3208j58365
19309a45896J7433O4714n2649K8261o7454q7736r7487n9594N9641p0317N6651
19298c54433P149J50847K3555q6461J6254p7283N700p9055j77204J8609J50263
19287d02059K7708j53079k5671J63347J08777p2262M1842O8050P2714j54862o2868
19276c88363R7292K57339l6661m8081k8096Q374O7552R9418q1609j54320J18950
19265h8205j04504j39458j10839J47624j3589r2181J1932O0390Q1768L1263N2007
19254a63792O862K9751J95605j04440R1777P9381k58815j02408l3540J4069K08711
19243c6839J9806l7941J2321K2543n7904j4730N2354J5023q4034o8294n4216O325
$$ y = [-193932, -113661, -107407, 22264, 42448, 219852, 165584, 163151, 214135, 95677, 12469, -145896, -128463, -63749, -116398, -88137, -155591, -243327, -340814, -400408, -340767, -411084, -354433, -347284, -196437, -172882, -259343, -243089, -320372, -314672, -393727, -570931, -552322, -402059, -374351, -527430, -553101, -389754, -280977, -353239, -311397, -243347, -170633, -325495, -388363, -291071, -33732, -70393, -118474, -146570, -138196, -70644, 28774, -52835, -207155, -88205, -192709, -332167, -443006, -295382, -308971, -401152, -389220, -328830, -247062, -215799, -163792, -156930, -127179, 68426, -36014, 55763, 135144, -123671, -226079, -259619, -245550, -36839, -17033, -54974, -42653, -20110, -78014, -92744, -40390, -25367, -109401, -177695, -231911, -225586]
19231b25586Q8362j6711j76568m2499n6735l1628J34114K56897N3143o7585m454
19220h9250n4736l1034o0837k1388l6660N4598O6094J4480m0330n332N4197J31611
19208a8587l9772p4681l9440m53K851j39590j81999J22582R3218J46313L9944
19197h9614j61968P0027P2784J5808L4847k1140k3712N6035J72647L7907j49055
19186A4566r4052K713Q8012J9854j712J51541K09586P9202j75577J41770K8982
19175D64885k7549j90820j13727r9910j0974k1510J58497Q2999P2747K81004J67085
19164G62727J34235P7472j34148J8940K59412K33387L50388L43637L77111O12360
19154C035521N63547R76199J320275Q71683P81872N55041k34704o89389p20020
$$ y = [-225586, -137224, -153935, -330503, -373002, -429737, -461365, -327251, -70354, -17211, -84796, -89250, -143986, -175020, -235857, -257245, -293905, -239307, -173213, -158733, -199063, -204395, -150198, -18587, -58359, -133040, -172480, -172933, -170082, -309672, -491671, -369089, -275871, -129558, -89614, -251582, -181555, -108771, -92963, -58116, -79256, -102968, -46933, 125714, 163621, 14566, -79486, -76773, 11239, 31093, 29381, 180922, 390508, 469710, 294133, 435903, 464885, 437336, 246516, 132789, 32879, 21905, 395, 158892, 241891, 314638, 595642, 762727, 896962, 974434, 840286, 859226, 1118638, 1352025, 1702413, 2046050, 2423161, 3035521, 3599068, 4575267, 5895542, 6767225, 7549097, 8104138, 7869434, 7180045, 6460025]
19145F460025n17984j4424J70451N68823P90172J325211J808181K682144M255707
19136A7528306O480295Q927408Q759389O045006K407093k462522n991760p716448
19128C3976767p347556n132323l000730j251657N6119P94003J676404L157853
19120B2928880M975066N959797L614676l09934l556509m859379l598657j407372
19112B3746568J00965J537569L297170O023315R966825J5085820J9990136J9119186
19104I8867554P884933o576738j6599232j8674772j3653677p790467l623894r23012
19096C8910695J366759L180836N557581R218202J4905533K3051786K8452824J8647237
19088A43291453l81507j5048710k0165533j1709643K03049J1222410K2965955
$$ y = [6460025, 5942041, 5927617, 6098068, 6666891, 7457063, 8782274, 10590455, 13272599, 17528306, 24008601, 32936009, 41695398, 47740404, 50147497, 47684975, 41693215, 33976767, 26629211, 21496888, 18496158, 17244501, 17300620, 18094623, 19771027, 22928880, 27903946, 33863743, 37478419, 37168485, 33611976, 28752597, 25153940, 23746568, 23847533, 25385102, 28682272, 34705587, 44672412, 59758232, 79748368, 98867554, 106752487, 100175749, 83576517, 64901745, 51248068, 43457601, 39833707, 38910695, 40277454, 43458290, 49015871, 58234073, 73139606, 96191392, 124644216, 143291453, 142909946, 127861236, 107695703, 95986060, 96189109, 107411519, 130377474]
19081A30377474L8523432N9789868Q3871576R3733069P3724462L4697772j1331629
19074E03386024n3776667p5993305p9546708o7659414m6835487k8311320j4619113
19067A36644010m216867N829796J6913307L1013275M9335016O9081729P8891403
19060C83491669O7567338M3226140O828952l6815603o9680937q3854070p6665369
19053B34098120n5258556l4432679j9686519r279846l89015P750361J2255453
19046A35057319P602919m120888j5260353k0758722j8580296j2958405q161020
19039F2820554m968079k954773j457519L71021L590410P775895J3079996J7884690
19031I6142195J5991365M654587r053441j8500213j9666994j5030754r952360
$$ y = [130377474, 168900906, 228690774, 312562350, 406295419, 480019881, 514717653, 503386024, 449609357, 373616052, 294069344, 226409930, 179574443, 151263123, 136644010, 132427143, 138256939, 155170246, 186183521, 235518537, 304600266, 383491669, 451059007, 494285147, 501114099, 464298496, 394617559, 310763489, 234098120, 178839564, 144406885, 124720366, 115440520, 115051505, 122801866, 135057319, 142660238, 138539350, 123278997, 102520275, 83939979, 70981574, 62820554, 57852475, 54897702, 53440183, 53811204, 57401614, 65177509, 78257505, 96142195, 112133560, 116788147, 107734706, 89234493, 69567499, 54536745, 44584385]
19024D4584385o301737m094595k173967p46934R03081K885266L966699K862867
19016D1885065m84727l752481n506089n343891l872896k072344m55034N73038
19008B0970641J934024L506856N770282Q064475Q163377N336742K366626k303550
19000E3809473o888987q735475q847490o644741m367915k867079j824597j174706
18992A2458483q57513n52668k20161N3616N07382Q48172M87255l1516n11605r31382
18982A1250063j134217j172447j038878q89477p35214l23982k15531j70072j48059
18973E422186l01148j83105k21867k25323k57147m5651o6850l9054j1566j82385
18963C888090o6524N6682o0179o0983o9212p761m4402j86039k3090K2630J32334
$$ y = [44584385, 38282648, 34188053, 32014086, 31267152, 32170233, 35055499, 39022198, 41885065, 41400338, 37647857, 32141768, 26797877, 22924981, 20852637, 20397603, 20970641, 22904665, 26411521, 32181803, 40246278, 48409655, 53746397, 56113023, 53809473, 46920486, 38185011, 29337521, 22692780, 18324865, 15457786, 13633189, 12458483, 11600970, 11048302, 10828141, 10881757, 11389139, 12237311, 12724566, 12693050, 12181445, 11250063, 10115846, 8943399, 7904521, 7015044, 6279830, 5955848, 5740317, 5570245, 5422186, 5121038, 4937933, 4716066, 4490743, 4233596, 4187945, 4121095, 4082041, 4070475, 3888090, 3821566, 3878248, 3818069, 3757086, 3687874, 3680113, 3635711, 3449672, 3426582, 3449212, 3581546]
18952C581546p189r8250j0015k6684j01379n294j33655r1809j89545j83413l6428
18941B697885l2797j20416j37071j04833J55662O3990J94420J35622m6255J39600
18931B945807p1791l85188k50423k75393k7355O4824L8431m740k42286k11874
18921A580012k8767J7201K03571J13830j33529j78096o4359J39887p0209o3428
18911A516113J03879J05827r5261q432R4242K716O7216j91713o3604q0778j15370
18900A334835q9540j93284Q792K01896R8718k2377j44938J88848K6566l9884O4345
18889A433977j6088n2147q5959l1373j75140j39963J4584P4028J30586m6199j12916
18878I93390j500Q7032J20642q7892n629n6784n7251r2396j43882j33624j20257
$$ y = [3581546, 3574357, 3476107, 3466092, 3439408, 3338029, 3332735, 3199080, 3107271, 2917726, 2734313, 2697885, 2665088, 2544672, 2407601, 2302768, 2458430, 2522420, 2716840, 2852462, 2806207, 2945807, 2874016, 2488828, 2238405, 1963012, 1935657, 2000481, 2038912, 2034172, 1791886, 1580012, 1551245, 1568446, 1772017, 1885847, 1752318, 1574222, 1509863, 1649750, 1579541, 1516113, 1619992, 1725819, 1630558, 1622126, 1716368, 1719084, 1786300, 1594587, 1530983, 1450205, 1334835, 1245295, 1052011, 1060803, 1262699, 1361417, 1339040, 1194102, 1382950, 1409516, 1369632, 1433977, 1417889, 1365742, 1279783, 1248410, 1073270, 933307, 947891, 1021919, 1152505, 1106306, 993390, 991890, 1078922, 1199564, 1111672, 1106043, 1049259, 992008, 899612, 755730, 622106, 501849]
18867E01849N2418K30637J89666L5926j04099n4104P9857K43063J06032j33613
18857A147632o3128k9385n9065j41584p8587J41678K65440n9117j06525k1178
18847I96181P0531J3015j75450r4841l3663L4705O2009o7272R5467J00752O087
18836A007521j06470q3893k3443n0167J9787N3545N4933j5182j56313N6390j02780
18825F53928O4180J45790J11054j79708l9045J44154P7790P3326M317p3881p0630
18814I11275L4531Q1440l0005J18882p9505m1442j43716k27888O1959J64742R5756
18803I46029J45943O8189k7198o0011J4024n5075o3325p1539o472l182o1535Q1023
18791I06871J5707m2508k1265J22651n0477r8927K3392N6242R3366j23384j29844
$$ y = [501849, 554267, 784904, 974570, 1010496, 906397, 852293, 932150, 1175213, 1281245, 1147632, 1084504, 1055119, 996054, 854470, 775883, 917561, 1183001, 1123884, 1017359, 996181, 1066712, 1079727, 904277, 809436, 775773, 810478, 872487, 805215, 900682, 1001434, 1007521, 901051, 817158, 793715, 743548, 763335, 816880, 871813, 856631, 700318, 756708, 653928, 718108, 863898, 974952, 795244, 756199, 900353, 978143, 1051469, 1055786, 981905, 911275, 945806, 1027246, 997241, 1116123, 1036618, 995176, 851460, 623572, 685531, 850273, 946029, 1091972, 1160161, 1132963, 1072952, 1086976, 1031901, 968576, 897037, 890565, 887383, 825848, 906871, 922578, 880070, 858805, 981456, 930979, 832052, 855444, 911686, 1005052, 881668, 751824]
18780G51824J284R1184M4090n1295O3N5565J1822n5945j96929j93328J88065L67083
18768A013483J04506j9494M1175J7229j62611j52292j03669m9135R7784n4140
18758G32836m862J59027N2693k022j00331J1808K21594K15665j23081L195k02759
18747I63763j31278M3610n9342p6523j00931J02159J71665M1401Q3679O917K2245
18736A067365p1757K7033j37012p573K52096J93302m2359l9241l185Q8617P1657
18725A398943J944K3732l6367j05601k01344n7554Q5568N1369j58351q6952K77846
18714A193233q54p9460J5402K6464R3631k3795q5909j1518R0704Q795j9059m3333
18702A164301k4731r3504j01410O7915l3775N2671J43330j21079J863J24008M4403
$$ y = [751824, 753108, 844292, 888382, 837087, 837150, 892715, 904537, 848592, 651663, 458335, 646400, 1013483, 1117989, 1098495, 1139670, 1156899, 994288, 841996, 738327, 689192, 786976, 732836, 727974, 887001, 939694, 937672, 837341, 849149, 1070743, 1286408, 1163327, 1166522, 963763, 832485, 876095, 816753, 740230, 639299, 741458, 913123, 954524, 1038203, 1045120, 1067365, 995608, 1022641, 885629, 878056, 1130152, 1323454, 1281095, 1241854, 1238669, 1327286, 1398943, 1400887, 1424619, 1388252, 1282651, 1081307, 1023753, 1109321, 1160690, 1002339, 915387, 1193233, 1192379, 1112919, 1128321, 1154785, 1248416, 1224621, 1138712, 1127194, 1217898, 1226693, 1207634, 1164301, 1139570, 1046066, 944656, 1012571, 978796, 1031467, 1174797, 1053718, 1055581, 1179589, 1223992]
18691A223992J5418L334K1740j90402j55832L6409K2349k3969k7155K34410J35919
18680A296213q0237J15489m4114l5497M226o2475K4351j49837k3187O2341N596
18669A112869K7799J07334r6895j03032J49413n0422m5598O6691J74595J29063
18659A471817m6855j04974j59432j00998j23156j8768O4005p995N4895j03628
18649I24911j30123M891r3298m5687k1533J3491j1063n8584l0290Q9277m9289
18638E92703o0408p8632K94912P6219n2040n6182Q0603J81809k5061q4157r6029
18627G73737N4914j15256M6547j6483j0450M3295K06863L1447k84883k74920r2766
18616C62045J57149L52783q4489j39063r1324j53600j9215J88193m2511N601m597
$$ y = [1223992, 1239410, 1242744, 1264484, 1074082, 918250, 954659, 977008, 953039, 925884, 1160294, 1296213, 1215976, 1331465, 1287351, 1251854, 1256080, 1193605, 1217956, 1068119, 1044932, 1107273, 1112869, 1140668, 1248002, 1151107, 1048075, 1197488, 1147066, 1101468, 1168159, 1342754, 1471817, 1424962, 1319988, 1160556, 1059558, 936402, 917634, 981639, 973644, 1028539, 924911, 794788, 799679, 706381, 660694, 639161, 652652, 641589, 583005, 552715, 641992, 592703, 532295, 453663, 748575, 824794, 772754, 716572, 797175, 978984, 953923, 869766, 773737, 828651, 713395, 759942, 743459, 733009, 776304, 983167, 1014614, 729731, 454811, 362045, 519194, 871977, 787488, 648425, 557101, 403501, 384286, 572479, 529968, 535569, 530972]
18605E30972p5636J02233K46179R687P4209P966j90402P2417j13125P4837M8144
18594G87481l4154j25066O6259K13735J71237O2943J77621O3030M1527j15238
18584A309375l7333J20867M7945l9991r3187j01775j62068J18568J89244J3243
18574A364888r4490J08925K48023K03637J85782J00795K5070R1567M3428k09999
18564B067626j62862j53410J97795J19592j40829r3167j9509j93885o3068J4096
18554A572379J42257M2738m4259k8496n1835k13059j51312m6990Q0777K60069
18544A562269J65075M6565l1597n5825K48033M4545j20117m4432N6695j7411N2331
18533A906131J26298J82178J77653K6498J06938J49264J9717k17598j14733J4173
$$ y = [530972, 455336, 557569, 803748, 813435, 887644, 895610, 705208, 777625, 664500, 739337, 787481, 753327, 628261, 694520, 908255, 1079492, 1142435, 1320056, 1383086, 1424613, 1309375, 1272042, 1392909, 1440854, 1400863, 1307676, 1205901, 1043833, 1162401, 1351645, 1364888, 1270398, 1379323, 1627346, 1830983, 2016765, 2117560, 2142630, 2234197, 2277625, 2067626, 1904764, 1751354, 1949149, 2068741, 1927912, 1834745, 1815236, 1621351, 1558283, 1572379, 1714636, 1757374, 1713115, 1684619, 1632784, 1419725, 1268413, 1221423, 1302200, 1562269, 1727344, 1773909, 1742312, 1686487, 1934520, 1979065, 1858948, 1814516, 1871211, 1853800, 1906131, 2032429, 2214607, 2392260, 2418758, 2525696, 2674960, 2694677, 2477079, 2362346, 2376519]
18523B376519j1300J07116J32770J01747k12210j35518P8015j24239r6280k4387
18513B192233j05975n4390k42619j53611Q3117K20574N8144N4533P4766k32406
18503A894366j67286p9796j30282j35092Q0090L00405J81067j60272l5280L4342
18493A782262j10468j7081O0893J60821j1052M4694K43403K45792L29663L3851
18483B762778J3083Q9650n4311p2938j79463j439J43759Q8477J00821n9885r6781
18472B733751p5829Q0913O0348j25573L4833J09389o0707L1328q9926j46088j9310
18461B533129j15583j41531k68622J1347J15244o14l20488k61634j05103O9574
18451A515719O6434J69468k6288j6300R9753J93648j12705q7051q4522o5668j50539
$$ y = [2376519, 2365219, 2472335, 2605105, 2706852, 2494642, 2359124, 2437139, 2312900, 2216620, 2192233, 2086258, 2031868, 1789249, 1635638, 1718755, 1939329, 1997473, 2052006, 2126772, 1894366, 1727080, 1647284, 1517002, 1381910, 1462000, 1762405, 1943472, 1783200, 1747920, 1782262, 1671794, 1654713, 1715606, 1876427, 1865375, 1910069, 2153472, 2399264, 2728927, 2762778, 2775861, 2865511, 2811200, 2738262, 2558799, 2557360, 2701119, 2789596, 2890417, 2830532, 2733751, 2657922, 2738835, 2799183, 2673610, 2708443, 2817832, 2757125, 2788453, 2698527, 2552439, 2533129, 2417546, 2276015, 2007393, 2018740, 2133984, 2133370, 1812882, 1551248, 1446145, 1515719, 1582153, 1751621, 1725333, 1709033, 1808786, 2002434, 1889729, 1802678, 1718156, 1652488, 1501949]
18440A501949M5470J33858p3509j52459P0231J22131J49362q454J08359Q6742
18430A983680n8067k9144m5197o820j19604k4556J37021Q4613K3670n049p0036
18419A870511l9985j581j35433j98114k13339O0127J74120p9137j48630n3219
18409A235320j10913j64607m6979P9420J75439m9841j38527k49615p5707J7066
18399F71056J02888R094k396q9037J16005P7046Q0251p46L2648J89943n4936j90559
18387I41257k6923J2988J04974K31411j5951p2151l1165j63515j08439k8414K2235
18376H66307q5532o556p6829o455J98970R6941K6479j88478o2205J67321Q3621
18365A013584M3825k4231j54020q5125P0442N6643j63266k19685J2144K16616
$$ y = [1501949, 1547419, 1681277, 1607768, 1455309, 1525540, 1647671, 1797033, 1788579, 1896938, 1983680, 1925613, 1896469, 1851272, 1844452, 1724848, 1700292, 1837313, 1921926, 1945596, 1940547, 1870511, 1830526, 1828945, 1693512, 1495398, 1282059, 1342186, 1516306, 1437169, 1288539, 1235320, 1124407, 959800, 912821, 992241, 1167680, 1117839, 979312, 729697, 653990, 671056, 773944, 783038, 780642, 691605, 807610, 884656, 964907, 964161, 996809, 1186752, 1131816, 941257, 914334, 927322, 1032296, 1263707, 1247756, 1175605, 1144440, 980925, 872486, 844072, 866307, 780775, 774219, 697390, 690935, 889905, 986846, 1013325, 824847, 762642, 929963, 1013584, 1057409, 1033178, 879158, 794033, 864475, 921118, 757852, 538167, 550311, 766927]
18355G66927J54432j74305r3317O9547L028j46999q6737J08075J21116Q4486j827
18344H04426J9045Q1719p7934j90107L4469L3421j03738J3588J49147k1421j53251
18333E89364j47463K302J00428j4998K0246N0193K3825m4545J27249j4567j36849
18322E55185M6630j07935R3111J28038j49289k15342J9034K3840J59474J11425
18312F64171m3057j8102J24856r0025j42694j30374L0207N6065K3647K837L1430
18301E08961j11894l8751J35184J69629J54778j31472m5647Q0696P494P1360M963
18290H05301n7705n984p5578k2196n6750j79198L9366P523L932J70056P5333J05267
18278H09367j04227k9793J05388Q2852j03463k1183J12868L4562M7665l5015K0487
$$ y = [766927, 921359, 747054, 653737, 723284, 726312, 579313, 492576, 600651, 721767, 806253, 804426, 823471, 905190, 827256, 637149, 671618, 705039, 601301, 614889, 764036, 742615, 589364, 441901, 444203, 544631, 529633, 549879, 600072, 623897, 579352, 706601, 692034, 555185, 601815, 493880, 586991, 715029, 565740, 350398, 369432, 393272, 552746, 664171, 621114, 603012, 727868, 637843, 495149, 364775, 394982, 451047, 474694, 477531, 508961, 397067, 358316, 493500, 663129, 817907, 686435, 640788, 721484, 728978, 800338, 805301, 747596, 741612, 666034, 643838, 587088, 407890, 447256, 454779, 458711, 628767, 704100, 809367, 705140, 675347, 780735, 863587, 760124, 738941, 851809, 886371, 934036, 899021, 919508]
18267I19508l7092j5678j0690N6022k7262q5977P1829j20354j26124k1242k6419
18256E76521q6680o9101K22904K3656r0770j8891R5834M0223r9442p5443r2490
18245D26321m0333q1621J62853R4814Q4695j8608l570J14714Q8656q329J15850
18234I35442J77436K13744J78270o3770O1993K49305K01490J57572J53328J28602
18224B393412P6651J53974K16811J91451R6059R9396J85438K71577L419j13897
18214C574291j52395q5863K0448P3171N5512K0715k72119l44042l62563p3887
18204B453268K4402J2185P217J87505K49024K58861N08170M58397L47814M02591
18194D909434L33017L97028K41300O8197K2147J35131K27559N40676J100700J453945
$$ y = [919508, 882416, 866738, 856048, 912070, 884808, 798831, 870660, 750306, 624182, 602940, 576521, 489841, 420740, 643644, 667300, 576530, 557639, 653473, 693696, 594254, 518811, 426321, 385988, 304367, 467220, 562034, 646729, 628121, 624551, 739265, 827921, 819592, 935442, 1112878, 1326622, 1504892, 1441122, 1503115, 1752420, 1953910, 2111482, 2264810, 2393412, 2470063, 2624037, 2840848, 3032299, 3128358, 3227754, 3413192, 3684769, 3688188, 3574291, 3421896, 3336033, 3356481, 3429652, 3485164, 3505879, 3233760, 2889718, 2527155, 2453268, 2477670, 2489855, 2497072, 2684577, 2933601, 3192462, 3700632, 4159029, 4506843, 4909434, 5242451, 5639479, 5880779, 5948976, 5971123, 6106254, 6333813, 6874489, 7975189, 9429134]
18184I429134J713896J894078J781831J646493J180133N20893Q9147l63809q25794
18175A7066002q73636j318892j612529j683206j716657j550284j269553q62394
18167F178851n98098l27281l28834l49620l39440k22976k66463k34325k40645
18158C271169j39457J07832P7703L2976k9607N9577J89519J44250l3310l7179
18148C643473L9946J6205q5062p0767K4400M1K41359J85058K04802K54460j3566
18137D440349m9513j37821j33037k26223l33769j60155p8721R2633J10359q5376
18127C438726M4917k0142j16225k50737j86796j1042O2105j52297k62476M6257
18117B592290K5571R9422p2811j6076j44151L7917j65602k17567j07342J94147
$$ y = [9429134, 11143030, 13037108, 14818939, 16465432, 17645565, 18166458, 18255605, 17891796, 17066002, 16192366, 14873474, 13260945, 11577739, 9861082, 8310798, 7041245, 6178851, 5580753, 5253472, 4924638, 4575018, 4235578, 4012602, 3746139, 3511814, 3271169, 3131712, 3239544, 3317247, 3350223, 3320616, 3380193, 3569712, 3713962, 3680652, 3643473, 3683419, 3699624, 3614562, 3543795, 3568195, 3568236, 3809595, 3994653, 4199455, 4453915, 4440349, 4390836, 4253015, 4119978, 3893755, 3559986, 3399831, 3321110, 3413743, 3524102, 3438726, 3483643, 3463501, 3347276, 3096539, 2909743, 2898701, 2960806, 2808509, 2546033, 2592290, 2617861, 2717283, 2644472, 2628396, 2484245, 2522162, 2356560, 2138993, 2031651, 2225798]
18107B225798J90432j7577l2772j62765k2805P45q1276j8229L9898P2196R4404
18096B288049j12511j08120q2195M0206j51933l4430J17583P0982j7794M40l4337
18085A975940J52454O9697J30232M3876q4093j10070j95794q6602j11753l27538
18075A456349k22108j18314N4746O3290n7834Q588o7622j43541J05184p2992q8939
18064I16807K6843k6498m677n6202l4654j06212k1708J86114Q8501Q6743j36480
18053I18577m1831J36572n5609K2456j04208J19431P1976J20102m8596j28658
18043A010212m2301j07258j56716j38657l4426L9212Q2936j94244r3460J17295
18033D82593J42383j79192j71599l1486P7036J61184J9901R1974j6446r373k36299
$$ y = [2225798, 2416230, 2398653, 2365881, 2203116, 2180311, 2181056, 2099780, 2081551, 2121449, 2193645, 2288049, 2175538, 2067418, 1985223, 2025429, 1873496, 1839066, 1956649, 2027631, 2009837, 2010277, 1975940, 2128394, 2198091, 2328323, 2372199, 2288106, 2178036, 1982242, 1895640, 1783887, 1456349, 1234241, 1115927, 1170673, 1233963, 1176129, 1184717, 1117095, 973554, 1078738, 1005746, 916807, 943650, 917152, 912475, 856273, 821619, 715407, 693699, 879813, 968314, 1055057, 918577, 876746, 1013318, 957709, 980165, 875957, 995388, 1067364, 1187466, 1138870, 1010212, 967911, 860653, 703937, 565280, 530854, 570066, 653002, 458758, 365298, 482593, 624976, 445784, 274185, 242699, 319735, 480919, 500820, 592794, 576348, 566975, 330676]
18022C30676j0434k6611q973k3066O624R6311j0875p1337M0621L7606Q4976l4939
18010D10579m3715N0173o7585J58282n3049j42687l9159m5455q2242J41923j3629
17999B73436j09759J27860K02570J31436n2681k10121o8968J85498J56913o5696
17989E70488j04369N0645j59065k03963j15615J56398J56995m7553l3808o070
17979B64083p2028j80196m0694j8608p1943K373M7934J13849K8448J390N4946
17968A29554J52081m3971o6819N2271p0097m7342o4454j06919J31049O9972j54758
17957a9433m8209K4680J05267O5776Q7545P6168M5993J5651j1766n3434j12667
17946A75571j13733M1805J23124j56851n7900M3415j0844M7841J26618O2392o5213
$$ y = [330676, 320242, 293631, 284658, 261592, 268216, 364527, 353652, 282315, 322936, 360542, 445518, 410579, 366864, 417037, 349452, 507734, 454685, 311998, 272839, 227384, 145142, 287065, 273436, 163677, 291537, 494107, 625543, 572862, 362741, 293773, 479271, 636184, 570488, 466119, 516764, 357699, 153736, 38121, 194519, 351514, 303961, 270153, 264083, 192055, 11859, -28835, -47443, -119386, -117013, -69079, 44770, 73218, 74608, 129554, 281635, 237664, 170845, 223116, 153019, 105677, 41223, -65696, 65353, 135325, -19433, -67642, -42962, 62305, 128081, 215626, 291794, 337787, 353438, 341672, 288238, 175571, 61838, 103643, 226767, 69916, 12016, 55431, 44587, 92428, 219046, 281438, 216225]
17935B16225j69607j72966q3431P7851K30140K73381J35336r4008r0383J45149
17925D67687j3179p2714p4061j58721j51344M5679j50051o1397O6076O8427Q4519
17914E0921P4808n1314j815J12451N3954r423j02707l6055k5554J9573M8054J96611
17902C29504J36090k11584r7887M7042j8815q1957k6724M5451Q3648J76168j36814
17891B44122n3983Q2685j79808l1266J94569K727M445K43372o7235q8290L9896
17880C91234N8652m5270k02594r3861L5426K1065m2678k07780P418J45009N5500
17869A22121j35220l9391r3287j86563j7340L07249P570O8637K07437m6842q7606
17858A06765k8655J6339j53402j0273J06930J76855R0141p587p0476M7046Q7695
$$ y = [216225, 46618, -126348, -209779, -131928, 98212, 371593, 506929, 412921, 322538, 467687, 454508, 381794, 307733, 149012, -2332, 43347, -106704, -168101, -102025, -33598, 50921, 125729, 74415, 72600, 185051, 239005, 229582, 126875, 90820, 65266, 84839, 132893, 329504, 465594, 254010, 156123, 203165, 184350, 102393, 75669, 121120, 204768, 380936, 244122, 190139, 272824, 93016, 61750, 256319, 259046, 263491, 506863, 439628, 351338, 391234, 449886, 404616, 202022, 108161, 143587, 164652, 121974, -85806, -78388, 66621, 122121, -13099, -52490, -145777, -332340, -349680, -42431, -34861, 33776, 241213, 194371, 106765, 78110, 94449, -58953, -69226, 37704, 214559, 304700, 297113, 226637, 273683, 361378]
17847C61378j12876j8330K4040o2951j31841n1274P0629P3068n2941J45870j17925
17836A26847j74872n838j521j03173Q0213N4045J63931l3208j06912M6310m9682
17825c860J92645O9126l11498l0004K80856K56858q9505p9567M0307m4967J4593
17814B94984k32954n6998k946q7798o2112J05332m9301P9119R2591o2035p4316
17803e6434l3264m0210M8730P4930M9467N5727r9765n3553J94494n8688k10281
17792a28847J52165K74041L6339o317l45688j57341j52170N0134K52609J62600
17782A37525N175m5195Q297J9620l8125j40181J25377J82877J82818j1066j65041
17771B62081k54062r9850j4828J54108J14758L2180n9841K3475m3314M7364j5489
$$ y = [361378, 248502, 230172, 254212, 191261, 59420, 8146, 78775, 151843, 98902, 244772, 126847, -48025, -53863, -55384, -158557, -78344, -24299, 139632, 106424, -488, 45822, -3860, 188785, 257911, -53587, -83591, 197265, 454123, 364618, 285051, 325358, 280391, 294984, 62030, 5032, 2086, -85712, -147824, -42492, -91793, -12674, 79917, 17882, -56434, -89698, -129908, -81178, -6248, 43219, 98946, -819, -54372, 140122, 81434, -128847, 23318, 297359, 333698, 327381, -18307, -175648, -327818, -277684, -25075, 137525, 142700, 97505, 105802, 125422, 87297, -52884, 72493, 255370, 438188, 427122, 262081, 8019, -91831, -106659, 47449, 162207, 194387, 134546, 158021, 114707, 162071, 146582]
17760A46582j7961J2531O6892m8617Q4324p3548Q3881J43863J50186l3105p4960
17749D40068j05701j17425K5115Q3507j17607M3792O736j95317q3760L41473J59157
17738D80038k05014j56706q5016O541K4310p766O3854q0123j9363K7563M9644
17727I7962p2600r1841l1864Q4848J09183K8643J3693j98305p4497P8223l2810
17716h9365J74714o7703m8298q7649j83112J17452J16661Q7402O000J01280J99659
17705C27041N1920r8135k6258k124j39777l3546J45586l9695P344O7210q4698
17694A74868j01445k23593N8225J08803J72590J1166K2280N3713q3098p4898k1860
17683I6751K3679P9101m5806M6734J3604n0450j27095q4500j5857J5643j01221
$$ y = [146582, 128621, 141152, 208044, 159427, 243751, 170203, 254084, 397947, 548133, 515028, 440068, 334367, 216942, 242057, 325564, 207957, 251749, 258485, 63168, -20592, 320881, 480038, 275024, 118318, 33302, 39843, 64153, 56387, 120241, 40118, 20755, 48318, 97962, 25362, -66479, -98343, -13495, 95688, 124331, 138024, -60281, -134778, -56555, -89365, 85349, 17646, -30652, -118301, -301413, -183961, -67300, 20102, 26102, 127382, 327041, 378961, 280826, 254568, 252444, 112667, 79121, 224707, 185012, 192356, 259566, 174868, 73423, -150170, -91945, 16858, 189448, 200614, 222894, 276607, 193509, 118611, 96751, 120430, 199531, 153725, 200459, 214063, 163613, 36518, -47982, -63839, -48196, -149417]
17672a49417P4874J51836l9340J02208N3680j11737q5010Q4739P5106l3764m3954
17661G9221j78251j3516K15372j16476O5053o8062j55758J08596K57720M7110
17651B41009Q8231o823j23391p6743l6001J03610n2787l3615J6755J6517K2584
17640A59346J40994j86239j62696J6382Q6878J02564j33021L2551K17288M2134
17630C16181j88912q2252Q9587N9021R3757l7711O8169m2275J2289o0400o7333
17619A60121j07798P540j3838Q1235R1416n1993j57793R4744j74581n0552J48419
17608B6920J23745K3934K8779p4373n3158k8885J00123j3833l9230j2873Q95J59524
17596B41568P545r2432k1457J16673K1813o7309j61074j40075j18764L7077K01925
$$ y = [-149417, -74543, 77293, 37953, 140161, 193841, 82104, -2906, 81833, 156939, 123175, 79221, -99030, -112546, 102826, -13650, 51403, -16659, -172417, -63821, 193899, 241009, 329240, 322417, 199026, 122283, 86282, 189892, 137105, 103490, 120245, 136762, 159346, 300340, 114101, -48595, -32213, 54665, 157229, 24208, 56759, 274047, 316181, 127269, 45017, 134604, 193625, 287382, 249671, 317840, 275565, 287854, 227454, 160121, 52323, 59863, 46025, 127260, 218676, 166683, 8890, 103634, -70947, -121499, 26920, 150665, 174599, 203378, 129005, 75847, 46962, 147085, 133252, 94022, 81149, 82044, 241568, 249113, 156681, 135224, 251897, 273710, 206401, 45327, -94748, -213512, -176435, 25490]
17585B5490J83745n5048J66303O8074j74506q5195j4930K5221P1297j04544p200
17574I8707J4334j30403n6370K1641K2407J15704n8383j52876M3995m9905J58604
17563B7455J86986m8021m4651m0451o1153p3276N758L5950M3636m5208O5908J18532
17551A71465J84382j87090k83438P9506J410K5094P7156k04186M8083J47798q781
17540E1399k57630O7871J89020J40111l6120k8717l0037P0331m1630k0908j56926
17529e3236O6527J08615J16314j49470p7679j54846q8564j5394P8593J84161Q6213
17518A01234O9095k8160p9869P7077K2030j12269o5704J12521N1171j07404j37827
17507i8105k4093m7920N0877J30188J78863L9518j70520n3054l2758J23675k2554
$$ y = [25490, 209235, 154187, 320490, 388564, 214058, 128863, 113933, 139154, 210451, 105907, 98707, 113041, -17362, -73732, -52091, -29684, 86020, 27637, -125239, -81244, -131149, 27455, 214441, 166420, 121769, 81318, 20165, -53111, -47353, -11403, 32233, -12975, 52933, 171465, 355847, 168757, -114681, -35175, -33765, -8671, 68485, -135701, -87618, 60180, 51399, -206231, -138360, 50660, 190771, 154651, 125934, 95897, 166228, 124598, 103690, -53236, 13291, 121906, 238220, 88750, 11071, -143775, -232339, -247733, -169140, 15021, 101234, 170329, 142169, 62300, 139377, 161407, 49138, -16566, 95955, 147126, 39722, -98105, -122198, -170118, -119241, 10947, 189810, 229328, 58808, 5754, -27004, 96671, 74117]
17496G4117l2883O1123J11765K620l6876K706L2037j19918l4049J40314j43795
17485E7161m4268l7990l9885M7899J20659J50649M2440j00592J13017k64760j73784
17474a29454O3745J87501j00417o7799n150K6925j5316q9846J51497P551n9094
17463b9857O3522K7796J10445j3883k1046J31107M0047j06038L7515O3736J01322
17452D04666m4991l8215M5937q3258j12340j5418n1876j79935J24617m3803j24921
17441a19537m1707j0113J59029K01344j6749q3036J0129J638J77766N3808j1928
17430C20644J3794O1885j11252k01909n454j29644l2852M0138r9063J76875K14107
17419B47269n7989j27348k8827r4918k41662m6594K73735K31387m6862l4604J41218
$$ y = [74117, 41234, 102357, 214122, 216742, 179866, 182572, 214609, 94691, 60642, 200956, 57161, 12893, -25097, -64982, -17083, 103576, 254225, 296665, 196073, 309090, 44330, -129454, -65709, 121792, 21375, -46424, -51574, -24649, -39965, -129811, 21686, 29237, -29857, 33665, 61461, 171906, 158023, 136977, 268084, 308131, 202093, 239608, 303344, 404666, 359675, 321460, 367397, 284139, 171799, 156381, 104505, -75430, 49187, 5384, -119537, -161244, -171357, -12328, 189016, 172267, 89231, 99360, 100998, 278764, 332572, 320644, 334438, 396323, 285071, 83162, 77708, -51936, -84788, -44650, -143713, 33162, 247269, 189280, 61932, 33105, -61813, -303475, -350069, -76334, 155053, 108191, 73587, 214805]
17408B14805r8809r7479J08846o5040l7057P8980m9796J6810p8207r2298N6926
17397d2319p1450P9618J06891J0804R2477j20595p1982j92664j01355K54117J49218
17386I2760L1426n8253p8247Q2381O9225j01573j20928J16406J59790n8003j79281
17375d4297J922O7328k5509L2997r3337J04917M5840l5777n649J12710R8016J1394
17363B70555k3838J0724P0574o8528q0322M5766o1590q9365q014N5467l5432J4112
17351A00109J16011M3814l0143Q5331L4580l1051n6676p6928k35334o1499j14
17340a11900Q3263L904J16950L8907j14689m4601N5107l4611l0005R4902o8840
17329a1613j5736Q4463k7155Q5831J70684J6676K4974k11266j62931R2803O6392
$$ y = [214805, 115996, 18517, 127363, 62323, 25266, 104246, 54450, 71260, -6947, -99245, -42319, -113769, -34151, 72740, 83544, 176021, 55426, -16556, -209220, -310575, -56458, 92760, 124186, 65933, -12314, 70067, 139292, 37719, -83209, 33197, 192987, 134984, -44297, -42375, 24953, -556, 32441, -60896, 44021, 89861, 54084, 48435, 161145, 259161, 270555, 246717, 257441, 328015, 259487, 179165, 224931, 163341, 73976, 65962, 121429, 85997, 100109, 216120, 259934, 229791, 315122, 349702, 318651, 261975, 185047, -50287, -111786, -111900, -28637, -24733, 92217, 131124, 16435, -28166, 26941, -7670, -37675, 57227, -11613, -27349, 57114, 29959, 115790, 286474, 303150, 328124, 116858, -46073, 46730, 113122]
17318A13122J63564L4125j36073q1309k2408r67m0564j03171K7409P0243O8772
17307I2743l3858j01047K2800J05054J87344K07761j49983p4305j825j1304o4612
17296A78768j39867R76J9694n2471Q2170J7159p7294j09349j05125N6370j3984
17285a42953j7042Q4389J09129L1890q0884j01405J42223O7189p7106o9387R6871
17274D2914N2999O0380k0770o6857j714Q1812l7905J3956L5120k93284j09894
17263b43243J34562J93290j85384m5748Q0581M6841q4707K2612K18415K43133
17253C80352Q3366p3970j13209j92363j17786J27440K70456q9849j76532p1511
17243B6394J9384k04439O187q6533J01818L8780r301P6664K86689l1485k00246
$$ y = [113122, 276686, 310811, 174738, 93429, 71021, 70054, 29490, -73681, -46272, 23971, 92743, 58885, -42162, -19362, 85692, 273036, 480797, 330814, 256509, 254684, 243380, 178768, 38901, 39877, 59571, 7100, 89270, 106429, 29135, -80214, -185339, -128969, -142953, -159995, -75606, 33523, 65413, -15471, -116876, 25347, 92536, 15430, -53957, 42914, 95913, 156293, 135523, 68666, 66952, 148764, 110859, 124815, 159935, -133349, -243243, -108681, 84609, -100775, -146523, -65942, -19101, -103808, -81196, 137219, 380352, 463718, 389748, 276539, 84176, -33610, 93830, 364286, 274437, 97905, 26394, 45778, -158661, -152474, -239007, -137189, -98409, -107710, -31046, 255643, 224158, 23912]
17232B3912M1490J02694K43706K4438j14051m111j37129l68461j27393K3491J77508
17221a13906R5126J50977J22524p0500r9467J2241M8623N5520l8430j81920O3309
17210D4097J8042J989j70270j00080J07825J07198m3831L7015M8113M5937l6748
17199E9287j40714J8534R9117M1073n8411J63027q4223m1814k1922N6951m4888
17188D6017j2011J1514J7014R711m9662j07842L8738p1104o8381R7449J33430
17177D4873p469l4421J21015N6665L3672r3566j16603J3527Q0996L9674j0382
17166A27981j67602j70532p8603n2460q2587J43454K11721K298N1539J21052j4939
17155I1322k3955L2672r8288K5900L4886J42466l7278j78730L4917K24888o1888
$$ y = [23912, 65402, 168096, 411802, 436240, 322189, 318078, 180949, -187512, -314905, -291414, -113906, -18780, 132197, 254721, 184221, 84754, 96995, 145618, 201138, 162708, -19212, 44097, 62139, 64128, -106142, -206222, -98397, 8801, -35030, 1985, 50098, 96035, 59287, -81427, -62893, 36224, 77297, 18886, 181913, 97690, 55876, 33954, 90905, 46017, 34006, 45520, 62534, 72245, 22583, -85259, -46521, -117625, -186006, -88557, 44873, 37404, 2983, 123998, 180663, 214335, 120769, 4166, 17693, 98689, 138363, 127981, -39621, -210153, -288756, -341216, -423803, -280349, -68628, -66330, -14791, 106261, 91322, 67367, 100039, 1751, 27651, 62537, 205003, 167725, -11005, 23912, 248800, 186912]
17144A86912k13724r8656n3443P7782l7125J38334L1572o0828J85779L3011j42923
17133D6691k83808J17940J24442R0078j2626L7530K0782M0599l0730J11620J44231
17122D06749j30277j07552n3704j10267N3929N3192r291J22748l1829j55129k4925
17111A3644K08678J26968k04791j77688n0595P5060N408P4801N4994N6307N6429
17100B39215K0026P0331p4858j09378K91m5458j5715n4809N7773J74235N0338
17089C11991j1485o8165k1601M8916o470j38560L371J32728q9076j24146j7443
17078B0060Q70j7239K43182P2560j12741o0540R0240p3465Q478J38240r4507L2778
17066B47916o6142j06117M7049J46262M2422n9424j32978o6734j59363N9859J13766
$$ y = [186912, -26812, -125468, -178911, -101129, -138254, 80, 31652, -29176, 156603, 189614, 46691, -237117, -119177, 5265, 95343, 82717, 120247, 141029, 181628, 150898, 262518, 406749, 276472, 168920, 115216, 4949, 58878, 112070, 102779, 225527, 193698, 38569, 13644, 222322, 349290, 144499, -33189, -83784, -8724, -3316, 71485, 126479, 182786, 239215, 259241, 329572, 254714, 145336, 145627, 100169, 84454, 29645, 87418, 261653, 311991, 300506, 232341, 210740, 259656, 253186, 114626, 117997, 250725, 161649, 37503, 20060, 20930, 3691, 246873, 319433, 206692, 146152, 236392, 162927, 171405, 309645, 215138, 247916, 181774, 75657, 122706, 268968, 311390, 251966, 118988, 52254, -107109, -47250, 66516]
17055F6516O1572j43471L2465M5920L1524J4453L1291Q3204n0648l2439L533Q009
17043A51929p457j56078j15099k0598N3374L837r3195j03974J07289J68764O1569
17032E0361q1973M7101n0318l3808j17596R2235O2599o3656m3566K3056Q3027
17021c2538J16928J3404k5267K4568o8605J5079j60009L9429p6297J10674J5607
17010b7027q2132p4197J72902L4158n8539r0511Q518N5313J32006L8879M3510
16999A52880l9288J8215n2446j51246K4473N5790J21973j5674m6837o9068l2273
16988c3501o944m3290k725R1832m9242J4661l5876J18659j1480j73515M2634m845
16976i3632J32613J10693P6334m3888j04634R3723M1163q5097o2915q0821J36102
$$ y = [66516, 128088, -15383, 17082, 63002, 94526, 108979, 140270, 223474, 172826, 140387, 143920, 151929, 144472, -11606, -126705, -147303, -93929, -90092, -183287, -287261, -179972, -11208, 50361, -31612, 15489, -34829, -68637, -186233, -93998, -31399, -95055, -138621, -115565, -32538, 84390, 97794, 72527, 97095, 28490, 43569, -116440, -77011, -153308, -42634, -27027, -109159, -183356, -10454, 23704, -34835, -125346, -116828, -61515, 70491, 109370, 152880, 113592, 131807, 79361, -71885, -47412, 8378, 130351, 114677, 67840, -1228, -33501, -40445, -83735, -86460, 5372, -43870, -29209, -65085, 53574, 42094, -131421, -88787, -93632, 38981, 149674, 226008, 182120, 77486, 171209, 212372, 127275, 64360, -16461, 119641]
16965A19641l3721j07564J4978N3025j76271L4975K22682K9216l076R7069j15867
16954A35087N3460N9548O5174l2155l6334j53789p2890Q6243Q0802o6564j00288
16943A8294N768J38007L8098j29712Q584N3535j4732j0665p5277k7548j38686
16932a34334J0259J20099J26140l4745j25922k78239K0343J37775J45033Q6894
16922G3303j8353N7530K0790j07100j37091j5437J65593Q8070n2686j04367j12246
16911a41994J19846J24938j9744J12350J71444n1408j49433j11430m6816J2644
16901B0397m4674k9259J49634q8048m0943J3814O7780k3882m8975k7663m8467
16890a00286L7662j8336M9445j43487R2943J7781m1370J24051J03642k1429k2446
$$ y = [119641, 85920, -21644, -6666, 46359, -129912, -94937, 127745, 156961, 153885, 250954, 135087, 188547, 248095, 313269, 281114, 244780, 90991, 18101, 104344, 185146, 118582, 18294, 24062, 162069, 200167, 70455, 79039, 132574, 117842, 107177, 31900, 4352, -134334, -124075, -3976, 122164, 87419, -38503, -316742, -296399, -158624, -13591, 73303, 54950, 112480, 133270, 26170, -110921, -126358, 39235, 127305, 74619, -29748, -141994, -22148, 102790, 83046, 195396, 366840, 315432, 165999, 54569, 7753, 20397, -24277, -53536, 96098, 8050, -32893, -19079, 48701, 24819, -24156, -51819, -100286, -62624, -80960, -31515, -175002, -82059, -64278, -105648, 18403, 122045, 100616, 78170]
16879G8170o2516r8087K7786J58679n1899m6711q5475N995j7561K0806M5590K9820
16867D597Q726n686j25398J3609J1181Q9780m2185N5682R0533J1371r8938j13230
16855i9958M606N5027R7566J48666J7270j95576P4544n6491K9232K3656M7323
16844A45865j9096m0456R3218O0971J6140m9054r7065m5858J12039J52038l2634
16833B96108q9695l1141n964p9148k10281o1444J55092J03839n9693j41483n9455
16822a83265j7156M8711P2971N8335P9416j18113J88527J04551m8956m5700L9843
16811A79164k7104q7102l3611P1104J19890j38493q9589l7765K5578J21587J33928
16800B37587j44513L095K1562j18468l8055Q2948O2691j71929q1725K856l477
$$ y = [78170, 15654, -82433, -54647, 104032, 52133, 5422, -80053, -74058, -91619, -70813, -25223, 4597, 13323, 7637, -117761, -104152, -92971, -3191, -45376, 10306, 100839, 112210, 13272, -99958, -95352, -40325, 57241, 205907, 223177, 27601, 102145, 45654, 74886, 98542, 145865, 126769, 86313, 179531, 240502, 256642, 207588, 110523, 64665, 176704, 328742, 296108, 206413, 175272, 169308, 90160, -120121, -181565, -26473, 77366, 17673, -123810, -183265, -200421, -151710, -78739, -20404, 59012, -59101, 129426, 233977, 185021, 139321, 179164, 152060, 64958, 31347, 102451, 222341, 83848, -5741, -43506, -17928, 103659, 237587, 93074, 96169, 117731, -737, -38792, 44156, 106847, -65082, -146807, -143951, -147428]
16789a47428N7315K30185K0058j70235O5693J38164n5223j19354j4902n3236m7735
16778i6698J13566J11191K1840j00533J05639r0200J6545N7648P2209J23624J42793
16767D77624j49024j25580o7199K3818j34755R8366m8487j8209J30081j933n154
16756A79548j2468L1352k2994j0697K1524J0354j1085j07544q0001J15432M7445
16745A60866q4131m1262r3795N3126r1176p0925J31111j57842K2649J72783P7392
16734G8796O3003k8114O1517O4360j90708k2938O040J9669k8096m4012m7744J0950
16722e7277l9242N5502l7339M8726J33128j59738O6244K45965j02192k50711J39331
16711D2397R4899o3347N910m4739m9011R429J63041K9059j24488K2489o8767k30333
$$ y = [-147428, -90113, 140072, 160130, -10105, 55588, 193752, 138529, 19175, 4273, -48963, -96698, 16868, 128059, 149899, 49366, 155005, 64805, 81350, 138998, 211207, 334831, 477624, 328600, 203020, 135821, 159639, 24884, 123250, 74763, 56554, 186635, 184702, 179548, 167080, 198432, 175438, 164741, 186265, 196619, 185534, 77990, -2011, 113421, 160866, 76735, 35473, -58322, -5196, -96372, -167297, -36186, -194028, -171379, 1404, 78796, 141799, 113685, 175202, 239562, 48854, 25916, 31956, 51625, 23529, -20483, -68227, -57277, -96519, -41017, -78356, -29630, 103498, -56240, 10004, 255969, 153777, -96934, 42397, 137296, 73949, 79859, 35120, -13891, -4462, 158579, 187638, 63150, 85639, 16872, -213461]
16699b13461j878R6033K2068j1779M8159J29199P8581p7399j00190P314R2885
16688F9532K1278l6147M030j01331j8394k6344L7930j00756j51848q166R0535
16677b19681L3049R319J6026n2651q136Q7698J42996N2976M2003L0817j87476
16666e3060r4857k2832J65033J09600r6606J7474k2272j21045L3552Q272n7585
16655a34326M2056q8626M1807l9395M2903J3548J04018J94185J0287Q4618o5913
16644B05162k3136j19463o6940M6351p8364n7053m9441k1619R2222L2961J24618
16633H5298l4522o9891m2212k6112M9014j4784r707M4969O9994j7501l249r6965
16621f5668q7563n9027m8383j8437O7537R4465m4303q3970R683K10733K65545
$$ y = [-213461, -215339, -119306, -97238, -109017, -60858, 68341, 146922, 69523, -30667, -23353, 69532, 90810, 54663, 58693, -42638, -61032, -87376, -49446, -150202, -302050, -310216, -219681, -186632, -177313, -161287, -213938, -222074, -134376, 8620, 61596, 103599, 134416, -53060, -147917, -170749, -5716, 103884, 7278, 24752, 2480, -118565, -85013, -76741, -134326, -92270, -180896, -139089, -178484, -135581, -122033, -18015, 176170, 186457, 271075, 205162, 182026, 62563, -4377, 41974, -36390, -93443, -142884, -164503, -72281, -39320, 85298, 50776, -19115, -61327, -87439, -38425, -53209, -62916, -17947, 52047, 34546, 31297, -65668, -153231, -212258, -260641, -279078, -211541, -117076, -161379, -245349, -235666, -24933, 240612]
16610B40612l713j66551j11431P8485l1988j61024J82980P6570P8724p5005l4286
16599G3373L6891O8633j06503p6428j18858q9093q2499j04460K9396J23449J08395
16588a37704L2355J6404k5536J94855J16481L1211o7063j91429n9607R1467P5812
16577G7246L4881J17253J20285k04312q9213n3857L8432N8442J110N7386J03775
16566B61428N8412j50931j10158J41363J11157o9838j13800j36147p8646j9970
16556a07130P6821J36642J69572l9327m2329j53804n0458M4777k6608n0498R7641
16545E5299k0621m2794P447m9044L8018J17773j9955Q373m7120q1246k64057q7223
16533c85150P0418K31668J08728n70J31439n6724J8238P3954l7867j00032N4687
$$ y = [240612, 236899, 70348, -41083, 37402, 5414, -155610, 27370, 103940, 182664, 107659, 73373, 110264, 178897, 72394, -4034, -122892, -211985, -294484, -398944, -369548, -246099, -137704, -105349, -88945, -114481, 80374, 196855, 228066, 161003, -30426, -90033, 1434, 77246, 112127, 229380, 349665, 145353, 56140, 2283, 40715, 99157, 100267, 157653, 261428, 319840, 168909, 58751, 200114, 311271, 241433, 127633, -8514, -87160, -107130, -30309, 106333, 275905, 236578, 194249, 40445, -10013, 34764, 8156, -42342, 55299, 34678, -8116, -669, -49713, -11695, 106078, 86123, 94496, 47376, -33870, -297927, -385150, -314732, -83064, 25664, 25094, 156533, 99809, 118047, 192001, 154134, 54102, 108789]
16522A08789j8832r5127Q2121R8321j30466q6495j07806j18397Q2238p1838O5288
16511a92204K18858K10752j18306j11438O57N4979P722j8499K1324N9205P9858
16500B12908n4755r3925n4436n4098r6157j71534k3404j6880J12123J41795J56364
16489E8001J03221m8610j23350m2805j11223N2790L5581m6563L364K9662j5707
16478a05639n999K9737N9406l6345J1863J36954L4660q9633n6252O2805q9854
16467d8297k9865J22410K30631j34222l67474j55791J75027k1358N7600j738n5803
16456b28880J08598N9454J42406K906j68454M8463K14643O1702P4084o6426k24863
16445B3633J39476L7336k00536j44135N868J51357j25852J1165K05374J10673
$$ y = [108789, 89957, -5170, 76951, 175272, 44806, -41689, -149495, -267892, -185654, -257492, -192204, 26654, 237406, 119100, 7662, 8319, 63298, 71020, 52521, 73845, 133050, 212908, 158153, 64228, 9792, -44306, -140463, -311997, -335401, -352281, -240158, -98363, 58001, 161222, 112612, -10738, -53543, -164766, -111976, -76395, -122958, -119594, -89932, -105639, -111638, -81901, -22495, -58840, -46977, 89977, 124637, 35004, -21248, 41557, -48297, -78162, 44248, 274879, 140657, -226817, -382608, -207581, -228939, -171339, -173077, -228880, -120282, -60828, 81578, 84484, -83970, -35507, 179136, 240838, 314922, 248496, 23633, 163109, 200445, -91, -144226, -138358, 12999, -112853, -101688, 103686, 214359]
16435B14359k324j44381j17550J9495J37167R6917J1869N3074k0112Q1180k34738
16424I4956r6357J8661K303n6296m6671l8875J4436M1854q5346k774J6641p9078
16412b16546m8714R3375R6471O681N9917M948j20409R482N9441N4183N1055k2825
16400B7059j04547j31411m2961j1030m1475l028J28515j4303J27986K14333J30517
16389B79655j13646k89180n9958J77585O7434M5735J7247P5160Q489k24613j40510
16378a56602o6680J67724J7035L171l5672l9600N4360P5764k02432j7405K16759
16367A6422J98771J3154j11992j02370J47750P3132j05777L7825R6681R3882Q7161
16356D44639j94937k12972M3615o980N8377j44299j20693j98706Q1181K30110
$$ y = [214359, 212035, 67654, -49896, -30401, 106766, 203683, 215552, 268626, 248514, 329694, 94956, -1401, 17260, 19563, -36733, -83404, -122279, -107843, -65989, -151335, -154109, -137468, -216546, -265260, -171885, -75414, -68733, -8816, -3868, -124277, -114795, -55354, -1171, 49884, 27059, -77488, -208899, -251860, -262890, -304365, -307393, -178878, -193181, -65195, 149138, 279655, 166009, -123171, -183129, -5544, 61890, 107625, 124872, 200032, 208521, -16092, -156602, -223282, -55558, -38523, -35352, -71024, -110624, -56264, 19500, -182932, -200337, 16422, 215193, 228347, 116355, 13985, 161735, 234867, 129090, 166915, 263596, 357478, 444639, 249702, 36730, 80345, 73365, 131742, -12557, -133250, -331956, -250775, -20665]
16346b0665J72487N1616j82527r0545J88L5167n7597j55253l7457J19116Q6642
16335g8828P5441K9309P9338N1960p8778j34026j5982j11391O0186K07609k5322
16324E9516p9692k00661j02498l0021o9685P0320J02381J65658M8023P9583K18411
16313B61335o16j20678l7081Q6579q9717l2950j89071k81673j27366m9506J21253
16302d59491J94829R8894J39167K11738J26343p3907k06010n2961j366R7230J11111
16291A85577o0552j27380M4763l7566j86101J99116J95731J57263O8733k14618
16281B24966k19746k0457r6050J00640L9258L2309q4121k10169Q4819J07537n3324
16270i4338q1200J3007P4627Q1083L4142J41971k9274K2788k44288k8065O8627
$$ y = [-20665, 151822, 203438, 20911, -69634, -69446, -34279, -91876, -247129, -284586, -165470, -78828, -3387, 25922, 105260, 157220, 78442, -55584, -71566, -182957, -122771, 84838, 59516, -20176, -220837, -323335, -353356, -423041, -352721, -250340, -84682, -36659, 42924, 261335, 260719, 140041, 102960, 189539, 99822, 66872, -122199, -403872, -531238, -580744, -459491, -264662, -165768, -26601, 185137, 311480, 237573, 31563, -21398, -22764, 74466, 185577, 125025, -2355, 42408, 4842, -181259, 17857, 213588, 370851, 439584, 224966, 5220, -15237, -111287, -10647, 28611, 60920, -23201, -233370, -148551, -41014, -94338, -175538, -162531, -87904, -6821, 27321, 169292, 140018, 162806, -81482, -109547, -40920]
16259d0920N8481q0657j09422m1072L5750q9910j6462K19913J27346j22432k36805
16248b96190j47444m4681J85980J30597N9220J19428j2518j67204j04011p4347
16238c51170m5030O4180J29527K48553J1237j87169k8261k0045J19713O90n1666
16227a09441l507j10342o4827L8006k9044P5865q7350J1482J45730K14123K3507
16216A04202j36028n7166P8732J27350j36825l11720l3220J65302J46286k8072
16206h1159J32588O2230j34771n1250r198J04960m272J15520k7383j87791j71812
16195b52338P9891J17320L8354L9876J35900j03713o6463L5469K47657J13577
16185C85530j10926p0525q9512m8216n8698j50039O1229N4847L1809J172k811
$$ y = [-40920, 17561, -63096, -172518, -213590, -177840, -267750, -284212, -64299, 63047, -59385, -296190, -443634, -488315, -302335, -171738, -112518, 6910, -5608, -172812, -276823, -351170, -396200, -332020, -202493, 46060, 57297, -129872, -158133, -178178, -58465, -57775, -109441, -112948, -223290, -288117, -250111, -279155, -203290, -290640, -279158, -133428, 80695, 104202, -31826, -88992, -10260, 117090, -19735, -331455, -364675, -199373, -53087, -81159, 51429, 113659, -21112, -72362, -81560, 23400, 19128, 134648, 107265, -80526, -252338, -172447, -55127, -16773, 23103, 159003, 55290, -11173, 24296, 271953, 385530, 274604, 204079, 114567, 66351, 7653, -142386, -81157, -26310, 5499, 6671, 3860]
16174C860P6181J435P4799l8589j56724k27874j512O8818J14873j52315N1644
16163a85404j9961J41359K27352l1208J27J49063K7077L669j33775j83952p0460
16152g6113N032O0624N4477j9499L1104j73874K3075J29146O418j4835O7573p5499
16140A7629M343K1062p7084j02808P6647n0034M5800K15686O3968j06405r9789
16129I015j04493J4021P9227K20931l1397n8680n7618J64045J018j43231m5421
16118D7417R6232o07k81991j59902j1793J21527Q3448O305M9255l4846l3323j58530
16106b76808J43173R3802l0419j6162R9367J39026o0877j24275J02834q5079j43724
16095a59142M6112N2133J04642L5916L7114p3091J7969j08359Q418L5934J29965
$$ y = [3860, 80041, 81476, 156275, 117686, -39038, -266912, -268424, -199606, -84733, -237048, -185404, -205365, -64006, 163346, 132138, 132265, 281328, 308405, 312074, 178299, -5653, -76113, -71081, -10457, 44020, 24521, 55625, -118249, -95174, 33972, 40390, 25555, 93128, 17629, 21972, 43034, -34050, -136858, -60211, -110245, -64445, 151241, 215209, 108804, 9015, -95478, -81457, -2230, 218701, 187304, 128624, 71006, 235051, 236069, 92838, 47417, 143649, 143042, -138949, -298851, -310644, -189117, -105669, -99364, -50109, -84955, -118278, -276808, -133635, -39833, -70252, -86414, 12953, 151979, 91102, -33173, 69661, -15418, -159142, -113030, -60897, 43745, 79661, 116775, 43684, 61653, -46706, -38288, -2354, 127611]
16084A27611J2339j31392k11913J22235r2090j6799o918Q1851Q3574Q8598J84593
16073B41689Q1832k3984r5940p6432n2114Q6336j5528k16883k0928J48827L3788
16062I0663n3654j1119L0490j25856j87114L8262M5975k1490o8931Q7570J14681
16051f0523O4866j7020k119M6264j24773m2951Q4266n9672l4265J55031L2119
16040D1223p4049j3779j18890l2380j02888J25630R5073m759j70060l7763J74027
16029a18615Q1901R997J76446Q0j62034j03634M2858J87504K03140p9757k31423
16018F463p8272l7965M6518N2996K121N1686J8837k7099j34957o3201R6336q753
16006g5290N674j5390J29376J35213M0260k75J11936j55105j62049k6651m0004
$$ y = [127611, 139950, 8558, -203355, -81120, -173210, -190009, -196927, -115076, -31502, 57096, 241689, 323521, 299537, 203597, 127165, 75051, 161387, 145859, -71024, -91952, 56875, 90663, 37009, 25890, 56380, -69476, -256590, -218328, -172353, -193843, -262774, -175204, -60523, 4343, -12677, -14796, 31468, -93305, -136256, -51990, -111662, -145927, 9104, 41223, -32826, -46605, -165495, -197875, -300763, -175133, -80060, -84819, -254879, -292642, -118615, -36714, -26717, 149729, 149809, -12225, -115859, -73001, 114503, 317643, 237886, 6463, -71809, -109774, -63256, -10260, -8139, 43547, 62384, 35285, -99672, -162873, -66537, -75290, -69616, -85006, 44370, 179583, 219843, 219568, 331504, 176399, 14350, -12301, -52305]
15995e2305m25l4576J03837Q6142j0549N1213r0424Q833K9621K8120J10830R406
15983B39723k5645j41128k22314n4139P0962J17957j20352j10015N2644L9888
15973a52419R5295j2176J59331j24192j41027J0901m4488l1403l692N8567J09966
15962g5337M6477N4054n9665m9902n9368P1632K2003j17785p1428K78499K50805
15951B89985O8782p1890r9558j2246j96970j69265j38481J16595L6225q344j7906
15940b03073J40137j074p4068R6109J26716p5639q6098L8885q4069j42640L4141
15929b30673j13701L7362J43521o3054p8208J66097J71478n2924n2455J66131
15919I3574l7847j58020J38441J9844p462j89775j29022m8992o9911j52540P0755
$$ y = [-52305, -52730, -87306, 16531, 102673, 92124, 143337, 52913, 61746, 91367, 119487, 230317, 239723, 214078, 72950, -149364, -203503, -132541, -14584, -134936, -244951, -192307, -152419, -57124, -69300, 90031, -34161, -175188, -164287, -208775, -240178, -243870, -185303, -75337, -28860, 25194, -34471, -84373, -143741, -72109, -50106, -167891, -239319, 39180, 289985, 358767, 286877, 187319, 175073, -21897, -191162, -329643, -213048, -176823, -185167, -203073, -62936, -64010, -138078, -41969, 84747, 9108, -76990, -38105, -122174, -264814, -230673, -344374, -307012, -163491, -226545, -304753, -138656, 32822, -20102, -72557, 93574, 55727, -102293, 36148, 55992, 48530, -141245, -270267, -319259, -389170, -541710, -470955]
15908d70955K15779J15846Q2202O7193J93940n3123j33466n955M0318k59882j04439
15897c12542J11808J47049p4643J5201J83865o0554J53889Q9676n2166P439j796
15886B07226l2496J3991j05376j00538j24214J71201N546k2490q1259k4827r909
15875a03145M4146n1059p7483n538O4007J29447M6699O8645K5842J2203M3831
15864A97595m4917N99R670o2693q6711j04391k352P4905n9513r5005M1751N6178
15852g4884j755l6960R6369J47401J10852n5512q9989o2280J34799k0407l9886
15841A07748l2500j66516p0343M5358M1411J05845j16180J1684o8204j41544M0496
15830b42745P8108L8168j7195J29427j3806j29178j7944k3502O8580M0294J30385
$$ y = [-470955, -255176, -139330, -57128, 10065, 204005, 150882, 17416, 11461, 51779, -208103, -312542, -200734, -53685, -128328, -113127, 70738, 10184, 164073, 253749, 201583, 209022, 207226, 174730, 188721, 83345, -17193, -141407, 29794, 35340, 12850, -68409, -93236, -103145, -58999, -110058, -187541, -193079, -129072, 375, 47074, 115719, 141561, 153764, 197595, 152678, 153277, 162947, 100254, 13543, -90848, -93200, -18295, -77808, -172813, -131062, -74884, -76639, -113599, -17230, 130171, 241023, 185511, 95522, 33242, 168041, 147634, 107748, 75248, -91268, -161611, -116253, -74842, 31003, -85177, -73493, -141697, -283241, -242745, -164637, -126469, -143664, -14237, -28043, -157221, -175165, -198667, -130087, -89793, 40592]
15819D0592M9389O6684j00109j61410n1503q6321J39503L3756j4738J34086J77091
15808B27020j20793k37065k8651j8680O6652o2129m0946j28373J5313J75137J19917
15797c2598K08200J15798j87788k15438j2944J97253O0715j84349P88q3111Q0402
15786e3072n859j6081O1191m4415n7369j11561L8950O7114J0626J26659J47621
15775A63804L160o1941L7297q7510r4771j22891j5064O1541N8660n569N5755N7698
15763E0169O7912Q523O8699L1869j12295J4974N1952N1195J00836M0110J52956
15752E26900J27084Q3990R1618L95554P53679Q86958J571304K435584L971917
15743A0844588N334374L233056p68868l706037n098388l811034k174714j175026
$$ y = [40592, 89981, 156665, 56556, -104854, -156357, -242678, -103175, -69419, -84157, 49929, 227020, 106227, -130838, -159489, -178169, -111517, -173646, -214592, -342965, -327652, -152515, -32598, 175602, 291400, 103612, -111826, -124770, 72483, 133198, -51151, -50363, -133474, -53072, -58931, -75012, -13821, -58236, -115605, -227166, -188216, -121102, -110476, 16183, 163804, 166964, 105023, 142320, 54810, -39961, -162852, -177916, -116375, -57715, -63284, -7529, 50169, 118081, 126604, 195303, 227172, 114877, 129851, 181803, 232998, 333834, 373944, 526900, 653984, 737974, 829592, 1225146, 1978825, 2865783, 4437087, 6872671, 10844588, 16178962, 19412018, 18643150, 14937113, 9838725, 6027691, 3852977, 2677951]
15735B677951p58073n50452l06555r8960j07424k07218M9514p4226k64621j06010
15725B53926L6219J25401m4173M8308o3674n1042L4646L8420P7101K4293j03578
15714C75847n8398r9430j70310M1951k9831K21267K38733j28586k04177j08746
15704G8320j00284N5454J59195K68n0337j24913k60931p3859N8565K03647P4693
15693A9818N8728K20101L9096j35823r5508N2289R00M6071k36035J2561j3402
15682c1204L4239M8548J55000J91972R338n7934O368j91435r3781j03328J61030
15671A28813J24621q3045j54769p4782l612J46800j29582L2911K00284j33895
15661E3744M8924J18462N9537j01842l9557j76981l1394N7707K3423J6069J9670
$$ y = [2677951, 1919878, 1369426, 1062871, 963911, 856487, 649269, 698783, 624557, 359936, 253926, 290145, 415546, 371373, 419681, 356007, 304965, 339611, 378031, 455132, 479425, 375847, 317449, 218019, 47709, 89660, 59829, 281096, 519829, 391243, 187066, 78320, -21964, 33490, 192685, 192953, 142616, 17703, -243228, -317087, -258522, -54875, 19818, 78546, 298647, 337743, 201920, 106412, 158701, 159601, 205672, -30363, -17802, -31204, 3035, 51583, 206583, 398555, 407893, 349959, 356327, 164892, 71111, -32217, 128813, 253434, 170389, 15620, -59162, -62774, 84026, -45556, -12645, 187639, 53744, 102668, 221130, 280667, 178825, 139268, -37713, -69107, -11400, 12023, 28092, 47762]
15650D7762P508L9043M2758r1602j83243R4326P3267J9810Q3518Q5280j5699M5988
15638B48716n8039J8464R8668j600p0748r4486O1162j49734j52951J7442N9474
15627b3632r5880j5478J700J49336n0693l4518J2082J5501Q2022J9360o4233L7123
15615C2690J03680m0539j06912J65397P1046R273Q1002Q984j28712j31878j50945
15604h6914n2530J42404K30522M9985r7341n1753r5571q5158l5242L0158O1202
15593I762j22217O7568m816j1877L4333m2456Q998L5564j11043M7891M4914j06362
15581a49741P5375J05900j08296o7717J34806J81439j40337o8375P112M6685m5430
15570b8579j04350o833J9544Q0107K3447R1109n6214j46133J3053L609O2681M8500
$$ y = [47762, 55270, 94313, 137071, 45469, -137774, -43448, 29819, 49629, 133147, 218427, 202728, 248716, 190677, 209141, 307809, 306209, 235461, 140975, 202137, 52403, -100548, -83106, -23632, -119512, -134990, -133290, 16046, -34647, -69165, -57083, -41582, 40440, 59800, -4433, 32690, 136370, 95831, -11081, 154316, 225362, 234635, 315637, 324621, 195909, 64031, -86914, -139444, 2960, 233482, 283467, 186126, 134373, 38802, -46356, -81598, -51440, 9762, -112455, -44887, -49703, -61580, -27247, -69703, -60705, -25141, -136184, -88293, -43379, -149741, -74366, 31534, -76762, -144479, -9673, 171766, 31429, -36946, -29834, 16851, -28579, -132929, -139762, -120218, -40111, -16664, 74445, 18231, -127902, -114849, -111240, -48559, -59]
15558e9k5845q0535j9663J2895P7667L7941R6464J56105m6300l26347n3489K3145
15546a48021K8627q8233k5523K05481L633k3223J96289j5579N0199p3883j91745
15535h1978r2293P8977L3809j40825J85743J9395j11162j1658K7432J04948K57899
15524B70287O264k26082j41742k5264J7398K818j16769N8643J17865j00351j77089
15513c14022Q992j3977O1025J94724K01951l2105M6322p2750L462j91075O0673
15502d6780K54595M2395l3971k1453l4838j34431M1949P1918p6111p6128n2020
15491f4875j34526L4104J58050J03634L909j46159j70391P9886L1613j06206L498
15480b07463J33215p6830j90108L8760J26358J13250J88232P1347l024O8873O4425
$$ y = [-59, -25904, -106439, -126102, -113207, -35540, 2401, 98865, 254970, 208670, -117677, -171166, -148021, -119394, -207627, -233150, -27669, -24036, -47259, 149030, 133451, 183650, 109767, -81978, -174271, -95294, -61485, -202310, -16567, 2828, -108334, -119992, -92560, 12388, 270287, 276551, 50469, -91273, -116537, -99139, -96321, -213090, -154447, -36582, -136933, -314022, -305030, -319007, -257982, -63258, 138693, 106588, 152910, 80160, 83622, -107453, -46780, 207815, 250210, 216239, 194786, 159948, 25517, 67466, 139384, 63273, -12855, -64875, -199401, -165297, -7247, 96387, 100296, -45863, -216254, -136368, -104755, -210961, -207463, -74248, -151078, -341186, -302426, -176068, -62818, 125414, 196761, 193737, 262610, 327035]
15469C27035M0432Q52j4608j28543r6207j03249J2200P8393l6924k39381j48670
15458c08670J34928K4141q0252O6695Q4006K9266J81585J54105Q2964N7986j05576
15447C21178k56734M1811R2788J8991j19088p4322j19364p921O8221R4577J25887
15436A86024k61102R130M8458m7370m7042J83563p1069j8881J99313M6834l01832
15425g3974p2074L68R4357N1899P0514M0622J00277j900j49591j819J46580M9318
15413B54577k7950k09081j00191J4288J29531J55071r4459k03436j43792K988
15403b22454m6477O0855J98000P6675K7478o4811j08332j85382m0489K4116J68025
15392a12796p1118j13056K15365J27171R5370R4649j24047j71754q2812J73134
$$ y = [327035, 367467, 368319, 353711, 225168, 128961, 25712, 37912, 116305, 79381, -160000, -308670, -173742, -149601, -229853, -163158, -79152, -49886, 131699, 285804, 368768, 426754, 321178, 64444, 106255, 199043, 218034, 98946, 24624, -94740, -102661, -34440, 60137, 186024, -75078, -65948, -17490, -64860, -111902, 71661, 592, -18289, 181024, 227858, -73974, -146048, -145680, -51323, 576, 71090, 111712, 211989, 210089, 60498, 58679, 205259, 254577, 226627, 17546, -82645, -68357, 61174, 216245, 121786, -81650, -225442, -222454, -268931, -208076, -10076, 66599, 94077, 29266, -79066, -264448, -304937, -280821, -112796, -183914, -296970, -81605, 45566, 140936, 235585, 111538, -60216, -143028, 30106]
15382C0106j11382j57124K3236p1859n0304K91593J88033p5549p3017N2773J54173
15371B00679M7113k7564j68807K8306n4924k13477J8179J90364L8391j08876n8770
15360a09386l6476O1406O0431j5118P1990o152j26705J3159p4647q9185q4294
15349c34977K03946J00786r6867J29273J17450L4784j37943Q9948J13417l8966
15339A80851j38484Q0699j53797N0493J41059j59072l2281J04375m7201p0254
15329d3612J41174o909j22395j21866L3760L0906J6995N9556j17334N9099k2298
15318i2924n3476J8067R7170Q6655k26312j47442J44027j8224p2632K05679K11825
15307A52413K1115j52436j18274j25908L3645J9784j19912J03286J12966k8969
$$ y = [30106, -81276, -238400, -215164, -287023, -337327, -45734, 142299, 66750, -6267, 46506, 200679, 247792, 220228, 51421, 79727, 24803, -188674, -170495, 19869, 58260, -50616, -109386, -145862, -84456, -24025, -39143, 32847, 26695, -100010, -86851, -161498, -250683, -334977, -131031, -30245, -127112, 2161, 119611, 154395, 16452, 106400, 219817, 180851, 42367, 123066, -30731, 19762, 160821, 1749, -30532, 73843, 26642, -43612, 97562, 90653, -31742, -153608, -119848, -88942, -71947, -12391, -129725, -70626, -92924, -146400, -128333, -31163, 55492, -170820, -318262, -174235, -192459, -265091, -59412, 152413, 173528, 21092, -97182, -223090, -189445, -169661, -289573, -186287, -73321, -102290]
15297a02290K9150R9876L1560N1131L9264r665m139j00171Q853j27216j04132
15286a87779J36430L693L9621Q9553j92323K8886l1426N982J08212j2832J01540
15275H9557l8258r9926j5302L0971o7153J21604O8363k7655Q5337k9646m4090
15264G3802j37800r6932j31480O0829J02279n8909J33948j16228J69467L2335
15254C1311J3280L5968k10402k1074L8498p4835l3880J13559j1220m9241J76177
15243H141J41975K9158j77569M9157p8453l5946K25756Q8648k14291J29615K34149
15232D00340k1416L0400j29413k0536N4207r7467k28266o9585K2108J2179j2057
15221e9506o2951K5870Q0166m5843l9778O5162J05358k7917j4642j18664j45030
$$ y = [-102290, -73140, 26736, 58296, 109427, 148691, 139026, 134887, 34716, 43569, -83647, -187779, -51349, -47656, -8035, 81518, -110805, -81919, -113345, -107363, 849, -11983, 89557, 51299, -48627, -63929, -32958, -100111, 21493, 89856, 62201, 147538, 117892, 73802, -63998, -160930, -292410, -231581, -129302, -188211, -54263, -170491, -1024, 31311, 44591, 80559, -129843, -150917, -112419, -187254, -221134, -107575, -118795, -168036, 8141, 150116, 179274, 1705, 50862, -27591, -63537, 162219, 250867, 36576, 166191, 400340, 378924, 409324, 279911, 259375, 313582, 216115, -12151, -81736, -59628, -47449, -59506, -122457, -96587, -16421, -62264, -102042, -36880, 68478, 40561, 25919, -92745, -237775]
15210b37775p948o9296r0157J55981J07780J28220m5728k8092O7062J18297K8851
15199A27195k11445o1869K0457Q0025r3641j30345J13701K3198R6099l3534j38045
15188b08204N519j07616m9872j5536K8874J14903M169l1578Q1075J45410O2824
15177B9968o5448n1660M2821j89337Q6690K540J01298j3474j12118J1416l3785
15166a91089o4653p0745K19256K17920L8821j98986l6336M7406j1748Q9699J09356
15155A48901p5744q3349j21847J20620J56542Q1308l2685k2691N6902p9658j00845
15144D7454p7223j41933J03785J0272K44393k4933k46685M2837L3084K6823Q7344
15133A05218k6506O8659J3780k29122j15168L876J67559P4439K1514J63982O3970
$$ y = [-237775, -245723, -315019, -405176, -249195, -141415, -13195, -58923, -87015, -19953, 98344, 127195, -84250, -146119, -125662, -45637, -139278, -269623, -155922, -132724, -36625, -70159, -208204, -202685, -310301, -360173, -375709, -346835, -231932, -227763, -259341, -178266, -32856, 29968, -35480, -87140, -44319, -233656, -146966, -144426, -43128, -56602, -168720, -157304, -191089, -255742, -326487, -107231, 110689, 149510, -49476, -85812, -38406, -50154, 39545, 148901, 73157, -10192, -132039, -11419, 145123, 226431, 193746, 171055, 227957, 148299, 47454, -29769, -171702, -67917, -57645, 186748, 161815, -84870, -42033, -8949, 17874, 105218, 78712, 147371, 161151, -67971, -183139, -179263, -11704, 62735, 84249, 248231, 312201]
15122C12201j14782j66105j23328k5883j7554N7424L3482l01123k5610J12357
15112b58921J16980l8716j32905j24604K35573M5705K31891R7733Q180q7096r6775
15101b955m1710q2957j7381M4538P0146j20688o0118m5653j44577K04685J17984
15090g8686J37401j08449m471J4642m1107q612j9514k2178l1550k17796M8061
15079c32259o7171Q7583K0669J59918K68863l3090j63404o7896Q4258L3564J27473
15068A18508j01138n6073N9022r7393k40376j4952J53080J36337j8714j01600
15058a63299P7507j030o2490j19168J8352J12182J08461J85599M7019o254j71326
15047B5553k03819k6475o7736l8088N8606r3211j47688M5141K19117r694M6249
$$ y = [312201, 197419, 31314, -92014, -117897, -135451, -78027, -44545, -345668, -371278, -258921, -141941, -180657, -313562, -438166, -202593, -156888, 75003, 172736, 180916, 93820, -2955, -44665, -127622, -145003, -100465, -30319, -151007, -211125, -256778, -401355, -196670, -78686, 58715, -49734, -54205, -39563, -80670, -89282, -108796, -130974, -162524, -380320, -332259, -399430, -311847, -291178, -131260, 137603, 104513, -58891, -126787, -42529, -8965, 118508, 17370, -38703, 20319, -77074, -317450, -332402, -179322, -42985, -61699, -163299, -85792, -86822, -149312, -268480, -250128, -137946, -29485, 156114, 203133, 196879, 25553, -178266, -204741, -272477, -310565, -251959, -345170, -492858, -447717, -228600, -238294, -192045]
15036a92045n898J9506N1818n5299n7756p7684K61566R7411N6551O3270j74297
15025a2857o8203L8752R8325o4496j42511J43080J04117j78112q4215J91111K31989
15014B56980M0344j45294l6258r0600Q7159N0824q9083j26510j58231l2312R2538
15003a50443J07849j01223j72250J61172M7100j53424j46450R6764L04770Q4331
14993G8196j54778j84796m0515J06180J83240p0941j39340J09756K9185J21816
14983C8003J81674N9483j31698L593P5381M459j66765j37259K3199O7023J9988
14972C7081j3498j23056n0425N0204P0901J25507J34235j05171o8466P2643j8314
14961A11641M1972j40094O3856o6698n753J9272n7258J44751r3516j31890r9685
$$ y = [-192045, -197943, -178437, -126619, -181918, -239674, -317358, -55792, 41619, 98170, 161440, -12857, -81060, -42308, 56017, -8479, -150990, -7910, 96207, -81905, -166120, 24991, 256980, 297324, 152030, 115772, 25172, 112331, 163155, 74072, -52438, -210669, -242981, -150443, -42594, -143817, -316067, -154895, -107795, -261219, -407669, -310905, -6135, 78196, -76582, -261378, -301893, -195713, -12473, -83414, -222754, -112998, -83813, 38003, 219677, 279160, 147462, 151055, 226436, 230895, 64130, -73129, -49930, 17093, 37081, 23583, -99473, -149898, -99694, -28793, 96714, 230949, 125778, 57312, 129955, 111641, 153613, 13519, 77375, 10677, 4924, 24196, -33062, 111689, 18173, -113717, -213402]
14950b13402J14692J85150l5329P3798J769M24R5644K32876p0403j76715l43544
14939a35040j08556J38912J49949L4821q4736j54304m4922l5870J37726K7190
14929g4830J0569O9783j39844n6930j5812l295P4819J15065N3962l0986p5448
14918g2947n7301J63942L8155N0740p1600k25738O4698J02838J1289j17049j9002
14907a31975J83554j0606n4045L2405o7484p919P3399J27391L8681O8957k21884
14896C0474j1156J54013n4608p9840M6350r5061m3770n3085P9916K5505L4462
14885C3200K24557k2632o2864n9105r6209J29430j2246r4823j7289J12067K5878
14874A59964j07534j9575j01999p5494L01838J30466J7984j4791r0640j00493
$$ y = [-213402, -98710, 86440, 51111, 124909, 126678, 127102, 222746, 455622, 385219, 208504, -135040, -243596, -104684, 45265, 80086, -4650, -158954, -203876, -239746, -102020, -74830, -64261, 5522, -134322, -191252, -207064, -210359, -135540, -20475, 33487, 2501, -72947, -130248, 33694, 71849, 122589, 50989, -174749, -110051, -7213, 4076, -112973, -131975, 51579, 40973, -13072, 19333, -48151, -56070, 17329, 144720, 183401, 252358, 30474, 19318, 173331, 118723, 38883, 85233, -9828, -53598, -106683, -26767, -1262, 33200, 257757, 235125, 172261, 113156, 16947, 146377, 134131, 39308, 22019, 134086, 159964, 52430, 32855, -69144, -144638, 157200, 287666, 305650, 290859, 200219, 99726]
14864I9726q8213q0332j7268Q9406O8918o1976N9459O7512m3223q6444l2321K26116
14852B01360j55611j27023J06054p0360k7271j86259o1622J85247Q8265p6391
14842a23611R6057o113K3372r3305k0421Q6598p5719J6643K2499j9904j09325
14831b03229N101M660o7951J6103P2989J25746j04832r4284J49949J67610Q7975
14820A59837O1044l619K4076j9394j89687j73346j55614n4135L8920r4059q1507
14809d87484J86871P9251q1638n1760p5764K0870K31720m8873n5716N7701M2557
14798a82265P6753m5696J3107j08111O003N2593P1198n6627n1078L734J39962
14787h0427n142J08916J37985j4909k14139j15398k9979J43667R1166R2740k4155
$$ y = [99726, 11513, -68819, -86087, 3319, 72237, 10261, 69720, 137232, 94009, 7565, -24756, 201360, 45749, -81274, 24780, -45580, -72851, -259110, -320732, -135485, -47220, -123611, -27554, -33667, -10295, -103600, -124021, -37423, -113142, -96499, -74000, -93904, -203229, -198128, -193468, -261419, -245316, -172327, -46581, -151413, -245697, -95748, 71862, 159837, 220881, 217262, 241338, 221944, 32257, -141089, -296703, -350838, -311918, -405977, -487484, -300613, -221362, -303000, -354760, -430524, -409654, -177934, -226807, -282523, -224822, -182265, -105512, -151208, -138101, -246212, -240209, -187616, -116418, -173045, -224123, -220389, -80427, -85569, 23347, 161332, 146423, -67716, -183114, -213093, -69426, 21740, 114480, 90325]
14776I0325k14113j31742J52290Q5167j73558J18427J88415k2397k02458j420
14766a11064J48486L7240j78417j79068P0896L1865Q7819J17815O1842m3059j43846
14755i9491n3286M0819m2030M1700L5901q1368o4480l1737J83988K02826J5181
14744A48023M0552J76373k11642j38072L2554j23823K78J04313j8000p6805K6628
14733c9621N5071n5218L9190N6348M207j6494l2275K4683L0459P6614j99427o0195
14721a16658L2837j017l1567j1888L7521l5864j43024K6990J9384n2082N8889
14710b16479O4161Q0474N8594K57681r8735k55956O538M0504P9327K36242l2463
14699B19888j03469o0467n6288j01388J09703k6049n063Q858O9417m379j12631
$$ y = [90325, -123788, -255530, -103240, -18073, -191631, -73204, 115211, 92814, -109644, -111064, 37422, 74662, -103755, -282823, -211927, -180062, -92243, 25572, 87414, 44355, -99491, -152777, -111958, -153988, -112288, -76387, -157755, -222235, -253972, -69984, 132842, 148023, 188575, 364948, 153306, 15234, 47788, -76035, -75757, 28556, 10556, -66249, -39621, 15450, -39768, -578, 55770, 59977, 43483, 11208, 35891, 66350, 142964, -56463, -116658, -83821, -84838, -116405, -128293, -90772, -126636, -269660, -242670, -223286, -275368, -216479, -152318, -71844, -13250, 244431, 145696, -110260, -103722, -63218, 16109, 252351, 219888, 116419, 55952, -336, -101724, 7979, -18070, -23133, -14275, 55142, 50763, -61868]
14688f1868n3676j07180L9258J24051P6720J00369j0346j29462j73058n2498J64959
14677h2731P7645J45364k2500j46190m4190O8892n1710j24607L2846l9771p6443
14666b63395M626Q1301J20260J18584j22266M2704J2153r3531K9106k4652j40956
14655b36066K754K36372K6260p0841N1887j90298j13613J20521K56796n3505j1698
14644A8569m902J3968Q911n6858m7201r954j9073L6977j73815j14863p2773j417
14632d22431J82199J24719r3319j08900O137L3771J64457o397J9628J01647j29967
14621a28456j96117J253K04901Q5621j84943m8802J03760J39774q264j7415J5642
14610c3046m66J37312K8233l5752Q9317p6089q7373O0537r3026j54757L9594Q4048
$$ y = [-61868, -115544, -222724, -183466, -59415, 17305, 117674, 107328, -22134, -195192, -247690, -82731, -5086, 140278, 117778, -28412, -72602, -3710, -55420, -180027, -147181, -186952, -263395, -258769, -177468, -57208, 61376, -60890, -18186, -6033, -99564, -70458, -95110, -236066, -233312, 3060, 29320, -41521, 10366, -179932, -293545, -173024, 83772, 30267, 18569, 13667, 27635, 36546, -20312, -67513, -77467, -96540, -59563, -233378, -348241, -421014, -422431, -240232, -115513, -208832, -317732, -311595, -277824, -113367, -119764, -100136, 1511, -128456, -324573, -323320, -118419, -32798, -217741, -266543, -162783, -23009, -31273, -48688, -33046, -33512, 103800, 132033, 96281, 185598, 109509, 22136, 82673, -10353, -165110, -125516, -41468]
14598d1468J8597n939o1280N6507p1728J2011n6275j8866J20876L1494q6581j51551
14586b54203J08110K25188P1052l9973p0998L1015l0518O8390N5273J8676k38410
14575e6398j04314J03134Q4761j5599o7784j65318L8236L1153n5166J30151K6534
14564e0610N258j25029Q8454o1405r8247Q29k1605R9838L2414R6155o3032m0731
14552a37711O9126O8971m8201r3266J15611j44765j23561N7950J33054J74474
14542G1682n2424r8966m230J3900j19228j61604q6734J50386l0678l8531l1291
14531c87718J64933J94118J21271j62265j37440J1874L3740O2249Q1842J9238
14521A842J62031M3543N8302r5570l0439p5240r8584L881p5121l1053L3157J31491
$$ y = [-41468, -22871, -28810, -90090, -33583, -105311, -93300, -149575, -168441, -47565, -16071, -102652, -254203, -146093, 79095, 150147, 110174, 39176, 70191, 39673, 108063, 163336, 182012, -56398, -160712, -57578, 27183, 11584, -56200, -221518, -183282, -152129, -207295, -77144, -50610, -45352, -170381, -81927, -143332, -241579, -240750, -262355, -162517, -130103, -33948, -96980, -137711, -68585, 386, -47815, -141081, -25470, -170235, -293796, -235846, -102792, 71682, 19258, -79708, -83938, -70038, -189266, -350870, -437604, -287218, -317896, -356427, -387718, -222785, -28667, 92604, -69661, -207101, -195227, -161487, -99238, -17396, 1842, 163873, 207416, 265718, 170148, 139709, 64469, -34115, -30234, -105355, -136408, -103251, 28240]
14509B8240O4991j10232j876J1619L647q2150J0327J09634L6582p357J05409j33621
14497C5213l6817J05491p7276J01084m4035m9599q868p9139j47078L7387J38239
14486b5398K0942Q3399m8428j50607k6780n274J44500p7946j09479m3259N2840
14475a85490M3582j5210q4832R4704R9885J40323k7122l0989j8752n0960j00362
14464a35223J10684Q2073k4048p4167n5939o7846J4236M3123M6619K02736m0286
14453A01962k28175j02537l0042j4731J0621j27733J31187J71655P7579l3505
14443d3719j72672r9611J11757J24883q7849Q3833N5207L5492J30630M5093r1633
14432I1411j95549R9804m5661L2817m9454q7083p1760K2468K972r496j5866Q7274
$$ y = [28240, 93231, -17001, -18877, -7258, -3611, -85761, -75434, 34200, 70782, 63425, 168834, 35213, -1604, 103887, 26611, 127695, 83660, 34061, 25193, -53946, -201024, -163637, -25398, -4456, 78943, 30515, -120092, -146872, -152146, -7646, -85592, -195071, -238330, -185490, -141908, -157118, -241950, -147246, -47361, 92962, 65840, 34851, 16099, -34861, -135223, -24539, 57534, 33486, -40681, -96620, -164466, -150230, -107107, -60488, 142248, 101962, -126213, -228750, -258792, -273523, -262902, -390635, -259448, -87793, -10214, -43719, -216391, -316002, -204245, -79362, -167211, -83378, -28171, 7321, 137951, 183044, 91411, -104138, -4334, -49995, -17178, -66632, -153715, -225475, -203007, -200035, -209531, -225397, -138123]
14420a38123J44460O7402K3557k614j26496j56933j23106r5354m7526N6675o5264
14409d63322Q1321j8693R6182J16120J71524J00193j15876q9485j28891p721N2420
14398b06228J04672J77867P9846L1036j7775J08066N7435j9286j01720j50419
14388F3494j18637N9802J45846j2954k1398m5515K279M7536J6524k83444L4669
14377a11798R6555J82535J6450j25377j16140k54034m4554Q0879J02447K58977
14367H5940K5088r9665N5966l4684j43629J1396R2417O7171K5479p2218n6276
14356d3015j8025J58560j28063j91069J60246Q7605j1692k39448j46721J05571
14346b66051J22903O6807J34665L3276M8087j2848K0497K105J03772r7257r9393
$$ y = [-138123, 6337, 73739, 97296, 94682, -31814, -188747, -311853, -407207, -454733, -398058, -463322, -382001, -400694, -304512, -188392, -16868, 83325, -32551, -122036, -250927, -258648, -206228, -101556, 76311, 156157, 187193, 169418, 277484, 334919, 315633, 213913, 63494, -55143, 4659, 150505, 137551, 116153, 70638, 72917, 120453, 136977, -146467, -111798, -15243, 167292, 183742, 58365, -57775, -311809, -356363, -275484, -173037, 85940, 111028, 11363, 67329, 32645, -110984, -99588, -7171, 60000, 85479, 13261, -43015, -61040, 97520, -30543, -221612, -61366, 26239, 14547, -224901, -371622, -266051, -143148, -76341, 58324, 91600, 139687, 126839, 147336, 149441, 253213, 155956, 56563]
14335E6563j70955j35405M6293L7822L9100K44o5740P5432J82575k6373j09365
14324f9809n4887q1800j1300O4888R9101M9056n0701o6887Q2944j02308k3742
14313a65445P5685O7717J95299N6661l8393j55916q566M2860l7746o7624N074
14302c0394m0432l8227k4382M7668L6954N9813l3323O5319M0538o8825o7053k2127
14290g4471p2444j52542k0869J96180j13320r8814J71312q861J14646J23459n0432
14279A3844o9564n5083P889J74620j6087j03254R603K01165R6549j71637j84706
14268i6661j57029k4509J00711P6957J45632j61751k01257K7723l3848k4342R1262
14257b57112P9615J17725J04017N6279L392l7052p9431l3378M0412N5451O9844
$$ y = [56563, -114392, -249797, -203504, -165682, -126582, -126338, -192078, -116646, 65929, 39556, -69809, -124696, -206496, -217796, -152908, -53807, -4751, -55452, -122339, -39395, -141703, -165445, -89760, -22043, 173256, 229917, 191524, 35608, 27042, 69902, 32156, -35468, -30394, -70826, -109053, -133435, -85767, -48813, 11000, -22323, 42996, 83534, 14709, -52344, -74471, -146915, -299457, -320326, -124146, -237466, -336280, -164968, -173829, -59183, 64276, 13844, -55720, -110803, -102914, 71706, 55619, -47635, -38032, 163133, 259682, 88045, -96661, -253690, -278199, -177488, -100531, 45101, -116650, -317907, -290184, -324032, -348374, -257112, -177497, -59772, 44245, 100524, 103916, 66864, -12567, -45945, -5533, 49918, 119762]
14246A19762j24889j35428J17570m2369k7341l2937J25104k6863m5780J03152
14236B9981J6554j45790r909K5076j30019n2659M160J93540J36598j36177M2160
14225b6485R8551K4775R510J4862k7391q4693j0540j4054L3552j22148k3082Q3125
14213d4018J05410p6156j45167j26322O540n8829l3910J04273J13671N4740P2617
14202b7151J7506j88255J6777j17708n9228J23347N6081R0425R6382L1328J19414
14191A58918O0159n9655o4717j01811o575J10200j02640j71614j15327J28280
14181a64782J32864L16750L0933N6798n6872j63725k22479p8982o694O7443L8536
14170e0210n6899r5956N6229O6147o8742q840J2762N1828m6053M4288J7616k9896
$$ y = [119762, -5127, -140555, -22985, -65354, -92695, -125632, -528, -27391, -73171, 29981, 46535, -99255, -109164, -84088, -214107, -266766, -262606, -69066, 67532, -68645, -26485, 72066, 96841, 106351, 121213, 93822, 9129, -1411, -15465, 18087, -104061, -127143, -44018, 61392, -14764, -159931, -286253, -279713, -338542, -372452, -268179, -154508, -99768, -27151, -9645, -197900, -181123, -298831, -358059, -234712, -178631, -88206, 8176, 39504, 158918, 219077, 159422, 94705, -7106, -13681, 96519, -6121, -177735, -293062, -164782, -31918, 284832, 315765, 372563, 315691, 151966, -70513, -149495, -156189, -88746, -50210, -107109, -203065, -146836, -80689, -149431, -158271, -145509, -93681, -139734, -95446, -77830, -107726]
14158a07726J6117L0006K4426l5535r6025j4477J73391M7292j36352M6808J2836
14147c9239Q7756j44829Q254P5290J20924r5945k42711j08831N7429J47320l1044
14136a65626L1181P4231m8800o7758L8683P9425j1289m2088J00680p8554j35813
14125b25728M550N4541M8242j25751J56393J23076P1756j3059m9315j04948k5354
14114h5597J07324k8801q9308j1517n0927m991J10869J51881j19455m3459J40062
14103G6081q1740k59166k18247N9986J85395K27633n6100j16835o7848M7428J50098
14092e3315J20320L7426n4193j36734p1817j05793J919N2996J71173q305l287
14081d9610O2487K5540O0193n8027k9312Q6136O2337N3511J8767j15669k505j6571
$$ y = [-107726, -91609, -61603, -37177, -72712, -168737, -183214, -9823, 37469, -98883, -52075, -39239, 48517, -96312, -88058, -12768, 108156, 12211, -230500, -339331, -281902, -134582, -165626, -134445, -60214, -109014, -176772, -138089, -58664, -69953, -112041, -11361, -89915, -225728, -221178, -166637, -118395, -244146, -87753, 35323, 107079, 94020, 44705, -60243, -85597, 21727, -7074, -96382, -107899, -158826, -163817, -52948, 98933, -20522, -63981, 76081, -5659, -264825, -483072, -423086, -237691, -10058, -66158, -182993, -250841, -203413, -53315, 67005, 104431, 50238, -86496, -158313, -264106, -262187, -209191, -38018, -46323, -49610, 12877, 38417, 98610, 40583, 11271, 97407, 159744, 213255, 232022, 116353, 113848, 97277]
14069I7277j74229j70630m3200J25045J18144l5307R413K653P436l7661j17256
14058b18315O907J15330J64279q6023n5507j01458N6398r7415n6462N626J30132
14047a36508o2807m6800J28159K09800j34553j17655j6159Q8937O4648o9589J65145
14036G2618J29577o0155j0709K2780k491K5673j25660r4235N6334O858J63841
14025A84431Q3451j87404K5235J016j7754j5793L3727k7758q3594n311K8083j83743
14013a65414k7786P4048L8473j86588M715J9614J63207M8222J05198J18734Q6879
14002B79302l4283j14763q4399j01128n8019j22704L271J34366J44288l5228m3791
13991c3088j6478l2898Q9345m1232l9882J8883Q9573j61350o9920J41053J9327
$$ y = [97277, -76952, -247582, -290782, -165737, -47593, -82900, -73487, -70834, -63398, -101059, -218315, -211408, -96078, 68201, -17822, -73329, -174787, -118389, -215804, -272266, -266640, -136508, -199315, -246115, -117956, 91844, -42709, -160364, -176523, -87586, -22938, -92527, 72618, 202195, 142040, 131331, 154111, 151620, 177293, 51633, -42602, 13732, 20590, 184431, 267882, 80478, 105713, 106729, 88975, 73182, 106909, 79151, -4443, -9754, 18329, -165414, -193200, -119152, -80679, -267267, -262552, -242938, -79731, -31509, 73689, 192423, 279302, 245019, 130256, 45857, -55271, -113290, -235994, -232723, -98357, 45931, 10703, -33088, -49566, -82464, 6881, -34351, -74233, -55350, 34223, -127127, -197047, -55994, -36667]
13980c6667R1415r1211j22377R5541R5937k4002Q3071o696j44285M663Q343l4152
13968h0420n5578j43055K1450P0085J7139N2984O801N5678n2418j21961P7220
13957a52075j47757k4095R2297J65836O2756K6942j05707p6391J36000J08000
13947H5806K6227n6827j8389P3454j48118o6127N3560L7213M316k5342k9968j59300
13935b23495J0263l9086P4313J62894M2009p732l2764J49446j32490n4510n9350
13924a10502j4352K1001j09319K8168k0524J13209P4009j60951J99831K08308
13914B28878j74020j59380M4180k4305k4229q76M4275j8189p4413m0553j47729
13903c46361K0304M4632M3762J57470J10492J30666J51739j26656o1423j5658
$$ y = [-36667, 54748, -36463, -158840, -63299, 32638, 8636, 91707, 85011, -59274, -54611, -46268, -80420, -135998, -279053, -257603, -187518, -170379, -117395, -110594, -54916, -107334, -229295, -152075, -299832, -323927, -231630, -65794, -3038, 23904, -81803, -158194, -22194, 85806, 112033, 55206, 36817, 110271, -37847, -103974, -50414, -13201, -8885, -34227, -64195, -223495, -213232, -252318, -178005, -15111, 26898, 19166, -13598, 135848, 3358, -51152, -110502, -124854, -103853, -213172, -185004, -205528, -92319, -18310, -179261, 20570, 228878, 54858, -104522, -60342, -84647, -108876, -109752, -65477, -83666, -158079, -198632, -346361, -326057, -281425, -237663, -80193, 30299, 160965, 312704, 186048, 124625, 108967]
13893A08967K552j04815l3322l0920k0803K8435l2240J41630K40128N6195r4550
13882B61257j48433N9443J11161j1793j65261k0624q9108j71997r8907p5577J96148
13871a53691J93663R0186o7128L3070K1347j14892r1804J2592j04518P5153N5065
13860e0957O7001R905j18287J58664J22547K993r6494j00368r3136j12838p2492
$$ y = [108967, 111519, 6704, -26618, -57538, -78341, -49906, -82146, 59484, 299612, 355807, 261257, 112824, 172267, 283428, 271635, 106374, 85750, -3358, -175355, -274262, -349839, -153691, 39972, 130158, 63030, 96100, 117447, 2555, -89249, -76657, -181175, -106022, -50957, 16044, 25949, -92338, 66326, 188873, 191866, 95372, -4996, -98132, -210970, -283462]
$$ [...]
##END NTUPLES=NMR SPECTRUM
##END=
