##TITLE=Analysis number 318704
Compound Code cc 00075
Project Code adrs
Chemist Name fudan
##JCAMPDX= 6.0         $$ Bruker NMR JCAMP-DX V2.0
##DATA TYPE= NMR SPECTRUM
##DATA CLASS= NTUPLES
##ORIGIN= Bruker BioSpin GmbH
##OWNER= nmr
$$ XWIN-NMR		Version 3.5
$$ Mon Apr 10 16:04:20 2006 GMT Daylight Time (UT+1h)  MAYBRIDGE\nmr@NMR_250MHZ
##.OBSERVE FREQUENCY= 250.131544655141
##.OBSERVE NUCLEUS= ^1H
##.ACQUISITION MODE= SIMULTANEOUS (DQD)
##.ACQUISITION SCHEME= undefined
##.AVERAGES= 16
##.DIGITISER RES= 18
##SPECTROMETER/DATA SYSTEM= dpx250
##.PULSE SEQUENCE= zg30
##.SOLVENT NAME= DMSO
##.SHIFT REFERENCE= (INTERNAL, DMSO, 0, 16.522)
##AUDIT TRAIL= $$ (NUMBER, WHEN, WHO, WHERE, WHAT)
$$ ##TITLE= Audit trail, XWIN-NMR		Version 3.5
$$ ##JCAMPDX= 5.01
$$ ##ORIGIN= Bruker BioSpin GmbH
$$ ##OWNER= nmr
$$ C:\u/data/dgb/nmr/ADRS/2490/pdata/1/auditp.txt
$$ ##AUDIT TRAIL=  $$ (NUMBER, WHEN, WHO, WHERE, WHAT)
(   1,<2006-04-10 16:04:01.26 +100>,<MAYBRIDGE\nmr>,<NMR_250MHZ>,
      <created by zg, POWCHK disabled, PULCHK disabled
       configuration hash MD5:
       84 BC 41 DB A1 6E 1D 46 DA 25 12 A5 C1 ED C5 3A
       data hash MD5: 64K
       91 D4 01 CF B5 81 E1 48 4B 98 BC 99 FA C7 AB 1B>)
(   2,<2006-04-10 16:04:12.97 +100>,<MAYBRIDGE\nmr>,<NMR_250MHZ>,
      <Start of raw data processing
       ef LB = 0.3 FT_mod = 6 PKNL = 1 SI = 32K 
       data hash MD5: 32K
       FA 87 A3 B7 0F ED B1 19 84 24 D2 71 A6 41 30 A6>)
(   3,<2006-04-10 16:04:14.79 +100>,<MAYBRIDGE\nmr>,<NMR_250MHZ>,
      <apk 
       data hash MD5: 32K
       12 6C 78 AE 65 64 20 D3 48 82 A3 3A 76 5A 84 9C>)
(   4,<2006-04-10 16:04:15.58 +100>,<MAYBRIDGE\nmr>,<NMR_250MHZ>,
      <abs ABSG = 5 
       data hash MD5: 32K
       D7 C1 3B D6 45 36 7F BD FF 87 D7 21 0E C6 E0 EA>)
$$ ##END=
$$ 
$$ hash MD5
$$ A6 C2 F0 EA A5 67 F2 17 90 56 89 74 35 9B 15 5F
##$RELAX= 
##$RELAX= 
##$RELAX= 
##$RELAX= 
##$RELAX= 
##$RELAX= 
##$RELAX= 
$$ Bruker specific parameters
$$ --------------------------
##$DU= <C:\u>
##$EXPNO= 2490
##$NAME= <ADRS>
##$PROCNO= 1
##$TYPE= <nmr>
##$USER= <dgb>
##$AMP= (0..31)
100 100 100 100 100 100 100 100 100 100 100 100 100 100 100 100 100 100 
100 100 100 100 100 100 100 100 100 100 100 100 100 100 
##$AQSEQ= 0
##$AQ_mod= 3
##$AUNM= <au_zg>
##$AUTOPOS= <1 >
##$BF1= 250.13
##$BF2= 250.13
##$BF3= 250.13
##$BF4= 250.13
##$BF5= 500.13
##$BF6= 500.13
##$BF7= 500.13
##$BF8= 500.13
##$BYTORDA= 1
##$CFDGTYP= 0
##$CFRGTYP= 5
##$CHEMSTR= <none>
##$CNST= (0..31)
1 1 145 1 1 1 1 1 1 1 1 1 1 1 1 1 1 1 1 1 1 1 1 1 1 1 1 1 1 1 1 1 
##$CPDPRG= <>
##$CPDPRG1= <>
##$CPDPRG2= <>
##$CPDPRG3= <>
##$CPDPRG4= <mlev>
##$CPDPRG5= <mlev>
##$CPDPRG6= <mlev>
##$CPDPRG7= <mlev>
##$CPDPRG8= <mlev>
##$CPDPRGB= <>
##$CPDPRGT= <>
##$D= (0..31)
0 1 0 0 0 0 0 0 0 0.06 0 0 0 0 0 0 0.0002 0 0 0 0 0 0 0 0 0 0 0 0 0 0 
0 
##$DATE= 1144681440
##$DBL= (0..7)
120 120 120 120 120 120 120 120 
##$DBP= (0..7)
150 150 150 150 150 150 150 150 
##$DBP07= 0
##$DBPNAM0= <>
##$DBPNAM1= <>
##$DBPNAM2= <>
##$DBPNAM3= <>
$$ [...]
##$SUBNAM6= <"">
##$SUBNAM7= <"">
##$SUBNAM8= <"">
##$SUBNAM9= <"">
##$SW= 20.6930455092707
##$SWIBOX= (0..15)
0 0 3 0 0 0 0 0 0 0 0 0 0 0 0 0 
##$SW_h= 5175.983436853
##$TD= 65536
##$TD0= 1
##$TE= 295.16
##$TE2= 300
##$TE3= 300
##$TEG= 300
##$TL= (0..7)
0 120 120 120 120 120 120 120 
##$TP= (0..7)
150 150 150 150 150 150 150 150 
##$TP07= 0
##$TPNAME0= <>
##$TPNAME1= <>
##$TPNAME2= <>
##$TPNAME3= <>
##$TPNAME4= <>
##$TPNAME5= <>
##$TPNAME6= <>
##$TPNAME7= <>
##$TPOAL= (0..7)
0.5 0.5 0.5 0.5 0.5 0.5 0.5 0.5 
##$TPOFFS= (0..7)
0 0 0 0 0 0 0 0 
##$TUNHIN= 0
##$TUNHOUT= 0
##$TUNXOUT= 0
##$USERA1= <user>
##$USERA2= <user>
##$USERA3= <user>
##$USERA4= <user>
##$USERA5= <user>
##$V9= 5
##$VALIST= <valist>
##$VCLIST= <CCCCCCCCCCCCCCC>
##$VD= 0
##$VDLIST= <DDDDDDDDDDDDDDD>
##$VPLIST= <PPPPPPPPPPPPPPP>
##$VTLIST= <TTTTTTTTTTTTTTT>
##$WBST= 1024
##$WBSW= 4
##$XGAIN= (0..3)
0 0 0 0 
##$XL= 0
##$YL= 0
##$YMAX_a= 278204
##$YMIN_a= -446957
##$ZGOPTNS= <>
##$ZL1= 120
##$ZL2= 120
##$ZL3= 120
##$ZL4= 120
##$ABSF1= 16.522
##$ABSF2= -4.171173
##$ABSG= 5
##$ABSL= 3
##$ALPHA= 0
##$AQORDER= 0
##$ASSFAC= 0
##$ASSFACI= 0
##$ASSFACX= 0
##$ASSWID= 0
##$AUNMP= <proc_1d>
##$AZFE= 0.1
##$AZFW= 0.1
##$BCFW= 0
##$BC_mod= 0
##$BYTORDP= 0
##$COROFFS= 0
##$CY= 12.5
##$DATMOD= 1
##$DC= 0
##$DFILT= <>
##$DTYPP= 0
##$F1P= 14.0000005364418
##$F2P= -0.99999901652339
##$FCOR= 0.5
##$FTSIZE= 32768
##$FT_mod= 6
##$GAMMA= 0
##$GB= 0
##$INTBC= 1
##$INTSCL= 1
##$ISEN= 128
##$LB= 0.3
##$LEV0= 0
##$LPBIN= 0
##$MAXI= 10000
##$MC2= 0
##$MEAN= 0
##$ME_mod= 0
##$MI= 0
##$NCOEF= 0
##$NC_proc= -3
##$NLEV= 6
##$NOISF1= 0
##$NOISF2= 0
##$NSP= 0
##$NTH_PI= 0
##$NZP= 0
##$OFFSET= 16.522
##$PC= 1
##$PHC0= 163.822
##$PHC1= 6.127092
##$PH_mod= 1
##$PKNL= yes
##$PPARMOD= 0
##$PSCAL= 4
##$PSIGN= 0
##$REVERSE= no
##$SF= 250.13
##$SI= 32768
##$SIGF1= 0
##$SIGF2= 0
##$SINO= 400
##$SIOLD= 32768
##$SREGLST= <1H.DMSO>
##$SSB= 0
##$STSI= 32768
##$STSR= 0
##$SW_p= 5175.98343685301
##$SYMM= 0
##$S_DEV= 0
##$TDeff= 65536
##$TDoff= 0
##$TI= <Analysis number 999999
Compound Code 99
Book Reference 9
Project Code 9>
##$TILT= no
##$TM1= 0
##$TM2= 0
##$TOPLEV= 0
##$USERP1= <user>
##$USERP2= <user>
##$USERP3= <user>
##$USERP4= <user>
##$USERP5= <user>
##$WDW= 1
##$XDIM= 32768
##$YMAX_p= 282773112
##$YMIN_p= -609907
$$ End of Bruker specific parameters
$$ ---------------------------------
##NTUPLES= NMR SPECTRUM
##VAR_NAME=  FREQUENCY,     SPECTRUM/REAL,   SPECTRUM/IMAG
##SYMBOL=    X,             R,               I
##VAR_TYPE=  INDEPENDENT,   DEPENDENT,       DEPENDENT
##VAR_FORM=  AFFN,          ASDF,            ASDF
##VAR_DIM=   32768,         32768,           32768
##UNITS=     HZ,            ARBITRARY UNITS, ARBITRARY UNITS
##FACTOR=    0.157963299565203, 1,           1
##FIRST=     4132.6476996994, 0,             0
##LAST=      -1043.33573715361, 0,           0
##MIN=       -1043.33573715361, -609907,     0
##MAX=       4132.6476996994, 282773112,     0
$$ Real data points
##PAGE= N=1
##DATA TABLE= (X++(R..R)), XYDATA
$$ [...]
21935C569773k0870m7699p7160o2940l7595q8315l2725j783p4926o6130o5586
21924B994044l2015k3593N158n8973p8676m7310l889n3105l2443r5851r5724k2785
21912B454838J1147r430o1104o4686m7541l9822l4778p222O107o5888k6349Q859
21900B124131k8456o9669n0699j2946l4566j340l7659m0916j9653J0470k8887
21889A809810l8169J7857Q486k1626j7840l1670m5528l4073k5821n7220k8129
21878A536077K5853P59r642p3591j5704K1402l6137k8727q560k9276m0911q034
21866A333509K0155l3227j2863L4630m638M111r666k0821l0046m6367m3633j7976
21854A173168m367J2410q241n0238l0345j9657L343N847Q769M668l4857n2770
$$ y = [3569773, 3548903, 3501204, 3424044, 3361104, 3323509, 3235194, 3202469, 3200686, 3125760, 3059630, 2994044, 2962029, 2938436, 2943594, 2884621, 2805945, 2758635, 2754746, 2701641, 2669198, 2573347, 2477623, 2454838, 2465985, 2456555, 2395451, 2330765, 2283224, 2243402, 2208624, 2201402, 2207509, 2141621, 2115272, 2124131, 2095675, 2026006, 1975307, 1962361, 1927795, 1926455, 1888796, 1847880, 1828227, 1838697, 1809810, 1771641, 1789498, 1797984, 1776358, 1758518, 1726848, 1681320, 1647247, 1621426, 1564206, 1536077, 1561930, 1562689, 1553047, 1479456, 1463752, 1485154, 1449017, 1420290, 1411730, 1382454, 1341543, 1333509, 1353664, 1320437, 1307574, 1342204, 1337566, 1341677, 1332011, 1311190, 1281144, 1234777, 1191144, 1173168, 1168801, 1181211, 1172970, 1122732, 1092387, 1072730, 1076073, 1081920, 1090689, 1095357, 1060500, 1007730]
21842A007730l092K9446L8460j389n9704n7917l5154L887k1879p939M393J3234
21830I10076l4186k4396L084q193L959O656K056j8683Q347O577j0392j57m5010
21817G99738l8134K4996r710j5273l128K7287j4011k8873L1195K8180N83l4966
21805G67884l8226J977l3017p1030m5068O957K3942K2137j7362J5944L0559Q676
21793F73373l2787j7057M548N0481j755n296L052M610j1328K0964j9986j8502
21781F50317k3179q008K255K6066J0325n3193j9651J5093j1830K9442M2323l6742
21769F23218o0149n0439l0146k1401J4912m098j7821K5898M676J5599K3066k848
21757E20467j3435J9433l8402k3771j7074K8899q791k9438p2516N4536R0447R29
$$ y = [1007730, 1004638, 1034084, 1072544, 1071155, 1011451, 953534, 918380, 922267, 900388, 892449, 896842, 910076, 875890, 851494, 854578, 846385, 850344, 857000, 859056, 840373, 848720, 855297, 844905, 844748, 799738, 761604, 786600, 776890, 761617, 758489, 785776, 771765, 742892, 774087, 802267, 802850, 767884, 729658, 731635, 698618, 627588, 582520, 589477, 613419, 635556, 618194, 634138, 664697, 673373, 640586, 623529, 628077, 678558, 676803, 671507, 674559, 679169, 667841, 688805, 668819, 650317, 627138, 619130, 621385, 647451, 657776, 604583, 584932, 600025, 588195, 617637, 659960, 623218, 563069, 512630, 482484, 461083, 475995, 471897, 454076, 479974, 484650, 500249, 523315, 520467, 507032, 526465, 488063, 464292, 447218, 476117, 467326, 437888, 365372, 419908, 510355, 511284]
21745E11284N032k1574k5087J830q424j969N3433J5203k8014K3302N2815R813
21733E87644o723p2964k3413J9327j5142q188K045k2421K8458K0373o556K4029
21721E26469o959j7240q383r277J3462m0963j3186P732Q996k5613l7757K079M8730
21708D48090J3352k7897j8815k0692m0685j3338K47N620L2314l6677J1804M1418
21696C94741K4505l0175O47k617m1749k0752R175J620P128o600K3949M4638l0393
21683C74117m3806j7591J1104O1717K0384j017q387m138k359k47k3158J785J1363
21670C79767L2592K6124k4054N415p272J8063K2701q220j5636Q307J3772J842
21658D53401L2407Q514n8754l2966k0900O568J6123K2467J1148K4021o316m6001
$$ y = [511284, 516316, 494742, 469655, 471485, 463061, 461092, 514525, 529728, 501714, 525016, 577831, 587644, 580921, 507957, 484544, 503871, 488729, 480541, 482586, 460165, 488623, 508996, 502440, 526469, 519510, 502270, 493887, 484610, 498072, 457109, 443923, 451655, 460651, 435038, 397281, 399360, 448090, 461442, 433545, 414730, 394038, 353353, 340015, 340262, 345882, 378196, 341519, 353323, 394741, 419246, 389071, 389718, 387101, 345352, 324600, 333775, 335395, 342523, 335923, 359872, 404510, 374117, 330311, 312720, 323824, 385541, 405925, 404908, 396521, 392383, 390024, 389777, 366619, 368404, 379767, 412359, 438483, 414429, 419844, 412572, 430635, 453336, 445116, 429480, 437787, 451559, 453401, 485808, 494322, 435568, 402602, 381702, 388270, 404393, 426860, 438008, 462029, 455713, 409712]
21646D09712q659p636L021K1913K374p40J2240K840J3408J740j5270j012L207
21633D37138j7745l285N859r635m3271J7703L870j983k0042J9221J8500K525n130
21620D03725K9390l8400k327R839l7840J1657k2811J6789L389K986j7122K6455
21608C85730M423L1651J5346m5739L2928n099k0116O9655L0619j8208k1165j0066
21596D49959k234l3216l9703M2914K4776k4711J0171N1113k765p371J1293p698
21584D72528l0988k7131L383M5968L4822k4531j9595k5521k693J3149J3023J8235
21572D70649J5307M31j5193l373k4898j1431J8902M6294P563J7500O185m2967
21560D84969m889K8809K7692L7685K6941K3444k1577j9590P314L2951j9894m7162
$$ y = [409712, 401053, 393417, 396438, 418351, 420725, 419985, 432225, 435065, 448473, 450213, 434943, 433931, 437138, 419393, 416108, 421967, 412332, 369061, 386764, 390634, 388651, 368609, 387830, 406330, 408855, 403725, 433115, 394715, 392388, 402227, 364387, 376044, 353233, 370022, 373411, 376397, 359275, 385730, 390153, 421804, 437150, 391411, 424339, 419240, 399124, 468779, 499398, 481190, 460025, 449959, 447725, 414509, 374806, 417720, 442496, 417785, 427956, 479069, 476304, 468933, 480226, 472528, 441540, 414409, 417792, 463760, 498582, 474051, 454456, 428935, 426242, 439391, 452414, 470649, 485956, 486387, 471194, 467821, 442923, 431492, 450394, 496688, 504251, 521751, 527936, 484969, 480080, 508889, 536581, 574266, 601207, 624651, 603074, 583484, 590798, 623749, 603855, 556693]
21548E56693m6046L8712O7098M3275J8513K2921Q120J8794P08P867L7033O377
21536G80065j0739R677j2745L9200K7538L8353O447j5502L47J1618N881j4447
21524H65693l2183j8151K4589M7618N2207j947p48K321K7279O7492K5586K0379
21512A080135k2233k1723M9082j0492m1792J384p572n251P1386O9555M8426J2391
21500A223296j314m1328j4129P7530M2545K5164j8002K2767M209O4711N9097L7771
21488A482317J5272L3350Q297j2580J318K5071P060l620L9281K8112M5057L3861
21476A702796L9198L2621M1888L2161P513J241M2686R0271N2142J9357L3584R421
21464B104879L1077P5344R8255o895K1381R9733J2121Q054P0745L5477M7259K5128
$$ y = [556693, 510647, 549359, 616457, 659732, 678245, 701166, 709286, 728080, 728788, 736655, 773688, 780065, 769326, 779003, 766258, 805458, 832996, 871349, 877796, 862294, 862641, 874259, 880140, 865693, 833510, 815359, 839948, 887566, 939773, 937826, 937078, 939399, 966678, 1034170, 1059756, 1080135, 1057902, 1036179, 1085261, 1074769, 1032977, 1034361, 1026789, 1021538, 1092924, 1162479, 1210905, 1223296, 1221982, 1180654, 1166525, 1244055, 1286600, 1311764, 1293762, 1316529, 1320738, 1385449, 1444546, 1482317, 1497589, 1530939, 1539236, 1526656, 1527974, 1553045, 1560105, 1556485, 1595766, 1623878, 1668935, 1702796, 1741994, 1774615, 1816503, 1848664, 1856177, 1857418, 1900104, 1990375, 2042517, 2061874, 2095458, 2104879, 2135956, 2211300, 2309555, 2302660, 2324041, 2423774, 2435895, 2443949, 2514694, 2550171, 2597430, 2622558]
21452B622558M4231P0032N9344J12254P1172M2811Q7747P6778Q5976J04176Q1802
21441C458881J08000J36287J08866R2304R0999R4571J25455J22165J20276J00045
21431D557849J54480J42555J85806J90311J15654J87163J69608J45654K10732
21422F059812J81998K02761K24330K27149K45077K65051K87902L01810K42207
21413H238097K79146L08106L08389K98538L26871L13617L30202L62817L78680
21404A1144463L79434L82242L51274L53316M28833M16579L67284L85074L64426
21395A4572925L57952M14747L75335L21534K76342J89366K69597K30079J76089
21386A7183966K19968J52379J05077Q3700j152J50j9108m8926j14996j03229j07031
$$ y = [2622558, 2666789, 2736821, 2796165, 2908419, 2979591, 3022402, 3110149, 3186927, 3272903, 3377079, 3458881, 3566881, 3703168, 3812034, 3904338, 3995337, 4089908, 4215363, 4337528, 4457804, 4557849, 4712329, 4854884, 5040690, 5231001, 5346655, 5533818, 5703426, 5849080, 6059812, 6241810, 6444571, 6668901, 6896050, 7141127, 7406178, 7694080, 7995890, 8238097, 8517243, 8825349, 9133738, 9432276, 9759147, 10072764, 10402966, 10765783, 11144463, 11523897, 11906139, 12257413, 12610729, 13039562, 13456141, 13823425, 14208499, 14572925, 14930877, 15345624, 15720959, 16042493, 16318835, 16508201, 16777798, 17007877, 17183966, 17403934, 17556313, 17661390, 17745090, 17743938, 17744088, 17724980, 17676054, 17561058, 17457829, 17350798]
21375A7350798j80394j80396k35171l29671l01455k68577k86179l18312k86788
21366A4963855l20734l37420l31427l11660l10479l01769l23427l30043l06897
21357A2089999l54029k83524k95672k57115k33120k47288k79251k93549k61441
21348I585010k26588k33060k23042k09991k30683k14464j81346j49029j98107
21339G718700k07321j83005j67161j54807j26369j80584j81763j70380j51645
21330F195665j24625j24210j87826j37081j28032j10755p8728r9774j03376j19717
21320D981541j03376r8650q9924j11737j06172l2117p5700p6649p1548n8878p3223
21309D083567j45681j29613m2820l1965q4687q1313m1715n2008l9178m6618p7240
$$ y = [17350798, 17170404, 16990008, 16754837, 16425166, 16123711, 15855134, 15568955, 15250643, 14963855, 14643121, 14305701, 13974274, 13662614, 13352135, 13050366, 12726939, 12396896, 12089999, 11735970, 11452446, 11156774, 10899659, 10666539, 10419251, 10140000, 9846451, 9585010, 9358422, 9125362, 8902320, 8692329, 8461646, 8247182, 8065836, 7916807, 7718700, 7511379, 7328374, 7161213, 7006406, 6880037, 6699453, 6517690, 6347310, 6195665, 6071040, 5946830, 5759004, 5621923, 5493891, 5383136, 5304408, 5204634, 5101258, 4981541, 4878165, 4779515, 4689591, 4577854, 4471682, 4439565, 4363865, 4287216, 4215668, 4156790, 4083567, 3937886, 3808273, 3765453, 3733488, 3648801, 3567488, 3525773, 3473765, 3434587, 3387969, 3310729]
21298C310729q8851p1776l3697n0660l7190k9631l8434j03008j06935l6708k2574
21287B691265n3159p2864j1529J3344j4119m1631n2379n2234o1320j416j7125
21276B326833m2878l2361p2219k4911N655k8492m1788n3719K841j1652P346o1962
21264A972693n5041j4310P840n3878k8739l7190l3913K2087j9710n4540l9880
21253A665419m6053l6163J2165n5225l3953L7042j4665o775k7358q7592j0074
21242A396768n629j9697L2689j6793o7532l7436J6046j2203k2671q764j5477m8547
21230A190754J99J4556L0019k3760n6943l5272J2077k779Q020K7975J1799j4161
21218A162484k5299m1429m3254m811k7921p708j6576q2007l4343K8228l3454P893
$$ y = [3310729, 3221878, 3150102, 3116405, 3065745, 3028555, 2998924, 2960490, 2857482, 2750547, 2713839, 2691265, 2638106, 2565242, 2553713, 2567057, 2552938, 2511307, 2458928, 2406694, 2345374, 2343958, 2326833, 2283955, 2251594, 2179375, 2154464, 2160119, 2131627, 2089839, 2036120, 2038961, 2027309, 2034655, 1972693, 1917652, 1903342, 1911182, 1857304, 1828565, 1791375, 1757462, 1779549, 1759839, 1705299, 1665419, 1619366, 1583203, 1595368, 1540143, 1506190, 1543232, 1528567, 1521792, 1494434, 1406842, 1396768, 1391139, 1371442, 1404131, 1387338, 1319806, 1282370, 1298416, 1286213, 1263542, 1254778, 1239301, 1190754, 1190953, 1205509, 1235528, 1211768, 1154825, 1119553, 1131630, 1128851, 1136871, 1164846, 1176645, 1162484, 1137185, 1095756, 1052502, 1047691, 1019770, 1012062, 995486, 913479, 879136, 907364, 873910, 881803]
21206H81803L3380l3626l7260J9196M7285k716q37n1122k3569k1865K9226N156
21194H45051j3866j7214l6569K0007j2887k324j7752J3248j9974k2639J1656L7775
21182G84512K175k1053p196k07j0794J95o4062p4975M438J2078K9258P461l642
21169F58188m710n2023j858q394j3433m2366k9598J421L8766k2375k6439J1568
21157E08747O800K001J0436k8987M943j141j30P833m97O474r066j4512l7983R580
21143D64498n983K776K5420j1835j5556J0326m9049n494L77j1293N4565j6948
21131D41804n2877n4058n9644M9710P088J3483N0082K1366k2503j6747O576J7838
21119D02118N2539J3676L4184k8815n7473j1269K7920j5866m882k6959q296J0555
$$ y = [881803, 915183, 881557, 844297, 863493, 910778, 908062, 907225, 856103, 832534, 810669, 839895, 845051, 831185, 813971, 777402, 797409, 784522, 782198, 764446, 777694, 757720, 735081, 746737, 784512, 786687, 765634, 758438, 758231, 747437, 747632, 683570, 608595, 613033, 625111, 654369, 661830, 658188, 653478, 601455, 599597, 591203, 577770, 535404, 505806, 507227, 545993, 523618, 497179, 508747, 515547, 517548, 527984, 498997, 503940, 502799, 502669, 510502, 510005, 516479, 507413, 492901, 454918, 464498, 458515, 461291, 486711, 474876, 459320, 469646, 420597, 415103, 415480, 404187, 458752, 441804, 388927, 334869, 275225, 324935, 332023, 345506, 395588, 416954, 394451, 377704, 384280, 402118, 454657, 468333, 502517, 473702, 416229, 404960, 432880, 417014, 412132, 385173, 376877, 387432]
21107C87432P595L7464M1741l0691K0636k9438k7318k0096K2413k0958K6374Q753
21095D23907j2570l3371o3834j1065q005J7373k2456k2077L148K5605M281m2214
21083B58722j6633j3361o415K9683L735M575K0220j8214l2118q180Q851j4458
21071B16407J5707j3169k0251j8397J4209M8541J0713J1590K681l541m43L3514
21059B97561j1244j7930J263k568M26j0729j6595K6693j5064J4568P36n0141O783
21046B23759k612j4520k678l3363J5183N384J439l7677J7543k0497Q639O673m6111
21033A21162O567K8943L9901k833n3058P349N915k4690K0560R420m7173k7297
21021H4766M4015M2004M3041j083k3346K1365l2770n2248J0869K4508m3468k1710
$$ y = [387432, 395027, 432491, 474232, 443541, 464177, 434739, 407421, 387325, 409738, 388780, 415154, 423907, 411337, 377966, 314132, 303067, 295062, 312435, 289979, 267902, 271050, 296655, 300936, 258722, 242089, 228728, 222313, 251996, 255731, 260306, 280526, 262312, 230194, 222014, 230865, 216407, 232114, 218945, 198694, 180297, 194506, 243047, 253760, 265350, 268031, 264490, 264047, 297561, 286317, 268387, 269650, 267082, 267508, 256779, 240184, 266877, 251813, 266381, 267117, 216976, 223759, 221147, 206627, 203949, 170586, 185769, 191153, 192592, 154915, 172458, 151961, 160600, 167273, 121162, 127729, 156672, 196573, 193740, 140682, 148031, 153946, 129256, 149816, 159236, 112063, 84766, 128781, 170785, 213826, 212743, 189397, 210762, 177992, 125744, 136613, 161121, 117653, 95943]
21009I5943k7746L0652K7778O5401M3423m9651o2505j2280J6692N8385K6262o3582
20997A48772k400j133j0453J4524K2093J0790l0936j6426k4783j2175J3379l4966
20985G6286K894M260k5460l0869J1852K7141J1448J372O220J2884Q885L6284P645
20972A50842j9078r064l857K268M608j7783l482J1656L0156j8226l1302L1443
20960A28181M0656j412n549j4911J5434k3855k3747j9941j3503J8248K8667j8752
20948A09516n815M3951J8711k9146J2813M851k6894k7529r459K3071J5295Q675
20936A38040j7136m4331j6175k6623j0692L0995J6333j2455k8647K1091J0139
20925F0539J0974O0532J4449k3885K0556j5863j2802j6631k0745o2677k7387K65
$$ y = [95943, 68197, 98849, 126627, 192028, 235451, 185800, 123295, 111015, 127707, 186092, 212354, 148772, 146372, 145239, 134786, 149310, 171403, 182193, 151257, 134831, 110048, 97873, 111252, 76286, 79180, 83440, 57980, 27111, 38963, 66104, 77552, 78924, 85144, 98028, 106913, 143197, 150842, 131764, 122700, 118843, 121111, 125719, 107936, 104454, 116110, 146266, 128040, 96738, 128181, 168837, 167425, 161876, 146965, 162399, 138544, 114797, 94856, 81353, 99601, 128268, 109516, 103701, 147652, 166363, 137217, 150030, 154881, 127987, 100458, 90999, 114070, 129365, 138040, 120904, 76573, 60398, 33775, 23083, 54078, 70411, 57956, 29309, 50400, 60539, 71513, 132045, 146494, 122609, 143165, 127302, 114500, 97869, 77124, 14447, -12940, -12675]
20913a2675j7393j365M4349L9760J2556L517k4984R165J8736k1288k8710k2563
20901h95L1226J3995r83l5507p207m403K8792K4859k0400q417L8363K3735j4805
20888F8353j2399k4316l9578l1455J7584L1387k0636N897J6346L1124P026j8173
20876C1160j3832K4055J1066K1178J9752j960k9387p841Q872J344j4629j0416
20864C9362j372j431k2546J492K7070L1855K6992N528l623j1272Q972l737o3928
20851C3362o0031p9759L440L9808K7820L8973j800M1057R874k8011j633j1507
20839A1593M0673N2345m327P327K3277k0933n8708k2371P0724J3988k7402K8000
20827A14186j7987j1691O072q994L300r068R09o875k575l8746p35K1483J377M3500
$$ y = [-12675, -30068, -31433, 12916, 52676, 65232, 68749, 43765, 52930, 71666, 50378, 21668, -895, 30331, 44326, 43343, 7836, 629, -3774, 25018, 49877, 29477, 21060, 59423, 83158, 68353, 55954, 31638, -7940, -39395, -21811, 9576, -11060, -5163, 11183, 42307, 49333, 31160, 17328, 41383, 52449, 73627, 93379, 91419, 62032, 54191, 63063, 64407, 49778, 39362, 37990, 36559, 14013, 15505, 42575, 74430, 101422, 106950, 103327, 92055, 101027, 97290, 33362, -26669, -106428, -102988, -63180, -35360, 3613, 1813, 42870, 52744, 24733, 23100, 11593, 52266, 104611, 100284, 107611, 130888, 109955, 51247, 28876, 99600, 113588, 86186, 114186, 96199, 84508, 90580, 81586, 84886, 75818, 76727, 69852, 67277, 28531, 27796, 49279, 50656, 94156]
20813I4156J2454m6494j6445k6908j8468L8884L1055j0782k6222J2799j1003J7295
20801E0321Q040L6285p374l2071l6666l2435M1820L4807L5074k0607l0524k530
20789D4140J7372K4533l3171k7125j3999m995J7464J4663J3389j1426L122J7128
20777F1095n3625R853L2750j0025l0734k0547j0118K1239L2671l687j6627L3856
20765D6101K4672k1513J708M626J4100o104k4956k7012Q375N3390K712j2200q512
20752E5387l9038k0728M0046l5450k101N8014l09m7366p207M194O351J1502J0797
20739C4092k054J5744K3457j6883J9483N428j4755k5919l2838j0134j9203l3153
20727e6735J5453K1075k2679l5031M5681P0999j8891n039K625M8221k9499l0580
$$ y = [94156, 106610, 60116, 43671, 16763, -1705, 37179, 68234, 57452, 31230, 44029, 33026, 50321, 58361, 94646, 87272, 55201, 18535, -13900, 27920, 62727, 97801, 77194, 46670, 44140, 61512, 86045, 52874, 25749, 11750, 6755, 24219, 38882, 52271, 40845, 43967, 61095, 7470, 17323, 50073, 40048, 9314, -11233, -21351, -112, 32559, 28872, 12245, 46101, 70773, 49260, 50968, 55594, 69694, 63590, 38634, 11622, 19997, 73387, 76099, 63899, 55387, 16349, -4379, 35667, 217, -1884, 56130, 55821, 8455, 1248, 5442, 11793, 23295, 34092, 32038, 47782, 71239, 54356, 73839, 79267, 64512, 38593, 5755, -4379, -23582, -56735, -41282, -20207, -42886, -77917, -32236, 38763, 19872, 14833, 17458, 65679, 36180, 5600]
20715E600R022m3023j9415l2274K3524O0436K4637k2181l2468m1202L5569N9314
20703B7539j3096j4759J9206P5258L3654o650j3540k1619k2100m4241Q401J8855
20691D6908o439L119K986j103k9138l1079o798J4056J4275l1198L4163M9775K8255
20678H7782j4486j7679l861l0520O30j4495j0072k6282n729R878J3773Q4382L3163
20665A06484n8818m0824K1733J1822p430K0006k1231n6524J2935K8264m718k4122
20653a2423Q463k509J7541P12m499J5032M071l8942k2521K5896K4994L4574Q231
20640E8620o89j4832j6466k3748j916L340Q245J2802J6609L1605k5636k8533J3211
20627C2612j3045k1919N081l0933L4191l85K65J3983Q573o218K584m7489M5937
$$ y = [5600, 14622, -28401, -47816, -80090, -56566, 3870, 28507, 6326, -26142, -67344, -31775, 27539, 14443, -316, 18890, 94148, 127802, 121152, 107612, 85993, 63893, 19652, 28053, 46908, 40469, 43588, 46574, 45471, 16333, -14746, -21544, -7488, 6787, -24411, 9752, 59527, 87782, 73296, 55617, 51756, 21236, 21866, 7371, -2701, -28983, -34712, -24834, -11061, 73321, 106484, 47666, 6842, 28575, 40397, 32967, 52973, 31742, -24782, -11847, 16417, 11699, -12423, -3960, -6469, 11072, 11784, 7285, 22317, 26388, -12554, -35075, -9179, 15815, 50389, 58620, 57931, 43099, 26633, 2885, 969, 4309, 12554, 25356, 41965, 73570, 47934, 19401, 32612, 19567, -2352, 2729, -28204, 5987, 5602, 5867, 19850, 28423, 22205, 24789, -22700, 23237]
20614B3237K3404k8659o6820l1772J3960J9039p33J8895J8702P873L2283L5862
20602F5271k9863j4036k5152j1287Q589J5780L711K5545k0152l3190J1187J5998
20590A2401J677J1790J9135l4218J0248j42m3572j9227P918k6030K085Q690J9729
20577b9516p586Q906j5448J2664L2247L6700j3314J6749k6711j3386j3931N820
20565f806J5313L559j7021q987j1771l506M5465N0983K090J1221L5637m192o6278
20552D5707r621o412j340Q698J3989K4324l0930o698O303K3719o79k0391n8273
20539a1604o0102K3943L3081K605j2397J8275J0736K4967K569l2051j0590K2690
20527A2122L0994o721m3379j7692L668J4186j3269M581K9186k2024J520J3251
$$ y = [23237, 46641, 17982, -48838, -80610, -66650, -47611, -48344, -29449, -10747, -2874, 29409, 65271, 35408, 21372, -3780, -15067, -6478, 9302, 13013, 38558, 18406, -14784, -3597, 12401, 14078, 25868, 45003, 10785, 21033, 20891, -22681, -41908, -33990, -60020, -57935, -49245, -29516, -37102, -28196, -43644, -30980, 1267, 37967, 24653, 41402, 14691, 1305, -12626, -6806, 8507, 12066, -4955, -13942, -25713, -29219, 16246, 67229, 69319, 80540, 116177, 111985, 45707, 36086, 29674, 28334, 37032, 51021, 75345, 44415, 37717, 44020, 67739, 67060, 46669, -11604, -71706, -47763, -14682, -12077, -24474, -6199, 4537, 29504, 32073, 22, -10568, 12122, 43116, 36395, -6984, -24676, -21008, -6822, -20091, -15510, 13676, -8348, -6828, 6423]
20515F423j4576K0138M0407r740J7501k2540q7058J0100L5558K636k478O202M8354
20502E0927k3112K8234K5775j5260l4428n8673j2036L9758L2914l7771m9303K6203
20490b6772J5983P258K0462L4404q527j148p181L1864m5453j1703m6460n8161
20478i5434j4295N4766M0264k8430k3245L3703O2238J0491m9126j1347J1441o028
20466a5002N8908J9217j1583L4980j8532m7781m1793K7384L9841k5070l6123N155
20454a0399L0769L973o2459j559k221J1706N1686N0163Q861n2122P378K5088J922
20441F2786m5740L831J5377J0713K7961P497m6224P015j483l7532j6329J0314
20429a814j0478j0078j7160L3039m7422l2044J3545M4353P173o628M5258N3575
$$ y = [6423, -8153, 11985, 52392, 42652, 60153, 37613, -49445, -39345, -3787, -1151, -3629, 2573, 50927, 27815, 56049, 81824, 66564, 32136, -26537, -38573, 1185, 34099, -3672, -52975, -26772, -10789, -3531, 16931, 51335, 42808, 41660, 34479, 66343, 20890, 9187, -37273, -95434, -109729, -54963, -14699, -43129, -66374, -32671, 29567, 40058, -9068, -20415, -8974, -15002, 43906, 63123, 51540, 86520, 67988, 20207, -21586, 5798, 45639, 20569, -15554, -10399, 20370, 24343, -38116, -39675, -41896, -30190, 21496, 71659, 80520, 28398, 35776, 60864, 62786, 17046, 20877, 36254, 46967, 74928, 82425, 36201, 43216, 41733, 4201, -12128, -1814, -12292, -22370, -39530, -6491, -53913, -85957, -72412, -28059, -20886, -27514, 17744, 71319]
20417G1319O982j8286p518l600N01k1111k4707k6298k9173p263j993J6826L6840
20404g481m0488K2037J2125j1219J9219L0278R717p032k5051J311j5775J3952
20392A593k6301l522J28k992K2240k3642L3800J258J0410m323k461m66K4576Q243
20378C8541j2819l2052l9290K5882L4989J3606L796k8530l5215J5696J3676J8304
20366A6584l7611j5887O3169Q885M4L0840j9556l5586k6119K1492K1916J2299
20354D0470j015j4858j5441M0250K202j1497j6697l8891M268L6274L7220K255
20342F4540l175p1634j5253K5649L5760L4272l3899k0717J4663k5406R576J8797
20330C3173K6573j5154k7759j9568k6766L460M0M1909L8563M2592k846o293j1723
$$ y = [71319, 78301, 60015, 52497, 48897, 49398, 28287, 3580, -22718, -51891, -59154, -61147, -44321, -7481, -47969, -25932, -13807, -25026, -5807, 24471, 34188, 27156, 2105, 3416, -12359, 1593, -24708, -28230, -28102, -31094, -8854, -32496, 1304, 2562, 12972, 8649, 6188, 5722, 30298, 38541, 25722, -6330, -45620, -19738, 15251, 28857, 32653, 4123, -31092, -15396, -1720, 16584, -21027, -36914, 26255, 35140, 35184, 66024, 46468, 10882, -15237, 6255, 28171, 40470, 39455, 24597, 9156, 49406, 51608, 40111, 23414, -15477, -11209, 25065, 62285, 64540, 61365, -10269, -25522, 127, 35887, 70159, 36260, 15543, 30206, 4800, 14376, 33173, 59746, 44592, 16833, -2735, -29501, -26041, -26001, 15908, 54471, 97063, 94217, 87924, 76201]
20317G6201l2256l0058j2035o260K4175J4241k5480n9257k6491J1932P334m0533
20305i8487L621M2516L669K2398p723o661j0162j8388J1866N570J2968K0799J5811
20292b203J7652j7540L639n6887m533L8316J3820J692p325l0219j8369J7256L3689
20279a1012J5696n44n1581j1404l1462k1708J8020J6407J7972M6056k71o178N3404
20266C3395k5059l3990J4146Q693M521J4978M7279k0652j567K507l018l0306m9851
20253c8924K6172J0596L3047j3535J6498L0140o604M582M746l1867J3532P013
20241E5396j6480m1193k3597J0897J9034K612Q448K9455k4736j4350K7216l250
20229B9452J9217k9183n025P192m7421l5236M041K6888O1144J6550p796J7506
$$ y = [76201, 43945, 13887, 1852, -4408, 19767, 34008, 8528, -50729, -77220, -65288, -57954, -98487, -94866, -52350, -48681, -26283, -34006, -40667, -50829, -69217, -57351, -51781, -38813, -18014, -2203, 15449, -2091, 1548, -55339, -59872, -21556, -7736, -6044, -13369, -43588, -61957, -44701, -11012, 4684, 4140, -47441, -58845, -90307, -112015, -93995, -77588, -59616, -13560, -13831, -20009, 33395, 8336, -25654, -11508, -2815, 1706, 16684, 63963, 43311, 41744, 44251, 41233, 10927, -38924, -12752, -2156, 30891, 17356, 33854, 63994, 57390, 61972, 66718, 34851, 48383, 55396, 38916, -2277, -25874, -14977, 4057, 6669, 15117, 44572, 19836, 5486, 32702, 29452, 48669, 19486, 14461, 21653, -25768, -61004, -56963, -30075, 31069, 47619, 39823, 57329]
20217E7329k4962l7771j3661J4970J162L6491L8914J2034k5014k2934j3238j158
20205B2162j823L6061K6483k1272r798L121J5084j5923j1796j1069J0832j2080
20193B9982k2703L7936P189j712l84K843l1666N312Q467j810k059k2380o2369
20180e3354J592L0186L5892O597r785n2482J2167O5537K3900m9897l0819P891
20168a2575J2922j4100J8626L0285J2751j3439l1400n4775p159Q0527L961j3752
20156A1872J559j6414N755j1558j1613J3211J4446K7534r679j4140L436k5498
20144a1089j6175J6953O004l695J8358k3750k0547J8992r077L1884J3674j00K5065
20131D6497j4547l5478J1566m1627n4171M0135Q322k4212o833J8014K2581N140
$$ y = [57329, 32367, -5404, -19065, -4095, -2933, 33558, 72472, 84506, 59492, 36558, 23320, 22162, 20339, 56400, 82883, 61611, 51813, 54934, 70018, 54095, 42299, 31230, 42062, 29982, 7279, 45215, 52404, 50692, 50308, 53151, 21485, 26797, 35264, 33454, 31395, 9015, -53354, -51762, -21576, 14316, 20913, 11128, -41354, -29187, 36350, 60250, 10353, -20466, -12575, 347, -13753, 4873, 35158, 47909, 34470, 3070, -51705, -58864, 21663, 25624, 11872, 13431, -2983, 2772, -8786, -20399, -7188, 7258, 34792, 25113, 10973, 14409, -11089, -27264, -10311, -4307, -8002, 10356, -13394, -33941, -14949, -24026, 7858, 21532, 21432, 46497, 31950, -3528, 8038, -33589, -87760, -47625, -39303, -63515, -70348, -52334, -29753, -24613]
20119b4613M0213J3572l324R807l611K1471n6520l9267R0823O960l5682l2537
20107a2708k2288J4406k649J1043k1401L727L3058J8487m024k4337J3246J4944
20095B1504J1595m287j5290k7608J9809m7600k8796J0362K6505J4210l1251R849
20083d0998K4802j7010l7449K1295J2023J0668n7j3072m7342j5532P386J039L7564
20070e6683J9928L4293O643l69N3062n883k0333n0257r96j0517K2257M2431L277
20057C6853l5722M29Q103O178j4815p747J1516L9942K2677j1734o3049k1842J4334
20044a4877k2319l9662p485K7960M2197q781J8839J7678N635j6800P043M166j1947
20031A647j793k3753L3409J1876o2337J0267K1934L5354j296l5661r588l8487
$$ y = [-24613, 15600, 29172, 25848, 35655, 32044, 53515, -3005, -42272, 48551, 55511, 19829, -12708, -34996, -20590, -23239, -12196, -33597, -29870, 3188, 21675, 17651, -6686, 6560, 21504, 33099, 28812, 13522, -14086, 5723, -41877, -70673, -60311, -33806, -19596, -50847, -40998, -16196, -33206, -70655, -49360, -37337, -26669, -26726, -39798, -87140, -102672, -95286, -94247, -56683, -36755, -2462, 4181, 3812, 56874, 50991, 30658, -19599, -20595, -31112, -8855, 33576, 36853, 1131, 1560, 9663, 15841, 1026, -6721, 4795, 44737, 67414, 55680, -7369, -29211, -14877, -37196, -76858, -84343, -56383, -14186, -22967, -4128, 13550, 19185, 2385, 9428, 13594, 1647, -146, -23899, 9510, 21386, -40951, -30684, -8750, 26604, 25308, -10353, -19941, -58428]
20019e8428L017J3308j2271N268j9560j0781N9286M0430K6751k331k5111l5704
20007a6126O398P189K471L1537L7669P29o813p0170l1919k2328K1502K300K1340
19994a6221J969J919M617k8135J1829j9084Q157N3429j9971J6691J24j2940Q190
19981A0574J5010j9839K7619K1471K417O296k8216q0894O004l917k584K8621J9046
19968A608N90m3452R663P2381j8093j7714J316l328P798n536K0437M39r84j8157
19954F968n0204l9196J1758M9893J3281J4215j5049l4360k7964j6996n53J2114
19942g6093J6931L7085K082k0358n284L4084K5587p340m0655j6591J0865N891
19930c3796j5459j107J4789K5293L5324k1072M811M6967l8563r595L3304K4609
$$ y = [-58428, -55411, -42103, -54374, -49106, -68666, -79447, -20161, 20269, 47020, 44689, 19578, -16126, -9728, -2539, -68, 31469, 69138, 69867, 63054, -7116, -39035, -61363, -39861, -37561, -16221, -14252, -12333, -7716, -35851, -24022, -43106, -34949, 18480, -1491, 15200, 15324, 2384, 10574, 25584, 5745, 33364, 54835, 57252, 63548, 35332, -45562, -39558, -43475, -46059, -17438, 1608, 2198, -41254, -31591, 40790, 22697, 4983, 6299, 2971, 10769, 5233, 25670, 26109, 25125, 6968, -43236, -82432, -70674, -20781, -7500, 6715, -8334, -42694, -70658, -87654, -88207, -76093, -59162, -22077, -19995, -40353, -45637, -11553, 14034, 6694, -33961, -50552, -39687, -33796, -49255, -50362, -35573, -10280, 25044, 3972, 8783, 55750, 17187, 7592, 40896, 65505]
19918F5505j1687l2514k0805j5788l7388j0913N575L296p72k4333K9842M8996
19906i86J0315k752l3354j1897M380J4515j4883m4844M7458L6048l2383j7238
19894d5621L8608k0520P511L4427j2536J9331j1491m4221j7621J6898j4720j6992
19882f6947M3709Q6162J865p5963K1676K0563m7880P654r26j8129j7783K3511
19870b2488R51M251J3266J3354J2072k913J8693K5525l2265q972n121n3599m5619
19857h2865k2014K0498M2527J8620J4750j4960j0822N742K0691k060N2741j8996
19845B3852p712K7142P702r624k0499k7386n2154P836K6120L6501r915J7599j3068
19832F394m1328M0146M525k9509m7582n965M3681j2642n1671L4428j1640J5665
$$ y = [65505, 53818, 21304, 499, -15289, -52677, -63590, -58015, -54719, -55491, -79824, -49982, -986, 9329, 6577, -26777, -38674, -34294, -19779, -34662, -79506, -32048, 4000, -28383, -45621, -7013, -27533, -20022, 14405, 1869, 21200, 9709, -34512, -52133, -35235, -49955, -66947, -23238, 62924, 64789, -11174, 10502, 31065, -16815, -9161, -10087, -28216, -45999, -22488, -21537, -17286, -4020, 9334, 21406, 18493, 37186, 62711, 30446, 21474, 16353, -37246, -82865, -104879, -84381, -41854, -23234, -8484, -23444, -34266, -28524, -7833, -9893, 42848, 23852, 16140, 43282, 50984, 41360, 20861, -6525, -58679, -50843, -24723, 11778, 1863, 19462, 6394, -34934, 5212, 9737, -19772, -67354, -73319, -29638, -42280, -93951, -59523, -71163, -55498]
19820e5498N4934J1305j563j6956j2736M404l3827J8873J4087J456n975J5679
19808e817Q731m9613j4271L0830J2019L0898J3149J9789l0603k8330L0560L7232
19796E4574K6390j6803M155J0772l6076m7807j0643o059R968N3117l6674Q050
19784A2964R897k0534k6982k2100k0083j9476l1279M5134O1084L3952k6529p9977
19772h3929k3181M6731l582N0003O7442p873o633m0520o149j8755m900k8799K7159
19759c2986J9339O641l0285k712K5437J683n255j9803j6672R591J2907r346M5420
19746C959J942r416j9570q212K7957k418l0112K6430O8494k5702p1699k6952N5350
19733i949L7116K2785k7672j6271K0542k010l5451m9396k6451J2977K3720J4897
$$ y = [-55498, -564, 10741, 9178, -7778, -20514, -16110, -49937, -31064, -16977, -15521, -21496, -5817, 2914, -46699, -60970, -30140, -18121, 12777, 25926, 45715, 15112, -13218, 17342, 54574, 80964, 64161, 68316, 79088, 43012, -4795, -15438, -21497, -11529, 41588, 4914, 12964, 22861, 2327, -24655, -46755, -66838, -86314, -117593, -72459, -11375, 22577, -3952, -83929, -107110, -60379, -63961, -13958, 53484, 45611, 38978, -1542, -7691, -26446, -31346, -60145, -32986, -13647, -7006, -37291, -40003, -14566, -12883, -18138, -37941, -54613, -45022, -32115, -41461, 3959, 5901, -3515, -23085, -31297, -3340, -5758, -35870, -9440, 59054, 33352, -38347, -65299, -9949, 27167, 49952, 22280, 6009, 26551, 24541, -10910, -60306, -86757, -73780, -50060, -35163]
19721c5163m937N286M0705M849K3772K5851j2127j05440l6787N4270R467k9429
19709e9683j0928J0927L4826M308K5097P778r958J243l4254l5481O8698N5088
19697E7661o821k9099l8288m347j7500l9733o1372J4388J9178J5820J0541q46
19685h0418K4350L7207j4118j1483J1135K9561K9327l375J4182K1061m5303K2412
19673C4538Q904J0185L3373K4635j0349l9250p4765l1090o395P327K8935M358
19661i594M965Q1555j1622k9181m8798l912J687N507J9262J3729l8387l5170m3478
19648i3437M84O7188N4662J5716m785J7572m577n1119n3393l2032K5095j0492
19636f9118K9746K0523J5004K6792j5998j7157j410J253j0053k0585M163k5338
$$ y = [-35163, -40100, -34814, 5891, 10740, 34512, 60363, 48236, -57204, -93991, -39721, -30254, -59683, -70611, -59684, -24858, -20550, 4547, 12325, 2367, 3610, -30644, -66125, 2573, 57661, 50840, 21741, -16547, -20894, -38394, -78127, -139499, -125111, -105933, -90113, -79572, -80418, -56068, -18861, -32979, -44462, -33327, -3766, 25561, 22186, 36368, 57429, 12126, 34538, 43442, 53627, 87000, 111635, 101286, 62036, -12729, -43819, -50214, -42887, -13952, -9594, -4629, 76926, 65304, 36123, -12675, -16587, -14900, -9393, 9869, 23598, -14789, -49959, -93437, -92953, -25765, 28897, 44613, 39828, 57400, 52823, 1704, -51689, -83721, -58626, -69118, -39372, -18849, -3845, 22947, 6949, -10208, -11618, -10365, -20418, -41003, -36840, -62178]
19624f2178k2140J5062j0073p810J143M8280M5071k9183j7534J7679R882m486
19612a6287K694K6337J5758j9659j7292J4964k2988k3389J1998L0260J8768j3741
19600G423k3599k6028L0531k20k086l1828j1679L2028K8940M3701j8737l5661
19588g215K3674m932N50J2444o437R245M0946j935q634r095j6489k8056n0868
19575d6802l1941J4723j881J0700j6379l248L4521Q3345j4n6433m114L6578l326
19562A5729j2333M490K0130k5801M0787n3909l8156J4113J6065L3315K138J7105
19550C3673l1443k440o356L8232j6725m5956J8589j0549o587r139k030j9365j9509
19537g9605l9332J3432J5074K0338P0091N2009j2999p230l2972o4764J5640Q380
$$ y = [-62178, -84318, -69256, -79329, -87139, -85996, -37716, 7355, -21828, -39362, -21683, -11801, -16287, -13593, 12744, 28502, 8843, -8449, 6515, -16473, -39862, -27864, 2396, 21164, 7423, -16176, -42204, -11673, -11893, -13979, -45807, -57486, -25458, 3482, 47183, 28446, -7215, 16459, 11527, 12077, 24521, 18084, 27329, 68275, 66340, 57706, 48611, 32122, 4066, -46802, -78743, -64020, -65901, -55201, -71580, -74828, -40307, 43038, 43024, -13409, -17523, 19055, 15729, 3396, 7886, 28016, 2215, 43002, -10907, -49063, -34950, -18885, 14430, 16568, 33673, 2230, -210, -6566, 31666, 14941, -31015, -12426, -22975, -29562, -38701, -40731, -60096, -79605, -118937, -105505, -90431, -70093, -2, 52007, 39008, 31778, -1194, -65958, -50318, -41938]
19525d1938J2094M880m9109J2876j753Q712M4765L598O168K9535R378j5995j5975
19512G236l6595k6834k6156N586K6218L2183O130K265o313K8233J5317j3662n5440
19499d1832j4312R207K8699O187K0255J9820o575j5730k9128j5114O6562N995
19487C4034k1192j6090L6844J8568r957n6710l3048J2599J3877m2552m8097M0113
19475g1611M358k0135N9879M1452J3236j7827k6191p85J4711L1583l0108m1313
19463d2751K6536m211K3943q243k6295L41J2646Q055l1683m174Q623Q157N236
19450b3820J373N42n552l7366j781p138k0666K7907L9169m9847l2909M0186K1143
19437d8759J1856m1260J506K5934L8097L847k4856J3109q495j8502K0457M237
$$ y = [-41938, -29844, -24964, -74073, -61197, -62950, -54238, -9473, -5875, 293, 29828, 39206, 23211, 7236, -29359, -56193, -82349, -76763, -50545, -18362, -12232, -9967, -16280, 11953, 27270, 13608, -41832, -56144, -46937, -18238, -12051, 8204, 28024, 21449, 5719, -23409, -38523, 28039, 34034, 12842, -3248, 33596, 52164, 42207, -14503, -47551, -34952, -21075, -63627, -111724, -71611, -67253, -87388, -27509, 13943, 27179, 9352, -16839, -17624, -2913, 28670, -1438, -42751, -16215, -20426, 3517, -4726, -31021, -30680, -18034, -9979, -41662, -45836, -37213, -29056, -23820, -22447, -21905, -27457, -64823, -66604, -73742, -94408, -66501, -27332, -77179, -110088, -69902, -48759, -36903, -78163, -76657, -50723, -12626, -8779, -33635, -20526, -29021, -47523, -27066, -22829]
19425b2829J9580L529l6733j0475J6015o8393j1286L0426Q564M5520K7963K4552
19413B6433J6495j7666l8853K4074N3073J7004p0143n3703j2860L8456J7588K412
19401B310j738r660p18J823J1500j843N5071R135k8698k6101O41L5567k2328k2412
19387B549k575j7603k3122k2906N908R71J1724m1576p488L5371J5245j2571q846
19374f4919J2849N437j8324J3590j3467k0344J4061L4612M1708R043l3914k5641
19362d5309j6836r598K8185K3480l6635J3541L3271N79k341l451j2961j0826J6809
19349b2092L2328k0452J818J3644L914q658j8271Q268N1838J0936l9216m6689
19337c2632P6287M6647R36n2717n8874M288P153k4917l331N607L8099n375o7219
$$ y = [-22829, -3249, 280, -36453, -46928, -30913, -99306, -110592, -80166, -71602, -26082, 1881, 26433, 42928, 25262, -13591, 10483, 63556, 80560, 10417, -43286, -56146, -17690, -102, 2310, 572, -9088, -9806, -7983, 3517, 1674, 56745, 65880, 37182, 11081, 11722, 47289, 24961, 2549, -26, -17629, -40751, -63657, -57749, -56778, -45054, -86630, -94118, -58747, -43502, -56073, -64919, -52070, -46633, -64957, -51367, -64834, -85178, -71117, -36505, 5203, 14246, -19668, -45309, -62145, -71743, -43558, -20078, -56713, -43172, -9901, -9322, -11663, -15114, -28075, -38901, -22092, 10236, -10216, -8398, 5246, 9160, 502, -17769, -9501, 42337, 53273, 14057, -32632, 43655, 90302, 91238, 38521, -20353, -16065, -8912, -33829, -37160, -31553, 6546, 1171, -66048]
19324f6048l8097M578J875Q887K8098K8734N3592r983p537J3951k5097j5323J9859
19311b511J9692k7283p789M6033k7098l9215J9308J1185M1731J1968N790m7458
19299D353j4063j0051N424M328l256K9568M8386L4587p1303l5907K2314m744J0597
19286B0233N7416l1654k968k052l9757q924J6000J2557j8184l3918M2726Q174
19274A9649m1283k1862N993K4540L8840J4468k6121K9364k0513p6164R860K0090
19262b3139N1498j4292n8941l1912J5161N4686J1304M689K8063J3679m1504r278
19250A4J1529r030l8087L149k1940O774J1492K1505O301o726K2164K297o700J5335
19236A8077k8800L3876L3706R200k5808l7704j0536O7478K3429o0492o0065n264
$$ y = [-66048, -104145, -99567, -97692, -88805, -60707, -31973, 21619, 11636, 4099, 18050, -7047, -22370, -2511, 17181, -10102, -17891, 28142, 1044, -38171, -18863, -7678, 34053, 46021, 51811, 4353, -9710, -19761, -14337, -10009, -13265, 16303, 64689, 99276, 27973, -7934, 14380, 9636, 20233, 77649, 45995, 43027, 40975, 1218, -7706, 8294, 20851, 2667, -31251, 11475, 19649, -21634, -43496, -37503, -12963, 25877, 40345, 14224, 43588, 23075, -53089, -43229, -23139, 28359, 14067, -44874, -76786, -61625, -6939, 4365, 9054, 37117, 50796, 9292, 14, 11543, 2513, -35574, -32425, -54365, -47591, -36099, -14594, -8293, -15019, 7145, 9442, 2742, 18077, -10723, 23153, 56859, 66059, 40251, 2547, -7989, 59489, 82918, 22426, -37639, -42903]
19224d2903M0959m7573l4085N1060O371N3103k5437J7185R198K7369j7849l03
19212C7095J3460K680j3449K5801J0954j9641k4153L263R570j2553m1405J9832
19200A1454K4156K3629j6858l0661m5408j6871J8454L309o400r735L8567N0101
19188D3737k7521k5205j0653j1794J0407L939K339J5431L0598j4890J2541R878
19176C8807K6979j7849J298k6179K7604M8302J935L201M8729L0821k364m0809
19164A40475L734l421k6547q320l4138N1576J0446K2591k4100P0195M8344K3877
19152B74712l8565p4557l235k299k6646m6001L4173l51J83k8899m475p924j0396
19139F5720p209j7780J9775K1991k0431l1138l7606q668K7120N3031k2086k734
$$ y = [-42903, -1944, -49517, -83602, -32542, -26171, 26932, 1495, 18680, 27878, 55247, 37398, 37095, 50555, 53235, 39786, 65587, 76541, 56900, 32747, 36010, 45580, 33027, -8378, 11454, 35610, 59239, 42381, 11720, -33688, -50559, -32105, -28796, -35196, -44931, -6364, 43737, 16216, -8989, -19642, -31436, -21029, -17090, -14751, 680, 31278, 16388, 28929, 38807, 65786, 47937, 49235, 23056, 50660, 98962, 100897, 104098, 152827, 183648, 181284, 140475, 144209, 140788, 114241, 105921, 71783, 123359, 133805, 156396, 132296, 202491, 250835, 274712, 236147, 161590, 158355, 156056, 129410, 83409, 117582, 117231, 117414, 88515, 84040, 76116, 65720, 58511, 40731, 60506, 82497, 62066, 30928, -6678, -15346, 11774, 64805, 42719, 39985]
19127C9985J7012j5922l9968m356J4411J1168K4167M3495M4629K8443R829j7421
19115A55472j9913K3360k8455K5559m7333k6192L402K1402L4289J0389M997k1450
19103A35527J1463O1818J5922j3613n7107j4397q5688m0391j903J8399l370J3050
19091C9710L640k2337Q87K8713L5298Q03r05j6430n8384k4565J9175r423m373
19078h191N1073J1540n7580n864j4723k2815O9896J5479j5084J0062K140O857
19066D2790q661Q155K3870k3101l1833P170l9087j3542N944J3676j1085M860Q729
19053a2115j3257J4964K5142o3586k5672J2805K0740K4221j0338l533L4438n655
19041a846m884J1361N419m366J6098Q75M6326L4652M7030M7002j0495L6553L1806
$$ y = [39985, 56997, 41075, 1107, -3249, 11162, 22330, 46497, 89992, 134621, 163064, 172893, 155472, 135559, 158919, 130464, 156023, 108690, 82498, 85900, 107302, 141591, 151980, 156977, 135527, 146990, 208808, 224730, 211117, 154010, 139613, 53925, 13534, 11631, 30030, 26660, 39710, 43350, 21013, 21900, 50613, 85911, 86714, 85809, 69379, 10995, -13570, 5605, -3818, -8191, 42882, 54422, -3158, -9022, -23745, -46560, 23336, 38815, 23731, 33793, 35933, 42790, 34129, 42284, 66154, 43053, 11220, 18390, -20697, -34239, -28295, -14619, -25704, -20844, -12115, -25372, -10408, 14734, -48852, -74524, -61719, -40979, -16758, -27096, -30629, 3809, -1846, -6730, 4631, 10050, 5684, 21782, 22657, 68983, 103635, 150665, 197667, 187172, 223725, 255531]
19028B55531L3509M3456J5078J1319K7598j577o5004l0087p8585j8488q224K5222
19016B09748J08106L3763o930K0056L1543q5589q1846O20n1738n1221p1667K9973
19004H4818L6391J3940p359j9925k434J481j1331j8827M001J3415J88k2908l5070
18991C6380j6348N7257k374n928k0608k6243k2410M666L8868L9257Rk0511j4120
18978D7895j7874j4381N329j852M790M18K0934J8852K3792j5477l1986l9806K0376
18965B1010k148k9024j383K8553q427R968K4701m344k2306N119L5114k8950n667
18952B2216J3624l5124l1368L3417O4130l0857L2144m2888n97M1988J7223l5745
18940D8163n322L5268j8915p841J1809K833r820m2681r701K5613M3046j0559j7126
$$ y = [255531, 289040, 332496, 347574, 358893, 386491, 384914, 319910, 289823, 211238, 192750, 184526, 209748, 317854, 351617, 344687, 364743, 396286, 310697, 228851, 229471, 177733, 126512, 54845, 84818, 121209, 135149, 127790, 107865, 105431, 106912, 95581, 76754, 80755, 94170, 94358, 71450, 36380, 20032, 77289, 74915, 68987, 48379, 22136, -274, 4392, 43260, 82517, 82526, 62015, 47895, 30021, 15640, 20969, 19117, 23907, 24325, 45259, 64111, 87903, 72426, 40440, 634, 21010, 18862, -10162, -11545, 17008, 8581, 18549, 43250, 38906, 16600, 21719, 56833, 27883, 22216, 35840, 716, -30652, 2765, 66895, 36038, 68182, 25294, 24697, 66685, 83908, 48163, 42841, 78109, 59194, 51353, 63162, 65995, 56175, 13494, 3793, 29406, 72452, 61893, 44767]
18927D4767k8566j0159P844N8070K0928n5302r514q166j5682J6878k2208k6258
18915b7368k0301M8953L5250J1208o735J1103K3486j2134l8727J584l029M256
18903B7546q479m6255K3753J1845J4606J04J4725j3561K5328j5038mj6656L4433
18890E2347j730K97K5694j5251k6094k3997Q366R173r470m478P366k2929L7946
18877C7240M0130j2925k9770M1565l1252j5267P341J6265J2460o997m0363O752
18865B5179M8661J8087j4727l5088j8975k9551R031M9449K1444j3318J012j8985
18853D2219J2098K799k8237N1461q59j1479K1112n9651j4743j1420J4811k594
18841A5517k0319M7604J0095k6036L0259K8587K4842M0197k5018m7598n7599k8148
$$ y = [44767, 16201, 6042, 13886, 71956, 92884, 37582, 28068, 19902, 4220, 21098, -1110, -27368, -47669, 1284, 36534, 47742, 41007, 52110, 75596, 63462, 24735, 26319, 23290, 27546, 19067, -27188, -3435, 8410, 23016, 23120, 37845, 24284, 49612, 34574, 34570, 17914, 52347, 50617, 50914, 76608, 61357, 35263, 11266, 19632, 28805, 19335, 14857, 22223, -706, 37240, 77370, 64445, 34675, 76240, 44988, 29721, 37062, 53327, 65787, 58790, 18427, 25179, 73840, 91927, 77200, 42112, 23137, -6414, 2617, 52066, 73510, 60192, 61204, 42219, 54317, 57116, 28879, 80340, 79481, 68002, 89114, 29463, 14720, 3300, 18111, 15517, -4802, 42802, 52897, 26861, 57120, 85707, 110549, 150746, 125728, 78130, 20531, -7617]
18829g617k4287n404O2937O059J4631N7974j8983k6980j0868M662J6546K6404
18817I5074o317l7942o409J6104k35p1626l8210J7732M1685N7546K0979k9608
18805E8773l8558k0700M0550J7944O811r472q513J1991k4207k1711J1265Q815
18793C2988j4674j1990j3188n927k3086N3285P1456j8316n3896j9896K6415J8310
18781D1481O6317k149o8201O687R659K7397M3303K347J8357J1350M5793L9138
18769B41479j73L4793J7382l7391L5124L8745L107J1994L6335l033k921n302n1853
18756C18286m5052p4966l0063P8687J2012k5538J570K2071l5326j4671N1718L2491
18744B91219J32K2303q441k4342n697K9876M499l0824o2758N961O4963O386j9105
$$ y = [-7617, -31904, -37308, 25629, 31688, 46319, 104293, 85310, 58330, 47462, 52124, 68670, 95074, 88757, 50815, 44406, 60510, 60275, -11351, -49561, -31829, 9856, 67402, 88381, 58773, 20215, -485, 40065, 58009, 64820, 55348, 46835, 58826, 34619, 12908, 24173, 32988, 18314, 6324, -6864, -12791, -35877, 17408, 88864, 70548, 16652, -3244, 23171, 41481, 107798, 105649, 37448, 44135, 53794, 81191, 124494, 126841, 145198, 156548, 202341, 241479, 241306, 276099, 293481, 256090, 291214, 329959, 333066, 345060, 381395, 378362, 375441, 370139, 318286, 273234, 198268, 168205, 246892, 258904, 233366, 234936, 257007, 221681, 207010, 258728, 291219, 291351, 313654, 305213, 280871, 275174, 305050, 309549, 278725, 215967, 221928, 286891, 293277, 274172]
18731B74172j670N258N9203K0871J1457L0845J3377n897k195l697m769K0972K8959
18718D46886k218l3703J5427M6364J2879l0709J4565j4206P518J7834k2023k9929
18706D28685l6174l1914n006l1146J6852J4028M69o856j7084l2105J7113J1071
18694C27933K1955o859M1788P0849K5719J8988J76L5448j4176l5844k9277K2099
18682D78799O4895N8391l782N9863J19096J30017R3472M4242P231J8698O067J1777
18670A088766P1105J11587J13729K12267K62508J82646K23245K94367L60570N81000
18660C501790Q50417J279556K090905L372256M991491N400328L898481L365831
18652B8751055L937087R94991n332351o749243m207552j695139K63172K241100
$$ y = [274172, 272502, 277760, 336963, 357834, 369291, 400136, 413513, 407616, 405421, 401724, 396955, 417927, 446886, 444668, 410965, 426392, 472756, 485635, 454926, 469491, 455285, 462803, 480637, 458614, 428685, 392511, 360597, 355591, 324445, 341297, 355325, 355794, 348938, 331854, 299749, 316862, 327933, 349888, 343029, 384817, 455666, 481385, 500373, 500549, 535997, 521821, 485977, 456700, 478799, 543694, 602085, 598303, 658166, 777262, 907279, 1000751, 1044993, 1052224, 1070922, 1076989, 1088766, 1159871, 1271458, 1385187, 1597454, 1859962, 2042608, 2265853, 2560220, 2920790, 3501790, 4352207, 5631763, 7722668, 11094924, 16086415, 21486743, 25385224, 28751055, 32688142, 33683133, 28350782, 21601539, 17393987, 15698848, 15962020, 18203120]
18644A8203120M391626N491800M148326L069000L622326J202695n937999r025843
18636B5165051o714105m140359k518207j653884j174954q35742o12589l92277
18628G122934l34870l04665k01551j20974j74273j41096q0878j54730j24316n7237
18618E428344o4185K346L5143K7956M3520N4580J22321J88732L08051M72564P76152
18607G395524J254163J960685L264660N003557N698544M326313L401935M041801
18599C6347182J672490m875910p262583m926539k156691J44260K379085M908043
18591B6229337O567604N181740L444840M213422K463977n936851j0938865q554240
18583B2670964n284662l190180k094542j440951j019424p62895n93612m38374
$$ y = [18203120, 22594746, 28086546, 32234872, 35303872, 38926198, 40128893, 34190894, 25165051, 18450946, 14310587, 11792380, 10138496, 8963542, 8127800, 7515211, 7122934, 6788064, 6483399, 6281848, 6160874, 5986601, 5845505, 5764627, 5609897, 5485581, 5428344, 5364159, 5366505, 5401648, 5429604, 5473124, 5527704, 5650025, 5838757, 6146808, 6619372, 7395524, 8649687, 10610372, 13875032, 18878589, 24577133, 28903446, 32305381, 36347182, 38019672, 33143762, 25881179, 20954640, 18797949, 18942209, 21321294, 26229337, 32796941, 37978681, 41423521, 45636943, 48100920, 42164069, 31225204, 22670964, 17386302, 14196122, 12101580, 10660629, 9641205, 8878310, 8284698, 7846324]
18575G846324l94216l71271l01336k81862l03515k63134j81575j72624j55191
18566E421600j49246j14608j19743j64806k02778j56635j21503j08521j16689
18557D167071j00607k7841l4422o2946k9735q0033j17985j08683j05901j05529
18547C393389q9259r1812q0910j7663l6851o9278p0907n8470j3537J5115J64R175
18535B889156j7245l4985L822M1732J37045J69415J62728J84778J74983J63851
18525C875280J61162J19347J17746J20978J90118L28872M73304O17081O84209
18516F688097Q64908J177331J696556K443404L960791O400384R104315J0282264
18508D2618050J0855199J1805890R111353K066605k844035o111864j2011087j1522595
$$ y = [7846324, 7452108, 7080837, 6779501, 6497639, 6194124, 5930990, 5749415, 5576791, 5421600, 5272354, 5157746, 5038003, 4873197, 4670419, 4513784, 4392281, 4283760, 4167071, 4066464, 4038623, 4004201, 3941255, 3911520, 3831487, 3713502, 3604819, 3498918, 3393389, 3304130, 3212318, 3131408, 3113745, 3076894, 3007616, 2936709, 2878239, 2864702, 2879817, 2879981, 2889156, 2871911, 2836926, 2840748, 2882480, 3019525, 3188940, 3351668, 3536446, 3711429, 3875280, 4036442, 4155789, 4273535, 4394513, 4584631, 4913503, 5386807, 6003888, 6688097, 7553005, 8730336, 10426892, 12870296, 16831087, 23231471, 32335786, 42618050, 53473249, 65279139, 74390492, 76457097, 73613062, 67501198, 55490111, 43967516]
18500D3967516n768783k51926M079170O023461O214930P227324O508039M11270
18492F8411001n598728p385223j0414226j0967982p755825m793369k983410k039150
18484A6473088j482912j138160q46686p65769p54038o43311n02302m61123l99680
18475I479107l58605k75876k40667l00100l32527k88153k98712k64234k56092
18466F864141k10006j88092j89147j62540j05678j71377j51197j88820j87956
18457E309328j77018j95241j53154q8762j06643r0236j35975j36829j25896j54786
18447C944788j29655r0134n6660p8795r7852o1636j01805j00178o2335o6608n3306
18436C045824o1738p8540p2072r8075m7966m4356o0690P130k4292r6039n4544
$$ y = [43967516, 38198733, 37946807, 42025977, 48049438, 54264368, 61491692, 67999731, 68411001, 62812273, 55427050, 45012824, 34044842, 26289017, 21495648, 18512238, 16473088, 14990176, 13852016, 13005330, 12239561, 11485523, 10842212, 10339910, 9878787, 9479107, 9120502, 8844626, 8603959, 8303859, 7971332, 7683179, 7384467, 7120233, 6864141, 6654135, 6466043, 6276896, 6114356, 6008678, 5837301, 5686104, 5497284, 5309328, 5132310, 4937069, 4783915, 4695153, 4588510, 4498274, 4362299, 4225470, 4099574, 3944788, 3815133, 3724999, 3668339, 3589544, 3491692, 3430056, 3328251, 3228073, 3165738, 3099130, 3045824, 2984086, 2905546, 2833474, 2735399, 2687433, 2643077, 2582387, 2589517, 2565225, 2469186, 2414642]
18425B414642m1499p6173n8948n0436q0402n1181j9617k9091m4121j9140j0127
18414A933907r268l3841o7551o0094m0555k4776n6111l4362m5559j6155j5890
18403A529745m1008k4076J3374J5623P104O188q0296o1574m6874n4905J6784k059
18391A278026m0981k3339l6034j2646K7795k4566p170N7938M6855J1969J0631
18380A288478J5932K8107o935k5365l6669n9434o0610j088O99j0567K1085L728
18368A157361L3008K9039Q55q9807o6051l2211m8253n9976k3869n2469r1921r447
18356G46259K9442J8152r977j1305m6377K5831j3645j2795L370K5181n074p5644
18344F73418m8485j9671q26J5849m7880l52K1998L0526K3477p609o3297j4142
$$ y = [2414642, 2373143, 2296970, 2238022, 2187586, 2107184, 2056003, 2036386, 2007295, 1963174, 1944034, 1933907, 1924639, 1890798, 1823247, 1763153, 1722598, 1697822, 1641711, 1607349, 1561790, 1545635, 1529745, 1488737, 1464661, 1478035, 1493658, 1500762, 1506950, 1426654, 1365080, 1318206, 1263301, 1280085, 1278026, 1237045, 1213706, 1177672, 1165026, 1192821, 1168255, 1161085, 1219023, 1265878, 1277847, 1288478, 1304410, 1332517, 1325582, 1300217, 1263548, 1204114, 1143504, 1142416, 1143115, 1132548, 1153633, 1157361, 1190369, 1219408, 1220263, 1130456, 1064405, 1032194, 983941, 923965, 900096, 847627, 755706, 746259, 775701, 793853, 783876, 772571, 726194, 752025, 738380, 725585, 728955, 754136, 749062, 673418, 624933, 605262, 604436, 620285, 572405, 572053, 594051, 624577, 648054, 640445, 577148, 563006]
18332E63006J7467Q090n1865o4061k2779K3566J4139J5091L6211M2213q007r907
18320E63164O186M7882J1400l3486K134l2726k4514n6227n7042j8943K2818O016
18308D36662K759J3436k0455J9661O2932n8693o5051k8349k1371J7852j4987p024
18296C37372k4103k2945j8314j9982o522L2171J4951J590M032j9146m8647k6646
18284B03811j0769l4382L0893L2964J0459J5152J3308j6619r329l2670J3159N600
18272B21577m3010k8654J478K9121K147j9481J1917M732n527O979J1822J6248
18260B09349K1963J1325K5322J5321j2015l2167M081j8420j7742j9170l5917K638
18248A54568q480k0186l4417k8130J8932R609O584O3704J5308m5002o761l9693
$$ y = [563006, 580473, 588563, 536698, 472637, 449858, 473424, 487563, 502654, 538865, 581078, 573071, 563164, 569350, 617232, 628632, 595146, 597280, 564554, 540040, 483813, 426771, 407828, 430646, 436662, 439421, 452857, 432402, 452063, 514995, 456302, 391251, 362902, 341531, 359383, 344396, 337372, 313269, 290324, 272010, 252028, 245506, 277677, 292628, 294218, 298250, 279104, 230457, 203811, 193042, 158660, 189553, 222517, 232976, 248128, 261436, 244817, 235488, 202818, 215977, 221577, 178567, 149913, 151391, 180512, 182659, 163178, 175095, 179827, 174300, 181279, 193101, 209349, 231312, 242637, 267959, 283280, 271265, 239098, 243179, 224759, 207017, 187847, 151930, 154568, 146088, 125902, 91485, 63355, 82287, 91896, 98480, 162184, 177492, 132490, 125729, 86036]
18236H6036j9529K2705N4236L0505J0126k7617n7930J1432p889N451j6712k4733
18224F6081m6304J7250O2654J3737n3419l3733p836j5921Q778J4059M28J0761
18212C6535J4345J7124J6442m7343L257q385J7320L5120Q504j2028J3762q82q944
18199H4827l378K0914J0716M682K0443j7604j0387J0229M324J1529k4913L1044
18187A42426J5683K1540M802N2972P1873K476J3041N525J0143J5607k7461n1458
18175B77169j9260k4137m4818q2477l4969J1258m915K008r368Q617l764L2097
18163A07441m5529l3844k9506l3283M069Q809l591r564J2336O4277J2352l6173
18151A7794j9448L6692K5003K2067L0557J1733k3123N203p424o799L830J8645
$$ y = [86036, 66507, 89212, 143448, 173953, 184079, 156462, 98532, 109964, 102075, 107526, 90814, 66081, 19777, 37027, 99681, 113418, 59999, 26266, 18430, 2509, 11287, 25346, 25774, 36535, 50880, 68004, 84446, 37103, 40360, 31975, 49295, 84415, 92919, 80891, 94653, 93771, 84827, 81449, 102363, 113079, 117761, 138204, 120600, 110213, 120442, 124766, 136295, 111382, 142426, 158109, 179649, 184451, 237423, 309296, 311772, 324813, 330338, 340481, 356088, 328627, 277169, 257909, 233772, 188954, 106477, 71508, 82766, 77851, 79859, 70491, 79108, 75344, 107441, 61912, 28068, -1438, -34721, -30652, -21843, -25434, -34998, -22662, 41615, 53967, 17794, -1654, 35038, 60041, 82108, 112665, 124398, 101275, 106478, 99054, 92255, 96085, 114730]
18139A14730N8701K3852p770K3696J0232K1929K1262O058L9589J3716j4916J6297
18127C27376J4690O938K556j8260j7473k5977k9418l4757j6291k1187l0082j7355
18115A40760j4292k8012l7658K0923L9990k201J4184k3220m63K7954J7835m5545
18103A10255r948j469k3661M441j674j4582m187l636K6586j3937j3653J4141n534
18090F3142k7169J8845J8454J4756n115M4681K8024O663O118J8485O410J463m0985
18077A53772l9029m739K1157J2172J7434N9194O848n84M3173J3955j2829m2423
18065B28101l3936k7413o4876j7450n946m466J9254j1676m993K5655O892j7309
18053I1837k2333l2064j4303j132J2152L6534K4587K4963J1658j4806m9023l2678
$$ y = [114730, 173431, 197283, 189513, 213209, 223441, 245370, 266632, 272690, 312279, 325995, 311079, 327376, 342066, 349004, 351560, 333300, 315827, 289850, 260432, 225675, 209384, 188197, 158115, 140760, 126468, 98456, 60798, 81721, 121711, 119510, 133694, 110474, 110011, 137965, 155800, 110255, 100307, 98838, 75177, 79618, 77944, 63362, 59175, 55539, 82125, 68188, 54535, 68676, 63142, 35973, 54818, 73272, 88028, 82913, 127594, 155618, 162281, 168399, 186884, 193294, 194757, 153772, 114743, 110004, 131161, 143333, 160767, 219961, 226809, 226225, 269398, 283353, 270524, 228101, 194165, 166752, 101876, 84426, 78480, 74014, 93268, 81592, 76599, 102254, 109146, 91837, 69504, 37440, 23137, 22005, 34157, 70691, 95278, 120241, 131899, 117093, 68070, 35392]
18041C5392K2568J1819J7067k4845j2078l8689k1903J7393j3470J020N8300l946
18029D8628k8318N2820K2372o3590j6721l928K5122j1941m555K6967j5907n2925
18017b1976J234j0421l171L7412M354M7235k6537l4365k609M8685J131l2153l1096
18004b2277P515J8143L7166L7249K0305n5114Q838M4794K4766r989l2211o698
17992G2487m3231L527M738j4417l226R5943O3462N1508L8778J5900j4874L2284
17980C02879k2676k905K7013j7843o4233m3403J2522L4099N6456O2798J404o187
17968C39924k0610m805m2868n2079m7310Q707k1871n280j6450q2063p6874K9781
17956H202k273n711N3452L7296k8615k1463k141J2322J6087k958k9636m7007K9669
$$ y = [35392, 57960, 69779, 86846, 62001, 49923, 11234, -10669, 6724, -6746, -5726, 52574, 48628, 20310, 73130, 95502, 31912, 15191, 11263, 36385, 24444, 19889, 46856, 30949, -21976, -20742, -31163, -34334, 3078, 7432, 54667, 28130, -6235, -8844, 39841, 40972, 8819, -22277, -14762, 3381, 40547, 77796, 98101, 42987, 51825, 96619, 121385, 111396, 79185, 72487, 29256, 32783, 37521, 23104, 19878, 115821, 179283, 230791, 269569, 285469, 270595, 302879, 280203, 277298, 304311, 286468, 222235, 178832, 191354, 225453, 281909, 344707, 346111, 339924, 319314, 314509, 271641, 219562, 172252, 180959, 159088, 153808, 137358, 55295, -21579, 8202, 5929, 218, 53670, 90966, 62351, 40888, 38747, 51069, 67156, 64198, 34562, -12445, 17224]
17943A7224O1922J2654o6624k2698r411K3626K6283j7273n2201m1569K9785L7644
17931f38j1797K181K7826K1761j3271l1786j9977l3551O7210L6693n396K1556
17919F0811J6854L784j9805r96j6688Q694m017r162j7005L796k6854m8007M3680
17906d915K9186M7885M6554k7171j3345n5925K5332k2223k6890k2802J8164K3142
17894A6992L242k9684p235L3078J0749N851J7006N499l3562k6290O488K172M4151
17881D8457j7243o4337m2399j6571K2583L3159k598Q340L2747P8181K5879l7795
17869F8403j3665k2890j3515n8209j7322N0700K2452L6146Q73o4426j8670k2689
17857e2812j2881Q3365M7019L1754M4604k4210k0484j1343j3669o6701n5540p675
$$ y = [17224, 79146, 91800, 25176, 2478, -6933, 16693, 42976, 25703, -26498, -68067, -38282, -638, -12435, -10254, 17572, 39333, 26062, -5724, -25701, -59252, 7958, 44651, 39255, 60811, 77665, 81449, 61644, 60648, 43960, 52654, 48637, 39475, 22470, 26266, -588, -48595, -4915, 24271, 72156, 118710, 91539, 78194, 22269, 47601, 25378, -1512, -24314, -6150, 16992, 20234, -9450, -16685, 16393, 27142, 32993, 49999, 55498, 21936, -4354, 2134, 4306, 48457, 31214, -33123, -75522, -92093, -69510, -36351, -38949, -30609, 2138, 80319, 106198, 68403, 54738, 31848, 18333, -39876, -57198, -6498, 15954, 52100, 52973, -11453, -30123, -52812, -65693, 17672, 64691, 96445, 141049, 116839, 96355, 85012, 71343, 4642, -50898, -58573]
17845e8573k1072j8417n606K078J1202L5730K2694K7728Q959k3212J5533q198
17833a1154O268k733j9609M1372J5173l1481j9057J8949r738n9980n836J500j7318
17820i3644R317M1220L5149K5937L8221J1685l6307j4932l3774J193M4524K8382
17808E6971l7173j6114P783J7231M9115R348l792n7006j4435L6908l4579P188
17796B1445R979m7582n8141r132m520o200M1814J1648N2253Q7057M3936J6469
17784A59026L90M2215L7636J5376K5412K9513k5347J4032M4095M613l9840l9335
17772B67786J6066L7276M0511m3055j4640p0693k0104j922J3520K0203P842L1014
17760B83804K3188j0071m7136K0019O826n8515k2132l3708l6721J8974K7522L2036
$$ y = [-58573, -79645, -98062, -103668, -101590, -90388, -54658, -31964, -4236, 4723, -18489, -2956, -11154, -4886, -7619, -27228, 14144, 29317, -2164, -21221, -2272, -12010, -71990, -77826, -76326, -93644, -84327, -43107, -7958, 17979, 56200, 67885, 31578, 16646, -17128, -15935, 28589, 56971, 19798, 3684, 11467, 28698, 77813, 87161, 83369, 26363, 11928, 48836, 14257, 21445, 31424, -16158, -74299, -83431, -87951, -94151, -52337, -40689, 11564, 98621, 142557, 159026, 159416, 201631, 239267, 254643, 280055, 309568, 284221, 298253, 342348, 346961, 307121, 267786, 283852, 321128, 361639, 318584, 303944, 233251, 213147, 211225, 224745, 244948, 252790, 283804, 306992, 296921, 249785, 269804, 276630, 218115, 195983, 162275, 125554, 144528, 172050, 204086]
17748B04086J4143J386K3295j9759j9275j1529L3904K4764j6290j8088P970j525
17736B23082l550L5030O40J2975L6792K3364M9882K9012L504M6072N347p4873
17724C87277l121N3456k9817l9764j6267J4450q676L9355M3219J6009n1878M635
17712D08878k6207r69m3318l1060L1619k219o3694K1282L2307J9757Q682K0858
17700C75916j4559l2648r885P074r673M7658K7426K0971L057M2495M9982M5258
17688E53072O6741L1467K9892K7779M4183J13484J63616J83863J27088J42093
17678A483278J21823L6727l082J3980L3769Q0809Q9177J22000K57735K72439L83438
17667B892093N46817P44337R90364J448175K154080L418866N653253Q601002J0355907
$$ y = [204086, 218229, 219615, 242910, 223151, 203876, 192347, 226251, 251015, 234725, 216637, 224607, 223082, 219532, 254562, 255202, 268177, 304969, 328333, 378215, 407227, 410731, 456803, 462150, 387277, 384156, 437612, 407795, 368031, 351764, 366214, 357538, 396893, 440112, 456121, 404243, 408878, 382671, 381702, 338384, 307324, 338943, 336724, 273030, 294312, 326619, 346376, 355058, 375916, 361357, 328709, 318824, 325898, 316225, 363883, 391309, 412280, 415337, 457832, 507814, 553072, 619813, 651280, 681172, 708951, 753134, 866618, 1030234, 1214097, 1341185, 1483278, 1605101, 1641828, 1638746, 1652726, 1686495, 1767304, 1856481, 1978481, 2236216, 2508655, 2892093, 3438910, 4183247, 5173611, 6621786, 8775866, 12194732, 17847985, 26448987, 36804894]
17658C6804894J0253247J0900169J0169347L859957m011722p368869j2485635
17651D8121388j4033352r747024n826459l587533k362406j604612j141153q69025
17643H949824p27740o21225n75431m23594l14708k63226k05531j32918k9280k159
17633E654012j1336m1735l4648o0238j32855j18349j37493j07102o4607j28357
17623D817292j26558r7126k8314L5869M7492J30562J62018K61142L92781N38875
17613F134033P41613J113445J790263K818064M667202P411827R290123R242286
17605D3208856R771405R509829M297359l139006o262633j0857975j3205128r482513
17597B3840194n598346l438945k251111j514785j112815q40326o71757o21696
$$ y = [36804894, 47058141, 57958310, 68127657, 71987614, 67975892, 60607023, 48121388, 34088036, 24341012, 18514553, 14927020, 12564614, 10960002, 9818849, 8949824, 8222084, 7600859, 7025428, 6601834, 6287126, 6023900, 5818369, 5685451, 5656171, 5654012, 5642676, 5600941, 5566293, 5506055, 5373200, 5254851, 5117358, 5010256, 4945649, 4817292, 4690734, 4593608, 4565294, 4601163, 4648655, 4779217, 4941235, 5202377, 5595158, 6134033, 6875646, 7989091, 9779354, 12597418, 17264620, 24676447, 33966570, 43208856, 52980261, 62490090, 66787449, 63648443, 57385810, 46527835, 33322707, 23840194, 18241848, 14802903, 12551792, 11037007, 9924192, 9083866, 8412109, 7790413]
17589G790413n49399m18968l60989k72255k27621j59130q7406j13380p3656q8724
17579E438885j76562k38796k25230j90687k66164k53884r9438j02224j32129j13815
17569C639956o9860n7998j07949r9563r6554j36759j37993p5739r7111o2008k6287
17558B672135k2086n3094k3006o2537r0345p5880q6297o8533k0952r5853q3288
17547A990264k9695l3179m7787m4920j2403p4176n2969j9732j3337l4606P972
17536A635432J1367k590n5236k544j0679j9082K7243M0659j0830o1178m1194n6186
17524A455182r1677n3472l5991n0224k0805J55k909k1247l9754k783n3902M170
17512A086743m8830n2013m4356l7449k2833J842J6406k6211m6920K7884j604K9572
$$ y = [7790413, 7241014, 6822046, 6461057, 6188802, 5961181, 5802051, 5714645, 5601265, 5527609, 5438885, 5262323, 5023527, 4798297, 4607610, 4341446, 4087562, 3988124, 3885900, 3753771, 3639956, 3570096, 3512098, 3404149, 3304586, 3208032, 3071273, 2933280, 2857541, 2760430, 2698422, 2672135, 2650049, 2596955, 2573949, 2511412, 2421067, 2345187, 2258890, 2190357, 2169405, 2073552, 1990264, 1960569, 1927390, 1879603, 1834683, 1822280, 1748104, 1695135, 1675403, 1662066, 1627460, 1635432, 1646799, 1644209, 1588973, 1586429, 1575750, 1556668, 1583911, 1624570, 1613740, 1552562, 1511368, 1455182, 1363505, 1310033, 1274042, 1223818, 1203013, 1203168, 1200259, 1179012, 1139258, 1136475, 1082573, 1086743, 1037913, 985900, 941544, 904095, 881262, 883104, 899510, 873299, 826379, 854263, 852659, 882231]
17500H82231J7204q024o5261p6272k1285L7056Q983K9547j0267j8017R227J6524
17488H01646j9163n7528m4801k1275k0297k0778N1602Q965M441R3442L1689J4040
17476H21983K9143N182o1393o4433q252K0537J1941l6575m3177m9542m0118j6901
17464E68395L2030n4315o0368j0388J8174K9191k7447o4395P210l6423r939k09
17452C91516j8229j1638K4197L6852K1721k1752k0604j1105l4194m1315r034l2179
17440B74236j2582L630M7872j3634O597K3850L1396K3902O685o7676l2945Q094
17428B99425K2586j7141l8007m6840M0098J92P102L0406j8953j4664K6673N0045
17416C40922K4488J7512K3780m9829n2673m0715q220k9159m5851M337J0509j3130
$$ y = [882231, 899435, 891411, 826150, 749878, 728593, 765649, 774632, 804179, 793912, 775895, 785122, 801646, 782483, 724955, 680154, 658879, 638582, 617804, 669406, 678371, 682812, 776254, 807943, 821983, 851126, 856308, 794915, 730482, 722230, 742767, 754708, 718133, 674956, 625414, 585296, 568395, 600425, 546110, 485742, 475354, 493528, 522719, 495272, 430877, 438087, 401664, 391725, 391516, 373287, 361649, 385846, 422698, 444419, 422667, 402063, 390958, 356764, 315449, 306415, 274236, 261654, 265284, 313156, 299522, 306119, 329969, 361365, 385267, 391952, 324276, 291331, 299425, 322011, 304870, 266863, 220023, 260121, 260313, 267415, 297821, 278868, 264204, 290877, 340922, 365410, 382922, 406702, 356873, 304200, 263485, 255265, 226106, 180255, 184592, 195101, 181971]
17404A81971k0065Q037O732P209m356R533j650k2797l2149K3311K3450q684l1099
17391A39443K0986K9297k3898j7548J4292P332J4294j5064k4237k3383l0994n108
17379H5412L0462j7348K2898N1330l1687m1141k963J5263J7620k8528o4504P136
17367D3950K179p982N3404J4421L0769j0727k6122k3786l728M4612R415L461k4543
17354A05323p808j7504m1677k2848J0205K3641j965k373J0183M2322N403r1332
17342A1570j7177j541L5919L1010J7590j9512m706j469q088Q235K9639j1313j8686
17329E1471j8999k0227J2564L5204m8887j9057K758J7864k0364O125K1148K8107
17317D7707j6253P915N492p5091k5600L9785J5564M5216J0852K1107P547j6696
$$ y = [181971, 161906, 169943, 176675, 183884, 179528, 189061, 187411, 164614, 132465, 155776, 179226, 170542, 139443, 160429, 189726, 165828, 148280, 162572, 169904, 184198, 169134, 144897, 121514, 90520, 85412, 115874, 98526, 121424, 172754, 141067, 99926, 96963, 112226, 129846, 101318, 36814, 43950, 46129, 38147, 91551, 105972, 136741, 126014, 99892, 76106, 72378, 116990, 126405, 129866, 105323, 97515, 80011, 38334, 15486, 25691, 49332, 47367, 44994, 55177, 97499, 102902, 11570, -5607, -7148, 28771, 59781, 77371, 57859, 53153, 51684, 43596, 51831, 81470, 70157, 51471, 32472, 12245, 24809, 60013, 11126, -7931, -5173, 12691, -7673, -1548, 19600, 47707, 31454, 39369, 44861, -30230, -55830, -16045, -481, 44735, 55587, 76694, 84241, 67545]
17305F7545q107K9120j5257k6835n5346o4812j0373M7485M6847K909j4519J5949
17293A4606K4357J8254J1166j9543j0960j2209j1490L2616J4465m9221J2084R16
17281B5041k2841n4622J9780M8970K1493K836j8424J029J955j8825j1993q796
17269a4397n805l6413L3552K2980L4727J3450m311j311j3557k9659j1156j2434
17257b4334j2074j6959K6207N0215j1583k4271m84N054J2935J1137J1841J3246
17245D0930j2475m154m3653M230K7567J9910l7593l6661R976q989j5394L4860
17233b1446L1274M827J3502L3182k4594q581R921M093L0553j1811k5829j8858
17221A6233l3636L8470J1318j7568k4982k4862j0307m3129j6355M8313K4036L836
$$ y = [67545, 59438, 88558, 73301, 46466, -8880, -73692, -84065, -36580, 10267, 13176, -1343, 14606, 38963, 57217, 68383, 48840, 37880, 25671, 14181, 46797, 61262, 12041, 24125, 25041, 2200, -52422, -32642, 16328, 37821, 40657, 22233, 23262, 25217, 6392, -5601, -14397, -20202, -56615, -23063, -83, 34644, 48094, 43783, 42472, 28915, -744, -11900, -24334, -36408, -53367, -27160, 23055, 11472, -12799, -13283, -8229, 4706, 15843, 27684, 40930, 28455, 24301, -19352, -15122, 12445, 32355, -5238, -41899, -31923, -40912, -56306, -21446, 9828, 14655, 28157, 61339, 36745, 28164, 38085, 42178, 72731, 60920, 35091, 16233, -17403, 21067, 32385, 14817, -10165, -35027, -45334, -88463, -104818, -56505, -32469, -28633]
17209b8633K6420J3803m0695j3856J8491k9652K2894J6943k5327n7378q907j7081
17197a22978L6062L3554j3477J9862P037L2307M5711K827l856r49j0684k9346
17185c930L0729K1932J4358j0146K2988j2856l6163j1565K893K7404m6703o229
17173g288L4720L0508l7595l7656J7141J591j1258K336k5387l7133L0184L4708
17161e129l5482j7749J6735j5147p576K5778L8186L6611J6942q669q241l2107
17149D152j2184k4873l5942P388L4554J3580J6923l3878m6500j2644O542J4993
17137f7889N2943J0789M1306M9225l0051J8409k0182M1397Q8354O2698j5714R0279
17125C21564L3068o5631l0190o5305p9274K997m2245O411L6572p3935P652J5872
$$ y = [-28633, -2213, 11590, -29105, -42961, -24470, -54122, -31228, -14285, -39612, -96990, -105897, -122978, -86916, -53362, -66839, -46977, -39940, -7633, 38078, 40905, 37049, 36100, 25416, -3930, 26799, 48731, 63089, 52943, 75931, 63075, 26912, 15347, 18240, 45644, -1059, -7288, 27432, 57940, 20345, -17311, -170, 1421, -9837, -7501, -32888, -70021, -39837, -5129, -40611, -58360, -41625, -56772, -64348, -38570, -384, 36227, 53169, 44500, 36259, 4152, -8032, -32905, -68847, -61459, -26905, -13325, 3598, -30280, -76780, -89424, -82882, -67889, -14946, -4157, 37149, 86374, 56323, 74732, 54550, 95947, 184301, 246999, 231285, 321564, 354632, 289001, 258811, 193506, 114232, 117229, 74984, 81395, 117967, 44032, 51684, 67556]
17113F7556j0386l1327j4411L0307K1581m7175r4724j6453O3219L339M354n265
17101b9385L7347O091K1837J0498L3741l2503l4861j451J059M8226l8056p4433
17089e1890M797j96M1838O0139K0049l006j7176J7280j6814L4688K3482K0858
17077A34049L6733K9862N4740N0828M4634j4836k5653n5298l9167n4897l8950
17066A22045k5344j0771l7916K2900K7681l7361J029l154l8046m988j4000J394
17054C469L8101J8425M231K2280r11l2341l0470J6520M251k633k3376q67P11j8520
17040a130N644j2811q564j4994J3137m6180l1145L9859L8875K139o222o47K3911
17027A872o213k5552O484J6842N984j1941R897p306r771R096m007L6627j7306
$$ y = [67556, 57170, 25843, 11432, 41739, 63320, 16145, -78579, -95032, -31813, -28474, -24120, -29385, 7962, 14053, 35890, 46388, 80129, 47626, 12765, 11314, 12373, 60599, 22543, -51890, -47093, -47289, -5451, 54688, 74737, 71731, 54555, 71835, 55021, 89709, 113191, 134049, 170782, 200644, 255384, 306212, 350846, 336010, 310357, 255059, 215892, 160995, 122045, 96701, 85930, 48014, 70914, 98595, 61234, 62263, 59109, 21063, 16075, 2075, 3469, 41570, 59995, 64226, 86506, 85595, 53254, 22784, 39304, 43555, 40922, 17546, 16679, 17390, -1130, 4514, -8297, -16861, -31855, -18718, -64898, -96043, -56184, -17309, -15170, -21392, -22039, 1872, -4341, -29893, -23409, -6567, -583, -12524, -2627, -9933, -19704, -10608, -14615, 22012, 4706]
17014D706l5548P799J9145N4456J1798m6216k5770j5634k8507n851M258M6461
17002h903o99j7839J4033P195K7344L6172M798k7324K6038J434k4783k0711K8513
16989D5268K8549k5039n6124l9273J4474N0331J6909P07k4094J212K1582O1927
16977I6429j722l0863L812O544o536k3754J9704l8349K6k8428k9639P1083J4732
16964E3039l2926k6413L8212N9347n912k8556j616L1574k9475r452k716k6673
16952A8433K6662K7591L2953n2998j3432K8994J1701k2407P112l38K6643l2006
16940E8908J6957m3580k0796K60j9291l010r225K2679K6608L5213l048m4072m3758
16927b6155m797J7659p672Q563O6916n359k2999K3461J7403j0500J6966j6183
$$ y = [4706, -30842, -23043, -3898, 50558, 62356, 16140, -9630, -25264, -53771, -59622, -55364, -8903, -9602, -27441, -13408, -6213, 21131, 57303, 62101, 34777, 60815, 62249, 37466, 16755, 45268, 73817, 48778, -7346, -46619, -32145, 18186, 35095, 35802, 11708, 12920, 34502, 96429, 94707, 63844, 67656, 74200, 67664, 43910, 63614, 25265, 25291, -3137, -32776, 38307, 53039, 20113, -6300, 31912, 91259, 85347, 56791, 55175, 86749, 57274, 47822, 45106, 18433, 45095, 72686, 105639, 52641, 39209, 68203, 79904, 57497, 64609, 64271, 90914, 58908, 75865, 32285, 11489, 11749, -7542, -10552, -19777, 2902, 29510, 64723, 61675, 17603, -26155, -30952, -13293, -20965, -12402, 54514, 49155, 26156, 49617, 67020, 56520, 73486, 57303]
16915E7303l4528j6797J9935j2698j81K2846M5091l6003p0337m867M7118K0935
16903C7817m7677K5001L5103k158o1959k3468K1119L127k91k2609j5538K5426
16891b6107J5863J5492M139j1945K0757K5472J5101j3986k2823j9776k5050K395
16879b0468O651J0939j9858l8958K1477K3199J5413o612J102N3735k0577p948
16867A8095k6790p543L4115k9009r462l473j1196J7842L7546K980j0343k3056
16855a0294K0053J6550J8762K1945L8968O5204P111N2912R0430O7205P5142J36595
16843F00583J67614J76570J34300J15959R8266l1002j98259k47180j24311p5558
16833F16982p6912r4073q2133n3452p750r253j8756l5540l5255j0407j5702k7270
$$ y = [57303, 22775, 5978, 25913, 13215, 13034, 35880, 80971, 44968, -25369, -30236, 16882, 37817, -9860, 15141, 50244, 48086, -13873, -37341, -16222, -13095, -13386, -35995, -51533, -26107, -10244, 5248, 9387, -2558, 18199, 43671, 58772, 44786, 21963, 2187, -22863, -20468, -13817, -2878, -22736, -61694, -40217, -17018, -1605, -8217, -7115, 46620, 26043, 18095, -8695, -16238, 17877, -11132, -20594, -24067, -35263, -17421, 20125, 23105, 12762, -10294, 9759, 26309, 45071, 67016, 105984, 171188, 178299, 231211, 321641, 388846, 463988, 600583, 768197, 944767, 1079067, 1195026, 1293292, 1262290, 1064031, 816851, 692540, 616982, 540070, 445997, 363864, 310412, 302662, 293409, 274653, 239113, 203858, 193451, 177749, 150479]
16821A50479m7318k6670J7635o465p60k8615l2852O908L9800m0453N491K4088
16809F1268J0685L1448n9793k3272m966j0188N736j4427M2694J1437M670k4121
16797C1171l7898N0395l969m0285M476J9689j9196n4285L0623K9812L9715j4416
16785C5832M899k5621J9824J2186j8135l69m870m03n557M1907k3530j9256O220
16772B3127L733M1208P895j5439J8554Q634l9843o4682j4302K5084N5321R047
16760E8337l1117j43m262J2391J8589n706k7158O938O5937L1031l834J705k807
16747A19901j2330l0586k8675P15J9185O7239M2497m4610l1639J994k6269K379
16735G9801J4946L523j9682k1724K1935L0374l4925L398j3855l8286j7696N069
$$ y = [150479, 103161, 76491, 94126, 87661, 86901, 58286, 25434, 32342, 72142, 31689, 37180, 61268, 71953, 103401, 43608, 20336, 15370, 5182, 10918, -3509, 39185, 50622, 55292, 31171, -6727, 43668, 39699, -586, 3890, 23579, 4383, -49902, -19279, 10533, 50248, 35832, 40731, 15110, 34934, 47120, 28985, 28616, 23746, 23343, 17786, 59693, 36163, 16907, 23127, 26860, 68068, 75963, 60524, 79078, 87712, 47869, -16813, -31115, -6031, 49290, 58337, 27220, 27077, 22815, 35206, 53795, 48089, 20931, 27869, 93806, 124837, 121003, 122708, 119901, 107571, 76985, 48310, 49025, 68210, 135449, 177946, 133336, 101697, 103691, 77422, 79801, 94747, 98270, 78588, 56864, 78799, 109173, 74248, 77646, 63791, 25505, 7809, 12878]
16723A2878L780K8112J2240l0826J6029L748m8575k6215l2639m474j724M5676
16711b1990L8704k9282k1620j7179M184J0685K1491k1866J5596J6568K8551J7275
16699D1117j5508r940o201J0407o256j2090j3935m202J8286j5864M430J8506k989
16686E761J338l380Q205p605M894k0054J2243m92K0727J7274J3902j4067k6601
16673A2145k1653j1855r061M9329q06M61Q348K131L3061k9646l948N3293N329
16660H7128p038k7446l1359r458k1651J4658j2658j7229K2960N505j6712J2487
16648h13J4707N7272K3028R512o697l854k7746l6908K5897m9447r152K1071M3467
16635F0337L122l8099o819L3172K7724k0108k682J1824k797l88k89k3873J5902
$$ y = [12878, 16658, 44770, 57010, 26184, 42213, 45961, -2614, -28829, -61468, -65942, -67666, -21990, 16714, -12568, -34188, -51367, -47183, -36498, -15007, -36873, -21277, -4709, 23842, 41117, 25609, 15669, 9468, 19875, 13619, 1529, -12406, -16608, 1678, -14186, -9756, 8750, 5761, 7099, 3719, 11924, 4319, 9213, -10841, 1402, 910, 21637, 38911, 52813, 38746, 12145, -9508, -21363, -30424, 18905, 18099, 18560, 26908, 29039, 62100, 32454, 28506, 81799, 87128, 80090, 52644, 21285, 11827, -9824, 4834, -7824, -25053, -2093, 3412, -13300, -813, 13894, 71166, 94194, 103706, 97009, 93155, 65409, 28501, 54398, 4951, -4201, 16870, 60337, 63459, 25360, 18541, 51713, 79437, 59329, 56647, 68471, 65674, 65286, 64997, 41124, 57026]
16622E7026p32k2478L4726L1674M650j9301o7495J288L2843j5549P681J1607J916
16609E7856j7143q204L3488K6561j9941l7149j3140J654J3979M6753K7364L497
16597A15575j2240j6110K197l0114j7970j3086k2572k4098Q4807K3185o6296j6603
16585F675l8187j9993k1369K5959M1646L908m842n9968J6997N8209R144k8136
16573i957l2819J0266K0757M5843l1265l222R934o3348k0537K2197N5271K7201
16561C0321j640l7481Q304l717k1850q623L1169L5069M3853r139n068P120J3921
16548H2239j0664j5776L2238L5842J342P640r409j6339J0652J7725M927L3742
16536A74159k438J9265m1263N374P069n4824r9005j2185J2289M1658O834j8010
$$ y = [57026, 56294, 33816, 68542, 100216, 104866, 85565, 18070, 19358, 52201, 36652, 44333, 55940, 57856, 40713, 32509, 65997, 92558, 72617, 35468, 22328, 23982, 37961, 84714, 112078, 115575, 103335, 87225, 89422, 59308, 41338, 28252, 5680, -18418, 66389, 89574, 23278, 6675, -31512, -51505, -72874, -46915, -5269, -1361, -6203, -66171, -49174, 9035, 18179, -9957, -42776, -32510, -11753, 34090, 2825, -397, 9537, -53811, -74348, -52151, 3120, 30321, 28681, -8800, -496, -4213, -26063, -34686, -3517, 31552, 75405, 66266, 61198, 68318, 82239, 71575, 55799, 88037, 123879, 125221, 132861, 123452, 107113, 117765, 135490, 140417, 174159, 171721, 190986, 149723, 155097, 162166, 107342, 8337, -3848, 8441, 50099, 56933, 38923]
16524C8923L6917P097P205K6094j716j0506l9974m1320j0717K8594K2813r768
16512E3642k3376N433k8577M72L3274J2115j1603k8450K9970O7894O827l2149
16500H5472j3919L6267M11m1120r2055o9568l8447M7307L1820M5410k0794j3429
16488d2645J8610L4264r357K141L5995J0093k2707p6699j49446j05958n9724j19212
16476d84645j25262K7410J73154J43674M8064N9895P5457J9150r523k7553J5329
16465h4850n318K0635M2435N4003n733m4284m3214k0745k4098n2988J8958L5293
16453a09906N5499K8022k4316L3569N5632L3752Q372l2957k3592j515j8029K389
16441F920M5464J1261j29J0561K3713K5581L2154j5931j8589l9517J9705K787
$$ y = [38923, 75840, 82937, 90142, 116236, 114520, 104014, 64040, 22720, 12003, 40597, 63410, 53642, 30266, 35699, 7122, 7594, 40868, 52983, 41380, 12930, 42900, 110794, 117621, 85472, 71553, 107820, 108231, 67111, -24944, -94512, -132959, -85652, -53832, -8422, -29216, -42645, -24035, 10229, 872, 3013, 39008, 49101, 26394, -50305, -199751, -305709, -365433, -484645, -609907, -582497, -409343, -265669, -217605, -157710, -82253, -63103, -72626, -100179, -84850, -90168, -69533, -27098, 26905, 21172, -23112, -66326, -87071, -111169, -164157, -145199, -109906, -54407, -26385, -50701, -17132, 38500, 72252, 80624, 47667, 24075, 22560, 4531, 6920, 52384, 63645, 63516, 74077, 97790, 123371, 155525, 139594, 121005, 81488, 101193, 103980]
16429A03980K9433O421k052L6162L4013q98k7700J8297R1862J04327P4134R9213
16417E67192R5009J15265N8971J03336J65160J12198L2983J2224L1988l428l1756
16406A259142r1417j01765l7182k005M3379L4106J4995k1255k875l6040r5683
16395I63400r7053l3394k5331q165j5997K508r668j3488j1328O776l274Q721j3196
16382G50511m9600k7028j000j0554j1137M1455m252L6018j3628j9702k9382J1855
16370F73556J5479J1112J3360k755L1733j5106K0792J8049N8m1725l6006j2598
16358F75949K5124l9536j2435J3249J1394J3113K7573O5657M8642J3957j7337
16347H25350j8892k0503R171O571M1215K9141L7206m013J670K1134M7410l693
$$ y = [103980, 133413, 139834, 137782, 173944, 207957, 207059, 179359, 197656, 289518, 393845, 467979, 567192, 662201, 777466, 836437, 939773, 1104933, 1217131, 1250114, 1262338, 1294326, 1290898, 1259142, 1167725, 1065960, 1028778, 1026773, 1070152, 1104258, 1119253, 1097998, 1095123, 1059083, 963400, 866347, 832953, 807622, 799457, 783460, 785968, 776300, 762812, 751484, 758260, 754986, 763707, 750511, 700911, 673883, 672883, 662329, 651192, 692647, 688395, 724413, 710785, 691083, 661701, 673556, 689035, 700147, 713507, 710752, 742485, 727379, 748171, 766220, 766278, 724553, 688547, 675949, 701073, 661537, 649102, 662351, 673745, 686858, 714431, 780088, 828730, 842687, 825350, 806458, 785955, 795126, 801697, 842912, 872053, 909259, 905246, 906916, 928050, 975460, 971767]
16335I71767L0006J09109N4484J9905k057O8883L1793K282J6180N3255N7465M3957
16323A457029Q1536O7581P4916J02966J51448J78171J72612J60572J78380J77840
16313B803051K05719K01503K35211K99639L41709M13630M94341N28682O23781
16304F147266P30737R10051J101270J384778J747442K169980K907193L932166
16296B1030883N273947P241308J0649201J6528827K6047576L8810142M6414642
16289A71996526L7952702K7692361K9605237J5526286l4280582o5074057n3541449
16282A29877024l3989663k0872062j3369364r411660p273507n530099m284108
16275C5146561l377386k669397k188241j835314j586413j377651j198039j013643
$$ y = [971767, 1001773, 1110882, 1165366, 1185271, 1183214, 1252097, 1283890, 1286172, 1302352, 1355607, 1413072, 1457029, 1538565, 1606146, 1681062, 1784028, 1935476, 2113647, 2286259, 2446831, 2625211, 2803051, 3008770, 3210273, 3445484, 3745123, 4086832, 4500462, 4994803, 5523485, 6147266, 6878003, 7788054, 8889324, 10274102, 12021544, 14191524, 17098717, 21030883, 26304830, 33546138, 44195339, 60724166, 86771742, 125581884, 171996526, 209949228, 237641589, 267246826, 282773112, 248492530, 183418473, 129877024, 95887361, 75015299, 61645935, 52234275, 44960768, 39430669, 35146561, 31769175, 29099778, 26911537, 25076223, 23489810, 22112159, 20914120, 19900477]
16267A9900477q84314q30472p19990o75835o72282n74258m86972m73887m93153
16258A4089314n23432m51292l89836l62119k91994k54045k71759k71729k90840
16249A0982268l15620l33928l61844l72601l59207l02083k57861k45354j98670
16240H235100k16568k23464k07544k30315k25260j75557j89379j55401j21731
16231F489881j62098k02593j78980j24588j30698j85343j37497r7668j08005j21126
16221E041285q6436r6812n3992j10811j12310r7587j27011j51301q4259r3546
16211D027220q5740r7892m9792n1332n9016j27213r0222r3573p1585m5621j29383
16200C125851j14977o1479n0910l9589l5025o8551j10088n1722R368P098o4061
$$ y = [19900477, 19016163, 18185691, 17465701, 16789866, 16117584, 15543326, 15056354, 14582467, 14089314, 13565882, 13114590, 12724754, 12362635, 12070641, 11816596, 11544837, 11273108, 10982268, 10666648, 10332720, 9970876, 9598275, 9239068, 8936985, 8679124, 8433770, 8235100, 8018532, 7795068, 7587524, 7357209, 7131949, 6956392, 6767013, 6611612, 6489881, 6327783, 6125190, 5946210, 5821622, 5690924, 5505581, 5368084, 5270416, 5162411, 5041285, 4954849, 4858037, 4804045, 4693234, 4580924, 4483337, 4356326, 4205025, 4120766, 4027220, 3941480, 3843588, 3793796, 3742464, 3683448, 3556235, 3466013, 3372440, 3300855, 3255234, 3125851, 3010874, 2949395, 2898485, 2858896, 2823871, 2755320, 2645232, 2593510, 2602878, 2609976, 2545915]
16189B545915p1168j8568m5338o9093l1602k8173k222m0510o9745J1652K8713
16178B209861n7378l1879m5071n2358j4631k8090m6154n715j6114k7978j8980
16167A865513J685N9897J34238J61934P2477J28919J54560Q3989j8704r1435j17424
16156B435649j86238j94320q2679p3262p1336j10548j07241p5289l5696r018o102
16145A483920k9146r195M2045m5038k3894l4491p4488r0032J0824k390l4490K4493
16133A218118k0071m4998k908k3571l3665j3782L8720O3386l6236n4317m2016
16122A048660l5412M747J5856P241j9521k680n742k8141k8406o7857m1364j2326
16110H35055n453K2893l110K5569N1776M7941K6554K4911O542J4177N5796N6297
$$ y = [2545915, 2474747, 2456179, 2410841, 2341748, 2310146, 2281973, 2279751, 2239241, 2169496, 2181148, 2209861, 2152483, 2120604, 2075533, 2023175, 2008544, 1980454, 1934300, 1928585, 1912471, 1884493, 1865513, 1867198, 1927095, 2061333, 2223267, 2295744, 2424663, 2579223, 2663212, 2644508, 2553073, 2435649, 2249411, 2055091, 1972412, 1899150, 1827814, 1717266, 1610025, 1534736, 1499040, 1490022, 1483920, 1454774, 1445579, 1487624, 1442586, 1418692, 1384201, 1309713, 1219681, 1230505, 1228115, 1193625, 1218118, 1198047, 1153049, 1150141, 1126570, 1092905, 1079123, 1117843, 1181229, 1144993, 1090676, 1048660, 1013248, 1017995, 1033851, 1041092, 1021571, 1018891, 1013149, 985008, 956602, 888745, 847381, 835055, 829602, 852495, 849385, 874954, 926730, 974671, 1001225, 1026136, 1032678, 1046855, 1102651, 1158948]
16098A158948M892j6269n1218j04133k04505j04076q1019l3231k2442j714j1703
16087E33530N349J5496k5718j2763Q652q952r519L4099k523m726j9773R956n5998
16074D67110p7397J8862N976j0263J4041L205J2343n1458l9747P931R453L5044
16062C95100L6690J0856K8694j6914m8022k0715n566J2816J3217l6361k9234N5309
16050C95870l2321m0672K0917k3915l8761l2802Q717J1756k1091J170L4064J576
16038B84508j1553k3628J581J837m1277j9547M1118l151p581o725m098J4045J468
16025B26997m207L880L4875j367j5685k2465j0480j0430M388R373J8937j6777
16013B17039k2868k4234o314k9702j175O748j766L3071r409k9110Q632j432l1452
$$ y = [1158948, 1163840, 1147571, 1096353, 992220, 787715, 683639, 602620, 569389, 546947, 545233, 533530, 538879, 554375, 528657, 515894, 524546, 515594, 506075, 540174, 537651, 532925, 513152, 523108, 467110, 389713, 408575, 414551, 404288, 418329, 421534, 433877, 382419, 342672, 350603, 360056, 395100, 431790, 442646, 471340, 454426, 406404, 385689, 380123, 392939, 406156, 369795, 340561, 395870, 363549, 322877, 343794, 319879, 281118, 248316, 257033, 268789, 247698, 248868, 282932, 284508, 272955, 249327, 250908, 252745, 211468, 191921, 233039, 229888, 222307, 215582, 211484, 225529, 226997, 222790, 226670, 261545, 260178, 244493, 222028, 211548, 201118, 205506, 214879, 233816, 217039, 194171, 169937, 163623, 133921, 132746, 139494, 137728, 170799, 161390, 132280, 140912, 139480, 108028]
16000A08028L4341N5266j7437J4159K2296q261k2290L3040K1963j7544j2520m7881
15988A63160j3828J3354p459j4011k9415k6097j6665K1692q345n2304q405P7840
15976I9517M7430k1543J757k7511q42k2270k4393J2475q738L2004J793o957j8503
15963F4219l8964j8896M5975r460k2447L9979J3301Q848O880k6918N709K8737
15951I6963K7268J0731k5788l1508m9556N16J175N391k1571L0466O5623J7870
15939A27580j6281k8899j9316k3075l0900j9099M8515K8429J6786j2222m7161
15928B4357N882J8300L5272k6133K1837J5640j9359j6653L5466K7616Q61k7373
15916I5713n1396m906K2134j8131J6494k94n128k7922k4149K6658L3934j3481
$$ y = [108028, 142369, 197635, 180198, 194357, 216653, 208392, 186102, 219142, 241105, 223561, 211041, 163160, 149332, 162686, 155227, 141216, 111801, 85704, 69039, 90731, 82386, 30082, 21677, 99517, 146947, 125404, 127161, 99650, 98808, 76538, 52145, 64620, 55882, 87886, 89679, 82722, 64219, 25255, 6359, 52334, 42874, 20427, 60406, 73707, 82555, 89435, 62517, 68226, 96963, 124231, 134962, 109174, 77666, 28110, 28626, 29801, 35192, 13621, 44087, 109710, 127580, 111299, 82400, 63084, 40009, 9109, -9990, 38525, 66954, 83740, 71518, 24357, 30239, 48539, 83811, 57678, 79515, 95155, 75796, 59143, 94609, 122225, 123086, 95713, 44317, 39411, 61545, 43414, 59908, 59614, 54486, 26564, 2415, 29073, 63007, 49526]
15904D9526J255k3374O976K0358N84J6719o2703l1077J1289J3079L2757J3709
15892D9098o4153k9029k503n622O4136M1641O9341n8937m5925L052K5652K740
15880D9491o183K5013j6856k4820j3418K231l961K8767M8637l0643l5925j6211
15868F122L0885J3891J3715Q341n7106k1512l5593o849k5454J6045K5162K8193
15856d160J4069J2861j7863q760K1291M858j8341j0767l6261k0121l2089L092
15844i2191M294k3687J8797M3176K8977k8904m2557j0802K7543L4426J5116M0549
15832A4737J2049p708k912j3448l503P323p620p647L8174K627k9331o628M0493
15819C6606K7787j2515M3352j3150r0810j0056J508q934r747J0127k8623l8281
$$ y = [49526, 50781, 27407, 34383, 54741, 55325, 72044, 9341, -21736, -10447, 2632, 35389, 49098, -15055, -44084, -46587, -52209, 11927, 53568, 122909, 63972, 18047, 21099, 46751, 49491, 43308, 68321, 51465, 26645, 13227, 15458, 11497, 40264, 88901, 58258, 22333, 6122, 37007, 50898, 64613, 72954, 15848, -5664, -41257, -48106, -73560, -57515, -32353, -4160, 9909, 22770, 4907, -3853, 17438, 22296, 3955, -6812, -43073, -63194, -95283, -92191, -87897, -111584, -92787, -49611, -20634, -49538, -92095, -102897, -75354, -40928, -25812, 14737, 26786, 19078, 16166, 2718, -785, 6538, -1082, -8729, 29445, 32072, 2741, -3887, 36606, 64393, 51878, 95230, 82080, -8730, -18786, -17278, -26212, -35959, -25832, -54455, -92736]
15807i2736N9780K0864m2223J5887M1784R77n750l1918k611J4291K1601K846j9780
15794a6988j9208K0337K7011M9480L0066j4016j8972J1115n753j5662m6395j7416
15782a6401K324K7985l6680k3471J890O215j4453k7621K8570K2812L1438m2005
15770c9397K0814N032j7941K8820L0290K350o1772J5417P844j5565R450L6611
15758B1953k294m6977l2979l7045j5616M7988L5002R579k9510L3194L4576K8403
15746D6274O1017R952k9983k7561j6097k5897k1275K9262M7450j080j8165J4220
15734F8117N0778P9738J15384P3394J06854J70065J71213J93787J11435P9036
15724A219801P488j63904k11521j95135j80865j00494n0700n8942k8560j6757
$$ y = [-92736, -32956, -12092, -54315, -38428, 3356, 4333, -1417, -33335, -35946, -21655, -54, 2792, -16988, -36196, -15859, 11152, 60632, 90698, 76682, 57710, 68825, 63072, 47410, 1015, -16401, -14077, 13908, -22772, -46243, -44353, -38138, -52591, -80212, -51642, -28830, 2608, -39397, -18583, -13551, -31492, -2672, 27618, 29968, -31804, -16387, -8543, -24108, -14658, 21953, 19659, -27318, -60297, -97342, -112958, -64970, -29968, -20389, -49899, -16705, 17871, 46274, 107291, 117243, 87260, 59699, 43602, 17705, -3570, 25692, 73142, 72062, 53897, 68117, 118895, 198633, 314017, 387411, 494265, 664330, 835543, 1029330, 1140765, 1219801, 1227289, 1063385, 851864, 656729, 475864, 375370, 324670, 265728, 237168, 220411]
15714B20411r405m9358p011k8400l7162L6806K947l3007j603O161k1943j4741
15702F3695K9608J7631J3431J444m090m0121j6887j2357k5913j1532m632j8198
15690g921J8880K3040J6509m0147k4805J6170J637K0649K2376j1664l087Q753
15678D0390M2885J8003j4175n8213j7898L961l627m0829j8378L3865N1471j3004
15666B4451j9312L7278L4878j7750n3455j2164P504L0475K6632j3643m9578J2359
15654G675K6023L3176j6946J4660J8932k3985l9387m7537j0428K8152L4616j3006
15642A1945p036r844R640N961K0658j3482r060j6467M284K2523j794m2457r480
15629c4609K3103M7609m765j8989K0436L5625j77m3336j0608J243m5079l4272
$$ y = [220411, 211006, 161648, 154637, 126237, 89075, 125881, 128828, 95821, 94218, 100379, 78436, 63695, 93303, 110934, 124365, 125809, 121719, 81598, 64711, 52354, 26441, 14909, 10277, -7921, 10959, 33999, 50508, 10361, -14444, 1726, 3363, 24012, 46388, 34724, 31637, 40390, 83275, 101278, 87103, 28890, 10992, 14953, 11326, -29503, -47881, -14016, 37455, 24451, 5139, 42417, 77295, 59545, 6090, -6074, 1430, 31905, 58537, 44894, -4684, 7675, 33698, 66874, 49928, 64588, 83520, 59535, 20148, -27389, -37817, -9665, 24951, 11945, 4909, -4935, 4705, 10666, 31324, 17842, 8782, -7685, -3401, 19122, 17328, -25129, -34609, -11506, 36103, 31338, 12349, 32785, 68410, 68233, 24897, 14289, 15532, -29547, -63819]
15617f3819L1437N0160L6010j3615l6438m3292j0975M2434n975K9975r21k4845
15605i864k4320J4487L7361j7684r760J655p735k9272P09M1913o142j8488Q027
15592a9113R081j2270k2510n077M733P208o562j7516n326o313N885o139q022L1924
15578e0017K6815l1142n144N0238J7985k0466J5260O219r210K5065j991m3411
15566a9799j999k9113l2730Q438J8016J3233K5716K9740J2479M234j8230m6811
15554c6826k7827M6079K384P778k1285n1703m801L2200J1078M4869k8572j2598
15542c9224M541K6801l2731k3349N7542L8357o094p594K2180q414l3190n3183
15530e4358k7352J4507j2717M1101N2098j9668o819m348n7727k1328O992N6710
$$ y = [-63819, -32382, 17778, 53788, 40173, 3735, -39557, -50532, -8098, -14073, 15902, 14981, -9864, -34184, -19697, 17664, -20, -9780, -8125, -15860, -45132, -44423, -2510, -8652, -27140, -19113, -10032, -22302, -44812, -49889, -45156, -37948, -44510, -62026, -67352, -73665, -67780, -73919, -81941, -50017, -23202, -54344, -59488, -9250, 8735, -11731, 3529, 9748, 538, 25603, 23612, -19799, -21798, -50911, -83641, -75203, -57187, -43954, -18238, 11502, 23981, 28215, 9985, -36826, -64653, -18574, -16190, -8412, -29697, -81400, -86201, -54001, -42923, 1946, -26626, -39224, -34683, -7882, -40613, -63962, -6420, 31937, 25843, 18249, 40429, 32015, -1175, -54358, -81710, -67203, -79920, -38819, 13279, -6389, -13208, -17556, -75283, -96611, -89619, -32909]
15518c2909L6310J1131n0670k5409L8168N0134q564j2891J9300r62l372m1483
15506b1217q871j7408k0551k6195k605K3815M0600L4015k0877J9107l3150k1125
15494e4462K5077L3950j107K654n857K5080l6168m6595l2856K7592j3224J4051
15482f1865K0842M887k5463l711k6182L5588P5101j8996j7218J7786J7450M874
15470B3093j0301k9244j4634r987L9081K1083m377n820L480K0252j1885K2803
15458D3544J0781K0862m8584m5025k5591L6931J4094j1177q156K3871J7017J6356
15446D4923J2792k9609k4842j2315m479j6342J6493M3911N29J4571M5157l2083
15434E8706o5059n454J1202K2040K7751k5065k4715M820k122k9159k52j2938K2966
$$ y = [-32909, 3401, 14532, -36138, -61547, -23379, 26755, 18191, 5300, 24600, 23638, 20266, -21217, -30088, -47496, -68047, -94242, -96847, -73032, -32432, 1583, -19294, -187, -33337, -54462, -29385, 4565, 3458, 6112, 255, 25335, -10833, -57428, -90284, -62692, -75916, -61865, -41023, -36136, -61599, -65310, -91492, -55904, 19197, 201, -17017, 769, 18219, 23093, 12792, -16452, -31086, -41073, -1992, 19091, 14714, 8894, 12374, 32626, 20741, 43544, 54325, 75187, 26603, -18422, -44013, -7082, 7012, -4165, -12321, 11550, 28567, 44923, 57715, 28106, 3264, -9051, -13530, -29872, -13379, 30532, 31061, 45632, 90789, 58706, -6353, -11807, -605, 21435, 49186, 24121, -594, 4226, 2104, -27055, -27307, -40245, -17279]
15421a7279M0284L4955K9175j1494l4538k0179j8196N961q081O252j8944j0537
15409b2621N968K7443L1528k542L080P457j2247l2786m5335n089L727K0474K9354
15396H411k3953l3675k03N6587j2636k5463M092n678Q357j1444j2942K5623M1976
15383A9052N1152l28p9271j2761M2651j470l4925J9715J4494Q585n3090m641R272
15370b1565q238J0388K8945N469l4751J120k3936K7863M8168L1030l6618j5764
15358A2111M5246r32k7376j4086m891J4979K4512j0721j6012l3439n4776J1560
15346e3825M3448J8432l981l6006l1438M010K8811L303J8764j3568k5596p0013
15334a17659R257N1004L599j36o829l2274k043L0301L3998L921j0020m1139J0636
$$ y = [-17279, 23005, 57960, 87135, 75641, 41103, 20924, 2728, 8689, 608, 6860, -12084, -22621, -16653, 10790, 42318, 39776, 42856, 50313, 38066, 5280, -40055, -45144, -41417, -20943, 8411, -15542, -49217, -49420, 7167, -5469, -30932, -26840, -32518, -24161, -35605, -48547, -22924, 19052, 70204, 69876, -9395, -22156, 20495, 19025, -15900, 3815, 18309, 26894, -26196, -30837, -21565, -29803, -19415, 9530, 14999, -19752, -18632, -42568, -14705, 33463, 64493, 27875, 12111, 57357, 56425, 29049, 14963, 10072, 25051, 49563, 38842, 22830, -10609, -65385, -53825, -10377, 8055, 4074, -31932, -63370, -59360, -30549, -27246, -8482, -22050, -47646, -117659, -108402, -57398, -53799, -53935, -60764, -93038, -95081, -64780, -30782, -26861, -36881, -78020, -67384]
15321f7384K6332J0392k6766K4137K2424l101J2151p992P768J1557j3069M788
15309A237N5603Q525k3688l5069q590k5688l0525P600M507L9954N178n6998l3320
15296i1274K5686K6405P848K0578J1426j8152Q15K1748j0552k4558K0427j0847
15284b0450l1037N21K7548j2018k9539p103R914N463O180k0819J2054L98j7511
15271g6399j942K9945k5626j233N7230J3924k2723o80J7366L7261m0930O280r673
15258a7200k0092J8492J281M148N303L1929k0110l2565m93K1239j6969K393K7293
15245D649j5551k2303J7570R192L2801m2285n1019M3241J9578K4635P495k1903
15233F100j1137q322k6091P607M2484M843q580L605l2042k4668p137o299K1967
$$ y = [-67384, -41052, -30660, -57426, -33289, -10865, -13966, -1815, -9807, -2039, 9518, -3551, 1237, 56840, 65365, 41677, 6608, -1982, -27670, -58195, -50595, -46088, -6134, -956, -57954, -91274, -65588, -39183, -31335, -10757, 669, -17483, -16668, 5080, -5472, -30030, -9603, -20450, -51487, -50966, -23418, -35436, -64975, -72078, -62164, -56701, -50521, -71340, -59286, -58888, -76399, -78341, -48396, -74022, -75255, -18025, -4101, -26824, -27504, -10138, 27123, -13807, -7527, -17200, -37292, -18800, -17519, -13371, -8068, 23861, 3751, -28814, -29307, -8068, -25037, -22644, 4649, -10902, -33205, -15635, -6443, 26358, -15927, -66946, -23705, -4127, 20508, 28003, 6100, -5037, -13359, -39450, -31843, 10641, 15484, 6904, 10509, -21533, -46201, -53338, -59637, -37670]
15220c7670K9378o76J228L8339o322o5131J84K3072R556N130j251k5146n2768
15207h2077MN3760K4669j9603j4745k5268n0584j0565J0341O9697K4299p919n390
15194c3381j9129j8564o7183J741O2084J6433K5790Q241L7794K7214j07447k140
15182f8547j198K8645k393K7370Q348j4469j065q237N117j054o479m318K1778
15169a6502N74K7037L6254j7774j6284J5075j7818k1147P560m2088J1574j1432
15157d4971J4909L309j2184q720k0217p661K3670L3070J8094r178k1150J2300
15145a8729O725j5292m521k9781l6437M1703L9352K0463L970k1868j325J1044
15133d696J125q084R586j5835J006k8466m8395J6476K8932K5801Q874M946j1569
$$ y = [-37670, -8292, -8968, -7740, 30599, 24277, -40854, -40670, -17598, -8042, -2912, -4163, -29309, -82077, -82073, -28313, -3644, -23247, -37992, -63260, -113844, -124409, -114068, -44371, -20072, -27991, -33381, -52510, -71074, -138257, -136516, -74432, -57999, -32209, -23968, 13826, 41040, -66407, -68547, -69745, -41100, -43493, -16123, -7775, -22244, -23309, -31546, -26429, -27483, -33962, -38280, -16502, -15928, 11109, 47363, 29589, 13305, 28380, 10562, -10585, -3025, -45113, -33539, -44971, -30062, -26753, -38937, -47657, -67874, -75535, -51865, -18795, -701, -9879, -31029, -18729, -12004, -27296, -31817, -61598, -98035, -56332, -16980, 3483, 7453, -14415, -15740, -4696, -3571, -11655, -2069, -17904, -16898, -45364, -93759, -77283, -48351, -22550, -13676, -8730, -20299]
15120b0299m3122J0619J5289j691K0325L557k0950j3255K679j2893L4334N892
15108a9515q146n294N860L2456Q330k6851l9878Q406N8069L8668j8192l9524K320
15095c291K3744o109m8096j2045L0573J3115J193m5908m93J7164R180L26p250
15082b7897K0331N5798J3626o9452k3486L9219K9603l9121j3930K6860l560j9393
15070a1402P728l3372K2208L5551l0471k6183L0820N8173K5704J6362k0193k3865
15058E1060k8396O925o641k2814J133K5216q129k4298n13M237k5505k792l6492
15045f7009r888j6671K4444J4136j69Q026L1475O298L5054j3288l7335k0052j2861
15032e7840l1974K120K0773J635J9450L8775Q757K8747P348k4975m2844J8466
$$ y = [-20299, -63421, -52802, -37513, -39204, -18879, -15322, -36272, -49527, -46848, -59741, -25407, -19515, -27661, -32955, -27095, 5361, 13691, -13160, -53038, -44632, 13437, 52105, 33913, -5611, -3291, 20453, 14344, -33752, -45797, -15224, -2109, -916, -46824, -47317, -30153, -20973, -20647, -27897, -7566, 48232, 61858, -7594, -31080, 8139, 37742, -1379, -15309, 11551, 7991, -11402, -3674, -37046, -14838, 20713, -9758, -35941, -5121, 53052, 78756, 95118, 74925, 51060, 22664, 29589, 22948, 134, 1267, 26483, 18354, -5944, -6457, -2220, -27725, -30517, -67009, -76897, -93568, -69124, -54988, -55157, -47131, -15656, -9358, 25696, 12408, -24927, -44979, -57840, -89814, -87694, -66921, -65286, -45836, -7061, 1696, 30443, 37791, 12816, -30028, -11562]
15020a1562O016p75q755k0734J4484J7466Q000k795n723j201n3780k3488M3031
15007c9816K8640L4545K0602J8334J1980K2110P217k2076l0128K4310L4744l6878
14995G3584m2164k2000j5369J0339K1501L548L0086M3j9491j9407j2620l6127
14983b8077J0555M765l623N3847j4022j8056J7191j8756J7886L9065m6409j9145
14971d779j9400o3994l5875K5408J9589K9542j2946j9697L5003K0518M1997J5051
14959C0417j0081J2044m6428P159r58J8026P216q462j7569j4067k2064p201j4458
14946f6426k5602j7957P491J1149R558L4676L0068l6483j3482j0849j0202K5603
14934f2456N5035n732k4628j1563J910M4833O324K6554m442J7345J9361k0450
$$ y = [-11562, -5546, -6321, -15076, -35810, -21326, -3860, 4140, 1345, -4378, -5579, -59359, -82847, -39816, -11176, 23369, 43971, 62305, 74285, 96395, 103612, 81536, 51408, 75718, 110462, 73584, 31420, 9420, -5949, 4390, 25891, 29439, 59525, 59568, 40077, 20670, 8050, -28077, -17522, -12757, -16380, 37467, 23445, 5389, 22580, 3824, 21710, 60775, 14366, -4779, -24179, -88173, -124048, -98640, -79051, -49509, -62455, -82152, -47149, -26631, 15366, 30417, 20336, 32380, -14048, -6889, -7847, 10179, 17395, 8933, -8636, -22703, -44767, -51968, -66426, -92028, -109985, -102494, -91345, -81787, -47111, -17043, -53526, -67008, -77857, -88059, -62456, -7421, -13153, -37781, -49344, -47434, -2601, 3723, 30277, 25835, 43180, 62541, 42091]
14922D2091p644Q944r118j611P507K0971n672m7775j0452m5800K5207K8855k2192
14909a6689k0901L2016R668k8733j0916J9486J9421K4331m933j4109R43m6084
14897c6500k0617K4169L279m4440l266N1590J2129j1492j6659l0891j2206J6603
14885f8301N0360P921J1947j920N171J1798M761m0098K1593Q422j7175j4710M3140
14872B2909L920k7153m212j7465J2208m535L9508M930k2598r834k3587J008q796
14859c3697J3117J9165J6835O335n4771J5643J4893k3732j4355k3603M6952K5928
14847H710m4958j8552L2654k7326l4317Q194L9302j4077l1940K8010L0270R543
14835a4487l1182Q023M4530R50j917K3068k4351j1800k0408K6153N02L0229O266
$$ y = [42091, 34447, 43391, 34273, 32662, 40169, 61140, 55468, 7693, -2759, -48559, -23352, 5503, -16689, -37590, -5574, 4094, -24639, -35555, -16069, 3352, 27683, 22750, 8641, 9584, -36500, -57117, -32948, -29669, -74109, -77375, -25785, -13656, -25148, -41807, -72698, -84904, -68301, -17941, -10020, 1927, 7, 5178, 16976, 21737, -18361, 3232, 11654, -5521, -20231, 22909, 26829, -324, -4536, -22001, -9793, -14328, 25180, 30110, 7512, -2322, -25909, -24901, -33697, -20580, -1415, 15420, 21755, -33016, -17373, -2480, -26212, -40567, -64170, -17218, 8710, -36248, -54800, -22146, -49472, -83789, -75595, -36293, -50370, -82310, -54300, -24030, -14487, -45669, -37646, 6884, 7834, 5917, 28985, 4634, -7166, -27574, -1421, -919, 29310, 35576]
14822C5576j8315K8685j7197l3461n690j6034M252L6810m0185Q949J9857N287
14810H534l0706m9838L774L4364j679j2567P58L245J297O185J9004l4366Q5L2628
14796a9282k6776k7572J250M088N846K1806L6758k878j7932M0390M5045k3709
14784C7034l7272j1428P999M425Q651k0408l0821n1496q844K8072N5187q34k1062
14771d0797K1316p669M0814J081l0783o018k9647J5939M1439L143J3590R470J3131
14758D5009K2326j6571k9029l5493m1653m6333R237L1707l677K2384J344J2120
14746b8629K161k514M905j4974j3076j1467K9601j877L5563m822m106N947J3429
14733A0141j560m4738j2263M3446j80j1181m9282L051R961J9756K6836K3153j7123
$$ y = [35576, 17261, 45946, 28749, -4712, -10402, -26436, -22184, 14626, -25559, -16610, 3247, 8534, -22172, -72010, -68236, -33872, -35551, -48118, -47360, -44115, -42818, -36633, -17629, -51995, -51910, -19282, -46058, -73630, -72380, -68292, -62446, -40640, -3882, -6760, -24692, 15698, 60743, 37034, -238, -11666, -3667, 758, 9409, -10999, -41820, -93316, -102160, -74088, -18901, -19735, -40797, -19481, -27150, 13664, 14745, -16038, -22056, -51703, -35764, 5675, 8818, 22408, 31878, 45009, 67335, 50764, 21735, -13758, -55411, -101744, -92507, -60800, -64477, -42093, -40749, -28629, -26468, -28982, -24077, -39051, -52127, -63594, -33993, -35870, -307, -5129, -9235, -3288, 10141, 8581, -36157, -48420, -4974, -5154, -16335, -65617, -62566, -52605, -32849, -6013, 17140, 17]
14720A7J5910M6399J8340k1086l5431j9629j873k2604l9900k3581K191L1706j6514
14707f6055K7788L4348K8588L9737R316K2566K753l1972k1007m4064J4448R055
14695B5501j5003l5864j8056J1823M5137L8795k0067l1539L7270P88n2067k0311
14683c3593J4572J3329K5272J8130r329l0651m5897k3915L226K9514N733L0763
14671b846L921R271p820l386l6673K45J4309l00K0923J779k2808P083k0798K087
14657c5013j846j8906J9725L7420K8408p267l6546j8767k2536p031k9879K0361
14645g1877M2509L5255k5792j7299N2767L8311k542k6807l1890l081k2520m8824
14633h1790k2919P561q40K0654L5761J6873J1869P741K3247L2000J0815k7282
$$ y = [17, 15927, 62326, 80666, 59580, 24149, 4520, 2647, -19957, -59857, -83438, -81247, -49541, -66055, -38267, -3919, 24669, 64406, 73722, 96288, 99041, 67069, 46062, 1998, 16446, 25501, 10498, -25366, -43422, -31599, 13538, 52333, 32266, 727, 37997, 38785, -13282, -33593, -19021, -5692, 19580, 37710, 28381, -2270, -48167, -72082, -68856, -39342, -33609, -2846, 1075, 10346, 2526, -860, -37533, -37288, -22979, -23279, -2356, -577, -23385, -16302, -37100, -35013, -36859, -55765, -36040, 1380, 29788, 22521, -14025, -32792, -55328, -62359, -92238, -71877, -29368, 5887, -19905, -37204, 15563, 53874, 51332, 24525, -7365, -10446, -32966, -81790, -104709, -97148, -97988, -77334, -41573, -24700, -12831, -5090, 18157, 50157, 60972, 33690]
14621C3690K7223o879k6451j9131j6787O081L4276K0577k4244r436l4742K4020
14609H197k1372k75k0837l0679L315j7811J4610J202j3377j0467L7330J0504L8669
14596i91L8142k4346k1229j8999m855M8705K4652m215l6956l2393j3156M5153
14584d88M7110j5046k8943j0015K7695J6124L022j5038k2111j0791J2279k575
14572A223k5129K84J354K7586j4896J6200L3522K3755r586k5526K5965J7736J682
14559G4170k8993k4057n292m8753n3081J14L5514o585m288J820O3495R422N397
14546A8883P892j7714N270J5774K6285Q816p44k0310q355N626j6167J6204l0534
14533A0926k331K7125L971p017P026j0490l174j9484r003k5437j4005J8579N3534
$$ y = [33690, 60913, 54034, 27583, 8452, -8335, -2254, 32022, 52599, 28355, 18919, -15823, 8197, -13175, -13450, -34287, -64966, -61651, -79462, -64852, -63650, -77027, -87494, -50164, -39660, -991, 37151, 12805, -8424, -27423, -32278, 16427, 41079, 36864, -92, -32485, -45641, -488, 46622, 31576, 2633, -7382, 20313, 36437, 39459, 24421, 2310, -8481, 3798, 1223, -23906, -23622, -22268, 5318, -9578, 6622, 40144, 63899, 54313, 28787, 54752, 72488, 74170, 45177, 21120, 15828, -32925, -86006, -85892, -50378, -56963, -61251, -59431, 4064, 13486, 18883, 26775, 9061, 14331, 30105, 56390, 65206, 64462, 44152, 35797, 41423, 25256, 41460, 10926, 8595, 35720, 39691, 32674, 39700, 29210, 26036, 6552, -2451, -27888, -41893, -23314, 30220]
14520C0220K9935P457k9290k5545j1894j8300J3550q57l023k4322m358J771l9197
14507g3853J3325l216K4251N5080Q580l1708p888J4834M3547k6445k8287m3361
14495e5141o078j982l0034J8324K7487N0123J9680l5700L617J3527l8109J6433
14483a7853K3254K5795j0344j0039l033N693K2547J9387n058k873L192j9640j9982
14470A1046J2351J243m895M7037L5459j527j8190k2682l1307N4256K8246l4272
14458G6765l9145n2918K898J3303J4880k8898m481M0719M741l800J0568m923J4182
14445D3891l8826J0826K3770j3451N794n2335l2556J9779L3380j5776q558M1504
14433A7442O678j1000k3643K454J0110k7130R82K4789p651J5930o967j394J4856
$$ y = [30220, 60155, 67612, 38322, 12777, 883, -17417, -3867, -4724, -7747, -32069, -36427, -34656, -73853, -60528, -63744, -39493, 15587, 24167, -7541, -15429, -595, 42952, 16507, -11780, -55141, -61219, -63201, -93235, -74911, -47424, 2699, 22379, -13321, -9704, 3823, -34286, -17853, 5401, 31196, 20852, 10813, 7780, 13473, 36020, 55407, 50349, 47476, 50668, 31028, 11046, 23397, 24640, 19745, 66782, 102241, 100714, 82524, 59842, 28535, 82791, 111037, 76765, 37620, -15298, -12400, 903, 15783, -13115, -17596, 23123, 27864, 24064, 34632, 29709, 43891, 5065, 15891, 39661, 26210, 32004, -20331, -52887, -33108, 272, -15504, -24062, 17442, 24120, 13120, -10523, -8069, 2041, -25089, -24107, 682, -6969, 8961, 1994, 600, 15456]
14420A5456P487q6269k0793J7170Q172J9850L2573m6467j3600K0701N5504J6340
14408B6124j7925j3955K0455M2216r350n4414J1786k1670Q037M7126Q225q918
14396C7737Q19M3731m9830j5553L6583J0727L0231n8326j7532K8148n0389m6190
14384d9844j6564L3466L7825L3483L3372J575L0374J4937o0830n9338k2064k2668
14372d6276k4862M3230L2558p323K230j3580J5293l1131m1771M2622J4956l307
14360a7361J3164J7057q273n91l108R546j3643m4965o959j4041k6009R335J5227
14347g0621K3305K6766o760j2954l5149k832K3747m54J9552K705n492j4290J2722
14334c9755J4993L4984J0404l4302l4483n618k918M3427J2287J4803l1525l1526
$$ y = [15456, 22943, -63326, -84119, -66949, -58777, -38927, -6354, -52821, -66421, -45720, 9784, 26124, 8199, -5756, 14699, 56915, 47565, -6849, 4937, -16733, -8696, 38430, 46655, 37737, 38556, 82287, 32457, 16904, 53487, 64214, 94445, 36119, 18587, 46735, -3654, -49844, -66408, -32942, 4883, 38366, 71738, 73313, 103687, 118624, 57794, -1544, -23608, -46276, -71138, -27908, 4650, -2673, -443, -14023, 1270, -29861, -71632, -29010, -14054, -17361, -4197, 12860, 4587, 3996, 888, 10434, -3209, -48174, -55133, -69174, -95183, -85848, -70621, -47316, -20550, -27310, -40264, -75413, -78245, -54498, -54952, -35400, -32695, -38187, -52477, -39755, -24762, 10222, 20626, -13676, -48159, -53777, -56695, -13268, -981, 13822, -17703, -49229]
14322d9229k9961k7991K1130M9183K2383L3328M834L18k5756l2583J7879M891
14310a1574j3942q62J8772M119j6400K1248q844m7029R659M6345P073m7751k9238
14297f8424L1597J3711k4666M1795j3499l1791M1165J5293o70j4957o652r378
14285b6476J2040N631j6915L5723K8160M4199k1430j5962r463m1147m7515k1119
14273g4274M7784L4179n47j8466m1154n102M0061L0342n153J3054L3659J3809
14261F8192N791k6467k7774l3548L128o162o975l1049M241M6623K2015K5367m128
14248C9254j3674l0216M915k0397n651Q643K2794J656j098J4155l110R932k7261
14235e8j340M3053O651m1805n1030m6939q457K301J3331L9492M3984J8299J8968
$$ y = [-49229, -79190, -107181, -86051, -36868, -14485, 18843, 23677, 23995, -1761, -34344, -16465, -11574, -25516, -26378, -7606, -3487, -19887, 1361, -7483, -54512, -44853, 1492, 8565, -39186, -68424, -36827, -23116, -47782, -5987, -19486, -51277, -10112, 5181, 4511, -10446, -17098, -26476, -14436, -8805, -25720, 10003, 38163, 82362, 60932, 44970, 35507, -5640, -53155, -74274, -26490, 7689, 7142, -11324, -52478, -57580, -17519, 12823, 7670, 20724, 54383, 68192, 73983, 47516, 19742, -13806, -10678, -16840, -23815, -54864, -50623, -4000, 18015, 43382, 39254, 25580, -4636, 279, -20118, -25769, -17126, 5668, 7324, 6226, 20381, 17271, 27203, -58, -1398, 41655, 48306, 6501, -44529, -91468, -99925, -97624, -84293, -44801, -817, 17482, 36450]
14222C6450k7550l3329k703k0513k6688K2078l321K5442J5371K2097J7257k1003
14210C588k0465J4266k8515J1550M0182p529k2437L4825M240k5405J1197K0740
14198C6237n288l6834J8459R145j247n647l1108K7904L7345J5019l8153k7784
14186a952q898L694K2997J863k0501m339j4986j1091P8784K1950n3182N064m666
14173A4737k3976J6068J7217J5111J9367K3650k4665o7667j2550K0649k877m5040
14161d9976j4026J8591J5957K6701J4651l5337l5119Q37k8009j2275N7307j0335
14149e1033l4447L5270q728j3661M0009K990N771o022k6720m36O996L2795k2127
14136c9343r78N350K2719n535J059K6589j3164o972J864p121L133K0612n380l2169
$$ y = [36450, 8900, -24429, -27132, -47645, -74333, -52255, -55576, -30134, -14763, 7334, 24591, 3588, -16877, -2611, -31126, -19576, 20606, 13077, -9360, 25465, 29705, 4300, 15497, 36237, 30949, -5885, 12574, 21719, 20472, 14825, -16283, 11621, 48966, 63985, 25832, -1952, -10850, -7156, 15841, 17704, -2797, -7136, -22122, -33213, 45571, 67521, 14339, 19403, 14737, -9239, 6829, 24046, 39157, 58524, 82174, 57509, -10158, -22708, -2059, -4936, -49976, -64002, -45411, -29454, -2753, 11898, -23439, -58558, -57721, -85730, -98005, -40698, -51033, -85480, -50210, -58938, -72599, -32590, -29600, -23829, -29851, -56571, -57007, -50011, -17216, -39343, -40321, -34971, -12252, -17787, -16728, 9861, -3303, -10275, -8411, -15532, -12399, 8213, 2833, -29336]
14122b9336j3471Q927K5293J2815K9179K9144j9156j8745j5359k5935q385k861
14110b7890j0080N481m9056K4850J6349k3191j5868j9024K6077O1297P888p899
14098a1066J4416L379K0377l6065j7635L6957K2050j7180P600L9153L2217l2468
14086F1735m4866l6201J0766J3746J1168J0648Q482J2438l6992q284j144j657
14074a61k139r788J2433J1607n641j1648q5J1280J0494l4164p177L5536K2517
14061C3064j1481k3831J1014l9613k6496m0084L1924N2965R78O870o469o211k66
14048a7636J6827j3032k2826l2223J5973L9534R359J3667j7017j7971L082l7832
14036f0095n898M572K1944l669q174J5301k3962J773L998k0298K97L6233j1107
$$ y = [-29336, -42807, -33880, -8587, 4228, 33407, 62551, 43395, 24650, 9291, -16644, -25029, -27890, -37970, -32489, -81545, -56695, -40346, -63537, -79405, -98429, -72352, -11055, -3167, -11066, 3350, 6729, 27106, -8959, -26594, 10363, 32413, 15233, 22833, 61986, 94203, 61735, 16869, -19332, -8566, 5180, 16348, 26996, 35478, 47916, 10924, 2640, 1496, -161, -2300, -12088, 345, 11952, 6311, -5337, -5422, 5858, 16352, -17812, -24989, 10547, 33064, 21583, -2248, 8766, -30847, -57343, -97427, -65503, -12538, -11560, -4690, -11159, -17370, -17636, -809, -13841, -36667, -68890, -52917, -13383, -4024, 9643, -7374, -25345, -22263, -60095, -65993, -61421, -39477, -43146, -51320, -36019, -59981, -58208, -54210, -74508, -74211, -37978, -49085]
14023d9085p100K4634L1335J5947J7886l9356k4268k7811O151Q2122M1958j3383
14011E9030q417k736o3598p7922k3785K8902K0157O810N7759L8246J4911L309
13999E2666k6949M693m788k5135k141Q066j746j6099J882k3755m1239J7561LJ046
13985e5935K0954N932k8833K312K7875j4820J4424j3250L430r904k1225l8690
13973a07730K3858O9251L536l8212J7575K9416K0575n159j9944L096R255o55N926
13960A0788j2750k0470l2645r148K9347k8061l2940J5604j3477L0646n222J2647
13948e5681L3570L1296K1980j9600m2149k0091J6808n720J184j6990j5819P507
13936f3705l382Q564J3264L9100J6626J6730N794l4903m0703l9836K191N3497
$$ y = [-49085, -56185, -31551, -216, 15731, 33617, -5739, -30007, -57818, -51667, 30455, 72413, 59030, 50613, 47877, -15721, -93643, -117428, -88526, -68369, -61559, -3800, 34446, 49357, 52666, 25717, 30410, 25622, 487, -1654, 6412, 4666, -11433, -9551, -33306, -74545, -56984, -56981, -55935, -34981, -29049, -57882, -55570, -27695, -42515, -28091, -41341, -37911, -47815, -69040, -107730, -83872, -14621, -11085, -49297, -31722, -2306, 18269, 13110, -6834, -3738, 5517, 4862, 10788, -1962, -22432, -55077, -64225, -34878, -62939, -95879, -80275, -93752, -63106, -68328, -55681, -22111, 9185, 31165, 11565, -30584, -50675, -33867, -39587, -38403, -55393, -71212, -63705, -67087, -58523, -45259, -6159, 10467, 27197, 32991, -1912, -42615, -82451, -80260, -26763]
13924b6763N4841r29J3231p123j4209j1556k0525N3780k749p8056N892J6062m3634
13911f1738j5632k2431j8587m65K4543J8439j0709L5526N6652J52m8713j4449
13899e7412J6213J7014k0981o509M7206K6029K1049j085j6004O853m802k4574
13887B997n964j005p56Q301l354p503R184n135o194N181k4696J2763J7547J3890
13873A5256j4740k541j191R33l337J2347k4672M948K4773m200K998K4083j7562
13860A7095j8844n3661j5420j6259K3531j6851O502L1238M7814J823n409l6716
13848c5157J778K1278r663J1394K2017k570k333k9599J9450j9344l1684k0743
13836g5176K9569N412M7463K4692l0783k7841k8560j374N4084K1628n2143M080
$$ y = [-26763, 28078, 27149, 40380, 33257, 19048, 7492, -13033, 40747, 37998, -40058, -34166, -18104, -61738, -77370, -99801, -118388, -118853, -94310, -75871, -86580, -51054, 5598, 5750, -42963, -57412, -41199, -24185, -45166, -51675, -4469, 21560, 42609, 41524, 25520, 32373, 27571, 2997, -2967, -3972, -4728, 3573, 219, -7284, 1900, -3235, -9429, -4248, -28944, -16181, 1366, 15256, 516, -2025, -3216, -2283, -5620, 6727, -17945, -12997, 11776, 7576, 10574, 34657, 17095, -1749, -55410, -70830, -87089, -63558, -80409, -73907, -42669, 5145, 6968, 1559, -35157, -33379, -12101, -21764, -10370, 11647, 9077, 6744, -22855, -3405, -22749, -54433, -75176, -45607, -40195, 7268, 31960, 1177, -26664, -55224, -56598, -2514, 19114, -33029, -28949]
13824b8949J8404j939Q803l7432k2011P8388K9959m436l4644o8993l544L5720
13812c0674K2399K687K2256k1157L374K1145K3885L7928k3576j2393k8314j1171
13800F389p991k9597K2158l0331k3286M2198L0702J8180m1645O534M2722J5357
13788E1390k4707R171k2954m103K2864N235k1061j3141J5346m7484l4511J2864
13776e1091j1452k6795J0266M0457K8067R665K4225l332k3750K7902j4338k5663
13764a5839k6417K8832J5349M0420q675j5100k5541N318J8253n229n842M0380
13752D5909Q499j5990J3535n4654J5568k191J0043l073M3409K4788j024m6874
13740C7945m6234j2550J1435L3690L044J1622l5569K9841R013m4731p287K8058
$$ y = [-28949, -10545, -12484, -3681, -41113, -63124, 15264, 45223, 40787, 6143, -62850, -66394, -30674, -8275, -5588, 16668, -4489, -1115, 20030, 43915, 81843, 58267, 45874, 17560, 6389, -1602, -31199, -9041, -39372, -62658, -20460, 10242, 28422, -13223, -6689, 36033, 51390, 26683, 35854, 12900, 8797, 31661, 36896, 15835, 2694, 18040, -29444, -63955, -51091, -62543, -89338, -79072, -38615, -10548, -883, 23342, 20010, -3740, 24162, 9824, -15839, -42256, -13424, 1925, 42345, 33670, 18570, -6971, -1653, 16600, 11371, 5529, 45909, 54408, 38418, 51953, -2701, 12867, 10676, 20719, 17646, 61055, 85843, 84819, 37945, -8289, -20839, -9404, 24286, 27330, 38952, 3383, 33224, 42237, -2494, -9781, 18277]
13728A8277K5266k7911l147j5583J0349j7416L031k6593j3607L5044K5915n885
13716G740L718l01M1000J7301o066k8873k5959Q409l3449k5345L417o071j467
13703d5946J7063K5864K851J2942m3607m4372J3881K5180K2204J3966k1745Q05
13691b0914r678R216k697J7864J2776L9924o570j3762K748K762o737j7993l093
13678C846l647J9566J0857J7723j3037l3465k5532j5278L5615Q388M711J0259
13666B0006k3243j850J3859L6728J7902k7538p899m72N525n8731j034p590p067
13653d1404m939J7806j9979J3261K3765M629L417K5836k2490m1736l292K7563
13641a7563j3125J4449M8575L324j0101j9723k2291j5352m014K4324k1405l1060
$$ y = [18277, 43543, 15632, 12485, -3098, 7251, -10165, -7134, -33727, -47334, -12290, 13625, 7740, 11458, 11157, 52157, 69458, 63392, 34519, 8560, 16969, -16480, -41825, -38408, -44479, -45946, -28883, -3019, -168, 12774, -30833, -75205, -61324, -36144, -13940, 26, -21719, -20914, -30592, -21376, -24073, -6209, 6567, 46491, 39921, 26159, 28907, 31669, 24932, 6939, 3846, 199, 19765, 30622, 48345, 35308, 1843, -23689, -38967, -3352, 5036, 9747, 20006, -3237, -5087, 8772, 45500, 63402, 35864, 27965, 27493, 33018, -25713, -26747, -34337, -41404, -46343, -28537, -48516, -35255, -11490, -6861, -3444, 22392, -98, -41834, -45126, -17563, -30688, -16239, 32336, 35660, 25559, 5836, -16455, -31807, -35821, -11497, -32902, -63962]
13629f3962j441N3397m1389j6835L0281K5185M031M0851K4444J0515R494l8644
13617C5927m0583L953J0055j9833j2601J4272K2632J4579j4933l2533q26J970
13605a7921K2155q459l9620J405j3407k4711J0514O735J7361m862R213M6659k1321
13592a6259j7169J5694J2150j1859j8353k4895R446M8005J5116o5491Q168K0384
13580b5063j535J5773J7878J7005m5805M663j2023M329q807L740K0804M348N0068
13567D5375K3970j686m3349j3680L6897N0216m8525m9354L7264P216k2860k3108
13555a624k7398O574j1874Q672k409K0634N39J6174p65J1455k2624O315L5684
13542C9353K237j4075l2070k5251k331l770k3109J6839N8033k991l0853q517o14
$$ y = [-63962, -65403, -12006, -53395, -70230, -39949, -14764, -10733, 30118, 54562, 65077, 74571, 35927, -4656, -703, 9352, -10481, -23082, -8810, 13822, 28401, 13468, -19065, -19891, -17921, 4234, -4225, -43845, -42440, -55847, -80558, -70044, -63309, -45948, -50810, -41597, 5062, -16259, -33428, -17734, -5584, -17443, -35796, -60691, -51245, -3240, 11876, -53615, -45447, -25063, -26598, -10825, 7053, 24058, -21747, -17084, -29107, -24778, -33585, -29845, -9041, -4693, 45375, 69345, 67659, 24310, 10630, 47527, 97743, 49218, -136, 37128, 44344, 21484, -1624, -29022, -22448, -34322, -25650, -28059, -7425, -6886, 9288, 8523, 19978, -2646, 3669, 39353, 41590, 27515, -4555, -29806, -32137, -35907, -59016, -42177, 15856, 12865, -17988, -26505, -27119]
13529b7119L9295o86m2274M3036L2751k6936L982k9022l0708j7484L2253K2699
13517b13J5162o831M830k2415L149P660N9132m577k4951o775l6246K4017j0394
13504A548p0990j4006K0747L0473J2060j1069p86K451L3831p795J0691j2243k4821
13491b9909j7676l059K98J8615q032j3530J6400Q582J6323p567j056n33j3132
13478c4276J1250N2176N7584Q954m3451j3258n03l792M1009j9419n3135P269k571
13465G837n906k1738m2944K7173M9890q232k5468j7204J9996K2721L3208l1355
13453G978n0257J773J8530q964n875j3347K6794M07L5436N7264Q12l9616k2017
13440H918l538J4491K887l7293K0643L4872N561k2334J8407q639K2346K9432m0960
$$ y = [-27119, 12176, 11490, -30784, 12252, 45003, 18067, 22049, -6973, -37681, -55165, -22912, -213, 14949, 8118, 12948, -9467, -6318, 1342, 60474, 55897, 30946, 24171, -12075, 11942, 1548, -69442, -83448, -62701, -32228, -20168, -31237, -32023, -29572, 4259, -3536, 7155, -5088, -29909, -47585, -50644, -50346, -31731, -39763, -53293, -36893, -28311, -11988, -19555, -20611, -21144, -34276, -23026, 29150, 86734, 95688, 52237, 38979, 38476, 34684, 75693, 56274, 3139, 10408, 7837, 1931, -19807, -62751, -35578, 14312, 6080, -19388, -36592, -16596, 6125, 39333, 7978, -42279, -40506, -21976, -30940, -36815, -50162, -23368, -22961, 12475, 69739, 70551, 30935, 8918, 5380, 19871, 22758, -14535, 6108, 40980, 46541, 24207, 42614, 33975, 56321, 85753, 44793]
13427D4793m4924k541N203M0232N0950r679k3160l4411l5567J2855j6624j2435
13415b5308P61J0576K4113m340Q055p521j630L2167L4437l3500j7700Q934k1260
13402G784k3203k7960Q150J8487J7609j433N673L357m8675k0940L7896K8422j7042
13389a1875j9396n3900K1449N3881K4026l1288k6307K6738k9139m3108L5010L89
13377e3520m120K8273M3596l5726k9220J6852J9896l0543j4010J097j1200l392
13365g2017L854l070R006J8708j3381L8680J862k1053j5877K3898M3808j1631
13353B787m8238M26q38j8323j5731K5287M4587R275M5408L368k1630j4995J5277
13340B6660j6070j7328J8780O694j3634l6745k1886J2439L7717p930o205k8781
$$ y = [44793, -131, -2672, 2531, 42763, 93713, 84034, 60874, 26463, -9104, 3751, -12873, -25308, -24547, -13971, 10142, 5802, 13857, 6336, 4706, 36873, 71310, 37810, 20110, 29044, 7784, -15419, -43379, -35229, -16742, 867, -566, 5107, 8464, -40211, -61151, -23255, 5167, -11875, -31271, -85171, -63722, -9841, 14185, -17103, -43410, -16672, -45811, -88919, -53909, -53520, -57640, -29367, 14229, -21497, -50717, -33865, -13969, -44512, -58522, -57425, -68625, -72017, -68163, -71233, -62227, -43519, -56900, -18220, -16358, -37411, -53288, -29390, 14418, 2787, -45451, -45025, -45863, -64186, -79917, -54630, -10043, -768, 44640, 48008, 26378, 11383, 26660, 10590, -6738, 12042, 18736, 5102, -31643, -53529, -41090, -3373, -11303, -17508, -46289]
13328d6289j9826K0983O422j63L2299j0972K4491K1990l9147q764j9137K2203
13316a5910K7199M2638L0609K0392n1043l1093k0214k8588k948l1997o327K7111
13304d0171J2027o56m1875K2909L2343k1003K4046j3825K9334l534R999l3854
13292b4260l2159j4695J0823L4419j116l9543K3299J4097j3648k6331N505k9264
13280i2873K0335j2868J1719N557J9164o426Q792J2981k4999K4185L1744K9769
13268B7080J3666N297p375k4121o214J4554n5845K0159L6646K42j8793m5660j2002
13255e2366N0116L4749k2011k5052k2533K8335J7623K442k1538n945J9128k1078
13243a8130l0230O639M9922L5458k3003m0344Q287j7208J118N785k8560M2254
$$ y = [-46289, -66115, -45132, -38710, -38873, -6574, -17546, 6945, 28935, -10212, -18976, -38113, -15910, 11289, 53927, 84536, 104928, 53885, 22792, 2578, -26010, -28958, -60955, -67282, -40171, -28144, -28800, -70675, -47766, -15423, -36426, -12380, -26205, 3129, -405, 9594, -24260, -56419, -71114, -60291, -25872, -26988, -66531, -43232, -29135, -42783, -69114, -63609, -92873, -72538, -85406, -73687, -68130, -48966, -55392, -46600, -33619, -58618, -34433, -2689, 27080, 40746, 46043, 38668, 14547, 8333, 22887, -32958, -12799, 23847, 24089, 5296, -40364, -52366, -2250, 32499, 10488, -14564, -37097, -8762, 8861, 11303, -10235, -16180, 2948, -18130, -48360, -41721, 8201, 43659, 20656, -19688, -11401, -28609, -27491, -21706, -50266, -8012]
13231h012K3029J5265k583j5609j8374r104J3904q27O846K2267j6077j5086q120
13218a2481k0897K8434K0324k579J1476K0756O166k9665k7968l3501K99K3748
13206a5888M2183Q982j3078j1497n153O0722K6119q929j9977j4599N4L851L497
13193E6287k3704j289n882J262j6790m505Q243j2797l7043k4080M2470L9042j8790
13180B424m5030j1399N0779L9066k8544l6423M827L4348l6166Q633L9600J0450
13168C2565k9589J4551j7208j6002j2811n0582j0252K6742M4172M1639Q052k670
13156B8607m4337k564p185K9873J8584q06p373l2151j6748l5808L9445L2674k1789
13143a9578J061P991L2565K2936j6956m0829J8658J4847r629o884K1060m699p740
$$ y = [-8012, 15017, 30282, 27699, 12090, -6284, -15388, -1484, -2311, 4535, 26802, 10725, -4361, -12481, -33378, -4944, 15380, 12801, 24277, 45033, 51199, 21534, -6434, -39935, -39636, -15888, 26295, 35277, 22199, 10702, 5549, 66271, 92390, 83461, 63484, 48885, 48939, 52790, 56287, 32583, 31294, 25412, 26674, 9884, 5379, 13622, 825, -36218, -60298, -17828, 21214, 2424, -42606, -54005, -3226, 35840, 7296, -29127, -24300, 10048, -26118, -17485, 22115, 32565, 2976, 17527, 319, -15683, -28494, -79076, -89328, -62586, -18414, 23225, 31277, 28607, -15730, -18294, -25479, 4394, 22978, 22172, 14799, -17352, -34100, -69908, -30463, 2211, -19578, -18517, -10526, 22039, 44975, 28019, -12810, 5848, 20695, 11066, 4182, 25242, 20543, 12803]
13130A2803m856r273j5925L4533k4854l6748k479J1380M2425k2006j5762P959
13118b2803J2606k3169N3696P0666o943o409k4187k4852j6291N174L600m3662
13106b2574o1937k3816K9840O7704Q804l5105N007r936J6069J8608N364R988Q600
13093A6616K6223n673l3423J6821P564L1279J5905j4495m6953n2861j2963R829
13081d2131J9429J692m5165J7612M0500K2998l782J1637l9020k5129M2483j1796
13069a0672k830R609L8799q687M917j7861j1962J1056J9256j8525k2777K4221
13057A4544J9335R951j034q748k351n473q744k882L795j614k9939q981N332o609
13043b3418J6463L1903o324l8575R867j012K3583p484l5220J0087N860J5968J9526
$$ y = [12803, 7947, -1326, -17251, 17282, -7572, -44320, -46799, -35419, 7006, -15000, -30762, -22803, -10197, -33366, 20330, 90996, 84053, 77644, 53457, 28605, 12314, 17488, 21088, -22574, -84511, -108327, -78487, -10783, -1979, -37084, -32077, -42013, -25944, -7336, -1972, 8016, 16616, 42839, 37166, 3743, 20564, 28128, 59407, 75312, 60817, 13864, -38997, -51960, -42131, -22702, -21010, -66175, -48563, -8063, 14935, 11153, 22790, -16230, -41359, 1124, -10672, -13502, -3893, 34906, 26219, 31136, 13275, 1313, 12369, 31625, 13100, -9677, 14544, 33879, 43830, 42796, 34048, 31697, 26224, 17480, 14598, 18393, 16779, -13160, -22141, -16809, -23418, -6955, 24948, 18624, -19951, -10084, -11096, 12487, 5003, -30217, -20130, -14270, 1698, 21224]
13030B1224K7345O965K1241P438n2124k1655K195j5826M346N124l0017j4239j3686
13017e1669K9582n057m5885o568K0405P279J7318M5308J1292k708O0971K974m2637
13004D0605j370j6462l1376k98J3145L7567J6632k9217k6637J4330o0556j8064
12992f1701P385K7507O2351L0661n7026j6742m059K7569K0576J4475q052l0986
12980A1958j90o273n945j4057l3711K7584J6023l517R111J8660j698m50m3006
12967b5511m8464K1129K315O774J6213L0777K8258m176k1651P785M1217N076l5347
12954B4395J0087j1771j8476L584j8267P833K3521M3947r352o944L632K0216L369
12941G5774P611K689k6263r943j6287j5873j3512L636j0328q250n398L5474j6344
$$ y = [21224, 48569, 55534, 76775, 84213, 32089, 10434, 12629, -3197, 1149, 6273, -23744, -37983, -51669, -22087, -27144, -73029, -79597, -59192, -51913, -34595, 10713, 22005, 19297, 80268, 83242, 40605, 39235, 22773, -8603, -8901, 4244, 41811, 58443, 29226, 2589, 16919, -43637, -61701, -54316, -26809, 35542, 66203, 9177, -7565, -11624, 15945, 36521, 50996, 42944, 11958, 11768, 5495, -450, -14507, -48218, -20634, -4611, -8128, 983, 19643, 17945, 17495, -25511, -73975, -52846, -50531, -43757, -27544, 3233, 31491, 27315, 5664, 13449, 54666, 59742, 24395, 34482, 22711, 4235, 7819, -10448, -2615, 20906, 64853, 55501, 48557, 52189, 72405, 75774, 83385, 86074, 59811, 49868, 33581, 17708, 4196, 7832, -2496, -10746, -16144, 19330, 2986]
12928B986j6220k6663j6114K8449K2466q077k3610J4110R255l3329l095K1081
12916b8761L7645K0608l1896k7363K4544J4733j7263k6073J6364M031p960K8126
12904F735l3616j9960k2489K531K9192K4525M6056J7500n9438l123J5390k0290
12892a6987N951J1343L5742L8614P699N069q519l2781o6280n287L3607N525l8130
12879b4434l2075J7766j4722K9143K8776O370k4690j0959K5868o205j6824J2390
12867i596J2078n568k6101J1071Q03m332l0429j7253L4112K5452N506J8033K5653
12854C9429j2865o5341j144j1643n008K4132j3968j2533K7614k944o486J0930
12842b9827L808J2409j5643r29J0373j5262K5575L766K770K0509m6687k9004J5086
$$ y = [2986, -13234, -39897, -56011, -27562, -5096, -13173, -36783, -22673, -13418, -46747, -49842, -28761, 8884, 29492, -2404, -29767, -5223, 9510, -7753, -33826, -17462, -13431, -21391, 6735, -26881, -46841, -69330, -66799, -37607, -13082, 32974, 50474, -8964, -12087, 3303, -16987, -11036, 307, 36049, 74663, 82362, 87431, 78912, 46131, -20149, -25436, 8171, 13696, -24434, -56509, -38743, -53465, -24322, 4454, 10824, -13866, -24825, 1043, -5162, -21986, -9596, 2482, -3086, -29187, -18116, -17313, -21645, -52074, -69327, -35215, -9763, -4257, 13776, 39429, 26564, -38777, -39921, -51564, -56572, -32440, -46408, -58941, -31327, -34271, -40757, -29827, -26019, -13610, -29253, -30182, -19809, -35071, -9496, -5730, -2960, 17549, -29138, -58142, -43056]
12829d3056k2378K6176M9938j7727j4537N8782Q785j845l6273J402L0244J0128
12817D9639j4307J6523q276j5172K693Q09J5985l2893O13J0824j6202j7225p858
12804a4847k0924l7931K1866K7346l738j9364L9020m3716l0933P2216P176L672
12792a57K132j6617J4220O029j3406J7726J9768m583j1417L719K4207l776j7263
12779B0582j8899N5206M7796k0244j6877K9959m153l5178k8019L3636J3833j9969
12767E7673l1395k5323j3332J3303L1606k099m5225n852P529k9148j9373O29j0588
12754g1595J7889L9071k0296k9721K8727j3293K6594J9708O5861J4313o6182k1546
12742a0470k0522J6635J4075K5558K6531J7365k7398m0447L7621M2444L5615m7314
$$ y = [-43056, -65434, -39258, 10680, -7047, -21584, 37198, 45983, 44138, 7865, 9267, 39511, 49639, 35332, 51855, 43579, 28407, 31100, 31909, 47894, 15001, 15614, 26438, 10236, -6989, -14847, -35771, -73702, -51836, -24490, -28228, -47592, -8572, -52288, -83221, -11005, -3829, -157, 1975, -14642, -422, 5607, -7799, 9927, 29695, 25112, 13695, 17414, 41621, 37845, 20582, 1683, 56889, 104685, 84441, 67564, 97523, 93370, 58192, 30173, 63809, 77642, 57673, 26278, 955, -12377, 926, 32532, 30433, -14792, -20644, -13115, -42263, -61636, -61007, -71595, -53706, -14635, -34931, -64652, -35925, -49218, -22624, -2916, 62945, 77258, 11076, -10470, -30992, -14357, -282, 25276, 51807, 69172, 41774, 1327, 38948, 81392, 117007, 69693]
12730F9693m5598o677j7472k7933L2919L045J9700J2131k5617j4801j126J7888
12718A6152j7823Q75k1672j3274J0487j4753K133J3452J5195K782K6005p501j3273
12705a215k7140O566J442j9237M0700O5597L5034J6077n6928k9795j3561j9131
12693a591O95k3389j4812l463J3058r232L2177K243m574P59K112N3364Q012n4843
12679E16j579L018r948L6293J6952K889j74J2950o884l9855J650k0703l5356l2782
12665g3013K6226L4303K4684k9280n088L1630k8777j9017l2486o448l986K5056
12653e6196O996P281J0540l275L0669K7629l1538J0389M747J8176j5308J878j2686
12640f98r261Q564J2699J2262P314K0679K9119j1356m7222o55k9961N362p264
$$ y = [69693, 24095, 17418, -54, -27987, 4932, 7977, 27677, 39808, 14191, -610, -1736, 16152, -1671, -796, -22468, -35742, -25255, -40008, -37875, -24423, -9228, -6446, 19559, 12058, -1215, -28355, -21789, -20347, -39584, 1116, 66713, 101747, 117824, 60896, 31101, 17540, -1591, -896, -24285, -39097, -42560, -29502, -38734, -6557, -4314, -8888, -8129, -6017, 47347, 55359, 516, -1063, 1955, -7993, 28300, 45252, 48141, 47967, 60917, 54033, 14178, 15828, -4875, -40231, -73013, -46787, -12484, 12200, -17080, -22168, 9462, -19315, -38332, -70818, -77266, -81252, -56196, -49200, -41919, -31379, -34654, -3985, 23644, -7894, 2495, 7242, 25418, 10110, 11988, -698, -9959, -1395, 11304, 23566, 30880, 51559, 80678, 69322, 22100, 21445, -8516, -3154, -10418]
12627a0418L8696j765N642m4839j2631k6948o994K1430J2849L2032L5078l984
12615C8148j7743j1624k0673p049K8242m5079J1224N439m2888l7293K4169K5860
12603d9267K8835L7102j4448p167Q763k1690l0929Q22j4970L4187j726Q517M8900
12590B6929M5941p381o988l9210l8937k8917J5713J3394N247N44J0208n7439l8563
12577i9459N2874P981j1769k370j928k1313J9274j0668J3467L0476j3042Q46L4521
12564a110K1784j7388o961L558J4512q030j6449O289L1033n741l1593l4249L356
12551d0989j0002K0433m541k5955m0066k1963Q442k2326N1151M9749M0970j2980
12539h077K8318K8060L0138M4k7469j6064n021j0654o277p233j9491k6742k5168
$$ y = [-10418, 28278, 26513, 32155, -12684, -25315, -52263, -59257, -37827, -24978, 7054, 42132, 38148, 20405, 8781, -11892, -18941, 9301, -35778, -24554, -19115, -62003, -99296, -75127, -49267, -20432, 16670, 2222, -4945, 3818, -17872, -48801, -47979, -62949, -28762, -30488, -21971, 26929, 72870, 65489, 58501, 19291, -19646, -48563, -32850, -19456, -14209, -13665, -3457, -60896, -99459, -46585, -38604, -50373, -52743, -54671, -75984, -56710, -67378, -53911, -23435, -36477, -35631, -1110, 20674, 3286, -3675, -117, 14395, 6365, -10084, -3795, 27238, 21497, -10096, -44345, -40989, -50991, -30558, -35099, -61054, -101120, -123083, -114641, -136967, -85816, -36067, 4903, -8077, 20241, 48301, 78439, 78483, 51014, 34950, 29929, 19275, 12998, 5765, -13726, -40468, -65636]
12526f5636K6576N3544j0408J402l9155l6383j6544P4140L0192J6469Q720n648
12514C7269m0569J6762L2607M6550j8674l1943J0517p765N248l4546l193K3753
12502C6016n028J4956l6489m2310l5456m351K8282O2322L4299q651J4261l9982
12490A7869k4823k2321n9305j9427M7915N3285q05O091j3058k8274j616k3508
12478f7977J3176o748K0875k0268k21K991K5614j3342k2599J8713j3510L491j6649
12465g6454J7977R155M1524J520q470Q630O843j0432l6327J1812K4077J1383k0968
12452a9730k2850j0180q913j6935N4294K7261J4724K2997J4755Q164o0344o7104
12440f3861J2999J3124Q952L5914K1589O576j7141q6866k6483J2728K5777r718
$$ y = [-65636, -39060, 14484, 4076, 5478, -33677, -70060, -86604, -12464, 17728, 34197, 42917, 37269, -3300, 13462, 46069, 92619, 73945, 42002, 52519, 44754, 50002, 15456, 12263, 36016, 30988, 45944, 9455, -32855, -68311, -72662, -44380, 17942, 52241, 43590, 57851, 17869, -6954, -29275, -88580, -108007, -60092, -6807, -7612, -1521, -14579, -42853, -44469, -67977, -54801, -61549, -40674, -60942, -61163, -58172, -32558, -45900, -68499, -49786, -63296, -59805, -76454, -58477, -49322, -7798, -6278, -14748, -6118, 725, -9707, -46034, -34222, -10145, 1238, -19730, -42580, -52760, -61673, -78608, -24314, 2947, 17671, 40668, 55423, 63587, 3243, -63861, -50862, -37738, -28786, 7128, 28717, 35293, 18152, -68714, -95197, -82469, -56692, -66410]
12428f6410J6612M4413K652l9381J6865L8003j6118l6358K1194K5158P0319K7762
12416A04711j7205n613j1624k5546k3808l7066O813J9040j319K6207j6843n0810
12404c3063j1107k1200l7230J1039J4766J5734P938J9755K0158j1994m445K6741
12392b908N6507n754n2465j6055N467k6960P112N516K2414N757K8238M3712m331
12379F6250l3216m1738j0189M2410L7239J5402m7889j2423j535l2256P231M7996
12367C7282J5631K612o99m8647n5071k325R720J8122K4072J0160k6971q063j4559
12354c8736K2666K4325R415J7279J7574j2103J611j3798k5913J825j2784J9343
12342A0704P772q376m2980k0589K7268o392q544n017M3547J9706k4522q339n3120
$$ y = [-66410, -49798, -5385, -2733, -42114, -25249, 12754, -3364, -39722, -18528, 6630, 76949, 104711, 87506, 81893, 70269, 44723, 20915, -16151, -9338, 9702, 8383, 34590, 17747, -33063, -44170, -65370, -102600, -91561, -76795, -61061, -53123, -33368, -13210, -25204, -29649, -2908, 53599, 47845, -4620, -20675, -15208, -42168, -35056, -29540, -7126, -1369, 26869, 70581, 66250, 33034, -8704, -18893, 23517, 60756, 76158, 28269, 15846, 14311, -17945, -10714, 37282, 52913, 55525, 54826, 6179, -48892, -51217, -41497, -23375, 697, 10857, -16114, -24177, -38736, -16070, 8255, 17670, 34949, 52523, 40420, 42031, 28233, 2320, 4145, -8639, 10704, 18476, 10100, -32880, -53469, -26201, -32593, -41137, -46154, -2607, 17099, -7423, -15762, -68882]
12329f8882J724N5055M4387K4957j5925k1036L2199l0994j9186K2366K4826J3386
12317F2877l5877q865l8357o242L5145l0686j9176J7962k5875l788M1658M5961
12305C4737Q184j642j9167l2845j1446N293J6128J9680j7818l4862O006q749J4666
12292b1835q68P42K0998J2627N956R898K4772K824k1919J1346j9311L8035j0651
12279E2614q924K377m553N617j0721J4449r516J1231k3999j01946N421L7319M9387
12266A8756k137j2579k2498q136R804J2268P499J5478J2189l8579k891J4009k4934
12253b1751k9836J3272O2905M5260J45p717K812k403P15j3256m6560j168R95k3249
12239a9836K5407R529Q598K4165J7286k028K0898l3322k9520K4920m785l9296
$$ y = [-68882, -67158, -12103, 32284, 57241, 41316, 20280, 52479, 21485, 2299, 24665, 49491, 62877, 27000, 18135, -20222, -26464, 8681, -22005, -41181, -23219, -49094, -52882, -11224, 34737, 42921, 41279, 22112, -10733, -22179, -16886, -758, 18922, 1104, -33758, -27752, -36501, -21835, -22703, -21961, -963, 11664, 17620, 27518, 52290, 55114, 33195, 44541, 25230, 63265, 52614, 43690, 46067, 41514, 47131, 36410, 50859, 41343, 52574, 28575, -73371, -67950, -30631, 18756, 16619, 4040, -18458, -26594, -16790, -4522, 2977, 18455, 30644, -7935, -10826, 3183, -21751, -51587, -38315, 24590, 69850, 69995, 62278, 65090, 62687, 63402, 50146, 3586, 2418, 3413, -19836, 5571, 15100, 23698, 47863, 65149, 63121, 84019, 50697, 21177, 46097, 41312, 2016]
12227B016l9029J5911j2569n396R075J4986K4175P678k1423l4256R868L6536j4200
12214f628r203m9643k2410j4630N4586L933K1060M8689k050l2056O11Q807p737
12201f671k6397j2935R479L4130k6510J5537r811L762J7833J640J0719l247J3783
12188B1312j2915p5260K506K5845O5584P772l1030k1200n481O415O239J2370K2991
12175B5148K2904K0224L9644L3182o1440n8734P65k5074k864J931R980M0317n520
12162D0463j2137l3409K4K5598J4527k0823k1485m7584J8756O1449q504K573L911
12149B3359j7550K7569L4196j2816j66m238L428j1349R839l6929j5978q88J14
12136a409K0405J7678q241n1666J826K8627K2268P523j2321K5042K0870m0848
$$ y = [2016, -37013, -21102, -33671, -39067, -29992, -15006, 9169, 16847, -4576, -38832, -28964, 7572, -6628, -15831, -65474, -87884, -102514, -47928, -43995, -22935, 25754, 23704, -8352, -7741, 1066, -6671, -33068, -46003, -36524, -2394, -28904, -13367, -23178, -19416, -1583, 57, 10776, 7529, 21312, 8397, -66863, -64357, -38512, 27072, 34844, 3814, -17386, -22867, -16452, -10213, 2157, 25148, 48052, 68276, 107920, 141102, 79662, 20928, 21693, -3381, -6245, -4314, 5666, 45983, 40463, 28326, -5083, -5059, 20539, 35066, 14243, -7242, -54826, -36070, 25379, 16875, 19448, 23359, 5809, 33378, 67574, 54758, 54592, 50354, 53782, 42433, 52272, 15343, -635, -1523, -1409, 18996, 36674, 28433, -23233, -21407, 7220, 29488, 37011, 24690, 49732, 70602, 29754]
12124B9754k4242j8066p2844j3368L7969J6529M7102L5129o878k3121R299l1383
12112a4120m561M1102K9539J0430m9372l7858m4572o4883k8160o352J4122N4981
12100i9704L9702O950K1605k1150L2303p399k1746J4730K3585l9753n9969M8698
12088f2148k886O214L6276n378J0401L1192j8736j3133k2939K8166L2161K8018
12076D7208J2996k0202n7610k5372K9490K5948K0220m290L9591o431N06R871p450
12063F4475l6135o2509p302L8852N3215L089l6241l4342J4546J8714j1753k1852
12051a7243Q680M4049L4684M2553K2073k8504J2956m215L4528Q2784L7554N8366
12039C28265L5783k5600o3131J8297L0167n5259m4812m662j6990j871L1500k4304
$$ y = [29754, 5512, -12554, -85398, -98766, -60797, -44268, 2834, 37963, 31085, 7964, 17263, -14120, -18681, 22421, 51960, 62390, 13018, -24840, -69412, -134295, -162455, -168807, -154685, -99704, -60002, -53052, -31447, -52597, -20294, -27693, -49439, -34709, -11124, -50877, -110846, -62148, -65034, -58820, -22544, -27922, -17521, 13671, -5065, -18198, -41137, -12971, 19190, 47208, 60204, 40002, -17608, -42980, -13490, 12458, 32678, 28388, 67979, 61548, 62054, 71925, 64475, 28340, -34169, -41471, -2619, 50596, 53685, 17444, -16898, -2352, 16362, 4609, -17243, -8563, 35486, 70170, 112723, 134796, 106292, 119248, 115033, 149561, 232345, 269899, 328265, 364048, 338448, 275317, 293614, 323781, 268522, 223710, 219048, 202058, 200187, 231687, 207383]
12027B07383j5572J8445j0416N911j0754O0128k3360o3554k9826J1671L0218K5760
12015B06034k5606J0094L9469j1426n7184k2238M5309j8922k1377l9046k9759
12004G5348K7560K8399l4322q775j4480J8026L3678J3484r491j6680k822L1090
11992A41015M6973j2659M481J991l147k8627j5451j9307j641K683m514P895N0328
11979A70020J7376p190R917k4838j6963P968J5426P327J1978l2165k4196M0040
11967A74700L6733k5954N4134R7k6213k0571M856M0862K1502j8637q639L0741
11955B63611J3762K2278O204m5213N527K5223O2878R1028O6967J9840N872J7296
11943E55273K1633j650K7347N6722P3791O4104O1919Q4375J05287J18517J25993
$$ y = [207383, 191811, 210256, 199840, 205751, 194997, 255125, 231765, 168211, 138385, 150056, 180274, 206034, 180428, 190522, 229991, 218565, 161381, 139143, 184452, 165530, 144153, 105107, 75348, 102908, 131307, 96985, 88210, 73730, 91756, 125434, 138918, 129427, 112747, 109925, 141015, 187988, 175329, 179810, 181801, 178654, 150027, 134576, 115269, 113628, 116311, 111797, 119692, 170020, 187396, 180206, 190123, 165285, 148322, 156290, 171716, 179043, 191021, 158856, 134660, 174700, 211433, 185479, 239613, 239710, 213497, 192926, 197782, 238644, 260146, 241509, 232870, 263611, 277373, 299651, 305855, 260642, 266169, 291392, 354270, 445298, 512265, 532105, 537977, 555273, 576906, 575256, 602603, 659325, 733116, 797220, 859139, 943514, 1048801, 1167318, 1293311]
11932A293311J61070J57132J79515K21166L00763L54379M83891O68638Q79379
11923D699244J179528J759621K765163M448276P357725J1213914J2671385R106940
11915E5201796P107427Q793321K592237j3634083j8536007j2899835p639098m608002
11907A6377756k947680k024495j457880j098465q53335p01226n68322m74559m26330
11898E825464l57255l14777k67968k16924j82301j94642j76544j74766j34612
11889C805675j04687j13108r8593r2409q4276o8971m3056m9422n5503k5449l6465
11878C033736j7168k2394j14806j10868j16125q0692o9679q7318p4440q9836r4460
11867B155950j17200p2497p3212p2672k4077l6771o8201o4149k8867k3383o6919
$$ y = [1293311, 1454381, 1611513, 1791028, 2012194, 2312957, 2667336, 3151227, 3819865, 4699244, 5878772, 7638393, 10403556, 14851832, 22209557, 33423471, 46094856, 55201796, 62309223, 71102544, 73694781, 60060698, 41524691, 28624856, 20985758, 16377756, 13430076, 11405581, 9947701, 8849236, 7995901, 7294675, 6726353, 6251794, 5825464, 5468209, 5153432, 4885464, 4668540, 4486239, 4291597, 4115053, 3940287, 3805675, 3700988, 3587880, 3489287, 3396878, 3312602, 3243631, 3200575, 3151153, 3095650, 3070201, 3033736, 3016568, 2994174, 2879368, 2768500, 2652375, 2571683, 2502004, 2414686, 2340246, 2250410, 2155950, 2038750, 1966253, 1893041, 1820369, 1796292, 1759521, 1691320, 1627171, 1598304, 1574921, 1508002]
11856A508002m2901j430m2329o6392j2741l1161m4654l4453l6674r117k6504k9607
11844A130039l3853J3488J1309o939k8939l0530j07739q0373P886L0975p118k2127
11832H76079l8955n1301Q938l142l4743k9422k7932j8282j5656J5118L5940j0352
11820G06290n6575k5220L2225r545k2816l1067o6067K0807L6490R639L2504o5744
11808E60921J5767L6334l627m0270N681j1028j4820o853k2160K005J4798N424
11796E42172m610l4360R84N2272K7317J2940N928M2380N6251k1427n7737r177
11784F12933N554j07070m2727k775l1516m0983L0110K3265Q665k1949l062k6978
11772D03467r893m702k8739j5419j7855k3265j0360K1081L6418r109k9087m7180
$$ y = [1508002, 1465101, 1463671, 1421342, 1354950, 1342209, 1311048, 1266394, 1231941, 1195267, 1186150, 1159646, 1130039, 1096186, 1109674, 1120983, 1114044, 1085105, 1054575, 946836, 866463, 874349, 905324, 898206, 876079, 837124, 785823, 794761, 791619, 756876, 727454, 699522, 681240, 665584, 680702, 716642, 706290, 649715, 624495, 656720, 647175, 624359, 593292, 527225, 548032, 584522, 594161, 626665, 560921, 576688, 613022, 609395, 569125, 574806, 563778, 548958, 542105, 519945, 521950, 536748, 542172, 537562, 503202, 504186, 556458, 583775, 596715, 602643, 645023, 701274, 679847, 622110, 612933, 618487, 511417, 468690, 465915, 434399, 393416, 423526, 446791, 455456, 433507, 430445, 403467, 393574, 388872, 360133, 344714, 326859, 303594, 293234, 314315, 350733, 341624, 312537, 265357]
11760B65357n72L7649Q585l1602M002j8585K2007L1402l1257l8103p229k2107
11748B19547M67L7728J0869m8394L9187J3989p6645l2849L9941N0973j0687j8332
11736B25794k1239l0838M629L6055K3276J9318N950j9973L4301J1356m650j5562
11724B68417k2016n5315k0473j2106l4474j6565J1370k1437n586j2078N6833j33
11712A36437l6424N6560j089l7735l4304L1714M9784p780m3622j1697L4468q44
11700A35468n2696j5931K3666P042j4632j7677L907K5184K0321K7867J8499K0257
11688A81275l2658n4856k031m0087M8500J5222j4983k4237k022M314O458J1715
11676I6610k6522k4669k051J8919j3264L5543L4159q75N762L0m7462m1850j352
$$ y = [265357, 264785, 302434, 311019, 279417, 283419, 264834, 286841, 318243, 286986, 248883, 241654, 219547, 220014, 257742, 268611, 220217, 259404, 273393, 196748, 163899, 203840, 254813, 244126, 225794, 204555, 173717, 178346, 214401, 237677, 256995, 262945, 242972, 277273, 288629, 283979, 268417, 246401, 191086, 170613, 158507, 124033, 107468, 118838, 97401, 91815, 79737, 136570, 136437, 100013, 156573, 155484, 117749, 83445, 115159, 164943, 157163, 113541, 101844, 136312, 135468, 82772, 66841, 90507, 97549, 82917, 65240, 69147, 94331, 114652, 142519, 161018, 181275, 148617, 93761, 91730, 51643, 100143, 115365, 100382, 76145, 74123, 78437, 84895, 96610, 70088, 45419, 43368, 62287, 49023, 84566, 118725, 117850, 123612, 123642, 76180, 34330, 32978]
11663C2978N431j5738K0208N1347J377K8918q949n0308l6082J2989N1080L4038
11651A27289k0637l181l4311k3709j8096j2619j636n982R744J2646m187l0102
11639d781J5359L6097q526j083K8011l2334n0847j8123L8847J2188K9678N2785
11627I7271L9253J3370M539L0590o3356n1749m283j6371l0218J965J118k2123
11615FJ3580L6690r706J1748k7511m8591j3521k8881N3781J1167M3555L318j3514
11602C2121k4127J8728J2456K6570N2827K9990k564m0248k2570r822o3755j1323
11590a717K3690N142J4971K8795L3529o4598o1578J2791J1374N942k8698k1303
11578d1660P497k194k3290M5452J7032J5428N976r633K2345K0922l275M73l19
$$ y = [32978, 38409, 22671, 42879, 94226, 95603, 124521, 115572, 65264, 29182, 42171, 93251, 127289, 106652, 103471, 69160, 45451, 27355, 14736, 13100, 7118, 16862, 29508, 25321, -4781, 10578, 46675, 38149, 37066, 65077, 32743, -18104, -36227, 2620, 14808, 44486, 97271, 136524, 149894, 154433, 185023, 121667, 69918, 65635, 49264, 19046, 21011, 22129, 6, 13586, 50276, 40570, 52318, 24807, -23784, -37305, -66186, -12405, -1238, 42317, 45635, 32121, 7994, 26722, 39178, 65748, 118575, 148565, 146001, 105753, 83183, 73361, 9606, -1717, 21973, 27115, 42086, 70881, 104410, 39812, -21766, -8975, 2399, 8341, -20357, -41660, -34163, -36357, -59647, -14195, 2837, 18265, 24241, 14608, 36953, 57875, 54600, 55073, 54754]
11565E4754l1822l068r484K1537p529j5046O109R20j3840j9146L2137J0147k860
11552B2809k1176k9345K9071K2944j0194k1208j2616O575j9361N934k7037l7632
11540i1236K5707N0256J1167k182j6288J113j2144J0613p35J91k8821M7812J1709
11527G162j2061j8007L0150M8282O518l8616q136M024j1222k3497p639P705J7188
11514A851K4945k3070j7270r213j2689M5738m381r733R800J3736j1453K363L0697
11501D1321j5283J8278k077j3808N815J8254m879m0219Q518k9355n53N081l24
11488i231k6779M761L2570J4448J1415k3393l7238l4197K2003J9794r68L3216
11476F401j1241R397M3744J8268J3680n3167m578k020K8975m5809j6194K5795
$$ y = [54754, 22932, 19864, 10380, 31917, 24388, 9342, 15451, 16371, 2531, -16615, 15522, 25669, 22809, 1633, -27712, 1359, 24303, 14109, -7099, -19715, -13140, -32501, -26567, -53604, -91236, -65529, -15273, -4106, -6288, -22576, -21463, -33607, -22994, -23729, -23538, -52359, -4547, 7162, -4899, -22906, 7244, 55526, 62044, 23428, 15292, 19316, 8094, -15403, -23042, -15337, 1851, 26796, 3726, -13544, -22757, -35446, 10292, 5911, -3822, 5978, 19714, 8261, 10624, 41321, 26038, 44316, 42239, 28431, 34246, 52500, 47621, 7402, 15920, -13435, -13988, -8907, -9231, -36010, -31249, 1321, 15769, 27184, 3791, -33447, -67644, -45641, -25847, -26815, 6401, -4840, 4557, 48301, 66569, 80249, 27082, 22504, 20484, 49459, 3650, -12544, 13251]
11464A3251J3973J4488j8901k9180L5469Q081p2501J1842K9496q442j8217p714
11452b8355m5750q036J5626N2972K1340l509j8521q680j6908K2991L7380J0056
11440C0606K703j391L707K2861K4708P653k7859l0619l8965j1937j333J0262m0301
11427d9905j2741M6972K9185R413P876j4405k3921m9334K1174K3904j8292K7653
11415b421O2014J2796r691l4488Q04k2752j3254J2050K6089l6912l1868m520L0349
11402a1804J9500l4316J3399n860l3007k5804l373J0186N0706k14j4929l5545
11390g1061M6322M8530l8835m235K76M43q176K3399N3153n070n0133Q242m793
11377a938j2618L7217J1146j766n1204K6469O2653Q944l1491l0830o063l2025
$$ y = [13251, 27224, 41712, 22811, -6369, 29100, 37181, -35320, -23478, 6018, -2424, -20641, -28355, -74105, -82141, -66515, -13543, 7797, 4288, -14233, -22913, -39821, -16830, 20550, 30606, 33309, 31918, 35625, 58486, 83194, 90847, 62988, 32369, -6596, -18533, -19866, -9604, -49905, -62646, -15674, 13511, 22924, 30800, 16395, -7526, -56860, -35686, -11782, -30074, -2421, 59593, 72389, 62698, 28210, 29014, 6262, -6992, 5058, 31147, -5765, -37633, -42153, -11804, 7696, -26620, -13221, -19081, -52088, -77892, -81265, -71079, -20373, -20587, -35516, -71061, -24739, 23791, -15044, -19279, -19003, -18560, -26736, -3337, 49816, 44746, -5387, 2855, -1938, -14556, 22661, 33807, 32041, -19163, 7306, 69959, 78903, 47412, 16582, 10519, -21506]
11365b1506k744j10l575k5134m2171m673J3347L1477K0924j5377L308q374M0353
11352a4255J6937M8768k8147K2305k7227o0411P987p922J6994J3779k8584j7101
11340e6877J2622N853O647M6210l513l6643L490J3806J2842r702N273l0374J8615
11327a1751K148k649k1110k8947K0869N3346L7330q713k2905j2054k6272K4748
11315D040K9681m6053l1631M653j6721j6990J3168J7220P981N620J593k444q04
11302c0687L454L030J0848O545K970M35l5023j9252J15K0591k575j2591l205M5752
11288i593K1679J5246j7052m0175p469N858J5119j5082p952J8027k782Q362K993
11275a2821K3421J3573k9962J3047M7111L5021m7803l8388J0631k1184K3196N6422
$$ y = [-21506, -24250, -24360, -27935, -53069, -95240, -99913, -86566, -55089, -34165, -49542, -46234, -54608, -14255, 2682, 51450, 23303, 45608, 18381, -42030, -34043, -41965, -24971, -11192, -39776, -56877, -44255, -38402, -31755, 14455, 10942, -25701, -22211, -8405, 4437, -5265, 8, -30366, -11751, -9603, -12252, -33362, -62309, -41440, 11906, 49236, 40523, 17618, 5564, -20708, 4040, 33721, -12332, -43963, -39310, -56031, -73021, -59853, -42633, -34652, -29032, -27439, -29883, -30687, -27233, -24203, -13355, -6810, -3840, -3405, -38428, -57680, -57565, -36974, -39549, -52140, -55345, -9593, 12086, 27332, 10280, -29895, -37364, -31506, -16387, -31469, -39421, -21394, -24176, -15814, -12821, 10600, 24173, -5789, 7258, 54369, 89390, 41587, 3199, 13830, -7354, 15842, 72264]
11263G2264k0975K652K7699K549m9273m9037J5458K2046p694J5143O997l3527
11251D302q979L1793N706L873j5213j9655J5130J4483K5431k543J24K6930J2236
11238I3618n4910k2789O83L928m518j2042m8367k9046N2533J8740k3365l3001
11226e8536P910J1906K9537N1273L1948K1365j0230j9075n577l4406j976K0738
11214D4877L7294K9568J828l043l1588k178r927j2796J348m5661N759m3887M2252
11201A3846J4410j0050L542J6192m759M298j6696j7703K433k3458m1897K3047
11189c6795J5843J4000R570L1769O96k7568n4825K7911L9657R544J9777l0921
11177A8658K943n16o8796N330P843J6297K2498P884j2637j6309R148K5571j721
$$ y = [72264, 51289, 53941, 81640, 84189, 34916, -14121, 1337, 23383, 15689, 30832, 37829, 4302, -4677, 27116, 32822, 36695, 21482, 1827, 16957, 31440, 56871, 54328, 54452, 81382, 93618, 38708, 15919, 16602, 20530, 16012, 3970, -44397, -73443, -20910, -2170, -25535, -58536, -50626, -38720, -9183, 42090, 74038, 95403, 85173, 66098, 60521, 26115, 24139, 44877, 82171, 111739, 113567, 110524, 78936, 76758, 66831, 54035, 55383, 9722, 15481, -28406, 13846, 28256, 18206, 21748, 37940, 33181, 37479, 20783, 3080, 5513, -17945, -59842, -36795, -20952, -6952, 2618, 34387, 35083, 7515, -47310, -19399, 20258, 29802, 49579, 18658, 21601, 21085, -47711, -42381, -34538, -18241, 4257, 12141, -496, -16805, -7657, 17914, 16193]
11164A6193k7367k0733K6574j3777Q3J0911K8467m8302j0201J9688J3443k7762
11152c2783j637n131L6481N6928j9906k9704k8369J8423K0607j7803j8050m297
11140b5241L22k986M1973P682q44J943l1399K9216J7569n993j1120j7839J9576
11127B2859k5086m8419k9344q548N739K0208M4150K3405l159k0907j7728N8880
11115B2050m198l5357J7239j1713m6633K3851L3509Q959J8450J6625n5769k2226
11103c5213O654R780J1224j8605k162N1944J0464n27J7448j5982L137r717k9220
11090g75n1366k9752j5404K5995j9474j7044J247J5345N618L5531M7730M4622
11078D2273L552l0055l10Q555q068O522K902M333o047l4771L932K8652M878p3874
$$ y = [16193, -11174, -31907, -5333, -19110, -19027, -8116, 20351, -27951, -38152, -18464, -5021, -32783, -34420, -39551, -3070, 53858, 33952, 4248, -24121, -5698, 14909, -2894, -20944, -25241, -24919, -27905, 14068, 21750, 20906, 22849, -8550, 20666, 38235, 32242, 21122, 3283, 22859, -2227, -50646, -79990, -88538, -82799, -62591, -18441, 4964, 1805, -19102, -36830, 22050, 17852, -17505, -266, -11979, -58612, -34761, -1252, 7707, 26157, 42782, -12987, -35213, -28559, -18779, -7555, -26160, -28322, 23622, 34086, 33559, 51007, 35025, 38162, 28445, -775, -52141, -81893, -97297, -71302, -90776, -107820, -106573, -91228, -85610, -50079, -2349, 42273, 45825, 15770, 15460, 24015, 15947, 22469, 25371, 29704, 23657, -11114, -7182, 21470, 26348, -47526]
11064d7526j7511J1957M9154L6601j5048J6935j6476j1052k423M1012M9323k041
11052I2905p9288k4344l5722n744N9207N5998O1249K5389k1338Q664L2831M9286
11040B19093k0995p0266o5457p029L3201K5403K6344O2189L1146j1612n992J143
11028B17168j5417J7911L0937k4858J2606K8201N560m865M0704J6667j1941o9876
11016B42797n1891p125m5722j6048P3431N2096K8692Q521K1529j7744l7885q2218
11004A68433j7980J9924k4846K9325M857k9357K6847J0586j3030j7537o3202j9010
10992G5010l9655m5450n3328M0885P2329J4835J8635j5985j0680l7911k4876L6914
10980C0723J0419j7707J6258Q449K982j3221m6420p235l739J680J489L6484O6056
$$ y = [-47526, -65037, -53080, -3926, 32675, 17627, 34562, 18086, 7034, 4611, 45623, 94946, 92905, 13617, -10727, -46449, -52193, 7014, 63012, 124261, 149650, 128312, 136976, 169807, 219093, 198098, 127832, 62375, 55346, 88547, 113950, 140294, 202483, 233629, 222017, 216025, 217168, 201751, 219662, 250599, 225741, 238347, 266548, 272108, 267243, 307947, 324614, 312673, 242797, 190906, 183781, 138059, 122011, 195442, 247538, 276230, 284751, 306280, 288536, 250651, 168433, 150453, 170377, 145531, 174856, 179713, 150356, 177203, 187789, 174759, 157222, 94020, 75010, 35355, -10095, -63423, -22538, 49791, 64626, 83261, 67276, 56596, 18685, -6191, 30723, 41142, 23435, 39693, 48142, 51124, 37903, -8517, -15752, -19491, -17811, -16322, 20162, 86218]
10967H6218n641l4786n1626n081K1317Q289q800j8961p525l946R791K8118l2372
10954a5005j0920J1400J0142R428L4337L112j1552R568q632n000j2934k8224k2539
10941c6819k1303l329L8629L6079p9K1542J9361K165J8784j8041j1036l6256j4013
10928d316K470j8184l3877l508M4226N1246K3590k7638m2948j2927O078o851J540
10915b1099K2747N1164l7503o1412J6961L911r68J7919K8251l4794l109L3420
10903A5488q720n805j5653J3319K2440l0252O668N5954K1269K510l6039k0675
10891B0504m0187l2242M238K2409M0833r531l1316j3309K5527k2920J7906l784
10879b1872m0103J2207M8330J9628q996P948K4287q85k263k0123k3373L4833M0394
$$ y = [86218, 80577, 45791, -5835, -10916, 10401, 18690, 9890, -9071, -16596, -20542, -10751, 17367, -15005, -25925, -14525, -4383, 5045, 39382, 42494, 30942, 40510, 31878, 26878, 13944, -14280, -36819, -58122, -61451, -22822, 13257, 13178, 34720, 54081, 56246, 75030, 56989, 45953, 9697, -4316, -1846, -20030, -53907, -57415, -13189, 38057, 61647, 34009, -8939, -21866, -15788, -22639, -21099, 1648, 52812, 15309, -46103, -29142, -25231, -26199, -8280, 19971, -14823, -17932, 15488, 6768, 963, -14690, -1371, 21069, -9183, -2515, 53439, 74708, 77218, 41179, 20504, -19683, -51925, -47687, -25278, 15555, 6024, -25292, -38601, -13074, -35994, -18088, -21872, -61975, -49768, -1438, 18190, 9194, 17142, 41429, 40544, 38281, 18158, -5215, 29618, 70012]
10866G0012M1653l6048l600N880L694l7974k5066K4465J0590k0124j824J0117
10854D1775k0470M47L8363J8343j7623M548n208J4959K5494m036j4145l4897J319
10841D8869J8578K6252L4312k4307l0288j765l0546j4738k3673l1507L7221J8266
10829B6674k4646M3621L0443O724N155m3673m2504J3992J6963k6630l208R786
10817A2697R749j2511m959j3814q757k9578k6156k5356k1345K7670K2625l7621
10805a07356M1243Q777j5512K6973L6079L0524M4149L3175n3826n8370j8442k781
10793c5367l7314k3480Q864M1614M7087K5536j6634P370J0413m8468k3293Q11
10781d2861k2124k5344j3468k2152l8444o097K6789L7848L9211k1294l3224k908
$$ y = [70012, 111665, 75617, 72017, 77897, 81591, 43617, 18551, 43016, 53606, 33482, 31658, 41775, 21305, 21752, 60115, 78458, 60835, 65383, 60175, 75134, 100628, 96592, 82447, 47550, 48869, 67447, 93699, 128011, 103704, 73416, 71651, 41105, 26367, 2694, -28813, 8408, 26674, 2028, 45649, 76092, 82816, 87971, 44298, 1794, 15786, 32749, 6119, 2911, 12697, 22446, 9935, 4976, -8838, -17595, -47173, -73329, -98685, -120030, -92360, -69735, -107356, -66113, -57336, -72848, -45875, -9796, 20728, 64877, 98052, 44226, -14144, -32586, -35367, -72681, -96161, -87297, -45683, 1404, 26940, 10306, 17676, 28089, -20379, -43672, -42861, -64985, -90329, -103797, -125949, -164393, -170490, -143701, -105853, -66642, -87936, -121160, -124068]
10769a24068N280J357J7850J8793M4910K044k4430j5238J0890R271K1285K304
10757b9752R352R896Q848J3365j6736m391k010J7394k2575J0521K0196j3479p689
10744g060j379M2506O2780J0113j572J0856M1364M689O493M0132l6330Q643L8929
10731B20164p381l0734J3544K8422j2909N8575J8746j2002N7717L7562J3729k7632
10719C57801r858j3486O1031M0510j0601j2353M089L4237K6956m3950j563O8665
10707E01478N2200j5722l4584m3161K3829K024L605J9503k4675m5042o8366J5840
10695C86929M9188J2190M2262k4287l3198N93j0697l6326J953N1516J1593k8598
10683D23118n1676J3860J0973M643J478j1449j2047l3583m135Q881K2160J7285
$$ y = [-124068, -118788, -117431, -99581, -80788, -35878, -33834, -58264, -73502, -62612, -53341, -32056, -29752, -20400, -10504, -1656, 11709, -5027, -9418, -11428, 5966, -16609, -6088, 14108, 629, -7060, -8439, 34067, 96847, 106960, 105388, 116244, 157608, 162297, 168790, 208922, 172592, 181235, 220164, 212783, 182049, 195593, 224015, 211106, 269681, 288427, 276425, 334142, 371704, 385433, 357801, 347943, 334457, 395488, 435998, 425397, 413044, 417133, 451370, 478326, 434376, 432813, 501478, 553678, 537956, 503372, 460211, 484040, 486064, 489669, 509172, 484497, 439455, 371089, 386929, 436117, 448307, 490569, 466282, 433084, 433677, 422980, 386654, 388607, 440123, 451716, 423118, 371442, 385302, 396275, 400918, 402396, 390947, 378900, 345317, 341182, 350063, 372223, 389508]
10671C89508O326j0836k1018j1770L7198N786k8736P155R35K1801J3799L7266
10659D47414K0864j8811J460L2747O0443K1239j0053m182J09781L7539k3433l1817
10647F43191j5256J3857j0508j7833J8809k2022K6573J3378K1473N3256N8728
10636G83646M3115J00840J17586R3706J28315J39892R0936J19321J44210J18872
10626A880439J54090J76685K60153M16002N72382P76978J027152J406323J835910
10617H506114K100096K132019K042470J865243J474097O35069j50080m70600j10311
10608A8024117P16631J759908K965349L890032M094005L741218L210674K148742
10600D0550676p4890k222718k811458j839250j77269J772570L602664M825443
$$ y = [389508, 395834, 384998, 363980, 352210, 389408, 395194, 366458, 373613, 374548, 396349, 410148, 447414, 468278, 449467, 450927, 483674, 544117, 565356, 555303, 551121, 660902, 698441, 675008, 643191, 627935, 641792, 631284, 613451, 632260, 610238, 636811, 650189, 671662, 724918, 783646, 826761, 927601, 1045187, 1138893, 1267208, 1407100, 1498036, 1617357, 1761567, 1880439, 2034529, 2211214, 2471367, 2887369, 3459751, 4236729, 5263881, 6670204, 8506114, 10606210, 12738229, 14780699, 16645942, 18120039, 18755108, 18605028, 18134428, 18024117, 18740748, 20500656, 23466005, 27356037, 31450042, 35191260, 38401934, 40550676, 40475786, 38253068, 35441610, 33602360, 33425091, 35197661, 38800325, 43625768]
10592D3625768M941405M267439L222068J279670k137209n250261n840145m559368
10584C9549367k540091n89606J089877K102059K202325J742646R83606n09892
10576D4030291k821950m686246m796585l707646k354178j139926k51866K06998
10568B4478892K88068P6551l08184j043699j941162k515951k562675k177645j750629
10559A2543566j311298r38645p24622n57727m72813l85604l68385l24313l08937
10550G151222k50801k27712k53343k10044j82064k42041j94438j32860j33960
10541E323959j25100j12529j72365j33451j46026j00554j13172r2570j00798j00976
10531D126418j05434j03413j10208j20701j15766j01453q7914o7089q6852o9285
$$ y = [43625768, 48567173, 52834612, 56056680, 57336350, 55199141, 49948880, 44108735, 39549367, 37009276, 36419670, 37509547, 39611606, 41813931, 43556577, 44540183, 44030291, 41208341, 36522095, 31725510, 28017864, 25663686, 24523760, 24271894, 24478892, 24766960, 24843511, 24535327, 23491628, 21550466, 19034515, 16471840, 14294195, 12543566, 11232268, 10293623, 9569001, 9011274, 8538461, 8152857, 7784472, 7460159, 7151222, 6900421, 6672709, 6419366, 6209322, 6027258, 5785217, 5590779, 5457919, 5323959, 5198859, 5086330, 4913965, 4780514, 4634488, 4533934, 4420762, 4328192, 4227394, 4126418, 4020984, 3917571, 3807363, 3686662, 3570896, 3469443, 3381529, 3314440, 3227588, 3158303]
10521C158303o8912o3455o6643n0689p5046q0469r0035j10953m2420p819n3296
10510B448566o3241n2041m0747n5574p5138m2806q779j8985n3320o7246p687k0562
10498A942440n5235k9124k1519J157l5249q3393j3944N957j7108q0389n3832L4419
$$ y = [3158303, 3089391, 3025936, 2959293, 2908604, 2833558, 2753089, 2663054, 2552101, 2509681, 2501862, 2448566, 2385325, 2333284, 2292537, 2236963, 2161825, 2119019, 2110240, 2091255, 2037935, 1970689, 1963002, 1942440, 1887205, 1858081, 1836562, 1837719, 1802470, 1719077, 1705133, 1711090, 1693982, 1613593, 1559761, 1594180]
$$ [...]
##END NTUPLES=NMR SPECTRUM
##END=
