##TITLE=Analysis number 318453
Compound Code cc 00080
Project Code adrs
Chemist Name prosynth
##JCAMPDX= 6.0         $$ Bruker NMR JCAMP-DX V2.0
##DATA TYPE= NMR SPECTRUM
##DATA CLASS= NTUPLES
##ORIGIN= Bruker BioSpin GmbH
##OWNER= nmr
$$ XWIN-NMR		Version 3.5
$$ Wed Mar 29 12:04:37 2006 GMT Daylight Time (UT+1h)  MAYBRIDGE\nmr@NMR_250MHZ
##.OBSERVE FREQUENCY= 250.131544655141
##.OBSERVE NUCLEUS= ^1H
##.ACQUISITION MODE= SIMULTANEOUS (DQD)
##.ACQUISITION SCHEME= undefined
##.AVERAGES= 16
##.DIGITISER RES= 18
##SPECTROMETER/DATA SYSTEM= dpx250
##.PULSE SEQUENCE= zg30
##.SOLVENT NAME= DMSO
##.SHIFT REFERENCE= (INTERNAL, DMSO, 0, 16.522)
##AUDIT TRAIL= $$ (NUMBER, WHEN, WHO, WHERE, WHAT)
$$ ##TITLE= Audit trail, XWIN-NMR		Version 3.5
$$ ##JCAMPDX= 5.01
$$ ##ORIGIN= Bruker BioSpin GmbH
$$ ##OWNER= nmr
$$ C:\u/data/dgb/nmr/ADRS/1640/pdata/1/auditp.txt
$$ ##AUDIT TRAIL=  $$ (NUMBER, WHEN, WHO, WHERE, WHAT)
(   1,<2006-03-29 12:04:15.41 +100>,<MAYBRIDGE\nmr>,<NMR_250MHZ>,
      <created by zg, POWCHK disabled, PULCHK disabled
       configuration hash MD5:
       84 BC 41 DB A1 6E 1D 46 DA 25 12 A5 C1 ED C5 3A
       data hash MD5: 64K
       18 00 3E 83 E2 B5 F9 37 B2 38 0C 34 F0 C5 9A AA>)
(   2,<2006-03-29 12:04:28.45 +100>,<MAYBRIDGE\nmr>,<NMR_250MHZ>,
      <Start of raw data processing
       ef LB = 0.3 FT_mod = 6 PKNL = 1 SI = 32K 
       data hash MD5: 32K
       0F 6E 46 90 97 6D AB CC EC 7C 2D 9D 30 ED 26 43>)
(   3,<2006-03-29 12:04:30.05 +100>,<MAYBRIDGE\nmr>,<NMR_250MHZ>,
      <apk 
       data hash MD5: 32K
       98 B4 5A 7A A4 12 1D 65 CA CC 6D 7A BC 30 DA 6E>)
(   4,<2006-03-29 12:04:30.80 +100>,<MAYBRIDGE\nmr>,<NMR_250MHZ>,
      <abs ABSG = 5 
       data hash MD5: 32K
       BF 68 3B FC 87 41 1A 43 EB 87 BD 48 AD E9 E4 09>)
$$ ##END=
$$ 
$$ hash MD5
$$ 3F D0 AA 04 4F 67 74 C6 61 72 B3 57 34 A1 4F F5
##$RELAX= 
##$RELAX= 
##$RELAX= 
##$RELAX= 
##$RELAX= 
##$RELAX= 
##$RELAX= 
$$ Bruker specific parameters
$$ --------------------------
##$DU= <C:\u>
##$EXPNO= 1640
##$NAME= <ADRS>
##$PROCNO= 1
##$TYPE= <nmr>
##$USER= <dgb>
##$AMP= (0..31)
100 100 100 100 100 100 100 100 100 100 100 100 100 100 100 100 100 100 
100 100 100 100 100 100 100 100 100 100 100 100 100 100 
##$AQSEQ= 0
##$AQ_mod= 3
##$AUNM= <au_zg>
##$AUTOPOS= <18 >
##$BF1= 250.13
##$BF2= 250.13
##$BF3= 250.13
##$BF4= 250.13
##$BF5= 500.13
##$BF6= 500.13
##$BF7= 500.13
##$BF8= 500.13
##$BYTORDA= 1
##$CFDGTYP= 0
##$CFRGTYP= 5
##$CHEMSTR= <none>
##$CNST= (0..31)
1 1 145 1 1 1 1 1 1 1 1 1 1 1 1 1 1 1 1 1 1 1 1 1 1 1 1 1 1 1 1 1 
##$CPDPRG= <>
##$CPDPRG1= <>
##$CPDPRG2= <>
##$CPDPRG3= <>
##$CPDPRG4= <mlev>
##$CPDPRG5= <mlev>
##$CPDPRG6= <mlev>
##$CPDPRG7= <mlev>
##$CPDPRG8= <mlev>
##$CPDPRGB= <>
##$CPDPRGT= <>
##$D= (0..31)
0 1 0 0 0 0 0 0 0 0.06 0 0 0 0 0 0 0.0002 0 0 0 0 0 0 0 0 0 0 0 0 0 0 
0 
##$DATE= 1143630254
##$DBL= (0..7)
120 120 120 120 120 120 120 120 
##$DBP= (0..7)
150 150 150 150 150 150 150 150 
##$DBP07= 0
##$DBPNAM0= <>
##$DBPNAM1= <>
##$DBPNAM2= <>
$$ [...]
##$SUBNAM7= <"">
##$SUBNAM8= <"">
##$SUBNAM9= <"">
##$SW= 20.6930455092707
##$SWIBOX= (0..15)
0 0 3 0 0 0 0 0 0 0 0 0 0 0 0 0 
##$SW_h= 5175.983436853
##$TD= 65536
##$TD0= 1
##$TE= 294.16
##$TE2= 300
##$TE3= 300
##$TEG= 300
##$TL= (0..7)
0 120 120 120 120 120 120 120 
##$TP= (0..7)
150 150 150 150 150 150 150 150 
##$TP07= 0
##$TPNAME0= <>
##$TPNAME1= <>
##$TPNAME2= <>
##$TPNAME3= <>
##$TPNAME4= <>
##$TPNAME5= <>
##$TPNAME6= <>
##$TPNAME7= <>
##$TPOAL= (0..7)
0.5 0.5 0.5 0.5 0.5 0.5 0.5 0.5 
##$TPOFFS= (0..7)
0 0 0 0 0 0 0 0 
##$TUNHIN= 0
##$TUNHOUT= 0
##$TUNXOUT= 0
##$USERA1= <user>
##$USERA2= <user>
##$USERA3= <user>
##$USERA4= <user>
##$USERA5= <user>
##$V9= 5
##$VALIST= <valist>
##$VCLIST= <CCCCCCCCCCCCCCC>
##$VD= 0
##$VDLIST= <DDDDDDDDDDDDDDD>
##$VPLIST= <PPPPPPPPPPPPPPP>
##$VTLIST= <TTTTTTTTTTTTTTT>
##$WBST= 1024
##$WBSW= 4
##$XGAIN= (0..3)
0 0 0 0 
##$XL= 0
##$YL= 0
##$YMAX_a= 342847
##$YMIN_a= -499716
##$ZGOPTNS= <>
##$ZL1= 120
##$ZL2= 120
##$ZL3= 120
##$ZL4= 120
##$ABSF1= 16.522
##$ABSF2= -4.171173
##$ABSG= 5
##$ABSL= 3
##$ALPHA= 0
##$AQORDER= 0
##$ASSFAC= 0
##$ASSFACI= 0
##$ASSFACX= 0
##$ASSWID= 0
##$AUNMP= <proc_1d>
##$AZFE= 0.1
##$AZFW= 0.1
##$BCFW= 0
##$BC_mod= 0
##$BYTORDP= 0
##$COROFFS= 0
##$CY= 12.5
##$DATMOD= 1
##$DC= 0
##$DFILT= <>
##$DTYPP= 0
##$F1P= 14.0000005364418
##$F2P= -0.99999901652339
##$FCOR= 0.5
##$FTSIZE= 32768
##$FT_mod= 6
##$GAMMA= 0
##$GB= 0
##$INTBC= 1
##$INTSCL= 1
##$ISEN= 128
##$LB= 0.3
##$LEV0= 0
##$LPBIN= 0
##$MAXI= 10000
##$MC2= 0
##$MEAN= 0
##$ME_mod= 0
##$MI= 0
##$NCOEF= 0
##$NC_proc= -3
##$NLEV= 6
##$NOISF1= 0
##$NOISF2= 0
##$NSP= 0
##$NTH_PI= 0
##$NZP= 0
##$OFFSET= 16.522
##$PC= 1
##$PHC0= 166.0687
##$PHC1= 6.096797
##$PH_mod= 1
##$PKNL= yes
##$PPARMOD= 0
##$PSCAL= 4
##$PSIGN= 0
##$REVERSE= no
##$SF= 250.13
##$SI= 32768
##$SIGF1= 0
##$SIGF2= 0
##$SINO= 400
##$SIOLD= 32768
##$SREGLST= <1H.DMSO>
##$SSB= 0
##$STSI= 32768
##$STSR= 0
##$SW_p= 5175.98343685301
##$SYMM= 0
##$S_DEV= 0
##$TDeff= 65536
##$TDoff= 0
##$TI= <Analysis number 999999
Compound Code 99
Book Reference 9
Project Code 9>
##$TILT= no
##$TM1= 0
##$TM2= 0
##$TOPLEV= 0
##$USERP1= <user>
##$USERP2= <user>
##$USERP3= <user>
##$USERP4= <user>
##$USERP5= <user>
##$WDW= 1
##$XDIM= 32768
##$YMAX_p= 339051527
##$YMIN_p= -243039
$$ End of Bruker specific parameters
$$ ---------------------------------
##NTUPLES= NMR SPECTRUM
##VAR_NAME=  FREQUENCY,     SPECTRUM/REAL,   SPECTRUM/IMAG
##SYMBOL=    X,             R,               I
##VAR_TYPE=  INDEPENDENT,   DEPENDENT,       DEPENDENT
##VAR_FORM=  AFFN,          ASDF,            ASDF
##VAR_DIM=   32768,         32768,           32768
##UNITS=     HZ,            ARBITRARY UNITS, ARBITRARY UNITS
##FACTOR=    0.157963299565203, 1,           1
##FIRST=     4132.6476996994, 0,             0
##LAST=      -1043.33573715361, 0,           0
##MIN=       -1043.33573715361, -243039,     0
##MAX=       4132.6476996994, 339051527,     0
$$ Real data points
##PAGE= N=1
##DATA TABLE= (X++(R..R)), XYDATA
$$ [...]
16264e523J6550n793j3325m4861r09K9989n1786o1973N803M8034K0667j9291K1041
$$ -5523 11027 5234 -8091 -52952 -53861 -23872 -75658 -137631 -131828 -83794 -63127 -82418 -61377
16251f1377O40n7960J2529P3063j343J6371m7582J5559K485P80N0890O0149m820
$$ -61377 -60737 -118697 -106168 -33105 -34448 -18077 -65659 -50100 -47615 -46835 4055 64204 59384
16238E9384l5285n4949J7565l0357r231J8410n4152J2397N0616L6603o4817n6769
$$ 59384 24099 -30850 -13285 -43642 -52873 -34463 -88615 -76218 -25602 11001 -53816 -110585
16226a10585M8128O3424K5315L0428K176l6765l5675o380J5117j774R431m819
$$ -110585 -62457 967 26282 56710 58886 22121 -13554 -19934 -4817 -6591 2840 -1979
16214a979M36k225r849N5448j850K1887p179J1521n6144o6794n7534O7385K1724
$$ -1979 -1543 -3768 -13617 41831 39981 61868 54689 66210 10066 -56728 -114262 -46877 -25153
16201b5153K4819m859k3719j3220L5200K3258M2798p89j3524j2728n1145o1604
$$ -25153 -334 -5193 -28912 -42132 -6932 16326 59124 58335 44811 32083 -19062 -80666
16189h0666M1297k6941L501N9492J3493k2268l307j5061k2549k368J4646P178
$$ -80666 -39369 -66310 -62809 -3317 10176 -12092 -15399 -30460 -53009 -55377 -40731 -33553
16177c3553k1480O5764L2219n370l025n2292M9930R1587n6130o3402k0256O3600
$$ -33553 -55033 10731 42950 37580 34555 -17737 32193 123780 67650 4248 -16008 47592
16165D7592L5833j7104j9704k6358m6255m7845M4524L3289m82Q363K6522l0900
$$ 47592 83425 66321 46617 20259 -25996 -73841 -29317 3972 3490 11853 38375 7475
16153G475J2222j4829O5138J5576q273n4521j5097K1907K2852m865p4413j9558
$$ 7475 19697 4868 70006 85582 77309 22788 7691 29598 52450 47585 -26828 -46386
16141d6386l2341l4043J5994O3215L5055K675j3723J5818L0958j9781J5405l788
$$ -46386 -78727 -112770 -96776 -33561 1494 4169 -9554 6264 37222 17441 32846 29058
16129B9058J8831k639j1811L5613j3473l9250o2212K9115N4087K8635l679m4873
$$ 29058 47889 45250 33439 69052 55579 16329 -45883 -16768 37319 65954 62275 17402
16117A7402L9018j6796n9407K8277j5956Q151l9172k5867L1748k8784k4998M3619
$$ 17402 56420 39624 -19783 8494 -7462 689 -38483 -64350 -32602 -61386 -86384 -42765
16105d2765J3692l6647M121L8935K5213m1565J7261N8136k6744L2931K8484r914
$$ -42765 -29073 -65720 -61599 -22664 2549 -39016 -21755 36381 9637 42568 71052 61138
16093F1138j8661n9527l3178k6704K8596M2100J0937m7405J8032M8014l3373m702
$$ 61138 42477 -17050 -50228 -76932 -48336 -6236 4701 -42704 -24672 23342 -10031 -14733
16081a4733J7607M342o5810J262l2665J6313P7692K8795l5317N0813O957l3617
$$ -14733 2874 7216 -58594 -57332 -89997 -73684 4008 32803 -2514 48299 55256 21639
16069B1639m7846L2152l4634l8487L0787l2937j1541M5875L240K6633o784j6118
$$ 21639 -26207 5945 -28689 -67176 -36389 -69326 -80867 -34992 -31752 -5119 -11903 -28021
16057b8021j2420r0076N1218N9474j250K7319K745K7304j665N221J0388j3968
$$ -28021 -40441 -130517 -79299 -19825 -21075 6244 8989 36293 34628 39849 50237 36269
16045C6269m8128K8962J4679J2950J5225K253m6421m5463n68l8582J5919j9977
$$ 36269 -11859 17103 31782 44732 59957 62210 15789 -29674 -30242 -68824 -52905 -72882
16033g2882j2931J4797o372M0882J5442J599O44j5418J4394K551M1272k2460l6337
$$ -72882 -85813 -71016 -77388 -36506 -21064 -19465 -18821 -34239 -19845 -17294 23978 1518 -34819
16020c4819m6943k7239K8811P0451j4102m9646j0207J9276M4309j6149l9528l0093
$$ -34819 -81762 -109001 -80190 -9739 -23841 -73487 -83694 -64418 -20109 -36258 -75786 -105879
16008a05879J1050M5862o2806k5754K2254L2799j3170P1602P1647o780l143j1899
$$ -105879 -94829 -48967 -111773 -137527 -115273 -82474 -95644 -24042 47605 40825 37682 25783
15996B5783L4843J0019m0282j8556J0247l1749M857M1175P680M0959M1056l5895
$$ 25783 60626 70645 30363 11807 22054 -9695 -4838 36337 44017 84976 126032 90137
15984I0137O5493j7524n2091k1068p4987l1626N6431Q3904o009O112l3142K5267
$$ 90137 155630 138106 86015 64947 -10040 -41666 14765 98669 92660 98772 65630 90897
15972I0897p804o4837L635K3968j7346l1154m5839J3944K8619K4282L6162k072
$$ 90897 83093 18256 21891 45859 28513 -2641 -48480 -34536 -5917 18365 54527 52455
15960E2455l9445k3942L3715j3432m98K9258k3451p57p5k6721N339P6213k0771
$$ 52455 13010 -10932 22783 9351 8853 38111 14660 13903 13828 -12893 -7554 68659 47888
15947D7888k0011p9808m6508K1717P0628O5812J1595P147M0424j8797j7982m3650
$$ 47888 27877 -51931 -98439 -76722 -6094 59718 71313 78460 118884 100087 82105 38455
15935C8455m3122J0926l932M8352K9611j5936J9290K701m5128l5361K885r778
$$ 38455 -4667 6259 2327 50679 80290 64354 83644 86345 41217 5856 8741 -1037
15923a037j4978k365O8149j0980l7955K2170j7422j7350l99J6000k3602K2638
$$ -1037 -16015 -18380 49769 38789 834 23004 5582 -11768 -12167 3833 -19769 2869
15911B869k2720m8518m190M851m7889k6930P0691M6520L7968M7460O304K444L9298
$$ 2869 -19851 -68369 -72559 -67708 -115597 -142527 -71836 -25316 12652 60112 66416 68860 108158
15898A08158n078l9440k3916l7160m9945n0883j0540J3463L3817P0433N835k3920
$$ 108158 103080 63640 39724 2564 -47381 -98264 -108804 -95341 -61524 8909 14744 -9176
15886i176n478k3326J1369J3184L962n956M9414n1475m8448J9590M7321J1240
$$ -9176 -14654 -37980 -26611 -13427 -9465 -15421 33993 -17482 -65930 -46340 981 12221
15874A2221m7675l7004K5261L92M553N322K6124m581J1266N5985M4358L0474l8955
$$ 12221 -35454 -72458 -47197 -46805 -42252 -36930 -10806 -15387 -4121 51864 96222 126696 87741
15861H7741k397J745J4383j00876m1660R0237M2969q363m4042K419N7875J0949
$$ 87741 85344 87089 101472 596 -41064 49173 92142 83779 39737 42156 100031 110980
15849A10980n1761m1526l4233j6652L0955j1019l3921o7638N591N5725j7516m1775
$$ 110980 59219 17693 -16540 -33192 -2237 -13256 -47177 -114815 -109224 -53499 -71015 -112790
15837a12790m297J2781J2902O111O0028L3882K3027p0577q8836J3751J9792P5371
$$ -112790 -117087 -104306 -91404 -85293 -25265 8617 31644 -38933 -127769 -114018 -94226 -18855
15825a8855O2843r93J8338K1731l0778p9927n1673J0615l2239K5087N8203K2822
$$ -18855 43988 42995 61333 83064 52286 -27641 -79314 -68699 -100938 -75851 -17648 5174
15813E174N9123k7953l4897j5349K340J9904j6835n9935k8554K2897Q2177N7013
$$ 5174 64297 36344 1447 -13902 -11562 8342 -8493 -68428 -96982 -74085 8092 65105
15801F5105N982m8674O122l12J1465m3842l7329K3749M3396q300k3241o8054l286
$$ 65105 71087 22413 28535 28223 39688 -4154 -41483 -17734 25662 17362 -5879 -73933 -77219
15788g7219J6152J4863J3211L1660k5721k5147J4258j8257m465J2070O9953N5007
$$ -77219 -61067 -46204 -32993 -1333 -27054 -52201 -37943 -56200 -60665 -48595 21358 76365
15776G6365r201p9682K6867L3884m4510l1359K0588k736n4002J9205O1928K8891
$$ 76365 67164 -12518 14349 48233 3723 -27636 -7048 -9784 -63786 -44581 17347 46238
15764D6238n1276o5721k9499N8132L7370m9889K0393j284R542m5905q567j1770
$$ 46238 -5038 -70759 -100258 -42126 -4756 -54645 -34252 -35536 -25994 -71899 -80466 -92236
15752i2236R220N1876q306Q058M5918O2876M0554Q4279P5519K5135l79n70n6773
$$ -92236 -83016 -31140 -39446 -31388 14530 77406 117960 202239 277758 302893 302514 301944 245171
15739B45171q3394k5565m7762j353k6930p358J2001J1060J1270K9509j6774j05868
$$ 245171 161777 136212 88450 87097 60167 52809 64810 75870 87140 116649 99875 -5993
15727e993n5682K59K7277Q1238l1869l5651r2045m5651N2438P930P5940M3599
$$ -5993 -61675 -61416 -34139 47099 15230 -20421 -112466 -158117 -105679 -97749 -21809 21790
15715B1790j8476l0505m7838M2269K7980M7325L9998m2593J8007j9675l2334M91
$$ 21790 3314 -27191 -75029 -32760 -4780 42545 82543 39950 57957 38282 5948 6439
15703F439J0964L4009J3617N371q324k2568k1222j3441k704m1039K2567R794j2256
$$ 6439 17403 51412 65029 70400 62076 39508 18286 4845 2141 -38898 -16331 -6537 -18793
15690a8793k0027L6910J1596m7961J6123M1784l4480K3808q815j7791q118j4217
$$ -18793 -38820 -1910 9686 -38275 -22152 19632 -14848 8960 145 -17646 -25764 -39981
15678c9981q316j0814m0945m126N4138M7106J0402J6978P3378k2571p7016p4831
$$ -39981 -48297 -59111 -100056 -104182 -50044 -2938 7464 24442 97820 75249 -1767 -76598
15666g6598k2425L4599Q1949K8515m2812k190j1025k8285j5071j2696J4567J5704
$$ -76598 -99023 -64424 17525 46040 3228 1038 -9987 -38272 -53343 -66039 -51472 -35768
15654c5768j398L8697M3161m3932M9066K7694l2813p8668J832L2298l9661k4469
$$ -35768 -37166 1531 44692 760 49826 77520 44707 -33961 -32129 169 -39492 -63961
15642f3961l3925P183M8509M0414R15j8357J2539j7710L6245j030l4772m2676
$$ -63961 -97886 -90703 -42194 -1780 -865 -19222 -6683 -24393 11852 10822 -23950 -66626
15630f6626m509K8211L1241k6025J2400l9518k4151p536N918J7819L4657K1587
$$ -66626 -71135 -42924 -11683 -37708 -25308 -64826 -88977 -96513 -90595 -72776 -38119 -16532
15618a6532m9852m038N904j9052k2255L7046M6640L2258L5421j0649n5630j2014
$$ -16532 -66384 -70422 -64518 -83570 -105825 -68779 -22139 10119 45540 34891 -20739 -32753
15606c2753p686j4669N7510R1427Q065J5224j3678p7863o0886j8992L4691N0912
$$ -32753 -40439 -55108 2402 93829 101894 117118 103440 25577 -35309 -54301 -19610 31302
15594C1302J4918j8815l1105j0006L8230K9055k2873k890m5385J2599K9551n0834
$$ 31302 46220 27405 -3700 -13706 24524 53579 30706 27816 -17569 -4970 24581 -26253
15582b6253n0017K521K8181N6251m654j9085l7894Q443P2039J8288N358o6756
$$ -26253 -76270 -73749 -45568 10683 6029 -13056 -50950 -42507 29532 47820 53178 -13578
15570a3578K8979K2867k2769k506J5555j3729l9686J8834O4192l4845p5546j1377
$$ -13578 15401 38268 15499 12993 28548 14819 -24867 -6033 58159 23314 -52232 -63609
15558f3609J5905o2752l5515J7051P0180P9391m4258o6455L6477J0185k4113k2685
$$ -63609 -47704 -110456 -145971 -128920 -58740 20651 -23607 -90062 -53585 -43400 -67513 -90198
15546i0198r21j176K2544m2749O0161J04418L4010K2311O401m7691r290K4421
$$ -90198 -91119 -92295 -69751 -112500 -52339 52079 86089 108400 114801 67110 57820 82241
15534H2241K07r523k0603l2569k0704K7541L8749k4547o2770l7228J6203k8151
$$ 82241 82448 72925 52322 19753 -951 26590 65339 40792 -21978 -59206 -43003 -71154
15522g1154m0740m755K9848O0804N1925r910K1808k0434o6486J1409P5560N0156
$$ -71154 -111894 -116649 -86801 -25997 25928 16018 37826 17392 -49094 -37685 37875 88031
15510H8031n7902p908m1417m5042P2767j6433m9330O582K398L4273k4768K925
$$ 88031 30129 22221 -19196 -64238 8529 -7904 -57234 -50652 -48254 -13981 -38749 -35824
15498c5824L1127j3572K8114J5090J0107q616L583l6o5286j7910J6875k7553M6513
$$ -35824 -4697 -18269 9845 24935 35042 26426 30009 29973 -35313 -53223 -36348 -63901 -17388
15485a7388L6880k6694K2679j7069m0552k1202L6874k0627j7492P7386l9865M086
$$ -17388 19492 -7202 15477 -1592 -42144 -63346 -26472 -47099 -64591 12795 -27070 -22984
15473b2984k4463j1971o920j9766J9532Q25l9776L4395K0227p086N844L0441K0968
$$ -22984 -47447 -59418 -66338 -86104 -66572 -65747 -105523 -71128 -50901 -57987 -52143 -21702 -734
15460g34k4104j5255j7070Q944J6224j2425j4790M0031O1260L930R935R810k7597
$$ -734 -24838 -40093 -57163 -48219 -31995 -44420 -59210 -19179 42081 46011 55946 65756 38159
15447C8159o8287n267L7186m0038p194O0001K0688j5875l3303r757k2148l345
$$ 38159 -30128 -35395 1791 -38247 -45441 14560 35248 19373 -13930 -23687 -45835 -49180
15435d9180J2923L0653m243l8507J3687J6960k357N7901l1900n4162P331P1832
$$ -49180 -36257 -5604 -9847 -48354 -34667 -17707 -20064 37837 5937 -48225 -40894 30938
15423C0938J1993m178J0773j4199J4390q535k6639o2548r864J3197M3081O898
$$ 30938 42931 38753 49526 35327 49717 41182 14543 -48005 -57869 -44672 -1591 5307
15411E307j8444n3779n34l3902N3666J2420N119o3852r248J7896M4454O1084N755
$$ 5307 -13137 -66916 -67450 -101352 -47686 -35266 -30147 -93999 -103247 -85351 -40897 20187 25942
15398B5942L8580m0647j871n5444p5918L3145P933l3816m663j6205j6881Q2163
$$ 25942 64522 23875 22004 -33440 -109358 -76213 -68280 -102096 -106759 -122964 -139845 -57682
15386e7682M7630K6809j8713J9472n0558L829J3333r966j0597K8098j5572j5105
$$ -57682 -10052 16757 -1956 17516 -33042 -29213 -15880 -25846 -36443 -8345 -23917 -39022
15374c9022m7955L7799N8870k3572J7679l1813k8653N617k1967J4777L5279M5055
$$ -39022 -86977 -49178 9692 -13880 3799 -28014 -56667 -51050 -73017 -58240 -22961 22094
15362B2094j1360k6936M36N52M8273k7160L3967n4740k8575K2166P431K2881K4972
$$ 22094 10734 -16202 -15766 -15214 33059 5899 39866 -14874 -43449 -21283 -13852 9029 34001
15349C4001N194k0912O3733K4774j8398q862K3164K2538J0325P176k8793k0739
$$ 34001 39195 18283 82016 106790 88392 79530 102694 125232 135557 142733 113940 93201
15337I3201k6938r100o3806m1977N7045N730l4138J3529l0078n92K4029J4506
$$ 93201 66263 57163 -6643 -48620 8425 14155 -19983 -6454 -36532 -37124 -13095 1411
15325A411Q402O167j8672j687o48l8521k3520L056K5426K6404J9943L9833m4526
$$ 1411 9813 15980 -2692 -4379 -5027 -43548 -67068 -64012 -38586 -12182 7761 47594 3068
15312C068j12047l4359k378K9843K6221m55l1119J8369M6326N0234J1040j391
$$ 3068 -108979 -143338 -145716 -115873 -89652 -90107 -121226 -102857 -56531 -6297 4743 3352
15300C352k2640p2279j1534R6384K2878K2252p1552k458L4712J3516K8403p6652
$$ 3352 -19288 -91567 -103101 -6717 16161 38413 -33139 -35597 -885 12631 41034 -35618
15288c5618l263P6077K2524j11252o4695j4128k9068O7692M1913j0233m981L5195
$$ -35618 -38881 37196 59720 -51532 -116227 -130355 -159423 -91731 -49818 -60051 -65032 -29837
15276b9837O0976k0157n9970K9419J0023k1836k726J2592M4726M4762J174n3791
$$ -29837 31139 10982 -48988 -19569 -9546 -31382 -34108 -21516 23210 67972 69146 15355
15264A5355j6170k273J7496M000O9172O903l3518l5288n6941k1071k6566K0018
$$ 15355 -815 -3088 14408 18408 87580 94483 60965 25677 -31264 -52335 -78901 -58883
15252e8883O6201K1496o4950n2376k901K8123j705O7058O761j3307j5853J0095
$$ -58883 7318 28814 -36136 -88512 -91413 -63290 -64995 2063 8824 -4483 -20336 -10241
15240a0241L5244P151n8040J9558k4045l0983m0749N2382K9404J196J3350J8740
$$ -10241 25003 32154 -25886 -6328 -30373 -61356 -102105 -49723 -20319 -19123 -5773 12967
15228A2967M050j7872M4136J9532m7981K3273j0665m3017p1659p069J6492K365
$$ 12967 17017 -855 43281 62813 14832 38105 27440 -15577 -87236 -94305 -77813 -75448
15216g5448J6553M5947L130K4569j6838k3876l5637J1168n66O8514N6306J9833
$$ -75448 -58895 -12948 -9818 14751 -2087 -25963 -61600 -50432 -50998 17516 73822 93655
15204I3655j4643n7203o0418L2601M1557P104j0780n0073q5800K4164L4905m4213
$$ 93655 79012 21809 -38609 -6008 35549 42653 31873 -18200 -104000 -79836 -44931 -89144
15192h9144k4640P66J5528M7640N0699J7130m0283m1218M455L6033O9030K4117
$$ -89144 -113784 -113018 -97490 -49850 849 17979 -22304 -63522 -59067 -23034 45996 70113
15180G0113k4833R738J9739l6589k0318n395m7692k7790r136K49l7486M9663J5204
$$ 70113 45280 55018 74757 38168 17850 12455 -35237 -63027 -72163 -71914 -109400 -59737 -44533
15167d4533J5597L9556J0896j7166K6115j6205l8000j0417K76J1755j7172L2696
$$ -44533 -28936 10620 21516 4350 30465 14260 -23740 -34157 -33881 -22126 -39298 -6602
15155f602k0445k1046J877M1686K966P585n470K5750j1293l742K4767k1578k8634
$$ -6602 -27047 -48093 -46216 -4530 -1564 6021 551 26301 15008 11266 36033 14455 -14179
15142a4179J2069O2390k1175k8922P622m4586K1574O1156O6242j7053k6952k1644
$$ -14179 -2110 60280 39105 10183 17805 -26781 -5207 55949 122191 105138 78186 56542
15130E6542q153o9104K5965K6337j2013J8687j5373K453J1989j1029m1717k9137
$$ 56542 48389 -20715 5250 31587 19574 38261 22888 25341 37330 26301 -15416 -44553
15118d4553J5344M2642l5403k4971M9457L9342k4176n6551K1377M3872K0957P3011
$$ -44553 -29209 13433 -21970 -46941 2516 41858 17682 -38869 -17492 26380 47337 120348
15106A20348k7820j4859K6372l3317O729L4426r31J8755o553l561n1362k9968
$$ 120348 92528 77669 104041 70724 77453 111879 110948 129703 123150 119589 68227 38259
15094C8259L106J1355Q220j9478j7301J7159N783k6921l0262l670J0822j0800
$$ 38259 41365 52720 60940 41462 24161 41320 47103 20182 -10080 -13750 -2928 -13728
15082a3728K7998m8446R899j8331L062K2269K1685K1549l4137o3396k4510j5230
$$ -13728 14270 -34176 -24277 -42608 -39546 -17277 4408 25957 -8180 -71576 -96086 -111316
15070a11316J7725N36J5898R9710k9398k663J4478o627K6649k8113l0277o310
$$ -111316 -93591 -93055 -77157 22553 -6845 -9508 4970 -1657 24992 -3121 -33398 -39708
15058c9708N0408M6354J685q9386o974J6408O2778j4163n5075j8431K0847J73
$$ -39708 10700 57054 58739 -30647 -37621 -21213 41565 27402 -27673 -46104 -25257 -25084
15046b5084l6178K1574K4209Q942n7618M089j1769l3424P131k188L6602L8623
$$ -25084 -61262 -39688 -15479 -6537 -64155 -60066 -71835 -105259 -98128 -100316 -63714 -25091
15034b5091N202j1825K8638Q052l8354M3531l1976j6141o545J7922K0129r520
$$ -25091 -19889 -31714 -3076 4976 -33378 10153 -21823 -37964 -44509 -26587 -6458 -15978
15022a5978p61K5296N4915k8646j6745k6010K1591L2058k4346m1229m1599K7696
$$ -15978 -16739 8557 63472 34826 18081 -7929 13662 45720 21374 -19855 -61454 -33758
15010c3758k2400J0817l653N2919R326n320j5168K203j4450j6740L4825j6073
$$ -33758 -56158 -45341 -48994 3925 13251 7931 -7237 -5034 -19484 -36224 -1399 -17472
14998a7472M3723L0192J1735M417j238K260M717j1508j1241k1453K5510j4281
$$ -17472 26251 56443 68178 72595 71357 73617 78334 66826 55585 34132 59642 45361
14986D5361l7869J5009p183J3254o0496j8970R569J0886L6295K9995K004k822
$$ 45361 7492 22501 15318 28572 -31924 -50894 -41325 -30439 5856 35851 37855 35033
14974C5033n706m8367j02859J4239J97n09L7997J5723k4790K7172J8196l2720
$$ 35033 29327 -19040 -121899 -107660 -107463 -107972 -69975 -54252 -79042 -51870 -33674 -66394
14962f6394K861k3508k0306L2699K2686M5759K2152k3806j15255O4320J5945l4720
$$ -66394 -63533 -87041 -107347 -74648 -51962 -6203 15949 -7857 -123112 -58792 -42847 -77567
14950g7567O7499P5925J5285J2428j1121m6681k773M3691j8308q2979k1592J7214
$$ -77567 -10068 65857 81142 93570 82449 35768 32995 76686 58378 -24601 -46193 -28979
14938b8979L1995J635n0681l3190M3564m0091N4632J0498K542k3588M837j3809
$$ -28979 3016 4651 -46030 -79220 -35656 -75747 -21115 -10617 -8075 -31663 -26826 -40635
14926d0635J8021M2739J5933K431k4782j9533l3932J697N9225j3075l6029m5527
$$ -40635 -22614 20125 36058 38489 13707 -5826 -39758 -38061 21164 8089 -27940 -73467
14914g3467l1039K1411K7654j8461M7054N8459K4829j3488p2480k9193k3168K6343
$$ -73467 -104506 -83095 -55441 -73902 -26848 31611 56440 42952 -29528 -58721 -81889 -55546
14902e5546J8692j7346K5955M5233r349n5253M5543N0795m9250k0965k1404k4072
$$ -55546 -36854 -54200 -28245 16988 7639 -47614 -2071 48724 -526 -21491 -42895 -66967
14890f6967J0295j2501k6869O174K2575J3752K9813J0278j6031j366J270m1108
$$ -66967 -56672 -69173 -96042 -89868 -67293 -53541 -23728 -13450 -29481 -30847 -29577 -70685
14878g0685k361j3633L1239j0655M2845J6025k1042j9696K6349J0115j2929N55
$$ -70685 -73046 -86679 -55440 -66095 -23250 -7225 -28267 -47963 -21614 -11499 -24428 -23873
14866b3873j8557n4602j3719M5463Q2135O9734L271n0549l5365p2602l3292J731
$$ -23873 -42430 -97032 -110751 -65288 16847 86581 89852 39303 3938 -68664 -101956 -100225
14854a00225L0734N0070N8333N2815J666j1298j6651j1002k4194l306k4591j5717
$$ -100225 -69491 -19421 38912 91727 93393 82095 65444 54442 30248 26942 2351 -13366
14842a3366j3903K3642N2285K9444l1561k0714l2918k7986J0927J1410K0256j9242
$$ -13366 -27269 -3627 48658 78102 46541 25827 -7091 -35077 -24150 -12740 7516 -11726
14830a1726j12100k0997Q0375O5944j2546M5495j0451l1256j0681L4375M6060
$$ -11726 -123826 -144823 -64448 1496 -11050 34445 23994 -7262 -17943 16432 62492
14819F2492O849l675j8837p0642k8015M0868k8000O3536L2083j3584o8982l8853
$$ 62492 69341 65666 46829 -23813 -51828 -10960 -38960 24576 56659 43075 -25907 -64760
14807f4760M9116Q2300K5251o6551l8904k6239m570K2049j3772O7883J0393J4036
$$ -64760 -15644 66656 91907 25356 -13548 -39787 -44357 -22308 -36080 31803 42196 56232
14795E6232K0304p4571J5889j4233q775P6376K6427j3644q541J289p5668Q231
$$ 56232 76536 1965 17854 3621 -5154 71222 97649 84005 75464 76753 1085 9316
14783I316L1129n0460l896N337J0406J6175k6282k0767j5817k9994m5702L1993
$$ 9316 40445 -10015 -13911 -8574 1832 18007 -8275 -29042 -44859 -74853 -120555 -88562
14771h8562q452K2444O2819L5134k9318k7262J9111p735m2567K0541L5716l2900
$$ -88562 -97014 -74570 -11751 23383 -5935 -33197 -14086 -21821 -64388 -43847 -8131 -41031
14759d1031J9328j9692n1178j6769K5054l6398J6312N4832O7924L6814k6847m5685
$$ -41031 -21703 -41395 -92573 -109342 -84288 -120686 -104374 -49542 18382 55196 28349 -17336
14747a7336O5715K607q1645l3698j1678K3973L6536R396M7684L495m8747k388
$$ -17336 48379 50986 -30659 -64357 -76035 -52062 -15526 -6130 41554 45049 -3698 -6086
14735f086m1041K9753N3757J9423k4952J4901J2217n2576k2141Q723L7555j0170
$$ -6086 -47127 -17374 36383 55806 30854 45755 57972 5396 -16745 -8022 29533 19363
14723A9363m4108k5229L2128j126j7476M447J15872J8159M2123j4371q2577j4588
$$ 19363 -24745 -49974 -17846 -18972 -36448 -32001 83871 102030 144153 129782 47205 32617
14711C2617j673K8815k4595n8411K6222o30m5997k5058K3929J9321m4235N9654
$$ 32617 30944 59759 35164 -23247 2975 2345 -43652 -68710 -44781 -25460 -69695 -10041
14699a0041M2303J7321O993l2563k2471j0887J3407k739m5739j7213k3536p312
$$ -10041 32262 49583 56576 24013 1542 -9345 4062 1323 -44416 -61629 -85165 -92477
14687i2477O0922m890r274J9454j0124K8824M2942J389m3464j2637k0633J7520
$$ -92477 -31555 -36445 -45719 -26265 -36389 -7565 35377 36766 -6698 -19335 -39968 -22448
14675b2448K9170O4566n23l4466k4946N494j1087R032K6490l8366m4674M684m844
$$ -22448 6722 71288 70765 36299 11353 16847 5760 14792 41282 2916 -41758 -37074 -41918
14662d1918J9236j2776Q055n6153l9596R3929L8451j2562k8212n2667L0460M5689
$$ -41918 -22682 -35458 -27403 -83556 -123152 -29223 9228 -3334 -31546 -84213 -53753 -8064
14650h064N1490l5403Q045P0678J436k1078j03855n1493j015K1620L1179k8669
$$ -8064 43426 8023 16068 86746 88182 67104 -36751 -88244 -89259 -67639 -36460 -65129
14638f5129j3934N5131N2523L7514n6029o0507J7025J08306M1505l3157J5603
$$ -65129 -79063 -23932 28591 66105 10076 -50431 -33406 74900 116405 83248 98851
14627I8851l3793k9979m9861m9510K9505l690q653N3541J1202p4788k2665O230
$$ 98851 65058 35079 -14782 -64292 -34787 -38477 -47130 6411 17613 -57175 -79840 -73610
14615g3610l5610j1018P8769l8443K4318k1724L473m1090K6009L4575k0728j6653
$$ -73610 -109220 -120238 -41469 -79912 -55594 -77318 -73845 -114935 -88926 -54351 -75079 -91732
14603i1732l117L5618K2690M1963j2071m822l524M3522K5388L3870L5739n8381
$$ -91732 -94849 -59231 -36541 5422 -6649 -11471 -14995 28527 53915 87785 123524 65143
14591F5143j9445m5871k850J8433j9059m1684q216K5223L6780L2314p9571n814
$$ 65143 45698 -173 -3023 15410 -3649 -45333 -53549 -28326 8454 40768 -38803 -44617
14579d4617Q8599L5703O686J0880m8412m5802K0312l9311k7090L5562k4001k2280
$$ -44617 43982 79685 86371 97251 48839 3037 23349 -15962 -43052 -7490 -31491 -53771
14567e3771O3702n283L4674M0899K9122m9444j2706O457k9950Q423L9804M5241
$$ -53771 9931 4648 39322 80221 109343 59899 47193 53650 23700 32123 71927 117168
14555A17168r135r940o1173m1524l951M2597n1837l6944N9984R803j6177l9987
$$ 117168 108033 98093 36920 -4604 -8555 34042 -17795 -54739 5245 15048 -1129 -41116
14543d1116K5625M9417K7878n7571o934L432Q236m3326m2930J9211N4713M4262
$$ -41116 -15491 33926 61804 4233 -2701 731 8967 -34359 -77289 -58078 -3365 40897
14531D0897m7177l4810L5911K2793N2548n3045m7169j4926p234L9236J0832R348
$$ 40897 -6280 -41090 -5179 17614 70162 17117 -30052 -44978 -52212 -12976 -2144 7204
14519G204K0987l1864o6673L6981K2227j931L2874K7698l4695j8393j4253k3957
$$ 7204 28191 -3673 -70346 -33365 -11138 -13069 19805 47503 12808 -5585 -19838 -43795
14507d3795q83l0772K2257K7648L7367m1837k1440l3620k491N6605L5309K0303
$$ -43795 -44678 -75450 -53193 -25545 11822 -30015 -51455 -85075 -87566 -30961 4348 24651
14495B4651K410m8458j2835J6999M7144K116m9720j5319k2441k3671k5688j8477
$$ 24651 27061 -21397 -34232 -17233 29911 32027 -17693 -33012 -55453 -79124 -104812 -123289
14483a23289M4628k8700o257O0435K2303l250k9473K9000L2948L3540R545p6555
$$ -123289 -78661 -107361 -113618 -53183 -30880 -34130 -63603 -34603 -1655 31885 41430 -35125
14471c5125k5524J169q417l3450J8456J3358K4349J8764M1075L4524k876j1100
$$ -35125 -60649 -59480 -67897 -101347 -82891 -69533 -45184 -26420 14655 49179 46303 35203
14459C5203j6151J1509O1253k0795L5129m586j11101m0875n1447j6594L4498r736
$$ 35203 19052 30561 91814 71019 106148 101562 -9539 -50414 -101861 -118455 -83957 -93693
14447i3693p628L1465P104r776N7101k3159L000L3478k4688o356M2275m324l7348
$$ -93693 -101321 -69856 -62752 -72528 -15427 -38586 -35586 -2108 -26796 -33152 9123 4799 -32549
14434c2549M2948J4714J0951P1233l861j21024q1882j1510J3993N1791j3793m6465
$$ -32549 10399 25113 36064 107297 103436 -17588 -99470 -110980 -96987 -45196 -58989 -105454
14422a05454P28J532M7760J1408j312K1763j8302o2127k0310q373K6191n409J8131
$$ -105454 -104726 -103194 -55434 -44026 -45338 -23575 -41877 -104004 -124314 -132687 -106496 -111905 -93774
14409i3774M4651N220O5405J8183q321o1m841j4253p496j6330L2455J3428L2252
$$ -93774 -49123 -43903 21502 39685 31364 31303 26462 12209 4713 -11617 20838 34266 66518
14396F6518L994m6455n5949j3894k3687l373K0321j0870J1928K8111K6269P294
$$ 66518 70512 24057 -31892 -45786 -69473 -72846 -52525 -63395 -51467 -23356 2913 10207
14384A0207p0622r1572K314J3164J3633j9P3521K8012k1401p0925N645J0473O009
$$ 10207 -60415 -151987 -149673 -136509 -122876 -122895 -49374 -21362 -42763 -113688 -108043 -97570 -91561
14371i1561O3067K7918m4109m0758k4753N694L2084O1690J4553j4487l7754J2277
$$ -91561 -28494 -576 -44685 -85443 -110196 -104502 -72418 -10728 3825 -10662 -48416 -36139
14359c6139l1882p988j2625N4486K5353J2868j1865j402L0949O487j0257n4432
$$ -36139 -68021 -76009 -88634 -34148 -8795 4073 -7792 -9194 21755 28242 17985 -36447
14347c6447p248M8764n4020L456L7238j4163k9417j3320K7430M6968n1070m5978
$$ -36447 -43695 5069 -48951 -45495 -8257 -22420 -51837 -65157 -37727 9241 -41829 -87807
14335h7807L770K982R3416N1360j8925m712r942J9695m6233J6925J1045p7928
$$ -87807 -84037 -81055 12361 63721 44796 40084 30142 49837 3604 20529 31574 -46354
14323d6354m7863j9305M4687N6067L5478J6606m3631n3967r269M2796O8507n1301
$$ -46354 -94217 -113522 -68835 -12768 22710 39316 -4315 -58282 -67551 -24755 43752 -7549
14311g549p4731k2658M0990Q029J6285L7670r31k7511K764N702M8090j9288K117
$$ -7549 -82280 -104938 -63948 -55919 -39634 -1964 -2895 -30406 -27642 -21940 26150 6862 8979
14298H979N173m548O7551k0514k6277r286o607J1211k5212n7658Q329O0617N818
$$ 8979 14152 9604 77155 56641 30364 21078 14471 25682 470 -57188 -48859 11758 17576
14285A7576j5954l1542r9042M762O3237Q60K4083K5678J7232Q980K2113R469m1725
$$ 17576 1622 -29920 -128962 -124200 -60963 -60103 -36020 -10342 6890 15870 37983 47452 5727
14272E727n6019j4107L2453l5741J3927L8977m0910J4135n9081o160M2155j2272
$$ 5727 -50292 -64399 -31946 -67687 -53760 -14783 -55693 -41558 -100639 -106799 -64644 -76916
14260g6916j0894j8668r498R326N2590K5465R445K9411L2423j3970J725l0317
$$ -76916 -87810 -106478 -115976 -106650 -54060 -28595 -19150 10261 42684 28714 30439 122
14248A22m5579L5131j3224k7353K2986O3468j3691n6585j3063K6824j7179M6091
$$ 122 -45457 -10326 -23550 -50903 -27917 35551 21860 -34725 -47788 -20964 -38143 7948
14236G948m5709m5879R261L0707q900R034M4988K3031j8246l1657P680j0960K1310
$$ 7948 -37761 -83640 -74379 -43672 -52572 -43538 1450 24481 6235 -25422 -17742 -28702 -7392
14223g392K3885q642j7317j1556M1541R169J8357p393p3665r722k5769K7127N6501
$$ -7392 16493 7851 -9466 -21022 20519 29688 48045 40652 -33013 -42735 -68504 -41377 15124
14210A5124k8612q837M1980j0460o3483M588O5602M5635J95l7935j3339L967k2582
$$ 15124 -13488 -22325 19655 9195 -54288 -49700 15902 61537 61732 23797 10458 14425 -8157
14197h157q2816J3111L0872L9350K7227k7785K4917l7913j9952m4933M502N6157
$$ -8157 -90973 -77862 -46990 -7640 19587 -8198 16719 -21194 -41146 -86079 -81577 -25420
14185b5420O3158N810m322n89p1277o2368K9670K3444o536O14L3481k1837Q588
$$ -25420 37738 43548 39226 38637 -32640 -95008 -65338 -41894 -48430 -47816 -14335 -36172 -27584
14172b7584j7483J6943N0829j1819K2350P3286k0835n6447J3663J476N460p795
$$ -27584 -45067 -28124 22705 10886 33236 106522 85687 29240 42903 44379 49839 42044
14160D2044L8101M1467k9863r116l79k0223k4458j6239l0722j529M6968p174M5783
$$ 42044 80145 121612 91749 82633 82254 62031 37573 21334 -9388 -10917 36051 28877 74660
14147G4660k9356j01878k2829O5129N7331J4210J1028k3655k6908k4971o6030
$$ 74660 45304 -56574 -79403 -14274 43057 57267 68295 44640 17732 -7239 -73269
14136g3269m994K9402N493j9516J0713N6225M5047j839m7838N8885J7798l3369
$$ -73269 -78263 -48861 -43368 -62884 -52171 4054 49101 47262 -576 58309 76107 42738
14124D2738J3420o930K8484P461n0139Q143L842m0463J4080j8173j965k821o79
$$ 42738 56158 49228 77712 85173 35034 43177 47019 6556 20636 2463 498 -2323 -3002
14111c002m5980L3659L4649K1403j6738K6799j4350p8225K0310J8818p448j4703
$$ -3002 -48982 -15323 19326 40729 23991 50790 36440 -41785 -21475 -2657 -10105 -24808
14099b4808j3178J1667M4397L2286l0643j8969j253p234M1834j5329o2921j5650
$$ -24808 -37986 -26319 18078 50364 19721 752 -501 -7735 34099 18770 -44151 -59801
14087e9801k2784J0241j1632l1763N1160L5033N4860l2230k8445J2597J6511K2057
$$ -59801 -82585 -72344 -83976 -115739 -64579 -29546 25314 -6916 -35361 -22764 -6253 15804
14075A5804n4669l6528K3739J7713j2402P6035M4733n7938q4747J7723M8727J0864
$$ 15804 -38865 -75393 -51654 -33941 -46343 29692 74425 16487 -68260 -50537 -1810 9054
14063I054K6842J2890M7343r662j4831k5268k8333k6175K1771P0027M0882o5219
$$ 9054 35896 48786 96129 86467 71636 46368 18035 -8140 13631 83658 124540 59321
14051E9321k7858rk3927N2768M4637l142K0920m2974J3424J3303m3191m0985o5136
$$ 59321 31463 31454 7527 60295 104932 101790 122710 79736 93160 106463 63272 22287 -42849
14038d2849p7320k1904K9631M8541M758j3993J2186N13M2246n5186l830N3150
$$ -42849 -120169 -142073 -112442 -63901 -59143 -73136 -60950 -60437 -18191 -73377 -77207 -24057
14026b4057r307n554M8700L266N6660K1947r9832k293M6690n2654j350J7298k3225
$$ -24057 -33364 -38918 9782 13048 69708 91655 -8177 -10470 36220 -16434 -17784 -486 -23711
14013b3711l5649J0259J3985M6205M9873l283K508k7761k3332J9868j4865r021
$$ -23711 -59360 -49101 -35116 11089 60962 57679 60187 32426 9094 28962 14097 5076
14001E076j8450j9759M2332M0365j5507M803l5389J2374O1127j1707q4309k0688
$$ 5076 -13374 -33133 9199 49564 34057 38860 3471 15845 76972 65265 -19044 -39732
13989c9732q450k1832r928O0670N0299k1854o8840k4884m0338o304O9425N8105
$$ -39732 -48182 -70014 -79942 -19272 31027 9173 -59667 -84551 -124889 -131193 -61768 -3663
13977c663k1876K1949Q3956J0268q0953j948O6874j9384q8049o1206l0121j0825
$$ -3663 -25539 -3590 80366 90634 9681 7733 74607 55223 -32826 -94032 -124153 -134978
13965a34978j8256M3671O1308J0611n8418O2029N2462N553n438j5212J7332j3320
$$ -134978 -153234 -109563 -48255 -37644 -96062 -34033 18429 23982 18544 3332 20664 7344
13953G344n0695M6213L5141j157k9123k5002k4079N626M9664k6365k9378J5428
$$ 7344 -43351 2862 38003 36846 7723 -17279 -41358 -35732 13932 -12433 -41811 -26383
13941b6383k3219k4189J2595N2476j3218p359M0622K7383o6419l6003K4362K9787
$$ -26383 -49602 -73791 -61196 -8720 -21938 -29297 11325 38708 -27711 -63714 -39352 -9565
13929i565j7823k4749j9607k5009k053j351K4722K7934R722M189J1410R948m7124
$$ -9565 -27388 -52137 -71744 -96753 -98806 -100157 -75435 -47501 -37779 -33590 -22180 -12232 -59356
13916e9356n789R138j4688K5415k8505l6649Q4383R377n0195l8986O5685O4445
$$ -59356 -65145 -56007 -70695 -45280 -73785 -110434 -26051 -16674 -66869 -105855 -40170 24275
13904B4275N5906J1825o1095K5985M6466l259k1029M062m2768O286J5197j5025
$$ 24275 80181 92006 30911 56896 103362 100103 79074 83136 40368 46654 61851 46826
13892D6826J704R312K366L5974R866m576j9719l3714q9797l2402P632j6850J7373
$$ 46826 48530 57842 60208 96182 106048 101472 81753 48039 -41758 -74160 -66528 -83378 -66005
13879f6005L9663j479j9380O853N8892M6268l7620k4805l5912j02P221J9316N4469
$$ -66005 -26342 -27821 -47201 -40348 18544 64812 27192 2387 -33525 -33627 -26406 -7090 47379
13866D7379O2651k2420n4876L0827N2044o0440k0228J8419l1098q1036k4681M1159
$$ 47379 110030 87610 32734 63561 115605 55165 34937 53356 22258 -58778 -83459 -42300
13854d2300J9566J71K2593N1229r624j9079k0882j0133p407P160J1823l0173l6093
$$ -42300 -22734 -22563 30 51259 41635 22556 1674 -8459 -15866 -8706 3117 -27056 -63149
13841f3149M4222K8692J9574K3500n3323k1267p514J7778j0027L1503N444p7156
$$ -63149 -18927 9765 29339 52839 -484 -21751 -29265 -11487 -21514 9989 15433 -61723
13829f1723q1490L7330O5331J2846L1168j2392L6191J0358J960k0227l2101q165
$$ -61723 -143213 -105883 -40552 -27706 3462 -8930 27261 37619 39579 19352 -12749 -20914
13817b0914J8138j4223r8443n901M7961R9928R598q360l4071r506l5358L6405
$$ -20914 -2776 -16999 -115442 -121343 -73382 26546 36144 27784 -6287 -15793 -51151 -14746
13805a4746N2485j3756q4739n5198q191R924R1544M5764L4574j487Q489k523K791
$$ -14746 37739 23983 -60756 -115954 -124145 -114221 -22677 23087 57661 56174 64663 62140 64931
13792F4931m6000q342K8204K4334m8522m8986r493M032L7202l5500J1197l262
$$ 64931 18931 10589 38793 63127 14605 -34381 -43874 -39842 -2640 -38140 -26943 -30205
13780c0205P77k1500l8602j7617l1206K6711N7326O3764L1174J7111l144k9184
$$ -30205 -29428 -50928 -89530 -107147 -138353 -111642 -54316 9448 40622 57733 54589 25405
13768B5405M797k3198l6621m1950q588J1498K1698M9061l989o456o2270n116k321
$$ 25405 30202 7004 -29617 -71567 -80155 -68657 -46959 2102 -1887 -8343 -70613 -75729 -78050
13755g8050N6971N2313K7861o2652l5978O2375k6618n3054M1688N4706j9873k5024
$$ -78050 -21079 31234 59095 -3557 -39535 22840 -3778 -56832 -15144 39562 19689 -5335
13743e335k2574n1950l0481M0393J00848J7730l5709k7321n4160q0811M089L7066
$$ -5335 -27909 -79859 -110340 -69947 30901 48631 12922 -14399 -68559 -149370 -145281 -108215
13731a08215K8001L0064j5407J3192K042o215M0925J04302k0680k1794o0406k4540
$$ -108215 -80214 -50150 -65557 -52365 -50323 -56538 -15613 88689 68009 46215 -14191 -38731
13719c8731K2991Q037l4370l194K0405K8389k5169M588J7929K7132k4063k1244
$$ -38731 -15740 -7703 -42073 -45267 -24862 3527 -21642 -17054 875 28007 3944 -17300
13707a7300l8377j6056K8835L1149k0775K8098k9852J148K2102l97J3762j4548
$$ -17300 -55677 -71733 -42898 -11749 -32524 -4426 -34278 -33130 -11028 -11425 2337 -12211
13695a2211r701J13169m0503r5721n0609k7581M0044N3235Q1952Q153n0046p3439
$$ -12211 -21912 91257 50754 -44967 -95576 -123157 -83113 -29878 52074 60227 10181 -63258
13683f3258n0346J4434L1513M0907L6088N2037k2589q5049j2605K1825L6871j9618
$$ -63258 -113604 -99170 -67657 -26750 9338 61375 38786 -46263 -58868 -37043 -172 -19790
13671a9790m2342L9161L9403L1701Q839J9861N689p3070q7586J2670L1973J4973
$$ -19790 -62132 -22971 16432 48133 56972 76833 82522 9452 -78134 -65464 -33491 -18518
13659a8518P0151M3112n393l7255N6000n9507q4557k3095M8599M0163k502k5103
$$ -18518 51633 94745 89352 52097 108097 48590 -35967 -59062 -10463 29700 27198 2095
13647B095l3263K0595l8549j8937N0312N7180M8808K6936n3028J5678j0782J4477
$$ 2095 -31168 -10573 -49122 -68059 -17747 39433 88241 115177 62149 77827 67045 81522
13635H1522P190l4177l8959J6730l551o6115J3926Q0407J7346n3867j5453R006
$$ 81522 88712 54535 15576 32306 28755 -37360 -23434 56973 74319 20452 4999 14005
13623A4005J0096j9308m7818o274N4534k4556o5178l6117O6199O6142o4006l4979
$$ 14005 24101 4793 -43025 -49299 5235 -19321 -84499 -120616 -54417 11725 -52281 -87260
13611h7260m925L9683P0859L894M7245O5025r238j2307q2247n6145J9183M8729
$$ -87260 -92185 -52502 18357 22251 69496 134521 125283 112976 30729 -25416 -6233 42496
13599D2496j897k2453J2355O275m9622j7624L859l3815m1141O1327R1103M5211
$$ 42496 40599 18146 30501 36776 -12846 -30470 -26611 -60426 -101567 -40240 50863 96074
13587I6074r861l9637J8355k7412P381J7674N820k7920J7981J3466j4693Q057
$$ 96074 86213 46576 64931 37519 44900 62574 68394 40474 58455 71921 57228 65285
13575F5285M7763l9023p7921j5309N9890M3559l4652l1949L421J2548K6873J4165
$$ 65285 113048 74025 -3896 -19205 40685 84244 49592 17643 21064 33612 60485 74650
13563G4650o8678p6992M2321n711J3629K7027L1308L0618m3295n0439m1621p230
$$ 74650 5972 -71020 -28699 -34410 -20781 6246 37554 68172 24877 -25562 -67183 -74413
13551g4413J6805M4842m1821m809m325L6146J2516j9685n390N4719M6561P104
$$ -74413 -57608 -12766 -54587 -59396 -63721 -27575 -15059 -34744 -40134 14585 61146 68250
13539F8250k0899r406l1794N4973l2277n2816j0072R339p302k9513l7403n862
$$ 68250 47351 37945 6151 61124 28847 -23969 -34041 -24702 -32004 -61517 -98920 -104782
13527a04782L0737N5767J421l7975J6862L8957n386k6028r414o488p165L0358
$$ -104782 -74045 -18278 -16857 -54832 -37970 987 -4399 -30427 -39841 -46329 -53494 -23136
13515b3136J5970M8761l6468m3317j2110K7495J9370n2996l0443K7261O9728K6954
$$ -23136 -7166 41595 5127 -38190 -50300 -22805 -3435 -56431 -86874 -59613 10115 37069
13503C7069m5200o4732N689J5756O669Q083R646j7886K0420Q8663M3399J2358
$$ 37069 -8131 -72863 -67174 -51418 -44749 -36666 -27020 -44906 -24486 64177 107576 119934
13491A19934J8183j7060j8793n3984k9909k866m317L1730J1772p9842M9490j2492
$$ 119934 138117 121057 102264 48280 18371 15505 11188 42918 54690 -25152 24338 11846
13479A1846r8519l2553m4354N1235Q1256j8320j4319j4482j4179M1679j6615o333
$$ 11846 -86673 -119226 -163580 -112345 -31089 -49409 -63728 -78210 -92389 -50710 -67325 -73658
13467g3658m2652L1676J961n851J0685M3187k0360k7018K1981P0161Q35L1409
$$ -73658 -116310 -84634 -82673 -88524 -77839 -34652 -55012 -82030 -60049 10112 10947 42356
13455D2356m3493K713K2906m3971k8617p90L2147N0713K3403J7304k2559j5060
$$ 42356 -1137 1576 24482 -19489 -48106 -48896 -16749 33964 57367 74671 52112 37052
13443C7052J145l9866k7614L5662j6773L157m5123N2505k4960m4180K9426K6364
$$ 37052 38197 -1669 -29283 6379 -10394 -7237 -52360 145 -24815 -68995 -39569 -13205
13431a3205n346o0L9654K2208k6644j9430M1080k4490P756J8238k0561N397Q515
$$ -13205 -18551 -18611 21043 43251 16607 -2823 38257 13767 21523 39761 19200 24597 33112
13418C3112j4361M1786k2418k6166J1333l2721M9769N9457k4271k3798r87l2863
$$ 33112 18751 60537 38119 11953 23286 -9435 40334 99791 75520 51722 50735 17872
13406A7872J9141p4108l6195M4469O3827L2316p116m4157q7928J9164o9375o796
$$ 17872 37013 -37095 -73290 -28821 35006 67322 60206 16049 -71879 -52715 -122090 -128886
13394a28886J305N3357P1173P21n4517m7792j2715R4434M3231j0432k7308J6755
$$ -128886 -127581 -74224 -3051 -2330 -56847 -104639 -117354 -22920 20311 9879 -17429 -674
13382f74o760M002J5782J1042j9547o1046L6881M9577O916n1208j6413J2456K1753
$$ -674 -7434 -3432 12350 23392 3845 -57201 -20320 29257 36173 -15035 -31448 -18992 2761
13369B761J4986J8597j640n0127p5051L9598M2751K1672o462k0184n3056j7580
$$ 2761 17747 36344 34704 -15423 -90474 -50876 -8125 13547 7085 -13099 -66155 -83735
13357h3735P8737R5543j3836p4164k8281o723L1144L3136L2732l6216l2112L7051
$$ -83735 -4998 90545 76709 2545 -25736 -32459 -1315 31821 64553 28337 -3775 33276
13345C3276j1819K2372N2134o2452j8823L1114P005p403l3902q3725j5867P8021
$$ 33276 21457 43829 95963 33511 14688 45802 52807 45404 11502 -72223 -88090 -10069
13333a0069N8462J00376L5474j18292j03113o3666k1598N8006Q6476j6697q5530
$$ -10069 48393 148769 184243 65951 -37162 -100828 -122426 -64420 22056 5359 -80171
13322h0171m4788N421L0985M6147L2036J8736J0556k0335r961q871J6748l395
$$ -80171 -124959 -119538 -88553 -42406 -10370 8366 18922 -1413 -11374 -20245 -3497 -6892
13310f892l6522j031K6962L9265m683j0818O150j4803q815k6933l0540j0726m8866
$$ -6892 -43414 -44445 -17483 21782 17099 6281 12431 -2372 -11187 -38120 -68660 -79386 -128252
13297a28252N9452L0001K669j4854j7887n695l794P287J5482r883L5314r499M2931
$$ -128252 -68800 -38799 -36130 -50984 -68871 -74566 -78360 -71073 -55591 -65474 -30160 -39659 3272
13284C272N8451j2046K3931l6478q6426k2921M4752L0570q013p733M4599r904
$$ 3272 61723 49677 73608 37130 -49296 -72217 -27465 3105 -4908 -12641 31958 22054
13272B2054n4096l3187k8640K5805j298k846l24q085k6601l4774M0886J4934j34
$$ 22054 -32042 -65229 -93869 -68064 -69362 -72208 -72532 -80617 -107218 -141992 -101106 -86172 -86306
13259h6306j5297j9479p7211N8710J33822Q0130R00o154J6052l58r746Q924P635
$$ -86306 -101603 -121082 -198293 -139583 -5761 74369 75269 69115 85167 84809 75063 83987 91622
13246I1622p3098o8227Q767K254K326J7281L9104J9268N7504J6719K3245J2680
$$ 91622 18524 -49703 -40936 -38682 -36356 -19075 20029 39297 96801 113520 136765 149445
13234A49445l4122l1327j6031m0483r0052j5049M3407P5383O5633m1691k7189
$$ 149445 115323 83996 67965 27482 -62570 -77619 -34212 41171 106804 65113 37924
13223C7924p623j4587j0800O470l8080K5226J005l7102m4491N282K8411J9809
$$ 37924 30301 15714 4914 11384 -26696 -1470 -465 -37567 -82058 -76776 -48365 -28556
13211b8556M0590r258n7070R510P299K4035J8082j299j3681J0399J8551k9124
$$ -28556 12034 2776 -54294 -44784 -37485 -13450 4632 3333 -10348 51 18602 -10522
13199a0522l823J8677K7678p196l5508j4894M2901M7138M780j3281m4747o9232
$$ -10522 -14345 4332 32010 24814 -10694 -25588 17313 64451 69231 55950 11203 -58029
13187e8029L1398L2590k9082R249j0157R788N9861q131l2888l4739j9371o51P7180
$$ -58029 -26631 5959 -23123 -13874 -24031 -14243 45618 37487 4599 -30140 -49511 -50162 27018
13174B7018n2804n7705M839R392m2232O2289N6630k8420k0357k7811J9948j84
$$ 27018 -25786 -83491 -78652 -69260 -111492 -49203 7427 -20993 -41350 -69161 -49213 -49397
13162d9397L956J322O3278m3525m948P5089J2507l1229m2127N5984K7296l4296
$$ -49397 -45441 -44119 19159 -24366 -29314 45775 58282 27053 -15074 40910 68206 33910
13150C3910r0409n610l0343k7270k2285K4065P5342P7433L917q9137J2362N6983
$$ 33910 -56499 -62109 -92452 -119722 -142007 -117942 -42600 34833 38750 -50387 -38025 18958
13138A8958J9197R720J842P01J1120q2236k6982L899M5970N2362o753n102m8640
$$ 18958 38155 47875 49717 50418 61538 -20698 -47680 -43781 2189 54551 47798 42696 -5944
13125e944M6899L2673j4588n3254L7219o313O366o6361j8736n6061K7283k1648
$$ -5944 40955 73628 59040 5786 43005 36692 43058 -23303 -42039 -98100 -70817 -92465
13113i2465K982K5993M4749J7844j6198J3636j4167l6580l6875k6822M7683N9239
$$ -92465 -89483 -63490 -18741 -897 -17095 -3459 -17626 -54206 -91081 -117903 -70220 -10981
13101a0981L8823L301j1486l7115J8635J0701J4956L2289Q396l6007Q649K4272
$$ -10981 27842 31143 19657 -17458 1177 11878 26834 59123 67519 31512 40161 64433
13089F4433l6680n3354K0348j5273r80L5046Q6858P2801K333j06769p4328m8937
$$ 64433 27753 -25601 -5253 -20526 -21506 13540 100398 173199 175532 68763 -5565 -54502
13077e4502J5756j6343o2740L1418P8526J6398j4059l2967J3734N506K2444J7499
$$ -54502 -38746 -55089 -117829 -86411 -7885 8513 -5546 -38513 -24779 -19273 3171 20670
13065B0670L2531J145k4631L734m1534j6856J8760L8762O256k9499J9696n761
$$ 20670 53201 54346 29715 33449 -8085 -24941 -6181 32581 38837 9338 29034 23273
13053B3273k0126o1858l0016L180K2311J5198J1876K4160L5303m3807o748l3613
$$ 23273 3147 -58711 -88727 -85547 -63236 -48038 -36162 -12002 23301 -20506 -27254 -60867
13041f0867j6073L6760k907M8434O0784J4435k9109k8057r1672L2416K3704o5276
$$ -60867 -76940 -40180 -43087 5347 66131 80566 51457 23400 -68272 -35856 -12152 -77428
13029g7428K4720P0875O4003k410N3396k2724q2634k2061N8528O162j7947l2591
$$ -77428 -52708 18167 82170 79760 133156 110432 27798 5737 64265 70427 52480 19889
13017A9889N1585J5897k0010n6573Q025M0251Q1791n0289j29975j4897L8461J1319
$$ 19889 71474 87371 67361 10788 18813 59064 140855 90566 -39409 -54306 -15845 -4526
13005d526N1495K5020M3966n1929p06l831j6420k2327J8564N6976m4203M1033
$$ -4526 46969 71989 115955 64026 63320 59489 43069 20742 39306 96282 52079 93112
12993I3112l4189o4127k8495M1116k6892n2046J0053K1253N7788N1248L1654Q009
$$ 93112 58923 -5204 -33699 7417 -19475 -71521 -61468 -40215 17573 68821 100475 108484
12981A08484N1195o4692m6521K5546J6833o2926k9614K9621M9554k7264N186k1072
$$ 108484 159679 94987 48466 74012 90845 27919 -1695 27926 77480 50216 55402 34330
12969C4330k9004P0913L8343m0329n8606m8533J6973Q476k111l0655R872R604
$$ 34330 5326 76239 114582 74253 15647 -32886 -15913 -7437 -9548 -40203 -30331 -20727
12957b0727K0060q58K112O849k9174L1326N4884L9671l1735l673n902j289k455
$$ -20727 -667 -1525 587 7436 -21738 9588 64472 104143 72408 68735 62833 61544 59089
12944E9089k3587M649J1245p795n4188k1283J2668j5922o056K7838L92m12J9370
$$ 59089 35502 40151 51396 43601 -10587 -31870 -19202 -35124 -41180 -13342 -12950 -13362 6008
12931F008N2325M7740l0528o3059m4399J6238l983j5471M746l7320M327L0143
$$ 6008 58333 106073 75545 12486 -31913 -15675 -19658 -35129 -30383 -67703 -63376 -33233
12919c3233Q1352R6787J1071j03998m3879K1189L895k5061l7104j2402n824O7553
$$ -33233 48119 144906 155977 51979 8100 29289 33184 8123 -28981 -41383 -47207 20346
12907B0346M1112L3258j3632n7979m1062k2973K1581M0864N460J6447j5877M0684
$$ 20346 61458 94716 81084 23105 -17957 -40930 -19349 21515 26975 43422 27545 68229
12895F8229K3285J260n0335m4167L3648K8044k0261o0051l9545K3242J7506K2969
$$ 68229 91514 92774 42439 -1728 31920 59964 39703 -20348 -59893 -36651 -19145 3824
12883C824l4776m5665m4649O1794L3648K0380j6859M449P2533l6695o8021l922
$$ 3824 -30952 -76617 -121266 -59472 -25824 -5444 -22303 -17854 54679 17984 -50037 -53959
12871e3959J3931q337J1348J9351K9504k0235k0022k7308J862O0072p279Q973
$$ -53959 -40028 -48365 -37017 -17666 11838 -8397 -28419 -55727 -53865 6207 -1072 7901
12859G901N7364m3282l0843j6087r062p1571j1755J6948N4572L9763j807j4059
$$ 7901 65265 21983 -8860 -24947 -34009 -105580 -117335 -100387 -45815 -6052 -7859 -21918
12847b1918j5499R1894N0021K3253M873m1706j5634l1105M0934J4506n3382k9235
$$ -21918 -37417 54477 104498 127751 132624 90918 75284 44179 85113 99619 46237 17002
12835A7002n0418L5586L9320k2283K8938N9599k1266J0190M2633P450k3758n4613
$$ 17002 -33416 2170 41490 19207 48145 107744 86478 96668 139301 146751 122993 68380
12823F8380k5647K565m3566j3514K8269j5033l3139K4531P9899M0798m3201o0648
$$ 68380 42733 45298 1732 -11782 16487 1454 -31685 -7154 72745 113543 70342 9694
12811I694l2792J1181j7523L2068O0672o0583q7402k9115K9520O2549N9175L7608
$$ 9694 -23098 -11917 -29440 2628 63300 2717 -84685 -113800 -84280 -21731 37444 75052
12799G5052m0597N091o20l0365o0072l922J1269L0033o787o245J6106L475K0320
$$ 75052 34455 39546 38926 8561 -51511 -55433 -44164 -14131 -20918 -27163 -11057 -7582 12738
12786A2738J1657l2503o1754L9509M686L1541L0568l9742m6235j1115K4297N5086
$$ 12738 24395 -8108 -69862 -30353 -25667 5874 36442 -3300 -49535 -60650 -36353 18733
12774A8733j205l0548j5262j5603n5778j669M942J967O0552L7962r260k1466J6161
$$ 18733 17528 -13020 -28282 -43885 -99663 -101332 -96390 -94423 -33871 4091 -5169 -26635 -10474
12761a0474L1461K1753M749o329j0925L480J954M2679k3602K2140K727n0324j9096
$$ -10474 20987 42740 47489 41160 30235 33715 35669 78348 54746 76886 79613 29289 10193
12748A0193n222L0752n0257Q306K7576q128j5715l8448j8759K2036N1998L6771
$$ 10193 4971 35723 -14534 -6228 21348 13220 -2495 -40943 -59702 -37666 14332 51103
12736E1103m3806k3418M064m367R008q121m7248k2818J9541q38N008J9833O7624
$$ 51103 7297 -16121 -12057 -16424 -7416 -15537 -62785 -85603 -66062 -66900 -61892 -42059 25565
12723B5565M0759p195K9512k6104l5505L3904r625j7312M125J2958r4073l5772
$$ 25565 66324 59129 88641 62537 27032 60936 51311 33999 38124 51082 -42991 -78763
12711g8763N1212M9199P0844L95j7921m5047j164L2741P7552M3850m4192n3756
$$ -78763 -27551 21648 92492 92887 74966 29919 28755 61496 139048 182898 138706 84950
12699H4950p461m4844m6781m4595J6615N8011K4499k4483q1079k7907O082J6445
$$ 84950 77489 32645 -14136 -58731 -42116 15895 40394 15911 -65168 -93075 -86993 -70548
12687g0548Q5080J2747m7162l3780J1724O0487K8878J4309L4748o1597k8972j1210
$$ -70548 14532 27279 -19883 -53663 -41939 18548 47426 61735 96483 34886 5914 -5296
12675e296q167j283J0663k1891o039L5859J4102l1663j7461J1193j9485m1897
$$ -5296 -13463 -14746 -4083 -25974 -32013 3846 17948 -13715 -31176 -19983 -39468 -81365
12663h1365m5841M3126R2479M2286k9261n201J2262j743L666P2642L1025m1365
$$ -81365 -127206 -84080 8399 50685 21424 16223 28485 26742 30408 103050 134075 92710
12651I2710J5663K99p9644q6019j2415O845J962j4075O1782O699j0998O930K3597
$$ 92710 108373 108672 29028 -56991 -69406 -62561 -60599 -74674 -12892 -6193 -17191 -10261 13336
12638A3336J5872p574L8666m2361n3994l9028O6518L6190M7553n417n8240k3120
$$ 13336 29208 21634 60300 17939 -36055 -75083 -8565 27625 75178 69761 11521 -11599
12626a1599k8509R151Q845J6116K9596N1765K2358m9912l2316M1681n5414j5371
$$ -11599 -40108 -30957 -22112 -5996 23600 75365 97723 47811 15495 57176 1762 -13609
12614a3609L5108k8617J6672L0053p848L2195J2315J5648M4822J2837m1337M323
$$ -13609 21499 -7118 9554 39607 31759 63954 76269 91917 136739 149576 108239 112562
12602A12562l4603k3528J5214p273J368n4288l4909l6991n6055J1397N5854N9585
$$ 112562 77959 54431 69645 62372 63740 9452 -25457 -62448 -118503 -107106 -51252 8333
12590H333M3927J06435m3008j07940k6457L6100J566K8378l3395l4904M01l4225
$$ 8333 52260 158695 115687 7747 -18710 17390 18956 47334 13939 -20965 -20564 -54789
12578e4789L9687O2822j857J3352p992m9733j9677J817J7496Q0648J6812P638
$$ -54789 -15102 47720 45863 59215 51223 1490 -18187 -16370 1126 81774 98586 106224
12566A06224p1409m2954K4598o365k475l3691R623o308q20K7913M5140J9919P8217
$$ 106224 34815 -8139 16459 10094 7619 -26072 -16449 -22757 -23577 4336 49476 69395 147612
12553A47612j0012m1376o5719m9900P7218O1599L1614M247k9960o6423j4009o775
$$ 147612 137600 96224 30505 -19395 57823 119422 151036 155283 125323 58900 44891 38116
12541C8116R432L1431J8276o844j5653k6808r870j4528k0387l1102N9411Q8199
$$ 38116 47548 78979 97255 90411 74758 47950 38080 23552 3165 -27937 31474 119673
12529A19673O8043L2638l6826m9695k3494l6510K7611m5308n5220O2359k1696
$$ 119673 187716 220354 183528 133833 110339 73829 101440 56132 912 63271 41575
12518D1575j9687K9886Q3922K5992M167j3629p206m6211l3362J5141j8195m0451
$$ 41575 21888 51774 135696 161688 165855 152226 145020 98809 65447 80588 62393 21942
12506B1942r067M0088j7221J6740j8094l4663q426L5608O123j6826l1494J5755
$$ 21942 12875 52963 35742 52482 34388 -275 -8701 26907 33030 16204 -15290 465
12494D65R796J1324m9330n4043M9234P5277j7266k2485J0880L367k4785k9846
$$ 465 10261 21585 -27745 -81788 -32554 42723 25457 2972 13852 17219 -7566 -37412
12482c7412Q928L6320Q427J9013k5882P396K9216L7941m2363n2968R47N9256K3628
$$ -37412 -28484 7836 16263 35276 9394 16790 46006 83947 41584 -11384 -10437 48819 72447
12469G2447j1251l8949k1738N0802J6212p039L5937K0937J2974k2295m065r680
$$ 72447 61196 22247 509 51311 67523 60484 96421 117358 130332 108037 103972 94292
12457I4292o9072L6573O9993L3202O744j9113k1389R828M8636l4156n5852l1683
$$ 94292 25220 61793 131786 164988 171732 152619 131230 141058 189694 155538 99686 68003
12445F8003n3023K0078Q3221J004Q901o018J9661P874l8575J357j2544J2180j7837
$$ 68003 14980 35058 118279 119283 128184 122166 141827 149701 111126 112483 99939 112119 94282
12432I4282j3047l556J1238j2773K5156K5036K2308J6768l3031O363L238J1505
$$ 94282 81235 77679 88917 76144 101300 126336 148644 165412 132381 138744 141982 153487
12420A53487l753n226k148K5607O544J732o2149J403k8157L374K714K001K1255
$$ 153487 149734 144508 142360 167967 174511 176243 114094 115497 87340 90714 93428 95429 116684
12407A16684n166n428k6115l778l3602j354N3848K2165K0143k2200L3168l4668
$$ 116684 111518 106090 79975 76197 42595 41241 95089 117254 137397 115197 148365 113697
12395A13697R705J5588k9015J1050K045j9876j5547k2363N2315M3857J8217p848
$$ 113697 123402 138990 109975 121025 123070 103194 87647 65284 117599 161456 179673 171825
12383A71825q2013j1994K4809r04N08n3288l9226M2396K177J8023o581N8858K9601
$$ 171825 89812 77818 102627 101723 102231 48943 9717 52113 54290 72313 65732 124590 154191
12370A54191l9172j960K3539L5003j1688L2542M804m3040n2263K0781J9139L9968
$$ 154191 115019 113059 136598 171601 159913 192455 197259 154219 101956 122737 141876 181844
12358A81844N817J9636j6k5865K404r1005p4447M7317k336J1305K8699N2099K8294
$$ 181844 187661 207297 207281 181416 183820 92815 18368 65685 63349 74654 103353 155452 183746
12345A83746k4660k0629j401M1068K6763o4802l5079J8758j675q1863l0065N1245
$$ 183746 159086 138457 137056 178124 204887 140085 105006 123764 122089 40226 10161 61406
12333F1406K118L5809O2414L1133l427o128l7037l5561l839K423n9356O4245J00590
$$ 61406 63524 99333 161747 192880 189453 183325 146288 110727 106888 109311 49955 114200 214790
12320B14790J0469j9295k8134L3579N086k550J4828n7911k9955j731M4802J887
$$ 214790 225259 205964 177830 211409 216495 213945 228773 170862 140907 139176 183978 185865
12308A85865L072j7241N031l183j0824j480K5611o188j6688l335M8053L2767M5437
$$ 185865 188937 171696 176727 173544 162720 161240 186851 180663 163975 160640 208693 241460 286897
12295B86897l2382l5332M2686k4955j0727l8938l785j402R8582j0183n908J462
$$ 286897 254515 219183 261869 236914 226187 187249 183464 182062 280644 270461 264553 266015
12283B66015K81n1416q4439j4178k763k5791j888O6611P9982O916k7893n4793
$$ 266015 266296 214880 130441 116263 113500 87709 85821 152432 232414 239330 211437 156644
12271A56644r808K0346l8814n9740j5478L0186R315M8690O065M2686Q3678L7169
$$ 156644 146836 167182 128368 68628 53150 83336 92651 141341 147406 190092 273770 310939
12259C10939L2764o102j8979m343j8741m519n8854q6406R819N9793Q7440j133
$$ 310939 343703 337601 318622 314279 295538 291019 232165 145759 155578 215371 302811 301678
12247C01678m6869L277q268l1373j1644K5137p3737q1451l3295R2725L9487M8234
$$ 301678 254809 258086 249818 218445 206801 231938 158201 76750 43455 136180 175667 223901
12235B23901m174J8303K2804J7225M733L870q7033O466O7541k6981O5466M6408
$$ 223901 219727 238030 260834 278059 282792 286662 199629 206095 273636 246655 312121 358529
12223C58529N476n4788K3098J1700j8542j1609j4898n0785L0765J0615J2542N6104
$$ 358529 364005 309217 332315 344015 325473 313864 298966 248181 278946 289561 302103 358207
12211C58207j6942M0162K0331L1904O0487L4990J0464n4006o7365k3800l7635
$$ 358207 341265 381427 401758 433662 494149 529139 539603 485597 418232 394432 356797
12200C56797n6055P668L785J1742M7697r16j1178R4764L9045p209K1891l5094
$$ 356797 300742 308410 312195 323937 371634 370718 359540 454304 493349 486140 508031 472937
12188D72937n0409o6854n6668j330Q1748K1040N3870P095M0491k1261J487m2713
$$ 472937 422528 355674 299006 297676 379424 400464 454334 461429 501920 480659 482146 439433
12176D39433j541Q507Q225J6043k0932J6004m1888k9555L2112J8443o435K9173
$$ 439433 437892 446399 454624 470667 449735 465739 423851 394296 426408 444851 438416 467589
12164D67589M5124K9122l6904j7814K9980M9177l588K8593O204k9530K6667J707
$$ 467589 512713 541835 504931 487117 517097 566274 562686 591279 597483 567953 594620 596327
12152E96327j4871K8198j1110j5381J3666L697J0004O0110j3061m5862J3314k3869
$$ 596327 581456 609654 598544 583163 596829 600526 610530 670640 657579 611717 625031 601162
12140F01162r556J05904J5232p9625l6896N779J8137N0503N3596k3360k3926j4238
$$ 601162 591606 697510 712742 633117 596221 602000 620137 670640 724236 700876 676950 662712
12128F62712L4915J9683K5578j4349L0578K2538o583j6097l0935J0316N1132O6174
$$ 662712 697627 717310 742888 728539 759117 781655 775072 758975 728040 738356 789488 855662
12116H55662j3213j3535l8641L5686P998o603M4712l8122O5L380O4102Q7448k9722
$$ 855662 842449 828914 790273 825959 833957 827354 872066 833944 834009 837389 901491 988939 959217
12103I59217J173n6273j1710O836J2104L3094j8175j8924J4435L5974k4040r4377
$$ 959217 960390 904117 892407 899243 911347 944441 926266 907342 921777 957751 933711 839334
12091H39334L1807L2769K0000k1271K4384L9293k37L8022N4869J537n5960K8191
$$ 839334 871141 903910 923910 902639 927023 966316 966079 1004101 1058970 1060507 1004547 1032738
12079A032738O0674L8008P273j4845N3670p659q3285J4560M0148O5522Q4028P79
$$ 1032738 1093412 1131420 1138693 1123848 1177518 1169859 1086574 1101134 1141282 1206804 1290832 1291611
12067A291611o8089o517k3703M2307N4485O6428R4779k9521L3211O861l3333j7441
$$ 1291611 1223522 1217005 1193302 1235609 1290094 1356522 1451301 1421780 1454991 1461852 1428519 1411078
12055A411078J9909K2822P6856K4170j2712L8404L6056k0416N731o637j9359m4993
$$ 1411078 1430987 1453809 1530665 1554835 1542123 1580527 1616583 1596167 1601898 1595261 1575902 1530909
12043A530909M5981N6149L1937L4799L7816J3829o97M6455Q9994M1611J9916M2729
$$ 1530909 1576890 1633039 1664976 1699775 1737591 1751420 1750723 1797178 1887172 1928783 1948699 1991428
12031A991428O8461j1481j609k769M5462O4705O8031P7068n1167n501O5030O5696
$$ 1991428 2059889 2048408 2046799 2044030 2089492 2154197 2222228 2299296 2248129 2242628 2307658 2373354
12019B373354L4988l1207J1241Q3154J06711L7254J4747L8770L1579M8125J4788
$$ 2373354 2408342 2377135 2388376 2471530 2578241 2615495 2630242 2669012 2700591 2748716 2763504
12008B763504K8754R8742K2913J8026K5814j0133q918M6433M3685J38026J11798
$$ 2763504 2792258 2891000 2913913 2931939 2957753 2947620 2938702 2985135 3028820 3166846 3278644
11997C278644Q8588O3183K8161O1301O0800P2934L5890m0247N3908Q3880O7189
$$ 3278644 3367232 3430415 3458576 3519877 3580677 3653611 3689501 3649254 3703162 3787042 3854231
11986C854231P7785J0020K940O9939J32314L6537O9570J14675Q3582K6252L8855
$$ 3854231 3932016 3942036 3944976 4014915 4147229 4183766 4253336 4368011 4451593 4477845 4516700
11975D516700J5393P9345J96947J24860N2242J30785J20266J12344M2311P2102
$$ 4516700 4532093 4611438 4808385 4933245 4985487 5116272 5236538 5348882 5391193 5463295
11965E463295J23970R1742R6598J08204J06168O9717Q6083P5698J08374J09087
$$ 5463295 5587265 5679007 5775605 5883809 5989977 6059694 6145777 6221475 6329849 6438936
11955F438936M6127J7593N0739J10992J58377J06239Q8423O8327M0273O1972J08538
$$ 6438936 6485063 6502656 6553395 6664387 6822764 6929003 7017426 7085753 7126026 7187998 7296536
11944G296536J30729J44619J47113O8112J2462P8379O5975P0204P6060R5744Q7599
$$ 7296536 7427265 7571884 7718997 7787109 7799571 7877950 7943925 8014129 8090189 8185933 8273532
11933H273532J00978Q8805L8411K8220N5944P1317J3784N0537M3423N9439Q4710
$$ 8273532 8374510 8463315 8501726 8529946 8585890 8657207 8670991 8721528 8764951 8824390 8909100
11922H909100O7280N1541O7771j0217Q163l9981Q022M7175p7l0592L685J7254
$$ 8909100 8976380 9027921 9095692 9085475 9093638 9053657 9061679 9108854 9108777 9078185 9081870 9099124
11910I099124n6576m2447l2519Q76n2006o9871m4047j1531j4978m9162l3966j06832
$$ 9099124 9042548 9000101 8967582 8968458 8916452 8846581 8802534 8791003 8776025 8726863 8692897 8586065
11898H586065o7522j33666r1473J9735R212l8210p9591q4255j21035q2146j11403
$$ 8586065 8518543 8384877 8293404 8313139 8322351 8284141 8204550 8120295 7999260 7917114 7805711
11887G805711l8751p6277n4716q7420r9609j21384r6405o9836r8648r3504o8005
$$ 7805711 7766960 7690683 7635967 7548547 7448938 7327554 7231149 7161313 7062665 6969161 6901156
11876F901156o9182j12839j81032j13866j11970j16186o0544o3311l2241j33371
$$ 6901156 6831974 6719135 6538103 6424237 6312267 6196081 6135537 6072226 6039985 5906614
11866E906614m1206m1451q5898j53994j41376p2561O408J0440j24635j93112o0569
$$ 5906614 5865408 5823957 5738059 5584065 5442689 5370128 5376536 5386976 5262341 5069229 5008660
11855E008660k2038j28195q6149m4630r0275m8669p3914p9005q0136k6447m3125
$$ 5008660 4986622 4858427 4772278 4727648 4637373 4588704 4514790 4435785 4355649 4329202 4286077
11844D286077n1837j3316l5653j18576o8629p161p1037p5666p0739q4138q0868
$$ 4286077 4234240 4220924 4185271 4066695 3998066 3990905 3919868 3844202 3773463 3689325 3608457
11833C608457K2182l9783n0067k9249j96311l1347M1432o1298r3136j16253o1858
$$ 3608457 3630639 3590856 3540789 3511540 3315229 3283882 3325314 3264016 3170880 3054627 2992769
11822B992769l9097k2407n0298m1875J8441M1493j5808k3154r1647j36286q9530
$$ 2992769 2953672 2931265 2880967 2839092 2857533 2899026 2883218 2860064 2768417 2632131 2542601
11811B542601k4761J2673p127j13026o1741P1151K6509n1843o8550n4391m1433
$$ 2542601 2517840 2530513 2523386 2410360 2348619 2419770 2446279 2394436 2325886 2271495 2230062
11800B230062k8450m4100n7229l5614m9097p0556j3840L3662K7835m1933k9272
$$ 2230062 2201612 2157512 2100283 2064669 2015572 1945016 1931176 1964838 1992673 1950740 1921468
11789A921468q125j8696m4505l3246m6595R99k7680n0480k3658n3127m6463m0385
$$ 1921468 1913343 1894647 1850142 1816896 1770301 1771300 1743620 1693140 1669482 1616355 1569892 1529507
11777A529507J6991L9384m2256K7203p853J7410R003R890L0490l0441n8698m4029
$$ 1529507 1546498 1585882 1543626 1570829 1562976 1580386 1589389 1599279 1629769 1599328 1540630 1496601
11765A496601q9187n5207l6407L9792m550J1693L2164l7416n1846n102Q680J7667
$$ 1496601 1407414 1352207 1315800 1355592 1351042 1362735 1394899 1357483 1305637 1300535 1309215 1326882
11753A326882m5179p1506k7762O7197l2007o9125j3358m39p1785j6525L1893K0637
$$ 1326882 1281703 1210197 1182435 1249632 1217625 1148500 1135142 1134703 1062918 1046393 1078286 1098923
11741A098923l697L430L9375j9718l7973n6019k0244L7314O9008n2904n2053k8497
$$ 1098923 1095226 1098656 1138031 1118313 1080340 1024321 1004077 1041391 1110399 1057495 1005442 976945
11729I76945n6145j2657J1038m2600j5480K604l9470L3545q985K1667L1995r5156
$$ 976945 920800 908143 919181 876581 861101 863705 824235 857780 848795 870462 902457 807301
11717H07301l0021k3607m3753l841j903j0592J2517J7444L9916M2642j145N418
$$ 807301 777280 753673 709920 706079 704176 693584 706101 723545 763461 806103 804958 810376
11705H10376J7403k3064j3476m326k8473k1737k4816M8668L736j1398n2002q8198
$$ 810376 827779 804715 791239 786913 758440 736703 711887 760555 764291 752893 700891 612693
11693F12693l0176K960l0984M7791O3110k6638j7798J3711R765l329N8122K6593
$$ 612693 582517 585477 554493 602284 665394 638756 620958 634669 644434 641105 699227 725820
11681G25820m1235M342j9708l4738J0203n6081j4487L3586P7691n6482R146l7530
$$ 725820 684585 688927 669219 634481 644684 588603 574116 607702 685393 628911 638057 600527
11669F00527j5008k4771m8985K7283r2488O232m686M6012J0111K4346r44k6933
$$ 600527 585519 560748 511763 539046 446558 452790 448104 494116 504227 528573 527629 500696
11657E00696J3659J7049j7588n844j9111M347j2952j7802p211P323n1501l1791
$$ 500696 514355 531404 513816 507972 488861 493208 480256 462454 455243 462566 411065 379274
11645C79274J0815J7174N1743p346o7952j5361K3146n3208N4224k6298n4366L0252
$$ 379274 390089 407263 459006 451660 383708 368347 391493 338285 392509 366211 311845 342097
11633C42097Q4579O0173l1174o5515J2813k3348m6880n2913L9172l6661o3912
$$ 342097 426676 486849 455675 390160 402973 379625 332745 279832 319004 282343 218431
11622B18431j5539J8964M1822N9787J2678j4863k8964J9639N2510M4714K2953
$$ 218431 202892 221856 263678 323465 336143 321280 292316 311955 364465 409179 432132
11611D32132m6634j7442L1072M476l4526l7517m1275o9267q435O205Q3166L6237
$$ 432132 385498 368056 399128 403604 369078 331561 290286 221019 212584 218789 301955 338192
11599C38192Q0356J484q6684j3128J5147M4884o811K5186l6121p3221j3548M4959
$$ 338192 418548 420032 333348 320220 335367 380251 373440 398626 362505 289284 275736 320695
11587C20695L0954o583l6692k0734n2315j0959O7584j0181j7064k5418k9189O4431
$$ 320695 351649 345066 308374 287640 235325 224366 291950 281769 264705 239287 210098 274529
11575B74529K8102l249M556L65K855J2669j6610j4028l7282m3717M0434k778j712
$$ 274529 302631 299382 303938 304303 307158 319827 303217 289189 251907 208190 248624 245846 244134
11562B44134J4867m7175L7671P2613n259k1939p126j2597o7722m2826O9523N2500
$$ 244134 259001 211826 249497 322110 316851 294912 287786 275189 207467 164641 234164 286664
11550B86664n78J3674o910m3628l1325L3525J1297L0043l3805j8255J2996K7179
$$ 286664 286086 299760 292850 249222 217897 251422 262719 292762 258957 240702 253698 280877
11538B80877K1711j08475q5241K1353M7246j2402O230k0979Q555p935N5110Q3071
$$ 280877 302588 194113 108872 130225 177471 165069 171299 150320 158875 150940 206050 289121
11526B89121j5449n5841j07565J9855M5842J3785J8504j8638k1969j9359J6079
$$ 289121 273672 217831 110266 130121 175963 189748 208252 189614 167645 148286 164365
11515A64365O467l7440m683K312N2889O2096q313n5017j5361J5883J0633M4337
$$ 164365 170832 133392 128709 131021 183910 246006 237693 182676 167315 183198 193831 238168
11503B38168k4808k6304j177P416M8844k0786m8488k8750L9114j2152p8193q3090
$$ 238168 213360 187056 185879 193295 242139 221353 172865 144115 183229 171077 92884 9794
11491I794L2248R4858P4179K0409o943k4005j7531k527m161k0948K9778l7636
$$ 9794 42042 136900 211079 231488 224545 200540 183009 180482 176321 155373 185151 147515
11479A47515k0633L3217L3923k3626p3388M0260K5637j591l0347n1440j0082j1708
$$ 147515 126882 160099 194022 170396 97008 137268 162905 161314 130967 79527 69445 57737
11467E7737m758k0118M7654L7718l587N7202k4090o9444K3908L9653j0188m7828
$$ 57737 52979 32861 80515 118233 114646 171848 147758 78314 102222 141875 131687 83859
11455H3859O9733m3980l5402j0937p252L7391k8879n777L5267j2150m9218L8352
$$ 83859 153592 109612 74210 63273 56021 93412 64533 58756 94023 81873 32655 71007
11443G1007N3055k1946l2848M5828L570n4180K3734j4392L8160r860L8925J8693
$$ 71007 124062 102116 69268 115096 118666 64486 88220 73828 111988 102128 141053 159746
11431A59746o2076M1483L6216o4842k0030M498l9189M102O0823K2172l3585l06
$$ 159746 97670 139153 175369 110527 90497 94995 55806 59908 120731 142903 109318 109012
11419A09012J0944p820O046m7274J8858K6915o1587m0024M107N273K3984J6576
$$ 109012 119956 112136 118182 70908 89766 116681 55094 15070 19177 24450 48434 65010
11407F5010L985k4854J2142K8502j346k3564J4589N2605l3332J8626m539q60o9602
$$ 65010 68995 44141 56283 84785 83439 59875 74464 127069 93737 112363 107824 106964 37362
11394C7362k5486P1688N6586K3550l8734m1552L3206N4456M9389k0283k0035L306
$$ 37362 11876 83564 140150 163700 124966 83414 116620 171076 220465 200182 180147 183453
11382A83453j6566k7121l0974l014k6552J3602K0839k7719k4173K5847N3497r183
$$ 183453 166887 139766 108792 105778 79226 92828 113667 85948 61775 87622 141119 131936
11370A31936M3912Q696J0755l3115p758N5151o422p0622J726M7041n373m0910
$$ 131936 175848 184544 195299 162184 154426 209577 203155 132533 134259 181300 175927 135017
11358A35017j8226l7643q5838K3528L0346n7971k9625O8072M2202k2067l4045
$$ 135017 116791 79148 -6690 16838 47184 -10787 -40412 27660 69862 47795 13750
11347A3750k6259N2360M1974K2040O672m1134J0549l2436k920j5697n2449L6822
$$ 13750 -12509 39851 81825 103865 110537 69403 79952 47516 44596 28899 -23550 13272
11335A3272K5443r482l5447R6959O3952J6188L2570M2612R075m1450q7813N1448
$$ 13272 38715 29233 -6214 90745 154697 170885 203455 246067 255142 213692 125879 177327
11323A77327L182r2820l2083J9258N4951J9178j5907N348M2908M0601L6034o2111
$$ 177327 180509 87689 55606 74864 129815 148993 133086 138434 181342 221943 257977 195866
11311A95866o6212L433P1624K1708M922r2830L5743J4883n8148N065J1430r84
$$ 195866 129654 133087 204711 226419 231341 138511 174254 189137 130989 136054 147484 146500
11299A46500o1811N614K4891k2892J6266M6923K2877L844m2236J5200J934J8428
$$ 146500 84689 90303 115194 92302 108568 155491 178368 182212 139976 155176 157110 175538
11287A75538J658M2791K8091J05992J30514J09120M6457L8598n6635n2546m9269
$$ 175538 177196 219987 248078 354070 484584 593704 640161 678759 622124 569578 520309
11276E20309p8373n9055j3626j1372n5288p6974r1849o2943k6554K1074N9968
$$ 520309 441936 382881 369255 357883 302595 225621 133772 70829 44275 65349 125317
11265A25317M4776r749r602p1293j4683L4184p72k0432j3441L5419L1232l5140
$$ 125317 170093 160344 150742 79449 64766 98950 98178 77746 64305 99724 130956 95816
11253I5816J4293L5024j0760p5397P591L9328L6332q586K9097N7587J7579L2960
$$ 95816 110109 145133 134373 58976 66567 105895 142227 133641 162738 220325 237904 270864
11241B70864N4612Q6831R071N8579J32130N3102L499k6833K9276j3307n5729o6402
$$ 270864 325476 412307 421378 479957 612087 665189 668688 641855 671131 657824 602095 535693
11229E35693j26669r1269k4855o4144n5659o1964n36J0603k4434N8089K2548q7572
$$ 535693 409024 317755 292900 228756 173097 111133 110597 121200 96766 154855 177403 89831
11217H9831r907M7798l2125n7256j9980p4866K1934R4654l209k2873L1262P0309
$$ 89831 79924 127722 95597 38341 18361 -56505 -34571 60083 56874 34001 65263 135572
11205A35572Q249l3454J6710K7203j7726Q134K98L2009L2268Q0155m4306M0305
$$ 135572 143821 110367 127077 154280 136554 144688 144986 176995 209263 289418 245112 285417
11193B85417j6485m8967L5824J6989j8734n472k6441l6753l0454o605m9964o5009
$$ 285417 268932 219965 255789 272778 254044 248572 222131 185378 154924 148319 98355 33346
11181C3346J4904J7357N1410j0250J193J9039j2953m4302n0185M7920J0305k6511
$$ 33346 48250 65607 117017 106767 107960 126999 114046 69744 19559 67479 77784 51273
11169E1273n0257o8255p92P5891J21603k2680j3194l5460j7015k8214k4950L7170
$$ 51273 1016 -67239 -68031 7860 129463 106783 93589 58129 41114 12900 -12050 25120
11157B5120R155k9658K2823J4812k547n7106m9230J238l2430N6866L0150j5564
$$ 25120 34275 4617 27440 42252 39705 -17401 -66631 -65393 -97823 -40957 -10807 -26371
11145b6371J1949j0511l2368m2870J7045P0672L0867o704K2992J1064k7843n390
$$ -26371 -14422 -24933 -57301 -100171 -83126 -12454 18413 11709 34701 45765 17922 12532
11133A2532j6453j4662L947j6597K731K540k6643M8921R571k7867j9187m9712
$$ 12532 -3921 -18583 -14636 -31233 -28502 -25962 -52605 -3684 5887 -21980 -41167 -90879
11121i0879q726K0685K1567N3396N0526o786k5047m2101L251K4403j4629R985
$$ -90879 -99605 -78920 -57353 -3957 46569 39783 14736 -27365 -24114 289 -14340 -4355
11109d355j0527p906J2029o82j8481n919k9945L4659N4460O133j4644l251j5223
$$ -4355 -14882 -22788 -10759 -11441 -29922 -35841 -65786 -31127 23333 29466 14822 11571 -3652
11096c652l60R164K1603l3097l657n5940J4154N5646J6371O992J9694L3466m8979
$$ -3652 -4012 5152 26755 -6342 -9999 -65939 -51785 3861 20232 27224 46918 80384 31405
11083C1405J3319j2760m9969k5770J3862Q1693K3080l2959n1799m192N617M8794
$$ 31405 44724 31964 -18005 -43775 -29913 51780 74860 41901 -9898 -14090 -8473 40321
11071D0321k3203j3595q5337p863M7917Q7306N218m2164n03l614j9702j2316m6270
$$ 40321 17118 3523 -81814 -89677 -41760 45546 50764 8600 8097 4483 -15219 -27535 -73805
11058g3805n3405m4186J3561P5639M0835L2043O0060j7993R455J0049L2605n550
$$ -73805 -127210 -171396 -157835 -82196 -41361 -9318 50742 32749 42204 52253 84858 79308
11046G9308j2201Q50K995k4206m772M95O8659J1297n2214L3772j7863L7520Q4973
$$ 79308 67107 67957 70952 46746 41974 42469 111128 122425 70211 103983 86120 123640 208613
11033B08613K8706j6150l7124N1445J325Q5639J40199M7626N6846N7676j18492
$$ 208613 237319 221169 184045 235490 236815 322454 462653 510279 567125 624801 506309
11022E06309p6215Q1739L1245L6186m865l905J4918L1280Q6190L9768O823M579
$$ 506309 430094 511833 543078 579264 574399 570494 585412 616692 702882 742650 749473 754052
11010G54052n3276j50510j00191j3938M442l1877n008J5976K0990J8417l806l3428
$$ 754052 700776 550266 450075 436137 440579 408702 403694 419670 440660 459077 455271 421843
10998D21843m5543p1953K572j1363o3714M2577l8203l2143L7903L0022N0327l3061
$$ 421843 376300 304347 306919 295556 231842 274419 236216 204073 241976 271998 322325 289264
10986B89264l1476j5951l3950L942m0429n9226m1122K3537P1294O3184K0844l9772
$$ 289264 257788 241837 207887 211829 171400 112174 71052 94589 165883 229067 249911 210139
10974B10139j1721P969L1247Q5979N2704J29173J41935J66647J93726K06677K75704
$$ 210139 198418 206387 237634 323613 376317 505490 647425 814072 1007798 1214475 1490179
10963A490179J83137K1708j49674j90256k06516j92087j89210j86085j50181r7064
$$ 1490179 1673316 1695024 1545350 1355094 1148578 956491 767281 581196 431015 333951
10953C33951q5048J1474p5553j44449l6173O4218J3360M2179P9637m6422l6155
$$ 333951 248903 260377 184824 40375 4202 68420 81780 123959 203596 157174 121019
10942A21019J642L5890J9896k5719n8142p9218l4750L917K716l1630j2979N0472
$$ 121019 122661 158551 178447 152728 94586 15368 -19382 -15465 -12749 -44379 -57358 -6886
10930f886k097J0695j6910P3862n1119m4953M4176k808J0662M1058p0742k4374
$$ -6886 -8983 1712 -15198 58664 7545 -37408 6768 3960 14622 55680 -15062 -39436
10918c9436P6490K6350k5121m966k0658L385r533n4253L3582M3722l9J8585k090
$$ -39436 37054 63404 38283 33317 12659 16044 6511 -47742 -14160 29562 29523 48108 46018
10905D6018o200P960k8809k9488J5626Q045L7638L881j03494j4803J19477K2216
$$ 46018 39818 47778 18969 -10519 5107 13152 50790 54671 -48823 -63626 55851 78067
10893G8067L956P248m9868l2680j1887L3900K5603L7783k7451l8537N790K9348
$$ 78067 82023 89271 39403 6723 -5164 28736 54339 92122 64671 26134 31924 61272
10881F1272l5005o4444L9552K0719r1026j0371o562n56o9382J5050Q5548L9757
$$ 61272 26267 -38177 1375 22094 -68932 -79303 -85865 -86421 -155803 -140753 -55205 -15448
10869a5448K2280p863J0060P377n272k1623K2071l612P575o156m6450J8904N4478
$$ -15448 6832 -1031 9029 16406 11134 -10489 11582 7970 15545 9389 -37061 -18157 36321
10856C6321K2370K9606O9264j3481j9697L0487L89k6255r214M4609l6879n5217
$$ 36321 58691 88297 157561 144080 124383 154870 155259 129004 119790 164399 127520 72303
10844G2303L589o1759l3003L1055K1734L4294l6050p2716Q351Q5517L1765l0997
$$ 72303 75892 14133 -18870 12185 33919 68213 32163 -40553 -32202 53315 85080 54083
10832E4083P914J3755K2723K407j2902p3456M2176J11609n5926q8869m3501O645
$$ 54083 61997 75752 98475 100882 87980 14524 56700 168309 112383 23514 -19987 -13342
10820a3342o569j3308L0933P6236L8195l2238K8030N157j9939K4779K318l5289
$$ -13342 -19911 -33219 -2286 73950 112145 79907 107937 113094 93155 117934 120252 84963
10808H4963n9658M2445M6644n0526o9620J1131M2858k3168r68K5116P762P377
$$ 84963 25305 67750 114394 63868 -5752 5379 48237 25069 24101 49217 56979 64356
10796F4356M7969o7365p8117J2146J3685K7064l2420j2329K8338N6399K7716j0026
$$ 64356 112325 44960 -33157 -21011 -7326 19738 -12682 -25011 3327 59726 87442 77416
10784G7416q3530O4511j3047o0020l6072j5924P7113O5850L2861O701P547K1852
$$ 77416 -6114 58397 45350 -14670 -50742 -66666 10447 76297 109158 115859 123406 145258
10772A45258l4708l7365j3718l1224l6684J5013j6949j4900J2196N5499L7536
$$ 145258 110550 73185 59467 28243 -8441 6572 -10377 -25277 -13081 42418 79954
10761G9954l4782J1282k8733j7979l5832L9310K5449k4765p0742K0691j962K7780
$$ 79954 45172 56454 27721 9742 -26090 13220 38669 13904 -56838 -36147 -38109 -10329
10749a0329l781l0131q169J9859Q779M679R757P6092l3537k367j5596K5489M1291
$$ -10329 -14110 -44241 -52410 -32551 -23772 -19093 -9336 66756 33219 30852 15256 40745 82036
10736H2036k7169l6991m9502m2451R078o4598o889L1746N8739P2148p334m962
$$ 82036 54867 17876 -31626 -74077 -64999 -129597 -136486 -104740 -46001 26147 18813 13851
10724A3851N1725m3617n0098j3938J7836n4647j6301m4425N4954P5104N8585m3494
$$ 13851 65576 21959 -28139 -42077 -24241 -78888 -95189 -139614 -84660 -9556 49029 5535
10712E535q1641k4673m2692k031L1941M4715o868K7851j7672K0021K5010k7113
$$ 5535 -76106 -100779 -143471 -145502 -113561 -68846 -75714 -47863 -65535 -45514 -20504 -47617
10700d7617k2974M9021J1965j143m6962J0622M7344O940n7424k1447k1944k2943
$$ -47617 -70591 -21570 -9605 -10748 -57710 -47088 256 7196 -50228 -71675 -93619 -116562
10688a16562K8342k8363O6666P5L9319M3321P5678L4672l2944n8047p8114m5794
$$ -116562 -88220 -116583 -49917 -49842 -10523 32798 108476 143148 110204 52157 -25957 -71751
10676g1751k1640O1365Q1058L9486n7411m6468J1677r668m5393l3661J2671M983
$$ -71751 -93391 -32026 49032 88518 31107 -15361 -3684 -13352 -58745 -92406 -79735 -74752
10664g4752K6261K8094P7568P0544j4403K5759K7350k4709k3181j4129K1648k0448
$$ -74752 -48491 -20397 57171 127715 113312 139071 166421 141712 118531 104402 126050 105602
10652A05602K4767O3775Q5785m974L1902J48852J45883J30503R9155L7175M7786
$$ 105602 130369 194144 279929 274955 306857 455709 601592 732095 831250 868425 916211
10641I16211Q0685N0632l1634q8563q2114o3732m5769L6561P4394P8098J20931
$$ 916211 996896 1047528 1015894 927331 845217 781485 735716 772277 846671 924769 1045700
10630A045700J71374K24609K79900L41646M24614M47535L97413L39871K56439
$$ 1045700 1217074 1441683 1721583 2063229 2487843 2935378 3332791 3672662 3929101
10621C929101J50127J42212J98558L70662O06746Q40154J206009J683750K218642
$$ 3929101 4079228 4221440 4419998 4790660 5397406 6237560 7443569 9127319 11345961
10612A1345961K836422L708029M729944N531905N622588M968633L787170K119212
$$ 11345961 14182383 17890412 22620356 28152261 33774849 38743482 42530652 44649864
10604D4649864K30123q39800o44058O75398K758727N421069Q314069J0578058
$$ 44649864 44879987 44040187 43396129 44071527 46830254 52251323 60565392 71143450
10596G1143450J1015640R040249N425476Q74000l683410o204693n570820k488188
$$ 71143450 82159090 91199339 96624815 97498815 93815405 87610712 82039892 79551704
10588G9551704J652408O159915J0608825J3734190J3491916R630509L759015l156859
$$ 79551704 81204112 87364027 97972852 111707042 125198958 134829467 138588482 135431623
10580A35431623r854792j3239920j1871940p964885l504322Q05013M537841O772956
$$ 135431623 125576831 112336911 100464971 92500086 88995764 89800777 94338618 101111574
10572A01111574O493914L853905q1730m575268q414424r564321p701567m186398
$$ 101111574 107605488 111459393 111377663 106802395 98387971 88823650 81122083 76935685
10564G6935685m35052L253261O731728J0232261J3965047J9060224K6693841L6583234
$$ 76935685 76500633 79753894 86485622 96717883 110682930 129743154 156436995 193020229
10556A93020229M3625477M2255788L7246465K2903568m923587k8708669m0588315
$$ 193020229 236645706 278901494 316147959 339051527 334127940 305419271 264830956
10549B64830956m9621277m8076963l6877819k6088339j8575976j3606138j0482803
$$ 264830956 215209679 167132716 130254897 104166558 85590582 71984444 61501641
10542F1501641q282592o566951n432574m446394l640169l101080k592372k114126
$$ 61501641 53219049 46652098 41219524 36773130 33132961 30031881 27439509 25325383
10534B5325383j741069j535259j315836j130791j118680j157717j139754j087484
$$ 25325383 23584314 22049055 20733219 19602428 18483748 17326031 16186277 15098793
10526A5098793j098483r87785q11342o97985o29399o44858n32525m78621m84345
$$ 15098793 14000310 13012525 12201183 11503198 10873799 10228941 9696416 9217795 8733450
10517H733450m00044l59739l18150l83732l36068k36166k48934k29281k47835
$$ 8733450 8333406 7973667 7655517 7271785 6935717 6699551 6450617 6221336 5973501
10508E973501l07994k11961k03398j93749j77028r2566r7177j40667j57484j50708
$$ 5973501 5665507 5453546 5250148 5056399 4879371 4786805 4689628 4548961 4391477 4240769
10498D240769j23599j04048j43301r3761q4612j21754j40659q6424q8066r7716
$$ 4240769 4117170 4013122 3869821 3776060 3691448 3569694 3429035 3342611 3254545 3156829
10488C156829p9709r1207l8760m9181j49730j01462p3747o8138o601M285m6326
$$ 3156829 3077120 2985913 2947153 2897972 2748242 2646780 2573033 2504895 2498294 2502579 2456253
10477B456253Q124p9187j65019j9803L0964M7489l0626m2146p6429q1725o9044
$$ 2456253 2464377 2385190 2220171 2200368 2231332 2278821 2248195 2206049 2129620 2047895 1978851
10466A978851j6227k4860P0433J29465Q9029K27367K79493K52838J50076O9355
$$ 1978851 1962624 1937764 2008197 2137662 2226691 2454058 2733551 2986389 3136465 3205820
10456C205820j30553k01555j90408k71001k69668k14814j49590j15988m8039p5060
$$ 3205820 3075267 2873712 2683304 2412303 2142635 1927821 1778231 1662243 1614204 1539144
10446A539144o2476n0564q9397j02147m6732J0399o4969l7812n6471k6423N729
$$ 1539144 1476668 1426104 1336707 1234560 1187828 1198227 1133258 1095446 1038975 1012552 1018281
10435A018281l7308L9257J4590p4928j9344K8879k1273l8357q572K4694m5360
$$ 1018281 980973 1020230 1034820 959892 940548 969427 948154 909797 901225 925919 880559
10424H80559k4379p9635Q631o1741j4342J2986N9741J0536o1114n6960n8171k5697
$$ 880559 856180 776545 785176 723435 709093 722079 781820 792356 731242 674282 616111 590414
10412E90414L4646N4822m1691j03964K421M073J8102K3474K0694j660k1115j439
$$ 590414 625060 679882 638191 534227 536648 540721 558823 582297 602991 601331 580216 578777
10400E78777q276o894j3260r129k328k8436r79r077l1431P5264K5542n3419J91
$$ 578777 570501 563607 550347 541218 538890 510454 509475 500398 468967 544231 569773 516354 516545
10387E16545J5969J694j9640O140k4642o0174J5375N66k1029M9725M6140n7387
$$ 516545 532514 534208 514568 520708 496066 435892 451267 451833 430804 480529 526669 469282
10375D69282m2536k1865O7100r015p3929J4887j9681j9016P433P4934K0337K3247
$$ 469282 426746 404881 471981 462966 389037 403924 384243 365227 372660 447594 467931 491178
10363D91178m0972m1873O1046j10616p4073n389K092N9077K5308N893N8595P4279
$$ 491178 450206 408333 469379 358763 284690 279301 281393 340470 365778 371671 430266 504545
10351E04545r935l8587N714J2763m7654m2718J1241J5115m3587m4614n0035o073
$$ 504545 494610 456023 461737 474500 426846 384128 395369 410484 366897 322283 272248 266175
10339B66175M779m352j9817J019N5397N9381Q685o395q8022m2894Q3078N3494
$$ 266175 270954 266602 246785 247804 303201 362582 371267 364872 276850 233956 317034 370528
10327C70528L3141R886m3800l4387L8620k9094K1396K2151l0342l7878R434j6941
$$ 370528 403669 413555 369755 335368 373988 344894 366290 388441 358099 320221 329655 312714
10315C12714m2205l5089O1051P2494k8015j4230K8156M1601J7310j9235j2057
$$ 312714 270509 235420 296471 368965 340950 326720 354876 396477 413787 394552 382495
10304C82495K5923K9786o5756j14423k8382L1647p401k3186j3231Q724j971l4848
$$ 382495 408418 438204 372448 258025 229643 261290 253889 230703 217472 226196 224225 189377
10292A89377q515J7096P942o018l2477o7812L0415L7615K1322l0573K3405N1543
$$ 189377 180862 197958 205900 199882 167405 99593 130008 167623 188945 158372 181777 233320
10280B33320l49P267p830k2619l3515Q5723N8724n3210r5009n0524Q78N8245O6894
$$ 233320 232971 240238 232408 209789 176274 261997 320721 267511 172502 121978 122856 181101 247995
10267B47995N9144k2178o5342L144N1087K5173R781l4849q7614o0362l4635N3808
$$ 247995 307139 284961 219619 222763 273850 299023 308804 273955 186341 125979 91344 145152
10255A45152O0750J2160P484m795m1856K9920M1124k8911j5630k2391o9371J8490
$$ 145152 205902 218062 225546 220751 178895 208815 249939 221028 205398 183007 113636 132126
10243A32126K3384m1004r5703M8217M4479L584j9891L9849J3949J2952r123j3209
$$ 132126 155510 114506 18803 67020 111499 115083 95192 135041 148990 161942 152819 139610
10231A39610N8387L8692k8587k7294P921M7849k6318m2293O640m2793J5614J8357
$$ 139610 197997 236689 208102 180808 188729 236578 210260 167967 174607 131814 147428 165785
10219A65785M4994l780p5549j9703K110r961l6322J9434N7975L4531l7551l3317
$$ 165785 210779 206999 131450 111747 113857 103896 67574 87008 144983 179514 141963 108646
10207A08646K1430K5211K489J1102L1093m2805J664J29445L9338o5527q2101k2887
$$ 108646 130076 155287 157776 168878 199971 157166 158830 288275 327613 262086 179985 157098
10195A57098L0581M1982J6394q113p7759j7494k29J9774K1376m5738n2600K7419
$$ 157098 187679 229661 246055 237942 160183 142689 142460 162234 183610 137872 85272 112691
10183A12691j7925K3403K1211J0881K2603N761m1855k0146K8821O015J0641R526
$$ 112691 94766 118169 139380 150261 172864 178625 136770 116624 145445 151460 162101 171627
10171A71627M7695M3732M8300O6049J7415L0122L6471K1468n9826K6641R8998
$$ 171627 219322 263054 311354 377403 394818 424940 461411 482879 423053 449694 548692
10160E48692O0654R8237R2865K1565p7440q9576n306J1092P942j5229L0469J60396
$$ 548692 609346 707583 800448 822013 744573 654997 649691 660783 668725 653496 683965 844361
10148H44361J47888Q5756N2901O5548J02697Q1251J58049J39653J59812J77698
$$ 844361 992249 1078005 1130906 1196454 1299151 1380402 1538451 1678104 1837916 2015614
10138B015614J50208L4720o8633r8933j89859k20553k25799j64099j53495k06229
$$ 2015614 2165822 2200542 2131909 2032976 1843117 1622564 1396765 1232666 1079171 872942
10128H72942q8119l3685j3036n0801o6054k5517o8369j8243M3004o7847q4614
$$ 872942 784823 751138 738102 687301 621247 595730 527361 509118 552122 484275 399661
10117C99661n7829j5678l7094l8236L6400k4731m9831L45j830K8409L1019k6202
$$ 399661 341832 326154 289060 250824 287224 262493 212662 213007 211177 239586 270605 244403
10105B44403m1601j0663l2135o7326R7602R4554m7941m6337j9964K9471m4124
$$ 244403 202802 192139 160004 92678 190280 284834 236893 190556 170592 200063 155939
10094A55939j5732k584K054J7276L6474L90j7948K2633K6398k9508j0179j5222
$$ 155939 140207 137623 139677 156953 193427 193817 175869 198502 224900 195392 185213 169991
10082A69991O883K045N3768P681P362M691j3413p461k710r589j5306m2089M8730
$$ 169991 176874 178919 232687 240368 247730 252421 239008 231547 228837 219248 203942 161853 210583
10069B10583j6705o3869K880J9301J9858k0908j6711j5535J2989j8714k8346q019
$$ 210583 193878 130009 132889 152190 172048 151140 134429 118894 131883 113169 84823 76804
10057G6804k8096L3879N8557n9412k0113J5977k8117n6838j875N6299P0679j0069
$$ 76804 48708 82587 141144 81732 61619 77596 49479 -7359 -9234 47065 117744 107675
10045A07675L007O2034j7719m6663l2137M4971O8221O745j3040l1984O380K8965
$$ 107675 110682 172716 154997 108334 76197 121168 189389 196134 183094 151110 157490 186455
10033A86455J748J0613l7694m5797P762K0887k4838l7518j913J9532M280M7329
$$ 186455 188203 198816 161122 115325 123087 143974 119136 81618 79705 99237 103517 150846
10021A50846K9170k7501l7639J6867M7821n169l3730o3263L2640J3472m8965J309
$$ 150846 180016 152515 114876 131743 179564 174395 140665 77402 110042 123514 74549 75858
10009G5858L0594M7840k5501l7616k4780k4492j8086L4636L6362O0677J332k4827
$$ 75858 106452 154292 128791 91175 66395 41903 23817 58453 94815 155492 156824 131997
9997A31997L2153m5312j8639M7087K8168j9745p5083r702L4273l93J9076M9587
$$ 131997 164150 118838 100199 147286 175454 155709 80626 70924 105197 104804 123880 173467
9985A73467j02975n6437N7180K4790k2203O520l574l8648J7300N7593M3283l3411
$$ 173467 70492 14055 71235 96025 73822 80342 76768 38120 55420 113013 156296 122885
9973A22885j03548j3011N041K6011J4136N0216J6370n191N9187J8222j9984q606
$$ 122885 19337 6326 11367 37378 51514 101730 118100 112909 172096 190318 170334 161728
9961A61728k212J2480j6854J0770K0042j4502n6732m5265K5164l396j9285l0311
$$ 161728 159516 171996 155142 165912 185954 171452 114720 69455 94619 91223 71938 41627
9949D1627L4012P968l8279l9121K7138R577O3188K5502l7998m8276R340M6466
$$ 41627 75639 83607 45328 6207 33345 42922 106110 131612 93614 45338 54678 101144
9937A01144k0531J6796K2781K0147q470n6344r9793L2784M5960M979R1381N5744
$$ 101144 80613 97409 120190 140337 131867 75523 -24270 8514 54474 59453 150834 206578
9925B06578Q3357K20046J56391K0249L2077k2343k07195j76926j19049k5064L0506
$$ 206578 289935 509981 666372 686621 718698 696355 489160 312234 193185 168121 198627
9914A98627k0545J0913r684k1305l3147L1782L4096l8113j5273k5901P199K464
$$ 198627 178082 188995 179311 158006 124859 156641 190737 152624 137351 111450 118649 121113
9902A21113J9338N2296R767J3643n9026k7380m5182q223J1000j7283K5621N1969
$$ 121113 140451 192747 202514 216157 157131 129751 84569 76346 87346 70063 95684 147653
9890A47653r450o7601k5111j7452q352K9060k0715L338m026p508K62P6266J0086
$$ 147653 138203 70602 45491 28039 19687 48747 28032 31370 27344 19836 20098 96364 106450
9877A06450M240j3616l4149k8925L7111K5908Q521N2016l276p5229k5043Q834
$$ 106450 110690 97074 62925 34000 71111 97019 105540 157556 154280 79051 54008 62842
9865F2842M3819q768j7649j7117J6244L0424M1877n6131o345M4467m4771p5474
$$ 62842 106661 97893 80244 63127 79371 109795 151672 95541 89196 133663 88892 13418
9853A3418K076K1663K8584J3334M411p271O0323K600k4461n0090l2665K6939q757
$$ 13418 15494 37157 65741 79075 83486 76215 136538 139138 114677 64587 31922 58861 50104
9840E0104L3894m8125J988K1107m1509R440K7017N3477P045j5311M963j4764L3582
$$ 50104 83998 35873 37861 58968 17459 26899 53916 107393 114438 99127 104090 89326 122908
9827A22908J3478o0899j6479j301j6744M9572L0838P10k7424k0028n3091l6608
$$ 122908 136386 75487 59008 57707 40963 90535 121373 122083 94659 74631 21540 -15068
9815a5068L4949L8972J3291m9642n2581L2470l3707K6165K5746j099o3801K1999
$$ -15068 19881 58853 72144 22502 -30079 2391 -31316 -5151 20595 19496 -44305 -22306
9803b2306P2034K4151l5142k6392J9069n044K0441k5332o2095j5469Q596K8357
$$ -22306 49728 73879 38737 12345 31414 26370 46811 21479 -40616 -56085 -47489 -19132
9791a9132k5036K0032L0066L2452P2020J6957j1597l9334K8529j4599n3359k7365
$$ -19132 -44168 -24136 5930 38382 110402 127359 115762 76428 104957 90358 36999 9634
9779I634N9901P814l930K7175Q017M2049L3768j010J11319J91621J44841L2900
$$ 9634 69535 77349 73419 100594 108611 150660 184428 183418 294737 486358 631199 664099
9767F64099n1461r2258r6867j89333j11433j0625k78k6345N227n2912L2690O4211
$$ 664099 612638 520380 423513 234180 122747 112122 111844 85499 90726 37814 70504 134715
9755A34715n0101N338m3871k9802L8345P5592J442O661k1876R929N3669j0054
$$ 134715 84614 89952 46081 16279 54624 130216 131658 138319 116443 126372 180041 169987
9743A69987l7153l4503J3175n74l7545j3233l8982J2058J070o1083j3263J6301
$$ 169987 132834 98331 111506 110932 73387 60154 21172 33230 34300 -26783 -40046 -23745
9731b3745L5619L3247m5514N8438Q8902l3081o3606j0943M4335K8503m9119m0892
$$ -23745 11874 45121 -393 58045 146947 113866 50260 39317 83652 112155 63036 22144
9719B2144J7170O317l4474k4604O9132n2539p2779O298O9160j3358m0688L5299
$$ 22144 39314 45631 11157 -13447 55685 3146 -69633 -63335 5825 -7533 -48221 -12922
9707a2922N3326l031J609J2739l1578l6291l019K6622j0378k9078K8819j1376
$$ -12922 40404 37373 38982 51721 20143 -16148 -19167 7455 -2923 -32001 -3182 -14558
9695a4558J8108K8741n389l2104K7955J7790J5761k7728r932k1666L1631M3399
$$ -14558 3550 32291 26902 -5202 22753 40543 56304 28576 18644 -3022 28609 72008
9683G2008k1162R600K8967m8426p9438k0393N2267O1613l212l5513J2908M2011
$$ 72008 50846 60446 89413 40987 -38451 -58844 -6577 55036 51824 16311 29219 71230
9671G1230j2077n5257N8922L4767l9337j7034r924j4284L5461O6567j6579J5495
$$ 71230 59153 3896 62818 97585 58248 41214 31290 17006 52467 119034 102455 117950
9659A17950o106R497l0427k2891Q3712k6105L988P215r193k934J4628J2546M0551
$$ 117950 111844 121341 90914 68023 151735 125630 129618 136833 127640 124706 139334 151880 192431
9646A92431R4288Q3238M5127N4158N2504k8437p1990j63471j20827M2010l8034
$$ 192431 286719 369957 415084 469242 521746 493309 421319 257848 137021 179031 140997
9635A40997j6147M895k5281J8116N0731j7503l5700o3434r5070K5553K6863l6854
$$ 140997 124850 129745 104464 122580 173311 155808 120108 56674 -38396 -12843 14020 -22834
9623b2834n2216k2377J5500r263j1888L5645L3065N6693R5699l5742m7768J1467
$$ -22834 -75050 -97427 -81927 -91190 -103078 -67433 -34368 22325 118024 82282 34514 45981
9611D5981Q319J4201L3257J0859k0355k2105k8167m6825n4181Q2694M5365K0554
$$ 45981 54300 68501 101758 112617 92262 70157 41990 -4835 -59016 23678 69043 89597
9599H9597m3867n4290K1396l5291j3453J8726M3568P5548P663K6971j8992L6390
$$ 89597 45730 -8560 12836 -22455 -35908 -17182 26386 101934 109597 136568 117576 153966
9587A53966m9688m0366m3641K0506J2369l4182L023J7862j6652J6349K8716L1866
$$ 153966 104278 63912 20271 40777 53146 18964 21987 39849 23197 39546 68262 100128
9575A00128k0578J2540n3612p930K141k6441K0374R266P280p1484l1171K2221
$$ 100128 79550 92090 38478 30548 32689 6248 26622 35888 43168 -28316 -59487 -37266
9563c7266N5628l1383K5926k0510k079O2245M5010k2509o4539j0333J3146N4840
$$ -37266 18362 -13021 12905 -7605 -9684 52561 97571 75062 10523 190 13336 68176
9551F8176J0427L312k3201R425j359M2594k49q456j4733p080J9461L6001l9996
$$ 68176 78603 81915 58714 68139 66780 109374 109125 100669 85936 78856 98317 134318 94322
9538I4322m2473P4252P1086K1245j2070m7643j17094o6938Q855K5727M9726K3609
$$ 94322 51849 126101 197187 218432 206362 158719 41625 -25313 -16458 9269 58995 82604
9526H2604m0575l3952K0202L8393J365m4586l9351L4959N249k0953k4312m120
$$ 82604 42029 8077 28279 66672 68037 23451 -15900 19059 24308 3355 -20957 -25077
9514b5077R712q903K9131n0339l7017L8707L8115j8286l7263R553J04867R2345
$$ -25077 -15365 -24268 4863 -45476 -82493 -43786 -5671 -23957 -61220 -51667 53200 145545
9502A45545m8466k7061m1522J1141P88L7591j9569L854j04499j6197J3254l091
$$ 145545 97079 70018 28496 39637 40425 78016 58447 62301 -42198 -58395 -45141 -48232
9490d8232J7588j9275o155J1180M1733l9241k6792M2037J6850J5590Q642j9230
$$ -48232 -30644 -49919 -56074 -44894 -3161 -42402 -69194 -27157 -10307 5283 13925 -5305
9478e305M0208Q324O821L3585K2189L971m3603J5468L3522k2879o495M915j2676
$$ -5305 34903 43227 50048 83633 105822 109793 66190 81658 115180 92301 85806 90721 78045
9465G8045n2723r83K9808K5491k456q780q017j8863m6023n5459K6019N9109L122
$$ 78045 25322 24339 54147 79638 77182 68402 60385 41522 -4501 -59960 -33941 25168 28290
9452B8290j4253J5318J9882n2784N068q207l5057J6766P438j1359n755p9890o1349
$$ 28290 14037 29355 49237 -3547 1521 -6686 -41743 -24977 -17539 -28898 -34653 -114543 -175892
9439a75892M4514O4316K7230M3707J1206M5715J2463m569K9615l3728k5683n205
$$ -175892 -131378 -67062 -39832 3875 15081 60796 73259 68690 98305 64577 38894 33689
9427C3689j5524N3284Q1813r2493q2119m3472k872m167k3471k2282R5290R5317
$$ 33689 18165 71449 153262 60769 -21350 -64822 -67694 -71861 -95332 -117614 -22324 72993
9415G2993J3404o7493n4559m1685Q2130O4793L0630K5429n9601l6629k9375k0807
$$ 72993 86397 18904 -35655 -77340 4790 69583 100213 125642 66041 29412 37 -20770
9403b0770M7118M3790j3489k6867m0583k0431j8108L2954M8421l8911o4948j5228
$$ -20770 26348 70138 56649 29782 -10801 -31232 -49340 -16386 32035 -6876 -71824 -87052
9391h7052J6658P5452K6217M89q296L6263L4297j6436l9498J6543L0837j7461
$$ -87052 -70394 5058 31275 31764 23468 59731 94028 77592 38094 54637 85474 68013
9379F8013K5442j7654k8527l3718Q72J0889M6632j6923n7353k5368J11997K4554
$$ 68013 93455 75801 47274 13556 14428 25317 71949 55026 -2327 -27695 84302 108856
9367A08856o406q743j8605L1570l5450n2814q48J4313J5060J41r9876M032Q8411
$$ 108856 102450 93707 75102 106672 71222 18408 17560 31873 46933 47074 -52802 -48770 39641
9354C9641N207m002O094R568j8973j4633J3189o55l5732o6140J8863M2375L756
$$ 39641 44848 40846 46940 56508 37535 22902 36091 35436 -296 -66436 -47573 -5198 -1442
9341a442M2588K638l6581j7648J7975J3267O249M3062n167j7456K4170k2289l774
$$ -1442 41146 43784 7203 -10445 7530 20797 27046 70108 64941 47485 71655 49366 45592
9328D5592N1114P2505p9535m6823o435o9518o824M3462K4583P7406Q242m7458
$$ 45592 96706 169211 89676 42853 36418 -33100 -39924 3538 28121 105527 113769 66311
9316F6311q0243o701M2272N1265J7865M4549K1287o5589p4733K7435n48K4142
$$ 66311 -13932 -20633 21639 72904 90769 135318 156605 91016 16283 43718 43170 67312
9304F7312q9560o1392N3915J04294M6785j6561M3211J8120n4316k9967o1472m4483
$$ 67312 -22248 -83640 -29725 74569 121354 104793 148004 166124 111808 81841 20369 -24114
9292b4114m2583J7820j17n826M1596J5485p9671K6542J6051k4177M9558R7621
$$ -24114 -66697 -48877 -48994 -54820 -13224 2261 -77410 -50868 -34817 -58994 -9436 88185
9280H8185l444j8457o3572k6526j3117m1639J5364L7017R0420O2402O6095k2817
$$ 88185 84741 66284 2712 -23814 -36931 -78570 -63206 -26189 64231 126633 192728 169911
9268A69911o761r1804r9959n3201L9924K8233M3426J3481n5649l9346J1886L5428
$$ 169911 163150 71346 -28613 -81814 -41890 -13657 29769 43250 -12399 -51745 -39859 -4431
9256d431Q635K438j3103k3200L0600K1416o1557J6048M8554P204o0250J6998O2375
$$ -4431 4204 6642 -6461 -29661 939 22355 -39202 -23154 25400 32604 -27646 -10648 51727
9243E1727P036J3618Q455n6743m6363k9780l5995L8855J9068L5092L6724r044
$$ 51727 58763 72381 80836 24093 -22270 -52050 -88045 -49190 -30122 4970 41694 32650
9231C2650o1107o5015K3682N1258Q958J9397J3293o5534J5303M3959j6837J2282
$$ 32650 -28457 -93472 -69790 -18532 -9574 9823 23116 -42418 -27115 16844 7 12289
9219A2289l3544O17J2845j7785j1744J738N1076Q652m5687k3817n7877k4125J1605
$$ 12289 -21255 -20638 -7793 -25578 -37322 -35584 15492 24144 -21543 -45360 -103237 -127362 -115757
9206a15757j8955L4524N9887P9978j3393N078J3840p66k4756J9891k3658J165
$$ -115757 -134712 -100188 -40301 39677 26284 31362 45202 44436 19680 39571 15913 17078
9194A7078J8798r752K9300J9426J5928L4828l5206l1775k3813K1913l02J9896
$$ 17078 35876 26124 55424 74850 90778 125606 90400 58625 34812 56725 56423 76319
9182G6319R434p9931m8835J811P3602M5838k0042K1565k0643l413J1538m4250
$$ 76319 85753 5822 -43013 -41202 32400 78238 58196 79761 59118 55705 67243 22993
9170B2993j7641J2918K747l5671r780R030j8874P3888J7694l6418P5789j1251
$$ 22993 5352 18270 21017 -14654 -24434 -15404 -34278 39610 57304 20886 96675 85424
9158H5424p9032n6698k6797M1205L4689Q007J0553K1817L8667M0716k6300m4808
$$ 85424 6392 -50306 -77103 -35898 -1209 6798 17351 39168 77835 118551 92251 47443
9146D7443m8123K9444P671L9775N2616K544l0267m6818k7082j5864k0522K233
$$ 47443 -680 28764 36435 76210 128826 131370 101103 54285 27203 11339 -9183 -6950
9134f950l69J9826k425P288M2835l1816l476m1006j3503K7854L8883N7794k3950
$$ -6950 -7319 12507 10082 17370 60205 28389 24913 -16093 -29596 -1742 37141 94935 70985
9121G0985k1094n0573M9604M5824r397K4528J7769n8563l550R0497k9573j0236
$$ 70985 49891 -682 48922 94746 85349 109877 127646 69083 65533 156030 126457 116221
9109A16221n9212p9147N7820O0787n4255j2758M1504k7205l3924M9594K0230l3136
$$ 116221 57009 -22138 35682 96469 42214 29456 70960 43755 9831 59425 79655 46519
9097D6519J8007N976m690l5177m572J6147q335J8274k5554j7017N0282j8977P996
$$ 46519 64526 70502 65812 30635 26063 42210 33875 52149 26595 9578 59860 40883 48879
9084D8879M1547j1490M48j9369l092Q767m8096r9564J5409l450O525j1646O9960
$$ 48879 90426 78936 79384 60015 56923 65690 17594 -81970 -66561 -70011 -63486 -75132 -5172
9071e172P9418K9964N025m1228m8469m2536K0372o086Q8115l2005q9565J590k7285
$$ -5172 74246 104210 109235 68007 19538 -22998 -2626 -8712 79403 47398 -42167 -40577 -67862
9058f7862O8892m8816K339J7795j8390M6120O6309L9743l8474k3568L2887J6318
$$ -67862 1030 -47786 -45447 -27652 -46042 78 66387 106130 67656 44088 76975 93293
9046I3293l4346l326j7898k618m1059n5506k6109N7906O42m3664l2283O0568O8848
$$ 93293 58947 55621 37723 35105 -5954 -61460 -87569 -29663 -29021 -72685 -104968 -44400 24448
9033B4448M8920J7513n00M0215J3829k9889o1618m0490O688M903J353K6310L1146
$$ 24448 73368 90881 90381 130596 144425 114536 52918 12428 19116 24019 25372 51682 82828
9020H2828p923o2479R869l9700p7283L7825K2341L5421N5575J5176P641p0702
$$ 82828 74905 12426 22295 -17405 -94688 -56863 -34522 899 56474 71650 79291 8589
9008H589o1217k5687O3181J9751p1098j9454l2725O7682R4602Q0156q474j53000
$$ 8589 -52628 -78315 -15134 4617 -66481 -85935 -118660 -50978 43624 123780 115306 -37694
8996c7694m8638L3754N1467O4559J5495o7254n73n859M8384K265l3266O426Q592
$$ -37694 -86332 -52578 -1111 63448 78943 11689 11116 5257 53641 55906 22640 29066 37658
8983C7658p416N397L4872k5719m0869l0980k2027O3157N7808K4275l7029m4206
$$ 37658 30242 35639 70511 44792 3923 -27057 -49084 14073 71881 96156 59127 14921
8971A4921L1475K2385j4344m2766K3422l2069n0854M7503O0788m1653p4351j1779
$$ 14921 46396 68781 54437 11671 35093 3024 -47830 -327 60461 18808 -55543 -67322
8959f7322K4027K4312J7837k1231K5289N7661j4421k1936l5167O1229K2280j7888
$$ -67322 -43295 -18983 -1146 -22377 2912 60573 46152 24216 -10951 50278 72558 54670
8947E4670o3899n2840j0535k399m4885K0404P2882M5040J1781j1727J5357N0218
$$ 54670 -9229 -62069 -72604 -75003 -119888 -99484 -26602 18438 30219 18492 33849 84067
8935H4067J27m332p8799J0538M4794j308n3607K9751J1505k3147m5003J9225O180
$$ 84067 84194 79862 1063 11601 56395 55087 1480 31231 42736 19589 -25414 -6189 -9
8922ik4290K4566k367Q261J6337K2816k6488o018M400O614l060L959j6225L598
$$ -9 -24299 267 -2100 6161 22498 45314 18826 12808 17208 23822 20762 24721 8496 12094
8908A2094R306K6660K58j699j6260j187k2710K7675k4980M9840M4126l714p9193
$$ 12094 21400 48060 48318 46619 30359 29172 6462 34137 9157 58997 103123 99409 20216
8895B0216J7182O4001p867n1106j5525O2945k8243r8668n270O8591k0623l357
$$ 20216 37398 101399 93532 42426 26901 89846 61603 -37065 -42335 26256 5633 2276
8883B276M1741K734l7192k1423J6586J9736L8031j2712K0015N376P089j2604N210
$$ 2276 44017 46751 9559 -11864 4722 24458 62489 49777 69792 75168 82257 69653 74863
8870G4863K2654k3896j6298m3826p6386l2112M4149N3422K7594l572m3626l044
$$ 74863 97517 73621 57323 13497 -62889 -95001 -50852 2570 30164 26592 -17034 -20078
8858b0078L5614K0115L2203l180n6409P368L8079n0374o7868N6428K7441o6036
$$ -20078 15536 35651 67854 64674 8265 15633 53712 3338 -64530 -8102 19339 -46697
8846d6697k6891k3573M5505K9493K4765O5748K4832n5671m2657N0184K028J8882
$$ -46697 -73588 -97161 -51656 -22163 2602 68350 93182 37511 -5146 45038 47066 65948
8834F5948J8967l4867n3771k7697L9393K476l4340j3506N9903m9792j3264M0059
$$ 65948 84915 50048 -3723 -31420 7973 10449 -23891 -37397 22506 -27286 -40550 -491
8822d91j7517K1534J9427p463o2010K4206m358m2575r51M1224n689N116m142J9926
$$ -491 -18008 3526 22953 15490 -46520 -22314 -26672 -69247 -70198 -28974 -34663 -29547 -33689 -13763
8808a3763j135P420L6976Q942j2076J5657n4143k7904K2591J9629k3967K7432
$$ -13763 -14898 -7478 29498 38440 26364 42021 -12122 -40026 -17435 2194 -21773 5659
8796E659J4050R661j0030n249j8166J8010K9069k1216m239k8361M6617M2053q777
$$ 5659 19709 29370 19340 14091 -4075 13935 43004 21788 17549 -10812 35805 77858 69081
8783F9081m696k0647o0663m3018m592L0049P5243L1058j9394K9773K0338P169
$$ 69081 64385 43738 -16925 -59943 -64535 -34486 40757 71815 52421 82194 102532 109701
8771A09701k0236L8536n947j5379L7137J5723k8743q317k5330q8530k7413k9268
$$ 109701 89465 128001 122054 106675 143812 159535 130792 122475 97145 8615 -18798 -48066
8759d8066M7673M6231j7665m2837m4915K8988R1656Q67n026M4481l8514q655k0899
$$ -48066 -393 45838 28173 -14664 -59579 -30591 61065 61932 56906 101387 62873 54218 33319
8746C3319k7855K6705K681k2403q647j4209K2820N4839L7909r693k4312l8934
$$ 33319 5464 32169 34850 12447 3800 -10409 12411 67250 105159 95466 71154 32220
8734C2220k588J4911L616j6750L334L1963L5762J0211n3778j3434o280L0695k9447
$$ 32220 29632 44543 48159 31409 34743 66706 102468 112679 58901 45467 39187 69882 40435
8721D0435j08095J1928P1938j6834O641J2538P77J3918j6938j8259J93k636K40
$$ 40435 -67660 -55732 16206 -628 6013 18551 19328 33246 16308 -1951 -1758 -4394 -4154
8708d154K8867M3433j7373o6228l0130k0660N843j0987K3502L4309j6890l437
$$ -4154 24713 68146 50773 -15455 -45585 -66245 -60402 -71389 -47887 -13578 -30468 -33905
8696c3905M7335L445q693q857j4383j0658M2270J3604K8023m4572q880L3252J1983
$$ -33905 13430 16875 8182 -675 -15058 -25716 16554 30158 58181 13609 4729 37981 49964
8683D9964N609K4186J6548J6182n7333l8465J3507P1793L6191q4791m8586l1454
$$ 49964 55573 79759 96307 112489 55156 16691 30198 101991 138182 53391 4805 -26649
8671b6649J7466N5106K4981k3558j7839q2458l7126N7997K9547J540K4579L467
$$ -26649 -9183 45923 70904 47346 29507 -52951 -90077 -32080 -2533 -993 23586 27053
8659B7053M1786n4222n8094K6372J1384M002M2398K779K4913k7055j1106l4551
$$ 27053 68839 14617 -43477 -17105 -5721 -1719 40679 43458 68371 41316 30210 -4341
8647d341n3359l5527L7605M8542N067M361L2844J3566L825l0913L5860O6143L2037
$$ -4341 -57700 -93227 -55622 -7080 -2013 2348 35192 48758 52583 21670 57530 123673 155710
8634A55710o6679j9351j048n2667J4297k9552m9335O230P2404J7734J9392K190
$$ 155710 89031 69680 68632 15965 30262 710 -48625 -42395 30009 47743 67135 69325
8622F9325n2914j7460L5682N0548m3710j0613K3045q605p539m649l0606j8772
$$ 69325 16411 -1049 34633 85181 41471 30858 53903 45298 37759 33110 2504 -16268
8610a6268p09M0559j3367J2929L3709P6263m888o4935l7408m4853L4284J095n354
$$ -16268 -16977 23582 10215 23144 56853 133116 128228 63293 25885 -18968 15316 16411 11057
8597A1057k093o629j5963K6916J9857k8588Q520P589R060m3287P520O6920K5593
$$ 11057 8964 2335 -13628 13288 33145 4557 13077 20666 29726 -13561 -6041 60879 86472
8584H6472P785k4546K8199K2591Q735k9775K7197l8414J5931k8513l1058P005
$$ 86472 94257 69711 97910 120501 129236 99461 126658 88244 104175 75662 44604 51609
8572E1609M5687L7391K4043l7548k3587M0872P261L583N1321n230p6330j9325
$$ 51609 97296 134687 158730 121182 97595 138467 145728 149311 200632 195402 119072 99747
8560I9747N3017m2474k0325J9227k7975K5092l779q284j600K5980J4315q2388
$$ 99747 152764 110290 89965 109192 81217 106309 102530 94246 92646 118626 132941 50553
8548E0553n3115L9507K1474J6732L0570K8293J5297l2453O277J5789l6588k6152
$$ 50553 -2562 36945 58419 75151 105721 134014 149311 116858 123135 138924 102336 76184
8536G6184j2500l8158L1739P6282O0137l6159p3724l7776P801M8687J3252j2822
$$ 76184 63684 25526 57265 133547 193684 157525 83801 46025 53826 102513 115765 102943
8524A02943O0449N1238M3761j8528N5869p2718p7790l8630J2690l9234k4968r510
$$ 102943 163392 214630 258391 239863 295732 223014 145224 106594 119284 80050 55082 45572
8512D5572o9289j8850O0363P7683j2693J2478J9825n1582J0118p410P396J2373
$$ 45572 -23717 -42567 17796 95479 82786 95264 115089 63507 73625 66215 73611 85984
8500H5984j2475j4480P797J4879k371m996l3010k9853o015L618q195l3255j0745
$$ 85984 73509 59029 66826 81705 79334 74338 41328 11475 5460 9078 883 -32372 -43117
8487d3117J2713M5525m990n1716K456Q1380J9766L7801K5850J7860P3963O5263
$$ -43117 -30404 15121 10131 -41585 -39129 42251 62017 99818 125668 143528 217491 282754
8475B82754j1336l2295p7522O408j8830L0970l6047n4400j1593L3783L684o5001
$$ 282754 271418 239123 161601 168009 149179 180149 144102 89702 78109 111892 115576 50575
8463E0575l2517j5372K9843J6581n5010J314r740R876O9680j0939m4646l003K0695
$$ 50575 18058 2686 32529 49110 -5900 -4586 -14326 -4450 65230 54291 9645 6642 27337
8450B7337k9866J1004j9974L8905j3199k5259M3368O9979O335j7241k5178K864
$$ 27337 -2529 8475 -11499 27406 14207 -11052 32316 102295 108630 91389 66211 69075
8438F9075N5067R4113J24231Q2900Q6421J30608J24531J25420R3254k8077j25955
$$ 69075 124142 218255 342486 425386 511807 642415 766946 892366 985620 957543 831588
8427H31588j56253j93483j07121r2330n8959l3417J1034L8683j0136k4744j6553
$$ 831588 675335 481852 374731 282401 223442 190025 201059 239742 229606 204862 188309
8416A88309j3762J1137l808J4057n754l0672o0648n0536j2206L249K3723L285
$$ 188309 174547 185684 181876 195933 190179 159507 98859 48323 36117 39366 63089 66374
8404F6374N600O755P946M3158O965J5354M5140M2449j0803mJ3936j9008j5041
$$ 66374 71974 78729 86675 129833 136798 152152 197292 239741 228938 228934 242870 223862 208821
8391B08821O7720K00892K08211K75908K74453K72957J81149N5304o6041j72461
$$ 208821 276541 477433 685644 961552 1236005 1508962 1690111 1745415 1679374 1506913
8381A506913k87772l07823k05764j75053j19172n4905n0496J2704l2268r6883
$$ 1506913 1219141 911318 705554 530501 411329 356424 305928 318632 286364 189481
8371A89481r9721m7275j1517j1539O0650M7527K3659l4879j8449m9950p271K6960
$$ 189481 89760 42485 30968 19429 80079 127606 151265 116386 97937 47987 40716 67676
8359F7676J5308q316p956R6594l39m6802m0997m1169L4610K513N1775j580L0971
$$ 67676 82984 74668 66712 163306 162967 116165 75168 33999 68609 71122 122897 121317 152288
8346A52288K7718O9034P8690M1948J17673J61003J17074M9762N3014m8823j33827
$$ 152288 180006 249040 327730 369678 487351 648354 765428 815190 868204 819381 685554
8335F85554j42748j01232l4435k6164p6992m7094n8180n0729l0496K7184Q146
$$ 685554 542806 441574 407139 380975 303983 256889 198709 147980 117484 144668 152814
8324A52814n6730p437j5353j1745l2514N8479j3937n1513J6705J7367j1633k9033
$$ 152814 96084 88647 73294 61549 29035 87514 73577 22064 38769 56136 44503 15470
8312A5470q052m4252o3208M6223Q4229M995M1656m1309o9889K3303O3191K1782
$$ 15470 7418 -36834 -100042 -53819 30410 35405 77061 35752 -34137 -10834 52357 74139
8300G4139k6860n0943l6931O909N3904O789m7089J5504L6526K5681R459p802l3618
$$ 74139 47279 -3664 -40595 -33686 20218 27007 -20082 -4578 31948 57629 67088 59286 25668
8287B5668J5876K0207j0616q9159l7098Q127K513K3975m5298Q568J9332k9229
$$ 25668 41544 61751 51135 -38024 -75122 -66995 -64482 -40507 -85805 -77237 -57905 -87134
8275h7134O8392R4521O15l902L1548r277j1535j963l7277m2299K1965m301J8285
$$ -87134 -18742 75779 76394 72492 104040 94763 83228 81265 43988 1689 23654 19353 37638
8262C7638j8542k6237k3817m1302m344K5332N837k5732L293R479m3952M440J8172
$$ 37638 19096 -7141 -30958 -72260 -76604 -51272 -45435 -71167 -67874 -58395 -102347 -97907 -79735
8249g9735K3013M889J9780p491O5221L9901m1570j3283j0367l3287J1830k159
$$ -79735 -56722 -51833 -32053 -39544 25677 65578 24008 10725 358 -32929 -21099 -23258
8237b3258J0313r971k852J097L7724m567k4286K151p0193l0437L4040N8822J8402
$$ -23258 -12945 -22916 -25768 -24671 13053 8486 -15800 -13649 -83842 -114279 -80239 -21417 -3015
8224c015m6834j5690J4922N0540M0354k6322j0544N4574k3241j4923O5593j9716
$$ -3015 -49849 -65539 -50617 -77 40277 13955 3411 57985 34744 19821 85414 65698
8212F5698q3681k5255M9281j1929j7440N753k2527l7440M5326J43474l2842o9545
$$ 65698 -17983 -43238 6043 -5886 -23326 -17573 -40100 -77540 -32214 111260 78418 8873
8200H873m6995P7595N3160m0047q3098J206j555l8176k728N0531N3831K8215p114
$$ 8873 -38122 39473 92633 52586 -30512 -29306 -30861 -69037 -71765 -21234 32597 60812 53698
8187E3698l4527k7265j4370K7046j9513l8419J6975K0037L331K8312J5510J1078
$$ 53698 19171 -8094 -22464 4582 -14931 -53350 -36375 -16338 -13007 15305 30815 41893
8175D1893J6564j5466J4939K8056K6693j8150l6953l0628q1755J5824L0750m404
$$ 41893 58457 42991 57930 85986 112679 94529 57576 26948 -54807 -38983 -8233 -12637
8163a2637L6694j4116k3987n978m9069P2443M1648j6016n7507n6797K9198O8132
$$ -12637 24057 9941 -14046 -20024 -69093 3350 44998 28982 -28525 -85322 -56124 12008
8151A2008j9539P916J9773j3895m5512L945J7016m5786L329j0006J4717k7464
$$ 12008 -7531 385 20158 6263 -39249 -35304 -18288 -64074 -60745 -70751 -56034 -83498
8139h3498l7294N807L8045J2967R936O3348j6852l4810L1997K7289N5269J1434
$$ -83498 -120792 -114985 -76940 -63973 -54037 9311 -7541 -42351 -10354 16935 72204 83638
8127H3638m785l643n935n1024n3414k8693M631j8534j2565K7294K8373K1676l1011
$$ 83638 78853 75210 69275 18251 -35163 -63856 -59225 -77759 -90324 -63030 -34657 -12981 -43992
8114d3992n465M8863L1406K2814o9418n9998Q9479M4516R1931L4434k9205m4774
$$ -43992 -49457 -594 30812 53626 -15792 -75790 13689 58205 150136 184570 155365 110591
8102A10591p3284J1209k7190j995L2543m1253q2630l8786M6870j1874p37K8378
$$ 110591 37307 48516 21326 19331 51874 10621 -72009 -110795 -63925 -75799 -76536 -48158
8090d8158l505m768L6942K4733M1400l1496k4014m8966n584k7217K6811L2385
$$ -48158 -51663 -56431 -19489 5244 46644 15148 -8866 -57832 -63416 -90633 -63822 -31437
8078c1437j5419k8434N1022r369o415L3252q482M1265J6835k8032k9752k8250
$$ -31437 -46856 -75290 -24268 -33637 -40052 -6800 -15282 25983 42818 14786 -14966 -43216
8066d3216J6980J0874p622o5003j4778M3628K9365k069K8284J5700m500L4649
$$ -43216 -26236 -15362 -22984 -87987 -102765 -59137 -29772 -31841 -3557 12143 7643 42292
8054D2292O411m3708l0304k5251O410M1939k8220m3245o2395O254J0736O4609
$$ 42292 48703 4995 -25309 -50560 -44150 -2211 -30431 -73676 -136071 -129817 -119081 -54472
8042e4472P593L5610m761K801P1517m1943l7929l5790m2546L6074Q2560r296J6160
$$ -54472 -46879 -11269 -16030 -13229 58288 16345 -21584 -57374 -99920 -63846 18714 9418 25578
8029B5578L6811j6049k3959Q0952J2489m5200j123k041J9764M9081o325n1615
$$ 25578 62389 46340 22381 103333 115822 70622 69499 67458 87222 136303 129978 78363
8017G8363k0432n6321k5503L39O1911M5879K6023j1738k8503k5636k255O176M9898
$$ 78363 57931 1610 -23893 -23554 38357 84236 110259 98521 70018 44382 42127 48303 98201
8004I8201j454l8551K8615L9069j3619m8336k116O777k3131q232k1660n9678K221
$$ 98201 96747 58196 86811 125880 112261 63925 61809 68586 45455 37223 15563 -44115 -41894
7991d1894j3063m9258j9643M0531K4621J9612P900K4723L272N8642K3818K6194
$$ -41894 -54957 -104215 -123858 -83327 -58706 -39094 -31194 -6471 -3199 55443 79261 105455
7979A05455p1803n7684N2292M6148p577J8452Q295j8654K3456L6433J7535k3838
$$ 105455 33652 -24032 28260 74408 66831 85283 93578 74924 98380 134813 152348 128510
7967A28510k5426j4482M7874M5019m515j1122j07310o3262K43q8251k0117R874
$$ 128510 103084 88602 136476 181495 176980 165858 58548 -4714 -4471 -92722 -112839 -102965
7955a02965O5912o07J593M6800L8764K1409l7745p0402j8558p389P4716N9855
$$ -102965 -37053 -37660 -36067 10733 49497 70906 33161 -37241 -55799 -63188 11528 71383
7943G1383k3645j1283O0630J1627l4380K0391M7160q4994l9888K700J4965J2408
$$ 71383 47738 36455 97085 108712 74332 94723 141883 56889 17001 19701 34666 47074
7931D7074N2770j7929k4484m1915j5688K1791j1057K3787k1087j7507p890M2639
$$ 47074 99844 81915 57431 15516 -172 21619 10562 34349 13262 -4245 -12135 30504
7919C0504k3709K1684N2618l9929J0263K8801j9698N2444l1480j15153P453L3558
$$ 30504 6795 28479 81097 41168 51431 80232 60534 112978 81498 -33655 -26202 7356
7907G356j9844L8864M5263j7962j4199j2117p559M4598P344M2864k6170n4454
$$ 7356 -12488 26376 71639 53677 39478 27361 19802 64400 71744 114608 88438 33984
7895C3984m7659j5459k8065l591m1938n1166L2336O4690P0251j4814o0101L7564
$$ 33984 -13675 -29134 -57199 -60790 -102728 -153894 -121558 -56868 13383 -1431 -61532 -23968
7883b3968P4897k9674o7503J2583M1168O790Q740O107j9363l3910l9694l2428
$$ -23968 50929 21255 -46248 -33665 7503 14293 23033 29140 9777 -24133 -63827 -96255
7871i6255Q3511J0870n0262m323N4966N9624K9338l6893j1576K1747R005J3569
$$ -96255 -12744 -1874 -52136 -56459 -1493 58131 87469 50576 39000 60747 69752 83321
7859H3321o406q194p5531j6655K4801N2063J6803j5021n2104m1713P7125N0958
$$ 83321 76915 68721 -6810 -23465 1336 53399 70202 55181 3077 -38636 38489 89447
7847H9447r27n2119l5649L3869l4654m6413j2601M906J6496P1656o123m7031K7246
$$ 89447 88520 36401 752 34621 -33 -46446 -59047 -54141 -37645 34011 27888 -19143 8103
7834H103k5230j7992n438o095K7101J583J2372k4389J6343Q3348j8811J268L0480
$$ 8103 -17127 -35119 -40557 -46652 -19551 -17968 -5596 -29985 -13642 69706 50895 52163 82643
7821H2643j3145j9201n8739l3383j8924J6755L1335k5683P8228L8640K7238M8513
$$ 82643 69498 50297 -8442 -41825 -60749 -43994 -12659 -38342 39886 78526 105764 154277
7809A54277l1848p2861L8226n2p8601n0225L2038j3721L1182J2271J6046M364
$$ 154277 122429 49568 87794 87742 9141 -41084 -9046 -22767 8415 20686 36732 41096
7797D1096j9341j1428m9122j607L1057R500j8784r1032l6151P9553M4506m0475
$$ 41096 21755 10327 -38795 -40402 -9345 155 -18629 -109661 -145812 -66259 -21753 -62228
7785f2228k8066K7458L4068J3075j960m535K9203k4533n6919n0488l7618J9471
$$ -62228 -90294 -62836 -28768 -15693 -17653 -22188 7015 -17518 -74437 -124925 -162543 -143072
7773a43072P8041N6224K0658M6500l5873J6170p041j1204l0859K2900l0376p8304
$$ -143072 -65031 -8807 11851 58351 22478 38648 31607 20403 -10456 12444 -17932 -96236
7761i6236l8424N2021O2948J0838L5046m7921m7343j8130K7315J9241K3710k6721
$$ -96236 -134660 -82639 -19691 -8853 26193 -21728 -69071 -87201 -59886 -40645 -16935 -43656
7749d3656N4332k2431r1818j822K9112J3831k249R1308N488p8763L8520J6326
$$ -43656 10676 -11755 -103573 -105395 -76283 -62452 -64701 26607 32095 -46668 -8148 8178
7737H178O513L1057l8609m0668n1236p1731N9457P4767M858j8445j613N7608K7936
$$ 8178 14691 45748 7139 -33529 -84765 -156496 -97039 -22272 -17414 -35859 -37472 20136 48072
7724D8072j89k7453k5528k7965j8322j0890k2870j6457k2082L8174O9382j5134
$$ 48072 47883 20430 -5098 -33063 -51385 -62275 -85145 -101602 -123684 -85510 -16128 -31262
7712c1262p028J0920k1648K2008K8385k0194r9291j9725n877J7296Q5471j6863
$$ -31262 -38290 -27370 -49018 -27010 1375 -18819 -118110 -137835 -143712 -126416 -40945 -57808
7700e7808m9221j9284j0613k320l0884j7180N8832O0683L8308N7590J1256q841
$$ -57808 -107029 -126313 -136926 -139246 -170130 -187310 -128478 -67795 -29487 28103 39359 30518
7688C0518L609p606k866l9272M976m4104l5863Q3257R7817k6989m8819P2843Q117
$$ 30518 34127 26521 23655 -15617 -10641 -54745 -90608 -7351 90466 63477 14658 87501 95618
7675I5618j2583m6169m4687j3730J6560L284o446k6797J2663k698o98J9468k8419
$$ 95618 83035 36866 -7821 -21551 -4991 -1707 -8153 -34950 -22287 -24985 -25683 -6215 -34634
7662c4634L9907K0237k6772n2104J6124Q981m6499l4989J81l814Q2908M7028J5809
$$ -34634 5273 25510 -1262 -53366 -37242 -28261 -74760 -109749 -109568 -113382 -30474 16554 32363
7649C2363k9771k9880L1830k6372J199J4308r534M544L6996k0349J5567j0480
$$ 32363 2592 -27288 4542 -21830 -20631 -6323 -15857 -11313 25683 5334 20901 10421
7637A0421o3681N435M3156L0120L7564j8497n6987j7996r768l6369Q93k7553M6088
$$ 10421 -53260 -47825 -4669 25451 63015 44518 -12469 -30465 -40233 -76602 -75709 -103262 -57174
7624e7174j2352j2475K5355j5271k3566M1068R311P3K7456K9246L898J5943J4726
$$ -57174 -69526 -82001 -56646 -71917 -95483 -54415 -45104 -45031 -17575 11671 15569 31512 46238
7611D6238m2890m2479K1594l5727N0882M640m0510Q312L464Q9736P1394j39o0826
$$ 46238 3348 -39131 -17537 -53264 -2382 2258 -38252 -29940 -26476 63260 134654 134515 73689
7598G3689k7443j7674j7292k8849j499K9382L9183K8854m3616l4154j8275J6740
$$ 73689 46246 28572 11280 -17569 -19068 10314 49497 78351 34735 581 -17694 -954
7586i54K6256k0566J9327L8520k8766q2762j5800r314N6344N461O4514L8309L0516
$$ -954 25302 4736 24063 62583 33817 -48945 -64745 -74059 -17715 -12254 52260 90569 121085
7573A21085n5450r033l7244N154l358n7533q1401k8153N9552O0000l7172j5798
$$ 121085 65635 56602 19358 24512 21154 -36379 -117780 -145933 -86381 -26381 -63553 -79351
7561g9351L4856R132P474o7813K424N2273L0217l7145K2267K7247j776l2049j2042
$$ -79351 -44495 -35363 -27889 -95702 -93278 -41005 -10788 -47933 -25666 1581 -195 -32244 -44286
7548d4286r55J0923k2416J4898J1350l804m9378N1653N0283n3983q693K9262j4398
$$ -44286 -45241 -34318 -56734 -41836 -30486 -34290 -83668 -32015 18268 -35715 -44408 -15146 -29544
7535b9544k4359J7309Q0772K0430m722p2469n0757p473j953J2406K2950L0682
$$ -29544 -53903 -36594 44178 64608 59886 -12583 -63340 -70813 -72766 -60360 -37410 -6728
7523f728k3516k9131J8540L7320J840j174n2128j425R979M0273J7635p1486k2276
$$ -6728 -30244 -59375 -40835 -3515 -1675 -2849 -54977 -56402 -46423 -6150 11485 -60001 -82277
7510h2277J5253L1300M765j2114J4804l517K9921k4578n2276l4173l5858k4258
$$ -82277 -67024 -35724 -30959 -43073 -28269 -31786 -1865 -26443 -78719 -112892 -148750 -173008
7498a73008P2418L2596M0731j445o9206J2830J0693L9719J6385l1380k3303L0849
$$ -173008 -100590 -67994 -27263 -28708 -97914 -85084 -74391 -34672 -18287 -49667 -72970 -42121
7486d2121l3108l6328Q334L5980k2528N7937M2417K5394M8529k4602m1336j6707
$$ -42121 -75229 -111557 -103223 -67243 -89771 -31834 10583 35977 84506 59904 18568 1861
7474A861j4413J8603P473l678k7479J9053N1068J2960j3108J5117O699J7591k7399
$$ 1861 -12552 6051 13524 9846 -17633 1420 52488 65448 52340 67457 74156 91747 64348
7461F4348j0716m6683n4952l0530O8445M1044j8261O098K0675m6893k5458J4551
$$ 64348 53632 6949 -48003 -78533 -10088 30956 12695 18793 39468 -7425 -32883 -18332
7449a8332Q944O869n9723m4541j1628p142K0014l5591M7438M6956L9869J8757
$$ -18332 -9388 -2519 -62242 -106783 -118411 -125553 -105539 -141130 -93692 -46736 -6867 11890
7437A1890l2901q0289m2154J4252O5084N7331j4967l8967q362l074j6638j5455
$$ 11890 -21011 -101300 -143454 -129202 -64118 -6787 -21754 -60721 -69083 -72157 -88795 -104250
7425a04250P490J4355k3269j2253K7473L8676K9114J2207m9622k7280j3870o3094
$$ -104250 -96760 -82405 -105674 -117927 -90454 -51778 -22664 -10457 -60079 -87359 -101229 -164323
7413a64323L1533O0674j5949J7545M7305J4631J6774L488j4753m6544l0996L9405
$$ -164323 -132790 -72116 -88065 -70520 -23215 -8584 8190 11678 -3075 -49619 -80615 -41210
7401d1210O3928Q3658m7327n4774o0122j2353k1925J0701M4177R692k0681L273
$$ -41210 22718 106376 59049 4275 -55847 -68200 -90125 -79424 -35247 -25555 -46236 -42963
7389d2963j9118K9104J8158j5701j7490n6284K4795K2548L685M3553N4257J2872
$$ -42963 -62081 -32977 -14819 -30520 -48010 -104294 -79499 -56951 -53266 -9713 44544 57416
7377E7416K5483K1838K3154l866o5569k466J0797l2238j9398m7382m4306K1645
$$ 57416 82899 104737 127891 124025 58456 55990 66787 34549 15151 -32231 -76537 -54892
7365e4892L6931L2503K767o6478k0198J0898j4196k8633l2113J5999L0118N8901
$$ -54892 -17961 14542 17309 -49169 -69367 -58469 -72665 -101298 -133411 -117412 -87294 -28393
7353b8393Q301O470m36O0583M3909j800j5965j1871k5628l9871L982j5277K1048
$$ -28393 -20092 -13622 -14058 46525 90434 88634 72669 60798 35170 -4701 -719 -15996 5052
7340E052o783k7197o326L524J7581p962j9461J6356N112L3664J1508o3706M344
$$ 5052 -1731 -28928 -35254 -31730 -14149 -22111 -41572 -25216 -20104 13560 25068 -38638 -34294
7327c4294Q8237M6077K269k3805j6693n749k9280k5800K0611m8128l8835L8010
$$ -34294 53943 100020 102289 78484 61791 56042 26762 962 21573 -26555 -65390 -27380
7315b7380j517N6507J9376j5180j2195J0936J0779j2900k1399K3111M8237k6462
$$ -27380 -28897 27610 46986 31806 19611 30547 41326 28426 7027 30138 78375 51913
7303E1913k7056o8624l1091O2454q232r912n3635p1646O7286M221J469J1813L5151
$$ 51913 24857 -43767 -74858 -12404 -20636 -30548 -84183 -155829 -88543 -84322 -82853 -71040 -35889
7290c5889K516K8779k9048J1232l160O2121K1308k2423K3265p017l2153J370m3765
$$ -35889 -33373 -4594 -33642 -22410 -25570 36551 57859 35436 58701 51684 19531 20901 -22864
7277b2864o3774q703J3144j9086O0254M1897K9528m9895P920o2650j5156L2957
$$ -22864 -86638 -95341 -82197 -101283 -41029 868 30396 -19499 -11579 -74229 -89385 -56428
7265e6428P934k187l4228p098K1285r463L0435L0122j6943l195J6799K096p878
$$ -56428 -48494 -50681 -84909 -92007 -70722 -80185 -49750 -19628 -36571 -39766 -22967 -20871 -28749
7252b8749J7030j5365M5390O1290j2705m1657r2047L4275M8037O184j7467k7576
$$ -28749 -11719 -27084 18306 79596 66891 25234 -66813 -32538 15499 21683 4216 -23360
7240b3360M7754Q5901K6369k0404J4191j2240Q78k9632j694l1716Q003K809j1321
$$ -23360 24394 110295 136664 116260 130451 118211 119089 89457 87763 56047 64050 66859 55538
7227E5538r639J5892j9400q6684n8989q64K2812L9679J4709R732Q7245N8811p4212
$$ 55538 45899 61791 42391 -44293 -103282 -104146 -81334 -41655 -26946 -17214 70031 128842 54630
7214E4630p2260m8720K477K3171J608K8519L6076k69j8498j8890j0168N020j8682
$$ 54630 -17630 -66350 -63873 -40702 -39094 -10575 25501 25232 6734 -12156 -22324 -17304 -35986
7201c5986n451j7896K8986P6544O4756R228J233o644p6272L517M6538J0517l2953
$$ -35986 -41437 -59333 -30347 46197 110953 120181 121414 114770 38498 42015 88553 99070 66117
7188F6117k152l6619n5760r462O2521K4343J0049j498j06996m3330n6716L5803
$$ 66117 63965 27346 -28414 -37876 24645 48988 59037 57539 -49457 -92787 -149503 -113700
7176a13700J29306R1870k5449k4729r262M299K3019r754N042P6055M5315p2191
$$ -113700 15606 107476 82027 57298 48036 52335 75354 65600 70642 146697 192012 119821
7164A19821m267n7839p1463m218J9117L9031n4917M6J1429K7072K7347k8394q9075
$$ 119821 115554 57715 -13748 -17966 1151 40182 -14735 -14689 -3260 23812 51159 22765 -66310
7151f6310j8988O4283l4452K1714J6852L1451p67o5198q0884L4598O8843M9176
$$ -66310 -85298 -21015 -55467 -33753 -16901 14550 13783 -51415 -132299 -97701 -28858 20318
7139B0318k8924o5652L7121P2088o8289K6655k744r713l0007K522O8071O9398
$$ 20318 -8606 -74258 -37137 34951 -33338 -6683 -9427 -19140 -49147 -46625 21446 90844
7127I0844k2275o9562m8775L5705k668k6871J963j5561p668N4257J0828M7250
$$ 90844 68569 -993 -49768 -14063 -16731 -43602 -41639 -57200 -64868 -10611 217 47467
7115D7467n4850m395M2536L3980m0394k4653q0987J8570P1944k8687o6172K6196
$$ 47467 -7383 -11778 30758 64738 24344 -309 -81296 -62726 9218 -19469 -85641 -59445
7103e9445O4429o9476r0282N5700K7132Q951N316l728K2405J6129K8220J6514
$$ -59445 4984 -64492 -154774 -99074 -71942 -62991 -57675 -61403 -38998 -22869 5351 21865
7091B1865M671J4456L2999Q582j12961K911M1689k1788M315J577K1431n0770K0654
$$ 21865 26536 40992 73991 82573 -30388 -27477 14212 -7576 -3261 -1684 19747 -31023 -10369
7078a0369j4629Q425M6035N9089k5981o499j2211J547m5499m1448M7783O818o9408
$$ -10369 -24998 -16573 29462 88551 62570 56071 43860 45407 -92 -41540 6243 13061 -56347
7065e6347k8640M3431J3476k3953l801q83J8344l0161M884K8339j7106J2365J7053
$$ -56347 -84987 -41556 -28080 -52033 -55834 -56717 -38373 -68534 -63650 -35311 -52417 -40052 -22999
7052b2999j163P2085R795q7194m4628L1316O6486k1377J157N5590L2528k0060
$$ -22999 -24162 47923 57718 -29476 -74104 -42788 23698 2321 3478 59068 91596 71536
7040G1536k4452n874K2541k2426l7384K1324q490j0109k3132o9739J9638O464
$$ 71536 47084 41210 63751 41325 3941 25265 16775 6666 -16466 -86205 -66567 -60103
7028f0103J8475k1329m950k8455q570N0964L5250l5282r1399J2521R2039K9938
$$ -60103 -41628 -62957 -67907 -96362 -104932 -53968 -18718 -54000 -145399 -132878 -40839 -10901
7016a0901j8646J3758L261J0592o922M9967n3096n5405m0618r065n459J1524l431
$$ -10901 -29547 -15789 -12528 -1936 -8858 41109 -11987 -67392 -108010 -117075 -122534 -111010 -114441
7003a14441J6478O6090k729m4165m9532J13268K7082J1924n174q460l0149J6727
$$ -114441 -97963 -31873 -34602 -78767 -128299 -15031 12051 23975 18801 10341 -19808 -3081
6991c081Q934k521l1238L1182J7150l2995j2350m8388l8451K5747M3544M9742
$$ -3081 5853 3332 -27906 3276 20426 -12569 -24919 -73307 -111758 -86011 -42467 7275
6979G275L5042q035r790J2517n6971J4833L2232n9764j3676O4008l2595l7439
$$ 7275 42317 34282 24492 37009 -19962 -5129 27103 -32661 -46337 17671 -14924 -52363
6967e2363j217l4864j028m915j1612j9378L0521l1564M1162L5549J1890N572k1950
$$ -52363 -53580 -88444 -89472 -94387 -105999 -125377 -94856 -126420 -85258 -49709 -37819 -32247 -54197
6954e4197l8054m9011j2315O6068L0180o853K4524K4159k7629m7081q220O27j0298
$$ -54197 -92251 -141262 -153577 -87509 -57329 -64182 -39658 -15499 -43128 -90209 -98429 -97802 -108100
6941a08100J871J05309M7551n209L3720l533j9254k8878j1387m8860j8446l7900
$$ -108100 -106229 -920 46631 41422 75142 71609 52355 23477 12090 -36770 -55216 -93116
6929i3116L0775M0829L3250Q0199P5942l8261m6817k2479L129j9938n3019j5298
$$ -93116 -62341 -21512 11738 91937 167879 129618 82801 60322 63451 43513 -9506 -24804
6917b4804n1752L7207O3178j3752l8793L540N3716O555m2042Q182Q0837j1111
$$ -24804 -76556 -39349 23829 10077 -28716 -25176 28540 35095 -6947 1235 82072 70961
6905G0961p0639j8966l9104M4028J2655O144M2638L9946n6018o8196p0824M9815
$$ 70961 322 -18644 -57748 -13720 -1065 5079 47717 87663 31645 -36551 -107375 -57560
6893e7560J0612p7539K387O4693K1271j4457J5812J5275J8807j4380l4593L9955
$$ -57560 -46948 -124487 -122100 -57407 -36136 -50593 -34781 -19506 -699 -15079 -49672 -9717
6881i717N604J3004K367M423n3574m6430P4258P684p1945n244j6347k3114N5500
$$ -9717 -4113 8891 11258 15681 -37893 -84323 -10065 -2381 -74326 -79570 -95917 -119031 -63531
6868f3531R9135q592k4402k2444m1038j501k4548M2599K1404l8919l2610L0152
$$ -63531 35604 27012 2610 -19834 -60872 -62373 -86921 -44322 -22918 -61837 -94447 -64295
6856f4295L1078N3845P1748k9175o1145K9824k7377k262q293L2882l0102l1098
$$ -64295 -33217 20628 92376 63201 2056 31880 4503 2241 -6052 26830 -3272 -34370
6844c4370K9925K992J1478k1231j4249K2658m7476j1863J8053j7495j2195J3546
$$ -34370 -4445 -1453 10025 -11206 -25455 -2797 -50273 -62136 -44083 -61578 -73773 -60227
6832f0227O4430j243k5298L0590j4872m035L6992n846L2256k4675q9615q7463
$$ -60227 4203 2960 -22338 8252 -6620 -10655 26337 20491 52747 28072 -61543 -149006
6820a49006p054O6143M2809n7722L7459P6852q631L281M6334n7594k6300j8023
$$ -149006 -156060 -89917 -47108 -104830 -67371 9481 850 4131 50465 -7129 -33429 -51452
6808e1452O293n795N750K2514j6575K2103L9152p004p4271m016L9667m2261l0858
$$ -51452 -45159 -50954 -45204 -22690 -39265 -17162 21990 14986 -59285 -63301 -23634 -65895 -96753
6795i6753M4931P0559M4674J096J9766q460M743k6145l8656K3811j7568q9369
$$ -96753 -51822 18737 63411 64507 84273 75813 80556 54411 15755 39566 21998 -67371
6783f7371M8041Q084K3192j4152p5395k2370N7106o3680q028R6359m59K4345M282
$$ -67371 -19330 -11246 11946 -2206 -77601 -99971 -42865 -106545 -114573 -18214 -18673 5672 9954
6770I954j7944m1047K5936M1166L3143k6198n7383K4203M6233j467Q768j4273
$$ 9954 -7990 -49037 -23101 18065 51208 25010 -32373 -8170 38063 36596 45364 31091
6758C1091j0601k3808l10j2722K7538O283K2656o7025J1805k8940n3388M6219
$$ 31091 20490 -3318 -3628 -16350 11188 17471 40127 -26898 -15093 -44033 -97421 -51202
6746e1202j9163j2203O3134L8399q9277j8634N3578J3266L1888J3876l6165k2504
$$ -51202 -70365 -82568 -19434 18965 -70312 -88946 -35368 -22102 9786 23662 -12503 -35007
6734c5007J7176Q525J1863J2251o6470k5867K5761J7383M9971j5896J1382j0753
$$ -35007 -17831 -9306 2557 14808 -51662 -77529 -51768 -34385 15586 -310 11072 319
6722C19l7229j8839J9712K4027K0313l479j9754K7467K325m146L0028l6841L3350
$$ 319 -36910 -55749 -36037 -12010 8303 4824 -14930 12537 14862 10716 40744 3903 37253
6709C7253k2472m7860j10986J9898J01585N4599J1713j3715l196j1690m9556N786
$$ 37253 14781 -33079 -144065 -124167 -22582 32017 43730 30015 26819 15129 -34427 -28641
6697b8641k5056m2305j7338O6473O5760Q991o908K357l073k0737j1070K2300l0935
$$ -28641 -53697 -96002 -113340 -46867 18893 27884 20976 23333 20260 -477 -11547 10753 -20182
6684b0182k8970l9769l0466r620M4739L8016p360O632k376L7409K5247J4044k5622
$$ -20182 -49152 -88921 -119387 -129007 -84268 -46252 -53612 -46980 -49356 -11947 13300 27344 1722
6671A722n1056J0336M7831L271m0825k7000N366L262L6381R613L5372Q482L9133
$$ 1722 -49334 -38998 8833 12104 -28721 -55721 -50355 -47093 -10712 -1099 34273 42755 81888
6658H1888L479n2486m516j9602K2520J4886m0856k4433k8923r729J8461K8907
$$ 81888 85367 32881 28365 8763 31283 46169 5313 -19120 -48043 -57772 -39311 -10404
6646a0404K6763k9407l1798M062r496j1970o4356r6782O9475J13113L3795k6248
$$ -10404 16359 -13048 -44846 -40784 -50280 -62250 -126606 -223388 -153913 -40800 -7005 -33253
6634c3253j7530M6920j7181o1211R451R164K1706L2820L3580N4666K3079l5587
$$ -33253 -50783 -3863 -21044 -82255 -72804 -63640 -41934 -9114 24466 79132 102211 66624
6622F6624n2079k9602n1010L4327j5328o62N4836k4514l2523o004l020j635J9512
$$ 66624 14545 -15057 -66067 -31740 -47068 -47730 7106 -17408 -49931 -55935 -58955 -60590 -41078
6609d1078N0804m0615l805L0641K7149O674l4491q08O7331k098m5318m0510n916
$$ -41078 9726 -30889 -34694 -4053 23096 29770 -4721 -5529 61802 59704 14386 -26124 -32040
6596c2040J8592N3416N4141j6261l721K9883p9878n8662J5870p630l4880o1914
$$ -32040 -13448 39968 94109 77848 74127 104010 24132 -34530 -18660 -26290 -61170 -123084
6584a23084K4948Q9313K7945m0511M5006j0735M6402j9916p7172l601K2081P293
$$ -123084 -98136 -8823 19122 -21389 23617 12882 59284 39368 -37804 -41405 -19324 -12031
6572a2031N6260j7410j3844K6070k7909l3267M4459M2155J0953K6112l4640n0022
$$ -12031 44229 26819 12975 39045 11136 -22131 22328 64483 75436 101548 66908 16886
6560A6886q5912l4773O1149M1359J7024N685j7117k2842j0333l0011K1641r874
$$ 16886 -69026 -103799 -42650 -1291 15733 21418 4301 -18541 -28874 -58885 -37244 -47118
6548d7118M4538N6841K1190j8726k8300n2098J0145K2222r250o8439r00M3638
$$ -47118 -2580 54261 75451 56725 28425 -23673 -13528 8694 -556 -68995 -69895 -26257
6536b6257j624l5972j1291P6382M4118Q27J0737J3996j7375n2493l1168L438K2325
$$ -26257 -27881 -63853 -75144 1238 45356 46183 56920 70916 53541 1048 -30120 -26682 -4357
6523d357O790R589K8764q207K861N513K1839n7317o304k4910l7327M6345L9672
$$ -4357 2433 12022 40786 32579 35440 40953 62792 5475 -829 -25739 -63066 -16721 22951
6510B2951J6452q789J0913k0101j594k4987O273l7085R357J3761L2702M110j0484
$$ 22951 39403 30614 41527 21426 19832 -5155 1118 -35967 -26610 -12849 19853 23963 13479
6497A3479p388q866m9796k0501O3433j7209l8988R3215m6214K0537N5665l9902
$$ 13479 6091 -2775 -52571 -73072 -9639 -26848 -65836 27379 -18835 1702 57367 17465
6485A7465j30801p249R3279J5290p7513l7280Q680Q0301L9969K0033K3895j3793
$$ 17465 -113336 -120585 -27306 -12016 -89529 -126809 -118129 -37828 2141 22174 46069 32276
6473C2276l0301L3973j2460m4027k0118j4248M0239K1152n3140L431P5963k5949
$$ 32276 1975 35948 23488 -20539 -40657 -54905 -14666 6486 -46654 -43223 32740 6791
6461F791m4722k4208k4932N1217N2023m6423j5848N3184k7492L0992R958n875
$$ 6791 -37931 -62139 -87071 -35854 16169 -30254 -46102 7082 -20410 10582 20540 14665
6449A4665j3630m0049j9752n04J8873J3786J6931R730n843p1376N2353O2952k4046
$$ 14665 1035 -39014 -58766 -59270 -40397 -26611 -9680 50 -5793 -77169 -24816 38136 14090
6436A4090o6142P221J4442M5573l3361n0923j0580k0860j1742Q8099N2601l6082
$$ 14090 -52052 -44831 -30389 15184 -18177 -69100 -79680 -100540 -112282 -24183 28418 -7664
6424g664k1989L6925k7562N720M5041o2415n0944j2643L8749K7529m5007L92L9104
$$ -7664 -29653 7272 -20290 -14570 30471 -31944 -82888 -95531 -56782 -29253 -74260 -73868 -34764
6411c4764J5135m9425J923N2137L5176n3050n9266J8754j0908J620j7014n878
$$ -34764 -19629 -69054 -67131 -14994 20182 -32868 -92134 -73380 -84288 -82668 -99682 -105560
6399a05560K0063j4947K5660L8625K5003J6060R146K6181m1164k3128p3154r153
$$ -105560 -85497 -100444 -74784 -36159 -11156 4904 14050 40231 -933 -24061 -97215 -106368
6387a06368P2847M7843Q277j9110O436k7773k4611O9992r151o1780p112l8623
$$ -106368 -33521 14322 22599 3489 9925 -17848 -42459 27533 18382 -43398 -50510 -89133
6375h9133J0000O3011O7412P516j2986l8529l380J3437l3919p6683L8067M3671
$$ -89133 -79133 -16122 51290 58806 45820 7291 3911 17348 -16571 -93254 -55187 -11516
6363a1516P386K8141j7125k8568j01245m277M6787j3565P013J385R028K0023J5594
$$ -11516 -4130 24011 6886 -21682 -122927 -127204 -80417 -93982 -86969 -85584 -76556 -56533 -40939
6350d0939K8782n2075N4495Q7600o0950o7306L5345L1868q124k6148m655j6630
$$ -40939 -12157 -64232 -9737 77863 16913 -50393 -15048 16820 8696 -17452 -22107 -38737
6338c8737p602j760o85j1213l6920J8945J02696L9161Q60k7164j1266L1038k7746
$$ -38737 -46339 -48099 -48784 -59997 -96917 -77972 24724 63885 64745 37581 26315 57353 29607
6325B9607l0771J3035O010r115n337J2221l4596m3291N9627k562m1930k2969n64
$$ 29607 -1164 11871 17881 8766 3429 15650 -18946 -62237 -2610 -5172 -47102 -70071 -70635
6312g0635N9587O4430J6475k6366O416o379j9913k6322k5458n6481k4274R772
$$ -70635 -11048 53382 69857 43491 49907 43528 23615 -2707 -28165 -84646 -108920 -99148
6300i9148O5705L9097q838m4105l91K927K2063K7425l893l5474L0534k8164m2702
$$ -99148 -33443 5654 -3184 -47289 -47680 -44753 -22690 4735 842 -34632 -4098 -32262 -74964
6287g4964M2807j3522m2506M5446O9940k1729K6845m2409l9809q197J2721k0651
$$ -74964 -32157 -45679 -88185 -42739 27201 5472 32317 -10092 -49901 -58098 -45377 -66028
6275f6028K096N9828L8669M930q141r789m3467N7953m4832n2796J6263M2110N670
$$ -66028 -63932 -4104 34565 39495 31354 21565 -21902 36051 -8781 -61577 -45314 -3204 2466
6262B466m7734Q838N3136Q55n1104K7069k2343k8666J7293k6545k0920j6347J4912
$$ 2466 -45268 -36430 16706 17561 -33543 -6474 -28817 -57483 -40190 -66735 -87655 -104002 -89090
6249h9090P7904L652m0565P842J9042L3229j3098m5393j0427K8372j1448J8393
$$ -89090 -11186 -7534 -48099 -40257 -21215 12014 -1084 -46477 -56904 -28532 -39980 -21587
6237b1587N1695m4481l4759K818N9900k5807p6441j0904M9429M8384L9060P1167
$$ -21587 30108 -14373 -49132 -46314 13586 -12221 -88662 -99566 -50137 -1753 37307 108474
6225A08474q958o3189j2599K1161o0142m140M7674m0557L1063R221j6658o4746
$$ 108474 99516 36327 23728 44889 -15253 -19393 28281 -12276 18787 28008 11350 -53396
6213e3396N4683P149l4737R530j0931L0000N7355K8553L1208q1330n3920J1635
$$ -53396 1287 8436 -26301 -16771 -27702 2298 59653 88206 119414 38084 -15836 -4201
6201d201j0520j7132M0540N9590P607k9290j03039l5137N8143J7681N385j5802
$$ -4201 -14721 -31853 8687 68277 75884 46594 -56445 -91582 -33439 -15758 -10373 -26175
6189b6175L6578j974J8857k8201r324M9911J527l7839l797K0023J6849k1864J324
$$ -26175 10403 8429 27286 -915 -10239 39672 41199 3360 -437 19586 36435 14571 15895
6176A5895j4330K0410J4596k5411j0043O3053N0080K9497o466n534n4869J7437
$$ 15895 1565 21975 36571 11160 1117 64170 114250 143747 137281 131747 76878 94315
6164I4315j27575o0127P4442L1131j9533J1712m324o3199Q837N0505M966R993
$$ 94315 -33260 -93387 -18945 12186 -7347 4365 41 -63158 -54321 -3816 1150 11143
6152A1143j8897n9355j4069j4575N0370M9460J5235l7316k924j3634K0140Q108
$$ 11143 -7754 -67109 -81178 -95753 -45383 4077 19312 -18004 -20928 -34562 -14422 -6314
6140f314j5289j2493J3384J9714j5585J2493J1901n8365J700L7842R615p3619
$$ -6314 -21603 -34096 -20712 -998 -16583 -4090 7811 -50554 -48854 -11012 -1397 -75016
6128g5016Q961O887M9046K2111k127p010K641K6639q314l4020l0855Q5264J3385
$$ -75016 -66055 -59168 -10122 11989 9862 2852 5493 32132 23818 -10202 -41057 44207 57592
6115E7592J868m2648j2351K991K5978j1677J0979m2520j8300n435P872k2655m4617
$$ 57592 59460 16812 4461 7452 33430 21753 32732 -9788 -28088 -33523 -25651 -48306 -92923
6102i2923J66l3136m6782l815P6626J0424n7887k090J03723K1389l4360J6073
$$ -92923 -92757 -125893 -172675 -176490 -99864 -89440 -147327 -149417 -45694 -24305 -58665 -42592
6090d2592M5237L0738K8664l4015k9586K2133k2810m3405k1255P148N4288k2847
$$ -42592 2645 33383 62047 28032 -1554 20579 -2231 -45636 -66891 -59743 -5455 -28302
6078b8302l5494n5295L1001M0580j7443m2720l3332L2972K4772L3452l6307l5873
$$ -28302 -63796 -119091 -88090 -47510 -64953 -107673 -141005 -108033 -83261 -49809 -86116 -121989
6066a21989M3698K0104J830P404Q8669N9990K5246J5792k8947n3441r1502k5921
$$ -121989 -78291 -58187 -56357 -48953 39716 99706 124952 140744 111797 58356 -33146 -59067
6054e9067M7862M3761j185o379n1727K9345Q3641L2864n5832n0806o3461P713
$$ -59067 -11205 32556 31371 24992 -26735 2610 86251 119115 63283 12477 -50984 -43271
6042d3271K7194j4118n4801J8657M7460j7170k1163K2551o256Q90k8777j5875
$$ -43271 -16077 -30195 -84996 -66339 -18879 -36049 -57212 -34661 -40917 -40027 -68804 -84679
6030h4679J9736N834n6966k5750P3606P9600M6771N5504j3257p9305l7760o7238
$$ -84679 -64943 -59109 -116075 -141825 -68219 11381 58152 113656 100399 21094 -16666 -83904
6018h3904K6956M735K1113k9773K1268P7848Q161q3034J2041M7256K3613k7065
$$ -83904 -56948 -52213 -31100 -60873 -39605 38243 46404 -36630 -24589 22667 46280 19215
6006A9215k9569m5889R003N2130K0337Q414l9697l9774o7812K0010j645J6900
$$ 19215 -10354 -56243 -47240 4890 25227 33641 -6056 -45830 -113642 -93632 -95277 -78377
5994g8377R28L565N978k0382J7064J3747N2256M226j3726K2003J9056M7229K0570
$$ -78377 -77449 -73884 -67906 -88288 -71224 -57477 -5221 -995 -14721 7282 26338 73567 94137
5981I4137l2698m1282k5650M5314K7090J1416m0972J619J1492J4716M4109m6489
$$ 94137 61439 20157 -5493 39821 66911 78327 37355 38974 50466 65182 109291 62802
5969F2802j04783o5276l4992L2590N1557j0430K083K306K0725L7817q999k3051
$$ 62802 -41981 -107257 -142249 -109659 -58102 -68532 -66449 -64143 -43418 -5601 -14600 -37651
5957c7651K589l5829k7325K7037L6287M393L7729m397j7260m0590J6955J040m9557
$$ -37651 -35062 -70891 -98216 -71179 -34892 -30499 7230 2833 -14427 -55017 -38062 -37022 -86579
5944h6579k1454L9434O5376j18J262L0732j6207r92P007k7768P254l1593n1313
$$ -86579 -108033 -68599 -3223 -3341 -2079 28653 12446 11454 18461 -9307 -2053 -33646 -84959
5931h4959p8233L0634l1811k9237O2165J9137J2063L8212r545J2337N492m8034
$$ -84959 -163192 -132558 -164369 -193606 -131441 -112304 -100241 -62029 -71574 -59237 -53745 -101779
5919a01779O1323K8417n532m550K6413N2785P420j29495o5224o973O2255q96j998
$$ -101779 -40456 -12039 -17571 -22121 4292 57077 64497 -64998 -130222 -137195 -74940 -75836 -77834
5906g7834K9159N0968k7844k8009O0603K8167p9533L2965J2936m2487l8702O4546
$$ -77834 -48675 2293 -25551 -53560 7043 35210 -44323 -11358 1578 -40909 -79611 -15065
5894a5065J34922M7453k4585m9659M3757k4419m2685j398Q093L4175j8302m0144
$$ -15065 119857 167310 142725 93066 136823 112404 69719 68321 76414 110589 92287 52143
5882E2143l0879L411l3467l1834K1111m6529k7648L8338L9378K2341k7679l5060
$$ 52143 21264 24675 -8792 -40626 -19515 -66044 -93692 -55354 -15976 6365 -21314 -56374
5870e6374m5552K1369O1613j954K0208k8481k3089l0602L3065M0423K5236J9901
$$ -56374 -101926 -80557 -18944 -20898 -690 -29171 -52260 -82862 -49797 -9374 15862 35763
5858C5763l0466l1706m397r917r109K1008l312k0161J5662P484J069p1416n6941
$$ 35763 5297 -26409 -30806 -40723 -49832 -28824 -32136 -52297 -36635 -29151 -28082 -99498 -156439
5845a56439l1600L1371N1326L7933J2786m7190L2644L7688L8966O4000q879p6270
$$ -156439 -188039 -156668 -105342 -67409 -54623 -101813 -69169 -31481 7485 71485 62606 -13664
5833a3664n0563j4758j8144M3704J8176k3030O5292j0788l6134j9275L6598J6012
$$ -13664 -64227 -78985 -97129 -53425 -35249 -58279 7013 -3775 -39909 -59184 -22586 -6574
5821f574K081l4311j1801N5669L2600k1269o410r9512o2333P270M7809P2311J1663
$$ -6574 -4493 -38804 -50605 5064 37664 16395 9985 -89527 -151860 -144590 -96781 -24470 -12807
5808a2807j1057m5920k328J2890P0906O3193O2657J0098l2353r926l3212k3031
$$ -12807 -23864 -69784 -72112 -59222 11684 74877 137534 147632 115279 105353 72141 49110
5796D9110L941k8638P18l8215l4549J3211Q9697L5868j1647K4890m9982k2168
$$ 49110 53051 24413 25131 -13084 -47633 -34422 55275 91143 79496 104386 54404 32236
5784C2236j4376j8534n054M9255L5k7454j5442k1998j7860N6530L0756l2577j309
$$ 32236 17860 -674 -5728 43527 43562 16108 666 -21332 -39192 17338 48094 15517 14208
5771A4208j9646o5870k5065K1824O9224N2310j498m6076n0215m1375j8368N4281
$$ 14208 -5438 -71308 -96373 -74549 -5325 46985 45487 -589 -50804 -92179 -110547 -56266
5759e6266L975L0747O0286j5713r214k078r614J2541J765j7589k1917N094J3292
$$ -56266 -52291 -21544 38742 23029 13815 11737 2123 14664 16429 -1160 -23077 -17983 -4691
5746d691o5634l4732J0644J6159O5487J0051J8513K3297j428M1881j00723k4030
$$ -4691 -70325 -105057 -94413 -78254 -12767 -2716 15797 39094 37666 79547 -21176 -45206
5734d5206L2149J6505k1223J0784M8176J4447k7431k7758m2472o4976N96M1623
$$ -45206 -13057 3448 -17775 -6991 41185 55632 28201 443 -42029 -107005 -106409 -64786
5722f4786N5194M2638j369r002m833j3425j8087j4748m842N975K1592k370J7367
$$ -64786 -9592 33046 31677 22675 17842 4417 -13670 -28418 -33260 -27285 -5693 -8063 9304
5709I304J9489o7283o3971j6215N4370J6750J198k0296J4707O0948M6887p617
$$ 9304 28793 -38490 -102461 -118676 -64306 -47556 -46358 -66654 -51947 9001 55888 48271
5697D8271j4571m450p593j1242R511L3318K2036m2303m045O880L252M6319M6446
$$ 48271 33700 29250 21657 10415 19926 53244 75280 32977 28932 35812 39064 85383 131829
5684A31829j81k7586k6099M5585K2346o626m6636m7158J2681L7201k1555m1211
$$ 131829 131648 104062 77963 123548 145894 139268 92632 45474 58155 95356 73801 32590
5672C2590L7530J4786m4925k347L969j7607l7962j8291K2710J6988m7193P953
$$ 32590 70120 84906 39981 37634 41603 23996 -13966 -32257 -9547 7441 -39752 -31799
5660c1799K4850K6134K632l0916j6929K4938L5446J5674j2308m0272L6694K9565
$$ -31799 -6949 19185 21817 -9099 -26028 -1090 34356 50030 37722 -2550 34144 63709
5648F3709r641J034J4739l173o0580l7691j01521m8496L7863J8974k0908P3017
$$ 63709 54068 55102 69841 66668 6088 -31603 -133124 -181620 -143757 -124783 -145691 -72674
5636g2674Q355r560m1968j931P0080J5768l2127K1513L4101j9621k3208L2680
$$ -72674 -64319 -73879 -115847 -117778 -47698 -31930 -64057 -42544 -8443 -28064 -51272 -18592
5624a8592P2922l5161l8303L392k3367j4277j0762k1022N101l6571K2900M3581
$$ -18592 54330 19169 -19134 -15742 -39109 -53386 -64148 -85170 -80069 -116640 -93740 -50159
5612e0159j4016Q579J0481O946Q7130n932p571l4043J1764l0540j8716j8808J9295
$$ -50159 -64175 -55596 -45115 -38169 48961 43029 35458 1415 13179 -17361 -36077 -54885 -35590
5599c5590k3554j1896L545n1191O526K2328P290Q153O755N6111N583m3610L3594
$$ -35590 -59144 -71040 -67495 -118686 -112160 -89832 -82542 -74389 -67634 -11523 -5940 -49550 -15956
5586a5956J8095k2855J536J4336j9034L2861p306k4055j0430K8752M7501n939
$$ -15956 2139 -20716 -19180 -4844 -23878 8983 1677 -22378 -32808 -4056 43445 37506
5574C7506l6842j9836Q179k6684l8150L780j0766J2594P0729Q3593K7150Q557
$$ 37506 664 -19172 -10993 -37677 -75827 -72047 -82813 -70219 510 84103 111253 119810
5562A19810k0871q8937l3544N395r706N023l243m3279o7248j5024M5537J5444
$$ 119810 98939 10002 -23542 -18147 -27853 -22830 -26073 -69352 -136600 -151624 -106087 -90643
5550i0643J1923J3336N2940K3598n4563k7442M1218K3752j0398k4603p56J654
$$ -90643 -78720 -65384 -12444 11154 -43409 -70851 -29633 -5881 -16279 -40882 -41638 -39984
5538c9984L274M0867L6282k7874k4335o8395l5045l2189R962M1921M4812O0052
$$ -39984 -36710 4157 40439 12565 -11770 -80165 -115210 -147399 -137437 -95516 -50704 9348
5526I348N0164l4429l0301k4372r667J7798J9967K3876l8044l0546l7898M591
$$ 9348 59512 25083 -5218 -29590 -39257 -21459 -1492 22384 -15660 -46206 -84104 -79513
5514g9513J7999n250J7889J4471Q914K3607M2023r56j8078j02181K377Q0332K20
$$ -79513 -61514 -66764 -48875 -34404 -25490 -1883 40140 39184 21106 -81075 -78698 1634 1854
5501A854p3366M6184Q6602O864l8783n6506m0380K2342K4929m4044J2511N7067
$$ 1854 -71512 -25328 61274 68138 29355 -27151 -67531 -45189 -20260 -64304 -51793 5274
5489E274L6182L074j7301J5113l9066l7819j7118j975K7645J3841o5334l3309
$$ 5274 41456 44530 27229 42342 3276 -34543 -51661 -53636 -25991 -12150 -77484 -110793
5477a10793k0457N015M919M8600M5240M3177J6008m2000j0662k8788r462J0495
$$ -110793 -131250 -126235 -121316 -72716 -27476 15701 31709 -10291 -20953 -49741 -59203 -48708
5465d8708K3960Q232m0566j9638M0095Q8736M1836J8960j12209n5162K7503N659
$$ -48708 -24748 -16516 -57082 -76720 -36625 52111 93947 112907 698 -54464 -26961 -21302
5453b1302l7068J3979M5839l0733o065J9602q166l0734l0400K9510M5779J6930
$$ -21302 -58370 -44391 1448 -29285 -35350 -15748 -23914 -54648 -85048 -55538 -9759 7171
5441G171p2457n4233M1362m420j542P042J1770m0282L0718N6447l586L1090J5704
$$ 7171 -65286 -119519 -78157 -82577 -84119 -77077 -65307 -105589 -74871 -18424 -22010 9080 24784
5428B4784k5986m3011J8479k5352j0492m6037L1328L8343N9616M1540r708q6578
$$ 24784 -1202 -44213 -25734 -51086 -61578 -107615 -76287 -37944 21672 63212 53504 -33074
5416c3074j9431k8691J7990P3131K9386m5691l0564l2988M8242r31O982o124K689
$$ -33074 -52505 -81196 -63206 9925 39311 -6380 -36944 -69932 -21690 -22621 -15639 -21763 -19074
5403a9074n945O321N2434Q652p2020k4914K911l5811K0091O4533N636j294o8825
$$ -19074 -25019 -18698 33736 42388 -29632 -54546 -51635 -87446 -67355 -2822 2814 1520 -67305
5390f7305j9700j4123n4497k5205J06315N2578N994j6871j0863j0326L4776J1777
$$ -67305 -87005 -101128 -155625 -180830 -74515 -21937 -15943 -32814 -43677 -54003 -19227 -7450
5378g450J9931M6832L9237j510r149j0592K5325n8358p887P996n0892P726o6793
$$ -7450 12481 59313 98550 97040 87891 77299 102624 44266 36379 44375 -6517 1209 -65584
5365f5584j1216K4445N5957n0704j6775o395r484K2647K7528R333L4292R687p5558
$$ -65584 -76800 -52355 3602 -47102 -63877 -70272 -79756 -57109 -29581 -20248 14044 23731 -51827
5352e1827k9491L1285N787j7060k719J7045J5252M7004r225J365J5982j0313k7292
$$ -51827 -81318 -50033 -44246 -61306 -64025 -46980 -31728 15276 6051 7416 23398 13085 -14207
5339a4207q838l7221o0322J8135M4705k3446j9281j9045K0539N2050P952p430
$$ -14207 -23045 -60266 -120588 -102453 -57748 -81194 -100475 -119520 -98981 -46931 -38979 -46409
5327d6409N4447j1405l202k6425m4498k4940K4418k2456j1525R2224O1683l6561
$$ -46409 8038 -3367 -6569 -32994 -77492 -102432 -78014 -100470 -111995 -19771 41912 5351
5315E351l9691j5487j2360J6485k6398J0033J1773q417J8400l9345J1937l4452
$$ 5351 -34340 -49827 -62187 -45702 -72100 -62067 -50294 -58711 -40311 -79656 -67719 -102171
5303a02171Q598J6514N7708L5009j299j7878m0244J3478K4351r489K9859q347
$$ -102171 -93573 -77059 -19351 15658 14359 -3519 -43763 -30285 -5934 -15423 14436 6089
5291F089K684k6029j2862l3727m2526K3007P402N1065m2445l0499K7771N887N4019
$$ 6089 8773 -17256 -30118 -63845 -106371 -83364 -75962 -24897 -67342 -97841 -70070 -64183 -10164
5278a0164r869k1630N5420K7604k3322l5661j8578l4202m3924K3722P8454M967
$$ -10164 -20033 -41663 13757 41361 18039 -17622 -36200 -70402 -114326 -90604 -12150 -7183
5266g183p6944m1660Q925N2614O660q578L213j8174l5729N0681J15471J2482j8224
$$ -7183 -84127 -125787 -116862 -64248 -57588 -66166 -62953 -81127 -116856 -66175 49296 61778 43554
5253D3554L841K2191o5444m3905L0628K116j781J6958P064K3524J2234L7128k7446
$$ 43554 47395 69586 4142 -39763 -9135 -7019 -8800 8158 15222 38746 50980 88108 60662
5240F0662j9347r351J1510K5718L8900m6190k6034l1052R273k5317n7342m1758
$$ 60662 41315 31964 43474 69192 108092 61902 35868 4816 14089 -11228 -68570 -110328
5228a10328M625J4315k919l2505m3570K5416R6377Q5592k086k2663K0631k5118
$$ -110328 -105703 -91388 -94307 -126812 -170382 -144966 -48589 37003 34917 12254 32885 7767
5216G767j0078k1608k0372L978Q029J4359K8930L5277n206o4912j7929J9359m815
$$ 7767 -2311 -23919 -44291 -40313 -32284 -17925 11005 46282 41076 -23836 -41765 -22406 -27221
5203b7221o798n0966l9378N168L4438m709M0394L8264o7711k9411J2190M0323
$$ -27221 -34019 -84985 -124363 -119195 -84757 -89466 -49072 -10808 -78519 -107930 -95740 -55417
5191e5417l5248m5532Q0007N4795j4077j9879N7005P5762O1334k7384q7181m5970
$$ -55417 -90665 -136197 -56190 -1395 -15472 -35351 21654 97416 158750 131366 44185 -1785
5179a785P985l3367O5818M8731k527L4252j9019m9586q5818k9254K6606m1433
$$ -1785 6200 -27167 38651 87382 84855 119107 100088 50502 -35316 -64570 -37964 -79397
5167g9397K0946P909k2271K0666k6323k9448n875M0456R026j4737L3606K7477
$$ -79397 -58451 -50542 -72813 -52147 -78470 -107918 -113793 -73337 -64311 -79048 -45442 -17965
5155a7965q549l4032k2413M0326Q5031K1381P96l443q4892m572J354j1714q733
$$ -17965 -26514 -60546 -82959 -42633 42398 63779 64575 61132 -23760 -28332 -26978 -38692 -47425
5142d7425l986k8727M913Q307l2848L4114N5472L2034m4662l6152K7976L8954
$$ -47425 -51411 -80138 -75225 -66918 -99766 -65652 -10180 21854 -22808 -58960 -30984 7970
5130G970O443l2119m0220J7595O7107j4034o2409M4827N7676K4167L8318j0584
$$ 7970 14413 -17706 -57926 -40331 26776 12742 -49667 -4840 52836 77003 115321 104737
5118A04737m9827m9021J1059L8648l5552J0380k6982P373J4141K0559l900l09
$$ 104737 54910 5889 16948 55596 20044 30424 3442 10815 24956 45515 41615 41306
5106D1306Q507P74n625o8093J3066k869q3229K9887N3249K3880l6667P9126j1051
$$ 41306 49813 50587 44962 -23131 -10065 -12934 -96163 -66276 -13027 10853 -25814 53312 42261
5093D2261n2582j9219j9737n1758m9744J0286N8566L192J16843K299k5173j2078
$$ 42261 -10321 -29540 -49277 -101035 -150779 -140493 -81927 -78735 38108 40407 15234 3156
5081C156o1117K7482j3940J5892L2964p578K4980r969n8333k9487k5146l551M5582
$$ 3156 -57961 -30479 -44419 -28527 4437 -3141 21839 11870 -46463 -75950 -101096 -104647 -59065
5068e9065R6753M5007j2480o0526k8846K2416M9650J697k0023k2898J056k5003
$$ -59065 37688 82695 70215 9689 -19157 3259 52909 54606 34583 11685 12741 -12262
5056a2262k731m440P185M0054K7484q986L9812N4745j7729j2841j1536J232p9365
$$ -12262 -14993 -19433 -12248 27806 55290 46304 86116 140861 123132 110291 98755 99987 20622
5043B0622n5064m4949m0036P614K7934l4157j2837Q3919M0074k1275n312M8263
$$ 20622 -34442 -79391 -119427 -111813 -83879 -118036 -130873 -46954 -6880 -28155 -33467 14796
5031A4796N1770K912o0542N838K9392r8699l1880L9714L0150k8234l6129j4243
$$ 14796 66566 69478 8936 14774 44166 -54533 -86413 -46699 -16549 -44783 -80912 -95155
5019i5155j6506l1471K2935Q5428J6421m766m9045L4336Q5192k3025j5393K5268
$$ -95155 -111661 -143132 -120197 -34769 -18348 -23114 -72159 -37823 47369 24344 8951 34219
5007C4219j535L6405q432q1298J5739m6124k5280r3M0618O4482J3167O690l0569
$$ 34219 32684 69089 60657 -20641 -4902 -51026 -76306 -76399 -35781 28701 41868 48558 17989
4994A7989p064k5002l3879j0606O9050J1063m3747l5311k6814K3965P7927l5449
$$ 17989 10925 -14077 -47956 -58562 10488 21551 -22196 -57507 -84321 -60356 17571 -17878
4982a7878m3178N7718P658n2748m446J4113J4637m917R11k3363P5160K815o0747
$$ -17878 -61056 -3338 4320 -48428 -52874 -38761 -24124 -29041 -28130 -51493 23667 26482 -34265
4969c4265l4267J6826K4011l815K9479O0994j9995k4111J4132l172j874l0694
$$ -34265 -68532 -51706 -27695 -31510 -2031 58963 38968 14857 28989 25817 23943 -6751
4957f751J8020p298J1983r143k0708M3795M9044J2582K7124j47886r0902N7280
$$ -6751 11269 3971 15954 6811 -13897 29898 78942 91524 118648 -29238 -120140 -62860
4945f2860L185J6711N0948L026n6775R414Q769m876N9855L4899j4662r659k5161
$$ -62860 -59675 -42964 7984 11010 -45765 -36351 -27582 -32458 27397 62296 47634 37975 12814
4932A2814p0519K9416L166J8912K4148N4059Q04n7171l6447K0090k4161l6335
$$ 12814 -57705 -28289 -25123 -6211 17937 71996 72800 15629 -20818 -728 -24889 -61224
4920f1224K2623N630j9359j2266l7065M3023L4139K2310l369j0177J2654K9984
$$ -61224 -38601 -32971 -52330 -64596 -101661 -58638 -24499 -2189 -5558 -15735 -3081 26903
4908B6903j3816N0691J8732k2101k3736n8529K1081N7672J4319p6816l3166J887
$$ 26903 13087 63778 82510 60409 36673 -21856 -775 56897 71216 -5600 -38766 -36879
4896c6879M9926J4355l654o0914l3060M9166J2269k4643l4969j7205J7181L8306
$$ -36879 13047 27402 23748 -37166 -70226 -21060 -8791 -33434 -68403 -85608 -68427 -30121
4884c0121L5489P376J9749J8867L3148j0815k4652k0140m9234m3306J2539Q0004
$$ -30121 5368 12744 32493 51360 84508 73693 49041 28901 -20333 -63639 -51100 28904
4872B8904k92O055M8996j931n4604n8L7776o732R45m3020K6400l383k8268m0955
$$ 28904 28612 34667 83663 81732 27128 27070 64846 58114 59059 16039 42439 39056 10788 -30167
4858c0167k3946K9545M5685r339p7810o7115l701q070J7389K4666M0762r442N2131
$$ -30167 -54113 -24568 21117 11778 -66032 -133147 -136848 -144918 -127529 -102863 -62101 -71543 -19412
4845a9412k6547l8416M0567K0703l241M9320L9l188M2424J723n1292j5961J1154
$$ -19412 -45959 -84375 -43808 -23105 -26346 22974 23013 19825 62249 63972 12680 -3281 7873
4832G873K7074n9283p1425m3962K2331M911J6101L3902J4502O406P5536j4067
$$ 7873 34947 -24336 -95761 -139723 -117392 -112481 -96380 -62478 -47976 -41570 33966 19899
4820A9899n3672K6207M0614J0139J9824J004n096m3584p126k6376j4844j0263
$$ 19899 -33773 -7566 33048 43187 63011 64015 58919 15335 8209 -18167 -33011 -43274
4808d3274K9799j4364O0406N0324n2614o3032l6214m7245K1467L0956l3194m5067
$$ -43274 -13475 -27839 32567 82891 30277 -32755 -68969 -116214 -94747 -63791 -96985 -142052
4796a42052p228j7462J4916J923K8867K3536j160P657J5636J9115j3291j0027
$$ -142052 -149280 -166742 -151826 -149903 -121036 -97500 -98660 -91003 -75367 -56252 -69543 -79570
4784g9570J8873O2616K0657j4838K3262R1596l4801o2242k686n9008r746o339
$$ -79570 -60697 1919 22576 7738 31000 122596 87795 25553 22867 -36141 -45887 -52226
4772e2226k4680P1331M213J3884J3170l8682p8386j1707J8117L8122k1303j2574
$$ -52226 -76906 -5575 -1362 12522 25692 -12990 -91376 -103083 -84966 -46844 -68147 -80721
4760h0721K5899N7867L2226L2553o5307n4151j2106O842M3028J6691k2996J3862
$$ -80721 -54822 3045 35271 67824 2517 -51634 -63740 -56898 -13870 2821 -20175 -6313
4748f313m8930j9076Q4202M6827j9007p3506q0156J8630K3509l9600J635Q9467
$$ -6313 -55243 -74319 9883 56710 37703 -35803 -115959 -97329 -73820 -113420 -111785 -22318
4736b2318L7775J497k9489j6493J5527j3438o7799p408j5513R918L6643K7724
$$ -22318 15457 16954 -12535 -29028 -13501 -26939 -94738 -102146 -117659 -107741 -71098 -43374
4724d3374q83J0971O1157j4983M2049O7702n7177m4184J6228j3892o420k672l5923
$$ -43374 -44257 -33286 27871 12888 54937 122639 65462 21278 37506 23614 17194 14522 -21401
$$ [...]
##END NTUPLES=NMR SPECTRUM
##END=
