##TITLE=Analysis number 317620
Compound Code cc 00111
Project Code adrs
Chemist Name af chempharm
##JCAMPDX= 6.0         $$ Bruker NMR JCAMP-DX V2.0
##DATA TYPE= NMR SPECTRUM
##DATA CLASS= NTUPLES
##ORIGIN= Bruker BioSpin GmbH
##OWNER= nmr
$$ XWIN-NMR		Version 3.5
$$ Tue Feb 28 08:17:53 2006 GMT Standard Time (UT+0h)  MAYBRIDGE\nmr@NMR_250MHZ
##.OBSERVE FREQUENCY= 250.131544655141
##.OBSERVE NUCLEUS= ^1H
##.ACQUISITION MODE= SIMULTANEOUS (DQD)
##.ACQUISITION SCHEME= undefined
##.AVERAGES= 16
##.DIGITISER RES= 18
##SPECTROMETER/DATA SYSTEM= dpx250
##.PULSE SEQUENCE= zg30
##.SOLVENT NAME= CDCl3
##.SHIFT REFERENCE= (INTERNAL, CDCl3, 0, 16.522)
##AUDIT TRAIL= $$ (NUMBER, WHEN, WHO, WHERE, WHAT)
$$ ##TITLE= Audit trail, XWIN-NMR		Version 3.5
$$ ##JCAMPDX= 5.01
$$ ##ORIGIN= Bruker BioSpin GmbH
$$ ##OWNER= nmr
$$ C:\u/data/dgb/nmr/ADRS/16950/pdata/1/auditp.txt
$$ ##AUDIT TRAIL=  $$ (NUMBER, WHEN, WHO, WHERE, WHAT)
(   1,<2006-02-28 08:17:32.53 +000>,<MAYBRIDGE\nmr>,<NMR_250MHZ>,
      <created by zg, POWCHK disabled, PULCHK disabled
       configuration hash MD5:
       84 BC 41 DB A1 6E 1D 46 DA 25 12 A5 C1 ED C5 3A
       data hash MD5: 64K
       8A 26 8A DF B9 80 80 F4 3E 2F 29 C7 61 AE 73 04>)
(   2,<2006-02-28 08:17:45.19 +000>,<MAYBRIDGE\nmr>,<NMR_250MHZ>,
      <Start of raw data processing
       ef LB = 0.3 FT_mod = 6 PKNL = 1 SI = 32K 
       data hash MD5: 32K
       84 29 98 B1 2E 1E D2 C7 C8 E4 42 B1 8E 5B 57 98>)
(   3,<2006-02-28 08:17:47.08 +000>,<MAYBRIDGE\nmr>,<NMR_250MHZ>,
      <apk 
       data hash MD5: 32K
       19 EB 78 D4 C1 F8 14 3E A8 E0 14 0F 37 49 07 27>)
(   4,<2006-02-28 08:17:47.87 +000>,<MAYBRIDGE\nmr>,<NMR_250MHZ>,
      <abs ABSG = 5 
       data hash MD5: 32K
       B7 C2 7A 5E 6C E7 37 11 C9 C3 98 F5 FE 30 FC 64>)
$$ ##END=
$$ 
$$ hash MD5
$$ D9 CE 47 C1 91 8C 3E 3C 05 09 96 7A 93 57 12 E7
##$RELAX= 
##$RELAX= 
##$RELAX= 
##$RELAX= 
##$RELAX= 
##$RELAX= 
##$RELAX= 
$$ Bruker specific parameters
$$ --------------------------
##$DU= <C:\u>
##$EXPNO= 16950
##$NAME= <ADRS>
##$PROCNO= 1
##$TYPE= <nmr>
##$USER= <dgb>
##$AMP= (0..31)
100 100 100 100 100 100 100 100 100 100 100 100 100 100 100 100 100 100 
100 100 100 100 100 100 100 100 100 100 100 100 100 100 
##$AQSEQ= 0
##$AQ_mod= 3
##$AUNM= <au_zg>
##$AUTOPOS= <10 >
##$BF1= 250.13
##$BF2= 250.13
##$BF3= 250.13
##$BF4= 250.13
##$BF5= 500.13
##$BF6= 500.13
##$BF7= 500.13
##$BF8= 500.13
##$BYTORDA= 1
##$CFDGTYP= 0
##$CFRGTYP= 5
##$CHEMSTR= <none>
##$CNST= (0..31)
1 1 145 1 1 1 1 1 1 1 1 1 1 1 1 1 1 1 1 1 1 1 1 1 1 1 1 1 1 1 1 1 
##$CPDPRG= <>
##$CPDPRG1= <>
##$CPDPRG2= <>
##$CPDPRG3= <>
##$CPDPRG4= <mlev>
##$CPDPRG5= <mlev>
##$CPDPRG6= <mlev>
##$CPDPRG7= <mlev>
##$CPDPRG8= <mlev>
##$CPDPRGB= <>
##$CPDPRGT= <>
##$D= (0..31)
0 1 0 0 0 0 0 0 0 0.06 0 0 0 0 0 0 0.0002 0 0 0 0 0 0 0 0 0 0 0 0 0 0 
0 
##$DATE= 1141114651
##$DBL= (0..7)
120 120 120 120 120 120 120 120 
##$DBP= (0..7)
150 150 150 150 150 150 150 150 
##$DBP07= 0
##$DBPNAM0= <>
##$DBPNAM1= <>
##$DBPNAM2= <>
$$ [...]
##$SUBNAM7= <"">
##$SUBNAM8= <"">
##$SUBNAM9= <"">
##$SW= 20.6930455092707
##$SWIBOX= (0..15)
0 0 3 0 0 0 0 0 0 0 0 0 0 0 0 0 
##$SW_h= 5175.983436853
##$TD= 65536
##$TD0= 1
##$TE= 293.16
##$TE2= 300
##$TE3= 300
##$TEG= 300
##$TL= (0..7)
0 120 120 120 120 120 120 120 
##$TP= (0..7)
150 150 150 150 150 150 150 150 
##$TP07= 0
##$TPNAME0= <>
##$TPNAME1= <>
##$TPNAME2= <>
##$TPNAME3= <>
##$TPNAME4= <>
##$TPNAME5= <>
##$TPNAME6= <>
##$TPNAME7= <>
##$TPOAL= (0..7)
0.5 0.5 0.5 0.5 0.5 0.5 0.5 0.5 
##$TPOFFS= (0..7)
0 0 0 0 0 0 0 0 
##$TUNHIN= 0
##$TUNHOUT= 0
##$TUNXOUT= 0
##$USERA1= <user>
##$USERA2= <user>
##$USERA3= <user>
##$USERA4= <user>
##$USERA5= <user>
##$V9= 5
##$VALIST= <valist>
##$VCLIST= <CCCCCCCCCCCCCCC>
##$VD= 0
##$VDLIST= <DDDDDDDDDDDDDDD>
##$VPLIST= <PPPPPPPPPPPPPPP>
##$VTLIST= <TTTTTTTTTTTTTTT>
##$WBST= 1024
##$WBSW= 4
##$XGAIN= (0..3)
0 0 0 0 
##$XL= 0
##$YL= 0
##$YMAX_a= 435743
##$YMIN_a= -444024
##$ZGOPTNS= <>
##$ZL1= 120
##$ZL2= 120
##$ZL3= 120
##$ZL4= 120
##$ABSF1= 16.522
##$ABSF2= -4.171173
##$ABSG= 5
##$ABSL= 3
##$ALPHA= 0
##$AQORDER= 0
##$ASSFAC= 0
##$ASSFACI= 0
##$ASSFACX= 0
##$ASSWID= 0
##$AUNMP= <proc_1d>
##$AZFE= 0.1
##$AZFW= 0.1
##$BCFW= 0
##$BC_mod= 0
##$BYTORDP= 0
##$COROFFS= 0
##$CY= 12.5
##$DATMOD= 1
##$DC= 0
##$DFILT= <>
##$DTYPP= 0
##$F1P= 14.0000005364418
##$F2P= -0.99999901652339
##$FCOR= 0.5
##$FTSIZE= 32768
##$FT_mod= 6
##$GAMMA= 0
##$GB= 0
##$INTBC= 1
##$INTSCL= 1
##$ISEN= 128
##$LB= 0.3
##$LEV0= 0
##$LPBIN= 0
##$MAXI= 10000
##$MC2= 0
##$MEAN= 0
##$ME_mod= 0
##$MI= 0
##$NCOEF= 0
##$NC_proc= -1
##$NLEV= 6
##$NOISF1= 0
##$NOISF2= 0
##$NSP= 0
##$NTH_PI= 0
##$NZP= 0
##$OFFSET= 16.522
##$PC= 1
##$PHC0= -117.6324
##$PHC1= 10.18688
##$PH_mod= 1
##$PKNL= yes
##$PPARMOD= 0
##$PSCAL= 4
##$PSIGN= 0
##$REVERSE= no
##$SF= 250.13
##$SI= 32768
##$SIGF1= 0
##$SIGF2= 0
##$SINO= 400
##$SIOLD= 32768
##$SREGLST= <1H.CDCl3>
##$SSB= 0
##$STSI= 32768
##$STSR= 0
##$SW_p= 5175.98343685301
##$SYMM= 0
##$S_DEV= 0
##$TDeff= 65536
##$TDoff= 0
##$TI= <Analysis number 999999
Compound Code 99
Book Reference 9
Project Code 9>
##$TILT= no
##$TM1= 0
##$TM2= 0
##$TOPLEV= 0
##$USERP1= <user>
##$USERP2= <user>
##$USERP3= <user>
##$USERP4= <user>
##$USERP5= <user>
##$WDW= 1
##$XDIM= 32768
##$YMAX_p= 363438773
##$YMIN_p= -40529
$$ End of Bruker specific parameters
$$ ---------------------------------
##NTUPLES= NMR SPECTRUM
##VAR_NAME=  FREQUENCY,     SPECTRUM/REAL,   SPECTRUM/IMAG
##SYMBOL=    X,             R,               I
##VAR_TYPE=  INDEPENDENT,   DEPENDENT,       DEPENDENT
##VAR_FORM=  AFFN,          ASDF,            ASDF
##VAR_DIM=   32768,         32768,           32768
##UNITS=     HZ,            ARBITRARY UNITS, ARBITRARY UNITS
##FACTOR=    0.157963299565203, 1,           1
##FIRST=     4132.6476996994, 0,             0
##LAST=      -1043.33573715361, 0,           0
##MIN=       -1043.33573715361, -40529,      0
##MAX=       4132.6476996994, 363438773,     0
$$ Real data points
##PAGE= N=1
##DATA TABLE= (X++(R..R)), XYDATA
$$ [...]
##PAGE= N=2
##DATA TABLE= (X++(I..I)), XYDATA
$$ plain form
14753 -60650 -46383 -40905 -40285 -39753 -39022 -49673 -53403 -48554 -45501 -44530 -49360 -55658 -58888 -61755 -70039
14738 -70039 -71192 -62795 -52040 -49946 -49631 -57105 -52529 -48871 -53988 -53565 -41687 -30807 -33039 -41553
14724 -41553 -35476 -32066 -34035 -39463 -42244 -42958 -42441 -42929 -47980 -51231 -50981 -58610 -57581 -50132 -48304
14709 -48304 -48162 -45338 -42219 -43079 -42724 -37397 -36410 -35863 -34819 -36267 -39851 -33548 -30897 -26594 -25618 -32991
14693 -32991 -40330 -41589 -42989 -48303 -42370 -35972 -37360 -42395 -41676 -37001 -25673 -16021 -20913 -22754
14679 -22754 -19654 -19225 -20754 -31151 -33067 -29803 -26167 -36883 -37284 -41310 -36661 -34448 -34246 -40944 -45391
14664 -45391 -38472 -32719 -27540 -29739 -27639 -26819 -25224 -28293 -20762 -17204 -14269 -10819 -21838 -23256
14650 -23256 -29284 -35359 -44531 -38870 -35536 -44554 -45989 -37367 -38986 -44103 -48913 -50268 -46490 -34672
$$ packed form
14753f0650J4267N478O20N32P31j0651l730M849L053R71m830o298l230k867q284
14738g0039j153Q397J0755K094L15p474M576L658n117M23J1878J0880k232q514
14724d1553O077L410j969n428k781p14N17m88n051l251K50p629J029P449J828
14709d8304J42K824L119q60L55N327R87N47J044j448l584O303K651M303R76p373
14693c2991p339j259j400n314N933O398j388n035P19M675J1328R652m892j841
14679b2754L100M29j529j0397j916L264L636j0716m01m026M649K213K02o698m447
14664d5391O919N753N179k199K100Q20J595l069P531L558K935L450j1019j418
14650b3256o028o075r172N661L334r018j435Q622j619n117m810j355L778J1818
$$ plain form
14636 -34672 -34828 -24933 -22858 -23197 -24246 -17910 -19596 -20180 -20768 -20040 -21076 -24376 -31547 -34361 -27884 -28336
14620 -28336 -28596 -23449 -28493 -29848 -37505 -41119 -42657 -35175 -24693 -23305 -25721 -27280 -28957 -28926 -31094
14605 -31094 -21168 -15220 -17207 -18796 -25928 -36491 -33654 -28965 -28904 -31814 -34034 -22884 -19380 -25085
14591 -25085 -28785 -25536 -35124 -27507 -25308 -24400 -17690 -25809 -26171 -28621 -29320 -26357 -23316 -27200 -22815
14576 -22815 -18108 -14875 -18519 -19821 -5945 -2223 -1988 -4656 -13302 -21184 -21210 -25614 -28747 -23630 -21743
14561 -21743 -23668 -25746 -30409 -32297 -32302 -33700 -29292 -21456 -20993 -23855 -23767 -24621 -21546 -16524 -15786 -10388
14545 -10388 -14761 -21217 -18996 -16857 -21865 -18110 -14894 -14670 -22770 -14585 -5706 -12375 -13688 -8062 -11187
14530 -11187 -21001 -31617 -33969 -35279 -34750 -27778 -22857 -19650 -18489 -24279 -29106 -24847 -15034 -15696 -18276
$$ packed form
14636c4672j56R895K075l39j049O336j686n84n88P28j036l300p171k814O477m52
14620b8336k60N147n044j355p657l614j538P482J0482J388k416j559j677L1k168
14605c1094R926N948j987j589p132j0563K837M689O1k910k220J1150L504n705
14591b5085l700L249r588P617K199R08O710q119l62k450o99K963L041l884M385
14576b2815M707L233l644j302J3876L722K35k668q646p882k6m404l133N117J887
14561b1743j925k078m663j888nj398M408P836M63k862Q8q54L075N022P38N398
14545a0388m373o456K221K139n008L755L216K24q100Q185Q879o669j313N626l125
14530a1187r814j0616k352j310N29O972M921L207J161n790m827M259R813o62k580
$$ plain form
14515 -18276 -18868 -23262 -20765 -19713 -17284 -21232 -31522 -40286 -32463 -26492 -18811 -13275 -17208 -14216
14501 -14216 -10460 -19633 -21567 -21049 -21216 -24578 -26115 -22809 -25448 -25503 -21232 -14762 -6076 559 -1472
14486 -1472 -7241 -3400 4154 5562 50 291 1668 -7638 -4662 -6022 -9402 -11679 -10254 -9627 -6375
14471 -6375 -2347 2323 1864 5091 9899 6181 86 -3086 -973 3338 6504 9043 5932 2685 2109
14456 2109 705 -2551 -5886 -10145 -18562 -25913 -21273 -19540 -15627 -9082 -9599 -21438 -23541 -18420 -15640
14441 -15640 -10690 -1900 -10839 -9892 -1019 -3098 -4656 -6055 -6249 -4556 -7619 -19338 -11948 -7260 -2647
14426 -2647 8134 20052 21177 11840 518 -6361 -9183 -5054 -2687 3065 6281 -3172 -5659 -9974
14412 -9974 -17035 -9061 1112 -3053 -4177 1275 -6416 -5494 -6860 -14101 -16723 -9088 -1173 -1290 -6325
$$ packed form
14515a8276n92m394K497J052K429l948j0290q764P823N971P681N536l933K992
14501a4216L756r173j934N18j67l362j537L306k639n5M271O470Q686O635k031
14486a472n769L841P554J408n512K41J377r306K976j360l380k277J425O27L252
14471f375M028M670m59L227M808l718o095l172K113M311L166K539l111l247n76
14456B109j404l256l335m259q417p351M640J733L913O545n17j1839k103N121K780
14441a5640M950Q790q939R47Q873k079j558j399j94J693l063j1719P390M688M613
14426b647J0781J1918J125r337j1322o879k822M129K367N752L216r453k487m315
14412i974p061P974J0173m165j124N452p691R22j366p241k622P635P915j17n035
$$ plain form
14397 -6325 -2328 -10239 -10904 -10937 -11415 -6903 2008 873 3915 11649 13134 11319 -1865 -12203 -15792
14382 -15792 -5095 1922 9558 8266 -1125 -9941 -16509 -15579 -5028 -3013 -10336 -7637 -19432 -21490
14368 -21490 -8995 -3880 -180 -5776 -9682 -11822 -8417 -6232 -7242 -18193 -7054 2554 1660 -1911
14354 -1911 1880 6078 12297 16302 11406 1847 -3376 -362 10224 13260 9655 3353 -470 4252
14340 4252 7846 3268 -4518 -960 -483 8053 13701 13225 14990 16898 25117 20308 17523 17376 16751 9951
14324 9951 3182 2064 4401 1691 4185 9321 3754 -1917 7229 9959 10688 915 -3462 -2920 5053
14309 5053 14098 -1889 -5650 -5768 -3450 4921 11178 10747 9219 6471 9283 20258 18410 11594 1755
14294 1755 -6249 -1754 954 6674 14318 10173 6917 6908 3325 103 6321 14512 14095 16597 18230 18258
$$ packed form
14397f325L997p911o65l3m78M512Q911j135L042P734J485j815j3184j0338l589
14382a5792J0697P017P636j292r391q816o568R30J0551K015p323K699j1795k058
14368b1490J2495N115L700n596l906k140L405K185j010j0951J1139R608q94l571
14354a911L791M198O219M005m896r559n223L014J0586L036l605o302l823M722
14340D252L594m578p786L558M77Q536N648m76J765J908Q219m809k785j47o25o800
14324I951o769j118K337k710K494N136n567n671R146K730P29r773m377N42P973
14309E053R045j5987l761j18K318Q371O257m31j528k748K812J0975j848o816r839
14294A755q004M495K708N720P644m145l256rl583l222O218Q191m17K502J633K8
$$ plain form
14278 18258 12940 11022 19124 21870 21453 16274 9068 9915 3852 1169 6283 13955 10191 15343 21824
14263 21824 21505 22885 14835 10873 7128 12636 15835 17506 26554 18367 7093 2041 1680 8243 13342
14248 13342 10760 10335 15379 24487 20112 23595 18321 6096 6318 1087 1048 5038 10442 10866 14531
14233 14531 16639 21711 14290 8947 12813 12438 11643 14256 10513 5751 6315 9186 4724 -4693 -2386
14218 -2386 8239 15995 17672 16281 14012 7620 11981 21584 23554 15711 22561 19119 16035 15373 19673
14203 19673 25648 23612 29814 25770 20432 14741 20449 16160 16744 20399 22317 21184 26490 28735 23646
14188 23646 22028 12805 12515 19661 17309 11921 15621 19494 24819 21393 16080 17759 21798 18144 21574
14173 21574 25287 25583 34261 30841 21981 16100 16196 20203 19870 15748 11949 13662 10570 8675 9541 14738
$$ packed form
14278A8258n318j918Q102K746m17n179p206Q47o063k683N114P672l764N152O481
14263B1824l19J380q050l962l745N508L199J671R048q187j1274n052l61O563N099
14248A3342k582m25N044R108m375L483n274j2225K22n231l9L990N404M24L665
14233A4531K108N072p421n343L866l75p95K613l743m762N64K871m462r417K307
14218b386J0625P756J677j391k269o392M361R603J970p843O850l442l084o62M300
14203A9673N975k036O202m044n338n691N708m289N84L655J918j133N306K245n089
14188B3646j618r223k90P146k352n388L700L873N325l426n313J679M039l654L430
14173B1574L713K96Q678l420q860n881R6M007l33m122l799J713l092j895Q66N197
$$ plain form
14157 14738 15488 19506 21369 16568 13388 18159 25105 23362 28424 32907 28697 20523 22262 31764 40310
14142 40310 42988 33169 33487 31197 29309 27760 25238 21687 23976 24847 24713 30146 37110 36773 31735
14127 31735 21993 16636 21717 27143 25158 19736 18302 22588 29081 37271 38934 36322 30252 20219
14113 20219 19189 18150 17325 16068 15947 21196 22016 32726 39183 40752 31171 36889 43425 47322 44943
14098 44943 40197 44728 43702 39549 30121 16878 18875 30458 45433 39942 33278 38169 35957 26008
14084 26008 23787 28302 35003 33593 27883 25960 38027 37495 19080 21844 26033 25496 25630 27016 30441
14069 30441 26675 30097 35930 32960 28068 38796 45464 47796 51667 58255 58359 52263 49746 44122
14055 44122 32270 38038 44197 42940 41029 36268 28762 21423 30700 30421 32538 29301 26783 24198
$$ packed form
14157A4738P50M018J863m801l180M771O946j743N062M483m210q174J739R502Q546
14142D0310K678r819L18k290j888j549k522l551K289Q71j34N433O964l37n038
14127C1735r742n357N081N426j985n422j434M286O493Q190J663k612o070j0033
14113B0219j030j039q25j257j21N249Q20J0710O457J569r581N718O536L897k379
14098D4943m746M531j026m153r428j3243J997J1583J4975n491o664M891k212r949
14084B6008k221M515O701j410n710j923J2067n32j8415K764M189n37J34J386L425
14069C0441l766L422N833k970m892J0728O668K332L871O588J04o096k517n624
14055D4122j1852N768O159j257j911m761p506p339R277k79K117l237k518k585
$$ plain form
14041 24198 29085 23342 29996 37013 40668 41698 42371 35890 33870 28551 30819 33512 37697 38515 34129
14026 34129 34554 36380 37290 38153 41363 41301 35644 29035 33064 41343 39187 41474 38831 43808 38188 29857
14010 29857 18890 19862 29053 26554 29022 33649 32511 33720 35253 30648 31679 37726 37731 32293 29907
13995 29907 34568 41442 43495 40833 42853 37714 32619 27137 32788 34096 33978 39871 51377 52938
13981 52938 50793 48166 46302 46735 45727 42732 35575 39454 43308 39360 39803 45111 47576 45195 37094
13966 37094 40442 50020 45819 42356 38377 30518 26592 33471 40369 41239 46638 48894 49161 41361 38034
13951 38034 32404 32264 37276 43629 44447 48064 51916 45304 42505 40837 45083 53502 48536 48967 54974
13936 54974 51607 49900 54572 55120 51522 53410 55981 45912 45912 54767 55760 45777 42567 42971 38638 40856
$$ packed form
14041B4198M887n743O654P017L655J030O73o481k020n319K268K693M185Q18m386
14026C4129M25J826R10Q63L210o2n657o609M029Q279k156K287k643M977n620q331
14010B9857j0967R72R191k499K468M627j138J209J533m605J031O047Nn438k386
13995B9907M661O874K053k662K020n139n095n482N651J308j18N893J1506J561
13981E2938k145k627j864M33j008k995p157L879L854l948M43N308K465k381q101
13966C7094L348R578m201l463l979p859l926O879O898Q70N399K256K67p800l327
13951C8034n630j40N012O353Q18L617L852o612k799j668M246Q419m966M31O007
13936E4974l367j707M672N48l598J888K571j0069%Q855R93r983l210M04m333K218
$$ plain form
13920 40856 44671 46711 48007 46695 42257 40197 39689 40214 44230 40103 45526 48835 55653 53709 51033
13905 51033 58198 63373 57293 48730 38638 37721 36139 34950 42382 38946 40216 45271 46598 49001
13891 49001 51501 48672 46094 56005 57225 49530 47234 46574 50723 48400 54148 53226 49269 49128 48460
13876 48460 42374 48499 57453 56995 45333 31774 28996 34305 37346 40913 47483 47893 44268 38586
13862 38586 33815 42452 48657 47205 54084 52588 48706 57960 63377 66214 63382 58265 51650 43036
13848 43036 35912 36288 37057 35080 34304 42484 51079 49186 46245 55923 60837 55864 47276 54411 60648
13833 60648 57611 56336 57995 58750 60944 47747 41306 38922 48776 60889 58136 60677 59657 60189
13819 60189 61793 52224 47510 52590 57325 61359 55632 50091 49717 51162 49721 40113 35558 28798 41595
$$ packed form
13920D0856L815K040J296j312m438k060n08N25M016m127N423L309O818j944k676
13905E1033P165N175o080q563j0092r17j582j189P432l436J270N055J327K403
13891D9001K500k829k578R911J220p695k296o60M149k323N748r22l957j41o68
13876D8460o086O125Q954m58j1662j3559k778N309L041L567O570M10l625n682
13862C8586m771Q637O205j452O879j496l882R254N417K837k832n117o615q614
13848D3036p124L76P69j977p76Q180Q595j893k941R678M914m973q588P135O237
13833F0648l037j275J659P55K194j3197o441k384R854J2113k753K541j020N32
13819F0189J604r569m714N080M735M034n727n541l74J445j441r608m555o760J2797
$$ plain form
13804 41595 50500 49566 48601 47133 48619 49069 46912 46438 43335 38595 39173 44073 49428 58428 55939 48146
13788 48146 44135 48253 53374 50324 57570 67923 67062 63185 59988 56376 57274 60120 56378 54318 61523
13773 61523 66883 69659 73033 67524 54844 47862 53083 70704 77251 73322 66713 59671 56853 58221
13759 58221 65095 72925 75350 67095 60512 59396 58071 59953 59187 64639 67831 70478 72944 75114 86181
13744 86181 81331 76389 72833 69528 59580 59211 54167 60209 63709 62999 67534 68456 67587 59514 56235
13729 56235 60020 56577 62336 65436 66143 68792 70266 72688 78435 70457 62381 67366 63778 54550 54882
13714 54882 56859 57299 60246 62580 58394 59074 64441 67764 70958 66162 63966 64266 63035 63667 69646
13699 69646 76104 73237 74699 77072 73650 71452 68337 65330 66552 69419 70011 75085 79359 74932 75971
$$ packed form
13804D1595Q905r34r65j468J486M50k157m74l103m740N78M900N355R000k489p793
13788D8146m011M118N121l050P246J0353q61l877l197l612Q98K846l742k060P205
13773F1523N360K776L374n509j2680o982N221J7621O547l929o609p042k818J368
13759E8221O874P830K425q255o583j116j325J882p66N452L192K647K466K170J1067
13744H6181m850m942l556l305r948l69n044O042L500p10M535R22q69q073l279
13729E6235L785l443N759L100P07K649J474K422N747p978q076M985l588r228L32
13714E4882J977M40K947K334m186O80N367L323L194m796k196L00j231O32N979
13699F9646O458k867J462K373l422k198l115l007J222K867N92N074M274m427J039
$$ plain form
13684 75971 74194 67728 70690 73615 75553 68451 68489 78335 83431 81382 76807 71362 64478 68197 73364
13669 73364 71976 66990 62455 57746 65368 70927 72048 68487 72209 75145 70438 72053 77601 69186
13655 69186 69362 71406 61768 53627 51806 51807 61872 67137 68082 72511 77484 77486 70011 68292 68920 67390
13639 67390 69101 68869 66095 57245 63104 73274 66156 59815 58953 51482 57409 71889 70048 62625
13625 62625 63324 69974 74899 76337 70731 60214 55881 63765 63765 71442 70673 65247 63338 55935 52698
13610 52698 53055 60205 67303 68710 66506 66972 67234 66502 68516 72689 78602 79622 73196 71120 70184 67471
13594 67471 62910 55141 62346 74851 79594 86430 94471 95492 92397 90913 87385 79471 71829 64600
13580 64600 64788 67348 73535 77137 80548 79497 74150 75984 77922 83681 85842 79699 84759 87298 80998
$$ packed form
13684G5971j777o466K962K925J938p102L8R846N096k049m575n445o884L719N167
13669G3364j388m986m535m709P622N559J121l561L722K936m707J615N548q415
13655F9186J76K044r638q141j821JJ0065N265R45M429M973Kp475j719O28j530
13639F7390J711k32k774q850N859J0170p118o341q62p471N927J4480j841p423
13625F2625O99O650M925J438n606j0517m333P884%P677p69n426j909p403l237
13610E2698L57P150P098J407k204M66K62p32K014M173N913J020o426k076r36k713
13594F7471m561p769P205J2505M743O836Q041J021l095j484l528p914p642p229
13580F4600J88K560O187L602L411j051n347J834J938N759K161o143N060K539o300
$$ plain form
13565 80998 72399 65669 65047 66046 72409 75888 70108 68482 72858 84009 79516 73505 74449 78386 80569
13550 80569 85449 97151 99733 85753 84366 82087 78847 82100 82460 80173 76816 79365 80327 83248
13536 83248 85569 79584 81888 88131 89786 84341 74559 65225 61688 72872 77695 79135 82610 87122
13522 87122 85823 78133 77739 76439 76457 81026 84626 85844 85144 81935 84419 82753 75005 78416 77534 79291
13506 79291 70334 71250 76858 75287 71167 69642 66249 70039 79988 79121 80227 83870 83340 74144 76531
13491 76531 74365 70832 76141 70960 77898 84580 78970 77430 93300 95075 87226 81015 77575 76739
13477 76739 74323 73749 80726 76532 70821 72349 72119 82691 80914 84914 84700 74321 74484 72244 66017
13462 66017 67082 85357 92454 87657 88163 99032 101172 99314 100034 99709 102733 105069 100479 93790 82208
$$ packed form
13565H0998q599o730o22R99O363L479n780j626M376J1151m493o011R44L937K183
13550H0569M880J1702K582j3980j387k279l240L253L60k287l357K549R62K921
13536H3248K321n985K304O243J655n445r782r334l537J1184M823J440L475M512
13522H7122j299p690l94j300J8M569L600J218p00l209K484j666p748L411q82J757
13506G9291q957R16N608j571m120j525l393L790R949q67J106L643n30r196K387
13491G6531k166l533N309n181O938O682n610j540J5870J775p849o211l440q36
13477G6739k416n74O977m194n711J528k30J0572j777M000k14j0379J63k240o227
13462F6017J065J8275P097m797N06J0869K140j858P20l25L024K336m590o689j1582
$$ plain form
13447 82208 76898 85161 97723 103833 100416 90679 86474 88393 93157 94368 87029 80345 73215 71130
13433 71130 75443 72190 75054 75732 80695 81330 77841 80868 79686 80603 82760 83980 84549 85736 86064 84221
13417 84221 77616 78132 76638 86276 87645 93927 97247 98975 104752 109861 104431 94371 93786 87362 81842
13402 81842 86339 92673 95857 95615 94716 87061 88050 91922 98492 95926 89886 91308 95288 97380 95016
13387 95016 88313 81483 84044 92058 95304 93192 81653 73959 80091 85923 89795 84271 77564 76371
13373 76371 82012 85007 84059 78769 74507 92871 100854 104184 99781 93901 85447 93096 96358 93738
13359 93738 95399 98785 95381 94473 94689 90340 94986 91036 76787 83913 88366 85919 86069 87511 88910
13344 88910 91400 91179 87954 79759 80141 90145 93695 85691 83361 79047 78946 79361 84717 89064 86612
$$ packed form
13447H2208n310Q263J2562O110l417r737m205J919M764J211p339o684p130k085
13433G1130M313l253K864O78M963O35l489L027j182R17K157J220N69J187L28j843
13417H4221o605N16j494R638J369O282L320J728N777N109n430j0060n85o424n520
13402H1842M497O334L184k42q99p655R89L872O570k566o040J422L980K092k364
13387I5016o703o830K561Q014L246k112j1539p694O132N832L872n524o707j193
13373G6371N641K995r48n290m262J8364P983L330m403n880q454P649L262k620
13359I3738J661L386l404r08K16m349M646l950j4249P126M453k447J50J442J399
13344H8910K490k21l225q195L82J0004L550q004k330m314j01M15N356M347k452
$$ plain form
13329 86612 89509 90162 90071 89033 94119 98729 99105 92911 99829 103429 111374 109341 111357 108356 105357
13314 105357 100256 101087 94225 84662 76964 83264 91936 102563 109086 105767 99698 106615 104728 101325
13300 101325 104261 99957 95189 95370 99216 100147 100302 95074 90835 95196 100986 100258 100982 100090 96509 95564
13284 95564 89343 97501 101097 95714 87914 78413 75684 80197 91852 99581 103211 108816 108277 108380 109333
13269 109333 116164 122358 123957 119136 110599 103979 100134 102680 99145 93193 88879 91933 92394 99130
13255 99130 110840 121801 120003 105731 97008 97080 98468 96407 99721 98409 100048 109781 108978 113781
13241 113781 108253 101678 99742 93222 102794 111379 114566 112183 108442 101087 101316 96174 93244 95795
13227 95795 102643 104146 104013 111576 106966 100919 99080 94400 99199 105138 103050 108560 112071 109324 108090
$$ packed form
13329H6612K897O53r1j038N086M610L76o194O918L600P945k033K016l001k999
13314A05357n101Q31o862r563p698O300Q672J0627O523l319o069O917j887l403
13300A01325K936m304m768J81L846R31J55n228m239M361N790p28P24q92l581r45
13284I5564o221Q158L596n383p800r501k729M513J1655P729L630N605n39J03R53
13269A09333O831O194J599m821q537o620l845K546l535n952m314L054M61O736
13255I9130J1710J0961j798j4272q723P2J388k061L314j312J639R733q03M803
13241A13781n528o575j936o520R572Q585L187k383l741p355K29n142k930K551
13227I5795O848J503j33P563m610o047j839m680M799N939k088N510L511k747j234
$$ plain form
13212 108090 102917 104751 111012 108887 112733 113320 113542 114754 110178 101470 96230 97298 101558 99072 92452
13197 92452 89476 100304 104979 96472 84814 89176 98513 106588 106409 102444 109364 117339 117205 111645
13183 111645 113480 106975 97182 96380 101123 99789 99371 96309 97654 107213 114382 113003 109164 116537 114461
13168 114461 112536 120560 125188 125511 117925 108019 111053 116580 111332 100564 102975 107050 103038 113813
13154 113813 119863 110639 112971 121316 119738 125182 119307 114508 109005 111709 112355 103162 101138 101467 99813
13139 99813 98014 99594 109377 115463 116359 121603 129894 125606 117878 120580 126938 127699 120116 113479 112758
13124 112758 120832 123701 130339 133776 134889 130054 120407 123064 116775 117727 121220 124079 116268 112525
13110 112525 112814 112455 115537 126889 130849 121082 115400 113627 113417 122037 121514 121417 121280 116791 109543 103641
$$ packed form
13212A08090n173J834O261k125L846N87K22J212m576q708n240J068M260k486o620
13197I2452k976J0828M675q507j1658M362R337Q075j79l965O920P975j34n560
13183A11645J835o505r793q02M743j334m18l062J345R559P169j379l839P373k076
13168A14461j925Q024M628L23p586r906L034N527n248j0768K411M075m012J0775
13154A13813O050r224K332Q345j578N444n875m799n503K704O46r193k024L29j654
13139I9813j799J580R783O086Q96N244Q291m288p728K702O358P61p583o637p21
13124A12758Q074K869O638L437J113m835r647K657o289R52L493K859p811l743
13110A12525K89l59L082J1352L960r767n682j773k10Q620n23r7j37m489p248n902
$$ plain form
13094 103641 98507 103790 108606 108542 110844 114903 124600 131837 123693 110687 116946 123736 120690 115322
13080 115322 113687 119304 124212 125221 118682 117562 115349 116431 122594 127460 118890 118843 121588 133810
13066 133810 139925 140935 144297 138140 131501 127911 134459 140452 139943 132679 116685 107397 111468 113896
13052 113896 115968 117007 119895 127212 132257 126816 125615 118408 115330 118215 121212 119878 116234 110812
13038 110812 114116 110134 114121 131240 132083 124136 127860 126998 130877 126272 116603 113658 108115 113217
13024 113217 116197 124560 126962 132340 144729 143555 142039 135391 137334 135108 123888 121822 118813 115372
13010 115372 116303 128704 128525 119844 124711 128712 116412 107623 110377 111358 109317 114030 120803 121863
12996 121863 120416 122328 129152 122378 123010 135257 144464 145417 139659 137703 138736 136353 129860 131144
$$ packed form
13094A03641n134N283M816o4K302M059R697P237q144j3006O259O790l046n368
13080A15322j635N617M908J009o539j120k213J082O163M866q570m7K745J2222
13066A33810O115J010L362o157o639l590O548N993n09p264j5994r288M071K428
13052A13896K072J039K888P317N045n441j201p207l078K885K997j334l644n422
13038A10812L304l982L987J7119Q43p947L724q62L879m605r669k945n543N102
13024A13217K980Q363K402N378J2389j174j516o648J943k226j1220k066l009l441
13010A15372R31J2401j79q681M867M001j2300q789K754R81k041M713O773J060
12996A21863j447J912O824o774O32J2247R207R53n758j956J033k383o493J284
$$ plain form
12982 131144 120012 113147 112388 110870 111003 104183 98512 102278 106354 114637 120664 127514 131533 132049 128659
12967 128659 127638 129730 127072 129827 124442 127454 129940 124925 128005 135753 138005 142689 138531 132509
12953 132509 127517 118490 120164 130063 131167 130394 130387 129843 133931 133895 133960 132979 136456 141662 142741 135181 127224
12936 127224 127708 126564 124752 123621 126533 129316 134826 136933 135197 131584 130624 130286 121047 120917 121552
12921 121552 129686 124415 119428 126821 126080 120642 123017 125177 124468 123806 123985 136746 141088 138774 138730
12906 138730 142674 140903 134488 127632 120742 125573 132115 127743 123507 121157 124589 130298 130072 135469
12892 135469 135902 137901 148647 152847 152731 149723 149100 141393 146399 145420 144331 132854 134696 134034 125934
12877 125934 127028 131713 132129 135106 135547 138218 141538 146002 146364 149383 156028 162593 163853 158741 145468
$$ packed form
12982A31144j1132o865p59j518J33o820n671L766M076Q283O027O850M019N16l390
12967A28659j021K092k658K755n385L012K486n015L080P748K252M684m158o022
12953A32509m992r027J674R899J104p73pn44M088l6O5r81L477N206J079p560p957
12936A27224M84j144j812j131K912K783N510K107j736l613r60l38r239j30O35
12921A21552Q134n271m987P393p41n438K375K160p09o62J79J2761M342k314m4
12906A38730L944j771o415o856o890M831O542m372m236k350L432N709k26N397
12892A35469M33J999J0746M200j16l008o23p707N006r79j089j1477J842o62q100
12877A25934J094M685M16K977M41K671L320M464L62L019O645O565J260n112j3273
$$ plain form
12862 145468 139409 131743 134959 134614 137575 138120 137985 133508 142806 144970 147116 139489 137358 138707 146789
12847 146789 151365 143265 140607 138730 146439 152298 148246 150865 158976 156751 148981 139686 134167 131043
12833 131043 132540 137030 134524 142692 148118 146471 146374 155002 156058 149010 144932 139133 143937 141559 127193
12818 127193 124785 132118 141098 142463 139326 142325 143757 151345 155867 156106 154459 147919 142850 138730
12804 138730 141853 153385 162710 158397 150368 144395 139394 138514 139149 144942 152909 141438 140437 140941
12790 140941 138489 136087 137999 137630 130777 137275 135645 140476 142989 144141 145174 154627 146813 145360
12776 145360 149259 146107 144495 148675 150291 159404 159066 161538 164985 166558 159475 152408 152616 150377 161612
12761 161612 166018 158772 151954 145392 142189 142102 139215 140254 136256 136757 138421 141634 144459 141560 139396
$$ packed form
12862A45468o059p666L216l45K961N45j35m477R298K164K146p627k131J349Q082
12847A46789M576q100k658j877P709N859m052K619Q111k225p770r295n519l124
12833A31043J497M490k506Q168N426j647r7Q628J056p048m078n799M804k378j4366
12818A27193k408P333Q980J365l137K999J432P588M522K39j647o540n069m120
12804A38730L123J1532R325m313q029n973n001q80O35N793P967j1471j001N04
12790A40941k452k402J912l69o853O498j630M831K513J152J033R453p814j453
12776A45360L899l152j612M180J616R113l38K472L447J573p083p067K08k239J1235
12761A61612M406p246o818o562l203q7k887J039l998N01J664L213K825k899k164
$$ plain form
12746 139396 143352 139668 150125 148918 153394 156857 168441 170620 161098 157737 158281 162743 158297 151956
12732 151956 146448 143639 144147 144604 148769 153644 160438 153180 149106 150832 149399 155560 150501 143424 144269
12717 144269 143193 146077 155273 160701 168290 163326 158695 160048 168065 163688 162927 160044 157475 159187
12703 159187 151757 148015 148675 142590 131693 126838 130090 132741 134446 137207 137573 142361 147111 154244
12689 154244 162380 167417 164484 165477 159589 153321 157166 166005 169849 172968 158872 159750 165004 158106
12675 158106 153404 156608 161293 166689 160619 160839 161646 159318 150602 141312 146572 151928 157101 160043 161239
12660 161239 160640 159135 161301 165175 155747 147499 151620 147562 146692 146249 152511 144106 136396 140201 146720
12645 146720 148217 147511 143885 146740 147588 139281 147633 151838 150149 152216 157850 159195 155722 151433 162030
$$ packed form
12746A39396L956l684J0457j207M476L463J1584K179r522l361N44M462m446o341
12732A51956n508k809N08M57M165M875O794p258m074J726j433O161n059p077Q45
12717A44269j076K884R196N428P589m964m631J353Q017m377p61k883k569J712
12703A59187p430l742O60o085j0897m855L252K651J705K761L66M788M750P133
12689A54244Q136N037k933R93n888o268L845Q839L844L119j4096Q78N254o898
12675A58106m702L204M685N396o070K20Q07k328q716r290N260N356N173K942J196
12660A61239n99j505K166L874r428q248M121m058q70m43O262q405p710L805O519
12645A46720J497p06l626K855Q48q307Q352M205j689K067N634J345l473m289J0597
$$ plain form
12630 162030 163526 152553 155291 156475 155081 160648 157518 158927 168969 166888 157357 148918 140722 144110
12616 144110 142616 151129 158299 158409 160247 167567 165796 157688 151991 147414 146350 153516 156374 160779
12602 160779 160550 157595 163259 168649 164840 164706 162773 161311 162025 153736 153118 161156 164230 164767 168033
12587 168033 166847 160961 153437 157593 162622 164893 160110 165682 167955 171728 169691 163619 157289 160116
12573 160116 164573 163885 164442 164695 162375 159201 154419 145820 151580 156809 164386 162781 158310 153610 153537
12558 153537 156517 165275 161815 159202 165873 173514 175253 166688 164987 166046 174316 172583 159298 162427
12544 162427 175372 182155 183835 187985 195289 189076 185329 182900 179865 180981 182323 175816 164269 158744
12530 158744 157942 163720 165338 168292 177144 172767 170807 177192 178026 173643 172623 171235 163110 160176 159716
$$ packed form
12630A62030J496j0973K738J184j394N567l130J409J0042k081r531q439q196L388
12616A44110j494Q513P170J10J838P320j771q108n697m577j064P166K858M405
12602A60779k29k955N664N390l809j34j933j462P14q289o18Q038L074N37L266
12587A68033j186n886p524M156N029K271m783N572K273L773k037o072o330K827
12573A60116M457o88N57K53k320l174m782q599N760N229P577j605m471m700p3
12558A53537K980Q758l460k613O671P641J739q565j701J059Q270j733j3285L129
12544A62427J2945O783J680M150P304o213l747k429l035J116J342o507j1547n525
12530A58744q02N778J618K954Q852m377j960O385Q34m383j020j388q125k934m60
$$ plain form
12515 159716 157349 153848 156083 154876 160246 161947 164318 168171 175778 175074 169459 166090 169801 174166
12501 174166 171173 156132 149190 157094 159491 168676 166374 167590 168801 172880 170596 173374 181933 184769
12487 184769 177067 174120 176695 180332 181497 169362 167875 177244 179748 177222 185557 188064 193404 199404
12473 199404 195838 183001 179271 183430 186867 184059 181285 170176 160799 155144 169854 173934 175766
12460 175766 181035 186003 184333 183422 184763 182608 184672 179302 173496 179071 176399 177325 180510 178801 168396
12445 168396 170549 170181 173599 175367 178610 179669 178827 168199 163092 164809 168183 172449 176225 173936
12431 173936 173886 180433 182655 174311 171095 178469 176053 177457 185659 192971 192680 192306 178426 169966 172227
12416 172227 169080 171490 169027 165979 172500 173348 186012 192449 190157 189634 189156 185814 185852 182680 192380
$$ packed form
12515A59716k367l501K235j207N370J701K371L853P607p04n615l369L711M365
12501A74166k993j5041o942P904K397R185k302J216J211M079k284K778Q559K836
12487A84769p702k947K575L637J165j2135j487R369K504k526Q335K507N340O000
12473A99404l566j2837l730M159L437k808k774j1109r377n655J4710M080J832
12460A75766N269M968j670r11J341k155K064n370n806N575k672R26L185j709j0405
12445A68396K153l68L418J768L243J059q42j0628n107J717L374M266L776k289
12431A73936n0O547K222q344l216P374k416J404Q202P312k91l74j3880q460K261
12416A72227l147K410k463l048O521Q48J2664O437k292n23m78l342L8l172R700
$$ plain form
12401 192380 187528 188465 184096 177952 177180 172920 178433 178329 183464 185853 181320 181320 182871 185882 187713 190184
12385 190184 189825 186871 182360 188330 188283 184606 181950 183816 182238 187420 187695 184744 183974 189168 189252 185541
12369 185541 182603 174956 178077 187813 202508 199250 187018 175599 174611 181186 181025 177848 176196 177081
12355 177081 179706 193494 197898 191261 191412 189090 190329 187592 188169 183268 179389 182948 194551 187659
12341 187659 190858 184512 180384 174185 159829 172584 178065 183489 192489 192909 188150 183199 196140 197207
12327 197207 203674 202017 194674 193581 195107 192905 190851 192529 189059 185223 187448 185900 187358 182847
12313 182847 185011 192119 188792 182765 185203 189179 197880 200525 196448 191332 190115 188433 186655 193701
12299 193701 194504 192598 186286 182348 183467 187507 190025 189552 192674 200331 201296 200291 190657 185952 179421
$$ packed form
12401A92380m852R37m369o144p72m260N513j04N135K389m533%J551L011J831K471
12385A90184l59k954m511N970m7l677k656J866j578N182K75k951p70N194Q4l711
12369A85541k938p647L121R736J4695l258j2232j1419r88O575j61l177j652Q85
12355A77081K625J3788M404o637J51k322J239k737N77m901l879L559J1603o892
12341A87659L199o346m128o199j4356J2755N481N424R000M20m759m951J2941J067
12327A97207O467j657p343j093J526k202k054J678l470l836K225j548J458m511
12313A82847K164P108l327o027K438L976Q701K645m077n116j217j682j778P046
12299A93701Q03j906o312l938J119M040K518m73L122P657R65j005r634m705o531
$$ plain form
12284 179421 180733 197091 199972 203734 206581 196836 179725 182022 185143 181547 185046 187795 190888 192896
12270 192896 186637 193813 199194 194351 190659 183433 186007 191235 195179 198093 197555 199024 197968 201430
12256 201430 202038 197528 199650 202727 203795 209256 213952 212837 209870 206477 205962 211390 215616 206695 199106
12241 199106 202824 205808 212036 204921 197535 194528 190293 188056 188578 197546 210378 211205 209198 206710
12227 206710 207074 207367 210782 209223 205836 203340 200305 201583 208872 205779 195206 198549 209587 204965
12213 204965 196385 184717 191299 200055 207518 199471 188222 187021 198997 203183 198365 204259 213779
12200 213779 211287 197078 191652 201095 212036 214192 211560 207427 201311 193650 204053 206468 197943
12187 197943 194305 197786 200002 203212 203143 197529 190597 192555 187229 192091 198455 195624 198038 203432 206101
$$ packed form
12284A79421J312J6358K881L762K847r745j7111K297L121l596L499K749L093K008
12270A92896o259P176N381m843l692p226K574N228L944K914n38J469j056L462
12256B01430O08m510K122L077J068N461M696j115k967l393n15N428M226q921p589
12241A99106L718K984O228p115p386l007m235k237N22Q968J2832Q27k007k488
12227B06710L64K93L415j559l387k496l035J278P289l093j0573L343J1038m622
12213B04965q580j1668O582Q756P463q047j1249j201J1976M186m818N894R520
12200B13779k492j4209n426R443J0941K156k632m133o116p661J0403K415q525
12187A97943l638L481K216L210o9n614o932J958n326M862O364k831K414N394K669
$$ plain form
12172 206101 218083 215326 212711 209614 214632 220422 223941 223660 213930 211993 222500 219381 210265 214172
12158 214172 214352 219532 223603 224222 213215 205141 209170 208017 208802 205440 204122 199777 197970 203479 202966
12143 202966 198014 197493 195697 195322 201448 201572 211269 209321 205425 199569 206261 212752 223311 219597 205217
12128 205217 203558 204782 208490 209829 210308 207826 212855 216098 208552 208234 204673 198352 204137 210655 205016
12113 205016 202818 205201 209504 210756 201988 206479 218623 223807 221035 216197 213571 215561 209963 213394
12099 213394 211919 215813 210804 213286 215808 204637 198953 204515 205939 213355 220789 213861 218227 220959
12085 220959 220089 222200 226168 229204 223988 224389 225087 225333 226997 229980 230744 231792 230685 223810 217221
12070 217221 212511 217008 229475 223399 220689 221560 219443 220369 222402 232677 229961 220094 219773 224102
$$ packed form
12172B06101J1982k757k615l097N018N790L519k81r730j937J0507l119r116L907
12158B14172J80N180M071O19j1007q074M029j153P85l362j318m345j807N509n13
12143B02966m952n21j796l75O126J24R697j948l896n856O692O491J0559l714j4380
12128B05217j659J224L708J339M79k482N029L243p546l18l561o321N785O518n639
12113B05016k198K383M303J252q768M491J2144N184k772m838k626J990n598L431
12099B13394j475L894n009K482K522j1171n684N562J424P416P434o928M366K732
12085B20959q70K111L968L036n216M01O98K46J664K983P64J048j107o875o589
12070B17221m710M497J2467o076k710Q71k117R26K033J0275k716r867l21M329
$$ plain form
12056 224102 228032 228195 217632 225174 223003 225327 221582 227449 235942 237310 238386 233403 222782 224805
12042 224805 229089 231470 228793 227057 227398 223435 226530 225983 219884 219450 231977 233389 231493 234568 232545
12027 232545 228583 221475 220426 220329 230193 231160 233717 238287 240838 229687 227859 229871 228766 233504 228819
12012 228819 224860 224026 219296 215785 221168 215169 219368 229537 234398 227709 217206 218213 226842 229903
11998 229903 235751 238625 234587 232370 234758 240689 243559 245547 239182 237363 233073 227180 236062 235553
11984 235553 236189 234281 231796 237304 240993 239148 233088 235593 236469 235427 234367 232001 227036 223066 225614
11969 225614 222644 233435 240827 240310 234749 225701 219543 223280 231644 232526 226533 224565 229429 231774
11955 231774 226862 234476 242350 243669 243921 251824 244179 237968 238431 244594 249689 249220 245225 241923 237839
$$ packed form
12056B24102L930J63j0563P542k171K324l745N867Q493J368J076m983j0621K023
12042B24805M284K381k677j736L41l963L095n47o099m34J2527J412j896L075k023
12027B32545l962p108j049r7R864R67K557M570K551j1151j828K012j105M738m685
12012B28819l959q34m730l511N383n999M199J0169M861o689j0503J007Q629L061
11998B29903N848K874m038k217K388N931K870J988o365j819m290n893Q882n09
11984B35553O36j908k485N508L689j845o060K505Q76j042j060k366m965l970K548
11969B25614k970J0791P392n17n561r048o158L737Q364Q82n993j968M864K345
11955B31774m912P614P874J319K52P903p645o211M63O163N095m69l995l302m084
$$ plain form
11940 237839 238015 233655 227081 231382 236585 235288 230692 225383 230968 231135 228528 228953 229652 223679 223862
11925 223862 236582 238225 234201 242083 241416 245229 245965 242227 238004 240497 242210 237874 243281 243800 249976
11910 249976 248247 241684 243092 239734 236861 240437 240162 243319 239917 238385 243644 253759 249538 237002
11896 237002 237042 242483 238419 232287 224817 221686 238638 254651 246540 243706 239874 254094 259088 254900
11882 254900 255337 252463 249324 241410 246372 249251 253021 254297 251337 251621 248758 248704 246539 242650 241753
11867 241753 232279 232406 235158 248537 258094 259573 252418 253104 256191 252156 254043 259963 261629 251110
11853 251110 241406 240157 248284 250595 253197 256211 258288 247256 248572 248430 247444 250664 245466 238137
11839 238137 234542 244750 253483 246614 247709 252341 252303 252341 244941 239816 240281 249681 259727 257796 255153
$$ packed form
11940B37839J76m360o574M301N203j297m596n309N585J67k607M25O99n973J83
11925B23862J2720J643m024P882o67L813P36l738m223K493J713m336N407N19O176
11910B49976j729o563J408l358k873L576k75L157l402j532N259J0115m221j2536
11896B37002M0N441m064o132p470l131J6952J6013q111k834l832J4220M994m188
11882B54900M37k874l139p914M962K879L770J276k960K84k863n4k165l889q97
11867B41753r474J27K752J3379R557J479p155O86L087m035J887N920J666j0519
11853B51110r704j249Q127K311K602L014K077j1032J316j42r86L220n198p329
11839B38137l595J0208Q733o869J095M632l8L8p400n125M65R400J0046j931k643
$$ plain form
11824 255153 261100 270177 271458 257951 251923 262550 269455 259475 253724 256972 247760 241463 235529 230144
11810 230144 239926 244116 248709 246698 244057 246123 254699 255983 255439 256526 263659 269190 266718 259428
11796 259428 247614 248461 246667 241844 251282 260931 266152 264631 256201 259454 262712 264785 263695 261709
11782 261709 259380 263938 262635 259948 262320 269340 273863 272015 256486 257647 253705 254229 262640 264274
11768 264274 260794 264749 258830 260332 265494 264284 262899 259705 265558 262003 255826 259027 259764 250828
11754 250828 252285 250026 251488 256015 267524 273898 269793 258816 258027 258478 259282 264499 269739 269640 273088
11739 273088 269319 256951 259738 267125 268195 273517 267752 268491 275148 280287 276235 273049 263944 248155
11725 248155 246190 249289 253309 255968 265700 272599 271630 263399 263973 263042 263285 259018 261858 270018 276363
$$ packed form
11824B55153N947R077J281j3507o028J0627O905r980n751L248r212o297n934n385
11810B30144R782M190M593k011k641K066Q576J284n44J087P133N531k472p290
11796B59428j1814Q47j794m823R438R649N221j521q430L253L258K073j090j986
11782B61709k329M558j303k687K372P020M523j848j5529J161l942N24Q411J634
11768B64274l480L955n919J502N162j210j385l194N853l555o177L201P37q936
11754B50828J457k259J462M527J1509O374m105j0977p89M51Q04N217N240r9L448
11739B73088l769j2368K787P387J070N322n765P39O657N139m052l186r105j5789
11725B48155j965L099M020K659R732O899r69q231N74r31K43m267K840Q160O345
$$ plain form
11710 276363 277306 276477 277737 275179 264267 262856 259114 260579 274582 271777 263953 258577 265359 267365
11696 267365 271411 271599 265606 268690 271640 272620 280955 284874 275856 269456 270426 272322 278601 283137 289661
11681 289661 291933 286034 280536 288242 286001 276607 273297 274174 269084 267910 273111 283854 284855 283984
11667 283984 289378 291720 286596 280235 275662 276650 286327 288138 276704 276133 277282 268439 273745 292543
11653 292543 292826 285641 278772 277932 290066 297909 295343 294242 297199 299923 297287 289136 290462 293945
11639 293945 290302 277020 281275 293665 290035 273095 265400 275550 285226 286117 284242 287003 277490
11626 277490 278985 277124 276134 284523 287813 289501 286336 287134 282227 285444 299474 303384 299906 300613 301048
11611 301048 290687 288960 282368 278033 276679 281582 290213 294540 294848 296549 290239 284611 286281 288982
$$ packed form
11710B76363R43q29J260k558j0912j411l742J465J4003k805p824n376O782K006
11696B67365M046J88n993L084K950R80Q335L919r018o400R70J896O279M536O524
11681B89661K272n899n498P706k241r394l310Q77n090j174N201J0743J001q71
11667B83984N394K342n124o361m573R88R677J811j1434n71J149q843N306J8798
11653B92543K83p185o869q40J2134P843k566j101K957K724k636q151J326L483
11639B93945l643j3282M255J2390l630j6940p695J0150R676Q91j875K761r513
11626B77490J495j861r90Q389L290J688l165P98m907L217J4030L910l478P07M35
11611C01048j0361j727o592m335j354M903Q631M327L08J701o310n628J670K701
$$ plain form
11597 288982 292788 299353 303130 301081 290312 294557 302114 301318 300152 303251 288501 282938 295077 293385
11583 293385 290411 287295 287889 293406 293463 290709 291889 293575 296657 301123 306386 305545 291608 291645 294887
11568 294887 292979 298018 307387 307696 300351 296551 296376 302060 306981 307481 311275 314186 313798 312417 306115
11553 306115 310272 316062 317347 312424 308399 302721 299495 309060 310871 306398 300825 295244 288531 298275
11539 298275 311188 316984 315392 306625 302858 302064 306652 320202 325087 322999 320334 315248 308284 308522
11525 308522 307956 313446 318101 320518 312964 308886 305039 310195 315767 319025 314014 305800 310598 310571 309549
11510 309549 312170 314644 317996 307028 299398 306262 313544 316782 317049 323774 327170 327423 324136 330297
11496 330297 339161 337183 325818 326455 330174 340329 342621 331995 326283 326367 326520 323997 327662 322980
$$ packed form
11597B88982L806O565L777k049j0769M245P557p96j166L099j4750n563J2139j692
11583B93385k974l116N94N517N7k754J180J686L082M466N263q41j3937L7L242
11568B94887j908N039R369L09p345l800j75N684M921N00L794K911l88j381o302
11553C06115M157N790J285m923m025n678l226R565J811m473n573n581o713R744
11539B98275J2913N796j592q767l767p94M588J3550M885k088k665n086o964K38
11525C08522n66N490M655K417p554m078l847N156N572L258n011q214M798k7j022
11510C09549K621K474L352j0968p630O864P282L238K67O725L396K53l287O161
11496C30297Q864j978j1365O37L719J0155K292j0626n712Q4J53k523L665m682
$$ plain form
11482 322980 319064 316442 316530 323952 336275 339559 347282 347517 343435 348428 355961 347940 344096 343626 337854
11467 337854 330728 336117 344860 341666 335598 337444 342678 347284 348167 346053 343152 340344 347184 349234
11453 349234 359514 356191 360427 363976 360986 353076 355097 356633 359219 369209 368555 366651 376330 381591
11439 381591 382470 389397 386485 382787 379821 377007 375028 367065 353010 337642 328450 329522 329173 331061
11425 331061 337866 342163 346049 350993 358194 368202 378969 377599 376585 381093 375973 389168 401767
11412 401767 402689 392292 392675 394608 389677 387113 397721 397816 390951 388441 386449 380121 374498 371634 371509
11397 371509 378865 390790 400299 404640 411208 423067 430955 444300 453310 446886 439368 414624 372133
11384 372133 330346 296976 288695 300184 303252 298559 300026 311616 323555 325927 328100 332526 342257
$$ packed form
11482C22980l916k622Q8P422J2323L284P723K35m082M993P533q021l844m70n772
11467C37854p126N389Q743l194o068J846N234M606Q83k114k901k808O840K050
11453C49234J0280l323M236L549k990p910K021J536K586R990o54j904R679N261
11439C81591Q79O927k912l698k966k814j979p963j4055j5368r192J072l49J888
11425C31061O805M297L886M944P201J0008J0767j370j014M508n120J3195J2599
11412D01767R22j0397L83J933m931k564J0608R5o865k510j992o328n623k864j25
11397C71509P356J1925R509M341O568J1859P888J3345R010o424p518k4744m2491
11384C72133m1787l3370q281J1489L068m693J467J1590J1939K372K173M426R731
$$ plain form
11371 342257 355919 362917 375489 382038 396200 398449 398999 404051 414257 430346 430959 432519 428561
11358 428561 412970 375183 338346 290071 274875 271917 284348 296189 302682 314593 327610 336153
11346 336153 340014 350841 361335 378567 389732 385444 359767 322113 275617 244373 226171 224773
11334 224773 231314 239690 244265 249128 253217 261039 266054 264383 269324 281261 291105 294975 307049 318409
11320 318409 333442 344675 350582 347573 354104 361975 365228 365611 358048 325549 278755 241716 212334
11307 212334 192149 188173 190113 206292 220361 236994 249487 254014 253914 264192 271721 275049 273523
11294 273523 265456 254936 244426 232451 217748 222431 229424 230192 231456 229115 234391 252358 266652
11281 266652 263804 266042 271088 279529 277503 276030 285326 297981 300078 305639 308944 298175 298814 299849
$$ packed form
11371C42257J3662O998J2572O549J4162K249N50N052J0206J6089O13J560l958
11358D28561j5591l7787l6837m8275j5196k958J2431J1841O493J1911J3017Q543
11346C36153L861J0827J0494J7232J1165m288k5677l7654m6496l1244j8202j398
11334B24773O541Q376M575M863M089P822N015j671M941J1937R844L870J2074J1360
11320C18409J5033J1233N907l009O531P871L253L83p563l2499m6794l7039k9382
11307B12334k0185l976J940J6179J4069J6633J2493M527j00J0278P529L328j526
11294B73523q067j0520j0510j1975j4703M683O993P68J264k341N276J7967J4294
11281B66652k848K238N046Q441k026j473R296J2655K097N561L305j0769O39J035
$$ plain form
11267 299849 301814 302233 298628 291338 273375 262187 253683 251565 256333 257207 258051 263086 270294 278280
11253 278280 276454 278196 281168 276882 274516 281168 282130 281621 281588 285496 291302 288277 280638 271446 269414
11238 269414 275585 280992 287480 279222 284739 293814 301082 304938 314237 308135 302366 294658 297591 301518
11224 301518 301909 304719 291407 291688 299441 304528 310859 310442 315016 315507 310520 313184 309836 308706 314799
11209 314799 323258 318808 313964 315025 311904 313936 313466 316707 322001 325140 326402 326627 326051 323488 321158
11194 321158 321499 318337 317957 315054 315454 319960 324726 326155 329038 330641 334100 327140 324416 322968 320824
11179 320824 326592 322482 319277 321872 318967 315894 328077 322578 329388 327272 334615 345624 346664 338911
11165 338911 340864 331961 330609 331426 329132 328736 325669 324908 329707 331856 339363 342194 346251 353722 349817
$$ packed form
11267B99849J965M19l605p290j7963j1188q504k118M768Q74Q44N035P208P986
11253B78280j826J742K972m286k366O652R62n09l3L908N806l025p639r192k032
11238B69414O171N407O488q258N517R075P268L856R299o102n769p708K933L927
11224C01518L91K810j3312K81P753N087O331m17M574M91m987K664l348j130O093
11209C14799Q459m450m844J061l121K032m70L241N294L139J262K25n76k563k330
11194C21158L41l162l80k903M00M506M766J429K883J603L459o960k724j448k144
11179C20824N768m110l205K595k905l073J2183n499O810k116P343J1009J040p753
11165C38911J953q903j352Q17k294l96l067p61M799K149P507K831M057P471l905
$$ plain form
11150 349817 350811 348788 348420 351181 349334 351219 347049 341595 337683 339594 334984 330981 336586 339634 351755
11135 351755 352437 347458 342558 352507 359492 355044 351031 345923 343642 342279 345704 346300 345140 342842 341075
11120 341075 346775 347266 343744 344053 354645 355104 350272 349165 346433 346212 355957 358842 355101 352083 351969
11105 351969 354899 351627 352003 356529 356983 358916 359835 352045 354668 356954 352176 349606 356491 358401 354410
11090 354410 350408 349300 352639 359188 352545 346660 347805 344187 349470 358553 361302 360474 357485 356598 361865
11075 361865 362865 365043 370509 367307 364798 367348 370297 360624 356239 358707 363966 364053 354770 354214 348775
11060 348775 354945 362732 359915 364372 368149 364991 358801 349809 350553 365790 373383 365075 367405 370455
11046 370455 362251 361526 364423 362835 361660 367818 361062 356450 353482 359081 371081 370601 364418 356837
$$ packed form
11150C49817R94k023l68K761j847J885m170n454l912J911m610m003N605L048J2121
11135C51755O82m979m900R949O985m448m013n108k281j363L425N96j160k298j767
11120C41075N700M91l522L09J0592M59m832j107k732k21R745K885l741l018j14
11105C51969K930l272L76M526M54J933R19p790K623K286m778k570O885J910l991
11090C54410m002j108L339O549o643n885J145l618N283R083K749q28k989q87N267
11075C61865J000K178N466l202k509K550K949r673m385K468N259Q7r283n56n439
11060C48775O170P787k817M457L777l158o190q992P44J5237P593q308K330L050
11046C70455q204p25K897j588j175O158o756m612k968N599J2000m80o183p581
$$ plain form
11032 356837 353617 358909 365906 360645 356766 360330 357757 360406 363376 370556 377808 379891 381163 388100
11018 388100 385548 379536 380936 375936 374803 375672 373912 372081 370739 371978 371815 378573 385046 384012 382854
11003 382854 379632 379557 383562 389361 394586 390771 392652 395885 390583 391380 396027 391353 380344 370881 371698
10988 371698 383550 390305 392942 383929 378001 378316 385941 388178 391634 392470 386416 386483 392410 389992 386372
10973 386372 385008 382917 380733 380378 378348 384651 376780 378979 375286 371655 374437 381565 392395 398972
10959 398972 404724 404062 404417 405370 403458 401910 407896 411774 408301 410117 402370 398264 400397 399463 399541 402297
10943 402297 403729 403064 400093 393460 390385 387655 394745 404564 401631 392280 388175 387725 395568 396054 406212
10928 406212 407206 395181 388059 389514 397939 405493 411000 409633 414407 414996 408327 407082 414017 417300
$$ packed form
11032C56837l220N292O997n261l879L564k573K649K970P180P252K083J272O937
11018C88100k552o012J400n000j133Q69j760j831j342J239j63O758O473j034j158
11003C82854l222p5M005N799N225l815J881L233n302P97M647m674j1009r463Q17
10988C71698J1852O755K637r013n928L15P625K237L456Q36o054O7N927k418l620
10973C86372j364k091k184l55k030O303p871K199l693l631K782P128J0830O577
10959C98972N752o62L55R53j912j548N986L878l473J816p747m106K133r34P8K756
10943D02297J432o65k971o633l075k730P090R819k933r351m105m50P843M86J0158
10928D06212R94j2025p122J455Q425P554N507j367M774N89o669j245O935L283
$$ plain form
10914 417300 416009 403294 401243 408082 413946 411278 411540 414007 417216 414567 415144 413586 407245 398831
10900 398831 398536 404803 415440 410860 401501 398462 400590 401367 401660 404709 405082 404730 408718 401681 399521
10885 399521 406315 418835 422071 423261 421347 421383 415354 411751 415612 416745 411205 406136 418940 430419
10871 430419 430026 425755 424152 421388 413113 411241 410737 416805 423467 432786 429410 420095 425594 429197 429619
10856 429619 431983 428498 420364 423581 425467 421582 426251 423658 428059 434179 436935 428978 425719 433756
10842 433756 434912 423894 409060 411899 421360 425157 426180 414182 424308 434184 438261 434263 436673
10829 436673 435784 437761 439414 444268 441176 446447 453504 450424 441509 436448 432734 432750 440614 439302 431724
10814 431724 420882 418296 424355 424062 425786 431323 426938 421435 418331 421296 425122 428032 432949 431246
$$ packed form
10914D17300j291j2715k051O839N864k668K62K467L209k649N77j558o341q414
10900C98831k95O267J0637m580r359l039K128P77K93L049L73l52L988p037k160
10885C99521O794J2520L236J190j914L6o029l603L861J133n540n069J2804J1479
10871D30419l93m271j603k764q275j872n04O068O662R319l376r315N499L603M22
10856D29619K364l485q134L217J886l885M669k593M401O120K756p957l259Q037
10842D33756J156j1018j4834K839R461L797J023j1998J0126R876M077l998K410
10829D36673q89J977J653M854l092N271P057l080q915n061l714J6P864j312p578
10814D31724j0842k586O059k93J724N537m385n503l104K965L826K910M917j703
$$ plain form
10800 431246 435650 437962 438618 434471 439613 447465 446749 449215 443147 442365 436371 435219 440030 438894 431054
10785 431054 430210 426622 429302 439437 445662 444477 442648 444555 440638 439090 441998 442543 443991 443878 446030
10770 446030 443480 437983 440596 438935 441170 451370 452823 444701 445846 450816 459325 461537 457503 452451
10756 452451 454675 457423 457256 447999 446489 455954 460199 452216 454747 450733 443777 439466 447753 455034
10742 455034 451849 451262 451601 454142 462007 464852 466861 466078 466861 469316 471818 475717 473952 468201 467116
10727 467116 472965 470917 469726 470668 470568 466623 466479 473248 475713 467647 462404 458633 462070 459699 463309
10712 463309 466043 459614 459691 466006 466951 474764 474593 467518 465975 472058 473362 465278 461280 461448 462624
10697 462624 471977 478377 475979 480525 495211 488251 477287 475923 476672 473229 474999 473348 474935 466435
$$ packed form
10800D31246M404K312O56m147N142P852p16K466o068p82n994j152M811j136p840
10785D31054q44l588K680J0135O225j185j829J907l917j548K908N45J448j13K152
10770D46030k550n497K613j661K235J0200J453q122J145M970Q509K212m034n052
10756D52451K224K748j67r257j510R465M245p983K531m014o956m311Q287P281
10742D55034l185n87L39K541P865K845K009p83P83K455K502L899j765n751j085
10727D67116N849k048j191R42j00l945j44O769K465q066n243l771L437k371L610
10712D63309K734o429P7O315R45P813j71p075j543O083J304q084l998J68J176
10697D62624R353O400k398M546J4686o960j0964j364P49l443J770j651J587q500
$$ plain form
10683 466435 456577 458691 463168 465162 462239 460974 470283 479822 483732 481604 477305 476079 469273 472536
10669 472536 482202 479140 478714 479870 489165 496280 497881 498021 487604 486719 491474 491895 491201 490977 494420
10654 494420 501130 497997 494546 491759 482655 490439 492373 490382 496955 502247 498280 503397 493389 489898
10640 489898 490800 494095 493909 498475 501262 507416 502585 498768 497292 499501 494670 486075 484796 487508 496373
10625 496373 505762 506307 503514 495644 489610 490764 495738 498219 506486 517571 516043 511608 506807 521085
10611 521085 525966 525221 521353 511124 507411 513802 509103 511076 507015 496657 498757 504156 503483 502729
10597 502729 510106 511757 505846 506730 506080 499968 500839 501612 498386 509074 511020 514544 515176 520715 526158
10582 526158 523421 519939 512934 507420 507112 508462 511247 508357 508597 514679 517646 520185 525312 525023 525006
$$ packed form
10683D66435r858K114M477J994k923j265R309R539L910k128m299j226o806L263
10669D72536R666l062m26J156R295P115J601J40j0417q85M755M21o94k24L443
10654D94420O710l133l451k787r104P784J934j991O573N292l967N117j0008l491
10640D89898R02L295j86M566K787O154m831l817j476K209m831q595j279K712Q865
10625D96373R389N45k793p870o034J154M974K481Q267J1085j528m435m801J4278
10611E21085M881p45l868j0229l713O391m699J973m061j0358K100N399o73p54
10597E02729P377J651n911Q84o50o112Q71P73l226J0688J946L524O32N539N443
10582E26158k737l482p005n514l08J350K785k890K40O082K967K539N127k89j7
$$ plain form
10567 525006 521792 513878 517493 518535 516492 515032 521974 532882 532354 531978 537693 538899 527447 532130
10553 532130 529121 531461 538739 538913 532972 538890 549318 549865 544717 539810 524652 519953 524251 528905
10539 528905 531098 534328 533239 527694 531608 539031 546309 537804 527367 528708 527104 529326 534197 529452
10525 529452 529497 535517 545261 539778 535395 533849 536188 539818 544742 539909 545135 551951 544741 545264 543886
10510 543886 542082 542107 547052 550488 544780 547679 543095 543489 542443 538541 546598 546068 538216 548030 554613
10495 554613 551420 551179 545362 545057 543733 547378 555814 559968 561734 561804 560532 557213 557085 563553 572738
10480 572738 569304 556774 552580 561766 570324 563822 564604 567510 570160 570311 566214 564347 571722 569659
10466 569659 559127 563027 568794 572446 563739 555513 559261 572343 572588 561239 555943 557867 556177 559465
$$ packed form
10567E25006l214p914L615J042k043j460O942J0908n28l76N715J206j1452M683
10553E32130l009K340P278J74n941N918J0428N47n148m907j5158m699M298M654
10539E28905K193L230j089n545L914P423P278q505j0437J341j604K222M871m745
10525E29452M5O020R744n483m383j546K339L630M924m833N226O816p210N23j378
10510E43886j804K5M945L436n708K899m584L94j046l902Q057n30p852R814O583
10495E54613l193k41n817l05j324L645Q436M154J766P0j272l319j28O468R185
10480E72738l434j2530m194R186Q558o502P82K906K650J51m097j867P375k063
10466E69659j0532L900N767L652q707q226L748J3082K45j1349n296J924j690L288
$$ plain form
10452 559465 558491 565284 563915 565935 567595 566218 566915 569504 568631 573435 571090 574820 574394 568200 571646
10437 571646 576056 578486 579125 579693 575762 579109 581405 573818 569420 571616 562140 559879 569236 573493 576663
10422 576663 575156 576525 578187 585158 586766 585807 583474 588609 590604 595583 595391 593583 592670 593256 590495
10407 590495 595980 594862 595426 597821 597675 604201 600237 593373 595957 601566 602854 596141 588271 581879 583559
10392 583559 587500 589341 599495 602504 599200 603243 605453 609301 605636 599703 593295 593126 610423 615301
10378 615301 620667 615180 612546 617714 614622 614900 612774 604654 602937 603892 606264 614325 621112 624782 620716
10363 620716 621500 627421 618162 609618 613445 608789 611551 609818 608322 598511 600681 604318 598513 604080
10349 604080 617635 623422 629116 625647 619499 619426 618455 610872 613372 617643 620647 624335 624466 618800 622808
$$ packed form
10452E59465r74O793j369K020J660j377O97K589q73M804k345L730m26o194L446
10437E71646M410K430O39N68l931L347K296p587m398K196r476k261R357M257L170
10422E76663j507J369J662O971J608r59k333N135J995M979j92j808r13N86k761
10407E90495N485j118N64K395j46O526l964o864K584N609J288o713p870o392J680
10392E83559L941J841J0154L009l304M043K210L848l665n933o408j69J7297M878
10378F15301N366n487k634N168l092K78k126q120j717R55K372Q061O787L670m066
10363F20716P84N921r259q544L827m656K762j733j496r811K170L637n805N567
10349F04080J3555N787N694l469o148p3r71p583K500M271L004L688J31n666M008
$$ plain form
10334 622808 625794 623510 628871 630979 639287 641129 637270 623941 623919 623514 624770 622465 625514 624227 627118
10319 627118 625468 629244 628521 636951 645566 647017 646275 640342 629224 629596 640174 652869 660295 658169
10305 658169 651353 642371 643060 651551 657249 660746 660909 657674 648848 642861 637538 635774 635133 634867 639946
10290 639946 635980 632528 632918 640837 650836 649432 646610 647268 655086 663063 664847 663691 663630 664732 667707
10275 667707 666793 663930 656256 651057 656443 658143 648942 649483 654233 660782 666791 671252 676303 681041 673801
10260 673801 661836 664355 678198 682722 689482 694978 684904 673703 670586 671273 665113 666341 670655
10247 670655 672648 666308 665178 669241 664892 672857 684618 691220 688809 684077 691598 693762 687542 688409
10233 688409 691877 693056 696266 693424 681896 679890 679912 688013 697129 692695 690154 690500 693796 699737 711561
$$ packed form
10334F22808K986k284N361K108Q308J842l859j3329k2m05J256k305L049j287K891
10319F27118j650L776p23Q430Q615J451p42n933j1118L72J0578J2695P426k126
10305F58169o816q982O89Q491N698L497J63l235q826n987n323j764o41k66N079
10290F39946l966l452L90P919R999j404k822O58P818P977J784j156o1J102K975
10275F67707r14k863p674n199N386J700r201N41M750O549O009M461N051M738p240
10260F73801j1965K519J3843M524O760N496j0074j1201l117O87o160J228M314
10247F70655J993o340j130M063m349P965J1761O602k411m732P521K164o220Q67
10233F88409L468J179L210k842j1528k006K2Q101R116m434k541L46L296N941J1824
$$ plain form
10218 711561 709040 703955 707521 708304 710132 706519 713700 723841 718236 706267 697655 693952 698171 697109
10204 697109 701107 702216 707856 709428 714811 714849 709147 708580 707307 707517 712146 722138 723286 721549 718057
10189 718057 724829 724948 725909 720995 714345 716379 724540 727928 721145 718669 723312 721315 720603 738872 740476
10174 740476 728312 718987 715211 718712 720809 716405 715899 725554 727265 728185 736795 735657 728904 729706 733786
10159 733786 733753 733811 734071 731717 726969 724273 724428 728811 735169 736186 728206 730196 740889 744062 740491
10144 740491 748880 758917 748685 737516 741430 749447 746570 747108 743683 746894 758051 765066 762231
10131 762231 757064 753840 754841 748765 746423 753201 755795 750883 754583 765285 768989 765843 762721 766102
10117 766102 768909 763722 756721 759602 767661 768805 767465 762579 754797 762934 769153 771535 776851 778206
$$ packed form
10218G11561k521n085L566P83J828l613P181J0141n605j1969q612l703M219j062
10204F97109L998J109N640J572N383L8n702n67j273K10M629R992J148j737l492
10189G18057O772J19R61m914o650K034Q161L388o783k476M643j997p12J8269J604
10174G40476j2164r325l776L501K097m404n06R655J711R20Q610j138o753Q02M080
10159G33786l3N8K60k354m748k696J55M383O358J017p980J990J0693L173l571
10144G40491Q389J0037j0232j1169L914Q017k877N38l425L211J1157P015k835
10131G62231n167l224J001o076k342O778K594m912L700J0702L704l146l122L381
10117G66102K807n187p001K881Q059J144j340m886p782Q137O219K382N316J355
$$ plain form
10103 778206 770487 772757 774528 765590 759121 766365 774406 772666 778636 791607 799365 790183 779927 776311
10089 776311 776730 784086 788287 788496 781591 782386 792486 800268 803874 799854 795635 797085 801721 795587 795220
10074 795220 798735 804600 803702 803482 806106 804184 810848 820352 813543 809983 810309 799932 800585 816466 819044
10059 819044 809044 802409 802592 802272 800888 802796 808264 802300 795940 805241 813214 817943 811277 809141
10045 809141 814867 817314 818151 816265 814611 816817 813159 811209 817273 830526 834584 833847 825583 824819 832661
10030 832661 833256 833996 836146 842467 843314 832757 827426 837180 839664 836738 843671 847907 849456 849848 845353
10015 845353 849061 853808 854647 860628 867671 873051 870348 865990 865378 865166 862005 856933 855293 857043 858646
10000 858646 861894 857418 859260 865067 869847 866588 866332 865258 875223 877560 877248 876762 876103 880244 885723
$$ packed form
10103G78206p719K270J771q938o469P244Q041j740N970J2971P758r182j0256l616
10089G76311M19P356M201K09o905P95J0100P782L606m020m219J450M636o134l67
10074G95220L515N865q98k20K624j922O664R504o809l560L26j0377O53J5881K578
10059H19044j0000o635J83l20j384J908N468n964o360R301P973M729o666k136
10045H09141N726K447Q37j886j654K206l658j950O064J3253M058p37q264p64P842
10030H32661N95P40K150O321Q47j0557n331R754K484k926O933M236J549L92m495
10015H45353L708M747Q39N981P043N380k703m358o12k12l161n072j640J750J603
10000H58646L248m476J842N807M780l259k56j074R965K337l12m86o59M141N479
$$ plain form
9985 885723 877336 872354 876510 879526 872026 871978 875660 875047 882406 879242 884682 894570 903049 898436 900277
9970 900277 902604 900204 889778 884788 883617 890737 894747 900545 905455 907596 905711 905284 899976 901999
9956 901999 905397 903588 911604 917722 923575 916325 910565 916940 923151 925133 923683 925673 926039 936946
9942 936946 933852 933965 947654 940842 940307 934731 926395 924501 928483 940993 941489 937330 929473 927551 925462
9927 925462 935181 948446 942142 940447 954097 962803 961124 964537 967946 968304 965197 963635 963366 969472
9913 969472 970782 966573 962496 954852 946365 950438 958037 958718 958274 959517 966790 968161 968019 967681 975138
9898 975138 976885 969710 969717 981720 986611 981348 980491 982291 977230 976812 967591 969064 972420 976818 981910
9883 981910 983847 982906 981897 985895 989777 994143 997759 1006761 1007137 1006791 1002819 1000241 1004467 1004676 1004851 1001531
$$ packed form
9985H85723q387m982M156L016p500m8L682o13P359l164N440R888Q479m613J841
9970I00277K327k400j0426m990j171P120M010N798M910K141j885m27n308K023
9956I01999L398j809Q016O118N853p250n760O375O211J982j450J990L66J0907
9942I36946l094J13J3689o812n35n576q336j894L982J2510M96m159p857j922k089
9927I25462R719J3265o304j695J3650Q706j679L413L409L58l107j562k69O106
9913I69472J310m209m077p644q487M073P599O81m44J243P273J371j42l38P457
9898I75138J747p175PJ2003M891n263q57J800n061m18r221J473L356M398N092
9883I81910J937r41j009L998L882M366L616R002L76l46l972k578M226K09J75l320
$$ plain form
9867 1001531 1007775 1015826 1023553 1028053 1029997 1030174 1031695 1026693 1025385 1035588 1038103 1031000 1032243 1028111
9853 1028111 1019265 1011554 1012165 1021404 1017292 1010850 1017387 1031285 1035625 1033926 1032533 1035414 1035988 1045499
9839 1045499 1051513 1046151 1046577 1050749 1053114 1052455 1039870 1040907 1040797 1044088 1052241 1049623 1053016 1052513 1062248
9824 1062248 1068651 1059968 1060979 1067476 1065190 1067018 1065930 1066804 1063072 1065278 1073307 1072972 1085170 1093110
9810 1093110 1093239 1079048 1079545 1082923 1079113 1084673 1089511 1095445 1097342 1093885 1099475 1111248 1106504 1104679
9796 1104679 1106121 1109094 1099884 1097297 1111577 1117454 1118824 1111864 1110527 1113448 1113194 1114742 1112926 1124035
9782 1124035 1131391 1136674 1132253 1121573 1121100 1127982 1127734 1123730 1122143 1121566 1124631 1131665 1135054 1138093 1149704
9767 1149704 1146924 1152829 1154514 1155871 1159223 1156995 1157343 1158019 1155478 1155325 1156180 1156136 1165576 1168536 1160234 1160043
$$ packed form
9867A001531O244Q051P727M500J944J77J521n002j308J0203K515p103J243m132
9853A028111q846p711O11R239m112o442O537J3898M340j699j393K881N74R511
9839A045499O014n362M26M172K365o59j2585J037j10L291Q153k618L393n03R735
9824A062248O403q683J011O497k286J828j088Q74l732K206Q029l35J2198P940
9810A093110J29j4191M97L378l810N560M838N934J897l457N590J1773m744j825
9796A104679J442K973r210k587J4280N877J370o960j337K921k54J548j816J1109
9782A124035P356N283m421j0680m73O882k48m004j587n77L065P034L389L039J1611
9767A149704k780N905J685J357L352k228L48O76k541j53Q55m4R440K960q302j91
$$ plain form
9751 1160043 1163708 1173942 1171481 1178925 1184492 1183791 1192147 1195915 1191557 1193407 1187682 1181518 1192020 1192701
9737 1192701 1187890 1200134 1200237 1200027 1208064 1212326 1213732 1209899 1201404 1205827 1220333 1229177 1234898 1232836
9723 1232836 1223075 1229585 1234385 1234489 1233966 1233544 1240412 1248597 1254657 1255051 1254688 1252436 1240854 1235236 1235761
9708 1235761 1240132 1241476 1236053 1237419 1248624 1257250 1255853 1253331 1257318 1263411 1269145 1269146 1270406 1266717 1272950
9693 1272950 1279071 1273904 1269195 1270224 1274713 1277736 1271274 1272233 1279030 1280810 1297391 1306377 1308677 1308525
9679 1308525 1309509 1312438 1310540 1298596 1306874 1312433 1306121 1309134 1316259 1309001 1314001 1317372 1319778 1319002
9665 1319002 1324658 1331345 1327367 1334363 1347626 1356692 1358073 1352182 1354203 1359128 1364111 1365126 1366170 1367611
9651 1367611 1366741 1366889 1377864 1384323 1388947 1392496 1398083 1386425 1379473 1379053 1385375 1392079 1394620 1386729
$$ packed form
9751A160043L665J0234k461P444N567p01Q356L768m358J850n725o164J0502O81
9737A192701m811J2244J03k10Q037M262J406l833q495M423J4506Q844N721k062
9723A232836r761O510M800J04n23m22O868Q185O060L94l63k252j1582n618N25
9708A235761M371J344n423J366J1205Q626j397k522L987O093N734JJ260l689O233
9693A272950O121n167m709J029M489L023o462R59O797J780J6581Q986K300j52
9679A308525R84K929j898j1944Q278N559o312L013P125p258N000L371K406p76
9665A319002N656O687l978O996J3263R066J381n891K021M925M983J015J044J441
9651A367611q70J48J0975O459M624L549N587j1658o952m20O322O704K541p891
$$ plain form
9637 1386729 1385677 1387531 1391547 1393385 1408031 1413467 1419430 1427178 1428108 1425837 1422963 1423035 1421641 1412335 1414163
9622 1414163 1417718 1419001 1431259 1441478 1445680 1445094 1452653 1455432 1453748 1446601 1449042 1454061 1460647 1470662
9608 1470662 1475351 1476266 1475531 1470276 1472437 1477317 1482983 1488936 1495087 1499824 1494871 1483674 1486732 1493168
9594 1493168 1497232 1511011 1528820 1530957 1527940 1521614 1518421 1513958 1516277 1522159 1523993 1528902 1533966 1531172
9580 1531172 1526336 1529116 1545526 1559706 1557057 1558470 1564690 1567286 1569625 1571289 1577166 1569428 1562423 1559458
9566 1559458 1561931 1562264 1571765 1576271 1570228 1575579 1584055 1594113 1599978 1603774 1593085 1594316 1603833 1606283
9552 1606283 1617444 1626879 1628141 1620621 1615380 1621917 1625198 1629625 1636961 1641309 1645818 1652406 1661542 1656177
9538 1656177 1651743 1655120 1659862 1659200 1660411 1666989 1674922 1679743 1677694 1676899 1688899 1699180 1705028 1710064
$$ packed form
9637A386729j052J854M016J838J4646N436N963P748R30k271k874P2j394r306J828
9622A414163L555J283J2258J0219M202n86P559K779j684p147K441N019O586J0015
9608A470662M689R15p35n255K161M880N666N953O151M737m953j1197L058O436
9594A493168M064J3779J7809K137l017o326l193m463K319N882J834M909N064k794
9580A531172m836K780J6410J4180k649J413O220K596K339J664N877p738p005k965
9566A559458K473L33R501M506o043N351Q476J0058N865L796j0689J231R517K450
9552A606283J1161R435J262p520n241O537L281M427P336M348M509O588R136n365
9538A656177m434L377M742o62J211O578P933M821k049p95J2000J0281N848N036
$$ plain form
9524 1710064 1716256 1724020 1726914 1726278 1721491 1727371 1733786 1740150 1744503 1745581 1746521 1752727 1751779 1754696 1764575
9509 1764575 1761749 1757241 1768875 1772667 1776384 1777557 1786175 1795824 1797727 1800221 1805336 1813618 1819483 1826708
9495 1826708 1838530 1841174 1830394 1830967 1839646 1844296 1841367 1851289 1866114 1872258 1880119 1885215 1893334 1893373
9481 1893373 1883780 1891912 1898602 1905317 1909412 1901810 1910617 1913700 1913856 1915979 1923552 1932484 1932488 1940824 1946981
9466 1946981 1947365 1959354 1964609 1958408 1954752 1957507 1967046 1976013 1981954 1997192 1998247 1995530 1991725 1985605
9452 1985605 1989785 2005358 2031544 2042606 2039607 2045738 2047538 2052263 2067808 2070511 2073083 2087136 2097205
9439 2097205 2096663 2098437 2100643 2105590 2116841 2120709 2118962 2125546 2135490 2145622 2159830 2167579 2175299 2186477
9425 2186477 2199105 2218407 2225347 2226753 2228738 2237548 2249746 2262925 2271937 2284003 2294444 2316759
$$ packed form
9524A710064O192P764K894o36m787N880O415O364M353J078R40O206r48K917R879
9509A764575k826m508J1634L792L717J173Q618R649J903K494N115Q282N865P225
9495A826708J1822K644j0780N73Q679M650k929R922J4825O144P861N096Q119L9
9481A893373r593Q132O690O715M095p602Q807L083J56K123P573Q932MQ336O157
9466A946981L84J1989N255o201l656K755R539Q967N941J5238J055k717l805o120
9452A985605M180J5573K6186J1062k999O131J800M725J5545K703K572J4053J0069
9439B097205n42J774K206M947J1251L868j747O584R944J0132J4208P749P720J1178
9425B186477J2628J9302O940J406J985Q810J2198J3179R012J2066J0441K2315
$$ plain form
9413 2316759 2326349 2326770 2341037 2356000 2374257 2386625 2400224 2408945 2431291 2452787 2477985 2519144
9401 2519144 2554849 2577491 2618532 2658539 2700660 2734597 2766501 2795977 2817509 2819368 2810758 2756457
9389 2756457 2664569 2541003 2384464 2226033 2086587 1969361 1880289 1824783 1794779 1788690 1807346
9378 1807346 1841258 1871371 1898615 1931019 1969110 2003090 2031764 2067269 2091730 2114895 2130067
9367 2130067 2143684 2155593 2173679 2197327 2212323 2215011 2218151 2239520 2264672 2273890 2282644 2298385
9355 2298385 2319569 2335637 2346777 2356496 2363829 2371448 2381954 2393869 2399126 2398704 2403449 2414718 2426915
9342 2426915 2434103 2445957 2456197 2463532 2476082 2495919 2507633 2523809 2531561 2535280 2544039 2566299
9330 2566299 2584087 2600527 2617023 2621111 2634793 2636533 2637915 2640156 2649396 2656549 2664653 2673663 2692625
$$ packed form
9413B316759R590M21J4267J4963J8257J2368J3599Q721K2346K1496K5198M1159
9401B519144L5705K2642M1041M0007M2121L3937L1904K9476K1532J859q610n4301
9389B756457r1888j23566j56539j58431j39446j17226q9072n5506l0004o089J8656
9378A807346L3912L0113K7244L2404L8091L3980K8674L5505K4461K3165J5172
9367B130067J3617J1909J8086K3648J4996K688L140K1369K5152R218Q754J5741
9355B298385K1184J6068J1140R719P333P619J0506J1915N257m22M745J1269J2197
9342B426915P188J1854J0240P335J2550J9837J1714J6176P752L719Q759K2260
9330B566299J7788J6440J6496M088J3682J740J382K241R240P153Q104R010J8962
$$ plain form
9317 2692625 2704832 2711608 2714767 2723145 2733499 2741497 2753692 2767296 2777176 2782637 2789272 2806108 2818130
9304 2818130 2824600 2828450 2831524 2845585 2856327 2874270 2895754 2910919 2923965 2935354 2944338 2951355
9292 2951355 2966565 2974017 2988396 3000843 3003888 2991734 2994280 3006710 3015838 3025794 3048485 3070831
9280 3070831 3093800 3112288 3122842 3133673 3140018 3155684 3167460 3180131 3191829 3194625 3196954 3205547
9268 3205547 3217272 3236463 3251424 3274265 3283330 3291509 3303587 3322165 3337022 3350439 3364114 3373424
9256 3373424 3384503 3407502 3430349 3439997 3451874 3480739 3524254 3555176 3558793 3553121 3531546 3521847
9244 3521847 3541372 3559895 3578228 3608848 3640757 3643398 3662439 3684218 3684598 3654709 3634706 3632296
9232 3632296 3632856 3649837 3671040 3694822 3724150 3757179 3783352 3800778 3814835 3831212 3848766 3864616
$$ packed form
9317B692625J2207O776L159Q378J0354P998J2195J3604R880N461O635J6836J2022
9304B818130O470L850L074J4061J0742J7943K1484J5165J3046J1389Q984P017
9292B951355J5210P452J4379J2447L045j2154K546J2430R128R956K2691K2346
9280C070831K2969J8488J0554J0831O345J5666J1776J2671J1698K796K329Q593
9268C205547J1725J9191J4961K2841R065Q179J2078J8578J4857J3417J3675R310
9256C373424J1079K2999K2847R648J1877K8865M3515L0922L617n672k1575r699
9244C521847J9525J8523J8333L0620L1909K641J9041K1779L80k9889k0003k410
9232C632296N60J6981K1203K3782K9328L3029K6173J7426J4057J6377J7554J5850
$$ plain form
9220 3864616 3877050 3888091 3899272 3925414 3958527 3993204 4024015 4043090 4065216 4091010 4115554
9209 4115554 4136125 4156231 4177052 4194363 4217970 4234702 4249423 4264433 4284260 4311578 4350049
9198 4350049 4382292 4402110 4418537 4438739 4446497 4455714 4490899 4532758 4580569 4613265 4625933 4629256
9186 4629256 4635005 4647725 4665686 4679254 4713731 4776997 4847574 4918264 4976678 4994059 4973090 4957505
9174 4957505 4957146 4977173 5003409 5037311 5065812 5085243 5103670 5129203 5160235 5200968 5245851 5284797
9162 5284797 5313616 5352657 5396996 5427577 5449306 5461060 5485266 5519661 5559205 5597865 5643552
9151 5643552 5704617 5764714 5816922 5860091 5892308 5933525 5989228 6050102 6111627 6179230 6243198
9140 6243198 6304695 6380820 6458315 6539292 6628395 6703518 6794276 6910056 7033266 7156216 7272765
$$ packed form
9220C864616J2434J1041J1181K6142L3113L4677L0811J9075K2126K5794K4544
9209D115554K0571K0106K0821J7311K3607J6732J4721J5010J9827K7318L8471
9198D350049L2243J9818J6427K0202P758R217L5185M1859M7811L2696J2668L323
9186D629256N749J2720J7961J3568L4477O3266P0577P0690N8414J7381k0969j5585
9174D957505l59K0027K6236L3902K8501J9431J8427K5533L1032M0733M4883L8946
9162E284797K8819L9041M4339L0581K1729J1754K4206L4395L9544L8660M5687
9151E643552O1065O0097N2208M3169L2217M1217N5703O0874O1525O7603O3968
9140F243198O1497P6125P7495Q0977Q9103P5123R0758J15780J23210J22950J16549
$$ plain form
9129 7272765 7382170 7431631 7306930 6928571 6411192 6003342 5803911 5791556 5885060 5994957
9119 5994957 6104779 6191459 6245774 6306977 6416420 6497077 6532733 6583863 6680567 6794567 6913461
9108 6913461 7027631 7123996 7195203 7268474 7336837 7425118 7524358 7616763 7690924 7765605 7845094
9097 7845094 7924543 8012755 8105708 8214359 8324754 8412656 8492490 8576128 8680754 8787817 8888902
9086 8888902 8981863 9073263 9168080 9270992 9365529 9455384 9561531 9676288 9805296 9956452
9076 9956452 10110199 10245976 10363230 10470045 10567833 10676743 10794509 10935078 11082066 11225524
9066 11225524 11381852 11543313 11695759 11843723 11997717 12155471 12327486 12496405 12660294
9057 12660294 12816522 12982972 13174069 13390826 13623632 13876446 14134075 14382955 14628088
$$ packed form
9129G272765J09405M9461j24701l78359n17379m07850j99431j2355R3504J09897
9119E994957J09822Q6680N4315O1203J09443Q0657L5656N1130R6704J14000J18894
9108F913461J14170R6365P1207P3271O8363Q8281R9240R2405P4161P4681P9489
9097G845094P9449Q8212R2953J08651J10395Q7902P9834Q3638J04626J07063J01085
9086H888902R2961R1400R4817J02912R4537Q9855J06147J14757J29008J51156
9076I956452J53747J35777J17254J06815R7788J08910J17766J40569J46988J43458
9066A1225524J56328J61461J52446J47964J53994J57754J72015J68919J63889
9057A2660294J56228J66450J91097K16757K32806K52814K57629K48880K45133
$$ plain form
9048 14628088 14880381 15122663 15374732 15656385 15957744 16251325 16555892 16853076 17149393
9039 17149393 17457112 17778750 18150914 18546531 18944196 19345885 19767951 20229463 20699183
9030 20699183 21183687 21728857 22317947 22898181 23463327 24060911 24749291 25494769 26256941
9021 26256941 27024439 27837979 28730082 29695024 30726958 31843521 33068283 34387600 35764009
9012 35764009 37220613 38817062 40616727 42660648 44885938 47195593 49611298 52229314
9004 52229314 55109487 58338143 61966658 65960532 70144570 74908750 81086740 88975130
8996 88975130 98665752 110589993 125416884 143869342 166363100 190118356 198454122
8989 198454122 145358103 14305398 -104818621 -164725932 -176063428 -163213269 -144753722
$$ packed form
9048A4628088K52293K42282K52069K81653L01359K93581L04567K97184K96317
9039A7149393L07719L21638L72164L95617L97665M01689M22066M61512M69720
9030B0699183M84504N45170N89090N80234N65146N97584O88380P45478P62172
9021B6256941P67498Q13540Q92103R64942J031934J116563J224762J319317J376409
9012C5764009J456604J596449J799665K043921K225290K309655K415705K618016
9004E2229314K880173L228656L628515L993874M184038M764180O177990P888390
8996H8975130R690622J1924241J4826891J8452458K2493758K3755256Q335766
8989A98454122n3096019j31052705j19124019n9907311j1337496J2850159J8459547
$$ plain form
8982 -144753722 -127639698 -113117561 -101070206 -91112976 -82888945 -76185789 -70758327 -66556149
8974 -66556149 -63478311 -60724913 -57817282 -54844359 -51917326 -49177083 -46754237 -44635287
8966 -44635287 -42705360 -40894029 -39196337 -37646813 -36272005 -35045199 -33889878 -32796078
8958 -32796078 -31750276 -30751387 -29779348 -28832484 -27934470 -27132363 -26389850 -25648728 -24906148
8949 -24906148 -24202050 -23580240 -23011077 -22455352 -21925146 -21424593 -20944593 -20466716 -19997215
8940 -19997215 -19562288 -19156998 -18768512 -18385604 -18006765 -17632639 -17273113 -16936834 -16627806
8931 -16627806 -16336546 -16055530 -15785828 -15515842 -15237787 -14983718 -14762913 -14562749 -14372701
8922 -14372701 -14178828 -13977176 -13760065 -13543713 -13328698 -13126298 -12940770 -12759862 -12571175
$$ packed form
8982a44753722J7114024J4522137J2047355R957230Q224031O703156N427462M202178
8974f6556149L077838K753398K907631K972923K927033K740243K422846K118950
8966d4635287J929927J811331J697692J549524J374808J226806J155321J093800
8958c2796078J045802R98889R72039R46864Q98014Q02107P42513P41122P42580
8949b4906148P04098O21810N69163N55725N30206N00553M80000M77877M69501
8940a9997215M34927M05290L88486L82908L78839L74126L59526L36279L09028
8931a6627806K91260K81016K69702K69986K78055K54069K20805K00164J90048
8922a4372701J93873K01652K17111K16352K15015K02400J85528J80908J88687
$$ plain form
8913 -12571175 -12398613 -12237288 -12069497 -11902186 -11748032 -11598065 -11460171 -11326104 -11186016
8904 -11186016 -11038107 -10887515 -10732142 -10601877 -10490284 -10401874 -10311940 -10209877 -10114705 -10000829
8894 -10000829 -9883499 -9771831 -9663776 -9560276 -9458805 -9360371 -9269323 -9184372 -9091852 -9006174
8884 -9006174 -8917117 -8834195 -8764464 -8689659 -8618454 -8541188 -8460140 -8379504 -8302043 -8224553 -8147732
8873 -8147732 -8087409 -8017448 -7940871 -7862011 -7783798 -7723753 -7673887 -7653670 -7653544 -7620779 -7530001 -7454416
8861 -7454416 -7456955 -7473984 -7401407 -7267885 -7158833 -7079033 -7005263 -6940283 -6877641 -6817834 -6769932
8850 -6769932 -6719495 -6666580 -6607479 -6558235 -6508199 -6447593 -6403384 -6359970 -6314341 -6265947 -6220554
8839 -6220554 -6178375 -6144854 -6113973 -6076947 -6040743 -6006327 -5965662 -5928918 -5901475 -5865388 -5830566
$$ packed form
8913a2571175J72562J61325J67791J67311J54154J49967J37894J34067J40088
8904a1186016J47909J50592J55373J30265J11593Q8410Q9934J02063R5172J13876
8894a0000829J17330J11668J08055J03500J01471R8434R1048Q4951R2520Q5678
8884i006174Q9057Q2922O9731P4805P1205P7266Q1048Q0636P7461P7490P6821
8873h147732O0323O9961P6577P8860P8213O0045M9866K0217J26L2765R0778P5585
8861g454416k539j7029P2577J33522J09052P9800P3770O4980O2642N9807M7902
8850f769932N0437N2915N9101M9244N0036O0606M4209M3414M5629M8394M5393
8839f220554M2179L3521L0881L7026L6204L4416M0665L6744K7443L6087L4822
$$ plain form
8828 -5830566 -5785317 -5747336 -5721005 -5696107 -5665506 -5643589 -5613692 -5580880 -5537860 -5488946 -5433486
8817 -5433486 -5385158 -5347876 -5322858 -5293356 -5255774 -5230863 -5212918 -5188224 -5160624 -5133952 -5099282
8806 -5099282 -5054016 -5022149 -5003651 -4983569 -4955380 -4909963 -4840511 -4765388 -4724758 -4708455 -4716569 -4746180
8794 -4746180 -4758278 -4752625 -4722748 -4687948 -4649498 -4599564 -4554571 -4525718 -4506150 -4501487 -4496680 -4476953
8782 -4476953 -4443563 -4408659 -4378341 -4352514 -4339903 -4333270 -4323643 -4311477 -4301708 -4264626 -4227621 -4202293
8770 -4202293 -4177988 -4156779 -4140318 -4120860 -4104230 -4077327 -4047822 -4030408 -4023570 -4021713 -4006590 -3989461
8758 -3989461 -3981336 -3966274 -3945690 -3928050 -3907449 -3883971 -3863235 -3834112 -3814558 -3806067 -3797340 -3783277
8746 -3783277 -3759617 -3737441 -3721031 -3702519 -3691562 -3658880 -3633267 -3614828 -3595465 -3592839 -3598580 -3591908
$$ packed form
8828e830566M5249L7981K6331K4898L0601K1917K9897L2812M3020M8914N5460
8817e433486M8328L7282K5018K9502L7582K4911J7945K4694K7600K6672L4670
8806e099282M5266L1867J8498K0082K8189M5417O9452P5123M0630J6303q114k9611
8794d746180j2098N653K9877L4800L8450M9934M4993K8853J9568M663M807J9727
8782d476953L3390L4904L0318K5827J2611O633R627J2166R769L7082L7005K5328
8770d202293K4305K1209J6461J9458J6630K6903K9505J7414O838J857J5123J7129
8758c989461Q125J5062K0584J7640K0601K3478K0736K9123J9554Q491Q727J4063
8746c783277K3660K2176J6410J8512J0957L2682K5613J8439J9363K626n741O672
$$ plain form
8734 -3591908 -3587909 -3582961 -3575755 -3563000 -3552741 -3522701 -3497306 -3490266 -3477836 -3471901 -3475119 -3474386 -3472418
8721 -3472418 -3461562 -3433673 -3404684 -3373600 -3349546 -3340306 -3335318 -3328809 -3318494 -3298428 -3271361 -3262605
8709 -3262605 -3249867 -3233784 -3228253 -3220332 -3201329 -3174608 -3153965 -3143086 -3130986 -3115007 -3102386 -3090179
8697 -3090179 -3083386 -3072616 -3061457 -3053805 -3055304 -3053607 -3042173 -3012620 -2978035 -2962686 -2952115 -2941624
8685 -2941624 -2931907 -2920303 -2910275 -2893715 -2865485 -2839035 -2821070 -2813974 -2808510 -2800700 -2781967 -2758104
8673 -2758104 -2731163 -2708240 -2692020 -2666825 -2640845 -2621663 -2586946 -2554677 -2537649 -2550971 -2609346
8662 -2609346 -2695708 -2784014 -2849851 -2888066 -2898436 -2887502 -2858694 -2829720 -2804358 -2776744 -2755230
8651 -2755230 -2729987 -2712559 -2701092 -2683726 -2656646 -2635203 -2624619 -2610061 -2595371 -2583543 -2573245
$$ packed form
8734c591908L999M948P206J2755J0259L0040K5395P040J2430N935l218P33J968
8721c472418J0856K7889K8989L1084K4054R240M988O509J0315K0066K7067Q756
8709c262605J2738J6083N531P921J9003K6721K0643J0879J2100J5979J2621J2207
8697c090179O793J0770J1159P652j499J697J1434K9553L4585J5349J0571J0491
8685b941624R717J1604J0028J6560K8230K6450J7965P096N464P810J8733K3863
8673b758104K6941K2923J6220K5195K5980J9182L4717L2269J7028j3322n8375
8662b609346q6362q8306o5837l8215j0370J0934K8808K8974K5362K7614K1514
8651b755230K5243J7428J1467J7366K7080K1443J0584J4558J4690J1828J0298
$$ plain form
8640 -2573245 -2557247 -2531609 -2507902 -2491054 -2473604 -2457433 -2431952 -2402307 -2369398 -2335397 -2322779
8629 -2322779 -2331441 -2321058 -2295730 -2271824 -2249927 -2214951 -2167515 -2127091 -2080884 -2011176 -1970114 -1971398
8617 -1971398 -2037979 -2197828 -2406306 -2603227 -2725715 -2773092 -2760560 -2713929 -2664319 -2622568 -2573799
8606 -2573799 -2529592 -2483925 -2450347 -2413716 -2367311 -2324598 -2289233 -2257311 -2217496 -2181339 -2136060
8595 -2136060 -2087904 -2039244 -1973490 -1924679 -1883518 -1858265 -1873187 -1914211 -1963718 -2038975 -2135438
8584 -2135438 -2264495 -2407094 -2544236 -2657821 -2741875 -2797654 -2817471 -2822065 -2805374 -2769139 -2721572
8573 -2721572 -2668270 -2617502 -2603052 -2631585 -2699617 -2761698 -2805733 -2828694 -2819454 -2786341 -2758837 -2736353
8561 -2736353 -2703680 -2677302 -2655087 -2624764 -2591870 -2566413 -2551425 -2539430 -2534271 -2520352 -2498350 -2474554
$$ packed form
8640b573245J5998K5638K3707J6848J7450J6171K5481K9645L2909L4001J2618
8629b322779q662J0383K5328K3906K1897L4976M7436M0424M6207O9708M1062j284
8617a971398o6581j59849k08478j96921j22488m7377J2532M6631M9610M1751M8769
8606b573799M4207M5667L3578L6631M6405M2713L5365L1922L9815L6157M5279
8595b136060M8156M8660O5754M8811M1161K5253j4922m1024m9507p5257r6463
8584b135438j29057j42599j37142j13585q4054n5779j9817m594J6691L6235M7567
8573b721572N3302N0768J4450k8533o8032o2081m4035k2961R240L3113K7504K2484
8561b736353L2673K6378K2215L0323L2894K5457J4988J1995N159J3919K2002K3796
$$ plain form
8549 -2474554 -2464644 -2459809 -2447316 -2431993 -2419568 -2401670 -2395125 -2390838 -2377706 -2370673 -2357597 -2340969
8537 -2340969 -2327880 -2315155 -2306870 -2299404 -2294348 -2280484 -2260297 -2259692 -2254803 -2243742 -2248383 -2251023 -2240241
8524 -2240241 -2240472 -2242697 -2226324 -2205819 -2183826 -2177047 -2174371 -2173234 -2162795 -2166070 -2164474 -2161009 -2157837
8511 -2157837 -2147246 -2148211 -2144624 -2136999 -2124531 -2108041 -2097608 -2094496 -2088744 -2078885 -2076228 -2076872 -2077597 -2069992
8497 -2069992 -2058996 -2062034 -2058985 -2044071 -2039008 -2037620 -2027588 -2024277 -2020607 -2017019 -2003619 -1997017 -1997028 -1997835
8483 -1997835 -1997113 -1988919 -1980108 -1971809 -1957631 -1952646 -1953409 -1954982 -1956373 -1953841 -1955398 -1947004 -1942918 -1933085
8469 -1933085 -1931448 -1931692 -1929019 -1923738 -1917208 -1894919 -1881563 -1878444 -1878976 -1887620 -1892111 -1889956 -1886393 -1885013
8455 -1885013 -1883631 -1874860 -1864109 -1857292 -1850547 -1849894 -1855785 -1855852 -1842584 -1836818 -1828228 -1824633 -1828616 -1826492
$$ packed form
8549b474554R910M835J2493J5323J2425J7898O545M287J3132P033J3076J6628
8537b340969J3089J2725Q285P466N056J3864K0187O05M889J1061m641k640J0782
8524b240241k31k225J6373K0505K1993O779K676J137J0439l275J596L465L172
8511b157837J0591r65L587P625J2468J6490J0433L112N752R859K657o44p25P605
8497b069992J0996l038L049J4914N063J388J0032L311L670L588J3400O602j1q07
8483a997835P22Q194Q811Q299J4178M985p63j573j391K532j557Q394M086R833
8469a933085J637k44K673N281O530K2289J3356L119n32q644m491K155L563J380
8455a885013J382Q771J0751O817O745O53n891o7J3268N766Q590L595l983K124
$$ plain form
8441 -1826492 -1829488 -1825013 -1819583 -1812202 -1808889 -1812940 -1809427 -1804402 -1802839 -1802415 -1795663 -1791850 -1777476 -1762532
8427 -1762532 -1763271 -1757764 -1751164 -1753220 -1750314 -1748007 -1747201 -1743259 -1743908 -1748872 -1746075 -1741114 -1745956 -1752223 -1751368
8412 -1751368 -1737693 -1726204 -1721107 -1710118 -1704674 -1702968 -1698972 -1695984 -1693763 -1695183 -1693008 -1687960 -1688070 -1694329
8398 -1694329 -1690898 -1674973 -1671892 -1673719 -1666852 -1668955 -1656253 -1651113 -1660486 -1654661 -1648912 -1647240 -1646040 -1648356
8384 -1648356 -1652230 -1645898 -1640693 -1632733 -1626226 -1615771 -1618287 -1629632 -1622760 -1619680 -1615694 -1608400 -1611926 -1609597
8370 -1609597 -1605004 -1586727 -1581734 -1585042 -1581424 -1575277 -1578834 -1582521 -1581246 -1579466 -1580149 -1574400 -1568505 -1562786
8356 -1562786 -1562827 -1563351 -1553623 -1552587 -1557239 -1550864 -1540911 -1541927 -1538528 -1527469 -1527382 -1529392 -1530110 -1528372 -1529775
8341 -1529775 -1527268 -1531187 -1534478 -1531240 -1523779 -1518817 -1513507 -1515800 -1514856 -1515090 -1506052 -1501695 -1499402 -1491758 -1491509
$$ packed form
8441a826492k996M475N430P381L313m051L513N025J563M24O752L813J4374J4944
8427a762532p39N507O600k056K906K307Q06L942o49m964K797M961m842o267Q55
8412a751368J3675J1489N097J0989N444J706L996K988K221j420K175N048j10o259
8398a694329L431J5925L081j827O867k103J2702N140r373N825N749J672J200k316
8384a648356l874O332N205P960O507J0455k516j1345O872L080L986P294l526K329
8370a609597M593J8277M993l308L618O147l557l687J275J780o83N749N895N719
8356a562786m1n24R728J036m652O375R953j016L399J1059Q7k010p18J738j403
8341a529775K507l919l291L238P461M962N310k293R44k34R038M357K293P644K49
$$ plain form
8326 -1491509 -1484068 -1481653 -1493119 -1494323 -1496524 -1490708 -1491029 -1483378 -1470195 -1477036 -1481278 -1472932 -1465960 -1457054
8312 -1457054 -1452915 -1454316 -1453424 -1450320 -1453758 -1458950 -1457103 -1455152 -1446030 -1441251 -1444222 -1443003 -1446632 -1442295
8298 -1442295 -1429557 -1431164 -1425328 -1425884 -1423334 -1410960 -1401600 -1408011 -1410937 -1401197 -1405230 -1413921 -1410869 -1406589
8284 -1406589 -1393391 -1387295 -1392093 -1392389 -1385086 -1391943 -1394024 -1387751 -1387017 -1387011 -1381753 -1382177 -1386201 -1388417 -1389109 -1390664
8268 -1390664 -1386807 -1380013 -1372323 -1367832 -1364762 -1356830 -1343204 -1340323 -1333708 -1342415 -1342854 -1335862 -1335714 -1341455
8254 -1341455 -1341769 -1335760 -1335927 -1339056 -1337315 -1334342 -1328096 -1328882 -1322258 -1321647 -1322165 -1316357 -1319330 -1316419 -1317828
8239 -1317828 -1314841 -1310513 -1309232 -1305083 -1306003 -1309682 -1311991 -1307327 -1316787 -1319505 -1300411 -1291297 -1286966 -1292408
8225 -1292408 -1295969 -1303843 -1299027 -1294461 -1286304 -1275880 -1274238 -1275904 -1273692 -1267093 -1264114 -1259025 -1251498 -1263388
$$ packed form
8326a491509P441K415j1466j204k201N816l21P651J3183o841m242Q346O972Q906
8312a457054M139j401Q92L104l438n192J847J951R122M779k971J219l629M337
8298a442295J2738j607N836n56K550J2374R360o411k926R740m033q691L052M280
8284a406589J3198O096m798k96P303o857k081O273P34ON258m24m024k216o92j555
8268a390664L857O794P690M491L070P932J3626K881O615q707m39O992J48n741
8254a341455l14O009j67l129J741K973O246p86O624O11n18N808k973K911j409
8239a317828K987M328J281M149r20l679k309M664r460k718J9094R114M331n442
8225a292408l561p874M816M566Q157J0424J642j666K212O599K979N089P527j1890
$$ plain form
8211 -1263388 -1271542 -1270153 -1267479 -1265478 -1258723 -1254972 -1251612 -1248191 -1240859 -1238035 -1248587 -1252642 -1249364 -1249964
8197 -1249964 -1242592 -1234656 -1233188 -1236137 -1237288 -1231233 -1233121 -1241987 -1238135 -1237168 -1234073 -1230128 -1224492 -1221861
8183 -1221861 -1224240 -1219846 -1220847 -1224520 -1222559 -1222499 -1218719 -1219760 -1219491 -1218373 -1205783 -1198253 -1199894 -1203921 -1210385
8168 -1210385 -1212262 -1211501 -1202640 -1200198 -1195871 -1190250 -1192210 -1192443 -1192175 -1183046 -1178893 -1183478 -1185773 -1190763 -1186889
8153 -1186889 -1179332 -1175973 -1175960 -1178909 -1185533 -1180342 -1170434 -1174097 -1171027 -1166793 -1164400 -1165023 -1164884 -1175012 -1170109
8138 -1170109 -1159598 -1153285 -1147213 -1143874 -1148099 -1147260 -1133470 -1133637 -1134489 -1127625 -1119886 -1117502 -1116969 -1118068 -1130881
8123 -1130881 -1140166 -1145618 -1156915 -1163006 -1161459 -1154587 -1142668 -1137015 -1128715 -1130896 -1132705 -1136569 -1140660 -1137870
8109 -1137870 -1141774 -1135051 -1126767 -1119821 -1115186 -1115844 -1112310 -1116392 -1120128 -1125711 -1124014 -1120458 -1112556 -1101442
$$ packed form
8211a263388q154J389K674K001O755L751L360L421P332K824j0552m055L278o00
8197a249964P372P936J468k949j151O055j888q866L852R67L095L945N636K631
8183a221861k379M394j001l673J961O0L780j041K69J118J2590P530j641m027o464
8168a210385j877P61Q861K442M327N621j960k33K68R129M153m585k295m990L874
8153a186889P557L359J3k949o624N191R908l663L070M234K393o23J39j0128M903
8138a170109J0511O313O072L339m225Q39J3790j67q52O864P739K384N33j099j2813
8123a130881r285n452j1297o091J547O872J1919N653Q300k181j809l864m091K790
8109a137870l904O723Q284O946M635o58L534m082l736n583J697L556P902J1114
$$ plain form
8095 -1101442 -1093828 -1090432 -1091246 -1097644 -1094071 -1086227 -1080924 -1076511 -1069124 -1077092 -1082831 -1074446 -1063799 -1056340
8081 -1056340 -1046588 -1054880 -1059194 -1070469 -1079611 -1091552 -1105226 -1112698 -1110379 -1101646 -1099968 -1096871 -1094828
8068 -1094828 -1091048 -1082879 -1075159 -1071803 -1070654 -1070330 -1069566 -1067619 -1068761 -1063114 -1059559 -1058942 -1056957 -1053326 -1047140
8053 -1047140 -1033725 -1027958 -1035592 -1043672 -1041919 -1038399 -1044260 -1054093 -1055783 -1057465 -1059698 -1048230 -1042321 -1043280
8039 -1043280 -1040941 -1033128 -1032958 -1032641 -1031985 -1033156 -1030440 -1027319 -1022757 -1025988 -1031190 -1045762 -1049431 -1048836 -1042982
8024 -1042982 -1047789 -1051512 -1050904 -1044017 -1032947 -1019716 -1012710 -1011253 -1007986 -1009579 -1016651 -1014562 -1011215 -1002534
8010 -1002534 -999308 -1004687 -999413 -996211 -993466 -996353 -1002812 -997934 -988996 -994914 -1001168 -1006584 -1009014 -1003347
7996 -1003347 -995388 -997886 -995451 -988969 -996415 -1003932 -1011760 -1019201 -1023584 -1017876 -1015604 -1022573 -1022184 -1019083
$$ packed form
8095a101442P614L396q14o398L573P844N303M413P387p968n739Q385J0647P459
8081a056340R752q292m314j1275r142j1941j3674p472K319Q733J678L097K043
8068a094828L780Q169P720L356J149L24P64J947j142N647L555O17J985L631O186
8053a047140J3415N767p634q080J753L520n861r833j690j682k233J1468N909r59
8039a043280K339P813J70L17O56j171K716L121M562l231n202j4572l669N95N854
8024a042982m807l723O08O887J1070J3231P006J457L267j593p072K089L347Q681
8010a002534L226n379N274L202K745k887o459M878Q938n918o254n416k430N667
7996a003347P959k498K435O482p446p517p828p441m383N708K272o969L89L101
$$ plain form
7982 -1019083 -1014551 -1003093 -1002251 -994685 -989650 -990111 -998001 -997863 -993533 -991114 -981325 -978129 -978333 -981612 -981938
7967 -981938 -972484 -967779 -964080 -951146 -935963 -931325 -935529 -949293 -941338 -931892 -930394 -924903 -946180
7954 -946180 -962174 -963916 -962974 -957215 -954739 -956225 -972448 -982965 -985603 -989008 -989731 -985721 -981131 -978587
7940 -978587 -981052 -979327 -978315 -974149 -976572 -971831 -961975 -958773 -960277 -965273 -966363 -958734 -950000 -951487
7926 -951487 -949748 -946194 -949112 -950352 -945996 -942948 -948656 -958665 -960107 -961035 -952288 -947711 -948386 -949621 -944940
7911 -944940 -947721 -944576 -939961 -936273 -930700 -931812 -938058 -942577 -930744 -932113 -943598 -946512 -934067 -920890
7897 -920890 -921405 -924560 -926103 -920968 -918728 -912082 -909752 -916420 -910433 -913455 -916872 -914679 -912245 -915939 -921266
7882 -921266 -924954 -925665 -921267 -917694 -913975 -913965 -918577 -927805 -938565 -939008 -932225 -925903 -909849 -902929 -907206
$$ packed form
7982a019083M532J1458Q42P566N035m61p890J38M330K419R789L196k04l279l26
7967i81938R454M705L699J2934J5183M638m204j3764P955R446J498N491k1277
7954i46180j5994j742R42N759K476j486j6223j0517k638l405p23M010M590K544
7940i78587k465J725J012M166k423M741R856L202j504m996j090P629Q734j487
7926i51487J739L554k918j240M356L048n708j0009j442r28Q747M577o75j235M681
7911i44940k781L145M615L688N573j112o246m519J1833j369j1485k914J2445J3177
7897i20890n15l155j543N135K240O646K330o668N987l022l417K193K434l694n327
7882i21266l688p11M398L573L719J0m612r228j0760m43O783O322J6054O920m277
$$ plain form
7867 -907206 -905512 -912289 -917896 -914863 -909598 -908092 -904504 -899337 -896146 -897220 -898249 -897074 -890974 -890697 -894590
7852 -894590 -894831 -895737 -894780 -895963 -895525 -899055 -900461 -900700 -899119 -896185 -889067 -882934 -892380 -884467 -877148 -877366
7836 -877366 -877006 -875579 -869731 -867285 -873158 -876134 -881332 -876607 -868149 -869296 -879527 -879310 -868550 -864855
7822 -864855 -871336 -874964 -874371 -871445 -863940 -860162 -863426 -869811 -867952 -866069 -858901 -852482 -854253 -850954 -858017
7807 -858017 -864695 -850289 -838555 -842190 -856087 -857075 -850466 -854159 -852617 -852933 -849904 -850378 -848244 -851074
7793 -851074 -856730 -845685 -846754 -852571 -851776 -851352 -847623 -850450 -848393 -847400 -840765 -836708 -838472 -844301 -838777
7778 -838777 -832392 -824470 -826223 -831442 -826902 -821418 -826322 -829144 -829108 -824553 -814360 -817796 -830009 -837565
7764 -837565 -843794 -841502 -845863 -841600 -836657 -832950 -826853 -828917 -836072 -838000 -840139 -843290 -840291 -832426
$$ packed form
7867i07206J694o777n607L033N265J506L588N167L191j074j029J175O100K77l893
7852h94590k41r06R57j183M38l530j406k39J581K934P118O133r446P913P319k18
7836h77366L60J427N848K446n873k976n198M725Q458j147j0231K17J0760L695
7822h64855o481l628N93K926P505L778l264o385J859J883P168O419j771L299p063
7807h58017o678J4406J1734l635j3897r88O609l693J542l16L029m74K134k830
7793h51074n656J1045j069n817P95M24L729k827K057R93O635M057j764n829N524
7778h38777O385P922j753n219M540N484m904k822L6M555J0193l436j2213p556
7764h37565o229K292m361M263M943L707O097k064p155j928k139l151K999P865
$$ plain form
7750 -832426 -832091 -830314 -825564 -820681 -823830 -828526 -829265 -822919 -818220 -823318 -818495 -820327 -816102 -810951 -804191
7735 -804191 -800793 -808289 -807942 -806205 -809031 -812170 -812447 -812526 -806314 -803914 -801512 -798649 -804175 -805829 -800980
7720 -800980 -798526 -795775 -789487 -792405 -791180 -795541 -799019 -798068 -803312 -809281 -804923 -794313 -791591 -789607
7706 -789607 -796337 -793187 -792345 -795097 -789424 -789173 -787995 -784813 -779367 -780083 -785155 -789956 -786236 -786706 -782235
7691 -782235 -781933 -785626 -788446 -791852 -791087 -790794 -790490 -787440 -780737 -774927 -774462 -767293 -765538 -772718 -782876
7676 -782876 -782107 -785405 -786211 -783712 -779224 -773264 -760557 -763410 -760783 -764197 -770311 -778750 -772648 -767355 -762912
7661 -762912 -758317 -755179 -766753 -767171 -757361 -762706 -759519 -756734 -753701 -745181 -743031 -755342 -760870 -766727
7647 -766727 -766732 -767843 -768866 -764638 -765802 -767921 -768599 -757335 -756162 -760599 -761007 -747663 -742675 -737959 -739634
$$ packed form
7750h32426L35J777M750M883l149m696p39O346M699n098M823j832M225N151O760
7735h04191L398p496L47J737k826l139k77p9O212K400K402K863n526j654M849
7720h00980K454K751O288k918J225m361l478R51n244n969M358J0610K722J984
7706g89607o730L150Q42k752N673K51J178L182N446p16n072m801L720m70M471
7691g82235L02l693k820l406P65K93L04L050O703N810M65P169J755p180j0158
7676g82876P69l298q06K499M488N960J2707k853K627l414o114q439O102N293M443
7661g62912M595L138j1574m18R810n345L187K785L033Q520K150j2311n528n857
7647g66727nj111j023M228j164k119o78J1264J173m437m08J3344M988M716j675
$$ plain form
7632 -739634 -743755 -746647 -744215 -756300 -756670 -749197 -753082 -754948 -752175 -752015 -746200 -746700 -746637 -742841 -736755
7617 -736755 -737121 -739834 -739732 -738450 -729212 -718781 -716859 -724615 -738411 -739895 -741745 -733885 -732804 -734444
7603 -734444 -734447 -727683 -721800 -723163 -723860 -727468 -735438 -745163 -744506 -736035 -726148 -724688 -717798 -726748 -730432 -731692
7587 -731692 -728552 -724708 -728153 -731316 -722916 -716515 -712440 -715765 -719472 -726192 -733422 -729179 -716676 -714398
7573 -714398 -719870 -721355 -716138 -713559 -715935 -717528 -718351 -714825 -719121 -718882 -717724 -717877 -716224 -711975 -707489
7558 -707489 -707531 -711184 -703777 -706273 -704907 -708616 -712769 -715994 -714756 -714112 -719145 -725168 -728123 -720342 -707108
7543 -707108 -702050 -700373 -702494 -707566 -701973 -692842 -696560 -698502 -695821 -696408 -696404 -690403 -707565 -711863 -707558
7528 -707558 -709165 -699663 -696303 -693685 -687388 -681448 -686464 -688678 -691561 -685438 -684091 -684655 -690924 -693207 -688449
$$ packed form
7632g39634m121k892K432j2085l70P473l885j866K773J60N815n00O3L796O086
7617g36755l66k713J02J282R238J0431J922p756j3796j484j850P860J081j640
7603g34444lO764N883j363o97l608p970r725O57Q471R887J460O890q950l684j260
7587g31692L140L844l445l163Q400O401M075l325l707o720p230M243J2503K278
7573g14398n472j485N217K579k376j593q23L526m296K39J158j53J653M249M486
7558g07489m2l653P407k496J366l709m153l225J238O44n033o023k955P781J3234
7543g07108N058J677k121n072N593R131l718j942K681n87MO001j7162m298M305
7528g07558j607R502L360K618O297N940n016k214k883O123J347n64o269k283M758
$$ plain form
7513 -688449 -680992 -685887 -681683 -672763 -670251 -674443 -685723 -688777 -689492 -683396 -680886 -683957 -680500 -674423
7499 -674423 -676303 -684660 -691241 -684343 -678232 -675966 -677771 -681677 -681789 -687199 -687288 -679175 -683498 -684846 -677932
7484 -677932 -675412 -676064 -680370 -681625 -680710 -682570 -688765 -688761 -682577 -678323 -684423 -688739 -690649 -685844 -680508 -674749
7468 -674749 -676251 -677708 -677547 -674071 -660873 -662094 -663793 -671418 -674986 -668250 -668097 -661924 -658124 -656636 -656131
7453 -656131 -657993 -657311 -661478 -665173 -667553 -666453 -669179 -668348 -667596 -666599 -657801 -659009 -658211 -655269 -654154 -661230
7437 -661230 -664510 -664943 -657983 -651075 -653746 -654691 -650787 -645640 -645344 -646933 -648182 -652228 -655030 -657238 -660737
7422 -660737 -661031 -656032 -654601 -661023 -663602 -654867 -654049 -660048 -654365 -646101 -645309 -641880 -635645 -635888 -636384 -639889
7406 -639889 -648447 -659839 -651286 -655479 -661670 -652235 -636252 -625582 -635719 -643611 -643153 -638827 -645244 -644623
$$ packed form
7513f88449P457m895M204Q920K512m192j1280l054p15O096K510l071L457O077
7499f74423j880q357o581O898O111K266j805l906j12n410q9Q113m323j348O914
7484f77932K520o52m306j255R15j860o195MO184M254o100m316j910M805N336N759
7468f74749j502j457J61L476J3198j221j699p625l568O736J53O173L800J488N05
7453f56131j862O82m167l695k380J100k726Q31P52R97Q798j208P98K942J115p076
7437f61230l280m33O960O908k671r45L904N147K96j589j249m046k802k208l499
7422f60737k94M999J431o422k579Q735Q18n999N683Q264P92L429O235k43m96l505
7406f39889q558j1392Q553m193o191R435J5983J0670j0137p892M58M326o417O21
$$ plain form
7392 -644623 -633287 -627097 -630180 -641907 -646499 -638229 -632274 -633839 -639185 -640726 -640328 -648385 -652705 -643702
7378 -643702 -640723 -642635 -644535 -646325 -650650 -652693 -651344 -645633 -643086 -640597 -638448 -636186 -636405 -636237 -636426
7363 -636426 -626839 -630331 -626586 -626888 -634201 -632750 -632475 -637590 -640069 -639968 -630053 -625427 -623586 -622827 -619670
7348 -619670 -621177 -626073 -628556 -620921 -618311 -614998 -610466 -612681 -621278 -617148 -618700 -617301 -616279 -620334
7334 -620334 -621302 -619970 -614235 -616360 -613053 -612177 -614116 -610002 -603502 -610040 -613504 -617190 -617041 -617562 -607409
7319 -607409 -600944 -603203 -606617 -608463 -611506 -615267 -621029 -629252 -630079 -617016 -606622 -605052 -611116 -612080
7305 -612080 -616570 -611671 -606453 -606352 -608189 -613498 -618053 -613720 -611633 -614619 -616874 -616691 -619103 -619719 -611759
7290 -611759 -610514 -606514 -610874 -610560 -612805 -612022 -610673 -607247 -606919 -600317 -599231 -598407 -596217 -595448 -602518 -603570
$$ packed form
7392f44623J1336O190l083j1727m592Q270N955j565n346j541L98q057m320R003
7378f43702K979j912j900j790m325k043J349N711K547K489K149K262k19J68j89
7363f36426R587l492L745l02p313J451K75n115k479J01R915M626J841P59L157
7348f19670j507m896k483P635K610L313M532k215q597M130j552J399J022m055
7334f20334r68J332N735k125L307Q76j939M114O500o538l464l686J49n21J0153
7319f07409O465k259l414j846l043l761n762q223q27J3063J0394J570o064r64
7305f12080m490M899N218J01j837n309m555M333K087k986k255J83k412o16P960
7290f11759J245M000m360L14k245P83J349L426L28O602J086Q24K190P69p070j052
$$ plain form
7274 -603570 -599005 -584337 -582409 -587206 -598469 -602535 -600899 -591934 -593365 -593963 -596116 -605856 -605243 -609056
7260 -609056 -602965 -600581 -601513 -601313 -599751 -591385 -590953 -594295 -603754 -599992 -602452 -600419 -596570 -594781 -599957
7245 -599957 -598444 -592615 -590603 -604486 -606367 -597923 -588757 -585818 -587045 -584108 -581537 -583524 -584978 -573370
7231 -573370 -581256 -586710 -592778 -593833 -588849 -581737 -586166 -583435 -585263 -579246 -576861 -580274 -590490 -599208
7217 -599208 -595591 -586992 -583328 -583181 -582529 -571433 -561362 -564670 -572855 -586015 -577441 -569176 -572579 -569933
7203 -569933 -568289 -570137 -567599 -578942 -582330 -582468 -580159 -575291 -570782 -575338 -579208 -586738 -589796 -590271 -591421
7188 -591421 -582152 -579382 -578363 -565780 -562595 -558850 -568118 -580955 -577002 -573702 -572503 -574107 -568074 -557170
7174 -557170 -553699 -552731 -550855 -555237 -566263 -570218 -572177 -573859 -572081 -567542 -559096 -556665 -559065 -561802
$$ packed form
7274f03570M565J4668J928m797j1263m066J636Q965j431n98k153r740O13l813
7260f09056O091K384r32K00J562Q366M32l342r459L762k460K033L849J789n176
7245e99957J513N829K012j3883j881Q444R166K939j227K937K571j987j454J1608
7231e73370p886n454o068j055M984P112m429K731j828O017K385l413j0216q718
7217e99208L617Q599L664J47O52J1096J0071l308q185j3160Q574Q265l403K646
7203e69933J644j848K538j1343l388j38K309M868M509m556l870p530l058m75j150
7188e91421R269K770J019J2583L185L745r268j2837L953L300J199j604O033J0904
7174e57170L471R68J876m382j1026l955j959j682J778M539Q446K431k400k737
$$ plain form
7160 -561802 -561703 -567082 -575424 -571657 -559230 -556680 -559770 -558309 -561724 -560527 -562812 -574219 -583105 -576054
7146 -576054 -574487 -568703 -566992 -572824 -576343 -565800 -560176 -555513 -558366 -562470 -566592 -577384 -575115 -564010
7132 -564010 -559323 -550541 -549181 -558927 -561381 -556796 -551827 -553004 -556908 -555891 -555466 -558016 -561851 -565063 -568467
7117 -568467 -567683 -563158 -553209 -550781 -557357 -561526 -568655 -561635 -556441 -552010 -545477 -536230 -538814 -541498 -548091
7102 -548091 -544759 -547075 -554646 -567325 -565333 -558895 -556128 -557369 -551401 -550372 -550094 -549557 -551977 -550093 -549366
7087 -549366 -549166 -535129 -530413 -541366 -543822 -549085 -541815 -547999 -554197 -553662 -547256 -537204 -533452 -523377
7073 -523377 -514109 -531279 -540374 -544636 -539184 -526206 -527653 -532195 -539268 -532056 -529294 -542935 -551848 -548561
7059 -548561 -542652 -538237 -538472 -541523 -534285 -517956 -520928 -534144 -537696 -539113 -537146 -527175 -518288 -529974
$$ packed form
7160e61802R9n379q342L767J2427K550l090J461l415J197k285j1407q886P051
7146e76054J567N784J711n832l519J0543N624M663k853m104m122j0792K269J1105
7132e64010M687Q782J360r746k454M585M969j177l904J017M25k550l835l212l404
7117e68467P84M525R949K428o576m169p129P020N194M431O533R247k584k684o593
7102e48091L332k316p571j2679J992O438K767j241N968J029K78N37k420J884P27
7087e49366K00J4037M716j0953k456n263P270o184o198N35O406J0052L752J0075
7073e23377R268j7170r095m262N452J2978j447m542p073P212K762j3641q913L287
7059e48561N909M415k35l051P238J6329k972j3216l552j417J967R971Q887j1686
$$ plain form
7045 -529974 -532613 -528845 -531093 -531220 -537652 -541989 -533183 -523048 -524958 -531983 -537133 -530797 -522382 -522398 -529996
7030 -529996 -530310 -531367 -531638 -527080 -522943 -511190 -504026 -511427 -516866 -522441 -525397 -533549 -533344 -520186 -513207
7015 -513207 -505981 -499447 -509122 -520472 -521246 -519945 -517184 -523652 -539679 -549925 -543789 -532301 -529740 -531652
7001 -531652 -521757 -519877 -513555 -514635 -517360 -518340 -514572 -518676 -519444 -518845 -514488 -514471 -512298 -511109 -502422 -501124
6985 -501124 -514828 -522292 -523189 -528247 -517808 -512666 -512429 -525003 -525477 -517382 -516547 -509645 -512153 -514141 -529687
6970 -529687 -525281 -526879 -523429 -523481 -523634 -524051 -520200 -518622 -512966 -514415 -521980 -522944 -521339 -519070 -509132 -505289
6954 -505289 -503096 -512752 -516822 -516292 -522505 -525390 -519181 -512409 -503540 -504163 -504789 -501035 -504794 -508900 -510879
6939 -510879 -512219 -511765 -513940 -513228 -521057 -516262 -514006 -516154 -512272 -504679 -507782 -514252 -520136 -518962 -511070
$$ packed form
7045e29974k639L768k248j27o432m337Q806J0135j910p025n150O336Q415j6p598
7030e29996l14j057k71M558M137J1753P164p401n439n575k956q152K05J3158O979
7015e13207P226O534r675j1350p74J301K761o468j6027j0246O136J1488K561j912
7001e31652R895J880O322j080k725r80L768m104p68N99M357J7K173J189Q687J298
6985e01124j3704p464q97n058J0439N142K37j2574m74Q095Q35O902k508j988j5546
6970e29687M406j598L450n2j53m17L851J578N656j449p565r64J605K269R938L843
6954e05289K193r656m070N30o213k885O209O772Q869o23o26L754l759m106j979
6939e10879j340M54k175P12p829M795K256k148L882P593l103o470n884J174P892
$$ plain form
6924 -511070 -507248 -501494 -495916 -497064 -497162 -498243 -498330 -500204 -497261 -496657 -505771 -512554 -515659 -512253 -510854 -512322
6908 -512322 -516807 -519434 -516321 -506160 -501872 -504363 -499313 -492906 -497527 -505729 -509416 -508341 -508267 -502915 -501022
6893 -501022 -499701 -494021 -494836 -499151 -493258 -490575 -506069 -505052 -497444 -496320 -500566 -505719 -497800 -490011
6879 -490011 -488917 -490960 -498829 -499508 -503029 -494472 -482985 -482419 -479095 -486821 -496762 -496595 -501479 -490545 -486995
6864 -486995 -488775 -488844 -485376 -481782 -484186 -481331 -479177 -481816 -486129 -491117 -494134 -497667 -501272 -500964 -501305
6849 -501305 -496233 -488580 -483568 -482896 -481450 -482192 -486246 -480714 -477021 -481241 -485904 -481730 -482196 -485685 -486411
6834 -486411 -485990 -481395 -485697 -487702 -480285 -483709 -490291 -486680 -480377 -485477 -491408 -490550 -483296 -475275 -480569
6819 -480569 -484190 -492476 -494908 -489223 -483218 -477171 -485472 -482767 -478922 -482926 -492993 -489940 -479494 -475394
$$ packed form
6924e11070L822N754N578j148r8j081q7j874K943O04r114o783l105L406J399j468
6908e12322m485k627L113J0161M288k491N050O407m621q202l687J075P4N352J893
6893e01022J321N680q15m315N893K683j5494J017P608J124m246n153P919P789
6879d90011J094k043p869o79l521Q557J1487N66L324p726r941J67m884J0934L550
6864d86995j780o9L468L594k404K855K154k639m313m988l017l533l605L08l41
6849e01305N072P653N012O72J446p42m054N532L693m220m663M174m66l489p26
6834d86411M21M595m302k005P417l424o582L611O303n100n931Q58P254Q021n294
6819d80569l621q286k432N685O005O047q301K705L845m004j0067L053J0446M100
$$ plain form
6805 -475394 -481796 -483410 -483697 -491580 -491864 -495828 -489027 -477357 -466495 -465124 -461595 -457421 -473913 -484837
6791 -484837 -486950 -485224 -492055 -495784 -489278 -480880 -466497 -463353 -465679 -471228 -474304 -477976 -476816 -480087
6777 -480087 -482512 -484805 -478053 -473001 -476764 -474605 -475533 -464477 -458355 -464517 -471863 -485775 -478352 -460328
6763 -460328 -456491 -455540 -459577 -463011 -461609 -462468 -471695 -483129 -476150 -472287 -465519 -457886 -456460 -450738 -452875
6748 -452875 -461195 -467931 -466209 -471421 -474481 -474888 -483090 -481850 -476582 -470003 -465209 -465553 -464661 -461818 -468282
6733 -468282 -466039 -465684 -467226 -467918 -473475 -470145 -464039 -459605 -463912 -470693 -478991 -479268 -482253 -478904 -468049
6718 -468049 -455135 -450951 -446012 -449844 -447407 -441137 -448638 -462428 -457276 -456483 -463452 -469939 -460241 -449845
6704 -449845 -455349 -457687 -463558 -466163 -462308 -456471 -455681 -457051 -466558 -467986 -468409 -454569 -447624 -443106 -443088
$$ packed form
6805d75394o402j614k87p883k84l964O801J1670J0862J371L529M174j6492j0924
6791d84837k113J726o831l729O506Q398J4383L144k326n549l076l672J160l271
6777d80087k425k293O752N052l763K159r28J1056O122o162p346j3912P423J8024
6763d60328L837R51m037l434J402q59r227j1434O979L863O768P633J426N722k137
6748d52875q320o736J722n212l060m07q202J240N268O579M794l44Q92K843o464
6733d68282K243L55j542o92n557L330O106M434m307o781q298k77k985L349J0855
6718d68049J2914M184M939l832K437O270p501j3790N152P93o969o487R698J0396
6704d49845n504k338n871k605L855N837P90j370r507j428m23J3840O945M518J8
$$ plain form
6689 -443088 -448078 -453329 -457107 -455012 -453953 -456956 -454169 -451567 -448776 -445224 -444362 -445470 -453427 -451693 -442649
6674 -442649 -437979 -439460 -444120 -446675 -449832 -446619 -454702 -457294 -450653 -447085 -446408 -447348 -444309 -444390 -455238
6659 -455238 -465439 -463246 -458877 -449107 -445466 -445182 -448620 -447720 -446437 -451129 -447133 -440852 -450473 -447430 -439490
6644 -439490 -442960 -452715 -457117 -464774 -469160 -458376 -451670 -453489 -461050 -470997 -469081 -460731 -452597 -452329
6630 -452329 -464072 -450787 -441572 -441997 -446269 -457032 -457174 -455413 -458283 -457623 -445568 -440177 -440973 -437401
6616 -437401 -444017 -440138 -435034 -439350 -438295 -438794 -432702 -430171 -435341 -440483 -443692 -446413 -447895 -442327 -441385
6601 -441385 -438781 -436242 -438574 -435373 -429245 -429720 -433926 -435625 -435395 -435803 -427301 -439418 -437687 -437955 -445009
6586 -445009 -441514 -436984 -437511 -441341 -438962 -428560 -430094 -436524 -439048 -442106 -443279 -447660 -451421 -446428
$$ packed form
6689d43088m990n251l778K095J059l003K787K602K791L552Q62j108p957J734R044
6674d42649M670j481m660k555l157L213q083k592O641L568O77r40L039q1j0848
6659d55238j0201K193M369R770L641K84l438R00J283m692L996O281r621L043P940
6644d39490l470r755m402p657m386J0784O706j819p561r947J916Q350Q134K68
6630d52329j1743J3285R215m25m272j0763j42J761k870O60J2055N391p96L572
6616d37401o616L879N104m316J055m99O092K531n170n142l209k721j482N568R42
6601d41385K604K539k332L201O128m75m206j699K30m08Q502j2117J731k68p054
6586d45009L495M530n27l830K379J0402j534o430k524l058j173m381l761M993
$$ plain form
6572 -446428 -445869 -443242 -434813 -442388 -451397 -456449 -453843 -445313 -442413 -453406 -447291 -440628 -436777 -436629 -431662
6557 -431662 -433912 -437872 -446525 -443277 -437369 -437151 -448140 -451147 -443906 -445557 -434926 -435490 -435378 -423674
6543 -423674 -422224 -434012 -434778 -428767 -431117 -430458 -424425 -420252 -425633 -429545 -431379 -443928 -443853 -440996 -439618
6528 -439618 -441354 -439330 -438511 -436289 -430628 -425145 -429628 -427093 -427536 -430130 -431310 -432349 -434629 -428911 -430207
6513 -430207 -424822 -418239 -420490 -419870 -421984 -418136 -414858 -419703 -423078 -426542 -425291 -426279 -431638 -438417 -440747
6498 -440747 -436982 -429918 -413329 -400852 -410215 -416960 -415521 -419299 -419928 -414615 -414418 -419673 -419634 -419967 -413959
6483 -413959 -416240 -421346 -426466 -424783 -415402 -405602 -401246 -397207 -398772 -407842 -411980 -406563 -409306 -399914
6469 -399914 -399035 -409534 -418493 -423665 -420578 -423923 -420263 -426450 -423423 -409714 -408043 -412891 -427166 -427415
$$ packed form
6572d46428N59K627Q429p575r009n052K606Q530K900j0993O115O663L851J48M967
6557d31662k250l960q653L248N908K18j0989l007P241j651J0631n64J12J1704
6543d23674J450j1788p66O011k350O59O033M173n381l912j834j2549P5K857J378
6528d39618j736K024Q19K222N661N483m483K535m43k594j180j039k280N718j296
6513d30207N385O583k251O20k114L848L278m845l375l464J251r88n359o779k330
6498d40747L765P064J6589J2477r363o745J439l778o29N313J97n255L9l33O008
6483d13959k281n106n120J683R381R800M356M039j565r070m138N417k743R392
6469c99914Q79j0499q959n172L087l345L660o187L027J3709J671m848j4275k49
$$ plain form
6455 -427415 -430141 -429015 -418438 -410111 -413872 -418684 -423375 -413680 -394105 -390717 -404552 -414455 -411158 -403743
6441 -403743 -410000 -422431 -423679 -417151 -413686 -411074 -406655 -405390 -417850 -427325 -420729 -410352 -409918 -408522
6427 -408522 -410313 -412282 -412984 -413092 -407500 -396691 -402880 -407169 -411750 -417273 -425537 -431253 -424610 -410759
6413 -410759 -407499 -412038 -407329 -404427 -407359 -417817 -417293 -413932 -406124 -399997 -405306 -402796 -399428 -406124
6399 -406124 -410303 -406551 -410053 -412481 -416126 -418968 -424932 -421818 -410790 -399195 -398337 -395646 -392436 -399363
6385 -399363 -400747 -400611 -402477 -404975 -404992 -401107 -399850 -403193 -408593 -417155 -419427 -410086 -407514 -411454 -422744
6370 -422744 -422666 -413176 -402549 -389512 -387986 -394010 -403860 -408284 -401809 -400698 -396541 -389206 -392020 -399618
6356 -399618 -406806 -400417 -390223 -382817 -385186 -384378 -384840 -389301 -393715 -390995 -393203 -402485 -400972 -399654 -390275
$$ packed form
6455d27415k726J126J0577Q327l761m812m691R695J9575L388j3835r903L297P415
6441d03743o257j2431j248O528L465K612M419J265j2460r475O596J0377M34J396
6427d08522j791j969p02j08N592J0809o189m289m581n523q264n716O643J3851
6413d10759L260m539M709K902k932j0458N24L361P808O127n309K510L368o696
6399d06124m179L752l502k428l645k842n964L114J1028J1595Q58K691L210o927
6385c99363j384J36j866k498j7L885J257l343n400q562k272R341K572l940j1290
6370d22744P8R490J0627J3037J526o024r850m424O475J111M157P335k814p598
6356c99618p188O389J0194P406k369Q08m62m461m414K720k208r282J513J318R379
$$ plain form
6341 -390275 -384414 -390003 -398511 -404580 -403921 -406987 -414307 -412206 -406348 -404563 -414089 -415048 -415337 -412617 -402660
6326 -402660 -400686 -392145 -380190 -386706 -399729 -403042 -402326 -401054 -403964 -403853 -397635 -394726 -389958 -392815
6312 -392815 -387606 -391238 -399848 -402265 -404729 -413266 -411009 -404082 -404156 -401143 -403071 -408688 -394065 -388107 -398400
6297 -398400 -404095 -404319 -407979 -403725 -399949 -400151 -403252 -400848 -399939 -406990 -407057 -403583 -402238 -405269 -407695 -402647
6281 -402647 -398925 -394392 -392203 -387848 -386324 -396008 -399816 -399635 -397616 -401536 -397425 -396987 -394276 -388342 -381584
6266 -381584 -380719 -382462 -378946 -378718 -381655 -390109 -382688 -382171 -379434 -378513 -383337 -391299 -398459 -396342 -387853
6251 -387853 -378101 -379660 -385110 -396415 -401796 -396284 -398984 -400073 -397659 -396589 -394867 -389912 -383461 -380469
6237 -380469 -387775 -386095 -381070 -382887 -387255 -390844 -390320 -386063 -377311 -374397 -380969 -381958 -386709 -376126 -372660
$$ packed form
6341c90275N861n589q508o069O59l066p320K101N858J785r526r59k89K720R957
6326d02660J974Q541J1955o516j3023l313P16J272k910J11O218K909M768k857
6312c92815N209l632q610k417k464q537K257O927p4L013j928n617J4623N958j0293
6297c98400n695k24l660M254L776k02l101K404R09p051o7L474J345l031k426N048
6281d02647L722M533K189M355J524r684l808J81K019l920M111M38K711N934O758
6266c81584Q65j743L516K28k937q454P421N17K737R21m824p962p160K117Q489
6251c87853R752j559n450j1305n381N512k700j089K414J070J722M955O451K992
6237c80469p306J680N025j817m368l589N24M257Q752K914o572r89m751J0583L466
$$ plain form
6222 -372660 -381545 -383599 -381714 -386520 -390471 -387611 -386392 -384406 -392187 -388633 -394254 -393272 -386801 -389591 -383358
6207 -383358 -374749 -373267 -371563 -375073 -376780 -379981 -380644 -381011 -380595 -380397 -377534 -376741 -379079 -374363 -378680 -381254
6191 -381254 -373586 -373473 -380360 -378649 -373615 -374411 -367561 -376882 -384927 -388696 -388947 -388625 -391445 -396044 -390694
6176 -390694 -380064 -372340 -366814 -375050 -378327 -372322 -368832 -371758 -375973 -377806 -380909 -380251 -377760 -371727
6162 -371727 -380081 -392734 -380311 -368059 -360573 -358424 -364146 -365539 -363384 -362408 -361982 -360182 -358140 -359071
6148 -359071 -368164 -382555 -392995 -386038 -381009 -379149 -378880 -382884 -386944 -394527 -393586 -386377 -378255 -375401
6134 -375401 -375247 -374329 -370382 -365201 -370554 -377277 -379902 -379501 -372148 -380414 -391067 -395688 -402836 -396615 -385139
6119 -385139 -383441 -391628 -387413 -384885 -385555 -383428 -382671 -385008 -386152 -384226 -380669 -365146 -365166 -378053 -374153
$$ packed form
6222c72660q885k054J885m806l951K860J219J986p781L554n621R82O471k790O233
6207c83358Q609J482J704l510j707l201o63l67M16J98K863P93k338M716m317k574
6191c81254P668J13o887J711N034p96O850r321q045l769k51L22k820m599N350
6176c90694J0630P724N526q236l277O005L490k926m215j833l103O58K491O033
6162c71727q354j2653J2423J2252P486K149n722j393K155R76M26J800K042r31
6148c59071r093j4391j0440O957N029J860K69m004m060p583R41P209Q122K854
6134c75401J54R18L947N181n353o723k625M01P353q266j0653m621p148O221J1476
6119c85139J698q187M215K528o70K127P57k337j144J926L557J5523k0j2887L900
$$ plain form
6104 -374153 -365223 -364087 -364551 -371122 -374529 -376404 -381335 -379861 -367842 -364276 -364937 -363934 -375455 -375394 -388549
6089 -388549 -383287 -376191 -367689 -359904 -367882 -374305 -366691 -364956 -363745 -364869 -366086 -367546 -364923 -366060
6075 -366060 -371192 -375123 -365726 -360444 -359295 -372095 -372357 -367442 -360282 -365025 -370495 -371435 -372307 -367340 -354660
6060 -354660 -357777 -360635 -362600 -372367 -375072 -375902 -362168 -354263 -367608 -370214 -372843 -373684 -370396 -369105
6046 -369105 -366452 -361626 -361162 -362978 -359244 -351310 -349319 -353353 -355102 -365307 -368972 -362274 -353746 -357338
6032 -357338 -356554 -350248 -351213 -354149 -358518 -357581 -354968 -354799 -357299 -360190 -357809 -356190 -356952 -356468 -363725 -360171
6016 -360171 -359244 -356924 -356809 -358973 -357187 -365029 -368635 -363265 -361782 -356605 -347463 -342238 -346352 -349273 -347686
6001 -347686 -350874 -347286 -348034 -357023 -362931 -365075 -363521 -359831 -357215 -352250 -342023 -331725 -332778 -338204
$$ packed form
6104c74153Q930J136m64o571l407j875m931J474J2019L566o61J003j1521O1j3155
6089c88549N262P096Q502P785p978o423P614J735J211j124j217j460K623j137
6075c66060n132l931R397N282J149j2800k62M915P160m743n470r40q72M967J2680
6060c54660l117k858j965r767k705q30J3734P905j3345k606k629q41L288J291
6046c69105K653M826M64j816L734P934J991m034j749j0205l665O698Q528l592
6032c57338P84O306r65k936m369R37K613J69k500k891K381J619p62M84p257L554
6016c60171R27K320J15k164J786p842l606N370J483N177R142N225m114k921J587
6001c47686l188L588p48q989n908k144J554L690K616M965J0227J0298j053n426
$$ plain form
5987 -338204 -343541 -344943 -351262 -355030 -357650 -356215 -355990 -361130 -359719 -351982 -358191 -363324 -362403 -358343 -356191
5972 -356191 -354733 -351321 -350580 -347541 -350908 -356635 -360370 -362422 -371828 -365998 -361966 -357675 -359319 -360496 -348533
5957 -348533 -352127 -352510 -350254 -345144 -345282 -348162 -354993 -357266 -362886 -364989 -362951 -358604 -367256 -369383 -366870
5942 -366870 -366064 -361157 -356111 -347994 -342831 -340648 -346140 -348158 -356543 -361786 -358946 -357491 -357542 -357621 -345254
5927 -345254 -332435 -335211 -336597 -344323 -342340 -343359 -350486 -353352 -345156 -345605 -347916 -355210 -360081 -350302
5913 -350302 -351526 -340884 -343620 -350927 -351081 -358537 -355705 -352447 -352175 -355068 -363992 -359667 -353104 -352153 -348712
5898 -348712 -351890 -358029 -348022 -341528 -346780 -351965 -360138 -359674 -357534 -351228 -351832 -353575 -350614 -340373
5884 -340373 -332268 -337609 -352477 -355312 -353535 -350952 -351080 -356843 -363049 -363780 -356538 -352080 -346757 -346169 -346995
$$ packed form
5987c38204n337j402o319l768k620J435K25n140J411P737o209n133R21M060K152
5972c56191J458L412P41L039l367n727l735k052r406N830M032M291j644j177J1963
5957c48533l594l83K256N110j38k880o831k273n620k103K038M347q652k127K513
5942c66870Q06M907N046Q117N163K183n492k018q385n243K840J455n1p9J2367
5927c45254J2819k776j386p726J983j019p127k866Q196m49k311p294m871R779
5913c50302j224J0642k736p307j54p456K832L258K72k893q924M325O563R51L441
5898c48712l178o139J0007O494n252n185q173M64K140O306o04j743K961J0241
5884c40373Q105n341j4868k835J777K583j28n763o206p31P242M458N323N88q26
$$ plain form
5869 -346995 -346013 -356631 -359651 -358133 -350154 -341397 -349907 -348726 -339232 -333254 -335133 -345361 -345280 -348697 -355154
5854 -355154 -352622 -342618 -337822 -339970 -341151 -337796 -336681 -344243 -355715 -351596 -349552 -346573 -334230 -338694
5840 -338694 -345032 -351242 -346374 -346347 -347456 -348427 -350680 -353098 -354502 -352860 -347824 -349244 -355664 -358074 -356114
5825 -356114 -367226 -364122 -355626 -342310 -335014 -335767 -338858 -331901 -320716 -322276 -325136 -327383 -328519 -333529
5811 -333529 -336977 -331697 -323496 -326506 -334690 -340627 -341022 -340969 -338547 -334968 -339075 -338815 -333499 -335717 -345361
5796 -345361 -353353 -345453 -340171 -339524 -337297 -330905 -328209 -321083 -331585 -335708 -334889 -327982 -324940 -331172 -333933
5781 -333933 -339285 -338947 -337124 -334415 -335227 -344131 -347097 -343201 -339396 -334401 -333170 -342159 -346449 -342475 -342301
5766 -342301 -341772 -331290 -330346 -330908 -333555 -337006 -333650 -334173 -336982 -342676 -340012 -335215 -335092 -328329 -329189 -327883
$$ packed form
5869c46995R82j0618l020J518P979Q757q510J181R494N978j879j0228Q1l417o457
5854c55154K532J0004M796k148j181L355J115p562j1472M119K044K979J2343m464
5840c38694o338o210M868K7j109r71k253k418j404J642N036j420o420k410J960
5825c56114j1112L104Q496J3316P296p53l091O957J1185j560k860k247j136n010
5811c33529l448N280Q201l010q184n937l95N3K422L579m107K60N316k218r644
5796c45361p992P900N282O47K227O392K696P126j0502m123Q19O907L042o232k761
5781c33933n352L38J823K709q12q904k966L896L805M995J231q989m290L974J74
5766c42301N29J0482R44n62k647l451L356n23k809n694K664M797J23O763q60J306
$$ plain form
5750 -327883 -329447 -333901 -338017 -330173 -324660 -322624 -329543 -336597 -342756 -338228 -333835 -333666 -330205 -321539 -317032
5735 -317032 -313659 -316412 -324598 -324142 -329550 -331000 -330827 -318894 -320125 -317710 -321985 -322388 -324836 -328935 -327223
5720 -327223 -335943 -334325 -324130 -323137 -327830 -334617 -335473 -331061 -328880 -329760 -324793 -319232 -324635 -334669 -331943
5705 -331943 -326286 -331586 -333892 -328355 -325432 -326624 -322740 -321204 -326773 -334689 -327432 -336279 -334499 -331762
5691 -331762 -338902 -346239 -343513 -340507 -331680 -332707 -332433 -325159 -329770 -335984 -334453 -332826 -333457 -326877 -323246
5676 -323246 -326983 -321192 -321936 -325163 -322336 -323011 -328567 -329893 -333753 -332505 -332282 -327282 -323708 -326548 -333689
5661 -333689 -339632 -339785 -339013 -334281 -337406 -336630 -335339 -338143 -334716 -320312 -315620 -322348 -327763 -330895 -333789
5646 -333789 -334944 -332195 -333144 -340204 -331158 -330823 -334901 -328321 -320407 -315684 -317416 -315319 -316370 -316739 -318090
$$ packed form
5750c27883j564m454m116P844N513K036o919p054o159M528M393J69L461Q666M507
5735c17032L373k753q186M56n408j450J73J1933j231K415m275m03k448m099J712
5720c27223q720J618J0195R93m693o787q56M412K181q80M967N561n403j0034K726
5705c31943N657n300k306N537K923j192L884J536n569p916P257q847J780K737
5691c31762p140p337K726L006Q827j027K74P274m611o214J531J627o31O580L631
5676c23246l737N791p44l227K827o75n556j326l860J248K23N000L574k840p141
5661c33689n943j53P72M732l125P76J291k804L427J4404M692o728n415l132k894
5646c33789j155K749r49p060R046L35m078O580P914M723j732K097j051l69j351
$$ plain form
5631 -318090 -317529 -319832 -323313 -319799 -323471 -321726 -320525 -312738 -305381 -308818 -315794 -316919 -312448 -319418 -326631
5616 -326631 -329819 -324498 -321008 -320811 -324236 -332159 -331895 -330583 -328407 -324695 -322927 -312337 -305665 -306581 -310897
5601 -310897 -312892 -318096 -315888 -315205 -319912 -324112 -324170 -324457 -319316 -311299 -313716 -321562 -324172 -322895 -317950
5586 -317950 -319334 -315322 -311477 -312683 -317977 -328562 -321868 -314263 -317601 -313695 -307315 -302891 -304850 -314821
5572 -314821 -333663 -345121 -344508 -340570 -335248 -327107 -319732 -321223 -327655 -321398 -308047 -314033 -324395 -318824
5558 -318824 -315803 -317710 -312600 -316375 -312499 -314433 -318555 -320073 -318316 -315111 -316014 -326036 -330217 -328290
5544 -328290 -323275 -318818 -321431 -329171 -328535 -322622 -318799 -313972 -309330 -312960 -308068 -308072 -311438 -317561 -309144
5529 -309144 -304015 -310717 -322733 -323150 -324291 -319784 -318901 -325686 -328658 -319492 -307192 -309067 -311731 -322298
$$ packed form
5631c18090N61k303l481L514l672J745J201P787P357l437o976j125M471o970p213
5616c26631l188N321L490J97l425p923K64J312K176L712J768J0590O672r16m316
5601c10897j995n204K208O83m707m200n8k87N141Q017k417p846k610J277M945
5586c17950j384M012L845j206n294j0585O694P605l338L906O380M424j959r971
5572c14821j8842j1458O13L938N322Q141P375j491o432O257J3351n986j0362N571
5558c18824L021j907N110l775L876j934m122j518J757L205r03j0022m181J927
5544c28290N015M457k613p740O36N913L823M827M642l630M892ml366o123Q417
5529c09144N129o702j2016m17j141M507Q83o785k972R166J2300j875k664j0567
$$ plain form
5515 -322298 -331069 -323344 -315505 -318022 -325622 -329903 -322852 -309385 -311869 -314056 -314540 -316930 -318085 -316343
5501 -316343 -314501 -318174 -312969 -317497 -317774 -313034 -315811 -320580 -322078 -324307 -318502 -313759 -314334 -319175 -322694
5486 -322694 -314988 -312519 -314843 -312724 -310078 -315037 -319636 -316464 -316296 -311768 -311959 -305640 -308840 -307305 -307976
5471 -307976 -313788 -316109 -314322 -311464 -309389 -304990 -310650 -311048 -299608 -298937 -297175 -306521 -309798 -306573 -307977
5456 -307977 -305434 -309966 -311877 -311141 -309612 -314103 -317668 -309480 -304771 -304762 -306074 -306682 -309525 -309597 -304452 -309979
5440 -309979 -310584 -306986 -303337 -299062 -296085 -313601 -324203 -319753 -317288 -314107 -316028 -312965 -315676 -312591
5426 -312591 -305701 -304870 -306083 -304690 -307049 -305376 -300742 -298186 -301670 -299821 -302149 -307093 -311786 -314550 -312335
5411 -312335 -313726 -316725 -317537 -315234 -324825 -329142 -322676 -315561 -321264 -323429 -312961 -303970 -304862 -306772 -311585
$$ packed form
5515c22298q771P725P839k517p600m281P051J3467k484k187m84k390j155J742
5501c16343J842l673N205m528k77M740k777m769j498k229N805M743n75m841l519
5486c22694P706K469k324K119K646m959m599L172J68M528j91O319l200J535o71
5471c07976n812k321J787K858K075M399n660l98J1440O71J762r346l277L225j404
5456c07977K543m532j911P36J529m491l565Q188M709Rj312o08k843p2N145n527
5440c09979o05L598L649M275K977j7516j0602M450K465L181j921L063k711L085
5426c12591O890Q31j213J393k359J673M634K556l484J849k328m944m693k764K215
5411c12335j391k999q12K303r591m317O466P115n703k165J0468Q991q92j910m813
$$ plain form
5396 -311585 -307693 -299418 -299248 -293246 -298770 -305092 -309731 -302202 -300475 -298152 -299068 -299999 -296399 -301327 -293623
5381 -293623 -294336 -301502 -299955 -304419 -306409 -303734 -302287 -307293 -311532 -304675 -293909 -288746 -294261 -302309
5367 -302309 -297120 -294119 -288139 -292370 -300566 -292120 -283466 -292870 -300895 -305782 -301825 -300026 -308571 -311987
5353 -311987 -312465 -303873 -305611 -306349 -309882 -320682 -323098 -317089 -309599 -305500 -313346 -309241 -302666 -306343 -315002
5338 -315002 -311892 -302620 -303270 -312838 -313674 -316745 -312489 -306937 -308420 -302136 -290251 -294293 -304464 -303900 -293854
5323 -293854 -286677 -288336 -296627 -298382 -299478 -309563 -309542 -304379 -295590 -300741 -300406 -294715 -288887 -286821 -285124
5308 -285124 -290390 -289876 -293880 -293554 -288852 -292153 -294453 -294125 -295033 -294643 -290159 -291981 -298988 -303791 -299966 -300244
5292 -300244 -304360 -304562 -303459 -305125 -294705 -295336 -292232 -288877 -295767 -298482 -297680 -292415 -287927 -289627 -292797
$$ packed form
5396c11585L892Q275J70O002n524o322m639P529J727K323r16r31L600m928P704
5381b93623p13p166J547m464j990K675J447n006m239O857J0766N163n515q048
5367c02309N189L001N980m231q196Q446Q654r404q025m887L957J799q545l416
5353c11987m78Q592j738p38l533j0800k416O009P490M099p846M105O575l677q659
5338c15002L110R272o50r568q36l071M256N552j483O284J1885m042j0171N64J0046
5323b93854P177j659q291j755j096j0085K1N163Q789n151L35N691N828K066J697
5308b85124n266N14m004L26M702l301k300L28r08L90M484j822p007m803L825k78
5292c00244m116k02J103j666J0420o31L104L355o890k715Q02N265M488j700l170
$$ plain form
5277 -292797 -288417 -289402 -298627 -301901 -293588 -296607 -290882 -283807 -286039 -288690 -298542 -305506 -302343 -299159 -289469
5262 -289469 -283618 -288757 -293591 -287456 -279815 -284618 -278331 -274825 -282575 -283171 -284914 -294871 -305269 -305341 -296645
5247 -296645 -295852 -300656 -299072 -304003 -304198 -293760 -291340 -288039 -289266 -293581 -291162 -289208 -287122 -283683 -287987
5232 -287987 -295855 -294711 -292605 -291827 -294450 -289753 -286933 -286226 -292904 -300122 -303040 -296108 -297886 -294893 -291512
5217 -291512 -286194 -287569 -289201 -291741 -294222 -291352 -291931 -293061 -291521 -287923 -292383 -299868 -302518 -294115 -293597
5202 -293597 -290575 -281451 -282247 -282518 -281867 -288397 -287241 -283062 -283761 -277455 -284513 -290051 -285684 -285528 -292727 -291021
5186 -291021 -295858 -296125 -290611 -283679 -280378 -273310 -271683 -277128 -278804 -278046 -280549 -283312 -281077 -281540 -290647
5171 -290647 -295379 -297658 -291958 -290993 -305475 -303225 -301395 -299871 -299459 -301789 -310266 -310513 -295929 -288931 -284215
$$ packed form
5277b92797M380r85r225l274Q313l019N725P075k232k651r852o964L163L184R690
5262b89469N851n139m834O135P641m803O287L506p750n96j743r957j0398p2Q696
5247b96645P93m804J584m931j95J0438K420L301j227m315K419J954K086L439m304
5232b87987p868J144K106P78k623M697K820P07o678p218k918O932j778K993L381
5217b91512N318j375j632k540k481K870n79j130J540L598m460p485k650Q403N18
5202b93597L022R124p96k71O51o530J156M179o99O306p058n538M367J56p199J706
5186b91021m837k67N514O932L301P068J627n445j676P58k503k763K235m63r107
5171b90647m732k279N700R65j4482K250J830J524M12k330q477k47J4584O998M716
$$ plain form
5156 -284215 -285610 -288143 -287295 -288611 -284429 -282790 -281716 -284873 -291176 -292210 -288802 -281644 -275360 -276115 -284675
5141 -284675 -284284 -282399 -282182 -275732 -273211 -277158 -284130 -289832 -292315 -284831 -288853 -284968 -280398 -283971 -283584
5126 -283584 -278761 -273563 -274379 -277305 -278934 -280907 -284497 -285408 -282622 -286181 -281900 -276487 -278771 -277497 -274155
5111 -274155 -278164 -283016 -283133 -280333 -279222 -275652 -268830 -273647 -271549 -275839 -286368 -286687 -291247 -294948 -292026
5096 -292026 -292597 -285447 -270751 -272651 -292046 -303457 -298668 -293160 -283372 -282695 -293457 -293983 -287328 -283520
5082 -283520 -286648 -292799 -299643 -288324 -282242 -280489 -271938 -268895 -280495 -286119 -283412 -282487 -286327 -285266
5068 -285266 -288692 -294829 -293684 -297876 -304265 -301072 -285607 -281621 -278449 -278842 -280858 -278287 -278149 -280747 -284336
5053 -284336 -281202 -282720 -277321 -275392 -267228 -267239 -275525 -280104 -289399 -290207 -289717 -290179 -285247 -275636 -268726 -270982
$$ packed form
5156b84215j395k533Q48j316M182J639J074l157o303j034L408P158O284p55q560
5141b84675L91J885K17O450K521l947o972n702k483P484m022L885M570l573L87
5126b83584M823N198q16k926j629j973l590r11K786l559M281N413k284J274L342
5111b74155m009m852j17K800J111L570O822m817K098m290j0529l19m560l701K922
5096b92026n71P150J4696j900j9395j1411M789N508R788O77j0762n26O655L808
5082b83520l128o151o844J1319O082J753Q551L043j1600n624K707R25l840J061
5068b85266l426o137J145m192o389L193J5465L986L172l93k016K571J38k598l589
5053b84336L134j518N399J929Q164j1q286m579r295q08M90m62M932R611O910k256
$$ plain form
5037 -270982 -273715 -274795 -278491 -284114 -288422 -286638 -276712 -276041 -277596 -277409 -281295 -290810 -295089 -294478 -286751
5022 -286751 -283459 -287955 -283508 -277966 -276018 -279094 -274944 -270903 -271211 -277174 -275820 -283487 -284777 -278076 -281474
5007 -281474 -283143 -278253 -281366 -281795 -292781 -301602 -292728 -282448 -283214 -287617 -281055 -276691 -271925 -275385
4993 -275385 -275280 -276904 -282113 -289926 -284967 -280639 -279677 -284048 -279914 -275156 -272331 -263664 -263625 -270553 -273942
4978 -273942 -272070 -267217 -262895 -268054 -273693 -269305 -265203 -268140 -271660 -278804 -282111 -274579 -270924 -272908
4964 -272908 -269052 -270790 -274757 -279443 -279460 -276964 -284558 -280651 -285430 -288871 -287098 -286903 -281783 -266960 -262082
4949 -262082 -264726 -263750 -274297 -279782 -281058 -279480 -278944 -283912 -282735 -283282 -282209 -279108 -275090 -279320 -283904
4934 -283904 -283467 -283399 -280228 -276871 -265391 -269001 -279388 -284773 -282416 -281057 -283440 -282842 -277682 -266202 -260022
$$ packed form
5037b70982k733j080l696n623m308J784R926O71j555J87l886r515m279O11P727
5022b86751L292m496M447N542J948l076M150M041l08n963J354p667j290O701l398
5007b81474j669M890l113m29j0986q821Q874J0280p66m403O562M364M766l460
4993b75385J05j624n209p813M959M328R62m371M134M758K825Q667L9o928l389
4978b73942J872M853M322n159n639M388M102k937l520p144l307P532L655j984
4964b72908L856j738l967m686j7K496p594L907m779l441J773J95N120J4823M878
4949b62082k644R76j0547n485j276J578N36m968J177n47J073L101M018m230m584
4934b83904M37O8L171L357J1480l610j0387n385K357J359k383N98N160J1480O180
$$ plain form
4919 -260022 -266721 -259338 -262501 -263022 -268056 -278732 -278048 -272197 -278052 -278626 -278175 -274021 -277738 -276731 -277476
4904 -277476 -286060 -273348 -261426 -283079 -290451 -282131 -270826 -268323 -262595 -265364 -266588 -259371 -261847
4891 -261847 -264493 -268148 -271981 -274546 -275709 -280166 -281780 -273647 -265656 -270733 -266488 -270260 -272021 -274958
4877 -274958 -269300 -265590 -256935 -262968 -271294 -279311 -277802 -271950 -269126 -268505 -263813 -265276 -265553 -263450 -269673
4862 -269673 -271307 -271604 -278517 -276761 -267447 -262073 -267974 -262292 -265378 -269065 -270528 -276276 -275242 -274132 -278769
4847 -278769 -280599 -279470 -274570 -271408 -274833 -275068 -277904 -273971 -269512 -261631 -261374 -268373 -273370 -273891 -269336
4832 -269336 -273367 -270263 -267237 -270787 -271662 -264451 -256928 -264768 -265247 -254011 -251625 -264832 -270579 -271758
4818 -271758 -278903 -275221 -270825 -265267 -265359 -266817 -269627 -266570 -259320 -255084 -258860 -259836 -249431 -244416 -248466
$$ packed form
4919b60022o699P383l163n21n034j0676O84N851n855n74M51M154l717J007p45
4904b77476q584J2712J1922k1653p372Q320J1305K503N728k769j224P217k476
4891b61847k646l655l833k565j163m457j614Q133P991n077M245l772j761k937
4877b74958N658L710Q655o033q326q017J509N852K824O21M692j463k77K103o223
4862b69673j634k97o913J756R314N374n901N682l086l687j463n748J034J110m637
4847b78769j830J129M900L162l425k35k836L933M459P881K57o999m997n21M555
4832b69336m031L104L026l550q75P211P523p840m79J1236K386j3207n747j179
4818b71758p145L682M396N558r2j458k810L057P250M236l776r76J0405N015m050
$$ plain form
4803 -248466 -254502 -260947 -266731 -263932 -261080 -264061 -267054 -267730 -270730 -264471 -257974 -257363 -265853 -275624 -279029
4788 -279029 -274975 -266598 -257807 -254543 -251649 -260909 -265393 -266146 -276989 -272598 -263302 -260305 -270826 -271586
4774 -271586 -261870 -258887 -251277 -248537 -249545 -244871 -247717 -254248 -273334 -285014 -273684 -270655 -264091 -259181
4760 -259181 -265034 -265343 -262471 -258135 -251247 -249883 -247536 -241702 -247880 -257388 -265005 -257622 -254208 -252987 -259050
4745 -259050 -259162 -259706 -260562 -265177 -260291 -262889 -264336 -259339 -252342 -250915 -259371 -262936 -257922 -252371 -255851
4730 -255851 -263401 -265400 -270826 -272370 -269539 -274278 -264811 -256301 -260907 -258434 -256991 -257509 -253190 -254751 -260765
4715 -260765 -259016 -247979 -255492 -263441 -269235 -270399 -268555 -257856 -253006 -258279 -264387 -264966 -265996 -255776
4701 -255776 -269730 -273146 -264791 -269088 -269453 -266080 -257800 -257921 -273298 -273782 -267884 -270329 -273627 -271578 -264209
$$ packed form
4803b48466o036o445n784K799K852k981k993o76l000O259O497O11q490r771l405
4788b79029M054Q377Q791L264K894r260m484p53j0843M391R296K997j0521p60
4774b71586R716K983P610K740j008M674k846o531j9086j1680J1330L029O564M910
4760b59181n853l09K872M336O888J364K347N834o178r508p617P383L414J221o063
4745b59050j12n44q56m615M886k598j447M997O997J427q456l565N014N551l480
4730b55851p550j999n426j544K831m739R467Q510m606K473J443n18M319j561o014
4715b60765J749J1037p513p949n794j164J844J0699M850n273o108n79j030J0220
4701b55776j3954l416Q355m297l65L373Q280j21j5377m84N898k445l298K049P369
$$ plain form
4686 -264209 -254459 -256806 -261294 -259594 -262542 -263950 -270054 -272006 -265109 -258719 -257725 -258864 -263309 -251678
4672 -251678 -249350 -248833 -246673 -247477 -248684 -246960 -254016 -260996 -259046 -252954 -253251 -258905 -257478 -257692 -250177
4657 -250177 -253336 -258192 -258904 -263538 -271402 -260612 -262724 -269825 -267798 -262702 -258751 -259742 -260398 -263182 -258517
4642 -258517 -248916 -241756 -245601 -244780 -253035 -260762 -262520 -265012 -259086 -259600 -264044 -250722 -248684 -249049 -244706
4627 -244706 -245687 -251544 -254480 -255872 -255144 -255182 -250477 -251171 -256881 -251331 -258642 -261546 -262484 -268597 -271165 -265917
4611 -265917 -255477 -248975 -251109 -247953 -244401 -241253 -242704 -252917 -257987 -261672 -256581 -247359 -243593 -247196
4597 -247196 -245437 -246570 -245189 -246035 -248276 -247815 -243170 -244296 -249284 -249805 -243764 -240778 -241194 -240315 -242803 -253024
4581 -253024 -254133 -247849 -246641 -251262 -253013 -258473 -257161 -255689 -253743 -248755 -249745 -245711 -239345 -238616 -243369
$$ packed form
4686b64209R750k347m488J700k948j408o104j952O897O390R94j139m445J1631
4672b51678K328N17K160q04j207J724p056o980J950O092k97n654J427k14P515
4657b50177l159m856p12m634p864J0790k112p101K027N096L951r91o56k784M665
4642b58517R601P160l845Q21q255p727j758k492N926n14m444J3322K038l65M343
4627b44706r81n857k936j392P28l8M705o94n710N550p311k904r38o113k568N248
4611b65917J0440O502k134L156L552L148j451j0213n070l685N091R222L766l603
4597b47196J759j133J381q46k241M61M645j126m988n21O041K986m16Q79k488j0221
4581b53024j109O284J208m621j751n460J312J472J946M988r90M034O366P29m753
$$ plain form
4566 -243369 -246999 -245586 -242691 -247921 -249681 -244029 -241676 -246926 -254371 -255375 -260639 -255907 -258288 -261063
4552 -261063 -259003 -248982 -236331 -235423 -240283 -246405 -247127 -239978 -240972 -245804 -248823 -255465 -264323 -261043 -254931
4537 -254931 -244696 -240595 -244402 -257871 -264406 -256514 -245926 -251839 -248538 -250899 -253167 -257981 -259883 -246483
4523 -246483 -235323 -236211 -243258 -247676 -248631 -258466 -257759 -252949 -244539 -246254 -246279 -247931 -249112 -246981 -244795
4508 -244795 -242155 -240519 -238090 -244076 -247533 -244899 -249468 -262244 -261966 -256181 -249887 -240110 -238865 -244523
4494 -244523 -242522 -238319 -236841 -239523 -243270 -247363 -249722 -255967 -259314 -256961 -253135 -250216 -249634 -254989 -254408
4479 -254408 -256050 -252634 -255121 -255305 -255733 -261568 -259409 -255059 -251322 -243239 -240989 -244033 -241136 -247660 -251244
4464 -251244 -262621 -262044 -263596 -267648 -264214 -251301 -246209 -256764 -259866 -252201 -243315 -247751 -248767 -241394
$$ packed form
4566b43369l630J413K895n230j760N652K353n250p445j004n264M732k381k775
4552b61063K060J0021J2651R08m860o122p22P149r94m832l019o642q858L280O112
4537b54931J0235M101l807j3469o535P892J0588n913L301k361k268m814j902J3400
4523b46483J1160q88p047m418r55r835P07M810Q410j715k5j652j181K131K186
4508b44795K640J636K429n986l457K634m569j2776K78N785O294R777J245n658
4494b44523K001M203J478k682l747m093k359o245l347K353L826K919N82n355N81
4479b54408j642L416k487j84m28n835K159M350L737Q083K250l044K897o524l584
4464b51244j1377N77j552m052L434J2913N092j0555l102P665Q886m436j016P373
$$ plain form
4450 -241394 -250913 -253307 -249606 -243481 -239695 -247498 -254190 -255284 -247979 -240116 -237697 -240630 -236346 -235349 -250083
4435 -250083 -261993 -253925 -243873 -249321 -261058 -265709 -261631 -257056 -258345 -253320 -250251 -247826 -247567 -245258
4421 -245258 -244789 -239816 -239312 -239239 -241301 -248801 -245147 -245334 -243181 -244972 -249820 -250688 -253691 -248862 -249925 -250951
4405 -250951 -248241 -242158 -242686 -247764 -240834 -238668 -234058 -234013 -246217 -245861 -247054 -248601 -241870 -239197 -240688
4390 -240688 -241845 -235169 -230837 -230620 -232877 -241411 -248438 -253941 -247843 -243899 -249607 -242687 -241187 -237340 -232434
4375 -232434 -229012 -233487 -235910 -237211 -250606 -252738 -251196 -245771 -251057 -252499 -245551 -239526 -231902 -234220
4361 -234220 -235911 -229828 -231003 -234307 -230161 -239618 -239656 -236062 -248288 -254719 -254492 -259109 -260309 -254565 -250083
4346 -250083 -248068 -249318 -254851 -255912 -258512 -256148 -239839 -226782 -225335 -229937 -234894 -240186 -240463 -243732
$$ packed form
4450b41394r519k394L701O125L786p803o692j094P305P863K419k933M284R97j4734
4435b50083j1910Q068J0052n448j1737m651M078M575j289N025L069K425K59K309
4421b45258M69M973N04P3k062p500L654j87K153j791m848q68l003M829j063j026
4405b50951K710O083n28n078O930K166M610M5j2204L56j193j547O731K673j491
4390b40688j157O676M332K17k257q534p027n503O098L944n708O920J500L847M906
4375b32434L422m475k423j301j3395k132J542N425n286j442O948O025P624k318
4361b34220j691O083j175l304M146r457l8L594j2226o431K27m617j200N744M482
4346b50083K015j250n533j061k600K364J6309J3057J447m602m957n292k77l269
$$ plain form
4332 -243732 -247786 -254342 -254834 -246462 -244546 -241847 -241241 -248851 -256621 -252884 -248523 -252711 -252319 -245586 -246540
4317 -246540 -249374 -244577 -234722 -236401 -235343 -236031 -235327 -224076 -216958 -227453 -226496 -223679 -224728 -231948 -234351
4302 -234351 -237753 -237893 -241135 -245670 -245792 -236412 -234900 -239804 -235282 -233769 -232952 -237121 -234143 -230879 -229251
4287 -229251 -226495 -229675 -240638 -239945 -243117 -248488 -248978 -251755 -251006 -250850 -246533 -241399 -237574 -236619 -235296
4272 -235296 -245049 -239246 -233053 -237680 -241357 -242578 -237507 -234920 -232330 -231540 -229881 -237031 -231926 -220191
4258 -220191 -229396 -239824 -242874 -248646 -244703 -243373 -244789 -235733 -237443 -237808 -234053 -238977 -231638 -231693 -232977
4243 -232977 -233222 -231820 -234625 -232004 -227315 -223008 -220871 -228567 -226824 -221992 -226034 -238488 -237032 -234152
4229 -234152 -231948 -232551 -232640 -227093 -230653 -226043 -231825 -233085 -232191 -230744 -229534 -232244 -236018 -241365 -240380 -242887
$$ packed form
4332b43732m054o556m92Q372J916K699O06p610p770L737M361m188L92O733r54
4317b46540k834M797R855j679J058o88P04J1251P118j0495R57K817j049p220k403
4302b34351l402j40l242m535j22R380J512m904M522J513Q17m169K978L264J628
4287b29251K756l180j0963O93l172n371m90k777P49J56M317N134L825R55J323
4272b35296r753N803O193m627l677j221N071K587K590P90J659p150N105J1735
4258b20191r205j0428l050n772L943J330j416R056j710l65L755m924P339n5j284
4243b32977k45J402k805K621M689M307K137p696J743M832m042j2454J456K880
4229b34152K204o03q9N547l560M610n782j260Q94J447J210k710l774n347R85k507
$$ plain form
4213 -242887 -236285 -225101 -225160 -227201 -224467 -231062 -240532 -245271 -242353 -246562 -254195 -248743 -239728 -239112 -230100
4198 -230100 -230570 -228897 -233503 -238473 -238624 -230693 -229163 -232482 -220523 -218481 -222905 -224996 -225719 -232060 -235162
4183 -235162 -238252 -233154 -232084 -235773 -233625 -228072 -235753 -238953 -236507 -231127 -222454 -224937 -228877 -225715
4169 -225715 -228790 -234112 -225712 -223075 -226840 -237242 -244086 -245128 -249058 -242255 -228374 -224504 -233920 -234270
4155 -234270 -224994 -216737 -221722 -233891 -237968 -245278 -250979 -247973 -243772 -234093 -235060 -246868 -249184 -251431
4141 -251431 -247728 -239661 -228937 -224265 -221106 -223162 -227908 -228562 -233119 -230643 -230065 -240374 -242278 -245162
4127 -245162 -246819 -246166 -230090 -225363 -218995 -224227 -236602 -239592 -243026 -247556 -245727 -248097 -244273 -239583
4113 -239583 -230506 -226298 -225554 -239109 -237472 -236912 -230922 -227310 -230067 -227997 -226057 -229000 -233915 -242472 -239879
$$ packed form
4213b42887O602J1184n9k041K734o595r470m739K918m209p633N452R015O16R012
4198b30100m70J673m606m970j51P931J530l319J1959K042m424k091p23o341l102
4183b35162l090N098J070l689K148N553p681l200K446N380Q673k483l940L162
4169b25715l075n322Q400K637l765j0402o844j042l930O803J3881L870r416l50
4155b34270R276Q257m985j2169m077p310n701L006M201R679r67j1808k316k247
4141b51431L703Q067J0724M672L159k056m746o54m557K476N78j0309j904k884
4127b45162j657O53J6076M727O368n232j2375k990l434m530J829k370L824M690
4113b39583R077M208P44j3555J637N60N990L612k757K070J940k943m915q557K593
$$ plain form
4098 -239879 -245055 -251221 -246450 -236339 -227090 -220682 -221312 -219924 -220342 -228744 -236216 -244104 -241729 -230190
4084 -230190 -230579 -238651 -241303 -238282 -238229 -237360 -234895 -239458 -237020 -228803 -224924 -226214 -229303 -227888 -229498
4069 -229498 -229498 -232373 -232503 -229625 -223983 -229760 -233600 -225733 -217556 -215771 -215299 -221546 -225010 -224099 -220192 -218873
4053 -218873 -221667 -225323 -229772 -225776 -221838 -224412 -229592 -236566 -241385 -242397 -236870 -239277 -245288 -240673
4039 -240673 -235371 -225150 -228548 -232647 -232480 -234654 -240976 -242987 -244356 -240677 -233724 -233033 -234125 -237511 -238827
4024 -238827 -234223 -222222 -222749 -224503 -223027 -231287 -235972 -230124 -224039 -222820 -224214 -228442 -230845 -232595
4010 -232595 -229701 -223933 -217082 -223956 -229625 -229863 -228604 -224681 -219269 -224824 -230795 -223815 -224127 -222457 -223488
3995 -223488 -221936 -217987 -220694 -225104 -224584 -226367 -232385 -231378 -229947 -229817 -233042 -229742 -234031 -239504 -233899
$$ packed form
4098b39879n176o166M771J0111R249O408o30J388m18q402p472p888K375J1539
4084b30190l89q072k652L021N3Q69K465m563K438Q217L879j290l089J415j610
4069b29498%k875j30K878N642n777l840P867Q177J785M72o247l464R11L907J319
4053b18873k794l656m449L996L938k574n180o974m819j012N527k407o011M615
4039b40673N302J0221l398m099J67k174o322k011j369L679O953O91j092l386j316
4024b38827M604J2001n27j754J476q260m685N848O085J219j394m228k403j750
4010b32595K894N768O851o874n669k38J259L923N412n555n971O980l12J670j031
3995b23488J552L949k707m410N20j783o018J007J431J30l225L300m289n473N605
$$ plain form
3980 -233899 -229097 -231779 -233567 -227763 -224161 -221941 -221554 -223540 -221754 -231354 -227137 -226627 -230292 -226054 -222266
3965 -222266 -222659 -217597 -217084 -217341 -210427 -213195 -216223 -214180 -223441 -227522 -222582 -229473 -234017 -235072 -238486
3950 -238486 -236878 -230828 -223104 -227536 -234802 -246391 -250472 -247697 -240137 -234313 -226485 -222154 -220393 -216863
3936 -216863 -212850 -219760 -225900 -228514 -229715 -229176 -230642 -234226 -239570 -235790 -234999 -235656 -234375 -223219 -221012
3921 -221012 -225306 -232203 -238438 -244180 -240817 -243277 -245146 -248957 -253247 -243170 -228302 -230198 -234321 -232394
3907 -232394 -224303 -214768 -223818 -231387 -232656 -226314 -224888 -216202 -210142 -214717 -220820 -222831 -219055 -225651
3893 -225651 -220575 -213680 -214329 -218582 -227855 -223254 -217847 -221167 -222517 -223727 -219150 -212025 -214874 -210039 -211438
3878 -211438 -218248 -216644 -210237 -208548 -212864 -212592 -212403 -215063 -218486 -221265 -228050 -235200 -234166 -224497 -220186
$$ packed form
3980b33899M802k682j788N804L602K220L87j986J786r600M217N10l665M238L788
3965b22266l93N062N13k57O914k768l028K043r261m081M940o891m544j055l414
3950b38486J608O050P724m432p266j1589m081K775P560N824P828M331J761L530
3936b16863M013o910o140k614j201N39j466l584n344L780P91o57J281J1156K207
3921b21012m294o897o235n742L363k460j869l811m290J0077J4868j896m123J927
3907b32394Q091R535r050p569j269O342J426Q686O060m575o103k011L776o596
3893b25651N076O895o49m253r273M601N407l320j350j210M577P125k849M835j399
3878b11438o810J604O407J689m316K72J89k660l423k779o785p150J034R669M311
$$ plain form
3863 -220186 -221654 -229792 -235949 -236485 -227053 -228206 -222489 -219962 -220649 -229004 -228403 -222712 -229656 -232578 -228809
3848 -228809 -225359 -228041 -227723 -232180 -224769 -216662 -216640 -217643 -217671 -217609 -212073 -212583 -212970 -205155 -210947 -217682 -217592
3831 -217592 -215917 -218109 -225923 -224403 -217672 -219463 -220913 -222559 -223149 -228042 -229078 -229838 -230801 -224102 -218040
3816 -218040 -215538 -213898 -211010 -207289 -212159 -213688 -209473 -207254 -214821 -215213 -216246 -223879 -213875 -213669 -217631
3801 -217631 -219975 -223959 -223801 -217666 -218995 -215148 -216108 -219411 -222371 -221732 -230761 -229569 -227754 -225239 -226938
3786 -226938 -223190 -215106 -214645 -216738 -211282 -213580 -215577 -216759 -218525 -219462 -215298 -215055 -212866 -221288 -228154
3771 -228154 -232180 -226856 -215779 -203031 -209899 -213550 -204116 -201758 -211845 -218649 -216025 -213764 -214869 -205695
3757 -205695 -211495 -212286 -211734 -218297 -227543 -229804 -229017 -228591 -227075 -219637 -218012 -220034 -219770 -217998 -215522 -209658
$$ packed form
3863b20186j468q138o157n36R432j153N717K527o87q355O01N691o944k922L769
3848b28809L450k682L18m457P411Q107K2j003k8O2N536n10l87P815n792o735R0
3831b17592J675k192p814J520O731j791j450j646n90m893j036p60r63O699O062
3816b18040K502J640K888L721m870j529M215K219p567l92j033p633J0004K06l962
3801b17631k344l984J58O135j329L847r60l303k960O39r029J192J815K515j699
3786b26938L748Q084M61k093N456k298j997j182j766r37M164K43K189q422o866
3771b28154m026N324J1077J2748o868l651R434K358j0087o804K624K261j105R174
3757b05695n800p91N52o563r246k261P87M26J516P438J625k022K64J772K476N864
$$ plain form
3741 -209658 -216552 -217419 -217016 -220899 -220114 -219964 -229050 -232921 -229259 -237492 -237605 -223225 -214239 -211143 -214192
3726 -214192 -209897 -212695 -216196 -221328 -219553 -222118 -210822 -213137 -220768 -218500 -222635 -228047 -220715 -219571
3712 -219571 -221067 -230462 -226789 -223578 -220377 -210614 -211847 -217777 -215846 -211240 -222394 -225983 -224581 -223461
3698 -223461 -221352 -229260 -239802 -231805 -219347 -211446 -216362 -222330 -224103 -221990 -215573 -223321 -224040 -212607
3684 -212607 -211844 -210651 -206296 -210850 -218344 -222087 -215728 -223319 -222295 -222465 -233409 -230042 -221703 -222372 -217515
3669 -217515 -210732 -211018 -218827 -210257 -206847 -202636 -198808 -204413 -216450 -217115 -216756 -217365 -217078 -218763 -213785
3654 -213785 -219255 -220678 -211540 -210848 -207443 -208329 -212351 -218172 -216435 -211961 -211632 -213721 -213436 -215037 -205086
3639 -205086 -205473 -214592 -215030 -211961 -216985 -213507 -213200 -217291 -225677 -224767 -220313 -214095 -210841 -206486 -201636
$$ packed form
3741b09658o894q67M03l883P85J50r086l871L662q233j13J4380Q986L096l049
3726b14192M295k798l501n132J775k565J1296k315p631K268m135n412P332J144
3712b19571j496r395L673L211L201R763j233n930J931M606j1154l589J402J120
3698b23461K109p908j0542P997J2458P901m916n968j773K113O417p748p19J1433
3684b12607P63J193M355m554p494l743O359p591J024j70j0944L367Q339o69M857
3669b17515O783k86p809Q570L410M211L828n605j2037o65L59o09K87j685M978
3654b13785n470j423R138O92L405q86m022n821J737M474L29k089K85j601R951
3639b05086l87r119m38L069n024L478L07m091q386R10M454O218L254M355M850
$$ plain form
3624 -201636 -206532 -209809 -211257 -215530 -211470 -209374 -208806 -215645 -226848 -230374 -227208 -222827 -222255 -217761 -215728
3609 -215728 -219385 -217079 -224453 -223558 -217784 -220543 -219675 -211689 -208862 -214818 -210883 -206473 -199820 -200229 -205672
3594 -205672 -206892 -207626 -205296 -198523 -199301 -208523 -208807 -210842 -210652 -206207 -204013 -205025 -205083 -204907 -215939 -225361
3578 -225361 -223904 -223972 -222702 -218673 -219074 -221163 -219462 -216828 -220513 -223283 -226726 -229154 -225797 -225473 -217075
3563 -217075 -219082 -225709 -223396 -221969 -221921 -217452 -218430 -223846 -226218 -226595 -226448 -230226 -218357 -214193 -211631
3548 -211631 -204969 -198928 -191617 -190009 -195206 -207118 -215422 -212172 -206868 -210687 -206713 -201341 -190116 -184850
3534 -184850 -192201 -205050 -217310 -214713 -212696 -214369 -215232 -205949 -198544 -191784 -195776 -201485 -196082 -198749
3520 -198749 -206344 -204459 -195559 -196890 -199203 -203267 -208418 -218599 -212590 -207529 -210275 -213384 -208268 -206282
$$ packed form
3624b01636m896l277j448m273M060K096N68o839j1203l526L166M381N72M494K033
3609b15728l657K306p374Q95N774k759Q68P986K827n956L935M410O653m09n443
3594b05672j220p34K330O773p78r222k84k035J90M445K194j012n8J76j1032r422
3578b25361J457o8J270M029m01k089J701K634l685k770l443k428L357L24Q398
3563b17075k007o627K313J427M8M469r78n416k372l77J47l778J1869M164K562
3548b11631O662O041P311J608n197j1912q304L250N304l819L974N372J1225N266
3534a84850p351j2849j2260K597K017j673q63R283P405O760l992n709N403k667
3520a98749p595J885Q900j331k313m064n151j0181O009N061k746l109N116J986
$$ plain form
3506 -206282 -197911 -194810 -199153 -200892 -207776 -211665 -216251 -221627 -229049 -241271 -241558 -229094 -216186 -213823
3492 -213823 -210864 -208485 -204600 -209586 -199678 -196855 -199236 -197133 -201372 -206569 -204365 -207027 -217504 -228371
3478 -228371 -218038 -211381 -214479 -213936 -212036 -211996 -208999 -209465 -214561 -210582 -207196 -211370 -215253 -217730 -219189
3463 -219189 -215020 -203894 -191636 -193303 -203120 -212657 -213632 -213119 -214243 -218077 -215124 -217109 -213085 -210393
3449 -210393 -208723 -201523 -202180 -210713 -210476 -207163 -209079 -211249 -206286 -199196 -206784 -209327 -206086 -206022 -207170
3434 -207170 -208616 -203652 -198179 -201525 -203368 -200783 -203404 -199776 -205545 -204819 -190407 -191181 -195124 -189769 -190906
3419 -190906 -197079 -202573 -201558 -187576 -185497 -193530 -200637 -206877 -208032 -208997 -214254 -214306 -215518 -225336 -220742
3404 -220742 -211488 -198001 -201670 -207593 -212510 -207058 -204952 -214361 -214705 -213402 -212621 -209101 -205435 -197576 -193714
$$ packed form
3506b06282Q371L101m343j739o884l889m586n376p422j2222k87J2464J2908K363
3492b13823K959K379L885m986R908K823k381K103m239n197K204k662j0477j0867
3478b28371J0333O657l098N43J900M0K997m66n096L979L386m174l883k477j459
3463b19189M169J1126J2258j667r817r537r75N13j124l834K953j985M024K692
3449b10393J670P200o57q533K37L313j916k170M963P090p588k543L241O4j148
3434b07170j446M964N473l346j843K585k621L628n769P26J4412p74l943N355j137
3419a90906o173n494J015J3982K079q033p107o240j155r65n257n2j212r818M594
3404b20742R254J3487l669n923m917N452K106r409l44J303P81L520L666P859L862
$$ plain form
3389 -193714 -194739 -200912 -206099 -206371 -213355 -212275 -210698 -212587 -207200 -199445 -197187 -193491 -195738 -195212 -197145
3374 -197145 -198500 -205151 -211544 -213863 -220220 -218375 -208126 -205254 -203665 -213297 -203372 -200468 -203551 -206857
3360 -206857 -215045 -226073 -217451 -211072 -213400 -212665 -209884 -203872 -205375 -203815 -205758 -206355 -210485 -208695 -200945
3345 -200945 -206119 -212913 -208198 -199944 -193346 -193777 -189962 -198018 -213827 -216849 -215440 -213899 -210217 -214046
3331 -214046 -222085 -225002 -217421 -201335 -195826 -190751 -192605 -191768 -188322 -184853 -187340 -185462 -191905 -193197
3317 -193197 -191379 -195436 -196332 -201091 -204157 -208527 -203602 -206340 -210125 -209486 -213670 -206565 -201287 -189759 -187366
3302 -187366 -197190 -199158 -197295 -190658 -191238 -197174 -198025 -195219 -202469 -208856 -212641 -211197 -204394 -206440 -204386
3287 -204386 -198471 -206835 -211571 -212093 -210047 -210563 -213827 -202737 -197212 -202378 -206853 -207068 -207930 -199527 -193595
$$ packed form
3389a93714j025o173n187k72o984J080J577j889N387P755K258L696k247N26j933
3374a97145j355o651o393k319o357J845J0249K872J589r632R925K904l083l306
3360b06857q188j1028Q622O379k328P35K781O012j503J560j943n97m130J790P750
3345b00945n174o794M715Q254O598m31L815q056j5809l022J409J541L682l829
3331b14046q039k917P581J6086N509N075j854Q37L446L469k487J878o443j292
3317a93197J818m057q96m759l066m370M925k738l785O39m184P105N278J1528K393
3302a87366r824j968J863O637n80n936q51K806p250o387l785J444O803k046K054
3287b04386N915q364m736n22K046n16l264J1090N525n166m475k15q62Q403N932
$$ plain form
3272 -193595 -193687 -202210 -210901 -198456 -196363 -199429 -200389 -203019 -203472 -198628 -196945 -196466 -193799 -200808 -202264
3257 -202264 -195558 -200768 -205832 -206843 -210280 -214839 -210246 -210971 -209287 -204710 -195765 -190333 -193734 -195533 -202191
3242 -202191 -192831 -189707 -191588 -189718 -200728 -198107 -191167 -191968 -189542 -189984 -196499 -207608 -203647 -199965
3228 -199965 -202885 -196995 -189950 -192393 -196508 -193347 -195013 -199225 -201961 -196182 -193730 -193031 -189921 -187484 -181451
3213 -181451 -178208 -185585 -203035 -209607 -208320 -191217 -181724 -186196 -194889 -201903 -202646 -197123 -197349 -199199
3199 -199199 -196761 -198858 -195561 -188649 -183792 -183042 -178922 -178306 -189942 -199167 -192172 -191818 -190032 -190942 -192919
3184 -192919 -195872 -198163 -199270 -201954 -197314 -198579 -207950 -221087 -215328 -210264 -202197 -199622 -207717 -212409
$$ packed form
3272a93595r2q523q691J2445K093l066r60k630m53M844J683M79K667p009j456
3257b02264O706n210n064j011l437m559M593p25J684M577Q945N432l401j799o658
3242b02191R360L124j881J870j1010K621O940q01K426m42o515j1109L961L682
3228a99965k920N890P045k443m115L161j666m212k736N779K452O99L110K437O033
3213a81451L243p377j7450o572J287J7103R493m472q693p014p43N523k26j850
3199a99199K438k097L297O912M857P50M120O16j1636r225O995L54J786r10j977
3184a92919k953k291j107k684M640j265r371j3137N759N064Q067K575q095m692
$$ [...]
##END NTUPLES=NMR SPECTRUM
##END=
