##TITLE=Analysis number 325395
Compound Code cc 52414
Book Reference 464/76/5
Project Code adrs
Chemist Name chrisr
##JCAMPDX= 6.0         $$ Bruker NMR JCAMP-DX V2.0
##DATA TYPE= NMR SPECTRUM
##DATA CLASS= NTUPLES
##ORIGIN= Bruker BioSpin GmbH
##OWNER= nmr
$$ XWIN-NMR		Version 3.5
$$ Tue Jan  2 11:32:31 2007 GMT Standard Time (UT+0h)  MAYBRIDGE\nmr@NMR_250MHZ
##.OBSERVE FREQUENCY= 250.131544655141
##.OBSERVE NUCLEUS= ^1H
##.ACQUISITION MODE= SIMULTANEOUS (DQD)
##.ACQUISITION SCHEME= undefined
##.AVERAGES= 16
##.DIGITISER RES= 18
##SPECTROMETER/DATA SYSTEM= dpx250
##.PULSE SEQUENCE= zg30
##.SOLVENT NAME= CDCl3
##.SHIFT REFERENCE= (INTERNAL, CDCl3, 0, 16.5203)
##AUDIT TRAIL= $$ (NUMBER, WHEN, WHO, WHERE, WHAT)
$$ ##TITLE= Audit trail, XWIN-NMR		Version 3.5
$$ ##JCAMPDX= 5.01
$$ ##ORIGIN= Bruker BioSpin GmbH
$$ ##OWNER= nmr
$$ C:\u/data/dgb/nmr/ADRS/110/pdata/1/auditp.txt
$$ ##AUDIT TRAIL=  $$ (NUMBER, WHEN, WHO, WHERE, WHAT)
(   1,<2007-01-02 11:32:08.21 +000>,<MAYBRIDGE\nmr>,<NMR_250MHZ>,
      <created by zg, POWCHK disabled, PULCHK disabled
       configuration hash MD5:
       49 4B E0 1D 92 C2 6B 37 9F E6 65 BC 52 41 86 1D
       data hash MD5: 64K
       88 DC 1A A0 3C 69 25 3F 26 7F 3F 98 73 47 C8 8B>)
(   2,<2007-01-02 11:32:21.10 +000>,<MAYBRIDGE\nmr>,<NMR_250MHZ>,
      <Start of raw data processing
       ef LB = 0.3 FT_mod = 6 PKNL = 1 SI = 32K 
       data hash MD5: 32K
       23 93 32 08 C5 B8 65 B5 0D A6 D4 A5 72 8A C1 65>)
(   3,<2007-01-02 11:32:22.83 +000>,<MAYBRIDGE\nmr>,<NMR_250MHZ>,
      <apk 
       data hash MD5: 32K
       CE F4 7E 7A 8E 5F 67 31 13 46 E1 97 5B A3 44 9D>)
(   4,<2007-01-02 11:32:23.53 +000>,<MAYBRIDGE\nmr>,<NMR_250MHZ>,
      <abs ABSG = 5 
       data hash MD5: 32K
       A5 0E CE 22 5A 6E C6 3D C4 EC 12 F1 C0 7F 8A AB>)
$$ ##END=
$$ 
$$ hash MD5
$$ 33 53 E9 0B 37 B6 19 35 D3 86 75 A7 D4 EF 63 99
##$RELAX= 
##$RELAX= 
##$RELAX= 
##$RELAX= 
##$RELAX= 
##$RELAX= 
##$RELAX= 
$$ Bruker specific parameters
$$ --------------------------
##$DU= <C:\u>
##$EXPNO= 110
##$NAME= <ADRS>
##$PROCNO= 1
##$TYPE= <nmr>
##$USER= <dgb>
##$AMP= (0..31)
100 100 100 100 100 100 100 100 100 100 100 100 100 100 100 100 100 100 
100 100 100 100 100 100 100 100 100 100 100 100 100 100 
##$AQSEQ= 0
##$AQ_mod= 3
##$AUNM= <au_zg>
##$AUTOPOS= <15 >
##$BF1= 250.13
##$BF2= 250.13
##$BF3= 250.13
##$BF4= 250.13
##$BF5= 500.13
##$BF6= 500.13
##$BF7= 500.13
##$BF8= 500.13
##$BYTORDA= 1
##$CFDGTYP= 0
##$CFRGTYP= 5
##$CHEMSTR= <none>
##$CNST= (0..31)
1 1 145 1 1 1 1 1 1 1 1 1 1 1 1 1 1 1 1 1 1 1 1 1 1 1 1 1 1 1 1 1 
##$CPDPRG= <>
##$CPDPRG1= <>
##$CPDPRG2= <>
##$CPDPRG3= <>
##$CPDPRG4= <mlev>
##$CPDPRG5= <mlev>
##$CPDPRG6= <mlev>
##$CPDPRG7= <mlev>
##$CPDPRG8= <mlev>
##$CPDPRGB= <>
##$CPDPRGT= <>
##$D= (0..31)
0 1 0 0 0 0 0 0 0 0.06 0 0 0 0 0 0 0.0002 0 0 0 0 0 0 0 0 0 0 0 0 0 0 
0 
##$DATE= 1167737527
##$DBL= (0..7)
120 120 120 120 120 120 120 120 
##$DBP= (0..7)
150 150 150 150 150 150 150 150 
##$DBP07= 0
##$DBPNAM0= <>
##$DBPNAM1= <>
$$ [...]
##$SUBNAM7= <"">
##$SUBNAM8= <"">
##$SUBNAM9= <"">
##$SW= 20.6930455092707
##$SWIBOX= (0..15)
0 0 3 0 0 0 0 0 0 0 0 0 0 0 0 0 
##$SW_h= 5175.983436853
##$TD= 65536
##$TD0= 1
##$TE= 294.16
##$TE2= 300
##$TE3= 300
##$TEG= 300
##$TL= (0..7)
0 120 120 120 120 120 120 120 
##$TP= (0..7)
150 150 150 150 150 150 150 150 
##$TP07= 0
##$TPNAME0= <>
##$TPNAME1= <>
##$TPNAME2= <>
##$TPNAME3= <>
##$TPNAME4= <>
##$TPNAME5= <>
##$TPNAME6= <>
##$TPNAME7= <>
##$TPOAL= (0..7)
0.5 0.5 0.5 0.5 0.5 0.5 0.5 0.5 
##$TPOFFS= (0..7)
0 0 0 0 0 0 0 0 
##$TUNHIN= 0
##$TUNHOUT= 0
##$TUNXOUT= 0
##$USERA1= <user>
##$USERA2= <user>
##$USERA3= <user>
##$USERA4= <user>
##$USERA5= <user>
##$V9= 5
##$VALIST= <valist>
##$VCLIST= <CCCCCCCCCCCCCCC>
##$VD= 0
##$VDLIST= <DDDDDDDDDDDDDDD>
##$VPLIST= <PPPPPPPPPPPPPPP>
##$VTLIST= <TTTTTTTTTTTTTTT>
##$WBST= 1024
##$WBSW= 4
##$XGAIN= (0..3)
0 0 0 0 
##$XL= 0
##$YL= 0
##$YMAX_a= 242406
##$YMIN_a= -367880
##$ZGOPTNS= <>
##$ZL1= 120
##$ZL2= 120
##$ZL3= 120
##$ZL4= 120
##$ABSF1= 16.52034
##$ABSF2= -4.172832
##$ABSG= 5
##$ABSL= 3
##$ALPHA= 0
##$AQORDER= 0
##$ASSFAC= 0
##$ASSFACI= 0
##$ASSFACX= 0
##$ASSWID= 0
##$AUNMP= <proc_1d>
##$AZFE= 0.1
##$AZFW= 0.1
##$BCFW= 0
##$BC_mod= 0
##$BYTORDP= 0
##$COROFFS= 0
##$CY= 12.5
##$DATMOD= 1
##$DC= 0
##$DFILT= <>
##$DTYPP= 0
##$F1P= 14.0000005364418
##$F2P= -0.99999901652339
##$FCOR= 0.5
##$FTSIZE= 32768
##$FT_mod= 6
##$GAMMA= 0
##$GB= 0
##$INTBC= 1
##$INTSCL= 1
##$ISEN= 128
##$LB= 0.3
##$LEV0= 0
##$LPBIN= 0
##$MAXI= 10000
##$MC2= 0
##$MEAN= 0
##$ME_mod= 0
##$MI= 0
##$NCOEF= 0
##$NC_proc= -5
##$NLEV= 6
##$NOISF1= 0
##$NOISF2= 0
##$NSP= 0
##$NTH_PI= 0
##$NZP= 0
##$OFFSET= 16.52034
##$PC= 1
##$PHC0= 227.2058
##$PHC1= 15.94147
##$PH_mod= 1
##$PKNL= yes
##$PPARMOD= 0
##$PSCAL= 4
##$PSIGN= 0
##$REVERSE= no
##$SF= 250.13000041499
##$SI= 32768
##$SIGF1= 0
##$SIGF2= 0
##$SINO= 400
##$SIOLD= 32768
##$SREGLST= <1H.CDCl3>
##$SSB= 0
##$STSI= 32768
##$STSR= 0
##$SW_p= 5175.98343685301
##$SYMM= 0
##$S_DEV= 0
##$TDeff= 65536
##$TDoff= 0
##$TI= <Analysis number 999999
Compound Code 99
Book Reference 9
Project Code 9>
##$TILT= no
##$TM1= 0
##$TM2= 0
##$TOPLEV= 0
##$USERP1= <user>
##$USERP2= <user>
##$USERP3= <user>
##$USERP4= <user>
##$USERP5= <user>
##$WDW= 1
##$XDIM= 32768
##$YMAX_p= 325941021
##$YMIN_p= -686016
$$ End of Bruker specific parameters
$$ ---------------------------------
##NTUPLES= NMR SPECTRUM
##VAR_NAME=  FREQUENCY,     SPECTRUM/REAL,   SPECTRUM/IMAG
##SYMBOL=    X,             R,               I
##VAR_TYPE=  INDEPENDENT,   DEPENDENT,       DEPENDENT
##VAR_FORM=  AFFN,          ASDF,            ASDF
##VAR_DIM=   32768,         32768,           32768
##UNITS=     HZ,            ARBITRARY UNITS, ARBITRARY UNITS
##FACTOR=    0.157963299565203, 1,           1
##FIRST=     4132.23264250641, 0,            0
##LAST=      -1043.7507943466, 0,            0
##MIN=       -1043.7507943466, -686016,      0
##MAX=       4132.23264250641, 325941021,    0
$$ Real data points
##PAGE= N=1
##DATA TABLE= (X++(R..R)), XYDATA
$$ [...]
$$ plain form
23406 176130 151873 40764 21492 -154249 -183837 -79416 -10153 83650 222009 275986 246882
23395 246882 134895 -5262 72306 25009 -119176 -51994 68941 49873 134513 153885 239874
23384 239874 201711 190690 3636 -74056 -192187 -202844 -37328 55523 113237 92172 156287
23373 156287 40100 -173545 9332 281991 103273 -21952 -256322 -198779 95027 130798
23363 130798 -24223 -70079 -82711 -216842 -260608 -180356 -37638 151204 191966 -15632
23353 -15632 49298 45510 -90877 -235896 -122310 -121160 -164517 -152445 -186430 -177934 -60110
23342 -60110 100690 129934 27432 20540 10207 -170542 -186492 -76771 147886 144267 66733
23331 66733 27094 60355 39883 52323 -46661 -131328 174473 191456 105275 44148 -12523
$$ packed form
23406A76130k4257j11109j9272j75741k9588J04421O9263R3803J38359N3977k9104
23395B46882j11987j40157P7568m7297j44185O7182J20935j9068Q4640J9372Q5989
23384B39874l8163j1021j87054p7692j18131j0657J65516R2851N7714k1065O4115
23373A56287j16187k13645J82877K72659j78718j25225k34370N7543K93806L5771
23363A30798j55021m5856j2632j34131m3766Q0252J42718J88842M0762k07598
23353a5632O4930l788j36387j45019J13586J150m3357J2072l3985Q496J17824
23342f0110J60800K9244j02502o892j0333j80749j5950J09721K24657l619p7534
23331F6733l9639L3261k0472J2440r8984q4667L05801J6983q6181o1127n6671
$$ plain form
23320 -12523 -7216 -77693 -68347 16943 85573 135667 -80606 -291251 -347597 -216391 -84959
23309 -84959 34548 118215 292667 224236 153622 54775 32505 34036 22638 57763 -4620
23298 -4620 -1118 105201 13600 -70461 -89224 -112201 -244662 -259808 -245338 -50625 117272
23287 117272 206165 138886 128126 19020 39072 44108 73360 40369 -141425 -182157 -12084
23276 -12084 5968 -77794 -15745 684 24600 136851 110282 148009 215155 206386 157203 171305
23264 171305 86245 73995 -62470 -38060 115729 250914 242864 190193 196375 149948 -87276
23253 -87276 -43385 -167637 -336883 -147761 58716 200706 310501 230483 -3102 43179
23243 43179 -71729 148664 199909 256859 195924 58436 58832 151661 210458 187753 4830
$$ packed form
23320a2523N307p0477R346Q5290O8630N0094k16273k10645n6346J31206J31432
23309h4959J19507Q3667J74452o8431p0614r8847k2270J531j1398L5125o2383
23298d620L502J06319r1601q4061j8763k2977j32461j5146J4470J94713J67897
23287A17272Q8893o7279j0760j09106K0052N036K9252l2991j81794m0732J70073
23276a2084J8052q3762O2049J6429K3916J12251k6569L7727O7146q769m9183J4102
23264A71305q5060j2250j36465K4410J53789J35185q050n2671O182m6427k37224
23253h7276M3891j24252j69246J89122K06477J41990J09795q0018k33585M6281
23243D3179j14908K20393N1245N6950o0935j37488L96R2829N8797k2705j82923
$$ plain form
23232 4830 18951 -8570 -1006 -5660 59289 25471 149470 254792 72753 -68448 64103
23221 64103 6865 -209616 -192618 -141133 -178618 -169523 -168595 -130189 -199120 -164241 -3790 109934
23209 109934 107273 59121 91165 91250 -39317 -46240 71466 105869 43594 -134582 -168204 -87058
23197 -87058 -10440 71144 65689 47050 -54032 -40426 27645 166093 225312 192965 22347
23186 22347 -42322 10592 31526 -8236 -89730 -135464 -52555 76016 171057 75933 10182
23175 10182 40438 277731 409181 242529 109932 -5518 141481 170907 196163 304582
23165 304582 146535 20921 -18583 -155589 -145647 -50340 36277 80857 79707 5226 -151499
23154 -151499 -152331 -88602 -40109 39694 242240 290335 78578 55360 175111 151013 156686
$$ packed form
23232D830J4121k7521P564m654O4949l3818J23999J05322j82039j41201J32551
23221F4103n7238k16481J6998N1485l7485R095R28L8406o8931L4879J60451J13724
23209A09934k661m8152L2044Q5j30567o923J17706L4403o2275j78176l3622Q1146
23197h7058P6618Q1584n455j8639j01082J3606O8071J38448N9219l2347j70618
23186B2347o4669N2914K0934l9762q1494m5734Q2909J28571R5041r5124o5751
23175A0182L0256K37293J31450j66652j32597j15450J46999K9426K5256J08419
23165C04582j58047j25614l9504j37006R942R5307Q6617M4580j150p4481j56725
23154a51499q32O3729M8493P9803K02546M8095k11757k3218J19751k4098N673
$$ plain form
23143 156686 164195 63590 13927 161375 147896 -65213 -48919 58066 166540 174744 182931
23132 182931 106208 11983 5451 -53543 34460 52191 135573 -131502 -180731 -138646 -191254
23121 -191254 -84689 -7594 -49628 -203360 -177599 -104887 -212630 -263776 -115725 48724
23111 48724 57467 -65207 49440 265125 299038 224683 219561 231109 194795 19305 -50993
23100 -50993 -75043 8358 140496 101849 -19588 -111406 -134219 -85995 -77558 42766 191007
23089 191007 104857 -43047 -48568 -90243 -20783 2559 37364 81016 6298 -43633 16160
23078 16160 -100455 -98732 -89321 1121 138409 86244 -23779 -14070 130835 23385 149538
23067 149538 148811 133525 226149 81972 -84282 -33652 -53005 2966 22561 56938 144893
$$ packed form
23143A56686P509j00605m9663J47448j3479k13109J6294J06985J08474Q204Q187
23132A82931p6723r4225o532n8994Q8003J7731Q3382k67075m9229M2085n2608
23121a91254J06565P7095m2034j53732K5761P2712j07743n1146J48051J64449
23111D8724Q743j22674J14647K15685L3913p4355n122J1548l6314j75490p0298
23100e0993k4050Q3401J32138l8647j21437r1818k2813M8224Q437J20324J48241
23089A91007q6150j47904n521m1675O9460K3342L4805M3652p4718m9931N9793
23078A6160j16615J723R411R0442J37288n2165j10023R709J44905j07450J26153
23067A49538p27j5286R2624j44177j66254N0630j9353N5971J9595L4377Q7955
$$ plain form
23056 144893 275091 278367 130112 111060 186143 113620 120545 188266 79810 -41890 -37505
23045 -37505 -139519 -197084 -199919 -126290 31879 135307 160665 141694 221515 355941 353777
23034 353777 161819 231021 305266 207945 40038 -13632 -41229 44547 189588 247735 276160
23023 276160 143079 72700 96979 100272 186274 128092 -25773 -28476 -35701 -39997 96112 85320
23011 85320 97019 102458 -102999 -96410 -235022 -361131 -367981 -16141 205304 136724 132029
23000 132029 224299 244029 176498 237828 129056 2855 -34759 -238613 -371986 -221648
22990 -221648 -143887 -136979 -91299 -110121 -181952 -103630 -97831 -119823 -41883 -58051 -61192 16912
22978 16912 -30621 23304 139638 96663 177888 266655 267843 15222 -198997 -130881 177438
$$ packed form
23056A44893J30198L276j48255j9052P5083p2523O925O7721j08456j21700M385
23045c7505j02014n7565k835P3629J58169J03428K5358j8971P9821J34426k164
23034C53777j91958O9202P4245r7321j67907n3670k7597Q5776J45041N8147K8425
23023B76160j33081p0379K4279L293Q6002n8182j53865k703p225m296J36109j0792
23011H5320J1699N439k05457O589j38612j26109o850L51840K21445o8580m695
23000A32029R2270J9730o7531O1330j08772j26201l7614k03854j33373J50338
22990b21648P7761O908M5680j8822p1831P8322N799k1992P7940j6168l141P8104
22978A6912m7533N3925J16334m2975Q1225Q8767J188k52621k14219O8116L08319
$$ plain form
22967 177438 157104 71697 48661 15374 50970 42093 137691 344387 274435 137679 170544
22956 170544 311906 340079 236610 234552 129477 110006 70092 183302 315215 365086 260921
22945 260921 280395 455358 358385 185456 11160 67542 -87731 -183258 -157059 -32669
22935 -32669 -116 -73699 -32859 81940 15132 11577 21684 191684 268564 156765 203294
22924 203294 200530 83753 -68520 -106656 5284 54591 -137285 -94053 84877 161713 30256
22913 30256 30921 57714 8068 110587 146303 111497 209092 270826 171954 256196 263508 236207
22901 236207 82118 12304 -191497 -181412 -128038 -177493 -20477 16450 -66381 -235772 -226729
22890 -226729 -238151 -316581 -289396 -80346 -96216 22652 -11774 -188970 -72495 174990
$$ packed form
22967A77438k0334q5407k3036l3287L5596q877R5598K06696o9952j36756L2865
22956A70544J41362K8173j03469k058j05075j9471l9914J13210J31913M9871j04165
22945B60921J9474J74963r6973j72929j74296N6382j55273r5527K6199J24390
22935c2669L2553p3583M0840J14799o6808l555J0107J70000P6880j11799M6529
22924B03294k764j16777j52273l8136J11940M9307j91876M3232J78930P6836j31457
22913C0256O65K6793m9646J02519L5716l4806R7595O1734r8872Q4242P312k7301
22901B36207j54089o9814k03801J0085N3374m9455J57016L6927q2831j69391R043
22890b26729j1422p8430K7185K09050j5870J18868l4426j77196J16475K47485
$$ plain form
22880 174990 229924 222757 113605 101422 -193 -143433 -111541 -5968 42391 150028 -60263
22869 -60263 -262756 -246302 -136328 -68337 -50152 -160033 -229289 -198058 -390320 -407009 -324768
22858 -324768 -296062 -343831 -239276 -120871 -174864 -185641 -286477 -258477 -63550 25487 -87320
22847 -87320 20235 11315 2707 -26520 -2167 -59320 -197621 -245428 -197291 -89287 -52800
22836 -52800 -6034 -69072 -90430 181328 398512 373643 296070 197807 246310 366697 305938
22825 305938 157037 196339 268157 174165 76168 90818 146928 85673 -12108 69022 186542
22814 186542 199986 150954 39765 -68566 -153508 -49894 115034 92235 238345 264166
22804 264166 175393 139673 116739 98034 225916 211880 179862 -34409 -395587 -347239 53668
$$ packed form
22880A74990N4934p167j09152j2183j01615j43240L1892J05573M8359J07637k10291
22869f0263k02493J6454J09974O7991J8185j09881o9256L1231j92262j6689Q2241
22858c24768K8706m7769J04555J18405n3993j0777j00836K8000J94927Q9037j12807
22847h7320J07555q920q608k9227K4353n7153j38301m7807M8137J08004L6487
22836e2800M6766o3038k1358K71758K17184k4869p7573r8263M8503J20387o0759
22825C05938j48901L9302P1818r3992r7997J4650N6110o1255r7781Q1130J17520
22814A86542J3444m9032j11189j08331q4942J03614J64928k2799J46110K5821
22804B64166q8773l5720k2934j8705J27882j4036l2018k14271l61178M8348M00907
$$ plain form
22793 53668 43561 17211 29122 -147632 -239003 -115042 -158013 -213321 -171859 -38935 77330
22782 77330 144614 71742 -1660 -101922 -251378 -217032 -252084 -243010 -61934 2431 -16997
22771 -16997 -61284 -2607 5344 47693 42148 64879 126985 43761 73814 159528 77705 111526
22759 111526 50715 -194530 -168845 20712 85855 87428 24149 101015 109851 26872 74992
22748 74992 188632 247996 213971 206736 168813 302639 381107 287921 253772 323926 267424
22737 267424 190086 164992 236830 205863 40146 487 -14549 -99564 -131001 -68886 70864
22726 70864 60667 -97420 -240738 -94660 -109423 -47072 75336 58834 44606 47699 7693
22715 7693 100197 -2543 -106846 50068 112708 185812 239450 250953 293955 220631 136031
$$ packed form
22793E3668j0107k6350J1911j76754r1371J23961m2971n5308M1462J32924J16265
22782G7330O7284p2872p3402j00262j49456L4346l5052R074J81076O4365j9428
22771a6997m4287N8677P951M2349n545K2731O2106q3224L0053Q5714q1823L3821
22759A11526o0811k45245K5685J89557O5143J573o3279P6866Q836q2979M8120
22748G4992J13640N9364l4025p235l7923J33826P8468r3186l4149P0154n6502
22737B67424p7338k5094P1838l0967j65717l9659j5036q5015l1437O2115J39750
22726G0864j0197j58087j43318J46078j4763O2351J22408j6502j4228L093m0006
22715G693R2504j02740j04303J56914O2640P3104N3638J1503M3002p3324q4600
$$ plain form
22704 136031 45432 33786 59354 -79242 83124 146440 239392 412345 382620 391272 330024
22693 330024 242018 213738 51867 -16283 103498 45231 36909 9853 -128898 -135700 -37968
22682 -37968 -37045 -7474 -43566 27689 114510 149278 91744 -45601 -27772 94421 105968 204868
22670 204868 117525 4013 -56759 -67903 -142115 -244253 -250545 -235292 -154330 -149544 -57890
22659 -57890 36829 -76612 -133417 -61471 59790 55155 -48600 -140728 -232927 -138091 -234360
22648 -234360 -322728 -336202 -386332 -429074 -361235 -450638 -470858 -251908 -201431 -84892 170635
22637 170635 101778 -6277 -60661 23115 26328 -78098 -161816 -350063 -385444 -295560 -189627
22626 -189627 35380 85317 202568 157902 52079 92631 100489 108961 144695 179617 293075
$$ packed form
22704A36031r0599j1646K5568j38596J62366O3316R2952J72953k9725Q652o1248
22693C30024q8006k8280j61871o8150J19781n8267q322k7056j38751o802R7732
22682c7968R23K9571l6092P1255Q6821L4768n7534j37345J7829J22193J1547R8900
22670B04868q7343j13512o0772j1144p4212j02138o292J5253Q0962M786R1654
22659e7890R4719j13441n6805P1946J21261m635j03755r2128r2199R4836r6269
22648b34360q8368j3474n0130m2742O7839q9403k0220K18950N0477J16539K55527
22637A70635o8857j08055n4384Q3776L213j04426q3718j88247l5381Q9884J05933
22626a89627K25007M9937J17251m4666j05823M0552P858Q472L5734L4922J13458
$$ plain form
22615 293075 244827 39117 -67294 -39919 -496 57536 145280 141264 148364 106119 48275
22604 48275 -48920 -138561 -32084 -193956 -239253 -189359 -117225 -115277 -156688 -213029 -240763
22593 -240763 -216478 -199409 -187652 -236503 -233394 -230253 -195758 -224596 -278155 -224538 -189107 -148651
22581 -148651 -231523 -266459 -231708 -180552 -100548 -117235 -114638 147740 193836 146895 201498
22570 201498 147422 31119 -105872 -177488 -190839 -207910 -58095 -24988 -83458 -179786 -54858
22559 -54858 187332 1277 -147740 41151 -108283 -268664 -233475 -242768 -306040 -207839 -189961
22548 -189961 -169698 -74931 -41596 -11459 -46378 92279 73558 134232 20436 -156880 -151988
22537 -151988 -52323 -182392 -257865 -363006 -261211 -83157 28825 203009 139308 124260
$$ packed form
22615B93075m8248k05710j06411K7375L9423N8032Q7744m016P100m2245n7844
22604D8275r7195q9641J06477j61872m5297M9894P2134J948m1411n6341k7734
22593b40763K4285J7069J1757m8851L109L141L4495k8838n3559N3617L5431M0456
22581a48651q2872l4936L4751N1156Q0004j6687K597K62378M6096m6941N4603
22570B01498n4076j16303j36991p1616j3351j7071J49815L3107n8470r6328J24928
22559e4858K42190j86055j49017J88891j49434j60381L5189r293o3272R8201J7878
22548a89961K0263R4767L3335L0137l4919J38657j8721O0674j13796j77316M892
22537a51988R9665j30069p5473j05141J01795J78054J11982J74184o3701j5048
$$ plain form
22527 124260 118831 90992 164494 88045 -17562 73360 64983 1335 44530 39438 -45763 -47047
22515 -47047 24137 25827 26598 -48215 -162236 -135806 -100150 -675 -87161 -117604 -83637 12892
22503 12892 115859 130472 179236 231101 407744 311237 127100 89225 76563 -14022 -130871
22492 -130871 -1325 -8708 -22485 91111 90185 124752 351648 240217 180266 200271 186817
22481 186817 177252 226817 272752 315674 403695 412340 289319 116843 169065 143008 78231
22470 78231 172492 12948 -86740 -14405 160332 280476 128024 -87303 -125013 -114760 -50039
22459 -50039 -170694 -185899 -91401 -76718 -21526 110605 131986 13557 -23790 -19805 39701
22448 39701 -52433 -86244 -117468 -118748 -147003 -310917 -240866 -291731 -267646 -117924 4601
$$ packed form
22527A24260n429k7839P3502p6449j05607R0922q377o3648M3195n092q5201j284
22515d7047P1184J690P71p4813j14021K6430L5656R9475q6486l0443L3967R6529
22503A2892J02967J4613M8764N1865J76643r6507j84137l7875j2662r0585j16849
22492a30871J29546p383j3777J13596r26L4567K26896j11431n9951K0005j3454
22481A86817r565M9565M5935M2922Q8021Q645j23021j72476N2222k6057o4777
22470G8231R4261j59544r9688P2335J74737J20144j52452k15327l7710J0253O4721
22459e0039j20655j5205R4498J4683N5192J32131K1381j18429l7347L985N9506
22448C9701r2134l3811l1224j280k8255j63914P0051n0865K4085J49722J22525
$$ plain form
22437 4601 -123841 -116923 -384109 -275808 -68381 83387 103842 44636 -61184 -143117 35286
22426 35286 162516 183223 199388 62506 -13278 99122 154819 128384 57176 32710 19647
22415 19647 -135462 -170765 13396 236556 234902 168981 165430 26377 31255 85408 27858
22404 27858 -19953 -128233 -55723 38145 28090 -18672 -172978 -131164 -255932 -136758 17688
22393 17688 93742 218891 171243 14413 -214313 -266514 -326436 -294782 -376246 -369919 -380012
22382 -380012 -271034 -145295 -87848 -101557 -96844 -54891 204534 233583 214371 254243 121572
22371 121572 -74558 -192180 -96801 -16969 -139649 -224379 -183303 -115096 21194 -7861 37161
22360 37161 153718 182149 105744 14655 -4600 24626 183542 289689 199824 130088 120548
$$ packed form
22437D601j28442O918k67186J08301K07427J51768K0455n9206j05820q1933J78403
22426C5286J27230K0707J6165j36882p5784J12400N5697k6435p1208k4466j3063
22415A9647j55109l5303J84161K23160j654o5921l551j39053M878N4153n7550
22404B7858m7811j08280P2510R3868j0055m6762j54306M1814j24768J19174J54446
22393A7688P6054J25149m7648j56830k28726n2201n9922L1654q1464O327j0093
22382c80012J08978J25739N7447j3709M713M1953K59425K9049j9212L9872j32671
22371A21572j96130j17622R5379P9832j22680q4730M1076O8207J36290k9055M5022
22360C7161J16557K8431p6405r1089j9255K9226J58916J06147q9865o9736r540
$$ plain form
22349 120548 -15201 -212270 -142326 -75536 -69477 -88374 -2209 -97775 26999 80308 11558
22338 11558 -114049 -184641 -205958 -200014 -131045 -139733 -155887 -217587 -268750 -224643 -163414 -127888
22326 -127888 -108513 -85455 34956 -79781 -101085 -160512 -168219 13653 117330 142781 33804
22315 33804 -148294 -146739 -226140 -233482 -206479 -313666 -256093 -165382 -189593 -230468 -163251 -233331
22303 -233331 -120122 -51339 -69380 -67344 -82999 809 6701 28892 29519 -29111 13025 26344
22291 26344 28833 -36767 25543 82014 221290 43604 157112 114298 -10995 -177670 -207116
22280 -207116 -179980 -139339 30709 27040 185190 37183 -56843 -21633 5724 130412 70837
22269 70837 21165 20083 -63648 -197306 -285299 -146897 -137999 -172851 -51629 7513 77026
$$ packed form
22349A20548j35749j97069O9944O6790O059j8897Q6165r5566J24774N3309o8750
22338A1558j25607p0592k1317N944O8969q688j6154o1700n1163M4107O1229L5526
22326a27888J9375K3058J20411j14737k1304n9427p707J81872J03677K5451j08977
22315C3804j82098J555p9401p342K7003j07187N7573R0711k4211m0875O7217p0080
22303b33331J13209O8783j8041K036j5655Q3808N892K2191O27n8630M2136J3319
22291B6344K489o5600O2310N6471J39276j77686J13508m2814j25293j66675k9446
22280b07116K7136M0641J70048l669J58150j48007r4026L5210K7357J24688n9575
22269G0837m9672j082q3731j33658q7993J38402Q898l4852J21222N9142O9513
$$ plain form
22258 77026 76248 -42111 -58048 -13101 -68463 -8479 -41464 -56698 6167 -51279 31696 165973
22246 165973 107220 -71472 -19695 -138887 -168121 -186073 -6435 95420 50620 82043 60247
22235 60247 -63833 12300 103662 21331 4924 -24390 -30977 7172 45176 -14016 -84439 -80723
22223 -80723 -33775 30975 -86870 -111272 -29039 56818 1763 -45698 -60567 -5717 -81660
22212 -81660 -314761 -382066 -380224 -169507 -98812 -155282 -126716 94784 258894 149645 -67435
22201 -67435 -110582 -130257 -61407 49037 70182 -120726 -11107 175006 220191 12499 -186850
22190 -186850 -246057 -243736 -106079 52 150575 137143 115165 116149 -21927 -192390 -69748
22179 -69748 -200351 -214020 -114121 20888 144653 47701 -1946 4343 -81514 -193866 -220613
$$ packed form
22258G7026p78j18359j5937M4947n5362N9984l2985j5234O2865n7446Q2975J34277
22246A65973n8753j78692N1777j19192k9234j7952J79638J01855m4800L1423k1796
22235F0247j24080P6133R1362q2331j6407k9314o587L8149L8004n9192p0423L716
22223h0723M6948O4750j17845k4402Q2233Q5857n5055m7461j4869N4850p5943
22212h1660k33101o7305J842K10717P0695n6470K8566K21500J64110j09249k17080
22201f7435m3147j9675O8850J10444K1145j90908J09619J86113M5185k07692j99349
22190a86850n9207K321J37657J06131J50523j3432k1978R84j38076j70463J22642
22179f9748j30603j3669R9899J35009J23765r6952m9647O289q5857j12352k6747
$$ plain form
22168 -220613 -139495 -57003 -124348 -196485 -155221 -173638 -186405 -208401 -340538 -274658 24968
22157 24968 203316 72845 1998 -22317 91244 90636 36096 145564 137929 84805 -108775
22146 -108775 -318548 -317043 -247898 -298543 -248127 -205772 -247255 -117022 25611 21924 -187929
22135 -187929 -440043 -323000 -363448 -329648 -108758 -17824 -72805 -110401 -14584 -100710 -216000
22124 -216000 -172691 -198909 -273744 -276155 -234125 -96494 -102028 -85787 -106667 -169413 -88135 39942
22112 39942 56067 19718 61347 118953 177849 162049 196407 89403 13133 -81195 -292230
22101 -292230 -177787 -82950 4527 51581 94379 -72512 -47682 22451 104100 98888 95536
22090 95536 65753 246968 266365 -3526 -266577 -186795 -29645 -79371 -31 48959 -44668
$$ packed form
22168b20613Q1118Q2492o7345p2137M1264j8417j2767k1996j32137O5880K99626
22157B4968J78348j30471p0847k4315J13561o08n4540J09468p635n3124j93580
22146a08775k09773J505O9145n0645N0416M2355m1483J30233J42633l687k09853
22135a87929k52114J17043m0448L3800K20890R0934n4981l7596R5817q6126j15290
22124b16000M3309k6218p4835k411M2030J37631n534J6241k0880o2746Q1278J28077
22112C9942J6125l6349M1629N7606N8896j5800L4358j07004p6270r4328k11035
22101b92230J14443R4837Q7477M7054M2798j66891K4830P0133Q1649n212l352
22090I5536k9783J81215J9397k69891k63051P9782J57150m9726P9340M8990r3627
$$ plain form
22079 -44668 3548 104109 124574 37861 35697 29711 -11279 23058 41237 111480 41662 -7062
22067 -7062 -31114 -173935 -123706 -227533 -89522 -213172 -104515 -125794 -139924 -190706 -242989
22056 -242989 -278908 -259591 -216632 -166629 -278019 -390091 -239118 45923 76852 -5856 -125581
22045 -125581 73765 221648 71478 -80176 -16275 7535 -81352 -224902 -230758 -69982
22035 -69982 85268 96206 -47878 -77749 39790 12817 22205 -75431 8439 55787 82264
22024 82264 105705 100048 5991 -187011 -144285 -288252 -392356 -144026 56400 -121310 -195556
22013 -195556 -154809 -140217 -150373 -276389 -345373 -158718 -153384 -238895 -136975 -146800 -82635
22002 -82635 -28005 -49203 -31921 -136605 -198941 -159009 -81573 12590 -22551 -91263 -57581
$$ packed form
22079d4668M8216J00561K0465q6713k164n986m0990L4337J8179P0243o9818m8724
22067g062k4052j42821N0229j03827J38011j23650J08657k1279j4130n0782n2283
22056b42989l5919J9317M2959N0003j11390j12072J50973K85041L0929q2708j19725
22045a25581J99346J47883j50170j51654O3901K3810q8887j43550n856J60776
22035f9982J55250J0938j44084k9871J17539k6973R388r7636Q3870M7348K6477
22024H2264K3441n657r4057j93002M2726j43967j04104K48330K00426j77710p4246
22013a95556M0747J4592j0156j26016o8984J86655N334q5511J01920r825O4165
22002h2635N4630k1198J7282j04684o2336L9932P7436R4163l5141o8712L3682
$$ plain form
21991 -57581 141343 242197 236692 233404 102062 86552 -101266 -263259 -301502 -287664 -105577
21980 -105577 58088 65545 85350 22608 -116205 -95882 -115554 -185335 -32767 -156613 -174701
21969 -174701 -105882 81847 60290 5211 39140 -70575 -46419 26498 -3855 -207299 -395540
21958 -395540 -436851 -272882 -160193 -16981 149048 183599 201451 144061 92334 -43026
21948 -43026 -183564 -114424 109426 195051 230790 248131 85927 -35246 -107708 -49165 -96436
21937 -96436 -18526 24246 -161247 -247998 -290682 -505858 -487828 -250755 -143101 -65562 -16491
21926 -16491 -44006 -68306 -2521 -212388 -202437 -217887 -276045 -308492 -374500 -274022 -446516
21915 -446516 -459669 -184332 51241 -68989 -121163 -258688 -262798 -132557 17888 -46572
$$ packed form
21991e7581J98924J00854n505l288j31342j5510j87818j61993l8243J3838J82087
21980a05577J63665P457J9805o2742j38813K0323j9672o9781J52568j23846j8088
21969a74701O8819J87729k1557n5079L3929j09715K4156P2917l0353k03444j88241
21958c95540m1311J63969J12689J43212J66029L4551J7852n7390n1727j35360
21948d3026j40538O9140K23850Q5625L5739J7341j62204j21173p2462N8543m7271
21937i6436P7910M2772j85493q6751m2684k15176J8030K37073J07654P7539M9071
21926a6491k7515k4300O5785k09867R951j5450n8158l2447o6008J00478j72494
21915d46516j3153K75337K35573j20230n2174j37525m110J30241J50445o4460
$$ plain form
21905 -46572 105224 144903 217371 46546 -160087 -303144 -201917 -141400 -341595 -489407
21895 -489407 -497967 -324251 -167927 -199307 -101181 -121813 9345 153611 -28084 -78404 -153448
21884 -153448 -83418 -19712 83543 -37197 -12975 149630 83924 123858 166187 184607 43160
21873 43160 -38148 -117799 -132953 -38913 28991 205335 164707 63101 18000 -27787 -69749
21862 -69749 61025 247931 233600 163881 114899 98182 -47019 -141667 -243329 -98258 22732
21851 22732 51527 32615 -81716 -52081 104923 151168 127581 -45733 -170122 -60182 -41758
21840 -41758 28741 57079 42456 -58118 -3008 149520 209912 99628 111265 -69038 -156179
21829 -156179 -58736 -81537 -85079 -74566 -57746 -8110 -99443 -261815 -267444 -222845 -165039 -248016
$$ packed form
21905d6572J51796L9679P2468j70825k06633j43057J01227O0517k00195j47812
21895d89407q560J73716J56324l1380R8126k0632J31158J44266j81695n0320p5044
21884a53448P0030O3706J03255j20740K4222J62605o5706L9934M2329J8420j41447
21873D3160q1308p9651j5154R4040O7904J76344m0628j01606m5101m5787m1962
21862f9749J30774J86906j4331o9719m8982j6717j45201r4648j01662J45071J20990
21851B2732K8795j8912j14331K9635J57004M6245k3587j73314j24389J09940J8424
21840d1758P0499K8338j4623j00574N5110J52528O0392j10284J1637j80303q7141
21829a56179R7443k2801l542J0513J6820M9636r1333j62372n629M4599N7806q2977
$$ plain form
21817 -248016 -341801 -329030 -302208 -208916 -51499 -14903 -115773 -138567 54151 137990 -57141
21806 -57141 -82592 -55225 61087 84199 -71880 -110223 -68241 -40513 -43507 -80108 -4431
21795 -4431 90982 57524 -73321 -200788 -190743 -138254 -100770 -60631 -101988 -257269 -252319
21784 -252319 -126583 -141156 -191692 -254417 34199 336444 296582 76088 -22246 51017 29246
21773 29246 96826 199312 259044 255155 144663 40153 89772 32332 -49621 -67621 -71399
21762 -71399 -3077 90185 184179 233034 202223 322559 282540 345364 213558 142046 123541
21751 123541 70592 -17462 -166595 -248982 -79430 107243 102918 -2418 29680 127003 97738
21740 97738 83930 72148 125148 148123 121322 136867 -10458 -89324 -6547 74277 185109
$$ packed form
21817b48016r3785J2771K6822R3292J57417L6596j00870k2794J92718Q3839j95131
21806e7141k5451K7367J16312K3112j56079l8343M1982K7728k994l6601P5677
21795d431R5413l3458j30845j27467J0045N2489L7484M0139m1357j55281M950
21784b52319J25736j4573n0536o2725K88616L02245l9862k20494r8334P3263k1771
21773B9246O7580J02486N9732l889j10492j04510M9619n7440q1953j8000l778
21762g1399O8322R3262R3994M8855l0811J20336m0019O2824j31806p1512j8505
21751A23541n2949q8054j49133q2387J69552J86673m325j05336L2098R7323k9265
21740I7738j3808j1782N3000K2975k6801J5545j47325p8866Q2777Q0824J10832
$$ plain form
21729 185109 41027 -406 80647 69284 94744 259821 237411 182030 87440 -82121 -99001
21718 -99001 -117918 -177669 -67047 21824 -2566 -198377 -229347 -64469 15589 196630 214231
21707 214231 -22915 -239970 -272685 5279 76074 19241 5303 -5068 3227 199066 117059
21696 117059 -1587 -64934 -37706 -105092 -114224 5660 4982 107448 42697 50022 -64804
21685 -64804 -51342 38671 -28270 -32593 -76183 7897 273009 317261 198131 35603 -109854
21674 -109854 -209217 -366651 -223749 -96762 6692 -110289 -119933 -265770 -220167 -99940
21664 -99940 -35213 -12647 -98973 -147704 -257505 -204403 -22751 -31006 -126565 -117138 -70148 -15557
21652 -15557 189379 460954 439580 410598 252582 55993 -80874 -187464 -237263 -146796
$$ packed form
21729A85109j44082m1433Q1053j1363K5460J65077k2410n5381r4590j69561j6880
21718i9001j8917n9751J10622Q8871k4390j95811l0970J64878Q0058J81041J7601
21707B14231k37146k17055l2715K77964P0795n6833j3938j0371Q295J95839q2007
21696A17059j18646o3347K7228o7386r132J19884o78J02466o4751P325j14826
21685f4804J3462R0013o6941m323m3590Q4080K65112M4252j19130j62528j45457
21674a09854r9363j57434J42902J26987J03454j16981r644j45837M5603J20227
21664i9940O4727K2566q6326m8731j09801N3102J81652q255r5559R427M6990N4591
21652a5557K04936K71575k1374k8982j58016j96589j36867j06590m9799R0467
$$ plain form
21642 -146796 -177721 -183112 -161086 -191014 -124476 -92665 -152788 -290938 -269359 -173480 -126158
21631 -126158 -33366 50793 55376 137842 357411 433479 307699 225854 178547 246474 95891
21620 95891 44163 75967 171022 -69397 -218649 -146225 -19519 57684 16895 -234604 -239376
21609 -239376 -97677 572 -83149 -153491 -193040 -238442 1254 248320 256188 253398 368692
21598 368692 489042 235624 165548 54732 -104778 -28822 -7521 -62968 -51472 -93679 -18814
21587 -18814 30266 50103 55917 227676 203936 64525 60982 64432 87360 -2661 35630 184031
21575 184031 201172 162345 51940 40886 -301 -109103 -61764 -37070 -53332 -54024 -96498
21564 -96498 -204768 -303502 -342892 -134265 67518 94973 -35027 -189251 -86038 -125500
$$ packed form
21642a46796l0925n391K2026k9928O6538L1811o0123j38150K1579R5879M7322
21631a26158R2792Q4159M583Q2466K19569P6068j25780q1845m7307O7927j50583
21620I5891n1728L1804R5055k40419j49252P2424J26706P7203m0789k51499m772
21609b39376J41699R8249q3721p0342l9549m5402K39696K47066P868k790J15294
21598C68692J20350k53418p0076j10816j59510P5956K1301n5447J1496m2207P4865
21587a8814M9080J9837N814J71759k3740j39411l543L450K2928r0021L8291J48401
21575A84031J7141l8827j10405j1054m1187j08802M7339K4694j6262o92m2474
21564i6498j08270r8734l9390K08627K01783K7455j30000j54224J03213l9462
$$ plain form
21554 -125500 -199677 -190803 -397247 -325448 -259392 -228067 -340178 -333039 -375125 -238111 -196211
21543 -196211 -45701 248113 330245 62143 -59209 -18780 -117344 -201900 -36822 11352
21533 11352 -225293 -148547 -132822 -149265 9263 -57377 -90533 3581 52399 81919 185600
21522 185600 261408 132472 211607 261971 65976 -158499 1406 71463 46782 86708 108431
21511 108431 168344 70182 159943 258146 174459 231306 218618 215143 154549 32706 25543 75368
21499 75368 57019 153677 207274 56598 154500 66142 20448 145572 146961 172483 221595
21488 221595 223774 157002 71655 96757 25289 -28967 -131845 -140955 -84347 -2793 122521
21477 122521 61843 -69817 -82477 -63027 -278838 -348546 -165701 -21394 12082 -90101
$$ packed form
21554a25500p4177Q874k06444P1799O6056L1325j12111P139m2086J37014M1900
21543a96211J50510K93814Q2132k68102j21352M0429r8564q4556J65078M8174
21533A1352k36645P6746J5725j6443J58528o6640l3156R4114M8818K9520J03681
21522A85600P5808j28936P9135N0364j95995k24475J59905P0057k4681L9926K1723
21511A08431N9913r8162Q9761R8203q3687N6847j2688l475o0594j21843p163M9825
21499G5368j8349R6658N3597j50676R7902q8358m5694J25124J389K5522M9112
21488B21595K179o6772q5347K5102p1468n4256j02878r110N6608Q1554J25314
21477A22521o0678j31660j2660J9450k15811o9708J82845J44307L3476j02183
$$ plain form
21467 -90101 -186430 -61570 184889 121906 -123937 -213656 -204636 -211795 -127990 -93649 -152292
21456 -152292 -160532 -241267 -246863 -79123 -120574 -46093 96156 103182 42417 40136 -132093 -62902
21444 -62902 -24865 -38608 -67952 -108632 -116287 -151553 -136298 -105747 -207294 -179965 -72749
21433 -72749 70608 119820 268195 281395 237240 207347 137277 1199 -219889 -201189 -277431
21422 -277431 -269854 -240271 -167218 -197017 -26077 5009 -56875 -47081 -47176 -27352 101947 144910
21410 144910 217210 122746 4773 -146634 -28868 74951 104565 358842 477316 326224
21400 326224 213132 269414 124825 27053 588 22943 111363 -52104 -240533 -306418 -186618
21389 -186618 -36191 -30572 -50096 173806 340221 369739 290339 178021 -109909 -251325
$$ packed form
21467i0101r6329J24860K46459o2983k45843q9719R020p159Q3805L4341n8643
21456a52292q240q0735n596J67740m1451P4481J42249P026o0765k281j72229O9191
21444f2902L8037j3743k9344m0680p655l5266J5255L0551j01547K7329J07216
21433g2749J43357M9212J48375J3200m4155k9893p0070j36078k21088J8700p6242
21422b77431P577K9583P3053k9799J70940L1086o1884R794r5J9824J29299M2963
21410A44910P2300r4464j17973j51407J17766J03819K9614K54277J18474j51092
21400C26224j13092N6282j44589r7772k6465K2355Q8420j63467j88429o5885J19800
21389a86618J50427N619j9524K23902J66415K9518p9400j12318k87930j41416
$$ plain form
21379 -251325 -261860 -201875 -146355 -84521 -125144 -260496 -283566 -224787 2508 74962 18077
21368 18077 31717 -134554 -101809 30591 17201 66557 32224 -49098 -97595 66224 171894
21357 171894 225286 235725 132598 -9717 -51835 -55067 -1763 -34980 -35520 47504 -6465 82085
21345 82085 135916 290381 271435 138317 89410 -73356 -149275 -66347 35584 20734 -130358
21334 -130358 -276873 -245439 -197560 -154904 -95919 -13203 -22099 98380 -78504 -64312 124163
21323 124163 246774 292249 249334 147992 4572 -59571 -78583 43798 -30871 -86902 -83866
21312 -83866 -189573 -228496 -120848 -131100 -83850 -120221 -110325 -283045 -259347 -58143 65440
21301 65440 -13421 -36249 -47495 -155128 -187591 -256296 -209500 -79874 54758 113678 56343
$$ packed form
21379b51325j0535N9985N5520O1834m0623j35352k3070N8779K27295P2454n6885
21368A8077J3640j66271L2745J32400j3390M9356l4333q1322m8497J63819J05670
21357A71894N3392J0439j03127j42315m2118l232N3304l3217n40Q3024n3969Q8550
21345H2085N3831J54465j8946j33118m8907j62766p5919Q2928J01931j4850j51092
21334a30358j46515L1434M7879M2656N8985Q2716q896J20479j76884J4192J88475
21323A24163J22611M5475m2915j01342j43420o4143j9012J22381p4669n6031L036
21312h3866j05707l8923J07648j0252M7250l6371R896j72720K3698K01204J23583
21301F5440p8861k2828j1246j07633l2463o8705M6796J29626J34632N8920n7335
$$ plain form
21290 56343 -45755 -86078 -136049 -73912 20378 -53269 -38000 -18598 -65740 8429 44305
21279 44305 77511 57357 44312 20246 -93202 -191376 -165491 -337550 -311200 -285091 -215853
21268 -215853 -146764 -212830 -96178 -93768 -129935 -59599 3060 153696 220000 -123117 -150864
21257 -150864 -26024 274133 303072 218517 59551 43240 145784 103707 19704 -191537
21247 -191537 -185727 -74076 152046 263307 152987 165468 196358 160443 215681 160547 98484
21236 98484 123481 14263 -206041 -268049 -201015 -137007 1940 136441 255347 69923
21226 69923 -49145 -203710 -111157 -36326 86318 126860 156836 275248 216602 122783 33951
21215 33951 77450 87079 80235 42164 -80844 4891 45241 -60163 -108456 -67427 53150
$$ packed form
21290E6343j02098m0323m9971O2137R4290p3647J5269J9402m7142P4169L5876
21279D4305L3206k0154j3045k4066j13448r8174K5885j72059K6350K6109O9238
21268b15853O9089o6066J16652K410l6167P0336O2659J50636O6304l43117k7747
21257a50864J24840L00157K8939q4555j58966j6311J02544m2077q4003k11241
21247a91537N810J11651K26122J11261j10320J2481L0890l5915N5238n5134o2063
21236I8484K4997j09218k20304o2008O7034O4008J38947J34501J18906j85424
21226F9923j19068j54565R2553P4831J22644M0542K9976J18412n8646r3819q8832
21215C3951M3499R629o844l8071j23008Q5735M0350j05404m8293M1029J20577
$$ plain form
21204 53150 16840 -42170 -104856 -136932 -238686 -198133 -134174 -74467 48610 145992 -65736
21193 -65736 -174022 -64806 4737 17416 -135268 -122102 27004 59708 -40403 -106675 -37146
21182 -37146 -9610 -93269 -21141 222609 118825 146167 22101 26632 -43401 -103521 -88222
21171 -88222 -72541 -5060 -23800 -238 -62099 -77662 -85376 -38365 -108293 -165155 -137907 -31727
21159 -31727 96669 14044 -120281 -262474 -198615 -196308 -294432 -222237 -248865 -58335 211648
21148 211648 122047 -38411 -62892 -166509 -82451 58170 18348 168815 89903 42297 18100
21137 18100 72856 46057 -24432 195231 136317 104021 76059 -81789 -16604 81817 130422
21126 130422 -5490 -98843 -136779 -42710 21915 141036 241712 287692 270019 152107 112325
$$ packed form
21204E3150l6310n9010o2686l2076j01754M0553O3959N9707J23077R7382k11728
21193f5736j08286J09216O9543J2679j52684J3166J49106L2704j00111o6272O9529
21182c7146K7536q3659P2128K43750j03784K7342j24066M531p0033o0120J5299
21171h8222J5681O7481j8740K3562o1861j5563p714M7011o9928n6862K7248J06180
21159c1727J28396q2625j34325j42193O3859K307r8124P2195k6628J90530K69983
21148B11648q9601j60458k4481j03617Q4058J40621l9822J50467p8912m7606k4197
21137A8100N4756k6799p0489K19663n8914l2296k7962j57848O5185R8421M8605
21126A30422j35912r3353l7936R4069O4625J19121J00676M5980j7673j17912l9782
$$ plain form
21115 112325 -32140 -330861 -423952 -90160 -82817 -191806 -313077 -221446 -60667 1658
21105 1658 48447 67026 22775 3903 -78344 -137335 -241117 -267599 -255424 -103010 -86340
21094 -86340 3784 -77928 -153835 -109009 -166771 -227945 -143429 -117590 -165143 -365859 -329403
21083 -329403 -46164 22940 -59192 -6993 -43183 -8713 59499 76041 138428 124830 16039
21072 16039 -41068 -47308 -38940 -269303 -284295 -98999 -125715 -199497 -136751 -80268 -107874 -119396
21060 -119396 -154453 -167722 -101005 -208354 -221304 -230806 -134693 -117133 -244379 -301653 -145732
21049 -145732 44300 113058 34093 47378 113328 72013 112985 142561 193009 57849 7928
21038 7928 43442 -7925 -2844 25496 -116808 -182949 -277228 -440301 -488082 -302176 -166025
$$ packed form
21115A12325j44465k98721r3091L33792P343j08989j21271R1631J60779O2325
21105A658M6789J8579m4251j8872q2247n8991j03782k6482J2175J52414J6670
21094h6340R0124q1712p5907M4826n7762o1174Q4516K5839m7553k00716L6456
21083c29403K83239O9104q2132N2199l6190L4470O8212J6542O2387j3598j08791
21072A6039n7107o240Q368k30363j4992J85296k6716p3782O2746N6483k7606j1522
21060a19396l5057j3269O6717j07349j2950r502R6113J7560j27246n7274J55921
21049a45732J90032O8758p8965J3285O5950m1315M0972K9576N0448j35160m9921
21038G928L5514n1367N081K8340j42304o6141r4279j63073m7781J85906J36151
$$ plain form
21027 -166025 -211639 -168480 43524 53842 15189 -61190 59573 171917 27821 -41733 -69540
21016 -69540 -45232 56408 157952 60302 -17854 19156 -25878 -23150 -52600 -112266 -111399 38206
21004 38206 87435 144363 55209 100522 150148 165064 71804 67233 126142 68281 164143 203581
20992 203581 175830 15906 6249 25499 17138 16835 68517 46318 175281 196192 211925 176443
20980 176443 141008 227015 286230 100383 -20008 112546 302676 213738 138461 96243 67991
20969 67991 -23517 71489 131770 32124 119081 140817 85193 53224 -27115 45989 -99232
20958 -99232 -198818 -233162 -243031 -214763 -164084 -55755 181810 40456 -238845 -209975 -72026
20947 -72026 -7134 15506 -98395 -142050 -44057 50103 -15645 -63523 -211280 -214048 -180514
$$ packed form
21027a66025m5614M3159K12004J0318l8653p6379J20763J12344j44096o9554k7807
21016f9540K4308J01640J01544r7650p8156L7010m5034K728k9450n9666Q67J49605
21004C8206M9229N6928q9154M5313M9626J4916r3260m571N8909n7861R5862L9438
20992B03581k7751j59924r657J9250q361l03N1682k2199J28963K0911J5733l5482
20980A76443l5435Q6007N9215j85847j20391J32554J90130q8938p5277m2218k8252
20969F7991r1508R5006O0281r9646Q6957K1736n5624l1969q0339P3104j45221
20958i9232r9586l4344r869K8268N0679J08329K37565j41354k79301K8870J37949
20947g2026O4892K2640j13901m3655R7993R4160o5748m7878j47757k768L3534
$$ plain form
20936 -180514 -109487 -85253 -53367 -32877 -51876 28279 54869 -249 16409 94397 -47220
20925 -47220 -142129 -28503 105886 115272 31957 -53903 -167750 -150786 23205 98452 83850
20914 83850 37338 71839 75122 166149 197393 188263 52641 23391 -172910 -209735 -19575
20903 -19575 -2758 -220883 -200414 -297744 -226034 -15373 -14167 -74937 50180 4455 22031
20892 22031 142879 149048 -59043 -29055 -37371 -92988 142932 198521 35759 -37075 -72971
20881 -72971 -197366 -50046 -1190 -37868 -189697 -325375 -309005 -102630 -25844 -19533 22515
20870 22515 -81544 -6736 -48454 -68682 -74551 -172906 -180720 -104652 -59243 -92966 -282558 -282642
20858 -282642 -271055 -246770 -142899 10272 118397 42310 -116430 -223441 -147395 52103
$$ packed form
20936a80514P1027K4234L1886K0490j8999Q0155K6590n5118J6658P7988j41617
20925d7220r4909J13626J34389R386q3315q5860j13847J6964J73991P5247j4602
20914H3850m6512L4501L283R1027L1244r130j35622k9250j96301l6825J90160
20903a9575J6817k18125K0469r7330P1710K10661J206o0770J25117m5725J7576
20892B2031J20848O169k08091K9988q316n5617K35920N5589j62762p2834l5896
20881g2971j24395J47320M8856l6678j51829j35678J6370K06375P6786O311M2048
20870B2515j04059P4808m1718k0228n869r8355p814P6068M5409l3723j89592q4
20858b82642J1587K4285J03871J53171J08125p6087j58740j07011P6046J99498
$$ plain form
20848 52103 229710 200487 -162339 -275220 -133244 52733 108157 41990 -112986 -290642
20838 -290642 -192142 18108 77992 134330 132713 -100926 -29300 -90762 -181881 -129386 -58833
20827 -58833 9713 20261 -80690 -459 141858 158321 288060 330630 230283 5577 -55778
20816 -55778 59220 66601 125299 124809 146939 212292 86723 54433 139758 69322 -159945 -74732
20804 -74732 46436 184836 273211 230388 96620 114312 106701 84711 25529 28505 221176
20793 221176 404717 288731 138798 -575 -70216 -84804 145304 185086 161273 14296
20783 14296 -204308 -123763 55856 57967 104230 -66260 -62826 -11879 14750 118542 135591
20772 135591 120324 2625 -70697 10080 100978 -13351 -112389 31848 60514 186005 218383
$$ packed form
20848E2103J77607k9223l62826j12881J41976J85977N5424o6167j54976j77656
20838b90642R8500K10250N9884N6338j617k33639P1626o1462r1119N2495P0553
20827e8833O8546J0548j00951Q0231J42317J6463J29739M2570j00347k24706o1355
20816e5778J14998P381N8698m90K2130O5353j25569l2290Q5325p0436k29267Q5213
20804g4732J21168J38400Q8375m2823j33768J7692p611k1990n9182K976J92671
20793B21176J83541j15986j49933j39373o9641j4588K30108L9782k3813j46977
20783A4296k18604Q0545J79619K111M6263j70490L434N0947K6629J03792J7049
20772A35591j5267j17699p3322Q0777R0898j14329r9038J44237K8666J25491L2378
$$ plain form
20761 218383 71371 -20497 45968 105603 147933 -39998 -181132 -303388 -500073 -372280
20751 -372280 -341066 -360590 -307710 -253659 -137363 -103610 -144684 -31413 146678 224339 287332
20740 287332 307928 219562 186728 151122 60827 -7654 78135 236881 201344 93635 115878
20729 115878 78742 67675 44974 -71545 180845 255157 168405 -12384 168445 331785
20719 331785 162935 132 -20358 67552 72073 -39069 -60298 66860 -67276 -160250 -59597
20708 -59597 -2595 30317 119663 24348 -45525 -110156 -93181 -135221 66550 147800 -113435
20697 -113435 -194501 -149115 -1024 140965 183976 191029 280334 260830 190238 138565 257883
20686 257883 376649 288819 210264 83760 -114608 -178488 -225141 -257238 -212661 3068 181083
$$ packed form
20761B18383j47012r1868O6465N9635M2330j87931j41134j22256j96685J27793
20751c72280L1214j9524N2880N4051J16296L3753m1074J13271J78091P7661O2993
20740B87332K0596q8366l2834l5606r0295o8481Q5789J58746l5537j07709K2243
20729A15878l7136j1067k2701j16519K52390P4312q6752j80789J80829J63340
20719C31785j68850j62803k0490Q7910M521j11142k1229J27158j34136r2974J00653
20708e9597N7002L2912Q9346r5315o9873o4631J6975m2040K01771Q1250k61235
20697a13435q1066M5386J48091J41989M3011P053Q9305j9504p0592n1673J19318
20686B57883J18766q7830p8555j26504j98368o3880m6653l2097M4577K15729J78015
$$ plain form
20675 181083 98549 147623 194308 114177 156501 221169 116005 -24501 -157404 -191763 -132027
20664 -132027 -192067 -235245 -260585 -182983 11111 52817 -41143 -71042 -78516 -29115 198873
20653 198873 278505 229233 138569 241258 218660 3720 -184370 -67112 -20199 -18532 -79904
20642 -79904 -205377 -266578 -267128 -194622 -204590 -208999 -314459 -250087 12609 -10856 5232 -111667
20630 -111667 -260708 -102422 190165 196953 183774 356757 448229 392418 284978 184863
20620 184863 101348 34572 -77282 -46044 -34490 100035 308390 358658 77193 -105938
20610 -105938 -62057 86537 75409 -43084 -71456 -57436 65624 61814 -280967 -353363 -278324
20599 -278324 -113631 -85020 -8746 58417 112755 259850 312534 292725 303880 328037 301871
$$ packed form
20675A81083q2534M9074M6685q0131M2324O4668j05164j40506j32903l4359N9736
20664a32027o0040m3178k5340P7602J94094M1706r3960k9899p474M9401K27988
20653A98873P9632m9272r0664J02689k2598k14940j88090J17258M6913J667o1372
20642g9904j25473o1201n50P2506r968m409j05460O4372K62696k3465J6088j16899
20630a11667j49041J58286K92587O788j3179J72983R1472n5811j07440j00115
20620A84863q3515o6776j11854L1238J1554J34525K08355N0268k81465j83131
20610a05938M3881J48594j1128j18493k8372J4020J23060l810l42781p2396P5039
20599b78324J64693K8611P6274O7163N4338J47095N2684j9809J1155K4157k6166
$$ plain form
20588 301871 165306 31097 -155520 -138011 -63041 46142 -19030 -142530 -166231 7213
20578 7213 142673 56107 9744 4619 64293 49611 132229 59177 -71049 -139527 -57837 64473
20566 64473 144359 104660 -34406 8976 137774 77232 -141012 -127468 -134969 -245162 -338568
20555 -338568 -306262 -256360 -135049 95688 121516 154636 117437 -15627 20985 -48128 -88083
20544 -88083 -128524 -356771 -239343 -107058 184801 -26389 -282360 -263636 -231522 -144909
20534 -144909 -75327 48647 178074 180131 61965 23756 62770 56981 88529 50580 -43742
20523 -43742 -246858 -421088 -288199 33140 65212 133234 192363 121150 146421 378253 393791
20512 393791 162218 75698 103400 74589 77274 -30397 138797 191062 171960 171297 130131
$$ packed form
20588C01871j36565j34209j86617J7509P4970J09183o5172j23500k3701J73444
20578G213J35460q6566m6363n125N9674j4682Q2618p3052j30226o8478Q1690J22310
20566F4473P9886l9699j39066M3382J28798o0542k18244J3544p501j10193r3406
20555c38568L2306M9902J21311K30737K5828L3120l7199j33064L6612o9113l9955
20544h8083m0441k28247J17428J32285K91859k11190k55971J8724L2114Q6613
20534a44909O9582J23974J29427K057j18166l8209L9014n789L1548l7949r4322
20523d3742k03116j74230J32889L21339L2072O8022N9129p1213K5271K31832J5538
20512C93791k31573q6520K7702k8811K685j07671J69194N2265j9102o63m1166
$$ plain form
20501 130131 21002 70355 190835 121147 39813 -69116 -102869 67681 -39727 -128129
20491 -128129 -206301 -118391 107933 258345 248570 59605 -115482 -169940 5632 86212 -42858
20480 -42858 -326394 -233397 -251568 -231686 54354 190173 13107 12712 9607 -85966 68964
20469 68964 226269 -41877 19832 74971 -204208 -214525 -345334 -341545 -215336 -81584 51252
20458 51252 86886 -43373 -22429 53541 47804 -148237 -150462 -80120 -12958 68796 43127 7333
20446 7333 -90461 5741 63293 39911 -62354 -21478 -72218 -83597 -163254 -240212 -249811 -207676
20434 -207676 -118608 1006 1638 753 -94435 -70826 -120966 -101616 -132222 -106446 71152 131693
20422 131693 149316 197614 105257 -55717 -108411 -88004 49002 195625 101822 44282 20957
$$ packed form
20501A30131j09129M9353J20480o9688q1334j08929l3753J70550j07408q8402
20491a28129p8172Q7910K26324J50412r775j88965j75087n4458J75572Q0580j29070
20480d2858k83536R2997j8171J9882K86040J35819j77066l95l105r5573J54930
20469F8964J57305k68146O1709N5139k79179j0317j30809L789J26209J33752J32836
20458E1252L5634j30259K0944P5970n737j96041k225P0342O7162Q1754k5669l5794
20446G333r7794R6202N7552k3382j02265M0876n0740j1379p9657p6958r599M2135
20434b07676Q9068J19614O32q85r5188K3609n0140J9350l0606K5776J77598O0541
20422A31693J7623M8298r2357j60974n2694K0407J37006J46623r3803n7540k3325
$$ plain form
20411 20957 129161 -6172 -158216 -140317 -30154 128992 128865 109889 176348 133451 16561
20400 16561 -131273 -152563 946 202110 269987 217337 227877 242655 227053 223980 169986
20389 169986 113266 21573 -127591 -80284 108149 105694 7074 82843 42761 149235 221481
20378 221481 75814 -55846 -58091 104492 -11716 -51784 -8269 73832 -86860 -267781
20368 -267781 -35871 31429 158345 185671 205457 246336 202464 14869 7583 -99471 -139891
20357 -139891 -207354 -281357 -312806 -283621 -257017 -97898 53032 69866 50409 -15407 -108080
20346 -108080 -156404 -133752 -11250 204818 233878 71263 -84070 -154641 -214661 -239016 -95775
20335 -95775 -183487 -202106 -68473 -36015 -81721 -5425 64836 3497 11013 -94908 -34951
$$ packed form
20411B0957J08204j35333j52044J7899J10163J59146j27j8976O6459m2897j16890
20400A6561j47834k1290J53509K01164O7877n2650J0540J4778j5602l073n3994
20389A69986n6720r1693j49164M7307J88433k455r8620P5769m0082J06474P2246
20378B21481j45667j31660k245J62583j16208m0068M3515Q2101j60692j80921
20368b67781K31910O7300J26916K7326J9786M0879m3872j87595p286j07054m0420
20357a39891o7463p4003l1449K9185K6604J59119J50930J6834j9457o5816r2673
20346a08080m8324K2652J22502K16068K9060j62615j55333p0571o0020k4355J43241
20335i5775q7712j8619J33633L2458m5706P6296P0261o1339P516j05921N9957
$$ plain form
20324 -34951 71527 11829 -13925 -75934 -123906 -10190 -140997 -255414 -136693 -87006 -5095
20313 -5095 -135709 97120 53622 -1469 -100848 -170921 19932 87507 135002 171201 195866
20302 195866 157074 106335 148411 272705 304992 170715 139491 259782 55461 27194 -17531
20291 -17531 -23481 -94845 -154430 12059 24617 -116670 -63382 -133846 -342336 -390844 -342058
20280 -342058 -166000 -41396 -30957 9631 100291 66423 -93753 -65399 -87310 -209021 -351823
20269 -351823 -279299 -82392 -102883 71751 249338 162175 3854 98134 170857 109115 33619
20258 33619 -31235 7950 93293 80106 130039 243521 142322 172599 104632 241581 305272
20247 305272 340688 345870 250457 206694 226282 -17959 -92140 -37163 -39005 176088 263043
$$ packed form
20324c4951J06478n9698k5754o2009m7972J13716j30807j14417J18721M9687Q1911
20313e095j30614K32829m3498n5091r9379p0073J90853O7575M7495L6199K4665
20302A95866l8792n0739M2076J24294L2287j34277l1224J20291k04321k8267m4725
20291a7531n950p1364n9585J66489J2558j41287N3288p0464k08490m8508M8786
20280c42058J76058J24604J0439M0588R0660l3868j60176K8354k1911j21711j42802
20269c51823P2524J96907k0491J74634J77587q7163j58321R4280P2723o1742p5496
20258C3619o4854L9185Q5343j3187M9933J13482j01199L0277o7967J36949O3691
20247C05272L5416N182r5413m3763J9588k44241p4181N4977j842K15093Q6955
$$ plain form
20236 263043 314467 458131 337881 163659 107997 103996 177480 127414 18680 -130886 -154537
20225 -154537 -3338 55313 30938 -113694 -73054 -122862 -178361 -13759 336237 222491
20215 222491 155549 160230 -15145 -95616 -33154 143504 105800 148144 238591 155686 -73353
20204 -73353 -30182 -73572 -83665 -27547 -58041 -116688 -186978 -162250 -144571 -120994 -50294 95500
20192 95500 111829 104555 115861 -34251 -125053 -183803 -213283 -176490 -255521 -225061 -44955
20181 -44955 117054 35847 -118971 -109403 -97370 -74664 50236 88457 6594 14606 81294
20170 81294 262495 376737 266207 155729 24229 -87993 -217830 -309022 -93009 -72868
20160 -72868 -49686 -73450 -29526 190390 242537 334440 201484 245934 240862 -1257 -147027
$$ packed form
20236B63043N1424J43664j20250j74222n5662m001P3484n0066j08734j49566k3651
20225a54537J51199N8651k4375j44632M0640m9808n5499J64602L49996j13746
20215B22491o6942M681j75375q0471O2462J76658l7704M2344R0447q2905k29039
20204g3353M3171m3390j0093N6118l0494n8647p0290K4728J7679K3577P0700J45794
20192I5500J6329p274J1306j50112r0802n8750k9480L6793p9031L0460J80106
20181d4955J62009q1207j54818R568J2033K2706J24900L8221q1863Q012O6688
20170H1294J81201J14242j10530j10478j31500j12222j29837r1192K16013K0141
20160g2868K3182k3764M3924K19916N2147R1903j32956M4450n072k42119j45770
$$ plain form
20149 -147027 -171522 -68162 -26015 137455 219280 96985 -56698 -32214 -48426 -80384 16162
20138 16162 37076 49444 143436 145326 240151 263283 181109 106600 92783 59391 114436 160375
20126 160375 1215 -33766 -162504 -195220 -137558 -28296 81389 112387 -87232 -169502
20116 -169502 -123945 -187731 -268192 -160699 152522 248198 178251 213695 223197 210526 282429
20105 282429 195955 152796 -3874 -142408 -116054 151823 308168 193245 1656 123312
20095 123312 60470 26665 36272 46807 2258 -7135 100677 118463 18029 -30778 -255949
20084 -255949 -329009 -279195 -256486 -161920 -106510 -373366 -390856 -180238 69034 284827 344029
20073 344029 139320 -65215 -132004 -270240 -331304 -419648 -307423 -257931 -65477 -65719 -86605
$$ packed form
20149a47027k4495J03360M2147J63470Q1825j22295j53683K4484j6212l1958R6546
20138A6162K0914J2368R3992J890R4825K3132q2174p4509j3817l3392N5045M5939
20126A60375j59160l4981j28738l2716N7662J09262J09685L0998j99619q2270
20116a69502M5557o3786q0461J07493L13221R5676o9947L5444R502j2671P1903
20105B82429q6474m3159j56670j38534K6354K67877J56345j14923j91589J21656
20095A23312o2842l3805R607J0535m4549r393J07812J7786j00434m8807k25171
20084b55949p3060M9814K2709R4566N5410k66856j7490K10618K49272K15793N9202
20073C44029k04709k04535o6789j38236o1064q8344J12225M9492J92454k42k0886
$$ plain form
20062 -86605 -169877 -119960 -114095 -26966 17901 -102037 -110600 -94642 12196 186068 252834
20051 252834 70556 -25086 -21876 82827 42151 12694 127118 149533 22004 121096 -65547
20040 -65547 -160195 -88845 -140171 -168793 -264072 -285141 -135708 -226936 -207507 -120118 -214301
20029 -214301 -246616 -17327 1635 -77197 -164281 -183687 -146070 -93007 -47294 -138295 46883
20018 46883 222885 -26963 -310292 -136385 -167540 -175646 -127795 -131848 -151139 -45710 33065
20007 33065 -35815 -137906 -221666 -390872 -271732 -183782 -177968 -149752 -161287 -71158 -144222
19996 -144222 -205691 -184393 -232720 -259854 -247371 -189887 -198762 -194135 -80725 -18232 -125573
19985 -125573 67394 66680 -117837 -117923 -63382 82564 78343 84526 75870 4649 40735 111856
$$ packed form
20062h6605q3272M9917N865Q7129M4867j19938q563J5958J06838J73872O6766
20051B52834j82278r5642L210J04703m0676k9457J14424K2415j27529R9092j86643
20040f5547r4648P1350n1326k8622r5279k1069J49433r1228J9429Q7389r4183
20029b14301l2315K29289J8962p8832q7084j9406L7617N3063M5713r1001J85178
20018D6883J76002k49848k83329J73907l1155q106M7851m053j9291J05429P8775
20007C3065o8880j02091q3760j69206J19140Q7950N814K8216j1535R0129p3064
19996a44222o1469K1298m8327k7134J2483N7484q875M627J13410O2493j07341
19985a25573J92967p14j84517q6N4541J45946m221O183q656p1221L6086P1121
$$ plain form
19973 111856 25515 -128358 -219593 -288357 -189371 -197509 -93340 56116 47389 66669 107597
19962 107597 95637 95870 136849 102368 184864 258283 232091 198076 122904 37733 86758 37858
19950 37858 -29334 -83843 -146361 -148573 -105536 79092 286153 268720 96891 -45169 -134161
19939 -134161 61669 216894 24730 -108407 -29806 4026 -35465 -48458 -33448 -46995 -109896
19928 -109896 -140447 -53768 -79077 -218111 -217710 -121723 -32365 -27763 -4339 20306 119222 73453
19916 73453 -83063 87327 174521 295028 211013 55085 88148 131186 -71881 -144088 -193653
19905 -193653 -320091 -196355 -307996 -307190 -60323 33747 -117435 -12337 -62430 -99117 -102966
19894 -102966 -61204 -26791 -150828 -44428 -14925 19412 -70105 -150315 -146232 -274973 -124456
$$ packed form
19973A11856q6341j53873r1235o8764R8986q138J04169J49456q727J9280M0928
19962A07597j1960K33M0979l4481Q2496P3419k6192l4015p5172q5171M9025m8900
19950C7858o7192n4509o2518k212M3037J84628K07061j7433j71829j42060q8992
19939a34161J95830J55225j92164j33137P8601L3832l9491j2993J5010j3547o2901
19928a09896l0551Q6679k5309j39034M01R5987Q9358M602K3424K4645R8916m5769
19916G3453j56516J70390Q7194J20507q4015j55928L3063M3038k03067p2207m9565
19905a93653j26438J23736j11641Q06K46867R4070j51182J05098n0093l6687l849
19894a02966M1762L4413j24037J06400K9503L4337q9517q0210M083j28741J50517
$$ plain form
19883 -124456 46247 99110 48050 99794 145779 37243 -28998 -37420 4132 -44921 -58589
19872 -58589 -370198 -427485 -253429 -191974 -111715 77156 66482 -143563 -56316 851 -185621
19861 -185621 -135155 41029 280520 256616 218017 187987 301515 277592 142389 107771 169391
19850 169391 264212 355568 338206 260167 258740 314526 166090 -6835 66691 204254 236459
19839 236459 212481 137634 16331 82730 -23323 -376833 -504123 -443379 -183348 906
19829 906 96798 109826 7360 78182 168836 240992 281429 297804 345415 242703 195257 75886
19817 75886 230293 218275 169094 107819 35601 -81175 -161526 92554 91644 147825 103245
19806 103245 -88613 -134881 -166922 -241445 -80567 -14342 -46669 -1078 50874 148680 251981
$$ packed form
19883a24456J70703N2863n1060N1744M5985j08536o6241q422M1552m9053j3668
19872e8589l11609n7287J74056O1455Q0259J88871j0674k10045Q7247N7167j86472
19861a85621N0466J76184K39491k3904l8599l0030J13528k3923j35203l4618O1620
19850A69391R4821R1356j7362p8039j427N5786j48436j72925P3526J37563L2205
19839B36459k3978p4847j21303O6399j06053l53510j27290O0744K60031J84254
19829I06R5892J3028j02466P0822R0654P2156M0437J6375M7611j02712m7446j19371
19817G5886J54407j2018m9181o1275p2218j16776q0351K54080r10N6181m4580
19806A03245j91858m6268l2041p4523J60878O6225l2327M5591N1952R7806J03301
$$ plain form
19795 251981 209335 -10373 -18526 -100416 -128233 -10035 -15109 -9283 143624 257741 263086
19784 263086 109683 123615 297745 259994 248117 234343 -4668 -104189 -90400 -45970 -86262
19773 -86262 -18688 35564 150713 55008 119409 175410 115194 -61481 -118615 -159334 -256897
19762 -256897 -241798 -88381 -4340 32808 -114734 -118504 -76221 -67270 -123685 -127903 -91058 60062
19750 60062 159046 33798 -10310 27865 39839 44582 51034 -81450 -185073 -80542 -7903
19739 -7903 -53704 -60880 -44850 93372 -12096 -141132 -196422 -140510 -109233 -150127 -194719
19728 -194719 -353743 -236790 96122 274119 83652 67145 -88050 -71495 -17281 -57007
19718 -57007 -166572 -85019 63700 161036 158715 182878 -2411 -232291 -266934 -321523 -485986
$$ packed form
19795B51981m2646k19708q153q1890k7817J18198n074N826J52907J14117N345
19784B63086j53403J3932J74130l7751j1877j3774k39011r9521J3789M4430m0292
19773h6262O7574N4252J15149r5705O4401N6001o0216j76675n7134m0719r7563
19762b56897J5099J53417Q4041L7148j47542l770M2283Q951n6415m218L6845J51120
19750F0062R8984j25248m4108L8175J1974M743O452j32484j03623J04531P2639
19739g903m5801p176J6030J38222j05468j29036n5290N5912L1277m0894m4592
19728a94719j59024J16953L32912J77997j90467j6507j55195J6555N4214l9726
19718e7007j09565Q1553J48719R7336k321K4163j85289k29880l4643n4589j64463
$$ plain form
19707 -485986 -560772 -372720 -177735 -130707 -51884 117193 57378 43112 -30786 -25897 105726
19696 105726 176645 235503 161660 60999 103930 212650 137391 121364 83414 184591 246294
19685 246294 339397 226475 128225 152860 128191 3915 -43923 -80361 -80221 -90982 -94141 -290061
19673 -290061 -243942 16042 187218 88481 60204 118759 68281 35867 -11524 -53803 -34467
19662 -34467 102793 224533 159993 51086 91018 72335 175190 280724 260453 240294 225466
19651 225466 278091 458559 412571 69802 -42919 -6446 -62426 -34752 -187611 -323436
19641 -323436 -386568 -290868 -129436 -67585 -163789 -73976 -26236 30981 54912 129841 185803
19630 185803 257186 270081 107974 99651 35573 37369 96948 57957 -32859 -123128 -65796 -91720
$$ packed form
19707d85986p4786J88052J94985M7028P8823J69077n9815j4266p3898M889J31623
19696A05726P0919N8858p3843j00661M2931J08720p5259j6027l7950J01177O1703
19685B46294R3103j12922r8250K4635k4669j24276m7838l6438J40j0761l159j95920
19673b90061M6119K59984J71176r8737k8277N8555n0478l2414m7391m2279J9336
19662c4467J37260J21740o4540j08907L9932j8683J02855J05534k0271k0159j4828
19651B25466N2625J80468m5988l42769j12721L6473n5980K7674j52859j35825
19641c23436o3132R5700J61432O1851r6204Q9813M7740N7217K3931P4929N5962
19630A85803P1383J2895j62107q323o4078J796N9579l8991r0816r0269N7332k5924
$$ plain form
19618 -91720 -226935 -232271 -211436 -169674 -73040 -48580 113656 111664 126483 155478 365923
19607 365923 427302 355120 187253 146690 273150 174699 10282 70661 94145 4347 33272
19596 33272 -45427 -116428 -68892 32714 139395 226568 134584 239121 185607 95730 83082
19585 83082 92582 214630 223472 192757 104162 -131206 -81728 65185 121610 -36740 -31927
19574 -31927 -121143 -330450 -181068 97393 188085 88298 -41720 3357 -118791 -127374 46022
19563 46022 59079 -20294 -11487 213906 178204 118286 98842 88077 107503 202603 355205
19552 355205 332367 143011 -699 106126 145449 158405 288234 353903 114590 492
19542 492 -52769 -119762 37827 135965 315248 199243 269390 214828 58978 -23038 -25644
$$ packed form
19618i1720j35215n336K0835M1762R6634K4460J62236j992J4819K8995K10445
19607C65923O1379p2182j67867m0563J26460r8451j64417O0379K3484q9798K8925
19596C3272p8699p1001M7536J01606J06681Q7173r1984J04537n3514q9877j2648
19585H3082R500J22048Q842l0715q8595k35368M9478J46913N6425j58350M813
19574c1927q9216k09307J49382K78461R0692r9787j30018M5077j22148q583J73396
19563D6022J3057p9373Q807K25393l5702n9918j9444j0765J9426R5100J52602
19552C55205k2838j89356j43710J06825L9323J2956J29829O5669k39313j14098
19542D92n3261o6993J57589R8138J79283j16005P0147n4562j55850q2016k606
$$ plain form
19531 -25644 113110 113456 111934 148845 224604 143090 16926 -80365 -93500 -177579 -301276 -327225
19519 -327225 -329090 -408073 -331697 -225209 -147257 -40784 -28283 -65684 -33808 -227511 -365926
19508 -365926 -492290 -453982 -432645 -228438 -285569 -279923 -123900 8429 128297 102055 -117983
19497 -117983 -313716 -459659 -537423 -381994 -60423 -34716 29785 144190 149333 62559 49105
19486 49105 -117034 -305328 -312003 -216497 -43404 175285 261174 312281 328843 91574 -127590
19475 -127590 -153632 -209497 -253119 -264827 -146109 187082 228053 -42692 -246921 -263809 -165763
19464 -165763 25659 -63271 -167735 -52300 8566 118780 207419 280245 240913 237348 101425
19453 101425 132694 120235 -41950 -235177 -371113 -337975 -450533 -367715 -358786 -323907 -19339
$$ packed form
19531b5644J38754L46j522L6911P5759q1514j26164r7291j3135q4079j23697k5949
19519c27225j865p8983P6376J06488P7952J06473J2501l7401L1876j93703j38415
19508c65926j26364L8308K1337K04207n7131N646J56023J32329J19868k6242k20038
19497a17983j95733j45943p7764J55429L21571K5707O4501J14405N143q6774j3454
19486D9105j66139j88294o675R5506J73093K18689Q5889N1107J6562k37269k19164
19475a27590k6042n5865m3622j1708J18718L33191M0971k70745k04229j6888R8046
19464a65763J91422q8930j04464J15435O0866J10214Q8639P2826l9332l565j35923
19453A01425L1269j2459j62185j93227j35936L3138j12558Q2818Q929L4879L04568
$$ plain form
19442 -19339 -34073 -92482 -158409 -297548 -137546 -11624 23433 35697 28799 -6577 -62228
19431 -62228 -229096 -233561 -156702 -52329 -118349 -90502 -31170 -44836 -62847 -103125 -149151
19420 -149151 -83149 -1553 15301 134059 123595 258471 422592 278646 277553 264606 110432
19409 110432 45913 128338 148426 108009 -45665 -101661 -56912 50280 43347 93819 209956
19398 209956 223200 17453 -17141 42045 -75923 -102937 2136 -5391 -25042 2190 118752
19387 118752 52600 7425 -50401 37639 88736 191739 183454 245060 218052 161229 103208
19376 103208 108204 -18661 189034 205991 121228 165554 59678 126370 250255 166031 -34745
19365 -34745 -193406 -224893 -58397 86596 200342 251486 4790 -33840 -7589 147872
$$ packed form
19442a9339j4734n8409o5927j39139J60002J25922L5057J2264o898l5376n5651
19431f2228j66868m465P6859J04373o6020K7847N9332j3666j8011m0278m6026
19420a49151O6002Q1596J6854J18758j0464J34876J64121j43946j093j2947j54174
19409A10432o4519Q2425K0088m0417j53674n5996M4749J07192o933N0472J16137
19398B09956J3244k05747l4594N9186j17968k7014J05073p527j9651K7232J16562
19387A18752o6152m5175n7826Q8040N1097J03003q285O1606k7008n6823n8021
19376A03208M996j26865K07695J6957q4763M4326j05876O6692J23885q4224k00776
19365c4745j58661l1487J66496J44993J13746N1144k46696l8630K6251J55461
$$ plain form
19355 147872 249312 185166 181702 322686 438205 377941 292698 204592 162737 184517 107504
19344 107504 25198 22347 -52349 -130009 17113 180577 275164 317866 325199 79926 -83597
19333 -83597 -148359 84997 162633 170310 189007 148683 -20856 -45973 45851 161860 73109
19322 73109 5694 58942 112245 -198567 -240581 -185374 -123238 -29369 159011 226987 221522
19311 221522 226683 248693 237732 146910 -43422 -173215 -162078 -150342 -174783 -96351 -92152
19300 -92152 -47344 -92266 -224728 -232428 -93279 -10456 32977 -21094 87216 226841 249197
19289 249197 113091 61147 84914 73131 92536 212403 251971 224021 149540 94478 209106
19278 209106 142859 197135 322447 236204 151220 -45826 -131096 -4113 -5684 -235909 -113968
$$ packed form
19355A47872J01440o4146l464J40984J15519o0264q5243q8106m1855K1780p7013
19344A07504q2306k851p4696p7660J47122J63464R4587M2702P333k45273j63523
19333h3597o4762K33356P7636P677J8697m0324j69539k5117R1824J16009q8751
19322G3109o7415N3248N3303l10812m2014N5207O2136R3869J88380O7976n465
19311B21522N161K2010j0961r0822j90332j29793J1137J1736k4441P8432M199
19300i2152M4808m4922j32462p700J39149Q2823M3433n4071J08310J39625K2356
19289B49197j36106n1944K3767j1783J9405J19867L9568k7950p4481n5062J14628
19278B09106o6247N4276J25312q6243q4984j97046q5270J26983j571k30225J21941
$$ plain form
19267 -113968 51358 31186 86431 77952 -27994 -15919 -39503 -100942 -158931 -56908 16007
19256 16007 67161 32328 5890 291 -31497 -39739 -126121 -158008 -120255 -160034 -55120 163605
19244 163605 330221 323350 234823 239533 204102 174695 105838 81697 -57031 -228983 -92514
19233 -92514 154398 225403 41763 75149 -38095 -203062 -288832 -155501 40009 -5695
19223 -5695 -206781 -158525 130737 260623 244938 319770 345615 234846 199493 151242 37612
19212 37612 -83599 -150114 -80094 15675 94399 45029 37672 137963 228597 45810 -112559
19201 -112559 -36043 -48367 -162404 -248364 -168096 -198542 -136139 64764 111132 -66882 -247490
19190 -247490 -241281 -131747 -243310 -342359 -462668 -268362 -177790 -59165 123481 38695
$$ packed form
19267a13968J65326k0172N5245q479j05946J2075k3584o1439n7989J02023P2915
19256A6007N1154l4833k6438n599l1788q242q6382l1887L7753l9779J04914K18725
19244A63605J66616o871q8527M710l5431k9407o8857k4141j38728j71952J36469
19233i2514K46912P1005j83640L3386j13244j64967q5770J33331J95510m5704
19223e695k01086M8256K89262J29886j5685P4832K5845j10769l5353m8251j13630
19212C7612j21211o6515P0020R5769P8724m9370p357J00291R0634j82787j58369
19201a12559P6516j2324j14037q5960Q0268l0446O2403K00903M6368j78014j80608
19190b47490O209J09534j11563r9049j20309J94306R0572J18625J82646q4786
$$ plain form
19180 38695 -257650 -382331 -200106 -98707 -164084 -84208 77433 106817 24625 -45912 -95716
19169 -95716 -103792 -114738 -139202 -130680 -54522 -62103 -208440 -252076 -174503 35912 74947 -34656
19157 -34656 65743 32118 63656 97030 144437 135881 124077 183797 207396 80656 -101341
19146 -101341 -57457 29528 -66314 -43954 -62225 -103948 -101386 75351 164951 127782 134849 103883
19134 103883 32996 111743 74436 97680 156830 256745 396613 509305 437260 169272 -43214
19123 -43214 -44839 -125977 -315394 -299676 -240159 -177915 -276585 -138737 132922 122685 -46226
19112 -46226 44047 -103587 -98078 12268 152061 144623 169884 123350 -70611 -125528 73985
19101 73985 173574 79088 47653 -18106 -49120 -29737 74078 57033 17959 -46967 -131637
$$ packed form
19180C8695k96345j24681J82225J01399o5377P9876J61641K9384q2192p0537m9804
19169i5716q076j0946k4464Q522P6158p581j46337m3636P7573K10415L9035j09603
19157c4656J00399l3625L1538L3374M7407q556j1804N9720K3599j26740j81997
19146a01341M3884Q6985r5842K2360j8271m1723K562J76737Q9600l7169P067l0966
19134A03883p0887P8747l7307K3244N9150R9915J39868J12692p2045k67988k12486
19123d3214j625q1138j89417J5718N9517O2244r8670J37848K71659j0237j68911
19112d6226R0273j47634N509J10346J39793p438K5261m6534j93961n4917J99513
19101G3985R9589r4486l1435o5759l1014J9383J03815j7045l9074o4926q4670
$$ plain form
19090 -131637 69238 136926 -45846 -11619 44455 3803 -125304 -99163 69018 116150 43604
19079 43604 85120 90261 45271 9627 71756 132288 147463 92434 126116 96516 -107220 -135681
19067 -135681 -13059 9225 125410 144059 40287 82524 72805 42910 58889 15193 -26736
19056 -26736 146570 92503 146136 186247 222671 335473 312793 187738 136555 109688 60571
19045 60571 64186 -1274 50015 123943 236592 217260 178360 34590 -48847 -103724 -168647
19034 -168647 -167095 62988 281772 209508 -8999 -168988 -178637 -182721 -170634 -72571 -141926
19023 -141926 -298776 -151923 39110 107597 81519 30470 153261 206386 196384 275145 221025
19012 221025 130152 57928 -78329 -186173 -333492 -287793 -240437 -219592 -60678 -20334 25516
$$ packed form
19090a31637K00875O7688j82772L4227N6074m0652j29107K6141J68181M7132p2546
19079D3604M1516N141m4990l5644O2129O0532J5175n5029L3682k9600k03736k8461
19067a35681J22622K2284J16185J8649j03772M2237r719k9895J5979m3696m1929
19056b6736J73306n4067N3633M0111L6424J12802k2680j25055n1183k6867m9117
19045F0571L615o5460N1289P3928J12649j9332l8900j43770q3437n4877o4923
19034a68647J552K30083K18784p2264k18507j59989r649m084J2087R8063o9355
19023a41926j56850J46853J91033O8487k6078n1049J22791N3125j0002P8761n4120
19012B21025r0873p2224j36257j07844j47319M5699M7356K0845J58914M0344M5850
$$ plain form
19001 25516 44588 192192 150341 16238 152735 262172 127574 -21156 -4479 233578
18991 233578 439580 422540 315214 275700 206015 177770 109160 30860 -86779 -101899 -27016
18980 -27016 -131964 -241283 -178426 -157322 -144443 -87506 -19149 165966 229079 250269 299560
18969 299560 325808 185573 244629 306086 295746 101138 57500 -260953 -108616 -71793 75247
18958 75247 -23694 77308 102624 278361 373488 299530 184950 115636 285799 239369 175394
18947 175394 14498 -118226 -140655 -189486 -186282 -203664 -137543 94336 181657 175421 63922
18936 63922 74487 -57640 -58284 -4602 -70190 27136 45434 -25721 -90846 121581 289937
18925 289937 275404 243831 141511 128194 11403 -109831 -167082 -146649 -6552 -45900 -84740
$$ packed form
19001B5516J9072J47604m1851j34103J36497J09437j34598j48730J6677K38057
18991B33578K06002j7040j07326l9514o9685k8245o8610p8300j17639j5120P4883
18980b7016j04948j09319O2857K1104J2879N6937O8357J85115O3113K1190M9291
18969B99560K6248j40235N9056O1457j0340j94608m3638l18453J52337L6823J47040
18958G5247r8941J01002K5316J75737R5127p3958j14580o9314J70163m6430o3975
18947A75394j60896j32724k2429m8831L204j7382O6121K31879Q7321o236j11499
18936F3922J0565j32127o44N3682o5588R7326J8298p1155o5125K12427J68356
18925B89937j4533l1573j02320j3317j16791j21234n7251K0433J40097l9348l8840
$$ plain form
18914 -84740 -3054 6283 -8971 196608 269885 118153 56162 -128401 -195917 -121148 -98461
18903 -98461 -17537 -26836 -102635 -82827 11932 155281 195103 187664 178258 112178 140341 32825
18891 32825 96275 223496 217177 197690 287023 343710 196298 1236 27613 129632 3333
18880 3333 -10036 9332 76352 19178 -1939 -8324 10731 15149 63029 -116594 -145996 -22666
18868 -22666 120970 89065 55306 139408 84411 42653 -16493 27832 231291 240967 225543
18857 225543 100659 76533 84862 91946 -25634 -32724 -143127 -312795 -254081 -193771 -158167
18846 -158167 -373158 -432098 -277024 -86323 -83945 -126656 -7219 113972 89619 206972
18836 206972 39247 86574 188923 -7179 -76246 -225160 -349992 -167509 -56816 -13190
$$ packed form
18914h4740Q1686R337j5254K05579P3277j51732o1991j84563o7516P4769K2687
18903i8461Q0924r299p5799J9808R4759J43349L9822p439r406o6080K8163j07516
18891C2825O3450J27221o319j9487Q9333N6687j47412j95062K6377J02019j26299
18880C333j3369J9368O7020n7174k1117o385J9055M418M7880j79623k9402J23330
18868b2666J43636l1905l3759Q4102n4997m1758n9146M4325K03459R676j5424
18857B25543j24884k4126Q329P084j17580p090j10403j69668N8714O0310L5604
18846a58167k14991n8940J55074J90701K378m2711J19437J21191k4353J17353
18836B06972j67725M7327J02349j96102o9067j48914j24832J82483J10693M3626
$$ plain form
18826 -13190 50520 224266 158963 43419 103614 28317 -51664 -107948 -39541 23747 -68136
18815 -68136 -93114 -192942 -115244 22860 -49878 -28665 -10915 -77884 -87356 -33298 11714 -104057
18803 -104057 -225370 -182067 -192894 -260055 -197928 -48859 -100477 13975 211027 128325 72959
18792 72959 10508 -24647 59714 -107850 -276236 -101005 159473 164882 -947 -66140 21696
18781 21696 96542 221526 422488 506575 343056 343633 336847 267976 143362 83456 331953
18770 331953 615175 728768 726096 1081622 1638762 1804183 1234226 718051 421800 287607
18760 287607 271702 156925 34650 173784 25032 -69879 92349 187196 123423 166032
18750 166032 11615 -56668 61675 111580 -38136 -71825 -145597 -11342 105188 224936
$$ packed form
18826a3190O3710J73746o5303j15544O0195p5297p9981n6284O8407O3288r1883
18815f8136k4978r9828P7698J38104p2738K1213J7750o6969r472N4058M5012j15771
18803a04057j21313M3303j0827o7161O2127J49069n1618J14452J97052q2702n5366
18792G2959o2451l5155Q4361j67564j68386J75231K60478N409j65829o5193Q7836
18781B1696P4846J24984K00962Q4087j63519N77o786o8871j24614n9906K48497
18770C31953K83222J13593k672L55526N57140J65421n69957n16175k96251j34193
18760B87607j5905j14777j22275J39134j48752r4911J62228R4847o3773M2609
18750A66032j54417o8283J18343M9905j49716l3689p3772J34255J16530J19748
$$ plain form
18740 224936 253786 323550 429405 315820 67208 42317 173258 222208 278026 188525 149053
18729 149053 213605 288383 317555 417942 481959 250817 277108 191821 82254 194231 421277
18718 421277 293559 47138 49402 180009 351070 364996 371536 299693 299253 232802 73933
18707 73933 95606 26883 -1713 194049 191425 163073 107204 10274 -120467 -144399 87903
18696 87903 159921 191898 106077 -3305 6169 91601 166327 299526 182188 -7851 -8847
18685 -8847 70183 26198 199759 260686 200677 157644 293821 390234 398365 354291 248763
18674 248763 198540 92819 116277 213122 141354 62550 144663 -66560 -132517 53624 89709
18663 89709 -124289 -80773 22400 172389 299671 182592 181192 242181 239850 273225 205246
$$ packed form
18740B24936K8850O9764J05855j13585k48612k4891J30941M8950N5818q9501l9472
18729A49053O4552P4778K9172J00387O4017k31142K6291q5287j09567J11977K27046
18718D21277j27718k46421K264J30607J71061J3926O540p1843m40o6451j58869
18707G3933K1673o8723k8596J95762k624k8352n5869r6930j30741k3932K32302
18696H7903P2018L1977q5821j09382R474Q5432P4726J33199j17338j90039r96
18685h847P9030m3985J73561O0927o0009m3033J36177R6413Q131m4074j05528
18674B48763n0223j05721K3458R6845p1768p8804Q2113k11223o5957J86141L6085
18663H9709k13998M3516J03173J49989J27282j17079j400O0989k331L3375o7979
$$ plain form
18652 205246 45808 -19453 -85886 94463 51556 -61913 -64981 -112671 -49056 -212430 -442243
18641 -442243 -354329 -114756 -35513 -85980 -169645 39757 -90314 -181471 51168 30745 -63775
18630 -63775 -46780 51732 152227 208253 321800 270517 331759 302697 245412 182332 201871
18619 201871 -42026 -304540 -226451 -65534 -141841 -102444 -103119 22597 10906 -74028 48350
18608 48350 73543 29629 -45411 -33506 278 34233 65731 87314 54842 -31848 -56202 -132690
18596 -132690 35447 -33885 -34126 47223 58411 72156 97155 57088 204325 286534 122702
18585 122702 -111694 -202074 -218985 -154634 -153732 -41742 -78477 -21026 121016 117636 153166
18574 153166 229431 47050 63856 58895 47721 98761 110683 65823 49691 21610 -5708
$$ packed form
18652B05246j59438o5261o6433J80349m2907j13469l068m7690O3615j63374k29813
18641d42243Q7914K39573P9243n0467q3665K09402j30071r1157K32639k0423r4520
18630f3775J6995R8512J00495N6026J13547n1283O1242k9062n7285o3080J9539
18619B01871k43897k62514P8089J60917p6307L9397o75J25716j1691q4934J22378
18608D8350K5193m3914p5040J1905L3784L3955L1498K1583l2472q6690k4354p6488
18596a32690J68137o9332k41Q1349J1188J3745K4999m0067J47237Q2209j63832
18585A22702k34396r0380j6911O4351R02J11990l6735N7451J42042l380L5530
18574A53166P6265j82381J6806m961j1174N1040J1922m4860j6132k8081k7318
$$ plain form
18563 -5708 55838 152196 189189 160490 242505 112567 -189106 -130904 -89173 -78972 88240
18552 88240 168193 128118 164295 214880 130076 63960 -24675 -40344 -125962 -289078 -214073
18541 -214073 -116038 -122405 15922 126590 29295 132613 196547 166256 296940 245339 117191
18530 117191 34572 -125391 -157321 -190652 -271166 -247229 -134537 -194721 -335814 -131795 -135330
18519 -135330 -190945 -123011 24373 94941 -60593 -247093 -205092 -198389 -119177 6945 85173
18508 85173 82265 77774 -166695 -130359 -212998 -248176 -281261 -234238 -90384 -116790 -163713 38168
18496 38168 49222 -128116 -84929 65179 86836 52551 50282 -104167 -128237 -122764 -111879
18485 -111879 -120504 -144634 -28257 80363 96715 99827 57406 180608 129086 311434 252679
$$ packed form
18563e708O1546R6358L6993k8699Q2015j29938l01673N8202M1731J0201J67212
18552H8240P9953m0075L6177N0585q4804o6116q8635j5669q5618j63116P5005
18541b14073R8035o367J38327J10668r7295J03318O3934l0291J30684n1601j28148
18530A17191q2619j59963l1930l3331q0514K3937J12692o0184j41093K04019l535
18519a35330n5615O7934J47384P0568j55534j86500M2001O703P9212J26122P8228
18508H5173k908m491k44469L6336q2639l5178l3085M7023J43854k6406m6923K01881
18496C8168J1054j77338M3187J50108K1657l4285k269j54449k4070N473J0885
18485a11879q625k4130J16377J08620J6352L112m2421J23202n1522J82348n8755
$$ plain form
18474 252679 180725 227680 253152 218322 -10239 -94684 -74343 58824 231212 236820 257486
18463 257486 208634 44370 98505 290459 326654 163714 148967 -28374 -55479 35787 128839
18452 128839 315042 255924 73712 64114 227159 143211 -25972 -84799 3737 14167 95820
18441 95820 149040 189984 75521 -4364 -32106 67953 188423 166559 137782 265894 179928
18430 179928 69558 188263 177393 196054 100809 -38064 23707 45569 -40855 -80877 64146
18419 64146 145391 161730 4451 -116075 -104139 184772 175422 126701 -73203 73924 97859
18408 97859 156066 118787 199938 259617 228854 136875 18707 38090 124176 178125 34303
18397 34303 52999 167193 140118 140583 95866 15454 136043 191818 258846 484248 535065
$$ packed form
18474B52679p1954M6955K5472l4830k28561q4445K0341J33167J72388N608K0666
18463B57486m8852j64264N4135J91954L6195j62940j4747j77341k7105R1266R3052
18452A28839J86203n9118j82212r598J63045q3948j69183n8827Q8536J0430Q1653
18441I5820N3220M0944j14463p9885k7742J00059J20470k1864k8777J28112q5966
18430A79928j10370J18705j0870J8661r5245j38873O1771K1862q6424m0022J45023
18419F4146Q1245J6339j57279j20526J1936K88911r350m8721j99904J47127K3935
18408I7859N8207l7279Q1151N9679l0763r1979j18168J9383Q6086N3949j43822
18397C4303J8696J14194k7075M65m4717q0412J20589N5775O7028K25402N0817
$$ plain form
18386 535065 336567 274212 250377 215289 169645 3006 -63960 63932 306225 424343
18376 424343 480527 426652 367607 332607 144731 168909 212887 297647 357551 245878 179095
18365 179095 281171 319977 240713 140147 187527 304282 281488 244754 324904 277032 301239
18354 301239 316137 237551 135191 196746 110071 95796 242493 430218 491255 391656 342322
18343 342322 297976 178672 81965 221447 339558 388404 364379 401178 477006 295733 171074
18332 171074 295233 432269 471112 299373 274229 253337 264803 283718 246684 53540 -62536
18321 -62536 -1534 188918 234731 219967 150593 169537 391637 414393 247312 48390 50135
18310 50135 -1898 85611 8199 -128708 -44841 -151972 -196089 -99007 -68706 139615 283678
$$ packed form
18386E35065j98498o2355k3835l5088m5644j66639o6966J27892K42293J18118
18376D24343N6184n3875n9045l5000j87876K4178M3978Q4760N9904j11673o6783
18365A79095J02076L8806p9264j00566M7380J16755k2794l6734Q0150m7872K4207
18354C01239J4898p8586j02360O1555q6675j4275J46697J87725O1037r9599m9334
18343C42322m4346j19304r6707J39482J18111M8846k4025L6799P5828j81273j24659
18332A71074J24159J37036L8843j71739k5144k0892J1466J8915l7034j93144j16076
18321f2536O1002J90452M5813j4764o9374J8944K22100K2756j67081j98922J745
18310E0135n2033Q7509p7412j36907Q3867j07131m4117R7082L0301K08321J44063
$$ plain form
18299 283678 365710 289350 69343 -146426 -154917 -180787 -115128 -30129 37569 155997 249657
18288 249657 362730 466322 356810 281255 226970 266119 373302 500146 626964 757719
18278 757719 699312 624456 532690 417007 246835 204391 313955 147516 -18900 67054
18268 67054 17984 40847 156631 89029 202169 124157 216330 233633 23180 -224928 -269809
18257 -269809 -233900 -5746 51189 258369 255339 40558 69915 193671 215442 192942 256439
18246 256439 348746 381044 372579 393203 597109 619610 605338 478024 372424 420287 386554
18235 386554 389815 461612 528384 560077 536746 348272 208499 160464 270210 395032 335836
18224 335836 171128 135231 169442 271848 303850 189596 160194 179703 108895 234451 335960
$$ packed form
18299B83678Q2032p6360k20007k15769q491k5870O5659Q4999O7698J18428R3660
18288B49657J13073J03592j09512p5555n4285L9149J07183J26844J26818J30755
18278G57719n8407p4856r1766j15683j70172m2444J09564j66439j66416Q5954
18268F7054m9070K2863J15784o7602J13140p8012R2173J7303k10453k48108m4881
18257b69809L5909K28154N6935K07180l030k14781K9357J23756K1771k2500O3497
18246B56439R2307L2298q465K0624K03906K2501j4272j27314j05600M7863l3733
18235C86554L261P1797O6772L1693k3331j88474j39773m8035J09746J24822n9196
18224C35836j64708l5897L4211J02406L2002j14254k9402J9509p0808J25556J01509
$$ plain form
18213 335960 234947 301985 231201 -19851 35963 176294 232900 94288 260328 208045
18203 208045 221562 257549 236146 211355 122158 341197 457522 367217 285549 498535 618515
18192 618515 489441 221546 248208 341370 586005 815974 579746 488804 528955 548875
18182 548875 564976 471501 229256 277345 468552 434178 492989 741085 912958 969105 945189
18171 945189 731397 776997 818906 1032699 1070373 957211 872757 872617 760658 730395 812146
18160 812146 694969 662166 640461 788063 1030825 1218922 1150797 1140127 1212743 1522722
18150 1522722 1585668 1424160 1396646 1546128 1633369 1602270 1500561 1482590 1595107 1915030
18140 1915030 1983256 1922843 1926330 1908253 2037099 2287480 2529275 2775839 2914180 3088925
$$ packed form
18213C35960j01013O7038p0784k51052N5814J40331N6606j38612J66040n2283
18203B08045J3517L5987k1403k4791q9197K19039J16325r0305q1668K12986J19980
18192F18515j29074k67895K6662R3162K44635K29969k36228r0942M0151J9920
18182E48875J6101r3475k42245M8089J91207l4374N8811K48096J71873N6147k3916
18171I45189k13792M5600M1909K13793L7674j13162q4454j40j11959l0263Q1751
18160H12146j17177l2803k1705J47602K42762J88097o8125j0670P2616L09979
18150A522722O2946j61508k7514J49482Q7241l1099j01709j7971J12517L19923
18140A915030O8226o0413L487j8077J28846K50381K41795K46564J38341J74745
$$ plain form
18130 3088925 3339881 3410252 3818413 4554526 5073542 5674878 6364366 7285188 8457415
18121 8457415 9946011 11525679 13545310 16281131 20094107 26330628 36252096 51126461
18113 51126461 71441191 97158508 127098070 159220791 201346083 265702477 316189022
18106 316189022 230149756 125635085 72686903 46519102 32199615 23600738 17874328
18099 17874328 13941284 11148099 9132840 7536619 6556525 5801095 5047173 4558961 4232470
18090 4232470 3798549 3313896 2925682 2787067 2616282 2475959 2455442 2448362 2248527 1768968
18080 1768968 1467287 1365796 1282822 1279545 1251071 1343582 1308350 1086140 1002336 944081 936954
18069 936954 1101070 1040742 870983 636984 444284 294076 333263 495881 427402 410353
$$ packed form
18130C088925K50956P0371M08161P36113N19016O01336O89488R20822J172227
18121H457415J488596J579668K019631K735821L812976O236521R921468J4874365
18113E1126461K0314730K5717317K9939562L2122721M2125292O4356394N0486545
18106C16189022q6039266j04514671n2948182k6167801j4319487q598877n726410
18099A7874328l933044k793185k015259j596221r80094p55430p53922m88212l26491
18090D232470m33921m84653l88214j38615j70785j40323k0517p080j99835m79559
18080A768968l01681j01491q2974l277k8474R2511l5232k22210q3804n8255p127
18069I36954J64116o0328j69759k33999j92700j50208L9187J62618o8479j7049
$$ plain form
18059 410353 471035 586601 609465 564007 517731 614454 570572 531169 521589 462100 613072
18048 613072 489999 484009 422308 421322 219454 211453 494925 470576 258243 372468 179169
18037 179169 -28715 89213 137253 -32706 82807 216148 137455 104829 -73384 -34390
18027 -34390 111988 168542 166189 227841 357224 132948 -73946 -108325 -4678 -48741 -200736
18016 -200736 -170457 -147710 -95853 -136357 -69942 109105 283736 343620 362982 358019 340396
18005 340396 169417 208325 243367 189275 383426 358191 183803 152243 197270 154258 33918
17994 33918 165139 90433 30290 105695 95478 50923 201174 92904 -9605 -28667 -11566
17983 -11566 -157914 -85922 117245 260568 378357 307164 198597 65831 -38775 -217454
$$ packed form
18059D10353O0682J15566K2864m5458m6276R6723m3882l9403r580n9489J50972
18048F13072j23073n990o1701r86k01868q001K83472k4349k12333J14225j93299
18037A79169k07884J17928M8040j69959J15513J33341p8693l2626j78213L8994
18027c4390J46378N6554k353O1652J29383k24276k06894l4379J03647m4063j51995
18016b00736L0279K2747N1857m0504O6415J79047J74631N9884J9362m963j7623
18005C40396j70979L8908L5042n4092J94151k5235j74388l1560M5027m3012j20340
17994C3918J31221p4706o0143P5405j0217m4555J50251j08270j02509j9062J7101
17983a1566j46348P1992K03167J43323J17789p1193j08567j32766j04606j78679
$$ plain form
17973 -217454 -238822 -154018 -91021 -40699 -135934 -116818 -139978 -22435 127790 49305 -191620
17962 -191620 -320445 -118025 -27549 111169 154346 295894 229754 153807 172049 -181881
17952 -181881 -403667 -356748 -270263 -104797 -76825 32317 149560 321662 272172 299906
17942 299906 289329 181349 112306 52038 -20540 -84967 95468 284491 244825 164246 186264
17931 186264 182261 243235 82151 -14035 21211 2616 131894 94654 -30237 -89218 -42991
17920 -42991 88481 102188 8389 20594 6804 -57677 73159 148723 48656 112365 176795
17909 176795 185533 267501 211328 425055 425397 414683 351459 202703 87018 130499 -34641
17898 -34641 -45352 15720 -91565 -65174 -23059 16519 133534 283801 181254 94869 284942
$$ packed form
17973b17454k1368Q4804O2997N0322r5235J9116k3160J17543J50225p8485k40925
17962a91620j28825K02420R0476J38718M3177J41548o6140p5947J8242l53930
17952a81881k21786M6919Q6485J65466K7972J09142J17243J72102m9490K7734
17942B99906j0577j07980o9043o0268p2578o4427J80435J89023l9666q0579K2018
17931A86264m003O0974j61084r6186L5246j8595J29278l7240j24891n8981M6227
17920d2991J31472J3707r3799J2205j3790o4481J30836P5564j00067O3709O4430
17909A76795Q738Q1968n6173K13727L42j0714o3224j48756j15685M3481j65140
17898c4641j0711O1072j07285K6391M2115L9578J17015J50267j02547q6385J90073
$$ plain form
17887 284942 287853 324587 224716 222685 211154 118696 -95775 -25448 206303 234430 296930
17876 296930 450267 319440 102394 206847 391142 495446 511038 492197 566647 618520
17866 618520 638421 609437 501235 437407 231342 254625 479015 493590 621332 649371 573618
17855 573618 581673 636153 550192 595427 655981 687028 747524 659379 626748 540684 656095
17844 656095 822846 789453 858875 983241 970020 828295 665503 534656 603021 435888
17834 435888 309870 373416 371161 405938 390268 336184 363789 313627 291388 249869 238373
17823 238373 211454 314890 291935 256386 411455 545762 350287 280840 386613 352102
17813 352102 342563 391466 517628 614142 781922 803952 790101 737791 760806 707392 795991
$$ packed form
17887B84942K911L6734r9871k031j1531r2458k14471P0327K31751K8127O2500
17876B96930J53337j30827k17046J04453J84295J04304J5592j8841P4450N1873
17866F18520J9901k8984j08202o3828k06065K3283K24390J4575J27742K8039p5753
17855E73618Q055N4480q5961M5235O0554L1047O0496q8145l2631q6064J15411
17844F56095J66751l3393O9422J24366j3221j41725j62792j30847O8365j67133
17834D35888j26018O3546k255L4777j5670n4084K7605n0162k2239m1519j1496
17823B38373k6919J03436k2955l5549J55069J34307j95475o9447J05773l4511
17813C52102r539M8903J26162R6514J67780K2030j3851n2310K3015n3414Q8599
$$ plain form
17802 795991 765108 697727 595910 561836 569340 587765 731520 748516 848901 935439 832009
17791 832009 831531 670729 464893 442372 558272 490780 383068 353040 406773 426509 461627
17780 461627 504690 491485 414431 458511 379078 283648 204118 195431 251639 380851 400868
17769 400868 352660 433832 324349 269113 412535 423129 425547 320189 299572 429700 501458
17758 501458 449205 392994 215159 309194 475156 524358 495721 561071 517035 358215 424699
17747 424699 252151 85717 -125697 -154498 69424 255866 186575 109769 95634 142476
17737 142476 24748 20987 -42198 -47106 275804 292872 215952 60751 113686 232852 171183
17726 171183 200076 287611 251319 413019 375114 349276 339646 230032 110293 147377 79565
$$ packed form
17802G95991l0883o7381j01817l4074P504J8425J43755J6996J00385Q6538j03430
17791H32009m78j60802k05836k2521J15900o7492j07712l0028N3733J9736L5118
17780D61627M3063j3205p7054M4080p9433r5430p9530q687N6208J29212K0017
17769D00868m8208Q1172j09483n5236J43422J0594K418j05358k0617J30128P1758
17758E01458n2253n6211j77835R4035J65962M9202k8637O5350m4036j58820O6484
17747D24699j72548j66434k11414k8801K23922J86442o9291p6806j4135M6842
17737A42476j17728l761o3185m908L22910J7068p6920j55201N2935J19166o1669
17726A71183K8893Q7535l6292J61700l7905k5838r630j09614j19739L7084o7812
$$ plain form
17715 79565 29565 144954 41304 257812 285638 162149 198286 150426 214101 261408 51108
17704 51108 -62992 -20923 -35992 -183274 -214012 -196264 -189946 -155108 -90573 112940 118174
17693 118174 243499 193443 -9625 78088 78082 22206 -24527 -54663 143381 256308 347614
17682 347614 417160 523553 467984 324835 505449 562041 488699 377609 137958 123510
17672 123510 201887 215132 200404 186823 374212 321218 290357 364032 568507 637449 586643
17661 586643 620501 563725 567366 460697 381549 305769 356836 272106 250748 329211 423063
17650 423063 533091 589339 699221 840771 810302 773001 686563 591411 698157 692154 754640
17639 754640 659871 657580 701447 671398 702815 707012 822213 1080905 919404 847137 798288
$$ packed form
17715G9565n0000J15389j03650K16508K7826j23489L6137m7860O3675M7307k10300
17704E1108j14100M2069j5069j47282l0738J7748O318L4838O4535K03513N234
17693A18174J25325n0056k03068Q7713on5876m6733l0136J98044J12927R1306
17682C47614O9546J06393n5569j43149J80614N6592p3342j11090k39651j4448
17672A23510P8377J3245j4728j3581J87389n2994l0861P3675K04475O8942n0806
17661E86643L3858n6776L641j06669p9148p5780N1067q4730k1358P8463R3852
17650D23063J10028N6248J09882J41550l0469l7301q6438r5152J06746o003O2486
17639G54640r4769k291M3867l0049L1417M197J15201K58692j61501p2267m8849
$$ plain form
17628 798288 612681 614427 580142 643302 864718 837385 755675 754918 871850 762709 709395
17617 709395 856655 798416 838944 893932 936663 806938 573006 498843 436352 690331 828205
17606 828205 937812 1018566 990283 1031533 1126714 1187945 1386599 1449516 1310153 1141750 1062912
17595 1062912 1057661 1185128 1379995 1420963 1459301 1485804 1406270 1382552 1548009 1473902 1548980
17584 1548980 1725064 1644982 1583777 1624604 1501109 1501172 1567595 1395494 1283039 1409682 1653616
17573 1653616 1784029 1680909 1655424 1383599 1351362 1416581 1409125 1192042 1223756 1236588 1135008
17562 1135008 1019448 857782 776670 797430 791343 803382 895998 937825 1090940 1114051 938770
17551 938770 938643 1110223 1029551 937594 959552 1107417 1259643 1359540 1287979 1199196 1213942
$$ packed form
17628G98288j85607J746l4285O3160K21416k7333q1710p57J16932j09141n3314
17617G09395J47260n8239M0528N4988M2731j29725k33932p4163o2491K53979J37874
17606H28205J09607Q0754k8283M1250R5181O1231J98654O2917j39363j68403p8838
17595A062912n251J27467J94867M0968L8338K6503p9534k3718J65457p4107P5078
17584A548980J76084q0082o1205M0827j23495O3O6423j72101j12455J26643K43934
17573A653616J30413j03120k5485k71825l2237O5219p456k17083L1714J2832j01580
17562A135008j15560j61666q1112K0760o087J2039R2616M1827J53115K3111j75281
17551I38770j27J71580q0672r1957K1958J47865J52226R9897p1561q8783J4746
$$ plain form
17540 1213942 1219962 1190941 1190785 1047517 1002354 984787 1134633 1245427 1100226 1084950 1137065
17529 1137065 1099351 1125997 1016328 994058 976746 975557 928692 868716 791845 743046 902943
17518 902943 915906 796273 771394 824233 958288 1052391 1096914 1066934 885922 810387 970314
17507 970314 1033218 986943 885240 847138 826547 842411 946050 902253 890806 1015927 925740
17496 925740 1041617 1256218 1347835 1383407 1345153 1489599 1594727 1715383 1656633 1431036
17486 1431036 1327263 1317975 1211624 1038688 983429 977865 911450 974966 853779 892429 991289
17475 991289 1022507 1079205 1065941 839250 893143 1085236 1206123 1315090 1585688 1603901
17465 1603901 1580347 1560387 1365399 1145134 1300938 1328881 1283114 1292096 1217152 1071304 934434
$$ packed form
17540A213942O020k9021j56j43268m5163j7567J49846J10794j45201j5276N2115
17529A137065l7714K6646j09669k2270j7312j189m6865n9976p6871m8799J59897
17518I02943J2963j19633k4879N2839J34055R4103M4523k9980j81012p5535J59927
17507I70314O2904m6275j01703l8102k0591J5864J03639m3797j1447J25121r0187
17496I25740J15877K14601R1617L5572l8254J44446J05128J20656n8750k25597
17486A431036j03773r288j06351j72936n5259n564o6415O3516j21187L8650R8860
17475I91289L1218N6698j3264k26691N3893J92093J20887J08967K70598J8213
17465A603901k3554j9960j94988k20265J55804K7943m5767Q982p4944j45848j36870
$$ plain form
17454 934434 1142376 1371419 1343911 1236551 1394160 1529034 1719808 1813395 1981408 2270595
17444 2270595 2576759 2784131 3178665 3907745 3650619 3210076 3333896 3143026 2853197
17435 2853197 2759897 2649871 2535382 2410789 2434613 2407748 2299606 1992258 1836560 1903425
17425 1903425 2177129 2294483 2214321 2354281 2426099 2601287 2852962 3100057 3276593 3491128
17415 3491128 3537134 3278907 3132288 3188394 3256533 3025312 2883032 2818485 2887197 3003674
17405 3003674 2912536 2862548 3029692 3235322 3239706 3235415 3368474 3632258 4062766 4334255
17395 4334255 4633009 5356147 6206023 6913512 7816279 9046879 10363788 11634913 13075611
17386 13075611 14955857 16885538 17023105 15316398 12925757 11447374 10880580 11119864
$$ packed form
17454I34434K07942K29043k7508j07360J57609J34874J90774R3587J68013K89187
17444B270595L06164K07372L94534P29080k57126m40543J23820j90870k89829
17435B853197r3300j10026j14489j24593K3824k6865j08142l07348j55698O6865
17425A903425K73704J17354q0162J39960P1818J75188K51675K47095J76536K14535
17415C491128M6006k58227j46619N6106O8139k31221j42280o4547O8712J16477
17405C003674r1138m9988J67144K05630M384m291J33059K63784M30508K71489
17395D334255K98754P23138Q49876P07489R02767J230600J316909J271125J440698
17386A3075611J880246J929681J37567j706707k390641j478383n66794K39284
$$ plain form
17378 11119864 11606413 12746412 14124838 15971457 18780503 22742082 28351166 36250375
17370 36250375 46990254 61266635 79164500 100513651 127077653 159639982 184357895
17363 184357895 182073515 159198528 133991940 108305250 81052759 59486751 46800459
17356 46800459 40786811 38848978 39741710 42893109 47568024 53725063 61073019 66077961
17348 66077961 62638771 50913341 37199038 27269753 21425188 17982102 15742497 14459102
17340 14459102 13904130 13872341 13819069 14006539 14414581 15011591 15507168 16422032 17622152
17331 17622152 19399011 22210081 26386492 32139705 39476630 48084653 58072351 69825910
17323 69825910 80863003 84092374 76555007 63893672 54625382 51412295 53559743 60791199
$$ packed form
17378A1119864M86549J139999J378426J846619K809046L961579N609084P899209
17370C6250375J0739879J4276381J7897865K1349151K6564002L2562329K4717913
17363A84357895k284380k2874987k5206588k5686690k7252491k1566008j2686292
17356D6800459o013648j937833Q92732L151399M674915O157039P347956N004942
17348F6077961l439190j1725430j3714303r929285n844565l443086k239605j283395
17340A4459102n54972l1789n3272J87470M08042N97010M95577R14864J200120
17331A7622152J776859K811070M176411N753213P336925Q608023R987698J1753559
17323F9825910J1037093L229371p537367j2661335r268290l213087K147448P231456
$$ plain form
17315 60791199 73532123 91920264 116368739 147153378 184819762 229089928 271793530
17308 271793530 299665333 302223073 269093536 204719715 136988891 90338964 63323137
17301 63323137 47573845 37603631 30926178 26252999 23267861 21272594 19765907 18963169
17293 18963169 18997734 20056624 21864279 24083419 26904113 30507100 34049771 33822155
17285 33822155 28330289 20909661 15462691 12292552 10204381 8529627 7116771 5868832
17277 5868832 5066816 4366179 3858854 3416043 3252117 3169370 3010800 2650494 2404815 2210004
17267 2210004 2027607 1607920 1582618 1633201 1675354 1876948 1919565 1710773 1582736 1511160
17257 1511160 1418130 1323178 1259857 1222024 1158634 1216496 1202293 1243552 1346989 1271682 1132486
$$ packed form
17315F0791199J2740924J8388141K4448475L0784639L7666384M4270166M2703602
17308B71793530K7871803K557740l3129537o4373821o7730824m6649927k7015827
17301F3323137j5749292r970214o677453m673179k985138j995267j506687q02738
17293A8963169L4565J058890J807655K219140K820694L602987L542671k27616
17285C3822155n491866p420628n446970l170139k088171j674754j412856j247939
17277E868832q02016p00637n07325m42811j63926q2747j58570l60306k45679j94811
17267B210004j82397m19687k5302N0583M2153K01594M2617k08792j28037p1576
17257A511160r3030r4952o3321l7833o3390N7862j4203M1259J03437p5307j39196
$$ plain form
17246 1132486 1090202 1043619 1011071 932335 1036211 1205270 1244134 1258464 1303289 1311466 1224045
17235 1224045 1142884 1000054 1102474 1154669 1257226 1371641 1275817 1229241 1275876 1230459
17225 1230459 1105950 971677 1025548 1026722 1176411 1112763 1206722 1215649 1184972 1045119 1096421
17214 1096421 1233182 1364361 1455354 1530521 1537679 1415467 1246856 1138170 1135259 1106923 1180364
17203 1180364 1311782 1439648 1452317 1316565 1231516 1443713 1620311 1648138 1618117 1908424
17193 1908424 2073583 1897151 1948106 2167121 2395727 2565115 2771939 2910070 2835605 2913528
17183 2913528 3157164 3341473 3490299 3607124 3842236 4028498 4247128 4663742 5229123
17174 5229123 5814223 6379739 7226272 8240385 9682567 11223151 12891884 15018226 17543538
$$ packed form
17246A132486m2284m6583l2548p8736J03876J69059L8864J4330M4825Q177q7421
17235A224045q1161j42830J02420N2195J02557J14415r5824m6576M6635m5417
17225A230459j24509j34273N3871J174J49689o3648R3959Q927l0677j39853N1302
17214A096421J36761J31179R0993P5167P158j22212j68611j08686k911k8336P3441
17203A180364J31418J27866J2669j35752q5049K12197J76598K7827l0021K90307
17193A908424J65159j76432N0955K19015K28606J69388K06824J38131p4465P7923
17183B913528K43636J84309J48826J16825K35112J86262K18630M16614N65381
17174E229123N85100N65516Q46533J014113J442182J540584J668733K126342K525312
$$ plain form
17165 17543538 20806154 24900287 29990063 35802842 39361103 34182825 26211379 21473968
17157 21473968 19586848 19131577 19743150 21248311 23481526 26505624 30886704 37568468
17149 37568468 47843121 62869195 83651572 110979887 143994007 181777675 227650761
17142 227650761 283743249 325941021 309423188 259231844 200316107 137517876 95173666
17135 95173666 71499212 58231818 51044386 48011111 48567794 51628383 56443228 62992241
17127 62992241 71515075 80818711 82340540 66924173 47383459 33859692 25938599 21027039
17119 21027039 17858204 15834031 14478029 13602372 13262894 13292222 13684907 13824395 13775082
17110 13775082 13918505 14342682 15452217 17442644 20584347 24793888 30276710 36558255
$$ packed form
17165A7543538L262616M094133N089776N812779L558261n178278p971446m737411
17157B1473968j887120m55271O11573J505161K233215L024098M381080O681764
17149C7568468J0274653J5026074K0782377K7328315L3014120L7783668M5873086
17142B27650761N6092488M2197772j6517833n0191344n8915737o2798231m2344210
17135I5173666k3674454j3267394p187432l033275N56683L060589M814845O549013
17127F2992241Q522834R303636J521829j5416367j9540714j3523767p921093m911560
17119B1027039l168835k024173j356002q75657l39478K9328L92685J39488m9313
17110A3775082J43423M24177J109535J990427L141703M209541N482822O281545
$$ plain form
17102 36558255 43843207 52671481 63305893 71049650 65519158 52037889 42478743 38477049
17094 38477049 39300909 43916455 52346394 64712000 80981684 101639940 127825943 155997657
17086 155997657 169209186 170499503 178461985 159019133 105827213 66531299 44957626
17079 44957626 32786363 25202189 19977586 16265509 13551606 11793915 10514682 9640640
17071 9640640 9245988 9120097 9261901 9823927 10643540 11733591 13060313 14851050 15853077
17062 15853077 13507368 9781844 7198926 5842942 4907319 4283068 3964570 3540923 2928840
17053 2928840 2383693 1999069 1870182 1788903 1538187 1293425 1297881 1351289 1209468 1020896
17043 1020896 946263 881887 962974 705888 509937 540512 447214 475708 575265 697650 663756
$$ packed form
17102C6558255P284952Q828274J0634412P743757n530492j3481269r559146m001694
17094C8477049Q23860M615546Q429939J2365606J6269684K0658256K6186003K8171714
17086A55997657J3211529J290317P962482j9442852n3191920l9295914k1573673
17079D4957626j2171263p584174n224603l712077k713903j757691j279233q74042
17071I640640l94652j25891J41804N62026Q19613J090051J326722J790737J002027
17062A5853077k345709l725524k582918j355984r35623o24251l18498m23647o12083
17053B928840n45147l84624j28887q1279k50716k44762M456N3408j41821j88572
17043A020896p4633o4376Q1087k57086j95951L0575r3298K8494R9557J22385l3894
$$ plain form
17032 663756 498849 602081 636991 559697 423295 460100 598755 373075 301924 408683
17022 408683 466063 542827 401646 368082 291999 223054 243292 208774 180824 140963 169304
17011 169304 101743 154957 224063 172124 69641 -9826 58199 90832 257281 256032 10120
17000 10120 38128 86131 45686 133335 84515 -109297 -210616 -243443 -284571 -270969 -94917
16989 -94917 121895 295562 265338 229306 154762 37669 -9153 -101765 -243208 -94023 -82613
16978 -82613 -14987 -24644 13564 -156429 -97094 -120803 -90491 -9848 -23793 -92824 -79231 -50788
16966 -50788 89853 80959 67653 41245 215886 153453 -62436 -170924 -122069 -34959 64411
16955 64411 64189 98928 71521 20332 128178 119483 -125811 -214073 -454318 -434677 -217155
$$ packed form
17032F63756j64907J03232L4910p7294j36402L6805J38655k25680p1151J06759
17022D08683N7380P6764j41181l3564p6083o8945K0238l4518k7950l9861K8341
17011A69304o7561N3214O9106n1939j02483p9467O8025L2633J66449j249k45912
17000A0120K8008M8003m0445Q7649m8820j93812j01319l2827m1128J3602J76052
16989i4917K16812J73667l0224l6032p4544j17093m6822r2612j41443J49185J1410
16978h2613O7626r657L8208j69993N9335k3709L0312Q0643j3945o9031J3593K8443
16966e0788J40641q894j3306k6408J74641o2433k15889j08488M8855Q7110R9370
16955F4411k22L4739k7407n1189J07846q695k45294q8262k40245J9641K17522
$$ plain form
16944 -217155 -117908 -28768 108139 37914 38126 149362 222949 302195 328515 224067 -14067
16933 -14067 -258074 -265059 -139652 -152786 -320007 -333849 -311901 -153461 -135031 4829 -101720
16922 -101720 -348062 -205182 -196668 -72542 27824 -38611 -26157 -76651 -154541 -169654 -162854
16911 -162854 -179304 -162936 -266223 -175069 -77698 -42912 18881 -85291 -146498 -285363 -302260
16900 -302260 -268327 -193492 -227587 -151415 -123159 -80327 40731 76029 -61953 -163556 -130192
16889 -130192 58168 170472 -40728 -112158 -79893 7328 -47483 62846 46152 30365 156562
16878 156562 161039 22102 -94035 71057 65116 62057 166797 184696 184523 277975 343666 412238
16866 412238 636055 717444 608679 638456 581821 466889 365198 466733 519658 418508
$$ packed form
16944b17155R9247Q9140J36907p0225K12J11236P3587P9246K6320j04448k38134
16933a4067k44007o985J25407j3134j67221j3842K1948J58440J8430J39860j06549
16922a01720k46342J42880Q514J24126J00366o6435J2454n0494p7890j5113O800
16911a62854j6450J6368j03287R1154R7371L4786O1793j04172o1207j38865j6897
16900c02260L3933P4835l4095P6172K8256M2832J21058L5298j37982j01603L3364
16889a30192J88360J12304k11200p1430L2265Q7221n4811J10329j6694j5787J26197
16878A56562M477j38937j16137J65092n941l059J04740J7899j73R3452O5691O8572
16866D12238K23817Q1389j08765K9777n6635j14932j01691J01535N2925j01150
$$ plain form
16856 418508 409971 526222 476314 418422 452302 439849 450358 356069 453388 412939 234649
16845 234649 272041 308613 250913 387583 361528 197628 212189 185480 241357 386930 186122
16834 186122 -29013 -9102 100637 -35575 -123967 -239835 -271535 -262700 -288566 -85927 -85143
16823 -85143 -263892 -221648 -263761 -123766 -72810 109214 379944 303794 162634 104043 -7724
16812 -7724 72694 270830 307953 339619 262160 278982 321731 298791 202923 203299 313522 348908
16800 348908 239181 111583 -131036 -202261 -178683 -113933 -113191 -143081 -176396 130349 550733
16789 550733 672923 403936 357889 368706 329177 293905 145535 94051 69361 -107546 -187453
16778 -187453 7912 -124789 -248722 -268969 -180695 -96478 -58511 -115443 -25024 26090 -79747
$$ packed form
16856D18508q537J16251m9908n7892L3880j2453J0509r4289R7319m0449j78290
16845B34649L7392L6572n7700J36670k6055j63900J4561k6709N5877J45573k00808
16834A86122k15135J9911J09739j36212q8392j15868l1700Q835k5866K02639P84
16823h5143j78749M2244m2113J39995N0956J82024K70730p6150j41160n8591j11767
16812g724Q0418J98136L7123L1666p7459J6822M2749k2940r5868L76J10223L5386
16800C48908j09727j27598k42619p1225K3578O4750P42k9890l3315L06745M20384
16789E50733J22190k68987m6047J0817l9529l5272j48370n1484k4690j76907p9907
16778a87453J95365j32701j23933k0247Q8274Q4217L7967n6932R0419N1114j05837
$$ plain form
16767 -79747 -15663 -32696 -41202 -49434 97964 178521 188459 244815 128209 8765 6594 -35911
16755 -35911 -28274 -180757 -401638 -384216 -253643 -263750 -308679 -237035 -216179 -279445 -295240
16744 -295240 -338089 -172484 -35747 -128292 -188193 -301955 -393441 -315314 -198950 -205604 -57364
16733 -57364 -37357 -123068 -90226 4241 -37117 85422 -100687 -104305 -46588 84781 133065
16722 133065 51121 -172933 -177016 -117070 -117899 -159149 -221553 -47185 -23070 -198782 -181240
16711 -181240 -137229 17498 6764 74665 -13853 -187177 -211199 13925 6098 -40486 -250811
16700 -250811 -289933 -251136 -245842 -256021 -210341 -313049 -280358 -78320 -56611 -54061 -19911
16689 -19911 -66823 -169447 -185803 -219765 -77699 19735 -208831 -412371 -445288 -403881 -437139
$$ packed form
16767g9747O4084j7033q506q232J47398Q0557R938N6356j16606j19444k171m2505
16755c5911P637j52483k20881J7422J30573j0107m4929P1644K0856o3266j5795
16744b95240m2849J65605J36737r2545n9901j13762r1486P8127J16364o654J48240
16733e7364K0007q5711L2842R4467m1358J22539j86109l618N7717J31369M8284
16722A33065q1944k24054m083N9946q29m1250o2404J74368K4115j75712J7542
16711a81240M4011J54727j0734O7901q8518j73324k4022K25124p827m6584k10325
16700b50811l9122L8797N294j0179M5680j02708L2691K02038K1709K550L4150
16689a9911m6912j02624j6356l3962J42066R7434k28566k03540l2917M1407l3258
$$ plain form
16678 -437139 -360115 -263087 -274393 -259731 -238185 -110706 -133820 69399 161122 8184 -55597
16667 -55597 -110024 -85620 55148 84744 60552 141000 118307 251124 292973 278899 298122
16656 298122 461433 606401 424489 313231 319490 231938 331092 322987 313442 351349 328799
16645 328799 179316 193560 383331 508466 559519 542339 538983 654130 734025 615049 388712
16634 388712 325579 284432 142329 84770 59277 177583 112605 11818 20546 99769 75981
16623 75981 1345 -5718 66966 106457 -25125 -59798 -15743 113989 196025 242993 222739
16612 222739 243756 107617 27357 109264 304806 325609 349818 241259 184222 80767 121853
16601 121853 380799 452260 342335 399151 400165 158357 70775 245821 378499 273753
$$ packed form
16678d37139P7024R7028j1306J4662K1546J27479k3114K03219R1723j52938o3781
16667e5597n4427K4404J40768K9596k4192Q0448k2693J32817M1849j4074J9223
16656B98122J63311J44968j81912j11258O259q7552R9154q105r545L7907k2550
16645C28799j49483J4244J89771J25135N1053j7180l356J15147P9895j18976k26337
16634C88712o3133m1147j42103n7559k5493J18306o4978j00787Q728P9223k3788
16623G5981p4636p063P2684L9491j31582l4673M4055J29732Q2036M6968k0254
16612B22739K1017j36139q0260Q1907J95542K0803K4209j08559n7037j03455M1086
16601A21853K58946P1461j09925N6816J014k41808q7582J75046J32678j04746
$$ plain form
16591 273753 209556 265547 247914 86085 -17442 108689 79058 170011 235640 390335 408787
16580 408787 585504 659524 566610 492351 311583 181911 206519 77107 -102584 -53677
16570 -53677 12138 -98773 -211682 -202138 -336658 -364999 -31513 45957 -39547 -44613 -33031
16559 -33031 -61801 -4387 -151675 -152438 -53746 99830 8208 -124152 -158149 -46562 -91596
16548 -91596 54595 -33517 -221611 -145258 -69105 142611 107122 89035 46005 -2169 175348
16537 175348 205503 250785 190005 95934 25683 -3384 -20222 -191133 -230984 -202719 -199951
16526 -199951 -317407 -100903 -119658 -171745 -84376 -90023 -154377 -142847 -135943 -86302 32826
16515 32826 23794 80187 235586 102957 2888 -25186 -120232 -259107 -161568 -71374 -156333
$$ packed form
16591B73753o4197N5991j7633j61829j03527J26131k9631R0953O5629J54695J8452
16580D08787J76717P4020r2914p4259j80768j29672K4608j29412j79691M8907
16570e3677O5815j10911j12909R544j34520k8341L33486P7470q5504n066J1582
16559c3031k8770N7414j47288p63R8692J53576r1622j32360l3997J11587m5034
16548i1596J46191q8112j88094P6353P6153K11716l5489j8087m3030m8174J77517
16537A75348L0155M5282o0780r4071p0251k9067j6838j70911l9851K8265K768
16526a99951j17456K16504j8755n2087Q7369n647o4354J1530O904M9641J19128
16515C2826r032N6393J55399j32629j00069k8074r5046j38875R7539R0194q4959
$$ plain form
16504 -156333 -157542 -163878 -167142 -170332 -244160 -316562 -170269 -176646 -114557 -209096 -298727 -380278
16492 -380278 -243675 -320525 -237470 -379256 -421561 -442343 -529057 -540369 -510157 -437327 -308040
16481 -308040 -253641 -28031 71402 208668 285836 38198 -162050 -263232 -156364 -254204
16471 -254204 -286736 -123838 -8141 -174260 -358755 -131530 -59227 -128764 -208893 -212310 -373379
16460 -373379 -591220 -483222 -288420 -115836 -139233 -85038 -183981 -246215 -319868 -260233 -354273
16449 -354273 -292107 -56631 -5091 -89346 -137172 -51369 -2788 -509 -68856 -97121 -97001 -135255
16437 -135255 -193016 -159494 -123167 -126868 -104356 165364 223944 93038 53667 -66537 -197464
16426 -197464 -321319 -406738 -395388 -462820 -521469 -199375 -131933 -246941 -22552 48595 -34324
$$ packed form
16504a56333j209o336l264l190p3828p2402J46293o377O2089r4539q9631q1551
16492c80278J36603p6850Q3055j41786m2305k0782q6714j1312L0212P2830J29287
16481c08040N4399K25610R9433J37266P7168k47638k00248j01182J06868r7840
16471b54204l2532J62898J15697j66119j84495K27225P2303o9537q0129l417j61069
16460c73379k17841J07998J94802J72584k3397N4195r8943o2234p3653N9635r4040
16449c54273O2166K35476N1540q4255m7826Q5803M8581K279o8347k8265J20l8254
16437a35255n7761L3522L6327l701K2512K69720N8580j30906l9371j20204j30927
16426a97464j23855q5419J1350o7432n8649L22094O7442j15008K24389P1147q2919
$$ plain form
16415 -34324 -253568 -383998 -317109 -150556 -148833 -90976 -40573 45332 118047 60673 -82758
16404 -82758 -210700 -103500 -17278 -45933 -44350 -39779 34979 -73161 -111608 86550 187613
16393 187613 208146 251129 143578 10574 46883 -43988 -106477 -64487 -100247 -266325 -188977
16382 -188977 -69513 -130894 -81128 -65214 -120642 -109071 -88412 -140752 -817 174871 216509
16371 216509 238944 169343 14945 -49218 -114129 20566 69314 74852 -126392 -219745 -291651
16360 -291651 -153201 -73618 -258031 -226900 -46435 -13982 -102091 -151826 -117531 -105190 -73643
16349 -73643 22356 -30648 -266245 -331831 -238197 -120635 -459 -5343 -194265 -225382 -264212
16338 -264212 -250858 -287976 -207281 -111597 -45350 -143533 -263388 -205828 -50571 27562 86336
$$ packed form
16415c4324k19244j30430O6889J66553J723N7857N0403Q5905P2715n7374j43431
16404h2758j27942J07200Q6222k8655J583M571P4758j08140l8447J98158J01063
16393A87613K0533M2983j07551j33004L6309r0871o2489M1990l5760j66078P7348
16382a88977J19464o1381M9766J5914n5428J1571K0659n2340J39935J75688M1638
16371B16509K2435o9601j54398o4163o4911J34695M8748N538k01244r3353p1906
16360b91651J38450P9583j84413L1131J80465L2453q8109m9735L4295J2341L1547
16349g3643R5999n3004k35597o5586R3634J17562J20176m884j88922l1117l8830
16338b64212J3354l7118Q0695R5684O6247r8183j19855N7560J55257P8133N8774
$$ plain form
16327 86336 -24046 -18296 59049 -4982 40283 -47680 -71089 7875 -149229 -235114 -196053
16316 -196053 -75513 23143 -781 13796 29516 142385 118277 105484 -39031 29467 -73809
16305 -73809 -221477 -421748 -479315 -362866 -276930 -119941 -96022 8264 161296 140948
16295 140948 -147881 -254220 -327626 -272117 -205993 -63021 -9398 -150037 -214737 -142129 -119331
16284 -119331 -26991 103143 -14052 -278253 -270781 -63628 34723 -23713 -31239 -184552 -194631
16273 -194631 -153876 -148632 -115376 -197451 -157104 -54246 -136184 -224065 -91580 -18707 19204
16262 19204 -104863 47677 8890 -158456 -78528 -175330 -249720 -363781 -460046 -469131 -368429
16251 -368429 -439792 -268316 -111073 -317523 -327403 -279442 -220416 -212132 -224504 -198742 -354049
$$ packed form
16327H6336j10382N750P7345o4031M5265q7963k3409P8964j57104q5885L9061
16316a96053J20540R8656k3924J4577J5720J12869k4108j2793j44515O8498j03276
16305g3809j47668k00271n7567J16449Q5936J56989K3919J04286J53032k0348
16295A40948k88829j06339p3406N5509O6124J42972N3623j40639o4700P2608K2798
16284a19331R2340J30134j17195k64201P472K07153R8351n8436p526j53313j0079
16273a94631M0755N244L3256q2075M0347J02858q1938q7881J32485P2873L7911
16262A9204j24067J52540l8787j67346P9928r6802p4390j14061r6265r085J00702
16251c68429p1363J71476J57243k06450r880M7961N9026Q284j2372K5762j55307
$$ plain form
16240 -354049 -339450 -363981 -386245 -337160 -280262 -294780 -257871 -201196 -183372 8713 -1081
16229 -1081 -118392 -27648 104385 71603 176084 190954 128977 44468 -92951 -61225 4057
16218 4057 75088 -86942 -224119 -52739 -5164 -169993 -288231 -170057 -95368 -159604 -319055
16207 -319055 -450047 -486838 -185790 166346 425972 257647 166443 39137 -85438 -370277
16197 -370277 -432483 -258372 -223280 -288882 -302184 -259875 -182654 -169526 -185766 -288460 -396156
16186 -396156 -278903 -211414 -210492 -145444 -145052 -178399 -199753 -183827 -44876 -130014 -55994 44185
16174 44185 136397 9569 -10597 125671 124815 128565 48145 71074 118502 190798 62288 -106557
16162 -106557 12995 180078 255652 96068 -109466 -192641 -310397 -262137 -179788 -178960 -160927
$$ packed form
16240c54049J4599k4531k2264M9085N6898j4518L6909N6675J7824J92085r794
16229a081j17311R0744J32033l2782J04481J4870o1977q4509j37419L1726O5282
16218D057P1031j62030j37177J71380M7575j64829j18238J18174P4689o4236j59451
16207c19055j30992l6791L01048L52136K59626j68325r1204j27306j24575k84839
16197c70277o2206J74111L5092o5602j3302M2309P7221J3128j6240j02694j07696
16186c96156J17253O7489R22O5048L92l3347k1354J5926J38951q5138P4020J00179
16174D4185R2212j26828k0166J36268q56L750q0420K2929M7428P2296j28510j68845
16162a06557J19552J67083P5574j59584k05534q3175j17756M8260Q2349Q28J8033
$$ plain form
16151 -160927 -3692 2805 -165878 -205510 2082 -126168 -173280 -181740 -254293 -314681 -147479
16140 -147479 111085 33716 -64998 -37406 -16240 107099 -23092 -132179 -221846 -203640 -216224
16129 -216224 -391159 -457549 -349534 -206661 -74657 -105675 -188585 -170185 -209590 -52478
16119 -52478 113102 97854 -74693 -65949 -224753 -316402 -347334 -419534 -456217 -270333 -260371
16108 -260371 -404727 -302638 -102774 -45575 -80833 -148937 -103509 -205462 -280381 -319469 -223835
16097 -223835 -215708 36210 207464 85759 192469 95796 199506 438990 475879 368465
16087 368465 349451 226433 109263 55439 112409 28353 -55626 -86319 -101170 -245890 -337926
16076 -337926 -143461 -77591 208430 230073 70825 18550 25281 91817 115168 -29192 -99662
$$ packed form
16151a60927J57235O497j68683l9632K07592j28250m7112q460p2553o0388J67202
16140a47479K58564p7369r8714K7592K1166J23339j30191j09087q9667J8206j2584
16129b16224j74935o6390J08015J42873J32004l1018q2910J8400l9405J57112
16119e2478J65580j5248j72547Q744j58804r1649l0932p2200l6683J85884R962
16108b60371j44356J02089J99864N7199l5258o8104M5428j01953p4919l9088R5634
16097b23835Q127K51918J71254j21705J06710r6673J03710K39484L6889j07414
16087C68465j9014j23018j17170n3824N6970q4056q3979l0693j4851j44720r2036
16076c37926J94465O5870K86021K1643j59248n2275O731O6536K3351j44360p0470
$$ plain form
16065 -99662 -142008 -94779 -47189 -105795 -111448 -131626 -23304 63480 99192 -70465 -212937
16054 -212937 -101879 -170795 -129060 -1381 -34779 -131038 -139281 -53409 -2953 51669 -88035
16043 -88035 46227 121597 -122059 -230833 -284700 -377489 -429214 -398856 -372678 -425058 -383099
16032 -383099 -340150 -220220 -162465 -35253 -75753 -67249 10051 -152794 -287867 -188153 -138915
16021 -138915 -137918 -97637 -105475 -207307 -266193 -279308 -216246 -244940 -381863 -503999 -253401
16010 -253401 -180354 -170123 -202970 -322288 -378624 -247273 -123490 -235165 -180089 -71168
16000 -71168 35247 -65012 -150913 -75016 -130980 -119249 -104333 -134976 -54297 -13745 660
15989 660 -155200 -317896 -316143 -164904 -46445 -109787 -121127 -153797 -21591 -136677 -230177
$$ packed form
16065i9662m2346M7229M7590n8606n653k0178J08322Q6784L5712j69657j42472
16054b12937J11058o8916M1735J27679l3398r6259q243Q5872N0456N4622j39704
16043h8035J34262P5370k43656j08774n3867r2789n1725L0358K6178n2380M1959
16032c83099M2949J19930N7755J27212m0500Q504P7300j62845j35073R9714M9238
16021a38915R97M0281p838j01832n8886j3115O3062k8694j36923j22136K50598
16010b53401P3047J0231l2847j19318n6336J31351J23783j11675N5076J08921
16000g1168J06415j00259q5901P5897n5964J1731J4916l0643Q0679M0552J4405
15989F60j55860j62696J753J51239J18459o3342j1340l2670J32206j15086r3500
$$ plain form
15978 -230177 -39228 78087 78692 66248 -57325 -111924 -198548 -326672 -350019 -282338 -189733
15967 -189733 -108208 -94692 -170053 -215146 -208946 -103888 -104533 -53486 -62666 -176532 -82627 -25737
15955 -25737 -133639 -112930 4055 46704 -20782 -96846 -41261 8457 -9333 -192756 -467486
15944 -467486 -329048 -247716 -129992 7759 109435 93678 -62522 -182529 -251570 -232293
15934 -232293 -302252 -109817 67923 152721 212847 -65590 -86381 31390 79647 79296 -2475
15923 -2475 102764 208205 185130 -18582 -148711 -228658 -116710 -145406 -145377 -128062 -51325
15912 -51325 68849 -32276 -20874 -6572 -7255 -106439 -112940 97214 139594 170943 75727 -49090
15900 -49090 17359 36320 -10879 189886 205449 157932 368369 402059 222719 55255 -44742
$$ packed form
15978b30177J90949J17315O05j2444j23573n4599q6624j28124k3347O7681R2605
15967a89733Q1525J3516p5361m5093O200J05058o45N1047r180j13866R3905N6890
15955b5737j07902K0709J16985M2649o7486p6064N5585M9718j7790j83423k74730
15944d67486J38438Q1332J17724J37751J01676j5757j56200j20007o9041J9277
15934b32293o9959J92435J77740Q4798O0126k78437k0791J17771M8257l51q1771
15923b475J05239J05441k3075k03712j30129p9947J11948k8696K9J7315P6737
15912e1325J20174j01125J1402J4302o83r9184o501K10154M2380L1349r5216j24817
15900d9090O6449J8961m7199K00765J5563m7517K10437L3690j79340j67464r9997
$$ plain form
15889 -44742 -250104 -286522 -161761 -76820 -102804 -120836 -68761 -74532 -92957 58699 247194
15878 247194 337441 331126 298446 229305 130395 64666 105692 194934 83417 31280 130907
15867 130907 -27050 -202924 -149014 30305 71211 -38038 62843 63706 -48138 -145840 -106672
15856 -106672 -86450 -194257 -140242 -15683 -96417 -211436 -215414 -239403 -202692 -80376 -83963
15845 -83963 -110782 27392 95244 -66996 -312536 -199644 78690 91742 71603 157057 73465
15834 73465 17667 -55713 -10937 -29266 55685 196216 195220 46103 13189 -27897 -47387 -41371
15822 -41371 -49883 -3395 -763 -80097 -211312 -158583 -326709 -371391 -232612 -33949 -134579
15811 -134579 -122698 -218336 -324375 -272880 -152519 -98709 -222115 -266376 -129951 -31408 -70872
$$ packed form
15889d4742k05362l6418J24761Q4941k5984j8032N2075n771j8425J51656J88495
15878B47194R0247o315l2680o9141r8910o5729M1026Q9242j11517n2137R9627
15867A30907j57957j75874N3910J79319M0906j09249J00881Q63j11844r7702L9168
15856a06672K0222j07807N4015J24559q0734j15019l978k3989L6711J22316l587
15845h3963k6819J38174O7852j62240k45540J12892K78334J3052k0139Q5454q3592
15834G3465n5798p3380M4776j8329Q4951J40531r96j49117l2914m1086j9490O016
15822d1371q512M6488K632p9334j31215N2729j68126m4682J38779J98663j00630
15811a34579J1881r5638j06039N1495J20361N3810j23406m4261J36425R8543l9464
$$ plain form
15800 -70872 -135367 -97506 -103391 58637 85325 -100996 -104277 -10045 32598 -19509 -92377 -86103
15788 -86103 -62554 -3231 17002 230397 384380 223750 160789 85978 120593 -22994 -37343
15777 -37343 9868 76297 23833 -35884 -73948 3859 -104556 -175506 66553 198180 274365
15766 274365 36551 -253988 -261640 -5160 -67097 -84897 -93946 -46021 8513 39873 -57312
15755 -57312 -181898 -92142 -65612 -31427 -124624 -227848 -293095 -240955 -303984 -285095 39145
15744 39145 107609 145682 71074 -68340 -35093 33153 49054 109162 141190 167695 182533
15733 182533 89205 55363 127052 30320 101089 152650 23696 2771 65498 173066 -83155
15722 -83155 -170095 -232017 -200029 -46354 -122558 -249488 -282533 -229013 -178503 -117275 33353
$$ packed form
15800g0872o4495L7861n885J62028K6688j86321l281R4232M2643n2107p2868O274
15788h6103K3549N9323K0233K13395J53983j60630o2961p4811L4615j43587j4349
15777c7343M7211O6429n2464n9717l8064P7807j08415p0950K42059J31627P6185
15766B74365k37814k90539p652K56480o1937j7800r049M7925N4534L1360r7185
15755e7312j24586Q9756K6530L4185r3197j03224o5247N2140o3029J8889L24240
15744C9145O8464L8073p4608j39414L3247O8246J5901O0108L2028K6505J4838
15733A82533r3328l3842P1689r6732P0769N1561j28954k0925O2727J07568k56221
15722h3155q6940o1922L1988J53675p6204j26930l3045N3520N0510O1228J50628
$$ plain form
15711 33353 97611 104468 31586 -163784 -165180 -255575 -205089 -173559 -152493 -23290 -55502 -45337
15699 -45337 18673 -31685 -154365 -169844 -32911 33152 -132068 -219283 -259118 -309834 -382474
15688 -382474 -301524 -274026 -265105 -279179 -188887 -24547 13028 -69044 -9319 -5346 16282 27439
15676 27439 106446 141025 157928 135127 -46709 -127257 -226563 -213094 -114674 -345604 -409418
15665 -409418 -431776 -409647 -278953 -269445 -307449 -325873 -269534 -230261 -179287 -213098 -130268
15654 -130268 -85451 -85215 -180079 -234307 -139878 -114446 -99596 -94170 37540 90334 -86303 -300449
15642 -300449 -229045 -150548 -89486 -127909 -141638 -74278 -193011 -110219 -35274 -886 66236
15631 66236 -13266 -132348 -136093 -132117 -260556 -231482 -290715 -352052 -383893 -388400 -350111 -223464
$$ packed form
15711C3353O4258O857p2882j95370j396r0395N0486L1530K1066J29203l2212J0165
15699d5337O4010n0358j22680j5479J36933O6063j65220q7215l9835n0716p2640
15688c82474Q0950K7498Q921j4074R0292J64340L7575q2072N9725L973K1628J1157
15676B7439P9007L4579J6903k2801j81836q0548r9306J3469R8420k30930o3814
15665d09418k2358K2129J30694R508l8004j8424N6339L9273N0974l3811Q2830
15654a30268M4817K36r4864n4228R4429K5432J4850N426J31710N2794j76637k14146
15642c00449P1404P8497O1062l8423j3729O7360j18733Q2792P4945L4388O7122
15631F6236p9502j19082l745L976j28439K9074n9233o1337l1841m507L8289J26647
$$ plain form
15619 -223464 -145604 -63847 181283 195681 -9361 -55859 -15670 19928 970 -98560 -196157
15608 -196157 6486 -3838 -233412 -88191 -50902 -91408 -51920 14732 -15254 -21609 157584
15597 157584 214838 131868 130548 39127 37028 -3541 -125486 -164088 -307673 -268990 -130327
15586 -130327 53956 31120 190362 110408 -105683 -212325 -110493 -61490 -64636 10807 -58510
15575 -58510 -125866 -308519 -216384 -91561 24052 142550 113745 -16472 -41769 -7653 20847
15564 20847 11703 -25402 -79953 -167539 -86614 -151719 -202711 -33019 -140069 -185029 -150703
15553 -150703 -109764 -52972 -33872 -81082 -45802 -185819 -252275 -278668 -188852 -160841 -250521
15542 -250521 -361401 -139913 -70456 45258 -84404 -140957 -76825 -45949 138639 63355
$$ packed form
15619b23464P7860Q1757K45130J4398k05042m6498M0189L5598j8958r9530r7597
15608a96157K02643j0324k29574J45221L7289m0506L9488O6652k9986o355J79193
15597A57584N7254q2970j320r1421k099m0569j21945l8602j43585L8683J38663
15586a30327J84283k2836J59242p9954k16091j06642J01832M9003l146P5443o9317
15575e8510o7356j82653R2135J24823J15613J18498k8805j30217k5297L4116K8500
15564B0847r144l7105n4551q7586Q0925o5105n0992J69692j07050m4960L4326
15553a50703M0939N6792J9100m7210L5280j40017o6456k6393Q9816K8011q9680
15542b50521j10880K21488O9457J15714j29662n6553O4132L0876J84588p5284
$$ plain form
15532 63355 -1767 74412 59896 -106970 -244929 -197788 -45362 -157386 -102493 -29215 -51325
15521 -51325 -56494 -170606 -302673 -377530 -309323 -131950 -126867 -78116 3521 8533 73081 103544
15509 103544 -90258 -141181 -37983 -21436 -12137 87512 -61265 -191777 -328964 -484507
15499 -484507 -456016 -100117 -50544 -206717 -160819 -265959 -236271 -14166 19865 -108736
15489 -108736 -104217 -168735 -255063 -102167 -17964 -108333 81174 50729 -211203 -214411 -76988
15478 -76988 -73325 -261044 -185335 -128029 -203828 -200977 -278408 -156120 -23960 93613 189477
15467 189477 215556 166584 191294 151446 -61025 -292331 -266135 -98179 -85376 26612 -59931
15456 -59931 -147608 -74512 -34896 -45003 126308 55292 -58279 3955 93282 195221 216758
$$ packed form
15532F3355o5122P6179j4516j66866j37959M7141J52426j12024N4893P3278k2110
15521e1325n169j14112j32067p4857O8207J77373N083M8751Q1637N012O4548L0463
15509A03544j93802n0923J03198J6547R299R9649j48777j30512j37187j55543
15499d84507K8491L55899M9573j56173M5898j05140K9688K22105L4031j28601
15489a08736M519o4518q6328J52896Q4203r0369J89507l0445k61932l208J37423
15478g6988L663j87719P5709N7306p5799K851p7431J22288J32160J17573R5864
15467A89477K6079m8972K4710l9848k12471k31306K6196J67956J2803J11988q6543
15456e9931q7677P3096L9616j0107J71311p1016j13571O2234Q9327J01939K1537
$$ plain form
15445 216758 123766 34400 81749 96884 -26139 -102007 499 111565 164886 161829 -39067
15434 -39067 -135674 -148198 -87397 -51345 -115061 -315374 -285750 -149579 -103754 -31585 104269
15423 104269 74154 117921 96518 86283 -33738 961 223055 178143 157169 364354 315454
15412 315454 229398 66545 115310 51891 36964 145849 -34853 -84057 -187079 -243420 -258787
15401 -258787 -150634 -151744 -250229 -388121 -294555 -219444 -270911 -239103 -326819 -318973 -71948
15390 -71948 -169935 -228600 -113822 -43500 138277 123145 165707 211440 91044 -79342 -117098
15379 -117098 -63241 45435 56712 -270557 -309717 -205092 -230163 -242375 -188956 -59298 -59348
15368 -59348 -127780 -208296 -123660 -113149 -211462 -292366 -335440 -409603 -329776 -103716 -21297
$$ packed form
15445B16758r2992q9366M7349J5135j23023p5868J02506J11066N3321l057k00896
15434c9067r6607j2524O0801L6052o3716k00313K9624J36171M5825P2169J35854
15423A04269l0115M3767k1403j0235j20021L4699K22094m4912k0974K07185m8900
15412C15454q6056j62853M8765o3419j4927J08885j80702m9204j03022n6341j5367
15401b58787J08153j110r8485j37892R3566P5111n1467L1808q7716P846K47025
15390g1948r7987n8665J14778P0322J81777j5132M2562M5733j20396j70386l7756
15379a17098N3857J08676J1277l27269l9160J04625k5071j2212N3419J29658n0
15368e9348o8432q0516Q4636J0511r8313q0904m3074p4163P9827K26060Q2419
$$ plain form
15357 -21297 -125946 -154116 -96167 -28512 -118957 -149361 32115 -27654 -91581 22265 -25291
15346 -25291 -155463 -289939 -328955 -84398 13184 15567 -94885 -207103 -69500 155209
15336 155209 110256 18414 -126892 -158601 -273355 -326025 -134449 55525 -23104 107409
15326 107409 108830 196919 203480 216364 284723 40433 -94043 -31512 -69922 -16804 -36722
15315 -36722 -55023 -76269 10776 184131 140182 6926 7029 46409 -78850 -183198 -135476
15304 -135476 49575 151942 109437 -20260 -5619 -3699 -195209 -240694 -59901 -45641 2287
15293 2287 -24441 -82847 -173037 -116107 13036 -22057 -25875 -110036 -103695 -151965 -98737 29367
15281 29367 58448 -111966 -115562 -81633 -69705 -134605 -60225 22000 -122670 -220880 -202416
$$ packed form
15357b1297j04649k8170N7949O7655r0445l0404J81476n9769o3927J13846m7556
15346b5291j30172j34476l9016K44557R7582K383j10452j12218J37603K24709
15336A55209m4953r1842j45306l1709j14754n2670J91576J89974p8629J30513
15326A07409J421Q8089O561J2884O8359k44290j34476O2531l8410N3118j9918
15315c6722j8301k1246Q7045J73355m3949j33256J03L9380j25259j04348M7722
15304a35476J85051J02367m2505j29697J4641J920j91510m5485J80793J4260M7928
15293B287k6728n8406r0190N6930J29143l5093l818q4161O341m8270N3228J28104
15281B9367K9081j70414l596L3929J1928o4900P4380Q2225j44670r8210J8464
$$ plain form
15270 -202416 -181760 -54533 9475 -174832 -229147 -2059 -39193 -12681 -31775 -118142 -93868
15259 -93868 111034 320911 436812 176845 60092 69746 -50184 -41868 20611 6621 -48443
15248 -48443 -31754 -427 35401 -51545 -117201 -116487 -102508 -200498 -240877 -244869 -327758 -344751
15236 -344751 -377426 -372461 -354945 -244339 -161351 -166054 -108157 64501 131953 141177 103067 -8469
15224 -8469 -12962 36662 53968 46209 39306 -27356 -68831 -245212 -43465 180738 135964 125620
15212 125620 63989 -103593 -105823 -76144 -60260 -97569 -205544 -96277 200271 170575 -98669
15201 -98669 -269626 -110263 -236182 -300201 -140548 -13412 30671 71881 78128 -49928 -68758
15190 -68758 96839 200945 329586 261233 111029 113718 -52905 -147176 -270611 -276495 -311512
$$ packed form
15270b02416K0656J27227O4008j84307n4315K27088l7134K6512j9094q6367K4274
15259i3868K04902K09877J15901k59967j16753R654j19930Q316O2479j3990n5064
15248d8443J6689L1327L5828q6946o5656P14J3979r7990m0379l992q2889j6993
15236c44751l2675M965J7516J10606Q2988m703N7897J72658O7452R224l8110j11536
15224h469m493M9624J7306p759o903o6662m1475j76381K01747K24203m4774j0344
15212A25620o1631j67582k230K9679J5884l7309j07975J09267K96548k9696k69244
15201i8669j70957J59363j25919o4019J59653J27136M4083M1210O247j28056j8830
15190f8758J65597J04106J28641o8353j50204K689j66623r4271j23435n884l5017
$$ plain form
15179 -311512 -193512 -117945 -61965 67188 81498 107516 123220 103319 -29620 -145867 -106371
15168 -106371 24271 169475 156499 -19274 -222501 -267358 -181623 -162392 -43117 33813
15158 33813 133350 251212 63281 7868 -48641 11994 103237 89812 54395 77160 145201
15147 145201 68933 -50044 -162514 -114266 25777 69564 70863 7882 -286942 -210457 -20089
15136 -20089 -52872 -157727 -210537 -257330 -216413 -97845 -57640 -16091 -29316 -24051 -12516
15125 -12516 -14864 27350 -32986 -127726 -185548 -144729 90543 220307 227740 169430 135210 127357
15113 127357 109691 65310 745 -190824 -142277 -68261 14438 191856 181295 59382 -23811
15102 -23811 -234264 -407751 -230290 -11893 58897 130855 50298 -147107 -238121 -261870 -196925
$$ packed form
15179c11512J18000P5567N5980J29153J4310K6018J5704j9901j32939j16247L9496
15168a06371J30642J45204j2976j75773k03227m4857Q5735J9231J19275P6930
15158C3813R9537J17862j87931n5413n6509O0635R1243j3425l5417K2765O8041
15147A45201p6268j18977j12470M8248J40043M3787J299o2981k94824P6485J90368
15136b0089l2783j04855n2810m6793M0917J18568M0205M1549j3225N265J1535
15125a2516k348M2214o0336r4740n7822M0819K35272J29764P433n8310l4220p853
15113A27357j7666m4381o4565j91569M8547P4016Q2699J77418j0561j21913q3193
15102b3811k10453j73487J77461K18397P0790P1958q0557j97405r1014k3749O4945
$$ plain form
15091 -196925 -65944 -24039 -122408 -132987 -254118 -82174 150668 108983 115920 87938 54890
15080 54890 121756 143442 201345 187447 130291 114672 152525 -19222 -218534 -170424 -71628
15069 -71628 -77730 -151775 -61912 -66888 -125765 -178836 -280627 -316700 -440554 -410899 -324710 -364034
15057 -364034 -184279 -127815 -144321 -294469 -416418 -327189 -348089 -393000 -231189 -107225
15047 -107225 -83424 -123299 -67307 -86292 75085 163775 154455 174364 79609 98007 146101
15036 146101 75889 -19365 16276 -148001 -190761 -192611 -213299 -220879 -67770 -12561 -59764
15025 -59764 -19868 -155800 -112667 -90912 -167240 -77908 -50664 -73443 -152620 -244954 -267015
15014 -267015 -247885 17292 160819 74370 -22949 122070 176576 175170 150474 111622 22938
$$ packed form
15091a96925J30981M1905r8369j0579j21131J71944K32842m1685O937k7982l3048
15080E4890O6866K1686N7903j3898n7156j5619L7853j71747j99312M8110R8796
15069g1628o102p4045Q9863m976n8877n3071j01791l6073j23854K9655Q6189l9324
15057c64034J79755N6464j6506j50148j21949Q9229k0900m4911J61811J23964
15047a07225K3801l9875N5992j8985J61377Q8690r320J9909r4755J8398M8094
15036A46101p0212r5254L5641j64277m2760j850k0688p580J53109N5209m7203
15025e9764L9896j35932M3133K1755p6328Q9332K7244k2779p9177r2334k2061
15014b67015J9130K65177J43527q6449r7319J45019N4506j406k4696l8852q8684
$$ plain form
15003 22938 -38505 65356 183479 159258 14765 48407 86786 201625 -15202 -67237 114945
14992 114945 213720 118003 44903 47529 62751 -21851 -152672 -125711 46163 135691 81142
14981 81142 63008 -67368 -77246 -14101 87980 -16165 -50057 -167105 -282022 -266651 -202491
14970 -202491 -378076 -403502 -395964 -192526 -108998 -30628 -88798 -297807 -297033 -197447 -65249
14959 -65249 -182076 -329469 -254943 -104065 -106408 -111596 -68752 -23586 -90215 -254768 -301067
14948 -301067 -215525 -208259 -169690 28056 127168 178141 233434 176371 53495 8976 103100
14937 103100 208083 114351 -166511 -388377 -417327 -219710 -152285 -127034 -102372 -11568 45924
14926 45924 -140423 -278708 -227523 -360374 -255811 -6047 71721 -68527 -277284 -347554
$$ packed form
15003B2938o1443J03861J18123k4221j44493L3642L8379J14839k16827n2035J82182
14992A14945R8775r5717p3100K626J5222q4602j30821K6961J71874Q9528n4549
14981H1142j8134j30376r878O3145J02081j04145l3892j17048j14917J5371O4160
14970b02491j75585k5426P538K03438Q3528P8370n8170k09009P74R9586J32198
14959f5249j16827j47393P4526J50878k343n188M2844M5166o6629j64553m6299
14948c01067Q5542P266L8569J97746R9112N0973N5293n7063j22876m4519R4124
14937A03100J04983r3732k80862k21866k8950J97617O7425K5251K4662R0804N7492
14926D5924j86347j38285N1185j32851J04563K49764P7768j40248k08757p0270
$$ plain form
14916 -347554 -127100 -24975 -58989 -107506 -21681 22711 -31375 -9491 49705 22494 -170116
14905 -170116 -309701 -192751 -227426 -140681 45391 13935 -21649 68076 60074 -71585 -111763
14894 -111763 -124105 -97344 -73310 -54349 13496 157868 166533 45473 -109617 -85166 72123
14883 72123 78513 101915 -36069 54766 175027 208744 304107 286656 211172 140879 87658
14872 87658 -19738 -52039 27441 -26510 -77120 30570 151785 -7822 -8806 -76753 -95738
14861 -95738 -94664 -45815 -46331 50778 116608 111512 -42930 -38246 39959 109163 45954 -6937
14849 -6937 -63648 47096 191016 293857 265207 210545 143138 10952 -194843 -232910 -248495
14838 -248495 -237897 -227207 -142853 -210235 -277931 -222553 -111947 -187187 -297472 -280101 -318069
$$ packed form
14916c47554K20454J02125l4014m8517Q5825M4392n4086K1884N9196k7211j92610
14905a70116j39585J16950l4675Q6745J86072l1456l5584Q9725q002j31659m0178
14894a11763j2342K6761K4034J8961O7845J44372Q665j21060j55090K4451J57289
14883G2123O390K3402j37984R0835J20261L3717R5363j7451p5484p0293n3221
14872H7658j07396l2301P9480n3951n0610J07690J21215j59607r84o7947j8985
14861i5738J074M8849n16R7109O5830n096j54442M684P8205O9204o3209n2891
14849f937n6711J10744J43920J02841k8650n4662o7407j32186k05795l8067j5585
14838b48495J0598J0690Q4354o7382o7696N5378J10606p5240j10285J7371l7968
$$ plain form
14827 -318069 -243672 -180678 -115385 -391017 -538190 -374150 -332679 -292716 -316908 -461615 -386826
14816 -386826 -92120 67475 -3964 -207218 -362126 -281334 -49153 16914 10119 -125710
14806 -125710 -106539 -269065 -353007 -339115 -263702 -253755 57579 100114 6 54624 39262
14795 39262 -71537 -165883 -221703 -168234 35455 159056 176146 135065 16505 -28152 29074
14784 29074 11196 55664 -33800 -97839 -24308 31363 -112582 -250752 -187647 -19038 68449
14773 68449 -83439 -112072 -24990 -140822 -113459 1053 -95548 -160136 -88246 -23927 10374
14762 10374 87381 190703 206965 131590 107660 142480 167553 104734 -27220 -183678 38049
14751 38049 183223 -1504 -18658 82858 132416 30816 259571 220679 174188 46531
$$ packed form
14827c18069P4397O2994O5293k75632j47173J64040M1471L9963k4192j44707P4789
14816c86826K94706J59595p1439k03254j54908Q0792K32181O6067o795j35829
14806a25710J9171j62526q3942J3892P5413R947L11334M2535j00108N4618j5362
14795C9262j10799r4346n5820N3469K03689J23601J7090m1081j18560m4657N7226
14784B9074j7878M4468q9464o4039P3531N5671j43945j38170O3105J68609Q7487
14773F8449j51888k8633Q7082j15832K7363J14512r6601o4588P1890O4319L4301
14762A0374P7007J03322J6262p5375k3930L4820K5073o2819j31954j56458K21727
14751C8049J45174j84727j7154J01516M9558j01600K28755l8892m6491j27657
$$ plain form
14741 46531 174207 326882 266693 223445 69601 -10929 -488 -60848 30697 44267 -68282
14730 -68282 -148840 -318940 -304319 -125497 -29449 21050 -22028 -300114 -393993 -266479 -63762
14719 -63762 69180 -94644 -286127 -286249 -192104 -280583 -123338 173886 116715 47261 -2755
14708 -2755 -38838 -8303 -38533 -27695 -48069 40763 4507 100094 -60586 -61754 -104515 -157366
14696 -157366 -184894 -165374 -116592 67723 122810 181582 212683 67655 -45728 -109180 -117
14685 -117 -24009 -155907 -294763 -359999 -297858 -262865 -150228 -83218 59715 143051 181182
14674 181182 -204 -72582 -85234 -149276 -386763 -410480 -284268 -97084 -176404 -104238 -26920
14663 -26920 97577 184537 309726 214163 70714 56862 232429 242073 299819 403035 334432
$$ packed form
14741D6531J27676J52675o0189m3248j53844q0530J0441o0360R1545J3570j12549
14730f8282q0558j70100J4621J78822R6048N0499m3078k78086r3879J27514K02717
14719f3762J32942j63824j91483j22R4145q8479J57245K97224n7171o9454n0016
14708b755l6083L0535l0230J0838k0374Q8832l6256R5587j60680j168m2761n2851
14696a57366k7528J9520M8782J84315N5087N8772L1101j45028j13383o3452J09063
14685a17k3892j31898j38856o5236O2141L4993J12637O7010J42933Q3336L8131
14674A81182j81386p2378j2652o4042k37487k3717J26212J87184p9320P2166P7318
14663b6920J24497Q6960J25189r5563j43449j3852J75567R644N7746J03216o8603
$$ plain form
14652 334432 245954 231850 163956 100012 -86724 -86342 -52758 10156 29798 37872 -104999 -60137
14640 -60137 84797 92273 116690 186611 113170 3167 -162576 -189859 -262089 -241620 -47520
14629 -47520 -41762 -70734 -17723 24124 37445 -10185 5748 152226 158473 38320 -56700 -106563
14617 -106563 -306903 -248734 -37871 -42519 -191422 -287526 -315324 -314968 -177965 5361 -56962
14606 -56962 -143163 -22491 -1627 72826 155141 189024 52317 -76941 -117208 -75689 38383
14595 38383 36139 -64009 -90309 134588 75205 2205 7295 141458 164125 66477 -125323
14584 -125323 -200296 -80154 43926 74300 -19994 -188724 19657 368392 276733 21443
14574 21443 -109967 -172282 -134728 -168456 -187096 -223721 -203802 -58362 63672 68111 -84641
$$ packed form
14652C34432q8478j4104o7894o3944j86736L82L3584O2914J9642Q074j42871M4862
14640f0137J44934P476K4417O9921p3441j10003j65743k7283p2230K0469J94100
14629d7520N758k8972N3011M1847J3321m7630J5933J46478O247j20153r5020m9863
14617a06563k00340N8169K10863m648j48903r6104k7798L56J37003J83326o2323
14606e6962q6201J20672K0864P4453Q2315L3883j36707j29258m0267M1519J14072
14595C8383k244j00148k6300K24897n9383p3000N090J34163K2667r7648j91800
14584a25323p4973J20142J24080L0374r4294j68730K08381L48735r1659k55290
14574B1443j31410o2315L7554l3728j8640l6625J9919J45440J22034M439j52752
$$ plain form
14563 -84641 -63013 42933 268384 315213 188071 15404 -87703 -59812 -33101 -19253 -63765
14552 -63765 105830 223754 160279 302834 229677 -22497 -11759 275288 433687 350176
14542 350176 185977 112492 -40799 -81644 -116159 -463266 -630371 -378071 -218455 -94252
14532 -94252 -147609 -181824 -194499 -183249 -238907 -181661 -37631 -118407 -89470 -99037 -39915 -90238
14520 -90238 -21869 -75580 -142607 -111393 131490 252341 51395 -3560 -15794 -49419 -65754
14509 -65754 -84206 50908 51977 132452 133852 -38382 -69094 -21734 -469 25708 110982 43703
14497 43703 195091 97381 69935 -6360 23129 95826 279280 186093 -73594 -140150 32684
14486 32684 20946 43176 -5998 -15962 -36809 80014 17885 66297 42768 58929 109763 152070
$$ packed form
14563h4641K1628J05946K25451M6829j27142j72667j03107K7891K6711J3848m4512
14552f3765J69595J17924o3475J42555p3157k52174J0738K87047J58399q3511
14542C50176j64199p3485j53291m0845l4515l47107j67105K52300J59616J24203
14532i4252n3357l4215j2675J1250n5658N7246J44030q0776K8937r567N9122n0323
14520i0238O8369n3711o7027L1214K42883J20851k00946n4955j2234l3625j6335
14509f5754j8452J35114J069Q0475J400j72234l0712M7360K1265K6177Q5274o7279
14497D3703J51388r7710k7446p6295K9489P2697J83454r3187k59687o6556J72834
14486C2684j1738K2230m9174r964k0847J16823o2129M8412k3529J6161N0834M2307
$$ plain form
14474 152070 96724 159900 286333 362861 280966 202739 181815 84196 -58303 6636 89012
14463 89012 69559 -96356 -357726 -484970 -298475 9363 120834 72212 73982 117471 109956
14452 109956 210031 161293 -72589 -230930 -360702 -385327 -276852 -191545 -216037 -155590
14442 -155590 -224167 -179067 -246997 -131209 -152632 -167858 17679 276418 270156 97769 -20953
14431 -20953 39744 45700 -88199 -175598 -270222 -263390 -225200 -209701 -74643 -28094 -61828 -40587
14419 -40587 -135431 -260367 -65060 23208 -112676 -147874 -40364 19955 73542 36057 85759
14408 85759 85148 61574 62598 79751 152434 28906 82043 84827 -13455 31957 -8669 185556
14396 185556 153675 159790 83445 8603 28157 70428 87042 269283 259087 56550 -93697
$$ packed form
14474A52070n5346O3176J26433P6528q1895p8227k0924r7619j42499O4939Q2376
14463H9012j9453j65915k61370j27244J86495L07838J11471m8622J770M3489p515
14452A09956J00075m8738k33882j58341j29772k4625J08475Q5307k4492O0447
14442a55590o8577M5100o7930J15788k1423j5226J85537K58739o262j72387j18722
14431b0953O0697N956j33899q7399r4624O832L8190J5499J35058M6549l3734K1241
14419d0587r4844j24936J95307Q8268j35884l5198J07510O0319N3587l7485M9702
14408H5759o11k3574J024J7153P2683j23528N3137K784r8282M5412m0626J94225
14396A85556l1881O115p6345p4842J9554M2271J6614J82241j0196k02537j50247
$$ plain form
14385 -93697 -178445 -97099 -280282 -284515 -46564 76125 -43614 -126237 -69500 26238 -37464
14374 -37464 -4908 -146475 -190292 -242806 -224077 -48458 92760 -15417 -3509 64534 -39967
14363 -39967 151984 147545 -4147 33321 148988 232621 204201 147163 8269 -243687 -340754
14352 -340754 -377346 -345264 -371806 -184459 -49751 18366 -132131 -71510 -949 246450 75273
14341 75273 146048 17023 -126915 17038 -77813 -204337 -113256 51452 167872 190786
14331 190786 104838 3113 70672 120868 4482 42128 74955 34364 -74870 -318699 -434443
14320 -434443 -327212 -122776 41268 172957 242908 135159 -84998 6730 150642 245331
14310 245331 25875 -38333 45201 -7041 49048 1105 19749 128297 110559 63020 95952
$$ packed form
14385i3697q4748Q1346j83183m233K37951J22689j19739q2623N6737R5738o3702
14374c7464L2556j41567m3817n2514J8729J75619J41218j08177J1908O8043j04501
14363c9967J91951m439j51692L7468J15667Q3633k8420n7038j38894k51956r7067
14352c40754l6592L2082k6542J87347J34708O8117j50497O0621P0561K47399j71177
14341G5273P0775j29025j43938J43953r4851j26524R1081J64708J16420K2914
14331A90786q5948j01725O7559N0196j16386L7646L2827m0591j09234k43829j15744
14320d34443J07231K04436J64044J31689O9951j07749k20157R1728J43912R4689
14310B45331k19456o4208Q3534n2242N6089m7943J8644J08548j7738m7539L2932
$$ plain form
14299 95952 65171 94704 -26135 -74616 66346 196304 225650 23498 -44312 -175081 -236674
14288 -236674 -84184 29397 -97197 -152212 -67604 25708 196669 95769 5489 -136136
14278 -136136 -115703 90496 211188 137171 -3608 -250032 -198157 -123559 -175118 -267349 -246554
14267 -246554 -191998 -161556 -19652 -122133 -114540 -88991 -24401 -29342 87476 65072 -27891
14256 -27891 -35704 13198 69522 98992 137937 111803 -8324 -14394 -58452 -116889 -202329 45318
14244 45318 -140795 -201819 -46336 -23791 51115 109633 85113 72792 24814 -81647 -167587
14233 -167587 -246247 -196530 -136252 107927 264352 273518 159003 -91885 -235757 -103192
14223 -103192 -29810 -162976 -161815 -2586 46310 75223 110306 -113652 -155734 -127256 -250116
$$ packed form
14299I5952l0781K9533j20839m8481J40962J29958K9346k02152o7810j30769o1593
14288b36674J52490J13581j26594n5015Q4608R3312J70961j00900r0280j41625
14278a36136K0433K06199J20692p4017j40779k46424N1875P4598n1559r2231K0795
14267b46554N4556L0442J41904j02481P593K5549O4590m941J16818k2404r2963
14256b7891p813M8902N6324K9470L8945k6134j20127o070m4058n8437q5440K47647
14244D5318j86113o1024J55483K2545P4906N8518k4520j2321m7978j06461q5940
14233a67587p8660M9717O0278K44179J56425R166j14515k50888j43872J32565
14223a03192P3382j33166J161J59229M8896K8913L5083k23958m2082K8478j22860
$$ plain form
14212 -250116 -210740 -174661 -27619 98177 124079 66310 23047 -132167 -145599 -151959 -141965
14201 -141965 -91723 -38622 -155603 -343241 -410790 -373849 -251204 -69051 -23687 -51948 -185793
14190 -185793 -7073 90265 210297 132482 -12870 3863 -105277 -120492 -165690 -171462 -77192
14179 -77192 102683 52777 4788 144443 249554 225190 188563 117167 101121 166896 31701
14168 31701 -101869 21052 108755 98315 322197 390242 344067 139154 26966 10639 111095
14157 111095 175977 168272 117873 105654 39740 56078 88381 -13945 -86483 -14081 36563
14146 36563 147 63700 227378 110804 102284 27988 42154 2976 -16703 -168990 -313233
14135 -313233 -259259 -257787 -139837 -70152 -10241 69782 20515 -56865 -5634 -16200 -8610 81993
$$ packed form
14212b50116L9376L6079J47042J25796K5902n7769m3263j55214j3432o360R994
14201a41965N0242N3101j16981j87638o7549L6941J22645J82153M5364k8261j33845
14190a85793J78720R7338J20032p7815j45352J6733j09140j5215m5198n772R4270
14179g7192J79875m9906m7989J39655J05111k4364l6627p1396j6046O5775j35195
14168C1701j33570J22921Q7703j0440K23882O8045m6175k04913j12188j6327J00456
14157A11095O4882p705n0399j2219o5914J6338L2303j02326p2538P2402N0644
14146C6563l6416O3553J63678j16574q520p4296J4166l9178j9679j52287j44243
14135c13233N3974J472J17950O9685N9911Q0023m9267p7380N1231j0566P590R0603
$$ plain form
14123 81993 73342 22579 -137333 29166 26795 -49990 -159770 -201821 -228949 -285848 -332118
14112 -332118 -317720 -218096 -191452 -18509 145216 188723 29537 40537 277551 207436 163660
14101 163660 138214 84125 79374 458 -111798 -75405 -3869 164542 127867 157288 203429
14090 203429 73720 114010 348117 438934 220746 46967 42279 242328 202876 -27846
14080 -27846 -67942 -8648 85507 62272 51740 -47001 72024 37887 -131463 12524 -22491
14069 -22491 1543 105965 -4045 -105251 -196868 -204979 -152123 48035 180328 231231 215654
14058 215654 140449 94988 70248 3206 -90654 -70030 -278188 -331926 -277803 -232592 -98265
14047 -98265 -7083 -129358 -62991 38634 -21052 -136605 -240831 -280169 -227378 -107558 -58052
$$ packed form
14123H1993q651n0763j59912J66499k371p6785j09780m2051k7128n6899m6270
14112c32118J4398R9624K6644J72943J63725M3507j59186J1000K37014p0115m3776
14101A63660k5446n4089m751p8916j12256L6393P1536J68411l6675K9421M6141
14090B03429j29709M0290K34107R0817k18188j73779m688K00049l9452k30722
14080b7846m0096N9294R4155k3235j0532r8741J19025l4137j69350J43987l5015
14069b2491K4034J04422j10010j01206r1617q111N2856K00158J32293N0903j5577
14058B15654p5205m5461k4740o7042r3860K0624k08158n3738N4123M5211J34327
14047i8265R1182j22275O6367J01625n9686j15553j04226l9338N2791J19820M9506
$$ plain form
14036 -58052 7655 -13829 -28250 162259 198799 -47946 -131372 -79865 2223 53056 -2644
14025 -2644 -18879 59558 184711 174142 77362 118573 105794 14066 -135483 -105743 -61739
14014 -61739 6085 973 -24738 -1589 -172354 -163020 -295876 -256877 -172599 -18326 35843
14003 35843 28265 -15068 -93222 54007 166258 186649 284574 228418 200093 4920 -147592
13992 -147592 -224871 -229781 -34714 54161 25872 43693 120597 141470 84642 107769 53952
13981 53952 74553 28804 33716 49766 -141565 -273852 -87277 63805 117260 75297 76371
13970 76371 122167 171109 15089 -29186 69703 179550 316230 167966 105505 33903 -92397
13959 -92397 -123539 81131 289583 240881 101203 129295 143295 187685 277405 154314 160417
$$ packed form
14036e8052O5707k1484j4421J90509L6540k46745q3426N1507Q2088N0833n5700
14025b644j6235P8437J25153j0569r6780M1211j2779r1728j49549K9740M4004
14014f1739O7824n112k5711K3149j70765R334j32856L8999Q4278J54273N4169
14003C5843p578m3333p8154J47229J12251K0391R7925n6156k8325j95173j52512
13992a47592p7279m910J95067Q8875k8289J7821P6904K0873n6828K3127n3817
13981E3952K0601m5749M912J6050j91331j32287J86575J51082N3455m1963J074
13970G6371M5796M8942j56020m4275R8889J09847J36680j48264o2461p1602j26300
13959i2397l1142K04670K08452m8702j39678K8092J4000M4390Q9720j23091O103
$$ plain form
13948 160417 152596 264928 284264 328872 379452 321198 222646 296357 78979 -82089 -188002
13937 -188002 -107374 19497 -11890 113243 110442 -50630 -82900 95888 222125 173540 122814
13926 122814 141634 42909 -11509 -68983 -48630 27440 -27384 87272 225734 223235 98466
13915 98466 76743 -73045 -226514 -153656 -112610 -148727 -10652 90531 149164 93986 108001
13904 108001 145368 212274 330626 309738 325560 383187 500518 439000 378072 465063 423258
13893 423258 288329 322035 242848 134285 44609 29235 66833 117600 175675 42023 -18765
13882 -18765 -127184 -138721 -144234 -29194 -28414 -65996 20064 87495 201762 252753 333076 493074
13870 493074 462582 351206 425519 514009 497461 271087 249491 268210 103153 42547 70431
$$ packed form
13948A60417p821J12332J9336M4608N0580n8254r8552P3711k17378j61068j05913
13937a88002Q0628J26871l1387J25133k801j61072l2270J78788J26237m8585n0726
13926A22814J8820r8725n4418n7474K0353P6070n4824J14656J38462k499j24769
13915I8466k1723j49788j53469P2858M1046l6117J38075J01183N8633n5178J4015
13904A08001L7367O6906J18352k0888J5822N7627J17331o1518o0928Q6991m1805
13893D23258j34929L3706p9187j08563q9676j5374L7598N0767N8075j33652o0788
13882a8765j08419j1537n513J15040P80l7582Q6060O7431J14267N0991Q0323J59998
13870D93074l0492j11376P4313Q8490j6548k26374k1596J8719j65057o0606K7884
$$ plain form
13859 70431 -24015 181327 264559 179409 175381 171180 176850 247430 428233 579895 622660 781337
13847 781337 792947 725518 506013 250410 47863 -23040 51419 171675 216377 328573
13837 328573 222545 53393 -8154 141729 246733 407758 445149 493273 498921 231129
13827 231129 -131194 -318954 -46521 223751 404135 338298 100247 51999 145509 -16400
13817 -16400 -10276 88176 -39869 -184147 -226745 70847 98942 12794 -123589 -105785 -91341
13806 -91341 -156469 4530 -1732 98322 230119 170881 -42842 -47392 153999 222248 281421
13795 281421 317370 235627 345628 367546 379392 296567 169712 214630 325074 228641 268923
13784 268923 157539 -52563 -65441 -19161 87308 178960 124142 -10454 131376 260268
$$ packed form
13859G0431r4446K05342Q3232q5150m028m201N670P0580J80803J51662M2765J58677
13847G81337J1610o7429k19505k55603k02547p0903P4459J20256M4702J12196
13837C28573j06028j69152o1547J49883J05004J61025L7391M8124N648k67792
13827B31129l62323j87760K72433K70272J80384o5837k38051m8248R3510j61909
13817a6400O124R8452j28045j44278m2598K97592K8095q6148j36383J7804J4444
13806i1341o5128J60999o262J00054J31797n9238k13723m550K01391O8249N9173
13795B81421L5949q1743J10001K1918J1846q2825j26855M4918J10444r6433M0282
13784B68923j11384k10102j2878M6280J06469R1652n4818j34596J41830J28892
$$ plain form
13774 260268 87933 65408 47003 70816 139066 121739 219626 183644 32819 -95072 -7476
13763 -7476 -96798 -39832 -7559 -42342 -65537 -66106 149105 303871 234344 31796 86152 150343
13751 150343 115243 31955 -101036 40902 128426 -50964 -100146 13357 -50414 -15605 107772
13740 107772 86488 242840 390701 359596 240248 146384 79086 76464 106493 30876 80783
13729 80783 121590 226670 153863 137517 -3166 -22090 88627 174153 251146 278232 178739
13718 178739 -9052 -102521 -182925 -72665 -55951 34018 132967 52883 59833 99550 177452
13707 177452 128022 -33681 -85248 -130144 -32545 -56543 68177 178717 164863 83440 12081
13696 12081 188492 316544 233388 142677 111092 -9808 100411 258339 287733 275704 164756
$$ packed form
13774B60268j72335k2525j8405K3813O8250j7327R7887l5982j50825j27891Q7596
13763g476q9322N6966L2273l4783k3195n69K15211J54766o9527k02548N4356O4191
13751A50343l5100q3288j32991J41938Q7524j79390m9182J13503o3771L4809J23377
13740A07772k1284J56352J47861l1105j19348r3864o7298k622L0029p5617M9907
13729H0783M0807J05080p2807j6346j40683j8924J10717Q5526P6993K7086r9493
13718A78739j87791r3469q0404J10260J6714Q9969R8949q0084O950L9717P7902
13707A77452m9430j61703n1567m4896R7599k3998J24720J10540j3854q1423p1359
13696A2081J76411J28052q3156r0711l1585j20900J10219J57928K9394j2029j10948
$$ plain form
13685 164756 -32586 -104602 -17932 15553 121738 134571 305042 351289 293545 198329 146763
13674 146763 8434 -14708 29421 116711 286521 463833 421455 292577 189778 62504
13664 62504 188832 353933 440806 513950 431072 314720 442083 411934 353999 305220 312798
13653 312798 151617 -418 58507 51848 4874 209519 439489 332571 304484 385764 376830
13642 376830 397170 478359 541089 555272 425617 311489 203330 98500 47191 75989 91025
13631 91025 107386 179133 324427 300124 236577 232624 164100 197305 182457 180681 275136 385416
13619 385416 147825 214700 291668 236565 188130 106520 325399 383365 371776 443341 438523
13608 438523 258167 307015 353733 166638 59406 29719 5621 92982 149655 246186 321169
$$ packed form
13685A64756j97342p2016Q6670L3485J06185J2833J70471M6247n7744r5216n1566
13674A46763j38329k3142M4129Q7290J69810J77312m2378j28878j02799j27274
13664F2504J26328J65101Q6873P3144q2878j16352J27363l0149n7935m8779P578
13653C12798j61181j52035N8925o659m6974K04645K29970j06918k8087Q1280q934
13642C76830K0340Q1189O2730J4183j29655j14128j08159j04830n1309K8798J5036
13631I1025J6361P1747J45294k4303o3547l953o8524L3205j4848j776R4455J10280
13619C85416k37591O6875P6968n5103m8435q1610K18879N7966j1589P1565m818
13608D38523j80356M8848M6718j87095j07232k9687k4098Q7361N6673R6531P4983
$$ plain form
13597 321169 366275 445589 533220 599183 539169 422306 329328 340326 289995 338616 314763
13586 314763 312983 344892 384321 296023 261985 257877 273624 248068 145436 162885 321973
13575 321973 352237 104645 95451 206938 184878 28629 55376 91869 259748 330332 376195
13564 376195 511517 443273 265328 147247 174074 138775 79555 142294 -22403 -47361 137698
13553 137698 225729 353833 424856 451744 453200 450297 407283 449175 468716 359096 213236
13542 213236 142416 98403 334026 523320 592433 573841 655613 604680 434084 420957 500556
13531 500556 519356 401304 148617 193401 246922 197489 266425 275044 306913 375034 525642
13520 525642 514951 518973 447158 461859 497105 517929 490012 309530 322428 353409 280491
$$ packed form
13597C21169M5106P9314Q7631O5963o0014j16863r2978J0998n0331M8621k3853
13586C14763j780L1909L9429q8298l4038m108J5747k5556j02632J7449J59088
13575C21973L0264k47592r194J11487k2060j56249K6747L6493J67879P0584M5863
13564C76195J35322o8244j77945j18081K6827l5299n9220O2739j64697k4958J85059
13553A37698Q8031J28104P1023K6888J456k903m3014M1892J9541j09620j45860
13542B13236p0820m4013K35623J89294O9113j8592Q1772n0933j70596j3127P9599
13531E00556J8800j18052k52687M4784N3521m9433O8936Q619L1869O8121J50608
13520E25642j0691M022p1815J4701L5246K0824k7917j80482J2898L0981p2918
$$ plain form
13509 280491 465944 518541 461042 635547 619635 518335 553887 535189 433838 440632 334954
13498 334954 342512 475254 546186 606133 574503 531927 646852 735439 836062 1014006 1010920
13487 1010920 1070036 1460120 1727064 1961735 2093991 2478286 2869501 3400034 4122814 5096708
13477 5096708 6471613 8039375 9663808 11426472 13030651 14307913 14791972 14724797 14127336
13468 14127336 13040952 11633905 9943617 8351053 7056324 6264344 5524906 5061891
13460 5061891 4933735 5042388 5412696 6181731 7148277 8361142 9859778 11686738 14122397
13451 14122397 17156162 20395251 23773307 26486332 28456832 29633680 29369794 27663103
13443 27663103 24676679 21313041 17828064 14716541 12102193 10220735 8995823 8218640
$$ packed form
13509B80491J85453N2597n7499J74505j5912j01300L5552j8698j01351O794j05678
13498C34954P558J32742P0932N9947l1630m2576J14925Q8587J00623J77944l086
13487A010920N9116L90084K66944K34671J32256L84295L91215N30533P22780R73894
13477E096708J374905J567762J624433J762664J604179J277262M84059o7175n97461
13468A4127336j086384j407047j690288j592564j294729p91980p39438m63015
13460E061891j28156J08653L70308P69035R66546J212865J498636J826960K435659
13451A4122397L033765L239089L378056K713025J970500J176848k63886j706691
13443B7663103k986424l363638l484977l111523k614348j881458j224912p77183
$$ plain form
13435 8218640 8037189 8001893 8218414 8643855 9359702 10546372 12292946 14862848 18155916
13426 18155916 22145574 26745471 31709028 36734454 41047138 44004851 45300316 44418840
13418 44418840 41316724 36904535 31855433 26691312 21852842 18024330 15075313 13205022
13410 13205022 12097945 11522966 11539065 11960390 12719102 14037658 16215688 19100786 22891027
13401 22891027 27756835 33697383 40558433 47522114 53514459 58393426 61110583 60890767
13393 60890767 57614461 51577700 44421264 37085128 30006747 24013704 19514261 16166511
13385 16166511 14012137 12643838 11874924 11594597 11796046 12371337 13333066 15142399 17761256
13376 17761256 21065315 25084569 29777834 34940644 39575883 43400022 45768884 46280302
$$ packed form
13435H218640j81451l5296K16521M25441P15847J186670J746574K569902L293068
13426A8155916L989658M599897M963557N025426M312684K957713J295465q81476
13418D4418840l102116m412189n049102n164121m838470l828512k949017j870291
13410A3205022j107077n74979J6099M21325P58712J318556K178030K885098L790241
13401B2891027M865808N940548O861050O963681N992345M878967K717157k19816
13393F0890767l276306o036761p156436p336136p078381n993043m499443l347750
13385A6166511k154374j368299p68914k80327K01449N75291R61729J809333K618857
13376A7761256L304059M019254M693265N162810M635239L824139K368862N11418
$$ plain form
13368 46280302 44700147 41204106 36331268 30915059 25575485 20787526 16553823 13443393
13360 13443393 11308157 9848068 9002882 8583502 8293418 8275684 8666215 9531600 10830661
13351 10830661 12550259 14586508 17300503 20480188 23848454 27099783 29785824 31519417
13343 31519417 31777570 30299548 27534653 24255072 20562278 16853675 13523191 10861934
13335 10861934 9051186 7508456 6323079 5842893 5672545 5614285 5803133 6150407 6734096
13326 6734096 7453992 8482918 9911972 11538720 13271557 14551567 15577536 16250666
13318 16250666 16250506 15314568 13780173 12023830 10058224 8246267 6458897 5060110 4002943
13309 4002943 3290734 2789966 2420559 2108535 1964160 1780287 1664480 1594516 1523367 1490648
$$ packed form
13368D6280302j580155l496041m872838n416209n339574m787959m233703l110430
13360A3443393k135236j460089q45186m19380k90084j7734L90531Q65385J299061
13351A0830661J719598K036249K713995L179685L368266L251329K686041J733593
13343C1519417K58153j478022k764895l279581l692794l708603l330484k661257
13335A0861934j810748j542730j185377m80186j70348n8260J88848L47274N83689
13326F734096P19896J028926J429054J626748J732837J280010J025969O73130
13318A6250666j60r35938j534395j756343j965606j811957j787370j398787j057167
13309D002943p12209n00768l69407l12024j44375j83873j15807o9964p1149l2719
$$ plain form
13299 1490648 1466270 1325335 1248787 1171392 902023 757205 900224 873279 910803 859659
13289 859659 792925 828055 849576 877578 771562 694614 598527 458332 357108 388398 381720
13278 381720 395522 438688 396606 403386 274538 309648 400572 417722 330473 279992 268946
13267 268946 338688 438472 491379 457768 354112 202200 76980 35421 141108 241754
13257 241754 297470 301857 255297 332054 388631 269459 205808 233208 330968 365790 333151
13246 333151 249695 257929 219500 199517 199392 120849 129479 250223 377843 175967 143239 218993
13234 218993 256213 242153 186586 19518 10177 166551 264990 242755 323568 370915 498201
13223 498201 489061 391696 321338 395374 506135 462236 331807 327992 270252 311930 325805
$$ packed form
13299A490648k4378j40935p6548p7395k69369j44818J43019k6945L7524n1144
13289H59659o6734L5130K1521K8002j06016p6948r6087j40195j01224L1290o678
13278C81720J3802M3166m2082O780j28848L5110R0924J7150q7249n0481j1046
13267B68946O9742R9784N2907l3611j03656j51912j25220m1559J05687J00646
13257B41754N5716M387m6560P6757N6577j19172o3651K7400R7760L4822l2639
13246C33151q3456Q234l8429j9983j25p8543Q630J20744J27620k01876l2728P5754
13234B18993L7220j4060n5567j67068r341J56374R8439k2235Q0813M7347J27286
13223D98201r140r7365p0358P4036J10761m3899j30429l815n7740M1678J3875
$$ plain form
13212 325805 112180 144788 351612 399660 121281 -55623 8048 36619 83405 244626
13202 244626 368583 491585 566679 529270 374120 252793 92249 143098 274440 124856
13192 124856 144574 149612 256571 265956 302386 123865 94133 101700 240528 197265 200486 171507
13180 171507 77485 76437 38297 70672 55349 157520 169287 173839 275237 208368 187322
13169 187322 304153 215287 254189 256352 325368 358085 160164 56612 69779 92009 146565
13158 146565 104825 -11650 35539 34327 -29753 -17143 94780 144546 247404 154438 -62572
13147 -62572 -192235 -48693 -38895 55583 -22309 27081 47456 -26721 -99684 -31633 187359
13136 187359 263900 183911 46734 63319 241702 156784 190918 253428 363646 277469 218909
$$ packed form
13212C25805k13625L2608K06824M8048k78379j76904O3671K8571M6786J61221
13202B44626J23957J23002P5094l7409j55150j21327j60544N0849J31342j49584
13192A24856J9718N038J06959R385L6430j78521k9732P567J38828m3263L221k8979
13180A71507r4022j048l8140L2375j5323J02171J1767M552J01398o6869k1046
13169A87322J16831q8866L8902K163O9016L2717j97921j03552J3167K2230N4556
13158A46565m1740j16475M7189j212o4080J2610J11923M9766J02858r2966k17010
13147f2572j29663J43542R798R4478p7892M9390K0375p4177p2963O8051K18992
13136A87359P6541p9989j37177J6585J78383q4918L4134O2510J10218q6177n8560
$$ plain form
13125 218909 155694 203468 131381 -77674 -109668 -192106 -158542 -47683 47399 110878 179877
13114 179877 159483 28173 83328 165865 195500 148527 113796 18679 -181809 -320171 -464561
13103 -464561 -212143 49742 145661 105870 117413 241700 232694 66750 123428 88206 47518
13092 47518 -156071 -262411 -217072 -248834 -107944 -51631 23481 46401 90268 27629 96315
13081 96315 172310 334461 196833 90695 254983 425796 321246 98230 120114 258447
13071 258447 383250 467300 372344 207257 104467 150630 210582 309918 298078 435290 510969
13060 510969 512462 497579 454931 293863 387441 482762 480181 575751 344451 250124 359739
13049 359739 477339 495655 411053 202896 220811 299427 291526 336790 440886 354042 311566
$$ packed form
13125B18909o3215M7774p2087k09055l1994q2438L3564J10859R5082O3479O8999
13114A79877k0394j31310N5155Q2537K9635m6973l4731r5117k00488j38362j44390
13103d64561K52418K61885R5919l9791J1543J24287r006j65944N6678l5222m0688
13092D7518k03589j06340M5339l1762J40890N6313P5112K2920M3867o2639O8686
13081I6315P5995J62151j37628j06138J64288J70813j04550k23016K1884J38333
13071B58447J24803Q4050r4956j65087j02790M6163N9952R9336j1840J37212P5679
13060E10969J493j4883m2648j61068R3578R5321k581R5570k31300r4327J09615
13049C59739J17600J8316q4602k08157J7915P8616p901M5264J04096q6844m2476
$$ plain form
13038 311566 346922 440668 493596 672147 795719 772930 720564 798073 866396 949805 929112
13027 929112 777408 729170 651262 611830 645700 704436 713721 651892 633247 805682 871411
13016 871411 728609 861481 826839 1018816 1225985 1137318 1063448 1176523 1207309 1326428
13006 1326428 1575954 1557913 1617002 1932038 2071521 2246194 2292462 2420206 2392433 2435085
12996 2435085 2767035 3173606 3466676 3668391 3997057 4276052 4804475 5431973 6319586
12987 6319586 7487105 8894073 10570075 12935685 15748727 19020283 23024238 27830558
12979 27830558 33408025 38926454 42970886 45390355 46866622 47200712 45557482 42150552
$$ packed form
13038C11566L5356R3746N2928J78551J23572k2789n2366P7509O8323Q3409k0693
13027I29112j51704m8238p7908l9432L3870N8736R285o1829j8645J72435O5729
13016H71411j42802J32872l4642J91977K07169q8667p3870J13075L0786J19119
13006A326428K49526j8041N9089L15036J39483J74673M6268J27744k7773M2652
12996B435085L31950M06571K93070K01715L28666K78995N28423O27498Q87613
12987F319586J167519J406968J676002K365610K813042L271556M003955M806320
12979B7830558N577467N518429M044432K419469J476267L34090j643230l406930
$$ [...]
##END NTUPLES=NMR SPECTRUM
##END=
