##TITLE=Analysis number 325534
Compound Code cc 56602
Book Reference 508/30
Project Code adrs
Chemist Name antons
##JCAMPDX= 6.0         $$ Bruker NMR JCAMP-DX V2.0
##DATA TYPE= NMR SPECTRUM
##DATA CLASS= NTUPLES
##ORIGIN= Bruker BioSpin GmbH
##OWNER= nmr
$$ XWIN-NMR		Version 3.5
$$ Wed Jan  3 13:22:34 2007 GMT Standard Time (UT+0h)  MAYBRIDGE\nmr@NMR_250MHZ
##.OBSERVE FREQUENCY= 250.131544655141
##.OBSERVE NUCLEUS= ^1H
##.ACQUISITION MODE= SIMULTANEOUS (DQD)
##.ACQUISITION SCHEME= undefined
##.AVERAGES= 16
##.DIGITISER RES= 18
##SPECTROMETER/DATA SYSTEM= dpx250
##.PULSE SEQUENCE= zg30
##.SOLVENT NAME= CDCl3
##.SHIFT REFERENCE= (INTERNAL, CDCl3, 0, 16.5229)
##AUDIT TRAIL= $$ (NUMBER, WHEN, WHO, WHERE, WHAT)
$$ ##TITLE= Audit trail, XWIN-NMR		Version 3.5
$$ ##JCAMPDX= 5.01
$$ ##ORIGIN= Bruker BioSpin GmbH
$$ ##OWNER= nmr
$$ C:\u/data/dgb/nmr/ADRS/180/pdata/1/auditp.txt
$$ ##AUDIT TRAIL=  $$ (NUMBER, WHEN, WHO, WHERE, WHAT)
(   1,<2007-01-03 13:22:11.76 +000>,<MAYBRIDGE\nmr>,<NMR_250MHZ>,
      <created by zg, POWCHK disabled, PULCHK disabled
       configuration hash MD5:
       49 4B E0 1D 92 C2 6B 37 9F E6 65 BC 52 41 86 1D
       data hash MD5: 64K
       4B 7B EC ED E5 60 FF 5C 73 13 9F 5D 13 45 B7 A5>)
(   2,<2007-01-03 13:22:26.52 +000>,<MAYBRIDGE\nmr>,<NMR_250MHZ>,
      <Start of raw data processing
       ef LB = 0.3 FT_mod = 6 PKNL = 1 SI = 32K 
       data hash MD5: 32K
       93 7A D3 14 B8 63 93 3B B2 8B 4D 6B DB 40 B2 5B>)
(   3,<2007-01-03 13:22:28.21 +000>,<MAYBRIDGE\nmr>,<NMR_250MHZ>,
      <apk 
       data hash MD5: 32K
       00 30 51 A7 3C 06 CC 3F C0 35 18 EB 63 47 29 53>)
(   4,<2007-01-03 13:22:28.96 +000>,<MAYBRIDGE\nmr>,<NMR_250MHZ>,
      <abs ABSG = 5 
       data hash MD5: 32K
       A3 31 68 C4 D1 F4 97 92 74 C1 F5 EF 85 9D 1C 41>)
$$ ##END=
$$ 
$$ hash MD5
$$ DA 91 D7 40 12 54 60 2A 3A 85 46 A1 50 10 7B 89
##$RELAX= 
##$RELAX= 
##$RELAX= 
##$RELAX= 
##$RELAX= 
##$RELAX= 
##$RELAX= 
$$ Bruker specific parameters
$$ --------------------------
##$DU= <C:\u>
##$EXPNO= 180
##$NAME= <ADRS>
##$PROCNO= 1
##$TYPE= <nmr>
##$USER= <dgb>
##$AMP= (0..31)
100 100 100 100 100 100 100 100 100 100 100 100 100 100 100 100 100 100 
100 100 100 100 100 100 100 100 100 100 100 100 100 100 
##$AQSEQ= 0
##$AQ_mod= 3
##$AUNM= <au_zg>
##$AUTOPOS= <26 >
##$BF1= 250.13
##$BF2= 250.13
##$BF3= 250.13
##$BF4= 250.13
##$BF5= 500.13
##$BF6= 500.13
##$BF7= 500.13
##$BF8= 500.13
##$BYTORDA= 1
##$CFDGTYP= 0
##$CFRGTYP= 5
##$CHEMSTR= <none>
##$CNST= (0..31)
1 1 145 1 1 1 1 1 1 1 1 1 1 1 1 1 1 1 1 1 1 1 1 1 1 1 1 1 1 1 1 1 
##$CPDPRG= <>
##$CPDPRG1= <>
##$CPDPRG2= <>
##$CPDPRG3= <>
##$CPDPRG4= <mlev>
##$CPDPRG5= <mlev>
##$CPDPRG6= <mlev>
##$CPDPRG7= <mlev>
##$CPDPRG8= <mlev>
##$CPDPRGB= <>
##$CPDPRGT= <>
##$D= (0..31)
0 1 0 0 0 0 0 0 0 0.06 0 0 0 0 0 0 0.0002 0 0 0 0 0 0 0 0 0 0 0 0 0 0 
0 
##$DATE= 1167830530
##$DBL= (0..7)
120 120 120 120 120 120 120 120 
##$DBP= (0..7)
150 150 150 150 150 150 150 150 
##$DBP07= 0
##$DBPNAM0= <>
##$DBPNAM1= <>
$$ [...]
##$SUBNAM7= <"">
##$SUBNAM8= <"">
##$SUBNAM9= <"">
##$SW= 20.6930455092707
##$SWIBOX= (0..15)
0 0 3 0 0 0 0 0 0 0 0 0 0 0 0 0 
##$SW_h= 5175.983436853
##$TD= 65536
##$TD0= 1
##$TE= 293.16
##$TE2= 300
##$TE3= 300
##$TEG= 300
##$TL= (0..7)
0 120 120 120 120 120 120 120 
##$TP= (0..7)
150 150 150 150 150 150 150 150 
##$TP07= 0
##$TPNAME0= <>
##$TPNAME1= <>
##$TPNAME2= <>
##$TPNAME3= <>
##$TPNAME4= <>
##$TPNAME5= <>
##$TPNAME6= <>
##$TPNAME7= <>
##$TPOAL= (0..7)
0.5 0.5 0.5 0.5 0.5 0.5 0.5 0.5 
##$TPOFFS= (0..7)
0 0 0 0 0 0 0 0 
##$TUNHIN= 0
##$TUNHOUT= 0
##$TUNXOUT= 0
##$USERA1= <user>
##$USERA2= <user>
##$USERA3= <user>
##$USERA4= <user>
##$USERA5= <user>
##$V9= 5
##$VALIST= <valist>
##$VCLIST= <CCCCCCCCCCCCCCC>
##$VD= 0
##$VDLIST= <DDDDDDDDDDDDDDD>
##$VPLIST= <PPPPPPPPPPPPPPP>
##$VTLIST= <TTTTTTTTTTTTTTT>
##$WBST= 1024
##$WBSW= 4
##$XGAIN= (0..3)
0 0 0 0 
##$XL= 0
##$YL= 0
##$YMAX_a= 321528
##$YMIN_a= -375170
##$ZGOPTNS= <>
##$ZL1= 120
##$ZL2= 120
##$ZL3= 120
##$ZL4= 120
##$ABSF1= 16.52287
##$ABSF2= -4.170303
##$ABSG= 5
##$ABSL= 3
##$ALPHA= 0
##$AQORDER= 0
##$ASSFAC= 0
##$ASSFACI= 0
##$ASSFACX= 0
##$ASSWID= 0
##$AUNMP= <proc_1d>
##$AZFE= 0.1
##$AZFW= 0.1
##$BCFW= 0
##$BC_mod= 0
##$BYTORDP= 0
##$COROFFS= 0
##$CY= 12.5
##$DATMOD= 1
##$DC= 0
##$DFILT= <>
##$DTYPP= 0
##$F1P= 14.0000005364418
##$F2P= -0.99999901652339
##$FCOR= 0.5
##$FTSIZE= 32768
##$FT_mod= 6
##$GAMMA= 0
##$GB= 0
##$INTBC= 1
##$INTSCL= 1
##$ISEN= 128
##$LB= 0.3
##$LEV0= 0
##$LPBIN= 0
##$MAXI= 10000
##$MC2= 0
##$MEAN= 0
##$ME_mod= 0
##$MI= 0
##$NCOEF= 0
##$NC_proc= -3
##$NLEV= 6
##$NOISF1= 0
##$NOISF2= 0
##$NSP= 0
##$NTH_PI= 0
##$NZP= 0
##$OFFSET= 16.52287
##$PC= 1
##$PHC0= 228.1875
##$PHC1= 12.17362
##$PH_mod= 1
##$PKNL= yes
##$PPARMOD= 0
##$PSCAL= 4
##$PSIGN= 0
##$REVERSE= no
##$SF= 250.129999782539
##$SI= 32768
##$SIGF1= 0
##$SIGF2= 0
##$SINO= 400
##$SIOLD= 32768
##$SREGLST= <1H.CDCl3>
##$SSB= 0
##$STSI= 32768
##$STSR= 0
##$SW_p= 5175.98343685301
##$SYMM= 0
##$S_DEV= 0
##$TDeff= 65536
##$TDoff= 0
##$TI= <Analysis number 999999
Compound Code 99
Book Reference 9
Project Code 9>
##$TILT= no
##$TM1= 0
##$TM2= 0
##$TOPLEV= 0
##$USERP1= <user>
##$USERP2= <user>
##$USERP3= <user>
##$USERP4= <user>
##$USERP5= <user>
##$WDW= 1
##$XDIM= 32768
##$YMAX_p= 470749212
##$YMIN_p= -159356
$$ End of Bruker specific parameters
$$ ---------------------------------
##NTUPLES= NMR SPECTRUM
##VAR_NAME=  FREQUENCY,     SPECTRUM/REAL,   SPECTRUM/IMAG
##SYMBOL=    X,             R,               I
##VAR_TYPE=  INDEPENDENT,   DEPENDENT,       DEPENDENT
##VAR_FORM=  AFFN,          ASDF,            ASDF
##VAR_DIM=   32768,         32768,           32768
##UNITS=     HZ,            ARBITRARY UNITS, ARBITRARY UNITS
##FACTOR=    0.157963299565203, 1,           1
##FIRST=     4132.86524691809, 0,            0
##LAST=      -1043.11818993492, 0,           0
##MIN=       -1043.11818993492, -159356,     0
##MAX=       4132.86524691809, 470749212,    0
$$ Real data points
##PAGE= N=1
##DATA TABLE= (X++(R..R)), XYDATA
$$ [...]
24523d1849j2750p28J0071r67J0892J1529J7674K0026p393k0569K923K4105J6442
24510B9406M155K2633k3150K9427j8991m7128J7850M3739k5233j3923k6500M883
24498b832j1005k0620N287l340l1785k2926N3728J3577N508m76k2791M300L0375
24485c000J9394p198n4149j466N0881M8002k4842j1793K6557K5174j2585n3396
24473A579j2436k4008j4628o767m392k2873L1211j0363K8332J5941k238m4687
24461f5329j0794K2992K4827J9887L0654k435l9904Q391M8931K4715l2776p493
24449B1666l886k3904K1494K9099l0851j2528K2035J5812j5967m801j8996l3638
24437c4465j3357J560j0929K4505J8755j7938l7028m876L9407P044k816j1367
$$ plain form
24523 -41849 -54599 -55327 -45256 -46223 -35331 -23802 -6128 13898 6505 -14064 -11141 12964 29406
24510 29406 33561 56194 33044 62471 43480 -3648 14202 57941 32708 18785 -7715 -2832
24498 -2832 -13837 -34457 -29170 -32510 -64295 -87221 -33493 -19916 -14408 -14884 -37675 -33375 -3000
24485 -3000 16394 9196 -44953 -46419 4462 52464 27622 15829 42386 67560 54975 1579
24473 1579 -10857 -34865 -49493 -56260 -60652 -83525 -52314 -62677 -34345 -18404 -20642 -65329
24461 -65329 -76123 -53131 -28304 -8417 22237 19802 -20102 -11711 37220 61935 29159 21666
24449 21666 17780 -6124 15370 44469 13618 1090 23125 38937 22970 18169 -827 -34465
24437 -34465 -47822 -46262 -57191 -32686 -13931 -31869 -68897 -73773 -34366 -27322 -30138 -41505
24425d1505K7020J1591k264R142M8172J7759k5385m1408l7494L8912N637j9644
24413i467j5749J8265k1049j1185K3190K9827o341K9265l3638l2001K8746l486
24401c623j2054O587J7981N590K6990K8431o0579m6589P563o742J0489L081l1803
24388e4678J1685J1987L339L3629K3456k0503j4171L2029J3062r449j7070k3239
24376i923j8727M5964K6741j4874N613J6021M682j3324j4937j5444j553l758m4283
24363c7802k5125K3226n877l3451R854J196k6012P824K8889K1063q161J911j2842
24350e5307p917k4351L1112J2980j365L1544J5042k0550J3252M627R383J2564
24338B1014k7829j7434k7136N003j439n031K6314K7855j8413J5112k5165K2823
$$ plain form
24425 -41505 -14485 -2894 -5158 3984 52156 69915 44530 3122 -34372 4540 10177 -9467
24413 -9467 -25216 -6951 -28000 -39185 -15995 13832 7491 36756 3118 -28883 -137 -3623
24401 -3623 -15677 -9090 8891 14481 41471 69902 9323 -37266 -29703 -36445 -25956 -22875 -54678
24388 -54678 -42993 -31006 -27667 5962 29418 8915 -5256 26773 39835 30386 13316 -9923
24376 -9923 -28650 17314 44055 29181 34794 50815 55497 42173 27236 11792 10239 6481 -37802
24363 -37802 -62927 -39701 -45578 -79029 -69175 -67979 -93991 -86167 -57278 -36215 -44376 -42465 -55307
24350 -55307 -63224 -87575 -56463 -43483 -44848 -13304 1738 -18812 -5560 -933 8450 21014
24338 21014 -6815 -24249 -51385 -46382 -47821 -52852 -26538 1317 -17096 -1984 -27149 -4326
24326d326O3691j255O47K0228n254l0337n20l2445J0372K0802j6101J5938j1795
24313B9645k5963j2144j2815l073o571k2568n365k3605Q903N5985R42l5554J9505
24300c2678k7015j6668N0415M1394r61J3999L4849k5277k9933J6735j5377n0112
24288d0629P110k2587m7464k0686P8807N4250R692j542K414J326J168k5678k0224
24275b4043o349J9292q605l999l675K5565j5659j0817J8368o202j2959N929J5541
24262g613K83j4153j2943K0363o472N2632K4859l5116l0550K1051m6551j5145
24250d9355J1346R267n4820P935M384L4303Q2467K3386l1872J520J1591j0785
24238C9367J2420k637o000j5544k510K0926k4071o0173k185n084P616J4813J7141
$$ plain form
24326 -4326 59365 58110 58757 78985 73731 43394 42874 10429 20801 41603 25502 41440 29645
24313 29645 3682 -8462 -21277 -24350 -30921 -53489 -58854 -82459 -73556 -17571 -16629 -52183 -32678
24300 -32678 -59693 -76361 -25946 15448 14487 28486 63335 38058 8125 24860 9483 -40629
24288 -40629 -33519 -56106 -103570 -124256 -45449 8801 18493 16951 19365 20691 21859 -3819 -24043
24275 -24043 -30392 -11100 -19705 -23704 -27379 -1814 -17473 -28290 -9922 -16124 -29083 -23154 -7613
24262 -7613 -7330 -21483 -34426 -14063 -20535 32097 56956 21840 -8710 12341 -34210 -49355
24250 -49355 -38009 -28742 -83562 -75627 -71243 -36940 45527 68913 37041 38561 50152 39367
24238 39367 51787 49150 43150 27606 25096 46022 21951 -38222 -40407 -45491 -37875 -23062 -5921
24225e921K9076K7227J4945k1725o0268n3223J749L813m478J6380J5073l5424
24213g2776J85P0864j0050Q738O4025J7718j2009k3806O554l7932p461M566n433
24200C183k8791j4178K6910L0311Q251o551K5360N1592j5329n4557j6814L159
24188A2546j7542M428P546K3847j1182l21J3473k9372m7336N365n145j220K1321
24175b3592P920l7326k060J1355J9905N7732N548o2403k0808n391L3511J9960
24163D351k4896Q079l2591O176K1199m4854l5742J7502K276j5154M8528J6074
24151b9052Q816m457J9097Q652j1803j653J729j0041K9469J0039l4564k9271m0057
24138h3096r396N1138K6002K0329o904j3538L0199K9194k9364l7040m6671m748
$$ plain form
24225 -5921 23155 50382 65327 43602 -16666 -69889 -68140 -64327 -68805 -52425 -37352 -72776
24213 -72776 -72591 -1727 -11777 -3039 60986 78704 66695 42889 49443 11511 4050 8616 3183
24200 3183 -25608 -39786 -12876 17435 25686 19135 44495 96087 80758 26201 9387 12546
24188 12546 -4996 -568 6978 30825 19643 19322 32795 3423 -43913 -38548 -43693 -44913 -23592
24175 -23592 -15672 -52998 -55058 -43703 -23798 33934 39482 -22921 -43729 -49120 -15609 4351
24163 4351 -20545 -12466 -45057 -38881 -17682 -62536 -98278 -80776 -78500 -93654 -45126 -29052
24151 -29052 -20236 -24693 -5596 3056 -8747 -10400 -8671 -18712 10757 20796 -13768 -43039 -83096
24138 -83096 -92492 -41354 -15352 4977 -1927 -15465 14734 43928 14564 -22476 -69147 -73895
24126g3895L9855N3319j873m3957K1254q367J0842n908L188K9776l112p712j4525
24113a115k4172n111M504J9537J1536K7007r67k749J881J6047r356J4740P013
24100E8795n1731Q709J858j4807Q263K382o618j6938L0841J1390k2211l1146j4827
24087c6040k0911p407M1260M3212J9324j3753j7927k6042L631j6472K1058j1424
24075b1491k4232j8211k6989K4904M2276j3125O600o504l5389k556k3327J6611
24063h1433L4244K5781j125k744J5006M4613j8841k5022k8150J3695M377J3687
24051e912K7082J3265k5133q376L4267k4798k3483k749j1997l2290M5641L4791
24039B0308q384k3672j5667o054j8858p436L5544J4629N1015L2850k2156r2416
$$ plain form
24126 -73895 -34040 19279 17406 -26551 -5297 -13664 -2822 -8730 -5542 24234 21122 13410 -1115
24113 -1115 -25287 -30398 -25894 -6357 5179 32186 31219 28470 30351 46398 37042 51782 58795
24100 58795 7064 15773 17631 2824 11087 13469 6851 -10087 20754 32144 9933 -21213 -36040
24087 -36040 -56951 -64358 -23098 20114 39438 25685 7758 -18284 -14653 -31125 -10067 -21491
24075 -21491 -45723 -63934 -90923 -66019 -23743 -36868 -30268 -36772 -72161 -74717 -98044 -81433
24063 -81433 -47189 -21408 -22533 -25277 -10271 34342 15501 -9521 -37671 -23976 -19599 -5912
24051 -5912 21170 34435 9302 926 35193 10395 -13088 -15837 -27834 -60124 -14483 20308
24039 20308 11924 -11748 -27415 -33469 -52327 -59763 -24219 -9590 41425 74275 52119 -40297
24027d0297N904P985K0886L5837k5179l0360L2553J4119n5947k4305j7684J9361
24015e7127M263K1065P259K5444J1272L3372N653J3453k7663k9312J7665j4755
24003A0589m6084p387k0398K1671J864J3493K284P703J4099m5446j0391M8768
23991i235q5k663o132J235L6990N3090k2852J7608k0396K6134j9178l4291m223
23978A6002K3263L657k8373k7684p975J9735J2896k5460k6201k760J7567j7063
23966d2396L060J9987M59K0365J8390M0659M3369r789p694k7565j6115n219L459
23953D0970k9836j8246J0453O560M720j8106Q954m436K534J1946J5333Q413l1165
23940H094k4911N0313K1906P398j8495l9560k4174J6673M720k2080L294M454K2383
$$ plain form
24027 -40297 -34393 -26408 -5522 30315 5136 -25224 7329 21448 -34499 -58804 -76488 -57127
24015 -57127 -52864 -31799 -24540 904 12176 45548 51201 64654 36991 7679 25344 10589
24003 10589 -35495 -42882 -63280 -41609 -39745 -26252 -23968 -16265 -2166 -47612 -58003 -9235
23991 -9235 -9320 -11983 -18115 -16880 20110 73200 50348 67956 47560 73694 54516 20225 16002
23978 16002 39265 42922 14549 -13135 -21110 -1375 11521 -13939 -40140 -42900 -25333 -42396
23966 -42396 -39336 -19349 -18890 1475 19865 60524 103893 94104 86410 58845 42730 37511 40970
23953 40970 11134 -7112 3341 9901 14621 -3485 5469 1033 3567 15513 30846 39259 8094
23940 8094 -16817 33496 55402 62800 44305 4745 -19429 -2756 1964 -20116 -16822 -12368 10015
23927A0015j9740j1858j6609K7840J7241l028N0012p813J1119K0553m0647m1331
23915d246Q354O715p354J3656k0672k5738l656j1336K4317J7089j6450q400L8257
23902A0536j4121L906K7365J1730k1226l9954O510K3434P603j9863L253M8998
23890D8171l8493l4283n998M2631K2514O963Q100m6487J1266L7154K0256m337
23878F7457n0902k8267j6911J5289N4330J4282l3488n0337K1267J3292n176K627
23866C463K5345j2384k2687j7788L2953M0820J7340j9377J2638k327k303o380
23854D9313j0337m7575l4652K759p960J8552J3761J660j6488J7007K1324k9355
23842b1991j735j1585J8054m379K410p111K3891Q202j4003l9554L6862M3246N000
$$ plain form
23927 10015 -9725 -21583 -38192 -10352 6889 3861 53873 46060 57179 77732 37085 -4246
23915 -4246 4108 10823 3469 17125 -3547 -29285 -32941 -44277 -19960 -2871 -19321 -27721 10536
23902 10536 -3585 321 27686 39416 18190 -21764 -15254 8180 15783 -4080 -827 48171
23890 48171 9678 -24605 -30603 12028 34542 41505 49605 3118 14384 51538 71794 67457
23878 67457 16555 -11712 -28623 -13334 40996 55278 21790 -28547 -7280 6012 836 3463
23866 3463 28808 16424 -6263 -24051 8902 49722 67062 47685 60323 57996 55693 49313
23854 49313 38976 -8599 -43251 -40492 -48452 -29900 -16139 -14479 -30967 -13960 7364 -21991
23842 -21991 -23726 -35311 -17257 -21636 -19226 -26337 -2446 5756 -8247 -47801 -10939 32307 37307
23829C7307m660j1707K083k9280k2644J5873k5479k1838K2674L5966K8954r681
23817A7568J3880K9682L3j3558l7021k8568r456o80k2331l863J9040L6215M8215
23804D9156N137l5096m9006l1740M283M6553O6348K448l9451l9216k8320j174
23792e0078l121K0488J1876n911q854J7509J0401J3508M3959J8541j4688j7787
23780C5843l7616o72o054L8569J5057n3601j6134j1507j1170J4409K0298j019
23768a3597q361J2446k86k4285r128p33L00r258p798k9578Q955k9431M1376O5381
23754c997l0364o6658r42N4889R0980L3074j4830j7130k6236m311L4830j2112
23742C7193j1522j6288m794N0928K3650k658j8997J2207m6851n1871j8903k1615
$$ plain form
23829 37307 32647 20940 23023 -6257 -28901 -13028 -38507 -60345 -37671 -1705 27249 17568
23817 17568 31448 61130 61163 47605 10584 -17984 -27440 -28120 -50451 -54314 -35274 941 49156
23804 49156 54293 19197 -29809 -61549 -57266 -10713 55635 58083 18632 -20584 -48904 -50078
23792 -50078 -53199 -32711 -20835 -26746 -35600 -18091 -7690 5818 49777 68318 53630 35843
23780 35843 -1773 -2445 -8499 30070 45127 -8474 -24608 -36115 -47285 -32876 -12578 -13597
23768 -13597 -21958 -9512 -9798 -34083 -43211 -43944 -43644 -52902 -60700 -90278 -81323 -110754 -69378 -3997
23754 -3997 -34361 -101019 -101961 -47072 43908 76982 62152 45022 18786 14475 49305 37193
23742 37193 25671 9383 4589 55517 79167 76509 57512 69719 22868 -29003 -47906 -69521
23730f9521Q160K9938L666m365P902K2732J8809k9176k8977N177J5160k2941p724
23717e1160K0409O32N1424j695K0867L917K2091P67l6578k1243m0918k4113M318
23704e1282L2202N673R014N043K0751R784o2746k6639N2853K0272M352m4629L4788
23691I436K6900J2252p624k5776k4668P555j3231j3884P521j0650N3593k7240
23679e816l90J7539J6598P881l3112l8610K4454M9504n231J2036j6347j5818K6523
23666C9211N452j5927n057M086M6676J250n4067k3931M0476r492J4294k3758l4228
23653a5015j6961L6142j2107K038M1705O020k7403M23l5302p258K9271j8688L8
23640a7097K6083j3761n2449L0087l813N4867J7801j951j1551l5358l2151j9754
$$ plain form
23730 -69521 -61361 -31423 -27757 -32122 -24220 -1488 17321 -11855 -40832 -35655 -20495 -43436 -51160
23717 -51160 -30751 -30119 21305 19610 40477 44394 66485 67252 30674 9431 -31487 -55600 -51282
23704 -51282 -19080 -13407 -4393 650 21401 31185 -31561 -58200 -5347 14925 19277 -25352 9436
23691 9436 36336 48588 40964 15188 -9480 -1925 -15156 -29040 -21519 -32169 21424 -5816
23679 -5816 -6206 11333 27931 35812 2700 -35910 -11456 38048 32817 44853 28506 12688 39211
23666 39211 44663 28736 23679 27765 74441 75691 21624 -2307 38169 28677 42971 19213 -15015
23653 -15015 -31976 4166 -7941 -5903 35802 41822 14419 14842 -20460 -27718 1553 -17135 -17097
23640 -17097 8986 -4775 -57224 -27137 -30950 23917 41718 39767 28216 -7142 -39293 -59047
23628e9047L6195L9615p030Q071R770K0441l1806m2622L3301J8167j6100J1557
23616B0512P923j8158p411l7816m309L018j7728K3151Q4438M1613l0968m2215
23604B2050m2556k3737J8372l2161L7586k1966J7903K3018p678j2991j7366n310
23592d4836Q515N9133n337j6156N548K5550m051p077q295L757k8107j2956K2019
23579b293j7009l0612J7503N0213M136n1241l9753P289K3927r660l3027K40M3444
23566c6843n11M847Q933n3412k0463M043N4946K7364j1290K6140j442k1387k950
23553b2025j3199J834J2168j6536K0183K9825K5007l2751j0086k0705l1930K7027
23541c1188J3462k6921K8811K1215k614R983M0476J1082J4520p527Q424K234m1776
$$ plain form
23628 -59047 -22852 16763 9733 17804 27574 48015 16209 -26413 6888 25055 8955 20512
23616 20512 28435 10277 2866 -34950 -39259 -36241 -53969 -30818 53620 95233 64265 22050
23604 22050 -20506 -44243 -25871 -58032 -20446 -42412 -24509 -1491 -9169 -22160 -39526 -44836
23592 -44836 -36321 22812 17475 1319 6867 32417 28366 21289 12994 16751 -11356 -24312 -2293
23579 -2293 -19302 -49914 -32411 17802 21938 -29303 -69056 -61767 -37840 -47500 -80527 -80287 -36843
23566 -36843 -37354 -32507 -23574 -76986 -97449 -93406 -38460 -11096 -22386 3754 2312 -19075 -22025
23553 -22025 -35224 -33390 -21222 -37758 -17575 12250 37257 4506 -5580 -26285 -58215 -31188
23541 -31188 -17726 -44647 -15836 5379 2765 12748 53224 64306 78826 71299 79723 81957 40181
23528D0181M4120J290q106n1695l7774p383J8368K2149k2523j8286R30L3303l050
23515A1524J475L5697l297o7158m4273K6475L9489L2004J4974L4003m1807n9849
23503b0743J8318K8010N180j9872j1732k907j8275j3174M4385j8744o6411J6908
23491e9057N8733M0162j0132k771L673J676o305l2792r003K6641K6774N185J4181
23478E6965j8771l0527j2291q676k5104K4354j3111k2048M0548Q710K4673M1849
23466F6571m9588J5545j349K5337L0009l3499l0230k4945m3421k7908P749J6773
23454d8956j6739J1752N6716q725K0615J0427r476J9872n081k9970K1583q831
23442A3187j7129M391J6620Q451k9594l9764k2067J2161p345q082l0839L3336
$$ plain form
23528 40181 84301 85591 77485 25790 -11984 -19367 -999 21150 -1373 -19659 -18729 14574 11524
23515 11524 12999 48696 45399 -21759 -66032 -39557 -68 31936 46910 80913 39106 -20743
23503 -20743 -2425 25585 30765 10893 -839 -3746 -22021 -35195 9190 -9554 -75965 -59057
23491 -59057 -324 39838 29706 26935 30608 32284 25979 -6813 -15816 10825 37599 42784 56965
23478 56965 38194 7667 -4624 -13300 -38404 -14050 -27161 -49209 -8661 49 24722 66571
23466 66571 16983 32528 31179 56516 86525 53026 22796 -2149 -45570 -73478 -65729 -48956
23454 -48956 -65695 -53943 2773 -5952 14663 25090 15614 35486 30405 435 22018 13187
23442 13187 -3942 449 17069 25520 -4074 -43838 -65905 -53744 -61089 -69171 -100010 -66674
23430f6674K8835K2072J3259J2173o396j1703j3308K2404O0361M1705l0914l0907
23418D0907l4440l8550O994N6350j5186j5684J2653j8436O689k0253M146m777
23406a9587K5694O901k3279k9070l7503L9178L4134J0075j3474j5313K610K8941
23394I307K7002J5384j86J1118k2046p115r614j4207k5794j5595k2631L5125K8842
23381I590M74K965q936M622k7639K569m0k0230L409j9256k7482N0120K8922M921
23367D009k7332l0351K6615O3617L3670k7472L357j7123K1372J3342n069K121
23355F0756Q118r455J3683j8666l8584m2039m689p310j2017k7165J2780M6716
23343a7872M3898R683O997J7102K6055j2651n330M674Q320j2307k4886l7457l8324
$$ plain form
23430 -66674 -37839 -15767 -2508 9665 3269 -8434 -21742 662 61023 102728 71814 40907
23418 40907 6467 -32083 -25089 31261 16075 391 13044 -5392 1297 -18956 -14810 -19587
23406 -19587 6107 13008 -10271 -39341 -76844 -37666 -3532 6543 -6931 -22244 -19634 9307
23394 9307 36309 51693 51507 62625 40579 33464 23850 9643 -16151 -31746 -54377 -19252 9590
23381 9590 10064 13029 4093 8715 -18924 -16355 -16395 -36625 -33216 -52472 -79954 -29834 -912 4009
23367 4009 -23323 -53674 -27059 36558 70228 42756 46113 28990 50362 63704 58635 60756
23355 60756 68874 59419 73102 54436 15852 -26187 -30876 -38186 -50203 -77368 -64588 -17872
23343 -17872 26026 35709 42706 59808 85863 73212 67882 72556 80876 68569 43683 6226 -32098
23330c2098N0991J5820k8726P598J6774J7478m151l3995l3227j8493o84j4674
23318e7387l118j09N028M1181J1926K6934J6241j8998m6059k3453k5833J8187
23306e5460M2815L7282m0720j5907K605P065j190n257L6327q753n1304q495M1600
23293a9392J3962k4626M585k524n012k4534j9680L9254J1155l730M8226k1292
23281c608j3836k5950n5611J6640N926L997K8478K9838L6191k8269k2956k7622
23269e6782o783J2125K3903K5041J2123K798K3708O66n009j4362l7613l3120k7228
23256h0533P339q709q76O5126O810k9070K2644J8720L677K8017J7771k0218m4562
23243a3864k6681j0440K7821r404l1080K3838K8054n644M070J1148N534m5703
$$ plain form
23330 -32098 18893 34713 5987 13585 30359 47837 43686 9691 -23536 -42029 -42713 -57387
23318 -57387 -60505 -60614 -55586 -14405 -2479 24455 40696 21698 -24361 -47814 -73647 -55460
23306 -55460 -12645 24637 -16083 -31990 -29385 -22320 -23510 -28767 7560 -1193 -52497 -60992 -19392
23293 -19392 -5430 -30056 -25471 -27995 -33007 -57541 -77221 -37967 -26812 -30542 17684 -3608
23281 -3608 -17444 -43394 -99005 -82365 -76439 -72442 -43964 -14126 22065 -6204 -29160 -56782
23269 -56782 -63565 -51440 -27537 -2496 9627 12425 36133 36799 31790 17428 -20185 -53305 -80533
23256 -80533 -73194 -81903 -82779 -17653 -10843 -39913 -17269 1451 5128 33145 50916 30698 -13864
23243 -13864 -40545 -50985 -23164 -32568 -63648 -39810 -11756 -17400 -13330 -2182 3352 -42351
23231d2351j7292K3646J0895J8136R391l1256J1919L1K9170J7061k1146k4781
23219a6577j6517M3527K820l7838l9080M9275M7599k6395j4405l212r658l8388
23207e8849n581M5426M033J9720M1055l4255o9217J1674M6954L9167j8421n0369
23195b8663j1887J214k4407r696J690J9477J1556M2051J9468j0413n7375n7601
23183a04586M0217M8280J8588l17j9398m1371K9085N2199J1136j4047l1436k8375
23171d0025j7664O765J729o111K7946J3816J9182l3381r123k75k0902R813Q302
23158c9928j7542O635O677K0490L7033o398l2574k109o3L8216R254J9484J4204
23145E3379k9588k023j9671J0318K5159k917m402q368l0448l6985M9322M8148
$$ plain form
23231 -42351 -59643 -35997 -25102 -6966 2425 -28831 -16912 -16881 12289 29350 8204 -16577
23219 -16577 -33094 10433 13253 -24585 -63665 -14390 33209 6814 -7591 -10803 -20461 -58849
23207 -58849 -64430 -19004 -14971 4749 45804 11549 -57668 -45994 960 40127 21706 -28663
23195 -28663 -40550 -39336 -63743 -73439 -71749 -52272 -40716 1335 20803 10390 -46985 -104586
23183 -104586 -64369 -16089 2499 2182 -17216 -58587 -29502 22697 33833 19786 -11650 -40025
23171 -40025 -57689 -50924 -49195 -55306 -27360 -13544 5638 -27743 -36866 -37141 -58043 -48230 -39928
23158 -39928 -57470 -50835 -44158 -23668 13365 6967 -25607 -27716 -27779 10437 19691 39175 53379
23145 53379 23791 21768 2097 12415 37574 34657 30255 21887 -8561 -45546 3776 51924
23133E1924k7812m0239o533J6736O862j6411L7771j7877m2443o4056j3147L296
23121a11929L9726K9712p379J4655L5055M942J3673K951o7o566J2576q614k4359
23108e624q277K7133Q339j2004J6615o335l473o784k4987K118L85k9001k400M9478
23094E183L0672J7209j9564j1828J0979J3840j3131n9367j7628J9253k0397K990
23082d1789J1947j5570m2158M0158P172K6208K6601P445O057l5183j731J6026
23070E183j2527k0138m9382K8798L1014J2393J2156k6093k5133k4391Q380P9938
23058B0198J4461l9229j5879m667J2335k7452K9876L5534k945j3849k2496j8428
23046c2541K9851l527N158R518j5467k2863L7310k6246m5866P514Q485k0680O390
$$ plain form
23133 51924 24112 -16127 -22660 -5924 938 -15473 22298 4421 -38022 -102078 -115225 -111929
23121 -111929 -72203 -42491 -49870 -35215 -160 4782 18455 21406 21339 14773 27349 18735 -5624
23108 -5624 -13901 13232 21571 9567 26182 19847 16374 9590 -15397 -13279 -12894 -41895 -44295 5183
23094 5183 35855 53064 33500 21672 32651 46491 33360 -26007 -43635 -24382 -44779 -41789
23082 -41789 -29842 -45412 -87570 -47412 -40240 -14032 12569 20014 26071 -9112 -10843 5183
23070 5183 -7344 -27482 -76864 -48066 -17052 -4659 7497 -18596 -43729 -68120 -59740 20198
23058 20198 34659 -4570 -20449 -25116 -12781 -40233 -10357 25177 22232 8383 -14113 -32541
23046 -32541 -2690 -6217 -1059 8459 -7008 -29871 7439 -18807 -64673 -57159 -48674 -69354 -62964
23033f2964K8660n70K5580J0310k1773K7374j2007j3228l539K2467Q274Q7544
23021I6128m6995o4447j3832K1952j3441P515M0547Q642j4379M5246K3043l3906
23009E6073k0443J2393p25m1995o4337k2136O0084O5245P260N913l4204l8703
22997a5575P130M4073J4721j1168j7017L839r079j6297L3066k667l3915l038l0897
22984c6824O116N0350J9437k9334k377J6431O498P880J945J8591l2247l4713k825
22971a1072k6849k8594o886K8523N0378J1198J6102j4908n0505K9321K2395r921
22959I182j3779J0070J8478j4100n930K9272p015l3731m666l1721O627m836K6338
22946a5811J2572j9136k7419J3512J4648k6789k2594J8647K8850q167k8198k211
$$ plain form
23033 -62964 -34304 -34874 -9294 1016 -20757 6617 -5390 -18618 -22157 310 8584 96128
23021 96128 49133 -15314 -29146 -7194 -20635 -13120 27427 36069 21690 66936 89979 56073
23009 56073 35630 48023 47298 5303 -59034 -81170 -21086 44159 51419 57332 23128 -15575
22997 -15575 -8445 35628 50349 39181 22164 26003 16924 627 33693 31026 -2889 -5927 -36824
22984 -36824 -30708 19642 39079 9745 7368 23799 30297 38177 40122 58713 26466 -8247 -11072
22971 -11072 -37921 -66515 -73401 -44878 5500 16698 32800 17892 -32613 -3292 19103 9182
22959 9182 -4597 5473 23951 9851 3921 33193 26178 -7553 -12219 -43940 -37313 -42149 -15811
22946 -15811 -3239 -22375 -49794 -36282 -21634 -48423 -71017 -52370 -23520 -31687 -59885 -62096
22934f2096L8196j1068P416o855k8889j2105K0395J1915J8992k8931K1598j7028
22922d8460k8051K3694K3540K7743L3177k0495K285L1875J1645j3322m4404N735
22910D962m351j4570J1434N23p165j1841L7517J3945j9353k250r266J913L5202
22897C6700M9437k3065k8317k705K3495J553k625n634k9354l3340l0030q608m2
22884e2535M9731M327o137K1437O735j7180o988m2766j7629j4353l346j103K8285
22871e1522K2153j471K3752L0527M1k9834k7310J4982l987K411L0602M4317j8137
22858C6524k0819J710m138K5188m1821k8280J6414K3830j8142p0509M014L0334
22846d5695N650O190M2509m232j30l1799j201L0280L3416O1120k2191l1358j8632
$$ plain form
22934 -62096 -23900 -34968 -27552 -34407 -63296 -75401 -55006 -43091 -24099 -53030 -31432 -48460
22922 -48460 -76511 -52817 -29277 -1534 31643 11148 13433 45308 56953 43631 -773 4962
22910 4962 611 -13959 -2525 -2002 -9167 -21008 16509 30454 11101 8851 -415 1498 36700
22897 36700 86137 63072 34755 32050 55545 57098 54473 48839 19485 -13855 -43885 -52493 -52535
22884 -52535 -2804 1523 -4614 16823 23558 6378 -610 -43376 -61005 -75358 -78704 -79807 -51522
22871 -51522 -29369 -30840 -7088 23439 23480 -6354 -33664 -18682 -22669 -20258 10344 54661 36524
22858 36524 15705 17415 13277 38465 -3356 -31636 -15222 8608 -9534 -80043 -76029 -45695
22846 -45695 -40045 -33855 8654 4422 4292 -27507 -28708 1572 34988 96108 73917 42559 23927
22833B3927M502k2972r762L5386P480j2346j0185k4952L3419j6881k8937p247
22821b8568N8616K5832l8556J1862J4682k57m660O171p156J0300p260j7843K23
22808B3386l9598l3165L1629K9931J8678j0736Q661k690p217l5726K4215O622
22796A3990j5552m455J9376M3546k2177l7328l6608l7989k3715Q5423P3317M7838
22784A05666k9917l567k0099l5138j184j9966P046J3886l4952k778j7006J8327
22772a9682J6425O691K3068j0130k2217J952M4694N605l582k252m3789j530l9864
22759d4611k5106J5472K0553L2870O957M415J2199J4813P420K6199k6843k9692
22747A4646l1689O3j4084J3576K4716K9654K9703k4362J92J4519o0264R445k0067
$$ plain form
22833 23927 28429 5457 -4305 31081 38561 26215 16030 -8922 24497 7616 -21321 -28568
22821 -28568 30048 55880 17324 29186 43868 43611 38951 45122 37966 48266 41006 23163 23386
22808 23386 -16212 -49377 -17748 12183 30861 20125 28786 26096 18879 -16847 7368 13990
22796 13990 -1562 -6017 13359 56905 34728 -2600 -39208 -77197 -100912 -15489 57828 105666
22784 105666 75749 72182 52083 16945 15761 -4205 2841 16727 -18225 -21003 -38009 -19682
22772 -19682 -3257 3434 26502 16372 -5845 -3893 40801 46406 42824 40572 -3217 -4747 -44611
22759 -44611 -69717 -54245 -33692 -822 6135 10550 22749 37562 44982 71181 44338 14646
22747 14646 -17043 -16980 -31064 -17488 7228 36882 66585 42223 42415 56934 -3330 6115 -13952
22734a3952K9399L665J6907L1649K413r528N09q422j1747k2262k7670L829N146
22721f4p750l704r214m4747l8979J9483K5009K249k6866L459K503L9990M1416
22708B785j5717L3121K2174l7399m6012l658J5426M0253j0239j8229K358K5336
22696A0199K0538k6029n7601R936M3088N6767K7533j8092n0713k1544q121j6821
22684c0860n095l7312J9096P6982l329l6193K9837J5259m752j211l7133n5763
22672g0474j7773M8248L9413j6537j4606j8622j4025j2303K9061L2276k4162M1766
22660B262K6248K8252L361k2001n0132J1796L5038q055m2126k0609Q6400L8385
22648H8819j7691j5869j0872L668Q610l4502k5269k4616P1757L3021n6147k5995
$$ plain form
22734 -13952 15447 19112 36019 67668 70081 60553 61062 52640 40893 18631 -9039 -5210 -64
22721 -64 -7814 -11518 -20732 -65479 -104458 -84975 -59966 -57717 -84583 -81124 -78621 -38631 2785
22708 2785 -12932 20189 42363 4964 -41048 -44706 -29280 10973 734 -17495 -15137 10199
22696 10199 30737 4708 -52893 -42957 131 56898 84431 66339 15626 -5918 -14039 -30860
22684 -30860 -35955 -73267 -54171 22811 19482 -16711 13126 28385 23633 22422 -14711 -70474
22672 -70474 -88247 -39999 -586 -17123 -31729 -50351 -64376 -76679 -47618 -15342 -39504 2262
22660 2262 28510 56762 60123 38122 -12010 -214 34824 26769 -15357 -35966 50434 88819
22648 88819 71128 55259 44387 48055 56665 22163 -3106 -27722 44035 77056 20909 -5086
22636e086q494n63J3977M9041j4896k8690J1847J8295L2343J640j7348l2817P570
22623B6819l4311j8465k5008R660J6074j3751M5990M8327k3571M370l794l295
22611B9045m686L305q1k0664n965K8374L7913o950p462j1478J0024J038l7775
22598A4638p605N747j2339l2883k5363j122L2221K5383k2860K003N831k6418m5805
22585h8572K4311M7285J265j2443k0543k0254n17L979K0732L2320K1662j0758
22573a533j2484r00j4697j0705K4331K8652j2888M9872o070l9934k1281J8494
22561H57N6926L2108k1700N941k5755j4623Q829N143K4320j8312m9571K887J515
22548H565J2303l412k9506j1680J0408k9101k457k6688K1768K5419j1415L2529
$$ plain form
22636 -5086 -13580 -14143 -166 48875 33979 5289 17136 35431 67774 69414 52066 19249 26819
22623 26819 -7492 -25957 -50965 -41305 -25231 -38982 7008 55335 31764 36134 32340 29045
22611 29045 24359 27664 27583 6919 954 29328 67241 60291 52829 41351 51375 52413 14638
22598 14638 7033 12780 441 -32442 -57805 -58927 -26706 -1323 -24183 -22180 -16349 -42767 -88572
22585 -88572 -64261 -16976 -15711 -28154 -48697 -68951 -69468 -65489 -44757 -12437 9225 -1533
22573 -1533 -14017 -14917 -29614 -40319 -15988 12664 -224 49648 43578 3644 -17637 857
22561 857 57783 89891 68191 74132 48377 33754 42583 47726 72046 53734 4163 7050 8565
22548 8565 20868 17456 -12050 -23730 -13322 -42423 -44880 -71568 -49800 -24381 -35796 -3267
22536c267P552q738L3125L9106j3009N859l4161m0661k1151M411m0204p244J6937
22523f1445J2477k5780j9570m649J2627M848J7371J8979o872k6282J6607K2289
22511c9400m732k9799k1655L3874M2426N273l8318q533L7811k7894n822j2546
22499f9315J5210K1853L5252n903k6555k7845j2614j5136K3499K2017P274O757
22487b5506J048o623k348P065J1570J4570K547n7760P254J6982m604K5334K3014
22474A2543N264Q333j0480K918L9724k438k3808k8849m1561J0921J6938K4494
22462A3999j4858J0549K3127L8667L989j6479o4717J614k1788k9862J4702L3054
22450h003L8327K9539K2094m0647n1316k8048j4312j5118L3272M7530P015k502
$$ plain form
22536 -3267 4285 -4453 28672 67778 54769 60628 26467 -14194 -35345 -30934 -71138 -78382 -61445
22523 -61445 -48968 -74748 -94318 -98967 -86340 -81492 -64121 -45142 -52014 -78296 -61689 -39400
22511 -39400 -44132 -73931 -95586 -61712 -19286 -14013 -52331 -60864 -23053 -50947 -56769 -69315
22499 -69315 -54105 -32252 3000 -2903 -29458 -57303 -69917 -85053 -61554 -39537 -32263 -25506
22487 -25506 -24458 -31081 -33429 -26364 -14794 -224 2323 -55437 -48183 -31201 -35805 -10471 12543
22474 12543 17807 26140 15660 18578 58302 55864 32056 3207 -38354 -27433 -10495 13999
22462 13999 -859 9690 32817 71484 75473 58994 -5723 -4109 -25897 -55759 -41057 -8003
22450 -8003 30324 59863 81957 41310 -10006 -38054 -52366 -67484 -34212 13318 20333 17831
22438A7831l573J3095q317k8206j4645J1415k3397k9928Q988N2221K0562l044
22426A3002L3987q856J0742j6417n5895k38j5704K6050O7694M0959k3335n3012
22414A8977J5623m147K438J2866m9051j2160n436M218K5525M1264n252J9118k9892
22401C4091m9258J2784J1621L3522J4108l3502k0276L055J424p857J2719j5750
22389c319J1330N37j9548k3406L2922O368o231m764P516N4741M0047m6617l2950
22376A6626j78k4818k239O3063L9786k3715K5520l5118l2480j619j42q624l6740
22363b0678k9057j953K8655M5904j1674n9965J000Q80L1336l458J7394m177K9780
22350B3987K0792J8719k2798n3298r606K5114L2028j9620m0497J3032K0262j8844
$$ plain form
22438 17831 14258 27353 19036 -9170 -23815 -12400 -35797 -65725 -56737 -4516 16046 13002
22426 13002 46989 38133 48875 32458 -23437 -23675 -39379 -13329 54365 95324 71989 18977
22414 18977 34600 30453 32891 45757 -3294 -15454 -20890 -16672 8853 50117 44865 63983 34091
22401 34091 -15167 -2383 9238 42760 56868 23366 3090 6145 7569 -288 12431 -3319
22389 -3319 8011 8548 -11000 -34406 -1484 4884 -1347 -6111 1405 56146 96193 49576 16626
22376 16626 16448 -8370 -10609 52454 92240 68525 94045 58927 26447 24828 24686 16062 -20678
22363 -20678 -49735 -51688 -23033 22871 11197 -48768 -47768 -46888 -15552 -19010 -1616 -5793 23987
22350 23987 44779 63498 40700 -12598 -22204 2910 34938 15318 -25179 -12147 8115 -10729
22338a0729J3896J1120j6275K0797J9636K6800N883k4783l8977j1954L2380k3413
22326D381j9501n404Q789o094L4168L5351q670n1914l0613k841m866r209M2908
22313a3515M5383l47o1318m261K0416L8089k8391k6579K9069L1311N805q580l8697
22300a1615n2766r391k3173N073N4340L8365L2771k5824l1521N91Q215J6269l1290
22287b9956n899M3541J7706l0334r0306J0682L8411k1605M310m775N4316P8639
22275F4730N320l5326n0004l3113M191L7808P522k6062m4182J2652O2094L2529
22263C8159l0255k7285J2657K0401N307M1013o2l5150n311j7955o475J8096o162
22250F978P970j9778K8519n962p754j8473k5276j2395N430M9206q907K8780J3255
$$ plain form
22338 -10729 3167 14287 -1988 18809 38445 65245 71128 46345 7368 -4586 27794 4381
22326 4381 -15120 -20524 -11735 -17829 16339 51690 43020 -8894 -39507 -42348 -47214 -56423 -13515
22313 -13515 31868 31521 -29797 -34058 -13642 24447 -3944 -30523 -1454 29857 35662 27082 -11615
22300 -11615 -64381 -73772 -96945 -91872 -37532 833 33604 7780 -23741 -23150 -14935 1334 -29956
22287 -29956 -35855 7686 25392 -4942 -95248 -84566 -46155 -67760 -63450 -68225 -13909 64730
22275 64730 70050 34724 -15280 -48393 -44202 -6394 1128 -24934 -69116 -56464 5630 38159
22263 38159 7904 -19381 -6724 13677 18984 59997 59935 24785 19474 1519 -4956 13140 6978
22250 6978 14948 -4830 23689 17727 9973 -8500 -33776 -46171 -40741 8465 -442 28338 41593
22237D1593j0766n5395k0436O923L1006M711k3793k7423j1017j9010Q085L0651
22225d4871P024J3213L1914k0972K9100j0025j6765K3518J6060k1403m8286k2792
22213f4285m823j0815j9140M222J8063J3440M1029M0066j4273j1271o265l4283
22201d8335m4390J6137O2226K3882J6455K6407L11k9263K877J2755j210l5933
22189A919l1595J3414j1630o03N711k3711j9924K6699O7207Q3919J4m1465k7405
22176D2550o676j4802k0745P722M4980K6260k2465m1491R164j147J957R011K6350
22163F0668j535l1574R963L194j0804K0614R706j2428n8176k5922M3955L7021
22151D4682l0655J7184J5175j9029j3769l731Q80P144k2060Q188m3229l9027l2404
$$ plain form
22237 41593 30827 -24568 -45004 -38081 -7075 -2364 -26157 -53580 -64597 -83607 -75522 -44871
22225 -44871 -37847 -24634 7280 -13692 15408 5383 -11382 12136 28196 6793 -41493 -64285
22213 -64285 -69108 -79923 -99063 -94841 -76778 -63338 -22309 17757 3484 -7787 -14052 -48335
22201 -48335 -92725 -76588 -14362 9520 25975 52382 52693 23430 26307 39062 37852 1919
22189 1919 -29676 -16262 -27892 -28495 -22784 -46495 -66419 -39720 27487 111406 111420 69955 42550
22176 42550 35874 21072 327 8049 53029 79289 56824 15333 24497 23350 25307 34318 60668
22163 60668 59133 27559 37522 40716 29912 50526 60232 47804 -10372 -36294 7661 44682
22151 44682 14027 31211 46386 27357 13588 9857 10737 17881 -4179 4009 -39220 -78247 -110651
22138a10651K3112O7298K9424l3543k7446K9570L1656J4132L7798j4387m6106
22127H57j499N359Q97k6055k9708q715L038l1890j720K4560J9178L4241L4961
22114B3504j596l4297m0578J1491M8321M3678k8616m4209l4316J5743N0546J6119
22102B5790j6705P406R642K871n1751j365O02J1138J7632n609k0140L6732L3398
22089D9641N69k0371N124M3008L8541r983m7303l8635m0439J4345N0710L962K6730
22076G5899J7626l7807n6990J7061J4682k2809r370k8605l4432P094L2303L5157
22064I809j3037k3830n3168O326K9395j1357q866L3845L328K192N7305P102j0848
22051B8196k7604n325j1889o5018j0317O729K4089L4954J1890L9154M4397k7513
$$ plain form
22138 -110651 -87539 -20241 9183 -24360 -51806 -22236 9420 23552 61350 46963 857
22127 857 -642 4717 5614 -20441 -50149 -58864 -55826 -87716 -89436 -64876 -45698 -11457 23504
22114 23504 21908 -12389 -52967 -41476 6845 50523 21907 -22302 -56618 -40875 9671 25790
22102 25790 9085 16491 26133 29004 -22747 -24112 -23510 -12372 5260 -349 -20489 16243 49641
22089 49641 50210 29839 34963 77971 116512 106529 59226 20591 -19848 -5503 45207 49169 75899
22076 75899 93525 55718 -1272 15789 30471 7662 -1708 -30313 -64745 -57651 -25348 9809
22064 9809 -3228 -27058 -80226 -73900 -44505 -55862 -64728 -30883 -27555 -25363 31942 39044 28196
22051 28196 592 -4733 -16622 -81640 -91957 -85228 -61139 -26185 -14295 24859 69256 41743
22039D1743m9647l6359j8910K2176J2918l350k8375p647L3949M4275K0944K2911
22027E4628J6121m3793k2025L998m948N251K1674j6247l5362l923M4579K0282
22015D0235k0193j2834K6409L6930L064N96N695n6019o043J5041m447m7177L6094
22002A7351J767K0149M146j673k9654M101l1851j9081M3207M715j5105p013j6486
21989b5427Q476m2109P264L2747K5446l1298j304M3074J2979l3238J4310K7471
21977C8391o267j3696m6006k4K1857q358j000P684M0098P502k0435j4969n0949
21964d6172J7963K1730n796L2127N799L0471k9000J6732m0924j1373M3413K2801
21952E7771J0347o867M916l7442l0702K6358K1508k7696l1127J1704K1686j6351
$$ plain form
22039 41743 -7904 -44263 -63173 -40997 -28079 -31429 -59804 -67451 -33502 10773 31717 54628
22027 54628 70749 26956 4931 8929 3981 9232 30906 14659 -20703 -24626 19953 40235
22015 40235 20042 7208 33617 70547 73611 74207 79902 23883 17840 32881 28434 -18743 17351
22002 17351 19118 39267 43413 41740 12086 16187 -15664 -34745 8462 13177 -1928 -8941 -25427
21989 -25427 -16951 -59060 -51796 -19049 6397 -24901 -26205 16869 29848 -3390 10920 38391
21977 38391 32124 18428 -27578 -27602 -5745 -14103 -15103 -7419 32679 40181 19746 4777 -46172
21964 -46172 -28209 -6479 -12275 19852 25651 56122 27122 43854 2930 -8443 34970 57771
21952 57771 68118 61251 66167 28725 -1977 24381 45889 18193 -12934 -1230 20456 4105
21940D105k9660m345k0399K7849q739k541J1488k2613m0129M2361K8465K6005
21928A1847n445j7194m457m7077L2981L9901M3546j4723j0482l1934k5073K749
21916b5361K2167J9420K4834j7938k2672p748R250J1491J5521m2443j7842J7516
21904a3805J469N723M6205J3672q651l3906p362k1892L128j9475k2015R518r093
21891e6484p010J728M3829O867l0280l5129j0704K5810K3347L4329l4331o863
21879d4891j7217P40l9150J854M6412J7970J0250M1668L875k4634J6622Q635j0350
21866A1784J2768J3716k4179k8298j4499j9571L1308J8592j2860l8953q950O2330
21854C188K5436o405o301L596K0473j6600q889K797K0530j359m6429m9420n0935
$$ plain form
21940 4105 -25555 -29900 -50299 -22450 -31189 -33730 -22242 -44855 -84984 -42623 -14158 11847
21928 11847 6402 -10792 -15249 -62326 -29345 10556 54102 39379 28897 -3037 -28110 -25361
21916 -25361 -3194 16226 41060 23122 450 -7298 1952 13443 28964 -13479 -31321 -13805
21904 -13805 -12336 -6613 39592 53264 44613 10707 3345 -18547 -15419 -34894 -56909 -47391 -56484
21891 -56484 -63494 -61766 -17937 -11070 -41350 -76479 -87183 -61373 -38026 -3697 -38028 -44891
21879 -44891 -62108 -61368 -100518 -98664 -52252 -34282 -24032 17636 21511 -3123 13499 22134 11784
21866 11784 24552 38268 14089 -14209 -28708 -48279 -16971 1621 -11239 -50192 -59142 3188
21854 3188 28624 22219 15918 19514 39987 23387 14498 17295 37825 36466 -9963 -59383 -110318
21841a10318K063N2097l216K9606J8070K9113K7551L196m0373n1519o274j4404
21829f4408l0179K8856K2671l6598O1277K6437M431N400J0780j7499L2177K4339
21817F7684k6548n615l5108l3620n595K6945n3055k1133K7994J8271J1464l317
21805c1633l6178p680J3029N3850J704m9309k058J5516L1451M2240l2804j2264
21793a4136j9432l8861m5367J8836N9327M8198k0175k5555j9894j0542m0355L503
21781a04453P434J900O4110M5947j50m9626j9362J7701L4572k8265J4212N8979
21769D2999O7525L904k3089l0460n2172M613k4020K334L1956J0071Q509j7706
21757B4464M3007j4313n3606n5872k4014L4888L0767K6599k4075J3795k4261J7214
$$ plain form
21841 -110318 -108255 -56158 -59374 -29768 -11698 17415 44966 48162 7789 -43730 -50004 -64408
21829 -64408 -94587 -65731 -43060 -79658 -18381 8056 12487 17887 28667 11168 43345 67684
21817 67684 41136 35521 413 -33207 -38802 -11857 -64912 -86045 -58051 -39780 -28316 -31633
21805 -31633 -67811 -75491 -62462 -8612 -6908 -56217 -58275 -42759 -11308 30932 -1872 -14136
21793 -14136 -33568 -72429 -117796 -98960 -39633 8565 -11610 -37165 -57059 -67601 -107956 -104453
21781 -104453 -97019 -95119 -31009 14938 14788 -34838 -54200 -36499 -1927 -30192 -15980 42999
21769 42999 110524 114428 91339 60879 8707 13320 -10700 -8366 23590 33661 42170 24464
21757 24464 67471 53158 -448 -56320 -80334 -45446 -14679 11920 -12155 1640 -22621 -5407
21745e407O0487K3223P87j2236m7956K171n6077K0047L0331r63J6127N978K0994
21732E7506j9840m5668l5584l4561o440K3934l429j1734J1423L8322J3184O413
21720f474l1806P996J8121j5443J9575r647j6215o454L1008j4401m0341l8542
21708a02623j1480N3184P5965K5014j2745m1723l5732k3694J5802K2143K4616
21697a1273N1762P422m3710j4814l9769j6645L7051M9213q151J3637m4880K5318
21685E161R421K6850J0755m0096L3037J1847m155m515L748K4601l7647l6197j5964
21672a3154J5798K4464j6767j5797j1354K3433P3161l0720m5484l5469j757J0209
21660b3437M7763O935R877n423K9222j4021k6150m4683o838k3120K5131M0847
$$ plain form
21745 -5407 55080 78303 79090 66854 18898 21069 -35008 -14961 15370 14407 30534 36512 57506
21732 57506 37666 -8002 -43586 -78147 -84587 -60653 -64082 -75816 -64393 -26071 -12887 -6474
21720 -6474 -38280 -30284 -12163 -27606 -8031 -17678 -33893 -40347 -9339 -23740 -64081 -102623
21708 -102623 -114103 -60919 15046 40060 27315 -14408 -50140 -73834 -58032 -35889 -11273
21697 -11273 40489 47911 4201 -10613 -50382 -67027 -29976 19237 11086 24723 -20157 5161
21685 5161 14582 41432 52187 12091 45128 56975 52820 48305 52053 76654 39007 2810 -13154
21672 -13154 2644 27108 10341 -5456 -16810 6623 79784 49064 3580 -31889 -33646 -23437
21660 -23437 24326 31261 41138 35715 64937 50916 24766 -19917 -26755 -49875 -24744 16103
21648A6103J4919m4051m2614M3906J0308M110N284L641j3775l9723k3230P2696
21636G574K9504j6353k6924Q39O3603m503k5143q242M230j5147K7713J3331O073
21623E6555l4259q336k4959l108N2025P066m2985k7348O3026j2211P457j6314
21611A6609j1267r791m0019l0604K6625P770J273K066K6781j7398k8642J4274
21599d2323L1960J1366m0031J1502j9535k4804m433L2640J4069J5981j2851k821
21587b9280M6122L1273Q918m0404l107J5250m4744j9951O670Q44M8680K9707O503
21574E6481j8654m5068j3140j6744K078k949N804j2737r753J8386K0061L9186
21562B2951L997l8408j042k7341K97M0852N6588L1666k0345m7049o5428j5656
$$ plain form
21648 16103 31022 -13029 -55643 -11737 -1429 2681 7965 11606 -2169 -41892 -65122 7574
21636 7574 37078 20725 -6199 -5360 58243 53740 28597 20355 24585 9438 37151 50482 56555
21623 56555 22296 13960 -10999 -14107 37918 44984 1999 -25349 37677 25466 32923 16609
21611 16609 5342 -4449 -44468 -75072 -48447 -40677 -39404 -37338 -10557 -27955 -56597 -42323
21599 -42323 -10363 1003 -39028 -27526 -47061 -71865 -76298 -43658 -29589 -13608 -26459 -29280
21587 -29280 16842 48115 57033 16629 13522 28772 -15972 -35923 -29253 -28409 20271 49978 56481
21574 56481 37827 -7241 -20381 -37125 -35047 -37996 -32192 -44929 -54682 -36296 -16235 22951
21562 22951 26948 -11460 -12502 -39843 -39546 1306 57894 89560 69215 22166 -43262 -58918
21550e8918J1111M550J9467k1698j4031M9203N381K666K3507j6845j5790K6397
21538A5000J624O297J0226K0842j6697l1959j8208J4337J2045J2429R739k4491
21526A1184m5611j2565O252M9554j6549M084L8408K2082J452l7569l9582L3771
21514A4911j3317K208j5725K1107M1049L6078l2090j34j4846k3704j9037p890
21502a1390L1741J2673q285P477j9490j4711M893K4459r359l6496l4185K4051
21490b8622L9551j4196k704K9421Q684l7746P139k803l863m1759J880L4419j6059
21477b6658k0855q484r506j6114o2321l712J1126N5774P7063L9685J7140n116
21465D8022l158k2477K7089O2806j8488n2574k0313k1030k4985j0043P1300M5299
$$ plain form
21550 -58918 -47807 -43257 -23790 -45488 -59519 -10316 -4935 -2269 21238 4393 -11397 15000
21538 15000 16624 22921 33147 53989 37292 5333 -12875 1462 13507 25936 35675 11184
21526 11184 -34427 -46992 -40740 8814 -7735 -3651 34757 56839 58291 20722 -18860 14911
21514 14911 1594 3802 -11923 9184 50233 86311 54221 54087 39241 15537 -3500 -11390
21502 -11390 20351 33024 24739 32216 12726 -1985 2908 27367 18008 -18488 -52673 -28622
21490 -28622 10929 -3267 -5971 23450 32134 -5612 1527 -1276 -5139 -46898 -45018 -10599 -26658
21477 -26658 -47513 -55997 -65503 -81617 -143938 -147650 -136524 -80750 -3687 35998 53138 48022
21465 48022 44864 22387 49476 112282 93794 41220 20907 -123 -25108 -35151 36149 81448
21453H1448j9821l9557P55M2691J5732l2093k8664l5573J0415L2481J3623m1396
21441D1j633J0665M557L006m3380m940J8050M684J4679k3198Q632R144J7617K2778
21427D0702K9443l7810r792L2566L7302m3525k3573J935k8092m3450k822O569
21415d0547K7335k208j6192J2395L4914o795k7504J823J331k4432M1069O0723
21403F1912L846m3491j9301K6247j3029j2994m9837j8287K5330N2292L2243m494
21391D0437k0732j4265r802K5638P614n6022k1966J8688j8237M710K949q677J7645
21378c2020j4382K1721M0180J6506j6478j8946r682k9410J9328J3440p595n980
21366b3318J1018o0455J1986N5599L4505k0764l2496p368J8866K0647J9823J3790
$$ plain form
21453 81448 61627 22070 22825 65516 81248 49155 20491 -15082 -4667 27814 41437 41
21441 41 -1592 9073 13630 16636 -26744 -31684 -13634 -8950 5729 -17469 -8837 307 17924 40702
21427 40702 70145 32335 22543 55109 92411 48886 25313 27248 -844 -44294 -47116 -40547
21415 -40547 -13212 -15420 -31612 -19217 15697 8902 -18602 -16779 -15448 -39880 1189 61912
21403 61912 65758 22267 2966 29213 16184 3190 -46647 -64934 -39604 12688 44931 40437
21391 40437 19705 5440 -4362 21276 28890 -27132 -49098 -30410 -48647 -43937 -40988 -49665 -32020
21378 -32020 -46402 -24681 15499 32005 15527 -3419 -13101 -42511 -23183 -9743 -17338 -23318
21366 -23318 -12300 -72755 -60769 -5170 29335 8571 -23925 -31293 -12427 8220 28043 41833
21354D1833k6158m064o852Q349l85N499R403r432m2127m2356J6671M6318j2727
21341a6028j256L4666J6249O63k6276l0594J8052K2208m1377r202J8086K6420
21329A1611K1804k8267j5908J3367O0426K2766m1976m2993j7868p006L5765K8595
21317D0316k2994m3613k5271p401j3126M0465k809l5003k841J8764j0830J6023
21305d8320j300J1841N1952J2531n0433L710K5032l8948k0425K56J232j27j156
21292e4155L1540k274k1379J4250K3449K1553R45k5034l0722k758K3018k0033
21280d1600j4420P2521K5871m365K0199j7445m9097o2569J0055J2845q05K5851
21268b2959J4734j195L012n040k6231k7897k8242q315K7913K3546n901L5850L2024
$$ plain form
21354 41833 15675 11611 4759 13108 12723 18222 27625 18193 -23934 -66290 -49619 -3301 -16028
21341 -16028 -17284 17382 33631 34294 8018 -22576 -4524 17684 -23693 -32895 -14809 11611
21329 11611 33415 5148 -10760 2607 63033 85799 43823 830 -17038 -24044 11721 40316
21317 40316 17322 -26291 -51562 -58963 -72089 -31624 -34433 -69436 -72277 -53513 -64343 -48320
21305 -48320 -49620 -37779 14173 26704 -23729 -20019 5013 -33935 -54360 -54104 -52872 -52999 -54155
21292 -54155 -22615 -24889 -46268 -32018 -8569 12984 13929 -11105 -41827 -44585 -21567 -41600
21280 -41600 -56020 16501 42372 38007 58206 40761 -8336 -70905 -60850 -48005 -48810 -22959
21268 -22959 -8225 -9420 -6408 -11448 -37679 -65576 -93818 -102133 -74220 -50674 -56575 -20725 11299
21255A1299r044m0526l02p978j9788m1826K9849J5771N5992K8709m923j2052j343
21242C838o156j8581M792j2274m314O455R119o423M400M9782K1584j4023q658
21229B9541j0017k1636j2390l3877k984L5850L2789n195J1583L965j2733O965
21217B1861m334k8143m3620j180M740K2199l1933M1325R4301J8223m1265l5126
21205A7048l4623l097k7447m446L8634K0372k4768j8716K74J2547L600q328J7899
21192a1051l0555j0514J4055P5696L6518m0751m4386p746k060n46k4261k5127
21180g0728o355P669N4602J1797K3236J3895n553j0859l022k7134J5703M1291
21168D4542m598k484o216k4887J101J3708j1805j6116j6369R30J6464j1946o404
$$ plain form
21255 11299 2255 -38271 -38573 -46551 -66339 -108165 -78316 -62545 -6553 22156 17233 5181 3838
21242 3838 -2318 -20899 -16107 -28381 -32695 -26240 -17121 -23544 -19144 30638 52222 38199 29541
21229 29541 19524 -2112 -14502 -48379 -51363 -15513 17276 12081 23664 27629 14896 21861
21217 21861 17527 -10616 -54236 -55416 -50676 -28477 -60410 -19085 75216 93439 52174 17048
21205 17048 -17575 -20672 -48119 -52565 -13931 6441 -18327 -37043 -36769 -24222 -20622 -28950 -11051
21192 -11051 -41606 -52120 -38065 37631 74149 33398 -10988 -18734 -20794 -21340 -45601 -70728
21180 -70728 -77083 -69414 -14812 -3015 20221 34116 28563 17704 14682 -12452 3251 44542
21168 44542 39944 37460 31244 6357 7458 21166 9361 -6755 -23124 -22194 -5730 -17676 -24080
21155b4080N595J7540J2525m4062Q91N624K4095J0316M491J7049R789J1555k794
21142D8534l3969m5579K3608J4755k49k0898J4918J2873m9014k2796l618j328
21130f2763R722n2769Q318J4680J5804L481L8534N4822J5128P337l4397n2354
21118c4457l3996M2997L8483j4139N023k3526l7890j6934J8444N2166K8817l2100
21106g112l8154O5816L6099j0160j289M384J0802j1318m9733K9409N2648k6915
21094E4477o3375j8811J0795L3586j2871M6172j1291k3665l5106l6990K5974L2048
21082I43j0514j1759l899k7486J8327M2595j8254j5194L0651K6119j4873K1209
21070C7865L505j0710n170k6163k3356K6593j129J8187L149l344J3218N181j4628
$$ plain form
21155 -24080 -18485 -945 11580 -32482 -31591 -25967 -1872 8444 12935 29984 39773 51328 48534
21142 48534 14565 -31014 -7406 7349 7100 -13798 1120 13993 -35021 -57817 -61435 -62763
21130 -62763 -53041 -105810 -97492 -82812 -67008 -63527 -24993 29829 44957 52294 17897 -34457
21118 -34457 -68453 -25456 13027 -1112 3911 -19615 -57505 -74439 -55995 -3829 24988 -7112
21106 -7112 -45266 20550 56649 46489 45200 49584 60386 49068 -665 28744 81392 54477
21094 54477 -8898 -27709 -16914 16672 3801 49973 38682 15017 -20089 -57079 -31105 943
21082 943 -9571 -21330 -25229 -52715 -34388 8207 -10047 -25241 5410 31529 16656 37865
21070 37865 41370 30660 25490 -673 -24029 2564 1435 19622 22771 19427 32645 37826 23198
21057B3198m6453K0721k047j1396L9461L6569J4127o5710o0153k842J7010K8309
21045i206M408R972L2042j8774k4931j5422M841K5637M3816k9989j6365J3854
21033A9883j4075j1186K6020J7108J5239k5170m696m5326l2449L0726K4522M1449
21021D2045m172J28n239J1466k3208J9798J0005l5826k2649L8471k7068L159J8030
21008B4940k2163L757J2563k512P866L991j2903j5752K4271K3339k5115k9303
20996g021k8607J269J1676J3375K3828M2414j2034m1018r468N193n385l991j5164
20983b4933K8304L4090r405N936L0165l2922p125j8443p700N5630N860l7885j0808
20970A0764M816j5286j3536J3609M1505j8062k5796L0959M6241N354n2193n8961
$$ plain form
21057 23198 -23255 -2534 -4581 -15977 23484 60053 74180 8470 -51683 -54525 -37515 -9206
21045 -9206 -4798 5174 37216 18442 -6489 -21911 -17070 8567 52383 22394 6029 19883
21033 19883 5808 -5378 20642 37750 52989 27819 23123 -22203 -54652 -23926 596 42045
21021 42045 37873 38001 32762 44228 21020 40818 50823 14997 -7652 30819 3751 6910 24940
21008 24940 2777 6534 19097 16585 24451 28442 15539 -213 24058 47397 22282 -7021
20996 -7021 -35628 -34359 -22683 -9308 14520 56934 44900 3882 -5586 -393 -5778 -9769 -24933
20983 -24933 3371 37461 28056 33992 64157 31235 24110 5667 -2033 53597 59457 21572 10764
20970 10764 15580 294 -13242 367 41872 23810 -1986 28973 75214 80568 28375 -30586
20958c0586o105Q716j6483J9331M9011K1053n401j7545j7872k776l2281j3839
20946d4777j4383q19K431J1341K033K0414j9535j2281J3963n521K065K7787J7821
20933E39L6553k9809k2182l0776o170J0154L6818O654K4913p889l7205j8098j4966
20920e1464L803J9024j1301j7377l927L349J9695k974K628K0401k6479K427j7691
20907e9886Q198J9980J7233j764k0852m442J2134K0136L0498l494k7935K1183
20895A0989Q630n199J7579k8717j2241N4387J4042J8206Q674o5578q5931l1644
20883i6803Q3037L9485j4818j0123K4015J8077M810o610J3139m225k7232l595
20871A9157N158j7667k6768k0094K2471L1835k3153O247Q016m11j410j053k170
$$ plain form
20958 -30586 -36691 -27975 -44458 -25127 23884 44937 39536 21991 4119 1343 -30938 -44777
20946 -44777 -59160 -59979 -57548 -46207 -44174 -23760 -43295 -55576 -41613 -47134 -45069 -17282 539
20933 539 37092 7283 -14899 -45675 -51845 -41691 -4873 1781 26694 18805 -18400 -36498 -51464
20920 -51464 -47661 -28637 -39938 -57315 -61242 -57893 -38198 -41172 -38544 -18143 -44622 -42195 -59886
20907 -59886 -51688 -31708 -14475 -16239 -37091 -41533 -29399 -9263 21235 17741 -10194 10989
20895 10989 19619 14420 31999 3282 -8959 45428 59470 77676 86350 20772 -65159 -96803
20883 -96803 -13766 25719 10901 778 24793 42870 47680 41070 54209 49984 22752 19157
20871 19157 24315 6648 -20120 -40214 -17743 14092 -9061 -2814 5202 4791 3381 2328 158
20858A58K1093L0525J1817o502k4341J1541j7736p743j7039k4848j9761j4598
20846e7434J5463J5081O22N013J3683L8233K0786j1472o8887n5638l491L9242
20834d8799M6637j1591p202n629l44l7725K2378O8737k0061l5794k245Q121L3363
20821I846L803l255J6540k3616n1675L473K0028J8634k5574R625M802L4257j8450
20808a562k8058M6756J1420j8417K1039K1427j9550k0634O122N2351Q833k5445
20796E4282k5227J5315j7459m779k595j1860n588K093J2676N056k5547k2508K0779
20783e362K2433J1036N5679R543n2169m2109K8464K2388j1352K2371O966l5236
20771C2652N871P053m5601M275N1802Q881l7923k791P621K753K3677o527j4975
$$ plain form
20858 158 21251 51776 63593 57091 32750 44291 26555 18812 1773 -23075 -42836 -57434
20846 -57434 -41971 -26890 -26268 -21255 -7572 30661 51447 39975 -28912 -84550 -88041 -48799
20834 -48799 -2162 -13753 -20955 -26584 -26928 -64653 -42275 26462 6401 -29393 -31638 -23517 9846
20821 9846 13649 10394 26934 3318 -48357 -44884 -24856 -6222 -31796 -22171 -17369 16888 -1562
20808 -1562 -29620 17136 28556 10139 31178 52605 33055 12421 18543 70894 79727 54282
20796 54282 29055 44370 26911 22132 19537 7677 2089 4182 16858 21914 -3633 -26141 -5362
20783 -5362 17071 28107 83786 93329 41160 -949 27515 49903 38551 60922 67888 32652
20771 32652 38523 45576 -25 4250 56052 64933 27010 24219 31840 34593 58270 51743 36768
20758C6768m3607l2705M7966J8054o014J5276J0758r508k840O2115o314r8538
20746h589m0378K0890K1273J0384J0861k1615P530M825R382k657l2247K1076J9278
20733B0013j6191k6042K9456L8402J3444Q114L1070k016J87k9608K005j3299l3118
20720B2417O508J8385k7030k0013K556J4538J7722j418Q506l1372J9362L6485
20708F6646j7217n9693n5304p916Q560K4213M3327n226k4992J3335J7710k2025
20696a8582M8174l1170n3597r077L1295J9495J71R114J9923m0152j1191o581j513
20683d3691j9289m9573K3566L9854k5062l558N4817L0919k2100P128J6052l9286
20671c0223J6673l8304k0576K1239J2890K9106l865k5427j4267l3126j5348M2804
$$ plain form
20758 36768 -6839 -39544 8422 26476 20462 35738 46496 36988 34148 96263 89949 -8589
20746 -8589 -48967 -28077 -6804 3580 14441 -7174 356 5181 14563 11906 -20341 735 20013
20733 20013 3822 -22220 7236 45638 59082 67196 98266 96250 96437 66829 68834 55535 22417
20720 22417 28925 47310 20280 267 2823 17361 35083 33665 42171 10799 30161 66646
20708 66646 49429 -10264 -65568 -73484 -64924 -40711 2616 -2610 -27602 -14267 3443 -18582
20696 -18582 29592 -1578 -55175 -64252 -32957 -13462 -13291 -4177 15746 -24406 -35597 -42178 -43691
20683 -43691 -62980 -112553 -88987 -49133 -74195 -77753 -22936 7983 -14117 -6989 9063 -30223
20671 -30223 -13550 -51854 -72430 -51191 -38301 -9195 -13060 -38487 -52754 -85880 -101228 -58424
20659e8424N5120R382l3720j1360l029j492J9480k6815l2298J8485J6768l1710
20647g9613n922L6137L6455K06K1274j5762j9300q089J1991M2578j5955m7885
20635d3885k1063l1914k5899M4613J9695K7512J9107K0394j307o449J2929O631
20623B0364k5452r2336l3457K0577O6608M406L397J152K692n712K9927J4313R757
20610A6236k3212j1993k8300k2372J4041L3923J1514N4021J9324k2233n8538L159
20598a4430K2909p903j9912r798l799o195J7690K2075o167N255M2908J6419k1638
20585C7414j7736R691k1579M543M0146j1200j6490O703l2095R710J0496K9627
20573D9230q941j2697R424l5591k2652j1560O910R020j81j6905j3540K1676N9056
$$ plain form
20659 -58424 -3304 6078 -27642 -39002 -42031 -43523 -24043 -50858 -83156 -64671 -47903 -79613
20647 -79613 -85535 -49398 -12943 -12737 8537 -7225 -26525 -34614 -22623 19955 4000 -43885
20635 -43885 -64948 -96862 -122761 -78148 -58453 -30941 -11834 8560 7253 804 13733 20364
20623 20364 -5088 -97424 -130881 -110304 -43696 -39290 -35893 -34741 -32049 -37761 -7834 6479 16236
20610 16236 -6976 -18969 -47269 -69641 -55600 -21677 -10163 43858 63182 40949 -17589 -14430
20598 -14430 8479 576 -19336 -29134 -32933 -39128 -21438 637 -5530 -275 42633 59052 37414
20585 37414 19678 29369 7790 12333 52479 41279 24789 31492 -603 9107 19603 49230
20573 49230 40289 27592 37016 1425 -21227 -32787 -25877 -16857 -17038 -33943 -47483 -25807 33249
20560C3249M1728J0481j4741n759l7696m9076j3676k2655J9846m409k7007k7581
20548i7296J8774L6494J5731L8460O549j4645j650m1059K5751L1641j6423j3749
20536a1422k6024K7177M7191L4906m4206l2027M4137L0121k2234k6876m016k9311
20524a2584J6460m0331l9599N1390L5168K8931J5807Q218l3925l7668m617l953
20512a6703r977M7292L2599J8320k340k0840o929l4205k2580k8574l114J5379
20500c1672n298l4758M052J7748O6582K8919j3722l8244J0822o551p736N3686
20488D3828J6275J5654n6450l2992J2498m89J9338k0093m1637K2147j0840n3055
20476h5816j1777P872k002M8627M4578N607J218o122j3584k1292K5256K157j3242
$$ plain form
20560 33249 74977 85458 70717 64958 27262 -21814 -35490 -58145 -38299 -42708 -69715 -97296
20548 -97296 -78522 -42028 -26297 12163 18712 4067 2417 -38642 -12891 18750 2327 -11422
20536 -11422 -37446 -10269 36922 71828 27622 -4405 39732 69853 47619 20743 16727 -12584
20524 -12584 3876 -36455 -76054 -24664 10504 39435 55242 63460 29535 -8133 -12750 -16703
20512 -16703 -26680 20612 53211 71531 69191 48351 41422 7217 -15363 -43937 -47051 -31672
20500 -31672 -36970 -71728 -67676 -49928 16654 45573 31851 -6393 4429 -2122 -9858 43828
20488 43828 60103 75757 19307 -13685 -1187 -1676 17662 -2431 -44068 -21921 -32761 -85816
20476 -85816 -97593 -89721 -91723 -43096 1482 7089 8307 2185 -11399 -32691 -7435 -5278 -18520
20463a8520m9553m0894K6236K3255K2613J8029j6665j9196l2879J5207K0442K3090
20451b8835J0160K7566M3716J4041J9737k8738k5922J510k5474k1919P89K3281
20439I912L2200K9205O534j3088l3346K3326M4739j0342l5350k8452J3834o648
20427C2524J0111m3094p5405k4625L9851L0144l2145q006J9199K3769k5867J2128
20415d1416N2807m04k7420j6775K2486N0711Q609n3709n6488j0106L0361Q137
20403c3207J605J7359J4141J9437j5544m8113n953J7266P568K4692K982J7825
20391B0058N2116j0125R203J772l0613n4678m5720L3080J3652L495M552k7870
20379c1078m0327J8016N0245j993K851l571q764N980K8835J7790k4774k8519M197
$$ plain form
20463 -18520 -68073 -108967 -82731 -59476 -36863 -18834 -35499 -54695 -87574 -72367 -51925 -28835
20451 -28835 -18675 8891 52607 66648 86385 57647 31725 33235 7761 -14158 -13369 9912
20439 9912 42112 71317 77851 64763 31417 54743 99482 89140 53790 25338 39172 32524
20427 32524 42635 -459 -75864 -100489 -60638 -30494 -62639 -70645 -51446 -27677 -53544 -41416
20415 -41416 11391 10987 -16433 -33208 -10722 39989 48598 -5111 -61599 -71705 -41344 -33207
20403 -33207 -31602 -14243 -102 19335 3791 -44322 -50275 -33009 -25441 -749 2233 20058
20391 20058 72174 62049 71252 73024 42411 -12267 -57987 -24907 -11255 -7760 -3208 -31078
20379 -31078 -71405 -53389 -3144 -5137 -2286 -5857 -14621 -8641 20194 37984 13210 -15309 -11112
20366a1112j5833P199K164K3971L1088n0696l7333M6089K9850r861j6165m2917
20354d3556o229L3879N0340m424l166n836M410P415J5579m4985n1632L5556K6489
20341A3840N677p952j1977k5334q309p217q796M55j900J2941j4218m6404L5402
20328f3792N8838j702k2537R224j4473n446k1799K392P760M3606L0960l107K1454
20315D1378j7017N337K1242j7093n5108k0874k972K4872j6271l4443j458K1422
20303e0985K1997j0436j2977k694j7950K109K7875j1241l7148L1329L1289k3457
20291e2289j6574P4757N0285k4633j9653J3983j4139j1276K8005M1522K1186l4025
20279E7149l449o286k5240k0644j6623L8025M228k4324l5139k796k0775j2448
$$ plain form
20366 -11112 -26945 -19746 -17582 6389 37477 -13219 -50552 -4463 25387 15526 -639 -43556
20354 -43556 -49785 -15906 34434 30010 26844 21008 25418 32833 48412 3427 -48205 -12649 13840
20341 13840 19517 11565 -412 -25746 -34055 -41272 -50068 -49613 -51513 -38572 -52790 -99194 -63792
20328 -63792 -4954 -6656 -29193 -19969 -34442 -39888 -61687 -59295 -51535 -7929 23031 19924 41378
20315 41378 24361 29698 50940 33847 -21261 -42135 -45107 -20235 -36506 -70949 -72407 -50985
20303 -50985 -28988 -39424 -52401 -55095 -73045 -70936 -43061 -54302 -91450 -60121 -28832 -52289
20291 -52289 -68863 5894 56179 31546 11893 25876 11737 461 28466 69988 91174 57149
20279 57149 53700 47414 22174 1530 -15093 22932 27160 2836 -32303 -35099 -55874 -68322
20267f8322O625k1462j011L9538M7051K2384P775J534j5176o32k0972k5229l9857
20254f7754r258Q349j4752J9933O4406N5034K0270j1530k0216p711m1763o946
20242a1938L1064o143K486m272j6679k9287L3311O5272k4377l7873M3012L3462
20230G8038k2023l0578m3927Q442J4866J2030J5763K085R017l6109k1617k6057
20218d0070K2632J3300N608j1347k6214K4633o757K0095K601R449l4947p488k6371
20205e4876J4339J3360k4640L5468J8898K4143K1121P786j1895j9912Q976l1449
20193A319j5136j3521K2134M3329k7469l3312j3576L404N16J7609O356L2283k8900
20180d964l0445m0159j1296R191R738k284K6294P866M5721j202k7719J2887L5034
$$ plain form
20267 -68322 -61697 -83159 -84170 -44632 2419 24803 32578 34112 18936 18304 -2668 -27897 -67754
20254 -67754 -77012 -68663 -83415 -63482 924 55958 76228 64698 44482 36771 -4992 -11938
20242 -11938 19126 12983 15469 11197 -5482 -34769 -1458 63814 39437 1564 44576 78038
20230 78038 56015 25437 -18490 -10048 4818 16848 32611 34696 43713 7604 -14013 -40070
20218 -40070 -17438 -4138 1470 -9877 -36091 -11458 -18215 1880 4481 13930 -21017 -28505 -54876
20205 -54876 -40537 -27177 -51817 -16349 2549 26692 47813 55599 43704 23792 32768 1319
20193 1319 -13817 -27338 -5204 38125 10656 -22656 -36232 -32828 -32312 -14703 -8347 23936 -4964
20180 -4964 -35409 -75568 -86864 -77673 -67935 -70219 -43925 -36059 9662 8460 -19259 -6372 28662
20167B8662j4880n3065o323j454J4008Q034J341L432J8591K0099r235j2923m1718
20154d5431j4353k1314m5679O2129J9446k0854k0977l882L6069L9239J0522l9157
20142d4242M1708J540m033M2607R579J5180j4563n0311n896J6441r96j0131l8676
20129d1793l5902o27J5753l1567j6026O281N9966R836M1678n7663N966L1242M0021
20116B7165M227k704j9113J4207O26q766n015j4841O37J1089j754r852k6400k9407
20102e9901N9840K6785p616q868j1378P274j9633L212L8851m4169N858j2163j1740
20089c3648l7277j6706K8837P2053K2244k8654l225r402P579J7025k5521l7656
20077d4351N586K6369J9259J954Q964M711k5411j9658M4235J9840k0803j2018
$$ plain form
20167 28662 13782 -39283 -45606 -47060 -33052 -25018 -23677 -20245 -1654 18445 9210 -3713 -45431
20154 -45431 -59784 -81098 -126777 -64648 -45202 -66056 -87033 -90915 -54846 -15607 -5085 -44242
20142 -44242 -2534 -994 -5027 37580 47159 62339 47776 -2535 -8431 8010 7014 -3117 -41793
20129 -41793 -77695 -78322 -62569 -94136 -110162 -103881 -43915 -34079 7599 -50064 -44098 -12856 27165
20116 27165 31392 28688 9575 23782 24408 15642 10627 -4214 -3577 7512 5758 -4094 -30494 -59901
20102 -59901 -61 26724 19108 10240 -1138 6136 -13497 -10285 28566 -15603 -9745 -21908 -33648
20089 -33648 -70925 -87631 -58794 13259 35503 6849 3624 -5778 1801 18826 -6695 -44351
20077 -44351 -38765 -12396 6863 8817 17781 22492 -2919 -22577 21658 41498 20695 8677
20065H677m403j0626J8082O427p185l414q269M342J207J381L220j6273k3251L4708
20051D623K8702q067J445L6515l7239m3472J3449J7115J0446K1860J1131O458
20039F2966l063n7384j0229J4480J747j897k944J9548m375j4710m405j0277Q600
20026a943L6308R858j9523j4773J5788p823j7236o615J1859k2971k65q587o657
20013c2580K4143k346L1716K2266Q443p6473j397M9773N816J1994L9528N1019
20001A31902j9518k4001l3885k5964R83q902j6719k51J1351J2353n313M374J7436
19988D3846j7119K1172m0003j292R935l492l599l6489p845J3454m59J0591J90
19975a1110j2305k0079j8738O296j7351K656J9692j2379p163K9784K9380P763
$$ plain form
20065 8677 4274 -6352 11730 18157 10972 7558 -711 3631 4838 6219 9439 -6834 -30085 4623
20051 4623 33325 25258 26703 63218 25979 -17493 -4044 13071 23517 45377 56508 62966
20039 62966 59903 2519 -7710 6770 8517 6620 3676 23224 18849 4139 -266 -10543 -1943
20026 -1943 34365 44223 24700 9927 25715 17892 656 -5959 5900 -17071 -17336 -25923 -32580
20013 -32580 -8437 -10783 20933 43199 51642 -24831 -26228 23545 29361 41355 80883 131902
20001 131902 112384 88383 54498 28534 29517 20615 3896 3645 14996 27349 22036 26410 43846
19988 43846 26727 47899 7896 6604 16539 13047 9448 -27041 -34886 -21432 -21891 -11300 -11110
19975 -11110 -23415 -43494 -62232 -55936 -73287 -70631 -50939 -63318 -70481 -40697 -11317 -3554
19963c554k0566P338r375k9163k707k3794J4972L4502J395j2000q618K1398M341
19950b5831m572J5624K0885l8795J887K1029j8915P118J3780L5998r567r122k2437
19937a2918J1327L4765j0263j3613k6125O414J3614J888J8733j6309k0320k1242
19925c4049K9227J0732P512j2234j3354l4610m119r126r85J0869k2261k533J1371
19912f3560M0703J0526m145n676N2895J1405r624L0152k832m4407l41J1974k3867
19899C203k0184N3688O561o801L9579l4583q0962K35P413L8160k323J4653o93
19886A7946K6526l2379l9228Q521K5584K7629L1149K455j0424q245J5315K2092
19874H6941l9271l113N334j0284q984m6459Q04M313K0584L6883J9115P655j0092
$$ plain form
19963 -3554 -24120 -16782 -26157 -55320 -58027 -81821 -66849 -32347 -30952 -42952 -51570 -30172 -25831
19950 -25831 -30403 -14779 6106 -32689 -30802 -9773 -28688 -21570 -7790 28208 18641 9519 -12918
19937 -12918 -1591 33174 22911 9298 -16827 -10413 3201 5089 23822 7513 -12807 -34049
19925 -34049 -4822 5910 13422 1188 -12166 -46776 -50895 -60021 -61006 -50137 -72398 -74931 -63560
19912 -63560 -22857 -12331 -16476 -22152 30743 42148 32524 62676 59844 15437 15096 27070 3203
19899 3203 -16981 36707 43268 36467 76046 41463 -39499 -39264 -31851 6309 3986 18639 17946
19886 17946 44472 12093 -27135 -18614 6970 34599 65748 68203 57779 49534 64849 86941
19874 86941 47670 44557 49891 39607 30623 -15836 -15032 -10719 9865 46748 65863 73518 63426
19861F3426n7816K4205R164Q289J2781j0808J2751O859k6125o7738m7591P615
19849f4988L2315L2889j0075j8846k2877l6953K373K6328J9426P240P198J3000
19837a2970L025m390J6614l95m5947K778j8834j767J3788K3601K9697j8308k2141
19824c5249O043K0768J0295P535M5484K1035m9006o3394k1425k7881l898K9736
19812e9957Q1641O832k226j0792K0930M623J7448P824o810m3555l4513J4983K4246
19799B0674j9976Q275L1223K6332L4937p676j9531K11l9381j2553l285J0909M3498
19786G3657q615l0476n246L6632n984o7475k9334J1578Q293L578q163M8668m971
19773B2142K442l4427n79K1130J3739l6104J1477K9066j4109o056k1947j6515
$$ plain form
19861 63426 5610 29815 38979 47268 60049 49241 61992 68851 42726 -25012 -72603 -64988
19849 -64988 -32673 216 -9859 -28705 -51582 -88535 -86162 -59834 -40408 -33168 -25970 -12970
19837 -12970 -9945 -14335 2279 1884 -44063 -41285 -60119 -61886 -48098 -24497 5200 -13108 -35249
19824 -35249 -29206 -8438 1857 9392 54876 75911 26905 -36489 -57914 -85795 -89693 -59957
19812 -59957 21684 28516 26290 15498 36428 41051 58499 66323 59513 15958 -18555 -3572 20674
19799 20674 698 8973 40196 66528 101465 93789 74258 74469 35088 22535 19250 30159 73657
19786 73657 65042 34566 29320 65952 59968 -7507 -36841 -25263 -16970 -13392 -21555 27113 22142
19773 22142 24584 -9843 -10422 10708 24447 -11657 -180 28886 14777 8721 -13226 -29741
19761b9741K2555J8533R58k9173J5525K0418j250M866L27J3890j1962m8291K6765
19748C420L187j7388K3127J3060N0812J2031k4560J2801K1990k3840m4872j4344
19736A5424N648P419j7949k2085j2041J107j2522M3269L4622K58j9867k2502L2200
19723C2981P561o7240Q601m687j357l410J7970R910p234J0118l0605Q027N4843
19710C5478K5781k1264r039J0850Q115k8520J4621L3310Q189l6087l5764l0444
19698b4774N323J458M8447J6353j0434j4009L948k161k864n25k5683j1742j0927
19685b7590j083J0529J5620M4007K6506o1196p7776L5487L5323Q707J7027k8991
19673c430Q21K7548j153m4040J1935Q883K0523L7233m4391l6672P604K5378J945
$$ plain form
19761 -29741 -7186 11347 12305 -16868 -1343 19075 17825 22691 23018 36908 24946 -23345 3420
19748 3420 6607 -10781 12346 25406 76218 88249 63689 76490 98480 74640 29768 15424
19736 15424 21072 28491 10542 -11543 -23584 -22477 -34999 8270 42892 43150 23283 781 32981
19723 32981 40542 -26698 -18097 -22784 -24141 -27551 -9581 329 -6905 3213 -27392 -19365 35478
19710 35478 61259 39995 30956 41806 49921 21401 36022 69332 77521 41434 5670 -24774
19698 -24774 -19451 -17993 30454 46807 36373 22364 26312 24151 21287 20762 -4921 -16663 -27590
19685 -27590 -28673 -18144 -2524 41483 67989 6793 -70983 -35496 -173 8534 25561 -3430
19673 -3430 -2609 24939 23786 -20254 -8319 564 21087 58320 13929 -22743 -15139 10239 12184
19660A2184n5323Q644J9582J0436J4297m7800k8250m648K2980K5278j501p578
19648c1699m535K2359J3632O784J9226j713k1396K8865J6853j8564n4941K730
19636b2399R928j4761l9033k3368R726K5085J564L2080O531l452R662J5805o102
19623A266k5893Q726N419j5740n973k15J8626R688P637J8876N5719N459m3130
19610D0465o1772l2061J7661K7528j8184L9265L6562R862L0995j0971l9341m7484
19598g475k3530L362j343j8867J0000q849j7403Q107j4291J0342R131K8670J2332
19585i814k2240r325L9568J2502L6l0832r693M0007k9004j9118k7430p344J1742
19572f0945j0938P057R571P168r219L039K7123j8401N825J4529j7458L96K1325
$$ plain form
19660 12184 -43139 -34495 -14913 -4477 9820 -37980 -66230 -70878 -47898 -22620 -24121 -31699
19648 -31699 -36234 -13875 -243 6541 25767 24054 2658 31523 48376 29812 -25129 -22399
19636 -22399 -12471 -27232 -66265 -89633 -79907 -54822 -53258 -21178 -14647 -18099 -8437 7368 1266
19623 1266 -24627 -15901 -10482 -26222 -32195 -32410 -13784 -4096 3541 22417 78136 83595 40465
19610 40465 -21307 -53368 -35707 -8179 -26363 12902 49464 59326 90321 79350 40009 -7475
19598 -7475 -31005 -27643 -28986 -47853 -37853 -46702 -64105 -55998 -70289 -59947 -50816 -22146 -9814
19585 -9814 -32054 -41379 -1811 10691 10727 -20105 -29798 10209 -18795 -37913 -65343 -72687 -60945
19572 -60945 -71883 -64826 -55255 -48087 -57306 -54267 -27144 -45545 -39720 -25191 -42649 -42253 -20928
19559b0928K0440J2439m0478k8825L0589M2269K0790L8537k4975k7223m385n851
19547A2399l3791j7096K7055m618J642L7612K1960J0407m4614l6133j7857m235
19535d7269k0128J8405L5953p175o020L1048K6461J3559L4006l2626k0713L596
19523B9097K2995n6370j8069k9893J9233M8752J9081k1281m5970j2976N478J2821
19511b7102J4165P369r865N442K9986N41p487K6262K2831m4932k7977L3217J5112
19498C7562l2234n479K8022J0810m4232l5873j6754J4358N4757O288j9275j228
19486c278o919J9467M753J0923j5744j8190K7589K4033k0767k234R500k8869k1609
19473b1345p794K1254j3733o1371l9081k8834L5864N2581K6943J4429K594J4348
$$ plain form
19559 -20928 -488 11951 -28527 -57352 -26763 15506 36296 74833 49858 22635 18250 12399
19547 12399 -21392 -38488 -11433 -16051 -14409 23203 45163 55570 10956 -25177 -43034 -47269
19535 -47269 -67397 -48992 -13039 -20214 -26234 4814 31275 44834 78840 46214 25501 29097
19523 29097 52092 -4278 -22347 -52240 -33007 15745 34826 13545 -32425 -45401 -39923 -27102
19511 -27102 -12937 -5568 -15433 -9991 19995 20536 13049 39311 62142 17210 -10767 22450 37562
19498 37562 5328 -151 27871 38681 -5551 -41424 -58178 -43820 10937 17225 -2050 -3278
19486 -3278 -10197 9270 14023 24946 9202 -8988 18601 42634 21867 19633 29133 264 -21345
19473 -21345 -29139 -7885 -21618 -82989 -122070 -150904 -115040 -62459 -35516 -21087 -18493 -4145
19461d145K3638J6927l5759k7393K3723n244k262o657k9970J3889l3486m317N9926
19448a1130K0868J3975k2633R601k4014n584K4681L5392p911j534j1354j7644
19436B713j1126L9689L1579K3379J6807l2467n6253J8631J791k0875J4958K177
19424C1003J9662Q441l9166j4845j605j9699L0934J2693l6013l913N5894L4329
19412G7715m329p0405l0279j5908j975J0704M0250j6694j7408k6362R362k7811
19400g3140K4961K0946o156O540R508J9956j6387J4012K6771j6337l1721Q640
19388a2407L3967J6552n4191l2977L3497N8670L2129k5750l9814J2215K1497j7753
19376B5635k879L8570k0981L4527L2082n8746j8581k0918k2381j196J6633J2603
$$ plain form
19461 -4145 19493 36420 661 -26732 -3009 -8253 -10515 -17172 -47142 -33253 -66739 -71056 -11130
19448 -11130 9738 23713 1080 10681 -13333 -18917 5764 41156 33245 31711 20357 2713
19436 2713 -8413 31276 62855 86234 103041 70574 14321 32952 34743 13868 28826 31003
19424 31003 50665 59106 19940 5095 3490 -16209 14725 27418 -8595 -12508 43386 77715
19412 77715 73386 2981 -27298 -43206 -45181 -34477 5773 -10921 -28329 -54691 -45329 -73140
19400 -73140 -48179 -27233 -33389 -26849 -17341 2615 -13772 240 27011 10674 -21047 -12407
19388 -12407 21560 38112 -16079 -49056 -15559 43111 75240 49490 9676 21891 43388 25635
19376 25635 22756 61326 40345 74872 106954 48208 29627 8709 -13672 -14868 1765 14368
19364A4368J1481R680j1330m7039r247K0344N3844k037l8430k1213j8276j7635
19352e5490K0211j713J4700m6456K0433N9269j0223j8689K243K3494j5273R781
19340B287Q309J8839n874n6247J6759R280l4109K437J2101N1827j5866n8435J2331
19327c6361K7757k143r173J561k2692J9631P758k3522j1958p544j4419j7743M4446
19314d4402M3825K3911K3794l141k1858k9974K713K928r1o13j2042k2209Q072
19301b9087J296j5413Q20j685l363M959K5038J6273j4684j2007o697J3821K1530
19288H01P506J6811J0541p907p386j6383J7391J5873j6431j5266k7356K8118n52
19275E760l0014j7016K2719J2694j3330J8085N9254N3888l9247n7856l3592j2525
$$ plain form
19364 14368 25849 35529 24199 -22840 -32087 -11743 42101 40064 1634 -19579 -37855 -55490
19352 -55490 -35279 -36992 -22292 -68748 -48315 10954 731 -17958 -15715 7779 -7494 2287
19340 2287 10596 29435 23561 -32686 -15927 -6647 -40756 -38319 -26218 25609 9743 -48692 -36361
19327 -36361 -8604 -10747 -19920 -18359 -41051 -21420 -13662 -37184 -49142 -56686 -71105 -88848 -44402
19314 -44402 -577 23334 47128 43987 22129 -7845 -5132 -2204 -2295 -2908 -14950 -37159 -29087
19301 -29087 -27791 -43204 -42384 -44069 -47432 -42473 -17435 -1162 -15846 -27853 -34550 -20729 801
19288 801 8307 25118 35659 27752 20366 3983 21374 37247 20816 5550 -21806 6312 5760
19275 5760 -24254 -41270 -18551 -5857 -19187 -1102 58152 112040 72793 14937 -18655 -31180
19263c1180P297J2545l982Q76j5356m2105J3786L5265K2091M8504P5n678k3128
19250A9010k6119n5240j2187L0514O919j6914o541J5073P95K5859K3338L1843
19238C6350n540p156K6830m5568Q21k0038l1496M1228L9484k0169l7825K9923
19226F844K2930L98l2226L1805J9652j9104K3993j657K7025K9934m5401j9652
19214D4541J0613r972l1288k837k7131n061k5604J1843M665q391J2741j4099K7399
19201a2581Q336j4099j2284j1607K517K2495O0485l6580o7065k691J9598R421
19189c4055J8289J1911K0957P468q056J6513K5294J629K836m1026j2380j6265
19177f885L8725L966l23j6029j1877O027L4322k6692k3585L3403M591P845M9347
$$ plain form
19263 -31180 -23883 -11338 -15320 -14444 -29800 -71905 -58119 -22854 -763 47741 47816 42138 19010
19250 19010 -7109 -62349 -74536 -44022 -37103 -54017 -60558 -45485 -44690 -18831 4507 36350
19238 36350 30810 23654 50484 4916 5737 -14301 -45797 -4569 34915 14746 -23079 6844
19226 6844 29774 30172 -2054 29751 49403 30299 54292 52635 79660 109594 64193 44541
19214 44541 55154 45182 13894 11057 -16074 -21135 -46739 -34896 -30231 -38622 -25881 -39980 -12581
19201 -12581 -4245 -18344 -30628 -42235 -39718 -17223 43262 6682 -60383 -63074 -43476 -34055
19189 -34055 -15766 -3855 17102 24570 16514 33027 58321 59950 62786 21760 9380 -6885
19177 -6885 31840 35806 35483 19454 7577 13604 47926 21234 -2351 31052 35643 43488 92835
19164I2835k3864j5557r124M605m3734r301L1610Q085L757j8188o178j771R553
19151B2728p958L4017J3317O88n3964j2185j4402L1495J7111n072L8864K3291
19139H7930L1165N0978Q9978J39189K60950M56944O20291M19277m46859o87240
19129A022603m10237k02528r5320r3009q2637r778j5793j5032m402k5485j0545
19118E7837p654L9596m3696J0221k7261J2974J5713Q392J7402N3197n5086m3154
19106C8481L0849J1860j4815j8053L6480Q2893J09874J14264K19136M03804N86491
19095A601264O33736p6528q26463n83934k76925j16109r1292n3779m5215k3105
19085A41650l0811q1073k6419J1271K1568k8356L613j0162J2810N2640J2426J3949
$$ plain form
19164 92835 68971 53414 44290 48895 5161 -4140 27470 35555 39312 21124 14946 13175 22728
19151 22728 14770 48787 62104 62792 8828 -3357 -17759 13736 30847 25775 64639 87930
19139 87930 119095 170073 260051 399240 660190 1117134 1737425 2156702 1709843 1022603
19129 1022603 612366 409838 314518 221509 138872 129094 113301 98269 93867 68382 57837
19118 57837 50183 89779 46083 56304 29043 42017 57730 66122 83524 136721 81635 38481
19106 38481 69330 81190 66375 48322 84802 167695 277569 391833 610969 1014773 1601264
19095 1601264 2235000 2158472 1332009 748075 471150 355041 263749 209970 164755 141650
19085 141650 110839 29766 3347 14618 36186 7830 11443 1281 14091 66731 79157 93106
19073I3106p233o570M498K0466l408n400j8897o0038k3646p922N651Q069j2510
19060a3834j1548K7127K1095M0591j915l4402j9967Q971L366M9882K7730l8653
19048E8443o156j1973q48J0223l7285J5955K096l3140m0574K783J9025M1430J9363
19035C9342l9394l2943R774K7053L8447M835J3878o197r152k4761k8379J7126
19023I629J4425j0479K6570K0p1071J0953J2038j2660k493J3256Q098K1105j789
19010A7602o830m774k6678j789Q023M3921P492j9250l3736Q682l821l021j9914
18997c4093K5024L3138J0979r630p397k0932m470R761m0283k5072J6368J0912
18985c5695M3714J1096r594l3023N683r848J1044p964k2554N5211L4104r534r1
$$ plain form
19073 93106 85873 79303 83801 104267 100859 95459 76562 16524 -7122 -15044 -9393 -1324 -13834
19060 -13834 -25382 1745 22840 63431 61516 27114 7147 16118 19484 69366 97096 58443
19048 58443 52287 40314 39466 49689 12404 28359 30455 -2685 -43259 -40476 -21451 19979 39342
19035 39342 -52 -32995 -23221 3832 42279 47114 60992 54795 45643 20882 -7497 9629
19023 9629 24054 13575 40145 40165 -30906 -19953 -7915 -20575 -23068 -9812 -1714 19391 17602
19010 17602 10772 5998 -20680 -22469 -14446 29475 36967 17717 -16019 -7337 -11158 -14179 -34093
18997 -34093 -9069 24069 35048 25418 18021 -2911 -7381 2380 -37903 -62975 -46607 -35695
18985 -35695 8019 19115 9521 -23502 -17819 -27667 -16623 -24587 -47141 8070 42174 32640 32549
18972C2549O221j8573m4427j2942K5440K1682N015n231J9022o867j0375j2904
18960a390l948k5322k5201R951M1346j888j7626k6811L747L4272L7228M698n790
18947B3266j4812j3616n203K5455Q3750K8440l5291l3914k089j2157L068R17k424
18934D5390J6535K6168k0365r047J9669K6535j6112q6842j2735N401L2766j210
18922B6153k0837L222j0243l4970N0429N252n320J3725o790j2979K42N557l6953
18909b3512M540J8288N1266L3769k5636q0207j2887O9485L9611l202p173J3681
18897G8023l7715k4442J8040l2354l5581j3013L3448N0335L2443J381j3214k7031
18885C0320j9011p1271j1624R700O8726K6789N219K5654j562m0652k4222R018
$$ plain form
18972 32549 38770 20197 -24230 -37172 -11732 9950 14965 9734 28756 21889 11514 -1390
18960 -1390 -5338 -30660 -55861 -45910 -4564 -6452 -24078 -50889 -47142 -12870 24358 29056 23266
18947 23266 8454 -5162 -10365 15090 98840 127280 91989 58075 55986 43829 46897 47814 45390
18934 45390 61925 88093 67728 58681 78350 104885 88773 1931 -10804 -5403 27363 26153
18922 26153 5316 8538 -1705 -36675 13754 19006 13686 27411 20621 7642 7884 13441 -23512
18909 -23512 -18972 -684 50582 84351 58715 -21492 -34379 35106 74717 71515 64342 78023
18897 78023 40308 15866 33906 1552 -34029 -47042 -13594 36741 69184 70565 57351 30320
18885 30320 11309 -59962 -71586 -61886 6840 33629 38848 64502 62940 22288 -1934 7084
18873G084K0093k6272J804Q957K573k3662L320O1138j2493j812l1541l6542K9848
18860B495J02864K5647l3498o0479j5258k855j9765K9988L7325j8613j9831q569
18848A9451m8409j0916J3041J8758N9273N2751j475k8790k5624M158L5499L3925
18836A21642m2532j2318L5538K055l787R76M787M7609K7510L5251k074m5779k0736
18823A48142k2287o3n3699k1141K4396K50J9649J0433k271N158j5176K5605K6853
18810A45849J1591r798o986o277K2462P1871K1230N6683J13541J29819J88802
18799G38787K91363M90367N11674j35007o60870m77255j77247j17236r6858j0098
18789C57620J825m0650m7518k544q0886k6807J3913l0955p037o794m8549j1895
$$ plain form
18873 7084 27177 905 2709 11666 14239 -9423 -6103 55035 42542 40730 9189 -27353 2495
18860 2495 105359 131006 97508 37029 21771 18916 -849 29139 66464 47851 28020 19451
18848 19451 -28958 -39874 -26833 -8075 51198 103949 102474 73684 48060 52218 87717 121642
18836 121642 79110 66792 102330 104385 100598 101574 106361 153970 181480 216731 214657 168878 148142
18823 148142 125855 125792 72093 50952 75348 75598 95247 105680 103409 108567 93391 118996 145849
18810 145849 157440 147642 140656 134379 156841 228712 249942 306625 420166 549985 738787
18799 738787 1030150 1520517 2032191 1897184 1236314 759059 581812 464576 367718 357620
18789 357620 359445 318795 271277 268733 187847 161040 174953 143998 136961 130167 81618 69723
18777F9723j7022K1864L9716K1381J338k5725M180Q8173J37868J63510J87550
18766F92556J12773l5986p773J24397L12820N67061P93914L17802p70362r00930
18756A206272m98127k39830r7206q9029l8238j4810m7782l6617k5081P582j8092
18745A09042J3222j3815m6426m9406Q913L1759J8323k2195N197L2812j9664l9214
18733B8548P0283P0265k7860m3501k8323k1288K9174k1382k352O4491J7141k3106
18721A12090J3248Q261n2782p2800l4064o186l0420m1096k8596j1714N0635P0590
18709b2834O2506J49206J64780Q7495M7918j28997m5508j3225j02341r9267N3445
18698A53178O0089p632n5314j4574K0828j88j2497M954J4396p5762r8166K4101
$$ plain form
18777 69723 52701 74565 114281 135662 137000 111275 115455 203628 341496 505006 692556
18766 692556 805329 769343 761570 885967 1198787 1765848 2559762 2877564 2107202 1206272
18756 1206272 708145 468315 371109 282080 243842 229032 181250 144633 119552 127134 109042
18745 109042 122264 108449 62023 12617 21530 53289 71612 49417 54614 87426 67762 28548
18733 28548 98831 169096 141236 97735 69412 48124 77298 55916 53564 118055 135196 112090
18721 112090 125338 133599 80817 8017 -26047 -32233 -62653 -103749 -132345 -144059 -93424 -22834
18709 -22834 39672 188878 353658 441153 489071 360074 314566 301341 199000 99733 153178
18698 153178 213267 205635 150321 135747 156575 156387 143890 148844 163240 87478 -10688 13413
18686A3413q253k8531M313p653L7018J8061K4739n135J5087J429j5573j5726k9395
18673C794K4600O4924J01337K41497J44965P2508j9584o4839j6020m5970j01878
18662D05334r8392n1061j0975N4133J4739n4405k0993j0613k192J7222N9669L1896
18650C34362n119O988K5761L6672q793j6268K5913j4871j8248k3721K2828Q218
18638C73722l1209N4135L4904k044M3380N243p3899k9181R222L2242L1751N5547
18626E03813P9347P1231N1933j3084J490J13766J11946J93358L69985N73590P29524
18615B786899L07667n78319o14085l10679p1731R0895O9320K2432q15N9297N4615
18604A815496Q7617J15220J03134O2433J48555K78328L65598M13265N17990P86818
$$ plain form
18686 13413 5160 -23371 -19058 -26711 10307 28368 53107 47972 63059 64488 48915 33189 3794
18673 3794 28394 93318 194655 436152 581117 653625 634041 569202 553182 507212 405334
18662 405334 306942 255881 244906 299039 313778 259373 238380 227767 225575 242797 302466 334362
18650 334362 329243 336231 361992 398664 389871 373603 399516 384645 366397 342676 365504 373722
18638 373722 342513 396648 431552 429508 472888 478131 404232 375051 384273 416515 448266 503813
18626 503813 583160 654391 706324 693240 694730 808496 920442 1113800 1483785 2057375 2786899
18615 2786899 3094566 2516247 1902162 1591483 1519752 1610647 1679967 1702399 1701584 1760881 1815496
18604 1815496 1903113 2018333 2121467 2183900 2332455 2610783 2976381 3389646 3907636 4694454
18594D694454J229396J903990K036840R55808j17263K67131J674670L111675M419496
18585B0176197O628000J1873090K2632099M2615270P3042546J11642907J06030552
18578C94640661n5980168j46830470q5243055m0255040k0632669j1266481o523501
18571B7909277m423589m230541l483900k191972j372580q32880j054016j205579
18563I114220p11765k91856K06407N52478N69543j21038r6710Q87811J841311
18554A1950401J655806M78704o1339J110520K958554M628326O521128J1070583
18546D0312683K0478163L9005060O9615699J12375155J46604668M2357784j62023113
18539C08726099j42213354o8606410l3743835j8224354j0455691o369331n127228
$$ plain form
18594 4694454 5923850 7827840 9864680 10820488 10703225 10970356 12645026 15756701 20176197
18585 20176197 26804197 38677287 61309386 103924656 176967202 288610109 394640661
18578 394640661 338660493 191830023 106586968 66331928 45699259 34432778 27909277
18571 27909277 23485688 19255147 15771247 13579275 12206695 11373815 10319799 9114220
18563 9114220 8402455 8110599 8317006 8869484 9439027 9317989 9221279 10109090 11950401
18554 11950401 13606207 14084911 14023572 15134092 18092646 22720972 29242100 40312683
18546 40312683 60790846 99795906 169411605 281786760 428391428 470749212 308726099
18539 308726099 166512745 97906335 64162500 45938146 35482455 29113124 23985896
18532B3985896m799210l264906k144334j471036j209124j752102j403357q30578
18524G111249m84408p0019K03638m11024j202838j063208p20301m23134k65839
18515B674116k86393k85784j93867q8192m9085O9472J69624K95630M58346O69951
18505C433818L12713p13845q27531m94837k65552j66333j05359r3781j19303k2510
18495I37480J2554k0505l1457j0672M589j1527l4579n1608j04257m2223j2951
18484F34844l1376k6862n8634o4758n1724m3971L9205M9606K4452l0408o7777
18473C72597p1878j4761m1665m2902k9123M2131P4630j2753M3364N5191m6573
18462C28258j9708L9453j4160k5274n6752J5644Q6574J7336M5419Q5588M8273
$$ plain form
18532 23985896 19186686 15921780 13777446 12306410 11097286 9345184 7941827 7111249
18524 7111249 6626841 6556822 6760460 6349436 5146598 4083390 3363089 2939955 2674116
18515 2674116 2387723 2101939 1908072 1819880 1770795 1840267 2009891 2305521 2763867 3433818
18505 3433818 3746531 3032686 2205155 1710318 1444766 1278433 1173074 1079293 959990 937480
18495 937480 950034 929529 898072 887400 891989 880462 845883 794275 690018 647795 634844
18484 634844 603468 576606 517972 453214 401490 357519 396724 446330 470782 440374 372597
18473 372597 300719 285958 244293 201391 172268 214399 289029 276276 319640 374831 328258
18462 328258 308550 348003 333843 308569 251817 267461 354035 371371 416790 502378 550651
18451E50651M6509o8933J4580l366K0286M8709k001o9576j3765j0421J2665L2910
18439E58248m5317m3962o7721m1506n5792j8320L2552L2710K7269n9613n2340
18428B66208m8830k8504j4404J8589K1317L4016k899p560K6900K7898m0703r2093
18416A59935k4747P5556J06161K6314p293Q9826P9422k9571l420k5215p4335j0046
18404C62587L5089O9953l603m3567n7683o8886n3808K5374M3435k4135m8664j3216
18392B22876K3778K2781n073K3742K9505l44k1336n0689M482N8276R9644J29759
18380E37401K01361K94700M86172M67906k13603o13759m01157k19687q8218n5271
18370C95845q9924q9361m0162L2808Q8250M441k1973n4838r102k9191m8787j9797
$$ plain form
18451 550651 597160 528227 542807 539441 559727 608436 606435 536859 523094 512673 525338 558248
18439 558248 512931 468969 401248 359742 303950 285630 318182 350892 378161 318548 266208
18428 266208 217378 188874 174470 193059 214376 248392 245493 237933 264833 292731 252028 159935
18416 159935 135188 210744 316905 343219 335926 425752 505174 475603 472183 446968 372633 362587
18404 362587 397676 467629 464026 420459 362776 293890 240082 265456 308891 284756 236092 222876
18392 222876 246654 269435 264362 288104 317609 317265 295929 245240 249722 307998 407642 537401
18380 537401 738762 1033462 1519634 1987540 1773937 1160178 759021 539334 451116 395845
18370 395845 305921 216560 176398 209206 297456 301897 279924 225086 215984 186793 138006 118209
18358A18209L5591j8672M4382O4625j8476k5099j3486K2924K5803j3064M6900
18347B69637L7269L6089Q1568J94932K56928M80838O91864M54852n07080p95771
18337A201126m49646k07014j35625o0676p0298o6381p1445n7194J2434J6230n2324
18326E9187n8535k6595K967L9535O9098J83012K65626J36898N6542j12071j69823
18315D45841k8370m4651j02909m3751K076m581K576O792L0351N0800K16r660K365
18302C07095p7856j30743L073K0220j90J3153P4506L7802k2657l3028L72m109
18290A87638p1775l4369q722P724O5724Q4306J21649J47892N8522n58K031o5113
18278D94949j0966m1003o5778k7795o6462l7407J4950j2251m2169j6239L5070
$$ plain form
18358 118209 153800 135128 179510 244135 225659 200560 187074 209998 235801 222737 269637
18347 269637 306906 342995 424563 619495 876423 1357261 2049125 2503977 1996897 1201126
18337 1201126 751480 544466 408841 348165 277867 211486 140041 82847 95281 111511 59187
18326 59187 652 -25943 -22976 16559 85657 268669 534295 671193 727735 615664 445841
18315 445841 417471 372820 269911 226160 228236 223655 226231 233023 263374 314174 314390 304730 307095
18302 307095 229239 98496 101569 121789 121599 134752 209258 247060 224403 191375 191747 187638
18290 187638 115863 81494 72772 80496 146220 230526 352175 500067 558589 558031 560062 494949
18278 494949 483983 442980 377202 349407 282945 245538 260488 248237 206068 189829 224899
18267B24899K7349K9001Q6023K3587L2362O266j5202L7063J0608J6003J1855k5535
18255D64279n1351K316P3385j8126m5886m3850n559M1620Q977L7881m147N435
18243D64974m679n1110J6396K4987M7204Q4261J22210O7761O965M0174J6850Q4827
18231I20820J04506N4080R8419M8497K2924J09724J80835L65839N75035Q67617
18221C348296Q93110O6889q55568n04145m798L13138N79904Q11943M76204n01407
18211D623566n13861p7645J84184L31552N73943J009405J443365J664162J530844
18202A0769515R73608J145103K547595M652710P929996J2893091K2976105M3066841
18194A06954564P5285774J19316657J43008728J0953108j68017452j29154504
$$ plain form
18267 224899 252248 281249 367272 390859 423221 429487 414285 451348 461956 477959 489814 464279
18255 464279 412928 415244 488629 470503 424617 380767 375208 416828 425805 463686 459539 464974
18243 464974 460295 409185 425581 450568 497772 582033 704243 772004 778969 819143 835993 920820
18231 920820 1025326 1079406 1177825 1226322 1249246 1358970 1539805 1905644 2480679 3348296
18221 3348296 4241406 4308295 3452727 2948582 2943784 3256922 3836826 4648769 5124973 4623566
18211 4623566 4109705 4032060 4216244 4547796 5121739 6131144 7574509 9238671 10769515
18202 10769515 11743123 12888226 15435821 20088531 28018527 40911618 63887723 106954564
18194 106954564 182240338 301556995 444565723 455518831 287501379 158346875
18188A58346875o2169785l1943880j7867939j0311279o140207m375807m038507
18181B1499471l158367k928448k570837j364392l99465o4251o89443j171970o45114
18172H507184q8135L16599P17824Q95070M31674L53373Q80418J003304R02330
18163A3919641J832173K706148M054053P717741J3899458K6258306M8032646Q0185170
18155A98605336J16444387Q2979366r0115953j37434531p3073624l5339648j9269546
18148D2795787j1105414o750365m363100l061553k004363j966467k648082k170450
18140H725993j313419p86452o05307n78874m47350k08122m5165K07924L47991
18131E297219j17782p43575m64975j0284N48693J079158J015549n24950j493047
$$ plain form
18188 158346875 96177090 64233210 46365271 36053992 29913785 25537978 21499471
18181 21499471 18341104 15412656 12841819 11477427 11077962 11013711 10324268 9152298 8507184
18172 8507184 8419049 8735648 9453472 10348542 10780216 11133589 12014007 13017311 13919641
18163 13919641 15751814 18457962 22512015 30229756 44129214 70387520 118420166 198605336
18155 198605336 315049723 398029089 307913136 170478605 97404981 62065333 42795787
18148 42795787 31690373 24940008 20576908 17515355 15510992 13544525 10896443 8725993
18140 8725993 7412574 6626122 6020815 5441941 4994591 4786469 4741304 4949228 5297219
18131 5297219 5179437 4435862 3970887 3960603 4509296 5588454 6604003 6079053 4586006
18122D586006p93748k74094j16453j9830K14223M17593P88700J268305K089321
18113H160023L562229O754828J2804876K1998102L2907662K7308073k1122911
18106I2372882m0854997k2629174j0659936n593724l264768k045716j385911j093408
18098D845248p96935n68339n24000m02192k34718j45110q5998N7514K59524L99263
18088B804257L13251m10561p85427n13055k57242j72852j28469o2104l2903l696
18078G51199J4881O0426m150m6874l3832o6063m3443l8611n4956o8537l1046l2122
18066D06872l2402j3970J1795P1036O6166Q7034R5961J699k4196p5066l8072J4884
18054E71741l857l7194l7576l9158l5575j6416P458K0996n525p718m834m0652
$$ plain form
18122 4586006 3792258 3518164 3401711 3381881 3596104 4013697 4802397 6070702 8160023
18113 8160023 11722252 18477080 31281956 53280058 86187720 113495793 92372882
18106 92372882 51517885 28888711 18228775 12635051 9370283 7324567 5938656 4845248
18098 4845248 4048313 3479974 2955974 2553782 2319064 2173954 2087956 2145470 2404994 2804257
18088 2804257 3117508 2706947 1921520 1408465 1151223 978371 849902 787798 754895 751199
18078 751199 766080 826506 822356 775482 741650 675587 632144 593533 538577 470040 438994 406872
18066 406872 374470 360500 372295 443331 509497 596531 692492 694191 669995 594929 556857 571741
18054 571741 567884 530690 493114 453956 418381 401965 409423 430419 424894 417176 412342 371690
18042C71690j663Q625l7223m8077K0261n1073p5913j4200j1627J1012K2852K8263
18030B22927J8342M14N6104o006M245K8280N2606P1205J52962J10559J25805K48311
18018A085754M76823P12906P17792k26779r76365o68241l92963j90273m7910m984
18008D85760k4732m5894q8207l1958J1432l6623l2006l891j794J9795K036l1072
17996B22846K5110J8497j6542q457k0180M1896M048m9944l1512N372K2693M9864
17984B63691K2627K6939J71925K30792M03604N38908K75837m84428n83047l67595
17974D99253j60989m5779l1582l3844q4468p713L5557J4517R722l5159n6430M7396
17962A50481K4359K0470J2193j8060k1372k0901j096J8851L2507j9827r137l4535
$$ plain form
18042 371690 370027 378652 341429 293352 313613 262540 186627 172427 160800 171812 194664 222927
18030 222927 241269 241683 297787 291781 296026 324306 376912 448117 601079 711638 837443 1085754
18018 1085754 1562577 2275483 2993275 2766496 1790131 1121890 728927 538654 490744 485760
18008 485760 461028 415134 326927 294969 306401 269778 237772 233881 232087 251882 253918 222846
17996 222846 247956 266453 249911 241454 221274 263170 267218 217274 185762 191134 213827 263691
17984 263691 286318 313257 485182 715974 1119578 1658486 1934323 1449895 866848 499253
17974 499253 338264 292485 260903 227059 142591 134878 170435 184952 194674 159515 103085 150481
17962 150481 174840 195310 207503 189443 168071 147170 146074 164925 197432 177605 168468 133933
17950A33933J2442L1376m2679m9179j4040l0457K1605L0938O310L8972j1511l8654
17938H9056J5800K6420L69k3582k5049q188J2956J4661J73m0378k1279O130K679
17925D9768k1147m0799j51J01147L9530J4303k6774k2309O969j0232j1111M797
17913H3991J4125l780J0361j3618m4550j2417R717L3113N6259l0458l0123o915
17901F5705K5607l7544O709K783l1359N9084j8531l5710j0865l8747K1298K1303
17889B9733M364J8833N5326k7768j3741j1714k0273J8232K0177K1719j6063l0912
17877D7913L6545L7559k2373l9738L2109J0j4926j7368m107n40j4291k5892j6589
17864a688K8540R106j2633J4559o80q921K6384J941r064J8300M0527p401K283
$$ plain form
17950 133933 146375 177751 135072 85893 71853 41396 63001 93939 100249 139221 127710 89056
17938 89056 104856 131276 131645 108063 83014 74826 87782 102443 102616 62238 40959 47089 49768
17925 49768 28621 -12178 -12329 88818 128348 142651 115877 93568 100537 90305 79194 83991
17913 83991 98116 94336 104697 91079 46529 34112 43829 76942 133201 102743 72620 65705
17901 65705 91312 53768 60477 63260 31901 90985 72454 36744 25879 -12868 8430 29733
17889 29733 34097 52930 108256 80488 66747 55033 34760 52992 73169 94888 78825 47913
17877 47913 84458 122017 99644 59906 92015 92025 77099 59731 55624 55084 40793 14901 -1688
17864 -1688 26852 35958 23325 37884 37204 28283 54667 56608 47544 65844 106371 98970 101253
17851A01253o211n069k433j0094m8903l877K5823J4461P55L0628l1349l4442k6210
17838D332o841M0104K7615k9253M1077l588J4823J560m574j7272m0894k6574J4539
17825A5054L617j3034R911j9745N0437L9273K7036M838k422K2464R273r3863k7302
17812B5537J7870j7183j4336J2754J7934K308j5556Q3460O6658o1850o6026J3350
17800F4920N65K2986K5283j7458m1978m9514J0153K3122l5278J3912N387M0098
17788F2198k18j7357j927n27o550J1459L7837K4319l6770n6320j1718l060J6510
17775A7876K6817j9162j0621J4449q334J3515j2279k7244J1946L2296l5759j3856
17763a0356K6889P1072L0241j2581P365l1081l7408N136p493K1515k3599l951
$$ plain form
17851 101253 95042 89973 87540 77446 28543 24666 50489 64950 65705 96333 64984 30542 4332
17838 4332 -2509 37595 65210 35957 77034 73446 88269 89829 85255 67983 27089 515 15054
17825 15054 18671 5637 15548 -4197 46240 85513 112549 117387 114965 137429 146702 52839 25537
17812 25537 43407 26224 11888 24642 42576 44884 29328 112788 179446 117596 51570 64920
17800 64920 65485 88471 113754 96296 54318 4804 14957 38079 2801 16713 22100 62198
17788 62198 61980 44623 42696 42169 35619 47078 84915 109234 72464 16144 4426 1366 17876
17775 17876 44693 25531 14910 29359 21025 34540 22261 -4983 6963 39259 3500 -10356
17763 -10356 16533 87605 117846 105265 112630 81549 44141 49277 41784 63299 39700 35749
17751C5749J1173n5706m3411k119J6112N5963L5261L4501j3940n0928k1082K0453
17739B2026n098J6801Q955M3338J1302o8472q3786j6435j9650K5868N0123L117
17727a1911J8049l0140k2804J4876O5100O6712J0773o5520n7835K3268O0321N918
17715G6807j7266l9563p3293j4008L1153J7151J0323K8563J177J9582p888r3456
17703f0718p908K2802m2419k9644K6719O8440k277k6622m053M4158L652p935j258
17690a7063K3681J2189j3415j0505q282k3313N534K1945N2846l7328l6144M749
17678b5106J91l332L3016K1927k4014P251Q220Q597J3782j213J4856N2839L719
17665A10733n9929k722K755j9087J6731J1206J7560r939n6644k0547J1169K946
$$ plain form
17751 35749 46922 -8784 -52195 -54314 -38202 17761 53022 87523 73583 22655 1573 22026
17739 22026 16928 33729 42684 86022 97324 28852 -54934 -71369 -91019 -65151 -15028 -11911
17727 -11911 6138 -24002 -46806 -31930 33170 99882 110655 45135 -12700 10568 70889 76807
17715 76807 59541 19978 -53315 -67323 -36170 -19019 -8696 19867 21044 40626 32738 -60718
17703 -60718 -68626 -45824 -88243 -117887 -91168 -22728 -25005 -51627 -55680 -11522 -7870 -15805 -17063
17690 -17063 6618 18807 5392 -5113 -13395 -36708 -31174 -9229 43617 6289 -29855 -25106
17678 -25106 -24915 -28247 4769 26696 2682 9933 18153 26750 40532 39319 54175 107014 110733
17665 110733 50804 48082 50837 31750 48481 59687 77247 67308 10664 -9883 1286 4232
17653D232o298k011L047j9252K061n551n506M1947J7966K0110K4320O9j7085n4520
17639C529J1627Q108K8065j1467j9496J6849j9481m8590J7821J8386K3093q319
17627B0125l565k5979k9017j8528J8236M3187L5185j473P995j1863j6455k378
17615A5470k7821p080Q012J5734l628n579j9158K1115J1405k7095r130k5674k090
17602e5519k0293M2282P3427L632k801P684k2244M946J0377R904r463L8223K3271
17589A03426N6881N9844O6964R5867J77993L37747O10424P44101J01816p61218
17579A593845o88015l49736j60538j07961l9525m8495j5760l2031k6789m7419
17569G7576o1678Q246J9833m760k4864K9461L5005J3015L3273J3269m1666o214
$$ plain form
17653 4232 -2066 -4077 -1030 -20282 -18221 -23772 -29278 12669 30635 50745 75065 75134 58049 3529
17639 3529 15156 23264 51329 39862 20366 37215 17734 -30856 -13035 5351 28444 20125
17627 20125 16560 -9419 -38436 -56964 -38728 4459 39644 38171 46166 34303 17848 15470
17615 15470 -12351 -19431 -11419 4315 687 -4892 -24050 -2935 8470 -18625 -27755 -53429 -55519
17602 -55519 -75812 -33530 39897 43529 40728 48412 26168 31114 41491 51395 41932 80155 103426
17589 103426 160307 220151 287115 382982 560975 898722 1509146 2253247 2355063 1593845
17579 1593845 905830 556094 395556 287595 248070 199575 183815 151784 124995 77576
17569 77576 15898 24144 43977 39217 14353 43814 78819 91834 125107 138376 96710 90496
17557I0496J7895j5276K2204J6459J9757K2391J9745M9636O7929J65116K87708
17546G64060M42288O35607M31010m14550p24142m52486k05821j04360r2889p1871
17536B06846n4244n1892R019k9612j2184J7676q121m9339j0656J3153J4107j4712
17524C0041j3736L3176K9723J3001n2253m3408j213J9262L5679J7439l2247j1128
17512B4336J2501l2342J2115J8841m1585K346q514L021k2508K582K3919M3833
17500C8545m49j43k372K697o2827j7023J0567N7020m206j0594l8744m684K3624
17487h589Q971J6947r193R70k974n5894o95M2187k4404J1253j367L7493L1363
17474D6068l7870O78N771j8928j7625R341j2204L808L3430P633k0289O376L8035
$$ plain form
17557 90496 108391 93115 115319 131778 151535 173926 193671 243307 311236 476352 764060
17546 764060 1206348 1841955 2272965 1858415 1134273 681787 475966 371606 278717 206846
17536 206846 152602 100710 109729 80117 67933 85609 77488 28149 17493 30646 44753 30041
17524 30041 16305 49481 79204 92205 39952 -3456 -4669 14593 50272 67711 35464 24336
17512 24336 36837 4495 16610 35451 -6134 -3788 -12302 -9281 -31789 -29207 -5288 38545
17500 38545 38096 37953 35581 38278 -24549 -41572 -31005 26015 21809 11215 -27529 -32213 -8589
17487 -8589 382 17329 8136 9106 6132 -49762 -50457 -8270 -32674 -21421 -22788 14705 46068
17474 46068 8198 8876 14647 -4281 -21906 -12565 -24769 -20961 12469 20102 -187 6189 44224
17461D4224n9386k4414M4368L145N178k7665k90j145J1852j2712k6107L1781n976
17448a7147J0069L0687P654O7613Q1003J85551K20107N929k13715j79913o4423
17437A33415k3230m009l2233l2282J754k6660j1276N217k3572m337r520M5970
17425A9237L3379m38l5542O14L4541O45k5049l029l9098J5113r146m1589j3553
17412f3915J078J2158n858M0701M6441M869j0114l5962j058J3179L1637j3398
17400A9758j5001J470p665J6142k1642O428P450J3687O375m659k2510k7991j7918
17387d6076K2830J2298q648j8811J4625J5679k5045l9727K0781N081K4337k494
17375b5170j9332k2719m6253P064K1433J6328O6705L3645j9000k1391l2166J2092
$$ plain form
17461 44224 -15162 -39576 4792 7937 13115 -14550 -14840 -15985 -4133 -16845 -42952 -11171 -17147
17448 -17147 -7078 23609 31263 98876 179879 365430 585537 591466 377751 197838 133415
17437 133415 110185 106176 73943 41661 43415 16755 5479 10696 -12876 -17213 -26733 19237
17425 19237 52616 52178 16636 17250 51791 52436 27387 24358 -14740 373 -8773 -50362 -63915
17412 -63915 -62837 -50679 -56537 -15836 30605 35474 25360 -10602 -11660 1519 33156 19758
17400 19758 4757 6227 -1438 14704 -6938 -510 6940 20627 27002 22343 -167 -28158 -46076
17387 -46076 -23246 -10948 -19596 -38407 -23782 -8103 -33148 -72875 -52094 -47013 -22676 -25170
17375 -25170 -44502 -67221 -113474 -106410 -84977 -68649 -1944 31701 12701 -8690 -40856 -28764
17363b8764J34k202J4298J2949k3632M9375J4746o9508m0709J202L0297j2828
17351e4642j3807P2801J9836m1513J1814O5114k3858l3000k1085l881j4839j0913
17339d7973m894J0349q768q771J9384K2360J5867L1263k1087k105k0742k21J354
17326a3984K0011N879R222J9275k6930k928k3161n111J856J1795K4354J5017j0508
17313B4787l0178j3432o552k5793o900R858K920R678j595j1680L259L7973j2261
17300a9916J3337j0982k0767k2144k6787p487L7576K8920Q8557k11j9138K7035
17288F7993k9926o3934P805P882m8604K4280R9391J97k0124l3576j9238j8768
17276b6622j7120n27R799J437J0539k5285l0005L6680M5020K3895J1843j5130
$$ plain form
17363 -28764 -28630 -30832 -16534 -3585 -27217 22158 36904 -32604 -73313 -72111 -41814 -54642
17351 -54642 -68449 4352 24188 -17325 -5511 59603 35745 2745 -18340 -22221 -37060 -47973
17339 -47973 -52867 -42518 -51286 -60057 -40673 -18313 -2446 28817 7730 5625 -15117 -15338 -13984
17326 -13984 6027 11906 21128 40403 13473 10545 -12616 -17727 -15871 -4076 20278 35295 24787
17313 24787 -5391 -18823 -25375 -51168 -58068 -48210 -45290 -35612 -37207 -48887 -45628 -7655 -19916
17300 -19916 -6579 -17561 -38328 -60472 -87259 -94746 -57170 -28250 60307 60096 40958 67993
17288 67993 38067 -25867 -18062 -10180 -58784 -34504 64887 65084 44960 11384 -7854 -26622
17276 -26622 -43742 -44269 -34470 -33033 -22494 -47779 -77784 -41104 3916 27811 39654 24524
17264B4524N531j6456k840l6269l0154K8070J7104O434j7284k807J0702R585k5203
17251b9063k8328K8315J9229J8984L3207J7785p70J965k9094j1645j8715k9208
17239b7338p292J1061m631L7103N416j7371k4379O180K1130j5604k017j6127K4314
17226i555j4767m1913j8456K9567l211K356k0058L0111N9273M60n2417m5092M4715
17213c8987M9045J5817k9367k1329p243J4450p939j9943K5328l289k046j385k3171
17200e0059n566K1547K4068J1750n4897m7226J1996J6993j5042J8918M6665j5911
17188c6764P272L7216m1599o684L1078K7559p876j2182L4751N4859l9330l6045
17176A2255j6713K7887J5058o0835k7417r292J4446k1099J3081M0958k7532l7726
$$ plain form
17264 24524 30055 13599 10759 -25510 -55664 -27594 -10490 -4056 -21340 -24147 -13445 -3860 -29063
17251 -29063 -57391 -29076 -9847 9137 42344 60129 59359 61324 32230 20585 1870 -27338
17239 -27338 -34630 -23569 -28200 8903 14319 -3052 -27431 -21251 -121 -15725 -17742 -33869 -9555
17226 -9555 -24322 -66235 -84691 -55124 -58335 -55979 -76037 -45926 13347 13807 -38610 -83702 -38987
17213 -38987 10058 25875 -3492 -24821 -32064 -17614 -25553 -45496 -20168 -23457 -25503 -26888 -50059
17200 -50059 -55625 -34078 -10010 1740 -53157 -100383 -88387 -71394 -86436 -67518 -20853 -36764
17188 -36764 -29492 7724 -33875 -40559 -9481 18078 10202 -1980 32771 87630 48300 12255
17176 12255 -4458 23429 38487 -22348 -49765 -59057 -44611 -65710 -52629 -11671 -39203 -76929
17164g6929N7741M0737J6726m441k6246m731L9427L4036l0532l914k9575k5137
17152a2838Q164n261q046J8112J1000J0701l0666n0941j1802j0684K5854O6760
17140A0353k2694j3335l2334K0803M1242K3155j3678k6973P966l7401n5020J0931
17128h6985O4494M5497J3028k8419p467l0656j4199L215P5116L4527K6990j7936
17116G7205l5080n426l7996n8051K2508K1584K8074m21m938M6041J5452j0824
17104E8128N553l6925j3470j3461j7792k0283K1019k9801k6030l021Q936L8366
17092b8781L3624M514n5564J9506L6086J937q224r428l5189L1M6083m9538p299
17079e2242K3960L6937J0924j3971n763j5255m1678K6638N362n662j0770o830
$$ plain form
17164 -76929 -19188 21549 38275 33834 7588 2857 42284 76320 45788 41874 12299 -12838
17152 -12838 -4674 -9935 -17981 131 11131 21832 -8834 -59775 -71577 -82261 -56407 10353
17140 10353 -12341 -25676 -58010 -37207 4035 27190 13512 -13461 -5495 -42896 -97916 -86985
17128 -86985 -22491 23006 36034 7615 148 -30508 -44707 -41492 33624 68151 95141 77205
17116 77205 42125 36699 -1297 -59348 -36840 -15256 12818 12397 7459 53500 68952 58128
17104 58128 63681 26756 13286 -175 -17967 -38250 -17231 -47032 -73062 -76083 -67147 -28781
17092 -28781 4843 9357 -46207 -26701 9385 11322 3098 -6330 -41519 -41488 4595 -44943 -52242
17079 -52242 -28282 8655 19579 5608 -155 -15410 -57088 -30450 -25088 -30750 -41520 -48350
17067d8350M466J1170L734J940n859r673M2553n590j5822P104J8680K5940k4197
17054F096k4022j8781j9241L0076K7834M5994m1853j1864k487m019o690k7006
17042d5963L5593J871K8489L3280J0185j0425O5595J7767n8123n2309l9773n519
17030a9332Q187k863L8070j8070m0769q946L2765N3365p973K369l766q155n591
17017A9291k0164p098q938K4537J1645l6516k4577j0001M8181J3828l368J0031
17005A6851R917o445M667q631j3043J321N390j0337k6278j3020N8003k871J388
16992A6912j5356l1311J1578q899J521L9208P893j238J1433n675k9961k2923l405
16979c0223k104P488L8028m849j5053P773K6804k1494k126j7899j8083J7228j4286
$$ plain form
17067 -48350 -43884 -32714 -28980 -27040 -32899 -42572 -19 -5609 -21431 -14327 4353 30293 6096
17054 6096 -17926 -36707 -55948 -25872 1962 47956 6103 -5761 -8248 -12267 -18957 -45963
17042 -45963 -10370 -8499 19990 53270 63455 53030 118625 136392 78269 25960 -13813 -19332
17030 -19332 -11145 -14008 24062 5992 -34777 -43723 -10958 42407 34434 36803 33037 24882 19291
17017 19291 -873 -7971 -16909 7628 19273 -17243 -41820 -51821 -3640 10188 6820 16851
17005 16851 26768 20323 24990 16359 3316 4637 10027 -310 -26588 -39608 18395 15524 16912
16992 16912 1556 -29755 -18177 -27076 -25555 13653 21546 20308 31741 26066 -3895 -26818 -30223
16979 -30223 -32327 -24839 13189 8340 -6713 1060 27864 6370 4244 -13655 -31738 -14510 -28796
16966b8796l1506q776r209L1276o60j7934j0178J7436N3263L812K0616j0377J141
16953A0108l2673j3782L5869Q525j0854M3626j396k7135l0155J0102K7930M2201
16941F2366j0289p193q984l8626k0334k7622l0495K0120J0869M186K3223l7195
16929e9974R017L9174J5612K6096j0700l662K5751J916K3797J1811J7282k8052
16917F8068k0000l3958k9541r982L0873L2112K7049P427l2843j9523O1359J5282
16905I6323l5457k5341k9900K2337K6124k0032J3527j540j52j6401n8964P619
16893b1857j618j8287J5912R65j6788j0111K2381j7787K7532j8268n928K1388
16881b2466L5058N634o016k3183j1070j3396P499R622o559L6862j1828K0491K1590
$$ plain form
16966 -28796 -60302 -69078 -78287 -47011 -47671 -65605 -75783 -58347 -5084 -1272 19344 8967 10108
16953 10108 -22565 -36347 -478 8047 -2807 40819 39423 12288 -17867 -7765 20165 62366
16941 62366 52077 44884 35900 -2726 -23060 -50682 -81177 -61057 -50188 -46002 -22779 -59974
16929 -59974 -50957 -11783 3829 29925 19225 15563 41314 43230 67027 78838 96120 68068
16917 68068 48068 14110 -15431 -25413 5460 37572 64621 72048 39205 19682 81041 96323
16905 96323 60866 35525 5625 27962 54086 34054 47581 46041 45889 29488 -29476 -21857
16893 -21857 -23475 -41762 -25850 -24885 -41673 -51784 -29403 -47190 -19658 -37926 -43854 -22466
16881 -22466 12592 18226 12210 -10973 -22043 -35439 -27940 -18318 -24877 11985 157 20648 42238
16868D2238R102k2890l5638l5582L6791j7513k080J7946j7031j0835k0690j555
16856e7737M0758Q950L619J0175q575N0218K0170j1102p512q408k4539k3098J4684
16843G603m784j5908j8009q367J2138M4842Q950O263o040j8618p011j1051l276
16830a3268j5532M6232N580O104J7850K1947O9156k2978k8904n4011m1765n1068
16818f0657m2720L8295N0451R516k5845K823O922P460J4880Q811j4162k0056p336
16805c1618Q869K2941K3102J3929k4094l765p1692l4224N1455M717j5557J0465
16793d5472M2810J7586N2587j4313l7200P939R577r97j7368K6544J6128K4994
16781H2815Q03J211l4111l6984J1778J5863m1384K789j05l0405J9703M9537l8654
$$ plain form
16868 42238 51340 28450 -7188 -42770 -5979 -23492 -25572 -7626 -24657 -35492 -56182 -57737
16856 -57737 -16979 -8029 -4410 5765 -2810 47408 67578 56476 48964 40556 16017 -7081 7603
16843 7603 2819 -13089 -31098 -39465 -27327 17515 26465 32728 26688 8070 1059 -9992 -13268
16830 -13268 -28800 17432 23012 29116 46966 68913 138069 115091 86187 32176 -9589 -60657
16818 -60657 -103377 -65082 -14631 -5115 -30960 -28137 -21215 -13755 1125 9936 -4226 -24282 -31618
16805 -31618 -22749 192 23294 37223 13129 9364 -62328 -96552 -45097 -40380 -55937 -45472
16793 -45472 -2662 14924 67511 53198 15998 23937 33514 32517 15149 41693 57821 82815
16781 82815 83618 84829 50718 13734 25512 41375 -9 2780 2675 -27730 -8027 41510 2856
16768B856j8650J4816L8485J3154k1496p1272K1016J561m288M3723j6412K985
16756F478J2180L2987J6823r635k3632l315k758r976l5661p847L090k378M695
16743a8949J1008K1765O757N628Q363J7257r483k2532k3422l0071J5132M7379
16731B8832j3032L7002L9189K4026m8728o8112l5774k0593L8922J4994K5477J9128
16719D1331M5149j5261k4831j9307j2173m03k8345l4881l104J3220J9060L2836
16707A3291Q386l51J6852R100l537k4536j9270R645M270J2715j0951o961j0073
16694a420L7073R742k1912L4930J2012K1581l5323J1460J7521j3018l7677j9394
16682A5575j8913l4836l229j056J7225j1782N221O909j2926k7682L7333K8905
$$ plain form
16768 2856 -15794 -978 37507 50661 29165 -42107 -21091 -19530 -23818 19905 3493 6478
16756 6478 18658 51645 68468 58833 35201 31886 29128 19152 -16509 -24356 -21266 -23644 -18949
16743 -18949 -7941 13824 20581 26209 34572 51829 42346 19814 -3608 -33679 -18547 28832
16731 28832 15800 52802 91991 116017 67289 -823 -36597 -57190 -18268 -3274 22203 41331
16719 41331 86480 71219 46388 27081 14908 14505 -13840 -48721 -51825 -38605 -19545 13291
16707 13291 21677 21326 38178 47278 43741 19205 -65 9580 13850 26565 15614 8653 -1420
16694 -1420 35653 45395 23483 58413 70425 92006 56683 68143 85664 72646 34969 15575
16682 15575 -3338 -38174 -41403 -42459 -25234 -37016 -31795 -24886 -37812 -65494 -28161 744
16670G44p192L094J2087O265l555L2800m4838J4820Q042k0621Q643k1180n3763
16657f4654J1286K1023K780J2430k3665o788o723n783K524L3852J0960q367Q447
16644a2678J7611l4779l7193R0623M5415m1102j1476l9559k5810K5431K2513J1606
16632A0602r356K5285K7614p877m1265k1155J3469M905j0187J887K9136O839l5891
16619e994l3489k1697O690M116k6432M2319M4263k3167J4090j0558p5117R11J4384
16606f9681J3555N6930k0076k0110k875K023j7794k3311J4974R0885M6891m3394
16594B8017k4485l4246L5888R672l2035J3237j0418n6346L5893K4232r104K1907
16582B212J4891l4651k1207J2628M428K5313j7836j2210k0170j3579K5986K8658
$$ plain form
16670 744 -6448 -3354 8733 14998 11443 44243 -595 14225 22267 1646 10289 -10891 -64654
16657 -64654 -53368 -32345 -29565 -17135 -40800 -47588 -54311 -60094 -57570 -23718 -12758 -21125 -12678
16644 -12678 4933 -29846 -67039 23584 68999 27897 16421 -23138 -48948 -23517 -1004 10602
16632 10602 1246 26531 54145 46268 5003 -16152 -2683 2222 -7965 -6078 23058 29897 -5994
16619 -5994 -39483 -61180 -54490 -50374 -76806 -34487 9776 -13391 699 -9859 -84976 -84065 -69681
16606 -69681 -56126 804 -19272 -39382 -42257 -40234 -58028 -81339 -66365 24520 71411 28017
16594 28017 3532 -30714 5174 14846 -17189 -3952 -14370 -70716 -34823 -10591 -19695 2212
16582 2212 17103 -17548 -38755 -26127 -21699 3614 -14222 -26432 -46602 -60181 -34195 -5537
16570e537L6892K4284k296N015J791n7120o2144j9282N754K6634j0751L8194O200
16557a2366P649L7117l306j0825l5082o4269j1525L2340j722J2472N0129J7567
16545A8179l477k800l7013m0753J3486K1542M338N419R259P471Q967j6548J3459
16532A529J3802M4295m1168q0289l0805J9565r022j1334N326N7545L4041k8177
16520b4692K647M4740J4759j1688j724l849M3320M102l3116l6099k3894L891K2104
16507E01J254l5642j4717q378o457N269K6513J0758K2148l9368j1935L5269L4727
16494A9942K9803M0061J3566K7k9912r293M390l4273m2901K0842o968p641j1342
16481a3699J8306K5111p157K5178k787J5548J1654r958J1588q474J8232l2326
$$ plain form
16570 -5537 31355 55639 53343 58358 60149 3029 -59115 -78397 -72643 -46009 -56760 -18566 -12366
16557 -12366 -4717 32400 29094 18269 -16813 -81082 -92607 -60267 -61989 -49517 612 18179
16545 18179 14702 11902 -25111 -65864 -52378 -30836 -26498 -21079 -11820 -4349 4618 -11930 1529
16532 1529 15331 59626 18458 -61831 -92636 -73071 -82093 -93427 -88101 -30556 3485 -24692
16520 -24692 -22045 22695 37454 25766 24042 20193 63513 67615 34499 -1600 -25494 -21603 501
16507 501 1755 -33887 -48604 -56982 -63439 -58170 -31657 -20899 1249 -38119 -50054 -14785 19942
16494 19942 49745 89806 103372 103399 73487 64194 68584 34311 -8590 12252 5284 -2357 -13699
16481 -13699 4607 29718 22561 47739 44952 60500 72154 62196 73784 65310 83542 51216
16469E1216j2612n6696m8522J2242q915k9466Q372J7679m191K1828P975J2044
16457b9046j233k2735j9108K8557N3875K7625l1839k4517k6569O805J0654j2109
16445c9640J1172K7198O2737n782j4773K6778P188O24k2349k299J0508P690j9435
16432D9617k9078j4849K3106J3182J641J176P585P277k4086k6787k3779p340N8574
16419C6239J9808m9895L1342J4717l4704J8406j1444m5998k5894j6228K4706J467
16407c7478j1233K6439J8953M5522N353K0757l410m2138j4307j6538k5599K1673
16395a2006L957Q22n408l745P57K042j1563j3434l4932j1482L0518O8889J9444
16382C3859m1521l854P499j9584j6493K0465R196n583J8696l4828q985L4449p064
$$ plain form
16469 51216 38604 -18092 -66614 -54372 -63287 -92753 -84381 -66702 -70893 -49065 -41090 -29046
16457 -29046 -30279 -53014 -72122 -43565 10310 37935 6096 -18421 -44990 -38185 -27531 -39640
16445 -39640 -28468 -1270 61467 55685 40912 67690 74878 75502 53153 50854 61362 69052 49617
16432 49617 20539 5690 28796 41978 43619 44795 52380 59657 35571 8784 -14995 -22335 36239
16419 36239 56047 6152 37494 52211 17507 35913 24469 -21529 -47423 -63651 -38945 -37478
16407 -37478 -48711 -22272 -3319 42203 47556 68313 64903 22765 8458 -8080 -33679 -12006
16395 -12006 -8049 -7227 -12635 -16380 -15623 -13581 -25144 -38578 -73510 -84992 -54474 14415 33859
16382 33859 -7662 -11516 -4017 -23601 -40094 -19629 -10433 -16016 2680 -32148 -41133 -6684 -13748
16369a3748j7849o30l2494Q544M7889K2759l375o34l1523j0412N710K987j4419
16356c7195n183K6144Q403K5863l794l8682j1095J2840L1165J1335K4304l5222
16344H883k9714K182n2433r339K7915K5646j3951l7955K0235L6045K5082K5607
16332B8203k4526J2180L1681J834j0439k0796k286m9031j7164J8446J7991j33
16320a4040k034K0451O2173J173n8363l0943K0081k7396N896J0636L2796K0251
16308D0681j6407J9543L943k165n5539k3383K1868L5769P667m3584J8600K2904
16296B9897j4783k9340J7363M6252q849j0998J2500L3563n1967n7543K0161L3980
16284B0236j0714l8714K4186N3079M1599o1409p573r522m125J425l0456l3882
$$ plain form
16369 -13748 -31597 -32227 -64721 -56177 -8288 14471 11096 10462 -21061 -31473 -25763 -22776 -37195
16356 -37195 -42378 -16234 -7831 18032 14238 -24444 -35539 -22699 8466 19801 44105 8883
16344 8883 -20831 -18649 -71082 -80421 -52506 -26860 -40811 -78766 -58531 -22486 2596 28203
16332 28203 3677 15857 47538 49372 38933 18137 15851 -33180 -50344 -31898 -13907 -14040
16320 -14040 -16074 4377 66550 67723 9360 -21583 -1502 -28898 -23002 -12366 20430 40681
16308 40681 24274 43817 47760 45595 -9944 -33327 -11459 24310 31977 -11607 6993 29897
16296 29897 15114 -14226 3137 49389 40540 29542 42042 75605 23638 -33905 -13744 20236
16284 20236 9522 -29192 -5006 48073 89672 28263 20690 11168 7043 8468 -21988 -55870
16272e5870O912J7632J5371R69K9934J5773j8667l195L938k2881j5743p188M1438
16259H423L7610l826l2849j8035M56J4907l7299J1793J867K9693l7225p412p946
16246c9843l010N1544K5891k74k3370K7966L9135j623k2240m0462l0490o369J6450
16233f695R440o227K6138K4794n5971o481k2690l788L5374M224J8638K2433M4019
16220H3208j6693j9656K2867J8649p841p1869Q767L9609L6509L8277m3537o2838
16208B5452l8164j9573P67N60J2713L1448N3060k6621m7083l316P021j591L747
16195a580Q116j1931j9921p838J0566O894L757j7100J7550K490n449l485K1412
16182C481O982k0645n5798n36J3318P971L7259J8042j7726p397Q897l569l0787
$$ plain form
16272 -55870 -48958 -31326 -15955 -14986 14948 30721 12054 8859 12797 -10084 -25827 -33015 8423
16259 8423 46033 42207 9358 -8677 -8221 6686 -30613 -18820 -16953 12740 -24485 -31897 -39843
16246 -39843 -42853 8691 34582 34308 10938 38904 78039 76416 54176 13714 -16776 -23145 -6695
16233 -6695 2745 -3482 22656 47450 -8521 -15002 -37692 -41480 -6106 -1882 16756 39189 83208
16220 83208 66515 46859 69726 88375 80534 8665 17432 57041 93550 131827 88290 25452
16208 25452 -12712 -32285 -31518 -30958 -18245 13203 66263 39642 -7441 -10757 -3736 -5327 -1580
16195 -1580 6536 -5395 -25316 -33154 -22588 -15694 -11937 -29037 -11487 -8997 -14446 -17931 3481
16182 3481 10463 -10182 -65980 -66516 -53198 -45227 -7968 10074 -7652 -15049 -6152 -9721 -40508
16169d0508j4938K1249j8359j5787Q236J2893K820o255J1384J3199K4174j9801
16157b1693N130O611J1903m976j4364K4075P127j4313J0871j2566l3705k0024
16145e5924j0218J5681M1215K4718k590M9l1805l3359L5727N2850P582j4520j0062
16132A9344K414j2190l8937o7245J4979K9834O0895j5685k1005J9500J1547j1365
16120g914K6129J2110J3000l645J5700L18M5131Q094l0931k3145j3735k9552j491
16107A0069o1909N5255M4411M649J3540k6685l0746J3088k0103k9728K2578p484
16095a3065J1512K4951P446m6631j907k816j0250J0491j865J8734K504n420M5109
16082C8793J8756k5499m7136L714m0979K2884l500j1827j510K750K1017j6985
$$ plain form
16169 -40508 -55446 -34197 -52556 -68343 -60107 -47214 -44394 -50649 -39265 -26066 -1892 -21693
16157 -21693 -16563 -9952 1951 -3025 -17389 6686 13813 -500 10371 -2195 -35900 -55924
16145 -55924 -66142 -50461 -9246 15472 12882 12931 -18874 -52233 -16506 36344 43926 29406 19344
16132 19344 21758 9568 -29369 -96614 -81635 -51801 9094 -6591 -27596 -8096 3451 -7914
16120 -7914 18215 30325 43325 39680 55380 55698 100829 108923 77992 54847 41112 11560 10069
16107 10069 -51840 3415 47826 52475 66015 39330 8584 21672 1569 -28159 -5581 -13065
16095 -13065 -1553 23398 30844 -15787 -17694 -20510 -30760 -20269 -22134 -3400 -896 -6316 38793
16082 38793 57549 32050 -15086 -11372 -52351 -29467 -32967 -44794 -46304 -43554 -22537 -39522
16070c9522j7135k5491J4768J9587j2328k4503j3630R8057P5037j1802n8822j4836
16058a0620K8859L0839l8177j9047j1831M656n2466L2414O2997O301r522j6451
16046G952K1693j5127j1021K3040R407M118j5022j7443l8828j4087j3162K2497
16034c5983J7692l7731R902K2484Q797J1996k4783J1153r527j5406J52N039J0642
16021b5573Q45L0851K7961j9163l5817n9074j9912J8680J3576j2814j2538l71
16009i3349j2625L1429P8535L2988l3297k9781K4801P659j1953J3908j6987n5621
15997f4293k794L8701M5268M9379k0850m8887K6853O4256q429l5242M079j7099
15985C0942k9236j4523L3252j8641P163M0100L0857J5435o5433m0933k6157L1580
$$ plain form
16070 -39522 -56657 -82148 -67380 -47793 -60121 -84624 -98254 -197 74840 63038 4216 -10620
16058 -10620 18239 49078 10901 -8146 -19977 -15321 -67787 -35373 27624 33925 24403 7952
16046 7952 29645 14518 3497 26537 35944 40062 25040 7597 -31231 -45318 -58480 -35983
16034 -35983 -18291 -56022 -46120 -23636 -14839 -2843 -27626 -16473 -26000 -41406 -41254 -36215 -25573
16021 -25573 -24728 6123 34084 14921 -20896 -79970 -99882 -81202 -67626 -80440 -92978 -93349
16009 -93349 -105974 -74545 3990 36978 3681 -26100 -1299 6360 -5593 8315 -8672 -64293
15997 -64293 -67087 -28386 16882 66261 45411 -3476 23377 87633 79204 43962 48041 30942
15985 30942 1706 -12817 20435 1794 8957 49057 79914 95349 29916 -11017 -37174 -5594
15973e594L7945J5915k1987j9998O92j8846o0722k3484L8358m138k8245N8859
15961c1245J0235J5679j9917k816J3395n373R707M454K7257L6354J3109J3875
15949H4714l5052k6130K3233j4934r246J0300k70l0185R965O288J2807O8387j6650
15936H3227j2837j5217k2406m958k9140k4842o027j1110K8722L90n3952m689O5086
15923g753K534l5149Q29N8998r86j961l3276q954M1074k527k2581Q642j5372l093
15909a9575L237k0204j279K5504n378k1797l003J2802j0885J2581J5046R397K8050
15896B4496j6063k6380J3607J2734P662r229q740j3832j1292J3129l212j8450
15884c5570m996Q8236J8961o8440m751L709K2671L6158m6744k8277O866K8479
$$ plain form
15973 -5594 32351 48266 26279 6281 6973 -11873 -72595 -96079 -57721 -61859 -90104 -31245
15961 -31245 -21010 -5331 -25248 -28064 -14669 -20042 -10335 -5881 21376 57730 70839 84714
15949 84714 49662 23532 46765 31831 22585 32885 32615 2430 12395 18683 31490 99877 83227
15936 83227 70390 55173 32767 27809 -1331 -26173 -32200 -43310 -14588 -14198 -68150 -72839 -7753
15923 -7753 -5219 -40368 -39539 19459 18473 16512 -16764 -25718 15356 12829 -9752 -1110 -16482 -19575
15909 -19575 -16338 -36542 -37821 -12317 -17695 -39492 -42495 -29693 -40578 -27997 -12951 -3554 24496
15896 24496 8433 -17947 -4340 8394 16056 6827 -1913 -15745 -27037 -13908 -17120 -35570
15884 -35570 -40566 47670 66631 -1809 -6560 -2851 19820 55978 9234 -19043 -12177 16302
15872A6302J8616k461q564j79P532K5367K8781l9185o5472K0388j4381m0675j5435
15859f9366J4154L9750k1648N436K1886l711L4847o1689l9834J3329Q76L4754
15847c1216J5505R422l2457j2726j0562k4292Q439K9820j9497k6549J5302N6324
15835b2487J7847n986j0764m382L5676M615k2233k8544J3774j8615k831J282M6268
15822C620O8593J29L3227M509o0529k7174l5162o1253l7076R984K4806L0921k144
15809d7549K3202N2442j3092l1955R090L8453N5377k0315j8653J8630k0295k4337
15797B0998k1685k7784o303k456L3718N5568L8368l5076o4805k4372L9547k2158
15785a6440J4888J0500j5427J9505J2208L4923R007M956j184k6340k83j7259k0030
$$ plain form
15872 16302 34918 32457 23893 23714 31246 56613 85394 46209 -19263 1125 -13256 -53931 -69366
15859 -69366 -55212 -15462 -37110 -31674 -9788 -13499 21348 -40341 -80175 -66846 -65970 -31216
15847 -31216 -15711 -6289 -38746 -51472 -62034 -86326 -77887 -48067 -67564 -94113 -78811 -22487
15835 -22487 -4640 -10626 -21390 -25772 9904 14519 -7714 -36258 -22484 -41099 -43930 -42648 3620
15822 3620 72213 72342 105569 110078 49549 22375 -12787 -74040 -111116 -101132 -76326 -45405 -47549
15809 -47549 -24347 28095 15003 -16952 -7862 30591 85968 65653 47000 65630 45335 20998
15797 20998 -687 -28471 -34774 -37230 -3512 52056 90424 55348 -9457 -33829 5718 -16440
15785 -16440 -1552 8948 -6479 13026 25234 60157 69164 74120 72936 46596 46313 29054 9024
15772I024k1999j471K2676Q374j625n829k3461l9372j1115j7525j3196K5261L4339
15759c5919K6269j6339R725L0028k4287Q851K2806l6648m8708p3M1285L8195j0314
15746D871l8091l593J8906p325J8566n3239k9943K2196K1479p90J9317j6347J68
15733d3825M2304K1851k9127J4190M166j8158L725k1538J8515J6953p684k7677
15721b6305l2546l4131n171P3723M0742M240j2736k8860l0882O610K5318K3022
15709C024K3520m9546k8330j9397K6453k0065m146M0366N5423K3780m780J8296
15697F4598k4762k2338k318R459q782j354K0222M2066m5588j5566Q192j1838N616
15684A7607P485K9562j977k2054J7417q451N307j9866o312k726m6849J7092J8037
$$ plain form
15772 9024 -12975 -14446 8230 16604 14979 9150 -14311 -53683 -64798 -82323 -95519 -70258 -35919
15759 -35919 -9650 -25989 -16264 13764 -10523 -1672 21134 -15514 -64222 -64295 -23010 15185 4871
15746 4871 -33220 -36813 -17907 -25232 -6666 -59905 -89848 -67652 -46173 -46963 -27646 -43993 -43825
15733 -43825 -1521 20330 -8797 5393 9559 -8599 -4874 -26412 -7897 9056 1372 -26305
15721 -26305 -58851 -92982 -98153 -24430 16312 20552 7816 -21044 -51926 -45316 -19998 3024
15709 3024 26544 -23002 -51332 -70729 -44276 -64341 -68487 -28121 27302 51082 46302 64598
15697 64598 39836 17498 15180 24639 15857 14503 34725 76791 31203 15637 23829 11991 17607
15684 17607 25092 54654 52677 30623 48040 39589 44896 25030 18718 15992 -30857 -13765 4272
15671D272j2933J2851P149P765J6145n865J9751m2846j2320J357J7939q254J0443
15658A5454J4311M1925j7211m6933L0235M4887L048n1606o0657N690L9465L0771
15646D9379O009J600l2974l499j250l4483K3518J9031L6508j2724l0319k0006
15634G90P991k0270j0682j56K1129J4082k4816k2326p44M927q45k447J1285j1073
15620c3155l95J3976K8083p992K3090L2881K2093N228q2597n731K1067j1280j5647
15607a0379J1072K2783N58j3249j3139L3403K9000l8873l5020L6705K4538k9344
15595A8055l1232m7127L8622r079k5536O2307K497q935k3882j7665M0911M6236
15583D5172q35J0008r847r845l1317l590m241L1694J0666J9564k7225L689J7379
$$ plain form
15671 4272 -8661 4190 11339 19104 35249 29384 49135 6289 -6031 -4674 13265 5011 15454
15658 15454 29765 71690 54479 7546 37781 82668 85716 34110 -26547 -20857 18608 49379
15646 49379 55388 56988 24014 20515 19265 -15218 8300 27331 63839 51115 20796 790
15634 790 8781 -11489 -22171 -22327 -1198 12884 -11932 -34258 -35002 -30075 -30920 -33367 -22082 -33155
15620 -33155 -33550 -19574 8509 517 23607 56488 78581 83809 1212 -4519 16548 5268 -10379
15607 -10379 693 23476 24034 10785 -2354 31049 60049 21176 -13844 22861 47399 18055
15595 18055 -13177 -60304 -21682 -30761 -56297 6010 8507 -428 -24310 -41975 -1064 45172
15583 45172 44337 54345 44498 34653 3336 -254 -4495 27199 37865 57429 30204 33893 51272
15570E1272q688J6926K5460j3673k8380K172J2791q763o7922k6113K1080O238
15558a7600R906k2595j4031K2671M0996L8061j9576k7790J7910l5098Q088K6257
15546B7199k5866j456N0812L7495n6648m0725k6257k276K7438M0138L4922K63
15534F5039n575l0625l993k002K1533p321k2474M951l739Q771K7902L1179P144
15521I0790o2524p2474Q393L5004J7724l6394j1516J737K2598K1187j0955r773
15509f203k7930L692L8664J6714k9752r795O642m154J3574j41K1088J5678m798
15496C3279o777k9152N969J4646j4805J4925P75r874Q12N909p910k4450q268M1524
15482A6603K2387j9111j4861j4636m712j7106J2969l2414l0370q833J1316L3325
$$ plain form
15570 51272 42584 59510 84970 71297 42917 45089 57880 49117 -18805 -44918 -23838 -17600
15558 -17600 -7694 -30289 -44320 -21649 19347 57408 37832 10042 27952 -7146 942 27199
15546 27199 1333 -123 50689 88184 31536 -9189 -35446 -37722 -10284 29854 64776 65039
15534 65039 59464 28839 24846 22844 44377 37056 14582 19533 15794 24565 52467 83646 90790
15521 90790 28266 -44208 -35815 -811 16913 -19481 -30997 -29260 -6662 14525 3570 -6203
15509 -6203 -34133 -30441 8223 24937 -4815 -14610 -7968 -12122 1452 1311 22399 38077 33279
15496 33279 26502 -2650 3319 17965 3160 18085 18860 8986 9798 15707 7797 -16653 -24921 16603
15482 16603 38990 19879 5018 -9618 -14330 -31436 -18467 -50881 -81251 -90084 -78768 -45443
15470d5443N9379j3614N115O183m914j7526J3010M0476k1261j8546L733R755K4202
15457D0549j1880l0264K8003N1972J2339l844j0781j5587l4958k0100n601K6172
15445B6020J3749m0872l308L1083J9244j5016m5767o530J503k1610N025K6666
15433i813K6562j2495m1155k0444J0165K6671J2430K7037P820m672N7790M6093
15421A25989m006m4743n3230k9714j0557l415J1330M5252k130m3204j9776L0821
15409B617l618k8094k8839j4090M1038L9178K4977p265o4624j1258J7051L1232
15397a695K0671K2408j9824l0347L060L9369J0263P853J9220J0676k0463k7797
15385C3394Q22l9980n5962J2350M1689L8723k2748n6962j8085M0299M5144J5712
$$ plain form
15470 -45443 13936 322 5437 11620 6706 -10820 2190 42666 21405 2859 6592 16347 40549
15457 40549 28669 -1595 26408 78380 90719 86875 76094 60507 25549 5449 -152 26020
15445 26020 39769 -1103 -4411 26672 45916 30900 -14867 -21397 -19894 -41504 -36479 -9813
15433 -9813 16749 4254 -36901 -57345 -47180 -20509 -8079 18958 26778 22106 79896 125989
15421 125989 121983 77240 24010 -5704 -16261 -19676 -8346 36906 34776 -8428 -28204 2617
15409 2617 -1001 -29095 -57934 -72024 -30986 8192 33169 25904 -38720 -49978 -32927 -1695
15397 -1695 18976 41384 21560 -8787 -5727 33642 43905 51758 70978 81654 61191 33394
15385 33394 34216 -5764 -61726 -49376 -7687 31036 8288 -48674 -66759 -26460 18684 34396
15373C4396j1092J0021J262K6031p908k6585j5880J6160j4353m2628j4525m929
15361e0030P015j1512J2819K0072J0298j7485j37L5154K8323K5767K0122j0459
15349F9947l1413q481k1764m0413Q759J9886J7430N592r860j9764R696J4186j9615
15336e814M795L1052j7997m2558R150J2711j9008q930L0839L9557j941K0245J3956
15323F6057j4923m3260j9542l9649J3294J6268J7357K8835k067l973j4633m3447
15311c9683k3876N4121M4169M2467J9852j4175n4027j1418l0126K1253K5716l9826
15299e553l7606o084K641k725P924L8198J8132l454K2892J3649J993l9920m0584
15286c0497K7890L0318K7138J0579l394j3835J6357K3302L9967l5734m3830J9247
$$ plain form
15373 34396 23304 33325 34587 60618 52710 26125 10245 26405 12052 -30576 -45101 -50030
15361 -50030 -43015 -54527 -41708 -21636 -11338 -28823 -28960 6194 34517 60284 80406 69947
15349 69947 38534 30053 8289 -32124 -23365 -3479 13951 19543 9683 -10081 -385 13801 -5814
15336 -5814 -1019 30033 12036 -30522 -21372 -8661 -27669 -36599 -5760 33797 31856 52101 66057
15323 66057 51134 7874 -11668 -51317 -38023 -21755 -4398 24437 22370 18397 3764 -39683
15311 -39683 -63559 -9438 34731 77198 97050 82875 28848 17430 -12696 8557 34273 -5553
15299 -5553 -43159 -49243 -46602 -49327 -41403 -3205 14927 11473 34365 48014 50007 10087 -30497
15286 -30497 -2607 27711 54849 65428 62034 48199 64556 87858 127825 92091 48261 67508
15274F7508K8528J3387n0066k9845J2812J8799m7967k6807N213k837k5238j8737
15262e5250K3884M0974J252m4682j8183L1444J5949M879R263l36k200L7476K2431
15249F6901J339k8038l0634m0385R976M6333J2769J9353J579o221j9641R615J0854
15236E3800j6013k9210L873J192J8583K2221l3454m7874J2924M764J2857M084
15224G747J3679M0593J5690m180R51J873k5258l5316M039K1734k9918r520J5980
15211A8094J3249L2239l0670n112K8761m2320m0508j5631O8974M5280p2907l3186
15199c3737K3821K7491J8516l740m2003J6122q910J3255k835L425M3722K9263
15187H4390k6079J5271o548o5747k7395K2042l9882o820L1430r574K5767J8656
$$ plain form
15274 67508 96036 109423 59357 29512 42324 61123 13156 -13651 -8438 -11275 -36513 -55250
15262 -55250 -31366 9608 10860 -33822 -52005 -20561 -4612 267 9530 9194 6994 44470 66901
15249 66901 68240 40202 9568 -30817 -20841 25492 38261 57614 59193 52972 33331 42946 53800
15236 53800 37787 8577 12450 13642 32225 54446 20992 -26882 -13958 -9194 3663 7747
15224 7747 21426 62019 77709 73529 74480 76353 51095 15779 19818 41552 11634 2114 18094
15211 18094 31343 63582 32912 27800 56561 14241 -26267 -41898 27076 72356 -551 -33737
15199 -33737 -9916 17575 36091 32351 -9652 6470 -2440 10815 7980 11405 55127 84390
15187 84390 58311 73582 67034 1287 -26108 -4066 -43948 -50768 -19338 -28912 -3145 15511
15175A5511k7501j2096J2357m682K253j528j2663k4992L2944K3521L938m3478
15163c6416r598M6841J5677j487R331j3224k5569j3066k8320l9651R957K5801
15151e9724K7123p449j8582J9315k381L4384J8206k0753J5578j749P252k7129
15139a5909j7431K2807k4951J2017R794k8050J9046M7429J8867k2342j2154M3111
15127E2234L9494k0754k2525l6652k5885l9893K044J4175R790M4541j2048m5177
15115d0656r439M0452J9191r050L3920j2818Q667K5568J5092o858r331m8975o1686
15102e5923L3252o262j0549K3313O016K4038P0712j0448o4960m957L120j1925
15090d573P648J2983j4325J671J5130J9212L867j620j4912j611M506l487Q748
$$ plain form
15175 15511 -11990 -24086 -11729 -16411 -14158 -15686 -28349 -53341 -20397 3124 7062 -36416
15163 -36416 -46014 827 16504 15017 24348 11124 -14445 -27511 -55831 -95482 -85525 -59724
15151 -59724 -32601 -40050 -58632 -39317 -41698 -7314 10892 -9861 5717 3968 11220 -15909
15139 -15909 -33340 -10533 -35484 -23467 -13673 -41723 -22677 24752 43619 21277 9123 52234
15127 52234 91728 70974 48449 11797 -14088 -53981 -51937 -37762 -27972 16569 4521 -40656
15115 -40656 -50095 -9643 9548 498 34418 21600 30267 55835 70927 64069 54738 5763 -55923
15102 -55923 -22671 -28933 -39482 -16169 -10153 13885 84597 74149 9189 4232 7352 -4573
15090 -4573 3075 16058 1733 3404 18534 37746 41613 39993 25081 23470 27976 24489 33237
15077C3237k0567k4853m882L389r082K7618L5845L0333j2517k6760R988K6831
15065F8580r658j3462k3392k9499J6028l1474j7819L9666J0234j0116M015N851
15053H954k1652J1472L4670P3787j0686p5524n6029K905Q618j1317j5362L9480
15041a0684q377p883j1067L9328N1380j0494m8840j470P2511R76l1561l1242l5339
15028c2762n889J2162R88L9879k5961o8299k3226M3370L2376l019p796k7137L5400
15015b9914R108j879j1221PK7217L8363j5323J0876m0712j8907K6398J8771k769
15002A0015q146K387R232N2239J4280l3922j8246n410j5175m785K2576j888K716
14989B5873j6272J6654K5917m6762k9531J3677K8887L2964L825j5460k8512o8620
$$ plain form
15077 33237 12670 -12183 -17065 -13676 -22758 4860 40705 71038 58521 31761 41749 68580
15065 68580 58922 45460 22068 -7431 8597 -22877 -40696 -1030 9204 -912 3103 8954
15053 8954 -12698 -1226 33444 107231 96545 21021 -35008 -32103 -23485 -34802 -50164 -10684
15041 -10684 -19061 -26944 -38011 1317 52697 42203 -6637 -8107 64404 65380 33819 2577 -32762
15028 -32762 -38651 -26489 -25501 14378 -11583 -79882 -103108 -59738 -27362 -30381 -38177 -65314 -29914
15015 -29914 -20806 -22685 -33906 -33899 -6682 31681 16358 27234 -13478 -32385 -5987 12784 10015
15002 10015 1869 4256 13488 65727 80007 46085 27839 22429 7254 2469 25045 23157 25873
14989 25873 9601 26255 52172 5410 -24121 -10444 18443 51407 55232 39772 11260 -57360
14977e7360K5445L2202j3458K8921j1141l6339K3292k0493r467j5647r108L248
14965e9905K757M2450Q40O865N1588L9467j3188l2045l4677k1856l2483L5066
14953a5121P993r134l4722j7181L6493K3874K905L423k1480j247K2668L6871J7022
14940E2364m191n0390K2315K2569Q96L262l180m3804j2830K7047L450N573k887
14927B0194j6383n211n908j6031M371J2116k5805k3870O993Q956K5325j0211j5294
14914d0758J6350P386Q553m118j7693M2727K9513m003L725m8820k3012M6745J4422
14901C1017k266L687j3092J94K9602M2847M6874J5962k7500K407k3625j8828l4209
14888E3070k1975k1077Q862j980J5384r406p904j1038l3360l8405M8617K076J4066
$$ plain form
14977 -57360 -31915 287 -13171 15750 4609 -31730 -8438 -28931 -38398 -54045 -63153 -59905
14965 -59905 -57148 -14698 -13858 -6993 44595 84062 70874 38829 4152 -17704 -50187 -15121
14953 -15121 -7128 -16262 -50984 -68165 -31672 -7798 -4893 -1470 -22950 -24197 -1529 35342 52364
14940 52364 48173 -2217 20098 42667 43563 46825 43645 -159 -12989 14058 17508 23081 20194
14927 20194 3811 -1400 -7308 -23339 -18968 -6852 -32657 -56527 -49534 -40578 -15253 -25464 -40758
14914 -40758 -24408 -17022 -8469 -12587 -30280 12447 41960 37957 41682 -7138 -30150 16595 31017
14901 31017 28751 32438 19346 19540 49142 91989 138863 154825 127325 129732 106107 87279 53070
14888 53070 31095 10018 18880 16900 32284 22878 14974 3936 -29424 -67829 -19212 -17136 -3070
14875c070L1493m563J7346k233m0750j176J9478J8795l902L105j3087m17j8322
14862B697k6163j8250K2440N3331O408l6781j0251m2452O906j1745m2223j8307
14850a14390O5864J3129k162P492j1939l007J1602L2223p730K5295J5896r647
14838B2626K4535n57k551O71k7286k8044J7753J1150k4251Q861N816J9506k934
14825B5295l7087j3075J7503K468K0406L5272j674L3464l4025j1816j2774j1446
14813A2511l3583P935K7109L5384M7268k5078m5958m220K6787k44N223r168l1707
14800A2259R416j6327M760M188l9167j3183M919K4286L4689J1861k0556J3428
14788C0573j2411n517j7117r548l1440J7875K9188K5826r701n248M649k4400j4455
$$ plain form
14875 -3070 28423 23860 41206 38973 -1777 -2953 16525 35320 31418 34523 21436 21019 2697
14862 2697 -23466 -41716 -19276 34055 40463 3682 -6569 -49021 -42115 -53860 -96083 -114390
14850 -114390 -48526 -35397 -37559 -30067 -42006 -45013 -33411 -1188 -8918 16377 32273 22626
14838 22626 47161 46604 44053 44724 17438 -10606 7147 18297 -5954 2907 8723 28229 25295
14825 25295 -11792 -24867 -7364 -4896 15510 50782 49108 82572 48547 36731 23957 12511
14813 12511 -21072 -13137 13972 49356 96624 71546 25588 21368 48155 47911 53134 43966 12259
14800 12259 21675 5348 10108 14296 -24871 -38054 -33135 -8849 25840 37701 17145 30573
14788 30573 18162 12645 -4472 -14020 -45460 -27585 1603 27429 17728 12480 17129 -7271 -21726
14775b1726L4132K4802K3461k2651l755L805j6217j5284p223n086K0182p599j115
14762E726o999K1933K2138K2291k7737k4714k9031j4760J0132J5996Q399M2866
14750D6240j2063l5029q316j2717K4278J9071J3342O967N21k3900q194k1664o282
14737a7746j1272K2727j0467Q957J9650l4283K1701R115l9840l6960J5448R3410
14725D0440K3471J0016k5290k3290j6308m0503m913k7672M58K230N4067J4099
14713F805q256j9275L769J3931J3076o870k1479j4920o897L3904P082m607j8754
14700b2491o316J090j5820q684M4715m318j1512J7172j3690K0966M3936k0605
14688B4443j6954O057L2097N689k2888K3669P924j5303l61j5546o276M0034j9114
$$ plain form
14775 -21726 12406 37208 60669 38018 34263 38068 21851 6567 -656 -5742 14440 6841 5726
14762 5726 -1273 20660 42798 65089 37352 12638 -16393 -31153 -21021 -5025 3374 46240
14750 46240 34177 -852 -9168 -21885 2393 21464 34806 41773 42294 18394 10200 -11464 -17746
14737 -17746 -29018 -6291 -16758 -7801 11849 -22434 -733 8382 -31458 -68418 -52970 40440
14725 40440 63911 73927 48637 25347 9039 -31464 -36377 -64049 -63591 -61361 -7294 6805
14713 6805 -1451 -20726 -16957 -3026 10050 3180 -18299 -33219 -40116 -6212 870 -3737 -22491
14700 -22491 -28807 -27717 -43537 -52221 -7506 -11824 -23336 -6164 -19854 1112 45048 24443
14688 24443 7489 13546 45643 51332 28444 52113 60037 44734 44373 28827 22551 62585 43471
14675D3471r254J813l1324l2539l1595J5820J7209k2681j950m404M7841J1343
14663C750m1257p87O519j3743K9608K0308l5814k7405K0257K6871r339j5064N339
14650c0757j1156L6617J4464O338l2883l7443o628L5082r460Q937N0641j8565
14638E187l7734L802l037J2218M6580j0021j2695N947L0047J3828n064m2130j1990
14625e062j4082k607R042L8187R655L2465j9566o4409j2361J5132J0001j319j7349
14612b2273n270J7136o395k142K6844l2692j8306L0525p796N8895J0166q998k00
14599C9494k0681n9538j6609J5819L6881l6063k6651J1694M5853K0691N6012k2979
14587D3923k4338K320J478n173R33j7173K2674P691J8967o013m6881l1277k3164
$$ plain form
14675 43471 34217 36030 4706 -27833 -59428 -43608 -26399 -49080 -51030 -55434 -7593 3750
14663 3750 -37507 -38294 -31775 -45518 -15910 4398 -31416 -58821 -38564 -11693 -21032 -36096 -30757
14650 -30757 -41913 -5296 9168 15506 -17377 -54820 -61448 -26366 -35826 -26889 23752 5187
14638 5187 -32547 -28745 -31782 -19564 27016 16995 4300 10247 40294 54122 49058 6928 -5062
14625 -5062 -19144 -21751 -12709 25478 35133 67598 48032 -16377 -28738 -13606 -3605 -4924 -22273
14612 -22273 -27543 -10407 -16802 -18944 7900 -24792 -43098 -12573 -20369 38526 48692 39694 39494
14599 39494 18813 -40725 -57334 -41515 -4634 -40697 -67348 -55654 -9801 10890 66902 43923
14587 43923 19585 21905 23383 18210 19143 1970 24644 32335 51302 45289 -1592 -32869 -56033
14574e6033k0094J1639N6602J455L9827L6238j1044l2292k6911R834j0779j298
14562b856M8788J5580K1593k099k4433k7165n4379l5344L2463L1792L445k118
14550E267j4121n3620J7884N4989L6079l446m6n560K4213j0139p0202j4787M7993
14537A4504p539K4873j6031m3062k4707j0100K7970K7880k0166r592L1405R149
14525D584p755j4175J9131J5887L0136K9777k119o6505j5427j1625j8526L2513
14513d104J8921l871J4259q956J3046L8555k3535m3918K912K945j389l0323J5302
14500a0156J4307k4333K3210N1436j9028m2152o5548r014K3456J3245L7893J5258
14488H574J0442j8981k4921O412K7825n510J402J6395P932j2151k5510Q955j9516
$$ plain form
14574 -56033 -76127 -64488 -7886 -6431 33396 69634 58590 26298 -613 9221 -1558 -2856
14562 -2856 45932 61512 83105 81006 56573 29408 -24971 -60315 -27852 3940 7385 5267
14550 5267 -8854 -62474 -44590 10399 46478 43032 42986 37426 61639 51500 -18702 -33489 14504
14537 14504 6965 31838 15807 -27255 -51962 -62062 -34092 -6212 -26378 -35970 -4565 4584
14525 4584 -3171 -17346 1785 17672 47808 77585 75466 8961 -6466 -18091 -36617 -4104
14513 -4104 14817 10946 25205 16249 29295 67850 44315 397 3309 6254 4865 -25458 -10156
14500 -10156 4151 -20182 3028 54464 35436 -6716 -72264 -81278 -57822 -44577 -6684 8574
14488 8574 19016 35 -24886 -18474 9351 3841 5243 21638 29570 17419 -8091 864 -18652
14475a8652J4510J2746k9008k8794M102n216K4008J9858l9085J0337K4639l281
14463a3836J8336M1185L907j1317J4521N2269l1459k1129K1715K4315l0293k9952
14451C8262o277k8027p577L3382j4712l8260n5687M0258K7652J6881R613K3930
14439C9438m2630o258L2808m826k3364k1970N174L9548j3816P493L6088K1004
14427F8689r150J7930N98P058k0311k5632l7341J4451j764J4284J3868m3549R940
14414I071N2876p1987m4600j9478K1622K4016l163r005J2101K7851j8338l5540
14402e4574l321L216M9307K2942J3759J9329J4133j4277p2566l7048M3542L4087
14390A8529L436m711l3654l8159m3419M3220L0649r57L5753K3695l812l4275R236
$$ plain form
14475 -18652 -4142 8604 -20404 -49198 -45096 -50312 -26304 -6446 -45531 -35194 -10555 -13836
14463 -13836 4500 45685 49592 38275 52796 105065 73606 52477 74192 98507 68214 38262
14451 38262 31985 3958 -3619 29763 15051 -23209 -78896 -38638 -10986 5895 15508 39438
14439 39438 -3192 -9450 23358 18532 -4832 -26802 -21628 17920 4104 11597 47685 68689
14427 68689 59539 77469 78067 85125 64814 39182 1841 16292 14528 28812 42680 -869 9071
14414 9071 61947 -10040 -54640 -74118 -52496 -28480 -31643 -40648 -28547 -696 -19034 -54574
14402 -54574 -57895 -54679 -5372 17570 31329 50658 64791 50514 -22052 -59100 -15558 18529
14390 18529 21965 17254 -16400 -54559 -97978 -54758 -24109 -25066 10687 34382 30570 -3705 5531
14377E531K2957J3126K3385m992k7823n1049m1219J0916L4646j0628n5461K6742
14365e3869L6859M5761n983j1353M3298k836n6529l7475P49O367M9635M1358j9824
14352C6158J2644L1479j4394k8055P799l7483K1078J3983K7971L858m3001N597
14340C7634k066M981L8040l0996l0614j5278J0742J4358K0632l8092l7939L1077
14328B479K6575n1274k4744N4911K9048n0176j1719N8820N0541j3563m9520k2412
14316a034O7k4199J9022L5413p383j2776j108l8239j9196J6737O006k7505k7376
14303h1571J6560Q937K4878J2239k1801n672J9448M811K4953j7990j8314j4809
14291d8331L1329j8422K0183M59j0552j7599K0220L431J5813j2667L8013n615
$$ plain form
14377 5531 28488 41614 64999 60007 32184 -18865 -60084 -49168 -14522 -25150 -80611 -53869
14365 -53869 -17010 28751 22768 11415 54713 51877 -4652 -42127 -41378 -35011 14624 55982 36158
14352 36158 48802 80281 65887 37832 45631 8148 29226 43209 71180 75038 32037 37634
14340 37634 35568 40549 78589 47593 16979 1701 12443 26801 47433 9341 -28598 2479
14328 2479 29054 -22220 -46964 7947 36995 -13181 -24900 33920 84461 70898 21378 -1034
14316 -1034 -967 -25166 -6144 29269 21886 9110 8002 -30237 -49433 -32696 -26690 -54195 -81571
14303 -81571 -65011 -56074 -31196 -18957 -40758 -46430 -26982 -22171 2782 -15208 -33522 -48331
14291 -48331 -17002 -35424 -15241 -14782 -25334 -42933 -22713 -19282 -3469 -16136 21877 16262
14279A6262j4349K0726J1618n699p83q16L7259N535l5548m322J1054K0040L337
14266F4314l7149r978J2725j5000J7596Q051l999M13J5735R987O162n6441l4335
14253b1919l291L234J5813p865K4684N544Q694q76R050K2686R95k3906k5024j5451
14239g632J6295O470l2828K5635K9120L650N095q940o227l9909l932o993K513
14226a7683j2655M733P444N6062L449J446m4831j9376J8513p029K9103k434Q035
14213B4777J4568n4499n0707L8325J6673m0144q129P7474p859k3571k0987j582
14201c5661M9191K4819k0654l1565l7120j6088Q021J3949R205K692K6866N759
14189e86l3042J8078K0580K9429K5800j1532o896o085J191l186L3970r817K1641
$$ plain form
14279 16262 1913 22639 34257 28558 27775 26959 64218 69753 34205 29883 40937 60977 64314
14266 64314 27165 17187 29912 14912 32508 40559 36560 36973 52708 62695 68857 12416 -21919
14253 -21919 -25210 -21976 -6163 -14028 10656 16200 24894 24018 33068 55754 56749 32843 7819 -7632
14239 -7632 8663 15133 -17695 7940 37060 40710 45805 36865 30638 -9271 -13203 -20196 -17683
14226 -17683 -30338 -25605 -18161 37901 41350 42796 -2035 -21411 -2898 -9927 19176 16742 24777
14213 24777 39345 -15154 -65861 -27536 -10863 -51007 -59136 18338 10479 -13092 -34079 -35661
14201 -35661 13530 38349 17695 -13870 -50990 -67078 -59057 -45108 -35903 -33211 -6345 -586
14189 -586 -33628 -15550 5030 34459 60259 48727 41831 35746 36937 33751 67721 57904 79545
14176G9545K1484j2978o737k1347L599m8159M668J2962l0367j2453K7569k7770
14164i984J170J9436P238j6194l1243L5726R385j1098k9511K4893L1691j4556
14152A6953m2996j1274O747K1852K0632m2882P049L9236n301j4355J2757k94J5547
14139B3671j6051k5046q346Q525K9365J8408J032K847K4815j3059m942j3089o065
14126B2065k4685m6l752R777K8812r159J1927m091k0084J0596j0617k2520L2012
14113B0235L7389J9726l845l3897m0066K3505K325J9592n63l4260R118O95j6082
14100C872J0313J8060j4623J925k2871j3080L422J169L8321J9128J4928o108l2472
14087B1984k7345l5775j6314K1036l025J6272M3710n181J7579j4906k4138j0753
$$ plain form
14176 79545 101029 88051 81314 59967 63566 15407 20075 33037 2670 -9783 17786 -9984
14164 -9984 -8814 10622 17860 1666 -29577 6149 15534 4436 -25075 -182 31509 16953
14152 16953 -26043 -37317 -30570 -8718 11914 -30968 -23919 15317 10016 -4339 8418 8124 23671
14139 23671 7620 -17426 -25772 -17247 12118 30526 31558 34405 59220 46161 41219 28130 22065
14126 22065 -2620 -2666 -6418 3359 32171 23012 34939 30848 10764 21360 10743 -11777 20235
14113 20235 57624 77350 73505 39608 -458 23047 25372 44964 44401 10141 19259 19954 3872
14100 3872 14185 32245 17622 19547 -3324 -16404 -12982 -11813 26508 45636 60564 54456 21984
14087 21984 -5361 -41136 -57450 -36414 -39439 -23167 20543 15362 32941 18035 -6103 -16856
14075a6856k4670J3692J1404K7104K0009o940l805q222L7063j1931o854k0281
14063I713L4581l1914j4761J8633J4025J1561J2520l5985m1792m204K7213j922
14051b332k6163J3101M397m2436k7777J1467J5215J9587j4904M451L9164l3145
14039c9375k4105N781L3895m3235Q86K5831J5919m582R844J0985K4990M1532J432
14026E9798l1263j4993L1147q36P753k1933j4062N2310J6524m8804k7208J2094
14014B0527q491j289k953j4280j3865j5521O315q222J6085J9174k0934J2006q490
14001a9938K3844k7659m917P0123K6065K9538K8263j644p922q014l1878j2653
13989F3208j2117n4524j8163J3760l1994J4646L442K7948J4911q409j1779M052
$$ plain form
14075 -16856 -41526 -27834 -16430 10674 30683 23743 19938 11716 48779 36848 29994 9713
14063 9713 44294 12380 -2381 16252 30277 41838 54358 18373 -23419 -27623 -410 -2332
14051 -2332 -28495 -15394 -10997 -53433 -81210 -69743 -54528 -34941 -49845 -45394 -6230 -39375
14039 -39375 -63480 -57699 -23804 -67039 -66153 -40322 -24403 -28985 -19141 -8156 16834 58366 59798
14026 59798 28535 13542 44689 43853 51606 29673 15611 67921 84445 35641 8433 20527
14014 20527 12036 10747 7794 -6486 -20351 -35872 -29557 -37779 -21694 -2520 -23454 -11448 -19938
14001 -19938 3906 -23753 -28670 41453 67518 97056 125319 123675 115753 107739 75861 63208
13989 63208 51091 -3433 -21596 -7836 -39830 -25184 -21742 6206 21117 12708 929 4981
13977D981j2446q202k4263J2663O6198j585l423k216k6175J6010L1613o228l7352
13964I575K9097K7403l2936j5252j685j5117k6882K2333L5969j0834M5589j2284
13952E4976k3281m87J0785l4659n0573k114L0725N3224J3051k5480j843J7458
13940D1782L0427p374l1890q34k9285j5522J0225O366K5321k0592j9864r560K495
13927a8305K6277P413K9280M8439n706j4201k943j6220j3340J5677r911n5736
13915i276j0394k0237j3552O2596N9700J1283p1093o8765j9787O7909Q91j1168
13903b1893l051J0412o385J2192K3072k1242L760L4342n167k6893j2363K653J7903
13890G340p383k3531m0907l3125L2208J9907N0880M2430J98r749K0627K3q047
$$ plain form
13977 4981 -7465 -15667 -39930 -27267 38931 37346 33923 31707 5532 21542 53155 46927 9575
13964 9575 38672 66075 33139 17887 16202 1085 -25797 -3464 32505 21671 67260 54976
13952 54976 31695 31208 41993 7334 -43239 -45353 -14628 38596 51647 26167 24324 41782
13940 41782 72209 64835 32945 32111 2826 -12696 -2471 3895 29216 8624 -11240 -20800 -18305
13927 -18305 7972 15385 44665 93104 87398 73197 70254 54034 40694 56371 46460 -9276
13915 -9276 -19670 -39907 -53459 9137 68837 80120 9027 -59738 -79525 -11616 -10725 -21893
13903 -21893 -24944 -14532 -20917 -8725 14347 -6895 -3135 31207 26040 -853 -13216 -10563 7340
13890 7340 -43 -23574 -64481 -97606 -65398 -45491 5389 47819 48017 38268 58895 58918 50871
13877E0871m6199o6070k3203P2577L4024K0544P358K1188n2617k8514l3084K0916
13865b2209L2738k3940k4651p589l3543j1644L4201L7322N0568R163m723l0263
13853E430J9206L1171k8424j1727o330n569K5037L626k3735q904M3023j5796k9962
13840b954K6110k9405j5779K5281R641K6932j9752J707J0265o4053p220L5185
13828d042N859K5344k9705j9132j3004Q989o41M3347L8293L8608l3767o7481k9049
13815c6381Q054j7524j8254J5698L3059P175m910o70L005M2909J8649j4263j5664
13802B0883l2911k4224j0041N462L0633N5064M8308J7850j5233l85l8300m5595
13790A1511l4475n6259R238M0864L2855Q756N2423K1054k2721q903j4459L2394
$$ plain form
13877 50871 4672 -61398 -84601 -12024 22000 42544 49902 71090 18473 -10041 -43125 -22209
13865 -22209 10529 -13411 -38062 -45651 -79194 -90838 -56637 -19315 31253 40416 35693 5430
13853 5430 24636 55807 27383 15656 9326 3757 28794 32420 8685 -219 42804 27008 -2954
13840 -2954 23156 -6249 -22028 3253 12894 39826 20074 21781 32046 -32007 -39227 -4042
13828 -4042 1817 27161 -2544 -21676 -34680 -25691 -26332 17015 55308 93916 60149 -7332 -36381
13815 -36381 -28327 -45851 -64105 -48407 -15348 -8173 -13083 -13753 -10748 32161 50810 36547 20883
13802 20883 -12028 -36252 -46293 -40831 -10198 44866 93174 111024 95791 95406 57106 11511
13790 11511 -22964 -79223 -69985 -29121 3734 12490 64913 85967 63246 54343 39884 72278
13778G2278J6351j2597l873m1433l3418j6J7583l988J2273j055J575N823k8985
13765E18j5132j265M9411j1523l0343q500J7255k285J8278L3527j7033l9849j4522
13752b1463K2246L7137m2242j3333L5510J9842r756J2988L5515K1726k5057k2239
13740E0874p809m7893n13J8880M420K3808o341j2923J142m5970j1282J7278L5558
13727A9229J750m8937k0894K3318K972k190J3033k191k48L1621r186L4873J2055
13714E5205m4596k6276L3571M9266o955l0395J1012k4671m4621n912p132o555
13702d8059m1446K590N4837l093k3045j0694j8596j7591O1169P4221J7562k2401
13690B5454p191j0258l1886R422O496j6759J8965K8941M9393k5301m7395q282
$$ plain form
13778 72278 88629 76032 72159 30726 -2692 -2708 14875 10887 23160 22105 23680 29503 518
13765 518 -14614 -15879 33532 22009 -8334 -16834 421 -1864 16414 49941 32908 -6941 -21463
13752 -21463 783 37920 -4322 -17655 17855 37697 27941 40929 76444 98170 73113 50874
13740 50874 43065 -4828 -5341 13539 17959 41767 35426 22503 23645 -22325 -33607 -16329 19229
13727 19229 20979 -27958 -48852 -25534 -22562 -24752 -11719 -13910 -14158 17463 8277 43150 55205
13714 55205 10609 -15667 17904 67170 60215 29820 40832 16161 -28460 -34372 -41504 -48059
13702 -48059 -89505 -86915 -32078 -35171 -58216 -68910 -87506 -105097 -43928 30293 47855 25454
13690 25454 18263 8005 -23881 -14459 -7963 -24722 -5757 23184 72577 47276 -119 -8401
13678h401J6663K3885R223L8091M5545j4592p4090o8132L693L3034M4038P091
13666E6048n9041k96K1378J6147Q076l1657k3735K60j2681L2331k3794j7906P633
13653b7237L7465K2710L7692K8431n0345o349j0806l022M5724j1329m3553q579
13641A0802j7014O148k9283J1412m610q475J5353q682m1372j0840j2978j4943
13629a04482M8112M2194p452P455L2583K9991k1627k3735N688L6684k943j0846
13617C1622l8951R946j180M0600K2538l5179m4266p027j7730K3439L1109R639
13605B4560r164K23k1041l3444j7462N4202M3154p090j6768p096j2745j5910j431
13592b0012j4400k0327L1993J6417K4947J2475k6155j0370m289J4766n841L745
$$ plain form
13678 -8401 8262 32147 41370 79461 125006 110414 36324 -31808 -28115 4919 48957 56048
13666 56048 -2993 -3289 18089 34236 42312 10655 -13080 -12820 -25501 6830 -16964 -34870 -27237
13653 -27237 10228 32938 70630 99061 48716 42367 31561 28539 74263 62934 19381 10802
13641 10802 -6212 -64 -29347 -17935 -22545 -31020 -15667 -24349 -65721 -76561 -89539 -104482
13629 -104482 -56370 -14176 -21628 -14173 18410 48401 26774 3039 8727 45411 42468 31622
13617 31622 -7329 2617 1437 42037 64575 29396 -14870 -21897 -39627 -16188 14921 24560
13605 24560 15396 15619 -5422 -38866 -56328 -2126 41028 33938 17170 10074 -2671 -18581 -20012
13592 -20012 -34412 -54739 -22746 -6329 18618 31093 4938 -5432 -9721 5045 -796 2949
13580B949j5129j5818m4820J2505J5916k2060P0696K4898k0740N123n354K6719
13568C4885M1862M1077M548o9094n6647J2708K2615l751m877j1000j3618J7147
13556A5855K1399k895m0415L895R048K497k9195K6948M2283K792l4574k7620K5696
13543A5714k49K5362l9999l2267J4060L4936K9337l8814K220K177J4600j6120
13531A0957p152K407k1945M833O2009k308j9274k443l3875l1266m82K8447J1175
13518A083J032j7819n469J3362K1847K8607j1756K1091K2371j7594p339m5873
13506C543P504M6981j3911n190N480j7262l0311M0020j2184l2940q342N1530J7995
13493E2913l377l1887J8186Q051K9744Q635j5515n711j4880j6214J2755q706K3889
$$ plain form
13580 2949 -12180 -27998 -72818 -60313 -44397 -66457 4239 29137 8397 13520 8166 34885
13568 34885 76747 117824 122372 53278 -3369 9339 31954 28203 23326 12326 -1292 15855
13556 15855 37254 34359 -6056 -2161 6887 9384 -19811 7137 49420 52212 17638 -9982 15714
13543 15714 15465 40827 828 -31439 -17379 17557 46894 8080 10300 12477 27077 10957
13531 10957 3805 6212 -15733 -10900 51109 48801 29527 27084 -6791 -38057 -38539 -10092 1083
13518 1083 2115 -15704 -21173 -7811 14036 42643 30887 51978 74349 56755 49416 3543
13506 3543 11047 58028 44117 38927 44407 27145 -3166 36854 24670 -8270 -16612 34918 52913
13493 52913 49536 17649 35835 43886 73630 82265 66750 61039 46159 29945 42700 33994 57883
13480E7883L6641j8139j8631k9433R293K2367L217K4034O8759K08o4310j8486
13468G3403J8721k9712J9988M5786n0960j8852J4219j4617p4345j3253M0860L2147
13456D3385j219m007M4853J7508K8259L6881l7894p1999q699m8074l521j1815
13444a6342k6489n039K6850J9589k598m2646J8699K0872j7776J1234J6878p924
13432d692J0696L2899k4259l7206R821j1187k0076j2828M4228M9665l0339k7526
13420b0804K136k2078n4311N0416M1401N2143K6859l2696m5125k0506l2485k7370
13408h2420J5106K9113K4326O236K5043J4774M246J2228m4859K648j4994j6752
13396b5305r817M2101J9695p730m606m2211k2779n966j552L6911L4894N2374J7019
$$ plain form
13480 57883 94524 76385 57754 28321 37614 59981 63198 87232 155991 156199 91889 73403
13468 73403 92124 62412 82400 128186 77226 58374 72593 57976 -16369 -29622 11238 43385
13456 43385 42166 38159 83012 100520 128779 165660 127766 55767 47068 -1006 -4527 -16342
13444 -16342 -42831 -47870 -21020 -1431 -4029 -46675 -27976 -7104 -24880 -13646 3232 -4692
13432 -4692 6004 38903 14644 -22562 -12741 -23928 -44004 -56832 -12604 37061 6722 -20804
13420 -20804 -18668 -40746 -95057 -44641 -3240 48903 75762 43066 -2059 -22565 -55050 -82420
13408 -82420 -67314 -38201 -13875 -7639 17404 32178 36424 48652 3793 6441 -8553 -25305
13396 -25305 -35122 6979 26674 18944 14338 -27873 -50652 -56618 -58170 -21259 13635 66009 83028
13383H3028j5251j3996o620K996k916J6987J4438k6727k4801K7221j6028n0724
13371a2393J820O153K7800J3834k8046P562j734k4674j9326K3986J1053o769J9526
13358A8792J238o201j973J3391l4463m2062J073L9417N0354j7856k0481l0873
13346b9644k074q58j1154M809J6629P565j5412J1122K0882j0541J6727J3945n6903
13333c4907J1552j866L6409p196k0466L7159r132J2755R850n4653j8111L4145
13321d461j3228J1402j5591J7865m4507l6504L7694J8600O292L6779R706J6381
13309D0428j203k5783K1447J982J3414K7826k0597j3955J3146K0199m160l0978
13297D1766l7884j4253R245J5024L8197N874l827k0702j6065j277j3597J7449
$$ plain form
13383 83028 67777 53781 47161 50157 47241 64228 78666 51939 27138 54359 38331 -12393
13371 -12393 -10573 -4420 23380 37214 9168 16730 14996 -9678 -29004 -5018 6035 -734 18792
13358 18792 20030 13829 11856 25247 -9216 -51278 -50205 -10788 39566 21710 1229 -29644
13346 -29644 -31718 -32576 -43730 -38921 -22292 -14727 -30139 -19017 1865 -8676 8051 21996 -34907
13333 -34907 -23355 -25221 11188 3992 -16474 20685 11553 24308 34158 -20495 -38606 -4461
13321 -4461 -17689 -6287 -21878 -4013 -48520 -85024 -47330 -28730 -22438 14341 24047 40428
13309 40428 39225 13442 34889 36871 50285 78111 57514 43559 56705 76904 72744 41766
13297 41766 3882 -10371 -1126 13898 52095 57969 54142 33440 17375 16098 2501 19950
13285A9950j2613J6382n663K1056k4253k6785J1887K7513K0490o543l1340k2447
13273a2366J5682p05J1553M1826L713m217J8348k81n255N942p4238k5483K0671
13260d810j0103j816O663J3779O0857L179l6985j9830n9512j2176J2649K0339
13248b7766j8565K6962J474k6478J659k1552J5902Q725J8023l2725j1798K5207
13236d0932K1707k2277O25J5856J4441O599J6831k5239j788n1579k5561Q073n726
13223h8970M433J8062K6994K5463J4797K4016k8767Q407Q869L9285o328K012N372
13210E3645j1469m9013J8070J0156L4178j3334K7574k339l2311J936j6232k0239
13198F22p569l733L8358k9476m0371N192K0413L2980j9100l7980k7661J7105J9335
$$ plain form
13285 19950 7337 23719 18056 39112 14859 -11926 -39 27474 47964 41421 10081 -12366
13273 -12366 3316 2611 14164 55990 59703 55486 73834 73553 68298 74240 2 -25481 -4810
13260 -4810 -14913 -16729 -10066 3713 64570 67749 30764 10934 -48578 -60754 -48105 -27766
13248 -27766 -46331 -19369 -17895 -44373 -42714 -64266 -48364 -39639 -21616 -54341 -66139 -40932
13236 -40932 -19225 -41502 -40877 -25021 -10580 -3981 12850 -12389 -14177 -65756 -91317 -83244 -88970
13223 -88970 -84537 -66475 -39481 -14018 779 24795 -3972 4435 13304 52589 46261 48273 53645
13210 53645 42176 -6837 11233 21389 55567 42233 69807 67468 35157 37093 20861 622
13198 622 -6947 -10680 27678 -1798 -42169 -36977 -16564 16416 -2684 -40664 -68325 -51220 -31885
13185c1885J5086k0206k1486K7132J7032K4383J6439L9875M5295k6543O036q727
13173H2431J555l6901k6457l6858L3101J093R350K341l828m6324L3J9159K9270
13160B7965J6057j9859m8592l0211K6054K7123j7092L3515j3150L229j3312k6894
13148c5167m527N4935J2633J3988M3677J9836n6863n2823J4209O912M245n3286
13136c2231q078l05j2895K2339J8207K5637K1225j9513o328K7353k129p666k7872
13123b256n430K3038L2104k1442k8703j1838Q19K8534M916k2024l2765l4743K4322
13110d5468P028L0909l048Q905J4207j3569j6835l1649k6088J5513L2411J2117
13098a5567k318Q405K3418l5793Q730m44o762j747p181J9815J7599K6729o882
$$ plain form
13185 -31885 -16799 -37005 -58491 -31359 -14327 10056 26495 66370 111665 85122 91158 82431
13173 82431 83986 47085 20628 -16230 16871 17964 27314 29655 25827 -20497 -20464 -1305 27965
13160 27965 44022 24163 -24429 -54640 -28586 -1463 -18555 14960 1810 5039 -8273 -35167
13148 -35167 -39694 15241 27874 41862 85539 105375 48512 -4311 9898 16810 21055 -32231
13136 -32231 -40309 -40614 -53509 -31170 -12963 12674 33899 14386 8058 35411 33282 25616 -2256
13123 -2256 -7686 15352 47456 26014 -2689 -14527 -13708 14826 19742 -2282 -35047 -69790 -45468
13110 -45468 -38440 -7531 -10579 -1674 12533 -1036 -17871 -49520 -75608 -60095 -27684 -15567
13098 -15567 -17885 -9480 13938 -21855 -13125 -13569 -20331 -22078 -29259 -9444 8155 34884 28002
13085B8002k5642k0996k5261n777K4864K4993K7716Q046J445k479p540O984k6714
13072G641q2429L0151L5000L7305k8792n657P813m4137k9885J976N9057L0571
13060A8614k5972r121k472q283k2566K793M596m243L8711M8820o199J130n367
13047C0441l6471j7261N720L184K457k1208k1724r06K41j0408J1892J1089K2606
13034b0348K2616K7223N322j5939L4088J6115k7382m1982n7839L7262J6880l2947
13022c6931J9977M976M9631K0555j0854j7929j6423j6415q281k0182m0494L5712
13010c6658N27J121K5864j21k2486j3839J176L0776M037L2967K694L417M4537
12997G4012j2917m0762J9265j5355r293K3278l5778j0420n0202j2127L9814M9085
$$ plain form
13085 28002 2360 -18636 -43897 -49674 -24810 183 27899 35945 37390 34911 27371 34355 7641
13072 7641 -74788 -44637 -9637 27668 -1124 -6781 1032 -43105 -72990 -71014 -11957 18614
13060 18614 -7358 -16479 -18951 -27234 -49800 -47007 -42411 -46654 -7943 40877 34678 35808 30441
13047 30441 -6030 -23291 -17571 -14387 -11930 -33138 -54862 -55768 -55527 -65935 -54043 -42954 -20348
13034 -20348 2268 29491 34813 18874 52962 69077 41695 -287 -58126 -20864 -3984 -36931
13022 -36931 -16954 -11978 37653 58208 47354 29425 13002 -3413 -11694 -31876 -72370 -36658
13010 -36658 -36131 -35010 -9146 -9267 -31753 -45592 -44416 -13640 -9603 23364 26058 29475 74012
12997 74012 61095 20333 39598 24243 14950 38228 2450 -7970 -58172 -70299 -30485 18600
12985A8600J8198k1659p55L0504j4106r479k1203L616n118K4273k4343j9217J7620
12972c069J3369p678k6298J3679j256o214J6874q756j5269j47q011J1643N122
12959a6011Q119J00J9777K7725J0352K0903r543j6973m949J4960j3787k5648j7982
12946b957P297j3314p3431k8965K9697N8381M9265Q670l3624j1032M933k4750
12934b9830p129M954P777K1174J9948M630r087p175o4159m2655L2251K7454K3901
12921a7946J8919j5603j7056J311J1704o322J326M929r630k4808k8103R687M2086
12908b9506K0048L7280N210l3852M297n675J6575l1941j3073J2057o6870l6646
12896a22096M7385K0962L663J3215K0895J6177J3839J2841J0637Ll8118l5942
$$ plain form
12985 18600 36798 15139 14384 44888 30782 21303 100 3716 -1402 22871 -1472 -20689 -3069
12972 -3069 10300 2622 -23676 -9997 -11253 -17467 -593 -9349 -24618 -24765 -32776 -21133 -16011
12959 -16011 -7892 -7792 11985 39710 50062 70965 61422 44449 39500 54460 40673 15025 -2957
12946 -2957 4340 -8974 -82405 -111370 -81673 -23292 25973 34643 1019 -10013 -5080 -29830
12934 -29830 -36959 -32005 -24228 -3054 16894 21524 12437 5262 -58897 -101552 -69301 -41847 -17946
12921 -17946 973 -14630 -31686 -30375 -18671 -24993 -23667 -18738 -28368 -53176 -81279 -71592 -29506
12908 -29506 -9458 27822 33032 -820 3477 -2198 14377 -17564 -30637 -18580 -85450 -122096
12896 -122096 -74711 -53749 -50086 -36871 -15976 201 14040 26881 37518 37521 -597 -36539
12884c6539p367J8622n942m3029L074K0829R997J03j179j0325P9730M4261l2440
12871C9795J9488m1714k2162L6133q357r800j0608l696k3312q369p820J9675N767
12858a4980j4298n068L066o268J9184J692l269j9896K576J9918q245J5823k4457
12845c4222k2450M3453O0174r935j960J3778m0221m8832N2496l2737n8892J5543
12833f3805M3066L1383k1984o803m880J245r400k7799J3834N0109k134P714j2498
12820a952j4299J5268l3125j5731J6209k8466l5737N5452K9160k6974k7374n201
12808g2770P773k910o361O258n575j8298J9707N4305K2682k7725o096J7939K2183
12795A1112L4901m1403o6276K7446O4083l7048m3033J0584L0345J5671k3224k2465
$$ plain form
12884 -36539 -43906 -25284 -31226 -74255 -71181 -50352 -40355 -40252 -41431 -51756 27974 72235 39795
12871 39795 59283 17569 -4593 31540 23183 13383 2775 -921 -24233 -32602 -40422 -20747 -14980
12858 -14980 -29278 -34346 -31280 -37548 -18364 -16672 -19941 -39837 -37261 -17343 -25588 -9765 -34222
12845 -34222 -56672 -13219 46955 37020 35060 48838 8617 -40215 12281 -20456 -79348 -63805
12833 -63805 -20739 10644 -11340 -18143 -23023 -21778 -31178 -58977 -45143 4966 2832 10546 -1952
12820 -1952 -16251 -983 -34108 -49839 -33630 -62096 -97833 -42381 -13221 -40195 -67569 -72770
12808 -72770 -64997 -67907 -74268 -68010 -73585 -91883 -72176 -17871 4811 -22914 -29010 -11071 11112
12795 11112 46013 4610 -61666 -34220 29863 -7185 -50218 -39634 -9289 6382 -16842 -39307
12783c9307J3706j4556o204P8886J3724j7852M556k4471n1758k0216K31q164K4822
12770d6603J1265M82r829k430K6512r674K440j8513l4452J4717L3024L1646l2311
12757c3726j220J5464j3748p577K11j5097J6592j1562J73k7873P28J55j4580K0099
12743g1961L6157n414q716r789K7140N6445j3970l3964J4983L1384K6012k2639
12731B5668J5149j0563k8722k124J1904O630K5011l0161k4155r889K1149P601
12719G498K4462k8565j4639J2983J9802j0075j757K882j5328j696L7729L5637
$$ plain form
12783 -39307 -25601 -40157 -46361 32525 46249 28397 32953 8482 -43276 -63492 -63261 -71425 -46603
12770 -46603 -35338 -34856 -44685 -47115 -20603 -30277 -27837 -46350 -80802 -66085 -33061 -1415 -33726
12757 -33726 -34946 -19482 -33230 -40807 -40596 -55693 -39101 -50663 -50490 -78363 -77635 -77480 -92060 -71961
12743 -71961 -35804 -41218 -49934 -59723 -32583 23862 9892 -24072 -9089 22295 48307 25668
12731 25668 40817 30254 1532 -592 11312 17942 42953 12792 -11363 -21252 -103 7498
12719 7498 31960 3395 -11244 1739 21541 11466 9709 12591 -2737 -4433 33296 68933
$$ [...]
##END NTUPLES=NMR SPECTRUM
##END=
