##TITLE=Analysis number 325909
Compound Code cc 56606
Book Reference 508/40
Project Code adrs
Chemist Name antons
##JCAMPDX= 6.0         $$ Bruker NMR JCAMP-DX V2.0
##DATA TYPE= NMR SPECTRUM
##DATA CLASS= NTUPLES
##ORIGIN= Bruker BioSpin GmbH
##OWNER= nmr
$$ XWIN-NMR		Version 3.5
$$ Thu Jan 18 11:35:02 2007 GMT Standard Time (UT+0h)  MAYBRIDGE\nmr@NMR_250MHZ
##.OBSERVE FREQUENCY= 250.131544655141
##.OBSERVE NUCLEUS= ^1H
##.ACQUISITION MODE= SIMULTANEOUS (DQD)
##.ACQUISITION SCHEME= undefined
##.AVERAGES= 16
##.DIGITISER RES= 18
##SPECTROMETER/DATA SYSTEM= dpx250
##.PULSE SEQUENCE= zg30
##.SOLVENT NAME= CDCl3
##.SHIFT REFERENCE= (INTERNAL, CDCl3, 0, 16.522)
##AUDIT TRAIL= $$ (NUMBER, WHEN, WHO, WHERE, WHAT)
$$ ##TITLE= Audit trail, XWIN-NMR		Version 3.5
$$ ##JCAMPDX= 5.01
$$ ##ORIGIN= Bruker BioSpin GmbH
$$ ##OWNER= nmr
$$ C:\u/data/dgb/nmr/ADRS/1370/pdata/1/auditp.txt
$$ ##AUDIT TRAIL=  $$ (NUMBER, WHEN, WHO, WHERE, WHAT)
(   1,<2007-01-18 11:34:41.94 +000>,<MAYBRIDGE\nmr>,<NMR_250MHZ>,
      <created by zg, POWCHK disabled, PULCHK disabled
       configuration hash MD5:
       49 4B E0 1D 92 C2 6B 37 9F E6 65 BC 52 41 86 1D
       data hash MD5: 64K
       5B 77 84 30 63 2F A0 C4 E8 1E 74 D1 CB 3D DA 71>)
(   2,<2007-01-18 11:34:54.32 +000>,<MAYBRIDGE\nmr>,<NMR_250MHZ>,
      <Start of raw data processing
       ef LB = 0.3 FT_mod = 6 PKNL = 1 SI = 32K 
       data hash MD5: 32K
       E3 DD 01 E4 0B 5A 1C 40 D6 32 D4 93 D2 59 B8 BC>)
(   3,<2007-01-18 11:34:56.58 +000>,<MAYBRIDGE\nmr>,<NMR_250MHZ>,
      <apk 
       data hash MD5: 32K
       41 EC 98 B7 DD 4F F4 6F A9 57 D7 12 3E CD 15 99>)
(   4,<2007-01-18 11:34:57.38 +000>,<MAYBRIDGE\nmr>,<NMR_250MHZ>,
      <abs ABSG = 5 
       data hash MD5: 32K
       13 2F 2E 01 4F 81 F9 CE 4F 03 DD DF 3E AB 70 EC>)
$$ ##END=
$$ 
$$ hash MD5
$$ 4B 9F 56 98 01 6C 25 E0 41 50 B8 7A 88 0A A5 BD
##$RELAX= 
##$RELAX= 
##$RELAX= 
##$RELAX= 
##$RELAX= 
##$RELAX= 
##$RELAX= 
$$ Bruker specific parameters
$$ --------------------------
##$DU= <C:\u>
##$EXPNO= 1370
##$NAME= <ADRS>
##$PROCNO= 1
##$TYPE= <nmr>
##$USER= <dgb>
##$AMP= (0..31)
100 100 100 100 100 100 100 100 100 100 100 100 100 100 100 100 100 100 
100 100 100 100 100 100 100 100 100 100 100 100 100 100 
##$AQSEQ= 0
##$AQ_mod= 3
##$AUNM= <au_zg>
##$AUTOPOS= <17 >
##$BF1= 250.13
##$BF2= 250.13
##$BF3= 250.13
##$BF4= 250.13
##$BF5= 500.13
##$BF6= 500.13
##$BF7= 500.13
##$BF8= 500.13
##$BYTORDA= 1
##$CFDGTYP= 0
##$CFRGTYP= 5
##$CHEMSTR= <none>
##$CNST= (0..31)
1 1 145 1 1 1 1 1 1 1 1 1 1 1 1 1 1 1 1 1 1 1 1 1 1 1 1 1 1 1 1 1 
##$CPDPRG= <>
##$CPDPRG1= <>
##$CPDPRG2= <>
##$CPDPRG3= <>
##$CPDPRG4= <mlev>
##$CPDPRG5= <mlev>
##$CPDPRG6= <mlev>
##$CPDPRG7= <mlev>
##$CPDPRG8= <mlev>
##$CPDPRGB= <>
##$CPDPRGT= <>
##$D= (0..31)
0 1 0 0 0 0 0 0 0 0.06 0 0 0 0 0 0 0.0002 0 0 0 0 0 0 0 0 0 0 0 0 0 0 
0 
##$DATE= 1169120080
##$DBL= (0..7)
120 120 120 120 120 120 120 120 
##$DBP= (0..7)
150 150 150 150 150 150 150 150 
##$DBP07= 0
##$DBPNAM0= <>
##$DBPNAM1= <>
$$ [...]
##$SUBNAM7= <"">
##$SUBNAM8= <"">
##$SUBNAM9= <"">
##$SW= 20.6930455092707
##$SWIBOX= (0..15)
0 0 3 0 0 0 0 0 0 0 0 0 0 0 0 0 
##$SW_h= 5175.983436853
##$TD= 65536
##$TD0= 1
##$TE= 294.16
##$TE2= 300
##$TE3= 300
##$TEG= 300
##$TL= (0..7)
0 120 120 120 120 120 120 120 
##$TP= (0..7)
150 150 150 150 150 150 150 150 
##$TP07= 0
##$TPNAME0= <>
##$TPNAME1= <>
##$TPNAME2= <>
##$TPNAME3= <>
##$TPNAME4= <>
##$TPNAME5= <>
##$TPNAME6= <>
##$TPNAME7= <>
##$TPOAL= (0..7)
0.5 0.5 0.5 0.5 0.5 0.5 0.5 0.5 
##$TPOFFS= (0..7)
0 0 0 0 0 0 0 0 
##$TUNHIN= 0
##$TUNHOUT= 0
##$TUNXOUT= 0
##$USERA1= <user>
##$USERA2= <user>
##$USERA3= <user>
##$USERA4= <user>
##$USERA5= <user>
##$V9= 5
##$VALIST= <valist>
##$VCLIST= <CCCCCCCCCCCCCCC>
##$VD= 0
##$VDLIST= <DDDDDDDDDDDDDDD>
##$VPLIST= <PPPPPPPPPPPPPPP>
##$VTLIST= <TTTTTTTTTTTTTTT>
##$WBST= 1024
##$WBSW= 4
##$XGAIN= (0..3)
0 0 0 0 
##$XL= 0
##$YL= 0
##$YMAX_a= 329643
##$YMIN_a= -422537
##$ZGOPTNS= <>
##$ZL1= 120
##$ZL2= 120
##$ZL3= 120
##$ZL4= 120
##$ABSF1= 16.522
##$ABSF2= -4.171173
##$ABSG= 5
##$ABSL= 3
##$ALPHA= 0
##$AQORDER= 0
##$ASSFAC= 0
##$ASSFACI= 0
##$ASSFACX= 0
##$ASSWID= 0
##$AUNMP= <proc_1d>
##$AZFE= 0.1
##$AZFW= 0.1
##$BCFW= 0
##$BC_mod= 0
##$BYTORDP= 0
##$COROFFS= 0
##$CY= 12.5
##$DATMOD= 1
##$DC= 0
##$DFILT= <>
##$DTYPP= 0
##$F1P= 14.0000005364418
##$F2P= -0.99999901652339
##$FCOR= 0.5
##$FTSIZE= 32768
##$FT_mod= 6
##$GAMMA= 0
##$GB= 0
##$INTBC= 1
##$INTSCL= 1
##$ISEN= 128
##$LB= 0.3
##$LEV0= 0
##$LPBIN= 0
##$MAXI= 10000
##$MC2= 0
##$MEAN= 0
##$ME_mod= 0
##$MI= 0
##$NCOEF= 0
##$NC_proc= -3
##$NLEV= 6
##$NOISF1= 0
##$NOISF2= 0
##$NSP= 0
##$NTH_PI= 0
##$NZP= 0
##$OFFSET= 16.522
##$PC= 1
##$PHC0= 218.6477
##$PHC1= 21.7624
##$PH_mod= 1
##$PKNL= yes
##$PPARMOD= 0
##$PSCAL= 4
##$PSIGN= 0
##$REVERSE= no
##$SF= 250.13
##$SI= 32768
##$SIGF1= 0
##$SIGF2= 0
##$SINO= 400
##$SIOLD= 32768
##$SREGLST= <1H.CDCl3>
##$SSB= 0
##$STSI= 32768
##$STSR= 0
##$SW_p= 5175.98343685301
##$SYMM= 0
##$S_DEV= 0
##$TDeff= 65536
##$TDoff= 0
##$TI= <Analysis number 999999
Compound Code 99
Book Reference 9
Project Code 9>
##$TILT= no
##$TM1= 0
##$TM2= 0
##$TOPLEV= 0
##$USERP1= <user>
##$USERP2= <user>
##$USERP3= <user>
##$USERP4= <user>
##$USERP5= <user>
##$WDW= 1
##$XDIM= 32768
##$YMAX_p= 363926599
##$YMIN_p= -275306
$$ End of Bruker specific parameters
$$ ---------------------------------
##NTUPLES= NMR SPECTRUM
##VAR_NAME=  FREQUENCY,     SPECTRUM/REAL,   SPECTRUM/IMAG
##SYMBOL=    X,             R,               I
##VAR_TYPE=  INDEPENDENT,   DEPENDENT,       DEPENDENT
##VAR_FORM=  AFFN,          ASDF,            ASDF
##VAR_DIM=   32768,         32768,           32768
##UNITS=     HZ,            ARBITRARY UNITS, ARBITRARY UNITS
##FACTOR=    0.157963299565203, 1,           1
##FIRST=     4132.6476996994, 0,             0
##LAST=      -1043.33573715361, 0,           0
##MIN=       -1043.33573715361, -275306,     0
##MAX=       4132.6476996994, 363926599,     0
$$ Real data points
##PAGE= N=1
##DATA TABLE= (X++(R..R)), XYDATA
$$ [...]
$$ plain form
23172 18925 18528 -22323 -37958 -34563 -32184 -38509 -38288 -44799 -37320 -33016 -30114 -19846 -5456 -14850
23158 -14850 -32728 -41948 -42468 -28548 -41160 -19925 -25956 -38550 -39180 -27525 -19696 -27981 -55421
23145 -55421 -22677 16167 12746 -10673 -27412 -24502 -14325 6354 12689 32064 232 -26942
23133 -26942 -31887 -20561 -18849 -3921 6104 -19141 -36487 -24620 -5019 -7619 -22953 -13194
23121 -13194 20337 24498 46582 22112 405 -5967 4193 911 -546 -11633 -975 5748 -1602
23108 -1602 -263 -9661 5315 30172 33912 38204 17958 -15070 -15063 -40114 -61687 -61649 -59329 -35761
23094 -35761 -7744 -6259 13773 -8995 -41181 -51875 -54555 -42444 -17403 -41425 -50337 -33928
23082 -33928 -18965 -13179 663 9051 -1131 2923 -32864 -74063 -82838 -42044 2811 16206
$$ packed form
23172A8925l97m0851j5635L395K379o325K21o511P479M304K902J0268J4390r394
23158a4850j7878r220n20J3920j2612K1235o031j2594o30J1655P829q285k7440
23145e5421L2744L8844l421k3419j6739K910J0177K0679O335J9375l1832k7174
23133b6942m945J1326J712J4928J0025k5245j7346J1867J9601k600j5334R759
23121a3194L3531M161K2084k4470k1707o372J0160l282j457j1087J0658O723p350
23108a602J339r398J4976K4857L740M292k0246l3028Pk5051k1573L8K320K3568
23094c5761K8017J485K0032k2768l2186j0694k680J2111K5041k4022q912J6409
23082c3928J4963N786J3842Q388j0182M054l5787m1199q775M0794M4855J3395
$$ plain form
23070 16206 27714 10304 -4211 -22738 -5306 46999 24501 27154 18513 27922 -3691 -26757
23058 -26757 -22292 -16236 -32534 -24950 -8214 -45747 -52667 -50545 -44775 817 28710 40108 32674
23045 32674 30793 33101 30833 26908 45653 28599 31265 33044 43725 21061 11272 -16169 -11912
23032 -11912 4512 13703 12337 -86 12177 43815 25181 -7568 -22168 -33518 -51157 -29738
23020 -29738 28839 70584 63707 37822 7549 -12223 -50681 -21737 -14145 -16575 -28310 -2189
23008 -2189 15838 -1621 -12380 -26128 -24313 -1459 -867 5580 12356 -12853 -15461 -9537 13771
22995 13771 -2141 -6440 30563 8974 -7534 -14558 -8371 13497 29434 33079 22505 14991 -878
22982 -878 10798 17495 14202 496 -5304 -2134 -7275 -18267 -32140 -26487 -55171 -50033 -50974 -39712
$$ packed form
23070A6206J1508j7410j4515j8527J7432N2305k2498K653q641R409l1613k3066
23058b6757M465O056j6298P584J6736l7533o920K122N770M5592K7893J1398p434
23045C2674j881K308k268l925J8745j7054K666J779J0681k2664r789k7441M257
23032a1912J6424R191j366j2423J2263L1638j8634l2749j4600j1350j7639K1419
23020b9738N8577M1745o877k5885l0273j9772l8458K8944P592k430j1735K6121
23008b189J8027j7459j0759j3748J815K2854N92O447O776k5209k608N924K3308
22995A3771j5912m299L7003k1589j6508p024O187K1868J5937L645j0574p514j5869
22982h78J1676O697l293j3706n800L170n141j0992j3873N653k8684N138r41J1262
$$ plain form
22968 -39712 -40976 -56793 -32490 -7592 9944 3060 29343 61308 45468 21445 8391 44438
22956 44438 24370 14880 5919 -6644 11368 42435 45894 24543 7756 -17344 -31111 -41659
22944 -41659 -31895 -49434 -38128 5635 19953 20754 7748 -5107 -30752 -19042 15554 64605
22932 64605 67637 26095 18060 30065 9512 -17179 -32488 -27384 12000 66864 47782 30953
22920 30953 34666 37543 36249 20153 -20514 -13859 -19134 -27861 -60613 -49626 -17060 -23102 -32055
22907 -32055 -47367 -36040 -9576 7353 7749 -3349 9647 -14326 -29248 1149 3954 -16392
22895 -16392 -44363 -52489 -38836 -13689 -3303 -18673 -11190 11146 26226 31613 -7953 -25034
22883 -25034 -11156 14934 39098 46477 41240 42422 51045 48752 16346 1475 10442 -5955 -18223
$$ packed form
22968c9712j264j5817K4303K4898J7536o884K6283L1965j5840k4023j3054L6047
22956D4438k0068r490q961j2563J8012L1067L459k1351j6787k5100j3767j0548
22944d1659R764j7539J1306M3763J4318Q01j3006j2855k5645J1710L4596M9051
22932F4605L032m1542q035J2005k0553k6691j5309N104L9384N4864j9082j6829
22920C0953L713K877j294j6096m0667O655n275q727l2752J0987L2566o042q953
22907c2055j5312J1327K6464J6929L96j1098J2996k3973j4922L0397K805k0346
22895a6392k7971q126J3653K5147J0386j5370P483K2336J5080N387l9566j7081
22883b5034J3878K6090K4164P379n237J182Q623k293l2406j4871Q967j6397j2268
$$ plain form
22870 -18223 15918 19551 21778 5740 -24486 -61167 -52867 -15741 -4614 -6498 21007 37079
22858 37079 13624 11412 21095 15632 28216 26592 16456 18374 26400 40855 68255 89387 47151
22845 47151 8980 24568 18419 13295 20104 11589 15104 -8956 -43609 -15936 26719 14214 51983
22832 51983 73522 45002 27602 -6739 -9488 -56666 -68362 -25304 -44801 -69620 -73893 -29798
22820 -29798 -14954 -59980 -58064 -22724 -3120 -23578 -27475 -18720 -21780 -43590 -61287 -46504
22808 -46504 -55982 -36797 4851 48391 38431 3322 -8782 9416 16463 2708 6463 27743
22796 27743 35658 45523 2264 -11053 1511 14522 4390 -2768 -9282 -19530 -1031 7275 12083
22783 12083 8517 -1951 -12094 -22307 -16029 2977 36416 57604 58011 27083 27803 8477 -15094
$$ packed form
22870a8223L4141L633K227j6038l0226l6681Q300L7126J1127j884K7505J6072
22858C7079k3455k212R683n463J2584j624j0136J918Q026J4455K7400K1132m2236
22845D7151l8171J5588o149n124O809q515L515k4060l4653K7673M2655j2505L7769
22832E1983K1539k8520j7400l4341k749m7178j1696M3058j9497k4819m273M4095
22820b9798J4844m5026J916L5340J9604k0458l897Q755l060k1810j7697J4783
22808d6504r478J9185M1648M3540r960l5109j2104J8198P047j3755L755K1280
22796B7743P915R865m3259j3317J2564J3011j0132p158o514j0248J8499Q306M808
22783A2083l566j0468j0143j0213O278J9006L3439K1188M07l0928P20j9326k3571
$$ plain form
22770 -15094 -12120 652 -25033 1944 -22674 -73226 -82227 -85369 -54467 -27893 -6724 4568
22758 4568 12479 8481 -16535 5669 11828 22294 2125 15574 26158 36060 40656 16008 24866
22745 24866 15308 -45471 -57280 -22633 -6538 8801 4863 5541 8533 6326 19123 4219 -25195
22732 -25195 -38645 -4031 22551 30706 23595 13413 10048 6357 -21244 -54987 -38140 -4782
22720 -4782 20568 18069 11837 1593 5989 -10777 28591 35277 6371 -16350 -52351 -52922 -33592
22707 -33592 -15583 -34988 -18167 18485 54474 46221 17780 -10464 -313 -9507 -37376 -41929
22695 -41929 -17934 4223 16724 -22609 -23688 -23862 -37775 -30968 -14908 -11255 -13074 -6100 3256
22682 3256 -16924 -16808 4935 27466 30795 4965 2796 -1910 -14693 -7311 -4417 4123 12866 -16439
$$ packed form
22770a5094K974J2772k5685K6977k4618n0552r001l142L0902K6574K1169J1292
22758D568P911l998k5016K2204O159J0466k0169J3449J0584R902M596k4648Q858
22745B4866r558o0779j1809L4647J6095J5339l938O78K992k207J2797j4904k9414
22732b5195j3450L4614K6582Q155p111j0182l365l691k7601l3743J6847L3358
22720d782K5350k499o232j0244M396j6766L9368O686k8906k2721l6001n71J9330
22707c3592J8009j9405J6821L6652L5989q253k8441k8244J0151r194k7869m553
22695d1929K3995K2157J2501l9333j079j74j3913O807J6060L653j819O974R356
22682C256k0180J16K1743K2531L329k5830k169m706j2783P382K894Q540Q743k9305
$$ plain form
22668 -16439 -39052 -11716 -16921 -24327 -18610 -10558 12508 -2785 -13637 14748 28230 41061
22656 41061 39231 38337 58357 73074 77725 29281 15381 17517 4685 6855 8812 35790 27324
22643 27324 1741 -17463 -184 18947 6714 27054 59409 31203 17273 17150 7625 -12564
22631 -12564 -7134 8514 -4443 -2758 -3380 -25994 -554 10655 -873 -15509 -21857 -8309 -12335
22618 -12335 -32714 -41462 -50352 -75633 -109576 -104958 -56302 -53037 1513 49585 37675 36861 11290
22605 11290 -15382 -20943 -23051 -30212 -38641 -14406 31999 47578 18425 -8307 -6962 13124 24581
22592 24581 13762 28534 31582 52028 99091 99767 54757 35943 23968 24980 8049 31032
22580 31032 32515 24497 -2140 3719 10748 29435 21388 2344 -26306 -6000 18175 -2506 -456
$$ packed form
22668a6439k2613K7336n205p406N717Q052K3066j5293j0852K8385J3482J2831
22656D1061j830q94K0020J4717M651m8444j3900K136j2832K170J957K6978q466
22643B7324k5583j9204J7279J9131j2233K0340L2355k8206j3930j23r525k0189
22631a2564N430J5648j2957J685o22k2614K5440J1209j1528j4636o348J3548m026
22618a2335k0379q748q890k5281l3943M618M8656L265N4550M8072j1910q14k5571
22605A1290k6672n561k108p161q429K4235M6405J5579k9153k6732J345K0086J1457
22592B4581j0819J4772L048K0446M7063O76m5010j8814j1975J012j6931K2983
22580C1032J483q018k6637N859P029J8687q047j9044k8650K0306K4175k0681K050
$$ plain form
22567 -456 4161 -28416 -36853 -50336 -39396 -9974 5827 -1218 -20531 -34558 -26603 -5918 -12495
22554 -12495 -23294 -12783 13725 30994 18544 10990 41617 48316 26841 28309 41661 25229
22542 25229 -14196 -37254 -34837 257 8653 35826 28891 3266 16043 27909 47456 61202
22530 61202 30451 -20 4544 24366 13620 -5208 -17722 -25928 -16831 -37503 -32604 -43119
22518 -43119 -28987 -20399 -22559 9824 -14129 -60949 -59497 -37546 -17989 21167 28840 14352
22506 14352 -18010 -50804 -48435 -43884 -47134 -41813 -26392 12640 34801 -11125 -11083 11094 -3284
22493 -3284 -23447 -13690 4493 12838 5196 -2376 -25678 -19280 -5964 -6311 16177 -16908 -28091
22480 -28091 -9594 6377 -6861 -29601 -35857 -17019 -36616 -52486 -79365 -74682 -41183 -14759
$$ packed form
22567d56M617l2577q437j3483J0940K9422J5801p045j9313j4027P955K0685o577
22554a2495j0799J0511K6508J7269j2450p554L0627O699k1475J468J3352j6432
22542B5229l9425k3058K417L5094Q396K7173o935k5625J2777J1866J9547J3746
22530F1202l0751l0471M564J9822j0746j8828j2514q206R097k0672M899j0515
22518d3119J4132Q588k160L2383k3953m6820J452K1951J9557L9156P673j4488
22506A4352l2362l2794K369M551l250N321J5421L9032K2161m5926M2K2177j4378
22493c284k0163R757J8183Q345p642p572k3302O398J3316l47K2488l3085j1183
22480b8091J8497J5971j3238k2740o256J8838j9597j5870k6879M683L3499K6424
$$ plain form
22468 -14759 2961 -13971 -44742 -44086 -26581 -6687 -29178 -14765 -16884 -21952 16439 52255
22456 52255 18059 -16354 -12276 -32594 -43527 -19084 -28363 -30414 -4929 306 -14307 10153
22444 10153 -10710 -9978 907 8064 -9611 -7855 16242 51393 55831 36230 19321 14988 6719
22431 6719 221 23289 44340 38207 17020 598 -24664 -14416 38257 40542 31957 45373 31438
22418 31438 21708 -11841 -27163 6135 35266 32979 15321 36704 46601 44542 24074 -12276
22406 -12276 -52443 -69564 -43852 -24255 281 3612 -10850 -6657 11942 10382 26535 -217
22394 -217 -20083 5763 2609 -21320 -43924 -88406 -87267 -70765 -39059 -42271 -33017 -6301 -4663
22381 -4663 -10790 -4096 5825 -8713 -22682 -8325 -4209 -11985 5065 10953 23016 -1811 -36174
$$ packed form
22468a4759J7720j6932l0771O56J7505J9894k2491J4413k119n068L8391L5816
22456E2255l4196l4413M078k0318j0933K4443r279k051K5485N235j4613K4460
22444A0153k0863P32J0885P157j7675J756K4097L5151M438j9601j6909m333q269
22431F719o498K3068K1051o133k1187j6422k5262J0248N2673K285q585J3416j3935
22418C1438r730l3549j5322L3298K9131k287j7658K1383R897k059k0468l6350
22406a2276m0167j7121K5712J9597K4536L331j4462M193J8599j560J6153k6752
22394b17j9866K5846l154k3929k2604m4482J139J6502L1706l212R254K6716J638
22381d663o127O694R921j4538j3969J4357M116p776J7050N888J2063k4827l4363
$$ plain form
22368 -36174 -34850 -40459 -61376 -32010 -29932 -24876 -13001 1628 20629 37774 18048 17808 15360
22355 15360 36562 37125 14953 5643 -564 12270 6303 -22283 -47479 -58803 -66409 -47624 -11613
22342 -11613 -8167 -31136 -31771 -30375 -30838 -44228 -39293 19861 43477 49284 42290 25661 24422 -17394
22328 -17394 -31059 -20900 -7900 -11354 -531 34231 40141 25208 34769 21423 14066 2652
22316 2652 -12001 -10511 7290 11541 6944 -1269 3267 7507 -22463 -30658 17113 38701 25334
22303 25334 2577 -4083 1391 17806 2545 -12808 -9686 -13615 -3671 2827 -26235 -27314 -34522
22290 -34522 -38501 -30639 -10876 6347 7703 -25491 -24625 -13051 -13882 -4436 -9492 -16544 -34779 -13844
22276 -13844 -13043 5475 -1480 -52076 -45995 -34159 -51685 -34507 -3162 -13446 -24992 -23998 -18273
$$ packed form
22368c6174J324n609k0917K9366K078N056J1875J4629J9001J7145j9726k40k448
22355A5360K1202N63k2172r310o207J2834n967k8586k5196j1324p606J8785L6011
22342a1613L446k2969o35J396m63j3390M935N9154K3616N807o994j6629j239m1816
22328a7394j3665J0159J3000l454J0823L4762N910j4933R561j3346p357j1414
22316B652j4653J490J7801M251m597q213M536M240k9970q195M7771K1588j3367
22303B5334k2757o660N474J6415j5261j5353L122l929R944O498k9062j079p208
22290c4522l979P862J9763J7223J356l3194Q66J1574q31R446n056p052j8235K0935
22276a3844Q01J8518o955n0596O081J1836j7526J7178L1345j0284j1546R94N725
$$ plain form
22263 -18273 -8959 -1630 -11650 -4830 -140 -1764 -26104 -24067 -23409 -31556 -11135 13195 7364 11126
22249 11126 14671 -761 -30624 -28377 -20142 913 6871 -14116 -10395 11727 20998 49280 38027
22236 38027 25713 28360 37248 73463 80276 71274 14740 -14301 -24798 -13436 -29239 -72139
22224 -72139 -81007 -60839 -22682 31423 34122 20589 9108 4873 -174 1284 -25083 -34607 -32114
22211 -32114 -30060 -34098 -44284 -38808 -41978 9055 45091 75250 57782 36241 29875 50912 58014
22198 58014 30631 -12976 -23328 -26416 -1153 3409 25176 -74 -2281 -6099 -3704 -21192 -9821
22185 -9821 -371 1100 8627 124 -11402 -6884 -13734 -18691 -31685 -37196 -45699 -41605 -23170 -21183
22171 -21183 -2411 -7656 7730 20992 6848 25868 19293 14839 21982 7938 -24096 -35907
$$ packed form
22263a8273R314P329j0020O820M690j624k4340K037O58q147K0421K4330n831L762
22249A1126L545j5432k9863K247Q235K1055N958k0987L721K2122R271K8282j1253
22236C8027j2314K647Q888L6215O813r002n6534k9041j0497J1362j5803m2900
22224g2139q868K0168L8157N4105K699j3533j1481m235n047J458k6367r524K493
22211c2114K054m038j0186N476l170N1033L6036L0159j7468k1541o366K1037P102
22198E8014k7383m3607j0352l088K5263M562K1767k5250k207l818K395j7488J1371
22185i821R450J471P527q503j1526M518o850m957j2994n511q503M094J8435J987
22171b1183J8772n245J5386J3262j4144J9020o575m454P143j4044l2034j1811
$$ plain form
22159 -35907 -14858 -13133 11222 36108 41222 42413 42872 32531 11735 2735 12847 13173 -2896
22146 -2896 -16529 -7538 -19081 -46135 -54429 -53064 -39172 -20104 816 18018 -2098 -2891 -18541
22133 -18541 -34009 -16090 12874 32560 25083 47383 34616 35856 26898 8630 7273 -17208
22121 -17208 -18639 -34637 -21862 10464 12839 21273 30231 6429 34068 48777 54714 49621 25668
22108 25668 4231 9423 3965 16018 13670 31938 43773 32692 40237 -1034 -672 -8154 -36349
22095 -36349 -33565 -9337 -4356 1818 13268 30848 17496 22631 4098 25657 39929 -1251
22083 -1251 -39690 10539 27099 23737 49944 61189 48645 3808 -13691 -21305 -23151 -1072
22071 -1072 -29176 -9193 5818 16460 2154 3396 -14550 5022 263 3180 26193 43015
$$ packed form
22159c5907K1049J725K4355K4886N114J191M59j0341k0796r000J0112L26j6069
22146b896j3633Q991j1543k7054q294J365J3892J9068K0920J7202k0116p93j5650
22133a8541j5468J7919K8964J9686p477K2300j2767J240q958j8268j357k4481
22121a7208j431j5998J2775L2326K375Q434Q958k3802K7639J4709N937n093k3953
22108B5668k1437N192n458J2053k348J8268J1835j1081P545m1271L62p482k8195
22095c6349K784K4228M981O174J1450J7580j3352N135j8533K1559J4272m1180
22083a251l8439N0229J6560l362K6207J1245j2544m4837j7499p614j846K2079
22071a072k8104J9983J5011J0642j4306J242j7946J9572m759K917K3013J6822
$$ plain form
22059 43015 7889 7146 -2270 27547 52273 60701 54950 20932 6579 23513 19317 -5801 -552
22046 -552 -10437 -23299 -857 7565 -5742 -27737 -26428 -21269 -22935 -10677 9860 21004 35751
22033 35751 31694 39513 21234 -7241 -26361 -35338 -24304 -14525 -6758 16746 10865 15526 6567
22020 6567 27668 28818 11134 -1199 269 28117 38944 35269 35632 24931 -16261 -6764 -1113
22007 -1113 -29860 -28464 -17804 -18598 -18611 4575 -678 -6157 -5629 6932 -4293 -25435 -21291 -33063
21993 -33063 -5877 16359 23533 16178 -21130 -47265 -24421 1757 51439 29771 -18006 -53086
21981 -53086 -62724 -29132 16600 18912 -11115 -32512 -46288 -35570 -6567 25503 30535 49484
21969 49484 69856 65398 33215 -2775 -17457 -39335 -43395 -36144 -3301 -15115 -38242 -26176
$$ packed form
22059D3015l5126p43r416K9817K4726Q428n751l4018j4353J6934m196k5118N249
22046e52r885j2862K2442Q422j3307k1995J309N159j666J2258K0537J1144J4747
22033C5751m057P819j8279k8475j9120q977J1034R779P767K3504n881M661q959
22020F567K1101J150j7684j2333J468K7848J0827l675L63j0701m1192R497N651
22007a113k8747J396J0660p94j3K3186n253n479N28J2561j1225k1142M144j1772
21993c3063K7186K2236P174p355l7308k6135K2844K6178M9682k1668m7777l5080
21981e3086r638L3592M5732K312l0027k1397j3776J0718K9003L2070N032J8949
21969D9484K0372m458l2183l5990j4682k1878m060P251L2843j1814k3127J2066
$$ plain form
21957 -26176 -4771 10175 47224 46190 37692 9222 -22253 -15234 -18616 -44402 -46352 -22378 -8897
21944 -8897 3896 8900 -19556 -34899 -24671 -27684 -52760 -41615 1456 51546 57810 48419 9635
21931 9635 -13077 1219 -153 -624 -2185 -3525 2714 18379 27209 24730 24876 -4858 -20429 -23500
21917 -23500 -12551 -7327 -9891 -32786 -45087 -845 -8202 -11374 13076 6384 16500 -3770 9422
21904 9422 40482 51364 33973 -11208 -30887 -56409 -15636 -3225 3663 18177 59994 55297
21892 55297 35058 5382 -39255 -27196 -16148 -9568 5578 -3095 -29404 -47496 -61880 -64373
21880 -64373 -67629 -54606 -50225 -56306 -61254 -43098 -27105 -12224 -11856 -21942 -29727 -73861 -60461
21867 -60461 -47700 -52439 -46821 -39923 -19433 7915 1187 -30195 -46569 -26248 11466 35772
$$ packed form
21957b6176K1405J4946L7049j034q498k8470l1475P019l382k5786j950K3974J3481
21944h897J2793N004k8456j5343J0228l013k5076J1145M3071N0090O264r391l8784
21931I635k2712J4296j372m71j561j340O239J5665Q830k479J46k9734j5571l071
21917b3500J0949N224k564k2895j2301M4242p357l172K4450o692J0116k0270J3192
21904I422L1060J0882j7391m5181j9679k5522M0773J2411O888J4514M1817m697
21892E5297k0239k9676m4637J2059J1048O580J5146q673k6309j8092j4384k493
21880f4373l256J3023M381o081m948J8156J5993J4881L68j0086p785m4134J3400
21867f0461J2761m739N618O898K0490K7348o728l1382j6374K0321L7714K4306
$$ plain form
21855 35772 10239 -22235 -11032 -5478 -14175 -32754 -45173 -40316 -13392 15379 11807 -23883
21843 -23883 -36048 -18085 -36439 -55549 -30057 -43688 -45032 -19036 5805 23249 38641 49196
21831 49196 25825 3405 -26009 -32945 -25495 -32359 -31292 -29416 -5244 6598 4177 -9160 -4544
21818 -4544 12873 6852 -15622 -33102 -32858 -60452 -66101 -30225 2786 -2722 -18836 -28365 -19227
21805 -19227 -20873 -27016 -5101 35054 34369 -10037 -28415 -12114 2250 35149 26240 13618 17414
21792 17414 -19737 -41472 -31787 10801 43220 31108 24033 18268 4628 -9371 -4235 12146
21780 12146 17620 19464 7199 40549 44605 -3689 -44532 -45446 -47961 -51296 -26299 8398 24084
21767 24084 17530 -7439 -10676 -10096 -16145 10650 -2091 -25174 -35774 -11636 -39019 -58585 -47443
$$ packed form
21855C5772k5533l2474J1203N554q697j8579j2419M857K6924K8771l572l5690
21843b3883j2165J7963j8354j9110K5492j3631j344K5996K4841J7444J5392J0555
21831D9196k3371k2420k9414o936P450o864J067J876K4172J1842k421j3337M616
21818d544J7417o021k2474j7480K44k7594n649L5876L3011n508j6114r529R138
21805a9227j646o143K1915M0155o85m4406j8378J6301J4364L2899q909j2622L796
21792A7414l7151k1735R685M2588L2419j2112p075n765j3640j3999N136J6381
21780A2146N474J844j2265L3350M056m8294m0843r14k515l335K4997L4697J5686
21767B4084o554k4969l237N80o049K6795j2741k3083j0600K4138k7383j9566J1142
$$ plain form
21754 -47443 -31485 -51453 -60677 -43866 -11713 -5597 -38879 -53787 -26360 -7226 -5631 6277
21742 6277 12150 -9564 -34777 -55415 -64894 -73022 -73867 -58773 -52309 -34237 -26331 -34612 -37056 -24100
21728 -24100 23091 19144 -2595 4981 10113 14334 32602 15799 -3340 -20109 -19189 -22443 -30459
21715 -30459 -27839 -25179 -45624 -50616 -20983 481 -3223 -15835 -26562 -12042 -23849 -3631
21703 -3631 43850 42303 16822 -9833 -3187 1128 3671 16147 11952 15513 26562 28702 22001
21690 22001 39610 -1525 -40194 -36875 1572 7543 -160 -18226 -3715 17457 -35 -22274
21678 -22274 -4784 -2233 -21822 8733 38673 58743 52331 47944 32875 3030 -24560 -2124
21666 -2124 -1874 -51284 -52530 -47479 -26999 670 19600 13961 4422 9891 40158 54435 37816
$$ packed form
21754d7443J5958j9968r224J6811L2153O116l3282j4908K7427J9134J595J1908
21742F277N873k1714k5213k0638r479q128q45J5094O464J8072P906q281k444J2956
21728b4100M7191l947k1739P576N132M221J8268j6803j9139j6769R20l254q016
21715c0459K620K660k0445m992K9633K1464l704j2612j0727J4520j1807K0218
21703c631M7481j547k5481k6655O646M315K543J2476m195L561J1049K140o701
21690B2001J7609m1135l8669L319L8447N971p703j8066J4511K1172j7492k2239
21678b2274J7490K551j9589L0555K9940K0070o412m387j5069k9845k7590K2436
21666b124K50m9410j246N051K0480K7669J8930n639r539N469L0267J4277j6619
$$ plain form
21653 37816 30688 18565 -6441 -23628 -30802 -37566 -24244 -23395 -16408 -39490 -52395 -51261 -20439
21640 -20439 -9166 -20895 -7004 4224 15116 3131 -6011 10227 16851 19796 62596 45511
21628 45511 -5795 -18634 -25234 -37868 -25226 -24901 -11182 -21499 -21872 8540 7832 -15487 -18968
21615 -18968 -19012 -16956 -8530 -36634 -11804 11223 7977 5817 -6715 -14455 -11765 -28216 -9709
21602 -9709 18806 13818 24571 5778 -21711 -17634 -31566 17561 30118 -8644 -41507 -41305 -9765
21589 -9765 29606 52369 2203 1519 -17956 -40381 -49734 -59948 -41258 1762 20316 3717
21577 3717 -36734 -3764 30609 36878 23625 -22365 -42452 -4543 30994 16442 -5936 -26207
21565 -26207 -32857 -5962 -6455 -8599 11239 18817 24486 25966 18492 5571 -775 -23389 -18203 5902
$$ packed form
21653C7816p128j2123k5006j7187p174o764J3322Q49O987k3082j2905J134L0822
21640b0439J1273j1729J3891J1228J0892j1985r142J6238O624K945M2800j7085
21628D5511n1306j2839o600j2634J2642L25J3719j0317l73L0412p08k3319l481
21615a8968m4K056Q426k8104K4830K3027l246k160j2532p740K690j6451J8507
21602i709K8515m988J0753j8793k7489M077j3932M9127J2557l8762l2863K02L1540
21589i765L9371K2763n0166o84j9475k2425r353j0214J8690M3020J8554j6599
21577C717m0451L2970L4373O269j3253m5990k0087L7909L5537j4552k2378k0271
21565b6207o650K6895m93k144J9838P578N669J480p474j2921o346k2614N186K4105
$$ plain form
21551 5902 13688 -3151 -35284 -39191 -18464 5280 12316 19950 40033 9817 -17978 -24336 -24179
21538 -24179 1473 28595 49032 57819 46799 33834 57383 54543 42848 4474 -20315 -21140
21526 -21140 29370 21447 -6705 -28631 -35396 -19504 -28908 -37436 -48266 -40408 -37309 -32028 -13532
21513 -13532 -16716 -33895 -27267 -35448 -10413 -18448 -14403 -52866 -22925 -2897 28470 13223 -433
21500 -433 -16321 -16376 -20356 -3670 5129 21391 31239 20789 -5645 -9546 4472 16802 4370
21487 4370 16426 7329 -8298 5661 27839 30681 12379 13327 47524 44759 11616 6874 29579
21474 29579 56228 46999 70118 84925 59790 11664 5378 -19595 -43226 -10206 2009 -13786
21462 -13786 -10621 17556 -3781 -24720 -29123 7888 8556 9615 16355 10731 13900 8315 721 9130
$$ packed form
21551E902P786j6839l2133l907K0727K3744P036P634K0083l0216k7795o358J57
21538b4179K5652K7122K0437Q787j1020j2965K3549k840j1695l8374k4789q25
21526b1140N0510p923k8152k1926o765J5892r404q528j0830P858L099N281J8496
21513a3532l184j7179O628q181K5035q035M045l8463K9941K0028L1367j5247j3656
21500d33j5888n5l980J6686Q799J6262R848j0450k6434l901J4018J2330j2432
21487D370J2056r097j5627J3959K2178K842j8302R48L4197k765l3143m742K2705
21474B9579K6649r229K3119J4807k5135m8126o286k4973k3631L3020J2215j5795
21462a3786L165K8177k1337k0939m403L7011O68J059O740n624L169n585p594Q409
$$ plain form
21448 9130 26319 -17006 -22782 5872 20145 40911 50016 41775 5000 1680 -9912 -12180 -14205
21435 -14205 -13664 -50501 -85068 -60847 -20196 -34287 -57562 -45919 -20772 -12151 -32496 -17443
21423 -17443 1813 -7846 -13541 -21394 -8992 -18925 -22946 -32804 -13476 14700 -18055 -24787 -1384
21410 -1384 -6394 -21114 -27424 -2774 15278 29253 57222 57725 60719 35903 22524 -2745 -41317
21397 -41317 -35156 5721 10973 -44837 -50389 -23771 7632 29810 18264 13 -8729 2574
21385 2574 15727 -2555 8262 21544 50035 32172 18940 21907 33786 31039 12621 -13077
21373 -13077 -10232 44813 49319 44184 31039 -13994 -30517 -31037 -48136 -13367 -21416 -39732 -60153
21360 -60153 -52828 -24150 5858 56107 73509 40277 12726 27268 3799 -8012 -14516 -24753
$$ packed form
21448I130J7189m3325n776K8654J4273K0766R105q241l6775l320j1592k268k025
21435a4205N41l6837l4567K4221M0651j4091k3275J1643K5147Q621k0345J5053
21423a7443J9256r659n695p853J2402r933m021r858J9328K8176l2755o732K3403
21410a384n010j4720o310K4650J8052J3975K7969N03K994k4816j3379k5269l8572
21397d1317O161M0877N252n5810n552K6618L1403K2178j1546j8251q742J1303
21385B574J3153j8282J0817J3282K8491j7863j3232K967J1879k747j8418k5698
21373a3077K845N5045M506n135j3145m5033j6523n20j7099L4769q049j8316k0421
21360f0153P325K8678L0008N0249J7402l3232k7551J4542k3469j1811o504j0237
$$ plain form
21348 -24753 -37411 -17134 -5253 -717 -11398 -28118 -17880 -15165 -18969 -3180 7826 248
21336 248 -1969 9495 15055 -9498 -35380 -42804 -45709 -31400 743 38477 22151 21961 30704
21323 30704 16240 2914 -8040 -23357 -20690 10399 1857 -45275 -59678 -16684 14349 21753
21311 21753 19467 19113 1727 15177 14303 12871 25473 36073 14144 9031 40477 36920 38000
21298 38000 43467 -866 -14706 -4805 966 6692 5733 2064 7253 -28753 -48148 -53046 -42422
21285 -42422 -30422 -32932 -49468 -25326 -20484 -3912 -10120 -45951 -42103 -28167 -45062 -18163
21273 -18163 2399 7849 29031 37085 30860 15410 20182 11532 9123 7671 -6532 18644 34696
21260 34696 21594 12142 -33 -10254 4334 19543 -4387 -19145 -3940 9965 24857 46636
$$ packed form
21348b4753j2658K0277J1881M536j0681j6720J0238K715l804J5789J1006p578
21336B48k217J1464N560k4553k5882p424k905J4309L2143L7734j6326j90Q743
21323C0704j4464j3326j0954j5317K667L1089q542m7132j4403M2994L1033P404
21311B1753k286l54j7386J3450q74j432J2602J0600k1929n113L1446l557J080
21298C8000N467m4333j3840R901N771N726r59l669N189l6006j9395m898J0624
21285d2422J2000k510j6536K4142M842J6572o208l5831L848J3936j6895K6899
21273a8163K0562N450K1182Q054o225j5450M772q650k409j452j4203K5176J6052
21260C4696j3102r452j2175j0221J4588J5209k3930j4758J5205J3905J4892K1779
$$ plain form
21248 46636 27780 12832 34068 30215 -13704 -23213 -15233 13367 12872 12876 25417 15478 7322 -7264
21234 -7264 6549 34515 42661 30231 63400 47633 43834 52358 37618 24199 34680 19166
21222 19166 11585 -7930 -9601 -23427 -3706 31240 18276 1322 -27116 -32729 -23898 2256
21210 2256 16051 30428 29683 65039 68027 33010 14299 19448 26653 -828 -17395 -2398 23603
21197 23603 38491 55450 46932 32320 29798 6706 -13777 18667 37986 45267 60980 43263
21185 43263 31604 908 -1330 9678 1196 -12082 -5050 14199 23962 9831 19221 -5543 -17924
21172 -17924 -11850 2689 12633 10822 28800 3633 -23421 -35791 -7911 21741 38152 51812
21160 51812 35772 11389 -5990 1218 11223 2922 15610 -2273 -16593 -35094 -24496 -19795
$$ packed form
21248D6636j8856j4948K1236l853m3919r509P980K8600m95MJ2541r939q156j4586
21234g264J3813K7966Q146j2430L3169j5767l799Q524j4740j3419J0481j5514
21222A9166p581j9515j671j3826J9721L4946j2964j6954k8438n613Q831K6154
21210B256J3795J4377p45L5356K988l5017j8711N149P205k7481j6567J4997K6001
21197B3603J4888J6959q518j4612k522k3092k0483L2444J9319P281J5713j7717
21185D3263j1659l0696k238J1008q482j3278P032J9249R763j4131R390k4764j2381
21172a7924O074J4539R944j811J7978k5167k7054j2370K7880K9652J6411J3660
21160E1812j6040k4383j7379P208J0005q301J2688j7883j4320j8501J0598M701
$$ plain form
21148 -19795 3953 14153 -12095 -12960 -5271 -14118 -35159 -5550 23414 -573 -14065 -3288
21136 -3288 -6102 9094 39019 54329 47765 26511 939 -31221 -10890 -1178 -14096 26449
21124 26449 50676 8803 -18617 -13849 1927 21754 19813 10782 5619 -19610 -1833 -19306
21112 -19306 -25236 10936 17383 -2345 -25760 -27566 -13465 -28148 -59081 -21152 2001 14659
21100 14659 16218 24807 38633 52211 30447 26433 22010 22986 25433 -5407 -8486 -86 -8326 16672
21086 16672 27568 20348 34754 39141 2041 -21631 16491 41859 57812 49350 53870 56494 36124
21073 36124 6540 -20365 -37107 -54781 -41486 -27204 -10609 9075 27478 55403 41791 7782
21061 7782 -30090 -5565 33238 15048 -897 12361 -622 -40162 -66591 -51062 -3824 38312
$$ packed form
21148a9795K3748J0200k6248q65P689q847k1041K9609K8964k3987j3492J0777
21136c288k814J5196K9925J5310o564k1254k5572l2160K0331R712j2918M0545
21124B6449K4227m1873k7420M768J5776J9827j941r031n163k5229J7777j7473
21112a9306n930L6172O447j9728k3415j806J4101j4683l0933L7929K3153J2658
21100A4659J559Q589J3826J3578k1764m014m423R76K447l0840l079Q400q240K4998
21086A6672J0896p220J4406M387l7100k3672L8122K5368J5953q462M520K624k0370
21073C6124k9584k6905j6742j7674J3295J4282J6595J9684J8403K7925j3612l4009
21061G782l7872K4525L8803j8190j5945J3258j2983l9540k6429J5529M7238M2136
$$ plain form
21049 38312 50894 36305 -6656 1988 -531 4941 29411 4216 1688 31411 43002 43186 18703
21036 18703 -12927 -41048 -7097 19291 7494 -11095 3463 -602 -33147 -40078 -11153 4715
21024 4715 3626 -10684 -20120 -10858 -14903 -22429 -33075 -43530 -57152 -54526 -14249 6466 6629
21011 6629 25235 39020 8090 -10539 -18770 -36659 -43224 -32323 -50034 -58257 -44213 -42091 -46894
20998 -46894 -34172 -23786 -26691 -14405 10876 28429 52480 47470 36200 29529 75750 82830
20986 82830 64798 39358 54401 77305 64185 43764 37373 45059 37829 35755 43672 54846 15645
20973 15645 -8683 -25844 -39133 -49127 -47552 -33011 -28805 -16561 -19140 -50032 -70570 -78160 -75274
20960 -75274 -53801 -66664 -64335 -59728 -35085 -590 3065 2891 1119 -2112 -48736 -93714 -66424
$$ packed form
21049C8312J2582j4589m2961Q644k519N472K4470k5195k528K9723J1591J84k4483
21036A8703l1630k8121L3951K6388j1797j8589J4558m065l2545o931K8925J5868
21024D715j089j4310r436R262m045p526j0646j0455j3622K626M0277K0715J63
21011F629J8606J3785l0930j8629q231j7889o565J0901j7711q223J4044K122m803
20998d6894J2722J0386k905J2286K5281J7553K4051n010j1270o671M6221P080
20986H2830j8032k5440J5043K2904j3120k0421o391P686p230k074P917J1174l9201
20973A5645k4328j7161j3289r994J575J4541M206J2244k579l0892k0538p590K886
20960g5274K1473j2863K329M607K4643L4495L655j74j772l231m6624m4978K7290
$$ plain form
20947 -66424 -24750 -28350 -18551 -18986 -2666 22472 13621 58 5488 6644 18046 13716 5405
20934 5405 -21471 2195 27250 24026 49362 27642 12537 -6791 -21260 10034 26894 -329
20922 -329 14854 28435 32070 32802 53867 73186 65751 36293 40196 39800 50465 61509 77145
20909 77145 58673 47546 12927 -6788 -14419 3698 11720 -15610 -4545 2277 -1755 -3551 -5704
20896 -5704 5000 17963 -733 3119 35907 55486 38392 8556 25513 15947 21784 23463 24509
20883 24509 17407 32033 6031 9554 4765 15225 22036 13427 14871 -5390 2747 22339 17324
20870 17324 26623 42987 57910 19924 11218 1260 36698 54542 15877 -19075 -41092 -58861
20858 -58861 -54267 -10986 -8712 -18718 -35771 -27859 -9835 -25081 -19720 -1698 12665 21959 11499
$$ packed form
20947f6424M1674l600R799m35J6320K5138q851j3563N430J156J1402m330q311
20934E405k6876K3666K5055l224K5336k1720j5105j9328j4469L1294J6860k7223
20922c29J5183J3581L635P32K1065J9319p435k9458L903l96J0665J1044J5636
20909G7145j8472j1127l4619j9715p631J8117Q022k7330J1065O822m032j796k153
20896e704J0704J2963j8696L852L2788J9579j7094k9836J6957r566N837J679J046
20883B4509p102J4626k6002L523m789J0460O811q609J444k0261Q137J9592n015
20870A7324R299J6364J4923l7986q706r958L5438J7844l8665l4952k2017j7769
20858e8861M594M3281K274j0006j7053P912J8024j5246N361J8022J4363R294j0460
$$ plain form
20845 11499 -24766 3835 5995 -3283 -2770 -4773 16475 52557 19220 -21142 -12014 16256 18431
20832 18431 19694 1812 592 1210 5164 -8501 -5722 -2167 9417 29155 41895 33363 -1355
20819 -1355 -12370 7443 24806 22565 3665 2199 16688 -22215 -23899 -8689 -13711 -11541 -3908
20806 -3908 5626 -4192 792 517 37977 46910 21357 6184 -2853 -7111 -17479 -33225 -48932
20793 -48932 -56548 -34410 -54052 -38259 -728 -12089 5237 26203 2992 -2283 13415 -3540
20781 -3540 4170 22611 14375 -14428 -2149 25625 29320 -2715 -18385 -19947 4187 14704 -2211
20768 -2211 -3022 12321 -7841 -22396 9630 23371 -4023 -10225 1468 24573 19306 2289 -9623
20755 -9623 -24163 -21701 18717 29438 36415 29783 -14472 -16100 12229 37343 51655 70268 43510
$$ packed form
20845A1499l6265K8601K160r278N13k003K1248L6082l3337m0362R128K8270K175
20832A8431J263j7882j220O18L954j3665K779L555J1584J9738J2740q532l4718
20819a355j1015J9813J7363k241j8900j466J4489l8903j684J5210n022K170P633
20806c908R534r818M984k75L7460Q933k5553j5173r037m258j0368j5746j5707
20793d8932p616K2138j9642J5793L7531j1361J7326K0966k3211n275J5698j6955
20781c540P710J8441q236k8803J2279K7774L695l2035j5670j562K4134J0517j6915
20768b211q11J5343k0162j4555L2026J3741k7394o202J1693K3105n267j7017j1912
20755i623j4540K462M0418J0721O977o632m4255j628K8329K5114J4312J8613k6758
$$ plain form
20742 43510 29011 16092 6295 4614 9677 21590 36752 53367 37385 24594 37875 54271
20730 54271 36545 46195 73705 64678 32278 16411 -358 361 6369 15688 -20846 -24585 -23500
20717 -23500 -4429 -16082 -29837 -31139 1698 9425 -6009 -22421 -8945 -11178 -24187 -15598
20705 -15598 15635 32127 20642 11270 21752 44193 61161 56110 50674 54511 49409 32074 36987
20692 36987 31259 10427 7489 27216 26544 -19705 -14162 5481 -5391 12444 35905 49907 25534
20679 25534 28522 21795 29936 10704 37717 68223 20106 -21156 -3842 -9711 -16165 -7193 -19033
20666 -19033 -26949 -4169 5448 521 13698 -21491 -31239 -30714 -16208 -13932 -4650 -15711 8331
20653 8331 34086 37007 53266 59370 56684 48353 9085 -21379 -45306 -33234 -21598 -32162 -36679
$$ packed form
20742D3510j4499j2919r797j681N063J1913J5162J6615j5982j2791J3281J6396
20730E4271j7726R650K7510r027l2400j5867j6769P19O008R319l6534l739J085
20717b3500J9071j1653j3755j302L2837P727j5434j6412J3476k233j3009Q589
20705a5598L1233J6492j1485r372J0482K2441J6968n051n436L837n102j7335M913
20692C6987n728k0832k938J9727o72m6249N543J9643j0872J7835K3461J4002k4373
20679B5534K988o727Q141j9232K7013L0506m8117m1262J7314n869o454Q972j1840
20666a9033p916K2780R617m927J3177l5189r748N25J4506K276R282j1061K4042
20653H331K5755K921J6259O104k686q331l9268l0464k3927J2072J1636j0564m517
$$ plain form
20640 -36679 -21232 -35946 -38728 -52416 -78973 -82210 -51365 -5258 4836 -15433 -14972 1493
20628 1493 -19214 -15472 9850 21362 7009 11184 21271 553 -28238 -29311 -16152 -12640 -28789
20615 -28789 -23170 -18830 7223 16391 19478 12030 33983 57643 19264 -15384 -1987 21038 -4067
20602 -4067 603 2326 -1639 10749 4484 -18746 11703 58773 64480 41715 21171 24306 11355
20589 11355 46697 59667 38600 41450 29325 31598 41251 56675 33415 1420 8228 12816 1066
20576 1066 3974 -3969 -18130 -25345 -24225 -14213 -986 -20322 -39647 -55487 -43718 -19662 -25354
20563 -25354 -50855 -33959 -9507 22407 6084 -2897 -12552 13633 26685 31381 37790 23048
20551 23048 3852 16409 61971 88481 56691 50881 37090 27473 -5509 -19407 -6300 27523
$$ packed form
20640c6679J5447j4714k782j3688k6557l237L0845M6107J0094k0269M61J6465
20628A493k0707L742K5322J1512j4353M175J0087k0718k8791j073J3159L512j6149
20615b8789N619M340K6053R168L087p448K1953K3660l8379l4648J3397K3025k5105
20602d067M670J723l965J2388o265k3230L0449M7070N707k2765k0544L135j2951
20589A1355L5342J2970k1067K850j2125K273R653J5424k3260l1995O808M588j1750
20576A066K908p943j4161p215J120J0012J3227j9336j9325j5840J1769K4056n692
20563b5354k5501J6896K4452L1914j6323q981r655K6185J3052M696O409j4742
20551B3048j9196J2557M5562K6510l1790n810j3791r617l2982j3898J3107L3823
$$ plain form
20539 27523 42408 22867 40524 37856 22860 4638 11795 12472 22742 10953 -4764 16812
20527 16812 18468 -1421 -9554 34297 59496 76662 63520 65298 57544 24235 -22463 -29551 -7678
20514 -7678 6036 16225 13410 14680 26479 -1489 3668 -4225 -15372 -25158 -28937 -49873 -34163
20501 -34163 -17287 -11395 -12729 11732 -7391 -18117 -3504 -16077 -21545 -20961 -22678 -16769 -13342
20488 -13342 24346 41583 18513 -3643 -74 28726 56018 44538 34304 17116 16524 10440
20476 10440 35726 61501 50735 24588 10322 6339 -2182 -8610 864 -9643 2483 51425
20464 51425 87319 82988 35811 10623 9896 4245 11635 26221 47259 78833 81439 51440 13751
20451 13751 20864 -8482 -31304 -43245 -37034 -34411 -28193 -32142 -36622 -17896 5191 34836 17780
$$ packed form
20539B7523J4885j9541J7657k668j4996j8222P157O77J0270j1789j5717K1576
20527A6812J656j9889q133M3851K5199J7166j3142J778p754l3309m6698p088K1873
20514g678J3714J0189k815J270J1799k7968N157p893j1147r786l779k0936J5710
20501c4163J6876N892j334K4461j9123j0726J4613j2573n468N84j717N909L427
20488a3342L7688J7237k3070k2156L569K8800K7292j1480j0234j7188n92o084
20476A0440K5286K5775j0766k6147j4266l983q521o428R474j0507J2126M8942
20464E1425L5894m331m7177k5188p27n651P390J4586K1038L1574K606k9999l7689
20451A3751P113k9346k2822j1941O211K623O218l949m480J8726K3087K9645j7056
$$ plain form
20438 17780 -7832 -4947 12657 20793 42415 59970 36943 48249 35444 29235 23887 24576 31308
20425 31308 30734 36654 -2264 -28902 -723 30667 42018 6601 -34143 -18793 9707 -597
20413 -597 -7160 23640 -13384 -13805 -7151 1009 8244 12115 55597 63482 43417 27687 41084 18187
20399 18187 -17026 -22599 -15107 -3463 17262 -992 14328 22335 14123 27944 -4755 -13088 124
20386 124 14038 31601 28956 20404 -15266 -22460 -15372 2723 9130 -1481 -4731 612 15691
20373 15691 8201 22710 17139 241 8860 31985 73199 57094 46902 29773 26430 45388
20361 45388 87314 98270 104608 100127 89660 67509 36939 18387 12375 17638 11740 -8090 1666
20348 1666 15473 22353 37028 22253 35284 32229 29033 43523 41780 28899 26773 56081 71922
$$ packed form
20438A7780k5612K885J7604Q136K1622J7555k3027J1306j2805o209n348O89O732
20425C1308n74N920l8918k6638K8179L1390J1351l5417m0744J5350K8500j0304
20413e97o563L0800l7024m21O654Q160P235L871M3482P885k0065j5730J3397k2897
20399A8187l5213n573P492J1644K0725j8254J5320Q007q212J3821l2699q333J3212
20386A24J3914J7563k645q552l5670p194P088J8095O407j0611l250N343J5079
20373A5691p490J4509n571j6898Q619K3125M1214j6105j0192j7129l343J8958
20361D5388M1926J0956O338m481j0467k2151l0570j8552o012N263n898j9830R756
20348A666J3807O880J4675j4775J3031l055l196J4490j743j2881k126K9308J5841
$$ plain form
20335 71922 35472 38504 56151 53390 37138 16686 3392 5306 13492 44683 35224 43474 1712
20322 1712 23329 17613 -11759 5319 197 3099 -10759 -14529 -22003 -23150 -46569 -43587 -29570
20309 -29570 -19846 -13142 -12986 8843 31022 34165 7777 12420 39662 29089 -3026 3561 -5168
20296 -5168 -8051 -7979 -5054 -12500 -45694 -51535 -48175 -27001 -16437 -8071 -4421 -13203 -10473 -25913
20282 -25913 -20876 45829 68984 53332 42611 50803 33140 14660 -6417 6014 18111 25926
20270 25926 14941 -13835 -4900 -3081 -2942 -17102 -13369 -2412 -3796 12477 28558 13948 2269
20257 2269 2852 -31998 -43029 -30490 -13877 2612 27557 18653 15542 12038 -3194 -26827 -37891
20244 -37891 -37645 -41684 -39005 -45187 -31676 -29460 -14457 13187 18889 36484 7928 10286 10570 18335
$$ packed form
20335G1922l6450L032J7647k761j6252k0452j3294J914Q186L1191r459Q250m1762
20322A712K1617n716k9372J7078n122K902j3858l770p474j147k3419K982J4017
20309b9570R724O704J56K1829K2179L143k6388M643K7242j0573l2115O587q729
20296e168k883P2K925p446l3194n841L360K1174J0564Q366L650q782K730j5440
20282b5913N037O6705K3155j5652j0721Q192j7663j8480k1077J2431J2097P815
20270B5926j0985k8776Q935J819J39j4160L733J0957j384J6273J6081j4610j1679
20257B269N83l4850j1031J2539J6613J6489K4945q904l111l504j5232k3633j1064
20244c7891K46m039K679o182J3511K216J5003K7644N702J7595k8556K358K84P765
$$ plain form
20230 18335 3574 -17552 -22191 21166 18704 24905 30985 48963 59383 56061 43265 37926 36425
20217 36425 28147 6281 -17053 403 7919 29379 20828 -2535 -39999 -45410 -84480 -52905
20205 -52905 -11526 -426 20621 22915 4680 -9048 -22728 -52230 -73882 -35701 24106 67896
20193 67896 51921 23064 22115 56853 87312 84835 57871 34043 48203 61624 56108 28401
20181 28401 -9303 1296 12342 33831 37985 53510 29160 9279 7921 2787 4391 4862 -5225
20168 -5225 -15680 -29600 -42236 -62894 -45625 -23187 -32311 -22431 -24129 -25648 -25688 -17590 -9469 9170
20154 9170 15918 7069 -13778 -2449 24344 35327 11646 -7371 30584 35149 21960 20911 -1141
20141 -1141 -785 5000 -20296 -30747 -36359 -27106 2148 15302 852 7338 6354 -14640 -10832 -9657
$$ packed form
20230A8335j4761k1126m639M3357k462O201O080J7978J0420l322j2796n339j501
20217C6425q278k1866k3334J7456P516K1460q551k3363l7464n411l9070L1575
20205e2905M1379J1100K1047K294j8235j3728j3680k9502k1652L8181N9807M3790
20193F7896j5975k8857r49L4738L0459k477k6964k3828J4160J3421n516k7707
20181B8401l7704J0599J1046K1489M154J5525k4350j9881j358n134J604M71j0087
20168e225j0455j3920j2636k0658J7269K2438r124R880j698j519m0Q098Q121J8639
20154I170O748q849k0847J1329K6793J0983k3681j9017L7955M565j3189j049k2052
20141a141L56N785k5296j0451n612R253K9254J3154j4450O486r84k0994L808J175
$$ plain form
20127 -9657 -31636 -35692 -32702 -14576 -5118 -18017 -32731 -49404 4131 14415 -22321 -34052
20115 -34052 -18449 -6116 -39023 -45754 -14908 19130 15244 15367 28629 60284 66530 24956 50472
20102 50472 71503 37055 5653 9777 10491 -10544 -10686 -18164 -8652 -10127 -20357 -5592 19242
20089 19242 -10111 -8028 21965 30839 35907 40034 45809 50847 67587 86332 82571 42765 17223
20076 17223 42455 28769 -10363 4924 8412 -4874 -12349 -8056 -10438 8111 28741 47668
20064 47668 65019 50964 33118 19619 -5688 36386 7991 -14345 3885 29682 38756 52794
20052 52794 53622 10756 7943 3785 14498 3005 2133 -2752 -10398 -6145 -932 8545 13441 -18087
20038 -18087 -4851 32570 36032 285 -5639 27987 40151 47440 54436 41202 17640 12461 -4253
$$ packed form
20127i657k1979m056K990J8126R458j2899j4714j6673N3535J0284l6736j1731
20115c4052J5603J2333l2907o731L0846L4038l886J23J3262L1655O246m1574K5516
20102E0472K1031l4448l1402M124P14k1035j42p478R512j475j0230J4765K4834
20089A9242k9353K083K9993Q874N068M127N775N038J6740J8745l761l9806k5542
20076A7223K5232j3686l9132J5287L488j3286p475M293k382J8549K0630J8927
20064D7668J7351j4055j7846j3499k5307M2074k8395k2336J8230K5797R074J4038
20052E2794Q28m2866k813m158J0713j1493q72m885p646M253N213R477M896l1528
20038a8087J3236L7421L462l5747n924L3626J2164P289O996j3234k3562n179j6714
$$ plain form
20025 -4253 -27134 -39939 -9866 3639 22588 59518 74861 52721 36463 19222 6327 19612
20013 19612 1364 -12866 -17 488 -14101 -20584 8610 44478 52127 6826 6985 5488 2605
20000 2605 24266 53044 62241 46061 31431 18896 -6382 9842 23092 40117 77323 94678
19988 94678 52925 465 -9981 4831 1876 14892 12884 33567 30521 13709 -6211 967
19976 967 19601 12027 -12083 -14308 2356 3814 -39624 -19707 3275 5059 3588 -31791 -21783
19963 -21783 1941 38139 51507 35765 27222 7540 -18513 -676 2569 -14487 -18047 11508
19951 11508 19405 32906 26774 29118 34895 -2668 12495 34241 41930 30173 -5489 2471 6528
19938 6528 8881 18161 879 18897 37435 27204 -2592 -2349 8682 9074 -15562 -35587 -16625
$$ packed form
20025d253k2881j2805L0073J3505J8949L6930J5343k2140j6258j7241j2895J3285
20013A9612j8248j4230J2849N05j4589o483K9194L5868P649m5301J59j497k883
20000B605K1661K8778R197j6180j4630j2535k5278J6224J3250J7025L7206J7355
19988I4678m1753n2460j0446J4812k955J3016k008K0683l046j6812j9920P178
19976I67J8634p574k4110k225J6664J458m3438J9917K2982J784j471l5379J0008
19963b1783K3724L6198J3368j5742q543j9682k6053J7837L245j7056l560K9555
19951A1508P897J3501o132K344N777l7563J5163K1746P689j1757l5662P960M057
19938F528K353R280j7282J8018J8538j0231k9796K43J1031L92k4636k0025J8962
$$ plain form
19925 -16625 4062 -18929 -9398 37914 27233 -13550 -890 19825 12855 22418 32528 32083 8362
19912 8362 -3785 31268 40040 22893 8443 -8331 -5695 -6594 35450 89269 63291 22727 -3376
19899 -3376 40749 48575 30215 19447 17214 2624 -13356 -17126 -12451 15649 17629 17730 47722
19886 47722 42292 44956 54532 20138 -16660 3758 40591 59625 59968 75446 90404 54806 20968
19873 20968 -12160 26748 45670 47199 52099 44086 33957 48486 52137 46819 39480 26739 11684
19860 11684 18425 52555 38945 -2231 -11766 8459 12077 -2337 27046 17280 -3036 10865
19848 10865 17669 27683 27287 73790 90457 75997 48644 26616 30242 12358 15378 -1044 -12639
19835 -12639 -9706 -6217 -13092 -27423 -30419 -8595 14152 -811 -2791 -3590 16898 0 -19914
$$ packed form
19925a6625K0687k2991R531M7312j0681m0783J2660K0715o970R563J0110m45k3721
19912H362j2147L5053Q772j7147j4450j6774K636q99M2044N3819k5978m0564k6103
19899c376M4125P826j8360j0768k233j4590j5980l770M675K8100J980J01K9992
19886D7722n430K664R576l4394l6798K0418L6833J9034L43J5478J4958l5598l3838
19873B0968l3128L8908J8922J529M900q013j0129J4529L651n318p339j2741j5055
19860A1684O741L4130j3610m1176r535K0225L618j4414K9383r766k0316J3901
19848A0865O804J0014l96M6503J6667j4460k7353k2028L626j7884L020j6422j1595
19835a2639K933L489o875j4331k996K1824K2747j4963j980p99K0488j6898j9914
$$ plain form
19822 -19914 -42142 -28244 16783 16918 13287 17680 5934 -8438 -12579 -4630 -19255 -11510 -12936
19809 -12936 -26416 -12136 -6503 11847 31759 20885 31955 48253 37726 -13112 -37679 -12250
19797 -12250 -15899 -10053 16903 34753 44169 50380 14857 -11940 -5514 13091 12967 28192 56214
19784 56214 48933 18452 480 5246 13580 27773 57224 16293 -31244 -24119 2580 25921
19772 25921 28271 24115 36172 32086 49041 56748 12962 5482 16889 35806 31332 29972 38499
19759 38499 64364 92748 88519 69781 55878 28620 53643 61266 46843 40938 26497 -572
19747 -572 -267 18687 44365 44755 12287 -31469 -29473 -13416 6724 29433 28437 60031 65853 65092
19733 65092 81986 77172 46139 8131 22704 57761 11776 -8012 -3902 18089 49977 7925
$$ packed form
19822a9914k2228J3898M5027J35l631M393j1746j4372m141P949j4625P745j426
19809a2936j3480J4280N633J8350J9912j0874J1070J6298j0527n0838k4567K5429
19797a2250l649N846K6956J7850R416O211l5523k6797O426J8605j24J5225K8022
19784E6214p281l0481j7972M766Q334J4193K9451m0931m7537P125K6699K3341
19772B5921K350m156J2057m086J6955P707m3786p480J1407J8917m474j360Q527
19759C8499K5865K8384m229j8738j3903k7258K5023P623j4423n905j4441k7069
19747e72L05J8954K5678L90l2468m3756J996J6057K0140K2709r96L1594N822p61
19733F5092J6894m814l1033l8008J4573L5057m5985j9788M110K1991L1888m2052
$$ plain form
19721 7925 -13586 -523 24975 31685 17672 13594 19229 3277 -4943 7416 -13316 6172 20390
19708 20390 36742 19566 -7811 -4120 -20273 -26629 -33494 -8558 1900 31932 36102 56562
19696 56562 65241 56570 75492 81425 72978 52157 48253 63560 48274 37708 31364 40530 57715
19683 57715 46616 17436 1351 1724 10982 32792 40880 51287 49479 9790 13416 23551 2345
19670 2345 -18103 -14405 -7672 6492 6192 21289 3140 1873 21772 20972 9932 120 -3251 -3471
19656 -3471 -21596 470 24689 33404 61827 55520 88039 104458 109757 77084 57808 56206 26741
19643 26741 1786 -7724 24107 62980 67509 66262 75150 80299 71459 49845 52689 65036 68836
19630 68836 76281 67976 48740 28643 44068 71095 51486 35775 43820 36750 19726 3781
$$ packed form
19721G925k1511J3063K5498O710j4013m078N635j5952q220J2359k0732J9488J4218
19708B0390J6352j7176k7377L691j6153o356o865K4936J0458L0032M170K0460
19696E6562Q679q671J8922N933q447k0821l904J5307j5286j0566o344R166J7185
19683E7715j1099k9180j6085L73R258K1810Q088J0407j808l9689L626J0135k1206
19670B345k0448L698O733J4164l00J5097j8149j267J9899q00j1040r812l371k20
19656c471j8125K2066K4219Q715K8423o307L2519J6419N299l2673j9276j602k9465
19643B6741k4955r510L1831L8873M529j247Q888N149q840k1614K844J2347L800
19630F8836P445q305j9236k0097J5425K7027j9609j5711Q045p070j7024j5945
$$ plain form
19618 3781 16974 2676 33017 68983 59180 36527 28837 37371 21026 5010 13958 3023 15043
19605 15043 47578 35757 5963 14593 29988 10731 21760 52733 56357 28069 6076 6473
19593 6473 18772 54048 60623 40373 20176 1262 28086 15509 1858 33962 37953 -2667
19581 -2667 -1372 -19236 -27648 -8921 10260 20098 18490 29980 26727 42629 21527 7900 4482
19568 4482 -12601 13700 46187 61584 33411 7709 28479 28480 34010 21986 23034 7760 -11987
19555 -11987 -14257 -20293 -22975 15592 37046 31216 10186 24059 23513 29584 22544 -7199 -25618
19542 -25618 -35476 -4904 37313 38780 54408 81455 57314 43804 27265 42015 10188 473
19530 473 6296 5692 15400 23195 17670 7616 12836 21676 -4033 27651 59299 60215 58681 51294
$$ packed form
19618C781J3193j4298L0341L5966r803k2653p690Q534j6345j6016Q948j0935J2020
19605A5043L2535j1821k9794Q630J5395j9257J1029L0973L624k8288k1993L97
19593F473J2299L5276O575k0250k0197j8914K6824j2577j3651L2104L991m0620
19581b667J295j7864q412J8727J9181R838j608J1490l253J5902k1102j3627l418
19568D482j7083K6301L2487J5397k8173k5702K0770JN530j2024J048j5274j9747
19555a1987k270o036k682L8567K1454n830k1030J3873n46O071p040k9743j8419
19542b5618r858L0572M2217J467J5628K7047k4141j3510j6539J4750l1827r715
19530D73N823o04R708P795n525j0054N220Q840k5709L1684L1648R16j534p387
$$ plain form
19516 51294 23737 17563 51111 56963 48919 22534 11830 38419 57584 30938 44629 66782
19504 66782 52982 29941 24231 18370 31771 62265 53749 20059 3228 968 36578 45316 30166
19491 30166 33924 40523 27530 19779 35253 34746 24958 24786 15381 46232 33324 27077 13571 29427
19477 29427 6751 -870 27770 13971 -1468 -21402 -11135 6081 39838 46636 52305 47455
19465 47455 41859 17707 13147 40936 52650 65156 14839 -3827 10572 23977 45094 15443
19453 15443 -22026 -776 9673 -26461 -45117 -32625 -19270 17854 48257 14641 -363 14988
19441 14988 38307 43803 49754 41383 36030 19143 16711 -11304 1636 -1028 -427 13759 24752
19428 24752 11508 24702 42802 51508 45655 28724 20402 19078 23748 35097 52737 37169 28610
$$ packed form
19516E1294k7557o174L3548N852q044k6385j0704K6589J9165k6646J3691K2153
19504F6782j3800k3041n710n861J3401L0494q516l3690j6831k260L5610Q738j5150
19491C0166L758O599j2993p751J5474n07r788j72r405L0851j2908o247j3506J5856
19477B9427k2676p621K8640j3799j5439j9934J0267J7216L3757O798N669m850
19465D7455n596k4152m560K7789J1714J2506n0317j8666J4399J3405K1117k9651
19453A5443l7469K1250J0449l6134j8656J2492J3355L7124L0403l3616j5004J5351
19441A4988K3319N496N951q371n353j6887k432k8015J2940k664O01J4186J0993
19428B4752j3244J3194J8100Q706n853j6931q322j324M670J1349J7640j5568q559
$$ plain form
19415 28610 30573 31303 39570 51612 41373 14577 -5276 -7792 1746 24599 35214 67510 29014
19402 29014 28002 31568 39228 60063 67450 62345 63037 77061 42175 29713 72479 62862 59967
19389 59967 75596 55809 57990 54417 60227 51376 33280 6637 17967 47038 50777 56423 71695
19376 71695 52278 32041 35480 60718 80607 57000 57127 56804 78314 78395 58697 69105 40236
19363 40236 17477 5727 10974 2669 7196 18887 -3928 -29760 -15663 11040 8202 16016 8483
19350 8483 37881 63351 67791 65233 35350 -16130 -20310 -11460 14546 23585 2728 21800 66314
19337 66314 51098 48543 30203 -6495 9268 5983 22424 252 -9233 16376 40671 30052
19325 30052 33758 61993 60832 61884 61004 41942 33800 46003 51190 29074 26238 55686 72997
$$ packed form
19415B8610J963P30Q267J2042j0239k6796j9853k516R538K2853J0615L2296l8496
19402B9014j012L566P660K0835P387n105O92J4024l4886j2462M2766r617k895
19389E9967J5629j9787K181l573N810q851j8096k6643J1330K9071L739N646J5272
19376G1695j9417k0237L439K5238J9889k3607J27l23K1510Q1j9698J0408k8869
19363D0236k2759j1750N247q305M527J1691k2815k5832J4097K6703k838P814p533
19350H483K9398K5470M440k558k9883n1480m180Q850K6006R039k0857J9072M4514
19337F6314j5216k555j8340l6698J5763l285J6441k2172r485K5609K4295j0619
19325C0052L706K8235j161J052q80j9062q142J2203N187k2116k836K9448J7311
$$ plain form
19312 72997 86066 46267 23537 30573 24311 55470 57427 24679 4041 -1170 7152 15134 20406
19299 20406 4008 24851 64811 78851 57510 48778 57261 33080 3687 -11165 18074 18207
19287 18207 11132 30626 65080 32418 5371 21284 59709 76062 62190 48677 33831 39108
19275 39108 41859 52660 32573 27339 40880 36136 14859 27918 46042 61980 56133 40251
19263 40251 28087 22254 -16980 -17997 -15876 16804 58258 69394 45423 36217 37165 32381 37956
19250 37956 34050 5937 -8070 23555 51015 85313 109876 107478 78773 61662 70434 71310 51889
19237 51889 30564 23394 28845 3828 -26860 -16263 13922 27746 29242 25043 12049 17298 22492
19224 22492 22346 12512 17390 44210 60142 40431 35303 51068 62028 59861 72685 75811 72917
$$ packed form
19312G2997J3069l9799k2730P036o262L1159J957l2748k0638n211Q322P982N272
19299B0406j6398K0843L9960J4040k1341q732Q483k4181k9393j4852K9239J33
19287A8207p075J9494L4454l2662k7047J5913L8425J6353j3872j3513j4846N277
19275C9108K751J0801k0087n234J3541m744k1277J3059J8124J5938n847j5882
19263D0251j2164n833l9234j017K121L2680M1454J1136k3971r206R48m784N575
19250C7956l906k8113j4007L1625K7460L4298K4563k398k8705j7111Q772Q76j9421
19237E1889k1325p170N451k5017l0688J0597L0185J3824J496m199j2994N249N194
19224B2492j46r834M878K6820J5932j9711n128J5765J0960k167J2824L126k894
$$ plain form
19211 72917 39031 20122 30398 43056 52328 62966 56614 49391 46549 26059 11739 8440 -2815
19198 -2815 33042 62652 71679 51420 68543 47181 34853 45299 69075 104011 54823 15471
19186 15471 16010 40853 32941 30064 13521 22327 41905 72074 81607 67633 37778 42627 53932
19173 53932 50671 29390 5546 11542 27706 41769 55022 49505 53730 42594 33382 40276 41999
19160 41999 63880 89094 66711 40192 40817 47613 62925 40513 6716 -15098 27811 54673
19148 54673 47270 47181 34491 3965 -7631 9256 33411 53819 58064 57383 59571 36887 33416
19135 33416 52499 32206 26408 38392 26562 20205 35631 30053 28042 36866 34732 25445 33239
19122 33239 47166 51273 56026 73449 86269 68599 74743 79218 68051 28159 10128 12942 9541
$$ packed form
19211G2917l3886j8909J0276J2658R272J0638o352p223k842k0490j4320l299j1255
19198b815L5857K9610R027k0259J7123k1362j2328J0446K3776L4936m9188l9352
19186A5471N39K4843p912k877j6543Q806J9578L0169R533j3974k9855M849J1305
19173E3932l261k1281k3844N996J6164J4063J3253n517M225j1136r212O894J723
19160D1999K1881K5214k2383k6519O25O796J5312k2412l3797k1814M2909K6862
19148E4673p403q9j2690l0526j1596J6887K4155K0408M245o81K188k2684l471
19135C3416J9083k0293n798J1984j1830o357J5426n578k011Q824k134r287P794
19122C3239J3927M107M753J7423J2820j7670O144M475j1167l9892j8031K814l401
$$ plain form
19109 9541 37515 66448 70430 36173 39320 43982 56862 65252 55336 50678 30194 31761 13057
19096 13057 6040 17459 41196 56713 74937 93229 78629 84791 87136 50880 31627 15659
19084 15659 21834 25479 14237 16631 2352 13683 5704 -8378 -10419 -5519 -24440 10179 48489
19071 48489 75477 98101 84898 57872 47814 49794 45504 54492 39806 23407 27869 28943 21340
19058 21340 23128 25825 16452 8463 30012 42029 10510 5067 10126 27290 28111 29669 35423 17106
19044 17106 41293 32565 41945 49109 48777 42801 39509 54386 50183 43832 57130 69484 76877 79998
19030 79998 49872 41126 60555 46572 51911 61591 29411 3134 32205 59227 31465 46438
19018 46438 70895 80813 70737 59695 48847 20480 17085 14061 34756 55169 42555 40606
$$ packed form
19109I541K7974K8933L982l4257L147M662J2880Q390r916m658k0484J567j8704
19096A3057p017J1419K3737J5517J8224J8292j4600O162K345l6256j9253j5968
19084A5659O175L645j1242K394j4279J1331p979j4082k041M900j8921L4619L8310
19071D8489K6988K2624j3203k7026j0058J980m290Q988j4686j6399M462J074p603
19058B1340J788K697r373p989K1549J2017l1519n443N059J7164Q21J558N754j8317
19044A7106K4187q728R380P164l32n976l292J4877m203o351J3298J2354P393L121
19030G9998l0126q746J9429j3983N339R680l2180k6277K9071K7022k7762J4973
19018D6438K4457R918j0076j1042j0848k8367l395l024K0695K0413j2614j949
$$ plain form
19006 40606 4845 14281 983 23910 53206 47974 50010 62348 78918 45738 29915 27187
18994 27187 38509 43022 41185 14885 -20362 -19148 -6334 -13238 -15654 11664 53737 74038 80260
18981 80260 49161 25563 11725 9387 -10438 -1771 23400 69903 63768 54874 25023 31875 23862
18968 23862 7777 22644 33689 28728 57381 66806 70085 46352 47803 56732 71237 78308 66860
18955 66860 40194 21265 17703 14059 41400 82429 86994 104258 112163 119722 71474 31703 29126
18942 29126 63188 86929 92232 86752 47060 5036 17484 55345 19125 24299 49304 69917
18930 69917 52400 59741 56879 66885 64177 81007 76111 65740 66619 57497 68038 46725 53334
18917 53334 66514 33625 7571 31380 50037 68717 85797 118661 129813 113612 134883 153919
$$ packed form
19006D0606l5761R436j3298K2927K9296n232K036J2338J6570l3180j5823k728
18994B7187J1322M513j837k6300l5247J214J2814o904k416K7318M2073K0301O222
18981H0260l1099k3598j3838k338j9825Q667K5171M6503o135q894k9851O852q013
18968B3862j6085J4867J1045m961K8653R425L279k3733J451Q929J4505P071j1448
18955F6860k6666j8929l562l644K7341M1029M565J7264P905P559m8248l9771k577
18942B9126L4062K3741N303n480l9692m2024J2448L7861l6220N174K5005K0613
18930F9917j7517P341k862J0006k708J6830m896j0371Q79r122J0541k1313O609
18917E3334J3180l2889k6054K3809J8657J8680J7080L2864J1152j6201K1271J9036
$$ plain form
18905 153919 142752 135383 85862 41140 33568 55849 77998 65619 94372 91470 83539 88161
18893 88161 85748 94979 96816 99467 89008 85001 105990 108862 97700 71166 47688 57342 101094
18880 101094 95306 71173 81959 62151 67389 71089 56220 44340 71659 89038 80564 83332
18868 83332 116188 107015 76761 56350 52403 28561 21278 46170 63685 51267 82910 114047
18856 114047 118292 74604 39368 50230 50982 61600 79431 70696 80744 68631 65224 53820
18844 53820 31525 22700 14005 38346 60427 52859 65867 79989 82809 72313 59440 65995 97390
18831 97390 101666 98520 103601 78613 64674 108886 147493 135224 117793 91189 110057 152611
18819 152611 167971 100133 80805 88564 91400 83235 76600 72986 52639 50449 66344 87809 73599
$$ packed form
18905A53919j1167p369m9521m4722p572K2281K2149j2379K8753k902p931M622
18893H8161k413R231J837K651j0459m007K0989K872j1162k6534k3478R654M3752
18880A01094n788k4133J0786j9808N238L700j4869j1880K7319J7379q474K768
18868H3332L2856r173l0254k0411l947k3842p283K4892J7515j2418L1643L1137
18856A14047M245m3688l5236J0862P52J0618J7831q735J0048j2113l407j1404
18844E3820k2295q825q695K4341K2081p568J3008J4122K820j0496j2873O555L1395
18831I7390M276l146N081k4988j3939M4212L8607j2269j7431k6604J8868M2554
18819A52611J5360o7838j9328P759K836q165o635l614k0347k190J5895K1465j4210
$$ plain form
18806 73599 63483 75165 86499 68749 71558 91751 88358 90551 79682 28284 16172 19541
18794 19541 10958 1449 21721 39919 75428 68009 19454 21375 45463 56214 55189 55631 62172
18781 62172 113128 127750 99702 87487 86684 84776 87753 72704 96240 106081 126004 176946 211058
18768 211058 226738 238331 295941 368439 288877 192826 173648 124973 115879 95555 88222 87740
18756 87740 102062 78467 62549 77778 73147 50534 40792 51389 61601 44662 52574 64736
18744 64736 96791 86397 79369 63809 70648 92638 108049 137141 111327 113159 89568 66571
18732 66571 73911 113768 126754 101532 65129 69856 89651 76738 70460 74048 50440 12290
18720 12290 14263 51427 72315 60812 96024 67805 54332 40858 33179 32763 42476 61591 83404
$$ packed form
18806G3599j0116J1682J1334j7750K809K0193l393K193j0869n1398j2112L369
18794A9541q583r509K0272J8198L5509p419m8555J921K4088J0751j025M42O541
18781F2172N0956J4622k8048j2215q03j908K977j5049K3536R841J9923N0942L4112
18768B11058J5680J1593N7610P2498p9562r6051j9178m8675r094k0324p333m82
18756H7740J4322k3595j5918J5229m631k2613r742J0597J0212j6939P912J2162
18744F4736L2055j0394p028j5560O839K1990J5411K9092k5814J832k3591k2997
18732F6571P340L9857J2986k5222l6403M727J9795j2913o278L588k3608l8150
18720A2290J973L7164K0888j1503L5212k8219j3473j3474p679m16R713J9115K1813
$$ plain form
18707 83404 76347 74651 88320 80204 87348 111590 95679 62375 36969 20131 32627 65324
18695 65324 98253 115907 122044 114118 73317 62936 86573 108967 109855 99330 114271 107256 94875
18682 94875 97071 108362 122106 109782 95872 137210 159680 168433 154768 139855 172682 190052
18670 190052 200155 251335 274821 288451 321870 393568 540722 762246 1000144 1219522 1445413
18659 1445413 1683470 1954092 1899034 1392138 924438 611421 430883 356666 315018 273117
18649 273117 245035 196579 151496 139206 140918 130302 114505 124490 141287 165107 164787 180483
18637 180483 198965 197085 193459 211067 231383 208248 228012 257332 316436 415846 613338 861584
18625 861584 1102859 1323850 1578282 1895708 2102010 1813167 1223080 774480 562418 437202
$$ packed form
18707H3404p057j696J3669q116P144K4242j5911l3304k5406j6838J2496L2697
18695F5324L2929J7654O137p926m0801j0381K3637K2394Q88j0525J4941p015j2381
18682I4875K196J1291J3744j2324j3910M1338K2470Q753j3665j4913L2827J7370
18670A90052J0103N1180K3486J3630L3419P1698J47154K21524K37898K19378K25891
18659A445413K38057K70622n5058n06896m67700l13017j80538p4217m1648m1901
18649B73117k8082m8456m5083j2290J712j0616j5797R985J6797K3820l20J5696
18637A80483J8482j880l626J7608K0316k3135J9764K9320N9104R9410J97492K48246
18625H61584K41275K20991K54432L17426K06302k88843n90087m48600k12062j25216
$$ plain form
18615 437202 342415 275824 246112 215451 191510 189373 186845 189241 213510 213761 203830 180786 140982
18602 140982 132193 141483 130470 105990 78502 93021 97690 114079 121676 107617 103320 90927
18590 90927 121150 125259 104851 73235 51118 66570 101081 98317 59321 65446 51954 85069
18578 85069 111523 111402 97061 69042 77287 98006 101105 109586 124589 108539 112542 123645 130376
18565 130376 132979 140514 140582 156293 143153 111278 83477 101919 101114 80166 96567 121054 116481
18552 116481 127373 126447 86296 83460 83652 115145 130580 122546 117055 137310 124720 128873 99944
18539 99944 130733 147835 129893 125239 135918 133547 137511 132249 126470 155174 156559 148824 129118
18526 129118 147463 149050 149228 158960 203174 213938 230424 236667 199026 166267 162235 164798 194522
$$ packed form
18615D37202r4787o6591k9712l0661k3941k137k528K396K4269K51r931k3044l9804
18602A40982q789R290j1013k4480k7488J4519M669J6389P597j4059m297j2393
18590I0927L0223M109k0408l1616k2117J5452L4511k764l8996O125j3492L3115
18578H5069K6454j21j4341k8019Q245K0719L099Q481J5003j6050M003J1103O731
18565A30376K603P535O8J5711j3140l1875k7801J8442q05k0948J6401K4487m573
18552A16481J0892r26m0151k836J92L1493J5435q034n491K0255j2590M153k8929
18539I9944L0789J7102j7942m654J0679k371L964n262n779K8704J385p735j9706
18526A29118J8345J587J78R732M4214J0764J6486O243l7641l2759m032K563K9724
$$ plain form
18513 194522 203130 184440 163611 144820 147062 172117 172349 178000 175849 182984 159919 172218 177911
18500 177911 155230 162839 141001 106726 136099 123408 99891 113587 107624 123264 152963 179884
18488 179884 191128 172514 187211 179674 165017 163686 152589 118104 113863 134511 124038 138241
18476 138241 142847 124284 132762 140217 113738 137800 139546 115783 109021 137185 149988 130809
18464 130809 103270 119716 141675 172574 175377 133141 95208 101155 103226 126702 139086 144867
18452 144867 160784 182978 171547 177831 175463 155176 146479 165199 183465 172975 162797 180135
18440 180135 173432 180367 157618 142835 142592 162945 212833 228924 213301 196358 172061 147289
18428 147289 121487 141162 159669 169075 193137 176439 159058 166513 180049 210608 202804 189411
$$ packed form
18513A94522Q608j8690k0829j8791K242K5055K32N651k151P135k3065J2299N693
18500A77911k2681P609k1838l4275K9373j2691k3517J3696n963J5640K9699K6921
18488A79884J1244j8614J4697p537j4657j331j1097l4485m241K0648j0473J4203
18476A38241M606j8563Q478P455k6479K4062J746k3763o762K8164J2803j9179
18464A30809k7539J6446K1959L0899K803m2236l7933N947K071K3476J2384N781
18452A44867J5917K2194j1431O284k368k0287q697J8720J8266j0490j0178J7338
18440A80135o703O935k2749j4783k43K0353M9888J6091j5623j6943k4297k4772
18428A47289k5802J9675J8507R406K4062j6698j7381P455J3536L0559p804j3393
$$ plain form
18416 189411 126401 87095 96775 107729 136795 152247 134679 159397 165423 163362 160485 134693
18404 134693 94690 87017 96502 111723 126955 138685 140636 170337 187274 189014 194553 198704 183394
18391 183394 198885 182676 177400 209735 246936 214379 237132 272512 243918 243028 292685 337158
18379 337158 378968 399244 398547 370932 360707 343869 280539 261343 243975 227687 212186 175948
18367 175948 142975 122461 111837 152159 167632 179127 190498 225879 282627 277067 294668 278628
18355 278628 265047 253684 262474 274898 280577 280554 299809 339308 364226 382750 382809 403669 446321
18342 446321 489191 508265 518638 514600 500968 462889 406208 391760 368634 338033 306393 263671
18330 263671 231132 218450 218119 200809 187394 204345 203392 214054 237970 248935 252696 292019
$$ packed form
18416A89411o3010l9306R680J0954K9066J5452j7568K4718O026k061k877k5792
18404A34693m0003p673R485J5221J5232J1730J951K9701J6937J740N539M151j5310
18391A83394J5491j6209n276L2335L7201l2557K2753L5380k8594q90M9657M4473
18379C37158M1810K0276o97k7615j0225j6838o3330j9196j7368j6288j5501l6238
18367A75948l2973k0514j0624M0322J5473J1495J1371L5381N6748n560J7601j6040
18355B78628j3581j1363Q790J2424N679k3J9255L9499K4918J8524N9K0860M2652
18342D46321M2870J9074J0373m038j3632l8079n6681j4448k3126l0601l1640m2722
18330B63671l2539j2682l31j7310j3415J6951r53J0662K3916J0965L761L9323
$$ plain form
18318 292019 306412 307887 336936 372163 425309 448490 437026 384486 394181 400755 403462 350717
18306 350717 315344 305440 307409 318440 313709 316823 309747 298119 270326 269290 270326 261003 252421
18293 252421 268955 283350 262993 263220 257316 246617 218358 245197 261633 275205 259620 264811
18281 264811 281286 310285 349280 374235 443485 472814 449004 382161 337870 360404 350240
18270 350240 331870 336571 336991 364365 336718 338799 345255 335171 300513 267685 267773 292980 312635
18257 312635 310582 315199 338966 336676 319642 337347 351791 334273 316060 319273 337818 342085
18245 342085 345489 342386 336871 352884 361109 347006 335980 323593 338119 346410 330790 299596
18233 299596 289722 282790 281422 295971 310559 331655 340673 360264 388021 408403 435220 451704
$$ packed form
18318B92019J4393J475K9049L5227N3146K3181j1464n2540R695O574K707n2745
18306C50717l5373r904J969J1031m731L114p076j1628k7793j036J036r323q582
18293B52421J6534J4395k0357K27n904j0699k8259K6839J6436J3572j5585N191
18281B64811J6475K8999L8995K4955O9250K9329k3810o6843m4291K2534j0164
18270C50240j8370M701M20K7374k7647K081O456j0084l4658l2828Q8K5207J9655
18257C12635k053M617K3767k290j7034J7705J4444j7518j8213L213J8545M267
18245C42085L404l103n515J6013Q225j4103j1026j2387J4526Q291j5620l1194
18233B99596r874o932j368J4549J4588K1096R018J9591K7757K0382K6817J6484
$$ plain form
18221 451704 466120 481365 507372 549618 610147 655057 671190 638122 578307 529234 496597
18210 496597 452225 428507 394935 422757 461023 529863 605494 677196 709254 762847 866600
18199 866600 951965 939702 871997 811807 756781 681842 640469 615350 613120 619395 614975 565003
18187 565003 501332 449909 466973 603663 692974 738800 774618 764750 775295 739900 697211
18176 697211 669026 608665 551129 476893 467379 507525 569083 587026 614632 661185 718774 762704
18164 762704 794062 852378 896234 926392 906699 885052 872125 865087 847750 828556 819745 845175
18152 845175 835561 774179 719514 661484 647337 771820 849118 861746 868013 861697 840377 835808
18140 835808 834141 889177 926292 981330 1018943 1078538 1184227 1274396 1332198 1370370 1438387
$$ packed form
18221D51704J4416J5245K6007M2246O0529M4910J6133l3068n9815m9073l2637
18210D96597m4372k3718l3572K7822L8266O8840P5631P1702L2058N3593J03753
18199H66600Q5365j2263o7705o0190n5026p4939m1373k5119k230O275m420m9972
18187E65003o3671n1423J7064J36690Q9311M5826L5818r868J0545l5395m2689
18176F97211k8185o0361n7536p4236r514M0146O1558J7943K7606M6553N7589M3930
18164G62704L1358N8316M3856L0158j9693k1647j2927p038j7337j9194q811K5430
18152H45175r614o1382n4665n8030j4147J24483P7298J2628O267o316k1320m569
18140H35808j667N5036L7115N5038L7613N9595J05689R0169N7802L8172O8017
$$ plain form
18129 1438387 1537592 1597554 1658068 1736374 1854972 2007042 2158826 2374501 2624983 2873709
18119 2873709 3209157 3709680 4476519 5540337 7216523 10037993 14604234 21023043 27821173
18110 27821173 33511445 39443104 47893680 55009259 48561785 32249622 19764637 13151132
18102 13151132 9691538 7774722 6652318 6005944 5628305 5396001 5332533 5409028 5286296
18093 5286296 4720214 4135104 3818122 3727536 3728146 3738659 3784371 3879368 4063147 4381669 4821508
18082 4821508 5323730 5880533 6400879 7041520 7849328 8644899 9103168 9480815 10228467
18073 10228467 11363904 12819018 14691813 17234523 20727398 25531912 32797970 44897261
18065 44897261 65240404 97117722 138327723 178133891 212116486 252284064 306434922
$$ packed form
18129A438387R9205N9962O0514P8306J18598J52070J51784K15675K50482K48726
18119B873709L35448N00523P66839J063818J676186K821470M566241O418809O798130
18110B7821173N690272N931659Q450576P115579o447474j6312163j2484985o613505
18102A3151132l459594j916816j122404o46374l77639k32304o3468P6495j22732
18093E286296n66082n85110l16982r0586O10J0513M5712R4997J83779L18522M39839
18082D821508N02222N56803N20346O40641Q07808P95571M58269L77647P47652
18073A0228467J135437J455114J872795K542710L492875M804514P266058J2099291
18065D4897261K0343143L1877318M1210001L9806168L3982595M0167578N4150858
$$ plain form
18058 306434922 331865844 267224471 168908137 103389131 67983249 48241144 36412754
18051 36412754 28822280 23829155 20476686 18225875 16801818 15893572 15212540 14405386
18043 14405386 13870633 13875194 14290913 14778855 15010400 15035537 15131629 15746519 16986910 18932882
18033 18932882 21828041 25880425 31526689 40466482 55725754 81256527 119672953 165446740
18025 165446740 206590243 243760444 292309569 350334462 350130040 257022899 156717742
18018 156717742 96681909 64161301 45570386 34084833 26531186 21565302 18054952
18011 18054952 15464882 13601159 12153790 10735240 9318419 8195275 7438099 6885622
18003 6885622 6558306 6277533 5572773 4658704 3968714 3503051 3150226 2956959 2835844
$$ packed form
18058C06434922K5430922o4641373r8316334o5519006l5405882j9742105j1828390
18051C6412754p590474m993125l352469k250811j424057r08246o81032q07154
18043A4405386n34753M561M15719M87942K31545K5137R6092O14890J240391J945972
18033A8932882K895159M052384N646264Q939793J5259272K5530773L8416426M5773787
18025A65446740M1143503L7170201M8549125N8024893k04422r3107141j00305157
18018A56717742o0035833l2520608j8590915j1485553p553647m965884l510350
18011A8054952k590070j863723j447369j418550j416821j123144p57176n52477
18003F885622l27316k80773p04760r14069o89990m65663l52825j93267j21115
$$ plain form
17994 2835844 2671351 2550157 2515254 2520512 2580799 2666971 2774042 2946215 3157464 3047113
17984 3047113 2446509 1805599 1416985 1207973 1122753 1029047 954397 900344 905904 912848 859822
17973 859822 765111 704964 703507 718663 705867 685330 624216 552539 519797 501748 469554 430562
17961 430562 445205 461282 466819 473398 474244 430136 376813 335314 262760 219318 186154 158516
17949 158516 168829 217934 275290 319172 332070 338816 353073 364306 366244 391853 426752 427359
17937 427359 426620 457376 453138 470579 533676 598571 503206 339482 273955 227846 189546 212802
17925 212802 224073 208010 197144 179070 172708 168231 162761 147919 155220 161033 167579 194905 210640
17912 210640 218280 241059 246360 248435 198821 152424 84632 -42361 -128220 -104289 -49180 16565
$$ packed form
17994B835844j64493j21194l4903N258O0287Q6172J07071J72173K11249j10351
17984C047113o00604o40910l88614k09012q5220r3706p4650n4053N560O944n3026
17973H59822r4711o0147j457J5156j2796k0537o1114p1677l2742j8049l2194l8992
17961D30562J4643J6077N537O579Q46m4108n3323m1499p2554m3442l3164k7638
17949A58516J0313M9105N7356M3882J2898O746J4257J1233J938K5609L4899O07
17937D27359p39L0756m238J7441O3097O4895r5365j63724o5527m6109l8300K3256
17925B12802J1271j6063j0866j8074o362m477n470j4842P301N813O546K7326J5735
17912B10640P640K2779N301K075m9614m6397o7792j26993q5859K3931N5109O5745
$$ plain form
17900 16565 64175 149503 234179 299915 368901 425817 331557 254107 230744 216400 217649 191750
17888 191750 158531 162972 157855 137038 117560 95217 67325 33300 19162 37780 65633 82684
17876 82684 102959 112160 125808 94025 107576 70617 12585 -55580 -151622 -243918 -275306 -221613
17864 -221613 -140059 -99645 -61357 -64656 -62896 -37527 -14596 4378 39656 34846 7292 14887
17852 14887 25350 24515 43141 48949 67872 74568 69675 80858 49286 65182 53723 22787 29839
17839 29839 43510 55193 59774 95406 103408 71393 3701 6214 23378 6231 25544 75620
17827 75620 78707 58407 67996 72397 60597 61713 71345 78593 72927 93561 106227 106659 128068
17814 128068 172939 299918 467053 649490 898038 1170917 1423969 1662085 1980694 2172095
$$ packed form
17900A6565M7610Q5328Q4676O5736O8986N6916r4260p7450k3363j4344J249k5899
17888A91750l3219M441n117k0817j9478k2343k7892l4025j4138J8618K7853J7051
17876H2684K0275R201J3648l1783J3551l6959n8032o8165r6042r2296l1388N3693
17864b21613Q1554M0414L8288l299J760K5369K2931J8974L5278m810k7554P595
17852A4887J0463q35J8626N808J8923O696m893J1183l1572J5896j1459l0936P052
17839B9839J3671J1683M581L5632Q002l2015o7692K513J7164j7147J9313N0076
17827G5620L087k0300R589M401j1800J116R632P248n666K0634J2666M32K1409
17814A28068M4871J26979J67135J82437K48548K72879K53052K38116L18609J91401
$$ plain form
17804 2172095 1848360 1261698 847746 595483 431008 317394 225823 162145 120108 106914
17794 106914 116311 122214 112931 117981 131464 126781 117520 124485 95999 85185 95931 104405 93859
17781 93859 62349 69447 108560 141730 164918 211130 330299 518968 738807 929636 1075563
17770 1075563 1280610 1550746 1612025 1255828 787098 468224 292813 201930 179051 161112
17760 161112 143932 146467 92141 76729 54668 59049 85514 115230 101193 80577 49343 12513
17748 12513 1450 4409 -7254 -5257 -10091 -32567 -47887 -8951 16344 13209 1199 15789
17736 15789 12585 3120 -1455 4427 2685 18268 25471 24809 13771 30086 31037 20198 23504 72420
17722 72420 52740 33388 21273 23099 29061 55900 77495 83650 74336 -1774 -37050 -36462 -32850
$$ packed form
17804B172095l23735n86662m13952k52263j64475j13614r1571o3678m2037j3194
17794A06914R397N903r283N050J3483m683r261O965k8486j0814J0746Q474j0546
17781I3859l1510P098L9113L3170K3188M6212J19169J88669K19839J90829J45927
17770A075563K05047K70136O1279l56197m68730l18874j75411r0883k2879j7939
17760A61112j7180K535n4326j5412k2061M381K6465K9716j4037k0616l1234l6830
17748A2513j1063K959j1663J997m834k2476j5320L8936K5295l135j2010J4590
17736A5789l204r465m575N882j742J5583P203o62j1038J6315R51j0839L306M8916
17722G2420j9680j9352j2115J826N962K6839K1595O155r314p6110l5276N88L612
$$ plain form
17709 -32850 -34513 5326 5030 6149 1102 -33966 -33170 -14731 -11519 -32167 -54573 -25129 -34198
17696 -34198 -14102 -1376 183 9133 3601 -10674 -28560 -17145 23828 45242 77321 92641
17684 92641 54750 42903 40970 32381 27715 -3572 21689 24181 5046 49785 46693 22715 27915
17671 27915 24424 4540 24870 41086 9773 -23656 -41111 -36151 -16924 -10032 9053 87
17659 87 -13345 -1667 13204 51344 60732 66685 52870 31483 12455 15810 9360 -12317 -6254
17646 -6254 -7131 21488 61672 51170 71887 57745 29118 9406 7334 54139 110032 117531 58481
17633 58481 48117 41407 29906 42355 40232 32545 11876 9057 15396 4702 41446 68033 60182
17620 60182 64175 46834 35993 11954 -21161 2346 40240 59961 47280 30262 37256 41738
$$ packed form
17709c2850j663L9839k96J119n047l5068P96J8439L212k0648k2406K9444r069
17696c4198K0096J2726J559Q950n532j4275j7886J1415M0973K1414L2079J5320
17684I2641l7891j1847j933q589m666l1287K5261K492j9135M4739l092k3978N200
17671B7915l491j9884K0330J6216l1313l3429j7455M960J9227O892J9085q966
17659H7j3432J1678J4871L8140R388N953j3815k1387j9028L355o450k1677O063
17646f254q77K8619M0184j0502K0717j4142k8627j9712k072M6805N5893P499n9050
17633E8481j0364o710j1501J2449k123p687k0669k819O339j0694L6744K6587p851
17620F0182L993j7341j0841k4039l3115K3507L7894J9721j2681j7018O994M482
$$ plain form
17608 41738 44891 36628 17438 -3834 18924 19985 40961 21436 20293 1237 6971 36965 50410
17595 50410 70051 73617 78163 98622 90612 110817 110425 82046 44069 30877 32041 67997 94101
17582 94101 125780 124515 125758 129767 144278 170386 159023 146431 161251 173726 162685 105754
17570 105754 99315 119950 154563 168030 188187 194321 150859 109672 100479 85318 114457 132615
17558 132615 143030 144193 117102 127292 130445 144001 200436 206321 188687 180492 165817 178500
17546 178500 193099 196846 195900 191423 185199 124777 102895 134790 161739 157520 125205 93938 79901
17533 79901 67136 60393 35271 13214 10163 39544 54955 76114 103639 119303 127262 155604
17521 155604 170887 195827 215698 208998 195824 220449 278302 307934 300004 314452 299095 282110
$$ packed form
17608D1738L153q263j9190k1272K2758J061K0976j9525j143j9056N734K9994J3445
17595E0410J9641L566M546K0459q010K0205l92k8379l7977j3192J164L5956K6104
17582I4101L1679j265J243M009J4511K6108j1363j2592J4820J2475j1041n6931
17570A05754o439K0635L4613J3467K0157O134m3462m1187r193j5161K9139J8158
17558A32615J0415J163k7091J0190L153J3556N6435N885j7634q195j4675J2683
17546A78500J4599L747r46m477o224o0422k1882L1895K6949m219l2315l1267j4037
17533G9901j2765o743k5122k2057l051K9381J5411K1159K7525J5664P959K8342
17521A55604J5283K4940J9871o700j3174K4625N7853K9632p930J4448j5357j6985
$$ plain form
17509 282110 290776 283478 275290 265177 274961 299463 280948 249785 266804 278258 274042 264020
17497 264020 235835 227097 221452 238023 250893 253745 242350 219205 221073 224849 180405 126216
17485 126216 146651 149400 132839 157545 185810 188248 211879 225453 254735 233752 225432 234894
17473 234894 263012 281440 317414 353931 367568 380460 362338 347125 338943 340026 371617 385333
17461 385333 392197 474116 596425 681346 778657 943854 1122136 1309116 1561741 1816873
17451 1816873 1706997 1229898 865241 661541 553147 492797 455411 482007 524344 546236
17441 546236 546608 530765 460867 357684 321710 300418 269643 254670 258150 268805 268293 296357
17429 296357 297741 301950 330516 351018 417498 511587 613524 753421 964713 1273662 1576132
$$ packed form
17509B82110Q666p298q188j0113R784K4502j8515l1163J7019J1454m216j0022
17497B64020k8185q738n645J6571J2870K852j1395k3145J868L776m4444n4189
17485A26216K0435K749j6561K4706K8265K438K3631J3574K9282k0983q320R462
17473B34894K8118J8428L5974L6517J3637J2892j8122j5213q182J083L1591J3716
17461C85333O864Q1919J22309Q4921R7311J65197J78282J86980K52625K55132
17451A816873j09876m77099l64657k03700j08394o0350l7386K6596M2337K1892
17441E46236L72j5843o9898j03183l5974k1292l0775j4973L480J0655n12K8064
17429B96357J384M209K8566K0502O6480R4089J01937J39897K11292L08949L02470
$$ plain form
17418 1576132 1842476 2105069 2415448 2589149 2193385 1471774 915012 583346 392727
17409 392727 323928 314520 332094 354486 314779 277314 252938 283101 290877 292366 257079 229785
17397 229785 248919 251367 279748 290873 293654 291549 301529 284640 244931 200501 176933 281169
17385 281169 381956 424780 456811 474994 471769 458156 420597 400392 377940 308763 241897
17374 241897 181369 169639 190370 250898 285476 309411 316008 308377 272336 281370 314488 299082
17362 299082 311896 354551 356401 328979 319265 339569 383460 425175 449767 402185 358739 322326
17350 322326 300788 323004 380249 411770 416848 411442 384870 370470 347041 369027 414386 439115
17338 439115 445669 470869 519023 528356 518731 539089 574577 651879 627105 582946 573628 565314
$$ packed form
17418A576132K66344K62593L10379J73701l95764p21611n56762l31666j90619
17409C92727o8799r408J7574K2392l9707l7465k4376L0163P776J489l5287k7294
17397B29785J9134K448K8381J1125K781k105R980j6889l9709m4430k3568J04236
17385B81169J00787M2824L2031J8183l225j3613l7559k0205k2452o9177o6866
17374B41897o0528j1730K0731O0528L4578K3935O597p631l6041R034L3118j5406
17362B99082J2814M2655J850k7422r714K0304M3891M1715K4592m7582m3446l6413
17350C22326k1538K2216N7245L1521N078n406k6572j4400k3429K1986M5359K4729
17338D39115O554K5200M8154R333r625K0358L5488P7302k4774m4159r318q314
$$ plain form
17326 565314 578662 602109 625932 660930 699702 749851 813588 856714 879744 878590 877980 919475
17314 919475 929676 955517 1047830 1097903 1108499 1155077 1212619 1257937 1316522 1397260 1558086
17303 1558086 1697373 1856975 2038699 2266424 2572071 2885166 3200603 3485602 3817107
17294 3817107 4104226 4034174 3593984 3248346 3085304 3089268 3195821 3353397 3564455 3859975
17284 3859975 4213167 4622044 5137842 5756857 6489346 7323770 8215794 9229301 10463055
17275 10463055 11787435 12955921 14295650 16359365 19504552 24238694 31447227 42853058
17267 42853058 61625287 91766441 133850205 179017050 217688451 257064766 312323493
17260 312323493 363926599 330918579 224606339 136976508 88187545 61235663 45361326
$$ packed form
17326E65314J3348K3447K3823L4998L8772N0149O3737M3126K3030j154o10M1495
17314I19475J0201K5841R2313N0073J0596M6578N7542M5318N8585Q0738J60826
17303A558086J39287J59602J81724K27725L05647L13095L15437K84999L31505
17294C817107K87119p0052m40190l45638j63042L964J06553J57576K11058K95520
17284C859975L53192M08877N15798O19015P32489Q34424Q92024J013507J233754
17275A0463055J324380J168486J339729K063715L145187M734142P208533J1405831
17267D2853058J8772229L0141154M2083764M5166845L8671401L9376315N5258727
17260C12323493N1603106l3008020j06312240q7629831m8788963k6951882j5874337
$$ plain form
17253 45361326 35409808 28867008 24123537 20255318 17461413 15513142 14034016 13002981
17245 13002981 12549640 12558195 12837587 13297988 14005718 14762763 15170129 15346407 15609787 16440088
17235 16440088 18193915 21233434 25987769 33343493 45299885 65046464 95898584 136343402
17227 136343402 176329763 210085177 248320932 301364395 332595635 274688513 174912917
17220 174912917 106048566 69078897 48516234 36194942 28277672 22972916 18841302
17213 18841302 15413446 12878274 10867953 9295986 8164849 7390584 6843957 6395447
17205 6395447 6069035 5848351 5428667 4733312 4027298 3552135 3284213 3129905 3026221
17196 3026221 2917758 2900552 2966608 3020664 3013295 3101356 3269043 3147369 2602975 2045226
$$ packed form
17253D5361326r951518o542800m743471l868219k793905j948271j479126j031035
17245A3002981m53341Q555K79392M60401P07730P57045M07366J76278K63380Q30301
17235A6440088J753827L039519M754335P355724J1956392J9746579L0852120M0444818
17227A36343402L9986361L3755414L8235755N3043463L1231240n7907122r9775596
17220A74912917o8864351l6969669k0562663j2321292p917270n304756m131614
17213A8841302l427856k535172k010321j571967j131137p74265n46627m48510
17205F395447l26412k20684m19684o95355p06014m75163k67922j54308j03684
17196C026221j08463j7206O6056N4056p369Q8061J67687j21674n44394n57749
$$ plain form
17186 2045226 1652287 1419480 1274224 1193998 1129420 1102973 1032037 977702 959358 957632 908803
17175 908803 858306 828003 790076 752257 716910 658929 629770 590883 557196 538974 508781
17164 508781 498170 515081 535790 564666 569436 522289 488710 450557 394278 350259 330353 313098
17152 313098 290534 292333 306273 325147 312794 349710 388503 451642 430309 392803 369718 373923
17140 373923 407008 422306 442827 443313 457218 459349 534487 551997 418759 343087 291301 306156
17128 306156 326162 315185 290000 261136 244594 236066 257240 257159 236512 245229 228322 217793
17116 217793 225301 241809 233693 259651 295306 263761 232158 227759 189239 98047 -25199 -93281
17104 -93281 -41913 23151 68827 104014 147232 200149 324210 417755 387356 244452 184766
$$ packed form
17186B045226l92939k32807j45256q0226o4578k6447p0936n4335j8344j726m8829
17175I08803n0497l0303l7927l7819l5347n7981k9159l8887l3687j8222l0193
17164E08781j0611J6911K0709K8876M770m7147l3579l8153n6279m4019j9906j7255
17152C13098k2564J799J3940J8874j2353L6916L8793O3139k1333l7506k3085M205
17140C73923L3085J5298K0521M86J3905K131P5138J7510j33238p5672n1786J4855
17128C06156K0006j0977k5185k8864j6542q528K1174q1k0647Q717j6907j0529
17116B17793P508J6508q116K5958L5655l1545l1603m399l8520r1192j23246o8082
17104i3281N1368O5064M5676L5187M3218N2917J24061R3545l0399j42904n9686
$$ plain form
17093 184766 194016 192623 197621 173425 123189 116143 93640 73076 53030 48148 52242 52464 38915
17080 38915 47609 53504 74795 97725 119282 121610 102275 87676 36684 -23807 -91279 -185762
17068 -185762 -256881 -217133 -138514 -110200 -81020 -54413 -20025 3052 4531 10478 -6273 -28719
17056 -28719 -2654 7378 4473 -8178 -2481 -18750 -11577 5252 10673 25683 10229 -1795
17044 -1795 -12764 -6721 -7413 -6597 30127 33173 27991 31725 12291 -6844 -2962 7174 914 -30749
17030 -30749 -24186 -32717 -35988 -34288 -25035 -6266 3285 5076 -8342 -36612 -30270 -3741 -31101
17017 -31101 -36824 -26899 -51790 -76474 -62413 -33968 26710 70343 83826 30872 -28312 -22579
17005 -22579 31246 69522 47072 35901 21284 -7432 -36135 1660 8217 -16796 -26234 -27964
$$ packed form
17093A84766R250j393M998k4196n0236p046k2503k0564k0046m882M094K22j3549
17080C8915Q694N895K1291K2930K1557K328j9335j4599n0992o0491o7472r4483
17068a85762p1119L9748P8619K8314K9180K6607L4388K3077J479N947j6751k2446
17056b8719K6065J0032k905j2651N697j6269P173J6829N421J5010j5454j2024
17044a795j0969O043o92Q16L6724L046n182L734j9434j9135L882J0136o260l1663
17030c0749O563q531l271J700R253J8769R551J791j3418k8270O342K6529k7360
17017c1101n723R925k4891k4684J4061K8445O0678M3633J3483n2954n9184N733
17005b2579N3825L8276k2450j1171j4617k8716k8703L7795O557k5013r438j730
$$ plain form
16993 -27964 -17883 -25085 -75896 -82060 -39507 -18031 -12656 -3881 10376 12289 -13802 -47716 -72603
16980 -72603 -84789 -93435 -96964 -72174 -56475 -53480 -27765 -1882 -20287 -64365 -100494 -95748
16968 -95748 -54885 -23160 23870 32857 29510 15857 5234 -13515 -20662 -23247 -8844 26131
16956 26131 79199 100342 70105 55575 11886 -43206 -69299 -63563 -75761 -57699 -29514 -15227
16944 -15227 -20051 -44281 -61821 -67005 -57391 -35202 -626 14056 -33425 -62302 -58214 -19337
16932 -19337 -17666 -12644 -28290 -37267 -55686 -58911 -32556 -22932 -16656 -13724 -18373 17093 38972
16919 38972 39065 48662 39000 17778 -34363 -51130 -55053 -80055 -58756 -39980 -93597 -121962 -90464
16906 -90464 -42876 -28803 -35805 -51166 -51501 -58361 -58451 -70090 -70263 -80358 -82448 -68341 -79052 -78455
$$ packed form
16993b7964J0081p202n0811o164M2553K1476N375Q775J4257J913k6091l3914k4887
16980g2603j2186q646l529K4790J5699K995K5715K5883j8405m4078l6129M746
16968i5748M0863L1725M7030Q987l347j3653j0623j8749p147k585J4403L4975
16956B6131N3068K1143l0237j4530m3689n5092k6093N736j2198J8062K8185J4287
16944a5227m824k4230j7540n184R614K2189L4576J4682m7481k8877M088L8877
16932a9337J671N022j5646q977j8419l225K6355R624O276K932m649L5466K1879
16919C8972R3R597r662k1222n2141j6767l923k5002K1299J8776n3617k8365L1498
16906i0464M7588J4073p002j5361l35o860r0j1639j73j0095k090J4107j0711N97
$$ plain form
16892 -78455 -56115 -27634 -26417 -37667 -51171 -48831 -36533 -54187 -48182 -11972 -20395 -37631
16880 -37631 -18767 -15790 -29381 -55320 -84207 -73126 -72256 -64098 -73856 -82474 -43572 -16261 -23883
16867 -23883 -39453 -41562 -37199 -50608 -39630 -15116 -16820 -24372 -22538 -32916 -53711 -61671 -59696
16854 -59696 -43135 -27298 -26451 -22068 -54184 -55387 -53207 -55521 -63422 -83128 -36479 6599 -9168
16841 -9168 -47892 -56804 -67177 -57088 -69649 -78147 -44352 -17558 -22475 -54696 -51563 -31798 1352
16828 1352 2146 21197 33503 10615 -18014 -10845 -43538 -59278 -7438 -3846 300 -9909 -24108
16815 -24108 -11118 -12229 -24599 -56480 -61950 -57649 -46689 -38715 -53420 -96343 -111167 -104564 -118158
16802 -118158 -112772 -106839 -93494 -72808 -77873 -90834 -88033 -71803 -34896 -24659 -31805 -22151 -24047
$$ packed form
16892g8455K2340K8481J217j1250j3504K340J2298j7654O005L6210q423j7236
16880c7631J8864K977j3591k5939k8887J1081Q70Q158r758q618L8902K7311p622
16867b3883j5570k109M363j3409J0978K4514j704p552J834j0378k0795p960J975
16854e9696J6561J5837Q47M383l2116j203K180k314p901j9706M6649M3078j5767
16841i168l8724q912j0373J0089j2561q498L3795K6794m917l2221L133J9765L3150
16828A352P94J9051J2306k2888k8629P169l2693j5740N1840L592M146j0209j4199
16815b4108J2990j111j2370l1881n470M301J0960P974j4705m2923j4824O603j3594
16802a18158N386N933J3345K0686n065j2961K801J6230L6907J0237p146R654j896
$$ plain form
16789 -24047 -13004 -29233 -55349 -43971 -40528 -14806 34416 21967 9122 -30497 -68455 -87648
16777 -87648 -91897 -89372 -69020 -72615 -55290 -32094 -12640 -29955 -5886 8691 -20503 -26106
16765 -26106 -47097 -41684 -39823 -29861 -27122 -66916 -63048 -51805 -62390 -57761 -24126 -14166 -52736
16752 -52736 -69935 -52209 -62108 -53467 -12460 -24224 -61923 -76696 -42828 -20438 1568 31132
16740 31132 26650 13131 12203 12698 -15739 -30371 -20448 -14019 -13445 -9606 991 -7605 -15212 -26721
16726 -26721 -44596 -29380 -11503 26028 74288 94213 112464 136612 139260 130104 142636 210156
16714 210156 310404 501902 730252 953242 1176285 1416365 1704551 1863652 1570585 1042543
16704 1042543 671750 471440 321889 186986 120617 94592 73921 64886 66705 41744 25186
$$ packed form
16789b4047J1043j6229k6116J1378L443K5722M9222j2449j2845l9619l7958j9193
16777h7648m249K525K0352l595J7325K3196J9454j7315K4069J4577k9194n603
16765b6106k0991N413J861R962K739l9794L868J1243j0585M629L3635R960l8570
16752e2736j7199J7726r899Q641M1007j1764l7699j4773L3868K2390K2006K9564
16740C1132m482j3519r28M95k8437j4632R923O429N74L839J0597q596p607j1509
16726b6721j7875J5216J7877L7531M8260J9925J8251K4148K648r156J2532O7520
16714B10156J00248J91498K28350K22990K23043K40080K88186J59101k93067n28042
16704A042543l70793k00310j49551j34903o6369k6025k0671r035J819k4961j6558
$$ plain form
16693 25186 21670 63700 91569 90020 101735 81853 64884 21995 35004 30478 21503 56018
16681 56018 81281 107448 146844 228036 375407 585926 800056 1002403 1155942 1370004
16671 1370004 1660651 1737830 1340402 845699 512087 300865 193991 136063 98673 71571
16661 71571 17412 -15233 -13868 2954 -3382 -9127 -5410 -26674 -41043 -22568 -34717 -33792 -14185
16648 -14185 -36866 -51250 -59151 -45011 -46164 -34582 -45219 -27031 -27754 -49000 -36590 3972
16636 3972 -4709 -20688 -14257 -3657 -731 -1332 12765 19716 16444 -3923 -17926 -29139 5207
16623 5207 926 -39256 -36297 -30726 -33858 -44440 -29533 1837 -4561 -23802 -23256 -29124 -41236
16610 -41236 -57286 -73904 -91769 -50936 -13950 -7895 7386 1334 -7175 -25773 -34034 -44740
$$ packed form
16693B5186l516M2030K7869j549J1715j9882j6969m2889J3009m526q975L4515
16681E6018K5263K6167L9396Q1192J47371K10519K14130K02347J53539K14062
16671A370004K90647P7179l97428m94703l33612k11222j06874n7928l7390k7102
16661G1571n4159l2645J365J6822o336n745L717k1264j4369J8475j2149R25J9607
16648a4185k2681j4384p901J4140j153J1582j0637J8188p23k1246J2410M0562
16636C972q681j5979O431J0600K926o01J4097O951l272k0367j4003j1213L4346
16623E207m281m0182K959N571l132j0582J4907L1370o398j9241N46n868j2112
16610d1236j6050j6618j7865M0833L6986O055J5281o052q509j8598q261j0706
$$ plain form
16598 -44740 -60232 -63549 -52329 -38066 -20766 -18061 -20908 -33448 -28241 -6244 21445 27452 206
16585 206 -10213 -17749 -26730 -48505 -68464 -60532 -17147 8212 6601 -6929 -18841 -25124 -32367
16572 -32367 -62311 -36695 -19974 11062 -769 -21150 245 29286 144 -33737 -39506 -23250
16560 -23250 9836 7201 -15597 -39413 -45524 -49106 -60932 -37409 -63138 -101113 -67617 -66926 -44765
16547 -44765 -21368 -19582 -20897 -8633 -11040 -23473 -48830 -45724 -47601 -38467 -5678 -3653 -8126
16534 -8126 -22106 -33877 -36529 -42423 -23294 -15346 -12061 589 -2874 -3701 -20339 -54168 -53999 -54098
16520 -54098 -56582 -61966 -50521 -27329 -2444 2563 3820 -11800 -24658 -23920 -52822 -71964 -85532
16507 -85532 -86070 -86534 -91660 -73344 -63455 -65917 -71668 -81162 -92385 -103631 -103612 -120260 -100969 -73174
$$ packed form
16598d4740j5492l317J1220J4263J7300K705k847j2540N207K1997K7689O007k7246
16585B06j0419p536q981k1775j9959P932M3385K5359j611j3530j1912o283p243
16572c2367k9944K5616J6721L1036j1831k0381K1395K9041k9142l3881n769J6256
16560b3250L3086k635k2798k3816o111l582j1826K3523k5729l7975L3496O91K2161
16547d4765K3397J786j315J2264k407j2433k5357L106j877R134L2789K025m473
16534h126j3980j1771k652n894J9129P948L285J2650l463q27j6638l3829J69r9
16520e4098k484n384J1445K3192K4885N007J257j5620j2858P38k8902j9142j3568
16507h5532n38m64n126J8316R889k462n751r494j1223j1246J9j6648J9291K7795
$$ plain form
16493 -73174 -47956 -60329 -61471 -41144 -32454 -30705 -3871 -15239 -35739 -55905 -82676 -70666
16481 -70666 -82784 -99827 -91021 -101117 -95049 -71426 -70051 -53880 -58234 -64365 -38703 -31100 -48912
16468 -48912 -58871 -36420 -166 -5165 -36481 -3290 41829 26196 -21670 -51023 -26492 -15705
16456 -15705 -6388 -4750 5013 19042 20727 -15415 -40319 -35659 -8169 -19156 -29367 -57145 -28601
16443 -28601 -51096 -54819 -32024 -16399 -36471 -39977 -26838 -8386 -12845 -47268 -77323 -65317
16431 -65317 -64611 -36466 7084 9389 -5730 28841 43044 21982 -27724 -78669 -72922 -30960
16419 -30960 -29449 -27338 -14132 -11841 -19558 -27907 -936 -3539 -16923 -36847 -26682 -26487 -11043
16406 -11043 -20757 -35258 -58369 -103726 -95819 -62471 -42158 -27819 -41160 -48959 -56902 -62415 -55521
$$ packed form
16493g3174K5218j2373j142K0327Q690J749K6834j1368k0500k0166k6771J2010
16481g0666j2118j7043Q806j0096O068K3623J375J6171m354o131K5662P603j7812
16468d8912r959K2451L6254m999l1316L3191M5119j5633m7866k9353K4531J0787
16456a5705R317J638R763J4029J685l6142k4904M660K7490j0987j0211k7778K8544
16443b8601k2495l723K2795J5625k0072l506J3139J8452m459l4423l0055J2006
16431f5317P06K8145M3550K305j5119L4571J4203k1062m9706n0945N747M1962
16419c0960J511K111J3206K291p717q349K6971k603j3384j9924J0165J95J5444
16406a1043r714j4501k3111m5357P907L3348K0313J4339j3341p799p943n513O894
$$ plain form
16393 -55521 -51112 -62945 -45282 -74217 -93756 -75229 -36970 -46548 -82009 -61321 -51939 -36148
16381 -36148 -46348 -43448 -42699 -42554 -33281 -6447 21292 33979 41730 57984 68432 31786 9086
16368 9086 -510 -26718 -8878 5157 -4214 -7684 -15978 -31630 -28996 -19042 -29133 -44338 -53492
16355 -53492 -35688 -53522 -60232 -56079 -34428 -47465 -27811 -18315 -18864 -33920 -39192 -34693 -38179
16342 -38179 -51211 -52650 -57268 -38574 -16366 -11380 -35758 -13218 24401 59701 50276 34930
16330 34930 9044 9154 -542 -25450 -48812 -35998 -30844 -27225 -13089 -21295 -21266 -18583 6820 22808
16316 22808 11156 -23820 -50207 -75358 -53638 -12807 -7789 -10311 264 -1427 -12495 7692
16304 7692 28576 23432 5404 261 10410 16687 -27835 -44731 -50493 -60062 -36405 -66675 -68740
$$ packed form
16393e5521M409j1833J7663k8935j9539J8527L8259r578l5461K0688R382J5791
16381c6148j0200K900P49J45R273K6834K7739J2687P751J6254J0448l6646k2700
16368I086r596k6208J7840J4035r371l470q294j5652K634R954j0091j5205r154
16355e3492J7804j7834o710M153K1651j3037J9654R496n49j5056n272M499l486
16342c8179j3032j439m618J8694K2208M986k4378K2540L7619L5300r425j5346
16330C4930k5886J10r696k4908k3362J2814N154L619J4136q206K9K683K5403J5988
16316B2808j1652l4976k6387k5151K1720M0831N018k522J0575j691j1068K0187
16304G692K0884n144j8028n143J0149O277m4522j6896n762r569K3657l0270k065
$$ plain form
16291 -68740 -69578 -69188 -44148 -20452 -2510 548 -29574 -28238 -35759 -31157 -49363 -65690 -77375
16278 -77375 -59551 -31839 -8611 6537 11430 4196 -6352 -6249 -7960 206 27280 13539 -12272
16265 -12272 -8069 -35194 -51861 -51311 -67429 -78223 -75045 -58622 -70997 -64051 -63433 -68450 -55920
16252 -55920 -39641 -29966 -17461 4156 11293 6813 837 10059 -13052 -35802 -49698 -17248 -9147
16239 -9147 -28838 -31597 -26986 -6384 2943 -15611 -13513 5828 -13432 -15845 -60690 -94277 -98802
16226 -98802 -71280 -36743 -12441 -14671 -39449 -55599 -41492 -33254 -9733 -23609 -19917 16736
16214 16736 31417 16251 -36007 -54287 -77110 -78118 -13326 -2197 -13102 210 20047 17333
16202 17333 26474 31281 -21699 -14963 -11260 -25557 -48894 -57915 -32923 -34786 -28793 -24127 -35940
$$ packed form
16291f8740q38L90K5040K3696J7942L058l0122J336p521M602j8206j6327j1685
16278g7375J7824K7712K3228J5148M893p234j0548J03j711Q166K7074j3741k5811
16265a2272M203k7125j6667N50j6118j0794L178J6423j2375O946O18n017J2530
16252e5920J6279R675J2505K1617P137m480n976R222k3111k2750j3896L2450Q101
16239i147j9691k759M611K0602R327j8554K098J9341j9260k413m4845l3587m525
16226i8802K7522L4537K4302k230k4778j6150J4107Q238K3521j3876L692L6653
16214A6736J4681j5166n2258j8280k2823j008O4792J1129j0905J3312J9837k714
16202A7333R141M807n2980O736L703j4297k3337r021K4992j863N993M666j1813
$$ plain form
16189 -35940 -75758 -92741 -57490 -32492 -27185 -42909 -56104 -51902 -43674 -61908 -44881 -42324
16177 -42324 -42445 412 14280 -1296 -48555 -89270 -50364 -23827 -4931 -20967 -31560 -51253
16165 -51253 -46851 -22748 -6904 -41734 -34148 7787 1525 579 -14835 -22867 -12077 -24980 -3311
16152 -3311 -1585 -35578 -66733 -68933 -61711 -40962 -18078 -37577 -37118 -20284 -7231 -12034 -58877
16139 -58877 -68892 -65715 -65224 -74619 -55865 7479 9890 -20630 -5292 -25087 -52104 -55982 -52072
16126 -52072 -76518 -63594 -37143 -7800 -8380 3679 2143 8085 9052 -4898 -10134 -5068 13481
16113 13481 25677 10040 4527 -9823 -7922 -8637 8438 10145 -2067 7939 -16392 -19704 -52639
16100 -52639 -50385 -51488 -50456 -51184 -45221 -44761 -33636 -10658 -33100 -32854 -13817 22923 807 -18848
$$ packed form
16189c5940l9818j6983L5251K4998N307j5724j3195M202Q228j8234J7027K557
16177d2324j21M2857J3868j5576m7259m0715L8906K6537J8896j6036j0593j9693
16165e1253M402K4103J5844l4830P586M1935o262r46j5414q032J0790j2903K1669
16152c311J726l3993l1155k200P222K0749K2884j9499M59J6834J3053m803m6843
16139e8877j0015L177M91r395J8754O3344K411l0520J5338j9795k7017l878L910
16126e2072k4446J2924K6451K9343n80J2059j536N942R67j3950n236N066J8549
16113A3481J2196j5637n513j4350J901p15J7075J707j2212J0006k4331l312l2935
16100e2639K254j103J032p28N963M60J1125K2978k2442K46J9037L6740k2116j9655
$$ plain form
16086 -18848 -26042 -9557 9291 10331 -24923 -28770 -53337 -63996 -49146 -36353 -25724 -7205
16074 -7205 -30156 -29112 -29010 -50257 -68756 -46956 -37642 -44264 -39088 299 10308 -5621 -28270
16061 -28270 -29889 -28544 -29689 -18244 8127 18572 -6233 223 5836 14059 7723 14824 14661 -6611
16047 -6611 -1455 13464 25591 4403 -15817 -23621 -25846 -22226 -27478 -27865 -20443 -7231 4570
16034 4570 23230 7329 -30781 -63758 -73236 -54853 -70956 -67497 -68311 -61330 -54841 -48894 -23982
16021 -23982 -35473 -62479 -63740 -33463 -20776 -18897 -37737 -44934 -30633 -19985 5384 33036
16009 33036 27983 -3616 -7715 -14780 -6733 -23510 -14568 19772 4508 -31822 4012 -23117 -42070
15996 -42070 -27139 -32916 -13241 -532 -33992 -43807 -31724 -6723 -14882 -3980 474 -27260
$$ packed form
16086a8848p194J6485J8848J040l5254l847k4567j0659J4850J2793J0629J8519
16074g205k2951J044J02k1247j8499K1800R314o622N176L9387J0009j5929k2649
16061b8270j619J345j145J1445K6371J0445k4805O456N613Q223o336P101j63k1272
16047f611N156J4919J2127k1188k0220p804k225L620n252l87P422J3212J1801
16034D570J8660j5901l8110l2977r478J8383j6103L459q14O981O489N947K4912
16021b3982j1491k7006j261L0277J2687J879j8840p197J4301J0648K5369K7652
16009C3036n053l1599m099p065Q047j6777Q942L4340j5264l6330L5834k7129j8953
15996d2070J4931n777J9675J2709l3460r815J2083K5001q159J0902M454k7734
$$ plain form
15984 -27260 -49791 -39332 -39719 -76793 -64107 -18525 3731 -2073 -10728 -3707 18368 28834 36681
15971 36681 26292 6535 14854 14448 21431 14055 -11209 -19207 -14630 -36716 -19783 17601 25589
15958 25589 -6850 -13559 4928 -5741 -11620 -18693 -17555 -7088 -7712 -5112 -43273 -49291 -13330
15945 -13330 -11848 5524 -3483 -21004 431 4195 8141 9380 -14818 -10152 -9162 8324 4533
15932 4533 37382 40127 24692 18878 -2584 -14803 -8713 -9915 -6223 255 290 -12551 -31915 -27611
15918 -27611 -10870 3678 -21820 -38416 -12618 5130 4684 15194 -4196 -14601 -29155 -19391
15906 -19391 -9728 -22761 -6991 -12113 -15475 6351 28148 5455 -30897 -70889 -63169 -45428
15894 -45428 -40460 -54578 -66149 -53634 -62658 -27176 33751 5273 -2399 -1455 38721 30260 18835
$$ packed form
15984b7260k2531J0459l87l7074J2686M5582K2256n804q655P021K2075J0466P847
15971C6681j0389j9757Q319m06O983p376k5264p998M577k2086J6933L7384P988
15958B5589l2439o709J8487j0669n879p073J138J0467o24K600l8161o018L5961
15945a3330J482J7372r007j7521K1435L764L946J239k4198M666R90J7486l791
15932D533L2849K745j5435n814k1462j2219O090j202L692O478L5j2841j9364M304
15918b7611J6741J4548k5498j6596K5798J7748m46J0510j9390j0405j4554R764
15906a9391R663j3033J5770n122l362K1826K1797k2693l6352l9992P720J7741
15894d5428M968j4118j1571J2515r024L5482O0927k8478p672R44M0176q461j1425
$$ plain form
15881 18835 31474 30890 19359 -13211 -25807 -8921 -12438 -10516 -28699 -43023 -48242 -10476 2497
15868 2497 -2810 -11507 3800 10719 12751 29341 16947 -5793 -6773 -13246 -46896 -46408 -41055 -50311
15854 -50311 -54027 -52573 -40650 -41049 -38913 -16568 4501 12461 14659 5946 11585 12779 -2936 -1709
15840 -1709 -3153 -15982 -15605 -13396 -28439 -22709 -22542 -13019 -27050 -52246 -58829 -57443 -30694 -23414
15826 -23414 4676 20002 24891 15757 23368 48757 52305 20728 13075 17068 20784 -464 15076
15813 15076 26315 27274 34947 39937 33611 12043 -22238 -35600 -38273 -12765 -28897 -20118 5600
15800 5600 9083 -17323 -27968 -58507 -40481 -17432 -1921 -4974 2829 -10808 -41961 -42020 -49995
15787 -49995 -47497 -28045 -26905 -21270 -43405 -49466 -60615 -57517 -45371 -36147 -32136 -67947 -90581
$$ packed form
15881A8835J2639n84j1531l2570j2596J6886l517J922j8183j4324n219L7766J2973
15868B497n307q697J5307O919K032J6590j2394k2740r80o473l3650M88N353r256
15854e0311l716J454J1923l99K136K2345K1069P960K198q713N639J194j5715J227
15840a709j444j2829L77K209j5043N730J67R523j4031k5196o583J386K6749P280
15826b3414K8090J5326M889r134P611K5389L548l1577p653L993L716k1248J5540
15813A5076J1239R59P673M990o326k1568l4281j3362k673K5508j6132Q779K5718
15800E600L483k6406j0645l0539J8026K3049J5511l053P803j3637l1153n9p975
15787d9995K498J9452J140N635k2135o061j1149L098J2146R224M011l5811k2634
$$ plain form
15774 -90581 -25687 2328 5840 -8499 -10336 -13066 -5847 -10296 3117 -7140 -36455 -43745 -40372
15761 -40372 -43325 -35733 -18255 3781 16377 12012 -26350 -16293 17342 30504 31415 17413 8107
15748 8107 -4010 -23373 -57152 -74343 -48113 -40040 -37076 -23714 -28476 -39279 -49498 -47082 -53738
15735 -53738 -43064 -32916 -31486 -1566 -21760 -67535 -80815 -22762 22140 4532 -2302 9506
15723 9506 1693 -1663 -4134 22478 24189 34818 35663 36909 48954 39494 10119 -17825 -46176
15710 -46176 -32787 -17528 -10704 3746 -4792 9033 47034 48409 35851 43338 37143 20527 14933
15697 14933 10270 27848 30695 30195 6131 -10324 -23122 -53846 -58539 -52721 -48313 -47408 -18763
15684 -18763 3107 -28987 -78279 -70051 -33606 -32597 -42042 -37956 -28325 -14375 -35862 -56221 -56644
$$ packed form
15774i0581O4894K8015L512j4339j837k730P219m449J3413j0257k9315p290L373
15761d0372k953P592J7478K2036J2596m365l8362J0057L3635J3162R11j4002r306
15748H107j2117j9363l3779j7191K6230Q073K964J3362m762j0803j0219K416o656
15735e3738J0674J0148J430K9920k0194m5775j3280N8053M4902j7608o834J1808
15723I506p813l356k471K6612J711J0629Q45J246J2045r460k9375k7944k8351
15710d6176J3389J5259O824J4450q538J3825L8001J375j2558P487o195j6616n594
15697A4933m663J7578K847n00k4064j6455j2798l0724m693N818M408R05K8645
15684a8763K1870l2094m9292Q228L6445J009r445M086R631J3950k1487k0359m23
$$ plain form
15671 -56644 -34963 -70737 -91016 -66849 -50875 -72675 -100262 -121751 -110773 -48242 15513 24035
15659 24035 16038 24910 30103 11122 -4342 -25442 -23972 -15035 -10440 9235 -753 -24078 -11412
15646 -11412 -23239 -10522 35672 61611 28882 -4136 -27508 -14727 -14381 -34340 -38206 -26235
15634 -26235 -7533 -20643 -39647 -62472 -34635 -5002 -3172 -24377 -38093 -9306 8512 26596
15622 26596 35883 -4919 -5963 3005 -7542 5402 12530 -6393 -33886 -7276 6138 -20886
15610 -20886 -10359 -7729 1994 -6276 -15984 -12090 -15167 -40198 -72009 -53876 -7896 33013 51087
15597 51087 50972 25838 20569 5351 -42811 -55501 -25606 -9698 -3623 -4082 -3646 908 -11205
15584 -11205 20136 66245 82846 78618 63863 38207 23412 15211 25974 33919 3149 17710
$$ packed form
15671e6644K1681l5774k0279K4167J5974k1800k7587k1489J0978O2531O3755Q522
15659B4035p997Q872N193j8981j5464k1100J470Q937M595J9675r988k3325J2666
15646a1412j1827J2717M6194K5939l2729l3018k3372J2781L46j9959l866J1971
15634b6235J8702j3110j9004k2825K7837K9633J830k1205j3716K8787J7818J8084
15622B6596R287m0802j044Q968j0547J2944P128j8923k7493K6610J3414k7024
15610b0886J0527K630R723q270r708L894l077k5031l1811J8133M5980M0909J8074
15597E1087j15k5134n269j5218m8162j2690K9895J5908O075m59M36M554j2113
15584a1205L1341M6109J6601m228j4755k5656j4795q201J0763P945l0770J4561
$$ plain form
15572 17710 11118 10972 7803 -4571 5774 10804 15314 -11117 -16876 -2309 -5481 -15961 -16367 5618
15558 5618 22518 17990 -18595 -51275 -46173 -39580 -7403 -20708 1918 -618 -13914 -32791 -12748
15545 -12748 -13407 -16193 -27974 -21911 -3749 18347 39298 16920 -2298 24976 22100 17859 18964
15532 18964 -1766 -18398 -37170 -15935 -10590 5555 28889 22665 3017 17402 22107 3806
15520 3806 -6796 7565 1173 -28643 -53053 -20633 -2651 -9349 -33334 -44593 -65311 -57556
15508 -57556 -43683 -30710 -15852 -27828 -8482 656 -16029 13294 23941 2607 -3352 -11393
15496 -11393 -21563 -28216 -4466 7590 21347 28944 16042 35793 32552 7775 -2464 4924
15484 4924 4514 -601 12663 14252 -7828 -806 9325 24878 36417 36741 23415 14218 7258 30085
$$ packed form
15572A7710o592j46l169j2374J0345N030M510k6431n759J4567l172j0480m06K1985
15558E618J6900m528l6585l2680N102O593L2177j3305K2626k536j3296j8877K0043
15545a2748o59k786j1781O063J8162K2096K0951k2378j9218K7274k876m241J105
15532A8964k0730j6632j8772K1235N345J6145K3334o224j9648J4385M705j8301
15520C806j0602J4361o392k9816k4410L2420J7982o698k3985j1259k0718P755
15508e7556J3873J2973J4858j1976J9346R138j6685K9323J0647k1334n959q041
15496a1393j0170o653K3750J2056J3757P597j2902J9751l241k4777j0239P388
15484D924m10n115J3264J589k2080P022J0131J5553J1539L24j3326r197o960K2827
$$ plain form
15470 30085 -5387 -23428 -15518 -37212 -48960 -24009 -17745 -45693 -42189 -1564 48773 77096
15458 77096 46963 -6843 -40397 -65849 -63851 -37481 -34800 -18432 18144 15685 743 13482
15446 13482 -347 -15381 -20014 -11830 -28345 -23016 -11944 -19884 -33474 -3705 11918 7892 -17888
15433 -17888 -5948 -4763 -35174 -72255 -76347 -77770 -66917 -46080 -45618 -41090 -38428 -19427 -22738
15420 -22738 -17876 -15150 10467 -1089 -16963 -17535 -23002 -1606 17709 19123 -23881 -25618 -14954
15407 -14954 -47736 -51524 -62657 -49753 -42164 -21993 -31915 -18809 -14543 -13261 -15373 -44782 -69064
15394 -69064 -54096 -47778 -45366 -4491 10450 28627 862 -27273 -18304 31513 28530 2713
15382 2713 -4152 -13336 -24066 -23970 -34496 -34865 -7724 -5176 -41082 -57320 -58107 -46705 -41830 -42772
$$ packed form
15470C0085l5472j8041P910k1694j1748K4951O264k7948L504M0625N0337K8323
15458G7096l0133n3806l3554k5452J998K6370K681J6368L6576k459j4942J2739
15446A3482j3829j5034m633Q184j6515N329J1072p940j3590K9769J5623m026k5780
15433a7888J1940J185l0411l7081m092j423J0853K0837M62M528K662J9001l311
15420b2738M862K726K5617j1556j5874n72n467K1396J9315J414m3004j737J0664
15407a4954l2782l788j1133J2904P589K0171r922J3106M266J282k112k9409k4282
15394f9064J4968O318K412M0875J4941J8177k7765k8135Q969M9817k983k5817
15382B713o865r184j0730R6j0526l69K7141K548l5906j6238p87J1402M875r42
$$ plain form
15368 -42772 -52808 -55943 -60201 -66517 -63349 -43737 -24345 -26541 -10471 -40516 -55466 -57655 -29273
15355 -29273 -18276 -31756 -18468 -438 24714 24953 -868 -32662 -51163 -34340 -14580 16475
15343 16475 40610 -3314 -26824 5674 10819 -8273 -6978 10438 -496 -30847 -33485 -20534
15331 -20534 -18193 -56539 -96751 -49462 -37992 -37959 -58341 -74072 -46690 -16891 -32599 -53222
15319 -53222 -46132 -53750 -47120 -53732 -37326 -15877 -19231 -16537 -43488 -71447 -93078 -81220 -48309
15306 -48309 -33149 -20487 -12695 -59 5555 -22203 -51982 -51023 -57966 -51422 -43811 -50904 -37061
15293 -37061 -23668 -47790 -39537 -17726 -6645 20250 7172 -6513 -23759 -3973 -30416 -54279
15281 -54279 -18321 -4800 -5870 -11687 -2793 -14161 -5968 -1802 1442 -14600 -5116 -5162 -15430 -9287
$$ packed form
15368d2772j0036l135m258o316L168J9612J9392k196J6070l0045j4950k189K8382
15355b9273J0997j3480J3288J8030K5152K39k5821l1794j8501J6823J9760L1055
15343A6475K4135m3924k3510L2498N145j9092J295J7416j0934l0351k638J2951
15331b0534K341l8346m0212M7289J1470L3k0382j5731K7382K9799j5708k0623
15319e3222P090p618O630o612J6406K1449l354K694k6951k7959k1631J1858L2911
15306d8309J5160J2662P792J2636N614k7758k9779R59o943O544P611p093J3843
15293c7061J3393k4122Q253K1811J1081K6895j3078j3685j7246J9786k6443k3863
15281e4279L5958J3521j070n817Q894j1368Q193M166L244j6042R484m6j0268O143
$$ plain form
15267 -9287 -15759 -22566 -5771 -3565 -1192 -27979 -33304 607 -7645 -6342 -10113 -12694 -19822 -35884
15253 -35884 -59686 -63388 -39957 -19521 4193 14174 23495 32415 -18163 -35566 -9053 -15936 -14850
15240 -14850 6875 33501 36809 35604 1686 -18742 -28409 3605 8497 -15901 -9159 13491 18729
15227 18729 -20738 -66946 -60816 -35089 -19030 26856 44728 26360 13473 13150 39031 28505
15215 28505 -22321 -31828 -14137 2498 813 -6240 -21343 -54753 -67422 -27115 -18221 -17426 -25431
15202 -25431 -39383 -37432 -22450 -23876 -41127 -46850 -24338 -26500 -29784 -29982 -30638 -30284 -27634 -44191
15188 -44191 -30254 2500 -11690 -49787 -47192 -45491 -68350 -34516 190 -29057 -7532 17573
15176 17573 32112 18812 10547 10761 26209 6712 14327 7948 9238 14755 25828 15049 -27892
$$ packed form
15267i287o472o807J6795K206K373k6787n325L3911q252J303l771k581p128j6062
15253c5884k3802l702K3431K0436K3714R981R321Q920n0578j7403K6513o883J086
15240a4850K1725K6626L308j205l3918k0428r667L2014M892k4398O742K2650N238
15227A8729l9467m6208O130K5727J6059M5886J7872j8368j2887l23K5881j0526
15215B8505n0826r507J7691J6635j685p053j5103l3410j2669M0307Q894P95q005
15202b5431j3952J951J4982j426j7251n723K2512k162l284j98o56L54K650j6557
15188d4191J3937L2754j4190l8097K595J701k2859L3834L4706k9247K1525K5105
15176A7573J4539j3300q265K14J5448j9497P615o379J290N517J1073j0779m2941
$$ plain form
15163 -27892 -8651 5109 -2583 -3490 -1668 -20255 -20160 -14734 -19476 -18376 -55572 -68898 -49235 -35262
15149 -35262 -26595 -22933 -44324 -31578 -15844 5983 45190 60225 61621 51741 25720 11495
15137 11495 19045 13308 -3542 -12659 -29188 -41326 -62107 -17501 2585 31026 44117 -1603
15125 -1603 -24493 3506 4812 5698 3282 -11714 -4068 -17502 -19128 -38159 -47010 -32965 -19680
15112 -19680 -49124 -86492 -68706 -46215 -47327 -65344 -46043 -31604 -14541 4458 -13504 -18072
15100 -18072 -2789 24279 -3288 -43735 -40737 -44707 -26947 -9191 2090 10497 5337 -2990 9891
15087 9891 1438 -30322 -54522 -44986 -29300 -32169 -6190 21884 6419 2019 2275 5871 5055 -12101
15073 -12101 -12769 -19557 -41835 -25815 -1418 7113 -27323 -42360 -27344 -39402 -30689 -1445 -4674
$$ packed form
15163b7892J9241J3760p692r07J822j8587R5N426m742J100l7196j3326J9663J3973
15149c5262Q667L662k1391J2746J5734K1827L9207J5035J396r880k6021j4225
15137A1495P550n737j6850r117j6529j2138k0781M4606K0086K8441J3091m5720
15125a603k2890K7999J306Q86k416j4996P646j3434j626j9031q851J4045J3285
15112a9680k9444l7368J7786K2491j112j8017J9301J4439J7063J8999j7962m568
15100a8072J5283K7068k7567m0447K998l970J7760J7756J1281Q407n160q327J2881
15087I891q453l1760k4200R536J5686k869K5979K8074j5465m400K56L596q16j7156
15073a2101o68o788k2278J6020K4397Q531l4436j5037J5016j2058Q713K9244l229
$$ plain form
15060 -4674 18225 45440 35472 11738 -17606 -22015 -18963 -15072 -18036 -14364 5602 -6963 1100
15047 1100 -4216 -403 9524 -18786 -6084 20881 41056 32252 30565 28616 6467 6836 11719 4671
15033 4671 28594 31010 24460 10481 12526 22045 38767 57956 33644 11191 -3948 -16878 -25601
15020 -25601 -15238 -22437 -45928 -46143 -35916 -7558 15192 24822 41548 73742 81066 70790 40955
15007 40955 13170 -18929 -1509 -9690 -21981 -1226 24411 21917 6124 -14623 -65013 -67442
14995 -67442 -59260 -29774 -6784 -9844 -33299 -40097 -33455 -14527 -8607 34139 51221 40839 37521
14982 37521 25422 10351 20190 14413 17305 23668 10627 19893 33618 53012 53410 40270 43047
14969 43047 4497 -5306 28471 24896 -17825 -17511 350 4318 22745 20211 5322 -25394 -27417
$$ packed form
15060d674K2899K7215r968k3734k9344m409L052L891k964L672J9966j2565Q063
15047A100n316L813R927k8310J2702K6965K0175q804j687j949k2149L69M883p048
15033D671K3923K416o550j3979K045R519J6722J9189k4312k2453j5139j2930q723
15020b5601J0363p199k3491k15J0227K8358K2750R630J6726L2194P324j0276k9835
15007D0955k7785l2099J7420q181j2291K0755K5637k494j5793k0747n0390k429
14995f7442Q182K9486K2990l060k3455o798O642J8928N920M2746J7082j0382l318
14982C7521j2099j5071R839n777K892O363j3041R266J3725J9394L98j3140K777
14969D3047l8550r803L3777l575m2721L14J7861L968J8427k534j4889l0716k023
$$ plain form
14956 -27417 -13801 -7941 -11704 15266 42793 27906 30017 14962 8196 16031 6714 16091 56092
14943 56092 45809 23222 50881 43943 12101 -5884 4903 36075 22063 7524 -8155 -30978
14931 -30978 -27585 -20450 -10801 33138 48612 20241 6481 -12139 -9356 9415 433 -6412 -19492
14918 -19492 -23939 -16305 -6329 10164 -2827 -17081 -20735 -10059 -3498 5029 4455 27025 -1460
14905 -1460 -20033 -20229 -38774 -23467 31824 5316 -28031 -32220 -38706 -44953 -31800 -8422 -17178
14892 -17178 -22819 -5418 47855 30239 -182 26566 52277 45611 6001 -11794 -24458 -52716
14880 -52716 -61409 -39921 -25699 -20505 12817 31662 30067 18693 5141 10171 4637 35378 58051
14867 58051 34630 10805 -9947 2687 28703 45100 33652 28257 24029 30384 24430 -4724
$$ packed form
14956b7417J3616N860l763K6970K7527j4887K111j5055o766P835r317R377M0001
14943E6092j0283k2587K7659o938l1842j7985J0787L1172j4012j4539j5679k2823
14931c0978L393P135R649M3939J5474k8371j3760j8620K783J8771q982o845j3080
14918a9492m447P634R976J6493j2991j4254l654J0676O561Q527n74K2570k8485
14905a460j8573j96j8545J5307N5291k6508l3347m189o486o247J3153K3378q756
14892a7178n641J7401N3273j7616l0421K6748K5711o666l9610j7795j2664k8258
14880e2716q693K1488J4222N194L3322J8845j595j1374j3552N030n534L0741K2673
14867E8051k3421k3825k0752J2634K6016J6397j1448n395m228O355n954k9154
$$ plain form
14855 -4724 -19874 -18403 -40661 -10176 13424 14459 18050 24170 31236 24090 27814 3863 -23715
14842 -23715 -22725 -41773 -21457 14364 34239 13630 -14385 -27872 -23376 -30053 -40122 -28360
14830 -28360 2762 -12067 -14290 22590 13951 10107 10906 24298 7097 -30529 -40826 -29025 -11391
14817 -11391 12485 29783 16489 13803 -35953 -62928 -51930 -25137 -9436 -20073 -13804 -6092
14805 -6092 6680 37890 33805 24455 42082 21731 8945 23424 26113 10477 -9517 -11684 3214
14792 3214 -4469 -27950 -23957 -9233 22345 10959 9348 -8516 -13678 21674 16266 7276 -5992
14779 -5992 -24824 -29553 -40606 -51287 -47741 -40104 -26426 -23618 -12588 -1771 26729 -14012 -28677
14766 -28677 21316 84130 56967 27054 27530 5862 25639 22121 23621 1307 -33484 -39014 -7553
$$ packed form
14855d724j5150J471k2258L0485K3600J035L591O120P066p146L724k3951k7578
14842b3715R90j9048K0316L5821J9875k0609k8015j3487M496o677j0069J1762
14830b8360L1122j4829k223L6880q639l844P99J3392j7201l7626j0297J1801J7634
14817a1391K3876J7298j3294k686m9756k6975J0998K6793J5701j0637O269P712
14805f092J2772L1210m085r350J7627k0351j2786J4479K689j5636j9994k167J4898
14792C214p683k3481L993J4724L1578j1386j611j7864n162L5352n408q990j3268
14779e992j8832m729j1053j0681L546P637J3678K808J1030J0817K8500m0741j4665
14766b8677M9993O2814k7163k9913M76k1668J9777l518J500k2314l4791n530L1461
$$ plain form
14753 -7553 35587 28464 24577 -12000 -32834 -61161 -75625 -75209 -27085 -23228 -5871 37188 22770
14740 22770 -7074 -24804 -15872 -14073 -1506 15581 4924 -20494 -6901 10024 6341 19068
14728 19068 22344 44643 58363 38195 5303 -27573 -42253 -35363 4982 26422 24032 29115
14716 29115 47454 48689 45785 29090 16540 29886 42616 27999 2270 18391 35335 24072
14704 24072 32321 63472 43389 10734 10723 20274 16717 -12168 -8154 36491 47935 40973 44572
14691 44572 17220 17917 36072 54554 32302 1092 -34855 -42068 -49234 -22707 -12234 -17825 -82
14678 -82 18951 46304 29463 -14187 7602 16863 38972 52308 49660 41634 -7561 -16366 -23517
14665 -23517 -54658 -51469 -43644 -44675 -16369 -6794 -3389 -6186 -8620 -26158 -5047 55516 35286
$$ packed form
14753g553M3140p123l887l6577k0834k8327j4464M16M8124L857J7357M3059j4418
14740B2770k9844j7730Q932J799J2567J7087j0657k5418J3593J6925l683J2727
14728A9068L276K2299J3720k0168l2892l2876j4680O890M0345K1440k390N083
14716B9115J8339J235k904j6695j2550J3346J2730j4617k5729J6121J6944j1263
14704B4072Q249L1151k0083l2655j1R551l557k8885M014M4645J1444o962L599
14691D4572k7352O97J8155J8482k2252l1210l5947p213p166K6527J0473n591J7743
14678h2J9033K7353j6841m3650K1789R261K2109J3336k648q026m9195q805p151
14665b3517l1141L189P825j031K8306R575L405k797k434j7538K1111O0563k0230
$$ plain form
14652 35286 17581 -1211 -17157 17037 42758 52218 43038 65575 55104 5498 -18690 -5386
14640 -5386 35657 51637 18690 -19393 -5844 -7089 -10421 334 50664 27816 3840 4789 1857
14627 1857 7517 7806 8021 2141 34292 43477 4980 11657 -28907 -72982 -97853 -75998 -72087 -85804
14613 -85804 -91677 -61331 -28403 14039 27284 11888 5238 -41811 -89646 -65527 -17966 -10437
14601 -10437 -1003 5318 -14213 -16324 -9683 -16576 -9128 29696 33074 13062 -9470 4418 -19955
14588 -19955 -10461 -4734 -582 338 -13254 -44135 -43995 -36408 -23199 -7062 22504 28221 10985
14575 10985 13934 21929 -11440 -30632 7003 48029 59554 59659 38422 30862 9933 7485 -3540
14562 -3540 -10801 -5260 -16833 -17769 24743 27225 13738 8855 10076 10385 -3082 15754 -4265 -22366
$$ packed form
14652C5286j7705j8792j5946L4194K5721R460r180K2537j0471m9606k4188J3304
14640e386M1043J5980l2947l8083J3549j245l332J0755N0330k2848k3976R49k932
14627A857N660K89K15n880L2151R185l8497O677m0564m4075k4871K1855L911j3717
14613h5804n873L0346L2928M2442J3245j5396o650m7049m7835K4119M7561P529
14601a0437R434O321j9531k111O641o893P448L8824L378k0012k2532J3888k4373
14588a9955R494N727M152R20j3592l0881J40P587J3209J6137K9566N717j7236
14575A0985K949P995l3369j9192L7635M1026J1525J05k1237p560k0929k448j1025
14562c540p261N541j1573r36M2512K482j3487m883J221L09j3467J8836k0019j8101
$$ plain form
14548 -22366 -30283 -14106 -5052 -1876 -8392 3180 30285 35265 24457 18223 -10246 -35670 -30976
14535 -30976 -483 39761 30045 14281 6772 4376 1742 -13901 -18670 16647 52172 28989 -384
14522 -384 -61910 -65276 -43017 -15588 -27659 -25193 16054 35731 -11537 -61160 -15193 34727
14510 34727 31210 14057 2968 3739 -28705 -48692 434 3451 -1051 10382 27839 40668 32650
14497 32650 36867 49098 17268 -12688 20223 25857 16896 7771 6503 37343 51783 45687 38022
14484 38022 20240 847 19891 2790 -7502 8984 21492 14609 1041 -24533 -13773 -3942
14472 -3942 -25350 -37513 -28010 19089 -1869 6693 27527 29077 -16133 -30392 -4063 19681
14460 19681 12583 -3443 -20904 3336 45669 52451 42195 14662 -15988 -20216 10616 16632
$$ packed form
14548b2366p917J6177R054L176o516J1572K7105M980j0808o234k8469k5424M694
14535c0976L0493M0244r716j5764p509k396k634j5643m769L5317L5525k3183k9373
14522c84o1526l366K2259K7429j2071K466M1247J9677m7268m9623M5967M9920
14510C4727l517j7153j1089P71l2444j9987M9126L017m502J1433J7457J2829q018
14497C2650M217J2231l1830k9956L2911N634q961r125j268L0840J4440o096p665
14484C8022j7782j9393J9044j7101j0292J6486J2508o883j3568k5574J0760R831
14472c942k1408j2163R503M7099k0958Q562K0834J550m5210j4259K6329K3744
14460A9681p098j6026j7461K4240M2333O782j0256k7533l0650m228L0832O016
$$ plain form
14448 16632 -6424 168 -6287 10497 27241 21289 27598 14167 -30018 -2799 16636 -8412
14436 -8412 -29204 -29745 -20859 4892 24982 -4753 2259 -7771 2130 18318 14035 4691 -26409
14423 -26409 -46000 -35646 -11794 -4322 10163 42369 45476 35866 50232 58648 70188 63895 48722
14410 48722 59927 51900 24103 19454 37360 46064 49780 40628 11037 -35643 -46420 -15674 22560
14397 22560 25213 21092 29877 31951 19610 884 -1748 132 26183 42622 9214 -23991 -23631
14384 -23631 -31511 -27941 -360 15342 -6291 605 18962 24924 -29130 -49378 -32635 -2711
14372 -2711 -2386 7534 24423 38893 13626 -12455 -4850 -24 -4962 27902 51863 68214 43504
14359 43504 70 -28459 -14039 -23892 -1007 30617 47180 36661 24831 18814 7638 9159
$$ packed form
14448A6632k3056O592o455J6784J6744n952O309j3431m4185K7219J9435k5048
14436h412k0792n41Q886K5751K0090k9735P012j0030R901J6188m283r344l1100
14423b6409j9591J0354K3852P472J4485L2206L107r610J4366Q416J1540o293j5173
14410D8722J1205q027k7797m649J7906Q704L716r152k9591m6680j0777L0746L8234
14397B2560K653m121Q785K074j2341j8726k632J880K6051J6439l3408l3205L60
14384b3631p880L570K7581J5702k1633O896J8357N962n4054k0248J6743K9924
14372b711L25R920J6889J4470k5267k6081P605M826m938L2864K3961J6351k4710
14359D3504m3434k8529J4420r853K2885L1624J6563j0519j1830o017j1176J521
$$ plain form
14347 9159 -69 -19271 -4063 21919 42371 43277 -8990 -27570 -32142 -29248 -3088 -13142 -52970
14334 -52970 -64517 -53311 -64923 -30224 22160 79 -31932 -27800 -179 -16945 -26955 540
14322 540 15718 10279 7259 -9210 -3003 -15602 31632 40151 19195 54423 30082 26324 3135
14309 3135 20284 60859 65164 44568 10214 -4227 4710 805 15277 15241 19501 33482 39186
14296 39186 43079 36435 10311 -2540 25287 21301 15643 9559 -25101 -12676 8129 20364 23161
14283 23161 43958 55917 55634 54184 62448 61535 28007 -17913 -37661 -28534 -27544 -36716 -26131 -4000
14269 -4000 4399 -6092 7165 24443 42286 62182 63157 42400 12188 7074 -6272 548 -9591
14256 -9591 3326 27249 42003 25699 5107 11849 -2436 12585 42923 58439 46330 38263
$$ packed form
14347I159r228j9202J5208K5982K0452R06n2267j8580m572K894K6160j0054l9828
14334e2970j1547J1206j1612L4699N2384k2081l2011M132K7621j6766j0010K7495
14322E40J5178n439l020j6469O207j2599M7234Q519k0956L5228k4341l758k3189
14309C135J7149M0575M305k0596l4354j4441Q937l905J4472l6M260J3981N704
14296C9186L893o644k6124j2851K7827l986n658o084l4660J2425K0805J2235K797
14283B3161K0797J1959k83j450Q264r13l3528m5920j9748R127R90r172J0585K2131
14269d000Q399j0491J3257J7278J7843J9896R75k0757l0212n114j3346O820j0139
14256i591J2917K3923J4754j6304k0592O742j4285J5021L0338J5516j2109q067
$$ plain form
14244 38263 40326 -70 -14864 -34017 -21456 -15282 18019 42698 34229 28392 14637 13210 20478
14231 20478 35524 27185 39178 42489 70796 69528 55702 49761 46563 45793 -6549 -3757 1712
14218 1712 35974 35122 7927 6802 785 -29553 -40787 -43733 -17477 11996 -14735 -30347 3134
14205 3134 -14456 -42110 -19672 25556 47520 51597 38547 12418 7542 -18910 -36055 -11385
14193 -11385 10179 21013 13542 5020 40876 16757 16160 16991 22387 32806 5680 -31483 -38149
14180 -38149 -15857 6192 21215 13148 6106 6986 8694 2540 4058 -9520 -5698 -22825 -22013 -2455
14166 -2455 1303 4314 16820 26690 30791 6447 2728 22456 22186 10926 -10012 -14926 1488
14153 1488 8492 -4818 -14243 -5221 -19440 -13275 -12562 12606 23597 4942 15398 1479 -9297
$$ packed form
14244C8263K063m0396j4794j9153J2561O174L3301K4679q469n837j3755j427P268
14231B0478J5046q339J1993L311K8307j268j3826n941l198p70n2342K792N469
14218A712L4262q52k7195j125o017l0338j1234k946K6256K9473k6731j5612L3481
14205C134j7590k7654K2438M5228K1964M077j3050k6129m876k6452j7145K4670
14193a1385K1564J0834p471q522L5856k4119n97Q31N396J0419k7126l7163o666
14180c8149K2292K2049J5023q067p042Q80J708o154J518j3578L822j7127Q12J9558
14166b455L758L011J2506R870M101k4344l719J9728k70j1260k0938m914J6414
14153A488P004j3310r425R022j4219O165P13K5168J0991j8655J0456j3919j0776
$$ plain form
14140 -9297 -31683 -44932 -27634 3188 10682 18151 9082 3579 20610 23176 9190 -27847 -46364
14127 -46364 -41402 -32984 -25670 -16084 17578 17953 -1669 1479 -21536 -34991 797 35888 16362
14114 16362 -12743 -8252 25240 39757 21871 17992 25051 1022 -8854 -16589 -40836 -28895 11869
14101 11869 23417 33925 39596 39690 7361 -4618 -8869 4892 28001 28951 1796 -23423 -27427
14088 -27427 -11254 11344 4399 -12060 20760 23995 3449 -11246 -13768 -11157 37589 75749
14076 75749 40824 4515 -7986 -1180 -15826 -23783 -14637 -2755 -4663 6033 -17040 -58107
14064 -58107 -52921 -44316 -45816 -42610 -30080 -36476 -9832 21525 61285 38938 19450 33547 20648
14051 20648 -21103 -32315 -4243 440 5120 -13303 -24528 -38054 -5456 13019 7946 24693
$$ packed form
14140i297k2386j3249J7298L0822P494P469r069n503J7031K566j3986l7037j8517
14127d6364M962Q418P314R586L3662L75j9622L148k3015j3455L5788L5091j9526
14114A6362k9105M491L3492J4517j7886l879P059k4029r876p735k4247J1941M0764
14101A1869J1548J0508N671R4l2329j1979m251J3761K3109R50k7155k5219m004
14088b7427J6173K2598o945j6459L2820L235k0546j4695k522K611M8746L8160
14076G5749l4925l6309j2501O806j4646p957R146J1882j908J0696k3073m1067
14064e8107N186Q605j500L206J2530o396K6644L1357L9760k2347j9488J4097j2899
14051B0648m1751j1212K8072M683M680j8423j1225j3526L2598J8475n073J6747
$$ plain form
14039 24693 58201 52072 44303 40193 29779 52626 54059 46955 56570 39286 3615 2487 28679
14026 28679 36184 25417 10149 -20342 -45134 -16949 23394 26871 31609 -1512 -11215 7130
14014 7130 21237 17139 2514 -3194 -14738 -10794 -8578 1856 -3719 -3890 -858 -10569 -2499 -155
14000 -155 18600 42134 56983 48107 55305 30583 -2669 -17718 100 15944 13182 7940 -9913
13987 -9913 -18822 -60154 -81148 -37875 -21461 -22487 -17914 -19230 3602 13610 30393 20282 -7553
13974 -7553 -2357 -5726 -33540 -38785 -37723 -29103 1750 42462 19928 26442 29250 -7103 -12019
13961 -12019 16631 30163 -9468 -25996 -27467 -12410 6227 13218 18478 22944 24627 28906 40233
13948 40233 50772 36107 35522 19325 9742 5498 2219 5396 12837 8875 2418 9222 -4848 -10870
$$ packed form
14039B4693L3508o129p769m110j0414K2847J433p104R615j7284l5671j128K6192
14026B8679P505j0767j5268l0491k4792K8185M0343L477M738l3121r703J8345
14014G130J4107m098j4625n708j1544L944K216J0434n575j71L032r711Q070K344
14000a55J8755K3534J4849q876P198k4722l3252j5049J7818J5844k762n242j7853
13987i913q909m1332k0994M3273J6414j026M573j316K2832J0008J6783j0111k7835
13974g553N196l369k7814n245J062Q620L0853M0712k2534O514K808l6353m916
13961a2019K8650J3532l9631j6528j471J5057J8637O991N260M466J683M279J1327
13948D0233J0539j4665n85j6197r583m244l279L177P441l962o457O804j4070o022
$$ plain form
13934 -10870 -27088 -13825 -24964 -11902 -18138 3300 -9301 -28927 -23289 -10202 -17549 -9731
13922 -9731 -6930 -3286 -18226 10951 18870 13972 187 -21353 -1285 17923 19866 9791 -40839
13909 -40839 -76070 -84787 -47265 -21575 -11763 20073 30827 34285 57710 37411 25475 30477
13897 30477 28425 46907 47954 39396 36216 26857 46393 47262 20696 30713 13487 15581 40340
13884 40340 41886 31800 30298 21249 -14865 -33979 -37812 -15306 6423 -5623 28172 41158
13872 41158 26363 21952 17836 42255 64452 63551 49037 13490 -10906 8365 20017 15722 10557
13859 10557 5660 26301 26136 7732 16516 41582 52117 50788 49124 33576 12305 -4053 -25067
13846 -25067 -42409 -44168 -37932 -14190 4862 -7855 -13546 -24409 -23484 -11048 -8174 -7504 -3841
$$ packed form
13934a0870j6218J3263j1139J3062o236K1438j2601j9626N638J3087p347P818
13922i731K801L644j4940K9177P919m898j3785k1540K0068J9208J943j0075n0630
13909d0839l5231q717L7522K5690R812L1836J0754L458K3425k0299j1936N002
13897C0477k052J8482J047q558l180r359J9536Q69k6566J0017j7226K094K4759
13884D0340J546j0086j502r049l6114j9114l833K2506K1729j2046L3795J2986
13872D1158j4795m411m116K4419K2197r01j4514l5547k4396J9271J1652m295n165
13859A0557m897K0641j65j8404Q784K5066J0535j329j664j5548k1271j6358k1014
13846b5067j7342j759O236K3742J9052j2717n691j0863R25J2436K874O70L663
$$ plain form
13833 -3841 -14909 -21770 -2012 12322 2899 10599 -1894 15955 26221 -9360 -19585 -25478 -23754
13820 -23754 -5227 -22154 -27785 -17682 -18396 -13084 -11433 -4373 -19942 -23688 -21116 -10532 5192
13807 5192 33059 53437 34173 -21750 -13765 -4940 4835 20481 879 -11024 -15750 -949 32063
13794 32063 27914 30695 28937 20598 12960 2109 -7640 1184 5571 37292 49881 26827 11947
13781 11947 21581 46938 27471 24484 47914 33875 13827 -9853 -1574 -13545 -9525 -11257 28
13768 28 14050 30607 49391 48317 21266 17350 17546 11496 16393 63370 83854 18740 9154 3614
13754 3614 -2840 11159 13934 31766 40703 17782 27545 54346 33282 29605 29575 27995 69838 65986
13740 65986 63416 55901 49063 53013 42514 33804 38350 30301 40908 26076 18562 24387 29451 30070
$$ packed form
13833c841j1068o861J9758J4334r423P700j2493J7849J0266l5581j0225n893J724
13820b3754J8527j6927n631J0103p14N312J651P060j5569l746K572J0584J5724
13807E192K7867K0378j9264n5923P985Q825R775J5646j9602j1903m726J4801L3012
13794C2063m149K781j758q339p638j0851r749Q824M387L1721J2589k3054j4880
13781A1947R634K5357j9467k987K3430j4039k0048k3680Q279j1971M020j732J1285
13768B8J4022J6557J8784j074k7051l916J96o050M897M6977K0484o5114r586n540
13754C614o454J3999K775J7832Q937k2921R763K6801k1064l677l0j580M1843l852
13740F5986k570p515o838L950j0499q710M546q049J0607j4832p514N825N064O19
$$ plain form
13726 30070 36842 34740 6343 14649 29376 31111 12684 35597 32578 -9801 -44727 -61402 -38865
13713 -38865 -24295 -7130 8549 8663 -16102 -20200 -34212 -36743 -10017 -9616 15583 5859 19069
13700 19069 18856 980 -6387 -20529 -30889 -31512 -8262 20826 34759 26224 14333 17649 45653
13687 45653 30184 4258 3045 16862 53628 38850 19236 23442 36479 8418 -7530 -23967
13675 -23967 10645 45003 56826 48586 8966 18425 27248 -3340 -4122 7660 22886 19163 13451
13662 13451 24481 40538 51827 37827 5776 1902 -6757 -22849 -13314 -20807 -24303 12124 27384
13649 27384 37428 28695 38750 30507 24627 21989 -1424 -25433 -33544 -50192 -32716 -18731 -1672
13636 -1672 -10039 -2746 7488 690 -7023 -10817 17720 29093 22411 16651 -17974 -39805 2853
$$ packed form
13726C0070O772k102k8397Q306J4727J735j8427K2913l019m2379l4926j6675K2537
13713c8865J4570J7165J5679J14k4765m098j4012k531K6726M01K5199r724J3210
13700A9069k13j7876p367j4142j0360o23K3250K9088J3933q535j1891L316K8004
13687D5653j5469k5926j213J3817L6766j4778j9614M206J3037k8061j5948j6437
13675b3967L4612L4358J1823q240l9620R459Q823l0588p82J1782J5226l723n712
13662A3451J1030J6057J1289j4000l2051l874q659j6092R535p493l496L6427J5260
13649B7384J0044q733J0055q243n880k638k3413k4009q111j6648J7476J3985J7059
13636a672q367P293J0234o798p713l794K8537J1373o682n760l4625k1831M2658
$$ plain form
13623 2853 -574 3609 33608 41854 3072 -14663 8601 8363 -1126 10693 32800 53074 61099
13610 61099 14870 -5926 -2786 -39888 -23100 -16574 -24106 -30585 -21324 5474 31553 13194 8
13597 8 33196 77600 102119 63886 27594 40662 51036 42405 9006 -2169 -24274 -11103 -5007
13584 -5007 -9814 -28146 -30554 12923 -642 12471 35063 28530 19385 33431 30515 20492 26661
13571 26661 25881 43616 33885 14386 -4658 -17064 -13964 19325 196 2656 33960 54052 29571
13558 29571 879 -9642 -34585 -38954 2197 2229 -16720 -7723 8245 10762 -31981 -37744 -25042
13545 -25042 14180 20975 10356 7274 22987 -104 -40312 -46897 -60944 -40219 -21151 -20160 -39375
13532 -39375 -46955 -16431 -14903 -23323 -23569 -11241 3254 12969 7951 -7490 14125 35442 40806
$$ packed form
13623B853l427M183K9999Q246l8782j7735K3264k38r489J1819K2107K0274Q025
13610F1099m6229k0796L140l7102J6788O526p532o479R261K6798K6079j8359j3186
13597HL3188M4404K4519l8233l6292J3068J0374q631l3399j1175k2105J3171O096
13584e007m807j8332k408M3477j3565J3113K2592o533r145J4046k916j0023O169
13571B6661p80J7735r731j9499j9044j2406L100L3289j9129K460L1304K0092k4481
13558B9571k8692j0521k4943m369M1151L2j8949Q997J5968K517m2743n763J2702
13545b5042L9222O795j0619l082J5713k3091m0208o585j4047K0725J9068R91j9215
13532c9375p580L0524J528q420k46J2328J4495R715n018j5441K1615K1317N364
$$ plain form
13519 40806 8940 -40136 -35379 -34043 -42028 -38917 -43626 -23191 -14441 -22492 -24209 21198 45542
13506 45542 28991 33026 28203 -1730 -23959 -7002 3895 -4128 -10527 22345 26894 38800 57090
13493 57090 49191 50419 36992 3338 -635 22644 39352 35071 11180 6609 19301 5004 2606
13480 2606 -17748 -51182 -51807 16030 56512 61374 45897 36137 23469 11821 -11218 -18561 -6697
13467 -6697 -29367 -23362 -7699 -8283 1988 23573 39167 54093 66951 21490 -3463 -16161
13455 -16161 -12713 -7005 -38343 -39354 -4981 23346 38238 9521 3060 5942 -1159 -21495 -23068
13442 -23068 -4592 13531 42574 60186 36105 11388 -11582 -27401 -24251 -16723 -27268 -3038
13430 -3038 17141 19145 -2032 -36956 -40732 -21692 5365 9860 -13018 -27388 -43634 -41177 -10548
$$ packed form
13519D0806l1866m9076M757J336p985L111m709K0435Q750q051j717M5407K4344
13506D5542j6551M035m823k9933k2229J6957J0897q023o399L2872M549J1906J8290
13493E7090p899J228j3427l3654l973K3279J6708m281k3891m571J2692j4297k398
13480B606k0354l3434o25O7837M0482M862j5477r760j2668j1648k3039p343J1864
13467f697k2670O005J5663n84J0271K1585J5594J4926J2858m5461k4953j2698
13455a6161L448N708l1338j011L4373K8327J4892k8717o461K882p101k0336j573
13442b3068J8476J8123K9043J7612k4081k4717k2970j5819L150P528j0545K4230
13430c038K0179K004k1177l4924l776J9040K7057M495k2878j4370j6246K457L0629
$$ plain form
13417 -10548 8504 33466 36359 46476 39331 32046 -12030 -35021 -25368 -24104 -33742 -38332 -16747
13404 -16747 11254 -19471 -37240 -6389 -13128 2102 11056 -4631 -24177 -10497 -1878 -5218
13392 -5218 -299 -17626 -51989 -65803 -56131 -48103 -42218 -4679 647 -13370 -21948 -28440 -25257
13379 -25257 5482 22258 22218 7794 -5029 10999 -12 -13537 -8105 -10303 -26239 -25391 -5383
13366 -5383 16174 34062 20536 3124 -15321 -24735 -18837 1024 -498 -2877 32058 59022 71398
13353 71398 87609 52201 12752 9348 26896 -4202 -31483 -8091 -19385 2995 27588 26431
13341 26431 6530 43216 59804 59462 23940 18338 41322 16843 -4615 -18222 4712 15654
13329 15654 -6976 -7851 -14877 -16582 -22241 -49294 -35595 -21240 -23614 -41274 -32327 -53088 -48361
$$ packed form
13417a0548J9052K4962K893J0117p145p285m4076k2991R653J264r638m590K1585
13404a6747K8001l0725j7769L0851o739J5230Q954j5687j9546J3680Q619l340
13392e218M919j7327l4363j3814R672Q028N885L7539N326j4017q578o492L183
13379b5257L0739J6776m0j4424j2823J6028j1011j3525N432k198j5936Q48K0008
13366e383K1557J7888j3526j7412j8445r414N898J9861j522k379L4935K6964J2376
13353G1398J6211l5408l9449l404J7548l1098k7281K3392j1294K2380K4593j157
13341B6431j9901L6686J6588l42l5522n602K2984k4479k1458j3607K2934J0942
13329A5654k2630q75p026j705n659k7053J3699J4355k374j7660Q947k0761M727
$$ plain form
13316 -48361 -48654 -33909 -17552 1518 17940 42330 69602 47844 36591 31350 24470 11599
13304 11599 -52 10119 7006 2455 -12853 -17400 -2749 -9499 -3843 5093 -26064 -29733 -29981
13291 -29981 -33258 -29571 -26489 -29352 -23212 16296 40917 20523 9768 8497 10119 9366 8763 18611
13277 18611 16196 -18324 -13249 -6648 6664 6734 37066 46725 38026 24994 10167 -8881 -8277 543
13263 543 -789 15904 6165 -7591 -13022 -39424 -28472 -14836 -15258 -8819 -8058 -14137 -20732 14987
13249 14987 36356 -6255 -3531 24559 15754 -3751 17846 37882 18477 -5552 -5578 7870 6775
13236 6775 1687 3600 -16652 -29711 -45689 -25110 19621 37044 40920 22273 7930 6840 32441
13223 32441 30079 6137 -422 2708 -11912 7411 17803 16975 -7652 -44202 -34083 -31726 -35405
$$ packed form
13316d8361k93J4745J6357J9070J6422K4390K7272k1758j1253n241o880j2871
13304A1599j1651J0171l113m551j5308m547J4651o750N656Q936l1157l669k48
13291b9981l277L687L082k863O140L9508K4621k0394j0755j271J622p53o03R848
13277A8611k415l4520N075O601J3312P0L0332R659q699j3032j4827j9048O04Q820
13263E43j332J6693r739j3756n431k6402J0952J3636m22O439P61o079o595L5719
13249A4987K1369m2611K724K8090q805j9505K1597K0036j9405k4029k6J3448j095
13236F775n088J913k0252j3059j5978K0579M4731J7423L876j8647j4343j090K5601
13223C2441k362k3942o559L130j4620J9323J0392q28k4627l6550J0119K357l679
$$ plain form
13210 -35405 -15678 10431 34699 22883 -19405 16269 48849 44084 32973 6767 -6877 -30235
13198 -30235 -25398 -18818 19827 37445 57865 53481 108587 115292 121696 183780 261500 370742
13186 370742 486798 586742 700191 892779 977454 745286 445747 243993 137772 106122
13176 106122 115994 104366 97125 95701 54147 17993 10663 -10808 -135 24124 42177 31695
13164 31695 17305 5493 13714 16394 17389 13547 19926 23796 49685 54479 44716 43664 3531 -14114
13150 -14114 12111 40739 34977 20942 -9912 -39129 -12811 31197 40531 59581 49659 7161
13138 7161 -2328 -6318 -8133 3702 8413 31064 19729 -3248 -10320 20924 -506 20842 27928
13125 27928 38564 39090 -7578 7488 15821 1235 16450 8855 3418 -26962 -48086 -17059 -84
$$ packed form
13210c5405J9727K6109K4268j1816m2288L5674L2580m765j1111k6206j3644k3358
13198c0235M837O580L8645J7618K0420m384N5106O705O404O2084P7720J09242
13186C70742J16056R9944J13449J92588Q4675k32168k99539k01754j06221l1650
13176A06122R872j1628p241j424m1554l6154p330k1471J0673K4259J8053j0482
13164C1695j4390j1812Q221K680R95l842O379L870K5889M794r763j052m0133j7645
13150a4114K6225K8628n762j4035l0854k9217K6318M4008R334J9050r922m2498
13138G161r489l990j815J1835M711K2651j1335k2977p072L1244k1430K1348P086
13125B7928J0636N26m6668J5066Q333j4586J5215p595n437l0380k1124L1027J6975
$$ plain form
13112 -84 1044 -24611 -17475 6615 24006 63288 61433 47989 27914 37995 37827 28719 28173 5837
13098 5837 37101 36805 9954 -15528 -40745 -17986 -14561 -19125 -13597 -5834 3627 20083 -2824
13085 -2824 -15014 12735 19871 -5190 1895 -12650 -15049 -50908 -29568 3369 -1130 8396 28019
13072 28019 -5463 -27294 -24927 -12535 -3809 -1105 -21027 -26982 -21094 -42398 -44665 964 22610
13059 22610 33985 34082 52863 65778 37384 18146 14114 -6921 12358 12946 11148 -18528 -39892
13046 -39892 -36479 -5069 11748 25324 4473 3863 -30576 -19220 -21522 2091 29201 48325
13034 48325 70950 86598 87703 19611 -32331 -80618 -63265 -54767 -49358 -15856 -8752 -34238
13022 -34238 -57361 -52477 -33349 -11899 -9945 -19177 -41631 -90208 -88860 -50937 -52214 -54907 -25893
$$ packed form
13112h4J128k5655P136K4090J7391L9282j855j3444k0075J0081j68r108n46k2336
13098E837L1264k96k6851k5482k5217K2759L425m564N528P763R461J6456k2907
13085b824j2190K7749P136k5061P085j4545k399l5859K1340L2937m499R526J9623
13072B8019l3482k1831K367J2392Q726K704j9922n955N888k1304k267M5629K1646
13059B2610J1375R7J8781J2915k8394j9238m032k1035J9279N88j798k9676k1364
13046c9892L413L1410J6817J3576k0851o10l4439J1356k302K3613K7110J9124
13034D8325K2625J5648J105o8092n1942m8287J7353Q498N409L3502P104k5486
13022c4238k3123M884J9128K1450J954r232k2454m8577J348L7923j277k693K9014
$$ plain form
13009 -25893 345 28562 22663 1839 22095 71551 79672 56816 39588 30415 -2315 -18707
12997 -18707 -6333 -14062 -3228 2511 -18563 -64974 -70092 -18899 4229 1226 4444 -2695 9992
12984 9992 21289 -14789 -30377 -8913 -8474 10991 37557 16335 20133 34228 6518 -18486
12972 -18486 -8632 -13911 -8026 10600 -1012 -29307 -1652 -5656 8141 27523 -5503 -4298 5338
12959 5338 18367 21460 -9266 -33261 -14197 -6284 21189 4367 -12364 -39135 -51115 -57850
12947 -57850 -22409 -53041 -35954 -4158 -7874 -8969 -1370 19020 3756 -34642 -49072 -57751
12935 -57751 -23390 -25301 -15323 6365 17825 9955 -30541 -39591 -39852 -40312 -42668 -28457 -8933
12922 -8933 -1062 -8650 -2794 -17954 -4183 -13455 -29217 -43869 -48194 -83037 -84330 -54696 -15294
$$ packed form
13009b5893K6238K8217n899k0824K0256M9456Q121k2856j7228r173l2730j6392
12997a8707J2374p729J0834N739k1074m6411n118N1193K3128l003L218p139J2687
12984I992J1297l6078j5588K1464M39J9465K6566k1222L798J4095k7710k5004
12972a8486R854n279N885J8626j1612k8295K7655m004J3797J9382l3026J205R636
12959E338J3029L093l0726k3995J9064P913K7473j6822j6731k6771j1980o735
12947e7850L5441l0632J7087L1796l716j095P599K0390j5264l8398j4430q679
12935e7751L4361j911R978K1688J1460p870m0496r050k61m60k356J4211J9524
12922h933P871p588N856j5160J3771r272j5762j4652m325l4843j293K9634L9402
$$ plain form
12909 -15294 -2300 9941 14107 18508 20253 -3664 -7292 818 -6625 3215 14609 13581 -10865
12896 -10865 -21791 5778 -5002 6913 13215 599 20943 29096 43917 41026 11287 8800
12884 8800 11085 23986 36666 65535 61287 3083 -27766 8403 38587 32749 1131 -18713
12872 -18713 -1940 11027 11283 -6155 1536 -2838 640 6326 -8263 -10578 15824 32032 24122
12859 24122 20418 -10269 -48 8207 24089 -1159 -26606 -24204 8237 5590 9993 27661 27480
12846 27480 17480 7478 11448 34208 10620 -19760 -54002 -51373 -10153 20789 26451 22574
12834 22574 4132 -38088 -29539 -20863 -13947 23593 66995 82232 54538 25850 17046 25965 6460
12821 6460 17532 25169 25630 1985 -4498 -12344 587 21264 -12740 -30873 -49383 -43736 -31877
$$ packed form
12909a5294J2994J2241M166M401J745k3917l628Q110p443R840J1394j028k4446
12896a0865j0926K7569j0780J1915O302j2616K0344Q153J4821k891k9739k487
12884H800K285J2901J2680K8869m248n8204l0849L6169L0184n838l1618j9844
12872a8713J6773J2967K56j7438P691m374L478N686j4589k315K6402J6208p910
12859B4122l704l0687J0221Q255J5882k5248k5447K402L2441k647M403J7668j81
12846B7480j0000j0002L970K2760k3588l0380l4242K629M1220L0942N662l877
12834B2574j8442m2220Q549Q676O916L7540M3402J5237k7694k8688q804Q919j9505
12821F460J1072P637M61k3645o483p846J2931K0677l4004j8133j8510N647J1859
$$ plain form
12808 -31877 -16766 -14267 -9600 19444 22847 17080 -313 -105 -4702 -35608 -36651 -4673 -1217
12795 -1217 -37632 -43444 -34995 -33916 -17867 -3867 14622 20856 1867 -11041 -595 4070 6914
12782 6914 14866 -8531 11347 54331 64824 61837 48657 48132 28205 14972 1426 26346 65399
12769 65399 46449 3221 -18246 -4620 -18221 7219 28757 9959 16901 20196 19372 24590 -8994
12756 -8994 -18895 -5272 20095 48249 11622 -152 4342 25446 25613 38230 18704 18932 53491
12743 53491 51867 5848 -42128 -71714 -33547 -576 18087 27389 1542 -4095 -6702 -13203 -24371
12730 -24371 -15644 17526 10677 -32266 -44369 -47348 -16417 -10036 -35940 -35814 -34591 -22305 9155
12717 9155 29441 23795 32642 54166 33484 9018 21427 53079 76969 70979 50405 41588 41767
$$ packed form
12808c1877J5111K499M667K9044L403n767j7393K08m597l0906j043L1978L456
12795a217l6415n812Q449J079J6049J4000J8489O234j8989j2908J0446M665K844
12782F914P952k3397J9878M2984J0493k987j3180n25j9927j3233j3546K4920L9053
12769F5399j8950m3228k1467J3626j3601K5440K1538j8798O942L295q24N218l3584
12756h994r901J3623K5367K8154l6627j1774M494K1104J67J2617j9526K28L4559
12743E3491j624m6019m7976k9586L8167L2971J8663R302k5847n637k607o501j1168
12730b4371Q727L3170o849m2943j2103k979L0931O381k5904J26J223J2286L1460
12717I155K0286n646Q847K1524k0682k4466J2409L1652K3890n990k0574q817J79
$$ plain form
12704 41767 26730 13855 6977 -24709 -30440 -28477 -28985 -33490 -26210 -5653 8604 11523 38737
12691 38737 26596 -11781 7389 53139 81708 87795 89079 98618 82027 64382 48952 34200
12679 34200 30489 39268 33591 24514 -4682 -7486 -5874 19104 26175 23755 18033 8518 -17493 -4919
12665 -4919 -8030 -23485 -6729 14287 27550 27633 3175 -8274 25769 70442 62184 17941 -8270
12652 -8270 -12414 2243 15792 20151 35042 30398 19375 13588 -7596 -19880 675 10969 11324
12639 11324 32519 44981 -895 -5626 20188 15014 7562 24689 51538 47474 45127 31408 15958
12626 15958 -11603 -21478 -4037 -15494 -23378 -1775 2372 -17353 -23083 -3640 -1108 -2749 15744
12613 15744 8906 33230 16884 1745 -15071 -6836 -9968 -13766 -10270 10768 13569 13412 12111
$$ packed form
12704D1767j5037j2875o878l1686n731J963n08m505P280K0557J4257K919K7214
12691C8737j2141l8377J9170M5750K8569O087J284R539j6591j7645j5430j4752
12679C4200l711Q779n677r077k9196k804J612K4978P071k420n722r515k6011J2574
12665d919l111j5455J6756K1016J3263Q3k4458j1449L4043M4673q258m4243k6211
12652h270m144J4657J3549M359J4891m644j1023n787k1184j2284K0555J0294L55
12639A1324K1195J2462m5876m731K5814n174p452J7127K6849m064k347j3719j5450
12626A5958k7561r875J7441j1457p884K1603M147j9725n730J9443K532j641J8493
12613A5744o838K4324j6346j5139j6816Q235l132l798L496K1038K801j57j301
$$ plain form
12600 12111 15235 11944 1091 12858 24043 26987 18735 9514 1431 -2514 5932 11981 -10257
12587 -10257 -11950 -6760 -13787 -21239 -31451 -56007 -9889 30563 32618 2452 -14336 -1243 -12240
12574 -12240 6871 10928 15800 -1285 -294 3012 -38870 -41428 16636 32550 27927 37629 10371
12561 10371 -5252 -11672 -20820 -6062 20187 11270 -6276 6452 20136 45340 46610 45500 24774
12548 24774 -18847 -52972 -25879 11734 18044 31276 27453 30301 72418 95102 47813 31745
12536 31745 -14899 -45020 -24809 -32351 -20987 -20255 -20006 -21784 -15716 8232 15030 13170 10961 21114
12522 21114 31308 27643 10463 -8634 4935 9121 17639 8167 13800 4920 8152 -424 -2812
12509 -2812 -1969 21193 15427 -8344 -12098 22499 28483 -2811 -19616 -29699 -19699 -5769 2242
$$ packed form
12600A2111L124l291j0853J1767J1185K944q252r221q083l945Q446O049k2238
12587a0257j693N190p027p452j0212k4556M6118M0452K055l0166j6788J3093j0997
12574a2240J9111M057M872j7085R91L306m1882k558N8064J5914m623R702k7258
12561A0371j5623o420r148J4758K6249q917j7546J2728J3684K5204J270j110k0726
12548B4774m3621l4125K7093L7613O310J3232l823K848M2117K2684m7289j6068
12536C1745m6644l0121K0211p542J1364P32K49j778O068K3948O798j860k209J0153
12522B1114J0194l665j7180j9097J3569M186Q518r472N633q880L232q576k388
12509b812Q43K3162n766k3771l754L4597N984l1294j6805j0083J0000J3930Q011
$$ plain form
12496 2242 24341 42065 34046 26178 12884 -8890 -40195 -46749 -24873 20945 24666 6898 -804
12483 -804 4360 26283 50284 28816 10732 -21789 8837 14845 8277 5978 14945 32617 44532
12470 44532 19967 -32547 -43471 -9580 11840 29085 45149 10109 17667 10211 19854 -4015
12458 -4015 -20168 11201 23942 5502 2346 -7127 -14927 12021 17861 -10858 -3600 -20188 -155
12445 -155 -12420 -20006 -18250 -4472 9824 21037 29585 -9391 -18796 -19475 -3724 6664 9760
12432 9760 -32136 -49866 -23108 -7431 -12233 -28735 -23858 13648 13366 -904 -14632 -5383 -20556
12419 -20556 -20106 -16094 -4739 25104 47549 32339 1791 -7811 -7218 7575 1977 -18573 -44102
12406 -44102 -1370 14912 7977 16392 18323 -11862 -17765 -5120 -2100 -2897 -8824 837 -31615
$$ packed form
12496B242K2099J7724q019p868j3294k1774l1305o554K1876M5818L721j7768p702
12483h04N164K1923K4001k1468j8084l2521L0626O008o568k299Q967J7672J1915
12470D4532k4565n2514j0924L3891K1420J7245J6064l5040P558p456R643k3869
12458d015j6153L1369J2741j8440l156r473p800K6948N840k8719P258j6588K0033
12445a55j2265p586J756J3778J4296J1213Q548l8976r405o79J5751J0388L096
12432I760m1896j7730K6758J5677m802j6502M877L7506k82j4270j3728R249j5173
12419b0556M50M012J1355K9843K2445j5210l0548r602N93J4793n598k0550k5529
12406d4102M2732J6282o935Q415J931l0185n903J2645L020p97n927R661l2452
$$ plain form
12393 -31615 -21263 7804 26208 31710 26569 51849 46580 25818 -28006 -45061 -51452 -24504
12381 -24504 3312 20567 28922 9766 758 5602 -1708 -3843 15717 39100 -1269 -23978 -4832
12368 -4832 965 6664 20076 -11573 1133 27757 37181 44035 18415 6518 7978 -19356 -29866
12355 -29866 -41432 -19644 19817 41465 12570 -25492 -36828 -63209 -53738 -48974 -52576 -53757
12343 -53757 -40750 -38896 -18846 1449 -17589 -32119 -13912 15033 31909 31328 29281 1382
12331 1382 -45275 -44470 -21522 18531 30853 37163 21845 19248 901 -1840 -4641 31441 79390
12318 79390 44637 -2380 -24300 -35831 -24365 -16947 -9527 -21893 -9851 -18327 -22545 -15132 -20543
12305 -20543 -14954 -3987 -6385 6389 19563 11144 11924 10467 -2427 15557 28996 21017 -11101
$$ packed form
12393c1615J0352K9067J8404N502n141K5280n269k0762n3824j7055o391K6948
12381b4504K7816J7255Q355j9156r008M844p310k135J9560K3383m0369k2709J9146
12368d832N797N699J3412l1649J2706K6624R424O854k5620j1897J460k7334j0510
12355b9866j1566K1788L9461K1648k8895l8062j1336k6381R471M764l602j181
12343e3757J3007J854K0050K0295j9038j4530J8207K8945J6876n81k047k7899
12331A382m6657Q05K2948M0053J2322O310j5318k597j8347k741k801L6082M7949
12318G9390l4753m7017k1920j1531J1466P418P420j2366J2042q476m218P413n411
12305b0543N589J0967k398J2774J3174q419P80j457j2894J7984J3439p979l2118
$$ plain form
12292 -11101 1696 48747 64157 56662 85809 78421 47470 49671 65494 52616 10475 9756 -7835
12279 -7835 15984 33666 39310 25401 31382 46307 7812 -10120 9111 13198 32018 54364
12267 54364 56529 61846 22893 2461 1365 -4837 3899 1037 -16955 9895 20157 30338 29667
12254 29667 21520 19637 31286 44469 70306 77500 41539 25217 23248 24555 10413 -3449 -2637
12241 -2637 -11922 -422 -17354 -17044 -5758 -46115 -18110 26022 37106 12426 -3116 7053
12229 7053 19423 17928 28171 10392 4877 15039 18269 22326 29626 41176 28026 294 3461
12216 3461 13551 20517 568 -11550 -2253 -274 -35492 -56064 -8699 4176 -29131 -30937 30248
12203 30248 52126 38832 -1535 -16187 -21091 -40990 -41873 -4419 43098 14355 -22652 -28542
$$ packed form
12292a1101J2797M7051J5410p495K9147p388l0951K201J5823j2878m2141p19j7591
12279g835K3819J7682N644j3909N981J4925l8495j7932J9231M087J8820K2346
12267E4364K165N317l8953k0432j096o202Q736k862j7992K6850J0262J0181o71
12254B9667q147j883J1649J3183K5837P194l5961j6322j969J307j4142j3862Q12
12241b637r285J1500j6932L10J1286m0357K8005M4132J1084k4680j5542J0169
12229G053J2370j495J0243j7779n515J0162L230M057P300J1550j3150k7732L167
12216C461J0090O966j9949j2118R297J979l5218k0572M7365J2875l3307j806O1185
12203C0248K1878j3294m0367j4652m904j9899q83L7454M7517k8743l7007n890
$$ plain form
12191 -28542 -41742 -55800 -66921 -29834 -10459 -2020 14720 27770 32962 43407 20719 4999
12179 4999 -14559 -37309 -47816 -48429 -30798 -21485 -24912 7941 38634 40056 39324 43454 42644 50493
12165 50493 30455 33316 16197 -35008 -39291 -35963 -33920 -9393 -15476 -34637 -47849 -39051 -28286
12152 -28286 -29598 4740 47438 26674 27214 17862 7732 16729 -2181 -4231 -17886 -17625 -14532
12139 -14532 12294 41629 29070 44713 31389 2482 -1703 10427 -5 -9486 -34649 -35130
12127 -35130 -16360 15929 18873 2282 -22986 1535 7023 15817 25987 15711 714 -9207
12115 -9207 -22052 -27750 -51140 -60060 -59508 -55277 -41939 -43542 -43123 -57610 -34380 -33152 -46844 -12406
12101 -12406 -1418 -7091 49320 56835 33781 25494 9272 445 -9288 -17292 -58400 -83805 -51473
$$ packed form
12191b8542j3200j4058j1121L7087J9375Q439J6740J3050N192J0445k2688j5720
12179D999j9558k2750j0507o13J7631R313l427L2853L0693J422p32M130q10P849
12165E0493k0038K861j7119n1205m283L328K043K4527o083j9161j3212Q798J0765
12152b8286j312L4338M2698k0764N40r352j0130Q997j8910k050j3655K61L093
12139a4532K6826K9335j2559J5643j3324k8907m185J2130j0432r481k5163m81
12127c5130J8770L2289K944j6591k5268K4521N488Q794J0170j0276j4997r921
12115i207j2845n698k3390q920N52M231J3338j603M19j4487K3230J228j3692L4438
12101a2406J0988n673N6411P515k3054q287j6222q827r733q004m1108k5405L2332
$$ plain form
12088 -51473 93 -8983 -53730 -63360 -30237 -2523 16349 9533 18907 21657 6914 -9707 -19886
12075 -19886 10365 15078 11829 22138 27293 29033 29768 1802 745 12069 -9283 -6807 -17779
12062 -17779 -55982 -60760 -62168 -30960 -10967 3299 -2797 16030 11487 -6592 -6450 -23630 -11629
12049 -11629 -1920 -59 4046 19375 12961 16567 12963 33860 17077 -23367 -46955 -43313 -18732
12036 -18732 -21124 -18815 -3886 23166 9744 3807 20516 792 -5755 1748 2913 -18169 -6652
12023 -6652 10931 -12632 10578 4333 258 -8127 -39 13995 -10656 -27123 -18961 -32823 -43115
12010 -43115 -21887 11892 15767 8886 -5986 -13775 -19078 -26463 -844 10617 -3176 -32570 -13208
11997 -13208 10999 8714 -5174 6629 -10861 -7240 33383 41409 30081 12422 1073 -11950
$$ packed form
12088e1473N1566r076m4747r630L3123K7714J8872o816R374K750j4743j6621j0179
12075a9886L0251M713l249J0309N155J740P35k7966j057J1324k1352K476j0972
12062a7779l8203m778j408L1208J9993J4266o096J8827m543j8079J42j7180J2001
12049a1629R709J861M105J5329o414L606l604K0897j6783m0444k3588L642K4581
12036a8732k392K309J4929K7052j3422n937J6709j9724o547P503J165k1082J1517
12023f652J7583k3563K3210o245m075q385Q088J4034k4651j6467Q162j3862j0292
12010d3115K1228L3779L875o881j4872p789n303p385K5619J1461j3793k9394J9362
11997a3208K4207k285j3888J1803j7490L621M0623Q026j1328j7659j1349j3023
$$ plain form
11985 -11950 -14792 -37907 -1707 4743 -32029 -2131 39676 42084 34520 34396 30497 51751 53688
11972 53688 11966 -15927 -17350 -13531 -15673 -10795 -3954 -8719 -33337 -32122 14120 -8797 -20528
11959 -20528 11173 46631 40874 23151 24820 -7918 1789 12531 2576 8043 18485 31711 22701
11946 22701 14018 8454 -3299 -30495 -18487 -1061 -13356 14298 39253 26902 38887 47465
11934 47465 52041 44158 18441 23306 32211 5739 -11960 -38103 -30395 -8717 -578 -35259 -14654
11921 -14654 8585 13589 -15527 -12415 -31705 -40081 -24741 1857 21555 48699 22768 -3873
11909 -3873 19048 24963 1994 -21228 -27728 2722 13012 19292 -6401 -12487 -28343 -30165 -24606
11896 -24606 -4105 -10301 4622 31979 39920 48782 2646 -34564 -21763 -30140 -33924 -37842 -28901
$$ packed form
11985a1950k842k3115L6200O450l6772K9898M1807K408p564j24l899K1254J937
11972E3688m1722k7893j423L819k142M878O841m765k4618J215M6242k2917j1731
11959b0528L1701L5458n757j7723J669l2738R707J0742r955N467J0442J3226r010
11946B2701q683n564j1753k7196J2008J7426j2295K7654K4955j2351J1985Q578
11934D7465M576p883k5717M865Q905k6472j7699k6143P708K1678Q139l4681K0605
11921a4654K3239N004k9116L112j9290q376J5340K6598J9698K7144k5931k6641
11909c873K2921N915k2969k3222o500L0450J0290O280k5693o086j5856j822N559
11896b4606K0501o196J4923K7357P941Q862m6136l7210J2801q377l784l918Q941
$$ plain form
11883 -28901 -22055 -6857 1332 20284 41038 36367 45391 41818 34294 -7150 -36381 -58698 -32643
11870 -32643 -13662 -32486 -18781 -16007 -6698 -9539 -45917 -52028 -31825 6265 18392 5302
11858 5302 -14629 13465 31808 42316 40319 24727 21304 26329 34710 39448 16505 -21480 -14739
11845 -14739 5431 2463 -24855 -45198 -62421 -33174 -38549 -27526 9152 12988 41580 32039
11833 32039 20981 40103 18188 -12668 -26308 -20529 -28125 -2717 15619 9952 -12773 -23811
11821 -23811 -3162 1398 -13102 -38735 -31776 -13398 -20899 -20060 -24805 -50838 -61032 -42850 -33351
11808 -33351 -41160 -11100 14055 28874 36854 22859 15083 36579 33954 24151 11816 27631 87779
11795 87779 68592 38454 29248 23546 16755 9024 8608 20742 15329 27524 39724 34891 -5819
$$ packed form
11883b8901O846J5198Q189J8952K0754m671R024l573p524m1444k9231k2317K6055
11870c2643J8981j8824J3705K774R309k841l6378o111K0203L8090J2127j3090
11858E302j9931K8094J8343J0508j997j5592l423N025Q381M738k2943l7985O741
11845a4739K0170k968k7318k0343j7223K9247n375J1023L6678L836K8592r541
11833C2039j1058J9122k1915l0856j3640N779p596K5408J8336n667k2725j1038
11821b3811K0649M560j4500k5633O959J8378p501Q39m745k6033j0194J8182R499
11808c3351p809L0060K5155J4819P980j3995p776K1496k625r803j2335J5815O0148
11795H7779j9187l0138r206n702o791p731m16J2134n413J2195J2200m833m0710
$$ plain form
11782 -5819 -17946 -38845 -41539 -35009 -42970 1494 31332 28477 2146 -30872 -6084 17948 44870
11769 44870 52175 43046 19172 21646 16841 -22696 -22750 -18982 -13649 -10016 -19482 -22332 -28766 -46525
11755 -46525 -44663 -57058 -74279 -71945 -25519 6363 5563 8121 25843 11382 -24257 -36486 -44872
11742 -44872 -22362 -5179 10053 20298 614 18599 21024 30363 20339 19388 39073 47670 39068
11729 39068 15168 28829 26844 32166 133 -20398 -34374 -35175 -5560 -6014 -10648 -19008 -10157
11716 -10157 43 11128 7473 -19476 -36073 -20767 7251 4336 -10305 2345 24016 1623
11704 1623 -26126 -42752 -41329 -69492 -26627 -10972 16782 35819 63579 67125 34781 7551
11692 7551 6126 2565 3362 -11786 14786 28486 22043 15112 16780 2815 -29689 -39596 -12616
$$ packed form
11782e819j2127k0899k694O530p961M4464K9838k855k6331l3018K4788K4032K6922
11769D4870P305r129k3874K474m805l9537n4L768N333L633r466k850o434j7759
11755d6525J862j2395j7221K334M6426L1882q00K558J7722j4461l5639j2229q386
11742d4872K2510J7183J5232J0245j9684J7985K425R339j0024r51J9685Q597q602
11729C9068k3900J3661j985N322l2033k0531j3976q01K9615m54m634q360Q851
11716a0157J0200J1085l655k6949j6597J5306K8018k915j4641J2650K1671k2393
11704A623k7749j6626J423k8163M2865J5655K7754J9037K7760L546l2344k7230
11692G551j425l561P97j5148K6572J3700o443o931J668j3965l2504r907K6980
$$ plain form
11679 -12616 7199 8679 -7455 -22714 -28290 -37741 -23521 -8710 5545 -11196 -1043 17753
11667 17753 -6661 -41920 -37516 -20792 23181 49409 25187 -3926 -10551 -14994 -10593 8116
11655 8116 31195 51971 74794 60644 40121 37224 34318 9637 -4406 24984 36458 11175
11643 11175 -6543 -22076 -29751 -17303 881 7422 8920 -7813 -28536 -18101 -3966 9015
11631 9015 -5111 -16051 -14664 9023 9729 7833 51073 55057 23844 2317 -13591 -20599 -10553
11618 -10553 17446 24651 42297 57853 39583 10469 -409 -7090 -4757 15470 17647 -5625
11606 -5625 6577 16287 -5729 -10668 -17329 -8730 1044 -6418 -11239 18478 40712 60439 34154
11593 34154 -9997 -19146 -19608 -46468 -55952 -46360 -41731 3599 14553 13209 42053 39536 58622
$$ packed form
11679a2616J9815J480j6134j5259n576r451J4220J4811J4255j6741J0153J8796
11667A7753k4414l5259M404J6724M3973K6228k4222k9113o625m443M401J8709
11655H116K3079K0776K2823j4150k0523k897k906k4681j4043K9390J1474k5283
11643A1175j7718j5533p675J2448J8184O541J498j6733k0723J0435J4135J2981
11631I015j4126j0940J387K3687P06j896M3240L984l1213k1527j5908p008J0046
11618a0553K7999P205J7646J5556j8270k9114j0878o681K333K0227K177k3272
11606e625J2202R710k2016m939o661Q599R774p462m821K9717K2234J9727k6285
11593C4154m4151r149m62k6860r484R592M629M5330J0954j344K8844k517J9086
$$ plain form
11580 58622 61733 39076 21300 11211 -9961 -13321 9162 -937 -1680 11227 19707 11380 11108
11567 11108 -25106 -53744 -56069 -40717 -28105 1274 -9010 -17436 -12382 -38172 -53798 -23850
11555 -23850 -40433 -54340 -63988 -47930 -34829 -18846 -3989 134 -19766 -2971 18442 25788
11543 25788 21301 9361 9164 -1181 -12637 -24600 10742 42488 43508 57219 32998 30280 26345
11530 26345 30548 -4986 -23846 -1965 13592 21847 25569 24921 39570 20710 -5318 -3389 3735
11517 3735 -14814 -17208 -12504 -16056 -19424 -46945 -20141 -11720 -28117 -37245 -41417 -49361 -54937 -38349
11503 -38349 -12510 8956 15518 22641 34057 22764 14861 -6659 15670 17882 12879 30709 13023
11490 13023 5645 4822 -10102 -9166 -5523 -7647 10091 12513 1031 16485 4325 -13447 -17703
$$ packed form
11580E8622L111k2657j7776j0089k1172l360K2483j0099p43J2907Q480q327k72
11567A1108l6214k8638k325J5352J2612K9379j0284q426N054k5790j5626K9948
11555b3850j6583j3907r648J6058J3101J5983J4857M123j9900J6795K1413P346
11543B5788m487j1940j97j0345j1456j1963L5342L1746J020J3711k4221k718l935
11530B6345M203l5534j8860K1881J5557Q255L722o48J4649j8860k6028J929P124
11517C735j8549k394M704l552l368k7521K6804Q421j6397r128m172p944n576J6588
11503c8349K5839K1466O562P123J1416j1293p903k1520K2329K212n003J7830j7686
11490A3023p378q23j4924R36L643k124J7738K422j1482J5454j2160j7772m256
$$ plain form
11477 -17703 -59966 -52017 8954 21818 15742 26789 19808 1901 -35966 -43768 -34647 -11668 -16263
11464 -16263 -17710 -24550 -45368 -25828 22888 28710 -7503 -4333 24466 11333 -4831 16207
11452 16207 2779 -14667 2623 14611 -22004 -13738 11140 11189 -6501 6175 -14977 -38408
11440 -38408 -11772 -1438 -5441 4063 2909 5851 -16389 -18862 -15868 -2761 5870 -4801 -9046
11427 -9046 -14900 -10562 19121 40373 38702 12193 -3042 -4787 -3923 -5785 -6116 -1829 13522 2722
11413 2722 -12094 -1608 32673 28568 654 -13964 -4313 22575 44784 39028 1976 -25427
11401 -25427 12056 23815 17671 28106 52102 59914 161 -23598 -4320 -22953 -39024 -20589
11389 -20589 -3607 -10959 -25433 -50796 -41403 -51597 -61284 -57983 -48659 -49167 -38377 -44557 -13695
$$ packed form
11477a7703m2263P949O0971J2864o076J1047o981j7907l7867p802R121K2979m595
11464a6263j447o840k0818J9540M8716N822l6213L170K8799j3133j6164K1038
11452A6207j3428j7446J7290J1988l6615Q266K4878M9j7690J2676k1152k3431
11440c8408K6636J0334m003R504j154K942k2240k473K994J3107Q631j0671m245
11427i046n854M338K9683K1252j671k6509j5235j745Q64j862l31M287J5351j0800
11413B722j4816J0486L4281m105k7914j4618R651K6888K2209n756l7052k7403
11401b5427L7483J1759o144J0435K3996P812n9753k3759J9278j8633j6071J8435
11389b0589J6982p352j4474k5363R393j0194r687L301R324n08J0790o180L0862
$$ plain form
11376 -13695 -18142 -13655 21631 5560 -26316 -63662 -60730 -56986 -61949 -56184 -87203 -68649 -37930
11363 -37930 -27440 -31245 -24667 -9262 -25305 -1483 2694 -17635 -20757 -14062 -26149 -41968 -47248
11350 -47248 -42786 -415 11832 -16512 -12563 33553 40580 32513 21512 25666 14510 22122 7757
11337 7757 -19649 -3065 24887 38174 26936 6932 -10871 -18156 -35952 -6953 11917 -5738
11325 -5738 -28564 -50332 -62566 -44032 -36703 -39899 -38829 -44564 -59513 -53656 -41548 -35687 -27691
11312 -27691 -28184 -45564 -48508 7557 45598 29635 2602 12454 25137 43634 55545 61102 65194
11299 65194 63478 43298 3114 -41656 -34260 -20392 -13902 6032 -28747 -31554 -3109 10918
11287 10918 4835 -12107 -18581 -18818 -41118 -51741 -58006 -44452 -23979 -9823 15688 24214 9680
$$ packed form
11376a3695m447M487L5286j6071l1876l7346K932L744m963N765l1019J8554L0719
11363c7930J0490l805O578J5405j6043K3822M177k0329l122O695j2087j5819n280
11350d7248M462M2371J2247k8344L949M6116P027q067j1001M154j1156P612j4365
11337G757k7406J6584K7952J3287j1238k0004j7803p285j7796K8999J8870j7655
11325e738k2826k1768j2234J8534P329l196J070n735j4949N857J2108N861P996
11312b7691m93j7380k944N6065L8041j5963k7033R852J2683J8497J1911N557M092
11299F5194j716k0180m0184m4770P396J3868O490J9934l4779k807K8445J4027
11287A0918o083j6942o474k37k2300j0623o265J3554K0473J4156K5511Q526j4534
$$ plain form
11274 9680 -38971 -21765 616 1460 10137 15922 12096 -10090 -56898 -60681 -45578 -27997 143
11261 143 31231 43248 52763 26641 13155 -23922 -59189 -44458 -11532 27063 33648 33128 57163
11248 57163 72604 24381 22914 7340 17107 45221 20750 16499 32177 59137 57462 27318
11236 27318 16656 13837 -1926 9579 -10392 27435 62275 60280 38987 30156 1822 11702
11224 11702 24693 17249 -11626 -1883 -8781 -32158 -52002 -33151 4783 -8581 -15613 -20968 -43984
11211 -43984 -50689 -43631 -47865 -36286 -32806 -39153 -34839 -40019 -18526 -8608 5113 -1859 -13554
11198 -13554 4773 53277 47844 18013 26692 40523 62460 53068 39179 47560 47111 66317 52081
$$ packed form
11274I680m8651J7206K2381Q44Q677N785l826k2186m6808l783J5103J7581K8140
11261A43L1088J2017R515k6122j3486l7077l5267J4731L2926L8595O585n20K4035
11248E7163J5441m8223j467j5574R767K8114k4471m251J5678K6960j675l0144
11236B7318j0662k819j5763J1505j9971L7827L4840j995k1293q831k8334R880
11224A1702J2991p444k8875R743o898k3377j9844J8851L7934j3364p032n355k3016
11211d3984o705P058m234J1579L480o347M314n180K1493R918J3721o972j1695
11198a3554J8327M8504n433k9831Q679J3831K1937r392j3889Q381m49J9206j4236
$$ [...]
##END NTUPLES=NMR SPECTRUM
##END=
