##TITLE=Analysis number 325536
Compound Code cc 58310
Book Reference 467/118
Project Code adrs
Chemist Name benw
##JCAMPDX= 6.0         $$ Bruker NMR JCAMP-DX V2.0
##DATA TYPE= NMR SPECTRUM
##DATA CLASS= NTUPLES
##ORIGIN= Bruker BioSpin GmbH
##OWNER= nmr
$$ XWIN-NMR		Version 3.5
$$ Wed Jan  3 13:29:51 2007 GMT Standard Time (UT+0h)  MAYBRIDGE\nmr@NMR_250MHZ
##.OBSERVE FREQUENCY= 250.131544655141
##.OBSERVE NUCLEUS= ^1H
##.ACQUISITION MODE= SIMULTANEOUS (DQD)
##.ACQUISITION SCHEME= undefined
##.AVERAGES= 16
##.DIGITISER RES= 18
##SPECTROMETER/DATA SYSTEM= dpx250
##.PULSE SEQUENCE= zg30
##.SOLVENT NAME= DMSO
##.SHIFT REFERENCE= (INTERNAL, DMSO, 0, 16.522)
##AUDIT TRAIL= $$ (NUMBER, WHEN, WHO, WHERE, WHAT)
$$ ##TITLE= Audit trail, XWIN-NMR		Version 3.5
$$ ##JCAMPDX= 5.01
$$ ##ORIGIN= Bruker BioSpin GmbH
$$ ##OWNER= nmr
$$ C:\u/data/dgb/nmr/ADRS/190/pdata/1/auditp.txt
$$ ##AUDIT TRAIL=  $$ (NUMBER, WHEN, WHO, WHERE, WHAT)
(   1,<2007-01-03 13:29:31.54 +000>,<MAYBRIDGE\nmr>,<NMR_250MHZ>,
      <created by zg, POWCHK disabled, PULCHK disabled
       configuration hash MD5:
       49 4B E0 1D 92 C2 6B 37 9F E6 65 BC 52 41 86 1D
       data hash MD5: 64K
       A1 E2 62 8F E9 C5 B5 3F 8C 30 35 ED 9D C3 13 1D>)
(   2,<2007-01-03 13:29:44.35 +000>,<MAYBRIDGE\nmr>,<NMR_250MHZ>,
      <Start of raw data processing
       ef LB = 0.3 FT_mod = 6 PKNL = 1 SI = 32K 
       data hash MD5: 32K
       02 D3 45 DD 7A F4 88 1F 59 89 A2 26 86 0D 17 3C>)
(   3,<2007-01-03 13:29:46.02 +000>,<MAYBRIDGE\nmr>,<NMR_250MHZ>,
      <apk 
       data hash MD5: 32K
       04 BA 0B B9 40 CF 64 80 6E ED 06 74 E2 50 A0 41>)
(   4,<2007-01-03 13:29:46.69 +000>,<MAYBRIDGE\nmr>,<NMR_250MHZ>,
      <abs ABSG = 5 
       data hash MD5: 32K
       16 3A 4F E5 06 41 FA 92 C1 14 09 5A A1 70 9F EC>)
$$ ##END=
$$ 
$$ hash MD5
$$ 2B BE 94 0B 28 A7 13 97 07 95 1D 64 F3 B2 5B F0
##$RELAX= 
##$RELAX= 
##$RELAX= 
##$RELAX= 
##$RELAX= 
##$RELAX= 
##$RELAX= 
$$ Bruker specific parameters
$$ --------------------------
##$DU= <C:\u>
##$EXPNO= 190
##$NAME= <ADRS>
##$PROCNO= 1
##$TYPE= <nmr>
##$USER= <dgb>
##$AMP= (0..31)
100 100 100 100 100 100 100 100 100 100 100 100 100 100 100 100 100 100 
100 100 100 100 100 100 100 100 100 100 100 100 100 100 
##$AQSEQ= 0
##$AQ_mod= 3
##$AUNM= <au_zg>
##$AUTOPOS= <27 >
##$BF1= 250.13
##$BF2= 250.13
##$BF3= 250.13
##$BF4= 250.13
##$BF5= 500.13
##$BF6= 500.13
##$BF7= 500.13
##$BF8= 500.13
##$BYTORDA= 1
##$CFDGTYP= 0
##$CFRGTYP= 5
##$CHEMSTR= <none>
##$CNST= (0..31)
1 1 145 1 1 1 1 1 1 1 1 1 1 1 1 1 1 1 1 1 1 1 1 1 1 1 1 1 1 1 1 1 
##$CPDPRG= <>
##$CPDPRG1= <>
##$CPDPRG2= <>
##$CPDPRG3= <>
##$CPDPRG4= <mlev>
##$CPDPRG5= <mlev>
##$CPDPRG6= <mlev>
##$CPDPRG7= <mlev>
##$CPDPRG8= <mlev>
##$CPDPRGB= <>
##$CPDPRGT= <>
##$D= (0..31)
0 1 0 0 0 0 0 0 0 0.06 0 0 0 0 0 0 0.0002 0 0 0 0 0 0 0 0 0 0 0 0 0 0 
0 
##$DATE= 1167830970
##$DBL= (0..7)
120 120 120 120 120 120 120 120 
##$DBP= (0..7)
150 150 150 150 150 150 150 150 
##$DBP07= 0
##$DBPNAM0= <>
##$DBPNAM1= <>
$$ [...]
##$SUBNAM6= <"">
##$SUBNAM7= <"">
##$SUBNAM8= <"">
##$SUBNAM9= <"">
##$SW= 20.6930455092707
##$SWIBOX= (0..15)
0 0 3 0 0 0 0 0 0 0 0 0 0 0 0 0 
##$SW_h= 5175.983436853
##$TD= 65536
##$TD0= 1
##$TE= 293.16
##$TE2= 300
##$TE3= 300
##$TEG= 300
##$TL= (0..7)
0 120 120 120 120 120 120 120 
##$TP= (0..7)
150 150 150 150 150 150 150 150 
##$TP07= 0
##$TPNAME0= <>
##$TPNAME1= <>
##$TPNAME2= <>
##$TPNAME3= <>
##$TPNAME4= <>
##$TPNAME5= <>
##$TPNAME6= <>
##$TPNAME7= <>
##$TPOAL= (0..7)
0.5 0.5 0.5 0.5 0.5 0.5 0.5 0.5 
##$TPOFFS= (0..7)
0 0 0 0 0 0 0 0 
##$TUNHIN= 0
##$TUNHOUT= 0
##$TUNXOUT= 0
##$USERA1= <user>
##$USERA2= <user>
##$USERA3= <user>
##$USERA4= <user>
##$USERA5= <user>
##$V9= 5
##$VALIST= <valist>
##$VCLIST= <CCCCCCCCCCCCCCC>
##$VD= 0
##$VDLIST= <DDDDDDDDDDDDDDD>
##$VPLIST= <PPPPPPPPPPPPPPP>
##$VTLIST= <TTTTTTTTTTTTTTT>
##$WBST= 1024
##$WBSW= 4
##$XGAIN= (0..3)
0 0 0 0 
##$XL= 0
##$YL= 0
##$YMAX_a= 203891
##$YMIN_a= -328752
##$ZGOPTNS= <>
##$ZL1= 120
##$ZL2= 120
##$ZL3= 120
##$ZL4= 120
##$ABSF1= 16.522
##$ABSF2= -4.171173
##$ABSG= 5
##$ABSL= 3
##$ALPHA= 0
##$AQORDER= 0
##$ASSFAC= 0
##$ASSFACI= 0
##$ASSFACX= 0
##$ASSWID= 0
##$AUNMP= <proc_1d>
##$AZFE= 0.1
##$AZFW= 0.1
##$BCFW= 0
##$BC_mod= 0
##$BYTORDP= 0
##$COROFFS= 0
##$CY= 12.5
##$DATMOD= 1
##$DC= 0
##$DFILT= <>
##$DTYPP= 0
##$F1P= 14.0000005364418
##$F2P= -0.99999901652339
##$FCOR= 0.5
##$FTSIZE= 32768
##$FT_mod= 6
##$GAMMA= 0
##$GB= 0
##$INTBC= 1
##$INTSCL= 1
##$ISEN= 128
##$LB= 0.3
##$LEV0= 0
##$LPBIN= 0
##$MAXI= 10000
##$MC2= 0
##$MEAN= 0
##$ME_mod= 0
##$MI= 0
##$NCOEF= 0
##$NC_proc= -4
##$NLEV= 6
##$NOISF1= 0
##$NOISF2= 0
##$NSP= 0
##$NTH_PI= 0
##$NZP= 0
##$OFFSET= 16.522
##$PC= 1
##$PHC0= 213.3432
##$PHC1= 8.22692
##$PH_mod= 1
##$PKNL= yes
##$PPARMOD= 0
##$PSCAL= 4
##$PSIGN= 0
##$REVERSE= no
##$SF= 250.13
##$SI= 32768
##$SIGF1= 0
##$SIGF2= 0
##$SINO= 400
##$SIOLD= 32768
##$SREGLST= <1H.DMSO>
##$SSB= 0
##$STSI= 32768
##$STSR= 0
##$SW_p= 5175.98343685301
##$SYMM= 0
##$S_DEV= 0
##$TDeff= 65536
##$TDoff= 0
##$TI= <Analysis number 999999
Compound Code 99
Book Reference 9
Project Code 9>
##$TILT= no
##$TM1= 0
##$TM2= 0
##$TOPLEV= 0
##$USERP1= <user>
##$USERP2= <user>
##$USERP3= <user>
##$USERP4= <user>
##$USERP5= <user>
##$WDW= 1
##$XDIM= 32768
##$YMAX_p= 376395380
##$YMIN_p= -229228
$$ End of Bruker specific parameters
$$ ---------------------------------
##NTUPLES= NMR SPECTRUM
##VAR_NAME=  FREQUENCY,     SPECTRUM/REAL,   SPECTRUM/IMAG
##SYMBOL=    X,             R,               I
##VAR_TYPE=  INDEPENDENT,   DEPENDENT,       DEPENDENT
##VAR_FORM=  AFFN,          ASDF,            ASDF
##VAR_DIM=   32768,         32768,           32768
##UNITS=     HZ,            ARBITRARY UNITS, ARBITRARY UNITS
##FACTOR=    0.157963299565203, 1,           1
##FIRST=     4132.6476996994, 0,             0
##LAST=      -1043.33573715361, 0,           0
##MIN=       -1043.33573715361, -229228,     0
##MAX=       4132.6476996994, 376395380,     0
$$ Real data points
##PAGE= N=1
##DATA TABLE= (X++(R..R)), XYDATA
$$ [...]
17440G2014257L910119K273280j3786712k1064579j5977985r048872n058305l159920
$$ 72014257 75924376 78197656 64410944 43346365 27368380 18319508 13261203 10101283
17432A0101283k156556j474349j073062p55026n44177m49479m55353l20641k80013
$$ 10101283 7944727 6470378 5397316 4642290 4098113 3648634 3193281 2872640 2592627
17423B592627k44731j79557j73351j27316o6511k7784O0641J40412J08283o5089
$$ 2592627 2347896 2168339 1994988 1867672 1801161 1773377 1834018 1974430 2082713 2017624
17413B017624l4501K8525k7773j71087j59010j57454k7558L9685N9284J25235
$$ 2017624 1983123 2011648 1983875 1812788 1653778 1496324 1468766 1508451 1567735 1692970
17403A692970J57148J78791J66878J67725K85435M71927N51519P62687J040447
$$ 1692970 1850118 2028909 2195787 2363512 2648947 3120874 3672393 4435080 5475527
17394E475527J563744K511920M250414P114963J1478017J7077445J9195731P328892
$$ 5475527 7039271 9551191 13801605 20916568 32394585 49472030 68667761 75996653
17386G5996653n194981k785207N363764o95246j6303091j9902728j3480491p397532
$$ 75996653 70801672 68016465 73380229 72684983 56381892 36479164 22998673 15601141
17378A5601141m219414k673592j856112j257052r09208p46280n39209m48698l51055
$$ 15601141 11381727 8708135 6852023 5594971 4685763 3939483 3400274 2951576 2600521
17369B600521l29710k23630k71266j34595j31613j10522q9624o4144n5319M2667
$$ 2600521 2270811 2047181 1775915 1641320 1509707 1399185 1309561 1245417 1190098 1232765
17359A232765K1564k5720m2916n1359j40338j74932j38677o9544o7241k7458j1713
$$ 1232765 1254329 1228609 1185693 1134334 993996 819064 680387 610843 543602 516144 504431
17348E04431k6080k1854K4437k364m9353j11637n3634m863J0635k9807k416o785
$$ 504431 478351 456497 480934 478570 429217 317580 263946 259083 269718 239911 237495 230710
17336B30710n7359k5552P231l387K215Q6692O8120l9524m4033L3229j3062k196
$$ 230710 173351 147799 155030 151643 153858 240550 308670 269146 225113 258342 245280 243084
17324B43084p6955l9903N6191K3653j2377n579j5118M1808N6279r850n7035j4307
$$ 243084 166129 126226 182417 206070 193693 188114 172996 214804 271083 261233 204198 189891
17312A89891n5002p9552l966l7320l6255M6881N2778R5841j4698r061k4575K8193
$$ 189891 134889 55337 51371 14051 -22204 24677 77455 173296 158598 149537 124962 153155
17300A53155O6987m2832J6728K293j4391k7920m2440m2852K8284m1179m1715K5135
$$ 153155 220142 177310 194038 196331 181940 154020 111580 68728 97012 55833 14118 39253
17288C9253L9828M7967l5607j762o610J4461L0425j8558n7097j2159r871O031
$$ 39253 79081 127048 91441 89679 83069 97530 127955 109397 52300 40141 30270 36301
17276C6301O0225p082k703l761O886K7572J2213q0896l743N2652R7903j1847j7091
$$ 36301 96526 89444 86741 82980 89866 117438 129651 48755 45012 97664 195567 183720 166629
17263A66629l6199o3322m5261n6802L20J2762M0240k6187M9896L3081q748k7686
$$ 166629 130430 67108 21847 -34955 -34635 -21873 18367 -7820 42076 75157 66409 38723
17251C8723n7620J1263M3477k8314n86q803l5463L2170L9455N2190J4411j4796
$$ 38723 -18897 -7634 35843 7529 6943 -1860 -37323 -5153 34302 86492 100903 86107
17239H6107P297O4193k3930o6758m8363K0120l132j2518o6056k6010O0755M3399
$$ 86107 93404 157597 133667 66909 18546 38666 35534 23016 -43040 -69050 -8295 35104
17227C5104j3409J9375J1075n2253Q493R655M5444m3780m9781k838N1883J9449
$$ 35104 21695 41070 52145 -108 8385 18040 63484 19704 -30077 -32915 18968 38417
17215C8417J8780n5000k6434P408M6916N032j2917K1509o547L0364n2628l1693
$$ 38417 57197 2197 -24237 -16829 30087 35119 22202 43711 37164 67528 14900 -16793
17203a6793j99j7210k609r751p881J6227L4771K6722J7313k8624j7180J7224k4923
$$ -16793 -16992 -34202 -36811 -46562 -54443 -38216 -3445 23277 40590 11966 -5214 12010 -12913
17190a2913J3596N6883L6999n4731o5161J610o391K4323l4440l7434Q1836M8388
$$ -12913 683 57566 94565 39834 -25327 -23717 -30108 -5785 -40225 -77659 4177 52565
17178E2565K6613O9917m9177p8741l9198L9312J5741J7917l4920r507j1222q20
$$ 52565 79178 149095 99918 21177 -18021 21291 37032 54949 20029 10522 -700 -1520
17166a520m6653k0527k773K7110L7495l8276j8645M2918K4957j7600K2218J4797
$$ -1520 -48173 -68700 -71473 -44363 -6868 -45144 -63789 -20871 4086 -13514 8704 23501
17154B3501n3631k6767k3293K5751l9907L0624O0680k6517P315O4077P0550P513
$$ 23501 -30130 -56897 -80190 -54439 -94346 -63722 -3042 -29559 -22244 41833 112383 119896
17142A19896j8554l5258l5091k5608L0452O1851j4428j15039l3457N5961k325
$$ 119896 101342 66084 30993 5385 35837 97688 83260 -31779 -65236 -9275 -11600
17131a1600L7917m2579j01011J2642M9669p791l4183L7929M5361N962j1286n755
$$ -11600 26317 -16262 -117273 -104631 -54962 -62753 -96936 -59007 -13646 -7684 -18970 -24725
17119b4725l1908R591N1979L3451J1257j7561n061k737j5952J8328j2266l3073
$$ -24725 -56633 -47042 4937 38388 49645 32084 27023 24286 8334 26662 14396 -18677
17107a8677q5252o588P2389N0837M1479j0027n0038n195M351O5655M3143J3394
$$ -18677 -103929 -110517 -38128 12709 54188 44161 -5877 -11072 -6721 58934 102077 115471
17095A15471p5506k9598J1757m1924L0803K5998n9600k9353k9478j7519L811j6010
$$ 115471 39965 10367 22124 -19800 11003 37001 -22599 -51952 -81430 -98949 -95138 -111148
17083a11148K6860J2647J3380L6012k2813k7880K658L7704o154R838k1581J9338
$$ -111148 -84288 -71641 -58261 -22249 -45062 -72942 -70284 -32580 -38734 -28896 -50477 -31139
17071c1139k0154R810J8749Q965L207l1614k8260l024n3882l0711M6210J03547
$$ -31139 -51293 -41483 -22734 -13769 -10562 -42176 -70436 -73460 -127342 -158053 -111843 -8296
17059h296K10N555r3730J1379Q6145m19k2160l0186k3666k8019j4854P876K7566
$$ -8296 -8086 -2531 -96261 -84882 1263 844 -21316 -51502 -75168 -103187 -118041 -110165 -82599
17046h2599P897l2171k3477P0938M3346k9176L0223J4840J6759J3410k3422q064
$$ -82599 -74702 -106873 -130350 -59412 -16066 -45242 -15019 -179 16580 29990 6568 -1496
17034a496M7382n0544j1298q919K1827k4069l978k2311N559P9604k3059n1939
$$ -1496 45886 -4658 -15956 -24875 -3048 -27117 -31095 -53406 -47847 31757 8698 -43241
17022d3241j2086M0421L9409K319p703Q013k2815k6337j2217J5491k693J33o5825
$$ -43241 -55327 -14906 24503 26822 19119 27132 4317 -22020 -34237 -18746 -21439 -21306 -87131
17009h7131o114L8633k3091p764O4661k9157p0838K9290N3925o7253M1814Q1285
$$ -87131 -93245 -54612 -77703 -85467 -20806 -49963 -120801 -91511 -37586 -104839 -63025 18260
16997A8260m6368m820J2299n2815m6569M1426Q6499O625n974k5419m3832j5695
$$ 18260 -28108 -32928 -20629 -73444 -120013 -78587 7912 14537 8563 -16856 -60688 -76383
16985g6383o2829K214K0290L5662O7345K0450j6768J2505N0357l0399m6431k6842
$$ -76383 -139212 -136998 -116708 -81046 -13701 6749 -10019 2486 52843 22444 -23987 -50829
16973e0829k6847J5098K4913J1613K0716L8860J4868m2905j5988k6542m6518k1155
$$ -50829 -77676 -62578 -37665 -26052 -5336 33524 48392 5487 -10501 -37043 -83561 -104716
16961a04716M1544P6159K4820k3491q765l1154M3909M0672n2258j5042l5226k4188
$$ -104716 -63172 12987 37807 14316 5551 -25603 18306 58978 6720 -8322 -43548 -67736
16949f7736M851J1180K5845K0383J7219m1783K6776R649k4399J4303J1216P183
$$ -67736 -62885 -51705 -25860 -5477 11742 -30041 -3265 6384 -18015 -3712 7504 14687
16937A4687J7034l2777M9577k5958l1964M0945k9673j5180M5999j8085p1441p301
$$ 14687 31721 -1056 48521 22563 -9401 31544 1871 -13309 32690 14605 -56836 -64137
16925f4137N0210r853j7552j5091K8898O3142Q5129J2129o9355P205J9998L8003
$$ -64137 -13927 -23780 -41332 -56423 -27525 35617 120746 132875 63520 70725 90723 128726
16913A28726J8487k6611J7645j1523M7986R6148O8612R42l2804o3832K8977N4343
$$ 128726 147213 120602 138247 126724 174710 270858 339470 340412 307608 243776 272753 327096
16901C27096n7480j41460j06692m3231J0563J7587M9431j8078L503k2935J0371
$$ 327096 269616 128156 21464 -21767 -11204 6383 55814 37736 41239 18304 28675
16890B8675k4005k3397m6056m4488j6645K0334J50841k2769j2099j5008k1219
$$ 28675 4670 -18727 -64783 -109271 -125916 -105582 45259 22490 10391 -4617 -25836
16879b5836j264K6127K9455K2322j3411r6018J9864j2814M5161J4114o2852l1545
$$ -25836 -27100 -973 28482 50804 37393 -58625 -38761 -51575 -6414 7700 -55152 -86697
16867h6697R9253M5976p217p8292l0413o430R507M5433M5435P0742j2749m7180
$$ -86697 12556 58532 51315 -26977 -57390 -63820 -54313 -8880 36555 107297 94548 47368
16855D7368M3828m0951L8376J06703N2514L9041O8625M2013O8763l4421j07700
$$ 47368 91196 50245 88621 195324 247838 286879 355504 397517 466280 431859 324159
16844C24159j11037r6912m1376J2839K3592l1100o5739j6763k3815Q889J7795
$$ 324159 213122 116210 74834 87673 111265 80165 14426 -2337 -26152 -17263 532
16833E32m7318k6382j5590K7293k3674p833K2399J1117R211p601L5393K4526K635
$$ 532 -46786 -73168 -88758 -61465 -85139 -92972 -70573 -59456 -50245 -57846 -22453 2073 4708
16820D708l3255K1981N4539k1920n352k760j3136M4447p090j4750j943n6033k8545
$$ 4708 -28547 -6566 47973 26053 20701 17941 4805 49252 42162 27412 25469 -30564 -59109
16807e9109l3819p1297o160K899O1358M2508l397N6175L9817o49n6854N037N963
$$ -59109 -92928 -164225 -170385 -167486 -106128 -63620 -67017 -10842 28975 28326 -28528 -23491 -17528
16794a7528m6986P64J4557k507J3958r89l4774o8474k786p445j449M7777N7368
$$ -17528 -64514 -63750 -49193 -51700 -37742 -38731 -73505 -141979 -144765 -152210 -153659 -105882 -48514
16781d8514J8647n3211m749K2957j6423M2715K1874K0619J5910k1201O986m0227
$$ -48514 -29867 -83078 -87827 -64870 -81293 -38578 -16704 3915 19825 -1376 5610 -34617
16769c4617M8666J0347j0847K507m9478l8524J5011M1792J1095M2059M499k1268
$$ -34617 14049 24396 13549 16056 -33422 -71946 -56935 -15143 -4048 38011 42510 21242
16757B1242j4358n5441k6604m9799k2505L6500K0452M0200L9328n4023K1829r48
$$ 21242 6884 -48557 -75161 -124960 -147465 -110965 -90513 -50313 -10985 -65008 -43179 -44127
16745d4127P442K9423N666o1904l8520N0759J2777n6800M0468L7658O9670L7882
$$ -44127 -36685 -7262 -1596 -63500 -102020 -51261 -38484 -95284 -54816 -17158 52512 90394
16733I0394q892m5086n3142n4161m8547N394N4615L5573j2434K8662k6594r219
$$ 90394 81502 36416 -16726 -70887 -119434 -114040 -59425 -23852 -36286 -7624 -34218 -43437
16721d3437L6190m3603r5312R306O1173n856j5410n937L4241K6972Q254o9726
$$ -43437 -7247 -50850 -146162 -136856 -75683 -81539 -96949 -102886 -68645 -41673 -33419 -103145
16709a03145k4407l846N0378J0922n191m2224l3786Q6100M8962j0821m3380j0852
$$ -103145 -127552 -131398 -81020 -70098 -75289 -117513 -151299 -65199 -16237 -27058 -70438 -81290
16697h1290n817J3594J9260K2773K5173j8764L49L4034k1849L8955L9216l735
$$ -81290 -87107 -73513 -54253 -31480 -6307 -25071 -24722 9312 -12537 26418 65634 61899
16685F1899l3479l1536k770l3644J2323k8227j8775q206N5663J339k7038J609
$$ 61899 28420 -3116 -5886 -39530 -27207 -55434 -74209 -82415 -26752 -25413 -52451 -50842
16673e0842R9508L9986k077m0325p8304J7566N229k7700m0174P5804K292m7574
$$ -50842 48666 88652 86575 46250 -32054 -14488 -9259 -36959 -77133 -1329 963 -46611
16661d6611N8353k2371k861m1909J9239M8199m120m5244k1751L8293J9443J6552
$$ -46611 11742 -10629 -13490 -55399 -36160 12039 7919 -37325 -59076 -20783 -1340 15212
16649A5212j8789n7478J0589K8810M6349J2067n0395K3758K925K0778k3083M434
$$ 15212 -3577 -61055 -50466 -21656 24693 36760 -13635 10123 13048 33826 10743 15177
16637A5177j5607p4236j11641K367L1616M3497M2534R872p079L3608M9104K6592
$$ 15177 -430 -74666 -186307 -183940 -152324 -108827 -66293 -56421 -63500 -29892 19212 45804
16625D5804P832k3689o7218N852P835p750R743M2362j1134m6135Q060O224n1971
$$ 45804 53636 29947 -37271 -31419 -23584 -31334 -21591 20771 9637 -36498 -28438 -22214 -74185
16612g4185K685Q884K6465k7622l138o92n556K8732M977k4281n470l4487n416
$$ -74185 -71500 -62616 -36151 -63773 -66911 -67603 -73159 -44427 -39450 -63731 -69201 -103688 -109104
16599a09104J4299n7858j0758j3053Q90J5089L3968L3139j0641K392K6906O5070
$$ -109104 -94805 -152663 -163421 -176474 -175584 -160495 -126527 -93388 -104029 -101637 -74731 -9661
16587i661j5926l0377Q2209j1693o2804k3929l528L8249P686K8751m3005o4909
$$ -9661 -25587 -55964 26245 14552 -48252 -72181 -75709 -37460 -29774 -1023 -44028 -108937
16575a08937k766O1722K5697J4306j3565o3373L673J7497K4853k6057J963J8781
$$ -108937 -111703 -49981 -24284 -9978 -23543 -86916 -83243 -65746 -40893 -66950 -64987 -46206
16563d6206O02J0011l8766N013Q4187N3376j4426K7897k8023r9481p6121p819
$$ -46206 -45604 -35593 -74359 -69346 14841 68217 53791 81688 53665 -45816 -121937 -129756
16551a29756Q5081N2455r033O8458K882l8155K8593L7097o3260o3959k1261j5929
$$ -129756 -44675 7780 -1253 67205 70087 31932 60525 97622 34362 -29597 -50858 -66787
16539f6787j7434j9037j559n799K6408n0330O577J01877O1773n6228p2321j7736
$$ -66787 -84221 -103258 -104817 -110616 -84208 -134538 -127961 -26084 35689 -20539 -92860 -110596
16527a10596K5381L116K1624k2020j6239j2534L3021K618k4059r571k3897l905
$$ -110596 -85215 -82099 -60475 -82495 -98734 -111268 -78247 -75629 -99688 -109259 -133156 -137061
16515a37061N3238N9413r486j3732K7160m8709q0688J8945J4884J1740K6003J9128
$$ -137061 -83823 -24410 -33896 -47628 -20468 -69177 -149865 -130920 -116036 -104296 -78293 -59165
16503e9165K0798l1205p5375J8218M9238q619P880n4569O074M4654N3499P0489
$$ -59165 -38367 -69572 -144947 -126729 -77491 -86110 -78230 -132799 -126725 -82071 -28572 41917
16491D1917L402K251l9814n697k4912L7781l323p7606J5399L8421l2660m0549
$$ 41917 45319 47570 7756 2059 -22853 14928 11605 -66001 -50602 -12181 -44841 -85390
16479h5390n652k9477k9313M3606R1111L5064j1388j2198J467k518q247N0284
$$ -85390 -91042 -120519 -149832 -106226 -15115 19949 8561 -3637 -2170 -4688 -12935 37349
16467C7349n9665l4814M5067O8151n162q4526k7497l9268N092J6823R344K627
$$ 37349 -22316 -57130 -12063 56088 50926 -33600 -61097 -100365 -95273 -78450 -69106 -66479
16455f6479M2260P5278J8685q6372j9718l240J363j1416l849O3174J8395P11l1444
$$ -66479 -24219 51059 69744 -16628 -36346 -39586 -38223 -49639 -53488 9686 28081 28792 -2652
16442b652k9339l9137L6830n437o3679n3454n835L2044N2124O3916K5142K9800
$$ -2652 -31991 -71128 -34298 -39735 -103414 -156868 -162703 -130659 -78535 -14619 10523 40323
16430D0323k8794j8877j5458L0781k3488M874L0764K340n0149l3017o202K5717
$$ 40323 11529 -7348 -22806 7975 -15513 -10639 20125 22465 -27684 -60701 -66903 -41186
16418d1186m2843l8509J8632M9111j677l1229k737J2802J6050k004L4778M1733
$$ -41186 -84029 -122538 -103906 -54795 -56472 -87701 -90438 -77636 -61586 -63590 -28812 12921
16406A2921l5187m5044M946O5161N9867r619j0967n4312J6714R6381j7618j17387
$$ 12921 -22266 -67310 -62364 2797 62664 53045 42078 -12234 4480 100861 83243 -34144
16394c4144k8967P5054M0539R392l5046j7286q187K6965K800m6309j4316k9312
$$ -34144 -63111 11943 52482 61874 26828 9542 1355 28320 31120 -15189 -29505 -58817
16382e8817j8216r2054j1403R4342Q412M4612K6372K8079J2925K2951m2173j8215
$$ -58817 -77033 -169087 -180490 -86148 -77736 -33124 -6752 21327 34252 57203 15030 -3185
16370c185n386L5306Q755o1143k5366K2097J3662j0757K6150j82j3647M9341J5412
$$ -3185 -8571 26735 35490 -25653 -51019 -28922 -15260 -26017 133 -49 -13696 35645 51057
16357E1057m9552k0017k9757J0674J9098P681J9110l4328o189P661J718M8815
$$ 51057 1505 -18512 -48269 -37595 -18497 -10816 8294 -26034 -32223 -24562 -22844 25971
16345B5971J0165k8654k695L2914K765Q361J4483m2013k5031L5431k750j1483
$$ 25971 36136 7482 4787 37701 40466 48827 63310 21297 -3734 31697 28947 17464
16333A7464l0406K8616N6664k4258j2180J7198m1011J0430j7759n0M3490k9813
$$ 17464 -12942 15674 72338 48080 35900 53098 12087 22517 4758 4708 48198 18385
16321A8385n5119l5650L343l4809M9366N0077l153k8483l5166j2870M920K1124
$$ 18385 -36734 -72384 -69041 -103850 -54484 -4407 -7560 -36043 -71209 -84079 -79159 -58035
16309e8035q149o303K0622j564J5140j7172K4746J2892R481l6997j6986L5964
$$ -58035 -66184 -72487 -51865 -53429 -38289 -55461 -30715 -17823 -8342 -45339 -62325 -26361
16297b6361r982K0112j3738k2211k7757m743O1808P5047j1546L518l478K2498
$$ -26361 -36343 -16231 -29969 -52180 -79937 -84680 -22872 52175 40629 44147 40669 63167
16285F3167k9191o5474j4055L4511K4514l2818j3591K904L1325n698n0822m7371
$$ 63167 33976 -31498 -45553 -11042 13472 -19346 -32937 -30033 1292 -4406 -55228 -102599
16273a02599J0341J00230L1260l0209l569m30j5374p7647J3901N0553p8114q868
$$ -102599 -92258 7972 39232 9023 5454 5024 -10350 -87997 -74096 -23543 -101657 -110525
16261a10525J5646R722J14104J7409j8994l4938o9303O7576M0589l6321l355l8755
$$ -110525 -94879 -85157 28947 46356 27362 -7576 -76879 -9303 31286 -5035 -8390 -47145
16249d7145k4290j4161L0576J4082O42N8527K271K6649l9566m0922n843K9752
$$ -47145 -71435 -85596 -55020 -40938 -40296 18231 20502 47151 7585 -33337 -39180 -9428
16237i428J4852M0069p725r462K5087j9226o6866n2110O8160N4340L9n9157O706
$$ -9428 5424 45493 37768 28306 53393 34167 -32699 -84809 -16649 37691 37730 -21427 -14721
16224a4721m0631k6389k4423j375j3563l2918K0749L7628L3524L06p609J4455
$$ -14721 -55352 -81741 -106164 -107539 -121102 -154020 -133271 -95643 -62119 -61813 -69422 -54967
16212e4967r743m7359l5995M9020L5116L8504J4088K300m478p883l8885K6511
$$ -54967 -64710 -112069 -148064 -99044 -63928 -25424 -11336 -9036 -13514 -21397 -60282 -33771
16200c3771n325K4873O7971J3678J0365j6357q081k8338l8071K3308j5996j9876
$$ -33771 -39096 -14223 53748 67426 77791 61434 53353 25015 -13056 10252 -5744 -25620
16188b5620R865K989o4143k2355L938N2963O4171m739J5483l0309k9564j7463
$$ -25620 -15755 -12766 -76909 -99264 -95326 -42363 21808 17069 32552 2243 -27321 -44784
16176d4784M629K8179O587n6616l1051J20232j9214l0157J7518m5234j8615k5423
$$ -44784 -40155 -11976 -5389 -62005 -93056 27176 7962 -22195 -4677 -49911 -68526 -93949
16164i3949J112K4342J6365l966j499j5779L2479M077m3941l9323l4368o382Q0287
$$ -93949 -92837 -68495 -52130 -56096 -57595 -73374 -40895 -36818 -80759 -120082 -154450 -160832 -80545
16151h0545R611j6187Q26j0290M0148N2280n243N4712O6959j9871j7767l2270
$$ -80545 -70934 -87121 -86295 -96585 -56437 -4157 -9400 45312 112271 92400 74633 42363
16139D2363R566Q115k3352j6716r4589j3726M4839N4689q3812q910O9221K7589
$$ 42363 51929 60044 36692 19976 -74613 -88339 -43500 11189 -72623 -81533 -12312 15277
16127A5277m7723N622J5144q317N6514P0634m45q9348j1682k757n1839J3674J3845
$$ 15277 -32446 -26824 -11680 -19997 36517 107151 106706 17358 5676 2919 -48920 -35246 -21401
16114b1401l1825J6056J8352q770J7027l8024j1386O367m371q588n0990L626P716
$$ -21401 -53226 -37170 -18818 -27588 -10561 -48585 -59971 -53604 -57975 -66563 -117553 -113927 -106211
16101a06211K5363L3734L4656M0453N348J5425k4773m7348k2807L3930k927m0665
$$ -106211 -80848 -47114 -12458 27995 33343 48768 23995 -23353 -46160 -12230 -15157 -55822
16089e5822k569n6548l5858N7893n136j9653M4010O949m6025j1158K3835M4750
$$ -55822 -58391 -114939 -150797 -92904 -98040 -117693 -73683 -66734 -112759 -123917 -100082 -55332
16077e5332P4591p786p6191K5553M7584O8O456p767l639l4961L4569J2275l6003
$$ -55332 19259 11473 -64718 -39165 8419 8487 14943 7176 3537 -31424 3145 15420 -20583
16064b0583k2546j1754o593l6005N5856L6267j5345K770J1024L1040Q802p9862
$$ -20583 -43129 -54883 -61476 -97481 -41625 -5358 -20703 -17933 -6909 24131 32933 -46929
16052d6929j4143J0333J4274K728k5808l4369K4773j4404l6689J9377O1413Q609
$$ -46929 -61072 -50739 -36465 -33737 -59545 -93914 -69141 -83545 -120234 -100857 -39444 -30835
16040c0835k1926m7922j835k0977J4664p235O9955N7364j1127m6158n2552k930
$$ -30835 -52761 -100683 -102518 -123495 -108831 -116066 -46111 11253 126 -46032 -98584 -101514
16028a01514P090J9155J5913j7582J4626K5664p526N540l6311o1941P987n919
$$ -101514 -94424 -75269 -59356 -76938 -62312 -36648 -44174 -38634 -74945 -136886 -128899 -134818
16016a34818j8775M7116L9492L4884j3304L232l5432m2563j5583L2008K5400J9725
$$ -134818 -153593 -106477 -66985 -32101 -45405 -42173 -77605 -120168 -135751 -103743 -78343 -58618
16004e8618j1450J1963m450M0603L0536J6986o6878p6358L2382N2024k9849j1464
$$ -58618 -70068 -58105 -62555 -21952 8584 25570 -41308 -117666 -85284 -33260 -63109 -74573
15992g4573N159P8316J03719L0861m7747m5582M1308m9164n0361k4830j0444q5510
$$ -74573 -69414 8902 112621 143482 95735 50153 91461 42297 -8064 -32894 -43338 -128848
15980a28848j9724O8303M8362J14320R964n3577n4163N256K4820n7485l0564L348
$$ -128848 -148572 -80269 -31907 82413 92377 38800 -15363 -10107 14713 -42772 -73336 -69988
15968f9988K9957K9919n719J8412L9472m8265l4370N7605L0945n1076L2611Q4017
$$ -69988 -40031 -10112 -15831 2581 42053 -6212 -40582 17023 47968 -3108 29503 113520
15956A13520K5914m7135r3897k8981l8855N85l452L2955l6774l485L4518N162
$$ 113520 139434 92299 -1598 -30579 -69434 -68849 -72301 -39346 -76120 -79605 -45087 -39925
15944c9925J7776m5376J8869N5231j105l5515j1752k6866L211J644L4759P9747
$$ -39925 -22149 -67525 -48656 6575 5470 -30045 -41797 -68663 -65452 -63808 -29049 50698
15932E0698m9508q1091m1202N745l3192K0543K8654J1049L2753l47K2127k317
$$ 50698 1190 -79901 -121103 -115358 -148550 -128007 -99353 -88304 -55551 -55898 -33771 -36088
15920c6088K6073N0268l241m9242J1581K1577j7323r1429p2025j7930K1399P3309
$$ -36088 -10015 40253 37012 -12230 -649 20928 3605 -87824 -159849 -177779 -156380 -83071
15908h3071L3913l955j1333L7259L6664p473K3086j6591n0454o557P355l5392
$$ -83071 -49158 -53113 -64446 -27187 9477 2004 25090 8499 -41955 -48512 -41157 -76549
15896g6549m5488O2602Q2405O3925P848l7240m3549r576j4657o8475l9112L0703
$$ -76549 -122037 -59435 22970 86895 94743 57503 13954 4378 -10279 -78754 -117866 -87163
15884h7163J1841M1846P5166Q973p3472l8095n8872l384L77J975j1506K6249L2744
$$ -87163 -75322 -33476 41690 50663 -22809 -60904 -119776 -123160 -122783 -120808 -132314 -106065 -73321
15871g3321Q007j637J4727l7211P941j6614O2378J9946l9776n832j8069j9064
$$ -73321 -65314 -66951 -52224 -89435 -81494 -98108 -35730 -15784 -55560 -61392 -79461 -98525
15859i8525L3358l3382L8735j1056k8684K2000N6835L339J7097l1062l6075K8561
$$ -98525 -65167 -98549 -59814 -70870 -99554 -77554 -20719 -17380 -283 -31345 -67420 -38859
15847c8859j5257n1204j950K1166J3562K2591l9051Q3229N5219Q17R2q3994n5515
$$ -38859 -54116 -105320 -107270 -86104 -72542 -49951 -89002 -5773 49446 50263 50355 -33639 -89154
15834h9154O913M9585M7667l3774j6222o3461N4882p855k1004M5101J3020k0306
$$ -89154 -82241 -32656 15011 -18763 -34985 -98446 -43564 -51419 -72423 -27322 -14302 -34608
15822c4608j5090K2958l7293k804O062J8679Q260M0795j4235j02448r708M8347
$$ -34608 -49698 -26740 -64033 -66837 -60775 -42096 -33836 6959 -7276 -109724 -119432 -71085
15810g1085N3733l8067k6371j7218J2005N7020N0070L2887m2845r768k2288P849
$$ -71085 -17352 -55419 -81790 -99008 -87003 -29983 20087 52974 10129 361 -21927 -14078
15798a4078M7921j0800j7346M2423K2196o9974j7370J5907K126o285l2206N106
$$ -14078 33843 23043 5697 48120 70316 342 -17028 -1121 1005 -5280 -37486 -32380
15786c2380M3484J239j7021L527r087J3412j6373P63k9702p0537M6620N9983M0713
$$ -32380 11104 12343 -4678 -1151 -10238 3174 -13199 -12436 -42138 -112675 -66055 -6072 34641
15773C4641j9726j9672o210kN9804J13n4421J3822J6171m5389n8077J3355L1293
$$ 34641 14915 -4757 -10967 -10969 48835 48948 -5473 8349 24520 -20869 -78946 -65591 -34298
15760c4298L7541L8631l442J8477L3462j0448p0812j02894l2051p699l5538L3448
$$ -34298 3243 41874 38432 56909 90371 79923 9111 -93783 -125834 -133533 -169071 -135623
15748a35623L8056J5071j1923j148J1914K6468M7896J924j3102j0194L7816l8519
$$ -135623 -97567 -82496 -94419 -95567 -83653 -57185 -9289 -7365 -20467 -30661 7155 -31364
15736c1364Q4034L5472l8187q1802j8517O4610N3053k3583m8315n174j0650N3586
$$ -31364 52670 88142 49955 -31847 -50364 14246 67299 43716 -4599 -9773 -20423 33163
15724C3163j2820j5198R022K9797K5449L9451k7561j7252p8944M2361N3521q217
$$ 33163 20343 5145 14167 43964 69413 108864 81303 64051 -14893 27468 80989 72772
15712G2772j630J4799j9270k2379O506J943k5450k8932J6759j7130n719L7743
$$ 72772 71142 85941 66671 44292 50798 52741 27291 -1641 15118 -2012 -7731 30012
15700C0012P526q339n1712j3543P582K1180M3354M578j3847p0668m8337l106M1639
$$ 30012 37538 29199 -22513 -36056 -28474 -7294 36060 40638 26791 -43877 -92214 -95320 -53681
15687e3681J00470Q917k2232K238r8996l9870K6810M0162J8225O7168K6552l2995
$$ -53681 46789 55706 33474 35712 -63284 -103154 -76344 -36182 -17957 49211 75763 42768
15675D2768n5174k8626J0994j2428o7894j7465N4425K2230O9699J8620j7267m3800
$$ 42768 -12406 -41032 -30038 -42466 -110360 -127825 -73400 -51170 18529 37149 19882 -23918
15663b3918l1976J8750O9152l871l9085O332j7631K6345m102M6087m047k8827
$$ -23918 -55894 -37144 32008 28137 -10948 -4616 -22247 4098 -4 46083 42036 13209
15651A3209P076j3332n5024l4985M4049l5825L110J9014l0629k5242q951O7920
$$ 13209 20285 6953 -48071 -83056 -39007 -74832 -71722 -52708 -83337 -108579 -117530 -49610
15639d9610L8554J2946o969r298k0856k2128o859J4434L2876K421J86M7183K8615
$$ -49610 -11056 1890 -5079 -14377 -35233 -57361 -64220 -49786 -16910 -14489 -14303 32880 61495
15626F1495L381o8830o0431J7821L5584k2377l1037j2980o35K5669j7256j7249
$$ 61495 64876 -3954 -64385 -46564 -10980 -33357 -64394 -77374 -78009 -52340 -69596 -86845
15614h6845q961L9956M4101O254r145O584R098N797M1585J1968K5473l0857j4462
$$ -86845 -95806 -55850 -11749 -5495 -14640 -8056 1042 6839 48424 60392 85865 55008 40546
15601D0546J8296J0891m6516l4995N404K4745m1368j07607j1914P3196O1033k7938
$$ 40546 58842 69733 23217 -11778 -6374 18371 -22997 -130604 -142518 -69322 -8289 -36227
15589c6227n5235R9977Q8843K5834k4864L7927j030l5973l7841n7917l2608K7634
$$ -36227 -91462 8515 97358 123192 98328 136255 135225 99252 61411 3494 -29114 -1480
15577a480L640J7349J7382j2216j5310R064J2224J8810n854j874P503K3930r746
$$ -1480 2160 19509 36891 24675 9365 18429 30653 49463 43609 41735 49238 73168 63422
15564F3422o2066m4670l571L7942n600J9439n191M0921n431k9593k6050m1232
$$ 63422 1356 -43314 -46885 -8943 -14543 4896 -295 40626 35195 5602 -20448 -61680
15552f1680k4698N9290J2771k6607m3069P349J5510L2416K1805L5569J346o8979
$$ -61680 -86378 -27088 -14317 -40924 -83993 -76644 -61134 -28718 -6913 28656 30002 -38977
15540c8977q5925m9333O719L2272M9061P2992K8754J8158j3739k7701K3742N291
$$ -38977 -124902 -174235 -167516 -135244 -86183 -13191 15563 33721 19982 -7719 16023 21314
15528B1314j7192Q604m3970l4510p9294O482J00745L7410l8156r992J4850M559
$$ 21314 4122 12726 -31244 -65754 -145048 -138566 -37821 -411 -38567 -48559 -33709 -29150
15516b9150K4131k0371j68n3690K120R2218P9338p3276m1727k085L3305Q298K7846
$$ -29150 -5019 -25390 -25558 -79248 -77128 15090 94428 21152 -20575 -22660 10645 18943 46789
15503D6789L489o6337j4222P2732P0970O97j5462n3954k6704p833L2463J944M729
$$ 46789 50278 -16059 -30281 42451 113421 114118 98656 44702 17998 10165 42628 44572 49301
15490D9301p436l2694m9884m4896k0427N1178M6282J2681m4347j1996L9377n751
$$ 49301 41865 9171 -40713 -85609 -106036 -54858 -8576 4105 -40242 -52238 -12861 -18612
15478a8612m9985J8557j524R277k7929K3794J0653n8277k3485L3307K8333r147
$$ -18612 -68597 -50040 -51564 -42287 -70216 -46422 -35769 -94046 -117531 -84224 -55891 -65038
15466f5038l1385k4550k5146J1294J0333N2895P2159j818k367o247j4662K7822
$$ -65038 -96423 -120973 -146119 -134825 -124492 -71597 562 -1256 -3623 -9870 -24532 3290
15454C290N927N0267k425j9994q2541j4693l1374l5443M6370J02684j7031l4098
$$ 3290 9217 59484 57059 37065 -45476 -60169 -91543 -126986 -80616 22068 5037 -29061
15442b9061p2K1493j5045J5747l8505L1955M6040J9506J5873j5947k1415k0376
$$ -29061 -29133 -7640 -22685 -6938 -45443 -13488 32552 52058 67931 51984 30569 10193
15430A0193l9729j6603N94L3749L180L5834k0198O029o3569j5482P3935J4635
$$ 10193 -29536 -46139 -45545 -11796 -8616 27218 7020 13049 -50520 -66002 7933 22568
15418B2568l4889m794m1240m1120O9592q302q2475N728N6280P0934K3703m8118
$$ 22568 -12321 -17115 -58355 -99475 -29883 -38185 -120660 -114932 -58652 12282 35985 -12133
15406a2133m8682L9079K574r427m0884k8179K463J5154N8767M9095n2558J726
$$ -12133 -60815 -21736 -19162 -28589 -69473 -97652 -95189 -80035 -21268 27827 -24731 -23005
15394b3005K8051K0413j12J679k3265j8858Q237K684O958o2759k3981Q1897M6132
$$ -23005 5046 25459 25347 27026 3761 -15097 -6860 -4176 2782 -59977 -83958 -2061 44071
15381D4071J1748m5470L153Q0031p6006l0673L733o695p7278L2212M8482K3013
$$ 44071 55819 10349 13502 93533 17527 -13146 -9413 -16108 -93386 -61174 -12692 10321
15369A0321p4720j8700L5369J7758m4117K472M4500O2492o977j5660N4182m6179
$$ 10321 -64399 -83099 -47730 -29972 -74089 -71617 -27117 35375 28398 12738 66920 20741
15357B0741p5336L3665O8669K6657o5628k6841K2750k2630J5601k0897m595O2456
$$ 20741 -54595 -20930 47739 74396 8768 -18073 4677 -17953 -2352 -23249 -27844 34612
15345C4612K5316J4467n4632q9254J7472j3358m9247O938n88N8923Q0398K3887
$$ 34612 59928 74395 19763 -69491 -52019 -65377 -114624 -107686 -108274 -49351 31047 54934
15333E4934k6290p3985m0171q374N585M5589L8038n398M9889l1804L1955l3848
$$ 54934 28644 -45341 -85512 -93886 -88301 -42712 -4674 -10072 39817 8013 39968 6120
15321F120j1035N7158l9394l1386K9445J9765K7215J900k6140M6995j3716N08
$$ 6120 -4915 52243 12849 -18537 10908 30673 57888 59788 33648 80643 66927 67435
15309F7435n211J9181l2973m722J4415J814K594m060L2239N756j2511j8609K3058
$$ 67435 62224 81405 48432 43710 58125 59939 62533 58473 90712 96468 83957 65348 88406
15296H8406o7068j8537K1264K1180k7759k1730j9815O5739j110n8781r615k8437
$$ 88406 21338 2801 24065 45245 17486 -4244 -24059 41680 40570 -18211 -27826 -56263
15284e6263k5309Q3715O9436l1995l0597L6841M2774K373J8402J6512o4854J3736
$$ -56263 -81572 2143 71579 39584 8987 45828 88602 90975 109377 125889 61035 74771
15272G4771N2990m3748m3771p27J459m3275j5729p591J4786L5879J5914l1614
$$ 74771 127761 84013 40242 39515 40974 -2301 -18030 -25621 -10835 25044 40958 9344
15260I344q913R4842K4814p2130j6390J2608j7689L1270k3319O204m1194L3819
$$ 9344 431 95273 120087 47957 31567 44175 26486 57756 34437 40641 -553 33266
15248C3266o884M6393L0833P951k0871r951l6979m3829Q566m0909k8592j7774
$$ 33266 26382 72775 103608 111559 90688 80737 43758 -71 8495 -32414 -61006 -78780
15236g8780K4229K9941O5655K5310K0382J7771l4969L8545M6583o1442p5156J9939
$$ -78780 -54551 -24610 41045 66355 86737 104508 69539 108084 154667 93225 18069 38008
15224C8008j0532N812n036K3153j9989k7043o4991J5484K4921L5453l7284L5125
$$ 38008 27476 33288 28252 51405 31416 4373 -60618 -45134 -20213 15240 -22044 13081
15212A3081M8327K3346n2948l2031J0445M239L3486K8034n610j2390J9139M2991
$$ 13081 61408 84754 31806 -225 10220 14459 47945 75979 70369 57979 77118 120109
15200A20109O425n317n8449K305j4333P293L2605K3508k0867l9903J0520L3048
$$ 120109 126534 121217 62768 65073 50740 58033 90638 114146 93279 53376 63896 96944
15188I6944k5651j8326m24P011J878k4065P822K7537p6322l411M23M1566Q8239
$$ 96944 71293 52967 52543 59554 61432 37367 45189 72726 -3596 -7007 -6584 34982 123221
15175A23221j5964k0376J2635K9647L713k6242q3072k2751K9153J1729j4343j17118
$$ 123221 107257 86881 99516 129163 132876 106634 23562 811 29964 41693 27350 -89768
15163h9768J7468R5570R0357k7817q4944O5194j3974j7802N7980l9130p7159N114
$$ -89768 -72300 23270 113627 85810 866 66060 52086 34284 92264 53134 -24025 -18911
15151a8911K3325k1280J926M75j1933L546L1046J1851O7183m1409o8293M177R9105
$$ -18911 4414 -16866 -14940 -14465 -26398 -22852 8194 20045 87228 45819 -22474 -18297 80808
15138H0808L7682Q417M893K7517o9583j08280P245J9475N258o0855k7526O0773
$$ 80808 118490 126907 131800 159317 89734 -18546 -11301 8174 13432 -47423 -74949 -14176
15126a4176M8923J8010n7956k903P550M5029K977L6665o3237l8249J4396o480
$$ -14176 34747 52757 -5199 -8102 -552 44477 47454 84119 20882 -17367 -2971 -9451
15114i451J9526J2631J9963J0988o6991j01834O7147J08851l078m43P456L9094
$$ -9451 10075 22706 42669 53657 -13334 -115168 -48021 60830 57752 57309 64765 103859
15102A03859k7550q1076J414L6236m343k4803l0299n5627n6322N0579P1329L0174
$$ 103859 76309 -4767 -3353 32883 28540 3737 -26562 -82189 -138511 -87932 -16603 13571
15090A3571j2633j511l6932m1860K0053K2279p782q193k7890r431M5225K7168
$$ 13571 938 -573 -37505 -79365 -59312 -37033 -44815 -53008 -80898 -90329 -45104 -17936
15078a7936L53j1795L7321L0250L2931K5977l6986L6619m4825o6328l6915M8103
$$ -17936 -17583 -29378 7943 38193 71124 97101 60115 96734 51909 -14419 -51334 -3231
15066c231p007l3189N541L5240K5590j364n0483o902j3254l8312L7781P335j7564
$$ -3231 -10238 -43427 -37886 -2646 22944 21580 -28903 -35805 -49059 -87371 -49590 -42255 -59819
15053e9819m3429O9353J3026k068j831l7488m0226M2240O2250o4099l2329J3781
$$ -59819 -103248 -33895 -20869 -22937 -24768 -62256 -102482 -60242 2008 -62091 -94420 -80639
15041h0639J4396O5236J4918p7983n2609J4032K0325o46O2305Q2831j9026l8720
$$ -80639 -66243 -1007 13911 -64072 -116681 -102649 -82324 -82970 -20665 62166 43140 4420
15029D420j349M9199k5717j8429k0351J7193O0363O0563k9376P612k3745k3506
$$ 4420 3071 52270 26553 8124 -12227 4966 65329 125892 96516 104128 80383 56877
15017E6877J0570k1382J598m1995o8287k7565M6991K8645N0942J2019M908m5867
$$ 56877 67447 46065 47663 5668 -62619 -90184 -43193 -14548 36394 48413 53321 7454
15005G454j3672N0510L178m0789L091j6980K1678k8757k4006Q624l8402O0076
$$ 7454 -6218 44292 47470 6681 9772 -7208 14470 -14287 -38293 -29669 -68071 -7995
14993g995P7824K7771k9521k241j8237k2787j3231J4493j5990k1866L8311m6290
$$ -7995 69829 97600 68079 65838 47601 24814 11583 26076 10086 -11780 26531 -19759
14981a9759K0035K6919o5782j7744j4024K5787k2295L5481N3152P602J2456J9753
$$ -19759 276 27195 -38587 -56331 -70355 -44568 -66863 -31382 21770 29372 41828 61581
14969F1581r5327r6006K0618N8189l756K489N6285P8708K4380r149O2461l0234
$$ 61581 -33746 -129752 -109134 -50945 -54701 -52212 4073 82781 107161 98012 160473 130239
14957A30239o1547n5908j0768M5291L0647J5885j02353n2296M1284M6053J6269
$$ 130239 68692 12784 2016 47307 77954 93839 -8514 -60810 -19526 26527 42796
14946D2796o1329p2893k9005K5061J02817J551k6966n283L1649m0989l0034J056
$$ 42796 -18533 -91426 -120431 -95370 7447 8998 -17968 -23251 8398 -32591 -62625 -61569
14934f1569J1317Q9938r482j6923M1188O8077Q3081J7496n8732j823P72k1606
$$ -61569 -50252 39686 30204 13281 54469 122546 205627 223123 164391 162568 163340 141734
14922A41734l6109Q114K1426l1340l3797K7354n7203j2265m6918J7480O5158M887
$$ 141734 105625 113739 135165 103825 70028 97382 40179 27914 -19004 -1524 63634 68521
14910F8521m5504K9802J8944o7493K9542M3785m6897n9582J3371L584k6849j5979
$$ 68521 23017 52819 71763 4270 33812 77597 30700 -28882 -15511 -11927 -38776 -54755
14898e4755L5156K7861L3240R150p088j2535n2382O904N7986j1016K243p4790
$$ -54755 -19599 8262 41502 50652 43564 31029 -21353 -14449 43537 32521 34764 -40026
14886d0026k6550O2240O3272j4599j0314p871q052j2008k1483o657K7395O9829
$$ -40026 -66576 -4336 58936 44337 34023 26152 18100 6092 -15391 -22048 5347 75176
14874G5176m1705j2855L0328M9513J2451j594L4055J5059J0359j0795k8715k8852
$$ 75176 33471 20616 50944 100457 112908 111314 145369 160428 170787 159992 131277 102425
14862A02425K2995m3239l7848N0452J6241k8219l0238m4040l1530l1653L4777
$$ 102425 125420 82181 44333 94785 111026 82807 52569 8529 -23001 -54654 -19877
14851a9877J10920M2124K5953K6941R744k5512L5279N7122n1552n920L3921m2727
$$ -19877 91043 133167 159120 186061 195805 170293 205572 262694 211142 205222 239143 196416
14839A96416q3451J6108P9894J26658J02473Q5444N4231P4976J74806K42174K96331
$$ 196416 112965 129073 208967 335625 438098 523542 577773 652749 827555 1069729 1366060
14828A366060L20593M11679M55589O19523Q22655R26513R12096P23148N42052
$$ 1366060 1686653 2098332 2553921 3173444 3996099 4922612 5834708 6557856 7099908
14819G099908J44230j06612n43939p68074q08690p87451o74736m57543l59902
$$ 7099908 7244138 7137526 6593587 5825513 5016823 4229372 3554636 3097093 2737191
14810B737191k52881n3082q3035n0388M671L6657K26404L42944M28380O31866
$$ 2737191 2484310 2431228 2348193 2297805 2302476 2339133 2565537 2908481 3336861 3968727
14800C968727R09878J224039J558078J814143J901812J808599J429710P58783
$$ 3968727 4878605 6102644 7660722 9474865 11376677 13185276 14614986 15373769
14792A5373769r3741r10759j479217j818172j867530j598964j354008j002224
$$ 15373769 15280028 14369269 12890052 11071880 9204350 7605386 6251378 5249154
14784E249154p21066n11450l12813k37126j29343o3263q2119P7475J95255L56562
$$ 5249154 4528088 4016638 3703825 3466699 3337356 3274093 3191974 3269449 3464704 3821266
14774C821266N19774O72505R56961J300770J613179J805827K008079K071415K013610
$$ 3821266 4341040 5013545 5970506 7271276 8884455 10690282 12698361 14769776 16783386
14765A6783386J818642J376916Q02515P2407p44966j452496j998019k243785k280764
$$ 16783386 18602028 19978944 20781459 20853866 20108900 18656404 16658385 14414600 12133836
14756A2133836k086289j704466j285149q17885o02858m40926k29197k808J12135
$$ 12133836 10047547 8343081 7057932 6240047 5637189 5196263 4967066 4964258 5076393
14747E076393J74231L49862O52953R09048J306713J822954K440959L136869L860823
$$ 5076393 5250624 5600486 6253439 7162487 8469200 10292154 12733113 15869982 19730805
14738A9730805M140396L711486K828278J454805m46650k156242l297194l924754
$$ 19730805 23871201 27582687 30410965 31865770 31419120 29262878 25965684 22040930
14730B2040930l938256l516954k829758k055128j550083j100388p82743n22559
$$ 22040930 18102674 14585720 11755962 9700834 8150751 7050363 6267620 5745061
14722E745061l57418k55690o3273R7977K56928N28864P30319J057030J448628
$$ 5745061 5387643 5131953 5068680 5166657 5423585 5952449 6682768 7739798 9188426
14713I188426J877771K186242K294387K117803J751342J233865M64588k57225
$$ 9188426 11066197 13252439 15546826 17664629 19415971 20649836 21114424 20857199
14705B0857199q44739j343132j862953k152041k104132j981973j777401j538775
$$ 20857199 20012460 18669328 16806375 14654334 12550202 10568229 8790828 7252053
14697G252053j163726r11330o73931m38272l45868k72459j19918j6244J03761
$$ 7252053 6088327 5176997 4503066 4064794 3718926 3446467 3326549 3310305 3414066
14688C414066J92442K59759M55015O35445Q76673J234775J650778J943548K020550
$$ 3414066 3606508 3866267 4321282 4956727 5833400 7068175 8718953 10662501 12683051
14679A2683051J871403J334350N89670l42239j193648j780830j966789j970626
$$ 12683051 14554454 15888804 16478474 16136235 14942587 13161757 11194968 9224342
14671I224342j712180j399985j168553p97147n76219m19006k90200k39277r9349
$$ 9224342 7512162 6112177 4943624 4146477 3570258 3151252 2861052 2621775 2522426
14662B522426k88J00128K16782J96821K47406M39234O13353P66820R04434Q19528
$$ 2522426 2522138 2622266 2839048 3035869 3283275 3722509 4335862 5102682 6007116 6826644
14652F826644O28781M20426Q2852m00880o83052q53900r33439r19159p92206o04035
$$ 6826644 7455425 7875851 7958703 7557823 6874771 6020871 5087432 4168273 3376067 2772032
14642B772032m40673l61215l10540k54215j40282j23528j58444j47511n9281l6837
$$ 2772032 2331359 1970144 1659604 1405389 1265107 1141579 983135 835624 776343 739506
14632G39506o4535r3226p3556q4834l1316o6638k2637p794p570m1879k3807L9147
$$ 739506 674971 581745 508189 423355 392039 325401 302764 294970 287400 245521 221714 260861
14620B60861J6909l6726m0570l3493M2784J5249M6565l6319r6720K8724N8182
$$ 260861 277770 241044 200474 166981 209765 225014 271579 235260 138540 167264 225446
14609B25446J2576o866j1426j8399K120L1838j7381o8489o6241L8679N0509n817
$$ 225446 238022 231156 219730 201331 203451 235289 217908 149419 83178 121857 172366 166549
14597A66549j1936m1767l5473j6384O9208O6091o5145l2366m9347L3666M374M5719
$$ 166549 154613 112846 77373 60989 130197 196288 131143 98777 49430 83096 87470 133189
14585A33189L89n8415m3963k3478m9589J914J0586j5609L8999L0455J1859K4194
$$ 133189 133578 75163 31200 7722 -41867 -39953 -29367 -44976 -5977 24478 36337 60531
14573F0531O522l450J2958L7200P1836p968j21636j906J7714L4697m121J2893
$$ 60531 67053 63603 76561 113761 185597 177629 55993 54087 71801 106498 102377 115270
14561A15270rl2404J3567r161n9411r14p913K7781j1172k5563K0071j8747k3227
$$ 115270 115261 82857 96424 87263 27852 26938 19025 46806 35634 10071 30142 11395 -11832
14548a1832J0724J4627m491O9989N3871j1077k6442j9754p928Q080J4524k8704
$$ -11832 -1108 13519 9028 79017 132888 121811 95369 75615 67687 75767 90291 61587
14536F1587L6593K6851l540k0626j7567o6623k4551k9886J1359M1062M5359q442
$$ 61587 98180 125031 121491 100865 83298 16675 -7876 -37762 -26403 14659 60018 51576
14524E1576k4178j422L6769Q268m0516M6777P1596N857k2406k5685j2839M4251
$$ 51576 27398 25976 62745 71013 30497 77274 148870 154727 132321 106636 93797 138048
14512A38048J682k1403j3734L738n593N548j0420M2028j2518n5267l004o591M3050
$$ 138048 139730 118327 104593 108331 102738 108286 97866 139894 127376 72109 69105 62514 105564
14499A05564l693k4076m5536j3955l1557K6439k986n773l4793q3117k457K7272
$$ 105564 101871 77795 32259 18304 -13253 13186 10200 4427 -30366 -113483 -115940 -88668
14487h8668M1222Q3393O2825m5554n1122N5197J4132j0095l1931L6145L624k2139
$$ -88668 -47446 35947 98772 53218 2096 57293 71425 61330 29399 65544 69168 47029
14475D7029m8859j9772r921m1650Q4662Q8711R254j5135m3609l3546K928J0594
$$ 47029 -1830 -21602 -31523 -73173 11489 100200 109454 94319 50710 17164 20092 30686
14463C0686L138O1275q545l9035O0683J3282o0463l5323n9394J1867J08033j3492
$$ 30686 33824 95099 86554 47519 108202 121484 61021 25698 -33696 -21829 86204 72712
14451G2712o0849J482n6482K503m9305N2090j6293k5553n545L4333J6780Q5022
$$ 72712 11863 13345 -43137 -40634 -89939 -37849 -54142 -79695 -85240 -50907 -34127 50895
14439E0895J384k1699l2039J0350J2436K8100k4976m8913j6469P1245M9880J1951
$$ 50895 52279 30580 -1459 8891 21327 49427 24451 -24462 -40931 30314 80194 92145
14427I2145m6470l4823j00485J5619l6328Q2445L3544L7411L0019j0498k5467
$$ 92145 45675 10852 -89633 -74014 -110342 -27897 5647 43058 73077 62579 37112
14416C7112J3116k1912K9736K1051n363l1876l8016K6639j2843m6111o8582L9181
$$ 37112 50228 28316 58052 79103 73740 41864 3848 30487 17644 -28467 -97049 -57868
14404e7868N8783P9259m8809q1346r611K5931N7286O3706K7741j4401m1888o8590
$$ -57868 915 80174 31365 -49981 -59592 -33661 23625 87331 115072 100671 58783 -9807
14392i807j7783O8155k047q205K6589j399m2406m8416m3346j4863N5598N0889
$$ -9807 -27590 40565 38518 30313 56902 55503 13097 -35319 -78665 -93528 -37930 12959
14380A2959k914l0024r95O846N0416J438K0684n2292k6952j3698M8761N0465N0415
$$ 12959 10045 -19979 -20974 -14128 36288 37726 58410 6118 -20834 -34532 14229 64694 115109
14367A15109o3568J671j9854j9043j6064K1294j5964J1340q2494j8608l1904J2360
$$ 115109 51541 53212 33358 14315 -1749 19545 3581 14921 -67573 -86181 -118085 -105725
14355a05725P1974L4221K6330L1621k5991j6129Q0952Q321o98N6926l0084n1805
$$ -105725 -33751 470 26800 58421 32430 16301 97253 105574 104876 161802 131718 79913
14343G9913p296m106l1102l859j4212K491j0322J3420M4989L4436l2543o7314
$$ 79913 72617 68511 37409 33550 19338 21829 11507 24927 69916 104352 71809 4495
14331D495l3911o0458J0368P4933L8268p2057m8061K3552K5338L3124J3658j0383
$$ 4495 -29416 -89874 -79506 -4573 33695 -38362 -86423 -62871 -37533 -4409 9249 -1134
14319a134O850Q2593K7747m1699j6537l4185m8148j3149N1633L9608P026K0016
$$ -1134 5716 88309 116056 74357 57820 23635 -24513 -37662 13971 53579 60605 80621
14307H0621K676m1990k7757L6563M2395o6240m8105K7155K821l8859K7249N5492
$$ 80621 83297 41307 13550 50113 92508 26268 -21837 5318 8139 -30720 -3471 52021
14295E2021M354R8938M859n0692q9700J9510J5292K6523j3839j8860O615m0336
$$ 52021 56375 155313 160172 109480 19780 39290 54582 81105 67266 48406 55021 14685
14283A4685q024J8492M326m8483l7876o913J7000P461l2614M6187O692L5894M1411
$$ 14685 6661 25153 29479 -19004 -56880 -63793 -46793 -39332 -71946 -25759 -19067 16827 58238
14270E8238j1660k3842L7222L9064K5311l3317k3555N1583J1595J594P2596O7550
$$ 58238 46578 22736 59958 99022 124333 91016 67461 119044 130639 132233 204829 272379
14258B72379m4723j3199k1973q7204l4649m939o900J3069P8429N505J6772q8478
$$ 272379 227656 214457 192484 105280 70631 65692 58792 71861 150290 155795 172567 84089
14246H4089j5410k825p464p0835m7742N3432l2903n3612K2611M1689Q0869J2003
$$ 84089 68679 65854 58390 -12445 -60187 -6755 -39658 -93270 -70659 -28970 51899 63902
14234F3902J4558K5657K9421J8929K5298n3233m142j4870l6709J94j6120k6331
$$ 63902 78460 104117 133538 152467 177765 124532 120390 105520 68811 69005 52885 26554
14222B6554j5558K9359K0542L5064n2229k7071J3595Q0697J05050m2440n2335
$$ 26554 10996 40355 60897 95961 43732 16661 30256 110953 216003 173563 121228
14211A21228j7436K0673J1276J2433K8808K6269l9164m741r651R22N3616K6095
$$ 121228 103792 124465 135741 148174 176982 203251 164087 159346 149695 150617 204233 230328
14199B30328m6931j02620m6867r151Q720m2624k8637M4690R4293l9650l1301L5151
$$ 230328 183397 80777 33910 24759 33479 -9145 -37782 6908 101201 61551 30250 65401
14187F5401J0550l3758o184M1954j0452M842J0832L7713K0132l4235p2854J4727
$$ 65401 75951 42193 36009 77963 67511 72353 83185 120898 141030 106795 33941 48668
14175D8668N7619M3575l5683k3244m6330m1384p061l6045J1200j7314J979J2020
$$ 48668 106287 149862 114179 90935 44605 3221 -3840 -39885 -28685 -45999 -44020 -32000
14163c2000J1920K2587k8252j1202M9222k0623m4077J9361Q018J6985J8378J5575
$$ -32000 -20080 2507 -25745 -36947 12275 -8348 -52425 -33064 -25046 -8061 10317 25892
14151B5892k8115m8663j53j1817Q465L5748K4386K4621R207k4497N258o362N291
$$ 25892 -2223 -50886 -51039 -62856 -54391 -18643 5743 30364 39571 15074 20332 13970 19261
14138A9261m0324k6437m6687L7322L7577p315K2651K8526k0075o85R647k0724
$$ 19261 -21063 -47500 -94187 -56865 -19288 -26603 -3952 24574 4499 3814 13461 -7263
14126g263k610k8734m1994N28J1063k1657J0764J2934m9484r883J9722P9989L4975
$$ -7263 -9873 -38607 -80601 -80073 -69010 -90667 -79903 -66969 -116453 -126336 -106614 -26625 8350
14113H350M1405J7650m1105K681p5170j1754P645m0172J8132M1330L1188l657
$$ 8350 49755 67405 26300 28981 -46189 -57943 -50298 -90470 -72338 -31008 180 -3477
14101c477N1343m8414j232J10906M1583J5878k0461j2796K1320J24115R9427l4181
$$ -3477 47866 -548 -1780 109126 150709 166587 146126 133330 154650 278765 378192 344011
14089C44011r3548q3265p5214m3406L2694j26017n3091L8062J00673O6215n0509
$$ 344011 250463 167198 91984 48578 81272 -44745 -97836 -59774 40899 107114 56605
14078E6605n747N565L4075N1303l7091o0941m4505j8297k1777P9195N5203O8492
$$ 56605 50858 56423 90498 141801 104710 43769 -736 -19033 -40810 38385 93588 162080
14066A62080l583M8525K4511j218m0514q9338j01726K536L210p4173p4247J4247
$$ 162080 158497 207022 231533 230315 189801 100463 -1263 1273 4483 -69690 -143937 -129690
14054a29690K9959K3490l7121N275M4689O9799K7015n8127Q478J6178l1146k804
$$ -129690 -99731 -76241 -113362 -108087 -63398 6401 33416 -24711 -16233 -55 -31201 -34005
14042c4005k136m482L1484K4945j5729k2627J2677M3433Q905L7179l1238m3872
$$ -34005 -36141 -40623 -9139 15806 77 -22550 -9873 33560 42465 79644 48406 4534
14030D534M2273J1211N470j1670j6145j861l0615J8782o1306m9266j8018J0698
$$ 4534 46807 58018 63488 51818 35673 33812 3197 21979 -39327 -88593 -106611 -95913
14018i5913M2641K8788m8285j3785J514P6542P567m5849K2919o525L0595N5244
$$ -95913 -53272 -24484 -72769 -86554 -85040 -8498 -931 -46780 -23861 -30386 209 55453
14006E5453m5992m0948P042L0529O2348k2658P014k7945n1580k8812J0837L885
$$ 55453 9461 -31487 -24445 6084 68432 45774 52788 24843 -26737 -55549 -44712 -40827
13994d0827Q3539N2366j6757L164j2493m29n616m5912j1843n2928j0371l2117
$$ -40827 42712 95078 78321 81485 68992 68563 62947 17035 5192 -47736 -58107 -90224
13982i0224L96J07267K7729o9007j8038O518K1507O0424j7700m2763k3589N2599
$$ -90224 -89828 17439 45168 -23839 -41877 -35359 -13852 46572 28872 -13891 -37480 15119
13970A5119J9768M7346M7500k2520m1665O784j6780l4711n682j3662p8376n0720
$$ 15119 34887 82233 129733 107213 65548 72332 55552 20841 15159 1497 -76879 -127599
13958a27599M1639R6023O0906L1746q7328n7608O941K1036L362M7093O1628j2273
$$ -127599 -85960 10063 70969 102715 15387 -42221 -35280 -14244 -10882 36211 97839 85566
13946H5566K9257l7456p2839n6193J8679K8099J666q883J1810P024k471J9971
$$ 85566 114823 77367 4528 -51665 -32986 -4887 -3221 -12104 -294 6730 4259 24230
13934B4230j1159k7276o481m0832o858L0429J1808L0162L7776j5610P708J0503
$$ 24230 13071 -14205 -20686 -61518 -68376 -37947 -26139 4023 41799 26189 33897 44400
13922D4400j2822l8741l6338o2136K4981l2082k2226M3306O0299O5296L8124l9280
$$ 44400 31578 -7163 -43501 -105637 -80656 -112738 -134964 -91658 -31359 33937 72061 32781
13910C2781o9319l9070o658n7505j6692P7870J0100l7631J3187k1564n2866M9328
$$ 32781 -36538 -75608 -82266 -139771 -156463 -78593 -68493 -106124 -92937 -114501 -167367 -118039
13898a18039P4494M4975J9724o05k5568l7646l3216M1030J7662m019J2239k9119
$$ -118039 -43545 1430 21154 20549 -5019 -42665 -75881 -34851 -17189 -21208 -8969 -38088
13886c8088m626J1299p489L1238j843R150j8253k1066l744M4654N3846p4176l1938
$$ -38088 -42714 -31415 -38904 -7666 -9509 -359 -18612 -39678 -43422 1232 55078 -19098 -51036
13873e1036k2703k3258N3531K9719k4791J1506L6773K5580j2758l6881l4368n987
$$ -51036 -73739 -96997 -43466 -13747 -38538 -27032 9741 35321 22563 -14318 -48686 -54673
13861e4673j3682J6717K7516q612K104O3599J2689J7624l1036l8772K0736M7471
$$ -54673 -68355 -51638 -24122 -32734 -30630 32969 45658 63282 32246 -6526 14210 61681
13849F1681M4079n3353l5776Q530R382L5867k6156l1162o4507L3993O1624o6051
$$ 61681 105760 52407 16631 25161 34543 70410 44254 13092 -51415 -17422 44202 -21849
13837b1849N6480N8370n5359r0518j3950K0248j6630J1147O9566Q6902J6403l7093
$$ -21849 34631 93001 37642 -52876 -66826 -46578 -63208 -52061 17505 104407 120810 83717
13825H3717J2876m7465l1081o0111n3532L4355L2334N2452j8813k6013K4016L0184
$$ 83717 96593 49128 18047 -42064 -95596 -61241 -28907 23545 4732 -21281 2735 32919
13813C2919j794j6474j57K4652j959J5199j5890m1667m8424J3485L0758K1733
$$ 32919 31125 14651 14494 39146 37187 52386 36496 -5171 -53595 -40110 -9352 12381
13801A2381q931p896l7729L5152N6040j5835k0540L4392o3423n001P708o9374
$$ 12381 3450 -4446 -42175 -7023 49017 33182 12642 47034 -16389 -21390 -13682 -83056
13789h3056q7996N2884J7408M0714L7650k3583k3028m2641m1494N6477L2900k9118
$$ -83056 -171052 -118168 -100760 -60046 -22396 -45979 -69007 -111648 -153142 -96665 -63765 -92883
13777i2883n0061k3022M1150J2589P3617M6911L7969o231m9699j21M3508O729
$$ -92883 -142944 -165966 -124816 -112227 -38610 8301 46270 40039 -9660 -9781 33727 40456
13765D0456m3790n0450J6574L567K8526K7384Q7337Q6174k6506j00137l7267J6802
$$ 40456 -3334 -53784 -37210 -33643 -5117 22267 109604 195778 169272 69135 31868 48670
13753D8670k9930l3607l5151o1355k6544J3814P9203O2310l0154N894K3195L3670
$$ 48670 18740 -14867 -50018 -111373 -137917 -124103 -44900 17410 -12744 -6850 16345 50015
13741E0015l568p9253p535L8513M1338K9533l0201L5993Q791j6916K6437k8775
$$ 50015 46447 -32806 -40341 -1828 39510 69043 38842 74835 83626 66710 93147 64372
13729F4372j05709n7572M739J3116J3992J7940L8075J7640o4008m5396M1234q645
$$ 64372 -41337 -98909 -94170 -81054 -67062 -49122 -11047 6593 -57415 -102811 -61577 -70222
13717g0222m5285M8151R2063J00197m0993n2106o869J1705l1952o7535j106P196
$$ -70222 -115507 -67356 24707 124904 83911 31805 24936 36641 4689 -62846 -63952 -56756
13705e6756j4310L730O8590N4463k0726j0955l8533J201m53j5120j6507J2477
$$ -56756 -71066 -67336 1254 55717 34991 24036 -14497 -13296 -13749 -28869 -45376 -32899
13693c2899M1674O0135M8597N898K7469K3700p0044m8757m8155J2109J4422n592
$$ -32899 8775 68910 117507 123405 150874 174574 104530 55773 7618 19727 34149 28557
13681B8557j8844l0650K7304m6993l5149r724N724L991L6522k679K8640K3708
$$ 28557 9713 -20937 6367 -40626 -75775 -85499 -79775 -75784 -39262 -41941 -13301 10407
13669A0407k3615j4585m5624j6355K4811l693M174J4760J974J5469M1424J1375
$$ 10407 -13208 -27793 -73417 -89772 -64961 -68654 -64480 -49720 -47746 -32277 9147 20522
13657B0522J4197J9963k4507L5439l0340o8454p688M533P3907L0925o186J6776
$$ 20522 34719 54682 30175 65614 35274 -33180 -40868 -36335 37572 68497 62311 79087
13645G9087q1385l2774j285L8350l1591k3250N5379N6426J1733m0861K1278N939
$$ 79087 -2298 -35072 -36357 1993 -29598 -52848 2531 58957 70690 29829 51107 57046
13633E7046j1045l0975l4427j8642J8102r845m589L650j3420l7656K7210N5351
$$ 57046 46001 15026 -19401 -38043 -19941 -29786 -34375 -30725 -44145 -81801 -54591 760
13621G60K4050K1361N4820K6526k1807l4462K952l758j9716p897l2536l6828p927
$$ 760 24810 46171 100991 127517 105710 71248 74200 70442 50726 42829 10293 -26535 -34462
13608c4462K1912M0216q5071j945K4188k4179N0715K5436j2968K1556J6497n2176
$$ -34462 -12550 27666 -57405 -59350 -35162 -59341 -8626 16810 3842 25398 41895 -10281
13596a0281L4m7448j1991L8238j5074l7444R480N8086J4629p431P711l6576M7146
$$ -10281 -10247 -57695 -69686 -31448 -46522 -83966 -74486 -16400 -1771 -9202 -1491 -38067 9079
13583I079j2456p994L0710j5824k719p24J9062j298k7406L2649n0849N2501L9132
$$ 9079 -3377 -11371 19339 3515 796 72 19134 17836 -9570 23079 -27770 24731 63863
13570F3863M086k7646k311j710J5654k1682l6638K0650j6837O262k3362P102Q986
$$ 63863 67949 40303 37992 36282 51936 30254 -6384 14266 -2571 3691 -19671 -12569 -3583
13557c583k017k5198k6661P6134J0395k6802J2724k6697k4438l4197j3970n7939
$$ -3583 -5600 -30798 -57459 18675 29070 2268 14992 -11705 -36143 -70340 -84310 -142249
13545a42249R000K0915M0097K1215M4486M6510j5413O805m2716p8795l7679J8852
$$ -142249 -133249 -112334 -72237 -51022 -6536 39974 24561 31366 -11350 -90145 -127824 -108972
13533a08972R1225m708j6944N0442j1346K7769q314N0104J3328l6787N036j7407
$$ -108972 -17747 -22455 -39399 11043 -303 27466 19152 69256 82584 45797 50833 33426
13521C3426o1470K5392O9920R932n2622j3460k6188l0726J3246j6607l5811K4140
$$ 33426 -28044 -2652 67268 77200 24578 11118 -15070 -45796 -32550 -49157 -84968 -60828
13509f0828k6486J9936O0635J0975l4095N730O9575M1736L4333o3245m7888j3398
$$ -60828 -87314 -67378 -6743 4232 -29863 -24133 45442 87178 121511 58266 10378 -3020
13497c020j3878J9268l0726o3493k0736R2714P198n3315q4272l8471O1283L0921
$$ -3020 -16898 2370 -28356 -91849 -112585 -19871 -12673 -65988 -150260 -188731 -127448 -96527
13485i6527l8858M6605J1739P1035L7063n9925K98J22285k5128q6346m5094L1808
$$ -96527 -135385 -88780 -77041 -6006 31057 -28868 -28570 93715 68587 -17759 -62853 -31045
13473c1045J2909M6866r9077m3108K2095J7302j443O3240J5023L282o206k9589
$$ -31045 -18136 28730 -70347 -113455 -91360 -74058 -75501 -12261 2762 6044 -162 -29751
13461b9751j8672N0430Q2703m9956P346J9557j7291j98L970K7188m8676k9567
$$ -29751 -48423 2007 84710 34754 42100 61657 44366 44168 48138 75326 26650 -2917
13449b917K025n2928M4746L1773J72J1900m7369m0820P191k8610k0557J7765L3185
$$ -2917 -892 -53820 -9074 22699 22871 34771 -12598 -53418 -46227 -74837 -95394 -77629 -44444
13436d4444K6502k7711m2398P5296M8779J4748j9550k1939J5740j4105n4654p1187
$$ -44444 -17942 -45653 -88051 -12755 36024 50772 31222 9283 25023 10918 -43736 -114923
13424a14923j3319O7851J2838m0896N008O1263O7709k32l9008L0206K9878m2671
$$ -114923 -128242 -60391 -47553 -88449 -83441 -22178 45531 45299 6291 36497 66375 23704
13412B3704j6279n0672m7296k9019n965J7357j5725P0484N8247K6832N9857n3707
$$ 23704 7425 -43247 -90543 -119562 -125527 -108170 -123895 -53411 4836 31668 91525 37818
13400C7818l9305L4741q0607r6231j5463L1447O8724k073k0356N3700M9218M6998
$$ 37818 -1487 33254 -47353 -143584 -159047 -127600 -58876 -60949 -81305 -27605 21613 68611
13388F8611k321j4234k8615k1415K2397k3152j3299m3049l0178k4126k9271m119
$$ 68611 66290 52056 23441 2026 24423 1271 -12028 -55077 -85255 -109381 -138652 -142771
13376a42771k4793L153N1049N2038O3868M5076l9113r042J6168J1572m0077p082
$$ -142771 -167564 -164411 -113362 -61324 2544 47620 8507 -535 15633 27205 -12872 -19954
13364a9954J8376l7253o068M0985l5744k3855O4508K283m288K7664m8834r767
$$ -19954 -1578 -38831 -44899 -3914 -39658 -63513 995 3278 -1010 26654 -22180 -31947
13352c1947N2677O0173J3429J9237k7188l2679M105l2709m1250n4254J8656L9276
$$ -31947 20730 80903 94332 113569 86381 53702 57807 25098 -16152 -70406 -51750 -12474
13340a2474j6095l4795K6822K0834q811K3761O4234Q2854m3771n6537o106k3670
$$ -12474 -28569 -63364 -36542 -15708 -24519 -758 63476 146330 102559 46022 39916 16246
13328A6246l4737O09L5833P691k4719j8519r63l0730M8627l8032j5205Q7749N1162
$$ 16246 -18491 -17882 17951 25642 923 -17596 -18559 -49289 -662 -38694 -53899 33850 85012
13315H5012m584l6536m8285k4088l9582Q087r012k461P2465O0460m1581L688J4236
$$ 85012 80428 43892 -4393 -28481 -68063 -59976 -68988 -71449 1016 61476 19895 23583 37819
13302C7819p8816M0552J9251k6274q409N5279K3845k1157o827K9969M123m7643
$$ 37819 -40997 -445 18806 -7468 -15877 39402 63247 42090 35263 65232 69355 21712
13290B1712J35R70R9735k9533n8509m4906j1361J2083K516K514J8105P1786L4137
$$ 21712 21847 22817 122552 93019 34510 -10396 -21757 -9674 -7158 -4644 13461 85247 119384
13277A19384J6742J725J2393J5649q2895q2068k4009l78Q0979L2529n1644o1236
$$ 119384 136126 137851 150244 165893 82998 930 -23079 -23457 57522 90051 38407 -22829
13265b2829L4268K1049k558P0423J8552n5851m1246J8849L5438k5375k9272M3332
$$ -22829 11439 32488 29930 100353 118905 63054 21808 40657 76095 50720 21448 64780
13253F4780M4709j2077J9329j3014q16j2662j8443L7041N5175j6358m5859k0423
$$ 64780 109489 97412 116741 103727 102911 90249 71806 108847 164022 147664 101805 81382
13241H1382n372M3869R486m9523J2338k218k2278n3636K714J4792k2148N8362
$$ 81382 76010 119879 129365 79842 92180 89962 67684 14048 16762 31554 9406 67768
13229F7768J7628J234l5943J1315M1476K7829L9097L5664o6020j2828Q3318J8637
$$ 67768 85396 86630 50687 62002 103478 131307 170404 206068 140048 127220 210538 229175
13217B29175l7773k6204r460K0055j0425o9701m2860N057m922j306k1605l6772
$$ 229175 191402 165198 155738 175793 165368 95667 52807 57864 52942 51636 30031 -6741
13205f741M3663L8606k8457l3455J0781L0212K0593R3877J119j4858K2260j7048
$$ -6741 36922 75528 47071 13616 24397 54609 75202 169079 170198 155340 177600 160552
13193A60552o6911J5501r2256l3934M6021N8684M2522k5135l903l2511k254J9624
$$ 160552 93641 109142 16886 -17048 28973 87657 130179 105044 101141 68630 66376 86000
13181H6000K0622K2806K2233n7036l1907J1581K0088k0166Q2752P3667K3642m0283
$$ 86000 106622 129428 151661 94625 62718 74299 94387 74221 156973 230640 254282 213999
13169B13999n3482o4746N9702L5044l8977m8942L7066M4274m8499j4804L1205
$$ 213999 160517 95771 155473 190517 151540 102598 139664 183938 135439 120635 151840
13158A51840K9233n972o0159m9270j6337K1989O1695L2980K091J6090q505m5780
$$ 151840 181073 175101 114942 65672 49335 71324 133019 165999 168090 184180 175675 129895
13146A29895K8200J0196L0965K7504L6446l7297J7444j0612q874J351q8317r094
$$ 129895 158095 168291 199256 226760 263206 225909 243353 232741 223867 225218 136901 127807
13134A27807M5720j5219n5594l4038K8077o7752m4347L7248k5222J3611O7834
$$ 127807 173527 158308 102714 68676 96753 29001 -15346 21902 -3320 10291 78125
13123G8125k5375N2277L9436j3607k9327J0780q233k6142k1910J7941m9607l7443
$$ 78125 52750 105027 144463 130856 101529 112309 104076 77934 56024 73965 24358 -13085
13111a3085O980R2592L7071j4308n42k8640l1741p2966r0336r854K1460N3034
$$ -13085 -6105 86487 123558 109250 108708 80068 48327 -24639 -114975 -124829 -103369 -50335
13099e0335P9875N6975k7650p8406K2585K9508k2049N553k8463r934l3555K0226
$$ -50335 29540 86515 58865 -19541 3044 32552 10503 16056 -12407 -22341 -55896 -35670
13087c5670M3757l7831K2202N7057M9468L8985l1466n0618m2445O459k3833l8729
$$ -35670 8087 -29744 -7542 49515 98983 137968 106502 55884 13439 19898 -3935 -42664
13075d2664k2955N3545j5420l0740J8125Q5095M8574K6464K4638k4223o5692k5603
$$ -42664 -65619 -12074 -27494 -58234 -40109 44986 93560 120024 144662 120439 54747 29144
13063B9144q0158l2004K6974P4474N7115l4894l9561o4653k7507O967J1306M8414
$$ 29144 -51014 -83018 -56044 18430 75545 40651 1090 -63563 -91070 -84103 -72797 -24383
13051b4383M2725K9214J0839J8178K983o5363j1986N3281m1609L7437P7566N1927
$$ -24383 18342 47556 58395 76573 79556 14193 2207 55488 13879 51316 128882 180809
13039A80809k0782l3236l3424l3744l3344l315o696L2191N4242O909m6192M8546
$$ 180809 160027 126791 93367 59623 26279 22964 16268 48459 102701 109610 63418 111964
13027A11964L6767L785j4492k8022l8986l6594K7375J8363q406o672l2686O0888
$$ 111964 148731 152516 138024 110002 71016 34422 61797 80160 71754 65082 32396 93284
13015I3284J4077o9869n3487J7108L6323J8653K0280m072j67Q1206l9502r8793
$$ 93284 107361 37492 -15995 1113 37436 56089 76369 72297 72130 153336 113834 15041
13003A5041J3649k0470J8196K3598K5249P249q4840q1247L0638K2307j635M6920
$$ 15041 28690 8220 26416 50014 75263 82512 -2328 -83575 -52937 -30630 -32265 14655
12991A4655l1594J4538l398k9229l517N0877O7907k4101j6007k960l5321j533
$$ 14655 -16939 -2401 -5799 -35028 -38545 12332 80239 56138 40131 37171 1850 317
12979C17j9555Q35Q0445N690l3974J7954o9111l698J6358K6100O3470K9259j7054
$$ 317 -19238 -18403 62042 67732 33758 51712 -17399 -21097 -4739 21361 84831 114090 97036
12966I7036l5495n0031k6871J0242O582l5706k2901r311Q372L9479O870l3682
$$ 97036 61541 11510 -15361 -5119 1463 -34243 -57144 -66455 -58083 -18604 -11734 -45416
12954d5416l8181l3900N75P1248M4327K1296m0728j5192j3165L8411O5697Q155
$$ -45416 -83597 -117497 -116922 -45674 -1347 19949 -20779 -35971 -49136 -10725 54972 63127
12942F3127l7849k2656j6050P5359N9479k6237m9285J7304L9870l1153k9858r116
$$ 63127 25278 2622 -13428 61931 121410 95173 45888 63192 103062 71909 42051 32935
12930C2935k415l4036o7317J0709K3915L5689R6732K372k0647r608k6514k3866
$$ 32935 30520 -3516 -70833 -60124 -36209 -520 96212 98584 77937 68329 41815 17949
12918A7949M2343k92j8374p040o1574O557L8754n623O2136Q484m7073n897k928
$$ 17949 60292 60000 41626 34586 -26988 -20431 18323 12700 74836 83320 36247 30350 27422
12905B7422N5824N1107N56m7081n0502m5134L3927P9967j4579L8512M8517o3809
$$ 27422 83246 134353 134909 87828 37326 -7808 26119 106086 91507 130019 178536 114727
12893A14727O58L034m998J2119K2943m3777k8886o774k1420L4687N3583J2635
$$ 114727 115385 118419 113421 125540 148483 104706 75820 69046 47626 82313 135896 148531
12881A48531r2838m6463J0293j2954q123L3529K5786K0943m862K0267K3466M4002
$$ 148531 55693 9230 19523 6569 -1554 31975 57761 78704 73842 94109 117575 161577
12869A61577k019m8760p674k2281J7013P3729k5686L365j721o6236L7590l2123
$$ 161577 159558 110798 103124 80843 97856 171585 145899 149264 147543 81307 118897 86774
12857H6774j2638L6220m6918K0376Q8341K3946p5634m3858M179J6851J5931m1619
$$ 86774 74136 110356 63438 83814 172155 196101 120467 76609 80788 97639 113570 71951
12845G1951L6818K5916m2851P410R840J2337L3454L1640K0760j8193o1282P9288
$$ 71951 108769 134685 91834 99244 109084 121421 154875 186515 207275 189082 127800 207088
12833B07088R6609O6962k1579k432K2401l2926m5832R0799N5088N8161K8572k3599
$$ 207088 303697 370659 349080 346648 369049 336123 290291 381090 436178 494339 522911 499312
12821D99312O526N8291O2455K7948N1627K4805M2034J06321P6069K7246Q0954
$$ 499312 505838 564129 626584 654532 706159 730964 772998 879319 955388 982634 1063588
12810A063588M6124L9283O5339J51626J57300J03433J60224K68612L33491L58270
$$ 1063588 1109712 1148995 1214334 1365960 1523260 1626693 1786917 2055529 2389020 2747290
12800B747290M01538N56443O88736R23321J191175J509403J919788K180967K284862
$$ 2747290 3148828 3705271 4394007 5317328 6508503 8017906 9937694 12118661 14403523
12791A4403523K167310J796713J455742Q39481K64615j97409p39955j162351j404631
$$ 14403523 16570833 18367546 19823288 20662769 20927384 20729975 19990020 18827669 17423038
12782A7423038j512290j619185j647851j385003j143746p98250n23290j42463
$$ 17423038 15910748 14291563 12643712 11258709 10114963 9316713 8793423 8650960
12774H650960J70335M42500O80076J034104J450181J975757K653461L421457M169788
$$ 8650960 8821295 9263795 9943871 10977975 12428156 14403913 17057374 20478831 24648619
12765B4648619M794411M966529M577886L568476K181135P27376p67940k176257
$$ 24648619 29443030 34409559 38987445 42555921 44737056 45464432 44696492 42520235
12757D2520235l088626l607972l779280l690951l602743l363523k945294k519963
$$ 42520235 39431609 35823637 32044357 28353406 24750663 21387140 18441846 15921883
12749A5921883k064535j524919j059915o62226l17888K6954L30691O87559J087700
$$ 15921883 13857348 12332429 11272514 10610288 10292400 10319354 10650045 11337604 12425304
12740A2425304J369684J636270J786275J742133J563989J291417R06759M59849
$$ 12425304 13794988 15431258 17217533 18959666 20523655 21815072 22721831 23181680
12732B3181680J59912j47827m94038p74307j006227j209569j114183r13374n91907
$$ 23181680 23341592 23193765 22699727 21925420 20919193 19709624 18595441 17682067 17090160
12723A7090160j20423M23579Q73922J322112J588355J657859J584666J308472
$$ 17090160 16969737 17393316 18267238 19589350 21177705 22835564 24420230 25728702
12715B5728702J176978Q63095M60590j08137o60983j139028j595125j919155k121922
$$ 25728702 26905680 27768775 28229365 28121228 27460245 26321217 24726092 22806937 20685015
12706B0685015k187802k031805j726503j244745p05255l46830O6479N27994R82564
$$ 20685015 18497213 16465408 14738905 13494160 12788905 12442075 12508554 13036548 14019112
12697A4019112J474596K049976K745421L450070L994522M367525M612905M724765
$$ 14019112 15493708 17543684 20289105 23739175 27733697 32101222 36714127 41438892
12689D1438892M840345M579533L881618K448672O54680j288377l167837m723682
$$ 41438892 46279237 50858770 54740388 57189060 57843740 56555363 53387526 48663844
12681D8663844n814025o138285n704650m953379l937790l156684k433700j742161
$$ 48663844 42849819 36711534 31006884 26053505 22115715 18959031 16525331 14783170
12673A4783170j183167p98273m71100j65857K68642P18518J152355J538313J918800
$$ 14783170 13600003 12801730 12330630 12164773 12433415 13151933 14304288 15842601 17761401
12664A7761401K165122K095313J931621J633611J278367Q83335K84439l93891
$$ 17761401 19926523 22021836 23953457 25587068 26865435 27748770 28033209 27639318
12656B7639318j147240j801422k388082k869752l016860k832043k338688j925573
$$ 27639318 26492078 24690656 22302574 19432822 16415962 13583919 11245231 9319658
12648I319658j474680j134678q96057o62076n30954m63893m27883l71446l43256
$$ 9319658 7844978 6710300 5814243 5152167 4621213 4157320 3729437 3357991 3014735
12639C014735j49449j74489k22639k07311j57270j66125j48003n5383k5386j48699
$$ 3014735 2865286 2690797 2468158 2260847 2103577 1937452 1789449 1734066 1708680 1559981
12629A559981j03840k6584l4929n1763q1148o1119p9936p5306o8872j2273p6681
$$ 1559981 1456141 1429557 1394628 1342865 1261717 1200598 1120662 1045356 976484 964211 887530
12618H87530q6452J6397M8732k1870p1307o6776r219j844j3871q0978n0504K501
$$ 887530 801078 817475 866207 844337 773030 706254 697035 695191 681320 600342 549838 552339
12606E52339J9072K4893k6942o9020m7592N2740J3220n150o743M1443K1900m599
$$ 552339 571411 596304 569362 500342 452750 505490 518710 513560 506817 548260 570160 565561
12594E65561J0362p7635n3564n5466N169M3570M3957j6530J0714Q0344L8889k90
$$ 565561 575923 498288 444724 389258 394427 437997 481954 465424 476138 556482 595371 595081
12582E95081k4322j6784l5711k7184k8745L9875K8828J9300N1612R791Q45N981
$$ 595081 570759 553975 518264 491080 462335 502210 531038 550338 601950 611741 612586 618567
12570F18567K11q009L5098O3519J6428Q60L6628p7689o9873j3574n1148p7812
$$ 618567 618778 610769 645867 709386 725814 726674 763302 685613 615740 602166 551018 473206
12558D73206K656o754l788J2975j1154o4194q1315n9090n51J8252K3912J3698
$$ 473206 475862 469108 465320 478295 467141 402947 321632 262542 261991 280243 304155 317853
12546C17853l0244n8538L890J8319j5221K5370L4354M4585o702j5259Q655k8358
$$ 317853 287609 229071 232961 251280 236059 261429 295783 340368 333666 318407 327062 298704
12534B98704o9038l0046l377n041n6662M2637J1071O354K2159J7806m7501j5351
$$ 298704 229666 199620 196243 191202 134540 177177 188248 194602 216761 234567 187066 171715
12522A71715j9226o7030M0681M8499N2695j0651o5739K421K2536L2236l5620K1379
$$ 171715 152489 85459 126140 174639 227334 216683 150944 153365 175901 208137 172517 193896
12510A93896O4822J9926k5790q069M5373j9688J6420j5057r192N0209N0489k6215
$$ 193896 258718 278644 252854 244785 290158 270470 286890 271833 262641 312850 363339 337124
12498C37124o902N626L306k2245q5342q181k0596L801J8546o3315n2685K2631
$$ 337124 330222 335848 339154 316909 231567 223386 202790 206591 225137 161822 109137 131768
12486A31768j0126k3400J3583q549J1062J2369k3780j8506m7581K1275O88K7147
$$ 131768 121642 98242 111825 103276 114338 126707 102927 84421 36840 58115 58803 85950
12474H5950L208J8359o3572K3727O5044L647m0372r569Q004J6988J3622m0438
$$ 85950 89158 107517 43945 67672 132716 136363 95991 86422 94426 111414 125036 84598
12462H4598j1901M4116J4639j7035l8425L2828M7459J6546L1171L3878j1253l2209
$$ 84598 72697 116813 131452 114417 75992 108820 156279 172825 203996 237874 226621 194412
12450A94412r47n0430p849l9001l852j3114j05l5998l6078K0163k7319L4822J865
$$ 194412 193465 143035 135186 96185 92333 79219 79114 43116 7038 27201 -118 34704 36569
12437C6569O7965P8790L5718k8781p2470l69K8983J1054p3998L5327O0762o9680
$$ 36569 104534 183324 219042 190261 117791 117422 146405 157459 83461 118788 179550 109870
12425A09870n0660j4659N11l5035k350O8081O7450M372k5975j1993j7766j2286
$$ 109870 59210 44551 45062 10027 7677 75758 143208 147580 121605 109612 91846 79560
12413G9560k410J5709l0902R993J831k779m104m8358J3784J15217N508l2210j9817
$$ 79560 77150 92859 61957 71950 73781 71002 66898 18540 32324 147541 153049 120839 101022
12400A01022K0828K1564k7833P645N0097K30m1166r3422m1479L3564K3925J29239
$$ 101022 121850 143414 115581 123226 173323 173553 132387 38965 -2514 31050 54975 184214
12388A84214j1402l5342m2780l6567K0204K3656O4956J7415m2063o8410L0036
$$ 184214 172812 137470 94690 58123 78327 101983 166939 184354 142291 73881 103917
12377A03917m462J4442r386l1392K2933M9229P132j5838j4500k093n4933n4737
$$ 103917 99455 113897 104511 73119 96052 145281 152413 136575 122075 119982 65049 10312
12365A0312l7153M8768l2677P0123N3972K1086j4221n7310l8840J03537m279m3851
$$ 10312 -26841 21927 -10750 59373 113345 134431 120210 62900 24060 127597 123318 79467
12353G9467K0742K4956m8142m7297m2265P7511K326L9308k776k9119k1245j2947
$$ 79467 100209 125165 77023 29726 -12539 64972 67298 106606 103830 74711 53466 40519
12341D0519O2006j2301K9030K6829o234m7877j0046O8625L2115j9135L6412N0848
$$ 40519 102525 90224 119254 146083 139849 91972 81926 150551 182666 163531 199943 250791
12329B50791K0353P197K0278M9180k8938o4623m0045K6450k1802j7386o02o917
$$ 250791 271144 278341 298619 347799 318861 254238 214193 240643 218841 201455 200853 193936
12317A93936n2239j5127l382n461M9501O7752k4021p5241M33K9661j7616K7482
$$ 193936 141697 126570 123188 117727 167228 234980 210959 135718 136151 165812 148196 175678
12305A75678O4308J0986L6940L642J639n871j8803m4937J0221L6933K1512k9255
$$ 175678 239986 250972 287912 291554 293193 287322 268519 223582 233803 270736 292248 262993
12293B62993p8469N738L8239k4202m0879L1215K9480k40m1688o4472K0388K7341
$$ 262993 184524 190262 228501 204299 163420 194635 224115 223875 182187 117715 138103 165444
12281A65444k2952N8720O587j842k1966r158L5124k8149o6750K8768J13216K0183
$$ 165444 142492 201212 207799 205957 183991 174833 209957 181808 115058 143826 257042 277225
12269B77225K0897P6561n942q87L7720j7351q520q453l9292j9777L988m9884N214
$$ 277225 298122 374683 368741 367854 405574 388223 379703 371250 331958 312181 316169 266285 271499
12256B71499Q2165L3309J1859l0033J5390M7772m8827m7954l4585L8348Q5313
$$ 271499 353664 386973 398832 368799 384189 431961 383134 335180 300595 338943 424256
12245D24256M9745O1310J8878r407K0594O417P28l244P0394K8642j9086K4303
$$ 424256 474001 535311 554189 544782 565376 571793 572521 569277 639671 668313 649227 673530
12233F73530N3818P0669M7690J28676J13397R1018J11764R1456M0780J16080J39076
$$ 673530 727348 798017 845707 974383 1087780 1178798 1290562 1382018 1422798 1538878 1677954
12222A677954J57090J77569K31029L24593L75814L93532N71995O05615P29261
$$ 1677954 1835044 2012613 2243642 2568235 2944049 3337581 3909576 4515191 5244452
12213E244452Q75668J051923J378472J765462K350604L205616M193605M862548
$$ 5244452 6120120 7172043 8550515 10315977 12666581 15872197 20065802 24928350
12205B4928350M971761M029211J955736p34121k971409l991488m077958l472032
$$ 24928350 29900111 33929322 35885058 35150937 32179528 28188040 24110082 20638050
12197B0638050k591659j705450q46172q4547P53711J516576K513719L445647M175963
$$ 20638050 18046391 16340941 15494769 15410222 16163933 17680509 20194228 23639875 27815838
12188B7815838M480593L787889J941061n91826k942320m239500m491616m065014
$$ 27815838 32296431 36084320 38025381 37433555 34491235 30251735 25760119 21695105
12180B1695105l512329l132928k647836k058005j478909j181907r33400p27596
$$ 21695105 18182776 15049848 12402012 10344007 8865098 7683191 6749791 6022195
12172F022195n78643m55977m33088l37244k50194k57872j38374j08261j44084
$$ 6022195 5443552 4987575 4554487 4217243 3967049 3709177 3570803 3462542 3318458
12163C318458l5042p583L6569P6407J58174K51313K80200L27299M28426M77772
$$ 3318458 3283416 3275833 3312402 3388809 3546983 3798296 4078496 4405795 4834221 5311993
12153E311993N88749Q70759R49108J205995J573048K061128K824166L753364M746564
$$ 5311993 5900742 6771501 7720609 8926604 10499652 12560780 15384946 19138310 23884874
12144B3884874N398192N137974L615211J377451l57432j363948j757379j898932
$$ 23884874 29283066 34421040 38036251 39413702 39056270 37692322 35934943 34036011
12136C4036011j655303j002728J05508J524694L069867M082892M307289L596606
$$ 34036011 32380708 31377980 31483488 33008182 36078049 40160941 44468230 48064836
12128D8064836K314684J391799J254431J067054J1903k104273m198383n224833
$$ 48064836 50379520 51771319 53025750 54092804 54104707 52000434 47802051 42577218
12120D2577218m906341l735382k195042p14500K52433O88720P90339O03956K07539
$$ 42577218 37670877 33935495 31740453 31025953 31278386 31967106 32757445 33361401 33568940
12111C3568940p32108k188220l602951m340167m115361l365245k620411j927486
$$ 33568940 32836832 30648612 27045661 22705494 18590133 15224888 12604477 10676991
12103A0676991j434083j080968r23513p93357n71089n69197m92454m06177l33776
$$ 10676991 9242908 8161940 7238427 6445070 5873981 5304784 4812330 4406153 4072377
12094D072377k55222k24070j93187j92752j02876m7306M374k4500O456R4857J45091
$$ 4072377 3817155 3593085 3399898 3207146 3104270 3056964 3061338 3036838 3043294 3138151 3283242
12083C283242J78755K94088K97266L50438N01545N97595P52024R88444J468555
$$ 3283242 3461997 3756085 4053351 4403789 4905334 5502929 6254953 7243397 8711952
12074H711952J883810K358168K797822L229144L579701L596131L062319J755258
$$ 8711952 10595762 12953930 15751752 18980896 22560597 26156728 29219047 30974305
12066C0974305m08229k426537l527111l573214l118797k412223j654729r93915
$$ 30974305 30566076 28139539 24612428 21039214 17920417 15508194 13853465 12859550
12058A2859550l17206M16597J216243K008935K731150L321774L624927L113086
$$ 12859550 12542344 12958941 14175184 16184119 18915269 22237043 25861970 28975056
12050B8975056J774154l75472k502477l914385m253455l792983l139842k467469
$$ 28975056 30749210 30373738 27871261 23956876 19703421 15910438 12770596 10303127
12042A0303127j882186j373866r34482p02050o13319n81076n29164m13532l97144
$$ 10303127 8420941 7047075 6112593 5410543 4797224 4216148 3686984 3273452 2876308
12033B876308l24610k57128k09869k32830j62757j67725n8118l8810j00583j11355
$$ 2876308 2551698 2294570 2084701 1851871 1689114 1521389 1463271 1424461 1323878 1212523
12023A212523o9278r4479n2965m6572J2700Q532n640k2776o3185m1276p476m84
$$ 1212523 1143245 1048766 995801 949229 961929 970461 964821 942045 878860 837584 830108 829624
12011H29624m1657j00337M0393N9793N1853n69q5403n4614J346o3642m2364k7434
$$ 829624 787967 687630 728023 787816 839669 839100 753697 699083 700429 636787 594423 566989
11999E66989j0470j7903J5774L2873O8865P2368l772j5863m0649j3408j3494n6720
$$ 566989 556519 538616 554390 587263 656128 728496 724724 708861 668212 654804 641310 584590
11987E84590n7297k1438J8160J4598K671M5210K2852K4524K3191M6555J4778M0904
$$ 584590 527293 505855 524015 538613 541284 586494 609346 633870 657061 703616 718394 759298
11975G59298O851m5673o5929m1818n386J02244O4892J713j9300K1847N4071O0843
$$ 759298 766149 720476 654547 612729 607343 709587 774479 776192 756892 778739 832810 893653
11963H93653k933M1857P5667j8285Q915J02809Q7157P8667P3462N0522P6353J06103
$$ 893653 890720 932577 1008244 989959 998874 1101683 1188840 1267507 1340969 1391491 1467844 1573947
11951A573947R8422R6892J43370J61804K47355K05097K12041K23989J60951K50104
$$ 1573947 1672369 1769261 1912631 2074435 2321790 2526887 2738928 2962917 3123868 3373972
11941C373972K62200L38055M28961M94521O88059Q51337Q92668R94581J257570
$$ 3373972 3636172 3974227 4403188 4897709 5585768 6437105 7329773 8324354 9581924
11932I581924J673233K168116K763280L620243N034814P195403J0816186J6997258
$$ 9581924 11255157 13423273 16186553 19806796 24841610 32037013 42853199 59850457
11924E9850457K7559893M4529670O7725138Q7767109P8690474J0272639o8638788
$$ 59850457 87410350 131940020 199665158 287432267 366122741 376395380 307756592
11917C07756592r5804820p4280643m5018656k6567959j6561272j0901227p571957
$$ 307756592 211951772 137671129 92652473 66084514 49523242 38622015 31050058
11910C1050058n402445m070285l114657k427222k096277j782770j461410j216220
$$ 31050058 25647613 21577328 18462671 16035449 13939172 12156402 10694992 9478772
11902I478772j046288q87662o71576o56799n57170m39324m41394m24968l27812
$$ 9478772 8432484 7544822 6873246 6216447 5659277 5219953 4778559 4353591 4025779
11893D025779k75993k42139j21369j98019j84999j94305j16169n0555m9854j50119
$$ 4025779 3749786 3507647 3386278 3188259 3003260 2808955 2692786 2642231 2592377 2442258
11883B442258j49761j05949n1557r2062j06160r0507j50167j00271m4826o9181
$$ 2442258 2292497 2186548 2134991 2042929 1936769 1846262 1696095 1595824 1550998 1481817
11873A481817j4894p0719n0696j06186r8633n5935J284L2334L5337k3215m9598
$$ 1481817 1466923 1396204 1345508 1239322 1140689 1084754 1086038 1118372 1153709 1130494 1080896
11862A080896r0087r8690q4826l9650J2169O921l6772l8019j5648l81K4950k9460
$$ 1080896 990809 892119 807293 767643 779812 786733 749961 711942 696294 695913 720863 691403
11850F91403l1621N0845l5500j0476P1169o889j0929o0083p326K0559o228k8517
$$ 691403 659782 710627 675127 664651 735820 728931 718002 657919 650593 671152 664924 636407
11838F36407m789J9279O2357M4072m5954l8130J1723M3686J3645k0672n0330j1815
$$ 636407 631618 650897 713254 757326 711372 673242 684965 728651 742296 721624 671294 659479
11826F59479M7801l781q3623l7350J9736J9122J3952l8223l1394o4363n5560k6310
$$ 659479 707280 703499 619876 582526 602262 621384 635336 597113 565719 501356 445796 419486
11814D19486K1080n1034l8424J3609K1490j7854o810R4670O574p25k6431K1421
$$ 419486 440566 389532 351108 364717 386207 368353 361543 456213 462787 462062 435631 457052
11802D57052J4873J1088N4595M1510O720N4014p2439j86745j85426p3050q0214
$$ 457052 471925 483013 537608 579118 585838 639852 567413 380668 195242 122192 41978
11791D1978L4197J25155N5375l1054o0953J2081l4722Q022L0412K3865M7867L0728
$$ 41978 76175 201330 256705 225651 164698 176779 142057 150079 180491 204356 252223 282951
11779B82951p3109m9336M25L2222Q4079L6598l3421N0520R0513l5787j31827q2657
$$ 282951 209842 160506 160931 193153 277232 313830 280409 330929 421442 385655 253828 171171
11767A71171J487Q6866q066K926K4754o317N674o85K3437k6972m0545P0692P4663
$$ 171171 172658 259524 251458 254384 279138 272821 278495 277810 301247 274275 233730 304422 379085
11754C79085M3199L4401q3651j02631k3521r758M4601M0208l2959L618K3733q620
$$ 379085 422284 456685 373034 270403 246882 237124 281725 321933 288974 292592 316325 307705
11742C07705K9175O674j2974K141k2876N693L4786K3116N9399L5069l9942q3373
$$ 307705 336880 343554 330580 332721 309845 315538 350324 373440 432839 467908 427966 344593
11730C44593m1801k112J4270k5074n6207q3048M3778O6283r116P288l5151L1557
$$ 344593 302792 300680 314950 289876 233669 150621 194399 260682 251566 258854 223703 255260
11718B55260L1165Q743m932k6323k0341j939m0215J86R445P910O809j3391l5824
$$ 255260 286425 295168 290236 263913 243572 241633 201418 201604 211049 218959 225768 212377 176553
11705A76553K1110k0343m2290K7117N1655L0972L0972J9849k2360q7872k5571
$$ 176553 197663 177320 135030 162147 213802 244774 275746 295595 273235 185363 159792
11694A59792L5701N1461L3033J2076l775o81j2002O6821N107k4978J0822J9676
$$ 159792 195493 246954 279987 292063 288288 287607 275605 342426 347533 322555 333377 353053
11682C53053j024O3159j3722l7496l8472N1872N8487p15m6292p203K8582r9512
$$ 353053 352029 415188 401466 363970 325498 377370 435857 435142 388850 381647 410229 310717
11670C10717j14144L5062M433k297K8575k4034K2591j6345J3860K3900j15061
$$ 310717 196573 231635 236068 233771 262346 238312 260903 244558 258418 282318 167257
11659A67257r4602j7460K2426J9635q734M5652J3527p815q9845l124j046L0172
$$ 167257 72655 55195 77621 97256 88522 134174 147701 139886 50041 46917 45871 76043
11647G6043J7086P307k5130l3725p636j0996k8618J1962k6175L0237M6864M5568
$$ 76043 93129 100436 75306 41581 33945 22949 -5669 6293 -19882 10355 57219 102787
11635A02787K284n0172l4018M7134o862j8063J3710K8667J3911n621K1358R755
$$ 102787 105071 54899 20881 68015 61153 43090 56800 85467 99378 93757 115115 124870
11623A24870N6303L4459J25782N6846l927l9853k4522J1563k6466r6877m6161
$$ 124870 181173 215632 341414 398260 394333 354480 329958 341521 315055 218178 172017
11612A72017m3306j28256p6810L808M5873O3083J01688j4343l2125O8158M5555
$$ 172017 128711 455 -76355 -72547 -26674 36409 138097 123754 91629 159787 205342
11601B05342k4068L2335n105j1471J4828l0872l5954J9937j1163m7015l4639k9156
$$ 205342 181274 213609 208504 197033 211861 180989 145035 164972 153809 106794 72155 42999
11589D2999n3154J3487J3070Q1471k706q9927k6415N2257N7368P2805k5081o7091
$$ 42999 -10155 3332 16402 97873 95167 5240 -21175 31082 88450 161255 136174 69083
11577F9083n0424J465l8089L733O1217J2300p7255k1235J6476K0931J7680m5544
$$ 69083 18659 20124 -17965 -14232 46985 59285 -17970 -39205 -22729 -1798 15882 -29662
11565b9662K3807j923J9397K8076K0078P333q2847n0970j9104O4229k820N952
$$ -29662 -5855 -7778 11619 39695 59773 67106 -15741 -66711 -85815 -21586 -24406 -18454
11553a8454M3423Q0267Q163m5092P888J7935J0956P939l6722k7876k3218M6596
$$ -18454 24969 105236 113399 68307 76195 94130 105086 113025 76303 48427 25209 71805
11541G1805l4485m1656J8858m2441l9296N2633P7451k442o5922O7568o423m7936
$$ 71805 37320 -4336 14522 -27919 -67215 -14582 62869 60427 -5495 62073 55650 7714
11529G714L6807K6872m7910k7498k001P239O2964O0587K8346p593L9473m0763
$$ 7714 44521 71393 23483 -4015 -6016 1223 64187 124774 153120 145527 185000 144237
11517A44237m1771J8816J8560K0861J2362m6618o352q37K5742k332j3874n2489
$$ 144237 102466 121282 139842 160703 173065 126447 120095 119258 145000 142668 128794 76305
11505G6305k4336L7195P9269j8077j4527k6730q9859k9008M2003P2l1776n1483
$$ 76305 51969 89164 168433 150356 135829 109099 19240 -9768 32235 32307 531 -50952
11493e0952L5146o802Q582J4364M8228N4956j3155q335Q728J3277q849n0121Q302
$$ -50952 -15806 -22608 -14026 338 48566 103522 90367 82032 90760 104037 95188 45067 53369
11480E3369K6450r452q600Q1403j8738m0455l0468p9156j8664K4844N1517k6813
$$ 53369 79819 70367 61767 143170 124432 83977 53509 -25647 -44311 -19467 32050 5237
11468E237K3672M1724N5384L1937k7323o1109K5648L5096m0273q4351J4348M7396
$$ 5237 28909 70633 126017 157954 130631 69522 95170 130266 89993 5642 19990 67386
11456F7386L7441M933m7430m6637m9137L7918J9187R270N0943j5447o9032L6090
$$ 67386 104827 109760 62330 15693 -33444 4474 23661 32931 83874 68427 -605 35485
11444C5485N293j7326l083O9837l0789m2473j8917J4607l9222m2942K8000M2183
$$ 35485 40778 23452 20369 90206 59417 16944 -1973 12634 -26588 -69530 -41530 653
11432F53M3591M1087j6990n5226k3813k1654n2484P293K2512L5461R339N991M5414
$$ 653 44244 85331 68341 13115 -10698 -32352 -84836 -77543 -55031 -19570 -10231 -4240 41174
11419D1174N2360o9463M888k6487k3720K8584K1563L767o140o7617m7119N5024
$$ 41174 93534 24071 28959 2472 -21248 7336 28899 32666 26526 -41091 -88210 -33186
11407c3186M0133M2043M209l0572k6531j108o34R600m0425l3823K013M0215N1543
$$ -33186 6947 48990 53199 22627 -3904 -5012 -5646 3954 -36471 -70294 -68281 -28066 23477
11394B3477K746J4503L4935L0268k8223l5620j8360L1554M0850q4978k7252N1891
$$ 23477 26223 40726 75661 105929 77706 42086 23726 55280 96130 11152 -16100 35791
11382C5791n19J5715j675o955k7127k7420M4674r143o2442m7979k0849P3734M4384
$$ 35791 35272 50987 49312 42357 15230 -12190 32484 23341 -39101 -87080 -107929 -34195 10189
11369A0189L5791j6610M3710l4155M420k8104N097P853m401K8854k0742o2404
$$ 10189 45980 29370 73080 38925 43345 15241 20338 28191 23790 52644 31902 -30502
11357c0502l2902J8439O1278J5181J1390P3789L659k6807l4853J91K4485K7468
$$ -30502 -63404 -44965 16313 31494 42884 116673 120332 93525 58672 58863 83348 110816
11345A10816m5055m3159K3293k6426n1080k193N0987l20J5636J6121n3505k043
$$ 110816 65761 22602 45895 19469 -31611 -33804 17183 16863 32499 48620 -4885 -6928
11333f928K4202N582O105m9632o8715l4087N5448M9486Q333j6607j5705N0615
$$ -6928 17274 22856 28961 -20671 -89386 -123473 -68025 -18539 -10206 -26813 -42518 8097
11321H097N5366j2192k7626k9573m3199P123k6519J4017Q4656M1266M156k7340
$$ 8097 63463 51271 23645 -5928 -49127 -42004 -68523 -54506 30150 71416 75572 48232
11309D8232j6568J2156j6465k422L0590R54J3714K5587k6047n3553l5327r138
$$ 48232 31664 43820 27355 24933 55523 56477 70191 95778 69731 16178 -19149 -28287
11297b8287n523L5238m443k7449M2487K0370K8892k0831k024O0722K2780j2814
$$ -28287 -33810 1428 -3015 -30464 12023 32393 61285 40454 38430 99152 121932 109118
11285A09118k6665m7523L2334P065j1459n0680l8387O1713R8688M696l2162j9834
$$ 109118 82453 34930 67264 74329 62870 12190 -26197 35516 134204 138900 106738 86904
11273H6904n3713L7436J2241r168l6389n2780N1332j2441l9882K1370p2979J766
$$ 86904 33191 70627 82868 73700 37311 -15469 35863 23422 -16460 4910 -68069 -66303
11261f6303j2049m700M6329m624L2330J5662p5640l9063J0314P1020J1230m3758
$$ -66303 -78352 -83052 -36723 -41347 -9017 6645 -68995 -108058 -97744 -26724 -15494 -59252
11249e9252J4848N6275n0103n4061l7643J6292N7128Q3542l360k4264J5984M1063
$$ -59252 -44404 11871 -38232 -92293 -129936 -113644 -56516 27026 23666 -598 15386 56449
11237E6449q284k5852J1324k0754K0465o9511J2799K2425j7318L2066N2031k7444
$$ 56449 48165 22313 33637 12883 33348 -36163 -23364 -939 -18257 13809 65840 38396
11225C8396l7824K7158N1908o4294J4874Q9960P045o2276r766L1315n9865l8848
$$ 38396 572 27730 79638 15344 30218 120178 127223 64947 55181 86496 26631 -12217
11213a2217k9206P526M8259p342k7118Q4861L6618k3329K3040q352J3045m5256
$$ -12217 -41423 -33897 14362 7020 -20098 64763 101381 78052 101092 92740 105785 60529
11201F0529o0403l4761m4791L4622K5476K3081M0940j4943K192m3648k3113J9383
$$ 60529 126 -34635 -79426 -44804 -19328 3753 44693 29750 31942 -11706 -34819 -15436
11189a5436M216k8041K6239K9708L0340J9479R729k0048n8923O524O4138L282
$$ -15436 -11220 -39261 -13022 16686 47026 66505 76234 56186 -2737 3787 67925 71207
11177G1207j9585N8215J4418n9259Q003L19o5106K0576J624l5768p6769m0521
$$ 71207 51622 109837 124255 64996 72999 73318 8212 28788 30412 -5356 -82125 -122646
11165a22646K3211O8611j6613k8370K2234O3314M6797J4767L4707n02l531Q571
$$ -122646 -99435 -30824 -47437 -75807 -53573 9741 56538 71305 106012 105510 101979 110550
11153A10550j7562r6805r2119l9001K1844k9355K4440R4302L7908M1378j1392
$$ 110550 92988 -3817 -95936 -134937 -113093 -142448 -118008 -23706 14202 55580 44188
11142D4188m8275j3119j0285k9048K1947J2058K2653k374o533K1056m2955r710
$$ 44188 -4087 -17206 -27491 -56539 -34592 -22534 119 -2255 -8788 12268 -30687 -40397
11130d0397K7748O4851l3475N132K0345n287k2808M389n4954o6751k086r136K5570
$$ -40397 -12649 52202 18727 23859 44204 38917 16109 20498 -34456 -101207 -103293 -112429 -86859
11117h6859Q119m2164l6114P4582M3375M9045O9801o5704k5628Q8209j7177m9962
$$ -86859 -78740 -120904 -157018 -82436 -39061 9984 79785 14081 -11547 76662 59485 9523
11105I523j1267K7390l0727n1525K1185O3844N2089n5292k8410O3380k4220k6919
$$ 9523 -1744 25646 -5081 -56606 -35421 28423 80512 25220 -3190 60190 35970 9051
11093I051j8370q774n333l2012K8585N9512l2973l5658J5266M6747K3099k8941
$$ 9051 -9319 -18093 -23426 -55438 -26853 32659 -314 -35972 -20706 26041 49140 20199
11081B0199L6753L711n2475J9884L7455P9184l8139n0707m9499l2584m1819k7672
$$ 20199 56952 60663 8188 28072 65527 144711 106572 55865 6366 -26218 -68037 -95709
11069i5709L386m985l5667l2010q413N0304M730l678O5928L3663m9834k9975K8702
$$ -95709 -92323 -97308 -132975 -164985 -173398 -123094 -118364 -122042 -56114 -22451 -72285 -102260 -73558
11056g3558P1071O7645p1312K709N1555Q920m9874L088k0013R0668R5119R0586
$$ -73558 -2487 65158 -6154 -3445 48110 57030 7156 10244 -9769 80899 176018 266604
11044B66604M2452m2565m0780L1411O591p5642m8857K3654J12208J01148L3969
$$ 266604 309056 266491 225711 257122 263713 188071 139214 162868 275076 376224 410193
11033D10193N061l6826K711k4185p0280j7092j7568L0753Q9166N5689R7622P4881
$$ 410193 415254 378428 381139 356954 286674 269582 252014 282767 371933 427622 525244 600125
11021F00125N7847K7231o6921j16873j20519l9658k1654r687K5963R1448L0879
$$ 600125 657972 685203 618282 501409 380890 341232 319578 309891 335854 427302 458181
11010D58181O1915P8368q6541j40989j56631p9206P4857j3880q1135j2473N8075
$$ 458181 520096 598464 511923 370934 214303 135097 209954 196074 114939 102466 160541
10999A60541N5677p34k4454j369l0789o8863k1046m1107n0960K5131q466j9107
$$ 160541 216218 215484 191030 189661 158872 90009 68963 27856 -23104 2027 -6439 -25546
10987b5546L9983J812M6326j2867j03448q3762J2297Q0828R3762M9642J6113n3146
$$ -25546 14437 16249 62575 49708 -53740 -137502 -125205 -44377 49385 99027 115140 61994
10975F1994n330J4565K464m6436j0628L4017j0672m3947j4095J0394p646n022
$$ 61994 56664 71229 73693 27257 16629 50646 39974 -3973 -18068 -7674 -15320 -20342
10963b0342K3339J1222m9582k1463J884R4963J17868M4687q0089n4829l2868n779
$$ -20342 2997 14219 -35363 -56826 -54942 40021 157889 202576 122487 67658 34790 29011
10951B9011M118k2909N4950L5886m7005m3101m3120O5650P0066L7761m4751k8425
$$ 29011 33129 10220 65170 101056 54051 10950 -32170 33480 103546 141307 96556 68131
10939F8131J5414L447k6239l5008m4065j6312K63K0677J7631k3141p7771K8432
$$ 68131 83545 86992 60753 25745 -18320 -34632 -34369 -13692 3939 -19202 -96973 -68541
10927f8541Q6273P013J640J4210L2215k4761k6794q732N358k910j0192j3287k4987
$$ -68541 17732 24745 26385 40595 72810 48049 21255 12523 17881 14971 4779 -8508 -33495
10914c3495o2798l4304L0837J9090M9758R4918J6124l0332k8900j3749L796J0876
$$ -33495 -96293 -130597 -99760 -80670 -30912 64006 80130 49798 20898 7149 10945 21821
10902B1821j3461j1303K4344J995n4914l9235M1636M5151m9916q219L0462N2336
$$ 21821 8360 -2943 21401 23396 -31518 -70753 -29117 16034 -33882 -42101 -11639 40697
10890D0697K0157L758l5546M7605M5324m6777p9206J108J8890K307J6187j4749
$$ 40697 60854 64612 29066 76671 121995 75218 -3988 -2880 16010 18317 34504 19755
10878A9755k6070n5032J5722M7864o329k563M0202o2354p575N4063O1226L0473
$$ 19755 -6315 -61347 -45625 2239 -4090 -6653 33549 -28805 -36380 17683 78909 109382
10866A09382N4840j6789q0792r1070J2650K9663N3203J1265n6657l0713K5391
$$ 109382 164222 147433 66641 -24429 -11779 17884 71087 82352 25695 -5018 20373
10855B0373k9786K0109M3298L7911p3n6512k5370j0600o12k0835k2387L4175J5839
$$ 20373 -9413 10696 53994 91905 91832 35320 9950 -650 -1262 -22097 -44484 -10309 5530
10842E530N1336M9869M7393k2970p3142j6346J5751m4271M129J5438J4683K0148
$$ 5530 56866 106735 154128 131158 58016 41670 57421 13150 17279 32717 47400 67548
10830F7548L0450j2698J3608j1861j04452m1108k7172R929m4091j648J05230k2093
$$ 67548 97998 85300 98908 87047 -17405 -58513 -85685 -75756 -119847 -121495 -16265 -38358
10818c8358k5402J9535m512K2191L009J4583k9322l5349k7890k6730k8382k5096
$$ -38358 -63760 -44225 -48737 -26546 -23537 -8954 -38276 -73625 -101515 -128245 -156627 -181723
10806a81723R5211J8080M172k0259o629J8034k1813J0971L3486L0316M6019O568
$$ -181723 -86512 -68432 -64260 -84519 -91148 -73114 -94927 -83956 -50470 -20154 25865 32433
10794C2433p3483q3275J8325k7631K26N2354P9334K7462r659J3311j008L5444
$$ 32433 -41050 -124325 -106000 -133631 -133405 -81051 -1717 25745 16086 29397 28389 63833
10782F3833o1977m8642O969J2091k9314L4019P3928k3221j7517j6211L9541K0782
$$ 63833 1856 -46786 -39817 -27726 -57040 -23021 50907 27686 10169 -6042 33499 54281
10770E4281K1496J5288n3745n3681p525j2705l6312J6735N5463J7075P528j662
$$ 54281 75777 91065 37320 -16361 -23886 -36591 -72903 -56168 -705 16370 23898 22236
10758B2236m0645l9200m908O0794k7278m7355K0396O8456O6580m4577R374K7714
$$ 22236 -18409 -57609 -62517 -1723 -29001 -76356 -55960 12496 79076 34499 43873 71587
10746G1587n0610q49L9756O6167J6701l7295m9208o142L0854M6138M038k9347
$$ 71587 20977 20128 59884 126051 142752 105457 56249 50107 80961 127099 131137 101790
10734A01790m406O7322N0143K317l8999j6235R922k1556n0484p8564m2976M1336
$$ 101790 97384 164706 214849 217166 178167 161932 171854 150298 99814 21250 -21726 19610
10722A9610K3626n3987j5236J1864M3326N9997O212m4686l5749q3228L014p831
$$ 19610 43236 -10751 -25987 -14123 29203 89200 95412 50726 14977 -68251 -65237 -73068
10710g3068J3589J04180O5184j628M050L4025P2757o9902j04832j6211j7884m8008
$$ -73068 -59479 44701 109885 108257 112307 146332 219089 149187 44355 28144 10260 -37748
10698c7748K0067k643m619m9322j454J11172P1508l7285J3448O521o588o9758
$$ -37748 -17681 -20324 -24943 -74265 -75719 35453 106961 69676 83124 89645 83057 13299
10686A3299n5220k1913K427J7562M6794l969J1248M5428L5398K6296k6061l5592
$$ 13299 -41921 -63834 -61407 -43845 2949 -1020 10228 55656 91054 117350 91289 55697
10674E5697J283j9241J8838k7573q6479l4397N3401J8606L6142O9638M7175K1558
$$ 55697 56980 37739 56577 29004 -57475 -91872 -38471 -19865 16277 85915 133090 154648
10662A54648j9318K597K9460L6789R969p0411Q830K02357J52859R2656M1550j4622
$$ 154648 135330 137927 167387 204176 214145 143734 152564 354921 507780 600436 641986 627364
10650F27364O1506J00118P1664K1306j39429j31026k5357L913k4607l22M4049
$$ 627364 688870 788988 860652 881958 742529 611503 586146 590059 565452 565130 609179
10639F09179Q1318J28969K6462N8345J76240K61491K71145K97685K88391J63883
$$ 609179 690497 819466 845928 904273 1080513 1342004 1613149 1910834 2199225 2363108
10629B363108J57157J63223J94887L47617M77168O79387R21111J248805J782881
$$ 2363108 2520265 2683488 2878375 3225992 3703160 4382547 5303658 6552463 8335344
10620H335344K435792L206387M190975N199022N788283N031738K855288J4992
$$ 8335344 10771136 13977523 18168498 23367520 29155803 34187541 37042829 37057821
10612C7057821j803690k027522j002366N55215K513671N029467P891982J0544681
$$ 37057821 35254131 33226609 32224243 32779458 35293129 40322596 48214578 58759259
10604E8759259J1707189R426434L261428l748641p688061p652169n069816j532426
$$ 58759259 70466448 79892882 83154310 79405669 71717608 64065439 58995623 57463197
10596E7463197K309480O364712J0594511J3950905J4537738J0045314J68889r899740
$$ 57463197 59772677 66137389 76731900 90682805 105220543 115265857 115434746 105535006
10588A05535006j4765912j3954093j0267599n946597j872518J843757N186788
$$ 105535006 90769094 76815001 66547402 60600805 58728287 60572044 65758832
10581F5758832P524750P435134L656304l083988r337408j1987675j0815062p817717
$$ 65758832 73283582 80718716 84375020 81291032 71953624 59965949 49150887 41333170
10573D1333170m849836k389593l78989J148251J993943J656051o9507k752321
$$ 41333170 36483334 34093741 33714752 34863003 36856946 38512997 38443490 35691169
10565C5691169n125830n947727n376058m205545l109391k282112j633570j335115
$$ 35691169 30565339 24617612 19241554 15036009 11926618 9644506 8010936 6675821
10557F675821r78816p42026n30125m42840l82509l58833l15865k92603k50051
$$ 6675821 5697005 4954979 4424854 3982014 3599505 3240672 2924807 2632204 2382153
10548B382153j54893k11429j84376j56173o7318q1776K4889j21104o8390j04428
$$ 2382153 2227260 2015831 1831455 1675282 1607964 1526188 1551077 1429973 1361583 1257155
10538A257155n9985k2998n4997r8319j11513n638k0136n5892J049J9264J2073
$$ 1257155 1197170 1174172 1119175 1020856 909343 903705 883569 827677 828726 847990 860063
10527H60063m305p9142M1902J3415l7916n3936n640Q209l4154l5391j2684O377
$$ 860063 855758 776616 818518 831933 794017 740081 734441 742650 708496 673105 660421 666798
10515F66798k4571J2498m097p6157p2367n1213n1247Q1741M8032m398p8979q686
$$ 666798 642227 654725 650628 574471 502104 450891 399644 481385 529417 525019 446040 437354
10503D37354L4568Q231k805J466J8958r384o4859K2159L1378m455p356p1827j5107
$$ 437354 471922 480153 477348 478814 497772 488388 423529 445688 477066 472611 465255 393428 378321
10490C78321M4372P081l0317K2150J2484L3434n6229k5311o565l8334m3816J0544
$$ 378321 422693 429774 399457 421607 434091 467525 411296 385985 379420 341086 297270 307814
10478C07814k3786l8820l1569l8569M5723j7397N0998J3819N2704M3120q8613
$$ 307814 284028 245208 213639 175070 220793 203396 254394 268213 320917 364037 275424
10467B75424o5282L4601k3329k0254l9722M0802N0524N319K6775J0935M482l9700
$$ 275424 210142 244743 221414 201160 161438 202240 252764 258083 284858 295793 300275 260575
10455B60575j6079m5444r4775m3594P0889J02294J0090q2127M95M3631l4864r8149
$$ 260575 244496 199052 104277 60683 131572 233866 243956 161829 162324 205955 171091 72942
10443G2942o4740J3160L2487r792N5386N824J4523M9279O876l0446k7848k0797
$$ 72942 8202 21362 53849 44057 99443 105267 119790 169069 175945 145499 117651 96854
10431I6854r939K2234O763j6895o1928j8882K2200K9162K1677J3625J3710N0613
$$ 96854 86915 109149 115912 99017 37089 18207 40407 69569 91246 104871 118581 169194
10419A69194M2374m0691r520M2798k1918m1957J4807K544j9407m7040k2667j0468
$$ 169194 211568 170877 161357 204155 182237 140280 155087 157631 138224 91184 68517 58049
10407E8049J1992J3313J7567j7296R8286P7678n6010j2997m0072m0533L8104m8412
$$ 58049 70041 83354 100921 83625 181911 259589 203579 190582 150510 109977 148081 99669
10395I9669o263Q3734M946n1517m2491L9705M9517J2987K8814l8709m6501M4106
$$ 99669 93406 177140 182086 130569 88078 127783 177300 190287 219101 180392 133891 177997
10383A77997J7937R596o2521j3985J60k2208l9349L3410J0492J70L9268M6013
$$ 177997 195934 205530 143009 129024 129184 106976 67627 101037 111529 111699 150967 196980
10371A96980o108M879k3189m8211o2458L552p521K3368m0268j5837m8725L042
$$ 196980 190872 195751 172562 124351 61893 65445 57924 81292 41024 25187 -23538 -20496
10359b0496M5354K4390M7664N2879l5377o0467j4623K0854k5425K3863L4455J4048
$$ -20496 24858 49248 96912 149791 114414 53947 39324 60178 34753 58616 93071 107119
10347A07119j8617n221r961j1947R615J2521r686P76k4470L8572l5763k6900k2498
$$ 107119 88502 83281 73320 61373 70988 83509 73823 74599 50129 88701 52938 26038 3540
10334C540J0745J4828Q644k8684k7669J0462L8697O7445N757m1473l9428j7876
$$ 3540 14285 29113 37757 9073 -18596 -8134 30563 98008 103765 62292 22864 4988
10322D988J866l9024K8759P7348O1861M0416n6516J6798L1594L5832j2287q4512
$$ 4988 6854 -32170 -3411 73937 135798 176214 119698 136496 168090 203922 191635 107123
10310A07123q267J698L9681j4060K645L5951L445j04770k0977P0159l5800Q547
$$ 107123 98856 100554 140235 126175 128820 164771 168216 63446 42469 112628 76828 85375
10298H5375K2638J0517L4857m2473p9499n6911O3209L1901L2033m217L8629l6079
$$ 85375 108013 118530 153387 110914 31415 -25496 37713 69614 101647 97430 136059 99980
10286I9980m9519l6030K9800J3270L0647n8436k5794L03N8019K2246K7914j020
$$ 99980 50461 14431 44231 57501 88148 29712 3918 4221 62240 84486 112400 111380
10274A11380m8917o2978n4054K6354J00338o732j08241k9914Q4580M4991n0817
$$ 111380 62463 -515 -54569 -28215 72123 65391 -42850 -72764 11816 56807 5990
10263E990j0745l1692L1776N8222L9085q47m5278k4268L4825L7036R863l1169
$$ 5990 -4755 -36447 -4671 53551 92636 91789 46511 22243 57068 94104 103967 72798
10251G2798k8283M2833K1988o2605k4589n663K1783J13180Q1222m3517l55L437
$$ 72798 44515 87348 109336 46731 22142 16479 38262 151442 232664 189147 188792 192229
10239A92229K0675n1664l4050J2158M8207j1315o3794ll0573L9343M2363K5915
$$ 192229 212904 161240 127190 139348 187555 176240 112446 112443 81870 121213 163576 189491
10227A89491l4477J4488j7761R1264j016m7807m1915j9319K9004k7562k8497n910
$$ 189491 155014 169502 151741 243005 241989 194182 152267 132948 161952 134390 105893 99983
10215I9983k3557L8876j3879m1038L2333J7734L9279M9001N1844p1495m817m6959
$$ 99983 76426 115302 101423 60385 92718 110452 149731 198732 250576 179081 174264 127305
10203A27305k6103Q687j0771j3592L7160n0729m5224O0039P5609k5817l2663k0911
$$ 127305 101202 109889 99118 85526 122686 71957 26733 86772 162381 136564 103901 82990
10191H2990M2116M2791J4421M4264r170o5301l5603K0971L6480L5928K1771j7100
$$ 82990 125106 167897 182318 226582 217412 152111 116508 137479 173959 209887 231658 214558
10179B14558O8077M7694K2466r692k6534m9132N911L4362Q5679M3466n253R4959
$$ 214558 282635 330329 352795 343103 316569 267437 273348 307710 393389 436855 431602 526561
10167E26561Q9360j6322o4365n3923K0157n7664j0509j1122N876K6305O7853R4040
$$ 526561 615921 599599 535234 481311 501468 443804 433295 422173 428049 454354 522207 616247
10155F16247J02729J36203J816j01074j33924q0491j08240m9464O002J5871K7961
$$ 616247 718976 855179 856995 755921 621997 541506 433266 383802 389804 405675 433636
10144D33636O5381O0480J06581K4885j02145r8165p6940M282O363l140P145L0682
$$ 433636 499017 559497 666078 690963 588818 490653 413713 417995 424358 421218 428363 459045
10132D59045J3400k2757L2425l9370p8720n5090p5966M165o329k5473l909M2020
$$ 459045 472445 449688 482113 442743 364023 308933 232967 237132 230803 205330 201421 243441
10120B43441Q764n2788j569P3940k0758J8044J238j0501m3466k333n3526j8399
$$ 243441 252205 199417 197848 271788 251030 269074 270312 259811 216345 214012 160486 142087
10108A42087J6734l739L3287k9287o7934K5115M3852R296l0101N9186l1142o7213
$$ 142087 158821 155082 188369 159082 91148 116263 160115 169411 139310 198496 167354 100141
10096A00141k2953p55n508k5422K611k7767N548r950m538M7145N9183l2063o2789
$$ 100141 77188 76433 70925 45503 48114 20347 25895 15945 11407 58552 117735 85672 22883
10083B2883L2879P9056J8269p758l7128o5792j2795J6305j6142k4159m4089K2725
$$ 22883 55762 134818 153087 145329 108201 42409 29614 45919 29777 5618 -38471 -15746
10071a5746K872J11O2304j8699P789P103l771m4829p1492o0713K7126j2247k8468
$$ -15746 -12874 -12763 49541 30842 38631 45734 41963 -2866 -74358 -135071 -107945 -120192 -148660
10058a48660P7358N1175K4956J4830M657l2903j718R3119K4961j0027j9810k8525
$$ -148660 -71302 -20127 4829 19659 24316 -8587 -10305 82814 107775 97748 77938 49413
10046D9413L3144O7003k7530p4909J8619N8058l1062n9408l6897K7497l9257M3688
$$ 49413 82557 149560 122030 47121 65740 123798 92736 33328 -3569 23928 -15329 28359
10034B8359K3076j5518l129j08942n6617K7548L6975K979J6370P5572O9952K0494
$$ 28359 51435 35917 32788 -76154 -132771 -105223 -68248 -65269 -48899 26673 96625 117119
10022A17119j0160K4422k0664L0109p882p9950n3325O9060N1340k9520m6222N0348
$$ 117119 106959 131381 110717 140826 132944 52994 -331 68729 120069 90549 44327 94675
10010I4675K9926m0120M8922L7345o7131n2813l8170n0496j6518M2547M7080J3159
$$ 94675 124601 84481 133403 170748 103617 50804 12634 -37862 -54380 -11833 35247 48406
9998D8406K6790J5310Q694j934k8141j28215M9072k5716K114O3186q013J1305
$$ 48406 75196 90506 99200 97266 69125 -59090 -10018 -35734 -33620 29566 21553 32858
9986C2858J6801m1787L8255J6950m4182N72r173L8548R759N445K359k3453m0102
$$ 32858 49659 7872 46127 63077 18895 19467 10294 48842 58601 64046 66405 42952 2850
9973B850j41947j0784L2398N6026L5969L875L6243M8717J0336m4152L1789L4656
$$ 2850 -139097 -149881 -117483 -61457 -25488 -21613 14630 63347 73683 29531 61320 95976
9961I5976L5785j5142l2499j4878J7884j5787k6144l5556K9303M8242l4023l8200
$$ 95976 131761 116619 84120 69242 87126 71339 45195 9639 38942 87184 53161 14961
9949A4961n7993J9035N4879J1303p173K9148J4960j5188J5168N1474l2657J7200
$$ 14961 -43032 -23997 30882 42185 35012 64160 79120 63932 79100 130574 97917 115117
9937A15117k0176k6579K7104j0680j2697J7765N9229J1776k9914j508m643R111
$$ 115117 94941 68362 95466 84786 72089 89854 149083 160859 130945 129437 124794 133905
9925A33905n3975j6712l766L1314k0734k3883N7153P5267L8232j17002q0372J7008
$$ 133905 79930 63218 59452 90766 70032 46149 103302 178569 216801 99799 19427 36435
9913C6435N856j6208o8933P869o161O6424N2642M0462j4049J8747O1811K982n420
$$ 36435 42291 26083 -42850 -34981 -41142 25282 77924 118386 104337 123084 184895 187877 182457
9900A82457j1057l7594M7630M3331l015m4974j0764K8808P726J7623K2433L1350
$$ 182457 171400 133806 181436 224767 221752 176778 166014 194822 202548 220171 242604 273954
9888B73954n6634k8095N2264J5286p7395n7987N2416P0648J2685j4582O2978L1037
$$ 273954 217320 189225 241489 256775 179380 121393 173809 244457 257142 242560 305538 336575
9876C36575r478k5231L1303L5905P7753L6675Q316R0252O7231r933k3722l8296
$$ 336575 327097 301866 333169 369074 446827 483502 491818 582070 649301 639368 615646 577350
9864E77350J08815J42402R4084J49384J68504K02710K64468L25558L75164M50163
$$ 577350 686165 828567 922651 1072035 1240539 1443249 1707717 2033275 2408439 2858602
9854B858602N89003O96352Q12621Q09606P12628N75189L23493K54570K48965K24153
$$ 2858602 3447605 4143957 4956578 5766184 6478812 7054001 7377494 7632064 7881029 8105182
9844H105182K79665M43228N00467N89221O14707L95348N4865p3709j33288k3404
$$ 8105182 8384847 8828075 9328542 9917763 10532470 10927818 10982683 10908974 10775686 10752282
9834A0752282K59627N47854O52321O65184O35013N58402N83427P34207J035684
$$ 10752282 11011909 11559763 12212084 12877268 13512281 14070683 14654110 15388317 16424001
9825A6424001J436600J773261K003579J838987J154119L10818m94057r63822r93724
$$ 16424001 17860601 19633862 21637441 23476428 24630547 24941365 24447308 23483486 22489762
9816B2489762o68970k93071m8819j0302j5680m2694j62370k40868j89963j7477
$$ 22489762 21820792 21527721 21478902 21468600 21452920 21410226 21247856 21006988 20817025 20799548
9806B0799548L04140M71495L96808J90059l0527l16298k76378m641M41424Q89643
$$ 20799548 21103688 21575183 21971991 22162050 22131523 21815225 21538847 21534206 21975630 22865273
9796B2865273J213090J064125N14365k26382r39604j500115j642832j605563j485843
$$ 22865273 24078363 25142488 25656853 25430471 24490867 22990752 21347920 19742357 18256514
9787A8256514j292948j049550p72406m44297l03418l09967k73589j11625J15399
$$ 18256514 16963566 15914016 15141610 14697313 14393895 14083928 13810339 13698714 13814113
9778A3814113L15959L12197K23624J98132K31707L30594N74320Q24162P31900
$$ 13814113 14130072 14442269 14665893 14864025 15095732 15426326 16000646 16824808 17556708
9769A7556708M29428K30600M050J5192N1480N2937o7013l15478l23574j09071
$$ 17556708 17986136 18216736 18220786 18235978 18287458 18340395 18273382 17957904 17634330 17525259
9759A7525259J87269J06284l9017k17056k67346k20261j33381J25549L66299L98248
$$ 17525259 17712528 17818812 17779795 17562739 17295393 17075132 16941751 17067300 17433599 17831847
9749A7831847M48426N85116R62811J376069J742291K087270K218781K124653J831569
$$ 17831847 18280273 18865389 19828200 21204269 22946560 25033830 27252611 29377264 31208833
9740C1208833J380120O32435l60490j128655j432146j274098o67860L3046M19869
$$ 31208833 32588953 33221388 32860898 31732243 30300097 29025999 28358139 28391185 28811054
9731B8811054M25980K54140q6764m41229n73933m46756k35803l0752J38664R4098
$$ 28811054 29237034 29491174 29404410 28963181 28389248 27942492 27706689 27675937 27814601 27908699
9721B7908699L70l7937m0952J89386N18156Q49661J254649J331952Q98653j8778
$$ 27908699 27909069 27871132 27830180 28019566 28537722 29387383 30642032 31973984 32872637 32853859
9711C2853859j219792k216517k610822k489972k040138j390361r88245p24574
$$ 32853859 31634067 29417550 26806728 24316756 22276618 20886257 19898012 19173438
9703A9173438n81985n69937p61173r06689p66530m62559k11861j6315J7452j45505
$$ 19173438 18591453 18021516 17260343 16353654 15587124 15124565 14912704 14896389 14913841 14768336
9693A4768336m25861o88845q22852p23196n42028l93432k38321j75035k49330
$$ 14768336 14342475 13653630 12830778 12107582 11565554 11172122 10933801 10758766 10509436
9684A0509436m97253o61316q87311j035354r66341q83655p97556p48225m88653
$$ 10509436 10012183 9350867 8463556 7428202 6461861 5578206 4780650 4032425 3543772
9675C543772m26908m43753k90238k14263j78527j67017q6136r1947j16014q7507
$$ 3543772 3116864 2673111 2382873 2168610 1990083 1823066 1736930 1644983 1528969 1441462
9665A441462j57185r3189n3036p8606o9618p0927p2524l1940p3510N5478O3101
$$ 1441462 1284277 1191088 1138052 1059446 989828 918901 846377 814437 740927 796405 859506
9654H59506Q852m1351m4922n8639l4958r129l0594r2027K6114L1015m1725N164
$$ 859506 868358 827007 782085 723446 688488 679359 648765 556738 582852 613867 572142 577306
9642E77306l2410m1146J4925M7799P6474q172M6152Q8747J6394r8223p3399j7364
$$ 577306 544896 503750 518675 566474 642948 634776 680928 769675 786069 687846 614447 597083
9630E97083K2307m4221l9691J6249j2533l6295J2868J346J698P1627k4828n5117
$$ 597083 619390 575169 535478 551727 539194 502899 515767 517113 518811 590438 565610 510493
9618E10493j8973k8528j6917l3179m821J123N7084M2812j7381J4423O2792L8072
$$ 510493 491520 462992 446075 412896 408075 409198 466282 509094 491713 506136 568928 607000
9606F07000q2922j8237J2555n6826j9751J7672n6104r344J9207k7335l8800J3587
$$ 607000 524078 505841 518396 461570 441819 459491 403387 394043 413250 385915 347115 360702
9594C60702M2410l9211N829n6345p3469N4588M309M2661K8981n7195m2777P573
$$ 360702 403112 363901 369730 313385 239916 294504 298813 341474 370455 313260 270483 278056
9582B78056o1499j7800j9232n382Q0083K4213L6344j2425K3266J8091j67j2583
$$ 278056 216557 198757 179525 174143 254226 278439 314783 302358 325624 343715 343548 330965
9570C30965m1782p3564n6071M4179Q0877m81n1869n0646J4273l957j6535N1775
$$ 330965 289183 215619 159548 203727 284604 284123 232254 181608 195881 191924 175389 227164
9558B27164M4724j044o940k526M993J3852M3835J10865K0257k078j6459k953j9801
$$ 227164 271888 270844 263904 261378 266371 280223 324058 434923 455180 453102 436643 433690 413889
9545D13889k8546m8037j0187J368j8501m444l9614L4176m561L0562n3060o0522
$$ 413889 385343 337306 327119 328487 309986 305542 265928 300104 295543 326105 273045 212523
9533B12523j3982l0111K1118O4327K9394N4920j3110o8391r6433K5552J9493m8318
$$ 212523 198541 168430 189548 253875 283269 338189 325079 256688 160255 185807 205300 156982
9521A56982n2809P4474L8442k8830m2602o1564j6222K1448L2692K8026l796k1549
$$ 156982 104173 178647 217089 188259 145657 84093 67871 89319 122011 150037 146241 124692
9509A24692L0509n4549n450K9696R572r960m5403j0578O4105J4188k7698N490
$$ 124692 155201 100652 95202 124898 134470 124510 79107 68529 132634 146822 119124 124614
9497A24614J9204l5157J1207R0500K5583o6557m5987m5897J6750j5616l0143K112
$$ 124614 143818 108661 119868 210368 235951 169394 123407 77510 94260 78644 48501 50613
9485E0613m282M783l7648O7429J2123k1523R2482J6354n2144J0382N413l324J8840
$$ 50613 46331 51114 13466 80895 93018 71495 163977 180331 128187 138569 143982 140658 159498
9472A59498J382l0320O538K3698P99l9005k1004M630R421O1092j6529j06136r9234
$$ 159498 160880 130560 137098 160796 161595 122590 101586 106216 115637 176729 160200 54064 -45170
9459d5170O2867Q9720P763J0118o5115J1111N9858K1117m9163m7024q911O224
$$ -45170 17697 107417 115180 125298 60183 71294 131152 152269 103106 56082 47171 53395
9447E3395L8739j055L7898L3273k7603L5653J7803m0701l2732P593M1879N564
$$ 53395 92134 91079 128977 162250 134647 170300 188103 147402 114670 122263 164142 169706
9435A69706N008j6415K3181K7942m7110J8180K1169n7263n5794j2296N8508Q973
$$ 169706 174714 158299 181480 209422 162312 180492 201661 144398 88604 76308 134816 143789
9423A43789m5826L6919J9132P9555K284o5891l5200L7327L1647P7258k5084o8947
$$ 143789 97963 134882 154014 233569 235853 169962 134762 172089 203736 280994 255910 186963
9411A86963p970P1516L0899m1488n4460n580M5426k6250j056K1366Q963L8437
$$ 186963 178993 250509 281408 239920 185460 179880 225306 199056 198000 219366 228329 266766
9399B66766O4458J8906l0458r694Q893j6962l4153q03j2752l1328N2758J5654
$$ 266766 331224 350130 319672 309978 318871 301909 267756 266953 254201 222873 275631 291285
9387B91285m8011k2934k1362l1349J6069K0522n861M0543L4085j6831q300k188
$$ 291285 243274 220340 198978 167629 183698 204220 198359 238902 272987 256156 247856 245668
9375B45668j4510L2526J3387j906j203k0389L060J2463J02O5204K439j8824k7837
$$ 245668 231158 263684 277071 275165 273962 253573 256633 269096 269198 334402 336841 318017 290180
9362B90180p6115k700M2851J3619L2499K7279k2484j8956n6774r510M8335K0455
$$ 290180 214065 211365 254216 267835 300334 327613 305129 286173 229399 219889 268224 288679
9350B88679K8529K1545j3693q702n380m4888j7234j7314L6278K7529j8908r361
$$ 288679 317208 338753 325060 316358 310978 266090 248856 231542 267820 295349 276441 267080
9338B67080m6000L5697M2777K7103l646m858K6432k0518k150L0145M0439J2147
$$ 267080 221080 256777 299554 326657 323011 318153 344585 324067 321917 352062 392501 404648
9326D04648o7224j5250M8398K7708N3432M0603K1178K7652n6775L13N2659N778
$$ 404648 337424 322174 370572 398280 451712 492315 513493 541145 484370 484683 537342 543120
9314E43120K6931L4208K3895N9913P7745L3606K7055N8088R1233P2975J38322
$$ 543120 570051 604259 628154 688067 765812 799418 826473 884561 975794 1048769 1187091
9303A187091K18336J99131J78541J55611K57750K97244M36889N31233O71501Q12084
$$ 1187091 1405427 1604558 1783099 1938710 2196460 2493704 2930593 3461826 4133327 4945411
9293D945411J069160J374395J658475K063512K397884K311983J661181N19428
$$ 4945411 6014571 7388966 9047441 11110953 13508837 15820820 17482001 18001429
9285A8001429p02314j685048k206966k172948j804364j440762j100243q91342
$$ 18001429 17299115 15614067 13407101 11234153 9429789 7989027 6888784 5997442
9277E997442o60733m96623l14754j80405q4109M0141J91846L56436N39415O67348
$$ 5997442 5336709 4840086 4525332 4344927 4260818 4300959 4492805 4849241 5388656 6056004
9267F056004Q60898J227216J573399J802713J917514J813049J446230Q07031j82538
$$ 6056004 6916902 8144118 9717517 11520230 13437744 15250793 16697023 17504054 17321516
9258A7321516j133317j603414j656952j526207j399901j191024j092766r71614
$$ 17321516 16188199 14584785 12927833 11401626 10001725 8810701 7717935 6746321
9250F746321p48030n88480n46314l86850j49443o4287l4200M3002J18908L04666
$$ 6746321 5998291 5409811 4863497 4476647 4327204 4262917 4228717 4271719 4390627 4695293
9240D695293M41375N37281O76130P85543J200536J421353J760020K253262K698618
$$ 4695293 5136668 5673949 6350079 7135622 8336158 9757511 11517531 13770793 16469411
9231A6469411L175900L498365L195541K437837J413143J76337r59803j765608
$$ 16469411 19645311 23143676 26339217 28777054 30190197 30366534 29406731 27641123
9223B7641123k257681k451082k568383k341852k010425j636036j199148q71889
$$ 27641123 25383442 22932360 20363977 18022125 16011700 14375664 13176516 12304627
9215A2304627m44560j1887M34289Q19442J160585J565237K153386K654473L200605
$$ 12304627 11860067 11848180 12282469 13101911 14262496 15827733 17981119 20635592 23836197
9206B3836197L585446L702277L449788K809025J676538L14194r87388j977931
$$ 23836197 27421643 31123920 34573708 37382733 39059271 39373465 38386077 36408146
9198C6408146k610510k996299l225544l175371l077601k670809k162443j821359
$$ 36408146 33797636 30801337 27575793 24400422 21322821 18652012 16489569 14668210
9190A4668210j433153j074406p96238m19182j64149K01645N67343Q69136J042971
$$ 14668210 13235057 12160651 11364413 10945231 10781082 10982727 11550070 12419206 13462177
9181A3462177J084587J073615R24089O25238J24093l20421o68715p18319m75187
$$ 13462177 14546764 15620379 16544468 17169706 17293799 16973378 16304663 15586344 15111157
9172A5111157J660N50686J061195J254440J042187N56114q9540p57797j175330
$$ 15111157 15112817 15663503 16724698 17979138 19021325 19577439 19487899 18730102 17554772
9163A7554772j453154j534064j396210j137446r33244n51279k12516O2499M24608
$$ 17554772 16101618 14567554 13171344 12033898 11100654 10549375 10336859 10399358 10823966
9154A0823966P66703J041500J361352J813350K214994K537952K777851K828992
$$ 10823966 11590669 12632169 13993521 15806871 18021865 20559817 23337668 26166660
9146B6166660K805399K538762K098774J442503L80499q23949j926681k687802
$$ 26166660 28972059 31510821 33609595 35052098 35432597 34608648 32681967 29994165
9138B9994165l089565l263792l077133k658708k104265j660841j368190j019565
$$ 29994165 26904600 23640808 20563675 17904967 15800702 14139861 12771671 11752106
9130A1752106o87286l49270K8798M06386P69256J182491J519216J780279J908343
$$ 11752106 11064820 10715550 10744348 11150734 11919990 13102481 14621697 16401976 18310319
9121A8310319J874972J670650J367070O66785k83376j204853j930481k466265
$$ 18310319 20185291 21855941 23223011 23889796 23606420 22401567 20471086 18004821
9113A8004821k644197k324904j968314j640836j353492j035512p63092p13586
$$ 18004821 15360624 13035720 11067406 9426570 8073078 7037566 6274474 5560888
9105E560888o37183m91934l05513j63335j34509j48781m9031M7272Q8410J03973
$$ 5560888 4923705 4431771 4126258 3962923 3828414 3679633 3630602 3677874 3766284 3870257
9095C870257K43720L86018N86090P14781P97166R00857J014500J169281J223544
$$ 3870257 4113977 4499995 5086085 5800866 6598032 7498889 8513389 9682670 10906214
9086A0906214J230097R39428K25279n57356j156417j367068j386809j258542j140528
$$ 10906214 12136311 13075739 13301018 12743662 11587245 10220177 8833368 7574826 6434298
9077F434298r27253p63058n82690l88427k34465j83141j12925N6469J27701K13317
$$ 6434298 5507045 4743987 4161297 3772870 3538405 3355264 3242339 3298808 3426509 3639826
9067C639826L50187M60648N62409P64755J039391J368840J574562J504727J180357
$$ 3639826 3990013 4450661 5013070 5777825 6817216 8186056 9760618 11265345 12445702
9058A2445702N28170k73840j162125j667968j645640j445581j122118r30826p75416
$$ 12445702 12973872 12700032 11537907 9869939 8224299 6778718 5656600 4725774 3950358
9049C950358o09700m68323m04528k56761k29608k29351j54054j57217j24069n9925
$$ 3950358 3340658 2872335 2467807 2211046 1981438 1752087 1598033 1440816 1316747 1256822
9039A256822o8888j54683q1516n5610p903n3806o2192P683o1759o6087o2538J5968
$$ 1256822 1187934 1033251 951735 896125 888222 834416 772224 779907 718148 652061 589523 605491
9027F05491L1026N135n2921l0908j2247L7727K2374p5810q8500o7175m5788K4531
$$ 605491 636517 641652 588731 557823 545576 583303 605677 529867 441367 374192 328404 352935
9015C52935M249k7727L3981P6286M3339l8562p4819k3244j3877n51P3114j8791
$$ 352935 357184 329457 363438 439724 483063 444501 369682 346438 332561 332010 405124 386333
9003C86333o9562l1998M6670L2650O2571R997n8308m5508J7393j7998J354j9288
$$ 386333 316771 284773 331443 364093 426664 436661 378353 332845 350238 332240 333594 314306
8991C14306k1856m8598n806O4693L3995l9893l4027j03631m0823L8626P4291L9969
$$ 314306 292450 243852 238046 302739 336734 296841 262814 159183 118360 156986 231277 271246
8979B71246K6854k8274k5128N37p1387J6310l125M9855Q579l1469J3987j6072
$$ 271246 298100 269826 244698 245235 173848 190158 187033 236888 245467 213998 227985 211913
8967B11913j1405k9728M8605K5793j226P89m6005j3124J2791m52P938L7612m6086
$$ 211913 200508 170780 219385 245178 243952 244741 198736 185612 198403 197951 205889 243501 197415
8954A97415j013L8681k0733N2162N3160m233L7938o5048m7276J4716k7558K8548
$$ 197415 196402 235083 214350 266512 319672 315439 353377 288329 241053 255769 228211 256759
8942B56759K1636J7561r9278l8134L2580K5132j9901k2603j2663q201k1080j871
$$ 256759 278395 295956 196678 158544 191124 216256 196355 173752 161089 152888 131808 129937
8930A29937N4525J5412R94k6837j7065j3492j7509J2922K3528J2803n8795K8762
$$ 129937 184462 199874 200868 174031 156966 143474 125965 138887 162415 175218 116423 145185
8918A45185R020j8779j816j857J4737N6752L8738M498m7761M286m12l2105l9990
$$ 145185 154205 135426 133610 131753 146490 203242 241980 246478 198717 203003 202591 170486 130496
8905A30496n0933q506M7659Q6089k308n6264K3189J240o5607k9147L70M794O5930
$$ 130496 79563 71057 118716 204805 202497 146233 169422 170662 105055 75908 76278 81072 147002
8892A47002L7127P337j1065L1284k9209k7948J5837K169L4814n029j4031J6760
$$ 147002 184129 191466 180401 211685 182476 154528 170365 172534 207348 202319 188288 205048
8880B05048k3339o5226o829M9345p526Q691l0663J8935L0315J982k9731J2208
$$ 205048 181709 116483 109654 158999 151473 160164 129501 148436 178751 180733 151002 163210
8868A63210l0770J8830M2874m2284k8108L7291M4082N6651k5537O683K0652l1026
$$ 163210 132440 151270 194144 151860 123752 161043 205125 261776 236239 242922 263574 232548
8856B32548j8884r068J6373J5371L6808K6014j1505k8717M2284L352n370k1494
$$ 232548 213664 204596 220969 236340 273148 299162 287657 258940 301224 304576 299206 277712
8844B77712j7644n0542o1414L1660N0242n6161J0379L0748r93n4129m6008k978
$$ 277712 260068 209526 148112 179772 230014 173853 184232 214980 213987 159858 113850 110872
8832A10872L4157k1290l5881j9254R740O2058P0788K2853K349l9769J7361m576
$$ 110872 145029 123739 87858 68604 78344 140402 211190 234043 236392 196623 213984 209408
8820B09408l0351l2664N6311O4314N4338j0177j9624Q017j835j0863L6409K4314
$$ 209408 179057 146393 202704 267018 321356 311179 291555 299572 297737 286874 323283 347597
8808C47597m3391q0837m738P827p5583J7340Q108n8978J9856R5750J2963J0226
$$ 347597 304206 223369 218631 226458 150875 168215 176323 117345 137201 232951 245914 256140
8796B56140K4973K3897M894j1785K404O3473R4103R270m8806k4365j2081R09k3921
$$ 256140 281113 305010 309904 298119 300523 363996 458099 467369 418563 394198 382117 383026 359105
8783C59105K5243J191m7404m9577J9858r113o7008k9936K0055k9312m9137M1152
$$ 359105 384348 385539 338135 288558 308416 299303 232295 202359 222414 193102 143965 185117
8771A85117j1882o901l2859j7097L4174k0152j9044l461j5548L9505L8680O6903
$$ 185117 173235 166334 133475 116378 150552 130400 111356 107895 92347 131852 170532 237435
8759B37435L9401K3386Q535k94m1101J7221o1478q9410O3968L6570L348J5925
$$ 237435 276836 300222 308757 308463 267362 284583 223105 133695 197663 234233 237581 253506
8747B53506l5873L4047j4258q563j3142J9105l8637P766J4763n148J741j5274
$$ 253506 217633 251680 237422 228859 215717 234822 196185 203951 218714 213566 215307 200033
8735B00033M4696Q8741M9164l0321k161m8442l146J4234l4133k6087R884m8766
$$ 200033 244729 333470 382634 352313 350152 301710 298564 312798 278665 252578 262462 213696
8723B13696l6123n5873J3404J0645J1768m574k0392L36j1529j5132Q8053P6990
$$ 213696 177573 121700 135104 145749 157517 152943 132551 132887 121358 106226 194279 271269
8711B71269J2110K1667K0007K0801l5342l0846k3669m9166L3983K2622L2535J3824
$$ 271269 283379 305046 325053 345854 310512 279666 255997 206831 240814 263436 295971 309795
8699C09795q6226m569N229k7944M260q3320l1874q280m604L0194k6421j10593
$$ 309795 223569 219000 224229 196285 200545 117225 85351 77071 72467 102661 76240 -34353
8687c4353O2409M1098o704j302K9757N8857j82K530j3002K31l4425m1716M1738
$$ -34353 28056 69154 62450 61148 90905 149762 149580 152110 139108 139339 104914 63198 104936
8674A04936M5352r537r126J3897K3381k6088j9683j4537R439J8420o1545q4523
$$ 104936 150288 140751 131625 145522 168903 142815 123132 108595 118034 136454 74909 -9614
8662i614K2721j9515M1688N9430k2354p473M9511L1887m7404k4569K9638k6620
$$ -9614 13107 -6408 35280 94710 72356 64883 114394 146281 98877 74308 103946 77326
8650G7326L4093M5212L2036M2735n0021l886q617j8040j02054j6726J595O9483
$$ 77326 111419 156631 188667 231402 181381 177495 168878 150838 48784 32058 33653 103136
8638A03136o23o2779L0431K943k3035k2293L049P896o5645L1972J3664L6471O932
$$ 103136 102513 39734 70165 73108 50073 27780 30829 38725 -26920 5052 18716 55187 62119
8625F2119j9888R472j6979M0313j0669m7874K5859l1045K4803N7795Q861k6361
$$ 62119 42231 51703 34724 75037 64368 16494 42353 11308 36111 93906 102767 76406
8613G6406k3854N2967O2820j0449K4556J466k5748j4110k2547o4821k8865K3165
$$ 76406 52552 105519 168339 157890 182446 183912 158164 144054 121507 56686 27821 50986
8601E0986k2578L4687K1417j03798j400Q7110K9416p0859k4478K5254L2741k9620
$$ 50986 28408 63095 84512 -19286 -20686 66424 95840 24981 503 25757 58498 28878
8589B8878o4473L3972O7112M6588K924n9196k2586M7384l1677m5963N1887M6678
$$ 28878 -35595 -1623 65489 112077 115001 55805 33219 80603 48926 2963 54850 101528
8577A01528J4820r039k5833k1346j9692l310N3032j5825m319k767K8624J6537
$$ 101528 116348 107309 81476 60130 40438 37128 90160 74335 70016 67249 95873 112410
8565A12410m9905o6646M667m7290k659m305O14L1393r79K2071R725k1694q7616
$$ 112410 62505 -4141 526 -46764 -49423 -53728 -53114 -21721 -22700 -629 9096 -12598 -100214
8552a00214m8954J2198P0230O9314L9636m2489N470K2379N6987Q982r5772M7605
$$ -100214 -149168 -136970 -66740 2574 42210 -279 5191 27570 84557 93539 -2233 45372
8540D5372O004j1064o4r702j6583J754K9742P1021J6412M7526p761m366n6823
$$ 45372 51376 40312 40248 30546 13963 15717 45459 116480 132892 180418 172657 168291 111468
8527A11468m0981l5912p5584J2758O3724l444k2475o052j8958l9936J1309q415
$$ 111468 70487 34575 -41009 -28251 35473 32029 9554 3502 -15456 -55392 -44083 -52498
8515e2498m013N8285J6456k573p624m1468n328j7796N536M373O7621N8953n3283
$$ -52498 -56511 1774 18230 15657 8033 -33435 -38763 -56559 -51023 -46650 20971 79924 26641
8502B6641k1458N4204M2789J0143j8784L1083k9173j8228k2385M3467M2991L3835
$$ 26641 5183 59387 102176 112319 93535 124618 95445 77217 54832 98299 141290 175125
8490A75125K5147l8379L1943Q1969R4832K3009j09353r7146l5574r0498j04163
$$ 175125 200272 161893 193836 275805 370637 393646 284293 187147 151573 61075 -43088
8479d3088l063M7753K1425K0459K3515j0152q775K7903j1286k2386n6374l7395
$$ -43088 -46151 1602 23027 43486 67001 56849 48074 75977 64691 42305 -14069 -51464
8467e1464N2471N1943k538k3898o4048J9113L3698k0328p534r397L120J2330M5521
$$ -51464 1007 52950 50412 26514 -37534 -18421 15277 -5051 -12585 -21982 -18862 -6532 38989
8454C8989L5341J6700m133k1385m5495l3187l8220l706M0519J09402M7570J941
$$ 38989 74330 91030 86897 65512 20017 -13170 -51390 -55096 -14577 94825 142395 144336
8442A44336P5441J6227P656p0983j13372K3648L1107M3298P824j249k8916o3008
$$ 144336 219777 236004 243660 172677 59305 82953 114060 157358 165182 163933 135017 72009
8430G2009q4651K9930N1124m1645k3308j8020l870l616j3727k3266K864n499O662
$$ 72009 -12642 17288 68412 26767 3459 -14561 -18431 -22047 -35774 -59040 -56176 -61675 -55013
8417e5013N6042J555N895j4700N0077P096l6486o1369j2478P165M5514q0128k3825
$$ -55013 1029 2584 8479 -6221 43856 50952 14466 -46903 -59381 -52216 -6702 -86830 -110655
8404a10655j789L2386M1715K7168M6160n8419M8351j6763l6211O7251k717N771
$$ -110655 -112444 -80058 -38343 -11175 34985 -23434 24917 8154 -28057 39194 36477 42248
8392D2248k0516j3835o2309l9536J6903K1193J23487M3866J4425O8153N1777k0857
$$ 42248 21732 7897 -54412 -93948 -77045 -55852 67635 111501 125926 194079 245856 224999
8380B24999n8201r3276m1748J9156l3206Q130k001l5684N864L145l3755m1424
$$ 224999 166798 73522 31774 50930 17724 25854 23853 -11831 -5967 -2822 -36577 -78001
8368g8001J6270J0474L8828P294k72J4701Q983m56l993l0143p330K5768o196n3229
$$ -78001 -61731 -51257 -12429 -5135 -5407 9294 18277 17821 13828 -16315 -23645 2123 -4073 -57302
8354e7302N4641n924j593L73L1571J7716k9552J3221L0603j697p3920p093L400
$$ -57302 -2661 -8585 -10178 -9805 21766 39482 9930 23151 53754 52057 -21863 -28956 -25556
8341b5556J8500L5418N4003l4898m8078J5339K3725R178L5127r574m0718k4180
$$ -25556 -7056 28362 82365 47467 -611 14728 38453 47631 82758 73184 32466 8286
8329H286l2352k6054P479J3667n0337Q983M2940J2883j5850K4011N810L5633n261
$$ 8286 -24066 -50120 -42641 -28974 -79311 -70328 -27388 -14505 -30355 -6344 -534 35099 29838
8316B9838o888j7438J5980J2231m7823k0436M3301J6709J4646n636j8473O5977
$$ 29838 22950 5512 21492 33723 -14100 -34536 8765 25474 40120 34484 16011 81988
8304H1988q324j01123l3248J1751M1000J0711q0201n827L5208N4800P7088j6261
$$ 81988 73664 -27459 -60707 -48956 -7956 2755 -77446 -83273 -48065 6735 83823 67562
8292F7562n9334l159M5343J522L0490m508k3731K446m2614P19l8907M8857K9826
$$ 67562 8228 5069 50412 51934 82424 77916 54185 56631 14017 14736 -24171 24686 54512
8279E4512M9984m5215k9622R752l9048K1857o331j709m8421l933q686n903r502
$$ 54512 104496 59281 29659 39411 363 22220 15889 14180 -34241 -38174 -46860 -52763 -62265
8266f2265Q480O0057K037K4259J5614n9257K1601l9238J4029L3930k7422l5177
$$ -62265 -53785 6272 8309 32568 48182 -11075 10526 -28712 -14683 19247 -8175 -43352
8254d3352k0360L8031O2896k9381J9683L7116Q233m7341O210r378L4042n0757
$$ -43352 -63712 -25681 37215 7834 27517 64633 72866 25525 31735 22357 56399 5642
8242E642k41J2962k3417l6296j7066j1568j1350J3432L2704L8065J9074K6985
$$ 5642 5401 18363 -5054 -41350 -58416 -69984 -81334 -67902 -35198 2867 21941 48926
8230D8926l2834J3846j9149l7408l758Q9813L6102K846L1102l6532m9656m1887
$$ 48926 16092 29938 10789 -26619 -30377 59436 95538 98384 129486 92954 43298 1411
8218A411M5703M3843k6425k8526n6365Q858L2093P7101Q05j1332j6496K1294K188
$$ 1411 47114 90957 64532 36006 -20359 -11501 20592 97693 98498 87166 70670 91964 94152
8205I4152j7229l9720m2633L11K0541L5014R675N057L319o930K1446m5590j7108
$$ 94152 76923 37203 -5430 -5119 15422 50436 60111 65168 68487 61557 83003 37413 20305
8192B0305k2696m252N130M1260L0100J2160O230J013k3930n5428K4652L308l5296
$$ 20305 -2391 -6643 -1513 39747 69847 82007 88237 89250 65320 9892 34544 37852 2556
8179B556n557l3819K4494K1092Q438L9535K091j0379O925M6355l1258l4805j2403
$$ 2556 -3001 -36820 -12326 8766 17204 56739 58830 48451 55376 101731 70473 35668 23265
8166B3265k7167Q484N346j6972J4135K4037j8298k2115j3199m5941l651M9218
$$ 23265 -3902 4582 9928 -7044 7091 31128 12830 -9285 -22484 -68425 -72076 -22858
8154b2858N4759p1706n3964j145O2922L5662L2026l5231K837q426m1K3209N1615
$$ -22858 31901 -39805 -93769 -94914 -31992 3670 35696 465 3302 -5124 -5165 18044 69659
8141F9659l1198m1036L3664L0948J157o3246o9621n979P7276K9291j2731N1672
$$ 69659 38461 -2575 31089 62037 63194 -52 -69673 -75652 1624 30915 18184 69856
8129F9856k6458j8902r520l1696k0728k9530l7126K3222O5674R2935j8733r303
$$ 69856 43398 24496 14976 -16720 -37448 -66978 -104104 -80882 -15208 77727 58994 49691
8117D9691R5643J7406q5481r2669J0625j1051K4071J5294K6126K8870l2770l7762
$$ 49691 145334 162740 77259 -15410 -4785 -15836 8235 23529 49655 78525 45755 7993
8105G993j7333m4335N796q155M589K1660j6235k0176L2875m9010J7213P1734O5284
$$ 7993 -9340 -53675 -47879 -56034 -51445 -29785 -46020 -66196 -33321 -82331 -65118 6616 71900
8092G1900l2765j1958R108J7647j075j9163K5002N1440M0093K4848m0815k5720
$$ 71900 39135 27177 36285 53932 52857 33694 58696 110136 150229 175077 134262 108542
8080A08542O744k7391k5615o7242L5151P4347k5230l5246l3774j418j0202P727
$$ 108542 115286 87895 62280 -4962 30189 104536 79306 44060 10286 8868 -1334 6393
8068F393O4797O1805m9949j9898J8499m1840n9419K503R501K2285m2895k687Q9320
$$ 6393 71190 132995 83046 63148 81647 39807 -19612 -17109 -7608 14677 -28218 -30905 58415
8055E8415j5356n8857J3509M3587r723n8582m3112K7831O7112Q573M3461n3018
$$ 58415 43059 -15798 -2289 41298 31575 -27007 -70119 -42288 24824 33397 76858 23840
8043B3840K7029N5480l3467k506m8568l8795m5751K5982O6276M9518J3420R650
$$ 23840 50869 106349 72882 70376 21808 -16987 -62738 -36756 29520 79038 92458 102108
8031A02108L7426l6242n9061K2860n2178j8611J7846J7885m696j1485K087K0525
$$ 102108 139534 103292 44231 67091 14913 -3698 14148 32033 27337 15852 17939 38464
8019C8464J1954j1201n5667j8169N7454M5644J2444k9250m983L1546J0032l3207
$$ 38464 50418 39217 -16450 -34619 22835 68479 80923 51673 46690 78236 88268 55061
8007E5061m3982l3254j6893m7042N610M6861J7356n9903O5238Q4658J1416k8743
$$ 55061 11079 -22175 -39068 -86110 -80500 -33639 -16283 -76186 -10948 73710 85126 56383
7995E6383m6378K1077J0224j394Q061m5308K6859M1840Q2062k2185m7779m4681
$$ 56383 10005 31082 41306 39912 47973 2665 29524 71364 153426 131241 83462 38781
7983C8781o9661n2940L0395J03783O5339m3293o0341k8093J6418j4703l2426K0353
$$ 38781 -30880 -83820 -53425 50358 115697 72404 12063 -16030 388 -14315 -46741 -26388
7971b6388m1038K6985J8817p141L1574K1039k627j6208k7703K9131J3276M7985
$$ -26388 -67426 -40441 -21624 -28765 2809 23848 21221 5013 -22690 6441 19717 67702
7959F7702K1022q490n7189j2686M0071l328K3805k0393J7623l8156L7901J4455
$$ 67702 88724 80234 23045 10359 50430 47102 70907 50514 68137 29981 67882 82337
7947H2337j5257r5142l9894J0892J6063r748P0140P2388J9617n6158l7526P372
$$ 82337 67080 -28062 -67956 -57064 -41001 -50749 19391 91779 111396 55238 17712 25084
7935B5084J3240j4865k9398j9235M6480L4166m0445m6315J0453j7719N1528J1398
$$ 25084 38324 23459 -5939 -25174 21306 55472 15027 -31288 -20835 -38554 12974 24372
7923B4372k1925L3867k2974r8183P485O1939l2021r450O3437O3629k8722k2013
$$ 24372 2447 36314 13340 -84843 -77358 -15419 -47440 -56890 6547 70176 41454 19441
7911A9441L7106L8382l025R821m947j2512o4837n2014k0287l214N2826L0155m0204
$$ 19441 56547 94929 91904 101725 96778 84266 19429 -32585 -52872 -56086 -3260 26895 -13309
7898a3309M0217N1749K695N2355Q0705p6919j32184j1215P401m1458j00890M5748
$$ -13309 26908 78657 81352 133707 214412 137493 5309 -5906 1495 -39963 -140853 -95105
7886i5105P9406J9871J7240L7888N790J4520N250m6695O6774j8986n0546m7504
$$ -95105 -15699 4172 21412 59300 65090 79610 84860 38165 104939 85953 35407 -12097
7874a2097K0176l917k1307L123J662k9304N1629J15061k2504j7002j0741n9705
$$ -12097 8079 4162 -17145 -14022 -12360 -41664 9965 125026 102522 85520 74779 15074
7862A5074m0687K9541P0942q925m7066N296P3251j0922m7608p0637J92k832k7011
$$ 15074 -25613 3928 74870 65945 18879 24175 97426 86504 38896 -31741 -31549 -34381 -61392
7849f1392k9665R9364M8960n0535o8994Q2024K5740m2659L0500J8851M591n1124
$$ -61392 -91057 8307 57267 6732 -62262 19762 45502 2843 33343 52194 56785 5661
7837E661J2183J5349M6966M265J1174l1515Q704J2934m9620m0414j2352J8670
$$ 5661 17844 33193 80159 84424 95598 64083 72787 85721 36101 -4313 -16665 2005
7825B005N102j1443K4311P4167J8622m5250j464o141l8441n2096n5092Q120r103
$$ 2005 7107 -4336 19975 94142 112764 67514 66050 59909 21468 -30628 -85720 -77600 -86703
7812h6703j6832Q5785N3042L1458n5256L187K0582k0845M7726J8674k6997M4928
$$ -86703 -103535 -17750 35292 66750 11494 14681 35263 14418 62144 80818 53821 98749
7800I8749J2095l8036j4368n1751l7809m8147J1503j9445M8259j2476m244R7504
$$ 98749 110844 72808 58440 6689 -31120 -79267 -67764 -87209 -38950 -51426 -55670 41834
7788D1834Q3j7543J0310m6279k568j126L6056M5414P120k8763o5372k598l7556
$$ 41834 41917 24374 34684 -11595 -14163 -15289 20767 66181 73301 44538 -20834 -23432 -60988
7775f0988L2990Q2468j6650p1492k6161L7699N0846k9908j5772M1142j6110L1385
$$ -60988 -27998 54470 37820 -33672 -59833 -22134 28712 -1196 -16968 24174 8064 39449
7763C9449m717o5452k9843k0038M3672Q8587L2214k8031k672K7342j1717l7119
$$ 39449 34732 -30720 -60563 -80601 -36929 51658 83872 55841 53169 80511 68794 31675
7751C1675L3474k7759l5832L124k2986N9879N7899L461p5586l2662P443J734N8662
$$ 31675 65149 37390 1558 4682 -18304 41575 99474 102935 27349 -5313 2130 3864 62526
7738F2526l4797j1843m37J6003K5861O8782j4801N64M968K852K2372j9963l4089
$$ 62526 27729 15886 15449 31452 57313 126095 111294 111858 116826 119678 142050 122087 87998
7725H7998l3432p765J7894K5369l4840p6183K8498p51N892k727O593L6066M1583
$$ 87998 54566 46801 64695 90064 55224 -20959 7539 6788 12680 9953 16546 52612 94195
7712I4195O094m9871o3487q874l481j8493K6536K4387J0227J5493m3280j4818
$$ 94195 100289 50418 -13069 -21943 -25424 -43917 -17381 7006 17233 32726 -10554 -25372
7700b5372L8284J0379R740J8232J2728j2335J5575J3710l0171m5979o610J9366
$$ -25372 12912 23291 33031 51263 63991 51656 67231 80941 50770 4791 -1819 17547
7688A7547j437n6420l5600O2037P3480j5170k1869k6914K0286k4306j6181O8004
$$ 17547 16110 -40310 -75910 -13873 59607 44437 22568 -4346 15940 -8366 -24547 43457
7676D3457K604l4k0686k0458K42J7649j5329m6257j4168L4398J01451J6221m2184
$$ 43457 46061 46027 25341 4883 5125 22774 7445 -38812 -52980 -18582 82869 99090 56906
7663E6906k3438J2309j3267n2497j2164N5485j2036q4509l0504N1131J08715N3590
$$ 56906 33468 45777 32510 -19987 -32151 23334 11298 -73211 -103715 -52584 56131 109721
7651A09721K4957p5961m4528L4862K6195n8002o2674N462N5520J4246j9918J8003
$$ 109721 134678 58717 14189 49051 75246 17244 -45430 -39968 15552 29798 9880 27883
7639B7883P5010k2616n5673m0872j7289l1488n012M4118M1636J6384K011O0287
$$ 27883 102893 80277 24604 -16268 -33557 -65045 -70057 -25939 15697 32081 34092 94379
7627I4379j3046o1946n2393m5391M380O3474N4563m52j0762M3758J9003L8373
$$ 94379 81333 19387 -33006 -78397 -74017 -10543 44020 43568 32806 76564 95567 133940
7615A33940K278q1793j01344J7575Q615M823j0107J2401j9992k7689p596k1696
$$ 133940 136218 54425 -46919 -29344 -20729 -15906 -26013 -13612 -33604 -61293 -68889 -90585
7603i0585j4419k5053N1960L9845L4738K0855q2237L735L7550J3154N0776K7449
$$ -90585 -105004 -130057 -78097 -38252 -3514 17341 -64896 -61161 -23611 -10457 40319 67768
7591F7768n557j378l7847K5662L0264p8366k6752j6404m9303j6941J310N0705
$$ 67768 62211 60833 22986 48648 78912 546 -26206 -42610 -91913 -108854 -107544 -56839
7579e6839M7555L6671N7107K2302m0267l22l0017m145N5203j6036l2962j4592
$$ -56839 -9284 27387 84494 106796 66529 66207 36190 32045 87248 71212 38250 23658
7567B3658j3983J6302M5871q544n2899m3687n9507J9541N0283R376k441J7298
$$ 23658 9675 25977 71848 63304 10405 -33282 -92789 -73248 -22965 -13589 -16030 1268
7555A268k9406N7339k7739q6418l2753P5551M1187n1962l4005k3556R8620M9059
$$ 1268 -28138 29201 1462 -84956 -117709 -42158 -971 -52933 -86938 -110494 -11874 37185
7543C7185K708J7598k6762k8967k0363N7899n0575j1969O5630K0391K0159J1315
$$ 37185 39893 57491 30729 1762 -18601 39298 -11277 -23246 42384 62775 82934 94249
7531I4249p812j2828k010m5370n5132j9251K2246M0024k3902j8070j3804O082
$$ 94249 86437 73609 71599 26229 -28903 -48154 -25908 14116 -9786 -27856 -41660 -35578
7519c5578K0064m0605J8975P0013R2517k3503q899k3984k4631l194j1282j804
$$ -35578 -15514 -56119 -37144 32869 125386 101883 92984 69000 44369 41175 29893 28089
7507B8089n7166m1724P6340L7896j049l5865k4471K5887L807k2140K7298n8117
$$ 28089 -29077 -70801 5539 43435 42386 6521 -17950 7937 11744 -10396 16902 -41215
7495d1215J7239L6799k8874o8950J4712J7452m08R207J5801j3099J1753K3494
$$ -41215 -23976 12823 -16051 -85001 -70289 -52837 -53245 -44038 -28237 -41336 -29583 -6089
7483f089J9764J5713n3952k4214L9178J5462n8235P451M638p081l3121j5009k6782
$$ -6089 13675 29388 -24564 -48778 -9600 5862 -52373 -44922 -40284 -47365 -80486 -95495 -122277
7470a22277P3812L5883M982l8041k744J400m5140k530l8463N4368P6275M4418
$$ -122277 -48465 -12582 -7600 -45641 -48385 -46985 -92125 -94655 -133118 -78750 -2475 41943
7458D1943r687j6638l6917J5371Q504l6581m1734N6018N3460j2497l77M6285p9981
$$ 41943 32256 15618 -21299 -5928 2576 -34005 -75739 -19721 33739 21242 20865 67150 -12831
7445a2831j0878K5490o679j4603L3825K2941K1578Q0835k1762o0340M4932p539
$$ -12831 -23709 1781 -4898 -19501 14324 37265 58843 139678 117916 57576 102508 94969
7433I4969k3592j357k5979k7266K5896K1220K4488k0916m5404k4109K7608r099
$$ 94969 71377 70020 44041 16775 42671 63891 88379 67463 22059 -2050 25558 16459
7421A6459l6140k6047n0354M8011K2830l7708K3959j632j7255o384J0914j5429
$$ 16459 -19681 -45728 -96082 -48071 -25241 -62949 -38990 -40622 -57877 -64261 -53347 -68776
7409f8776L7119l016j6758Q358O3025L9100L5294m3740p8544m5961Q517M9648
$$ -68776 -31657 -34673 -51431 -43073 19952 59052 94346 50606 -27938 -73899 -65382 -15734
7397a5734N8683k1135m3409j0205l8390j9578N3430j449L2481M607M133L0546
$$ -15734 42949 21814 -21595 -31800 -70190 -89768 -36338 -37787 -5306 -699 3434 33980
7385C3980l8960j7899L1241j9928P0759L3751q3j9218j2012j0431L3554O2719
$$ 33980 -4980 -22879 8362 -11566 59193 92944 92861 73643 61631 51200 84754 147473
7373A47473P73r7262l1967j6826n5382L5993L3498j8369m270O075M6220q124o0285
$$ 147473 148246 50984 19017 2191 -53191 -17198 16300 -2069 -6339 -264 45956 37832 -22453
7360b2453l3922L7350j5698k028M6710K4236J7606p1289n0433J4477K4717Q3010
$$ -22453 -56375 -19025 -34723 -36751 9959 34195 51801 -19488 -69921 -55444 -30727 52283
7348E2283Q420J2964J698M952l3284j6846J948q41p9644o0336J11769M2473m230
$$ 52283 60703 73667 75365 80317 47033 30187 32135 31294 -48350 -108686 3083 45556 41326
7335D1326n0207N852M174n190j426J7521o980n108m7762k2589N4315L8831O8029
$$ 41326 -8881 -3029 1145 -4045 -5471 12050 5070 -38 -47800 -70389 -16074 22757 90786
7322I0786l3791q5065l240K1888k2616k2009K4079O7050P0526j2501l5596j4589
$$ 90786 56995 -28070 -31310 -9422 -32038 -54047 -29968 37082 107608 95107 59511 44922
7310D4922k5831l8923M7445k48m7260j7636J03m1837P6661Q6967l7698O86M9547
$$ 44922 19091 -19832 27613 27365 -19895 -37531 -37428 -79265 -2604 84363 46665 47351 96898
7297I6898k7661k5748j5112o0274K0606p256J0698o2009J2851J9528K7871j9167
$$ 96898 69237 43489 28377 -31897 -11291 -18547 -7849 -69858 -57007 -37479 -9608 -28775
7285b8775K3594Q414l4953k4924m3023J1281K1072J2069M0583j3828n7277m0830
$$ -28775 -5181 3233 -31720 -56644 -99667 -88386 -67314 -55245 -14662 -28490 -85767 -126597
7273a26597K7626M1121K5619O8172M154q4543k0829L1439M1061N0968k4700n1497
$$ -126597 -98971 -57850 -32231 35941 40095 -44448 -65277 -33838 7223 58191 33491 -18006
7261a8006j8931k4191M8086J9664N012J3250j2138M1329p524j179J6107J244k3673
$$ -18006 -36937 -61128 -13042 6622 11634 24884 12746 54075 46551 45372 61479 62723 39050
7248C9050N1586N588J813r6937n9041J5719j1575J6780K1142l5797K1901K0923
$$ 39050 90636 96224 98037 1100 -57941 -42222 -53797 -37017 -15875 -51672 -29771 -8848
7236h848m906K4161L918K8623K5990M2529p323j07381q8125k3866K0166J2618
$$ -8848 -13754 10407 14325 42948 68938 111467 104144 -3237 -91362 -115228 -95062 -82444
7224h2444O2417M7596p4955j4028o6589j5616M0895J2204J6680q118k3436J3398
$$ -82444 -20027 27569 -47386 -61414 -128003 -143619 -102724 -90520 -73840 -81958 -105394 -91996
7212i1996r848J0742P0702L832j0438O778L9444J9380l3275p385O9502L7350l9400
$$ -91996 -101844 -91102 -20400 -16568 -27006 -20228 19216 38596 5321 -2064 67438 104788 65388
7199F5388o0412K2824q723o2537K105N6841K9060l3877J8061J6907k6195J2820
$$ 65388 4976 27800 19077 -43460 -41355 15486 44546 10669 28730 45637 19442 32262
7187C2262k8140J5971N6153R569j1804n920k570l9473Q893n322j6015l8731Q5280
$$ 32262 4122 20093 76246 85815 74011 68091 65521 26048 34941 29619 13604 -25127 60153
7174F0153M9229j4021m4798p6j8470k0600j2349P7655J3278m4741J796J5979L7449
$$ 60153 109382 95361 50563 50487 32017 11417 -932 76723 90001 45260 47056 63035 100484
7161A00484m6322o6763m2153q874k4140J3510J3699j2271k5468K5865N6392O4604
$$ 100484 54162 -12601 -54754 -63628 -87768 -74258 -60559 -72830 -98298 -72433 -16041 48563
7149D8563k715m1364l4657l9251m8717L7129o044K498J0211J3006Q080N8225O2039
$$ 48563 45848 4484 -30173 -69424 -118141 -81012 -87056 -84558 -74347 -61341 -53261 4964 67003
7136F7003l2294p0664o44k6106M1097J5862K9351r770o7059o689L815K3353P750
$$ 67003 34709 -35955 -36599 -62705 -21608 -5746 23605 13835 -53224 -59913 -56098 -32745 -24995
7123b4995p610J4178n5117P200L9673L16q1977K3712M0953L7997J8971Q960L4337
$$ -24995 -32605 -18427 -73544 -66344 -26671 -26355 -108332 -84620 -43667 -5670 13301 22261 56598
7110E6598j4317m4773k3419K5398J2197m3605j1399J7827j1870J1407j0353k5699
$$ 56598 42281 -2492 -25911 -513 11684 -31921 -43320 -25493 -37363 -25956 -36309 -62008
7098f2008K2895L6887l5775J0568n4625n010P477K3757j5473R509P1892O1510
$$ -62008 -39113 -2226 -38001 -27433 -82058 -87068 -79591 -55834 -71307 -61798 10094 71604
7086G1604O1903j3950q8126k0806L187j3528L286M4933K6585L1461j7963k8072
$$ 71604 133507 119557 31431 10625 13812 284 3570 48503 75088 106549 88586 60514
7074F0514n026L9708j2099l5868l0393J0808j8555m9088m1675M9605k6789m7824
$$ 60514 55488 95196 83097 47229 16836 27644 9089 -39999 -81674 -32069 -58858 -106682
7062a06682L3763J0380m186M0317L3388q894k2438K1358j7161j4090L2131N1628
$$ -106682 -72919 -62539 -66725 -26408 6980 -1914 -24352 -2994 -20155 -34245 -2114 49514
7050D9514q136n5037m9983L1150L2834J6456L0689J5365l1679o9642m0679j6763
$$ 49514 41378 -13659 -63642 -32492 342 16798 47487 62852 31173 -38469 -79148 -95911
7038i5911J8760N3359K9136L0964M6982l7909r06L1512K022K121n8488k015k4854
$$ -95911 -77151 -23792 5344 36308 83290 45381 44475 75987 78009 80130 21642 19627 -5227
7025e227l4438j8429M4451J9104M2112J7392o8795o67L5251j8826j3560Q997j1383
$$ -5227 -39665 -58094 -13643 5461 47573 64965 -3830 -4497 30754 11928 -1632 7365 -4018
7012d018j2297q03p578k2271J334m043J6118K8693m83k5180o3254l0542P2131
$$ -4018 -16315 -17118 -24696 -46967 -45633 -49676 -33558 -4865 -5348 -30528 -93782 -124324 -52193
6999e2193R6704j0776k5269k4388L7265l0444k5404l9480P541O6520O5j8600O0974
$$ -52193 44511 33735 8466 -15922 21343 -9101 -34505 -73985 -66444 76 141 -18459 42515
6986D2515M9018K636m1350k4345o367l8052r936P892K9673n766K233j0275m1980
$$ 42515 91533 94169 52819 28474 22107 -15945 -25881 -17989 11684 5918 8151 -2124 -44104
6973d4104j5258M7636K5141K1676j3733j8366j0736l3776J2075r575R619o0475
$$ -44104 -59362 -11726 13415 35091 21358 2992 -7744 -41520 -29445 -39020 -29401 -89876
6961h9876l7307L7101O2652r05m643L4655K3642l3075k0219J1559k589M1181N54
$$ -89876 -127183 -90082 -27430 -28335 -32978 1677 25319 -7756 -27975 -16416 -19005 22176 22730
6948B2730o3799o288M2135L9592L5709K785m2973n8735k4403L5990m7481k7133
$$ 22730 -41069 -47357 -5222 34370 70079 72864 29891 -28844 -53247 -17257 -64738 -91871
6936i1871L1093k4812k468R4238L7983K6558R053K1201k7154j5076r114J9404
$$ -91871 -60778 -85590 -88058 6180 44163 70721 79774 100975 73821 58745 49631 69035
6924F9035l4515k1184l3362k5531q858L5884L2392j4163l2328k266J3774M0211
$$ 69035 34520 13336 -20026 -45557 -54415 -18531 13861 -302 -32630 -34896 -21122 19089
6912A9089j5546m377M212K2610j2711k5828j2124J5288l0682n3755m1n5224K1240
$$ 19089 3543 -834 3378 25988 13277 -12551 -24675 -9387 -40069 -93824 -93865 -149089 -127849
6899a27849K7031P7157L799j1366N770K85k626L5778n2573K3495K8013J2254j0747
$$ -127849 -100818 -23661 -19862 -31228 -25458 -25173 -27799 7979 -44594 -21099 6914 19168 8421
6886H421j9206J8223K3241k4778J5612M3368L7336n7259o2771k3448K1529K5888
$$ 8421 -10785 7438 30679 5901 21513 64881 102217 44958 -17813 -41261 -19732 6156
6874F156M9484O0105L2531k6960o9229p4070l4735N6257M68J2102k7685k6828
$$ 6156 55640 115745 148276 121316 52087 -21983 -56718 -461 7 12109 -15576 -42404
6862d2404l1410m8584J1511N2685O3063j3802l4665l2882m9542N2880k7452K1959
$$ -42404 -73814 -122398 -110887 -58202 4861 -8941 -43606 -76488 -126030 -73150 -100602 -78643
6850g8643Q1789R1092L6709o0213k3020j4182l6079j1190l3707K9334j6270j102
$$ -78643 3146 94238 130947 70734 47714 33532 -2547 -13737 -47444 -18110 -34380 -35482
6838c5482q7J5615Q7617k5172J3312r401m222M6566m6574j7894m0067l1693l4426
$$ -35482 -35569 -19954 67663 42491 55803 46402 42180 88746 42172 24278 -15789 -47482 -81908
6825h1908J8267j0399R627O9512N5608o9928k3521M115m9845m4890L8353P9209
$$ -81908 -63641 -74040 -64413 5099 60707 -9221 -32742 -28627 -78472 -123362 -85009 -5800
6813e800M5865K346p3273L8152O4680q7389n4001O3301K9297j1004K4279k5340
$$ -5800 40065 42411 -30862 7290 71970 -15419 -69420 -6119 23178 12174 36453 11113
6801A1113l4632r79l562l4332M5993K2146R122m7482n22K5072Q1039J6034l9697
$$ 11113 -23519 -24498 -28060 -62392 -16399 5747 14869 -32613 -33135 -8063 72976 89010 49313
6788D9313K4688m8193k6961J9358j3710j8787M7491r895m546r523j7118L3126
$$ 49313 74001 25808 -1153 18205 4495 -14292 33199 23304 18758 9235 -7883 25243
6776B5243L3988l5647m2725O434j3656o618R608n240K844J781l4374J3113o743
$$ 25243 59231 23584 -19141 -12707 -26363 -32981 -23373 -28613 -25769 -23988 -58362 -45249 -51992
6763e1992l4539N7639L4006O2516K8014m5065p1835k0886N0798M1913m9244k6736
$$ -51992 -86531 -28892 5114 67630 95644 50579 -21256 -42142 8656 50569 1325 -25411
6751b5411k6068p134j1658J8835O1165M9789m2784r4837k486M8764m0165j3304
$$ -25411 -51479 -58613 -70271 -51436 9729 59518 16734 -78103 -80589 -31825 -71990 -85294
6739h5294L7551m4885n6618J00382O6365j3465k7315m1141K4686K716J0021L3430
$$ -85294 -47743 -92628 -149246 -48864 17501 4036 -23279 -64420 -39734 -37018 -26997 6433
6727F433N6945l9537L6712k9364q941J2381q85J8128n3398m3705R57O5540j8605
$$ 6433 63378 23841 60553 31189 22248 34629 33744 51872 -1526 -45231 -44274 21266 2661
6714B661j4413Q414j5547n090M1110P104m6431j17433m8465M2331K5061M8596
$$ 2661 -11752 -3338 -18885 -23975 17135 24239 -22192 -139625 -188090 -145759 -120698 -72102
6702g2102k3299J601N9849P089q658J8432K676K2389M8566M6651m9764n336n402
$$ -72102 -95401 -93800 -33951 -26862 -35520 -17088 -14412 7977 56543 103194 53430 48094 42692
6689D2692r9069q3709L1631O453m3363j3940R0463L000k5383L6649R305m5637
$$ 42692 -56377 -140086 -108455 -102002 -145365 -159305 -68842 -65842 -91225 -54576 -45271 -90908
6677i0908l7286N7066P2973P2509L9891r9684j26950L4277K1518l3783J0445N5672
$$ -90908 -128194 -71128 1845 74354 114245 14561 -112389 -78112 -56594 -90377 -79932 -24260
6665b4260L496M820K2763k1591m6204j3202O9199J9146J6720J192J4676n003l0386
$$ -24260 -20764 -15944 6819 -14772 -60976 -74178 -4979 14167 30887 32079 46755 41752 11366
6652A1366l4646N1465P1107J7166o1549k0121K805j0409n2120k7548K4014M5622
$$ 11366 -23280 28185 99292 116458 54909 34788 37593 27184 -24936 -52484 -28470 17152
6640A7152N0514o784o2751o0124r693M6531L627N9748J2208Q947l2580k1568q004
$$ 17152 67666 60882 -1869 -61993 -71686 -25155 -21528 38220 50428 59375 26795 5227 -2777
6627b777k0310J3876L7230k3502o0381J0308j2303Q654j3367J9029J1081P813
$$ -2777 -23087 -9211 28019 4517 -55864 -45556 -57859 -49205 -62572 -43543 -32462 -24649
6615b4649j65J4535l6437l0879M0598N880j7238K004l7608J1895M4654r175q134
$$ -24649 -24814 -10279 -46716 -77595 -36997 -31117 -48355 -46351 -83959 -72064 -27410 -36585 -44719
6602d4719J5482l698K5401K992O271l1437j0792J9765l1515k7862L446p995K1801
$$ -44719 -29237 -32935 -7534 -4542 1729 -29708 -40500 -20735 -52250 -80112 -76666 -84661 -62860
6589f2860O1111J4641m4393J4759j3797k9519m8132J691L2148N9075L7499k256
$$ -62860 -1749 12892 -31501 -16742 -30539 -60058 -108190 -106499 -74351 -15276 22223 19967
6577A9967l9157j7228k3438K3222L8941k2414o3222k2744J422N0192J5402k7638
$$ 19967 -19190 -36418 -59856 -36634 2307 -20107 -83329 -106073 -104651 -54459 -39057 -66695
6565f6695j0942L681L8044K4077M1847n0514j9759j4819J8333J8659o598J5656
$$ -66695 -77637 -73956 -35912 -11835 30012 -20502 -40261 -55080 -36747 -18088 -24686 -9030
6553i030M1214J2388l8237M141M0931Q0917k3395o8217j766j9934l1521l6759
$$ -9030 32184 44572 6335 10476 51407 132324 108929 40712 38946 19012 -12509 -49268
6541d9268K8695K4935k0269l6368k5602j7103J7093P1082N1525R533L575J2142
$$ -49268 -20573 4362 -15907 -52275 -77877 -94980 -77887 -6805 44720 54253 57828 69970
6529F9970l3189o2696l4469j3354J0269N6170J1513o6059j0010K7118K3862J6463
$$ 69970 36781 -25915 -60384 -73738 -63469 -7299 4214 -61845 -71855 -44737 -20875 -4412
6517d412l9115o4338M341P5956j969L1452O7178J8770J673o5654n3966j0171J9593
$$ -4412 -43527 -107865 -103524 -27568 -29537 1915 69093 87863 89536 23882 -30084 -40255 -20662
6504b0662k9682N797j0408M3935R1031n6239K3193K8216j7512n5776o3584N745
$$ -20662 -50344 -44547 -54955 -11020 80011 23772 46965 75181 57669 1893 -61691 -55946
6492e5946L2285j7985L8356j641k866L0095N130m8363j5161Q741L097l8041m5228
$$ -55946 -23661 -41646 -3290 -4931 -7797 22298 27428 -20935 -36096 -27355 -24258 -62299 -107527
6479a07527L969K2471J7089K762J4493J5669M797N3974K9546l9965p2643q311
$$ -107527 -103558 -81087 -63998 -61236 -46743 -31074 -26277 27697 57243 17278 -55365 -63676
6467f3676j49K106L0144k7322j5590L3122L0093l248O238m5707l3749M9447M6127
$$ -63676 -63825 -61719 -31575 -58897 -74487 -41365 -11272 -14520 -8282 -53989 -87738 -38291 7836
6454G836N7627M1589j1969K4914J5212k1330o7824l2734r824k7935k501M746m192
$$ 7836 65463 107052 95083 119997 135209 113879 46055 13321 3497 -24438 -26939 -22193 -26385
6441b6385K2945J4838l1773P4675O0397n22o0943n6241N810K9707Q272o2384l5409
$$ -26385 -3440 11398 -20375 54300 114697 114175 53232 -3009 2801 32508 40780 -21604 -57013
6428e7013j4854m7692j8865K0944K267L9365M129l3172p452J8832Q0899K8543
$$ -57013 -71867 -119559 -138424 -117480 -115213 -75848 -71719 -104891 -112343 -93511 -12612 15931
6416A5931j05220j10278K3721L4355J7889O982L1425L8344l3397j6213k0299L6055
$$ 15931 -89289 -199567 -175846 -141491 -123602 -116620 -85195 -46851 -80248 -96461 -116760 -80705
6404h0705L7742J1871p509j0601K8748N1239J3557k1863p7406n002Q467m2918
$$ -80705 -42963 -31092 -38601 -49202 -20454 30785 44342 22479 -54927 -59929 -51462 -94380
6392i4380Q641L5972q165l1691M1732j8844J0110O4621O379J671L9100N8848l7954
$$ -94380 -85739 -49767 -57932 -89623 -47891 -66735 -56625 7996 14375 16046 55146 113994 76040
6379G6040m0275l3345j0768l06m2786l5967r168k2869P298Q6935j7689m1257L6995
$$ 76040 35765 2420 -8348 -8654 -51440 -87407 -96575 -119444 -112146 -25211 -42900 -84157 -47162
6366d7162J9792J3420L8237j3461q627M440j9576N6793q655p5605j5344P1774
$$ -47162 -27370 -13950 24287 10826 2199 6639 -12937 43856 35201 -40404 -55748 16026
6354A6026M6768l3266n4689k5325L2088J2748k9261j6093K3348O5238R3882l0827
$$ 16026 62794 29528 -25161 -50486 -18398 -5650 -34911 -51004 -27656 37582 131464 100637
6342A00637k3097k748K9927j2622m3344n2827p7772o6644N3534k398K3466M0589
$$ 100637 77540 74792 104719 92097 48753 -4074 -81846 -148490 -94956 -97354 -73888 -33299
6330c3299J1396k7897M4077m984J6624L7321K6099j7056r957k4634o1317o3904
$$ -33299 -21903 -49800 -5723 -10707 5917 43238 69337 52281 42324 17690 -43627 -107531
6318a07531j8213Q2348Q2954j8198M1535j3343j1931r496O865J3908J9111j4805
$$ -107531 -125744 -43396 39558 21360 62895 49552 37621 28125 34990 48898 68009 53204
6306E3204k4342m5412k7787K8775L3553J0808q806m7983n0191L4598m0145K2908
$$ 53204 28862 -16550 -44337 -15562 17991 28799 19993 -27990 -78181 -43583 -83728 -60820
$$ [...]
##END NTUPLES=NMR SPECTRUM
##END=
