##TITLE=Analysis number 325857
Compound Code cc 59410
Book Reference 494/102/2
Project Code adrs
Chemist Name craigr
##JCAMPDX= 6.0         $$ Bruker NMR JCAMP-DX V2.0
##DATA TYPE= NMR SPECTRUM
##DATA CLASS= NTUPLES
##ORIGIN= Bruker BioSpin GmbH
##OWNER= nmr
$$ XWIN-NMR		Version 3.5
$$ Wed Jan 17 10:08:04 2007 GMT Standard Time (UT+0h)  MAYBRIDGE\nmr@NMR_250MHZ
##.OBSERVE FREQUENCY= 250.131544655141
##.OBSERVE NUCLEUS= ^1H
##.ACQUISITION MODE= SIMULTANEOUS (DQD)
##.ACQUISITION SCHEME= undefined
##.AVERAGES= 16
##.DIGITISER RES= 18
##SPECTROMETER/DATA SYSTEM= dpx250
##.PULSE SEQUENCE= zg30
##.SOLVENT NAME= CDCl3
##.SHIFT REFERENCE= (INTERNAL, CDCl3, 0, 16.4499)
##AUDIT TRAIL= $$ (NUMBER, WHEN, WHO, WHERE, WHAT)
$$ ##TITLE= Audit trail, XWIN-NMR		Version 3.5
$$ ##JCAMPDX= 5.01
$$ ##ORIGIN= Bruker BioSpin GmbH
$$ ##OWNER= nmr
$$ C:\u/data/dgb/nmr/ADRS/1310/pdata/1/auditp.txt
$$ ##AUDIT TRAIL=  $$ (NUMBER, WHEN, WHO, WHERE, WHAT)
(   1,<2007-01-17 10:07:40.32 +000>,<MAYBRIDGE\nmr>,<NMR_250MHZ>,
      <created by zg, POWCHK disabled, PULCHK disabled
       configuration hash MD5:
       49 4B E0 1D 92 C2 6B 37 9F E6 65 BC 52 41 86 1D
       data hash MD5: 64K
       33 8A CC E4 AA DD 58 BC 47 DA 46 7E 4E FF AC 5E>)
(   2,<2007-01-17 10:07:55.36 +000>,<MAYBRIDGE\nmr>,<NMR_250MHZ>,
      <Start of raw data processing
       ef LB = 0.3 FT_mod = 6 PKNL = 1 SI = 32K 
       data hash MD5: 32K
       21 0E 2A 57 0C 3C 9C AA B0 B4 81 F5 BC FF 2C E9>)
(   3,<2007-01-17 10:07:57.04 +000>,<MAYBRIDGE\nmr>,<NMR_250MHZ>,
      <apk 
       data hash MD5: 32K
       7E 2F 1B F8 0E 74 62 37 12 0C 7F C1 14 7B 16 48>)
(   4,<2007-01-17 10:07:57.75 +000>,<MAYBRIDGE\nmr>,<NMR_250MHZ>,
      <abs ABSG = 5 
       data hash MD5: 32K
       69 FE E0 F8 60 6B 67 B1 F3 54 E7 B4 54 3A 9B 56>)
$$ ##END=
$$ 
$$ hash MD5
$$ 02 77 62 61 0C F3 71 EB 19 AF 46 DB 50 EA F0 B0
##$RELAX= 
##$RELAX= 
##$RELAX= 
##$RELAX= 
##$RELAX= 
##$RELAX= 
##$RELAX= 
$$ Bruker specific parameters
$$ --------------------------
##$DU= <C:\u>
##$EXPNO= 1310
##$NAME= <ADRS>
##$PROCNO= 1
##$TYPE= <nmr>
##$USER= <dgb>
##$AMP= (0..31)
100 100 100 100 100 100 100 100 100 100 100 100 100 100 100 100 100 100 
100 100 100 100 100 100 100 100 100 100 100 100 100 100 
##$AQSEQ= 0
##$AQ_mod= 3
##$AUNM= <au_zg>
##$AUTOPOS= <7 >
##$BF1= 250.13
##$BF2= 250.13
##$BF3= 250.13
##$BF4= 250.13
##$BF5= 500.13
##$BF6= 500.13
##$BF7= 500.13
##$BF8= 500.13
##$BYTORDA= 1
##$CFDGTYP= 0
##$CFRGTYP= 5
##$CHEMSTR= <none>
##$CNST= (0..31)
1 1 145 1 1 1 1 1 1 1 1 1 1 1 1 1 1 1 1 1 1 1 1 1 1 1 1 1 1 1 1 1 
##$CPDPRG= <>
##$CPDPRG1= <>
##$CPDPRG2= <>
##$CPDPRG3= <>
##$CPDPRG4= <mlev>
##$CPDPRG5= <mlev>
##$CPDPRG6= <mlev>
##$CPDPRG7= <mlev>
##$CPDPRG8= <mlev>
##$CPDPRGB= <>
##$CPDPRGT= <>
##$D= (0..31)
0 1 0 0 0 0 0 0 0 0.06 0 0 0 0 0 0 0.0002 0 0 0 0 0 0 0 0 0 0 0 0 0 0 
0 
##$DATE= 1169028459
##$DBL= (0..7)
120 120 120 120 120 120 120 120 
##$DBP= (0..7)
150 150 150 150 150 150 150 150 
##$DBP07= 0
##$DBPNAM0= <>
##$DBPNAM1= <>
$$ [...]
##$SUBNAM7= <"">
##$SUBNAM8= <"">
##$SUBNAM9= <"">
##$SW= 20.6930455092707
##$SWIBOX= (0..15)
0 0 3 0 0 0 0 0 0 0 0 0 0 0 0 0 
##$SW_h= 5175.983436853
##$TD= 65536
##$TD0= 1
##$TE= 294.16
##$TE2= 300
##$TE3= 300
##$TEG= 300
##$TL= (0..7)
0 120 120 120 120 120 120 120 
##$TP= (0..7)
150 150 150 150 150 150 150 150 
##$TP07= 0
##$TPNAME0= <>
##$TPNAME1= <>
##$TPNAME2= <>
##$TPNAME3= <>
##$TPNAME4= <>
##$TPNAME5= <>
##$TPNAME6= <>
##$TPNAME7= <>
##$TPOAL= (0..7)
0.5 0.5 0.5 0.5 0.5 0.5 0.5 0.5 
##$TPOFFS= (0..7)
0 0 0 0 0 0 0 0 
##$TUNHIN= 0
##$TUNHOUT= 0
##$TUNXOUT= 0
##$USERA1= <user>
##$USERA2= <user>
##$USERA3= <user>
##$USERA4= <user>
##$USERA5= <user>
##$V9= 5
##$VALIST= <valist>
##$VCLIST= <CCCCCCCCCCCCCCC>
##$VD= 0
##$VDLIST= <DDDDDDDDDDDDDDD>
##$VPLIST= <PPPPPPPPPPPPPPP>
##$VTLIST= <TTTTTTTTTTTTTTT>
##$WBST= 1024
##$WBSW= 4
##$XGAIN= (0..3)
0 0 0 0 
##$XL= 0
##$YL= 0
##$YMAX_a= 436838
##$YMIN_a= -378056
##$ZGOPTNS= <>
##$ZL1= 120
##$ZL2= 120
##$ZL3= 120
##$ZL4= 120
##$ABSF1= 16.44991
##$ABSF2= -4.243263
##$ABSG= 5
##$ABSL= 3
##$ALPHA= 0
##$AQORDER= 0
##$ASSFAC= 0
##$ASSFACI= 0
##$ASSFACX= 0
##$ASSWID= 0
##$AUNMP= <proc_1d>
##$AZFE= 0.1
##$AZFW= 0.1
##$BCFW= 0
##$BC_mod= 0
##$BYTORDP= 0
##$COROFFS= 0
##$CY= 12.5
##$DATMOD= 1
##$DC= 0
##$DFILT= <>
##$DTYPP= 0
##$F1P= 14.0000005364418
##$F2P= -0.99999901652339
##$FCOR= 0.5
##$FTSIZE= 32768
##$FT_mod= 6
##$GAMMA= 0
##$GB= 0
##$INTBC= 1
##$INTSCL= 1
##$ISEN= 128
##$LB= 0.3
##$LEV0= 0
##$LPBIN= 0
##$MAXI= 10000
##$MC2= 0
##$MEAN= 0
##$ME_mod= 0
##$MI= 0
##$NCOEF= 0
##$NC_proc= -2
##$NLEV= 6
##$NOISF1= 0
##$NOISF2= 0
##$NSP= 0
##$NTH_PI= 0
##$NZP= 0
##$OFFSET= 16.44991
##$PC= 1
##$PHC0= 228.0229
##$PHC1= 6.69751
##$PH_mod= 1
##$PKNL= yes
##$PPARMOD= 0
##$PSCAL= 4
##$PSIGN= 0
##$REVERSE= no
##$SF= 250.130018029212
##$SI= 32768
##$SIGF1= 0
##$SIGF2= 0
##$SINO= 400
##$SIOLD= 32768
##$SREGLST= <1H.CDCl3>
##$SSB= 0
##$STSI= 32768
##$STSR= 0
##$SW_p= 5175.98343685301
##$SYMM= 0
##$S_DEV= 0
##$TDeff= 65536
##$TDoff= 0
##$TI= <Analysis number 999999
Compound Code 99
Book Reference 9
Project Code 9>
##$TILT= no
##$TM1= 0
##$TM2= 0
##$TOPLEV= 0
##$USERP1= <user>
##$USERP2= <user>
##$USERP3= <user>
##$USERP4= <user>
##$USERP5= <user>
##$WDW= 1
##$XDIM= 32768
##$YMAX_p= 381006553
##$YMIN_p= -25209
$$ End of Bruker specific parameters
$$ ---------------------------------
##NTUPLES= NMR SPECTRUM
##VAR_NAME=  FREQUENCY,     SPECTRUM/REAL,   SPECTRUM/IMAG
##SYMBOL=    X,             R,               I
##VAR_TYPE=  INDEPENDENT,   DEPENDENT,       DEPENDENT
##VAR_FORM=  AFFN,          ASDF,            ASDF
##VAR_DIM=   32768,         32768,           32768
##UNITS=     HZ,            ARBITRARY UNITS, ARBITRARY UNITS
##FACTOR=    0.157963299565203, 1,           1
##FIRST=     4114.6160873275, 0,             0
##LAST=      -1061.36734952551, 0,           0
##MIN=       -1061.36734952551, -25209,      0
##MAX=       4114.6160873275, 381006553,     0
$$ Real data points
##PAGE= N=1
##DATA TABLE= (X++(R..R)), XYDATA
$$ [...]
16903A2248J95n219m93L334m35M68m437O425J5026J0261K95P062l15p907q874
$$ 12248 12443 7224 6731 10065 9630 10098 5661 12086 27112 37373 37668 44730 44415 36508 27634
16888B7634L677K088O135J0543J0055r518m431l918o081o423J295P265K872N159
$$ 27634 31311 33399 39534 50077 60132 50614 46183 42265 36184 29761 31056 38321 41193 46352
16874D6352n411j0354k127Q63J0065J0050M900j0041j4733r007n249o749j153
$$ 46352 40941 30587 28460 29323 39388 49438 54338 44297 29564 20557 15308 8559 7406
16861G406L347M41o605p19R60o787k764M410L520L392l629m821k607J0118j282
$$ 7406 10753 11194 4589 3870 4830 -1957 -4721 -311 3209 6601 2972 -1849 -4456 5662 4380
16846D380n14K780k265l564j650L541M731Q54K358n296o269j371j248M50j48N218
$$ 4380 3866 6646 4381 817 -833 2708 7439 8293 10651 5355 -914 -2285 -3533 -3083 -3231 1987
16830A987k128j419N503P51J649l806j0489J972M170l513k832O732N886J8l906
$$ 1987 -141 -1560 3943 4694 6343 2537 -7952 -5980 -1810 -5323 -8155 -1423 4463 4481 575
16815E75N142l033k581l880J580k306J337K316j62K637M217L359k315n180j3063
$$ 575 5717 2684 103 -3777 -2197 -4503 -3166 -850 -1012 1625 5842 9201 6886 1706 -11357
16800a1357k900L903r21O379N007K739J780K24m257J130p17j141J435m75L211
$$ -11357 -14257 -10354 -11275 -4896 111 2850 4630 4854 597 1727 1010 -131 1304 829 4040
16785D040N35P454k072n188l959k907L559m794o56P249k855k206m265K893j508
$$ 4040 4575 12029 9957 4769 810 -2097 1462 -3332 -3988 3261 406 -1800 -6065 -3172 -4680
16770d680K665M542M016j252l884J110P08K790N252l215p237J432O292L88o426
$$ -4680 -2015 2527 6543 5291 1407 2517 3225 6015 11267 8052 815 2247 8539 8927 2501
16755B501j478k43K927k272R76l076l670l326J067L376P38o56P871R722M489j095
$$ 2501 1023 780 3707 1435 2411 -665 -4335 -7661 -6594 -3218 -2480 -3136 4735 14457 18946 17851
16739A7851j1111o022k459L742J117o27k684j744J685M623k429l028l625r062
$$ 17851 6740 718 -1741 2001 3118 2491 -193 -1937 -252 4371 1942 -1086 -4711 -13773
16725a3773l901K434L982J2410P683n265J406Q82j076R78J537K602n475o124K210
$$ -13773 -17674 -15240 -11258 1152 8835 3570 4976 5858 4782 5760 7297 9899 4424 -1700 510
16710E10R02j942N52K391j803J092J565L506O50l741j393K462n687n634j453N46
$$ 510 1412 -530 22 2413 610 1702 3267 6773 7423 3682 2289 4751 -936 -6570 -8023 -7477
16694g477J722P827K964k340k3M532J055M065O388K84l545p510l086o850j76K331
$$ -7477 -5755 2072 5036 2696 2673 7205 8260 12325 18713 18997 15452 7942 4856 -1994 -2170 161
16678A61m247J778n247j944O44j565R902M864K994p110l843L348l55K112K301
$$ 161 -4086 -2308 -7555 -9499 -8855 -10420 -518 4346 7340 230 -3613 -265 -620 1492 3793
16663C793m167N80N549O284m07p361p956p33L372J008l603k364n004P745j653
$$ 3793 -374 206 5755 12039 11632 4271 -3685 -4418 -1046 -38 -3641 -6005 -11009 -3264 -4917
16648d917l938O944j074r7L541n28p62k96K277q566j0532j030N635J0614n814
$$ -4917 -8855 -1911 -2985 -3082 459 -69 -831 -1127 1150 -7416 -17948 -18978 -13343 -2729 -8543
16633h543Q5J171K276j056L932k32p617K105N487N132l03J536l733J544m32l694
$$ -8543 -8458 -7287 -5011 -6067 -2135 -2367 -9984 -7879 -2392 2740 2437 3973 240 1784 1352 -2342
16617b342n854M63P47O846O877J237k57j367o392j184K52K823k013M571L507n259
$$ -2342 -8196 -7733 -6986 -140 6737 7974 7717 6350 -42 -1226 -974 1849 -164 4407 7914 2655
16601B655o989n4N02L84O123m6n283l382L108j292J353K45M899M483k574K78K91
$$ 2655 -4334 -4388 -3886 -3502 2621 2575 -2708 -6090 -2982 -4274 -2921 -2676 2223 6706 4132 4410 4701
16584D701L769k276n499j599P403l875k01J110m92l900K075L03J072J397O945
$$ 4701 8470 6194 695 -904 6499 2624 2423 3533 3041 -859 1216 1519 2591 3988 10933
16569A0933j397p043k449j671K208K404j249m791M29k446L153O706l254k261M886
$$ 10933 9536 2493 44 -1627 581 2985 1736 -3055 -2626 -5072 -1919 4787 1533 -728 4158
16554D158N70j257Q322P581m574q658l258q099j445L412Q316J119l72m686j616
$$ 4158 4728 3471 11793 19374 14800 6142 2884 -5215 -6660 -3248 5068 6187 5815 1129 -487
16539d87q95N035K979n125Q77k681L297l606j646k432j092P102L760n7l012k824
$$ -487 -1382 3653 6632 1507 2384 -297 3000 -606 -2252 -4684 -5776 1326 5086 5029 2017 -807
16523h07j281K467K648P849o972n259m039l45K372K387J215m916j1113P181P093
$$ -807 -2088 379 3027 10876 3904 -1355 -5394 -5739 -3367 -980 235 -4681 -15794 -8613 -1520
16508a520Q450k236r242r30k469q19l270J859J677J029j932o894m246O204J1368
$$ -1520 6930 4694 -4548 -5478 -7947 -8766 -12036 -10177 -8500 -7471 -9403 -16297 -20543 -14339 -2971
16493b971P379K661j36o917m890k397K683M543L044m026J411l06l500L020L230
$$ -2971 4408 7069 6933 16 -4874 -7271 -4588 -45 2999 -1027 384 78 -3422 -402 2828
16478B828r7J494j004k129J331p088m325m74O925Q213R38N39p436k303J651l598
$$ 2828 2731 4225 3221 1092 2423 -4665 -8990 -9464 -2539 5674 6612 7151 -285 -2588 -937 -4535
16462d535l782P81N274K300K099N393M034m997m128j850p429q73m97O479J458
$$ -4535 -8317 -7536 -2262 38 2137 7530 11564 6567 2439 589 -6840 -7713 -8210 -1731 -273
16447b73l344J958K065O299O012r33p173m243k852J143L323j642K350N848o369
$$ -273 -3617 -1659 406 6705 12717 11784 4611 368 -2484 -1341 1982 340 2690 8538 2169
16432B169l251R04r69J913L234o435j390K967n350o717p164j178P046R27k942
$$ 2169 -1082 -178 -1147 766 4000 -2435 -3825 -858 -6208 -12925 -20089 -21267 -14221 -13294 -16236
16417a6236j796M544K544m094K005j160N444J1175L748p784r105M154L179j656
$$ -16236 -18032 -13488 -10944 -15038 -13033 -14193 -8749 2426 6174 -1610 -10715 -6561 -3382 -5038
16403e038M309q54L840M69j816k879m210O069J353l020j063J197k358K22L831
$$ -5038 -729 -1583 2257 2726 910 -1969 -6179 -110 1243 -1777 -2840 -1643 -4001 -3779 52
16388E2K209K137j152K140N734k783p924l085R261J855J552K07j906j157J283
$$ 52 2261 4398 3246 5386 11120 8337 413 -2672 6589 8444 9996 10203 8297 7140 8423
16373H423O860j1371m746L51M678M643j971o470k783q29r73L276m99l412p34L810
$$ 8423 15283 3912 -834 -483 4195 8838 6867 397 -2386 -3215 -4188 -912 -1411 -4823 -5557 -1747
16357a747k978J599Q492O794j783k660n0k50M426L817k660n069o252n093p753
$$ -1747 -4725 -3126 5366 12160 10377 7717 7667 7417 11843 15660 13000 7931 1679 -3414 -11167
16342a1167M330N493O39n59o237M305O734M44n448p979m18O218J728M640M208
$$ -11167 -6837 -1344 -705 -1264 -7501 -3196 3538 3982 -1466 -9445 -9863 -3645 -1917 2723 6931
16327F931j819o343r438J185P004k799M765o17m322O89K387k075J569o852m609
$$ 6931 5112 -1231 -10669 -9484 -2480 -5279 -514 -1131 -5453 -4764 -2377 -4452 -2883 -9735 -14344
16312a4344O262O280J318Q98M877l47k005m653m524O09O527L098r935l783k868
$$ -14344 -8082 -1802 -484 414 5291 4944 2939 -1714 -6238 -5629 898 3996 -5939 -9722 -12590
16297a2590k975K820O135m714k036J453R947K879q814l362M934l286m556K834
$$ -12590 -15565 -12745 -6610 -11324 -13360 -11907 -1960 919 -7895 -11257 -6323 -9609 -14165 -11331
16283a1331J0782O135L145J767k937k784k064k384m00K256m414k496L726K068
$$ -11331 -549 5586 8731 10498 7561 4777 2713 329 -71 2185 -2229 -4725 -999 1069
16269A069K826j53n534n265j021K465K156m84l229K676L629j092M368J804l515
$$ 1069 3895 3742 -1792 -7057 -8078 -5613 -3457 -3941 -7170 -4494 -865 -1957 2411 4215 700
16254G00M196n198m421N887l58k355L64k525k683j999O293Q046j098l577j411
$$ 700 4896 -302 -4723 1164 806 -1549 -1185 -3710 -6393 -8392 -2099 5947 4849 1272 -139
16239a39R83n543k355o43p995J073L187l424k070N533J686L013l94m28K955m36
$$ -139 844 -4699 -7054 -7697 -15692 -14619 -11432 -14856 -16926 -11393 -9707 -6694 -7088 -7516 -4561 -4997
16223d997p57j04L126j894m317J567O917O800j078k615n919j802K310J794l0N3
$$ -4997 -5754 -5858 -2732 -4626 -8943 -7376 -459 6341 5263 2648 -3271 -5073 -2763 -969 -999 -946
16207i46j179r61P68M139N312K83l079o169M856K736K856K610k183j980r631k743
$$ -946 -2125 -3086 -2318 1821 7133 7416 4337 -1832 3024 5760 8616 11226 9043 7063 -2568 -5311
16191e311p28Q8L164J975N013L325j126p536l207K587K720N106P129j56p365o542
$$ -5311 -6039 -5951 -2787 -812 4201 7526 6400 -1136 -4343 -1756 964 6070 13199 13043 5678 -864
16175h64j837N573K75k32j059L71M78J250q49J91j804j963l066J965K096m385
$$ -864 -2701 2872 3147 2915 1856 2227 2705 3955 3106 3297 1493 -470 -3536 -1571 525 -3860
16159c860j022J274K716k786M747J567k76j969n946K577K048R90L73NJ557m29
$$ -3860 -4882 -3608 -892 -3678 1069 2636 2360 391 -5555 -2978 -930 60 433 438 1995 1566
16143A566N07K712j147k784k496L401Q28L217Q97o781k777J925Q186k153m436
$$ 1566 2073 4785 3638 854 -1642 1759 2587 5804 6701 -80 -2857 -932 7254 5101 665
16128F65l864m241N85N853M203l912J669L687k703o954j577p14K065L427k230
$$ 665 -3199 -7440 -6855 -1002 3201 -711 958 4645 1942 -5012 -6589 -7303 -5238 -1811 -4041
16113d041q06O477K942K508n322n841o21O096n08p97K516O6J819j225l19k043
$$ -4041 -4847 1630 4572 7080 1758 -4083 -4704 1392 884 87 2603 2669 4488 3263 2944 901
16097I01n484j796j725K225Q37r66n229J049L097J344K332j133O95l963P02M706
$$ 901 -4583 -6379 -8104 -5879 -5042 -6008 -11237 -10188 -7091 -5747 -3415 -4548 -3853 -7816 -7114 -2408
16081b408l842j09K188M420n430l397N670K050Q190P77n596j620P883N757p60
$$ -2408 -6250 -6359 -4171 249 -5181 -8578 -2908 -858 7332 8109 2513 893 8776 14533 13773
16066A3773o256l221O954K203j603l420J309J256k952j086l660j903N818J0415
$$ 13773 7517 4296 11250 13453 11850 8430 9739 10995 8043 6957 3297 1394 7212 17627
16052A7627R72n582k498P99q102j146m009K752L976N015o318r545m531O152Q713
$$ 17627 18599 13017 10519 11318 3216 2070 -1939 813 4789 9804 3486 -6059 -10590 -4438 4275
16037D275o293k529L55K022L341L291j519r46k606j719l65n29K023N416M581k434
$$ 4275 -2018 -4547 -4192 -2170 1171 4462 2943 1997 -609 -2328 -2693 -3222 -1199 4217 8798 6364
16021F364n908r78R907L881j047q001j58j736p562l408L953J358j886M005l39
$$ 6364 456 -522 9385 13266 12219 4218 4060 2324 -5238 -8646 -4693 -3335 -5221 -1216 -1555
16006a555M704m028l367P138N006K349j892o287j369K03q29N59J315l116l443
$$ -1555 3149 -879 -4246 2892 7898 10247 8355 2068 699 902 73 632 1947 -1169 -4612
15991d612j851m94M154N592L98k299L165K377m053k356O67j633m541n01O215j442
$$ -4612 -6463 -6957 -2803 2789 3187 888 4053 6430 2377 21 688 -945 -5486 -5987 228 -1214
15975a214r399M58O971P152M270o07m599O9L580J312j97l596q085k501j098n210
$$ -1214 -10613 -10155 -3184 3968 8238 7631 3032 3101 6681 7993 7796 4200 -3885 -6386 -7484 -12694
15959a2694k928J607o49J280M557Q095K29n998m10L942R26m48k385K074K892L813
$$ -12694 -15622 -14015 -14664 -13384 -8827 -732 -503 -6501 -6911 -2969 -2043 -2491 -4876 -2802 90 3903
15943C903L087J547m416j679m250r567J184M483J367N835r073o736O300Q101K903
$$ 3903 6990 8537 4121 2442 -1808 -11375 -10191 -5708 -4341 1494 -7579 -14315 -8015 86 2989
15928B989k461O348J91K77n025L492k151j425P007O370m397q878j546M798J287
$$ 2989 528 6876 7067 7344 2319 5811 3660 2235 9242 15612 11215 2337 791 5589 6876
15913F876l284k476J920o69l104O30n851l397R119l179q852k953kO316J0965R006
$$ 6876 3592 1116 3036 2367 -737 -107 -5958 -9355 -236 -3415 -12267 -15220 -15222 -8906 2059 11065
15897A1065j152l133J516l075m336o117j946J330l501o5N046J452R041n333o507
$$ 11065 9913 6780 8296 5221 885 -5232 -7178 -5848 -9349 -9414 -4368 -2916 6125 792 -5715
15882e715l69j339k260M054L475n140m057P41L866p84j555l688l912J1004J0060
$$ -5715 -6084 -7423 -9683 -5629 -2154 -7294 -11351 -10610 -6744 -7528 -9083 -12771 -16683 -5679 4381
15867D381K015n303j726J265p951m225J835O224o87L026Q284N668l227q751o61
$$ 4381 6396 1093 -633 632 -7319 -11544 -9709 -3485 -4172 -1146 7138 12806 9579 828 167
15852A67m875k787N729n60q33L760K03j384j610j273o266N337J0111k50j905j1041
$$ 167 -4708 -7495 -1766 -2326 -3159 601 804 -580 -2190 -3463 -9729 -4392 5719 5469 3564 -7477
15836g477m890J0186N734M918l273k111p41l554j649k409J78J210K814J354m801
$$ -7477 -12367 -2181 3553 8471 5198 3087 2346 -1208 -2857 -5266 -5088 -3878 -1064 290 -4511
15821d511l13l657k58J196J265j088l295Q487L989Q4j403L107Q85l180J095K378
$$ -4511 -4824 -8481 -8739 -7543 -6278 -7366 -10661 -2174 1815 1899 496 3603 4488 1308 2403 4781
15805D781o859j374K018M294N462r252j3510K226J0579M74r16L384m176q57M486
$$ 4781 -2078 -3452 -1434 2860 8322 -930 -14440 -12214 -1635 -1161 -2077 1307 -2869 -3726 760
15790G60K150l301m526l260j113k760k256j034J782R65j390N296L526K792M52
$$ 760 2910 -391 -4917 -8177 -9290 -12050 -14306 -15340 -13558 -12593 -13983 -8687 -5161 -2369 -1917
15775a917m820l124K340J096j605K971k556M801N473n693j835j909p80j076J506
$$ -1917 -6737 -9861 -7521 -6425 -8030 -5059 -7615 -2814 2659 -3034 -4869 -6778 -7558 -8634 -7128
15760g128O085J746j095l558k862L19L097M325L802O341n660o162P50P38l813
$$ -7128 -1043 703 -392 -3950 -6812 -6493 -3396 929 4731 11072 5412 -750 0 738 -3075
15745c075m064n602k018J998N42L960L134o56J467J747Q322M303O393M230m270
$$ -3075 -7139 -12741 -14759 -12761 -12219 -8259 -5125 -5781 -4314 -2567 5755 10058 16451 20681 16411
15730A6411j1442Q09M57j644r378k291J525L83J269J314p200m575J16J117L541
$$ 16411 4969 5778 6235 4591 -4787 -7078 -5553 -5170 -3901 -2587 -9787 -14362 -14246 -13129 -9588
15715i588K810L212N522j204k08J375n960m200O57r58l569k532L357N452K994
$$ -9588 -6778 -3566 1956 752 544 1919 -4041 -8241 -7584 -8542 -12111 -14643 -11286 -5834 -2840
15700b840l245M740K536K389q85k366Q8j303M148k28o328l027j959j240K411J0669
$$ -2840 -6085 -1345 1191 3580 2695 329 417 -886 3262 3034 -3294 -6321 -8280 -9520 -7109 3560
15684C560K292o546q411o39K1K908L897J698J884N87j78q788n198m944M277P953
$$ 3560 5852 -694 -9105 -9744 -9723 -6815 -2918 -1220 664 1251 1073 -7715 -12913 -17857 -13580 -5627
15668e627J624M871J759J388j1802m652L989m588q078N671O574K13K635P73K95
$$ -5627 -4003 868 2627 4015 -7787 -12439 -8450 -13038 -21116 -15445 -8871 -8658 -6023 -5250 -4955
15653d955N32K11j349k467J425M262L222J959o206K404M995j840n645j763J771
$$ -4955 -4423 -4212 -5561 -8028 -6603 -2341 881 2840 -3366 -962 4033 2193 -3452 -5215 -3444
15638c444R856l180k140k745R89k044k329M195K482j424n172p33P762l329n334
$$ -3444 6412 3232 1092 -1653 -664 -2708 -5037 -842 1640 216 -4956 -5689 2073 -1256 -6590
15623f590j363l039M633J445O083q77k947j889p71P812P409Q278k595o609k637
$$ -6590 -7953 -10992 -6359 -4914 1169 292 -2655 -4544 -5315 2497 9906 18184 15589 8980 6343
15608F343o624L509N555K606k008o097R17N073l188N05j089l220m118j051Q449
$$ 6343 -281 3228 8783 11389 9381 3284 4201 9274 6086 6591 5502 2282 -1836 -2887 5562
15593E562N762j737L30l941o099j122J197k941j772m45O168M250k461j258l555
$$ 5562 11324 9587 9917 5976 -123 -1245 -48 -2989 -4761 -5206 962 5212 2751 1493 -2062
15578b062M71K649r0l032n99O076j678l858q95P968L136p843n126k340m837L136
$$ -2062 -1591 1058 968 -2064 -2663 3413 1735 -2123 -3018 4950 8086 243 -4883 -7223 -12060 -8924
15562h924n045n288L460L971Q148J1945M567l766n298L319M809m587j329R29n363
$$ -8924 -13969 -19257 -15797 -11826 -3678 8267 12834 9068 3770 7089 11898 7311 5982 6911 1548
15547A548r919O95K890k780Q305p84q881Q602R284j893P82l401p559q557M793
$$ 1548 -8371 -7676 -4786 -7566 739 -45 -8926 -324 8960 7067 7849 4448 -3111 -11668 -6875
15532f875M985O895n551p681N682R926j832l320N704o287j783M964K64q124k364
$$ -6875 -1890 5005 -546 -8227 -2545 7381 5549 2229 7933 1646 -137 4827 5091 -3033 -5397
15517e397L705J042j644j084M078M053k872n321k258J209j940L976k850N31K560
$$ -5397 -1692 -650 -2294 -3378 700 4753 1881 -3440 -5698 -4489 -6429 -2453 -5303 -4772 -2212
15502b212j211k910L599K274J826R48k458J241o714J771K496J003R62l518l233
$$ -2212 -3423 -6333 -2734 -460 1366 2314 -144 1097 -5617 -3846 -1350 -347 615 -2903 -6136
15487f136j642J10O307k855l246N756N725J165m34j790Q65j72k190p73J636k563
$$ -6136 -7778 -7668 -1361 -4216 -7462 -1706 4019 5184 4750 2960 3825 3653 1463 690 2326 -237
15471b37p227l722M582O697L462k980o276j335m53J500L412P007j56j1274o880
$$ -237 -7464 -11186 -6604 93 3555 575 -5701 -7036 -7489 -5989 -2577 4430 4274 -7000 -13880
15456a3880m512R68J797O616J1352J286j383J598k220r88k128m246l75O88l276
$$ -13880 -18392 -17424 -15627 -9011 2341 3627 2244 3842 1622 634 -1494 -5740 -6115 -5427 -8703
15441h703j464q290l179R445J2091N787l483l345O237N458n569j0097q658N02
$$ -8703 -10167 -18457 -21636 -12191 -100 5687 2204 -1141 5096 10554 4985 -5112 -13770 -13268
15427a3268L891L126J239o321J019K985L565k959l144Q294N644K667L207n387
$$ -13268 -9377 -6251 -5012 -11333 -10314 -7329 -3764 -6723 -9867 -1573 4071 6738 9945 4558
15413D558o886j819L402r66J680M296o178j452K419m168k475J201K249L582L24
$$ 4558 -2328 -4147 -745 -1711 -31 4265 -1913 -3365 -946 -5114 -7589 -6388 -4139 -557 -233
15398b33K183K104N459N794m881p102J120K256l404p09L24M169m839L114L399
$$ -233 1950 4054 9513 15307 10426 3324 4444 6700 3296 2587 2911 7080 2241 5355 8754
15383H754m807n672r192K147l921O360J0480j964o92L85m075m906P49j008N195
$$ 8754 3947 -1725 -10917 -8770 -12691 -6331 4149 2185 1493 1878 -2197 -7103 -6354 -7362 -2167
15368b167N442n044J798j837j380J952K994l033m485j387n30l813L678O672N09
$$ -2167 3275 -1769 29 -1808 -3188 -1236 1758 -1275 -5760 -7147 -7677 -11490 -7812 -1140 -631
15353f31r62k452K349L060p981o883K656L706J177J618r25k485k13o78O491R102
$$ -631 -1593 -4045 -1696 1364 -6617 -13500 -10844 -7138 -5961 -4343 -5268 -7753 -7966 -8644 -2153 6949
15337F949n28j074L51l398J91o163o525K133M976J623L691q342p333l285L911
$$ 6949 6421 5347 5698 2300 2491 -3672 -10197 -8064 -3088 -1465 2226 -6116 -13449 -16734 -12823
15322a2823O050n09n31L001L719P577l657p361K276M257j795l839o95K444J705
$$ -12823 -6773 -7282 -7813 -4812 -1093 6484 2827 -4534 -2258 1999 204 -3635 -4330 -1886 -181
15307a81L475k469j76k49l830r66K785J459M93n813k817M592N938k476o639l86
$$ -181 3294 825 649 400 -3430 -4396 -1611 -152 341 -5472 -8289 -3697 2241 -235 -6874 -7260
15291g260K840K455n880m074j577j064O175l202M833j737p927J888K164N545N385
$$ -7260 -4420 -1965 -7845 -11919 -13496 -14560 -8385 -11587 -6754 -8491 -16418 -14530 -12366 -6821 -1436
15276a436N36m87Lj928J048M78k58p971P731N600L646M692j328o809m225l724
$$ -1436 -900 -1387 -1384 -3312 -2264 -1786 -2044 -10015 -2284 3316 6962 11654 10326 3517 -708 -4432
15260d432O374J603k464k562j96n655K773k329L363j85N848J852r4l793M460j357
$$ -4432 1942 3545 1081 -1481 -1677 -7332 -4559 -6888 -3525 -3710 2138 3990 3896 103 4563 3206
15244C206j338J077K771J858m098l780M585n37j49O588K338j850J82K396l752
$$ 3206 1868 2945 5716 7574 3476 -304 4281 3744 3595 10183 12521 10671 10853 13249 9497
15229I497L736O91q801p989L154P801j241K460N1N86K645o546J768k217J805L588
$$ 9497 13233 13924 5123 -2866 288 8089 6848 9308 9359 9945 12590 6044 7812 5595 7400 10988
15213A0988j561j275j468n633l336N814K13k107k777l331N67N551J747k563K670
$$ 10988 9427 8152 6684 1051 -2285 3529 3742 1635 -1142 -4473 -3906 1645 3392 829 3499
15198C499k600n157m119P84N712M537M463K001L415n102m077j763l601K467j94
$$ 3499 899 -4258 -8377 -7593 -1881 2656 7119 9120 12535 7433 3356 1593 -2008 459 265
15183B65k869n154J696L371m622J138K630M630j06K481j676K272j708j0889l611
$$ 265 -2604 -7758 -6062 -2691 -7313 -6175 -3545 1085 979 3460 1784 4056 2348 -8541 -12152
15168a2152k769l097O251Q707J305L606p081R88P227j336N73l6k467J344M971
$$ -12152 -14921 -18018 -11767 -3060 -1755 1851 -5230 -4242 2985 1649 2222 2186 -281 1063 6034
15153F034L310J167p971n081J460N099k272j364l473r41n233k913J0661k99k795
$$ 6034 9344 10511 2540 -2541 -1081 4018 1746 382 -3091 -4032 -9265 -12178 -1517 -1816 -4611
15138d611N386J0317k911o187k495K598P10p659O2j050J498Q399P676M28l110
$$ -4611 775 11092 8181 1994 -501 2097 2807 -4852 -4790 -5840 -4342 4057 11733 12161 9051
15123I051j0388n838L723L762L218k849r79j006J6L21K205K550K840n077l147
$$ 9051 -1337 -7175 -3452 310 3528 679 -300 -1306 -1290 -969 1236 3786 6626 1549 -1598
15108a598n831L717l229J678N018o051n694N729j610K273p67O60k098j707R18
$$ -1598 -7429 -3712 -6941 -5263 -245 -6296 -11990 -6261 -7871 -5598 -6365 -5705 -7803 -9510 -8592
15093h592K491j453N380M932m740J54N934J30Q171O640o421l617l406r41o758
$$ -8592 -6101 -7554 -2174 2758 -1982 -1828 4106 4236 12407 19047 12626 9009 5603 4662 -2096
15078b096l237K434L630J496J839l193j030j675K191M721m186j903j37j687M871
$$ -2096 -5333 -2899 731 2227 4066 873 -157 -1832 359 5080 894 -1009 -1146 -2833 2038
15063B038k8k996m793L992M360K520K341j451q474l994O420k374p95L580O353
$$ 2038 2010 -986 -5779 -1787 2573 5093 7434 5983 -2491 -6485 -65 -2439 -3234 346 6699
15048F699L502r247m907J992j190j648K82j379n94P98M170R880j467q821K733
$$ 6699 10201 954 -3953 -1961 -3151 -4799 -4517 -5896 -6490 -5692 -1522 8358 6891 -1930 803
15033H03J491j72K482L688k097L892j203m497q57l774p959o261m105L873L784
$$ 803 2294 2122 4604 8292 6195 10087 8884 4387 3530 -244 -8203 -14464 -18569 -14696 -10912
15018a0912j979L194N186O426O36m946p034n015q16P904N684L552p845o889R623
$$ -10912 -12891 -9697 -4511 1915 2551 -2395 -9429 -14444 -15260 -7356 -1672 1880 -5965 -12854 -3231
15003c231J0270L98j472K075M795J1665K5778L6576N6560M2247l3833o6780m0063
$$ -3231 7039 7437 5965 8040 12835 24500 50278 86854 143414 185661 151828 85048 44985
14990D4985k1072p936p163N151K000n221O84n197L182R9j095k487o770r99J091
$$ 44985 23913 15977 8814 13965 15965 10744 11428 6231 9413 9512 8417 5930 -840 -1839 -748
14975g48l567n885L26J3757L021K220n81l595m549O739n042j773O517L690m891
$$ -748 -4315 -10200 -9874 3883 6904 9124 8543 4948 399 7138 2096 323 6840 10530 5639
14960E639m702K501m736n230p183Q402O437O722L017l555o298n228r236M078o51
$$ 5639 937 3438 -1298 -6528 -13711 -5309 1128 7850 10867 7312 1014 -4214 -13450 -9372 -10023
14945a0023l068Q870O881m15j127m344m148J707P669K179N258K271q298m682j663
$$ -10023 -13091 -4221 2660 2245 1118 -3226 -7374 -5667 2002 4181 9439 11710 3412 -1270 -2933
14930b933L17M616J609P18l242l521L728J508K233L286k264n145j814l449o71
$$ -2933 -2616 2000 3609 4327 1085 -2436 1292 2800 5033 8319 6055 910 -904 -4353 -5024
14915e024K510k546J370K066J29o295K712J455o082J484L668J0131J758o561n179
$$ -5024 -2514 -5060 -3690 -1624 -1495 -7790 -5078 -3623 -9705 -8221 -4553 5578 7336 775 -4404
14900d404o161n42O370N353j711N777N554L62r892n613M980N378O156K337r164
$$ -4404 -10565 -11107 -4737 616 -1095 4682 10236 10598 706 -4907 73 5451 11607 13944 4780
14885D780L271J908j116o994j995N717J002k206r814o523K776N988l899j1399
$$ 4780 8051 9959 8843 1849 -146 5571 6573 4367 -5447 -11970 -9194 -3206 -7105 -18504
14871a8504J870j46N838N362K856L814l391l762j269l923n781P62K591P643O841
$$ -18504 -16634 -16780 -10942 -5580 -2724 1090 -2301 -6063 -7332 -11255 -17036 -16274 -13683 -6040 801
14856H01j341p434J37J12N056r33p49l525R19j044m543O486L124j247QL840m386
$$ 801 -540 -7974 -7837 -7725 -2669 -3602 -4351 -7876 -6957 -8001 -12544 -6058 -2934 -4181 -4173 -333 -4719
14839d719o435K132N933J0057k086p295K759L3M999J232q847n524R48N327M260
$$ -4719 -11154 -9022 -3089 6968 4882 -2413 346 379 5378 6610 -2237 -7761 -6813 -1486 2774
14824B774j037J849p13p668M169j882j152M371M995J644m246m773N953r418r879
$$ 2774 1737 3586 2873 -4795 -626 -2508 -3660 711 5706 7350 3104 -1669 4284 -5134 -15013
14809a5013l702M855M841j437n092q78Q788J28K661k202J959N637L604j186p034
$$ -15013 -18715 -13860 -9019 -10456 -15548 -16426 -7638 -7510 -4849 -7051 -5092 545 4149 2963 -4071
14794d071J44J143j258L981J169N443J890m5l129r929m023j25j353k227M877P924
$$ -4071 -3927 -2784 -4042 -61 1108 6551 8441 8396 5267 -4662 -8685 -8810 -10163 -12390 -7513 411
14778D11J130M01m632J320J341J022K197o482L835N753n136M036J229m350p265
$$ 411 1541 1942 -2690 -1370 -29 993 3190 -3292 543 6296 1160 5196 6425 2075 -5190
14763e190j668O4J644n300l615L211L240K180Q428L155M12k167j141j155R18q883
$$ -5190 -6858 -6794 -5150 -10450 -14065 -10854 -7614 -5434 2994 6149 6561 4394 3253 2098 3016 -5867
14747e867q408M560R653m597p393j226L711N460j308q10L1K405K276J165L638
$$ -5867 -14275 -9715 -62 -4659 -12052 -13278 -9567 -4107 -5415 -6225 -6194 -3789 -1513 -348 3290
14732C290M570K709m574m021J82K601k385j343n088J25K23L458M805k615l164
$$ 3290 7860 10569 5995 1974 2156 4757 2372 1029 -4059 -3934 -3711 -253 4552 1937 -1227
14717a227n911N796K779J534m727o56K269m7J709L141r2l593j980k572L438q67
$$ -1227 -7138 -1342 1437 2971 -1756 -2412 -143 -190 1519 4660 4568 975 -1005 -3577 -139 -1006
14701a006o489j706P477K420P3m139P124K973p702k788R61J671k397p871L818
$$ -1006 -7495 -9201 -1724 696 769 -3370 3754 6727 -975 -3763 -2802 -1131 -3528 -11399 -7581
14686g581Q092k662k809k948j325K283j700p50L221j701k69K645K16P91l034O565
$$ -7581 511 -2151 -4960 -7908 -9233 -6950 -8650 -9400 -6179 -7880 -8149 -5504 -5288 -4497 -7531 -966
14670i66O358M940O12n906k601j163N660P178m845o699k680r7j257J154J715Q566
$$ -966 5392 10332 10944 5038 2437 1274 6934 14112 9267 2568 -112 -209 -1466 -312 1403 9969
14654I969J0474l935p390j1983n275J043P547r89o248N179M146k904j0217k146
$$ 9969 20443 16508 9118 -2865 -8140 -7097 450 -539 -6787 -1608 2538 -366 -10583 -12729
14640a2729j53J015q557o84N432L793N190M038N630Q05l105j1558l765M907R67
$$ -12729 -12882 -11867 -20424 -21108 -15676 -11883 -6693 -2655 2975 3780 675 -10883 -14648 -9741 -8774
14625h774K399N502k926K801L588q11q776N46M378J0527K416j0138l068l042J909
$$ -8774 -6375 -873 -3799 -998 2590 1779 -6997 -6451 -2073 8454 10870 732 -2336 -5378 -3469
14610c469K15J65J181n371k93L953k051M648J51m266m2L523l106K603L498r81
$$ -3469 -3254 -3089 -1908 -7279 -7572 -3619 -5670 -1022 -871 -5137 -5179 -1656 -4762 -2159 1339 358
14594C58p28L51j571k132M259m218o771L006M675J573m280P679O385o721o573
$$ 358 -370 -19 -1590 -3722 537 -3681 -10452 -7446 -2771 -1198 -5478 2201 8586 1865 -4708
14579d708j222L469J936L75j849K91k050K546L882k092k842n591j1218n05M320
$$ -4708 -5930 -2461 -525 -150 -1999 -1708 -3758 -1212 2670 578 -2264 -7855 -19073 -19578 -15258
14564a5258R689M424m139K751L027J893k628O088M53l456Q61j429J347l462K359
$$ -15258 -5569 -1145 -5284 -2533 494 2387 -241 5847 6300 2844 3705 2276 3623 161 2520
14549B520r95p10L013l248m67n02k37j197N750o019q243J832k733K258L556o94
$$ 2520 1525 815 3828 580 113 -389 -626 -1823 3927 -2092 -10335 -8503 -11236 -8978 -5422 -6116
14533f116o216l948M897k629L540J841N874R74j715N484L702p80j927j71K69l040
$$ -6116 -12332 -16280 -11383 -14012 -10472 -8631 -2757 -1783 -3498 1986 5688 4908 2981 2810 3079 39
14517C9Q38J227Q03n713j958K064m533l624M100K493p979j005M659J680J834J853
$$ 39 877 2104 2907 -2806 -4764 -2700 -7233 -10857 -6757 -4264 -12243 -13248 -8589 -6909 -5075 -3222
14501c222N51p067k776L824k49O518j683m794Q107N197K125K31m535j224j048
$$ -3222 -2671 -9738 -12514 -8690 -8939 -2421 -4104 -8898 -791 4406 6531 6762 2227 1003 -45
14486d5R35K508k800m83J358j205l368l727J546N689L154l448L562K308n025j739
$$ -45 890 3398 598 115 1473 268 -3100 -6827 -5281 408 3562 114 3676 5984 959 -780
14470g80j166m075k442K296L068P59M369Q295q72l321M193q36o386l658k090L903
$$ -780 -1946 -6021 -8463 -6167 -3099 -2340 2029 10324 9452 6131 10324 9488 3102 -556 -2646 1257
14454A257O361L504J964J47m844n57l081L01l399q155n14M772K897j103J577j252
$$ 1257 7618 11122 13086 13233 8389 7832 4751 5052 1653 -6502 -7016 -2244 653 -450 1127 -125
14438a25J240R35L424K130k853L968P60l182n52l019j110L007L763m610j17N714
$$ -125 1115 2050 5474 7604 4751 8719 9479 6297 5745 2726 1616 4623 8386 3776 3659 9373
14422I373j995j652K3k621k165oK005n64L622N261m787l865n692N19k550j077
$$ 9373 7378 5726 5749 3128 963 957 2962 2398 6020 11281 6494 2629 -3063 -2544 -5094 -6171
14406f171j742O620J15j105J524o405l359K282K943l457n431Q858J672j0038k151
$$ -6171 -7913 -1293 -1178 -2283 -759 -7164 -10523 -8241 -5298 -8755 -14186 -5328 -3656 -13694 -15845
14391a5845M659k144N795N829j235m544l369L471j432k236l086L213J651R54K2
$$ -15845 -11186 -13330 -7535 -1706 -2941 -7485 -10854 -7383 -8815 -11051 -14137 -10924 -9273 -8319 -8297
14376h297k220M173M82K588J578m980j215j211L239J1088R95j0293l984L277J674
$$ -8297 -10517 -6344 -5862 -3274 -1696 -6676 -7891 -9102 -5863 5225 6220 -4073 -8057 -4780 -3106
14361c106K788R983K326o384l171P975O75o714k763n949k753J328j075rO483o115
$$ -3106 -318 9665 11991 5607 2436 10411 11086 4372 1609 -4340 -7093 -5765 -6840 -6849 -366 -6481
14345f481k115M787k28J024M542j712L657q66J338L027J458m362r087k541P705
$$ -6481 -8596 -3809 -4037 -3013 1529 -183 3474 2608 3946 6973 8431 4069 -5018 -7559 146
14330A46M293M285l625p916L442M867K222r39K615q54j2557q756J033K611J324
$$ 146 4439 8724 5099 -2817 625 5492 7714 6775 9390 8536 -4021 -12777 -11744 -9133 -7809
14315g809K76J766q30J92l671r37K838j649l985L878j20m289K542L420L28M177
$$ -7809 -7533 -5767 -6597 -6405 -10076 -11013 -8175 -9824 -13809 -9931 -10051 -14340 -11798 -8378 -8050 -3873
14299c873J350K500o08k766l77k644k622L219L789J942P978M897n673n352k496
$$ -3873 -2523 -23 -631 -3397 -3774 -6418 -9040 -5821 -2032 -90 7888 12785 7112 1760 -736
14284g36n632L015k51J066K713o64L046l563k017j772j352j036N089N293k136
$$ -736 -6368 -3353 -3604 -2538 175 -489 2557 -1006 -3023 -4795 -6147 -7183 -2094 3199 1063
14269A063J019o11l680P32n619L094P307k20j815k422K081L746R71K685l740o849
$$ 1063 2082 1471 -2209 -1477 -7096 -4002 3305 3085 1270 -1152 929 4675 5646 8331 4591 -2258
14253b258l486L989J611M681n897o423m116M14Q908M981L341j186q390n24N822
$$ -2258 -5744 -1755 -144 4537 -1360 -7783 -11899 -11485 -2577 2404 5745 4559 -3831 -4355 1467
14238A467O164k750o916k808l293L329O976l59j879n452k15j70K199N20L735Q73
$$ 1467 7631 4881 -2035 -4843 -8136 -4807 2169 1810 -69 -5521 -5736 -5906 -3707 -3187 548 1421
14222A421p2n555m898k979N600Q986o368j5R255K303j547j310m714l073m22M85
$$ 1421 1349 -4206 -9104 -12083 -6483 2503 -3865 -3880 5375 7678 6131 4821 107 -2966 -3388 -2903
14206b903j213k848J125j784k746k047l66N231p61M165J155l942L38J542R19k973
$$ -2903 -4116 -6964 -5839 -7623 -10369 -12416 -12782 -7551 -8312 -4147 -2992 -6934 -6596 -5054 -4135 -7108
14190g108n264L455N582O491K639n635j709m074Q2P40p22K41O10K797J1637N104
$$ -7108 -12372 -8917 -3335 3156 5795 160 -1549 -5623 -5541 -4801 -5523 -5282 -4672 -1875 9762 14866
14174A4866j2034o742j417k218J256l3L596K383l106M23n262M40j409j552Q156
$$ 14866 2832 -3910 -5327 -7545 -6289 -6322 -2726 -343 -3449 -3026 -8288 -7848 -9257 -10809 -2653
14159b653N05p401m695k981M757K057j441K593M991n66J812J093O898J269P593
$$ -2653 -2148 -9549 -14244 -17225 -12468 -10411 -11852 -9259 -4268 -4834 -3022 -1929 4969 6238 13831
14144A3831L871J875q061j1055l516L545N950Q440n753l671p807m67o236l054
$$ 13831 17702 19577 11516 461 -3055 490 6440 14880 9127 5456 -2351 -2818 -9054 -12108
14130a2108J4043P318p45k523o06l101K999K523K633m501l327r56l556o298O37
$$ -12108 1935 9253 8508 5985 5379 2278 5277 7800 10433 5932 2605 1649 -1907 -8205 -7568
14115g568K745L317M506Q2k981K839m363L094J1806j680m470K368m671o13p80
$$ -7568 -4823 -1506 3000 3082 101 2940 -1423 1671 13477 11797 7327 9695 5024 4411 3631
14100C631k818m195K754L468k314J857j827o25k759p48L231k070J216L575n600
$$ 3631 813 -3382 -628 2840 526 2383 556 -69 -2828 -3576 -345 -2415 -1199 2376 -3224
14085c224j054K626J147J6l39n41l032j966o916J897N578J1366M350r324o644
$$ -3224 -4278 -1652 -505 -489 -828 -1369 -4401 -6367 -13283 -11386 -5808 5558 9908 584 -6060
14070f060J267K522L560m212j364L703O15K368j942m360j738J620j198J425M641
$$ -6060 -4793 -2271 1289 -2923 -4287 -584 31 2399 457 -3903 -5641 -4021 -5219 -3794 847
14055H47k825j363M501p83k574j2004J087Q452M884L351l92j284l271k265rP071
$$ 847 -1978 -3341 1160 377 -2197 -14201 -13114 -4662 222 3573 3181 1897 -1374 -3639 -3648 3423
14039C423m628l671K094O735k946K666j79o651l399M02l567n387l231j288K097
$$ 3423 -1205 -4876 -2782 3953 1007 3673 3494 -3157 -6556 -6154 -9721 -15108 -18339 -19627 -17530
14024a7530l589K407P146R847L050o329k086L996n377q306k695J0066L995J105
$$ -17530 -21119 -18712 -11566 -1719 1331 -4998 -7084 -3088 -8465 -16771 -19466 -9400 -5405 -4300
14010d300K629j656j0031K212L103j841K091J1654O262K869K66M478m212q659
$$ -4300 -1671 -3327 -13358 -11146 -8043 -9884 -7793 3861 10123 12992 13258 17736 13524 4865
13996D865j797J387n75k793k205l62r8j405J807J233Q849n583o323o04R986O154
$$ 4865 3068 4455 3880 1087 -1118 -1480 -1578 -2983 -1176 57 8906 3323 -3000 -3604 6382 12536
13980A2536j153k348k717m437m20N073p260k458r1l330o561l725O379J1133O898
$$ 12536 11383 9035 6318 1881 1461 6534 -726 -3184 -3275 -6605 -13166 -16891 -10512 621 7519
13965G519M35p016p64m821l555P656Q37l957L774L055J654o46q09j844m633q14
$$ 7519 7954 938 174 -4647 -8202 -546 291 -3666 108 3163 4817 4171 3362 1518 -3115 -3929
13949c929j475o58j81L058l759L668P433o58L382J766p418K086k335q925p295
$$ -3929 -5404 -6062 -6243 -3185 -6944 -3276 4157 3499 6881 8647 1229 3315 980 -7945 -15240
13934a5240L746P804K32l767m165k13P642k36L431M753l724P83k559m871k337
$$ -15240 -11494 -3690 -3458 -7225 -11390 -11603 -3961 -4197 -766 3987 263 1046 -1513 -6384 -8721
13919h721K286K661N029P35j388k440L306J018R4L065N47j029n420p328m981J916
$$ -8721 -6435 -3774 1255 1990 602 -1838 1468 2486 2580 5645 6192 5163 -257 -7585 -12566 -10650
13903a0650N504K035m135O86j108j506K867K489M832N719q21l945m485M3J053
$$ -10650 -5146 -3111 -7246 -6560 -7668 -9174 -6307 -3818 1014 6733 5912 1967 -2518 -2475 -1422
13888a422J645Q92K071K939n199j854P9k241j59N019N75O0K100m071q269k049
$$ -1422 223 1115 3186 6125 926 -928 -849 -3090 -3249 1770 2345 2405 4505 434 -7835 -9884
13872i884j813j668k110J688L092N316L12J003J906M407O360m235j05n173j892
$$ -9884 -11697 -13365 -15475 -13787 -10695 -5379 -5067 -4064 -2158 2249 8609 4374 4269 -904 -2796
13857b796k731K31N733j920o507J969Q310m664o509m005l60K947O829O709L129
$$ -2796 -5527 -5296 437 -1483 -7990 -6021 2289 -2375 -8884 -12889 -13249 -10302 -3473 3236 6365
13842F365l3j671N60o899j060P257N278n364L872n19l408n500k328j306J453J549
$$ 6365 6332 4661 5221 -1678 -2738 4519 9797 4433 8305 7786 4378 -1122 -3450 -4756 -3303 -1754
13826a754N489J875o181P824K783j796j916n342M065N864L010q347l257r00n8
$$ -1754 3735 5610 -571 7253 10036 8240 6324 982 5047 10911 13921 5574 2317 1417 1359
13811A359n278J87M060l896m07J130j918o684J730P860K143k933l855k308Q699
$$ 1359 -3919 -3732 328 -3568 -3975 -2845 -4763 -11447 -9717 -1857 286 -2647 -6502 -8810 -111
13796a11j816o342l404P8J385j977L34J781P563L40N73O084J928P814J062j0327
$$ -111 -1927 -8269 -11673 -11595 -10210 -12187 -11853 -10072 -2509 -2169 -1596 4488 6416 14230 15292 4965
13780D965L131N269O286J736n464j834n70M442j947j3352k3O539L772k392M75
$$ 4965 8096 13365 19651 21387 15923 14089 13519 17961 16014 2662 2639 9178 12950 10558 11033
13765A1033Q819l55j360l274k288m036n863m850j9j989k125J665K750K756L139
$$ 11033 19852 19497 18137 14863 12575 8539 2676 -2174 -2193 -4182 -6307 -4642 -1892 864 4003
13750D003M682Q23l250j106K908l784J071M663J860O476M19m460M08l799o785
$$ 4003 8685 9508 6258 5152 8060 4276 5347 10010 11870 18346 18765 14305 14713 10914 4129
13735D129J32k371m333J4146M524l469M094k365j2887j0658q47K710M681R151
$$ 4129 4261 1890 -2443 11703 16227 12758 16852 14487 1600 -9058 -9905 -7195 -2514 6637
13721F637o852k327k813M344K677k052j740L613K447N28q99R4n797n931M039K200
$$ 6637 -215 -2542 -5355 -1011 1666 -386 -2126 1487 3934 4462 3563 3657 -2140 -8071 -4032 -1832
13705a832J286l357Q55L620Q52l154p63K665J823J084l690k562L414J400K367
$$ -1832 -546 -3903 -3048 572 1424 -1730 -2493 172 1995 3079 -611 -3173 241 1641 4008
13690D008K49l523p2k430L05j07L393L693J427L409P955q587k130M98m304r390
$$ 4008 4257 734 662 -1768 -1463 -1570 1823 5516 6943 10352 18307 9720 7590 8088 3784 -5606
13674e606j404m82L35j149n743L190K675J669l298n392J839J019K422N489J351
$$ -5606 -7010 -7492 -7157 -8306 -14049 -10859 -8184 -6515 -9813 -15205 -13366 -12347 -9925 -4436 -3085
13659c085p97J593m779j213Q756k585l676M299J906m406P562o48n519j891P65
$$ -3085 -3882 -2289 -7068 -8281 475 -2110 -5786 -1487 419 -3987 3575 2927 -2592 -4483 -3718
13644c718m245l964N733j8j340N475O198J195m283j028p56M654L982J499k871
$$ -3718 -7963 -11927 -6194 -6212 -7552 -2077 4121 5316 1033 5 -751 3903 7885 9384 6513
13629F513l025R00m047q021J098L432J140k18L759l378m973N507M974k359o752
$$ 6513 3488 4388 341 -7680 -6582 -3150 -2010 -2228 1531 -1847 -6820 -1313 3661 1302 -5450
13614e450o75M256Q614L323m861q254l345m014l190P120O282N364q22o876m317
$$ -5450 -6125 -1869 6745 10068 5207 -3047 -6392 -10406 -13596 -6476 -194 5170 4348 -2528 -6845
13599f845l905J1641K735l131J421l044n328J598m524J685J3106P99q176o018
$$ -6845 -10750 891 3626 495 1916 -1128 -6456 -4858 -9382 -7697 5409 6208 -1968 -7986
13585g986L402K751L220n491j787Q004J0550j839o182m20m497p752M588K779m30
$$ -7986 -4584 -1833 1387 -4104 -5891 2113 12663 10824 4642 4222 -275 -8027 -3439 -660 -1090
13570a090K294K64R24k748J059k296o136J611L601J016K273k580M379n07j268
$$ -1090 1204 1468 2392 -356 703 -1593 -7729 -6118 -2517 -1501 772 -1808 2571 2064 796
13555G96j888o431O574m52k861K969K838J802k532k228p89K66m87L508L888M892
$$ 796 -1092 -7523 -949 -1401 -4262 -1293 1545 3347 815 -1413 -2202 -1936 -2423 1085 4973 9865
13539I865p607o123K219M498k01m17l31n414m169N538O24k033L852j823p951k475
$$ 9865 2258 -3865 -1646 2852 2651 2234 1903 -3511 -7680 -2142 -1518 -3551 301 -1522 -9473 -11948
13523a1948K235J366n949R17N701M387J400O866l122k87N561l232k873k320m163
$$ -11948 -9713 -8347 -14296 -13379 -7678 -3291 -1891 4975 1853 1566 7127 3895 1022 -1298 -5461
13508e461J920L14k557o177m27M090N680L752k907P89N508k09n540l110J498l440
$$ -5461 -3541 -3227 -5784 -11961 -12388 -8298 -2618 1134 -1773 -984 4524 4315 -1225 -4335 -2837 -6277
13492f277J037N783m58l983j44J304k417j351l478l31M600k951m053M034N500
$$ -6277 -5240 543 85 -3898 -4042 -2738 -5155 -6506 -9984 -10315 -5715 -8666 -12719 -8685 -3185
13477c185O649k880o432l212j207K51J864n58L666L7q995P21J062K579l480j019
$$ -3185 3464 584 -5848 -9060 -10267 -10016 -8152 -8710 -5044 -5007 -14002 -13281 -12219 -9640 -13120 -14139
13461a4139k923l587J027O863N542L067K673n12l71P31J942J756j168l537M325
$$ -14139 -17062 -20649 -19622 -12759 -7217 -4150 -1477 -1989 -2360 -1629 313 2069 901 -2636 1689
13446A689J337N363o57p039l55P999P682l941k964m218M419L571j88Q25J605j876
$$ 1689 3026 8389 7732 693 338 8337 16019 12078 9114 4896 9315 12886 12698 13523 15128 13252
13430A3252n66L65l134j472R052O824K097M966r91K799O232K7490L5293J6981
$$ 13252 12686 13051 9917 8445 17497 24321 26418 31384 30393 33192 39424 66914 102207 119188
13416A19188L207n862j3246j4201k0014j5697q291n185L771r063j0197k052o05
$$ 119188 122395 116533 103287 89086 69072 53375 45084 39899 43670 34607 24410 22358 21753
13403B1753j839j458n458k535O422J843k982r53K95j746l596J027j302M005R23
$$ 21753 19914 18456 12998 10463 16885 18728 15746 14793 15088 13342 9746 10773 9471 13476 14399
13388A4399j040k696K250J1885J2178J5965Q592J3826K2062L3494M4875M5985
$$ 14399 13359 10663 12913 24798 36976 52941 61533 75359 97421 130915 175790 221775
13376B21775K9475J3264k3819m6125m0335m1042l0061k2666j1626n934j298j450
$$ 221775 251250 264514 240695 194570 154235 113193 83132 60466 48840 42906 41608 40158
13364D0158n330o199p915n398J646j805J527L204n662o169K209m427n775k080
$$ 40158 34828 28629 20714 15316 16962 15157 16684 19888 14226 8057 10266 5839 64 -2016
13350b016K977j36M704K973O002O166p36L166N873P332J3906J5233Q333K0810
$$ -2016 961 825 5529 8502 14504 20670 19934 23100 28973 36305 50211 65444 73777 94587
13336I4587K2618O508p72j1285k0690j8070k0404j4514j2889j1161o242M084M878
$$ 94587 117205 123713 122941 111656 90966 72896 52492 37978 25089 13928 7686 11770 16648
13323A6648L859n903j255J4k269k518O76R199M30l505q193n936k79K353K275l517
$$ 16648 20507 14604 13349 13363 11094 8576 9252 18451 18881 15376 7183 1247 968 3321 5596 2079
13307B079o582J190P919L437n11k402J892N319m789o583L27K468J295j150j847
$$ 2079 -4503 -3313 4606 8043 7532 5130 7022 12341 7552 969 1296 3764 5059 3909 2062
13292B062L783m497m60Q4O935L747m537m442l26L973j116k968P889M713J834J522
$$ 2062 5845 1348 888 972 7907 11654 7117 2675 2349 6322 5206 2238 10127 14840 16674 18196
13276A8196p317r752K404j476l859K766M922M750k424n030J149l634j392j359
$$ 18196 10879 1127 3531 2055 -1804 962 5884 10634 8210 3180 4329 695 -697 -2056
13262b056J834K447L435j207n444n17Q72p299j223N940J57L999J617O20K205M009
$$ -2056 -222 2225 5660 4453 -991 -1508 -636 -7935 -9158 -3218 -3061 938 2555 3175 5380 9389
13246I389n4k596k93J464N154M466P51n102m41N274J749R02L73j0511q906l67
$$ 9389 9335 6739 6446 7910 13064 17530 18281 13179 12738 18012 19761 20663 21036 10525 1619 1252
13230A252O378L913j882o760m773K150L978Q968Q659K678l235n365k412n626j0732
$$ 1252 7630 11543 9661 2901 -1872 278 4256 13224 21883 24561 21326 15961 13549 7923 -2809
13215b809l963J539P831L28r72J568L641O417L408k855r564m906M839O983k873
$$ -2809 -6772 -5233 2598 2926 1954 3522 7163 13580 16988 14133 4569 -337 4502 11485 8612
13200H612J789m46L358j261o352n99J108k032k336p17L752r13j526P68k226L113
$$ 8612 10401 9955 13313 12052 5700 5101 6209 4177 1841 1124 4876 3963 2437 3205 979 4092
13184D092J2770P702O285J927J0308M774k563q711l733q764q560p61o137j687
$$ 4092 16862 24564 30849 32776 43084 47858 45295 36584 32851 24087 15527 14766 8629 6942
13170F942l047M711K756j307o204K34K823L30m233j305K90J2733J363M28j889
$$ 6942 3895 8606 11362 10055 3851 4085 6908 7238 3005 1700 1990 14723 16086 16514 14625
13155A4625M084k294o385l890J637Q489K263k015m6Q286l965m50N778J462n812
$$ 14625 18709 16415 10030 6140 7777 16266 18529 16514 16468 24754 20789 20339 26117 27579 21767
13140B1767l470j801O100o68n227K389j893k384k548n026j534N389M013n290j661
$$ 21767 18297 16496 22596 21928 16701 19090 17197 14813 12265 7239 5705 11094 15107 9817 8156
13125H156p21j142L687L574O256J2907L331m411p177m826J52m079o878m214P556
$$ 8156 7435 6293 9980 13554 19810 32717 36048 31637 24460 19634 19786 15707 8829 4615 12171
13110A2171R894K55N991J1406J1137r11n962r179m921O465M25o451j860m16j983
$$ 12171 22065 22320 28311 39717 50854 49943 43981 34802 29881 36346 36771 30320 28460 28044 26061
13095B6061O666M193J877M155J457k180Q026J1476J1486J2841K3621K8800J6484
$$ 26061 32727 36920 38797 42952 44409 42229 50255 61731 73217 86058 109679 138479 154963
13082A54963k068j0035r781j6650j4393r681m862r801j0708l883j0221m977n205
$$ 154963 152895 142860 133079 116429 102036 92355 87493 77692 66984 63101 52880 47903 42698
13069D2698l976r79J2724O925R702L250n57J751M723l933P68p84r032j71n263
$$ 42698 38722 37743 50467 57392 67094 70344 69787 71538 76261 72328 73096 72312 63280 63109 57846
13054E7846O448Q036R381L391k899o44K2179L3204M1259M8462M4017L8244J4158
$$ 57846 64294 72330 81711 85102 82203 81559 103738 136942 178201 226663 270680 308924 323082
13041C23082j6682l6439m3277l9418l6611k8281j6003p624p200Q289K186p866
$$ 323082 306400 269961 226684 187266 150655 122374 106371 98747 91547 99836 102022 94156
13029I4156o677n908K566M980j167m068m418J825Q67Q938J1232M605j783L895
$$ 94156 87479 81571 84137 89117 87950 83882 79464 81289 82156 91094 102326 106931 105148 109043
13015A09043N112K76L360L300R395R240J1054J2181J9367K8436K9008K8427K1381
$$ 109043 114155 114431 117791 121091 130486 139726 150780 162961 182328 210764 239772 268199 289580
13002B89580J1899O372m495j0768j1157j0430n318K14Q948M587J2526J7821K5191
$$ 289580 301479 307851 303356 292588 281431 271001 265683 265897 274845 279432 291958 309779 334970
12989C34970L0162L0920L1962L9280M8523O8459Q5377J04098J16992J37595J58921
$$ 334970 365132 396052 428014 467294 515817 584276 669653 773751 890743 1028338 1187259
12978A187259J91976K19348K91817M06965N62947Q07282J192926J796993K692928
$$ 1187259 1379235 1598583 1890400 2297365 2860312 3667594 4860520 6657513 9350441
12969I350441L804749M729648M672722L016088M7481k893984m514808m545778
$$ 9350441 13155190 17884838 22557560 25573648 25621129 22727145 18212337 13666559
12961A3666559l646301k558023j695939j144070q03588n92959m44487l25261k33698
$$ 13666559 10020258 7462235 5766296 4622226 3818638 3225679 2781192 2455931 2222233
12952B222233j84112j55939j17545q9129o9570l4852k545K5762N2579Q4816J29496
$$ 2222233 2038121 1882182 1764637 1675508 1605938 1571086 1568541 1594303 1646882 1731698 1861194
12941A861194J82331K34563K66777K97354L42535M37373N99715Q42427J214502
$$ 1861194 2043525 2278088 2544865 2842219 3184754 3622127 4221842 5064269 6278771
12932F278771J751732K616801M013389O086937Q577933J0415183R809776N485580
$$ 6278771 8030503 10647304 14660693 20747630 29325563 39740746 49550522 55036102
12924E5036102j476104p738343j0533843r829349p394624m929424l158920k088347
$$ 55036102 53559998 45821655 35287812 25458463 18063839 13134415 9975495 7887148
12916G887148j453056j061777q06560o26106m83272l75776l10039k77845k34150
$$ 7887148 6434092 5372315 4565755 3939649 3456377 3080601 2770562 2492717 2258567
12907B258567j90055j57504j11781o7732l8876n808K3890O0311Q6972J09723J33408
$$ 2258567 2068512 1911008 1799227 1731495 1692619 1686811 1710701 1771012 1857984 1967707 2101115
12896B101115J74037K35941L32904M74693O98004J010431J516273K295087L358027
$$ 2101115 2275152 2511093 2843997 3318690 4016694 5027125 6543398 8838485 12196512
12887A2196512M466503N010182M165061J657012j685263m274145n143592m521181
$$ 12196512 16663015 21673197 25838258 27495270 25810007 21535862 16392270 11871089
12879A1871089l319887k227870j462713r91369p08727n24070m00817l18034k53854
$$ 11871089 8551202 6323332 4860619 3869250 3160523 2636453 2235636 1917602 1663748
12870A663748k09294j80252j57514j29994j02076q8417p8093o7772n4657m4402
$$ 1663748 1454454 1274202 1116688 986694 884618 796201 718108 650336 595679 551277
12860E51277m8787m5976k9934k4315k3143k0321k0566k2370k1349j3335q008j8419
$$ 551277 502490 456514 426580 402265 379122 358801 338235 315865 294516 281181 273173 254754
12848B54754k0471n507m201j0326j4475p818j388N080n38l460r475r038n911m363
$$ 254754 234283 228776 224575 214249 199774 191956 190568 195648 195110 191650 182175 173137 167226 162863
12834A62863n403k411j0652j4293K080L636q80n886k292j0424l922p864J321k349
$$ 162863 157460 155049 144397 130104 132184 135820 134940 129054 126762 116338 112416 104552 105873 103524
12820A03524m326n863m17m809l452R2L889l225q024k315M409N891J399n583k183
$$ 103524 99198 93335 92918 88109 84657 84749 88638 85413 77389 75074 79483 85374 86773 81190 79007
12805G9007L209N0o235J1240J5854J5931O529l727k491j6179j7593r412o806q111
$$ 79007 82216 82266 76031 87271 103125 119056 125585 121858 119367 103188 85595 76183 69377 61266
12791F1266J597m0L284l565k803J155J565o891l764m33M78n100m790R498Q310
$$ 61266 62863 62823 66107 62542 59739 60894 62459 55568 51804 51371 51849 46749 41959 51457 59767
12776E9767M856m49J125K546m157r335J984o148k508l890K278m669m565M237J569
$$ 59767 64623 64174 65299 67845 63688 54353 56337 50189 47681 43791 46069 41400 36835 41072 42641
12761D2641N511M947J538M442L686O03p022q697k433j553m363M10k108O004N051
$$ 42641 48152 53099 54637 59079 62765 63368 56346 47649 45216 43663 39300 39710 37602 43606 48657
12746D8657k012m129j653J449O808J088K32k89o900M566O444p552p928L256P194
$$ 48657 46645 42516 40863 42312 49120 50208 50440 50151 43251 47817 54261 46709 38781 42037 49231
12731D9231N18j367p705k911n631q137k308K925M525l518k482l182j872J0048
$$ 49231 49749 48382 40677 37766 32135 23998 21690 24615 29140 25622 23140 19958 18086 28134
12717B8134P601j674J916K147k508k557J032L21M150J193j262l351n674k827J625
$$ 28134 35735 34061 35977 38124 35616 33059 34091 34412 38562 39755 38493 35142 29468 26641 28266
12702B8266q90n17K501L648m907k647L43M594N765l456r648o457m503n623P705
$$ 28266 27376 26859 29360 33008 28101 25454 25797 30391 36156 32700 23052 16595 12092 6469 14174
12687A4174N733L620J8q235m072J994K721N181j019j72l348l173M788N295M415
$$ 14174 19907 23527 23545 15310 11238 13232 15953 21134 20115 19943 16595 13422 18210 23505 27920
12672B7920k592l691N445j0656r60l83M97L778p64p93l674N400N884M688j894
$$ 27920 25328 21637 27082 16426 15466 15083 15580 19358 18594 17801 14127 19527 25411 30099 28205
12657B8205o36l548r002j027q485q858k326P579N238K50j020l076q87M655P995
$$ 28205 27569 24021 15019 13992 5507 -3351 -5677 1902 7140 7390 6370 3294 2407 7062 15057
12642A5057m132l196O654l987O12K482l538O703K953J550j138l350K385N069J054
$$ 15057 10925 7729 14383 10396 11008 13490 9952 16655 19608 21158 20020 16670 19055 24124 25178
12627B5178l859J264O197Q18N412J987j432l20L81l522K993J5397K0889K6020
$$ 25178 21319 22583 28780 29598 35010 36997 35565 35245 35626 32104 35097 50494 71383 97403
12613I7403M4179Q2476R2483L0510o5757j01632o8307l9258k6094j0384r957o377
$$ 97403 141582 224058 316541 347051 281294 179662 111355 72097 46003 35619 25662 19285
12601A9285J718P59M013M909j715K693j943n632p920q84k665o785m568O699L935
$$ 19285 21003 21762 25775 30684 28969 31662 29719 24087 16167 15283 12618 5833 1265 7964 11899
12586A1899l197M47K492J981j588k611m883j706M288J422M627O69J071J500n501
$$ 11899 8702 9149 11641 13622 12034 9423 4540 2834 7122 8544 13171 13840 14911 16411 10910
12571A0910j357j1m685j79J492J509q497n41K199K235J824M476Q075o396j352
$$ 10910 9553 9542 4857 4678 6170 7679 -818 -1359 840 3075 4899 9375 17450 11054 9702
12556I702p43R05J28l67j956N741K155q80j304q458k631O509L341n114j1076m992
$$ 9702 8959 9864 9992 9625 7669 13410 15565 14685 13381 4923 2292 8801 12142 7028 -4048 -9040
12540i040J239M1J13M496J294m94K065J79R14K372o638J652N597K747J824k727
$$ -9040 -7801 -7760 -7647 -3151 -1857 -2351 -286 -107 807 3179 -3459 -1807 3790 6537 8361 5634
12524E634J678n59K189k35L153J269k180K376K315L696N883M275Q014J1011J3284
$$ 5634 7312 6753 8942 8707 11860 13129 10949 13325 15640 19336 25219 29494 37508 48519 61803
12509F1803K2988K1977J0085N737j0584k2456j6937j6436j1933q543j3216n771
$$ 61803 84791 106768 116853 122590 112006 89550 72613 56177 44244 35701 22485 16714
12497A6714j3194k100O128L016o335Q80N012j088k323J593j444K44l405p1K386
$$ 16714 3520 1420 7548 10564 4229 5109 10121 9033 6710 8303 6859 7103 3698 3627 6013
12482F013k506O087N249N780K324K442N49M900R759N721K1715K7852K7799L8100
$$ 6013 3507 9594 14843 20623 22947 25389 25938 30838 40597 46318 68033 95885 123684 161784
12468A61784M1105L7613J5389j3119l1795m1747l9790l2626k3333j4210n537q225
$$ 161784 202889 240502 255891 242772 210977 169230 129440 96814 73481 59271 53734 45509
12456D5509j5538r129j779K165q45m336o772k111N811j856L645J954n450r122
$$ 45509 29971 20842 19063 21228 20383 16047 9275 7164 12975 11119 14764 16718 11268 2146
12442B146j899L586Q290J287L980M47L419N654M549M931P854Q131Q539J2639J9878
$$ 2146 247 3833 12123 13410 17390 17837 21256 26910 31459 36390 44244 52375 60914 73553 93431
12427I3431J7361J5713O262j0190k6061j8576j6859k1398j1259j1374m586l73
$$ 93431 110792 126505 132767 122577 96516 77940 61081 39683 28424 17050 12464 12091
12415A2091m294L903J887J096m602m201k286j957O446O065m226j0013l222k246
$$ 12091 7797 11700 13587 14683 10081 5880 3594 1637 8083 14148 9922 -91 -3313 -5559
12401e559j457K319J535N53J634K844R365K893J95p14M461o284o44k131j786k231
$$ -5559 -7016 -4697 -3162 -2609 -975 1869 11234 14127 14322 13608 18069 11785 11141 9010 7224 4993
12385D993j92m807R65L733K956L605L174M71j3263o22O382l97J240R55m921k296
$$ 4993 4801 -6 959 4692 7648 11253 14427 14898 1635 1013 7395 6998 8238 9193 4272 1976
12369A976N42K132k528N01N92k67m913n450N479N646j353l28m30M007L128m998
$$ 1976 2518 4650 2122 2623 3215 2948 -1965 -7415 -1936 3710 2357 2029 1599 5606 8734 3736
12353C736l228j528R29P20M103M143l63k187r88j812j451o091k751M57q44m872
$$ 3736 508 -1020 -91 629 4732 8875 8512 6325 5337 3525 2074 -4017 -6768 -6311 -7155 -12027
12337a2027k233M073L417N813Q393n042l867O7k433O51k385k614l104M082M775
$$ -12027 -14260 -10187 -6770 -957 7436 2394 -1473 -1406 -3839 -3188 -5573 -8187 -11291 -7209 -2434
12322b434J72k644J003K176O08l628J02J1217l444J281R146l213l189p60m779
$$ -2434 -2262 -4906 -3903 -1727 -1119 -4747 -4645 6572 3128 4409 13555 10342 7153 6393 1614
12307A614j614m369k875n41j254K353J0435J654n694j706L860N082J719K476o746
$$ 1614 0 -4369 -7244 -7785 -9039 -6686 3749 5403 -291 -1997 1863 6945 8664 11140 4394
12292D394k567J806j236J224n719K225O40Q830J549K421o027J856P606M56m420
$$ 4394 1827 3633 2397 3621 -2098 127 767 9597 11146 13567 7540 9396 17002 17458 13038
12277A3038m517l9k128k531M088L096m398Q47q449l677l65K287j921N046k91l276
$$ 13038 8521 8482 6354 3823 7911 11007 6609 7456 -993 -4670 -5035 -2748 -4669 377 86 -3190
12261c190L994K631K528o45L825j969m497n076o143j20J790N608j496j799l624
$$ -3190 804 3435 5963 5318 9143 7174 2677 -2399 -8542 -8662 -6872 -1264 -2760 -4559 -8183
12246h183K094M655M468N585M371n940J67J935l245j154O810K199m908l605K911
$$ -8183 -6089 -1434 3034 8619 12990 7050 7217 9152 5907 4753 11563 13762 8854 5249 8160
12231H160k174j819k509K903j0875J001N471J1024M906J178o075o338K472K399
$$ 8160 5986 4167 1658 4561 -6314 -5313 158 11182 16088 17266 11191 4853 7325 9724
12217I724l2J866m414n44J480n978J728L214L490j172r45J12L746J325r941m408
$$ 9724 9692 11558 7144 6600 8080 2102 3830 7044 10534 9362 8417 8529 12275 13600 3659 -749
12201g49L170j662j567k116M111j060j664K79L548M594J416L60M717O859N764
$$ -749 2421 759 -808 -2924 1187 127 -1537 -1258 2290 6884 8300 8660 13377 20236 26000
12186B6000K692J5624K3544K8841N1350N7799K6047l2391o0627n2055l4712j7433
$$ 26000 28692 44316 67860 96701 148051 205850 231897 199506 138879 86824 52112 34679
12174C4679n519P14J152o578l048l763q203K509J0673l982p762q423n456L509
$$ 34679 29160 29874 31026 24448 21400 17637 9434 11943 22616 18634 10872 2449 -3007 502
12160E02O864m947K423M078J947O072K175K054o096K178L007K100k4K611p77O819
$$ 502 7366 2419 4842 8920 10867 16939 19114 21168 15072 17250 20257 22357 22333 24944 24167 30986
12144C0986L889J3264J5378K6292M8533R5860J37663J90583J79103N230j86015
$$ 30986 34875 48139 63517 89809 138342 234202 371865 562448 741551 746781 560766
12133E60766k12715j38487p6675m0734j8713j5090o438l108l893j0189j3337p171
$$ 560766 348051 209564 132889 92155 73442 58352 51914 48806 44913 34724 21387 14216
12121A4216k773J634m451o958O34n61m228M438K429J433R26m047J374n97k6K385
$$ 14216 11443 13077 8626 1668 2302 1741 -2487 1951 4380 5813 6739 2692 4066 3469 3443 5828
12105E828J598O898M944P154M088M578N814J2080L3149M5726O6164J11854J74171
$$ 5828 7426 14324 19268 26422 30510 35088 40902 52982 86131 131857 198021 309875 484046
12092D84046K01573R7377j24748k28754j75195r4851n1547k5427j6800j7736j2905
$$ 484046 685619 782996 658248 429494 254299 159448 107901 82474 65674 47938 35033
12081C5033n357l558q924l582M313M165k879N15j504n079P48P96n54J348J326
$$ 35033 29676 26118 17194 13612 17925 22090 19211 19726 18222 13143 13891 14687 14133 15481 16807
12066A6807o45M134j581P73n191l042k885O333K022o631j994R095L834l346Q047
$$ 16807 16162 20296 18715 19488 14297 11255 8370 14703 16725 10094 8100 17195 21029 17683 25730
12051B5730J2044L8619N9830O9252M2622k0604o0914n9588l5832k1729j2201o005
$$ 25730 37774 76393 136223 205475 248097 227493 166579 106991 71159 49430 37229 31224
12039C1224p922r392k809N587M600K002m598l146q459P89K228l967j589j314L018
$$ 31224 23302 13910 11101 16688 21288 23290 18692 15546 7087 7876 10104 6137 4548 3234 6252
12024F252j362k763k670j759k862k827P783J224J766J1855K794K929k20p543r523
$$ 6252 4890 2127 -543 -2302 -5164 -7991 -208 1016 2782 14637 17431 20360 20140 12597 3074
12009C074l265M63L208k002m808N694k110R07J610l7l66j410O341n696l451Q78
$$ 3074 -191 272 3480 1478 -3330 2364 254 1161 2771 2734 2368 958 7299 1603 -1848 -970
11993i70P424j221K797o00n527M65n78M306k060j316J851o89p833O55K947m01
$$ -970 6454 5233 8030 7430 1903 2368 1790 6096 4036 2720 4571 3882 -3951 -3296 -349 -750
11977g50K209q94O95P101L860l199l231k724O378N119r46q850j023m300j949r86
$$ -750 1459 565 1260 8361 12221 9022 5791 3067 9445 14564 13618 4768 3745 -555 -2504 -3490
11961c490m403l288n37l976k071n735L199J1047O525L935j47M96r705o076J553
$$ -3490 -7893 -11181 -11718 -15694 -17765 -23500 -20301 -9254 -2729 1206 1059 1555 -8150 -14226 -12673
11946a2673L183K717J499K649k628l608k484l726N635J2855L497p646l280L812
$$ -12673 -9490 -6773 -5274 -2625 -5253 -8861 -11345 -15071 -9436 3419 6916 -730 -4010 -198
11932a98j90P62k789o480M278P697p00K792L890q69p738k220k362L967K058R93
$$ -198 -388 374 -2415 -8895 -4617 3080 2380 5172 9062 8193 455 -1765 -4127 -160 1898 2891
11916B891J145J432J6J176j764k934K611J1209j976l787n801J117q66m549N832
$$ 2891 4036 5468 5484 6660 4896 1962 4573 15782 13806 10019 4218 5335 4469 -80 5752
11901E752m231l303j319p07K321J922K335L039O06N84K77l443r360p310P224K721
$$ 5752 1521 -1782 -3101 -3808 -1487 435 2770 5809 6415 6999 7276 3833 -5527 -12837 -5613 -2892
11885b892N34M806O90l541k415L35M4p636O958P159l495k308l28l76l653o336
$$ -2892 -2358 2448 3138 -403 -2818 -2483 -2439 -10075 -3117 4042 547 -1761 -2089 -2465 -6118 -12454
11869a2454k016N215O144O141k863p68J219J881k673k517J157k065M09l078o337
$$ -12454 -14470 -9255 -3111 3030 167 -601 618 2499 -174 -2691 -1534 -3599 -3190 -6268 -12605
11854a2605N469k416k848O84J265J1508L939Q29p437o228n342o500L382M615L928
$$ -12605 -7136 -9552 -12400 -11716 -10451 1057 4996 5825 -1612 -7840 -13182 -19682 -16300 -11685 -7757
11839g757L929O947l384K613l097j65J407l013J326N160k197N257k110n518l172
$$ -7757 -3828 3119 -265 2348 -749 -914 493 -2520 -1194 3966 1769 7026 4916 -602 -3774
11824c774Q100K949j0488o267K85L084L966N686M525n532k47K242K31M69j078
$$ -3774 4326 7275 -3213 -9480 -9195 -6111 -2145 3541 8066 2534 2287 4529 4760 5229 4151
11809D151o002l090L732k983n404l853m110r94l97P094P694L697k769j408l210
$$ 4151 -1851 -4941 -1209 -4192 -9596 -13449 -17559 -18553 -18950 -11856 -4162 -465 -3234 -4642 -7852
11794g852N0K030l402j544L657J0603J338l110n067J584k127l674O368N137m922
$$ -7852 -7802 -5772 -9174 -10718 -7061 3542 4880 1770 -3297 -1713 -3840 -7514 -1146 3991 -931
11779i31j113L91o991j303K889P476j88O132J347P62j024o49o73M910o46k020
$$ -931 -2044 -1653 -8644 -9947 -7058 418 230 6362 7709 8471 7447 6798 6125 11035 10389 8369
11763H369n188k742K997o333K09J214p477kM070L331K662P246j800r748q712n843
$$ 8369 3181 439 3436 -2897 -2688 -1474 -8951 -8953 -4883 -1552 1110 8356 6556 -3192 -11904 -17747
11747a7747O466m87J807j000j599O538o47n444M780O678k507k110l782p35o54
$$ -17747 -11281 -11768 -9961 -10961 -12560 -6022 -6669 -12113 -7333 -655 -3162 -5272 -9054 -9789 -10443
11732a0443K787J62O57L743l98k414J728J291m25k85M16J321m24l525O171J359
$$ -10443 -7656 -7494 -6837 -3094 -3492 -5906 -4178 -2887 -3312 -3597 -3181 -1860 -2284 -5809 362 1721
11716A721J124N93k43O88p224M90N761K62l68n594J421n222j164K150K333L323
$$ 1721 2845 3438 3195 3883 -3341 -2851 2910 3172 2804 -2790 -1369 -6591 -7755 -5605 -3272 51
11700E1j800l873P66K69J447K907J883n75N19J240k09Q8n295n229j042K367j543
$$ 51 -1749 -5622 -4856 -4587 -3140 -233 1650 1075 1594 2834 2625 2713 -2582 -7811 -8853 -6486 -8029
11683h029n271K5J794K509M543Q231j528l635l035l037K306J615l426j462N093
$$ -8029 -13300 -13275 -11481 -8972 -4429 3802 2274 -1361 -4396 -7433 -5127 -3512 -6938 -8400 -3307
11668c307K705k375R97R568K647K787M287N57k110o621J325P50l436n138j386
$$ -3307 -602 -2977 -1980 7588 10235 13022 17309 17866 15756 9135 10460 11210 7774 2636 1250
11653A250L163n115p794P4N149l00o582K0L287Q259j010p75L464k62q08K14m37
$$ 1250 4413 -702 -8496 -8422 -3273 -3573 -10155 -10135 -6848 1411 401 -374 3090 2828 2020 2234 1797
11636A797K991o00k300m385n137N225K378j677J068k688p465r21o5k668K267N382
$$ 1797 4788 4188 1888 -2497 -7634 -2409 -31 -1708 -640 -3328 -10793 -11714 -11779 -14447 -12180 -6798
11620f798L755K190M741N135j770J483q950k825n74L428N224R50q9n227m089M895
$$ -6798 -3043 -853 3888 9023 7253 8736 -214 -3039 -3613 -185 5039 5989 5900 673 -3416 1479
11604A479M846l334j625q916J0692K789n964n443l51j911K243J758o444j500k980
$$ 1479 6325 2991 1366 -7550 3142 5931 -33 -5476 -5827 -7738 -5495 -3737 -10181 -11681 -14661
11589a4661N00M190J74J390j081J1217L542n301j084K823J026J239l823p49R43
$$ -14661 -14161 -9971 -9797 -8407 -9488 1729 5271 -30 -1114 1709 2735 3974 151 -598 345
11574C45J322l622M21J795l966k694J915l700L734O727q52n245l068R52K13J200
$$ 345 1667 -1955 -1534 261 -3705 -6399 -4484 -8184 -4450 2277 1425 -3820 -6888 -5936 -5723 -4523
11558d523n3l45n374L243k518j143N576O946l582l112p496L336K439L000k372
$$ -4523 -4576 -4921 -10295 -7052 -9570 -10713 -5137 1809 -1773 -4885 -12381 -9045 -6606 -3606 -5978
11543e978n821J950M936J587j054O636p044o976J1651M243o57J358J297L277J367
$$ -5978 -11799 -9849 -4913 -3326 -4380 2256 -4788 -11764 -113 4130 3473 4831 6128 9405 10772
11528A0772j111m588l892q18m190L115q20L296N696j555k822J98M803p4l490k673
$$ 10772 9661 5073 1181 363 -3827 -712 -1532 1764 7460 5905 3083 3281 8084 8010 4520 1847
11512A847L060k157k274l781m38J828M867K318p581l122J968J722R10N978M011
$$ 1847 4907 2750 476 -3305 -3743 -1915 2952 5270 -2311 -5433 -3465 -1743 -833 5145 9156
11497I156J484m147J599m899j371j281l640j728J0919P253j948r803p60O002L399
$$ 9156 10640 6493 8092 3193 1822 541 -3099 -4827 6092 13345 11397 1594 834 6836 10235
11482A0235j450n872q20m582o79p31K930K484j335O5m83k828m353N223L606l0
$$ 10235 8785 2913 2093 -2489 -3168 -3899 -969 1515 180 245 -238 -3066 -7419 -2196 1410 1380
11466A380Q33M116j0893l101J0530J703K792m591m984k191P791K517J021K048
$$ 1380 2213 6329 -4564 -7665 2865 4568 7360 2769 -2215 -4406 3385 5902 6923 8971
11452H971l386l501J755k396o998N465N062k92p013m86j957L111R68m010P384
$$ 8971 5585 2084 3839 1443 -5555 -90 4972 4680 -2333 -2819 -4776 -1665 -697 -4707 2677
11437B677N563j903L149l301j068L16m251n618k242M505M269K98n787j327M667
$$ 2677 8240 6337 9486 6185 5117 5433 1182 -4436 -6678 -2173 2096 2394 -3393 -4720 -53
11422e3L211L424j696m916n130m73J470J893j13k70l487J881M240Q173j185m766
$$ -53 3158 6582 4886 -30 -5160 -5633 -4163 -2270 -2383 -2653 -6140 -4259 -19 8154 6969 2203
11406B203j100M88p356r167M73N855o35J758l682K559K033K999O530O242N441
$$ 2203 1103 1591 -5765 -14932 -14459 -8604 -9239 -7481 -11163 -8604 -6571 -3572 2958 9200 14641
11391A4641n356n451j832M816J153q847p085l478J841N682N910K371m451n523
$$ 14641 9285 3834 2002 6818 7971 -876 -7961 -11439 -9598 -3916 1994 4365 -86 -5609
11377e609l181K305Q429M787m97K827M697p36m030j890o65j773J176j138m743
$$ -5609 -8790 -6485 1944 6731 6234 9061 13758 13022 8992 7102 6437 4664 5840 4702 -41
11362d1M96J783p91K538J59P79M080m117l391k522J041P089n372o208M672J2645
$$ -41 455 2238 1447 3985 4144 4923 9003 4886 1495 -1027 14 7103 1731 -4477 195 12840
11346A2840j738q97j300J794p163P74k40J972n554r756J722K69N082K845L24p092
$$ 12840 11102 10205 8905 10699 3536 4310 4070 6042 488 -9268 -7546 -7277 -2195 650 974 -6118
11330f118l459J358m40J525M51P834K315n173m468K889N843L041M728M023k602
$$ -6118 -9577 -8219 -8659 -7134 -6683 1151 3466 -1707 -6175 -3286 2557 5598 10326 14349 11747
11315A1747n835k951l352L310q647m382L367o639q519M920M411O438P697j617
$$ 11747 5912 2961 -391 2919 -5728 -10110 -6743 -13382 -21901 -16981 -12570 -6132 1565 -52
11301e2r90r51r13J191L267k518l797k369J0094L960Q03k105k525m835l128O784
$$ -52 -1042 -1993 -2906 -1715 1552 -966 -4763 -7132 2962 6922 7725 5620 3095 -1740 -4868 1916
11285A916P932J2746O795j903l53L529o542p357p392l759K249j353j962q24mj105
$$ 1916 9848 22594 29389 27486 27133 30662 24120 16763 9371 5612 7861 6508 4546 3722 3718 2613
11269B613l634L445K31l285K309J050n436n174k844R57K38j391J227j798N075
$$ 2613 -1021 2424 2655 -630 1679 2729 -2707 -7881 -10725 -9768 -9530 -10921 -9694 -11492 -6417
11254f417O102P38n530J989L533j128j197J133j559j230P456O738j1915j0259
$$ -6417 -315 423 -5107 -3118 415 -713 -1910 -777 -2336 -3566 3890 10628 -1287 -11546
11240a1546k135L68Q361L733k224K453j293J309L478Q6j817M232J807o703o205
$$ -11546 -13681 -13313 -4952 -1219 -3443 -990 -2283 -974 2504 2590 773 5005 6812 109 -6096
11225f096j654q61R276J043k049J979O160l817k126K185k763m17K546L021O73
$$ -6096 -7750 -8611 665 1708 -341 1638 7798 3981 1855 4040 1277 860 3406 6427 7100
11210G100j058N65P316K484K283L383L862l774K133Q04M522m41j137K334J52n29
$$ 7100 6042 6607 13923 16407 18690 22073 25935 22161 24294 25098 29620 29179 28042 30376 30528 29999
11194B9999l052j31j198m726j0712k085M949O94k268R54O867q515P78k756m920
$$ 29999 26947 26816 25618 20892 10180 8095 13044 13738 11470 12424 19291 10776 11554 8798 3878
11179C878q65j967o528Q314M977R372J2648P922R179m470m380m120r326o837j2999
$$ 3878 3013 1046 -5482 2832 7809 17181 29829 37751 46930 42460 38080 33960 24634 17797 4798
11164D798k199J04l192p427R327R374j83k022k654n640r22L672K623J2330j963
$$ 4798 2599 2703 -489 -7916 1411 10785 10602 8580 5926 286 -636 3036 5659 17989 16026
11149A6026n735o904L297L31l009j412j964k765k154L266L113q09k318J144l318
$$ 16026 10291 3387 6684 7015 4006 2594 630 -2135 -4289 -1023 2090 1281 -1037 107 -3211
11134c211j322J002M07k219K155O484O665N372k649q535J73p2k542n522R41M966
$$ -3211 -4533 -3531 -3124 -5343 -3188 3296 9961 15333 12684 4149 4322 4250 1708 -3814 -2873 2093
11118B093J148Q16j981K15m968M943K571J44k052p366r077J594P538L140j854
$$ 2093 3241 4057 2076 2291 -2677 2266 4837 4981 2929 -4437 -13514 -11920 -4382 -1242 -3096
11103c096K269L69M283j381k800L264j018q73j257j953J300o962m098l105J647
$$ -3096 -827 -458 3825 2444 -356 2908 1890 1017 -240 -2193 -893 -7855 -11953 -15058 -13411
11088a3411J0034J486k86L41j805l51L155O480J997r095n137j208K394K994Q881
$$ -13411 -3377 -1891 -2177 -1836 -3641 -3992 -837 5643 7640 -1455 -6592 -7800 -5406 -2412 6469
11073F469j871j259j513N34L557M436M212k473k607l99Q60o81r92n104p9n662
$$ 6469 4598 3339 1826 2360 5917 10353 14565 12092 9485 9086 9946 9265 8273 3169 3090 -2572
11057b572J171L176n033P18j760n231Q32P085M836m19l376r526m981R45K318N03
$$ -2572 -1401 1775 -3258 -2540 -4300 -9531 -8699 -1614 3222 2803 -573 -10099 -15080 -14135 -11817 -11314
11041a1314M619O298J592l565n086K146L993N41k789n564l88R016P053r42m891
$$ -11314 -6695 -397 1195 -2370 -7456 -5310 -1317 -776 -3565 -9129 -9517 -501 6552 5610 719
11026G19k824P52M284O90k272m888l351N533J670R20N715L159l790r88K111n440
$$ 719 -2105 -1353 2931 3621 1349 -3539 -6890 -1357 313 1233 6948 10107 6317 5329 7440 2000
11010B000j821J810M519j551o854j1864O93N182Q935Q132k423k244k667k071m547
$$ 2000 179 1989 6508 4957 -1897 -13761 -13068 -7886 1049 9181 6758 4514 1847 -224 -4771
10995d771N164K817j518J13l227J780m945L136K967j73n691p98m333m999K285
$$ -4771 393 3210 1692 1805 -1422 358 -4587 -1451 1516 1343 -4348 -5146 -9479 -14478 -12193
10980a2193N905P97J815l35L184L569l042J182M989O310n819m743m152K924k163
$$ -12193 -6288 -5491 -3676 -4011 -827 2742 -300 882 5871 12181 6362 1619 -2533 391 -1772
10965a772M646O311J258m617k616k09L682J363P56R636j790j3021O39k96J49O574
$$ -1772 2874 9185 10443 5826 3210 3001 6683 8046 8802 18438 16648 3627 4266 3970 4119 10693
10949A0693l257p131M051K929j934K992k900j954l426l276K272M817P571P419
$$ 10693 7436 305 4356 7285 5351 8343 5443 3489 63 -3213 -941 3876 11447 18866
10935A8866J038l541K642j304p520J340L473m123L384l392r6P05P19L563N002
$$ 18866 19904 16363 19005 17701 10181 11521 14994 10871 14255 10863 10767 11472 12191 15754 20756
10920B0756L173N760N993N28J2615K1585J7977J8560Q991K244p919j6841j1910
$$ 20756 23929 29689 35682 36210 48825 70410 88387 106947 115938 118182 110263 93422 81512
10907H1512j8763j5362j6334p985k415J45j106m56n087j55m32p66N87l135o956
$$ 81512 62749 47387 31053 23068 20653 20798 19692 19236 14149 13994 13562 12796 13383 10248 3292
10892C292J611M963m56m149L969J3249R306J522r57n78K346k0K064P12J232k029
$$ 3292 4903 9866 9410 5261 9230 22479 31785 33307 32350 31772 34118 34098 36162 36874 38106 36077
10876C6077N717K329P052J7786J9028L0854K9478K0074J9856J0450M26r845j6857
$$ 36077 41794 44123 51175 68961 87989 118843 148321 168395 188251 198701 199127 189282 172425
10863A72425j5861j9105k5635k0167k667r700j4751j1224p015P59J588n419m132
$$ 172425 156564 137459 111824 91657 88990 79290 64539 53315 46300 47059 48647 43228 39096
10850C9096j827J395k543j1154k488K365k193m265m304K947l509m880o3n32J8
$$ 39096 37269 38664 36121 24967 22479 24844 22651 18386 14082 17029 13520 8640 8577 8045 8063
10835H063m268J230Q243N070K260L973j079Q597J2265Q692J0834J6294J4838J9184
$$ 8063 3795 5025 13268 18338 20598 24571 23492 32089 44354 53046 63880 80174 95012 114196
10821A14196P500L54L393k0621k3164j7018j6022j6372o811J820j590n129q576
$$ 114196 121696 122050 125443 104822 81658 64640 48618 32246 25435 27255 25665 20536 11960
10808A1960l806m649r79L095m395M320L941O110l248R88R919J319o468r038j138
$$ 11960 8154 3505 2526 5621 1226 5546 9487 15597 12349 13337 23256 24575 18107 9069 7931
10793G931n232p093R41Q701L98M520j684l234O75K954j434m217m17Q226Q968J334
$$ 7931 2699 -4394 -3453 5248 5646 10166 8482 5248 5923 8877 7443 3226 2809 11035 20003 21337
10777B1337j611p287o688J780Q564J789l236o880N143K204p582j1194K521M536
$$ 21337 19726 12439 5751 7531 16095 17884 14648 7768 12911 15115 7533 -3661 -1140 3396
10763C396n82N99M35L687P067m97N195O722K879l349p62J645l7l074J165q955
$$ 3396 2814 3413 3848 7535 14602 14105 19300 26022 28901 25552 24790 26435 26398 23324 24489 15534
10747A5534j1235N445N813J140l87m272J865j570l638K53O063q62K38P290N024
$$ 15534 4299 9744 15557 16697 16310 12038 13903 12333 8695 8948 15011 14149 14387 21677 26701
10732B6701m377l938K003L168n177r787k535L204J34j2325j19N347J0838L965
$$ 26701 22324 18386 20389 23557 18380 8593 6058 9262 9396 -2929 -3048 2299 13137 17102
10718A7102j0777r778r67J583l55K777O264R399N397K728P077J625P71k150k39
$$ 17102 6325 -3453 -4420 -2837 -3192 -415 5849 15248 20645 23373 30450 32075 32846 30696 30457
10703C0457q73l692r70k220M348o786n908N17l667K21M652m62M023K039j988J293
$$ 30457 29584 25892 24922 22702 27050 20264 14356 14873 11206 11427 16079 15617 19640 21679 19691 20984
10687B0984J626l252k911j398k014m8n00j027M560Q46J397J392M734J809m731
$$ 20984 22610 19358 16447 15049 13035 12987 12487 11460 16020 16866 18263 19655 24389 26198 21467
10672B1467J946m032K065J0052M023j445k211j826L889M373n840l133L024o110
$$ 21467 23413 19381 21446 31498 35521 34076 31865 30039 33928 38301 32461 29328 32352 26242
10658B6242p616L570L047o232o171J236J552j0119n196J0203R390m37n055l600
$$ 26242 18626 22196 25243 19011 12840 14076 15628 5509 313 10516 19906 19469 14414 10814
10644A0814N147k115p974L43M468L722k162K786N25k862O445N125m746j177L707
$$ 10814 15961 13846 5872 6215 10683 14405 12243 15029 15554 12692 19137 24262 19516 18339 22046
10629B2046Q40J891J0921J0232J3333j38P741J1729M611n251n388j0352p070k264
$$ 22046 22886 24777 35698 45930 59263 59125 66866 78595 83206 77955 72567 62215 55145 52881
10615E2881O38J389k9j900L142O275J2408M547l859L41K340k418r035J463R901
$$ 52881 53519 54908 54879 52979 56121 62396 74804 79351 75492 75833 78173 75755 66720 68183 78084
10600G8084J0817R281L170Q655K690K861K440Q818J6277K7956L2246N3246Q4740
$$ 78084 88901 98182 101352 110007 112697 115558 117998 126816 143093 171049 203295 256541 341281
10587C41281J09009J40541J82835K21933K30986J99382J26616K6613q7426j78017
$$ 341281 450290 590831 773666 995599 1226585 1425967 1552583 1579196 1491770 1313753
10577A313753k25572k28549k01274j51688j06912p2997m6903l3087l0708k1656
$$ 1313753 1088181 859632 658358 506670 399758 326761 279858 246771 216063 194407
10567A94407l707p231k562k344k500L28N629n07p674p127l050L506l92L474j674
$$ 194407 190700 183469 180907 178563 176063 176391 182020 181513 173839 166712 163662 167168 166776 170250 168576
10552A68576q797l792n07o551p107M276J9028J1871J7631L3138M3718L5288L2335
$$ 168576 159779 155987 155480 148929 141822 146098 165126 176997 194628 227766 271484 306772 339107
10539C39107J6614m958j3396j4274p624j0135r955m969q081m898M565P961J0312
$$ 339107 355721 350763 337367 323093 315469 305334 295379 290410 282329 277431 281996 289957 300269
10526C00269J3339J5303K2921L2749K2989K1815L1035M6329N9295P2815Q8330
$$ 300269 313608 328911 351832 384581 407570 429385 460420 506749 566044 638859 727189
10515G27189J02634J17710J35090J55544J66808J87806K36123L19847M42078O48913
$$ 727189 829823 947533 1082623 1238167 1404975 1592781 1828904 2148751 2590829 3239742
10505C239742R89088J482767K094144K738906L173498L091502K335799J018055
$$ 3239742 4228830 5711597 7805741 10544647 13718145 16809647 19145446 20163501
10497B0163501n25439j881032k752688k999817k732142k205285j633891j149582
$$ 20163501 19638062 17757030 15004342 12004525 9272383 7067098 5433207 4283625
10489D283625p85469n31409l70698k65975j88916j44795j27021j08955q8022p5881
$$ 4283625 3498156 2966747 2596049 2330074 2141158 1996363 1869342 1760387 1672365 1596484
10479A596484n9484m2286k3842L567K5855P1049J33746K29262L48714M87634O10646
$$ 1596484 1537000 1494714 1470872 1474439 1500294 1571343 1705089 1934351 2283065 2770699 3381345
10468C381345O88280O65629N32390L49293K35126K85159N57634J086840J884291
$$ 3381345 4069625 4735254 5267644 5616937 5852063 6137222 6694856 7781696 9665987
10459I665987K967036M255571N422312N845973M926103K593015m12950k861219
$$ 9665987 12633023 16888594 22310906 28156879 33082982 35675997 35263047 32401828
10451C2401828l882339l566697k674685k046670k036256k381026k664835k571664
$$ 32401828 28519489 24952792 22278107 20231437 18195181 15814155 13149320 10577656
10443A0577656k119640j525135r39532m60791j24132O9480N5055j66178m52731
$$ 10577656 8458016 6932881 5993349 5532558 5408426 5477906 5532961 5366783 4914052
10434D914052o60603p05776o10427m62728l24661k20664j38459p7356k3145L2583
$$ 4914052 4253449 3547673 2937246 2474518 2149857 1929193 1790734 1713378 1690233 1722816
10424A722816P4756J07651J54571J86800K15860K42352K79232L44428M54104O63053
$$ 1722816 1797572 1905223 2059794 2246594 2462454 2704806 2984038 3328466 3782570 4445623
10414D445623J015453J559954K299394L154381L886237M108936L460769J889176
$$ 4445623 5461076 7021030 9320424 12474805 16361042 20469978 23930747 25819923
10406B5819923k18919k238877l602402m062380l758947l025943k213986j545999
$$ 25819923 25601004 23362127 19759725 15697345 11938398 8912455 6698469 5152470
10398E152470j055917p31438n10104l72054k88444k38690k07190j99351j87493
$$ 5152470 4096553 3365115 2855011 2482957 2194513 1955823 1748633 1549282 1361789
10389A361789j61953j44638j23020j01349q0376p0047n4299m1707m8208m4209
$$ 1361789 1199836 1055198 932178 830829 750453 680406 626107 584400 536192 491983
10379D91983l8428l6828l2351k5180k8347j5574p364q090l095l884n949j7586
$$ 491983 453555 416727 384376 359196 330849 315275 307911 299821 296726 292842 286893 269307
10367B69307k8144k1687j7621j9370r601p917j1268p196p868j1646p569M26j915
$$ 269307 241163 219476 201855 182485 172884 164967 153699 146503 138635 126989 119420 119846 117931
10354A17931j1561j8616l257K2812K8840J1784L620L121k940n608M493M326n327
$$ 117931 106370 87754 84497 107309 136149 147933 151553 154674 151734 146126 150619 154945 149618
10341A49618L422N818N692K000M433J0267O694L939R508M624j036q682o686n631
$$ 149618 153040 158858 164550 166550 170983 181250 187944 191883 201391 206015 204979 196297 189611 183980
10327A83980k299m309j797M88K363M65q62n447O703O541L011l295j4753j3881
$$ 183980 181681 177372 175575 176063 178426 178891 178029 172582 179285 185826 188837 185542 170789 156908
10313A56908k292r85n376j1405l824k593m962LJ2910K8226R776j1703j2059r681
$$ 156908 154616 153631 148255 136850 133026 130433 125471 125474 138384 166610 176386 164683 152624 142943
10299A42943j2950p847n429j57j2587j9221k738J2491K8100M1945M0950J5976
$$ 142943 129993 122146 116717 116560 103973 84752 82014 94505 122605 164550 205500 221476
10287B21476q728p670p133J269p296p6J661n587l93m80k835M919P627Q101Q326
$$ 221476 212748 205078 197945 199214 191918 191842 193503 187916 187523 187043 184208 189127 196754 204855 213181
10272B13181J264N848J2932R336m155j3002j7303j8387j6576r996n040J233M253
$$ 213181 214445 220293 233225 242561 238406 225404 208101 189714 173138 163142 158102 159335 163588
10259A63588J407P817J5749J6897O097P927R047O746Q684J7627K0147J5597R654
$$ 163588 164995 172812 188561 205458 211555 219482 228529 235275 243959 261586 281733 297330 306984
10246C06984Q424J4748l34p962M07M451J0036J2475J7372J4749p07r999j2099
$$ 306984 315408 330156 329822 321860 322267 326718 336754 349229 366601 381350 380643 370644 358545
10233C58545p918J499J0838J4269J5796J6943J7985J3558J9565J4620J2923O481
$$ 358545 350627 352126 362964 377233 393029 409972 427957 441515 461080 475700 488623 495104
10221D95104Q487J7521J9117L1691M7084M5607L5349J4595J7129L2482M6346M4938
$$ 495104 503591 521112 540229 571920 619004 664611 699960 714555 731684 764166 810512 855450
10209H55450K9684K7221M1486N7144P8132Q2841O7929N9652O4241P3851Q4878
$$ 855450 885134 912355 953841 1010985 1089117 1171958 1239887 1299539 1363780 1437631 1522509
10198A522509R6107R2685R0933R8491J15436J49220J97239K22480K31919K53628
$$ 1522509 1618616 1711301 1802234 1900725 2016161 2165381 2362620 2585100 2817019 3070647
10188C070647L07054L84750M95644O41506Q03615R68183J123935J265862J343158
$$ 3070647 3377701 3762451 4258095 4899601 5703216 6671399 7795334 9061196 10404354
10179A0404354J268527J120979J190103J581731K061577K464522L059529M336547
$$ 10404354 11672881 12793860 13983963 15565694 17627271 20091793 23151322 27487869
10171B7487869O599931J0320828J6550304K6838083M3038748O5128261Q4434598
$$ 27487869 34087800 44408628 60958932 87797015 130835763 195964024 280398622
10164B80398622P6962698K3645233m8165051q6233469p9130340n4440663l3785911
$$ 280398622 357361320 381006553 332841502 246608033 167477693 113037030 79251119
10157G9251119k0980969j3639784r373359o715174m953723l720985k746789j913591
$$ 79251119 58270150 44630366 35257007 28541833 23588110 19867125 17120336 15206745
10149A5206745j177042o51899n16523p97763j173011j315171j220929j044504
$$ 15206745 14029703 13377804 12861281 12063518 10890507 9575336 8354407 7309903
10141G309903q66083p07116n76791m88769l97181l35905k91846k59769k47513
$$ 7309903 6443820 5736704 5159913 4671144 4273963 3938058 3646212 3386443 3138930
10132C138930k28229k20112j84732j52122j22458j00075q8707p0192p3181p3938
$$ 3138930 2910701 2690589 2505857 2353735 2231277 2131202 2042495 1972303 1899122 1825184
10122A825184p0255p6802q0802p5053p1526p3654o2327m0245n1763o0470n8195
$$ 1825184 1754929 1678127 1597325 1522272 1450746 1377092 1314765 1274520 1222757 1162287 1104092
10111A104092m9900l2125j1883j7572k6898l7745m4880m5911m0075l3997j8139
$$ 1104092 1054192 1022067 1010184 992612 965714 927969 883089 837178 797103 763106 744967
10100G44967j3110q397J361k18j3490j8282l0286l2576j6971j6224j7473j6439
$$ 744967 731857 723460 724821 724603 711113 692831 662545 629969 612998 596774 579301 562862
10088E62862j4779o899n115p540n547k113m42N189J1998J2587K856o122P4L714
$$ 562862 548083 541184 536069 528529 522982 520869 520427 525616 537614 550201 553057 546935 547009 550723
10074E50723k523q924k359m921j4252j7634j4352j3368j9378j0757j0754j7726
$$ 550723 548200 539276 536917 531996 517744 500110 485758 472390 453012 442255 431501 413775
10062D13775k1480k5174k1649k5400j0151r375p778L578Q15K909Q818N864P960
$$ 413775 392295 367121 345472 320072 309921 300546 292768 296346 297161 300070 308888 314752 322712
10049C22712J1222J1305P463J5834L3315L2357R294P095L0053N9396P3628P8412
$$ 322712 333934 345239 352702 368536 401851 434208 443502 450597 480650 540046 613674 692086
10037F92086O9755P734n1632p6065o2056n1476m2496l1563k5871j7533j3507k1980
$$ 692086 761841 769575 717943 641878 579822 528346 485850 454287 428416 410883 397376 375396
10025C75396l2210k4824j6830j4488j616M925k449p026r702m937j5663j1350k1683
$$ 375396 343186 318362 301532 287044 285428 290353 287904 280878 271176 266239 250576 239226 217543
10012B17543k8015j8544q487j753L015Q178o731l08n72K353k103K999Q066L682
$$ 217543 189528 170984 162497 160744 163759 171937 165206 164898 164326 166679 164576 167575 175641 179323
9998A79323O760o567r66p244J950J4298K4616L0474K9703K1656J1214o738q967
$$ 179323 186083 179516 178550 171306 173256 187554 212170 242644 272347 294003 305217 298479 289512
9985B89512k2916k7967j5855k3172j5826j3267n088M248J9869K6904K5160J7996
$$ 289512 266596 238629 222774 199602 183776 170509 165421 169669 189538 216442 241602 259598
9973B59598L739q762j4129q938p020n571J433p23n184l836o895j6908r902j5176
$$ 259598 263337 254575 240446 231508 224488 218917 220350 219627 214443 210607 203712 186804 176902 161726
9959A61726j5660j6537o819J484N771N753J0041Q426j12K497j0296j7532j5450
$$ 161726 146066 129529 122710 124194 129965 135718 145759 154185 154073 156570 146274 128742 113292
9946A13292o31K096n943Q36N160J804j437J693L484l068p375p641k511l507p49
$$ 113292 112661 114757 108814 109650 114810 116614 115177 116870 120354 117286 109911 102270 99759 96252 95503
9931I5503J2665K176K753l944l785O669p49L675m345q146N020K182k625O961K211
$$ 95503 108168 110344 113097 109153 105368 112037 111288 114963 110618 102472 107492 109674 107049 114010 116221
9916A16221L454N195O765J4009J4763P523p729l796n798p326m095j275l031k070
$$ 116221 119675 124870 131635 145644 160407 167930 160201 156405 150607 143281 139186 137911 134880 132810
9902A32810N98l745N087J374o280m167O2j223n618K893L887l494n426L743P951
$$ 132810 133408 129663 134750 136124 129844 125677 125739 124516 118898 121791 125678 122184 116758 120501 128452
9887A28452J426L880O371J162n150o57R230L935m016M53M402L792l31j229M548
$$ 128452 129878 133758 140129 141291 136141 135484 144714 148649 144633 145086 149488 153280 152949 151720 156268
9872A56268L761j554p049J0550M872n596J827O140o260j3844l937J1581K0429
$$ 156268 160029 158475 151426 161976 166848 161252 163079 169219 162959 149115 145178 156759 177188
9859A77188K7451K7024J7850J3110J7154J2109j3857l5815k9552j5813r859n060
$$ 177188 204639 231663 249513 262623 279777 291886 278029 242214 212662 196849 186990 181930
9847A81930R63O785R761P356P228R475J3493J6773J6564J176q399p228J290R010
$$ 181930 182893 189678 199439 206795 214023 223498 236991 253764 270328 271504 263105 255877 257167 266177
9833B66177M248n06J726K032O293R236O795J0099R918J0422J2133O569N961J1393
$$ 266177 270425 269919 271645 273677 279970 289206 296001 306100 316018 326440 338573 345142 351103 362496
9819C62496J4851J8760L5527M1725L4698L2003K5888J1337L453J2782J1382K723
$$ 362496 377347 396107 431634 473359 508057 540060 565948 577285 580738 593520 604902 607625
9807F07625K988N572K00R908J8457J5429K0414K7359K2572J9069K0837J8181J5318
$$ 607625 610613 616185 616385 626293 644750 660179 680593 707952 730524 749593 770430 788611 803929
9794H03929J1966R441J5747J7101K2281J7337J7329J7011J7817J1777O029J0551
$$ 803929 815895 825336 841083 858184 880465 897802 915131 932142 949959 961736 967765 978316
9782I78316P579J7391K2773K6569L0519M0097M3494M6900N7660P8118J03642J37124
$$ 978316 985895 1003286 1026059 1052628 1083147 1123244 1166738 1213638 1271298 1349416 1453058 1590182
9770A590182J94349K85633M03317N89900Q32977J066050J106565Q29693L72550
$$ 1590182 1784531 2070164 2473481 3063381 3896358 4962408 6068973 6898666 7271216
9761G271216p5981n83507j038615j170638r77135p07527m78256l25751k26792
$$ 7271216 7195235 6611728 5573113 4402475 3425340 2717813 2239557 1913806 1687014
9752A687014j57684j10178o0001j7545J1255L9747P9638J26821J76034K13423
$$ 1687014 1529330 1419152 1359151 1341606 1352861 1392608 1472246 1599067 1775101 1988524
9742A988524K29594K03038J41164N6322j7877n6133l8318L4954J23007J71279
$$ 1988524 2218118 2421156 2562320 2618642 2600765 2544632 2506314 2541268 2664275 2835554
9732B835554J51337J08500J58904L26308N96112R62965J497837K243335L046456
$$ 2835554 2986891 3095391 3254295 3580603 4176715 5139680 6637517 8880852 11927308
9723A1927308L436402K827872J249543o10232j879727j926420j064171k03923
$$ 11927308 15363710 18191582 19441125 18830893 16951166 15024746 13960575 13756652
9715A3756652j14506r16839j897341k237645j918750j388319r37650o09659l81712
$$ 13756652 13642146 12725307 10827966 8590321 6671571 5283252 4345602 3735943 3354231
9706C354231k22047j10904n7049r2605j89427k26550j81391j06644k9657M3361
$$ 3354231 3132184 3021280 2964231 2871626 2682199 2455649 2274258 2167614 2137957 2181318
9696B181318J16616K23872L50787M44503M06482J56989n9171k1935J78291M55269
$$ 2181318 2297934 2521806 2872593 3317096 3723578 3880567 3821396 3799461 3977752 4433021
9686D433021P77384J224388J854465K587370L075601K629837J090868k99114l68577
$$ 4433021 5210405 6434793 8289258 10876628 13952229 16582066 17672934 17373820 17005243
9677A7005243P62048K172090K818942J947483l18977k615087l586183l380674
$$ 17005243 17767291 19939381 22758323 24705806 24386829 21771742 18185559 14804885
9669A4804885k860091k376718j861241j321891q42399m72422k61744l03788m87834
$$ 14804885 11944794 9568076 7706835 6384944 5542545 5070123 4808379 4504591 4016757
9660D016757n55734m64963l35325k30083j58422q9686r699O0363J08534P3539
$$ 4016757 3461023 2996060 2660735 2430652 2272230 2182544 2172845 2233208 2341742 2415281
9650B415281l0307q3759n1222K0208J21638K29568L61507N42578P58386Q99219
$$ 2415281 2384974 2301215 2249993 2270201 2391839 2621407 2982914 3525492 4283878 5183097
9640E183097Q17483N52606M73255Q30958J453169K077916K435237K294384J418243
$$ 5183097 6000580 6553186 7026441 7857399 9310568 11388484 13823721 16118105 17536348
9631A7536348J4731j155558j774412k248968k537804k317593j740900j179371
$$ 17536348 17551079 16395521 14621109 12372141 9834337 7516744 5775844 4596473
9623D596473p58755m94250m00878l89373l74146l17014k25263j62980j35744j22447
$$ 4596473 3837718 3343468 2942590 2553217 2179071 1862057 1636794 1473814 1338070 1215623
9613A215623j12064r2061p7913o6260n0548l3651k0420j7177p048L163Q417R671
$$ 1215623 1103559 1011498 933585 867325 816777 783126 762706 745529 738481 741644 750061 759732
9601G59732L0303M9047P3608J03784J56604K29956L43253M99964O77340Q12392
$$ 759732 790035 839082 912690 1016474 1173078 1403034 1746287 2246251 2923591 3735983
9591C735983P63346M91369J55391j62917n34292q43412q81267p07390m96933l35447
$$ 3735983 4499329 4990698 5146089 4983172 4448880 3605468 2724201 2016811 1519878 1184431
9581A184431k26650j60114j19014q3547n7808n0549l8241k8864l1352l4373k3719
$$ 1184431 957781 797667 678653 595106 537298 486749 448508 419644 388292 353919 330200
9570C30200k6547k4812j6342j6979j8433j6696o910j521k565j0021p790l553q470
$$ 330200 303653 278841 262499 245520 227087 210391 203481 201960 199395 189374 181584 178031 169561
9557A69561p082o048m509K621l184l827q199J822M709l373j092J164q7m847q666
$$ 169561 162479 156431 151922 154543 151359 147532 139333 141155 145864 142491 141399 142563 142476 137629 128963
9542A28963m335J88n403n480l601o62P93n295M435m40m993o029J176J696o161
$$ 128963 124628 124816 119413 113933 110332 109670 110463 105168 109603 109163 104170 98141 99317 101013 94852
9527I4852m549n076M74O909L381j882L047k021l689J729n481j643M791K915L791
$$ 94852 90303 85227 85701 92610 95991 94109 97156 95135 91446 93175 87694 86051 90842 93757 97548
9512I7548J167j164m093o38j81K703Q823p09q9n048p750q340l207K018R66n935
$$ 97548 98715 97551 93458 92820 92639 95342 104165 103456 103367 98319 90569 82229 79022 81040 82006 76071
9496G6071q0r792l613R115K588M150j832o79k858r455n024J380M075n913k490
$$ 76071 75991 66199 62586 71701 74289 78439 76607 75928 73070 63615 58591 59971 64046 58133 55643
9481E5643J090l158k841J243O209Q798l19j201K320M948L707k553l03R00J683
$$ 55643 56733 53575 50734 51977 58186 66984 66665 65464 67784 72732 76439 73886 73583 74483 76166
9466G6166k368n577k161j828K029J97m631p150M051J770J637M173l154k167m172
$$ 76166 73798 68221 66060 64232 66261 66458 61827 54677 58728 60498 62135 66308 63154 60987 56815
9451E6815n537o494j632O731L193k292O294r23p468l620K054j627N802l36M709
$$ 56815 51278 44784 43152 49883 53076 50784 57078 56155 48687 45067 47121 45494 51296 50960 55669
9436E5669O859n617k209k860j282R39K422j501k109k1O150l577m343m66K310R58
$$ 55669 62528 56911 54702 51842 50560 51499 53921 52420 50311 50290 56440 52863 48520 48054 50364 51322
9420E1322L73k372J032k588p36m9N380K366l106l85n551n737J171J245N584O033
$$ 51322 51695 49323 50355 47767 47031 46982 52362 54728 51622 51237 45686 39949 41120 42365 47949 53982
9404E3982n947k779L28M095K073r207n980J077n53O46m809O218M075n085r063
$$ 53982 48035 45256 45584 49679 51752 42545 36565 37642 37089 37735 32926 39144 43219 38134 29071
9389B9071J572k997k946P561O545j33m658J145k543n810J43N892r35L942P354
$$ 29071 30643 27646 24700 32261 38806 38673 34015 35160 32617 26807 26950 32842 31907 35849 43203
9374D3203O35n167o14M134n0n963K500M639j792n017N408J0449J74k511M642J1726
$$ 43203 43838 38671 38057 42191 42141 36178 38678 43317 41525 36508 41916 52365 52539 50028 54670 66396
9358F6396n073k955o901l875j962l848k928L195O184j71q605j44J369m656m07
$$ 66396 61323 58368 51467 47592 45630 41782 38854 42049 48233 48062 39457 39313 40682 36026 35619
9343C5619M116O23L84k377k307j205j520J664O133p961m756L333L924q71n58l633
$$ 35619 39735 40358 40742 38365 36058 34853 33333 34997 41130 33169 28413 31746 35670 34799 34241 30608
9327C0608Q16K979P783j951K724J0002J7103J3532J5546J0590Q543p21p601j1670
$$ 30608 31424 34403 42186 40235 42959 52961 70064 83596 99142 109732 118275 117554 109953 98283
9313I8283n839k824R91k639o784p953r833q594n844K523l569L68j011l05j696
$$ 98283 92444 89620 90611 87972 81188 73235 63402 54808 48964 51487 47918 48286 47275 46970 45274
9298D5274n598N838L31q975l951k734L212m09k23Q303M489L60m180L277K154k619
$$ 45274 39676 45514 45845 36870 32919 30185 33397 32988 32765 41068 45557 45917 41737 45014 47168 44549
9282D4549M679J0522N585J4640K1968J7639J1920l559k69K486K290J1230j282
$$ 44549 49228 59750 65335 79975 101943 119582 131502 127943 127674 130160 132450 143680 142398
9269A42398m756k538m706j6333j9793j1923m958p692q652j0560n238M190J324
$$ 142398 137642 135104 130398 114065 94272 82349 77391 69699 61047 50487 45249 49439 50763
9256E0763n087o054j306m951q59L952N757k532j886q15k330L257j17n929q534
$$ 50763 45676 39622 38316 33365 32506 36458 42215 39683 37797 36982 34652 37909 37792 31863 23329
9241B3329J4689N550J019P638O447J199J860P124P964M815K921J1897J4248Q526
$$ 23329 38018 43568 44587 52225 58672 59871 61731 68855 76819 81634 84555 96452 110700 119226
9227A19226M679j848j5212j8910j3197j6465o508m231r733p415L492N049M46p366
$$ 119226 123905 122057 106845 87935 74738 58273 51765 47534 37801 30386 33878 38927 39373 32007
9213C2007M101K174n788n918M275L083n85K46m220n805k587L395l578m210k083
$$ 32007 36108 38282 32494 26576 30851 33934 33349 33595 29375 23570 20983 24378 20800 16590 14507
9198A4507L121o410k853K53Q537k641l350L496M885K964R485J2254N432l328n141
$$ 14507 17628 11218 8365 8618 17155 14514 11164 14660 19545 22509 31994 44248 49680 46352 41211
9183D1211m252m657l84p937p876q2j666P11L039N78p416q176o179n346N151P606
$$ 41211 36959 32302 31918 23981 16105 16023 14357 15068 18107 18685 11269 3093 -3086 -8432 -3281 4325
9167D325J0754O394k810l305L718P405n334j501J0913J960q506p295n121p46J968
$$ 4325 15079 21473 18663 15358 19076 26481 21147 19646 30559 32519 24013 16718 11597 10851 12819
9152A2819M586J287M270L968l690p12l232l900L988M662M695Q86J131K101j1316
$$ 12819 17405 18692 22962 26930 23240 22528 19296 15396 19384 24046 28741 29627 30758 32859 21543
9137B1543p340l322J917Q295K997l161k053O82j215o75K818j012J524n182Q37
$$ 21543 14203 10881 12798 21093 24090 20929 18876 19558 18343 17668 20486 19474 20998 15816 16653
9122A6653L045j64p071j97l675j757J766O912L774k237m48q46J106j326q80J788
$$ 16653 19698 19534 12463 12266 8591 6834 8600 15512 19286 17049 16601 15755 16861 15535 14655 16443
9106A6443k786q748m318j371K627O515J1700M525m916o952l293k253j011O975
$$ 16443 13657 4909 591 -780 1847 8362 20062 24587 19671 12719 9426 7173 6162 13137
9092A3137N234m173m043J590O922P326J064k314l766K967p760l316l238j391J921
$$ 13137 18371 14198 10155 11745 18667 25993 27057 24743 20977 23944 16184 12868 9630 8239 10160
9077A0160k978L938N910Q02P12J148K476l517l557P167N514n187o068J495m425
$$ 10160 7182 11120 17030 17832 18544 19692 22168 18651 15094 22261 27775 22588 16520 18015 13590
9062A3590k190L447k629J956k933K699k774p994M738r4p37j288j075L428P550
$$ 13590 11400 14847 12218 14174 11241 13940 11166 3172 7910 7816 7079 5791 4716 8144 15694
9047A5694n187o680k854M015L089L777q57N105R37n203N09j657J495K548o327
$$ 15694 10507 3827 973 4988 8077 11854 10997 16102 17039 11836 12345 10688 12183 14731 8404
9032H404j174M199L297l119O746j263J72L876K609k371n658k642k351N06J266
$$ 8404 7230 11429 14726 11607 18353 17090 17262 21138 23747 21376 15718 13076 10725 11231 12497
9017A2497j942m580L189L555Q644K402o357m584j517J527k913o255j279O366L672
$$ 12497 10555 5975 9164 12719 21363 23765 17408 12824 11307 12834 9921 3666 2387 8753 12425
9002A2425K231k515n469l959K423J0732L757q948q525N267L283J984o050k989
$$ 12425 14656 12141 6672 2713 5136 15868 19625 10677 2152 7419 10702 12686 6636 3647
8988C647L313k976R09K034j438K669r83L279R36N258l566k091K063L209l458j379
$$ 3647 6960 3984 4893 6927 5489 8158 7175 10454 11390 16648 13082 10991 13054 16263 12805 11426
8972A1426J033N58l892J853K332o71N908J619R65m582m404k260m025N780O050
$$ 11426 12459 13017 9125 10978 13310 12639 18547 20166 21131 16549 12145 9885 5860 11640 17690
8957A7690L200m06l037k031M872p820j134K375R72r337k956m065R133K275J16
$$ 17690 20890 20484 17447 15416 20288 12468 11334 13709 14681 5344 2388 -1677 7456 9731 9847
8942I847k440l201k345O397n748L084O258M250p908l039N517Q451J758R53n300
$$ 9847 7407 4206 1861 8258 2510 5594 11852 16102 8194 5155 10672 19123 20881 21834 16534
8927A6534r581K050N45j882k330L806J940O818o08J802O803K344k166j1282n931
$$ 16534 6953 9003 9548 7666 5336 9142 11082 17900 17292 19094 25897 28241 26075 14793 8862
8912H862N20L3j786J267M85l142n681o086J470O744J414J302Q97P12N150k11M72
$$ 8862 9382 9415 7629 8896 9381 6239 558 -5528 -4058 2686 4100 5402 6299 7011 12161 11950 12422
8895A2422k958p520n474K449R864O670l912L516j431M416K502q04m092J748J030
$$ 12422 9464 1944 -3530 -1081 8783 15453 11541 15057 13626 18042 20544 19740 15648 17396 18426
8880A8426k293N158Q689O127J6971K7523K8721K0002p178l7473k5561j0068q152
$$ 18426 16133 21291 29980 36107 53078 80601 109322 129324 122146 84673 59112 49044 40892
8867D0892o693j284l819o332n974K066J363n001p607M74K484n698m134L48l461
$$ 40892 34199 32915 29096 22764 16790 18856 20219 15218 7611 8085 10569 4871 737 1085 -2376
8852b376q98N212M64L311P39j871J563N250K168o442o52N113M900j45n695K980
$$ -2376 -3274 1938 2402 5713 6452 4581 6144 11394 13562 7120 6468 11581 16481 16336 10641 13621
8836A3621m22p368m089m80l367P928K092n841p38p13P225O027n542N915l011l415
$$ 13621 13199 5831 1742 1262 -2105 5823 7915 2074 1336 623 7848 13875 8333 14248 11237 7822
8820G822N479K549j737M455j013n315l691m156l693J44j17M875K875N945Q5k128
$$ 7822 13301 15850 14113 18568 17555 12240 8549 4393 700 844 727 5602 8477 14422 14507 12379
8804A2379m441m816L361O419o328o629L398K103J656L08l580q184l98N497L185
$$ 12379 7938 3122 6483 12902 6574 -55 3343 5446 7102 7410 3830 -4354 -4752 745 3930
8789C930M696K104l961K526k517n789M530P118K933j657p969j595M325K440o281
$$ 3930 8626 10730 6769 9295 6778 989 5519 12637 15570 13913 5944 4349 8674 11114 4833
8774D833j037O761O146n771k110j22l743N544J221k985k2Q516k360j0150k028
$$ 4833 3796 10557 16703 10932 8822 8700 4957 10501 11722 8737 8715 17231 14871 4721 2693
8759B693J386K056R74j778M84k929m910q49P63m90O027J3003O658j168j0858m527
$$ 2693 4079 6135 7109 5331 5815 2886 -2024 -2873 -2110 -2600 3427 16430 23088 21920 11062 6535
8743F535M448j383j799K75j251N45N711J633K958l870m852k319k106M200Q360
$$ 6535 10983 9600 7801 8076 6825 7370 13081 14714 17672 13802 8950 6631 4525 8725 17085
8728A7085O394m43p776k126n985n24K242L626l884r80O598J506l988l838N239
$$ 17085 23479 23036 15260 13134 7149 6625 8867 12493 8609 7629 14227 15733 11745 7907 13146
8713A3146J579m671n72L275l926N54Q763k669k108M549J939p359k154K467Q55
$$ 13146 14725 10054 9482 12757 8831 9385 18148 15479 13371 17920 19859 12500 10346 12813 13668
8698A3668m942o98j970K159k386j548Q148k064k356K601j892j860K560O498j973
$$ 13668 8726 8028 6058 8217 5831 4283 12431 10367 8011 10612 8720 6860 9420 15918 13945
8683A3945p173o930j785O88n479l100P065P607J062R58N445J268M219K620k039
$$ 13945 6772 -158 -1943 -1255 -6734 -9834 -2769 4838 5900 6858 12303 13571 17790 20410 18371
8668A8371K336m757m352l450O182P30O014k770p460j0344m541k211k658K501O688
$$ 18371 20707 15950 11598 8148 14330 15060 21074 18304 10844 500 -4041 -6252 -8910 -6409 279
8653B79R593K400k621l115J0107k374o37K488l53r40o46J134N87q13j732O831
$$ 279 9872 12272 9651 6536 16643 14269 13632 16120 15767 14827 14181 15315 15902 15089 13357 20188
8637B0188M078l710q360n651m709j726q77M429K242O854N538M112L041J823J332
$$ 20188 24266 20556 12196 6545 1836 110 -767 3662 5904 12758 18296 22408 25449 27272 28604
8622B8604j550j122K30l707l288P48j516L162R069k679q199j784N750J1051Q463
$$ 28604 27054 25932 26162 22455 19167 19915 18399 21561 30630 27951 19752 17968 23718 34769 43232
8607D3232o105j0413l109N49J0170Q319O99M439P488L919P506L849K886O364M854
$$ 43232 37127 26714 23605 24154 34324 42643 43342 47781 55269 59188 66694 70543 73429 79793 84647
8592H4647O0n791q263n458K132k446j725m544l810J7m789m300L253K534r63m261
$$ 84647 84707 78916 70653 65195 67327 64881 63156 58612 54802 54819 50030 45730 48983 51517 50554 46293
8576D6293j848M01J752R247J2101J4284L4784P1537J16602J84879K27533J20392
$$ 46293 44445 44846 46598 55845 67946 82230 117014 188551 305153 490032 717565 837957
8564H37957j15566k30428j85852j09944n8343k9602j8320j4336j2480k217n436
$$ 837957 722391 491963 306111 196167 137824 108222 89902 75566 63086 60869 55433
8553E5433j0607m686l333n128j754p18j766n191l368M241R647n054n692M497J494
$$ 55433 44826 40140 36807 31679 29925 29207 27441 22250 18882 23123 32770 27716 22024 26521 28015
8538B8015j893k020J3927Q718M387J436N027P195M052J7565J3151K9524O1059
$$ 28015 26122 24102 38029 46747 51134 52570 57597 64792 68844 86409 99560 129084 190143
8525A90143J05231J76584K98063M44408M05792n1892m46794m36650k60863j37460
$$ 190143 295374 471958 770021 1214429 1620221 1568329 1121535 684885 424022 286562
8515B86562p7379m8898l6767k4688j4921j0975j4157j0866j638K006j364p922
$$ 286562 209183 160285 123518 98830 83909 72934 58777 47911 46273 48279 46915 38993
8503C8993L70n576k399q679q274l561R60J614M216K125o367R52O871R872L991
$$ 38993 39363 33787 31388 22709 14435 10874 11834 13448 17664 19789 13422 14374 21245 31117 35108
8488C5108j146k151L864L035J1047Q391J8988L9574Q1185J26523J83040K06970
$$ 35108 33962 31811 35675 38710 49757 58148 77136 116710 197895 324418 507458 714428
8476G14428Q3371j45171k29707j68943r0708n2666k1528j8609k3410r772m868
$$ 714428 797799 652628 422921 253978 163270 110604 89076 70467 47057 37285 32417
8465C2417L28J800l723k935M094j925o928J060k088j770J778m195k382n873Q73
$$ 32417 32745 34545 30822 27887 31981 30056 23128 24188 22100 20330 22108 17913 15531 9658 10531
8450A0531k675P80M073n391K02M846J42p026L325L969K024l161o715k647p7m78
$$ 10531 7856 8636 12709 7318 7520 12366 12508 5482 8807 12776 14800 11639 4924 2277 2200 1722
8434A722l98M56J396L444k665J037M246M509N64K796K435p191L26o879n003r34
$$ 1722 1324 1780 3176 6620 3955 4992 9238 13747 14311 17107 19542 12351 12677 5798 795 -139
8418a39L8L674O057K547l834O394R151m100r113K398J228j528n759L58l791j463
$$ -139 -101 3573 9630 12177 8343 14737 23888 19788 10675 13073 14301 12773 7014 7372 3581 2118
8402B118k313J664M487K26p20J336k858M045P539k359k572k063J76J363k57M86
$$ 2118 -195 1469 5956 6182 5462 6798 3940 7985 15524 13165 10593 8530 8706 10069 9812 10298
8386A0298l05l317J093O71K557j920k471l874l95M523K367m735k36o387m972k741
$$ 10298 9993 6676 7769 8440 10997 9077 6606 2732 2337 6860 9227 4492 4256 -2131 -7103 -9844
8370i844Q013R278M864J15n69m84M464L302J749l774j702J01J278j778l223j429
$$ -9844 -1831 7447 12311 12426 11857 11373 15837 19139 20888 17114 15412 15513 16791 15013 11790 10361
8354A0361M24k273l897n020p994k58R293L135R761j104m812l770M099N928n78
$$ 10361 10785 8512 4615 -405 -8399 -8657 636 3771 13532 12428 7616 3846 7945 13873 13295
8339A3295J473l167l385k34m553L751J1058m68k062R576n280l879O768J557J662
$$ 13295 14768 11601 8216 7982 3429 7180 18238 17770 15708 25284 20004 16125 22893 24450 26112
8324B6112m491k585l860n253p19L146o56j109m053k279m589j462k726n52J2819
$$ 26112 21621 19036 15176 9923 9204 12350 11694 10585 6532 4253 -336 -1798 -4524 -5076 7743
8309G743N763j43L594K399j506O24Q57j512q157o416k27M098j929j913K367K495
$$ 7743 13506 13363 16957 19356 17850 18474 19331 17819 9662 3246 3019 7117 5188 3275 5642 8137
8293H137K311L991m359l608K986K846m391k721P464P496K183J8322J5951J2412
$$ 8137 10448 14439 10080 6472 9458 12304 7913 5192 12656 20152 22335 40657 56608 69020
8279F9020o879k2908j2086n529j1292k670K049m508n958O50M94J462j979O837
$$ 69020 62141 39233 27147 21618 10326 7656 9705 5197 -761 -111 383 1845 -134 6703
8265F703O316p294j685k782M903O765K336n437l310M927J138j0069l275L443K311
$$ 6703 13019 5725 4040 1258 6161 12926 15262 9825 6515 11442 12580 2511 -764 2679 4990
8250D990k961q719j792R521M820K485N587K468J929p366m256J591L323J295M693
$$ 4990 2029 -6690 -8482 1039 5859 8344 13931 16399 18328 10962 6706 8297 11620 12915 17608
8235A7608J462k543L99p115j282j009Q084k187o433k174M935L97j083q881r856
$$ 17608 19070 16527 16926 9811 8529 7520 15604 13417 6984 4810 9745 10142 9059 178 -9678
8220i678j049n49J346L031K239N461P032M218o730n909J378M548L864q45o914
$$ -9678 -10727 -11276 -9930 -6899 -4660 801 7833 12051 5321 -588 790 5338 9202 8357 1443
8205A443o502j210L826j338N593o29n483m738j585K490J32M361J538j528O714
$$ 1443 -5059 -6269 -2443 -3781 1812 1183 -4300 -9038 -10623 -8133 -8001 -3640 -2102 -3630 3084
8190C084J536j762r76p158K646O598P92J294l25J719J759o620J833K685k690M335
$$ 3084 4620 2858 1882 -5276 -2630 3968 4760 6054 5729 7448 9207 2587 4420 7105 4415 8750
8174H750J226O213j016o270n933j82L993Q108K771O195j659l059o532j919L896
$$ 8750 9976 16189 15173 8903 2970 2788 6781 14889 17660 23855 22196 19137 12605 10686 14582
8159A4582q290l167L3j568J42n214m526L193J0148J087J987Q881k916l762k794
$$ 14582 6292 3125 3158 1590 1732 -3482 -8008 -4815 5333 6420 8407 17288 14372 10610 7816
8144G816K766r2j354l174J560J605j326q70q97n522j04P370l476j501k857m727
$$ 7816 10582 10490 9136 5962 7522 9127 7801 6931 6034 512 408 7778 4302 2801 -56 -4783
8128d783l535K589L699M259M980L699J233Q949Q48J25l168q450p53K517j404o94
$$ -4783 -8318 -5729 -2030 2229 7209 10908 12141 21090 21938 22063 18895 10445 9692 12209 10805 10111
8112A0111k522l868P976M291J351m448N59k393j11k062J596N104l205N3n002l47
$$ 10111 7589 3721 11697 15988 17339 12891 13450 11057 10946 8884 10480 15584 12379 12432 7430 7083
8096G083j72M136m017m411L230M152J571O939N27q713K079K533k482L048j262
$$ 7083 6911 11047 7030 2619 5849 10001 11572 18511 19038 10325 12404 14937 12455 15503 14241
8081A4241R13N53p35L780L30l790n755j530k086M772M829J21J529j141j0138k641
$$ 14241 15154 15707 14972 18752 19082 15292 9537 8007 5921 10693 15522 15643 17172 16031 5893 3252
8065C252P374L401L036J2503P984o76q342k245L544k545r416p431k254m59O181
$$ 3252 10626 14027 17063 29566 37550 36874 28532 26287 29831 27286 17870 10439 8185 7726 13907
8050A3907J494K281K721l144l582m287j152Q567L403J282k215p342n670K244N21
$$ 13907 15401 17682 20403 17259 13677 9390 8238 16805 20208 21490 19275 11933 6263 8507 9028
8035I028Q59l24R004K856o270j275j631N804O288j29O049Q107M053m322J789Q952
$$ 9028 9887 9563 18567 21423 15153 13878 12247 18051 24339 24210 30259 38366 42419 38097 39886 48838
8019D8838O44k471k757p708k778k583j818M089J0885Q884O374p96r827r183o801
$$ 48838 49482 47011 44254 36546 33768 31185 29367 33456 44341 53225 59599 58803 48976 39793 32992
8004C2992n1l504p54K911m441O76j418k971j300L44L875J195N72O231L217j3233
$$ 32992 32941 29437 28683 31594 27153 27829 26411 23440 22140 22484 26359 27554 28126 34357 37574 24341
7988B4341j4140j725J1829L028J41L531Q075k366l918j774M852L04R39n456k681
$$ 24341 10201 8476 20305 23333 23474 27005 35080 32714 28796 27022 31874 32178 33117 27661 24980
7973B4980l830l007l157Q248P020M623P377L765L081m38n852j4002o269k141J344
$$ 24980 21150 18143 14986 23234 30254 34877 42254 46019 49100 48662 42810 28808 22539 20398 21742
7958B1742l328J021r87j709n60L354O57n23n199j488L192o88l281n963o955o242
$$ 21742 18414 19435 18448 16739 16179 19533 20190 19667 14468 12980 16172 15484 12203 6240 -715 -6957
7942f957P09p60M843N390M62j487q2J408N224k524J035O906N030l597k799Q3l927
$$ -6957 -6248 -7008 -2165 3225 3687 2200 2118 3526 8750 6226 7261 14167 19197 15600 12801 12884 8957
7925H957K457O140j020j620k104m81P359L339L609R11l946j0930n310L296k436
$$ 8957 11414 17554 16534 14914 12810 12329 19688 23027 26636 27547 23601 12671 7361 10657 8221
7910H221m590m196Q473K075j545l35O619l677P53o92J350j249K350n975m060k612
$$ 8221 3631 -565 7908 9983 8438 8103 14722 11045 11798 11106 12456 11207 13557 7582 3522 910
7894I10q325l825L694L642P345q79O48K727L900P82o13l034L10j018J808m631
$$ 910 -7415 -11240 -7546 -3904 3441 2562 3210 5937 9837 10619 10006 6972 7282 6264 8072 3441
7878C441p270J427N869M049j359l611r758O015L323m270l669M786K417O223L748
$$ 3441 -3829 -2402 3467 7516 6157 2546 -7212 -1197 2126 -2144 -5813 -1027 1390 7613 11361
7863A1361j0791M43j816j512Q576N453o553j3574m516L429O200n620k307N719
$$ 11361 570 1013 -803 -2315 6261 11714 5161 -8413 -12929 -9500 -3300 -8920 -11227 -5508
7849e508M457N26O103N567l880q01N434l99o986k013n743j383L207P479m3Q6r034
$$ -5508 -1051 -525 5578 11145 7265 6464 11898 11499 4513 2500 -3243 -4626 -1419 6060 6017 6103 -2931
7832b931o556L073K541l916J701Q672l720k806Q186L29k548j612N87k626P469
$$ -2931 -9487 -6414 -3873 -7789 -6088 2584 -1136 -3942 4244 4573 2025 413 1000 -1626 5843
7817E843L658L732N440J858p296q234n283j115M243k547m58l989l359P167p21
$$ 5843 9501 13233 18673 20531 13235 5001 -282 -1397 2846 299 -159 -4148 -7507 -340 -1061
7802a061n922j29P458P900k483j174P38J294k014K121k07J030L836Q23n49o85
$$ -1061 -6983 -7112 346 8246 5763 4589 5327 6621 4607 6728 6521 7551 11387 12210 11661 10976
7786A0976Q94J283n331J075m718j513L052L616J749k860o158O64l011K968O561
$$ 10976 11870 13153 7822 8897 4179 2666 5718 9334 11083 8223 2065 2729 -282 2686 9247
7771I247J834p120o156j489P3J903l434k668L851J785q337j192K503m29N450M482
$$ 9247 11081 3961 -2195 -3684 -3611 -1708 -5142 -7810 -3959 -2174 -10511 -11703 -9200 -9629 -4179 303
7755C03n109k302Q072O227j273n262P116K902j895k983o825l721k129p83K083
$$ 303 -4806 -7108 964 7191 5918 656 7772 10674 8779 5796 -1029 -4750 -6879 -7662 -5579
7740e579K801L168M720N678J762p98m578n890m873K739R074j371k750l279K223
$$ -5579 -2778 390 5110 10788 12550 11752 7174 1284 -3589 -850 8224 6853 4103 824 3047
7725C047k544p370o36M421J847k206M25N200L666M236M531n675o126l583M785
$$ 3047 503 -6867 -7503 -3082 -1235 -3441 -3016 2184 5850 10086 14617 8942 2816 -767 4018
7710D018L63l826o684j123R47M252j061o70K742o29M049K366n046p521o419O265
$$ 4018 4381 555 -6129 -7252 -6305 -2053 -3114 -3784 -1042 -1671 2378 4744 -302 -7823 -14242 -7977
7694g977K880N520K240j049k837N809J744P95N262K38o644J805o84l300L162l662
$$ -7977 -5097 423 2663 1614 -1223 4586 6330 7125 12387 12625 5981 7786 7102 3802 6964 3302
7678C302N516N507p958p466N06N876K778l032J144J712l94r14K253j248p88o440
$$ 3302 8818 14325 6367 -1099 -593 5283 8061 5029 6173 7885 7491 6577 8830 7582 6794 354
7662C54J394K009l024j01r096l109N859l97J045J553O52k598k784l674K571K687
$$ 354 1748 3757 733 632 -8464 -11573 -5714 -6111 -5066 -3513 -2861 -5459 -8243 -11917 -9346 -6659
7646f659N882l58p9K534M017q755J049O858l144J10L333r03K705J565j063n613
$$ -6659 -777 -1135 -1214 1320 5337 -3418 -2369 4489 1345 1455 4788 3885 6590 8155 7092 1479
7630A479m552l990Q287J132n621m140k022o096J0127O493m373O50P67K481J679
$$ 1479 -3073 -7063 1224 2356 -3265 -7405 -9427 -15523 -5396 1097 -3276 -2626 -1859 622 2301
7615B301O29n393n584j178Q719L054j611K536k99J917O226k823n072j483N492
$$ 2301 2930 -2463 -8047 -9225 -506 2548 937 3473 3174 5091 11317 8494 3422 1939 7431
7600G431p17m483K128J451l119O053M22j847j850p867J162j094j0065P528P924
$$ 7431 6714 2231 4359 5810 2691 8744 9166 7319 5469 -2398 -1236 -2330 -12395 -4867 3057
7585C057m16q581m237M638R716J857m59R28K370j534J490m501J436q81K306K78
$$ 3057 2641 -5940 -10177 -5539 4177 6034 5575 6503 8873 7339 8829 4328 5764 4883 7189 7467
7569G467k641J483N404L94q597j0643P86O314N394N272M222l476k44j549N87n037
$$ 7467 4826 6309 11713 12107 3510 -7133 -6347 -33 5361 10633 14855 11379 11135 9586 10173 5136
7553E136k757J736j306L903P482j648j0114p666n24M003M830J61q078k057P136
$$ 5136 2379 4115 2809 6712 14194 12546 2432 -5234 -5758 -1755 3075 3236 -4842 -6899 237
7538B37N76m029K729P272M353m879k209O354l682l014l280P884j310n569L421
$$ 237 813 -3216 -487 6785 11138 6259 4050 10404 6722 3708 428 8312 7002 1433 4854
7523D854n255j458L313O543P262p214j331J03j558j994L471M871L855o321k547
$$ 4854 -401 -1859 1454 7997 15259 8045 6714 6817 5259 3265 6736 11607 15462 9141 6594
7508F594m147l448R09O327N135M880m253l630j645q506k630p043l947P277M818
$$ 6594 2447 -1001 -92 6235 11370 16250 11997 8367 6722 -1784 -4414 -11457 -15404 -8127 -3309
7493c309j464K64O435M389p619k913M40N829k16M809N461J81N53k123o559n213
$$ -3309 -4773 -4509 1926 6315 -1304 -4217 -3777 2052 1836 6645 12106 12287 12840 10717 4158 -1055
7477a055N355K172m151o384k236K374M257J597N36k795k522l439N942l37m51L86
$$ -1055 4300 6472 2321 -4063 -6299 -3925 332 1929 2465 -330 -2852 -6291 -349 -686 -1137 -751
7461g51k58l272J866M415J459N85j11K092j642k096j0147l30L060L600J460L296
$$ -751 -1009 -4281 -2415 2000 3459 4044 3933 6025 4383 2287 -7860 -8190 -5130 -1530 -70 3226
7445C226L821J995j924m595k382M861J850k389N136Q969m141m350j359r067j492
$$ 3226 7047 9042 7118 2523 141 5002 6852 4463 9599 18568 14427 10077 8718 -349 -1841
7430a841M64K06L206L829o454K577K198o18M400L923k01j0406n876L996J727j155
$$ -1841 -1377 -1171 2035 5864 -590 1987 4185 3567 7967 11890 11689 1283 -4593 -597 1130 -25
7414b5O352n85p840n663L731J1321R01kk678Q93n10L587M699n13l382j0678j0496
$$ -25 6327 5742 -2098 -7761 -4030 7291 8192 8190 5512 6405 5895 9482 14181 13668 10286 -392 -10888
7397a0888J853N510M093O585l124n296L057Q249n31o256L182j791k470K039m263
$$ -10888 -9035 -3525 568 7153 4029 -1267 1790 10039 9508 3252 6434 4643 2173 4212 -51
7382e1m56M044l017l345p161L149N480j303j479l292l48j065J4304N137j507k581
$$ -51 -507 3537 520 -2825 -9986 -6837 -1357 -2660 -4139 -7431 -7779 -8844 5460 10597 9090 6509
7366F509j001n297K198J686O250l715J56k279K448k579o679l931K589O82j694
$$ 6509 5508 211 2409 4095 10345 6630 6786 4507 6955 4376 -2303 -6234 -3645 -2963 -4657
7351d657J318J109K26K287l186k783O46n15J770Q714K533j176o385n081O425m354
$$ -4657 -3339 -2230 -2004 283 -2903 -5686 -5040 -5555 -3785 4929 7462 6286 -99 -5180 1245 -3109
7335c109o11j75L025K522O31o200k471P643L060K401p001L413R139j547j678k031
$$ -3109 -3720 -3895 -870 1652 2283 -3917 -6388 1255 4315 6716 -285 3128 12267 10720 9042 7011
7319G011j510K882o513p927l058l189l650L661L822J190K940N107j471l77L82
$$ 7011 5501 8383 1870 -6057 -9115 -12304 -15954 -12293 -8471 -7281 -4341 766 -705 -1082 -700
7304g00n936k286K845M286M26K045j129j564J669j668J043l946k361J78M251J0694
$$ -700 -6636 -8922 -6077 -1791 -1365 680 -449 -2013 -344 -2012 -969 -4915 -7276 -7098 -2847 7847
7288G847K134l965j54m046O73N522K284k721j0931n712M15k031M335N947K69L037
$$ 7847 9981 6016 5862 1816 2489 8011 10295 7574 -3357 -9069 -8654 -10685 -6350 -403 -134 2903
7272B903L661p12p635N64Q535p327m069r74l259k346J96l11O57J691J510O295
$$ 2903 6564 5852 -1783 -1219 7316 -11 -4080 -5054 -8313 -10659 -10463 -10774 -10117 -8426 -6916 -621
7256f21K578p19K67l067k4M495M112Q42m292R99K254J20K618n34Q62o214k076
$$ -621 1957 1238 1505 -1562 -1586 2909 7021 7863 3571 4570 6824 6944 9562 9028 9890 3676 1600
7239A600O410l514j638p15m41l71J69P439o330n509M332P695M910m930r856m379
$$ 1600 8010 4496 2858 2143 1702 1331 1500 8939 2609 -2900 1432 9127 14037 9107 -749 -5128
7223e128R14N028O812j783j606J0508l161r396j75P339k55q468j246j033k707
$$ -5128 -4214 814 7626 5843 4237 14745 11584 2188 2013 9352 9097 629 -617 -1650 -4357
7208d357L671k740l692J510M223M864j205J117J088k185J025l549o791l477N3
$$ -4357 -686 -3426 -7118 -5608 -1385 3479 2274 3391 4479 2294 3319 -230 -7021 -10498 -10445
7193a0445N717P685K773O26k334k454l488l305m069K257M239M757K104K861L237
$$ -10445 -4728 2957 5730 6356 4022 1568 -1920 -5225 -9294 -7037 -2798 1959 4063 6924 10161
7178A0161O64o027r474n267N087M857K309l488j254p99j358p79N552K202l108
$$ 10161 10825 4798 -4676 -9943 -4856 1 2310 -1178 -2432 -3231 -4589 -5368 184 2386 -722
7163g22o445q103M4J864N773n43L473j04K71J884n07j731p194k594K331K221J073
$$ -722 -7167 -15270 -15226 -13362 -7589 -8132 -4659 -4763 -4492 -2608 -3115 -4846 -12040 -14634 -12303 -10082 -9009
7146i009J69P10N150Q762k720o021N089L117j940Q37k808l753r16j507L386M213
$$ -9009 -8840 -8130 -2980 5782 3062 -2959 2130 5247 3307 4144 1336 -2417 -3333 -4840 -1454 2759
7130B759L844q59q797j874K492j886l461N337j251n034L005J260m172k472L317
$$ 2759 6603 5744 -3053 -4927 -2435 -4321 -7782 -2445 -3696 -8730 -5725 -4465 -8637 -11109 -7792
7115g792Q69J139K22j227j339k784O100L095K03o508J669K425N578O829k990j983
$$ -7792 -6923 -5784 -5562 -6789 -8128 -10912 -4812 -1717 -1514 -8022 -6353 -3928 1650 8479 5489 3506
7099C506j923P189k322m682j381L75l58j113j881Q29J726K758K245j176j673r420
$$ 3506 1583 8772 6450 1768 387 762 404 -709 -2590 -1761 -35 2723 4968 3792 2119 -7301
7083g301n751O004O493j764K412M029j27L3q62P025p275K1o676m753M759N824
$$ -7301 -13052 -7048 -555 -2319 93 4122 3995 4028 3166 10191 2916 2937 -3739 -8492 -3733 2091
7067B091K616k254Q89j117K439j772l694k905M838k857o325L109L349m094o559
$$ 2091 4707 2453 3342 2225 4664 2892 -802 -3707 1131 -1726 -8051 -4942 -1593 -5687 -12246
7052a2246o589N740P146R675k349j287J652O147l714k723L484l115k277k495L31
$$ -12246 -18835 -13095 -5949 3726 1377 90 1742 7889 4175 1452 4936 1821 -456 -2951 -2620
7037b620J68J937K660p9M194q677l174k38R7j190k320k127N407J039L273Q36L386
$$ -2620 -2452 -515 2145 2066 6260 -2417 -5591 -5829 -5732 -6922 -9242 -11369 -5962 -4923 -1650 -814 2572
7020B572O36K813m090O324J356o773q792j480N987j13M360J480m661L381l613
$$ 2572 3208 6021 1931 8255 9611 2838 -5954 -7434 -1447 -1560 2800 4280 -381 3000 -613
7005f13j519m487n795L411P877L161Q35k671j17M554L244k60o94j1288m773R472
$$ -613 -2132 -6619 -12414 -9003 -1126 2035 2870 199 82 4636 7880 7620 6926 -4362 -9135 337
6989C37P994M92m208J15r98K438m577K153l864K004k083L193K173L302o976m604
$$ 337 8331 8823 4615 4730 3732 6170 1593 3746 -118 1886 -197 2996 5169 8471 1495 -3109
6973c109l0l474K575j206J265L115o950m578O810R627m511k815M422N367j600
$$ -3109 -3139 -6613 -4038 -5244 -3979 -864 -7814 -12392 -5582 4045 -466 -3281 1141 6508 4908
6958D908p241k22k144m164L201L727M466l14l099k427P549N495n321N96l005o733
$$ 4908 -2333 -2555 -4699 -8863 -5662 -1935 2531 2217 -882 -3309 4240 9735 4414 5010 2005 -4728
6942d728n560q78R89N961j95j763k785l390k038L72J554M142N782L496M52l517
$$ -4728 -10288 -11166 -10177 -4216 -4411 -6174 -8959 -12349 -14387 -14015 -12461 -8319 -2537 959 1411 -2106
6926b106J4K906l590k691Q35N69O663Q569q280q312k278l572n921K601L24Q391
$$ -2106 -2092 814 -2776 -5467 -4632 -4063 2600 11169 2889 -5423 -7701 -11273 -17194 -14593 -14269 -5878
6910e878Q828n371j969l237m870j212O926N893m08K015o44J311O39l017M307O39
$$ -5878 2950 -2421 -4390 -7627 -12497 -13709 -6783 -890 -1298 717 73 1384 2023 -994 3313 3952
6894C952n261K101k137j669K205L737O852N965o583L877l871j2681n904M153K012
$$ 3952 -1309 792 -1345 -3014 -809 2928 9780 15745 9162 13039 9168 -3513 -9417 -5264 -3252
6879c252L558Q992k055k325k136p187O29P46j0286l222O407O863j842J054R38
$$ -3252 306 9298 7243 4918 2782 -4405 -3776 -3030 -13316 -16538 -10131 -3268 -5110 -4056 -3118
6864c118M708RQ01l91k260n81p166k282j947M664L260L391O328k609o924l052
$$ -3118 1590 1599 2400 2009 -251 -832 -7998 -10280 -12227 -7563 -4303 -912 5416 2807 -4117 -7169
6848g169m447M036N010J047K704R763R6k645o911J291N363k160r591M87J030K596
$$ -7169 -11616 -7580 -2570 -1523 1181 10944 11040 8395 1484 2775 8138 5978 -3613 -3126 -2096 500
6832E00K174r57J65L177O225k764k998q228n058M431l51k051j086M438J678j850
$$ 500 2674 1717 1882 5059 11284 8520 5522 -2706 -7764 -3333 -3684 -5735 -6821 -2383 -705 -2555
6816b555K293j320n48q25M919Q63j1681j654Q966O768J51j596m977j190m571K436
$$ -2555 -262 -1582 -2130 -2955 1964 2827 -8854 -10508 -1542 5226 5377 3781 -1196 -2386 -6957 -4521
6800d521Q516O72k148j534m173K040j698o898J530L819K163L066k361p376l661
$$ -4521 3995 4667 2519 985 -3188 -1148 -2846 -9744 -8214 -4395 -2232 834 -1527 -8903 -12564
6785a2564q90M265O744r72j767L396O064Q021J471j095K9l978k481l336j02P86
$$ -12564 -13454 -9189 -2445 -3417 -5184 -1788 4276 12297 13768 12673 12702 8724 6243 2907 2805 3591
6769C591k074K302J172n871n307k233M552R735j187l803l030l781K645Pj358j469
$$ 3591 1517 3819 4991 -880 -6187 -8420 -3868 5867 4680 877 -2153 -5934 -3289 -3282 -4640 -6109
6753f109J476m910M539J3689Ml747J615k321K005L008P15n9j900k932N039J321
$$ -6109 -4633 -9543 -5004 8685 8689 4942 6557 4236 6241 9249 9964 9905 8005 5073 10112 11433
6737A1433L105M92n220K439K219k07R729l525n376O197M22M263L062J3044J8966
$$ 11433 14538 15030 9810 12249 14468 14261 23990 20465 15089 21286 21708 25971 29033 42077 61043
6722F1043K7724K7785K1254N571j8849l7457l1394j8943p320l989j1589l823p800
$$ 61043 88767 116552 137806 143377 124528 87071 55677 36734 29414 25425 13836 10013 2213
6709B213k279L64J218M674R22L356k769o696l375J820l387K914K088J889M621
$$ 2213 -66 298 1516 6190 7112 10468 7699 1003 -2372 -552 -3939 -1025 1063 2952 7573
6694G573j072o426K422J339o98j4q803j286M092q79j23K967L049Q201l321n221
$$ 7573 6501 75 2497 3836 3138 3124 -5679 -6965 -2873 -3752 -3875 -908 2141 10342 7021 1800
6678A800l65L199N372n553j982l693K48O708J387k041J340l310m726j289j405
$$ 1800 1435 4634 10006 4453 2471 -1222 -974 5734 7121 5080 6420 3110 -1616 -2905 -4310
6663d310O070l201k362q3j887o00J926J59K409O98p433p83J0124P620m736q644
$$ -4310 1760 -1441 -3803 -3886 -5773 -6373 -4447 -4288 -1879 -1181 -8614 -9397 727 8347 3611 -5033
6647e033n418q4Q49o60L235j717M462M054k910m110l555n570O521L625J981l463
$$ -5033 -10451 -10535 -9686 -10346 -7111 -8828 -4366 -312 -3222 -7332 -10887 -16457 -9936 -6311 -4330 -7793
6631g793J581O500M545M100q910n676R177J969m574j598k897n488K620K866O863
$$ -7793 -6212 288 4833 8933 23 -5653 3524 5493 919 -679 -3576 -9064 -6444 -3578 3285
6616C285J09p904M78M743O89J996J0354O024R2j986J503j245n804m49q027M21
$$ 3285 3394 -4510 -4032 711 1400 3396 13750 19774 19866 17880 19383 18138 12334 11885 3858 4279
6600D279K165l241k092P66K70l206o722j718p21K234N082K156O56M740P457n679
$$ 4279 6444 3203 1111 1877 2147 -1059 -7781 -9499 -10220 -7986 -2904 -748 -92 4648 12105 6426
6584F426r110l084o041m36K544r34K113n24l450o627q21P801R039l118j662J618
$$ 6426 -2684 -5768 -11809 -12245 -9701 -10635 -8522 -9046 -12496 -19123 -19944 -12143 -3104 -6222 -7884 -6266
6568f266q91j473K091J462j261L179M309m201K592K865r68n341R16J218j188m998
$$ -6266 -7157 -8630 -6539 -5077 -6338 -3159 1150 -3051 -459 2406 1438 -3903 -2987 -1769 -2957 -7955
6552g955k89n075o510O978P828J499l87K81k908K360L806O436k142M849k110j420
$$ -7955 -8244 -13319 -19829 -12851 -5023 -3524 -3911 -3630 -6538 -4178 -372 6064 3922 8771 6661 5241
6536E241j214j256m271n604J790M887J071j013l26K533N3p811n13M095j680R53
$$ 5241 4027 2771 -1500 -7104 -5314 -427 644 -369 -695 1838 1891 -5920 -6433 -2338 -4018 -3065
6520c065P638L056l691M689M563l314l892n765j161K949p04n7L050J300n456k857
$$ -3065 4573 7629 3938 8627 13190 9876 5984 219 -942 2007 1303 1246 4296 5596 140 -2717
6504b717J22M801k314j925M881j356k470R902J703j195K437k252o784K377K29
$$ -2717 -2595 2206 -108 -2033 2848 1492 -978 8924 10627 9432 11869 9617 2833 5210 5439
6489E439l381K729k401m231r76k163M893R273O50l977n185m052o224k573o58K555
$$ 5439 2058 4787 2386 -1845 -2821 -4984 -91 9182 9832 5855 670 -3382 -9606 -12179 -12837 -10282
6473a0282J924O359j095K999r8n437k116N847p795n473M659M15P185P647k422
$$ -10282 -8358 -1999 -3094 -95 -193 -5630 -7746 -1899 -9694 -15167 -10508 -10093 -2908 4739 2317
6458B317J273p777k425j314M18k752J498k265l513r15J0887R69J072j336M994
$$ 2317 3590 -4187 -6612 -7926 -7508 -10260 -8762 -11027 -14540 -15455 -4568 -3599 -2527 -3863 1131
6443A131J025l109n144J713L497m794j493l311o72Q867L408J741m537N613Q41
$$ 1131 2156 -953 -6097 -4384 -887 -5681 -7174 -10485 -11157 -2290 1118 2859 -1678 3935 4776
6428D776j714K119k887K519n275r753J722K356L700N83N85P32k616J846M560k715
$$ 4776 3062 5181 2294 4813 -462 -10215 -8493 -6137 -2437 -1854 -1269 -537 -3153 -1307 3253 538
6412E38o604N112r384l259O620m759M474P838j638j459K787k785O632M588l210
$$ 538 -6066 -954 -10338 -13597 -6977 -11736 -7262 576 -1062 -2521 266 -2519 4113 8701 5491
6397E491m937j000q11l241o755r159K578O114N329n80j945j230n929n00R067O545
$$ 5491 554 -446 -1257 -4498 -11253 -20412 -17834 -11720 -6391 -6971 -8916 -10146 -16075 -16575 -7508 -963
6381i63O188j730J496K592K409K26k228m292l708l947n557q40q952O299J3777
$$ -963 5225 3495 4991 7583 9992 10218 7990 3698 -10 -3957 -9514 -10354 -19306 -13007 770
6366G70N680r77j836k328k066m263M487J562j638m088l087N026R473Q720k317
$$ 770 6450 5473 3637 1309 -757 -5020 -533 1029 -609 -4697 -7784 -2758 6715 15435 13118
6351A3118q930j0263l199N925j945k337M254k398n558l878k269P438L023K842
$$ 13118 4188 -6075 -9274 -3349 -5294 -7631 -3377 -5775 -11333 -15211 -17480 -10042 -7019 -4177
6337d177n529k26K530O054Q009K530j380j033l121l191l304q35o520q25M690l716
$$ -4177 -9706 -9932 -7402 -1348 6661 9191 7811 6778 3657 466 -2838 -3673 -10193 -11018 -6328 -10044
6321a0044o33r59J449r31P94j242O020J379M529m714m12j184o13l965j30P406
$$ -10044 -10677 -11636 -10187 -11118 -10324 -11566 -5546 -4167 362 -4352 -4764 -5948 -6561 -10526 -10656 -3250
6305c250O250L886R41k968j1905K871L405m793q449j285K097K150N330r7n59M517
$$ -3250 3000 6886 7827 4859 -7046 -4175 -770 -5563 -14012 -15297 -13200 -11050 -5720 -5817 -6376 -1859
6289a859l05j0886K05N345P160M395P697L013j0667p841N178l576k010J88L449
$$ -1859 -2164 -13050 -12845 -7500 -340 4055 11752 14765 4098 -3743 1435 -2141 -4151 -3963 -514
6274e14j93K238M533p8L417o032j524K715j291N31j691n04j358j562j950K52R40
$$ -514 -707 1531 6064 5986 9403 3371 1847 4562 3271 3802 2111 1607 249 -1313 -3263 -3011 -2071
6257b071j93J068o327P02J063m024M73R712L225o58K781l070k443l505l5k363
$$ -2071 -2264 -1196 -7523 -6821 -5758 -9782 -9309 403 3628 2970 5751 2681 238 -3267 -3302 -5665
6241e665j270r57L366M337l800Q45K395k078P67R064j304j962n146j2245J070
$$ -5665 -6935 -7892 -4526 -189 -3989 -3144 -749 -2827 -2060 7004 5700 3738 -1408 -13653 -12583
6226a2583M635J996k342M9L268M396o317J489J726k180K28J134K542m856N6K368
$$ -12583 -7948 -5952 -8294 -8245 -4977 -581 -6898 -5409 -3683 -5863 -5635 -4501 -1959 -6815 -6759 -4391
6210d391o23N807M570L297j896p097l270O26k208j785om38l723K742N73K468J261
$$ -4391 -5014 793 5363 8660 6764 -333 -3603 -2977 -5185 -6970 -6976 -7414 -11137 -8395 -7822 -5354 -4093
6193d093k366L1k500p719q322P522N352q34m35Q058L314K131M061j456K349J259
$$ -4093 -6459 -6428 -8928 -16647 -24969 -17447 -12095 -12929 -13364 -5306 -1992 139 4200 2744 5093 6352
6177F352K618l862j840J44n958l28L767M153k839k267l518n952J530N931R31Q263
$$ 6352 8970 5108 3268 3412 -2546 -2874 893 5046 2207 -60 -3578 -9530 -8000 -2069 -1138 7125
6161G125o577m663N87p220m544J252O841J988L886P346j225o272M754m06l016
$$ 7125 548 -4115 -3528 -10748 -15292 -14040 -7199 -5211 -1325 6021 4796 -1476 3278 2872 -144
6146a44j758J225O96o033L461M773M089m69K831L053m789l630k731K909J141J211
$$ -144 -1902 -677 19 -6014 -2553 2220 6309 5840 8671 11724 6935 3305 574 3483 4624 5835
6130E835k692l411k943j42j82k660M959J71l603N45O916M148m251o953k883q61
$$ 5835 3143 -268 -3211 -3353 -3535 -6195 -1236 -1065 -4668 -4123 2793 6941 2690 -4263 -7146 -8007
6114h007l783o230n430O386P328J246n825O672R098j699j444K019K078R991R511
$$ -8007 -11790 -18020 -23450 -17064 -9736 -8490 -14315 -7643 1455 -244 -1688 331 2409 12400 21911
6099B1911m020p627n119l447k076p7l921p7L936K469l164n718p17M293k554K819
$$ 21911 17891 10264 5145 1698 -378 -455 -4376 -4453 -517 1952 -1212 -6930 -7647 -3354 -5908 -3089
6083c089l9Q35J096j201K055l331n164k227M095Q855j689K215N345j332k763l299
$$ -3089 -3128 -2293 -1197 -2398 -343 -3674 -8838 -11065 -6970 1885 196 2411 7756 6424 3661 362
6067C62p611J153J291p471m646k455L891R273M221j174j936j517n48k599n588
$$ 362 -7249 -6096 -4805 -12276 -16922 -19377 -15486 -6213 -1992 -3166 -5102 -6619 -7167 -9766 -15354
6052a5354K040J0425N792K763j535m886l207o008r46L118O102l252K76p07l131
$$ -15354 -13314 -2889 2903 5666 4131 -755 -3962 -9970 -10916 -7798 -1696 -4948 -4672 -5379 -8510
6037h510j475O654N856k59p89N411r26q504l570R462K230m675K575J471l338k028
$$ -8510 -9985 -3331 2525 2266 1477 6888 5962 -2542 -6112 3350 5580 905 3480 4951 1613 -415
6021d15O65j730o146K589M745m459p371K221R922K605K775j546m171P86P811L04
$$ -415 250 -1480 -7626 -5037 -292 -4751 -12122 -9901 21 2626 5401 3855 -316 470 8281 8585
6005H585q94L269L712j211P01m764l374k928L07k024p361l231N429N153j880o70
$$ 8585 7691 10960 14672 13461 14162 9398 6024 3096 3403 1379 -5982 -9213 -3784 1369 -511 -1181
5989a181L674n35m268k486L363K652o058p126m734P871J4498J2372J027r0j277
$$ -1181 2493 1958 -2310 -4796 -1433 1219 -4839 -11965 -16699 -8828 5670 18042 19069 18979 17702
5974A7702p792p147l322N949J217m474l982M189j556L269M509M40o534m887K815
$$ 17702 9910 2763 -559 5390 6607 2133 -1849 2340 784 4053 8562 9002 2468 -2419 396
5959C96M947k002l577l057K569R234q33K77k078j960J053j990P77m76l699n22
$$ 396 5343 3341 -236 -3293 -724 8510 7677 7954 5876 3916 4969 2979 3756 3280 -419 -941
5943i41p835n29M702j0027j0579J1641M182L267Q762k104N35n979o097L612m14
$$ -941 -8776 -9305 -4603 -14630 -25209 -13568 -9386 -6119 2643 539 1074 -4905 -11002 -7390 -7804
5928g804j173K605K532M39m394J677N218J322m068j630k132m8J0K951k780Q41
$$ -7804 -8977 -6372 -3840 -3401 -7795 -6118 -900 422 -3646 -5276 -7408 -7456 -7446 -4495 -7275 -6434
5912f434j227J69j472O201K339j629n757k524R649P386N69j0358L320K267k09
$$ -6434 -7661 -7492 -8964 -2763 -424 -2053 -7810 -10334 -685 6701 7270 -3088 232 2499 2290
5897B290m32M181j530o820p89j283L659L389p281l730J943J1998N04n664o44l745
$$ 2290 1858 6039 4509 -2311 -3100 -4383 -724 2665 -4616 -8346 -6403 5595 6099 435 -209 -3954
5881c954L805J680K097j050k271k843j17m472J457n312k298J879K65l726l78P74
$$ -3954 -149 1531 3628 2578 307 -2536 -2653 -7125 -5668 -10980 -13278 -11399 -11134 -14860 -15238 -14464
5865a4464j042N053j45k067L016K196k8L563j710J243M593P968l905q604j747
$$ -14464 -15506 -10453 -10598 -12665 -9649 -7453 -7481 -3918 -5628 -4385 208 8176 4271 -4333 -6080
5850f080J28o867o18N696R6r92J318j08N007K295M890N01n655R49M722j74n431
$$ -6080 -5952 -12819 -13437 -7741 -7645 -8637 -7319 -7427 -2420 -125 4765 5266 -389 560 5282 5108 -323
5833c23k986k104L814l32J942J9l376R09j691L496N86o793p326J554Q805L313
$$ -323 -3309 -5413 -1599 -1931 11 30 -3346 -2437 -4128 -632 -46 -6839 -14165 -12611 -3806 -493
5817d93R51o322N01O834K026J146M89K224k029R29j309m192j22L94K930l864o018
$$ -493 458 -5864 -5363 1471 3497 4643 5132 7356 5327 6256 4947 755 633 1027 3957 93 -5925
5800e925R44K434p95m002l24q12K802L619l440L791P258J106n11J605L554K106
$$ -5925 -4981 -2547 -3342 -7344 -7668 -8480 -5678 -2059 -5499 -1708 5550 6656 6145 7750 11304 13410
5784A3410k871o262j288O270J776l833n520p219L480J769k691j419K124Q59O38
$$ 13410 10539 4277 2989 9259 11035 7202 1682 -5537 -2057 -288 -2979 -4398 -2274 -1415 -777
5769g77N121k409K185o755q886M92Q538J3331o211n063L179K538J177R42r674
$$ -777 4344 1935 4120 -2635 -11521 -11029 -2491 10840 4629 -434 2745 5283 6460 7402 -2272
5754b272P81P608m718m110J104l994l585K05M506M903M301k928m134j3L40J774
$$ -2272 -1491 6117 1399 -2711 -1607 -5601 -9186 -8981 -4475 428 4729 1801 -2333 -2346 -2006 -232
5738b32q09n02m768L426O207L336j682o475l107J843k019M975L146j490M14n562
$$ -232 -1041 -1543 -6311 -2885 3322 6658 4976 -1499 -4606 -2763 -4782 193 3339 1849 2263 -3299
5722c299q339M158N71L598k133k386k691M668K254K155N128j478l329o07L222
$$ -3299 -11638 -7480 -6909 -3311 -5444 -7830 -10521 -5853 -3599 -1444 3684 2206 -1123 -1730 1492
5707A492q682Q825J0197N212l338j6356n834OM452K806N238J969J811n90p446
$$ 1492 -7190 1635 11832 17044 13706 -2650 -8484 -8478 -4026 -1220 4018 5987 7798 7208 -238
5692b38K097M322k874l259L247L795l979r936j838K39k560n94l035M08N314N169
$$ -238 1859 6181 3307 48 3295 7090 3111 -6825 -8663 -8424 -10984 -11578 -14613 -14205 -8891 -3722
5676c722j504o990K753Q6j688j18m535M743P219j486L951k801m917K789m03M13
$$ -3722 -5226 -12216 -9463 -9377 -11065 -11183 -15718 -10975 -3756 -5242 -1291 -4092 -9009 -6220 -6623 -6210
5660f210M975l47q68l310l748K360r57j672O216N755M054p043k910q99k682n84
$$ -6210 -1235 -1582 -2450 -5760 -9508 -7148 -8105 -9777 -3561 2194 6248 -795 -3705 -4604 -7286 -7870
5644g870j814J750j33j960m39J0141O175l436l082L24J977o02m916l345Q0k129
$$ -7870 -9684 -7934 -8067 -10027 -10466 -325 5850 2414 -668 -344 1633 1031 -3885 -7230 -7150 -9279
5628i279M617k399J842O30n476m666P476Q169K075J852LO101q41m674j845k6J44
$$ -9279 -4662 -7061 -5219 -4589 -10065 -14731 -7255 914 2989 4841 4844 10945 10104 5430 3585 3559 3703
5611C703k466l494L903N728l515q088K054K649n953l042R07M536j49j231j14L527
$$ 3703 1237 -2257 1646 7374 3859 -4229 -2175 474 -5479 -8521 -7614 -3078 -3227 -4458 -4572 -1045
5595a045L64o34K29R82P30k799j668L214k219l060j97J558l099q19O700J54j787
$$ -1045 -681 -1315 -1086 -104 626 -2173 -3841 -627 -2846 -5906 -6103 -4545 -7644 -8463 -1763 -1609 -3396
5578c396j94J999k536q31K040k222M319J364J21J639m3m802n274J17J881L785
$$ -3396 -3590 -1591 -4127 -4958 -2918 -5140 -821 543 664 2303 2260 -2542 -7816 -7699 -5818 -2033
5562b033j035J746l792m821L778j280j623o3O230L420K547R53l315J266K134m86
$$ -2033 -3068 -1322 -5114 -9935 -6157 -7437 -9060 -9123 -2893 527 3074 4027 712 1978 4112 3626
5546C626L79N458n81p988o642j573o612k554K92N825Q562N551o435n98P650M314
$$ 3626 4005 9463 8882 894 -5748 -7321 -13933 -16487 -16195 -10370 -1808 3743 -2692 -3290 4360 8674
5530H674j106K803q959p405l69l362K134J79L541j349K643O39N580O589m333m028
$$ 8674 7568 10371 1412 -5993 -6362 -9724 -7590 -7411 -3870 -5219 -2576 -1937 3643 10232 5899 1871
5514A871l351j631o370o724O512P356L466K650n89k359K328n41J006K436K555
$$ 1871 -1480 -3111 -9481 -16205 -9693 -2337 1129 3779 3190 831 3159 2618 3624 6060 8615
5499H615o841p333p3J713j004p23K461J701L727o88M397K161j462O938q612j3779
$$ 8615 1774 -5559 -5632 -3919 -4923 -5646 -3185 -1484 2243 1555 5952 8113 6651 13589 4977 -8802
5483h802m303J273M964N264J670P884N9n913l738n221N639N061p10l422k576M76
$$ -8802 -13105 -11832 -6868 -1604 66 7950 8009 2096 -1642 -6863 -1224 3837 3127 -295 -2871 -2395
5467b395j519J784L301m975m469N90R072P294l591l346j282M734K492k480j663
$$ -2395 -3914 -2130 1171 -3804 -8273 -7683 1389 8683 5092 1746 464 5198 7690 5210 3547
5452C547k727k241j95Q56p071l313M942j354R75L066j901K687J0542l753o509
$$ 3547 820 -1421 -1616 -760 -7831 -11144 -6202 -7556 -6581 -3515 -5416 -2729 7813 4060 -2449
5437b449m245K512o214K331N949L276j868J868O063n673k918l851r200j868P905
$$ -2449 -6694 -4182 -10396 -8065 -2116 1160 -708 1160 7223 1550 -1368 -5219 -14419 -16287 -8382
5422h382J483K183K777J41J727m052L33L762k336J139Q391L568l153k014M705
$$ -8382 -6899 -4716 -1939 -1798 -71 -4123 -3790 -28 -2364 -1225 7166 10734 7581 5567 10272
5407A0272k598j033L379n586j1524j009j065L730M5J330M620J077p432k013j907
$$ 10272 7674 6641 10020 4434 -7090 -8099 -9164 -5434 -5389 -4059 561 1638 -5794 -7807 -9714
5392i714j975j184K961K102N934k748m810L591M332Q383J298o672k396k267j919
$$ -9714 -11689 -12873 -9912 -7810 -1876 -4624 -9434 -5843 -1511 6872 8170 1498 -898 -3165 -5084
5377e084L049K741l228k898J331p62M865j90M910n473n924l720M364L798L14N00
$$ -5084 -2035 706 -2522 -5420 -4089 -4851 14 -176 4734 -739 -6663 -10383 -6019 -2221 -1907 -1407
5361a407p26M384j964L013p438m73O954L675o389m984j239l230j556N875P656
$$ -1407 -2133 2251 287 3300 -4138 -4611 2343 6018 -371 -5355 -6594 -9824 -11380 -5505 2151
5346B151m98o69m390N261J1510r64n511p003j259L316m28l982L656l710J0214
$$ 2151 1653 984 -3406 1855 13365 12401 6890 -113 -1372 1944 1516 -2466 1190 -2520 7694
5331G694O708m644o10o33K556o050k752J840J602J59r24J964L071j376P00q92
$$ 7694 14402 9758 9148 8515 11071 5021 2269 4109 5711 5870 4946 6910 9981 8605 9305 8413
5315H413n077k438L538M82p406N37n341n959l52L818R48K693Q845N543K680l961
$$ 8413 3336 898 4436 4918 -2488 -1951 -7292 -13251 -13603 -9785 -8837 -6144 2701 8244 10924 6963
5299F963j181l341n751M185l11k268r60l94k700M658M220l54l593R92R60n307
$$ 6963 5782 2441 -3310 875 564 -1704 -2664 -3058 -5758 -1100 3120 2766 -827 165 1125 -4182
5283d182p830J05M137K212M990J01M275N491k384j273j0200k07M590M77n14k67
$$ -4182 -12012 -11907 -7770 -5558 -568 -467 3808 9299 6915 5642 -4558 -4765 -175 302 -212 -479
5267d79n174J777J699L329K497q274j3565j102P816Q649K660l701o382j301j627
$$ -479 -5653 -3876 -2177 1152 3649 -4625 -18190 -19292 -11476 -2827 -167 -3868 -10250 -11551 -13178
5252a3178N398J992m01J831k542j3189J478J2255N149L94p407n870O89l386j387
$$ -13178 -7780 -5788 -6189 -4358 -6900 -20089 -18611 -6356 -1207 -813 -8220 -14090 -13401 -16787 -18174
5237a8174k413l456J418R287j686J513J700P977p12l073M163L817R53l883p377
$$ -18174 -20587 -24043 -22625 -13338 -15024 -13511 -11811 -3834 -4546 -7619 -3456 361 1314 -2569 -9946
5222i946q586R31P815N911l686j681L664M565j00j409M284J938j401j0365j1437
$$ -9946 -18532 -17601 -9786 -3875 -7561 -9242 -5578 -1013 -1113 -2522 1762 3700 2299 -8066 -19503
5207a9503O186J2017j604J588r65k201j093L654O743K342K64J40m208j997J156
$$ -19503 -13317 -1300 -2904 -1316 -2281 -4482 -5575 -1921 4822 7164 7428 7568 3360 1363 2519
5192B519J774n629k620M337P004m302p599k428k683P41J910Q666K933j816Q17
$$ 2519 4293 -1336 -3956 381 7385 3083 -4516 -6944 -9627 -8886 -6976 1690 4623 2807 3624
5177C624J380o077n612K658P90j67L378K456m614Q53L135o42k701M954l802Rk627
$$ 3624 5004 -1073 -6685 -4027 -3237 -3404 -26 2430 -2184 -1331 1804 1162 -1539 3415 -387 -378 -3005
5160c005m437N766P471m132j849J494P86O45n793o181L051k407l364O406O523
$$ -3005 -7442 -1676 5795 1663 -186 1308 2094 2739 -3054 -9235 -6184 -8591 -11955 -5549 974
5145I74O15o88J235J506n491p095o90k595n421L20Q894O283Q891M097K51j025
$$ 974 1589 901 2136 3642 -1849 -8944 -9634 -12229 -17650 -17330 -8436 -2153 6738 10835 11086 10061
5129A0061p836o987j090P295J649o645N242K832l792j751k22o168L135j748J727
$$ 10061 2225 -4762 -5852 1443 3092 -3553 1689 4521 729 -1022 -1244 -7412 -4277 -6025 -4298
5114d298l760m947K882M254J636K287Q118N31j0759K043N906j0118P21n71j0384
$$ -4298 -8058 -13005 -10123 -5869 -4233 -1946 6172 6703 -4056 -2013 3893 -6225 -5504 -6075 -16459
5099a6459n888O05J0146L316l569J094N658L048r604M27P325K118k608J502m545
$$ -16459 -22347 -21742 -11596 -8280 -11849 -10755 -5097 -2049 -11653 -11226 -3901 -1783 -4391 -2889 -7434
5084g434m200M272J501l051J73M421J883J16m912l855J236K3N745L536q870m869
$$ -7434 -11634 -7362 -5861 -8912 -8739 -4318 -2435 -2319 -7231 -11086 -9850 -9827 -4082 -546 -9416 -14285
5068a4285N245K367l723K998L256K183j751n91L479j30L552K869n1n297m742l640
$$ -14285 -9040 -6673 -10396 -7398 -4142 -1959 -3710 -4301 -822 -952 2600 5469 5418 121 -4621 -8261
5052h261l937P209K737L426J510j989m167O016Q423j841q819N033N29K74J700
$$ -8261 -12198 -4989 -2252 1174 2684 695 -3472 2544 10967 9126 307 5340 5869 6143 7843
5037G843N288k226m621l773m780R48L143O917j89K673n708k696M886p40l127m648
$$ 7843 13131 10905 6284 2511 -2269 -1321 1822 8739 8550 11223 5515 2819 7705 6965 3838 -810
5021h10m002j386M302l827k88K538L647O779N03J549l320k945l501l202L239J231
$$ -810 -4812 -6198 -1896 -5723 -6011 -3473 174 6953 7456 9005 5685 2740 -761 -3963 -724 507
5005E07m493j534p22K822J129j798J212Q542L096k806l497j753M491J821p680
$$ 507 -3986 -5520 -6242 -3420 -2291 -4089 -2877 5665 8761 5955 2458 705 5196 7017 -663
4990f63o209j840O307N956l245L81J280m880m470P450M699l697J71j142L455o534
$$ -663 -6872 -8712 -2405 3551 306 687 1967 -2913 -7383 67 4766 1069 1240 98 3553 -2981
4974b981r15N27M405J431l423K129M938K48L648R54j407n783o665j380M89P707
$$ -2981 -3896 -3369 1036 2467 -956 1173 6111 6359 10007 10961 9554 3771 -2894 -4274 -3785 3922
4958C922j294l895J984j523L02k729n136M271K309M331L642m40P18n206J0j771
$$ 3922 2628 -1267 717 -806 -504 -3233 -8369 -4098 -1789 2542 6184 5744 6462 1256 1266 -505
4942e05k671k951m300K07M550N37n123o92K07N648o02k582K733K676P435j939
$$ -505 -3176 -6127 -10427 -10220 -5670 -5133 -10256 -10948 -10741 -5093 -5695 -8277 -5544 -2868 4567 2628
4926B628q230j659N137r48l798k599k320K75k326Q283R984n13L336j287q091o337
$$ 2628 -5602 -7261 -2124 -3072 -6870 -9469 -11789 -11514 -13840 -5557 4427 3914 7250 5963 -2128 -8465
4910h465j041L327j589J515j012p003K48L721K922J646j211n032n296R902O341
$$ -8465 -9506 -6179 -7768 -6253 -7265 -14268 -14020 -10299 -7377 -5731 -6942 -11974 -17270 -7368 -1027
4895a027M323k198l101j916k224J100l22L770O894M334J424J319m406j0651K33
$$ -1027 3296 1098 -2003 -3919 -6143 -5043 -5365 -1595 5299 9633 11057 12376 7970 -2681 -2448
4880b448q86l533N263R866J800p262o345J455L647J194m446r52K03o38q434l289
$$ -2448 -3334 -6867 -1604 8262 10062 2800 -3545 -2090 1557 2751 -1695 -2647 -2444 -3082 -11516 -14805
4864a4805O77J947M992Q852R639L350l518k864r581o984P00J035K947l054M260
$$ -14805 -14128 -12181 -7189 1663 11302 14652 11134 8270 -1311 -8295 -7595 -6560 -3613 -6667 -2407
4849b407K979k161k703N513N784L484n496q415K364n899j0417L248J214K161J241
$$ -2407 572 -1589 -4292 1221 7005 10489 4993 -3422 -1058 -6957 -17374 -14126 -12912 -10751 -9510
4834i510j238J040O459J414k375l924q068J594K555k29N705K885M194j715l661
$$ -9510 -10748 -9708 -3249 -1835 -4210 -8134 -16202 -14608 -12053 -12282 -6577 -3692 502 -1213 -4874
4819d874k731K16L283J646m49J255J572m676m48j059L113o758L43M079l093m70
$$ -4874 -7605 -7389 -4106 -2460 -2909 -1654 -82 -4758 -5206 -6265 -3152 -9910 -9567 -5488 -8581 -9051
4803i051J394j775k435j278L918L653J14Q66m527k193N575M156p145r30M117L391
$$ -9051 -7657 -9432 -11867 -13145 -9227 -5574 -5460 -4594 -9121 -11314 -5739 -1583 -8728 -9658 -5541 -2150
4787b150m523m158M014J0184J299K040M517k008J006K061k110j972l989k519o415
$$ -2150 -6673 -10831 -6817 3367 4666 6706 11223 9215 10221 12282 10172 8200 4211 1692 -4723
4772d723N111J077m066J0342M473p609o031M241O327j327r063l555O135j553o985
$$ -4723 388 1465 -2601 7741 12214 4605 -1426 2815 9142 7815 -1248 -4803 1332 -221 -7206
4757g206k591k020M903P934Q627j001r786o282m599J538n874j054k268K294J0706
$$ -7206 -9797 -11817 -6914 1020 9647 8646 -1140 -7422 -12021 -10483 -16357 -17411 -19679 -17385 -6679
4742f679L877p999o461L146O237M357k155j281k690m461k354P504J0394O709O075
$$ -6679 -2802 -10801 -17262 -14116 -7879 -3522 -5677 -6958 -9648 -14109 -16463 -8959 1435 8144 14219
4727A4219L45k504j958l532p428k939l410K883l042j778J909P739R024K300r27
$$ 14219 14564 12060 10102 6570 -858 -3797 -7207 -4324 -7366 -9144 -7235 504 9528 11828 10901
4712A0901j0652j0563o163J325l087J644J828L57P842L501o050k161K488j627
$$ 10901 249 -10314 -16477 -15152 -18239 -16595 -14767 -14410 -6568 -3067 -9117 -11278 -8790 -10417
4698a0417L370L152J323M92l983Q22K068m580l017M076K175l331m479K044M669
$$ -10417 -7047 -3895 -2572 -2080 -6063 -5241 -3173 -7753 -10770 -6694 -4519 -7850 -12329 -10285 -5616
4683e616J513K839J887K760J464J993l155q222j1156k053K969P765J840m945J954
$$ -5616 -4103 -1264 623 3383 4847 6840 3685 -4537 -15693 -17746 -14777 -7012 -5172 -10117 -8163
4668h163R690j276q545K465P386K215k63o30N017q137p445L249O769L228n790
$$ -8163 1527 251 -8294 -5829 1557 3772 3509 2879 7896 -241 -7686 -4437 2332 5560 -230
4653b30p759q156N222J0452N110q292J440j503J219N49l149j486r208L95M913
$$ -230 -7989 -16145 -10923 -471 4639 -3653 -2213 -3716 -2497 -1948 -5097 -6583 -15791 -15396 -10483
4638a0483M924O432j960J532k249R12j366K086n32j310k241J766P06L94m627k785
$$ -10483 -5559 873 -1087 445 -1804 -892 -2258 -172 -704 -2014 -4255 -2489 -1783 -1389 -6016 -8801
4622h801l354k302l28P347O958j960O85N021m212n122m9O08O751j376N380N959
$$ -8801 -12155 -14457 -14785 -7438 -480 -2440 -1755 3266 -946 -6068 -6117 -5509 1242 -134 5246 11205
4606A1205L97q63j0120n877l262l955m008m139N068J0724J379J715j482M181k300
$$ 11205 11602 10739 619 -5258 -8520 -12475 -16483 -20622 -15554 -4830 -3451 -1736 -3218 963 -1337
4591a337k73M695j288p2m563k084r50k727K839N895n102M25k107l257M744L903
$$ -1337 -1610 3085 1797 1725 -2838 -4922 -5872 -8599 -5760 135 -4967 -4542 -6649 -9906 -5162 -1259
4575a259j13j218k539M051O553O20o644k443P584n907m892p22j784P980R038q45
$$ -1259 -1372 -2590 -5129 -1078 5475 6095 -549 -2992 4592 -1315 -6207 -6929 -8713 -733 8305 7460
4559G460J840J127k310p437Q47j319P229L22l327K853k811p593K996K35J7j936
$$ 7460 9300 10427 8117 680 1527 208 7437 7759 4432 7285 4474 -3119 -123 112 129 -1807
4543a807k685k946k102Q431Q76n830J746N378J879j843L769l356k087m88j504
$$ -1807 -4492 -7438 -9540 -1109 -233 -6063 -4317 1061 2940 1097 4866 1510 -577 -1065 -2569
4528b569J474l258K852K228j381k751k311m335R12L960j939J576L896L119j020
$$ -2569 -1095 -4353 -1501 727 -654 -3405 -5716 -10051 -9139 -5179 -7118 -5542 -1646 1473 453
4513D53L646m075l007o89k704l46O800N893J73r621n773m144P626J385M980J535
$$ 453 4099 24 -2983 -3672 -6376 -6722 78 5971 6144 -3477 -9250 -13394 -5768 -4383 597 2132
4497B132K117j555k27o666K731J741o45K30k079n16J490K193L164K291K128o259
$$ 2132 4249 2694 2467 -4199 -1468 273 -372 -142 -2221 -2737 -1247 946 4110 6401 8529 2270
4481B270m737k43M357J404K865m433p56M502l790k428N992L796n538m423K871
$$ 2270 -2467 -2710 1647 3051 5916 1483 727 5229 1439 -989 5003 8799 3261 -1162 1709
4466A709J0620p595j1629p481J73J532M445N401P814j786J72N52P67o990O902
$$ 1709 12329 4734 -6895 -14376 -14203 -12671 -8226 -2825 4989 3203 3375 3927 4694 -2296 4606
4451D606J902k254p70k464K38M37k39n03j693N627N067l811m120m973j553J88
$$ 4606 6508 4254 3484 1020 1258 1695 1456 953 -740 4887 9954 6143 2023 -2950 -4503 -4315
4435d315L281L8m08l876j160k909j163O935J493N244n044l1k427JK736l264O88
$$ -4315 -1034 -996 -1404 -5280 -6440 -9349 -10512 -3577 -2084 3160 -1884 -1915 -4342 -4341 -1605 -4869 -4181
4418d181L168M345j791r55Q50O900o973o018k816K868J948L033M353K534k290
$$ -4181 -1013 3332 1541 586 1436 8336 1363 -4655 -7471 -4603 -2655 378 4731 7265 4975
4403D975l107K159J907o046m70M0J571N251L56k505k627Q115K222q495k247k466
$$ 4975 1868 4027 5934 -112 -582 -542 1029 6280 6636 4131 1504 9619 11841 3346 1099 -1367
4387a367J724O420n372l402o595l380R904K151o516m976j216l979j20R251O503
$$ -1367 357 6777 1405 -1997 -8592 -11972 -2068 83 -6433 -11409 -12625 -16604 -16724 -7473 -970
4372i70J346n828o88N075O464j52m839J301J0019Q7k146M071q67j0367P76J2017
$$ -970 376 -5452 -6140 -1065 5399 5247 408 1709 11728 11815 9669 13740 12873 2506 3282 15299
4356A5299n984q407P78J718L349l132k252l030l944p25j406K280j115k03Q061
$$ 15299 9315 908 1686 3404 6753 3621 1369 -1661 -5605 -6330 -7736 -5456 -6571 -6774 1287
4341A287M110m961J514J554k764m475m733m4J495M352P02L184K758O606k071J006
$$ 1287 5397 436 1950 3504 740 -3735 -8468 -8512 -7017 -2665 -1963 1221 3979 10585 8514 9520
4325I520N958n741l531m899j063O68L963N74n699n174K261K205k22l541k317P08
$$ 9520 15478 9737 6206 1307 244 912 4875 5449 -250 -5424 -3163 -958 -1180 -4721 -7038 -6330
4309f330J301Q08N714M612m392j051J560J410J43k367l342K190K853k682n548
$$ -6330 -5029 -4221 1493 6105 1713 662 2222 3632 3775 1408 -1934 256 3109 427 -5121
4294e121k430J958L604k425L155J1286j0296n927j747L672k122Q27K333L670n39
$$ -5121 -7551 -5593 -1989 -4414 -1259 10027 -269 -6196 -7943 -4271 -6393 -5566 -3233 437 -102
4279a02J514m803L54L288K458m809q932J499K407K588k803R0J978N533L616j103
$$ -102 1412 -3391 -3037 251 2709 -2100 -11032 -9533 -7126 -4538 -7341 -7251 -5273 260 3876 2773
4263B773P66J360o20n394n071q228L710R554N768j782j139N027k223J310l519
$$ 2773 3539 4899 4279 -1115 -6186 -14414 -10704 -1150 4618 2836 1697 6724 4501 5811 2292
4248B292p880J693k199L264K252J134L241j40o522j129n471k661p7j685O974J0806
$$ 2292 -5588 -3895 -6094 -2830 -578 556 3797 3657 -2865 -3994 -9465 -12126 -12203 -13888 -6914 3892
4232C892o24l227l786l686p074J373P938L448J636k192m665n528J943Q131M484
$$ 3892 3268 41 -3745 -7431 -14505 -13132 -5194 -1746 -110 -2302 -6967 -12495 -10552 -2421 2063
4217B063p806o66K290L551k080r132P63L374O161P365K873K115k748l863m570
$$ 2063 -5743 -6409 -4119 -568 -2648 -11780 -11017 -7643 -1482 5883 8756 10871 8123 4260 -310
4202c10o662k835K917O193j321j644j429k497M256m196o286J291k759N798R940
$$ -310 -6972 -9807 -6890 -697 -2018 -3662 -5091 -7588 -3332 -7528 -13814 -12523 -15282 -9484 456
4187D56L82q630n836J380j225R48P690K857m149r24q88j853k327K611K730R02
$$ 456 838 -7792 -13628 -12248 -13473 -12525 -4835 -1978 -6127 -7051 -7939 -9792 -12119 -9508 -6778 -5876
4171e876K01N726K633j0127k386M75j367l038j720J0080J478j584N442M212R45
$$ -5876 -5675 51 2684 -7443 -9829 -9354 -10721 -13759 -15479 -5399 -3921 -5505 -63 4149 5094
4156E094K549j827Q43j776n010l355j072L742N425n239m035k632L137l843P512
$$ 5094 7643 5816 6659 4883 -127 -3482 -4554 -812 4613 -626 -4661 -7293 -4156 -7999 -487
4141d87Q306M319J2k904o79K054q339j840q72k028r779Q25L036k935j883N676
$$ -487 7819 12138 12150 9246 8567 10621 2282 442 -430 -2458 -12237 -11412 -8376 -11311 -13194 -7518
4125g518j73J583Q41n14l437K055L889R79j704j676J025N908N716R01l619l438
$$ -7518 -7691 -6108 -5267 -5781 -9218 -7163 -3274 -2295 -3999 -5675 -4650 1258 6974 7875 4256 818
4109H18j674Q47L761k439l096J675p4k590o70N458Q15L92j340r616k322N689J929
$$ 818 -856 -9 3752 1313 -1783 -108 -182 -2772 -3442 2016 2831 3223 1883 -7733 -10055 -4366 -2437
4092b437k092l255j787J991M125k48M304k2p54j512N8j344J797k400k85k389m61
$$ -2437 -4529 -7784 -9571 -7580 -3455 -3703 601 579 -175 -1687 -1629 -2973 -1176 -3576 -3861 -6250 -6711
4075f711n674N90N193Q587m749J587O359k881j591L122j757o162j296P443o459
$$ -6711 -12385 -11795 -6602 1985 -2764 -1177 5182 2301 710 3832 2075 -4087 -5383 2060 -4399
4060d399j0539K436P419L92L645J940l084P64M05M853K941K364p836q348n63P537
$$ -4399 -14938 -12502 -5083 -4691 -1046 894 -2190 -1426 -1021 3832 6773 9137 1301 -7047 -7610 -73
4044g3j441n672l101n435R19P133K148N122o353j010P357m315N74L373N032J731
$$ -73 -1514 -7186 -10287 -15722 -14803 -7670 -5522 -400 -6753 -7763 -406 -4721 -4147 -774 4258 5989
4028E989k199m324m56k57Q93K12M493N144M697r33l620n161N205l193j0686n354
$$ 5989 3790 -534 -990 -1247 -354 -142 4351 9495 14192 13259 9639 4478 9683 6490 -4196 -9550
4012i550K124K499N009l004j892J485K028L527M655L143m974o411N860L497p649
$$ -9550 -7426 -4927 82 -2922 -4814 -3329 -1301 2226 6881 10024 5050 -1361 4499 7996 347
3997C47R12J198l541J199L194m340l594o081K106P409L173o135J187l8j920m670
$$ 347 1259 2457 -1084 115 3309 -1031 -4625 -10706 -8600 -1191 1982 -4153 -2966 -3004 -4924 -9594
3981i594J151L097J670K86o104l868J986O198K278m112M01M650K03o483K909Q705
$$ -9594 -8443 -5346 -3676 -3390 -9494 -13362 -11376 -5178 -2900 -7012 -6611 -1961 -1758 -8241 -5332 3373
3965C373l86j0294M533K039L22L448p8K235K862p756k239j533P665n76M166L215
$$ 3373 2987 -7307 -2774 -735 -413 3035 2957 5192 8054 298 -1941 -3474 4191 3615 7781 10996
3949A0996l574l649m554j111n05K120R497P125r299j0563j817N883O658n46l155
$$ 10996 7422 3773 -781 -1892 -2397 -277 9220 16345 7046 -3517 -5334 549 7207 6661 3506
3934C506k948j0182M487J421m859O688L430O97l33n30l380q700p9K146J232M318
$$ 3506 558 -9624 -5137 -3716 -8575 -1887 1543 2240 1907 1377 -2003 -10703 -10782 -8636 -7404 -3086
3918c086J078N460M548m387l842r760L087K356n857n60J849L789M384j381j09
$$ -3086 -2008 3452 8000 3613 -229 -9989 -6902 -4546 -10403 -10963 -9114 -5325 -941 -2322 -2431
3903b431K587P53M061K214m147m632k269N171J023m646R9N135k10p888l532L084
$$ -2431 156 909 4970 7184 3037 -1595 -3864 1307 2330 -2316 -2217 2918 2708 -5180 -8712 -5628
3887e628l439K70K898L749K091K384j312k143l784K015P51J277l687o576n24M994
$$ -5628 -9067 -8797 -5899 -2150 -59 2325 1013 -1130 -4914 -2899 -2148 -871 -4558 -11134 -11658 -6664
3871f664R413j868L5L287m576k190m312J697J955K632J286m788L50O462m845J115
$$ -6664 2749 881 916 4203 -373 -2563 -6875 -5178 -3223 -591 695 -4093 -3743 2719 -2126 -1011
3855a011M357l849k343o61M646J179l646j608k108J387O522j426k025J133k017
$$ -1011 3346 -503 -2846 -3507 1139 2318 -1328 -2936 -5044 -3657 2865 1439 -586 547 -1470
3840a470Q9m853Q71K78n184N8P476L842K806L694L532k9m121q441j516k764m795
$$ -1470 -1381 -6234 -5363 -5085 -10269 -10211 -2735 1107 3913 7607 11139 11110 6989 -1452 -2968 -5732 -10527
3823a0527J232Q269n73O308M078q757m965n933P293K669M112N60j489o701q394
$$ -10527 -9295 -1026 -1599 4709 8787 30 -4935 -10868 -3575 -906 3206 3766 2277 -4424 -12818
3808a2818M071J2152K61n744l117p388m551L969J1140L682J348l487p00R230j0776
$$ -12818 -8747 3405 3666 -2078 -5195 -12583 -17134 -13165 -2025 1657 3005 -482 -1182 8048 -2728
3793b728k017R315O109n589o869k756J092l844l500j157L732M281k677l744k078
$$ -2728 -4745 4570 10679 5090 -1779 -4535 -3443 -7287 -10787 -11944 -8212 -3931 -6608 -10352 -12430
3778a2430N185P829K931j809n127Q28M520j01p779n71J256k471r3K874N995m998
$$ -12430 -7245 584 3515 1706 -3421 -2593 1927 1826 -5953 -6524 -5268 -7739 -7832 -4958 1037 -3961
3762c961j974J344l853l61Q698K656L590K555n872m31m23N68O60O442O91k025
$$ -3961 -5935 -4591 -8444 -8805 -107 2549 6139 8694 2822 2391 1968 2536 3196 9638 10329 8304
3746H304o239P25P07J02j158Q91j8o338J863M63o338o62J474L676M055l33p464
$$ 8304 2065 2790 3497 3599 2441 3332 3314 -3024 -1161 -698 -7036 -7698 -6224 -2548 1507 1174 -6290
3729f290R77k177j334R004m433m540l8k29k810n720N552L543J212R246J2956m827
$$ -6290 -5313 -7490 -8824 180 -4253 -8793 -8831 -9060 -11870 -17590 -12038 -8495 -7283 1963 14919 10092
3713A0092j6760k11J347l441J474o722k829M321L379l209L652R284N213m726n647
$$ 10092 -6668 -6879 -5532 -8973 -7499 -14221 -17050 -12729 -9350 -12559 -8907 377 5590 864 -4783
3698d783K333m17m395j706j148P32n620J752L558j30K725r210K876Q76J393L403
$$ -4783 -2450 -2867 -7262 -8968 -10116 -9384 -15004 -13252 -9694 -9824 -7099 -16309 -13433 -12557 -11164 -7761
3682g761O082l811q5K125L0O323j306k758L77M679O994O377o260m535l767L163
$$ -7761 -1679 -5490 -5575 -3450 -3420 2903 1597 -1161 -784 3895 10889 17266 11006 6471 2704 5867
3666E867N028m186K812O6p587n890k851O084L921n742n09K61n277L37M552M140
$$ 5867 10895 6709 9521 9587 2000 -3890 -6741 -657 3264 -2478 -2987 -2726 -8003 -7666 -3114 1026
3650A026j639J187Q60p43J744k79J07P24k898L435M548M146M08k182q289l083
$$ 1026 -613 574 1434 691 2435 2156 2263 2987 89 3524 8072 12218 12626 10444 2155 -928
3634i28j049L46J920j494n248n135M178K944K953K954K619k131j923l872O793
$$ -928 -1977 -1631 289 -1205 -6453 -11588 -7410 -4466 -1513 1441 4060 1929 6 -3866 2927
3619B927p35l324K535O826k860J343o393n18j716l886J528m180j350L112j423
$$ 2927 2192 -1132 1403 8229 5369 6712 319 -199 -1915 -5801 -4273 -8453 -9803 -6691 -8114
3604h114j054k649N633O246O73L489q57m06k674n644K836q5p776N84L352J489
$$ -8114 -9168 -11817 -6184 62 735 4224 3367 2961 287 -5357 -2521 -2606 -10382 -9798 -6446 -4957
3588d957k86j045L963J428M917K555M17n316p709m384K934J72K329L258J522r60
$$ -4957 -5243 -6288 -2325 -897 4020 6575 6992 1676 -6033 -10417 -7483 -7311 -4982 -1724 -202 -1162
3572a162k172L324J033m31M888M919j747m030k164m249l337k336J794J926N018
$$ -1162 -3334 -10 1023 592 5480 10399 8652 4622 2458 -1791 -5128 -7464 -5670 -3744 1274
3557A274P295J198n357l360j0111o212O022L489M519p56O637N717j255j703l193
$$ 1274 8569 9767 4410 1050 -9061 -15273 -9251 -5762 -1243 -1999 4638 10355 9100 7397 4204
3542D204R7j004L603O253k821l814l034J76K008J025l884p66j082l552o392k426
$$ 4204 4301 3297 6900 13153 10332 6518 3484 3660 5668 6693 2809 2043 961 -2591 -8983 -11409
3526a1409Q251M311J106M367J973o600p236J101n3J711K693m683r97L973J620
$$ -11409 -3158 1153 2259 6626 8599 1999 -5237 -4136 -4189 -2478 215 -4468 -5465 -1492 128
3511A28p065o92J177j019P450K109M59q747M359O189N847q129K315M059K231j399
$$ 128 -6937 -7629 -6452 -7471 -21 2088 2547 -6200 -1841 4348 10195 2066 4381 8440 10671 9272
3495I272q796n128L755N378m243l584k993k680m017K822l769J057K949N782r77
$$ 9272 476 -4652 -897 4481 238 -3346 -6339 -9019 -13036 -10214 -13983 -12926 -9977 -4195 -5172
3480e172j019L839O180K884M415J269k691o570o461P08q07k358n301J723M157
$$ -5172 -6191 -2352 3828 6712 11127 12396 9705 3135 -3326 -2618 -3425 -5783 -11084 -9361 -5204
3465e204M410K304o654K904L708j395m093m71L525J0658Q03j1400p140K385j561
$$ -5204 -794 1510 -5144 -2240 1468 73 -4020 -4491 -966 9692 10495 -905 -8045 -5660 -7221
3450g221K591p5Q52R99J890j514l344n854N200q267P941J2408K106L97l675n764
$$ -7221 -4630 -4705 -3853 -2854 -964 -2478 -5822 -11676 -6476 -14743 -6802 5606 7712 8109 4434 -1330
3434a330m017m155j62K326P616J876K05N439p35j399n306J17Q249o066j0157n071
$$ -1330 -5347 -9502 -9664 -7338 278 2154 2359 7798 7063 5664 358 475 8724 2658 -7499 -12570
3418a2570J285P294N816l678j115l271o333M120K977R69N134p86m341O749N70
$$ -12570 -11285 -3991 1825 -1853 -2968 -6239 -12572 -8452 -5475 -4506 628 -158 -4499 2250 2820
3403B820k990o256R07N926m160K760m34p558J867J602J194K176j084m913L400
$$ 2820 -170 -6426 -5519 407 -3753 -993 -1427 -8985 -7118 -5516 -4322 -2146 -3230 -8143 -4743
3388d743R562M581m06l669J526K317n69l467L94j0135M836L687m041j710m15J696
$$ -4743 4819 9400 8994 5325 6851 9168 8599 5132 5526 -4609 227 3914 -127 -1837 -2252 -556
3372e56N679k984o351K89R69K704m438J210m961L888k855K375N420M689K401n623
$$ -556 5123 2139 -4212 -3923 -2954 -250 -4688 -3478 -8439 -4551 -7406 -5031 389 5078 7479 1856
3356A856j605J097J336J121p56q840k483k046Q36J1552Q346q681l486M143J692
$$ 1856 251 1348 2684 3805 3049 -5791 -8274 -10320 -9484 2068 10414 1733 -1753 2390 4082
3341D082N249L444k285O34K679n860l329l972m515j843n35j576j755j167j492
$$ 4082 9331 12775 10490 11124 13803 7943 4614 642 -3873 -5716 -6251 -7827 -9582 -10749 -12241
3326a2241o11j099K012M776P586J952J044l649o39L810J046k636L198P435M911
$$ -12241 -12852 -13951 -11939 -7163 423 2375 3419 -230 -869 2941 3987 1351 4549 11984 16895
3311A6895j0273q404q24K261N00N85N674l390p063K014J87L716l02J256q052j366
$$ 16895 6622 -1782 -2606 -345 155 740 6414 3024 -4039 -2025 -1838 1878 1576 2832 -5220 -6586
3295f586Q997N535l071q973o36K936n004p009J919n02n721M215P25K295J315j
$$ -6586 2411 7946 4875 -4098 -4734 -1798 -6802 -13811 -11892 -12394 -18115 -13900 -13175 -10880 -9565 -9566
3279i566p32k561O498P09L612M269J25J481l050m199k533N868K786J726J645p782
$$ -9566 -10298 -12859 -6361 -5652 -2040 2229 2354 3835 785 -3414 -5947 -79 2707 4433 6078 -1704
3263a704J93L209J741k164q3l388p411M341p22M196P298N828l979j2498L304L051
$$ -1704 -1511 1698 3439 1275 1192 -2196 -9607 -5266 -5988 -1792 5506 11334 7355 -5143 -1839 1212
3247A212k795n592J389O076J0980k170l431n601j359m15O445M388p316r372K479
$$ 1212 -1583 -7175 -5786 290 11270 9100 5669 68 -1291 -1706 4739 9127 1811 -7561 -5082
3232e082O692J319n869m509j431M511K141j466K311J89n91J783M850j923j726
$$ -5082 1610 2929 -2940 -7449 -8880 -4369 -2228 -3694 -1383 -1194 -1785 -2 4848 2925 1199
3217A199K550N233k057n891j560L02n969O346Q769n633j434J913m614O181L504
$$ 1199 3749 8982 6925 1034 -526 -224 -6193 153 8922 3289 1855 3768 -846 5335 8839
3202H839k299p577k092K431O163N12j206N022j561o519P12L306m280N57j062n346
$$ 8839 6540 -1037 -3129 -698 5465 5977 4771 9793 8232 1713 2425 5731 1451 2008 946 -4400
$$ [...]
##END NTUPLES=NMR SPECTRUM
##END=
