##TITLE=Analysis number 325613
Compound Code cc 59513
Book Reference 508/36
Project Code adrs
Chemist Name antons
##JCAMPDX= 6.0         $$ Bruker NMR JCAMP-DX V2.0
##DATA TYPE= NMR SPECTRUM
##DATA CLASS= NTUPLES
##ORIGIN= Bruker BioSpin GmbH
##OWNER= nmr
$$ XWIN-NMR		Version 3.5
$$ Tue Jan  9 08:54:23 2007 GMT Standard Time (UT+0h)  MAYBRIDGE\nmr@NMR_250MHZ
##.OBSERVE FREQUENCY= 250.131544655141
##.OBSERVE NUCLEUS= ^1H
##.ACQUISITION MODE= SIMULTANEOUS (DQD)
##.ACQUISITION SCHEME= undefined
##.AVERAGES= 16
##.DIGITISER RES= 18
##SPECTROMETER/DATA SYSTEM= dpx250
##.PULSE SEQUENCE= zg30
##.SOLVENT NAME= CDCl3
##.SHIFT REFERENCE= (INTERNAL, CDCl3, 0, 16.522)
##AUDIT TRAIL= $$ (NUMBER, WHEN, WHO, WHERE, WHAT)
$$ ##TITLE= Audit trail, XWIN-NMR		Version 3.5
$$ ##JCAMPDX= 5.01
$$ ##ORIGIN= Bruker BioSpin GmbH
$$ ##OWNER= nmr
$$ C:\u/data/dgb/nmr/ADRS/760/pdata/1/auditp.txt
$$ ##AUDIT TRAIL=  $$ (NUMBER, WHEN, WHO, WHERE, WHAT)
(   1,<2007-01-09 08:54:02.45 +000>,<MAYBRIDGE\nmr>,<NMR_250MHZ>,
      <created by zg, POWCHK disabled, PULCHK disabled
       configuration hash MD5:
       49 4B E0 1D 92 C2 6B 37 9F E6 65 BC 52 41 86 1D
       data hash MD5: 64K
       07 C0 47 EA AF 18 99 DE 9A B9 4B C3 E3 AC 94 7F>)
(   2,<2007-01-09 08:54:13.91 +000>,<MAYBRIDGE\nmr>,<NMR_250MHZ>,
      <Start of raw data processing
       ef LB = 0.3 FT_mod = 6 PKNL = 1 SI = 32K 
       data hash MD5: 32K
       20 BF 16 03 9E 10 B9 25 FE 8D F5 58 CC 5A 89 28>)
(   3,<2007-01-09 08:54:15.56 +000>,<MAYBRIDGE\nmr>,<NMR_250MHZ>,
      <apk 
       data hash MD5: 32K
       6E 28 5B 83 E6 09 0B 41 0F 7B A5 1E D6 85 20 BF>)
(   4,<2007-01-09 08:54:16.46 +000>,<MAYBRIDGE\nmr>,<NMR_250MHZ>,
      <abs ABSG = 5 
       data hash MD5: 32K
       73 6B 5F 47 F7 73 A0 56 93 1F 73 88 CA 65 7E 45>)
$$ ##END=
$$ 
$$ hash MD5
$$ AC 22 4E A9 D3 82 21 DF 07 B9 D7 D5 AD 7B F6 CA
##$RELAX= 
##$RELAX= 
##$RELAX= 
##$RELAX= 
##$RELAX= 
##$RELAX= 
##$RELAX= 
$$ Bruker specific parameters
$$ --------------------------
##$DU= <C:\u>
##$EXPNO= 760
##$NAME= <ADRS>
##$PROCNO= 1
##$TYPE= <nmr>
##$USER= <dgb>
##$AMP= (0..31)
100 100 100 100 100 100 100 100 100 100 100 100 100 100 100 100 100 100 
100 100 100 100 100 100 100 100 100 100 100 100 100 100 
##$AQSEQ= 0
##$AQ_mod= 3
##$AUNM= <au_zg>
##$AUTOPOS= <3 >
##$BF1= 250.13
##$BF2= 250.13
##$BF3= 250.13
##$BF4= 250.13
##$BF5= 500.13
##$BF6= 500.13
##$BF7= 500.13
##$BF8= 500.13
##$BYTORDA= 1
##$CFDGTYP= 0
##$CFRGTYP= 5
##$CHEMSTR= <none>
##$CNST= (0..31)
1 1 145 1 1 1 1 1 1 1 1 1 1 1 1 1 1 1 1 1 1 1 1 1 1 1 1 1 1 1 1 1 
##$CPDPRG= <>
##$CPDPRG1= <>
##$CPDPRG2= <>
##$CPDPRG3= <>
##$CPDPRG4= <mlev>
##$CPDPRG5= <mlev>
##$CPDPRG6= <mlev>
##$CPDPRG7= <mlev>
##$CPDPRG8= <mlev>
##$CPDPRGB= <>
##$CPDPRGT= <>
##$D= (0..31)
0 1 0 0 0 0 0 0 0 0.06 0 0 0 0 0 0 0.0002 0 0 0 0 0 0 0 0 0 0 0 0 0 0 
0 
##$DATE= 1168332841
##$DBL= (0..7)
120 120 120 120 120 120 120 120 
##$DBP= (0..7)
150 150 150 150 150 150 150 150 
##$DBP07= 0
##$DBPNAM0= <>
##$DBPNAM1= <>
$$ [...]
##$SUBNAM6= <"">
##$SUBNAM7= <"">
##$SUBNAM8= <"">
##$SUBNAM9= <"">
##$SW= 20.6930455092707
##$SWIBOX= (0..15)
0 0 3 0 0 0 0 0 0 0 0 0 0 0 0 0 
##$SW_h= 5175.983436853
##$TD= 65536
##$TD0= 1
##$TE= 294.16
##$TE2= 300
##$TE3= 300
##$TEG= 300
##$TL= (0..7)
0 120 120 120 120 120 120 120 
##$TP= (0..7)
150 150 150 150 150 150 150 150 
##$TP07= 0
##$TPNAME0= <>
##$TPNAME1= <>
##$TPNAME2= <>
##$TPNAME3= <>
##$TPNAME4= <>
##$TPNAME5= <>
##$TPNAME6= <>
##$TPNAME7= <>
##$TPOAL= (0..7)
0.5 0.5 0.5 0.5 0.5 0.5 0.5 0.5 
##$TPOFFS= (0..7)
0 0 0 0 0 0 0 0 
##$TUNHIN= 0
##$TUNHOUT= 0
##$TUNXOUT= 0
##$USERA1= <user>
##$USERA2= <user>
##$USERA3= <user>
##$USERA4= <user>
##$USERA5= <user>
##$V9= 5
##$VALIST= <valist>
##$VCLIST= <CCCCCCCCCCCCCCC>
##$VD= 0
##$VDLIST= <DDDDDDDDDDDDDDD>
##$VPLIST= <PPPPPPPPPPPPPPP>
##$VTLIST= <TTTTTTTTTTTTTTT>
##$WBST= 1024
##$WBSW= 4
##$XGAIN= (0..3)
0 0 0 0 
##$XL= 0
##$YL= 0
##$YMAX_a= 537802
##$YMIN_a= -619670
##$ZGOPTNS= <>
##$ZL1= 120
##$ZL2= 120
##$ZL3= 120
##$ZL4= 120
##$ABSF1= 16.522
##$ABSF2= -4.171173
##$ABSG= 5
##$ABSL= 3
##$ALPHA= 0
##$AQORDER= 0
##$ASSFAC= 0
##$ASSFACI= 0
##$ASSFACX= 0
##$ASSWID= 0
##$AUNMP= <proc_1d>
##$AZFE= 0.1
##$AZFW= 0.1
##$BCFW= 0
##$BC_mod= 0
##$BYTORDP= 0
##$COROFFS= 0
##$CY= 12.5
##$DATMOD= 1
##$DC= 0
##$DFILT= <>
##$DTYPP= 0
##$F1P= 14.0000005364418
##$F2P= -0.99999901652339
##$FCOR= 0.5
##$FTSIZE= 32768
##$FT_mod= 6
##$GAMMA= 0
##$GB= 0
##$INTBC= 1
##$INTSCL= 1
##$ISEN= 128
##$LB= 0.3
##$LEV0= 0
##$LPBIN= 0
##$MAXI= 10000
##$MC2= 0
##$MEAN= 0
##$ME_mod= 0
##$MI= 0
##$NCOEF= 0
##$NC_proc= -2
##$NLEV= 6
##$NOISF1= 0
##$NOISF2= 0
##$NSP= 0
##$NTH_PI= 0
##$NZP= 0
##$OFFSET= 16.522
##$PC= 1
##$PHC0= 223.345
##$PHC1= 5.837361
##$PH_mod= 1
##$PKNL= yes
##$PPARMOD= 0
##$PSCAL= 4
##$PSIGN= 0
##$REVERSE= no
##$SF= 250.13
##$SI= 32768
##$SIGF1= 0
##$SIGF2= 0
##$SINO= 400
##$SIOLD= 32768
##$SREGLST= <1H.CDCl3>
##$SSB= 0
##$STSI= 32768
##$STSR= 0
##$SW_p= 5175.98343685301
##$SYMM= 0
##$S_DEV= 0
##$TDeff= 65536
##$TDoff= 0
##$TI= <Analysis number 999999
Compound Code 99
Book Reference 9
Project Code 9>
##$TILT= no
##$TM1= 0
##$TM2= 0
##$TOPLEV= 0
##$USERP1= <user>
##$USERP2= <user>
##$USERP3= <user>
##$USERP4= <user>
##$USERP5= <user>
##$WDW= 1
##$XDIM= 32768
##$YMAX_p= 446415014
##$YMIN_p= -32573
$$ End of Bruker specific parameters
$$ ---------------------------------
##NTUPLES= NMR SPECTRUM
##VAR_NAME=  FREQUENCY,     SPECTRUM/REAL,   SPECTRUM/IMAG
##SYMBOL=    X,             R,               I
##VAR_TYPE=  INDEPENDENT,   DEPENDENT,       DEPENDENT
##VAR_FORM=  AFFN,          ASDF,            ASDF
##VAR_DIM=   32768,         32768,           32768
##UNITS=     HZ,            ARBITRARY UNITS, ARBITRARY UNITS
##FACTOR=    0.157963299565203, 1,           1
##FIRST=     4132.6476996994, 0,             0
##LAST=      -1043.33573715361, 0,           0
##MIN=       -1043.33573715361, -32573,      0
##MAX=       4132.6476996994, 446415014,     0
$$ Real data points
##PAGE= N=1
##DATA TABLE= (X++(R..R)), XYDATA
$$ [...]
21209 -10866 -12815 -19016 -18801 -10827 -1215 -7719 -12994 -12005 -10116 1492 4018 2839 -1037 -7296 -10625
21194 -10625 -7951 -4671 -5424 -5210 -10028 -12644 -11044 1808 2371 2693 -2015 -3845 3436 3667 1632
21179 1632 3484 6479 6404 3136 -1065 -4947 -4210 -1291 -5334 -10023 -1465 2038 -5182 -6373 -3252
21164 -3252 -9671 -4601 1456 2064 4772 4958 -562 -3639 -2481 -2770 -3996 -10755 -6683 -5551 -9814
21149 -9814 -8135 -12503 -14211 -14671 -12132 3063 2204 381 -10014 -8238 -6191 -8304 -13035 -10956 -348
21134 -348 -477 5264 734 -7244 -5362 2813 -1819 -5059 296 4725 -1665 3758 3212 -4368 -1038
21119 -1038 1821 6626 6477 36 -5880 -8618 -4996 -599 1672 -5061 -14237 -13550 -13216 -10639 -12657
21104 -12657 -11031 -10621 -7739 -9607 -8994 -11374 -1839 5219 1651 -3823 2062 3357 -652 -11151 -17914
21089 -17914 -19435 -14799 -7318 -3774 -2613 -4852 -2264 -2987 2032 5295 4698 4195 -4038 -7389 -8203
21074 -8203 -9797 -9013 456 -1624 -3015 -12318 -12569 -10179 2177 3754 -2268 -6051 -14641 -13964 -7024
21059 -7024 -5322 -7222 -11780 -13092 -17043 -14010 -5012 2120 4266 1470 177 -59 -4935 -5959 -4516
21044 -4516 -4208 -2432 -4990 -5328 -1052 -8556 -7538 -5358 -906 1811 -4118 -9347 -4375 -4643 -6788
21029 -6788 -8621 -535 7852 7741 1385 -5342 -6782 -2765 3068 6278 5663 2658 -2309 -2397 -6732 -2304
21013 -2304 4182 388 -1155 -4339 -5373 -7388 -7351 -1469 7353 6277 2447 9797 9239 1714 2204 793
20997 793 -3441 -5878 -2185 613 1747 6351 5177 13174 13544 5364 -2637 -2970 -2661 -1511 341 11674
20981 11674 6003 -1440 -3689 -4740 -5046 -5623 -1296 -4969 -8414 -6564 858 5615 9530 7227 5781
20966 5781 8494 9399 3589 -2572 -1722 -3944 -9511 -11556 -9064 -11877 -14725 -13370 -12346 -6630 -8471
20951 -8471 -10488 -9206 -5953 327 2124 5950 7396 -68 -962 2277 3833 5913 7692 9423 8934
20936 8934 6839 4809 -1077 -6083 -3149 -3413 -5946 -2184 -5794 -10311 -10882 -1853 -1132 -3990 -2266
20921 -2266 -2898 -5122 -6068 -3724 -2798 -450 -760 -6314 -7811 -5252 -4665 -10457 -12385 -8514 -11681 -15159
20905 -15159 -7656 -4880 5872 6871 7831 1423 2631 9405 2602 -10378 -11175 -7456 941 3177 1899
20890 1899 1815 3243 3378 1950 -589 1930 -1371 -8318 -13761 -9685 -6445 -3778 -4269 -954 -1451 -9502
20874 -9502 -7648 1045 -1574 -4084 -12761 -6841 -564 442 2052 6519 4543 -563 2528 -461 -3992
20859 -3992 -4037 -6151 -10281 -10044 -5273 6064 10606 12332 5856 10071 9848 6913 11275 8221 10749
20844 10749 8635 -1412 1170 5616 5844 2150 -1393 -208 2558 3891 1105 -3256 -8358 -15106
20830 -15106 -13053 -16341 -11268 -6539 -10222 -6659 -5836 -2613 1631 267 2512 -301 2983 2283 228
20815 228 433 5464 4781 3329 -2277 2001 4854 3943 3417 4955 -381 -46 2486 4510 -11 -5172
20799 -5172 -11322 -9198 -4541 1416 2575 7848 10178 1840 -5451 -7310 -5648 -2921 -2998 -6747 -6870
20784 -6870 -5026 -2205 -590 -2098 -2921 1635 9955 7667 3718 2545 4591 842 1498 -24 -3540
20769 -3540 -2670 -5564 -8018 -8628 2811 4440 2244 2235 8831 6822 4417 534 -10099 -9158 1097
20754 1097 6067 10796 12547 5433 6397 13795 17165 6832 -709 1624 4402 4648 2032 -5538 -9428
20739 -9428 -15224 -13956 -8889 -302 3931 10438 12745 7437 4033 3439 6219 -5828 -8604 -4277 -8214
20724 -8214 -10088 -9953 -2967 907 2357 -5155 -8209 -16213 -22977 -9411 -6674 -10222 -9070 -8257 -11390
20709 -11390 -6976 -4363 882 2309 1820 -3240 -3956 2160 -5603 -10392 -5874 -8928 -8005 -9545 -5435
20694 -5435 -8971 -12267 -11536 -8445 -5406 -7810 -5976 -3977 -5614 -7765 -5668 1455 -3917 -10210 -13797
20679 -13797 -16870 -7178 -3797 4067 6757 5581 7618 6334 1550 6384 7558 -5297 -12724 -10963
20665 -10963 -8091 -9127 -7799 -6508 -8306 -6412 -8479 -5710 -6701 -5210 -4109 -10180 -15199 -7472 -5658
20650 -5658 -6422 -1304 -3139 -2890 2441 5654 8359 4976 4344 -5075 -6686 -16759 -20460 -17000 -9785
20635 -9785 -4303 -6421 -2122 2968 4867 6193 2630 -1341 -7824 -10099 -1319 2600 -3899 -698 3791
20620 3791 3962 8188 3636 -337 -5469 -11555 -10208 -13812 -10245 -7750 -7127 -10480 -11258 -7612 474
20605 474 -737 -1775 -662 -3166 -2266 -9091 -8015 -7144 -3662 -3600 -2836 -4447 -8993 -4176 -4083 -3917 -4549
20588 -4549 -3391 -277 -2115 -10373 -15867 -14143 -9062 -6403 -2080 -2716 -6442 -10956 -7819 4716 6240
20573 6240 -1388 3444 1586 2643 948 -2844 -3656 -1402 934 553 -1552 -7284 -9482 -12255 -6623
20558 -6623 5 4250 -112 -5315 -7500 -7684 -13508 -12428 -16087 -19948 -17757 -7828 -4318 -3974 1551
20543 1551 1401 -983 227 2959 -1670 -6478 -7196 -3406 -4574 -4747 -4191 -4287 -6881 -6923 -8049 -6008 -7444
20526 -7444 -1756 1764 252 -1479 -3902 4688 6217 6193 3569 5120 3979 -448 -1422 -820 -2025 3565
20510 3565 1824 1173 -1389 1793 -1177 -5915 -8477 -7259 -2597 -3207 -11908 -12676 -8779 -7645 -10058
20495 -10058 -12783 -10132 -4975 -2512 -5105 -5077 -2876 -3561 -8096 -8113 -5028 -3748 -52 641 -3028 -2368
20479 -2368 -583 -1089 450 2132 -4151 -10370 -4516 -403 2826 4797 3381 211 1172 4671 -1489
20464 -1489 -5673 -8253 -7385 -5108 -568 4222 4340 6197 7421 5484 -11 687 -1214 -882 7225 13056
20448 13056 10192 3782 -567 -6094 -7916 -10827 -12688 -14090 -12511 -14858 -17510 -12060 -3520 -3103 -6705
20433 -6705 -10093 -5143 2147 4469 -2711 -8435 -4131 5088 3450 4519 901 -3319 -2914 8610 10486
20418 10486 4195 4645 -1269 740 3825 7417 3583 -4106 -5463 -1372 -3938 -4309 -7399 -16575 -16350
20403 -16350 -14637 -14568 -15275 -10489 -4931 -1432 475 -694 -9763 -13295 -6339 -5366 -4535 -1809 -3266 -3881
20387 -3881 -10459 -9720 -8922 -9442 -4415 -15803 -13024 -9075 -8428 -6684 -874 861 4624 4536 5290 7818
20371 7818 4599 1988 5125 2846 4826 7072 176 -4947 -8306 -4990 -1767 1413 1446 -4999 -6208
20356 -6208 -6670 -12174 -7481 -2739 924 8991 8750 -105 5044 4130 210 -583 -2082 3619 7359 4138
20340 4138 -3221 -7515 -11049 -15463 -16693 -22268 -13232 -8223 -8091 -6728 -2574 -4551 -1764 3139 2030
20325 2030 557 3622 5955 7473 3499 1068 8370 12928 10729 8429 5751 6461 8635 5705 1793
20310 1793 465 5497 6351 4587 -910 -4020 -2818 -4816 -5914 -1454 -9343 -11363 -10034 -11509 -11771
20295 -11771 -9201 -4854 -709 2634 3317 6097 5316 4969 3169 -618 4727 9278 8223 9405 6735
20280 6735 7126 9695 8500 5668 9639 5025 -2644 -4960 -3698 -4009 -3377 -6169 -6007 -4639 -4843 -3587
20264 -3587 -5045 -6871 -7273 -3974 1326 2024 4061 -2135 -8252 -5393 279 3178 -224 -3052 3703
20249 3703 3392 1362 -1556 -8136 -8589 -3326 -3993 -1325 1900 5664 -2408 -6788 -14532 -15073 -7626 389
20233 389 9581 7637 1142 -1296 72 1050 -6258 -4041 3285 4681 4737 1242 1095 -1805 -1679 420
20217 420 -3837 -4332 -4860 -10909 -14432 -18574 -12159 -5810 790 -3824 -4917 -4960 -11657 -11017 -9443 -14140
20201 -14140 -19264 -9085 -7212 -4189 1246 -297 -2225 -6502 -5257 -6414 -515 -1814 -4285 -6466
20187 -6466 -3790 -7038 -2352 1506 -623 -3799 -3847 -3959 -4573 -8270 -5081 -2742 -2989 -2812 1449 -5768
20171 -5768 -18458 -19544 -11052 -9338 -3639 -174 3439 8632 5811 -592 -2880 2470 5417 3143
20157 3143 6912 3754 -5874 -5050 8061 10177 8102 -1901 -4172 -2782 -2197 1480 7130 10183 8338
20142 8338 6117 4412 7292 6727 -356 -4851 -3224 -3613 3002 2741 -4635 -4460 -5176 -10705 -17235 -20966
20126 -20966 -15079 -3795 4954 7927 2716 -1554 964 7111 6127 1697 1371 2174 3845 971 -6581
20111 -6581 -8993 -8625 -7634 1877 -557 -2279 -7285 -3181 434 -31 -2610 -4899 3039 3100 2425 -2110
20095 -2110 -8564 -12163 -9974 -1864 4012 1314 -894 -767 6882 5787 5665 1659 -496 -2220 -7211
20080 -7211 -7596 -6118 -6655 -11133 -8844 -9825 -14637 -11499 -8291 -2748 -3895 -458 -3632 -8647 -9351 -15502
20064 -15502 -13430 -5682 -6743 -8247 -6549 -6761 -10134 -10910 -6652 5942 3830 -6784 -8300 -6844
20050 -6844 -5863 -3092 -1705 2912 8272 9414 -709 -3043 -5790 -7745 -948 444 -5291 -7911 -2937
20035 -2937 7930 9786 5064 5139 5684 6854 10754 10712 354 -1450 2609 428 3634 5427 1161
20020 1161 -5947 -4745 441 -477 6 8412 4101 -1785 5413 12081 12852 17973 15854 5689 2416
20005 2416 2692 -1381 2453 8223 9829 4078 -1153 -5963 -1681 -1631 -8153 -10306 -5373 -6600 -4708
19990 -4708 -5474 -2338 3585 309 -7309 -7935 -7328 -11973 -11777 -4096 -8338 -2220 -2609 -7868 -6718 904
19974 904 6869 7616 11546 17080 10552 12975 13310 9789 9038 7400 4193 4665 7658 5688 4555 7972
19958 7972 -552 -7441 -15026 -14287 -11660 -7950 -5353 -3715 3113 5270 -3319 -1101 -619 -2372 -654
19943 -654 2846 1235 -1367 5521 8140 -3432 -6622 -5216 -403 474 -2499 -5228 -8114 -11875 -10661
19928 -10661 -7583 -8134 -7303 -10833 -6992 2710 3309 2056 88 -5508 -11410 -12230 -6576 -5067 1202
19913 1202 6690 1601 -3642 -6516 -11498 -10170 -1879 -1137 -6748 -5939 -10364 -11439 -1626 68 -4425
19898 -4425 -4062 -599 1207 8766 6749 4839 4426 3182 2909 7050 6892 -1700 -7011 -10096 -7261 -2943
19882 -2943 -1058 -4219 -8843 -9456 -6531 -8278 -11279 -6378 -10985 -13401 -7906 -5150 -8740 -7375 -848
19867 -848 221 -804 -4628 -10111 -13234 -6351 732 3878 4525 2748 -2437 -5209 -4655 -7034 -10590
19852 -10590 -14061 -9153 -3639 -6271 -5104 -7325 -8112 -10225 -13689 -16141 -18913 -17224 -11684 -3255 -2611
19837 -2611 -5766 -3654 -1576 -7424 -8775 -9848 -4997 1181 -2025 -8138 -970 3643 -4937 477 -1549
19822 -1549 -3323 -4548 -5330 -2566 -2266 -81 6650 5824 9072 10895 4797 1519 -124 -350 -2560 -5146
19806 -5146 742 -2358 -982 -693 -7292 -19633 -12961 -6514 -2967 -10642 -11670 -12190 -9091 -4865 -8623
19791 -8623 -9581 -4660 -2736 -9561 -2846 -1181 -5296 -10755 -12842 -2152 11710 8696 5390 6135 8903
19776 8903 1031 644 4194 2652 -3189 -4111 -1651 3919 12663 4120 -6795 -4650 -1235 136 -1724
19761 -1724 -2869 -3603 -7720 -10359 -9266 -4003 -8503 -5864 -2279 -3430 2143 3335 1620 3689 2029
19746 2029 275 -1754 -3604 3202 5262 3049 -1892 -895 -2111 -4697 -6979 -8121 -8173 -7259 -9416 -3355
19730 -3355 6453 8902 5040 2383 905 7046 3586 4258 9729 13905 18286 18999 29088 36806 43645
19715 43645 50897 54432 62963 71708 76190 90367 103647 111164 125002 133476 139469 132384 124241 117728
19701 117728 108923 104216 92393 79611 64959 65958 71145 66062 49921 33204 26860 18262 17477
19688 17477 20677 19276 17794 12666 5244 1512 6916 10507 5234 176 5200 15271 11615 6313
19674 6313 -3171 -7534 -6650 -603 -1509 2946 1585 1371 4269 4463 -679 -5086 -3129 992 3657 765
19658 765 4595 5843 7458 8034 8299 8280 4515 -167 804 394 348 1538 5349 520 -1732 -611 -16
19641 -16 3114 2993 -2535 -5173 -4046 6034 11396 9705 15407 16151 12056 10685 6939 3541 4295 1383
19625 1383 -2551 -6275 -6347 175 116 7191 12517 6284 8570 7037 6326 5531 6839 3166 4643 5397
19609 5397 5022 11922 14044 11468 5605 2380 -3673 -8528 -8268 -3441 -4542 -2327 6293 7115 6826 7319
19593 7319 6798 -989 -3723 -6102 -2381 -199 1549 -7254 -8337 -6253 -5229 -7113 -8886 -144 6538
19578 6538 10406 6060 4975 4519 -5390 -9895 -7831 -1588 -3656 -4965 -4152 -6662 -3459 1827 4596
19563 4596 5675 5088 -2241 1038 2811 764 -2583 -3292 -10970 -15248 -5822 -1656 -6414 -7603 -10329
19548 -10329 -3533 160 1609 -589 -1804 -3354 1097 307 4167 6356 1905 -1825 -3403 -5989 -4111
19533 -4111 1145 2582 -392 -8098 -8341 -11110 -9053 -8965 -9032 -2427 -4860 -6182 4124 4053 980 514
19517 514 6641 8123 -3004 -2660 1431 3050 2690 -865 -2548 396 3398 6982 7475 6544 997 -3462
19501 -3462 4098 5426 6487 5253 2176 -414 -5973 -8104 -9271 -9416 -11657 -9478 -7980 -4183 -7945
19486 -7945 -9825 -8672 -14987 -13668 -2589 6510 11507 8467 8266 3493 -6785 -11113 -13704 -10298
19472 -10298 -9609 -7903 -12822 -14942 -16872 -13487 -4783 2303 6571 8067 9499 -1953 -307 925
19458 925 -3420 -472 -2936 -5422 -7569 -11975 -9102 -13215 -12594 -7388 -4015 -6138 -3921 -4939 -3402
19443 -3402 -3781 -4009 4731 9368 8099 10117 10787 4946 -3127 -6364 -8315 -2683 6305 2171 -2125
19428 -2125 -1251 7063 17211 17212 1768 1256 5962 6412 10068 2361 -2617 1160 -3883 -119 -2926 -4477
19412 -4477 -2295 -3665 1887 4631 2739 -511 -1818 -3761 -6963 -6620 -1611 -163 -3015 -3275 -5356
19397 -5356 -2986 3156 8077 4829 -5035 -10573 -1940 587 -5276 -8961 -15988 -11901 -5647 -8513 -6910
19382 -6910 -3343 -11536 -8841 -11934 -12115 -4446 4399 -576 -7525 -5825 -7349 -8639 -11712 -8027 -2341
19367 -2341 4100 3472 -2817 1277 4289 4355 156 1164 43 -1815 6631 8252 1206 1065 -1916 -1035
19351 -1035 8557 5854 1198 8177 6826 3377 -458 796 4281 7603 7560 15106 10043 7894 3448
19336 3448 6940 7144 10061 6310 2163 1540 -1810 -2177 1223 -513 4536 5409 914 -5577 235 1374
19320 1374 666 5429 7104 7659 1392 99 5963 3136 2345 2546 -3088 -2907 1217 -1145 -538 2646
19304 2646 2213 5179 7124 -1103 -4766 -7507 -8384 -103 2394 1939 -4977 3036 6814 4570 132
19289 132 -1414 9496 17359 11616 5176 -466 -2814 -849 258 1642 2541 2672 4897 6102 5875
19274 5875 3331 -2300 -6560 -9322 -5860 -4410 -5612 -5313 -216 496 5819 6332 5578 4927 5914 945
19258 945 1051 2997 2602 -5050 -10303 -9215 -6735 546 5640 4392 2821 4031 1222 -8492 -15997
19243 -15997 -10715 -4172 1989 456 -2098 -2412 -2986 -4001 -5556 1518 -3640 -8099 -572 957 -2847
19228 -2847 -5755 -4665 -4405 -6958 -9174 -6701 -1129 -4083 -1064 -213 -523 2937 3344 -1046 2438 11490
19212 11490 14858 10690 10625 7788 679 -10094 -9885 -4812 5528 9374 7543 8644 6391 -1774 -3557
19197 -3557 -2065 -1281 9238 10942 7414 5141 -2179 -6667 -11149 -12358 -5615 -2220 -5504 -8808 -10566
19182 -10566 -7708 -5791 -1686 6513 10311 12091 15514 14346 10070 6708 3847 7770 11149 13836
19168 13836 11673 4939 1894 8956 12700 10476 7901 9701 4514 1187 5709 7312 3039 -995
19154 -995 -1090 742 -3528 1932 8286 10476 11613 9008 5088 951 -4960 -2873 -4219 -9535 -12276
19139 -12276 -9956 -12257 -12116 -12235 -6123 -1297 5226 5630 3121 559 623 -841 2882 6116 5014 2579
19123 2579 562 -1313 -1636 -3801 -6348 -1122 3338 1996 -5745 -8051 -4497 -3992 -6453 -955 233
19108 233 3708 6796 4351 7526 11479 10202 5171 4350 12740 15453 12881 16630 7380 1454 9505
19093 9505 10172 8313 5931 9762 4664 2740 545 -4185 -3396 436 6792 1209 -6063 -2396 663
19078 663 3582 2910 3271 -400 1322 2254 3855 5328 6296 8231 12462 11087 13546 5799 -944 -2186
19062 -2186 -2992 -11831 -2375 4855 4931 3054 -1724 3178 2046 -921 -7738 -12320 -9143 1734 1552
19047 1552 3072 3989 4125 2270 95 2556 7891 8865 10130 3174 6052 10293 6367 4226 2731
19032 2731 2854 2452 9107 10056 10745 9129 10970 11510 11227 7417 5784 2366 1450 7786 6774 6776 3542
19015 3542 781 5262 924 -854 -1104 -2237 -4806 -1513 3717 8818 3312 -236 -5480 -2442 5471
19000 5471 9113 7737 7118 1601 -8264 -10594 -13326 -11637 -9292 -10490 -3707 3712 -480 4857 1487
18985 1487 -5685 -4689 5826 7797 1387 3834 -1248 -3069 1337 1068 5052 6194 -4257 -7821 -9652
18970 -9652 -5715 806 5646 6433 4894 6642 5725 2505 -2126 -3509 -4644 -7181 3333 14101 14336
18955 14336 8210 786 -2254 -2600 5169 12134 18333 17417 15962 9424 6280 6080 9978 13321 16708
18940 16708 9325 8496 12362 7315 6182 8544 10783 13449 8861 6988 4138 12090 12796 5618 5321
18925 5321 13828 14429 13779 12575 7415 3865 5952 5923 6986 4905 -199 1860 8883 13083 5519 4955
18909 4955 4766 7107 10005 7802 3610 4782 9136 11766 7762 11937 11881 8084 7963 4927 1760 -74
18893 -74 7041 11471 15977 16333 8425 5308 11120 14141 18082 19334 15866 15588 19609 20539 15383 12384
18877 12384 5474 2896 2836 6943 6018 2115 3572 12956 10192 7747 8395 8062 11586 13645 11566 10937
18861 10937 12819 12188 6573 6687 10902 14924 18770 23136 12372 1602 2303 712 -2020 -2384 -1180
18846 -1180 -7296 -8043 -320 -2250 -8070 -3460 1024 -1031 2284 5706 9538 6705 10181 11715 15918
18831 15918 15489 9460 9842 13463 15053 16670 21493 20808 17473 18360 20365 15698 19912 21974 24387
18816 24387 28521 29800 28673 25604 27773 26853 32436 35114 27630 22891 31589 41635 43231 49221
18802 49221 61256 83471 107972 132008 160754 176718 173616 171093 153805 128759 108634 89904
18790 89904 75537 69975 63515 59777 61059 58636 56028 52696 48995 36786 36958 33884 32890 36454
18776 36454 41427 31338 28656 30835 35271 42320 50093 64193 82365 90491 75013 52339 39261
18763 39261 33054 30291 29792 34023 36190 45572 56861 62863 67864 66287 66383 61393 56827 58235 59956
18748 59956 70227 86172 95044 118273 153355 188082 208363 216464 195491 162857 121234 86678
18736 86678 67190 47474 33295 30596 32553 25162 26401 32151 27274 25802 17658 15230 20553 27451
18722 27451 30843 25831 21498 20421 21476 20644 16017 10556 9740 13245 15074 18183 10646 2285 -1398
18707 -1398 -278 -1453 -6268 -8551 573 12034 16383 14690 9204 6904 10780 6730 4335 5467
18693 5467 7647 3872 407 2133 12574 13316 13704 19705 19665 17063 11320 5577 1738 4085 7698
18678 7698 6441 7749 10931 12055 8494 10303 13947 13266 13300 19927 26420 19149 13685 18410 22298
18663 22298 21486 23478 15618 10559 12223 5083 6247 10126 5154 3087 8521 5007 5391 4476 4842
18648 4842 10991 11047 4264 904 7064 12925 11515 14624 10866 13033 7699 5461 3057 5377 4737
18633 4737 7416 9274 10564 14150 20032 20523 18355 9486 5027 10320 4837 3144 8475 13129 7533
18618 7533 9770 13574 8209 9994 9703 6962 8169 12163 16303 13367 8673 9551 14061 15758 16141
18603 16141 16172 9614 7387 12401 13314 13615 13032 9170 2160 6187 8145 7666 10871 13787 14621 16348
18587 16348 21384 16255 2157 -4893 3818 7729 10515 16375 18599 16824 15069 14148 18274 20686
18573 20686 22620 17191 9420 2070 2410 7685 13690 13365 11438 13705 13524 17021 24303 18947 18552
18558 18552 19731 25560 28057 26596 25107 22139 16797 14031 12567 20985 34055 42157 48821 50445
18544 50445 50661 61301 67527 73309 74922 80439 87092 97656 103908 95354 91496 87173 87848 80134
18530 80134 81941 90769 105571 116546 130208 146563 152550 147880 144322 138683 122826 115463 108410
18517 108410 109629 105235 99841 90645 87144 83986 78866 72047 68686 68541 62455 44171 31513 32941
18503 32941 26834 26059 30878 35838 34506 38461 47406 57995 64634 75515 71432 75233 82147 79243
18489 79243 73586 72596 74376 84459 86192 87229 98566 117848 123957 131249 140688 147954 149478 155395
18475 155395 152830 151689 139060 121404 114951 116588 119587 121960 126590 130671 132310 125000 114997
18462 114997 101891 95733 85665 71617 66336 61767 58196 58791 53903 48665 50005 41340 36694 32056
18448 32056 30388 25168 23509 21880 26462 35847 34336 33905 31110 28461 26782 22636 20904 19697 23006
18433 23006 30801 31486 30644 32329 33824 27097 17892 15764 16010 20763 21567 19901 22289 22741 21381 20298
18417 20298 18723 15185 14172 14960 13229 15735 20065 20387 20167 14318 15329 15335 22036 29404 22729 18592
18401 18592 24902 27091 27874 27441 29614 28775 30597 31354 25661 21891 27454 24854 22546 19407 26419
18386 26419 30639 32445 33904 29603 18663 17901 20904 19704 16896 20889 21361 22119 25727 25709 21537
18371 21537 21323 26750 23397 23591 23491 20246 15879 20311 25986 28537 30537 29244 33221 34959 33748
18356 33748 35850 39144 30320 20410 20454 20158 20856 25294 22808 19525 21061 20389 27631 33044 28599 22814
18340 22814 19891 25351 29858 26735 34887 31809 22753 19899 23957 29572 28581 28307 28289 31514 29138
18325 29138 25046 32709 40146 41179 37148 38880 39469 44032 50111 55178 42758 28162 25558 29287
18311 29287 29154 29906 28836 31743 30481 30407 37592 43562 38775 39461 34797 33612 35736 37331 35425 46851
18295 46851 48005 49991 55919 52226 46954 50199 50453 51631 50747 48294 45886 42328 35540 29098 34556
18280 34556 47949 51383 42850 40649 45859 47963 50030 50041 56239 63517 63026 54253 52726 46568 40261
18265 40261 39022 34544 31859 28304 37365 41843 39356 35020 41673 45856 46524 47791 52474 57273 60999
18250 60999 58662 53748 57909 60559 60126 61573 64491 68439 68162 66835 69900 80427 79381 78069 84557
18235 84557 79746 69800 69983 65485 59840 55690 58257 59688 55982 55009 53300 51942 50273 48059 47846
18220 47846 40503 44238 45904 41915 45199 41531 45475 53452 52123 51423 50360 52969 51682 45940 46419
18205 46419 46902 49031 52986 65296 66780 64425 65753 69317 63188 59894 64558 58119 58908 62778 58100
18190 58100 64683 74894 79866 78794 81737 80721 82024 83623 79444 74171 70504 71396 69426 71573
18176 71573 79796 85987 82788 82965 90337 92443 98522 98516 93312 87401 82984 84401 75588 68721 77386
18161 77386 70585 66896 62908 72165 71244 65087 66573 65717 75771 79862 74134 76180 76185 77382 85764
18146 85764 91877 94320 90077 95726 107207 107637 100730 96060 100487 105612 112690 110175 109494 119208 134978
18131 134978 157631 170180 185730 205403 219840 224428 235748 263557 294783 321677 354178 394403
18119 394403 451026 530572 641733 803137 1048704 1446327 2142558 3386839 5455616 8656930
18109 8656930 12723176 13184126 9328661 5660965 3481718 2275739 1595374 1184971 915072
18100 915072 738641 613026 523144 453042 394410 350505 311767 288037 279649 272784 262621
18089 262621 258939 260165 258966 266187 283751 290981 290158 295805 301887 316978 328167 337138 354361
18076 354361 371158 390536 416848 454276 508360 561271 618684 676230 736958 807723 876360
18065 876360 953491 1065097 1223940 1452037 1771343 2181282 2600031 2980814 3382523 3793729
18055 3793729 3994828 3912722 3771801 3677576 3568868 3459392 3453619 3642776 4084637 4873750
18045 4873750 6193232 8280807 11405289 15624771 20236306 24405753 28630830 33349913
18037 33349913 36183739 35265288 32777786 30445578 27382281 23050295 18880704 15899356
18029 15899356 14012930 12921512 12382741 12179659 12308068 12622914 12411744 11331395 9974541
18020 9974541 8716719 7412216 6059201 4885567 4022986 3451124 3089757 2892464 2788435
18011 2788435 2742479 2738769 2771155 2846361 2959501 3137731 3408274 3803643 4393824 5277209
18001 5277209 6509223 7994176 9479913 10853801 12267911 13595892 14143315 13914256
17993 13914256 13687969 13798040 14226316 15209194 17114818 20134394 24556948 30175547 35304487
17984 35304487 38695807 41717013 44517090 43804606 38774406 33081241 28129859 22873173
17976 22873173 17346428 12716677 9433751 7285824 5950649 5153037 4734992 4625656
17968 4625656 4717435 4832743 4931805 5100105 5298102 5177825 4671641 4114558 3629039 3104965
17958 3104965 2561136 2104714 1772135 1533641 1370409 1258037 1166120 1066286 970797 883259
17948 883259 799818 716185 637614 572467 522800 470783 431444 402221 379010 369083 356515 341626
17936 341626 336921 327691 313658 306910 298076 285695 275478 264957 256660 244960 239697 230421 216701
17923 216701 207160 205828 208942 212617 204292 197997 196048 198029 200490 196872 192778 185829 180600 177486
17909 177486 167045 152420 147312 133168 123272 122548 123091 115499 104450 102130 95043 90216 84706 72673
17895 72673 73083 72360 67595 59523 64608 74350 81752 85439 86977 79651 80915 78100 74455 75627 71621
17880 71621 75728 71539 73830 73701 73338 70414 68978 66089 72444 77789 76956 81127 80495 77575 82582
17865 82582 85722 85412 89194 96724 104107 113572 117167 111867 106419 99753 96994 90167 79821 67267
17851 67267 56957 48023 49376 50449 49429 44003 38861 37677 36451 38775 42327 42693 37263 24230
17837 24230 19699 16213 20366 33468 33396 26693 19972 10700 8350 15427 18544 16125 15583 16802 16675
17822 16675 19481 19517 14703 13838 20113 22551 22444 29053 37392 32351 27530 27785 25967 21227 21768 20908
17806 20908 22221 19068 24405 32781 32833 25836 22904 22314 26115 30429 28001 29907 27570 26201 27287
17791 27287 23865 22906 24202 16349 14694 12522 17832 20720 20984 22943 23515 22675 23273 21688 14775 10082
17775 10082 15793 17077 20591 21254 17032 17484 17673 29886 36124 27016 22139 21364 21772 27386 19891
17760 19891 9445 9689 15726 23139 18713 20572 30617 34133 45384 57802 51839 43365 39565 39214
17746 39214 43822 40692 31833 34967 36672 33780 34130 33543 35502 34500 35319 33529 32523 34423 33579
17731 33579 29047 30425 36253 38108 34336 31944 33534 29519 31076 30224 32152 33508 36305 39651 37885
17716 37885 32598 35172 36309 31387 30086 34265 39030 42922 40366 40104 42490 40906 40078 40063 39803 42253
17700 42253 43833 43223 47209 46050 49510 54054 58539 49207 40219 39309 34777 28553 28262 32024 28301
17685 28301 32599 37712 42394 38101 38150 34468 29938 27564 23919 30436 37315 42532 37588 25885 21673
17670 21673 25671 29266 32220 38521 43152 41628 44721 46171 58257 61253 56893 61763 66680 65299
17656 65299 76512 86032 103961 129281 149088 168286 189816 217934 241389 252249 252047 249188
17644 249188 259109 249222 215105 181905 156687 138999 123017 109985 91560 74022 75975 81038
17632 81038 75904 76502 80542 85794 85645 86161 81554 74620 67806 54811 41962 32494 29392 20888 16727
17617 16727 25329 36652 38056 39051 42987 43047 35603 29927 30990 32610 26752 23543 28446 39561 47856
17602 47856 51345 55217 55611 54821 53698 56491 57425 56640 52034 53836 59605 64468 73877 83299 84078 81984
17586 81984 82854 89462 89984 85107 81971 90523 95933 105110 115777 134238 150766 168279 197480 236404
17572 236404 275266 298857 296801 269576 236070 203322 171444 154187 149689 149901 152336 157328 165952
17559 165952 175774 192865 195353 193724 192772 194621 194361 190833 191642 191073 196909 208264 218286 219169 223315
17544 223315 232730 245985 255227 257181 265645 284944 307014 335624 350082 358740 371291 389129
17532 389129 416804 446155 483060 531296 594292 666682 747893 852979 994650 1174752 1415939
17521 1415939 1741754 2167303 2731329 3486580 4418633 5377290 6066102 6203981 5762375
17512 5762375 5033463 4342378 3882189 3709340 3812628 4184687 4827919 5767430 7101572
17503 7101572 9092112 12188027 16999451 24117836 33492982 43638603 51624394 54373013
17495 54373013 51266723 44386216 36386189 28905705 22668604 17959039 14787694 12974246
17487 12974246 12334149 12722777 13894617 15329499 16228889 15854898 14094727 11564245 9035635
17478 9035635 6995887 5569501 4640517 4048406 3644528 3328978 3055483 2828537 2654989
17469 2654989 2534621 2466979 2447679 2490173 2599341 2773642 3019948 3380950 3921915 4760536
17459 4760536 6036105 7845966 10085199 12326006 13892386 14198620 13308750 11910780
17451 11910780 10764746 10378290 11002509 12766335 15776402 20035199 25374978 31452791
17443 31452791 37627648 42492850 43954352 40640954 33552360 25299445 18095627 12834333
17435 12834333 9357076 7144105 5729198 4787616 4139116 3664360 3332938 3164837 3202922
17426 3202922 3444610 3860641 4304002 4567185 4464021 3975477 3306879 2660319 2140046
17417 2140046 1757365 1469451 1248535 1076694 931791 814004 721327 651482 585581 534179
17407 534179 496192 458648 419365 385939 364629 339990 317900 301992 286543 269078 249141
17396 249141 239647 229117 217977 207967 202602 197671 193895 187582 182467 179411 171298 165624 164588
17383 164588 159405 150194 143944 148127 150567 146623 144812 145580 147616 150605 161286 173285 173818 165876
17369 165876 154246 141124 127245 115210 107245 98062 89103 81675 78932 80688 75833 70661 71146
17356 71146 67125 65077 62240 57629 53602 52094 45599 42305 46552 50592 50921 51282 48911 41306 44635
17341 44635 45132 39623 35042 40370 40631 38208 38833 42708 49399 55382 56502 53994 53576 56807 58000
17326 58000 53570 49637 54508 62011 61848 61001 66978 68410 72223 78122 76748 73627 67379 53698 43155
17311 43155 32542 19527 14553 13206 2200 -6159 -4685 -5123 5520 10492 10388 6598 7374 8401
17297 8401 7790 -1517 -1361 -3443 -2465 1751 -4158 -9018 -4315 -6277 -6827 -11309 -16201 -27200 -28992
17282 -28992 -23742 -19671 -23464 -21179 -18745 -11086 -2718 -2381 -9251 -13185 -8547 -12089 -11484 -10792 -10898
17267 -10898 -6487 594 5619 4773 9788 9337 8351 2791 -3712 377 2428 -1961 -12074 -13253 -8002
17252 -8002 -6782 -8967 -4849 621 294 -8477 -11442 -12644 -13044 -13352 -15389 -12682 -7139 1392 3154
17237 3154 4274 -4815 -8095 -6469 -15003 -8149 -12785 -18168 -17919 -18810 -25283 -17722 -7942 -7159 -4223
17222 -4223 -6201 -13946 -14410 -11548 -2860 -5900 -11980 -12605 -9822 -5370 -8368 -19197 -20386 -17470 -10710
17207 -10710 -5642 -5177 -1852 -1071 -3302 -7575 -11865 -18362 -21380 -16884 -12873 -6398 -10827 -15829 -7464
17192 -7464 157 -2008 -5723 -6511 -6448 -10069 -6625 -1138 -3357 -11899 -20089 -21421 -22304 -11813 -2179
17177 -2179 -1909 -2579 -10898 -16007 -12560 -7551 -8845 -11109 -15662 -11709 -6673 -11972 -16342 -10313 -4926
17162 -4926 1834 -1463 -8445 -13974 -12488 -8687 -10885 -9121 -4756 -6793 -6749 -10716 -11167 -16439 -22378
17147 -22378 -24280 -15588 -16359 -10431 -8908 -8749 -1106 -3725 -11988 -22134 -21484 -17510 -16381 -10970 -14002
17132 -14002 -16160 -17057 -12122 -3399 -13230 -13388 -12701 -16164 -16682 -18164 -18930 -17990 -13013 -18544 -18667 -19343
17116 -19343 -22221 -22579 -16946 -20206 -19891 -18664 -11995 -10657 -10799 -8326 -8261 -3528 -4346 -7654 -8691 -10684
17100 -10684 -9115 -9393 -4981 -1806 -5263 -11666 -16138 -15945 -8563 3442 -2484 -16591 -19646 -21923
17086 -21923 -14541 -9392 -9492 -8434 -8561 -9398 -11096 -8606 -5578 -5243 -112 3836 -944 -6372 -10993
17071 -10993 -15662 -16244 -18311 -15318 -12536 -13377 -16172 -20945 -21613 -17533 -14738 -16944 -8794 -5728 -3563
17056 -3563 -10119 -13636 -10262 -10130 -13430 -12780 -15097 -13587 -13948 -14061 -11906 -8077 -9380 -15108 -17055 -20053
17040 -20053 -22444 -19656 -14398 -16904 -11967 -15163 -18120 -14195 -11931 -12746 -10090 -13350 -16117 -16327 -15593
17025 -15593 -21252 -24140 -16681 -10279 -5965 -104 4116 -5706 -14413 -9631 -2422 3406 12602 16878
17011 16878 10603 6868 4231 9612 19445 30335 41947 59206 75489 90740 105407 105645 101783
16998 101783 102008 114912 114578 107314 96777 89452 87552 86447 79698 73106 76185 90400 108443 123863
16984 123863 123419 113028 98748 78707 60230 41666 22699 12900 9836 16358 14522 12933 19611
16971 19611 19734 29128 34821 36233 28736 23702 23298 16052 11541 11797 16076 22270 19252 16823 21440
16956 21440 24448 27946 35457 50597 68296 81969 87037 97774 104252 112148 125669 130861 128481
16943 128481 112166 83398 60771 49496 39042 33606 27581 25730 24301 27507 47281 55608 59738
16930 59738 73628 86414 100620 110282 109411 99425 82712 60259 50441 40601 24193 18029 18320
16917 18320 9270 2995 228 1430 -10883 -15727 -16901 -13822 -12080 -14006 -12120 -12672 -14580 -6852
16903 -6852 -4834 -5345 -9779 -15236 -9847 -4569 -4004 -7539 -8990 -7650 -12363 -14535 -11489 -9878 -6141
16888 -6141 -5406 -8179 -13474 -24445 -20398 -12725 -17026 -18100 -15955 -15809 -13351 -11373 -7549 -4441 -2953
16873 -2953 -7913 -14146 -16878 -20743 -20497 -16230 -16455 -9939 -5976 -7602 -7558 -9294 -13355 -14441 -15844 -17081
16857 -17081 -15019 -13446 -12688 -12001 -8918 -601 -4709 -8159 -14965 -10506 -11338 -10391 -6501 -10415 -12239
16842 -12239 -11327 -19720 -28820 -24049 -18913 -20457 -18990 -15277 -15983 -9653 -11593 -18460 -15516 -16935 -11835
16827 -11835 -14143 -13031 -7495 -5900 -7657 -14033 -15362 -15012 -9119 -8696 -12586 -12873 -11442 -8530 -6805
16812 -6805 -5619 -8201 -7974 -10272 -11735 -6662 -12632 -19820 -19306 -18158 -11784 -5858 -3860 2316 2562
16797 2562 530 -646 -7194 -12069 -11525 -6422 -3130 -9159 -16153 -22365 -22858 -17780 -18882 -16312 -15204
16782 -15204 -8334 -8136 -6114 -7545 -11692 -15177 -12215 -10848 -8460 -7724 -1010 -8396 -10596 -8802 -7886
16767 -7886 -3300 -2156 -7948 -14218 -21084 -22354 -17148 -11368 -10885 -16436 -14292 -12668 -9259 -11448 -5854
16752 -5854 -5238 -13501 -16614 -18416 -17304 -23104 -24629 -20083 -14720 -8809 -9059 -1283 2609 1816 -1041
16737 -1041 -10987 -10318 -9865 -8882 -1531 894 913 -986 -5638 -8577 -8502 -8527 -9541 -13818 -12713 -9606 -12793
16720 -12793 -15805 -18409 -17622 -16993 -16370 -13321 -13831 -18112 -18169 -18581 -13386 -6369 -9070 -10706 -6059 -9115
16704 -9115 -11646 -10516 -11568 -17563 -13363 -5868 -8240 -9006 -6928 -9623 -6480 -3819 -6129 -8615 -14256
16689 -14256 -16406 -5598 -914 -2434 -7044 -11525 -9334 -14688 -19546 -16748 -9165 -2399 -13487 -22720
16675 -22720 -19521 -18203 -22418 -24896 -22319 -18210 -18615 -21010 -26253 -26819 -21109 -18339 -14769 -13010 -11012
16660 -11012 -6132 -5636 -2523 -1271 607 1666 -4443 -6900 -7152 -3410 -5925 -8813 -6584 -2973 -8821
16645 -8821 -14682 -17475 -19740 -9136 -7034 -10978 -9612 -5078 92 -2029 -1957 -13 -3586 -3217 -3513
16630 -3513 -8890 -12534 -12784 -15736 -16030 -12853 -10093 -17375 -11946 -9055 -13297 -20197 -21508 -17592 -14391
16615 -14391 -12507 -18775 -19862 -24267 -24788 -17760 -10584 -10670 -8788 -14317 -15956 -15668 -13261 -11628 -11972 -13607
16599 -13607 -14632 -15427 -8916 -5262 -5395 -4161 135 1466 190 4415 -282 -5895 -12875 -8828 -7093
16584 -7093 -8820 -7813 -4494 -3953 -3921 -5225 -3713 -4325 -5423 -7630 -9968 -13656 -11655 -12711 -12206 -9145
16568 -9145 -10591 -6068 -1506 -338 -295 -743 -6520 -8889 -11909 -16666 -12060 -6626 -8867 -10581 -11665
16553 -11665 -13217 -17085 -13846 -9848 -6409 -17425 -27528 -23344 -24565 -25319 -19111 -15871 -15137 -12119
16539 -12119 -8654 -5606 -11629 -15927 -21565 -22292 -18891 -16835 -18491 -12263 -6198 -6921 -10094 -11762 -8141
16524 -8141 -8373 -1752 -581 -8553 -19972 -25390 -22971 -19150 -19883 -13396 -13562 -16787 -17637 -10288 -16480
16509 -16480 -19777 -17753 -19100 -18052 -18875 -15499 -10276 -6324 -4008 -6727 -12702 -16739 -16167 -11087 -7811
16494 -7811 -4317 -3467 -5575 -7205 -6657 -4672 -7388 -5800 -5327 -4092 1054 -832 -7715 -10388 -8506
16479 -8506 -5781 -7863 -8673 -14215 -13197 -2198 -3716 -12645 -12089 -11914 -10155 -9277 -9525 -3146 3773 -4322
16463 -4322 -3607 5123 2203 -6368 -2819 -3403 -9251 -14965 -18972 -13163 -6346 -8412 -13370 -10145 -5586
16448 -5586 -11309 -20053 -28044 -25373 -10475 -533 5734 3823 -5310 -15716 -21954 -23326 -17387 -12071
16434 -12071 -12597 -7481 -3616 -11492 -12269 -12486 -10270 -14319 -18728 -12783 -15984 -15014 -7220 1986 -4868
16419 -4868 -11279 -7154 -10876 -9813 -7126 -6996 -3369 -4136 -4081 -2444 -5828 -10212 -9951 -7100 -6225 -5466
16403 -5466 -6018 -7524 -7194 -12085 -10897 -14515 -16507 -10913 -12927 -16695 -11117 -2177 -5169 -13058 -11521
16388 -11521 -10685 -7029 -12008 -11568 -10534 -4764 -1408 1301 -513 -2981 -4719 -10735 -11126 -10134 -2076
16373 -2076 -2323 -9822 -11609 -9037 -10020 -8376 -10796 -15342 -13145 -13594 -15709 -13768 -18691 -23279 -24131 -20960
16357 -20960 -14268 -12144 -11890 -14768 -9876 -4359 -8509 -17338 -21374 -21972 -22099 -25278 -31070 -32573 -26453
16342 -26453 -22405 -19176 -16181 -8785 -7782 -8385 -6720 -5216 -5837 -9025 -6742 -4028 -3531 -3242 -8969
16327 -8969 -18684 -19696 -18732 -16735 -15158 -16476 -9933 -4852 -13578 -13905 -9173 -6988 -3413 -7517 -10268
16312 -10268 -4193 -8364 -8986 -5335 -5770 -3627 -2023 -214 -4238 -7830 -4531 -9165 -14814 -15315 -13601
16297 -13601 -7922 -6372 -16784 -18385 -10582 -5107 202 -4087 -10692 -14252 -8112 -6010 -3326 -6296
16283 -6296 -10777 -8495 -13435 -11077 -6607 -9883 -12245 -17326 -16026 -15578 -13533 -8882 -11824 -18788 -14299
16268 -14299 -10129 -5830 -11595 -13504 -6074 -1447 861 1450 -2329 33 1296 -4187 -2817 737 5870
16253 5870 5153 3429 -162 -4770 -6451 -3147 -7528 -12690 -12332 -5224 -3111 1761 4243 1100 -12823
16238 -12823 -12349 -3430 2648 2828 -4942 -5741 -21 -2113 4927 1202 1919 3710 -2244 -6225 -5502 -4292
16222 -4292 -3027 -10943 -18260 -14904 -6256 1000 -5965 -9956 -12372 -17659 -14577 -13397 -9872 -7972 -6280
16207 -6280 -7009 -8058 -6231 -3960 234 -4772 -5880 -5348 -6911 -4760 -1251 -1074 2105 8872 8980 1860
16191 1860 -4848 -8528 -12339 -16507 -16472 -18720 -10579 -1498 436 -8132 -7464 -11 5461 4644 1422 3245
16175 3245 -549 -128 3736 3142 1564 1292 7748 7856 2095 -7090 -11257 -5126 -8886 -13076 -16120 -9205
16159 -9205 -5393 -15153 -20682 -13992 -17720 -21575 -10583 -4819 -6082 -9757 -10862 -12068 -14000 -19268
16145 -19268 -22029 -20029 -19330 -20711 -12568 -7118 -10878 -12386 -5791 479 -1851 -4010 -6759 -3407 3007
16130 3007 6520 3514 -1634 3866 3165 -2109 -10233 -11029 -6833 -4217 1429 2480 -2959 -3849 -16425
16115 -16425 -20884 -9378 -5153 -4137 -8598 -13932 -11951 -7247 -5232 -6355 -3062 1079 888 2196
16101 2196 6207 2112 3534 5093 9927 8763 8620 9273 -6215 -9057 -6827 -12668 -12240 -11183 -6696
16086 -6696 -1228 -5582 -10517 -19650 -18615 -8040 2307 1453 -4260 -9962 -4180 -2439 -535 -5983
16072 -5983 -9468 -5593 -3600 -1706 -2197 -3077 -4887 -5840 288 -2066 687 550 -7172 -6011 -7867 -8805
16056 -8805 -10637 -4038 1484 -3395 -8401 -4590 -1798 -6932 -2578 -2062 -2528 -6955 -7437 -7908 -4488 -2608
16040 -2608 303 2657 3992 5363 4766 6684 4640 -684 -2365 -857 4907 3044 -2922 -7004 -1210
16025 -1210 4755 -200 -4621 -2225 -5664 -4404 -3483 -9420 -15631 -13644 -13851 -10826 -9634 -10805 -11893
16010 -11893 -6736 -9079 -13516 -13333 -17208 -20562 -20445 -20392 -11290 -13511 -17931 -6600 -4968 -3767 274
15995 274 1788 1856 4013 5493 4695 5521 6484 3945 447 -3905 -5709 -8754 -1950 909 -4399 -9927
15979 -9927 -8055 -2957 -3397 7395 3490 -258 2337 7391 7237 -1964 -3457 -207 1171 -846 -7755
15964 -7755 -13769 -12677 -13049 -15011 -13025 -5166 -2006 -3539 -5926 -6482 -9254 -8472 -7764 -2706 227 -5638
15948 -5638 -9212 -8166 -11461 -5700 -877 928 4152 3910 3626 1079 -6138 -7596 -1814 7281 9473
15933 9473 7865 2135 -7652 -9887 -11211 -4012 -8131 -11148 -4029 466 605 -4036 -6385 -2609 -2867
15918 -2867 -534 -5563 -11208 -10291 -4279 -6441 -3767 2094 -1170 -8091 -9494 -7411 -11829 -11684 -12503
15903 -12503 -9923 -7073 -3031 -1185 -2352 4773 9433 3124 2413 -4289 -10568 -15176 -11765 -9848 -7117
15888 -7117 -7448 -7492 649 4173 1380 -3744 -9173 -6372 -3664 313 1865 -866 -4030 -864 -175 -714
15872 -714 -4823 -3170 849 7457 4180 1050 1741 -3032 -9153 -14689 -14279 -12815 -6442 -5071 -4900 -4043
15856 -4043 -11470 -15806 -17190 -13053 -6944 -6240 -7969 -8731 -7460 -7843 -8431 -2700 -7066 -8146 1428 212
15840 212 -7796 -13982 -13879 -12510 -8560 -4544 -5890 -12708 -17160 -10626 -7030 -1390 1809 3742 7123
15825 7123 5084 3637 -321 -3953 -6961 -17369 -11568 -10294 -7632 -5306 -2047 -2842 -4896 -9342 -9986
15810 -9986 -10519 -10575 -6583 -4131 -4287 -5873 -4797 -6653 -9985 -9527 -7870 -8678 -12751 -11648 -10552 -5699
15794 -5699 -2169 -8021 -14928 -9142 -10012 -9459 -9212 -6160 -9752 -7089 2266 800 -5653 -9446 -8082
15779 -8082 -6446 -4352 2720 2696 1905 -6140 -14226 -8454 -7245 -12073 -8926 -4787 549 -4524 -7631
15764 -7631 -12671 -14968 -9940 -7097 -13052 -10827 -5621 -478 3184 -5613 -6299 -5402 -7218 -9282 -10219
15749 -10219 -13161 -11017 -13234 -13126 -10238 -10970 -16796 -12628 -9161 -7552 -6280 -2498 -7046 -8631 -10381
15734 -10381 -10867 -8036 -9003 -13097 -9762 -5586 -2449 -3973 -3218 -8473 -8976 -12530 -9764 -6690 -3605
15719 -3605 -9794 -14596 -11367 -14175 -12678 -11271 -14960 -10846 -5668 -6507 -7432 -7783 -5660 -6540 -4747 -739
15703 -739 -3028 -6172 -5834 -4387 -4778 -2296 1004 890 -956 -5433 -14180 -10573 -14001 -8517 -6695 -7921
15687 -7921 -10491 -10413 -6245 -1481 -4334 -6172 -8693 -5389 -9481 -9752 -5660 -5658 -5637 -2557 -4191 -1717 3641
15670 3641 5653 2833 -3016 -2355 -6583 -7753 -2381 979 -3968 -3525 -6195 -9872 -9241 -5238 -6169 2370
15654 2370 1704 -3196 -6532 -3921 -4296 -4260 -3496 4142 3013 2682 3868 3407 -2633 -344 3627 6256
15638 6256 1532 -4716 -14604 -9864 -4904 -3579 -4062 3193 3457 -1918 -1289 -4242 -8853 -10387 -9397 -5531
15622 -5531 -3136 -11297 -7895 -4702 -6057 -4534 -3492 -4969 -5195 -11794 -11312 -12358 -14526 -14005 -12794
15607 -12794 -14911 -13199 -9855 -7522 -5502 -4816 -6803 -10821 -7334 738 9177 9473 8359 3737 3195
15592 3195 8711 7580 -756 -2246 71 -1972 -1001 209 -636 -3178 -2743 -3972 -7201 -5833 4209
15577 4209 10535 10683 8300 -1551 -8316 -13932 -15563 -16224 -13331 -10544 -4838 -5747 -7303 -7837 -6681 -10818
15561 -10818 -9529 -291 -689 -6030 -14203 -15769 -8046 -5094 -2955 -6489 -7588 -7541 -5109 832 4195
15546 4195 19 1980 539 -5224 -13948 -17895 -19368 -14316 -8783 -4385 -1537 -3570 1465 3816 5463
15531 5463 5107 -3868 -4118 4237 3892 -1893 -2009 -2878 -2272 -8936 -11643 -5798 -3952 -17651 -18286 -8523
15515 -8523 -1238 6789 -2019 -4314 -62 6128 -190 -5526 139 -1770 -3016 -3354 -781 -2190 -2650
15500 -2650 -1561 7727 10340 1540 -854 -2993 -11403 -14298 -11995 -7653 -2938 886 3231 4003 784
15485 784 3124 9158 10988 14040 5823 5568 5234 1131 -2588 -2284 -1844 -4800 -5990 -6903 -7487 -10466
15469 -10466 -14137 -12456 -1340 1911 -240 -7607 -12989 -9331 -3575 2386 -1521 -9481 -12975 -10035
15455 -10035 1967 10044 5760 4299 205 -2990 -2784 -6727 -4732 -2886 -1919 1455 3760 4956 4555
15440 4555 -872 -4340 -6050 -7228 -3909 -13182 -16116 -8084 -5366 -2887 -8483 -11158 -4470 608 14
15425 14 -2999 -5963 -1335 7579 8883 10651 1539 -4381 -1250 1239 3366 4209 9752 1339 -11390
15410 -11390 -9290 -1414 -3074 -8058 -11796 -10009 3595 6147 5503 8197 7589 5685 320 -3977 -1795
15395 -1795 -3644 523 1862 -271 -1091 979 797 2161 4427 -681 -9689 -11679 -5105 715 -3853
15380 -3853 -9267 -5244 890 -6276 -8544 -6571 -3313 297 -1298 -2848 -7093 -8873 -4969 -7377 -9579
15365 -9579 -15463 -18451 -15034 -15281 -14233 -13504 -11663 -13961 -12774 -18363 -14151 -8286 -2743 -5029 -5312
15350 -5312 -6642 -9400 -7708 -2333 4352 9144 9387 9286 3643 2881 4118 7708 3814 -3663 -3774 -3559
15334 -3559 -4696 823 4371 8444 4719 2705 3530 -2845 1138 -846 1921 3986 -861 703 2714
15319 2714 -1199 -2087 -4756 -3528 -2766 -8366 -6403 -1085 6017 6758 4240 -1023 1241 5458 -272
15304 -272 -4196 -2558 -4222 -5939 -7912 -11017 -6296 -6173 -7600 -7306 -2272 3848 4824 2391 -1689 -11016
15288 -11016 -7568 -6834 -18478 -16804 -9931 -9463 -6003 -4403 -8130 4 2563 -430 871 -507 -5919
15273 -5919 -8066 -12936 -14866 -15204 -9408 -3309 5551 12767 3771 4111 6595 5484 4032 -1363 -2683
15258 -2683 -5566 -6276 -2732 -8437 -11932 -10360 -10832 -10008 -11467 -1608 3428 -1554 -3769 -7562 -943
15243 -943 7772 4324 -4577 -10278 -7091 -5281 -2260 -660 -812 -2717 -5543 -2411 -538 -628 -929 804
15227 804 3417 -2773 -5824 -4455 -4111 4912 5014 2843 -449 6014 5651 459 3426 -6661 -6313 987
15211 987 2917 -1218 3356 5741 -1137 -1710 -3058 -8126 -4025 447 -1014 -6285 -3568 -2034 -666
15196 -666 -895 -5010 -11001 -9000 -1916 -1952 -4580 -4279 -5503 -5552 -5992 -2640 4996 5660 -866 -2679 -5511
15179 -5511 -7521 3110 10412 7754 2064 -8243 -18948 -15200 -11420 -6775 -2627 -184 5068 2553
15165 2553 -2854 -4421 -6574 -4935 3951 1077 2923 2478 -3804 -3217 -4195 -3380 -3452 -8272 -8878 -5708
15149 -5708 -4276 -4056 -11172 -15564 -14713 -12557 -13504 -9529 -6230 -10524 -10497 -5531 -7696 -13547 -17328 -14774
15133 -14774 -7539 -4420 1312 3520 -3517 -2905 -4290 -5134 -1512 -1820 -8 1829 3082 789 4990
15118 4990 4720 5750 10179 6730 6639 2769 -4271 -4024 2861 6266 9561 4203 -4722 3053 4021 -6242
15102 -6242 -10612 -9973 -8825 5486 13466 9661 1456 3741 5003 6624 2 -1290 -8102 -15858 -14368
15087 -14368 1903 10049 8238 5112 7397 5688 7841 11814 14411 13970 7252 3128 20 -7664
15073 -7664 -10761 -2322 8040 5631 -394 1465 -3592 -11253 -11872 -8481 -4030 7449 7607 3346 4399
15058 4399 502 1914 7581 4923 -3212 -6582 1142 6005 6227 5297 3387 909 -2628 -2611 -3808 -6200
15042 -6200 -5533 -5297 -5019 -873 799 -4237 -2230 5993 3389 1051 258 -2589 -73 -2252 -11052 -11698
15026 -11698 -8465 -9555 -9806 -6441 -3089 -8590 -9004 -4877 -4932 -3859 -4129 -6610 -3983 -5841 -7508 -10781
15010 -10781 -9726 -8350 -1632 2044 -144 -11185 -10185 1467 1205 2364 4369 8750 6695 4128
14996 4128 4082 6522 8267 8892 7061 3553 699 -1354 2546 5812 4945 5981 5003 6979 4652 4438
14980 4438 6529 -2510 -1411 4927 7837 10310 7800 658 384 -2150 -3803 -9659 -16801 -16628 -8827
14965 -8827 -4210 1956 3285 -1635 -2236 -5553 -856 5494 96 -3521 1070 1199 -2454 -1755 -69
14950 -69 242 1951 2034 2158 1313 2982 7204 -168 -7434 -7218 -2221 4477 5487 -553 143 -2489 -9068
14933 -9068 -6360 -6153 -5374 -3355 -8542 -7813 -9213 -5340 534 2390 3391 1541 2172 -2190 -2322 3269
14917 3269 -2133 -9156 -6681 -2887 -3878 1612 5636 6897 4107 2253 -1329 -4142 -4634 1699 6689
14902 6689 11513 13699 11742 10592 7882 6898 8903 2968 2490 3896 3695 812 467 -3242 -8804 -8460
14886 -8460 -6833 -12344 -15302 -16795 -15276 -11920 -10370 -14103 -10726 -4502 -1159 396 -399 -8502 -13256
14871 -13256 -8247 -6057 -5060 -2798 -289 2298 -926 -6445 -4853 -6039 -3954 3943 1654 -4999 -4611
14856 -4611 -7086 -10048 -5487 1846 971 -4834 -843 -658 -1406 -3136 -117 -276 486 1889 -3609 -3210
14840 -3210 -1340 -1339 -6915 -7670 -3301 -2627 -6663 -10392 -6049 3684 6148 2274 3177 3755 -2807 -9043
14824 -9043 -6603 -1967 473 -747 -7496 -8840 -2531 1362 -5484 -6175 -1392 -3250 -5472 4332 13528
14809 13528 19002 19317 14077 4683 -110 -3023 -1810 -3102 -7547 -3329 -300 -396 2510 8742 12360
14794 12360 9584 6411 -1226 -2294 -2027 1975 1380 -3220 -963 219 3147 -131 -4023 -9454 -10803
14779 -10803 -8472 -4250 -4583 2109 5150 9218 14216 9278 7239 7849 4866 6859 8085 5174 2959
14764 2959 7254 7430 3321 739 2978 4625 -710 4967 7221 8656 10200 8842 -2079 -1944 -3521
14749 -3521 5846 8626 5659 6314 2521 -1441 -288 -499 -3373 -3859 1063 -6151 -9550 -11617 -10918 -5730
14733 -5730 -952 -1295 2255 2659 1691 4011 4703 -3135 -6991 -5494 -2561 -2608 -6593 -6083 -3662 -8261
14717 -8261 -781 1140 -2669 -6620 -4438 -8576 -6367 -6188 -3188 -985 -3099 -5250 -1248 2265 1963
14702 1963 5920 3677 -2636 -7001 -9372 -11810 -8761 -7478 -8576 -7010 -4686 -3720 -4765 579 1759
14687 1759 5830 4271 7709 6760 5315 9451 11901 9066 8116 8002 12998 10965 4048 3023 4987
14672 4987 2802 3511 1328 3241 2478 3022 7380 8917 5677 10145 7000 -1763 1488 2276 -4857 -6297
14656 -6297 -3315 -1616 -3522 -4971 -2831 -5451 -5110 4548 4600 3920 -859 -191 2172 -4839 -10607 -11251
14640 -11251 -11874 -12913 -16958 -12275 -10306 -9550 -10063 -8528 -8477 -12074 -8641 -1677 -1439 -1250 -4831 -485
14624 -485 1941 -3567 -7046 -952 -3071 -1101 4423 5797 440 -3641 -1721 5606 8685 4850 -1895
14609 -1895 -2036 956 -4584 -3894 -156 4018 5830 4491 6328 5560 4095 6028 9920 7657 5605
14594 5605 11440 11734 14251 22419 24483 14637 8978 7966 1515 -6951 -10183 -7528 -6356 -2774 -3961
14579 -3961 655 5613 8028 -330 2154 9210 4988 3784 5399 1340 4032 -184 -1989 -2160 -1620
14564 -1620 4609 2321 1259 -4302 -757 7519 12901 13838 15082 15721 15541 9609 623 -1641 -2319 544
14548 544 8233 4839 7227 10895 6338 10613 9483 2972 4398 2689 2315 -571 449 1756 -1074
14533 -1074 -8548 -10171 -7391 959 4935 5452 -5176 -7614 -273 962 2335 -462 -2652 -7350 -8457
14518 -8457 -10988 -6807 -4363 -4327 -6451 -3931 -6044 -9673 -7682 -3868 -2636 -1645 -728 7492 12891 11957
14502 11957 7750 6014 943 -7611 -2004 -1930 -7599 -2926 -7737 -5263 2896 7720 9811 8511 12915
14487 12915 14562 16611 15702 8867 249 7636 13649 12039 8296 1512 -2615 -5425 -8259 -4607 -2786
14472 -2786 -4731 -2759 4623 4327 -2160 -918 -136 -753 -1258 -2650 1153 933 -3519 -8447 -10618 -2030
14456 -2030 3757 3134 2522 2885 5716 2763 -6490 -7766 -1055 3897 8053 6505 1665 2328 2493 7698
14440 7698 7247 -4143 -4158 5493 5471 12450 10397 8015 2191 1467 5133 -675 -8704 -5698 -3043 1429
14424 1429 6058 7021 3662 5956 2749 4122 5333 4322 7210 10965 15722 11802 440 -1455 2006
14409 2006 6602 10114 10321 12463 14990 15764 12280 7819 8215 3156 7303 16590 15287 7029 4704
14394 4704 1401 5200 5347 3602 8229 7445 5035 7194 134 -1707 -525 1438 12686 16443 19512
14379 19512 17629 11560 5883 5730 10258 6607 2606 1692 1791 1933 5351 462 -2236 -5550 -6107 -7493
14363 -7493 -2371 4368 8437 15778 12311 7182 1007 1632 533 -2686 -7265 -3729 1912 799 -3556
14348 -3556 -8693 -10877 -4908 3961 -1766 -5212 -3763 -409 3986 7927 4523 -392 -6371 -4570 1440
14333 1440 -1375 1761 7536 9650 8068 9672 4470 8038 10949 12319 13785 11489 4397 1559 -48
14318 -48 -5459 -7732 -3908 -1240 27 13293 16804 9823 7205 7316 3093 6219 13824 18030 16774
14303 16774 5455 -723 -965 -2487 -895 -3403 -4246 -3769 -6633 -9147 -1058 8635 14228 12912 8991
14288 8991 2258 -156 1442 8110 6854 1113 -3390 -1899 -126 2804 -2250 -1822 849 3971 7087
14273 7087 2800 1467 -1102 -3484 -6740 -9070 2555 6950 1342 -8509 -11380 -8981 -3884 -2112
14259 -2112 236 -1348 -1805 -4123 -2708 -569 -1735 -1598 -6560 -1060 4439 1857 -3949 -4559 -8323
14244 -8323 -7334 -5717 -3316 -1954 -5813 -9308 -425 7834 7156 -913 1177 4150 833 4642 6533
14229 6533 2375 -4531 2284 10590 6477 2164 1559 4021 8171 918 -9207 -14853 -16043 -12396 -9977
14214 -9977 -4805 -5252 -4061 -5333 -2481 -4182 -3341 -1664 1105 2716 6472 7288 -118 -1889 1297
14199 1297 2636 8052 9595 2061 -4008 -3365 456 2888 4988 -108 2424 3741 1964 4254 1765
14184 1765 -1730 1605 -546 -5171 -2090 2304 5170 9888 9846 10337 8424 5325 -587 266 51 -2634
14168 -2634 -6010 601 -1173 -4598 -3889 -3949 -2691 -5845 -3627 -2481 1369 490 2183 5715 5735 8815
14152 8815 9402 8638 5309 3962 3334 4427 -30 -6951 -12958 -12326 -7278 -6562 -6297 -5544 2622 14104
14136 14104 18195 19466 19141 8929 9451 9964 4836 3863 3047 12120 12455 6889 3420 4126 8336 8449
14120 8449 6261 7739 2767 560 986 -2233 -475 4094 1503 -2667 3249 5778 4159 220 557
14105 557 3542 10053 9049 2631 -1491 1865 4506 12053 15452 17669 14826 10906 12440 15164 16598
14090 16598 10070 -4233 1900 18055 16166 9070 5928 10958 11151 14523 17949 19144 11711 10823
14076 10823 12013 16379 22076 27959 32191 36841 34858 40142 38993 52131 65342 78030 92393
14063 92393 117765 140864 161130 181059 199213 212751 220383 227359 230834 235808 235352 239038 237523
14050 237523 226995 218180 208724 189572 180208 161733 145278 131693 111501 88616 68671 53052
14038 53052 50687 50056 41933 32452 27377 23828 26482 23982 25042 25015 17018 14365 16079 18448 20769
14023 20769 20115 19234 17065 15394 12496 15556 19644 22793 19961 17741 20981 9724 5207 6091 4174
14008 4174 -820 3617 8691 17847 13077 10165 7017 9596 11302 6260 6901 11202 8098 4621 10767
13993 10767 10785 2068 1338 6867 9350 13495 13305 13020 12539 7188 3286 2923 5260 12237 16031 20099
13977 20099 19753 12559 11612 12808 6839 436 2599 1963 4532 7206 4328 3335 7122 15021 4104
13962 4104 -3021 2425 6703 4946 1634 3225 2644 3711 7965 15699 8735 5977 13262 17106 12637
13947 12637 9138 12794 14105 10713 8985 9679 12905 16661 19907 17331 17705 14903 6024 7313 10151
13932 10151 12394 11231 16736 10733 5023 8386 11053 13356 13831 10651 4934 2105 158 4274 1946
13917 1946 2554 8807 5151 7043 12248 11643 7176 -156 -1188 3272 5099 7707 1375 -178 360
13902 360 1164 5763 9487 11868 11530 10622 9203 10360 5302 4725 3017 4398 4387 4980 11904 12725 2361
13885 2361 -4368 11247 21690 13983 7287 6591 8241 3093 7174 11246 12080 16189 13129 7248 6022
13870 6022 11867 16290 17167 16665 14913 16939 10030 11196 11618 10952 8785 12532 16072 13263 9854 11903
13854 11903 6999 8871 14886 13389 6168 11951 13815 9144 4605 8037 8399 8668 10328 10929 11005 15271
13838 15271 16466 13952 13329 22831 22510 18400 14927 19175 18692 18179 24095 21757 12046 7855 15440
13823 15440 7478 -6741 -6510 816 9424 12211 17145 15978 12776 17309 21168 19401 22430 30499
13809 30499 31828 24085 24083 26976 19341 16082 16069 21087 25506 21579 18642 15607 7234 7176 13376 16149
13793 16149 16216 24058 29154 31971 33959 34811 32760 34323 34201 31800 30862 31226 31255 34118 31052 28492
13777 28492 22076 16523 15033 15486 14031 13004 17680 23221 19605 11511 5160 4861 6200 4941 10427
13762 10427 18498 11244 7643 14692 17220 19173 27501 28268 19699 3346 3137 7045 11311 17798 28719
13747 28719 28684 30189 28900 21480 18103 17412 17573 17295 15849 19133 18014 14217 15505 12567 9776 12468
13731 12468 5859 11893 14483 8889 6712 3308 6613 10738 10572 7559 7489 8599 9019 5090 12366
13716 12366 19695 18773 16627 15446 12621 12805 17744 19480 18165 21191 20747 12689 12939 11752 9433
13701 9433 12501 14951 16084 14237 14288 13972 10360 12057 18345 16892 16495 25519 21826 18368 20290 19010
13685 19010 11898 3411 6489 10836 15871 13637 12473 12800 18282 25987 23581 15720 12557 18501 30314
13670 30314 28568 28151 30134 38031 33212 34033 37324 37581 40974 43607 43706 37376 36715 43215 40753 35647
13654 35647 25916 17182 14495 11376 11830 19499 25599 26042 25779 19105 18321 18966 8931 9506 12476 11407
13638 11407 18112 16092 17751 20699 25208 23162 22718 27397 20517 27111 29866 24529 10056 2749
13624 2749 5873 5841 1892 53 3050 2632 10722 12746 10349 14997 16435 18210 18559 13589 16639 15167
13608 15167 11159 10873 12214 19195 24008 19924 13791 22935 26042 23978 18468 8421 8169 9074 12092
13593 12092 12894 15547 16650 16933 17181 14442 15108 8743 8897 11853 9441 5539 3585 2330 2537 9063
13577 9063 7730 19171 25504 21486 16731 17620 18776 14063 13954 11971 12603 18499 16937 13166 14681
13562 14681 13614 11883 16767 18892 27348 31307 25580 24219 28109 27588 29436 33841 22227 10174
13548 10174 13935 19631 23984 22473 15860 18361 29969 29248 25085 22814 26965 29760 22165 22814 31365
13533 31365 35443 28283 26259 28522 27183 30631 30242 30565 30080 29531 29766 26404 23959 23883 24089 23763 19165
13516 19165 15481 19046 24454 30021 30529 26961 19836 14383 9807 8185 20931 30172 27012 29548
13502 29548 27848 29432 37580 44170 45858 45375 43146 45576 39565 29430 30686 27768 21752 19494
13488 19494 23214 24388 22899 24571 28649 22865 16642 22700 24417 25335 19212 17696 25768 30742 34416
13473 34416 30617 31994 33371 30487 31562 28516 23861 30771 38485 40577 34365 31189 35820 36140 30710
13458 30710 25914 27544 34933 32498 32401 33436 32243 31322 33926 36268 38668 37604 32381 22091 18813
13443 18813 18651 18456 18793 17674 17973 24104 42569 42478 36502 40761 40542 43097 52780 56141 59231 57620
13427 57620 56424 62269 71346 82921 98908 110783 124654 146816 162905 160499 149025 128789
13415 128789 104189 93262 79146 69237 55639 47900 41387 36219 30046 30639 33610 36101 39580
13402 39580 38888 36426 35643 40180 41451 41151 40527 41778 40973 42330 40918 45121 53061 62413 66220 66786
13386 66786 70321 81436 105059 129533 166515 214866 264573 306882 337872 331302 293358 251908
13374 251908 206342 166451 131248 101743 81346 76570 71715 65163 58650 59722 58598 52503 46647
13361 46647 42268 44611 41053 36562 38349 37812 34653 36301 39874 42419 45830 47236 44082 45844 47402
13346 47402 44643 52290 63405 68599 81110 105249 130532 156717 177917 189946 188330 176350
13334 176350 150169 124128 103856 89240 67341 55072 53917 50181 49112 56246 60580 51082 48962
13321 48962 45616 46072 48011 45329 41776 35139 27666 31188 26692 20492 27958 23307 21634 32230
13307 32230 42310 31353 24685 24114 31318 35061 35267 35019 39759 41146 43040 45283 39782 38363 37453
13292 37453 36340 38861 35395 37926 35623 26721 33712 41307 51395 52239 50198 45551 48807 55784
13278 55784 54902 47694 44117 42393 43939 42132 33845 34745 33738 29188 28414 25733 26416 29330 32121
13263 32121 35074 36904 39288 36346 32165 30718 32451 37870 35700 37217 41533 33987 29477 30622
13249 30622 31877 29329 31045 37301 42713 50519 50239 55326 51475 47497 46418 48655 50624 48729 47539
13234 47539 45717 44157 49682 48172 48492 54599 54769 56249 59032 65287 63604 58821 50218 51468 61075
13219 61075 60253 59806 54844 47526 47371 47659 45590 44206 44572 47659 52113 53710 52252 52498 55733 60751
13203 60751 60763 59331 57505 59390 65805 60769 60979 64429 65189 71783 76319 70525 76092 85642 94975
13188 94975 114520 147021 189979 257261 353010 445391 495602 479960 404393 316043 234330 177362
13176 177362 141937 127651 117201 107069 102148 100911 94338 92284 94548 93275 91689 90088 86528
13163 86528 88348 91114 87894 82303 72363 78275 80683 86585 85133 83033 84762 86530 88255 90036
13149 90036 96647 106679 129630 146935 171719 202820 234469 296893 396481 552264 797041
13138 797041 1083170 1297053 1319308 1133960 848236 593578 416826 302574 235286 197121
13128 197121 181771 170953 159325 143681 132280 122688 121759 120447 109354 98849 94079 97005 94905
13115 94905 90488 94979 103383 103606 102501 102379 100880 100025 96653 101556 117775 130692 139663 150865
13101 150865 168957 190477 209298 240560 288490 374445 527953 759767 1038596 1287852 1371516
13090 1371516 1229831 945721 670041 471334 345119 272229 223627 192269 172654 151842
13080 151842 138961 129085 119583 119257 119016 116143 118424 118953 121543 113812 103844 114006 119303 117109
13066 117109 110192 111832 118254 126004 134119 136876 148217 158968 157771 145796 139362 135869 139256
13053 139256 142037 152692 181790 233090 315095 420102 514806 553429 521665 440715 351750
13042 351750 284249 250336 250248 262329 270935 277887 284921 283262 274555 267436 266419 268483 280306 312642
13028 312642 353514 410981 474919 543014 610863 667002 704536 720986 706976 670406 621952
13017 621952 566309 511030 457082 410553 370754 343496 325623 319354 318716 315667 311728 312541 320569
13004 320569 342422 359774 372091 391031 434002 497255 563767 626648 679283 716764 742052
12993 742052 766804 794933 822232 864322 930340 1014296 1111485 1246547 1405271 1585873 1795294
12982 1795294 2042719 2360211 2788961 3364259 4155929 5262903 6858848 9196505 12547490
12973 12547490 17026220 22282638 27191260 30118610 29866514 26609505 21747467 16822990
12965 16822990 12752677 9758436 7660825 6191331 5155173 4398379 3840092 3427437
12957 3427437 3119474 2878341 2680407 2528056 2410369 2331949 2295758 2290863 2326324 2401690
12947 2401690 2516897 2685241 2913138 3199816 3542045 3930974 4397608 4995181 5808227
12938 5808227 6934934 8512941 10748062 13994277 18782767 25744856 35245608 46601391
12930 46601391 57417874 63990602 63389875 55915795 44812102 33730961 24800361 18428096
12922 18428096 14113173 11176816 9102274 7577342 6420348 5524514 4820056 4259332
12914 4259332 3798188 3397270 3059731 2797842 2596475 2453810 2361162 2314954 2313848 2345285
12904 2345285 2415415 2521746 2651310 2819692 3046872 3341613 3761524 4352225 5179243 6348090
12894 6348090 8049569 10533897 14072100 18753709 24153535 29100987 31904193 31325863
12886 31325863 27586188 22203754 16864985 12538753 9403205 7242542 5748494 4677555
12878 4677555 3878336 3261798 2772367 2383137 2065390 1804646 1569335 1368166 1201978
12869 1201978 1075351 971182 885334 820049 769802 724141 680496 640999 605689 574969 548638
12858 548638 528520 518596 506214 491637 480046 463782 448312 429877 409253 385157 369682 356606
12846 356606 339457 325115 310713 294975 279552 259057 237043 222705 214383 214751 211911 205698
12834 205698 200788 195133 189265 187221 178120 172651 165681 163832 162910 165743 166742 172518 181010 177801 171588
12819 171588 164607 161279 167789 167147 169101 159776 152692 154054 158483 164948 169740 177873 183873 186150
12805 186150 190947 200475 199240 192032 175071 163359 153626 147431 132708 120159 115858 115272 117456
12792 117456 118736 117051 114574 110355 108933 105696 102214 93995 82709 84884 83412 80388 75224 75586
12778 75586 84906 87809 81944 74915 62752 61224 68214 72266 71538 81134 90560 97691 98030 97275 107130
12763 107130 118958 124667 124570 119443 114090 117375 122486 120739 120520 116016 110269 105657 100466 100089 102183
12748 102183 102357 103049 105461 102242 100648 96608 100425 101737 99859 97036 94864 97264 103798 108677 112670
12733 112670 119183 126096 127579 127528 122981 108683 92356 81198 66179 54885 50496 44655 37682
12720 37682 35768 36886 31390 30288 29245 29102 26764 29510 38270 42936 41002 44468 49492 56263 60510
12705 60510 68089 75563 71432 67848 64498 65861 72398 81672 81392 77803 80463 81124 80290 94725 106497
12690 106497 109742 111961 113653 123985 128940 128201 129434 132122 136304 140479 135809 143737 152932 148781
12676 148781 147424 145510 151126 165347 170742 171331 174988 177675 179878 186860 194215 197601 202399 205041
12662 205041 216116 225051 235601 249925 264994 273135 279553 298543 313858 328600 336488 346447
12650 346447 364316 375460 381415 392540 416513 435266 446986 462210 479744 497390 516717 536595
12638 536595 551784 575961 601332 627923 659329 708401 768140 831096 908287 1002636 1091500
12627 1091500 1174161 1264514 1371956 1495647 1654669 1850875 2093583 2376719 2725472 3157656
12617 3157656 3646795 4184602 4773893 5435229 6170194 7014567 8034516 9363918 11234069
12608 11234069 13996715 18124300 24233641 32821374 43662732 55720314 67806829 79009577
12600 79009577 88491125 94806986 96475434 92969672 85398926 75307807 63859208 51789968
12592 51789968 40159033 30172019 22611390 17358375 13808382 11374745 9643705 8351442
12584 8351442 7327342 6463088 5691558 4975445 4303876 3707248 3200693 2796820 2483998
12575 2483998 2246074 2055547 1893747 1746016 1620989 1511206 1416764 1345121 1300595 1262987
12565 1262987 1242900 1248643 1244845 1179979 1096134 1024738 970728 915235 849948 775741 702327 648253
12553 648253 608863 579258 569264 568608 568516 567991 557760 542088 524438 514908 516724 525030 528081 530409
12539 530409 550095 578306 600909 596322 575344 549577 526737 516788 513874 518149 519435 529862
12527 529862 542376 560144 590527 637681 706590 821332 920525 887897 769462 661312 605035
12516 605035 585208 578188 575513 561490 536360 503231 464793 427627 406527 402845 411585 401838
12504 401838 372668 339737 317156 310997 305573 295682 288175 296247 308731 317489 312472 297421 283270
12491 283270 274861 270812 271063 274949 294548 322173 341964 358026 373064 389412 414754 471462
12479 471462 544324 568471 549190 532504 540550 567866 608573 636611 629230 591753 519456 432430
12467 432430 351687 287354 239235 203417 168042 150335 135774 121112 114467 112565 108196 95864
12455 95864 92767 99973 98073 93280 92532 93711 92161 104087 122554 136022 133515 132094 139416 128199
12441 128199 107864 95127 86492 81410 79514 85100 98178 124340 153173 177737 181938 184914 174773
12428 174773 153778 133036 114723 93829 76466 76199 72820 75139 78862 71287 65889 64283 56183
12415 56183 50397 44506 44393 43438 45225 48011 55733 71130 80296 84369 88857 92197 94732 89954 84595
12400 84595 69377 53427 43654 37411 32040 28933 18987 11698 8049 11666 13674 8631 1458 3889
12386 3889 2709 1588 3924 4829 6070 9448 16116 26851 28455 22783 21392 21803 14610 18203 25920
12371 25920 32295 30933 27424 25137 19119 16405 18957 19585 10947 10516 19646 28125 28898 32285 36646
12356 36646 38028 34904 29359 27590 32899 27614 29393 32945 30555 25284 27490 33347 40745 51214
12342 51214 57412 56161 51642 47260 39065 40756 31873 26084 24342 20604 14104 23208 21830 20631
12328 20631 26134 23228 20864 15194 15829 27132 22998 15974 13152 6781 1628 535 1738 -1130
12314 -1130 1928 1709 599 5192 12910 21571 27606 25904 21127 23198 15925 9025 192 -1796 3256
12299 3256 10680 9633 9310 10820 4282 -2530 -92 3614 2946 7253 7301 4718 6500 5611 565 -664
12283 -664 4768 10066 9832 4263 317 1771 681 -4280 -7797 -7297 -4424 -6488 -102 -555 7239 10761
12267 10761 12422 12516 8323 3956 6650 5997 10688 8043 1951 3990 2081 2345 5544 3433 1620
12252 1620 3131 9982 5575 6989 12689 15908 9475 490 1287 5569 7460 1233 678 5058 8663
12237 8663 9101 2326 1943 6660 7816 3536 -12392 -15213 -4545 4921 7684 1247 -4154 -5482 -2763
12222 -2763 -3057 3597 1365 -2673 -603 8993 11715 10440 9384 4348 2902 6958 9250 1999 -164
12207 -164 -1383 -3393 3915 3506 -4474 -7999 1216 4445 9988 15138 10752 11649 10898 18933 19093 18214
12191 18214 21552 27351 30019 23793 23865 20745 21263 38000 40527 47844 57549 66344 71903 89860 124210
12176 124210 165924 219965 276844 337761 396013 445211 483790 497227 486346 460760 415717
12165 415717 359464 295693 241306 194277 151372 119020 88831 76253 68572 53239 40779 32434
12153 32434 27310 19078 17868 17819 20475 19398 15706 6678 2842 4697 10768 13196 10666 12780 11485
12138 11485 7108 9684 13226 12098 5201 1237 2294 8968 5474 5451 10243 9936 3150 -1966 -1403
12123 -1403 1409 3218 5071 8286 8122 4306 8583 14302 5604 2219 4175 8039 2313 2128 497
12108 497 1659 6720 4934 3029 7555 -1082 -8342 -10766 -1743 4344 7334 10053 8210 5943 8337
12093 8337 5084 4554 7554 9656 9518 12548 13918 10308 13239 12453 13114 13700 11600 11117 2564 2512 5168
12076 5168 -964 -4881 -1781 5188 9688 5821 4409 1536 823 -2280 -4005 4035 9803 9856 10191 8521
12060 8521 10193 6800 3052 1076 6169 9902 3702 1107 1596 5682 8817 5647 -952 2678 9575
12045 9575 7519 -954 382 4993 6468 4033 7060 15235 11957 6141 9248 12708 7444 3350 -408
12030 -408 243 5191 5012 -1909 1585 4036 3147 -1562 -3607 -2944 -4003 -5526 -3928 -8690 -12732 -7467
12014 -7467 3340 8320 9076 18935 14461 2515 -6045 -7206 -5474 -1322 1850 1113 1728 4619 -2198
11999 -2198 -3074 -2842 -7974 -7943 -8644 -6640 -9032 -7187 -5442 -6891 -7733 -3546 2453 -1147 -10613 -6179
11983 -6179 134 -3755 -814 232 -1078 2048 3854 6491 -929 1712 7271 8394 6019 4351 1375
11968 1375 -6276 -5835 -6228 1840 -672 300 2780 6348 9751 16038 9963 742 -5906 -3921 174
11953 174 171 -1835 537 310 -609 1538 2846 4768 7036 11879 6694 -3144 -8283 -8820 -9144 -6047 444
11936 444 -1876 -4111 -7599 -12084 -16530 -15416 -12032 -10532 -3845 -7471 -9588 -8975 -8714 203 11415
11921 11415 7587 8079 9442 8974 15455 15211 12731 8905 9258 6978 -840 -537 -5542 -6651 -9546 -7135
11905 -7135 -8665 -870 111 -1183 -8548 -1447 -2815 -1992 3612 9888 1820 1125 6895 14192 12438
11890 12438 4270 -2808 -2236 2581 28 -671 -3183 5 2953 8394 13590 13671 7038 2484 -1152
11875 -1152 -4420 -6318 -5706 382 4054 -615 -2072 -3095 -4115 -4587 -3747 -3124 -1579 -1480 -1396 -2129 -732
11858 -732 1372 3964 4945 690 -2376 -3884 -8044 -5150 846 1406 -373 2328 4461 6391 3264
11843 3264 -1274 -407 1045 -2371 -971 6288 6558 8517 10151 4878 -2811 341 9113 12933 11412
11828 11412 12550 11934 7501 -2807 -2859 -6193 -5290 -4788 -5426 -1505 5578 2505 3152 1787 4581 9161
11812 9161 9154 5591 6037 1982 1875 5684 959 5737 11154 11259 4623 3619 4121 2717 3083 5926 114
11795 114 -655 1604 4118 7846 7820 10755 15772 21081 24080 15503 13674 5222 215 9039 10111 4515
11779 4515 777 -1621 -4703 -2847 -2453 -2802 -7763 -1496 4285 573 -3350 -4248 -4104 -8439 -10155 -7271
11763 -7271 -10982 -1403 4751 6751 3109 6094 14226 9226 3405 1021 3880 8965 11198 10120 9690
11748 9690 9802 10264 12477 17402 14777 11095 11457 8692 10531 11768 8321 2363 -733 3456 4028 2107
11732 2107 5446 9554 2071 -2796 482 293 2353 3930 2810 9174 18049 25549 21752 14985 10808
11717 10808 14545 16538 17466 18469 24694 17335 9588 5219 4746 1720 3718 3383 5338 5718 7034
11702 7034 11111 16161 15561 14894 16286 14357 13513 15589 5481 2660 703 -219 2158 1388 -1379 3075
11686 3075 3276 4368 6500 9994 12207 13717 16346 16864 20076 20714 16721 13830 15380 12241 7093
11671 7093 7692 7030 2261 -1507 1631 7697 10468 2991 9574 18664 13951 8225 6536 1673 5909
11656 5909 12729 14814 8241 11252 8783 4600 3119 10400 16040 16908 15578 9942 15595 20340 17090
11641 17090 11599 13404 15209 13589 11771 10478 6749 7536 5596 2709 7490 12969 15765 13078 6155
11626 6155 -1600 -525 8672 15427 15407 14495 10985 16526 19929 15035 9778 10275 10474 9253 8030 8569
11610 8569 9836 12282 7799 -1101 4361 10045 6902 8423 7583 2808 7523 12389 11494 7959 847
11595 847 -7617 -2864 2431 9967 12399 7901 10760 13115 16454 13500 9918 9177 8545 14392 24431
11580 24431 26250 21727 19594 16201 9902 3032 -1514 -4409 -1444 3197 3200 5733 6368 2881 -950
11565 -950 2783 6462 5407 2071 6594 3322 676 5856 6545 5080 7054 7223 8276 9543 13017
11550 13017 12676 14145 9906 2042 -1586 3509 -1814 1949 6192 7763 14410 15553 16384 15291 11469
11535 11469 13144 16404 20018 21486 24635 28963 25604 16493 12383 9670 12596 15730 10780 9393
11521 9393 17446 23328 16773 18708 18033 20676 18784 19205 14330 11816 4508 4283 4128 2389 5815 10936
11505 10936 6755 9414 12390 8739 6595 -1675 -6150 684 -4586 -1553 9565 13246 12477 12213 11255
11490 11255 5013 -318 -466 2492 1832 5069 10531 5090 9895 9796 8163 7874 6716 8854 7082 508
11474 508 1013 3461 9790 14422 10431 5699 2545 6529 9573 11129 10890 10171 9547 8223 10119 7895
11458 7895 8363 8796 8198 12159 9772 7827 3842 4118 2237 3626 12055 18350 10911 6373 5734 17102
11442 17102 17506 15023 13401 5811 5065 10874 15521 15853 13411 10339 7897 9996 8723 10523 13742
11427 13742 15488 14173 7580 10690 12310 8912 10148 15689 8800 8912 12103 12985 16156 9588 12345
11412 12345 15278 19846 26042 24882 20713 14588 5628 3945 11382 21347 18262 8656 8005 10574 18875
11397 18875 22051 17673 14539 19893 19744 17391 19907 19885 17582 15540 7379 13572 21276 18567 14052
11382 14052 14210 15343 12960 9285 13944 12924 9773 7087 5395 10522 7238 6430 12405 19401 17111
11367 17111 11695 13491 16520 11703 13112 18765 21738 15495 9758 11072 12911 16763 20670 20402 21292
11352 21292 24064 22175 19637 21432 24089 17902 9639 4611 5850 8547 11876 11440 14261 13597 16106
11337 16106 18936 19133 20722 15612 18874 25207 26039 26184 24617 22325 12379 10279 15470 17913 18471
11322 18471 17713 19665 21778 16388 11678 7364 11415 11809 7722 6933 11140 20324 23568 20384 17320
11307 17320 10547 10249 10878 5041 9362 15127 16519 20948 26051 20328 11443 12796 20211 21742 21733 23197
11291 23197 25170 24701 21971 19562 22726 20025 18449 21212 21597 15353 11621 10996 8045 9052 9993
11276 9993 5895 -763 6975 13728 8196 7359 12505 14253 11443 14691 16600 15666 19694 17599 18394
11261 18394 16803 15848 17313 15911 18892 24208 22815 19365 17938 23869 24533 18606 18381 17397 13005
11246 13005 9941 10284 16344 21604 25044 29606 28054 22763 20894 18622 10579 12046 17036 18446 18271
11231 18271 11607 14569 21554 18109 9911 12611 17432 16674 16966 17717 19468 25451 27652 24117 21270
11216 21270 22108 22789 26992 23162 20802 19893 22770 21460 16076 17239 22591 19349 22870 22458 17299
11201 17299 12339 22280 30162 22397 23219 25228 16222 16019 17156 16998 15762 17232 13718 20210 24840
11186 24840 21458 20158 19330 21475 25290 31885 27399 28997 27549 24251 30107 35697 33906 26953 18206
11171 18206 26756 29404 28205 28995 30990 31398 26524 23098 19742 21230 30802 28001 21938 21321 21134
11156 21134 15173 12373 15581 20188 16945 17552 18428 22856 19364 20643 17386 18999 19483 19821 21383
11141 21383 24404 26308 29456 25953 24256 24656 26127 28183 19460 12809 15967 11838 14811 17058 19170
11126 19170 24452 26179 25465 20488 20052 19950 11009 13684 17297 26350 25461 28766 32094 22877 20672
11111 20672 27415 30053 32926 29527 32118 34289 30114 33435 39206 41938 34277 26410 27642 31689
11097 31689 29888 29735 32416 28434 23874 30662 28758 22823 19004 27585 29576 29538 33097 35004 36533
11082 36533 27623 24313 22026 27394 33011 30681 29098 24908 23638 25561 28549 30433 29441 26091 25228
11067 25228 25876 22445 24523 33048 37153 39941 45433 42301 36549 30710 25812 20404 20020 18729 22277
11052 22277 24379 29053 26218 29425 34332 32747 28469 26509 29419 31090 30955 33944 31870 28938 32404
11037 32404 33775 32571 30173 33364 29530 26255 24377 15125 19819 23792 22674 23827 25817 27666
11023 27666 31084 35647 44350 46075 46878 47067 49598 46870 44068 42316 41836 41999 45087 41654 33833
11008 33833 38064 44440 48869 42509 36179 36925 33364 32599 34897 36176 34970 36362 36003 30770 27479
10993 27479 32612 41564 44312 42174 45051 46722 54935 55025 49192 42385 43838 43807 38014 32541 39626
10978 39626 45377 49428 50593 49907 49389 48465 48332 54021 59585 58588 51878 46205 47716 48195 45155 48675
10962 48675 56117 51209 44641 39384 36820 37340 45675 46806 36903 37561 41256 46882 43791 47056 46679
10947 46679 43836 42623 47948 48491 50718 59099 57940 48177 45378 45132 44499 43531 44553 47558 51071
10932 51071 56667 61582 61248 57777 68130 70098 70004 78214 89884 99213 114339 129500 148452 165077
10918 165077 177051 182780 181897 161389 133387 115356 106473 101834 93735 84231 76969 71668 71935 65410
10904 65410 55031 57589 60853 62736 55345 47623 48478 65664 72087 70591 71864 65004 63190 64051
10890 64051 67457 68197 76489 82244 84483 91706 93297 91565 89246 97413 96513 100558 117589 147390
10876 147390 177874 208898 230694 242369 245306 246095 236121 220228 202513 191058 178611 173075
10864 173075 160167 136782 125476 112557 97740 94667 97388 99769 100057 91117 91123 89587 83656 68503
10850 68503 63492 67518 70029 68122 68829 68015 65221 58423 55685 58218 66162 75218 80190 83097 85224
10835 85224 88851 90557 91677 98156 105570 118278 138265 163279 189767 210922 223792 221395 203932
10822 203932 181098 160912 144832 119443 106654 96374 82526 82589 81529 75636 73322 71677 71937
10809 71937 72675 65608 63052 59491 57164 56469 54042 57891 61426 61770 60015 62896 69110 79284 80460
10794 80460 75933 71320 76032 82825 78141 70791 65252 55155 57769 57383 64716 70814 72131 72724 76126
10779 76126 76825 73143 77981 81375 78946 72648 68183 74160 79785 81387 80182 83839 80777 77144 77694
10764 77694 79188 75670 75313 78410 85136 90609 88707 89945 92748 83768 79793 76980 75794 73981 76088
10749 76088 76807 75801 73308 65559 69034 70322 72044 78436 74845 70567 72712 69120 76846 79141 72767
10734 72767 73078 72599 76483 79733 71497 70782 76664 86941 91492 94675 92955 96534 99874 97214 98547
10719 98547 103793 105806 96881 100037 101866 105741 108605 106381 102132 103685 106143 111174 111410 108091 107079
10704 107079 103936 108431 111345 107325 103148 100116 103186 104854 110690 109859 104101 94616 96341 102888
10690 102888 107426 101558 98051 98995 91807 90199 93075 88972 80971 82571 85514 85684 89656 88202 85941
10675 85941 90627 98387 101717 100430 104056 112359 117870 124994 125090 123237 126540 125536 123000 125393 129420
10660 129420 128498 129047 125765 127257 127582 128238 129640 130015 127978 120047 118970 121469 122794 121730 121945 121264
10644 121264 122066 120923 115913 114403 118445 124557 131394 126085 119916 126000 139241 153859 166780 173675
10630 173675 185128 200052 202893 201009 195099 183805 183977 182603 171632 171845 167856 168041 161973 152187
10616 152187 150076 149304 148646 142408 133043 129377 131786 131335 140905 150684 156437 169158 184270 182604
10602 182604 189201 192817 194302 207427 223626 235762 246951 264753 277923 287245 294280 298136 289269
10589 289269 283716 289847 288903 292556 289253 276553 269854 280170 292088 310773 345003 399010 475943
10576 475943 591549 749329 963178 1214499 1480665 1724751 1891938 1936390 1853238 1661757
10566 1661757 1406843 1161332 942712 763482 631282 543325 489358 457834 433639 420093
10556 420093 409752 390000 380679 364837 350497 339672 332411 329967 323898 319628 323041 324661 319136
10543 319136 322448 325547 323982 319104 315650 309846 317326 332373 349054 361084 372977 391609 418127
10530 418127 449082 476681 509840 556429 619239 691176 775061 863215 974154 1112225 1268309
10519 1268309 1445204 1639825 1853751 2101165 2396317 2784978 3311308 4062833 5160427
10510 5160427 6763338 9020652 12002205 15566407 19248600 22345455 24153990 24250530
10502 24250530 22663677 19817406 16371533 12970948 10065456 7812644 6167998 5013810
10494 5013810 4213257 3653500 3256332 2959075 2728317 2531187 2366824 2232353 2120195
10485 2120195 2036168 1994816 2006836 2054491 2156109 2320592 2552957 2861240 3277380 3843490
10475 3843490 4576226 5429217 6296823 7064268 7615179 7969563 8287008 8830265 9900912
10466 9900912 11793386 14790836 19061713 24478964 30439177 35842073 39440241 40370256
10458 40370256 38581641 34883379 30543179 26731214 24083824 22476899 21303379 19865600
10450 19865600 17804507 15284423 12744772 10571231 8968868 7984352 7531722 7439214 7479273
10441 7479273 7374565 6912413 6112720 5189918 4337890 3659509 3165241 2831042 2619800
10432 2619800 2500885 2445246 2450641 2511184 2611476 2746678 2923610 3139011 3391138 3692024
10422 3692024 4092874 4657474 5477329 6688238 8480540 11041447 14517126 18850601 23601601
10413 23601601 27923887 30787814 31419650 29673078 26058851 21490421 16926890 12999649
10405 12999649 9951892 7719070 6123100 5007696 4214061 3627765 3171523 2798049 2472505
10396 2472505 2179095 1911612 1672691 1462952 1287194 1158939 1059711 975175 913525 855766
10386 855766 799669 754567 711425 671911 638942 608762 595004 582362 562275 537434 521009
10375 521009 495319 467994 448217 432706 422491 413561 401920 397594 393798 388759 382388 365394
10363 365394 351946 347006 335011 330117 320542 319792 328876 344226 346483 339147 330870 320721 314255
10350 314255 316148 318755 312542 310243 316022 317993 331772 342862 334099 315959 303948 296713 293416
10337 293416 285331 279362 272643 269249 261113 244062 229630 224283 227628 224927 222795 220506 218732 225904
10323 225904 234620 240271 254667 268629 277600 288862 297183 309168 314175 321190 329820 325745 325328
10310 325328 329661 338364 343064 340980 334388 314809 299579 290874 288513 295449 311308 334587 358720
10297 358720 381483 400760 419122 418868 418962 413385 407415 410989 419246 438672 453907 470805 493134
10284 493134 501331 504878 497825 451239 359011 242699 142630 85451 73635 82276 90095 91226
10272 91226 89030 93535 98510 103369 116056 137246 153255 166009 174112 173236 169407 166221 168625 176089
10258 176089 195605 208277 209811 216791 225437 237160 242802 249878 256092 264526 276055 294061 317233
10245 317233 338157 359097 380745 402948 415713 424939 430975 432413 434045 439513 442656 450802 459167
10232 459167 466327 468242 476383 482604 480138 473343 465608 470740 488793 510067 525505 538729 563633
10219 563633 584954 606541 640168 679385 726312 776370 820420 862774 885564 897130 912525
10208 912525 936515 967065 1005515 1051398 1098680 1156786 1218258 1283433 1350309 1412031 1476259
10197 1476259 1549004 1641885 1755017 1877719 1985230 2077930 2168847 2217319 2227305 2250746 2315719
10186 2315719 2412037 2516976 2657572 2843716 3064385 3329792 3625721 3953224 4352982 4866110
10176 4866110 5532060 6356565 7324027 8434413 9700629 11126530 12679691 14252174 15641530
10167 15641530 16764819 17924386 19568428 22075306 25778851 31047154 38291409 48285219
10159 48285219 62924830 85630437 121424905 176154382 253492098 347254206 427654133
10152 427654133 446415014 389114764 295479691 209549366 147220892 105855426 78897564
10145 78897564 60909278 48249153 38897753 31896458 26670716 22803656 20005148 18080149
10137 18080149 16795305 15743797 14481925 12933761 11339101 9918516 8725891 7758932
10129 7758932 6999444 6385236 5835471 5332642 4894287 4534345 4241754 3997534 3787789
10120 3787789 3605994 3433616 3260257 3071960 2876030 2672485 2476841 2295747 2137603
10111 2137603 2011694 1915249 1836818 1750048 1662875 1579822 1493622 1418907 1355036 1308487 1267061
10100 1267061 1225258 1186516 1169435 1154971 1121678 1081411 1022411 967258 928121 917978 920899
10089 920899 938809 958500 969610 971261 966924 952806 926999 899351 869067 848655 825285 795317
10077 795317 760285 727861 701004 678169 664560 651377 634927 627798 632536 625555 602037 573628
10065 573628 540010 508137 485095 472636 459538 456201 461633 462145 466525 472124 475209 481915 484767
10052 484767 485319 482739 479749 485909 498774 520539 538655 562515 580705 593341 606936 611226 614383
10039 614383 605026 596973 588690 590710 600996 622766 656949 694049 735416 780685 833616 878394
10027 878394 890989 853547 767553 648166 519423 419538 351900 308896 274825 244367 228384
10016 228384 214771 199897 189767 179896 173259 172189 162356 148284 129383 117655 121869 138930
10004 138930 149841 158325 162502 160923 155889 144567 140329 157278 177904 202349 216295 222565 224268
9991 224268 223245 208369 197644 189252 171840 158064 157558 164039 170201 168570 171652 178674 187506 188022
9977 188022 188494 193051 199021 199800 190725 181835 165787 156931 144443 136352 131808 122638 112412 88585
9963 88585 72575 66457 61683 55759 57807 63032 61840 62395 60148 54296 50104 43165 35320 30222 34222
9948 34222 46347 61533 74605 75189 67832 58778 50794 43537 39826 38410 34665 38613 41773 41135
9934 41135 51448 54946 58451 64274 66079 64389 70724 75682 84940 88856 92766 90748 87060 79552
9920 79552 71134 64641 68189 73320 78106 81525 84638 81358 83413 84505 88736 94960 93492 87940 95569
9905 95569 99875 96696 98513 98601 103504 106055 102729 108297 105314 103469 106343 106551 108777 108514 103904 100778
9889 100778 89678 92899 95651 99656 99557 102360 107310 109129 107690 104218 108422 120527 132536 134264
9875 134264 132238 128880 125544 125691 112859 103430 102100 112986 117635 115813 116121 111291 107447 105712
9861 105712 98414 93498 85345 82717 78324 85287 89967 91858 101776 116597 132764 153416 169614
9848 169614 170722 155131 143992 142620 156022 178476 188855 198856 212792 233601 271468 319510
9836 319510 395050 495636 654356 935033 1420919 2235806 3502288 5031551 6016483 5628056
9826 5628056 4214230 2744469 1751678 1179029 850110 645577 507667 417289 364617 326764
9816 326764 287913 251514 231970 219575 203489 195746 195157 194879 195962 190511 193646 192770 183795 177160
9802 177160 175339 176621 174070 173738 172105 174142 177007 181644 187325 187117 185213 185870 190621 198504 201342
9787 201342 206693 224888 247284 268231 294193 326965 357828 385071 414336 448172 488316 538710
9775 538710 594594 655059 723376 810552 910540 1039893 1229222 1497268 1869814 2403608 3149725
9764 3149725 4159197 5399611 6663011 7612229 8068349 8023107 7423400 6322831 5067426
9755 5067426 3983807 3153345 2549111 2112259 1808291 1588172 1431967 1327470 1270034 1232509
9745 1232509 1218610 1222756 1247759 1277273 1322079 1376596 1457535 1581149 1763723 2012825 2353072
9734 2353072 2802801 3369117 4014233 4659730 5159903 5460610 5675373 5950142 6453406 7388067
9724 7388067 8965642 11373029 14639103 18311710 21236441 22395221 21744604 19851211
9716 19851211 17692725 16170960 15519839 15322184 14908460 13832522 12069874 9992497 8064214
9707 8064214 6553590 5477720 4757305 4306171 4045927 3942996 3911842 3835899 3628089 3367546
9697 3367546 3163394 3063069 3087811 3240967 3536003 3980580 4550242 5079838 5315874 5260164
9687 5260164 5190673 5345522 5838381 6745967 8196382 10331870 13166429 16341151 18800603
9678 18800603 19619871 19205607 18689208 19003561 20547724 23049402 25590142 27200650 27275779
9669 27275779 25481420 22235278 18564783 15162828 12276242 10008586 8378731 7306514
9661 7306514 6692870 6371147 6046459 5487258 4776302 4135322 3660709 3349884 3163666 3097099
9651 3097099 3128575 3242889 3360532 3371765 3269556 3160767 3149461 3267404 3521277 3929162
9641 3929162 4528556 5307043 6148351 6807432 7152433 7428886 8017819 9146123 10871099
9632 10871099 13088140 15566332 18020169 20015000 20803787 20073180 18267088 15750146
9624 15750146 12819500 10046505 7851938 6287403 5240790 4552953 4049064 3566389 3075492
9615 3075492 2632306 2279677 2004115 1788871 1622344 1476379 1347424 1243376 1159441 1090465
9605 1090465 1052631 1028167 1004086 977415 971328 985514 1011867 1048393 1098634 1180798 1304601
9594 1304601 1485245 1748196 2121171 2642586 3342333 4215902 5122290 5786203 6080046 6021726
9584 6021726 5581921 4752890 3759353 2874131 2200648 1718185 1387152 1151106 986256 864366
9574 864366 766505 692078 633847 591925 551699 521300 495550 481948 480960 507587 553248 559542
9562 559542 517503 474125 438216 405380 376120 353003 333747 305078 287348 283668 280278 288051
9550 288051 307433 334630 359018 376879 398591 432831 451742 441959 419248 401054 383681 365020
9538 365020 345839 335950 322603 314976 313952 313933 300779 274712 262315 266194 285550 320127 378810
9525 378810 460214 569917 716445 870283 942998 845657 672060 521613 418288 356908
9515 356908 311966 279103 270203 265582 271264 289558 302729 312652 308145 302722 322136 346051 356132
9502 356132 363618 382224 388619 387312 375574 343144 309138 275283 238364 201599 172585 152692
9490 152692 144780 145724 156285 165777 182636 199019 211448 230011 250793 280003 318218 336457
9478 336457 293566 234599 185648 159106 142859 126103 121111 117252 120029 125906 129746 126097 126803
9465 126803 111731 108857 102837 95230 93009 92559 84215 79290 77930 73197 78526 84337 79693 79457 71777
9450 71777 71372 78656 71045 65316 60861 65822 68769 71821 76936 75820 77605 75200 80637 81567 87173
9435 87173 90152 88714 83782 81117 78618 75053 67669 71568 69841 69902 65607 57806 59301 64774 66144
9420 66144 67212 73653 81673 84403 94497 103409 98809 91577 86465 86350 85412 84331 88943 85183 81638
9405 81638 75138 65321 64863 63185 66351 76462 74471 68983 65253 65227 68674 70215 69648 71200 76375
9390 76375 78857 76824 72756 69705 70023 74825 74356 76227 79495 78446 79189 80469 79474 73912 70291 73993
9374 73993 80964 85391 90064 86739 76701 76328 77978 78578 79339 78857 83277 84241 88054 84079 89138 95626
9358 95626 106296 119397 122827 118810 121693 117927 107389 100765 99863 103391 103325 99491 98157 95356 89218
9343 89218 92979 94607 93800 99293 99294 99845 100520 100946 98562 105327 116669 124715 129619 127450 126305 123020
9327 123020 117248 115456 109923 112991 114812 120475 139485 148042 163166 178429 195014 208764 212428
9314 212428 206581 191682 182124 183485 188553 186487 183318 176474 167746 156890 158263 161211 158601 160906
9300 160906 164459 167018 174467 186384 185890 183767 179138 172744 161989 156230 153107 147641 141400 146312
9286 146312 151171 154391 160401 163385 161714 158351 161521 179705 189295 199066 227226 246894 251677 250101
9272 250101 256868 263066 274557 295774 308356 305945 305567 305301 302695 286443 267706 249194 240506
9259 240506 239559 238295 237159 237514 234284 226473 217305 206717 209724 208128 196610 185342 178079 172215
9245 172215 164393 162807 163426 163235 163467 168589 181056 195164 207870 217513 222851 232059 239248 245854
9231 245854 258709 267822 284284 294845 300663 310365 316569 323310 316635 299926 281780 260590 243904
9218 243904 233650 225247 229193 238409 236562 230990 231667 229177 218069 203550 201416 200885 194488 194162
9204 194162 198498 198688 194605 198031 199967 200766 204733 212684 213248 217073 228296 235951 235058 233530 234497
9189 234497 233613 232528 234512 232495 231682 238681 245690 248488 249165 242067 242431 246956 244889 239332 240107 230185
9173 230185 229298 231633 233128 230967 224744 221905 221745 226145 220137 219214 215461 214068 220258 226006 223895
9158 223895 220842 219539 224404 228096 228942 230401 234243 237184 245045 243955 244256 253377 256618 260363 256644
9143 256644 256621 260799 260332 259241 268004 271768 268580 270112 269920 268907 276776 280724 281017 281584 284346 284180
9127 284180 286577 291679 290954 283929 280734 284925 283730 288971 298089 304228 302834 309393 314002 317802 311950
9112 311950 314827 313056 311666 319931 323035 326934 336039 334070 332829 332881 340947 341787 343254 339190 341058
9097 341058 353068 352392 351968 358586 364641 364867 370248 374154 373831 375711 379253 381897 381230 385302 390678
9082 390678 398372 396495 397542 400542 400694 398047 407503 412000 410363 417589 426040 432243 432398 433454 442221
9067 442221 440505 433807 441627 447548 445006 451840 463740 469557 470832 480349 483942 489875 491869 488369
9053 488369 492223 501463 500694 499367 505855 511678 518224 522750 530756 534859 538103 541216 546447 547041 547369
9038 547369 552641 561750 567215 573672 583141 582435 584192 596581 605534 614358 626464 638479 644577 646276
9024 646276 642514 652559 661497 667420 674012 686183 689226 694086 706446 715829 724573 733143 741582 749136
9010 749136 757919 759556 768806 781853 788945 794367 799671 804842 820160 833774 845177 852603 858143
8997 858143 868521 882796 889754 896758 904920 919492 927167 934274 944723 957962 979378 989992 1004505
8984 1004505 1022020 1034604 1045698 1057233 1072147 1076578 1081630 1098066 1114760 1133545 1148010 1163118
8972 1163118 1178208 1185178 1200738 1224386 1237612 1251289 1269134 1293531 1316710 1334370 1351921 1370583
8960 1370583 1393657 1413222 1438088 1453837 1466597 1489306 1508761 1527128 1555954 1589565 1611089
8949 1611089 1635177 1668451 1706360 1733624 1754848 1785930 1812797 1833549 1867399 1910525 1946513
8938 1946513 1975296 2003008 2041249 2076691 2110235 2145910 2183028 2222626 2258558 2297966 2339506
8927 2339506 2384739 2424144 2462506 2504189 2543134 2593508 2649051 2701300 2753024 2811111 2866438
8916 2866438 2918700 2972685 3033878 3099342 3158671 3222126 3293051 3354683 3413182 3477677 3549483
8905 3549483 3627956 3702299 3785675 3871901 3951138 4031868 4113301 4200518 4288075 4374895 4463953
8894 4463953 4559252 4654024 4751203 4857093 4957066 5061695 5177009 5295855 5409679 5527023
8884 5527023 5643275 5754325 5868057 5987539 6114723 6250125 6380549 6518437 6656145 6797646
8874 6797646 6936416 7077338 7220315 7370520 7515719 7659871 7806376 7964411 8138876 8335545
8864 8335545 8575045 8877554 9291639 9868716 10642762 11537745 12105892 11877772 11187252 10565055
8854 10565055 10167304 9934247 9807310 9752156 9725969 9724102 9726962 9737931 9742968 9743921 9730188 9706909
8842 9706909 9685149 9658129 9627448 9575522 9512606 9455214 9399271 9330799 9254887 9166767 9076080
8831 9076080 8987961 8890614 8794211 8695748 8581318 8468915 8352307 8232527 8109760 7986424
8821 7986424 7864221 7737773 7602115 7472809 7345224 7204563 7070123 6941451 6808180 6679872
8811 6679872 6558690 6433444 6310080 6187032 6057321 5933268 5813840 5696430 5581296 5476256
8801 5476256 5363681 5255349 5143506 5030399 4926447 4828096 4722994 4624765 4531462 4440372
8791 4440372 4351839 4262418 4176636 4090940 4005035 3917385 3842705 3769834 3692610 3615179 3539549
8780 3539549 3474374 3406600 3334652 3267873 3206878 3143430 3084780 3027283 2969358 2913616 2858241
8769 2858241 2799900 2746484 2693789 2641958 2593381 2548175 2498585 2450016 2406476 2365070 2326993
8758 2326993 2291152 2248897 2209712 2167240 2122818 2091058 2054413 2017476 1979612 1948028 1920608
8747 1920608 1888828 1866282 1835542 1796843 1763659 1735767 1710714 1684077 1659539 1628927 1607619
8736 1607619 1588248 1561837 1538110 1520350 1497995 1475197 1447451 1424744 1404985 1387246 1353826
8725 1353826 1329794 1310728 1292672 1277328 1259086 1240703 1227601 1216077 1194051 1178045 1159193
8714 1159193 1146946 1133103 1122253 1105810 1090182 1068775 1051483 1039879 1030787 1014061 996221 984640
8702 984640 970687 957170 944609 930081 921686 909890 896036 888014 883620 873106 859109 844951
8690 844951 835209 819625 806365 790513 785406 782125 776466 764734 757536 745940 738643 735408 723498
8677 723498 709622 699439 695945 688029 678178 669580 664205 656933 644952 639553 634865 629432 623836 621002
8663 621002 610905 609729 600417 592371 581792 578612 573752 563756 557454 554349 555491 553347 550953 538281
8649 538281 529566 532233 535473 531087 530021 530452 522644 520376 522165 522177 527075 530946 537150 554516 585279
8634 585279 633044 712081 851832 1096890 1464763 1887614 2014262 1668132 1238137 936457
8624 936457 751871 648577 582547 538083 508295 490705 474966 457044 446462 440855 435771 422399
8612 422399 414637 404612 399673 401226 395855 389037 384688 385172 386429 390808 391225 390982 387588 393713 402315
8597 402315 413991 423698 431324 444523 459662 483821 516628 584533 672392 810933 1061953 1487928
8585 1487928 2144913 3031479 3501620 2938842 2057024 1419708 1034877 805305 667025 579933
8575 579933 523736 491474 468432 441704 413265 386989 368152 354095 347327 337282 328779 322908
8563 322908 315244 308875 301980 297684 299253 299280 286440 278390 278784 281045 285967 286574 300713 307197 303919
8548 303919 302915 306984 319937 347205 382700 442232 549541 737019 1021851 1407280 1722524
8537 1722524 1583330 1165395 815923 598348 478404 408271 371542 355184 354779 356455 334515
8526 334515 295878 268441 255783 248688 244241 234761 223603 210534 200716 202330 200757 199055 203468
8513 203468 201218 199825 196399 195295 196155 197774 205066 216462 223409 214107 200525 190756 182825 182510
8499 182510 181915 180375 177628 170877 168339 163189 160126 159799 162557 157730 158174 163148 171545 179742 189347
8484 189347 196737 199517 191669 178209 163592 153324 158096 155928 155709 157148 150122 144709 141172 143384
8470 143384 148741 153419 162506 171971 173554 166021 156700 154791 149303 138712 135241 135326 137392 136410 138378
8455 138378 143317 139900 136632 130837 125621 123595 128308 122591 125684 120455 115552 112104 107391 110561
8441 110561 118411 122707 120029 120074 118996 122950 121458 114778 116248 116248 114120 112905 111460 109430 110701 109429
8425 109429 110618 118479 121059 116910 106665 100236 105707 102763 102525 100954 101177 101450 99619 99230 96802
8410 96802 101792 99437 99018 98509 100645 99845 100886 103330 98327 99245 108934 107605 100981 89737 79636
8395 79636 86526 93715 93210 88079 84015 88109 93723 90318 86487 84949 90039 91440 88954 91533 91609
8380 91609 89074 86002 85702 84315 78563 78479 82781 86609 90290 94114 89229 86137 82435 82560 81812 75782
8364 75782 71833 75582 82221 80811 77782 78663 77506 70814 71341 73372 75747 72477 73848 70154 67117
8349 67117 61839 57923 63844 73080 72196 70427 73734 70678 67242 66641 72079 72599 72752 74076 71169 68140
8333 68140 66462 69018 73889 70667 66215 65159 61392 63404 57315 55565 57384 52681 56393 49846 47159
8318 47159 54253 67426 68043 64418 61038 55408 53612 59944 61064 63311 60705 56818 61175 56580 49093
8303 49093 47055 48827 52081 49507 52735 61793 61639 52993 54677 48830 50557 59579 63671 59207 55424
8288 55424 54002 52487 54228 54582 54448 52524 51012 51567 51235 47699 41013 43956 49122 47839 48287 49511
8272 49511 49581 51676 52507 58444 54003 45449 45695 48367 48875 48521 47524 46574 46071 47104 46019 44711 46622
8255 46622 48221 46953 46551 47887 49704 44726 49527 49229 49019 48006 42094 40073 31745 35137 43133
8240 43133 52158 57333 49075 40922 37387 42573 41600 44416 48416 47181 41343 36221 32778 35022 40718
8225 40718 44270 46422 49156 52899 43491 35476 31041 35200 36673 34785 37058 43505 40252 35659 34686
8210 34686 34952 37558 38385 39505 41757 44701 43790 38531 35630 28935 33542 39593 40921 43227 42400 37630
8194 37630 37573 35636 34507 39575 38004 38265 43979 40566 31587 27967 28180 29497 38251 47858 52273 52707
8178 52707 55468 48141 36022 37263 36833 35665 31710 26953 28971 26355 26025 24439 26661 28968 24673
8163 24673 27350 26421 24198 28793 31105 25348 26631 26848 25116 23037 25576 33493 38221 32649 24895
8148 24895 22865 27026 27938 25494 22252 16434 18293 22994 29532 29441 24162 26743 24691 30137 39721
8133 39721 36123 28934 29979 28687 27615 32754 31700 32491 40513 36326 40901 40738 37590 34971 25503
8118 25503 17094 17224 22549 22274 23566 29046 32218 32411 29553 20638 15874 18511 20451 21046 17164 9047
8102 9047 11824 18605 21559 23133 21135 29181 25637 15468 14576 18670 20087 24974 29101 24134 23207
8087 23207 18171 15022 19158 25339 24512 25692 24375 23343 20796 21026 26630 25516 24824 27083 26205 20980
8071 20980 28561 26049 22697 21597 24810 26719 27627 31277 28897 31125 35313 35767 33051 33472 28317
8056 28317 28092 26925 25599 20960 24539 23277 21318 17641 11106 8222 6538 7376 9207 7863 7261
8041 7261 12753 17672 12682 9750 9390 10648 15790 20837 20594 26322 33003 39632 33550 29493 28693 25973
8025 25973 17627 17233 20098 19976 18410 26568 23840 23630 23094 24769 26846 31338 28676 25024 24675 27755
8009 27755 24818 23944 26151 23156 21108 15840 10874 3751 7142 16416 15715 17079 22635 24803 36707
7994 36707 33280 29032 27910 27307 31041 24813 26365 33290 35456 29207 22768 23633 24406 19639 18113
7979 18113 14659 23437 28680 27559 19316 21609 22667 22594 20557 16028 17192 19633 16062 13047 17476
7964 17476 20273 19151 17889 15447 22185 23612 15186 10957 8900 14738 18797 18761 19468 22132 27304
7949 27304 32697 26430 25552 31475 32635 32801 33219 28311 33330 34285 20918 22988 25161 22460 17773
7934 17773 16674 18865 21678 20383 27110 25663 20866 18204 17428 16788 18856 21709 16850 14472 12007
7919 12007 15634 15224 16482 19944 23342 21051 15301 13425 12770 18458 17491 19133 15574 14175 20746
7904 20746 25705 26372 26326 24951 25267 23311 13880 8119 4672 9173 12392 12343 12776 16928 17020 22260 21354
7887 21354 14371 12123 12918 16339 18932 27274 35070 29681 21485 20326 17793 16450 12557 13094 12366
7872 12366 8904 9123 8516 5820 11665 11221 6235 6160 9254 6058 3114 4930 7827 8227 1522 -94
7856 -94 -691 -675 749 -4763 -5627 1185 7091 14905 10524 9401 11408 6201 2664 3523 3993 4651 4463
7839 4463 2598 11433 11102 6989 -280 -7927 -5224 -1794 -6790 -6431 3241 7004 4877 3284 2956 6007
7823 6007 6069 1403 7130 8530 9393 14746 11035 3074 -2934 2979 4836 2472 2854 6222 9858 8698
7807 8698 2677 6334 3265 912 2854 7026 8779 10088 8201 11456 13302 8352 6712 6402 4181
7792 4181 6674 5096 4988 3186 -379 1066 1485 2213 7392 4254 1443 3104 5901 3947 7559 6035
7776 6035 10872 13385 15168 16799 9127 6919 7493 7488 -1397 -4649 -236 -1500 -1141 1555 1787 -1101
7760 -1101 -4 1379 1031 1541 -1913 -1791 -2277 -5021 -2252 1881 6458 4410 1875 6308 9253 2851
7744 2851 3900 9451 12222 14765 10042 14697 11741 4387 5503 9283 7848 6383 7273 3270 -2333
7729 -2333 -1457 2790 4471 5762 6517 1570 -5037 -1308 -2037 -6146 -4733 -3433 -10026 -12370 -9680 -5371
7713 -5371 -910 3305 1725 1819 2540 8406 9986 12277 20993 20541 5697 -2222 385 7896 2050 -6718
7697 -6718 -4547 -3702 -996 1689 -6166 -9070 -8455 -7704 -1698 504 -2158 918 2931 -1234 -6640 -7522
7681 -7522 -7361 -11269 -10996 -6810 342 9179 13854 7440 2783 -2472 999 7445 7640 8979 13966 13824
7665 13824 5435 -2577 686 8454 12969 13295 11538 2268 -1071 677 3340 -1125 6321 14590 11732
7650 11732 16901 17728 11006 7103 7947 6906 8936 15170 9772 5159 9354 8935 1655 -2437 -5679
7635 -5679 -11140 -7317 -337 357 -2210 -4514 -3464 -3109 -110 3437 552 -3455 -5529 -7565 -6409
7620 -6409 -5157 -2995 1315 -3341 -4955 -9000 -10529 -6799 -941 -1574 1433 1775 -1434 -4329 -4119 -1083
7604 -1083 -1274 8564 13727 6917 5115 9764 8893 5816 7398 8367 2362 2099 4742 9869 11402 13265
7588 13265 16587 8672 4018 5211 4524 -649 864 2167 3593 2923 8722 12637 12731 16366 16631 18010
7572 18010 14395 6039 3766 7537 9448 857 -4100 57 442 2691 4045 2394 502 629 1582
7557 1582 -681 -4547 -9014 -9074 -6019 -4099 -9833 -8694 1889 6601 5028 737 -602 -1542 -4927
7542 -4927 -5596 454 -592 2814 -686 -3298 -2166 3208 9595 12347 16652 15583 8244 3640 2010
7527 2010 -599 -3979 -4299 -3997 1269 6511 5796 953 5334 9837 12904 6464 571 4360 4584 2369
7511 2369 -667 -8764 -4220 -5444 2722 7469 4074 969 2680 2599 -974 -1125 -2208 -6286 -5816 -4651
7495 -4651 -4025 -3720 -5554 -4846 -8824 -9960 -8438 -1014 -1527 -3677 901 8933 6240 -13 -2326 -7136
7479 -7136 -8499 -12096 -8186 -6964 -10716 -5356 -3315 -2786 4399 5498 1145 1825 -1193 277 707 5170
7463 5170 3336 -416 -7794 -6511 4109 6360 8930 5902 -3607 -8189 -4686 -5015 -6571 -3088 -6845
7448 -6845 -5363 -9721 -9739 -9522 -5046 4272 9697 11372 15424 18688 12380 7950 9546 8758 10622 13808
7432 13808 9168 1962 -2652 -2185 -958 -12381 -13380 -7194 -7371 -7282 -6598 -526 1550 -5610 -7370 -7262
7416 -7262 -4510 -3562 -7780 -4671 4575 5425 11049 14562 8924 3958 10577 12060 11544 13496 10887 7382
7400 7382 9731 9312 4605 -2264 -693 4703 2608 681 -6515 -12416 -13408 -9264 -5555 1058 3932
7385 3932 4144 4511 8200 3328 -1811 -132 5647 10952 14167 16094 13509 5362 4239 4466 3067 4522
7369 4522 -2861 -12076 -11878 -8311 -8320 -6474 -5508 -4317 3793 2061 2741 4218 1003 -5595 -10190 -13376
7353 -13376 -6630 450 7300 2315 -1579 -4082 -2689 -1291 -610 -1394 -2822 -3753 -4496 -5437 -3778 -758
7337 -758 5689 8290 8569 5912 -1375 -583 2736 3002 4381 6773 -306 949 9438 8742 2503 -5367
7321 -5367 -5600 879 2030 3752 3498 1986 2115 -1893 -365 1679 274 608 1213 -4051 -5349 -5355 -2262
7304 -2262 -3170 -9952 -14626 -12975 -14513 -17761 -13645 -8207 -5725 -5448 -4711 -1854 -3029 -4642 -1354 -7187
7288 -7187 -13228 -12947 -10853 -11456 -16223 -17339 -12856 -9668 -12138 -16880 -17215 -14640 -16790 -12028 -2697 1290
7272 1290 2470 6014 4997 -4976 -8003 -6608 -3182 -3774 -8244 -6435 -9452 -12974 -9783 -7396 -301
7257 -301 5637 9031 3204 -740 -3873 -5742 -7412 -5306 -5821 -11967 -12403 -9438 -1746 7699 4910 -839
7241 -839 -5479 1937 5434 5933 3245 1944 995 67 200 1289 -4863 -4065 3803 -1934 -6737 1462
7225 1462 1361 -4481 -7118 6029 5861 -4894 -11784 -9881 -4078 -1770 -1311 6387 12987 9687 7821
7210 7821 9189 7461 808 -596 8307 14415 11306 3747 -3150 -6999 -6616 1280 1978 5757 6981
7195 6981 8250 7203 2063 3166 1395 1229 -1067 -1825 1057 707 -1870 -6014 1 5788 -1038 -5849
7179 -5849 -10373 -8080 -5496 1472 -70 -4515 -5474 -10259 -11207 -8670 -4803 -4069 -4316 -4572 -8774 -10350
7163 -10350 -4074 741 -289 825 43 -2123 52 1986 5370 9323 11761 5851 -216 1664 -184
7148 -184 -2045 -389 -1368 -2986 -7689 -9729 -1728 -2224 -1704 3167 -527 -4600 -4196 -3861 -4367 39 -1969
7131 -1969 -135 -488 -5160 -725 1163 3526 744 1477 -612 -1756 -11109 -1616 1360 -1651 -6828
7116 -6828 -7532 -3412 -2029 4053 2127 -382 -1618 -7632 -7482 -5933 -4792 -5070 -2261 413 -1841 939
7100 939 5105 4086 -1993 3868 10044 6135 3849 -687 -2486 -965 5695 4684 -1587 -3563 -3531 795
7084 795 1428 -3235 -820 800 -2467 -976 -4022 -6308 -12563 -14814 -14161 -10711 -11257 -13138 -11190 -11403
7068 -11403 1532 3781 4749 -2142 -9263 -11716 -3301 3049 533 -3677 -3986 -3417 -8478 -15166 -12252
7053 -12252 -7564 -10505 -14759 -10981 -3103 3743 3128 293 973 4843 4540 -5000 -10085 -8731 -4433
7038 -4433 -1337 17 -1475 -9924 -16148 -10020 -1929 -6942 -10493 -15739 -12806 -12236 -10951 -9434 -8109
7023 -8109 -630 -345 6821 7807 4498 5520 3906 3747 880 -2367 -1748 -10796 -14157 -15113 -19587 -17704
7007 -17704 -10797 -5470 -11739 -15581 -9297 -2916 -3987 -10749 -13324 -12336 -10267 -7668 -8825 -11042 -5568
6992 -5568 -5641 -4756 -2195 260 3589 7410 11096 583 -7447 -14941 -14185 -7161 -5211 -5030 -6155 -5342
6976 -5342 -14548 -14042 -18104 -20343 -15685 -6336 -4209 -8488 -8715 -8758 -3805 -3260 -5717 -8779 -6489 -2523
6960 -2523 -3147 1620 10549 14204 10618 8918 3092 -3365 -1842 -7683 -15281 -16978 -16779 -14617 -6045
6945 -6045 -9307 -2813 -2364 -2142 2052 10679 8631 2366 -807 -1168 435 -2278 -6521 -6469 -5760 -12860
6929 -12860 -18684 -12579 -6648 -6329 -7847 -14266 -13360 -10423 -8546 -8850 -9287 -8522 -2477 3586 1823 -1639
6913 -1639 -705 -5181 -6138 -4281 -7323 -3283 -4272 -3549 -2596 -1108 4949 2769 -9964 -12601 -11657 -10457
6897 -10457 -13945 -12162 -9695 720 13248 11192 8384 1589 -2969 -11660 -10153 -8921 -2738 1028
6883 1028 -2404 -5988 -12689 -13259 -7234 -5039 -5760 -8570 -9419 -4541 -4397 -8551 -9311 -4834 -3762 -7119
6867 -7119 -8089 -5614 -1964 663 5259 5704 -5969 -8222 -9851 -5217 490 1177 4384 4366 3516 6249
6851 6249 5094 13 -5493 -4363 2082 7502 10065 2085 2192 428 -4178 -3624 -895 2524 277
6836 277 3876 3798 2684 -2056 -6200 -4227 -1676 -1061 1133 -5253 3526 5288 2949 1398 37 424
6820 424 -1154 -2402 456 741 459 -6779 -5822 -1341 -4723 -1175 -1033 2069 5381 9351 13941 12441
6804 12441 9298 13799 6977 3007 3616 1695 -1184 -8490 -6206 -3424 -8470 -4216 2052 -1320 -89
6789 -89 -4239 -6816 -3380 -11772 -14341 -10974 -9715 -8613 -8215 -2213 -48 -4699 -2615 -6466 -12241 -17358
6773 -17358 -22521 -16813 -13290 -10179 -12782 -11756 -11533 -10928 -7122 -8330 -5186 -1102 4655 2982 3829
6758 3829 3946 7679 1083 -3117 -5163 -4439 -1570 -4618 -6825 -10979 -9002 -7474 1312 7825 11707
6743 11707 9867 2684 2659 6754 9642 5114 7911 7869 1926 -1021 824 4602 -5178 -16178 -9843
6728 -9843 1850 4403 4073 6414 1652 -113 3873 3095 -1712 1206 2624 -2480 -1444 -1170 2417
6713 2417 9940 13390 23484 21628 20516 19703 19936 21585 17959 15310 9710 7505 5538 4347 530
6698 530 -3329 -9451 -11704 -9324 -1270 8288 14519 9393 5353 69 -3400 -8579 -12480 -9068 -2788
6683 -2788 4114 4472 -59 -5352 -9537 -7314 -5641 -7726 -5603 -4518 -1093 805 -3415 -7028 1825
6668 1825 4096 -677 -1206 -2600 -4491 -1688 4232 7578 1295 -1691 -4311 -487 82 -3807 -10431
6653 -10431 -14433 -14847 -5757 -10828 -7839 1234 3134 513 2632 -662 -1597 -1586 -916 -3165 -4794 -4234
6637 -4234 -637 -4383 -16210 -20581 -18431 -18685 -17391 -15149 -8394 2921 714 7726 5384 5858 1133
6622 1133 -217 720 -2080 -3725 -2692 -3126 -5494 -3153 -5299 -9136 -11538 -17042 -11734 -1274 -2740
6607 -2740 -3638 -8311 -10503 -10052 -10543 -8964 -7714 513 -979 -7313 -3541 2996 10854 30632 62095
6592 62095 95672 84465 49510 23023 13693 9404 4850 3286 3294 -57 -1991 926 1367 -5516 -3919
6577 -3919 -252 1623 -2386 -3629 -3953 -4934 254 438 1021 709 972 -1375 921 909 335 -3662 -6053
6560 -6053 -3847 -6507 -4903 -4309 -6152 -9896 -9272 -829 1877 -1128 -4597 -11141 -7267 -5558 -9676
6545 -9676 -10505 -1927 -291 2275 2668 -2465 304 2379 973 -3782 -1540 -4604 3946 4856 2233 5269
6529 5269 2611 -3998 -201 -2235 -8577 -4683 -7348 -10385 -15340 -16426 -3977 5113 3156 -3663 -7433
6514 -7433 -9188 -8230 -8111 -5339 -4255 -4757 -4396 330 4856 3277 3483 -5533 -7991 -7727 -2729 -6814
6498 -6814 -11166 -7615 -5969 -274 3786 5733 4469 -1455 -6665 -4278 -5831 -4069 -5235 -5539 -7378
6483 -7378 -5977 -10549 -6734 16 1245 -907 -3851 1906 4827 4027 -1410 -9694 -7042 -713 2835
6468 2835 3037 -869 -1201 6440 4173 4205 -1316 1766 212 -4638 -542 -3890 -1482 1522 -542 4012
6452 4012 3697 -774 717 -2763 -12660 -14563 -10280 -2425 -6996 -7122 -10133 -11936 -15982 -19596 -15590
6437 -15590 -10290 -10610 -7582 -10425 -14855 -12227 -8750 -4745 2113 1790 -2718 -163 941 666 -279 -5614
6421 -5614 -6165 149 -5522 -5650 36 -6253 -14413 -15251 -13386 -9723 -8148 -4852 2840 2460 -4323 -11564
6405 -11564 -11263 -8515 -3142 4000 5225 -1983 1523 -1132 -3565 -7326 -13944 -20055 -9581 2188
6391 2188 7029 6735 6209 419 -6743 -5059 -7455 -10999 -9295 -7173 -5314 3761 3815 1056 -7714 -7739
6375 -7739 3553 3867 787 -4740 -7452 -3649 -4786 -3625 3496 5763 8224 3510 -3105 -5107 -4890
6360 -4890 -8556 -14695 -11907 -7020 -8002 -6206 -10722 -13074 -4972 4007 5509 -193 -1677 -442 -5326
6345 -5326 -12235 -9652 -5557 -7945 -13949 -12675 -8102 -11523 -15679 -7627 -9038 -10297 -10587 -14231 -11101
6330 -11101 -8316 -6039 -7032 -12402 -8396 -1594 -5209 -10909 -6629 -6049 -2130 794 -1339 -847 1032
6315 1032 564 -594 -4985 -3999 -5963 -6167 -7275 -5348 -1957 1502 3485 -791 -2388 -7470 -9208 -5962
6299 -5962 -6060 -2752 901 -3034 -5986 -4982 -7339 1669 -2825 -6860 -5501 -4973 -4677 -11601 -10460 -4576
6283 -4576 -7410 -8688 -12455 -10940 -9723 -12117 -8938 -4939 -9256 -9892 -2434 734 -4546 -6416 -8576
6268 -8576 -10955 -12166 -9069 -6787 -7307 -14118 -18513 -12067 -11133 -12883 -11239 -12219 -15973 -9241 -3822 -7106
6252 -7106 -6051 -5965 -5626 -8693 -9100 -8682 -4529 -6950 -3281 1048 1837 461 -4913 -6989 -7255 343 6473
6235 6473 219 -3063 -6159 -3774 -3286 -11749 -8909 -1595 -5255 -5590 -6730 -12282 -16885 -8878 -9476 -10152
6219 -10152 -13234 -7932 -9708 -13536 -15533 -11187 -8542 -13129 -17036 -8864 -5691 2771 10540 1683 -8090
6204 -8090 -14432 -15853 -13939 -7919 -7182 -5852 -4047 -918 1319 -2384 -7580 -7155 -11451 -12440 -7619 -2832
6188 -2832 -7078 -13919 -9109 -1324 -712 -1910 1808 3543 -1300 -2678 4300 5837 3999 2148 -1707
6173 -1707 368 -1218 4364 -2626 -5680 -8069 -5998 -10709 -10600 -12409 -2667 3187 4620 2271 -2998
6158 -2998 -4321 -3784 1630 3389 -794 -5775 -3482 2237 7584 2594 -6227 -4349 -2139 412 3498
6143 3498 615 -4397 -7385 -12849 -12231 -4082 -8665 -8488 -1040 1901 -990 -12156 -19164 -17370 -8441
6128 -8441 -6643 -4386 -5185 -9171 -4615 -3875 -7138 -8364 -8266 -872 4655 5197 1610 -650 -9378 -9043
6112 -9043 -3833 -5228 -11198 -6930 -8160 -4564 779 -144 -2804 -6297 -1398 -2095 -6648 -15431 -11899
6097 -11899 -3898 -1672 -4562 -7653 622 11678 9453 1749 -5510 -2271 -2230 416 1390 -2762 2956
6082 2956 6007 770 2735 -474 -2336 6298 5007 3858 295 -235 -2072 -3118 -10995 -9801 -1427
6067 -1427 5000 5313 1729 -216 -2012 -6328 -2192 5591 6118 2000 3444 3553 -1496 -4123 -2999 -3596
6051 -3596 -5400 -5848 -4511 -1208 -4031 -8622 -5574 -2867 -1775 3770 4217 1837 1256 -2651 -4235 -5979
6035 -5979 -7219 -11677 -7054 -5954 -5042 -2981 750 1143 -4302 -2611 419 -4179 -3896 -6787 -8395 -9229
6019 -9229 -8737 -2859 250 -5709 -6653 -4069 -5861 -4067 -8698 -11989 -10989 -10201 -10415 -13900 -9476 -3273
6003 -3273 -4282 -6988 -7056 -1883 2660 -7233 -7751 -2085 -4483 -8043 -7747 -6180 -5654 -2443 -5585 -8825
5987 -8825 -12691 -7865 495 2363 6004 6815 4386 2131 6644 4070 -291 4382 7169 1858 -3907
5972 -3907 -5212 -4247 -5379 1012 6380 1379 571 -5232 -4124 2415 -2347 -662 -4286 -12484 -10653
5957 -10653 -11647 -5670 -1085 -793 -4033 -6461 -8645 -6588 -8089 -9257 -13421 -14519 -11197 -8723 -7023
5942 -7023 -3258 -9841 -9049 -6338 -5945 -3346 -2219 103 -3196 -9773 -15078 -6481 838 6558 7837
5927 7837 9236 414 -5737 -13258 -12701 -12519 -17672 -14225 -8439 -14118 -10739 543 4706 3951 3415 1585
5911 1585 -127 3568 -3961 -6627 -5315 4694 2762 -3180 -5244 13 -4461 -9377 -7783 -4937 -11161
5896 -11161 -13698 -10851 -12487 -17399 -20395 -17903 -9985 -8990 -12015 -14152 -6844 -5448 -6028 -3601 1206
5881 1206 1971 1932 -1475 -1515 3901 3072 -1404 -666 3938 -811 1239 -1802 -669 3919 4972 -3723 -6941
5864 -6941 -5906 -6295 -5923 -621 3996 437 4173 313 5402 1491 -5765 -494 568 -3162 -1342
5849 -1342 2939 3847 489 -942 -6917 -8574 -4292 -4344 -7040 -11650 -11399 -8251 -2463 -4339 -14714 -12044
5833 -12044 -5764 -3647 4586 663 -4450 -6950 -4800 -2174 -9846 -10089 -4457 -508 -3851 -4687 -7929
5818 -7929 -5129 -5288 -9198 -11022 -11797 -11315 -8822 -9547 -13103 -10301 -5181 -6215 -9823 -7032 -10870 -11066
5802 -11066 -3612 267 -6721 -13749 -9159 -2724 4213 6979 6704 6786 776 -3234 -6053 -3247 3874
5787 3874 7266 2906 -29 -3417 -691 237 496 -3146 359 -1209 -7889 -4542 -3514 -1061 -2489
5772 -2489 -3223 -6454 -11285 -2226 -977 -1211 -2378 -397 -3192 -5377 -4893 -122 3485 -563 748 3109
5756 3109 -788 -2768 -2555 -7231 -10550 -12894 -18024 -9829 -4305 -3096 -1752 -4074 -2565 1028 -3408
5741 -3408 -10535 -15077 -8545 -5399 -4222 -10264 -8259 -106 1150 -6590 -6285 -3824 -3853 -5458 -710 -303
5725 -303 -4089 -6658 -8125 -6107 -9207 -7626 -8226 -3364 5037 5482 -1730 -6002 -5578 -2511 -12316 -22265
5709 -22265 -16327 -10115 -65 6540 9046 6066 -1959 -6224 -6381 -12067 -11136 -5800 -1206 -2185 -1973
5694 -1973 3658 8832 8026 5473 472 -7312 -4152 -2687 -650 3886 6154 2643 2635 4265 2804 6999
5678 6999 5792 4192 4287 5551 3769 380 2605 3666 -3240 -2519 503 -2977 -1901 -6921 -10730 -5725
5662 -5725 -752 1007 -1488 -951 3047 8478 6897 2787 2284 -2067 -2519 -5961 -7044 -6972 -2471 -7521
5646 -7521 588 2270 -2219 -6525 -9838 -15412 -18180 -7330 -3784 -7952 -11370 -4812 -2371 -7058 -9498
5631 -9498 -8070 -5983 -7974 -6854 -10028 -17800 -18803 -12361 -4815 -2748 -3776 -11010 -8205 667 289
5616 289 -5367 -11660 -17396 -12025 -10025 -8773 -7771 -6505 -3645 -2271 -397 -341 -10729 -22167 -19109
5601 -19109 -8572 -10606 -8204 -3314 -22 -3392 -7249 -5735 -8671 -11109 -15816 -6125 -2986 -9761
5587 -9761 -10017 -1645 -2515 -2450 -3982 -9646 -9076 -7785 -7074 -2242 1663 -726 -2210 -9203 -10405 -13276
5571 -13276 -15777 -9348 -5456 -1637 2950 653 -12102 -10685 -12094 -11179 -6222 -7211 -4310 -1301 -6160
5556 -6160 -2926 4948 9381 8410 -1832 -7013 -15170 -15543 -12740 -7718 -8849 -12339 -16579 -16812 -16773 -15391
5540 -15391 -12004 -12270 -8074 -6344 -2863 -4847 -9664 -8269 -4732 -3939 2059 6889 5015 750 1234
5525 1234 -5456 -7635 -4245 -7312 -4527 -2458 262 4267 1066 -4698 -2000 3036 5173 7083 8043
5510 8043 1589 3198 5987 4883 4209 -965 -2342 -4642 -1310 -2656 -4186 -2139 1133 349 -7450
5495 -7450 -6903 -3940 -6161 -4851 -1013 1555 -1903 -6015 -3251 -4731 -5177 -4110 -1198 -3912 -3711 -2290
5479 -2290 -6646 -8281 -5089 753 4856 9226 5532 -4745 -11429 -12216 -7547 -4885 857 2215 -239
5464 -239 -3344 -7210 -2778 -942 -1386 -6455 -3618 -3763 -5558 -3581 3528 6236 -5496 -7948 -11365
5449 -11365 -14857 -13667 -12672 -11397 -15671 -14171 -13385 -9521 -8582 -7626 -4066 5349 6967 -1711 -4590 -6299
5433 -6299 -3435 -4617 -1016 -308 -5221 -3022 -2779 -6567 -3303 -2239 -3693 -818 3581 10566 11392 6839
5417 6839 128 -963 -4351 -13235 -12508 -5464 -4402 -8893 -12663 -13734 -13247 -10808 -13351 -18740 -15165
5402 -15165 -8890 -2499 -1493 -4345 -6152 -3920 -11343 -14081 -20212 -20650 -14349 -9129 -11558 -8785 -10321
5387 -10321 -11902 -10846 -13882 -18094 -13725 -9862 -9464 -5604 3969 1510 -10989 -14404 -18444 -16853 -8956
5372 -8956 -3543 -6544 -6160 -6571 -9605 -6529 -8624 -6911 -4822 -7798 -9233 -3834 1114 -5604 -6985
5357 -6985 -8139 -10277 -11742 -3134 4735 -2399 -8944 -9915 -11667 -8812 -4712 -72 413 -754 -3822
5342 -3822 -2062 -3965 -3148 -1193 -3975 -11238 -10122 -6859 1729 6869 7092 -145 -3876 1098 -2498
5327 -2498 -7827 -11425 -8252 -1620 508 -1056 -1065 -5773 -9981 -6023 -550 -2039 718 536 -9310 -12916
5311 -12916 -5107 6491 3084 -704 560 -880 -5000 -2496 -244 -42 -1350 -1419 -1999 -7942 -10059
5296 -10059 -8309 2487 2180 176 -1024 1497 2108 2634 820 3889 9677 4165 3816 6787 1562
5281 1562 -1602 -7217 -1675 1277 -2519 -5269 -2280 125 -5897 -7699 -5206 -3146 333 4097 -888
5266 -888 2184 4953 4635 -1852 -6242 -7460 -11626 -13845 -13483 -9479 -18059 -19766 -9389 -7390 -11056
5251 -11056 -8842 -1708 -342 180 -1506 -1963 895 -4472 -10682 -7689 -5784 2490 6142 1377 -3520
5236 -3520 2140 7482 13353 9161 3754 4169 3776 3262 -1098 -7477 -10828 -11027 -4930 -3859 -3531 3122
5220 3122 1287 -2534 390 -1462 -9705 -14853 -10428 -8140 -5806 -8820 -6658 -2645 -3184 1877 1851 -945
5204 -945 -2975 -4007 -2670 -2738 -1616 1887 -802 -5428 -7118 -4487 -1108 5017 3213 2 1915 4899
5188 4899 6919 6526 9307 7838 -63 -3877 1058 7157 1205 3909 3879 2278 -208 -2057 -5195 -3662
5172 -3662 -4693 -5884 -8253 -10723 -7970 -3414 -5025 -8671 -7483 -5999 -6238 505 10521 7346 2242
5157 2242 2088 6592 9549 7040 6060 -2061 -11738 -11976 -7007 -11460 -4071 5985 11913 8219 3718
5142 3718 2409 -125 3995 1361 -2859 -6212 -1742 -7784 -16998 -11068 -9535 -11572 -12077 -12961 -8311
5127 -8311 -434 4788 -2384 -1682 23 6948 10070 13425 5246 -3772 -3988 2436 7947 -1968 -5745
5112 -5745 -10133 -4497 2470 1283 1547 -1900 -4706 -1083 7852 3142 1868 119 -3444 -10656 -7610
5097 -7610 -3931 -210 2483 6133 5114 1392 1972 -1040 -3836 -2863 129 -3501 -6571 -8299 -6850
5082 -6850 -7289 -10102 -11450 -2746 5064 1258 367 -3233 -5942 -6296 -5223 -8767 -6038 -5306 -8911 -9300
5066 -9300 -5456 -5592 -5053 -8199 -10586 -13061 -9624 -6990 -8339 -7400 -2127 2273 9925 7539 2363 327
5050 327 -6208 -4286 -2255 -3908 -523 1827 -2425 -7013 -6801 -12479 -15261 -5321 -2732 -4040 -5790
5035 -5790 -6698 -1638 -2806 -2265 2606 6166 3706 2946 3285 8770 2898 -2869 -3849 -5275 -2006 -915
5019 -915 787 5042 5016 3254 4653 5175 -155 2502 6143 2515 -9256 -14120 -5919 -2313 -3543 223
5003 223 4741 2343 1237 -2083 -2614 -9378 -7827 -1656 1971 1160 -7687 -11225 -6932 -3437 3760 11392
4987 11392 5716 5895 8255 4493 2950 5496 3706 -4289 -3106 -4079 -8939 -16556 -16797 -10248 -4723
4972 -4723 -944 4258 6805 2628 872 -8218 -13147 -16131 -16822 -14387 -5829 -153 -4448 -8002 -3179
4957 -3179 -2478 -3778 -5099 -4546 317 6869 2215 943 -147 -2410 218 1973 5667 9293 8124
4942 8124 6331 13080 3552 -520 2697 5740 7867 3646 -536 4450 5466 1144 121 1877 10945
4927 10945 3817 -4631 -6133 -3908 3151 -1780 -1843 -1651 -2541 -2815 3327 8090 11248 10825 4237 6881
4911 6881 7839 5484 6263 6777 3806 8889 6943 7721 7546 3661 5739 3246 -9326 -12984 -13048 -11307
4895 -11307 -6311 -1771 -1574 352 -1827 -2215 -2521 2469 6876 10902 2169 -1198 -3740 -7407 -2375
4880 -2375 -4627 2405 2546 -5982 -6039 -4075 731 353 -2368 -3817 -2971 -5142 -3550 -5840 -6202 -2978
4864 -2978 -3422 2153 4778 -2181 -2545 1208 9770 8826 190 -7595 -2768 3631 2359 1123 1337 2664
4848 2664 8463 7950 5701 10556 5874 4241 1183 -6686 -8881 -4205 5934 7821 17051 14783 7232
4833 7232 6849 8962 10101 9188 6400 2089 1888 5271 2563 1204 -4186 -1913 -1306 1178 3209 5979
4817 5979 -470 -8429 -5292 -5287 -4313 -1457 2213 3915 2402 3525 75 -1198 5091 2058 2628 472
4801 472 1778 719 263 6342 5908 -2067 -4744 -1587 -7378 -6229 -2942 706 1401 -2579 -8138 -6159
4785 -6159 433 1981 -1064 5867 12302 10576 8814 6484 923 5863 7731 3201 2201 2135 4946
4770 4946 1893 6942 7331 -2965 -4672 4135 15053 15937 10703 9981 7885 5769 12590 7402 4601
4755 4601 5959 2769 4865 547 538 -1422 -3705 -11499 -9003 -5139 -10456 -4870 -838 -5953 -3335 -1521
4739 -1521 -4540 -149 4280 5209 5371 6231 5585 1821 -4501 -3811 -1455 -4413 -5278 -3882 -3205 -297 -5303
4722 -5303 -15901 -14217 -8509 -6905 -2089 -4336 -2679 2774 9587 6635 687 1307 7820 8945 1006
4707 1006 -9825 -5890 -7667 -10261 -7074 -5003 -6846 -4427 -4307 -6092 4109 13440 13933 7986 -5107
4692 -5107 -4854 -6360 -10704 -6246 -9272 -9011 -1248 -4509 -8550 -9177 -3214 -1093 -2468 -1499 -467 -4435
4676 -4435 -3496 -5635 -9848 -3489 8537 5076 4002 239 3305 3082 3198 1945 -4704 -8345 -3134
4661 -3134 -3385 -5562 -9977 -13697 -17201 -18486 -11322 -2903 -3185 -1499 126 1733 -2750 -5036 -4085 -1062
4645 -1062 -1169 -4536 -10270 -12077 -12473 -8731 -9795 -11060 -10237 -6884 -2217 842 3910 10630 4737 -583
4629 -583 2376 4453 1434 3995 7705 4775 -2208 -3294 1578 339 -856 54 -2281 -3413 2013
4614 2013 7203 6445 8405 3913 1979 3081 436 -810 -2074 -3495 57 5370 6890 2933 4891
4599 4891 4663 6759 1625 -6096 -7879 -6508 -4230 -4934 711 9991 6176 2880 -2137 -4972 -7933
4584 -7933 -301 -2008 -3455 1734 4151 10212 13058 16694 10263 6347 1825 -4560 -5790 -2945 -243
4569 -243 2 -2977 -70 2838 5207 -4144 -8180 -11687 -8630 -4495 -8444 -12609 -13541 -13663 -9133 -6301
4553 -6301 -9971 -8825 -4263 -4605 -7532 -6365 -2140 -2443 -9376 -6888 -2117 -4771 -8632 -11955 -6714
4538 -6714 -5731 -3963 -1046 -3523 -1446 5735 7473 4264 5051 9272 6519 -1186 -4981 -2379 504
4523 504 -44 -8181 -9501 -12053 -7304 -3385 -5244 -8389 -4112 -3497 -8252 -10243 -8957 -11321 -11380 -18379
4507 -18379 -16850 -2482 2474 3721 638 -4692 -8060 -4109 1273 3035 -72 -6118 -7296 -1961
4493 -1961 2806 -2998 -2751 569 -5492 -11177 -5356 -1601 4212 4581 6228 7025 2452 -145 -7948 -11075
4477 -11075 -13741 -11229 -8295 -9385 -12407 -12452 -5656 -6590 -8474 -11461 -9863 -2080 -2083 -4773 -1955 4789
4461 4789 6018 3547 8100 2481 -5391 -11608 -10352 -1731 5929 7637 5926 9512 15443 10831 6256
4446 6256 1435 2197 1320 -6141 -8172 -7025 -2357 3572 1345 165 5670 7641 4238 2844 8196
4431 8196 6077 3218 -449 -10178 -6191 2000 6792 -3089 -2090 1693 -1841 6931 5666 -53 -10223
4416 -10223 -10282 -6504 -1100 -2179 -3927 -3465 -2759 -3448 -7913 -6339 -1818 5328 4955 5950 2199 2178 3083
4399 3083 5194 2101 97 1261 2802 3519 5019 4577 2272 1277 -6109 -8035 -9815 -7038 -6731 -4554
4383 -4554 -1743 -4475 -4346 -971 147 -1306 -3633 4195 4017 -5243 -8002 4691 13131 12668 -3325
4368 -3325 -8183 -4399 -2020 -883 5090 6273 4983 6450 7791 2233 -76 -5501 -7605 -1845 3062
4353 3062 4102 6972 3599 1702 -2360 -5518 -10877 -8136 -7842 -1991 -277 -1628 -3824 -7911 -4004
4338 -4004 4945 1855 -2593 -4127 -378 2163 -3121 -3750 -821 365 -4014 238 1843 4634 2278
4323 2278 6358 8292 4593 2881 -3811 -5016 2405 4555 8419 17987 19201 17512 9838 4924 5574
4308 5574 3132 -3969 -3575 -3983 -2291 -4523 -1484 4945 12286 12264 11138 10203 4061 -2808 1134 2037
4292 2037 965 -3728 -7234 -5558 -1318 -1003 -1927 -3137 -1392 1936 -190 396 56 -2078 1111 3262
4276 3262 4164 7872 5335 3705 7375 3381 236 -3493 -70 -4536 -4121 -3672 2627 6982 3412 -2546
4260 -2546 -7789 -4840 -3301 -3678 -1484 5375 3351 -8857 -7704 -736 -1652 -1827 -3434 -7440 -10146
4245 -10146 -10494 -9872 -9101 -10980 -14100 -12773 -18022 -12167 -3447 -1732 -1939 79 -642 -379 4347 6818
4229 6818 3134 -1177 739 3046 4297 2969 4913 7810 8730 5771 2409 569 -3694 -3730 1604 1669
4213 1669 5276 2750 902 632 -226 -10164 -11753 -3591 -186 -7199 -6773 -10751 -10651 -6677 -8583 -7177
4197 -7177 -73 7578 14141 14915 1420 -10869 -14154 -16107 -7071 -1554 -575 -360 -5967 -8705 -6211
4182 -6211 -1500 -152 752 -1019 -6424 -4996 3088 1332 3991 8150 10402 9428 5830 -4010 1297
4167 1297 9830 9335 6575 1854 -217 1709 236 3920 1930 -531 -1054 -1868 -1610 -966 3461 11743
4151 11743 13248 12462 15490 8589 3742 2587 3445 10055 8956 7980 10221 1800 -4631 -6950 -8076
4136 -8076 -6458 553 6366 4634 -5014 -11077 -8519 -7889 -2411 8929 3151 -2965 -5128 -6487 -3470
4121 -3470 1473 2372 -3335 -2681 2074 -4696 -4743 -4004 -7822 -9506 -6129 1533 8487 8260 4602 -2644
4105 -2644 -1165 -1563 -2467 -5151 -4605 -3902 -7981 -11681 -12313 -16527 -11734 -8258 -4245 -3982 -5062 -829
4089 -829 -2199 -1136 3362 4689 4463 492 6588 8383 1217 1400 7919 13066 12115 8338 3830 7458
4073 7458 5200 -2643 -4650 -4616 -2008 -6225 -5165 -5546 -5882 -2881 8 4164 1831 -788 -8286 -3171
4057 -3171 5515 6810 1876 -3848 -8613 -9505 -3435 -1996 -4890 -5915 -4201 -7439 -5214 1981 3969
4042 3969 6060 3292 -929 2405 4872 2829 -2340 -6983 -2500 1949 -525 -8117 -7454 -3333 -9550
4027 -9550 -4593 -808 -1769 -1553 -1116 -3206 -12021 -9662 -7648 -4347 -1345 1432 -395 3275 5005 -5604
4011 -5604 -16494 -9912 -2817 971 1428 -4458 -2019 3225 531 1330 2654 6973 9336 5555 -1115
3996 -1115 -1905 200 2081 2308 -2923 -9961 -11338 -6050 -2742 7104 9035 3763 4848 2530 1034
3981 1034 -3507 -5389 3966 5887 3592 5843 1258 2604 -3348 -9065 -4656 -5229 -5466 -10165 -6671
3966 -6671 -2112 -10139 -12123 -9030 -4320 6620 3820 -4703 -2568 1546 3317 8631 8536 14620 18914
3951 18914 14253 8107 2139 -3381 -4754 -337 1895 -778 3905 4521 -4856 -3020 7646 5790 -5497
3936 -5497 -11614 -11189 -9119 -4545 620 -4009 -5453 -5902 -2174 6269 8461 -384 -10288 -15870 -15167 -7660
3920 -7660 -4919 -10302 -13014 -9178 -756 -605 -4659 -3451 2316 -2373 2055 9280 3436 1114 -1194
3905 -1194 -4535 -5038 2342 3421 -1184 -6221 -5873 -2424 4298 7196 2491 1118 -1775 -67 -3418
3890 -3418 -182 4518 6328 -225 -1705 2962 -1982 -2123 2061 912 -278 -2906 -9366 -5710 -8462
3875 -8462 -9888 -4877 -2071 -3784 -955 369 -839 -156 1319 214 -2323 -7378 -11036 -5029 67
3860 67 1022 1122 -5468 -13952 -11611 -6201 -4289 -5640 -5450 -2426 2801 -6014 -8779 -4713 -1935 -5967
3844 -5967 -1865 2023 3873 2662 1795 1497 -2297 -2625 2253 13117 14935 560 -4687 -6196 -3041
3829 -3041 1365 3564 8180 12684 13989 13050 7076 2466 -1192 -3517 1659 8833 2292 -1000 4701
3814 4701 5572 4714 1900 1691 5807 8815 12586 3210 -2641 141 -490 1522 946 467 1351 1001 1487
3797 1487 7928 7830 3218 755 1192 1462 -1553 -5062 -1193 -572 -1368 3626 8876 8894 719 -2808 1312
3780 1312 9266 10137 8220 9517 9853 5929 2276 854 2014 2417 5442 2942 3356 7417 5743 -2670
3764 -2670 -5257 -3664 49 3256 2233 5140 1716 6673 2812 2099 4637 3770 -1357 -1557 3219 2814
3748 2814 -1923 -6332 -2041 -6224 -4560 -5740 -8529 -3435 -2954 -3723 -6459 -5515 -1622 -7340 -3948 3911
3732 3911 12350 10276 2449 -2936 3273 4971 1776 -981 -79 -8452 -9750 -9337 -9223 -5847 -102 9721
3716 9721 8879 9315 12612 15011 8313 9761 16359 7598 -814 345 -287 310 6138 8157 8822 6049
3700 6049 5356 7219 13310 11123 4736 3116 -2691 1058 5815 -1587 -262 66 -5763 -10276 -7568
3685 -7568 1611 6694 1380 -2262 328 780 -218 5263 9585 13935 5802 -6716 -5728 -2440 299
3670 299 -6222 -3686 -2841 -2103 -3230 -4161 -6620 -9585 -5933 -1252 -177 -6327 -10156 -7770 -7638 -1809
3654 -1809 4887 6085 2102 1010 -561 -846 -3258 -8914 -5640 1856 4622 -35 -6416 -10661 -12853
3639 -12853 -10157 -11109 -6542 -1688 -5026 -14390 -12040 -5909 -4053 -6127 -2815 1334 5637 6453 12191
3624 12191 9536 4684 -14 -4951 -8221 -6131 -8051 -6768 -7724 -11608 -12193 -10055 -5775 -2119 1107
3609 1107 4360 4262 6873 6379 8446 5603 472 3633 7402 11787 9224 7402 297 -2833 223 2175
3593 2175 203 2973 3545 4627 6149 3723 1820 -3048 -3296 598 7275 8418 17917 19214 12177
3578 12177 12996 8045 -93 -194 665 6040 6819 9829 2790 6 2741 2624 3933 -1383 -5329 -8476
3562 -8476 -8416 -5796 -2809 -6946 -5141 -2130 1804 -1055 -2588 -6490 -6522 -546 4055 3772 3090 435
3546 435 1546 6431 1769 -5047 -8031 -10211 -8006 -7168 -6449 -4767 -8275 -6186 -9477 -9510 -8546 -996
3530 -996 6619 9323 4425 2041 4376 3666 1536 12727 12548 3112 -3564 -3519 -4057 203 1657 7564
3514 7564 8748 6589 2418 8267 12878 10368 8499 12726 6775 4712 -2428 825 3878 1354 -2150
3499 -2150 -4411 -6372 -9102 -5674 3728 4542 3322 42 3955 -3855 -7985 -9710 -14978 -6546 1340
3484 1340 9746 8687 -635 -605 -303 -1868 -5173 -8222 -5767 -5182 -1423 914 1871 3665 -109 -4998
3468 -4998 -1668 -1389 1481 4281 5223 -1909 -7982 -10687 -11083 -11393 -8808 -4009 2739 3028 -839 -10703
3452 -10703 -14330 -16901 -8945 -2839 -6039 -6244 -7381 -1459 3355 5214 4309 3232 3334 5686 3561
3437 3561 -6735 -11212 -7659 -10060 -13501 -15814 -14047 -11847 -9249 -7073 -13577 -5681 4315 -554 -8196
3422 -8196 -9007 -3198 691 -7897 -15320 -17592 -13795 -13735 -12244 -6013 -6018 -5016 -1842 896 1578 -1697 -976
3405 -976 -2738 -2212 -9110 -12816 -15209 -14446 -15906 -9528 676 2214 2426 516 4620 -402 -3246 -4589
3389 -4589 -6145 -2257 -1579 -2269 4309 6810 12486 13374 7731 452 -3532 -1295 -142 3947 5005 8109
3373 8109 5533 4083 -3026 -9374 -10149 -6087 -2353 2694 4933 4244 -799 4395 2020 -2700 873
3358 873 4419 2952 -431 -4839 -2445 -4572 -5307 -3468 -4170 -3356 -7226 -7798 -7740 -5119 4555 -976 -11441
3341 -11441 -9719 -3732 -10343 -6422 -2067 -3529 -1187 -1288 -3083 -2729 1769 1496 -2632 -980 -641 383
3325 383 5328 3863 -4243 -4714 -327 -268 -3996 -2505 -2994 -4129 -2632 0 -3305 -3361 -5283 -4114 -5107
3308 -5107 -4033 989 -1983 -4775 1659 8265 2078 -138 -4083 -6017 -4253 -2517 -1115 -1396 -5513
3293 -5513 -3134 1824 1409 -4612 -8293 -941 6096 10675 8053 4350 4448 5379 1093 7073 11589 6058
3277 6058 6975 1212 -2603 -5365 -1144 -1181 1292 -315 161 -2746 -5193 -6685 529 1077 7361 10420
3261 10420 12257 3610 -5486 -3891 -7158 -11244 -14054 -9207 -5701 595 466 881 1614 1746 -204 -4648
3245 -4648 -12980 -14183 -8481 -4966 742 -2367 -8110 -7391 -810 6703 6501 2729 -3305 -3940 966 8411
3229 8411 9148 5849 -996 -3019 6773 15387 19514 11027 8880 8547 907 -291 5353 7704 4722
3214 4722 3461 2296 1657 4450 1746 2056 454 -5061 -6300 -5317 383 974 4044 3011 -1075 -1848
3198 -1848 -4342 -1164 -3083 -1864 2474 2367 -7601 -14566 -18164 -15103 -9361 -6700 -7868 -4078 -2352
3183 -2352 -3876 -5584 -3034 -3495 -2429 -2767 -4699 -7789 -5126 -4009 -5792 -5997 -192 -5283 -9267 -6036
3167 -6036 -4093 -4161 -8905 -4778 -5327 -4300 -2900 -2601 3569 7096 -1248 -10233 -1870 4257 6254 7609
3151 7609 -2430 -1060 4108 2131 -3368 -4564 -2527 3400 11432 8795 3420 4711 -1024 -4967 -5533
3136 -5533 -6631 -10099 -12448 -16710 -10071 -2641 1061 2499 1790 2847 5482 2346 4876 1755 -5423
3121 -5423 1307 887 1657 1072 5651 7789 6872 2817 -2370 -1209 -2122 -1517 1443 317 10319 12891
3105 12891 9044 4149 -1152 -5861 -2878 -355 4907 6029 3438 -1862 -242 5656 2952 1195 3930
3090 3930 5083 2789 -2458 77 626 -2787 -5351 -5631 -4210 -4166 -5829 -12770 -7097 -7046 -6624 -2656 616
3073 616 -337 -1929 -4886 -5213 -1041 -1405 -1651 8329 4870 -4198 -6387 -739 -1097 -3337 -1347 2497
3057 2497 2627 -72 4444 4855 354 172 3179 418 -5345 -1368 5342 3028 661 -2175 -4672 -7140
3041 -7140 -10839 -10108 -10006 -3470 -5524 -11226 -9051 -5117 -5119 -4453 -1048 1040 -2257 -3328 -4217 -778 -5859
3024 -5859 -1562 3459 577 -5017 -6540 -1538 2906 -2577 -2452 -5976 -2718 1003 -4713 -5354 -4117
3009 -4117 -4612 -9422 -5682 -5578 -3164 650 -8247 -7228 -1849 -2847 -5366 -10679 -12737 -5699 -3412 -5140
2993 -5140 -11056 -9355 -4685 214 -8008 -11233 -8530 6202 15902 11032 8249 4658 -1011 3010 6185
2978 6185 7735 8553 10754 9850 1904 533 7917 14703 19141 10791 2141 388 -2302 -4478 -7054
2963 -7054 -1785 1608 8327 14266 15060 16010 5178 5169 11362 2974 -5285 -320 5398 3786 3128 841
2947 841 -371 7955 14390 14770 10040 4759 5993 10357 6042 147 5308 4798 3129 8910 3825 -3083
2931 -3083 -1412 -4684 -6504 -4230 -567 -4960 -7658 -7280 -3287 -1013 4187 6760 8192 5525 6668
2916 6668 -4491 -3881 1695 3696 -1093 -2409 -4993 -5551 -1052 -5592 -4598 -416 9487 13571 19682
2901 19682 11319 -1116 -3738 -2883 2577 5179 6782 5271 8176 6304 -2416 -1413 -1261 4847 6203
2886 6203 2941 4296 4827 1813 -2828 -1662 5369 12760 11400 5641 -3056 -562 728 -9037 -9962
2871 -9962 -6835 -4523 -6716 -5154 -10743 -5107 8944 7588 3263 3542 6901 522 -1402 5468 6470
2856 6470 5857 2838 -10 2261 8063 6980 1330 1584 5401 171 -2252 -2353 395 573 -1203 2998
2840 2998 2837 3164 -1089 -566 -2809 -296 -425 1490 591 -1902 -7167 -8677 -5822 3699 -170 -2769
2824 -2769 -2105 987 5466 9459 8587 9653 6865 -6467 -8451 -560 4364 7481 4771 7798 14536
2809 14536 13879 11089 4998 -211 -12118 -11368 -6379 -2547 194 -3650 -8340 -3802 3816 4513 6839
2794 6839 6570 4965 3988 -1720 -11158 -9538 -2498 -4927 -8131 -9001 -12226 -15328 -8136 -4470 -6278 437
2778 437 935 -1888 -3796 3480 4388 1576 5776 4629 3907 3470 -4179 -3160 3866 2051 -969 -1326
2762 -1326 727 -323 -4 -7552 -4668 -2752 -5196 -15014 -16847 -14586 -3061 -861 -2110 -5530 -7866
2747 -7866 -8842 -9899 -10405 -6881 -4071 -6919 1807 4312 2809 -2854 -3247 3655 2995 1177 340 436 -4327
2730 -4327 -3420 4717 3122 -1456 705 -2669 -358 3220 407 -5930 -8559 -3262 3097 1678 -1723
2715 -1723 -2450 -5711 -8067 -10381 -1467 571 -2516 -2046 237 995 -6594 -9274 -14868 -13936 -15252 -6463
2699 -6463 3086 10499 12123 10936 6693 -758 -291 -804 5566 12012 11903 4168 -5519 -6916 1372 4476
2683 4476 2424 -2244 2607 8187 8051 1616 5268 9214 10467 -2843 -8674 -13292 -12877 -5733 119
2668 119 -1586 1684 -2716 -320 3174 2717 2841 871 -4615 -4215 -2444 -1513 -1447 -2947 949 5334 7025
2651 7025 5161 5195 4764 8885 5493 2075 -8890 -14323 -11773 -10318 -2699 -4339 -5207 -4791 -195 4295
2635 4295 5620 5183 1365 5405 8034 6152 14509 5292 -835 -1 612 1965 107 3841 2304 339
2619 339 8338 8116 1947 -78 2068 -572 2177 1672 5798 7498 8231 2647 819 2782 3611 2518
2603 2518 4245 3369 9398 1193 419 6416 9763 3514 129 -1253 1034 708 -5791 5 -911 2996
2587 2996 -3145 1097 9009 7416 8146 2907 2293 4256 170 -8030 -3951 -5 5462 6486 4207
2572 4207 5202 9950 9535 3555 3426 -510 825 4843 2801 1998 9786 15758 9437 6217 8973 9058
2556 9058 -3912 -4744 2724 3688 -541 -2967 -3254 -3237 -6957 -2509 3967 11406 11242 4592 1317 -403
2540 -403 -1367 -540 -6638 2 3711 4611 7581 11647 14157 8372 1596 922 6097 12232 5477 1236
2524 1236 3650 3538 5208 5189 7256 13462 12716 6991 1739 -948 -3524 496 2333 2596 7407 5281
2508 5281 -4618 -13364 -12005 -2772 2961 1708 2570 -3525 -9627 -4565 9318 7213 5638 -1102 -5503
2493 -5503 -6259 2936 17286 19950 13301 11304 4226 4681 6798 8799 12684 11650 3240 -5874 -7580
2478 -7580 -8360 -10020 -4482 3863 -990 -2246 -1132 5029 403 -4853 -1986 2355 4976 2419 -2785
2463 -2785 -694 2456 559 -3147 -317 1473 6108 9322 10417 1386 -8169 -8343 -6778 -2653 2248
2448 2248 217 -2692 3302 5777 3860 4347 2329 4493 7177 10625 7368 2180 2199 -1108 -3827 -2313
2432 -2313 -6200 177 9920 3422 -298 -4655 -4781 -2591 2131 7562 7831 9202 6440 6365 12833 10964
2416 10964 4026 2737 4813 1750 -1017 -4154 -12523 -14384 -13625 -7978 1481 2858 8811 6944 8297
2401 8297 10313 12518 9497 2388 2965 4801 6425 6721 -3666 -8262 -7158 -4660 1215 1177 258 5459
2385 5459 5330 -5229 -1497 1186 -4529 -6639 -4846 1122 -3177 -10200 -8532 -12958 -5988 -2224 960
2370 960 8030 9827 2024 -1427 4937 5042 6846 9032 7622 8395 8254 3462 2363 -1216 -3806 -8861
2354 -8861 -11896 -10013 -6231 -600 -6582 -15946 -20385 -12748 3019 11688 13439 13282 10003 8797 5799
2339 5799 -836 -1949 -1735 -1272 256 4337 7195 3046 1835 2737 -2879 143 -3511 1411 4651 12003
2323 12003 14079 16090 14755 11970 4753 -624 -1176 -4891 -5426 763 1316 918 4552 9182 12634 9140
2307 9140 6519 321 2197 1063 1098 -2537 -9220 -9205 -5467 -1777 -1689 -462 8327 9158 9423 2371 376
2290 376 -5892 -13963 -10283 -3961 -10778 -15460 -623 6089 2801 -728 -5498 -11402 -9954 2883 -405
2275 -405 -3616 306 -612 -3560 -1937 2181 4516 1280 -152 -1850 -4197 -7947 -4246 2189 -1609
2260 -1609 -11830 -14490 -6805 4175 4910 4495 6664 7611 3640 2734 -16 -3999 2367 5239 12527
2245 12527 2135 -2686 -9812 -13341 -9678 -10951 -7235 87 -2364 -5865 -2376 -2739 -2765 1479 4647
2230 4647 2969 2464 1754 3150 2825 10321 9163 4691 2001 2228 6176 5813 5727 8512 11513 3408 2260
2213 2260 7148 6804 -2716 -9513 -10058 -5204 -481 -501 3751 2814 1283 -5588 -11112 -9897 -1352 5199
2197 5199 7720 12064 4172 2378 3681 5886 11726 18860 21610 17979 10248 3496 6684 4390 -1826
2182 -1826 -6125 -5504 -3277 -2528 3896 3608 3936 4779 -1866 1841 5120 2880 -3095 -6087 -2729 -3355
2166 -3355 -6289 -5147 -6864 -3473 1480 6265 5220 1283 3645 7613 8061 8525 6910 6516 5573 6712
2150 6712 9365 2000 -242 3938 7306 3604 5495 4553 6295 7880 9704 6032 55 -3634 -3530
2135 -3530 -1438 -890 3025 4321 6656 -2079 -3002 -3123 -7382 -10595 -6280 866 -962 -5334 -5804 -3963
2119 -3963 -3383 -395 3147 -1623 -8465 -6790 -2457 3444 3169 1674 2149 5305 5524 8603 14343 9173
2103 9173 -1020 -4354 -6445 -163 1481 1931 1560 1669 -927 -998 4216 5730 5729 -1018 301 5286 5336
2086 5336 15409 8110 -964 -4964 -6735 -11240 -8825 -4174 -4668 -8044 -3846 -6177 -3531 -4217 -3893
2071 -3893 -2209 -4416 -4016 -6014 -11134 -8554 -2882 4039 8601 13639 5337 1377 1498 142 -251 -970
2055 -970 -2706 -936 573 -1907 1159 6646 7513 6707 8715 5176 986 2442 4624 2886 1247 -507
2039 -507 -4793 -3525 2281 -5776 -11400 -5606 -8372 -6551 -5350 -3875 4180 6751 5761 4051 5885
2024 5885 6378 4404 4853 1734 64 6749 4925 4577 1157 2635 976 -5232 -13522 -9112 -8025 -10025
2008 -10025 -11982 -11958 -1593 -710 -5840 -8326 -9873 -2959 5211 8050 7052 10464 14963 10706 13852
1993 13852 10167 1797 -4171 -1265 -4671 -1741 4869 5790 6534 -392 -4305 -9039 -7730 -6440 -12801
1978 -12801 -17623 -11188 -3671 3779 6871 12769 8111 5915 8530 10016 7234 192 2948 8274 15869
1963 15869 12988 9266 3596 8938 10316 4440 130 -2627 -5329 -8055 -5975 -4815 236 -3680 -2259
1948 -2259 99 4848 4176 3280 3130 -2802 -1495 862 1450 1767 9918 6443 704 4642 10070 8594
1932 8594 1223 633 -1438 -3792 -5745 -3326 226 3903 5220 3720 1487 5003 8302 12703 12423
1917 12423 4920 -894 -366 3765 7830 4640 1403 1589 1000 -9840 -5604 1585 -533 -5224 -2330
1902 -2330 3355 -111 -2741 -951 2428 1799 -846 -518 2898 7116 7993 3573 2229 3260 5857 10064
1886 10064 8397 -1869 -1002 7914 7433 8633 8346 5886 6487 8341 5633 7753 -960 -13937 -5768
1871 -5768 7198 15665 14532 13533 5864 -2111 -3443 3689 2824 -1263 -10229 -9152 -4471 -3921 1034
1856 1034 6098 10062 7574 7423 12272 7847 4291 8509 9313 7260 283 -4812 -4619 -2890 -907 -3566
1840 -3566 -5879 -6400 -8928 -3563 -61 -3026 -2497 664 3210 6411 8852 7893 5515 -346 -5438 -5647
1824 -5647 -8211 -2397 2879 -1765 -2053 655 -5048 -7501 -1183 1697 4571 4630 1490 5549 10875 15001
1808 15001 7616 -1551 -4201 -197 4695 4983 4437 -1046 -1032 2407 5309 9304 8705 8559 6487 7863
1792 7863 9482 6119 -142 2683 3020 -1368 -9872 -12045 -13545 -9380 -7561 -11841 -12269 -5097 3256
1777 3256 4023 9593 12286 4452 -1033 5395 4102 1369 1169 1832 4327 -1161 -1460 5855 12280 9076
1761 9076 3023 -2515 765 471 -3402 -8474 -2525 -1482 -3935 -5047 -1578 5229 7370 7330 14998 16911
1745 16911 7690 2313 3226 2332 -1564 2268 7910 5073 -3394 -4211 2162 4584 4719 3321 877 266
1729 266 -4065 -1615 1005 5612 2882 2888 6418 5361 11395 7197 256 -5940 -4993 4725 6673 3857
1713 3857 3962 2314 5998 2669 4343 5789 5081 15674 18399 13714 8206 2753 3705 8218 6450
1698 6450 2991 6469 10008 14301 16621 19059 13768 6223 586 1675 -570 -2940 6897 5408 703
1683 703 6049 13430 16694 12005 13259 17612 15074 9142 10370 11275 7644 5284 5431 -1791 -3735 -4512
1667 -4512 -3728 -911 -6721 -6497 -2311 -3921 -2947 -737 1597 3311 5201 2564 5583 12944 5771 1799
1651 1799 8175 10452 9215 4310 -4136 716 6198 5757 8336 9344 8235 8387 7611 5874 1896 505
1635 505 -775 3755 3970 1664 2462 -4431 -7293 -1629 -1467 -9572 -9616 -1856 1145 5685 3955 207
1619 207 7132 7064 2207 346 1669 3235 -270 -9052 -6706 -724 1860 -35 -1980 -4523 -2158 -2316
1603 -2316 -4386 -3883 286 5633 2637 6591 9428 11647 8676 1411 -6270 -8937 -3250 -3076 3732
1588 3732 11246 8522 4605 2749 -1027 -2527 -5805 -4250 -5986 -3339 80 758 1349 -1661 -8069
1573 -8069 -14921 -10128 -8394 -9299 -3411 5003 8094 -349 -3962 -3731 -4099 -2621 -1516 -1759 3981 3508
1557 3508 2431 -2944 -4056 -3600 -5170 -6317 -6277 -3368 -2889 152 -2857 -2028 3157 7593 6221 2691
1541 2691 2239 3380 178 -5338 -5105 -4803 -2785 1861 5435 5441 4770 5726 2072 4672 54 -7944 -3437
1524 -3437 1107 -3333 4086 2505 -3130 -6997 -1651 2659 4456 7280 12513 16811 8829 5414 2899
1509 2899 6212 12282 6158 6157 6760 1081 -1034 3617 8401 7389 13100 13189 13168 6260 3987 1288 1068
1492 1068 -1052 -5029 -5118 1079 7476 10373 15103 14962 8769 7716 9645 11587 9698 5648 442 -1139
1476 -1139 -6529 -11308 -4264 -6379 -5328 415 1104 4973 6200 9217 4271 2792 -3683 -3348 -943
1461 -943 1746 -2761 2429 9786 10065 6373 -2089 -11601 -10909 -2204 3767 3038 -1432 -2148 4907 6831
1445 6831 5707 5609 5540 10444 12642 6953 4508 2468 938 2819 3167 9294 7294 3109 2469 -730
1429 -730 -1137 165 -5080 -515 5968 -132 -7619 -10498 -6415 -9592 -5454 6544 6821 4676 1874
1414 1874 -7562 -6650 2000 5534 11302 14125 6513 1879 2683 4763 994 1022 -2634 -6910 -6690 -4117
1398 -4117 -1535 -4316 -3020 4765 5290 3161 4122 523 803 -384 6190 14941 8795 -290 248 2800
1382 2800 2478 2666 805 -2627 -10862 -15720 -10165 -1086 2322 4002 5162 3720 4193 1037 5 -2538
1366 -2538 -6782 -12821 -8183 -8437 -4558 77 -3151 -3886 -1272 1233 1295 3281 3923 5567 3878 3350
1350 3350 -5472 -8559 -10326 -10439 -10001 -6512 -7151 -12766 -19499 -14906 -431 8541 7266 8543 8830 5455
1334 5455 -3561 -5954 -4316 -283 1928 2761 -1565 -1134 -2674 4876 6759 1713 3048 2292 2332 -3521
1318 -3521 -2875 -154 1931 891 -707 -6852 -8826 -1446 2523 3743 4216 5341 8266 7479 11725 11183
1302 11183 3935 5619 7732 4073 -973 -14 11214 8796 8599 9369 10995 6321 -1344 -4769 792
1287 792 1051 5261 7859 8610 2194 -1485 -101 3792 -2394 -6816 -2572 350 1394 -1044 -4385 1432
1271 1432 -1329 -6487 -7433 -10959 -5671 2920 951 -501 -3131 -563 -6480 -5682 -439 -1059 -2668 -4648
1255 -4648 -6461 -891 -620 6078 9890 8469 6067 9769 14056 7548 2303 5573 6084 3969 1436
1240 1436 6286 5164 9689 12490 7509 5787 -2713 -2367 4229 5746 4261 2481 2229 -403 -1566
1225 -1566 -2888 -13403 -6602 685 -1821 -7036 -5154 462 -733 1119 3030 -2727 1216 542 -2347
1210 -2347 -5075 -3186 -3261 458 -402 -5603 -5340 -797 6319 5198 5442 8285 8675 8942 6876 1935 4785
1193 4785 6194 4060 5774 8596 12241 12302 2647 2019 -2873 -1326 4750 3900 -1271 -2749 3840 8757
1177 8757 13960 12945 15075 12825 3467 310 718 3197 -4968 -9900 -10106 -11028 -3878 -1034 -397 2904
1161 2904 37 -4112 -8610 -8376 -3085 3556 2577 3756 1657 8371 11697 9817 16688 11204 2079
1146 2079 1562 4523 -2164 -675 -186 -2750 -1007 -8841 -8635 -3134 7042 12227 3594 -1106 4602
1131 4602 3843 3665 -406 -2591 -412 -6307 -9621 -10523 -11354 -9556 -4847 915 -1731 -2043 -480 3917
1115 3917 -910 -1798 -3709 901 10249 5580 -5157 -6057 -2712 3273 11961 8329 1960 7283 15225
1100 15225 2913 -161 2806 6678 5559 3499 -74 -1057 -8701 -16806 -15493 -13115 -7749 51 3538
1085 3538 2431 145 -2242 119 2211 5392 538 -3488 -2514 -1990 -4638 -5721 -2269 3246 4655
1070 4655 7872 5714 3524 1417 1640 3055 -1611 -169 -1745 -3941 -1289 -16 402 5580 12532
1055 12532 9418 6987 -2674 -4245 -1274 -5875 -4377 -3380 -6726 -8114 -8294 -2188 5604 7626 6734
1040 6734 7133 2810 -292 -1391 -6501 -7637 -6381 63 -408 2358 6874 13138 10034 4378 2513
1025 2513 2085 210 570 1425 -375 -7464 -6541 -4789 -898 1995 1288 6441 7891 3224 5010 3478
1009 3478 512 115 -83 1556 1031 32 5276 3443 3269 6136 9630 4963 -560 -1379 -921 156 3509
992 3509 13152 6747 5738 6135 11704 14346 15399 14391 13517 8501 7880 11500 15852 14146 14244 10654
976 10654 6946 4323 3159 4731 1052 -1737 910 6875 5964 2671 1983 1694 4367 8965 5476 -1893
960 -1893 -4464 -7958 -9335 -9109 -6204 -4194 -3976 -7791 -8482 -10257 -650 8286 4475 -1262 354 -4519
944 -4519 -6754 -3392 -2549 -2624 -3031 -3769 -2378 -347 3184 4032 -1992 -11499 -17005 -17760 -9626 4374 2209
927 2209 1238 -1185 -2041 -203 -936 1847 -3537 -2763 -9766 -13550 -10917 -7651 -3869 861 9305 13099
911 13099 13823 8555 2029 2252 3308 6831 5521 7694 3894 -2556 4744 5687 4977 6249 8761 12580
895 12580 13833 9469 3440 4942 1097 2952 5434 6960 7308 398 1854 1806 -322 2465 6324 6991
879 6991 -2417 -15259 -17432 -13729 -8803 -3018 -1207 -8715 -770 3882 3687 1670 2034 -749 -1055 -2210
863 -2210 -8772 -4920 -297 -1427 -4188 1097 2572 2778 -727 -4495 -2175 7278 11384 9054 6463
848 6463 4872 9509 12201 4210 4162 364 -12517 -11152 -5809 -5594 -1526 5181 1969 -1509 818 -1032
832 -1032 646 -1584 -9646 -9864 -4524 -2464 -1830 1800 10122 14607 8612 7194 6461 6469 5088 9499 6966
815 6966 -1657 -5164 -4409 -2884 -2341 1256 -579 -8566 -10634 -8942 -5528 -1509 3858 4302 1564 -1274
799 -1274 -3273 -4108 2641 9290 7862 5016 -3716 -6079 -1120 2395 4224 7618 7908 4685 -773 -3110
783 -3110 -1555 -2495 1261 -733 4589 2664 -1554 5276 6305 7458 5969 3796 1038 2888 7255
768 7255 11567 11510 8629 5660 3350 5816 4876 6451 4705 -3797 1812 1387 -286 3245 976 388
752 388 5410 10620 11670 8508 1240 -5681 -2701 -2612 4675 9537 5119 -3283 -3432 -1147 -4416 -8685
736 -8685 -5979 6830 10878 6395 2775 1432 11525 12527 14001 7473 10521 9384 13614 12977 3904
721 3904 -3692 2601 4940 -2140 -6654 -6787 -88 1389 -457 -5395 -9301 -7205 -9124 -6308 -11683
706 -11683 -8878 500 2339 2083 -1600 -7614 -9189 -6637 -2646 4993 5983 3565 -1896 -5587 -4834 -6043
690 -6043 -3298 -4325 -2384 -1966 -1370 982 3394 2848 -4151 -4408 -1179 467 -1248 1169 -7564 -8092
674 -8092 712 3331 -2280 -10484 -6106 -741 9275 17596 20980 16575 10412 3581 2320 2335 290
659 290 -2691 2203 6360 3547 906 9551 13818 12697 13003 6473 -1068 -2399 1310 4921 -496 -8981
643 -8981 -7017 -6472 912 7983 9504 5023 291 -3327 -4293 2438 3444 2099 7045 5097 -4281 -6926
627 -6926 -5149 -2454 -2895 2862 7215 5505 1601 -5124 -754 8077 9831 7344 4616 5091 6020 3667
611 3667 6710 5484 1428 -6037 -13206 -5847 -473 7735 12642 10153 12432 10609 6160 -2395 -6084
596 -6084 -5461 -3009 6386 15353 16001 8390 5203 8221 10450 6477 4976 2190 2287 -1369 -816 -4568
580 -4568 -8903 -266 1901 -5159 -1934 -929 -1880 1355 7013 6249 5185 8435 6749 -2 -1565 -2539
564 -2539 -3741 -3294 -291 -1283 -1260 4932 5885 5368 6719 933 -6293 -8992 -5533 -396 -668 -1200 -4136
547 -4136 -86 601 -1103 -2089 2970 13101 9950 1652 2929 4998 1495 -483 -1936 -1765 621 7000
531 7000 6074 -1226 -2462 1883 1577 -1515 -5077 -5799 -2992 749 1397 1981 6214 4313 3197 1354
515 1354 -6638 -9008 -7249 -3939 1523 -5183 -6081 -1651 -2295 7700 11064 6838 3534 -5185 -1210 -2534
499 -2534 -5743 -5282 -4209 180 5730 9972 9992 11939 6532 4546 9596 2734 3080 6908 8760 6851
483 6851 5961 4163 -81 -3652 -277 2548 6578 12032 13305 3343 2779 3347 -230 4381 6138 8471
467 8471 4540 -7275 -10506 -5853 3908 6548 7663 6750 1244 2997 -648 -5185 -5488 -7204 -1337
452 -1337 -224 -3105 -4061 -9068 -18082 -18215 -17692 -20898 -16092 -7569 -9329 -14087 -6981 -2277 1582 3843
436 3843 4696 3981 2524 7481 12118 16770 19217 13209 14436 11472 6700 2002 -6056 -6877 -3914 2266
420 2266 732 935 238 -3439 -5552 -3649 -9361 -9662 -2001 4167 1833 3007 -6808 -14824 -11579 -2640
404 -2640 8755 15397 12719 15054 15004 12786 2124 -1415 -1278 -3157 2217 4745 532 3160 -1639
389 -1639 -8619 -7412 -5252 -2271 2766 5788 5967 5660 1542 3574 9420 4760 4679 7795 7634 7323 10844
372 10844 7209 -3613 -4165 1419 2017 4249 6648 3071 3718 2816 -300 -8175 -11389 -5180 -5570 -5136
356 -5136 -5801 -1777 5878 2961 -2086 -8 3191 4921 1749 1792 743 -1822 -1649 5309 16377 15458
340 15458 11870 2632 -1937 -1589 -4852 -9296 -7618 2232 7952 5985 4693 6483 5050 2116 167
325 167 -691 -4077 -3110 -5805 -3644 6 -1716 -1338 1184 6789 13333 15684 12714 12428 11120 -275
309 -275 495 3414 -6147 -7805 -4697 -4146 570 2970 -438 245 1044 -3181 -5206 -7915 -5950 -3769
293 -3769 -5002 -7813 -6006 -2580 -2902 -6495 -4836 -6459 681 8901 8126 3502 1956 4491 1792 2301
277 2301 4295 4236 5246 324 284 2051 4753 9927 15007 14930 17201 6352 2290 3293 986 9210
261 9210 16408 9365 1672 2699 2633 3186 11802 14979 13195 8240 3394 6306 10821 9672 6833 -2531
245 -2531 -7847 -1365 6800 9956 10676 10579 10211 12522 10555 12721 5717 819 -3779 -6742 -9581 -10683
229 -10683 -5747 -3532 -273 -1766 -3647 -3210 -175 968 -1118 -1485 -4994 -10139 -11626 -6673 -4488
214 -4488 -1826 736 -2731 -5319 -541 3590 5462 5585 1474 751 5688 5974 -1229 -3503 -1547 -384
198 -384 -887 39 2908 5601 5310 4116 4236 832 417 2098 4939 3199 1176 -1833 -2232 -3570 -5876
181 -5876 -2332 1301 8227 6901 -1803 1429 -4050 -8690 -7286 -2986 -1871 -76 593 -801 -213 4036
165 4036 3599 365 -1109 -4289 -9264 -4281 -2272 -272 2789 2850 4579 3818 4382 5846 1287 -1157
149 -1157 1492 3793 5845 6731 2895 602 3368 6061 7268 2980 -1403 1230 3427 1817 -2863
134 -2863 -1458 -3687 1363 4815 2367 1472 2512 2867 6253 8923 10320 5835 2499 4931 612 2730
118 2730 3216 713 2874 4416 1453 -1949 -2063 -4042 -3330 -1696 -4781 -5886 -6771 -5305 -5308 -8433 -3962
101 -3962 2449 3981 374 -811 1416 934 865 1314 4382 4555 3339 3414 6223 -152 -1786 -5975 -12753
84 -12753 -8645 -2784 -1045 -2992 -1666 3180 5532 3286 3926 950 1300 2374 747 3804 1655 -2246
68 -2246 -5342 -4956 -4133 -5773 -4927 -167 -481 2087 832 -982 -1690 1185 6002 10290 12441 9376 5474
51 5474 3478 1782 7481 9307 5840 2149 3227 2609 2511 5402 8314 7534 5744 6384 10181 11153 6940
34 6940 3830 4665 -336 -3058 -1695 2384 7271 7036 2474 -4716 -5655 -3350 -2249 -2569 580 1678
18 1678 -1940 67 1526 -4225 -3283 667 -2430 -5219 -3894 -4937 -3316 -2161 941 2043 6155 5081
2 5081 7193 7809
0 7809
$$ Imaginary data points
##PAGE= N=2
##DATA TABLE= (X++(I..I)), XYDATA
32767 37828 41177 43632 39926 39866 42496 45775 44538 48307 57056 57309 54030 47576 48647 50829 47927
32752 47927 47718 50636 52543 53510 56340 57994 53715 52253 54406 53765 59040 63996 64524 65361 65620 65349
32736 65349 67920 69753 65169 61342 66830 69978 69501 69573 63532 63657 70158 67660 70529 68362 65314
32721 65314 69306 74501 80303 80149 78888 81012 75319 73992 73041 70527 71093 73477 73696 71260 71301 78201
32705 78201 86848 86594 83804 80062 79021 79595 83069 88271 88648 85237 85273 83569 87791 90257 92249 97540
32689 97540 100057 91834 86566 91371 90028 88749 95568 106703 104154 97902 93617 88384 88232 91244
32675 91244 92628 97754 105034 108295 106718 106017 105169 103476 104132 106747 108986 108497 112246 108076 104675
32660 104675 103913 107620 103815 101950 107689 111432 115775 116865 116409 117072 113732 108585 108327 111359 111808
32645 111808 117577 121493 120188 120025 120624 124686 121707 120375 119774 116994 121957 128100 131151 126665 123021
32630 123021 124273 121953 125333 126820 131559 135128 131484 126064 125927 130124 137062 138769 133587 124867
32616 124867 125887 125870 122048 124413 129895 130228 129583 135238 137201 144045 144437 139688 135492 136568 141701
32601 141701 145109 145407 141623 140934 142636 145829 142345 141333 146431 141487 140981 141775 140405 149415 158444
32586 158444 156151 151195 151961 153028 158514 155066 151027 154721 155786 152973 150527 144837 147969 148688 146419
32571 146419 151681 157372 159815 159162 159284 162549 157218 154547 157739 165792 167830 162318 154491 154536 158994
32556 158994 160139 163463 168472 164403 162104 169720 172295 168056 166107 166325 168044 164866 162226 159128
32542 159128 157657 159969 160851 159053 166994 176523 177414 172908 170094 164734 154735 160520 165566 171291 173610
32527 173610 172818 171106 171728 170622 172626 167631 169773 176676 178884 178294 174579 167929 164022 165072 174128
32512 174128 187233 190228 185595 177478 174419 179105 183507 184242 180579 181001 182692 185841 189588 190117 184512
32497 184512 187146 192503 191138 189776 192668 189736 188148 188905 183879 182666 186586 191383 192942 194043
32483 194043 195051 189698 185448 189231 192360 193874 195157 196554 197841 195287 188872 193414 198656 202940
32469 202940 204225 201303 199479 193041 193223 192550 201392 206695 205760 199688 196484 197170 201146 200727 199330
32454 199330 200964 203495 203815 200890 197147 199765 197294 198990 203314 206877 209016 209587 206113 204192 201280
32439 201280 200103 197430 197929 200861 205996 205388 210616 208932 209708 212844 208544 207948 205164 202524 207776
32424 207776 207224 211250 212317 215072 216446 211954 207064 210160 212701 211278 211309 211804 210481 210592 215245
32409 215245 217787 214784 207814 211827 213227 218524 219073 215065 216275 214884 214985 223542 229507 224557 221188
32394 221188 217111 212826 210276 213162 216809 214350 212313 218732 221186 224062 219789 218408 220387 217017
32380 217017 221461 218439 214758 211579 218553 224632 231947 225501 224249 227296 224253 223297 223025 222557 223587
32365 223587 229196 231828 228149 220138 215547 214693 216860 222336 224131 220871 226755 232866 233848 229931 224505
32350 224505 224415 227031 227101 228913 233742 228644 222508 221855 220417 220264 215567 218299 226452 234772 231133 227216
32334 227216 227212 225960 224356 221659 221673 226089 231943 229103 225101 219334 216772 213950 214362 213413 216558 226059
32318 226059 232814 231105 229996 233949 238074 231455 234223 235541 243387 248765 241230 236526 241540 242818
32304 242818 238637 238266 236858 235778 237868 239063 237786 235832 231278 233928 232370 231254 226296 224187
32290 224187 229456 233691 236362 236494 232446 228636 230536 228805 231315 224530 225651 237487 240655 244630
32276 244630 241929 239278 241174 246116 250847 248756 240304 233698 234997 231586 226230 224252 228688 235906
32262 235906 232847 231399 230992 233931 232949 237135 239294 236824 240493 240958 235584 229264 230487 238742 242247
32247 242247 236844 235268 229987 232368 233581 234923 240670 239246 232225 228951 226313 228458 232608 238273
32233 238273 243400 238695 236434 237552 236003 227046 225390 227594 227444 225049 224741 231360 236084 238562 231185
32218 231185 234680 238629 241533 237247 238930 243093 241225 242314 238580 235569 242256 247455 242199 237866
32204 237866 233717 240706 238859 236854 239054 236851 244774 245138 239618 246413 243226 244520 244986 245163 241330
32189 241330 240726 246303 250055 247342 236686 230289 230125 237652 244853 251803 248713 242939 247830 243528
32175 243528 233988 234035 242977 250203 249675 245212 235681 236581 236265 242996 242148 237647 242212 244365 241885 235831
32159 235831 232391 236768 241706 246082 249290 248762 246172 248741 243602 237284 235540 235945 234183 233953 241138
32144 241138 247310 250858 243166 240114 241514 240517 235108 242173 240605 236299 238578 241908 243616 239181
32130 239181 239293 245592 253849 254170 253501 256017 253834 251825 246262 241240 240179 241580 246048 249222 255592
32115 255592 256070 254248 257874 260297 254042 251462 258619 253084 245381 245304 249928 246751 249674 245381 236932
32100 236932 237460 241745 243940 248661 242007 241871 243635 245953 244987 245030 247302 247452 247621 244785 241412 241202
32084 241202 243929 244766 240026 242074 239756 235100 239168 245942 244149 244711 245242 243476 242743 245941 247694
32069 247694 244461 245895 249808 252837 252589 248873 247480 236503 228828 230387 235039 239176 241910 240672
32055 240672 246731 246891 245042 245591 241279 239452 240768 247511 250742 245536 235753 241785 252763 251376
32041 251376 248046 244553 246111 249871 254953 253112 247688 244469 245136 255791 258098 249274 239360 235628
32027 235628 238949 241270 247642 248376 243492 244047 246072 250011 245837 242877 246597 248125 249842 242679 237420
32012 237420 234506 230115 233493 239653 236886 232708 231051 231852 237869 243697 241441 242681 239647 241235
31998 241235 246487 252248 261954 266947 267493 263166 262012 260984 256884 248527 244723 241756 244891 246524
31984 246524 241974 243010 245858 252628 254813 250629 245997 252802 250765 242318 243891 245225 245516 247848
31970 247848 248052 242176 236548 242511 244466 243728 244416 247869 249155 246359 241428 239770 244696 245983 243622
31955 243622 239765 241953 247071 243164 242859 253004 259924 257468 248536 238727 241772 243248 238921 238965 250127
31940 250127 259462 254419 250470 252122 253203 248995 252874 256370 257810 259928 254960 248638 247960 238935
31926 238935 235868 235666 240815 248550 248247 246755 250227 251574 253296 254182 249345 253910 259852 257458 246830
31911 246830 247026 243469 243183 243157 241000 247895 247717 241832 240618 250438 246204 239246 233732 226545 227017 231220
31895 231220 233563 242169 248540 250248 252982 256154 261289 254403 241494 241302 245689 247826 249303 248620
31881 248620 256504 259178 256549 247000 246219 246015 244097 248958 251832 253374 251815 252222 254175 253414 245545
31866 245545 245092 244012 247318 245313 239212 234856 238730 245152 251872 258361 261008 262156 258510 253406
31852 253406 252378 246830 239690 244341 246884 247819 242024 245876 251649 242315 238357 244362 245843 244733
31838 244733 251206 253880 246674 242521 248341 252017 247431 253012 253775 256837 254075 246928 250114 256572
31824 256572 252758 239698 241119 250361 255312 253151 249413 247451 253773 258792 260015 257173 255720 254567
31810 254567 250997 251535 248077 250205 250640 245000 243259 244718 234039 240897 248566 245189 237573 242346
31796 242346 251151 249312 248173 256694 257354 253770 251126 248952 248591 246494 246176 250887 251082 251824 248927
31781 248927 246599 250086 254816 252359 253581 255540 255511 251914 251560 255002 245699 248950 255523 256379 257461
31766 257461 259975 265953 261304 257998 249073 245826 249591 247121 246859 255126 260315 255261 255849 258147 256744
31751 256744 253165 251094 250131 253979 252261 249835 254784 254702 252623 254145 257977 254388 258178 261919 264280
31736 264280 256467 255147 258594 261178 259751 254506 244475 243299 249712 253275 255734 251243 252741 254304
31722 254304 257806 262349 259163 253714 252047 246321 241311 243239 244880 246930 252321 258371 249501 244939
31708 244939 241329 235084 237536 241046 247225 247597 257102 249019 242071 246665 247008 250600 254039 257577 256009
31693 256009 251516 251154 255158 257656 256129 244542 235865 234860 238007 235702 234038 234059 229911 231813 237020
31678 237020 242479 243206 239192 232415 231108 231367 238024 243668 247127 254725 256407 256697 254278 249626 246990
31663 246990 242575 240291 248027 248683 240067 235093 244422 251500 250447 250093 246338 245216 245435 243333 239205
31648 239205 239397 238773 239922 241775 244171 243183 243809 250474 248159 242860 238971 245942 242275 241628 245472
31633 245472 244631 249578 256639 256023 254467 250399 256286 256719 254003 257875 263735 263413 261441 261878 257316
31618 257316 251543 249172 251225 249198 250963 248326 246499 250559 246864 246954 249019 247322 252527 246306 244517
31603 244517 245222 250125 252703 252951 248807 246089 247914 245575 243988 249119 254514 251584 247785 248586 250585
31588 250585 254903 252868 252841 252481 253093 252156 253939 253181 250055 247199 246434 249568 253280 252300 256319 256878
31572 256878 251926 252969 251481 252798 246135 243255 243677 243107 248178 250531 248013 252128 250047 249699 250165
31557 250165 250728 247460 241422 240140 244981 247901 244595 243447 249977 250731 250618 249078 253181 253060 256975
31542 256975 262161 262649 258703 259187 262845 260513 258192 253820 251278 250646 252118 251738 248838 245619 251025
31527 251025 248488 244913 243459 246891 250256 250302 247682 244666 243248 246433 249535 255525 259241 260631 259836
31512 259836 257157 254644 255594 254590 252933 245123 242050 246362 253772 253876 248159 247056 247893 255870 254490
31497 254490 256564 252680 253663 260636 261218 256411 256345 255947 251413 251482 258019 260873 267165 264858 257886 256883
31481 256883 257040 253650 251711 249449 247892 250575 251950 253128 252473 254568 257005 256115 256129 255073 254112 255571
31465 255571 256989 259049 249517 246890 247301 247955 245524 243290 249999 250147 249494 252480 253606 253418 254293 252784
31449 252784 251891 256600 256600 256162 250402 246221 251483 254200 253281 251993 255221 257495 263584 265432 261042 246272
31433 246272 247081 248417 250382 245016 244302 240813 243269 237728 243035 244306 251015 260538 263499 253300
$$ [...]
##END NTUPLES=NMR SPECTRUM
##END=
