##TITLE=Analysis number 325890
Compound Code cc 59522
Book Reference 508/44
Project Code adrs
Chemist Name antons
##JCAMPDX= 6.0         $$ Bruker NMR JCAMP-DX V2.0
##DATA TYPE= NMR SPECTRUM
##DATA CLASS= NTUPLES
##ORIGIN= Bruker BioSpin GmbH
##OWNER= nmr
$$ XWIN-NMR		Version 3.5
$$ Thu Jan 18 09:50:01 2007 GMT Standard Time (UT+0h)  MAYBRIDGE\nmr@NMR_250MHZ
##.OBSERVE FREQUENCY= 250.131544655141
##.OBSERVE NUCLEUS= ^1H
##.ACQUISITION MODE= SIMULTANEOUS (DQD)
##.ACQUISITION SCHEME= undefined
##.AVERAGES= 16
##.DIGITISER RES= 18
##SPECTROMETER/DATA SYSTEM= dpx250
##.PULSE SEQUENCE= zg30
##.SOLVENT NAME= CDCl3
##.SHIFT REFERENCE= (INTERNAL, CDCl3, 0, 16.522)
##AUDIT TRAIL= $$ (NUMBER, WHEN, WHO, WHERE, WHAT)
$$ ##TITLE= Audit trail, XWIN-NMR		Version 3.5
$$ ##JCAMPDX= 5.01
$$ ##ORIGIN= Bruker BioSpin GmbH
$$ ##OWNER= nmr
$$ C:\u/data/dgb/nmr/ADRS/1350/pdata/1/auditp.txt
$$ ##AUDIT TRAIL=  $$ (NUMBER, WHEN, WHO, WHERE, WHAT)
(   1,<2007-01-18 09:49:37.83 +000>,<MAYBRIDGE\nmr>,<NMR_250MHZ>,
      <created by zg, POWCHK disabled, PULCHK disabled
       configuration hash MD5:
       49 4B E0 1D 92 C2 6B 37 9F E6 65 BC 52 41 86 1D
       data hash MD5: 64K
       2B DC 09 EC 27 5B D2 6F B2 D7 83 12 2B 26 53 C3>)
(   2,<2007-01-18 09:49:50.60 +000>,<MAYBRIDGE\nmr>,<NMR_250MHZ>,
      <Start of raw data processing
       ef LB = 0.3 FT_mod = 6 PKNL = 1 SI = 32K 
       data hash MD5: 32K
       F7 3F 91 99 DD C8 F9 48 D3 6E 5B AF C4 F1 0C 50>)
(   3,<2007-01-18 09:49:52.58 +000>,<MAYBRIDGE\nmr>,<NMR_250MHZ>,
      <apk 
       data hash MD5: 32K
       76 EE C2 0D 63 B1 96 7F 8D 49 98 22 1E 30 0A 91>)
(   4,<2007-01-18 09:49:53.30 +000>,<MAYBRIDGE\nmr>,<NMR_250MHZ>,
      <abs ABSG = 5 
       data hash MD5: 32K
       9B 75 D1 FB B8 D2 A9 D4 81 6C 72 BA AC 65 ED 67>)
$$ ##END=
$$ 
$$ hash MD5
$$ 30 FC 9D 42 CA 89 4A 6E AF E9 71 D7 C9 A1 E9 0C
##$RELAX= 
##$RELAX= 
##$RELAX= 
##$RELAX= 
##$RELAX= 
##$RELAX= 
##$RELAX= 
$$ Bruker specific parameters
$$ --------------------------
##$DU= <C:\u>
##$EXPNO= 1350
##$NAME= <ADRS>
##$PROCNO= 1
##$TYPE= <nmr>
##$USER= <dgb>
##$AMP= (0..31)
100 100 100 100 100 100 100 100 100 100 100 100 100 100 100 100 100 100 
100 100 100 100 100 100 100 100 100 100 100 100 100 100 
##$AQSEQ= 0
##$AQ_mod= 3
##$AUNM= <au_zg>
##$AUTOPOS= <4 >
##$BF1= 250.13
##$BF2= 250.13
##$BF3= 250.13
##$BF4= 250.13
##$BF5= 500.13
##$BF6= 500.13
##$BF7= 500.13
##$BF8= 500.13
##$BYTORDA= 1
##$CFDGTYP= 0
##$CFRGTYP= 5
##$CHEMSTR= <none>
##$CNST= (0..31)
1 1 145 1 1 1 1 1 1 1 1 1 1 1 1 1 1 1 1 1 1 1 1 1 1 1 1 1 1 1 1 1 
##$CPDPRG= <>
##$CPDPRG1= <>
##$CPDPRG2= <>
##$CPDPRG3= <>
##$CPDPRG4= <mlev>
##$CPDPRG5= <mlev>
##$CPDPRG6= <mlev>
##$CPDPRG7= <mlev>
##$CPDPRG8= <mlev>
##$CPDPRGB= <>
##$CPDPRGT= <>
##$D= (0..31)
0 1 0 0 0 0 0 0 0 0.06 0 0 0 0 0 0 0.0002 0 0 0 0 0 0 0 0 0 0 0 0 0 0 
0 
##$DATE= 1169113776
##$DBL= (0..7)
120 120 120 120 120 120 120 120 
##$DBP= (0..7)
150 150 150 150 150 150 150 150 
##$DBP07= 0
##$DBPNAM0= <>
##$DBPNAM1= <>
$$ [...]
##$SUBNAM7= <"">
##$SUBNAM8= <"">
##$SUBNAM9= <"">
##$SW= 20.6930455092707
##$SWIBOX= (0..15)
0 0 3 0 0 0 0 0 0 0 0 0 0 0 0 0 
##$SW_h= 5175.983436853
##$TD= 65536
##$TD0= 1
##$TE= 294.16
##$TE2= 300
##$TE3= 300
##$TEG= 300
##$TL= (0..7)
0 120 120 120 120 120 120 120 
##$TP= (0..7)
150 150 150 150 150 150 150 150 
##$TP07= 0
##$TPNAME0= <>
##$TPNAME1= <>
##$TPNAME2= <>
##$TPNAME3= <>
##$TPNAME4= <>
##$TPNAME5= <>
##$TPNAME6= <>
##$TPNAME7= <>
##$TPOAL= (0..7)
0.5 0.5 0.5 0.5 0.5 0.5 0.5 0.5 
##$TPOFFS= (0..7)
0 0 0 0 0 0 0 0 
##$TUNHIN= 0
##$TUNHOUT= 0
##$TUNXOUT= 0
##$USERA1= <user>
##$USERA2= <user>
##$USERA3= <user>
##$USERA4= <user>
##$USERA5= <user>
##$V9= 5
##$VALIST= <valist>
##$VCLIST= <CCCCCCCCCCCCCCC>
##$VD= 0
##$VDLIST= <DDDDDDDDDDDDDDD>
##$VPLIST= <PPPPPPPPPPPPPPP>
##$VTLIST= <TTTTTTTTTTTTTTT>
##$WBST= 1024
##$WBSW= 4
##$XGAIN= (0..3)
0 0 0 0 
##$XL= 0
##$YL= 0
##$YMAX_a= 491228
##$YMIN_a= -370205
##$ZGOPTNS= <>
##$ZL1= 120
##$ZL2= 120
##$ZL3= 120
##$ZL4= 120
##$ABSF1= 16.522
##$ABSF2= -4.171173
##$ABSG= 5
##$ABSL= 3
##$ALPHA= 0
##$AQORDER= 0
##$ASSFAC= 0
##$ASSFACI= 0
##$ASSFACX= 0
##$ASSWID= 0
##$AUNMP= <proc_1d>
##$AZFE= 0.1
##$AZFW= 0.1
##$BCFW= 0
##$BC_mod= 0
##$BYTORDP= 0
##$COROFFS= 0
##$CY= 12.5
##$DATMOD= 1
##$DC= 0
##$DFILT= <>
##$DTYPP= 0
##$F1P= 14.0000005364418
##$F2P= -0.99999901652339
##$FCOR= 0.5
##$FTSIZE= 32768
##$FT_mod= 6
##$GAMMA= 0
##$GB= 0
##$INTBC= 1
##$INTSCL= 1
##$ISEN= 128
##$LB= 0.3
##$LEV0= 0
##$LPBIN= 0
##$MAXI= 10000
##$MC2= 0
##$MEAN= 0
##$ME_mod= 0
##$MI= 0
##$NCOEF= 0
##$NC_proc= -3
##$NLEV= 6
##$NOISF1= 0
##$NOISF2= 0
##$NSP= 0
##$NTH_PI= 0
##$NZP= 0
##$OFFSET= 16.522
##$PC= 1
##$PHC0= 74.31819
##$PHC1= 6.806487
##$PH_mod= 1
##$PKNL= yes
##$PPARMOD= 0
##$PSCAL= 4
##$PSIGN= 0
##$REVERSE= no
##$SF= 250.13
##$SI= 32768
##$SIGF1= 0
##$SIGF2= 0
##$SINO= 400
##$SIOLD= 32768
##$SREGLST= <1H.CDCl3>
##$SSB= 0
##$STSI= 32768
##$STSR= 0
##$SW_p= 5175.98343685301
##$SYMM= 0
##$S_DEV= 0
##$TDeff= 65536
##$TDoff= 0
##$TI= <Analysis number 999999
Compound Code 99
Book Reference 9
Project Code 9>
##$TILT= no
##$TM1= 0
##$TM2= 0
##$TOPLEV= 0
##$USERP1= <user>
##$USERP2= <user>
##$USERP3= <user>
##$USERP4= <user>
##$USERP5= <user>
##$WDW= 1
##$XDIM= 32768
##$YMAX_p= 515578967
##$YMIN_p= -44251
$$ End of Bruker specific parameters
$$ ---------------------------------
##NTUPLES= NMR SPECTRUM
##VAR_NAME=  FREQUENCY,     SPECTRUM/REAL,   SPECTRUM/IMAG
##SYMBOL=    X,             R,               I
##VAR_TYPE=  INDEPENDENT,   DEPENDENT,       DEPENDENT
##VAR_FORM=  AFFN,          ASDF,            ASDF
##VAR_DIM=   32768,         32768,           32768
##UNITS=     HZ,            ARBITRARY UNITS, ARBITRARY UNITS
##FACTOR=    0.157963299565203, 1,           1
##FIRST=     4132.6476996994, 0,             0
##LAST=      -1043.33573715361, 0,           0
##MIN=       -1043.33573715361, -44251,      0
##MAX=       4132.6476996994, 515578967,     0
$$ Real data points
##PAGE= N=1
##DATA TABLE= (X++(R..R)), XYDATA
$$ [...]
16512i707M837P225j785p564n964r78M060M534M856j992q112P78l0j184N269l585
16496i342k551m123q87L05o510j433L025M527K953L90O058R64n437M12K89M433
16480f927j745M251J169N80j909P420O034q575k212k431k313M081M15m15j960
16465d537n35k88k239j634L391J741o2k377P04L102k700J294M031J554l699L806
16449A552j505n395n852O243N266o362J134j320k817Q432p80p377k740l929l728
16434a9178O860M145l824k143m71J139m65K459J002L503m563M741J288l077N19
16419h065j186o90L46m256J977K737K187o84k777l862J244O54M719M046j699j919
16403g228K909J13o277j0818K022P029M887J550q052n032l353K440O05m65R071
$$ y = [-9707, -4870, 2355, 570, -6994, -12958, -13936, -9876, -5342, -486, -2478, -10590, -9812, -9842, -11026, -5757, -9342, -11893, -16016, -16903, -16598, -23108, -24541, -21516, -16989, -14036, -13646, -7588, -6624, -12061, -11649, -11360, -6927, -8672, -4421, -3252, -2672, -4581, 2839, 8873, 298, -1914, -4345, -6658, -2577, -2162, -2577, -4537, -5072, -5360, -7599, -9233, -5842, -4101, -4163, -6540, -5836, -2734, -5434, -4140, -109, 1445, -2254, 1552, 47, -5348, -11200, -4957, 309, -6053, -4919, -6239, -9056, -624, -1404, -8781, -11521, -15450, -19178, -12318, -8173, -11997, -14140, -14611, -13472, -13937, -11478, -10476, -6973, -11536, -6795, -5507, -8584, -8065, -9251, -9941, -9595, -13851, -11874, -9137, -6950, -7634, -10411, -14273, -13029, -12375, -7656, -3610, -5309, -7228, -4319, -4206, -10483, -21301, -19279, -12250, -7363, -5813, -13865, -18897, -22250, -19810, -19205, -19670, -10599]
16388a0599L657m556K471k124J5J0931M7K787o345n820L123O216L984m142k457
16373b812j4522L720Q13J910P117n7M637j885o557o888n309O819k922K099O202
16358g635K01j576L227l043J628J208M256m154j929N835k370n527k43m514j950
16343a6586O729L998k32j602l217J669r02k568N356M092j784l737j0732O4R406
16328a0046Q61K519K538L844j877l652m058r0j151l307J632J620K811n3l94N604
16312c199l137j491l569k484J831J003j304L495J197J859K403K034J624l749J645
16297a842K83l057j531r788J933k22M495R049R868R258J2358R617p048j0463j8401
16282D509j1084j96R50J014M912k348l307j938l955O093J353l259P20K773o848
$$ y = [-10599, -6942, -11498, -9027, -11151, -11136, -205, -158, 2629, -3716, -9536, -6413, -197, 3787, -355, -2812, -17334, -13614, -12801, -10891, -3774, -3831, 806, -1079, -7636, -14524, -19833, -13014, -15936, -13837, -7635, -7434, -9010, -5783, -8826, -7198, -5990, -1734, -5888, -7817, -1982, -4352, -9879, -10122, -14636, -16586, -9857, -5859, -6091, -7693, -10910, -9241, -10143, -12711, -7355, -3263, -5047, -8784, -19516, -19452, -10046, -9185, -6666, -4128, -284, -2161, -5813, -9871, -9961, -11112, -14419, -12787, -11167, -8356, -8409, -8803, -3199, -6336, -7827, -11396, -13880, -12049, -11046, -12350, -8855, -7658, -5799, -3396, -1362, 262, -3487, -1842, -1559, -4616, -6147, -15935, -14002, -14224, -9729, -680, 9188, 18446, 30804, 40421, 33373, 22910, 4509, -6575, -6771, -5821, -4807, 105, -2243, -5550, -7488, -11443, -5350, -3997, -7256, -6536, -3763, -10611]
16267a0611K542O38j980N097K36J904J235J392J215l650k434K272J3054K5421
16253C6331K6267l386j7013j8805j4241o734l449n038m038R63L137M377k122m623
16239h374j821J174J930K974K795j226j340k217m168L458R305N489J121p247q829
16224f976R882J0819J2493K3382P840L856k4786j9643o255J23k671m374l808l434
16210c552j289J814L20k446p544J261q85l16L994N024j449K886j817n464m870
16195a4333L033L612P028M946L872J0002R179J6275J5464J94j4628j6144j6053
16182A2447m708L336N689R724N540N747j181j5887j0666m248k155k246k337n343
16168f288K226r76k259J586m279k494O971J519m521q708K285L869R182J4210M778
$$ y = [-10611, -8069, -7431, -9411, -4314, -4078, -2174, -939, 453, 1668, -1982, -4416, -2144, 10910, 36331, 62598, 59212, 42199, 23394, 9153, 2419, -1030, -6068, -10106, -9143, -6006, -1629, -3751, -8374, -10195, -9021, -7091, -4117, -1322, -2548, -3888, -6105, -10273, -6815, 2490, 7979, 9100, 1853, -6976, 2906, 13725, 26218, 49600, 57440, 61296, 36510, 16867, 10612, 10735, 8064, 3690, -118, -3552, -4841, -3027, -2707, -5153, -12697, -11436, -12321, -12637, -8643, -3619, -5068, -2182, -3999, -9463, -14333, -11300, -7688, -660, 4286, 8158, 18160, 27339, 43614, 59078, 59272, 44644, 28500, 12447, 7739, 11075, 16764, 26488, 32028, 37775, 36594, 20707, 10041, 5793, 3638, 1392, -945, -6288, -4062, -5038, -7297, -5711, -9990, -12484, -5513, -3994, -8515, -17223, -14938, -11069, -1887, 12323, 17101]
16153A7101L200l79o101j1517p204O874J6557J9493K0753K5434N58k3266k3383
16140C8120j7184n552p258K514j234j312m844j0097mj760n65J372j419n70m64
16125a0257j613K570L851j135k000O179j302n504r65m505J0879J8520J2553K2032
16111D9303K7945K735k2691k7603j6772j0704k412J831n036k041J7k70K459q53
16097d092o071K115P84M914O103l63K01k608j372o622j847K645J379L354L749
16082B269j379R548K2037K3482K2233Q747j7463k7085k5376j3181L78N02p573
16069b861l648R9K156P042P752n088k325l272L800J674q899l062k906O0L283j080
16053g275K57Q931L477K548n031k759N764J1630Q017J803M440q864j0696q451
$$ y = [17101, 20301, 19922, 13821, 2304, -4900, 1974, 18531, 38024, 58777, 84211, 84769, 61503, 38120, 20936, 15384, 8126, 10640, 9406, 8094, 3250, -6847, -6851, -8611, -9176, -7804, -9223, -9793, -10257, -11870, -9300, -5449, -6584, -8584, -2405, -3707, -9211, -10176, -14681, -3802, 14718, 27271, 49303, 77248, 79983, 57292, 29689, 12917, 2213, -199, 1632, -3404, -5445, -5428, -5698, -3239, -4092, -10163, -8048, -7264, -2350, 3753, 3390, 3591, 983, -389, -7011, -8858, -6213, -4834, -1480, 2269, 890, 10438, 32475, 55957, 78190, 86937, 69474, 42389, 17013, 3832, 4210, 4712, -2861, -6509, -6410, -4254, 2788, 10540, 5452, 3127, -145, 3655, 5329, -3570, -6632, -9538, -9478, -6195, -7275, -7018, 1913, 5390, 7938, 2907, 148, 5912, 17542, 25559, 27362, 31802, 22938, 12242, 3791]
16039C791p101J025m216l712O513K156J092N488m654k297r14l041p471l617L012
16024a3946N901L615q70j109q50m102J767Q75N999K714j704l375r029J611K283
16009a0220J147N352M048j609m341j0560o87Q587j865l122L496j005J206J321
15995h252Q38K757P31N091M256m056o585M044j386r316L48P100j55P81N204J184
15979B584m843k961j552m532J754N855L413L56j139o216o169L106J014K062R90
15964f278J974L080M98p271j0636j175l714k050L055j960q069k789K755L631Q444
15949b0505L366J530R291Q989L50l517M21k844o758M04N510l162m907l716M910
15934a0638K372J067P052J277k188l272Q19k550r67K140k311n005J308O780j905
$$ y = [3791, -3310, -2285, -6501, -10213, -3700, -1544, -452, 5036, 382, -1915, -2829, -5870, -13341, -16958, -13946, -8045, -4430, -5300, -6409, -7259, -11361, -9594, -8719, -2720, -6, -1710, -5085, -14114, -12503, -10220, -9073, -3721, 327, -1282, -5623, -16183, -16870, -8283, -10148, -13270, -9774, -10779, -9573, -8252, -7414, -4657, -3926, 1165, 5421, 1365, -5220, -1176, -2562, -11878, -11530, -4430, -4585, -3804, 1400, 2584, -2259, -5220, -6772, -11304, -9550, -3695, -282, 74, -1065, -7281, -13450, -10344, -9330, -7268, -6278, -4304, -1224, -726, -7997, -18633, -19808, -23522, -25572, -22517, -24477, -32546, -35335, -32580, -28949, -20505, -17139, -15609, -6318, 2671, 3021, -496, -75, -2919, -9677, -9273, -3763, -6925, -11832, -15548, -10638, -8266, -7199, -147, 1130, -1058, -4330, -3511, -6061, -7028, -4888, -7199, -12204, -10896, -4116, -6021]
15919f021n376O962J153k862J349j476k918K834l062k866q01J990k071M83M76
15904a2206K044M71n082K960M871M095m028K37k632m465J273L453P881j288r971
15889a2387k363j260p82Q875Q201o471L035R94r162q205O250K799K550k984l792
15874a4702O475O637o454n245J008P579O797J03j4044j6256k25Q720K382l115
15860b0340R99M632O052P580M478n790J097J266o345k885N500N924k419l542m448
15845h241L306K463n316j916k071n028N760r55n025J79P130L697K228Q61o23J569
15829a982j073k608K670M037o66k969r725l980R865R233O60o599m416m373k263
15814a4189J559K736J475n072J226N276N152k907L207J0907j707q416l547o234
$$ y = [-6021, -11397, -4435, -3282, -6144, -4795, -6271, -9189, -6355, -9417, -12283, -13084, -11094, -13165, -12682, -12206, -10162, -9691, -14773, -11813, -6942, -2847, -6875, -6638, -9270, -13735, -12462, -9009, -1128, -2416, -12387, -14750, -16010, -16792, -7917, 284, -6187, -3152, -2158, -11320, -19525, -13275, -10476, -7926, -10910, -14702, -8227, -1590, -8044, -13289, -12281, -4702, 2095, 2198, -11846, -28102, -28327, -19607, -17225, -20340, -19341, -14709, -8657, -1077, 3401, -2389, -1292, -26, -6371, -9256, -3756, 2168, -251, -3793, -8241, -4935, -2472, -7788, -9704, -11775, -16803, -11043, -11998, -17023, -16844, -9714, -6017, -3789, -2928, -3551, -1982, -3055, -5663, -2993, 1044, 378, -2591, -12316, -16296, -6431, 2802, 3462, -3137, -7553, -11926, -14189, -12630, -9894, -8419, -13491, -12265, -6989, -1837, -4744, -1537, 9370, 7663, -753, -4300, -10534]
15800a0534l839l38L334l20N63K290o565J041P094N211p96j809j405J935k62k650
15784g050p99M905m925K555o419J144J645m661j4K038l581K916K224M19p94O19
15768i778q011l768M188O172k168l529N766P243K088P616j334r311q162j702K405
15753a2285L188O216N106n076m816L187k979p430L32Q64K907P832M956N123j737
15738E388r879n362O252j544p020l681L346K947l151k441R39L498K61m241n553
15723b0241K849L103m20L657l300m882O05M511L419O695M841K146k877k969k542
15708e405m517M645M64o780O109J662l175o577N473N318j212j828m03k357j163
15693i746N773L708L577k280l426K518l612j764J242m48K526O89j32r03r6J253
$$ y = [-10534, -14373, -14711, -11377, -11697, -11134, -8844, -15409, -14368, -7274, -2063, -2859, -4668, -6073, -4138, -4400, -7050, -7849, -2944, -7869, -5314, -11733, -10589, -8944, -13605, -13619, -11581, -15162, -12246, -10022, -9603, -10397, -9778, -17789, -21557, -17369, -11197, -13365, -16894, -11128, -3885, -1797, 5819, 4485, -4826, -12988, -14690, -12285, -9097, -2881, 2225, -2851, -7667, -4480, -7459, -14889, -14557, -13693, -10786, -2954, 2002, 7125, 5388, -4491, -9853, -3601, -5145, -12165, -15846, -12500, -9553, -12704, -15145, -14206, -10708, -10447, -14688, -20241, -17392, -14289, -14709, -11052, -14352, -19234, -18629, -14118, -10699, -4004, 837, 2983, 106, -2863, -5405, -9922, -5277, -4813, -11593, -5484, -3822, -6997, -13574, -8101, -2783, -3995, -5823, -6226, -8583, -9746, -3973, -265, 3312, 1032, -2394, 124, -3488, -5252, -4010, -4458, -1932, -1243, -1375, -2278, -2374, -1121]
15677a121J040K732M443n85j0926o14M027R64j792Q20k322p01l303m289L15L119
15661h193k493o156o317l326K047O854R661p8q81J437M987k346m628O02o375P80
15645a4425O58L114J0941L265j884o025L419k407m473L104j595K057j711L01M444
15630a217O63j179Q7n618p419K889O641m07N778k412j323M835o09r678l801o184
15614a8954O619K978m105R27Q254J682j300m654M51OJ985L3J0114M526J1095R0
15598A9747q686j2470j3321n574j243J740N678P092L060l891q325K952N174K250
15584e817L916O364L201l564l362j586J264l290j313j0052j086L359k237l00K554
15569a1949N026n407k216O321m08L687K288k427j823J1644O621m958j838o109
$$ y = [-1121, -81, 2651, 7094, 6509, -4417, -5031, -1004, -40, -1832, -1012, -3334, -4035, -7338, -11627, -11312, -8193, -10686, -16842, -23159, -26485, -24438, -17584, -7923, -8001, -8882, -7445, -2458, -4804, -9432, -8830, -15205, -14425, -13767, -10653, 288, 3553, 1669, -4356, -937, -3344, -7817, -4713, -6308, -4251, -5962, -5661, -1217, -554, -1733, -1646, -7264, -14683, -11794, -5153, -5560, 218, -2194, -3517, 1318, 709, -8969, -12770, -18954, -12335, -9357, -13462, -12535, -4281, -2599, -3899, -8553, -8102, -8096, -6111, -6078, 4036, 8562, 19657, 19747, 11061, -1409, -14730, -20304, -21547, -19807, -14129, -7037, -3977, -7868, -16193, -13241, -8067, -5817, -1901, 4463, 7664, 4100, 738, -848, 416, -2874, -4187, -14239, -15325, -11966, -14203, -14503, -11949, -6923, -12330, -14546, -8225, -8633, -4946, -2658, -5085, -6908, 4736, 11357, 6399, 4561, -1548]
15555a548j3382l590R317N040P342n247l453P62lo304M840k95L001J641q43n165
15539g887J5l600N450R518M897n528j1878r756O84J0159P530o13j2832J147K811
15524i883N680L825l381n073L959Q70k251m001p46J744j323n430J343K147K623
15509i897O886O248l374j212k498O50k555l201J058K682l820J227n050o71J78
15494a3349p11J777N559J396R86p576m545J111M763L876L931k995L70j61J065
15479d503m378p256L758N87K129L472l48L450N37l222P94J806j237o061n418P798
15463h092R54l696m066O192j595M709M959P848j134k698j122k445l886K85k353
15448f140R155N445q924m107j470l966K971K271N330N612j436p454m769m08r23
$$ y = [-1548, -14930, -18520, -9203, -4163, 3179, -2068, -5521, -4759, -4762, -11066, -6226, -6521, -3520, -1879, -2722, -7887, -7872, -11472, -6022, 3496, 8393, 2865, -9013, -18769, -18085, -7926, -396, -1009, -13841, -12694, -9883, -4203, -378, -3759, -8832, -4873, -4003, -6254, -10255, -11001, -9257, -10580, -16010, -14667, -12520, -9897, -3011, 3237, -137, -1349, -3847, -3197, -5752, -8953, -7895, -5213, -9033, -7806, -12856, -13527, -13349, -14060, -12283, -6724, -5328, -4342, -11918, -16463, -15352, -10589, -6713, -2782, -5777, -5407, -5568, -4503, -8881, -16137, -12379, -11792, -9663, -6191, -6539, -3089, -2552, -5774, -4980, -3174, -4411, -10472, -15890, -8092, -7138, -10834, -14900, -8708, -10303, -5594, -635, 7213, 6079, 3381, 2259, -186, -4072, -3787, -6140, 3015, 8460, -464, -4571, -6041, -10007, -7036, -4765, 565, 6177, 4741, -2713, -7482, -7890, -8813]
15433h813l867N2l417M935K670p838K702j778m51O495o59j983j322L526L358K677
15417c713k863o18L014K84j510Q39j1457J066L548M158l087l403k549L592L275
15402i424K875k491k331K16k300q580J723P203L394q58N222P948j113r743p343
15387a5602k927l560J11N564N348m648L574J099L343N761o060L602J973j805m673
15372h900j42o02P88K28l995M481N673k309j490n052k663J568L21N204J358j962
15356g494k387L47M98j29l76L946L263J188j686r567J068M107L131O396N265l415
15340D155m638n727J463N316J765m185J171m273m84R37l227n326M282K247l020
15325i544k396K894L818O617L256l407k907m534q895K147J3526O679o771q313
$$ y = [-8813, -12680, -12628, -16045, -11110, -8440, -16278, -13576, -15354, -15805, -9310, -9969, -11952, -13274, -9748, -6390, -3713, -6576, -7194, -4180, -3896, -5406, -4567, -16024, -14958, -11410, -7252, -10339, -13742, -16291, -12699, -9424, -6549, -9040, -11371, -11155, -13455, -22035, -20312, -13109, -9715, -10573, -5351, 2597, 1484, -8259, -15602, -18529, -22089, -21978, -16414, -11066, -15714, -12140, -11041, -7698, -1937, -7997, -4395, -2422, -4227, -8900, -9042, -9644, -8856, -8628, -12623, -8142, -2469, -4778, -6268, -11320, -13983, -12415, -12094, -6890, -5532, -7494, -9881, -9534, -9036, -9165, -9541, -5595, -2332, -1144, -2830, -12397, -11329, -7222, -4091, 2305, 7570, 4155, -483, -6210, -4747, 569, 2334, -1851, -680, -4953, -5437, -4500, -7727, -13053, -8771, -6524, -9544, -11940, -9046, -5228, 1389, 4645, 1238, -1669, -6203, -15098, -12951, 575, 7254, 483, -7830]
15311g830L668N228j2644j8800Q611L9928L0243k11j0208l3521l8644j0071J4545
15298b9706K1517O407n461P430K906l536p894n007K423P981Q10k934p482R24K444
15283i178J28j316l226J529K701M829L134l182l612P622O374j1481p002L334J554
15268g792R72O46L453M563J356n176o592K00L472K34n905j152n38L843L358P03
15252d355L15M003k074o797n524J286L221O018M730J2059J2300J4149P003k696
15238D3638q160j2818q823l5Q877J4426L2496L3927J5001r599l3090k6456p716
15225D1668k156J935J5085L1610L1413K363k4933k9617j7526j0175j0301o535
15213B2831l831J1073J0601N842m452j4244r120o120q042q944j737l710p15P65
$$ y = [-7830, -4162, 1066, -11578, -30378, -21767, 18161, 48404, 48193, 37985, 4464, -34180, -44251, -29706, -8189, -1782, -7243, 187, 3093, -443, -8337, -13344, -10921, -2940, -2130, -5064, -12546, -11622, -9178, -9050, -10366, -13592, -12063, -9362, -4533, -1399, -4581, -8193, -571, 5803, -5678, -12680, -9346, -7792, -6820, -6174, -2721, 1842, 3198, -1978, -8570, -8370, -4898, -4664, -10569, -11721, -12259, -8416, -5058, -4355, -4040, -37, -2111, -8908, -14432, -13146, -9925, -3907, 823, 12882, 25182, 39331, 46334, 43638, 35478, 22660, 13837, 13802, 22679, 37105, 69601, 103528, 118529, 108930, 75840, 49384, 41668, 39512, 41447, 56532, 88142, 119555, 121918, 96985, 67368, 49842, 39667, 29366, 22831, 19000, 30073, 40674, 46516, 42064, 27820, 18700, 12580, 4538, -4406, -6143, -9853, -10568, -9803]
15199i803L267j886M029J757j794J308l35l899k817M542j616k959P372L276l92
15184E0J974n744q545o181J75L379J224QK769J759m972K380J158m939N187K087
15168h231j656N558l91j857L166N154k125k637J560J736M04m918O55l851K976
15153d457L877o870k109J102L549m447k807N477Q77q364l275Q584R922j813j886
15138b640k612j848M165L237Q135K027Q820J2829l974q092j1032k881q25P686
15124A2995J5551K2729K4660J6541m308j6957k3458j4881j508K091J0538J5798
15112E9791K5617R480p490j8829k0325j0372o658q350k221N432Q421P230o794
15099C4932j0744j8385r787K809p06p471nm127n462K450N558K106j917o103l195
$$ y = [-9803, -6536, -8422, -4393, -2636, -4430, -3122, -3457, -7356, -10173, -5631, -7247, -10206, -2834, 442, 50, 2024, -3720, -12265, -18446, -18271, -14892, -13668, -13660, -10891, -9132, -14104, -11724, -10566, -15505, -10318, -8231, -9887, -4329, -4720, -6577, -3411, 1743, -382, -3019, -1459, 277, 681, -4237, -3582, -7433, -4457, -580, -7450, -9559, -8457, -4908, -9355, -12162, -6685, -5808, -14172, -17447, -8863, 1059, -754, -2640, -5252, -7100, -2935, 302, 8437, 10464, 19284, 32113, 28139, 20047, 9015, 6134, 5309, 12995, 28546, 51275, 75935, 92476, 88168, 71211, 47753, 32872, 31364, 33455, 43993, 59791, 85408, 94888, 87398, 68569, 48244, 37872, 31214, 22864, 20643, 26075, 34496, 41726, 34932, 24188, 5803, -3984, -1175, -1881, -9352, -9357, -13484, -18946, -16496, -10938, -8832, -10749, -16852, -20047]
15084b0047L110O467j14o32N719J751L528j055n160P391M37j084j099k767k60
15069c815m189m228p52n18k689O816O702M390O61q589j408l235j259o9K16L877
15053h089M243N913M251M101J813k571K261J5317J4286O16n062l780n8K837J1996
15038D8074K1055L3243L0136K488l5571l3034k0771q150P536J7690K4446K9195
15026A16337M764l0238l6199k0078j0274K232J0499R413k950p918q568m991l290
15013A8739l658k448k315o753J509p116j707Q20j647L778J668L843o592R15J406
14998D42n972n469J178J788l545o040J040m181K287J1193J2778K647o351n800
14984d005J692n124k109P950K7012L2834K4537k627j2966n635K0558N6989J11677
$$ y = [-20047, -16937, -10470, -10584, -11216, -5497, -3746, -218, -1273, -6433, 958, 1395, 311, -788, -3555, -3815, -8004, -12232, -12984, -13502, -16191, -9375, -2673, 1717, 2378, -6211, -7619, -10854, -12113, -12182, -11966, -8089, -3846, 2067, 6318, 10419, 12232, 9661, 11922, 27239, 41525, 42141, 37079, 33299, 33241, 36078, 48074, 69129, 102372, 132508, 134996, 99425, 66391, 45620, 37470, 45006, 62696, 87142, 116337, 121101, 90863, 54664, 34586, 24312, 26544, 37043, 46456, 43506, 35588, 27020, 22029, 18739, 15081, 12633, 10318, 3565, 5074, -2042, -3749, -2929, -4576, -798, 870, 4713, -1879, -964, 442, -5530, -10999, -9821, -8033, -11578, -17618, -16578, -20759, -18472, -7279, 5499, 8146, 1795, -4005, -2313, -7437, -9546, -1596, 25416, 58250, 82787, 80160, 67194, 61559, 82117, 139106, 250783]
14971B50783J91911J77667p1345k07158j37355p4582l4000j6509o139J1620K9861
14960A14754J3829j8954l2691k2093j2466j5366r029L902J0457R007j0183j1667
14948A9500n624k397o81m817n632P02j595l013j118p536m264M182J1371M879k620
14933A337p539p780o286r2Q578L167J909r30J356P658P571M169J629m222n398
14918E127p450r012p295m430m191K314J1533N720O391k408k718k169K359r15j241
14903h385m057n066Q47k929K312J1675L772j242l930k054N300L063L828J475m522
14888H7n475m131p540r381Q735J0510p338p347q05O810P764K096L14n007j568
14873a2276J533J277L035L515R08L703O62J228J318r255r486R53K003L996Q69
$$ y = [250783, 442694, 620361, 549016, 341858, 204503, 129921, 95921, 79412, 73273, 84893, 114754, 128583, 109629, 76938, 54845, 42379, 27013, 17984, 21886, 32343, 41350, 31167, 19500, 13876, 11479, 10798, 5981, 349, 1051, -544, -3557, -4675, -12211, -16475, -12293, -922, 3957, 1337, -6202, -13982, -20268, -20360, -11782, -8615, -6706, -7636, -6280, 1378, 8949, 13118, 14747, 10525, 5127, -2323, -11335, -18630, -23060, -27251, -24937, -13404, -7684, -1293, -3701, -6419, -8588, -6229, -7144, -8385, -12442, -17508, -16661, -19590, -17278, -5603, -1831, -3073, -7003, -9057, -3757, -694, 3134, 4609, 87, -5388, -9519, -17059, -26440, -17705, -7195, -14533, -21880, -22685, -15875, -8111, -6015, -5701, -10708, -12276, -10743, -9466, -6431, -2916, -2008, 1695, 2357, 3585, 4903, -4352, -13838, -12885, -10882, -6886, -6017]
14858f017m762L890k494K118k985L61N040o87K195R31J077L899M139l510Q16O221
14842A0232L366l826q367n432r9r83l712K526M096m067m351K230P843L056m524
14827b012q649j277rQ23R94m177k745J537M935o37n128j660N27m51J923O617J1007
14810A618M239J732o807p716n542m676J448k360K775n6M661R23l836l043J973
14795a4667J228k681P899j273m032O315L301q75j939j082j525l909L030M688L6
14780e486L034O690r18o151Q537R57j3507n764J764j000K063L403l574O362k012
14765e602q909k290L646K907Q53J141n30m119K279j986k078L228K511m432n42
14750a3923M228J85m556J408K455n040o16L625K289K47L321k667k449L148j446
$$ y = [-6017, -10779, -6889, -9383, -7265, -10250, -9889, -4849, -5536, -3341, -2410, -1333, 2566, 6705, 3195, 4011, 10232, 13598, 9772, 1405, -4027, -4126, -5109, -8821, -6295, -2199, -6266, -10617, -8387, -544, 2512, -2012, -10661, -11938, -11947, -11124, -10130, -14307, -17052, -15515, -10580, -11217, -16345, -18005, -17478, -17929, -16006, -9389, 1618, 5857, 7589, 782, -6934, -12476, -17152, -15704, -18064, -15289, -15345, -10684, -9761, -13597, -16640, -14667, -13439, -16120, -8221, -9494, -13526, -7211, -3910, -4785, -6724, -7806, -9331, -13240, -10210, -5522, -5486, -2452, 4238, 3320, -2831, 5706, 6663, -6844, -12608, -10844, -11844, -9781, -6378, -9952, -3590, -5602, -14511, -16801, -13155, -10248, -9395, -8254, -8784, -12903, -10624, -12610, -14688, -11460, -8949, -13381, -13923, -9695, -9510, -14066, -12658, -10203, -15243, -15859, -12234, -9945, -9698, -6377, -9044, -11493, -8345, -9791]
14735i791l171o863o29N776K075N557K380n48M393L482p903L843J0743L046p151
14720E239o884q101k065J874j40N47J77J567N334J302q317l782L768J0842J317
14705B678l592q007m807O30L378J77j820N21J530m7n420J470L041L024L87n134
14689a1991N040O08p223O61m076l013O151J508M360M929J595q570L90L79J352
14674g900J92n8l182k639L195M136j429l633J03j135L379J821M808q170m112M080
14658a0544K295K076J053J334K84N27k35J752m855k290N892k881K74L183k702
14643d837j677L428m111l620l33K263j685n201M163R784l908j0063l521J097P03
14628a7518P859L431l693p619l07O88q88J475O937M405n901o097L67j409N284
$$ y = [-9791, -12962, -19825, -20454, -14678, -12603, -7046, -4666, -5214, -821, 2661, -5242, -1399, 9344, 12390, 5239, -1645, -9746, -11811, -9937, -10077, -9530, -9353, -7786, -2452, -1150, -9467, -13249, -9481, 1361, 2678, -914, -8921, -13728, -13098, -9720, -9543, -11363, -10842, -9312, -9359, -14779, -13309, -10268, -7244, -6857, -11991, -6951, -6343, -13566, -12905, -16981, -19994, -13843, -12335, -7975, -3046, -1451, -10021, -9631, -9252, -7900, -7708, -7766, -10948, -13587, -10392, -6256, -7685, -11318, -11215, -12350, -8971, -7150, -2342, -10512, -14624, -10544, -8249, -6173, -5120, -3786, -3502, -2975, -3210, -1458, -6313, -8603, -2711, -5592, -5318, -2135, -4837, -6514, -3086, -7197, -10817, -11150, -8887, -10572, -15773, -11610, -1826, -5734, -15797, -19318, -18221, -17518, -9659, -6228, -9921, -17540, -17847, -17159, -18047, -16572, -9635, -5230, -11131, -17228, -16861, -18270, -12986]
14613a2986l775P11P777L405j581LJ190L579K129k131l694j87L482L311k211n425
14597f403j1874o781L543M751O285R767k486q10J883j798o29n164p72q015m526
14582b3029J918l465K768n47O505Q674R894l12p372m828M342P75n607j478N52
14567a1210O327R51q04l617n580M885P416J821j588K56m53L072j0007n660J091
14552a3100M380K63k508L28K331O405J154o51m872n627L127m356n343m509L880
14537a9098O955M815n40m604L461K173P13J004m177j606J980L229k37n706R2l580
14521a5126o44J359N19R18R75L317M343m007J591m85j745M220q133m944j637k895
14505b2374J951Q128L782K794K20l579j712L270k359m551j311k120l065o11N429
$$ y = [-12986, -16761, -16050, -8273, -4868, -6449, -6446, -5256, -1677, 452, -1679, -5373, -5560, -2078, 1233, -978, -6403, -18277, -25058, -21515, -16764, -10479, -712, -3198, -4008, -2125, -3923, -4552, -9716, -10488, -18503, -23029, -21111, -24576, -21808, -22355, -15850, -7176, 2718, 2406, -4966, -9794, -5452, -4677, -10284, -11762, -11210, -4883, -3932, -4736, -8353, -13933, -9048, -1632, 189, -1399, -1143, -1596, 1476, -8531, -14191, -13100, -8720, -8457, -10965, -10637, -8306, -1901, -747, -1398, -6270, -11897, -8770, -13126, -18469, -22978, -19098, -12143, -7328, -7868, -12472, -9011, -6838, -6125, -5121, -9298, -10904, -8924, -5695, -5932, -11638, -11546, -15126, -15770, -14411, -13892, -12974, -11999, -8682, -4339, -8346, -6755, -7240, -8985, -4765, -12898, -17842, -19479, -22374, -20423, -12295, -8513, -5719, -5499, -9078, -10790, -7520, -9879, -14430, -15741, -17861, -20926, -21537, -16108]
14490a6108K034R227k417k018O623M350r078q854Q59j754p31j419J198O979K148
14475h961l435n965k161N218K248l328m91M133J493m000N49J521K607K015r57
14460i514N544O34m651k732j966j776L381R92j874J144K26j828n051N702L794
14445g975K20l008k793o91K073K057n191o534k0P848N460n123j451M426O216j155
14429e641j914o38N347o44j318O28j17m91J555n561m016M639k268n893Q704J226
14413f402q331k023K441N195k376j839m471j800N590P886M880j119j305j05K525
14398a254M36o600n984k050j127J0426R983J650o872J292l034p253k715j793l491
14383a8386m113L382O779N571K189J779j355k19L942j272k420o704l317O69L19
$$ y = [-16108, -14074, -4847, -7264, -9282, -2659, 1691, -7387, -16241, -15382, -17136, -17867, -19286, -18088, -11109, -8961, -12396, -18361, -20522, -15304, -13056, -16384, -16875, -12742, -11249, -15249, -14700, -13179, -10572, -8557, -9514, -3970, -3336, -7987, -10719, -12685, -14461, -11080, -10088, -11962, -10818, -10592, -12420, -17471, -11769, -7975, -7755, -10763, -13556, -14247, -12174, -10117, -15308, -21842, -21862, -14014, -8554, -13677, -15128, -10702, -4486, -5641, -7555, -8193, -2846, -3490, -4808, -4180, -4297, -4788, -3233, -8794, -12810, -8171, -10439, -16332, -7628, -6402, -14733, -16756, -14315, -9120, -11496, -13335, -17806, -19606, -14016, -6130, -1250, -2369, -3674, -3779, -1254, -818, -7418, -13402, -15452, -16579, -6153, 3830, 5480, -1392, -100, -3134, -10387, -13102, -14895, -18386, -22499, -19117, -12338, -6767, -4578, -2799, -4154, -4373, -431, -1703, -4123, -10827, -14144, -13475, -13156]
14368a3156O682n354J447M116NQ58r99M667J277n362r96M660n58l895P49J433
14352d426K14n427J663K304QL142O578K649k211l480o759m905K408K698J010l645
14336h179K072l120l291p49N698K598l556m715Q997J604l968J898J62K520n087
14321g116j09o88L661R97l732M780N73l598r88k280j006O67N329Q741l978l70
14305H83K354n290l798p752N50M345l01n762k321M270K835k399l443P010O802
14290b017k308p30l66r07M272M64J380l274k729k52M41N164j803O89m001m614
14274a0591Q33Q210N402l491k625j601q76j801m741K046M697K008o392n306K309
14259a1919k334k077j89N551M243L634m656j293m937P48p548M044P968J550l182
$$ y = [-13156, -6474, -11828, -10381, -6265, -6260, -5402, -6401, -1734, -457, -5819, -6815, -2155, -2713, -6608, -5859, -4426, -4212, -9639, -7976, -5672, -5664, -2522, 4056, 6705, 4494, 1014, -5745, -10650, -8242, -5544, -4534, -8179, -6107, -9227, -12518, -13267, -7569, -4971, -8527, -13242, -4245, -2641, -6609, -4711, -4549, -2029, -7116, -7225, -7913, -4252, -3255, -6987, -2207, -1634, -5232, -6220, -8500, -9506, -8839, -3510, 5231, 1253, 883, 3237, -2053, -5851, -13603, -13053, -8708, -9009, -14771, -17092, -12822, -9987, -12386, -15829, -8819, -2017, -4325, -5055, -5421, -6328, -2056, -1592, -212, -3486, -6215, -6467, -6026, -862, -2665, -1976, -5977, -10591, -9758, -1548, 3854, 363, -2262, -3863, -4739, -6540, -11281, -9235, -4538, -2530, -8922, -14228, -11919, -14253, -16330, -16519, -10968, -6725, -3091, -7747, -9040, -13977, -13229, -20777, -16733, -8765, -7215, -10397]
14244a0397k935L410O617N605l66m836j774j1276j844J0433K455n787n390N178
14230a0907K067K498Q2j007j176P192P320n178j068M902j551n363o107r76m730
14215a4002l075k872n437K382Q427R75L165k593m096M230N596K543L525k066k082
14200e380k118o71L071l282k794J489K436K844k474k01O319l039m915j961J0020
14185f56Q009o988r021j237M942k510q9l580j56J53k463o04K357M464K025l199
14169h553m365M03J0891J991l952l326j721J218n6O54J82L607J592K613j787p20
14153a329j40J706p229j405J835l740r888L711N195K681j993N038N911p75k93
14138g15n156P71J604j928P59P581n42j977n92j924q098j096N090K527l93L518
$$ y = [-10397, -13332, -9922, -3305, 2300, 1934, -2902, -4676, -15952, -17796, -7363, -4908, -10695, -16085, -10907, -8840, -6342, -6260, -7267, -8443, -1251, 6069, 891, -177, 4725, 3174, -2189, -8296, -9272, -14002, -17077, -19949, -25386, -23004, -14577, -13602, -10437, -13030, -17126, -12896, -7300, -4757, -1232, -3298, -5380, -7498, -8169, -5098, -8380, -11174, -9685, -7249, -4405, -6879, -7080, -761, -3800, -8715, -10676, -656, 7353, 365, -8656, -9893, -4951, -7461, -7550, -11130, -11286, -11133, -13596, -14200, -11843, -7379, -5354, -8553, -12918, -12515, -1624, 367, -3585, -6911, -8632, -7414, -7470, -6816, -6634, -3027, -1435, 1178, -609, -1329, -1469, 237, -6992, -8397, -6562, -10302, -20190, -16479, -11284, -8603, -10596, -5558, 353, -422, -715, -5871, -5100, -3496, -5424, -4665, 2916, 2374, 397, -195, -2119, -10217, -11313, -6223, -3696, -4089, -571]
14122e71M52j091K096k764j235N153L234p612k300K605n61J241K255K541m401
14107i58o099l163j902J0944N242m482o579n607K63P18k866L656O337J473m924
14092g947N27k590m680M066O708L897j1410j1189j219L398j626R588P686N063
14078B72J886j554M9k577o097n139J236l512K355K295J928j764M610J933p221
14063a1300k320j108L537J729j426k640o195q054N348L259M824j832K988l64K02
14048a3352m20R45N221Q32k884o004q630K717J0326N984n50j288M191r466N13
14033a1865O037p62l43K097j207j340p661l222L253M658K892O52N641m815q152
14018a4137M91K826J105M048L194k612o40l311q77k638N439R009p320l907j892
$$ y = [-571, -119, -1210, 886, -1878, -3113, 2040, 5274, -2338, -4638, -2033, -2594, -1353, 902, 3443, -958, -7057, -10220, -12122, -1178, 4064, -418, -6997, -12604, -12341, -11623, -14489, -10833, -4496, -3023, -7947, -7420, -10010, -14690, -10624, -3916, -19, -11429, -22618, -23837, -20439, -22065, -12477, -4791, 272, 2158, 604, 653, -1924, -8021, -13160, -11924, -15436, -13081, -10786, -8858, -10622, -6012, -4079, -11300, -13620, -14728, -11191, -9462, -10888, -13528, -19723, -27777, -22429, -19170, -14346, -16178, -13190, -13554, -13352, -13772, -12827, -7606, -6774, -9658, -15662, -24292, -21575, -11249, -5265, -5815, -7103, -2912, -12378, -11865, -5828, -6590, -6933, -4836, -6043, -7383, -15044, -18266, -15013, -10355, -7463, -6811, -1170, -5985, -14137, -13646, -10820, -9715, -5667, -2473, -5085, -5725, -9036, -9913, -12551, -7112, 1897, -5423, -9330, -11222]
14003a1222l438j210O366q74l803K079M556l20k96L068Q642J120j040j930n301
13988c603o930j141L999O790N262L357o166p297k756o620J519M129M403m673o233
13973a5960Q209L372J431k791j193J435j923o515j437L710O699p378j1865M622
13959a9584O286N011M713R91P24p660m013P76M007K248O647O392l628m056l097
13944d243M63K66k42k982m3N93J048L447n016J849m681o363O503O509L235K141
13928B484o570l699M417N549k465l661P79N56M252J80m08o195J587M889M095o85
13912E105q00l081k831m021N868O599j2509m381J7k458R188Q700j632j415k206
13897A43M927M703j222l061k928j170L020R75q393L2L840O717J251J016k191N67
$$ y = [-11222, -14660, -15870, -9504, -10378, -14181, -12102, -7546, -7866, -8162, -5094, 3548, 4668, 3628, 1698, -3603, -10533, -11674, -7675, -885, 4377, 7734, 1568, -5729, -8485, -15105, -13586, -9457, -5054, -9727, -15960, -7751, -4379, -2948, -5739, -6932, -5497, -7420, -13935, -15372, -11662, -4963, -12341, -24206, -19584, -13298, -8287, -3574, -2583, -1859, -9519, -13532, -12756, -8749, -6501, 146, 6538, 2910, -1146, -4243, -3780, -3514, -3756, -6738, -6781, -6188, -5140, -1693, -6709, -4860, -9541, -15904, -9401, -2892, 343, 2484, -4086, -7785, -3368, 2181, -284, -3945, -3166, -2610, 1642, 1822, 1414, -4781, -3194, 1695, 5790, 5105, 4305, 1224, -1607, -5628, 240, 6839, -5670, -10051, -10034, -12492, -3304, 5396, 3764, 2349, 143, 5070, 9773, 8551, 5490, 2562, 1392, 4412, 5387, -3006, -2974, 866, 7583, 8834, 9850, 7659, 8226]
13881H226R76Q615P947J5070J2148K6961L8702L4986J1999k1066l5089j8608l807
13868H7060Q383L1828N4379O7212M0569m609m3296n8250m6653l5519j3501Q500
13856I6103K4295L6167K0284j8600m2613l4513k3908j7190m381O822P853L526
13844E3845J1493K2659L1916L4249J2945r547l2189k4296j2801K991K5770M8095
13832A65130N6841M7170R500l0585n8843n2685k9714j2486O90J6185K4799K0960
13820A56962n682l3188l5223k4782j9661j5560k953m860j3639j946N087j818K363
13807E100l300k983M652n091J542P756J249P09j489k021m023l11Q185k666p557
13792b48N677L892j461M824l411j0533n27K558n060L68n42o824J5K661L844m039
$$ y = [8226, 9202, 17817, 25764, 40834, 52982, 79943, 118645, 153631, 165630, 144564, 109475, 90867, 87060, 95443, 127271, 181650, 248862, 289431, 284822, 241526, 183276, 136623, 101104, 87603, 96103, 120398, 156565, 176849, 158249, 115636, 81123, 57215, 40025, 35644, 42466, 50319, 53845, 65338, 87997, 119913, 154162, 167107, 157560, 125371, 101075, 88274, 91265, 117035, 165130, 221971, 269141, 278641, 248056, 189213, 136528, 106814, 94328, 95018, 111203, 136002, 156962, 151280, 118092, 82869, 58087, 38426, 22866, 19913, 15053, 1414, -532, 4555, 2737, 5100, 1800, -1183, 3469, -1622, -80, 7676, 8925, 9634, 8145, 6124, 2101, 1790, 9975, 7309, -248, 5429, 9321, 7860, 12684, 9273, -1260, -1787, 771, -4289, -3921, -4463, -11287, -11272, -8611, -4767, -8806]
13776h806J279L339R13j618j72N299M659j423q571l736K120L364L910K241m425
13761a627k738r712m21O467N241N273J087k143n825M700j673l638r2O657j613
13746e7O95k921n46L008M38n440n111O54P418j757J484K702K219l960l544P66
13730c952L57K664J434K23L39r546L686p86k977n797k492Q728K3J8l716j678L779
13713i693j156o44N398J745n947J765M93K99M116L492L21M171N719j502m562p745
13697c730j74P21k364j089O253R367R893l996p163m128M88M446K400n119N80m941
13681A444K724N148L348o827k324J788j615o535k913J330N763L901l913n378l877
13666g936k887J336l143R96L341j930K167L94k498K444Q989K676J031J070l402
$$ y = [-8806, -7527, -4188, -3275, -4893, -5065, 234, 4893, 3470, -5101, -8837, -6717, -3353, 557, 2798, -1627, -4365, -14077, -14498, -8031, -2790, 2483, 3570, 1427, -4398, 302, -1371, -5009, -5101, 1556, -57, 638, -2283, -2829, 179, 617, -4823, -9934, -9280, -1862, -3619, -2135, 567, 2786, -1174, -4718, -3952, -3595, -931, 503, 726, 1065, -8481, -4795, -5581, -8558, -14355, -16847, -8119, -8096, -8078, -11794, -13472, -9693, -10849, -11493, -6095, -4350, -10297, -8532, -8039, -7740, -3624, -132, 189, 4360, 10079, 8577, 4015, -3730, -3904, -3183, -5547, -6636, -383, 8984, 18877, 14881, 7718, 3590, 4078, 8524, 10924, 5805, 6385, 1444, 4168, 9316, 12664, 5837, 3513, 5301, 3686, -2849, -5762, -4432, 1331, 5232, 1319, -4059, -7936, -10823, -9487, -12630, -11634, -8293, -10223, -8056, -7662, -10160, -7716, 1273, 3949, 4980, 6050, 2648]
13651B648m531K830K79p06J121m51L676o418p177m317P168J917K626K437J988
13636C090M869j172o979p886m018N588J871r569K156L999L895K346J0372N745
13622A4307o317q750k97k327k789k662j913L488k030n663O011J0551M092j200
13608D501q50K5q409o504P762J0402l039k225Q05Q71l602m757k598N096J426m157
13592e253K786n84n441O542R385l708p131k555L883J009l091J257L798o407j0194
13577a5704l805O284N156N440L286r732k142M907J448Q6L190m125p07Q089P928
13562I599o334l616l867k656n57q036r73Q272N321L187k849p07J604M15m728N902
13546b3L189l514Q41N619L379M38k783L699L879m177j758l32L154n12k634k067
$$ y = [2648, -1883, 947, 1226, 520, 1641, 1190, 4866, -1552, -8729, -13046, -5878, -3961, -1335, 1102, 3090, 7959, 6787, -192, -8078, -12096, -6508, -4637, -14206, -12050, -8051, -4156, -1810, 8562, 14307, 7990, -760, -1057, -3384, -6173, -8835, -10748, -7260, -9290, -14953, -8942, 1609, 5701, 4501, 3651, 3676, -4733, -11237, -3475, 6927, 3888, 1663, 2468, 3339, -263, -5020, -7618, -2522, -1096, -5253, -2467, -3051, -8492, -1950, 7435, 3727, -3404, -5959, -2076, -1067, -4158, -2901, 897, -5510, -15704, -19509, -13225, -8069, -2629, 657, -9075, -11217, -6310, -4862, -4776, -1586, -5711, -6418, 1671, 9599, 3265, -351, -4218, -6874, -7431, -15467, -16440, -8168, -2847, 340, -2509, -3216, -1612, -1197, -5925, -23, 3166, -348, 493, 6112, 9491, 9929, 7146, 10845, 14724, 10547, 8789, 8457, 11611, 11099, 8465, 6398]
13530F398r76pL286q60J843K26M58r41K014J5811J1321P474R668K2074L0565L4978
13514A43332L2585J7287j031j0105l1278k9598k0582j3476j0894j2092q187n154
13502E0807j0137k068o018o611l166J655K042P080N111L821Q974J3430J0703P270
13488H2893M027j569o115K626n28q726n473r68K656J2553K3094M3781N1523O1106
13474B60880O1640M9619K6795p554m2229n5838o4792n9228m0853j9299j5710j1683
13462H1748j4434j3193q529k16R33j482N766J0836j214Q62J2454Q545K2287K6539
13448A30902K8323J6174l452k0503k8657k8290k1431n697L852K438K242J0102
13436H6003J4080J6083K4102K8294K2751J1259o562j7293l2867l2919k4901j3407
$$ y = [6398, 5422, 5415, 8701, 7841, 9684, 9910, 10368, 9427, 11441, 27252, 38573, 46047, 55715, 77789, 108354, 143332, 175917, 193204, 192173, 182068, 150790, 121192, 100610, 87134, 76240, 64148, 55961, 50807, 40670, 38602, 32584, 25973, 22807, 24462, 26504, 33584, 38695, 42516, 51490, 64920, 75623, 82893, 86920, 85351, 79236, 81862, 81334, 72608, 67135, 66167, 68823, 81376, 104470, 148251, 199774, 260880, 322520, 372139, 398934, 391380, 349151, 293313, 228521, 169293, 128440, 109141, 93431, 81748, 67314, 54121, 45592, 45376, 46309, 44827, 50593, 61429, 60215, 61077, 73531, 82076, 104363, 130902, 159225, 175399, 171947, 151444, 122787, 94497, 73066, 67369, 71221, 73659, 75901, 86003, 100083, 116166, 140268, 168562, 191313, 202572, 196010, 178717, 145850, 112931, 88030, 74623]
13424G4623L36j2087r779p381p490m336k02j891j633k010l474N67J1807P358O406
13409E0814P763Q550N133O719L105j495o127j2666j0991j4669o433k983k573J86
13395B4333p902l201K004J535k938m12K29q32R32n119m852J784P338L20L042o474
13379I787k390K293l709k614J851o22l09l349M175L851L483J237l867m975k276
13364B566M296l91K526r34R40K986J259L565K708o616m167l423K624N002K127
13349A5068N555M918o328j0Q064n548m232l725L999m871m60R993L361j1567q112
13334F105m057n132k20M236Q09M882Q700Q683j819q507m466p024k919L533l453
13319f49P308J5163M213P385J334O695M027m242j116j43o023k993j577m095K822
$$ y = [74623, 74959, 62872, 53093, 45712, 38222, 33886, 33684, 31793, 30160, 28150, 24676, 25243, 37050, 44408, 50814, 58577, 67127, 72260, 78979, 82084, 80589, 74462, 61796, 50805, 36136, 29703, 26720, 24147, 24333, 16431, 13230, 15234, 16769, 13831, 13419, 13648, 12816, 13748, 8629, 3777, 5561, 12899, 13219, 16261, 9787, 7397, 9690, 5981, 3367, 5218, 4596, 4287, 938, 5113, 8964, 12447, 13684, 9817, 4842, 2566, 6862, 6471, 8997, 8063, 9003, 11989, 13248, 16813, 19521, 12905, 8738, 5315, 7939, 12941, 15068, 20623, 25541, 19213, 19203, 27267, 21719, 17487, 13762, 17761, 12890, 12430, 22423, 25784, 14217, 6105, 2048, -3084, -3304, 932, 1741, 6623, 15323, 24006, 22187, 13680, 9214, 2190, -729, 2804, -649, 6659, 21822, 26035, 33420, 34754, 41449, 45476, 41234, 40118, 39975, 33952, 30959, 29382, 25287, 28109]
13304B8109R65k871l806j394M594o30p222k214n360J64J964j136k453j006O573
13289A4277k15L732M656m685L117K01l956M83O565P743Q540P714R092R736J3009
13274H0009P468L001p71q682j2720o069q618j0611p918j704K857l07N36L873M863
13259D5207n573j478k725N520O351J013j451k022p28n980K108Q918j803m623m498
13244C8236k237m262r30K54O681M668l404M915J3168R311M335L862P182k407j0897
13229F8475q147j2095j3200k696O071J666k988M817L955J0489J1259L542O639
13216G7787P857k60N42M281K40p28j704k733l733m113m077m360l044K331M209
13201G2495Q323K663N459P651J3365J5621J5970L4520L5085M5391O3722J02637
$$ y = [28109, 29074, 26203, 22397, 21003, 25597, 24967, 17745, 15531, 10171, 10335, 12299, 11163, 8710, 7704, 14277, 14062, 17794, 22450, 17765, 20882, 21083, 17127, 17610, 24175, 31918, 40458, 48172, 57264, 67000, 80009, 87477, 90478, 89707, 81025, 68305, 62236, 53618, 43007, 35089, 33385, 36242, 35935, 36471, 40344, 45207, 39634, 38156, 35431, 40951, 47302, 48315, 46864, 44842, 44114, 38134, 40242, 49160, 47357, 42734, 38236, 35999, 31737, 30807, 31061, 37742, 42410, 39006, 43921, 57089, 66400, 70735, 74597, 81779, 79372, 68475, 60328, 48233, 35033, 32337, 38408, 40074, 37086, 41903, 45858, 56347, 67606, 71148, 77787, 85644, 85384, 85926, 90207, 90447, 89719, 88015, 85282, 81549, 77436, 73359, 68999, 65955, 68286, 72495, 80818, 83481, 88940, 96591, 109956, 125577, 141547, 176067, 211152, 256543, 320265, 422902]
13189D22902J67342K75275M17419M72057J42555l59179m72475l37249k12510j34656
13179C81481q6648n1904l2679j9633n361j99M613j3253j7516j3492k0805j7097
13167A07507k239K8j041M706K493M600J261j0379j0077J166P985j689j838K257
13153A04740J7173J2054J0387J1303J2613J0055j2449k8165k0648j2472K139Q95
13141A07625n726j61M377K508O561K829l392m733L326N791k588l568N504R387
13127A27740m2P28m638J172J227N27L387L424J3474J6019J4087P494M696N733
13113A95028M476R949N957M981J7253J2061M570K988n696k284O439J1819J1593
13100B79134J5609K1089K3014K5747K0058J2540J3538O104J786P228J8625K9843
$$ y = [422902, 590244, 865519, 1282938, 1754995, 1897550, 1538371, 1065896, 728647, 516137, 381481, 294833, 242929, 210250, 190617, 185256, 185057, 189670, 176417, 158901, 145409, 124604, 107507, 105268, 105296, 104255, 108961, 111454, 116054, 117315, 106936, 96859, 98025, 106010, 104321, 102483, 104740, 121913, 133967, 144354, 155657, 168270, 178325, 165876, 137711, 117063, 104591, 106730, 107625, 101899, 101738, 106115, 108623, 115184, 118013, 114621, 109888, 113214, 119005, 116417, 112849, 118353, 127740, 127698, 128426, 123788, 124960, 126187, 126714, 130101, 133525, 146999, 163018, 177105, 184599, 189295, 195028, 199504, 209453, 215410, 220391, 237644, 249705, 254275, 257263, 251567, 249283, 255722, 267541, 279134, 294743, 315832, 338846, 364593, 384651, 397191, 410729, 416833, 418619, 425847, 444472, 474315]
13088D74315M0791M6500N4242M9828O1540Q1904R2904R2512J16368J54796J70832
13077A436532K06921K45246K71211L18149L87481M90254O53135Q80292J214105
13068F103326J741618K567418L798331N398121O903179P279348N455692J465652
13060D0712685l060957o053391o749313n858373m434083l161494k233426j606135
13052G555513j190093q92896o63956m90443l63976k85411k28632j76348j17210
13043C146548o9320k1226J9887O9393J29434J99072K80145L70343M49839N18968
13033E093083O05854P54932R66437J286224J769525K506161L662932N478800Q236443
13024C0360391J1893470J5337543J6096613J1607340K064037q384388j4783144
$$ y = [474315, 515106, 561606, 615848, 665676, 727216, 809120, 902024, 994536, 1110904, 1265700, 1436532, 1643453, 1888699, 2159910, 2478059, 2865540, 3355794, 4008929, 4889221, 6103326, 7844944, 10412362, 14210693, 19608814, 26511993, 33791341, 39247033, 40712685, 37651728, 31598337, 24849024, 18990651, 14556568, 11395074, 9161648, 7555513, 6365420, 5472524, 4808568, 4318125, 3954149, 3668738, 3440106, 3263758, 3146548, 3077228, 3056002, 3075889, 3145282, 3274716, 3473788, 3753933, 4124276, 4574115, 5093083, 5698937, 6453869, 7420306, 8706530, 10476055, 12982216, 16645148, 22123948, 30360391, 42253861, 57591404, 73688017, 85295357, 87359394, 78975006, 64191862]
13017F4191862j5598184j2835734r213818o264613m286593l037749k213605j655326
13009I086240j251236r56397p54919o21303n23847m51635l78599l01341k33792
13000C613171j76103j10871l8947K6168P7352J38366J96794K48162L04428L81682
12990D660202M96274O86418R61149J390477K032933L011045M415623O091447P378919
12981C1124487P158827M526254o3120m641999p230712p344140n991216m347189
12973A3191192l019381k103619j507764j123557q61069o67774n20123m24404l67580
12964B595921l17764k73669k29328j79974j46957j14360r8238r8057q5410p1129
12954I81035n7606n4356m1888m0641l7848l3422l1680l3228m0011m1190l6666
$$ y = [64191862, 48593678, 35757944, 26544126, 20279513, 15992920, 12955171, 10741566, 9086240, 7835004, 6878607, 6123688, 5502385, 4978538, 4526903, 4148304, 3846963, 3613171, 3437068, 3326197, 3287250, 3313418, 3390770, 3529136, 3725930, 3974092, 4278520, 4660202, 5156476, 5842894, 6804043, 8194520, 10227453, 13238498, 17654121, 23745568, 31124487, 38283314, 42809568, 42746448, 38104449, 30873737, 23529597, 17538381, 13191192, 10171811, 8068192, 6560428, 5436871, 4575802, 3908028, 3387905, 2963501, 2595921, 2278157, 2004488, 1775160, 1595186, 1448229, 1333869, 1235631, 1137574, 1052164, 981035, 923429, 869073, 827185, 786544, 748696, 715274, 683594, 650366, 610355, 569165, 532499]
12943E32499k9437j1598Q531J582j0911j7928k3620k3861k1624k9574k2608k1667
12931C29784j6326r706j0544q282r344o016j110N286o8j000n247k81N533n204
12917B67475J2919J9757M759j3166p305l441r756k6450l1503k3865j7430l787
12905A68207j982N272L998K869R125N435J7124K5877J5943k788j1355j2564q977
12892B16184j3615r672k171r50K944j626q510q973o669p163Q365K3155L3665K9559
12878B54523J196k2311k7372l1390j7562r779J084K881K727n803m46O394N433
12865A59575L533k823R973P240Q358Q078N550J4200K3280M3273O5802J06211Q9413
12852E41663m6545j35000j47278j01325l6875j165N081L519j416k729L500M363
$$ y = [532499, 503062, 491464, 499995, 501577, 490666, 472738, 449118, 425257, 403633, 374059, 351451, 329784, 313458, 303752, 293208, 284926, 275582, 269566, 268456, 273742, 273674, 272674, 267427, 267146, 272679, 267475, 280394, 300151, 304910, 291744, 284439, 280998, 271242, 244792, 213289, 189424, 171994, 168207, 166225, 171497, 175495, 178364, 187489, 192924, 210048, 235925, 251868, 249080, 237725, 225161, 216184, 202569, 192897, 190726, 189776, 192720, 191094, 182584, 173611, 166942, 159779, 168144, 191299, 224964, 254523, 255719, 233408, 206036, 174646, 157084, 147305, 148389, 151270, 153997, 148194, 147748, 154142, 159575, 163108, 160285, 170258, 177498, 185856, 193934, 199484, 213684, 236964, 280237, 346039, 452250, 541663, 495118, 360118, 212840, 111515, 74640, 73475, 78556, 82075, 80659, 77930, 81430, 85793]
12840H5793J69N252M535K116m827J769M267K656J4622R858n443j1335q11Q955
12826A17576Q969l574J530J0138J3053J2899J9370J007q513k993o549r380L532
12813A57065J4282J4947L94l910p723j6714n129P722J4680K9380J6569J332q19
12800B22076N120J1773Q103N680j13N982L625J0208N537m015K383J4973L0497
12787C21829K0752N788R491L1625L4517K1933J4206K3792K5733K2370J1121Q764
12775E51921L321J4329L0418L4436N2245L5148J7316P157J0807K1587L8325O7791
12763H84801R9269R3895Q1633N8868M8709L7407K6319K0038K5494O0176J11926
12752A548535J73112K09534K16472K44938K94001L30425L48751L38886L52249
$$ y = [85793, 85962, 91214, 95749, 97865, 93038, 94807, 99074, 101730, 116352, 126210, 120767, 109432, 108621, 117576, 126545, 122971, 124501, 134639, 147692, 160591, 179961, 180968, 172455, 169462, 162913, 153533, 157065, 171347, 186294, 186688, 182778, 175055, 158341, 153212, 160934, 175614, 204994, 221563, 222895, 222076, 227196, 238969, 247072, 252752, 252639, 258621, 262246, 272454, 277991, 273976, 276359, 291332, 321829, 342581, 348369, 357860, 389485, 424002, 445935, 460141, 483933, 509666, 532036, 543157, 551921, 555242, 569571, 599989, 634425, 686670, 721818, 739134, 746291, 757098, 778685, 817010, 884801, 984070, 1077965, 1159598, 1218466, 1267175, 1304582, 1330901, 1350939, 1376433, 1436609, 1548535, 1721647, 1931181, 2147653, 2392591, 2686592, 3017017, 3365768, 3704654, 4056903]
12743D056903M64263O31221Q09868J026439J337213J785475K211091K198531K025067
12734A6546071K532978L827350N866482R066625J4269492K2826417L8250409O5168002
12726A78353826R6400625Q7596046n013624r2957163r2089854n8655281l4634248
12719G9000327k1225253j3742748r460734o840789m962478l409355k249840j886301
12711A5222829k099844j975516j538261j175139r25226p87798p29168o50596n16907
12702D824374l85994l21102k84823k58660k15860j83092j82849k02464k00146
12693B589384j98751j83369j27726p7711l1833k2192q7028j43282j28481j00742
12683A488269j02970j04447r8901q3745o3803m5763k5224k2929l7712n6099m5868
$$ y = [4056903, 4521166, 5152387, 5962255, 6988694, 8325907, 10111382, 12322473, 14521004, 16546071, 19079049, 22906399, 28772881, 37839506, 52108998, 74935415, 113185824, 178353826, 274754451, 362350497, 357336873, 264379710, 172289856, 113634575, 79000327, 57775074, 44032326, 34571592, 27730803, 22768325, 19358970, 17109130, 15222829, 13122985, 11147469, 9609208, 8434069, 7508843, 6721045, 5991877, 5341281, 4824374, 4438380, 4117278, 3832455, 3573795, 3357935, 3174843, 2991994, 2789530, 2589384, 2390633, 2207264, 2079538, 2001827, 1969994, 1947802, 1860774, 1717492, 1589011, 1488269, 1385299, 1280852, 1181951, 1098206, 1034403, 988640, 963416, 940487, 902775, 846676, 800808]
12672H00808l2964l3855k4706j0283j6700k6460r502j0290j3214j4686n812q449
12660E93887L064j1378k2138k5002j7206j8443k0426j5735j5983p055n488l778
12648D34319p323j5034p071L811O911M285l65j2400k4030k0807j6332r074P643
12635C44533O969m808j9240j9920j6998j4049n446j147Q234L661o35m567l120
12622B73467o108p538o699o420l609M404J5484J0850J3536Q666K278J444N151
12609C04906P943K888J0160J5018K7908L8960M4345M0438L7460L4587K357j15616
12597D51354k09077j22644j1636J7903J5688Q373Q19j45l871M113P06q124q227
12584A35232p319r168j775K279M811Q130J295M276J548m102j8663k2249k3711
$$ y = [800808, 767844, 733989, 709283, 699000, 682300, 655840, 646338, 636048, 622834, 608148, 602336, 593887, 596951, 585573, 563435, 538433, 521227, 502784, 482358, 466623, 450640, 443585, 438097, 434319, 426996, 411962, 404891, 408702, 415613, 419898, 419533, 407133, 383103, 362296, 345964, 336890, 344533, 351502, 346694, 327454, 307534, 290536, 276487, 271041, 269894, 278128, 281789, 281154, 276587, 273467, 267359, 259821, 253122, 246702, 243093, 247497, 262981, 273831, 287367, 296033, 298311, 299755, 304906, 312849, 315737, 325897, 340915, 368823, 407783, 452128, 492566, 530026, 564613, 566970, 451354, 242277, 119633, 107997, 125900, 141588, 149961, 150780, 150635, 146764, 150877, 151583, 143459, 135232, 127913, 118745, 116970, 119249, 124060, 132190, 133485, 137761, 139309, 135207, 116544, 94295, 70584]
12571G0584j0147J6352L7873M9398M8227M1985M1750M8150N5696N2919K2500j2320
12559D62967m4132n4164n9845n1987l1517l2164k9045j7730r717J199M961K631
12547A41457L047m550Q83P02j882r679j2425j7488k5179j7262j1554j7775q449
12534A9846q949J2233K7084J8961J4632R658J2072P850J2255J8514K4122L4158
12522B02436M0197L7331J4208j1941k7288l0388k7447k2218j8710j3026j6930
12511A26224j9084k2753j3869n804N526J1978K478j0331j2921p695m433Q79N7
12498E0252N189p31R116J304n582m256p630k936M144J5899J3975O505j2253k1722
12484E1274q059j134L277J890K558J316n080P77j913Q366J2981O840k654Q650
$$ y = [70584, 60437, 76789, 114662, 164060, 212287, 254272, 296022, 344172, 399868, 452787, 475287, 462967, 418835, 364671, 304826, 252839, 221322, 189158, 160113, 142383, 132666, 133865, 138826, 141457, 144504, 139954, 140837, 141539, 139657, 129978, 117553, 100065, 74886, 57624, 46070, 28295, 19846, 10897, 23130, 50214, 69175, 83807, 93465, 105537, 113387, 125642, 144156, 168278, 202436, 242633, 279964, 294172, 282231, 254943, 224555, 197108, 174890, 156180, 143154, 126224, 107140, 84387, 70518, 64714, 70240, 82218, 84696, 74365, 61444, 53749, 49316, 50195, 50252, 55441, 54710, 63826, 65130, 59548, 55292, 47662, 44726, 48870, 64769, 78744, 85249, 72996, 51274, 43215, 42081, 45358, 47248, 49806, 51122, 46042, 46819, 44906, 53272, 66253, 73093, 70439, 79089]
12470G9089M543K050l677q917j2701p507N625P118K401O338q521j7415j3164l144
12456C2118p582n244K602M444L579j902m806j3558j252N457k402l69P954M211
12442B3250N276J289q420N56L750j344k372N97L012L007N423M982l479m509p831
12427B3187q947j157R169Q274N001J3866K2943J3215q086j4803o567j832O092
12414F0355M425o779j2189j1888j3982j0728k77O277J2770N808O1K80q304r379
12400A6450j0713k844O413J137L053N209k317N317P830J044p183K958M550j738
12386B9166M53M026k438l490OK44j60n892o061j842P248N505n005j169P952O712
12370C5255l2m436n623l63o602N263j450K341J1837P591k164j6343l370K767k444
$$ y = [79089, 83632, 85682, 82005, 73088, 60387, 52880, 58505, 65623, 68024, 74362, 65841, 48426, 35262, 32118, 24536, 19292, 21894, 26338, 29917, 28015, 23209, 9651, 8399, 13856, 11454, 11085, 19039, 23250, 28526, 29815, 21395, 21951, 25701, 24357, 21985, 22582, 25594, 28601, 34024, 39006, 35527, 31018, 23187, 14240, 13083, 22252, 30526, 35527, 49393, 72336, 85551, 77465, 62662, 56095, 54263, 60355, 64780, 58001, 45812, 33924, 19942, 9214, 8937, 15214, 27984, 33792, 33853, 34133, 25829, 16450, 5737, 2893, 9306, 10443, 13496, 18705, 16388, 21705, 29535, 30579, 23396, 26354, 30904, 29166, 29619, 33645, 31207, 27717, 27723, 27967, 27807, 21915, 15854, 14012, 21260, 26765, 21760, 20591, 28543, 35255, 35223, 30787, 25164, 24801, 18199, 23462, 22012, 24353, 36190, 43781, 41617, 25274, 21904, 24671, 22227]
12355B2227q26m028k093J0680N902k76K541m671j378k397n20m815r805l834J675
12340H382P451P622P297L23o939m033p891l219L97L784M079R29m832K095M848
12325B0293L178L312P35m786L710O692k925o46n654k934M279l361n684O53J861
12310A8723n212l407n656n61P387j555J506L07J749J152J171J257J841K394n089
12295A6007k963k431j18M848m59J117q973p9L832R037J1480J2346N611l542m326
12280D1387p097q616O352K469Q211J4860J3810P226M315J661J0420Q957J3289
12267A17244J3074J0254J5897K5565N4526P5855R1190J41271K45231L91406M73950
12256A655463K47291k60431m88665l75217k35354j39869r7265o3521m8466l4726
$$ y = [22227, 21401, 17373, 15280, 25960, 31862, 31586, 34127, 29456, 28078, 25681, 25161, 20346, 10541, 6707, 8382, 15833, 23455, 30752, 31075, 24136, 20103, 12212, 8993, 9390, 13174, 17253, 18182, 13350, 15445, 20293, 23471, 26783, 27518, 22732, 26442, 33134, 30209, 29563, 23909, 20975, 25254, 21893, 16209, 16862, 18723, 13511, 10104, 4448, 3887, 11274, 9719, 11225, 11532, 13281, 14433, 15604, 16861, 18702, 21096, 16007, 13044, 10613, 10495, 15343, 14884, 16001, 7028, 6949, 10781, 19818, 31298, 43644, 49255, 45713, 41387, 34290, 25674, 32026, 34495, 42706, 57566, 71376, 78602, 82917, 84578, 94998, 103955, 117244, 130318, 140572, 156469, 182034, 236560, 312415, 403605, 544876, 790107, 1181513, 1655463, 1902754, 1642323, 1153658, 778441, 543087, 403218, 305953, 242432, 193966, 159240]
12246A59240k4688k0138k1338j3683j3591j0866n909n416j1343k10K760L994M573
12233D3385L346m69p149j1451n323L062O814o05p092k622k285m952J71K823n447
12218A2206l695M356J577l838L89O458n2l983l258j143L389o323K850J0436j549
12203A7820q907n045L052J0847Q244j788k161o797p760r61N972L853k141r982
12189D246j849k997M1k298K606J1338J436J361N829j093p79N20m959l673k67L235
12173A2697L490l319q238Q880P931m484m375L383L439K107M739R263M264L698
12159D3475R385K1689M4838O9858P5780J0481n7255o4853n2403l6069j9279r841
12147C5806n975o183q467k367k041q08l06K287K532l020j908p722Q299l128N739
$$ y = [159240, 134552, 114414, 93076, 79393, 65802, 54936, 49027, 43611, 32268, 32058, 34818, 38812, 43385, 46731, 46262, 39113, 27662, 22339, 25401, 32215, 31610, 24518, 21896, 19611, 14659, 14830, 17653, 12206, 8511, 12867, 14444, 10606, 10995, 17453, 17401, 13418, 10160, 9017, 12406, 6083, 8933, 19369, 17820, 8913, 3868, 6920, 17767, 26011, 24223, 22062, 15265, 7505, 6544, 12516, 16369, 14228, 4246, 2397, -600, -559, -2857, -251, 11087, 12523, 13884, 19713, 18620, 17841, 18361, 13402, 9729, 9462, 12697, 16187, 12868, 4630, 13510, 21441, 16957, 12582, 15965, 19404, 21511, 26250, 35513, 39777, 43475, 52860, 74549, 119387, 189245, 265025, 275506, 218251, 153398, 100995, 64926, 45647, 35806, 29831, 23648, 15181, 12814, 10773, 9965, 9659, 11946, 14478, 11458, 9550, 1828, 10127, 6999, 12738]
12132A2738J0502L29o155L379M0J754N685L669P06K319N998O888L267K794L812
12117E7725J5700J4791L3048O3239J06622J82283K44811J75351r9654k78006k08389
12106C07521j09089o1775l5238j9367j9339q936K763k759l153j142j740m348m710
12093C8688k299j496k455r319k143K072m689n02j628n62P37k283J710K342o07
12078A7566K606J2651J982J1027J5537R648J8161L2306N1237Q3808J54235K39955
12066F50719K44256K6470k43159k57632j48209q3495m5517k7201k4685j2308q752
12055G0487q024r817p117k671n262n933j1407m668m182k748L563O198N38m665
12041A4292J195l039j985J168L06j299p511j724n31R895N700J263K403P24R698
$$ y = [12738, 23240, 23569, 17414, 20793, 20833, 22587, 28272, 31941, 32647, 34966, 40964, 47852, 51119, 53913, 57725, 73425, 88216, 121264, 184503, 291125, 473408, 718219, 893570, 793916, 515910, 307521, 198432, 136657, 101419, 82052, 62713, 53777, 56540, 53781, 50628, 49486, 47746, 43398, 38688, 36389, 34893, 32438, 23119, 20976, 23048, 18359, 17857, 16229, 15667, 16404, 14121, 15831, 18173, 17566, 20172, 32823, 34805, 45832, 61369, 71017, 89178, 121484, 172721, 256529, 410764, 650719, 894975, 921445, 678286, 420654, 272445, 188950, 143433, 116232, 91547, 79239, 70487, 62463, 52646, 45529, 42858, 37596, 31663, 20256, 15588, 11406, 8658, 12221, 18419, 18957, 14292, 15487, 12448, 10463, 11631, 11937, 10638, 3127, 1403, 872, 10767, 16467, 17730, 20133, 20857, 30555]
12026C0555J3161J9163N1419P7569Q4306M0113m4849q9078p7081m2864k3932m338
12014C4144O47o282J065j33m073p694m258j525k970L813j286n570o314j437O296
11999D423P237o061q306p039N592N730K889n17l17k633L19k193j867q107r67N813
11983f004P9O593K717n45Q55m769l984Q276N620j924o920p650K754P749O866M643
11967A4356J39l928m802q351o69L704L424j808k777K194N376K58j699j638L176
11952F955k905k476L83J024l153k012j0572j901k136M614J876n65K67K218O243
11937b140K616k011L97k023K278k069J713k121N550O01l23Q099L336O19l12j687
11921A2523n316r969M866O539R09J028j052m030o192M165m651j080n442q015J145
$$ y = [30555, 43716, 62879, 114298, 191867, 276173, 316286, 271437, 182359, 105278, 62414, 38482, 34144, 34791, 28509, 29574, 29441, 25368, 17674, 13416, 11891, 8921, 12734, 11448, 5878, -436, -1873, 4423, 11660, 5599, -2707, -9746, -4154, 1576, 4465, 3948, 3631, 998, 1317, -876, -2743, -10850, -11817, -6004, -5925, 668, 3385, 2840, 3695, -1074, -5058, 3218, 8838, 6914, -6, -7656, -4902, 2847, 9713, 14356, 14495, 10567, 5765, -2586, -3255, 449, 3873, 2065, -712, 1482, 6858, 7116, 5417, 3779, 6955, 4050, 1574, 1957, 2981, -172, -2184, -12756, -14657, -16793, -12179, -10303, -10868, -10601, -8383, -2140, 476, -1535, -1138, -3161, -883, -2952, -1239, -3360, 2190, 2791, 2468, 10567, 13903, 14522, 14210, 12523, 7207, -2762, 2104, 8643, 9552, 10580, 9528, 5498, -694, 3471, -1180, -2260, -7702, -15717, -14572]
11906a4572J696K129O204N927O738N091r21q62m571n28N39k170n56m814k361L494
11890D63P449K191m015L02L68L608J97q998J887j231o290O41J926n693J083Q05
11874e307K1J964M209J120P15K299M706N954n086l874n950p912k602K336l16n737
11858a3460l738N583P673M986L531n183m041j547L565j7m964L359L502l83M862
11843C728m079o45J20j246m317m319N718J084k455J830R10L272J281m90m01l137
11827c146L526o72n513j578J661K654l681K659j637l796l97P84J259M30j405N038
11811c814K305n063n362J984J305K823K2m895l744N544l370r000k32R425J1038
11796a034P672P984N22l838l108n426l655K975l292l34l287l962O299K191O267
$$ y = [-14572, -12876, -10747, -4543, 1384, 8122, 13213, 12292, 11430, 6859, 6331, 6870, 4700, 4144, -670, -3031, 463, 7912, 10103, 6088, 6390, 6758, 10366, 10563, 1565, 3452, 2221, -4069, -3428, -1502, -7195, -6112, -5307, -5286, -3322, 887, 2007, 2722, 5021, 9727, 15681, 10595, 6721, 771, -7141, -9743, -7407, -7723, -13460, -17198, -11615, -3942, 1044, 4575, -608, -4649, -6196, -2631, -2648, -7612, -4253, -751, -1134, 3728, -351, -996, -876, -2122, -6439, -10758, -5040, -3956, -6411, -4581, -3671, -399, 882, 392, -9, -3146, 380, -292, -5805, -7383, -5722, -3068, -6749, -4090, -5727, -9523, -9920, -9136, -7877, -7447, -8852, -3814, -1509, -6572, -11934, -9950, -8645, -5822, -5800, -10695, -14439, -8895, -12265, -21265, -21497, -12072, -1034, 6638, 14622, 15144, 11306, 8198, 2772, -883, 2092, -1200, -1534, -4821, -8783, -2484, -293, 5974]
11781E974j996l781R30K082l735n135m455n861N735O905M820k56m949j851N713
11766A40R08Q72J912j185q223m049N582M859j255O29J23m708m032K64M466N819
11750B122j998m051q96J068K86o778N74J279m818l428k352N561O410N2L652p45
11734d062p337L468J1546n294K716K126L21j421J149J036k001O17M228k363K370
11719G099R56L375j638j146o824K65p60K557L133K414n414j4281l924L202m946
11704a5932L626K279J465J650J0125P52o631o263L263o51N501j063j613K372N292
11689D172n249q017J106N889K951M320N503J013l446L922l713m195m720j395o144
11674h003n137Q988K738j652l194l277L989P214O789O109R727j016n881k087p211
$$ y = [5974, 3978, 197, 1127, 3209, -526, -5661, -10116, -15977, -10242, -3337, 1483, 1227, -3722, -5573, 140, 1048, 1920, 3832, 2647, -5576, -9625, -4043, 816, -439, 190, 313, -4395, -8427, -8163, -3697, 2122, 124, -3927, -4823, -3755, -3469, -10247, -9673, -8394, -13212, -16640, -18992, -13431, -7021, -6969, -3317, -4062, -11399, -7931, 3615, -1679, 1037, 3163, 3484, 2063, 3212, 4248, 2247, 2864, 7092, 4729, 7099, 8055, 11430, 9792, 8646, 1822, 2087, 1327, 3884, 7017, 9431, 4017, -10264, -14188, -10986, -15932, -12306, -10027, -8562, -6912, 3213, 3965, -2666, -8929, -5666, -6317, -816, -1879, -3492, -1120, 4172, -1077, -9094, -7988, -2099, 852, 5172, 10675, 11688, 8242, 12164, 8451, 4256, -464, -1859, -8003, -13140, -4152, -1414, -3066, -6260, -9537, -5548, 1666, 8455, 14564, 24291, 23275, 17394, 15307, 8096]
11659H096o707m616l057n495n98n620K886M305L79R460P978m66k018l673J356
11644B210M047J10o882n231K628L267J265O504N716l488L75J412k641o607o916
11629d231j4874l195O792K578L198P934N233m9M237M796l056r990j882n8k451
11614e018j088M516p86j145j2494o322j07R436Q277K115N37l013r821l460P36
11599a7637M256Q26K211L978o645L920M929Q309O587l030o595k423m575R96Q570
11584C677J139n431j333k479J640r90k299M673J878m545j785m41j38J095m46m175
11568i960L686K057N266n22l102k104m448l143O120M282k093k638R2M999O772
11553E264N145K119m574m885j478l055k973l18k317O202L415P078j293l582n836
$$ y = [8096, 1389, -3227, -6284, -11779, -12377, -17997, -15111, -10806, -10427, -967, 7011, 6545, 4527, 854, 2210, 6257, 6367, -515, -5746, -3118, 149, 1414, 7918, 13634, 10146, 10521, 11933, 9292, 2685, -4231, -19105, -22300, -15508, -12930, -9732, -1798, 3435, 3386, 7623, 12419, 9363, -627, -2509, -2567, -5018, -6106, -1590, -2376, -3521, -16015, -22337, -22444, -13008, -4731, -2616, -2079, -5092, -14913, -18373, -17637, -13381, -12555, -10344, -6366, -13011, -9091, -4162, 4147, 10734, 7704, 1109, -1314, -5889, -4893, 3677, 4816, -615, -1948, -4427, -2787, -3777, -6076, -1403, 475, -4070, -5855, -6296, -6434, -5339, -5785, -9960, -6274, -4217, 1049, 527, -2575, -4679, -9127, -12270, -6150, -1868, -3961, -6599, -6507, -1508, 5264, 10409, 12528, 7954, 3069, 1591, -1464, -4437, -4755, -7072, -870, 2545, 9623, 8330, 4748, -1088]
11538a088j507K365l213m562J017j069J256j481m30J192K659l350O865N470k519
11523A605q841o263J208k078L040R894K632k050L196k449j707n215j156M750J71
11508c263l269NM543M07K113P45k015L148l166o888J189N607N750m440O16j225
11492a43L118M698j61L363n592q299J49P574K715P75q23O887J817J186K104J66
11476A9534j0237o406j734K871n420o378J742K929P83K489l906J832J502J238
11462H39J682m305l433O596k428j166R942r38J140K845k156R2M234M127L042q398
11446A1715m906L42K99m483o136Q090L300j609p78l385o327K629R23L148P127
11431I949l405ok81k509M248L565L781J0299K6818L6739L5231K624l9035k8555
$$ y = [-1088, -2595, -230, -3443, -8005, -6988, -8057, -6801, -8282, -8712, -7520, -4861, -8211, -1346, 4124, 1605, -7236, -13499, -12291, -14369, -11329, -1435, 1197, -853, 2343, -106, -1813, -7028, -8184, -3434, -3263, -6532, -6527, -1984, -1577, 536, 1281, -734, 2414, -752, -7640, -6451, -844, 4906, 466, 1082, -143, 2975, 7673, 7512, 10875, 5283, -3016, -2867, 4707, 7422, 8197, 7374, 14261, 16078, 17264, 19368, 19534, 9297, 2891, 1157, 4028, -1392, -7770, -6028, -3099, -2316, 173, -3733, -1901, -399, 839, 2521, -1784, -5217, 1379, -1049, -2215, 7727, 6789, 7929, 10774, 8618, 8710, 12944, 17071, 20113, 11715, 6809, 7151, 7450, 2967, -3169, 4921, 8221, 6612, 5834, 2449, -3878, -1249, -326, 2822, 9949, 6544, 6538, 6257, 3748, 7996, 11561, 15342, 25641, 52459, 89198, 124429, 127053, 88018, 59463]
11417E9463j2655j7592r867l946q006n898N08q084o83L463O26J507O448J836o428
11402F92N4M946J215j151p271K72K612L087m908O404O035m17l192K227m117k816
11386C672q64M304K26K423n651N345k299l452Q64J305k507L262J909j606r468
11371b537l230L075P478l27L674K588j550n466r424j191O549J430J1058M158o324
11356I961p300q963M915j430o447o42J1080M993k461o218J165n614L5J0082N171
11341H327J155n403j107m609m828N39M168O54p75p99r16M715N699j983j284k115
11325A438l828J332O76M158J899j240J01j492p73J147L014r688J155J0606k232
11310F273k56K394M661J172n396L509Q163K955K02R79l93r050q133o585n19N689
$$ y = [59463, 46808, 29216, 19349, 15403, 7397, 1499, 2007, -6077, -6760, -3297, -2671, -1164, 5284, 7120, 692, 746, 5692, 6907, 5756, -1515, -1243, 1369, 4456, -452, 5952, 11987, 11570, 8378, 10605, 6488, 3672, 2808, 7112, 7338, 9761, 4110, 9455, 7156, 3704, 4568, 5873, 3366, 6628, 8537, 6931, -2537, -5767, -2692, 4786, 4459, 8133, 10721, 9171, 3705, -5719, -6910, -361, 1069, 12127, 16285, 9961, 2661, -6302, -1387, -2817, -9264, -9906, 1174, 6167, 3706, -2512, -1347, -6961, -6926, 3156, 8327, 9482, 4079, 2972, -1637, -6465, -5926, -1758, -1104, -1879, -2678, -3594, 1121, 6820, 4837, 3553, 1438, -2390, -1058, -382, 3776, 5675, 4435, 4536, 3044, 2271, 3418, 6432, -3256, -2101, 8505, 6273, 6017, 8411, 13072, 14244, 8848, 12357, 20520, 23475, 23677, 24656, 24263, 15213, 7080, 495, -24, 5665]
11294E665J338l485o296k773p88j973J167P93N706L284l474K562K68J832Q5j337
11278B574k888K508r59J631m10j647K350N617N506L776N51m270n486O26N1l420
11262F110k320o350K535P857J1786N585L019l239n02M706k651n641j3245q672
11248a022j235K028n795K144J348k028M330j903k494k92L250J0788J650l753j484
11233E532l03n18r22M019M949k310J718k663k982l84K301j0658j92Q564N53M221
11217A0925j633n483K377J0749j579l956N450J0010R433m029m060J232P808L179
11203D0423j2227M804J3999k079k680o94j431o205r009p07r49K521K667K733O301
11188C7467J374M611N074P872P963J4123N686N676O855k942m658j5240j2779q251
$$ y = [5665, 7003, 3518, -2778, -5551, -6339, -8312, -7145, -6352, -646, 2638, -836, 1726, 1994, 3826, 3911, 2574, -314, 2194, 1235, 2866, 2456, 809, 3159, 8776, 14282, 18058, 18609, 14339, 8853, 9479, 9530, 6110, 3790, -2560, -25, 7832, 19618, 25203, 28222, 24983, 24481, 29187, 26536, 20895, 7650, -1022, -2257, -229, -6024, -3880, -2532, -4560, -230, -2133, -4627, -4919, -1669, 9119, 10769, 7016, 5532, 5229, 4711, 3789, 7808, 12757, 10447, 12165, 9502, 6520, 6136, 8437, -2221, -2413, 6151, 6704, 10925, 9292, 3809, 6186, 16935, 15356, 11400, 16850, 26860, 36293, 32264, 28204, 29436, 37244, 40423, 28196, 33000, 46999, 44920, 42240, 41546, 40115, 33910, 24901, 24194, 23245, 25766, 28433, 31166, 37467, 38841, 43452, 48526, 56398, 64361, 78484, 84170, 89846, 96701, 93759, 89101, 73861, 61082, 52831]
11174E2831k683N263l409n979k731L353l0m276k839j284M75o5o913j3478p084
11159A1151K280l948Q21L079M366J434K051Q479K354r914k375M463O667Q192N063
11144D4163J323k281q335m129M3j787l455p587l375j25k422P660R28j300K511
11129B1832R28L215j443j186o481L758j447q621M975k006q706n96L147N653Q626
11114B1648M847o4k310q808n740J724R79N437J531r261j617n02l659J002L428
11099H635P54P472o92p532m853p548M824J835q86K749J655J10r46m269M613j362
11083D559j403m45L06m280M668O234j799j390p65M644l916N10R31l327N711n828
11067D410n279m163j593L757o450K846L708K973L806o96N872K460K015J633m079
$$ y = [52831, 50148, 55411, 52002, 46023, 43292, 46645, 46615, 42339, 39500, 38216, 38691, 38626, 31713, 18235, 11151, 13431, 9483, 10304, 13383, 17749, 19183, 21234, 29713, 32067, 22153, 19778, 24241, 30908, 39100, 44163, 45486, 43205, 34870, 30741, 30784, 28997, 25542, 17955, 14580, 14455, 12033, 19693, 20621, 19321, 21832, 22760, 25975, 24532, 23346, 16865, 20623, 19176, 10555, 15530, 13524, 4818, 4222, 7369, 13022, 21648, 26495, 26431, 24121, 15313, 9573, 11297, 12276, 17713, 19244, 9983, 8366, 7864, 4205, 5207, 8635, 9389, 16861, 16169, 8637, 3784, -3764, 1060, 2895, 2009, 4758, 6413, 6523, 5577, 1308, 5921, 4559, 3156, 2711, 3017, -1263, 3405, 9639, 7840, 6450, 5685, 10329, 6413, 6923, 7854, 4527, 10238, 4410, -869, -5032, -6625, -2868, -9318, -6472, -2764, 209, 4015, 3319, 9191, 11651, 13666, 15299, 11220]
11052A1220K481L243r95K60l547J99l484o388o862l404L949L216J2119K904K015
11037A6926K302m593k702l205l528K469O69k799J019J385l326K31M832K380K628
11022A4688O09l117r918k886R42P55j784R46O231L010j993m606l326m705K899
11007b255O227K73l388O68j97O409J956o772N258j741n488k63l137l134J1662
10992F078Q167M344M153N760P10r406j3286q76N098K432l639q267K825J435M941
10977A0469o226j786Q27J781J395K478K798J433m641l97k42q38m132L213k204
10962C928K593K705L837Q482L212n570K02j041k180M360M410L277j343m409j0764
10947A1699n915J880L294R419o086k733J2544k596j3801k726m943j255L467K137
$$ y = [11220, 13701, 16944, 15949, 16209, 12662, 12861, 9377, 2989, -3873, -7277, -3328, -112, 12007, 14911, 16926, 19228, 14635, 11933, 8728, 5200, 7669, 8338, 5539, 6558, 7943, 4617, 4848, 9680, 12060, 14688, 15297, 12180, 2262, -624, 318, 1073, -711, 235, 6466, 9476, 7483, 2877, -449, -5154, -2255, 3972, 4245, 857, 1525, 1328, 7737, 9693, 2921, 8179, 6438, 950, 687, -2450, -5584, 6078, 14245, 18589, 22742, 28502, 29212, 19806, 6520, 5644, 10742, 13174, 9535, 1268, 4093, 5528, 10469, 4243, 2457, 3284, 5065, 6460, 8938, 11736, 13169, 8528, 8131, 7889, 7051, 2919, 6132, 3928, 6521, 9226, 13063, 21545, 24757, 19187, 19389, 18348, 16168, 20528, 24938, 28215, 26872, 22463, 11699, 5784, 7664, 10958, 20377, 14291, 11558, 24102, 21506, 7705, 4979, 36, -1219, 2248, 4385]
10933D385M644O06p997K007k411O083M032L919Q030J2311Q906O254O915O212J0805
10918G4701K8321K8030J8022P978P631j880l740j7346k2592j6344j2171j5737
10906G4873r335m877n064m060j973k362n988j0517K584J578q03p629l139J330
10892B4618l368J406J1591O520L765J650J284J0066l824k065N124L917J1030P894
10878G9608O591J0735J5889K3999L4141L5180L3205L0486J8268L044n685j7904
10866B67557j9060k5313k5839k2396k8325j0695j0924j5295j7722r451J166j10
10854H3593o907n452q460m565N67l950J266p022n048K182k614K486K091P943K343
10839E8453N189l017k907J099L382P55l69j028K741O015J8993K1698K5045K4132
$$ y = [4385, 9029, 9635, 1638, 3645, 1234, 7317, 11349, 15268, 23298, 35609, 44515, 50769, 57684, 63896, 74701, 103022, 131052, 149074, 157052, 164683, 162803, 159063, 141717, 119125, 102781, 90610, 74873, 65538, 60661, 55597, 51537, 49564, 47202, 41214, 30697, 33281, 34859, 34056, 26427, 23288, 24618, 21250, 22656, 34247, 40767, 44532, 46182, 47466, 57532, 53708, 51643, 56767, 60684, 71714, 79608, 86199, 96934, 112823, 136822, 170963, 206143, 239348, 269834, 288102, 291146, 285461, 267557, 248497, 223184, 197345, 174949, 146624, 135929, 125005, 109710, 91988, 82537, 83703, 83593, 76686, 71234, 62774, 58209, 58776, 54826, 56092, 49070, 44022, 46204, 43590, 46076, 48167, 56110, 58453, 63642, 60625, 57718, 58817, 62199, 62954, 62585, 61557, 64298, 70313, 89306, 111004, 136049, 160181]
10825A60181J6080J4872J3042j504o021k8455k6844k5165j8577r554q68p089k977
10812G7121j4761j2771o213j548M432k34l579n137n780k573o48J384q023q364
10798A3306L765k681o079N686J2214M449L298q33m941j018o16l022l370N80j108
10783A9630l66K085N284O450l73n129m239J86q941n227J096M128N714Q124J200
10768B9622l108l372k159j464K121L559K497o726L477M041K758k784J67R108j02
10753C7635n673J607p19r27M998J2699O093p190M15q571p794o951k757M645k730
10738B4780l05K548l176L910P364J541O858M962k39k691j028O57J934l880k150
10723D1085P093P694O241o380j3108j529j693m483K706J0610N265J0669Q205K338
$$ y = [160181, 176261, 191133, 204175, 202671, 196650, 168195, 141351, 116186, 97609, 88055, 87187, 80098, 77121, 62360, 49589, 43376, 41828, 46260, 46026, 42447, 37310, 31530, 28957, 28309, 29693, 21670, 13306, 17071, 14390, 8311, 13997, 26211, 30660, 33958, 33125, 28184, 27166, 26550, 23528, 20158, 20738, 19630, 19264, 21349, 26633, 33083, 32710, 27581, 23342, 23528, 14587, 9360, 10456, 14584, 20298, 28422, 29622, 26514, 23142, 20983, 19519, 21640, 25199, 27696, 20970, 24447, 28488, 31246, 28462, 28629, 37737, 37635, 31962, 33569, 32850, 31923, 36921, 49620, 55713, 48523, 48938, 40367, 32573, 25622, 22865, 27510, 24780, 24475, 27023, 23847, 27757, 35121, 36662, 43520, 48482, 48243, 45552, 44524, 45181, 47115, 43235, 41085, 48178, 55872, 62113, 55733, 42625, 41096, 39403, 34920, 37626, 48236, 53501, 64170, 72375, 74713]
10709G4713l383k380l339Q27J218j048j158Q25m018Q89M864k425L063r6l864k626
10693F2062j7k23o692o388l665j365R125M904o104j0112n036Q067N921k901J458
10678D9034l22J095P701l88j5N76P055J607K065k788j967P088J0194P199m655
10663H3479p140o55J808o27K778J538O458J1376J558k56P317J620o250l030k462
10648I7512n895p685m652J6Q33j351j106N145O257m82p243m388J089O844J1183
10633I6077K070K009J0014R947J961j100L411q643p542k255L8o45P256N168L268
10618A21034j497j487L223j4085o033O026k383j257l716o671K009L147K920J419
10604A02649r054p20P700k657L336K826L896J3419J4818N218M924K033M212M200
$$ y = [74713, 71330, 68950, 65611, 66438, 67656, 66608, 65450, 66275, 62257, 63146, 68010, 65585, 68648, 68552, 64688, 62062, 62045, 61822, 55130, 48742, 45077, 43712, 52837, 57741, 51637, 41525, 36489, 44556, 50477, 47576, 49034, 48712, 49807, 57508, 57120, 57105, 57681, 64736, 66343, 68408, 65620, 63653, 70741, 80935, 88134, 83479, 76339, 75684, 77492, 76865, 79643, 81181, 87639, 99015, 100573, 100317, 107634, 109254, 103004, 99974, 97512, 91617, 83932, 79280, 79296, 80129, 78778, 77672, 82817, 89074, 88592, 81349, 76961, 78050, 84894, 96077, 98147, 100156, 110170, 120117, 122078, 120978, 124389, 115746, 108204, 105949, 105987, 105342, 112598, 117766, 121034, 119537, 118050, 121273, 107188, 101155, 107181, 104798, 103541, 99825, 93154, 95163, 98310, 101230, 102649, 93595, 92875, 100575, 97918, 101254, 104080, 107976, 121395, 136213, 141431, 146355, 148388, 152600, 156800]
10590A56800P448R403M791Q002J6202K2820K5040J6531R751J5161J1459J0445
10578C13853M947L896J5024K7666L5693M3979O0071Q9013J23379J64653K10503
10567A092677K60130K91709L08760K66735J55704J6568j20492k32512k91695k96572
10557A451012k58594k07314j58800j14564p7128n7314m1716l5238j9067j2627
10547D68650j6046m126m242m991R10j018P799J3381J4307M395R244P902Q933R428
10533E14526R050J5385J4831K3066L2195L9686M7201N6495N5495O9582P7194R8072
10521A052778J11196J33186J58512J80443K13052K43068K78755L20171L70546
10512C061707M32554N46760P17275R66926J326042J822279K448255L131681L685206
$$ y = [156800, 164248, 173651, 178442, 186444, 202646, 225466, 250506, 267037, 276788, 291949, 303408, 313853, 318800, 322696, 337720, 365386, 401079, 445058, 505129, 594142, 717521, 882174, 1092677, 1352807, 1644516, 1953276, 2220011, 2375715, 2392283, 2271791, 2039279, 1747584, 1451012, 1192418, 985104, 826304, 711740, 634612, 577298, 535582, 500344, 481277, 468650, 452604, 448478, 444236, 439245, 440155, 439137, 446936, 460317, 474624, 479019, 488263, 496165, 505098, 514526, 523576, 538961, 553792, 576858, 609053, 648739, 695940, 752435, 807930, 877512, 954706, 1052778, 1163974, 1297160, 1455672, 1636115, 1849167, 2092235, 2370990, 2691161, 3061707, 3494261, 4041021, 4758296, 5725222, 7051264, 8873543, 11321798, 14453479, 18138685]
10503A8138685L826196L339945K193996O06693j050562k432183l276387l504992
10495A7841391l265927k750307k169498j642430j219829r05069o70075n02140
10487D716116l81339k98430k47516j90847j46843j13636o7853j8862L4475Q9874
10477C375139J58138K48106L46847M70766O28821P88134R21355R88368R61100
10468H886774Q66960P93502Q23012J064496J590858K416494L540790M892704O225048
10459C1100638P039738O731158M936763J966428j164476l380650m204883m029341
10451C8995375l586894l424279l610679l844253l788077l368233k695051j957746
10443A2720163j299496p90286m50053l17207l86638n98881q14755r27767q83053
$$ y = [18138685, 21964881, 25304826, 27498822, 28105515, 27054953, 24622770, 21346383, 17841391, 14575464, 11825157, 9655659, 8013229, 6793400, 5888331, 5218256, 4716116, 4334777, 4036347, 3788831, 3597984, 3451141, 3337505, 3269652, 3250790, 3285265, 3375139, 3533277, 3781383, 4128230, 4598996, 5227817, 6015951, 6937306, 7925674, 8886774, 9753734, 10547236, 11370248, 12434744, 14025602, 16442096, 19982886, 24875590, 31100638, 38140376, 44871534, 49808297, 51774725, 50610249, 47229599, 43024716, 38995375, 35408481, 31984202, 28373523, 24529270, 20741193, 17372960, 14677909, 12720163, 11420667, 10630381, 10180328, 9863121, 9476483, 8877602, 8062847, 7135080, 6252027]
10434F252027p38485n66218m06060k93492j91927r6725j7909N9864J31978J93779
10424D326832K48731L05852L71659M59472O09945Q23843J129194J567156K166986
10415A2009670K933738L795577M551548M874165M404078L001089Q91097j428423
10407C5032539l354418m479767m744513m331417l585495k778154k060787j514422
10399H183566j151186r19562p60301o49716n47818m68862m04862l54169l23774
10390B603316k76154k27544j94153j71326j48608j25862j08223r2045p6576o9227
10380A113598n1506n0185m5668m9417n0426m5809l9561k7600j2735r350r089j1940
10368G10312j4380j5337j5296j7199k3291j8601j4673j5871k4049k0552k1530
$$ y = [6252027, 5513542, 4947324, 4541264, 4247772, 4055845, 3959120, 3941211, 4001075, 4133053, 4326832, 4575563, 4881415, 5253074, 5712546, 6322491, 7146334, 8275528, 9842684, 12009670, 14943408, 18738985, 23290533, 28164698, 32568776, 35569865, 36460962, 35032539, 31678121, 27198354, 22453841, 18122424, 14536929, 11758775, 9697988, 8183566, 7032380, 6112818, 5352517, 4702801, 4154983, 3686121, 3281259, 2927090, 2603316, 2327162, 2099618, 1905465, 1734139, 1585531, 1459669, 1351446, 1259401, 1182825, 1113598, 1062092, 1011907, 966239, 916822, 866396, 820587, 781026, 753426, 740691, 731341, 722252, 710312, 695932, 680595, 665299, 648100, 624809, 606208, 591535, 575664, 551615, 531063, 509533]
10357E09533j8271j4258j3553k153n619j4533j4051l92j889n079l935Q433O784
10344D31017N42j290o107M267J0954Q967J5090J5861P777M32o275j2394k0247
10331D48594k5670l3583m1196k3488j1630m771l921K853K985R267J3397J4375
10319C47212J1908M851P198L902M768J3065K4248J2479P646Q909K594L920L302
10306D56002j063L970K990R767K3776L5270K3423J0851j1393k6186k2902j8033
10294D86472m509k15R532J1366R867N763l173O739L336P550J48m000p110O599
10280E28365J9120K7503M4811P6271R8388J07546O4795k2945j08268j55281j41339
10269E38966q5945l1881p894N98P640Q931N016L836L519M956J6337J5111K1948
$$ y = [509533, 491262, 477004, 463451, 461298, 455679, 441146, 427095, 426703, 424814, 419735, 415800, 424233, 431017, 431559, 430269, 424162, 428429, 439383, 448350, 463440, 479301, 487078, 487510, 481235, 468841, 448594, 422924, 389341, 348145, 324657, 313027, 308256, 304335, 307188, 310173, 319440, 332837, 347212, 359120, 363971, 371169, 375071, 379839, 392904, 417152, 429631, 437277, 446186, 448780, 452700, 456002, 454939, 458909, 461899, 471666, 495442, 530712, 554135, 564986, 553593, 527407, 504505, 486472, 481963, 481748, 491280, 502646, 512513, 518276, 515103, 521842, 525178, 532728, 532876, 528876, 521766, 528365, 547485, 574988, 619799, 696070, 794458, 902004, 966799, 943854, 835586, 680305, 538966, 453021, 421140, 413246, 413844, 421484, 430415, 435431, 439267, 442786, 447742, 464079, 479190, 501138]
10256E01138K7847K5998K4851K4342K3690K3416K0453K0615J9290J6587K3423
10245G51650K1023J9992L1516L2580M2018M1069L7455L2513K1963L1172N0015
10234A112966N1407N5985M9462N3406N3029O0400P1270R0262J08347J18065J20258
10223A944857J21716J33355J45202J57896J70025J81912J90701K03226J97060
10214C445950J85010J82069J69544J54001J33893J11079Q1677L4254K163l1761
10204D467879m9878o8999r8674r5920r7529r3488r5414r8009p8077o1741n9633
10193C570517n3963l8269k8372l1504k3837j7031K0297O0178J00849J35691J50485
10182C845041J56606J40969J28829J28641J34988J54736J93205K67585L54671
$$ y = [501138, 528985, 554983, 579834, 604176, 627866, 651282, 671735, 692350, 711640, 728227, 751650, 772673, 792665, 824181, 856761, 898779, 939848, 977303, 1009816, 1031779, 1062951, 1112966, 1164373, 1220358, 1269820, 1323226, 1376255, 1436655, 1507925, 1598187, 1706534, 1824599, 1944857, 2066573, 2199928, 2345130, 2503026, 2673051, 2854963, 3045664, 3248890, 3445950, 3630960, 3813029, 3982573, 4136574, 4270467, 4381546, 4463223, 4497477, 4499640, 4467879, 4418001, 4349002, 4250328, 4154408, 4056879, 3963391, 3867977, 3769968, 3691891, 3630150, 3570517, 3516554, 3478285, 3449913, 3418409, 3394572, 3377541, 3397838, 3458016, 3558865, 3694556, 3845041, 4001647, 4142616, 4271445, 4400086, 4535074, 4689810, 4883015, 5150600, 5505271]
10173E505271M47355N48992O41958P59701R03347J070846J251447J452661J679880
10164A4261458J938659K170609K249345K143911K066332K365221L131713M236505
10156C4563753N641800P530204J0296264J4541419K1081380L1151396M6443175
10149A71249391O7850418R1230319J01093346P4791047R364446o0742361r5630768
10142C59205838r1158938o9810362m9202775l4276897k4313627j7670166j3095479
10135E9677594r787263p303661n424626l979855k892432k185245j918144k048372
10127B4137996k280558k338480k195351j923607j629492j349464j114132r18949
10119A0387963p78368o69909n95779n35366n08342m70558m33781m18371m04003
$$ y = [5505271, 5952626, 6501618, 7143576, 7903277, 8806624, 9877470, 11128917, 12581578, 14261458, 16200117, 18370726, 20620071, 22763982, 24830314, 27195535, 30327248, 34563753, 40205553, 47735757, 58032021, 72573440, 93654820, 124806216, 171249391, 239099809, 330330128, 431423474, 506214521, 515578967, 454836606, 359205838, 268046900, 198236538, 149033763, 114756866, 90443239, 72773073, 59677594, 49890331, 42586670, 37162044, 33182189, 30289757, 28104512, 26186368, 24137996, 21857438, 19518958, 17323607, 15400000, 13770508, 12421044, 11306912, 10387963, 9609595, 8939686, 8343907, 7808541, 7300199, 6829641, 6395860, 5977489, 5573486]
10110E573486l61610l06494k34076j73560j43929j47910j57752j77326j73058
10101C697771j60882j58149j55575j33850j16709j17297j12466j10633j00236
10092B531974q7772q6424q5301p8043o9485n4616m4539m4627l9497m9387n3817
10081A838466l9212l5236l8989m7270m4131l2549l2255l8742l0682k6317o531
10070A466552J1797L4058P3107J24402J52465R5895l2101j29916j50947j38856
10060A506456j01618q1680n5491l6944k8595l0438m1661m9211m4141l4386j4103
10049I88188r369q035l749m092j0326q452l474J554o78J787L897M886n260m365
10035I42512j1235j7425j5271j7447j2651p532q715j4340j6156k1239j4994O810
$$ y = [5573486, 5211876, 4905382, 4671306, 4497746, 4353817, 4205907, 4048155, 3870829, 3697771, 3536889, 3378740, 3223165, 3089315, 2972606, 2855309, 2742843, 2632210, 2531974, 2444202, 2357778, 2272477, 2194434, 2124949, 2070333, 2025794, 1981167, 1941670, 1892283, 1838466, 1799254, 1764018, 1725029, 1677759, 1633628, 1601079, 1568824, 1530082, 1499400, 1473083, 1466552, 1478349, 1512407, 1585514, 1709916, 1862381, 1958276, 1926175, 1796259, 1645312, 1506456, 1404838, 1323158, 1267667, 1230723, 1202128, 1171690, 1130029, 1080818, 1036677, 1002291, 988188, 978819, 970784, 967035, 962943, 952617, 944165, 940691, 942245, 941567, 943354, 947251, 952137, 946877, 942512, 931277, 913852, 898581, 881134, 868483, 860951, 852236, 837896, 821740, 800501, 785507, 792317]
10023G92317K1055M2410K7678j1401r2165j46419j26407p6478k1463J0971J0534
10012D30632Q656J0125m8l596r766j0857j3947m985L099o859N50N184N003J7968
9998D31159J1237Q264J972j2178k2060k3769j2760J2291K0586J8807Q773n136
9986D37186j9147k6513l3798k7888k3707j4544j3402r021n526K845j013P183R5
9973B72750l942J598J8500J4453R973K698O374N476j050k6j3237k3515l4946l1136
9959B23970k2873r594j2815j2751j2323J503J3196K2211K7139J4284M262n220
9947B30989l4l984M674R593O739N434m670m791n329p818J56m175o11p765j0538
9932B07870q535k998K952o795J70R059L223r759j0780r814n327J2137J0295M864
$$ y = [792317, 813372, 855782, 883460, 872059, 779894, 633475, 507068, 430590, 409127, 420098, 430632, 439288, 449413, 449365, 445769, 436003, 425146, 411199, 406214, 409313, 402454, 403004, 408188, 413191, 431159, 442396, 450660, 452632, 440454, 418394, 394625, 381865, 394156, 414742, 433549, 442322, 437186, 418039, 391526, 357728, 329840, 306133, 291589, 278187, 269166, 263640, 266485, 265472, 272655, 272750, 268808, 270406, 288906, 303359, 313332, 316030, 322404, 327880, 326830, 326804, 313567, 290052, 255106, 223970, 201097, 191503, 178688, 165937, 153614, 155117, 168313, 190524, 217663, 231947, 236209, 230989, 230955, 226971, 231645, 241238, 247977, 253411, 248741, 243950, 238621, 230803, 230959, 226784, 226173, 218408, 207870, 199335, 196337, 199289, 192494, 192664, 201723, 204946, 195187, 184407, 174593, 169266, 181403, 191698, 196562]
9918A96562O185O163m343K832j054L816M865O021J5662J4700L541q431j3250n678
9904B27591n775p731m540k374k117n859l404O52M508R807J4227Q469Q355J0215
9890B52024j715p849j5590j1930p78M29n225p642n407j3376M203k582r782o525
9876A68255m264K607Q211Q407K075m367o661n116n2K107j241L542R495Q297p48
9861A90547m429j3506p639L58M330p67k327k939M089Q582J1898P976o081K149
9847A92241n358L531J3278J6419K9579J2148j171k645n117o759k508N952K535
9834B52125k515n204j0307K22k752r3R78M26J5538J1334j236p275j215J85K350
9819B52561n351o603q1j1157O0R029J8303K2859J9749J4304J7916K8645J8724
$$ y = [196562, 202747, 208910, 204567, 207399, 206345, 210161, 215026, 221047, 236709, 251409, 254950, 246519, 233269, 227591, 221816, 214085, 209545, 207171, 205054, 199195, 195791, 196443, 200951, 210758, 224985, 233454, 241809, 252024, 250309, 242460, 226870, 214940, 214162, 214591, 209366, 201724, 196317, 182941, 187144, 184562, 174780, 168255, 163991, 166598, 174809, 183216, 185291, 180924, 174263, 169147, 169095, 171202, 169961, 173503, 182998, 191295, 190547, 186118, 172612, 164973, 165331, 169661, 168894, 166567, 163628, 167717, 176299, 188197, 196173, 190092, 192241, 186883, 190414, 203692, 220111, 249690, 261838, 260667, 258022, 252905, 246146, 243638, 249590, 252125, 249610, 244406, 234099, 234321, 231569, 231476, 232454, 232880, 248418, 259752, 258516, 251241, 250026, 250211, 252561, 247210, 240607, 240526, 229369, 229429, 238458, 256761, 279620, 299369, 313673, 331589, 360234, 378958]
9806C78958K2122K7452L2238L8808N2874O4766P8756P4344R2126J12233J37867
9795A112544J64163K17240K89789M05686N83405Q26834J159078J501923J673797
9786G934459J465232R29821L11021l91340j145707j611602j567225j256161r23651
9777C744847o67755m72853l47345k52217j75047j17530p9578n3752k8037k3290
9767A527443j6381L824K0446M3936P4516J06043J53638K15594K90162L55103M18478
9756C192802M64180M45378L90896L92886N41866Q46516J297169J978811K942208
9747A2492712M107751N009536M842756L273338Q89775j367465k492607k130155
9739B4625641j145989p14430j348882k520809l179418k978622k337630j677424
$$ y = [378958, 401080, 428532, 460770, 499578, 552452, 617218, 695974, 770318, 862444, 974677, 1112544, 1276707, 1493947, 1783736, 2189422, 2772827, 3599661, 4758739, 6260662, 7934459, 9399691, 10329512, 10640533, 10249193, 9103486, 7491884, 5924659, 4668498, 3744847, 3077092, 2604239, 2256894, 2004677, 1829630, 1712100, 1632522, 1578770, 1550733, 1527443, 1511062, 1514886, 1535332, 1579268, 1653784, 1759827, 1913465, 2129059, 2419221, 2774324, 3192802, 3656982, 4102360, 4493256, 4886142, 5428008, 6274524, 7571693, 9550504, 12492712, 16600463, 21609999, 26452755, 29726093, 30615868, 29248403, 26755796, 24625641, 23479652, 22765222, 21416340, 18895531, 15716113, 12737491, 10399861, 8722437]
9731H722437j131892p27148m14121j72910j1474M9131j203n2017p5844r4284j32204
9720E958471j56887j34528k7805J47781L30967M33206L18925Q4663O614J92167
9710G153574N29937R56399J520540K291574L280502M221481M468858L360377J441955
9701B9225197K82193P27673K221803L513641L235574O78037k885266n055420n290319
9692B6653113m663216l931127l200173k431651j714347j126125p47753o53497
9684H185224p78644q44008p59643n94794m43426l27115k08662j16759l0241O9177
9674D151109J07334N7669k7551m6874J9045J35753K79348M43212O69307R56388
9664F744740J241193J398042J315668J151697J269929J806872K620050L375342
$$ y = [8722437, 7590545, 6863397, 6449276, 6276366, 6264892, 6314023, 6312820, 6260803, 6184959, 6090675, 5958471, 5801584, 5667056, 5639251, 5787032, 6117999, 6551205, 6870130, 6954793, 6961407, 7153574, 7683511, 8639910, 10160450, 12452024, 15732526, 19954007, 24422865, 27783242, 29225197, 29507390, 30235063, 32456866, 35970507, 39206081, 39884118, 36998852, 31943432, 26653113, 21989897, 18058770, 14858597, 12426946, 10712599, 9586474, 8838721, 8185224, 7406580, 6562572, 5802929, 5208135, 4764709, 4437594, 4228932, 4112173, 4081932, 4151109, 4258443, 4316112, 4288561, 4241687, 4260732, 4396485, 4675833, 5119045, 5788352, 6744740, 7985933, 9383975, 10699643, 11851340, 13121269, 14928141, 17548191, 20923533]
9656B0923533L633501K836350R17129j112003k351346l130704l727068l691497
9648A4297895l027049k221001j553328j088835q18815p02196o41858n42834m27704
9639C274275l36895k69471k34521k04201j87599j58523j32523r6256o9575m1302
9629A543409k9212j7630n240l596J7813L9824O6505J00901J50409K16435L14418
9618B394036M50329O52856R03586J117485J160778R03071M46515j4312n20355
9609G493989j043529j293010j177374r00663o46506m65935l38636k48147j79970
9600A200219j34999j04680q3285p1419n4521n6031n2921m2147m2736l9181k6301
9589D91998k1759j6447j8696j4761p176j4980k3109j1509j3969j7063j6393p313
$$ y = [20923533, 24557034, 27393384, 28310513, 27198510, 24847164, 21716460, 17989392, 14297895, 11270846, 9049845, 7496517, 6407682, 5588867, 4886671, 4244813, 3701979, 3274275, 2937380, 2667909, 2433388, 2229187, 2041588, 1883065, 1750542, 1654286, 1584711, 1543409, 1514197, 1496567, 1491327, 1487731, 1505544, 1545368, 1611873, 1712774, 1863183, 2079618, 2394036, 2844365, 3497221, 4400807, 5518292, 6679070, 7582141, 8028656, 8014344, 7493989, 6450460, 5157450, 3980076, 3079413, 2432907, 1966972, 1628336, 1380189, 1200219, 1065220, 960540, 877255, 805836, 751315, 695284, 642363, 600216, 557480, 518299, 491998, 470239, 453792, 435096, 420335, 413159, 398179, 375070, 363561, 349592, 332529, 316136, 308823]
9577C08823j5778j4182l245m066m8m431p993j3529j4150j4157o787j3727q962
9564A87768n820J913J307j795k904k609l815m382j2268J765l94L311q395q86M474
9549A57270J630l01j050l621K594M74K399P06j0329k933M280k499L664N580K008
9534A59872n288k405L392K117p944o104m539o557q287n415l619M396K17m076p114
9519A08646j764K172l000M423K082L3J537k679l362o064m064l563l393O796K937
9504A00737n415n340K650K726o523o745J739M4O313J1566j162J935M196K871Q98
9489A10490O17M230k069q114m964j006n544l832j782m266K38L599o30q394K923
9474H1496N375K924l667l434j915l273j978K221J067O87l048l360j966N28j404
$$ y = [308823, 293045, 278863, 275618, 271552, 271504, 267073, 259080, 245551, 231401, 217244, 210457, 196730, 187768, 181948, 183861, 185168, 183373, 180469, 177860, 174045, 169663, 157395, 159160, 158766, 162077, 153682, 152796, 157270, 158900, 158599, 157549, 153928, 156522, 156996, 159395, 160101, 149772, 146839, 151119, 148620, 152284, 157864, 159872, 154584, 152179, 155571, 157688, 149744, 143640, 139101, 132544, 124257, 118842, 115223, 119619, 119836, 115760, 108646, 106882, 109054, 106054, 110477, 112559, 112592, 114129, 111450, 108088, 102024, 97960, 94397, 91004, 97800, 100737, 95322, 89982, 92632, 95358, 88835, 82090, 83829, 83873, 90186, 101752, 100590, 102525, 106721, 109592, 110490, 111107, 115337, 113268, 105154, 100190, 99184, 93640, 89808, 88026, 83760, 83998, 87597, 86967, 78573, 81496, 86871, 89795, 86128, 82694, 80779, 77506, 75528, 77749, 78816, 79503, 76455, 73095, 71129, 71657, 70253]
9459G0253k306m529N97J686K177n07p859L709J0956N876m949l466M751J502l053
9444G4838j498M538J0181O767m98o256o536K142n542N110O726K756o906j1056
9430G4766l58O99k684o107m111r596L685N937n107o100k505M358L358M734N388
9415F6357N80p775n997K844l44j5o035j18P601j06l803l855K719N165J658K438
9399F1314J867K282M065K996J759O992K443m65j266l718l440l62n23K846J1278
9384H8068O884M878k608N019O307k879p726j4064j1110o569o684k541o98P00J65
9369E7142J913L253J492k891l629o818m548N95J1100J0468m02j4445k184O499
9355E7545L928L289J3972J0157M26R96M16k088n56L384N513R837J6307J7141K6553
$$ y = [70253, 67947, 63418, 64015, 65701, 67878, 67371, 59512, 63221, 74177, 80053, 75104, 71638, 76389, 77891, 74838, 73340, 77878, 88059, 94826, 94328, 88072, 81536, 83678, 78136, 83246, 89972, 92728, 85822, 74766, 74408, 75107, 72423, 66316, 62205, 52609, 56294, 62231, 57124, 51024, 48519, 52877, 56235, 60969, 66357, 66937, 59162, 53165, 56009, 55665, 55650, 49615, 49497, 57098, 56992, 53189, 49334, 52053, 57218, 58876, 61314, 63181, 65463, 69528, 72524, 74283, 81275, 83718, 83253, 81987, 78269, 74829, 74467, 73944, 76790, 88068, 94952, 99830, 97222, 102241, 108548, 105669, 97943, 83879, 72769, 66200, 59516, 56975, 56277, 56977, 57142, 59055, 62308, 63800, 60909, 57280, 50462, 45914, 46509, 57609, 68077, 67675, 53230, 51046, 57545, 61473, 64762, 78734, 88891, 89317, 90313, 90729, 88641, 88085, 91469, 96982, 106819, 123126, 140267, 166820]
9340A66820K7307J2660K361o350j8866j1808j4265p531q822j7006j2649r763n897
9327I6191n835j1753j0721n245N571N671M123j628m465p756r042K456J2485P851
9313G7903j120j148K923J45J37R19k821M826N90K124J6117K0065K0159J8996K6466
9298A86281J4336L193O385R886J0558J3700J687p624j8995k4522k7615k6324j4153
9285A26793q798q406j1000r007n355q887n634l053K483l344J427O64n846k561
9271E9476O248M253k912k927O153K76l915L022l93n589J087J2074N716P21K902
9256H6192J3389Q712R216J1100J4193J0253J4202J9123j273j7328j8971j8199
9244A30609j1998j6713j1497n426l716j183n709p45p446k011j261J524j827p415
$$ y = [166820, 194127, 206787, 209148, 202798, 183932, 172124, 157859, 150328, 141506, 124500, 111851, 102088, 96191, 90356, 78603, 67882, 62637, 68208, 73879, 78002, 76374, 71909, 64153, 55111, 57567, 70052, 77903, 76783, 75635, 78558, 78703, 78840, 79759, 76938, 81764, 82354, 84478, 100595, 120660, 140819, 159815, 186281, 200617, 203810, 210195, 220081, 230639, 244339, 246026, 238402, 219407, 194885, 167270, 140946, 126793, 117995, 109589, 98589, 89582, 84227, 75340, 69706, 66653, 69136, 65792, 67219, 67883, 62037, 59476, 65724, 69977, 67065, 64138, 70291, 70567, 66652, 69674, 69281, 63692, 64779, 76853, 82569, 83290, 86192, 99581, 108293, 117509, 128609, 142802, 153055, 167257, 186380, 185107, 167779, 148808, 130609, 118611, 101898, 90401, 84975, 81259, 80076, 74367, 73622, 66176, 64165, 62904, 64428, 62601, 55186]
9230E5186m998n107k885P961p76j070K446k100j330p3O037K782N393m067M06L510
9214F1315M111K68k630P842M029N884J871J166l146n692N73o97m686p409l867
9199E8932o383q964o793l96J905Q88J31m412k982O283J769K699o92M172n54k004
9183D3599K199J461j258p737n651K583L994j333j49P633P210K708J846l838N57
9168E3824j678j944l150j666n890n765j500K933M15L6k685J426n153q520M165
9153B4848L999K939j058L058Q66n048k470n214O174M73j42p394p114Q904O585
9138B9406K887N07k207J254N247J976L579r68m248j489O749l941j905L75j040
9123C6182P2J887M433K207j562N187j594m131r161n694P46L161k372l251L386
$$ y = [55186, 50188, 45081, 42196, 50157, 49381, 48311, 50757, 48657, 47327, 47254, 53291, 56073, 61466, 57399, 57805, 61315, 65426, 65694, 63064, 70906, 74935, 80819, 82690, 83856, 80710, 75018, 75591, 74894, 70208, 62799, 58932, 52549, 43585, 36792, 36396, 38301, 39189, 39320, 34908, 31926, 38209, 39978, 42677, 41985, 46157, 45603, 43599, 45798, 47259, 46001, 38264, 32613, 35196, 39190, 37857, 37708, 45341, 52551, 55259, 57105, 53267, 53824, 52146, 50202, 47052, 45386, 39496, 33731, 32231, 35164, 35579, 35615, 32930, 34356, 29203, 20683, 24848, 28847, 31786, 30728, 33786, 34652, 29604, 27134, 21920, 28094, 28567, 28425, 21031, 13917, 22821, 29406, 32293, 32800, 30593, 31847, 37094, 39070, 42649, 41681, 37433, 35944, 42693, 38752, 36847, 37222, 36182, 36254, 38141, 42574, 44781, 43219, 48406, 46812, 42681, 33520, 27826, 28572, 31733, 29361, 26110, 29496]
9108B9496k32K523l482n444K555K372m932J74L120L551K052L20l091m98K286m940
9092B5830m324M725L622K395n86j819j699l987j363J125J158Q927l458j1758r88
9077A7800L761J71K058R820k540j0171O009K856m97N711k736l185k735l727r880
9062A2715n242Q958J476N83m170K848n57K84K271R468K886K047p738j0965l729
9047A1135P339P176l116k566L987n846R027R095m696j2243k349L456M839l955
9033B1283m150k442n241R87K336k275L365O55j13N96Q0k170K948L699l939m324
9017A1295K556N199L558N41J581J387l425p186k337J282K749O312L209l023k617
9002B1081O370J246o540l51k449J614m140r695N356O430o004J60N430j028o824
$$ y = [29496, 29264, 31787, 28305, 22861, 25416, 27788, 22856, 23030, 26150, 29701, 31753, 32073, 28982, 28484, 30770, 25830, 21506, 26231, 29853, 32248, 31662, 29843, 28144, 24157, 22794, 23919, 25077, 34004, 30546, 18788, 17800, 21561, 21732, 23790, 33610, 31070, 20899, 26908, 29764, 29267, 34978, 32242, 29057, 26322, 22595, 12715, 7473, 16431, 17907, 18490, 14320, 17168, 16611, 16895, 19166, 28634, 31520, 33567, 25829, 14864, 11135, 18474, 25650, 22534, 19968, 23955, 18109, 27136, 36231, 31535, 19292, 16943, 20399, 25238, 21283, 17133, 14691, 9450, 10437, 12773, 10498, 13863, 14518, 14405, 15001, 15081, 12911, 15859, 19558, 15619, 11295, 13851, 19050, 22608, 23149, 24730, 26117, 22692, 15506, 13169, 14451, 17200, 23512, 26721, 23698, 21081, 27451, 28697, 22157, 21806, 19357, 20971, 16831, 7136, 12492, 18922, 12918, 13078, 18508, 17480, 10656]
8987A0656J622L158L303J490K849O75n380o453L297K387n175q75R538M893m494
8972B1491n155M86N241J124r07l147L308k065r929m391j172O7J497K537J217Q239
8956A8441R78L660p19j489k23j527l266Q30R259M231m326j0094k064n953j061
8941F677P327K228J010M454K242k392j3048m818l08N411r33j368j12k619j618
8926B133k604k43J192K53N504Q893l539k25k318L801M132o589l251j783o549m96
8910a689J2014K549K905L081m550p097r718Q383K029R241P22m054m162n396m170
8895H8L157L345P148P052J1756K063j3222n662Q019J295m081J268j915l528l18
8880A6465m492l329M181n64l828j2k77J2656M055N183m799j0455o207k760J587
$$ y = [10656, 12278, 15436, 18739, 20229, 23078, 23753, 18373, 11920, 15217, 17604, 12429, 11554, 21092, 25985, 21491, 16336, 16822, 22063, 23187, 22280, 19133, 22441, 20376, 10447, 6056, 4884, 4951, 6448, 8985, 10202, 18441, 19419, 23079, 22360, 20871, 20648, 19121, 15855, 16685, 25944, 30175, 25849, 15755, 13691, 7738, 6677, 14004, 16232, 17242, 21696, 23938, 21546, 8498, 3680, 3372, 8783, 7850, 6482, 6370, 3751, 2133, -471, -714, 478, 731, 6235, 15128, 11589, 11364, 9046, 12847, 16979, 10390, 7139, 5356, -1193, -1689, 10325, 12874, 15779, 18860, 14310, 7213, -2505, 5878, 7907, 17148, 17870, 13816, 9654, 4258, 88, 3245, 6590, 13738, 20790, 32546, 34609, 21387, 15725, 23744, 25039, 20958, 22226, 20311, 16783, 16465, 11973, 8644, 12825, 12261, 8433, 8421, 8144, 20800, 24855, 30038, 25239, 14784, 8577, 5817, 7404]
8865G404N064Q00K943J56j26P06j577j796Q851L780l934Q831R294P197R746J4058
8849G1397M408j3247j6134j0401r585m953k493m591K98o579r92K879K278m085
8835H200K405K261L516j569p916J804J524J963k005j042n704j570P36j281p95
8820E27Q210K226N12P116J240m950m347n731k09j330N80K163K503l912M585N608
8804A4791J77N51m375M499j279J576J107k412r10J687m094m006N139J687j868
8789A2270l275K789M112m418j070M334J844j778o327k693L379K688L625Q46J071
8774A7397l684l476m347N818j485M669m36l976n322j42J226K102P458N40n978
8759A0364l766K569j546l459R38J432J882M521N136k511o799o25j536N271j56
$$ y = [7404, 12468, 13268, 16211, 16367, 16241, 16947, 15370, 13574, 22425, 26205, 22271, 31102, 40396, 47593, 57339, 71397, 75805, 62558, 46424, 36023, 26438, 21485, 18992, 14401, 14699, 8120, 7128, 10007, 12285, 8200, 10605, 12866, 16382, 14813, 6897, 8701, 10225, 12188, 10183, 9141, 3437, 1867, 2603, 1322, 527, 8737, 10963, 11475, 18591, 19831, 14881, 10534, 4803, 4594, 3264, 3844, 6007, 8510, 4598, 9183, 14791, 14968, 15519, 11144, 15643, 14364, 15940, 17047, 14635, 13725, 15412, 11318, 7312, 12451, 14138, 12270, 8995, 11784, 15896, 11478, 10408, 14742, 16586, 14808, 8481, 5788, 9167, 11855, 15480, 16326, 17397, 13713, 10237, 5890, 11708, 10223, 14892, 14456, 10480, 5158, 5016, 6242, 8344, 15802, 16342, 10364, 6598, 9167, 7621, 4162, 5100, 6532, 8414, 12935, 18071, 15560, 8761, 8136, 6600, 11871, 11715]
8744A1715M993l26p009J228M738q1K903J223o316n599O594Q333l678k148k36R24
8728A7258k163l776k507K092P705N645K575k546o126j805n528O546J924l150k062
8713A4082j2090n163O771P944K576n097m646p480n817J158J2195N937k163N648
8699A3855J579m2P165J200j883R33J56n670k870j145j999L573k636k554o217K635
8683F080Q97K432l671L098M939J2350M4m509Jj183K483L32l081J506k712j499
8667A7507j63l722j644j701k031J080Q526j348p248k341n935j545K504K294l777
8652D56k571L169O356K043k803m35N142M291K697M14O20n053j296L86n738m43
8636G235L08K039O209J32k908l998m597L40O603N454K914L91m880K351M864m393
$$ y = [11715, 16708, 16382, 9373, 10601, 15339, 15258, 18161, 19384, 13068, 7469, 14063, 22396, 18718, 16570, 16334, 17258, 15095, 11319, 8812, 10904, 18609, 24254, 26829, 24283, 18157, 16352, 10824, 17370, 19294, 16144, 14082, 1992, -3171, 3600, 11544, 14120, 9023, 4377, -3103, -8920, -7762, 4433, 10370, 8207, 13855, 15434, 15392, 22557, 23757, 21874, 22807, 22963, 17293, 14423, 13278, 11279, 14852, 12216, 9662, 3445, 6080, 6977, 9409, 5738, 8836, 13775, 26125, 26169, 21660, 21661, 20478, 22961, 23293, 20212, 21718, 19006, 17507, 17344, 13622, 11978, 10277, 8246, 9326, 17852, 16504, 9256, 6915, 980, -565, 1939, 4233, 456, -2115, 1054, 7410, 9453, 6650, 6215, 11357, 15648, 18345, 18759, 19379, 14326, 13030, 13416, 7678, 7235, 7543, 9582, 15791, 15923, 13015, 9017, 4420, 4760, 11363, 16817, 19731, 20122, 15242, 17593, 22457, 18064]
8620A8064n088J216j130o52o216N82K810L173J1036J564L49m433M586L410l630
8605B5641J47J108q994m894J493O174j69N279M411k70q482J714M682K748n4k877
8589B7657p628k384P410Q94M208Q927K527o561O02K508M706L908L671P051j076
8574E6420k295j163j021N699Q287P058M94j605k182p869n761l989j213P99q868
8559D2791n374j026j920K717M781m333N504l08j357N440O275O452P635J8025K9795
8544A15097O2179J25851K26218K86493J48389j50452k82368k08703j07217o0034
8534A55453l2886k4610j8815j6097j3446k494p40j04p9J789l213k896p821l694
8520C0347m20K350L916K598l430j128j362m317M121J0779J0266k93k063J0674
$$ y = [18064, 12976, 14192, 13062, 12410, 6194, 6776, 9586, 12759, 23795, 25359, 25708, 21275, 25861, 29271, 25641, 25788, 26896, 17902, 13008, 14501, 20675, 20506, 25785, 30196, 29926, 21444, 23158, 27840, 30588, 30534, 27657, 20029, 17645, 25055, 25949, 30157, 39084, 41611, 35050, 35652, 38160, 42866, 46774, 50445, 57496, 56420, 54125, 52962, 51941, 57640, 65927, 72985, 73479, 71874, 69692, 61823, 56062, 52073, 50860, 51659, 42791, 37417, 36391, 34471, 37188, 41969, 37636, 43140, 42832, 41475, 46915, 53190, 59642, 67277, 85302, 115097, 177276, 303127, 529345, 815838, 964227, 813775, 531407, 322704, 215487, 155453, 122567, 97957, 79142, 63045, 49599, 47105, 46365, 46261, 46182, 47971, 44758, 41862, 34041, 30347, 29927, 32277, 36193, 38791, 35361, 34233, 32871, 28554, 32675, 43454, 53720, 53427, 51364, 62038]
8506F2038O358P494P813J1368L2008N5302R4906J87688L48909N69152N27462q9015
8494A821483n85490n00968k84570j48692q1125n1945l2424k7769j8049j6227j4926
8483E9298j212K800P29k031o834l590q889L551l056l536P20K410k343k853o277
8468B8887P97L336j830K149L596J196N828J1400k264n530J3146K6197L9135O4804
8454A90847J22588K19178K74460J13244j79058k73869j83181r3289n5843m2075
8444I3002k1147o653j2842j4640n249m92j756K759k746j565p311p382L660N641
8430B3279l358k380N724J446o621j306M128M053k387j896j283j051l778j806k538
8415A0226L778J019j618l97m17M993M195k027r884l23Q815N601m086l228L37q91
$$ y = [62038, 68396, 75890, 83703, 95071, 127079, 182381, 277287, 464975, 813884, 1383036, 1910498, 1821483, 1235993, 735025, 450455, 301763, 220638, 168693, 136269, 108500, 90451, 74224, 59298, 58086, 60886, 61615, 59584, 52750, 49160, 40271, 43822, 40766, 37230, 37950, 40360, 38017, 35164, 28887, 29684, 33020, 31190, 33339, 36935, 38131, 43959, 55359, 53095, 47565, 60711, 86908, 126043, 190847, 313435, 532613, 807073, 920317, 741259, 467390, 284209, 190920, 135077, 93002, 71855, 65202, 52360, 37720, 32471, 31979, 30223, 32982, 30236, 28671, 21360, 13978, 17638, 23279, 19921, 17541, 23265, 24711, 18090, 16784, 20912, 24965, 22578, 20682, 19399, 18348, 14570, 12764, 10226, 14004, 15023, 13405, 13008, 12591, 17584, 21779, 19752, 9868, 9545, 18360, 23961, 19875, 16647, 16984, 16093]
8399A6093R095P083l272p639R1q599j365k431j225N91M708q231k851L034p47n37
8383C798M371J918O120k079p153M881l592n615K916J995M697O26j640M066j641
8368A3668j37k569j769M36M104k366J102K970l662m543j777k023k014l99O05N337
8352F963O570n461o42O682O12n621K413l909J663L185l039j73M846q089k138K733
8336F595o225m377R82R840L251Q42J679p669j683K082j730J89p055m891M32J0070
8320B332O060j745l616r99J805M850m23n161j144J0106O458n610k659O859K537
8305A9650L572N200N579O708N469O027m0m390m806j0688o895o784j161m967k422
8290A0052l057M001k683k380M511J817m836l972o51K096P54k161n26n829k808
$$ y = [16093, 25188, 32271, 28999, 21360, 21451, 12852, 11487, 9056, 7831, 8422, 13130, 4899, 2048, 5082, 4335, 3798, 8169, 10087, 16207, 14128, 6975, 11856, 8264, 2649, 5565, 7560, 12257, 12883, 11243, 15309, 13668, 13531, 10962, 9193, 9629, 13733, 11367, 12469, 15439, 11777, 7234, 5457, 3434, 1420, 1021, 1626, 6963, 13533, 8072, 7430, 14112, 14724, 9103, 11516, 7607, 9270, 12455, 9416, 9243, 14089, 6000, 3862, 6595, 370, -4007, -3025, 6815, 10066, 10908, 12587, 4918, 3235, 5317, 3587, 3776, -3279, -8170, -7738, 2332, 8392, 6647, 3031, 2032, 3837, 8687, 8264, 3103, 1959, 12065, 18523, 12913, 10254, 17113, 19650, 23222, 28422, 34001, 40709, 46178, 52205, 52165, 47775, 42969, 32281, 25386, 18602, 17441, 12474, 10052, 6995, 10996, 8313, 5933, 10444, 12261, 7425, 3453, 2802, 4898, 5652, 3491, 2965, -2864, -5672]
8275e672J193K352J212M559J958J00L61P142O609l97n102p194m311k3M80J212
8259D479Q180J5910K4608K7470K1343j848j9041j8579j4919j4888p579k204o138
8246A6794m131q50j201j58N93m627N849Q774J098m713k871k587o88k599R77Q73
8230A0533k929M281J747J963N202j1087o201k474J795J853O681Q951j052m891
8216A4372J641J258M49J571k16J1974R183k110j2209o438m426p657R52L013n359
8201E998q357j033L52J720N171K080R585K362m002j1302p32K103o80n84l662r77
8185a958l852K876L777L225j155N292P53J147J876m60p22m086m38N212N252N617
8169B2356k63q876n753l388J290L592J478M237K74m05o770J268m190n879J74N508
$$ y = [-5672, -4479, -2127, -915, 3644, 5602, 5702, 6063, 13205, 19814, 19417, 14315, 7121, 2810, 2787, 3267, 4479, 12659, 28569, 53177, 80647, 101990, 100142, 81101, 62522, 47603, 32715, 25136, 22932, 16794, 12663, 11813, 10612, 10454, 11047, 6420, 12269, 21043, 22141, 17428, 14557, 11970, 11282, 8683, 9660, 10533, 7604, 11885, 13632, 15595, 20797, 9710, 3509, 1035, 2830, 4683, 11364, 20315, 19263, 14372, 16013, 17271, 17720, 19291, 19075, 31049, 40232, 38122, 25913, 19475, 15049, 7392, 8344, 11357, 5998, -2359, -3392, -3040, -1320, 3851, 5931, 15516, 17878, 13876, 2574, 1842, 3945, 3265, 2681, -981, -1958, -5810, -2934, 843, 4068, 2913, 8205, 8958, 10105, 11981, 11521, 10799, 6713, 6275, 11487, 16739, 22356, 22093, 13217, 7464, 4076, 5366, 8958, 10436, 14673, 14947, 14542, 7772, 9040, 4850, -1029, -855, 4653]
8153D653l772O82N527K134k563m24m491k451n953O65J163J872M965K065j800l197
8137i25o86Q218M287m195J099k22L661K421J803P14Q30j090m148j5447n839J650
8121g869M788N037n13K991P639Jj792p473q64O539J979j834p805L510N805m39
8105I700M947l10j75L484J261k895P643J8j3291k756K876O77J236j561o114k56
8089D484k537M868q11j922l478L699M709L614N060M390k856n645m577J798Q42
8074A1638j756N033j387k166L886k867n30qj142k176L020P07M5r172m270L325
8058B180r03l074L81j09M236L448N071N996J057m046l37q87l58L603q251o99J1033
8041A8341N874O265R261J0076K714n939n348q218m663p695k075R73O592L262Q81
$$ y = [4653, 881, 1563, 7090, 9224, 6661, 6237, 1746, -705, -6658, -5993, -4830, -2958, 2007, 4072, 2272, -925, -1611, 6607, 10894, 6699, 7798, 7576, 11237, 13658, 15461, 16175, 17005, 15915, 11767, -3680, -9519, -7869, -3081, 1956, 1443, 4434, 12073, 12074, 10282, 2809, 1945, 8484, 10463, 8629, 824, 4334, 10139, 9700, 14647, 14337, 14162, 17646, 18907, 16012, 23655, 23673, 10382, 7626, 10502, 11179, 12415, 10854, 4740, 4484, 1947, 6815, 6004, 4082, 604, 4303, 9012, 12626, 17686, 22076, 19220, 13575, 8998, 10796, 11638, 9882, 14915, 13528, 11362, 15248, 12381, 11851, 11843, 10701, 8525, 11545, 12252, 12297, 3125, -1145, 2180, 1277, -1797, -1416, -1525, 2711, 6159, 11230, 17226, 18283, 14237, 13900, 13013, 12655, 16258, 8007, 7308, 18341, 24215, 30480, 39741, 49817, 52531, 46592, 41244, 33026, 28363, 20668, 18593, 19566, 26158, 29420, 30301]
8026C0301J504j241q587j273J943m0o759p265K253J709L290N218m068l976L763
8011A6772K094J123J377J240j964m04J1421P392R693R278l005N881J1035J1211
7997H3144M816M786N021o813j5128q642q029j1080j0483o068j424K041q08j440
7983B9893N728P275N842J234O278J0398P082O48O463M492k243o663j0417j4247
7969E1763q938j140J003k277r206q014j868N059O447M793K413J036M423P553M16
7954E3463q759n601k652n507J058N287O64k899K307J199k478O29l203K9k448J960
7938C3049N699M967O627Q767J0319R919L140n961j6465j3911j3811N60k36j301
7924C1362o684j03l64n732m480J935L214K273m183r319n108O792R8l950j217P993
$$ y = [30301, 31805, 30564, 21977, 20704, 22647, 22607, 15848, 8583, 10836, 12545, 15835, 21053, 16985, 13009, 16772, 18866, 19989, 21366, 22606, 20642, 20238, 31659, 39051, 48744, 58022, 55017, 60898, 71933, 83144, 87960, 92746, 97767, 90954, 75826, 67184, 59155, 48075, 37592, 31524, 30100, 32141, 31333, 29893, 35621, 42896, 48738, 49972, 56250, 66648, 73730, 74378, 80841, 85333, 83090, 76427, 66010, 51763, 42825, 41685, 42688, 40411, 31205, 23191, 21323, 26382, 32829, 37622, 40035, 41071, 45494, 53047, 53463, 44704, 39103, 36451, 30944, 32002, 37289, 37953, 35054, 37361, 38560, 36082, 36711, 33508, 33537, 31089, 33049, 38748, 43715, 50342, 59109, 69428, 79347, 82487, 76526, 60061, 46150, 32339, 32899, 32663, 31362, 24678, 24575, 24211, 18479, 13999, 15934, 19148, 21421, 17238, 7919, 2811, 9603, 9701, 5751, 4534, 12527]
7908A2527J388o456O83l512l383p56P854R458K201n079K291m818n760K24O191
7893A3053l781M57N676L319j1959m512J952K580l68k164M514J589k366M36O126
7878A4552M206K618rj0242o714p247O2J1441N297j305L650K462j877n113M28j436
7862A0773m550o606J016J72L993P15j97L686k488k659J174j17j782J762N25K706
7846H123l295q619n32O716K707k831Q58k09L470K750N24J308k87o916k149J1151
7830A2769K560l020k53j248j0044J661J0119K34J671m145l080K772r57k779l031
7815C229j924n124P672P78N41m356k224K321J533k653M848M41j0024Q602L667
7800G327j454n622p03R899J2105j155m391q180k785P104K910p409p184K766k831
$$ y = [12527, 13915, 7459, 8142, 4630, 1247, 491, 8345, 17803, 20004, 14925, 17216, 12398, 6638, 6862, 13053, 9272, 9729, 15405, 18724, 6765, 2253, 4205, 6785, 6417, 4253, 8767, 10356, 7990, 8426, 14552, 18758, 21376, 21367, 11125, 4411, -2836, -2774, 8667, 13964, 12659, 16309, 18771, 16894, 11781, 12209, 10773, 6223, -383, 633, 805, 4798, 5513, 5316, 9002, 6514, 3855, 5029, 4912, 3130, 4892, 5417, 8123, 4828, -3791, -4323, 2393, 5100, 2269, 3127, 2918, 6388, 9138, 9662, 10970, 10683, 3767, 1618, 12769, 15329, 12309, 12056, 10808, 764, 2425, 12544, 12778, 14449, 10304, 7224, 9996, 9039, 6260, 3229, 1305, -3819, 3853, 4631, 5172, 816, -1408, 913, 2446, -207, 4641, 5082, -4942, 3660, 7327, 5873, 251, -452, 9447, 21552, 20397, 16006, 7826, 5041, 12145, 15055, 7646, 462, 3228, 397]
7785C97K608J716j938J350K17l205K003M0j274j547N95l796K218k45O54N177K329
7768G299K008j868k561l793K875Q12j350j298j599L116J683L36K77l820j657K802
7752C262P204J150k683j668l239L09J362l036k50j325q16K625L266N859q394o868
7736c242J0175K031n595k519L304Q88N335J901j107L358q716p663j859k089k90
7721f088P858O217j229p053O98N69K968O61k493r72P17J810J900n382J818J292
7705C291L442l15M265M605L564p532q087j982O147r17j58l325L59n066L579K975
7689D845j181o321K3J1994K100p534K159m182j040j421m682M437L39l159j465
7674e088l801K455L563K453j722J566N38j536L91J975J80o890o738Q4L958K509
$$ y = [397, 3005, 4721, 2783, 4133, 4350, 1145, 3148, 3188, 1914, 367, 962, -2834, -616, -861, -207, 4970, 7299, 9307, 7439, 4878, 1085, 3960, 4772, 3422, 2124, 525, 3641, 5324, 5660, 5937, 2117, 460, 3262, 10466, 11616, 8933, 7265, 4026, 4335, 5697, 2661, 2411, 1086, 270, 2895, 6161, 12020, 3626, -3242, 6933, 8964, 3369, 850, 4154, 5042, 10377, 12278, 11171, 14529, 5813, -1850, -3709, -5798, -6088, 1770, 7987, 6758, -295, 403, 972, 3940, 4601, 2108, 1136, 1853, 3663, 5563, 181, 1999, 3291, 6733, 6418, 10683, 15288, 18852, 11320, 3233, 1251, 7398, 6481, 6323, 2998, 3357, -1709, 1870, 4845, 3664, -2657, -2634, 9360, 11460, 3926, 6085, 1903, 863, -558, -5240, -803, -464, -3623, -5088, -8889, -6434, -2871, -418, -2140, -574, -36, -1572, -1181, 794, 974, -5916, -12654, -12570, -8612, -6103]
7658f103N084N865j1739q624K961L162K705P308J0667M941q91q440q710k319k040
7643f173j166J861P071J602o262J291N458J89J850l854J629O644k655m545J851
7628D791L681O38n366p712m39N81J310K283M430n634o672J515L129R895O408r30
7612A1908o529j3189q326J890O984L066m613n862m66N896J2527M355j452k242
7598C947L704L217l175r756m339J1664Q170m520m062m287n530j28K46P24M495
7583C70O111l479j140m455r16K916P453M528j3077q359j660K159P409J2304K8434
7568C8598L2185J8396l848k4572l0376k2067j1645J191K813p93P679K873n146
7555E288p384q849m846L256R098R833n21K515l455k576R005k148l672k936R131
$$ y = [-6103, -1019, 4846, -6893, -15517, -12556, -9394, -6689, 619, 11286, 16227, 15336, 6896, -1814, -4133, -6173, -7339, -5478, 1593, 3195, -3067, -1776, 3682, 3871, 5721, 1867, 3496, 10140, 7485, 2940, 4791, 8472, 9110, 3744, -3968, -4407, -3826, -2516, -233, 4197, -1437, -8109, -6594, -3465, 6430, 12838, 11908, 5379, -7810, -16136, -14246, -7262, -4196, -8809, -14671, -15137, -9241, 3286, 7641, 6189, 3947, 7651, 10868, 7693, -2063, -6402, 5262, 13432, 8912, 4850, 563, -4967, -5095, -4849, -4125, 370, 6481, 3002, 1862, -2593, -3509, -593, 6860, 11388, -1689, -10048, -11708, -9549, -2140, 10164, 38598, 70783, 89179, 85331, 60759, 30383, 8316, -3329, -2138, 675, -118, 7561, 10434, 5288, -2096, -10945, -15791, -12535, -3437, 6396, 5875, 8390, 4935, 2359, 11364, 9216, 5544, 2608, 11739]
7540A1739k983j0089j972M61N723l196K917M510K956R51k114k415m423j0420m039
7525a2394K772k911M502Q078K146M121j598k790N419K571k325n30r63p717j4421
7510a6040p891L394M145J0624J0620K119J47k142l601K625P460K822o854o011
7496A417n104J120q8L764K415k083J979j873o869l705l612k652M755P961j124
7481c699j610j175K518k868J819L5N651k373J063N847N650m279p467o176j776
7466h840N146l373p474m452J983O651L448P221R61n230k453L320n072J276R593
7451B705M697K356j2381j856m062j078K301Q802p888k800P089M322r90j92K609
7436C634M405M48k357n53J570K435k150N52l771j608M257k986L327j575n575m959
$$ y = [11739, 8756, -1333, -3305, -2844, 2879, -317, 2600, 7110, 10066, 11017, 8903, 6488, 2065, -8355, -12394, -9622, -12533, -8031, 47, 2193, 6314, 4716, 1926, 7345, 9916, 7591, 7061, 6098, -1619, -16040, -23931, -20537, -16392, -5768, 4852, 6971, 7118, 4976, 1375, 4000, 11460, 14282, 7428, 1417, -3687, -2567, -2655, 1109, 3524, 1441, 3420, 1547, -5322, -9027, -12639, -15291, -10536, -2575, -3699, -5309, -6484, -3966, -6834, -5015, -4980, 671, -1702, -639, 5208, 10858, 6579, -888, -7064, -8840, -3694, -7067, -14541, -18993, -17010, -10359, -6911, 310, 1271, -3959, -6412, -3092, -8164, -6888, 2705, 7402, 9758, -2623, -4479, -8541, -9619, -7318, 1484, -6404, -9204, -2115, 2207, 1217, 1025, 3634, 8039, 8487, 6130, 5577, 7147, 9582, 7432, 7984, 4213, 2605, 6862, 3876, 7203, 5628, 53, -4906]
7420d906J498P286k273m178K06j867K836l566J915M208k772r16J744O73j092r02
7404b106m438P29K644l21Q603Q649K097L25k197p009l604o917n476l731L661L899
7388e192j206p981O664N582k639M419J849o464j683n715l193O195J3500k90n523
7373a677j568j402m044L436m95Q161M639n990j399j744n019K156J957k209M310
7358h88N465J982J389n588k340J413K245L020k056j367J824L064o794j2680k676
7343a3987J0115j093M397N196o666o672M502N713l961m560J577J235J100M634
7329A530J712o341o780k391N155P096m926m52q97K13K357L042K384l366l96j647
7313c707k79k309K259r45K3M028N304j036n421j4486p42J0523N558N782P456J191
$$ y = [-4906, -3408, 3878, 1605, -2573, -2367, -4234, -1398, -4964, -3049, 1159, -1613, -2529, -785, -112, -1204, -2106, -6544, -5815, -3171, -3492, 5111, 13760, 15857, 16182, 13985, 6976, 3372, -3545, -9021, -12752, -9091, -5192, -6398, -14379, -7715, -2133, -4772, -353, 1496, -4968, -6651, -12366, -15559, -9364, 4136, 3846, -1677, -3245, -4647, -8691, -5255, -5750, 2411, 7050, 1060, -339, -2083, -7102, -4946, -2989, -5198, -888, 4577, 6559, 7948, 2360, 20, 1433, 3678, 6698, 4642, 3275, 5099, 8163, 1369, -11311, -13987, -3872, -4965, -568, 4628, -2038, -8710, -4208, 1505, -2456, -7016, -5439, -4204, -3104, 1530, 3242, -3099, -9879, -12270, -7115, -19, -4945, -5397, -6294, -6081, -3724, -682, 1702, -1664, -2060, -3707, -3986, -6295, -4036, -4981, -4958, -930, 4374, 3338, -2083, -16569, -17311, -6788, -1230, 4552, 12008, 13199]
7297A3199j025q06J043J952m322o274j876l724J750L342l17n444k905K617J246
7282a544N288M602k399L949K531n100k166Q43O629n291J408M352O896L442p238
7267A6202q455n367n9K670j234k675j428o41j347J048j670m844M568K008j086
7252b310J040o3k624j784m540M199P655r22N919j671n950j186j080N146j810n721
7236e702K662O410N86j576l73J81l044k759o420q469M478O131L738R570J452o888
7220b3l19J89n724p041M172P58l083O290L164j412m457L23M439k950l257K087
7204f844L934N682m644k094k909k306K220K109N697N164r56m862J232r8k817m385
7188e877n072N284K6O391n892K054N523Q247K784J513m259j855o635j679N773
$$ y = [13199, 12174, 11368, 12411, 14363, 10041, 3767, 1891, -1833, -83, 3259, 2942, -2502, -5407, -2790, -1544, 3744, 8346, 5947, 9896, 12427, 7327, 5161, 6004, 12633, 7342, 8750, 13102, 19998, 23440, 16202, 7747, 2380, 2321, 4991, 3757, 1082, -346, -987, -2334, -1286, -2956, -7800, -3232, -1224, -2310, -1270, -1333, -3957, -5741, -10281, -6082, 1573, 651, 6570, 4899, -1051, -2237, -3317, 1829, 19, -5702, -3040, 3370, 3956, 2380, 2007, 2188, -856, -3615, -10035, -18504, -14026, -7895, -4157, 5413, 6865, -23, -342, -153, -5877, -12918, -8746, -7988, -11071, -4781, -1617, -3029, -7486, -7163, -2724, -5674, -8931, -6844, -2910, 2772, -1872, -3966, -6875, -9181, -6961, -4852, 845, 6009, 5053, 191, 1423, 1325, -1492, -5877, -10949, -5665, -5639, 752, -5140, -3086, 2437, 10684, 13468, 14981, 10722, 8867, 2232, 553, 6326]
7173F326j676p566n646j824L068J630J3996L302P51m743n268q32J837j342L995
7158F008K720k388n202R90M099K749n044k321j455o303m188k190o226j117M483
7143a5385M450O764l413K195J061L241j367K105j338J422M897N95l671l637j513
7128c594J93o100j553M811k37k812n948J932M232K606J239O845O328p780n193
7113e031J589L096l773P69K706N26L821L787R39k22p812k768J518P62P99j942
7097a236l478L717q9k452M599P097J208n902n506o29O046M533j984j825J554J296
7081F949o523n463J616J412j091O484k000r579m516m421l822k75K140O165J886
7066a1038O834L269J295J965r80r121n466l861P822O298j462l903k070J696k642
$$ y = [6326, 4650, -2916, -8562, -10386, -7318, -5688, 8308, 11610, 12361, 7618, 2350, 1518, 3355, 2013, 6008, 8728, 6340, 1138, 2128, 6227, 8976, 3932, 1611, 156, -6147, -10335, -12525, -18751, -19868, -15385, -10935, -4171, -7584, -5389, -4328, -1087, -2454, -349, -1687, -265, 4632, 5227, 1556, -2081, -3594, -3401, -9501, -11054, -6243, -6480, -9292, -15240, -13308, -9076, -6470, -5231, 1614, 7942, 162, -5031, -3442, -346, -4119, -3350, -644, -118, 3703, 7490, 8429, 8207, 395, -2373, -855, -93, 706, -1236, -4714, -997, -1086, -3538, 1061, 8158, 9366, 3464, -2042, -2671, 3375, 7908, 5924, 4099, 5653, 6949, 426, -5037, -3421, -2009, -3100, 3384, 1384, -8195, -12711, -17132, -20954, -21229, -19089, -12924, -11038, -4204, -935, 360, 2325, 1345, -7776, -13242, -17103, -9281, -2983, -4445, -8348, -10418, -8722, -11364]
7051a1364L393M205j535r98L428Q687K781p802k608m082l771M252Q400r52n300
7036c266n02P167K141p69j542M469j617o499M315m231k240l815L439K501L990
7021C541k600p31k304m321L518k137J397L51K256L191R8K439r10o154o642N051
7005c957O820m716o652q166M929R069j562j059m688o323K757Q810j591j608m411
6990a2348O406J696R36J757P860M992m689Q16R84J57j191j474o556J461o309n588
6974a1090j0449M545P220N728P978N670l747q167k493O353M544K353o679J87J661
6959C614M473p73l594n442m9L07l054J335N418M022L980m970m044o16j763m843
6943e999j083k888Q18P877L557m340l217J535M918l542J813N277o239k907J930
$$ y = [-11364, -7971, -3766, -5301, -6299, -2871, 5816, 8597, 795, -1813, -5895, -9666, -5414, 2986, 2034, -3266, -3768, 3399, 5540, 4771, 3229, 7698, 6081, -418, 3897, -334, -2574, -6389, -2950, -449, 3541, 941, 210, -2094, -6415, -2897, -5034, -3637, -3286, -1030, 2161, 2259, 4698, 3788, -2366, -9008, -3957, 2863, -1853, -8505, -16671, -11742, -2673, -4235, -5294, -9982, -16305, -13548, -4738, -6329, -7937, -12348, -5942, -4246, -3310, -1553, 6307, 11299, 6610, 7426, 8410, 8567, 7376, 5902, -654, 807, -5502, -11090, -21539, -16994, -9774, -4046, 3932, 9602, 5855, -2312, -4805, 1548, 6092, 8445, 1766, 1953, 3614, 8087, 7314, 3720, -1722, -1771, -1464, -4518, -3183, 2235, 6257, 10237, 5267, 1223, 607, -1156, -5999, -7082, -9970, -9152, -1275, 2282, -2058, -5275, -3740, 1178, -2364, -551, 4726, -1513, -4420, -2490]
6928b490M584K984L81K545j919o117m334p592p206M481L324L816P01j496O5L458
6912d815L063K682L748Q60M661m592m180n323M926L902L65M36l694N082J67o076
6896A212K954q05l854j088j659l603q944m615k321k441M26M541L307K438P0l078
6880a7460J913Q554P361M077l073o85l497m593n404j921Q101Q065n717J528Q62
6865a889l409K019J407j069j1140p599O102K543J596O363N414J710l192n025M227
6850a942j929K211m960l203L300J626p600M518M015M814k179q485l85J795j950
6835a0354R398L033q010L796L882j684j072J429K079L940j371q31j340l201k924
6820c230q42m216l626K039R158m478k021J540l091j666L454N279M901L089j546
$$ y = [-2490, 2094, 5078, 5459, 8004, 6085, -32, -4366, -11958, -19164, -14683, -11359, -7543, -6842, -8338, -8273, -4815, -1752, 930, 4678, 5538, 10199, 5607, 1427, -3896, 1030, 4932, 5297, 5733, 2039, 7121, 7288, 1212, 4166, 3361, -493, -1581, -3240, -6843, -15787, -20402, -22723, -25164, -24738, -20197, -16890, -14452, -14382, -17460, -15547, -6993, 368, 4445, 1372, 687, -2810, -7403, -12807, -14728, -6627, 1438, -4279, -2751, -1889, -5298, -3279, -1872, -2941, -14081, -21680, -15578, -13035, -11439, -5076, 338, 2048, -1144, -6169, -1942, -3871, -1660, -6620, -9823, -6523, -4897, -12497, -7979, -3964, 850, -1329, -9814, -10199, -8404, -10354, -956, 2077, -5933, -2137, 1745, 61, -1011, 418, 2497, 6437, 5066, 4235, 2895, -306, -3230, -4072, -8288, -11914, -9875, -717, -5195, -7216, -5676, -8767, -10433, -6979, -1700, 3201, 6290, 4744]
6805D744Q36P793n854m208k327J979l930K336o23m844l689j663p301l74N602j976
6789a3499p77J1276Q044m96m206n622m588J065J967N935N57J316m219M534R836
6774A1123m889P60l294l254J905j994p278N613L722k980n697J860K872J468K234
6759B171n250j227k196l324N123O34J384l044n035J130N45n986j79N186O761K800
6743e07k343l057o5p12L657R902K068J248J624o680L093l140K738L476k702J832
6727A0432M611o331p240j797j345K773P58j468K477P535N709R94k757J278J360
6712A6989k469L34P766Q222P585Q721K1384R843k782k0408k3783q528l525p642
6698A1707o135o426k577k514j970j910K742O01Q234O921l213j273j303M810J93
$$ y = [4744, 5580, 13373, 7519, 3311, 984, 2963, -967, 1369, 746, -4098, -7787, -9450, -16751, -17125, -11523, -13499, -14276, -3000, 5044, 4548, 342, -5280, -9868, -8803, -6836, -901, -344, 972, -3247, 1287, 11123, 6234, 6994, 3700, 446, 2351, 357, -6921, -1308, 2414, -566, -6263, -4403, -1531, -63, 2171, -3079, -4306, -6502, -9826, -4703, -4069, -2685, -5729, -10764, -9634, -9089, -15075, -15254, -10068, -3307, -507, -2850, -5907, -5972, -6684, -3027, 6875, 8943, 10191, 11815, 5135, 8228, 5088, 7826, 11302, 8600, 10432, 15043, 8712, 1472, -325, -1670, 1103, 1861, 393, 2870, 10405, 16114, 17108, 14351, 15629, 16989, 14520, 14854, 22620, 30842, 38427, 47148, 68532, 78375, 75593, 55185, 31402, 22874, 19349, 11707, 5572, -854, -3431, -5945, -7915, -9825, -7083, -6482, 1752, 8673, 5460, 4187, 2884, 7694, 7887]
6683G887k932K977k428k776q165o951K573J016K461N534M407M83j454m035k110
6668c513J323q89j301l57O43M398P732j679p003j136K614O02k65J941L29m145
6652g06m136J065L343j436q564M590N861N022n063j636J28R322J168p483l786
6637b311M151J261L011K123l155R75j292n745L652N836J523m066r43p530m512
6622g022p96J988L036J756l342Q33M224n748j147j20P866K454o762q410j013l301
6606a5504k346k218K526J0339Q542l833m828J444L207M046M91n252L000L945N913
6591I472O972l062o399l054m732J496L738J4465K34j781p35o122n848l956m916
6576d228J305j564L432K776K656l865l151O4l211j273P580L974l381K877P133
$$ y = [7887, 4955, 7932, 5504, 2728, -5437, -12388, -9815, -8799, -6338, -804, 3603, 4086, 2632, -1403, -3513, -2190, -3079, -4380, -4737, -4094, 304, 8036, 6357, -646, -1782, 832, 1434, 1169, 3110, 3439, -706, -4842, -3777, -434, -1870, -10434, -5844, 17, 5039, -24, -1660, -1532, 7790, 8958, 1475, -2311, 1840, 3101, 6112, 8235, 5080, 6055, 4763, -982, 2670, 8506, 10029, 5963, 5020, -2510, -7022, -7818, -5830, -2794, -1038, -4380, -3547, 677, -5071, -6218, -6338, 1528, 3982, -2780, -11190, -12203, -15504, -17850, -20068, -17542, -7203, 1339, -2494, -7322, -5878, -2671, 1375, 1866, -3386, -386, 3559, 9472, 16444, 13382, 6983, 3929, -803, 693, 4431, 18896, 19130, 17349, 16614, 10492, 4644, 688, -4228, -2923, -4487, -1055, 1721, 4377, 512, -2639, -2575, -5786, -7059, 521, 4495, 1114, 3991, 11124]
6561A1124O317n029j5136K078N497p503l843K306j697N573j665p860l799J665
6547a1972m387K882J877j649M845L092k707J567J196O723j371m578l885n005j554
6532a4926J1793J3104l080q300o065P26p02m525J45J985L341O468m825k973M658
6517c176J4235R778q488p047O1K581L736K97o042q949p079l756K384M594J264
6502e607M284n018K050O811k28q01k950m043J68j31K337N968q01n516l110m19
6486g006m328P617N089J117n961l678m469J803O600L640R5J079N623O241q29K121
6470A4754m37r619p791L85l700Q46j854m207M44K544l999L038P98n10P123k422
6454d607n801k773N286P058o80n19n032j354n909n769l64p94J590J013K998O747
$$ y = [11124, 17441, 12412, -2724, -646, 4851, -2652, -6495, -4189, -5886, -313, -1978, -9838, -13637, -11972, -16359, -13477, -11600, -13249, -8404, -5312, -8019, -6452, -5256, 1467, 96, -4482, -8367, -13372, -14926, -3133, 9971, 6891, -1409, -7474, -6748, -7450, -11975, -11830, -9845, -6504, -36, -4861, -7834, -3176, 11059, 20837, 12349, 5302, 5363, 7944, 11680, 11977, 5935, -3014, -10093, -13849, -11465, -6871, -5607, -1323, -6341, -4291, 2520, 2292, 1491, -1459, -5502, -5334, -5465, -3128, 2840, 2039, -3477, -6587, -7006, -11334, -3717, 1372, 2489, -3472, -7150, -11619, -9816, -3216, 424, 519, 1598, 7221, 13462, 12633, 14754, 14317, 4698, -3093, -2708, -6408, -5562, -7416, -11623, -11179, -8635, -12634, -9596, -8798, -9308, -2185, -4607, -10408, -13181, -7895, -837, -1517, -2036, -7068, -8422, -14331, -20100, -20464, -21258, -19668, -18655, -15657, -8910]
6438h910j811j98k031n944M722J309k785Q027R593M728l962q40m000m012l424
6423i538n54K390j877m009O444N913n810m144p00j293M120K525L187k24J819p038
6407h789l60o52P331O527L470k551r021k611Q082n461j092l711l937K186L961
6392f628N673N068J955m193j526J661L298n009m798J920j059j168O555M094k453
6377C390j072l863k538M94K689P80q546j548j341N061Q282P560l726O38m12N94
6361F442Q327O472k390j0156m986j193J189j965p65N279k416P35L864m995j359
6346B083K200k376j737J122L012R50o791k563k849L329N068l565J008m15n744
6331g268J973K829k747n539N369N255K609p39K443o74p096j073N421j161O715
$$ y = [-8910, -10721, -10919, -12950, -18894, -14172, -12863, -15648, -7621, 1972, 6700, 2738, 1898, -2102, -6114, -9538, -10092, -7702, -9579, -13588, -7144, -1231, -7041, -11185, -11885, -13178, -9058, -6533, -3346, -3570, -1751, -8789, -9149, -9801, -2470, 4057, 7527, 4976, -4045, -6656, 1426, -4035, -5127, -8838, -12775, -10589, -6628, -955, 4113, 6068, 1875, 349, 2010, 5308, 299, -4499, -2579, -3638, -4806, 1749, 5843, 3390, 2318, -1545, -4083, -3589, -900, -120, -8666, -10214, -11555, -6494, 1788, 9348, 5622, 6260, 5848, 6442, 14769, 21241, 18851, 8695, 3709, 2516, 3705, 1740, 975, 6254, 3838, 4573, 8437, 3442, 2083, 4283, 1907, 170, 1292, 4304, 5254, -1537, -4100, -6949, -3620, 1448, -2117, -1109, -1524, -7268, -5295, -2466, -5213, -10752, -5383, -128, 2481, 1742, 4185, 3511, -3585, -4658, 763, -398, 6317]
6316F317k243n982k408p935j321R707O095m38j839J372l50J540O918m842j735
6301B856K077m345j0182j853L028K010j595N771R993K022o458r527k414l521m821
6286a6959R884R723M460r445q188N27O125L6M82J553k860p304m395n78J2825R427
6270E313n205q215K304O805j0144m912R681o944j6791J0843K0988Q42p664P929
6256D830L589q080k326M211p59q050o775M68l856K939N533N55J498k953l094m91
6240a2761N951J107L136p884k458J0642N647n557K293J052L405m413j232p23l129
6225d924j717O875R12o97o4k824l080K659R150j51q873Q992l911j4966m463Q231
6209h851M695j066K068O461j0662p370N227Q462j924N070N507K540n108o895j881
$$ y = [6317, 4074, -1908, -4316, -12251, -13572, -3865, 2230, 1792, -47, 1325, 975, 2515, 9433, 4591, 2856, 4933, 588, -9594, -11447, -8419, -6409, -8004, -2233, 7760, 9782, 3324, -6203, -8617, -12138, -16959, -7075, 2648, 7108, -2337, -10525, -9998, -3873, -3837, -3355, -1802, -4662, -11966, -16361, -16939, -4114, 5313, 108, -8107, -5803, 1002, -9142, -14054, -4373, -11317, -28108, -17265, 3723, 4565, -3099, 4830, 8419, 339, -1987, 2224, 1465, -6585, -13360, -12892, -16748, -13809, -8276, -7721, -6223, -9176, -12270, -12761, -6810, -5703, -2567, -10451, -12909, -2267, 3380, -2177, 116, 1168, 4573, 160, -1072, -1795, -4924, -6641, 234, 1146, 449, 385, -2439, -5519, -2860, 6290, 6139, -2734, 6258, 2347, -12619, -17082, -8851, -4156, -5222, -3154, 3307, -7355, -14725, -9498, -1036, -2960, 2110, 7617, 10157, 5049, -1846, -3727]
6194c727L285J088l688n147j428k870l946N414Q142O365m596k825K21K035n247
6179f924K47k605Q49L512L354m308N47P528J394k331j625K358n391J785r98m639
6163g247j516R15q99K00o52m785p155L779N122j730j911L898R941N091q66n835
6147c650p494J749K508j263M716L272j508m618M78J588o6j346k478L150P410o07
6131A841j785m28L686j969m255J259n827Q23O306N787m985l903m737J617L978
6116b592J067k247k092m149K745O266O027K52n44p335l319o822l093J0133N596
6101a07L852k419o566L659J986J128J250l630o373m957M051P611k118k993Q58
6086d768K293j053K325m011j708O03K48n13J346L394l312J642L159L055J839M551
$$ y = [-3727, -442, 646, -3042, -8189, -9617, -12487, -16433, -11019, -2877, 3488, -1108, -3933, -3712, -1677, -6924, -6677, -9282, -8433, -4921, -1567, -5875, -5328, 2200, 3594, 1263, -362, 1996, -3395, -1610, -2608, -7247, -8763, -7848, -8747, -8547, -9199, -13984, -21139, -17360, -12238, -13968, -15879, -11981, -2040, 3051, 2185, -3650, -11144, -9395, -6887, -8150, -3434, -162, -1670, -6288, -5810, -4222, -4288, -5634, -8112, -4962, 2448, 1841, 56, -372, 3314, 1345, -2910, -1651, -7478, -6655, -349, 5438, 453, -3450, -8187, -6570, -2592, -1525, -3772, -5864, -10013, -7268, -1002, 5025, 5277, 4733, -2602, -5921, -12743, -15836, -5703, -107, 3745, 1326, -5240, -1581, 405, 1533, 2783, -847, -7220, -12177, -8126, -515, -2633, -5626, -4768, -2475, -3528, -1203, -5214, -6922, -6319, -6071, -6584, -5238, -1844, -5156, -3514, -355, 2700, 4539, 9090]
6070I090o509p569r555l209R445R735M285r037o95P895j430j238Q446j808j30
6055G716k731p62q42m272R8m403L401L975M285N467l641r304M680L03K305j536
6039D739n500p514P69K924K393k585k961p373J36O720J899L086M558k288J802
6024H05J347l363k561m41P940O184j421o690m871l233Q33J485K017R85L823k247
6008E92o345o656l327K611P520N535k032k101l466L686M187J655l305j716j585
5993d747M573j166n699j803N751R379J122o207n631l235N594J557J580Q708j530
5978H246n971k039q047o623K419K226m346J0382O617m103q42m986j970M322N022
5963C07j417p89K21k788n884Q139L211O328J919M588M82m456K5Q03r897o467N851
$$ y = [9090, 2581, -4988, -14543, -17752, -8307, 1428, 5713, -3324, -4019, 3876, 2446, 1208, 9654, 7846, 7716, 4985, 4223, 3381, -891, -793, -5196, -1795, 2180, 6465, 11932, 8291, -1013, 3667, 3970, 6275, 4739, -761, -8275, -7506, -4582, -2189, -4774, -7735, -15108, -14972, -8252, -6353, -3267, 1291, -997, 805, 2152, -1211, -3772, -4213, 3727, 9911, 8490, 1800, -3071, -6304, -5471, -3986, -1969, -984, 2839, 592, -5753, -12409, -15736, -13125, -5605, -70, -2102, -4203, -7669, -3983, 204, 1859, -1446, -3162, -4747, -174, -1340, -7039, -8842, -3091, 6288, 7410, 1203, -4428, -7663, -2069, -512, 1068, 9776, 8246, 2275, 236, -7811, -14434, -12015, -9789, -14135, -3753, 2864, -1239, -2081, -7067, -9037, -4715, 307, -1110, -1899, -1678, -4466, -10350, -2211, 1000, 7328, 9247, 13835, 14317, 9861, 9886, 10689, 792, -5675, 176]
5946A76L423p613m387M088O437j823n082r5Q895L798m569m989K152R111l591j1630
5930e699j666P619l038m138L94K32o716o446l70P902N728k542r26m48M370k931
5914h675N934R016M32l573l211L186J298J304n567L85p66m980p122m691M261L739
5898i030Q184N373K356l180m711J999r557q082P327K373M854j436j1349m203J910
5883a7172q29O751Q204L904N489K253m406k555j177m170n676k66M005O360m717
5868d002K679j26K791N088j282j689k108l211o02o188K301N619m26M530L628N187
5852A2189n111r275j114J677M591M870N16m698L74K445N358k558q262o744n097
5837a0839l213L225O223M544M879N214M147J464j0555q552l841j870n59K148j79
$$ y = [176, 3599, -4014, -8401, -4313, 2124, 301, -4781, -4876, 4019, 7817, 3248, -1741, 411, 9522, 5931, -5699, -7365, 254, -2784, -6922, -6528, -6296, -13012, -19458, -19828, -11926, -6198, -8740, -9666, -10114, -5744, -8675, -2741, 6275, 6707, 3134, -77, 3109, 4407, 5711, 144, 529, -237, -5217, -12339, -17030, -12769, -9030, -846, 4527, 6883, 3703, -1008, 991, -8566, -16648, -9321, -6948, -2094, -3530, -14879, -19082, -17172, -18001, -11250, -3046, 858, 6347, 8600, 4194, 1639, 462, -3708, -9384, -9650, -5645, 715, -4002, -1323, -1449, 1342, 6430, 5148, 3459, 1351, -1860, -2462, -8650, -6349, -730, -1156, 3374, 7002, 12189, 7078, -2197, -3311, -1634, 2957, 7827, 8343, 3645, 4019, 6464, 11822, 9264, 1002, -5742, -10839, -14052, -10827, -4604, -60, 4819, 10033, 14180, 15644, 5089, -3463, -7304, -9174, -9733, -7585, -7764]
5822g764J0448O818l361o377q154P03K993j91o381N70J949K29L625P024o887l860
5806h616L068K548m236j396L918k045n923j492K184P592R74l054j182M480O50
5791b530j1181P22J089j55l836o65M905J0804m144J575J976p271j1264m384k533
5776b6892O461N849m33K482J737L178o78J652J1657m072o443L386k94q32M418
5761A176O556j038O03m461n622J737Q48L77Q87Q253O854n874p816P40p160J631
5745b309J629J280k291l6K083j837l521o767k787M750K073J408R19P672O73J79
5729C118n823l922k799R51K662o678M1L653N32K340j970j053J855P80m792j778
5713a2883L51J0642L777N012m445o90j489j464P46L35p66j754M152J220L58L364
$$ y = [-7764, 2684, 9502, 6141, -236, -8390, -7687, -4694, -4885, -11266, -10696, -8747, -8518, -4893, 2131, -4756, -8616, -5548, -3000, -7236, -8632, -4714, -6759, -12682, -14174, -11990, -4398, -3424, -6478, -7660, -3180, -2530, -13711, -12989, -11900, -12055, -15891, -16556, -11651, -847, -4991, -3416, -1440, -8711, -19975, -24359, -26892, -20431, -14582, -15015, -12533, -10796, -7618, -8296, -6644, 5013, 941, -5502, -2116, -2410, -3242, 1176, 7732, 6694, 7297, 2836, -2786, -1049, -201, 176, 1063, 9316, 16170, 10296, 2480, 3220, -3940, -2309, -680, 600, -1691, -1727, 356, -1481, -5002, -11769, -14556, -9806, -7733, -6325, -5406, 2266, 2939, 3118, -2705, -6627, -9426, -8475, -5813, -12491, -12450, -8797, -8265, -5925, -7895, -8948, -7093, -6313, -11105, -12883, -12532, -1890, 1887, 6899, 2454, 1764, 275, -1189, -443, -108, -874, -2628, 1524, 2744, 3102, 6466]
5697F466j454J028l44m623l912l876j299K187M212n664k409Q94J271l343J826
5682i040N45p32K054N919K796k261L884L152r42m328r52K467J68J170l192k616
5666a908O19Q145j100n851m122j239k573N164O890M133p134j323j482O54m729
5651e856n276K276L315M633O19q58j475K679L119o316k062k30R36M271J261M085
5635E121m602j4800K984O949L347l355l400K866M681J156K822k471q770j971P839
5620a604P785p161m252m521J022j583o274l93L453N229N001P439k355J286J717
5605D789M461n24j029n050L521r09l592j3004p44Q625J3810K468o451q483p044
5590i156o28M97n02K319J755K709N268r99k457j122o069q555L754N794K478j087
$$ y = [6466, 5012, 6040, 5696, 1073, -2839, -6715, -8014, -5827, -1615, -7279, -9688, -8794, -7523, -10866, -9040, -8495, -9227, -7173, -1254, 1542, -719, 3165, 6317, 5375, 1047, 95, 2562, 2730, 3900, 708, -1908, -1289, 6856, 5756, -95, -4217, -5456, -8029, -2865, 4025, 8158, 1024, -299, -1781, -1127, -5856, -11132, -8856, -5541, -908, -289, -1147, -2622, 57, 3176, -3140, -5202, -5432, -4496, -225, 1036, 5121, 519, -14281, -11297, -4348, -1001, -4356, -7756, -4890, -209, 947, 3769, 1298, -7472, -9443, -1604, 6181, -980, -5232, -9753, -8731, -10314, -16588, -16981, -13528, -8299, -3298, 4141, 1786, 3072, 4789, 9250, 8726, 7697, 2647, 6168, 5259, 1667, -11337, -12081, -3456, 10354, 12822, 6371, -2112, -9156, -9784, -9287, -9789, -7470, -5715, -3006, 2262, 1263, -1194, -2316, -8385, -16940, -13186, -7392, -4914, -6001]
5574f001k305N714K654K931k67o05J793k528k035l0J000M04l550q04j685q565
5558a3879K5K793N531R7j581N224O076k729k80N728k225l337j1563k410j32k712
5542a5374j073R561P819m441q168n91L361M805L32l68L629L595k500k556N383
5527C414J056k658J838K12N060l45n010J279j860m159L429k90L174n691o600r565
5511a6716J465Q618K942J223O836l47q560m296P679K949j051p35m331O187J832
5496C695p834k981k589J386L069o018k595p88J944R181K904j354Q89o935k447
5481a0473k801j020K581n452R2K49N884J005Lk714O398K583J221m701m897K003
5465a0039R11L202M713O740k142o954l905M070K163j840P69M804k767n795l728
$$ y = [-6001, -8306, -2592, 62, 2993, 2726, 2121, 3914, 1386, -649, -679, 321, 725, -2825, -3629, -5314, -13879, -13854, -11061, -5530, -5433, -7014, -1790, 4286, 1557, 1277, 7005, 4780, 1443, -10120, -12530, -12662, -15374, -16447, -6886, 933, -3508, -11676, -12267, -8906, -4101, -3769, -4137, -508, 3087, 587, -1969, 3414, 4470, 1812, 3650, 3862, 8922, 8577, 3567, 4846, 2986, -1173, 2256, 1966, 5140, -551, -7151, -16716, -15251, -6633, -3691, -2468, 4368, 4021, -4539, -8835, -1156, 1793, 742, 7, -4324, 1863, 3695, -4139, -7120, -9709, -8323, -5254, -11272, -13867, -14655, -12711, -3530, -626, -1980, -1091, -8026, -10473, -13274, -14294, -11713, -17165, -17073, -16824, -10940, -9935, -9932, -12646, -6248, -3665, -2444, -7145, -12042, -10039, -9128, -5926, -1213, 5527, 3385, -3569, -7474, -3404, -1241, -3081, -2312, 2492, -275, -6070, -9798]
5450i798R553M390j694k153J907L38Q37J919N06m855k369j626N31o905R7O881
5434b441Q156j004k009m995k543L468l079o155J512M442O432K491m174J200j736
5419d35m183P10J813j279q85L676Q83m569p047m557M700O158N93R189l57k499
5403A911r80k530m86K670q56L021N590o090k577j732n60P7J118o746J372R807
5387C009J684L217k531n34M084K391l423k659p667m769J360j887p835k081J4231
5372c410K0243J4075m464j3571j0837q724n521O223P78j75L236n631j705M632
5358d851J336P39l026q239M072l695L539O006L789L579l569P99n761l701l906
5343a2889M296L996o633l792M439q12j51M840K274J855J493m705k182j685q563
$$ y = [-9798, -245, 4145, 2451, 298, 2205, 2543, 3380, 5299, 5805, 950, -1419, -3045, -2514, -9419, -9322, -2441, 5715, 4711, 2702, -2293, -4836, -1368, -4447, -10602, -9090, -4648, 1784, 4275, 101, 1301, -435, -4618, -3908, -2095, -3374, -4259, -583, 300, -4269, -11316, -15873, -11173, -5015, -4422, 4767, 4410, 1911, 931, -1599, -2085, 585, -271, 2750, 8340, 2250, -327, -2059, -2619, -2542, -1424, -8170, -6798, 3009, 4693, 7910, 5379, 4845, 8929, 11320, 7897, 5238, -2429, -7198, -5838, -7725, -15560, -17641, -3410, 16833, 30908, 26444, 12873, 2036, -6688, -12209, -5986, -5208, -5383, -2147, -7778, -9483, -4851, -3515, -2776, -5802, -14041, -9969, -13664, -10125, -4119, -330, 3249, -320, 479, -5282, -8983, -12889, -8593, -4597, -11230, -15022, -10583, -11395, -11546, -6706, -4432, -2577, -1084, -5789, -7971, -9656, -18219]
5328a8219j053N047O262O988k656k695L688j18k20l863n510J986J0113P423M310
5313A1483M517K818j3130j5196n750J133P100K573J156M627n022p426p548m717
5299b3382R711M914L383J982M057j441n255m180M449l742J094L978J585K092M889
5284D134n86m882L461m064o064J106M080M433n265j314p90K471J424K710K595
5269C449L602q788p380j741p47n996M907M692J374O386j215J104j658m721O79
5254f053m938k141O493J38k974O5Q468k343m74p186l844J2271Q188l393n146o946
5238i815P45L186R27p98J706n552K455J583j921p896K015L708N135M220J612k640
5222a330N797k113M73n045K462P5j347p77l30P99o654k403N30M337K242R312L146
$$ y = [-18219, -19272, -14225, -7963, -975, -3631, -6326, -2638, -2756, -2976, -6839, -12349, -10363, -250, 7173, 11483, 16000, 18818, 5688, -9508, -15258, -14125, -7025, -4452, -3296, 1331, -3691, -11117, -18665, -23382, -13671, -8757, -5374, -3392, 665, -776, -6031, -10211, -5762, -9504, -8410, -4432, -2847, -755, 4134, 3548, -1334, 2127, -1937, -8001, -6895, -2815, 1618, -3647, -4961, -5751, -3280, -1856, 854, 3449, 7051, -1737, -9117, -10858, -11605, -17601, -12694, -8002, -6628, -242, -1457, -353, -2011, -6732, -6053, -10991, -13132, -6639, -6501, -9475, -9410, -942, -3285, -3759, -10945, -14789, -2518, 5670, 2277, -2869, -9815, -9070, -5884, -4957, -5755, -4049, -9601, -7146, -5563, -7484, -15380, -13365, -9657, -4522, -302, 1310, -1330, 4467, 2354, 2827, -2218, 244, 319, -1028, -1805, -2135, -1336, -7990, -10393, -9863, -5526, -3284, 6028, 9174]
5205I174n710q355N664N552k070p974m336J419L342M309M30r01j950j982j448
5190d836n64j298l218M338j356j077L54O323K987N095j527p63K685l64p274j320
5174a815o852L158k670Q46N094K409n80o991m084j261l08N527P284k496o849o69
5158a0257J621R293O607R58j492m471k982j514k80k391N346K25L479P324P46j304
5142A0908n419q935l3l910J22J635J766P21k370R4k462j54M924j582J71m445N479
5125c490J139o09n265n453J384M771J15J422K406J766L231K675p944l988N714
5110b126j591K123P299K430q491o342l530o034P794K594L49J737l494o13j646
5095i541k782M919L892l702l23N709n411l79N215K749N664K723k075k514n127
$$ y = [9174, 3464, -4891, 773, 6325, 4255, -3719, -8055, -6636, -3294, 1015, 1445, 544, -1406, -3388, -4836, -5400, -6698, -9916, -5578, -6934, -8011, -7657, -1334, 1653, 6748, 5221, 4458, 7143, 6779, -495, -1815, -8667, -5509, -8179, -7333, -2239, 170, -410, -7401, -11485, -12746, -13054, -7527, -243, -2739, -9588, -10257, -8636, 657, 7264, 8222, 6730, 2259, -723, -2237, -2517, -4908, 438, 663, 4142, 11466, 12212, 10908, 5489, -3446, -3479, -7389, -7267, -5632, -3866, -3145, -5515, -5421, -7883, -8037, -3113, -4695, -4524, -8969, -3490, -2351, -2960, -8225, -13678, -12294, -7523, -7408, -5986, -3580, -1814, 1417, 4092, -3852, -7840, -2126, -3717, -1594, 5705, 8135, -356, -6698, -10228, -16262, -8468, -5874, -5525, -3788, -7282, -7895, -9541, -12323, -7404, -3512, -7214, -7537, -1828, -7239, -7618, -2403, 346, 6010, 8733, 6658, 4144, -983]
5080i83k039k28k265L01l000m45l495p644j519P609K511J224N017j015n376o79
5064a2026K44K23Q907J0485m712k622j221j432j371K418J090k888j715l134l143
5049a0897Q94P916M441J255k728K929j851k829n36M899k528m815k625N913J739
5034A177l791K199N549L530O182p436n169L435N959k790q641m515J756q43k447
5019e845J744l881K009Q12J647l121j138O671L763j072k143l555o706N202O890
5004A277k114n301q41j0498R60R828Q145J85J424l502p345o28L482j073j2558
4989a8559j0216o261j833J2048Q757N828P077J659j410k843k775q163J0810P553
4975A672n477k838K825M745J23l25N684J471n788l411J232n815l907l481M202
$$ y = [-983, -3022, -3250, -5515, -5214, -8214, -8659, -12154, -19798, -21317, -13708, -11197, -9973, -4956, -5971, -11347, -12026, -11782, -11559, -2652, 7833, 3121, 499, -722, -2154, -3525, -1107, -17, -2905, -4620, -7754, -10897, -10003, -2087, 2354, 3609, 881, 3810, 1959, -870, -1406, 3493, 965, -3850, -6475, -562, 1177, -2614, -415, 5134, 8664, 14846, 7410, 2241, 5676, 11635, 8845, 204, -4311, -2555, -3398, -5845, -4101, -7982, -5973, -5161, -3514, -6635, -7773, -1102, 2661, 1589, -554, -4109, -10815, -5613, 1277, -837, -6138, -6979, -17477, -16517, -6689, 1456, 1641, 3065, -437, -7782, -8410, -4928, -6001, -18559, -28775, -35036, -36869, -24821, -16064, -10236, -3159, -1500, -2910, -5753, -8528, -16691, -5881, 1672, -3805, -6643, -3818, 927, 1050, 725, 6409, 7880, 2092, -1319, -87, -5902, -9809, -13290, -9088]
4960i088O118l543O474K536O926J925l525r26K548m214m73p684o502O598Q463
4945E633N591J805k8M98p206p053o27k843k736J458L294l434J742J168L406M397
4929E065k040j25j617m773L403L385L25m735l275l415L5N20m46j379M975n070
4913i167P725R075j346p767k876L009L388J942k133n117l789j768N658P515o065
4898a716o135K726J981J019Q69n515k741L937M608k865k97M342j400k133Q86R12
4882a522J0005k248r844q41l48l467j775N68j52R94O19M739n552K761P832J332
4866C101p13j261j776L724M022o372k219J029j674r01m942J590m629j799j12P871
4850e061O721m782n570p56N368P453K19l729n517J93P177Q710j718o916n328N01
$$ y = [-9088, -2970, -6513, -39, 2497, 9423, 11348, 7823, 6897, 9445, 5231, 4758, -2926, -9428, -2830, 5633, 11224, 13029, 13001, 13499, 6293, -760, -1387, -4230, -6966, -5508, -2214, -5648, -3906, -2738, 668, 5065, 3025, 2900, 1283, -3490, -87, 3298, 3623, -1112, -4387, -7802, -7767, -7247, -7693, -9072, -4097, -9167, -1442, 7633, 6287, -1480, -4356, -1347, 2041, 3983, 1850, -3267, -7056, -8824, -3166, 4349, -1716, -7851, -5125, -3144, -2125, -1256, -6771, -9512, -5575, -967, -3832, -4129, 213, -1187, -3320, -2434, -1522, 8483, 6235, -3609, -4450, -4798, -8265, -10040, -9472, -9624, -8630, -8011, -3272, -8824, -6063, 1769, 3101, 2388, 1127, -649, 3075, 7097, 725, -1494, -465, -2139, -3040, -7982, -6392, -11021, -12820, -12932, -5061, 1660, -3122, -8692, -9448, -4080, 3373, 3592, -137, -5654, -5461, 1716, 10426, 8708, 1792, -3536, -3035]
4834c035P98k757M433M292P26R50J177M203k878l489k872j522k423M38q651j060
4818a1670J1949N015p95p790m894J343k072K501R752l753j961J943L767K7L730
4803G092k770k946P436R343o973j0146K603l463J290L147k40n138m826O556J265
4788B230K054k368j050p06P46M149R67k118k169k648j168J445k942l62m88L157
4772a271o824r373j0060N369P600N772n076j094J989N071R438O128k978q407j817
4757e533l116o9q982m867K867Q832P175L84J199L018k157j998j145j055N808J984
4741B345j291l732J0513O46o624o14k817o787m194M09L3M748M166L113J530Q2
4725A526n376j406J80L3Q25P22n609n017Q570P3m536o526L980Q640J796R23o262
$$ y = [-3035, -2237, -4994, -561, 3731, 4457, 5407, 6584, 10787, 7909, 4420, 1548, 26, -2397, -1959, -10610, -11670, 279, 5294, 4499, -3291, -8185, -6842, -8914, -6413, 3339, -414, -2375, -432, 3335, 3362, 7092, 4322, 1376, 8812, 18155, 11182, 1036, 3639, 176, 1466, 4613, 4373, -765, -5591, 965, 2230, 4284, 1916, 866, 160, 906, 5055, 6022, 3904, 1735, -913, -2081, -636, -3578, -3940, -4428, -1271, -8095, -17468, -27528, -22159, -14559, -8787, -13863, -14957, -12968, -7897, 1541, 7669, 4691, -3716, -5533, -8649, -8718, -17700, -22567, -19700, -10868, -3693, -3309, -2110, 908, -1249, -3247, -4392, -5447, 361, 2345, 1054, -2678, 7835, 8481, 1857, 1243, -1574, -8361, -12555, -12146, -12113, -7365, -3199, -86, 1444, 1526, -3850, -5256, -5076, -5043, -4218, -3496, -9105, -14122, -5552, -5479, -10015, -16541, -12561, -3921, -2125, -1202, -7464]
4708g464M809M599K608o1J013O096L084m318O09o444j1514r957j216j661L425
4693a6392Q276K388l91l318j062Q238P276M212m005n109J142L109K811l2J094
4678H237k069m964l192J427O322K015n056j1173l02P213L46L88k964l028K763
4663d037j409j341l54M127P895K729o736k047k657l876j495m207k390P823J764
4648f211p813M234L146k300N053K068J639m754P03L418P854j305r132o467l224
4633a3091K314P332M302O015l423m820o63L492L210N12k999J056r424J2J895j65
4617d445Q76J959J26l987r157L91J375O923L210M522l458m236J98N536O290L30
4601F453J102M00m2j629n293N219N03m012j290j295l026M204l657j3692O62N976
$$ y = [-7464, -2655, 1944, 4552, 4491, 5504, 11600, 14684, 10366, 10975, 4531, -6983, -16940, -18156, -19817, -16392, -8116, -5728, -6119, -9437, -10499, -2261, 5015, 9227, 5222, 113, 1255, 4364, 7175, 7143, 8237, 6168, 1204, -1988, -561, 5761, 7776, 2720, -8453, -8755, -1542, -1196, -808, -3772, -6800, -4037, -5446, -6787, -7141, -3014, 4881, 7610, 874, -1173, -3830, -7706, -9201, -13408, -15798, -7975, -6211, -14024, -9790, -6644, -8944, -3891, -1823, -184, -4938, -4235, -817, 7037, 5732, -3400, -9867, -13091, -10777, -3445, 857, 6872, 3449, -1371, -2034, 1458, 4668, 5180, 2181, 3237, -6187, -6175, -4280, -4445, -3569, -1610, -1484, -5471, -14628, -14237, -12862, -5939, -2729, 1793, -1665, -5901, -5703, -167, 6123, 6453, 7555, 7955, 7913, 6284, 991, 6210, 6713, 2701, 1411, 116, -2910, 1294, -2363, -16055, -15393, -9417]
4585i417M005l70k98L955K886n154m401L082K809O145N102k001j352n49r19n854
4569b331l988N188j275k352k651L93N222j469N081L332K950j297k207J407K881
4554H884R59r194n954O242Q542M6J786m939m831j049K068k292k533k732p249K060
4538a0186O847m457J684M230l462rL00K582k414k037k371Q79N10N406L53N73P80
4521g92j011K587M271j659l287P33k367o175N722L862j692m007K375j375r18L950
4505B17k74N329r6n828j236o246m584K601L452P433K74k609m435N444k770k854
4489f182o11J071N291M249k778m125L075r697m337L795K06L027l696j373L742
4474h343j711P94L438K427J491L18q64q653O097q4j846N162K918J279l146m94
$$ y = [-9417, -5412, -5782, -6080, -2125, 761, -4393, -8794, -5712, -2903, 3242, 8344, 6343, 4991, 4442, 3523, -2331, -6319, -1131, -2406, -4758, -7409, -7016, -1794, -3263, 1818, 5150, 8100, 6803, 4596, 6003, 8884, 9843, 649, -5305, 937, 9479, 9525, 11311, 6372, 1541, 492, 2560, 268, -2265, -4997, -12246, -10186, -3339, -7796, -6112, -1882, -5344, -5353, -5053, -2471, -4885, -6922, -9293, -8414, -7904, -2498, -2145, -1572, -792, -1803, 784, 5055, 3396, 109, 842, -1525, -7700, -1978, 1884, 192, -3815, -1440, -2815, -3733, 217, -57, 5272, 5176, -652, -1888, -8134, -12718, -10117, -6665, 768, 1042, -1567, -6002, -558, -3328, -6182, -6793, -5722, -431, 3818, 1040, -3085, -10, -9707, -14044, -10249, -10043, -7016, -10712, -12085, -8343, -10054, -9260, -5822, -3395, -1904, -1586, -2450, -11103, -5006, -5090, -6936, -1774, 1144, 2423, -723, -1217]
4458a217n384J226M685L615p099n778J663J48K393L528n792l685J001J971J433
4443g292K549R225j676n676n873n943l026m712Q866J707j702K945Q212P537P958
4428A3099n89m355J455j390l771m370k826L108L726k91N244k074n290k170J372
4413H78k666K168l656k171L620l350Q15M787L537M403n582j88K451N342k685p39
4397F964m236K471k802K618L871n20K90j293m958n58K391k59k296Q12n458k118
4381e081M906N017p87l187K556M598k300M9k186m531j963l662j626O424J047L561
4365B835K006o45J937K161j3519o062M867J612O004M382j578m690m589p706m977
4350a7962j00k154O870Q021R3k50N641O687m314j198K138J102j2121M038M521
$$ y = [-1217, -6601, -5375, -690, 2925, -4174, -9952, -8289, -8141, -5748, -2220, -8012, -11697, -10696, -8725, -7292, -4743, 4482, 2806, -2870, -8743, -14686, -17712, -22424, -13558, -11851, -13553, -10608, -2396, 5141, 13099, 12510, 8155, 9610, 8220, 4449, 79, -2747, 361, 4087, 3796, 9040, 6966, 1676, -494, 878, -1788, 380, -3276, -5447, -1827, -5177, -4362, 425, 3962, 8365, 2783, 2595, 5046, 10388, 7703, 6964, 2728, 5199, 2397, 5015, 8886, 8366, 8656, 7363, 2405, 1847, 4238, 3979, 1683, 2495, -2963, -5081, -175, 4842, 4055, 868, 3424, 8022, 5722, 5771, 3585, -946, -2909, -6571, -8197, -1773, -726, 2835, 4841, 4196, 6133, 8294, -5225, -11287, -6420, -4808, 1196, 5578, 4000, -690, -5279, -12985, -17962, -18062, -20216, -13346, -5325, -5232, -5482, 159, 6846, 2532, 1334, 3472, 4574, -7547, -3509, 1012]
4335A012o903m400p32J030j146L11o284M642P483M730m49m88J9N33m969j031R153
4318B511M662o513l332j045J614l177J132j439N68N973p449l088k019L421O734
4303a447L287l529N197O999K341o71m306o046j21P58l073m708k46O354R97k239
4287d53K585O462l813o707L147P110J595j784k381J069m059l094M22j390Q328
4272G037J86k574N62J271L867p850l544J649m535j165n129K524M077r73n375O436
4256c536j251J514K77l16L58L080J151K636o876l303M66M040m125j608L795k122
4240e820Q30P380M992j508m055k315o990K838O76j576J466P822N076L139j527
4225A0428n937k891j737m621Q83L377K727l907l859K548N886K349m149n613M277
$$ y = [1012, -5891, -10291, -11023, -9993, -11139, -10828, -17112, -12470, -4987, -257, -706, -1194, -1175, -642, -5611, -6642, 2511, 7173, 660, -2672, -3717, -2103, -5280, -4148, -5587, -5019, 954, -6495, -9583, -11602, -8181, -1447, 1840, -1689, 3508, 10507, 12848, 12177, 7871, 1825, 1704, 2462, -611, -5319, -5565, 789, 1786, -453, 2132, 8594, 4781, -1926, 1221, 8331, 9926, 8142, 5761, 6830, 2771, -323, 99, -1291, 7037, 7223, 4649, 5211, 6482, 10349, 2499, -1045, 604, -3931, -5096, -10225, -7701, -3624, -4597, -9972, -3536, -4787, -3273, -2996, -3312, -2954, 126, 1277, 3913, -2963, -6266, -5800, -1760, -5885, -7493, -3698, -5820, -4990, 2390, 7382, 5874, 1819, -496, -7486, -4648, -3972, -5548, -4082, 3740, 8816, 11955, 10428, 4491, 1600, -137, -4758, -3875, -498, 2229, -1678, -5537, -2989, 2897, 5246, 1097, -4516, -239]
4210b39J83L655n92k924l314p46Kl361m554J405K044J618M239J954K2p451o416
4193a4475K646O337J291R77l108j897k587N4K454l676k185j207j230k308R253
4178i661K085J220O529K397p37r35k883p621k072L460Q379j505k206K920K621
4163A991K185O288O823K807k328j0242p852o998O09M998J186j260N6j35K192q460
4147h140J348N608k525l780J828J532n750O233N66j483m272M70l797J834Q835
4132a493K278k487k307l048J267o8o341k343L607P329O830j353J082M831J795
4117I579n564o559P12M754P868m916k24l724P544Q451k380n717m841q024P81L875
4101A615R838P365m322l500o215j1236j531J853l464l947L257L093Q847M845L427
$$ y = [-239, -56, 3599, 3007, 83, -3231, -3977, -3975, -7336, -11890, -10485, -8441, -6823, -2584, -630, -608, -8059, -14475, -11829, -5492, -4201, -3224, -6332, -8229, -10816, -10762, -8308, -11984, -14169, -15376, -16606, -18914, -9661, -7576, -6356, 173, 2570, 1833, 898, -1985, -9606, -11678, -8218, 161, -1344, -3550, -630, 1991, 4176, 10464, 17287, 20094, 17766, 7524, -328, -7326, -6717, -1719, -533, -1793, -1737, -1872, 320, -8140, -6792, -1184, -3709, -7489, -5661, -4129, -9879, -3646, -3080, -4563, -8835, -8365, -12162, -10328, -1493, 785, -1702, -4009, -7057, -5790, -5858, -12199, -14542, -10935, -3606, 3224, 1871, 2953, 7784, 9579, 4015, -2544, -1832, 2922, 10790, 5874, 5650, 1926, 9470, 17921, 15541, 9824, 4983, -3041, -2260, 1615, 11453, 18818, 14496, 10996, 4781, -6455, -7986, -6133, -9597, -13544, -10287, -7194, 1653, 6498, 9925]
4086I925o402j869l118L946K211q913o429O063P720M067k653m276K220m617L100
4071I75Q56J51o30L888P4r34m636J613J082k426l813Q34J547l510O76n57K662
4054b148K780P179q79j2638n605N617M108O904J069j252P97k841k508K299j71
4039B711j204K611j384n584J555r21l828R58O933j522j779m134j422M296J65J48
4023b401l811m705M174Q581P421j0691j2821l698L863M376k96K350p109K135p69
4008a3401J938l556L782M345M216o4m248k161L059J021K69N874J390m411m712
3993f659j627K132J267L785M264k952j438L897J255K485L885L599l296o057l289
3978A251k582k569m878pN791k625m620L783P489o557M612Q86j0225j855L429K191
$$ y = [9925, 3523, 1654, -1464, 2482, 4693, -4220, -10649, -4586, 3134, 7201, 4548, 272, 2492, -2125, 975, 1831, 1982, 1352, 5240, 5314, 4380, -256, 1357, 2439, 13, -3800, -2966, -1419, -4929, -4253, -4810, -2148, 632, 7811, 6932, -5706, -11311, -5694, -1586, 5318, 6387, 5135, 5932, 3091, 583, 2882, 2711, 1507, 4118, 2734, -2850, -1295, -2216, -6044, -5086, 1847, 325, -1454, -5588, -7010, -2714, -2549, -2401, -6212, -10917, -6743, 1838, 9259, -1432, -14253, -17951, -14088, -9712, -10008, -7658, -14767, -12632, -13401, -11463, -15019, -11237, -6892, -2676, -2740, -6988, -9149, -6090, -5069, -4800, 1074, 2464, -1947, -6659, -8286, -6154, -4887, -1102, 3162, 210, -1228, 2669, 3924, 6409, 10294, 13893, 10597, 4540, 1251, -1331, -3900, -8778, -8785, -2994, -5619, -10239, -6456, 1033, -5524, -912, -26, -10251, -12106, -8677, -6486]
3962f486L3l99l841J419J312R83n52q49P19k195j1214J290N843J724l278l95N972
3945i914K790l089k201L838N600J965M947j079o068M59l93J382L730k921p36k102
3929c792l706n62M629n96j0116m229L837K693o02N360j76N75K750O769N020m058
3913C796o574J63M291L000r960k755L384M006j902n30j998K204Q93k831M180M355
3897C722M935J673j0325j207k232l039K351K782k612K111Q078o826m198j021o37
3882f445L70R59k292N230P421K78n584p266R13M153L040o998j578K533J696l362
3866f932Q94M157k671j138n646l22O924k580l297K43J754j287o000R99K531J893
3850a0478J358N036O217j995J446N657j885n344N614J266j0403M050L420n248
$$ y = [-6486, -6453, -6852, -10693, -9274, -7962, -6979, -7531, -8380, -7661, -9856, -21070, -19780, -13937, -12213, -15491, -15886, -9914, -7124, -10213, -12414, -8576, -2976, -1011, 3936, 2857, -3211, -2752, -3145, -1763, 1967, -954, -1690, -3792, -7498, -8060, -3431, -4027, -14143, -18372, -14535, -11842, -12444, -7084, -7260, -6685, -3935, 2834, 7854, 3796, -2778, -2615, 1676, 4676, -5284, -8039, -4655, -649, -2551, -3081, -5079, -2875, -1982, -4813, -633, 3722, 8657, 10330, 5, -1202, -3434, -6473, -4122, -1340, -3952, -1841, 6237, -589, -4787, -5808, -6445, -6075, -5116, -7408, -2178, 5243, 5521, -63, -7329, -6416, -2263, 777, -6221, -7799, -5266, -3570, -6932, -6038, -1881, -4552, -5690, -11336, -11658, -4734, -7314, -10611, -10368, -8614, -9901, -15901, -14902, -12371, -10478, -9120, -4084, 2133, 138, 1584, 7241, 5356, 12, 5626, 6892, -3511, 539, 3959, -1289]
3836a289m355K136L940j854j394K267j602K19j325P049j07l391n090k081J597
3821e280K70n101m411K824P514M598m961l711J31n035K555O296R61O82L95j435
3805c708l254M740M040J799q806r537k606J62K645N952o67O05l200K211P003K947
3789C26m036l42m57k393M417N262J390m894O54q367l848K993K661K809j427j087
3773f339K632K458n37J091K913m458K09M220Q50k220n689K694n7L904L670l138
3757B203o485J276o85O160P543n400p578L15m26j594M838l25l31q66K237L419
3741D301m406o689j950N321M887o370l415J611r49N974N7n982j62J090N707M1
3725i34j322P374J085j0681J60O470q27m337k55l40l061l079N176K274l525l006
$$ y = [-1289, -5644, -3508, 432, -1422, -2816, -549, -2151, -1932, -3257, 3792, 3685, 294, -4796, -6877, -5280, -5010, -10111, -14522, -11698, -4184, 414, -4547, -8258, -8127, -13162, -10607, -4311, -3350, -2668, -2273, -3708, -6962, -2222, 1818, 3617, -5189, -14726, -17332, -17170, -14525, -8573, -9240, -8635, -11835, -9624, -2621, 326, -3710, -4052, -4509, -6902, -2485, 2777, 4167, -727, -73, -8440, -12288, -9295, -6634, -3825, -5252, -6339, -3707, -1249, -1786, -695, 2218, -2240, -2031, 2189, 3039, 819, -4870, -2176, -2233, 1671, 5341, 2203, -4282, -3006, -3691, 2469, 10012, 4612, -2966, -2651, -3077, -4671, 167, -158, -489, -1355, 882, 4301, -105, -6794, -8744, -3423, 1464, -4906, -8321, -6710, -7659, -1685, -1628, -7610, -7772, -6682, -975, -934, -2256, 5118, 6203, -4478, -4318, 2152, 1325, -3012, -3267, -3607, -6668, -9747, -4571, -2297, -5822, -8828]
3709h828N935M789p549l597j106K408p24K487L735L178k789j824R119l877N12
3694A869l360N144K730j040q313r878N167K0115M963m670j1505j0440K497N013
3680a708l101o623l407K843P262N557K697j571k798k238k787K810K093O66l732
3665d037q846j598N058m549M091l590R607K378k875K838K731q07m145j98J674
3650b268O97L542l497n117qM354M606O378J021o082m484L302N571l08l986k472
3634A249k971p954o684R94Q068J3088K681j2350j1596l493P305J3530l05k907
3620a345j151r52l482k889k656L445O56k355J019m458m488J697K937Q892J2462
3605G332L29o360l412K705K629m023p425L508L352q305m680K462L047j233l513
$$ y = [-8828, -2893, 1896, -5653, -9250, -10356, -7948, -8672, -6185, -2450, 728, -2061, -3885, 5234, 1357, 1869, -1491, 3653, 6383, 5343, -2970, -12848, -7681, 12434, 17397, 12727, 1222, -9218, -6721, -1708, -4809, -11432, -14839, -11996, -4734, 823, 3520, 1949, -849, -3087, -5874, -3064, -971, -305, -4037, -12883, -14481, -9423, -13972, -9881, -13471, -3864, -1486, -4361, -1523, 1208, 401, -3744, -3942, -2268, -1571, 1971, -1526, -6643, -6651, -2297, 2309, 8687, 9708, 3626, -858, 2444, 8015, 7707, 3721, 1249, -1722, -9676, -16360, -15366, -7298, 5790, 8471, -3879, -15475, -18968, -11663, 1867, 1562, -1345, -2496, -3448, -6930, -9819, -12475, -9030, -8374, -10729, -9710, -14168, -18656, -16959, -14022, -5130, 7332, 7661, 1301, -2111, 594, 3223, -800, -8225, -4717, -1365, -9670, -14350, -11888, -8841, -10074, -13587]
3590a3587K958K630j847P395L732K422k137O36q00n272J580L482J204j104J352
3575B644n235j798k524N78n161l519M665N225K757l556n287L114K831r86k782
3560i034k38l810M570K127M082M299j380k05Q24r6M126O690p80p305m463j029
3544a622M733n994l770m56l755K578N489M496K114p275q848k382Q026K611Q00
3529c255m927j975J136J0653L371l109M840j428r319J417j384R57L366O034l529
3514B848j260j10j073M401L063M852J558j060j2366m335L344K815n395j94M071
3499A159L732k551M645j784o844j658m001m348L328K439j078J788N825j253o684
3484g285r59J337O023J0693n92J604n300j792m663l250q978J560R62M443j458
$$ y = [-13587, -10629, -7999, -9846, -2451, 1281, 3703, 1566, 2202, 1402, -3870, -2290, 1192, 2396, 1292, 2644, -2591, -4389, -6913, -6335, -11496, -15015, -10350, -5125, -2368, -5924, -11211, -8097, -5266, -6252, -9034, -9272, -13082, -8512, -6385, -2303, 1996, 616, 411, 1235, 1139, 5265, 11955, 11175, 3870, -593, -1622, 3111, -2883, -6653, -7109, -10864, -8286, -2797, 1699, 3813, -3462, -12310, -14692, -6666, -4055, -3255, -8182, -10157, -9021, 1632, 5003, 1894, 6734, 5306, -4013, -2596, -3980, -3023, 343, 6377, 2848, 1588, 1478, 405, 4806, 7869, 12721, 14279, 13219, 853, -3482, -138, 2677, -2718, -2912, 1159, 4891, 2340, 6985, 5201, -1643, -3301, -7302, -11650, -8322, -5883, -6961, -5173, 652, -601, -7285, -8244, -6907, -884, 9809, 9217, 10821, 5521, 3729, -934, -4184, -13162, -11602, -10640, -6197, -7655]
3469g655R26K89R83L880N320r05k099o258l402k469N034O681l002j957m363R865
3453H68P341K213p999o133P19L867j322j110N195L99m578r092p69L168N607N156
3437C530K341q872j871j493M262J788L036j00p996k531O53M648J413o856p087
3422a5135k005J427L007J657p66N537l38K60M053O4p648O76N757M237J76m040
3406c081K708Q820l48l556q789l740M581N671N860n89n7J291m93q26K430J177
3390A1059k063j1411k789k414P381J895q916J003J843K467n82K357l042k506P37
3375d981K38Q145K141L481r53m198l061j09n041O09l962J656R135M167Q26K309
3359A0402k502p462n711p037P479L690l055Q07l628L305k584k212k692M223L293
$$ y = [-7655, -6729, -6440, -5457, -1577, 3743, 2838, 739, -5519, -8921, -11390, -6356, 325, -2677, -4634, -8997, 868, 8209, 10422, 2423, -3710, -2991, 876, -446, -1556, 3639, 4038, -540, -9632, -10401, -7233, -1626, 3530, 5871, -3001, -4872, -6365, -2103, -315, 2721, 2621, -5375, -7906, -7253, -2605, -1192, -8048, -15135, -17140, -15713, -12706, -11049, -11815, -6278, -6616, -6356, -2303, -2239, -9887, -9211, -3454, 783, 959, -3081, -373, 8447, 8099, 4543, -4246, -7986, -3405, 2266, 8126, 7537, 7480, 8771, 8278, 7452, 9882, 11059, 8996, -2415, -5204, -7618, -237, 1658, -7258, -6255, -4412, -1945, -2527, -170, -3212, -5718, -4981, -4743, 3402, 5543, 9024, 8071, 3873, 812, 703, -4338, -3729, -7691, -6035, 3100, 7267, 8093, 10402, 7900, 438, -5273, -12310, -4831, -1141, -4196, -3389, -7017, -3712, -6296, -8508, -11200, -6977, -3684]
3344c684k547q8p620K705J821M769R470J962p863o823O360m47j574P64L32M769
$$ y = [-3684, -6231, -6319, -13939, -11234, -9413, -4644, 4826, 6788, -1075, -7898, -1538, -1985, -3559, -2795, -2463, 2306]
$$ [...]
##END NTUPLES=NMR SPECTRUM
##END=
