##TITLE=Analysis number 324299
Compound Code cc 60413
Book Reference 470/138
Project Code adrs
Chemist Name mikem
##JCAMPDX= 6.0         $$ Bruker NMR JCAMP-DX V2.0
##DATA TYPE= NMR SPECTRUM
##DATA CLASS= NTUPLES
##ORIGIN= Bruker BioSpin GmbH
##OWNER= nmr
$$ XWIN-NMR		Version 3.5
$$ Fri Nov 17 14:55:42 2006 GMT Standard Time (UT+0h)  MAYBRIDGE\nmr@NMR_250MHZ
##.OBSERVE FREQUENCY= 250.131544655141
##.OBSERVE NUCLEUS= ^1H
##.ACQUISITION MODE= SIMULTANEOUS (DQD)
##.ACQUISITION SCHEME= undefined
##.AVERAGES= 16
##.DIGITISER RES= 18
##SPECTROMETER/DATA SYSTEM= dpx250
##.PULSE SEQUENCE= zg30
##.SOLVENT NAME= CDCl3
##.SHIFT REFERENCE= (INTERNAL, CDCl3, 0, 16.522)
##AUDIT TRAIL= $$ (NUMBER, WHEN, WHO, WHERE, WHAT)
$$ ##TITLE= Audit trail, XWIN-NMR		Version 3.5
$$ ##JCAMPDX= 5.01
$$ ##ORIGIN= Bruker BioSpin GmbH
$$ ##OWNER= nmr
$$ C:\u/data/dgb/nmr/ADRS/610/pdata/1/auditp.txt
$$ ##AUDIT TRAIL=  $$ (NUMBER, WHEN, WHO, WHERE, WHAT)
(   1,<2006-11-17 14:55:02.15 +000>,<MAYBRIDGE\nmr>,<NMR_250MHZ>,
      <created by zg, POWCHK disabled, PULCHK disabled
       configuration hash MD5:
       49 4B E0 1D 92 C2 6B 37 9F E6 65 BC 52 41 86 1D
       data hash MD5: 64K
       04 A3 59 7A D6 FE E7 AA BB 14 39 64 22 F8 B2 D6>)
(   2,<2006-11-17 14:55:22.03 +000>,<MAYBRIDGE\nmr>,<NMR_250MHZ>,
      <Start of raw data processing
       ef LB = 0.3 FT_mod = 6 PKNL = 1 SI = 32K 
       data hash MD5: 32K
       1D 3C 19 32 DE 41 38 9D 27 DF 87 D5 A7 F8 66 1D>)
(   3,<2006-11-17 14:55:26.87 +000>,<MAYBRIDGE\nmr>,<NMR_250MHZ>,
      <apk 
       data hash MD5: 32K
       5B 82 49 85 25 9A 03 03 70 0D 7E FA F8 59 56 82>)
(   4,<2006-11-17 14:55:28.45 +000>,<MAYBRIDGE\nmr>,<NMR_250MHZ>,
      <abs ABSG = 5 
       data hash MD5: 32K
       17 BB D9 8A 36 61 87 78 DB 05 C0 2E 85 2E FD 49>)
$$ ##END=
$$ 
$$ hash MD5
$$ D2 8E 78 37 FF 17 FE 4C 6B 99 58 E0 AB CF 26 81
##$RELAX= 
##$RELAX= 
##$RELAX= 
##$RELAX= 
##$RELAX= 
##$RELAX= 
##$RELAX= 
$$ Bruker specific parameters
$$ --------------------------
##$DU= <C:\u>
##$EXPNO= 610
##$NAME= <ADRS>
##$PROCNO= 1
##$TYPE= <nmr>
##$USER= <dgb>
##$AMP= (0..31)
100 100 100 100 100 100 100 100 100 100 100 100 100 100 100 100 100 100 
100 100 100 100 100 100 100 100 100 100 100 100 100 100 
##$AQSEQ= 0
##$AQ_mod= 3
##$AUNM= <au_zg>
##$AUTOPOS= <44 >
##$BF1= 250.13
##$BF2= 250.13
##$BF3= 250.13
##$BF4= 250.13
##$BF5= 500.13
##$BF6= 500.13
##$BF7= 500.13
##$BF8= 500.13
##$BYTORDA= 1
##$CFDGTYP= 0
##$CFRGTYP= 5
##$CHEMSTR= <none>
##$CNST= (0..31)
1 1 145 1 1 1 1 1 1 1 1 1 1 1 1 1 1 1 1 1 1 1 1 1 1 1 1 1 1 1 1 1 
##$CPDPRG= <>
##$CPDPRG1= <>
##$CPDPRG2= <>
##$CPDPRG3= <>
##$CPDPRG4= <mlev>
##$CPDPRG5= <mlev>
##$CPDPRG6= <mlev>
##$CPDPRG7= <mlev>
##$CPDPRG8= <mlev>
##$CPDPRGB= <>
##$CPDPRGT= <>
##$D= (0..31)
0 1 0 0 0 0 0 0 0 0.06 0 0 0 0 0 0 0.0002 0 0 0 0 0 0 0 0 0 0 0 0 0 0 
0 
##$DATE= 1163775300
##$DBL= (0..7)
120 120 120 120 120 120 120 120 
##$DBP= (0..7)
150 150 150 150 150 150 150 150 
##$DBP07= 0
##$DBPNAM0= <>
##$DBPNAM1= <>
$$ [...]
##$SUBNAM7= <"">
##$SUBNAM8= <"">
##$SUBNAM9= <"">
##$SW= 20.6930455092707
##$SWIBOX= (0..15)
0 0 3 0 0 0 0 0 0 0 0 0 0 0 0 0 
##$SW_h= 5175.983436853
##$TD= 65536
##$TD0= 1
##$TE= 683.16
##$TE2= 300
##$TE3= 300
##$TEG= 300
##$TL= (0..7)
0 120 120 120 120 120 120 120 
##$TP= (0..7)
150 150 150 150 150 150 150 150 
##$TP07= 0
##$TPNAME0= <>
##$TPNAME1= <>
##$TPNAME2= <>
##$TPNAME3= <>
##$TPNAME4= <>
##$TPNAME5= <>
##$TPNAME6= <>
##$TPNAME7= <>
##$TPOAL= (0..7)
0.5 0.5 0.5 0.5 0.5 0.5 0.5 0.5 
##$TPOFFS= (0..7)
0 0 0 0 0 0 0 0 
##$TUNHIN= 0
##$TUNHOUT= 0
##$TUNXOUT= 0
##$USERA1= <user>
##$USERA2= <user>
##$USERA3= <user>
##$USERA4= <user>
##$USERA5= <user>
##$V9= 5
##$VALIST= <valist>
##$VCLIST= <CCCCCCCCCCCCCCC>
##$VD= 0
##$VDLIST= <DDDDDDDDDDDDDDD>
##$VPLIST= <PPPPPPPPPPPPPPP>
##$VTLIST= <TTTTTTTTTTTTTTT>
##$WBST= 1024
##$WBSW= 4
##$XGAIN= (0..3)
0 0 0 0 
##$XL= 0
##$YL= 0
##$YMAX_a= 414925
##$YMIN_a= -579969
##$ZGOPTNS= <>
##$ZL1= 120
##$ZL2= 120
##$ZL3= 120
##$ZL4= 120
##$ABSF1= 16.522
##$ABSF2= -4.171173
##$ABSG= 5
##$ABSL= 3
##$ALPHA= 0
##$AQORDER= 0
##$ASSFAC= 0
##$ASSFACI= 0
##$ASSFACX= 0
##$ASSWID= 0
##$AUNMP= <proc_1d>
##$AZFE= 0.1
##$AZFW= 0.1
##$BCFW= 0
##$BC_mod= 0
##$BYTORDP= 0
##$COROFFS= 0
##$CY= 12.5
##$DATMOD= 1
##$DC= 0
##$DFILT= <>
##$DTYPP= 0
##$F1P= 14.0000005364418
##$F2P= -0.99999901652339
##$FCOR= 0.5
##$FTSIZE= 32768
##$FT_mod= 6
##$GAMMA= 0
##$GB= 0
##$INTBC= 1
##$INTSCL= 1
##$ISEN= 128
##$LB= 0.3
##$LEV0= 0
##$LPBIN= 0
##$MAXI= 10000
##$MC2= 0
##$MEAN= 0
##$ME_mod= 0
##$MI= 0
##$NCOEF= 0
##$NC_proc= -4
##$NLEV= 6
##$NOISF1= 0
##$NOISF2= 0
##$NSP= 0
##$NTH_PI= 0
##$NZP= 0
##$OFFSET= 16.522
##$PC= 1
##$PHC0= 159.6535
##$PHC1= 5.483794
##$PH_mod= 1
##$PKNL= yes
##$PPARMOD= 0
##$PSCAL= 4
##$PSIGN= 0
##$REVERSE= no
##$SF= 250.13
##$SI= 32768
##$SIGF1= 0
##$SIGF2= 0
##$SINO= 400
##$SIOLD= 32768
##$SREGLST= <1H.CDCl3>
##$SSB= 0
##$STSI= 32768
##$STSR= 0
##$SW_p= 5175.98343685301
##$SYMM= 0
##$S_DEV= 0
##$TDeff= 65536
##$TDoff= 0
##$TI= <Analysis number 999999
Compound Code 99
Book Reference 9
Project Code 9>
##$TILT= no
##$TM1= 0
##$TM2= 0
##$TOPLEV= 0
##$USERP1= <user>
##$USERP2= <user>
##$USERP3= <user>
##$USERP4= <user>
##$USERP5= <user>
##$WDW= 1
##$XDIM= 32768
##$YMAX_p= 514286442
##$YMIN_p= -337959
$$ End of Bruker specific parameters
$$ ---------------------------------
##NTUPLES= NMR SPECTRUM
##VAR_NAME=  FREQUENCY,     SPECTRUM/REAL,   SPECTRUM/IMAG
##SYMBOL=    X,             R,               I
##VAR_TYPE=  INDEPENDENT,   DEPENDENT,       DEPENDENT
##VAR_FORM=  AFFN,          ASDF,            ASDF
##VAR_DIM=   32768,         32768,           32768
##UNITS=     HZ,            ARBITRARY UNITS, ARBITRARY UNITS
##FACTOR=    0.157963299565203, 1,           1
##FIRST=     4132.6476996994, 0,             0
##LAST=      -1043.33573715361, 0,           0
##MIN=       -1043.33573715361, -337959,     0
##MAX=       4132.6476996994, 514286442,     0
$$ Real data points
##PAGE= N=1
##DATA TABLE= (X++(R..R)), XYDATA
$$ [...]
16203a5260j0216l731P318J3255L335j1093j1304k16O727m823J837J0329N567
16190h275j4000j208R028m385k166j2758j507M795P895K1897p590q185l946p084
16176b7489J2616J6790l663M042p969k3603j770J7390l558r286q886N31Q002k31
16162b7084K368m654j563P07o642k646J0585J5174J1376p554N308J985r555j7712
16148b9907n806J7225J322O307J0548j2103K375L067o410J925R365n860Q576K741
16134C365Q017j0189j7321O410j5286l051k774N620j0542L089J2500n62N537m243
16120a9430O192J5654N336P27p53k687K5j0056p479k698K084q237M227J416K124
16105a3555J1386k708k703J873M419q054j6531j0467P862J1833j153p527l66o024
$$ y = [-15260, -25476, -29207, -21889, -8634, -5299, -16392, -27696, -27912, -21185, -26008, -24171, -13842, -8275, -22275, -23483, -14455, -18840, -21006, -33764, -35271, -30476, -22581, -684, -8274, -16459, -20405, -27489, -14873, 1917, -1746, 2296, -5673, -29276, -31046, -13656, -17214, -26500, -35386, -34855, -26853, -27084, -24716, -29370, -30933, -30226, -36868, -39514, -28929, -13755, -2379, -9933, -4625, -2640, -12195, -29907, -35713, -18488, -17166, -10859, -311, -12414, -10039, -6972, -13382, -11457, -2092, -7952, 624, 3365, 11382, 1193, -16128, -9718, -25004, -28055, -30829, -25209, -35751, -32662, -20162, -20724, -15187, -19430, -13238, 2416, 7752, 8479, 7726, 5039, 5064, -4992, -12471, -15169, -13085, -21322, -17095, -15679, -13555, -2169, -4877, -7580, -5707, -1288, -9342, -25873, -36340, -28478, -16645, -17798, -25325, -25691, -31715]
16091c1715J716N804K777Q267J172j777p290m766J2475P593N590M636k801p684
16077f003j5434l098Q658l517r280J7674J4301n894n686j4610K372R12k696J3048
16063i253K1762L284j0519r104J516L770l875L765j3871j4523L400M609M381Q706
16049e952k152q238P988J21j840K533n580j6154K392L502J7363Q768Q139Jn817
16034E074j3625j6999k017p298O831R707n307R268J0805p548j4603j0236L254
16021c2694P163q67K553J3984Q943L461k2261m753k154Q899L926k695n615p98
16007b2908p87m492O957j0271r789M774n174M27o121J3573J0031K002J016r83
15993b1745k945k435o030l140K884J0691J238m631j2984N115q83K1517J5240p83
$$ y = [-31715, -29999, -24195, -21418, -13151, -11979, -13756, -21046, -25812, -13337, -5744, -154, 4482, 1681, -6003, -21437, -24535, -15877, -19394, -28674, -11000, 3301, -2593, -8279, -22889, -20517, -19605, -22301, -9253, 12509, 15793, 5274, -3830, -2314, 1456, -2419, 1346, -12525, -27048, -23648, -19039, -14658, -5952, -8104, -16342, -8354, -8233, -10073, -7540, -13120, -29274, -26882, -23380, -6017, 2751, 10890, 10891, 5074, -8551, -25550, -27567, -34865, -28034, -18327, -23634, -14366, -3561, -11109, -25712, -35948, -32694, -25531, -26398, -23845, -9861, -918, 2543, -19718, -24471, -26625, -17726, -13800, -16495, -22110, -22908, -23695, -28187, -21230, -31501, -41290, -36516, -41690, -41263, -47384, -33811, -23780, -21778, -20762, -21745, -24690, -27125, -33155, -36295, -33411, -22720, -21482, -26113, -39097, -33982, -34865, -13348, 1892, 1109]
15979A109l149j052K100j3079K29J1797J3052M178N138J212q106n728k065j2135
15965f499j8177k672r43q397J2539J1234R534O878l013p742L298R002J2233L139
15951B0414j1067j6284j092k624p118K4304J2869k073K22l09m608M787J474k58
15937A8637O256l929j7497j2615k368L187N505R333L369n078q438K065r713J0296
15923i90J0593j991o642K957N056M855j5522l633P418J4407J5538j2720j5567
15910C759P400L0780O954j8704j7568j6645L533P800R838J951n68j4723k325J9537
15896B1019j485r641p212P701K1436k462k176M167l975r645Q970P573p822l254
15882B3194R299O752O456R699q743Q419J1253p052j339N227M795M299j6142j772
$$ y = [1109, -2040, -3092, -992, -14071, -13842, -2045, 11007, 15185, 20323, 21535, 13429, 7701, 5636, -6499, -24676, -27348, -28291, -36688, -24149, -12915, -3381, 3497, 484, -7258, -3960, 5042, 17275, 20414, 9347, -6937, -8029, -10653, -17771, 6533, 19402, 17329, 17551, 17242, 12634, 17421, 18895, 18637, 24893, 20964, 3467, -9148, -11516, -8329, -2824, 6509, 9878, 4800, -3638, -1573, -11286, -990, 9603, 7612, 970, 3927, 8983, 13838, -1684, -5317, 2101, 16508, 32046, 19326, 3759, 11159, 41939, 48893, 30189, 12621, -4024, -491, 7309, 17147, 19098, 18530, 3807, 1482, 21019, 19534, 9893, 2681, 10382, 31818, 29356, 27180, 31347, 27372, 17727, 26697, 34270, 26448, 23194, 32493, 39245, 45701, 55400, 46657, 55076, 66329, 59277, 57938, 63165, 67960, 72259, 56117, 54345]
15868E4345R323J6758J0700k011p454L460p961j1969q470L940J3553K6631q348
15855I2497n783N352K821p680n897J1119Q43r706j753J2269k369M232P596r898
15841I3643M352J056j5357J926J0575L242J0424L883r742L249P274j3329k6897
15828G4299L313P849J1033J0884M777Q129j4943j39J550p883L380R405L560m948
15814A10266k895J1590R92j5341q421p924j0302R833J8614M74m97j2392m950J1273
15800A00320o608j4365J0246M535r968Q035P261j1001j5483j2966p073K250J6679
15787G1862J1823N605n662q811j5045q070j064q146l048N329P39J305J185q416
15773C9586j3958o177j3856l680R778J9021O51Q307L455k157M294j3118j4286
$$ y = [54345, 63668, 80426, 91126, 89115, 81661, 85121, 77160, 65191, 56721, 60661, 74214, 100845, 92497, 86714, 92066, 94887, 87207, 81310, 92429, 93272, 83566, 81813, 94082, 91713, 95945, 103541, 93643, 97995, 99051, 83694, 85620, 96195, 99437, 109861, 113744, 104002, 107251, 114525, 101196, 74299, 77612, 85461, 96494, 107378, 112155, 120284, 105341, 105202, 106752, 98869, 102249, 111654, 115214, 110266, 107371, 118961, 119953, 104612, 96191, 88267, 77965, 87798, 106412, 106886, 106389, 93997, 89047, 100320, 93712, 79347, 89593, 94128, 84160, 92195, 99456, 88455, 72972, 60006, 52933, 55183, 71862, 83685, 89290, 83628, 74817, 59772, 51702, 50638, 42492, 39444, 44773, 45512, 46817, 48002, 39586, 25628, 19451, 5595, 1915, 11693, 30714, 31365, 39672, 43127, 40970, 45264, 32146, 17860]
15760A7860j144J0835r41j054j1720q47j935o617j3277k167J4292J5132O547j1513
15746A3451o795n513O790J0426J3534j83p595n085O429j3778j0190Q465Q913J79
15732A9048O418J5877O852p155j630m96j460o035p49j616r595j2590N52j033J6517
15717B2905K490j3567n987J35P18j0045R67J0156J8603n441j0362m902o447L957
15703C180j0057p279n983j709p835N048J6978J4556n717j2102L051k697Q273l303
15689e596k09j153j647L488J2054p815j8480N253K0655J508r305p395n027n624
15675a9293j1300o991J2861L193j5504M486J8965M357m664o135O177P198j3049
15662a9699M096m580J1187R315J53o705o846P207m727l328P117r938K845J185
$$ y = [17860, 16716, 27551, 26610, 25556, 13836, 12989, 11054, 4437, -8840, -11007, 3285, 18417, 24964, 13451, 6656, 1143, 7933, 18359, 31893, 31710, 24115, 19030, 25459, 11681, 1491, 9956, 18869, 19048, 25466, 41343, 48195, 41040, 39410, 38914, 37454, 31419, 30670, 29054, 19459, 6869, 7421, 6388, 22905, 25395, 11828, 5841, 5976, 6694, -3351, -2384, 7772, 26375, 20934, 10572, 5670, -777, 3180, -6877, -14156, -20139, -21848, -29683, -24635, -7657, 6899, 1182, -10920, -7869, -10566, -2293, -5596, -5805, -6958, -8605, -5117, 6937, -878, -19358, -14105, 6550, 8058, -1247, -8642, -13669, -19293, -30593, -37584, -24723, -21530, -37034, -32548, -13583, -9226, -13890, -20025, -13848, -6650, -19699, -15603, -20183, -8996, 319, 472, -6233, -13079, -5872, -10599, -13927, -6810, -16748, -13903, -12718]
15648a2718m51K514o207L980P780J2224L077n690j7636J0656j906k473R33o774
15634a2691J3268J2528p649r236q041p112M917J041n806o689K076l3o676q115
15620c8218J2655L821J0010Q530N255p865j0793N512O784m252N046j1662M52N082
15606i643K685m488p333m292r751n544P466K4179M796j1201l017o536M962J0655
15592g062P072P903n268j1829p94K861k791j627q349o179j507n383L069K403J8483
15577h998J1322n527Q984M590j5067O133M087p00j9074r098P603J8492k880q630
15563h763J820l721J015j1881j868K417L31m935L810R987N69O789J5320r672l1784
15548c0566m087J3187R579J2011m236m578k958K67J6029n923j8303L070K57K014
$$ y = [-12718, -13169, -10655, -16862, -12882, -5102, 7122, 10199, 4509, -13127, -2471, -4377, -6850, -5917, -12691, 577, 13105, 5456, -3780, -11821, -18933, -14016, -12975, -18781, -25470, -23394, -23427, -30103, -38218, -25563, -21742, -11732, -3202, 2053, -5812, -16605, -11093, -4309, -8561, -3515, -15177, -14725, -9643, -6958, -11446, -18779, -23071, -32822, -38366, -30900, -6721, -1925, -13126, -16143, -22679, -17717, -7062, 10, 7913, 2645, -9184, -9978, -7117, -9908, -11535, -19884, -26063, -27570, -32953, -29884, -27481, -8998, 2324, -3203, 5781, 10371, -4696, 1437, 5524, 4824, -14250, -23348, -15745, 2747, -133, -8763, -6943, -10664, -9649, -21530, -23398, -20981, -20650, -25585, -21775, -11788, -11219, -4430, 10890, 1218, -30566, -34653, -21466, -11887, 124, -4112, -8690, -11648, -11381, 4648, -1275, -19578, -16508, -16251, -14237]
15534a4237r433j2900m004N685L929N052Q769O447k719j2671p49Q99R499l384
15520a9817m379J4876R342K653R866O048n879j1986M149k491l848n254p222N721
15506h221J0794q680j2403q079J2259J0963n775J246j1136J0187J777N16J2358
15493E806K543o354j1466j236N918J7632j031j4737k3902p13R154J3814J0608
15480F036o744n124N265Q692j3738N501n05M128K263o728P004J708j4390n688
15466a2320N913J5394r865j2818o159K927n360j30r36J1641m821o897r94m941
15452b9366J0627l39r92P273Q153k169J0505k707r970K556K881L210l932r039
15438a3309J789j783p413J660R890p894k061P644j3629k0371L025K8164J0933
$$ y = [-14237, -23670, -36570, -40574, -34889, -30960, -25908, -17139, -10692, -13411, -26082, -26831, -25932, -16433, -19817, -24196, -9320, 22, 2675, 12541, 18589, 12710, 724, 4873, 2382, -1466, -6720, -13942, -8221, 2573, -6107, -18510, -26589, -14330, -3367, -9142, -7896, -19032, -8845, -7068, -6552, 5806, 8349, 1995, -9471, -10707, -4789, 12843, 11812, -2925, -26827, -27540, -18386, -4572, 6036, -708, -5832, -567, 8125, -5613, -112, -617, 3511, 5774, -954, 6050, 7758, -6632, -12320, -6407, 8987, -878, -13696, -19855, -16928, -22288, -22418, -23354, -11713, -16534, -23431, -24425, -29366, -18739, -19078, -20070, -12797, -4644, -6813, 3692, 985, -8985, -6429, -3548, -338, -4270, -13309, -11520, -13303, -20716, -19056, -9166, -17060, -19121, -11477, -25106, -45477, -42452, -14288, -3355]
15425c355j4678Q2n040Q853m540q643j0634J376J4229J675j470M175l398n544
15411b6912o213R642P149k626j0717M056J7265l66P90K99N171q897M956j1735
15397a8138j3410L617P647K842K3655m722j0811n724L557L361o628o337J4771
15384f320R612j1153j3661J07O422K836j317R10j1739K55R971M380K899q735N912
15369i621q591l354K714K868j881N64m45M270n534j447M393q060q824O090K764
15354b4094j076Q333Q801k346L147j4615n577Q645p637l957M738j682J0394R995
15340f931K998j4989L180P35j967L1K193k373P551n435j1620L545N179Q31q232
15325b5304J7296R996q988r107q457q221J1743j0599O281K118N74k162L326J016
$$ y = [-3355, -18033, -17951, -22991, -14138, -18678, -27321, -37955, -36579, -22350, -20675, -22145, -17970, -21368, -26912, -33125, -23483, -16334, -18960, -29677, -25621, -8356, -8722, -7932, -7633, -2462, -11359, -6403, -18138, -31548, -27931, -20284, -17442, 6213, 1491, -9320, -15044, -11487, -8126, -14754, -21091, -6320, 3292, -7861, -21522, -21415, -14993, -12157, -13474, -12564, -24303, -24048, -14077, -9697, -6798, -15533, -9621, -18212, -21566, -18852, -15984, -17865, -17301, -17746, -13476, -19010, -20457, -16064, -24124, -32948, -26858, -24094, -25170, -16837, -8036, -10382, -7235, -21850, -27427, -18782, -26419, -30376, -25638, -27320, -16926, -6931, -3933, -18922, -15742, -15007, -16974, -16943, -14750, -17123, -9572, -15007, -26627, -23082, -17903, -17072, -25304, -8008, 1988, -7000, -16107, -24564, -32785, -21042, -31641, -25360, -23242, -22668, -24830, -21504, -20488]
15311b0488l223N725k564p123j3256K152M28P450J8247R784l024j983j4958N726
15297a7107O426J508l415n342M562o959o354J075J5191j570j032J1076q726k1362
15283c2029j5978M960M593J26m272p418n149j65L234m410J6836J4357q462r759
15269d3536K264R18P01J2017K544M798n19m005L979m101q341J0242j315j1281
15255c5635r812J7655J4290N719o979j2932O863P35L303j301k470K088K3431p4
15241D881l2735q547M756N202J943L429J6456n292q055P573M307p510Q05j0889
15227b3676k3452O946J3440R391J30N652p960j739o925m340O26n231L764l11n628
15212c9313q627R477J2880R363j1236j1937k766J194P712O491n161O036n090j735
$$ y = [-20488, -23711, -17986, -20550, -27673, -40929, -38777, -38349, -30899, -12652, -2868, -5892, -7875, -22833, -17107, -10681, -9173, -12588, -17930, -13368, -20327, -26681, -25606, -10415, -11985, -13017, -1941, -10667, -32029, -48007, -43047, -38454, -38328, -42600, -50018, -55167, -55332, -52098, -56508, -39672, -25315, -33777, -43536, -41272, -40354, -39653, -27636, -25092, -20294, -20813, -24818, -20839, -24940, -33281, -23039, -24354, -35635, -45447, -27792, -13502, -7783, -14762, -27694, -20831, -20096, -16793, -18094, -20564, -18476, 4955, 4881, -27854, -36401, -31645, -26443, -24500, -21071, -4615, -9907, -17962, -10389, -6082, -13592, -12787, -23676, -47128, -40182, -26742, -17351, -17221, -11569, -19529, -21268, -28193, -32533, -31907, -37138, -33374, -33685, -39313, -47940, -38463, -25583, -16220, -27456, -39393, -42159, -40965, -33253, -26762, -31923, -25887, -30977, -32712]
15198c2712M182p139j6581j461O215K128L171Q109J1043J2872j744j4283M561
15185b1639J4377j0575j6400J4908L246k708J933Q225l209p737O935R040J0505
15172F901r683j3844l567K109J899P605Q246M448j3322j6083o726J013J579J758
15158b7667J2841L733o80M785J414p728j0633n643J0374j979L496P13p03O01O34
15143a6442m2j481K904P474R149j9843P155J0375j7886k096J625j6192J759O349
15129b7192P57K010K395O009j856m515L662J0379M975n573m400j7343p993k652
15115d1337l82L911J9201K3885K085j8490j1391m947M849P896R7O815l188l442
15101a4438K664l075r018M574J358K222o362j822J1206J3661q708j1165P259k05
$$ y = [-32712, -28530, -35669, -52250, -53711, -47496, -45368, -42197, -34088, -23045, -10173, -11917, -26200, -21639, -7262, -17837, -34237, -19329, -16083, -18791, -16858, -8633, -11842, -19579, -12644, -3604, 6901, -2782, -16626, -20193, -18084, -16185, -8580, -334, 4114, -9208, -25291, -32017, -31004, -29425, -27667, -14826, -11093, -11773, -6988, -5574, -13302, -23935, -29578, -19204, -21183, -17687, -16974, -17677, -17076, -16442, -16484, -17965, -15061, -7587, 1562, -18281, -11126, -751, -18637, -20733, -19108, -35300, -33541, -27192, -26435, -24425, -22030, -16021, -17877, -22392, -18730, -8351, -3376, -8949, -13349, -30692, -38685, -41337, -41719, -37808, -18607, 5278, 7363, -11127, -22518, -27465, -22616, -14720, -14623, -7808, -10996, -14438, -11774, -14849, -23867, -19293, -17935, -15713, -22075, -23897, -12691, 970, -7738, -18903, -11644, -11849]
15087a1849O457J4742P393m63R410J707l139j1994j3344n667n809P622M804R760
15073I630P518o658j4991j1905l709p381L121J185m154K1137J7818p551p484J310
15059b114j5093j4049J625q557k451K683M25P797k906m897L788J5693J311K419
15045a4326R584M65j7210O617k39o914o350L383P084r99P749p75q204m084n08
15030b4727k0037O764J3118L554p403j13J4677M436O918N461j0381p400R207O018
15016I2k3737p618P215Q27q629k75J8799J7546p905J423j288m796q374J3388n102
15001h434j1824q88L255l717m234M001o830o18J4500J6115K966m089l930R37q646
14986a1436l632J1464M754j6481q332j2704L77N080J5290N362M24M801K069l34
$$ y = [-11849, -5392, 9350, 16743, 16280, 25690, 27397, 24258, 12264, -1080, -6747, -12556, -4934, -130, 9630, 17148, 10490, -4501, -16406, -20115, -27496, -24375, -23190, -27344, -6207, 11611, 4060, -3424, -2114, -17207, -31256, -29631, -38188, -40639, -37956, -37531, -29734, -32640, -37537, -33749, -18056, -16745, -14326, -4742, -4277, -21487, -14870, -15109, -22023, -28373, -24990, -17906, -18905, -11156, -11931, -20135, -24219, -24727, -44764, -38000, -24882, -21328, -28731, -28844, -14167, -9731, -2813, 2648, -7733, -15133, -5926, 92, -23645, -31263, -24048, -23221, -31850, -32125, -13326, 4220, -3685, -2262, -3550, -8346, -16720, -3332, -8434, -20258, -21146, -17891, -21608, -25842, -21841, -28671, -29289, -14789, 1326, 4292, 203, -3727, -2790, -11436, -15068, -3604, 1150, -15331, -23663, -36367, -35990, -30910, -15620, -10258, -9834, -5033, -2964, -3298]
14972c298L21k500j0099r860K970N624P72p143j367M033k071L358J2220J793o571
14957a1818l732M413l045K682K099o286l065J04m526o877J2494J4361k026l428
14943h650J7951p955j7679M005K240J012j477k351m776j063N30M082L35O70N456
14928g670r980N272J0484O433l805n022n439j130J6692j1594p801M072O886J0113
14914G511Q837j4391J0104R072r860p821j1530Q759R670N052o700j4738r491j42
14900a5668J5010R477j717P853m244j0401o543j960l165K32N790o461j9198J0405
14886b0590P663r76l897Q832K803m16Q580m473o087j595L454J2274k017j3928
14872a0373R952O257O653J98j0984r292J1069O819j2049r17J0902j118q630j29
$$ y = [-3298, -2977, -5477, -15576, -25436, -22466, -16842, -16070, -23213, -24580, -20547, -22618, -19260, -7040, -5247, -11818, -15550, -11137, -14182, -11500, -9401, -15687, -18752, -18648, -23174, -30051, -17557, -3196, -5222, -8650, 9301, 1346, -16333, -12328, -10088, -9076, -10553, -12904, -17680, -18743, -18213, -14131, -13796, -13126, -7670, -17650, -12378, -1894, 4539, 734, -4288, -9727, -10857, 5835, -5759, -13560, -9488, -2602, 7511, 16348, 1957, 12061, 21133, 11273, 3452, -8078, 681, 10351, 15403, 8703, -6035, -15526, -15668, -658, 8819, 7102, 14955, 10711, 310, -6233, -8193, -11358, -11126, -5336, -11797, -30995, -20590, -12927, -13903, -17800, -8968, -6165, -6581, 1999, -2474, -8561, -10156, -6702, 5572, 3555, -10373, -421, 5836, 12489, 12687, 1703, -7589, 3480, 10299, -1750, -2667, 8235, 7117, -1513, -1642]
14858a642K697p795n393J4225n751n314l937O791K985Q580J0319N932m122p16
14844A6859k2344m811q64J1952j1068M95J0298m991n798N749k255J2881m432k0597
14830a8926q306o440k26K0621K0043o317m622j1551j145M61r812L506L819k137
14816b1032J0173O035J1105j6563j0210L246J6908N55q215r467Q810J1231P309
14803I885m566l816L993J0626j512l375Q27m274m636q549J5526J8645j2655k1730
14789e611m244j55K10k851M605K777L122r3l3p366M037R593J2301P307N492n976
14773B3115k493n506m084P999N07j2723m343L800m984n186P298m758l507J920
14759b945J55N965J0435n438j092J005l047j364q842j621Q20N881R255J8448O583
$$ y = [-1642, 1055, -6740, -12133, 2092, -3659, -8973, -12910, -6119, -3134, 5446, 15765, 21697, 17575, 16859, -5485, -10296, -11160, 792, -10276, -9781, 517, -4474, -10272, -4523, -6778, 6103, 1671, -18926, -27232, -33672, -33898, -13277, 6766, 449, -4173, -15724, -16869, -16408, -26220, -22714, -18895, -21032, -10859, -4824, 6281, -10282, -20492, -17246, -338, 217, -7998, -17465, -8655, 2576, 9885, 5319, 1503, 5496, 16122, 14610, 11235, 12062, 7788, 3152, -5397, 10129, 28774, 16119, -5611, -9855, -10010, -9800, -12651, -8046, -5269, -2147, -2240, -2273, -9639, -5602, 3991, 16292, 23599, 29091, 23115, 20622, 15116, 11032, 19031, 19538, 6815, 2472, 6272, 1288, -3898, 3400, -1358, -4865, -2945, -2790, 3175, 13610, 8172, 7080, 8085, 5038, 3674, -5168, -6789, -5969, -88, 9167, 27615, 34198]
14744C4198m484r183r423m058J0985q132k813j3752r091J3123m497N347O194m806
14730c92K895J359q261N239J0612N467p569j0927p057J9758J0879q859r941j662
14716A541o961l655M643p427q086r591J0270J0230O418k17r839o90O021L549j0308
14701a4102Q2j584K131J1921k501j3186M283J018L788J0273K192l554p652L080
14687c811J533L796n39O737p779j731J7449L267p65K162j2207j9248j0878J0574
14673a1440J2432l812J438p573J722N00p736j0855P894j118K536Q571J6790n414
14659C935r826k483M867O966P828K153l94o118o218j1977j781K7908N480j7663
14645B677q528q039R218M926j1875l137m953L967R837J3745l751k4494j5754O295
$$ y = [34198, 29714, 20531, 11108, 7050, 18035, 9903, 7090, -6662, -15753, -2630, -7127, -1780, 4414, -392, 2503, 3862, -4399, 840, 11452, 16919, 9350, -1577, -8634, 11124, 22003, 13144, 3203, 1541, -5420, -9075, -4432, -11859, -19945, -29536, -19266, -9036, -2618, -2835, -12674, -13364, -7343, -3794, -14102, -14020, -15604, -13473, -1552, -4053, -17239, -12956, -11938, -8150, 2123, 4315, 761, -6891, -3811, -2278, 1518, 979, 7716, -63, -1794, 15655, 18922, 18157, 20319, 8112, -11136, -22014, -11440, 992, -2820, -1382, -8955, -7233, -6733, -14469, -25324, -17430, -18548, -16012, -7441, 9349, 3935, -5891, -8374, -3507, 3459, 11287, 13440, 13046, 6928, 710, -11267, -13048, 14860, 20340, 2677, -5851, -13890, -4672, 254, -11621, -14758, -19711, -15744, -5907, 7838, 4087, -20407, -36161, -29866]
14631b9866J1592K6711M055o149J0380L332q105p312M676o824P972J3771q073
14618A6160j5958p117K842n774P377Q9q133R331J0889o713n664j2348j2636J1222
14604a6433l841o538m738O603O959N231J1691r01q330J359R49J981o626N238r801
14589a7197K895P241p838O265P44j1756j4436l770J503K3079J4704L519k771j791
14575C91j8743r687L394K4371K263j7317j1231O098j107l498M353J6910Q252L930
14561H379M719r607l051J80n10l394M387k240J0944m782j1189k468J2717n60J485
14546E010L154j4727J960J3051k808M72L13p180k326m297N9j2996k883J0226Q436
14531d536K607n154j7436N023J7257J1769p173l369N264N376o472j9619j7864
$$ y = [-29866, -18274, 8437, 12492, 6343, 16723, 20055, 11950, 4638, 9314, 2490, 10462, 24233, 16160, 202, -6915, -4073, -9847, -2470, -2381, -10514, -1183, 9706, 2993, -2671, -15019, -27655, -16433, -20274, -26812, -31550, -24947, -17988, -12757, -1066, -1967, -10297, -8938, -7989, -6008, -12634, -7396, -17197, -14302, -7061, -14899, -8634, -7890, -19646, -34082, -37852, -36349, -13270, 1434, 4953, 2182, 391, -18352, -28039, -24645, -274, 1989, -15328, -26559, -20461, -21568, -25066, -20713, -3803, 4449, 8379, 13098, 3491, 440, 620, 110, -3284, 1103, -1137, 9807, 5025, -6164, -8632, 4085, 3525, 5010, 8164, -6563, -4603, 8448, 5640, 6112, 6425, -755, -3081, -7378, -7319, -20315, -23198, -12972, -4536, -1929, -7083, -24519, -19496, -2239, 9530, 2357, -1012, 4252, 9628, 3156, -16463, -34327]
14518c4327Q642R834J8095J3872P052j359j5072o353n778j0842l296L780O276
14505i476K00N102M111o772p096j653N823n75J2697o464n288k862J5367j1063
14491g949j4786J5920k1729J405K699J164k521K0058N581O212J5955n080j1111
14478E818r17L925q58M319O707k889O534l185j4081p737n921j240l54n924K747
14463a3056J0621K826R90P179r733l287O917M621J951l103P92l140J898J725j2230
14448e029P571J73M483p346j8059o421l151L607M397n991J400q986M772J9181
14434i399p84J404P525K4960N16k3049n494P913J5069L749j268J200L217m336
14420B1223j7614l0283k702O319k315q035J1840M614N271K0979K924j7928N472
$$ y = [-34327, -25685, -15851, 2244, 16116, 23168, 21809, 6737, 384, -5394, -16236, -19532, -15752, -9476, -9276, -4174, -63, -6835, -13931, -15584, -9761, -10336, 2361, -4103, -9391, -12253, 3114, -7949, -22735, -6815, -28544, -27139, -24440, -23276, -25797, -5739, -158, 6054, 22009, 16929, 5818, 4901, 8826, 7968, 12287, 18994, 16105, 22639, 19454, 5373, -2364, -8285, -9525, -9879, -15803, -13056, -2435, 391, 1381, 8560, -1173, -4460, 2457, 7078, 9029, 5926, 6718, 3578, 5476, 7201, -5029, 2542, 2715, 7198, -148, -18207, -24628, -27779, -24172, -19775, -25766, -24366, -33352, -28580, -9399, -10183, -8779, -1254, 23706, 24222, 1173, -4321, 3592, 18661, 22410, 21142, 22342, 25559, 21223, 3609, -26674, -29376, -23057, -25372, -33407, -21567, -16953, -11682, 9297, 12221, -5707, -235]
14407b35k299k0729m665J0256J0879m922o097q527J3845J8630M954l927o399q052
14393g288R211n39p745Q026p0Q620J1788M431j096N364l963j9103j6771p179J1399
14378d915J1634q872q191q109q403P160j595J5257J2853p993Q604O509L82l764
14364A0557q652j3087k808j144L609J0809J3161M781j3863j2532L159j388J2269
14351D871Q402j0636j6223k3038l768J7545J1887O931m368j3383K372J3579L93
14338e436r011j5643J7677P523m854q206m180Q860j0175J84P930R073p090n962
14324a9310n42o907L709O659n69n373j190J8046J0514m596L212k628J4315o063
14310I277m540j0082LK305j7338J0398O33J7544K267j3551q051N977J736l545
$$ y = [-235, -2534, -23263, -27928, -17672, -6793, -11715, -17812, -26339, -12494, 6136, 11090, 7163, 764, -7288, 1923, 1384, -6361, 1665, 1595, 10215, 22003, 26434, 25338, 30702, 26739, 7636, -9135, -16314, -4915, 6719, -2153, -10344, -18453, -26856, -19696, -21291, -6034, 6819, -1174, 7430, 13939, 14321, 10557, 1905, -11182, -13990, -15134, -11525, -716, 12445, 17226, 3363, -9169, -6010, -7398, 4871, 13273, 2637, -13586, -36624, -40392, -22847, -10960, -4029, -8397, -21780, -19408, -5829, -5436, -14447, -30090, -12413, -4890, -9744, -17950, -22130, -13270, -23445, -23261, -15331, -6258, -13348, -19310, -19852, -26759, -23050, -16391, -16960, -22333, -23523, -5477, 5037, 441, 3653, 1025, 15340, 9277, 4737, -5345, -5342, -3037, -20375, -9977, -9344, 8200, 10467, -3084, -11135, -5158, -3422, -6967]
14296f967j2091p804J3936J4330O586j2320j3098q344q547o064O237J5656J413
14283a7077K083K285p012J0168n3o487J0571M495O15Q005P321p221j2181L274
14269a214r74l613O479J2098L901o348j4450n127m62J92N139P749p001L812O506
14254F687K524r85j0440p967K550J7395L393q722j9940j0881P723O346l518j866
14240a7701L936M368O382K568r721l539j2203R849L219M234O87Q868J7037p32
14226A7252n884j1611q886P698K812J4382j995j2479j0007J977O350J0705J2742
14213B3056m965N259M893j4997n305J4465J4966n637M484j2792j7193j6889J3191
14200B536r604K778J3053O914N13j4787k707L972n03j7268n787l713l5J8847Q794
$$ y = [-6967, -19058, -26862, -12926, 1404, 7990, -4330, -17428, -25772, -34319, -40383, -34146, -18490, -17077, -14994, -12709, -19721, -9553, -9606, -16093, -5522, -1027, -412, 7593, 14914, 7693, -4488, -1214, -2188, -5801, 678, 12776, 16677, 10329, -4121, -9248, -9710, -9518, -4379, 3370, -3631, 181, 6687, 9211, 8226, -2214, -10181, -7631, 9764, 13157, 4435, -15505, -26386, -18663, -12317, -15835, -17701, -13765, -9397, -3015, -447, -10168, -13707, -25910, -16061, -12842, -8608, -7921, 947, 17984, 17252, 11368, -243, -9129, -1431, 1381, 15763, 13768, 1289, -8718, -6741, -391, 10314, 23056, 18091, 23350, 28243, 13246, 7941, 22406, 37372, 31735, 36219, 23427, 6234, -10655, 2536, -7068, -4290, 8763, 15677, 16190, 1403, -1304, 2668, 2165, -15103, -20890, -24603, -24638, -5791, 3003]
14185C003l436P22o028l184j098Q551P757o931r139P316k963L596n020m328J3280
14170B098J385K069n947O079k026O980K243R480j512N856j7194j7104P96j538
14156h335J334J1149n798K890K379m75j231l225L6J4263L261l561k915m394R61
14141F339p439j243R314l548K365J394l155L337J356r769p231Q59R96k931j0857
14126b0213N576O694P122J100J688Q742o265R19p172j3688p053r3J731K749J0562
14111g601K660M458J9292p158j5681q119K884M626R689K906j758n79P000j674
14097A0945L045n776q091K319J851P920P712j7455l934n24l359k357o42K710k200
14082g836l041n465j938J615j16J644J3833O924K70N784j549J0415L506j6638
$$ y = [3003, -433, 289, -5739, -8923, -10021, -1470, 6287, -644, -9783, -2467, -5430, -1834, -6854, -11182, 2098, 3483, 5552, -395, 5684, 3658, 10638, 12881, 22361, 20849, 26705, 9511, -7593, -6797, -8335, -7001, 4148, -1650, 1240, 3619, 3144, 1913, -1312, -1276, 12987, 16248, 12687, 9772, 5378, 6339, -1100, -2343, 6971, 3423, 5788, 7182, 4027, 7364, 8720, -1049, -8280, -7421, -6425, -9356, -20213, -14637, -7943, -821, 279, 1967, 10709, 4444, 5363, -1809, -15497, -22550, -22643, -20912, -18163, -7601, -4941, -483, 18809, 11651, -4030, -12149, -9265, -4639, 5050, 7956, 6198, 5619, 12619, 10945, 13990, 8214, 123, 2442, 4293, 12213, 19925, 2470, -1464, -1988, -5347, -7704, -8346, -5636, -7836, -10877, -16342, -18280, -16665, -16781, -15137, -1304, 5620, 5890, 11674, 10125, 20540, 24046, 7408]
14068G408m145j5362r669L473R362n287Q940L863q202n250M962J1324N22K27m121
14053a955q503J050J5467k714j030N405K68J529M229j9680m015L386n18J206m94
14038f369J0435Q090M039K716l51m888N752j0069j7790o871J027J223k568p015
14024b2639J605J5206J5442J2216o634q345L227J6841j0509r101q070n00Q106
14011F845k876l574l479j473n195n781J6629j1375n913J5421P84J1818O981o016
13997A2796l820j346n812j3724M356R476N616J4015J9440O781n285n217K826k665
13983C7437k508j430m370L834N204Q033n495j6498n248k337J7215O608j3455n33
13969B6457m496m588K429l338K82K235o190n585R544M729N39j1470J067J3761
$$ y = [7408, 3263, -12099, -21768, -18295, -8933, -14220, -5280, -1417, -9619, -14869, -9907, 1417, 1939, 2166, -1955, -10458, -9408, 6059, 3345, 2315, 7720, 7988, 9517, 13746, -5934, -9949, -6563, -7081, -5875, -6369, 4066, 12156, 16195, 18911, 18560, 13672, 19424, 9355, -8435, -15306, -14279, -13056, -15624, -22639, -21034, -5828, 9614, 21830, 15196, 6851, 10078, 26919, 16410, 7309, -761, -1261, 6845, 3969, 395, -3084, -4557, -9752, -15533, 1096, -10279, -16192, -771, 13, 11831, 18812, 12796, 8976, 7630, 1818, -11906, -7550, 1926, 7542, 21557, 40997, 47778, 42493, 37276, 40102, 37437, 34929, 33499, 29129, 32963, 38167, 46200, 40705, 24207, 18959, 16622, 33837, 40445, 26990, 26457, 21961, 17373, 19802, 16464, 16746, 18981, 12791, 7206, 16750, 21479, 22018, 10548, 11615, 25376]
13955B5376J4290P932m924K409j060j3631j817L323J49K967r011M21n956k599
13941A7869m898j2499J5092J298j5082m661L011M428p820J194o259R865L297p042
13927b207Q404J5264k435j4266Q170R072k09q442n781j7950m565J730k88P699
13913e804k096L83Q286J3539q167L487K399L976L142j0925M698K6180R132P45
13899D8975j3702m132j937K076l217j3359R96K340J069R395J0758K184o22j1579
13885B9245j4365o793O191J0120n216K6q28n805p71n121l280n821O441J4584L144
13870B1751o623K82J059r830M034J2268O654n407J966N014J1726Q803J955M61
13856E4113q875m987r892P866J0125J9542l327j951q275j6191j3853j3225J3130
$$ y = [25376, 39666, 47598, 42674, 45083, 44023, 30392, 28575, 31898, 32047, 35014, 26003, 26424, 20468, 17869, 12971, 472, 15564, 16862, 1780, -2881, 130, 4558, -3262, -2068, -8327, 1538, 4835, -2207, 6197, 21461, 19026, 4760, 12930, 22002, 21793, 13351, 7570, -10380, -14945, -13215, -13503, -5804, -7900, -7517, 769, 14308, 6141, 9628, 12027, 16003, 19145, 8220, 12918, 39098, 48230, 48975, 35273, 31141, 29204, 31280, 28063, 14704, 15700, 18040, 19109, 28504, 39262, 41446, 40824, 29245, 14880, 8087, 14278, 24398, 19182, 19208, 18380, 12575, 11804, 6683, 3403, -2418, 4023, 18607, 21751, 15128, 15410, 16469, 6639, 10673, 22941, 29595, 24188, 26154, 31168, 42894, 51697, 53652, 54113, 45238, 40251, 30359, 38225, 48350, 67892, 64565, 62614, 54339, 38148, 24295, 11070, 24200]
13843B4200K4198J0538l007p244M99j407J2692K72O0o521j4227Q121P581k804
13829E2951L537J51j0923n31O971p842M173J3014M617j3925l620O397l789k474
13815D8707k709m37j0170L892O818J3479L492M10L975m09L675r895p736j1772
13801D1320j0735K6287P192j2243r141k072O302p799N266L381m060N442J4204
13788F3344M809j0663j638K082l897q392Q591J3157m63l420k738j5738k1043Q611
13774C2602J154J5845J1671Q220n5k0677k652L348j7063k2428K370N928O364J952
13760B6579j6P023k141p268J851P711m791M486n090k76J4786j2993r994p046l893
13745H928L023k923L062K909j1046J5123N092p041j2941j0830J2529k695N874
$$ y = [24200, 48398, 58936, 55929, 48685, 49184, 47777, 60469, 60741, 60801, 54280, 40053, 48174, 55755, 52951, 56488, 56639, 45716, 45185, 52156, 44314, 48487, 61501, 66118, 52193, 48573, 54970, 51181, 48707, 45998, 45561, 35391, 39283, 46101, 59580, 63072, 63482, 67457, 67048, 70723, 60828, 53092, 41320, 30585, 56872, 64064, 51821, 42680, 40608, 46910, 39111, 44377, 47758, 43698, 49140, 63344, 68153, 57490, 55852, 57934, 54037, 45645, 54236, 67393, 66930, 63510, 60772, 45034, 23991, 32602, 33756, 49601, 61272, 69492, 69437, 48760, 46108, 49456, 32393, 9965, 12335, 18263, 24627, 26579, 26563, 33586, 31445, 24177, 26028, 33739, 28948, 33434, 28344, 28068, 42854, 29861, 19867, 12821, 8928, 11951, 9028, 12090, 14999, 3953, 19076, 24168, 17127, 4186, -6644, 5885, 3190, 9064]
13732I064J6768q913l187J1285N303n412n989N49J272p906K052P78n13L945r972
13717I124j0496m554J3152J1601o082R927L292O369k008j8504J643J1156J80q862
13703A5938J4985L288J574J3798n553p062J28j6000m656j2170L123P999J629O321
13689B3342N477K90j8198M160J3443r498o257q751O505m295J3949N847j1875m665
13675I474O931k558L402j0171o967Q187j0824q665J7265K0948m941O503J002q635
13661B0951K407M943n445l007N685q62K281p966p199n351l253j092J958O822Q587
13646A9459O057P769n664p2J749J0702m564o237J1612M893m940k906r988J291
13632B9161M258K290Q526M826m139q05n560p649N439Q537j993J3430o531j0510
$$ y = [9064, 25832, 16919, 13732, 25017, 30320, 24908, 18919, 19468, 20740, 12834, 14886, 15664, 15151, 19096, 9124, -1372, -5926, 7226, 18827, 12745, 22672, 25964, 32333, 30325, 11821, 13464, 24620, 24800, 15938, 30923, 34211, 35785, 49583, 44030, 36968, 37096, 21096, 16440, 4270, 7393, 15392, 17021, 23342, 28819, 29109, 10911, 15071, 28514, 19016, 12759, 4008, 10513, 6218, 20167, 26014, 14139, 9474, 16405, 13847, 17249, 7078, 111, 8298, -2526, -11191, 6074, 27022, 22081, 28584, 29586, 20951, 23358, 28301, 22856, 19849, 25534, 24672, 26953, 18987, 11788, 6437, 3184, 2092, 4050, 10872, 19459, 25516, 33285, 27621, 27549, 29298, 40000, 35436, 29199, 40811, 45704, 40764, 37858, 27870, 29161, 33419, 35709, 44235, 49061, 44922, 44117, 38557, 30908, 36347, 44884, 42891, 56321, 49790, 39280]
13618C9280r668k1518M744J1309p324q861N362J385J2263l026r12M435r824k1738
13604d093j2346L422K4798R084n733N116J2978m340p531O518Q168q503j027M138
13590C0649q95J1060O546j1572l361J0547j3480j7245L721L140j2693R608q95
13577A5130j8336J3478J7837J4392J4083k6132j0388l965k263Q267M148J100M675
13564C2026j932P508K730j8118j5238L653M52J2751J595J862L541l309r055j3883
13550D583j213q35J410P487J2810k44m179N680R677j3303n962N670l069o971k229
13535I312L941P499O159L651j6487O385J0030J7544J531r689j2593m513j1732
13522A1038j0423O383J3975Q468j3341j923J6531P582o455j2636j0796R349L294
$$ y = [39280, 29612, 8094, 12838, 24147, 16823, 7962, 13324, 14709, 26972, 23946, 23034, 27469, 17645, -4093, -16439, -13017, 11781, 20865, 15132, 20248, 33226, 28886, 21355, 27873, 36041, 27538, 26511, 30649, 29754, 40814, 47360, 35788, 32427, 42974, 29494, 12249, 15970, 19110, 6417, 16025, 15130, -3206, 10272, 28109, 42501, 56584, 30452, 20064, 16099, 13836, 22103, 26251, 27351, 32026, 30094, 37602, 40332, 22214, 6976, 10629, 11081, 23832, 25427, 27289, 30830, 27521, 18466, 4583, 3370, 2535, 3945, 11432, 24242, 23998, 19819, 25499, 35176, 21873, 15911, 21581, 18512, 11541, 9312, 13253, 20752, 26911, 30562, 14075, 20460, 30490, 48034, 49565, 39876, 27283, 22770, 11038, 615, 6998, 20973, 29441, 16100, 14177, 30708, 38290, 31835, 19199, 8403, 17752, 21046]
13509B1046o237Q308M696m592n229k283J0182J8985N615p089k1330j742J7589
13496C7919J49n541P898j0554j36R150L789P527o77o313q408R324j05k418O72
13481D2276n485L329Q266q216l762K420k00j4070o489r052m125P807Q290L808
13467B4797o592p618j0161O813J4886Q000J0409j6708j7396j839o30j502J961
13454D420L4j857N33J956K603K771O092J776r376J0712J5986m09M244N749j4706
13439C0528j6773O590j400J561r026J0442J3847L968N646O749j700P50j2453k1996
13425A6733p139P989l158M965L407Q671J1768J2481J1200r362n051j1146r121
13412C2237O105L94o271k658J4368M505j6645J380q443j8763J5002K1302O586
$$ y = [21046, 14809, 23117, 27813, 23221, 17992, 15709, 25891, 44876, 50491, 43402, 22072, 20330, 37919, 38068, 32527, 40425, 29871, 29735, 38885, 42674, 50201, 49524, 43211, 34803, 44127, 44022, 41604, 42276, 36791, 40120, 48386, 40170, 36408, 38828, 38628, 24558, 18069, 9017, 4892, 12699, 20989, 24797, 18205, 10587, 426, 7239, 22125, 30125, 40534, 23826, 6430, 4591, 3961, 2459, 4420, 4454, 2597, 3130, 5086, 7689, 10460, 16552, 18328, 8952, 19664, 35650, 35241, 39485, 45234, 30528, 13755, 20345, 18945, 20506, 11480, 21922, 35769, 39737, 45383, 52132, 50432, 51182, 38729, 16733, 9594, 17583, 14425, 19390, 22797, 31468, 43236, 55717, 66917, 57555, 52504, 41358, 32237, 38342, 38736, 32465, 29807, 44175, 48680, 32035, 33415, 24972, 6209, 21211, 42513, 49099]
13399D9099J866P66p296j8701j2111o532m034p319J286N691J8420K0764n277l266
13385C3356l26L169l451o021n0J064J2925M979j0844r398O647k46m290j407p133
13370A8974R776Q495n734m413J827m249L440n332j1338P696J113o628L797p52
13356A6672O282j108R315j9997N931L723J291N029J350M58P994P622j863j3530
13342B9169r452L474J75R276J2281R878q261p078o126j579O978J1161J0073l934
13328E6035j897J1424n935j2875n351m719j68L977l112k882K735l834o927j3559
13314A2912j1045j479m895J0202J2318J1444J28J0359j5082k6460j3871L1885
13302A6416K3809N381n898L857j806l88J3918K6P692J4672N831o782N386R371
$$ y = [49099, 50965, 51731, 44435, 25734, 13623, 7091, 3057, -4262, -2976, 2715, 21135, 41899, 36622, 33356, 33030, 36199, 32748, 26727, 26677, 27741, 40666, 45645, 34801, 25403, 32050, 31804, 27514, 26107, 18974, 28750, 37245, 31511, 27098, 28925, 24676, 28116, 22784, 11446, 19142, 20255, 13627, 17424, 16672, 22954, 21846, 31161, 11164, 17095, 20818, 22109, 27138, 28488, 28946, 36940, 44562, 42699, 29169, 19717, 23191, 23366, 32642, 44923, 54801, 46540, 39462, 33336, 31757, 38735, 49896, 59969, 56035, 54138, 65562, 59627, 46752, 41401, 36682, 36514, 40491, 37379, 34497, 37232, 33398, 26471, 12912, 1867, 388, -4507, 5695, 18013, 29457, 29585, 39944, 24862, -1598, -15469, 16416, 40225, 45606, 39708, 43565, 41759, 41371, 55289, 55315, 63007, 77679, 83510, 76728, 82114, 91485]
13288I1485L074L016j0487j7653j0029q243j1109r584k3311o859J7807P583j1353
13275A4337L682N625J6350P684Q088Q59K711K412p175q244o00j672K520M380n620
13260D5337Q138J372l956o11J0979l260Q33j957o455n140r462r198M208J3295
13246D4123R395J7931Q301J701r680R248N711j9432l193k034q622R54P345N949
13232F7697K221r10L486n955j2344r094K954P014j980k0923O594M000l020L487
13218D3227r857l626J970O745J92M647Q559J5139J4678P822j312k1629p635K973
13204F1893p202O741J7748J1415q524k651l806J7891M744Q495O998J9572J2667
13191A45981J4807j6730k476J8579L3173J5983K1302L4349M0436N0004P1505Q8730
$$ y = [91485, 94559, 97575, 87088, 69435, 59406, 51163, 40054, 30470, 7159, 300, 18107, 25690, 14337, 18019, 23644, 39994, 47678, 55766, 56625, 59336, 61748, 54573, 46329, 45729, 44057, 46577, 50957, 45337, 53475, 54847, 50891, 50280, 61259, 57999, 58832, 56875, 50420, 45280, 35818, 26620, 30828, 44123, 53518, 71449, 79750, 81451, 71771, 81019, 86730, 67298, 64105, 62071, 53449, 54403, 61748, 67697, 69918, 69008, 72494, 66539, 54195, 45101, 48055, 55069, 53089, 32166, 38760, 42760, 39740, 43227, 33370, 29744, 31714, 38459, 38651, 43298, 51857, 66996, 81674, 89496, 88184, 66555, 58920, 61893, 54691, 61432, 79180, 90595, 82071, 79420, 75614, 93505, 98249, 106744, 113742, 133314, 145981, 160788, 144058, 141582, 160161, 193334, 209317, 230619, 264968, 305404, 355408, 426913, 515643]
13179E15643J22424J55668J69490J74770J57158J05512M2366k1146p3580j35417
13169A212888j67072j74960j72111j45892j05261p1900n4213m3632l8149j7320
13159B22378j4193k2020j2573n39k802j7320p617J855q705l2914J3916J3370n944
13146A26892J420R04K859J599p109N303L252L088J0156l423k7241j5546K445O764
13132A11363J1787K760n230K88k157o433J2875J222M404j1255j2141J0060L045
13119A20588n830j2348j622L934M555r42p309j106r380k4760j0700J5857Q731
13106G9668L587k852m400n27O220L747k0089r245O26O72O449n727K390J2112J40
13091G2771K55l242L082L069q719K818q19J6080P168j2608k3538k335m320m273
$$ y = [515643, 638067, 793735, 963225, 1137995, 1295153, 1400665, 1443031, 1421885, 1348305, 1212888, 1045816, 870856, 698745, 552853, 447592, 375692, 321479, 277847, 239698, 222378, 208185, 186165, 173592, 173053, 170251, 152931, 145314, 147169, 138464, 105550, 119466, 132836, 126892, 128312, 129216, 132075, 133674, 126565, 131868, 135120, 138208, 148364, 144941, 117700, 102154, 104599, 111363, 123150, 125910, 120680, 120968, 118811, 112378, 125253, 126475, 130879, 119624, 107483, 117543, 120588, 114758, 102410, 100788, 104722, 109277, 108335, 101026, 99920, 90540, 65780, 55080, 70937, 79668, 83255, 80403, 76003, 75476, 81696, 85443, 65354, 56109, 56735, 57407, 63856, 58129, 60519, 72631, 72771, 73026, 69784, 72866, 75935, 67216, 70034, 69215, 85295, 92463, 79855, 56317, 53982, 49662, 45389]
13077D5389q034l636R362J3607M844N212P029q52N682K51p315J0394K1182M151
13063A07266J1282N549K109L511P872J4332J5752q46L213m114J5008n132o461
13050A69341n292n931j0267o691Q118j598j2678J0736J0920p090K783j3673J221
13037A39899J1038k340r770j6620n465P538k033l273J426l595j147l49r519N908
13023A11698N399J0693J4297P780K521L083O316J5525N294M253J9209J3198Q134
13010B27400J4141K8446K0735L3061L6818K2962K6771K9359L7601O320j1075j1310
12998D61229k4168m3355l8640k6491l4581j7897k5872j6458m402j501q805P791
12986B26850J019j5180o546m637P780J326J929O211N136J1961J6932m13l636n422
$$ y = [45389, 37355, 33719, 43081, 56688, 61532, 66744, 73773, 72921, 78603, 78854, 71539, 81933, 103115, 107266, 118548, 124097, 126206, 129717, 137589, 151921, 167673, 166827, 170040, 165926, 180934, 175802, 169341, 164049, 158118, 147851, 141160, 149278, 147680, 135002, 145738, 156658, 149568, 152351, 138678, 139899, 150937, 148597, 138827, 122207, 116742, 124280, 122247, 118974, 120400, 116805, 115658, 115309, 105790, 111698, 117097, 127790, 142087, 149867, 152388, 155471, 161787, 177312, 182606, 186859, 206068, 219266, 227400, 241541, 269987, 290722, 323783, 360601, 383563, 410334, 439693, 477294, 483614, 472539, 461229, 437061, 393706, 355066, 328575, 293994, 276097, 250225, 233767, 229365, 227864, 219059, 226850, 227869, 212689, 206143, 201506, 209286, 210612, 212541, 218752, 223888, 235849, 252781, 252368, 248732, 243310]
12972B43310r302j9441q097l393J1789J6519p766k1223j2390k702o930Q745J6197
12959B05316M953q468P845Q087n213k3132Q355K6349J4024J4495O983k714k089
12946B54791L388r439j6909q227j6013k9596m0198n6465p0665n8672l7988l2673
12934a18666l4899k5541N168K1742K7051M6665N1172M8079L5331K5576L8120K0866
12922A40664J5414J1234J4491p767k094q614K264K627N73M125J720j761L360M129
12908A80365j3542l339J0110J3433N632o978j728n855p175J08J0288J1989J0951
12895B04259O462M721M753J6991K2504O340M477j726K125K1157J0310J5564j412
12882C16525l023R146K2724J6885L3525L9916L1361L0990K2686N301q769o898
$$ y = [243310, 234008, 214567, 206470, 203077, 214866, 231385, 223619, 202396, 190006, 187304, 180374, 189119, 205316, 210269, 201801, 209646, 217733, 212520, 189388, 197743, 224092, 238116, 252611, 259594, 256880, 254791, 258179, 248740, 231831, 223604, 207591, 177995, 137797, 81332, 10667, -48005, -85993, -118666, -153565, -179106, -173938, -152196, -125145, -78480, -27308, 20771, 56102, 81678, 119798, 140664, 156078, 167312, 181803, 174036, 171942, 163328, 165592, 168219, 168792, 172917, 174637, 172876, 176236, 180365, 166823, 163484, 173594, 187027, 192659, 185681, 183953, 178098, 170923, 171031, 181319, 193308, 204259, 210721, 215442, 220195, 237186, 259690, 266030, 270507, 268781, 270906, 292063, 302373, 317937, 316525, 313502, 322648, 345372, 362257, 395782, 435698, 467059, 498049, 520735, 526036, 517267, 510369]
12870E10369j811j6903l8065k6744k897o533n132M10L899n49Q9Q97j7740p871
12856C91419n457M917k527J2521J0701q155j4548J1867J5237K1535J6222R656
12844D63388K2263J9771L3376J5205J4833J3556J6653J4913n757J9350J6673O450
12832F50674l950M102K1740r96k830K21K751K3970K5182J5058K4101L8695K5833
12819H24551J8530M0939M7425M9021M0511L0252M9384L3443L0713K9729K4249
12808A218747K1826K3871L0582K8274J0872P926J2729L6202M8722L7352K9974
12797A507077L1054L4591N6149Q0377Q5720Q3689R7591J13483J19415J44794J39699
12786B493639J45383J65193J68374J72663J52910J65218J99636K17304K56365
$$ y = [510369, 508558, 491655, 453590, 426846, 423949, 417416, 412284, 412694, 416593, 416044, 416133, 417030, 399290, 391419, 385962, 390879, 388352, 400873, 411574, 403419, 388871, 400738, 415975, 437510, 453732, 463388, 485651, 505422, 538798, 554003, 568836, 582392, 599045, 613958, 608201, 627551, 644224, 650674, 646724, 650826, 672566, 671570, 668740, 668961, 671712, 695682, 720864, 735922, 760023, 798718, 824551, 843081, 884020, 931445, 980466, 1020977, 1051229, 1100613, 1134056, 1164769, 1194498, 1218747, 1240573, 1264444, 1295026, 1323300, 1334172, 1342098, 1354827, 1391029, 1439751, 1477103, 1507077, 1538131, 1572722, 1628871, 1709248, 1794968, 1878657, 1976248, 2089731, 2209146, 2353940, 2493639, 2639022, 2804215, 2972589, 3145252, 3298162, 3463380, 3663016, 3880320, 4136685]
12777D136685K99713L61250M38017N55725P10460Q79575J093116J307412J506310
12768A1288263J643122J729017J767590J760756J726622J735104J789356J996296
12760B5436126K442660L245609M594547O688170R878993J4295473J9736237K5599146
12752A11916961L0922023L3889166L2939065K7988060J9042956P219424n630632
12745B58287023j7299897k6423693l1963585l3743872l1736299k6439892j9822842
12738G0856943j3872532r582692o753583m982630l892338l203243k792470k531236
12730B3246219k286523k067923j826046j549966j270219j003474p71767o05517
12722A1864784n00902m40106m28317m32251m76839n18974n52388n60372n40265
$$ y = [4136685, 4436398, 4797648, 5235665, 5791390, 6501850, 7381425, 8474541, 9781953, 11288263, 12931385, 14660402, 16427992, 18188748, 19915370, 21650474, 23439830, 25436126, 27878786, 31124395, 35718942, 42407112, 52286105, 66581578, 86317815, 111916961, 142838984, 176728150, 209667215, 237655275, 256698231, 263917655, 258287023, 240987126, 214563433, 182599848, 148855976, 117119677, 90679785, 70856943, 56984411, 47401719, 40648136, 35665506, 31773168, 28569925, 25777455, 23246219, 20959696, 18891773, 17065727, 15515761, 14245542, 13242068, 12470301, 11864784, 11363882, 10923776, 10495459, 10063208, 9586369, 9067395, 8515007, 7954635, 7414370]
12713G414370m73946m22130l40765k50222j53940r0997l4741k555r966k5683o5785
12702E543640j27696j59259j64960j77666j65932j52379j75682j99851k33400
12693C986815k41875k07780k35495k43097k11233j73915j50796j27686j34715
12684B260223j01523p6916q2907p7206p3128n0525l4720l7499k7987m3308m0952
12673A613552m2499l7467j1435j2033k9173l8552l3555k6708n2638o2395m6233
12662A220864l0490l4849n1884m6878l1855l3373k5921j9825j9331j0498k4199
12651H91761j5504N215J7912J8759K0031L313j9556l9541n5668m3904l7456l1413
12639G13949l3397j9385j3561l436k1717k1134j9700j56J4075J555K690L858R202
$$ y = [7414370, 6940424, 6518294, 6177529, 5927307, 5773367, 5682370, 5647629, 5645074, 5635108, 5609425, 5543640, 5415944, 5256685, 5091725, 4914059, 4748127, 4595748, 4420066, 4220215, 3986815, 3744940, 3537160, 3301665, 3058568, 2847335, 2673420, 2522624, 2394938, 2260223, 2158700, 2081784, 1998877, 1921671, 1848543, 1798018, 1763298, 1725799, 1697812, 1654504, 1613552, 1571053, 1533586, 1522151, 1510118, 1480945, 1442393, 1408838, 1382130, 1329492, 1267097, 1220864, 1190374, 1155525, 1103641, 1056763, 1024908, 991535, 965614, 945789, 926458, 915960, 891761, 876257, 881472, 899384, 918143, 938174, 941487, 921931, 882390, 826722, 782818, 745362, 713949, 680552, 661167, 647606, 644170, 622453, 601319, 581619, 581463, 595538, 597093, 599783, 603641, 612843]
12626F12843J7756J8451J8894J3400K8238J8665L80J724q643l7186l5438j1081
12614F38003M799l860k568J465L508k1735k8225l3531m2831l2586m2596l8392
12602D01451j5766n942j020J0484J0362M06R853J405o97p816l892r953j9955q207
12588C60713j1528j1461p331k044m190M539m873q822j203J638R439J1809K0065
12575C56751K0796K2843J6766r792l1423k7234M689J1311L8724L7937L8972L7237
12563E17577K7639Q946O830j1496k2784k6539l9700n8591o1146o3939m5028m3188
12551A88581k8128j384J5048J0684J406J7441N11j1395o828m29k093n303j4068
12538A64043p466j2486K749o648o348J2572J1786K087J094o56K023p726q33m743
$$ y = [612843, 630599, 649050, 667944, 681344, 709582, 728247, 728627, 730351, 721708, 684522, 649084, 638003, 642802, 638942, 636374, 637839, 641347, 619612, 591387, 557856, 515025, 482439, 439843, 401451, 385685, 379743, 378723, 389207, 399569, 399975, 409828, 411233, 410536, 402720, 398828, 388875, 368920, 360713, 349185, 337724, 330393, 328349, 324159, 328698, 323825, 315003, 313800, 315438, 324877, 336686, 356751, 377547, 400390, 417156, 407364, 375941, 348707, 353396, 364707, 403431, 441368, 480340, 517577, 545216, 554162, 560992, 549496, 526712, 500173, 460473, 401882, 340736, 276797, 231769, 188581, 160453, 159069, 174117, 184801, 186207, 203648, 204159, 192764, 185936, 185507, 183414, 178111, 164043, 156577, 144091, 146840, 140192, 133844, 146416, 158202, 160289, 161383, 160727, 162750, 155024, 154191, 149448]
12524A49448L508J6770r661N762O923k906j8859K050J6997k543J1034J7779J8540
12511B14842K5202M2845M7933N5316N9158N3258K7723K35k5485p7853o2430l3644
12499C27100k8844k2558l2347k7013k8114j1973n455l752J988M951K347j5753
12487A60577n609N675l753p194R998K937j0670J1317R806j5795J501l110j3647
12474A42033p721P554J5523K1509L162P446J3506O804L836M378J999K251j453
12461B20827j7094k9785k1649k8647k1657o608L962k287O412J1935j1956j8799
12449H4654r975K357R691O740q108M766K4181K8974J6546J6281K682J7531K2954
12436B19274J6264Q410q87R19j6155r198p398j8832k0015p925k308k995j9760
$$ y = [149448, 152956, 169726, 160065, 165827, 172750, 169844, 150985, 153035, 170032, 167489, 178523, 196302, 214842, 240044, 282889, 330822, 386138, 445296, 498554, 526277, 526512, 501027, 423174, 360744, 327100, 298256, 275698, 243351, 216338, 188224, 176251, 170796, 167044, 169032, 173983, 176330, 160577, 154968, 160643, 156890, 149696, 159694, 162631, 151961, 163278, 173084, 157289, 158790, 155680, 142033, 134312, 141866, 157389, 178898, 182060, 189506, 203012, 209816, 213652, 218030, 220029, 222280, 220827, 203733, 173948, 152299, 123652, 101995, 95387, 99349, 97062, 103474, 115409, 103453, 84654, 74679, 77036, 86727, 93467, 85359, 90125, 114306, 143280, 159826, 176107, 178789, 196320, 219274, 235538, 243948, 243061, 243980, 227825, 218627, 211229, 192397, 172382, 164457, 162149, 159154, 139394]
12423A39394m234N42P882j752p405P452q728j2342q645J523O694L152n334J5587
12409A33786J858M737p6j0591j747J633q702n303J0924J9547R086Q319P698O424
12395A77593p093k864j3549m89l837n140J3704Q44J5921K1725Q125l677j7912
12382A83351n489J3570K4895J9670L1897M6673N5519M2805J791j3089j5492m0277
12370C45824m7825l3241k4324n190J989m515k770l55M457J7153J3737J9165O663
12357B90768q048L895K2332L1786R325O973P789K915J231J1050N28q548J1750
12344C83746L8389N0342P6247J01304Q9598R4834O3885K6868l1710p1972p2422
12333G49109p1338o3441n9368l1218K422m540O512L1285N5219O1537N4968P6964
$$ y = [139394, 135160, 135702, 143584, 141832, 134427, 141879, 133151, 120809, 112164, 113687, 120381, 123533, 118199, 133786, 135644, 140381, 140305, 129714, 127967, 129600, 120898, 115595, 126519, 146066, 155152, 163471, 171169, 177593, 170500, 167636, 154087, 153598, 149761, 144621, 158325, 159169, 175090, 196815, 204940, 201263, 183351, 177862, 191432, 216327, 235997, 267894, 314567, 370086, 412891, 414682, 401593, 386101, 345824, 297999, 264758, 240434, 235244, 237233, 232718, 229948, 229593, 234050, 251203, 264940, 284105, 290768, 282720, 286615, 308947, 340733, 350058, 357031, 364820, 367735, 368966, 380016, 380544, 371996, 383746, 422135, 472477, 548724, 650028, 739626, 834460, 898345, 925213, 893503, 821531, 749109, 677771, 614330, 554962, 523744, 526166, 521626, 528138, 559423, 614642, 676179, 731147, 808111]
12321H08111J07137J36120J51978J57475J51436J14361N6862j2615p1554j12869
12311A486442j46347j71265j47921j34841j10528o8192n5256j6600p914p101j2768
12300F07709l1549m6781n6171o4301o2019m7971l0051j3897k0522k3680k6474
12289A84293k3162L53N803m105q712k74P229P368J6803j947o801O27m628O486
12275A79333N301K312Q824j646JK984k042k558k40o719N571R269l91r425O129
12260A96703L392n142j4688q802r194r958m153J3683K6001J5022L085j0915J2289
12247B07323M526j8541k3994k9454j0607n123q279J447p203O129O481k832j0317
12234A09556O070O983J0435N895j3197M309L874p914j0167R418L395k172p337
$$ y = [808111, 915248, 1051368, 1203346, 1360821, 1512257, 1626618, 1683480, 1670865, 1599311, 1486442, 1340095, 1168830, 1020909, 886068, 775540, 707348, 652092, 635492, 627578, 620477, 607709, 576160, 529379, 473208, 408907, 346888, 298917, 268866, 254969, 234447, 210767, 184293, 161131, 161484, 167287, 163182, 154470, 154196, 161425, 168793, 185596, 183649, 176848, 177475, 172847, 179333, 184634, 186946, 195770, 194124, 194125, 197109, 195067, 192509, 192269, 185550, 191121, 200390, 199999, 190574, 196703, 200095, 194953, 180265, 171463, 162269, 152311, 148158, 161841, 187842, 202864, 205949, 195034, 207323, 211849, 193308, 169314, 139860, 129253, 124130, 115851, 117298, 110095, 116224, 122705, 119873, 109556, 115626, 122609, 133044, 138939, 125742, 130051, 133925, 126011, 115844, 125262, 128657, 126485, 119148]
12221A19148m56o165O731l037K0193K4791m946K672Q207p055N167o253k0583j2225
12207A26189j7271m942M109j0411M113K0396K0M472O268j3067q339L87N313O957
12193A24194m135N231J0785N938J468L987j751M668r309m466q423k1805m706r780
12179I1896p725J0690Q888L335m886r939j485J254r127O995J6838j298j3787m456
12165H7193J0191m212J7646J0215n709K022M548J0375M655j5111p773l808j8463
12152I1769J841K0444Q917R36L593p544r828J3237K785k2413q369n068L23L272
12138I3895J8323j824o729l4j3982k310Q032l52L577n328j239J0697M965Q977
12124A16668M125n77J429R730J4297J1606J0327J2532K107n372n56j2991K81R155
$$ y = [119148, 118692, 112527, 119258, 116221, 136414, 161205, 156259, 158931, 167138, 160083, 165250, 158997, 138414, 126189, 108918, 103976, 108085, 97674, 101787, 122183, 122203, 126675, 132943, 119876, 111537, 111924, 117237, 124194, 120059, 125290, 136075, 142013, 143481, 147468, 145717, 150385, 141076, 136610, 128187, 106382, 101676, 91896, 84171, 94861, 103749, 107084, 102198, 92259, 90774, 92028, 82901, 89896, 106734, 105436, 91649, 87193, 97384, 93172, 110818, 121033, 115324, 117346, 121894, 132269, 136924, 121813, 114040, 110232, 91769, 93610, 114054, 122971, 123907, 127500, 119956, 110128, 123365, 126150, 103737, 95368, 90300, 90623, 93895, 112218, 110394, 103665, 103631, 89649, 87339, 95371, 95019, 98596, 93268, 92029, 102726, 107691, 116668, 120793, 120216, 121645, 131375, 145672, 157278, 167605, 180137, 182244, 176872, 176316, 163325, 163606, 172761]
12110A72761P512K872J0768J6959O131Q071L6882M3159L3422J6776L1812K3233
12098D10358P837M912r071k0409j3722k1001k7037j0821m335l631k545K1019K6950
12085C58504J0396R588J0185J1521l486n647K4259K8681J7692L2397M5637M7239
12073E86966L9475M7514M0002M1262K9262N275l0888n8397n7435n9636o4555n3826
12061D65019l6518l1756j6294j816q059o394l865N121K4260K4614J2248k763J9514
12048D43311J684j6348J52K0994J2449J0278J4801M1489N0361N4278O3159N5297
12036G51905N1469M9102N7925K2292k765p497j0491n1009o7530o4776o3091p3261
12024E92273p9751p0207m6454m1334l2584k1637j1881j199p359k4036k4666j1196
$$ y = [172761, 180273, 183145, 193913, 210872, 217003, 225074, 261956, 305115, 338537, 355313, 387125, 410358, 418195, 423107, 414036, 393627, 379905, 358904, 331867, 321046, 316711, 313080, 310535, 331554, 358504, 368900, 378488, 388673, 400194, 396708, 391061, 415320, 444001, 461693, 494090, 539727, 586966, 626441, 673955, 713957, 755219, 784481, 789756, 758868, 700471, 643036, 583400, 518845, 465019, 428501, 396745, 380451, 378635, 370576, 364182, 360317, 365438, 389698, 414312, 426560, 423797, 443311, 444995, 428647, 428799, 449793, 462242, 472520, 487321, 528810, 579171, 633449, 696608, 751905, 803374, 852476, 910401, 932693, 929928, 922431, 911940, 860931, 793401, 728625, 665534, 592273, 512522, 442315, 395861, 354527, 321943, 300306, 288425, 287226, 279867, 255831, 231165, 219969]
12012B19969l422r88j3071J0519J6884n861l645P79L300J470O613J5674M350R93
11998B53564M771J8999L2453L8545M8624M4596J7558J2531N357j9178j4381k7141
11986D16298l9213k8594k8815l6289k6462k3584k1992N41q379j1723j7853N980
11974A79915J8630O572l072j5901p062j7664k1640K119P044J1557K903L268o737
11961A59932j8085J463J9452N094O810Q768R007Q455M694Q162N666M177R272J3721
11947B46588p967j6392M542J1710J6607N846J589P074J44J1264J5427N893P590
11934C09915K92q553J365n334j34q672k4303n051K784O634r382Q433J6055J8537
11920C02586J3831J4821J7988J2265o361r108J1901K6374J1396l755M854K2540
$$ y = [219969, 216547, 215559, 202488, 213007, 229891, 224030, 220385, 221164, 224464, 225934, 232547, 248221, 252571, 253564, 258335, 277334, 309787, 348332, 396956, 441552, 459110, 471641, 476998, 457820, 443439, 416298, 377085, 348491, 319676, 283387, 256925, 233341, 211349, 211890, 203511, 191788, 173935, 179915, 198545, 205117, 202045, 186144, 179082, 161418, 139778, 141897, 148941, 160498, 163401, 166669, 159932, 141847, 143310, 162762, 167856, 174666, 183434, 192441, 200896, 205590, 213752, 219418, 223595, 232867, 246588, 238621, 222229, 226771, 238481, 255088, 260934, 262523, 269597, 269741, 281005, 296432, 302325, 309915, 310207, 301654, 303019, 297685, 297551, 288879, 264576, 259525, 262309, 268943, 259561, 267994, 284049, 302586, 316417, 331238, 349226, 361491, 355130, 346022, 357923, 384297, 395693, 391938, 396792, 419332]
11908D19332J4065J6379K7546R545N753K96M907j0317o106L934r833l5941j4529
11895D25031k994N090n473m40k584J1172J0037k127R741O816J0687J332O742k205
11881D70825q192J1826Q103r612Q343K1097J3800j1604m194J4297n486k491j0296
11868D96416q481m04J6193J2663J5038R030j1297j535q359j1532j8606k6110O81
11855D63697o019j0630j0018O781O363P395J8687J5842r756m825j3180j9449j3251
11842D31637j0076k2339j0393j2757k5597j0584m747L847L681K3357L6159L7040
11830D39228L0182L7990M1601M2055L4288K1173J9221K1721J5292Q675j0217j5881
11818F85328k0901l1796m1414k5742j3057j0824k3065K828P388j6476j2631j9273
$$ y = [419332, 433397, 449776, 477322, 486867, 492620, 492916, 497823, 487506, 481400, 485334, 475501, 439560, 425031, 422037, 427127, 421654, 421214, 418630, 429802, 439839, 437712, 447453, 454269, 464956, 466288, 473030, 470825, 462633, 474459, 482562, 472950, 481293, 502390, 516190, 504586, 500392, 514689, 509203, 506712, 496416, 487935, 487531, 503724, 516387, 531425, 540455, 529158, 527623, 519264, 507732, 489126, 463016, 463697, 457678, 447048, 437030, 443811, 450174, 457569, 476256, 492098, 482342, 477517, 464337, 444888, 431637, 421561, 399222, 388829, 376072, 350475, 339891, 335144, 338991, 342672, 366029, 402188, 439228, 469410, 507400, 549001, 591056, 625344, 646517, 665738, 687459, 702751, 711426, 701209, 685328, 664427, 632631, 591217, 565475, 552418, 541594, 518529, 521357, 528745, 512269, 499638, 480365]
11806D80365j1880j2954k2238j9210o563n530N974L423n009J9282K6128J1154
11794D62942K1289K4360K5906J5867J5433K9885J606k57N523J879l817o668J5759
11781F09707J5473M965J5328k73J8251K5594J1592P845o012k324j3057j4051L220
11768F76258P537R850N178k022J1878R635o03k057M605J1715L113J0744J3970
11755G59801k721L787J4368J2104J2156K1072K0595K7268J8699L6395L2092K0538
11743I76154K1119K1413K2856K4503J9440J8384J7641K0643N464m062J6841J5332
11731A175728k803L512O781K1180K5944K6974L3203L2100L6109O1899O3724O1118
11719A545469N8471N5260P1773O7975N6701P2972Q3679O8518P9902Q4310R0252
$$ y = [480365, 468485, 455531, 433293, 414083, 407520, 401990, 407964, 411387, 406378, 425660, 451788, 462942, 484231, 508591, 534497, 550364, 565797, 595682, 597288, 597031, 602554, 604433, 600616, 593948, 609707, 625180, 630145, 645473, 645200, 663451, 689045, 700637, 708482, 702470, 700146, 687089, 673038, 676258, 683795, 693645, 698823, 696801, 708679, 718314, 717711, 715654, 720259, 731974, 735087, 745831, 759801, 757080, 760867, 775235, 787339, 799495, 820567, 841162, 868430, 887129, 923524, 955616, 976154, 997273, 1018686, 1041542, 1066045, 1085485, 1103869, 1121510, 1142153, 1147617, 1143555, 1160396, 1175728, 1172925, 1176437, 1183218, 1204398, 1230342, 1257316, 1290519, 1322619, 1358728, 1420627, 1484351, 1545469, 1603940, 1659200, 1730973, 1798948, 1855649, 1928621, 2012300, 2080818, 2160720, 2245030, 2335282]
11708B335282J32645J47216J60023J80622K01895K31121K60710K82811L09662
11699D241987L58855M07452M96783N64609O79573Q52659J064171J352281J758067
11690A1776437K332926L101823M115917N265956O329990P068899P185315O394643
11682E3571906M732196K479195o3762k459684m247628n160586n226018m440745
11674C9184874k951065j237693K63766J318051J855952J978071J678672J014391
11666D3105019K85014l13918q67423j305125j259527o94722K01279J449888L042638
11657D3643123M917444P023513R245670J1374826J2980026J3424715J2073161
11650A14682478Q582912L373668k630598q321485j2318588j3796238j3170766
$$ y = [2335282, 2467927, 2615143, 2775166, 2955788, 3157683, 3388804, 3649514, 3932325, 4241987, 4600842, 5008294, 5505077, 6069686, 6749259, 7601918, 8666089, 10018370, 11776437, 14109363, 17211186, 21327103, 26593059, 32923049, 39991948, 47177263, 53571906, 58304102, 60783297, 60719535, 58259851, 54012223, 48851637, 43625619, 39184874, 36233809, 34996116, 35259882, 36577933, 38433885, 40411956, 42090628, 43105019, 43390033, 43076115, 42208692, 40903567, 39644040, 38949318, 39150597, 40600485, 43643123, 48560567, 55584080, 64829750, 76204576, 89184602, 102609317, 114682478, 123265390, 126639058, 124008460, 115686975, 103368387, 89572149, 76401383]
11643G6401383j1303258q759589o063810l585586j520594J05237J270942J972549
11635D8517274K141829J986419J538571P54276p090m58740o50391n05013K11366
11626E3528501J520421L179014M869894O340980P302442P436031O727577N605329
11618I6510189M327421L175840K620216K950259L891785M922353N419356M663412
11610A28480831K345522j097237m929275q598467j1469388j2951005j3074568
11603G8706413j2182849j0638827q803298o985226n400605m115247l109752k360913
11595B5109696j790616j340316j079339r14199q03933p80545p77335p53869o75983
11586A6193561n53676m09236k33463l8197J99151M80837Q71606J446033K226287
$$ y = [76401383, 65098125, 56338536, 50274726, 46689140, 45168546, 45273783, 46544725, 48517274, 50659103, 52645522, 54184093, 54938369, 54931279, 54472539, 53822148, 53317135, 53528501, 55048922, 58227936, 63097830, 69438810, 76741252, 84177283, 90904860, 96510189, 100837610, 104013450, 106633666, 109583925, 113475710, 118398063, 123817419, 128480831, 130826353, 129729116, 124799841, 116201374, 104731986, 91780981, 78706413, 66523564, 55884737, 47081439, 40096213, 34695608, 30580361, 27470609, 25109696, 23319080, 21978764, 20899425, 19985226, 19181293, 18400748, 17623413, 16869544, 16193561, 15639885, 15230649, 14997186, 14958989, 15158140, 15638977, 16510583, 17956616, 20182903]
11577B0182903L300582M699182O279096P710409Q667766Q765678P449851M767786
11569G1823253J351972k398898o011837q460372r341140r007694p796633o116126
11561B4042525m480874l197322k279390j663796j276320j013069q05746o65605
11553H660403n98316n51476n14312m82845m44266m14108l71494l33337k90661
11544D659588k49858k20866j89331j75879j60586j42787j42140j16899j39382
11535C121860j39551j09563r5985q7350p7805p5726o4445n6077n0504n5650m5448
11524B263756n7611o1065m9047p0759p1803n7357l7588m8785o6623n5752m4260
11513A643106n0888k5936l6970l5080l4440k4284l3482l5639m5859k5683k2645
$$ y = [20182903, 23483485, 28182667, 34461763, 42172172, 50839938, 59605616, 67055467, 71823253, 73175225, 70776327, 64764490, 56304118, 46962978, 37955284, 30158651, 24042525, 19561651, 16364329, 14084939, 12421143, 11144823, 10131754, 9326008, 8660403, 8062087, 7510611, 6996299, 6513454, 6069188, 5655080, 5283586, 4950249, 4659588, 4409730, 4188864, 3999533, 3823654, 3663068, 3520281, 3378141, 3261242, 3121860, 2982309, 2872746, 2776761, 2689411, 2611606, 2535880, 2471435, 2415358, 2364854, 2309204, 2263756, 2206145, 2145080, 2096033, 2025274, 1953471, 1896114, 1858526, 1809741, 1743118, 1687366, 1643106, 1592218, 1566282, 1529312, 1494232, 1459792, 1435508, 1402026, 1366387, 1320528, 1294845, 1272200]
11502A272200j1007j6652k8386k0634q614N994L234n963J0142r174j033J424M480
11489A196011K1422K8248L6867N0345L5446M1189K0752j8739m1215o2429q5714
11478A222183p4682p0725p0717q2564o0823l0972k6583k3288j9774m141p899R19
11466G50934q040O566J1344j913o790j7738k6335l0556j4652j6130j1769j7150
11454F17771L65O884M248O603N200J161k3871k7295p959l932j4168j5412p219
11441E42376j5409j9626n688q095Q773p152n695L827Q679n693p471k942j089j478
11427D83317k313K332j4866q477o58j036r756j6833j226k557J3217K2906M6415
11414E10465M4084N7800O7374O2514M1922K7683Q99l0052o1425p0516q1981p4522
$$ y = [1272200, 1261193, 1244541, 1216155, 1195521, 1186907, 1192901, 1196135, 1190172, 1200314, 1191140, 1190107, 1191531, 1196011, 1217433, 1245681, 1282548, 1332893, 1368339, 1409528, 1430280, 1411541, 1370326, 1307897, 1222183, 1147501, 1076776, 1006059, 923495, 862672, 831700, 805117, 781829, 762055, 757914, 750015, 750934, 742894, 749460, 760804, 758891, 752101, 734363, 708028, 677472, 662820, 646690, 634921, 617771, 618136, 625020, 629268, 635871, 641071, 642232, 618361, 591066, 583107, 579175, 565007, 549595, 542376, 526967, 507341, 501653, 493558, 502331, 495179, 489484, 493311, 501990, 496297, 488826, 485884, 484795, 483317, 481004, 483336, 468470, 459993, 459335, 458299, 448543, 431710, 430484, 427927, 441144, 464050, 510465, 554549, 612349, 679723, 742237, 784159, 811842, 812741, 782689, 721264, 650748, 568767, 494245]
11402D94245o4536n8482k4101j7374k3856r785m684j6594M271r08P897m00q73
11389B84820J9057k73M330K9012M2295L0815K2359O365J5268J4108K8884K1713
11377E18753J0771K7556L2857M4764M8123L3878K4277L029j7402l8774m3950m8606
11365E95276n7743l5820l6624l0075j9224l2677k8901k0106k4604k3991k3088
11354B62423K816J2054R469j05L557l273l668Q94O945o588j704R514Q602J9003
11340C19939K6293J7468K9868N1253N9658L7537L0641K4487J1048j5655k3923
11329E68614j8788j6781j7564j957J4161L2483K9700J5784J0592o220j7205k0328
11317E72491l0133l0181l5127k6598j2687j4619N114J3520J112J545R25o002k1050
$$ y = [494245, 429709, 371227, 347126, 329752, 305896, 296111, 291427, 274833, 279104, 278196, 286093, 285693, 284820, 303877, 303604, 307934, 336946, 379241, 410056, 432415, 438780, 454048, 468156, 497040, 518753, 529524, 557080, 589937, 634701, 682824, 716702, 740979, 744008, 726606, 687832, 643882, 595276, 537533, 501713, 465089, 435014, 415790, 383113, 354212, 334106, 309502, 285511, 262423, 265239, 277293, 286762, 286657, 290214, 286941, 283273, 284167, 291112, 284524, 282820, 292334, 300936, 319939, 346232, 363700, 393568, 444821, 504479, 542016, 572657, 597144, 608192, 592537, 568614, 549826, 533045, 515481, 513524, 527685, 560168, 589868, 605652, 616244, 610024, 592819, 572491, 542358, 512177, 477050, 450452, 437765, 423146, 428260, 441780, 442892, 444437, 445362, 439360, 418310]
11304D18310k1318k0222m75J4442J2253L1332J8620L845J2230K6579K9609K1845
11292E47050M365j922K467j5579j2156k175k1565k9194k9009k1540j1078m343
11280D05321j7354q998q256r449M834K4438Q678j530P181j3853j2952j897R404
11267C85567J1332K0313L8821M1626N6026P4672P4376N7689M0478J8673K53j0457
11255H09369l0852o0835o3169n1336k6226l4408j3737K014M007o487p911k737
11243E17692J182r002n586j1177j9297j9226J7878Q476P856K3779K5390L0553
11231E68518N550O244J426M184Q635J6373L8755L1374K7928R250m093J5776m39
11218G29481j6774j5606J804J0034j6395k0666J163J840l043j2639L200j878L448
$$ y = [418310, 396992, 376770, 376295, 390737, 402990, 434322, 452942, 456787, 469017, 495596, 525205, 547050, 551415, 549493, 551960, 536381, 524225, 522050, 500485, 471291, 442282, 420742, 409664, 405321, 387967, 378969, 370713, 361264, 366098, 390536, 399214, 397684, 404865, 391012, 378060, 376163, 385567, 396899, 417212, 456033, 497659, 553685, 628357, 702733, 760422, 800900, 819573, 819826, 809369, 778517, 717682, 654513, 603177, 576951, 542543, 528806, 530820, 534827, 528340, 520429, 517692, 518874, 509872, 504286, 493109, 473812, 454586, 472464, 480940, 488796, 512575, 537965, 568518, 574068, 580312, 581738, 585922, 594557, 610930, 649685, 681059, 708987, 718237, 714144, 729920, 729481, 712707, 697101, 698905, 708939, 692544, 671878, 673041, 674881, 671838, 659199, 662399, 660521, 663969]
11205F63969k735N829L3743L0947K1250K7535K0919Q301K431j8896k7745k2139
11193G43409k4007l0866k1969n807J1331J1055K5599M4132N9850N1572K0572N456
11181H90327j3516k9878m5888n3996n2836m3198l0509j2431n582M687J3626K5728
11169F46534J6759J700o297r350j3497k0451k4651l3652k9405r034j2712j4763
11157D91181J208R756Q370j0957j0808p138R95r574J7364K3318L9875L7051L5290
11144F25931L4945K0525L22m0o839j2525k4821j0144J1329K688J3733J8634N118
11131F78856o916K084J1682p096n025j8870k7668j7971k1579q079J1246P455r099
11118E89020L490P260n745j7858j8473j0966o757j522k7126j1151n36J683k560
$$ y = [663969, 661234, 667063, 700806, 731753, 753003, 780538, 801457, 809758, 812189, 793293, 765548, 743409, 719402, 688536, 666567, 660760, 672091, 683146, 708745, 752877, 812727, 864299, 884871, 890327, 876811, 846933, 801045, 747049, 694213, 651015, 620506, 608075, 602493, 607180, 620806, 646534, 663293, 664993, 658696, 649346, 635849, 615398, 590747, 557095, 527690, 518656, 505944, 491181, 492389, 502145, 510515, 499558, 488750, 481612, 482607, 473033, 490397, 513715, 553590, 590641, 625931, 660876, 681401, 681723, 681683, 674844, 662319, 637498, 627354, 638683, 641371, 655104, 673738, 678856, 671940, 674024, 685706, 678610, 673585, 654715, 627047, 609076, 587497, 579418, 590664, 598119, 589020, 592510, 599770, 594025, 576167, 557694, 546728, 539971, 538449, 511323, 500172, 499636, 501319, 498759]
11105D98759k2848m866J318m026j848k792m936R072n245Q186K2666K4148N563
11092E23151J1611J7727K0796J2007r311o560P997j935J052J968L849M655P505
11079E94512N996Q361k969j5742j4365J746J0576Q164n457k63n004K872J3344
11066F01771o339J057K8222K9502Q46J0463J7891J9914L5397K8177K3835K5357
11054H16093L7261M7833O8349Q3897R0795J03015P9626O2065L6614O051k3491
11043A408108n0644n2949m8785l7975j7004k1477N439O503K6167K1013M7672L6185
11031A322253K4781L5206O4086O8215P4958M9155O1014P8851Q1187Q6999J04696
11020B051401J27020J49386J62716K03823K35363K71301L02008L30478L53877
$$ y = [498759, 475911, 471045, 472363, 468337, 466489, 463697, 458761, 467833, 462588, 470774, 493440, 517588, 523151, 534762, 552489, 573285, 585292, 575981, 569421, 577418, 575483, 576535, 578503, 582352, 587007, 594512, 600508, 608869, 605900, 590158, 575793, 577539, 588115, 596279, 590822, 590559, 585555, 588427, 601771, 595432, 596489, 624711, 654213, 655059, 665522, 683413, 703327, 738724, 766901, 790736, 816093, 853354, 901187, 969536, 1053433, 1144228, 1247243, 1326869, 1388934, 1425548, 1431599, 1408108, 1357464, 1304515, 1255730, 1217755, 1200751, 1179274, 1184713, 1191216, 1217383, 1238396, 1286068, 1322253, 1347034, 1382240, 1446326, 1514541, 1589499, 1638654, 1699668, 1778519, 1859706, 1946705, 2051401, 2178421, 2327807, 2490523, 2694346, 2929709, 3201010, 3503018, 3833496, 4187373]
11011D187373L66096L71026L70542L67292M29830N41538P07561R56963J306728
11002I604949J783544K460201L453013M787436O343482P754140Q571370Q409023
10994E3167158O917543M110039N39757l023912n850485p585460q110301p414862
10986C2749477n866088m145427k665656j539300p39496j86497J85543L33346L22911
10977A8448813K17343L2616j61764k65260k27557J1469M31111J062407J862309
10968B1411487K807901L795468M677050N326249N676037N730353N571909N367017
10960F0363471N259031N164672M644655L471695J651070o04738k856149m484226
10952G2609481n171294m996981m309504l566498l220837l359010l801908m272653
$$ y = [4187373, 4553469, 4924495, 5295037, 5662329, 6092159, 6633697, 7341258, 8298221, 9604949, 11388493, 13848694, 17301707, 22089143, 28432625, 36186765, 44758135, 53167158, 60084701, 64194740, 64734497, 61710585, 55860100, 48274640, 40164339, 32749477, 26883389, 22737962, 20072306, 18533006, 17793510, 17607013, 17792556, 18125902, 18448813, 18666156, 18698772, 18537008, 18271748, 18044191, 18055660, 18486771, 19549178, 21411487, 24219388, 28014856, 32691906, 38018155, 43694192, 49424545, 54996454, 60363471, 65622502, 70787174, 75431829, 78903524, 80554594, 79949856, 77093707, 72609481, 67438187, 62441206, 58131702, 54565204, 51344367, 47985357, 44183449, 39910796]
10944C9910796m462456m241403l628408k807538j980383j178144n03198K9648
10936B1138914L85935N87852O04790M62687K45595M6802J8281J94178O02880J327608
10926B5615522K424051L883051N699614P676869R423501J0468207J0413927Q956096
10918H4560838O256296K985063P5467j669540k123831j509591l93451L01045j70072
10909H8312224j821436l969662n856615o974571p211370o553354m972622k870398
10901D8082196q83088N88184J368204J405467Q10016j91360j334753k406398l288265
10892D4150203l688357l480976k883226k072551j059971R6712J263995K423171
10884C4749000L542337M535031N251187N468892M957597L678905J758968n01692
$$ y = [39910796, 35448340, 31206937, 27578529, 24770991, 22790608, 21612464, 21109266, 21138914, 21524849, 22112701, 22717491, 23180178, 23425773, 23472575, 23490856, 23685034, 24287914, 25615522, 28039573, 31922624, 37622238, 45299107, 54722608, 65190815, 75604742, 84560838, 90817134, 93802197, 93877664, 92208124, 90084293, 88574702, 88181251, 88482296, 88312224, 86490788, 82521126, 76664511, 69689940, 62478570, 55925216, 50952594, 48082196, 47199108, 47787292, 49155496, 50560963, 51370979, 51179619, 49844866, 47438468, 44150203, 40461846, 36980870, 34097644, 32025093, 30965122, 31061834, 32325829, 34749000, 38291337, 42826368, 48077555, 53546447, 58504044, 62182949, 63941917, 63440225]
10876F3440225k698914m373190n220273n247857m668224l755495k661352j463952
10868C3350968k62980Q43796J803077K475336K586006K101204J267077K05074
10860D4369558j030442j939855k199725j981597j393500l92928J052758K763643
10852C9247912M352140N359842N500390M682064K840735L01731k277145m438701
10844E5568968o027048o957781p045430o286355n073285l875272k898338k188505
10836A5216954j672972j282666r80444p21926m97809l00156j69742j90276k84408
10827I116555m67329o80245p83410p30546n93765m79926l97748l34122k74581
10818D374883k31574k00350j73831j65584j57872j33991r9242r9722q2720p4937
$$ y = [63440225, 60741311, 56368121, 51147848, 45899991, 41231767, 37476272, 34814920, 33350968, 33087988, 33931784, 35734861, 38210197, 40796203, 42897407, 44164484, 44369558, 43339116, 41399261, 39199536, 37217939, 35824439, 35431511, 36484269, 39247912, 43600052, 48959894, 54460284, 59142348, 61983083, 62284814, 60007669, 55568968, 49541920, 42584139, 35538709, 29252354, 24179069, 20303797, 17405459, 15216954, 13543982, 12261316, 11280872, 10558946, 10061137, 9760981, 9591239, 9400963, 9116555, 8649226, 7968981, 7185571, 6455025, 5861260, 5381334, 4983586, 4649464, 4374883, 4143309, 3942959, 3769128, 3603544, 3445672, 3311681, 3212439, 3112717, 3029997, 2955060]
10808B955060o9937p3128n7860o8830m7524m6868l8534n1132l8126J902L7165
10797B502188J00911J53768J83747J66961J05605r188j53918k72948k95100k51151
10787B230875j72781j17648p3356m5190m3156l4947l9886m7639n8726p1430o5016
10776A461100m0183k8500k2934k2170m4374m4598m0063l5901l3026m0363l2044
10765A076944l5334l9699l0363k5221k5529k2137k610j5644k8208o759K469K7010
10753H74919K6250L0603J6266n948k6166m9339o0279l4716k6227k7307k5060j6123
10741F76873k4295k8671k3597j5621R535n299k342N771n919k6770j0190m570k0691
10728E24214j3370j5482j9298l1990j6235j1644j1952Q93J2874K0432N6067M6649
$$ y = [2955060, 2885123, 2811995, 2754135, 2685305, 2637781, 2590913, 2552379, 2501247, 2463121, 2465023, 2502188, 2603099, 2756867, 2940614, 3107575, 3213180, 3203992, 3050074, 2777126, 2482026, 2230875, 2058094, 1940446, 1867090, 1821900, 1778744, 1743797, 1703911, 1656272, 1597546, 1526116, 1461100, 1420917, 1392417, 1369483, 1347313, 1302939, 1258341, 1218278, 1182377, 1149351, 1108988, 1076944, 1041610, 1001911, 971548, 946327, 920798, 898661, 896051, 880407, 852199, 845440, 847909, 874919, 901169, 931772, 948038, 942090, 915924, 866585, 806306, 771590, 745363, 718056, 692996, 676873, 652578, 623907, 600310, 584689, 594224, 588925, 586583, 592354, 586435, 559665, 549475, 544905, 524214, 510844, 495362, 476064, 444074, 427839, 416195, 404243, 405136, 418010, 438442, 494509, 541158]
10716E41158R825J7007J7917k457J6096L2024L0793K6324J3795J8413M693l3185
10704F92403k7535n5608o5746n4398k1037q192M245R940J661m050j2323n265k0086
10691D34009k2006k0395p963n320J324P835R893Q523K056L091L366K0868J5372
10678D50653j065j403J7353m102K658L39J9421N0763M5602M1727Q5573J15646
10666H23165J12309Q9188N6126Q833l1414p3879j01038j06542p1302p1070o9505
10655E64871o3490m7296j4471k4781k0542J185k684j813J5156R533J0886K5413
10643D51967m33j5497Q403r93j0239N985J468J5549R038j266p387K073r249q226
10629D41193o738k6742o008k196l4206j2429O853J2000K5226L0742L1978L4364
$$ y = [541158, 550983, 567990, 585907, 583450, 599546, 631570, 662363, 688687, 702482, 720895, 725588, 692403, 664868, 609260, 543514, 489116, 468079, 459887, 464132, 474072, 475733, 471683, 459360, 454095, 434009, 412003, 391608, 383645, 378325, 379649, 387484, 397377, 405900, 407956, 411047, 414413, 435281, 450653, 449588, 448185, 465538, 461436, 464094, 464433, 483854, 534617, 580219, 621946, 707519, 823165, 935474, 1024662, 1080788, 1089621, 1058207, 984328, 883290, 776748, 705446, 634376, 564871, 501381, 454085, 439614, 414833, 394291, 395476, 392792, 390979, 406135, 415668, 426554, 451967, 451534, 436037, 444440, 443447, 433208, 439193, 440661, 456210, 465248, 463982, 456595, 458668, 449419, 441193, 434455, 407713, 401705, 399509, 365303, 352874, 359727, 371727, 396953, 427695, 459673, 494037]
10617D94037N9096M5199M0651L3207K4754k459j6522j570j5182l8307m8187o6881
10605E07836o7953o8035r3098j08146j00018j16533j05126q1996p1716l3174L6218
10594c01741Q5369R3869Q9643P6999P4933N4736N1912M2070L6178K7659J2454
10583C44081R301K5456Q163J3332L4482L9234K6777K1819L4812P6376P0471L6483
10571G40787K3728K176j0804k2910m0597n5604n4848n4655n7665k3471k0628j9038
10559D06471M605K3941J8897K2805K0201O713R09j46J4826J5234m239K373M030
10546E36620J6619M2097M8132O2880P9255P2972Q5115J05033J00395R0971N5833
10535A295922K585q0460j20110j03430p4748m8008k4639j9148j7691n302l283
$$ y = [494037, 553133, 598332, 638983, 672190, 696944, 694485, 677963, 676393, 661211, 622904, 574717, 507836, 439883, 371848, 278750, 170604, 70586, -45947, -151073, -233069, -304785, -337959, -301741, -216372, -122503, -32860, 44139, 119072, 173808, 225720, 267790, 303968, 331627, 344081, 353382, 378838, 387001, 400333, 434815, 474049, 500826, 522645, 557457, 633833, 704304, 740787, 764515, 766691, 755887, 732977, 692380, 636776, 581928, 527273, 469608, 446137, 425509, 406471, 411076, 435017, 453914, 476719, 496920, 503633, 504542, 504396, 519222, 534456, 530217, 532590, 536620, 553239, 595336, 643468, 706348, 785603, 858575, 943690, 1048723, 1149118, 1240089, 1295922, 1298507, 1218047, 1097937, 994507, 919759, 871751, 847112, 827964, 810273, 804971, 801688]
10524H01688m072j6052j8738k2387j7927j2283j9273j1143k923m247K418k874
10512F72187J7833K9511L6478K1270J5140J7807L4616M2701O0362N3262N3600
10501A054767N5268P4240Q1564P8853O5829K1830N113J5780j0753j5443p894l06
10489A418848j4163k553J2948q016Q400L0469O5260J34541J79945J82673J49922
10478B158274R4080P851r2481r0774n9592k5971l707R187P610P663K4257L7475
10466B073872M7532O1451P4602J16353J63597J56624J43895J29606Q1246Q060
10456C056838J1087J6029N4766J02046J32923J55911J85967J96466J98030K14039
10446D324102K14762K06909K13904J79539J79390K18054K80520L78055M57288
$$ y = [801688, 797616, 781564, 762826, 740439, 722512, 710229, 690956, 679813, 676890, 672643, 675061, 672187, 690020, 719531, 756009, 777279, 792419, 810226, 844842, 887543, 947905, 1001167, 1054767, 1110035, 1184275, 1265839, 1344692, 1410521, 1432351, 1437464, 1453244, 1442491, 1427048, 1419154, 1418848, 1404685, 1402132, 1415080, 1407064, 1415464, 1445933, 1511193, 1645734, 1825679, 2008352, 2158274, 2252354, 2260205, 2167724, 2076950, 2017358, 1991387, 1987680, 1996867, 2004477, 2012140, 2036397, 2073872, 2121404, 2182855, 2257457, 2373810, 2537407, 2694031, 2837926, 2967532, 3048778, 3056838, 3067925, 3083954, 3138720, 3240766, 3373689, 3529600, 3715567, 3912033, 4110063, 4324102, 4538864, 4745773, 4959677, 5139216, 5318606, 5536660, 5817180, 6195235, 6652523]
10437F652523N85177O84114P77211Q94384J035645J235431J507527J820164K082095
10428A7274271K134115K104597K020714J929815K105443K847019M031526N545212
10420C9992712P583411J0519301J4989500K2120364L3636889N1398279P4030329
10413B54270785R0893393Q5637108N9120525K4364631k9132758q9595494j05573515
10406B89984675q2899945n5918509l6665745k4471650j6850621j1960453q619874
10399E2597878o252176m595381l464712k684489k236412k082435k123570k380529
10391B6778174k650763k586216k215186j820243j468192j151675r21501p80999
10383A3183399o91670o53346o28667o17582n93284n33322m73717m33735l88878
$$ y = [6652523, 7237700, 7921814, 8699025, 9593409, 10629054, 11864485, 13372012, 15192176, 17274271, 19408386, 21512983, 23533697, 25463512, 27568955, 30415974, 34447500, 39992712, 47576123, 58095424, 73084924, 95205288, 128842177, 180240456, 254270785, 345164178, 430801286, 489921811, 514286442, 485153684, 395558190, 289984675, 207084730, 151166221, 114500476, 90028826, 73178205, 61217752, 52597878, 46345702, 41750321, 38285609, 35601120, 33364708, 31282273, 29158703, 26778174, 24127411, 21541195, 19326009, 17505766, 16037574, 14885899, 13964398, 13183399, 12491729, 11838383, 11209716, 10592134, 9998850, 9465528, 8991811, 8558076, 8169198]
10374H169198l23868k87062k80006k38546j99464j83131j77810j76446j85440
10365F117425j92970j91091j98351j83804j93395j78803j78146j45353j23430
10356D532082j12056r1989q5268j05533j24155j70884k40748k44601k10960j74863
10346B971025j31623j14006r6347p8607o1169l7583m9166l6849k9435l5240l8671
10335B262329k5271l3409k1970n046n292k7150n8500q8299j07956j15912j01633
10324A671891o8889m1859l6798m0563m6094l5931j6768l0282L947L3120N3046
10313A444820P6960N6256K3980M244o2617j18142j02476p9671n7857m7712n3414
10302A084371n9114n2548l2665k7501j6142j2371j6154j3345o198Q996J2861M840
$$ y = [8169198, 7845330, 7558268, 7278262, 7039716, 6840252, 6657121, 6479311, 6302865, 6117425, 5924455, 5733364, 5535013, 5351209, 5157814, 4979011, 4800865, 4655512, 4532082, 4420026, 4328037, 4242769, 4137236, 4013081, 3842197, 3601449, 3356848, 3145888, 2971025, 2839402, 2725396, 2629049, 2550442, 2489273, 2451690, 2402524, 2365675, 2336240, 2301000, 2262329, 2237058, 2203649, 2181679, 2176633, 2171341, 2144191, 2085691, 1997392, 1889436, 1773524, 1671891, 1603002, 1561143, 1524345, 1483782, 1437688, 1401757, 1384989, 1354707, 1358654, 1391774, 1444820, 1521780, 1578036, 1602016, 1606260, 1543643, 1425501, 1323025, 1243354, 1185497, 1137785, 1084371, 1025257, 972709, 940044, 912543, 896401, 884030, 867876, 854531, 848333, 857329, 870190, 875030]
10290H75030J5560L1936M4963M7186M8426M6000L9140J9635j8230o9751j14109
10279I65786j02122o7419m7227l0104k3471k3548k8632k4156k2802j2227m017
10268E80061p594j2310p396q413j184n156N350L670K444K239k358J439o521j5824
10254E28447j4685j3748j8847q433M44j818m354P977M081R298j1593j8196j676
10241D56897j48J0375J2350J3261k99N887K3411M9702M8006O2219Q0377J04900
10229H66938J21279J46654J99749K40946L09751L61633M85360O05184N97698M09834
10219D345026J49175k41757p38736r12722p36862n04645l31819k22337j46707
10210F58616q3953n4983l5185k0732j8001m314j3070m751m44q975j4342j2231
$$ y = [875030, 890590, 922526, 967489, 1014675, 1063101, 1109101, 1148241, 1167876, 1149646, 1079895, 965786, 863664, 796245, 749018, 718914, 695443, 671895, 643263, 619107, 596305, 584078, 580061, 572467, 560157, 552761, 544348, 543164, 538008, 543358, 547028, 549472, 551711, 549353, 550792, 544271, 528447, 513762, 500014, 481167, 472734, 473178, 471360, 467006, 474983, 479064, 488362, 476769, 458573, 456897, 456749, 467124, 479474, 492735, 492436, 498323, 521734, 571436, 619442, 681661, 762038, 866938, 988217, 1134871, 1334620, 1575566, 1885317, 2246950, 2732310, 3337494, 3935192, 4345026, 4494201, 4252444, 3513708, 2600986, 1864124, 1359479, 1027660, 805323, 658616, 574663, 519680, 484495, 463763, 445762, 441448, 428378, 423627, 423183, 414208, 399866, 387635]
10198C87635q198j8658k1282j4316n303M508k414L522l445p170K0787L2764O0505
10185D28935Q8519J43515J90615K36438K81166L00907K43340J58553P9353K1934
10175B173275j16889k67998k63988j98131k23042k60253k15075j41181q1870m8649
10165C56199j9571j2133O309J4654Q836Q772k749p047r92m559N126N481P265K8848
10151C94439J9350r540m6544n5686l8140l1560j9259L916J2562l004L980R396
10139B39910J4334K7239N371J3722K2670j392j6274p151r232o623j0812K798P235
10126B81795Q408p587k290j8428j4630K647K66J0555K36M46l988q383J3966J0352
10112B73365L3655J7180J4033J1020J2605N037M074N327L1495M5231N8625Q2892
$$ y = [387635, 379437, 360779, 339497, 325181, 319878, 324386, 321972, 325494, 322049, 314879, 335666, 368430, 428935, 517454, 660969, 851584, 1088022, 1369188, 1670095, 1913435, 2071988, 2151341, 2173275, 2056386, 1788388, 1524400, 1326269, 1103227, 842974, 627899, 486718, 404848, 356199, 336628, 324495, 330804, 345458, 354294, 363066, 360317, 353270, 352278, 347719, 352845, 358326, 365591, 394439, 413789, 404249, 357705, 302019, 263879, 232319, 213060, 216976, 229538, 226534, 230514, 239910, 254244, 281483, 286854, 300576, 323246, 321854, 305580, 298429, 289197, 282574, 271762, 274560, 281795, 290203, 282616, 280326, 261898, 247268, 249915, 250181, 260736, 260972, 261418, 257430, 249047, 263013, 273365, 307020, 324200, 338233, 349253, 361858, 366895, 370969, 376296, 407791, 453022, 511647, 594539]
10100E94539Q8425O0742J8038Q340L933M453j7690k1345k3761n3352o0425n1092
10088E50805l4273k1261j5628o438j2223l2346j4829q149j7757j9676l46L2q482
10075C59429j7641J948P194L515K029J7497J4482M464P284Q853Q799J5129L4645
10062D67627L5356M0583M1875M1318K0274L829O190j547j7692j5170k9830l8086
10050E54727j5435k0519k4663j7134k391J1960l402j853N474m916Q912L081k832
10037D91009k61Q218J0999J2165N500k211L347J9438P110O446K0861J8574J691
10024F02886l975N014o619k788Q87K135l352j3378k3598l8602k8526j9353j952
10011D68779P607J070j1837j4959j8740o085l390Q318m013n735P003J5337J8033
$$ y = [594539, 682964, 743706, 761744, 770084, 774017, 778470, 760780, 739435, 715674, 662322, 601897, 550805, 516532, 495271, 479643, 473205, 460982, 428636, 413807, 405658, 387901, 368225, 367879, 367911, 359429, 341788, 343736, 350930, 354445, 356474, 373971, 388453, 392917, 400201, 409054, 417853, 432982, 467627, 502983, 543566, 585441, 626759, 647033, 650862, 657052, 655505, 637813, 622643, 592813, 554727, 539292, 518773, 494110, 476976, 474585, 486545, 483143, 481290, 486764, 481848, 490760, 493841, 491009, 490748, 498966, 509965, 522130, 527630, 525419, 528766, 548204, 555314, 561760, 582621, 601195, 602886, 598911, 603925, 597306, 594518, 595405, 597540, 594188, 580810, 557212, 518610, 490084, 470731, 468779, 476386, 477456, 465619, 450660, 431920, 425835, 422445, 430763, 426750, 421015, 428018, 443355, 461388]
9998D61388J1286K6820N2751N5294O5715J12790J69654K28828L15053M02540M01020
9987B303139L12675J39881r3799l43587m58851l98035k95988k14460j34649r7063
9977G19263p1560m7303l5509l2808j0697j0068k8669j4512j1061j5355j173j0688
9965D29860j9807K646K2076L0576J0446n312J5125J6767m748j5270r208p156q13
9952D65182j5998k7138k1132o453k8829l227M388J0958j074K096Q617j2928p75
9939C73687j630r772j71P252n938j1521O00l592l661N516P598J682l670N918J1375
9924C73673K5147M771Q537K8267Q288l776o253p168J1943p890O219N429q514l457
9910D35216K200Q802M949j2134o511J5251J646J8239M944M792J4484l940j3616
$$ y = [461388, 472674, 499494, 552245, 607539, 673254, 786044, 955698, 1184526, 1499579, 1902119, 2303139, 2615814, 2755695, 2661896, 2318309, 1859458, 1461423, 1165435, 950975, 816326, 719263, 647703, 600400, 564891, 532083, 521386, 511318, 482649, 468137, 457076, 441721, 440548, 429860, 410053, 412699, 434775, 465351, 475797, 470485, 485610, 502377, 497629, 482359, 473151, 465995, 465182, 449184, 422046, 400914, 394461, 365632, 362405, 366793, 377751, 376677, 378773, 387390, 374462, 373687, 372057, 362285, 362114, 369366, 363428, 351907, 352507, 348915, 345254, 350770, 358368, 360050, 356380, 362298, 373673, 398820, 403591, 412128, 440395, 448683, 444907, 438654, 431486, 443429, 435539, 441758, 447187, 438673, 435216, 437416, 446218, 451167, 439033, 432522, 447773, 449419, 467658, 472602, 477394, 491878, 487938, 474322]
9897D74322j8951j9066m296P334J048l043l863r379L256N21M758K2540J8421O583
9883D80185L956R1J0621K5863J7603L4194J0074j5193j3089l707K204j4276k1338
9870E17188j0180j55o406J0921j5015m208no635k3595p680M226J08j3241j0196
9856D35127m772m422M804j11o475J0505J0893j976Q536J2513K7672J6851M320
9843E13465J1448K3229K1105J6670J8098P645N527j4779J429J730p676k1600J572
9830E77863O669J6584R003R985Q720O536j2709j2180J0209Q749q400J197L153
9817F25379O975l742K142o644j486L753Q726l487N590K3420N211l224N503J6092
9803F84208J5671K4490J9491J1749N578J7707L797j2845P229K8146J5608N794
$$ y = [474322, 455371, 436305, 432009, 439343, 440391, 437348, 433485, 424106, 427362, 427883, 432641, 455181, 473602, 480185, 484141, 484232, 494853, 520716, 538319, 572513, 582587, 567394, 554305, 550598, 552802, 538526, 517188, 507008, 506853, 500447, 511368, 496353, 492145, 492140, 485505, 461910, 454230, 458456, 458564, 445323, 435127, 430355, 425933, 430737, 430626, 424151, 434656, 445549, 443573, 452109, 464622, 492294, 509145, 513465, 524913, 548142, 569247, 585917, 604015, 611660, 617187, 602408, 603837, 605567, 597891, 576291, 577863, 584532, 601116, 610119, 620104, 628824, 635360, 622651, 610471, 620680, 629429, 621029, 622226, 625379, 632354, 628612, 630754, 624110, 622624, 626377, 635103, 631616, 637206, 660626, 665837, 662613, 668116, 684208, 699879, 724369, 743860, 755609, 761187, 778894, 782691, 769846, 777075, 805221, 820829, 826623]
9791H26623J1738Q410J595J5912J388j8992j6866J213M482o710p719r194Q40l897
9777H08823K3779J9600Q350K4207J8691J7805J5156K9052L7705K9141K8509M7254
9765A108072L3095L9064N1060O0616O7608P0968R5810J21008J37667J60455K04070
9754B149493K62707K75335L03973L66626M78078O08825Q36164J181540J658890
9745H121631K258075K789661K978024K616168J648955K06932j449275k632572
9737A6537599k892195k470006j838444j285222q52080n34255k62665l8470J47649
9728F511911K66530L23232K99978K00795O9662m3288q779J62117L50378N10515
9718H643051O71257P95293R61360J224939J558212J771422J822708J788779J746805
$$ y = [826623, 838361, 846771, 848366, 864278, 865666, 846674, 829808, 831021, 835503, 828793, 821074, 811880, 812720, 808823, 832602, 852202, 860552, 884759, 903450, 921255, 936411, 965463, 1003168, 1032309, 1060818, 1108072, 1141167, 1180231, 1231291, 1291907, 1359515, 1430483, 1526293, 1647301, 1784968, 1945423, 2149493, 2412200, 2687535, 2991508, 3358134, 3836212, 4445037, 5281201, 6462741, 8121631, 10379706, 13169367, 16147391, 18763559, 20412514, 20619446, 19170171, 16537599, 13645404, 11175398, 9336954, 8051732, 7199652, 6665397, 6402732, 6364262, 6511911, 6778441, 7101673, 7401651, 7602446, 7672108, 7628820, 7620041, 7782158, 8132536, 8643051, 9314308, 10109601, 11070961, 12295900, 13854112, 15625534, 17448242, 19237021, 20983826]
9709B0983826J902150K633449L756927M737672N237934N167961M240354K496293
9701E1156566O34940j076353k748200m135253m980334n211831m821410m033449
9693B4784676k963615j859175r88759m23691p5158P3467j7420j63465k62089m07181
9683A7697590n49112n48165l04394J01139O88197J420489K170560K794135K946386
9674B6416825K717517K294010J703720J437621K315948L980658N467746O245015
9666E2579060O141146M945846K837127L00907k171190m101542n390700n793565
9658D9347089n136399l994318l094308k867416l331274l576345l238017k623591
9650B1485421j898134j198185o64234l09572p6589J4315M2543P8807M7673j8469
$$ y = [20983826, 22885976, 25519425, 29276352, 34014024, 39251958, 44419919, 48660273, 51156566, 51791506, 50715153, 47966953, 43831700, 38851366, 33639535, 28818125, 24784676, 21821061, 19961886, 18973127, 18549436, 18474278, 18547745, 18530325, 18366860, 18104771, 17697590, 17148478, 16600313, 16295919, 16397058, 17085255, 18505744, 20676304, 23470439, 26416825, 29134342, 31428352, 33132072, 34569693, 36885641, 40866299, 46334045, 52579060, 58720206, 63666052, 66503179, 66804086, 64632896, 60531354, 55140654, 49347089, 44210690, 40216372, 37122064, 34254648, 30923374, 27347029, 24109012, 21485421, 19587287, 18389102, 17724868, 17415296, 17338707, 17353022, 17395565, 17474372, 17522045, 17503576]
9640A7503576q2833j25899J4563M45312J134149J928198K622878L093073L266149
9631B9799166L117221K786115K443100K172357K064634J710909O94372q39810
9623D3948064k416607l684585m238338l921739l210650k643963k321574k325315
9615A9185293k432779k206747j692956j177580q44959o71606n62336n04313m37673
9606H654344l26736k18665j66388j72196k23013k93691l29289k79183j41106L113
9596F507190J43151L46224O01156R37816J341035J792775K120331K108390J614306
9587A7512374O66029n55681j788165k577575k592593k095470j530015j088335
9579E950569p66802n51834m15453l16262k60563k37423k19989k08143j94011j62204
$$ y = [17503576, 17420743, 17294844, 17309407, 17754719, 18888868, 20817066, 23439944, 26533017, 29799166, 32916387, 35702502, 38145602, 40317959, 42382593, 44093502, 44787874, 43948064, 41531457, 37846872, 33608534, 29686795, 26476145, 23832182, 21510608, 19185293, 16752514, 14545767, 12852811, 11675231, 10830272, 10158666, 9596330, 9092017, 8654344, 8327608, 8108943, 7942555, 7770359, 7547346, 7253655, 6924366, 6645183, 6504077, 6507190, 6650341, 6996565, 7597721, 8535537, 9876572, 11669347, 13789678, 15898068, 17512374, 18178403, 17622722, 15834557, 13256982, 10664389, 8568919, 7038904, 5950569, 5183767, 4631933, 4216480, 3900218, 3639655, 3402232, 3182243, 2974100, 2780089, 2617885]
9569B617885j59628j35411j20112r7970q1518q9931o4955m1555n0617m3524m1027
9558A691637n0214l1975l4998k8085k3029k8544l0726j2000P272p03J791L322
9546A463748j5872l1016l5368k4122k4372j1275j3776k4742j5283j8419l489J5999
9534A262013K0947K1849J2366J1613J4404m435k5192k6596j8749k3417l1510j2242
9522A201051l0133k3132k0041k580R582k546O929j0644j4768K786J0880Q242J7319
9509A152945L8013O4342P1552M5502Q339j4488o8627q5129n2105l6144k0211n990
9497A097999j0042J609K8995P021P381J7364J0525J8867P06J5451n333n810N62
9484A185295o191m189N410M106j2188j4649q962j8011l1332k6034j6662m79m899
$$ y = [2617885, 2458257, 2322846, 2202734, 2104764, 2023246, 1933315, 1868360, 1826805, 1776188, 1732664, 1691637, 1641423, 1609448, 1574450, 1546365, 1523336, 1494792, 1464066, 1452066, 1459338, 1458635, 1460426, 1463748, 1447876, 1416860, 1381492, 1357370, 1332998, 1321723, 1307947, 1283205, 1267922, 1249503, 1246014, 1262013, 1282960, 1304809, 1317175, 1328788, 1343192, 1338757, 1313565, 1286969, 1268220, 1244803, 1213293, 1201051, 1170918, 1147786, 1127745, 1125165, 1134747, 1132201, 1139130, 1128486, 1113718, 1116504, 1127384, 1135626, 1152945, 1190958, 1255300, 1326852, 1372354, 1380693, 1366205, 1297578, 1212449, 1160344, 1124200, 1103989, 1097999, 1087957, 1089566, 1118561, 1125582, 1132963, 1150327, 1160852, 1179719, 1180425, 1195876, 1190543, 1184733, 1185295, 1179104, 1174915, 1180325, 1184431, 1172243, 1157594, 1148632, 1130621, 1099289, 1073255, 1056593, 1056114, 1051215]
9471A051215K17J3678K868J7922M238N370K3062K0753J2898K533r643m0412j8622
9458A086077j2728q559N638J5211J2078K2813K8050J8698J2845J8772J8763o002
9446A211656k5304m060J1028K39n029n347k2140q776Q082j1151j4227m971O0J2937
9432A142997O437J749R652O867o890j0553o083M131P381K1097K3701L0894J5001
9419A246381N948K0249K6535K2379J7104Q572J2941O862L897J1079N221o465j4543
9406A366160n218L157J2500R195J0955M499O375n962l437O918J8367K7352K6816
9393A477677J5221R427J1494J6820N055l790N572J2484J2526J5996K4747K0435
9381A623664J5477J8573K9063K4615K9284J8675N843r27J6133Q337J6852L108
$$ y = [1051215, 1051432, 1065110, 1067978, 1085900, 1090138, 1095508, 1118570, 1139323, 1152221, 1154754, 1145111, 1104699, 1086077, 1073349, 1064790, 1070428, 1085639, 1097717, 1120530, 1148580, 1167278, 1180123, 1198895, 1217658, 1211656, 1186352, 1182292, 1193320, 1193559, 1188530, 1183183, 1161043, 1152267, 1160349, 1149198, 1134971, 1130000, 1130060, 1142997, 1149434, 1151183, 1160835, 1167702, 1160812, 1150259, 1144176, 1148307, 1155688, 1176785, 1200486, 1231380, 1246381, 1252329, 1272578, 1299113, 1321492, 1338596, 1347168, 1360109, 1366971, 1370868, 1381947, 1387168, 1380703, 1366160, 1360942, 1364099, 1376599, 1385794, 1396749, 1401248, 1407623, 1401661, 1398224, 1405142, 1423509, 1450861, 1477677, 1492898, 1502325, 1513819, 1530639, 1535694, 1531904, 1537476, 1549960, 1562486, 1578482, 1603229, 1623664, 1639141, 1657714, 1686777, 1711392, 1740676, 1759351, 1765194, 1764267, 1780400, 1788737, 1805589, 1808697]
9369A808697O479J8066R206n082K1120K3260J7785J8093L1434J8529J1191K3999
9357B002777K5463J2314M1199M0356K0923J9355L5056L7582M5664N3001M8268
9346B381958K5463M5045K9918L3361L5989L2065M685J7925K8874K2689J4464J8057
9334B690493O165J8941K3119K5906L0648K4681L1483L4045M7417L5313K4342L3801
9322C026354M9502O3343L5975K9875M3950N2334M1813M8666N8862O5544O4848
9311C581066N6069N3245O3085O9676P9432Q5673Q5960P2952N6001O2738O6474
9300D332371O7435O0641L6909K9473M3741N0180M5268M6122O2903N9014O7462
9289D901519P5310P5297Q3553P9265P3798P7019P8463P2237J01076J08647R1295
$$ y = [1808697, 1815176, 1833242, 1842448, 1837366, 1858486, 1881746, 1899531, 1917624, 1949058, 1967587, 1978778, 2002777, 2028240, 2040554, 2081753, 2122109, 2143032, 2162387, 2197443, 2235025, 2280689, 2333690, 2381958, 2407421, 2452466, 2482384, 2515745, 2551734, 2583799, 2588484, 2606409, 2635283, 2657972, 2672436, 2690493, 2696658, 2715599, 2738718, 2764624, 2795272, 2819953, 2851436, 2885481, 2932898, 2968211, 2992553, 3026354, 3075856, 3139199, 3175174, 3205049, 3248999, 3301333, 3343146, 3391812, 3450674, 3516218, 3581066, 3637135, 3690380, 3753465, 3823141, 3902573, 3988246, 4074206, 4147158, 4203159, 4265897, 4332371, 4399806, 4460447, 4497356, 4526829, 4570570, 4620750, 4666018, 4712140, 4775043, 4834057, 4901519, 4976829, 5052126, 5135679, 5214944, 5288742, 5365761, 5444224, 5516461, 5617537, 5726184, 5817479]
9278E817479R4156J08288J17908J24406J14762J21711J25728J33245J57484J72348
9268G087515J74199J97018K05713J97522J71639J48452J23043R7096Q7284P6540
9258H566021R7013J17027J35929J54066J71347J83520J99286K32141K28234K44053
9248A0328637K30537K26692K09979K05496K16947K37106K32139K34282K25337
9239A2347152K32202K78586K81522K96533K99746L23919L51075L76392M12673
9230A5199800M35948M34993M40235L99065L40823K90912K54356K39656K57705
9221A8293493K85315L17940L44164L70089M00300M18208M13237M24982M39254
9212B1706982M38313M47233M48228M28842M31215M11834M08016L93969L64763
$$ y = [5817479, 5911635, 6019923, 6137831, 6262237, 6376999, 6498710, 6624438, 6757683, 6915167, 7087515, 7261714, 7458732, 7664445, 7861967, 8033606, 8182058, 8305101, 8402197, 8489481, 8566021, 8663034, 8780061, 8915990, 9070056, 9241403, 9424923, 9624209, 9856350, 10084584, 10328637, 10559174, 10785866, 10995845, 11201341, 11418288, 11655394, 11887533, 12121815, 12347152, 12579354, 12857940, 13139462, 13435995, 13735741, 14059660, 14410735, 14787127, 15199800, 15635748, 16070741, 16510976, 16910041, 17250864, 17541776, 17796132, 18035788, 18293493, 18578808, 18896748, 19240912, 19611001, 20011301, 20429509, 20842746, 21267728, 21706982, 22145295, 22592528, 23040756, 23469598, 23900813, 24312647, 24720663, 25114632, 25479395]
9203B5479395L62564L54225L53717L44847L33861L48413L46244L23362L36641
9194B8583269L26422L10938L02252K47144K03239J59325R1850O2214M4345J2691
9184C0343689l2875n9684o5599p9583j03236j29393j47436j60440j96832k09118
9174B9159493k22375k63568k92038l00342l10116l38039l51483l75386l94089
9165B6312057l77594l89289l98093m01285l91030l89260m02880m12740m05136
9156B2744750l91068l73790l80453m00761m06073m15893m06579l91210l84048
9147A9194875l83033l82278l66196l61521l63888l60836l45428l36904l42679
9138A5952112l38913l30683l10278l15109l00181k88402k70709k53078k58379
$$ y = [25479395, 25841959, 26196184, 26549901, 26894748, 27228609, 27577022, 27923266, 28246628, 28583269, 28909691, 29220629, 29522881, 29770025, 29973264, 30132589, 30224439, 30286653, 30330998, 30343689, 30310814, 30251130, 30185531, 30105948, 30002712, 29873319, 29725883, 29565443, 29368611, 29159493, 28937118, 28673550, 28381512, 28081170, 27771054, 27433015, 27081532, 26706146, 26312057, 25934463, 25545174, 25147081, 24745796, 24354766, 23965506, 23562626, 23149886, 22744750, 22353682, 21979892, 21599439, 21198678, 20792605, 20376712, 19970133, 19578923, 19194875, 18811842, 18429564, 18063368, 17701847, 17337959, 16977123, 16631695, 16294791, 15952112, 15613199, 15282516, 14972238, 14657129, 14356948, 14068546, 13797837, 13544759, 13286380]
9129A3286380k56535k57338k52388k42702k48934k45132k37127k49148k35810
9120A1061266k24537k10805j92243k27895k20982j97527k06431j85127j78445
9111I217274j71313j57871j64058j65285j51242j59425j63495j52657j34176j24400
9101G673352j39053j31654j28966j24810j29194j36367j17515j25288j35813j04658
9091F400034q7723q7199j02123j04763r4629r5457j05252j00113q2708q9903q7658
9080E362506o6407r4964q2178p8432o5816n2606p6519p0038p0214m8525l5817
9069D620990o1002o4484n7340n4748n3246n6842o8845o8201n4449o9193o4962
9058C947678o9269o6748n8958m4296n1093n0638n9783m6964l7974m1559l7694
$$ y = [13286380, 13029845, 12772507, 12520119, 12277417, 12028483, 11783351, 11546224, 11297076, 11061266, 10836729, 10625924, 10433681, 10205786, 9984804, 9787277, 9580846, 9395719, 9217274, 9045961, 8888090, 8724032, 8558747, 8407505, 8248080, 8084585, 7931928, 7797752, 7673352, 7534299, 7402645, 7273679, 7148869, 7019675, 6883308, 6765793, 6640505, 6504692, 6400034, 6312311, 6225112, 6122989, 6018226, 5923597, 5828140, 5722888, 5622775, 5540067, 5450164, 5362506, 5296099, 5201135, 5118957, 5040525, 4974709, 4922103, 4845584, 4775546, 4705332, 4656807, 4620990, 4559988, 4495504, 4438164, 4383416, 4330170, 4273328, 4204483, 4136282, 4081833, 4012640, 3947678, 3878409, 3811661, 3752703, 3708407, 3657314, 3606676, 3546893, 3499929, 3461955, 3420396, 3382702]
9047C382702m1014k6527l3574l7049n3869n1183m5229m6379l9232n3828m8830
9036B905988k8693l7048o1620o3407m4958k3101l9713l9593k8890k6204k7696
9025B485065l6226j7734j7912k7564k0028j1688l4615m3082l3646j8527p521k0236
9013B196286k5183l429n829j4619k8399j5501k106L667k0744k5958j0587j1391
9001B036207k9322m0909m4837k8160k8760m0061l6176k6063k0524j9705j4452
8990A707238j5500k0472j0307r847j3108p705j0376k3399n089k5600k6270j2248
8978A527317j9814p824j3145m0645k6963j9594j3364J951n134k9017j6435J1112
8966A348445M760K54p003m222j660j488M031o680J188P330R6k4624l9593l8493
$$ y = [3382702, 3341688, 3315161, 3281587, 3244538, 3190669, 3139486, 3094257, 3047878, 3008646, 2954818, 2905988, 2877295, 2840247, 2778627, 2715220, 2670262, 2647161, 2607448, 2567855, 2538965, 2512761, 2485065, 2448839, 2431105, 2413193, 2385629, 2365601, 2353913, 2319298, 2276216, 2242570, 2224043, 2216522, 2196286, 2171103, 2167674, 2161845, 2147226, 2118827, 2103326, 2101220, 2104887, 2084143, 2058185, 2047598, 2036207, 2006885, 1965976, 1921139, 1892979, 1864219, 1824158, 1787982, 1761919, 1741395, 1721690, 1707238, 1691738, 1671266, 1660959, 1651112, 1638004, 1630299, 1619923, 1596524, 1591435, 1565835, 1539565, 1527317, 1507503, 1499679, 1486534, 1445889, 1418926, 1399332, 1385968, 1387919, 1382785, 1353768, 1337333, 1348445, 1353205, 1353459, 1346456, 1342234, 1340574, 1339086, 1343117, 1336437, 1337625, 1344955, 1345051, 1320427, 1280834, 1242341]
8952A242341l3655l0669k2641k4422o735p596m877j1594j3070j9065p236k0823
8940A039958j0801j1798p680p023j4329J875q135l624j3773n431J86p430n836
8927I46159r953L534n878j4981r946J2934J4857n858k920O694J8708J1899J9782
8914I85031R532M137N094J2088n322k3808l1515j4623j8152l8029j8141q412j0516
8901H47364l4518j4859p616N327Q5q091l405m272q5m345l983r31j5961J679n996
8886G50393L472k528P559P810P173J2622k069r895l651l718n222O608P069J6791
8872G92414J7586L1734L0331L3535L0585L1860O1851O4858M6542M2838M9927N7741
8860A291802Q4133R6555J06352J22702J42457J80759K53729M40845P23896J174242
$$ y = [1242341, 1208686, 1178017, 1155376, 1130954, 1124219, 1116623, 1111746, 1100152, 1087082, 1068017, 1060781, 1039958, 1029157, 1017359, 1009679, 1002656, 988327, 990202, 982067, 978443, 964670, 959239, 959425, 951995, 946159, 936206, 939740, 933862, 918881, 908935, 921869, 936726, 930868, 927948, 934642, 953350, 965249, 985031, 994563, 998700, 1003794, 1015882, 1010560, 986752, 955237, 940614, 922462, 884433, 866292, 857880, 847364, 812846, 797987, 790371, 795698, 795783, 787692, 784287, 780015, 779930, 775585, 771602, 770671, 754710, 756389, 750393, 753865, 751337, 758896, 766706, 773879, 786501, 784432, 774537, 770886, 767168, 761946, 768554, 775623, 792414, 810000, 841734, 872065, 905600, 936185, 968045, 1029896, 1094754, 1141296, 1184134, 1234061, 1291802, 1375935, 1472490, 1578842, 1701544, 1844001, 2024760, 2278489, 2719334, 3443230, 4617472]
8850D617472J870606K681787K953981K258694J273191j66659k635773l652694
8842I200605k760091j749832j085987p00854m42527k93577j85459j28751j13297
8833A740230j00261j13217j03325r2538o5833q6793r4182n4927m7911m8912l0661
8822I01670l3575l4555l7128j9546q661l7302k2381j1482o973q498l1507k7336
8810F22726k0563k686J91M383l075l1818o743R020n630k986j5136j0362q953m551
8796E23817J89n125j2073n711k286j0706k1104j2501l24j1567J949o461j6266
8783D21831n065j1015N17p275k21O033l271J981q380j2080r658L567O647L365
8769C86976o435j522O847r22j0596K442o71j6609j3041M37j487j0568L537j1967
$$ y = [4617472, 6488078, 9169865, 12123846, 14382540, 15655731, 15489072, 12853299, 9200605, 6440514, 4690682, 3604695, 2903841, 2461314, 2167737, 1982278, 1853527, 1740230, 1639969, 1526752, 1423427, 1330889, 1265056, 1178263, 1084081, 1029154, 981243, 932331, 901670, 868095, 833540, 796412, 776866, 768205, 730903, 708522, 697040, 690067, 681569, 650062, 622726, 602163, 599477, 599668, 604051, 600976, 569158, 562415, 571435, 565805, 562819, 547683, 537321, 528368, 523817, 524006, 518881, 506808, 501097, 498811, 488105, 467001, 454500, 454176, 442609, 444558, 438097, 421831, 416766, 405751, 406268, 398993, 398772, 404805, 401534, 403515, 395135, 383055, 373397, 376964, 383611, 386976, 380541, 379019, 385866, 384944, 374348, 376790, 376119, 359510, 346469, 346906, 345419, 334851, 338388, 326421]
8755C26421p608n493k490K317L625K169J2917q843k436O772Q190j0043j1654M20
8741C14264r544p083l972j0411O333N53J574q117m330R697o593p29J544r19j585
8726B80682J0157Q51r404q285L144o788P310O003R62j8037j1483L461O097n982
8712B58688J1128K0372j4327j5482n718q830j5499J922O271J133N601j1398K659
8699B36520M425J4188p736R074l810j0475J935j804j0201m771j903O383p07m974
8685B26144n996N754o11j614M35O068k958n690M42k255K3239o82k5508q415P74
8670B09127Q119j174J0630k026n186J2522n666L39O668O111L17m455p990q068
8656B19268N615O122p017k063k399L257j7190N320l497K806O827q453k320J20
$$ y = [326421, 318813, 313320, 310830, 313147, 316772, 318941, 331858, 323015, 320579, 327351, 335541, 325498, 313844, 314264, 304720, 297637, 293665, 283254, 289587, 290140, 291714, 283597, 279267, 288964, 282371, 281642, 283186, 282267, 280682, 290839, 291690, 282286, 274001, 277145, 270357, 277667, 283670, 284632, 266595, 255112, 258573, 264670, 258688, 269816, 290188, 275861, 260379, 254661, 245831, 230332, 232254, 238525, 239658, 245259, 233861, 236520, 240945, 255133, 247397, 256471, 252661, 242186, 244121, 242317, 232116, 227345, 225442, 231825, 231118, 226144, 220148, 225902, 225291, 223677, 224112, 230180, 227222, 221532, 221974, 219719, 242958, 242276, 216768, 208353, 209127, 217246, 216072, 226702, 224676, 219490, 232012, 226346, 226685, 233353, 239464, 239781, 235326, 227336, 219268, 224883, 231005, 223988, 221925, 219526, 222783, 205593, 210913, 207416, 210222, 217049, 208596, 206276, 206396]
8642B06396O011J2380p723j3549k5087o911Q205k971K012o99L449P650K648R127
8628B00938J1444n091n894L523P954l468r969J86k677J362n805K181j2412N007
8614A87279P381J0401L795j1019p819J3788n860j4521L708L924p74n904Q207R77
8600A93563K297M172j960k47j6033o989j433j1989L296J026R270O73p235J4995
8586A83406J5425l15j26q82J5179J7603O514n897k744l172M38J8063K2249J7447
8572B83188O824J5217N171J4947J8036K721j6628j0082j3352k4665p915j9952
8560B53510j7348j4656k1230k0000j0839m503P188M410N070j3004q89l300p234
8547A57175k18K480J780N636o324n235J549K786n395o050l197m647P094Q967l852
$$ y = [206396, 212407, 224787, 217064, 203515, 178428, 171517, 179722, 176751, 178763, 178064, 181513, 189163, 191811, 200938, 212382, 207291, 201397, 204920, 212874, 209406, 199437, 199623, 196946, 198308, 192503, 194684, 182272, 187279, 194660, 205061, 208856, 197837, 190018, 203806, 197946, 183425, 187133, 191057, 190283, 184379, 192586, 193563, 195860, 200032, 198072, 197825, 181792, 174803, 173370, 161381, 164677, 165703, 174973, 175646, 168411, 183406, 198831, 198516, 198390, 197508, 212687, 230290, 236804, 230907, 228163, 224991, 225429, 243492, 265741, 283188, 290012, 305229, 310400, 325347, 343383, 346104, 329476, 319394, 306042, 281377, 273462, 253510, 236162, 221506, 200276, 180276, 169437, 164934, 172122, 176532, 181602, 168598, 167709, 164409, 157175, 156957, 159437, 161217, 166853, 160529, 155294, 156843, 159629, 154234, 148184, 144987, 140340, 147434, 156401, 152549]
8532A52549P11L523j537o286N056J1961Q058J28m397J3440J2056O833P452J016
8518B10563j5685r064Q43n930j2344q825j5340r183j4348j5611L257J7606P655
8505A33594p452j0901L784J2273L616j1371r093j965j752L227O09N998Q40j0451
8491A10956m399l417J3021N570j0442k084o226K940J9035J2109K75q606j1504
8478A17228j2920l74N658l382j8088K748P348l749J416J2301Q664J118j5960R932
8464A11940L504j0117p6m71l556J2933M682kN79j6627n243q403L140J1519Q578
8449A12380L373m97J6797n615N094Q557K852Q185R192l054j7059j4209K549m822
8435A23723o550q91n620P372p074r718m088l374j1247q805R439r485L700M524
$$ y = [152549, 153260, 156783, 155246, 148960, 154016, 165977, 174035, 174163, 169766, 183206, 195262, 202095, 209547, 210563, 194878, 185814, 186657, 180727, 168383, 159558, 144218, 135035, 120687, 105076, 108333, 125939, 133594, 126142, 115241, 119025, 131298, 134914, 123543, 114450, 112485, 110733, 113960, 114569, 120567, 121407, 110956, 106557, 103140, 116161, 121731, 111289, 109205, 102979, 105919, 124954, 137063, 137338, 128732, 117228, 104308, 103934, 109592, 106210, 88122, 90870, 98218, 94469, 95885, 108186, 116850, 117968, 102008, 111940, 115444, 105327, 105251, 104780, 101224, 114157, 118839, 118837, 119416, 102789, 97546, 89143, 92283, 103802, 112380, 115753, 115256, 132053, 126438, 131532, 140089, 142941, 151126, 160318, 157264, 140205, 125996, 128545, 123723, 117173, 116282, 110662, 118034, 110960, 101242, 97154, 93780, 82533, 73728, 83167, 73682, 77382, 81906]
8421H1906j1434j219K2777O89p739l801K741P490p127n307N31Q123R240k940k2969
8406G0961m00Q231K041P806j661j6171l152Q095J1887k126l059m827j231L472
8392G9866P488J0274l421j1065j4895k1J0035J3768J0483k780j6304P62q50q263
8378G5077Q340M995m995l639R112k426M620j1618J2002r148l772m213n973M505
8364G2867O599K495j1078k058j783J3725J2731L047k0424q353n398p342J1337
8351F6365l295J1011P543j8453n707l440R096M967L19N040J7841L843p844q487
8337G8799n582J664J263J772J23R326O9O760r26n175n8K440K45J912k64L847k708
8320I3507p544m873L157L8j3715m614m958M37o840J548Q337J4021k055r552J92
$$ y = [81906, 70472, 69253, 92030, 92719, 84980, 81179, 83920, 91410, 84283, 78976, 79507, 87630, 96870, 93930, 70961, 70561, 78792, 80833, 88639, 86978, 70807, 67655, 75750, 87637, 85511, 82452, 77625, 76394, 79866, 87354, 97628, 94207, 83142, 68247, 68226, 78261, 92029, 102512, 99732, 83428, 84190, 83340, 75077, 83417, 88412, 83417, 79778, 88890, 86464, 91084, 79466, 91468, 82320, 78548, 74335, 68362, 72867, 79466, 81961, 70883, 68825, 67042, 80767, 93498, 96545, 76121, 67768, 62370, 55028, 66365, 63070, 74081, 81624, 63171, 57464, 54024, 63120, 68087, 68406, 73446, 91287, 95130, 87286, 78799, 73217, 74881, 76144, 77916, 78039, 87365, 87434, 94194, 93268, 88093, 88035, 90475, 90720, 92632, 92368, 96215, 93507, 85963, 81090, 84247, 84285, 70570, 65956, 60998, 61435, 54595, 56143, 64480, 78501, 76446, 66894, 67086]
8305F7086J2207R632k0330j7845k294Q816J9477J065p87L70m761j0163K2735R197
8291I4405k4400j2856n46L773j901Q646r742k729J0925J698L261M048L94k1343
8277E3633j7770J0827R643K239j351j3574P687N557M164K663l631l798N761R150
8263G1200J259j1054M792J3001j1035r219m569q189J2601j812r514J0195m17n127
8249E2112m618q395J963N570L819q123k028J3207Q082J686K305j1688L056R97
8235E7945r593j3935L716R821O215N067K840r102O895J6438M897n560n724r645
8221F0275O259J079j8446L222J3810j715o236K37p86k474j416l179P012J4082
8207G1724R889J7823K3580J9087J3699J6073K5388Q057m411j6213l5971l4721
$$ y = [67086, 79293, 88925, 68595, 50750, 48456, 57272, 76749, 77814, 77027, 77397, 72636, 62473, 85208, 94405, 70005, 57149, 56603, 60376, 58475, 67121, 57379, 54650, 65575, 67273, 70534, 74582, 74976, 53633, 35863, 46690, 56333, 58572, 57221, 43647, 51334, 56891, 61055, 63718, 60087, 56289, 62050, 71200, 72459, 61405, 66197, 79198, 68163, 58944, 54375, 46186, 58787, 56975, 47461, 57656, 57239, 52112, 47494, 39099, 41062, 46632, 50451, 42328, 40300, 53507, 61589, 63275, 65580, 53892, 56948, 57945, 48352, 34417, 38133, 47954, 54169, 59236, 62076, 52974, 59869, 76307, 81204, 75644, 69920, 60275, 66534, 67613, 49167, 52389, 66199, 64484, 58248, 58485, 57699, 55225, 53809, 50630, 57642, 71724, 81613, 99436, 123016, 142103, 155802, 171875, 197263, 205320, 200909, 184696, 148725, 114004]
8195A14004j5745n657j3523q423P48L335q968j5322M601m300r706j3562O738M998
8181C9218J1247k484L003m48R45K4472K106j3989j2421Q550P987j622l773M110
8167F6901J3541r068M437r27K615L007N636J3211J6578L5734N0698M8003M2927
8154B93293M2133K7686k6980o0652n5884m0719n1996l1514j8685j4342p699J2999
8142F7640P264J759M441k959j3517j2755j8407k60N348O131R629J2014J579J2633
8128H0540O279j8282j3555N015m359N41J2521q782j0334m875m450m642j949p448
8114B6220J3571J0937P189K2302L0738J4167J1885K0825R205n331j5494l2630
8102A13584j5945k320K736r607n312N10M968K669k17j0451j8361q99M028j619
$$ y = [114004, 98259, 92602, 79079, 70656, 71404, 74739, 65771, 50449, 55050, 50750, 41044, 27482, 34220, 39218, 50465, 47981, 50984, 50536, 51481, 75953, 78059, 64070, 51649, 60199, 68186, 66564, 62791, 66901, 80442, 71374, 75811, 74884, 77499, 80506, 86142, 99353, 115931, 151665, 202363, 250366, 293293, 335426, 363112, 336132, 275480, 219596, 178877, 126881, 95367, 76682, 62340, 54641, 67640, 74904, 76663, 81104, 78145, 64628, 51873, 33466, 33206, 38554, 44685, 54314, 66328, 67907, 80540, 86819, 68537, 54982, 59997, 55638, 56179, 68700, 59918, 49584, 44709, 40259, 35617, 33668, 26220, 39791, 50728, 57917, 80219, 110957, 125124, 137009, 157834, 167039, 161708, 146214, 113584, 97639, 95319, 98055, 88448, 83136, 83646, 88614, 91283, 91066, 80615, 62254, 61355, 65383, 63764]
8088F3764o238j4069m362k443n298L230P875L643J3007L2625K9544K8985J4410
8075A64673O808q505j1803k0544j6071j2880j5464q566q026j2889N911J7028J4686
8062I4358r929k5229P563O723r43N015P501M494K4318K9789L2416L2314M7816
8049B56206N2829L4391K6705J0320k8496l5172o4547o2459m6826l0091k2433j1332
8037G9095m2j497L168J7753K941j3084k062J466q645j4924J752J0576J615J9920
8023I8032J7779N169j0045p467j580j1712M390k419L773N9o125K885J3669J3777
8009A20185P729J1405K7878M7837P1107R0825Q6067J12016J05664M4826l1134
7998F94405q2727j11397j09309p9043p2743l7536j3298k3621j8748n351k939J0917
$$ y = [63764, 57526, 43457, 39095, 36652, 31354, 34584, 42459, 46102, 59109, 91734, 121278, 150263, 164673, 171481, 162976, 151173, 130629, 114558, 101678, 86214, 77648, 69622, 56733, 62644, 79672, 94358, 84429, 59200, 66763, 73486, 72543, 77558, 85059, 89553, 113871, 143660, 176076, 208390, 256206, 309035, 343426, 370131, 380451, 351955, 316783, 252236, 189777, 142951, 112860, 90427, 79095, 79053, 77556, 80724, 98477, 101418, 88334, 86272, 87738, 79093, 64169, 65921, 76497, 78112, 98032, 115811, 120980, 110935, 103468, 101888, 90176, 94566, 92147, 95920, 95979, 89854, 92739, 106408, 120185, 127914, 139319, 167197, 215034, 286141, 376966, 463033, 575049, 680713, 725539, 694405, 611678, 500281, 390972, 311929, 239186, 201650, 188352, 164731, 145983, 140632, 137693, 148610]
7986A48610j2549j5510Q00m633K786k789j0040j0032N964L071m660p923L453J8380
7972A14928J223p507m798N367m344q591k761K009J781l99p69N723J2597K5060
7958A39519K6475M2763M4723K3604K3764K9385l269l5843n2465l3877l5223m0507
7946A29049k6297k654k744j9327q108r485N146O503O597Q330L793N063P87j3666
7932H2987r29N087j504J527K844q714o190j0354J4468J372m517k421l134r462
7918F1060K424N962R64p038o160k223k572L873R686j1363k131M981R839j1638
7904E5664j1818n130J2296J1663k3761p004m738j2339P268J1476r24n071L698
7891C1280M697k373o691K2476K170k712K399J622Q602L844r678j0949R098N361
$$ y = [148610, 136061, 120551, 121351, 116718, 119504, 116715, 106675, 96643, 102607, 105678, 101018, 93095, 96548, 114928, 116151, 108644, 103846, 109213, 104869, 96278, 93517, 95526, 97307, 96908, 96139, 101862, 114459, 139519, 165994, 208757, 253480, 277084, 300848, 330233, 326964, 291121, 238656, 204779, 169556, 129049, 102752, 100098, 97354, 78027, 69919, 60434, 65580, 72083, 78680, 87010, 90803, 95866, 96653, 82987, 82058, 87145, 85641, 87168, 90012, 81298, 75108, 64754, 79222, 80594, 76077, 73656, 70522, 61060, 63484, 69446, 70410, 63372, 57212, 54989, 52417, 56290, 65976, 54613, 52482, 57463, 67302, 55664, 43846, 38716, 51012, 62675, 38914, 31910, 27172, 14833, 22101, 33577, 32653, 27582, 31280, 35977, 33604, 26913, 49389, 51559, 48847, 51246, 52868, 61470, 65314, 55636, 44687, 53785, 59146]
7877E9146j1921n693m659k286O492q494l698J3677N219j540j3613l744k107p609
7863A9170m984n837p208j806M955J0545J2887r55k422R188n286j2203p32P133
7849B2445n060j266Q239J2923M926j7337r961r325p49j0277J4527L505j1673J68
7835A085J862J060O766P206j7550j739K6989J8195j2949k3624J695M631Q104L609
7821B5340J549L839J753r598j0033J233J376p700n893M384M566j1512Q047P377
7807A4728P22j3657j5674O022P999R124O843J81L483Q558N772j422o419j0186
7793A6074q260L806J4499m018j5300o34L172r489N055M1O780N955R16j0223L316
7778A1690n582k1649M03K576n644j268P99L273m903J0324N979J457O204J0907
$$ y = [59146, 47225, 41532, 36873, 34587, 41079, 32585, 28887, 42564, 47783, 46243, 32630, 28886, 26779, 19170, 14186, 8349, 1141, -665, 4290, 14835, 27722, 26767, 24345, 33533, 28247, 16044, 15312, 22445, 17385, 16119, 24358, 37281, 42207, 24870, 14909, 5584, 4835, -5442, 9085, 12590, 917, 1085, 2947, 4007, 10773, 17979, 429, -1310, 25679, 43874, 30925, 7301, 8996, 13627, 21731, 25340, 26889, 30728, 32481, 22883, 12850, 14083, 15459, 7759, 1866, 6250, 10816, -696, 7351, 14728, 15450, 1793, -13881, -7859, 140, 9264, 16107, 16288, 19771, 28329, 34101, 32679, 26260, 16074, 7814, 11620, 26119, 22101, 6801, 6167, 9339, -150, 4905, 4946, 11726, 17681, 18597, 8374, 11690, 6108, -15541, -15138, -12562, -18206, -19474, -18675, -15402, -20305, -9981, -4002, -2545, 3659, 14566]
7764A4566Q361m458p915K346J4922m198j2813Q62k619k161J0323k980j2360n165
7750c289M587L887Q788k015j4926M26J63o093j2443M263J1658J950O381M306n211
7735B432m352q262j1103L572K1847m312q954J3870N778q290P985R032N591o022
7721A8812l552k350o640n419j786m254j3949k364k35N630J4758J89K810l744Q72
7706a222P099j4616q784O344m703J359N506L738K103M520N580m535k769J3228
7692A2848l76j3686J097O679p841M566R696k433J0552J0581n03j0712n587m108
7678A0773j829q083K223J868K513K060l4919j7429O229j080L150Q093J0145N223
7664a1063Q794n127j243R014N291k1626K850J0811l22L745j1043q635L278L520
$$ y = [14566, 22927, 18469, 10554, 12900, 27822, 23624, 10811, 11673, 9054, 6893, 17216, 14236, 1876, -3289, 1298, 5185, 13973, 11958, -2968, -2542, -2379, -8472, -20915, -16652, -4994, -3044, 3337, 7643, 2432, -1920, -10182, -21285, -17713, 4134, -178, -9132, 4738, 10516, 2226, 10211, 19243, 24834, 18812, 15260, 12910, 6270, 851, -935, -5189, -19138, -21502, -21737, -16107, -1349, -1160, 1650, -2094, -1222, 5877, -8739, -17523, -11179, -15882, -14523, -9017, -5279, -3176, 1344, 6924, 2389, -380, 12848, 12472, -1214, -117, 6562, -1279, 3287, 12983, 10550, 21102, 31683, 31180, 20468, 14881, 10773, 8944, 861, 3084, 4952, 7465, 9525, -25394, -42823, -36594, -37674, -34524, -26431, -16286, -11063, -2269, -7396, -8639, 375, 5666, -15960, -13110, -2299, -2621, 1124, -9919, -18554, -15276, -11756]
7650a1756j174P10O717Q760K218M787J3913q386n234j0308r922r193m863n895
7636b9626J4593J5583K427j073q05R522Q790l942l261k340l426j829J0329k371
7622A2571j844O807l362N978l128l956j4413j0695n20J542J375P426N481O436
7608I698l330k3816K265J9471J4102L926J377m798n335j0284l579O642K301q007
7594F33j6901l060M612k9p622J0800P061l268l540N07K384J099j1596R630J3827
7579D537j0554n064l943j944J1793J3334N849j163j9924J571J0398N951r941L757
7565D657J3777o684M88O210j0966j195j0492L018j0190P595K288q826m680P446
7551g554J640N086M165m096J3511p568l002P74J686N148p806q498K163J972J2731
$$ y = [-11756, -12930, -12220, -5503, 3257, 5475, 10262, 24175, 15789, 10555, 247, -9675, -18868, -23731, -29626, -15033, 550, 2977, 1904, 1099, 10621, 19411, 15469, 12208, 9868, 6442, 4613, 14942, 12571, 10727, 17534, 14172, 20150, 17022, 13066, -1347, -12042, -12562, -11020, -9645, -2219, 3262, 9698, 6368, -17448, -15183, 4288, 18390, 22316, 23693, 18895, 13560, 3276, -303, 6339, 8640, 633, -16268, -19328, -14716, -14745, -22367, -11567, -4506, -7774, -11314, -10807, -8423, -7324, -18920, -9290, 4537, -6017, -11081, -15024, -16968, -5175, 8159, 14008, 12845, -7079, -5508, 4890, 10841, 900, 4657, 18434, 11750, 12238, 18448, 7482, 6287, -4205, -1187, -11377, -3782, -1494, -10320, -15000, -7554, -5914, -828, 3337, -759, 12752, 5184, 2182, 2956, 4642, 9790, 1984, -6514, -4351, -2379, 10352]
7536A0352J1093l197j5819j6720K52K483K912k707k976M581M777m451j2112M253
7522a7279R112J2808m835J733N064m486j2984j435p022K64Q243O568o99r473K505
7507a1916J0024n310N059p533j2076m016M396Q093J2420O880o401k2951P3n59
7493b3817R015M003j610n52J765K632m52P366N71M300J1295k285j1782r626L97
7478h780j604L032Q37o189o932M810L199m010o856J0027Q345J288J1200R961J9212
7463C7540j1469q012K970k286j6882n691k040K70j7353J847j600N036P12P008
7449i950o744j1942Q922R524p372m147j140O433j0203P556J0952L786o890j4342
7435b5557K028l035N993l750N769M416o23M155L578j7531N709K2014J6699n834
$$ y = [10352, 21445, 18248, 2429, -14291, -14039, -11556, -8644, -11351, -14327, -9746, -4969, -9420, -21532, -17279, -8167, 4641, -194, 1539, 6603, 2117, -10867, -12302, -19324, -19060, -10817, -4249, -4948, -14421, -11916, -1892, -7202, -2143, -9676, -21752, -25768, -21372, -13279, -859, 6021, -380, -23331, -23258, -23817, -14802, -10799, -12409, -12961, -11196, -8564, -9016, -1650, -1079, 3221, 14516, 12231, 449, -9177, -8780, -10384, -7352, -6515, -12704, -19636, -14826, -11627, -15637, -22493, -12466, -4121, -2833, 8367, 18328, 37540, 26071, 18059, 21029, 18743, 1861, -3830, -5870, -5600, -22953, -21106, -22706, -17670, -16958, -9950, -16694, -28636, -19714, -10190, -17562, -21709, -22849, -16416, -26619, -19063, -8111, -4325, -11215, -25557, -23529, -26564, -20571, -24321, -18552, -14136, -14759, -10604, -7026, -24557, -18848, 3166, 19865, 14031]
7421A4031j2031r804l514k70q846j3997O489K0337O707k018l238r69R715Q537
7407A1129N823N736n883n007j4042K457j130o935L80R451P176j879k515l026L171
7392D906r337p294m436P461K150R482m236r459O491j2729n871J005K797l27Q419
7377a0978l307O498K361N24J689J5747n639k3027j853L955m544J1489q6m402J0997
7362e76r12J9066Q572o746j0081p319l384r249j351O588N112n44L853q15q512
7347f298j6570K443J0975J0252Q299J6249k762j7227m316o305k988N342J0665
7334G759n328j495q808j591Q489J4595p904p485Q51P954n758j145n874M027q221
7319i934o660J2000n443J371k108Q832O884P194j3121j49N471j757j82j7844j5215
$$ y = [14031, 2000, -7804, -11318, -11588, -20434, -34431, -27942, -7605, -898, -2916, -6154, -7123, 2592, 11129, 16952, 22688, 16805, 11798, -2244, 213, -917, -7852, -7472, 1979, 9155, 7276, 4761, 1735, 4906, -4431, -11725, -16161, -8700, -6550, 2932, -1304, -10763, -4272, -17001, -22872, -21867, -19070, -19397, -10978, -14285, -7787, -5426, -4902, -3213, 12534, 6895, -16132, -17985, -14030, -18574, -7085, -7171, -11573, -576, -1488, 17578, 26150, 19404, 9323, 2004, -1380, -10629, -11980, -5392, -280, -824, 3029, 2214, -6298, -22868, -20425, -9450, 802, 9101, 25350, 22588, 5361, 1045, -5260, -8248, -2906, 7759, 2431, 936, -7872, -9463, -974, 13621, 5717, -1768, -917, 7037, 1279, 134, -5740, -1713, -9934, -16594, -4594, -10037, -8666, -10774, -1942, 4942, 12136, -985, -1134, 4337, 2580, 2398, -15446, -30661]
7304c0661O490K4495J1555j5779p804j812q785l789Q505K055l263J811Q884P139
7290i59n257J6114J0269j2341n619l930j3369K191r577Q745K0840n262l577M445
7276B713J1887n046n771j359k757n470M611J2456q928k460J4876L721j965m915
7262A1593L385j2540p832p6l144j0750r334J461R443Q826q78O541J3348L507R745
7247B3295P493n969j1811p121n419q976p362p09J0534L496l371M355j019O878
7233D294j992n816P130P105o513r984L015M816k655Q823O599n943j0340j2003
7219a3464k17L227M783j551L858o532o589N956K973J469j1486l968Q601J1145
7205a795j995n319p201R330J8150P881j1148r914n664J307l210K2471m700n112
$$ y = [-30661, -24171, 324, 11879, -3900, -11704, -13516, -22301, -26090, -17585, -15530, -18793, -16982, -8098, -959, -6216, 9898, 20167, 7826, 2207, -1723, -15092, -12901, -22478, -13733, 7107, 1845, -1732, 2713, 14600, 9554, 3783, 2424, -333, -5803, -1192, 11264, 2336, -124, 14752, 18473, 16508, 11593, 14978, 2438, -5394, -5470, -8614, -19364, -28698, -27237, -17794, -8968, -9846, -3305, 10043, 13550, 23295, 30788, 24819, 13008, 5887, 468, -8508, -15870, -16579, -6045, -2549, -5920, -1565, -2584, 4294, 2302, -3514, 3616, 10721, 4208, -5776, -2761, 2055, -600, 8223, 14822, 8879, -1461, -13464, -13681, -10454, -5671, -7222, -3364, -9896, -16485, -10529, -7556, -6087, -17573, -21541, -12940, -1795, -3790, -9109, -16310, -6980, 11170, 19051, 7903, -2011, -7675, -6368, -9578, 12893, 8193, 3081]
7191C081M898m211n6k1884M329J6137l408m582l170o194q905J0989J0433r135
7177a1678L424q979m113m021l821m033Q590J6019n027K949p94j2498j3412O353
7163c1041J8780Q709R172l804j4304N587J4482Q927P202j7100n162j3450K553
7150i449P213O134N789p894J3225Q816j5799j2496m70q986j2013J447M756p404
7136b7131M644k444j623M036J0987o611M235J460N816p391M424P371k209M201
7122b35P702J713n143j0781l850L757r426K937O928q405n084r996m152K5439P608
7107i88p679p752R24k033Q604M073n681j1833L337K745j2020l828l250p61Q670
7092b7472Q703j5287n149j239J9595J4029O19j983L636m617n417N205J0793p457
$$ y = [3081, 7979, 3768, 3712, -18172, -13843, 2294, -1114, -5696, -8866, -15060, -23965, -12976, -2543, -11678, -8254, -17233, -21346, -25367, -29188, -33221, -24631, -8612, -13639, -10690, -11484, -23982, -37394, -31041, -12261, -3552, 5620, 1816, -12488, -6901, 7581, 16508, 23710, 6610, 1448, -12002, -9449, -2236, 3898, 9687, 1793, 15018, 23834, 8035, -4461, -4931, -13917, -25930, -24483, -19727, -27131, -22487, -24931, -26554, -22518, -11531, -18142, -13907, -12447, -6631, -14022, -9598, -2227, -4436, -235, 7467, 9180, 4037, -6744, -10594, -6837, -16263, -13326, -6398, -14803, -19887, -29883, -34035, -8596, -988, -8667, -16419, -15495, -17528, -8924, -4851, -10532, -22365, -19028, -16283, -28303, -32131, -35381, -36142, -27472, -18769, -34056, -39205, -40444, -20849, -6820, -6201, -8184, -4548, -9165, -14582, -9377, 1416, -6041]
7078f041r094L218J077k033J2535O098J051K616k493n166o678j0715M699R158
7064a768P925K805L578n12Q459L855k26p308j2319m23K595j7156P790J4001J709
7049A3005j17r424p288L51j558Q19j324Q402j423L612J414k283P975L174n465
7034I870p730p490o56r223N710j257K663l351m014N509J7077P705p592j6718k391
7019a1888l459J4384J4364j468j8483N894q222r803P992R451Q65l0J049m297M103
7004D52j0589M343J819j4788q947J1031J4425q219j7219Q428N548J0783j159p74
6990d866k504k020k222j873M419Q163j571l253j9749J36P678k80r292r995m552
6975d1781J5649j401o455L683K94R357J3087O588j35l619o341n861N930k17Q67
$$ y = [-6041, -15135, -11917, -10840, -12873, -338, 5760, 6811, 9427, 6934, 1768, -4910, -15625, -10926, -1768, 6157, 8962, 12540, 12028, 20487, 24342, 24116, 16808, 4489, 4066, 6661, -10495, -2705, 11296, 13005, 12888, 3464, -3824, -3473, -5031, -4212, -5536, 2866, 1443, 5055, 6469, 4186, 12161, 15335, 9870, 2140, -5350, -6006, -15229, -9519, -10776, -8113, -11464, -15478, -9969, 7108, 14813, 7221, -9497, -11888, -15347, -963, 13401, 11933, -6550, -656, -8878, -18681, -10689, -1238, -373, -403, 646, -3651, 452, -10137, -5794, -3975, -18763, -27710, -16679, -2254, -10473, -27692, -19264, -13716, -2933, -4092, -4866, -7370, -9390, -11612, -13485, -9066, -903, -2474, -5727, -25476, -25340, -17662, -17942, -27234, -37229, -41781, -26132, -27533, -33988, -30305, -30011, -20654, -7567, -979, -1114, -4733, -11074, -16935, -11005, -11222, -10355]
6960a0355L666Q4K631O751j0350k705J2833o328o057j727n382J2771O573M84p012
6945d123j6549p000m352N230O192J1431P111k288p122J3928K394n984k823p999
6931a1954j809J4469J0765r942j1733R184Q151J944o05n14j8874j3115q007J3901
6917a8139R327J094j3684m996N761J1949j0769N391J7081J3198J646j5097m716
6904a954p417n665k884J547O1q954M704J1061J3519K289m568R08l626Q896k339
6889E578K840R451m353k423n184N433M984Q354q753j4677m490K094R35q738M214
6874d735r601j1085K167p30m625l017Q933R565n910N669J0445n350o840o800L549
6859a8365L023J2334p07K216Q998Q066R768l793O00j828L041l038Q604l530K115
$$ y = [-10355, -6689, -6605, -3974, 2777, -7573, -10278, 2555, -3773, -9830, -11557, -16939, -4168, 2405, 2889, -4123, -20672, -27672, -32024, -26794, -20602, -9171, -2060, -4348, -11470, 2458, 4852, -1132, -3955, -11954, -13763, 706, 11471, 1529, -10204, -1020, 7131, 9075, 8470, 7956, -10918, -24033, -32040, -18139, -8812, -7718, -21402, -26398, -20637, -8688, -19457, -14066, 3015, 16213, 17859, 2762, -1954, -9371, -15036, -17920, -16373, -16312, -25266, -20562, -9501, 4018, 6307, 1739, 2647, -979, 7917, 5578, 8418, 17869, 13516, 11093, 5909, 11342, 16326, 24680, 15927, 1250, -3240, -1146, -211, -8949, -4735, -14336, -25421, -23254, -23984, -28609, -31626, -22693, -13128, -19038, -13369, -2924, -8274, -15114, -21914, -18365, -15342, -3008, -3715, -1499, 7499, 15565, 25333, 21540, 22140, 20312, 23353, 20315, 28919, 25389, 27504]
6844B7504n177l168j203l892j0130j157l997q379K245J482n733j2831K565J3863
6830h008M710N162K953K643J1524P893P199m140J4576K6101K2865J5277p555j9647
6816H1553k8112k2474j8966O568K109j1939p468m723n873R442M750j641n926N920
6802C220m624L319J13r741J1203J6072l887o627L329j208n249M894k915K442k136
6787H205j3973K850p198p751j640J4197L920j194M963J4570q855j2245J0590J6273
6773B2712o662k1823K885J1193n736R110M124Q18p077k3360j34M703O250j2407
6759a5404p837l31m840M043N852K1465N662j5374j0860j15n472R891P491o599
6745a2428j3889o26J358P429O068k180L658J1078M231r299O226Q370M300k0984
$$ y = [27504, 22327, 19159, 17956, 14064, 3934, 2777, -1220, -9599, -7354, -5872, -11605, -24436, -21871, -8008, -3298, 1864, 4817, 7460, 18984, 26877, 34076, 29936, 44512, 70613, 93478, 108755, 101200, 81553, 53441, 30967, 12001, 18569, 20678, 8739, 1271, -3452, -9325, 117, 4867, 3226, -2700, 3220, -1404, 1915, 2028, -7713, 3490, 19562, 15675, 9048, 12377, 11169, 5920, 10814, 7899, 10341, 8205, -5768, -2918, -10116, -17867, -19507, -5310, -1390, -2584, 2379, 16949, 8094, -4151, 6439, 22712, 16050, -5773, -2888, 8305, 2569, 11679, 15803, 16621, 9544, -13816, -13950, -9247, -2997, -15404, -23241, -23572, -28412, -24369, -18517, 2948, 8610, -6764, -17624, -17739, -23211, -13320, -5829, -12428, -26317, -26943, -25585, -18156, -12088, -14268, -10610, 468, 4699, -4600, 1626, 9996, 14296, -6688]
6731f688n419J2134N479o946n649o897l886j1874J1335P328J1410J4631L10j2469
6717B799j2214R72P337N019J786k382o762J6049J9206J079n330q737n066p631
6703F125M401N853o138K466m716j4043J7491K329j4316j3517K206O600L273j0174
6689a2160n149Q959K2067K896j2447Q029Q740o831l421q076P231P729m617j4836
6675a886r303Q170Q346q240J518R887J6002o456n804j1721l100N930k13n802O560
6660C888o549m86M446L134K65K877L97r236j4165m000K068L417Q41R84P396n019
6644i742K343R99j4060p828R279P816K731k79p293R957J5356M157m965r555k931
6629d015q373M075L318j236k921J156P295J054j0546j7853J306K522M199L341
$$ y = [-6688, -12107, 27, 5506, -1440, -7089, -13986, -17872, -29746, -18411, -11083, 327, 14958, 15268, 2799, -9415, -8443, -1106, 3913, 5699, 3317, -3445, 12604, 31810, 32889, 27559, 18822, 13756, 6125, 10526, 16379, 10241, 12707, 7991, -6052, 11439, 13768, -548, -14065, -11859, -5259, -1986, -12160, -17309, -8350, 13717, 16613, 4166, 12195, 20935, 14104, 10683, 2607, 9838, 17567, 12950, -1886, -11189, -3019, 5327, -2913, -1395, 8492, 24494, 18038, 12234, 513, -2587, 3343, 3130, -2672, 3888, -2661, -3147, 1299, 4433, 4698, 7575, 7972, -1264, -15429, -19429, -17361, -13944, -13103, -12119, -4723, -9742, -7399, -6400, -20460, -28288, -19009, -11193, -8462, -8741, -16034, -6077, 9279, 13436, 8471, -1084, -4015, -12388, -8313, -4995, -6231, -9152, -7996, -701, 353, -10193, -28046, -26740, -24218, -20019, -16678]
6615a6678K524p099m684Q698O58o315j087k345P003R295M569j2386O374M170j8508
6600b5811J0299R374O197k845J059j0850p594q40L135O506L402p630Q844R218
6586B464o493r86j0877j506l29L190R121M556j680N75O266q180m268O87m988r727
6570b2175O078Q032N492j4115l341p288N04L831O910Q757J1554j2242n370j1452
6556b4825O559L511q74J3234l764l817J750p490J5122J231p255J0008O525j1568
6542a653j733J650L963k15q323j0588o356k763p816J0037K1427N841K155j1517
6528e891k014L193J3243p736p833p815p08k375n553j283J1605M560Q693J93j0388
6513a0109r776M062k056J3153J148M678M712J0706m031L893j916o647j5172R411
$$ y = [-16678, -14154, -21253, -25937, -17239, -16581, -22896, -23983, -26328, -19325, -10030, -5461, -17847, -11473, -7303, -25811, -15512, -6138, 59, -2786, -1727, -12577, -20171, -21011, -17876, -11370, -7968, -15598, -6754, 2464, -4029, -5015, -15892, -17398, -17727, -14537, -5416, -860, -2540, -1965, 4301, -3879, -8147, -7460, -12448, -22175, -16097, -8065, -2573, -16688, -20029, -27317, -26813, -22982, -16072, -7315, 4239, -8003, -13373, -24825, -18266, -14755, -15629, -2395, -6159, -9976, -8226, -15716, -594, 637, -6618, 3390, 9915, -1653, -3386, -1736, 2227, 2012, -6311, -16899, -23255, -26018, -33834, -23797, -2370, 3471, 5626, -5891, -7905, -4712, 8531, 795, -7038, -14853, -15561, -17936, -23489, -24772, -13167, -8607, 86, 279, -10109, -19885, -15823, -17879, -4726, -3578, 1100, 5812, 16518, 12487, 16380, 14464, 7817, -7355, 2056]
6499B056K117j0250p440m901N219K691n169j830m19R066J9363o848j6868J8823
6485E610Q759r119n668J3122j167j2215q244n043J5549O311m865p559q902j393
6471a4824K660j0656J764J8616P923j1740l775j8073K395J1376M866n077R918
6458d627J0153j0240j0182k073J1919j0025N378Q962o597K318n907l219N094R496
6444D50P955L574Q665r8R286j923j1493k408r152j3279R395N509O922m496K031
6429A0938l364n593J2045J3477J658j7829r406o806j0129o097r490n798O435J7836
6415a2123O151L772J2024q543p53j3145k978J429j0791j7678N638J4070p513q099
6401c8539R177J4969R979O444P886P131M932k860j2280r777N774J9769L938j5543
$$ y = [2056, 4173, -6077, -13517, -18418, -13199, -10508, -15677, -17507, -17926, -8860, 10503, 3655, -13213, 5610, 14369, 5250, -418, 12704, 11537, -678, -8922, -13965, 1584, 7895, 3030, -4529, -13431, -14824, -12164, -22820, -21056, -2440, 5483, -6257, -10032, -28105, -25710, -14334, -9468, -14545, -4627, 5526, -4714, -14896, -16969, -5050, -15075, -9697, -735, -7332, -5014, -10921, -14140, -9046, 450, 8405, 11979, 20644, 20546, 29832, 27909, 16416, 14008, 4856, -8423, 972, 6481, 13403, 8907, 10938, 7574, 1981, 14026, 27503, 29161, 11332, 1926, -4880, -15009, -21106, -30596, -36394, -29959, -12123, -5972, -2200, 9824, 1281, 528, -12617, -15595, -14166, -24957, -42635, -36997, -22927, -30440, -38539, -29362, -14393, -4414, 2030, 9916, 17047, 21979, 19119, 6839, -2938, 2836, 22605, 26543, 11000]
6387A1000j7505K105k819o788n603j775p294J319m138L126N283n867o622N505
6373c0073k790J5537K4467N187K416L258j0621p63k122Q25q57j7504j0690M300
6359a9430J3226Q477L407r906l382P188J135K333j1907J991N319J1242K056o220
6345E529l228m244k2854j5515K591J1427N455Q999O868o094J3302K677j1971J368
6331e690M70j1449j5520J0990J4973N614L220o50j3719j5818N208R411P710J2608
6317G358P83j957M343j0885j5583O990J1751m649J090J5016j1194j6811j107J2418
6303b437k378p776J3598m024j0229Q685J18L010J2956n466j1669o026j0533O314
6289a5857J8688J4379q936j6760n38n839p355P692J39j068j5740M839J4581m255
$$ y = [11000, -6505, -4400, -7219, -14007, -19610, -21385, -28679, -27360, -31498, -28372, -23089, -28956, -35578, -30073, -32863, -17326, 7141, 12328, 14744, 18002, 7381, 6618, 4496, 5321, 4464, -13040, -23730, -19430, -6204, 2273, 5680, -4226, -7608, -420, 715, 3048, -8859, -6868, -1549, 9693, 11749, 5529, 2301, -1943, -24797, -40312, -37721, -26294, -20839, -11840, -4972, -11066, 2236, 4913, -7058, -5690, -5220, -16669, -32189, -21199, -6226, -612, 2608, 1958, -11761, -27579, -22371, -12960, -5250, 7358, 8141, 6184, 10527, -358, -15941, -8951, 2800, -1849, -759, 14257, 3063, -13748, -14855, -2437, -4815, -12591, 1007, -3017, -13246, -4561, -4443, -1433, 11523, 6057, -5612, -11638, -22171, -15857, 2831, 17210, 8274, -8486, -9024, -14863, -22218, -14526, -14387, -15455, -31195, -26356, -11775, -16030]
6275a6030O187m872Q562J3622q319r190Q220J3020O377j0507j3473p410L672J3567
6261C426L090j2528j1350O58Q039N46K851L367k469j230o248J1323R609o318r247
6246f481j3910m367o54J4395J6279j6234k6320P239J2476p101Q518J1129Q67k597
6232f761p271J241M148M052N29Q72q573j127J30J400P419J3636j3547r488p261
6217b0601P461J1035m775k463O653J3720o337j3801j1026l90Q110N257l174p088
6203a7419K569L352o192l848Q997J032r639R87O018j0643k418R338n281o476L547
6188b6076J1576N426o486j3098n476p96J0018N956P658m352m681J7010m82l887
6174g690M216J987J2491l351o704p28J094k2708j0569P153J7897q078p070M813
$$ y = [-16030, -9843, -14715, -6153, 7469, -850, -10040, -1820, 11200, 17577, 7070, -6403, -13813, -10141, 3426, 6516, -6012, -17362, -16704, -8665, -8119, -5268, -1901, -4370, -5600, -11848, -525, 9084, 2766, -6481, -20391, -24758, -25412, -11017, 5262, -10972, -37292, -30053, -17577, -24678, -16160, -5031, -4164, -6761, -14032, -12791, -8643, -4591, -4062, -3190, -11763, -12890, -12760, -11360, -3941, 9695, -3852, -13340, -20601, -13140, -2105, -6880, -9343, -2690, 11030, 4693, -9108, -20134, -20524, -12414, -7157, -10331, -17419, -14850, -11498, -17690, -21538, -12541, -11509, -21148, -20161, -14143, -24786, -27204, -17866, -23147, -29623, -26076, -14500, -9074, -15560, -28658, -34134, -34930, -24912, -18956, -11298, -15650, -20331, -3321, -3803, -7690, -3474, -1487, 11004, 7653, 949, 221, 1315, -21393, -31962, -24809, -6912, -14990, -22060, -17247]
6160a7247J5033O270j4073j8245K441J3961J5678O588q047Q36o216P923L419j0660
6146b339q439K397R695l464j0273l13O989q924p098j8L257J3876q099m904P95
6131a6862q913Q221L267N670J1600j79o810n746J1759n676n969L512J0410P620
6117A1904m461j7305j657o265m71k195N049n374k827P812R592k415n86N183J4355
6102A0339J132J772k866n751n330J3609M930n234j2247m479m594o69j1841M682
6088a6547K657k149Q053l033r550o179j267O998N80p307p913J5125K0559Q093
6074H120J844n878L173m678n141P302J974o641r54r960j1679J0493O838j8215
6060b3402K285N519o098K63J7393L368P774j84n966M970j274q017r612k561r5
$$ y = [-17247, -2214, 4056, -10017, -28262, -25821, -11860, 3818, 10406, 2359, 3195, -3021, 4902, 8321, -2339, -10778, -8381, 1314, -2150, -12423, -12736, -5747, -14671, -21769, -21787, -18530, -4654, -12753, -17657, -16862, -25775, -17554, -14287, -8617, 2983, 2804, -4006, -9752, 2007, -3669, -9638, -6126, 4284, 11904, 7443, -9862, -11519, -17784, -18255, -20450, -15401, -20775, -23602, -15790, -6198, -8613, -9199, -4016, 10339, 11471, 13243, 10377, 4626, -704, 12905, 17835, 12601, 354, -4125, -8719, -9388, -21229, -16547, -13890, -16039, -7986, -11019, -20569, -26748, -28015, -21017, -20437, -27744, -35657, -20532, 27, 8120, 9964, 4086, 7259, 2581, -2560, 4742, 6716, 75, -879, -10839, -22518, -12025, -5187, -23402, -21117, -15598, -21696, -21433, -4040, -672, 7102, 6918, 952, 5922, 4648, -3369, -12981, -15542, -15637]
6045a5637J1964j1012j792J324J4647J7695p454j3010k147n603J140O050p847
6032a1682O45M668l341q093M053J9464J483M17O004j5030p447j3214L542l75P13
6017a8193J1118n368K391R125j0734o5j430r829n227j047o275Q4Q900R16m581
6002c0215P832R562P459M745O265J5135j0225j6654j2255j4604K122J2066R509
5989i258j2176j2341p178O211J1930M51j599p836L424R384m016M716M641J211
5975a2436N677M937m207j3241j490r703q35K703N275J4237j894R856K957k401
5961e65q881K586J541R6q13P36J481O486N093n735j223j0684j4518L34J3570R596
5945i00P980J6571k741j1829o633m01m316m347Q237j815P208J532l463j023P543
$$ y = [-15637, -3673, -14685, -16477, -15153, -506, 17189, 9735, -3275, -5422, -11025, -9885, -3835, -11682, -11037, -6369, -9710, -17803, -13750, 5714, 7197, 7614, 13618, -1412, -8859, -22073, -18531, -18906, -18193, -7075, -12443, -10052, -927, -11661, -11726, -13156, -22985, -28212, -29259, -35534, -35450, -26550, -25634, -30215, -22383, -12821, -5362, -617, 5648, 20783, 10558, -6096, -18351, -32955, -30833, -18767, -9258, -21434, -33775, -40953, -34742, -22812, -22361, -23960, -31796, -28372, -18988, -23004, -18288, -13647, -12436, -6759, -1822, -6029, -19270, -20760, -30463, -31298, -28595, -23320, -9083, -10977, -1121, 1836, -565, -9446, -6860, -5319, -5223, -6036, -5300, -3819, 2667, 7760, 2025, 802, -9882, -24400, -24066, -10496, -900, 7080, 23651, 20910, 9081, 2448, 2047, -2269, -6616, 1621, -194, 7014, 8546, 5083, 4060, 11603]
5930A1603j3222n270n046N062O427q31r287k098J09J003j60m337M339P871M157
5915C20q80M138o285j764L770j0257O22O483Q732q354m281Q799r46k731p599L61
5899i872L122j2261M094K439j494N374q852j4623M12M763R689J5490j0634j3031
5885b5384P550J8241j759q743M364J606n801J652j18J182O687K094p26P812o84
5870G973j2211j4132Q579P895o818R87m805n252N838N501P978p549p507L200m025
5855a4348r313o278K088J295J0469j234O774J2878K0404k866j0460M737J0681
5842B4827l966J797Q683j4422j4012P296j150k849p933k0496r546p569Q507J4352
5828a6481O552Q955O570L826J827J108j1412r112M451m755k863P984R577j394
$$ y = [11603, -1619, -6889, -11935, -6873, -446, -1277, -10564, -12662, -12553, -11550, -11710, -16047, -11708, -3837, 320, -560, 3578, -2707, -4471, -701, -10958, -10336, -3853, 4879, -3475, -7756, 1043, 97, -2634, -10233, -9872, -6750, -19011, -14917, -12478, -13972, -8598, -17450, -32073, -31661, -26898, -17209, -1719, -12353, -25384, -17834, 407, -1352, -10095, -5731, -4125, -9926, -8274, -8392, -7210, -523, 1571, 845, 8657, 7973, -4238, -18370, -9791, -1896, -8714, -7727, -12532, -17784, -11946, -6445, 1533, -6016, -13523, -10323, -14348, -23661, -29939, -27851, -26556, -16087, -17321, -10547, 2331, 22735, 19869, 9409, 14146, 24827, 20861, 22658, 31341, 16919, 2907, 10203, 9053, 6204, -1729, -22225, -31771, -39340, -30833, -16481, -9929, -974, 5596, 9422, 11249, 12357, 945, -8167, -3716, -8471, -11334, -3350, 6227, 4833]
5814D833j2629O835P533o609j0807q254J4931M785k747p79J0530k109r647p385
5800a1519m245M366M592l737O554q334M558j383j5057r855p73J9289N274K152
5786h118j1637l787P856J4166Q511L499o787N684K0315j2641r11O838n003n560
5772A2425o379j8708J248J515j0638P900J2626K456L197l878M690l089L840j183
5758F022o775j3054q737J4499j298J599N887k542N09O805p70m7J1985N142k3121
5743c896j0683r231P042J16j312j1501n331K519O923l28j0053M423J1345J262
5729a8705k467J513L5M945L052J530J0591J2830J725r298j5837n272O02l084o746
5714b4586Q16P377k279Q278N399k14R647J3893n124L716L259j1441j8406q707
$$ y = [4833, -7796, -961, 6572, -37, -10844, -19098, -4167, 618, -2129, -2908, 7622, 5513, -4134, -11519, -15764, -11398, -6806, -10543, -3989, -12323, -7765, -9148, -24205, -34060, -34833, -15544, -10270, -8118, -19755, -23542, -15686, -1520, 6991, 10490, 3703, 9387, 29702, 17061, 16150, 22988, 17985, 12425, 6046, -12662, -11414, -9899, -20537, -12637, -11, 2445, 5642, 1764, 6454, 3365, 7205, 6022, -753, -13807, -22544, -8045, -9343, -7744, -1857, -4399, -3890, 2915, 2145, 2098, 14083, 19225, -3896, -14579, -23810, -16768, -16652, -17964, -29465, -34796, -32277, -25354, -25682, -35735, -31312, -19967, -18705, -21172, -19659, -19624, -14679, -11627, -10097, 494, 13324, 15049, 5751, -10086, -15358, -14756, -17840, -24586, -23770, -16393, -18672, -10394, -4995, -5209, 4438, 18331, 13207, 16923, 20182, 8741, -9665, -18372]
5700a8372J0171K2560n72o555j617j7986j7736L266J768P922Q344q988j0042J2018
5686a5819P414M017J064k079m775q919j164J4735P226j767l292p350O233j0101
5672a4577j451J958J1048k526q098k822L594N36j660k750Q604N340Q073j0855
5658e586r801Q183J823j9332O472J1071P838J737R504N033o938j2901j3353J2751
5644c499J8495Q993m963j920J4878N945o916j4677j4004n443J465k202j8111p962
5630b9921L818k643k268L13M235R965Q911P430J4638M529j5858j7226K123M594
5616g360j8142q668J28J538Q358j331O645K167P604Q894N594n371r513p227l815
5601b0499M169J0455j0459L825P075M914Q674m936K133J856K766n920o058l229
$$ y = [-18372, -8201, 14359, 13787, 7232, 5615, -12371, -30107, -26841, -25073, -17151, -8807, -17795, -27837, -15819, -8405, -4388, -3324, -5403, -10178, -19097, -20261, -5526, 1700, -67, -3359, -10709, -4476, -14577, -16028, -14070, -3022, -5548, -13646, -16468, -12874, -12338, -13998, -16748, -8144, -2804, 5269, -5586, -15387, -7204, -5381, -24713, -18241, -7170, 668, 2405, 11909, 16942, 10004, -2897, -16250, -3499, 14996, 23989, 19026, 17106, 31984, 37929, 31013, 16336, 2332, -3111, -1646, -3848, -21959, -29921, -26103, -28746, -31014, -30701, -26466, -16501, -7590, -160, 14478, 19007, 3149, -14077, -11954, -7360, -25502, -34170, -34042, -32504, -24146, -25477, -18832, -16665, -9061, -167, 5427, 56, -9457, -16684, -20499, -16330, -5875, -16334, -12509, -5434, -520, 8154, 3218, 5351, 7207, 9973, 4053, -2005, -5234]
5587e234M903j2756j257K081k742J4672N138q044K500M429P865J711K488L810
5573A9564J273j665N861J2341k8073k4610j3445j0769J1613Q586k263N645J3033
5560b909J3270j81M835o618k1661k253R427n339O478L399P553M269j51j2686j9488
5545b2055N97q126L215M293k366J4816L174r073p009M033K1411N464j0484o874
5531h984k589N559M160J587j354O58p71J1445j0178j5097r11P585J0915j625M789
5516E189n598J387O264l096n366j673j0695J615L783Q874M288j023p482M614k281
5501a200j1047j094J7361K343j4542J855r161m322O145q531N055J1632j2654m850
5487b3010o848q08J9608Q533l129j3025p59N873q053l351Q003Q501j4242J508
$$ y = [-5234, -331, -13087, -14344, -12263, -15005, -333, 4805, -3239, -739, 3690, 11555, 13266, 15754, 19564, 20837, 19172, 25033, 37374, 9301, -15309, -28754, -39523, -27910, -19324, -21587, -15942, -2909, 10361, 10180, 15015, 8397, -13264, -15517, -6090, -11429, -4951, -1552, 6001, 10270, 10119, -2567, -22055, -21458, -29584, -26369, -22076, -24442, -9626, -6452, -15525, -22534, -18501, 2910, 8374, -2110, -8984, -11573, -6014, -1854, -267, -1621, -963, -1734, 9711, -467, -15564, -16475, -8890, 2025, 400, 5189, -409, 978, 7242, 4146, -1220, -2893, -13588, -11973, -8190, 684, 4972, 3949, -3533, 1081, -1200, -12247, -13341, 4020, 6363, -8179, -6324, -15485, -19807, -13662, -22193, -17138, -5506, -18160, -23010, -29858, -30666, -11058, -2525, -5654, -18679, -19438, -13565, -21618, -24969, -16966, -8465, -22707, -21199]
5473b1199J2924J6433K401j4179R443K287R319J1026k275K352n358p496l125l868
5459H685q303r954O720P151M324q678J747nM410M971m469l768m010K231J121L253
5443E426P037L036j829j0928m424N286J985o44r721O576J5521N05l552r359j0220
5428e305J0385Q503L318l457n475q315r346P309Q548l992j4300l087j0364k427
5414b8005J2398l748P528J2834J2840j1326j8548J9259J2844J2465p879j5396
5402E266K739l013L50P871J1133q213N608m502j1824k672j0270N041N064K820
5388E398J2003n560j0593O513M304m297k2091Q935N492M112K229J7484M491r539
5374A8881K396q991j1746o574K647O912J2353o697q619k0440o830R389M759L266
$$ y = [-21199, -8275, 8158, 10559, -3620, 5823, 8110, 17429, 28455, 26180, 28532, 23174, 15678, 12553, 8685, 382, -9572, -2852, 4299, 8623, -55, 1692, 1687, 6097, 11068, 6599, 2831, -1179, 1052, 2173, 5426, 12463, 15499, 13670, 2742, -1682, 3604, 5589, 4945, -4776, 1800, 17321, 17826, 14274, 4915, -5305, 5080, 13583, 16901, 13444, 7969, -346, -9692, -2383, 6165, 2173, -12127, -15214, -25578, -28005, -15607, -19355, -11827, 1007, 13847, 2521, -16027, 3232, 16076, 28541, 20662, 5266, 8005, 4992, 5342, 13213, 24346, 16133, 21741, 17239, 5415, 2743, -7527, -2486, 2578, 5398, 17401, 11841, 1248, 7761, 12065, 7768, -14323, -5388, 104, 4216, 6445, 23929, 28420, 18881, 21277, 12286, 540, -6034, -3387, 3525, 15878, 9181, 562, -19878, -26708, -17319, -12560, -9294]
5360i294L035l673j313J0577l148k1087L261L369j3242R18P546K9339M275j2469
5346a906O258r485j2109j607J2568L664p481O295l846O075J4577k723j8615j781
5332a0116l322J230j566p75J6624J6879J58L055j5679j0960m541j541N614J0442
5318E502l594l0p691k985p922K830m425p475m892m376J3850R036J5564J84L586
5303G162o019p057K590K875j1432l723J6782k939n372j2213O897P559o20p933
5289a3443K481Q028J7958M207M260j0947r478j1453j474O882m68l218m151J2038
5275A222J707K365j1571r139j039m777R025J9160J944o103q944l485O314L088
5261b33j020k344M081J9266j965L726k075N498j51o602r228J557Q667l51l05J0818
$$ y = [-9294, -6259, -9932, -11245, -668, -3816, -24903, -21642, -18273, -31515, -30597, -23051, 6288, 10563, -1906, 4352, -5133, -17242, -18849, -6281, -2617, -10098, -3803, -7649, -1574, 13003, 10280, -8335, -10116, -13438, -12208, -13774, -14549, 2075, 18954, 19112, 22167, 6488, -4472, -9013, -10554, -4940, 5502, 1908, 1878, -5813, -8798, -16720, -13890, -18315, -25790, -30682, -35058, -21208, -12172, 3392, 3576, 7162, 1143, -5914, -3324, -449, -11881, -15604, 1178, -1761, -7133, -19346, -12449, -4890, -5510, -13443, -10962, -2934, 15024, 19231, 23491, 12544, 3066, -8387, -9861, -2979, -3447, -6665, -10816, 1222, 2929, 5294, -6277, -15416, -16455, -21232, -12207, 6953, 8897, 2794, -6150, -9635, -3321, -233, -1253, -3597, 484, 19750, 17785, 21511, 19436, 24934, 24783, 18181, 8953, 10510, 19177, 18826, 18521, 29339]
5245B9339k469j2465m95P25Q362J51r513q074r156L305P322P416N902j427r438
5230I485L646j1362r20L041l876L507p894q859r108j070P962Q174J918J7669k146
5215A0167r528j242N561J175Q625r388K715O81o273r063l040k442L280O07L982
5200d183K23K20p144k756j5052j0627Q86J3853O27k269r21q397O593J7898R045
5185b004L283J322j76q195o622r80L286j78k804J2035R187j411r753K298n165
5170e877m269Q891R808N907o873j6131P859J6488K291J360j769j270J0154j505
5156B5064j4253l633J8363q773k1235o264j4491P288K1953P650p84L137Q44n633
5142I233k2590k415R761Q185J713m480l142o513n082O144O782q323l303N876J2900
$$ y = [29339, 26870, 14405, 13910, 14635, 22997, 23148, 13635, 5561, -3595, -290, 7032, 14448, 20350, 18923, 9485, 13131, 1769, 849, 3890, 14, 3521, -4373, -13232, -22340, -23410, -15448, -7274, -5356, 12313, 10167, 639, -603, 4958, 6133, 14758, 5370, 8085, 8766, 2493, -6570, -9610, -12052, -8772, -8165, -4183, -3960, -3740, -10884, -13640, -28692, -39319, -38433, -24580, -23953, -26222, -27143, -35540, -28947, -11049, -2004, 1279, 2601, 2425, -5770, -12392, -13372, -10086, -10264, -13068, -1033, 8154, 6743, -3010, -712, -5877, -10146, -1255, 8553, 14460, 7587, -8544, -685, 15803, 18094, 19454, 17685, 16415, 26569, 25064, 10811, 7178, 25541, 16768, -4467, -10731, -25222, -17934, 4019, 11669, 10885, 14022, 14866, 9233, -13357, -15772, -6011, 2174, 3887, -593, -3735, -10248, -15330, -9186, -2404, -10727, -14030, -8154, 4746]
5127D746L998l966k262m05J5856j784j6614m903r809J3114J5126K889j7192o324
5113g530Q30j1452J7433K2329q392L702P889l693j765q86j1761n616K612q442
5099d742j663J6773o117k311j127J854J916o814p097O869J057N908L669n720j63
5084B292J323j419o042L684K2474P845j4479j4502k379L209m142J1598J902l594
5070G770k165j605J688R258M465p692r006p765L491j3887K562O451R862N281j1362
5055b654M571l119q736M339P913j67M378J0931k95j3863K650J2562j674K711Q186
5040B7733l777j0990M467q525q2N390j3174q49P486k187j5444p291L467N111M098
5025d567J1168n414R762o561o875J4457j5711o988N150K751Q186L880j3049o943
$$ y = [4746, 8744, 4778, 2516, 2111, 17967, 16183, -431, -5334, -15143, -2029, 13097, 15986, -1206, -7530, -6700, -18152, -719, 21610, 13218, 16920, 24809, 21116, 19351, 18465, 6704, 1088, 3700, -4742, -6405, 10368, 4251, 1940, 813, 2667, 4583, -2231, -9328, -2459, -1402, 4506, 8175, 2455, 2292, 3615, 2196, -3846, -162, 22312, 30157, 15678, 1176, -1203, 2006, -2136, 9462, 11364, 7770, 5605, 4000, 5688, 14946, 19411, 11719, 2713, -5052, -1561, -15448, -12886, -6435, 3427, 8708, -2654, 1917, -1202, -9938, -5599, 2314, 2147, 6525, 17456, 17161, 3298, 5948, 18510, 16836, 19547, 27733, 23956, 12966, 17433, 8908, 8826, 14216, 1042, 193, 7679, 5492, -9952, -17243, -13776, -8665, -4567, 6601, 1187, 10949, 4388, -2487, 11970, -3741, -10729, -5579, -2828, 5358, 9238, -3811, -10754]
5011a0754j600M157l650K083R619k50q335N654L867k833l369K077J4708J1468
4997B2842n261n903l435j1657j970j910R310L036j481R605R522o637M536j5686
4983D911q991J452K485J257J5505l502j2207l85p655K216J1757m052k278m391
4969c878m068L974K264P312m074m588Q150l30L788o845m849k465L594J111j198
4954b102M281j489q143N565j831j137R968k025m535Q50l543R34K76l96O809N174
4938H656j405j755j6802P76J3003J0672j1429j6835L876M374J0257N064J20j2658
4924d086P135R450P00Q93L208O58j427j7269q526K775J3492M74j488k678O276
4909I587r139p111q886q896M809j944M950m449J2536J4607o659p373o467N471
$$ y = [-10754, -12354, -8197, -11847, -9764, -145, -395, -8730, -3076, 791, -2042, -5411, -3334, 11374, 22842, 17581, 11678, 8243, -3414, -5384, -7294, 2016, 5052, 3571, 13176, 22698, 16061, 20597, 4911, -4080, -2628, -143, 1114, 16619, 13117, 910, 525, -7130, -4914, 6843, 2791, 513, -3878, -7946, -3972, -1708, 5604, 1530, -3058, 5092, 4762, 8550, 1705, -3144, -5609, -2015, -904, -2102, 2179, 690, -7453, -1888, -3719, -4856, 5112, 3087, -1448, -598, -4141, -3207, -2931, -3327, 3482, 8656, 7251, 5496, -11306, -10530, 2473, 13145, 1716, -15119, -11243, -6869, 3388, 8452, 8572, -4086, 3049, 12499, 13199, 14092, 17300, 17958, 16531, -738, -9264, -6489, 7003, 7477, 5989, 3311, 9587, 448, -6663, -15549, -24445, -19636, -21580, -16630, -21079, -8543, 6064, -595, -7968, -14435, -8964]
4895h964J0040k759L536q370r379M215M589j0614M698Q557j131j3947j422m689
4881b5640J9560O173p995M75O686L814K127o198l844M674N68m845j993J2622j970
4866D214l589L260n92R306l35q394J498N484n683j7390j0280P612R599J380Q167
4851D257n014O605L590l88R172O173l357j1032m8J3046j069j2054r781N852O599
4836A2551o114j5173j9871q41j640J7375m859o238J0872N195m489l567o889k701
4822b6389J226j365j1281J3385J7241J4124J258j4020k0157o489O042J1743n297
4809a9979N886R014N142m83j8584o634K3986J7887j7387j4163R675P165J7200
4796A8725Q868j956l72j1017J0575k971j4731o517M202j371o443m29n886N718
$$ y = [-8964, 1076, -1683, 1853, -6517, -15896, -11681, -7092, -17706, -13008, -4451, -5582, -19529, -20951, -25640, -6080, 93, -7902, -7427, -741, 3073, 5200, -998, -4842, -168, 400, -4445, -6438, 6184, 4214, 625, 3885, 3293, 12599, 12264, 3870, 5368, 10852, 5169, -12221, -22501, -14889, -5290, -3910, 4257, -757, 5848, 9438, 9050, 18222, 24395, 21038, 10006, 9958, 23004, 21935, 9881, 100, 5952, 12551, 6437, -8736, -28607, -29448, -31088, -13713, -18572, -24810, -13938, -8743, -13232, -16799, -23688, -26389, -25163, -26528, -37809, -24424, -7183, 6941, 8199, -5821, -25978, -32467, -26425, -14682, -19979, -14093, -5079, 63, -420, -19004, -25638, -1652, 16235, -1152, -15315, -5640, 1525, 18725, 27593, 25637, 25265, 14248, 24823, 21852, 7121, 604, 4806, 3435, -3008, -3437, -9323, -3605]
4782c605J046j512K742j4616M603j307J0289k762j712P370j2572q073L879Q646
4768g584M643R96J555Q88M124j684o699L985l377j3128J990J6487M673M600Q59
4753A2328m82o499k711r839l552Q76P300N335l424l785K478j0211p881k451J4117
4738h401K457M689o958j2626o377K318J4156P048q085j9018J1196L13j575J6268
4724d595J2806q389j2577L519K2048O380o303j0763k331p367j406R902Q707j334
4710H297j5984n174m213M974R399o29L874J2118j2562j2183L564m174j2215j13
4696b5021K1913p124O597L510q719J316M876K054j3325m812J4281m815j40O72
4682h737J0498l226J524M969k6n022j2026n234P098O710k39l50N609J3659Q643
$$ y = [-3605, -2559, -4071, -1329, -15945, -11342, -12649, -2360, -5122, -6834, 536, -12036, -20109, -16230, -7584, -2941, -1945, -390, 498, 4622, 2938, -3761, 224, -3153, -16281, -14291, 2196, 6869, 11469, 12328, 11846, 5347, 2636, -7203, -10755, -9879, -2579, 2756, -668, -4453, -1975, -12186, -20067, -22518, -8401, -5944, -1255, -8213, -20839, -27216, -24898, -10742, -3694, -11779, -30797, -19601, -19288, -20863, -4595, 8211, -178, -12755, -9236, 12812, 19192, 12889, 2126, -205, -7572, -8978, 924, 9631, 8297, -7687, -12861, -17074, -12100, -2701, -3330, 544, 12662, 100, -12083, -8519, -12693, -24908, -25021, -3108, -10232, -3635, -125, -8844, -7528, -2652, -598, -13923, -18735, -4454, -9269, -9409, -8737, 1761, -1465, 59, 5028, 5002, -20, -12046, -17280, -10182, -3472, -3711, -4061, 1548, 15207, 23850]
4667B3850l8j2668q903j3327N310J3469j1187n868P281m808j454J0541R454J21
4653A1773p341j6356K75M334Q264R901j961j3697j3452R418Q412J4816Q825O874
4639C0085j0915k0183j3078m866J496J3719O349n373j0273j0598J7302Q900j0798
4626h233p35m845m19K557k842N220L900L224l275j3316J0402L82j844O814R416
4611F406L552K966p57J275J1371r619J54J1001q029O498K887r875q433j2487m347
4596g437k109q064p833O703J242q171J1561K6706l293j7118P980N518m440Pj134
4581A18j723M170M10j6319j4368M097O564P802J7014R262k436j1909l417j982
4567b717Q17M861m819j347M682k841P074J236k0867j361J3688J1254q823j664
$$ y = [23850, 23812, 11144, 2241, -11086, -5776, 7693, -3494, -9362, -2081, -6889, -8343, 2198, 11652, 11773, 4432, -11924, -11649, -7315, 949, 10850, 8889, -4808, -18260, -8842, -430, 14386, 23211, 30085, 19170, -1013, -14091, -18957, -17461, -3742, 2607, -2766, -13039, -23637, -6335, 2565, -8233, -8968, -13813, -14232, -11675, -14517, -9297, -5397, -2173, -5448, -18764, -8362, -7980, -9824, -3010, 6406, 9958, 12924, 12167, 13442, 24813, 15194, 15348, 26349, 18320, 24818, 27705, 17830, 9397, -3090, -7437, -9546, -17610, -25443, -18740, -17498, -25669, -14108, 12598, 9305, -7813, 167, 5685, 1245, 1252, 118, -1605, 2565, 2975, -13344, -27712, -23615, -17051, -9249, 7765, 17027, 14591, 2682, -735, -2717, -1900, 2961, -1858, -3205, 1477, -1364, 5710, 6946, -13921, -15282, -1594, 9660, 837, -827]
4553h27K807o159j272l627O484r334q162k153Q647k241M8L545J0800K1112R83
4538B0651p956j2314q363j830L390J525o080J838p225j2684Q600J1086J8838R261
4524A8737j0155m843l349J1698m042j4193m127L111R971k950r377K074J0874R004
4510A2433j3982j1288n579J0888Q90P373l614j850l59p771J1636P626r506N677
4496B574M710j379j99n808r116N319L835m895r488Q39K0514L713o988n200j0886
4481a2455o785k07J6794N566j2537R749j1576l176P524P599N996J1217j0555n536
4467A618L07J415L471N245j6182l303J151L538J0661j205n238p581j3174L47p538
4452b6468K080Q817J0791p47R250J578K930n176Q37P412j1191n703J931K1421
$$ y = [-827, 1980, -4179, -5451, -9078, -2594, -11928, -20090, -22243, -13596, -15837, -15789, -12244, -1444, 19668, 20651, 12695, 381, -7982, -9812, -6422, -4897, -10977, -9139, -16364, -29048, -20448, -9362, 9476, 18737, 8582, 3739, 390, 12088, 8046, -6147, -10274, -7163, 2808, -142, -9519, -7445, 3429, 12433, -1549, -12837, -18416, -7528, -6638, 735, -2879, -4729, -5088, -12859, -1223, 6403, -3103, 2574, 7284, 5905, 5706, -102, -9218, -3899, -64, -4959, -14447, -13608, 6906, 10619, 3631, -1569, -12455, -19240, -19447, -2653, 2913, -9624, 125, -11451, -14627, -7103, 496, 6492, 17709, 7154, 1618, 1925, 3340, 6811, 12056, -4126, -7429, -6278, -2740, 7921, 6716, 1478, -6103, -19277, -18930, -26468, -24388, -15571, -4780, -5527, 3723, 5301, 8231, 3055, 3892, 11304, 113, -5590, -3659, 17762]
4438A7762O934o424j1884n013j927J041j2127R455J3794K984j0952j3497o440
4425a6294m799j288q491J4391M129K920j0080l620M317P150J0473m708m077K753
4411g224J770j409N798J0118o568m283N65Q194M088q182j0584m286J0383O825
4397E205p103q388k349L148j4634q107J1662m491R205N120Q86J969P092K97j1852
4382a2340o933K762K214P466K339Q732K0925M462p529p144N002m552r209j870
4368D325l782p02r611k517l742N401k091j061n115O96r988p13j921k28J8946J2899
4352G96m88J3p901M628O126K418p265N622J334Q939J4034Q697J212L221q875k9067
4336C444j0319O922J364j47K64j0034p695J6541J4869J18K201j8355K240m287
$$ y = [17762, 24696, 18272, 6388, 1375, -552, 489, -11638, -2183, 11611, 14595, 3643, -9854, -16294, -21093, -22381, -30872, -16481, -12352, -9432, -19512, -23132, -18815, -11665, -1192, -5900, -9977, -7224, -5454, -6863, -1065, 9053, 2485, -1798, -1233, 6961, 11049, 2867, -7717, -12003, -1620, 5205, -1898, -10286, -12635, -9487, -24121, -32228, -20566, -25057, -15852, -10732, -9846, -7877, -785, -488, -12340, -19273, -16511, -14297, -6831, -4492, 4240, 25165, 29627, 22098, 14954, 19956, 15404, 6195, 4325, 543, -159, -9770, -12287, -16029, -10628, -12719, -13780, -18895, -18199, -28187, -28900, -30821, -31049, -12103, 796, 308, 321, -7580, -2952, 3174, 5592, -1673, 3949, 5283, 14222, 28256, 36953, 38165, 41386, 32511, 3444, -6875, 47, 1411, 1264, 1528, -8506, -16201, 340, 15209, 15327, 17528, -827, 1413, -2874]
4322b874n410n86k336m420R63K0080J8927k505j0857l2095N263J7424K930K61
4308D765p137j626Q77K893J2030J1864j8261j4334N910Q143n318J4130J4217j4943
$$ y = [-2874, -8284, -8870, -11206, -15626, -14663, 5417, 24344, 21839, 10982, -21113, -15850, 1574, 4504, 4765, -2372, -3998, -3121, -228, 11802, 23666, 5405, -8929, -3019, 5124, -194, 13936, 28153, 13210]
$$ [...]
##END NTUPLES=NMR SPECTRUM
##END=
