##TITLE=Analysis number 323280
Compound Code cc 60416
Book Reference 470/113
Project Code adrs
Chemist Name mikem
##JCAMPDX= 6.0         $$ Bruker NMR JCAMP-DX V2.0
##DATA TYPE= NMR SPECTRUM
##DATA CLASS= NTUPLES
##ORIGIN= Bruker BioSpin GmbH
##OWNER= nmr
$$ XWIN-NMR		Version 3.5
$$ Fri Oct 20 11:56:04 2006 GMT Daylight Time (UT+1h)  MAYBRIDGE\nmr@NMR_250MHZ
##.OBSERVE FREQUENCY= 250.131544655141
##.OBSERVE NUCLEUS= ^1H
##.ACQUISITION MODE= SIMULTANEOUS (DQD)
##.ACQUISITION SCHEME= undefined
##.AVERAGES= 16
##.DIGITISER RES= 18
##SPECTROMETER/DATA SYSTEM= dpx250
##.PULSE SEQUENCE= zg30
##.SOLVENT NAME= CDCl3
##.SHIFT REFERENCE= (INTERNAL, CDCl3, 0, 16.522)
##AUDIT TRAIL= $$ (NUMBER, WHEN, WHO, WHERE, WHAT)
$$ ##TITLE= Audit trail, XWIN-NMR		Version 3.5
$$ ##JCAMPDX= 5.01
$$ ##ORIGIN= Bruker BioSpin GmbH
$$ ##OWNER= nmr
$$ C:\u/data/dgb/nmr/ADRS/1030/pdata/1/auditp.txt
$$ ##AUDIT TRAIL=  $$ (NUMBER, WHEN, WHO, WHERE, WHAT)
(   1,<2006-10-20 11:55:44.04 +100>,<MAYBRIDGE\nmr>,<NMR_250MHZ>,
      <created by zg, POWCHK disabled, PULCHK disabled
       configuration hash MD5:
       49 4B E0 1D 92 C2 6B 37 9F E6 65 BC 52 41 86 1D
       data hash MD5: 64K
       A6 44 9A 93 51 54 20 FE A6 88 48 C6 97 40 D9 70>)
(   2,<2006-10-20 11:55:56.40 +100>,<MAYBRIDGE\nmr>,<NMR_250MHZ>,
      <Start of raw data processing
       ef LB = 0.3 FT_mod = 6 PKNL = 1 SI = 32K 
       data hash MD5: 32K
       58 69 A4 14 26 83 76 AE FA 5A 82 98 81 D5 07 12>)
(   3,<2006-10-20 11:55:58.11 +100>,<MAYBRIDGE\nmr>,<NMR_250MHZ>,
      <apk 
       data hash MD5: 32K
       B1 F5 0F D2 7F B0 E9 90 70 4E 76 03 0B 8D 4B D0>)
(   4,<2006-10-20 11:55:58.86 +100>,<MAYBRIDGE\nmr>,<NMR_250MHZ>,
      <abs ABSG = 5 
       data hash MD5: 32K
       FC 24 A5 3E D6 65 80 B3 DC BD 83 49 40 07 49 FC>)
$$ ##END=
$$ 
$$ hash MD5
$$ 2A BF F2 7E 5A 63 84 B1 38 DD EB F6 0E 15 44 42
##$RELAX= 
##$RELAX= 
##$RELAX= 
##$RELAX= 
##$RELAX= 
##$RELAX= 
##$RELAX= 
$$ Bruker specific parameters
$$ --------------------------
##$DU= <C:\u>
##$EXPNO= 1030
##$NAME= <ADRS>
##$PROCNO= 1
##$TYPE= <nmr>
##$USER= <dgb>
##$AMP= (0..31)
100 100 100 100 100 100 100 100 100 100 100 100 100 100 100 100 100 100 
100 100 100 100 100 100 100 100 100 100 100 100 100 100 
##$AQSEQ= 0
##$AQ_mod= 3
##$AUNM= <au_zg>
##$AUTOPOS= <7 >
##$BF1= 250.13
##$BF2= 250.13
##$BF3= 250.13
##$BF4= 250.13
##$BF5= 500.13
##$BF6= 500.13
##$BF7= 500.13
##$BF8= 500.13
##$BYTORDA= 1
##$CFDGTYP= 0
##$CFRGTYP= 5
##$CHEMSTR= <none>
##$CNST= (0..31)
1 1 145 1 1 1 1 1 1 1 1 1 1 1 1 1 1 1 1 1 1 1 1 1 1 1 1 1 1 1 1 1 
##$CPDPRG= <>
##$CPDPRG1= <>
##$CPDPRG2= <>
##$CPDPRG3= <>
##$CPDPRG4= <mlev>
##$CPDPRG5= <mlev>
##$CPDPRG6= <mlev>
##$CPDPRG7= <mlev>
##$CPDPRG8= <mlev>
##$CPDPRGB= <>
##$CPDPRGT= <>
##$D= (0..31)
0 1 0 0 0 0 0 0 0 0.06 0 0 0 0 0 0 0.0002 0 0 0 0 0 0 0 0 0 0 0 0 0 0 
0 
##$DATE= 1161341743
##$DBL= (0..7)
120 120 120 120 120 120 120 120 
##$DBP= (0..7)
150 150 150 150 150 150 150 150 
##$DBP07= 0
##$DBPNAM0= <>
##$DBPNAM1= <>
$$ [...]
##$SUBNAM7= <"">
##$SUBNAM8= <"">
##$SUBNAM9= <"">
##$SW= 20.6930455092707
##$SWIBOX= (0..15)
0 0 3 0 0 0 0 0 0 0 0 0 0 0 0 0 
##$SW_h= 5175.983436853
##$TD= 65536
##$TD0= 1
##$TE= 683.16
##$TE2= 300
##$TE3= 300
##$TEG= 300
##$TL= (0..7)
0 120 120 120 120 120 120 120 
##$TP= (0..7)
150 150 150 150 150 150 150 150 
##$TP07= 0
##$TPNAME0= <>
##$TPNAME1= <>
##$TPNAME2= <>
##$TPNAME3= <>
##$TPNAME4= <>
##$TPNAME5= <>
##$TPNAME6= <>
##$TPNAME7= <>
##$TPOAL= (0..7)
0.5 0.5 0.5 0.5 0.5 0.5 0.5 0.5 
##$TPOFFS= (0..7)
0 0 0 0 0 0 0 0 
##$TUNHIN= 0
##$TUNHOUT= 0
##$TUNXOUT= 0
##$USERA1= <user>
##$USERA2= <user>
##$USERA3= <user>
##$USERA4= <user>
##$USERA5= <user>
##$V9= 5
##$VALIST= <valist>
##$VCLIST= <CCCCCCCCCCCCCCC>
##$VD= 0
##$VDLIST= <DDDDDDDDDDDDDDD>
##$VPLIST= <PPPPPPPPPPPPPPP>
##$VTLIST= <TTTTTTTTTTTTTTT>
##$WBST= 1024
##$WBSW= 4
##$XGAIN= (0..3)
0 0 0 0 
##$XL= 0
##$YL= 0
##$YMAX_a= 352151
##$YMIN_a= -371731
##$ZGOPTNS= <>
##$ZL1= 120
##$ZL2= 120
##$ZL3= 120
##$ZL4= 120
##$ABSF1= 16.522
##$ABSF2= -4.171173
##$ABSG= 5
##$ABSL= 3
##$ALPHA= 0
##$AQORDER= 0
##$ASSFAC= 0
##$ASSFACI= 0
##$ASSFACX= 0
##$ASSWID= 0
##$AUNMP= <proc_1d>
##$AZFE= 0.1
##$AZFW= 0.1
##$BCFW= 0
##$BC_mod= 0
##$BYTORDP= 0
##$COROFFS= 0
##$CY= 12.5
##$DATMOD= 1
##$DC= 0
##$DFILT= <>
##$DTYPP= 0
##$F1P= 14.0000005364418
##$F2P= -0.99999901652339
##$FCOR= 0.5
##$FTSIZE= 32768
##$FT_mod= 6
##$GAMMA= 0
##$GB= 0
##$INTBC= 1
##$INTSCL= 1
##$ISEN= 128
##$LB= 0.3
##$LEV0= 0
##$LPBIN= 0
##$MAXI= 10000
##$MC2= 0
##$MEAN= 0
##$ME_mod= 0
##$MI= 0
##$NCOEF= 0
##$NC_proc= -4
##$NLEV= 6
##$NOISF1= 0
##$NOISF2= 0
##$NSP= 0
##$NTH_PI= 0
##$NZP= 0
##$OFFSET= 16.522
##$PC= 1
##$PHC0= -52.60971
##$PHC1= 6.347044
##$PH_mod= 1
##$PKNL= yes
##$PPARMOD= 0
##$PSCAL= 4
##$PSIGN= 0
##$REVERSE= no
##$SF= 250.13
##$SI= 32768
##$SIGF1= 0
##$SIGF2= 0
##$SINO= 400
##$SIOLD= 32768
##$SREGLST= <1H.CDCl3>
##$SSB= 0
##$STSI= 32768
##$STSR= 0
##$SW_p= 5175.98343685301
##$SYMM= 0
##$S_DEV= 0
##$TDeff= 65536
##$TDoff= 0
##$TI= <Analysis number 999999
Compound Code 99
Book Reference 9
Project Code 9>
##$TILT= no
##$TM1= 0
##$TM2= 0
##$TOPLEV= 0
##$USERP1= <user>
##$USERP2= <user>
##$USERP3= <user>
##$USERP4= <user>
##$USERP5= <user>
##$WDW= 1
##$XDIM= 32768
##$YMAX_p= 484869180
##$YMIN_p= -113473
$$ End of Bruker specific parameters
$$ ---------------------------------
##NTUPLES= NMR SPECTRUM
##VAR_NAME=  FREQUENCY,     SPECTRUM/REAL,   SPECTRUM/IMAG
##SYMBOL=    X,             R,               I
##VAR_TYPE=  INDEPENDENT,   DEPENDENT,       DEPENDENT
##VAR_FORM=  AFFN,          ASDF,            ASDF
##VAR_DIM=   32768,         32768,           32768
##UNITS=     HZ,            ARBITRARY UNITS, ARBITRARY UNITS
##FACTOR=    0.157963299565203, 1,           1
##FIRST=     4132.6476996994, 0,             0
##LAST=      -1043.33573715361, 0,           0
##MIN=       -1043.33573715361, -113473,     0
##MAX=       4132.6476996994, 484869180,     0
$$ Real data points
##PAGE= N=1
##DATA TABLE= (X++(R..R)), XYDATA
$$ [...]
20216 -13524 2178 26483 27971 11768 -5189 11861 36362 57015 42986 28014 18576 7299
20204 7299 9042 261 -4694 22881 18345 2712 -12451 -23542 -26573 -14899 -7871 -15229 -9606
20191 -9606 -12661 -5683 11393 17553 1387 -22597 -31692 -43121 -28608 5082 1580 16382 36603
20178 36603 29204 10933 -4366 -21855 -33828 -16963 2308 10873 25000 33579 35915 21778
20166 21778 12256 16081 16275 6774 12125 -12669 -39868 -45786 -37096 -36334 -19616 8118 12718 7394
20152 7394 -11931 -7837 -17659 -25792 -15828 -15028 720 -1935 -730 22907 36193 40422 62094 48902
20138 48902 27883 10283 27055 40056 11911 -7740 -2526 4580 -2828 8406 25310 1139
20126 1139 -14211 -13270 -7377 -16356 -34105 -23652 -10159 5392 1205 -9821 -19402 -24086 -40924
20113 -40924 -20437 -16333 -23650 -45507 -44481 -20042 -28534 -32433 -15444 -20100 -8206 25558 43039
20100 43039 15947 -17607 -14067 6064 -8647 -45961 -37590 -26522 14959 24772 26590 15323
20088 15323 -17602 -22713 15539 8812 -18455 -24459 -18602 -24706 -6842 -15046 -52499 -62245 -55098
20075 -55098 -26970 -16000 -32514 -21097 -19748 -18922 -41868 -75159 -82287 -69825 -57572 -27314
20063 -27314 -22185 -18079 -7764 -4569 -5044 23130 19989 9011 16368 11627 -2801 -23797 -23970 -21120
20049 -21120 -11716 -14533 11357 21498 17006 6525 -23378 -29321 -10781 9609 21498 6485
20037 6485 25378 28668 19964 -5465 11502 -10071 847 -5013 -32369 -46777 -19827 -16805 -26119
20024 -26119 -12037 1732 -19985 -54240 -47939 -11583 -12464 -25173 -12702 -19755 -29037 -27950 -34932
20011 -34932 -44315 -47289 -40035 -37758 -46922 -36316 -27531 -5678 -9763 -32726 -65902 -33795 -959
19998 -959 27520 6920 14053 39460 36405 16985 -8529 -31661 -29008 -7396 21813 566 -18777
19985 -18777 23567 28655 26889 39216 14876 12754 20845 10731 -18757 -2911 16861 28128
19973 28128 23012 24977 24288 7469 4881 18193 32365 13272 9234 -3285 5170 -29013 -3729
19960 -3729 13952 42612 36367 25000 12018 2612 32573 22657 -7674 -8110 14814 30498 51439
19947 51439 15655 -7529 13476 35690 31562 22724 12465 17372 36155 59792 56561 39494
19935 39494 21908 -818 -4602 -4222 -18777 -35228 -40183 -21233 27700 56085 49569 64521 72714
19922 72714 28774 33593 34209 34706 39031 50748 40094 18192 3063 1877 4220 -1771 2304 7877
19908 7877 -135 -41454 -56214 -59476 -24560 -16676 -26652 -37157 -45093 -25888 -28631 -35944 -7173
19895 -7173 -789 -25880 -16549 1245 -6663 -13376 -9394 -10597 -12310 -20632 -4867 3020 2666 1710
19881 1710 11077 31462 38879 14147 8843 -3978 26458 7843 -5987 15227 33014 34802 28100
19868 28100 12621 15547 22149 -8980 -18073 -12517 -1302 -29736 -33449 -28032 -6072 15726 13391
19855 13391 8381 15175 36977 29457 18544 21434 34764 28884 17409 4032 -24299 -22976 -2185
19842 -2185 14430 1087 -11853 -29228 -5069 33365 42621 18362 20870 28388 27768 26281 5815
19829 5815 4760 3932 -9675 19420 23537 13561 5122 -9179 -14059 1333 32252 6415 -4665
19816 -4665 8625 15555 1209 -12692 -685 3633 -9983 -17746 8595 22860 -2198 -7938 -10068
19803 -10068 -749 1658 -3869 19067 -12276 -43057 -31451 -147 12923 13041 17621 13013 7572
19790 7572 19288 10735 30432 -689 -27137 -22656 -7414 -1346 4545 37227 32633 8306 -10223
19777 -10223 10457 934 -31230 -25401 -15986 -23433 -30798 -29058 -13875 7330 11059 -30522 -52820
19764 -52820 -11287 2589 15102 36326 32955 15400 519 -45308 -51907 -10427 -4521 -35684
19752 -35684 -34706 -19946 -21236 -9803 11498 787 -18850 -35279 -17976 18086 43039 35538
19740 35538 -3077 -27615 -27110 -26746 -18634 1178 2833 23296 17950 2890 4271 9952 7276 -12429
19726 -12429 -30201 -43687 -57619 -30696 -16868 -16938 -13222 7346 -22333 -29650 -26598 -26151 -21210
19713 -21210 -29891 -48399 -59526 -58027 -20659 -13629 -2413 -6440 -22399 -16122 -25547 -16223 12306
19700 12306 15684 18141 22988 27745 24100 29201 40905 2772 -3840 -17531 -14650 26453 37225
19687 37225 24731 13140 -3917 12423 44833 48101 32277 20925 6355 15310 14004 13602 16575
19674 16575 7981 1498 30693 27986 19560 7568 12016 23116 -19530 -29477 -18851 -11562 -5146
19661 -5146 -5714 -13853 -18348 -31118 -53149 -59000 -29917 -2549 37860 42507 56320 42094 -3202
19648 -3202 8595 26012 16717 -6599 15489 35100 25157 302 -17955 550 6037 6493 4455
19635 4455 1855 2908 10871 38037 24732 -11570 -24211 -19497 -5776 7843 14807 24202 16728
19622 16728 22376 19154 6175 -2095 -15839 -20392 -3812 -14324 -34810 -51510 -40903 -17160
19610 -17160 -14847 -18633 -1563 -2114 16547 19675 24604 33085 36113 33384 34435 6348 -17531 -34843
19596 -34843 -32181 -37686 -26730 -16523 -1517 -4249 -25379 -37584 -20174 -3159 -3204 -5851 -7796
19583 -7796 -12508 -1581 27316 6734 -26032 -7492 -16904 -30095 -8865 -17024 -5276 12969
19571 12969 17594 22012 31784 58947 55086 37191 24519 -14394 -28402 -9153 277 17237 11278
19558 11278 9375 14002 18829 8416 -3541 450 -7892 -786 14269 11417 -12031 5960 41910
19545 41910 45482 31050 40912 39504 31215 56647 81917 61391 55269 57547 88718 114711 140650
19532 140650 150469 128924 120098 90819 82101 79601 31395 25142 56665 44199 77221 103858
19520 103858 83944 71428 70623 47935 56115 48342 34168 20406 35955 28178 13912 3185
19508 3185 6948 4484 15636 24439 16089 16089 30412 5766 5469 7177 -8764 5637 18375 30250
19494 30250 58501 62920 86651 109232 110164 81681 101669 119050 112906 121087 162444 184508 200654
19481 200654 207065 225121 200822 159992 125547 109981 123452 132969 168647 192207 214961 223661
19469 223661 237242 220898 183399 138667 93276 80227 69272 75806 35970 8407 11198 37696
19457 37696 44022 21391 33321 63079 64189 52025 22420 5847 -14429 -1410 7145 -21008
19445 -21008 -28887 -29477 -16152 19163 46864 47845 47610 37318 57654 81834 94698 98733 91878
19432 91878 102158 115065 93339 87118 62288 50464 46908 48691 71266 76326 91487 96646 81458
19419 81458 77056 52616 45607 21712 10502 8518 17717 23086 -6543 -20006 -19792 -11746 24606
19406 24606 10755 -3413 14666 12418 9274 5510 -2674 -5522 -8076 -5060 6899 28886 36117
19393 36117 44878 54952 49980 19955 334 -5545 2099 -12162 -31934 -25976 -9091 -6472 -4463
19380 -4463 -1850 15663 21643 19272 10774 16084 32649 24538 13031 -16708 -12061 -2704 15669
19367 15669 30452 16686 10918 -6500 -1114 5580 -16219 -32895 -28483 -5389 -245 20397 13235
19354 13235 11948 -4149 -31703 -27143 -10539 33226 27428 5167 19098 25668 23024 38171 48045
19341 48045 55035 53093 29860 -17495 -21706 6188 42107 71075 67242 36466 -12356 -34266
19329 -34266 -13004 15477 19264 11652 24604 44479 37436 30665 29170 -16704 -53132 -41626 -7183
19316 -7183 13049 10895 19112 52712 71082 28069 -25400 -59662 -55835 -43521 -28707 -14268
19304 -14268 -13858 -31168 -41656 -51172 -69959 -77806 -43123 -33406 -38536 -30787 -28491 -33202 4730
19291 4730 6072 8114 25395 25096 18290 4647 -22058 -20161 -22421 -25961 -17517 21621 14581 7952
19277 7952 -1335 15462 7173 178 -7795 17 2052 22198 19753 -2503 2802 -3817 -298 5870
19263 5870 19497 19105 1875 910 -17934 8809 26004 38645 34050 25051 16332 12136 22037 29735
19249 29735 46775 44136 35970 38930 44845 29798 21866 17842 35975 34075 1939 50 5317
19236 5317 10887 -8105 -41351 -22820 3647 9741 12600 14859 -6534 -31290 -33990 -56034 -54641
19223 -54641 -20177 -359 14632 9900 14945 51990 60083 60844 65112 55660 32367 18693 -2464
19210 -2464 -36044 -30255 11368 7588 4817 -6509 -900 -1832 -5310 -8657 20966 38932 19570
19197 19570 3817 -18091 3901 19668 -7378 -32204 -20086 -26153 -22685 -28101 -37296 -24195
19185 -24195 -84 13121 27099 17653 5807 18339 40866 42973 30083 9280 21555 32475
19173 32475 37020 21009 16129 21700 1140 9709 -3171 -25709 -21637 -31960 -41063 -32750 -30086
19160 -30086 -994 7286 3828 10405 32647 37746 20292 31386 49320 40160 6341 -3476 19703
19147 19703 31747 34474 14283 7060 13936 15846 20395 20737 35917 55761 44508 41418 22664
19134 22664 -2996 -10221 16600 14214 16706 24101 33462 37816 52749 28177 5762 15774 29221
19121 29221 21630 24112 49979 49970 35102 27772 36576 22504 14913 26493 38415 20497 22235 22376
19107 22376 26640 15642 16287 17665 12597 -18499 -10957 21847 13424 -10041 -35968 -27083 -17383
19094 -17383 -16846 -15985 -3089 5040 13738 5793 8633 9654 10828 24382 31667 20544 30140 23712
19080 23712 2189 -6446 12396 22681 10338 -430 -12028 -2892 14236 11248 14334 4017
19068 4017 3405 27122 26019 23288 30962 26507 24237 11786 28073 49272 37241 4671 19242
19055 19242 40053 27671 38717 37694 20289 13735 6042 16648 19945 25956 2499 -5934 17218
19042 17218 120 -12103 -14141 -7230 -19245 -19229 -7534 -3603 -10680 -11671 -38750 -25395 -16879 -13720
19028 -13720 19746 22216 16879 10061 -13620 12490 33455 42151 28348 4957 -6945 23724
19016 23724 37237 23576 28136 40246 36815 33655 14795 27676 25890 24099 33335 46242 54872
19003 54872 59844 34288 43970 32276 41096 49392 49259 70982 66213 29574 12888 11681 18038
18990 18038 35144 19576 38089 61412 54211 73458 111849 122363 163108 221521 243777 263168
18978 263168 220822 191765 178099 195751 199905 195237 219215 244588 250495 234176 198257 173822
18966 173822 152056 132004 118581 138783 132453 118104 75534 60304 60411 81137 100831 92201
18954 92201 72763 54976 46350 53403 42804 47424 63852 83290 73509 82635 103141 130062 129741
18941 129741 140693 123884 104400 107607 143368 167746 151186 170345 200229 242091 251207 254625
18929 254625 231985 189053 147391 113780 125475 158499 218308 231686 225050 253869 250637 255915
18917 255915 246024 190276 143471 113122 93820 74520 63516 60161 86868 102444 58406 50103
18905 50103 76357 94250 77730 85978 104019 96605 89508 88300 121046 87338 75226 71060 69537
18892 69537 93942 136633 159912 157751 137333 112761 138861 179211 209542 204420 224397 254653
18880 254653 273644 300104 376467 504093 619587 771489 1010049 1305968 1653795 1958357
18870 1958357 2032520 1978764 1893266 1655527 1402626 1266994 1297632 1419046 1639356 1926739
18860 1926739 2163263 2179527 2048508 1866220 1483066 1055177 753995 578600 454754 392560
18850 392560 343965 284277 252345 238379 224806 210395 192168 199761 196696 209111 231929 252155
18838 252155 289432 308558 293927 274043 286505 328165 361594 387563 448466 509954 612408
18827 612408 745946 969725 1264167 1596292 1958955 2302305 2360006 2276332 2163300 1857581
18817 1857581 1542144 1426500 1482628 1685964 1943689 2227771 2496090 2484634 2343973 2139554
18807 2139554 1715529 1267517 943427 720630 586967 491665 431457 404882 361288 362403
18797 362403 353569 342519 332876 300156 256801 208546 198782 159594 118010 141615 163764 164570
18785 164570 171944 183790 172288 167618 164196 156527 141958 162338 157682 145963 132337 145219
18773 145219 177454 177013 207630 217351 248294 288256 316498 309875 258700 256778 273946 301397
18761 301397 312851 281111 233325 231273 267816 296861 354843 404799 438426 436011 433197 446468
18749 446468 426874 399878 371073 375670 403232 413747 391720 391845 437707 464479 451397 478074
18737 478074 531272 539173 528733 560777 568947 528819 468574 414225 367944 350143 335904 335774
18725 335774 317258 339398 361814 392501 395384 392174 391094 374511 377363 336451 300164 291189
18713 291189 299614 320672 328556 347463 388243 446329 501996 588818 621698 625346 616927 637900
18701 637900 692485 810352 907673 963360 978849 981658 962966 864662 800221 767881 711907
18690 711907 673076 689416 711672 763443 808689 853882 879014 841357 760283 684136 623063
18679 623063 563094 517823 493911 532804 630738 740714 845712 993152 1120642 1236570
18669 1236570 1373688 1501739 1522406 1319311 1067917 888756 803832 764440 836411 961530
18659 961530 1109049 1269191 1423365 1499202 1322866 1094863 1011046 1005500 1023447 1031266 1024197
18648 1024197 998483 938751 823811 717738 662606 614995 547797 465581 433055 423914 470163
18637 470163 539462 585250 608052 599599 588078 576761 518420 487885 523408 555407 589101 613525
18625 613525 715213 893892 1111616 1389422 1673614 1917835 2022812 1909928 1778606 1790589
18615 1790589 1902291 2013172 1967016 1829520 1766073 1795886 1897399 1914805 1756767 1613862
18605 1613862 1577688 1618908 1633317 1448307 1139799 934841 811581 741033 650341 580960
18595 580960 547716 504017 471249 466436 446442 450746 481276 499319 501346 497930 470274 440833
18583 440833 430709 393695 381252 354116 358910 359061 374595 391569 447696 517271 589993 678088
18571 678088 807978 987661 1228267 1483463 1703378 1810482 1587040 1224235 994240 905707
18561 905707 904854 954274 1061662 1204709 1387854 1565219 1622690 1381809 1022861 768583
18551 768583 625824 506281 421456 387468 369711 361911 355315 345698 321346 350931 378374 376335
18539 376335 352517 316186 308687 319854 330786 346466 368698 370597 337692 357679 369321 356646
18527 356646 372803 381128 408272 427926 435486 448012 502633 574722 614981 627177 615457 605428
18515 605428 578720 554846 532955 552985 569967 606131 636766 671334 694984 723866 733747 750174
18503 750174 771179 789301 815961 846838 887372 915234 961003 1019887 1104498 1204926 1268274
18492 1268274 1372836 1468304 1588491 1771412 1932555 2127519 2372852 2622789 2862382 3106248
18482 3106248 3426365 3840804 4357786 4982826 5833425 6992189 8557718 10790525 13983076
18473 13983076 18330825 23659132 29699461 35987429 39873824 39658798 38047700 34736786
18465 34736786 29145873 24899482 23677195 25232733 28870821 33849084 39713648 44058349
18457 44058349 43223493 39834603 35270197 27601197 19749392 14305803 10852619 8578929
18449 8578929 7023854 5947492 5231593 4721573 4355898 4107569 3937523 3837203 3792897
18440 3792897 3814719 3893731 4020479 4167437 4337053 4523649 4712753 4971572 5315753 5737939
18430 5737939 6307793 7134855 8286959 9896832 12171855 15458142 19952977 25603277
18422 25603277 32034312 38851376 43363341 43250978 41568880 38278131 32232687 27374303
18414 27374303 25802904 27223421 30955503 36158587 42331978 47227080 46817874 43188594
18406 43188594 38407146 30425105 21773829 15558117 11568055 8859931 7017493 5752142
18398 5752142 4832138 4182617 3720445 3323498 3011194 2787199 2629145 2488370 2366734
18389 2366734 2256842 2162306 2058929 1934180 1848624 1776220 1708690 1609179 1525691 1480999 1431106
18378 1431106 1367971 1291005 1222465 1156672 1072941 1006479 997739 961567 917299 875476 876459 841778
18366 841778 862963 879343 883272 879537 855773 859031 870189 873648 863808 828369 810961 803563 792872
18353 792872 791583 771300 767978 738058 709078 709220 710488 697279 666925 661198 671819 697492 741732
18340 741732 752203 769995 832307 879459 947636 1034385 1115626 1188663 1241381 1250722 1242488 1247702
18328 1247702 1233070 1254197 1302595 1365326 1470634 1593887 1729775 1905711 2044418 2148053
18318 2148053 2243190 2378680 2630871 3037978 3564941 4266514 5217055 6440793 8106488
18309 8106488 10431995 13469091 17020807 20521115 23485130 24183794 20760753 16130154
18301 16130154 12956826 11324208 10834910 11393036 12932920 15291230 17918640 20320560
18293 20320560 21451737 19000456 14228298 10361412 7871699 6232809 5154195 4399524
18285 4399524 3897118 3518196 3245465 3062727 2977861 2985545 3044128 3126988 3193966 3242283 3301441
18274 3301441 3371477 3471204 3666591 3930249 4306185 4861246 5631006 6626546 7864174 9516547
18264 9516547 11698942 14634594 18464838 22768244 26920958 30262526 30117488 26070373
18256 26070373 22478102 21294877 22340816 25351388 30060963 35866443 41942866 45930634
18248 45930634 44942188 39872647 32332872 25411119 21127958 19267152 19379700 20970436
18240 20970436 23248773 25514823 26704699 24083315 18356684 13433266 10228501 8131997
18232 8131997 6690640 5639274 4855524 4244529 3804178 3497709 3293523 3230046 3228332 3260311
18222 3260311 3310598 3364264 3436622 3469775 3500336 3566978 3739520 4071839 4568072 5209858
18212 5209858 6057968 7202742 8695313 10761634 13694387 17612465 22084931 26378702
18204 26378702 29796540 29518314 24350683 18830838 15452369 13901880 13665168 14727431
18196 14727431 17049789 20268899 23674316 26653120 27331335 23326710 17336422 12660038
18188 12660038 9678851 7806600 6606672 5767265 5079521 4272601 3512915 2978863 2630673
18179 2630673 2385561 2199805 2047354 1897594 1741547 1620718 1501923 1381945 1290130 1269165
18169 1269165 1255106 1274359 1279279 1266653 1237160 1201865 1146274 1123761 1114856 1071427 1028387 1012539
18157 1012539 1024540 1050475 1120765 1149739 1123270 1086043 1097455 1114192 1174210 1333917 1608919
18146 1608919 2005057 2457096 2894121 3287282 3420932 3234171 3056917 3067818 3208032 3410052
18136 3410052 3453181 3155292 2597162 2110001 1846410 1739538 1699136 1679309 1671780 1741674
18126 1741674 1844979 1951500 2082633 2254201 2473020 2743200 3103859 3573974 4216870
18117 4216870 5052955 6219634 7911252 10509524 14478496 20232798 27054047 33529757
18109 33529757 39951641 40305503 29216432 18652742 12485471 8807453 6452624 4934831
18101 4934831 3962876 3330098 2969481 2757844 2668184 2661945 2678615 2647888 2495325 2246165
18091 2246165 2098137 2038718 2081281 2101541 2004723 1744607 1429385 1191819 1019862 931664
18081 931664 881106 815741 788077 752052 715760 696467 682975 648135 626840 622297 600277 550447
18069 550447 527058 528796 534357 541325 550676 560728 560674 534420 499721 485090 507898 552017 544732
18056 544732 490405 430088 373329 319808 322051 325325 329502 364402 414117 465972 521493 567702
18044 567702 591905 643423 673575 631904 605636 603298 607091 625901 610876 553297 451515 407314
18032 407314 410980 404346 369673 339431 302187 263494 241890 236126 202013 183731 192699 197678
18020 197678 199881 183776 163847 157852 160364 159809 144865 116218 87193 88750 85720 79887 84571
18007 84571 60015 57811 57381 46549 60018 94795 71789 86746 119881 141617 135583 147001
17995 147001 183825 213887 217442 220200 250158 316872 334034 344514 407076 437815 453427 430068
17983 430068 378796 372696 385684 411602 432358 425024 392340 386550 376467 353935 359696 416765
17971 416765 440940 444426 446891 422525 394704 380239 387844 418713 428990 415646 380276 315909
17959 315909 264462 242530 231885 229194 190423 200579 233826 257931 265881 239619 211762 214229
17947 214229 239732 247366 233363 213719 191581 207435 254453 280513 284398 295415 310002 330293
17935 330293 307634 258270 219971 197530 172553 151009 169787 194319 242886 280343 273863 251689
17923 251689 237564 254722 251284 271324 281896 295441 307541 285315 280884 292043 317315 333616
17911 333616 329554 335837 351457 357216 338292 361806 374354 390351 429030 463982 469333 446761
17899 446761 438128 397768 334099 296738 315122 363761 381725 397286 417994 427911 427691 382987
17887 382987 391718 387506 337369 285475 239710 213960 212183 203963 176086 168655 155900 141464
17875 141464 141164 150275 151820 149453 147114 120261 123052 142689 166086 194318 214693 238670 248490
17862 248490 257298 272743 281953 292624 301793 320947 355360 383333 427895 448936 420564 398220
17850 398220 401169 388263 407433 423720 423737 407685 373153 346194 316787 281902 241450 218342
17838 218342 233187 216473 195486 202575 201552 194720 190602 183474 161389 126258 100299 102544 108183
17825 108183 128711 145016 131776 140729 157173 156429 151229 175976 224800 264677 281262 345351
17813 345351 394561 379495 377526 417601 409623 426031 429524 427162 417502 396024 351477 323330
17801 323330 338082 351574 369444 373044 375514 327309 292616 269524 257981 256441 264421 278402
17789 278402 260911 259126 271521 234309 187905 153129 121406 112689 98401 101652 128806 133425
17777 133425 137922 131999 130118 142642 121624 109204 81746 78509 95622 98388 110477 129081
17765 129081 183182 219699 194062 180037 193129 225734 215660 207233 222240 225213 192459 166594
17753 166594 154699 153014 158844 171610 172936 173928 169041 171537 177912 230360 284839 304218 280029
17740 280029 251408 214770 170591 169828 180970 193067 204895 194568 240358 236626 219124 215010
17728 215010 192544 173619 183301 165066 131504 144752 148263 161384 158074 148229 159327 163649
17716 163649 170429 177569 195205 175397 165728 160603 145174 118872 106998 113333 147252 141861 136306
17703 136306 140255 157770 166817 183558 227152 253739 288074 257669 226673 221268 213533 215278
17691 215278 221992 204297 267512 339119 364357 379338 377832 419271 450974 474635 552157 631320
17679 631320 747871 930671 1174944 1519323 1929143 2364403 2699392 2801840 2860952 2886825
17669 2886825 2805564 2797471 2819025 2749553 2533945 2255085 1910107 1462535 1087531 848164
17659 848164 699395 599520 529674 473141 438939 452093 485970 495201 497707 488608 481809 453604
17647 453604 430247 398372 349452 292735 289856 284891 289676 277808 254625 219216 213906 249171
17635 249171 248214 239773 255742 305738 352830 362835 434367 509999 575068 674057 841057 1030261
17623 1030261 1309704 1643520 2013334 2342561 2565552 2666076 2692332 2616675 2516591 2499822
17613 2499822 2483298 2329157 2092683 1800186 1409645 1033412 795768 639445 523890 473370
17603 473370 418883 385118 382301 387695 404168 419802 438808 440114 418746 415102 408502 425867
17591 425867 442394 435382 403004 399842 389228 333008 288160 271844 262476 247348 258790 255438
17579 255438 238721 224988 187076 166917 165390 157711 116612 121150 135261 128377 140324 161424
17567 161424 159948 186021 202340 199866 174897 163361 154154 177475 147000 141201 148298 138448 156213
17554 156213 200925 197404 193825 182021 213820 257602 254340 260801 261516 280588 308207 330736 319118
17541 319118 312309 338735 358861 332486 306606 317091 318068 335792 336523 340784 368900 377218 360130
17528 360130 329268 342794 356737 342756 342214 354763 387809 418117 441226 478435 488728 486527
17516 486527 483008 512479 519796 544015 533649 542338 566447 576473 581984 591399 606118 629745
17504 629745 673816 681070 685885 700582 764687 825328 881962 977677 1080356 1195405 1322314
17493 1322314 1489876 1645562 1783846 1955192 2119890 2289463 2509666 2735834 2990393
17484 2990393 3301220 3675879 4068450 4506107 5054331 5794531 6767092 8031696 9690139
17475 9690139 11914178 14916520 18878512 23893977 29861820 36350305 42618899 47825191
17467 47825191 51630362 54201464 55660306 56206038 55947434 54668952 51921187 47552628
17459 47552628 41717937 34803878 27640477 21237477 16165502 12449862 9830962 7978340
17451 7978340 6639324 5705585 5025244 4543625 4164419 3892580 3709152 3570027 3489230
17442 3489230 3418720 3356593 3266395 3223327 3184393 3141079 3108239 3110355 3133962 3195255 3274824
17431 3274824 3378876 3546504 3761811 4003968 4297949 4667969 5141051 5755361 6550540
17422 6550540 7612906 8974146 10840148 13365988 16698273 20934734 26086481 31826516
17414 31826516 37499647 42357879 45836652 47984638 49056813 49196199 48616416 47343276
17406 47343276 45004961 41366022 36558639 30781493 24590571 18912593 14369889 10962972
17398 10962972 8553521 6873480 5664481 4815633 4185302 3712775 3378092 3125185 2897625
17389 2897625 2715092 2547690 2413893 2290349 2156204 2024133 1892397 1777596 1633038
17380 1633038 1515906 1457117 1426140 1384315 1334213 1279280 1239475 1236828 1247955 1248385 1249429 1270249
17368 1270249 1313470 1327351 1348227 1378849 1432344 1470897 1532997 1563053 1646161 1746568 1842795
17357 1842795 1960467 2089225 2267853 2500473 2779112 3143904 3629092 4242717 4984521
17348 4984521 5968450 7296103 9163440 11802844 15423984 19897372 24731911 29414221
17340 29414221 32440197 31899033 29256120 27622101 27658060 28502962 28838415 26518481 21102529
17331 21102529 15433477 11309911 8581921 6754902 5517585 4659098 4072770 3663642
17323 3663642 3369319 3160041 3031268 2951197 2897440 2886463 2917379 2935720 2963016 3047476 3153906
17312 3153906 3280821 3453516 3661388 3914456 4238673 4619769 5080559 5688466 6464537
17303 6464537 7495081 8870367 10726485 13270697 16847514 21625668 27522694 34268533
17295 34268533 41404846 47140184 49885419 51593842 53453697 53601592 52028421 50192876
17287 50192876 47091185 42716885 38485110 33345716 26283043 19463380 14473874 11090222
17279 11090222 8764833 7165184 6024768 5174552 4577450 4118214 3748379 3490115 3274683
17270 3274683 3122444 3018392 2973894 2943165 2889525 2864917 2869528 2908806 2935813 2966878 3011960
17259 3011960 3110447 3256159 3498418 3822096 4269089 4877025 5696466 6837799 8471423
17250 8471423 10830981 14031056 17870084 21915952 25641310 27524209 26267206 23919745
17242 23919745 22880301 23207763 23964299 23878212 21171539 16255010 11664153 8456008 6337089
17233 6337089 4901339 3918819 3211281 2686895 2269362 1973401 1769733 1597589 1491182
17224 1491182 1404531 1319099 1244567 1189445 1131078 1086036 1073191 1045478 993902 956426 914507
17213 914507 871088 824859 786327 749710 703008 663362 619583 594887 579929 541591 515095
17202 515095 492563 468173 485156 481208 436207 406630 410828 415043 423972 399097 347546 313264
17190 313264 318597 309436 308103 349783 386866 415609 434455 465105 523727 546343 598497 652392
17178 652392 733247 799447 852899 897156 904127 862403 873847 850911 748888 609472 541298
17167 541298 539427 541738 498517 425352 402835 379905 365449 349889 334208 346385 346748 335435
17155 335435 326909 315829 302254 263759 233665 243389 231747 218180 250574 291673 279400 260758
17143 260758 214080 197748 195003 181120 186800 217444 226609 219617 219227 245960 274978 311027 366493
17130 366493 451986 545786 699737 849610 973903 1031531 1040654 1009580 935634 873391 830337
17119 830337 768456 688114 614782 514391 415619 351216 305247 275909 259421 245524 236684
17108 236684 252423 254257 226526 220177 214228 227207 236799 227257 198979 178947 193598 210369
17096 210369 185123 182776 147899 120787 102194 130738 130347 138794 122805 102728 96833 62734
17084 62734 67278 123779 159183 183594 216571 249581 286572 276709 252591 237526 223109 236461
17072 236461 256053 246343 227290 184248 163040 96000 63686 81049 77979 44309 63575 56615
17060 56615 35606 43546 43145 35479 28122 29265 47641 72160 82975 51971 64228 36426 -17092
17047 -17092 -6693 2043 35181 44610 42998 28470 19506 44439 46911 4771 -7774 -398 -18622
17034 -18622 -5680 25787 24709 34658 35263 31906 59856 65549 37155 23853 22666 23512 13931 13561
17020 13561 12521 23439 50174 60272 43631 19253 3485 -17823 -37056 -62540 -73158 -57914
17008 -57914 -29694 -53257 -87250 -55202 8301 22401 -22034 -33186 -21874 -8545 15652 18339
16996 18339 -16098 -20000 -12521 -2052 -4723 -7676 16974 -8590 -7906 26238 16714 2829 10278
16983 10278 22825 16679 -16183 2675 38190 48187 37135 16672 -24667 -38829 -13903 21371
16971 21371 31836 44835 53359 76784 96310 102592 97858 131862 181678 204912 249399 272329
16959 272329 282621 314236 340236 337598 298609 259179 242793 228052 192018 144536 129419 121835
16947 121835 93806 52851 26460 14890 18950 46373 78178 68665 57128 22190 2879 3302
16935 3302 30780 26643 15977 -1912 445 -7631 -21124 -31508 -35862 -14743 -5388 -20083 -19802
16922 -19802 -4785 10709 3054 10288 -696 -17363 -34252 -2132 5471 12251 52767 75441
16910 75441 94420 85778 113418 166850 236995 264161 275979 284733 303549 307078 307082 295878 281913
16897 281913 231834 191484 138154 123227 115125 118118 106701 53466 28312 27676 40955 51566
16885 51566 34650 14886 -4467 -9331 16553 9602 -11029 -9123 25705 18394 6025 -17236
16873 -17236 -37089 -16922 9335 4342 6530 -26 -15735 -16953 -6830 4031 4025 -6808 -25602
16860 -25602 -13408 10694 26012 23267 -2701 -16092 -9775 16510 21258 14920 4239 -11276
16848 -11276 -17841 -25695 -32269 -1508 10651 24298 -151 6560 4961 -9238 2019 -6051 -15182
16835 -15182 -19898 -11683 -26919 -34812 -25046 -15471 338 4120 -18904 -14289 -7309 4783 8436
16822 8436 4994 15544 32997 68900 108865 124870 134535 179831 178899 158714 138579 114537 99663
16809 99663 102841 88270 85434 70673 30266 11658 20150 28112 4581 -14759 25722 4282
16797 4282 -33172 -36111 -40380 -20147 16376 19169 9540 -12298 -15279 1994 16353 6895 -13684
16784 -13684 -15279 -2818 18171 9224 7576 -5908 9340 35614 43296 61154 58814 61412 87505
16771 87505 132167 187375 224792 224766 249642 272703 252050 251167 267829 240033 175975 157068 131965
16758 131965 124899 120609 89321 83393 71578 44368 16477 16699 10191 25706 33878 42234 -2291
16745 -2291 -14656 -26346 -5665 3612 39326 58661 50498 56023 41028 34842 37838 41577 23294
16732 23294 6457 13882 20130 19922 32848 47271 50697 48523 60516 89971 96747 114081 108618
16719 108618 130281 133570 146810 141792 131491 107508 123754 119608 109955 73189 53317 19428
16707 19428 -358 5990 21563 27557 425 -28172 -41598 -31826 -16893 -18848 -6585 -2853 -18745
16694 -18745 -3023 -1566 -735 -20334 -42593 -47856 -40371 -41404 -53453 -14648 21443 36285 60584
16681 60584 54846 29623 -10014 -48155 -61005 -47183 -46559 -20401 9486 26064 9351 -8063
16669 -8063 -13312 -15723 -7021 -18634 21260 51062 14668 -15177 -21538 2400 15639 -11063 -37539
16656 -37539 -30576 -33481 -50567 -43825 -8829 -21328 -19439 -13552 -13041 -20841 -15816 -22400 -11378 4415
16642 4415 -12183 -18888 7041 3825 -9003 -30393 -56927 -65365 -69052 -55608 -22707 -25997 -28126
16629 -28126 -26822 -22478 -14589 1870 -664 -9646 -22608 -38767 -42227 -53625 -69610 -78014 -54683
16616 -54683 -47007 -38287 -45403 -30570 -9454 -572 -8964 -24906 -21480 14263 4695 -24949 -29952
16603 -29952 -16332 -22493 -23550 -10323 6892 -2890 -13692 -22235 -23454 -25002 -32435 -51304 -38250
16590 -38250 -47899 -57533 -66212 -77496 -50841 -43801 -17870 -17953 -23031 -24116 -26877 6529 3914 8854
16576 8854 19318 5672 3037 -12947 -14143 -24364 -41002 -32194 -19140 4777 15337 4781
16564 4781 -17945 -8715 -3481 10606 -28396 -26925 -23568 -5945 -9152 -40208 -54230 -47408 -38794
16551 -38794 -39163 -22426 9085 15769 -17886 -5162 -10880 -1438 -4447 9572 11238 4356 -1332
16538 -1332 -24941 -33606 -31053 -27292 -4984 -35381 -50078 -45892 -55998 -46943 -24766 -6804 11545
16525 11545 6329 -19253 -14090 -25028 -53964 -75989 -56464 -51787 -19839 -25985 -29097 -21595 -17193
16512 -17193 -34402 -28408 -26513 -41274 -62339 -59185 -51745 -40602 -12021 446 -8167 -26532 -1534
16499 -1534 -1517 -15225 -15859 -28972 -35358 -17588 -30751 -20547 17570 -10736 -30783 -35558 -60019
16486 -60019 -55533 -42290 -46113 -57233 -68459 -60201 -47507 -59724 -71528 -88112 -48325 -33520
16474 -33520 -42578 -44186 -38986 -15037 -28341 -47648 -44191 -54985 -63590 -68179 -29897 3377 15454
16461 15454 -13216 -17488 -14298 -28843 -9546 17095 37507 6796 15138 43976 49858 54468 39314
16448 39314 19306 -9668 -29280 -40671 -7463 137 -36568 -47430 -30580 -17980 -18179 -6443
16436 -6443 -3730 -25232 -24492 -38410 -43031 -30995 -36779 -48867 -21675 -11627 4109 -8548 -1262
16423 -1262 24404 21654 7564 -27514 -35941 -9261 26784 25239 -8363 -20957 -13869 -1562 21488
16410 21488 18135 -14578 -32886 -20763 -16092 -31505 -31612 -6130 -8100 1639 4249 3121 5258
16397 5258 -366 -5361 1296 7728 7268 3727 26551 10590 -18349 6770 23608 32744 15376
16384 15376 5866 9866 -796 -14610 -7730 -19895 -55315 -46449 -42181 -11573 -1719 1280 -29532
16371 -29532 -31177 -9865 -11116 -8998 -17687 -33392 -21638 -8597 -35748 -53636 -39940 -59102
16359 -59102 -73118 -45926 -29893 -35922 -66900 -70244 -58618 -35297 -22976 -12825 -5945 -34583
16347 -34583 -32427 -28308 -57661 -47283 -44024 -62866 -55333 -29749 -18764 13403 9557 2965 14092
16334 14092 13410 -12914 -25147 -9881 -20416 -42626 -63369 -46194 -32293 -28065 -41380 -30108
16322 -30108 -5370 7754 -629 -30711 -45473 -38343 -30950 -39517 -16229 -22666 -20638 -24885 -30287
16309 -30287 -21596 -10444 -13068 9975 27765 677 -47089 -48625 -35194 -25113 -10975 8064
16297 8064 -1993 -17686 -11642 -16355 3912 15371 23668 2648 -40637 -31318 -33609 -23651 4221
16284 4221 -975 -39665 -64380 -69133 -63061 -56574 -22235 -42077 -43359 -33442 -46954 -51443 -56853
16271 -56853 -70502 -45959 -26583 -26721 -30347 -27896 -20313 -23314 -31842 -17399 -26326 -28845 -60523
16258 -60523 -65592 -58350 -28780 -104 658 -1421 7105 8915 -19835 -24721 -31712 -23848 -1033 12405
16244 12405 14006 2937 -7369 -20182 -23270 -28794 -50188 -51577 -42497 -45796 -56239 -41228 -45394
16231 -45394 -65361 -51495 -18366 2711 -24512 -53672 -70895 -75521 -51448 -42714 -49107 -40916
16219 -40916 -22122 -33661 -67830 -46647 -51223 -78781 -70991 -58949 -70334 -77213 -64597 -31889
16207 -31889 -30762 -48676 -68576 -58643 -26378 -25073 -60013 -53141 -15652 563 -20956 -26568 -2785
16194 -2785 4550 13251 10229 405 -26160 -25100 -15998 -1756 -8251 11545 21340 -2190 -3736 -15335
16180 -15335 -20774 -14995 -32135 -30598 1183 -535 -28301 -24177 -17123 635 -4114 -21878 -5025
16167 -5025 2481 10495 20316 29531 -5784 -17040 -1675 8820 -15009 -34225 8917 -4395 -11772
16154 -11772 6231 6010 -17345 -33858 -28886 -13118 -36514 -40592 -17961 1644 6060 -207 -22920
16141 -22920 -7687 6873 8168 16964 17161 29585 35207 10983 1055 13336 18559 -24870 -34821
16128 -34821 -26400 -15411 -8042 -2559 30947 10484 1079 -19698 -30835 -38580 -31276 -39811 -30576
16115 -30576 -16852 -15858 -30652 -29940 -33465 -28735 -26521 -26051 -25086 -11559 -2925 -11920 -15186 -29648
16101 -29648 -8612 -16611 -19896 2783 7267 6483 -2672 -14148 -42285 -51497 -21793 -8735 23554
16088 23554 24690 8610 -16846 -10980 -19214 -15468 -21229 -20751 26737 53420 67981 42825 14246
16075 14246 -274 -22576 -26879 -24285 -11842 7643 8952 -2442 5474 14818 12437 5978 12435
16062 12435 2504 1536 -4252 -13699 -1676 6281 12205 -8094 -29809 -39952 -37438 3302 38960
16049 38960 43323 22449 15460 11775 32676 37042 13010 24464 37813 27370 17023 32420
16037 32420 35579 41609 55052 30332 -5253 -22188 -42616 -40865 -33726 -32315 -21734 283 22933
16024 22933 39088 34331 3778 -560 7169 24686 20688 11237 20580 -1340 -39228 -35807 -17011
16011 -17011 -6506 3679 5413 5276 19235 17313 -941 -19801 -12891 -12232 12779 5829 -14040
15998 -14040 -12488 8440 30938 18804 -2028 -11704 -11265 23658 39260 33013 17817 26153 52097
15985 52097 15322 12843 -2457 -16700 -9943 -5506 -11522 -33179 -43243 -46492 -36350 -33242 -17831
15972 -17831 -42717 -47597 -31194 -19516 -20126 -30861 -17879 -19102 -66880 -92401 -77731 -57522
15960 -57522 -48009 -41336 -38359 -28857 508 8562 -511 -7847 -15129 -9210 -474 6409 -24027 -47012
15946 -47012 -34429 -22686 -17325 487 5132 14973 -16033 -38215 -15712 549 87 -9431 -24013
15933 -24013 -48186 -44607 -12813 3492 -27791 -19487 16749 30357 39731 45127 47012 39819 31136
15920 31136 25481 15197 5472 -7435 -21604 -23909 -31389 -28773 1608 11424 19354 324 12766
15907 12766 34887 40132 4234 -12347 -1396 19696 40897 11805 5944 24023 -3417 -31153
15895 -31153 -20410 17885 25202 7547 -37321 -53800 -71748 -69965 -23370 3070 -16097 -36730
15883 -36730 -44518 -19302 -20921 -50047 -42143 -6737 19741 28530 26963 4909 7346 25900 19155
15870 19155 4857 20293 -3198 5079 3836 31332 43537 52109 35717 13911 23359 29408 31865
15857 31865 21669 19023 -4696 1239 18383 11448 -998 28038 23978 23000 43172 43489 13199
15844 13199 -28032 -31534 -13452 6905 4306 -21306 -20426 -12055 -27152 -27917 -47309 -52391 -39585
15831 -39585 -883 -40 -23435 -32976 -25432 -3835 18523 23875 26475 3516 2865 1929 3563 18585
15817 18585 11224 14296 30311 19031 19156 2335 -17793 18577 24287 750 -14701 -8418 3021
15804 3021 28972 32129 9314 8591 11044 8633 6512 5341 -3626 -13606 -5686 -10260 7559 35228
15790 35228 34356 13845 6375 8187 3060 12988 13181 5267 1114 18352 23886 16237 39460 42720
15776 42720 41973 21703 29131 27028 2254 2989 -3888 1584 -1318 -14572 -5404 -7972 -43835 -49503
15762 -49503 -54991 -30422 -31298 -32811 -24801 -13524 -34383 -14851 3773 -7440 -3550 -7455 -21400
15749 -21400 -802 9746 -4425 -11198 -23058 -14097 -9219 1247 25917 -1117 5503 18399
15737 18399 6967 -7152 20664 41873 32704 24799 -2903 -20884 -34708 -53440 -61091 -33365
15725 -33365 -19028 4896 23672 17056 860 -33938 -24848 10394 19918 -3630 -11548 -1997 9264
15712 9264 -8518 -17367 6700 3020 -13482 -36556 -37521 -36674 -34162 -26475 -18014 -688 5515 12645
15698 12645 19383 8847 -66 -17226 -52475 -51834 -62891 -62859 -49956 -41599 -31361 -12562 6169
15685 6169 29120 32180 24034 -1877 -27391 -10613 -613 13236 23910 15368 -7336 -14150 26679
15672 26679 28093 26639 8381 -8773 -4840 3302 -34246 -54043 -38056 -33775 -34580 -33833 6177
15659 6177 32580 21639 3858 29944 48810 15443 -24185 1396 14417 15185 9786 20817
15647 20817 -4372 10651 20133 7536 18369 37993 30958 -1246 -25671 -12193 1971 -5355
15635 -5355 11432 27093 24689 47582 43836 -3247 -19597 -12980 -12511 -17885 -42959 -32118 -17560
15622 -17560 -37770 -46969 -41779 -8462 13992 -33475 -32900 -12932 -6550 -22374 -31385 -31807 -3028
15609 -3028 29992 21449 23559 26059 3072 11474 7880 -5329 -40400 -51365 -43217 -14634 -3921
15596 -3921 -14071 2215 11285 -1993 -18500 -3077 1179 -10602 -23030 -51226 -41626 -55859
15584 -55859 -60241 -18511 -9173 -19269 -16899 -16351 1468 -24240 -27446 -22025 -11252 6185 11762
15571 11762 -8804 -38342 -35724 -48055 -43035 -27667 -43234 -44933 -35272 -42284 -37324 -30550 -41548
15558 -41548 -29407 -21898 -24239 -6168 -16429 -30281 -9138 -7358 875 12676 7738 9412 -22789
15545 -22789 -22695 -8554 -18077 -8970 -25213 -33643 -37953 -38007 -11885 -6400 -6268 -11403 -16121 -40497 -44195
15530 -44195 -56444 -55980 -10751 -7876 -11822 264 -2896 4925 5263 -7708 -31437 -44603 -30792
15517 -30792 -14940 -12580 -20534 -29424 -8400 -3022 -25455 -22875 -36183 -24256 -3474 -36056 -47746
15504 -47746 -33570 -11202 -15630 -31439 -40193 -26238 -8548 -2773 3170 8055 1022 -47779 -36367
15491 -36367 -28253 -21415 -15128 -21113 -23253 -39236 -45452 -43624 -44895 -19705 -14494 -37913 -48322
15478 -48322 -63738 -69534 -53073 -30778 -36538 -50191 -41135 -27929 -11480 -875 11303 30590
15466 30590 37856 16236 -937 -23802 -39787 -50156 -39774 -25786 -23792 -26247 -18899 -11535 -12784
15453 -12784 -30830 -25453 -21448 -8024 1038 -5284 62 15350 26561 24662 26549 -192 -13232
15440 -13232 1096 -13226 -30522 -23175 -15297 -1621 -13305 8101 12281 -13986 -27057 -30185
15428 -30185 -29773 -31696 -25015 -16728 -5725 -27663 -43299 -28579 3625 -6036 -37213 -29557 -17532
15415 -17532 -21465 -31922 -42722 -43847 -9565 7572 -16216 -9468 9480 -11495 -19903 -573
15403 -573 -28396 -30359 -33850 -29053 -20016 -25022 -19161 -14958 -6656 -13389 -36894 -26872 -37404 -33014
15389 -33014 -10417 -9492 -24481 -31370 -34472 -35891 -41180 -36908 -24991 -16860 -28849 -34710 -43590 -61121
15375 -61121 -46709 -29802 -28538 -65034 -76176 -47243 -22398 -34716 -10517 9566 -18843 -48483
15363 -48483 -44671 -35660 -40152 -29209 -36411 -20009 -18360 -26404 -42189 -35552 -15049 -16515 -3946
15350 -3946 -9304 14063 10570 -26651 -36133 -18793 -7646 -2791 -31781 -33033 -21740 -37610 -40204
15337 -40204 -50115 -55544 -37673 -33309 -62960 -69491 -57306 -43297 -46221 -10817 -18965 -22003 -42649
15324 -42649 -57188 -46048 -36005 -29028 -7334 3885 -21698 -48671 -63945 -73289 -73267 -83842 -88045
15311 -88045 -102951 -107543 -85063 -77023 -47321 -54325 -43226 -33732 -21614 -16515 -27780 -28916 -24911
15298 -24911 -13175 -32373 -43901 -23931 -35890 -45689 -43328 -52110 -36457 -32116 -11070 6634
15286 6634 -2305 -5787 -6210 11763 -21955 -24681 -25020 -40701 -46230 -43637 -46105 -25900 -17603 -28427
15272 -28427 13494 39266 37120 24872 39431 7819 -39206 -36207 -23327 -45651 -42951 -19231
15260 -19231 -73 25605 16012 -10368 -18988 -564 4765 -6716 -10098 -12479 -19425 -22316 -36129
15247 -36129 -20836 15132 8601 7897 -6269 2863 4076 -29984 -60170 -63603 -65700 -54704 -29799
15234 -29799 14833 17769 -14023 -43736 -35217 -50443 -26380 -6579 7489 9320 -18350 -42864
15222 -42864 -38289 -25533 -17123 -10522 4724 1952 1762 8335 21998 12569 -34480 -52050 -85384
15209 -85384 -44957 5104 12181 -2189 -6317 -7340 -6078 -13115 -6180 -2560 -24026 -36048 -7625
15196 -7625 -11702 -45604 -74595 -62674 -58253 -54347 -31914 -44830 -28731 5367 -10398 -20045 -2402
15183 -2402 -26990 -70319 -49603 -59445 -43678 -29277 -43503 -47079 -35699 -8892 9978 4488
15171 4488 -10757 2201 2223 -9047 -12096 -27898 -23703 -12105 -31349 -68395 -69261 -34017 -17274
15158 -17274 -20683 -35429 -46962 -58310 -53080 -57697 -60143 -18948 -5753 -34286 -34053 -20531 -32692
15145 -32692 -60473 -58299 -56664 -33076 -10252 -3079 -25165 -26200 -45249 -61608 -61203 -66721 -67229
15132 -67229 -59992 -58980 -61904 -41576 -14812 -13838 -16749 -42590 -40328 -34571 -29059 -43176 -54836
15119 -54836 -36286 -20297 -9985 14047 11614 955 20871 31568 19578 -11563 -4670 23845
15107 23845 -9481 -11239 -11467 786 1205 -33191 -39424 -54573 -46193 -38333 -28526 -17623 -36776
15094 -36776 -60889 -78500 -68961 -45888 -30348 -683 3904 -19356 -38381 -40391 -7283 -26104
15082 -26104 -57539 -58542 -35015 -27484 -7925 3293 13492 20233 16294 13494 -16167 -6830 -20814
15069 -20814 -43020 -53373 -45057 -43206 -23177 -13719 -28842 -32169 -18640 -13464 -6904 -27409 -40664
15056 -40664 -28100 -13657 -21207 -42080 -41579 -28412 -31316 -21331 -3075 33638 60100 27047 9460
15043 9460 9279 25723 2398 -13094 -14608 7191 6208 -5456 -16178 -22481 -35192 -27624 -17918
15030 -17918 -25802 -30459 -47236 -27254 -15241 9944 14469 -4391 -10219 -1714 17258 -339 -16239
15017 -16239 -19755 -5672 -14286 -22213 -19942 -25595 -21663 -10767 -14087 -41411 -38582 6204 32015
15004 32015 32796 4505 -6618 4630 5648 -26436 -41003 -52277 -56933 -26350 -20823 -7403 -4071
14991 -4071 -15983 4763 13255 14669 14427 -3198 -5263 1424 -1960 -14299 -5759 10168 40671
14978 40671 20506 699 -33757 -34997 29550 49988 38674 30069 38743 26686 3704 -8252
14966 -8252 -21984 -16586 -23153 -32815 -42308 -39803 -38330 -51965 -21244 -3273 -1935 -1549 11222 10901
14952 10901 -9554 -14242 7189 -7704 -58051 -29464 -11009 437 1724 1220 -12593 -24079
14940 -24079 -43890 -29231 -3928 -3774 -2526 -21977 -22896 -18144 -2217 11471 -23800 -36807 -27118
14927 -27118 -34823 -35170 -23497 582 7536 37831 29590 -6210 -35870 -9335 6438 5431 10688
14914 10688 15040 11177 -4409 -25681 -43125 -18955 -22096 -11892 -12237 -5421 110 22265 -3069
14901 -3069 -26257 -15265 -1594 1851 -22653 -20183 -12482 -16582 -38534 -37257 -16836 -37373 -34829
14888 -34829 -25933 -21522 -11323 -5942 -17058 -18956 -4564 17176 14316 2882 -6459 -22397 -13568
14875 -13568 -4509 -10525 3541 5898 -1434 -12144 -15379 -10510 12461 21781 17806 -10128 -6807
14862 -6807 22990 29531 1051 -24524 -15634 -21270 -24508 -31231 -35426 -11629 25712 38325 23243
14849 23243 10567 -4363 18491 43759 18045 -4035 8380 -6006 5696 27764 45583 32963
14837 32963 -4678 -16785 8755 11319 7315 5100 -569 3764 -11631 -20584 -43197 -62548 -39761
14824 -39761 -44011 -42728 -49495 -58503 -23627 -11823 -31909 -37023 -14509 -4590 -8823 -2910 -3838 -10264
14810 -10264 -12670 18037 37223 53587 46382 12213 1666 -11198 -15126 -24664 -6566 -10934 -20111
14797 -20111 2341 -4412 -4912 -9637 -19064 -23554 -23260 -18390 -21096 -23193 -11200 6486 -4106 -36027
14783 -36027 -53262 -65218 -26910 -29124 -53543 -54734 -10739 25005 17481 35773 26136 41165
14771 41165 33314 22433 -6134 5245 9004 16582 19054 8745 -109 -1891 3628 6973 -25895
14758 -25895 -27382 -31372 -21734 -23946 -41312 -36952 -31127 -35427 -24572 -25484 -27785 -14398 -20131 -9443
14744 -9443 -11030 14191 33367 46295 32273 -11448 -43714 -56632 -30445 -51673 -35962 -37665
14732 -37665 -29458 -24144 -27877 -42678 -37291 -44286 -49577 -44739 -60944 -44363 -35669 -9879 9296
14719 9296 -13507 -8552 -16668 -25154 -19819 -6913 11857 4150 15443 18766 2368 -516 -19287
14706 -19287 -30793 -27928 10094 19492 -3024 -4393 -21042 -10508 -809 -1368 -32 -2232 -18834
14693 -18834 -8446 5400 -15688 -35090 -38986 -55711 -45562 -30347 2543 13538 13637 -5764
14681 -5764 3733 28001 3750 -984 3317 35477 38873 42917 49447 38105 44184 33520 -6571
14668 -6571 -28915 -16516 23093 24823 23117 27789 20689 -4623 -32632 -44927 -67676 -26236 17277
14655 17277 17083 19979 41171 30551 24766 27121 846 -29209 -12587 3802 2362 15484 12714
14642 12714 16856 105 -7621 -7700 -12213 -19075 -21228 -26527 -44891 -63766 -34578 -13920 -30065
14629 -30065 -29940 -12377 -11429 -12252 -18384 -55706 -62781 -65761 -60747 -67282 -44275 -14326 8616 16725
14615 16725 34462 21238 12190 7648 -8055 -17359 -8685 8564 7540 1025 -21163 -41668 -23647
14602 -23647 -9389 -16994 2457 -6474 -1518 971 -308 -1030 -25251 -26528 -26294 -24026 -19503 -31280
14588 -31280 -51984 -36592 -41414 -52274 -52767 -37280 -40373 -27949 -10745 -7650 -44712 -49080 -18819
14575 -18819 -848 4034 -13677 -29024 -23378 5631 25465 32100 76494 99469 51845 16313
14563 16313 -1350 9297 -180 23169 46961 50784 38190 34751 23769 31480 43961 23046
14551 23046 1961 -6489 -3352 11647 17480 20203 212 -28379 -15926 -5493 -22606 -7031
14539 -7031 -6568 -17825 -29692 -22159 -30375 -29213 -13192 -18459 414 -9940 -13225 -18618 -29014
14526 -29014 -21128 -7811 -7187 1728 3269 26118 17304 2765 -16756 -4468 25208 27122 8222
14513 8222 -4947 -17942 -2796 -10394 462 -4082 -33346 -53084 -67619 -54233 -33177 -3967
14501 -3967 -2700 -12438 -2727 12079 16107 -19017 -33696 -15435 -21328 -30126 -37492 -23553 -11709
14488 -11709 -5482 -35700 -39672 -17022 -18252 -20181 -23811 -7186 -18665 -7746 1702 -16509 4282
14475 4282 25134 31756 5538 -8837 -13892 -24074 -43157 -42859 -20124 -12402 -2327 11040 2673
14462 2673 -18483 -14541 -451 -6148 -27584 -8475 18498 8685 2009 4843 -2905 10275 14089
14449 14089 -5531 -23407 -19195 21468 14286 -34709 -39715 -15405 5778 13602 12856 -1564 -20084
14436 -20084 -25107 -13095 3557 -1598 -7120 -10159 -4813 -21968 -22574 -18674 8467 3783 -8070
14423 -8070 -38835 -35889 -16771 -16330 -31563 -43952 -22398 -36659 -49562 -12774 -3392 -11703 5047
14410 5047 -17463 -20215 -18787 -44453 -50548 -49748 -28664 -15970 -24715 -27918 -5070 -23152 -17066
14397 -17066 -33270 -35287 -21832 -11136 -9486 -18571 -21760 -8791 -36790 -36998 -61966 -59454 -30748
14384 -30748 -29175 -4427 12799 17866 -603 -22184 -24210 -20139 -711 6238 -19294 -38647 -20933
14371 -20933 6662 14584 -2688 6841 15666 -830 -17798 -16671 -16087 -24925 -20114 -19966 -12813 -11145
14357 -11145 503 22702 34975 39705 14377 8676 -7793 12474 2948 -10666 -18625 -34685
14345 -34685 -51166 -50805 -36126 -33672 -33730 -35142 -50649 -34875 -15172 -13815 6080 13256 9396 -2348
14331 -2348 -8114 -33902 -62039 -38895 -6071 -14153 -26968 -23559 -28537 -25832 1171 -21690 -41084
14318 -41084 -50347 -50343 -10490 -28454 -49351 -28758 -33664 -25785 -37533 -43754 -34662 -26658 -14485 -19304
14304 -19304 -24537 -15437 -17063 -21093 -3317 16524 20388 5289 6946 -423 -15177 -46103 -52558
14291 -52558 -49335 -50326 -22237 -14949 -27912 -28082 -8161 9809 18495 35623 36833 17871 -2376
14278 -2376 -9657 -18675 -20950 -48831 -70737 -74748 -66428 -30085 -6213 -2685 -6664 -1232 -13739
14265 -13739 -39151 -48522 -70361 -46110 -19810 -43222 -35029 -6548 3399 11047 34927 38225 13567
14252 13567 -11446 -6491 4157 1611 -13209 -16432 -35613 -63387 -47924 -40636 -42914 -60361 -77757
14239 -77757 -62344 -57239 -78777 -78885 -68477 -66251 -82107 -98722 -76344 -44615 -23428 3732
14227 3732 10211 -19415 -33301 -12507 13195 -4428 -27585 -53675 -65446 -43439 -56487 -34040
14215 -34040 -21137 -39264 -11070 11128 -4275 -33321 -34495 -13163 -12354 7309 26026 23613
14203 23613 6521 -29877 -32768 -21817 -17127 -9365 -6806 -18331 -36357 -24034 4080 -19644
14191 -19644 -16250 23286 40337 23331 26923 24134 -2115 1558 11663 -13347 -35190 -15940
14179 -15940 2718 -28678 -41340 -60111 -61331 -41876 -21031 -9065 -22499 -16355 -33335 -41687
14167 -41687 -59995 -30979 9958 -14882 -19232 6565 9717 15058 22918 5861 -19626 -40423
14155 -40423 -21031 3924 -8551 1217 -20639 -34462 -37697 -24893 -39424 -23167 -5191 -23504
14143 -23504 -39480 -22276 -24853 -29671 -38045 -20810 2494 15514 9783 -12574 -2396 -4170 -19567
14130 -19567 -13643 4290 -15078 5178 4486 -32991 -41213 -43493 -49401 -42878 -26604 -101 7013
14117 7013 -1341 -15320 -17469 -13716 -25843 -37011 -8382 -3759 -41220 -54410 -40125 -60043 -73733
14104 -73733 -62158 -70698 -94317 -67291 -20432 9195 32860 13381 -26937 -27091 -45055 -52503
14092 -52503 -19644 -9569 -12507 -1149 -998 -40251 -32313 -30757 -12590 -16622 -25339 -13020 -1412
14079 -1412 -33226 -35804 -5934 5274 25545 23358 466 -25329 -56825 -38331 -22512 938
14067 938 20481 -284 -32825 -27706 -28966 -33898 -15227 -14135 -27728 -35386 -23541 -23534 -4218 -22008
14053 -22008 -32229 -33719 -17179 -1302 -5898 -7065 -21780 -40344 -6723 -7586 -13641 -8925 -3064
14040 -3064 8313 26108 20372 3184 15374 29208 2703 -17567 -9612 1433 3927 9464 14835
14027 14835 -5562 -7177 5168 24848 30951 7598 -16595 -28729 -13599 15232 25539 14222
14015 14222 14938 32706 39522 17744 5096 94 -5371 -22343 -17340 13913 -2475 -5953 -17610
14002 -17610 -18763 -23871 -52285 -51795 -29934 8235 -4226 -19174 -25261 -33303 -21238 -19660 -25192
13989 -25192 -20198 6395 45166 51128 46577 33931 15282 -19595 -27092 5556 21746 2073
13977 2073 -30466 -27164 -9427 -18267 -23761 -18296 21129 19366 -5469 -30889 -49307 -51500 -27026
13964 -27026 -9590 -12185 287 19251 11225 3730 -21120 -29332 -17942 -24930 -20820 -22956 -24183
13951 -24183 -14208 -14078 -14156 -24223 -19334 -34457 -25230 -24207 -53712 -41432 -27756 -44456 -41727 -51219
13937 -51219 -68671 -48187 -35506 -1850 36729 22416 6939 -23804 -42207 -18856 20324 20920
13925 20920 -3238 3449 16610 19998 14096 1101 -14721 -36951 -20247 -19956 -3844 13460 18518
13912 18518 -15865 -25618 -17024 -15627 -20056 -6090 -11861 -2634 -9543 -15223 -37168 -20713 -11704
13899 -11704 -35449 -36023 -9224 -19400 -30178 -29707 -17872 -18601 -6404 -20621 -13762 -312 -21249
13886 -21249 -23632 -14025 -15288 -39122 -42787 -15861 10622 19541 -2606 -5527 16335 48473 51830
13873 51830 60913 25347 -10782 -2665 7506 -12486 -31723 -39068 -31764 -10922 4010 7538 -11739
13860 -11739 -16376 -19360 6155 39267 43613 27648 14985 -4433 7110 11764 13225 24887 9176
13847 9176 -23102 -37783 -47894 -55295 -59093 -57277 -19802 22988 19522 11430 8768 21817 -11808
13834 -11808 -29465 -30379 -20897 -20737 -56379 -65452 -20580 -7748 2751 14276 34567 20317 15567
13821 15567 13104 5730 -11385 -22548 -20612 -25503 -41035 -29913 -29397 -19640 -49862 -62068 -27683
13808 -27683 848 11699 -11433 -29570 -11322 17137 17908 -6388 76 688 5556 38683 60582
13795 60582 30811 10038 4575 -7189 -17782 -19215 -4362 17096 18814 -10975 -37493 -47019
13783 -47019 -28653 -20385 -12485 -16111 -23322 -10443 12123 18872 26085 7292 5432 -8405 -14722
13770 -14722 9232 30181 41467 17002 -3267 -24658 -19516 -3110 -30274 -43445 -22806 -16776
13758 -16776 -687 1605 4100 9290 3012 -24709 -6508 -8040 -37643 -19457 19001 17939 -5724
13745 -5724 -18925 -25463 -21200 -20716 -27908 -25120 4117 16424 31868 40748 38173 27905 -21421
13732 -21421 -32324 -15880 35649 44233 21725 14069 -10274 -18654 -16555 -24396 -16679 -12650 -3735
13719 -3735 32065 52237 1651 -44542 -61978 -40521 -20564 -20634 -8518 22619 6800 -20542
13707 -20542 -9659 14494 12996 22310 -10343 -23942 -671 14137 15877 15032 24069 15378 9980
13694 9980 7934 3100 18613 37766 20494 22863 31415 22784 11744 18187 29648 60315 76705
13681 76705 43869 38106 48529 47705 19174 37198 35401 24546 22280 48219 46775 53672 57974
13668 57974 61088 70923 64066 48808 65638 72622 74101 105386 118116 136470 152147 148023 182430
13655 182430 164172 141355 118442 133185 153277 184781 175581 149424 128181 134737 142478 132244
13643 132244 108340 103137 99699 101023 107442 114182 109360 127290 132099 91981 114932 136121 124791
13630 124791 114778 120283 106690 99252 87668 112138 104021 104416 103161 116131 109416 65003 68029
13617 68029 83541 102794 108246 120836 102619 88449 74263 65522 88110 108581 132037 117046
13605 117046 113852 125650 121223 119448 130605 160738 152432 101933 75565 86702 70403 83145
13593 83145 126847 149978 139128 117305 77955 61213 87901 63126 15346 -28866 -26206 -17373
13581 -17373 -11278 13197 18590 49527 42653 21595 33083 54787 48388 57709 53372 34689 56366
13568 56366 58297 74090 68850 28561 10332 -1451 7531 18235 38700 85771 97043 61673
13556 61673 32121 35579 50259 41348 12965 12774 40227 52653 55921 43272 22765 37147 39273
13543 39273 16667 -2718 32690 34978 27298 6291 3093 1639 -14843 -19511 2862 -18733 -16774
13530 -16774 13875 26105 -8269 -51217 -57848 -25279 -18333 -42146 -49027 -34412 -185 -1492
13518 -1492 -9278 -19839 10705 8586 277 -4377 -11112 4720 17152 18952 6590 13161 22716
13505 22716 6449 -4592 10762 4680 17802 18268 -14578 -907 30661 39921 31187 4049 8557
13492 8557 29268 24959 30779 28979 -18276 -13635 -15742 486 -1005 -30277 -46881 -29939 -22640
13479 -22640 -26777 -19991 -22571 -31387 -33448 -17966 -11970 -14129 1387 1973 -12000 -27481 -20425 -7952
13465 -7952 2582 19644 27225 33549 45442 34083 16619 24680 29493 2083 3708 12077 6294
13452 6294 20628 20840 25525 43233 7692 -6699 16841 15771 357 -28207 -22984 -4502 -19938
13439 -19938 -32580 -15716 -37938 -43862 -49121 -49150 -22968 -17193 -21466 -27207 -16764 -7687 1924 1293
13425 1293 -25494 -28445 8488 12306 -16316 -18512 3427 -2251 -9594 -6891 3004 25219 15170
13412 15170 3901 2954 -11810 -41311 -25334 -28677 -34484 -1550 5214 -24548 -4816 -8153 -30572
13399 -30572 -23286 -29053 -16822 -26495 -41582 -51442 -52004 -29144 -52774 -72007 -78883 -52737 -64155
13386 -64155 -64658 -52143 -51442 -63558 -56346 -42982 -23602 -1809 22352 32771 13798 11731 23374
13373 23374 20334 27300 27852 48936 28379 12721 23762 27263 25908 17854 552 -13671 5637
13360 5637 19540 23665 24223 31501 19697 20662 42487 52093 19430 -10697 -580 13890 4983
13347 4983 -1458 16925 11769 19877 10054 -2350 -3870 -18940 -18976 -22055 -35316 -25650 -15580 -39655
13333 -39655 -60141 -61995 -46357 -27218 -11788 -1349 -2638 -5652 -20566 -32122 -39504 -33003 -48035
13320 -48035 -57866 -36464 -25811 -12043 -1324 -1288 -1199 1836 3559 15703 13490 7678 25196 3206
13306 3206 -15565 -2438 32844 21453 23828 41863 19936 27502 12879 -43372 -33435 -19705
13294 -19705 -26683 -53974 -19415 16380 37308 43588 28957 2902 4568 1505 -18149 -27363 -21181
13281 -21181 1132 10360 -8542 -26383 3091 16527 14624 -3100 10887 5449 15318 11512 -11520
13268 -11520 -27247 -36645 -40480 -22159 -17286 -5897 -387 9787 8020 -16301 10187 28317 47043
13255 47043 56352 49656 29176 19361 6850 9299 17313 7031 -32492 -58726 -28107 -18093 1110
13242 1110 6556 -9801 -7741 -5382 -17059 3788 4844 -13685 8530 17318 -10710 -24711 -33600
13229 -33600 -48709 -78083 -53043 -30862 15199 16801 -17034 -42875 -23406 -20602 -27859 -43847
13217 -43847 -27314 -25535 -21338 2867 -4440 -30718 -30194 -23996 5407 32843 33804 12405 3913
13204 3913 987 531 8221 23364 38089 26762 19268 4750 -5863 -14747 -6975 -12266 -16559 -5084
13190 -5084 16946 38696 35487 30759 54467 88275 75589 41437 -9495 -48694 -68090 -58819
13178 -58819 -40142 -6363 -24149 -20367 -16009 13704 46384 42289 29338 5228 -3155 -5759 -25195
13165 -25195 -24204 -8699 2931 -1287 17728 27429 4317 27386 28364 19108 -11905 -24573 34556
13152 34556 63753 71897 34615 360 9621 37468 57583 -13284 -26828 -33611 -44665 -26731
13140 -26731 -20156 4105 11841 17123 14027 16652 32532 21845 -4352 -19878 -19375 16772 25145
13127 25145 40914 70502 53436 35251 21986 18986 8614 -5014 -22 14484 6475 10385
13115 10385 24758 44747 56478 56483 32962 12250 12840 13580 11016 8423 24648 53823 38745 29385
13101 29385 10493 1933 22035 52340 61553 82276 80129 20893 -27166 -15104 -10269 122
13089 122 7252 15841 24960 53530 79471 75984 61049 65819 66666 54676 62489 67245 61042 40876
13075 40876 36749 19519 9814 7098 9873 42002 62580 60810 45175 15072 -9301 -141 7608
13062 7608 18773 -7120 6207 18284 22950 39067 54920 70859 62223 64429 52354 48213 41933
13049 41933 15972 2537 -19716 -11164 -5167 -3306 14454 35848 46295 26470 15048 -5298
13037 -5298 2122 -952 -6192 1822 -8014 -8822 -14946 4670 12474 14989 7816 26989 46102 60381
13023 60381 67837 34413 46272 63216 68661 69785 46027 20428 21672 23328 22810 20460 18604
13010 18604 -6513 -5570 17390 42140 16342 2648 14970 30384 49864 48576 56091 53926 59782
12997 59782 35191 36754 38400 50204 65711 63707 23026 -10772 -13156 -4791 -13039 -6065 18508
12984 18508 5750 -12728 9877 21410 26674 30977 21574 -249 3923 16459 26189 49096 24122
12971 24122 25867 27285 8910 10739 18801 40482 60001 47369 34247 25240 5792 20615 73789
12958 73789 73896 53561 54536 48076 32955 13761 21172 39254 55024 44940 19850 20631 19085
12945 19085 34342 64087 71856 66120 53065 53218 43291 51573 50178 50575 58937 58232 74075 74502
12931 74502 78365 86716 105965 116868 109736 119774 108553 119913 140203 142841 146298 160224 182639
12918 182639 222092 246495 258953 290974 316343 325551 331411 305911 288116 285171 276798 256416
12906 256416 247310 256734 248054 215183 217733 219083 210113 206134 209614 230866 243298 232444 214557
12893 214557 208131 200148 205642 227669 232559 241145 272742 290136 308035 336439 358347 368451
12881 368451 368590 345173 312273 268093 227070 211129 238969 232973 227842 233474 228943 256619 284505
12868 284505 279594 230881 215920 224067 243491 259575 250335 256163 270162 271358 300817 293065 288135
12855 288135 318921 371454 393397 407372 400722 389075 349975 325362 288382 244780 230055 186336
12843 186336 136405 112340 109148 109583 107448 131412 119566 124887 100462 94884 92311 56136 59319
12830 59319 55958 43833 48320 84463 115998 119256 105659 58466 25921 13526 9327 34969
12818 34969 62645 79283 46969 29217 57974 79084 121769 135708 120778 130194 149553 166449
12806 166449 192535 219855 262235 280620 290821 297540 300528 344886 380501 363036 343404 322194
12794 322194 305891 260217 190595 168374 146326 151860 147721 155269 144684 131638 130954 135100 131896
12781 131896 98691 102715 132395 148512 131530 146573 159612 190758 200990 184692 182526 215075
12769 215075 241517 256044 289314 327118 356707 408468 464591 497394 497500 480680 490247 512811
12757 512811 492817 446441 406896 360571 307435 283841 244537 236999 233153 224095 196770 190952
12745 190952 229054 236593 248830 246217 241317 226317 217134 225253 231232 259390 265559 237179 225588
12732 225588 201127 204035 211164 231649 253016 280617 311615 340480 349074 364053 403034 421962
12720 421962 437968 430186 400794 334814 300609 299558 262230 236320 236989 216269 208699 229985
12708 229985 218295 196253 174761 131516 138367 125165 119100 114480 114349 133469 132314 124625 149383
12695 149383 160902 144844 160749 150586 163964 156663 157712 165628 179516 176406 178204 181863 171248
12682 171248 170240 194905 184815 161323 160553 179898 154759 95558 84874 114834 114139 95955
12670 95955 94806 93233 116721 132528 119101 92500 119022 146747 141774 144812 136215 138489 130973
12657 130973 103670 92237 118102 133313 150930 152461 134852 140363 136134 165520 185055 200398
12645 200398 214968 255435 255739 269021 331245 407472 466317 524163 536966 513009 500226 449551
12633 449551 412927 397808 372627 362770 383825 390254 396258 392256 390845 414402 412444 411440 391742
12620 391742 377868 380874 377583 388659 382282 358668 352099 369329 367601 375717 379568 411351 451612
12607 451612 457821 459294 459642 482336 489717 514575 517178 537360 550673 578329 601138 616426 604686
12594 604686 557644 548667 572310 556766 529338 534891 544565 563292 555964 552018 562681 566059 574064
12581 574064 570136 543356 527980 510040 518883 522135 511629 484697 498242 521379 540646 536930
12569 536930 538775 543735 558946 579304 613615 641359 677221 697934 712277 727810 730020 701505
12557 701505 709824 669921 627615 640354 647746 640031 633874 667480 692154 706730 723424 755167
12545 755167 766009 773786 757061 747749 727122 722524 728845 744700 770050 816204 819704 841363
12533 841363 918909 929999 924286 924793 944932 995943 1030242 1041525 1060326 1107934 1165319 1228688
12521 1228688 1273175 1334052 1393688 1443211 1518563 1615625 1755567 1896421 2035595 2207640
12511 2207640 2407229 2633128 2875410 3175082 3556916 4011285 4505319 5073885 5729507
12502 5729507 6489180 7374881 8409647 9617436 11075162 12903186 15184963 18091847
12494 18091847 21845186 26713838 32852692 40233233 48434692 56581551 63286396 67103578
12486 67103578 67188698 63693619 57815821 51247006 45395541 40964732 38016085 36113840
12478 36113840 34741354 33664262 32886427 32598900 32917792 33727505 34742765 35550729 35767631
12469 35767631 35307604 34409410 33526881 33125168 33574554 35082667 37710580 41282431 45579060
12460 45579060 50111218 54333057 57602443 59354776 59315798 57451164 54031067 49554755
12452 49554755 44700106 40109838 36265670 33511694 31863799 31273870 31684510 32815783
12444 32815783 34364090 35898418 36958155 37329513 36981619 36260485 35698297 35724706 36517250
12435 36517250 37992874 39962944 42405300 45440666 49397059 54514542 60597388 66823481
12427 66823481 71740580 73736851 71675992 65591456 56682192 46834185 37632019 29983237
12419 29983237 24046869 19638457 16387252 13959211 12074371 10573080 9357450 8330175
12411 8330175 7460692 6743339 6156240 5673853 5244628 4899825 4621957 4402163 4196760
12402 4196760 3997680 3833783 3718180 3649852 3598432 3605974 3655943 3713385 3777199 3893061 4071512
12391 4071512 4283028 4545645 4904548 5270389 5656016 6099326 6637964 7278067 8050068
12382 8050068 8926367 10038045 11444006 13215593 15431885 18307506 22102670 27042520
12374 27042520 33222332 40567818 48548353 56135521 61945184 64641025 63440138 58503378
12366 58503378 51098865 42849613 35129232 28736719 23902389 20376537 17857929 16048767
12358 16048767 14760063 13896340 13331782 13106111 13186177 13571258 14203051 14953760 15745254
12349 15745254 16483510 17090028 17688277 18384394 19288436 20566970 22387762 24884353 28260536
12340 28260536 32688106 38251039 45052640 52987178 61808304 71072796 80094662 88063988
12332 88063988 93980584 96909790 96224493 92014796 85023977 76361890 67133279 58198097
12324 58198097 49927489 42494404 35992626 30511062 26095127 22721468 20267845 18544689
12316 18544689 17430911 16760213 16401996 16261604 16165222 15986395 15667285 15272589 14892053
12307 14892053 14619850 14610818 14957358 15716345 16859433 18422164 20556106 23382493 27124057
12298 27124057 32074619 38317115 45740594 53751386 61228820 66694353 68695238 66398627
12290 66398627 60172421 51424199 42005052 33382459 26330159 20913973 16901776 13982583
12282 13982583 11828526 10183726 8923978 7893619 7037284 6284032 5607034 5049628 4583663
12273 4583663 4146969 3775236 3431207 3122874 2891382 2700972 2500782 2320810 2181007
12264 2181007 2049905 1934326 1858513 1766255 1681209 1585649 1529945 1490068 1446509 1400309 1355436
12253 1355436 1312895 1264088 1170913 1088827 1039403 989056 989164 991137 984076 973035 946885 928689
12241 928689 910131 879551 855463 855221 821505 801985 763944 722519 690450 650100 653852 635145
12229 635145 615685 574656 543941 541512 533336 536198 515262 484820 498523 511952 512526 479324
12217 479324 478172 507305 475449 439956 437701 460340 474990 477115 453376 446413 457633 461296
12205 461296 478872 487351 506132 494049 478926 492625 473936 425248 389831 380397 390634 386497
12193 386497 332628 309837 283273 272960 267554 306923 318454 309468 313563 310602 311121 329038 333633
12180 333633 352636 344416 330438 318161 302798 267545 228752 232634 231140 242775 239633 254958
12168 254958 295841 311786 322482 319979 316922 314903 312367 286212 272788 258112 259278 257191 264397
12155 264397 247203 230989 232212 264652 257527 242290 244333 248140 232830 221308 228268 230804 232629
12142 232629 226306 223107 227631 229043 201659 196078 195264 168537 158327 201294 200003 210399 223994
12129 223994 227399 262127 292244 316463 344094 361186 380697 389500 368205 377866 383645 349438
12117 349438 342925 306120 271778 232065 170044 149095 173020 212717 212061 213428 229191 204226
12105 204226 187702 186416 188691 209632 195211 177626 191898 181178 150569 142036 141334 147657 156561
12092 156561 151783 150574 153657 178021 179692 196300 231271 266897 291825 325301 386917 463121
12080 463121 521515 555055 583611 594373 563748 505871 437707 386767 342259 299101 275207
12069 275207 264570 242963 244292 249446 247152 249534 257912 254346 268014 298995 330493 404851 406548
12056 406548 414770 429880 432191 430991 417192 391436 363286 339243 338043 330300 313082 314425 315339
12043 315339 321175 351142 373748 408262 456844 480713 539204 560851 538240 517595 519087 514192
12031 514192 500080 475665 436124 423695 445949 454480 471756 463873 443013 432773 388735 376910
12019 376910 391275 379015 316468 264980 264089 282690 276412 267843 276122 304854 339373 331911 310524
12006 310524 300975 309546 330547 377523 391179 390332 401556 421095 462566 472731 485887 514517
11994 514517 506894 490054 476917 462088 415922 359109 301840 259182 243132 236536 217684 193337
11982 193337 168174 163397 176325 172469 174897 178682 180767 176141 159933 140220 120097 129787 160904
11969 160904 164399 179257 174933 152602 148782 164434 153165 145490 126428 123960 149903 159431 162595
11956 162595 194815 171234 115611 112846 143276 131311 120963 130814 155627 174787 154131 141780
11944 141780 134186 150028 143242 166648 201771 248213 300099 313255 327640 346677 382363 402788
11932 402788 404949 384544 356252 334242 322768 330734 318409 293610 275940 251873 193803 175940
11920 175940 207897 236638 232290 227298 223974 201849 215761 212031 215419 237830 243086 220989 184176
11907 184176 182246 203981 241596 270241 276692 318174 384634 410759 416570 471557 516806 523054
11895 523054 541989 560986 564289 551139 497363 488006 466309 418627 348864 302262 263832 216735
11883 216735 174620 149672 128667 159843 153444 156770 162912 153616 151201 166678 174788 152932 143841
11870 143841 159777 180876 192989 179965 159683 180492 204612 236424 263420 305286 311522 350134
11858 350134 383598 402324 414289 379377 351759 326578 295886 219013 169070 159094 133762 90203
11846 90203 83622 76012 92540 97728 87877 79949 86897 80426 70747 92307 71814 65765 59003 56412
11832 56412 51056 52973 43195 18903 15306 45311 34871 28259 50414 52043 46083 56796 67423
11819 67423 67450 60352 71753 87022 99319 86856 76579 71158 77901 80352 60097 54733 75483
11806 75483 83930 60643 42424 47196 54368 79304 100208 108688 72368 31876 19469 39715
11794 39715 66544 89908 102248 91696 87715 69893 42877 31956 45774 60756 62413 59781
11782 59781 73645 75726 82168 84402 57005 55045 73373 92275 91132 87344 77976 67328 40509
11769 40509 2292 -259 -1699 36462 28168 11004 28366 45588 68369 74083 62482 50222
11757 50222 35105 34606 32476 31893 19021 27788 48057 54808 72842 72596 45794 46126 53563 68734
11743 68734 79858 66865 70822 56246 42575 20172 21539 37409 51490 52850 62253 47672
11731 47672 11451 17261 24077 53512 78479 75541 70998 64186 59672 57350 37205 51133 27389
11718 27389 3493 23558 35298 19455 36910 51222 53252 45394 31494 29310 52056 74801
11706 74801 64044 42559 49152 48336 25813 15041 19188 13281 2578 2268 5647 2678 22274
11693 22274 37891 47896 68024 64542 73597 77579 56843 20751 3051 14790 2827 -485
11681 -485 8755 39599 34088 32757 56739 58336 47107 53796 49357 50360 31950 16467 44190
11668 44190 55960 40195 50555 38896 17627 13198 9412 22132 8304 909 15969 26273
11656 26273 48629 21554 8613 8139 -8515 32484 45613 34626 28960 28948 65901 56300 13797
11643 13797 -6453 15341 13130 2091 12490 49974 92212 81008 52359 58190 71806 81201
11631 81201 64951 69789 57007 39527 26043 18581 55181 83661 105802 114468 107775 69042
11619 69042 57225 46968 43480 33103 44572 28841 50469 55419 47178 18041 12856 14373 21033
11606 21033 28379 64788 70386 37450 64062 69839 74120 92269 97061 99915 90452 77119 66636
11593 66636 62563 22526 14385 42466 75953 57215 35122 52781 69617 80742 91185 47735
11581 47735 5951 22689 28594 33175 41500 50646 55112 78607 98781 99766 77016 57665 53336
11568 53336 50350 49158 51030 76337 76845 83693 65010 63937 74844 72890 85004 69287 47852
11555 47852 39588 27358 35373 73076 86033 65917 68700 79123 67675 70581 67584 52314 75979
11542 75979 90726 95502 77877 79188 86131 88539 58316 62122 73922 66562 71521 60868 52969
11529 52969 88881 118019 132366 158427 145980 117146 93465 77501 57153 29843 29860 44647
11517 44647 50177 73284 88579 111911 89947 68780 98799 122504 154063 162840 194266 220967
11505 220967 276358 316952 351603 381594 438478 442083 417354 368946 347034 312050 272382 254288
11493 254288 266927 286170 288328 273396 261926 258728 259380 240090 246655 219521 193871 205440
11481 205440 209363 213197 201754 199416 239680 260096 274642 293038 303828 322340 351860 359279
11469 359279 380801 392614 402490 366619 313717 274782 285850 263852 217931 199987 248097 282928
11457 282928 243396 228655 248551 244857 218608 217080 219560 214159 219415 244771 273107 278481 308078
11444 308078 334976 325479 361187 405234 380355 377497 380339 346215 310953 290332 281223 238456
11432 238456 192380 188377 184613 178918 129664 119197 133523 127615 117335 117564 107993 101286 96543
11419 96543 84412 67868 72931 73013 59379 47682 69448 79242 100329 81508 86272 109834 121848
11406 121848 95960 60702 83926 104808 123843 121965 142115 128787 100622 92147 77974 60408
11394 60408 78014 102838 109922 78810 86219 139571 164687 176140 197358 221969 252143 289873
11382 289873 300087 296946 333125 411681 503002 614601 783599 966244 1211743 1477076 1691947
11371 1691947 1845574 1825370 1652457 1348405 1040057 782271 589877 467545 374495 317696
11361 317696 282823 250811 204855 148199 139244 144659 169086 198723 184783 154125 150696 157901
11349 157901 152670 138927 142463 136748 152172 154686 151118 136499 130066 135443 153190 171287 153671
11336 153671 137569 159968 174531 168607 170172 153834 146428 142318 152176 149948 167579 138401 127129
11323 127129 122724 136159 138499 162534 171516 166389 178781 180708 172754 182277 151490 151095 186656
11310 186656 201874 217493 211832 191494 176506 179143 176098 177484 191760 185347 187892 193346 175873
11297 175873 181420 177240 147940 145240 149428 152004 168933 179868 163975 169449 191861 213762 189157
11284 189157 185740 209250 224079 234096 225556 214325 209831 188066 177821 187959 166027 159502
11272 159502 164762 142405 149172 160999 170139 187932 199995 193669 214308 222133 197362 203386 237774
11259 237774 211337 213702 230044 260990 283134 307839 327095 362203 368923 408327 488320 532210
11247 532210 552314 531292 484165 462890 461015 475354 502672 552591 569435 592231 662267 745956
11235 745956 833175 865175 909570 928287 901630 839048 757888 684791 626013 568326 504752
11224 504752 466158 451992 419986 412503 437281 444376 426231 410416 439862 495289 543696 620021
11212 620021 645530 691155 758463 809826 873317 954126 995596 995291 988788 945586 910982 850250
11200 850250 787794 726493 706486 668265 643405 621095 622866 612114 575536 555497 567020 550997
11188 550997 539534 515015 497181 484575 458985 469540 489041 478917 501464 514579 556197
11177 556197 588827 598104 609406 620094 620425 643212 720438 788346 840385 885964 917915 973649
11165 973649 995197 1026355 1031413 961636 884861 806121 760339 708663 684720 657668 648410 632010
11153 632010 606173 586130 599329 614232 604037 609661 604823 618213 628782 652227 681676 689323
11141 689323 682767 691276 712222 743027 748660 725460 721136 753933 772927 801990 834264 870460
11129 870460 885278 911358 948035 983060 1020099 1044145 1093846 1126905 1149362 1218202 1322090
11118 1322090 1426606 1526009 1609796 1669557 1783450 1889040 2005573 2174141 2358879 2554153
11108 2554153 2739205 2975630 3291839 3667210 4090561 4528676 5058660 5650579 6304131
11099 6304131 7078682 7970720 9025811 10317359 11907285 13911015 16388903 19536554
11091 19536554 23530775 28611570 34957031 42487892 50825509 59104998 65909691 69946535
11083 69946535 70668685 68336022 63651518 57690425 51814782 47050197 43485215 40733312
11075 40733312 38485110 36648677 35355054 34780601 34932614 35668949 36459351 36706544 36115643
11066 36115643 34778978 33004587 31184761 29939476 29730825 30847106 33351329 37130085
11058 37130085 41924138 47358509 52790181 57454666 60684658 61964405 60997454 57905629
11050 57905629 53303838 47961008 42565749 37688092 33886633 31497494 30577037 30937909
11042 30937909 32227672 33951279 35474806 36384017 36553230 36009808 35019629 34115055 33900069
11033 33900069 34580498 35911951 37689272 39831669 42334593 45452302 49372887 54015583
11025 54015583 58803064 62627551 64196435 62947100 58903679 52518396 44605610 36417208
11017 36417208 29202373 23467078 19109475 15829280 13315561 11374062 9882099 8685987
11009 8685987 7697948 6884466 6207444 5669555 5227283 4828743 4500574 4205926 3942749
11000 3942749 3676313 3418719 3180739 2956258 2761549 2584448 2434568 2319466 2222355 2171046
10990 2171046 2117720 2034031 1956950 1885241 1840817 1798519 1733150 1649872 1574733 1519394 1473522
10979 1473522 1438581 1400272 1363317 1340100 1290988 1263140 1233732 1222629 1214413 1171130 1139389
10968 1139389 1133129 1125274 1118868 1100007 1128463 1137712 1100741 1079242 1047629 1009214 995946 980686
10956 980686 943287 898668 878693 866686 863732 877977 851498 839508 855173 846413 820870 812838
10944 812838 785425 765679 747407 725883 700855 675424 670652 658061 625020 649073 649376 654337
10932 654337 656674 649175 669846 674569 672399 680491 662197 667361 659180 666309 653331 658842 638084
10919 638084 614219 612285 597244 596789 630967 653828 645526 674307 694270 674583 700865 717145
10907 717145 702691 684613 662873 675161 690379 697893 671760 683561 687784 709956 708648 685425
10895 685425 696622 729448 732616 763973 782317 779876 804698 847136 862836 876138 896273 901976
10883 901976 886377 895072 897806 927534 980454 1032534 1082529 1131562 1164692 1196425 1211180 1196991
10871 1196991 1183919 1178470 1172063 1170978 1170760 1187160 1198832 1215585 1235567 1248415 1272610 1300984
10859 1300984 1323940 1337867 1361826 1398790 1433396 1478925 1561818 1667342 1762024 1838694 1908045
10848 1908045 1999109 2146658 2324540 2548291 2770941 3028989 3335477 3697752 4067756 4426042
10838 4426042 4851659 5324424 5870858 6501719 7299172 8280385 9501277 10995798 12865263
10829 12865263 15193681 18071804 21678750 26239500 31801576 38330111 45488087 52625106
10821 52625106 58591646 62215991 62946018 60946329 56703956 50876665 44394853 38304819
10813 38304819 33123484 28903317 25511857 22908367 20951786 19619115 18891592 18710112
10805 18710112 19094707 20021481 21535508 23539498 25951377 28585507 31267750 33810461
10797 33810461 35913773 37449868 38562823 39622433 40937771 42745688 45204152 48325640
10789 48325640 51780704 55084540 57768993 59432724 59701711 58321464 55476582 51741450
10781 51741450 47725585 43937077 40690912 38175019 36542609 35709215 35371851 35162329
10773 35162329 34736706 33892399 32559224 30690418 28450094 26206151 24201581 22620243
10765 22620243 21563302 21078763 21255179 22102829 23639928 25902170 28948770 32849653
10757 32849653 37736715 43613945 50342879 57505900 64336800 69675481 72245586 71405614
10749 71405614 67214843 60309364 51715659 42756147 34613331 27922442 22693894 18665729
10741 18665729 15515317 13007035 11057616 9522868 8275756 7327196 6559101 5959108
10733 5959108 5458519 5068949 4724404 4412195 4122148 3856979 3573907 3301433 3059097
10724 3059097 2837319 2633064 2468910 2345835 2198582 2083317 1990565 1907438 1821299 1742536
10714 1742536 1676822 1623034 1571997 1526910 1506707 1489613 1474937 1458352 1425872 1391519 1367091
10703 1367091 1321429 1257538 1169039 1124749 1116609 1070612 1035297 1001465 949042 904545 920197
10692 920197 919866 905030 910057 878001 841690 818970 785957 751935 727118 720245 707111 663153
10680 663153 652046 679429 713090 719195 709135 694770 704323 709671 725710 756522 769666 777552
10668 777552 832795 894922 989469 1085141 1178663 1284190 1359954 1411477 1427859 1434550 1455190
10657 1455190 1464035 1428713 1343445 1226051 1115934 1001339 938424 909183 851758 760438 703006
10646 703006 701458 667416 657639 645050 614145 611167 623094 630978 640814 629442 640612 655280
10634 655280 682638 739785 767015 804667 813133 790769 735186 709606 703511 684904 640235 628972
10622 628972 626008 624780 657133 697877 694906 692039 685066 648724 634913 652344 676196 747696
10610 747696 808064 838744 897210 975332 1019557 1028531 985929 950087 912696 884699 871612 806624
10598 806624 702118 595272 505000 411128 339285 260015 218241 182928 197865 210495 222684
10587 222684 252429 277911 307884 324786 308462 282110 258940 228784 248831 243803 223512 215875
10575 215875 214004 218962 234214 235283 226587 239144 274530 310280 351158 384702 392150 387036 408294
10562 408294 452667 458407 435511 386999 358673 354855 342309 312160 283670 292044 291994 311069 312546
10549 312546 293213 305825 325901 325358 343468 377484 403380 428538 421743 429611 416984 415454
10537 415454 469067 495149 541425 635031 715218 804105 842390 869639 931422 1007564 1009670 935304
10525 935304 872272 813672 735583 649999 611232 618066 609494 576370 558482 579216 568059 538225
10513 538225 517645 516869 527658 558351 578783 596153 627861 670725 696714 715435 758723 830538
10501 830538 870845 888874 859942 809089 759067 710807 706667 712782 698160 710208 740954 779330
10489 779330 803326 816094 810553 801494 786994 783319 795986 795667 811968 823703 834366 852428
10477 852428 897552 926982 967885 1003869 1028965 1073684 1106278 1158369 1211641 1247125 1289291
10466 1289291 1337503 1388207 1421011 1444002 1532333 1594822 1605300 1639600 1671964 1694820 1723082
10455 1723082 1772453 1833948 1939868 2065608 2218687 2315536 2410283 2493648 2583268 2643034 2713920
10444 2713920 2831424 3007239 3193845 3380756 3651219 3936818 4248678 4601434 4969843
10435 4969843 5365684 5824583 6345356 6934690 7615694 8395019 9313611 10372810 11547396
10426 11547396 12952293 14804518 17164001 19998762 23106666 26411987 29681693 32755828
10418 32755828 35854743 39566226 44465712 51019890 59744849 71301654 86656259 107356813
10410 107356813 135861473 175450863 229172735 296803956 371047199 439429770 484869180
10403 484869180 477233339 404500295 307255379 225222830 166238498 124978769 95971440
10396 95971440 75480611 60835067 50203933 42379135 36596203 32269331 29006323 26554658
10388 26554658 24609290 22900810 21117740 19087370 16956117 15038476 13420713 12074581
10380 12074581 10938517 10004671 9204050 8543506 8007959 7531656 7114894 6777583 6473888
10371 6473888 6200821 5950202 5727548 5528053 5319821 5145183 4969797 4788178 4595615
10362 4595615 4377912 4094959 3805162 3613063 3460061 3315792 3204867 3071282 2967007
10353 2967007 2844810 2730485 2649003 2543035 2432789 2335717 2232403 2146859 2074992 1996281
10343 1996281 1922704 1847108 1805988 1765613 1733700 1699181 1674056 1654486 1694059 1707145 1722433
10332 1722433 1757036 1744409 1746564 1717819 1649306 1582808 1491419 1397441 1293543 1203757 1110442
10321 1110442 1066474 1076500 1093290 1104638 1098534 1084042 1075987 1047708 1030395 1023330 977562 940458
10309 940458 919902 896132 868844 808881 770050 758627 765362 752026 739992 743546 745067 727266
10297 727266 724619 731798 738153 746643 738352 743047 746382 725248 737882 735794 749592 758133 765655
10284 765655 808324 851352 895192 954564 1004990 999186 1005804 1080413 1171448 1209269 1184321 1113648
10272 1113648 1024890 982141 924276 878471 824824 801500 783590 789107 767612 763213 796325 868741
10260 868741 949799 1044765 1172168 1325036 1539644 1837064 2250335 2785259 3402589 3977509
10250 3977509 4364704 4362746 3816369 3027911 2358988 1896023 1554960 1347106 1179693 1040034
10240 1040034 930268 846618 800500 746016 679898 628854 644431 672367 683101 634824 599884
10229 599884 563933 516536 469881 464232 449213 429099 444945 485358 510603 522029 545987 593983
10217 593983 613629 640658 642973 611031 560454 523434 472363 415466 356226 334098 336141 326213
10205 326213 317111 301958 291320 299976 283425 271624 301199 305892 316229 303637 268861 279854
10193 279854 280004 254508 244227 273291 289086 291165 298402 263003 235309 250190 251719 249418 255605
10180 255605 251630 246068 233340 241520 300727 328897 334102 342570 339565 326165 306509 286708 274501
10167 274501 265919 254037 241702 226272 194272 177289 168616 182770 200912 227743 239450 233992
10155 233992 247738 273857 261642 227990 204417 224254 204664 183874 175486 147837 111446 116755
10143 116755 147548 172428 196122 186137 182097 195066 205655 202830 190488 177159 167902 164729
10131 164729 198959 206929 177846 155714 138357 128768 152682 163256 137748 120461 130088 152877
10119 152877 139870 141935 163611 161244 143759 174901 209272 217213 218115 217751 217111 248538 266621
10106 266621 305030 318554 326182 316417 326828 330291 346670 358956 380442 396968 391020 392037
10094 392037 374979 346893 330776 303456 262821 284955 311275 298349 315167 316114 309244 346048
10082 346048 336312 313229 313851 341563 362214 343264 354128 371104 372129 351790 356275 381482
10070 381482 413529 450167 458208 457776 459751 472355 476914 448977 433707 424984 423121 397751 377949
10057 377949 343167 326596 311761 308589 315763 304768 276575 294736 311848 343667 401234 432675
10045 432675 477123 553871 644978 702264 805301 998721 1311410 1662416 1957920 2303934
10035 2303934 2325364 1739163 1216321 918070 758106 695129 658567 665521 699852 734292 726233
10024 726233 716384 698577 681419 641860 593583 591248 592727 585920 598829 639163 633545 632087 600999
10011 600999 619886 665071 694737 709884 708326 718969 704019 684881 693025 712526 710132 708981
9999 708981 736233 736954 719996 716403 748746 801180 831306 840216 875533 905272 946116 1029218
9987 1029218 1122490 1227848 1345091 1521026 1734840 2014172 2341403 2651657 2804271 2738605
9977 2738605 2419074 2014741 1645116 1371572 1189666 1057611 969311 922865 868681 825806
9967 825806 801758 786460 771084 746299 708267 701438 706900 704741 693666 701359 726822 763044
9955 763044 791415 807152 796396 815198 839357 887988 932411 996361 1052611 1091336 1164754 1228781
9943 1228781 1309042 1397906 1493362 1595774 1727158 1922971 2139492 2385124 2657249 2985722
9933 2985722 3336353 3748383 4253865 4873556 5663158 6661298 7977653 9649016 11733571
9924 11733571 14241124 16848162 19177664 20655133 20815920 19530034 17345535 15090728
9916 15090728 13156907 11579771 10255991 9122572 8239616 7653921 7302168 7161169 7232218
9907 7232218 7498158 7942603 8618635 9550855 10687064 11921252 13061984 14011002 14744700
9898 14744700 15177820 15308211 15362640 15698961 16553635 18052004 20229839 23040577 26282380
9889 26282380 29702588 32953096 35527257 37389134 39025641 40619577 41880154 42217487
9881 42217487 41191197 39038725 36594123 34444307 32504913 30360896 27870191 25225470
9873 25225470 22681773 20563373 19146653 18469447 18457900 19095859 20241883 21800246 23553513
9864 23553513 25176693 26398245 26977940 26799274 26328780 26237152 26891866 28277181 30416935
9855 30416935 33422701 37133124 41155178 44943993 47769983 49283150 49831802 50053402
9847 50053402 50120153 49964051 49359870 47816404 44736665 40372559 35903140 32236561 29640627
9838 29640627 28010395 27063817 26562671 26245797 25600730 24270137 22510221 20864932 19610023
9829 19610023 18750941 18248980 18211539 18736063 19829205 21428357 23376005 25460489 27336607
9820 27336607 28813411 29851821 30596530 31384149 32504252 33817087 34888603 35407780 35288756
9811 35288756 34577371 33326174 31780476 30151704 28196649 25634330 22742397 20053397
9803 20053397 17891196 16366158 15393221 14858368 14573440 14256036 13676478 12765906 11722909
9794 11722909 10691789 9740386 8852671 8096368 7596038 7320133 7221295 7266968 7513276 7884981
9784 7884981 8416159 9087408 9915284 10916395 12053464 13312962 14740825 16142350 17232482
9775 17232482 17592285 16870150 15088588 12701984 10396797 8531345 7124732 6049436
9767 6049436 5247538 4678134 4275441 3982479 3723416 3481856 3290166 3120488 2986678 2880631
9757 2880631 2800428 2770366 2738938 2686618 2630399 2597422 2572673 2564697 2556521 2593714 2585092 2575983
9745 2575983 2579527 2583835 2596586 2654895 2709694 2767872 2830643 2896284 2975054 3040931 3088652 3150047
9733 3150047 3189091 3230780 3322162 3422031 3504775 3555598 3599271 3649748 3720104 3769217 3832368
9722 3832368 3881245 3906871 3912182 3908648 3878875 3869337 3876304 3858036 3809413 3765418 3688738 3640638
9710 3640638 3575069 3475501 3395326 3311500 3257403 3198135 3137536 3046297 2955099 2870646 2796333
9699 2796333 2722904 2620514 2508426 2415032 2359616 2331556 2247271 2143031 2069952 2002093 1951192
9688 1951192 1905728 1831082 1773711 1723251 1672914 1629552 1587449 1548373 1537694 1495100 1432220
9677 1432220 1373286 1361324 1332946 1287287 1258494 1226179 1215671 1208410 1187906 1111816 1061801 1023014
9665 1023014 982615 963244 955866 921169 891544 872335 835240 814891 808040 784359 782315 788045
9653 788045 782046 772892 756667 713484 673995 656827 642977 657894 660270 646454 615632 614506
9641 614506 591303 550539 544992 535496 544502 535161 544903 547664 536757 548863 551526 521941 502886
9628 502886 506652 491744 467212 471116 435457 394466 393248 400837 434655 430860 411573 350201 312538
9615 312538 309126 344555 358372 344274 351188 349254 314128 282312 257162 256216 242224 215021 223572
9602 223572 256087 276927 295428 294312 258744 261322 262125 247399 240249 253840 252039 236552 244870
9589 244870 250149 238794 251602 290793 268912 229522 222973 218923 224224 212226 203620 206441 199604
9576 199604 199326 183164 181436 229023 241474 226442 211496 202959 204170 198320 177951 149244 131094
9563 131094 157894 182373 190298 198555 167255 160438 169132 129156 106132 120794 152356 159940 157130
9550 157130 158971 169610 170373 151581 135529 106028 111143 121146 130944 175004 158626 148592 156149
9537 156149 179086 197341 217700 229246 202006 183294 178127 194819 206879 192948 161945 120276
9525 120276 119001 151353 172049 195348 230206 248582 233150 215235 202030 179033 177022 193237
9513 193237 213626 211262 179728 154109 162505 155874 142055 132313 142825 133989 147943 147639 158244
9500 158244 161824 161081 183669 216339 211488 188733 181244 173229 162696 168012 181875 183703 203104
9487 203104 234285 245253 245113 255948 263432 251412 247524 246577 253171 243143 239249 235152 251661
9474 251661 250314 234064 191770 157998 159822 163781 178690 176145 161727 178111 180386 185819 200460
9461 200460 213393 219653 228958 218465 231681 245947 258337 290348 295344 303183 308268 287955 294354
9448 294354 312876 323512 324297 340279 330993 316137 298933 306521 285479 234894 194898 185531 206462
9435 206462 187600 183860 190951 191924 177425 162053 181246 164005 150792 165821 170744 156681 175395
9422 175395 213988 236788 226048 232419 277368 284030 257731 243166 262002 263959 254504 267314
9410 267314 289132 283912 262844 251551 257465 210323 201754 198229 180834 146362 153867 148975 134909
9397 134909 131281 140353 132259 126270 111240 102879 104839 115959 118431 109340 83601 85109 85092 90263
9383 90263 94270 77033 81551 94176 96963 95266 95465 132411 138296 138552 147538 147321 123999 114058
9369 114058 101902 99063 117847 110718 79599 62623 73327 77662 59387 39252 63486 71951
9357 71951 72206 65490 44098 32209 38513 42462 21215 28297 30480 20131 20573 9905 7881 28360
9343 28360 31233 21644 -11521 -20494 8136 4143 32496 51560 41945 29800 17566 26710 48601
9330 48601 42709 27985 7262 8303 20571 30724 27065 37225 25676 12115 -10633 -5103 32397
9317 32397 47861 40365 27903 25284 28613 15879 9454 48237 51776 46044 47928 59551 46746
9304 46746 19686 10888 2577 -16792 -4246 -3711 17408 19672 9492 -3349 -14452 9789 12373
9291 12373 28414 17384 4485 7394 43027 61665 43384 41405 60357 49408 50287 35747 39642
9278 39642 39171 53335 52369 75821 84315 49772 21322 12558 18616 15384 21515 40517 28899 29164
9264 29164 33317 38369 44174 38471 13773 16184 28068 24000 14929 25257 56933 72309 64954
9251 64954 56268 57075 51170 44568 45984 44881 43854 39829 58392 75323 74248 88980 96892 89968
9237 89968 86085 127642 139731 147613 160841 144816 128685 117057 109166 106222 93972 102217 105122
9224 105122 106923 113809 115189 122503 112753 52375 62934 92046 110198 108336 114649 108521 100272
9211 100272 104323 153679 172340 142075 129612 128820 108791 107055 130000 157747 160744 139908 139945
9198 139945 130208 114499 94066 78088 73027 40330 54923 59759 51275 65438 45969 22445
9186 22445 2582 15214 37315 53598 61319 68171 91657 115804 119896 127711 130489 135237 143706
9173 143706 178665 188267 206498 226737 237889 268700 280009 255896 222645 212261 189386 214514
9161 214514 223340 190876 180714 187328 196441 213534 205668 208959 255531 290882 289268 274683 284620
9148 284620 288193 287199 299693 306533 287536 259807 254938 242301 238371 234293 225495 240719 231598
9135 231598 199370 166518 184246 203589 191129 176353 173704 162703 193243 226271 203360 182513
9123 182513 158206 132296 112826 117340 124352 107210 113575 120197 105181 92980 94645 87080 82627
9110 82627 118128 125312 133614 135328 145342 161633 154009 151959 156261 177287 177618 178568 174633 192578
9096 192578 195355 173442 152674 162023 185394 197301 165362 179673 230729 266470 276792 289691
9084 289691 287725 279214 281809 274449 267674 263074 280413 303545 290001 271035 241301 218435 205106
9071 205106 197923 177963 199169 213802 234316 218625 201439 189272 182400 170486 169264 149020
9059 149020 125948 149310 172664 159747 117587 98618 87345 81598 86859 60533 73476 71422
9047 71422 58840 38825 15712 34001 65678 50807 41927 55483 57330 47356 54127 83804 89943
9034 89943 95240 140586 165198 180729 183134 180848 169877 152410 138807 127128 129815 112860 116146
9021 116146 118243 121833 120580 115409 131857 120308 92304 77611 76733 93340 84871 86233 102116
9008 102116 96267 78032 60524 60459 61911 78283 119393 156691 183775 195068 182873 175676 174621
8995 174621 175794 186648 178509 172154 154168 177158 187637 193355 213009 237485 260243 275023
8983 275023 279015 270795 260881 209670 203386 160667 114703 58405 56764 74296 93771 99140 85757
8970 85757 72356 83377 85749 85886 74643 42756 26681 19122 26340 22899 5115 11707 39136
8957 39136 33072 18721 50415 63221 64177 56162 74921 83007 69942 76565 53627 42485 98518
8944 98518 130046 150508 177324 200144 215761 246304 287138 280467 277881 268221 238218 205950
8932 205950 164010 126068 130587 141166 102026 60694 60761 57288 64402 75218 68035 41590 41463
8919 41463 29031 16111 23984 2574 10162 49701 28443 4030 -7681 -13693 -9824 13536 29578
8906 29578 29692 34031 60841 73879 57161 51102 24364 8625 24488 68518 91443 104989 147642
8893 147642 197285 184892 158315 148195 136046 117692 93182 91487 67938 64166 64230 62098 17146
8880 17146 -4237 16423 16074 20472 27447 46201 63189 56521 54264 43458 27161 -2738 -30005
8867 -30005 -31247 -14802 -1255 19552 33839 26442 16449 -13491 -28206 -22403 -16439 15873 19922
8854 19922 2634 2972 17331 22535 -8306 -30919 -20071 29748 44700 60532 58566 49676 52131
8841 52131 35011 29450 20154 50384 50100 39485 10983 3051 5449 14528 21671 17778 7524 32568
8827 32568 19569 -3506 7656 25161 22590 8260 30923 18758 -1909 -15609 -34444 -30130
8815 -30130 -6411 -13415 -22390 -38748 -66552 -54290 -17650 5800 -2699 -8962 -1905 5984 21809
8802 21809 19643 20585 8420 22138 11840 -5752 211 14698 12994 -2157 -6616 -11409 10200
8789 10200 20879 46308 43394 20952 4402 -21330 -17059 -7594 17300 31296 14563 -1990
8777 -1990 1475 18329 15790 -13333 2331 17790 24788 12962 -3010 -8718 -9859 6086 10265
8764 10265 -14125 -13599 -10084 4918 4371 9471 817 4666 -4832 10361 32169 35475 28375 22026
8750 22026 17753 3486 14979 24993 3523 -8552 -10072 -9875 -823 -7687 20041 20743 21996 16066
8736 16066 5838 -4132 -20267 -24003 -38596 -21167 21312 5702 -6734 39116 61044 40805
8724 40805 26200 11018 -888 7158 15179 -368 -17745 -859 17916 22498 26503 35355 36527
8711 36527 38127 33835 27671 34533 27945 -9067 -22153 -4413 -501 28952 60799 65614 46166
8698 46166 1845 -23278 -125 24143 9194 3657 16190 25004 2817 -6647 28191 20612 4638
8685 4638 25814 29019 45125 42801 50813 36189 69889 76370 48288 28431 11438 -15983 -15647
8672 -15647 -11352 623 28807 54691 34754 47082 35006 10309 19082 31165 21308 5554
8660 5554 22658 29187 37436 46763 51093 40212 22751 21413 409 1993 15420 34820 30016
8647 30016 12400 19784 37243 48474 59873 59649 67369 28388 -5025 -20361 -15043 -1238 9909
8634 9909 6876 5299 8068 4744 9976 11816 -4285 7372 -4396 -21830 -24024 -11166 29463
8621 29463 43562 28257 22090 3314 3695 -2057 10812 -2071 -6259 -3826 -28077 -23664 -26203
8608 -26203 -31818 -7112 8943 31584 30226 27150 23318 11992 8874 37691 86578 82679 77756
8595 77756 69431 35781 53133 63495 56099 71587 74423 67526 88415 115624 126153 121953 121125
8582 121125 128247 84282 63548 65057 52262 60000 67795 69345 51333 24012 17426 33829 37105
8569 37105 16678 28372 46560 45442 29790 2573 -6963 -20240 5531 -3685 -13975 -14847 6680
8556 6680 16872 48439 60911 50589 49239 55357 30871 32616 20482 26166 43719 5509 -29098
8543 -29098 -24524 -26630 -45853 -36059 -12863 39548 45211 58144 48130 131 -7202 4826 7836
8530 7836 14458 9672 7113 7516 4119 -3408 1853 1183 -38134 -46978 -26212 -3458 744 4560 19696
8515 19696 19205 16179 20307 9153 -5585 -3240 -5892 -20415 -34585 -33135 -36669 -24959 5480
8502 5480 29040 46895 36161 29361 25439 18900 -1859 -9105 4914 30480 -1235 -5870 -17243
8489 -17243 -7357 -13319 -20143 -29598 -17309 -3508 1051 -16696 -4033 22399 67876 70960 33484
8476 33484 2083 14839 30869 33467 -5416 -4797 11428 -2625 -20142 -35461 -22579 8002
8464 8002 8781 3876 4898 3893 7067 27267 35934 29959 23265 4384 -14411 -15937 -15227 -22603 -9366
8449 -9366 7454 11976 3599 -2851 19803 35944 35354 37657 47387 13015 -7491 -923 36489 39594
8435 39594 34012 32025 311 -7850 -2397 4171 19129 23984 15718 8877 11783 15908 11517 16446
8421 16446 9120 -4730 -9745 -9332 -23735 -4514 1420 16334 11567 13490 20632 48484 35520
8408 35520 26350 15219 7084 38921 29434 38248 41422 28332 21815 16229 15614 10430 11184 32419
8394 32419 22508 17151 67332 85431 84509 78714 51308 49096 41769 57797 58063 62339 52416 56176
8380 56176 64944 73327 38411 20730 25214 18655 -6913 -20100 -26668 -1360 9663 13107 17562
8367 17562 -3230 -11194 1223 25209 42691 32410 -1582 -5903 20949 11403 5279 23264 14202
8354 14202 10376 14234 12730 11402 25468 51077 53199 24092 21661 29201 24961 31655 43907 53958
8340 53958 23650 8673 -1412 12909 19441 36124 69733 57440 59569 37694 22274 13217
8328 13217 -8988 -37276 -33810 -7402 -14905 3309 10084 11211 30573 28224 4353 1116 1211 -12337
8314 -12337 -20381 -13614 -2526 30415 14317 -16024 -37361 -50002 -20758 10618 16681 10334 -6722
8301 -6722 -11135 -6326 -5262 12208 -5405 -26313 -24119 -31699 -18339 2110 2545 13730 38779
8288 38779 19867 34225 37035 38132 49496 28157 9486 -7847 -29145 -28462 341 8618 23488
8275 23488 35102 47936 36758 20166 -1502 3340 26757 23531 15455 18110 11421 9981 2505
8262 2505 10298 8573 -3930 7791 40942 26959 21492 32916 25663 11964 -10323 -3482 -18453
8249 -18453 -23036 26823 27418 26192 15950 12083 21841 13531 12736 8948 27331 3699 -6231 -4117
8235 -4117 -7396 -752 14274 20355 35986 43362 39428 42985 44020 39858 -19523 -12303 -6665 -2659
8221 -2659 1454 -3117 11563 6528 -5253 -22424 -29938 -40793 -55012 -42141 -27507 -45592 -42585
8208 -42585 -13393 -14632 -27665 -25672 -27014 -5051 16688 37833 55180 25563 20869 24737 47080
8195 47080 33143 34965 67693 57985 44093 6989 -4596 18261 47199 73630 98008 76770
8183 76770 55785 45402 51361 43985 48483 36525 23158 3287 26223 37429 52060 63014
8171 63014 40475 5419 30121 38084 11181 -23845 -31714 -18407 -18061 -23023 13758 23512 40151
8158 40151 19517 12579 2545 2178 9942 15906 11778 9028 -5171 5698 29212 40919 37373
8145 37373 32428 -9425 -19565 -30346 -4262 -40576 -48704 -38350 -27084 -8946 -3823 -7637 -5853
8132 -5853 16955 46159 57807 77024 68080 58700 36046 33689 20987 48873 58415 42751 41814
8119 41814 16906 21853 33668 18619 20958 38268 36540 21136 25067 8905 -20875 -11035 -20131
8106 -20131 -19353 -26842 -55659 -64907 -58985 -38190 -23216 6496 8238 -13585 -16315 -28311 -13444
8093 -13444 -18107 -13937 17088 40364 43091 33027 41244 72455 90770 95478 94479 92094 83628 84159
8079 84159 113331 198971 268579 321293 372384 437201 475348 490585 462717 366865 294887 240488
8067 240488 163683 120969 111468 84360 64937 43527 41189 26378 9409 -18185 3199 371
8055 371 5794 12492 35258 20931 25826 34496 38856 51748 76300 86976 103552 100038 102418 106253
8041 106253 96478 78479 57928 56811 82265 105246 134547 153960 195642 251303 314760 384982
8029 384982 509882 658491 768676 815454 812385 745576 607889 454360 348495 272673 214777
8018 214777 172465 132020 86937 54928 77846 101510 60605 30681 7593 33790 62543 40489
8006 40489 32764 35141 40128 28583 3215 21252 39939 29746 29024 32203 49839 63655 63422
7993 63422 38091 57857 59550 60937 80550 105297 147454 161276 151762 166456 207732 269914
7981 269914 298548 296217 328581 328438 309058 278180 224137 157321 101963 98390 96453 76583 33874
7968 33874 14206 27918 35113 61673 73422 44273 43369 73858 73279 83112 77643 80729 63970
7955 63970 51169 40065 17939 9372 4562 -4651 11387 26071 38464 64633 97686 99533 66106
7942 66106 56883 45607 14786 -1537 -11626 2300 59295 75857 92168 92827 67540 60745 36347
7929 36347 10965 32510 45722 31741 30562 26403 9236 5977 19287 29305 38680 22760 30850
7916 30850 41859 31564 38628 35989 6625 16589 22173 -15315 4575 32183 19010 -5583 9807
7903 9807 -11837 -4670 13170 20688 23862 19106 25056 -1229 -27172 -5303 12156 40958 42171
7890 42171 41172 35385 37223 36525 24504 20793 16411 30170 53039 45397 35260 25281 3556 1240
7876 1240 -92 -13899 -8409 -1144 23718 40148 38552 30149 24782 21327 -5837 -37356 -19181
7863 -19181 -3082 7966 -7756 -4280 2938 26976 35585 10882 -11809 -9236 -6835 4967 2924
7850 2924 7017 21170 42836 29711 16036 26490 35575 39821 21333 -6028 -8613 26502 27113
7837 27113 12766 -7866 1436 14304 14294 -5614 3841 10550 1974 -15033 -6627 3660 5169 -1328
7823 -1328 -1628 22877 50323 27173 31097 25115 5554 -17858 -36355 -39079 -12784 10487 7841
7810 7841 5706 11902 22666 45166 28157 18863 8985 14036 21368 17056 13494 14794 20999 18919
7796 18919 9743 -8955 -8437 7307 3554 2071 2249 -10460 -20797 -15168 -6808 4171 3088 -16790
7782 -16790 -37886 -30334 -13241 17909 57845 55975 25703 24080 8096 6078 6172 -22380 -36077
7769 -36077 -29786 -3995 13095 -11927 -13733 -16412 -3888 6897 3617 16144 400 -6953 -6340
7756 -6340 -10433 -25432 -24371 -17146 5631 38904 52597 42918 6418 -8192 -19427 -5220 -6245
7743 -6245 2612 -4032 -599 34079 27720 -4707 -15624 -27202 -48413 -45812 -10223 -22710 -31808
7730 -31808 -4612 5324 11199 3964 -7309 -2455 23219 -3823 -31550 -23869 -38954 -28701 -14619
7717 -14619 -13037 -9257 25992 34383 34372 34214 38528 32708 28527 3057 -15056 -25133 -40494 -36588
7703 -36588 -32379 -21806 -14168 -4943 -2888 -11208 -6573 22517 42135 24805 -7809 -43844 -52858
7690 -52858 -32926 18438 43359 -18383 -27720 -26058 -24623 -29535 -33236 -30303 -20042 -25525 -9996
7677 -9996 -26818 -12494 17187 4710 -301 2868 -27650 -11585 5721 -1041 -671 17661 33093
7664 33093 9990 -5868 12508 18631 30058 18221 -27159 -27722 -46154 -40897 -4709 -242 -19946
7651 -19946 -22809 -27223 -15098 -17709 -30318 16112 30870 22665 21098 31915 25412 9181 -7765
7638 -7765 8092 2498 6389 -19334 -54787 -62339 -47806 -11453 15679 27306 22825 23415 -7915
7625 -7915 -22681 -854 -7031 -1138 -16916 -30130 -4974 15729 -11479 -24557 -31499 -23964 -46910
7612 -46910 -61638 -72387 -55921 -30300 -1708 28562 31425 18003 15647 27166 56922 38145
7600 38145 21833 42410 26849 3858 -14846 -21699 12090 18176 -29496 -36190 860 26453
7588 26453 35668 5158 -35653 -25244 2923 22352 15308 18048 -6116 -32197 -43759 -44265 -38852
7575 -38852 -29197 -13845 -7294 -18351 3574 9416 24350 14102 -3702 -15309 -7698 -15962 -14628
7562 -14628 12076 21597 17246 17072 2166 -1129 -8117 -5592 -11452 -39602 -34707 -24237 -1944 9910
7548 9910 4237 -20093 -48947 -23674 -6981 -8264 6123 182 -15626 -26785 -29867 -29579 -20392
7535 -20392 4011 14669 13601 1215 -33959 -56700 -54816 -15940 -14507 -13934 -20269 -41962 -39907
7522 -39907 -31967 -14100 -29789 -53324 -58293 -62992 -66189 -52726 -44275 -60776 -61293 -50855 -38948
7509 -38948 -29687 -38849 -47845 -47339 -28393 -5244 1103 10589 -15161 -33554 -23063 -12913 -11819
7496 -11819 -19677 -52707 -46837 -61646 -40067 -17929 -39655 -48897 -20198 9036 21791 14244 6669
7483 6669 -17670 -29014 -42158 -69508 -51628 -70594 -74343 -56369 -25945 -25357 -21945 -6890 -7131
7470 -7131 -2304 -3987 -792 -3670 -1898 5882 -17921 -33194 1031 22472 3527 1843 -7544 -30872
7456 -30872 -27327 -6214 -4900 -23629 -17410 -12362 -6115 -31312 -22683 1982 13718 -8685 -7053
7443 -7053 -33148 -38921 -25788 -6672 15974 36641 49437 37224 31298 19017 16872 6781 11651
7430 11651 -1224 1835 23490 7161 -10169 -12329 -3304 -10734 -11409 -3916 -1456 24266 20367 28589
7416 28589 23855 21668 21778 10426 31290 36264 25728 11528 -5811 11894 22315 18924 518
7403 518 -31642 -54966 -36593 -49010 -58592 -48316 -20879 -6794 6151 20350 17580 14152 31020
7390 31020 20812 14025 14237 2333 -11859 4246 -11056 -13244 13381 16012 6049 -16942 -35805
7377 -35805 -39490 -5887 958 -12809 -14733 24298 14883 6688 8780 15619 34184 31717 20446
7364 20446 16423 12583 -8790 -19081 -19494 -15584 -22701 -33854 -7851 21155 29085 28839 -527 -17533
7350 -17533 -1086 -2026 -25713 -24402 -21864 -28392 -14755 1278 17695 39450 9782 -7198 -11218
7337 -11218 -3515 -3742 -12726 -17364 -6372 17650 30610 51604 21057 19762 20770 16865 4920
7324 4920 23362 37176 20936 12411 17182 11304 6838 -15804 -29591 -35542 -27610 -22959 -13738 -3781
7310 -3781 2325 -9786 -16893 -7999 -1584 889 2877 1237 11993 8742 31189 20946 23530 43178
7296 43178 51808 40993 27364 15726 973 2347 -14746 -28253 -40326 -34486 -31167 -27320 -17545
7283 -17545 -7995 -10507 -42224 -30847 -37462 -56106 -72578 -54198 -14126 -6021 885 15619 7556
7270 7556 -4694 -1709 -6723 10815 13397 -220 6866 -14368 -11782 -24968 -10127 -19856 -28798
7257 -28798 -34713 -34952 -35932 -26769 -29125 -12251 5156 -22822 -31300 -25489 -33555 -20201 -8297 -10248
7243 -10248 -32046 -45659 -34739 -40381 -27764 -2990 17205 16331 1798 7206 18985 22859 21664
7230 21664 9670 35314 21134 834 -889 -3276 -2543 27015 18364 33295 32199 -4019 -8985
7217 -8985 -1744 -10923 4237 16853 19041 25450 30029 13220 26757 40968 74920 61383 25536
7204 25536 40799 43862 32317 7958 -5214 -425 6658 11015 16408 19512 24082 19089 -3783
7191 -3783 -38833 -35046 -6920 15916 14139 30645 47192 50642 41120 32811 9953 -23032 -22030
7178 -22030 -39972 -22588 -3134 5492 -5915 -8942 -14094 -14663 -22419 -9630 -9352 -8434 -12433 -9310
7164 -9310 -20896 -39447 -50797 -43021 -30821 -12383 8997 12274 -9205 -24853 -31478 -54417 -50322
7151 -50322 -22229 -30093 -17795 -6610 15083 21109 15266 -2854 -21789 -42011 -36964 -47827 -34467
7138 -34467 -15471 -2477 -8840 -37765 -38105 -4942 -13728 -22828 -12903 -5862 -5373 -19050 11607 50491
7124 50491 23188 797 -3874 -23296 -36393 -32641 -17056 -8989 8527 15237 -11699 751 -1710
7111 -1710 -23297 -30484 -259 6466 -13930 -26793 -15911 -6725 -6605 -3352 -24484 -28277 -51323
7098 -51323 -50388 -45257 -47793 -48810 -20187 -52645 -43791 -29417 -26244 -1769 -18031 -21158 -19121 -48564
7084 -48564 -29848 13092 55966 20726 12349 10114 12082 14373 12302 -25406 -38925 -48888 -40079
7071 -40079 -8375 -5413 -16050 -15513 -4815 -12199 -4347 18877 -1206 -25121 -59939 -88809 -103037
7058 -103037 -85020 -59766 -43162 -31886 -27816 -14012 -2364 19173 10820 2242 2353 6054 -1394
7045 -1394 -24503 -40894 -9084 7445 3051 2434 -7524 -26518 -17665 -20997 -19473 -29907 -28239 -37227
7031 -37227 -56266 -65399 -68995 -44409 -30762 -34029 -44656 -24052 -28484 -19131 -7213 -5325 1291
7018 1291 -10248 6158 27463 37393 41575 39221 30048 2187 -13582 -46786 -42381 -8564 -16886
7005 -16886 -35093 -58990 -54940 -22368 15108 18983 15491 -7218 -36312 -23945 -12961 -31179
6993 -31179 -28471 -26882 -26535 -9022 -13986 -29063 -24228 -26409 -49600 -94966 -105915 -63878 -14734
6980 -14734 -9601 -4688 -6767 -19601 -31639 -43419 -41530 -14880 468 6137 1495 6051 22022
6967 22022 9130 -22813 -20402 -16432 -16905 -24532 -41876 -26636 -24927 -15537 6060 18429 17313
6954 17313 7252 -3349 -27972 -39364 -17248 -26353 -31463 -33857 -16935 9960 15858 -24979 -37874
6941 -37874 -13990 -3326 -1467 -18542 -7130 -8802 -20416 -438 11678 22934 26589 14892
6929 14892 14647 23689 -1756 -33037 -34136 -48135 -16065 -8369 -26955 14862 25284 1975 -9636
6916 -9636 -3162 21808 48484 34159 21926 -4599 -18609 1361 21573 28529 52663 51372 50488
6903 50488 41898 39157 12334 12766 18566 12704 3809 -602 -7889 -2377 5138 -5272 -27121 -13267
6889 -13267 -22484 -14773 -20753 -5820 9907 -15518 -3821 2842 8174 -2276 -8607 9965 -10859
6876 -10859 -44955 -37598 -24451 -5297 -17528 -17059 3149 -3058 -13372 -14352 -23109 -16534 5377
6863 5377 -40151 -48342 -25501 -7841 -22469 -9495 -1778 -12894 -4341 14729 25123 13234 -9921
6850 -9921 -41991 -33440 -24455 -868 21966 41385 20200 -5115 -7109 -37848 -40486 -34608 -26435
6837 -26435 -24989 -9024 20421 22940 15288 29986 38086 2844 -545 -589 -11042 -2209 40608 12549
6823 12549 -518 10507 42867 37179 10167 -25249 -13329 -12267 -19650 -27172 -12765 27011 60018
6810 60018 40811 1947 10778 27747 52745 42976 10349 -8256 -1406 10139 13583 -2291 -21891
6797 -21891 -41155 -56365 -41423 -25598 -15128 -44285 -61422 -66298 -47285 3772 -6149 -22035
6785 -22035 -27648 -12661 -2785 -920 3604 21490 38748 19855 -28080 -46738 -35535 -43365 -58746
6772 -58746 -51436 -30240 -15564 -31296 -20319 4029 15190 12569 8902 -7134 -33541 -53762
6760 -53762 -27820 -8504 10503 7036 -16600 -21165 -7 4180 -136 29304 66354 62402 25807
6747 25807 20458 9391 -36884 -41318 -15958 27958 54576 25845 3443 19952 14729 5318 2829
6734 2829 14093 9077 -5001 -7471 6512 37044 38052 33103 25259 5269 5086 8818 33658 38461
6720 38461 38772 37015 28410 -792 -18534 -4878 1138 3148 4415 17816 -2304 -33211 -46472
6707 -46472 -60644 -29625 -12431 -18561 -37672 -30842 -13387 25202 62305 56964 24149 -4689
6695 -4689 6883 -6387 -30854 -53506 -41949 -17467 -8492 -4611 -31553 -43259 -63160 -66497 -52542
6682 -52542 -62933 -57813 -37255 -14081 -5656 -14152 -17638 -6898 -15572 -13806 -23167 -23378 -20852 -24771
6668 -24771 -25322 -16111 -5280 -8705 4215 31710 35243 4250 -5368 -30306 -47542 -39886 -25753
6655 -25753 -32576 -11514 6735 22931 32114 29650 -7389 -49182 -50822 -34094 -30922 -38628 -36868
6642 -36868 -29116 -1623 31960 47272 36438 9634 1157 18216 30901 6239 -34352 -31785
6630 -31785 -13500 -4587 -16142 -24613 -45821 -36786 -49071 -44251 5385 4435 -14661 -24579 -7712
6617 -7712 11790 35242 28143 24409 24002 31022 59497 53115 55004 47320 11362 24308 26063 8850
6603 8850 -4734 -12879 -10248 -54406 -63655 -46152 -35487 -45885 -60963 -32307 -7259 11842 -1728
6590 -1728 -37759 -35812 -9919 -23581 -47437 -43867 -42645 -5426 -12631 -46173 -47724 -27682 -6304
6577 -6304 3544 -6835 -16078 1875 16373 3274 -21263 -73444 -66453 -36128 -10532 -11902 -36861
6564 -36861 -32320 -32034 -45108 -44848 -49489 -37834 -21255 -39355 -26386 -2059 -10124 -18886 -21358 -5689
6550 -5689 25596 16175 11821 1812 -6319 5621 -7397 -8630 -23646 -34170 -34992 -68212 -82020
6537 -82020 -49277 -34311 -23786 -10154 -10859 -19195 -36569 -35837 -15671 -9270 -10768 21223 32020
6524 32020 14011 33280 47537 -31099 -90760 -79617 -42068 -15608 -41533 -54169 -44998 -27097
6512 -27097 -21338 -5207 26402 36894 29524 52797 60571 37795 18023 3184 -10498 -6395 2570
6499 2570 9314 27461 22685 22256 -26993 -49400 -30591 12875 8379 -1509 9658 20973 25408
6486 25408 28776 17636 16099 11771 8429 -7118 4060 8550 30429 34391 28052 30741 20129
6473 20129 16029 33493 39367 2839 -10327 -2389 16918 16685 5858 7972 14203 1334 10068
6460 10068 8027 704 2840 -13528 -42834 -49932 -41455 -16622 1181 4285 -2983 -12483 -13043 -732
6446 -732 15584 -1493 -19770 -28764 -30769 -2653 18366 7646 4325 -13031 -17737 3254 7826
6433 7826 -7695 34152 53657 49685 27172 28560 37192 34273 9603 -25360 -25965 -21790 -10104
6420 -10104 -16256 -33503 -13844 -12538 -2170 29487 12723 -1866 8329 8354 13960 15777 -4612
6407 -4612 -19991 -35712 -45509 -37287 6776 12157 10885 3991 14168 -1942 -19563 -40366 -57221
6394 -57221 -38860 -12498 -20903 -21884 -8322 -29524 -44104 -24870 -18165 -11071 -19559 -25358 -28573
6381 -28573 -20763 -18476 -11060 -17218 -12017 -18453 -34910 -30202 -27259 -17112 -10867 -1858 -10130 -7012
6367 -7012 11775 32295 23982 -10122 -29641 -25629 -43283 -31826 -22435 -20410 -40334 -40446 -45050
6354 -45050 -35577 -29668 -18621 -24110 -24545 -25402 -20576 13918 18729 26874 33720 19265 1594 -10373
6340 -10373 -21817 -20953 -43891 -33374 -2589 -15290 -58402 -58416 -50740 -32825 -28233 -36267 -41447 -28977
6326 -28977 -27309 -21724 -6958 -12912 -8330 -10265 -35363 -31944 -33307 -11987 4829 -5381 -14
6313 -14 -27045 -39224 -21695 -31346 -8793 -478 10746 -14340 -19372 -1606 -22316 -43612 -56796
6300 -56796 -75175 -54494 -18042 -434 24818 53235 40550 25750 23466 30195 49381 15069
6288 15069 -25304 -27967 -29096 -44307 -46296 -29804 -13156 -12841 -42418 -48446 -38901 -8047 -24980
6275 -24980 -22870 -39866 -47775 -13173 -8147 27048 42054 36175 17860 -4032 -16489 -6226 28361
6262 28361 8349 -6011 -27501 -20484 -24971 -16379 -29081 -40127 -41172 -19571 -22678 -13809 -3177
6249 -3177 -16870 -12336 878 14969 13678 7527 -8398 -29784 -49349 -25407 17560 -12730 -59941
6236 -59941 -40344 2460 -1834 -7778 -5902 -18342 -20339 -297 32860 43431 37432 32231 18944
6223 18944 15068 -9374 -16837 10272 20172 16327 6292 6018 1709 -12055 -41726 -54364 -65626
6210 -65626 -31151 -12491 -26253 -19220 -8478 -18804 -38124 -37424 -43284 -17814 2000 -12514 -8692
6197 -8692 10070 -20739 -21522 -29374 -43363 -53281 -32352 -15227 -2175 2497 303 -21142 -23043
6184 -23043 -13411 -13785 14046 -7856 8327 27696 28043 9709 -7437 -25768 -2090 -17648 9718
6171 9718 23314 -1694 -17979 -18926 -13188 -19450 375 2769 -2575 -9242 -7411 21562 28322 33917
6157 33917 36230 39083 9018 -20738 -23952 -33104 -26608 -732 -7221 -37706 -42785 -14751 -9508
6144 -9508 -594 8987 33739 21213 -10785 -28066 -42052 -32784 -37593 -40535 -10323 26534 27413
6131 27413 14824 6659 -11497 -10112 -32198 -27571 -35132 3799 20264 14569 28220 48273 37764
6118 37764 7072 -19932 -14735 1983 -9358 -29837 -58902 -71671 -36790 -24966 -23877 7295
6106 7295 -1566 661 -2554 -1656 -35066 -58915 -44806 -35655 -37826 -21693 -11310 -17012 -33462 -43509
6092 -43509 -29358 -35127 -28769 -9450 -20914 -26935 6909 22090 11524 -21346 -32415 1884
6080 1884 -3573 11790 -4547 -51296 -38840 -19926 -38573 -39298 -33440 -31591 -39527 -50328 -55381
6067 -55381 -46671 -72025 -44735 -10863 -9328 -15667 -16725 -5491 17771 36779 48303 13605 5706
6054 5706 34495 47058 45964 60500 27816 -17113 -58805 -60436 -35007 -40417 -53999 -40706 -46825
6041 -46825 -16182 -10062 -10610 7131 11273 4526 17027 -1479 -9896 -18841 -32242 -31485 -20743 -20922
6027 -20922 441 33555 48472 61080 71683 61748 27673 18815 13866 9609 19429 28170 24779
6014 24779 47225 38022 17306 15523 8100 11577 51047 60273 41136 20079 22975 17702 17068 -41
6000 -41 -3433 -4496 -40738 -46636 -33169 -20911 -33409 -42040 -37300 -6645 11561 18480 19848 -1799
5986 -1799 1897 -4824 12001 -8545 -22403 -29711 -21783 -32797 -38894 -44246 -48098 -28033 -15162
5973 -15162 -30713 -38776 -6282 15313 22660 28549 37561 35016 31203 19244 35276 31969 23740
5960 23740 22776 37180 53136 40634 31616 37042 15959 18394 30023 11617 12542 14182 22783 19477
5946 19477 38423 24198 9240 18470 25699 14194 24381 38575 5154 -11835 -8183 -26821
5934 -26821 -36138 -24336 3838 333 -36853 -19253 17338 17795 8015 -9004 -23477 -36840 -34092
5921 -34092 2183 5748 3951 -2289 -35405 -31221 -29269 -69621 -62635 -38749 -34659 -24924 654
5908 654 5013 -7217 -37025 -26452 3070 19336 17293 17877 21091 21991 24246 28533 27084 -1852
5894 -1852 -12599 -1321 -9178 -527 1953 2345 -15834 -42300 -53130 -51693 -27040 -14548 -18608
5881 -18608 -15200 -6582 -12709 -22934 -50298 -29284 8896 38881 34590 33502 25581 34436 42629
5868 42629 15571 7819 -28287 -66675 -65622 -58633 -49615 -56277 -59221 -45455 -8944 -13250 4649
5855 4649 11037 3319 2299 21677 8767 -15103 -8801 -14333 -9023 -23744 -7668 -5939 -24651
5842 -24651 -11376 -17334 -25025 -30619 -31348 -35068 -32957 -28975 -29698 -22067 -19583 10383 -780 5168
5828 5168 23045 31388 3491 -83 20818 -9187 -21051 -26023 -40964 -43810 -41123 -54006 -52786
5815 -52786 -19597 -44877 -48346 -37417 -19342 -9951 -2735 -13220 -6337 -1146 -8507 1587 4836
5802 4836 6139 -9256 -2874 -9912 -36655 -37131 -34810 -32496 -9997 396 -1639 -8263 1764 -12603
5788 -12603 -38032 -47374 -22486 -17834 -27018 -12223 -8124 -13428 -20895 -25838 -35296 -40412 -41521 -38972
5774 -38972 -27774 -31924 -22117 -15779 -18325 -16064 3857 9464 -21308 -17308 -8010 -18361 -31081
5761 -31081 -34885 -15424 -12130 6540 12508 14383 17602 32819 40832 22045 4410 849 -14936
5748 -14936 -17637 -28335 -37666 -30041 -47203 -56322 -26455 -7127 4433 -5838 -32250 -24141 -6684
5735 -6684 -25188 -41052 -28676 -7393 -22558 -14986 -26732 -58294 -63799 -75774 -68473 -45221 -55701
5722 -55701 -40318 -11261 18316 28690 4841 2781 17389 11731 3467 -35458 -30565 -2277 16205
5709 16205 -7030 -21147 -16384 -21134 -26372 4502 32839 20475 13788 20364 -17571 -44709 -22552
5696 -22552 -7349 18531 14360 8889 -2290 7852 17347 33383 34209 7966 5656 14639 13798 -6535
5682 -6535 -51672 -43165 -17875 -32069 -31523 -24654 -28196 -29011 -37727 -55988 -63462 -36156 -16267 -8131
5668 -8131 -21903 -2713 -5075 -5842 -18145 -27232 -17605 -26655 -29840 -16237 -2428 14723 18742 -11957
5654 -11957 -36415 -43901 -30935 9176 48294 44721 38197 22869 13422 15976 -11865 -21860 -16475
5641 -16475 -18401 -11201 20705 35894 15386 -28029 -10264 25580 29530 6104 -11345 -11108 -31159
5628 -31159 -46301 -43161 -48943 -18809 -40136 -60631 -37835 -23064 -9778 -5287 1755 10721 28543
5615 28543 30817 7070 822 -5805 -10150 -10621 -7838 1811 -24783 -37436 -41946 -63144 -39210 -9944
5601 -9944 -16922 -4917 8078 10948 11175 30537 28398 13770 -1498 -14066 -27129 -48434 -63436
5588 -63436 -67128 -80422 -76286 -65167 -64498 -41875 -26215 -35021 -33488 -1210 20717 14874 -8738
5575 -8738 3638 8494 23022 26376 19750 17399 10987 -442 -12939 9376 29935 30676 16011
5562 16011 21689 -13379 -33441 -11361 832 -14475 -16511 1185 5340 16487 3520 -2028 -4759
5549 -4759 -19671 -12176 -7800 -24109 -31160 -40856 -40399 -24330 -23483 -19211 -8929 26624 26876 46824
5535 46824 38711 20014 27039 35045 5477 -4225 -36017 -37506 -25916 -38112 -17489 -11221 -50373
5522 -50373 -61745 -30748 -12944 -27518 -35269 -26114 -17890 -28273 -1510 -1133 -8211 -33265 -21663
5509 -21663 4772 26630 47178 55071 49456 3325 -31294 -4034 12929 8281 8415 7736 -12616
5496 -12616 -29481 -9696 -15782 -37515 -10475 12736 13675 -7647 7210 -14743 -13165 30857 32500
5483 32500 19865 3234 8073 18932 4364 -12748 -25684 -21027 -17032 5947 4721 -1310 -8657
5470 -8657 -10115 -29605 -30337 -27195 -44753 -60082 -70773 -48542 -19215 -15980 -38177 -29635 -36032
5457 -36032 -46912 -51060 -28801 7709 -1053 -10464 -16653 -2724 5560 18272 -2305 -12177 -21739
5444 -21739 -21879 -21302 -25827 -27717 -19767 -9486 -16637 -25607 -17973 -2675 7598 16745 15254 -18345
5430 -18345 -7783 19250 5786 -14957 -41134 -13549 26058 9252 -4049 -38704 -37969 -22744
5418 -22744 -8548 30831 51300 38924 10340 11044 275 10447 1833 -5932 -3844 -5719 21903
5405 21903 17038 6057 15012 29190 23852 16469 1891 2949 -7094 15429 29765 -3196 -34616
5392 -34616 -58085 -59553 -53371 -29695 -15907 -4948 -31014 -20543 -3122 4044 4566 6479 -10536
5379 -10536 11339 14768 -23143 -45443 -25847 -1732 12625 13987 4393 -9407 -10976 -17770 -15475
5366 -15475 -982 16152 29846 7911 -6584 -595 16698 18385 14705 28672 10681 6988 10389
5353 10389 31880 27504 29209 -9225 -49727 -67643 -71306 -66145 -71256 -61107 -31547 -44493 -50767
5340 -50767 -53895 -32693 -43166 -62112 -44344 -26319 -31419 -20485 -3708 -2419 9741 15759 23026
5327 23026 31856 39615 49067 62436 23552 -7445 8733 -18814 -27882 -27813 -17892 2050 14014
5314 14014 3125 -10166 -17920 -12726 7443 16160 26406 18866 9057 30921 14000 17719 -5514
5301 -5514 -16819 -17886 -3885 21947 21808 23794 6175 -12791 -12484 43382 54691 12131 -28318
5288 -28318 -34930 -18198 -16641 -10632 -29085 -14027 -6543 -26160 -7135 21149 5673 -22714 -18807
5275 -18807 -19261 -12779 -25205 -14589 -32265 -34484 -42790 -48287 -9412 -3664 -7814 -1312 17916 39163
5261 39163 37563 10322 -8840 -16608 -20649 -21343 -1778 -6081 -18595 -15436 -23911 -38525 -17058
5248 -17058 13930 18607 14726 8294 -15174 -14821 -14513 -32686 -54166 -49395 -31103 -40151 -31541 -31146
5234 -31146 -25388 -14809 -24726 -36250 -18609 -477 7731 -9107 2659 16412 -36978 -60923
5222 -60923 -59180 -74550 -74486 -50846 -10289 4669 9038 6344 12776 -14267 -4860 35340 42508 44302
5208 44302 29193 8668 135 -34541 -31980 -5533 -3287 2796 19467 8410 2606 -29547 -39915
5195 -39915 -29654 -22981 -9368 8887 28660 32592 21270 -17065 -32067 -29229 4925 7396 -7185
5182 -7185 -12441 -14083 -2159 -4349 -35171 -51683 -42892 -6378 22308 20303 7928 18060 14878
5169 14878 -11480 -30688 -40464 -31733 -44591 -41067 -21775 3299 12716 42584 61667 13958 -13232
5156 -13232 -5991 4153 6572 3842 13576 20775 13615 1222 -7556 -10681 -3866 -1966 1250 -29333
5142 -29333 -19654 -11813 -6036 -15099 -27870 -23689 -12256 -2568 -22260 -36076 -40267 -24706 -52413
5129 -52413 -70781 -66224 -38510 7353 10882 -20686 -9944 -19556 -12530 -16091 -19290 -16015 -22759
5116 -22759 -22656 -21673 -14447 -7202 6558 7128 6853 4548 -9434 -32076 -28397 -29093 -23707 -12087 5156
5101 5156 1405 -28707 -32474 -33378 -37896 -30868 -16518 3019 -20291 -36196 -31793 -36858 -25953 -16272
5087 -16272 -1843 -29260 -61865 -44406 -17062 -16102 -8684 8813 508 -8980 -22587 -60782 -65296
5074 -65296 -53237 -24518 -27964 -57601 -69585 -39111 -17115 -16627 -24507 -17548 -7043 6982 6434
5061 6434 -9783 -24006 -12431 -12486 -8177 -16365 -2351 -6198 8762 20146 30217 3458 1022
5048 1022 -23592 -23840 -16899 -21801 -1573 -5872 13052 20264 -16436 -22588 -16961 -12788 -8261 -30465
5034 -30465 -11500 21247 13910 10200 -26172 -53010 -43080 -32575 -10963 -25346 -32760 -42087 -22633
5021 -22633 107 979 1789 -8421 15074 27361 17361 31681 44705 19999 -1033 10627 14497
5008 14497 5158 34153 42467 31455 38383 46417 45328 68106 45812 37420 30737 7494 -25083
4995 -25083 -638 40021 58159 50554 31206 36869 36679 21577 10414 28332 23345 -37495 -54091
4982 -54091 -38318 -29095 -29038 11480 18367 -10816 -3999 -1471 -10732 -43099 -58967 -31534 -25835 -61765
4968 -61765 -69630 -55900 -49244 -57641 -50618 -39000 -21951 -8216 9163 25274 7615 8087 14635
4955 14635 19016 32597 22736 12555 -2799 -54511 -68156 -15074 -1380 -45397 -50997 -3158
4943 -3158 9851 -17641 -3653 22447 27765 38263 39018 15755 2647 1052 -6339 -15587 -15545 -20000
4929 -20000 -36627 -41685 -10500 2932 -10317 -12291 17688 21220 16616 12903 -239 -3676 2281
4916 2281 2951 12369 12936 626 -12409 -28599 -8756 -21782 7351 18074 -8675 -9394 11606
4903 11606 16988 18800 21294 11885 15317 6733 -25876 -30306 -29498 -2068 15094 17164 31443 14443
4889 14443 18359 9995 -2492 4935 -7578 -13045 -19296 -25168 -22026 -21994 -5526 11002 26007 25317
4875 25317 8778 4821 25472 12336 2133 11805 -5383 -23543 1966 39382 43778 22974
4863 22974 25400 23106 8843 -9468 -20448 -12994 7393 25462 15333 10783 4428 -960 -6060
4850 -6060 4967 -15699 -14134 -3057 15561 6254 2047 -12331 -25436 -4764 16828 31061 57210
4837 57210 35247 5337 -12359 6749 2047 10290 6025 9679 -2425 -8656 -22574 -17296 -49836
4824 -49836 -45106 -19573 3848 16429 29152 7947 1593 -1628 -30595 -31830 -31626 -22576 -6831
4811 -6831 23266 7859 -6545 -17124 -5176 13195 10294 20619 8902 19701 25486 -19276
4799 -19276 -24563 -12809 1677 19531 5204 -3220 -33725 -58729 -71816 -66584 -43088 -11992
4787 -11992 -8610 1100 1284 -23521 -35602 -26045 -42515 -60217 -45987 -39580 -40678 -16264 -7863
4774 -7863 -21667 -5782 -798 -12595 -17394 1628 29657 43049 53665 52863 29387 1117 -3189
4761 -3189 21433 32039 -5107 -10342 9386 2539 -20297 -25826 10032 9693 -17092 -49995 -39276
4748 -39276 -19632 -38981 -71337 -55410 -6940 20126 -8072 -49703 -63671 -35919 -24965 -44897
4736 -44897 -66481 -65783 -27827 -23046 -16623 -28542 -21894 7548 17894 777 -11650 -21090 -41798
4723 -41798 -58457 -43286 -61535 -66923 -46847 -33496 -4936 13934 1166 33065 18228 855
4711 855 -14893 -31668 -5446 1478 -13175 -50900 -60391 -49178 -54203 -39558 -11204 -12025 -32947
4698 -32947 -28977 -31905 -30231 -32015 -34432 -6872 6722 -1341 458 7032 10959 -9491 -9420 402
4684 402 5338 41454 58265 15617 13109 29062 31742 11644 -841 -38817 -30774 -18982 1318
4671 1318 412 -5165 5259 14986 21214 18729 14453 7468 7119 3904 4308 -6479 -33944 -32667 -10832
4656 -10832 -18671 -45758 -66211 -78106 -56218 -37386 -23843 -4097 -3959 -12779 -36572 5658 5927
4643 5927 -1498 -8757 -7083 22308 14822 3323 10135 -10092 -12858 -16734 -18688 2826 13493 15570
4629 15570 -6519 -20094 -973 30598 27978 -5940 -25986 -7182 30596 18960 -11473 -28361
4617 -28361 -45143 -71695 -63302 -22752 4604 -2961 9479 21182 -4694 -8315 -22886 -29357 -20647
4604 -20647 -6061 -6848 4206 14294 2210 26616 29057 21247 -6061 -21679 -21547 21608 20492
4591 20492 31109 42446 61635 84223 66016 57034 36600 8031 15118 17318 -11765 -7706 22719
4578 22719 18466 13663 -5318 -4267 -16598 -18569 -4584 -21050 -15891 3460 5848 -9423 -16795
4565 -16795 7492 13937 -20641 -19502 33359 43911 21315 -1383 2195 18833 -30531 -40757
4553 -40757 -25322 -6868 20331 28499 32530 17314 -3882 -3276 -11354 -42886 -47745 -30939 -10173
4540 -10173 11330 3670 1556 27480 20957 -4141 -19048 3627 -26597 -10978 30530 46459
4528 46459 36768 11118 7195 6551 15563 22681 16553 3564 2992 10240 10619 -11757 -32505 -24014
4514 -24014 12998 43762 37503 35223 47907 60362 45627 37096 48665 75324 58430 29191
4502 29191 11509 -9527 3019 10695 12201 3854 -5846 24954 39001 25490 3099 14111 -1997
4489 -1997 10436 17650 13275 6859 24467 55496 35084 13929 20513 26647 17806 -6971 -9831
4476 -9831 -11892 -11453 12340 31691 17051 5968 7337 12350 18599 -19008 -57746 -48656 -50901 -52609
4462 -52609 -34767 -35285 -25553 8085 7148 2514 -16576 -23228 -15124 2843 3493 -4848 -277 -11455
4448 -11455 -10689 8003 -19290 -27353 -4763 6678 21698 27847 36371 25706 -9012 1376 -1782
4435 -1782 -159 10802 10256 -26679 -32775 -27860 -23603 -22308 -18602 -5553 1382 219 -3851 11267
4421 11267 11226 18481 -14812 -39475 -27872 -21829 -23360 -23009 -36910 -11214 -14422 -34819 -47567 -45657
4407 -45657 -17840 -794 -3869 -12962 -16763 -18492 -4065 20882 45402 50562 29031 17326 -6003
4394 -6003 2672 31273 11230 -3413 -3032 2180 -6668 -7664 -31001 -21609 11556 -7717 -36445 -29481
4380 -29481 -11222 -4415 25174 12991 -5445 -5253 -8191 -4067 13335 6130 12382 -5521 -32573
4367 -32573 -49459 -20384 1713 12321 -8155 -23874 -40616 -49016 -51699 -47763 -50147 -74299 -52214
4354 -52214 -19043 7117 4605 -8941 -15493 -716 10302 289 10903 18272 10805 -3377 -10553
4341 -10553 -5566 -23549 -43717 -56941 -50231 -40559 -56901 -51418 -44813 -26721 -13682 -1264 20866
4328 20866 13679 22307 37343 -100 -4500 -25733 -34685 319 18976 393 8878 1114 2348
4315 2348 19492 30329 26849 10194 -6315 -39083 -34605 -32476 -37172 -2940 33832 9960 -10766
4302 -10766 -2608 -17910 -36161 -14158 -5288 -11538 -9461 -3514 -8563 -649 6621 -6554 11537
4289 11537 27094 24016 13359 18409 8028 13975 -3703 -28820 -30933 -17951 1325 -73 -6501
4276 -6501 -10656 10123 29784 28994 6482 9425 8785 -16653 -18106 -14686 -8484 12043 24868 6230
4262 6230 -13073 20963 -6244 -12802 6402 7980 -1318 2556 -14277 -27314 -18798 -11859 -30236
4249 -30236 -16374 -1168 -2687 15768 20723 -2377 -8115 8540 9689 16934 -5449 -22688 -31264
4236 -31264 -22814 -3696 16353 11664 12151 -13546 -26634 -17526 -25165 -14761 -19496 -19372 -29866 -43054
4222 -43054 -25924 -24527 -25461 6220 8417 -7053 6635 -5606 2010 6100 -25037 -14194 34435
4209 34435 40602 15360 1551 -15263 -28201 -17686 -16308 -40729 -25740 21602 25928 28589 4580
4196 4580 -2156 499 -12313 -9701 279 -5811 -20210 -2382 18895 3893 5915 1501 -369 -576
4182 -576 5535 17258 25399 25117 23497 23814 5079 -17574 -35248 -28865 -2370 -8637 1244 8866
4168 8866 -5896 -41561 -40381 -19903 -31163 -55318 -33330 -28221 3550 9772 15893 11787 -21151
4155 -21151 -26114 -43249 -34402 -20098 -26875 10112 6544 -9397 -22844 -1580 21539 10255 -32253
4142 -32253 -24145 -22198 -25382 -15414 -16274 11136 36334 15701 4023 20823 14122 15001 -5261 -11684
4128 -11684 -22707 -27588 -65782 -56865 -43026 -9833 -9165 -18269 5255 13131 -2028 15494 13878
4115 13878 12926 16395 21353 45001 33770 35057 25834 23134 12693 -6466 -1107 12616 3334 -16099
4101 -16099 -30709 -39056 -18526 8558 22537 -2193 -36232 -63575 -62900 -58787 -37003 -19273 -11611
4088 -11611 -7127 -9589 -30781 -26092 -2952 19891 33037 10498 -9099 -10433 -11235 -8903 -802
4075 -802 1614 -1954 -9378 -1347 -4218 -19654 -33682 -47568 -20860 -3092 -3784 10631 -14666 3093
4061 3093 29149 19336 -6172 6423 19019 30670 18838 20749 28589 47215 35095 7130 -31998
4048 -31998 -45272 -14012 15934 6197 24164 39610 34220 16165 1811 -21304 -8084 -1294
4036 -1294 -2341 12540 4804 4660 11828 361 -24135 -25980 -30645 -24137 -7037 4930 11114 -17188
4022 -17188 3528 19557 19710 29454 -12996 -31978 -2371 7060 15498 11355 -9533 -17849 -18683 -18283
4008 -18283 -17375 -5880 11315 12375 12747 -3033 -2796 -8908 -15651 -36713 -24890 -34554 -27376 -22640
3994 -22640 -6147 -13756 -9962 -10448 -39640 -43166 -37564 -32799 -10625 7224 10023 17371 -19622 -32852
3980 -32852 -35998 -28463 3525 3883 162 -34797 -36049 -23467 -30421 -7838 -3340 -16335 -21794 -19181
3966 -19181 -8695 -4116 13081 30468 7909 -28252 -16803 20841 13261 7993 -8892 -21652
3954 -21652 -19746 -10787 -13779 -11852 -30154 -42126 -26735 -2298 9230 5859 387 7483 1739
3941 1739 16472 49 -25909 -23265 -22721 22093 39716 31217 22936 6137 -10412 -23416 -21239
3928 -21239 -40431 -41880 -14133 7508 34935 34292 6839 22700 24370 26653 32626 29340 5196
3915 5196 -13009 -9515 4600 18421 6759 -14458 -26786 -47751 -62397 -18156 19592 22826
3903 22826 36888 59052 51238 19990 -15817 -23571 -36231 -12809 949 854 9309 7045 -2768
3890 -2768 -1222 2813 -15266 -5626 -23017 -49128 -17737 -7958 -13733 -1480 10475 8077 -10751
3877 -10751 8533 25174 22652 5793 -15108 -33929 -19282 -4809 1946 -40932 -35530 -21677
3865 -21677 -30518 -19430 -174 3878 12757 12144 20240 897 -1736 2689 18399 16788 -19597 -6123
3851 -6123 -6101 10154 25567 9295 -10281 2375 14295 33278 33943 20664 187 954 9467 -12448
3837 -12448 -22386 1491 12913 7061 26888 39979 11581 -37270 -24193 -22624 -40915 -14860
3825 -14860 6652 14789 35503 29663 101 -29211 -25650 7880 14898 3952 -17544 -16221 2035
3812 2035 7035 20838 2019 -2926 -20069 -14821 -6553 -4672 23173 36650 25837 2957 10724
3799 10724 -2026 -18953 -5581 -6892 -15143 -15750 9871 20079 20558 -261 2488 -11387 -40070
3786 -40070 -65867 -49083 -19569 -4344 -16235 -36801 -57071 -47063 -30035 -10770 -15603 -24649
3774 -24649 -39350 -23628 -15124 -21369 -10987 10824 11094 -40002 -87151 -88946 -44381 -14146 -14572
3761 -14572 -32272 -42192 -28914 -25802 -14681 4297 7622 -8519 -22152 -8849 -4026 1539 -21621
3748 -21621 -47165 -40815 -34365 -12981 1134 12421 10139 1986 2313 41104 22077 -15908 -20284
3735 -20284 -181 1364 -19386 -34192 -42318 -52207 -39961 -47227 -34142 -18204 -2463 3970 -2764
3722 -2764 -22927 -42028 10735 16164 9375 14377 -16918 -15274 -24946 -13713 -15135 -12808 -16119 -17535
3708 -17535 -22449 -17387 1711 9537 1312 -17976 -24815 -17679 9101 16513 -7128 -10664 -3461 -18831
3694 -18831 -22871 -11731 -12007 1036 18662 2452 -14850 -6654 -21778 -32124 -20731 -878 -16817
3681 -16817 -20265 -21898 -16568 719 -11222 -26876 -18586 -25011 -23254 -11840 -36239 -50243 -43203
3668 -43203 5928 32787 14093 19792 -4281 -47545 -47108 1179 13603 7979 -15904 -1062 -15091
3655 -15091 -28604 4354 6487 -24641 -19763 -1913 -14074 -23439 -27302 -67310 -53669 -19370 3863
3642 3863 2434 -11198 -17288 -22496 -10358 22466 22628 23771 21543 6099 -13799 1706 -3198 -20080
3628 -20080 -33197 -19556 3848 -1957 -21030 -37031 -29372 -7258 -15016 -22920 -32375 -13870 -26369
3615 -26369 -32728 1339 13177 -4822 28657 45462 30849 15174 -2879 2470 -15584 -32894
3603 -32894 -67120 -58551 -39082 -25282 -37016 -42493 -17349 -16044 -4004 -13646 -23299 -29687 -33346
3590 -33346 -23557 -36545 -42773 -18049 6204 -3358 -18296 -7723 -17079 -13696 3224 -12402 -32441
3577 -32441 -59066 -48357 -58307 -61371 -16236 4815 13141 3939 -3200 -15289 16697 9570 12864
3564 12864 18748 6552 -3129 -21573 -24533 -15347 -11296 -14324 -31893 -14843 -3823 7435 18457
3551 18457 6468 20526 26415 17256 -6043 -25913 -31015 -28264 -31074 -19802 -16906 -16747 -30298
3538 -30298 -22854 -16590 25311 29152 -1607 -6227 -5971 -24910 -18209 302 14865 50025 59892
3525 59892 40893 26547 42195 48126 36773 41933 35341 7133 23228 45837 29150 19090
3513 19090 15969 629 -5192 6160 -2594 -8738 -14837 -36100 -11389 -23197 -27427 -19925 -25269
3500 -25269 -17455 -22828 -17533 -9333 5708 9910 -13172 -25598 -29774 -33083 -63940 -68393 -46427
3487 -46427 -39622 -29957 -8295 -5607 -17105 -24134 -39831 -22150 16676 27465 29636 13275 -10872
3474 -10872 -15013 -7062 16527 14665 29850 30606 36617 46857 65734 49006 18849 -4212 -3671
3461 -3671 -3295 -4911 11848 45611 22799 -14516 3372 11340 -2814 -588 -7866 -286 2151 -6902
3447 -6902 -25424 -34186 -27564 -32644 8560 18984 41957 28786 7307 -4882 5802 38768 34500
3434 34500 2591 -16188 -12764 6038 3441 6934 17812 -1240 -30240 -37985 -45049 -48180 -41017
3421 -41017 5932 38980 19574 -8294 -9500 -12713 -11971 1716 15041 23483 51932 63899 40453
3408 40453 3878 3982 -2764 -3221 8070 17505 7572 36172 41450 21802 12365 16444 17153 38996
3394 38996 52572 19077 -12971 -16625 -18713 17915 13571 -6135 -13598 -13809 -16296 -43339 -55585
3381 -55585 -26259 -10744 -12780 -6862 12273 85 6659 -5300 17976 36183 23116 17023 -14286
3368 -14286 -37107 -21874 -8618 -10195 -37456 -47523 -36586 -21180 -9094 -2356 6822 9382 3732
3355 3732 4818 -11688 -22532 -35091 -16862 7664 10960 -4896 -9791 3045 5686 1345 19444
3342 19444 37970 15776 -6072 14306 5343 -21769 -16152 -22491 1623 -2988 -24083 -26369 -11708
3329 -11708 14203 45066 40335 19718 -7079 4370 7315 5428 -8342 -7129 24705 46835 27563
3316 27563 6422 -6700 -27752 -26001 -16126 1475 846 -21992 -16519 -17507 -10360 -11313 -12803 -23303
3302 -23303 -12951 8732 -22923 -46372 -51751 -33448 -13136 -31160 -58628 -35164 2075 -1484
3290 -1484 -14849 -20333 -13863 -13909 -7617 3291 -421 3292 4777 417 -14519 19219 19629 -2153
3276 -2153 9045 32376 30307 19801 11859 22356 24233 14861 -4189 -35081 -18101 -15027 -7035
3263 -7035 68 -7064 12877 11952 37311 16371 -29521 -26220 1108 26257 36962 4643 -31183
3250 -31183 -31748 -13894 -22968 -18762 -16074 9344 26486 12281 4364 4901 8677 -11925 -20864 -469
3236 -469 24426 25499 26923 16167 -13766 -19823 5409 8942 -19028 -19192 -15345 -3800 1444 5936
3222 5936 -6751 23817 30297 53586 48150 36055 -5934 -14604 4397 14130 -24795 -35055 -19218
3209 -19218 337 21992 38928 35133 34682 37141 49640 18941 -35017 -69094 -41763 875 27223
3196 27223 29931 46176 59334 26703 -5858 12508 3382 -16014 -5174 13920 13661 15377 4068
3183 4068 -6228 7377 16114 24148 58917 45218 39252 15649 -9488 -34953 -33791 -17885 -21619
3170 -21619 -33520 -32427 -32346 -9618 24970 26323 18364 23970 36769 39420 21234 8067 5142 -11193
3156 -11193 3961 -7432 1370 -20431 -41458 -50061 -73555 -81871 -97774 -83721 -90530 -64075 -20555
3143 -20555 -15471 -10303 -36336 -8827 23705 27170 32583 22870 10004 14273 23398 41889 11657
3130 11657 -9724 -30110 -37456 -14711 -20033 -32718 -19932 21109 28750 18010 12092 12579 19876
3117 19876 29553 19172 -2360 3304 -12742 -22907 -15892 -7148 -19673 -15376 -32741 -2299 14068
3104 14068 -10015 -40301 -40876 -30309 -33898 -47387 -34178 -8045 -5698 -6564 -7533 1512 25920 5052
3090 5052 18668 13069 -29220 -36904 -33852 -28859 -28201 -24648 -4598 18335 13001 11273 18172 12061
3076 12061 2176 3085 1608 -10332 -11036 -9408 6110 6517 1778 9045 19302 42809 59560 46794
3062 46794 28711 12981 22567 25887 32725 37016 17338 4952 3307 3569 16877 31172 17307
3049 17307 7013 13984 14651 43014 28123 -6539 7341 25669 34821 31305 23092 9790 9231
3036 9231 -6373 -24578 -6019 9514 -5330 -10831 9347 20554 48712 76364 79148 72188 58943
3023 58943 12743 -10717 -26073 -38588 -27406 -14322 -36396 -31199 -20439 -23354 -17497 -10209 -4962
3010 -4962 -29289 -29197 -38052 -51097 -42648 -18741 -11474 -32359 -56242 -51586 -30031 -16820 -16701 -10362
2996 -10362 -6418 1859 -4552 -45274 -43379 -24894 -27798 -20397 -8906 4421 -2116 -12420 -30865
2983 -30865 -31078 -34654 -45983 -41864 -31439 3844 805 1437 -10104 24948 13316 -9432 8069
2970 8069 30999 44813 29498 -7052 -22337 -21508 -28350 -10047 15336 20836 17613 5489 2245
2957 2245 13531 8559 -5023 -21970 -22328 -13852 -961 1390 16351 14268 27117 33093 15574
2944 15574 30427 57998 41378 25964 34234 19216 34542 33779 15906 6938 5654 -28350 -23782
2931 -23782 10289 14358 -3854 -19396 -14894 -7451 -19846 -39641 -41317 -36903 -38418 -24117 -12797
2918 -12797 -9233 -15416 -31416 -38777 -53006 -38421 -31890 -50971 -50557 -32971 -10426 -7362 3994
2905 3994 3261 -5955 -29911 -39846 -24553 2039 10142 -1998 10927 2984 -5608 -11890 17650 35660
2891 35660 2332 -16678 -42359 -60397 -46107 -30145 -30858 -9073 -4311 -7027 -5367 -10234 -28650
2878 -28650 -48101 -41667 -22725 -10530 -486 24008 18221 18672 -2702 -12929 -15273 -1924 -7674
2865 -7674 -9767 16618 32688 25195 29473 53423 67716 70879 41792 13059 12437 12412 36377 48766
2851 48766 29985 28513 19059 8757 29898 40495 41924 37677 43482 59865 46185 32411 27574
2838 27574 25196 9091 34455 46379 32192 21248 17505 25959 14476 -1809 3035 2501 -34033
2825 -34033 -26375 -4180 20986 25341 44075 35628 19526 -4528 545 4907 10949 5681 1512
2812 1512 4658 8541 5294 15789 20159 10714 18510 33471 77056 95491 70742 42921 39165
2799 39165 34033 9874 -21396 -54789 -73792 -47649 -23582 -36394 -52252 -33904 -6482 8770
2787 8770 10858 14548 4900 17316 23173 2324 -3448 -3763 -25942 -36571 -48122 -46902 -15934 -12253
2773 -12253 -23496 -12236 6386 9562 19231 48523 24341 1297 5258 2793 -13504 -19683 -27304
2760 -27304 -3924 28387 33869 27992 33455 52057 38707 14807 5802 12025 4576 5201 3726 -7876
2746 -7876 -7362 3154 13418 1720 -23112 -24931 -30036 -12406 12400 30014 2967 -8735 -17985
2733 -17985 -8728 5304 -4562 -16083 -23978 -40264 -28908 2318 -570 -8435 -4516 -4643 -5373 32575
2719 32575 49255 25013 19022 41453 29479 -5508 -21073 -8281 -22083 -23630 -31441 -22282 -3895
2706 -3895 -6747 6934 17743 19446 41653 26977 2863 -847 24033 28658 13499 -5776 -24348
2693 -24348 -11583 998 -23355 -14687 -13411 -4306 6894 1419 -492 5265 -9282 -7082 -7862 -10382
2679 -10382 -19541 -16293 -25041 1904 16332 21213 11311 -6066 -22283 -10665 -17682 -10674 -798
2666 -798 532 14224 -2461 2362 3521 8109 7651 13632 21275 46686 22486 11151 20565 32226
2652 32226 15845 4737 18847 23450 11567 3267 -7632 6721 6321 3131 10938 -4199 -19355
2639 -19355 -29397 -26834 -17768 -25456 -22568 -28026 -32694 -36561 -16797 2278 21307 44977 39594
2626 39594 40207 7373 -9164 2288 14736 15823 14667 21050 25651 45765 39695 23396 11419
2613 11419 9607 28961 42823 32505 61301 64523 36795 30034 17123 10726 16944 23455 23299
2600 23299 26509 4384 -20857 -20418 -6988 6297 19595 28916 13668 29034 35846 -15910 -15695
2587 -15695 23290 54376 62081 31199 11030 18436 12762 -11202 -19798 -2765 -18799 -43518 -29755
2574 -29755 -3165 39282 36872 2142 2419 19944 26002 31226 16033 -20748 -28657 -35980 -35699 6003
2560 6003 35657 2570 -8961 11549 11702 -12124 -27461 -38218 -18797 5585 7288 -5254 -3787
2547 -3787 12349 -8613 -2494 -597 -1380 -27809 -49192 -21822 -10097 -10863 12420 -10962 -7057
2534 -7057 -25080 -45994 -21833 -4961 -18314 -14044 19288 29263 16266 2069 -17836 -33157
2522 -33157 -37795 -13407 -4241 352 -21783 -24388 -600 30318 38202 22896 -9224 -19955 -21436
2509 -21436 -28057 -25271 -2355 13731 9340 7410 -5858 6033 14379 -2374 -27773 -22689 -18064
2496 -18064 -16027 5045 5984 -4893 1102 -487 -6615 5373 25881 11719 -587 -13289 -3819
2483 -3819 -3117 -3310 -16319 -9823 10703 43727 34404 34203 7678 -3244 -14337 -19274 -18627 6743
2469 6743 20109 4551 3221 7480 -2701 -15780 -25793 -22803 -18693 -9261 -21343 -31508 -20075
2456 -20075 38030 70650 57291 39925 21911 34543 43746 30817 34526 44362 39679 19165 8211
2443 8211 5355 16971 10659 15090 12475 26863 46957 60011 34941 18225 -16431 -15217 10183
2430 10183 9368 194 -4188 -3868 16830 11057 -2621 2347 15278 22604 9252 14701 -7191 19891
2416 19891 28042 -8666 -27331 -36441 -41854 -26563 -37733 -45445 -35850 -35609 -30600 -30317 -12936 34893
2402 34893 42744 44722 44727 36547 35579 56029 49302 28503 19694 28254 16807 30496 52070 26363
2388 26363 12024 128 11210 6782 10367 -16080 -21364 -2392 13256 32720 6897 -16028
2376 -16028 -7040 -15063 -14324 -3389 27306 29700 35553 -2002 5217 1043 37 8812 34478 57281
2362 57281 51634 46088 31980 -4037 -4362 14249 10527 16626 15705 12170 -1379 495 12955 32131
2348 32131 36647 13140 22134 51456 53693 20983 -10238 -11279 13316 37508 10359 -2396 9463
2335 9463 17344 -14393 -31533 -36924 -27711 -38933 -39834 -17658 -21046 -4787 29305 28632 26394 15383
2321 15383 11515 12292 8636 18854 14426 5909 -1264 2576 3802 -28149 -34814 -32743 8330 55386
2307 55386 49437 20286 -5799 -18607 -6952 23312 33468 44992 52814 30275 6097 8589
2295 8589 24734 17161 25731 34217 5359 8975 34497 35667 37929 33543 26404 27708 20057 33840
2281 33840 54321 42922 28615 29394 11066 7771 -13079 -31899 -22063 -1351 2106 -6525 223
2268 223 14359 26255 15691 19847 21495 17801 27746 27357 -3174 -21449 -11245 -17444 -7714 27037
2254 27037 20314 31152 38206 15785 3262 -9323 -11061 1692 9492 4121 16908 -9802 -13872
2241 -13872 -15676 -500 578 4833 3782 4491 10361 23096 22868 26965 51325 43103 27966 22780
2227 22780 36228 33009 50249 47328 33913 7916 8258 138 -8566 -22644 -37263 -15697 8695
2214 8695 22630 -5689 -23334 -20641 -37004 -35927 -17651 -3424 -10874 -30297 -37978 -44058 -39086
2201 -39086 -24889 -23331 -321 712 17172 39605 33493 35519 25478 9822 16901 21936 7217
2188 7217 -16639 -8209 9826 35744 43856 40735 16143 14414 17760 -8699 -20505 -13275 -30242
2175 -30242 -21967 -34455 -32319 -16511 -26206 -18391 8248 17028 -8901 1328 -4334 -25297 -15760
2162 -15760 5568 17378 17320 35014 36787 6172 -5901 10535 5915 18368 50915 41909 18463
2149 18463 7943 2280 -16163 -5400 -4605 -7261 -6406 14608 11241 14505 32005 29334 23712 -2910
2135 -2910 -30462 -24176 -5911 34684 31633 3168 5062 30516 34508 14268 -8335 -31770 -37825
2122 -37825 -20452 1687 -5391 -12400 -15673 -13941 -24133 -11257 19933 37014 22413 10811 -2199
2109 -2199 -5967 -30210 -29910 -1102 21819 -13822 -28119 -15033 22016 32821 -2450 -22355 -13648
2096 -13648 3874 -35497 -42835 -17356 -865 6421 5138 -16735 -16221 -24400 -6582 -10943 -6644
2083 -6644 -10889 -41 15484 33083 31416 24045 -5947 -34375 -31891 -24657 -21470 -18858 -39673
2070 -39673 -16206 13604 21386 9270 15661 34833 30773 17813 33989 44815 32986 33366 52832
2057 52832 55844 10704 -13780 -18774 -7992 -7699 -12396 -34602 -40265 -26186 -4290 18874 9168
2044 9168 -22608 -11611 -27723 -25642 -22395 -35458 -33999 -20050 -15877 -30618 -29890 -14726 -5068
2031 -5068 -19245 -32558 -12207 -4871 749 11005 -9980 -18761 11244 -18547 -31302 -29655 -21314
2018 -21314 -5465 2820 -15101 -7134 7964 11490 24978 27121 24700 17761 11166 14101 42
2005 42 16618 12602 9845 4739 -12214 -11842 -38883 -29390 13612 39395 54485 52701 17056 1262
1991 1262 18374 40889 73811 54133 42513 43841 62835 75051 52765 35535 36073 13974 19799
1978 19799 14076 18952 -1075 -6781 -1047 -10098 11253 34032 7526 -7460 -3724 20966 3889
1965 3889 -21913 791 -13526 -37773 -48898 -47831 -22085 -11386 -24497 -19393 -16239 -15414 -16715
1952 -16715 -39620 -41724 -18047 -1973 -4958 -21420 -30604 -11602 -5032 -31498 -36111 -29422 -21197
1939 -21197 -17119 -32796 -16957 -16572 -37548 -52187 -53136 -75176 -70604 -36747 -3444 4729 -11489
1926 -11489 -35355 -42272 -28274 -1781 17318 25564 22664 25004 11408 2115 32993 30183 15124
1913 15124 18203 21249 50306 49085 48371 47566 33057 31709 40511 34312 32039 28975 40645 18770
1899 18770 4193 3706 85 -1981 1383 -28414 -15794 -6593 17079 15357 3921 24616 19565
1886 19565 1385 -38410 -53327 -28393 -19319 -7025 -6604 13064 -15237 -25188 -33274 -47236 -33312
1873 -33312 -31561 -14105 -7048 -13902 -8843 -5251 1068 5127 14769 33102 20387 5524 4893 40153
1859 40153 38679 858 9425 9440 2605 -3354 -22156 -25464 -16964 -17385 -26296 -40189 -6174 18033
1845 18033 -5439 -13526 6028 20580 25162 21757 18604 17336 25729 48968 55932 24029 24383 34915
1831 34915 44323 24684 12566 28591 17708 9304 -6999 -11872 -18872 -10587 -14399 -17927 -1968
1818 -1968 8919 20038 25640 16767 38678 46589 24220 25104 47624 17828 -20367 17184 52646
1805 52646 53769 26293 10028 8141 12544 21514 -53 -6314 26303 31741 32358 10724 12444 31692
1791 31692 36228 28817 9492 6959 14828 13958 19988 45937 31334 32035 41203 54949 43618 32835
1777 32835 17322 6709 175 -6960 3623 -3224 -32034 -34480 -9835 -9109 -22010 -43248 -60189
1764 -60189 -36074 -19236 772 -226 5727 5928 15302 39039 47946 46804 33430 33391 35232 30567
1750 30567 56159 55457 32403 15559 2632 -8486 -27129 -7458 11188 26825 14208 -6348
1738 -6348 3086 -3426 -13342 -3245 -8467 -5207 -11236 -9508 -12710 762 4733 3799 17726 25125
1724 25125 32628 143 -31300 -22341 -26172 11112 19563 38727 48461 32475 29984 47028 36336
1711 36336 24194 38971 30512 27772 9975 13879 35188 62670 38422 -10017 1131 25833
1699 25833 26134 -4296 -3392 -9375 -21510 -32015 -28642 -10174 -11963 -14271 -9076 -11093 18550 29460
1685 29460 7325 -29275 -17615 -11930 -8418 -6045 51 -10945 13800 37025 12075 2946 -5852
1672 -5852 -27459 -20121 -8780 -5125 -13793 8859 5455 5894 -5923 -5632 -2494 -16290 -28844 -36629
1658 -36629 -10937 12529 16197 27885 33387 28478 9253 -10867 -29832 -22720 -21694 -6502 -12730
1645 -12730 -7467 -5952 -29077 -38891 -36210 -26382 -36338 -51120 -47158 -22043 -7603 -6959 714 -9506
1631 -9506 2842 23219 20561 -12586 -4652 18545 16932 8552 -24126 -52543 -46510 -22305 -25479
1618 -25479 -24052 1685 5238 54 8296 -9285 -9502 11823 11574 17379 25605 30618 9126 -35748
1604 -35748 -39915 -40061 -53899 -79199 -71319 -31266 -579 23201 27493 18625 35008 49599 45371
1591 45371 24800 10667 13292 15941 9602 11673 23378 20406 -27456 -36138 2556 11304 26944
1578 26944 26218 2474 -19199 -13174 38724 44909 21963 16723 34115 17824 -4107 -705 16743
1565 16743 11370 -4841 30636 39247 34233 9721 -25258 -11719 -7699 -17556 -14846 -23121 -21413
1552 -21413 -27551 -23679 -4930 29095 37619 26066 19482 27568 13972 28362 57754 63557 54530
1539 54530 62359 59717 45919 18698 2365 1340 2442 31536 34923 3672 19775 11559 15527
1526 15527 40342 25297 33926 25869 13927 15915 11578 -6584 -21882 -27221 -8347 17230 2329
1513 2329 -602 8323 -11893 -3119 -13721 -25184 -2949 6545 -12838 -8340 18924 30431 26628
1500 26628 29562 44463 49802 36719 24287 44686 85630 64606 34904 12407 -6426 3156
1488 3156 19736 3119 2219 7845 32691 -10862 -9781 -4753 -15976 -23331 7152 26677 23163
1475 23163 17528 15371 28481 37454 24488 19133 59612 65424 61867 52859 18367 -6387 -5916 4429
1461 4429 18207 16437 5028 5998 11501 12454 -78 -1109 5513 -17914 -23751 -7047 626 -29529
1447 -29529 -25472 -20886 -9823 11362 -1046 -29224 -26085 -6136 -29644 -707 21423 24034 11377
1434 11377 -3466 -6647 -4482 4047 -2266 11024 24036 36738 21035 9023 6170 19594 23982
1421 23982 29253 21870 14705 11568 -19257 8255 -1 -5597 -19427 -12578 -2890 -16115 -16446 -20894
1407 -20894 -17157 15630 24010 11321 9546 3623 5761 5356 -2906 1697 14017 24121 15376 -14933
1393 -14933 -31246 -49756 -49702 -28718 -59247 -46349 -5769 12539 -6229 -25811 -25157 -13635 -18616
1380 -18616 -21195 -16470 -28887 -28268 -35895 -43775 -33170 -23837 9914 31040 12660 -19952 -42360
1367 -42360 -49858 -53745 -47480 -40959 -24230 -24938 -18587 17125 18247 30106 38441 15964 -1302 716
1353 716 2607 23817 37387 50652 87239 60681 14863 -15520 -18942 -22933 -22226 -16755 5577
1340 5577 19554 12659 17360 25940 6556 -4718 11962 44333 26457 41166 49717 34455 17899
1327 17899 26817 13958 13029 11096 -3296 16902 37128 30757 -24279 -32346 -15816 -8290 -12607
1314 -12607 -32281 -50854 -50260 -35705 -35713 -30299 -18085 3195 13981 2937 -13268 -15484 3880
1301 3880 2414 11449 33320 31835 14787 -16177 -4893 2286 23019 58258 57902 56987 27066 7174
1287 7174 9146 12690 22904 1807 -24975 -19147 1694 17498 -3483 -15330 -25920 -16228 -14034
1274 -14034 5680 29498 -2115 9103 2338 -7887 -43235 -29107 -16592 7105 -6631 11674
1262 11674 21481 16052 7273 31370 61459 46603 37061 26844 47072 89999 76895 34737 16861
1249 16861 19801 21388 7036 3799 23345 11542 -2956 6747 -12729 -13325 -33737 -12528 12651
1236 12651 26997 29714 14877 28240 52833 21064 6091 24770 36024 25217 28427 27017
1224 27017 32434 19326 18430 17038 37280 37240 34390 31190 10932 -35052 -27194 -13937 -2016 6649
1210 6649 34609 43732 53338 48945 49355 30544 2934 -18096 -7953 5338 3821 -6643 20857
1197 20857 25969 41811 64853 43599 22770 10078 1473 -15831 -47562 -31492 8472 11990
1185 11990 27408 25680 8511 -10018 5622 24895 4802 9438 18616 11371 -15613 6626 21280
1172 21280 23054 12280 -1281 -4021 -5668 3336 -196 -17466 -33440 -13563 -4328 -10338 -18572
1159 -18572 -14248 -2238 11153 -832 700 6450 9635 2862 -8258 -25916 -14219 13389 8224
1146 8224 -20486 -44574 -36880 -13199 -28076 -27798 -13420 8904 20325 -6520 1524 14755 -21287
1133 -21287 -41195 -30675 -1436 11500 1109 -18617 -28433 -10330 -16534 5847 18818 17560
1121 17560 34176 15161 4874 448 15226 37483 27238 3094 -4971 -893 -59613 -82899
1109 -82899 -48371 -43083 -7425 -13854 -34907 4958 12262 26551 24295 10328 2323 17939 41502
1096 41502 34948 40632 44686 47921 26540 23317 23788 10737 -1088 -33258 -66888 -54155 -50951
1083 -50951 -61682 -63620 -25340 -18977 -56648 -59600 -36953 -23181 -10776 3755 -1410 -10972 2488
1070 2488 -378 -8617 -16071 -20761 -20562 -22537 -27989 -27903 -1882 10168 9914 -7170 8882 54840 52477
1055 52477 23034 -1009 -11575 -3853 -15795 -36662 -16215 6648 5915 9075 22192 12304 21467
1042 21467 23185 42621 51906 37264 27986 663 848 -13412 -17712 -10371 -13057 -23358 -20208 -8510
1028 -8510 28965 40224 17030 9737 -12507 -48267 -44247 -10017 -13796 -11217 -18007 2477 -5361
1015 -5361 -1829 24127 2120 -26944 -32999 -20634 -20078 4239 -14964 -27216 -31425 -34837 -18699
1002 -18699 -7034 669 -3868 -35631 -41966 -27657 3033 50635 57404 14549 15001 -4629 -14073
989 -14073 -29536 -34850 -5868 7457 35833 33015 274 769 6258 -6252 -4434 -13109 -7802 -7666
975 -7666 -16206 -11766 -1094 -4396 1264 26129 28975 12664 -2157 17680 31327 28347 13663
962 13663 9333 24670 34400 23710 -6134 -8061 1838 8332 13385 8488 10328 27988 31478 23332
948 23332 -8377 -38438 -27851 -13854 -30748 -9679 20197 9670 -6090 3799 -553 -18987
936 -18987 -24406 -21426 -15000 14231 14974 30142 6428 4753 -1350 -21514 -58483 -74415 -40508
923 -40508 -18455 -16614 -36547 -14738 -3974 -8408 18732 37684 10600 23304 32527 31257 8964
910 8964 -2621 7878 28412 6525 9999 8729 8269 30491 32001 29871 40109 33603 18346 -4168
896 -4168 -16043 -4460 6390 12614 13271 -8033 -1406 13123 31545 31965 16237 20966 13112 -16027
882 -16027 -14843 45264 29397 3644 -987 -4313 1903 -22938 -21297 -27833 -29869 -17041 8209
869 8209 10729 19239 17447 32736 36092 30918 13890 13108 -2852 -55987 -45737 -17992 -11253 9221
855 9221 -10293 -17167 -16301 -3542 9557 32419 28494 25260 10983 28333 9736 -2249 2951
842 2951 19061 14079 11126 -21671 -10727 -10438 -10954 -14287 -22698 -14048 -32446 6564 15522 1789
828 1789 1417 8777 -2944 -9994 -9629 -7222 18048 969 6224 -5776 -2682 -12909 -14909 -9718
814 -9718 6876 16550 30724 19180 9657 8691 4791 -28360 -29803 -11096 1828 -1229 13445 64387
800 64387 46393 23983 24625 41099 49075 45882 60570 43003 25855 30771 46746 32239 25432
787 25432 22811 10144 41957 40466 49424 63388 47616 14860 10395 13451 -9980 -5368 10312
774 10312 8039 5143 44908 29792 -14987 12605 37496 -3148 -23220 -21591 18628 26847 25764
761 25764 7164 12214 18087 30378 45475 36573 17463 -11727 -33159 -28898 -8402 5541 8679
748 8679 648 -6316 -35060 -18129 15049 44290 44553 53340 63980 70979 42943 30970 18217
735 18217 23822 35101 28534 31269 14453 2064 -3646 10876 14838 -3382 -15399 -12947 -12424 -21471
721 -21471 -28801 -23160 7456 19059 -4161 6850 -9098 -16628 654 28247 10538 15380 23789
708 23789 16566 43014 53586 23937 -458 -14751 -10164 -2732 -20663 -38944 -9911 19187 40133
695 40133 47685 52235 28068 14133 37710 13477 16132 27039 19529 26008 31196 33433 24398 53213
681 53213 57556 47029 45216 45494 38884 12660 -1743 19077 32764 8714 29461 57095 36830
668 36830 29796 36173 30231 42840 70615 59519 24972 17896 37668 32978 43999 52152 19946
655 19946 49423 74453 45518 -2942 -19379 -28131 -47389 -34614 -20534 7219 21376 12050
643 12050 9979 -518 -18433 -7436 -12745 -11031 8718 10517 7924 11517 38830 62237 60820
630 60820 26562 13562 28583 38715 15802 12093 -12863 -18178 -4004 6910 -3527 6857
618 6857 16223 28867 16783 -6178 -15746 -8160 18755 45818 27305 22986 28314 15243 383
605 383 -7293 5308 -4107 -10184 10473 3190 -3624 -3143 -20297 10783 52015 44709 42665 43021 49293
590 49293 48373 19635 18579 22911 10433 7672 22808 21725 12296 -3838 -16351 -18488 -14404 -4493
576 -4493 30561 50922 26696 36946 53241 44109 27275 31449 17130 14316 -1021 7376 23917
563 23917 19517 8361 9292 30443 21187 -5902 3274 26518 59848 43681 27476 21634 21956 5934
549 5934 -15071 -19635 -20054 -19428 11749 13400 -6419 -26816 -16152 -9569 28431 21745 -15921 -16947
535 -16947 -32037 -29906 -20003 -26873 2966 5048 -13622 -14228 -16196 13955 36309 14527 -313
522 -313 11608 49554 59663 35947 27156 32676 -4660 -36106 -10098 13527 24650 34954 37497
509 37497 35914 21222 -6110 5954 15067 24766 22235 21546 13165 3803 -3086 -16632 -10264 28983
495 28983 33272 19040 18047 5212 7941 40975 39265 50929 57844 43214 16606 33154 44217
482 44217 19924 9575 4528 -19516 -2294 33119 48568 42636 28002 7376 -5785 -11189 -11933
469 -11933 -12421 9379 8160 -18410 -13507 -4327 26942 58705 62909 43763 39878 43236 39290 11336
455 11336 814 -386 18296 19156 35197 18310 -19132 -34264 -29936 -14078 7043 14440 20044
442 20044 23643 24864 11054 1496 -2958 5301 6795 -1053 -17123 5778 9314 10558 19304 27676
428 27676 15996 2745 4147 3178 22062 29733 27250 46354 38062 34833 40177 25439 4113 32190
414 32190 26853 3757 -277 -4143 22883 46013 43374 29927 5420 14190 34745 36755 36833 48516
400 48516 41204 41376 36845 48279 38820 15571 28945 34264 22385 23403 9260 7167 8620 24447
386 24447 52435 36754 30139 29847 33035 31813 27208 24528 25064 8925 -18311 -28494 -28608 -20689
372 -20689 -13705 -7677 -19788 -15783 -10953 24633 37621 43426 9824 -3987 5518 9066 -856 -4643
358 -4643 8043 29005 6433 1537 1758 -17707 -8939 8669 33874 39367 18090 926 9050
345 9050 32594 45932 40736 45758 54085 56916 54255 50599 36443 1929 16727 27516 45739
332 45739 42090 10668 -3671 15229 17179 8971 7619 -438 -17331 -5547 19064 29841 8703
319 8703 -4365 -2978 1588 2681 -1661 21397 37932 51001 57181 39943 27033 8350 11419
306 11419 27559 5125 -21761 -30430 -54680 -59889 -21996 -502 20887 27683 25686 42973 30968
293 30968 5058 3812 -5224 -14523 3562 3960 4033 12962 533 9850 14669 25360 42872 45148
279 45148 43676 42545 52938 25387 -12232 -16789 3096 -2722 -1732 -9913 -6758 -12702 -19253 9292
265 9292 30077 37036 38982 30500 24343 22035 19252 13744 -812 -20910 -22190 7494 19127 13987
251 13987 20637 30637 20116 20675 13115 28025 5135 10695 2906 -9228 690 27309 61132
238 61132 64495 47074 42624 48236 26189 4400 8231 -8363 -4011 6042 29262 39763 26068
225 26068 20734 5849 14841 -7681 -9404 -9083 -15686 -15247 -8657 597 7731 34366 45825 56096
211 56096 34766 40472 24361 -886 -7544 14735 20000 8159 -420 6141 5845 7700 -316 6010
197 6010 -5315 -3023 -7279 12769 16411 10933 25449 39723 36306 41319 44648 35617 54392 88148
183 88148 66868 31356 35591 30384 30177 27319 18671 8224 -18376 -7251 19646 32271 29517
170 29517 20284 12953 7998 9748 12187 39404 27828 21213 32021 27528 23858 24832 19233 -107
156 -107 14188 19698 22088 23015 31535 53868 27095 8749 10849 13364 -24091 -34883 -26135 -21273
142 -21273 -19282 -402 11271 15144 30463 21936 -23726 -38612 -23145 -23408 -29067 -26164 -29771 -23839
128 -23839 -3857 24316 27824 -7344 -15689 -17034 -11951 26690 29240 3731 -3257 11656 10403
115 10403 17326 34900 21417 1027 -10726 -8122 4277 17759 24767 19685 8541 4767 9678
102 9678 9599 21992 9949 6268 12398 19696 28240 26994 23985 13379 10363 32088 45978 48721
88 48721 40443 34420 8249 -12949 4821 -3674 -6648 -10390 -12105 -957 18136 19370 30998 42446
74 42446 41469 28769 24071 3819 17965 24286 14064 14570 20908 24373 17661 15653 26718 37043
60 37043 44403 42510 42876 43981 19072 4244 35019 52986 28857 17125 19669 26116 16027 6977
46 6977 12462 16377 -4243 -1225 8465 -3950 9119 6612 15803 35431 33379 35140 30864 7733
32 7733 7891 -2523 -4291 6331 23222 24650 21996 27289 21638 20678 22037 6398 7807 6976 -7724
17 -7724 5539 11018 9872 6937 -3559 -12175 -14030 -9454 -13302 -21000 -10206 15290 41007 36873
3 36873 20571 34850 47553
0 47553
$$ Imaginary data points
##PAGE= N=2
##DATA TABLE= (X++(I..I)), XYDATA
32767 111773 136395 168500 184876 172474 172211 166424 151466 154137 140490 133534 146301 153936 163199
32754 163199 161810 170085 184392 203554 190717 172212 168507 168720 165319 165706 153640 166112 181412
32741 181412 175154 174927 170147 166544 163954 156820 176280 178975 187833 187642 183460 191841 192986 187932
32727 187932 199769 181861 172747 178715 193948 200676 195253 169049 164283 186421 184843 192329 214691
32714 214691 216563 226965 229340 235878 227131 223673 221007 209948 203047 202877 203364 190929 190918 199065
32700 199065 206390 213972 222699 231250 221890 218765 219764 211459 207664 203722 209430 206639 184214 201796
32686 201796 209503 211262 239220 279302 272744 260240 260474 258461 248530 264023 269324 279424 254724
32673 254724 259582 260650 272867 267693 270941 277961 293228 313429 302559 304055 301541 296010 306492
32660 306492 302492 315819 305651 268122 272166 288689 298682 314790 320857 307052 298916 295346 296913
32647 296913 286585 291581 312955 316308 309375 309323 318265 321580 335169 358817 360778 365333 345008
32634 345008 340997 335495 331889 326014 320806 324831 331259 311268 305067 319252 332589 325238 334082
32621 334082 353405 346321 340719 337782 332127 314741 309117 303830 285926 299679 316824 343522 355206
32608 355206 341252 335740 353663 355758 350954 351313 336668 320234 328031 339062 343559 340618 334164
32595 334164 331556 371310 386295 377633 358383 345519 357659 370279 372199 372056 380109 366428 360488
32582 360488 376217 385442 384222 371034 362937 371335 389394 401714 411497 409087 408207 388478 374787
32569 374787 394898 417269 414324 416482 407789 404701 404264 396421 375213 379741 382191 391884 392778 379231
$$ [...]
##END NTUPLES=NMR SPECTRUM
##END=
