##TITLE=Analysis number 325687
Compound Code cc 60510
Book Reference 486/90
Project Code adrs
Chemist Name simons
##JCAMPDX= 6.0         $$ Bruker NMR JCAMP-DX V2.0
##DATA TYPE= NMR SPECTRUM
##DATA CLASS= NTUPLES
##ORIGIN= Bruker BioSpin GmbH
##OWNER= nmr
$$ XWIN-NMR		Version 3.5
$$ Tue Jan  9 13:15:56 2007 GMT Standard Time (UT+0h)  MAYBRIDGE\nmr@NMR_250MHZ
##.OBSERVE FREQUENCY= 250.131544655141
##.OBSERVE NUCLEUS= ^1H
##.ACQUISITION MODE= SIMULTANEOUS (DQD)
##.ACQUISITION SCHEME= undefined
##.AVERAGES= 16
##.DIGITISER RES= 18
##SPECTROMETER/DATA SYSTEM= dpx250
##.PULSE SEQUENCE= zg30
##.SOLVENT NAME= CDCl3
##.SHIFT REFERENCE= (INTERNAL, CDCl3, 0, 16.4476)
##AUDIT TRAIL= $$ (NUMBER, WHEN, WHO, WHERE, WHAT)
$$ ##TITLE= Audit trail, XWIN-NMR		Version 3.5
$$ ##JCAMPDX= 5.01
$$ ##ORIGIN= Bruker BioSpin GmbH
$$ ##OWNER= nmr
$$ C:\u/data/dgb/nmr/ADRS/780/pdata/1/auditp.txt
$$ ##AUDIT TRAIL=  $$ (NUMBER, WHEN, WHO, WHERE, WHAT)
(   1,<2007-01-09 13:15:28.77 +000>,<MAYBRIDGE\nmr>,<NMR_250MHZ>,
      <created by zg, POWCHK disabled, PULCHK disabled
       configuration hash MD5:
       49 4B E0 1D 92 C2 6B 37 9F E6 65 BC 52 41 86 1D
       data hash MD5: 64K
       1E 8D CF 2D AA 18 FA 22 07 AE BB 11 F7 87 E2 D8>)
(   2,<2007-01-09 13:15:43.56 +000>,<MAYBRIDGE\nmr>,<NMR_250MHZ>,
      <Start of raw data processing
       ef LB = 0.3 FT_mod = 6 PKNL = 1 SI = 32K 
       data hash MD5: 32K
       1F C2 00 F1 A3 72 74 77 8A FF A0 C7 97 F4 61 8C>)
(   3,<2007-01-09 13:15:45.56 +000>,<MAYBRIDGE\nmr>,<NMR_250MHZ>,
      <apk 
       data hash MD5: 32K
       28 B3 C6 7D 59 E2 A3 76 98 5C 37 36 F7 C7 C5 CC>)
(   4,<2007-01-09 13:15:46.43 +000>,<MAYBRIDGE\nmr>,<NMR_250MHZ>,
      <abs ABSG = 5 
       data hash MD5: 32K
       36 62 3C 2F 9A A6 86 7E CF 2B D0 E6 01 B3 8B F2>)
$$ ##END=
$$ 
$$ hash MD5
$$ 8C 5A 39 28 60 DC 59 11 9E 02 AD A0 54 26 85 4D
##$RELAX= 
##$RELAX= 
##$RELAX= 
##$RELAX= 
##$RELAX= 
##$RELAX= 
##$RELAX= 
$$ Bruker specific parameters
$$ --------------------------
##$DU= <C:\u>
##$EXPNO= 780
##$NAME= <ADRS>
##$PROCNO= 1
##$TYPE= <nmr>
##$USER= <dgb>
##$AMP= (0..31)
100 100 100 100 100 100 100 100 100 100 100 100 100 100 100 100 100 100 
100 100 100 100 100 100 100 100 100 100 100 100 100 100 
##$AQSEQ= 0
##$AQ_mod= 3
##$AUNM= <au_zg>
##$AUTOPOS= <45 >
##$BF1= 250.13
##$BF2= 250.13
##$BF3= 250.13
##$BF4= 250.13
##$BF5= 500.13
##$BF6= 500.13
##$BF7= 500.13
##$BF8= 500.13
##$BYTORDA= 1
##$CFDGTYP= 0
##$CFRGTYP= 5
##$CHEMSTR= <none>
##$CNST= (0..31)
1 1 145 1 1 1 1 1 1 1 1 1 1 1 1 1 1 1 1 1 1 1 1 1 1 1 1 1 1 1 1 1 
##$CPDPRG= <>
##$CPDPRG1= <>
##$CPDPRG2= <>
##$CPDPRG3= <>
##$CPDPRG4= <mlev>
##$CPDPRG5= <mlev>
##$CPDPRG6= <mlev>
##$CPDPRG7= <mlev>
##$CPDPRG8= <mlev>
##$CPDPRGB= <>
##$CPDPRGT= <>
##$D= (0..31)
0 1 0 0 0 0 0 0 0 0.06 0 0 0 0 0 0 0.0002 0 0 0 0 0 0 0 0 0 0 0 0 0 0 
0 
##$DATE= 1168348527
##$DBL= (0..7)
120 120 120 120 120 120 120 120 
##$DBP= (0..7)
150 150 150 150 150 150 150 150 
##$DBP07= 0
##$DBPNAM0= <>
##$DBPNAM1= <>
$$ [...]
##$SUBNAM7= <"">
##$SUBNAM8= <"">
##$SUBNAM9= <"">
##$SW= 20.6930455092707
##$SWIBOX= (0..15)
0 0 3 0 0 0 0 0 0 0 0 0 0 0 0 0 
##$SW_h= 5175.983436853
##$TD= 65536
##$TD0= 1
##$TE= 294.16
##$TE2= 300
##$TE3= 300
##$TEG= 300
##$TL= (0..7)
0 120 120 120 120 120 120 120 
##$TP= (0..7)
150 150 150 150 150 150 150 150 
##$TP07= 0
##$TPNAME0= <>
##$TPNAME1= <>
##$TPNAME2= <>
##$TPNAME3= <>
##$TPNAME4= <>
##$TPNAME5= <>
##$TPNAME6= <>
##$TPNAME7= <>
##$TPOAL= (0..7)
0.5 0.5 0.5 0.5 0.5 0.5 0.5 0.5 
##$TPOFFS= (0..7)
0 0 0 0 0 0 0 0 
##$TUNHIN= 0
##$TUNHOUT= 0
##$TUNXOUT= 0
##$USERA1= <user>
##$USERA2= <user>
##$USERA3= <user>
##$USERA4= <user>
##$USERA5= <user>
##$V9= 5
##$VALIST= <valist>
##$VCLIST= <CCCCCCCCCCCCCCC>
##$VD= 0
##$VDLIST= <DDDDDDDDDDDDDDD>
##$VPLIST= <PPPPPPPPPPPPPPP>
##$VTLIST= <TTTTTTTTTTTTTTT>
##$WBST= 1024
##$WBSW= 4
##$XGAIN= (0..3)
0 0 0 0 
##$XL= 0
##$YL= 0
##$YMAX_a= 386926
##$YMIN_a= -492403
##$ZGOPTNS= <>
##$ZL1= 120
##$ZL2= 120
##$ZL3= 120
##$ZL4= 120
##$ABSF1= 16.44758
##$ABSF2= -4.245592
##$ABSG= 5
##$ABSL= 3
##$ALPHA= 0
##$AQORDER= 0
##$ASSFAC= 0
##$ASSFACI= 0
##$ASSFACX= 0
##$ASSWID= 0
##$AUNMP= <proc_1d>
##$AZFE= 0.1
##$AZFW= 0.1
##$BCFW= 0
##$BC_mod= 0
##$BYTORDP= 0
##$COROFFS= 0
##$CY= 12.5
##$DATMOD= 1
##$DC= 0
##$DFILT= <>
##$DTYPP= 0
##$F1P= 14.0000005364418
##$F2P= -0.99999901652339
##$FCOR= 0.5
##$FTSIZE= 32768
##$FT_mod= 6
##$GAMMA= 0
##$GB= 0
##$INTBC= 1
##$INTSCL= 1
##$ISEN= 128
##$LB= 0.3
##$LEV0= 0
##$LPBIN= 0
##$MAXI= 10000
##$MC2= 0
##$MEAN= 0
##$ME_mod= 0
##$MI= 0
##$NCOEF= 0
##$NC_proc= -2
##$NLEV= 6
##$NOISF1= 0
##$NOISF2= 0
##$NSP= 0
##$NTH_PI= 0
##$NZP= 0
##$OFFSET= 16.44758
##$PC= 1
##$PHC0= 224.5122
##$PHC1= 3.16565
##$PH_mod= 1
##$PKNL= yes
##$PPARMOD= 0
##$PSCAL= 4
##$PSIGN= 0
##$REVERSE= no
##$SF= 250.130018614152
##$SI= 32768
##$SIGF1= 0
##$SIGF2= 0
##$SINO= 400
##$SIOLD= 32768
##$SREGLST= <1H.CDCl3>
##$SSB= 0
##$STSI= 32768
##$STSR= 0
##$SW_p= 5175.98343685301
##$SYMM= 0
##$S_DEV= 0
##$TDeff= 65536
##$TDoff= 0
##$TI= <Analysis number 999999
Compound Code 99
Book Reference 9
Project Code 9>
##$TILT= no
##$TM1= 0
##$TM2= 0
##$TOPLEV= 0
##$USERP1= <user>
##$USERP2= <user>
##$USERP3= <user>
##$USERP4= <user>
##$USERP5= <user>
##$WDW= 1
##$XDIM= 32768
##$YMAX_p= 308290318
##$YMIN_p= -103099
$$ End of Bruker specific parameters
$$ ---------------------------------
##NTUPLES= NMR SPECTRUM
##VAR_NAME=  FREQUENCY,     SPECTRUM/REAL,   SPECTRUM/IMAG
##SYMBOL=    X,             R,               I
##VAR_TYPE=  INDEPENDENT,   DEPENDENT,       DEPENDENT
##VAR_FORM=  AFFN,          ASDF,            ASDF
##VAR_DIM=   32768,         32768,           32768
##UNITS=     HZ,            ARBITRARY UNITS, ARBITRARY UNITS
##FACTOR=    0.157963299565203, 1,           1
##FIRST=     4114.03357598274, 0,            0
##LAST=      -1061.94986087027, 0,           0
##MIN=       -1061.94986087027, -103099,     0
##MAX=       4114.03357598274, 308290318,    0
$$ Real data points
##PAGE= N=1
##DATA TABLE= (X++(R..R)), XYDATA
$$ [...]
19113A64353j6816l189L866J9480J9200J0366N173Q782j184j5811k7303k3024
$$ 164353 147537 144348 148214 167694 186894 197260 202433 211215 210031 194220 166917 143893
19101A43893j1340o202k154j905N156J5042K4540M2132N1086M4539J9707M015
$$ 143893 132553 126351 124197 122292 127448 142490 167030 209162 260248 304787 324494 328509
19089C28509k9493l9860l2294k8298k3075j347Q806J0009K7149M3385M4087J6569
$$ 328509 299016 259156 226862 198564 175489 174142 182948 192957 220106 263491 307578 324147
19077C24147j5469m8118m4300l6229k8091j8136j2318j0426n013m310l568J18
$$ 324147 308678 260560 216260 180031 151940 133804 121486 111060 106047 101737 98169 98287
19065I8287n125K18O319P015L241J0789L978r789j2755j158K92l698L291R400
$$ 98287 93162 93380 99699 106714 109955 120744 124722 114933 102178 101020 101312 97614 100905 110305
19051A10305J2959J8803K4189J9197r956k1635k1345j3299j1793j0952k457n017
$$ 110305 123264 142067 166256 185453 175497 153862 132517 119218 107425 96473 94016 88999
19039H8999r48J5424J5731J2259J6075p204j3839r199p594n424j663m68o43p815
$$ 88999 88051 103475 119206 131465 147540 140336 126497 117298 109704 104280 102617 102149 101506 93691
19025I3691j2546j2722o307k204p26n135m497P296J075q040Q47J158j612J026
$$ 93691 81145 68423 62116 59912 59186 54051 49554 56850 57925 49885 50732 51890 50278 51304
19011E1304n201l067O496K355M216L515k902J141o887m891o591M580P691L754
$$ 51304 46103 43036 49532 51887 56103 59618 56716 57857 50970 46079 39488 44068 51759 55513
18997E5513L13m891J478J197l21L589N439L058m305k505j609k052k184o534N60
$$ 55513 55826 50935 52413 53610 53289 56878 62317 65375 61070 58565 56956 54904 52720 46186 46746
18982D6746M135L384m369l039O017N753J6896Q535M64O508J0633J3378J6166l366
$$ 46746 50881 54265 49896 46857 52874 58627 75523 84058 84522 91030 101663 115041 131207 127841
18968A27841k0457r739o371k447O321J9590L0872L9976J0274k7474k7970j8951
$$ 127841 107384 97645 91274 88827 95148 114738 145610 185586 195860 168386 140416 121465
18956A21465j6594p747o575k108k84K189Q305M378j592m762n474k497k321l680
$$ 121465 104871 97124 90549 88441 88157 90346 98651 103029 101437 96675 91201 88704 86383 82703
18942H2703o208k445n652k487R965k087L075L380p357l707L968J195L29J2967
$$ 82703 76495 74050 68398 65911 75876 73789 76864 80244 72887 69180 73148 74343 74672 87639
18928H7639J5381P774J709R91l16l80k731o387J656J2446J7663L3713J5895p405
$$ 87639 103020 110794 112503 113494 113178 112798 110067 103680 105336 117782 135445 169158 185053 177648
18914A77648q351o913n606K704P048J1739K634j9646j9391j9786j3456J119N828
$$ 177648 169297 162384 156778 159482 166530 178269 180903 161257 141866 122080 108624 109743 115571
18901A15571m654o085J184n879l763j424N484l050r269L87L471J689n506l477
$$ 115571 110917 104832 106016 100137 96374 94950 100434 97384 88115 88502 91973 93662 88156 84679
18887H4679M641J1475L056j796J08k172k50O99J289J0727J1276L44p364j992N583
$$ 84679 89320 100795 103851 102055 102163 99991 99741 100440 101729 112456 123732 124076 116712 114720 120303
18872A20303K164q271l447J735j59J2242J8424J3021n744n591O221N297k47J26
$$ 120303 122467 114196 110749 112484 112325 124567 142991 156012 150268 144677 150898 156195 155948 156074
18858A56074O664M200j925O858P178l868p769k730N631M654O460n930r751j0807
$$ 156074 162738 166938 165013 171871 179049 175181 167412 164682 170313 174967 181427 175497 165746 154939
18844A54939k298N954M644m527P321J8915L3500N0171M5125j2614l3110k0076
$$ 154939 152641 158595 163239 158712 166033 184948 218448 268619 313744 301130 268020 247944
18832B47944P477K8351M6293N3878L200j4095Q089j2827l9711l0436j7522J3585
$$ 247944 255421 283772 330065 383943 387143 373048 381137 368310 328599 298163 280641 294226
18820B94226L4675M8887J4394k7174l3009l1121j8498j4878j7108j4694J420L721
$$ 294226 328901 377788 392182 365008 331999 300878 282380 267502 250394 235700 237120 240841
18808B40841M641N492K359j469r226o087j1041r814m541K157l925l252l068j769
$$ 240841 245482 250974 253333 251864 242638 236551 225510 215696 211155 213312 209387 206135 203067 201298
18794B01298j491m885m13K388K4421M9448O8041N0687j1838l1132j5951P715L3685
$$ 201298 199807 194922 194509 196897 221318 270766 338807 389494 377656 346524 330573 338288 371973
18781C71973O2273N9496K1006L1389M4639k1041m8045l0275k8504q163K4800L6093
$$ 371973 434246 493742 514748 546137 590776 569735 521690 491415 462911 454748 479548 515641
18769E15641l354k8090j9647l8655n2484m0588j1771j4021j0039O71R69n271j6458
$$ 515641 512287 484197 464550 425895 373411 332823 321052 307031 296992 297663 298632 293361 276903
18756B76903j2756m244r881j3180o423r621j0413K05J27j0218L017Q46j0195p471
$$ 276903 264147 259903 250022 236842 230419 220798 210385 210590 210717 200499 203516 204362 194167 186696
18742A86696o308p189k598N071J5724J8677J5930Q465P15N160J1236K8029M0801
$$ 186696 180388 173199 170601 175672 191396 210073 226003 234468 235183 240343 251579 279608 320409
18729C20409L8780K5936K6022K1235J5951j2313l2528m6624l5986k2369O19N455
$$ 320409 359189 385125 411147 432382 448333 436020 403492 356868 320882 298513 299132 304587
18717C04587j3057k5590k1395o224j206Q53r434j0562j4347q353l829J403J5714
$$ 304587 291530 265940 244545 238321 237115 237968 228534 217972 203625 195272 191443 192846 208560
18704B08560O341N44K052J217O32K767n973j974J3217Q680J5226R630K626J973
$$ 208560 214901 215445 217497 218714 219346 222113 216140 214166 227383 236063 251289 260919 263545 265518
18690B65518j138J749o289q089L172l335N955J1114J9424K9756L9465K3873K566
$$ 265518 264380 266129 259840 251751 254923 251588 257543 268657 288081 317837 357302 381175 383741
18677C83741l290O819L70j7993l0804k6555j7157n571p084l375J401L13L020n559
$$ 383741 380451 387270 387640 369647 338843 312288 295131 289560 282476 279101 280502 280815 283835 278276
18663B78276o460j0942r163J669J0665L687L093K2745K4185K5693R962j5692j6833
$$ 278276 271816 260874 251711 253380 264045 267732 270825 293570 317755 343448 353410 337718 320885
18650C20885n208n968L424J78P931J2263M465J246k129R263J6430J1331J3852
$$ 320885 315677 309709 313133 313311 321242 333505 337970 339216 337087 346350 362780 374111 387963
18637C87963J8800K4443L0748L2845J7536J4808K7940M9642M3579L7226N9031
$$ 387963 406763 431206 461954 494799 512335 527143 555083 604725 648304 685530 744561
18626G44561O4160N2712N3396Q3960J05878J15567J22569J35031J78796K44966
$$ 744561 808721 861433 914829 998789 1104667 1220234 1342803 1477834 1656630 1901596
18616A901596K89979L61676N19487Q03580J309881K130767K648674J022467q84120
$$ 1901596 2191575 2553251 3072738 3876318 5186199 7316966 9965640 10988107 10103987
18607A0103987o01213N64024K068221M054666N815818M377049p08003j989993
$$ 10103987 9502774 10066798 12135019 16189685 22005503 26382552 25674549 23684556
18599B3684556J464701N550577O201656J163064l170187l233808r56853k146682
$$ 23684556 25149257 30699834 36901490 38064554 34894367 31660559 30703706 28557024
18591B8557024m341836l103146o07564K059125M149105J911857j238681K98321
$$ 28557024 24215188 21112042 20504478 22563603 26712708 28624565 27385884 27684205
18583B7684205Q85430k748034l803684j289219J593186J878431k458033m584968
$$ 27684205 28569635 25821601 22017917 20728698 22321884 24200315 21742282 17157314
18575A7157314l438536k188531j446636r56495n58077k45105P1583O20930J470296
$$ 17157314 13718778 11530247 10083611 9127116 8569039 8323934 8395517 9016447 10486743
18566A0486743K303481J905723J057088K101890R74970l297165m043790k655233
$$ 10486743 12790224 14695947 15753035 17854925 18829895 15532730 11488940 8833707
18558H833707j552066r26543n40654k57445l6701J74100M54627N55158L98518
$$ 8833707 7281641 6355098 5814444 5556999 5520298 5694398 6149025 6704183 7102701
18549G102701P98646J717216J492423r71074j966971j234858m15689K31297Q81137
$$ 7102701 7901347 9618563 11110986 10139912 8172941 6938083 6522394 6753691 7634828
18540G634828J765172L009125L712383R70081k867126l097851j924451r88487
$$ 7634828 9400000 12409125 16121508 17091589 14224463 11126612 9202161 8213674
18532H213674l28769K65311R87118J910147K514641R78132j260955j042496L70531
$$ 8213674 7884905 8150216 9137334 11047481 13562122 14540254 13279299 12236803 12607334
18523A2607334K144565M067986L775597j388955m300549l114548j527518n46592
$$ 12607334 14751899 18819885 22595482 21206527 16905978 13791430 12263912 11717320
18515A1717320J04797Q60105J896905L352651N549135Q771338J2059869J0092568
$$ 11717320 11822117 12682222 14579127 17931778 23480913 32252251 44312120 54404688
18507E4404688j27044q630855r844870p325407m600584k500302q13599P81481
$$ 54404688 54277644 45646789 35801919 28476512 23875928 21375626 20562027 21343508
18499B1343508K650268N053623P687380Q205762K812716n508613q844761p542165
$$ 21343508 23993776 29047399 36734779 44940541 47753257 42244644 33399883 25857718
18491B5857718n352541l663634k482536j624285r51948o60312r71756j090989
$$ 25857718 20505177 16841543 14359007 12734722 11782774 11122462 10150706 9059717
18483I059717r22657p48102o08905m71071l03889q7167J3900m52916p73839o21555
$$ 9059717 8137060 7388958 6780053 6308982 6005093 5917926 5931826 5478910 4705071 4083516
18473D083516m53517l67120l03638k44086k02979j84405j56084j46498j46993
$$ 4083516 3629999 3262879 2959241 2715155 2512176 2327771 2171687 2025189 1878196
18464A878196j22076r0617p5262p2489j00663j15299j04912p8378n4390m1977
$$ 1878196 1756120 1665503 1590241 1517752 1417089 1301790 1196878 1118500 1064110 1022133
18454A022133n0706o6994o3866n9492n7283m0338l4871l3215k5252k7489l0407
$$ 1022133 971427 904433 840567 781075 723792 683454 648583 615368 590116 562627 532220
18443E32220l4797l0641l3924k0011r899j3053j7504j5050n523r752p779o122
$$ 532220 497423 466782 432858 412847 402948 389895 372391 357341 351818 342066 334287 328165
18431C28165j2555j2707k670n917p113l273K23q31n964j6820m949M441M748L866
$$ 328165 315610 302903 300233 294316 287203 283930 284153 283322 277358 260538 255589 260030 264778 268644
18417B68644r72K104k484m519N671j587m954o888o11l832q302p4k033o408K195
$$ 268644 267672 269776 267292 262773 268444 266857 261903 255015 254404 250572 242270 242196 240163 233755 235950
18402B35950N042P55L656l7r369r946j0292l914m984L342n882j268r898j80J163
$$ 235950 240992 241747 245403 245366 235997 226051 215759 211845 206861 210203 204321 203053 193155 192975 194138
18387A94138R763R764M000k018N383K872m782K196O201R572n19K445p693l733
$$ 194138 203901 213665 217665 215647 221030 223902 219120 221316 227517 237089 236570 239015 231322 227589
18373B27589P131R463J1153J6897L0369K3134R963O923Q775K0972N1390N2370
$$ 227589 234720 244183 255336 272233 302602 325736 335699 342622 351397 372369 423759 476129
18361D76129m538l0154k3517M43K9782M6107M2362q303l2862r693J1381L0491
$$ 476129 471591 441437 417920 418363 448145 494252 536614 528311 495449 485756 497137 527628
18349E27628J4435k3121l1551j2232J2625L6790N2502J7752m1664n7812n5362
$$ 527628 542063 518942 487391 475159 487784 524574 577076 594828 553164 495352 439990
18338D39990l6191j8167j0521o433N549Q213L690K032l916j1509N446R288L58
$$ 439990 403799 385632 375111 368678 374227 382440 386130 388162 384246 372737 378183 387471 387829
18325C87829p589p476J983J0950J4735M856l858k263J2642K3990K6818L6409N1258
$$ 387829 380240 372764 374747 385697 400432 405288 401430 399167 411809 435799 462617 499026 550284
18312E50284O9868M4382j2824k6725q945J9761N1663Q2094N5123o029J9688R1070
$$ 550284 620152 664534 651710 624985 616040 635801 687464 769558 824681 818652 838340 929410
18300I29410J54808J73585J10611L8072K641K099R994P2287R6574l4729j41213
$$ 929410 1084218 1257803 1368414 1406486 1409127 1411226 1421220 1493507 1590081 1555352 1414139
18289A414139j03506n5932j5356L5908P7311J31529J59186J36845J55224K22250
$$ 1414139 1310633 1254701 1239345 1275253 1352564 1484093 1643279 1780124 1935348 2157598
18279B157598L91932P26078J177190R83841m78289j081926p44755l78941j20201
$$ 2157598 2549530 3275608 4452798 5436639 4958350 3876424 3131669 2752728 2632527
18270B632527J02204L30809O70763J218680J626205N36228j122236j241103p46724
$$ 2632527 2734731 3065540 3736303 4954983 6581188 7117416 5995180 4754077 4007353
18261D007353l83759j85549n3075O6495J14202J17629J85120K60326L11932L56821
$$ 4007353 3623594 3438045 3384970 3451465 3565667 3683296 3868416 4128742 4440674 4797495
18251D797495M91259P10251J033520J592045K589335M226656O833158J0066537
$$ 4797495 5288754 5999005 7032525 8624570 11213905 15440561 22273719 32340256
18243C2340256J0576792M736644K099916K5016n451901l518130K730372N563588
$$ 32340256 42917048 47653692 49753608 49778624 44326723 40808593 43538965 49102553
18235D9102553R42568q85455k485965p946342p721979m176604r82523J823520
$$ 49102553 50045121 49159666 46673701 38727359 31005380 26828776 25846253 27669773
18227B7669773L844209J313714m148140n250637l841104k243496r56904K58613
$$ 27669773 31513982 32827696 28679556 23428919 19587815 17344319 16387415 16646028
18219A6646028J874531L854000L979906j336991n313542m478085k916524j894788
$$ 16646028 18520559 22374559 26354465 25017474 19703932 15225847 12309323 10414535
18211A0414535j208135p64677m99196l24293r2874J88873M41543Q17995J572304
$$ 10414535 9206400 8441723 7942527 7618234 7525360 7714233 8155776 8973771 10546075
18202A0546075K936311M940590N568994R10600k277098m2966K732657M73133n045687
$$ 10546075 13482386 18422976 23991970 24902570 22625472 22582506 25315163 25788296 20742609
18193B0742609n356255l390544k116320j594208j175225q38261o43498m96283
$$ 20742609 15386354 11995810 9879490 8285282 7110057 6271796 5628298 5132015
18185E132015m18343m43182m43281m08911l51086k97418k53660k20702j83057
$$ 5132015 4713672 4270490 3827209 3418298 3067212 2769794 2516134 2295432 2112375
18176B112375j40974j07996j01706r6228p1336k3760m858k5782n3256p6582q0484
$$ 2112375 1971401 1863405 1761699 1665471 1594135 1570375 1565517 1539735 1486479 1409897 1329413
18165A329413o0416k4560J2859J4710j3464n2960l5652l092L1698P8336J38458
$$ 1329413 1268997 1244437 1257296 1272006 1258542 1205582 1169930 1166838 1198536 1276872 1415330
18154A415330K37507M27064P35325J154857J034670l8539j77401K89451k94190
$$ 1415330 1652837 2079901 2815226 3970083 5004753 4966214 4788813 5078264 4784074
18145D784074j136753r61353n86846l52192k23053j49252r4681o6775n6071m9293
$$ 4784074 3647321 2685968 2099122 1746930 1523877 1374625 1279944 1213169 1157098 1107805
18135A107805n6919o5007o8056o4306o0026m9903k3589m300K2643M9241Q4708
$$ 1107805 1050886 985879 917823 853517 793491 743588 719999 715699 738342 787583 872291
18124H72291J07505O9781L4172L7281k0250m0793m541K3284Q4901J75849L03748
$$ 872291 979796 1049577 1083749 1121030 1100780 1059987 1055446 1078730 1163631 1339480 1643228
18113A643228M99317Q71698J620096L039130M380094O18760l871344l093804j700274
$$ 1643228 2142545 3014243 4634339 7673469 12053563 12672323 8800979 5707175 4006901
18104D006901r45768n63175l64136k54390j74438j08424n6997m8291p9468j09370
$$ 4006901 3061133 2497958 2133822 1879432 1704994 1596570 1539573 1491282 1411814 1302444
18094A302444j01989p2734m5420l4828m2096o3435q1785n7914m4167k0792P857
$$ 1302444 1200455 1127721 1082301 1047473 1005377 941942 860157 802243 758076 737284 745141
18083G45141J4209J6199J3381P049k4592k6867p014M4155J03652J08549O8853
$$ 745141 759350 775549 788930 795979 771387 744520 737506 781661 885313 993862 1062715
18072A062715k903p8078j17238j27379p6893l1953j3598k9296l1042j9682j7773
$$ 1062715 1059812 981734 864496 737117 660224 628271 614673 585377 554335 534653 516880
18061E16880l3763l3494k5870j9938k6811k4160m327J0246P346o692J5947M6366
$$ 516880 483117 449623 423753 403815 377004 352844 348517 358763 366109 359417 375364 421730
18049D21730N9224R5168P4967L4613r215j9101j8843L05Ol1027p2557p1870l9070
$$ 421730 480954 576122 651089 685702 676487 657386 638543 638848 638854 607827 535270 463400 424330
18036D24330k2297k8384k8861l2742k1151r007M892Q075Q407k075P567L2316M1553
$$ 424330 402033 373649 344788 312046 290895 281888 286780 294855 303262 301187 308754 341070 382623
18023C82623J437k891k6776m9644l9574j2462o309j8636j9925k3011j6011q928
$$ 382623 384060 381169 354393 304749 265175 252713 246404 227768 207843 184832 168821 159893
18011A59893n021n167J672O413N298J2134J1641Q759P439J9390J6381o600j394
$$ 159893 154872 149705 151377 157790 163088 175222 186863 195622 203061 222451 238832 232232 230838
17998B30838Q288Q083l937r459O550J6604J1283J4643L2422M4459M8724M0545
$$ 230838 239126 247209 243272 233813 240363 256967 268250 282893 315315 359774 408498 449043
17986D49043N0864O9496O2428L8377N2297O8778K6217j1485P250K1468J5623j2435
$$ 449043 499907 569403 631831 670208 722505 791283 817500 806015 813265 834733 850356 837921
17974H37921l6525m0445k3172l2762n2545o7521o8703n1551n3593m8154k7148
$$ 837921 801396 760951 737779 705017 652472 584951 516248 464697 411104 362950 335802
17963C35802k0144l0802k1707q824j947q400j5745n910q039l88n679j1097m538
$$ 335802 315658 284856 263149 254325 252378 243978 228233 222323 214284 213896 208217 197120 192582
17950A92582M584J1003J5959K1415J5500N325J5264K4096J4526J012J245J5877
$$ 192582 197166 208169 224128 245543 261043 266368 281632 305728 320254 321266 322511 338388
17938C38388K3410J8907r74j2603Q390J9614J4700K485r093M332L525N044m319
$$ 338388 361798 380705 379731 367128 375518 395132 409832 412317 403224 407556 411081 416125 411806
17925D11806j1748q562l492r934k4666j4381j098J7590J1882j5258m0116m5841
$$ 411806 400058 391496 388004 378070 353404 339023 337925 355515 367397 352139 312023 266182
17913B66182l9576k2707o525M19L046J5687K7226L3252L1279R965j8049k6264
$$ 266182 226606 203899 197374 197793 200839 216526 243752 277004 308283 318248 300199 273935
17901B73935l4671l6696l4984k6577j2433j3138n441L516o659r079o065L740K819
$$ 273935 239264 202568 167584 141007 128574 115436 109995 113511 106852 97773 91708 95448 98267
17888I8267n103k843n628m866R044Q103K943j979n984m538l035q071M769L266
$$ 98267 93164 90321 84693 79827 88871 96974 99917 97938 91954 87416 84381 76310 81079 84345
17874H4345o688k105p049o751n093m208j546l031n236k431n58K382m480q281K94
$$ 84345 77657 75552 68503 61752 56659 52451 50905 47874 42638 40207 39649 42031 37551 29270 29564
17859B9564J03M601N892K727j058m803l361l514m232o532o551O6P772M130k474
$$ 29564 29667 34268 40160 42887 41829 37026 33665 30151 25919 19387 12836 12902 20674 24804 22330
17844B2330l405M3l109J093J485j364j492J42M905J555K401k012N08k000k944
$$ 22330 18925 18968 15859 16952 18437 17073 15581 15723 20628 22183 24584 22572 23080 21080 18136
17829A8136r9j852P627L691n270l597L83L334j606M501K423l953l468L99M195
$$ 18136 18037 16185 23812 27503 22233 18636 19019 22353 20747 25248 27671 23718 20250 20649 24844
17814B4844j563l306n230R10N0j707J409K445J261l283p804k853J463L58l434
$$ 24844 23281 19975 14745 15655 15705 13998 15407 17852 19113 15830 8026 5173 6636 6994 3560
17799C560P220R380k295j1081k243M67J41M549k029N486L050J109l528j534m785
$$ 3560 10780 20160 17865 6784 4541 5008 5149 9698 7669 13155 16205 17314 13786 12252 7467
17784G467N086r84m763L107k397L484J626k546q93p360J13K323J556P783J1503
$$ 7467 12553 11569 6806 9913 7516 11000 12626 10080 9187 1827 1940 4263 5819 13602 25105
17769B5105j67N946J713k158l97K460J656J195L511N394J0984J1325J3656J1746
$$ 25105 24938 30884 32597 30439 30042 32502 34158 35353 38864 44258 55242 66567 80223 91969
17755I1969j916q249j103M713J3671K2167O334N709Q767k871r843q632K086K3948
$$ 91969 90053 81804 80701 85414 99085 121252 127586 133295 142062 139191 129348 120716 122802 146750
17741A46750L1596K4447O478j2963k3617k6528l3385k5361r001j2528m679q914
$$ 146750 178346 202793 209271 196308 172691 146163 112778 87417 78416 65888 61209 52295
17729E2295o094J55L145o071j2606o437l434L399O060O44m881k876J573L199O77
$$ 52295 46201 46356 49501 43430 30824 24387 20953 24352 30412 31056 26175 23299 24872 28071 28748
17714B8748m595O6M549P991J7911J8603J9179n578j2603o060k617J0324J7568
$$ 28748 24153 24219 28768 36759 54670 73273 92452 86874 74271 68211 65594 75918 93486
17701I3486J2781q6K74J3651O13j1733j376J7136K7406M1298M2685K1332N03r231
$$ 93486 106267 106181 106455 120106 120719 108986 107610 124746 152152 193450 236135 257467 257970 248739
17687B48739k2190m1134m0594k9491k3106j0059j3129o549j1439q402j327Q25
$$ 248739 226549 185415 144821 115330 92224 82165 69036 62487 51048 42646 41319 42144
17675D2144j2279m579K226m993l622Q292l004p66m740l401N692M943m809l939
$$ 42144 29865 25286 27512 22519 18897 27189 24185 23419 18679 15278 20970 25913 21104 17165
17661A7165J903K404o242l365k656K384L512J761q1n911M525J639j368m382p166
$$ 17165 19068 21472 15230 11865 9209 11593 15105 16866 16785 10874 15399 17038 15670 11288 4122
17646D122L641K655R422J7189K2024J2852O475l0P200m730j1561j5321j4271r305
$$ 4122 7763 10418 19840 37029 59053 71905 78380 78350 85550 80820 69259 53938 39667 30362
17632C0362j760L86j054j158n096J001j625p852p013k864m42L903P300K674o99
$$ 30362 28602 28988 27934 26776 21680 22681 21056 13204 6191 3327 2885 6788 14088 16762 16063
17617A6063j3382N143J0547k311n475n705P47K358l787o943N848O455p197l042
$$ 16063 2681 7824 18371 16060 10585 4880 5627 7985 4198 -2745 3103 9558 2361 -681
17603f81K953O081O167J236o325o65p72K507K503k505k167l934l756M034k539
$$ -681 2272 8353 14520 15756 9431 8766 7994 10501 13004 10499 8332 4398 642 4676 2137
17588B137l26J773M81m636R74l11r644P272R145K824j394l897N137L916j666m307
$$ 2137 1811 3584 4065 -571 403 92 -9552 -2280 6865 9689 8295 4398 9535 13451 11785 7478
17572G478r030J978K755L624J95p349k641L733N890L267O576m558m774J439Q6
$$ 7478 -1552 426 3181 6805 7000 -349 -2990 743 6633 9900 16476 11918 7144 8583 8669
17557H669p196J230r25j1046m423J341n826n588Q322N575N438M240j987J377Q471
$$ 8669 1473 2703 1778 -9268 -13691 -12350 -18176 -23764 -15442 -9867 -4429 -189 -2176 -799 7672
17542G672K377J30j628L983n595M55n10o777l455l995L382L933O57K543N08p96
$$ 7672 10049 10179 8551 12534 6939 7394 6884 107 -3348 -7343 -3961 -28 629 3172 3680 2884
17526B884L315O893K88r246n014j627q49M103J688N604l979p916j694K819J815
$$ 2884 6199 13092 13380 4134 -880 -2507 -3356 747 2435 8039 4060 -3856 -5550 -2731 -916
17511i16m83m178J032L868R501J967n134m768k361K273K504l538k234j114k108
$$ -916 -1399 -5577 -4545 -677 8824 10791 5657 889 -1472 801 3305 -233 -2467 -3581 -5689
17496e689j813M451j945K99J087J444J818j35k467l386M994O942L01q395K639
$$ -5689 -7502 -3051 -4996 -4697 -3610 -2166 -348 -483 -2950 -6336 -1342 5600 5901 -2494 145
17481A45O795m896j975J1596M132k241M72o61k207J608j496k414J296Q95K479
$$ 145 6940 2044 69 11665 15797 13556 14028 13367 11160 12768 11272 8858 10154 11049 13528
17466A3528K10n698j0613l993L291n062J530O508j581L336j126l144k309k692
$$ 13528 13738 8040 -2573 -6566 -3275 -8337 -6807 -299 -1880 1456 330 -2814 -5123 -7815
17452g815K791Q125R208L183R49M961P613M013Q311K1549K1683j8281k9565j6029
$$ -7815 -5024 3101 12309 15492 16441 21402 29015 33028 41339 62888 84571 66290 36725 20696
17438B0696n465N437l048L832l199n4O312n908p843p148J696P74q499j18j718
$$ 20696 15231 20668 17620 21452 18253 18199 24511 18603 10760 3612 5308 6082 -2417 -2535 -4253
17423d253L546N670J839l762N465P094m813l610J998r669k782l482M370K954O088
$$ -4253 -707 4963 6802 3040 8505 15599 10786 7176 9174 -495 -3277 -6759 -2389 565 6653
17408F653L775M60n409l758o069l729M529K567n49K433R42r35N261K428J529n660
$$ 6653 10428 10888 5479 1721 -4348 -8077 -3548 -981 -1530 903 1845 910 6171 8599 10128 4468
17392D468J789K12O54K528m924l200K073j851k518M936M363m758k062K452o194
$$ 4468 6257 6469 7123 9651 4727 1527 3600 1749 -769 4167 8530 3772 1710 4162 -2032
17377b032o007q661m752O649J2932O274M767L774n800n848M170M708k377j0540
$$ -2032 -8039 -16700 -21452 -14803 -1871 4403 9170 12944 7144 1296 5466 10174 7797 -2743
17363b743n295K20L601N109K352N06P451K74o791r183p869N852L247m045Q80J1810
$$ -2743 -8038 -7818 -4217 892 3244 3750 11201 11475 4684 -4499 -12368 -6516 -3269 -7314 -6434 5376
17347E376L46q552k013k909J31M326L106j434L546M772k602L66R60P23Q3q606
$$ 5376 5722 -2830 -4843 -7752 -7621 -3295 -189 -1623 1923 6695 4093 4459 5419 6142 6225 -2381
17331b381n694k236M714K805O178l143l784j327J407L235L514Q32O848M735l53
$$ -2381 -8075 -10311 -5597 -2792 3386 243 -3541 -4868 -3461 -226 3288 4120 10968 15703 15350
17316A5350k57q49M63Q44l607n459n04n916k90j968N69M026J531m289L62o843
$$ 15350 15093 14244 14707 15551 11944 6485 5981 65 -225 -2193 -1624 2402 3933 -356 6 -6837
17300f837K644j732m201L5O403K958M683O501j810j543n401m137J712K553k159
$$ -6837 -4193 -5925 -10126 -10091 -3688 -730 3953 10454 8644 7101 1700 -2437 -725 1828 -331
17285c31n566K77J767Q534M303n150J516J210k498L038K621L768L534J0244J036
$$ -331 -5897 -5620 -3853 4681 8984 3834 5350 6560 4062 7100 9721 13489 17023 27267 28303
17270B8303j4332r140j291K789j902p168M11k240Q05M345P712J6643J2214n344
$$ 28303 13971 4831 3540 6329 4427 -2741 -2330 -4570 -3765 580 8292 24935 37149 31805
17256C1805n948m640r739q048m771l179P523P380J543k846o466j947J1777N068
$$ 31805 25857 21217 11478 3430 -1341 -4520 3003 10383 11926 9080 2614 667 12444 17512
17242A7512m837k448n542m959j395M82K819j526J780j638j181K682M426m604K496
$$ 17512 12675 10227 4685 -274 -1669 -1187 1632 106 1886 248 -933 1749 6175 1571 4067
17227D067k605O27k967m343l372O500Q222J252l883P463K865o547J031k459l875
$$ 4067 1462 2089 -878 -5221 -8593 -2093 6129 7381 3498 10961 13826 7279 8310 5851 1976
17212A976K462K602l974Q7J442k594r028L453K002P99N121m685J203M116k038
$$ 1976 4438 7040 3066 3153 4595 2001 -7027 -3574 -1572 -773 4348 -337 866 4982 2944
17197B944l658P138n119j427P853J290P354o93J713j360L74l554K101k905o249
$$ 2944 -714 6424 1305 -122 7731 9021 16375 15682 17395 16035 16409 12855 14956 12051 5802
17182E802l023Q90p9j606j354Q511N634P964r93M614N604j356o492l911N370M164
$$ 5802 2779 3669 3590 1984 630 9141 14775 22739 21746 26360 31964 30608 24116 20205 25575 29739
17166B9739J4569J3482J0924K8294L8601M9525N0675l462l7164l3319k8048j4888
$$ 29739 44308 57790 68714 97008 135609 185134 235809 232347 195183 161864 133816 118928
17154A18928q301p206J0168K5260K8174M2427L7251L938l8500n0637l0330k1830
$$ 118928 110627 103421 113589 138849 167023 209450 246701 250639 212139 161502 131172 109342
17142A09342j5481j7080j3519j1892l750J555m418R8p8n000l226M533R45j450
$$ 109342 93861 76781 63262 51370 47620 49175 44757 44855 44777 39777 36551 41084 42029 40579
17128D0579k587k140j164p266J345k074j094Q44l044n752M963J4q495l234M150
$$ 40579 37992 35852 34688 27422 28767 26693 25599 26443 23399 17647 22610 22624 14129 10895 15045
17113A5045M198j969l780O155O038J803K907k737M18k876p431n292o27L333J897
$$ 15045 19243 17274 13494 19649 25687 27490 30397 27660 28078 25202 17771 12479 11852 15185 17082
17098A7082N38k64j088M583O743N066o786k796L62n73n741O761J3146k048j0783
$$ 17082 17620 17356 16268 20851 27594 32660 25874 23078 23440 22867 17126 23887 37033 34985 24202
17083B4202o445r256J507j94l219M124O899P24N59k234n08L607L765n184J615
$$ 24202 17757 8501 10008 9814 6595 10719 17618 18342 18901 16667 16159 19766 23531 18347 19962
17068A9962N885o13k767m231q917N93J055O220J498l199K365j083K926J414K99
$$ 19962 25847 25234 22467 18236 9319 9912 10967 17187 18685 15486 17851 16768 19694 21108 21407
17053B1407p206L06J073o77O817k795N204j715k938M221L349J506j496k733p32
$$ 21407 14201 14507 15580 14903 21720 18925 24129 22414 19476 23697 27046 28552 27056 24323 23591
17038B3591m153p829o13l175J370M123L566j493p1k0J108K021j699l236J608P84
$$ 23591 19438 11609 10996 7821 9191 13314 16880 15387 15316 15296 16404 18425 16726 13490 15098 15882
17022A5882k944J003K837m873n597N561O811J994Q88j354r14J675n260K87M46
$$ 15882 12938 13941 16778 11905 6308 11869 18680 20674 21562 20208 19294 20969 15709 15996 16442
17007A6442m674M905L076o663k613K199m883n37M509j648j123N902J6571J913
$$ 16442 11768 16673 19749 13086 10473 12672 7789 7252 11761 10113 8990 14892 31463 33376
16993C3376q084k869k979o408n114j184j337L20N570O15j147K159J447O73J536
$$ 33376 25292 22423 19444 13036 7922 6738 5401 5721 11291 11906 10759 12918 14365 15038 16574
16978A6574K076k208q40N691p12r021k27j525P431J0969J1487P171j03J1809J7567
$$ 16574 18650 16442 15602 21293 20581 11560 11333 9808 17239 28208 39695 46866 46763 58572 76139
16963G6139L8028L6238M956l0319k6832k1524j5807j0961p32o08q8R399J8326
$$ 76139 114167 150405 155361 125042 98210 76686 60879 49918 49186 48578 48490 57889 76215
16950G6215K8492L2193M0477J9796k7132l4697k0508j4518j546L979P898K2221
$$ 76215 104707 136900 177377 197173 170041 135344 114836 100318 98772 102751 110649 132870
16938A32870L1210N2258R6611J60307K08265R9123j22164j76675j23583p2911
$$ 132870 164080 216338 312949 473256 681521 780644 658480 481805 358222 285311
16928B85311l8976k7163j1638O192K4143L4239N5161J07283J70309J63262k0644
$$ 285311 246335 219172 207534 213726 237869 272108 327269 434552 604861 768123 747479
16917G47479j70269j66725j00652o2884m7224k4985j6451j5950r222k045j0715
$$ 747479 577210 410485 309833 246949 199725 174740 158289 142339 133117 131072 120357
16906A20357j5588j0856p992J391M553l890j4161j2485o743n140r742o274k500
$$ 120357 104769 93913 85921 87312 91865 87975 73814 61329 54586 49446 39704 33430 30930
16893C0930p56m146J3j852L81K324J704J626J204K825o902j2329r186L514J849
$$ 30930 30174 26028 26041 24189 24570 26894 28598 30224 31428 34253 27351 15022 5836 9350 11199
16878A1199O362K643J758L729k564K74q846k367o01k165K830j100P46J1418Q782
$$ 11199 17561 20204 21962 25691 23127 23401 14555 12188 11587 9422 12252 11152 11898 23316 32098
16863C2098K039P521M526N159L796K050n778p147p255n402Q31J056K580L006L166
$$ 32098 34137 41658 46184 51343 55139 57189 51411 44264 37009 31607 32438 33494 36074 39080 42246
16848D2246P678j005N792J571o625n387j1185o781q470l561P835L652J102r463
$$ 42246 49924 48919 54711 56282 49657 44270 33085 26304 17834 14273 22108 25760 26862 17399
16834A7399l181Q373O142j173m767m978J393J14K58k926M031P59l903n043J955
$$ 17399 14218 22591 28733 27560 22793 17815 19208 19322 19580 16654 20685 21444 17541 12498 14453
16819A4453J389K495p50N557l374k222n927J086M84Q68J993j254r399k225P777
$$ 14453 15842 18337 17587 23144 19770 17548 11621 12707 13191 14059 16052 14798 5399 3174 10951
16804A0951O67J773j1100m286Q494Q188l890k66r024O38J327k377J284Q705P461
$$ 10951 11618 13391 2291 -1995 6499 14687 10797 10531 1507 2145 3472 1095 2379 11084 18545
16789A8545j462O687P112n203k538L0M37m393k642O394M272Q40O310n453q708
$$ 18545 17083 23770 30882 25679 23141 23171 23608 19215 16573 22967 27239 28079 34389 28936 20228
16774B0228J09p38l037l62L782L277L431P719O359k022R79J479m213m364o296
$$ 20228 20337 19599 16562 16200 19982 23259 26690 34409 40768 38746 39725 41204 36991 32627 26331
16759B6331r226j698N819O501N683L548P21R72n114o987q509K113J578o121N77
$$ 26331 17105 15407 21226 27727 33410 36958 37679 38651 33537 26550 18041 20154 21732 15611 16188
16744A6188Q954J0879M536l08p72j1234L11L468K694O202K220M643R581Q299O67
$$ 16188 25142 36021 40557 40249 39477 28243 28554 32022 34716 40918 43138 47781 57362 65661 66328
16729F6328n625k942r849l858K335K953m502K719P711J9948J4808k397l316l491
$$ 66328 60703 57761 47912 44054 46389 49342 44840 47559 55270 75218 90026 87629 84313 80822
16715H0822q262o562q511k617O616P627N994J619O010Q622K145q277n790K734
$$ 80822 72560 65998 57487 54870 61486 69113 75107 76726 82736 91358 93503 85226 79436 82170
16701H2170L504J654J291k544K984M198J299k521L254o646J723P056N032L697
$$ 82170 85674 87328 88619 86075 89059 93257 94556 92035 95289 88643 90366 97422 102454 106151
16687A06151m984m432J245J507j130J1347N659n319j684K518k485N202M333q391
$$ 106151 101167 96735 97980 99487 98357 109704 115363 110044 108360 110878 108393 113595 117928 109537
16673A09537j363l380l865L003O320K029O646J3672R067M891K551J911k533p01
$$ 109537 108174 104794 100929 103932 110252 112281 118927 132599 141666 146557 149108 151019 148486 147785
16659A47785L152j269l63N657N898R384J0608J0815M661P207J3361L908O574M791
$$ 147785 150937 149668 149305 154962 160860 170244 180852 191667 196328 203535 216896 220804 227378 232169
16645B32169M771J5260J1765J2275J9814J9423K3163K6129K5659J9781J8877K7769
$$ 232169 236940 252200 263965 276240 296054 315477 338640 364769 390428 410209 429086 456855
16633D56855M3024O7312R4218J15326Q3843L0892J4321L1964O8209J04071J43224
$$ 456855 499879 567191 661409 776735 860578 891470 905791 937755 1005964 1110035 1253259
16622A253259J60257J48877J32851J62767K36127K87888L18871L89634N54871
$$ 1253259 1413516 1562393 1695244 1858011 2094138 2382026 2700897 3090531 3645402
16613C645402Q19063J189865J742870K654953M142359O575188J0043728J1861760
$$ 3645402 4464465 5654330 7397200 10052153 14194512 20769700 30813428 42675188
16605D2675188N259520o324142j0089305p593027m539317k334865o86392Q19929
$$ 42675188 47934708 41610566 31521261 23928234 19388917 17054052 16367660 17187589
16597A7187589K607502N127977Q596313J1056705O064653n677408j0980397r000116
$$ 17187589 19795091 24923068 33519381 44576086 50640739 44963331 33982934 24982818
16589B4982818n951673l869508k592241j842055j388872j051356p83366o09150
$$ 24982818 19031145 15161637 12569396 10727341 9338469 8287113 7503747 6894597
16581F894597n55348n54199n28384m99153m76255m33170l86282l58210l37016
$$ 6894597 6339249 5785050 5256666 4757513 4281258 3848088 3461806 3103596 2766580
16572B766580k92665k49862j93063j44553r6525o9978r8288j48358j51920j30384
$$ 2766580 2473915 2224053 2030990 1886437 1789912 1719934 1621646 1473288 1321368 1190984
16562A190984j11372r9284p6746p4885o8327m8745m7377m4329l8563l7635l6942
$$ 1190984 1079612 980328 903582 828697 760370 711625 664248 619919 581356 543721 506779
16551E06779m2981l7097l4075k1351k1946k2956k2161j7681j2889o136n838n897
$$ 506779 463798 426701 392626 371275 349329 326373 304212 286531 273642 267506 261668 255771
16539B55771j8469j6874k2265j2390o433j4401j1646p625N197P460N229R93n253
$$ 255771 237302 220428 198163 185773 179340 164939 153293 145668 150865 158325 163554 164547 159294
16526A59294j5565k1028j7513r239j0760k342K969k650k391K169L951P61r46R57
$$ 159294 143729 122701 105188 95949 85189 82847 85816 83166 80775 82944 86895 87656 86710 87667
16512H7667n483l603n001r253l258j978N6j14r30m838n826l92J762L114O409l332
$$ 87667 82184 78581 73580 64327 61069 59091 59147 59033 58103 53265 47439 47047 48809 51923 58332 55000
16496E5000p138n010j0210k36J656l148j042K475P730L800n097j562l664N770
$$ 55000 47862 42852 32642 32406 34062 30914 29872 32347 40077 43877 38780 37218 33554 39324
16482C9324L950J373K275m191o021l720P509K481J242J252n668J311P414L621
$$ 39324 43274 44647 46922 42731 36710 32990 40499 42980 44222 45474 39806 41117 48531 52152
16468E2152N094n38l75K43M499o033j3501o634q969p81N207N047J931k015M487
$$ 52152 57246 56708 56333 56576 61075 55042 41541 34907 25938 25157 30364 35411 37342 35327 39814
16453C9814K539J0265L569m968q104p415j1240N12k092M604N583P091j829K742
$$ 39814 42353 52618 56187 51219 43115 35700 24460 24972 22880 27484 33067 40158 38329 41071
16439D1071m328n293k189k196K99M210l726o037n727k340P866K651k48Q08J150
$$ 41071 36743 31450 29261 27065 27364 31574 27848 21811 16084 13744 21610 24261 24013 24821 25971
16424B5971j073m061o116p39n632l529j17K701j928l054o243N891M447k120M228
$$ 25971 24898 20837 14721 13982 8350 4821 4704 7405 5477 2423 -3820 2071 6518 4398 8626
16409H626l06n28O603L703N988m69J949n497o877M80j340K141k810n50K556L622
$$ 8626 8320 7792 14395 18098 24086 23617 25566 20069 13192 13672 12332 14473 11663 11113 13669 17291
16393A7291O05J155J580j773o583k048N199K475o347m104m179J388K873M386R52
$$ 17291 17896 19051 20631 18858 12275 10227 15426 17901 11554 7450 3271 4659 7532 11918 12870
16378A2870m347J804L943J280n019J902j576j952o361O099L019l101l131r692
$$ 12870 8523 10327 14270 15550 10531 12433 10857 8905 2544 8643 11662 8561 5430 -4262
16364d262K946N877P147l24k756J348k057n386j202O52k331k838K961m44J046
$$ -4262 -1316 4561 11708 11384 8628 9976 7919 2533 1331 1983 -348 -3186 -225 -669 377
16349C77m213k347K409L870P034N926J817m452N595k149o458K328M491n883n910
$$ 377 -3836 -6183 -3774 96 7130 13056 14873 10421 16016 13867 7409 9737 14228 8345 2435
16334B435k112o38k512JK355J036N692L867p706k132n84N058L275L210k727K573
$$ 2435 323 -315 -2827 -2826 -471 565 6257 10124 2418 286 -298 4760 8035 11245 8518 11091
16318A1091M059j445o640j281j120m569j099P97k547L986O271j448n173j740m906
$$ 11091 15150 13705 7065 5784 4664 95 -1004 -207 -2754 1232 7503 6055 882 -858 -5764
16303e764P89O32o129o922j457K874n79j780L561M201n981j0112J697O403r95
$$ -5764 -4975 -4343 -10472 -17394 -18851 -15977 -16556 -18336 -14775 -10574 -16555 -26667 -24970 -18567 -19562
16288a9562J411L696q96O668k698m665n468M122P039m50J1366M836n13o717r50
$$ -19562 -18151 -14455 -15351 -8683 -11381 -16046 -21514 -17392 -10353 -10803 563 5399 4886 -1831 -2781
16273b781m405J262r63n602j204K278N047M212l966N96j022N351O020m479P469
$$ -2781 -7186 -5924 -6887 -12489 -13693 -11415 -6368 -2156 -6122 -5526 -6548 -1197 4823 344 7813
16258G813N180p797l497m590q428K302R27L636O610k711j361J565K292M730j937
$$ 7813 12993 5196 1699 -2891 -11319 -9017 -8090 -4454 2156 -555 -1916 -351 1941 6671 4734
16243D734J482R49K689M27k801j2389k356j765M974j463J375j510k062j0156K82
$$ 4734 6216 7165 9854 10281 7480 -4909 -7265 -9030 -4056 -5519 -4144 -5654 -7716 -17872 -17590
16228a7590R236l29j24Q369j923J074Q211l715l721K47n536j0656J40N011O676
$$ -17590 -8354 -8683 -8807 -438 -2361 -1287 6924 3209 -512 -265 -5801 -16457 -16317 -11306 -4630
16213d630l229j980l768l89Q05L952K674N633J219n5n555m287L047N242j684r229
$$ -4630 -7859 -9839 -13607 -13996 -13191 -9239 -6565 -932 287 232 -5323 -9610 -6563 -1321 -3005 -12234
16197a2234J220J924k318N084M355K587k376l34l442p25l878j1547J517K629p48
$$ -12234 -11014 -9090 -11408 -6324 -1969 618 -1758 -2092 -5534 -6259 -10137 -21684 -20167 -17538 -18286
16182a8286L859l63L09P067o062l637Q428N580k210m860M935J871n91J511k02
$$ -18286 -14427 -14790 -14481 -7414 -13476 -17113 -8685 -3105 -5315 -10175 -5240 -3369 -3960 -2449 -2651
16167b651K171j02O93k134j704l020J1930M817l898m011o385l357L103L240R79
$$ -2651 -480 -582 111 -2023 -3727 -6747 5183 10000 6102 2091 -4294 -7651 -4548 -1308 -329
16152c29j647k918l034J986q99l109L882N217m741o612l580N384K18M802M940
$$ -329 -1976 -4894 -7928 -5942 -6841 -9950 -6068 -851 -5592 -12204 -15784 -10400 -10182 -5380 -440
16137d40k083l497R91j094j1441K702J1846r60m4O474k018l872J241O990j004
$$ -440 -2523 -6020 -5029 -6123 -17564 -14862 -3016 -3976 -4020 2454 436 -3436 -2195 4795 3791
16122C791L976R5r227l829M981O006l47L069j1673n430N130k028p70J328R88J228
$$ 3791 7767 7862 -1365 -5194 -213 5793 5446 8515 -3158 -8588 -3458 -5486 -6256 -4928 -3940 -2712
16106b712m403J075m603j584k167L385Q964O40K675M358l84n772J383q430j536
$$ -2712 -7115 -6040 -10643 -12227 -14394 -11009 -2045 -1405 1270 5628 5244 -528 855 -7575 -9111
16091i111K579R81M020L533K731p844k823K559J414N279K199l668m36j690M983
$$ -9111 -6532 -5551 -1531 2002 4733 -3111 -5934 -3375 -1961 3318 5517 1849 1413 -277 4706
16076D706P49N150n292l382K15Q05M187O228J129k840K970n405n593j227J390
$$ 4706 5455 10605 5313 1931 2146 2951 7138 13366 14495 11655 14625 9220 3627 2400 3790
16061C790k837k458O54L925M600k727M087O623O4j438K908J8904K3094J8821L7120
$$ 3790 953 -1505 -851 3074 7674 4947 9034 15657 15721 14283 17191 36095 59189 78010 115130
16046A15130N1274N2667J8291k2353m8765m0304k7290m815m121N279J5863K7818
$$ 115130 166404 219071 237362 215009 166244 125940 98650 93835 89714 94993 110856 138674
16034A38674L6366M0446K0412k8220m8659m3307k1795j6500j4251p589k566r33
$$ 138674 175040 215486 235898 207678 159019 115712 93917 77417 63166 55577 53011 52078
16022E2078o293j1823p983k468j450n696Q362N73M598l291l130n868p454p184
$$ 52078 45785 33962 25979 23511 22061 16365 24727 25300 29898 26607 23477 17609 10155 2971
16008B971q40O045J814n250r13N2q080l35m127L648N047K944P62J049j197j578
$$ 2971 2131 8176 9990 4740 3827 3879 -4201 -4536 -8663 -5015 32 2976 3738 4787 3590 2012
15992B012K724J758l26L455l935l874k268p89J944p612J061L436L808N675j0157
$$ 2012 4736 6494 6168 9623 5688 1814 -454 -1243 701 -6911 -5850 -2414 1394 7069 -3088
15977c088r741q166M804J2326l162j289P50J540P245J000L83q240m664o477k719
$$ -3088 -12829 -20995 -16191 -3865 -7027 -8316 -7566 -6026 1219 2219 2602 -5638 -10302 -16779 -19498
15962a9498L925P526K651L706J617q717n220m669l290M495N627P747M974L91n886
$$ -19498 -15573 -8047 -5396 -1690 -73 -8790 -14010 -18679 -21969 -17474 -11847 -4100 874 1265 -4621
15947d621q448K532L791K826K866j34L722m71K38J585J900o77J101N24l735m020
$$ -4621 -13069 -10537 -6746 -3920 -1054 -1188 2534 2063 2301 3886 5786 5109 6210 6734 2999 -1021
15931a021L548L651o30o568q583R22O102l900k509P6J1424k549q832J871N146
$$ -1021 2527 6178 5548 -1020 -9603 -8681 -2579 -6479 -8988 -8912 2512 -37 -8869 -6998 -1852
15916a852j623m569O193p58l01N146k846p262l480K484K408j542L229M237L750
$$ -1852 -3475 -8044 -1851 -2609 -2910 2236 -610 -7872 -11352 -8868 -6460 -8002 -4773 -536 3214
15901C214o94K585L007L074o952o626J780j346p668l219j444N756J305J252L731
$$ 3214 2520 5105 8112 11186 4234 -2392 -612 -1958 -9626 -12845 -14289 -8533 -7228 -5976 -2245
15886b245N029M01o146n345k091N653J0395N305r031q757o48M421M896r58m32
$$ -2245 2784 3185 -2961 -8306 -10397 -4744 5651 10956 1925 -6832 -7480 -3059 1837 879 447
15871D47N162R41J07m860m530J363M562O144M862r63q378q625q706N07M7L014
$$ 447 5609 6550 6657 1797 -2733 -1370 3192 9336 14198 13235 4857 -3768 -12474 -11967 -11920 -8906
15855h906J551m614n680J579K472J368K261N87J179k686n33N344J119k900l674
$$ -8906 -7355 -11969 -17649 -16070 -13598 -12230 -9969 -9382 -8203 -10889 -11422 -6078 -4959 -7859 -11533
15840a1533M807O234k0m841n163O56M684k445k073M252K033q02k845R02J272k377
$$ -11533 -6726 -492 -512 -5353 -10516 -9860 -5176 -7621 -9694 -5442 -3409 -4211 -7056 -6154 -4882 -7259
15824g259K530K458o46K752j235l988N45J880m420O65J909L816n78l662j703L710
$$ -7259 -4729 -2271 -2917 -165 -1400 -5388 -4843 -2963 -7383 -6718 -4809 -993 -1571 -5233 -6936 -3226
15808c226L239j422K97o74n486n99k026n83K542L498L093J315j286m772j160K188
$$ -3226 13 -1409 -1112 -1786 -7272 -7871 -9897 -10480 -7938 -4440 -1347 -32 -1318 -6090 -7250 -5062
15792e062N01L264K82k367n105n083J099L12M036q6k069J408k079k555n653M14
$$ -5062 -4561 -1297 -1015 -3382 -8487 -13570 -12471 -12159 -8123 -8209 -10278 -8870 -10949 -13504 -19157 -18743
15776a8743L47M099J2032L567m730k210K839j451j52q50q540k711N599J413q89
$$ -18743 -18396 -14297 -2265 1302 -3428 -5638 -2799 -4250 -4402 -5252 -13792 -16503 -10904 -9491 -10380
15761a0380n790L724P019J533K190m746n143P364j906k912J460K39K72j20R076
$$ -10380 -16170 -12446 -5427 -3894 -1704 -6450 -11593 -4229 -6135 -9047 -7587 -7348 -7076 -7196 1880
15746A880q18k372k800m962o17J281L758J813R49O529m430n131m070J321m43n500
$$ 1880 1062 -1310 -4110 -9072 -9689 -8408 -4650 -2837 -1888 4641 211 -4920 -8990 -7669 -8112 -13612
15730a3612p94M254J02M580p091o304P20o04k253K921J3890K693l250J503L10
$$ -13612 -14406 -10152 -10050 -5470 -12561 -18865 -18145 -18749 -21002 -18081 -4191 -1498 -4748 -3245 -2935
15715b935j760K73j021l680j79J548k3J132P29J230q43o610n29J097K141J363
$$ -2935 -4695 -4422 -5443 -9123 -9302 -7754 -7777 -6645 -5916 -4686 -5529 -12139 -12668 -11571 -9430 -8067
15699h067O447k188k066k578J897N737N686L211o905J569M585k654M688n910n07
$$ -8067 -1620 -3808 -5874 -8452 -6555 -818 4868 8079 1174 2743 7328 4674 9362 3452 2945
15684B945R17K77k582n85J70L22m80q716m569J85N273P854Q20n574q049K691O197
$$ 2945 3862 4139 1557 972 1142 1464 984 -7732 -12301 -12116 -6843 1011 1831 -3743 -11792 -9101 -2904
15667b904Q17m031N02Q828r18nK820M042l328M37l388k292O24R54l812j309M103
$$ -2904 -2087 -6118 -5616 3212 2294 2289 5109 9151 5823 6260 2872 580 1204 2158 -1654 -2963 1140
15650A140J24M795l672n313j750L793L152n519q373L625J1156K471K649l873K40
$$ 1140 1264 6059 2387 -2926 -4676 -883 2269 -3250 -11623 -7998 3158 5629 8278 4405 4645
15635D645P268q812q016r35l444M943K786o069k731j794M28p63K472K415j629
$$ 4645 11913 3101 -4915 -5850 -9294 -4351 -1565 -7634 -10365 -12159 -11731 -12494 -10022 -7607 -9236
15620i236L554J937K546o857J011O499N604j130q378k431N224Q37N739j791n423
$$ -9236 -5682 -3745 -1199 -8056 -7045 -546 5058 3928 -4450 -6881 -1657 -820 4919 3128 -2295
15605b295m379J275n97L145j037j984K568m445j75Q673j079j647M35J336M592
$$ -2295 -6674 -5399 -5996 -2851 -3888 -5872 -3304 -7749 -7924 749 -330 -1977 -1542 -206 4386
15590D386L623K687K801o994o653p741p584j568O533N695J064r23K661J275j531
$$ 4386 8009 10696 13497 6503 -150 -7891 -15475 -17043 -10510 -4815 -3751 -4674 -2013 -738 -2269
15575b269l174N67J160J14j19J640K63m567j641L70Q583N996k959j151K484K831
$$ -2269 -5443 -4876 -3716 -3602 -3721 -2081 -1818 -6385 -8026 -7656 927 6923 3964 2813 5297 8128
15559H128K234p63l129k413Q29k951m765R25J711j106J860n438o23m85O75R475
$$ 8128 10362 9599 6470 4057 4886 1935 -2830 -1905 -194 -1300 560 -4878 -5501 -5986 -5311 4164
15543D164J830n682p482j419J272Q097J0272J87l206K609k889q273k162l459K549
$$ 4164 5994 312 -7170 -8589 -7317 780 11052 11239 8033 10642 7753 -520 -2682 -6141 -3592
15528c592O229k799l750l800J207O765j804p02m541m518L794N714O6L036o842
$$ -3592 2637 -162 -3912 -7712 -6505 260 -1544 -2246 -6787 -11305 -7511 -1797 -1731 1305 -5537
15513e537l441q83k57L229J2116o776o105Q81l549n07O758r2r341K032M133j427
$$ -5537 -8978 -9861 -10118 -6889 5227 -1549 -7654 -6773 -10322 -10829 -4071 -4163 -13504 -11472 -7339 -8766
15497h766N193J041o226K154J0989Q689m475P24L961M41j2175r719m69P346R868
$$ -8766 -3573 -2532 -8758 -6604 4385 13074 8599 9323 13284 13725 1550 -8169 -8638 -1292 8576
15482H576p775o595P12j73o532j344K155P958k315J285N37j1462M028N041L068
$$ 8576 801 -5794 -5082 -5255 -11787 -13131 -10976 -3018 -5333 -4048 -3511 -14973 -10945 -5904 -2836
15467b836R269k972Q7M644K271K244j208o917K7l074r455n158K59K106j038J929
$$ -2836 6433 3461 3548 8192 10463 12707 11499 4582 4609 1535 -7920 -13078 -12819 -10713 -11751 -9822
15451i822j027J745l203m856q70O761Q249k972o103L410J153n6O241O166K682
$$ -9822 -10849 -9104 -12307 -17163 -18033 -11272 -3023 -5995 -12098 -8688 -7535 -7591 -1350 4816 7498
15436G498q491l366n58k732p29J070j180k000r90N616L390m237N41O997P615m56
$$ 7498 -993 -4359 -4917 -7649 -8378 -7308 -8488 -10488 -11478 -5862 -2472 -6709 -6168 829 8444 7988
15420G988l600J619j875n342j019P96N565Q27J354q445o409M056K456l38n444
$$ 7988 4388 6007 4132 -1210 -2229 -1433 4132 4959 6313 -2132 -8541 -4485 -2029 -2367 -7811
15405g811J379K380M500J3319q95p322K219P844j868M713M246o365j1819k299
$$ -7811 -6432 -4052 448 13767 12872 5550 7769 15613 13745 18458 22704 16339 4520 2221
15391B221k533n057J042J657M348K771N290l703m256L622N202l125q243L580P505
$$ 2221 -312 -5369 -4327 -2670 1678 4449 9739 6036 1780 5402 10604 7479 -764 2816 10321
15376A0321N745k242j5094o281j948L153J295J188m973l560M13M990J604K469
$$ 10321 16066 13824 -1270 -7551 -9499 -6346 -5051 -3863 -8836 -12396 -11983 -6993 -5389 -2920
15362b920M341k951o379r017K185J618Q432q28J214o083L807P742o062r277k905
$$ -2920 1421 -1530 -7909 -16926 -14741 -13123 -4691 -5519 -4305 -10388 -6581 1161 -4901 -14178 -17083
15347a7083K910P010P845j506J234L256r06J839k83k827K55l385m462l555J1514
$$ -17083 -14173 -7163 682 -824 410 3666 2760 4599 4316 1489 1744 -1641 -6103 -9658 1856
15332A856O156l010q17L479q63r541m485m648m737K394P83L104O445L231k647
$$ 1856 8012 5002 4185 7664 6801 -2740 -7225 -11873 -16610 -14216 -13433 -10329 -3884 -653 -3300
15317c300J028J375l668L218M354p256N02J819L039M153m652m28J928J713j047
$$ -3300 -2272 -897 -4565 -1347 3007 -4249 -3747 -1928 1111 5264 612 184 2112 3825 2778
15302B778K044p29o285o928q01J808k719M94Q17K014J855J130M271L375n715k696
$$ 2778 4822 4093 -2192 -9120 -9921 -8113 -10832 -10338 -9521 -7507 -5652 -4522 -251 3124 -2591 -5287
15286e287K145j959J717l615P716J589m207N6J477L390J84N786j0976o715q07
$$ -5287 -3142 -5101 -3384 -6999 717 2306 -1901 -1845 -368 3022 3206 8992 -1984 -8699 -9506
15271i506J556K024M798R15L917J061r401m581K303N919n292J329J983O83N210
$$ -9506 -7950 -5926 -1128 -213 3704 4765 -4636 -9217 -6914 -995 -6287 -4958 -2975 -2292 2918
15256B918M417o281n090M135N72K399n378l116l208p94N968L990P75K656l560
$$ 2918 7335 1054 -4036 99 671 3070 -2308 -5424 -8632 -9426 -3458 532 1307 3963 403
15241D03l216r30J015o321m37L894P747k878l36J709l183l957k921L634J0197
$$ 403 -2813 -3743 -2728 -9049 -9486 -5592 2155 -723 -1059 650 -2533 -6490 -9411 -5777 4420
15226D420J205j366q418l780k577j146N687N470K284k282j0735J082Q769l68p399
$$ 4420 5625 4259 -4159 -7939 -10516 -11662 -5975 -505 1779 -503 -11238 -10156 -1387 -1755 -9154
15211i154k030M51P813O177M72P358R02m254n464k77j644n070N39N18O452j561
$$ -9154 -11184 -10733 -2920 3257 3729 11087 11989 7735 2271 1994 350 -4720 -4181 -3663 2789 1228
15195A228q586p273J225J2133M298j057m019n403O72O854K209m259q662J118M312
$$ 1228 -7358 -14631 -13406 -1273 3025 1968 -2051 -7454 -6782 72 2281 -1978 -10640 -9522 -5210
15180e210K973q95L510L942j168J446m484n545j207L014P54m79k719m310L481
$$ -5210 -2237 -3132 378 4320 3152 4598 114 -5431 -6638 -3624 -2870 -3349 -6068 -10378 -6897
15165f897N352O604n358q585K271J0714l85k017O454K649o463p657m558N894J488
$$ -6897 -1545 5059 -299 -8884 -6613 4101 3716 1699 8153 10802 4339 -3318 -7876 -1982 -494
15150d94j553L054K576L84p200J255m29J093M91R60K843P05k680j250n96m980
$$ -494 -2047 1007 3583 3967 -3233 -1978 -2407 -1314 -823 137 2980 3685 1005 -245 -841 -5821
15134e821j060k75J263J381O94q20K803J893L782N682o060k125M46k516n224o065
$$ -5821 -6881 -7156 -5893 -4512 -3818 -4638 -1835 58 3840 9522 3462 1337 1783 -733 -5957 -12022
15118a2022M85M595P811L115l385q215R129P714k398n326m399o330N500M642Q54
$$ -12022 -11537 -6942 869 3984 599 -7616 1513 9227 6829 1503 -2896 -9226 -3726 916 1770
15103A770N40M70m73L96O169k194J277J660m277Q94J386R34M584l595r481j042
$$ 1770 2310 2780 2307 2703 8872 6678 7955 9615 5338 6232 7618 8552 13136 9541 60 -982
15087i82K357r70J317j47j973N468J140m073J790k91p481M446n99p004L030N524
$$ -982 1375 405 1722 1575 -398 5070 6210 2137 3927 3636 -3845 601 2 -7002 -3972 1552
15071A552k9L122K212j322o685q19R797L686j375j09l704l714m331r73P54N044
$$ 1552 1523 4645 6857 5535 -1150 -1969 7828 11514 10139 10030 6326 2612 -1719 -2692 -1938 3106
15055C106M704k050j0810N079N978k265K05K054n162j091O996J150p204Q411K155
$$ 3106 7810 5760 -5050 29 6007 3742 3947 6001 839 -252 6744 7894 690 9101 11256
15040A1256l509j290l034r407n061m484N730O847J833k302m98O120j884K269K936
$$ 11256 7747 6457 3423 -5984 -11045 -15529 -9799 -2952 -1119 -3421 -3919 2201 317 2586 5522
15025E522L311l612j305l51L035j294l727R87K712k107l808o582J469J4726J695
$$ 5522 8833 5221 3916 3565 6600 5306 1579 2566 5278 3171 -637 -7219 -5750 8976 10671
15010A0671m299L01L895q527N238R170m234k330L628j896L471M473J0292O329
$$ 10671 6372 6673 10568 2041 7279 16449 12215 9885 13513 11617 15088 19561 29853 36182
14996C6182R844R075J2606K1860K7970N0330Q9033J60810L07379M55523R7863
$$ 36182 46026 55101 67707 89567 117537 167867 256900 417710 725089 1180612 1278475
14985A278475m02946l33811j66381r7328o2138l8036k4101j7083k2462j1650p98
$$ 1278475 875529 541718 375337 278009 215871 177835 153734 136651 114189 102539 101741
14974A01741l357q439j4692j2253j3945j3078q688J330M026l234l71j526o766
$$ 101741 98384 89945 75253 63000 49055 35977 27289 28619 32645 29411 29040 27514 20748
14961B0748o106M130q149p86L87J063P785n89m174q59J102n372Q50m694J681Q876
$$ 20748 14642 18772 10623 9837 10224 11287 19072 18483 14309 13450 14552 9180 10030 5336 7017 15893
14945A5893j747m088J97q86k877k642l503L09J495o48J417J055j637j432L729
$$ 15893 14146 10058 10255 9369 6492 3850 347 656 2151 1503 2920 3975 2338 906 4635
14930D635P95R95l337k659K633l050L912K78L398P205L820r67k673k107m513o130
$$ 4635 5430 6425 3088 429 3062 12 3924 4202 7600 14805 18625 17658 14985 12878 8365 2235
14914B235n05K376N185M362l009q456l920L797q72o504j266R400k086k968j373
$$ 2235 1730 4106 9291 13653 10644 2188 -1732 2065 1193 -5311 -6577 2823 737 -2231 -3604
14899c604p018K624N330N191K619p416j857j529K654M743L690l917n1j213L589
$$ -3604 -10622 -7998 -2668 2523 5142 -2274 -4131 -5660 -3006 1737 5427 1510 1459 246 3835
14884C835j863n572k59K991L755m091j676R96K082K879N834j271n347p69L355
$$ 3835 1972 -3600 -3859 -868 2887 -1204 -2880 -1884 198 3077 8911 7640 2293 1524 4879
14869D879L176l237N61l145j936j068k711m337k698K89l069K348L445p98l83J874
$$ 4879 8055 4818 5379 2234 298 -770 -3481 -7818 -10516 -10227 -13296 -10948 -7503 -8301 -8684 -6810
14853f810M572o32J0033p44o440l330L656j147L574L410j698J335j351k543j750
$$ -6810 -2238 -2870 7163 6419 -21 -3351 305 -842 2732 6142 4444 5779 4428 1885 135
14838A35m19p258O093M746J435M4J619M540M539N14r609j448J165m310n256J277
$$ 135 -284 -7542 -1449 3297 4732 4776 6395 10935 15474 15988 6379 4931 6096 1786 -3470 -2193
14822b193M407r58L192L182N155m298m848k901J732q01n684M406L749m632m950
$$ -2193 2214 1256 4448 7630 12785 8487 3639 738 2470 1669 -4015 391 4140 -492 -5442
14807e442K164O563J70p30l004j619j937K725N04K594l67L131m705o793r62j756
$$ -5442 -3278 3285 3455 2725 -279 -1898 -3835 -1110 -606 1988 1621 4752 47 -6746 -7708 -9464
14791i464j648n04L759L015k318J323L752m490o029j504O659J490j149P432Q322
$$ -9464 -11112 -11616 -7857 -4842 -7160 -5837 -2085 -6575 -12604 -14108 -7449 -5959 -7108 324 8646
14776H646k459m723J534l164l074J151N758j788n965Q439N410m61R7J460O837
$$ 8646 6187 1464 2998 -166 -3240 -2089 3669 1881 -4084 4355 9765 9304 9401 10861 17698
14761A7698q22r555k396L187j1053j726N946L838K395p622o471j332K662q19J907
$$ 17698 16876 7321 4925 8112 -2941 -4667 1279 5117 7512 -110 -6581 -7913 -5251 -6070 -4163
14746d163P198N822O261o356n602K791R436K101r89m780o296k603M856m97j512
$$ -4163 3035 8857 15118 8762 3160 5951 15387 17488 16499 11719 5423 2820 7676 7179 5667
14731E667O24J69K590m247k360j449k96N155J715J547L463K097j621l757K947
$$ 5667 6291 6460 9050 4803 2443 994 698 5853 7568 9115 12578 14675 13054 9297 12244
14716A2244K488r768q109Q43N002m94j740p89K85O33j955M135N319L029K256l513
$$ 12244 14732 4964 -3145 -2302 2700 2206 466 -323 -38 595 -1360 2775 8094 11123 13379 9866
14700I866p200n973K06Q44N98j6n441J916P265J0710L577n315k863r149j558K455
$$ 9866 2666 -3307 -3101 -2257 -1659 -1675 -7116 -5200 2065 12775 16352 11037 8174 -975 -2533 -78
14684g8M543K988N092k200l079L693o011O90K394J332o01j264m745n89R42k80
$$ -78 4465 7453 12545 10345 7266 10959 4948 5638 8032 9364 8763 7499 2754 2165 3107 2827
14668B827r59J750m48k683Q78o201K767J0275k983k155L755J687n932k774P85
$$ 2827 1868 3618 3170 487 1365 -4836 -2069 8206 5223 3068 6823 8510 2578 -196 589
14653E89N430J997L189m60m247K364k675K858M546l030l441j536M358L871k623
$$ 589 6019 8016 11205 10745 6498 8862 6187 9045 13591 10561 7120 5584 9942 13813 11190
14638A1190m009o215K732J881K894M776o700n86L101o048j516Q13m831o03K065
$$ 11190 7181 966 3698 5579 8473 13249 6549 5963 9064 3016 1500 2313 -2518 -3121 -1056
14623a056J715k295J690P48j155K646k202l840l45N719l497N686P478K301L773
$$ -1056 659 -1636 54 802 -353 2293 91 -3749 -4094 1625 -1872 3814 11292 13593 17366
14608A7366n439J936Q565O397m376p38j834m933N31k682r717o2m060l743J41M321
$$ 17366 11927 13863 22428 28825 24449 23711 21877 16944 17475 14793 5076 5014 954 -2789 -2648 1673
14592A673P107K251L317l15j0845r678J074P030P361m818r373K774R309J320r505
$$ 1673 8780 11031 14348 14033 3188 -6490 -5416 1614 8975 4157 -5216 -2442 6867 8187 -1318
14577a318l033l7J844n05J752k414m097J193J473N49R636q9m779J48o75N427J910
$$ -1318 -4351 -4388 -2544 -3049 -1297 -3711 -7808 -6615 -5142 -4593 5043 4954 175 323 -352 5075 6985
14560F985o688r913K360L334J836n517l074J55k190O683k81K41o35k822Q51J1901
$$ 6985 297 -9616 -7256 -3922 -2086 -7603 -10677 -10522 -12712 -6029 -6310 -6069 -6704 -9526 -8675 3226
14544C226Q027l440m114k579n237p781R42l228N792M988N644M891K306L73j335
$$ 3226 11253 7813 3699 1120 -4117 -11898 -10956 -14184 -8392 -3404 2240 7131 9437 9810 8475
14529H475O89j887l762j650j773N883O152o497p845l422L698J829L912p41K479
$$ 8475 9164 7277 3515 1865 92 5975 12127 5630 -2215 -5637 -1939 -110 3802 3061 5540
14514E540J066k225m211j180j723J743Q512L339n295l266J24L356N734l240j981
$$ 5540 6606 4381 170 -1010 -2733 -990 7522 10861 5566 2300 2424 5780 11514 8274 6293
14499F293J472l812r470m148K74M628r66J988P158J116k928k273J207L912R09
$$ 6293 7765 3953 -5517 -9665 -9391 -4763 -5729 -3741 3417 4533 1605 -668 539 4451 5360
14484E360m155L6L974m310l462J634K877P44K705L297k0n427m356O837J947l888
$$ 5360 1205 1241 5215 905 -2557 -923 1954 2698 5403 8700 8680 3253 -1103 5734 7681 3793
14468C793k982n784N573R607N92k155l221m304q340n382M068Q396O631j468j751
$$ 3793 811 -4973 600 10207 10799 8644 5423 1119 -7221 -12603 -8535 -139 6492 5024 3273
14453C273n957k424M418J600n74m680m070L306M286Q22M001K85k950M360k779
$$ 3273 -2684 -5108 -690 910 336 -4344 -8414 -5108 -822 0 4001 4286 1336 5696 2917
14438B917M582j647q98J671l215O279O44l297o308n658M827N814L841n620o718
$$ 2917 7499 5852 4954 6625 3410 9689 10333 7036 728 -4930 -103 5711 9552 3932 -2786
14423b786Q98J781J347o5o937l710R587Q753J319p451o451j7J0739N293J544J020
$$ -2786 -1888 -107 1240 1175 -5762 -9472 115 8868 10187 2736 -3715 -3732 7007 12300 13844 14864
14407A4864p010J211k497o279j279k442R69M800n626j781K777P463K925l35j176
$$ 14864 7854 9065 6568 289 -990 -3432 -2463 2337 -3289 -5070 -2293 5170 8095 7760 6584
14392F584k634M24l33O31O527P059N18n782n177P09J1503j193p346n177k332J751
$$ 6584 3950 4374 4041 4672 11199 18258 18776 12994 7817 8526 20029 18836 11490 6313 3981 5732
14376E732q424J330N277J036n98K326o562K335P420N499j313p617L027K002p708
$$ 5732 -2692 -1362 3915 4951 4353 6679 117 2452 9872 15371 14058 6441 9468 11470 3762
14361C762n33n789m81J0685J1458j087q585j230J913K419j083L969m485o04J135
$$ 3762 3229 -2560 -3041 7644 19102 18015 9430 8200 10113 12532 11449 15418 10933 10329 11464
14346A1464l150q188m375J212L483L638k902Q26K628O213k844m976m540j748N520
$$ 11464 8314 126 -4249 -3037 446 4084 1182 2008 4636 10849 8005 3029 -1511 -3259 2261
14331B261P847k769j586k511l562l077P516K371J765K88n012j1246O210O550L213
$$ 2261 10108 7339 5753 3242 -320 -3397 4119 6490 8255 8543 3531 -7715 -1505 5045 8258
14316H258K341l841r95j36k153k252L108M490M734o351n393j253k991k539n802
$$ 8258 10599 6758 5763 5627 3474 1222 4330 8820 13554 7203 1810 557 -2434 -4973 -10775
14301a0775O786O939l173m441M83N290O967M9n085n478l4j244M180M884m825k285
$$ -10775 -3989 2950 -223 -4664 -4181 1109 8076 8125 3040 -2438 -2472 -3716 464 5348 523 -1762
14285a762k583l477M862N272L799n339r017N496P682J653r226n603J275l836P141
$$ -1762 -4345 -7822 -2960 2312 6111 772 -8245 -2749 4933 6586 -2640 -8243 -6968 -10804 -3663
14270c663R15m655M541K739l34J817L920o2j997K400N79j239n979L87q16j328
$$ -3663 -2748 -7403 -2862 -123 -457 1360 5280 5218 3221 5621 6200 4961 -1018 -631 -1447 -2775
14254b775P361p423k616j523Q999O433n053k022L473Q22N94l220R68k744j433
$$ -2775 4586 -2837 -5453 -6976 2023 8456 3403 1381 4854 5676 6270 3050 4018 1274 -159
14239a59m471K906P117P881P466o962p030n372P37J645O626l013k501J249L238
$$ -159 -4630 -1724 5393 13274 20740 13778 6748 1376 2113 3758 10384 7371 4870 6119 9357
14224I357R101K304k933n449n536l910k37m333l538J669L500R931P080M432n389
$$ 9357 18458 20762 17829 12380 6844 2934 2697 -1636 -5174 -3505 -5 9926 17006 21438 16049
14209A6049j1006l210O954l447L687j204M23L448j960l875J761N80n641l532O425
$$ 16049 5043 1833 8787 5340 9027 7823 8246 11694 9734 5859 7620 8200 2559 -973 5452
14194E452N749N135m771j0005j353k57R79N178J114r516j263K957J627l447q0
$$ 5452 11201 16336 11565 1560 207 -50 929 6107 7221 -2295 -3558 -601 1026 -2421 -2501
14179b501Q282m8J681M781N94l430j4096l543L34M433K069j395L520O000j609
$$ -2501 5781 5733 7414 12195 12789 9359 -4737 -8280 -7946 -3513 -1444 -2839 681 6681 5072
14164E072j437k965J369K008K098j264M070L76K367J207l929k701J860J979l373
$$ 5072 3635 670 2039 4047 6145 4881 8951 9327 11694 12901 8972 6271 8131 10110 6737
14149F737l551k498k617l10J4546L751q082J383L097J912n709P06K393n582q835
$$ 6737 3186 688 -1929 -2239 12307 16058 7976 9359 12456 14368 8659 9365 11758 6176 -2659
14134b659o37N9j943J469j279K296j093M514M166j045K271j941m412p189M409
$$ -2659 -3296 -3237 -5180 -3711 -4990 -2694 -3787 727 4893 3848 6119 4178 -234 -7423 -3014
14119c014n026R99O070n052n641K152Q900m408L511j670r231P34L939L210P99
$$ -3014 -8040 -7041 -971 -6023 -11664 -9512 -612 -5020 -1509 -3179 -12410 -11676 -7737 -4527 -3728
14104c728k059o109M247J886o853j763P989M693O456J387L07L488o345m748O9
$$ -3728 -5787 -11896 -7649 -5763 -12616 -14379 -6390 -1697 4759 6146 6453 9941 3596 -1152 -1083
14089a083L338J297L975k213n83j613p87J275N02M415Q754k416n523k667N032
$$ -1083 2255 3552 7527 5314 4731 3118 2331 3606 4108 8523 17277 14861 9338 6671 11703
14074A1703K569n286n25J095M415l601n12J807o985n906j693N99M444P408j454
$$ 11703 14272 8986 8461 9556 13971 10370 9858 11665 4680 -1226 -2919 -2320 2124 9532 8078
14059H078n119K041k182k379l488q669j187J3530M151N08M559r57n423l920j781
$$ 8078 2959 5000 2818 439 -3049 -11718 -12905 625 4776 5284 9843 8886 3463 -457 -2238
14044b238k652K847O792l689n83M716L376N210n431q513L182J415k193K967l914
$$ -2238 -4890 -2043 4749 1060 477 5193 8569 13779 8348 -165 3017 4432 2239 5206 1292
14029A292M121J330l499k545M229On800J985l092M153J288k041L616J3433L81
$$ 1292 5413 6743 3244 699 4928 4934 -866 1119 -1973 2180 3468 1427 5043 18476 18857
14014A8857j1974r044O737N852k441m295j335o910l826R902N995l377m672J844
$$ 18857 6883 -2161 4576 10428 7987 3692 2357 -4553 -8379 1523 7518 4141 -531 1313
14000A313K735K737L166j014j971l807j960l307q640M34M666Q336N316j827n689
$$ 1313 4048 6785 9951 8937 6966 3159 1199 -2108 -10748 -10314 -5648 2688 8004 6177 488
13985D88J057M200N089P053k174j837J620J16J756j05l022J995m239m598k346
$$ 488 1545 5745 10834 17887 15713 13876 15496 15612 17368 17263 14241 16236 11997 7399 5053
13970E053k430M118J6j0153o407k859K245J291L941R731J621J05l422l007J311
$$ 5053 2623 6741 6757 -3396 -9803 -12662 -10417 -9126 -5185 4546 6167 6272 2850 -157 1154
13955A154O91k160J241M576r67j195k169J783k754M658M370K72j389P445M07k985
$$ 1154 1845 -315 926 5502 4535 3340 1171 2954 200 4858 9228 9500 8111 15556 15963 12978
13939A2978J821l919l123m563l412j260K883j31R11J790r915q69P544J733O2J381
$$ 12978 14799 10880 7757 3194 -218 -1478 1405 1274 2185 3975 -5940 -6809 735 2468 2530 3911
13923C911j308m168J44p4j080M647m98n109k521L418O787L509q505K156l73K465
$$ 3911 2603 -1565 -1421 -1495 -2575 2072 1574 -3535 -6056 -2638 4149 7658 -847 1309 936 3401
13907C401j030J525L090N006o201l854r68K010N116N923O94n266p867J435M269
$$ 3401 2371 3896 6986 11992 5791 1937 969 2979 8095 14018 14712 9446 1579 3014 7283
13892G283r05l064Q29o463K24l18N576j377j468M255l889k715k640J636M169J832
$$ 7283 6378 3314 4143 -2320 -2096 -2414 3162 1785 317 4572 683 -2032 -4672 -3036 1133 2965
13876B965l95p025l316M603J0062P158K818n915p592j495P447L733m812p390k403
$$ 2965 2570 -4455 -7771 -3168 6894 14052 16870 10955 3363 1868 9315 13048 8236 846 -1557
13861a557L786N531K668O836k676p213r90j56L272J534p203q011K690J989M286
$$ -1557 2229 7760 10428 17264 14588 7375 6385 6229 9501 11035 3832 -4179 -1489 500 4786
13846D786r68K104O923L003j474n034p247p01o502N378L585k586k061P125L645
$$ 4786 3818 5922 12845 15848 14374 9340 2093 1392 -5110 268 3853 1267 -794 6331 9976
13831I976k597L746J1170K605n598k024K679o806l151k608J584j14Q000k361j590
$$ 9976 7379 11125 22295 24900 19302 17278 19957 13151 10000 7392 8976 8862 16862 14501 12911
13816A2911p9k712m568j514O8l303O228N547K159k39M42m652j0040o829R9K866
$$ 12911 12832 10120 5552 4038 4106 803 7031 12578 14737 14498 14940 10288 248 -6581 -6482 -3616
13800c616N076N624N098k685n168K043j458j750J676m390o06o038M240N081J488
$$ -3616 1460 7084 12182 9497 4329 6372 4914 3164 4840 450 -156 -6194 -1954 3127 4615
13785D615Q754K613K486K107l962j197M243k307o367m671K316K811P974K837q859
$$ 4615 13369 15982 18468 20575 16613 15416 19659 17352 10985 6314 8630 11441 19415 22252 13393
13770A3393m975L996m24j265o067m746j85k373k805R57R382N532K958k738j38
$$ 13393 8418 12414 11990 10725 4658 -88 -273 -2646 -5451 -4494 4888 10420 13378 10640 10502
13755A0502n292l246L123N143K448K451l91m296n240P688R63m315P26n570j730
$$ 10502 5210 1964 5087 10230 12678 15129 14738 10442 5202 12890 13853 9538 10264 4694 2964
13740B964k595o66Q50J12K585Q31O357M290l595m991P01l723l979j071J0115K782
$$ 2964 369 -297 553 665 3250 4081 10438 14728 11133 6142 6843 3120 -859 -1930 8185 10967
13724A0967j63o943N782R440K393p921n215j882o438k994L161K863j217n65j77
$$ 10967 10804 3861 9643 19083 21476 13555 8340 6458 20 -2974 187 3050 1833 1268 1091
13709A091N919J888m329N569M437J369j920P716o39n654J01J515K37K243K214
$$ 1091 7010 8898 4569 10138 14575 15944 14024 21740 21101 15447 15548 17063 17300 19543 21757
13694B1757n904M328Q78n526p615l080J187M012L347j781l874J047R74J077j39
$$ 21757 15853 20181 21059 15533 7918 4838 6025 10037 13384 11603 7729 8776 9750 10827 10688
13679A0688J089K554R77l264n109m077j766R708N315k173l119j281O643L192k675
$$ 10688 11777 14331 15308 12044 6935 2858 1092 10800 16115 13942 10823 9542 16185 19377 16702
13664A6702o826n771J254O358K42l122j543M59N525N95M215n279k557K164N799
$$ 16702 9876 4105 5359 11717 11959 8837 7294 7753 13278 13873 18088 12809 10252 12416 18215
13649A8215n88L335J0377j536j713m498k064M221O429J647R12m911o717r146q44
$$ 18215 17627 20962 31339 29803 28090 23592 21528 25749 32178 33825 34737 29826 23109 13963 13119
13634A3119M568J0999N557l178r287n646j881N386l653K88M358M146M942k946
$$ 13119 17687 28686 34243 31065 21778 16132 14251 19637 15984 16272 20630 24776 29718 26772
13620B6772q70p118o635J752P289M987n615M840P56l457l105K79j40K065l011
$$ 26772 25902 18784 12149 13901 21190 26177 20562 25402 26158 22701 19596 19875 19735 21800 18789
13605A8789k380k166L247l870N27P338j689R47O187n39n710k3L071L939n86m317
$$ 18789 16409 14243 17490 13620 14147 21485 19796 20743 26930 26391 20681 20658 23729 27668 27082 22765
13589B2765n821m750J73K726J853O992K899j631J323l284Q43M454N62K34j023
$$ 22765 16944 12194 12367 15093 16946 23938 26837 25206 26529 23245 24088 28542 29104 29338 28315
13574B8315k19j104l307P56l871N24Q072M727j399O898m249J514k825m625k121
$$ 28315 28096 26992 23685 24441 20570 21094 29166 33893 32494 39392 35143 36657 33832 29207 27086
13559B7086N148L093j574n372r074O134Q96k851M631L065o59m490j560J703N088
$$ 27086 32234 35327 33753 28381 19307 25441 26337 23486 28117 31182 30523 26033 24473 26176 31264
13544C1264P63L690o887m783K25L422l67m73J048k779o744l02K440L29k094m977
$$ 31264 32027 35717 28830 24047 24272 27694 27327 26854 27902 25123 18379 18077 20517 20846 18752 13775
13528A3775n739P97M015J082O910L431m772p108k614J25O022M870j93n37K600
$$ 13775 8036 8833 12848 13930 20840 24271 19499 12391 9777 9902 15924 20794 20601 20064 22664
13513B2664N01l992J030R0L43m619R9N696J371l983J517O766O626K952n464o660
$$ 22664 23165 19173 20203 20293 20636 16017 16116 21812 23183 19200 20717 27483 34109 37061 31597 24937
13497B4937L254N032J173M527k958j1467m162K227P159K407J369l190j705J75
$$ 24937 28191 33223 34396 38923 35965 24498 20336 22563 29722 32129 33498 30308 28603 28778
13483B8778J097o3Q53N045K645o180o417n36j771k007J247k089n07r87P13r55
$$ 28778 29875 29812 30665 35710 38355 32175 25758 25222 23451 21444 22691 20602 20095 19108 19821 18866
13467A8866j569O686L276N343r45n284p65M710m659m776l517o044m750P946L037
$$ 18866 17297 23983 27259 32602 31657 26373 25608 30318 25659 20883 17366 11322 6572 14518 17555
13452A7555n071Q28O823L849N582L215p117l820N244p255l530L691Q31L242P856
$$ 17555 12484 13312 20135 23984 29566 32781 25664 21844 27088 19833 16303 19994 20825 24067 31923
13437C1923J368n317m423l442q940K868N745k564N088M615R18n409q948j254k757
$$ 31923 33291 27974 23551 20109 11169 14037 19782 17218 22306 26921 27839 22430 13482 12228 9471
13422I471K433m339M20M684L828M645q63j0428k334L376J621P510M727l00q49
$$ 9471 11904 7565 7985 12669 16497 21142 20279 9851 7517 10893 12514 20024 24751 24451 23602
13407B3602q51k050K242m379M299L124J179k868l900k446J207J171k595k977N149
$$ 23602 22751 20701 22943 18564 22863 25987 27166 24298 20398 17952 19159 20330 17735 14758 19907
13392A9907J0197J267k602L927J245m395L166p38q707l560j73L410k02k234J5223
$$ 19907 30104 31371 28769 32696 33941 29546 32712 31974 23267 19707 19534 22944 22742 20508 35731
13377C5731M405r328j0679m558L417K315N915J226o207O46L148o472J422m06R69
$$ 35731 40136 30808 20129 15571 18988 21303 27218 28444 22237 22883 26031 19559 20981 20575 21544
13362B1544Q910o076o03Q74J234j216l013l592P952Q855l424r916Q30j290m706
$$ 21544 30454 24378 23775 24649 25883 24667 21654 18062 26014 34869 31445 21529 22359 21069 16363
13347A6363L729R472k70k772m689o21q63N707j368l909O577M740k42P243o530
$$ 16363 20092 29564 29294 26522 21833 21212 20349 26056 24688 20779 27356 32096 31854 39097 32567
13332C2567k905L3q144k987O131K916p467k088M718q14o398k09J301P846K948
$$ 32567 29662 29695 21551 18564 24695 27611 20144 18056 22774 21960 15562 15353 16654 24500 27448
13317B7448K37J219P218o577m528m401L243L321J711n129m121J5001P356m182
$$ 27448 27685 28904 36122 29545 25017 20616 23859 27180 28891 23762 19641 34642 41998 37816
13303C7816m595J33M327J80O285P628L67J756m687m058j440n248K183O61k43K411
$$ 37816 33221 33354 37681 37861 44146 51774 52141 53897 49210 45152 43712 38464 40647 41308 41065 43476
13287D3476k278j445n229j0133J319M094l70J024k409j013L173K590J272n509
$$ 43476 41198 39753 34524 24391 25710 29804 29434 30458 28049 27036 30209 32799 34071 28562
13273B8562k840M645k757K359m14m711k04L685j873m050O780Q299Q713L165J849
$$ 28562 25722 30367 27610 29969 29555 24844 24640 28325 26452 22402 29182 37481 46194 49359 51208
13258E1208j773O381J631k556J456l843m792m049n01j023L748J027l671j685n60
$$ 51208 49435 55816 57447 54891 56347 52504 47712 43663 43162 42139 45887 46914 43243 41558 40998
13243D0998l527P709J4726M930n73j533l125o504N504M763l223m19P941Q666k05
$$ 40998 37471 45180 59906 64836 64263 62730 59605 53101 58605 63368 60145 59726 67667 76333 76128
13228G6128n059Q373P248O092O854N96J64J419M30L990R493N610J3830J1384K3734
$$ 76128 71069 79442 86690 92782 99636 100232 100396 101815 102245 106235 115728 121338 135168 146552 170286
13213A70286L6797M6889O8243J16348J99519L47204M80668K59284k91046m32478
$$ 170286 207083 253972 322215 438563 638082 985286 1465954 1725238 1434192 1001714
13203A001714k90934j61621r5252o5920n6379m9890k9771j9375j1755j6702j8812
$$ 1001714 710780 549159 453907 387987 331608 281718 251947 232572 220817 204115 185303
13192A85303k0512j7173j2709j4410j554l59o530l245r923r395o698R35o340j267
$$ 185303 164791 147618 134909 120499 118945 118586 112056 108811 98888 89493 82795 83730 77390 76123
13178G6123M841j402m015n049m349k811o065k801R052Q322P50o948k229j984k596
$$ 76123 80964 79562 75547 70498 66149 63338 57273 54472 63524 71846 72596 65648 63419 61435 58839
13163E8839J678N32m861k678k673o470J60m624N040N682L215p691q846K055J1665
$$ 58839 60517 61049 56188 53510 50837 44367 44527 39903 44943 50625 53840 46149 37303 39358 51023
13148E1023J1562k009j1382N542J634j0670j5318q982O415O735O452l131J7K00
$$ 51023 62585 60576 49194 54736 56370 45700 30382 21400 27815 34550 41002 37871 37888 38088
13134C8088k648P740j27m775M341J920L491P685Q819M706M930K61j1768q537n461
$$ 38088 35440 43180 43053 38278 42619 44539 48030 55715 64534 69240 74170 74431 62663 54126 48665
13119D8665j79j680o24r88l64k074O807N565l771J12l456j321J323M116O970L957
$$ 48665 48486 46806 46182 45194 44830 42756 49563 55128 51357 51469 48013 46692 48015 52131 59101 63058
13103F3058O138J034o957l195m739J00R337l851o880n084j08Q257N113K802M01
$$ 63058 69196 70230 63273 60078 55339 55439 64776 60925 54045 48961 48853 57110 62223 65025 65426
13088F5426m693J250k682J175M029O916k621k034m306j923N911J7303K3547K8282
$$ 65426 60733 61983 59301 60476 64505 71421 68800 66766 62460 60537 66448 83751 107298 135580
13074A35580L2859l167j7012r216j1140p941j1698j4416j0448m416n358l353L407
$$ 135580 168439 165272 148260 139044 127904 119963 108265 93849 83401 78985 73627 70274 73681
13061G3681L485l307j7316o731n178l892K078J575o794J351J930N145k77M508
$$ 73681 77166 73859 56543 49812 44634 40742 42820 44395 37601 38952 40882 46027 45750 50258
13047E0258j926q331n93P384R208J3304J261J705l648o561k454r28j809O091R425
$$ 50258 48332 40001 39408 46792 56000 69304 70565 72270 68622 62061 59607 58679 56870 62961 72386
13032G2386j500O99O815q86J85J9706K8589L0113K4964K2639L2842L6210L5433
$$ 72386 70886 71585 78400 77514 77699 97405 125994 156107 181071 203710 236552 272762 308195
13019C08195P939k5514m5608o3493k8751j2878j7276j0088j0482l035r654j008
$$ 308195 316134 290620 245012 181519 152768 139890 122614 112526 102044 99009 89355 88347
13007H8347l087k166n208K63R203O181j897k346l272o878q105l392l592o981k24
$$ 88347 85260 83094 77886 78149 87352 93533 91636 89290 86018 79140 71035 67643 64051 57070 56846
12992E6846M694M350m942m259m89M332J0970L49L310J2312R985L820N513O730
$$ 56846 61540 65890 60948 56689 56200 60532 71502 71851 75161 87473 97458 101278 106791 113521
12978A13521J081M493j91j800j1922M133J0712j2049k8281k7694k8573k1448L895
$$ 113521 114602 119095 118904 117104 105182 109315 120027 107978 79697 52003 23430 1982 5877
12965E877K5609K9867K2388K3324Q480J587R351K866j7464k0225j4384J0057J9831
$$ 5877 31486 61353 83741 107065 115545 117132 126483 129349 111885 91660 77276 87333 107164
12952A07164J3759o385j0656k197P77K985P782Q458J6719J5799J9623J2689K5218
$$ 107164 120923 114538 103882 101685 102462 105447 113229 121687 138406 154205 173828 186517 211735
12939B11735K6062L4511N0554M6154J3972j112k4938m3551m5488k5257j0279j3051
$$ 211735 237797 272308 322862 369016 382988 381876 356938 313387 267899 242642 232363 219312
12927B19312n179l800o150j6910k5533j7260j7593j1805J0061K1480J4799K1014
$$ 219312 214133 210333 204183 187273 161740 144480 126887 115082 125143 146623 161422 182436
12915A82436J8376J1235L251j1133j4297p482q132q598l173j703m261N407L990
$$ 182436 200812 212047 215298 204165 189868 182386 174254 165656 162483 160780 156519 161926 165916
12902A65916M500P482N073J1508M484j163J6357L5343P5417J10035K3117n3812
$$ 165916 170416 177898 182971 194479 198963 197800 214157 249500 324917 434952 458069 404257
12890D04257n9453l6865r609J5728L9452K3601K1717R751N329K2153J3547k29
$$ 404257 344804 307939 298330 314058 353510 377111 398828 408579 413908 436061 449608 449379
12878D49379p676j6869q422L185P149K3574L0849K9745K8050K9729M7333P2985
$$ 449379 441703 424834 416412 419597 426746 450320 481169 510914 538964 568693 616026 689011
12866F89011J10159J83001K85815L52501L33662L99975N57722P91820O87876J66770
$$ 689011 799170 982171 1267986 1620487 1954149 2354124 2911846 3703666 4391542 4558312
12856D558312k70056q42856q71150n70812l44561k07859j44999j14255r8620q0742
$$ 4558312 4288256 3445400 2574250 2003438 1658877 1451018 1306019 1191764 1093144 1012402
12846A012402n7043m8302l7996l4160m1243m4713l8246k0838j7512k4904j6033
$$ 1012402 955359 907057 869061 834901 793658 748945 710699 689861 672349 647445 631412
12835F31412j4832k3660j9040j6890m783j434M82J5637J3548J6274J5709J7611
$$ 631412 616580 592920 573880 556990 552207 550773 551255 566892 580440 596714 612423 630034
12823F30034K3110K2725Q027M051K2547K6116J5020N794J8392K9302K3481R594
$$ 630034 653144 675869 683896 687947 710494 736610 751630 757424 775816 805118 828599 838193
12811H38193J0727J6905J6304K7301M3803M9992M5211M1904N3369P6945R9245
$$ 838193 848920 865825 882129 909430 953233 1003225 1048436 1090340 1143709 1220654 1319899
12800A319899R3988Q0621O9402N9251O0676O9637R1106J19174J62950K20789K39785
$$ 1319899 1413887 1494508 1563910 1623161 1683837 1753474 1844580 1963754 2126704 2347493 2587278
12789B587278K25691K47955K71524L02991L78445M53735N22109O00265P22008
$$ 2587278 2812969 3060924 3332448 3635439 4013884 4467619 4989728 5589993 6312001
12780F312001R42311J227162J611067K123970K802337L869657N581101P714869
$$ 6312001 7254312 8481474 10092541 12216511 15018848 18888505 24469606 32184475
12772C2184475J0405097J5808013K6620461M6381464P6327193Q8458539J2105076
$$ 32184475 42589572 58397585 85018046 131399510 207726703 296185242 308290318
12765C08290318p5320584p4828431m6980868k7487717j6463998j0481373p767942
$$ 308290318 232969734 158141303 111160435 83672718 67208720 56727347 48959405
12758D8959405o311133m665642l214439k601834k984520l396381l260295k875219
$$ 48959405 42648272 37982630 34768191 32166357 29181837 25785456 22525161 19649942
12750A9649942k457544k061206j730314j494863j295683j103448r48548q34535
$$ 19649942 17192398 15131192 13400878 11906015 10610332 9506884 8558336 7723801
12742G723801p15114n90515n35637n03562m64464m24796l94032l49862l08724
$$ 7723801 7008687 6418172 5882535 5378973 4914509 4489713 4095681 3745819 3437095
12733C437095k69880k22387j91514j89680j87172j85171j49768j21297j20914
$$ 3437095 3167215 2944828 2753314 2563634 2376462 2191291 2041523 1920226 1799312
12724A799312j26388j20864j13488j01425q1698n8538m9646m9549q0612r4648
$$ 1799312 1672924 1552060 1438572 1337147 1255449 1196911 1147265 1097716 1017104 922456
12714I22456p5181p7634p5611o8600n7889m0607k6670k3022j9090j7281j6031
$$ 922456 847275 769641 694030 625430 567541 526934 500264 477242 458152 440871 424840
12703D24840r456j9146l8488m1669j4852j0090j4925r313p785K306O397j036j0047
$$ 424840 415384 396238 357750 316081 301229 291139 276214 266901 259116 261422 267819 266783 256736
12690B56736p276o728j660k712r70j3578j8380j8365j2437P64K183j1951q452
$$ 256736 249460 242732 241072 238360 237390 223812 205432 187067 174630 175394 177577 165626 157174
12677A57174j257j944j839o741q217j9354k0299q871n72O262O676K163l154m334
$$ 157174 155917 153973 152134 145393 137176 117822 97523 88652 88080 94342 101018 103181 100027 95693
12663I5693j1704m738R015K1549J0447m984j7421j0930j0576m68n53J603N739
$$ 95693 83989 79251 88266 109815 120262 115278 97857 86927 76351 75883 75330 76933 82672
12650H2672J60Q034K5178J4874J6438K7417M2501L9608o773j3807r260k968N59
$$ 82672 82832 90866 116044 130918 147356 174773 217274 256882 250109 236302 227042 224074 224633
12637B24633j3950k3072k7090k1354o764O96P6m660m422J0834Q79l609m003q97
$$ 224633 210683 187611 160521 139167 132403 133099 133175 128515 124093 134927 135806 132197 128194 127297
12623A27297O173Q289J074m605n244m098L965J5315J2441J9573R014k3270l4107
$$ 127297 133470 141759 142833 138228 132984 128886 132851 148166 160607 180180 189194 165924 131817
12610A31817k2934j2268m846n553n039p366j311n379n676J40n400p252l313j2680
$$ 131817 108883 96615 91769 86216 81177 73811 72500 67121 61445 61585 56185 48933 45620 32940
12596C2940n510k359k689l435o35r109K613N946J0058J2797J54o79l018o840p930
$$ 32940 27430 25071 22382 18947 18312 9203 11816 17762 27820 40617 40771 40092 37074 30234 22304
12581B2304l026R19J3300N747j3416j5692j1813j2387j152L231R13J3902K3517
$$ 22304 19278 20197 33497 39244 25828 10136 -1677 -14064 -15216 -11985 -11072 2830 26347
12568B6347K8132L0751J8285p861k3522l1979j9097m640P684k189j7275j8434
$$ 26347 54479 85230 103515 95654 72132 40153 21056 16416 24100 21911 4636 -13798
12556a3798n728O367O103l335L716L38P362O792J1022J5984K869m676J425k491
$$ -13798 -19526 -13159 -7056 -10391 -6675 -6337 1025 7817 18839 34823 37692 33016 34441 31950
12542C1950l895j37N303j795o182q486j753j729K839N305m434o000N120Q400m478
$$ 31950 28055 27918 33221 31426 25244 16758 15005 13276 16115 21420 16986 10986 16106 24506 20028
12527B0028j970N719k88n678l043K283p328k01N753J0245P695P94N367P904J268
$$ 20028 18058 23777 23489 17811 14768 17051 9723 9522 15275 25520 33215 34009 39376 47280 48548
12512D8548j3330k279n73l814k501l140O915K935n186Q01k545k074n596k492N231
$$ 48548 35218 32939 32366 28552 26051 22911 29826 32761 27575 28376 25831 23757 18161 15669 20900
12497B0900Q557Q40r92K353N846N059J674P360J1510R356K6955M1788P0283R4381
$$ 20900 29457 30297 29305 31658 37504 42563 44237 51597 63107 72463 99418 141206 211489 305870
12483C05870L6788p2979q3124n0346l3932j4072l680m986p942p322p293n139j1001
$$ 305870 342658 269679 186555 136209 102277 88205 84525 79539 71597 64275 56982 51843 40842
12470D0842p395q548n726j2253j5145q311m774q087j7395j7277k3723j5307K4259
$$ 40842 33447 24899 19173 6920 -8225 -16536 -21310 -29397 -46792 -64069 -87792 -103099 -78840
12457g8840L2089K4600Q224p518j464M656J623j855N347Q000k498J924L880o993
$$ -78840 -46751 -22151 -13927 -21445 -22909 -18253 -16630 -18485 -13138 -5138 -7636 -5712 -1832 -8825
12443h825n954O677k45n562l269K996R080P030P739J820K365K421J304l594n046
$$ -8825 -14779 -8102 -8347 -13909 -17178 -14182 -5102 1928 9667 11487 13852 16273 17577 13983 8937
12428H937r82j073P353K382J04l040k406J28M464J0425J275O63J330j72j486M552
$$ 8937 7955 6882 14235 16617 16721 13681 11275 11403 15867 26292 27567 28230 29560 29388 27902 32454
12412C2454K580N550l255O15k838J0187n784Q21l602p231K71l269k588j694o724
$$ 32454 35034 40584 37329 37944 35106 45293 39509 40330 36728 29497 29768 26499 23911 22217 15493
12397A5493J239o138p742j052R965J1345k792q896k415J981n644j974O675N098
$$ 15493 16732 10594 2852 1800 11765 23110 20318 11422 9007 10988 5344 3370 10045 15143
12383A5143N694P084O579Q619J417N648l213p389M913m398j520r5l033m92r16
$$ 15143 20837 27921 34500 43119 44536 50184 46971 39582 44495 40097 38577 38482 35449 34957 34041
12368C4041k728m8m637n202K931o979p351k884L445K842K125o378l757P169L673
$$ 34041 31313 31265 26628 21426 24357 17378 10027 7143 10588 13430 15555 9177 5420 12589 16262
12353A6262j0621r380j644Q080O026o4Q15k214N06L714K812O808Q417L049M953
$$ 16262 5641 -3739 -5383 2697 8723 8659 9474 7260 7766 11480 14292 21100 29517 32566 37519
12338C7519K394q91o302L038P254J187Q31J4161J3558J8100K8988L5215M5810
$$ 37519 39913 39022 32720 35758 43012 44199 45030 59191 72749 90849 119837 155052 200862
12325B00862O8373J18498J87366L25585M72634L03875k49282m45148l19179j83371
$$ 200862 269235 387733 575099 900684 1373318 1677193 1427911 982763 663584 480213
12315D80213j06473o1666n0001m1566l1135k4267j2870j3612j5686j6166j7111
$$ 480213 373740 312074 262073 220507 189372 165105 152235 138623 122937 106771 89660
12304H9660o413q646q765j1379q992n059m821j420P93k236n371J046J120Q54l097
$$ 89660 83247 74601 65836 54457 45465 40406 35585 34165 34958 32722 27351 28397 29517 30371 27274
12289B7274m219j78n668r637J003j079J874N743m8r890r800M48L304K792k33l3
$$ 27274 23055 22877 17209 7572 8575 7496 9370 15113 15065 5175 -4625 -4177 -873 1919 1686 1653
12273A653L908L082m84j9J287J027R56P10k541m98N462j69k670r421l297n387
$$ 1653 5561 8643 8159 8140 9427 10454 11410 12120 9579 9081 14543 14374 11704 2283 -1014 -6401
12257f401l112N781K298j234N71p074M725M432k361N764l127m871o82J414M70
$$ -6401 -9513 -3732 -1434 -2668 -2097 -9171 -4446 -14 -2375 3389 262 -4609 -5291 -3877 -3407
12242c407L057L974O186J153l359j1389l438n67R24m399j136O254L892n738N05
$$ -3407 -350 3624 9810 10963 7604 -3785 -7223 -7790 -6866 -11265 -12401 -6147 -2255 -7993 -7488
12227g488Q639O016n239m976m43k999L23r29L909O571m365L244Q114o022n225
$$ -7488 1151 7167 1928 -3048 -3491 -6490 -6167 -7096 -3187 3384 -981 2263 10377 4355 -870
12212h70K79N30R1L008l948m658j599K600Q408O389l671r00r08k301M633L049
$$ -870 -591 -61 30 3038 -910 -5568 -7167 -4567 3841 10230 6559 5659 4751 2450 7083 10132
12196A0132o440n910o042q51L152R197m357n134O066K165j725M21l795K388J597
$$ 10132 3692 -2218 -8260 -9111 -5959 3238 -1119 -6253 -187 1978 253 674 -3121 -733 864
12181H64K684L44l969l394k28M379K531r059m147M698K569n351m001K917O300
$$ 864 3548 3892 -77 -3471 -3699 680 3211 -5848 -9995 -5297 -2728 -8079 -12080 -9163 -2863
12166b863K750k465L327M026L051J101m322q975R05L045J434K542o88p43j230
$$ -2863 -113 -2578 749 4775 7826 8927 4605 -4370 -3465 -420 1014 3556 2868 2125 895
12151H95l440o73J091M805J90K311q183j0562K917O483M043O006J0759k483j0602
$$ 895 -2545 -3218 -2127 2678 2868 5179 -3004 -13566 -10649 -4166 -123 5883 16642 14159 3557
12136C557l506J386J438J813m688J653K157K360K164k643r11L139O243K147q743
$$ 3557 51 1437 2875 4688 0 1653 3810 6170 8334 5691 4780 7919 14162 16309 7566
12121G566k8n940l080N16L68J167j352M904K789P839J659K77j096n511K993k2
$$ 7566 7538 1598 -1482 -966 -598 569 -783 4121 6910 14749 16408 16685 15589 10078 13071 13049
12105A3049R99j034j755l953l943L137N886J325j238o499k016K206l527q80K275
$$ 13049 14048 13014 11259 7306 3363 6500 12386 13711 12473 5974 3958 6164 2637 1757 4032
12090D032O593J177l735k557k039K303R683L996K29n510j760J17O18k18p943m231
$$ 4032 10625 11802 8067 5510 3471 5774 15457 19453 19682 14172 12412 12529 13147 12929 4986 755
12074G55K313m34J008L786J32m067M975M699k95k69M937j339Q826R064J890O353
$$ 755 3068 2634 3642 7428 7560 3493 8468 13167 12872 12603 17540 16201 25027 34091 35981 42334
12058D2334J150p776n14K623l288k475n70L38N033L405K45p549J00j393m04o775
$$ 42334 43484 35708 35194 37817 34529 32054 31484 31822 36855 40260 40505 32956 33056 31663 31259 24484
12042B4484j034N220O579M608m091k59p968m979K440o025k196J505Q03J71Q10
$$ 24484 23450 28670 35249 39857 35766 35507 27539 22560 25000 18975 16779 18284 19087 19258 20068
12027B0068J2106L296p035o395o77n038j952K536O593l759l444k245q958l889
$$ 20068 32174 35470 28435 22040 21363 16325 14373 16909 23502 19743 16299 14054 5096 1207
12013A207M047L247q573j874O319Q080K347l336q30l591l046R46N519m39J328
$$ 1207 5254 8501 -72 -1946 4373 12453 14800 11464 10634 7043 3997 4943 10462 10023 11351
11998A1351k025n301j35K740n677l501K622m104O11R582N650J705L202R98k33
$$ 11351 9326 4025 3890 6630 953 -2548 74 -4030 -3419 6163 11813 13518 16720 17718 17485
11983A7485l864j1816n542P59N504j442l994O844L004J443J8j373J262O738P710
$$ 17485 13621 1805 -3737 -2978 2526 1084 -2910 3934 6938 8381 8399 7026 8288 15026 22736
11968B2736K746k781j419n75j750k676m465m756N952J240m872p01j020n470K08
$$ 22736 25482 22701 21282 20707 18957 16281 11816 7060 13012 14252 9380 8679 7659 2189 2397
11953B397J167j60j567L839Q66k740K121j458l014J796k661M658m815J844M583
$$ 2397 3564 3404 1837 5676 6542 3802 5923 4465 1451 3247 586 5244 429 2273 6856
11938F856n090m216k082j025k330O11N085K023O699J030j231j930M82k006n316
$$ 6856 1766 -2450 -4532 -5557 -7887 -7276 -2191 -168 6531 7561 6330 4400 4882 2876 -2440
11923b440p85O125L741M692m952M15k366p544L200M646q92o098K888Q29j1k784
$$ -2440 -3225 2900 6641 11333 6381 6796 4430 -3114 86 4732 3840 -2258 630 1459 1448 -1336
11907a336j347J520Q215L320P93K550R007J332r692J006l723j651o035j1186l33
$$ -1336 -2683 -1163 7052 10372 11165 13715 22722 24054 14362 15368 11645 9994 3959 -7227 -7560
11892g560K420K295M262O189K90l097o690l745O860Q495n2m289j989p071n731
$$ -7560 -5140 -2845 1417 7606 7896 4799 -1891 -5636 1224 9719 9667 5378 3389 -3682 -9413
11877i413K686M179K767j918j032O762M112k605j334l056j884m557l013M923j416
$$ -9413 -6727 -2548 219 -1699 -2731 4031 8143 5538 4204 1148 -736 -5293 -8306 -3383 -4799
11862d799r47j968o093N894M550l224m670J254M375m194o14m011j856N268O026
$$ -4799 -5746 -7714 -13807 -7913 -3363 -6587 -11257 -10003 -5628 -9822 -10436 -14447 -16303 -11035 -5009
11847e009k45j289P427m60J696p211l62R42M489N765L64j867l179K974m483M279
$$ -5009 -5254 -6543 884 424 2120 -5091 -5453 -4511 -22 5743 6107 4240 1061 4035 -448 3831
11831C831j100k12J977R89O55o434q341j090N773n35K193j84n153j150K475L441
$$ 3831 2731 2519 4496 5485 6140 -294 -8635 -9725 -3952 -4487 -2294 -2478 -7631 -8781 -6306 -2865
11815b865o60l276L86k602n31l696L542R35o58K354j218o531r400M972O882P851
$$ -2865 -3525 -6801 -6415 -9017 -9548 -13244 -9702 -8767 -9425 -7071 -8289 -14820 -24220 -19248 -12366 -4515
11799d515M459k346k576o251J345L21m491q251O268Q692l232p448j99P826J468
$$ -4515 -56 -2402 -4978 -11229 -9884 -9563 -14054 -22305 -16037 -7345 -10577 -18025 -18224 -10398 -8930
11784h930k082m649L931P351J682k195M04J522J560J093L604P45l674k690N038
$$ -8930 -11012 -15661 -11730 -4379 -2697 -4892 -4488 -2966 -1406 -313 3291 4036 362 -2328 2710
11769B710L308M021j1420o852L182N0l072j291L157O70l64l13K280m745K536M290
$$ 2710 6018 10039 -1381 -8233 -5051 -5001 -8073 -9364 -6207 -5537 -5901 -6214 -3934 -8679 -6143 -1853
11753a853n333j421K715j804k750j531J88m28Q52K158P0o56K002J379N572j607
$$ -1853 -7186 -8607 -5892 -7696 -10446 -11977 -11789 -12217 -11365 -9207 -9137 -9793 -7791 -6412 -840 -2447
11737b447n122l868n188r43n10M18N688o26L003L22l192K285p31l568K511O828
$$ -2447 -7569 -11437 -16625 -17568 -18078 -17660 -11972 -12598 -9595 -9273 -12465 -10180 -10911 -14479 -11968 -5140
11721e140k046J578P006L260J054m056l464j823R48l014m308J045l383J820K167
$$ -5140 -7186 -5608 1398 4658 5712 1656 -1808 -3631 -2683 -5697 -10005 -8960 -12343 -10523 -8356
11706h356L699R230L814l370n557N050j854n490l742j015l161J075j648l483L226
$$ -8356 -4657 4573 8387 5017 -540 4510 2656 -2834 -6576 -7591 -10752 -9677 -11325 -14808 -11582
11691a1582K258J134J220M967P072R86k751n805n777j353J451P092k163n392m05
$$ -11582 -9324 -8190 -6970 -2003 5069 6055 3304 -2501 -8278 -9631 -8180 -1088 -3251 -8643 -9048
11676i048m93j5n493J035L008K0L764M99j936m924K899Q303p55o756m655L233
$$ -9048 -9541 -9556 -15049 -14014 -11006 -10986 -7222 -6723 -8659 -13583 -10684 -2381 -3136 -9892 -14547 -11314
11660a1314J0122R85j259O27M361l360J143j846j662j345N68n89J429K137J318
$$ -11314 -1192 -207 -1466 -839 3522 162 1305 -541 -2203 -3548 -2980 -3569 -2140 -3 1315
11645A315r833l466K681P802P994p684J461N433n59N152M038K346m946k747m899
$$ 1315 -8518 -11984 -9303 -1501 6493 -1191 270 5703 5144 10296 14334 16680 11734 8987 4088
11630D088o265j253L185O863Q700n072j0628o802k841K198K075Q16L29J676J0641
$$ 4088 -2177 -3430 -245 6618 15318 10246 -382 -7184 -10025 -7827 -5752 -4936 -4607 -2931 7710
11615G710J7m793l614l045o261M42J094L896K010P5j065k523k972k350N857N998
$$ 7710 7727 2934 -680 -3725 -9986 -9544 -8450 -4554 -2544 -2469 -3534 -6057 -9029 -11379 -5522 476
11599D76K075r90m710o190J48J6574j49p926K54J214M641o542O93M88O62o96j586
$$ 476 2551 1561 -3149 -9339 -9191 7383 7234 -692 -438 776 5417 -1125 -432 56 718 22 -1564
11582a564N089L959l914P76n81m396j66l319m374l296k347m58J177O011J0575
$$ -1564 3525 7484 3570 4346 3765 -631 -797 -4116 -8490 -11786 -14133 -14591 -13414 -7403 3172
11567C172L193l890K655N802n494k547o343J487L943K985L265J661k974J206k043
$$ 3172 6365 2475 5130 10932 5438 2891 -3452 -1965 1978 4963 8228 9889 6915 8121 6078
11552F078M749J1466o06q508r699l585Q89O757m157J368J474k397k927n221L118
$$ 6078 10827 22293 21687 13179 3480 -105 784 7541 3384 4752 6226 3829 902 -4319 -1201
11537a201Q313R202j026m277K2M910M792J249J090J200m837M193j123j816J0682
$$ -1201 7112 16314 15288 11011 11033 15943 20735 21984 23074 24274 19437 23630 22507 20691 31373
11522C1373R231j0638q099J3417J5718l891j2197k050K331J856m830j842o20l5
$$ 31373 40604 29966 21867 35284 51002 47111 34914 32864 35195 37051 32221 30379 29759 29724
11508B9724L727J547n557r928n008P728m413n701l658P412O283l188j383l524
$$ 29724 33451 34998 29441 19513 14505 22233 17820 12119 8461 15873 22156 18968 17585 14061
11494A4061k314J924k123k858J688J523N708l125n460P97k281K872N791O77k991
$$ 14061 11747 13671 11548 8690 10378 11901 17609 14484 9024 9821 7540 10412 16203 16880 13889
11479A3889j290l06o71j476k739n30J721J802r1k09P328m42m847n988p584L787
$$ 13889 12599 12293 11622 10146 7407 6877 8598 10400 10309 10100 17428 16986 12139 6151 -1433 2354
11463B354M565L344k652P772J686m177m893o40L131L231k778L352j235r696m851
$$ 2354 6919 10263 7611 15383 17069 12892 7999 7359 10490 13721 10943 14295 13060 3364 -1487
11448a487qM02K497M207k787l889m027L052Q177k602m677J005L472J346o634K774
$$ -1487 -1495 -1093 1404 5611 2824 -1065 -5092 -2040 6137 3535 -1142 -137 3335 4681 -1953 821
11432H21K153K252j257K906j811l324l827q27k567p079N482P097J336O31j93L411
$$ 821 2974 5226 3969 6875 5064 1740 -2087 -2914 -5481 -12560 -7078 19 1355 1986 1793 5204
11416E204N700k853K769m94j1255o305M120M009o335J843m086J054J905N708J161
$$ 5204 10904 8051 10820 10326 -929 -7234 -3114 895 -5440 -3597 -7683 -6629 -4724 984 2145
11401B145n756k387M552O233k742n0J423k95o554L338r93R195R51n917n027l403
$$ 2145 -3611 -5998 -1446 4787 2045 1995 3418 3123 -3431 -93 -1086 8109 9060 3143 -1884 -5287
11385e287K386J477K4l66N149K324j331L96o7K44k38P290J388o916N490N044R97
$$ -5287 -2901 -1424 -1400 -1766 3383 5707 4376 4772 4705 4949 4711 12001 13389 6473 11963 17007 18004
11368A8004k637r640j670K799L457J952K021l68k951k757N52J31M884j401q435
$$ 18004 15367 5727 4057 6856 10313 12265 14286 13918 10967 8210 8762 8893 13777 12376 3941
11353C941j501L348L029K110J0124J1498j343L69k254l060k270M154M566L936
$$ 3941 2440 5788 8817 10927 21051 32549 31206 31575 29321 26261 23991 28145 32711 36647
11339C6647J465j15j650k778p521q445j465O68m26q40k406j625J307R196O717
$$ 36647 38112 37997 36347 33569 26048 17603 16138 16806 16380 15540 13134 11509 12816 22012 28729
11324B8729Q869J675K086N264M85L359j485j228o216j710P804M113K256J628j271
$$ 28729 37598 39273 41359 46623 47108 50467 48982 47754 41538 39828 47632 51745 54001 55629 54358
11309E4358j0679n622j257J33o674m405l94K927o896K20l747J0L541Q79k876o51
$$ 54358 43679 38057 36800 36933 30259 25854 25460 28387 21491 21711 17964 17974 21515 22394 19518 18867
11293A8867P496Q007J56j756p788k963R698L787J3751K1313L9476N8381M9834
$$ 18867 26363 34370 34526 32770 24982 22019 31717 35504 49255 70568 110044 168425 218259
11280B18259J5170P496p069k9838n3330m4861k4689j3568j0897n447j974m824
$$ 218259 233429 240925 233856 204018 150688 105827 81138 67570 56673 51226 49252 44428
11268D4428q415o624K256m111q532k060M397K981m638r002r5L114j116K048K697
$$ 44428 36013 29389 31645 27534 19002 16942 21339 24320 19682 10680 10585 13699 12583 14631 17328
11253A7328q958k334l905n627k987M739rr445j473N701K183o72M789O96J182l512
$$ 17328 8370 6036 2131 -3496 -6483 -1744 -1753 -11198 -12671 -6970 -4787 -5459 -670 26 1208 -2304
11237b304N047L596r65J742m658J560Q41P78r95J952M314j117K218l207J465P650
$$ -2304 2743 6339 5374 7116 2458 4018 4859 5637 4642 6594 10908 9791 12009 8802 10267 17917
11221A7917L856k601q538o808k458p401q373Q051L523J955K130l727o212J043
$$ 17917 21773 19172 10634 3826 1368 -6033 -14406 -6355 -2832 -877 1253 -2474 -8686 -7643
11207g643N182j886j0931J058J044P250L193L57r06N681K99l21k04N089o88p681
$$ -7643 -2461 -4347 -15278 -14220 -13176 -5926 -2733 -2376 -3282 2399 2698 2377 2173 7262 6574 -1107
11191a107q291K402k54p599j896P051J0544j469o691O06O037L718M318L116K39
$$ -1107 -9398 -6996 -7250 -14849 -16745 -9694 850 -619 -7310 -6704 -667 3051 7369 10485 10724
11176A0724N939P0o409J1231K0153J8240K4042M2396N0370J3045k1066j491K1769
$$ 10724 16663 16733 10324 21555 41708 59948 83990 126386 176756 189801 168735 167244 189013
11163A89013J485l6101m7125l2247j5401o757o411m883m265m858l211n232k077
$$ 189013 190498 154397 107272 75025 59624 52867 46456 41573 37308 32450 29239 24007 21930
11150B1930p266p088N702L878J954l625o457p419k08M95k525o08j047o42M211
$$ 21930 14664 7576 13278 17156 19110 15485 9028 1609 1401 1896 -629 -1237 -2284 -2926 1285
11135A285J861j637k656r05M150L825J39K752L606q173r012J471M841j931K077
$$ 1285 3146 1509 -1147 -2052 2098 5923 6062 8814 12420 4247 -4765 -3294 1547 -384 1693
11120A693l873N256P24O514j633k416p069L383K262M356l900p803n981N168N108
$$ 1693 -2180 3076 3800 10314 8681 6265 -804 2579 4841 9197 5297 -2506 -8487 -3319 1789
11105A789l873L684k047O98l177N754J3253o611l473m575J608N937L470p758n440
$$ 1789 -2084 1600 -447 251 -2926 2828 16081 9470 5997 1422 3030 8967 12437 4679 -761
11090g61j0478J318N527J1619M922j563n286L34j1272o190P878M455q87N123N95
$$ -761 -11239 -9921 -4394 7225 12147 10584 5298 5632 -5640 -11830 -3952 503 -384 4739 5334
11075E334N206N210m08L49m28j0751o965R057J0651N547r559p954J777o208j872
$$ 5334 10540 15750 15342 15691 15263 4512 -2453 6604 17255 22802 13243 5289 7066 858 -1014
11060a014p238J2161N610l692k56M092J463m702l659M874L645m354j935K553n030
$$ -1014 -8252 3909 9519 5827 5571 9663 11126 6424 2765 7639 11284 6930 4995 7548 2518
11045B518r77N958M891o872r230q63N22j026j115l3L748J470O280K077J133K511
$$ 2518 1541 7499 12390 5518 -3712 -4575 -4053 -5079 -6194 -6227 -2479 -1009 5271 7348 8481 10992
11029A0992j290k851o340k866M864k062J628M36m492j078o92N597J0858r98l641
$$ 10992 9702 6851 511 -2355 2509 447 2075 2511 -1981 -3059 -3751 1846 12704 11706 8065
11014H065k220k764k407L367J628k268k037P65P090Q57M77j202n25N755j845q799
$$ 8065 5845 3081 674 4041 5669 3401 1364 2129 9219 10076 10553 9351 8826 14581 12736 3937
10998C937L529j78L342j145M830K239j778p866p139J483N135O069J48p269m928
$$ 3937 7466 7288 10630 9485 14315 16554 14776 6910 -229 1254 6389 12458 12606 5337 409
10983D09k258Q37j959K173r07j468P835K209j517J97o599o575L155L139K564P87
$$ 409 -1849 -1012 -2971 -798 -1705 -3173 4662 6871 5354 5551 -1048 -7623 -4468 -1329 1235 2022
10967B022K338q72n90r86J122l042k246k094j355O789O102k691J504L358K282
$$ 2022 4360 3488 2898 1912 3034 -8 -2254 -4348 -5703 1086 7188 4497 6001 9359 11641
10952A1641L17n770j273K1l49N353k94K621N53l537q577l020k549M980l888l339
$$ 11641 11958 6188 4915 4936 4587 9940 9646 12267 12820 9283 706 -2314 -4863 117 -3771 -7110
10936g110J931L152o272N158K120J659L199L282M23L672J024o560k263J055r02
$$ -7110 -5179 -2027 -8299 -3141 -1021 638 3837 7119 7542 11214 12238 5678 3415 4470 3568
10921C568m089k826L409M367m123j368j195N193l850k919J010r3L522j179M461
$$ 3568 -521 -3347 62 4429 306 -1062 -2257 2936 -914 -3833 -2823 -2916 606 -573 3888
10906C888O177j137k006k261l286k499O690M63j459N5r57o627q25J919M952O61
$$ 3888 10065 8928 6922 4661 1375 -1124 5566 6029 4570 4625 3668 -2959 -3784 -1865 3087 3748
10890C748J185N257M26N00P080j23j391n599r519l339O61K000Q406m905K202K600
$$ 3748 4933 10190 10616 11116 18196 18073 16682 11083 1564 -1775 -1114 886 9292 4387 6589 9189
10874I189j236l664m246L130L246l85L23L00J080j598J361k548j714k541K893
$$ 9189 7953 4289 43 3173 6419 6034 6357 6657 7737 6139 7500 4952 3238 697 3590
10859C590Q187K105m576m483j938o31N483k443n57K247R699N3m784P918M893j0281
$$ 3590 11777 13882 9306 4823 2885 2254 7737 5294 4737 6984 16683 16736 11952 19870 24763 14482
10843A4482r003q414O950J932K059j370L236l839m126N546K367n197p13Q11o45
$$ 14482 5479 -2935 4015 5947 8006 6636 9872 6033 1907 7453 9820 4623 3910 4721 4076
10828D076m89Q81m031J508K586J01N070k121K348o827q447O35L153K732M15l130
$$ 4076 3587 4468 437 1945 4531 4632 9702 7581 9929 3102 -5345 -4710 -1557 1175 1590 -1540
10812a540j1831j318Q604M676K910O630j065m636P125k456o268k070Q8m211k967
$$ -1540 -13371 -14689 -6085 -1409 1501 8131 7066 2430 9555 7099 831 -1239 -1151 -5362 -8329
10797h329N834J121M995k429K458L232N937J391L118k529l717j813J389O846Q613
$$ -8329 -2495 -1374 3621 1192 3650 6882 12819 14210 17328 14799 11082 9269 10658 17504 26117
10782B6117J506k536l781N1m100l103K900l774J206K751l354J975O144K963L900
$$ 26117 27623 25087 21306 21357 17257 14154 17054 13280 14486 17237 13883 15858 22002 24965 28865
10767B8865J437o539j329o49m499n580l88l223J390M199m66P696K241L981J2335
$$ 28865 30302 23763 22434 21785 17286 11706 11318 8095 9485 13684 13218 20914 23155 27136 39471
10752C9471J5516q04j2042j1827n667m324m785q012L905O112R030N540J0458k632
$$ 39471 54987 54183 42141 30314 24647 20323 15538 7526 11431 17543 26573 32113 42571 39939
10738C9939r439r668l395r91j268j6M881n845M653M836j099l692Q08Q854L844
$$ 39939 30500 20832 17437 16446 15178 15162 20043 14198 18851 23687 22588 18896 19704 28558 32402
10723C2402l5l430j568m514k994m702l236P218K647o340Q030L709m930k955m167
$$ 32402 32367 28937 27369 22855 19861 15159 11923 19141 21788 15448 23478 27187 22257 19302 15135
10708A5135l328k370k134n095m717j239j480O238O573N688n189K560O42n227K393
$$ 15135 11807 9437 7303 2208 -2509 -3748 -5228 1010 7583 13271 8082 10642 11284 6057 8450
10693H450M154K432N564j144J809m606r533m994O639l5k074k780L80K477O385
$$ 8450 12604 15036 20600 19456 21265 16659 7126 2132 8771 8736 6662 3882 4262 6739 13124
10678A3124K7l829m462o11O232L368K124m176q87j83l897L383J495n470p898Q33
$$ 13124 13151 9322 4860 4249 10481 13849 15973 11797 10910 10727 6830 10213 11708 6238 -1660 -827
10662h27l40o20K519M902K868P55k207o615l756L204J522J890K591K306J81K525
$$ -827 -1167 -1787 732 5634 8502 9257 7050 435 -3321 -117 1405 3295 5886 8192 8373 10898
10646A0898K029O65N504R012K344p356n171m121o198m562M722r05m080j957L23
$$ 10898 12927 13592 19096 28108 30452 23096 17925 13804 7606 3044 7766 6861 2781 824 1147
10631A147L633L791m446K325L514K467K353K229K212k053o950j732L705o673m775
$$ 1147 4780 8571 4125 6450 9964 12431 14784 17013 19225 17172 10222 8490 12195 5522 747
10616G47k609j823M864k354o017J206O520Q155L309j263l321p116J021L755J853
$$ 747 -1862 -3685 1179 -1175 -7192 -5986 534 8689 11998 10735 7414 298 1319 5074 6927
10601F927n41l813J540j242j486K543K472K112M921m596k686M343M2L505N628
$$ 6927 6386 2573 4113 2871 1385 3928 6400 8512 13433 8837 6151 10494 10536 14041 19669
10586A9669p453r359L321L444n787J071l975N738N890N779m545j785M376N481
$$ 19669 12216 2857 6178 9622 3835 4906 931 6669 12559 18338 13793 12008 16384 21865
10572B1865L01k591j226L908l177o902o70p577l632M166m94P95J3770J1185J596
$$ 21865 22166 19575 18349 22257 19080 12178 11508 3931 299 4465 3971 4766 18536 29721 31317
10557C1317L66J885J0023J5374K1062L025k3991j5339j2027p806k728m85J967
$$ 31317 31683 33568 43591 58965 80027 83052 59061 43722 31695 23889 21161 20676 22643
10544B2643k160M77M085M570K676j2058o634L076L807L752n900l347L505N527
$$ 22643 20483 20960 25045 29615 32291 20233 13599 16675 20482 24234 18334 14987 18492 24019
10530B4019M587j311m643o910m877R99K975k889k154M121K461m977j551J496k118
$$ 24019 28606 27295 22652 15742 10865 11864 14839 11950 9796 13917 16378 11401 9850 11346 9228
10515I228m024K033J612m620J833K856j919j731K669q20k87j110Q19M054N063
$$ 9228 5204 7237 8849 4229 6062 8918 6999 5268 7937 7117 6830 5720 6539 10593 15656
10500A5656J290J105j972j458j0703L983P072J2370k222M61n709l723k569j081
$$ 15656 16946 18051 16079 14621 3918 7901 14973 27343 25121 25582 19873 16150 13581 12500
10486A2500J659l964k257J630R86k797k89N792M391O741N848l153j2659n532R07
$$ 12500 14159 10195 7938 9568 10554 7757 7468 13260 17651 24392 30240 27087 14428 8896 9803
10471I803p84j741l011J26k359l408L354m75j036R734M967P255J433m943J038
$$ 9803 9019 7278 4267 4393 2034 -1374 1980 1505 469 10203 15170 22425 23858 18915 19953
10456A9953J765P763K87k462J093N47M833M504J105p200j0676N480J2351L69n274
$$ 19953 21718 29481 29768 27306 28399 28946 33779 38283 39388 32188 21512 26992 39343 39712 34438
10441C4438q130N80k831K672J042k947k342k66j849K127l81K167k149j527l575
$$ 34438 26308 26888 24057 26729 27771 24824 22482 22216 20367 22494 22113 24280 22131 20604 17029
10426A7029j405K425n40j064m658l463Q562R980K154r287j720q93M046K678j88
$$ 17029 15624 18049 17509 16445 11787 8324 16886 26866 29020 19733 18013 17120 21166 23844 23656
10411B3656l445k342K55K029N684K028j860l667l590l841j444K257J693O355o529
$$ 23656 20211 17869 18124 20153 25837 27865 26005 22338 18748 14907 13463 15720 17413 23768 17239
10396A7239J49k151R789M874m965l563k410k862J871R856Q217j127m893Q02k631
$$ 17239 17388 15237 25026 29900 24935 21372 18962 16100 17971 27827 36044 34917 30024 30826 28195
10381B8195M447n154p993r01l703p30R47Q24p12m722K504M484M137m29k254J335
$$ 28195 32642 27488 19495 18594 14891 14161 15108 15932 15220 10498 13002 17486 21623 21194 18940 20275
10365B0275M030K917J072N540R254Q82R393R098M512L364Q93k369K708j651j452
$$ 20275 24305 27222 28294 33834 43088 43970 53363 62461 66973 70337 71230 68861 71569 69918 68466
10350F8466R632J0303L322J832L427O331Q582M198N114Q570J4346K2533L7086
$$ 68466 78098 88401 91723 93555 96982 103313 111895 116093 121207 129777 144123 166656 203742
10337B03742N1838P3257J21981J83438K15318K20706K43422K59576K35197J43828
$$ 203742 255580 328837 450818 634256 849574 1070280 1313702 1573278 1808475 1952303
10327A952303O2899j194l4396j15313j88278k30772k06985j81551j70302j54602
$$ 1952303 2015202 2014008 1979612 1864299 1676021 1445249 1238264 1056713 886411 731809
10317G31809j27974q5304n8165l8110k8129l0993k6701k4089k4670k3094k9808
$$ 731809 603835 518531 460366 422256 394127 363134 336433 312344 287674 264580 234772
10306B34772k0535k0876k5339j9319j4936q092l646j0530j4824m116j836j3476
$$ 234772 214237 193361 168022 148703 133767 125675 122029 111499 96675 92559 90723 77247
10294G7247n494o574k917j686J4M399K014j787o352r413l697k077q852j38N607
$$ 77247 71753 65179 62262 60576 60590 64989 67003 65216 58864 49451 45754 43677 34825 34687 40294
10279D0294J1353R35o782l289m69m675o411j257P428m443k77Q105M890p94P01
$$ 40294 51647 52582 45800 42511 42042 37367 30956 29699 37127 32684 32407 40512 45402 44608 45309
10264D5309O422R376P369M97j1475q900n834n814R032k841n698l818K822p76m654
$$ 45309 51731 61107 68476 68973 57498 48598 42764 36950 45982 43141 37443 33625 36447 35671 31017
10249C1017L821L313O105J898n34j642l580K593K969k64n57j795j730m161o261
$$ 31017 34838 38151 44256 46154 45620 43978 40398 42991 45960 45696 45139 43344 41614 37453 31192
10234C1192K339O659l49o38N342O623N56k018j624m639m382j955M315O708j907
$$ 31192 33531 40190 39841 39203 44545 51168 51724 49706 48082 43443 39061 37106 41421 48129 46222
10219D6222r885j6Q347n02r810q826j136N427L956k275m655J738M560n643N662
$$ 46222 36337 36321 44668 44166 34356 25530 24394 29821 33777 31502 26847 28585 33145 27502 33164
10204C3164P735j138J921o01m675o952o064j124N847J597o230j025P222M878k78
$$ 33164 40899 39761 41682 41081 36406 29454 23390 22266 28113 29710 23480 22455 29677 34555 34277
10189C4277o95k332m788j672n287j067N020O327M309L830K505k229M83n254k066
$$ 34277 33582 31250 26462 24790 19503 18436 23456 29783 34092 37922 40427 38198 38681 33427 31361
10174C1361n85l515p116j438N71O15M579j173j248M586J611k870Q35K070l848
$$ 31361 30776 27261 20145 18707 19278 19893 24472 23299 22051 26637 28248 25378 26213 28283 24435
10159B4435n70j834L663J076k895N283j842n544N719J735j323k940l399j89M626
$$ 24435 23865 22031 25694 26770 23875 29158 27316 21772 27491 29226 27903 24963 21564 21375 26001
10144B6001j72r09j119M414N216L896M5k91l353l394L248J614l739J677M928K145
$$ 26001 25829 24920 23801 28215 33431 37327 37372 37081 33728 30334 33582 35196 31457 33134 38062 40207
10128D0207J488q116K081N899O440K850j116r301l521k244L929r35m650l131l028
$$ 40207 41695 33579 35660 41559 47999 50849 49733 40432 36911 34667 38596 37661 33011 29880 26852
10113B6852R61j654R802l33M50K712k143o955m600R20L704L279l938m128J52L826
$$ 26852 27813 26159 35961 35628 36078 38790 36647 29692 25092 26012 29716 32995 29057 24929 25081 28907
10097B8907K052Q71K906K498L393m224N3n263m292l90k544p774l837Q815Q506
$$ 28907 30959 31830 34736 37234 40627 36403 36456 31193 26901 26511 23967 16193 12356 21171 29677
10082B9677j78j35l576k156J494Q364K496n789O036r25l50L187M788k236n655
$$ 29677 29499 29364 25788 23632 25126 33490 35986 30197 36233 35308 34958 38145 42933 40697 35042
10067C5042m149p20M744m15p90j64L109M935k143k564m092n061k419J264L246
$$ 35042 30893 30173 34917 34502 33712 33548 36657 41592 39449 36885 32793 27732 25313 26577 29823
10052B9823M03L246R397L657M208N920K840R06j836j956L930J1584L2579N4832
$$ 29823 30226 33472 42869 46526 50734 56654 59494 60400 58564 56608 60538 72122 104701 159533
10038A59533K7285m8876l9512j9610p783k036Q42o177p538m18K809L086k771m226
$$ 159533 186818 137942 98430 78820 71037 69001 69843 63666 56128 55710 58519 61605 58834 54608
10024E4608o608K199L302j1034l385N219P215K69p449p219P41L901O606P88M186
$$ 54608 48000 50199 53501 42467 39082 44301 51516 51785 44336 37117 37858 41759 48365 49153 53339
10009E3339N131j975o206q512m053N306l949k33k974j322J24j132K989P325K727
$$ 53339 58470 56495 50289 41777 37724 43030 39081 38848 35874 34552 34676 33544 36533 43858 46585
9994D6585Q79k577J298L110J45l600p458j778J23O346L738M77o845n916j878K212
$$ 46585 47464 44887 46185 49295 49440 45840 38382 36604 36727 43073 46811 47288 40443 34527 32649 34861
9978C4861J853j366O446J5079L620j0369M406M614k138k181L678k485j0476j380
$$ 34861 36714 35348 41794 56873 60493 50124 54530 59144 57006 54825 58503 56018 45542 44162
9964D4162J850M141L887J453m524q943l118L347l936o46K272J16N277L023K614
$$ 44162 46012 50153 54040 55493 50969 42026 38908 42255 38319 37673 39945 40061 45338 48361 50975
9949E0975m497l801L001J608l23M136K426J333m865J05j276m695O822J0234L475
$$ 50975 46478 42677 45678 47286 46963 51099 53525 54858 49993 50098 48822 44127 50949 61183 64658
9934F4658m42L207k287o18L86K713Q206O847J4278J7554J0208j2243j4330q571
$$ 64658 64216 67423 65136 64518 64904 67617 75823 82670 96948 114502 124710 112467 98137 89566
9920H9566k253r052Mj606m804K857M096l50q743m301N159M812K676J209N158P174
$$ 89566 87313 78261 78265 76659 71855 74712 78808 78458 69715 65414 70573 75385 78061 79270 84428 91602
9904I1602K4610J6733J8663L0678L2913L3070L1167p007l6316l6039k9534k2722
$$ 91602 116212 132945 151608 182286 215199 248269 279436 272429 236113 200074 170540 147818
9892A47818j4973q405n671n965j944k354p266q947j1866m352j152J185K307j488
$$ 147818 132845 124440 118769 112804 110860 108506 101240 92293 80427 76075 74923 76108 78415 76927
9878G6927l419L281k442p606N24K082M53N981J004K916j60k449j447j566M91k341
$$ 76927 73508 76789 74347 66741 67265 69347 69800 75781 76785 79701 79541 77092 75645 74079 74570 72229
9862G2229Q61L395O692K619n119j032N308k102l04L152m526k122M830R23l79R367
$$ 72229 73090 76485 83177 85796 80677 79645 84953 82851 82547 85699 81173 79051 83881 84804 84425 93792
9846I3792R02k801K47J0677K2493K5522K8002J7603p152k6220k5848j5387l715
$$ 93792 94694 91893 92140 102817 125310 150832 178834 196437 189285 163065 137217 121830 118115
9833A18115J46K100n447o390l622L688K813j731p787j602o35O350o22j651m480
$$ 118115 118261 120361 114914 108524 104902 108590 111403 109672 101885 100283 99648 105998 105376 103725 99245
9818I9245n086k696L693K16o862p72j142J67n82M955K017j452n275O12P175P637
$$ 99245 94159 91463 95156 95372 88510 87738 86596 86763 86181 91136 93153 91701 86426 87038 94213 101850
9802A01850O246O900N549l263m073j3080n505m526p754L314R558M783j727m063
$$ 101850 108096 114996 120545 117282 113209 100129 94624 90098 82344 85658 95216 99999 98272 94209
9788I4209k579l007k715L904K764m185k670J002k057m297j088N577q90J483J908
$$ 94209 91630 88623 85908 89812 92576 88391 85721 86723 84666 80369 79281 84858 83968 85451 87359
9773H7359r75p373j432N352p94k333o769J943k071L17J0366N245j685P0n94j329
$$ 87359 86384 79011 77579 82931 82137 79804 73035 74978 72907 73224 83590 88835 87150 87220 86626 85297
9757H5297K724m030J666M720j431R56j078j787n88j836n363L730O292M881L126
$$ 85297 88021 83991 85657 90377 88946 89902 88824 87037 86449 84613 79250 82980 89272 94153 97279
9742I7279j711n233M604N917k303j0465k685M771j341j588o64n108j725k22l562
$$ 97279 95568 90335 94939 100856 98553 88088 85403 90174 88833 87245 86581 81473 79748 79526 75964
9727G5964L405J0138J261j042m193K889k962j057M882J685k73J43O79R180k608
$$ 75964 79369 89507 90768 89726 85533 88422 85460 84403 89285 90970 90697 90840 91519 100699 98091
9712I8091m909M836m708j611P64J566o89o772J743Q084k413K90o563n730L247
$$ 98091 93182 98018 93310 91699 92463 94029 93340 86568 88311 96395 93982 94272 87709 81979 85226
9697H5226K756jm175m45M802r26m007N536l802L720M122L366k968O44n920o642
$$ 85226 87982 87981 83806 83361 88163 87237 83230 88766 84964 88684 92806 96172 93204 93848 87928 81286
9681H1286J405N166K398M688K89p8m220m001J114O15j435J581R82j450k888L247
$$ 81286 82691 87857 90255 94943 95232 95154 90934 86933 88047 88662 87227 88808 89790 88340 85452 88699
9665H8699J266L485k31K662M489J71j041L16l421o037j2576k756J245K675K085
$$ 88699 89965 93450 93219 95881 100370 100541 99500 99816 96395 90358 77782 75026 76271 78946 81031
9650H1031j574Q44L889J890j351M204k705J331P326j371r277p418L63K031O386
$$ 81031 79457 80301 84190 86080 84729 88933 86228 87559 94885 93514 84237 76819 77182 79213 85599
9635H5599M603J949l632l449J043k498K386o224Q50O80l086M08N008N329K7j1269
$$ 85599 90202 92151 88519 85070 86113 83615 86001 79777 80627 81307 78221 78629 83637 88966 88993 77724
9619G7724J236L205M21K7m44n152J121N431M317J793l216k39J054k944o916j461
$$ 77724 78960 82165 82586 82613 82169 77017 78138 83569 87886 89679 86463 86224 87278 84334 77418 75957
9603G5957J750K74j178P960M483o30l623n109r73O931m255m997n102J092O830
$$ 75957 77707 77981 76803 84763 89246 88616 84993 79884 78911 85842 81587 76590 71488 72580 79410
9588G9410O573o299p539j111M528J269J140J66m353R22R089Q684K586R70K032
$$ 79410 85983 79684 72145 71034 75562 76831 77971 78137 73784 74706 83795 92479 95065 96035 98067
9573I8067q10p649o201l905l567q950J910N635O33j856n412r56M952l87m927L533
$$ 98067 97257 89608 83407 79502 75935 66985 68895 74530 75163 73307 67895 66939 71891 71504 66577 70110
9557G0110j71j809L117n38J736O6r27k318J133M417K617J03k610j831k920j34
$$ 70110 69939 68130 71247 70709 72445 72511 71584 69266 70399 74816 77433 77536 74926 73095 70175 70041
9541G0041N706N943k317k573m220o249L076K123K175j359p178M61N95M737n225
$$ 70041 75747 81690 79373 76800 72580 66331 69407 71530 73705 72346 65168 65629 66224 70961 65736
9526F5736L071Q115m49m901l035K048J557J205k969j778J1158N502p445r457j581
$$ 65736 68807 76922 76473 71572 68537 70585 72142 73347 70378 68600 79758 85260 77815 68358 66777
9511F6777K647m213j734L521m47n296m523K239J883L78j671J597K724K19K144
$$ 66777 69424 65211 63477 66998 66551 61255 56732 58971 60854 61232 59561 61158 63882 64101 66245
9496F6245L919M402q857j4369l17J0464K259L472M164j509n790m186l693N660
$$ 66245 70164 74566 65709 51340 51023 61487 63746 67218 71382 69873 64083 59897 56204 61864
9482F1864O759l888r120J370J671l833j075M154k240L480K444j1789p815j370
$$ 61864 68623 64735 55615 56985 58656 54823 53748 57902 55662 59142 61586 49797 41982 40612
9468D0612M016P023N645R34K984m098m866k716l175j345Q86N770O533N066K839
$$ 40612 44628 51651 57296 58230 61214 57116 52250 49534 46359 45014 45900 51670 58203 63269 66108
9453F6108J584l138p802r518M55l157p05M812K962k819k959M750Q751m734o844
$$ 66108 67692 64554 56752 47234 47689 44532 43827 48639 51601 48782 45823 50573 59324 54590 47746
9438D7746M844K812N182M524K031k448l886L549K083o163m972L215l059O65J71
$$ 47746 52590 55402 60584 65108 67139 64691 60805 64354 66437 60274 55302 58517 55458 56123 56294
9423E6294p42l520k865m650N078J2960o31m623l510N40N359K096m453q69M568
$$ 56294 55552 52032 49167 44517 49595 62555 61924 57301 53791 54331 59690 61786 57333 56464 61032
9408F1032K180n520k429m560k575K545n166K360K724M902l983p584L08O974M814
$$ 61032 63212 57692 55263 50703 48128 50673 45507 47867 50591 55493 51510 43926 44234 51208 56022
9393E6022N213l598J028o73q67N308O96j439m402o187q154Q410R281M32m753K287
$$ 56022 61235 57637 58665 57992 57125 62433 63129 61690 57288 51101 42947 51357 60638 61070 56317 58604
9377E8604K917n396L465k944o555J514N135P941J812l786k377k914R006M469r200
$$ 58604 61521 56125 59590 56646 50091 51605 56740 64681 66493 62707 60330 57416 66422 70891 61691
9362F1691l656J208l016o379L823k77n098P297r56l032L031J290J442q627q4N178
$$ 61691 58035 59243 56227 49848 53671 53394 48296 55593 54637 51605 54636 55926 57368 48741 48657 53835
9346E3835k823m072p118Q854M961m620k848L328o96n228M042j21k298q00m606
$$ 53835 51012 46940 39822 48676 53637 49017 46169 49497 48801 43573 47615 47494 45196 44396 39790
9331C9790j077O081M119J654M685O143j710r550r21l914K90R08j525j646m477
$$ 39790 38713 44794 48913 50567 55252 61395 59685 50135 49214 45300 45590 46498 44973 43327 38850
9316C8850m331Q22L49P857N198K856J358L225j747J307L585M301L451k193j867
$$ 38850 34519 35341 35690 43547 48745 51601 52959 56184 54437 55744 59329 63630 67081 64888 63021
9301F3021l459j857J483m191o696l950R089l7m989K255M466L234J137j435J547
$$ 63021 59562 57705 59188 54997 48301 44351 53440 53403 48414 50669 55135 58369 59506 58071 59618
9286E9618K078k696j460K580J599k097k476K574O720k640L00j190K489J582j796
$$ 59618 61696 59000 57540 60120 61719 59622 57146 59720 66440 63800 64100 62910 65399 66981 65185
9271F5185M881J0458O55l218P521Q79J148q350j0989J7N569L942L700J773j226
$$ 65185 70066 80524 81179 77961 85482 86361 87509 79159 68170 68187 73756 77698 81398 83171 81945
9256H1945M515K048o661o721j162j031p05r54n455k294j47p92N936L918l525l129
$$ 81945 86460 88508 81847 75126 73964 72933 72228 71274 65819 63525 63378 62586 68522 72440 68915 65786
9240F5786l566l631J856O421O730m589o688L340L112M280n675j478l278j0333
$$ 65786 62220 58589 60445 66866 73596 69007 62319 65659 68771 73051 67376 65898 62620 52287
9226E2287J781J844K018J773K613L671J18j98l306p912N353M094n161r06m592
$$ 52287 54068 55912 57930 59703 62316 65987 66105 65907 62601 54689 60042 64136 58975 58069 53477
9211E3477r35K20J371k031K197N286k024J701o97m537k918j435K70mL323J108
$$ 53477 52542 52762 54133 52102 54299 59585 57561 59262 58565 54028 51110 49675 49945 49941 53264 54372
9195E4372k668J648m299J721J515n278L220N470N896n808l342O759L767N747p73
$$ 54372 51704 53352 49053 50774 52289 47011 50231 55701 61597 55789 52447 59206 62973 68720 67947
9180F7947j129k086L370m164n97K265k787K106l840o299L47N301J0078K246n961
$$ 67947 66818 64732 68102 63938 63341 65606 62819 64925 61085 54786 55133 60434 70512 72758 66797
9165F6797k410q14L359l581L787j835M997K776q80o944k722j065O159M028L662
$$ 66797 64387 63573 66932 63351 67138 65303 70300 73076 72196 65252 62530 61465 67624 71652 75314
9150G5314j518o913r314j989P689J016l435N33R273N653K265r081p223K260R356
$$ 75314 73796 66883 57569 55580 63269 64285 60850 61383 70656 76309 78574 69493 62270 64530 73886
9135G3886j0549o543N275K262M523O365P577n03j918j778K180k572n958l649q20
$$ 73886 63337 56794 62069 64331 68854 75219 82796 82293 80375 78597 80777 78205 72247 68598 67778
9120F7778O513q63J03p147l500O071l582l986k59Q247M153m121k744m447K014
$$ 67778 74291 73428 73531 66384 62884 68955 65373 61387 61128 69375 73528 69407 66663 62216 64230
9105F4230l610r035K728J461r810l231Q427P283L571n867o205k60K327L022o86
$$ 64230 60620 51585 54313 55774 45964 42733 51160 58443 62014 56147 49942 49682 52009 55031 54345
9090E4345l10Q115nn362j268L753M459K631M714k53K712M892P928n886q339o792
$$ 54345 54035 62150 62145 56783 55515 59268 63727 66358 71072 70819 73531 78423 86351 80465 72126 65334
9074F5334L032m794p645k278M488j831k040k935N398K902M512l447p67l569l818
$$ 65334 68366 63572 55927 53649 58137 56306 54266 51331 56729 59631 64143 60696 59929 56360 52542
9059E2542r32q16L456L555N867j220m193n640j95j496L791O098j182L77q4l198
$$ 52542 51610 50794 54250 57805 63672 62452 58259 52619 52424 50928 54719 60817 59635 60012 59928 56730
9043E6730N515j165j128m000J907P80P26o27l48K098n289P06L696L477q316M114
$$ 56730 62245 61080 59952 55952 57859 58639 59365 58738 58390 60488 55199 55905 59601 63078 54762 58876
9027E8876K848N140O01K160p494j080K236m133m511l119o64Q05K209j202j0641
$$ 58876 61724 66864 67465 69625 62131 61051 63287 59154 54643 51524 50860 51665 53874 52672 42031
9012D2031l761l860O519R072k923J820M599j900M303M245L858L633k716l826j535
$$ 42031 38270 34410 40929 50001 47078 48898 53497 51597 55900 60145 64003 67636 64920 61094 59559
8997E9559n762k303l443k810L890l667k204j32k420L949M206L658l119j042L047
$$ 59559 53797 51494 48051 45241 49131 45464 43260 43128 40708 44657 48863 52521 49402 48360 51407
8982E1407J572M96k124l287O820r01P48m501l317k133M161R024N589K065Q9q997
$$ 51407 52979 53475 51351 48064 54884 53983 54731 50230 46913 44780 48941 57965 63554 65619 65708 56711
8966E6711m439M627m94K033m883l537J15P509L93j2496L31j352J277P329J90n018
$$ 56711 52272 56899 56405 58438 53555 50018 50133 57642 58035 45539 45870 44518 45795 53124 53314 48296
8950D8296n185m99O84l456M214L902K802N290N387J587M973k118m127K639n021
$$ 48296 43111 42612 43296 39840 44054 47956 50758 56048 61435 63022 67995 65877 61750 64389 59368
8935E9368q651L839N559M640j0013m325R988J0878m040r254M69O568q960J05O10
$$ 59368 50717 54556 60115 64755 54742 50417 60405 71283 67243 57989 58458 65026 56066 56171 56781
8920E6781N62Q24L30K227o947L22j0206J004L927M49j117L685J455L65j232K553
$$ 56781 57343 58167 58497 60724 53777 54099 43893 44897 48824 49273 48156 51841 53296 53661 52429 54982
8904E4982k648M597n215q904j691M478J799K256K638J47n290L343L359M810l3
$$ 54982 52334 56931 51716 42812 41121 45599 47398 49654 52292 52439 47149 50492 53851 58661 58628
8889E8628M596Q248J28o03j0387j262j011r337m797m79J1893O237L583J336k013
$$ 58628 63224 71472 71600 70997 60610 59348 58337 49000 44203 43724 55617 61854 65437 66773 64760
8874F4760n590J066k61L97N556l281k94j3687l970N561O814N124Q48j296Q631
$$ 64760 59170 60236 59975 60372 65928 62647 62353 48666 44696 50257 57071 62195 63043 61747 70378
8859G0378L589n522r117l678J144N502P90k294J421P576L552p0k74k237J945K389
$$ 70378 73967 68445 59328 55650 56794 62296 63086 60792 62213 69789 73341 73271 72997 70760 72705 75094
8843G5094M991M977k677K265O487k258Q59Q1o14J895J776m355o690P04n950k867
$$ 75094 80085 85062 82385 84650 91137 88879 89738 89819 89205 91100 92876 88521 81831 82535 76585 73718
8827G3718j5030O87Q737m02l097K54Q584L190K545J682j1186j0712l335L544L926
$$ 73718 58688 59375 68112 67710 64613 64867 73451 76641 79186 80868 69682 58970 55635 59179 63105
8812F3105M342J036O112p73m883m666k261K557k804P72N157l11j126Q21J069L860
$$ 63105 67447 68483 74595 73822 68939 64273 62012 64569 61765 62537 67694 67383 66257 67078 68147 72007
8796G2007n636N694M804P5Q85K656r589J322K032R02K918J3j589l05L228O048
$$ 72007 66371 72065 76869 76944 77829 80485 70896 72218 74250 75152 78070 78083 76494 76189 79417 85465
8780H5465P971r07p861k112M76q419j558K260L987r203n044k191R22r59J1801
$$ 85465 93436 92529 84668 82556 83032 74613 73055 75315 79302 70099 65055 62864 63786 62827 74628
8765G4628K736j180M070M15L551M117R50m008K188j484M725p4K195o733l009O693
$$ 74628 77364 76184 80254 80669 84220 88337 89287 85279 87467 85983 90708 90634 92829 86096 83087 89780
8749H9780J465m129j091q649N420L357j740K508J3127O695J530m498K368Q6p138
$$ 89780 91245 87116 86025 77376 82796 86153 84413 86921 100048 106743 108273 103775 106143 106229 99091
8734I9091k445j48O220N910p6L606n0K817O055K852J831K906L723J2765Q615N009
$$ 99091 96646 96498 102718 108628 108552 112158 112108 114925 120980 123832 125663 128569 132292 145057 153672 158681
8718A58681n29m014j0111j680j722j387J788M342n44r62k07r268m328j352O788
$$ 158681 158152 154138 144027 142347 140625 139238 141026 145368 144824 143862 143655 134387 130059 128707 135495
8703A35495L501l563j878J924N696P107Q917O334R7O83o45p19n715k950p08J141
$$ 135495 138996 135433 133555 135479 141175 148282 157199 163533 163630 164313 163668 162949 157234 154284 153576 154717
8687A54717P093l83K863J0434K083N35N050P228l299K482O531Q83K312j442k597
$$ 154717 161810 161427 164290 174724 176807 177342 182392 189620 186321 188803 195334 196217 198529 197087 194490
8672A94490N136J64L301J5013K0046N556m060o155q680j188Q059Lj640K205J299
$$ 194490 199626 199790 203091 218104 238150 243706 239646 233491 224811 223623 231682 231685 230045 232250 233549
8657B33549n859o522k865M281O746K968N650O297K598JL770M460Q086R769J7809
$$ 233549 227690 221168 218303 222584 229330 232298 237948 244245 246843 246844 250614 255074 263160 272929 290738
8642B90738J3938N065J8778J0438l281P099J2060M340j2958j2005l818j493J608
$$ 290738 304676 309741 328519 338957 335676 342775 354835 359175 346217 334212 330394 328901 330509
8629C30509J0578O427k827N169J2164P756J0507O858N776N541J0840J8063J2863
$$ 330509 341087 347514 344687 349856 362020 369776 380283 387141 392917 398458 409298 427361 440224
8616D40224J2619J2647N016Q633K2816J9792K4074J7898K5402M2698M4667L4070
$$ 440224 452843 465490 470506 479139 501955 521747 545821 563719 589121 631819 676486 710556
8604G10556L8410M1292N5656N8145P1605Q7244Q9088R9872J19298J35023J39305
$$ 710556 748966 790258 845914 904059 975664 1062908 1151996 1251868 1371166 1506189 1645494
8593A645494J20298J16495J21080J11553Q0490K6849l6348r2917j32703j40145
$$ 1645494 1765792 1882287 2003367 2114920 2195410 2222259 2185911 2092994 1960291 1820146
8583A820146j41827j39756j41252j35491j20270j02085q3403p6063o9693o0643
$$ 1820146 1678319 1538563 1397311 1261820 1141550 1039465 956062 879999 810306 749663
8573G49663n9708n1490m5875m4942k7606l3867k9424k7016j3108j7409k2810k0329
$$ 749663 689955 638465 592590 547648 520042 486175 456751 429735 416627 399218 376408 356079
8561C56079k1267r659k333j3576j2319j957o120q937m562k894n042L73r60m618
$$ 356079 334812 325153 322820 309244 296925 294968 288848 279911 275349 272455 267413 267786 266826 262208
8547B62208j0473j2396j1821r752j2142Q1o7j806m515q010K247j583r357j575
$$ 262208 251735 239339 227518 217766 205624 205705 205638 203832 199317 191307 193554 191971 182614 181039
8533A81039L969P168K057o580p287p091j983L244m898r748q016j875m631n774
$$ 181039 185008 192176 194233 187653 180366 173275 171292 174536 169638 159890 151874 149999 145368 139594
8519A39594O948P493k123k149n039K402j7j127l917l876l598k798J004n443l698
$$ 139594 146542 154035 151912 149763 144724 147126 147109 145982 142065 138189 134591 131793 132797 127354 123656
8504A23656m173O725P437L793j622n921n008o199p606l692n571j08J564O16l328
$$ 123656 119483 126208 133645 137438 135816 129895 124887 118688 111082 107390 101819 101711 103275 103891 100563
8489A00563J687M747k005r514k341j921J18j677M179p32l850k322L986L210k48
$$ 100563 102250 106997 104992 95478 93137 91216 91334 89657 93836 93104 89254 86932 90918 94128 93880
8474I3880l896k01L756Q813J492n412m089R281o198j1639m826N492M544L770J2
$$ 93880 89984 89783 93539 102352 103844 98432 94343 103624 97426 85787 80961 86453 90997 94767 94779
8459I4779q302p786L460M993j10j437M774N120m296j3935p720N545M428j467K752
$$ 94779 86477 78691 82151 87144 87034 85597 90371 95491 91195 77260 69540 75085 79513 78046 80798
8444H0798K560N398M176L480j0413j1473K743R10l253l001J641J96N465M056j329
$$ 80798 83358 88756 92932 96412 85999 74526 77269 78179 74926 71925 73566 73762 79227 83283 81954
8429H1954k872p414K989j863r151l269L332N253J296L18l59J637j239l846L373
$$ 81954 79082 71668 74657 72794 63643 60374 63706 68959 70255 70573 70214 71851 70612 66766 70139
8414G0139K850M249J899n64n784j473k00J356j007J18l766J565P011K300o078
$$ 70139 72989 77238 79137 78573 72789 71316 71116 72472 71465 71583 67817 69382 76393 78693 72615
8399G2615k172Q293M561o247q383j234k731J600N468J199l166n622K691P90m117
$$ 72615 70443 78736 83297 77050 68667 67433 64702 66302 71770 72969 69803 64181 66872 67662 63545
8384F3545j419J598K066K290M661L87m801l956q306p3K896l773m370n74K746K955
$$ 63545 62126 63724 65790 68080 72741 73128 68327 64371 56065 55992 58888 55115 50745 50171 52917 55872
8368E5872j582L443R238J757J349o60J789k853l636p790j814K954L71m309O810
$$ 55872 54290 57733 66971 68728 70077 69417 71206 68353 64717 56927 55113 58067 58438 54129 60939
8353F0939R088M82p457r216K636j374j513J674J355n34Q052M989j698o896k900
$$ 60939 70027 70509 63052 53836 56472 55098 53585 55259 56614 56080 64132 69121 67423 60527 57627
8338E7627p066O55P581O155j938j204N198n20K214p064m709J075P109K452j95
$$ 57627 50561 51216 58797 64952 63014 61810 67008 66488 68702 61638 56929 58004 65113 67565 67370
8323F7370j98O777O323j197k563o160l496l130J530o382K708M568N679O634l978
$$ 67370 67172 73949 80272 79075 76512 70352 66856 63726 65256 58874 61582 66150 71829 78463 74485
8308G4485l215l374o418p084l625K757M367R57o237J180O392O436j1030l283n06
$$ 74485 71270 67896 61478 54394 50769 53526 57893 58850 52613 53793 60185 66621 55591 52308 51802
8293E1802N833O949q05j218k449J969K538o338o723M165J877k790k899K345P657
$$ 51802 57635 64584 63779 62561 60112 62081 64619 58281 51558 55723 57600 54810 51911 54256 61913
8278F1913k661p164j900o51J257J3940O915J77k248K814K582p279j882O779J1591
$$ 61913 59252 52088 50188 49537 50794 64734 71649 71826 69578 72392 74974 67695 65813 72592 84183
8263H4183Q283J2295N630p140j1700p153r026n179l148nm003m130L325J213j205
$$ 84183 92466 104761 110391 103251 91551 84398 75372 70193 67045 67040 63037 58907 62232 63445 62240
8248F2240k774j511P913l47o378O10j968j41l588m366K9J115L407J539M101K564
$$ 62240 59466 57955 65868 65521 59143 59753 57785 57644 54056 49690 49719 50834 54241 55780 59881 62445
8232F2445N353n870m757J12M198M970O302K261q032k871K393P362J3448J5970
$$ 62445 67798 61928 57171 57283 61481 66451 72753 75014 66982 64111 66504 73866 87314 103284
8218A03284K745j2076j8459p182m848k893q119j995q29K944j105r57Q10K378k011
$$ 103284 106029 93953 75494 68312 63464 60571 52452 50457 49628 52572 51467 50510 51320 53698 51687
8203E1687r74N43o02N489K574p937m135L162K40j08l193j594l861l93M40K775
$$ 51687 50713 51256 50654 56143 58717 50780 46645 49807 50047 49939 46746 45152 41291 40898 41338 44113
8187D4113k002Q11R44j751o134j251J389R105M248r94J071J727K121m965n534
$$ 44113 42111 42922 43866 42115 35981 34730 36119 45224 49472 48478 49549 51276 53397 48432 42898
8172D2898M832K196o88K488k615p575l591K5K97M15l900O849K777L108J16L082
$$ 42898 47730 49926 49238 51726 49111 41536 37945 37970 38267 38682 34782 41631 44408 47516 47632 50714
8156E0714p49q381J146L901j58l255k410M08J559m266o053O117O587n336M150
$$ 50714 49965 41584 42730 46631 46473 43218 40808 41216 42775 38509 32456 38573 45160 39824 43974
8141D3974J272l421m930r266N52J466K817O430j450k479k345K671O880N282L654
$$ 43974 45246 41825 36895 27629 28181 29647 32464 38894 37444 34965 32620 35291 42171 47453 51107
8126E1107K12K876J5503K212n707k899o770l384j869M630n78L169n26J193L381
$$ 51107 51319 54195 69698 71910 66203 63304 56534 53150 51281 55911 55333 58502 57976 59169 62550
8111F2550M01Q828l731L001o78q227j756K272m743m319Q031L855l771Q88j588
$$ 62550 62951 71779 68048 71049 70371 62144 60388 62660 57917 53598 61629 65484 61713 62601 61013
8096F1013j34K964J875J641m372k243o125J332n86L186M993l419K149P917p29
$$ 61013 60879 63843 65718 67359 62987 60744 54619 55951 55365 58551 63544 60125 62274 70191 69462
8081F9462j853k577k362J547J487M732p59o159j342K72P377L518R68N922J580
$$ 69462 67609 65032 62670 64217 65704 70436 69677 63518 62176 62448 69825 73343 74311 80233 81813
8066H1813L526n943m650N359P174O633P876K715R52m66l777p46Q21m155l397Q259
$$ 81813 85339 79396 74746 80105 87279 93912 101788 104503 105455 104989 101212 100466 101287 97132 93735 101994
8050A01994N370L297K346L162P270J695p263j189J1182J5340J1922R248N97K082
$$ 101994 107364 110661 113007 116169 123439 125134 117871 116682 127864 143204 155126 164374 164971 167053
8036A67053M365j569q99K363J510n281m197L733j262p824l64O833Q49o731K557
$$ 167053 171418 169849 168950 171313 172823 167542 163345 167078 165816 157992 157628 164461 165310 158579 161136
8021A61136O736P601M445L479R55o04k009R52Q004J3530N175O200J118J074k714
$$ 161136 167872 175473 179918 183397 184352 183748 181739 182691 190695 204225 209400 215600 216718 217792 215078
8006B15078o376Q887J1822J1304P299Q070J6259J3439K0587K7700L0473L2986
$$ 215078 208702 217589 229411 240715 248014 256084 272343 285782 306369 334069 364542 397528
7994C97528K0018N006k1448k7591k0263k2237j7597r647j0383q371j1881r196
$$ 397528 417546 422552 401104 373513 353250 331013 313416 303769 293386 285015 273134 263938
7982B63938r099p309J255q143m939m352J438L499k22k335N302J614Q128O819J6377
$$ 263938 254839 247530 248785 240642 235703 231351 232789 236288 236066 233731 239033 240647 248775 255594 271971
7967B71971K0368J5686R282M375O799O564J0655L355K933L498J517J2133J2973
$$ 271971 292339 308025 317307 321682 328481 335045 345700 349055 351988 355486 357003 369136 382109
7954C82109J0806P530J0612Q173l088j7935q773m316o9p135k0043j1840j0425
$$ 382109 392915 400445 411057 419230 416142 398207 389434 385118 385049 377914 357871 346031 335606
7941C35606j2478j5515r154q350m231j157k393j0387k371p153j4080l198N487
$$ 335606 323128 307613 298459 290109 285878 284721 282328 271941 269570 262417 248337 245139 250626
7928B50626l158M18O075N237P131L431J464M238N206M846p410p089j132J902k443
$$ 250626 247468 247886 253961 259198 266329 269760 271224 275462 280668 285514 278104 271015 269883 271785 269342
7913B69342j366l32M614L32r886n856l547m893l003m510q042o953j1173j6567
$$ 269342 267976 267644 272258 272590 262704 256848 253301 248408 245405 240895 232853 225900 214727 198160
7899A98160m056k213n734Q67k679p372p214o551n053m316p301q154p276M183o72
$$ 198160 194104 191891 186157 187024 184345 176973 169759 163208 158155 153839 146538 138384 131108 135291 134619
7884A34619p151l36m771l817m651K030M915M679k44n570p514L131L010k591n353
$$ 134619 127468 127132 122361 118544 113893 115923 120838 125517 125273 119703 112189 115320 118330 115739 110386
7869A10386o008n106j151n728J208K261n372j747o539K575P63J856k771M718J396
$$ 110386 104378 99272 98121 92393 93601 95862 90490 88743 82204 84779 85542 87398 84627 89345 90741
7854I0741L937m577j0501k306r02M468l546q339j3343p48n97O62o112l219M137
$$ 90741 94678 90101 79600 77294 76392 80860 77314 68975 55632 54884 54287 54949 48837 45618 49755
7839D9755K976k70l599j396n763M618J61P531K49l320k094k622m764P19P670n347
$$ 49755 52731 52461 48862 47466 41703 46321 46482 54013 54262 50942 48848 46226 41462 42181 49851 44504
7823D4504p402k089K887r257o691l935K75O844K05l078M31K320L55l042l391K063
$$ 44504 37102 35013 37900 28643 21952 18017 18292 25136 25341 22263 22694 25014 25369 22327 18936 20999
7807B0999J710l04Q02k612P03K154o453N168J0759O575q857q231J343L328K917
$$ 20999 22709 22405 23207 20595 21298 23452 16999 22167 32926 39501 30644 22413 23756 27084 30001
7792C0001J912j989n243J195k818n407p920L923O297M26n221l222j083L805m89
$$ 30001 31913 29924 24681 25876 23058 17651 9731 13654 19951 20377 15156 11934 10851 14656 14167
7777A4167m554m229l700l533N166M266K771N772M090n050n591J465K201K879j434
$$ 14167 9613 5384 1684 -1849 3317 7583 10354 16126 20216 15166 9575 11040 13241 16120 14686
7762A4686o328M144Q91J782k579k295N088J689L212j75r538j687K372m598k109
$$ 14686 8358 12502 13393 15175 12596 10301 15389 17078 20290 20115 10577 8890 11262 6664 4555
7747D555m270j1719M420O154M621N80P183J933k895n577n761K982K686L213L501
$$ 4555 285 -11434 -7014 -860 3761 4341 11524 13457 10562 4985 -776 2206 4892 8105 11606
7732A1606j017l333l686K747J33j369r89q77j086K02L234n241J172J559J316n550
$$ 11606 10589 7256 3570 6317 6450 5081 4092 3215 2129 2331 5565 324 1496 3055 4371 -1179
7716a179n07M140K941m3o059O06N592R67J100m277L431N093r327o97R284L74j640
$$ -1179 -1686 2454 5395 5352 -707 -101 5491 6458 7558 3281 6712 11805 2478 1781 11065 11439 9799
7699I799j344j76j0242m506J384O062M25J98J687k815j35m164k872M353j481L833
$$ 9799 8455 8279 -1963 -6469 -5085 977 1402 1600 3287 472 337 -3827 -6699 -2346 -3827 6
7683FO52m001O67K422J250j057k042j083q50P345J037K813k941m851L647m518
$$ 6 658 -3343 -2676 -254 996 -61 -2103 -3186 -4036 3309 4346 7159 4218 -633 3014 -1504
7667a504L370O68q818p55L164J546j247k799P581P282M054P994p146q717p410
$$ -1504 1866 2534 -6284 -7039 -3875 -2329 -3576 -6375 1206 8488 12542 20536 13390 4673 -2737
7652b737J152J80J278N023k931r002l57J607L538N482k54J711K540L057k377l521
$$ -2737 -1585 -1405 -127 4896 1965 -7037 -7394 -5787 -2249 3233 2979 4690 7230 10287 7910 4389
7636D389l289p57l32K024J412J110k955k47M356k147q351m224K304R591k374L056
$$ 4389 1100 343 11 2035 3447 4557 1602 1355 5711 3564 -4787 -9011 -6707 2884 510 3566
7620C566J092n378j701K395j516l813k767J43L488K250K253N25j745K045k344
$$ 3566 4658 -720 -2421 -26 -1542 -5355 -8122 -7979 -4491 -2241 12 537 -1208 837 -1507
7605a507l806O578M57r53O292M711m031j151j250p553j693K191k819k620l851
$$ -1507 -5313 1265 1722 769 7061 11772 7741 6590 5340 -2213 -3906 -1715 -4534 -7154 -11005
7590a1005j304L569k868O346J2840j00p118o16J281k817J0524n814n375M070K506
$$ -11005 -12309 -8740 -11608 -5262 7578 7478 360 -256 1025 -1792 8732 2918 -2457 1613 4119
7575D119k468k695j590K754P529p228p133J958R148R508L454k206r271l708K030
$$ 4119 1651 -1044 -2634 120 7649 421 -6712 -4754 4394 13902 17356 15150 5879 2171 4201
7560D201l475M706l828k689J660M773p15j847n849m720O967N069k778m433o998
$$ 4201 726 5432 1604 -1085 575 5348 4633 2786 -3063 -7783 -816 4253 1475 -2958 -9956
7545i956j008M847j881K555L875N12q063k127P632K480j561K009m80m336K327
$$ -9956 -10964 -6117 -7998 -5443 -1568 -1056 -9119 -11246 -3614 -1134 -2695 -686 -1166 -5502 -3175
7530c175k384k932l304K608P030O413j983p652k107N78k098J230L640J621n055
$$ -3175 -5559 -8491 -11795 -9187 -2157 4256 2273 -5379 -7486 -6908 -9006 -7776 -4136 -2515 -7570
7515g570K91N665K371J303l556K05l742j64O203J342k99J928m457j1061r14oO984
$$ -7570 -7279 -1614 757 2060 -1496 -1291 -5033 -5197 1006 2348 2049 3977 -480 -11541 -12455 -12461 -5477
7498e477O568K890P736K681o049r850p76K016J345J96L346J595n7k729o355n571
$$ -5477 1091 3981 11717 14398 8349 -1501 -2277 -261 1084 1280 4626 6221 6164 3435 -2920 -8491
7482h491P61K366K389K590l355L863J064M233o66o118j964l487O42k651k866O402
$$ -8491 -7730 -5364 -2975 -385 -3740 123 1187 5420 4754 -1364 -3328 -6815 -6173 -8824 -11690 -5288
7466e288M758K632l42j047l113L44n381N547R882L477j1303j643r890o180K452
$$ -5288 -530 2102 1760 713 -2400 -2056 -7437 -1890 7992 11469 166 -1477 -11367 -17547 -15095
7451a5095J5510O163L803Q65p325K166k120k496J144O32K04m804r692n275J117
$$ -15095 415 6578 10381 11246 3921 6087 3967 1471 2615 3247 3451 -1353 -11045 -16320 -15203
7436a5203N684M607Q29o875n933l259P475O74K453J237j09O978P437J06m916K812
$$ -15203 -9519 -4912 -4083 -10958 -16891 -20150 -12675 -12001 -9548 -8311 -8420 -1442 5995 6101 1185 3997
7420C997j683Q80L093j099j60l741k834j768k56j286k284L832J359O19n292m177
$$ 3997 2314 3194 6287 5188 5028 1287 -1547 -3315 -3571 -4857 -7141 -3309 -1950 -1331 -6623 -10800
7404a0800m146O898P375L250o571R46k784k606J073m05K848J528q930m356J031
$$ -10800 -14946 -8048 -673 2577 -3994 -3048 -5832 -8438 -7365 -7770 -4922 -3394 -12324 -16680 -15649
7389a5649l112j672L748R241N951J729o957L335P167N04n915p798l676M860N149
$$ -15649 -18761 -20433 -16685 -7444 -1493 236 -6721 -3386 3781 4285 -1630 -9428 -13104 -8244 -3095
7374c095N699p237l395n977N692O627J402M120k320l012r23J108m92j889j559
$$ -3095 2604 -4633 -8028 -14005 -8313 -1686 -284 3836 1516 -1496 -2419 -1311 -1803 -3692 -5251
7359e251m200K775L292m297J862j152R61k380n373m41L763L869m480j134M30N755
$$ -5251 -9451 -6676 -3384 -7681 -5819 -6971 -6010 -8390 -13763 -14204 -10441 -6572 -11052 -12186 -11756 -6001
7343f001j330K855o894K851O843L849K112k542P090L169J316p162m376k809p708
$$ -6001 -7331 -4476 -11370 -8519 -1676 2173 4285 1743 8833 12002 13318 6156 1780 -1029 -8737
7328h737O80K463j632J529q276q15M529J980j126O19M989J6491K077r182j3182
$$ -8737 -8057 -5594 -7226 -5697 -13973 -14788 -10259 -8279 -9405 -8786 -3797 12694 14771 5589 -7593
7313g593j125K680l135l117J509Q104P920q276k184J896M8k275P245M296K408
$$ -7593 -8718 -6038 -9173 -12290 -10781 -2677 5243 -3033 -5217 -3321 -3273 -5548 1697 5993 8401
7298H401l076k01j78j934R639P803k695l526m335r608j4004l335Q537J165l865
$$ 8401 5325 5124 4946 3012 12651 20454 17759 14233 9898 290 -13714 -17049 -8512 -7347 -11212
7283a1212q221q23L828K002M468M906j802l617j29P154O075m69l596j598K158
$$ -11212 -19433 -20256 -16428 -14426 -9958 -5052 -6854 -10471 -10600 -3446 2629 2160 -1436 -3034 -876
7268h76K620K897l142j784j534J650L908l396q384M125M852O11j0650o627M443
$$ -876 1744 4641 1499 -285 -1819 -169 3739 343 -8041 -3916 936 1547 -9103 -15730 -11287
7253a1287R391o38j259L670J213K795k221l530l433J968K017K682l953k965J23
$$ -11287 -1896 -2534 -3793 -123 1090 3885 1664 -1866 -5299 -3331 -1314 1368 -2585 -5550 -5427
7238e427R43j357j267j83R273k115J351m035K815K885n426m635n26j0018R310
$$ -5427 -4484 -5841 -7108 -7291 1982 -133 1218 -2817 -2 2883 -2543 -7178 -7704 -17722 -8412
7223h412R690j139n181j31j000M71J0735O042p131q170J292Q182k174n437R93
$$ -8412 1278 139 -5042 -5173 -6173 -5702 5033 11075 3944 -4226 -2934 5248 3074 -2363 -1370
7208a370m676L325R495J4l939k636K751m536p332N841J426m002m418O570N254
$$ -1370 -6046 -2721 6774 6788 2849 213 2964 -1572 -8904 -3063 -1637 -5639 -10057 -3487 1767
7193A767j498n007p044K124R907J271l409k613L598n885o913k371N41Q732Q013
$$ 1767 269 -4738 -11782 -9658 249 1520 -1889 -4502 -904 -6789 -13702 -16073 -15532 -6800 1213
7178A213N432k629l858N487j861j916J18J916L317k025j671l712J093n072R59
$$ 1213 6645 4016 158 5645 3784 1868 1986 3902 7219 5194 3523 -189 904 -4168 -3209
7163c209J845P10L078L881k384j440k003M150K646M550j770o260k261j684P2M115
$$ -3209 -1364 -654 2424 6305 3921 2481 478 4628 7274 11824 10054 3794 1533 -151 -79 4036
7147D036n746k166l432k452M486j522P56K160j137l941l430K495j278K954N505
$$ 4036 -1710 -3876 -7308 -9760 -5274 -6796 -6040 -3880 -5017 -8958 -12388 -9893 -11171 -8217 -2712
7132b712K544l18K074M891l12o061K375J1274m862o4p792n944K462q614k945M312
$$ -2712 -168 -486 1588 6479 6167 106 2481 13755 8893 8829 1037 -4907 -2445 -11059 -14004 -9692
7116i692J0750q21l725m599j597N910R407l901n382J888L585P18l625O5K495J970
$$ -9692 1058 237 -3488 -8087 -9684 -3774 5633 1732 -3650 -1762 1823 2541 -1084 -1019 1476 3446
7100C446k584k745J478j86J822R554o633j0802m441R59P44M490J0548N076P52
$$ 3446 862 -1883 -405 -591 1231 10785 4152 -6650 -11091 -10132 -9388 -4898 5650 10726 11478
7085A1478N79p75j802j708o64M437k719o608k357J878k955m242j089L203R730
$$ 11478 12057 11282 9480 7772 7108 11545 8826 2218 -139 1739 -1216 -5458 -6547 -3344 6386
7070F386L730p857q324m173l484Q572N233K361K239K787k53n638j1590J793O427
$$ 6386 10116 2259 -6065 -10238 -13722 -5150 83 2444 4683 7470 7217 1579 -10011 -8218 -1791
7055a791P93o114L22O641K043L375o342j602j692j645J204K536J034o029M972
$$ -1791 -998 -7112 -6790 -149 1894 5269 -1073 -2675 -4367 -6012 -4808 -2272 -1238 -7267 -2295
7040b295Q448M885J038j724o495k514o685m709L619L300K488K829N80K961J467
$$ -2295 6153 11038 12076 10352 3857 1343 -5342 -10051 -6432 -3132 -644 2185 2765 5726 7193
7025G193J250P5n213k770l891K877K123k659q32j844l940L962k86Q32j494k85
$$ 7193 8443 8518 3305 535 -3356 -479 1644 -1015 -1847 -3691 -7631 -3669 -3955 -3123 -4617 -4902
7009d902L680N275O80l011n508K232q92n113P2M028l384o468n29P245j579l139
$$ -4902 -1222 4053 4733 1722 -3786 -1554 -2446 -7559 -7487 -3459 -6843 -13311 -13840 -6595 -8174 -11313
6993a1313L186M261N837N30q07K089p846k520l76m663P687L020p837m606K424
$$ -11313 -8127 -3866 1971 2501 1694 3783 -4063 -6583 -6959 -11622 -3935 -915 -8752 -13358 -10934
6978a0934r01m445M861M246QN068k645J857K998r07J751m455l258O240L511r553
$$ -10934 -11835 -16280 -11419 -7173 -7165 -2097 -4742 -2885 113 -794 957 -3498 -6756 -516 2995 -6558
6962f558L399M234N391J530l300k666N997J252j91o795j844N761l490m565n408
$$ -6558 -3159 1075 6466 7996 4696 2030 8027 9279 9088 2293 449 6210 2720 -1845 -7253
6947g253o27L979O34M168J414l47O775L84j0375j823P174J055j36K491J666N129
$$ -7253 -7880 -3901 -3267 901 2315 1968 8743 9127 -1248 -3071 4103 5158 5022 7513 9179 14308
6931A4308q34k850r386K413q04p181l762L260L620m899J09L876l710K789R65O20
$$ 14308 13474 10624 1238 3651 2847 -4334 -8096 -4836 -1216 -6115 -6006 -2130 -5840 -3051 -2086 -1466
6915a466m601J427O668q09n54L528q340K365O352p110p857Q23K428l434k673K866
$$ -1466 -6067 -4640 2028 1219 665 4193 -4147 -1782 4570 -2540 -10397 -9574 -7146 -10580 -13253 -10387
6899a0387P971k629Q2O992N89r582K789M280M242q755j442l39m546K018R78M44
$$ -10387 -2416 -5045 -4963 2029 2618 -6964 -4175 105 4347 -4408 -5850 -6189 -10735 -8717 -7739 -7295
6883g295O507j886m48J133j441L017p90M587J568n754j229K032j96K26L660j784
$$ -7295 -788 -2674 -3122 -1989 -3430 -413 -1203 3384 4952 -802 -2031 1 -195 31 3691 1907
6867A907k086r20o317O819O464j248m830O6J684P15j619o554p17L841J90k606
$$ 1907 -179 -1099 -7416 -597 5867 4619 -211 -145 1539 2254 635 -5919 -6636 -2795 -2605 -5211
6851e211O509j077j636q99n960O65K330j243K303k712m956q39O381L154l715q47
$$ -5211 1298 221 -1415 -2314 -8274 -7609 -5279 -6522 -4219 -6931 -11887 -12726 -6345 -3191 -6906 -7753
6835g753O232n394m329K100Q709L369L936n858m970o18J0277Q99o778J510M853
$$ -7753 -1521 -6915 -11244 -9144 -435 2934 6870 1012 -3958 -4576 5701 6600 -178 1332 6185
6820F185K168k759p340o488L42J300l960j258O461k4k052J0118L531n850O14k669
$$ 6185 8353 5594 -1746 -8234 -7892 -6592 -10552 -11810 -5349 -5373 -7425 2693 6224 374 988 -1681
6804a681l269r82o73L494K806J179K022o652j782L255J136k60n773q3k180P398
$$ -1681 -4950 -5932 -6605 -3111 -305 874 2896 -3756 -5538 -2283 -1147 -1407 -7180 -7263 -9443 -2045
6788b045J0301R124o372n711L060K531P92k803n958R83m914m221l77R77L022j758
$$ -2045 8256 17380 11008 5297 8357 10888 11680 8877 2919 3902 -1012 -5233 -5610 -4633 -1611 -3369
6772c369O36n12M27k964J105P048m600p421n120L606K913O071R7J422K860J964
$$ -3369 -2733 -3245 -2818 -5782 -4677 2371 -2229 -9650 -14770 -11164 -8251 -2180 -2083 -661 2199 4163
6756D163M092K35j601k027j0083m697j733J294K624P291M116P078k824k596k350
$$ 4163 8255 8490 6889 4862 -5221 -9918 -11651 -10357 -7733 -442 3674 10752 7928 5332 2982
6741B982N371j828J369R76l606R39L680L076K248n79M873N814j77N837J7845J6767
$$ 2982 8353 6525 7894 8870 5264 6203 9883 12959 15207 14628 19501 25315 25138 30975 48820 65587
6725F5587K9574L1197K4202k1793l1785k4054j8453j7404j4577J446j554o704
$$ 65587 95161 126358 150560 128767 96982 72928 54475 37071 22494 23940 22386 15682
6713A5682L810K173K10j93l689n469o66N307p88m287k713Q783Q78n723p426m060
$$ 15682 19492 21665 21875 21682 17993 12524 11858 17165 16377 12090 9377 18160 19038 13315 5889 1829
6697A829J564Q942K242n962n583j064M388N91P63j112Q74n97n368j558N855R99
$$ 1829 3393 12335 14577 8615 3032 1968 6356 6947 7710 6598 7472 6875 1507 -51 5804 6803
6681F803n236m413m825j460k137L060M253M603L842k900j051k006M33k225N856
$$ 6803 1567 -2846 -7671 -9131 -11268 -8208 -3955 648 4490 1590 539 -1467 -1034 -3259 2597
6666B597K597K347m064l663m68P407m845j469K28l910J268L53k562k606l382l143
$$ 2597 5194 7541 3477 -186 -654 6753 1908 439 667 -3243 -1975 -1622 -4184 -6790 -10172 -13315
6650a3315P28L454L450J886K387j19j790o139J750K663l215M4r84k348L291N693
$$ -13315 -12587 -9133 -5683 -3797 -1410 -1529 -3319 -9458 -7708 -5045 -8260 -8216 -9200 -11548 -8257 -2564
6634b564M902m039j0621j086L539k66L055K678P128K771l584r16k96l238J988
$$ -2564 2338 -1701 -12322 -13408 -9869 -10135 -7080 -4402 2726 5497 1913 997 701 -2537 -549
6619e49k221p366j564N456P310N741M019Q29l903J151Q5l963O013Q058O134J5533
$$ -549 -2770 -10136 -11700 -6244 1066 6807 10826 11655 7752 8903 8988 5025 11038 19096 25230 40763
6603D0763K8913K1727j9666k7403j8239q839n637p6p08o14K788K754o534n69N766
$$ 40763 69676 91403 71737 44334 26095 17256 11619 11543 10835 10221 13009 15763 9229 8660 14426
6588A4426m260n905J959K286j752n9m63m105j1451K467O377L466O020L865j105
$$ 14426 10166 4261 6220 8506 6754 6695 6232 2127 -9324 -6857 -480 2986 9006 12871 11766
6573A1766j258k045r70o092o77N618l233K215Q60K253p998m620k640N460N819
$$ 11766 10508 8463 7493 1401 724 6342 3109 5324 6184 8437 439 -4181 -6821 -1361 4458
6558D458m504q73k203j073J113p13l17k631k653M538p7M355m226O86L228k711
$$ 4458 -46 -919 -3122 -4195 -3082 -3795 -4112 -6743 -9396 -4858 -4935 -580 -4806 -4120 -892 -3603
6542c603K315L042N255o229j227K918K175L44r499p79m87N53J0492N365j726q089
$$ -3603 -1288 1754 7009 780 -447 2471 4646 4990 -4509 -5288 -5775 -5222 5270 10635 8909 820
6526H20l13l83n7J727L093j000o824J105r37M224m96l562j094k360M786P5j619
$$ 820 507 124 67 1794 4887 3887 -2937 -1832 -2769 1455 959 -2603 -3697 -6057 -1271 -1196 -2815
6509b815r45O17P77k300m300L244N051K600r89r6l69k991N641m37k227L020k446
$$ -2815 -3760 -3143 -2366 -4666 -8966 -5722 -671 1929 940 844 475 -2516 3125 2688 461 3481 1035
6492A035l767k359K290m360P52j024L820k110O63N80k056J920K367K641K600o060
$$ 1035 -2732 -5091 -2801 -7161 -6409 -7433 -3613 -5723 -5060 -4480 -6536 -4616 -2249 392 2992 -3068
6476c068L42J78P058m26n140P22O949q97k323N745L311K204P370l301r978r034
$$ -3068 -2726 -2548 4510 4084 -1056 -334 6615 5718 3395 9140 12451 14655 22025 18724 8746 -288
6460b88k079J343n538p748N00J679N15N055N132J30N49K281m990p000l59K015
$$ -288 -2367 -1024 -6562 -14310 -13810 -12131 -11616 -6561 -1429 -1299 -750 1531 -3459 -10459 -10818 -8803
6444h803j750Q964P992M100j028o1k975l713n242p23j278j153o43J577P81O131
$$ -8803 -10553 -1589 6403 10503 9475 9414 6439 2726 -2516 -3239 -4517 -5670 -6313 -4736 -3955 2176
6428B176j407N99J408o152j497M113K078j741K027l299r83N967p206n174P71k043
$$ 2176 769 1368 2776 -3376 -4873 -760 1318 -423 1604 -1695 -2678 3289 -3917 -9091 -8320 -10363
6412a0363k289n73P56r207M083Q990J406M881L054M22l11p19O279j938m850o979
$$ -10363 -12652 -13225 -12469 -21676 -17593 -8603 -7197 -2316 738 1160 849 130 6409 4471 -379 -7358
6396g358j079k608K123j78l72Q155j672k499L392k662k277P370l803L26J590j938
$$ -7358 -8437 -11045 -8922 -9100 -9472 -1317 -2989 -5488 -2096 -4758 -7035 335 -3468 -3142 -1552 -3490
6380c490l192J850L59l730k529K519o50k330K111N629M94m169m536j877M097J1358
$$ -3490 -6682 -4832 -4473 -8203 -10732 -8213 -8863 -11193 -9082 -3453 -2959 -7128 -11664 -13541 -9444 1914
6364A914N857l564r5j0595j689N575o05n81P436P689n212j280j64l608l318j880
$$ 1914 7771 4207 4112 -6483 -8172 -2597 -3202 -3783 3653 11342 6130 4850 4686 1078 -2240 -4120
6348d120k882n680L118L585l904J813K078j657j015l290L722M040j936K457n203
$$ -4120 -7002 -12682 -9564 -5979 -9883 -8070 -5992 -7649 -8664 -11954 -8232 -4192 -6128 -3671 -8874
6333h874p28N200M442M395K297n60j57o764q117n864M697J796L100N974m398k287
$$ -8874 -9602 -4402 40 4435 6732 6172 6015 -749 -8866 -14730 -10033 -8237 -5137 837 -3561 -5848
6317e848Q722k079J541M220K014k671k231P085K336k668j200m369K627M691l230
$$ -5848 2874 795 2336 6556 8570 5899 3668 10753 13089 10421 9221 4852 7479 12170 8940
6302H940j0810l596l157L27P566N93n801L081O470j324k679k252l501M82K636
$$ 8940 -1870 -5466 -8623 -8296 -730 -137 -5938 -2857 3613 2289 -390 -2642 -6143 -5661 -3025
6287c025R47K650l145l710qN812P445K572M11j829L256M486l44m197o768p053
$$ -3025 -2078 572 -2573 -6283 -6291 -479 6966 9538 9949 8120 11376 15862 15518 11321 4553 -2500
6271b500L559O795K035l420m181J79l869r651K212N038M36M796n647p57J680K862
$$ -2500 1059 7854 9889 6469 2288 2467 -1402 -11053 -8841 -3803 -3367 1429 -4218 -4975 -3295 -433
6255d33n92m014J548m820n29p521M109Q450N823l693l95J253K11m442o473P07
$$ -433 -1025 -5039 -3491 -8311 -8840 -16361 -12252 -3802 2021 -1672 -2067 -814 -603 -5045 -11518 -10811
6239a0811J123n311N744K241J297r03L255M991n011m141L048K127K463l081q910
$$ -10811 -9688 -14999 -9255 -7014 -5717 -6620 -3365 1626 -3385 -7526 -4478 -2351 112 -2969 -11879
6224a1879K458L131L080j86J394J170n676N121M008n08j116O910j881k233n628
$$ -11879 -9421 -6290 -3210 -3396 -2002 -832 -6508 -1387 2621 2113 997 7907 6026 3793 -1835
6209a835K665J0195M283k954p698l932j487r05M629p33l852m657K196M933L585
$$ -1835 830 11025 15308 12354 4656 724 -763 -1668 2961 2228 -1624 -6281 -4085 848 4433
6194D433o130k150P856L020R31n513o605M971o72o810q826M319j63R342M938M49
$$ 4433 -1697 -3847 4009 7029 7960 2447 -4158 813 141 -6669 -15495 -11176 -11339 -1997 2941 3390
6178C390p62k852m469j06J362j684l993o217Q869R03P416M333m493k252K753J623
$$ 3390 2628 -224 -4693 -4799 -3437 -5121 -9114 -15331 -6462 -5559 1857 6190 1697 -555 2198 3821
6162C821J057K315J913m184j958m406n686k274R031L252k748m5M209k778M175
$$ 3821 4878 7193 9106 4922 2964 -1442 -7128 -9402 -371 2881 133 88 4297 1519 5694
6147E694j276k575K773N895l274mJ422l055p601j319K830m68m862o268l102R84
$$ 5694 4418 1843 4616 10511 7237 7233 8655 5600 -2001 -3320 -490 -958 -5820 -12088 -15190 -14206
6131a4206j900K371K583K202K323K285O272L876n295n07L057j353l70j865N12
$$ -14206 -16106 -13735 -11152 -8950 -6627 -4342 1930 5806 511 4 3061 1708 1338 -527 -15
6116a5L197J853n279N44K209K538r58l271k004j884M191k014l567J944j713n811
$$ -15 3182 5035 -244 300 2509 5047 4089 818 -1186 -3070 1121 -893 -4460 -2516 -4229 -10040
6100a0040n7O418j051j216l737l109l014K624O16J853M242k830m971N492K578
$$ -10040 -10097 -3679 -4730 -5946 -9683 -12792 -15806 -13182 -12566 -10713 -6471 -9301 -14272 -8780 -6202
6085f202k563N823p14m324L297N254K402m080k315k936J308L087K404l8M998J381
$$ -6202 -8765 -2942 -3656 -7980 -4683 571 2973 -1107 -3422 -6358 -5050 -1963 441 403 5401 6782
6069F782k408J842k334l130n891j33k721L786N085k745j88r34l105O167L852l130
$$ 6782 4374 6216 3882 752 -5139 -5272 -7993 -4207 878 -1867 -2055 -2989 -6094 73 3925 795
6053G95L232P54n010m333n18j320q06K18L665K03j166O95k503J443K492M663k434
$$ 795 4027 4781 -229 -4562 -5080 -6400 -7206 -6988 -3323 -3120 -4286 -3591 -6094 -4651 -2159 2504 70
6036G0r566k142J058O49L708O726R89l236K720M996M7o292p383L959L104l256
$$ 70 -9496 -11638 -10580 -9931 -6223 503 1492 -1744 976 5972 6019 -273 -7656 -3697 -593 -3849
6020c849k188J17R39l81N18R69M833l356k034L513J490J798p78O56K837j114l211
$$ -3849 -6037 -5920 -4981 -5362 -4844 -3875 958 -2398 -4432 -919 571 2369 1591 2247 5084 3970 759
6003G59J860j315q967q44O425O859p23m421L790j076o061n306o78N239N533K962
$$ 759 2619 1304 -7663 -8507 -2082 4777 4054 -367 3423 2347 -3714 -9020 -9698 -4459 1074 4036
5987D036m872o568J757n67K462K449P77L523j55J543k565p068k938P668K141o657
$$ 4036 -836 -7404 -5647 -6214 -3752 -1303 -526 2997 2842 4385 1820 -5248 -8186 -518 1623 -5034
5971e034k053P864K151K17m983Q56Q50o059N550N892l513j827l25r859l816L473
$$ -5034 -7087 777 2928 3145 -1838 -982 -132 -6191 -641 5251 1738 -89 -414 -10273 -14089 -10616
5955a0616J868j335K633O866N288k72o903l106K049j829k590J718J805m604n10
$$ -10616 -8748 -10083 -7450 -584 4704 4432 -2471 -5577 -3528 -5357 -7947 -6229 -4424 -9028 -9538
5940i538L038J502M566R542o716r502N518L070L93k267j874l281M992M490j667
$$ -9538 -6500 -4998 -432 9110 2394 -7108 -1590 1480 1873 -394 -2268 -5549 -557 3933 2266
5925B266p095j220K283L887L945n869o673R682l291n831m96P114L433n36l548
$$ 2266 -4829 -6049 -3766 121 4066 -1803 -8476 1206 -2085 -7916 -8412 -1298 2135 1599 -1949
5910a949J635J843L001n937k635n637Q96j048n063L100L773n704Q13J515L518
$$ -1949 -314 1529 4530 -1407 -4042 -9679 -8783 -9831 -14894 -11794 -8021 -13725 -12912 -11397 -7879
5895g879j231j443R97Q25l571j126QJ808N309O892o49P12r27l658k427p93J00
$$ -7879 -9110 -10553 -9556 -8731 -12302 -13428 -13420 -11612 -6303 589 -60 652 -275 -3933 -6360 -7153 -7053
5878g053O977K094l232k604P582p466m954R21Q283o15q721M960J880l629R03N426
$$ -7053 -76 2018 -1214 -3818 3764 -3702 -8656 -7735 548 -67 -8788 -3828 -1948 -5577 -4674 752
5862G52K230j038L487k921k724k06l139N927p83j684o717L653K941p35Q67p91
$$ 752 2982 1944 5431 2510 -214 -420 -3559 2368 1585 -99 -6816 -3163 -222 -957 -90 -881
$$ [...]
##END NTUPLES=NMR SPECTRUM
##END=
