##TITLE=Analysis number 325686
Compound Code cc 60610
Book Reference 486/90
Project Code adrs
Chemist Name simons
##JCAMPDX= 6.0         $$ Bruker NMR JCAMP-DX V2.0
##DATA TYPE= NMR SPECTRUM
##DATA CLASS= NTUPLES
##ORIGIN= Bruker BioSpin GmbH
##OWNER= nmr
$$ XWIN-NMR		Version 3.5
$$ Tue Jan  9 13:08:00 2007 GMT Standard Time (UT+0h)  MAYBRIDGE\nmr@NMR_250MHZ
##.OBSERVE FREQUENCY= 250.131544655141
##.OBSERVE NUCLEUS= ^1H
##.ACQUISITION MODE= SIMULTANEOUS (DQD)
##.ACQUISITION SCHEME= undefined
##.AVERAGES= 16
##.DIGITISER RES= 18
##SPECTROMETER/DATA SYSTEM= dpx250
##.PULSE SEQUENCE= zg30
##.SOLVENT NAME= CDCl3
##.SHIFT REFERENCE= (INTERNAL, CDCl3, 0, 16.522)
##AUDIT TRAIL= $$ (NUMBER, WHEN, WHO, WHERE, WHAT)
$$ ##TITLE= Audit trail, XWIN-NMR		Version 3.5
$$ ##JCAMPDX= 5.01
$$ ##ORIGIN= Bruker BioSpin GmbH
$$ ##OWNER= nmr
$$ C:\u/data/dgb/nmr/ADRS/770/pdata/1/auditp.txt
$$ ##AUDIT TRAIL=  $$ (NUMBER, WHEN, WHO, WHERE, WHAT)
(   1,<2007-01-09 13:07:32.15 +000>,<MAYBRIDGE\nmr>,<NMR_250MHZ>,
      <created by zg, POWCHK disabled, PULCHK disabled
       configuration hash MD5:
       49 4B E0 1D 92 C2 6B 37 9F E6 65 BC 52 41 86 1D
       data hash MD5: 64K
       97 FE 0E B0 AB D4 1B D9 C8 C3 C8 5E 84 EC 0F F9>)
(   2,<2007-01-09 13:07:50.81 +000>,<MAYBRIDGE\nmr>,<NMR_250MHZ>,
      <Start of raw data processing
       ef LB = 0.3 FT_mod = 6 PKNL = 1 SI = 32K 
       data hash MD5: 32K
       76 4A 7B 57 1B D8 6C E9 F6 1C 60 EE C1 02 D8 BA>)
(   3,<2007-01-09 13:07:52.81 +000>,<MAYBRIDGE\nmr>,<NMR_250MHZ>,
      <apk 
       data hash MD5: 32K
       B8 4E AE 22 49 C9 9F F6 B0 1F 16 83 AA F4 0D 2D>)
(   4,<2007-01-09 13:07:53.51 +000>,<MAYBRIDGE\nmr>,<NMR_250MHZ>,
      <abs ABSG = 5 
       data hash MD5: 32K
       58 E2 35 65 47 03 BA 45 CC EC B0 7D 58 A6 BD 42>)
$$ ##END=
$$ 
$$ hash MD5
$$ C4 2F D7 BC 13 E1 CF BF 96 89 70 86 69 2D 58 AA
##$RELAX= 
##$RELAX= 
##$RELAX= 
##$RELAX= 
##$RELAX= 
##$RELAX= 
##$RELAX= 
$$ Bruker specific parameters
$$ --------------------------
##$DU= <C:\u>
##$EXPNO= 770
##$NAME= <ADRS>
##$PROCNO= 1
##$TYPE= <nmr>
##$USER= <dgb>
##$AMP= (0..31)
100 100 100 100 100 100 100 100 100 100 100 100 100 100 100 100 100 100 
100 100 100 100 100 100 100 100 100 100 100 100 100 100 
##$AQSEQ= 0
##$AQ_mod= 3
##$AUNM= <au_zg>
##$AUTOPOS= <44 >
##$BF1= 250.13
##$BF2= 250.13
##$BF3= 250.13
##$BF4= 250.13
##$BF5= 500.13
##$BF6= 500.13
##$BF7= 500.13
##$BF8= 500.13
##$BYTORDA= 1
##$CFDGTYP= 0
##$CFRGTYP= 5
##$CHEMSTR= <none>
##$CNST= (0..31)
1 1 145 1 1 1 1 1 1 1 1 1 1 1 1 1 1 1 1 1 1 1 1 1 1 1 1 1 1 1 1 1 
##$CPDPRG= <>
##$CPDPRG1= <>
##$CPDPRG2= <>
##$CPDPRG3= <>
##$CPDPRG4= <mlev>
##$CPDPRG5= <mlev>
##$CPDPRG6= <mlev>
##$CPDPRG7= <mlev>
##$CPDPRG8= <mlev>
##$CPDPRGB= <>
##$CPDPRGT= <>
##$D= (0..31)
0 1 0 0 0 0 0 0 0 0.06 0 0 0 0 0 0 0.0002 0 0 0 0 0 0 0 0 0 0 0 0 0 0 
0 
##$DATE= 1168348051
##$DBL= (0..7)
120 120 120 120 120 120 120 120 
##$DBP= (0..7)
150 150 150 150 150 150 150 150 
##$DBP07= 0
##$DBPNAM0= <>
##$DBPNAM1= <>
$$ [...]
##$SUBNAM7= <"">
##$SUBNAM8= <"">
##$SUBNAM9= <"">
##$SW= 20.6930455092707
##$SWIBOX= (0..15)
0 0 3 0 0 0 0 0 0 0 0 0 0 0 0 0 
##$SW_h= 5175.983436853
##$TD= 65536
##$TD0= 1
##$TE= 294.16
##$TE2= 300
##$TE3= 300
##$TEG= 300
##$TL= (0..7)
0 120 120 120 120 120 120 120 
##$TP= (0..7)
150 150 150 150 150 150 150 150 
##$TP07= 0
##$TPNAME0= <>
##$TPNAME1= <>
##$TPNAME2= <>
##$TPNAME3= <>
##$TPNAME4= <>
##$TPNAME5= <>
##$TPNAME6= <>
##$TPNAME7= <>
##$TPOAL= (0..7)
0.5 0.5 0.5 0.5 0.5 0.5 0.5 0.5 
##$TPOFFS= (0..7)
0 0 0 0 0 0 0 0 
##$TUNHIN= 0
##$TUNHOUT= 0
##$TUNXOUT= 0
##$USERA1= <user>
##$USERA2= <user>
##$USERA3= <user>
##$USERA4= <user>
##$USERA5= <user>
##$V9= 5
##$VALIST= <valist>
##$VCLIST= <CCCCCCCCCCCCCCC>
##$VD= 0
##$VDLIST= <DDDDDDDDDDDDDDD>
##$VPLIST= <PPPPPPPPPPPPPPP>
##$VTLIST= <TTTTTTTTTTTTTTT>
##$WBST= 1024
##$WBSW= 4
##$XGAIN= (0..3)
0 0 0 0 
##$XL= 0
##$YL= 0
##$YMAX_a= 407640
##$YMIN_a= -554027
##$ZGOPTNS= <>
##$ZL1= 120
##$ZL2= 120
##$ZL3= 120
##$ZL4= 120
##$ABSF1= 16.522
##$ABSF2= -4.171173
##$ABSG= 5
##$ABSL= 3
##$ALPHA= 0
##$AQORDER= 0
##$ASSFAC= 0
##$ASSFACI= 0
##$ASSFACX= 0
##$ASSWID= 0
##$AUNMP= <proc_1d>
##$AZFE= 0.1
##$AZFW= 0.1
##$BCFW= 0
##$BC_mod= 0
##$BYTORDP= 0
##$COROFFS= 0
##$CY= 12.5
##$DATMOD= 1
##$DC= 0
##$DFILT= <>
##$DTYPP= 0
##$F1P= 14.0000005364418
##$F2P= -0.99999901652339
##$FCOR= 0.5
##$FTSIZE= 32768
##$FT_mod= 6
##$GAMMA= 0
##$GB= 0
##$INTBC= 1
##$INTSCL= 1
##$ISEN= 128
##$LB= 0.3
##$LEV0= 0
##$LPBIN= 0
##$MAXI= 10000
##$MC2= 0
##$MEAN= 0
##$ME_mod= 0
##$MI= 0
##$NCOEF= 0
##$NC_proc= -3
##$NLEV= 6
##$NOISF1= 0
##$NOISF2= 0
##$NSP= 0
##$NTH_PI= 0
##$NZP= 0
##$OFFSET= 16.522
##$PC= 1
##$PHC0= 222.1713
##$PHC1= 7.883989
##$PH_mod= 1
##$PKNL= yes
##$PPARMOD= 0
##$PSCAL= 4
##$PSIGN= 0
##$REVERSE= no
##$SF= 250.13
##$SI= 32768
##$SIGF1= 0
##$SIGF2= 0
##$SINO= 400
##$SIOLD= 32768
##$SREGLST= <1H.CDCl3>
##$SSB= 0
##$STSI= 32768
##$STSR= 0
##$SW_p= 5175.98343685301
##$SYMM= 0
##$S_DEV= 0
##$TDeff= 65536
##$TDoff= 0
##$TI= <Analysis number 999999
Compound Code 99
Book Reference 9
Project Code 9>
##$TILT= no
##$TM1= 0
##$TM2= 0
##$TOPLEV= 0
##$USERP1= <user>
##$USERP2= <user>
##$USERP3= <user>
##$USERP4= <user>
##$USERP5= <user>
##$WDW= 1
##$XDIM= 32768
##$YMAX_p= 475843187
##$YMIN_p= -77150
$$ End of Bruker specific parameters
$$ ---------------------------------
##NTUPLES= NMR SPECTRUM
##VAR_NAME=  FREQUENCY,     SPECTRUM/REAL,   SPECTRUM/IMAG
##SYMBOL=    X,             R,               I
##VAR_TYPE=  INDEPENDENT,   DEPENDENT,       DEPENDENT
##VAR_FORM=  AFFN,          ASDF,            ASDF
##VAR_DIM=   32768,         32768,           32768
##UNITS=     HZ,            ARBITRARY UNITS, ARBITRARY UNITS
##FACTOR=    0.157963299565203, 1,           1
##FIRST=     4132.6476996994, 0,             0
##LAST=      -1043.33573715361, 0,           0
##MIN=       -1043.33573715361, -77150,      0
##MAX=       4132.6476996994, 475843187,     0
$$ Real data points
##PAGE= N=1
##DATA TABLE= (X++(R..R)), XYDATA
$$ [...]
18783C2302577k012891q20420n09J132483N05762n016736o785398m395838k654404
18774A2254626j785192j342090j041990p81375n95784m76391m19537m46875m48879
18765D916513m30931m58219m48643l76261k75280k35511k13697k05488j88424
18756B084059j60026j52925j27690j54377j43509j34143j04299p8272n5723n4320
18746I18775n5068o7286n4737n1202l7423l4306n0919m6885j6218j5252l3352
18735D56127m1750j6982J2581J9272p162r610j4543j5022k7074j2663q764q90
18723C33520r161Q11J352K628r781o169r222q393j3396k738Q393l068L078p17
18709B87137J0943K130l6526q311j896J1114l869k6381j3034J9834K3523L4175
$$ plain form
18783 32302577 30289686 29469266 29468757 30601240 31107002 26090266 19304868 14909030 12254626
18774 12254626 10469434 9127344 8085354 7303979 6708195 6231804 5812267 5365392 4916513
18765 4916513 4485582 4027363 3578720 3202459 2927179 2691668 2477971 2272483 2084059
18756 2084059 1924033 1771108 1643418 1489041 1345532 1211389 1107090 1028818 973095 918775
18746 918775 863707 796421 741684 690482 653059 618753 567834 520949 504731 489479 456127
18735 456127 414377 397395 409976 429248 422086 412476 397933 382911 355837 343174 334410 333520
18723 333520 324359 325170 326522 329150 319369 313200 303978 295585 282189 279451 287844 284776 287854 287137
18709 287137 298080 300210 263684 255373 253477 264591 260722 234341 221307 241141 264664 298839
18697B98839L0874K9291M3785L0924K898P45p46N41j8371p342R533M0155M4596
18684E05722N7260L6056N291r689k7907m5734j3137k4600n9022j5185J3268Q897
18672D31220q013J4650K6690j3002l1183l8650k8022n1753m7522r414J4232j584
18660B57649j0318j4291k033R533J4444j9j6439J2205j841j47J4790K6071L3170
18647C22774J5851L1632P876k1734l1307l6772m8087k3567j0478j3671m222j9910
18635A68385l207J2760j153M635J5447K916j3140k764Q415M698L795j5296N168
18622A90659J0070J1995J3080J2415O139J0217k801O851j526J1686J2150Q259
18610B89194J5160K5407K3760J6697k770L3247K8190L1034J7631k780K1358M4101
$$ plain form
18697 298839 329713 359004 402789 433713 436611 437356 436610 437151 418780 411438 420971 461126 505722
18684 505722 562982 599038 604329 594640 566733 520999 507862 483262 424240 409055 422323 431220
18672 431220 423207 437857 464547 451545 420362 381712 353690 301937 254415 245001 259233 257649
18660 257649 247331 233040 231007 240540 254984 254965 238526 250731 248890 248743 263533 289604 322774
18647 322774 338625 370257 378133 356399 325092 288320 240233 216666 206188 192517 188295 168385
18635 168385 165178 177938 176785 181420 196867 199783 186643 183879 192294 196992 200787 185491 190659
18622 190659 200729 212724 225804 238219 244358 254575 251774 258625 257099 268785 280935 289194
18610 289194 304354 329761 353521 370218 367448 400695 428885 459919 477550 474770 496128 540229
18598E40229M0805K7176M9255L1376l219n007o0369r5629n7031l6268k1260k1922
18586C88136q730l861k2308k3709k0013k8671j3583o59N874j901K750J2827J4600
18573C00752k0073R500K3266N352K958j4338l4654p573j4135n009j7204Q490K8800
18560B66132K1914o015J1694K6751P082N961N585J2110K997K5926L8832L8070
18548D57039K0677L6915L3427k01k6585k2495l5017m4860k2531j0983p122K2284
18536D00548k910k282K4342N585O491k3004j9747J89O0Q145j0594J3477R686K2098
18522D32084J3134K0988L5223K4608K126l1460k8066k1984m585j1426Q823K6405
18510D65870K2092J3412l737N406m248l5703o6821o0864k5571j8230l3030j0713
$$ plain form
18598 540229 581034 608210 657465 688841 685622 680615 620246 524617 467586 431318 410058 388136
18586 388136 379406 375545 353237 329528 309515 280844 267261 266602 272476 270575 273325 286152 300752
18573 300752 280679 290179 313445 318797 321755 307417 272763 265190 251055 246046 228842 237332 266132
18560 266132 288046 282031 293725 320476 327558 333519 339104 351214 354211 380137 418969 457039
18548 457039 477716 514631 548058 547857 521272 498777 463760 418900 396369 385386 378264 400548
18536 400548 397638 395356 419698 425283 431774 408770 389023 389212 389272 397417 386823 400300 409986 432084
18522 432084 445218 466206 501429 526037 528163 496703 468637 446653 442068 430642 439465 465870
18510 465870 487962 501374 497637 503043 498795 463092 396271 335407 309836 291606 258576 247863
18498B47863K7649J5812n669O249k148j6396j9454L044J6365q399R853L060J017
18485B78846O456K188j4522J1388J5378j436k1448j760K395n092K25K1495l804
18472B90309P582K745m134J9722J1632j2239P481J3989m447j894K2299k59j5768
18459C37018M160j5167j3783j6625J1612J4742K860O826K5610J4851r055k0991
18447C42058l0596K208r74N41L425K426J1724r29k204K5251K3527O154l720j5282
18433C63609O764M915J1292n288P147P910R483J0770P225J7522K5080K5919J1723
18420E04071J5145J0124J0043J3705K7287L8396K9064L6590J7553K6737L1091
18409G59806J3660J5072J2238J357K1509J3902J7227K6622M6699L0508N7514Q0589
$$ plain form
18498 247863 275512 291324 285655 291904 289756 273360 253906 256950 273315 264916 274769 277829 278846
18485 278846 285302 287490 272968 284356 299734 298298 276850 275090 277485 272393 272618 294113 290309
18472 290309 297891 300636 296502 316224 327856 315617 323098 337087 332640 330746 353045 352786 337018
18459 337018 341178 326011 312228 295603 307215 321957 324817 331643 357253 372104 363049 342058
18447 342058 311462 313670 312696 313237 316662 319088 330812 329883 327679 352930 376457 382611 378891 363609
18433 363609 370373 375288 386580 381292 388439 396349 405832 416602 423827 441349 466429 492348 504071
18420 504071 519216 529340 539383 553088 580375 618771 647835 684425 701978 728715 759806
18409 759806 773466 788538 800776 802133 823642 837544 854771 881393 928092 958600 1016114 1096703
18397A096703P9720P4803R1979R7246J18081J44389J46735J77267K39053L16249
18387B582225L85962N05551O64044Q92555J303622J880070K389337K580128K336158
18378A5519652K219205K782796L331036O10906k023050p68363N90268J279392
18370B3541842K292067L343291O26607k823091j900620j26993J365375J604538
18362B7923016j543281k732395j140366k21090K04813Q73988O99572l185540n233255
18353A5645462l511742j970304j288188r50290p12429n18445l44790k08183j54883
18344E986208j80304j68698j27251j09799j8176J09614J97978L47715N62120Q16720
18334G416127J140781J633910K383321L312548L926768L804859L391910L657562
$$ plain form
18397 1096703 1176423 1251226 1343205 1440451 1558532 1702921 1849656 2026923 2265976 2582225
18387 2582225 2968187 3473738 4137782 5030337 6333959 8214029 10603366 13183494 15519652
18378 15519652 17738857 20521653 23852689 24463595 22440545 21672182 22262450 23541842
18370 23541842 25833909 29177200 29803807 26980716 25080096 24953103 26318478 27923016
18362 27923016 26379735 23647340 22506974 22285884 22490697 23364685 24064257 20878717 15645462
18353 15645462 12133720 10163416 8875228 7924938 7212509 6694064 6349274 6141091 5986208
18344 5986208 5805904 5637206 5509955 5400156 5381980 5491594 5689572 6037287 6599407 7416127
18334 7416127 8556908 10190818 12574139 15886687 19813455 23618314 27010224 30667786
18326C0667786M862499L437160k360294k804017j95468J290983K558063M350803
18318D1807515L592565j852315l155182r66373J289739L036420K33818m534257
18310C9451930l121213p41955L38496J284057K261383m12575n256741l959524
18302B9843858m59864K234125M381323O238740P660622Q507839Q591572P212045
18294G4210260N070208m8268m906187p300722j0563455q794201n846922k174390
18286C9646323J438352M320280O359379P526536P988384P322272N322949K202867
18278H2127342m317632p351893j1160859j2556678j0375092p926929n312124l390497
18270A9735638k230083j558239j236377j110881j054158j096340j143357j083647
$$ plain form
18326 30667786 35530285 38967445 36607151 33803134 33607666 34898649 37456712 41807515
18318 41807515 45400080 43547765 40392583 39426210 40715949 43752369 43986187 39451930
18310 39451930 36330717 35588762 35927258 37211315 39472698 39060123 33803382 29843858
18302 29843858 29383994 31618119 35999442 42238182 49898804 58406643 66998215 74210260
18294 74210260 79280468 79232200 74326013 67025291 56461836 47667635 41820713 39646323
18286 39646323 41084675 45404955 51764334 59290870 67279254 74601526 79924475 82127342
18278 82127342 77809710 70457817 59296958 46740280 36365188 28438259 23126135 19735638
18270 19735638 17505555 15947316 14710939 13600058 12545900 11449560 10306203 9222556
18262I222556j012135q79797p51832o31321n06203l71303l26720k93809k43817
18253D205619k31551k55181k46649k45428k41041k39775k08415j72977j34262
18244B230340j00917q0591q8461o4143p5640j03914j07201p8937m6816p7102q5875
18233A320743p9307p1445q5088p2149l3886j6802k1744n1117m8358k1825j3418
18222H05604l2797k5383k7350j8959k43r616l3207l0602j9170l020j3575l5149
18210E56533k3714j7903j1389M047O793j586K9637K0039J4133K3855L8437M1449
18198F80331M487Q850k533q152j300j7276j7174k7781J2541p632k994l439r43
18185F16985L185j2716k3784j4858L494J7098O313J0355K4328L7666O9755P1883
$$ plain form
18262 9222556 8210421 7330624 6578792 5947471 5441268 5069965 4743245 4449436 4205619
18253 4205619 3974068 3718887 3472238 3226810 2985769 2745994 2537579 2364602 2230340
18244 2230340 2129423 2048832 1960371 1896228 1820588 1716674 1609473 1530536 1483720 1406618 1320743
18233 1320743 1241436 1169991 1084903 1012754 978868 962066 940322 889205 840847 819022 805604
18222 805604 772807 747424 720074 701115 700872 691256 658049 627447 608277 605257 591682 556533
18210 556533 532819 514916 503527 507574 514367 512781 542418 562457 576590 600445 638882 680331
18198 680331 684818 693668 691135 682983 681683 664407 647233 619452 631993 624361 621367 617928 616985
18185 616985 620170 607454 583670 568812 572306 589404 595717 606072 630400 668066 737821 809704
18173H09704O1080Q8780N6227M0565k178N443J5050J660r59P590K6643M6716M9225
18160A205546N2615M0449N1730K6668J6309L0159P4021R8300J42914J62162J88447
18149B089320K39389L20977M31744N61146P55309J071957J527548K100667K949118
18140A2047175M139886N277394N873138N957629N981220O341143N036876k203979
18132D8450482m426705m421503r659413q703138n064764k888954j794609j176015
18124A0315381p69155n46061m50538l90326l31168k84118j93935O94L14246P31511
18114H396531J325969K163570K957077L049797K335806J740550K421161L829376
18106B8219837k885123q391291m994421k435187j259391o30901k41556M1866K87923
$$ plain form
18173 809704 870784 959564 1015791 1056356 1054178 1059621 1074671 1076331 1075372 1082962 1109605 1156321 1205546
18160 1205546 1258161 1298610 1350340 1377008 1393317 1423476 1497497 1595797 1738711 1900873 2089320
18149 2089320 2328709 2649686 3081430 3642576 4397885 5469842 6997390 9098057 12047175
18140 12047175 16187061 21464455 27337593 33295222 39276442 45617585 50654461 48450482
18132 48450482 44023777 39602274 29942861 21239723 16174959 13286005 11491396 10315381
18124 10315381 9546226 9000165 8549627 8159301 7828133 7544015 7350080 7350774 7665020 8396531
18114 8396531 9722500 11886070 14843147 17892944 20228750 21969300 24390461 28219837
18106 28219837 25334714 16943423 11949002 9513815 8254424 7623523 7381967 7423833 7711756
18097G711756N29144Q16496J122852J569440K344976L486082N059090O741176
18089B9381012Q080744Q726152Q939746R240929P892907J657313k792884p496532
18081F3629387j1078036j2091120j0928115o943536m154215k638035j789115j273642
18073A2733573j018173r04621q75273r03792r11670q44225p43337o29707n04327
18064E398448m02578l22391k46827j76277j79882j18700q9663j41655j19174q1655
18054C519646n5820r9529j07076m5900K9732Q4467J16209J55581K17817L54131
18044D169258O06921R43084J443323K120328K856135L385878L531166L486193
18036B2542286L625380L668375M69311k995173k283522m953357o082985l817237
$$ plain form
18097 7711756 8240900 9057396 10180248 11749688 14094664 17580746 22639836 29381012
18089 29381012 37461756 46187908 55127654 64368583 72261490 73918803 71125919 63629387
18081 63629387 52551351 40460231 29532116 22588580 18434365 15796330 14007215 12733573
18073 12733573 11715400 10810779 9935506 9031714 8120044 7275819 6532482 5902775 5398448
18064 5398448 4995870 4673479 4426652 4250375 4070493 3951793 3862130 3720475 3601301 3519646
18054 3519646 3463826 3364297 3257221 3211321 3241053 3325520 3441729 3597310 3815127 4169258
18044 4169258 4776179 5719263 7162586 9282914 12139049 15524927 19056093 22542286
18036 22542286 26167666 29836041 30305352 27310179 25026657 20073300 13990315 10173078
18028A0173078k145517j339393q83924o05400m55135l65479l35401l35300l37846
18019C369683l52757l20500k92999k46268k06481j66381j38754j31513j09621
18010A404409q0976m9922m3541q3539p0699n1825m2244m1284k3765j4942p752
17999H93920L332j680l3145k8314l9576m5279l5174m5063l4100k4954j0221k2492
17987E77254n9227l4100j1220k0025m0247j1256k7075l1458k7752l6365k0284
17976B58245k1569k4506K526l484n118J229N868k8006k102K254K7064K7389J4182
17963B53972j2126J2004J7191k307m9165l601K8694N043q595j2947q849o483Q840
17950B21671J5958P931j9673j9731L897K2227J0049k1407k2345j1989l405k4j5232
$$ plain form
18028 10173078 8027561 6688168 5804244 5198844 4743709 4378230 4042829 3707529 3369683
18019 3369683 3016926 2696426 2403427 2157159 1950678 1784297 1645543 1514030 1404409
18010 1404409 1323433 1273511 1229970 1146431 1075732 1023907 981663 940379 916614 901672 893920
17999 893920 897252 895572 862427 834113 794537 749258 714084 669021 634921 609967 599746 577254
17987 577254 518027 483927 472707 452682 412435 401179 374104 342646 314894 278529 258245
17976 258245 236676 212170 214696 211212 206094 207323 213191 185185 183083 185337 212401 239790 253972
17963 253972 241846 253850 271041 268734 219569 215968 244662 249705 241110 228163 219314 212831 221671
17950 221671 237629 245560 225887 206156 210053 232280 242329 220922 198577 186588 183183 183159 167927
17937A67927k1463l3481j2683j3587P9o19j3605q681J6156j0751j3915Q074j931
17924F1520l234j3077J585J5974j257K769J6809j1981K331J9531j3052p246J9220
17911H9892k62k3775k2059l912n900J0412J2188j3871O363j838j8885k4191M021
17898H183k201N451Q51R804O338L802k1889n652K2853J8174M239R579n783k4848
17884B8901J9052p008q886j2274k776K531r267J2763J2451P51j2768l897P14j0164
17870A0123j4787N990J1560R351p939j992k628J0134L506k1045j5179q832J007
17857b0731q636N092O908R146M587R074m077L88N646K3462K6705K1412N137K3133
17843A07246P710M915L2671O318J041r665Q35O337J1475K4928q39j6459j7551
$$ plain form
17937 167927 146464 112983 100300 86713 86792 86173 72568 63887 80043 69292 55377 63451 61520
17924 61520 58286 45209 46794 62768 61511 64280 81089 69108 71439 90970 77918 70672 89892
17911 89892 89630 65855 43796 39884 33984 44396 56584 42713 49076 47238 28353 4162 8183
17898 8183 5982 11433 12284 22088 28426 32228 10339 4687 27540 45714 49953 59532 53749 28901
17884 28901 47953 40945 32059 19785 17009 19540 10273 23036 35487 36238 23470 19573 20287 10123
17870 10123 -4664 1326 12886 22237 14298 12306 9678 19812 23318 2273 -12906 -21738 -20731
17857 -20731 -29367 -24275 -17367 -8221 -3634 5440 1363 1751 7397 30859 57564 78976 84113 107246
17843 107246 114956 119871 152542 158860 159901 150236 151071 157408 168883 193811 192972 176513 158962
17830A58962n53K1187Q721J5976O459l3428j4212O090l552j6372j022k8829j7547
17817A01880k9236l4166l963j091M021l318p84J104q637p624Q696n230M249P345
17803C3246k2257j9956j7768o058N81J4171J7167j0913J1159J6452L5577J7403
17791F8804J3147K6461R885N419q345m517M734J5798l689j162j2206n594P515
17778A16250J3705J0768J074N189P963j8036j2470j4708R596k207j7419k3157
17766G6548k0572K472M308j7953p763j185o614J1207K38k98j3326k678r3k0991
17752C300k2727n279J0354R926j3608q48J2238N190k795j652M009j4466j4803
17739c1161O173j6036k18L0139K0399P612O931j5608j0171k1515N362J0526K9225
$$ plain form
17830 158962 158409 179596 188317 204293 210752 177324 163112 169202 165650 149278 148256 119427 101880
17817 101880 72644 38478 34515 33424 37445 34127 33343 34447 25810 18186 26882 21652 25901 33246
17803 33246 10989 -8967 -26735 -32793 -32212 -18041 -874 -11787 -628 15824 51401 68804
17791 68804 81951 108412 118297 123716 115371 110854 115588 131386 127697 126535 114329 108735 116250
17778 116250 129955 140723 141797 146986 154949 136913 124443 109735 119331 117124 99705 76548
17766 76548 55976 58448 62756 44803 37040 35855 29241 40448 40686 40388 27062 24384 24291 3300
17752 3300 -19427 -24706 -14352 -4426 -18034 -18882 -6644 -1454 -4249 -5901 -1892 -16358 -31161
17739 -31161 -24988 -41024 -41242 -11103 9296 16908 23839 8231 -1940 -23455 -18093 -7567 21658
17726B1658n185k1704J1310J1653K353k861J341J7736j0773k244M220M848Q359
17713D0711M1610J1320J7949J5134K6573K5103M1705N1489M6594L6227p91J3619
17701C67243J1806k5396m5275n3372l3076k2654j4542J5406L5613M4199M1311
17690C21263K3281K5259Q354J5808J556m0527o5204o1513n4200m2639l3827j5338
17678H2273j209J153n078l150M796k0017k7528j3821r983J962R057q369l196K2658
17664B9548J0333j153N296q936j0474K521J2023J3278K815J712m424J1679L616
17651F7834k4316k116P071R791N646k361j7045j2073j6711j1753p011j504l922
17638h470K5393j2386m088O513k2482K574m66K3637K5144J0274J7283M1266K4723
$$ plain form
17726 21658 16473 -5231 6079 17732 20085 17224 18565 36301 25528 23284 27504 32352 40711
17713 40711 82321 93641 111590 126724 153297 178400 220105 271594 318188 354415 353624 367243
17701 367243 379049 353653 308378 255006 221930 199276 184734 200140 235753 279952 321263
17690 321263 344544 369803 378157 393965 395521 354994 289790 228277 174077 131438 97611 82273
17678 82273 81064 82217 77139 73989 78785 58768 31240 17419 7436 9398 18455 10086 6890 29548
17664 29548 39881 38728 44024 35088 24614 27135 39158 52436 55251 56963 52539 64218 67834
17651 67834 43518 41402 48473 58264 63910 61549 44504 32431 15720 3967 -3044 -4548 -8470
17638 -8470 16923 4537 449 6962 -15520 -12946 -13412 10225 35369 45643 62926 104192 128915
17625A28915P958Q348M5971M3357o554j8405j1501k2043l3175k4318k3537j4774
17613H0242j9556k0261p22k1207k1747K576J1487o964O498o331j4324q627K8433
17600I497J2081p647J1036J3790j6258j7404j1920n023r634Q585J4182J6775r188
17587H872j3608N143k091J3546O622q43J4669J8435J7320K8479L1055N2642P0268
17574B50509N5118M4418L7420M15l6102k9456m8716n8546n4272l5630k3222j6384
17562H5552k328l0005j4221m506j3255n971O11l822n940J5272L262j264O093J3118
17548D2596J3783L523k1013l8092p745O950k34J3099p494p005K4462L482N442
17535C1754K423j554J4111J6249J2272J1416L3031R332P395J3846L3762R236J3807
$$ plain form
17625 128915 136873 145221 191192 234549 227995 209590 198089 176046 142871 118553 95016 80242
17613 80242 60686 40425 39703 18496 -3251 -675 10812 3848 10346 4015 -10309 -18936 9497
17600 9497 21578 13931 24967 38757 22499 5095 -6825 -11848 -21482 -12897 1285 18060 8872
17587 8872 -4736 407 -1684 11862 18484 17641 32310 50745 68065 96544 127599 180241 250509
17574 250509 305627 350045 387465 387880 351778 322322 273606 215060 160788 125158 101936 85552
17562 85552 83224 53219 38998 34492 21237 15266 15877 12055 6115 21387 24649 23385 29478 42596
17548 42596 56379 59902 38889 797 -6948 2 -232 12867 5373 -1632 22830 26312 31754
17535 31754 34177 32623 46734 62983 75255 86671 119702 129034 136429 150275 184037 193273 207080
17522B07080M030R295r296k6381l8523k5607j2939j7747O94j0864j2659J2583
17510G9666P929k874j961J7695K6811Q485Q478K5434L0294P660K26K1725J2103
17497B41671J8824M3106J7663L7179N2424M2457L6928O482n5877q3876o9983m0652
17485B46346K345m785K3078L8233M1607N7592N9034K3025L4632N0393J3273r0431
17473D94342j00626r0540n7324k1509k7467k8314o672j6448k3949K3k2963k8209
17461G0344j0700J12P179Q828J436J1599J6670M79k983K2585K8905J0407l028
17448A61833j6879j297J3479l457n339r543p667J5822J9067l9499k8353k3324
17436G4843j4751p385J2355k2727j1169J0961k70J0752j2373n84q03N298L2375
$$ plain form
17522 207080 211110 220405 211109 184728 146205 120598 107659 89912 90606 79742 67083 79666
17510 79666 87595 84721 82760 100455 127266 135751 144229 169663 199957 207617 207843 229568 241671
17497 241671 260495 303601 321264 358443 410867 453324 490252 496734 440857 356981 286998 246346
17485 246346 248691 243906 266984 305217 346824 404416 463450 486475 521107 571500 584773 494342
17473 494342 393716 303176 245852 224343 196876 168562 161890 145442 121493 121516 98553 70344
17461 70344 59644 59756 66935 75763 77199 88798 105468 105947 102964 125549 154454 164861 161833
17448 161833 144954 143657 157136 153679 148340 138797 131130 146952 166019 126520 98167 74843
17436 74843 60092 52707 65062 42335 31166 42127 41857 52609 40236 39652 38849 44147 76522
17423G6522J7183K9696J7447o70J2808K7262L2362k8369m5814l9501k4752j5611
17411E8563k3849k3794O968K4128n23k2549j5636k916Q915J2063l386Q003R897
17398C5884J2288k1779j078J6573j100j9851r461j3614K907J5818q607j0310j3891
17385a6221j3094J0289N67l185o317j118J3214P04K4354r452J224o147l0709j0191
17371d6082k746J8242K3061K0020j8127k7560M746K4994J6991r722M885o851q386
17358f535P658o322k408p456j1710j8450j29J5309L909J6591j1400k1468Q203
17345c4208O089Q081m696O651J2878m305m857m272R122j7023R055K587j2996J9348
17331h546n026J875J9062J2407k0567j4796l861P823m183j1392j73j84K864J6011
$$ plain form
17423 76522 93705 123401 140848 140178 152986 180248 212610 184241 138427 98926 74174 58563
17411 58563 34714 10920 17888 42016 41493 18944 3308 392 9307 21370 17984 25987 35884
17398 35884 48172 26393 25315 41888 40788 20937 11476 -2138 769 16587 7980 -2330 -16221
17385 -16221 -29315 -19026 -18459 -21644 -27961 -29079 -15865 -15161 9193 -259 965 -5182 -35891 -46082
17371 -46082 -48828 -30586 -7525 12495 -5632 -33192 -28446 -3452 13539 3817 8702 1851 -6535
17358 -6535 1123 -5199 -7607 -15063 -26773 -45223 -45352 -30043 -26134 -9543 -20943 -42411 -34208
17345 -34208 -28119 -20038 -24734 -18083 -5205 -9510 -14367 -18639 -9517 -26540 -17485 -14898 -27894 -8546
17331 -8546 -13572 -11697 7365 19772 -795 -15591 -19452 -11629 -15812 -27204 -27377 -27561 -24697 -8686
17317h686m653o867R866q183K410J7114r11J5250k873j0988n718O455J8245k5895
17303e434k7062o473J1850J5186p99Q976R929k465n096M88M893j156j0741J296
17289f608r381j531J929j5009j2265J4674K1245R166K495N578L627K917M756J514
17275B3107J0289J592l782K300N72j2926l1449L885K0336J1087R203j8130l3759
17262a7675q994O976M940R277K0015K588j4202k1692J6141K524j2843m693J7972
17249C34J3811r923k710n054P818o699M182m920j7890m821K4049M101J5393J7188
17235C4859O547q575j9361k9464l0308O586K9817R768n557j5479r901M631M068
17222b2369J601L265M442J475K0880k253p487J7865J8856j1955j1520k846N451
$$ plain form
17317 -8686 -13339 -20206 -10340 -18523 -16113 1001 90 15340 12467 1479 -4239 2216 20461 -5434
17303 -5434 -32496 -38969 -27119 -11933 -12732 -3756 6173 3708 -1388 -900 3993 2837 -7904 -6608
17289 -6608 -15989 -17520 -15591 -30600 -42865 -28191 -6946 2220 4715 10293 13920 16837 21593 23107
17275 23107 33396 34988 31206 33506 34078 21152 -10297 -6412 13924 25011 34214 16084 -17675
17262 -17675 -26669 -19693 -14753 -5476 14539 17127 2925 -18767 -2626 -102 -12945 -17638 334
17249 334 14145 4222 1512 -3542 4276 -2423 1759 -3161 -21051 -25872 -1823 2278 17671 34859
17235 34859 41406 32831 13470 -15994 -46302 -39716 -9899 -131 -5688 -21167 -31068 -26437 -22369
17222 -22369 -20768 -17503 -13061 -11586 9294 7041 -446 17419 36275 24320 12800 9954 15405
17209A5405K913K861m457q550m506J2215L159J2294J3223q320j7705M792J0178
17196C3502K0837J4367L274K0076O861j710j2813j5179l219j944O276k871P321
17183G4778J2938R636J6252K711j0826j3556n057q263L521O096O44j2230j4219
17170F2425k3039k1144M264J7313K721o372m156l784O644j8426j3809M837L805
17157A1279J884M42J2762J795N409l071k8276r59J6869j4j640j5070m017K8052
17143B5445J4340p36k0326J6630J8501j0316k700l885j9425q68J4636J729q134
17130B4891J8673J6797j11K208j1055k6788N584K384M634r35O273M307j1764J4662
17116D9760J5902Q951K802m060j6881k8975j306k086J8252J1193n830o604P767
$$ plain form
17209 15405 18318 21179 16722 8172 3666 15881 19040 31334 44557 36237 18532 23324 33502
17196 33502 54339 68706 71980 92056 98917 97207 84394 69215 65996 64052 70328 67457 74778
17183 74778 87716 97352 113604 116315 105489 91933 86876 78613 82134 88230 88874 76644 62425
17170 62425 39386 18242 22506 39819 42540 36168 32012 28228 34872 16446 2637 7474 11279
17157 11279 13163 13605 26367 28162 33571 30500 2224 1265 18134 18120 16480 1410 -2607 25445
17143 25445 39785 39049 18723 35353 53854 43538 40838 36953 17528 16660 31296 33025 24891
17130 24891 43564 60361 60250 62458 51403 24615 30199 32583 37217 36282 42555 46862 35098 49760
17116 49760 65662 74613 77415 73355 56474 27499 26193 24107 42359 53552 47722 41118 48885
17103D8885P747o91P965k305j0029J2213Q094o705l201j4306J972J3334K3746
17090H6719M495K553J9434J1150r252l2112j3340n054L939K1934K784k460K0999
17077A11789J1098n695j865P287p99p851j9769K14N886k7234k1095j243M667j4207
17063D1183l623L924O950J8296K0254K023J0619J0016k1215l2160K050K110K144
17050F2571J1452l557N306J2441k700M690J8911L2N584r165j576J306N868J2771
17036A23934J158J0849j0738J9241K7323Q30o577j5083K013O177L0459R726j3969
17023A85343n190K2293J1744J7549l225j945J5505k0802k077K526N287J0696J4316
17010B52020L976p403Q775k518j0830J994K257K2898J4259M440J0651n880J0019
$$ plain form
17103 48885 56632 55941 63906 61601 51572 63785 71879 65174 61973 47667 49639 62973 86719
17090 86719 91214 93767 113201 124351 115099 82987 69647 64593 68532 90466 93250 90790 111789
17077 111789 122887 117192 115327 122614 121815 113964 94195 94409 100295 73061 51966 50723 55390 41183
17063 41183 37560 41484 48434 66730 86984 89007 99626 109642 88427 56267 58317 60427 62571
17050 62571 74023 70466 75772 88213 85513 90203 109114 109146 114730 105565 103989 105295 111163 123934
17036 123934 125092 135941 125203 144444 171767 172597 166020 150937 152950 159127 189586 199312 185343
17023 185343 180153 202446 214190 231739 228514 226569 242074 221272 219195 221721 227008 237704 252020
17010 252020 255996 248593 257368 254850 244020 246014 248271 271169 285428 289868 300519 294639 304658
16997C04658J1076J5228K8753o815p625P526L948M372J4990L8527K4605M733J036
16984D45012J0073J2893J0232K5023L3661O6083L9308J709K4420N2355M5363M9829
16972H15961O3220O3428P1551Q1613J06216J35344J33874J37453J61483J75000
16962A945143J27658Q0924J01332J64453K47691K84340L02092L75514M68863N83243
16952D681253P37522R12572J090635J455220K049196K874072M043771N756339
16944B3600580Q111602J0438576J1178449R783739Q165743Q791969R301601l639191
16936H5733068k0333341j7928964r868292m363549q34495J916678M702021P654385
16928D6677511R696998R493562P570667O478747P785997L825885j4615728k2593425
$$ plain form
16997 304658 315734 330962 359715 352900 345275 352801 356749 361121 376111 414638 439243 443976 445012
16984 445012 455085 467978 478210 503233 536894 602977 642285 643994 668414 720769 766132 815961
16972 815961 879181 942609 1014160 1095773 1201989 1337333 1471207 1608660 1770143 1945143
16962 1945143 2072801 2153725 2255057 2419510 2667201 2951541 3253633 3629147 4098010 4681253
16952 4681253 5418775 6331347 7421982 8877202 10926398 13800470 17844241 23600580
16944 23600580 31712182 42150758 53329207 63112946 71278689 80070658 89372259 85733068
16936 85733068 65399727 47470763 37602471 33238922 32404427 34321105 39023126 46677511
16928 46677511 56374509 65868071 73438738 79917485 87703482 91529367 76913639 54320214
16920E4320214j5794984r231944n578173l644142k528504j757526j243155q93241
16912A3648545q27574r24545j014561j063333j057906r61457q80733q01436o35501
16903E481499n33260m88348m02547l40202k87985k38153k01671j63327j77583
16894B648423k29239k59723k19344j69205j62879j41570q9813j04662r3192p5085
16884A103711q4372p9173p0717n0671m1586p2321n7814m3829m9279n3928k8524
16873D71497j8083k4437l0027k5209m1921l6224j6669q947J514M160p985o124
16861B61545j2206l1446q723K990j7319k8852j9992k965P376K1218O848j0893
16849A67581j2295q102p091N145m992m776K843N113j4170k7631o201o279m253
$$ plain form
16920 54320214 38525230 29293286 23715113 20070971 17542467 15784941 14541786 13648545
16912 13648545 12820971 11896426 10881865 9818532 8760626 7799169 6918436 6117000 5481499
16903 5481499 4948239 4459891 4057344 3717142 3429157 3191004 2989333 2826006 2648423
16894 2648423 2419184 2159461 1940117 1770912 1608033 1466463 1376650 1271988 1178796 1103711
16884 1103711 1019339 940166 869449 818778 777192 704871 647057 603228 553949 500021 471497
16873 471497 453414 428977 398950 373741 331820 295596 278927 269980 271494 275654 267669 261545
16861 261545 249339 217893 209170 212160 194841 165989 145997 143032 150408 171626 178474 167581
16849 167581 155286 147184 140093 145238 140246 135470 138313 143426 129256 101625 95424 89145 84892
16836H4892R109O219j2211j0429L1136L931P813J661l3711p596m283J5210Q869
16823A00610J5123J9796L921o91m264L32L492J785L061P611P295l0625j9518o947
16809A00981M04j04j1042Q752N556J2046L4730l38m052J2248p745k0210m5934
16796H5292k4546p525l964r537j996K3881Q419j3823l560q117k4678k160P182
16783B4868n404J3784J6611j2980j3806J8009o406k4493K151J0916Q373J4177
16771D5800k939j3417j635m26p740l631j0397l926k555L514m32k0189K0243L2625
16757C4895k03k1839k6106k3541q208P682L625k128q438J2931J1395J2033k794
16744a0696p716J3919N999J0123j5637l295N694r585l163N773o127j5954j2595
$$ plain form
16836 84892 94001 100220 88009 77580 108716 112647 120460 122121 88410 80814 76531 91741 100610
16823 100610 115733 135529 139450 138759 134495 134827 138319 140104 143165 150776 158071 127446 107928 100981
16809 100981 101385 101281 90239 98991 104547 116593 151323 150985 146933 159181 151436 131226 85292
16796 85292 60746 53221 49257 39720 37724 61605 70024 56201 52641 44524 19846 17686 24868
16783 24868 19464 33248 49859 36879 23073 41082 34676 10183 12334 23250 31623 45800
16771 45800 42861 29444 27809 27383 19643 16012 5615 1689 -866 2648 2216 -17973 2270 34895
16757 34895 34692 12853 -13253 -36794 -45002 -37320 -33695 -35823 -44261 -31330 -19935 -7902 -10696
16744 -10696 -18412 -4493 1506 11629 -4008 -7303 -1609 -11194 -14357 -8584 -14711 -30665 -43260
16731d3260k713Q699L383J2915L792J7422R575k502j3572q560o915K07L024J5381
16717c124m265l67J4020j1897l801l529J967j7069k1535m866p146m189K3876P485
16703c4440J3254J1473l992j9916k3998r718j220R795J9743J8402K088j3378j3314
16690d5221K2302K9643R553R147o345r277k8219j4162j1523j3022o447J5005J5593
16677c2973m164j398r310j634J0396M002R808J7108j773j4821j3244j4173r364
16664f1540J4359J080j8285J2206J5216J2301J7473r466j919p311N0K4813J1652
16651A0629k9202j7858k981J0327K700J1756K794N491P086N066j973p463O813
16638C185m162N9m265k1398Q148M969o23J5917J3007P589r198J2478J2809J0023
$$ plain form
16731 -43260 -45973 -37274 -33891 -20976 -17184 238 9813 7311 -6261 -14821 -21736 -21529 -18505 -3124
16717 -3124 -7389 -7756 6264 -5633 -9434 -12963 -10996 -28065 -49600 -54466 -61612 -65801 -41925 -34440
16703 -34440 -21186 -9713 -13705 -33621 -57619 -67337 -68557 -58762 -39019 -20617 -18529 -31907 -45221
16690 -45221 -22919 6724 16277 25424 19079 9802 -18417 -32579 -44102 -57124 -63571 -48566 -32973
16677 -32973 -37137 -38535 -47845 -49479 -39083 -35081 -25273 -8165 -9938 -24759 -38003 -52176 -61540
16664 -61540 -47181 -46101 -64386 -52180 -36964 -24663 -7190 -16656 -18575 -25886 -25836 -1023 10629
16651 10629 -18573 -36431 -39412 -29085 -26385 -14629 -11835 -6344 742 5808 3835 -3628 3185
16638 3185 -977 -918 -5183 -26581 -18433 -13464 -14087 1830 14837 22426 13228 25706 38515 48538
16624D8538n313n15Q859K0111M3535M6387L0923J3223L7369M3697p632o5021o7275
16611A46886j3300j496J0697J6279K8439J2831N888L8566M6575J2534p3475q7147
16599A43277m9106k6673l8295j0835K2434r466j5491Q36M163r747p381N337o607
16586B446n415p53K082l453j8857p961J2974J237J1187J09j4612R540M074j8838
16572b6240R44L039j1784j1218L243J3283P81J1961o976j9531j7244N672P735
16559d6335O396K1981J0746R779n904k8993l076R720j3454J1804K70O86M772J6837
16545d771q368m3270j664K1622K0238m65M863m520R730L05K203M859K1480K720
16531B4962j0050j2664k8196p757j0008J3867j03j170l018P514R858r479L313
$$ plain form
16624 48538 43225 42710 51569 71680 115215 161602 192525 205748 243117 286814 279182 214161 146886
16611 146886 133586 132090 142787 159066 187505 200336 206224 244790 291365 303899 230424 143277
16599 143277 94171 67498 29203 18368 40802 31336 15845 16681 20844 11097 3716 9053 2446
16586 2446 -2969 -3722 -1640 -5093 -23950 -31911 -18937 -17700 -6513 -6404 -21016 -11476 -7402 -26240
16572 -26240 -25296 -22257 -34041 -45259 -42016 -28733 -27952 -15991 -22967 -42498 -59742 -54070 -46335
16559 -46335 -39939 -17958 -7212 2567 -3337 -32330 -35406 -25686 -39140 -27336 -27066 -26380 -21608 -4771
16545 -4771 -13139 -56409 -58073 -36451 -16213 -16678 -11815 -16335 -6605 -6300 -4097 762 22242 24962
16531 24962 14912 2248 -25948 -33705 -43713 -29846 -29949 -31119 -34137 -26623 -16765 -26244 -22931
16518b2931K2201P234m668J0500q893r034j5513q79L064J8148r785l1485J2588
16505b9453K620M92k743j123J2370o619J0354n209j5458K238J2362N655O61j1351
16491b5204j1078J1914L379k725Q75K342j2997m537J0375R136L61r298m884j5687
16477d8028j5599O949O780k057L660P344j1569J2841P525k766O580M459m994q364
16463c7239o315J5186K0876q808n71K392k2927o60q27m894M730n930J1042J3809
16449b0136K53l173r717Q571L168l203j1452N949J2120j5675j5870J3171K0837
16436a5157R56n77m482R716j6876k1782j3286J6117J0555j5540j3471J6008K3406
16423b4413J7627O562J7923j130k6840k4676j2792J4431P356J3906j597M380k1814
$$ plain form
16518 -22931 -730 6504 1836 12336 3443 -5591 -21104 -21983 -18919 -771 -10556 -42041 -29453
16505 -29453 -26833 -26341 -29084 -30207 -17837 -24456 -14102 -19311 -34769 -32531 -20169 -14514 -13853 -25204
16491 -25204 -36282 -24368 -20989 -23714 -22839 -20497 -33494 -38031 -27656 -18520 -18159 -27457 -32341 -48028
16477 -48028 -63627 -56678 -49898 -51955 -48295 -40951 -52520 -39679 -32154 -34920 -28340 -23881 -28875 -37239
16463 -37239 -43554 -28368 -7492 -16300 -16871 -14479 -37406 -38066 -38893 -43787 -39057 -44987 -33945 -20136
16449 -20136 -19883 -23056 -32773 -24202 -21034 -24237 -35689 -29740 -17620 -33295 -49165 -35994 -15157
16436 -15157 -14201 -14778 -19260 -9544 -26420 -48202 -61488 -45371 -34816 -50356 -63827 -47819 -24413
16423 -24413 -6786 -224 17699 16569 -10271 -34947 -47739 -33308 -25952 -12046 -13643 -9263 -31077
16410c1077L696p872k011J2666J300n699J1915M895J2564j0618j7070k479J2192
16397a7598r691N400l007J5290K4251K4818J628O458J2988N331J9139K1661M2746
16384A49414N1412N9085N4444M7016L0297L4365j2011q9713q5141m6374m0682
16373A52112j6999J1611J9507L6843N1126M1634M9572N1807M9697J1646j02555
16362C56001j21472n4440m4921k8080q819j7681j7667j0982k383q892n755m049
16350C0860p834P63q413L180N717j6067j3056J1129j202o166l94M905j795j5487
16336a3860r068L293J4841m815j8639k026l200J2327J2262J4447J874j878r405
16323c847J665j3298q816j2507P643J5218q479j3756k779n205J6411N694p398
$$ plain form
16410 -31077 -27381 -35253 -37264 -24598 -23298 -28997 -17082 -12187 377 -10241 -27311 -29790 -17598
16397 -17598 -27289 -21889 -24896 -9606 14645 39463 41091 47549 60537 65868 85007 106668 149414
16384 149414 200826 259911 314355 361371 391668 426033 414022 324309 239168 192794 152112
16373 152112 135113 146724 166231 203074 254200 295834 345406 397213 446910 458556 356001
16362 356001 234529 180089 135168 107088 98269 80588 62921 51939 49556 40664 34909 30860
16350 30860 23026 23789 15376 18556 24273 8206 -4850 6279 5077 -1089 -1483 3422 1627 -13860
16336 -13860 -22928 -19635 -4794 -9609 -28248 -30274 -33474 -21147 -8885 5562 7436 5558 -3847
16323 -3847 -2182 -15480 -24296 -36803 -29160 -13942 -22421 -36177 -38956 -44161 -27750 -22056 -29454
16310b9454p839j439j2346n631K7724K0387j1825j115J849r40k933L060J993m527
16296b3036J0937K965K227j874j5091l168j0132N887K4437j5148p315R500m340
16283b4151M150j0972o515P802r41O565J832j0358m0895l667L1351J3320K422
16270c0057L691l180K3401L762m609p045k2731q141q742J7331N066n320R995J2793
16256a3786q372j0382m432r377Q356O5K0285j2970J7160J5468j2370j6976k2355
16243d9686q063K4501Q451j5830n91M834J3042j089j190j428Q643J2864J0878
16230E336o308l596r622m966Q102K000K446p620J0076J993p492j6717r352J4049
16216b1671J2725N558K419j2747m0140q354k384R815K4911J9438q167K235R231
$$ plain form
16310 -29454 -37293 -38732 -51078 -56709 -28985 -8598 -20423 -21538 -19689 -20629 -23562 -20502 -18509 -23036
16296 -23036 -12099 -9134 -6907 -8781 -23872 -27040 -37172 -31285 -6848 -21996 -29311 -19811 -24151
16283 -24151 -20001 -30973 -37488 -29686 -30627 -24062 -22230 -32588 -73483 -77150 -45799 -32479 -30057
16270 -30057 -26366 -29546 -6145 -2383 -6992 -14037 -36768 -44909 -53651 -36320 -31254 -36574 -26579 -13786
16256 -13786 -22158 -32540 -36972 -46349 -37993 -37928 -17643 -30613 -13453 2015 -10355 -27331 -49686
16243 -49686 -57749 -33248 -24797 -40627 -41218 -36384 -23342 -24431 -25621 -27049 -18406 -5542 5336
16230 5336 -972 -4568 -14190 -19156 -11054 -9054 -6608 -14228 -4152 -2159 -9651 -26368 -35720 -21671
16216 -21671 -8946 -3388 -969 -13716 -53856 -62210 -64594 -54779 -29868 -10430 -18597 -16362 -7131
16203g131p450r222k0657Q7J9919K6053K359j0869J1797j1626j9800O504m502
16190b4538k111n553M937j578j8811j6501j116L0798J6824J3300M09P386Q858
16177A2304j8284j8896q457j0190L479P013m151j0673K9579K5641N219j2099n073
16164d588N851l040n40R87j4175n684N778L362J3843O88J9733j2310k0637Q446
16150b286N576k3985j2853J1129n988k227j1646j827J9061P068j0271R653O036
16137a2560q524o907J3980n238n587j5717j1530K4609J6528o028q173k4474K268
16124d7353J4445J1848O866k744J4973k832J0363L744j245k7343M531J5439j059
16111c67j7331k3356K534J4756K440k316L269j2808L455O928j2584J6085j137
$$ plain form
16203 -7131 -14581 -23803 -44460 -44373 -24454 1599 3958 -6911 4886 -6740 -26540 -20036 -24538
16190 -24538 -26649 -32202 -27265 -28843 -47654 -64155 -65271 -34473 -17649 -4349 -3940 3446 12304
16177 12304 -5980 -24876 -33333 -43523 -40044 -33031 -37182 -47855 -18276 7365 12584 485 -4588
16164 -4588 1263 -1777 -2317 -1330 -15505 -21189 -15411 -12049 1794 2482 22215 9905 -10732 -2286
16150 -2286 3290 -20695 -33548 -22419 -28407 -30634 -42280 -44107 -25046 -17978 -28249 -18596 -12560
16137 -12560 -21084 -27991 -14011 -19249 -24836 -40553 -52083 -27474 -10946 -16974 -25147 -49621 -47353
16124 -47353 -32908 -21060 -14194 -16938 -1965 -4797 5566 9310 8065 -19278 -14747 692 -367
16111 -367 -17698 -41054 -38520 -23764 -21324 -23640 -20371 -33179 -29724 -22796 -35380 -19295 -20432
16098b0432K218P743j3154o291L685n250j5634L866J5797k709l267m740L182O213
16084b8773P125J447m100k644J122j0804J5510J097R27J2270M025j1300j0377
16071b4475J2761K762Q72k99R297n183n874J6041K649j9662j9114k58L96Q102
16057b1985J6848Kn900k599j663L476J0102j5541q033J5561J7766j211o152k7241
16043b6570J69q714J5616J0340L43O034J8054j1354k0028j1830P97o12N055n010
16029b7710N03J9134j23o915j73Q013O218r100j1556P609m647J0317J6552M912
16015A3034j3486J4339k669k3659q168R266J7038j6453k0492r119J2057P931n618
16002b5999J6558j1909j2929j3814J8436K5354R66k6986r420J7505J671N62m556
$$ plain form
16098 -20432 -18214 -10471 -23625 -29916 -26231 -31481 -47115 -43249 -27452 -30161 -33428 -38168 -34986 -28773
16084 -28773 -21648 -20201 -24301 -26945 -25823 -36627 -21117 -20020 -19093 -6823 -2798 -14098 -24475
16071 -24475 -11714 -8952 -8080 -8379 918 -4265 -10139 5902 8551 -11111 -30225 -30483 -30087 -21985
16057 -21985 -5137 -5135 -11035 -13634 -15297 -11821 -1719 -17260 -25293 -9732 8034 6823 671 -26570
16043 -26570 -26401 -35115 -19499 -9159 -8816 -2782 15272 3918 -16110 -27940 -27143 -27755 -22700 -27710
16029 -27710 -27207 -8073 -8196 -15111 -15284 -7271 -1053 -10153 -21709 -14100 -18747 -8430 8122 13034
16015 13034 -452 13887 11218 -12441 -20609 -11343 5695 -10758 -31250 -40369 -28312 -20381 -25999
16002 -25999 -9441 -21350 -34279 -48093 -29657 -4303 -3337 -30323 -39743 -22238 -20567 -20005 -24561
15989b4561O103M265O359q624J353J3987O605O745n981m137n010j0833K917K434
15975h378j4832j0788N190J7349j99n33J1858J0278j841j1321p864o94j5537j2918
15961d0230Q757l048q17K338J4146o087j1623O267P968r344j1604R666K4244M535
15947d832k758o290o965J5929J0567M913j6097j6112O424J3052j1674q095K298
15934a9640j1448R607N096j0128l944L015J483k677j0194P771J8134J7838k1907
15921a6994k3495Q577K687M451j4160M839n637M325J834M562Q310q236m741K31
15907c3447J2107l589n881l504j4350M983Q450q142N437R869P061j4009j1793
15894d6808K1625J2644j6555j0110M884R16K978j7185J2138K9360k1k4880j1862
$$ plain form
15989 -24561 -18458 -14193 -7834 -16458 -15105 -1118 5487 12232 6251 2114 -2896 -13729 -10812 -8378
15975 -8378 -23210 -33998 -28808 -11459 -11658 -12191 -333 9945 8104 -3217 -11081 -11775 -27312 -40230
15961 -40230 -31473 -34521 -35338 -33000 -18854 -24941 -36564 -30297 -22329 -31673 -43277 -33611 -9367 -4832
15947 -4832 -7590 -13880 -20845 -4916 5651 10564 -5533 -21645 -15221 -2169 -13843 -21938 -19640
15934 -19640 -31088 -21481 -16385 -26513 -30457 -27442 -25959 -28636 -38830 -31059 -12925 4913 -16994
15921 -16994 -40489 -31912 -29225 -24774 -38934 -34095 -39732 -35407 -33573 -29011 -20701 -28937 -33678 -33447
15907 -33447 -21340 -24929 -30810 -34314 -48664 -43681 -35231 -43373 -37936 -28067 -21006 -35015 -46808
15894 -46808 -25183 -12539 -29094 -39204 -34320 -33404 -30426 -47611 -35473 -6113 -6134 -31014 -42876
15881d2876l699O454K1266j9904j0401K3535R637o881l965P335p096O847J9734
15868a4j5973j3521O751K1523m528k432l743p099R473k783j2799k5284J7308K0026
15854a3095j204p858J1148L607k854n158N288p319K958P957R991p664j7967l952
15840b6122Q280Q453r167J1285K678m738K847J1710p797j4407j4440q25J2005
15827b0238Q925J9914l577j1878j4876l599J3582m215m342L686o058l355J0908
15814a5123l191p952J5270K8209k3353l2052l172p858J6J9726L8377k532j7277
15801a0912k740k081o800o861J3353p830P124K554j0516j1426o560J568N097N242
15787c0788j6053m405K1324q08l78O756L873J1446N310j6578n071j1736J4914
$$ plain form
15881 -42876 -46575 -40121 -18855 -38759 -49160 -25625 -15988 -22869 -26834 -19499 -26595 -19748 -14
15868 -14 -15987 -29508 -22757 -1234 -5762 -8194 -11937 -19036 -9563 -12346 -25145 -50429 -33121 -13095
15854 -13095 -14299 -22157 -11009 -7402 -10256 -15414 -10126 -17445 -14487 -6530 3461 -4203 -22170 -26122
15840 -26122 -17842 -9389 -18556 -7271 -4593 -9331 -6484 5226 -2571 -16978 -31418 -32243 -20238
15827 -20238 -11313 8601 5024 -6854 -21730 -25329 -11747 -15962 -20304 -16618 -22676 -26031 -15123
15814 -15123 -18314 -26266 -10996 17213 -6140 -38192 -41364 -49222 -49206 -29480 8897 6365 -10912
15801 -10912 -13652 -15733 -22533 -29394 -16041 -23871 -16747 -14193 -24709 -36135 -42695 -41127 -36030 -30788
15787 -30788 -46841 -51246 -29922 -30730 -31108 -24352 -20479 -9033 -3723 -20301 -25372 -37108 -22194
15774b2194P252o303N804M983j1689n532J883L536j2712j5533P414K669J7537
15761b2885q000l849L500p634p175L95K992J3957M058r147P263K1977o649L42
15747a0855j301n706O002R195J5474j5445k6534k2917J361L9993J427j2816K0148
15734a974M775J001j3757p395L669L39m479O393J1652l474m678q414r309j3818
15720c9469l771m363L431M729j0899K228J156R561k493N360J6046j8375P666q82
15706c0075L987K945O218p767R400m53o066K957j856P241p343j4060j2941K728
15692d5085q046N931j3475J242J9994J3931K774q925j3810O330L3288J5792m200
15679E741j2641n499j755l314j428j6477j7486M774K6265K080R88j678j4283L254
$$ plain form
15774 -22194 -14942 -21245 -15441 -10458 -22147 -27679 -25796 -22260 -34972 -50505 -43091 -40422 -22885
15761 -22885 -30885 -34734 -31234 -38868 -46043 -45648 -42656 -28699 -24641 -33788 -26525 -4548 -11197 -10855
15747 -10855 -12156 -17862 -11860 -2665 12809 -2636 -29170 -52087 -50726 -10733 -9306 -22122 -1974
15734 -1974 2801 3802 -9955 -17350 -13681 -13342 -17821 -11428 224 -3250 -7928 -16342 -25651 -39469
15720 -39469 -43240 -47603 -44172 -39443 -50342 -48114 -46958 -37397 -39890 -34530 -18484 -36859 -29193 -30075
15706 -30075 -26088 -23143 -16925 -24692 -15292 -15745 -21811 -18854 -20710 -13469 -20812 -34872 -47813 -45085
15692 -45085 -53131 -47200 -60675 -59433 -39439 -25508 -22734 -31659 -45469 -39139 -5851 9941 5741
15679 5741 -6900 -12399 -14154 -17468 -18896 -35373 -52859 -48085 -21820 -19740 -18752 -20430 -34713 -31459
15665c1459L377J0321J2283q251p683q723J0002R519r648O014R287J0589j174
15652D454k7481j5150J9401M584j352r347m61N891J6739P272j4937j0602J5789
15639e200K8891O656j5458l0817J7057M128j0571J967N079k0021J81j589J9514
15626a83K1667N677j3237m284l87j3481j5433L381K77k6625J561K246l937N801
15612c6957J3699J3746r053j366K480j7361O418J9042R730J1764j0179j9850j378
15599a9265n247R105Q432r81r960L929O159r511O930L300j2548p49K0026K1252
15585B0872M285l964K6221j3986l3397j9797q222K047R711R189j393k300j408
15572a2142R874k825n613l410O782P217J1114j343K335M14Q942R530k806j2782
$$ plain form
15665 -31459 -28082 -17761 -5478 -13729 -21412 -30135 -20133 -10614 -20262 -14248 -4961 5628 4454
15652 4454 -23027 -38177 -18776 -14192 -15544 -24891 -25352 -19461 -2722 4550 -10387 -20989 -5200
15639 -5200 23691 30347 14889 -15928 1129 5257 -5314 -3347 1732 -18289 -18108 -19697 -183
15626 -183 21484 27161 13924 9640 9253 -4228 -19661 -16280 -16003 -42628 -41067 -38821 -42758 -36957
15612 -36957 -23258 -9512 -18565 -19931 -17451 -34812 -28394 -9352 378 12142 1963 -17887 -19265
15599 -19265 -24512 -15407 -6975 -7956 -17916 -13987 -7828 -17339 -10409 -7109 -19657 -20406 -380 20872
15585 20872 25157 21193 47414 33428 31 -19766 -27988 -25941 -16230 -7041 -8434 -10734 -12142
15572 -12142 -2268 -5093 -10706 -14116 -7334 -117 10997 9654 11989 12403 21345 30875 28069 15287
15558A5287o928q447J2039r522j492J652j1947J5898j604r78O458j4756j5880
15545b0220Q196J4791l766J2261j933L694k5670j1360j4817R55m557J4409K3711
15532d306J2064j151m74J4331j9695j9310j672L007n366p782K241L30j7386j0238
15518e5407J1808K3548M485J890m022j0460l597q210J4857K1028q95Q051k890
15505A86l215R754l205j1322J1871J7126J802j3828P787j1999k7274n960k63N15
15491b8025Q323P028r102k6518P855K2799k995r856j981j628N919J8783M676j0206
15477a4928n673L884J4311N189q134K150J009N378k097j5676j6781o518L1015
15464f871J8472j7456J305j3714j2970l247M788J3660m546n083j1921J2217K0189
$$ plain form
15558 15287 8359 -88 11951 2429 937 2589 -9358 6540 4936 3958 10416 -4340 -20220
15545 -20220 -12024 2767 -999 11262 9329 13023 -12647 -24007 -38824 -37869 -42426 -28017 -4306
15532 -4306 7758 6607 6133 20464 769 -18541 -20213 -17206 -22572 -30354 -28113 -27783 -45169 -55407
15518 -55407 -43599 -20051 -15566 -13676 -17698 -28158 -31755 -39965 -25108 -4080 -4975 3076 186
15505 186 -3029 6725 3520 -7802 4069 21195 22997 9169 16956 4957 -22317 -28277 -28540 -28025
15491 -28025 -19702 -12674 -21776 -48294 -40439 -17640 -20635 -30491 -32472 -34100 -28181 -9398 -4722 -14928
15477 -14928 -20601 -16717 -2406 2783 -5351 -3201 -2192 3186 1089 -14587 -31368 -37886 -6871
15464 -6871 11601 -5855 -4550 -18264 -31234 -34481 -29693 -16033 -20579 -25662 -37583 -25366 -5177
15451e177j336j0027J125j6400o560K633J2969J3798J3547m864J80R940K376k2561
15437a0357L51j4604j3821P880J7699k982K632L899k7246J0228K150o084q356
15424c8611J2006k37R62Q366J5557K1681N058N315j6103j3959j6268k0194L31
15411c6096M801K377k345R95P337p181n049P408k3152J1831K7334O96k455j6496
15397b9995O245m519R518OJ138O656j903J1803l718Q653J2755k3037p957P224
15383g131P709k372j7721P882M138q285J3164J1611j2043l898M233k658k8665
15370c4036j9920J5104J6274J1142J031K160K63l84l363R09k894k524k412J741
15356a6909p317J2639L049K092k3614j728R899J765J2600J2576m242K444K214
$$ plain form
15451 -5177 -6513 -16540 -15415 -31815 -38375 -35742 -22773 -8975 4572 -292 -112 9828 12204 -10357
15437 -10357 -10006 -24610 -38431 -30551 -12852 -15834 -13202 -9303 -36549 -26321 -24171 -30255 -38611
15424 -38611 -26605 -26842 -25880 -17514 -1957 19724 24782 30097 13994 35 -16233 -36427 -36096
15411 -36096 -31295 -28918 -31263 -30268 -22931 -30112 -35161 -27753 -50905 -39074 -11740 -11044 -13499 -29995
15397 -29995 -23750 -28269 -18751 -18745 -17607 -10951 -12854 -1051 -4769 3884 16639 -6398 -14355 -7131
15383 -7131 578 -1794 -19515 -11633 -7495 -15780 -2616 8995 -3048 -6946 -2713 -5371 -34036
15370 -34036 -53956 -38852 -22578 -11436 -10405 -8245 -7982 -8366 -11729 -10820 -13714 -16238 -18650 -16909
15356 -16909 -24226 -11587 -8538 -6446 -30060 -31788 -21889 -20124 -7524 5052 810 3254 5468
15343E468n827p151j0485j7102j1818L0351K362m547J526Q113P605K790Q298l078
15329F505l839m351k74m811M597r043j4483P204l675j0655J1230R689Q547n602
15315h961J357K372K539k1351l1817o50J6582J2799J166O384J1216N721J971q676
15301i348J0637K0507k024l1704N692N114k255k663j9638l856L987j0041M047
15288c1545N873J886J8897J2102k0558k2167R052j77O682Q423K0999J6015j5070
15275A0412j4312n589n775o233P811P623p848k99n624M103J2971J6304j6280k5507
15261b8243m472k767J1610N473q498K3039O403j6338j9894K251J8507q228M109
15248a7048k197O326n666o093m088J1054r327k497K9148k475j5427j1339l565
$$ plain form
15343 5468 -359 -7510 -17995 -35097 -46915 -16564 -14202 -18749 -17223 -9110 -1505 1285 9583 6505
15329 6505 2666 -1685 -1959 -6770 -2173 -11216 -25699 -18495 -22170 -32825 -21595 -11906 -3359 -8961
15315 -8961 -7604 -5232 -2693 -24044 -55861 -56511 -39929 -27130 -25964 -19580 -8364 -2643 -672 -9348
15301 -9348 1289 21796 19772 -11932 -6240 -1126 -3381 -6044 -25682 -29538 -25551 -35592 -31545
15288 -31545 -25672 -23786 -4889 7213 -13345 -35512 -26460 -26637 -19955 -11532 9467 25482 10412
15275 10412 -3900 -9489 -15264 -21497 -13686 -6063 -13911 -14210 -19834 -15731 -2760 13544 -2736 -28243
15261 -28243 -32715 -35482 -23872 -18399 -26897 -3858 2545 -13793 -33687 -31436 -12929 -21157 -17048
15248 -17048 -19245 -12919 -18585 -24678 -28766 -17712 -27039 -29536 -388 -2863 -18290 -29629 -33194
15235c3194K6015J3501j1952o690J955j350N495o772L815o024j1188K796J3064
15222a0529n768O670M574n174k305N752J0454j048k1564j6262j15J7895K8073
15209A0653l416k6620l992K9631L759j2535k0856p017k315J5694J5269R200j4054
15196f599J206J6533M044M667J0994m693k5706j934Q399j1656L250J0042m806
15183C741J1865m135P75j277p300j8616Q112n506M988K47L3j5051J877J9461M665
15168C879j292K294P14j1279j2892k485k0454j5375L2312J9743J3262j058o030
15155A339j5623l337k483Q618K4297j1541p022Q534j647m099P233J231Q470n643
15141H327j4760j010j7213N579L8322J2911j6081m066J2168M868R063j628L024
$$ plain form
15235 -33194 -7179 6322 -5630 -12320 -10365 -11715 -6220 -12992 -9177 -15201 -26389 -23593 -10529
15222 -10529 -16297 -9627 -5053 -10227 -12532 -6780 3674 2626 -18938 -35200 -35315 -17420 10653
15209 10653 7237 -19383 -23375 6256 10015 -2520 -23376 -30393 -32708 -17014 -1745 7455 -6599
15196 -6599 -5393 11140 15184 19851 30845 26152 446 -1488 6911 -4745 -1495 8547 3741
15183 3741 15606 11471 12246 10969 3669 -14947 -6835 -12341 -7353 -7106 -7073 -22124 -20247 -786 3879
15168 3879 2587 4881 5595 -5684 -18576 -21061 -41515 -56890 -24578 -4835 8427 7369 1339
15155 1339 -14284 -17621 -20104 -11486 12811 1270 -5752 2782 1135 -2964 4269 5500 13970 8327
15141 8327 -6433 -7443 -24656 -19077 19245 32156 16075 12009 24177 29045 38108 36480 39504
15128C9504J5632j3861j9541J4016J561j5035p853j0376q388j9398m345J2456
15116a5628N06K096J373j9150L559N136N230J4096Q851J963j5433j4935n521Q374
15102a9483M51N704R916L325J5029j0714k1774r70m279J1881J150j4975n745J7012
15088a3472M502j0993R514Q357j675Q600J1176J7067q526j4642j9470P143j4013
15075a6432j1061k173J6055J3386J316N16m903O829P791J2666j4334l8308k6571
15062e5223j354J0337N857J4160M845j1951Q01J7437K6866p908o769J340j181
15049b743k1680L104p394l314O862j4127R176L1244P5O98L935J8874L54k7578
15035b514m199L848O16j519R22P776J9946j5760r076o321k420R712p334J869J3333
$$ plain form
15128 39504 55136 41275 21734 35750 37311 22276 14423 4047 -4341 -23739 -28084 -15628
15116 -15628 -15122 -13026 -11653 -30803 -27244 -22108 -16878 -2782 6069 8032 -7401 -22336 -27857 -19483
15102 -19483 -19032 -13328 -3412 -87 14942 4228 -17546 -18516 -22795 -10914 -9764 -24739 -30484 -13472
15088 -13472 -8970 -19963 -10449 -2092 -3767 4833 16009 33076 24550 9908 -9562 -2419 -16432
15075 -16432 -27493 -29666 -13611 -225 1091 1607 -3296 3533 11324 23990 9656 -28652 -55223
15062 -55223 -56577 -46240 -40383 -26223 -21378 -33329 -32528 -15091 11775 3867 -2902 -1562 -2743
15049 -2743 -24423 -21319 -28713 -32027 -25165 -39292 -30116 1128 1203 1901 5836 24710 25064 -2514
15035 -2514 -6713 -2865 -2249 -3768 -2846 4930 24876 9116 40 -6281 -8701 1011 -6323 -4454 8879
15020H879J4219K17j0979J2908m122R18J3637K230J6245P991j437q357o660K1273
15006F6962R495j5959K361J5996N1914N6756M2401Q9259J25337J56372K23693
14995H24587L54723M35443L70079K40561K09359M29999J96331r44506q30446m21735
14985H64395k00680j06106o9934m5723o1283l9918j8483j4969l1925l0919k9274
14974B15181j6521k6622j9268k5374r339K638j9799k3752j6686M809p920k865
14962E4482j3514j3220j8074j2163L98j386J731J763M099P547k421n321L849k353
14948E417r205r088n32j3176J5319L572J908R709p937j1908J8481O8M683j294
14934F017K2462J3800k5644k6407j0429O750k251j6310K306J532J9533N706O891
$$ plain form
15020 8879 23098 23315 12336 25244 21122 22040 35677 37907 54152 62143 60706 52349 45689 66962
15006 66962 76457 60498 62859 78855 130769 187525 229926 319185 444522 600894 824587
14995 824587 1179310 1614753 1984832 2225393 2434752 2864751 3061082 2116576 1286130 864395
14985 864395 663715 557609 487675 441952 380669 340751 322268 307299 275374 244455 215181
14974 215181 198660 172038 152770 127396 118057 120695 100896 77144 60458 65267 57347 54482
14962 54482 40968 27748 9674 -2489 -2091 -3477 -1746 17 4116 11663 9242 3921 7770 5417
14948 5417 -3788 -12876 -13408 -26584 -11265 -7693 -5785 3924 -4013 -15921 2560 2628 7311 6017
14934 6017 28479 42279 16635 -9772 -20201 -13451 -15702 -32012 -29706 -28174 -8641 -2935 3956
14921C956k4067j1906n448Q0J404J6960J3014r720j4967K5764J5783J2362j101
14908B2114k3537k9914L840j1738O611K307k961J6324J929P63M010o967O875r865
14894b0209p058J0477J4691k052q565o738L688K3568L35r275j0787k731Q561m787
14880a0882k087j4743j4891J4127K2176n955J5985n89k976j9469N745N939l616
14867a1236P46K0568j62J9859J5163k5504j0737K290m745j75o823j3002k0858
14854c4616K146o770n968K5252K6409j6354j5007K4724J8530J0532j0859J4788
14842C2807r24k7579j4986P296K2524j1276k9j2789j041J8441J1901l956j0601
14829I788j6522K835K1832K195m081Q189k4107j3061j4196o086K4430J1113O92
$$ plain form
14921 3956 -20111 -32017 -37465 -37385 -35981 -19021 -6007 -15727 -30694 -4930 10853 23215 22114
14908 22114 -1423 -31337 -27497 -39235 -32624 -30317 -33278 -16954 -15025 -14262 -10252 -17219 -10344 -20209
14894 -20209 -27267 -16790 -2099 -4151 -12716 -19454 -15766 7802 8137 -1138 -11925 -14656 -6095 -10882
14880 -10882 -12969 -27712 -42603 -28476 -6300 -12255 3730 3141 165 -19304 -13559 -7620 -11236
14867 -11236 -10490 10078 9916 29775 44938 19434 8697 10987 6242 6067 -756 -13758 -34616
14854 -34616 -32470 -39240 -45208 -19956 6453 -9901 -24908 -184 18346 28878 18019 32807
14842 32807 31883 4304 -10682 -3386 19138 7862 7833 -4956 -5997 12444 24345 20389 9788
14829 9788 -6734 -3899 17933 20128 16047 24236 129 -12932 -27128 -33214 -8784 2329 3021
14816C021j9641O521O127M489R260M507P908l286l8832n189J6586K4764J2070
14803B8305q99n394O425R631r985r082Q414o248k5956q54J1117K877J90M425J5316
14788B8282j2847Q084J1306k117j2955k37p184J2223j6872j6483K2152R439j7417
14775E374q570N280j4045l542j1369J7488Q2q236J1867J0648J74O404R974m322
14761A7207j8735j1191j2717j0751q031Q688J0967J0794N556J3432M227n302J8587
14748B2731J926m968J45n176m907M82j3391j0720q085J3713M512P086k0820J8659
14734A187K1629l056Q74r738j0110m847Q464O578K5670j129j8511l36j1120j4545
14720h990j70J0142m242K385m178M899k784j43l311K205M122J5010j820j0011
$$ plain form
14816 3021 -16620 -10099 -3972 517 9777 14284 22192 18906 -19926 -25115 -8529 16235 28305
14803 28305 27406 22012 28437 38068 28083 19001 27415 21167 -4789 -5643 5474 8351 8541 12966 28282
14788 28282 15435 23519 34825 32708 19753 19516 12332 24555 7683 -8800 13352 22791 5374
14775 5374 -3196 2084 -11961 -15503 -26872 -9384 -9302 -17538 -5671 4977 5151 11555 21529 17207
14761 17207 -1528 -12719 -25436 -36187 -44218 -35530 -24563 -13769 -8213 5219 9446 4144 22731
14748 22731 24657 19689 19834 14658 9751 10233 -3158 -13878 -21963 -8250 -3738 3348 -17472 1187
14734 1187 22816 19760 20634 10896 786 -4061 4403 10981 36651 35522 17011 16675 5555 -8990
14720 -8990 -9160 982 -3260 -875 -5053 -154 -2938 -3081 -6392 -4187 -65 14945 13125 3114
14706C114o718M638m576n438M38M904Q234p673O089J519l872N097j0289o320p912
14691a8765r319R389J0737O766L741M693k3090k7291Q195J1372j4689r392J5498
14678c2155J1032K263j821L796Q913O475R646O051j6204K282L005j3327m955J4215
14664g84p545j2397J903K3131O283n955J097O060M40r965j6j2867k5722J6019
14650b0318J3566J577k384p980m837R195J3552O71N868K124j7792r705J0760L383
14636b320L516L727J1643j5325k1076r66Q514J3140q067m989J3311O665m883p4
14622B816K9468n615P4m542j8543j0158j5582N320L192k472O224J2016J8799q919
14608A2078j8860J2356J4961J5436n097o311N555M945J4247Q78l8188j7914O516
$$ plain form
14706 3114 -3604 1034 -3542 -8980 -8542 -3638 4596 -3077 3012 4531 659 5756 -4533 -10853 -18765
14691 -18765 -28084 -18695 -7958 -1192 2549 7242 -15848 -43139 -34944 -23572 -38261 -47653 -32155
14678 -32155 -21123 -18860 -20681 -16885 -7972 -1497 8149 14200 -2004 278 3283 -10044 -14999 -784
14664 -784 -8329 -20726 -18823 4308 10591 4636 5733 11793 12233 2268 2252 -10615 -36337 -20318
14650 -20318 -6752 -5175 -7559 -15539 -20376 -11181 2371 3042 8910 11034 -6758 -16463 -5703 -2320
14636 -2320 1196 4923 16566 1241 -19835 -20801 -12287 853 -7214 -12203 1108 7773 2890 2816
14622 2816 32284 26669 26743 22201 3658 -6500 -22082 -16762 -13570 -16042 -9818 2198 20997 12078
14608 12078 -6782 5574 20535 35971 30874 24563 30118 35063 49310 50188 12000 -5914 602
14595F02J8858J7030j172j7538P263r370j2276j8152P622R648L163j1370m738
14582a0430K4445M927r977J321O905l473j9000j075K878k488K8455K2980j3876
14569C1592k3102p965Q556j8295l949R241J0989M464K421J1089k214j156j1199
14556A0472j7700M057J6918N738k344O442o592j9769P353L672o09n664K2932o119
14542A8787k6457j9826L225N985j0170Q112Q140q40M083N54q86j5196J0325l068
14528a7232j0522M127J8080J221j3474P031J0506R409q139j2829o62o747j3710
14515c2941r631K100L490L032J6364m27j0238l588J2677O239K816J5266K622k0210
14501a2429k1928j916J2011P796R868O803J3445P923M704m274J2020k7351Q727
$$ plain form
14595 602 19460 36490 35318 17780 25043 15673 3397 -14755 -7133 2515 5678 -5692 -10430
14582 -10430 14015 18942 8965 10286 17191 13718 -5282 -6357 -3479 -5967 22488 45468 31592
14569 31592 8490 525 9081 -9214 -13163 -3922 7067 11531 13952 25041 22827 21671 10472
14556 10472 -7228 -3171 13747 19485 17141 23583 16991 -2778 4575 8247 7638 1974 24906 18787
14542 18787 -7670 -27496 -24271 -18286 -28456 -20344 -12204 -13044 -8961 -8407 -9293 -24489 -14164 -17232
14528 -17232 -27754 -23627 -5547 -4326 -17800 -10769 -263 9146 1007 -11822 -12484 -19231 -32941
14515 -32941 -42572 -40472 -36982 -33950 -17586 -18013 -28251 -31839 -19162 -12923 -10107 5159 7781 -12429
14501 -12429 -34357 -36273 -24262 -16466 -6598 205 13650 21573 26277 22003 34023 6672 15399
14488A5399K374j1847k640n725m163J3190L11o500J08K6284j046j7937j2830J400
14474c622J9188J1623k144L661l99J3613j0120j6496J517n59J40j3187L994J2534
14460A9743Q829O38j1671j5173J760M758k994J0341J4623q951o602q457j777r68
14446D099L050m369k022L908M169P991K93k8423p066R801L883l596N313P821Q020
14431A2872k503J8242J0365k225r957k0437k455P259q495l07L278o707Q49j5195
14417a5416J0330O746j5008k4356r701J4452J4791M603j1088J6633Q602j8871
14405a8283j1825j3318K490J070J4905K768k970J1362P885j444j6190R887J826
14392a1837O476K529j2520J2022J887q360J6128K7063p510k0326k263J2478p087
$$ plain form
14488 15399 17773 5926 3286 -2439 -6602 6588 6899 399 507 26791 25745 7808 -5022 -3622
14474 -3622 15566 27189 25045 28706 28307 41920 31800 15304 16821 16262 16402 3215 7209 19743
14460 19743 28572 29210 17539 2366 4126 8884 5890 16231 30854 21903 15301 6844 5067 4099
14446 4099 7149 2780 758 4666 8835 16826 17119 -11304 -18370 -8569 -4686 -8282 -2969 4852 12872
14431 12872 10369 28611 38976 36751 26794 6357 3902 11161 2666 2359 5637 -1070 -221 -15416
14417 -15416 -5086 1660 -13348 -37704 -47405 -32953 -18162 -13559 -24647 -8014 588 -18283
14405 -18283 -30108 -43426 -40936 -39866 -24961 -22193 -25163 -13801 -5916 -7360 -23550 -13663 -11837
14392 -11837 -5361 -2832 -15352 -3330 -1443 -9803 6325 33388 25878 5552 3289 15767 8680
14379H680N531M740J7045m315q313k801J87o492j461q46k630J4032L607k2610
14365D354j4489N544J889Q708J6052m601o89j2523O884n13j2894J170m77n423
14351g008K1711Q435M464J1656j7664j4409j08j2944k0195J250J3390L676l62
14338h108R703o378J2737J7115p264k0339p446J012K098o740J3384l36r435j0337
14324b0334J1005K13N052J887K0033J5815p689r852n266j6400k133o259J071j2942
14310b5799o769R752q665J342p58J0506R126k799o66J7654J1710K55j4360p857
14296g328J0728j36p396J6872n515k8631l432k501L649O856N614P83R137J0777
14282I477j866p025j1466k382N107J4050J587j1361K8313J0554k2535j7008R1
$$ plain form
14379 8680 14211 18951 35996 31681 23368 20567 20754 14262 12801 11955 9325 23357 26964 4354
14365 4354 -10135 -4591 -2702 6006 22058 17457 16768 4245 11129 10616 -2278 -1108 -1585 -7008
14351 -7008 14703 23138 27602 39258 21594 7185 7077 -5867 -26062 -24812 -11422 -7746 -8108
14338 -8108 1595 -4783 7954 25069 17805 -2534 -9980 -8968 -6870 -13610 -226 -562 -9997 -20334
14324 -20334 -9329 -9116 -4064 -2177 17856 33671 25982 16130 10864 -5536 -7669 -13928 -12857 -25799
14310 -25799 -32568 -22816 -31481 -30139 -30897 -20391 -11265 -14064 -14730 2924 14634 14889 529 -7328
14296 -7328 3400 3264 -4132 12740 7225 -21406 -24838 -27339 -23690 -16834 -11220 -10437 -1300 9477
14282 9477 7611 586 -10880 -13262 -8155 5895 7482 -3879 24434 34988 12453 -4555 -4464
14269d464j1448K016n372J769Q794J7457J2981J0461k472r127n755j2025n080
14256b265j9774K558J7902j1456R171K0915l939q892j0837m757J4142J0622j5572
14243b182k313N036N641R350j9654j9532R297Q063Q234Q524P180j0423K976o84
14229I513k025o086j445J0322O536o16J1119m368j4672Q586N981J136j0740j7416
14215d175L398N405p042j7255j47K4516J2162k901P229R591j4693k6898Q98K4918
14201A5006p315m296q893k831Q514j2830P334R789J5027P3l607J02M056R15l791
14186A7253r053p598j4641k137J747P170J057N495R361Q235M880J3876j8694m137
14172A2814n572O467n629p669K805k511p140l541O326K083l637P844L913n342
$$ plain form
14269 -4464 -15912 -13896 -19268 -17499 -8705 8752 21733 32194 29722 20595 14840 2815 -2265
14256 -2265 -22039 -19481 -1579 -13035 -3864 17051 13112 4220 -6617 -11374 2768 13390 -2182
14243 -2182 -4495 541 6182 15532 -4122 -23654 -14357 -6294 1940 10464 17644 7221 10197 9513
14229 9513 7488 1402 -43 10279 16815 16199 27318 22950 8278 16864 22845 23981 13241 -4175
14215 -4175 -777 4628 -2414 -19669 -19816 4700 16862 13961 21190 30781 16088 -10810 -9912 15006
14201 15006 7691 3395 -5498 -8329 185 -12645 -5311 4478 19505 19578 15971 16073 20129 21044 17253
14186 17253 8200 602 -14039 -16176 -14429 -7259 -6202 -707 8654 16889 21769 35645 16951 12814
14172 12814 7242 13709 8080 411 3216 705 -6435 -9976 -3650 -1567 -5204 2640 6553 1211
14158A211O929O224j6765j0299m963J6424R132q67k766p392N97L367j114K030
14144A748k9049j1141J2425J5324j6904R161J5970N193m489J8708J1271J6912
14132D5129j3124k5295j8023r488J6808q936j3808J1554J5487Q166M00j241o038
14119A591M379k787r484k033l8J3326R10J663O300n661j4861r292K5335J9138
14105B8486o601p953j6095L836j82J228l330J6908Q839J3380n921j5687m716m881
14091G311k190O783J8373p201m339J4425R104l867k0001n043j2573l725q782j559
14077a3284J8001J7669N976k7962j6961J3808J058p032j6191P368L72J4804P103
14064D729p180q863j3572M813J7146J0412P268o88r447j1265P618j1494j5820
$$ plain form
14158 1211 8140 14364 -2401 -12700 -17663 -1239 7893 7026 4260 -3132 -2535 832 -282 1748
14144 1748 -27301 -38442 -26017 -10693 -27597 -18436 -2466 2727 -1762 16946 28217 45129
14132 45129 32005 6710 -11313 -20801 -3993 -12929 -26737 -15183 304 8470 8870 7629 1591
14119 1591 5970 3183 -6301 -8334 -8372 4954 5864 7527 13827 8166 -6695 -15987 9348 28486
14105 28486 21885 13932 -2163 1673 1491 2719 -611 16297 25136 38516 32595 16908 12192 7311
14091 7311 5121 11904 30277 23076 18737 33162 42266 38399 18398 13355 782 -2943 -11725 -13284
14077 -13284 4717 22386 28362 400 -16561 -2753 -1695 -8727 -24918 -17550 -17178 -2374 4729
14064 4729 -2451 -11314 -24886 -20073 -2927 7485 14753 14065 4618 -6647 971 -10523 -26343
14051b6343K4752N751j4761J0737K954l422J1363L586j1927J0535J9695R69j6067
14038A7822k2633p309J945L867q907j259J9990J5867j0245Q588K1584q680j8231
14025A2399K581J7562lq321k266j4819j050J4956J0130J9296L272r409J0288K3845
14011G8461J2426l2989m1175j2085J1969j4687L35K1272j3501l467P683J6063
13999C0305J3921l520j4055j4122J0300K6827m999j5411j2461n276q655j6234
13987a3380l835K9115J3888l931J0090j2008M217k892L956j888K042q258j7863
13974g47j7790j221J3959L078L724p456l861K842N928l000M870J8435J7606J2467
13960D8834j6802k3772K450p446j956M352N02K634R867J0158J6442k025k658j2572
$$ plain form
14051 -26343 -1591 4160 -10601 136 3090 -332 11031 14617 2690 13225 32920 33889 17822
14038 17822 -4811 -12120 -10175 -6308 -15215 -16474 3516 19383 9138 17726 39310 30630 12399
14025 12399 14980 32542 32539 24218 21952 7133 6083 21039 31169 50465 53737 44328 54616 78461
14011 78461 90887 57898 16723 4638 16607 1920 2255 23527 10026 6559 14242 30305
13999 30305 44226 40706 26651 12529 22829 49656 44657 29246 16785 11509 2854 -13380
13987 -13380 -17215 11900 25788 21857 31947 19939 24156 21264 25220 23332 25374 17116 -747
13974 -747 -18537 -19758 -5799 -2721 1003 -6453 -10314 -7472 -1544 -4544 326 18761 36367 48834
13960 48834 32032 8260 10710 3264 1308 5660 6162 8796 18663 28821 45263 43238 40580 28008
13946B8008l813j0697L848P741j8439P194j4339k697K2187J2091o426O85M672
13933C0015o113p328J016o145m004M221P988j1002k910L914l786j6699m168R757
13919e244N030k532P367J4690q08j9166L186o35j0233J2807K7553J2738j3122
13906C1631j000J8298L002r328j2622j2383k090m20p7N836J5380J7744J1462M559
13892F9992r25Q778K3598L2933K4404K7396N7571M4385K3932O716l0076m7286
13880B41418m9415m7989k7900j9990k6144k1590j3087J726Q675P023j1633j90
13868D0904o319j5103n131M572k922j3585m699j0072J1666L460N13L437P559M421
13854A8701o218j7174m469J742J8269R61j8209q717L362J1432K476N690M676M592
$$ plain form
13946 28008 24195 13498 17346 25087 6648 13842 -497 -3194 18993 31084 24658 25343 30015
13933 30015 23902 16574 17590 11445 7441 11662 19650 8648 5738 9652 5866 -10833 -15001 -5244
13919 -5244 -214 -2746 4621 19311 18503 -663 2523 1888 -8345 4462 32015 44753 31631
13906 31631 30631 48929 51931 42603 29981 17598 15508 15088 15011 20847 36227 53971 65433 69992
13892 69992 69067 77845 101443 134376 158780 186176 243747 288132 312064 318780 288704 241418
13880 241418 192003 144014 116114 96124 69980 48390 35303 37029 45704 52727 41094 40904
13868 40904 34585 19482 14351 18923 16001 2416 -2283 -12355 -689 2771 3284 6721 14280 18701
13854 18701 12483 -4691 -9160 -7418 10851 11812 -6397 -15114 -11752 -320 2156 7846 12522 17114
13840A7114k3895O261L830M20J4007M771j726l559N207J2905j3704p16Q525p804
13826B1636n673J5735J609m387l248j7654l125Q830j1856j084N100O80k2551p620
13812b3608j4310K59K5449m118k0684j161K4788n75M22l841j960o948J5674O314
13798d299k529O630K237J3865J8423m001k3184j2945J8291J2156j3375n80r737
13785I52r953j4466J3817J8128l80j546K9812L760j6156j713J9991j0033j4074
13772A8139j229J2618R583j64m724R9j3739j6136O015J474P403j5975j8979p91
13758a6406L196J7491j4655j1130N023L575M35P534J2033J6480K818j8241R887
13745A8040K784o046K539K173M812R746K226N729r70j4313j2661o624J2469J9694
$$ plain form
13840 17114 -6781 -520 3310 3730 17737 22508 20782 17223 22430 35335 21631 20915 29440 21636
13826 21636 15963 31698 33307 28920 25672 8018 4893 13723 1867 783 5883 6563 -15988 -23608
13812 -23608 -37918 -37659 -12210 -16328 -37012 -38173 -13385 -13960 -13538 -17379 -19339 -26287 -10613 -4299
13798 -4299 -6828 -198 2039 15904 34327 30326 7142 -5803 12488 24644 11269 10689 952
13785 952 -9001 -23467 -9650 8478 8098 6552 36364 40124 23968 22255 42246 32213 18139
13772 18139 16910 29528 39111 38947 34223 34322 20583 4447 10462 11936 19339 3364 -15615 -16406
13758 -16406 -13210 4281 -10374 -21504 -16481 -12906 -12471 -4937 7096 23576 26394 8153 18040
13745 18040 20824 14778 17317 19490 24302 34048 36274 42003 41033 26720 14059 7435 19904 39598
13731C9598p180O341N332k7617j3952J580J0694Q397J0971j0354K272Q805n606
13718B9281n903n974Q386l177j217j3383K3475p52R290j647j8359J5166k544j5849
13704A6793n31m908J1571k159l132o235k0476J0426J4363j6552j2511J9065J6053
13691B1767p927r13R224j1620j2197o770J3505R098J2652M48k347M526j782PJ0558
13676C8229n339l77o408j5763p560p012q182M427K7460L247j1893j0711p689R43
13662f628K8881J9883M57k0301o650J138J153K2709P197q508K164q968j9535j4295
13648a303J3802K8642m054r116r754k3919k732J5399N396k440J0027q06M454l924
13634A9672O671j7636r365n359L562J637j2376n066K1254J4808L689r2j0335p321
$$ plain form
13731 39598 32418 38759 44091 16474 2522 4102 14796 23193 34164 23810 26082 34887 29281
13718 29281 23378 17404 25790 22613 21396 8013 31488 30736 40026 38379 20020 35186 32642 16793
13704 16793 16262 11354 22925 20766 17634 11399 -9077 1349 15712 -840 -13351 5714 21767
13691 21767 13840 12927 22151 10531 -1666 -8436 5069 14167 26819 27267 24920 29446 27664 27671 38229
13676 38229 32890 32513 26105 10342 2782 -4230 -12412 -7985 19475 22722 10829 118 -7571 -6628
13662 -6628 22253 42136 42593 22292 15642 16780 17933 40642 47839 39331 41495 32527 12992 -1303
13648 -1303 12499 41141 37087 27971 18217 -5702 -8434 6965 12361 9921 19948 19142 23596 19672
13634 19672 26343 8707 -658 -6017 -2455 -818 -13194 -18260 2994 17802 21491 21399 11064 3743
13620C743P050J3793P805j0799m505r519o385O720k172N335o904O006O373L705
13606B0246N252j2768L879K383l46q25q812p840O104j5503L957J0559P196j7724
13592d242j7124N868o040L515M178J4921J6618l467j5326n597P806K0112Q960
13579C0182q091j0937o123J402J5480M481m241l891q716P664M406m722k7272L119
13565g259J3575O989J1312j703J5494J575M527q271k0603m157Q620J2967P626
13552D0692P999j6685q831J5151J0319O05m624J0108j7099k552K832j3706O61
13539B4870J1831j998k9593k7733N054J3788J6403M537O191J1876r259m33j4377
13526A1157p869m01P794J1276L915J5302j170n978j2654P85l099l661P992R391
$$ plain form
13620 3743 10793 24586 32391 21592 17087 7568 1183 7903 5731 11066 4162 10168 16541 20246
13606 20246 25498 12730 16609 18992 18646 17821 9009 1169 7273 -8230 -4273 6286 13482 -4242
13592 -4242 -21366 -15498 -21538 -18023 -13845 1076 17694 14227 -1099 -6696 1110 21222 30182
13579 30182 22091 11154 5031 6433 21913 26394 22153 18262 9546 17210 21616 16894 -10378 -7259
13565 -7259 6316 13305 24617 22914 38408 39983 44510 36239 15636 11479 20099 33066 40692
13552 40692 48691 32006 23175 38326 48645 49250 44626 54734 37635 35083 37915 24209 24870
13539 24870 36701 34703 5110 -22623 -17569 -3781 12622 17159 23350 35226 25967 25534 11157
13526 11157 3288 2887 10681 21957 25872 41174 40004 34026 21372 22157 19058 15397 23389 32780
13512C2780j169k2812k901q566K173k231L673K2088J3535N327j2086j3726r105
13499F980O170K576R535J2912J937J0061J6383K796j0150j1845j5267m515J223
13486B8796R541k3497Q868R08K711O651O884J0002o590j3739q21K341j2615N08
13472A9948J3149o000J1418J1370o509j4978j2739J2950n482j9097j1823r871
13460a7664K5012J5876J4786k506j5441j8665K0749P200k1647J2781K8946K826
13448E2253j4115j7010m92K2669j5601k58J1522L528n882m946Q41J068j0386J1355
13434C4546j059m719p392N186J1587m493k106p250k4566K1840K368j0952J3005
13421B5995J9598k768k3750j4218K818J5572J9993J0933L483j7883j3923j3322
$$ plain form
13512 32780 31611 8799 5898 -2668 -495 -2726 947 23035 36570 41897 29811 16085 6980
13499 6980 13150 15726 25261 38173 40110 50171 66554 69350 59200 47355 32088 27573 28796
13486 28796 38337 14840 23708 24616 27327 33978 40862 50864 44274 30535 29714 32055 19440 19948
13472 19948 33097 27097 38515 49885 43376 28398 15659 28609 23127 4030 -7793 -17664
13460 -17664 7348 23224 38010 35504 20063 1398 22147 29347 7700 20481 49427 52253
13448 52253 38138 21128 20636 43305 27704 27446 38968 42496 36614 31668 32509 33577 23191 34546
13434 34546 33487 28768 21376 26562 38149 33656 31550 24300 -266 21574 23942 12990 25995
13421 25995 45593 42825 19075 4857 7675 23247 43240 54173 57656 39773 25850 12528
13409A2528j7872k978J6397J9143J140N197o39Q864Q962j8289N862O43j0522j5268
13395A3168J1939J3631K9685j128k5363k246M86J2887j2722j4433K755K1087J5617
13382F5363j9062q109J0903J8059j1144l311O239J2492J0598J5203j505K661l4826
13369F3561L775J3506R457K4065R153j0319O614q850m474J2319J6738J5177M677
13356A55399l984L126K0014L4808K5604M0314R6213J25629J47121K23419K79455
13345A147118K59038K10215K14217K80017J93311l71815n89774l97923k07592
13336G36812j53650r2441o2760j1760j4928l6620N327j2231k3417j0783M42k7368
13324B96623l7713j6990k0740j947o541J0807j4790l4555j2407Q843n281j9645
$$ plain form
13409 12528 -5344 -8322 8075 27218 28358 33555 32916 41780 50742 32453 38315 38958 28436 13168
13395 13168 25107 38738 68423 67295 41932 39686 40172 53059 40337 25904 28659 49746 65363
13382 65363 46301 38192 49095 67154 56010 52699 58938 71430 82028 97231 95726 98387 63561
13369 63561 67336 80842 90299 114364 123517 113198 119812 110962 106488 118807 135545 150722 155399
13356 155399 151415 154541 174555 209363 234967 275281 371494 497123 644244 867663 1147118
13345 1147118 1406156 1616371 1830588 2110605 2303916 1932101 1342327 944404 736812
13336 736812 583162 490721 427961 416201 401273 364653 369980 357749 334332 323549 323991 296623
13324 296623 258910 241920 221180 219233 212692 223499 208709 174154 161747 170590 165309 145664
13312A45664m002J3551Q114K2891K9673L2070L0224N4865O4496J13235J52563
13301F63344K03808K68835L05682L15289L15503L14671K40549k9439k48390m27023
13291A922829n44995l91154k19242j28534j02369n1155l2985k5001k7619m1522
13281C58253k8594j6235j1750j3992m1229k4115j1752k8205j6051k2276j2279
13270A31775p327k3424J3663q241N559M409j1190J0774r23k8012j6324r518J6212
13257G7433j045n835j6913o156J1703o888k08L860j71j1354K4958K2339N389j060
13243I6052q10Q383O493r939j1321k218J0176O23j6532l812M633m921R392n263
13229H0936j2855J0329m316j9596o122J1723M045J4348J4976N708J6433r424l3603
$$ plain form
13312 145664 141662 155213 163327 186218 215891 247961 278185 333050 397546 510781 663344
13301 663344 867152 1135987 1441669 1756958 2072461 2387132 2627681 2598242 2349852 1922829
13291 1922829 1377834 986680 767438 638904 536535 485380 452395 427394 399775 358253
13281 358253 329659 313424 301674 287682 246453 222338 210586 182381 166330 144054 131775
13270 131775 124448 101024 114687 106446 112005 116414 105224 115998 115075 87063 70739 61221 77433
13257 77433 76388 70553 53640 47484 59187 52299 52091 55951 55780 44426 69384 91723 97112 96052
13243 96052 95242 103625 110118 100179 88858 86640 96816 97439 80907 77095 81728 76807 86199 80936
13229 80936 68081 78410 74094 54498 48376 60099 64144 78492 93468 99176 115609 106185 72582
13216G2582k8361M625K8363J4486Q202j8730r7k895K906J8894l84J544R99L89
13202A02523j1754J004j8120L192N160k5298o060M474J3107K3975M947P883J3784
13189A18817p487J31O103r044j0552o429N991P880M177O083k38p676j1871k0066
13175G5819J2609J3007k1212M143J1648k3649l1860m157N849k1048n517M647J780
13162B2059K4625M038J1512K0925k971L606L446M721o974k3131o652M409L193
13149F2806j4509j9541J134Q420L953j2120N55J7110R959q406L537K0088J6884
13136H9870J0985j739m546l122Q190Q879m752j2308K1639J9814R007k5639q324
13123A07954L4041P391N887K1067L5162N3017M2107N1428N7127M5118O0418M6463
$$ plain form
13216 72582 44221 48846 77209 91695 99897 81167 81070 78175 81081 99975 99591 101135 102134 102523
13202 102523 90769 91773 73653 76845 82005 56707 50647 55121 68228 92203 97150 105033 118817
13189 118817 111330 111461 117564 108520 97968 91539 97530 105410 109587 115670 115432 107756 95885 75819
13175 75819 88428 101435 80223 84366 96014 72365 40505 36348 42197 21149 15632 20279 22059
13162 22059 46684 50722 62234 83159 80188 83794 87240 91961 84987 61856 55204 59613 62806
13149 62806 48297 28756 29890 38310 42263 30143 30698 47808 57767 49361 52898 72986 89870
13136 89870 100855 99116 94570 91448 99638 108517 103765 91457 113096 132910 141917 116278 107954
13123 107954 141995 149386 155273 176340 211502 264519 306626 358054 415181 460299 520717 567180
13111E67180J4411K1216j9671n2888p4697p8841o8793n7540l2518k4460J890n401
13099A89888j642k14j3460k8301j2754N246l521Q008P586j2523l881j3697m996
13086A15739m225O973K4696l2716k2791K103J0855J5043l381k3307j1839n242
13074G1908Q165J7049N523p180j693j5432K8136J4669q560r710j1218J1203J7527
13061A20387o45K2528J5677J7729m813p830j8771J4871J9354j6734p854K7314
13049A81213K3781J4388l859M444J653j6063k3347l2303o54R211P329k391L642
13036A67044K2651N275R152J7451j2088P570K4035j1352j7463J064n584J0194
13024B17949J8139J5504l476k9289j0964p075R95K1353R179N877j75K625K6113
$$ plain form
13111 567180 581591 602807 583136 530248 455551 376710 307917 250377 217859 193399 195289 189888
13099 189888 188246 188032 174572 146271 133517 138763 135242 143250 150836 138313 134432 120735 115739
13086 115739 111514 118487 143183 110467 87676 89779 100634 115677 112296 88989 77150 71908
13074 71908 80073 97122 102645 95465 93772 78340 106476 121145 112585 102875 91657 102860 120387
13061 120387 119742 142270 157947 175676 170863 163033 144262 159133 178487 161753 153899 181213
13049 181213 204994 219382 215523 219967 221620 205557 182210 149907 149253 158464 165793 163402 167044
13036 167044 189695 194970 204122 221573 209485 217055 241090 229738 212275 213339 207755 217949
13024 217949 236088 251592 248116 218827 207863 200788 201783 223136 232315 238192 238017 240642 266755
13011B66755J6626l480O076j3921k977J5407K2423j4693j2660J166j8673k1322
12999B40727q083J6585J6508J9634K0789J5980K0537K0269K5598M970l609k5865
12987C64040l7151m2808k6170l9147p3953n8805n1687k6009N350J0455K5287L5414
12975H4816M5040K7912J9663K5003J0757J4723M2484L2424L1941R727J0865L9855
12963C95210K5361K6869L0406K1605N544m736J4315K3618J4125K6609L5191M1358
12951F55475M2860r983j8480k2869j5834j3480k803j1488k641k272P51j4688K514
12938E87062l481J1507L916j3196l83J8084L949J5741L9579L1443K8835L1371
12926G54427J1087J5748q531J1200L4309L4146L6828L4151K3139L2605K9791M2140
$$ plain form
13011 266755 283381 279901 285977 272056 269079 284486 306909 292216 279556 280722 262049 240727
12999 240727 232644 249229 265737 285371 306160 322140 342677 362946 388544 393514 389905 364040
12987 364040 326889 284081 257911 218764 144811 86006 34319 8310 13660 24115 49402 84816
12975 84816 129856 157768 177431 202434 213191 227914 270398 302822 334763 344490 355355 395210
12963 395210 420571 447440 477846 499451 504995 500259 514574 538192 552317 578926 614117 655475
12951 655475 698335 688352 669872 647003 631169 617689 614886 603398 600757 598485 599236 584548 587062
12938 587062 583581 595088 599004 585808 585425 603509 607458 623199 662778 694221 723056 754427
12926 754427 765514 781262 772731 783931 818240 852386 889214 923365 946504 979109 1008900 1051040
12914A051040K8465j100L380K3870L9838M6589L9711M7568N9334M5974N5703O2626
12902A502998M8850N8138N3487P5797R5033J04235J34347J17774J25731J64573
12892B480963J49343J59535J96256J99600K39780K76015K81283L10043L15609
12883D608427L10092L32886L84554M53210N23297O36061P47924Q86857J072826
12874I956134J318821J635024J991534K474368L186512M196085N560097P426346
12866C7744921J0107265J4068473J9685843K7768634L8963855N0755037N8415347
12859B57509375N9036687N5241101N4322187M9451497K82340m2794353p4514153
12852C58534681j02495503p4992902m3051435k5231532j6078061j0895445p863459
$$ plain form
12914 1051040 1079505 1078405 1081785 1105655 1145493 1192082 1231793 1279361 1338695 1384669 1440372 1502998
12902 1502998 1551848 1609986 1663473 1739270 1834303 1938538 2072885 2190659 2316390 2480963
12892 2480963 2630306 2789841 2986097 3185697 3425477 3701492 3982775 4292818 4608427
12883 4608427 4918519 5251405 5635959 6089169 6612466 7248527 7996451 8883308 9956134
12874 9956134 11274955 12909979 14901513 17375881 20562393 24758478 30318575 37744921
12866 37744921 47852186 61920659 81606502 109375136 148338991 199094028 257509375
12859 257509375 316546062 371787163 426109350 475560847 475843187 433048834 358534681
12852 358534681 256039178 181046276 137994841 112763309 96685248 85789803 77926344
12845G7926344o091655n548042n628952n921536o085063n809374n192533m468296
12837C3180893l774511l188819k718401k371269k097555j845070j650969j454892
12829A4079407j275908j126928r79071q51706p55125o86116o04190n50101n19546
12820F730716m74481m11173l95274l78464l67724l40739l07430k64743k49762
12811C540926k37658k39194k17163j75546j59399j54578j36006j31751j25427
12802A964204j34338j29260j07379q6377r4351n6991n5733o3310o8719m5012l1237
12791A091497k6644m4217k5766l0346j0131j2109j6471m3656r582J428J2271L5209
12779I21483M2855P2299J02624J39882J41326J87992J96621J45035J46357K09834
$$ plain form
12845 77926344 71834689 66286647 60657695 54736159 48651096 42841722 37649189 33180893
12837 33180893 29406382 26217563 23499162 21127893 19030338 17185268 15534299 14079407
12829 14079407 12803499 11676571 10697500 9845794 9090669 8404553 7800363 7250262 6730716
12820 6730716 6256235 5845062 5449788 5071324 4703600 4362861 4055431 3790688 3540926
12811 3540926 3303268 3064074 2846911 2671365 2511966 2357388 2221382 2089631 1964204
12802 1964204 1829866 1700606 1593227 1506850 1412499 1355508 1299775 1236465 1167746 1122734 1091497
12791 1091497 1064853 1020636 994870 964524 954393 942284 925813 882157 872575 874003 886274 921483
12779 921483 964338 1036637 1139261 1279143 1420469 1608461 1805082 1950117 2096474 2306308
12769B306308k5988n03604m57836k70998j63722j00851o9833n9587m6620k2778
12759E84491j4192j8577k5642q84j4864j5039N44M878j4481l4842k3530j0281
12747D17581K3712K2721L686Q185Q46O592K3249K6796K6894M3177N0442O6693
12735G20574N9032K6421L7805o922k4353n7271o9484q4169r8340n2189o1248l5667
12723C54189k2157j7315j4513J556j909p901Q844L221Q17K747q79k1368j4095
12710B71237j1135j863l268m424k503k3267q720j6587j7079J3616n15N812q190
12697A93114R189O609J3122m631j0108j0120r441n084o583k2403o456J477M144
12684A52829j954p505q116k2072l829n469M241J8454Q4O062N351p967l3061k6747
$$ plain form
12769 2306308 2280320 1776716 1318880 1047882 884160 783309 713476 653889 607269 584491
12759 584491 570299 551722 526080 525196 510332 495293 495837 500715 486234 451392 427862 417581
12747 417581 441293 464014 467700 475885 476731 483323 506572 533368 560262 603439 653881 720574
12735 720574 779606 806027 843832 836910 812557 755286 685802 601633 503293 451104 389856 354189
12723 354189 332032 314717 300204 301760 299851 291950 300794 304015 304832 307579 306700 285332 271237
12710 271237 260102 258239 254971 250547 248044 224777 216057 199470 182391 196007 195492 201304 193114
12697 193114 202303 208912 222034 217403 207295 197175 187734 182650 176067 153664 147208 148685 152829
12684 152829 150875 143370 135254 113182 109353 103884 108125 126579 126663 132725 138076 130109 97048 70301
12670G0301j2734k0292k5525M185l872K244l695J3234K5340J3661L1644J8380
12658A12871j1069p312n831l1260k7936O504J8384J6105J3397j1652R11R146O178
12645H8436J3161n787n509l638j16J2094j138J084k612J7527M530l52M74k0646
12631I7508k9852j9662j1256N843J3497R559k020m004m691j4280j1982J6418R087
12618E4165k332j7845p230L711k1267P180j369K1R860K7019K0285J4532j4453
12605G2277P147J5377j1844k7220k1985k2065l0721o123J6773Q059p515j2023
12593a9863j1078O525K0529J3710l450J0857n398l788J4841j1824L940k131o026
12580F844m62J7778L5879O597j6600m316N237J2180O532k122j396P519J2255p857
$$ plain form
12670 70301 57567 37275 11750 15935 12063 14307 10612 23846 49186 62847 94491 112871
12658 112871 101802 94490 88659 57399 29463 35967 54351 70456 83853 72201 73112 82258 88436
12645 88436 101597 95810 90301 86663 86547 98641 97503 98587 95975 113502 118032 117680 118154 97508
12631 97508 67656 47994 36738 42581 56078 65637 63617 59613 54922 40642 28660 45078 54165
12618 54165 51833 33988 26758 30469 9202 16382 15013 15034 24894 51913 72198 86730 72277
12605 72277 79424 94801 82957 55737 33752 11687 -19034 -25157 -8384 -325 -7840 -19863
12593 -19863 -30941 -24416 -3887 9823 6373 17230 11832 8044 22885 11061 15001 12870 6844
12580 6844 6382 24160 60039 66636 50036 45720 50957 63137 69669 67547 66151 73670 85925 78068
12566G8068j8143n254r366P316k3407j14J2851J0815R745p996K818j1510l202
12553D2621O99m011J2337K743k2128q890J4985K009Q986j2774M70J300J0221j6214
12539C2354o326J0489j610O900L728j4902K242q740j2138p199j5267R115K0664
12526A9310J9352o534j3316m455L261J323m017R818j771R463K1200m802j6828
12513C2004j688o236Q371R118q894r581M186o545P33J0190k5774j0084Q453K4261
12499B8514L768P569p504l809J4405k0668j3546P0o840k23J0760j0168j6188P288
12485f572J4962j37j1040Q201Q082O915k768j1415J6102J0436O292k194j8934
12472A7930j9610p564L999O703Q154n718J0811J6351j6P244j4753j7590O706P10
$$ plain form
12566 78068 59925 54671 45305 52621 29214 29100 41951 52766 62511 54515 57333 45823 42621
12553 42621 43320 39309 51646 54389 32261 23371 38356 40365 49351 36577 37047 38347 48568 32354
12539 32354 26028 36517 34907 41807 45535 30633 32875 24135 11997 4798 -10469 -1354 19310
12526 19310 38662 32128 18812 14357 17618 18941 14924 24742 22971 32434 53634 48832 32004
12513 32004 30316 24080 32451 41569 32675 23094 27280 20735 21468 31658 5884 -4200 4253 28514
12499 28514 32282 39851 32347 28538 42943 22275 8729 8799 1959 1736 12496 2328 -13860 -6572
12485 -6572 8390 8253 -2787 5414 13496 20411 17643 6228 22330 32766 39058 36864 17930
12472 17930 -1680 -9244 -5245 1458 9612 3894 14705 31056 31040 38284 23531 5941 12647 13357
12458A3357j5370j807q656O308J8448J2882K339N546j0572L110J0306J6526J2859
12445F5276J6780O318n874j7852j134p331o497q021J0571M159L073q967j8959
12432C1542k136j508M877P357P798J4198K0817J5687J6351L6719M1627K6138L1226
12419B50693J04342J26515J49050K14760K59500K84760K75709K88122L02725K67772
12409B523948p067k45612m29926n31221l81457k20050j34708p5192n5457m2316
12399D00942l9167j8305l5617l7015k6275k9315l7613k0114p653k1442j8013k163
12387A08250r5k4457j8626q279p55M266j5255j3766p940J7234o701q260P2K1645
12373D7333L636k012J904j0874p574j7639j5918p396j7752J321J6086J1067Q219
$$ plain form
12458 13357 -2013 -3820 -12476 -6168 12280 25162 27501 33047 22475 25585 35891 52417 65276
12445 65276 82056 88374 82500 64648 63514 56183 49686 41665 52236 56395 59468 50501 31542
12432 31542 29406 27898 32775 40132 47930 62128 82945 98632 114983 151702 193329 219467 250693
12419 250693 355035 481550 630600 845360 1104860 1389620 1665329 1953451 2256176 2523948
12409 2523948 2516881 2271269 1841343 1310122 928665 708615 573907 498715 443258 400942
12399 400942 361775 343470 307853 270838 244563 215248 177635 157521 149868 128426 110413 108250
12387 108250 108155 83698 65072 56793 56038 60304 45049 31283 23343 40577 33876 25616 25688 47333
12373 47333 50969 48957 50861 39987 32413 14774 -1144 -8540 -26292 -24971 -8885 2182 10401
12360A0401K4937J24j2295l36k0995j0681n269J5122j615o356J1960J4442J90
12347A9629K377P605j9930R023q195o100j1814q434O683R972N45Q563K0664J5879
12333D6467j0274o383m441k2039N205O797p287n879J0165P27j5866o035M540j0911
12319a5214J370O569k147o226N843j0974o224J7157O843L635J9828l122j0518
12306F820J7946j0711j7966Q74k602o130l834J2203J7766o048o331J9109k0953
12293A43N031Q422M553M854K190j6880j0398R70N433O466j595j2812r974J4356
12279G59O872j1327K608o52l276L4094O75k2724K632m814k1773k3537k0273k243
12265f2979J2142L3056K4435k438P256j884N02R831j5671j8137k6470n484P755
$$ plain form
12360 10401 35338 35462 23167 22831 1836 -8845 -14114 1008 -607 -6963 4997 19439 19629
12347 19629 22006 29611 9681 18704 10509 4409 -7405 -15839 -9156 816 1361 9924 30588 46467
12333 46467 36193 29810 25369 3330 8535 15332 8045 2166 12331 13058 -2808 -8843 -4303 -15214
12319 -15214 -13844 -7275 -9422 -15648 -9805 -20779 -27003 -9846 -3003 632 20460 17338 6820
12306 6820 24766 14055 -3911 -3037 -5639 -11769 -15603 -3400 14366 8318 1987 21096 143
12293 143 5174 13596 18149 23003 25193 8313 -2085 -1115 4318 10784 9189 -3623 -13597 759
12279 759 7631 -3696 -1088 -1740 -5016 29078 29753 7029 9661 4847 -16926 -40463 -60736 -62979
12265 -62979 -50837 -17781 6654 4216 11472 9588 10090 19921 4250 -13887 -40357 -45841 -38086
12252c8086K2962r307n086R008q925j3428N654L3228J1765J8875J0333N26j3631
12239B3888k83j2157j4090L581j0289K006J5220j114M83j1290J033k335o055K723
12225h679o531K339j504N261K1558p020j3263l47j3595J244l054k561J7159J3699
12211D706N255m209k1381r966K4990J4242K36n754q663j4407o140M986K1299K1260
12197B6454k0089k4973P763L824j3080p966l225R188R882J9007k0675N971L659
12184d260P882J0411p429P887o205j7337m074J757L000j5227j74J0943j6016J1298
12170a7544m210J373J0127J0836n230J0680k316p653Q008L3j0358J765j182m86
12156f157N684m994K1057J4738k4230k3175k5844j968l507K3114j8109Q119L0678
$$ plain form
12252 -38086 -15124 -24431 -29517 -20509 -29434 -42862 -37208 -3980 7785 26660 36993 37519 23888
12239 23888 23605 11448 -2642 939 -9350 -7344 7876 6762 7245 -4045 -3012 -5347 -11402 -8679
12225 -8679 -15210 -12871 -14375 -9114 12444 5424 -7839 -8186 -21781 -20537 -23591 -26152 -8993 4706
12211 4706 9961 5752 -15629 -25595 -605 13637 13873 8119 -544 -14951 -21091 -16105 5194 26454
12197 26454 6365 -18608 -10845 -7021 -20101 -28067 -31292 -22104 -12222 6785 -13890 -7919 -4260
12184 -4260 3622 14033 6604 14491 8286 -9051 -13125 -11368 -8368 -23595 -23769 -12826 -28842 -17544
12170 -17544 -21754 -20381 -10254 582 -4648 6032 3716 -3937 4071 4104 -6254 -4489 -5671 -6157
12156 -6157 -473 -5467 15590 30328 6098 -17077 -42921 -44889 -48396 -25282 -43391 -35272 -4594
12143d594J4550l970j8899k5263r118j1960j927J1663K5557K3717N882l5254k4281
12130e3897J8089K4090l111j62Q620R360n284J7571m99p133p877J738k893j5959
12116a7347L45J369J5843J9022O711j3098j1307j2643L202j5753M512O825o904
12103a9223O890J934j599r268N75J0784J2108j0704N426J9077m267n229K1816
12090B8320J5364k087r270n690M831p441j1536Q406k132k6567j1257j98j417J018
12076a9656j1667r681M751r931o505J4769K5087J4930J4887O853P960J4543j7164
12063B9176j4329j1036j6069O012l879k4661J525Q864J1454j0763q839k0660j911
12050e5116m047J2215L0176J5263M319j593j64l845j382K9719L801j2220J3036
$$ plain form
12143 -4594 9956 5986 -12913 -38176 -47294 -59254 -61181 -49518 -23961 -244 5638 -29616 -53897
12130 -53897 -35808 -11718 -14829 -14991 -6371 2989 -2295 15276 14777 7644 -233 1505 -1388 -17347
12116 -17347 -17002 -15633 210 19232 25943 12845 1538 -11105 -7903 -23656 -19144 -12319 -19223
12103 -19223 -12333 -10399 -11998 -21266 -20691 -9907 2201 -8503 -3077 16000 11733 6504 28320
12090 28320 43684 41597 32327 26637 31468 24027 12491 20897 18765 -7802 -19059 -19257 -20674 -19656
12076 -19656 -31323 -41004 -36253 -46184 -52689 -37920 -12833 2097 16984 23837 31797 46340 29176
12063 29176 14847 3811 -12258 -6246 -10125 -34786 -33261 -24397 -12943 -23706 -32545 -53205 -55116
12050 -55116 -59163 -46948 -16772 -1509 2810 1217 1053 -2792 -4174 25545 29346 17126 30162
12037C0162n292j2767n912j908J1427J8931M100j5829l5647J405P603O799Q510
12024A1582Q774m314Q286m69q43q632M346j3609j3643o185J780k855K543l887
12010a7126J4828K787o163q943R574K5773L935J180j2218p675J7442k765l814
11997A6815j0142l409j339O879j1934r166P185j6519n16J6640l026r088r018J7095
11983i543l062k3599K00J2548Q79J4038l882j4727l786J496R796J7980J567m939
11969e034j4366j4390R312q434q54N209J4917K218p343J2624K491k1277J5727
11956i200P714p382j2754Q495K3116J621K348J9679M506m71l3669m512n119q276
11942a3904k695j1169j22j1977l991J3114N427J1764J3762j2540J2456K1838J9325
$$ plain form
12037 30162 24870 12103 6191 4283 15710 34641 38741 22912 -12735 -11330 -3727 3072 11582
12024 11582 20356 16042 24328 23859 23016 14384 18730 5121 -8522 -14707 -12927 -15782 -13239 -17126
12010 -17126 -2298 489 -5674 -14617 -5043 20730 24665 25845 13627 5952 23394 20629 16815
11997 16815 6673 3264 1925 8804 -3130 -12296 -5111 -21630 -22146 -5506 -8532 -17620 -26638 -9543
11983 -9543 -12605 -36204 -36004 -23456 -22577 -8539 -12421 -27148 -30934 -29438 -19642 -1662 -95 -5034
11969 -5034 -19400 -33790 -24478 -32912 -33766 -28557 -13640 -11422 -18765 -6141 -3650 -24927 -9200
11956 -9200 -1486 -8868 -21622 -13127 9989 11610 13958 33637 38143 37672 4003 -509 -5628 -13904
11942 -13904 -16599 -27768 -27890 -39867 -43858 -30744 -25317 -13553 209 -12331 125 21963 41288
11929D1288j2008k3525q983k1655j3117j2313J6128J8008l186o546n251m490Q859
11916b6791M462N846l891q840O749J8139N057p294J2066n09M381Q736R07o039
11902A2979m571j0612j0189J3649R874l558k3770j0035M584R536J1138r808m146
11889a4929J3056k74p805j7310J0589K1124J6639j152j8323j0135m722n91Q609
11876e224O857o889o064j2156P458l445P961j6033O731P852J0409N145j2429j144
11862a0971l640j3654L55J2795q981Q291p032k253J0158Q611p369R313l78k407
11848g162p472q550J0631K0022O619j2622k0854r465j6291n713n539J2238J3889
11835c0269M245J2172M094J5407q181m685k243R075N793j2511K136R394m567j057
$$ plain form
11929 41288 29280 5755 -3228 -24883 -38000 -50313 -34185 -16177 -19363 -25909 -31160 -35650 -26791
11916 -26791 -22329 -16483 -20374 -29214 -22465 -4326 731 -6563 5503 4994 9375 18111 19018 12979
11902 12979 8408 -2204 -12393 1256 11130 7572 -16198 -26233 -21649 -12113 -975 -10783 -14929
11889 -14929 -1873 -2147 -9952 -27262 -16673 4451 21090 19938 1615 -8520 -13242 -13833 -5224
11876 -5224 1633 -5256 -11320 -23476 -16018 -19463 -11502 -27535 -20804 -12952 -2543 2602 -9827 -10971
11862 -10971 -14611 -28265 -27910 -15115 -24096 -15805 -22837 -25090 -14932 -6321 -13690 -4377 -4755 -7162
11848 -7162 -14634 -23184 -12553 7469 14088 1466 -19388 -28853 -45144 -50857 -56396 -44158 -30269
11835 -30269 -26024 -13852 -9758 5649 -2532 -7217 -9460 -385 5408 -7103 -4967 4427 -140 -1197
11821a197o872j314m32Q631K6160J0247k144m476o018m532j8564j1389j1943R17
11807b2926P65J2432J7280j757o240M905k480Q128N895K266q276K131j3765k0759
11793b2401j2295P961j49O691J7943j340j2316N768J0257P165L947L376j0350
11780D257J033n162N851k88m675l79j3007N072J5521N91j4882j3367J3365p116
11766a3186j2718K4366K0973N36l9164J3216O706L156j5198k7280p149o697J394
11753e1045J4479L537L35J4383K7911J3964k275n11j8995l770R633p26p357j092
11739a529L156L017r49j7595j0573l813q102J3267J6796j8483o285j4516J6141
11726b9468J1262J1309q05m68j3465M249J0133L509J0920L69O773p339q661j0818
$$ plain form
11821 -1197 -8069 -9383 -9815 -1184 24976 35223 33079 28603 22585 18053 -511 -11900 -23843 -22926
11807 -22926 -22161 -9729 7551 5794 -446 4459 1979 10107 16002 18268 9992 12123 -1642 -22401
11793 -22401 -34696 -26735 -26884 -20193 -2250 -3590 -15906 -10138 119 7284 11231 14607 4257
11780 4257 5290 128 5979 5691 1016 637 -12370 -7298 8223 8814 -6068 -19435 -6070 -13186
11766 -13186 -25904 -1538 19435 19971 -19193 -5977 729 3885 -11313 -38593 -45742 -52439 -51045
11753 -51045 -36566 -33029 -32694 -18311 9600 23564 21289 20778 1783 -1987 7646 6920 -437 -1529
11739 -1529 1627 4644 3695 -13900 -24473 -28286 -36388 -23121 -6325 -24808 -31093 -45609 -29468
11726 -29468 -18206 -6897 -7702 -8170 -21635 -17386 -7253 -3744 7176 7545 14318 6979 -1682 -12500
11712a2500k1701Q522K0566J2350j5250k23J6583L0052r27k2390o790k9768p797
11699b9273K2378o724r466k031k1230K6699J1415Q001J3809J0553o430k9619O034
11686e884j0922n232j0604R445L268Q371P036J0001r115M835J860k0596L735P97
11672a3005N789J2532m068O75l5229j1706J8831L662N667j7907l936J0600K7119
11659i76J3901J445l491j0553j3997n356J8034J1133q381l3751N583O228m448
11646b4629J2252r51j0863r916p653n758J7043K2002p873m108j7808l237L142
11633c8357J3517J5630J0582o821q327k543O960J1066o163n042j0704K30R570
11620a0402K686j0032J3135J6114N547p658j0679P810q98J113L057K119R132j2284
$$ plain form
11712 -12500 -34201 -25679 -5113 7237 -8013 -8236 8347 38399 37472 15082 8292 -21476 -29273
11699 -29273 -6895 -13619 -23085 -25116 -46346 -19647 -8232 -231 13578 24131 17701 -11918 -5884
11686 -5884 -16806 -22038 -32642 -23197 -19929 -11558 -4522 5479 -3636 1199 3059 -17537 -13802 -13005
11672 -13005 -7216 5316 1248 1923 -33306 -45012 -26181 -22519 -16852 -34759 -38695 -28095 -976
11659 -976 12925 14370 10879 326 -13671 -19027 -993 10140 1759 -31992 -26409 -20181 -24629
11646 -24629 -12377 -13328 -24191 -34107 -41760 -47518 -30475 -8473 -16346 -20454 -38262 -41499 -38357
11633 -38357 -24840 -9210 1372 -5449 -13776 -16319 -9359 1707 -4456 -9498 -20202 -19972 -10402
11620 -10402 -7716 -17748 -4613 11501 17048 9390 -1289 6521 5623 6736 9793 11912 21044 8760
11606H760P119R477J6888O935J1588J719k222J1445P64L900j8927j7969j3757
11593B5720K683p124l269J551r070l103J916Q114J971j3206p831l698L448J272
11579f26K169K0396J5765J71J986k3943q016J2920J7865l253j6123J0472K1309
11566E1092L060j5398l181J53j0291j7955j7246o036R641J3463k664J9505J9614
11553D3757O125l083P859p802j3721l152j1128j4453M144P812Q074J620l486J2670
11539C5236l28l625K005R639q35M138j4325J6812P115l662K5011p698k6333j3373
11525B9777j3382N247J5231r738L387J1337k910J029R663j2289p161n321j8863
11512F007J215k112k95L4024M417J3446J2344j3705j1781K949J9808M056m470
$$ plain form
11606 8760 15879 25356 42244 49179 60767 62486 60264 71709 72473 76373 57446 39477 25720
11593 25720 28403 21279 18010 19561 10491 7388 9304 17418 19389 6183 -1648 -5346 -1898 -626
11579 -626 1543 21939 37704 37875 39861 15918 7902 20822 38687 35434 19311 29783 51092
11566 51092 54152 38754 35573 35726 25435 7480 -9766 -15802 -6161 7302 4638 24143 43757
11553 43757 49882 46799 54658 46856 33135 29983 18855 4402 8546 16358 24432 26052 22566 35236
11539 35236 34908 31283 33288 42927 42092 46230 31905 48717 55832 52170 77181 69483 43150 29777
11525 29777 16395 21642 36873 27135 30522 41859 38949 39978 49641 37352 30191 24870 6007
11512 6007 7222 5110 4815 38839 43256 56702 69046 55341 43560 46509 66317 70373 65903
11499F5903j9084j2042m63K9180L0306j7771l0595l377J1802j4068l525Q613r26
11486D3953J2026Q260l318R089Q635L50l73R342o970L325o626K474O775j2094
11472G4848j0951k0725k8764M749K1983L329n123j8173m325m043p253o5O570o854
11458E203m589j195q432L638J1517o466J0365l23j4574J7768K132m218P577n394
11444A3009M292K296N626Q940N935j436j2372k2556j3322L118Q094M075R945J863
11430A7507N773J1687J2503q698j8120o414O205n694O807J1906m061j1583j9236
11417a418j0451n32J4J7221J3113j4149k7803r031o284k656J6424K2755K544J2982
11403A2729K157J0350P322P117r215r524q030M98R402k2598p886J2304N678J3708
$$ plain form
11499 65903 46819 34777 34314 63494 93800 76029 45434 42057 53859 39791 36266 44879 43953
11486 43953 55979 64239 60921 70010 78645 78995 78622 87964 80994 84319 77693 80167 86942 74848
11472 74848 63897 43172 14408 19157 41140 44469 39346 21173 16848 12805 5552 5487 12057 5203
11458 5203 614 -581 -9013 -5375 6142 -324 10041 9718 -4856 12912 15044 10826 18403 13009
11444 13009 17301 19597 25223 34163 40098 38662 26290 3734 -9588 -6470 1624 5699 15644 17507
11430 17507 23280 34967 47470 38772 20652 14238 20443 14749 21556 33462 29401 17818 -1418
11417 -1418 -11869 -12401 -12387 4834 17947 3798 -24005 -33036 -39320 -41976 -25552 -2797 -253 12729
11403 12729 14886 25236 32558 39675 30460 20936 12906 13404 22806 208 -7678 4626 10304 24012
11389B4012j1206j7099J4427k822j6401r835p2P505J8639j1011j702Q390K3719
11376B6544m541j1484R04j07r643R42K3504J1922k1166N583N670j5707n661j3777
11362g017j2335J8254p04p938j346M710K0597J5319j7770l280l678J1920J9470
11349C6202K3725K4861m015k6283j3830K1543K9716N966j6708l372Q158K147N930
11336I4040O188j8446k1000j977J0094r159j3184j1430o877J3016l466J1600K621
11323E2020m742O880p306p779L920J523k552p087L61J7634k125k1040N037J333
11309C6077j9347J215j533J2334L1480J3777l7131l975L5178K0083K045o966m694
11296G8543j0731K95j1979j2079M997K3649K0836K6278K4792J3161r954J2708
$$ plain form
11389 24012 12806 -4293 10134 7312 -9089 -18924 -18996 -11491 7148 -3863 -5565 2825 26544
11376 26544 22003 10519 11423 11316 1673 2615 26119 38041 16875 22458 28128 12421 6760 -7017
11362 -7017 -19352 -1098 -1802 -9740 -11086 -6376 14221 29540 11770 8490 4812 16732 36202
11349 36202 59927 84788 80773 54490 40660 62203 91919 97885 81177 77805 85963 88110 94040
11336 94040 100228 81782 60782 58805 68899 59740 46556 35126 28249 41265 37799 49399 52020
11323 52020 47278 54158 46852 39073 42993 44516 41964 34877 35238 52872 50747 29707 34744 36077
11309 36077 16730 17945 16412 28746 60226 74003 36872 32897 68075 88158 90203 83237 78543
11296 78543 67812 68107 56128 44049 49046 72695 93531 119809 144601 157762 147808 160516
11284A60516L0463N7175M6561N5863R2043J09934J35844J91580K97308M13470
11274A590757N06551N62006O03763O60988O58648K67101k72139m13013m76188
11265C688474q15882q36054n56378l00994j73295j20531p1367o4492o2104l7209
11255F50168m6896p4362p5921m4799k8180m5377o1220m8737l7797j8800k4313
11244A43766j3036m910J843k0092k1597k9259o304L963J9828J3591j6254j0832
11232F0707J8847P790j7677j6342p627k013J2363R858q072o920k2549k6729M74
11219B110p86j5491R00J7834L0607l413j4635r818m913k520J0813K1444L86k0950
11205A1568R53j021j562J0947Q828m619K760J8345p57r945m777K0157J3656J445
$$ plain form
11284 160516 190979 248154 294715 350578 442621 552555 688399 879979 1177287 1590757
11274 1590757 2097308 2659314 3263077 3924065 4582713 4849814 4577675 4164662 3688474
11265 3688474 2872592 2036538 1480160 1179166 1005871 885340 813973 749481 687377 650168
11255 650168 603272 528910 452989 408190 380010 334633 273413 224676 186879 168079 143766
11244 143766 130730 125820 127663 107571 85974 56715 50411 54374 74202 87793 71539 60707
11232 60707 79554 87344 69667 53325 45698 43685 56048 65906 57834 50914 28365 1636 2110
11219 2110 1324 -14167 -13267 4567 35174 31761 17126 7308 2395 -125 10688 32132 32518 11568
11205 11568 12521 11500 9938 20885 29713 25094 27854 46199 45442 35497 30720 50877 64533 65978
11191F5978k6739j0927L5072K10q793j2547Q018J6615J2617K1617L6859L3385
11179A71365L8187O0903P3943P8339R6782J30085K16005L06561L97615M65541
11169B035326M95546N02793O11163O44759J99162l86975l81843j02184k76335
11160C341412p55747p80891m78689k62849j65557q2234o9611n3152m5430o1826
11150E85426o3775o9170o0182n3064j9261l0339l9484l1546m3381k1124j6176
11139A37924j3214K2037r153m5031k5819N225J862j0623l624J2757j0119k6202
11127C6020K32K4448M662k5241l964k839J2596J596J1513Q364r004j620k843p910
11113D6010n329m241k2242j5754j48O190j5516L322J5073J444l033q972J259n8
$$ plain form
11191 65978 39239 28312 63384 63594 54801 42254 50272 66887 79504 101121 137980 171365
11179 171365 209552 270455 344398 422737 519519 649604 865609 1172170 1569785 2035326
11169 2035326 2530872 3033665 3644828 4289587 4488749 4101774 3719931 3617747 3341412
11160 3341412 2585665 1804774 1326085 1063236 897679 815445 745834 692682 647252 585426
11150 585426 521651 452481 392299 339235 319974 289635 250151 218605 175224 154100 137924
11139 137924 124710 146747 137594 92563 66744 71969 73831 63208 59584 72341 62222 36020
11127 36020 36252 60700 65362 40121 36157 33318 45914 47510 59023 67387 58383 56763 53920 46010
11113 46010 40681 36440 14198 -1556 -1704 4486 -11030 -7708 7365 8809 5776 -3196 -1937 -1995
11099a995J2851R989M197M857K01q029l378M366N703l358j7136j4995K076J4053
11085I402J2578J518L490j542j0807p467J897J904o815M07Q939n827j491j046
11071E140l407p971r535P97Q508K228Q074K712o364J6759P805k4330R176J137
11057A0729l44j1307M957l171M883j0358R351o24k0966r347J8022J3341l82O72
11043E456N818P118p338q756P61j963o109r337M244q818j2211n57O236j178N493
11028b1141J3319L91M225j0632J3830J2658J8795p634k0379r663r497L195P753
11015d780N717j7688O286J8427P662k2838q726J7943J7928j849K3r022k1300j5268
11001b7485N212J9931Q484l1708l971L5268J6511m16j4206N185o023j3542O819
$$ plain form
11099 -1995 10856 20845 25042 29899 30100 22071 18693 23059 28762 25404 8268 -6727 -4651 9402
11085 9402 21980 23498 26988 25446 14639 7172 9069 10973 4158 4565 13504 7677 6186 5140
11071 5140 1733 -6238 -15773 -14976 -6468 -4240 3834 6546 182 16941 24746 416 9592 10729
11057 10729 10385 -922 4035 864 5747 -4611 4740 4116 -16850 -26197 -8175 5166 4784 5456
11043 5456 11274 18392 11054 2298 3059 1096 -5013 -14350 -10106 -18924 -31135 -31692 -25456 -26634 -21141
11028 -21141 -7822 -7431 -3206 -13838 -8 12650 31445 23811 3432 -6231 -15728 -12533 -4780
11015 -4780 937 -16751 -10465 7962 15624 -7214 -15940 2003 19931 18082 18105 9083 -12217 -27485
11001 -27485 -22273 -2342 6142 -25566 -29537 5731 22242 21826 7620 12805 6782 -6760 59
10988E9m751j2235m232Q075j023K583K179J1428K285o036O217R741j357j316l456
10973H161n729r799k0448N433J0820J863P707J3907m075l768P95j9339O00O741
10959g131L953l807J045Q052p359j4518J5455K2585j2121L025k3546l931J7783
10946e15R118j043j9188L169j6168p947J1230K0753J738j4751M721m546j1320
10933b4749J8083J4086p458n239r154M068J3977j221j513J700k1585l947J7113
10920e839j77p096o720K0171K2055j2231j2126k500k013M776k4245j683J2823
10907a4805k192R494J6712N956r238m531N270R128j4538r260k9339j5955J4020
10894c9278K745j8165j327J7538J1751J1745K7362P324p498Q660m140n400p858
$$ plain form
10988 59 -4692 -16927 -21159 -13084 -14107 -11524 -9345 2083 4368 -1668 4549 14290 12933 11617 8161
10973 8161 2432 -7367 -27815 -22382 -11562 -9699 -1992 11915 7840 4072 4867 -14472 -13872 -7131
10959 -7131 -3178 -6985 -5940 2112 -5247 -19765 -4310 18275 6154 9179 -14367 -18298 -515
10946 -515 8603 7560 -11628 -8459 -24627 -32574 -21344 -591 1147 -13604 -8883 -13429 -24749
10933 -24749 -6666 7420 -38 -5277 -14431 -10363 3614 2393 880 2580 -19005 -22952 -5839
10920 -5839 -6016 -13112 -19832 339 22394 10163 -1963 -4463 -6476 -1700 -25945 -27628 -14805
10907 -14805 -16997 -7503 9209 15165 5927 1396 6666 15794 1256 -8004 -37343 -53298 -39278
10894 -39278 -36533 -54698 -56025 -38487 -26736 -14991 12371 19695 12197 20857 16717 11317 3459
10881C459j0000L323J1536l382K242J0258J084l34j4311l069Q435J2298j2413
10868I126r190R05m442L103L419N367q01n517l137k2129O956J5669J7518R762
10854B6609j653K427L219m475j5558j089J4562m981O124r134n585o828J8522M83
10840B2643j3983J1825l106N854M505j450O587m868j4432K5225k338k0415k775
10827A3272j0529L847n905r267J4943J0532p727K450o631M854n248j2293o179
10814a3881J1625Q327j0759M810P672j0678J0840N263j0677l927j1059j3230M366
10801b1308L749O947K6629j292o230N566M709q257j0864K4766M440j3109J148
10788A6894j7199n737N099L270K1904k933p134r740j7710j269r64P043K2982K072
$$ plain form
10881 3459 -6541 -3218 8318 4936 7178 17436 18520 18186 3875 806 9241 21539 9126
10868 9126 -64 841 -3601 -498 2921 8288 7487 1970 -1167 -23296 -16340 -671 16847 26609
10854 26609 24956 27383 30602 26127 10569 9480 24042 19061 25185 16051 10466 3638 22160 22643
10840 22643 8660 20485 17379 23233 27738 26288 32875 28007 13575 38800 36462 16047 13272
10827 13272 2743 6590 685 -8582 6361 16893 9166 11616 4985 9839 4591 -7702 -13881
10814 -13881 -2256 6071 -4688 122 7794 -2884 7956 13219 2542 -1385 -12444 -25674 -21308
10801 -21308 -17559 -10612 16017 14725 8495 14061 18770 10513 -351 24415 28855 15746 16894
10788 16894 -305 -6042 -943 2327 24231 21298 14164 4424 -13286 -14555 -15519 -8476 14506 16578
10774A6578j4928L825n171r246l40K5214Q355m088J4981j050j8963k2319J1971
10761D819M406j948N128m135k725J3220J3791L884r48j4637M436N199P291l064
10747C4717p839J0484K0529N932m030J2740K0722M3981L4539L9342P4519J24946
10735D10582J74543K28174K17784J55598J31028K16500K09654l93882n15593k69511
10725E64877j64319n8510k9023l0616k672l0249l5024j1288n789r091j5993L082
10713A75385j5191k2936p120l857N308k1539l1383j6898o182j3413m913P698J2448
10700E7407J171j9767j4005J1442M590j1881r781J470o157j5739j3892L680P620
10687c842J529l428P787o34m176k014q927j2175j517J2094K0510j5055p571J4359
$$ plain form
10774 16578 1650 5475 304 -8942 -9282 15932 24287 20199 35180 34130 15167 -7152 4819
10761 4819 9225 7277 12405 8270 5545 18765 32556 36440 35492 20855 25291 30490 37781 34717
10747 34717 26878 37362 57891 63823 59793 72533 93255 137236 171775 211117 285636 410582
10735 410582 585125 813299 1031083 1186681 1317709 1534209 1743863 1349981 834388 564877
10725 564877 400558 342048 313025 282409 279737 249488 214464 203176 197387 188296 172303 175385
10713 175385 160194 137258 130138 126281 131589 110050 78667 61769 55587 42174 37261 44959 57407
10700 57407 58578 38811 24806 36248 40838 28957 19176 20646 14489 -1250 -15142 -11462 -3842
10687 -3842 -2313 -5741 2046 1412 -2764 -4778 -13705 -25880 -27397 -15303 5207 -9848 -17419 -3060
10673c060J58j0055j554P735m714j5021j5081R481K603J1948K4572J2877O764
10660B6653j2647p88r722k4215j6896R634L4797M25L755N16N380m286k2223n257
10646a4874O627k748O211K572n310k002J2273O000m644m203J2862M378j8832J3910
10632A2220J8334j1835q285j622o784r384o455J7690j445M556k8692q845N180
10619b5367Q131K2557j3649n826p794M415M257l567L4227K1669j3417l48O851
10606C2139o470j5658j1359r265j1851J2909J5605P965j5202q284K586J0498J509
10593E122J509M920j0133j0177j1106O807M935J3152M084P051j2083k5730j853
10580b3502K2512J0507j5082K92K5662J4701k260O765P788j4525j0959j5542O153
$$ plain form
10673 -3060 -2902 -12957 -14511 -6776 -11490 -26511 -41592 -32111 -29508 -17560 7012 19889 26653
10660 26653 14006 13218 3496 -20719 -37615 -27981 6816 7241 10996 11512 16892 12606 -9617 -14874
10646 -14874 -8247 -10995 -4784 -2212 -7522 -9524 2749 8749 4105 -98 12764 17142 -1690 12220
10632 12220 30554 18719 10434 8812 2028 -7356 -13811 3879 2434 6990 -21702 -30547 -25367
10619 -25367 -17236 5321 -8328 -14154 -21948 -17533 -13276 -16843 17384 39053 25636 25288 32139
10606 32139 25669 10011 -1348 -10613 -22464 -9555 6050 14015 -1187 -9471 -6885 3613 5122
10593 5122 6631 11551 1418 -8759 -19865 -13058 -8123 5029 9113 16164 4081 -21649 -23502
10580 -23502 -990 9517 -5565 -5273 20389 35090 32830 39595 47383 32858 21899 6357 12510
10567A2510J4221j1216l1099m032J60P910J0260k0390j5951N537j969n622Q207
10554c1474J9355L933p988k979r848N457m780J5417J0965K2016J3728O978o847
10541C3933k0700q018J5701J4091l800m605j1404o884k997m205M688k408j814
10528A578j0664r862J9345J904M766k832j6589j6702J1028J5685j5798j433J1896
10515g678o72O706m811r445P265J2545r283o286J8762J1120k2682n380J401k1830
10501c0268J5954K804O02l714J0193J4887J2779l937P79J7747n967l523p9J5548
10487D3805R334p651j1791Q6j6843j0157K612m984m970K263J0950l046J0966Q969
10473B9543m330K0225L1373r458q373K759J1766j0722J2868J8817L1156M7152
$$ plain form
10567 12510 26731 15515 -15584 -19616 -19456 -11546 -1286 -21676 -37627 -32090 -34059 -39681 -31474
10554 -31474 -12119 -8186 -16174 -19153 -29001 -23544 -28324 -12907 -1942 20074 33802 40780 33933
10541 33933 13233 5215 20916 35007 31207 26602 15198 8314 5317 1112 5800 3392 1578
10528 1578 -9086 -18948 397 2301 7067 4235 -12354 -29056 -18028 -2343 -18141 -19574 -7678
10515 -7678 -8350 -1644 -6455 -15900 -8635 3910 -5373 -11659 7103 18223 -4459 -9839 -8438 -30268
10501 -30268 -14314 -11510 -10908 -14622 -4429 10458 23237 19300 20079 37826 31859 28336 28257 43805
10487 43805 53139 45488 33697 33783 16940 6783 9395 4411 -559 1704 12654 9608 20574 29543
10473 29543 25213 45438 76811 67353 58980 61739 73505 62783 75651 94468 125624 172776
10461A72776N1857O4246R4121J37059J85803K20730K51505K54319K91057K71726
10451A995199J69472J2878q7408j89362k27065k68717k86037k50132j78921j27069
10441E62838r8757o4926k2615m269r976l0735k4026l1143j5674k1066m3495l4484
10429A61672K093k1141k8596k5602o946j4562J4004J5685j146k2579j4086K262
10417F1058n273m410j8949M284N470j6458L256K0899L096m887J0051K6880K1221
10404A06238m869r837j5609J027j7743r270J4453p150O181k2852l1225k469M737
10391A1612p416K013R503K1184O357o11k7127o345P949J0535n152j0590j027J5126
10377B6011M785K20N107m086k5810k922P437o366q74J1409j3242p394J2193J0602
$$ plain form
10461 172776 224633 288879 383000 520059 705862 926592 1178097 1432416 1723473 1995199
10451 1995199 2164671 2177549 2090141 1900779 1673714 1404997 1118960 868828 689907 562838
10441 562838 464081 399155 376540 372271 362295 331560 307534 276391 260717 239651 196156 161672
10429 161672 163765 142624 114028 88426 81480 66918 80922 96607 95461 72882 58796 61058
10417 61058 55785 51375 32426 36710 42180 25722 28978 49877 52973 48086 58137 85017 106238
10404 106238 101369 91532 75923 76950 59207 49937 64390 57240 63421 40569 9344 6875 11612
10391 11612 4196 6209 15712 36896 43253 42642 15515 9170 17119 27654 22502 11912 10885 26011
10377 26011 30796 31016 36123 32037 6227 3305 10742 4376 3502 14911 1669 -5725 6468 17070
10363A7070J5709q382j743j7906K453J4086J5383j3004r526N242J2848K7143R75
10350F0348J1254L1321N2102M1384N9401R0914R9357J00505O1990M2412M5717
10339F96705L0878M981j0835l8945q3315r1914o8478o1138m2273m5942m1448l7504
10327B10772l9651l4083p157j3876J156K352j8766j8054L278M158l0805l925j4229
10314D1170q830J7929m903l619n026L913K3387j2477k4136N216J4474J6606j9560
10301D4144q246o065q807p25J2566J7252M379J744P518j503j5043K22j754j6522
10287B9160j2095Q989J4206K2671j3538q386j465j0709j1821j785k949R294l127
10274A8445j5851k37j357P515M43J6793j9299m914J5339J0482j7025J2880R766
$$ plain form
10363 17070 32779 24397 22654 4748 7201 21287 36670 23666 14140 19382 32230 59373 60348
10350 60348 71602 102923 155025 196409 255810 346724 446081 546586 608576 650988 696705
10339 696705 727583 732564 721729 682784 599469 507555 439077 377939 335666 289724 248276 210772
10327 210772 171121 137038 129881 116005 117161 119513 100747 82693 85971 90129 59324 55399 41170
10314 41170 32340 50269 45366 41747 36721 40634 64021 51544 27408 32624 47098 63704 44144
10301 44144 35898 29833 21026 20301 32867 50119 54498 56242 63760 62257 47214 47436 45682 29160
10287 29160 17065 26054 40260 62931 49393 41007 39542 28833 17012 15227 12278 21572 18445
10274 18445 2594 2357 1000 8515 8958 25751 6452 1538 16877 27359 10334 23214 32980
10261C2980q936N878j8421J0232O190Q002j4223k0058l659J6827M003j6922j176
10248G17J3021n326n044R201n486n253N316O888p889o793J734P380L443M281R963
10233B6153j8939k4593M153K0822J3859q047Q138J5151o758o238p49q674J8296
10220C2574L2249j3297k4022j3513R701p178l44j5250j0374K0183L071j2702K203
10207C301J2039M167q529O276O812k486j2968j0909j0168O848k212O556O251O570
10193A1548J4242m565k237j4862j1674j9570J0419M812J785J5337K259k374l189
10180A931k2308R7N334O798J2336L003o889k935l668J6275N368J9771q384q793
10166A7936J594j6106j703M080l512N031j9368n855K6380J2591j83j0204k1397
$$ plain form
10261 32980 24044 29922 11501 21733 27923 35925 21702 1644 -2015 14812 18815 1893 717
10248 717 13738 8412 3368 12569 7083 1830 7146 14034 6145 -648 1086 8466 11909 16190 26153
10233 26153 7214 -17379 -13226 7596 21455 13408 21546 36697 29939 23701 22952 14278 32574
10220 32574 64823 51526 27504 13991 23692 16514 16170 920 -9454 10729 13800 1098 3301
10207 3301 15340 19507 10978 17254 24066 21580 8612 -2297 -12465 -5617 -7829 -1273 4978 11548
10193 11548 25790 21225 18988 4126 -7548 -27118 -16699 -11887 -10102 5235 7494 5120 1931
10180 1931 -20377 -20280 -14946 -8148 4188 7191 302 -2633 -6301 9974 15342 35113 26729 17936
10166 17936 19530 3424 1721 5801 2289 7320 -12048 -17903 8477 21068 20885 10681 -10716
10153a0716p517K753J138J010L302j8109N983P550K3859o916m608J145P652j987
10139D539j2283M629L495n512Q364o172q930j1354m651J3673R300J5001P00l786
10125G013j1898r752K180K608P336k642P85o118m248J4511J5031j0952L412L840
10111A1106K411q247j0036J9843L830j0686n645k165L620k0771O225Q862q896
10098a0549M312R278L673j2106N086J3197l944N637j4534j3485m525j9947J0443
10085b7464J1683N995l381J3502k277k5190j4551K4270J3557K847j0485J0152
10073a342J8238O91j6392J3865J2971r434k8571m033j0662p263K349J9140l434
10060a3877j713J86J0894m520k4274R244N149p818J605J6706J4370J1024M499
$$ plain form
10153 -10716 -18233 -15480 -14342 -13332 -10030 -28139 -22156 -14606 9253 2337 -2271 -1126 6526 4539
10139 4539 -7744 -3115 380 -5132 3232 -2940 -11870 -23224 -27875 -14202 -4902 10099 10799 7013
10125 7013 -4885 -14637 -12457 -9849 -2513 -5155 -4370 -10488 -14736 -225 14806 3854 7266 11106
10111 11106 13517 5270 -4766 15077 18907 8221 2576 411 4031 -16740 -10515 -1653 -10549
10098 -10549 -6237 3041 6714 -5392 -306 12891 8947 14584 50 -13435 -17960 -37907 -27464
10085 -27464 -15781 -9786 -13167 335 -1942 -27132 -41683 -17413 -3856 -1009 -11494 -1342
10073 -1342 16896 17587 1195 15060 28031 18597 -9974 -14007 -24669 -31932 -29583 -10443 -13877
10060 -13877 -15590 -15404 -4510 -9030 -33304 -24060 -18911 -26729 -25124 -8418 5952 16976 21475
10047B1475K2813P502K2800J3465J749l229j462K5595J7526m0920m3965l7405
10035E944r344N861J940L058J935j1446j0551J6973K1115k444j8214j114J2088
10022A5801q445J860m308J433L662J1193j118r16m0435r297R241J2293J6356K299
10008I619O66K1073R371j8588l153Q082o538j0648o428j2299J1877J6881l548
9995A6367l590k824J46k3902j6276J5390K0602j7468j3035p398R327Q685N119
9982h857q09J0647J6317j550p896M923P806j4107j5082j1678J3997Q659P32l281
9968a79j3478l162J4144L844j9723n12J7733J3005j1693j0540J014R479J027J662
9954B621J1078R316j3984k590j1484K0005K1036j3673j8758q352L472k66O316
$$ plain form
10047 21475 44288 51790 74590 88055 89804 86575 85113 110708 128234 87314 43349 5944
10035 5944 -3400 2461 4401 7459 9394 -2052 -12603 4370 25485 23041 4827 3713 15801
10022 15801 7356 9216 4908 6341 10003 21196 20078 19162 -21273 -30570 -21329 -9036 7320 9619
10008 9619 10285 31358 40729 22141 18988 27070 20532 9884 3456 -8843 3034 19915 16367
9995 16367 12777 9953 10099 -13803 -30079 -14689 5913 -11555 -24590 -31988 -22661 -13976 -8857
9982 -8857 -9666 981 17298 15748 7852 12775 20581 6474 -8608 -20286 -6289 2370 3102 -179
9968 -179 -13657 -16819 -2675 1169 -18554 -19066 -1333 11672 -21 -10561 -9547 -68 959 2621
9954 2621 13699 23015 9031 6441 -5043 14962 35998 22325 3567 -4785 -1313 -1579 4737
9941D737J1138p492o500P962J8065o868r428Q200J1055l782J252K9718J7152j6865
9927E8344k4951Q53O037l240P303p07Q718Q642K3188J5759J1016K8718L8481M1845
9913B20006K2351m8851n9435l4843k4331m0435R484L308j5398o995M207n709P048
9900C0407J753P193k8537k5921K0495J5049p032j2666j942K2442L966P49L520
9887B9476R20m848J264k732O484l840j2481k428k873J2170K1009J652P83k0548
9873B4008j0012M403j3846n264M505J6287J7921Q953l056O20j5336k594Q786p520
9859B7855j1694q083N022O851M628q17J888J062N896J3710N230J0343o053l3049
9845B2789k1310P09L3390j205J754L455j3685k0289J0352M276K772J1923o431
$$ plain form
9941 4737 15875 8383 1883 9845 27910 21042 11614 19814 30869 27087 28339 58057 75209 58344
9927 58344 33393 34246 40283 37043 44346 43639 52357 60999 84187 99946 110962 139680 178161 220006
9913 220006 242357 193506 134071 99228 74897 34462 43946 47254 31856 24861 29068 23359 30407
9900 30407 32160 39353 10816 -15105 5390 20439 13407 741 -1201 21241 25207 25956 29476
9887 29476 30396 25548 26812 24080 30564 26724 14243 11815 8942 21112 42121 43773 44556 24008
9873 24008 13996 18399 4553 -711 3794 20081 38002 46955 43899 44519 29183 26589 35375 27855
9859 27855 16161 8078 13100 19951 24579 23762 25650 26712 32608 46318 51548 61891 55838 22789
9845 22789 1479 2188 35578 34373 36127 39582 25897 5608 15960 20236 23008 34931 28500
9832B8500j3742k4305j4819O800P627J2397K420o050k711Q674L621j4246J1624
9819E790m317n02K5615J8311j5235J3783K6880j1186p841j94K501j2496j4144
9806B6965j3965j3959R914n219n890Q728P402J5794k498j2811J7294o351j4181
9793A1223j776O844O637j4966j6181l360Q108N68j7707O337L0906J4748m298n023
9779B2060K1911J1851l9821k5280J4402J3540J7860j1793j4804k760J1077Q117
9767B6360Q473j0893k527j638j385k823o122J4549m068n926k63J258J5989J1117
9753D2101l4716j1069j782K16R551K2251l857m60j322N466j3701O70J7081k84
9739C0145q119j322q872M693Q097j7079j0297L1231J4732j0325j9302n700J2945
$$ plain form
9832 28500 14758 -9547 -24366 -17566 -9939 2458 4878 -1172 -3883 4791 8412 -5834 5790
9819 5790 1473 971 26586 44897 29662 43445 70325 59139 51298 51104 53605 41109 26965
9806 26965 13000 -959 8955 3736 -2154 6574 13976 29770 27272 14461 31755 25404 11223
9793 11223 9447 16291 22928 7962 -8219 -11579 -3471 -2903 -20610 -14273 16633 31381 27083 22060
9779 22060 43971 55822 16001 -9279 5123 18663 36523 24730 9926 7166 18243 26360
9767 26360 34833 23940 21413 19775 18390 15567 9445 23994 19926 14000 13737 14995 30984 42101
9753 42101 7385 -3684 -5466 -5250 4301 26552 22695 22235 20913 26379 12678 13348 30429 30145
9739 30145 22026 20704 11832 16525 24622 7543 -2754 28477 43209 32884 13582 7882 20827
9726B0827J6046m698j6186q197O026q064j9254m477N513j037o998l881J7040P066
9712b74k3405j4177K2580K9704Q174j9315k2454j3827N888K2951K5497k796k189
9699A6357K322J828j0855k347Q491j6377j2234R348K097J213j748j2651o323K0691
9685a88R411q230J8226j974Q27j3737J5462J7419j0970j5472J273o019j3239k146
9671i357M56j85J3156J0673o679p208J3047J1073p478q583p125j8844R914J4543
9657G403Q177p901j5613j8924K153M653J5419m856j4778Q678L722N073M227L605
9643A038k0720k777R311o714R007N258j479n767O359K1185K8495p695k3078m702
9629G721k0722j1631K219J4907P001J2054J2701n954o632p588k87J976J5240M404
$$ plain form
9726 20827 36873 32175 15989 7792 13818 5754 -13500 -17977 -12464 -13501 -20499 -24380 -7340 -274
9712 -274 -23679 -37856 -15276 14428 22602 3287 -19167 -32994 -27106 -4155 21342 18546 16357
9699 16357 18679 20507 9652 7305 15796 -581 -12815 -3467 -1370 -157 -1905 -14556 -20879 -188
9685 -188 9223 993 19219 17245 18072 4335 19797 37216 26246 10774 12047 6028 -7211 -9357
9671 -9357 -8901 -9086 4070 14743 8064 856 13903 24976 17498 8915 1790 -17054 -7140 7403
9657 7403 15580 7679 -7934 -26858 -24705 -20052 -4633 -9489 -24267 -15589 -11867 -6794 -2567 1038
9643 1038 -19682 -22459 -13148 -19862 -10855 -5597 -7076 -12843 -6484 14701 43196 35501 12423 7721
9629 7721 -13001 -24632 -22413 -7506 -505 11549 24250 18296 11664 4076 3789 5765 21005 25409
9615B5409k3560m159q034Q262k353J017O988j107j6637k485Q611r078K167K0391
9601E432j923l926m185l541L502J0335R554m529J7781M24Q016J6191L458j4203
9587D2386j6907j572q522J2747n539j2429k002m745R965N367o938k7472o184l90
9573b2235Q639m74J2839K554J6649K855J1489j0255l053M907N070p084r869M014
9559A6046k1118K71m319O363J7164r249j212k711J3636p36O038j5711Q585Q432
9545B1479l947Q288K561p780j901m206J0677J330j0572Q548J4627j2117K388R053
9531C8428K8367J4436j3674k2313k7500j0093L024P808q503Q040N809J0219P637
9518D1685r604J9471L135r421k4108m168M129L364L276J2525N209L613j921m15
$$ plain form
9615 25409 1849 -2310 -10344 -2082 -4435 -3418 3570 2463 -14174 -16659 -8048 -17126 -14959 5432
9601 5432 3509 -417 -4602 -8143 -4641 5694 15248 10719 28500 28924 36940 53131 56589 42386
9587 42386 25479 23907 15385 28132 22593 10164 8162 3417 13382 18749 11811 -15661 -21845 -22235
9573 -22235 -13596 -14070 -1231 1323 17972 20827 32316 22061 19008 23915 28985 21901 12032 16046
9559 16046 -5072 -4801 -9120 -2757 14407 5158 3946 1235 14871 14135 20173 4462 13047 21479
9545 21479 17532 25820 28381 20601 18700 14494 25171 26501 15929 24477 39104 26987 29375 38428
9531 38428 66795 81231 67557 45244 17744 7651 10675 18483 9980 18020 23829 34048 41685
9518 41685 32081 51552 54687 45266 21158 16990 21119 24483 27759 40284 45493 49106 47185 46770
9504D6770l142j0524l0275q027R783r247j465J3596J5075k207k621j0158K873
9491A0431j826M949J785J4970J4910q56J0208K2160j4066l4503j5423M504K0364
9478C7607Q732J415p188r055o858r385P39R641J354K249J4253L267J742N148j0075
9463D3586J1409M475l205j5619j2989m893J5232j131K74j732j3490r90J1458O187
9449C8572M286J8216j1676r167J3037q17J7435J502K254p658K0482J2794k9968
9436F9292j1012O546K9814J6621j0173l0243n234J3209j544K922o783r732R641
9423G3324k27J9635O039m369l78L148J1851J1190m004j0625P920K0713J3630r927
9409A37920j2236Q814K4995N853K181N052K859j9481j3331J5918R297L1379J8869
$$ plain form
9504 46770 43628 33104 2829 -5198 4585 -4662 -6127 7469 22544 20337 17716 7558 10431
9491 10431 8605 13554 15339 30309 45219 44363 54571 76731 62665 28162 12739 17243 37607
9478 37607 46339 47754 40566 31511 24653 15268 16007 25648 27002 29251 43504 46771 48513 53661 43586
9463 43586 54995 59470 56265 40646 27657 22764 37996 36865 37139 35407 21917 20927 32385 38572
9449 38572 42858 61074 49398 40231 53268 52451 69886 71388 73642 65984 86466 99260 69292
9436 69292 58280 64826 94640 111261 101088 70845 65611 78820 77276 80198 73415 63683 73324
9423 73324 73097 92732 98771 94402 94024 97172 109023 120213 116209 105584 113504 134217 147847 137920
9409 137920 125684 134498 159493 165346 167527 172579 175438 155957 142626 158544 167841 199220 218089
9396B18089R788q554j9818J5528P794J0424J0783K4329R031J7215l279J4475K7895
9383C33700Q021J8954J8038O099K7708K6929K4250Q055K7632M8584M0329M8372
9371F36671L9375M7886O4003O6122M5425O4098P1416P4548P0875Q6018J21561
9360A387998J42845J24663J44965J68601J79998J97556J90139K26209K46389K43123
9350C252486K11281K20896J72243J38437J01494N3797J2747m5067p7748j15573
9340C924993j47851j83296j96772j95147k04838k04508k18121j99615j60336j47344
9330B067165j32203j35271j27601j20453j08063q1471p2771q1615p2918p1188
9320A063611p8378p2653n6817k3940j8577n3510m9723n0937m0286j6791l0978
$$ plain form
9396 218089 227877 219323 199505 215033 222827 233251 244034 268363 277394 294609 291330 305805 333700
9383 333700 341721 360675 378713 384812 412520 439449 463699 471754 499386 547970 588299 636671
9371 636671 676046 723932 787935 854057 899482 963580 1034996 1109544 1180419 1266437 1387998
9360 1387998 1530843 1655506 1800471 1969072 2149070 2346626 2536765 2762974 3009363 3252486
9350 3252486 3463767 3684663 3856906 3995343 4096837 4150634 4163381 4118314 4040566 3924993
9340 3924993 3777142 3593846 3397074 3201927 2997089 2792581 2574460 2374845 2214509 2067165
9330 2067165 1934962 1799691 1672090 1551637 1443574 1362103 1289332 1207717 1134799 1063611
9320 1063611 985233 912580 855763 831823 813246 759736 710013 659076 618790 601999 571021
9309E71021k3622l3733k4918l7755k3541k5924l0105r5j2284o967k5888L098K250
9296C31537k0924m741j0703k2205j2754j3648j3969q534q261Q89o134q814k231
9283A99508J3488K058n397j7471k2769k2982j9498j5123q819R857R719J488j326
9270A22733r469N195R101j2371j4891o645L110O15J34J2963J4040O764J7697j2360
9256A36616J970o611j4902j5190R531p078j8260l846p020r252J6309l34q58n654
9242G5421J1185K4438o059j8290j1485J2063J7555Q462k2020j5954M047R741J6740
9229A05844j5930L654n882j6416q772L611J5917J4963m678k5361m11l77j3091
9216E3071J2894K0426l003n206k5865j3762J9715N412q363j143m821l866o695
$$ plain form
9309 571021 547399 513666 488748 450993 427452 401528 371423 371328 359044 352077 326189 329287 331537
9296 331537 310613 305872 295169 272964 260210 246562 232593 224059 215798 216687 210553 201739 199508
9283 199508 212996 215054 209657 192186 169417 146435 126937 111814 102995 112852 122571 124059 122733
9270 122733 113264 118459 127560 115189 100298 93653 96763 97378 97512 110475 124515 131279 148976 136616
9256 136616 138586 131975 117073 101883 111414 104336 86076 82230 75210 65958 82267 81933 81075 75421
9242 75421 86606 111044 104985 86695 75210 87273 104828 113290 91270 75316 79363 89104 105844
9229 105844 89914 93568 87686 71270 62498 66109 82026 96989 92311 66950 66539 66162 53071
9216 53071 65965 86391 83388 78182 52317 38555 58270 63682 55319 54176 49355 45489 38794
9203C8794n57M776Q285R357J9091j3245k225J2978J4528j3352r386k0915m335
9190D3794K487j56j2915l180J341q362K3295J2378k069j2642j4023o071J874O166
9176C1917O221Q231R960m50j0024o122K403P198m562l569j917K0052P807j9904
9162D7241j6210j1040K060l476n496j2507N870R342M437R024O259J050k7270j1919
9148b635K934K0551J798J3331K4423n025n132j728j0854j5323O229J3225K4402
9135F6196n490n404j4520j7395K5898M371M621j1743l0344r773J7680J173K1146
9122D6416M629j4835q686J0835k801P155N149k868K312L249R462l451n174Q683
9108F0075O971r936n448k1534r368J7952J0231O826J495J864l36P895j0601j1841
$$ plain form
9203 38794 38237 43013 51298 60655 79746 66501 64276 77254 91782 78430 69044 48129 43794
9190 43794 46281 46125 33210 30030 31371 23009 46304 58682 56613 43971 29948 23877 25751 31917
9176 31917 38138 46369 56329 55879 45855 39733 42136 49334 44772 41203 39286 59338 67145 47241
9162 47241 31031 19991 22051 18575 13079 572 6442 15784 20221 29245 35504 36554 9284 -2635
9148 -2635 299 20850 22648 35979 60402 55377 50245 48517 37663 22340 28569 41794 66196
9135 66196 60706 55302 40782 23387 49285 53656 58277 46534 16190 6417 24097 25270 46416
9122 46416 51045 36210 27524 38359 35558 42713 47862 44994 47306 50555 60017 56566 51392 60075
9108 60075 67046 57110 51662 30128 20760 38712 48943 55769 57264 59128 58792 66687 56086 44245
9094D4245K307L091j3223p232l431j1715J7820J4429j7090j0905n282o578K6385
9081C2821J4471j9702k2110K661K0296k422l187N528O772r515j3601J4042k854
9068B3200m130M579J3398M79j2968O052N589j3538k4159P005J7529n474n800L534
9054A5296N555L379J921l25K955N869l634j1429N929R056m175P156o188n57J0455
9039D1263J362o042j1584M126L16j7641j3344p215n02J9237L700j681J0854K410
9025B5259P287J4614j2362k5770j412J1874m116J0379l04Q520J0609j5974j663
9012B6941L340k07O039j0715k1170J1311J2861q191K1916p55j6889j4995O896
8999A6382N061M300L539K918j761j9969n123r038p372J3565J3445O319J0564K279
$$ plain form
9094 44245 46552 49643 36420 29188 25757 14042 31862 46291 29201 18296 13014 6436 32821
9081 32821 47292 27590 5480 8141 28437 26015 22828 28356 35128 25613 12012 26054 23200
9068 23200 19070 23649 37047 37526 24558 30610 36199 22661 -1498 5507 23036 17562 11762 15296
9054 15296 20851 24230 26151 25826 28781 34650 31016 19587 25516 34572 30397 37553 31365 30808 41263
9039 41263 42625 36583 24999 29125 29441 11800 -1544 -8759 -9261 9976 13676 11995 22849 25259
9025 25259 32546 47160 34798 9028 7616 19490 15374 25753 25449 33969 44578 28604 26941
9012 26941 30281 30074 36113 25398 4228 15539 28400 20209 42125 41370 24481 9486 16382
8999 16382 21443 25743 29282 32200 30439 10470 5347 -3691 -11063 2502 15947 22266 32830 35109
8985C5109j5476p998J3578K3422r946q516k2105q172m868L0485K0454J991j6760
8972C1198j7153N74J981K942K2639L507r747o777l406J6493P323p741M757L505
8958E0095j254j0778N27M96J0555l413l153J4340K6126m565N300n695L44J3400
8944I2325m682k9213l775j465m384r634r311M254N054Q695J1014j3798o419L349
8930D2010Q863p567J7134l684M321R90j2852j11N358O85q477J6776l227L18L528
8915F4065q87O183p570M39J3060M050o618p738J9999j0435K0269J8374O08N296
8901A19095J2241J8541q713N494K2860q47m915j1826J024q163l2795p646J2204
8888A16554J579R158j1596p685L822l510K0003J6369L633M790J2929R675j1640
$$ plain form
8985 35109 19633 11635 25213 48635 38689 30173 8068 -104 -4972 25513 45967 47958 31198
8972 31198 14045 14619 16600 19542 42181 45688 35941 29164 25758 42251 49574 41833 46590 50095
8958 50095 48841 38063 38590 39086 49641 46228 43075 57415 83541 78976 84276 78581 78925 92325
8944 92325 87643 58430 54655 53190 48806 39172 29861 34115 39169 47864 58878 45080 38661 42010
8930 42010 50873 43306 60440 56756 61077 62067 49215 49104 54462 55147 46670 63446 60219 60537 64065
8915 64065 63178 69361 61791 62230 75290 79340 72722 64984 84983 74548 94817 113191 113799 119095
8901 119095 131336 149877 141164 146658 169518 168671 163756 151930 152954 144791 111996 104350 116554
8888 116554 118133 127291 115695 108010 111832 108322 128325 144694 148327 153117 166046 175721 164081
8875A64081p080k4580k9197r150J4928l463J610J4499p840j9893j0103O632J460
8862I1904Q953J7746K0494K71M561p424L214K4802J9345L4007K6445R614J3974
8849B67906r212l0046k4451j1211k2075r819j2870k3232k2913P893p484K0240
8837A22726q69k1435m834k96l0520P830J5752q904n715r642j4274p312J765j1065
8823C3207j5383J1352J1280P347j2091L390J6966J5602K260k229J5683M234J2067
8810A03685K2544M680P156Q631O798J4542j1481o230p695j0233j9865p980L943
8797A08495j2352m434k80L380R789J733J0045J7185q379r717r770l503K487k4413
8783H0266k1118L723N652J5025K977o241r32Q225K1261J6057j1953k2008L785
$$ plain form
8875 164081 157001 132421 103224 94074 109002 105539 107149 121648 113808 93915 83812 90444 91904
8862 91904 100857 118603 139097 139368 143929 136505 139719 164521 183866 217873 244318 253932 267906
8849 267906 258694 228648 204197 192986 170911 161092 148222 124990 102077 109970 102486 122726
8837 122726 121857 100422 95588 95292 64772 72602 88354 79450 73735 64093 49819 42507 44272 33207
8823 33207 17824 29176 40456 47803 35712 39102 56068 71670 73930 71701 87384 91618 103685
8810 103685 126229 130909 138065 146696 153494 168036 156555 150325 142630 132397 112532 104552 108495
8797 108495 96143 91709 91429 94809 104598 106331 116376 133561 125182 115465 105695 102192 104679 80266
8783 80266 59148 62871 68523 83548 86525 80284 79352 87577 108838 124895 112942 90934 94719
8770I4719p044m9162j953k327j2725J3672R537J907J5191j5335n449M548O003
8757E1582J577k625k112J6390M344k2348m371J3933K390j920O231n275m729J3013
8743F6080M077k1186o617L9052K1953J938j7815J1721J0205j2426j7187k186J8663
8730I6272j3441R542J4003N271n223O469P405k706j847J866N458j9173j2215L465
8716I5146j4042R643p650j3083N276J6404O329r74L204J5799P551o485k338J4130
8702A28910R251q307k1566J183J8496O74k8252j4656J5246J1335R475O421J5759
8689A43969k959j2390J8474K9663m338o447r329O612J2427J3105j8856j4154J171
8676A56948m719J1787J015n021k522K384K0416j7837K492M778J8918N099p834
$$ plain form
8770 94719 87675 38513 36560 34233 21508 35180 44717 46624 61815 46480 41031 45579 51582
8757 51582 53159 50534 48422 64812 69156 46808 42437 56370 58760 56840 63071 57796 53067 66080
8743 66080 70157 48971 42354 81406 103359 105297 87482 99203 109408 96982 79795 77609 96272
8730 96272 82831 92373 106376 111647 106424 112893 120298 117592 115745 117611 123069 103896 91681 95146
8716 95146 81104 90747 83097 70014 75290 91694 98023 97049 100253 116052 123603 117118 114780 128910
8702 128910 138161 129854 108288 109471 127967 128641 100389 85733 100979 112314 121789 128210 143969
8689 143969 141010 128620 147094 176757 172419 165972 156643 163255 175682 188787 169931 155777 156948
8676 156948 152229 164016 165031 160010 157488 159872 180288 162451 164943 169721 188639 193738 185904
8663A85904J990j859J3720J5323m753k051N702R497L5752r108q548K2535K4667
8650B88771k5395j8595J1122J2308j138P339K655O735J9310K0099K8927j540j590
8637C49008J0642r06k082j218k078k433J6413m91j42L1057R104j0612M1120K6167
8623D63549j739L2151L4098J7317J4253L8336L2069M8300N3846N8187L5547N8836
8611H84750O7147P3011J19590R0191J05316J00119R9607J07391J03543J10018
8601A860683J03439M7168J0484j4462o0104q2002j23780j47951j60113j36179
8591A297183j20593r7384q6653r8870p9209n3148n9214l5579m3978k9983l5217
8580E57355k9065l0577l1908p941m743k9999j7559j4367j1267k7163j4833j2894
$$ plain form
8663 185904 187894 186035 199755 215078 210325 208274 213976 223473 259225 250117 241569 264104 288771
8650 288771 263376 244781 255903 268211 267073 274412 277067 283802 303112 323211 352138 350598 349008
8637 349008 359650 358744 356662 355444 353366 350933 367346 366855 366713 397770 406874 396262 437382 463549
8623 463549 461810 493961 528059 545376 559629 597965 630034 678334 732180 790367 825914 884750
8611 884750 951897 1024908 1144498 1234689 1340005 1440124 1539731 1647122 1750665 1860683
8601 1860683 1964122 2011290 2021774 2007312 1947208 1865206 1741426 1593475 1433362 1297183
8591 1297183 1176590 1079206 992553 893683 814474 761326 702112 666533 622555 592572 557355
8580 557355 528290 497713 465805 457864 453121 423122 405563 391196 379929 352766 337933 325039
8568C25039n422k0234k1310J7738O507q287O573M909j1889j7590j9768r634q87
8555B45745O042j9501k5085m360J296k0865k1812K3763L0137o2o806o979n453
8542A96060R209R18J643j0817O623Q446l51Q267L0811P423l259o507j9333j2182
8528B16951j1592L846p852k3562j6598J1046J7775q429k5010N59M704j6492j3113
8515A32233J2902j766l982J111l706m923q452n682J2059M147o718k2008m825J1318
8501A11708J2916o103M192M339k0472k195O571p037O580K5767J5418j2769k6543
8488A12372m04L1533m738m303j0950m126l009l626P149j2381K783J5987l608j5758
8474A06921Q331o100k1261K71M247o987r853j0901J3471n438J1911n338J5434
$$ plain form
8568 325039 319617 299383 278073 295811 302318 294031 300604 305513 293624 276034 256266 246632 245745
8555 245745 251787 232286 207201 202841 204137 183272 161460 185223 215360 215298 208492 201513 196060
8542 196060 205269 206187 207830 197013 203636 212082 211731 219998 250809 258232 254973 248466 229133 216951
8528 216951 205359 209205 201353 177791 161193 172239 190014 181585 156575 157134 161838 145346 132233
8515 132233 145135 143369 139387 140498 136792 131869 123417 117735 129794 133941 127223 105215 100390 111708
8501 111708 124624 118521 122713 127052 106580 104385 110956 103919 110499 136266 151684 138915 112372
8488 112372 111968 143501 138763 134460 123510 119384 116375 112749 119898 107517 110300 126287 122679 106921
8474 106921 115252 109152 87891 88162 92409 85422 75569 64668 78139 72701 84612 79274 94708
8461I4708J9361J5130j9103j6828L299M995k3031n626K436J1698k206L910o354
8448H2389J081j3588k4341k322K3384J3832k604j0397K80J8114O014J886m726
8435H9002r305l023J0591k1735l574J0907O942R558J0932P384m984j1565j1883
8422G9247j9959K694k447p834l1O792r025q143J7126Q132k9738k2246n322J3467
8408B2713K4245l240p114j4495j2010J2147J6155k799K339K0229o014j7526J6736
8395E1366Q687p482J4991j8281j3488L151k0598J965K2018O430n574Q686J6599
8382F8470j5870k9424K1758L1275N493n14O478j4874j5217j4401J7450K365k5996
8369C6993j0033l997p833Q007J2294J2655k459L525j2099j042l589P163R438M756
$$ plain form
8461 94708 114069 129199 110096 93268 96567 101562 78531 72905 75341 87039 84833 88743 82389
8448 82389 83470 69882 45541 43219 66603 80435 77831 67434 67714 85828 91842 93728 89002
8435 89002 79697 76674 87265 65530 61956 72863 79805 89363 100295 107679 102695 91130 79247
8422 79247 59288 61982 59535 51701 51670 58462 49437 41294 58420 66552 36814 14568 9246 22713
8408 22713 46958 43718 36604 22109 10099 22246 38401 35602 37941 58170 52156 34630 51366
8395 51366 60053 52571 67562 49281 35793 38944 18346 20311 42329 48759 43185 51871 68470
8382 68470 52600 23176 44934 76209 81702 81188 87666 72792 57575 43174 60624 62989 36993
8369 36993 26960 22963 15130 23137 35431 48086 45627 49152 37053 36011 32422 39585 49023 53779
8355E3779K100K2376K0860j9543l2800p33J5673J0078k433j250Q045m474j0865
8342F0813L146k343Q391j0847p411M78L271j985J1824k46j553j3526k9324R880
8328C0568J0610K493M57k1613p165J5227R830J6253M719k684j595J0746J9461
8315H7307J1029j8084k5170j2356L261K1362J2897j4409k117J1823k779j7930
8303E4834k1490j1341N140J9872O868J0375O972o744l89J8868p945j378P238J558
8289H2438j1897o787l419J4956J0979J950r610R39r49K603k168j2070q743k686
8275E5536j247j645j4196O327L436k347m491P61K694r73J3671Q65l474k1299j9041
8260A4577n858J268l853R955Q572J9248p602l934J2780N975M679p955j318o893
$$ plain form
8355 53779 55879 78255 99115 79572 46772 46039 61712 71790 69357 68107 76152 71678 60813
8342 60813 63959 61616 70007 59160 51749 52227 55498 53513 65337 65091 63538 50012 20688 30568
8328 30568 41178 43671 44128 22515 15350 30577 40407 56660 61379 58695 57100 67846 87307
8315 87307 98336 80252 55082 42726 45987 67349 80246 65837 63720 75543 72764 54834
8303 54834 33344 22003 27143 47015 53883 64258 71230 64486 64097 82965 75020 73642 80880 82438
8289 82438 70541 63754 60335 75291 86270 88220 78610 79549 78600 81203 79035 66965 58222 55536
8275 55536 54289 52644 38448 44775 48211 45864 41373 42134 44828 43855 57526 58391 54917 33618 14577
8260 14577 8719 9987 6134 16089 24661 43909 36307 32373 45153 51128 55807 47852 46534 39641
8246C9641k18Q483R098j298j571l126J2338J3339j1108J2484l697j4725P050o854
8232E9836J094j5803N053K3331k0094k2317K67L630N894J1260r368J977J3681
8219E8441J0686M952j3836l9600j4048K1141K942O473K3332J2758k0298o103p653
8206C9187j030n23J1301m531l884n4k078j1478j1569j4953m854J5446J1967J3823
8192C6770j3655j3744J4080J2313j799k593n12J8389k3509j0564l995J6546K7261
8179E4988J139J0926j086m640j3697j2792p474K100K0302K989N828n232m456q4
8165D8811k1761o286L529J4500j2354M58k981P258J9920k717n855j9273j47J628
8151B4730p016J3120m138P069J520J5883n626j5765O533o565J0429J9898j689
$$ plain form
8246 39641 39423 47906 57004 55706 54135 51009 63347 76686 65578 78062 74365 59640 66690 59836
8232 59836 60930 45127 50180 73511 53417 31100 31367 34997 40891 52151 42783 44760 58441
8219 58441 69127 74079 60243 20643 6595 27736 30678 37151 60483 73241 52943 46840 39187
8206 39187 38157 37634 48935 44404 40520 40466 38388 26910 15341 388 -4466 10980 22947 36770
8192 36770 23115 9371 23451 35764 33965 31372 30860 49249 25740 15176 11181 27727 54988
8179 54988 56127 67053 65967 61327 47630 34838 27364 29464 49766 52755 58583 53351 48895 48811
8165 48811 27050 20764 24293 38793 26439 26897 23916 31174 51094 48377 42522 23249 23102 24730
8151 24730 17714 30834 26696 33765 35285 51168 45542 29777 36310 29745 40174 60072 58383
8138E8383k1568O31J2401r81K997j3113j6264Q602j55L909J9478j0066j0829m937
8124B8488M99L795N691O838q029o39J0919Q518N749j2910k0963p067J1885l628
8110B9146J0271J3070P077J0911p515r346P951q50J1804k9105l565M836K546M250
8096E1481n081l341j4574k1330M41J9150J3585q337j6858K850K5703J6964l43
8083F0310k436p700j1467N560J7640M01j7898L559K7745j584j6707L476K983N563
8069F9445N818J6279J1003m86j1232q857j3915l0305J9536K8940L968J3771J7133
8056A21098q459j8601J749J6573N36J5496K1050L567J4542N926N424R43p553j9107
8042A53184j7390O318L486P402l414j300J5587Q621k1353J12K6496K3324m802
$$ plain form
8138 58383 36815 37446 49847 48866 51863 38750 22486 31088 30933 34842 54320 44254 33425 28488
8124 28488 28987 32782 38473 45311 37282 36643 47562 56080 61829 48919 27956 20889 32774 29146
8110 29146 39417 52487 59564 70475 62960 53614 61565 60715 72519 43414 39849 44685 47231 51481
8096 51481 46400 43059 28485 7155 7596 26746 40331 31994 15136 17986 43689 60653 60310
8083 60310 57874 50174 38707 44267 61907 62308 44410 47969 75714 74130 57423 60899 63882 69445
8069 69445 75263 91542 102545 102059 90827 81970 68055 37750 57286 86226 90194 103965 121098
8056 121098 112639 94038 95787 112360 112896 128392 149442 153009 167551 173477 178901 179844 172291 153184
8042 153184 135794 142112 145598 153000 149586 148286 163873 172494 151141 151253 177749 201073 196271
8029A96271l2967j8942j8662O846J9389P525j643J9764J6024O493n917m545N37
8016A90173L475O588p455J0678J0128J8246N3567L0171M014J2866r43L678l874
8003C31312m6136l3056p679j481j7582j756R883p060j3482l1246l5380J1983J4241
7990A72561j4204l476K547j8118O119J614M09J8837R785j182k1097J0677N625
7977A70097J8056J8681m546P971K3468M317L1035N119J853Q367q821N940N798
7964B87335j454J1198O642j6111q622O46j032j8059j1623Q102j4011k5812j5935
7951B01264j447J408p055k069K352J2258j9565k0484N654K39J0275q913k3208
7938A50709q253J3061J9113J5709j281p67j4366k205j7828J2426K3391L777k37
$$ plain form
8029 196271 163304 144362 125700 132546 151935 159460 157817 177581 193605 200098 194181 189636 190173
8016 190173 193648 200236 192781 203459 213587 231833 285400 315571 319585 332451 331508 335186 331312
8003 331312 285176 252120 244441 242960 225378 223622 233505 226445 212963 181717 146337 158320 172561
7990 172561 158357 154881 157428 139310 145429 147043 147452 166289 176074 174892 153795 164472 170097
7977 170097 188153 206834 202288 210259 233727 238044 269079 274198 276051 284418 275597 281537 287335
7964 287335 285881 297079 303721 287610 278988 279634 278602 260543 248920 257022 243011 217199 201264
7951 201264 199817 201225 194170 192101 194453 206711 187146 166662 172316 172555 182830 173917 150709
7938 150709 142456 155517 174630 190339 189058 188291 173925 171720 153892 166318 189709 193486 193249
7925A93249j2319p427l162R827n57n125j0735l308J1793l944k1451j0932M025
7912A39934L534n895r84r627k372K339n753R34l3j7190K091O972j6691R338M699
7897A11296k5664k5618L122J7044P372M360K453M860J5017j3233k782Q377q736
7884I7868p781q214K558J0479j2322j2102k4245R404J8698q287j3276l057J275
7871E0998Q045o937n599J6065k837p962m746J6634K473m323N796j8869q419O522
7857D6841o910N648R490j4851j8642n167m829n99m918j4996K2171K3162J2749
7844D9149N484P483j1375j3808K522P189l024j3171K475J1379j4075J161J571
7831C2960J2694l122k6695p410R619j4522M381R82j7544M655L2038j5548L013
$$ plain form
7925 193249 180930 173503 170341 180168 179611 174486 163751 160443 172236 168292 146841 135909 139934
7912 139934 143468 137573 136589 126962 124590 126929 121176 122110 122077 104887 106978 113950 97259 106597 111296
7897 111296 85632 60014 63136 80180 87552 91912 94365 99225 114242 101009 98227 106604 97868
7884 97868 90087 81873 84431 94910 82588 70486 46241 55645 74343 66056 52780 49723 50998
7871 50998 59043 52106 46507 62572 59735 51773 47027 63661 66134 61811 67607 48738 40319 46841
7857 46841 39931 45579 55069 40218 21576 16409 11580 10981 6063 -8933 13238 36400 49149
7844 49149 54633 62116 50741 36933 39455 46644 43620 30449 32924 44303 30228 31389 32960
7831 32960 45654 42532 15837 8427 18046 3524 7905 8887 -8657 -4002 28036 12488 15501
7818A5501j820J729m41m475j023l651J851J681o396Q207L988K1366R715K565l634
7803D5163Q660J811r354l179L45n787j7165J0739J8229k0130k0787l708K322J412
7789H571O651j927j7714R601M312j4231k933J2915o511M158r362j0341Q856M779
7775c176q332n687K889l241L535J375k892j3786J1252J2989j1941N450J593K3626
7761A3654Q503O118M134K399o110j2526O498J2886m202P461l715j1698r26J661
7747B4137J425k4363j5481K1752R095m850Q301j3386K863M319J2328K901p969
7734B1072j5340Q725j95R532J2688p031j7745j0005J2741O271j9397j4351J320
7721a1715p283R898L633o107K741k61J6670P348p693j1367K547K0808J1812J5574
$$ plain form
7818 15501 13681 15410 14969 10494 9471 5820 7671 9352 2956 11163 15151 36517 46232 48797 45163
7803 45163 53823 55634 46280 43101 43446 37659 20494 31233 49462 29332 8545 4837 7159 8571
7789 8571 15222 13295 -4419 5182 9494 -4737 -7670 5245 -1266 2892 -6470 -16811 -7955 -3176
7775 -3176 -11508 -17195 -14306 -17547 -14012 -12637 -15529 -29315 -18063 -5074 -17015 -11565 -9972 13654
7761 13654 22157 28275 32409 34808 28698 16172 22670 35556 31354 38815 35100 23402 22476 24137
7747 24137 25562 1199 -14282 7470 16565 11715 20016 6630 9493 13812 26140 29041 21072
7734 21072 5732 14457 14262 23794 36482 29451 11706 1701 14442 20713 1316 -13035 -11715
7721 -11715 -18998 -9100 -5467 -11574 -8833 -9094 7576 14924 7231 -4136 -1589 19219 31031 46605
7707D6605p435k9801q723J35N872n924l302q351J9411K2768M902j0437k9162K381
7693a061N498N084N399m460j0124P502n891j2823J7729j4461l811J3279n826r29
7679d895J6654N391j8223N885R071n396r525j5913j6065J8436Q020L592J5611
7666A2643p916j2945j9344M197R518J635J211j212M500J1838q044j8591j1932
7653c4442J4503K6432j436q130k9315N724J0942L0834L287o221k812j1889n723
7640h246o080J0337J2435j7040j5466J0462m35k057N90P281J8559J5846J3272
7627C9458j2377k6749j3186n07n293o682J584P931o001N389J2368j518k5503r796
7613d0882O600J0171J1205M281J8553R591l05n316j2201k36J7154k366j5479q492
$$ plain form
7707 46605 39170 9369 646 781 6653 729 -2573 -10924 8487 31255 36157 25720 -3442 -1061
7693 -1061 4437 9521 14920 10460 336 7838 1947 -10876 6853 -7608 -11419 1860 -3966 -4895
7679 -4895 11759 17150 -1073 4812 13883 8487 -1038 -16951 -33016 -14580 -6560 -2968 12643
7666 12643 4727 -8218 -27562 -23365 -13847 -12212 -11001 -12213 -7713 4125 -3919 -22510 -34442
7653 -34442 -19939 6493 5057 -3073 -32388 -26664 -15722 15112 18399 12178 9366 -2523 -8246
7640 -8246 -14326 -3989 8446 -8594 -24060 -13598 -14033 -16090 -15500 -8219 10340 26186 39458
7627 39458 27081 332 -12854 -13361 -18654 -25336 -23752 -15821 -21822 -16433 -4065 -5583 -31086 -40882
7613 -40882 -34282 -24111 -12906 -8625 9928 19519 19214 13898 1697 1461 18615 16249 770 -7722
7599g722K275J5723J5444j2595k3285k009j6241j3117L119J7802N554k523k771
7586b0346J744R506r249K1573J2275m825k6020j073M696L1834J3773j7228j0318
7573F342k4139j3277N893k375K239R278o761q767O802J9935j2191j5458J796K8882
7559a801j1630j0967M629j3025J1915J7484j1597N338K4126j1940p136J5313K1560
7546C2269q372k9755j6142l043k560P493J3556N622q190J670p998p013m786J9164
7532h085M491l591M268O201p502n68L880J7640M932p388m338l780P652q201q159
7517b548K869J1548j7431J0311k680J04l02J6279M783J070m115p222M556K175
7503A9397N504p079j4451o710o749J1760O505K853l870J6864j666k0193n034L667
$$ plain form
7599 -7722 -5447 10276 25720 13125 -10160 -12169 -28410 -41527 -38408 -20606 -15052 -17575 -20346
7586 -20346 -18602 -9096 -18345 3228 15503 10678 -15342 -16415 -11719 20115 33888 16660 6342
7573 6342 -17797 -31074 -25181 -27556 -25317 -16039 -22800 -31567 -24765 -4830 -17021 -32479 -30683 -1801
7559 -1801 -13431 -24398 -19769 -32794 -20879 -3395 -14992 -9654 14472 2532 -4604 10709 32269
7546 32269 23897 -5858 -22000 -25043 -27603 -20110 -6554 -932 -9122 -7452 -15450 -22463 -27249 -8085
7532 -8085 -3594 -7185 -2917 3284 -4218 -4786 -906 16734 21666 14278 9940 6160 13812 5611 -2548
7517 -2548 321 11869 -5562 4749 2069 2173 1871 18150 22933 24003 19888 12666 17222 19397
7503 19397 24901 17822 3371 -3339 -10088 1672 8177 11030 7160 24024 22358 2165 -2869 798
7489G98K4046m016k8331M229J8179L832j1302o98j581p761k361j0278P344J8391
7475A0491O668j872r473j4804l543J9719J1253p727k4126n416N21n229Q936N043
7461i559J0421K3534L641j9810k3023j321K2103j1077o789r142q162j3885N054
7448c8015L9214J9687m261j2582r167J1011l029j582j8631N069K9109K355O67
7435A9845J1245O863O764n547q356O410M507k8331k0872O176J0435J6289R92m112
7421B2308L076J0662o861n148o345j4637P63n753N826L754j2477o352J757K412
7407g015J6238J2939m423j3307j1464o714N081K0447j1641j3591N269K510j0632
7394a6303N730K242j4393J0788K1895K0819q257q572j1551n313J9096Q901k9034
$$ plain form
7489 798 24844 20828 -7503 -3274 14905 18737 7435 6737 5156 -2605 -4966 -15244 -7900 10491
7475 10491 17159 15287 5814 -8990 -12533 7186 18439 10712 -13414 -18830 -18309 -23538 -14602 -9559
7461 -9559 862 24396 28037 8227 -14796 -16117 5986 -5091 -11880 -21022 -29184 -43069 -38015
7448 -38015 1199 20886 16625 4043 -5124 5887 2858 1276 -17355 -12286 16823 19178 19845
7435 19845 31090 37953 44717 39170 30814 37224 41731 13400 -7472 -1296 9139 25428 26420 22308
7421 22308 25384 36046 29185 24037 17692 3055 3818 -1935 3891 7645 -4832 -11184 -9427 -7015
7407 -7015 9223 22162 17739 4432 -7032 -13746 -8665 11782 141 -13450 -8181 -5671 -16303
7394 -16303 -10573 -8331 -22724 -11936 9959 30778 22521 13949 2398 -2915 16181 25082 -3952
7381c952l613J729k2715R258n447n961o215j2809J8626K3638p779K980j3910Q313
7367a7857Q031J3187q56j2084j5969P552J0900J5938P155k034M586J7031O048
7354D1628j7729k3302k1544m033J6841K1083M106r681k3052M480O407J5189K3016
7341C3409O066k0292j5645J4188Q441K980m294j167j3022j0185n237P067J6749
7328A9058j4317j0004j3142j0685K824j139Q735l608L933P16o783l874J1597J4794
7314a895N493j7184q740K316L547O088r29m987o675K1928O259p272j0070l301
7300a5422l621J089j419J543k8713m497j960J364J4682r418k059K3979l661L809
7286b4304K5720K8339M804R237J3495k6491j8625o853k2333L315K8813J5461k4722
$$ plain form
7381 -3952 -7565 -5836 -28551 -19293 -24740 -30701 -36916 -49725 -31099 -7461 -15240 -12260 -26170 -17857
7367 -17857 -9826 3361 2505 -9579 -25548 -17996 -7096 8842 15997 13963 18549 35580 41628
7354 41628 23899 597 -20947 -24980 -8139 12944 17050 7369 -15683 -11203 -4796 10393 33409
7341 33409 39475 19183 3538 17726 26167 29147 24853 23686 10664 479 -4758 2309 19058
7328 19058 4741 -5263 -18405 -29090 -26266 -27405 -18670 -22278 -18345 -17629 -24412 -28286 -16689 -1895
7314 -1895 3598 -13586 -22326 -20010 -16463 -10375 -11304 -16291 -22966 -1038 5221 -2051 -12121 -15422
7300 -15422 -19043 -17954 -19373 -17830 -46543 -51040 -53000 -51636 -36954 -46372 -48431 -24452 -28113 -24304
7286 -24304 1416 29755 34559 43796 57291 30800 12175 5322 -17011 -13696 15117 30578 5856
7273E856j0347l905n543L963K536k268n532J1105N261J932j366j6368N218J492
7259g966R72l495j9674p223K0869J6564J2256m921q926k1132q041Q968q18P448
7245a5119L260K72J28J6276l858p117j1617r752l587L847L861K1129K885M150
7231D758J7562J797j3390r698j9340N867l958M680O595K167K0798O235j5109k8109
7217a9145q470J7578R789J352K769j6471k400J231L430N131J8208j0585j1278
7204h861m359j4415j3818R183Q732O419k969o555L426o115J007K342J9598o722
7190a3107q800j020P019l478j1195J1681L0352M792n700k10R301R43k1502j9284
7176b0208P342O979o862M881R913l146J8497J620j8789j1033j48J80J600l37m82
$$ plain form
7273 5856 -4491 -8396 -13939 -9976 -7440 -9708 -15240 -4135 1126 3058 1692 -14676 -9458 -7966
7259 -7966 -6994 -10489 -30163 -37386 -16517 47 12303 7382 -1544 -22676 -30717 -21749 -22567 -15119
7245 -15119 -11859 -11587 -11459 4817 959 -6158 -17775 -27527 -31114 -27267 -23406 -2277 608 4758
7231 4758 22320 24117 10727 1029 -18311 -12444 -16402 -11722 -5127 -2960 17838 24073 8964 -19145
7217 -19145 -27615 -10037 -248 1104 3873 -12598 -14998 -13767 -10337 -5206 13002 2417 -8861
7204 -8861 -13220 -27635 -41453 -32270 -23538 -17119 -20088 -26643 -23217 -29332 -28325 -25983 -6385 -13107
7190 -13107 -21907 -22927 -15908 -19386 -30581 -18900 11452 16244 10544 10334 19635 20578 -924 -20208
7176 -20208 -12866 -5887 -12749 -7868 2045 -1101 17396 19016 227 -10806 -10954 -10774 -9174 -9511 -9993
7161i993k4673o727o423l145J2172L1254N463k288o047K592P019k583Q107J7594
7147B2322J3905j4513j8443j654o409L189J0282l928O812l095Q332p649k2067
7134a2916N634K599j1129j518j2608K625J2044K1443J0602P093n425Q574r283
7121A7735r099j100l274n508p321M482o941k4131m848J8962J1125l535k6012N205
7107c4260J6178N897J0153R851k2013o607J5954m763j9611K872J8866j4046j0494
7094c2023J1507Q569k0255J765J2593R214j048o1n791M682J4469j3971M14p620
7080a7556N285K2615J1676j7320l197L01J0095j5903j5400j776p49M188j4780
7067c2521N293J3098n639j3118J341J4572P752o814J0431k0570M372K3582J6332
$$ plain form
7161 -9993 -34666 -41393 -47816 -50961 -38789 -7535 -2072 -4360 -10407 -7815 -796 -3379 4728 22322
7147 22322 36227 21714 3271 1617 -4792 -1603 8679 4751 11563 8468 16800 9151 -12916
7134 -12916 -7282 -4683 -15812 -17330 -29938 -27313 -15269 6174 16776 23869 18444 27018 17735
7121 17735 8636 7536 4262 -1246 -8567 -4085 -11026 -35157 -40005 -21043 -9918 -13453 -39465 -34260
7107 -34260 -18082 -12185 -2032 7819 -14194 -20801 -4847 -9610 -29221 -26349 -7483 -21529 -32023
7094 -32023 -20516 -11947 -32202 -30437 -17844 -8630 -9678 -9739 -15530 -10848 3621 -10350 -9936 -17556
7080 -17556 -12271 10344 22020 4700 1503 1804 11899 -4004 -19404 -21180 -21929 -17741 -32521
7067 -32521 -27228 -14130 -19769 -32887 -31546 -16974 -9222 -16036 -5605 -26175 -21803 1779 18111
7054A8111N78k6119l3205M276K7595Q871Q888j3778R29J5905M328j1696l900J544
7040B327j4516j2307r793J4703J4987J0877j6840j7306M475J0218K101J5224k839
7027A311m243M475J489n302j019P883n49L66r05k2615j1778n489M793K5930Q191
7012B538O563J7798J4217j1518k6019k3166m38n607N169M571L271l125M757j870
6998a2859K547P952O602O170o989j0401n890J6107j949J579M362P113l429p601
6984C314J1305q54l923n100r65J269j6968k0669K009J5860Q658l972L079k936
6970i893j0636k216j341k227K2860J3346j6326p823j1869l944J0440K2603o407
6957c433L196j1412m448J6357Q930M396j3541L14M03l100N93J4842j9396k2723
$$ plain form
7054 18111 18689 -7430 -40635 -36359 -8764 107 8995 -4783 -3854 12051 16379 4683 783 2327
7040 2327 -12189 -24496 -34289 -19586 -4599 6278 -10562 -27868 -23393 -13175 -11074 4150 1311
7027 1311 -2932 1543 3032 -2270 -3289 4594 4045 4411 3506 -19109 -30887 -36376 -31583 -5653 2538
7012 2538 9101 26899 41116 29598 3579 -19587 -20025 -25632 -20463 -15892 -12621 -15746 -10989 -12859
6998 -12859 -10312 -2360 4242 10412 3423 -6978 -12868 3239 1290 2869 7231 14344 10915 3314
6984 3314 14619 13765 9842 4742 3777 5046 -11922 -32591 -30582 -14722 -6064 -10036 -6957 -9893
6970 -9893 -20529 -22745 -24086 -26313 -3453 9893 -6433 -14256 -26125 -30069 -19629 2974 -3433
6957 -3433 -237 -11649 -16097 260 9190 13586 45 359 762 -2338 -1745 13097 -6299 -29022
6943b9022M856L272p664m75j2580J3338J8834P895j1720j435J2256O140k3795
6930b0100j226M0012J2522p992p325O963J0558o69k1067k0471m466k036o801M914
6916a7184J3754l181L008n683J2650K524J0421p222j6512o996O054J0766j790
6903F09j4835Q145L905j2121j2988j1812J2139K1056M257j2225P696J9227O323
6890A9376j9200m2391N58J5660K2316J4143q290j1617k746o547P721j0803N673
6877a6147M746q881L2630J0248j4544n03j1235k0756J1611K0865o800K996j361
6864B869n092J3877q120j7259k987J4293O830J1407m208J4726j3621j1763M429
6851E381N466J9507P364m585O013j0360k7941n066j60L285q051N447J1165J12
$$ plain form
6943 -29022 -24166 -20894 -28558 -29033 -41613 -28275 -9441 -1546 -13266 -14701 -2445 3695 -20100
6930 -20100 -21326 18686 31208 23216 15891 22854 33412 32743 11676 -8795 -13261 -15297 -22098 -17184
6916 -17184 -3430 -6611 -3603 -9286 3364 5888 16309 9087 -7425 -14421 -8367 2399 609
6903 609 -14226 -6081 -2176 -14297 -27285 -39097 -26958 -5902 -1645 -13870 -6174 13053 19376
6890 19376 176 -42215 -41657 -25997 -3681 10462 2172 -9445 -12191 -18738 -11017 -21820 -16147
6877 -16147 -11401 -20282 12348 22596 8052 7549 -3686 -24442 -12831 8034 1234 4230 2869
6864 2869 -2223 11654 3534 -13725 -16712 -2419 4411 15818 11610 26336 12715 952 5381
6851 5381 10847 30354 37718 33133 39146 28786 845 -4221 -4381 -1096 -9147 -3700 7465 7577
6837G577p469P596m895K005j6676k0928j7411Q081M897J3540J3906J9169j117
6824H275j389r898M566m408k1421k1532K4861R129k691Q668J1743J6963j6980
6811E886K636q189p597r249K927R586o773n559J3221j195j3795J071L940k620
6797a5710k99N208j4642p032l284J8675J3124K486K589k372j2327j3569n599n887
6783c8639M868J1453J2937J4877j0368q565l055p330J1467J078n847o01j1227
6770b8952j2628N759j6167J5361J5091Q517k059j077M081M284q814N514K525K5794
6756A7229K617k2025j9853J5619R451o008O929L036J968j7105l186N636k57n991
6742a1940r151Q818J801j3219J5015J6540j5378j8498n050K6370n651K251J1975
$$ plain form
6837 7577 108 7704 2809 4814 -11862 -32790 -50201 -42120 -37223 -23683 -9777 9392 8275
6824 8275 6886 -3012 1554 -2854 -24275 -45807 -20946 -11817 -14508 -5840 5903 22866 5886
6811 5886 8522 333 -7264 -16513 -13586 -4000 -10773 -16332 -3111 -4306 -18101 -17030 -13090 -15710
6797 -15710 -16009 -10801 -25443 -32475 -35759 -17084 -3960 -1474 1115 -1257 -13584 -27153 -32752 -38639
6783 -38639 -33771 -22318 -9381 5496 -4872 -13437 -16492 -23822 -12355 -11277 -17124 -17725 -28952
6770 -28952 -41580 -35821 -51988 -36627 -21536 -13019 -15078 -16155 -12074 -7790 -16604 -11090 -8565 17229
6756 17229 19846 -2179 -22032 -6413 3038 -2970 3959 6995 8963 -8142 -11328 -5692 -5949 -11940
6742 -11940 -21091 -12273 -10472 -23691 -8676 7864 -7514 -26012 -31062 -4692 -10343 -8092 3883
6729C883n180k0801L001L010J128K588j3357R479J7366J5984J0735j5940j7960
6716f064o205j661M931k14o730p172j2487p397J6522K732O970o681K843R915J392
6701i306q389P378J5169j8090q971R860K153j0748j7169J143J6907M958J2621
6688b484O877j5802j1079l754J513m957o574K4012K3035J8938L707j9372R893
6675B3953J078j1840j0002j4880P708N846J2282N847L147l226J2378J20k532Q67
6661C0746j8553n731R259J4405k4341k023j2890j4733J0396O389r157m317K297
6648a8253p31m049m0j34p579k077J5883J6948K2084m540j5073m435m388k2652
$$ plain form
6729 3883 -1297 -22098 -19097 -16087 -14959 -12371 -25728 -16249 1117 17101 27836 11896 -6064
6716 -6064 -12269 -13930 -8999 -9213 -15943 -23115 -35602 -42999 -26477 -23745 -16775 -23456 -20613 -10698 -9306
6701 -9306 -17695 -10317 4852 -13238 -22209 -12349 -10196 -20944 -38113 -36970 -20063 -15105 -2484
6688 -2484 4393 -11409 -22488 -26242 -24729 -29686 -36260 -12248 10787 29725 33432 14060 23953
6675 23953 25031 13191 3189 -11691 -3983 1863 14145 19992 23139 19913 32291 32411 29879 30746
6661 30746 12193 6462 15721 30126 5785 3762 -9128 -23861 -13465 -7076 -16233 -20550 -18253
6648 -18253 -18984 -23033 -23073 -23207 -30786 -32863 -16980 -32 22052 17512 2439 -1996 -6384 -29036
$$ [...]
##END NTUPLES=NMR SPECTRUM
##END=
