##TITLE=Analysis number 325688
Compound Code cc 60614
Book Reference 486/88
Project Code adrs
Chemist Name simons
##JCAMPDX= 6.0         $$ Bruker NMR JCAMP-DX V2.0
##DATA TYPE= NMR SPECTRUM
##DATA CLASS= NTUPLES
##ORIGIN= Bruker BioSpin GmbH
##OWNER= nmr
$$ XWIN-NMR		Version 3.5
$$ Tue Jan  9 13:23:39 2007 GMT Standard Time (UT+0h)  MAYBRIDGE\nmr@NMR_250MHZ
##.OBSERVE FREQUENCY= 250.131544655141
##.OBSERVE NUCLEUS= ^1H
##.ACQUISITION MODE= SIMULTANEOUS (DQD)
##.ACQUISITION SCHEME= undefined
##.AVERAGES= 16
##.DIGITISER RES= 18
##SPECTROMETER/DATA SYSTEM= dpx250
##.PULSE SEQUENCE= zg30
##.SOLVENT NAME= CDCl3
##.SHIFT REFERENCE= (INTERNAL, CDCl3, 0, 16.4445)
##AUDIT TRAIL= $$ (NUMBER, WHEN, WHO, WHERE, WHAT)
$$ ##TITLE= Audit trail, XWIN-NMR		Version 3.5
$$ ##JCAMPDX= 5.01
$$ ##ORIGIN= Bruker BioSpin GmbH
$$ ##OWNER= nmr
$$ C:\u/data/dgb/nmr/ADRS/790/pdata/1/auditp.txt
$$ ##AUDIT TRAIL=  $$ (NUMBER, WHEN, WHO, WHERE, WHAT)
(   1,<2007-01-09 13:23:16.90 +000>,<MAYBRIDGE\nmr>,<NMR_250MHZ>,
      <created by zg, POWCHK disabled, PULCHK disabled
       configuration hash MD5:
       49 4B E0 1D 92 C2 6B 37 9F E6 65 BC 52 41 86 1D
       data hash MD5: 64K
       21 E5 C9 53 5F 66 F4 6D 52 74 5D 8D FC FB 46 AE>)
(   2,<2007-01-09 13:23:28.63 +000>,<MAYBRIDGE\nmr>,<NMR_250MHZ>,
      <Start of raw data processing
       ef LB = 0.3 FT_mod = 6 PKNL = 1 SI = 32K 
       data hash MD5: 32K
       16 B7 F8 72 A6 8E 79 A9 AD 6E 06 67 B0 23 66 22>)
(   3,<2007-01-09 13:23:30.40 +000>,<MAYBRIDGE\nmr>,<NMR_250MHZ>,
      <apk 
       data hash MD5: 32K
       8F B4 82 2E D4 DF C4 64 21 41 56 99 D6 81 A9 A0>)
(   4,<2007-01-09 13:23:31.15 +000>,<MAYBRIDGE\nmr>,<NMR_250MHZ>,
      <abs ABSG = 5 
       data hash MD5: 32K
       DD BD 3B 2A CF 19 A2 BE 60 34 2F B7 80 F9 AC 91>)
$$ ##END=
$$ 
$$ hash MD5
$$ A9 8D 24 BD D0 02 9D 75 1A 65 53 15 D2 03 44 89
##$RELAX= 
##$RELAX= 
##$RELAX= 
##$RELAX= 
##$RELAX= 
##$RELAX= 
##$RELAX= 
$$ Bruker specific parameters
$$ --------------------------
##$DU= <C:\u>
##$EXPNO= 790
##$NAME= <ADRS>
##$PROCNO= 1
##$TYPE= <nmr>
##$USER= <dgb>
##$AMP= (0..31)
100 100 100 100 100 100 100 100 100 100 100 100 100 100 100 100 100 100 
100 100 100 100 100 100 100 100 100 100 100 100 100 100 
##$AQSEQ= 0
##$AQ_mod= 3
##$AUNM= <au_zg>
##$AUTOPOS= <46 >
##$BF1= 250.13
##$BF2= 250.13
##$BF3= 250.13
##$BF4= 250.13
##$BF5= 500.13
##$BF6= 500.13
##$BF7= 500.13
##$BF8= 500.13
##$BYTORDA= 1
##$CFDGTYP= 0
##$CFRGTYP= 5
##$CHEMSTR= <none>
##$CNST= (0..31)
1 1 145 1 1 1 1 1 1 1 1 1 1 1 1 1 1 1 1 1 1 1 1 1 1 1 1 1 1 1 1 1 
##$CPDPRG= <>
##$CPDPRG1= <>
##$CPDPRG2= <>
##$CPDPRG3= <>
##$CPDPRG4= <mlev>
##$CPDPRG5= <mlev>
##$CPDPRG6= <mlev>
##$CPDPRG7= <mlev>
##$CPDPRG8= <mlev>
##$CPDPRGB= <>
##$CPDPRGT= <>
##$D= (0..31)
0 1 0 0 0 0 0 0 0 0.06 0 0 0 0 0 0 0.0002 0 0 0 0 0 0 0 0 0 0 0 0 0 0 
0 
##$DATE= 1168348995
##$DBL= (0..7)
120 120 120 120 120 120 120 120 
##$DBP= (0..7)
150 150 150 150 150 150 150 150 
##$DBP07= 0
##$DBPNAM0= <>
##$DBPNAM1= <>
$$ [...]
##$SUBNAM7= <"">
##$SUBNAM8= <"">
##$SUBNAM9= <"">
##$SW= 20.6930455092707
##$SWIBOX= (0..15)
0 0 3 0 0 0 0 0 0 0 0 0 0 0 0 0 
##$SW_h= 5175.983436853
##$TD= 65536
##$TD0= 1
##$TE= 294.16
##$TE2= 300
##$TE3= 300
##$TEG= 300
##$TL= (0..7)
0 120 120 120 120 120 120 120 
##$TP= (0..7)
150 150 150 150 150 150 150 150 
##$TP07= 0
##$TPNAME0= <>
##$TPNAME1= <>
##$TPNAME2= <>
##$TPNAME3= <>
##$TPNAME4= <>
##$TPNAME5= <>
##$TPNAME6= <>
##$TPNAME7= <>
##$TPOAL= (0..7)
0.5 0.5 0.5 0.5 0.5 0.5 0.5 0.5 
##$TPOFFS= (0..7)
0 0 0 0 0 0 0 0 
##$TUNHIN= 0
##$TUNHOUT= 0
##$TUNXOUT= 0
##$USERA1= <user>
##$USERA2= <user>
##$USERA3= <user>
##$USERA4= <user>
##$USERA5= <user>
##$V9= 5
##$VALIST= <valist>
##$VCLIST= <CCCCCCCCCCCCCCC>
##$VD= 0
##$VDLIST= <DDDDDDDDDDDDDDD>
##$VPLIST= <PPPPPPPPPPPPPPP>
##$VTLIST= <TTTTTTTTTTTTTTT>
##$WBST= 1024
##$WBSW= 4
##$XGAIN= (0..3)
0 0 0 0 
##$XL= 0
##$YL= 0
##$YMAX_a= 446955
##$YMIN_a= -512030
##$ZGOPTNS= <>
##$ZL1= 120
##$ZL2= 120
##$ZL3= 120
##$ZL4= 120
##$ABSF1= 16.44454
##$ABSF2= -4.248632
##$ABSG= 5
##$ABSL= 3
##$ALPHA= 0
##$AQORDER= 0
##$ASSFAC= 0
##$ASSFACI= 0
##$ASSFACX= 0
##$ASSWID= 0
##$AUNMP= <proc_1d>
##$AZFE= 0.1
##$AZFW= 0.1
##$BCFW= 0
##$BC_mod= 0
##$BYTORDP= 0
##$COROFFS= 0
##$CY= 12.5
##$DATMOD= 1
##$DC= 0
##$DFILT= <>
##$DTYPP= 0
##$F1P= 14.0000005364418
##$F2P= -0.99999901652339
##$FCOR= 0.5
##$FTSIZE= 32768
##$FT_mod= 6
##$GAMMA= 0
##$GB= 0
##$INTBC= 1
##$INTSCL= 1
##$ISEN= 128
##$LB= 0.3
##$LEV0= 0
##$LPBIN= 0
##$MAXI= 10000
##$MC2= 0
##$MEAN= 0
##$ME_mod= 0
##$MI= 0
##$NCOEF= 0
##$NC_proc= -3
##$NLEV= 6
##$NOISF1= 0
##$NOISF2= 0
##$NSP= 0
##$NTH_PI= 0
##$NZP= 0
##$OFFSET= 16.44454
##$PC= 1
##$PHC0= 228.5238
##$PHC1= -4.276104
##$PH_mod= 1
##$PKNL= yes
##$PPARMOD= 0
##$PSCAL= 4
##$PSIGN= 0
##$REVERSE= no
##$SF= 250.130019374635
##$SI= 32768
##$SIGF1= 0
##$SIGF2= 0
##$SINO= 400
##$SIOLD= 32768
##$SREGLST= <1H.CDCl3>
##$SSB= 0
##$STSI= 32768
##$STSR= 0
##$SW_p= 5175.98343685301
##$SYMM= 0
##$S_DEV= 0
##$TDeff= 65536
##$TDoff= 0
##$TI= <Analysis number 999999
Compound Code 99
Book Reference 9
Project Code 9>
##$TILT= no
##$TM1= 0
##$TM2= 0
##$TOPLEV= 0
##$USERP1= <user>
##$USERP2= <user>
##$USERP3= <user>
##$USERP4= <user>
##$USERP5= <user>
##$WDW= 1
##$XDIM= 32768
##$YMAX_p= 483311270
##$YMIN_p= -119552
$$ End of Bruker specific parameters
$$ ---------------------------------
##NTUPLES= NMR SPECTRUM
##VAR_NAME=  FREQUENCY,     SPECTRUM/REAL,   SPECTRUM/IMAG
##SYMBOL=    X,             R,               I
##VAR_TYPE=  INDEPENDENT,   DEPENDENT,       DEPENDENT
##VAR_FORM=  AFFN,          ASDF,            ASDF
##VAR_DIM=   32768,         32768,           32768
##UNITS=     HZ,            ARBITRARY UNITS, ARBITRARY UNITS
##FACTOR=    0.157963299565203, 1,           1
##FIRST=     4113.27311476098, 0,            0
##LAST=      -1062.71032209203, 0,           0
##MIN=       -1062.71032209203, -119552,     0
##MAX=       4113.27311476098, 483311270,    0
$$ Real data points
##PAGE= N=1
##DATA TABLE= (X++(R..R)), XYDATA
$$ [...]
$$ plain form
18566 24267 30455 38779 67300 52014 64795 87391 87143 83683 80070 97705 94296 90090 68215
18553 68215 66381 67944 100016 118226 118823 131488 114994 94008 104311 99852 83793 73503 77583
18540 77583 91763 91555 92067 86062 91365 105869 106832 106902 116548 131905 126350 133807 160799 199974
18526 199974 218873 228861 224934 201947 185792 159549 155628 166186 199207 249768 283031 271090
18514 271090 244815 236698 222233 221829 256696 274090 261776 276823 270746 261866 261186 273154 289551
18501 289551 313170 319249 343674 361407 377784 351661 351005 386548 431307 463646 491396 527663
18489 527663 600866 705652 833831 962472 1009005 919500 799438 735327 696452 677062 704614
18478 704614 792607 944011 1149798 1378902 1524365 1461974 1268767 1079255 936652 826921
$$ packed form
18566B4267O188Q324K8521j5286J2781K2596k48l460l613J7635l409m206k1875
18553F8215j834J563L2072J8210N97J2665j6494k0986J0303m459j6059j0290M080
18540G7583J4180k08N12o005N303J4504R63P0R646J5357n555P457K6992L9175
18526A99974J8899R988l927k2987j6155k6243l921J0558L3021N0561L3263j1941
18514B71090k6275q117j4465m04L4867J7394j2314J5047o077q880o80J1968J6397
18501B89551K3619O079K4425J7733J6377k6123o56L5543M4759L2339K7750L6267
18489E27663P3203J04786J28179J28641M6533q9505j20062o4111l8875j9390K7552
18478G04614Q7993J51404K05787K29104J45463o2391j93207j89512j42603j09731
$$ plain form
18468 826921 760394 737566 732138 700365 675099 663478 659587 658529 628645 609152 636039 645662
18456 645662 630612 600588 571977 547900 517944 508034 513061 522565 491718 437313 414031 428694
18444 428694 423162 406093 405758 372590 377445 382423 400447 437579 429098 417473 418976 417468 429096
18431 429096 398425 373355 376332 390150 423088 454718 459625 498923 459945 381103 319147 271337
18419 271337 262966 257255 227941 227593 229891 212214 179847 177685 167600 176895 179804 165202 151696
18406 151696 162855 179779 201408 197288 174205 148981 137735 152918 174048 181680 149259 136321
18394 136321 139107 153830 164914 189161 203860 215694 225707 231110 222795 202262 171192 154204
18382 154204 162123 196263 221314 238286 226015 215134 238049 245979 259390 268989 292280 302850
$$ packed form
18468H26921o6527k2828n428l1773k5266j1621l891j058k9884j9493K6887R623
18456F45662j5050l0024k8611k4077k9956r910N027R504l0847n4405k3282J4663
18444D28694n532j7069l35l3168M855M978J8024L7132q481j1625J503j508J1628
18431D29096l0671k5070K977J3818L2938L1630M907L9298l8978p8842o1956m7810
18419B71337q371n711k9314l48K298j7677l2367k162j0085R295K909j4602j3506
18406A51696J1159J6924K1629m120k3083k5224j1246J5183K1130P632l2421j2938
18394A36321K786J4723J1084K4247J4699J1834J0013N403q315k0533l1070j6988
18382A54204P919L4140K5051J6972j2271j0881K2915P930J3411R599K3291J0570
$$ plain form
18370 302850 264127 240692 242129 247150 251677 246181 271613 272730 308578 325900 313904 324247
18358 324247 324700 326566 305291 280576 258143 231389 229038 243993 281319 305480 294840 289060
18346 289060 284173 300804 305439 286295 278786 281694 279914 276952 271044 276905 290650 322560 331276
18333 331276 328231 346528 368361 364053 344930 331866 317134 336840 359512 352659 355917 381516
18321 381516 400231 437926 446098 451592 439149 434108 427843 420715 414372 407598 420867 439605 456711
18308 456711 472742 483373 502224 509955 510889 514116 515726 534873 552163 525478 520388 550955 595529
18295 595529 631785 657980 687080 712012 776386 874902 969477 1130252 1312975 1499316 1634641
18284 1634641 1700409 1714877 1650941 1595890 1593192 1653260 1769443 1939864 2156288 2438446 2761771
$$ packed form
18370C02850l8723k3435J437N021M527n496K5432J117L5848J7322j1996J0343
18358C24247M53J866k1275k4715k2433k6754k351J4955L7326K4161j0640n780
18346B89060m887J6631M635j9144p509K908j780k962n908N861J3745L1910Q716
18333C31276l045J8297K1833m308j9123j3064j4732J9706K2672o853L258K5599
18321C81516J8715L7695Q172N494j2443n041o265p128o343o774J3269J8738J7106
18308D56711J6031J0631J8851P731R34L227J610J9147J7290k6685n090L0567M4574
18295E95529L6256K6195K9100K4932O4374R8516R4575J60775J82723J86341J35325
18284A634641O5768J4468o3936n5051k698O0068J16183J70421K16424K82158L23325
$$ plain form
18273 2761771 3169248 3650786 4208125 4743456 5382446 6248809 7491081 9422499 12577344
18264 12577344 17691451 25573497 36537610 49152193 61137068 68187795 68072931 63015582
18256 63015582 52063531 41165516 32357596 26608048 23992744 23947794 26440871 31920670
18248 31920670 40764614 52164751 63788462 72698779 73917733 69823962 59492897 46512522
18240 46512522 35300717 26626395 20901713 17269004 14901091 13296723 12130271 11177107
18232 11177107 10316430 9457492 8525146 7612688 6743645 6020637 5387602 4835723 4348375
18223 4348375 3974617 3713082 3506687 3368681 3227743 3083786 2926621 2699981 2460169
18214 2460169 2227629 2032453 1845508 1684696 1547601 1419883 1353796 1303884 1256378 1191676
$$ packed form
18273B761771M07477M81538N57339N35331O38990Q66363J242272J931418L154845
18264A2577344N114107P882046J0964113J2614583J1984875P050727j14864n057349
18256F3015582j0952051j0898015q807920n749548k615304m4950K493077N479799
18248C1920670Q843944J1400137J1623711Q910317J218954m093771j0331065j2980375
18240D6512522j1211805q674322n724682l632709k367913j604368j166452r53164
18232A1177107q60677q58938r32346r12458q69043p23008o33035n51879m87348
18223D348375l73758k61535k06395j38006j40938j43957j57165k26640k39812
18214B460169k32540j95176j86945j60812j37095j27718o6087m9912m7506o4702
$$ plain form
18204 1191676 1110123 1025537 968339 956274 950057 937776 966011 973968 926512 851812 833616 784390
18192 784390 711901 625484 567577 533616 526119 510695 509441 489205 470215 439275 439673 422339
18180 422339 403787 422525 410155 404947 418680 420469 394580 396098 402536 381364 376963 383088 426095
18167 426095 441287 394585 375908 382019 389301 393092 408116 410413 395593 373861 365432 355905 359251
18154 359251 387845 400987 395415 400457 435238 470456 502188 535283 559464 557636 538425 518287
18142 518287 483701 472575 453888 457215 462688 464416 474001 473789 488981 505035 514644 516141 515620
18129 515620 516707 531492 605791 702715 762050 806683 895564 1004391 1132819 1282624 1470088
18118 1470088 1765337 2177925 2703083 3455375 4605193 6480963 9888597 16270258 26728479
$$ packed form
18204A191676q1553q4586n7198j2065o217j2281K8235P957m7456p4700j8196m9226
18192G84390p2489q6417n7907l3961p497j5424j254k0236j8990l0940L98j7334
18180D22339j8552J8738j2370n208J3733J789k5889J518O438k1172m401O125M3007
18167D26095J5192m6702j8677O111P282L791J5024K297j4820k1732q429r527L346
18154C59251K8594J3142n572N042L4781L5218L1732L3095K4181j828j9211k0138
18142E18287l4586j1126j8687L327N473J728R585k12J5192J6054R609J497n21
18129E15620J087J4785P4299R6924N9335M4633Q8881J08827J28428J49805J87464
18118A470088K95249M12588N25158P52292J149818J875770L407634O381661J0458221
$$ plain form
18109 26728479 39103102 44350629 31626837 19082677 12698210 9404707 7510771 6232621
18101 6232621 5381554 4820108 4430104 4176128 3947910 3637336 3258956 2923724 2621953
18092 2621953 2364199 2109753 1922422 1769241 1634352 1518100 1414196 1346441 1290860 1230322
18082 1230322 1188684 1159910 1119533 1053501 994441 946647 890854 862495 867272 841333 818348
18071 818348 787993 768525 766758 786742 796853 827661 816526 824269 857634 882917 872096 875588
18059 875588 897806 980204 1091914 1139243 1150302 1170783 1190322 1181264 1242563 1362550 1469552
18048 1469552 1536800 1561792 1600506 1647836 1756705 2043631 2599295 3583956 5088072 6762051
18038 6762051 7558617 6595443 5767468 6017876 7013360 7913424 7101175 5223401 3996716
$$ packed form
18109B6728479J2374623N247527j2723792j2544160o384467l293503j893936j278150
18101F232621q51067n61446l90004k53976k28218l10574l78380l35232l01771
18092B621953k57754k54446j87331j53181j34889j16252j03904o7755n5581o0538
18082A230322m1638k8774m0377o6032n9060m7794n5793k8359M777k5939k2985
18071H18348l0355j9468j767J9984J0111L0808j1135P743L3365K5283j0821L492
18059H75588K2218Q2398J11710M7329J1059K0481J9539r058O1299J19987J07002
18048A469552O7248K4992L8714M7330J08869K86926N55664R84661J504116J673979
18038F762051P96566r63174q27975K50408R95484R00064q12249j877774j226685
$$ plain form
18029 3996716 3335369 2946154 2708823 2572491 2464219 2333730 2215446 2159408 2122588 2107118
18019 2107118 2095254 2122165 2169227 2189679 2199919 2217740 2286756 2406070 2549386 2634907 2656881
18008 2656881 2692549 2807990 2973926 3175119 3466746 3784755 4157121 4639797 5258854 6058341
17998 6058341 7115090 8604422 10799988 14078729 18937249 25291815 31329047 33743466
17990 33743466 35749223 42888379 54745100 66614883 70416916 63058442 58448388 59758294
17982 59758294 60967675 62703749 70626670 81325210 84454990 76387815 70270972 71752495
17974 71752495 79554833 91559791 99880613 93951803 77605839 66887030 64178015 65390321
17966 65390321 67360198 70076130 70152506 70460998 76498842 83755542 86389685 78724129
$$ packed form
18029C996716o61347l89215k37331j36332j08272j30489j18284n6038l6820j5470
18019B107118j1864K6911M7062K0452J0240J7821O9016J19314J43316Q5521K1974
18008B656881L5668J15441J65936K01193K91627L18009L72366M82676O19057P99487
17998F058341J056749J489332K195566L278741M858520O354566O037232K414419
17990C3743466K005757P139156J1856721J1869783L802033p358474m610054J309906
17982E9758294J209381J736074P922921J0698540L129780q067175o116843J481523
17974G1752495P802338J2004958Q320822n928810j6345964j0718809k709015J212306
17966F5390321J969877K715932P6376L08492O037844P256700K634143p665556
$$ plain form
17958 78724129 67381294 63407758 69090512 86044971 113923979 143609275 151285997
17951 151285997 124504274 95468371 82845892 82244018 84912517 80122815 67579252
17944 67579252 52358719 40946294 33955374 29373375 25865291 22976451 20694544 18859519
17936 18859519 17302545 15947240 14671924 13489978 12411112 11427861 10684257 10329155
17928 10329155 10632758 11729034 13192134 13697786 11683769 9147704 7583571 6725839
17920 6725839 6297374 6267667 6730925 7723669 8886211 8954978 7261278 5614851 4583773
17911 4583773 3881257 3298771 2877779 2593704 2386435 2223803 2071072 1933554 1807866
17902 1807866 1694396 1551766 1412614 1296637 1208540 1125456 1052511 949689 890455 856560
$$ packed form
17958G8724129j1342835l973536N682754J6954459K7879008K9685296P676722
17951A51285997k6781723k9035903j2622479o01874K668499m789702j2543563
17944F7579252j5220533j1412425o990920m581999l508084k888840k281907j835025
17936A8859519j556974j355305j275316j181946j078866r83251p43604l55102
17928A0329155L03603J096276J463100N05652k014017k536065j564133q57732
17920F725839m28465k9707M63258R92744J162542O8767j693700j646427j031078
17911D583773p02516n82486m20992k84075k07269j62632j52731j37518j25688
17902A807866j13470j42630j39152j15977q8097q3084p2945j02822n9234l3895
$$ plain form
17892 856560 787484 721207 670370 630876 605342 576658 546694 535931 544983 532382 516884 479280
17880 479280 455958 443282 427519 407953 389715 381071 362544 338895 322749 300780 286928 279589
17868 279589 284001 273942 261332 244423 239280 247525 234111 237494 220354 220440 245430 213780 215720
17855 215720 225732 203247 199864 217155 218636 230574 243639 221973 202035 181659 178472 168371
17843 168371 154058 159291 154935 158590 178538 193502 194875 180246 151161 152151 157168 162434 171651
17830 171651 176924 193828 203621 205930 214381 224394 211532 188199 152001 125969 106758 109907
17818 109907 106325 99625 117693 141432 146116 150834 173591 177502 186170 168845 168317 164062 156893
17805 156893 158972 173480 177564 163689 125868 100652 111872 151675 162417 132322 116420 110910
$$ packed form
17892H56560o9076o6277n0837l9494k5534k8684k9964j0763R052j2601j5498l7604
17880D79280k3322j2676j5763j9566j8238q644j8527k3649j6146k1969j3852p339
17868B79589M412j0059j2610j6909n143Q245j3414L383j7140Q6K4990l1650J940
17855B15720J0012k2485l383J7291J481J1938J3065k1666j9938k0376l187j0101
17843A68371j4313N233m356L655J9948J4964J373j4629k9085R90N017N266R217
17830A71651N273J6904R793K309Q451J0013j2862k3333l6198k6032j9211L149
17818A09907l582o700J8068K3739M684M718K2757L911Q668j7325n28m255p169
17805A56893K079J4508M084j3875l7821k5216J1220L9803J0742l0095j5902n510
$$ plain form
17793 110910 84736 58760 57048 54317 19986 9067 17311 20986 40902 54342 39635 60144
17781 60144 69993 74663 58510 42659 65853 55074 26594 3800 -626 1579 11723 19691 -18049
17768 -18049 -43289 -27364 14626 24947 25040 10988 -19820 -23936 -20854 -12277 628 41240 37629
17755 37629 16363 -26483 -39400 -31764 -2254 3338 22329 46315 56426 50593 36409 6635
17743 6635 21916 20285 7886 29352 47692 19909 12940 24712 42654 35115 29380 30233 77555
17730 77555 63887 43351 29078 14990 9167 4878 39534 67887 44616 36003 45632 43726 49890
17717 49890 59978 50644 34587 39116 70807 85263 74060 49361 65560 85197 53902 18940
17705 18940 22276 17816 12915 1908 450 9419 18028 23787 42723 57087 29067 598 4338
$$ packed form
17793A10910k6174k5976j712k731l4331j0919Q244L675J9916J3440j4707K0509
17781F0144R849M670j6153j5851K3194j0779k8480k2794m426K205J0144P968l7740
17768a8049k5240J5925M1990J0321R3j4052l0808m116L082Q577J2905M0612l611
17755C7629k1266m2846j2917P636K9510N592J8991K3986J0111n833j4184k9774
17743F635J5281j631j2399K1466J8340k7783o969J1772J7942p539n735Q53M7322
17730G7555j3668k0536j4273j4088n823m289L4656K8353k3271q613R629j906O164
17717D9890J0088r334j6057M529L1691J4456j1203k4699J6199J9637l1295l4962
17705A8940L336m460m901j1007j458Q969Q609N759J8936J4364k8020k8469L740
$$ plain form
17692 4338 28888 39010 44597 50571 32077 12964 28570 52280 52150 32667 1400 9064 35690
17679 35690 14571 17759 51178 84175 98011 108379 166817 210218 272602 349028 398313 402528
17667 402528 376994 322141 267460 224479 185631 190594 196041 215969 227486 245787 297294 338625
17655 338625 379746 396611 386011 339675 285351 232916 185547 142035 127562 116713 114647 113411
17643 113411 112293 117918 145418 133413 149354 154672 149101 136543 108862 76498 64194 56542
17631 56542 44005 48272 68442 68692 78766 87574 92934 114317 147445 165314 182118 169141 119541
17618 119541 88273 63135 74154 78324 74688 102331 149898 205006 227488 192802 157068 144381
17606 144381 108544 96516 91513 86949 102931 100129 76777 63372 51309 62410 88711 100451
$$ packed form
17692D338K4550J0122N587N974j8494j9113J5606K3710j30j9483l1267P664K6626
17679C5690k1119L188L3419L2997J3836J0368N8438M3401O2384P6426M9285M215
17667D02528k5534n4853n4681m2981l8848M963N447J9928J1517J8301N1507M1331
17655C38625M1121J6865j0600m6336n4324n2435m7369m3512j4473j0849k066j236
17643A13411j118N625K7500j2005J5941N318n571j2558k7681l2364j2304p652
17631E6542j2537M267K0170K50J0074Q808N360K1383L3128J7869J6804j2977m9600
17618A19541l1268k5138J1019M170l636K7643M7567N5108K2482l4686l5734j2687
17606A44381l5837j2028n003m564J5982k802k3352j3405j2063J1101K6301J1740
$$ plain form
17594 100451 141946 166572 158151 104606 59270 50813 52979 57732 89579 121806 108165 64153
17582 64153 -91 -10882 45879 81050 100138 83502 37538 27355 19198 16993 36223 41973
17570 41973 48179 61882 70444 92716 120931 97929 66276 47244 51654 75336 79902 77309 88383
17557 88383 66028 51302 57248 81556 94635 102888 101448 71428 20183 -5173 -6762 5442
17545 5442 16799 34842 32591 55711 55240 36303 10843 -5258 -31 871 -9523 -5204 -181
17532 -181 34944 35354 31406 66175 78925 70064 70753 93438 140749 151104 153210 161562 169396 145998
17518 145998 77723 28916 13092 28383 34077 25444 8004 -2961 11063 29776 46880 64109
17506 64109 71487 40025 38672 54007 45724 34321 47167 48537 68628 86778 99870 137510
$$ packed form
17594A00451M1495K4626q421n3545m5336q457K166M753L1847L2227j3641m4012
17582F4153o4244j0791N6761L5171J9088j6636m5964j0183q157k205J9230N750
17570D1973O206J3703Q562K2272K8215k3002l1653j9032M410K3682M566k593J1074
17557H8383k2355j4726N946K4308J3079Q253j440l0020n1245k5356j589J2204
17545E442J1357J8043k251K3120m71j8937k5460j6101N227R02j0394M319N023
17532a81L5125M10l948L4769J2750q861O89K2685M7311J0355K106Q352P834k3398
17518A45998o8275m8807j5824J5291N694q633j7440j0965J4024J8713J7104J7229
17506F4109P378l1462j353J5335q283j1403J2846J370K0091J8150J3092L7640
$$ plain form
17494 137510 164882 199640 220540 235181 228285 213281 204917 214185 215175 217479 237210 249354 285682
17481 285682 307083 316577 363577 442650 509173 559407 597051 620784 653533 659930 622484 575603
17469 575603 509613 493477 558317 605980 586169 564931 549714 554662 551661 559012 627987 707396
17457 707396 760051 670911 500755 371227 300417 277937 271257 272306 264009 265459 334546 403850
17445 403850 500792 637790 795819 834135 672467 456198 325713 281805 252121 214568
17435 214568 177515 172996 182186 206760 247264 262658 238372 214356 204674 228629 274235 311180
17423 311180 346437 338579 320246 287028 271644 274051 279027 265231 276022 291015 262734 212119
17411 212119 208187 202997 214056 218539 224294 202610 144577 89249 94143 113158 126531 141023
$$ packed form
17494A37510K7372L4758K0900J4641o896j5004q364R268R90K304J9731J2144L6328
17481B85682K1401R494M7000P9073O6523N0234L7644K3733L2749O397l7446m6881
17469E75603o5990j6136O4840M7663j9811k1238j5217M948l001P351O8975P9409
17457G07396N2655q9140j70156j29528p0810k2480o680J049q297J450O9087O9304
17445D03850R6942J36998J58029L8316j61668k16269j30485m3908k9684l7553
17435B14568l7053m519R190K4574M0504J5394k4286k4016r682K3955M5606L6945
17423C11180L5257p858j8333l3218j5384K407M976j3796J0791J4993k8281n0615
17411B12119l932n190J1059M483N755k1684n8033n5328M894J9015J3373J4492
$$ plain form
17399 141023 158139 155468 142326 163594 228088 281246 291622 252802 204291 222640 257716 304410
17387 304410 370260 391933 396199 415847 423393 372293 313005 292996 285593 311349 342920 327645
17375 327645 257923 197488 153891 129178 125631 129537 120455 106327 99549 80648 67153 97728
17363 97728 113958 109496 83879 86344 94250 94224 99671 88014 79473 88902 79361 71650 116094 130348
17349 130348 130630 172081 217148 244449 263162 249296 211686 216368 237629 280607 319069 360002
17337 360002 371821 389894 376165 327742 274731 253936 282844 319919 338887 318740 264691
17326 264691 223387 195422 154609 137506 150530 160687 124388 97914 108740 105660 76454 88009
17314 88009 90291 98916 88468 74774 74150 92179 112824 89199 73703 66430 70240 86521 100994
$$ packed form
17399A41023J7116k671j3142K1268O4494N3158J0376l8820m8511J8349L5076M6694
17387C04410O5850K1673M266J9648P546n1100n9288k0009p403K5756L1571j5275
17375C27645o9722o0435m3597k4713l547L906r082j4128o778j8901j3495L0575
17363I7728J6230m462k5617K465P906k6N447j1657q541R429r541p711M4444J4254
17349A30348K82M1451M5067K7301J8713j3866l7610M682K1261M2978L8462M0933
17337C60002J1819J8073j3729m8423n3011k0795K8908L7075J8968k0147n4049
17326B64691m1304k7965m0813j7103J3024J0157l6299k6474J0826l080k9206J1555
17314H8009K282Q625j0448j3694o24J8029K0645k3625j5496p273L810J6281J4473
$$ plain form
17301 100994 83186 103223 115619 106610 101701 85770 91263 93940 98371 106159 106004 92124 107701
17288 107701 114359 113321 115686 131211 113820 113084 109679 147382 142687 152245 195055 242929 248199
17275 248199 223604 221686 250947 276419 301173 315475 293985 250553 228323 243538 246776 275657
17263 275657 375898 483608 498866 421666 350355 350340 402821 454711 483898 458468 377240 330272
17251 330272 278584 262536 274219 243520 226493 262711 302182 322454 342365 396393 467454
17240 467454 533875 565657 500792 414386 377687 356026 327708 348084 429698 509992 597518
17229 597518 674342 735484 794126 855241 810890 760456 765654 784732 825381 841340 813121 823535
17217 823535 897977 971194 979743 960915 871434 686475 548122 474286 438374 430133 425868 441119
$$ packed form
17301A00994j7808K0037J2396r009m909j5931N493K677M431P788j55j3880J5577
17288A07701O658j038K365J5525j7391p36l405L7703m695R558M2810M7874N270
17275B48199k4595j918K9261K5472K4754J4302k1490m3432k2230J5215L238K8881
17263B75657J00241J07710J5258p7200p1311j5N2481N1890K9187k5430q1228m6968
17251C30272n1688j6048J1683l0699j7027L6218L9471K0272J9911N4028P1061
17240D67454O6421L1782o4865q6406l6699k1661k8318K0376Q1614Q0294Q7526
17229E97518P6824O1142N8642O1115m4351n0434N198J9078M0649J5959k8219J0414
17217H23535P4442P3217Q549j8828q9481j84959j38353p3836l5912q241m265J5251
$$ plain form
17205 441119 421872 388963 383429 371995 355727 364036 390108 385829 361887 361937 341452 314259 319109
17192 319109 345766 342879 369228 416772 471179 485293 486410 508160 575299 665403 801519 972219
17180 972219 1184853 1548979 2153506 2879978 3315481 2986591 2312681 1866134 1619819 1499429
17170 1499429 1490674 1532506 1602399 1709248 1969095 2455613 3153569 3873906 4092611 3657720
17160 3657720 3240129 2975247 2689262 2481006 2461304 2596355 2841707 3259685 3889779 4907430
17150 4907430 6554464 9277118 13638790 19558181 25021171 25232634 19297447 13647182
17142 13647182 10288319 8352136 7233950 6667530 6558569 6761965 7285686 8268036 9931426
17133 9931426 12659614 17074596 23236606 29550635 31960521 30065443 29175756 28879905
$$ packed form
17205D41119j9247l2909n534j1434j6268Q309K6072m279k3942N0k0485k7193M850
17192C19109K6657k887K6349M7544N4407J4114J117K1750O7139R0104J36116J70700
17180I72219K12634L64126O04527P26472M35503l28890o73910m46547k46315j20390
17170A499429q755M1832O9893J06849K59847M86518O97956P20337K18705m34891
17160C657720m17591k64882k85985k08256j9702J35051K45352M17978O30094J017651
17150D907430J647034K722654M361672N919391N462990K11463n935187n650265
17142A3647182l358863j936183j118186n66420j08961K03396N23721R82350J663390
17133I931426K728188M414982O162010O314029K409886j895078q89687k95851
$$ plain form
17125 28879905 25299177 19601583 15396748 12977112 11727816 11322634 11696877 12967496
17117 12967496 15329965 18551746 21270984 21029119 18838879 18599002 21146681 24845319
17109 24845319 25748673 21107360 15940386 13096362 12037754 12209892 13353715 15097351
17101 15097351 16331021 15790891 13711251 11775949 10798000 10843426 12095955 15043418 19712726
17092 19712726 24691108 26154231 22778891 20408591 21016124 22248225 20460384 15880566
17084 15880566 12149496 10020330 8946014 8500884 8434148 8693750 9530758 11413413 14842135
17075 14842135 19461545 23272294 22056030 16301874 11496286 8603923 6800807 5610022
17067 5610022 4820263 4317709 4000939 3823429 3751469 3820170 4023357 4314259 4370261 3839192
$$ packed form
17125B8879905l580728n697594m204835k419636j249296m05182L74243J270619
17117A2967496K362469L221781K719238k41865k190240k39877K547679L698638
17109B4845319R03354m641313n166974k844024j058608J72138J143823J743636
17101A5097351J233670n40130k079640j935302r77949M5426J252529K947463M669308
17092A9712726M978382J463123l375340k370300O07533J232101j787841m579818
17084A5880566l731070k129166j074316m45130o6736K59602Q37008J882655L428722
17075A4842135M619410L810749j216264n754156m805588k892363j803116j190785
17067E610022p89759n02554l16770j77510p1960O8701K03187K90902N6002n31069
$$ plain form
17057 3839192 3123156 2577366 2204014 1936343 1744598 1612921 1515275 1469858 1446794 1483299
17047 1483299 1620796 1894507 2270589 2571087 2383096 1839545 1412690 1115118 946417
17038 946417 829434 750763 681399 653249 658677 665195 672974 646189 597290 549376 489484 451212
17026 451212 410496 408629 387131 340299 335837 357129 330969 353504 341543 316993 283087 259143
17014 259143 245983 234009 258356 247539 218913 241925 246112 242329 254191 269429 246154 203978
17002 203978 223596 249294 245425 231086 224035 224446 235375 243538 253602 256641 245474 229355 238605
16989 238605 264926 270768 253029 241020 237374 233593 252664 283456 277501 251716 232729 206190
16977 206190 219943 218847 227348 242892 241442 232854 233145 251891 258809 273070 252128 246714 250959
$$ packed form
17057C839192p16036n45790l73352k67671j91745j31677r7646m5417k3064L6505
17047A483299J37497K73711L76082L00498j87991n43551m26855k97572j68701
17038I46417j16983p8671o9364k8150N428O518P779k6785m8899m7914n9892l8272
17026D51212m0716j867k1498m6832m462K1292k6160K2535j1961k4550l3906k3944
17014B59143j3160j1974K4347j0817k8626K3012M187l783J1862J5238k3275m2176
17002B03978J9618K5698l869j4339p051M11J0929Q163J0064L039j1167j6119R250
16989B38605K6321N842j7739j2009l646l781J9071L0792n955k5785j8987k6539
16977B06190J3753j096Q501J5544j450q588K91J8746O918J4261k0942n414M245
$$ plain form
16964 250959 247663 256007 254010 273397 332254 373585 361570 346387 350666 366657 379274 386496
16952 386496 409630 415930 428798 432994 452542 448228 479154 503899 533791 575524 606439 656996
16940 656996 723835 849934 988629 1134900 1206296 1170211 1154847 1225908 1355250 1476834
16930 1476834 1512465 1513741 1542222 1630633 1774260 1955152 2172707 2437930 2746993 3042034
16920 3042034 3373569 3766924 4138143 4573556 5164016 5911610 7005877 8686377 11128753
16911 11128753 14888247 21002649 31416042 48413759 71083260 91028857 89644680
16904 89644680 66310682 45375859 33103901 26403346 22850648 21259726 21269440 22952494
16896 22952494 26839658 34251566 47166280 66378721 87356039 95702558 77879981
$$ packed form
16964B50959l296Q344j997J9387N8857M1331j2015j5183M279J5991J2617P222
16952C86496K3134O300J2868M196J9548m314L0926K4745K9892M1733L0915N0557
16940F56996O6839J26099J38695J46271P1396l6085j5364P1061J29342J21584
16930A476834L5631J276K8481Q8411J43627J80892K17555K65223L09063K95041
16920C042034L31535L93355L71219M35413N90460P47594J094267J680500K442376
16911A1128753L759494O114402J0413393J6997717K2669501J9945597j384177
16904H9644680k3333998k0934823j2271958o700555l552698j590922R714J683054
16896B2952494L887164P411908J2914714J9212441K0977318Q346519j7822577
$$ plain form
16889 77879981 53199045 36827742 27284307 21468031 17640165 15008093 13185820 11961359
16881 11961359 11095719 10387564 9635530 8809739 8014410 7243914 6457267 5642562 4947900
16872 4947900 4414703 3961920 3541614 3156934 2834179 2591632 2434801 2328354 2242849 2161162
16862 2161162 2003003 1758564 1520727 1351751 1231192 1136027 1036562 938826 856377 784394
16852 784394 713756 654569 593156 549240 551976 519238 469672 448253 412287 357806 342884 317241
16840 317241 296630 262129 238110 221421 193041 176879 153071 126302 114855 125820 117141 119429
16828 119429 114005 124249 139352 157795 140157 103035 86447 106193 87466 67796 50609 42320
16816 42320 52607 79392 78094 49067 38206 24023 27949 50798 54325 55202 41302 50855 50610
$$ packed form
16889G7879981k4680936j6371303r543435n816276l827866k632072j822273j224461
16881A1961359q65640p08155p52034q25791p95329p70496p86647q14705o94662
16872D947900n33197m52783m20306l84680l22755k42547j56831j06447q5505q1687
16862B161162j58159k44439k37837j68976j20559r5165r9465r7736q2449p1983
16852G84394p0638n9187o1413m3916K736l2738m9566k1419l5966n4481j4922k5643
16840C17241k0611l4501k4019j6689k8380j6162k3808k6769j1447J0965q679K288
16828A19429n424J0244J5103J8443j7638l7122j6588J9746j8727j9670j7187q289
16816D2320J0287K6785j298k9027j0861j4183L926K2849L527Q77j3900R553k45
$$ plain form
16803 50610 46579 37904 20805 35997 37498 4279 -36554 -71343 -71479 -39188 -15404 -21006 -11563
16790 -11563 -27312 -38812 -20248 -5457 10247 9176 14599 16820 36140 58028 32108 26227
16778 26227 6705 -15333 -17965 -32448 -18480 14939 16777 21894 23413 26568 34953 55004 59517
16765 59517 42835 31782 18330 -25408 -49456 -42313 -14548 -4467 19800 16353 8586 19922
16753 19922 31679 26684 -2661 -2237 5648 936 -2575 19828 40308 32026 3817 -4463 -3133
16740 -3133 8251 5061 326 -3908 12898 -2789 -28337 -4710 1021 3395 -28985 -34501 -49868
16727 -49868 -36736 -30776 -38158 -51351 -55598 -53152 -50049 -41287 -52440 -55513 -55218 -79666 -107051
16714 -107051 -119552 -117595 -83514 -88803 -79051 -60529 -66603 -81784 -94433 -74423 -34558 -31815
$$ packed form
16803E0610m031q675j7099J5192J501l3219m0833l4789j36L2291K3784n602R443
16790a1563j5749j1500J8564J4791J5704j071N423K221J9320K1888k5920n881
16778B6227j9522k2038k632j4483J3968L3419J838N117J519L155Q385K0051M513
16765E9517j6682j1053j3452m3738k4048P143K7765J0081K4267l447p767J1336
16753A9922J1757m995k9345M24P885m712l511K2403K0480q282k8209q280J330
16740c133J1384l190m735m234J6806j5687k5548K3627N731K374l2380n516j5367
16727d9868J3132N960p382j3193m247K446L103Q762j1153l073K95k4448k7385
16714a07051j2501J957L4081n289R752J8522o074j5181j2649K0010L9865K743
$$ plain form
16702 -31815 -49410 -64491 -76161 -65881 -48315 -43472 -38207 -22275 -37822 -58193 -58373 -69322
16690 -69322 -59424 -32925 -21226 -33883 -46249 -31284 -38687 -62828 -63989 -55588 -35959 -22468
16678 -22468 -17327 -377 12474 -1300 -9054 -21566 -38067 -31256 -30705 -46119 -36527 -31529 -32889
16665 -32889 -53870 -47976 -41327 -47999 -42402 -38101 -33378 -46236 -56422 -65962 -47564 -59769 -38898
16652 -38898 -22023 -32697 283 31865 69772 83706 54814 7242 -6080 -6649 -13637 -31203
16640 -31203 -43281 -19046 -12301 -25975 -26006 2770 45183 92547 99406 88510 64703 66746 61162
16627 61162 70247 35904 -4736 5571 32563 48415 49995 66500 57605 6644 -10416 -14770
16615 -14770 -17211 -21677 -37346 -35796 -15611 16469 34261 41954 45462 58177 77446 103051 79551
$$ packed form
16702c1815j7595j5081j1670J0280J7566M843N265J5932j5547k0371j80j0949
16690f9322R898K6499J1699j2657j2366J4965p403k4141j161Q401J9629J3491
16678b2468N141J6950J2851j3774p754j2512j6501O811N51j5414R592M998j360
16665c2889k0981N894O649o672N597M301M723j2858j0186r540J8398j2205K0871
16652c8898J6875j0674L2980L1582L7907J3934k8892m7572j3322n69o988j7566
16640c1203j2078K4235O745j3674l1K8776M2413M7364O859j0896k3807K043n584
16627F1162R085l4343m0640J0307K6992J5852J580J6505q895n0961j7060m354
16615a4770k441m466j5669J550K0185L2080J7792P693L508J2715J9269K5605k3500
$$ plain form
16602 79551 6675 -3940 20767 34987 37677 26929 18749 3543 4752 31116 55758 94961
16590 94961 135376 148780 153513 140487 123725 80851 29173 9084 13611 15503 42505 49788
16578 49788 55897 55105 61558 86285 93047 94380 77107 55488 39005 25514 -14277 -19659 -16118
16565 -16118 -1075 -222 4086 10535 -9388 -19405 -27864 -20911 -15388 -22052 -37244 744 30254
16552 30254 31462 57138 102837 102891 151068 264481 425565 635208 757149 678199 490513
16541 490513 311912 222568 214601 234156 258542 300192 378003 521172 727230 860604 740713
16530 740713 533471 359560 239603 174451 137739 121887 98398 69279 67332 74339 63787
16519 63787 50113 40996 30329 12255 7389 -4545 -9915 -4536 10065 17638 -27669 -70260 -47996
$$ packed form
16602G9551p2876j0615K4707J4220K690j0748q180j5206J209K6364K4642L9203
16590I4961M0415J3404M733j3026j6762m2874n1678k0089M527J892K7002P283
16578D9788O109p92O453K4727O762J333j7273k1619j6483j3491l9791n382L541
16565a6118J5043Q53M308O449j9923j0017q459O953N523o664j5192L7988K9510
16552C0254J208K5676M5699N4M8177J13413J61084K09643J21941p8950j87686
16541D90513j78601q9344p967J9555K4386M1650P7811J43169K06058J33374j19891
16530G40713k07242j73911j19957o5152l6712j5852k3489k9119j947P007j0552
16519F3787j3674r117j0667j8074m866j1934n370N379J4601P573m5307m2591K2264
$$ plain form
16506 -47996 -36982 -30091 -24436 -59800 -76754 -34604 -30222 -30141 -11167 -14051 -30245 -35789 -38536
16493 -38536 -24772 -22733 -24385 -17782 -25921 -35703 -40166 -40861 -42416 -45914 -46431 -37565 -31159 -63484
16479 -63484 -49647 -59515 -67011 -48258 -46660 -63903 -67344 -54145 -64901 -81654 -75018 -66739 -62546
16466 -62546 -39480 -37351 -52349 -42991 -36274 -66444 -74393 -55756 -48817 -56210 -76687 -88771 -74657
16453 -74657 -77593 -82710 -82528 -53377 -37078 -25919 854 -9389 -34390 -36472 -25723 -14181 -20132
16440 -20132 -17114 -19956 -21687 -37074 -55145 -60156 -55509 -23460 -7912 -6218 -15620 -26395 -16295
16427 -16295 -17045 -35635 -43947 -47001 -37607 -20674 -20492 -22740 -23914 -37814 -35540 -54336 -47052 -36031
16413 -36031 -29558 -42387 -41566 -23188 -27546 -26491 -6116 13160 14334 -5128 4380 16401 -4080
$$ packed form
16506d7996J1014O891N655l5364j6954M2150M382Q1J8974k884j6194n544k747
16493c8536J3764K039j652O603q139r782m463o95j555l498n17Q866O406l2325
16479f3484J3837r868p496J8753J598j7243l441J3199j0756j6753O636Q279M193
16466f2546K3066K129j4998R358O717l0170p949J8637O939p393k0477j2084J4114
16453g4657k936n117J82K9151J6299J1159K6773j0243k5001k082J0749J1542n951
16440b0132L018k842j731j5387j8071n011M647L2049J5548J694r402j0775J0100
16427a6295p50j8590q312l054R394J6933J82k248j174j3900K274j8796P284J1021
16413c6031O473j2829Q21J8378m358J055K0375J9276J174j9462R508J2021k0481
$$ plain form
16400 -4080 -19126 -20579 -42305 -69811 -60332 -56430 -44157 -40377 -46452 -57660 -44098 -39364 -48567
16387 -48567 -51514 -23154 -28559 -52413 -61465 -68919 -67281 -68419 -70852 -69674 -51553 -49690 -24182
16374 -24182 3370 -9386 -45535 -58859 -45458 -51627 -47767 -16678 -16632 -35708 -65803 -71880 -62075
16361 -62075 -57857 -36058 -29934 -15714 9492 -13990 -23985 -5378 39895 98238 154874 254340
16349 254340 352137 446362 416826 292564 182112 130138 100643 83302 90158 78472 83586
16338 83586 120137 168402 226154 308434 433604 452819 353314 240005 160599 121358 94231
16327 94231 56571 47155 36182 20163 13505 11698 10932 -4301 -32931 -36740 -14543 2662 -6761
16314 -6761 -20880 -6283 2761 -17820 -22287 -34919 -28780 -16726 -12887 3640 8514 -533 3448
$$ packed form
16400d080j5046j453k1726k7506R479L902J2273L780o075j1208J3562M734r203
16387d8567k947K8360n405k3854r052p454J638j138k433J178J8121J863K5508
16374b4182K7552j2756l6149j3324J3401o169L860L1089M6j9076l0095o077R805
16361f2075M218K1799O124J4220K5206k3482r995J8607M5273N8343N6636R9466
16349B54340R7797R4225k9536j24262j10452n1974k9495j7341O856j1686N114
16338H3586L6551M8265N7752Q2280J25170J9215r9505j13309p9406l9241k7127
16327I4231l7660r416j0973j6019o658j807p66j5233k8630l809K2197J7205r423
16314f761j4119J4597R044k0581m467j2632O139J2054L839J6527M874r047L981
$$ plain form
16301 3448 7209 15702 -6820 -32075 -31671 -42585 -65423 -81303 -76866 -45844 -28992 -28638 -35661
16288 -35661 -18702 -14131 -50396 -39744 -31010 -22608 -19508 -16786 -24843 -50399 -82045 -81689 -69288
16275 -69288 -66622 -63463 -56204 -35807 -32515 -30456 -24521 -32984 -18104 -20022 -34889 -57691 -55661
16262 -55661 -38378 -21211 -53316 -39485 -30099 -28080 -33262 -54106 -61561 -46661 -38304 -24068 -13835
16249 -13835 -34918 -54159 -42437 -39151 -31434 -31590 -49867 -56847 -69711 -63160 -45297 -16795 -9539
16236 -9539 -15479 -22092 -9499 -27996 -39611 -52373 -58736 -48899 -44135 -39764 -39254 -59028 -48330
16223 -48330 -32826 -16021 -1989 -21715 -55964 -45754 -29680 -29399 -28878 -15036 -24528 -53893 -76726
16210 -76726 -83606 -70501 -56634 -46665 -30053 -21430 -40385 -40241 -41785 -43616 -44055 -50838 -53523 -49837
$$ packed form
16301C448L761Q493k2522k5255M04j0914k2838j5880M437L1022J6852L54p023
16288c5661J6959M571l6265J0652Q734Q402L100K722q057k5556l1646L56J2401
16275f9288K666L159P259K0397L292K059N935q463J4880j918j4867k2802K030
16262e5661J7283J7167l2105J3831R386K019n182k0844p455J4900Q357J4236J0233
16249a3835k1083j9241J1722L286P717j56j8277o980j2864O551J7863K8502P256
16236i539n940o613J2593j8497j1615j2762o363R837M764M371N10j9774J0698
16223d8330J5504J6805J4032j9726l4249J0210J6074K81N21J3842r492k9365k2833
16210g6726o880J3105J3867R969J6612Q623j8955J44j544j831m39o783k685L686
$$ plain form
16196 -49837 -46510 -30430 -12335 -38672 -32926 -28203 -20233 -20508 -22137 -21512 -20876 -19139 -15602 -9583
16182 -9583 -16386 -36413 -22131 -12115 -28031 -32653 -31013 -45694 -64937 -60470 -50813 -46129 -55678
16169 -55678 -43224 -23273 -12127 -9239 -39430 -56267 -34733 -41184 -67127 -85498 -83566 -52240
16157 -52240 -33407 -38680 -32228 -48311 -62987 -67672 -53474 -45814 -30255 -33325 -22891 -2765 -22192
16144 -22192 -40148 -21643 -18081 -14962 -47968 -88049 -76929 -53986 -24714 -32285 -32209 -11950 7671
16131 7671 -14136 -36201 -41915 -53303 -52726 -60894 -68329 -55534 -82514 -67498 -31786 -11673 -1674
16118 -1674 334 -6916 -7724 -7382 -10876 -23007 -44494 -62078 -74407 -97353 -96120 -83328 -72731
16105 -72731 -77613 -65963 -53460 -55668 -67758 -34786 -17521 -39908 -35007 -20880 -32171 -14917
$$ packed form
16196d9837L327J6080J8095k6337N746M723P970k75j629O25O36J737L537O019
16182i583o803k0027J4282J0016j5916m622J640j4681j9243M467R657M684r549
16169e5678J2454J9951J1146K888l0191j6837K1534o451k5943j8371J932L1326
16157e2240J8833n273O452j6083j4676m685J4198P660J5559l070J0434K0126j9427
16144b2192j7956J8505L562L119l3006m0081J1120K2943K9272p571P6K0259J9621
16131G671k1807k2065n714j1388N77q168p435J2795k6980J5016L5712K0113R999
16118a674K008p250q08L42l494j2131k1487j7584j2329k2946J233J2792J0597
16105g2731m882J1650J2503k208j2090L2972J7265k2387M901J4127j1291J7254
$$ plain form
16093 -14917 -32863 -52695 -38372 -33427 -8122 6201 -8681 -6058 3029 12865 12716 7661 10308
16080 10308 -14192 -37878 -34622 -27617 -35006 -17608 -3664 -4954 -28984 -58628 -66365 -62898 -50450
16067 -50450 -41219 -34289 -45063 -28657 -4686 9734 -5331 -13001 -27403 -26220 -24797 -30364 -20912
16054 -20912 -10395 -24222 -32373 -54196 -69002 -53270 -36539 -7080 -3890 -45728 -48356 -50550
16042 -50550 -70960 -86295 -91096 -64660 -45061 -37116 -21740 -16218 -9389 -4135 -1964 -14773 -19739
16029 -19739 -13247 -50506 -48175 -31630 -19097 -26599 -19101 -199 -4325 -5038 -10341 -33243 -42146
16016 -42146 -33145 -20669 -18007 -19748 -55464 -56449 -14707 -14074 -22530 -44011 -44602 -25638 -5353 -14184
16002 -14184 -28318 -50486 -46433 -43613 -30870 -25635 -32323 -36799 -24658 -27201 -28739 -25744 -19915
$$ packed form
16093a4917j7946j9832J4323M945K5305J4323j4882K623R087R836j49n055K647
16080A0308k4500k3686L256P005p389J7398J3944j290k4030k9644p737L467J2448
16067e0450R231O930j0774J6406K3971J4420j5065p670j4402J183J423n567R452
16054b0912J0517j3827q151k1823j4806J5732J6731K9459L190m1838k628k194
16042e0550k0410j5335m801K6436J9599P945J5376N522O829N254K171j2809m966
16029a9739O492l7259K331J6545J2533p502P498J8902m126p13n303k2902q903
16016d2146R001J2476K662j741l5716r85M1742O33q456k1481n91J8964K0285q831
16002a4184j4134k2168M053K820J2743N235o688m476J2141k543j538K995N829
$$ plain form
15989 -19915 -11323 -17327 -29083 -62766 -69803 -49218 -31136 -41472 -32446 -40746 -43416 -22111 -20950
15976 -20950 -27776 -8255 -13049 -25826 -18065 -18161 -22943 -35869 -57764 -55500 -47419 -43201 -10433 -19261
15962 -19261 -5906 7966 15516 20506 10777 -31682 -18414 13233 18345 9756 14525 21145 13892
15949 13892 26715 11866 -2319 -500 -16073 -53406 -75906 -59299 -38987 -27613 -34918 -56581
15937 -56581 -44779 -20227 -10462 -22577 -38470 -39656 -60996 -84663 -82873 -85551 -63318 -32640
15925 -32640 -27918 -38404 -32652 -29193 -44208 -48189 -70675 -73109 -66042 -24793 -10836 -9018 -8805
15912 -8805 -32532 -31748 -46624 -42594 -13278 -4349 -612 -5665 -5558 -2946 -473 16759 7632 -18963
15898 -18963 -14446 -235 10603 -1808 -24748 -37359 -40340 -30090 9027 13768 -3152 551
$$ packed form
15989a9915Q592o004j1756l3683p037K0585J8082j0336R026q300k670K1305J161
15976b0950o826J9521m794j2777P761r6m782j2926k1895K264Q081M218L2768q828
15962a9261J3355J3872P550M990r729m2459J3268L1647N112q589M769O620p253
15949A3892J2823j4849j4185J819j5573l7333k2500J6607K0312J1374p305k1663
15937e6581J1802K4552R765j2115j5893j186k1340k3667J790k678K2233L0678
15925c2640M722j0486N752L459j5015l981k2486k434P067M1249J3957J818K13
15912h805k3727P84j4876M030K9316Q929L737n053J07K612K473J7232r127k6595
15898a8963M517J4211J0838j2411k2940j2611k981J0250L9117M741j6920L703
$$ plain form
15886 551 -17296 -27106 -3230 1421 -23554 -29924 -38986 -35932 -20498 -16750 -13912 -18235 -39845 -42281
15872 -42281 -47576 -41665 -48832 -63210 -48092 -47780 -45249 -25572 -52749 -60599 -13461 10484 2494
15859 2494 -7083 -10670 -2538 -7443 -23214 -12331 -21128 -22835 -6944 -1155 6958 5812 -9589 -29363
15845 -29363 -18191 -13039 -17329 -3642 -12223 -28300 -30079 -37269 -35956 -19143 -11675 -26369 -50719
15832 -50719 -39143 -24846 -26508 -26360 -29608 -21911 -35312 -19036 -33623 -33545 -19231 -15939 -8782 1438
15818 1438 15554 29520 12411 10356 13553 9173 7188 -9847 -11393 -2922 9602 -16276 -39032
15805 -39032 -40825 -54658 -57701 -46934 -31261 -14130 -3944 -8762 -5247 -17849 -26359 -18939 -7123
15792 -7123 -23011 -51199 -60652 -47156 2726 -10824 -8015 -10702 -12207 -17296 -12868 304 -2498
$$ packed form
15886E51j7847r810K3876M651k4975o370r062L054J5434L748K838m323k1610k436
15872d2281n295N911p167j4378J5118L12K531J9677k7177p850M7138K3945p990
15859B494r577l587Q132m905j5771J0883q797j707J5891N789Q113j146j5401j9774
15845b9363J1172N152m290J3687q581j6077j779p190J313J6813P468j4694k4350
15832e0719J1576J4297j662J48l248P697j3401J6276j4587P8J4314L292P157J0220
15818A438J4116J3966j7109k055L197m380j985j7035j546Q471J2524k5878k2756
15805c9032j793j3833l043J0767J5673J7131J0186m818L515j2602q510P420J1816
15792g123j5888k8188r453J3496M9882j3550K809k687j505n089M428J3172k802
$$ plain form
15779 -2498 -19986 -18551 -36179 -40224 -11594 -22678 -18519 -40985 -38938 -23095 -33837 -32606 -21399
15766 -21399 -30783 -41126 -39306 -4026 4691 -20753 -13141 -4057 672 3346 -21716 -7870 11385
15753 11385 1631 -18175 -32674 -39840 -36093 -3937 -15088 -44876 -20199 -9383 65 4207 -21427
15740 -21427 -46458 -34958 -29238 -39099 -6595 -18660 -10264 1658 -20487 -46722 -49398 -37890
15728 -37890 -9299 5055 222 -18323 -16170 -12317 -17576 -16352 -3921 -10260 -404 -21315 -23559
15715 -23559 -6489 7468 -25362 -65060 -53473 -17173 -19632 -11342 10714 5109 7502 -21345
15703 -21345 -47172 -24610 7165 5 -27355 -53197 -43255 -35845 -22176 -43222 -47853 -36560
15691 -36560 -40048 -45351 -44836 -22544 -7810 8033 30632 21562 -11433 -25408 -279 13045 -6257
$$ packed form
15779b498j7488J435j7628m045K8630j1084M159k2466K047J5843j0742J231J1207
15766b1399r384j0343J820L5280Q717k5444P612R084M729K674k5062J3846J9255
15753A1385r754j9806j4499p166L747L2156j1151k9788K4677J0816R448M142k5634
15740b1427k5031J1500N720r861L2504j2065Q396J1922k2145k6235k676J1508
15728c7890K8591J4354m833j8545K153L853n259J224J2431o339R856k0911k244
15715b3559J7070J3957l2830l9698J1587L6300k459Q290K2056n605K393k8847
15703b1345k5827K2562L1775p160k7360k5842R942P410J3669k1046m631J1293
15691c6560l488n303N15K2292J4734J5843K2599r070l2995j3975K5129J3324j9302
$$ plain form
15678 -6257 -38489 -30480 -34938 -24608 -39936 -32556 -14872 -3715 13322 3711 20316 19451 -4137
15665 -4137 -1095 3212 -9377 -17783 -36153 -23209 26934 5772 -24315 -12630 -14597 -24670 -15392
15652 -15392 -17530 -17932 -9170 -8980 -43895 -41890 -25743 -31918 -39548 -35906 -29832 -50985 -39558 -32209
15638 -32209 -61367 -64805 -59652 -48039 -34283 -12234 418 2223 10024 16149 8094 775 -10589
15625 -10589 -9941 3108 -8775 609 -26380 -22513 3029 3369 -8807 -23657 -41131 -32534 -20106
15612 -20106 -24139 -13275 -17281 -30434 -45847 -31623 -31947 -27276 -23285 -36876 -33713 -12594 17974
15599 17974 11311 -7752 2784 10223 3189 -2820 -94 13848 4067 -32173 -49290 -58129 -70102
15586 -70102 -88260 -54779 -39851 -45945 -49651 -53741 -31173 -12580 -18149 -40608 -51965 -29421
$$ packed form
15678f257l2232Q009m458J0330j5328P380J7684J1157J7037r611J6605q65k3588
15665d137L042M307j2589q406j8370J2944N0143k1162l0087J1685j967j0073R278
15652a5392k138m02Q762J90l4915K005J6147o175p630L642O074k1153J1427P349
15638c2209k9158l438N153J1613J3756K2049J2652J805P801O125q055p319j1364
15625a0589O48J3049j1883R384k6989L867K5542L40j2176j4850j7474Q597J2428
15612b0106m033J0864m006j3153j5413J4224l24M671L991j3591L163K1119L0568
15599A7974o663j9063J0536P439p034o009K726J3942r781l6240j7117q839j1973
15586g0102j8158L3481J4928o094l706m090K2568J8593n569k2459j1357K2544
$$ plain form
15574 -29421 -18132 -33389 -13184 2242 16095 19430 10600 2520 2515 1169 -19653 -25233 -17174 -35380
15560 -35380 -41935 -23665 -3717 7870 -8085 -8990 4326 3145 249 6304 2978 9305 21299
15547 21299 14119 14568 16445 -22260 -37855 -39506 -54337 -64621 -33362 -34023 -29006 -21389 -4528
15534 -4528 3671 2815 -13007 -29138 -9012 -3318 -16153 -7646 557 -1441 13056 433 4043
15521 4043 -1814 -7406 4299 -315 -23554 -24125 -21526 -13216 -28432 -36318 -42945 -30707 -17069 -12655
15507 -12655 -16100 -14881 -17503 -24558 -51672 -57963 -9283 -13138 -22408 -21957 7440 9230 -4985 -30948
15493 -30948 -35101 -49921 -33098 -34023 -38106 -49625 -48091 -47164 -51171 -32045 -22798 -44032 -41368 -59509
15479 -59509 -64754 -60233 -51145 -28913 -24482 -21924 -50934 -64986 -63626 -65767 -63929 -57144 -39411
$$ packed form
15574b9421J1289j5257K0205J5426J3853L335q830q080nj346k0822n580Q059j8206
15560c5380o555J8270J9948J1587j5955r05J3316j181k896O055l326O327J1994
15547B1299p180M49J877l8705j5595j651j4831j0284L1259o61N017P617J6861
15534d528Q199q56j5822j6131K0126N694j2835Q507Q203j998J4497j2623L610
15521D043n857n592J1705m614k3239n71K599Q310j5216p886o627J2238J3638M414
15507a2655l445J219k622p055k7114o291M8680l855r270M51K9397J790j4215k5963
15493c0948m153j4820J6823r25m083j1519J534R27m007J9126R247k1234K664j8141
15479e9509n245M521R088K2232M431K558k9010j4052J360k141J838O785J7733
$$ plain form
15466 -39411 -21341 -11275 -6929 -17926 -23784 5349 12363 18736 13918 -25270 -13573 -3252 -18121
15453 -18121 -20312 -10329 -5655 -19414 -35760 -39699 -46267 -46698 -19567 -4946 -6180 -13948 -7177 -36793
15439 -36793 -60234 -38820 -24479 -30754 -35272 -28757 -15459 2413 -9959 -23422 -27042 -41012
15427 -41012 -28654 -9571 -2466 9071 -2761 -8499 -31391 -29252 -35207 -27721 -31823 -13976 -1367
15414 -1367 -1104 10773 -11688 -39053 -39822 -42159 -31320 -4262 -8129 -15471 -21203 -15824 -4991 -10813
15400 -10813 -21262 4202 7021 3427 9979 8862 1865 -4209 -2433 -29969 -35814 -19812 -26310
15387 -26310 -31474 -47206 -40399 -11813 -20057 -24431 -28724 -20648 -12815 -5947 -6299 11201 10058 8199
15373 8199 2995 -9441 13266 25398 37706 32115 11004 -107 -2342 -12229 -18818 -12947 -35031
$$ packed form
15466c9411J8070J0066M346j0997n858K9133P014O373m818l9188J1697J0321j4869
15453a8121k191R983M674j3759j6346l939o568m31K7131J4621j234p768O771k9616
15439c6793k3441K1414J4341o275m518O515J3298J7872j2372j3463l620j3970
15427d1012J2358J9083P105J1537j1832n738k2892K139n955P486m102J7847J2609
15414a367K63J1877k2461k7365p69k337J0839K7058l867p342n732N379J0833n822
15400a0813j0449K5464K819l594O552j117o997o074J776k7536n845J6002o498
15387b6310n164j5732O807K8586q244m374m293Q076P833O868l52J7500j143j859
15373H199n204j2436K2707J2132J2308n591k1111j1111k235r887o589N871k2084
$$ plain form
15360 -35031 -40831 -11021 -5887 -8682 -10366 -27719 -51882 -47356 -18313 2996 5747 -9227 -26878
15347 -26878 -28305 -16700 9885 15887 33801 36383 21998 5940 -1861 -3499 -8157 -13558 -25551
15334 -25551 -21610 -17967 3738 -90 11027 8869 280 -10117 6292 11457 1309 -21572 -22110
15321 -22110 7640 14718 4445 -36165 -54318 -31754 -18159 -446 -2614 -12178 -22443 -24276
15309 -24276 -42527 -54364 -27737 -11779 -23653 -30132 -26355 -34294 -24415 -5750 -20727 -28003 -37502
15296 -37502 -42471 -46561 -51393 -49970 -43030 -30668 -18741 -25660 -14288 -24552 -18048 -25741 -46995
15283 -46995 -56056 -43276 -14328 11448 15057 23689 3238 -40596 -37148 -25608 -36175 -51648
15271 -51648 -38154 -35091 -30385 -51559 -72523 -55507 -72470 -72861 -32019 -5977 8784 5271 -1314
$$ packed form
15360c5031n800K9810N134k795j684j7353k4163M526K9043K1309K751j4974j7651
15347b6878j427J1605K6585O002J7914K582j4385j6058p801j638m658n401j1993
15334b5551L941L643K1705l828J1117k158q589j0397J6409N165j0148k2881n38
15321b2110K9750P078j0273m0610j8153K2564J3595J7713k168r564j0265j833
15309b4276j8251j1837K6627J5958j1874o479L777p939R879J8665j4977p276r499
15296c7502m969m090m832J423O940J2362J1927o919J1372j0264O504p693k1254
15283d6995r061J2780K8948K5776L609Q632k0451m3834L448J1540j0567j5473
15271e1648J3494L063M706k1174k0964J7016j6963l91M0842K6042J4761l513o585
$$ plain form
15258 -1314 -4903 -4786 6117 -10275 -26852 -32207 -17208 17663 16006 -14480 -17464 -595 11212
15245 11212 14462 9552 12891 -3637 -8626 -9520 -16606 -40318 -22186 2452 11475 -1017 -22439
15232 -22439 -37996 -37400 -11664 8005 19260 8955 -7645 -35131 -42202 -39425 -35200 -41292 -17373
15219 -17373 -6820 -11629 -27775 -5655 -9324 -13448 569 -1297 -16028 -26197 -14920 -17748 -34135
15206 -34135 -44089 -32199 -28407 -31273 -37958 -23952 -18137 15927 35488 32632 14686 1274 -12591
15193 -12591 -33220 -59631 -57752 -33836 -14076 -5938 -28715 -20634 3072 616 25811 31415 -15868
15180 -15868 -61673 -65325 -29082 -21973 -12979 -17015 -31936 -37180 -37234 -34747 -20524 756 -9015 -8407
15166 -8407 -9109 -7033 26935 32223 24274 8668 10790 8254 16031 35122 27679 20217 38164 61498
$$ packed form
15258a314l589J17J0903j6392j6577n355J4999L4871j657l0486k984J6869J1807
15245A1212L250m910L339j6528m989q94p086k3712J8132K4638R023j2492k1422
15232b2439j5557N96K5736J9669J1255j0305j6600k7486p071K777M225o092K3919
15219a7373J0553m809j6146K2120l669m124J4017j866j4731j0169J1277k828j6387
15206c4135r954J1890L792k866o685J4006N815L4064J9561k856j7946j3412j3865
15193a2591k0629k6411J879K3916J9760Q138k2777Q081K3706k456K5195N604m7283
15180a5868m5805l652L6243P109Q994m036j4921n244n4K487J4223K1280r771O08
15166h407p02K076L3968N288p949j5606K122k536P777J9091p443p462J7947K3334
$$ plain form
15152 61498 24489 -24752 -11505 -472 15232 23724 27478 10085 17059 50425 23042 -3909
15140 -3909 -7418 -3036 1012 -2479 -28460 -10944 -15958 3805 7115 -2742 -1526 11022 12391 -1789
15126 -1789 -24172 -29608 -33903 -19186 -8287 21477 27623 24139 23500 11999 -293 -15921 -22512
15113 -22512 -29343 -37755 -31896 -8585 588 16715 25059 35009 47938 17198 4770 -2050 -19393
15100 -19393 -7425 2980 18183 12230 -132 3030 -19681 -38150 -59594 -72486 -32868 -17245
15088 -17245 6520 24702 15152 3437 748 -2799 -643 9038 19391 24513 33155 7558 -14544
15075 -14544 -16554 -2020 3440 33312 22770 8324 15376 13012 28672 15211 -2988 3307 6688
15062 6688 3046 8863 24653 26092 3803 -21896 -50518 -29488 -3297 26183 44909 50819 51887
$$ packed form
15152F1498l7009m9241J3247J1033J5704Q492L754j7393O974L3366k7383k6951
15140c909l509M382M048l491k5981J7516n014J9763L310r857J216J2548J369j4180
15126a789k2383n436m295J4717J0899K9764O146l484o39j1501j2292j5628o591
15113b2512o831q412N859K3311R173J6127Q344R950J2929l0740j2428o820j7343
15100a9393J1968J0405J5203n953j2362L162k2711j8469k1444j2892L9618J5623
15088a7245K3765J8182r550j1715k689l547K156R681J0353N122Q642k5597k2102
15075a4544k010J4534N460K9872j0542j4446P052k364J5660j3461j8199O295L381
15062F688l642N817J5790J439k2289k5699k8622K1030K6191K9480J8726N910J068
$$ plain form
15049 51887 34937 23274 28766 32549 39910 27703 13125 29566 27747 -14948 -35115 -39339 -42297
15036 -42297 -42102 -22648 -17162 5883 16686 5866 5404 29779 40332 14122 -7067 -25298 -27079
15023 -27079 -19045 -11012 -15505 -1579 24333 19407 19823 -3233 -6312 12087 34753 14556 -9237
15010 -9237 -5763 -6650 -24078 4724 49365 59728 49239 33257 28602 49561 96545 128776 142573
14997 142573 197190 283680 455846 801119 1268831 1666665 1439497 865154 555802 409155
14987 409155 277584 207127 188892 172776 148060 125170 98526 66864 67081 67822 71068 58668
14975 58668 57312 49363 33181 37513 35315 20799 -4901 -13036 -7511 24232 50584 47663 22216
14962 22216 -6872 -25242 -22849 36388 40118 15220 -9332 14733 3037 249 6201 -6298
$$ packed form
15049E1887j6950j1663N492L783P361j2207j4578J6441j819m2695k0167m224k958
15036d2297J95J9454N486K3045J0803j0820m62K4375J0553k6210k1189j8231j781
15023b7079Q034Q033m493J3926K5912m926M16k3056l079J8399K2666k0197k3793
15010i237L474q87j7428K8802M4641J0363j0489j5982m655K0959M6984L2231J3797
14997A42573N4617Q6490J72166L45273M67712L97834k27168n74343l09352j46647
14987D09155j31571p0457j8235j6116k4716k2890k6644l1662K17P41L246j2400
14975E8668j356p949j6182M332k198j4516k5700q135N525L1743K6352k921k5447
14962B2216k9088j8370K393N9237L730k4898k4552K4065j1696k788N952j2499
$$ plain form
14950 -6298 -14177 -21022 -18279 8375 25754 26431 1334 -7066 -10914 1269 13782 42245 5203
14937 5203 -39814 -25960 -17113 -6259 -19218 -13001 70 -12324 -21475 -6615 6137 19805
14925 19805 25002 5885 3100 8957 13051 25455 30525 25536 12348 20935 32870 32717 27592 14257
14911 14257 2534 -14541 -9807 -14825 -27887 -28083 8729 8757 -18935 -7688 11003 14474 11660
14898 11660 1090 -15845 -18516 673 10993 -2523 -22997 -27522 -23258 -12523 -27029 -22817
14886 -22817 -33477 -11085 -3278 -26112 -22751 -15553 -10924 -12265 -14479 -15795 -35055 -30298 -10736
14873 -10736 -10239 -4410 3563 6857 13966 35430 16668 -823 -2351 -4849 2462 12158 -13855 7867
14859 7867 12027 -1621 4818 16300 13855 15066 24558 32237 26193 5760 -18390 -32689 -52788
$$ packed form
14950f298p879o845K743K6654J7379O77k5097q400l848J2183J2513K8463l7042
14937E203m5017J3854Q847J0854j2959O217J3071j2394r151J4860J2752J3668
14925A9805N197j9117k785N857M094J2404N070m989j3188Q587J1935j53n125j3335
14911A4257j1723j7075M734n018j3062j96L6812K8k7692J1247J8691L471k814
14898A1660j0570j6935k671J9189J0320j3516k0474m525M264J0735j4506M212
14886b2817j0660K2392P807k2834L361P198M629j341k214j316j9260M757J9562
14873a0736M97N829P973L294P109K1464j8762j7491j528k498P311R696k6013K1722
14859G867M160j3648O439J1482k445J211R492P679o044k0433k4150j4299k0099
$$ plain form
14846 -52788 -25584 17527 23563 5036 -4501 -14960 -31885 -19532 -13637 -7584 -17620 -25795 -2635
14833 -2635 2345 6881 -2205 -10193 737 35021 20551 5722 11271 16653 18214 15893 18462 -326
14819 -326 -19978 -16175 -2225 3842 4411 -86 -29270 -14970 -19849 -9314 -11800 -15917 -11394 2221
14805 2221 -1699 3134 4172 -21359 -23352 -10288 -6637 -12420 -5502 6363 34858 47044 24027
14792 24027 -72 -9045 -327 -722 -1568 11629 -6533 12616 7770 -33531 -21013 -14224 -19381
14779 -19381 -22782 -35917 -46011 -41381 -1184 17794 17200 23788 15096 6729 452 4850 -6826
14766 -6826 -5731 4218 16390 31859 9035 18233 8748 -3324 -4817 888 -6738 19729 33774
14753 33774 36161 26753 29656 37809 40070 22594 37856 31269 24432 8264 46160 42621 30017
$$ packed form
14846e2788K7204M3111O036j8527r537j0459j6925J2353N895O053j0036q175K3160
14833b635M980M536r086p988J0930L4284j4470j4829N549N382J561k321K569j8788
14819c26j9652L803J3950O067N69m497k9184J4300m879J0535k486m117M523J3615
14805B221l920M833J038k5531j993J3064L651n783O918J1865K8495J2186k3017
14792B4027k4099q973Q718l95q46J3197j8162J9149m846m1301J2518O789n157
14779a9381l401j3135j0094M630M0197J8978n94O588q692q367o277M398j1676
14766f826J095R949J2172J5469k2824R198r485j2072j493N705p626K6467J4045
14753C3774K387r408K903Q153K261j7476J5262o587o837j6168L7896l539j2604
$$ plain form
14740 30017 11615 -16936 -15421 -4758 7981 28276 36337 34631 18064 -7874 -12255 14198
14728 14198 7799 16003 24221 14886 7059 9004 9693 2051 -540 -3416 31354 32542 28596 27869 10306
14713 10306 -8094 -10351 -21056 -10622 12934 14187 8191 -85 -18653 -3503 -2483 -18805 -20961
14700 -20961 -39060 -39141 -13299 14360 38401 1439 1690 24239 16866 17454 6276 6278 18130 42365
14686 42365 49932 38321 33407 21252 18632 16551 11157 -7791 -1049 5875 1394 21864 16755
14673 16755 10690 3356 -21825 6077 13567 -1407 5440 26647 31666 14050 8451 23995 35552
14660 35552 40704 41546 46441 42623 19047 5607 10941 32156 51544 31001 -14579 -30497 -21306
14647 -21306 -18657 -34358 -52870 -51079 -41409 -30901 -23754 17310 26610 25186 25777 9735 10968
$$ packed form
14740C0017j8402k8551J515J0663J2739K0295Q061j706j6567k5938m381K6453
14728A4198o399Q204Q218r335p827J945O89p642k591k876L4770J188l946p27j7563
14713A0306j8400k257j0705J0434K3556J253n996q276j8568J5150J020j6322k156
14700b0961j8099q1K5842K7659K4041l6962K51K2549p373N88j1178KJ1852K4235
14686D2365P567j1611m914j2155k620k081n394j8948O742O924m481K0470n109
14673A6755o065p334k5181K7902P490j4974O847K1207N019j7616n599J5544J1557
14660C5552N152Q42M895l818k3576j3440N334K1215J9388k0543m5580j5918R191
14647b1306K649j5701j8512J791R670J0508P147M1064R300j424N91j6042J233
$$ plain form
14634 10968 5429 16899 34868 38869 18132 23923 40326 39185 41839 34636 20319 10877 8872
14621 8872 24798 34603 45940 35964 17853 761 17588 22173 2109 -1481 -1637 1667 5248
14608 5248 1705 711 9648 15118 14985 23262 26505 15015 8013 19112 8558 -2851 7175 39238
14594 39238 44415 30125 12726 -6904 10187 26383 13290 8955 27934 44645 37328 35882
14582 35882 32656 24512 14991 -3131 10199 23523 30474 35216 17389 28587 36901 24635 14504
14569 14504 44128 42454 24648 15564 29769 35507 29800 -9157 -29507 -27889 -17190 -1900 10173
14556 10173 -8323 -17051 14383 34401 11753 22561 49660 67929 62856 39471 19047 34228
14544 34228 40832 59392 43312 34941 27008 18469 19104 27744 11990 22647 18013 -7889 -40705
$$ packed form
14634A0968n539J1470J7969M001k0737N791J6403j141K654p203j4317r442k005
14621H872J5926R805J1337r976j8111j7092J6827M585k0064l590j56L304L581
14608E248l543r94Q937N470j33Q277L243j1490p002J1099j0554j1409J0026L2063
14594C9238N177j4290j7399j9630J7091J6196j3093m335J8979J6711p317j446
14582C5882l226q144r521j8122J3330J3324O951M742j7827J1198Q314j2266j0131
14569A4504K9624j674j7806r084J4205N738n707l8957k0350J618J0699J5290J2073
14556A0173j8496q728L1434K0018k2648J0808K7099J8269n073k3385k0424J5181
14544C4228O604J8560j6080q371p933q539O35Q640j5754J0657m634k5902l2816
$$ plain form
14531 -40705 -33425 -11870 -5834 22263 39078 25387 26292 17056 3093 17436 12607 27647 66925
14518 66925 76045 60375 44629 53183 39178 37911 64358 69839 60700 39934 26062 8476 -8582
14505 -8582 -18693 -408 25316 42753 33297 49629 60657 76839 61118 56507 47121 42270 29870
14492 29870 30192 29751 36217 62302 45871 19641 13003 14648 32571 28311 43714 50476 37363
14479 37363 32299 29690 20238 -359 -13355 15963 52710 72653 68375 72218 47579 37976 27108
14466 27108 9485 14287 -17178 -313 42565 30823 20614 28589 63326 59392 44170 30394
14454 30394 33056 36963 40937 32021 28276 18881 -8431 4232 18303 16160 2917 -12709 -5622
14441 -5622 -11000 3043 16078 16722 2906 1398 16092 31766 35342 24381 12879 28273 32403
$$ packed form
14531d0705P280K1555O036K8097J6815j3691R05r236j3963J4343m829J5040L9278
14518F6925R120j5670j5746Q554j4005j267K6447N481r139k0766j3872j7586j7058
14505h582j0111J8285K5724J7437r456J6332J1028J6182j5721m611r386m851j2400
14492B9870L22m41O466K6085j6431k6230o638J645J7923m260J5403O762j3113
14479C7363n064k609r452k0597j2996K9318L6747J9943m278L843k4639r603j0868
14466B7108j7623M802l1465J6865M2878j1742j0209P975L4737l934j5222j3776
14454C0394K662L907L974q916l745r395k7312J2663J4071k143j3243j5626P087
14441e622n378J4043J3035O44j3816j508J4694J5674L576j0961j1502J5394M130
$$ plain form
14428 32403 30306 39064 39878 23733 -784 -10444 -38210 -24276 -11428 -12235 2605 23496 32059
14415 32059 25344 28576 26328 40964 51349 37366 2581 8082 17706 26729 30710 35802 33938
14402 33938 33414 46760 54899 31694 37927 51896 44481 41600 36741 56075 55308 53829 47274 26239
14388 26239 8283 15391 18293 22572 24103 10618 5381 20716 26282 33513 43372 63898 69407
14375 69407 43897 19742 -421 999 -6646 7676 30213 33192 35239 55764 83059 104714
14363 104714 70937 35354 40588 36112 34450 63855 60872 48658 48885 29191 2445 17765 42488
14350 42488 40244 58087 56382 48437 45746 62270 75213 73173 37733 16066 9596 27556 34136
14337 34136 22561 35778 40708 25542 10887 30002 48236 41933 38438 45050 37345 31750 37981
$$ packed form
14428C2403k097Q758Q14j6145k4517r660k7766J3934J2848q07J4840K0891Q563
14415C2059o715L232k248J4636J0385j3983l4785N501R624R023L981N092j864
14402C3938n24J3346Q139k3205O233J3969p415k881m859J9334p67j479o555k1035
14388B6239j7956P108K902M279J531j3485n237J5335N566P231R859K0526N509
14375F9407k5510k4155k0163J420p645J4322K2537K979K047K0525K7295K1655
14363A04714l3777l5583N234m476j662K9405k983j2214K27j9694k6746J5320K4723
14350D2488k244J7843j705p945k691J6524J2943k040l5440k1667o470J7960O580
14337C4136j1575J3217M930j5166j4655J9115J8234o303l495O612p705n595O231
$$ plain form
14324 37981 33735 33835 40695 11155 4087 11407 37452 39379 27534 41164 43024 31753 41480
14311 41480 65616 78978 69830 56196 9776 9393 10327 5384 20186 20047 35063 32234 29145 60707
14297 60707 93195 106986 93418 64121 57015 50873 33676 37768 42672 53281 57223 49699 49198
14284 49198 18479 20849 34089 40615 39581 57168 40496 35401 27586 9378 22251 34933 53467
14271 53467 56485 56163 57706 40845 46090 50221 36130 41119 42598 33950 33336 34990 26008 15014
14257 15014 23402 9174 16343 32031 22960 19993 31248 36926 25933 22534 27190 11181 -12714
14244 -12714 -5159 2653 6422 22721 40739 64926 74980 81720 70126 38819 28026 41844
14232 41844 35920 39956 58939 46774 19646 8134 1926 -17254 5202 42304 42567 50311 63048
$$ packed form
14324C7981m246J00O860k9540p068P320K6045J927j1845J3630J860j1271R727
14311D1480K4136J3362r148j3634m6420l83R34m943J4802j39J5016k829l089L1562
14297F0707L2488J3791j3568k9297p106o142j7197M092M904J0609L942p524n01
14284D9198l0719K370J3240O526j034J7587j6672n095p815j8208J2873J2682J8534
14271E3467L018l22J543j6861N245M131j4091M989J479q648o14J654q982j0994
14257A5014Q388j4228P169J5688r071k967J1255N678j0993l399M656j6009k3895
14244a2714P555P812L769J6299J8018K4187J0054O740j1594l1307j0793J3818
14232D1844n924M036J8983j2165k7128j1512o208j9180K2456L7102K63P744J2737
$$ plain form
14219 63048 48434 27964 20793 25073 41124 66667 62088 28684 34137 28379 10691 9561 9701
14206 9701 20110 42779 53500 52225 36162 39484 40665 38782 25399 48019 46864 38486 43679
14193 43679 53473 55939 48338 32466 42089 54598 42002 45995 69052 72698 87476 90618 77161
14180 77161 64735 50495 55530 59756 48346 50990 66353 64252 51836 43571 73755 74964 73658
14167 73658 52443 46798 64319 67980 38189 16169 1601 14001 26399 42384 57493 48712
14155 48712 64368 54467 51212 25723 -2056 4831 26609 56640 71242 64767 75140 76399 60637
14142 60637 61416 50356 58924 68044 55922 66187 83437 91776 89109 94958 91270 92171 74778 57439
14128 57439 44047 49023 58301 74491 63028 46508 30059 22400 38709 47326 68822 84584
$$ packed form
14219F3048j4614k0470p171M280J6051K5543m579l3404N453n758j7688j130J40
14206I701J0409K2669J0721j275j6063L322J181j883j3383K2620j155q378N193
14193D3679R794K466p601j5872R623J2509j2596L993K3057L646J4778L142j3457
14180G7161j2426j4240N035M226j1410K644J5363k101j2416q265L0184J209j306
14167G3658k1215n645J7521L661k9791k2020j4568J2400J2398J5985J5109q781
14155D8712J5656r901l255k5489k7779O887K1778L0031J4602o475J0373J259j5762
14142F0637P79j1060Q568R120j2122J0265J7250Q339k667N849l688R01j7393j7339
14128E7439j3392M976R278J6190j1463j6520j6449p659J6309Q617K1496J5762
$$ plain form
14116 84584 73156 55794 72994 59772 51047 67693 82078 89224 92484 123215 134143 115110
14104 115110 108328 113171 111632 104237 114679 104097 67495 59683 46563 40209 52731 62931 43760
14091 43760 54007 71398 79897 99449 89628 61852 60392 77988 94485 96808 88204 107625 114752
14078 114752 88815 65702 44251 20720 49860 60097 64564 63711 46628 41858 35555 34868 28433
14065 28433 41851 36114 47219 55035 64217 66452 46178 48601 54483 51181 46057 37999 31255 42835
14051 42835 71088 42051 44702 52285 62594 73546 95998 114171 104745 99120 87333 59149
14039 59149 44041 27753 50654 68602 61926 59944 64484 80977 77313 52325 22328 24933 41614
14026 41614 37309 39576 54264 66916 69229 63150 58766 62512 57537 46785 69650 63520 59403
$$ packed form
14116H4584j1428j7362J7200j3222q725J6646J4385P146L260L0731J0928j9033
14104A15110o782M843j539p395J0442j0582l6602p812j3120o354J2522J0200j9171
14091D3760J0247J7391Q499J9552r821k7776j460J7596J6497K323q604J9421P127
14078A14752k5937k3113k1451k3531K9140J0237M467q53j7083m770o303o87o435
14065B8433J3418n737J1105P816R182K235k0274K423N882l302n124q058o744J1580
14051D2835K8253k9037K651P583J0309J0952K2452J8173r426n625j1787k8184
14039E9149j5108j6288K2901J7948o676j982M540J6493l664k4988k9997K605J6681
14026D1614m305K267J4688J2652K313o079m384L746m975j0752K2865o130m117
$$ plain form
14013 59403 56702 51617 52756 37415 42566 41781 43268 48360 28218 16771 30000 46606 64975
14000 64975 54545 43395 77169 93069 94022 70364 48558 36530 20541 30934 34033 52815
13988 52815 82763 88402 79925 63301 69285 62373 62315 45416 40276 47239 35885 51632 77077
13975 77077 71765 31678 11925 27133 55296 47273 58948 64074 53604 58927 68224 57602 47961
13962 47961 38979 42299 57014 77381 54276 39544 44221 48169 49743 53760 62850 67975 57023
13949 57023 42310 45760 31049 20901 24142 46608 65847 52223 51642 45485 29099 37072 75123
13936 75123 80103 76672 84701 83558 87988 77615 86273 89533 70588 46037 72404 87807 94212
13923 94212 97781 82586 48142 62465 64848 75048 69047 55533 41823 47126 78016 87057 79682
$$ packed form
14013E9403k701n085J139j5341N151p85J487N092k0142j1447J3229J6606J8369
14000F4975j0430j1150L3774J5900R53k3658k1806j2028j5989J0393L099J8782
13988E2815K9948N639q477j6624N984o912n8j6899n140O963j1354J5747K5445
13975G7077n312m0087j9753J5208K8163q023J1675N126j0470N323R297j0622r641
13962D7961q982L320J4715K0367k3105j4732M677L948J574M017R090N125j0952
13949E7023j4713L450j4711j0148L241K2466J9239j3624n81o157j6386P973L8051
13936G5123M980l431Q029j143M430j0373Q658L260j8945k4551K6367J5403O405
13923I4212L569j5195l4444J4323K383J0200o001j3514j3710N303L0890R041p375
$$ plain form
13910 79682 79102 82283 69526 76557 75406 68623 67300 78299 73390 62785 52297 51060 55919 56659
13896 56659 61165 48441 57738 74585 89275 104791 97357 78121 79306 72984 70711 54975 81350
13883 81350 114923 108511 66292 47467 42091 60803 55747 49227 59803 48970 41238 39155 46385
13870 46385 55730 75549 110067 98653 68800 65086 61705 71008 80700 79909 60250 47298 57217
13857 57217 74193 92629 103878 117088 86992 79683 92864 81857 59152 66501 74882 65804
13845 65804 88385 94541 72233 77785 112119 87030 66172 60140 89247 101647 100349 82066
13833 82066 70511 39723 57330 74016 69399 51475 38922 44578 38151 22608 34247 50296
13821 50296 76224 89464 98402 88435 72940 81794 91421 82142 65187 66349 85701 92233 75045
$$ packed form
13910G9682n80L181j2757P031j151o783j323J0999m909j0605j0488j237M859P40
13896E6659M506j2724R297J6847J4690J5516p434j9236J185o322k273j5736K6375
13883H1350L3573o412m2219j8825n376J8712n056o520J0576j0833p732k083P230
13870D6385R345J9819L4518j1414k9853l714l381R303R692p91j9659j2952R919
13857E7217J6976J8436J1249J3210l0096p309J3181j1007k2705P349Q381r078
13845F5804K2581O156k2308N552L4334k5089k0858o032K9107J2400j298j8283
13833H2066j1555l0788J7607J6686m617j7924j2553N656o427j5543J1639J6049
13821E0296K5928J3240Q938r967j5495Q854R627r279j6955J162J9352O532j7188
$$ plain form
13808 75045 77750 118679 137760 128351 96422 98743 77330 86730 84774 71507 74057 79746 84637
13795 84637 92180 102487 113192 85653 56798 43708 43700 62158 91013 87009 104898 112923 82999
13782 82999 74699 96008 106321 101035 109609 126630 121085 103894 92189 79008 74337 70252 75429
13769 75429 97612 91304 87619 90792 80800 88990 101066 93968 94923 95029 63687 35704 28630 53756
13755 53756 96039 98019 99726 100912 76598 82806 94535 93762 89129 90908 110902 122024 139033
13742 139033 149928 139747 125704 124819 107430 97364 93254 105688 108743 103297 90659 78764
13730 78764 93458 99941 90525 85305 85120 92900 70885 83696 81916 76452 87030 103753 86718
13717 86718 89056 103223 101012 83167 76038 102547 121891 132373 116616 104506 107258 111124 129234
$$ packed form
13808G5045K705M0929J9081r409l1929K321k1413R400j956j3267K550N689M891
13795H4637P543J0307J0705k7539k8855j3090qJ8458K8855m004J7889Q025k9924
13782H2999q300K1309J0313n286Q574J7021n545j7191j1705j3181m671m085N177
13769G5429K2183o308l685L173r992Q190J2076p098R55J06l1342k7983p074K5126
13755E3756M2283J980J707J186k4314O208J1729p73m633J779J9994J1122J7009
13742A39033J0895j0181j4043q85j7389j0066m110J2434L055n446j2638j1895
13730G8764J4694O483r416n220j85P780k2015J2811j780n464J0578J6723j7035
13717H6718K338J4167k211j7845p129K6509J9344J0482j5757j2110K752L866J8110
$$ plain form
13704 129234 118379 107226 108053 112314 108741 101092 110017 124450 152091 135875 133746 139759 139845 124986
13690 124986 107570 110055 113006 113230 128142 127978 129959 112203 94050 74214 77044 88555 101425
13677 101425 101040 107793 131934 133311 109547 90452 110705 112549 124434 116562 96527 99189 98125
13664 98125 84405 87402 102801 109035 116870 121998 145533 156825 124640 113608 120582 117193 131638
13651 131638 121529 119001 101916 101304 109596 104738 117435 112417 114568 116659 98586 78939 105653
13638 105653 141837 148650 135114 155070 138515 130058 131714 118299 124540 113781 104074 98964 82879
13625 82879 87820 95174 82598 95539 116291 96095 108532 113605 105359 110475 119613 134678 130425
13612 130425 102601 118912 145410 146723 149987 142297 143763 143102 108722 117309 136270 129860 109692
$$ packed form
13704A29234j0855j1153Q27M261l573p649Q925J4433K7641j6216k129O013Q6j4859
13690A24986j7416K485K951K24J4912j64J981j7756j8153j9836K830J1511J2870
13677A01425l85O753K4141J377k3764j9095K0253J844J1885p872k0035K662j064
13664I8125j3720K997J5399O234P835N128K3535J1292l2185j1032O974l389J4445
13651A31638j0109k528j7085o12Q292m858J2697n018K151K091j8073j9647K6714
13638A05653L6184O813j3536J9956j6555q457J656j3415O241j0759r707n110j6085
13625H2879M941P354j2576J2941K0752k0196J2437N073q246N116R138J5065m253
13612A30425k7824J6311K6498J313L264p690J466o61l4380Q587J8961o410k0168
$$ plain form
13599 109692 120328 120913 139232 168859 166368 164997 168726 145094 153608 161934 147227 138348 124960
13586 124960 116148 110904 122054 146401 142919 137615 140161 127668 104446 91325 102745 109770 104394
13573 104394 112173 118081 124167 119267 103067 98717 122010 121854 79779 62018 95307 104659 118556
13560 118556 132996 145150 140297 149904 145813 158010 154127 141030 137353 159306 164636 143626 125107
13547 125107 140430 140353 139093 145286 143749 137597 124586 98263 92496 97579 100850 127055 156083
13534 156083 133887 104774 95971 116460 123518 131818 122537 112467 98855 83436 83878 112016 138548
13521 138548 169507 172173 182906 192955 191634 157628 117855 107854 133060 150388 152423 151673
13509 151673 145456 154541 145650 145933 155325 145302 111042 126589 160105 143675 136922 141352 156077
$$ packed form
13599A09692J0636N85J8319K9627k491j371L729k3632Q514Q326j4707q879j3388
13586A24960q812n244J1150K4347l482n304K546j2493k3222j3121J1420P025n376
13573A04394P779N908O086m900j6200m350K3293j56m2075j7761L3289R352J3897
13560A18556J4440J2154m853R607m091J2197l883j3097l677K1953N330k1010j8519
13547A25107J5323p7j260O193j537o152j3011k6323n767N083L271K6205K9028
13534A56083k2196k9113q803K0489P058Q300r281j0070j3612j5419M42K8138K6532
13521A38548L0959K666J0733J0049j321l4006l9773j0001K5206J7328K035p50
13509A51673o217R085q891K83R392j0023l4260J5547L3516j6430o753M430J4725
$$ plain form
13496 156077 151116 136606 160612 162483 127212 117928 140544 153581 167046 155927 152541 167891
13484 167891 174694 170782 165445 140185 130689 156651 181814 171392 163922 138467 124075 136559
13472 136559 156300 161121 167214 173609 166667 157005 145656 149473 172388 169744 148195 163530 183189
13459 183189 179519 145542 150991 152979 172039 180909 148244 134687 129603 133368 138424 155296 190567
13446 190567 211411 193303 153815 151529 165056 165231 162241 158972 141835 151881 150933 155365 153878
13433 153878 130019 136506 137774 143944 131941 134270 129712 146551 169888 179363 181721 170926 159946
13420 159946 160050 149202 156277 152205 155935 176515 211270 196391 179409 160572 168590 176191 183136
13407 183136 191254 174887 149850 173353 189964 188706 176793 182494 192670 200886 215251 196941
$$ packed form
13496A56077m961j4510K4006J871l5271r284K2616J3037J3465j1119l386J5350
13484A67891O803l912n337k5260r496K5962K5163j0422p470k5455j4392J2484
13472A36559J9741M821O093O395o942r662j1349L817K2915k644k1549J5335J9659
13459A83189l670l3977N449J988J9060Q870l2665j3557n084L765N056J6872L5271
13446A90567K0844j8108l9488k286J3527J75k990l269j7137J0046r48M432j487
13433A53878k3859O487J268O170j2003K329m558J6839K3337R475K358j0795j0980
13420A59946J04j0848P075m072L730K0580L4755j4879j6982j8837Q018P601O945
13407A83136Q118j6367k5037K3503J6611j258j1913N701J0176Q216J4365j8310
$$ plain form
13395 196941 193124 201127 211641 222629 235311 204925 193172 184862 178368 183724 191779 170461 177216
13382 177216 191710 200730 222463 229750 210181 190048 222592 226241 219680 226430 234822 245589 228354
13369 228354 232042 228509 221775 215679 219987 231661 211876 191432 216904 218064 212106 200558 172296
13356 172296 188931 199493 210596 223248 238125 244704 218691 211605 218856 222067 222160 195278 185646
13343 185646 196520 209397 222403 227952 226973 219435 220257 223896 219084 222195 216301 190055 204876
13330 204876 232274 229338 226299 238022 253579 268078 275755 280645 263028 233912 229999 219848
13318 219848 220702 207839 205705 201434 202633 184808 195861 200252 201852 220789 222371 223648 246404
13305 246404 250194 257077 270207 293885 301822 300925 309931 345060 354189 326151 340711 357478 379102
$$ packed form
13395A96941l817Q003J0514J0988J2682l0386j1753q310o494N356Q055k1318O755
13382A77216J4494R020K1733P287j9569k0133L2544L649o561O750Q392J0767j7235
13369B28354L688l533o734o096M308J1674j9785k0444K5472J160n958j1548k8262
13356A72296J6635J0562J1103J2652J4877O579k6013p086P251L211R3k6882r632
13343A85646J0874J2877J3006N549r79p538Q22L639m812L111n894k6246J4821
13330B04876K7398k936l039J1723J5557J4499P677M890j7617k9116l913j0151
13318B19848Q54j2863k134m271J199j7825J1053M391J600J8937J582J277K2756
13305B46404L790O883J3130K3678P937q97R006L5129R129k8038J4560J6767K1624
$$ plain form
13292 379102 380006 415146 508950 582371 639673 760161 960180 1318890 1849026 2458178 2830481
13281 2830481 2785979 2428895 1849162 1348687 1041888 861396 758534 675353 611309 566630
13271 566630 512628 485631 461547 441680 399864 381038 375707 367374 366524 360918 354112 341717 330275
13258 330275 342128 321957 303422 299560 299242 299183 297222 283028 264538 259388 268869 267784 264067 267621
13244 267621 262519 280160 301852 275185 265598 258537 269005 248013 265245 288452 279201 285456
13232 285456 283728 280352 294902 314717 313561 306198 289633 294351 299449 305596 291741 266285 246502
13219 246502 252456 273504 274196 275139 295535 289662 296697 314589 311083 305088 282863 286348 283798 280684
13205 280684 286022 296854 295955 292162 298052 322776 336219 312005 310339 317467 321593 328608 320895
$$ packed form
13292C79102R04L5140R3804P3421N7302J20488K00019L58710N30136O09152L72303
13281B830481m4502l57084n79733n00475l06799j80492j02862q3181o4044m4679
13271E66630n4002k6997k4084j9867m1816j8826n331q333q50n606o806j2395j1442
13258C30275J1853k0171j8535l862l18n9j961j4194j8490n150R481j085l717L554
13244B67621n102J7641K1692k6667r587p061J0468k0992J7232K3207r251O255
13232B85456j728l376J4550J9815j156p363j6565M718N098O147j3855k5456j9783
13219B46502N954K1048O92R43K0396n873P035J7892l506n995k2225L485k550l114
13205B80684N338J0832q99l793N890K4724J3443k4214j666P128M126P015p713
$$ plain form
13192 320895 330501 333112 334598 333144 348693 351588 339582 319760 320638 349065 364740 363536 363729
13179 363729 353666 351829 341386 331288 331966 333499 353431 366024 355107 334016 332743 317661
13167 317661 327101 317208 309836 327375 344903 332342 358771 367021 364118 340588 337950 335315 329592
13154 329592 341558 338915 329065 337196 339032 349179 339060 311672 313910 327716 327811 329172 347489
13141 347489 367707 362951 355350 380223 425077 416404 410122 385111 393193 411818 437410 457328
13129 457328 458599 408102 399977 409039 408699 396925 389268 385335 395598 435076 452521 458789 452191
13116 452191 448650 433715 423206 425190 429156 465128 483906 492366 482455 476856 484657 498668 508497
13103 508497 548481 574406 603418 660811 699063 747261 795095 801518 793939 732522 679949 650979
$$ packed form
13192C20895R606K611J486j454J5549K895j2006j9822Q78K8427J5675j204J93
13179C63729j0063j837j0443j0098O78J533J9932J2593j0917k1091j273j5082
13167C17661R440r893p372J7539J7528j2561K6429Q250k903k3530k638k635n723
13154C29592J1966k643r850Q131J836J0147j0119k7388K238J3806R5J361J8317
13141C47489K0218m756p601K4873M4854q673o282k5011Q082J8625K5592J9918
13129D57328J271n0497q125R062l40j1774p657l933J0263L9478J7445O268o598
13116D52191l541j4935j0509J984L966L5972J8778Q460r911n599P801J4011R829
13103E08497L9984K5925K9012N7393L8252M8198M7834O423p579o1417n2573k8970
$$ plain form
13091 650979 617450 574079 541474 525252 516627 496773 479796 462020 460175 459651 461374 441675
13079 441675 440385 465669 475036 466535 450787 443028 469531 472213 457134 450924 460430 492661 517588
13066 517588 520325 532925 540636 534418 496121 485555 485264 498980 498544 490952 499207 484299 474247
13053 474247 469558 491529 517745 511884 510362 511460 506891 497489 522005 560060 593258 584179 587878
13040 587878 593839 607134 623227 660078 682434 684291 687230 677676 658608 676716 692219 697962
13028 697962 716226 699762 658979 643609 644149 645580 639609 611378 588810 595537 596603 618971 619392
13015 619392 641081 666238 669261 672329 674905 681116 678184 671486 670971 660249 644295 633850 642122
13002 642122 658928 656173 669908 668540 635940 622714 626338 660741 693740 705142 713312 742547
$$ packed form
13091F50979l3529m3371l2605j6222q625j9854j6977j7776j845n24J723j9699
13079D41675j290K5284R367q501j5748p759K6503K682j5079o210R506L2231K4927
13066E17588K737J2600P711o218l8297j0566k91J3716m36p592Q255j4908j0052
13053D74247m689K1971K6216n861j522J098m569r402K4516L8055L3198r079L699
13040E87878N961J3295J6093L6851K2356J857K939r554j9068J8108J5503N743
13028F97962J8264j6464m0783j5370N40J431n971k8231k2568O727J066K2368M21
13015F19392K1689K5157L023L068K576O211k932o698n15j0722j5954j0445Q272
13002F42122J6806k755J3735j368l2600j3226L624L4403L2999J1402Q170K9235
$$ plain form
12990 742547 749240 742763 739083 747654 771176 786122 789552 784881 789564 804693 809376 822757 849979
12977 849979 895721 917052 953704 1008646 1086663 1144641 1184757 1214731 1192640 1157944 1084817
12966 1084817 1017813 976455 959946 993773 1006415 1029552 1038715 1062741 1070435 1060081 1076967 1091690
12954 1091690 1115743 1157569 1181587 1193231 1184238 1184062 1198742 1218724 1215517 1240516 1254117 1242854
12942 1242854 1206578 1203262 1224075 1240927 1252264 1256120 1282771 1283891 1279769 1287535 1293176 1294399 1289646
12929 1289646 1293916 1276900 1260995 1268997 1325642 1369198 1415679 1432543 1445354 1461481 1447566 1436181
12917 1436181 1473470 1497489 1501287 1527417 1544326 1588485 1642264 1667235 1677271 1682348 1701548 1733726
12905 1733726 1759655 1824408 1866399 1893503 1989474 2093880 2191787 2289114 2323977 2329879 2274049
$$ packed form
12990G42547O693o477l680Q571K3522J4946L430m671M683J5129M683J3381K7222
12977H49979M5742K1331L6652N4942P8017N7978M0116K9974k2091l4696p3127
12966A084817o7004m1358j6509L3827J2642K3137R163K4026P694j0354J6886J4723
12954A091690K4053M1826K4018J1644q993j76J4680J9982l207K4999J3601j1263
12942A242854l6276l316K0813J6852J1337L856K6651J120m122P766N641J223m753
12929A289646M270j7016j5905Q002N6645M3556M6481J6864J2811J6127j3915j1385
12917A436181L7289K4019L798K6130J6909M4159N3779K4971J0036N077J9200L2178
12905A733726K5929O4753M1991K7104R5971J04406R7907R7327L4863N902n5830
$$ plain form
12894 2274049 2249794 2274497 2310913 2395881 2480135 2571081 2696849 2828849 2923234 2988015 3061155
12883 3061155 3095162 3126002 3179936 3268761 3395604 3550425 3744194 3930061 4151589 4363940
12873 4363940 4554963 4753779 5030120 5343780 5694143 6073570 6458457 6898309 7322150
12864 7322150 7786726 8378996 9123871 9975185 10971333 12179086 13684618 15587332 18002525
12855 18002525 21088656 25184566 30592832 37751214 47178509 60178656 79561033 110985540
12847 110985540 164281588 249118983 360657739 461092434 483311270 445835992 349409364
12840 349409364 235491366 162078086 120814170 96412090 80995329 70631426 63300091
12833 63300091 57751423 52648188 47618586 42517337 37349682 32586509 28420060 24845752
$$ packed form
12894B274049k4255K4703L6416Q4968Q4254R0946J25768J32000R4385O4781P3140
12883C061155L4007L0840N3934Q8825J26843J54821J93769J85867K21528K12351
12873D363940J91023J98816K76341L13660L50363L79427L84887M39852M23841
12864G322150M64576N92270P44875Q51314R96148J207753J505532J902714K415193
12855A8002525L086131M095910N408266P158382R427295J3000147J9382377L1424507
12847A10985540N3296048Q4837395J11538756J00434695K2218836l7475278r6426628
12840C49409364j13917998p3413280m1263916k4402080j5416761j0363903p331335
12833F3300091n548668n103235n029602n101249n167655m763173m166449l574308
$$ plain form
12825 24845752 21831920 19275983 17118355 15248372 13613027 12181610 10989749 10004019
12817 10004019 9118541 8313253 7553664 6826635 6199008 5665587 5205583 4809532 4477010
12808 4477010 4149191 3857252 3602849 3339689 3103411 2893693 2728201 2576676 2389294
12799 2389294 2222571 2058625 1916988 1780570 1664926 1548777 1430864 1317066 1187654
12790 1187654 1083980 1005474 914307 884394 875422 856159 837826 798713 772964 772495 755359 729335
12778 729335 741081 762745 780299 763610 770893 805169 815453 833564 887268 979584 1130242
12767 1130242 1280213 1375102 1552057 1913656 2592544 3733978 5121902 6028118 5318078
12758 5318078 3752395 2661549 2065691 1730421 1536115 1399457 1303885 1237430 1170097 1110656
$$ packed form
12825B4845752l013832k555937k157628j869983j635345j431417j191861r85730
12817A0004019q85478q05288p59589p27029o27627n33421m60004l96051l32522
12808D477010l27819k91939k54403k63160k36278k09718j65492j51525j87382
12799B389294j66723j63946j41637j36418j15644j16149j17913j13798j29412
12790A187654j03674p8506r1167k9913q972j9263j8333l9113k5749m69j7136k6024
12778G29335J1746K1664J7554j6689P283L4276J0284J8111N3704R2316J50658
12767A130242J49971R4889J76955L61599O78888J141434J387924R06216p10040
12758E318078j565683j090846n95858l35270j94306j36658r5572o6455o7333n9441
$$ plain form
12748 1110656 1057023 1014915 974390 925193 867625 821526 779139 764991 759991 767277 767480 747666
12736 747666 726611 706648 682914 702313 708571 695535 711099 726808 719320 710687 729655 762207
12724 762207 782659 813834 848526 900596 965904 993581 1010516 1005720 956817 901915 868979 857867
12712 857867 861977 851284 853085 841898 857655 879467 906559 919101 939523 950397 986816 1012686
12700 1012686 1015201 1022387 1038320 1044584 1073011 1082707 1104313 1109620 1123542 1114929 1151498 1190116
12688 1190116 1187507 1177180 1179513 1167132 1152777 1154667 1166033 1172914 1154993 1149941 1179287 1200585
12676 1200585 1205690 1228515 1240221 1262459 1297319 1300327 1313480 1311306 1297915 1261649 1271535 1278831
12664 1278831 1285468 1269046 1269535 1284178 1305297 1298551 1296487 1315332 1334016 1359675 1376696 1389673
$$ packed form
12748A110656n3633m2108m0525m9197n7568m6099m2387j4148n000P286K03j9814
12736G47666k1055j9963k3734J9399O258j3036J5564J5709p488q633J8968L2552
12724G62207K0452L1175L4692N2070O5308K7677J6935m796m8903n4902l2936j1112
12712H57867M110j0693J801j1187J5757K1812K7092J2542K0422J0874L6419K5870
12700A012686K515P186J5933O264K8427R696K1606N307J3922q613L6569L8618
12688A190116k609j0327K333j2381j4355J890J1366O881j7921n052K9346K1298
12676A200585N105K2825J1706K2238L4860L008J3153k174j3391l6266R886P296
12664A278831O637j6422M89J4643K1119o746k064J8845J8684K5659J7021J2977
$$ plain form
12652 1389673 1425605 1448039 1448411 1471949 1492068 1492072 1513441 1545786 1554634 1552918 1601872 1673537 1712666
12639 1712666 1739977 1758413 1768091 1774220 1762913 1769154 1831064 1873867 1872319 1876614 1914066 1941115
12627 1941115 1958219 1998248 2008650 2016945 2025897 2033922 2062987 2090365 2114830 2136994 2162749 2201236
12615 2201236 2232151 2251516 2272787 2317405 2377105 2399790 2407043 2417059 2459768 2516203 2538442
12604 2538442 2569004 2605396 2664391 2693748 2712291 2737262 2767257 2807640 2871256 2923540 2947890
12593 2947890 3010739 3074120 3114995 3139170 3141830 3170552 3209535 3236708 3254037 3304948 3353922
12582 3353922 3388800 3426022 3491192 3521040 3563875 3623394 3659870 3694996 3736223 3787072 3847360
12571 3847360 3908838 3964877 4003406 4045631 4130172 4206491 4271603 4330082 4372359 4436487 4498829
$$ packed form
12652A389673L5932K2434L72K3538K0119MK1369L2345Q848j716M8954P1665L9129
12639A712666K7311J8436R678O129j1307O241O1910M2803j548M295L7452K7049
12627A941115J7104M0029J0402Q295Q952Q025K9065K7378K4465K2164K5755L8487
12615B201236L0915J9365K1271M4618N9700K2685P253J0016M2709N6435K2239
12604B538442L0562L6392N8995K9357J8543K4971K9995M0383O3616N2284K4350
12593B947890O2849O3381M0875K4175K660K8722L8983K7173J7329N0911M8974
12582C353922L4878L7222O5170K9848M2835N9519L6476L5126M1227N0849O0288
12571C847360O1478N6039L8529M2225Q4541P6319O5112N8479M2277O4128O2342
$$ plain form
12560 4498829 4557175 4622184 4722730 4817641 4870135 4937136 5014438 5060807 5127356 5191456 5259553
12549 5259553 5317631 5389763 5493049 5580034 5677765 5788811 5879162 5972554 6056593 6149317 6233482
12538 6233482 6317456 6386705 6476239 6571750 6674531 6778011 6883469 7021600 7157687 7259996
12528 7259996 7347395 7458880 7569601 7676062 7762827 7861459 7986374 8140899 8278212 8382751
12518 8382751 8506109 8635047 8771368 8905587 9040968 9184610 9354958 9562979 9727765
12509 9727765 9830340 9925222 10016068 10128193 10267067 10382609 10541441 10692614 10828525 10946477
12499 10946477 11042364 11186854 11350993 11505275 11642267 11775168 11921139 12077406 12207507
12490 12207507 12348018 12475336 12613924 12743467 12878808 12989426 13108301 13208722 13332719
$$ packed form
12560D498829N8346O5009J00546R4911N2494O7001P7302M6369O6549O4100O8097
12549E259553N8078P2132J03286Q6985R7731J11046R0351R3392Q4039R2724Q4165
12538F233482Q3974O9249Q9534R5511J02781J03480J05458J38131J36087J02309
12528G259996Q7399J11485J10721J06461Q6765R8632J24915J54525J37313J04539
12518H382751J23358J28938J36321J34219J35381J43642J70348K08021J64786
12509I727765J02575R4882R0846J12125J38874J15542J58832J51173J35911J17952
12499A0946477R5887J44490J64139J54282J36992J32901J45971J56267J30101
12490A2207507J40511J27318J38588J29543J35341J10618J18875J00421J23997
$$ plain form
12481 13332719 13452140 13575446 13688528 13812350 13923093 14022542 14117327 14196914 14272369 14365420
12471 14365420 14470206 14579614 14653204 14742656 14840573 14933521 14949952 14940180 14912048 14889905 14863791
12460 14863791 14848118 14831447 14817883 14787108 14769916 14731007 14708975 14664571 14607093 14577477 14516916
12449 14516916 14438846 14376597 14321035 14244049 14146210 14040999 13953281 13876081 13764531 13675396 13581230
12438 13581230 13461773 13326179 13187505 13060813 12956682 12836808 12687808 12564933 12444404
12429 12444404 12310577 12172485 12052507 11936916 11801513 11671762 11558351 11430417 11315557
12420 11315557 11132760 10938342 10788634 10661481 10506226 10350967 10207603 10066331 9935380
12411 9935380 9847721 9745587 9602808 9498847 9388064 9286794 9227689 9187261 9206013 9338968
$$ packed form
12481A3332719J19421J23306J13082J23822J10743R9449R4785P9587P5455R3051
12471A4365420J04786J09408P3590Q9452R7917R2948J6431r772k8132k2143k6114
12460A4863791j5673j6671j3564l0775j7192l8909k2032m4404n7478k9616o0561
12449A4516916p8070o2249n5562p6986r7839j05211q7718p7200j11550q9135r4166
12438A3581230j19457j35594j38674j26692j04131j19874j49000j22875j20529
12429A2444404j33827j38092j19978j15591j35403j29751j13411j27934j14860
12420A1315557j82797j94418j49708j27153j55255j55259j43364j41272j30951
12411I935380q7659j02134j42779j03961j10783j01270n9105m0428J8752J32955
$$ plain form
12401 9338968 9604892 10012757 10452740 10559007 10308564 9776739 9070561 8505532 8135319
12392 8135319 7889624 7705301 7547786 7359752 7200338 7090948 6968009 6848371 6734251
12383 6734251 6602578 6471430 6353666 6245684 6161288 6063829 5978296 5860686 5768801 5693944
12373 5693944 5597027 5506480 5417011 5328277 5254536 5180813 5106523 5026230 4949763 4875592 4823641
12362 4823641 4750981 4682044 4630070 4571690 4499705 4412293 4337666 4280714 4231687 4169360 4098101
12351 4098101 4023902 3952789 3903245 3867827 3816996 3752224 3713864 3664369 3621500 3586172 3542864
12340 3542864 3514109 3465929 3397457 3333371 3306403 3284697 3271099 3209002 3160493 3118281 3091499
12329 3091499 3040152 2993049 2976587 2952244 2900897 2877743 2840146 2800795 2800156 2773899 2762705 2765193
$$ packed form
12401I338968K65924M07865M39983J06267k50443n31825p06178n65029l70213
12392H135319k45695j84323j57515j88034j59414j09390j22939j19638j14120
12383F734251j31673j31148j17764j07982q4396r7459q5533j17610r1885p4857
12373E693944r6917r0547q9469q8734p3741p3723p4290q0293p6467p4171n1951
12362D823641p2660o8937n1974n8380p1985q7412p4627n6952m9027o2327p1259
12351D098101p4199p1113m9544l5418n0831o4772l8360m9495m2869l5328m3308
12340C542864k8755m8180o8472o4086k6968k1706j3598o2097m8509m2212k6782
12329C091499n1347m7103j6462k4343n1347k3154l7597l9351o39k6257j1194K488
$$ plain form
12317 2765193 2724454 2682304 2653730 2600377 2551523 2486109 2447790 2436739 2389065 2352328 2328445
12306 2328445 2304674 2275206 2243908 2224099 2179109 2150412 2160583 2171297 2152823 2107537 2066739
12295 2066739 2013412 1970958 1943692 1923564 1914427 1912440 1897114 1868595 1863842 1847165 1816957 1783954
12283 1783954 1778911 1776021 1747852 1724257 1700366 1707372 1691105 1692666 1677062 1652472 1620041 1583975
12271 1583975 1583242 1571050 1543221 1503236 1499192 1492516 1472399 1450448 1429738 1423307 1408695 1393482
12259 1393482 1408975 1408991 1379302 1359503 1346990 1348367 1344083 1296388 1284488 1277580 1258417 1230271
12247 1230271 1238663 1236910 1219512 1206641 1208612 1219954 1206916 1167113 1120791 1094681 1090764 1073037
12235 1073037 1071834 1081164 1061508 1061231 1051567 1050689 1046153 1029621 1051334 1049017 1035462 1030160 1006011
$$ packed form
12317B765193m0739m2150k8574n3353m8854o5414l8319j1051m7674l6737k3883
12306B328445k3771k9468l1298j9809m4990k8697J0171J0714j8474m5286m0798
12295B066739n3327m2454k7266k0128r137j987j5326k8519m753j6677l0208l3003
12283A783954n043k890k8169k3595k3891P006j6267J561j5604k4590l2431l6066
12271A583975p33j2192k7829l9985m044o676k0117k1951k0710o431j4612j5213
12259A393482J5493J6k9689j9799j2513J377m284m7695j1900o908j9163k8146
12247A230271Q392j753j7398j2871J971J1342j3038l9803m6322k6110l917j7727
12235A073037j203R330j9656k77r664q78m536j6532K1713k317j3555n302k4149
$$ plain form
12222 1006011 1001010 966651 931062 915455 905862 933894 946586 928763 912305 935773 927869 925930
12210 925930 897704 915298 913477 893477 857098 847070 850173 854583 840815 833471 853505 844865
12198 844865 813711 802296 806033 796145 788354 785157 795431 783450 757691 747196 741371 742363 755985
12185 755985 751486 738193 720860 719803 718315 688576 672156 672561 670937 656386 652246 634768 620865
12172 620865 624586 628692 631099 641155 617370 618108 624027 612056 629723 633024 613741 592774 568225
12159 568225 558417 558786 533293 548020 553780 564301 574187 570350 551265 543342 549177 553369 533725
12146 533725 531071 540095 561368 571380 530386 508924 490126 517295 526531 538098 536466 529376
12134 529376 534047 533459 528695 546181 522898 509598 514554 510378 506180 480687 452392 438766 447096
$$ packed form
12222A006011n001l4359l5589j5607r593K8032J2692j7823j6458K3468p904j939
12210I25930k8226J7594j821k0000l6379j0028L103M410j3768p344K0034q640
12198H44865l1154j1415L737r888p791l197J0274j1981k5759j0495n825R92J3622
12185G55985m499j3293j7333j057j488k9739j6420M05j624j4551m140j7478j3903
12172F20865L721M106K407J0056k3785P38N919j1971J7667L301j9283k0967k4549
12159E68225r808L69k5493J4727N760J0521R886l837j9085p923N835M192j9644
12146E33725k654R024K1273J0012m0994k1462j8798K7169R236J1567j632p090
12134E29376M671n88m764J7486k3283j3300M956m176m198k5493k8295j3626Q330
$$ plain form
12121 447096 444745 448938 439659 440959 460148 468546 457515 450824 431892 446847 457411 439992 430923
12108 430923 448317 452684 431472 403149 395883 410723 413650 399656 391766 402453 409442 419354 403069
12095 403069 396376 401074 402907 387782 381358 373953 372573 384567 390588 380277 389744 383864 352857
12082 352857 330767 321411 310804 307983 318608 325742 331106 325734 303254 309708 318951 325826 335059
12069 335059 336911 319345 332515 316583 284906 300414 314982 309828 331423 339819 327908 301217
12057 301217 288672 278255 295867 333192 341855 328104 307456 293662 266588 267601 285043 298834
12045 298834 295457 272753 235374 224176 230521 256487 269995 277244 287496 275890 272089 257899
12033 257899 227919 230578 212272 221446 225144 246315 259025 252244 258465 272454 277723 264606 247116
$$ packed form
12121D47096k351M193r279J300J9189Q398j1031o691j8932J4955J0564j7419r069
12108D30923J7394M367k1212k8323p266J4840K927j3994p890J0687O989R912j6285
12095D03069o693M698J833j5125o424p405j380J1994O021j0311R467n880l1007
12082C52857k2090r356j0607k821J0625P134N364n372k2480O454R243O875R233
12069C35059J852j7566J3170j5932l1677J5508J4568n154K1595Q396j1911k6691
12057C01217j2545j0417J7612L7325Q663j3751k0648j3794k7074J013J7442J3791
12045B98834l377k2704l7379j1198O345K5966J3508P249J0252j1606l801j4190
12033B57899k9980K659j8306R174L698K1171J2710o781O221J3989N269j3117j7490
$$ plain form
12020 247116 250108 247025 269646 267580 242829 245246 234074 216193 213999 213798 231750 220666 232111
12007 232111 227984 230405 250816 252244 238603 224955 231967 257109 264236 268768 284630 275363 249585
11994 249585 253746 248264 250475 234030 240448 251124 266264 268787 218642 212252 203896 201280 192222
11981 192222 174239 186584 194958 199630 190695 189079 194959 204439 183215 167343 185294 179593 194732
11968 194732 221581 222228 207751 176729 180862 190803 171748 174032 169208 160195 152929 172397 140998
11955 140998 113143 108197 111132 146962 166422 157142 156118 171563 181585 155830 144376 158167
11943 158167 161534 144495 147012 174238 180488 161433 150251 135187 128415 156943 178338 178496 172324
11930 172324 160437 148888 154877 165559 173209 182988 175489 157714 145004 134736 148318 152955
$$ packed form
12020B47116K992l083K2621k066k4751K417j1172j7881k194k01J7952j1084J1445
12007B32111m127K421K0411J428j3641j3648P012K5142P127M532J5862r267k5778
11994B49585M161n482K211j6445O418J0676J5140K523n0145o390q356k616r058
11981A92222j7983J2345Q374M672q935j616N880R480k1224j5872J7951n701J5139
11968A94732K6849O47j4477l1022M133R941j9055K284m824r013p266J9468l1399
11955A40998k7855m946K935L5830J9460r280j024J5445J0022k5755j1454J3791
11943A58167L367j7039K517K7226O250j9055j1182j5064o772K8528K1395J58o172
11930A72324j1887j1549N989J0682P650R779p499j7775j2710j0268J3582M637
$$ plain form
11918 152955 160813 154142 142778 139965 117185 128500 134903 108888 134315 175296 179705 177350 172498
11905 172498 154823 143684 145546 116566 97367 90403 112807 105532 86561 79514 82535 102430
11893 102430 116604 88496 60554 67049 98234 94624 99951 118684 129862 113371 104161 115248
11881 115248 131292 139748 127693 132568 139129 128586 141428 143124 114244 94827 84882 49522
11869 49522 54196 62646 62758 87071 103883 116412 118108 107406 103767 106735 100890 73707 93117
11856 93117 101903 86256 89748 86847 87382 109202 112999 84956 56653 68609 93881 75000 79498
11843 79498 100904 102043 96299 111145 111969 121154 136569 149040 120328 83367 96701 114445 124240
11830 124240 105066 98961 113428 104707 103814 98434 77542 88352 114991 92975 80434 75785 85310
$$ packed form
11918A52955P858o671j1364k813k2780J1315O403k6015K5427M0981M409k355m852
11905A72498j7675j1139J862k8980j9199o964K2404p275j8971p047L021J9895
11893A02430J4174k8108k7942O495L1185l610N327J8733J1178j6491r210J1087
11881A15248J6044Q456j2055M875O561j0543J2842J696k8880j9417r945l5360
11869D9522M674Q450J12K4313J6812J2529J696j0702l639K968n845k7183J9410
11856I3117Q786j5647L492k901N35K1820L797k8043k8303J1956K5272j8881M498
11843G9498K1406J139n744J4846Q24R185J5415J2471k8712l6961J3334J7744R795
11830A24240j9174o105J4467q721q93n380k0892J0810K6639k2016j2541m649R525
$$ plain form
11817 85310 81719 75091 61618 34956 31997 65461 52385 56340 68084 63652 51035 41588 52220
11804 52220 66037 61001 50721 42326 56821 56518 55126 47118 60374 63481 56793 34144 19985
11791 19985 30897 41806 27766 31243 48791 77254 47095 36137 38076 56883 51006 52611
11779 52611 44498 51734 68364 84124 102246 75995 61876 66403 49352 54559 100119 102572 61364
11766 61364 61144 66623 53130 33263 29083 44443 51719 57213 48553 34795 65021 82298 68693
11753 68693 49887 35832 55570 53279 40813 37342 60009 55613 45763 41500 45491 52119 40021
11740 40021 54462 60854 43065 45683 29674 4964 6960 19189 29960 38208 39985 48712 54913
11727 54913 63073 61199 42635 37159 53192 45574 50618 60683 71147 78977 102646 83999 69282
$$ packed form
11817H5310l591o628j3473k6662k959L3464j3076L955J1744m432j2617r447J0632
11804E2220J3817n036j0280q395J4495l03j392q008J3256L107o688k2649j4159
11791A9985J0912J0909j4040L477J7548K8463l0159j0958J939J8807n877J605
11779E2611q113P236J6630J5760J8122k6251j4119M527j7051N207M5560K453m1208
11766F1364k20N479j3493j9867m180J5360P276N494q660j3758L0226J7277j3605
11753F8693j8806j4055J9738k291j2466l471K2667m396r850m263L991O628j2098
11740D0021J4441O392j7789K618j6009k4710J996J2229J0771Q248J777Q727O201
11727E4913Q160j874j8564n476J6033p618N044J0065J0464P830K3669j8647j4717
$$ plain form
11714 69282 63136 38729 15670 39787 46352 37359 56116 58487 45591 21129 27058 39420 22691
11701 22691 34377 42817 46339 60750 58513 61190 76065 84576 103601 103396 89217 71648 41705
11688 41705 16525 16979 13265 10388 7091 34648 41019 46611 71855 53407 59878 79899 79845 74724
11674 74724 41781 36575 31481 27614 30605 43111 42220 51203 57214 35135 16138 11163 28939
11661 28939 23803 12628 16036 23203 22850 13561 27821 30749 -5056 4291 15969 41869 63713
11648 63713 91377 87169 67308 45872 36353 47767 35709 39352 38574 21446 -4803 -17695 -2682
11635 -2682 24379 13233 4286 8769 26059 45010 49562 36078 36635 39408 53978 36936 21705
11622 21705 1161 -3949 23368 33145 37875 45604 49190 25822 5422 19474 25033 16828 30926
$$ packed form
11714F9282o146k4407k3059K4117O565q993J8757K371j2896k4462N929J2362j6729
11701B2691J1686Q440L522J4411k237K677J4875Q511J9025k05j4179j7569k9943
11688D1705k5180M54l714k877l297K7557O371N592K5244j8448O471K0021n4n121
11674G4724l2943n206n094l867K991J2506q91Q983O011k2079j8997m975J7776
11661B8939n136j1175L408P167l53r289J4260K928l5805R347J1678K5900K1844
11648F3713K7664m208j9861k1436r519J1414j2058L643p78j7128k6249j2892J5013
11635b682K7061j1146q947M483J7290J8951M552j3484N57K773J4570j7042j5231
11622B1705k0544n110K7317R777M730P729L586k3368k0400J4052N559q205J4098
$$ plain form
11609 30926 46035 25072 5485 6385 -2383 8689 36614 40626 31098 16282 -6067 6229 17855
11596 17855 7767 2905 3368 -10615 -6199 -3546 -1720 1901 -2064 -12296 -14450 1909 2138 -789
11582 -789 -945 -23157 -30249 4009 4409 -8641 -8161 -6016 -374 102 7438 3049 -1265 -1107 16619
11567 16619 16918 35168 55853 69183 50978 37884 34593 22467 2037 11637 36728 50016
11555 50016 39200 34860 38011 32944 50156 51403 25800 -3175 -6974 1240 15972 26631 8149
11542 8149 2955 1224 -16626 -33929 -20298 -9519 -12778 2570 3282 1304 -13046 1168 9606
11529 9606 -3256 6688 20693 29043 18800 23717 10336 4848 -4778 3447 -12205 -28908 -28397
11516 -28397 -6685 1554 16852 14206 -26073 -52852 -33384 -7322 -14795 -21969 -4326 3701 3988
$$ packed form
11609C0926J5109k0963j9587R00q768J1072K7925M012r528j4816k2349J2296J1626
11596A7855j0088m862M63j3983M416K653J826L621l965j0232k154J6359K29k927
11582g89j56k2212p092L4258M00j3050M80K145N642M76P336m389m314J58J7726
11567A6619K99J8250K0685J3330j8205j3094l291j2126k0430R600K5091J3288
11555E0016j0816m340L151n067J7212J247k5603k8975l799Q214J4732J0659j8482
11542H149n194j731j7850j7303J3631J0779l259J5348P12j978j4350J4214Q438
11529I606j2862R944J4005Q350j0243M917j3381n488r626Q225j5652j6703N11
11516b8397K1712Q239J5298k646m0279k6779J9468K6062p473p174J7643Q027K87
$$ plain form
11503 3988 22151 30256 36143 38661 40702 23958 11945 14224 9147 26078 34112 28880 35642 33159
11489 33159 -4997 -2396 7134 17103 26066 18968 3978 16098 19964 19301 -8157 -21577 -5983
11476 -5983 6791 775 18958 34258 41601 44260 66167 72702 48876 58514 37416 29526 13065
11463 13065 7171 28329 23387 6077 -3574 -6137 -4721 -16728 -4216 9320 13416 20164 33488
11450 33488 52815 44858 30469 21686 17812 10647 6624 8381 13749 16484 19792 1513 2185 27988
11436 27988 21235 22845 41078 43949 22184 8625 5621 32484 39266 10389 -2329 20125 51644
11423 51644 39325 43919 35083 13320 -4504 -7545 1702 9769 -1127 -7609 -2930 1379 12473
11410 12473 753 5821 13005 -4837 -30866 -28073 13415 37845 51087 39721 11212 7804
$$ packed form
11503C988J8163Q105N887K518K041j6744j2013K279n077J6931Q034n232O762k483
11489C3159l8156K601R530R969Q963p098j4990J2120L866o63k7458j3420J5594
11476e983J2774o016J8183J5300P343K659K1907O535k3826R638k1098p890j6461
11463A3065n894K1158m942j7310r651k563J416j2007J2512J3536M096O748J3324
11450C3488J9327p957j4389q783l874p165m023J757N368K735L308j8279O72K5803
11436B7988o753J610J8233K871k1765j3559l004K6863O782k8877j2718K2454L1519
11423E1644j2319M594q836k1763j7824l041R247Q067j0896o482M679M309J1094
11410A2473j1720N068P184j7842k6029K793M1488K4430J3242j1366k8509l408
$$ plain form
11398 7804 -11441 -12171 -8297 -6097 -26592 -41188 -33529 -9632 8214 14197 15562 6143 2023 5765
11384 5765 12432 20262 38143 48014 37423 22811 22729 22997 24497 38309 40802 15662 -4594 22868
11370 22868 20286 9619 18752 19202 16759 -8533 -4556 27423 30100 18195 -22035 -42227 -21264
11357 -21264 2660 2871 9487 18183 43404 65072 34748 14101 26675 2031 5395 29035 47581
11344 47581 39774 39011 34871 63483 52299 31077 31114 45397 36413 9904 33553 29423 27588 46746
11330 46746 33119 10511 16618 40736 35079 37508 59541 81495 53195 33613 20561 16037
11318 16037 15565 19767 -5955 -5718 22072 51039 47224 34665 16163 15532 6122 22694 31106 54066
11304 54066 64811 67993 58355 23709 -16066 -18630 -24832 -24678 -3497 6611 29576 34413 46467
$$ packed form
11398G804j9245p30L874K200k0495j4596P659K3897J7846N983J365r419m120L742
11384E765O667P830J7881R871j0591j4612q2K68J500J3812K493k5140k0256K7462
11370B2868k582j0667R133M50k443k5292L977L1979K677j1905m0230k0192K0963
11357b1264K3924K11O616Q696K5221K1668l0324k0647J2574k4644L364K3640J8546
11344D7581p807p63m140K8612j1184k1222L7J4283q984k6509K3649m130j835J9158
11330D6746j3627k2608O107K4118n657K429K2033K1954k8300j9582j3052m524
11318A6037m72M202k5722K37K7790K8967l815j2559j8502o31r410J6572Q412K2960
11304E4066J0745L182r638l4646l9775k564o202J54K1181J0108K2965M837J2054
$$ plain form
11291 46467 33989 25019 38298 26080 10066 17571 20369 21437 27308 23256 19384 34597 18920
11278 18920 -4253 -6077 -694 -3159 -3217 30381 44052 31639 19225 26672 12172 21352 27649
11265 27649 3459 -9630 -9521 -14040 1034 18367 28892 41176 14683 -7625 -17323 -6098
11253 -6098 -6998 -20723 -3601 18129 2427 -37383 -26523 -9201 8786 -5006 -20681 -19172
11241 -19172 -630 13822 31238 15067 10816 -5649 -27439 -45943 -40532 -46091 -42419 -11178
11229 -11178 20403 17665 -19801 -15664 -1674 -11061 -49897 -47639 -16739 830 -1020 16487 41475
11216 41475 38259 20338 -14841 -36102 -13677 8221 -3428 -10908 8255 9888 17544 13182 -13427
11203 -13427 -21091 -20314 -15153 -28894 -23834 -11986 -21506 -33239 -11469 -5414 -14731 2630 25221
$$ packed form
11291D6467j2478q970J3279j2218j6014P505K798J068N871m052l872J5213j5677
11278A8920k3173j824N383k465n8L3598J3671j2413j2414P447j4500R180O297
11265B7649k4190j3089J09m519J5074J7333J0525J2284k6493k2308r698J1225
11253f098r00j3725J7122K1730j5702l9810J0860J7322J7987j3792j5675J509
11241a9172J8542J4452J7416j6171m251j6465k1790j8504N411n559L672L1241
11229a1178L1581k738l7466M137J3990r387l8836K258L0900J7569j850J7507K4988
11216D1475l216j7921l5179k1261K2425K1898j1649p480J9163J633P656m362k6609
11203a3427p664P77N161j3741N060J1848r520j1733K1770O055r317J7361K2591
$$ plain form
11190 25221 27910 32966 33248 32468 32561 34072 30322 20623 -6 188 3334 1589 1033 10702 1957 -5512
11174 -5512 1433 6261 -11630 -16941 -14684 -27638 -35184 -33731 -3007 11547 17896 23272 13430 -1710
11160 -1710 2033 18505 20647 -5607 -26025 -12121 7314 -15490 -23057 -22831 -422 4869 -1753
11147 -1753 -3992 -28529 -34126 -18478 -7808 -21952 -18876 -7441 -4398 -10142 -25625 -10594 2514
11134 2514 -1163 2367 7688 4939 -9796 -23114 -14789 6767 10556 5197 2927 -10703 -18693 -13083
11120 -13083 -5841 367 -3007 1229 17246 29544 43649 62951 44352 23564 39714 35699 17251
11107 17251 9622 -9043 -12460 8218 12676 6457 27499 36300 10988 -4839 5727 4234 9057
11094 9057 14275 18968 22455 28242 30218 42251 13742 -16107 -39094 -31480 -6771 -22625 -17160
$$ packed form
11190B5221K689N056K82p80R3J511l750r699k0629J94L146j745n56R669q745p469
11174e512O945M828j7891n311K257j2954p546J453L0724J4554O349N376r842j5140
11160a710L743J6472K142k6254k0418J3904J9435k2804p567K26K2409N291o622
11147a753k239k4537n597J5648J0670j4144L076J1435L043n744j5483J5031J3108
11134B514l677L530N321k749j4735j3318Q325K1556L789n359k270j3630p990N610
11120a3083P242O208l374M236J6017J2298J4105J9302j8599k0788J6150m015j8448
11107A7251p629j8665l417K0678M458o219K1042Q801k5312j5827J0566j493M823
11094I057N218M693L487N787J976J2033k8509k9849k2987P614K4709j5854N465
$$ plain form
11081 -17160 -8153 11460 -10570 -41344 -49643 -17829 -19714 -19765 -11294 -19410 3742 21133 50288
11068 50288 52059 37948 36511 54060 53491 44252 36212 9977 -11582 3714 8168 6182 16071
11055 16071 12212 28476 20940 7890 21903 7453 -7417 -6887 -18552 -11985 2700 1557 -8039
11042 -8039 -17203 -27838 -20920 -33789 -26131 -12845 -3522 690 -18451 -27519 11691 36614 39415
11029 39415 33070 20328 17236 6635 6647 -10081 -19427 -11587 4548 7310 3961 -8440 -11955 -29431
11015 -29431 -46868 -57923 -40516 -1697 8009 -10278 -5613 -1495 -5534 -14999 1931 25155 23225
11002 23225 24189 23156 14754 20427 30320 35331 26099 18755 4995 5450 -4603 615 16197 -3439
10988 -3439 -14170 -6541 1915 10114 19219 19771 -152 -5132 -17836 -11048 -34118 -42883 -16353 -18854
$$ packed form
11081a7160R007J9613k2030l0774q299L1814j885n1Q471q116K3152J7391K9155
11068E0288J771j4111j437J7549n69r239q040k6235k1559J5296M454j986R889
11055A6071l859J6264p536j3050J4013j4450j4870N30j1665O567J4685j143r596
11042h039r164j0635O918j2869P658J3286R323M212j9141r068L9210K4923K801
11029C9415o345j2742l092j0601J2j6728r346P840J6135K762l349j2401l515j7476
11015b9431j7437j1055J7407L8819R706j8287M665M118m039r465J6930K3224j930
11002B3225R64j033q402N673R893N011r232p344j3760M55j0053N218J5582j9636
10988c439j0731P629Q456Q199R105N52j9923m980j2704O788k3070q765K6530k501
$$ plain form
10974 -18854 -10327 -7244 -5593 -18009 -12089 -18127 -22287 -28373 -43810 -39107 -46075 -45259 -3702 41519
10960 41519 33365 2179 -32995 -49925 -34966 -32497 -37724 -39851 -38289 -18516 13700 9353 -20796
10947 -20796 -23612 -21452 -12292 -6508 5771 -21478 -5148 -1399 -29945 -27898 -42471 -36224 -25812
10934 -25812 -21839 2152 33576 36845 17409 -954 -8428 19867 58628 39790 -1555 -18064
10922 -18064 3711 3958 -5007 11303 26217 14019 3787 -2496 5256 6358 2869 15104 10846
10909 10846 6665 30762 54572 47464 20698 -6958 -3092 -14470 -10791 -8387 -9496 -16826 -12495
10896 -12495 12919 13134 26648 23673 17618 419 -23038 -18833 -2608 2857 10078 10928 -31802
10883 -31802 -37379 -44808 -51730 -28071 -5294 8507 -1867 -15529 -15 3041 -23646 -11376
$$ packed form
10974a8854Q527L083J651j2416N920o038m160o086j5437M703o968Q16M1557M5221
10960D1519q154l1186l5174j6930J4959K469n227k127J562J9773L2216m347l0149
10947b0796k816K160R160N784J2279k7249J6330L749k8546K047j4573O247J0412
10934b5812L973K3991L1424L269j9436j8363p474K8295L8761j8838m1345j6509
10922a8064K1775K47q965J6310J4914j2198j0232o283P752J102l489J2235m258
10909A0846m181K4097K3810p108k6766k7656L866j1378L679K404j109p330M331
10896a2495K5414K15J3514k975o055j7199k3457M205J6225N465P221Q50m2730
10883c1802n577p429o922K3659K2777J3801j0374j3662J5514L056k6687J2270
$$ plain form
10871 -11376 12536 16616 -14759 -32225 -49389 -39299 -33808 -9392 7194 6362 -18811 -34297
10859 -34297 -48246 -54123 -36268 -6144 5437 1987 7801 34317 49896 18664 -1512 -6883
10847 -6883 -14547 -28706 -21600 -21532 -31529 -28997 -23511 -5780 1350 -5269 -18548 2556 42530 56043
10833 56043 39424 18001 8977 -1024 -11069 -21789 -1871 516 -8840 -14953 9095 18097 1415
10820 1415 -13786 2056 -3664 4012 14209 25210 38009 54235 23492 9375 18332 2655
10808 2655 14475 30905 20949 37956 34324 27649 52442 35788 26799 30595 26613 16637 12029
10795 12029 3707 -4091 8143 46676 29133 14947 11406 -5737 -16410 -15993 12460 24497 6855
10782 6855 -8639 -22256 -31310 -26799 -8351 4587 10900 34589 40380 37189 23829 5415 12849
$$ packed form
10871a1376K3912M080l1375j7466j7164J0090N491K4416J6586q32k5173j5486
10859c4297j3949n877J7855L0124J1581l450N814K6516J5579l1232k0176n371
10847f883p664j4159P106O8r997K532N486J7731P130o619j3279K1104L9974J3513
10833E6043j6619k1423r024j0001j0045j0720J9918K387r356o113K4048R002j6682
10820A415j5201J5842n720P676J0197J1001J2799J6226l0743j4117Q957j5677
10808B655J1820J6430r956J7007l632o675K4793j6654q989L796l982r976m608
10795A2029q322p798J2234L8533j7543j4186l541j7143j0673M17K8453J2037j7642
10782F855j5494j3617r054M511J8448J2938O313K3689N791l191j3360j8414P434
$$ plain form
10769 12849 22261 34071 20948 3434 13270 29124 46321 60845 56503 39511 22155 24533
10757 24533 18976 14073 14249 -16137 -20926 -23477 1217 37082 27527 7198 7198 10138 21174 -2711
10743 -2711 8636 30955 25670 29442 28494 27232 36706 29255 5801 -9256 2869 5323 -6283
10730 -6283 -9807 8208 5534 9483 18742 19488 29726 39820 49823 53871 36169 7841 14220
10717 14220 -9552 7994 38190 30483 36847 34611 36054 6603 -33024 -36219 -27008 -19772 -20175
10704 -20175 -15937 4737 17058 45011 51316 59121 45276 54364 53594 56350 48820 49026 41731 36146
10690 36146 19474 11518 26926 8510 18999 25201 32033 34446 41009 35510 7899 19657 36055
10677 36055 46396 43029 35680 8022 2946 16430 20588 6317 -4708 6586 32410 48127
$$ packed form
10769A2849R412J1810j3123j7514R836J5854J7197J4524m342j6992j7356K378
10757B4533n557m903J76l0386m789k551K4694L5865r555k0329%K940J1036k3885
10743b711J1347K2319n285L772r48j262R474p451k3454j5057J2125K454j1606
10730f283l524J8015k674L949R259P46J0238J0094J0003M048j7702k8328O379
10717A4220k3772J7546L0196p707O364k236J443k9451l9627l195R211P236m03
10704b0175M238K0674J2321K7953O305P805j3845R088p70K756p530K06p295n585
10690C6146j6672p956J5408j8416J0489O202O832K413O563n499k7611J1758J6398
10677C6055J0341l367p349k7658n076J3484M158j4271j1025J1294K5824J5717
$$ plain form
10665 48127 50278 20752 9088 -5879 -11516 -9742 -4436 -15316 -27109 -8611 10720 -2049
10653 -2049 -29721 -11358 711 -8492 -8353 -7391 -15247 -1835 3620 13700 22029 13466 -9882 -20494
10639 -20494 -5550 -12914 -25005 -1012 3484 -3024 2650 8664 5141 26703 47714 6205 16362
10626 16362 24486 12935 5209 14478 16713 24083 36722 51453 55625 55323 33362 7401 19916
10613 19916 31801 19490 41503 42216 38726 16205 7862 18950 31186 17738 7947 5542 20150
10600 20150 36890 19961 24103 12948 7690 -24 2481 -12041 -22783 -23584 -21860 -11694 4086
10587 4086 20683 12162 -14401 -22159 3537 38787 44112 35083 43196 65242 46755 48480 60429
10574 60429 45698 23979 21076 -1783 -8633 4410 33245 27101 14342 22308 17915 11852 7632
$$ packed form
10665D8127K151k9526j1664j4967n637J774N306j0880j1793J8498J9331j2769
10653b049k7672J8363J2069r203J39R62p856J3412N455J0080Q329q563k3348j0612
10639b0494J4944p364j2091K3993M496o508N674O014l523K1562K1011m1509J0157
10626A6362Q124j1551p726R269K235P370J2639J4731M172l02k1961k5961J2515
10613A9916J1885j2311K2013P13l490k2521q343J1088J2236j3448r791k405J4608
10600B0150J6740j6929M142j1155n258p714K505j4522j0742q01J724J0166J5780
10587D086J6597q521k6563p758K5696L5250N325r029Q113K2046j8487J725J1949
10574F0429j4731k1719k903k2859o850J3043K8835o144j2759P966m393o063m220
$$ plain form
10561 7632 -2532 -22406 1998 3204 8223 8005 8496 -2214 -9954 -11864 -6849 -19713 1909 17468
10547 17468 6107 -13437 -13237 -815 -1857 -3845 -16157 -30490 -20645 -6904 17490 17294 44780
10534 44780 26469 43675 66747 45542 27196 25396 26092 27748 19883 28317 37044 43427 62072
10521 62072 64483 54148 34082 31839 2163 5673 2058 16794 16868 45992 42154 36422 12151
10508 12151 27605 38494 18051 24212 26587 20349 27513 29151 33778 10414 6505 -14219 -28490
10495 -28490 -21898 -10847 -2514 8959 29379 29937 2608 11386 34275 43974 51168 69397 62864
10482 62864 59166 38113 26414 35779 44009 38951 38395 21227 -3078 -1043 -3065 -10823 -25627
10469 -25627 -29448 -9956 -3701 8838 975 -3890 20931 31591 33538 27019 34709 53656 55375
$$ packed form
10561G632j0164j9874K4404J206N019k18M91j0710p740j910N015j2864K1622J5559
10547A7468j1361j9544K00J2422j042j988j2312j4333R845J3741K4394j96K7486
10534D4780j8311J7206K3072k1205j8346j800O96J656p865Q434Q727O383J8645
10521F2072K411j0335k0066k243k9676L510l615J4736P4K9124l838n732k4271
10508A2151J5454J0889k0443O161K375o238P164J638M627k3364l909k0724j4271
10495b8490O592J1051Q333J1473K0420N58k7329Q778K2889R699P194J8229o533
10482F2864l698k1053j1699R365Q230n058n56j7168k4305K035k022p758j4804
10469b5627l821J9492O255J2539p863m865K4821J0660J947o519P690J8947J719
$$ plain form
10456 55375 47007 55615 40973 31037 18995 28512 46683 -2027 -25575 -25742 -9612 -4031 22595
10443 22595 44978 39088 42800 51182 52491 57865 60598 43593 40368 23636 25531 43888 29472
10430 29472 37460 41920 22231 24857 37226 46879 67356 60834 50541 43080 38312 20923 34300
10417 34300 49206 69821 52146 33909 24969 10441 -58 -13359 -340 11852 -6778 8250
10405 8250 16393 19284 23215 30931 24110 22862 32949 45602 58463 80150 58767 24416 23679
10392 23679 12656 669 10642 42086 32763 30369 34760 10482 -3078 -1257 -2334 7788 1846
10379 1846 19921 60018 54928 32503 12473 8831 4764 13306 7939 -349 6292 1883 9664 16826
10365 16826 31359 20444 15249 18813 12421 36779 56611 49431 40662 37242 49452 55474 50579
$$ packed form
10456E5375q368Q608j4642r936j2042R517J8171m8710k3548j67J6130N581K6626
10443B2595K2383n890L712Q382J309N374K733j7005l225j6732J895J8357j4416
10430B9472P988M460j9689K626J2369R653K0477o522j0293p461m768j7389J3377
10417C4300J4906K0615j7675j8237q940j4528j0499j3301J3019J2192j8630J5028
10405H250Q143K891L931P716o821j248J0087J2653J2861K1687k1383l4351p37
10392B3679j1023j1987R973L1444r323k394M391k4278j3560J821j077J0122n942
10379A846J8075M0097n090k2425k0030l642m067Q542n367q288O641m409P781P162
10365A6826J4533j0915n195L564o392K4358J9832p180q769l420J2210O022m895
$$ plain form
10352 50579 53399 34878 19788 12781 6867 9403 19743 21605 14529 1574 7707 23576 34938
10339 34938 12394 3901 14555 21853 42063 40702 35201 46154 30180 20095 24396 30664 34725
10326 34725 11820 16492 39734 24555 15235 17047 31632 34988 56769 51904 58525 54799 44429
10313 44429 25066 20671 16715 15888 3368 16039 26809 28268 12537 -7416 13486 24490 21221
10300 21221 8286 21118 32520 15752 4965 27185 33767 17058 26263 44688 23765 18718
10288 18718 30352 34341 20461 9137 4788 4746 45847 45101 34293 24048 27792 12836 22659
10275 22659 47657 40208 46222 23299 30822 27544 26468 16129 18950 9929 17992 20312 28656 37703
10261 37703 47114 47510 36315 28098 20603 46428 65158 73175 73976 63241 69402 87790 73352
$$ packed form
10352E0579K820j8521j5090p007n914K536J0340J862p076j2955O133J5869J1362
10339C4938k2544q493J0654P298K0210j361n501J0953j5974j0085M301O268M061
10326C4725k2905M672K3242j5179r320J812J4585L356K1781m865O621l726j0370
10313D4429j9363m395l956q27j2520J2671J0770J459j5731j9953K0902J1004l269
10300B1221j2935J2832J1402j6768j0787K2220O582j6709R205J8425k0923n047
10288A8718J1634L989j3880j1324m349m2M1101p46j0808j0245L744j4956R823
10275B2659K4998p449O014k2923P523l278j076j0339K821r021Q063K320Q344R047
10261C7703R411L96j1195q217p495K5825J8730Q017Q01j0735O161J8388j4438
$$ plain form
10248 73352 62820 60955 45884 31699 31920 32291 15259 6105 20212 54933 54572 31980 8893
10235 8893 -10029 -226 34812 66668 88417 76232 62520 37686 45428 55401 44433 59114
10223 59114 62451 44427 33921 53712 55624 60115 49804 28279 18702 24904 36398 47311 35199
10210 35199 9804 14851 1153 -9077 12746 12950 9955 17374 45192 49217 60131 42508 39202
10197 39202 47227 47550 46158 58529 56623 33092 33462 51155 54361 66172 60514 35274 -4217
10184 -4217 -37808 -24842 5834 12790 10799 50859 64397 66478 42927 34436 38063 47530 34697
10171 34697 25991 38247 32198 7372 11587 59240 76682 74461 71329 76783 73546 86937 91397
10158 91397 101281 96382 88093 83811 75004 57213 30018 18395 21498 32501 19424 18806 39196
$$ packed form
10248G3352j0532j865j5071j4185K21L71j7032r154J4107L4721l61k2592k3087
10235H893j8922R803L5038L1856K1749j2185j3712k4834P742R973j0968J4681
10223E9114L337j8024j0506J9791J912M491j0311k1525r577O202J1494J0913j2112
10210C5199k5395N047j3698j0230K1823K04k995P419K7818M025J0914j7623l306
10197C9202Q025L23j392J2371j906k3531L70J7693L206J1811n658k5240l9491
10184d217l3591J2966L0676O956j991M0060J3538K081k3551q491L627R467j2833
10171C4697q706J2256o049k4826M215M7653J7442k221l132N454l237J3391M460
10158I1397R884m899q289m282q807j7791k7195j1623L103J1003j3077o18K0390
$$ plain form
10145 39196 30002 23849 31197 25738 30780 50285 78287 77488 69342 87420 59220 51200 57449 61905
10131 61905 81507 100308 97051 94332 79058 60791 54833 81597 84389 84551 83091 69410 48784
10118 48784 51972 87898 66646 67667 74164 89746 124157 142206 144560 132103 115624 117846 117933
10105 117933 124972 140972 148732 148593 179231 199404 221170 281279 341468 410516 497393 635261
10093 635261 881442 1214838 1544199 1698722 1601474 1310960 993067 746415 581611 504683
10083 504683 433898 378235 342836 334050 309664 271379 248503 240749 247585 227761 206179 209773
10071 209773 198307 200347 179412 190380 192481 171361 156648 169789 167947 179884 189597 185126
10059 185126 158616 161877 212258 233388 244922 256871 299058 366166 439833 543512 692310
$$ packed form
10145C9196r194o153P348n459N042J9505K8002p99q146J8078k8200q020O249M456
10131F1905J9602J8801l257k719j5274j8267n958K6764K792J62j460j3681k0626
10118D8784L188L5926k1252J021O497J5582L4411J8049K354j2457j6479K222Q7
10105A17933P039J6000P760j39L0638K0173K1766O0109O0189O9048Q6877J37868
10093F35261K46181L33396L29361J54523r7248k90514l17893k46652j64804p6928
10083E04683p0785n5663l5399q786k4386l8285k2876p754O836j9824k1582L594
10071B09773j1466K040k0935J0968K101k1120j4713J3141j842J1937R713m471
10059A85126k6510L261N0381K1130J1534J1949M2187O7108P3667J03679J48798
$$ plain form
10048 692310 964270 1460222 2365607 3709638 5100764 4923349 3035035 1819216 1256602
10039 1256602 970633 796211 664310 557692 481623 435298 410694 405497 377528 345959 316145
10028 316145 284878 276917 264117 236317 215053 191783 173112 166168 168100 186594 184498 181208
10016 181208 172162 117648 58214 51729 78524 99110 96412 106165 85667 81173 91056 72080 54389
10003 54389 58633 68284 54521 64646 52881 42930 65209 66386 85971 93783 94648 98139 95737
9990 95737 99074 106640 98554 98155 80656 58254 52452 56260 46042 39492 52918 31400 4042
9977 4042 24811 45249 64381 94966 114880 116701 131228 142318 144096 136270 118477 112535 106671
9964 106671 91369 95787 98734 91394 63506 67708 58208 50694 50149 81793 101513 91718 96224 82471
$$ packed form
10048F92310K71960M95952R05385J344031J391126j77415j888314j215819n62614
10039A256602k85969j74422j31901j06618p6069m6325k4604n197k7969l1569k9814
10028C16145l1267p961j2800k7800k1264k3270j8671o944J932J8494k096l290
10016A81208r046n4514n9434o485K6795K0586k698R753k0498m494R883j8976j7691
10003E4389M244R651j3763J0125j1765r951K2279J177J9585P812Q65L491k402
9990I5737L337P566q086l99j7499k2402n802L808j0218o550J3426k1518k7358
9977D042K0769K0438J9132L0585J9914J821J4527J1090J778p826j7793n942n864
9964A06671j5302M418K947p340k7888M202r500p514n45L1644J9720r795M506j3753
$$ plain form
9950 82471 86897 112505 104435 97093 85613 58399 51604 78164 80641 51904 67926 77641 63437
9937 63437 60087 50665 59798 82456 58748 16098 -6738 11389 23048 40789 41606 58122 61766
9924 61766 68512 53971 70676 77744 87384 92435 90165 61447 50648 35450 -594 -32210 -22638
9911 -22638 14378 24413 35779 40171 30882 12667 27012 32030 39654 48853 40705 52734 60964
9898 60964 60820 80843 67923 47962 33755 50191 69874 48150 34846 45649 65665 72250
9886 72250 95241 137453 128119 93670 77774 57574 32351 23346 27589 19658 52809 90016 95254
9873 95254 97981 105015 89129 75118 69774 58018 52482 50096 50215 58729 58410 50439 57843 61316
9859 61316 82578 65361 59419 64248 77177 76177 72199 68497 65795 31457 28104 30366 44051
$$ packed form
9950H2471M426K5608q070p342j1480k7214o795K6560K477k8737J6022R715j4204
9937F3437l350r422R133K2658k3708m2650k2836J8127J1659J7741Q17J6516L644
9924F1766O746j4541J6705P068R640N051k270k8718j0799j5198l6044l1616R572
9911b2638L7016J0035J1366M392r289j8215J4345N018P624R199q148J2029Q230
9898F0964j44K0023j2920j9961j4207J6436J9683k1724j3304J0803K0016O585
9886G2250K2991M2212r334l4449j5896k0200k5223r005M243p931L3151L7207N238
9873I5254K727P034j5886j4011n344j1756n536k386J19Q514l19p971P404L473
9859F1316K1262j7217n942M829J2929j000l978l702k702l4338l353K262J3685
$$ plain form
9846 44051 41590 40247 46394 55156 24739 37693 54543 83389 75217 56299 62528 62644 57998 63102
9832 63102 63850 45511 36546 26521 25165 27981 49030 68330 74052 76030 76007 67884 72416 81225
9818 81225 74700 65369 57508 57908 71468 56928 37689 29899 47531 80473 80850 63553 58339 67511
9804 67511 41052 38812 29579 32155 35312 37452 39212 36184 43940 66228 67957 47829 43757 62721
9790 62721 64135 19031 21509 57478 68540 71287 77467 61409 40201 26378 24361 60380 86599
9777 86599 89042 78415 101617 95370 67788 63094 57612 49163 59816 74199 85335 83498 69371
9764 69371 66625 75365 69950 68130 63238 98233 109504 110085 91631 49452 29803 51425 57046
9751 57046 38323 34084 27974 21317 25302 45510 57779 36567 50784 96469 104892 99563 96873
$$ packed form
9846D4051k461j343O147Q762l0417J2954J6850K8846q172j8918O229J16m646N104
9832F3102P48j8339q965j0025j356K816K1049J9300N722J978k3q123M532Q809
9818H1225o525r331p861M00J3560j4540j9239p790J7632L2942L77j7297n214R172
9804F7511k6459k240r233K576L157K140J760l028P756K2288J729k0128m072J8964
9790F2721J414m5104K478L5969J1062K747O180j6058k1208j3823k017L6019K6219
9777H6599K443j0627K3202o247k7582m694n482q449J0653J4383J1136j837j4127
9764F9371k746Q740n415j820m892L4995J1271N81j8454m2179j9649K1622N621
9751E7046j8723m239o110o657L985K0208J2269k1212J4217M5685Q423n329k690
$$ plain form
9738 96873 87284 79582 81237 70291 71310 73916 74849 49167 36911 50812 51941 48861 48474 45483
9724 45483 58176 81246 84510 81361 76360 96394 112381 122907 128591 127915 117748 85361 81771
9711 81771 92334 86298 57106 54183 67927 76551 90181 92491 80273 56656 68800 94318 76523
9698 76523 60374 47754 44242 50119 56606 94577 120124 123625 120377 95656 83223 78435 65759
9685 65759 75821 83898 106859 130286 100028 96613 129742 107079 101076 111427 112590 117665 118894
9672 118894 99874 68259 53368 60855 64884 65852 60855 53737 50940 39163 50841 59891 65932
9659 65932 59862 54732 56710 77822 107010 108390 106806 106389 77521 91356 116490 123687 116092 86904
9645 86904 75592 95073 102678 95765 106839 123034 100221 83420 83691 96115 102929 89607 101975
$$ packed form
9738I6873r589p702J655j0946J019K606R33k5682j2256J3901J129l080l87k991
9724D5483J2693K3070L264l149n001K0034J5987J0526N684o76j0167l2387l590
9711H1771J0563o036k9192k923J3744Q624J3630K310j2218k3617J2144K5518j7795
9698G6523j6149j2620l512N877O487L7971K5547L501l248k4721j2433m788j2676
9685F5759J0062Q077K2961K3427l0258l415L3129k2663o003J0351J163N075J229
9672A18894j9020l1615j4891P487M029R68m997p118k797j1777J1678R050O041
9659F5932o070n130J978K1112K9188J380j584m17k8868J3835K5134P197p595k9188
9645H6904j1312J9481P605o913J1074J6195k2813j6801K71J2424O814j3322J2368
$$ plain form
9632 101975 120660 107192 74895 73726 92247 91275 101705 110082 95161 69873 52617 72043
9620 72043 114786 111546 95349 92931 89940 78513 49307 59558 67144 76197 97959 79899 84454
9607 84454 71216 89742 91989 77182 75542 82216 84153 70696 40503 42674 66911 77994 84442
9594 84442 76915 93163 116478 87566 69206 56017 54165 51337 38927 42752 46913 73669 96130
9581 96130 91414 53111 54132 63003 38808 26475 45263 61043 68819 82392 83617 100660 108906
9568 108906 109407 93953 77503 77394 64282 57481 62101 76591 102855 88152 47567 58794 80774
9555 80774 99485 77354 70962 79040 93046 79661 74267 94984 107352 103897 105547 120004 114776
9542 114776 98060 107020 126949 150795 136031 127564 138708 141362 174290 174839 172586 189233 208880
$$ packed form
9632A01975J8685j3468l2297j169J8521r72J0430Q377j4921k5288j7256J9426
9620G2043M2743l240j6197k418k991j1427k9206J0251P586R053K1762j8060M555
9607H4454j3238J8526K247j4807j640O674J937j3457l0193K171K4237J1083O448
9594H4442p527J6248K3315k8912j8360j3189j852k828j2410L825M161K6756K2461
9581I6130m716l8303J021Q871k4195j2333J8788J5780P776J3573J225J7043Q246
9568A08906N01j5454j6450j09j3112o801M620J4490K6264j4703m0585J1227K1980
9555H0774J8711k2131o392Q078J4006j3385n394K0717J2368l455J650J4457n228
9542A14776j6716Q960J9929K3846j4764q467J1144K654L2928N49k253J6647J9647
$$ plain form
9529 208880 226375 224312 269260 333970 400363 518874 704120 978588 1377286 1760245 1892387
9518 1892387 1662559 1287538 968109 728201 567400 476962 408847 351487 325302 299142
9508 299142 272543 261883 255185 260786 256213 239921 211314 182448 163899 147924 142672 150790 137252
9495 137252 118303 135134 136711 135585 141478 139441 129335 115963 96959 81057 71872 89624 79348
9482 79348 74514 79896 92286 102467 104985 81940 88554 95825 74951 71993 68165 58676 50164 51954
9468 51954 53862 52922 55275 60822 48728 63695 67361 71150 87770 92546 103010 110432 92440 95188
9454 95188 87356 102306 126893 115519 95937 74257 52801 60844 83645 89442 65413 64570 73177
9441 73177 76923 104705 110843 102954 89303 86849 100911 74831 45714 52762 57471 66163 70454
$$ packed form
9529B08880J7495k063M4948O4710O6393J18511J85246K74468L98698L82959J32142
9518A892387k29828l75021l19429k39908j60801r0438o8115n7360k6185k6160
9508B99142k6599j0660o698N601m573j6292k8607k8866j8549j5975n252Q118j3538
9495A37252j8949J6831J577j126N893k037j0106j3372j9004j5902r185J7752j0276
9482G9348m834N382J2390J0181K518k3045O614P271k0874k958l828r489q512J790
9468E1954J908r40K353N547j2094J4967L666L789J6620M776J0464P422j7992K748
9454I5188p832J4950K4587j1374j9582k1680k1456Q043K2801N797k4029q43Q607
9441G3177L746K7782O138p889j3651k454J4062k6080k9117P048M709Q692M291
$$ plain form
9428 70454 76039 96263 101723 95700 73119 59937 65157 61297 53280 38401 30843 50841 65428
9415 65428 65968 57773 48145 44887 55347 71378 71279 67000 62966 52486 20429 2339 26340 41504
9401 41504 71158 101769 91228 71843 55811 56490 50340 30355 43196 58157 38048 45924 57745
9388 57745 37984 39549 32065 30308 28862 39397 41367 36873 58139 46848 77563 105142 121642
9375 121642 132661 103343 80480 67002 62390 71091 76357 84195 84928 84209 85550 97493 84501
9362 84501 64038 58979 79227 74296 78003 109704 96983 88017 84227 97342 88100 76251 50040
9349 50040 46851 43407 36698 35254 63378 77823 50327 41950 47280 62932 72987 60970 44945
9336 44945 48796 32829 44180 48465 52892 63947 59171 69284 78483 97277 107463 100397 81774
$$ packed form
9428G0454N585K0224N460o023k2581j3182N220l860q017j4879p558J9998J4587
9415F5428N40q195r628l258J0460J6031r9m279m034j0480l2057j8090K4001J5164
9401D1504K9654L0611j0541j9385j6032O79o150j9985J2841J4961k0109P876J1821
9388E7745j9761J565p484j757j446J0535J970m494K1266j1291L0715K7579J6500
9375A21642J1019k9318k2863j3478m612Q701N266P838P33p19J341J1943j2992
9362H4501k0463n059K0248m931L707L1701j2721q966l790J3115r242j1849k6211
9349E0040l189l444o709j444K8124J4445k7496q377N330J5652J0055j2017j6025
9336D4945L851j5967J1351M285M427J1055m776J0113R199J8794J0186p066j8623
$$ plain form
9323 81774 53870 30550 13837 7094 31828 59537 73037 64677 72516 84606 71826 70058 58695
9310 58695 72502 79467 94668 115855 115856 111342 83529 60357 59340 87324 103275 95039 88994 73776
9296 73776 72887 82990 93480 83870 74699 64199 70163 86162 88453 90219 76415 61699 61820 76470
9282 76470 85004 73860 60909 69699 63489 43936 33921 44335 52242 53111 37794 49585 71844
9269 71844 85354 70204 61446 56601 74364 104891 120086 111811 83223 77183 103455 117367 108019
9256 108019 82351 51382 56818 50251 20680 39455 63926 77715 90571 93317 92071 82570 72998
9243 72998 79133 85760 83909 68588 72351 70980 83944 89613 81070 58387 62695 68970 72712 78083
9229 78083 82871 68755 43825 42817 40261 60231 53451 57420 75803 98477 96627 89413 71966
$$ packed form
9323H1774k7904k3320j6713o743K4734K7709J3500q360P839J2090j2780j768j1363
9310E8695J3807O965J5201K1187Jm514k7813k3172j017K7984J5951q236o045j5218
9296G3776q89J0103J0490r610r171j0500N964J5999K291J766j3804j4716J21J4650
9282G6470Q534j1144j2951Q790o210j9553j0015J0414P907Q69j5317J1791K2259
9269G1844J3510j5150q758m845J7763L0527J5195q275k8588o040K6272J3912r348
9256A08019k5668l0969N436o567k9571J8775K4471J3789J2856K746j246r501r572
9243G2998O135O627j851j5321L763j371J2964N669q543k2683M308O275L742N371
9229G8083M788j4116k4930j008k556J9970o780L969J8383K2674j850p214j7447
$$ plain form
9216 71966 92123 93368 80093 45807 25935 34613 45112 54974 83333 73834 62019 76998 95603
9203 95603 87357 88440 69519 37663 49262 67947 76736 99074 92458 77466 58372 55881 50582
9190 50582 48213 44500 39731 56422 46938 39089 50638 60649 75661 87318 74098 48390 21296
9177 21296 14864 16380 34185 50903 41246 54827 57554 59599 76979 73536 71685 79227 73873 61271
9163 61271 106840 140519 123463 101507 100051 99891 99090 75449 44077 34926 44079 48121 39130 53099
9149 53099 58092 66760 58524 58162 71558 57684 74425 64631 61014 61248 58946 69721 86956 79055
9135 79055 44591 10249 3117 28231 61560 91951 84260 93868 74356 67222 80503 77955 92203
9122 92203 110434 92983 76775 69404 57815 79799 74293 52128 66807 98479 99455 105170 87323
$$ packed form
9216G1966K0157J245j3275l4286j9872Q678J0499R862K8359r499j1815J4979J8605
9203I5603q246J083j8921l1856J1599J8685Q789K2338o616j4992j9094k491n299
9190E0582k369l713m769J6691r484p849J1549J0011J5012J1657j3220k5708k7094
9177B1296o432J516J7805J6718r657J3581K727K045J7380l443j851P542n354j2602
9163F1271M5569L3679j7056k1956j456j60q01k3641l1372r151R153M042q991J3969
9149E3099M993Q668q236l62J3396j3874J6741r794l617K34k302J0775J7235p901
9135G9055l4464l4342p132K5114L3329L0391p691R608j9512p134J3281k548J4248
9122I2203J8231j7451j6208p371j1589K1984n506k2165J4679L1672R76N715j7847
$$ plain form
9109 87323 70319 67595 48572 49704 48042 54448 50289 57480 63637 50722 60443 61119 40461 34569
9095 34569 44053 28812 12131 22167 34307 25031 11661 19369 26149 28166 23327 6980 28169
9082 28169 44511 48935 67221 73778 77003 80119 50450 40993 30642 22094 19874 15839 11908 21582
9068 21582 28701 43906 28098 29194 46283 63499 71500 45387 25018 9185 56558 51991 26721
9055 26721 26633 26585 33705 39153 34988 30313 35385 27285 22962 36737 23827 9137 38454 35101 19917
9040 19917 31629 49263 64075 68860 54720 48939 55788 62756 61593 61964 66049 72740 76299 58647
9026 58647 32869 25496 35869 45443 46057 44828 39324 42225 30441 15137 -5455 -6242 2488 23900
9012 23900 19711 15178 1907 41860 61831 75131 80777 92234 67901 72348 78713 46770 10769
$$ packed form
9109H7323j7004k724j9023J132j662O406m159P191O157j2915R721O76k0658n892
9095C4569R484j5241j6681J0036J2140r276j3370P708O780K017m839j6347K1189
9082B8169J6342M424J8286O557L225L116k9669r457j0351q548k220m035l931R674
9068B1582P119J5205j5808J096J7089J7216Q001k6113k0369j5833M7373m567k5270
9055B6721q8m8P120N448m165m675N072q100m323J3775j2910j4690K9317l353j5184
9040A9917J1712J7634J4812M785j4140n781O849O968j163L71M085O691L559j7652
9026E8647k5778p373J0373R574O14j229n504K901j1784j5304k0592p87Q730K1412
9012B3900m189m533j3271L9953J9971J3300N646J1457k4333M447O365l1943l6001
$$ plain form
8999 10769 16688 27660 37695 16771 6494 31105 44333 33434 27103 19485 25691 30502 22011
8986 22011 21480 7505 19910 8935 27526 37879 55678 34556 27616 49105 50798 32345 30668
8973 30668 40249 43741 19672 5806 8204 5524 24240 24248 29376 18666 26669 13664 2541 6306
8959 6306 17388 10058 -9560 -18525 -18646 9725 19787 11488 24878 55497 58255 54675 41293
8946 41293 42448 50495 41181 21996 34123 53341 42763 27764 25358 61098 70933 36225 28171
8933 28171 18883 11351 -2440 2591 18000 44808 41950 32739 39305 29474 34268 62780 39754
8920 39754 11816 11742 16879 35513 21206 5413 29150 52362 44024 48879 44681 55220 54754 54020
8906 54020 20444 7124 17653 18511 -1601 7046 22595 13697 19418 45138 57689 35959 28890
$$ packed form
8999A0769N919J0972J0035k0924j0277K4611J3228j0899o331p618O206M811q491
8986B2011n31j3975J2405j0975J8591J0353J7799k1122o940K1489J693j8453j677
8973C0668R581L492k4069j3866K398k680J8716QN128j0710Q003j3005j1123L765
8959F306J1082p330j9618q965j21K8371J0062q299J3390L0619K758l580j3382
8946D1293J155Q047r314j9185J2127J9218j0578j4999k406L5740R835l4708q054
8933B8171r288p532j3791N031J5409K6808k858r211O566r831M794K8512k3026
8920C9754k7938p4N137J8634j4307j5793K3737K3212q338M855m198J0539m66p34
8906E4020l3576j3320J0529Q58k0112Q647J5549q898N721K5720J2551k1730p069
$$ plain form
8893 28890 31810 35685 28595 29195 20346 14440 20553 15587 -3452 -21605 -9177 6672 9024 27373
8879 27373 34413 40798 38827 40991 57310 40546 45019 42021 43756 55859 33993 9952 11148
8866 11148 19556 17138 23180 27667 18470 27802 32659 10211 9109 22031 29097 37536 45697 37298
8852 37298 27403 29430 29040 26581 10860 12195 36418 86925 101272 60124 15450 15567 -1708
8839 -1708 -12275 -21511 -18480 -9296 -2866 20023 25876 20520 12462 37228 62114 71755 53640 71501
8825 71501 67933 54478 52579 44366 18964 36311 37995 54958 61145 50561 28393 4229 3669
8812 3669 12007 11851 16917 8493 27592 24042 6530 23283 42546 41194 29111 7076 -6399
8799 -6399 16819 30539 22568 18277 15924 32064 17235 23995 30537 25591 25492 12172 27388 10402
$$ packed form
8893B8890K920L875p090O00q849n906O113m966j9039j8153J2428J5849K352J8349
8879B7373P040O385j971K164J6319j6764M473k998J735J2103k1866k4041J196
8866A1148Q408k418O042M487r197R332M857k2448j102J2922P066Q439Q161q399
8852C7298r895K027l90k459j5721J335K4223N0507J4347m1148m4674J17j7275
8839a708j0567r236L031R184O430K2889N853n356q058K4766K4886R641j8115J7861
8825G1501l568j3455j899q213k5402J7347J684J6963O187j0584k2168k4164n60
8812C669Q338j56N066q424J9099l550j7512J6753J9263j352j2083k2035j3475
8799f399K3218J3720p971m291k353J6140j4829O760O542m946r9j3320J5216j6986
$$ plain form
8785 10402 -27729 -13286 11298 23721 44044 51912 24550 -8097 -11457 -12020 -3620 16577 36093
8772 36093 60903 60600 45530 23957 4246 -12396 -814 10024 21010 27710 18011 29514 59083
8759 59083 65147 66044 52658 14513 4524 -27377 -12473 3890 713 15176 23213 33888 8333
8746 8333 16554 24152 19515 29850 43821 31547 29719 21761 3336 502 17578 23481 43500
8733 43500 56125 54038 50523 47799 53169 67344 45391 20211 1853 3924 25226 12662 2844
8720 2844 18709 43964 35605 46849 25187 3576 50539 62628 53349 45898 38331 50175 61387
8707 61387 61341 77490 99331 86434 61310 58577 68416 92150 116976 107892 70711 86967 128403
8694 128403 163792 175808 192269 193651 194944 192813 192585 157262 170940 206508 215290 190858 152469
$$ packed form
8785A0402l8131J4443K4584J2423K0323P868k7362l2647l360n63Q400K0197J9516
8772C6093K4810l03j5070k1573j9711j6642J1582J0838J0986O700r699J1503K9569
8759E9083O064Q97j3386l8145r989l1901J4904J6363l177J4463Q037J0675k5555
8746H333Q221P598m637J0335J3971j2274j828p958j8425k834J7076N903K0019
8733D3500J2625k087l515k724N370J4175k1953k5180j8358K071K1302j2564r818
8720B844J5865K5255q359J1244k1662k1611M6963J2089r279p451p567J1844J1212
8707F1387m6J6149K1841j2897k5124k733R839K3734K4826r084l7181J6256M1436
8694A28403L5389J2016J6461J382J293k131k28l5323J3678L5568Q782k4432l8389
$$ plain form
8681 152469 112785 114692 124291 129155 121190 95534 67871 82991 117386 109301 115928 134187 132014
8668 132014 135685 109109 101880 108428 93139 67874 74373 71819 79709 95686 79338 74057 68585
8655 68585 64156 42303 58631 66724 84871 106916 115055 104868 95558 79833 68024 45484 44002
8642 44002 66103 81749 85876 60585 46581 40550 56379 41835 34805 32845 30101 19565 51014
8629 51014 101762 109212 123871 146125 161551 147757 155904 163059 153476 153868 150314 136744 141561
8616 141561 160338 178030 187246 190981 212609 268106 349508 426833 448967 378239 307771 279319
8604 279319 270647 269689 265005 276568 270904 242661 234344 219204 193835 176448 175955 169997 138048
8591 138048 133524 85788 75280 65993 64251 65150 68827 82335 82746 66873 45305 42253 51159 78257
$$ packed form
8681A52469l9684J907R599M864p965k5656k7663J5120L4395q085O627J8259k173
8668A32014L671k6576p229O548j5289k5265O499k554P890J5977j6348n281n472
8655F8585m429k1853J6328Q093J8147K2045Q139j0187r310j5725j1809k2540j482
8642D4002K2101J5646M127k5291j4004o031J5829j4544p030j960k744j0536L1449
8629E1014N0748P450J4659K2254J5426j3794Q147P155r583L92l554j3570M817
8616A41561J8777J7692R216L735K1628N5497Q1402P7325K2134p0728p0468k8452
8604B79319q672r58m684J1563n664k8243q317j5140k5369j7387m93n958l1949
8591A38048m524m7736j0508r287j742Q99L677J3508M11j5873k1568l052Q906K7098
$$ plain form
8577 78257 81729 90680 92484 105056 96694 84490 101843 127237 138401 159872 261830 398867
8565 398867 565825 684766 558146 374056 262275 191134 143969 121568 115688 103207 113998
8554 113998 98734 99085 76097 59334 65153 65571 75946 84811 87863 59533 49148 53466 44486
8541 44486 39702 23641 29013 70413 96176 73258 58689 26231 13678 31430 26797 27762 59627
8528 59627 72026 46774 25150 30550 30498 61807 107658 213930 287658 289569 219749 132571 98348
8515 98348 92943 81648 77280 71503 72053 58026 27836 14231 15515 43430 59926 41234 36844
8502 36844 50745 45916 43697 51578 34649 34421 40281 20678 6182 7076 38513 36864 26553 14632
8488 14632 4757 26695 23902 10791 -2252 4351 18040 28111 27696 36143 37856 23053 33319
$$ packed form
8577G8257L472Q951J804J2572q362j2204J7353K5394J1164K1471J01958J37037
8565C98867J66958J18941j26620j84090j11781p1141m7165k2401n880j2481J0791
8554A13998j5264L51k2988j6763N819M18J0375Q865L052k8330j0385M318q980
8541D4486m784j6061N372M1400K5763k2918j4569l2458j2553J7752m633R65L1865
8528E9627J2399k5252k1624N400n2L1309M5851J06272P3728J911o9820q7178l4223
8515I8348n405j1295m368n777N50j4027l0190j3605J284K7915J6496j8692m390
8502C6844J3901m829k219P881j6929k28N860j9603j4496Q94L1437j649j0311j1921
8488A4632r875K1938k793j3111j3043O603J3689J0071m15Q447J713j4803J0266
$$ plain form
8475 33319 28250 14294 22149 8703 8822 3208 -8686 -6618 -18577 -27123 -19363 -15815 -16259 -21797
8461 -21797 -25611 -33708 -25238 -17762 -1728 -13580 -34006 -27510 -446 23449 19924 22289 27209
8448 27209 17342 11719 -5886 -22331 6224 15545 3558 2004 16184 6377 14712 32575 7082
8435 7082 -10059 -13300 -5934 -18729 -20150 -15305 -20312 9105 4233 -5318 -5741 -14649 -7673 2966
8421 2966 -13667 -39867 -35767 -25375 -15500 -2252 -1456 -4118 11631 43932 26766 3257 -4446
8408 -4446 -4345 -19990 -18246 -17157 -28521 -13937 18151 21636 -5266 -9998 -4558 -7222 -5885 4784
8394 4784 -5025 -12991 -24454 -20067 -18629 -6261 8942 33368 28917 926 -3820 5948 15671 9294
8380 9294 26289 33734 32159 483 -23971 -11621 -2437 3727 28295 14394 13291 9842 10318 9509
$$ packed form
8475C3319n069j3956P855j3446J19n614j1894K068j1959q546P760L548m44n538
8461b1797l814q097Q470P476J6034j1852k0426O496K7064K3895l525K365M920
8448B7209r867n623j7605j6445K8555R321j1987j554J4180r807Q335J7863k5493
8435G082j7141l241P366j2795j421M845n007K9417m872r551m23q908O976J0639
8421B966j6633k6200M100J0392R875J3248P96k662J5749L2301j7166k3509p703
8408d446J01j5645J744J089j1364J4584L2088L485k6902m732N440k664J337J0669
8394D784r809p966j1463M387J438J2368J5203K4426m451k7991m746R768R723o377
8380I294J6995P445j575l1676k4454J2350R184O164K4568j3901j103l449M76q09
$$ plain form
8366 9509 5101 -5785 8999 20864 29358 11880 -9145 4334 1117 -31621 -55439 -66981 -74842
8353 -74842 -50468 -43111 -37778 -3378 34406 42752 34776 16586 38136 49094 46726 43229 19464
8340 19464 8944 316 10821 -5852 -20352 -19028 -24280 -14683 11887 24524 11178 -13868 -12174
8327 -12174 904 4512 1049 -24866 -4503 11978 9010 -1969 -38158 -24189 12457 6070 -11063
8314 -11063 -41795 -55635 -15215 23287 45259 49517 52551 43157 42941 21023 -673 -7501 -13023
8301 -13023 -28426 -49947 -48080 -31175 2741 8856 -4436 -21317 -47779 -33706 -19675 -17666
8289 -17666 -16404 -12080 -36519 -22208 -9909 -8091 -18932 -37671 -49194 -41952 -27425 -4897 -3757
8276 -3757 -41254 -47319 -34726 -7080 988 -8312 -10524 6325 17770 23327 21306 -3182 4766
$$ packed form
8366I509m408j0886J4784J1865Q494j7478k1025J3479l217l2738k3818j1542p861
8353g4842K4374P357N333L4400L7784Q346p976j8190K1550J0958k368l497k3765
8340A9464j0520q628J0505j6673j4500J324n252R597K6570J2637j3346k5046J694
8327a2174J3078L608l463k5915K0363J6481k968j0979l6189J3969L6646o387j7133
8314a1063l0732j3840M0420L8502K1972M258L034r394k16k1918k1696o828n522
8301a3023j5403k1521J867J6905L3916O115j3292j6881k6462J4073J4031K009
8289a7666J262M324k4439J4311J2299J818j0841j8739j1523P242J4527K2528J140
8276c757l7497o065J2593K7646Q068r300k212J6849J1445N557k021k4488P948
$$ plain form
8263 4766 15725 449 -2346 -40285 -42880 4897 33136 48067 43850 34806 25232 10802 19001
8250 19001 2103 -34985 -25631 -5831 -4822 -1188 -16362 -9743 -16428 -23288 -36800 -51714 -14962
8237 -14962 2150 -7120 -28420 -11873 16474 12592 3733 -2456 -7416 -10954 10087 8971 -8253
8224 -8253 -21683 -45981 -37501 -1950 22187 33650 40057 27011 -2186 -23501 -18528 -15795 -6862
8211 -6862 -6758 -1970 2088 -9387 -21927 1505 6113 -18089 -46286 -40617 -49258 -63385 -84390
8198 -84390 -70250 -42197 -15757 3902 4113 -13807 -16800 12159 23631 28139 21340 15421 14575
8185 14575 27364 41349 34579 23865 10194 7803 -3281 -863 8923 2603 -11398 -22517 -31070
8172 -31070 -19471 -30909 -32573 -15311 6847 3746 8093 -5369 -13390 -2417 -30973 -41648 -11141
$$ packed form
8263D766J0959j5276k795l7939k595M7777K8239J4931m217r044r574j4430Q199
8250A9001j6898l7088R354J9800J009L634j5174O619o685o860j3512j4914L6752
8237a4962J7112r270k1300J6547K8347l882q859o189m960l538K1041j116j7224
8224h253j3430k4298Q480L5551K4137J1463O407j3046k9197k1315M973K733Q933
8211f862J04M788M058j1475j2540K3432M608k4202k8197N669q641j4127k1005
8198h4390J4140K8053K6440J9659K11j7920k993K8959J1472M508o799n919q46
8185A4575J2789J3985o770j0714j3671k391j1084K418R786o320j4001j1119q553
8172c1070J1599j1438j664J7262K2158l101M347j3462q021J0973k8556j0675L0507
$$ plain form
8159 -11141 425 -3926 2893 13162 16564 3255 -16587 -28450 -28767 -44662 -54736 -42280 -29132
8146 -29132 -26936 -8193 8415 15966 5246 11799 17612 8301 -4872 -17602 -29559 -30896 -10284
8133 -10284 3631 2491 -34591 -40794 -40147 -37265 -49571 -40909 -18825 -21495 -25288 -9499 -3596 -611
8119 -611 6452 4072 -5280 -13359 -11489 7732 -4502 -25503 -37172 3858 25395 26823 18158 15788
8105 15788 2382 -11408 -20129 -14067 -23503 -22626 130 10785 -7865 -22812 -9596 -1474 7598
8092 7598 21518 32281 27782 12190 -8561 -25416 -32552 -17826 26092 18735 -4442 -12269 -29461
8079 -29461 -13841 -7190 -15178 -4859 41 15093 18937 5183 24274 30658 29621 28720 28455 11181
8065 11181 -9601 1172 19378 25474 17252 817 -8439 -1769 9467 3553 19710 21672 21773
$$ packed form
8159a1141J1566m351O819J0269L402j3309j9842j1863l17j5895j0074J2456J3148
8146b9132K196J8743J6608P551j0720O553N813r311j3173j2730j1957j337K0612
8133a0284J3915j140l7082o203O47K882j2306Q662K2084k670l793J5789N903K985
8119f11P063k380r352q079J870J9221j2234k1001j1669M1030K1537J428q665k370
8105A5788j3406j3790q721O062r436Q77K2756J0655j8650j4947J3216Q122R072
8092G598J3920J0763m499j5592k0751j6855p136J4726M3918p357k3177p827j7192
8079b9461J5620O651p988J0319M900J5052L844j3754J9091O384j037r01k65j7274
8065A1181k0782J0773J8206O096q222j6435r256O670J1236n914J6157J962J01
$$ plain form
8052 21773 33195 40775 19772 10135 22814 34842 12265 8151 15874 15863 10437 -3449 -3639 14140
8038 14140 20185 -1683 -3853 13497 9572 10802 17197 7148 -16271 -38600 -35923 -24124 -845
8025 -845 5392 -5087 29335 41272 16544 -320 4042 -2618 20293 11927 4227 8219 39598
8012 39598 53893 54576 83699 69653 66337 85369 73742 56935 38241 35160 46813 37774 40937
7999 40937 43887 44170 43768 30165 32347 5239 -1140 15075 17182 17679 20472 33801 37797 32107
7985 32107 26795 24087 32848 44939 47732 23693 15025 12678 29482 34489 56720 70936 49178
7972 49178 59775 64160 56186 50635 69332 75611 53746 62462 93168 90399 92575 74841 44753
7959 44753 25187 46245 47187 42387 25881 38907 47000 47019 28805 2463 -16625 8222 31884
$$ packed form
8052B1773J1422P580k1003r637J2679J2028k2577m114P723j1n426j3886j90J7779
8038A4140O045k1868k170J7350l925J230O395j0049k3419k2329K677J1799K3279
8025h45O237j0479L4422J1937k4728j6864M362o660K2911q366p700L992L1379
8012C9598J4295O83K9123j4046l316J9032j1627j6807j8694l081J1653r039L163
7999D0937K950K83m02j3603K182k7108o379J6215K107M97K793J3329L996n690
7985C2107n312k708Q761J2091K793k4039q668k347J6804N007K2231J4216k1758
7972D9178J0597M385p974n551J8697O279k1865Q716L0706k769K176j7734l0088
7959D4753j9566K1058R42m800j6506J3026Q093J9j8214k6342j9088K4847K3662
$$ plain form
7946 31884 26501 12373 -6458 -10031 18863 32624 31509 15168 16606 -4467 6201 13763 31967
7933 31967 32455 28362 19308 17590 19336 8413 16392 32467 33602 11756 762 -2519 -3907 6928
7919 6928 16962 29994 21210 23039 24445 31966 42445 38237 24079 23940 35689 49730 54771 47091
7905 47091 46397 20650 -5608 -22826 2056 1636 6536 18582 17941 15692 10620 -7821 -8252 3786
7891 3786 26637 35230 7781 -6735 -24934 -42574 -38920 -35012 -27022 -34745 -42798 -40963 -54339
7878 -54339 -35700 -31635 -31109 -34042 -35348 -38608 -24365 -21007 -39703 -26418 -18172 -563 26757
7865 26757 26921 29572 14867 2757 4379 6538 2755 4413 1627 -19057 -18879 -15493 -9594 -2535
7851 -2535 -7430 -16090 -36400 -44945 -42559 -14360 -3519 -30845 -62344 -37095 4276 2245 -26999
$$ packed form
7946C1884n383j4128j8831l573K8894J3761j115j6341J438k1073J0668P562J8204
7933C1967M88m093r054j718J746j0923P979J6075J135k1846j0994l281j388J0835
7919F928J0034J3032q784J829J406P521J0479m208j4158j39J1749J4041N041p680
7905D7091o94k5747k6258j7218K4882m20M900J2046o41k249n072j8441m31J2038
7891C786K2851Q593k7449j4516j8199j7640L654L908P990p723q053J835j3376
7878e4339J8639M065N26k933j306l260J4243L358j8696J3285Q246J7609K7320
7865B6757J64K651j4705j2110J622K159l783J658k786k0684J78L386N899P059
7851b535m895q660k0310q545K386K8199J0841k7326l1499K5249M1371k031k9244
$$ plain form
7838 -26999 -46671 -66571 -85272 -70143 -22389 20552 7816 -16513 -10605 -6424 -4741 20379
7826 20379 34627 24290 -19809 -42355 -42657 -45677 -49748 -46534 -23367 12281 33902 37945 29180
7813 29180 32087 8138 -3289 325 -20334 -37508 -44065 -77113 -78798 -80919 -65411 -45923 -43074
7800 -43074 -58331 -53015 -38549 -35295 -35027 -43835 -57272 -66508 -61893 -60108 -53872 -57169 -60604 -64641
7786 -64641 -49527 -41555 -22712 -18240 -2299 29033 34225 -6117 -15815 2107 20331 7700 -9853
7773 -9853 -12745 -22787 -22196 -25840 -20571 -23444 -33166 -25290 -19798 -22855 -28073 -6422 -17354 -45820
7759 -45820 -51768 -59824 -61275 -70399 -42307 -19607 -12630 -13752 -25511 -41240 -30228 -13863 -3640
7746 -3640 -4563 -30904 -21350 -10446 -18174 -17834 7790 5157 6016 7253 21195 48408 32991 -7781
$$ packed form
7838b6999j9672j9900j8701J5129M7754M2941j2736k4329N908M181J683K5120
7826B0379J4248j0337m4099k2546l02l020m071L214K3167L5648K1621M043q765
7813B9180K907k3949j1427L614k0659j7174o557l3048j685k121J5508J9488K849
7800d3074j5257N316J4466L254K68q808j3437r236M615J785O236l297l435m037
7786f4641J5114P972J8843M472J5941L1332N192m0342r698J7922J8224j2631j7553
7773i853k892j0042N91l644N269k873r722P876N492l057n218K1651j0932k8466
7759d5820n948q056j451r124K8092K2700O977j122j1759j5729J1012J6365J0223
7746c640r23k6341R554J0904p728L40K5624k633Q59J237J3942K7213j5417m0772
$$ plain form
7732 -7781 -39942 -56651 -43662 -14889 -1601 2894 -12458 -37777 -57340 -64119 -55066 -47463 -29990
7719 -29990 -33373 -47546 -35339 -8993 -2752 1309 -9327 -7306 -10468 -11043 -11667 -2458 14614 3568
7705 3568 -23143 -45496 -38950 -14647 -9189 -10190 -25003 -36595 -18888 -6604 2476 2885 -7215
7692 -7215 -12638 -28193 -14465 -993 -24898 -44509 -57187 -56334 -45424 -23437 -17174 -4100 16307
7679 16307 13684 -2079 -27264 -38492 -16754 -26061 -2884 -29865 -57353 -68620 -66086 -66623 -65864
7666 -65864 -33421 -50068 -61013 -52610 -58008 -66767 -66984 -56379 -38136 -45100 -38645 -34346 -31365 -34738
7652 -34738 -12488 4075 -13735 -26818 -29813 -19975 -7961 -1728 -592 -16101 -30500 -40841 -61736
7639 -61736 -69300 -31055 -30098 -22190 -45541 -43132 -1836 18231 -6134 -30588 -37534 -904 27200
$$ packed form
7732g781l2161j6709J2989K8773J3288M495j5352k5319j9563o779R053P603J7473
7719b9990l383j4173J2207K6346O241M061j0636K021l162n75o24R209J7072j1046
7705C568k6711k2353O546K4303N458j001j4813j1592J7707J2284R080M09j0100
7692g215n423j5555J3728J3472k3905j9611j2678Q53J0910K1987O263J3074K0407
7679A6307k623j5763k5185j1228K1738r307K3177k6981k7488j1267K534n37P59
7666f5864L2443j6647j0945Q403n398q759k17J0605J8243o964O455M299K981l373
7652c4738K2250J6563j7810j3083k995R838J2014O233J136j5509j4399j0341k0895
7639f1736p564L8245R57P908k3351K409M1296K0067k4365k4454o946L6630K8104
$$ plain form
7626 27200 33721 15114 -9308 -10169 5203 19623 345 -38022 -21346 -14513 5362 19823 4959
7613 4959 -707 -10955 -33498 -41864 -36685 -23342 -29367 -29903 -40363 -36741 -21242 -26644 -29860 -61346
7599 -61346 -55798 -59936 -59022 -37391 -18819 -17040 -11477 -14014 -39849 -42727 -33848 -14090 -4382 -30192
7585 -30192 -21922 -11458 -5257 5351 22160 28501 7786 -31816 -46262 -41480 -52555 -54446 -57204
7572 -57204 -65094 -49795 -59917 -45048 -20445 -19935 -22864 -27691 -32467 -11944 978 -3941 -13472
7559 -13472 -9776 5690 11781 18336 17905 -6346 -32138 -36102 -35630 -13740 2648 -2164 -10917 -19416
7545 -19416 -26683 -17239 -1898 -4856 -24636 -23132 -32980 -37468 -58567 -65425 -27177 -9269 -22097
7532 -22097 -37493 -21635 -37837 -63281 -91197 -102294 -84630 -56110 -41684 -36539 -27642 -17024
$$ packed form
7626B7200O521j8607k4422q61J5372J4420j9278l8367J6676O833J9875J4461j4864
7613D959n666j0248k2543q366N179J3343o025n36j0460L622J5499n402l216l1486
7599f1346N548m138R14K1631J8572J779N563k537k5835k878Q879J9758R708k5810
7585c0192Q270J0464O201J0608J6809O341k0715l9602j4446M782j1075j891k758
7572e7204p890J5299j0122J4869K4603N10k929m827m776K0523J2922m919r531
7559a3472L696J5466O091O555m31k4251k5792l964M72K1890J6388m812q753q499
7545a9416p267R444J5341k958j9780J504r848m488k1099o858L8248J7908j2828
7532b2097j5396J5858j6202k5444k7916j1097J7664K8520J4426N145Q897J0618
$$ plain form
7520 -17024 8535 6602 -1234 -29287 -31735 -9130 -32085 -45419 -53010 -45185 -54010 -48342 -28739
7507 -28739 -12937 -10999 9050 17873 15217 17792 28148 33103 22782 19848 24109 3972 -41708
7494 -41708 -68296 -49166 -35260 -47981 -51859 -45865 -51538 -42789 -42425 -58738 -45323 -44314 -41309
7481 -41309 -35259 -35320 -62147 -78332 -67307 -49630 -44805 -39115 -30020 -30628 -29268 -16794 3646 13414
7467 13414 -23465 -40555 -35644 -20359 -11499 -42831 -58398 -57672 -57859 -23037 7588 18850 -9215
7454 -9215 -3560 12317 -1040 -32709 -24457 -12872 -3882 -14991 -14632 4956 9395 -15532 82
7441 82 19473 14227 -14760 -24174 -25098 -16724 -6903 -17763 -26291 -38941 -23153 -27190 -37972 -35174
7427 -35174 -30364 -28489 -36481 -42157 -50030 -27707 -6661 -10887 -19244 -22671 -33489 -47341 -68957
$$ packed form
7520a7024K5559j933p836k8053k448K2605k2955j3334p591P825q825N668J9603
7507b8739J5802J938K0049Q823k656K575J0356M955j0321k934M261k0137m5680
7494d1708k6588J9130J3906j2721l878N994n673Q749L64j6313J3415J009L005
7481d1309O050o1k6827j6185J1025J7677M825N690R095o08J360J2474K0440R768
7467A3414l6879j7090M911J5285Q860l1332j5567P26j87L4822L0625J1262k8065
7454i215N655J5877j3357l1669Q252J1585Q990j1109L59J9588M439k4927J5614
7441H2J9391n246k8987r414r24Q374R821j0860q528j2650J5788m037j0782K798
7427c5174M810J875p992n676p873K2323K1046m226q357l427j0818j3852k1616
$$ plain form
7414 -68957 -51400 -37189 -15846 -1735 -16656 -31754 -31068 -39271 -68335 -66667 -52300 -21514 -25213
7401 -25213 -21578 -22398 -16075 -23473 -25239 -14648 -408 4973 -16060 -24660 -19646 -33522 -40907 -22804
7387 -22804 -15888 -10103 -24510 -37239 -66688 -53404 -34397 -38435 -21337 -24057 -22044 -21523 -17813
7374 -17813 -6353 -2603 -21894 -26237 -23195 -17883 -15308 5500 16965 -9065 -22777 -23873 -13173
7361 -13173 18233 29796 25671 7583 -19382 -49606 -58704 -49984 -34967 -23060 -22670 -10056 -11978
7348 -11978 -19464 -32696 -39196 -26815 -5279 -12457 -31468 -51930 -43570 -34983 -42628 -816 -13817
7335 -13817 -18468 -13868 -3087 -6628 -8559 -6365 -936 -2153 -8820 -5082 4001 2217 -2419 -3370 -3260
7320 -3260 175 2782 -5294 -3288 -3727 -18996 -44630 -30970 -21689 -14285 -17833 -35038 -55837 -59323
$$ packed form
7414f8957J7557J4211K1343J4111j4921j5098O86q203k9064J668J4367L0786l699
7401b5213L635q20O323p398j766J0591J4240N381k1033q600N014j3876p385J8103
7387b2804O916N785j4407j2729k9449J3284J9007m038J7098k720K013N21L710
7374a7813J1460L750j9291m343L042N312K575K0808J1465k6030j3712j096J0700
7361a3173L1406J1563m125j8088k6965l0224r098Q720J5017J1907L90J2614j922
7348a1978p486j3232o500J2381K1536p178j9011k0462Q360Q587p645M1812j3001
7335a3817m651M600J0781l541j931K194N429j217o667L738R083j784m636r51J10
7320c260L435K607q076K006m39j5269k5634J3660R281P404l548j7205k0799l486
$$ plain form
7306 -59323 -58932 -29080 -32051 -54415 -71209 -54364 -40789 -43524 -42186 -35367 -51558 -40175 -32045
7293 -32045 -24731 -37135 -54316 -46565 -38769 -27360 -31525 -51606 -36603 -31821 -32931 -26959 -31092
7280 -31092 -43514 -59785 -54503 -53145 -21778 -28139 -32775 -44671 -38122 -38198 -40488 -26048 -2637 21609
7266 21609 4694 -9904 -30887 -27815 -30673 -33214 -18115 -21432 -16846 -24768 -36108 -30075 -13653
7253 -13653 -7262 -6812 -14655 -10120 -3923 3738 -3688 -42539 -77081 -90660 -36808 -20560 -30384 -29331
7239 -29331 -24645 965 34034 28718 1799 1171 8000 -4587 2343 4277 -18019 -7706 -16056
7226 -16056 -6746 -29112 -38025 -34361 -51757 -64695 -39080 -13421 -16196 -45564 -58919 -69451 -39957
7213 -39957 4536 23005 14545 -766 -25056 -38049 -41325 -35847 -30048 -37003 -78670 -99237 -49337
$$ packed form
7306e9323L91K9852k971k2364j6794J6845J3575k735J338O819j6191J1383Q130
7293c2045P314j2404j7181P751P796J1409m165k0081J5003M782j110N972m133
7280c1092j2422j6271N282J358L1367o361m636j1896O549p6k290J4440K3411K4246
7266B1609j6915j4598k0983L072k858k541J5099l317M586p922j1340O033J6422
7253a3653O391M50p843M535O197P661p426l8851l4542j3579N3852J6248r824J053
7239b9331M686K5610L3069n316k6919o28O829j2587O930J934k2296J0313q350
7226a6056R310k2366q913L664j7396j2938K5615K5659k775k9368j3355j0532K9494
7213c9957M4493J8469q460j5311k4290j2993l276N478N799o955m1667k0567M9900
$$ plain form
7200 -49337 -14433 4202 -6815 -39689 -43989 -36939 -14091 2034 14890 17017 -3488 -11409 -13441
7187 -13441 -20434 -39555 -54652 -48780 -23637 -6878 -11626 -25272 -43947 -18665 12354 -4126
7175 -4126 -25343 -31657 -18097 -7481 -9877 53 8809 -13177 -26321 -8854 -4985 -3484 1981
7162 1981 7937 22189 8683 -17025 -10586 4741 -2194 -9412 -3501 -1269 -1365 -10306 -27357 -25042
7148 -25042 -37883 -57180 -72411 -64269 -37057 -31998 -57879 -40906 -14691 -16861 -35752 -19328
7136 -19328 -26093 -33796 -10715 -21149 -20026 17504 22131 -7463 -20089 -16030 -10665 -15928 -42469
7123 -42469 -58008 -55768 -30089 4715 -13782 -34442 -53191 -60889 -58022 -60059 -72910 -59441 -32466
7110 -32466 -7460 29671 8750 6308 8943 -4832 -10308 -14437 -4749 -2726 -10380 -9945 -18368 -24957
$$ packed form
7200d9337L4904J8635j1017l2874m300P050K2848J6125J2856K127k0505p921k032
7187a3441o993j9121j5097N872K5143J6759m748j3646j8675K5282L1019j6480
7175d126k1217o314J3560J0616k396R930Q756k1986j3144J7467L869J501N465
7162A981N956J4252j3506k5708O439J5327o935p218N911K232r6q941j7051K315
7148b5042j2841j9297j5231Q142K7212N059k5881J6973K6215k170j8891J6424
7136a9328o765p703K3081j0434J123L7530M627k9594j2626M059N365n263k6541
7123d2469j5539K240K5679L4804j8497k0660j8749p698K867k037j2851J3469K6975
7110c2466K5006L7131k0921k442K635j3775n476m129R688K023p654M35q423o589
$$ plain form
7096 -24957 -23228 -27795 -20541 -46947 -55894 -42671 -19235 -30315 -31473 -20136 -14592 -25547 -39583
7083 -39583 -35735 -26060 -19460 -20664 -12064 -16926 -26329 -20655 -5531 -11958 -20202 -44946 -65418 -55558
7069 -55558 -38552 -25162 -27744 -40519 -56879 -58406 -65485 -73006 -70241 -67184 -64001 -46368 -42435
7056 -42435 -20874 -26862 -50371 -30790 -19164 -11613 -13690 -37369 -26956 -25954 -47414 -39103 -48610
7043 -48610 -48557 -36467 -41468 -38843 -17491 11973 27869 10777 -15326 -30253 -41603 -34347 -24676
7030 -24676 -15953 10148 26525 14653 -6303 -15369 -28478 -19932 -25504 -22119 -3995 -19463 -27274
7017 -27274 -35695 -16909 4355 19841 17104 -448 -23326 -10872 -762 -6127 -19726 -11530 -22649
7004 -22649 -44116 -53786 -61389 -37769 -12512 -7020 -40032 -52854 -41105 -16264 6259 17872
$$ packed form
7096b4957J729m567P254k6406q947J3223K3436j1080j158J1337N544j0955j4036
7083c9583L848R675O600j204Q600m862r403N674J5124o427q244k4744k0472R860
7069e5558J7006J3390k582j2775j6360j527p079p521K765L057L183J7633L933
7056d2435K1561n988k3509J9581J1626P551k077k3679J0413J002k1460Q311r507
7043d8610N3J2090n001K625K1352K9464J5896j7092k6103j4927j1350P256R671
7030b4676Q723K6101J6377j1872k0956r066j3109Q546n572L385J8124j5468p811
7017b7274q421J8786K1264J5486k737j7552k2878J2454J0110n365j3599Q196j1119
7004b2649k1467r670p603K3620K5257N492l3012j2822J1749K4841K2523J1613
$$ plain form
6992 17872 37217 50494 12075 -8891 -18950 -1874 9959 297 -393 -23666 -31918 -28525 -25442
6979 -25442 -41793 -48500 -46947 -61353 -73774 -45620 -22507 -50145 -53073 -37092 -33906 -31085 -37464
6966 -37464 -30566 -31706 -23380 6030 -14157 -26162 -28697 -15666 -6943 3735 -23489 -34479 -33604
6953 -33604 -26480 -23638 -41817 -40852 -46679 -39942 -44611 -61366 -71759 -71453 -48016 -25535 -31188 -43925
6939 -43925 -60804 -52164 -28822 -13200 -21728 -48077 -63699 -47447 -20926 -20977 -18535 -12088 -29061
6926 -29061 -37729 -31928 -4939 23873 40544 34548 21447 27884 21962 6961 -14260 -37654 -58037
6913 -58037 -55004 -30011 -17829 -30805 -32017 -27468 -26253 -19724 -20897 -25743 -23786 -39933 -62722
6900 -62722 -53939 -43923 -25708 -13201 -18691 -19583 -8148 -19118 -6949 4484 -4078 -36398 -33774
$$ packed form
6992A7872J9345J3277l8419k0966j0059J7076J1833r662o90k3273q252L393L083
6979b5442j6351o707J553j4406j2421K8154K3113k7638k928J5981L186K821o379
6966c7464O898j140Q326K9410k0187j2005k535J3031Q723J0678k7224j0990Q75
6953c3604P124K842j8179R65n827O737m669j6755j0393L06K3437K2481n653j2737
6939d3925j6879Q640K3342J5622q528k6349j5622J6252K6521n1K442O447j6973
6926b9061q668N801K6989K8812J6671n996j3101O437n922j5001k1221k3394k0383
6913e8037L033K4993J2182j2976j212M549J215O529j173m846J957j6147k2789
6900f2722Q783J0016J8215J2507n490q92J1435j0970J2169J1433q562l2320K624
$$ plain form
6887 -33774 -17249 11 -22917 -38754 -45402 -22702 -15389 -4832 -4078 -17057 -25139 -16772 -8441
6874 -8441 -29469 -33675 -40742 -27879 -47957 -59725 -41759 -38133 -15542 -5894 -13148 -37698 -32311
6861 -32311 -33547 -47872 -52342 -60716 -62101 -18360 -5895 -2800 -3375 -17768 -24024 -23778 1813 -4586
6847 -4586 -32635 -26485 -19019 -14995 -33648 -30025 -20695 -29049 -46763 -14314 -405 23486 21926
6834 21926 -5161 -17457 -18905 -39761 -23034 -4660 -9559 -23328 -48848 -15564 5143 -5382
6822 -5382 29444 34655 5663 -12162 -5665 -5343 -28758 -51035 -41211 -33252 -14687 13077 10220
$$ packed form
6887c3774J6525J7260k2928j5837o648K2700P313J0557P54j2979q082Q367Q331
6874h441k1028m206p067J2863k0078j1768J7966L626K2591R648p254k4550N387
6861c2311j236j4325m470q374j385M3741J2465L095n75j4393o256K46K5591o399
6847d586k8049O150P466M024j8653L623R330q354j7714L2449J3909K3891j560
6834B1926k7087j2296j448k0856J6727J8374m899j3769k5520L3284K0707j0525
6822e382L4826N211k8992j7825O497L22k3415k2277R824P959J8565K7764k857
$$ [...]
##END NTUPLES=NMR SPECTRUM
##END=
