##TITLE=Analysis number 325516
Compound Code cc 62016
Book Reference 511/44
Project Code adrs
Chemist Name stevem
##JCAMPDX= 6.0         $$ Bruker NMR JCAMP-DX V2.0
##DATA TYPE= NMR SPECTRUM
##DATA CLASS= NTUPLES
##ORIGIN= Bruker BioSpin GmbH
##OWNER= nmr
$$ XWIN-NMR		Version 3.5
$$ Tue Jan  2 15:12:23 2007 GMT Standard Time (UT+0h)  MAYBRIDGE\nmr@NMR_250MHZ
##.OBSERVE FREQUENCY= 250.131544655141
##.OBSERVE NUCLEUS= ^1H
##.ACQUISITION MODE= SIMULTANEOUS (DQD)
##.ACQUISITION SCHEME= undefined
##.AVERAGES= 16
##.DIGITISER RES= 18
##SPECTROMETER/DATA SYSTEM= dpx250
##.PULSE SEQUENCE= zg30
##.SOLVENT NAME= CDCl3
##.SHIFT REFERENCE= (INTERNAL, CDCl3, 0, 16.5271)
##AUDIT TRAIL= $$ (NUMBER, WHEN, WHO, WHERE, WHAT)
$$ ##TITLE= Audit trail, XWIN-NMR		Version 3.5
$$ ##JCAMPDX= 5.01
$$ ##ORIGIN= Bruker BioSpin GmbH
$$ ##OWNER= nmr
$$ C:\u/data/dgb/nmr/ADRS/120/pdata/1/auditp.txt
$$ ##AUDIT TRAIL=  $$ (NUMBER, WHEN, WHO, WHERE, WHAT)
(   1,<2007-01-02 15:11:59.57 +000>,<MAYBRIDGE\nmr>,<NMR_250MHZ>,
      <created by zg, POWCHK disabled, PULCHK disabled
       configuration hash MD5:
       49 4B E0 1D 92 C2 6B 37 9F E6 65 BC 52 41 86 1D
       data hash MD5: 64K
       64 2A 9C B8 ED 56 01 B0 F5 EC 72 DC C6 33 1C 2D>)
(   2,<2007-01-02 15:12:14.10 +000>,<MAYBRIDGE\nmr>,<NMR_250MHZ>,
      <Start of raw data processing
       ef LB = 0.3 FT_mod = 6 PKNL = 1 SI = 32K 
       data hash MD5: 32K
       82 3B 49 5B 0B 27 52 7A FA 53 07 4E 5D C4 B9 EB>)
(   3,<2007-01-02 15:12:15.77 +000>,<MAYBRIDGE\nmr>,<NMR_250MHZ>,
      <apk 
       data hash MD5: 32K
       C1 A3 BB 99 C1 49 9B C7 94 11 96 74 A8 84 42 A6>)
(   4,<2007-01-02 15:12:16.47 +000>,<MAYBRIDGE\nmr>,<NMR_250MHZ>,
      <abs ABSG = 5 
       data hash MD5: 32K
       6A 25 34 B8 65 64 00 C4 40 69 FF 6E 2C B6 42 2C>)
$$ ##END=
$$ 
$$ hash MD5
$$ BF 77 36 68 20 18 80 97 B2 5B C2 7B 3C 46 F3 00
##$RELAX= 
##$RELAX= 
##$RELAX= 
##$RELAX= 
##$RELAX= 
##$RELAX= 
##$RELAX= 
$$ Bruker specific parameters
$$ --------------------------
##$DU= <C:\u>
##$EXPNO= 120
##$NAME= <ADRS>
##$PROCNO= 1
##$TYPE= <nmr>
##$USER= <dgb>
##$AMP= (0..31)
100 100 100 100 100 100 100 100 100 100 100 100 100 100 100 100 100 100 
100 100 100 100 100 100 100 100 100 100 100 100 100 100 
##$AQSEQ= 0
##$AQ_mod= 3
##$AUNM= <au_zg>
##$AUTOPOS= <22 >
##$BF1= 250.13
##$BF2= 250.13
##$BF3= 250.13
##$BF4= 250.13
##$BF5= 500.13
##$BF6= 500.13
##$BF7= 500.13
##$BF8= 500.13
##$BYTORDA= 1
##$CFDGTYP= 0
##$CFRGTYP= 5
##$CHEMSTR= <none>
##$CNST= (0..31)
1 1 145 1 1 1 1 1 1 1 1 1 1 1 1 1 1 1 1 1 1 1 1 1 1 1 1 1 1 1 1 1 
##$CPDPRG= <>
##$CPDPRG1= <>
##$CPDPRG2= <>
##$CPDPRG3= <>
##$CPDPRG4= <mlev>
##$CPDPRG5= <mlev>
##$CPDPRG6= <mlev>
##$CPDPRG7= <mlev>
##$CPDPRG8= <mlev>
##$CPDPRGB= <>
##$CPDPRGT= <>
##$D= (0..31)
0 1 0 0 0 0 0 0 0 0.06 0 0 0 0 0 0 0.0002 0 0 0 0 0 0 0 0 0 0 0 0 0 0 
0 
##$DATE= 1167750718
##$DBL= (0..7)
120 120 120 120 120 120 120 120 
##$DBP= (0..7)
150 150 150 150 150 150 150 150 
##$DBP07= 0
##$DBPNAM0= <>
##$DBPNAM1= <>
$$ [...]
##$SUBNAM7= <"">
##$SUBNAM8= <"">
##$SUBNAM9= <"">
##$SW= 20.6930455092707
##$SWIBOX= (0..15)
0 0 3 0 0 0 0 0 0 0 0 0 0 0 0 0 
##$SW_h= 5175.983436853
##$TD= 65536
##$TD0= 1
##$TE= 294.16
##$TE2= 300
##$TE3= 300
##$TEG= 300
##$TL= (0..7)
0 120 120 120 120 120 120 120 
##$TP= (0..7)
150 150 150 150 150 150 150 150 
##$TP07= 0
##$TPNAME0= <>
##$TPNAME1= <>
##$TPNAME2= <>
##$TPNAME3= <>
##$TPNAME4= <>
##$TPNAME5= <>
##$TPNAME6= <>
##$TPNAME7= <>
##$TPOAL= (0..7)
0.5 0.5 0.5 0.5 0.5 0.5 0.5 0.5 
##$TPOFFS= (0..7)
0 0 0 0 0 0 0 0 
##$TUNHIN= 0
##$TUNHOUT= 0
##$TUNXOUT= 0
##$USERA1= <user>
##$USERA2= <user>
##$USERA3= <user>
##$USERA4= <user>
##$USERA5= <user>
##$V9= 5
##$VALIST= <valist>
##$VCLIST= <CCCCCCCCCCCCCCC>
##$VD= 0
##$VDLIST= <DDDDDDDDDDDDDDD>
##$VPLIST= <PPPPPPPPPPPPPPP>
##$VTLIST= <TTTTTTTTTTTTTTT>
##$WBST= 1024
##$WBSW= 4
##$XGAIN= (0..3)
0 0 0 0 
##$XL= 0
##$YL= 0
##$YMAX_a= 387495
##$YMIN_a= -427760
##$ZGOPTNS= <>
##$ZL1= 120
##$ZL2= 120
##$ZL3= 120
##$ZL4= 120
##$ABSF1= 16.52711
##$ABSF2= -4.166063
##$ABSG= 5
##$ABSL= 3
##$ALPHA= 0
##$AQORDER= 0
##$ASSFAC= 0
##$ASSFACI= 0
##$ASSFACX= 0
##$ASSWID= 0
##$AUNMP= <proc_1d>
##$AZFE= 0.1
##$AZFW= 0.1
##$BCFW= 0
##$BC_mod= 0
##$BYTORDP= 0
##$COROFFS= 0
##$CY= 12.5
##$DATMOD= 1
##$DC= 0
##$DFILT= <>
##$DTYPP= 0
##$F1P= 14.0000005364418
##$F2P= -0.99999901652339
##$FCOR= 0.5
##$FTSIZE= 32768
##$FT_mod= 6
##$GAMMA= 0
##$GB= 0
##$INTBC= 1
##$INTSCL= 1
##$ISEN= 128
##$LB= 0.3
##$LEV0= 0
##$LPBIN= 0
##$MAXI= 10000
##$MC2= 0
##$MEAN= 0
##$ME_mod= 0
##$MI= 0
##$NCOEF= 0
##$NC_proc= -2
##$NLEV= 6
##$NOISF1= 0
##$NOISF2= 0
##$NSP= 0
##$NTH_PI= 0
##$NZP= 0
##$OFFSET= 16.52711
##$PC= 1
##$PHC0= 226.8371
##$PHC1= 7.351358
##$PH_mod= 1
##$PKNL= yes
##$PPARMOD= 0
##$PSCAL= 4
##$PSIGN= 0
##$REVERSE= no
##$SF= 250.129998719405
##$SI= 32768
##$SIGF1= 0
##$SIGF2= 0
##$SINO= 400
##$SIOLD= 32768
##$SREGLST= <1H.CDCl3>
##$SSB= 0
##$STSI= 32768
##$STSR= 0
##$SW_p= 5175.98343685301
##$SYMM= 0
##$S_DEV= 0
##$TDeff= 65536
##$TDoff= 0
##$TI= <Analysis number 999999
Compound Code 99
Book Reference 9
Project Code 9>
##$TILT= no
##$TM1= 0
##$TM2= 0
##$TOPLEV= 0
##$USERP1= <user>
##$USERP2= <user>
##$USERP3= <user>
##$USERP4= <user>
##$USERP5= <user>
##$WDW= 1
##$XDIM= 32768
##$YMAX_p= 320642223
##$YMIN_p= -59675
$$ End of Bruker specific parameters
$$ ---------------------------------
##NTUPLES= NMR SPECTRUM
##VAR_NAME=  FREQUENCY,     SPECTRUM/REAL,   SPECTRUM/IMAG
##SYMBOL=    X,             R,               I
##VAR_TYPE=  INDEPENDENT,   DEPENDENT,       DEPENDENT
##VAR_FORM=  AFFN,          ASDF,            ASDF
##VAR_DIM=   32768,         32768,           32768
##UNITS=     HZ,            ARBITRARY UNITS, ARBITRARY UNITS
##FACTOR=    0.157963299565203, 1,           1
##FIRST=     4133.925789554, 0,              0
##LAST=      -1042.05764729901, 0,           0
##MIN=       -1042.05764729901, -59675,      0
##MAX=       4133.925789554, 320642223,      0
$$ Real data points
##PAGE= N=1
##DATA TABLE= (X++(R..R)), XYDATA
$$ [...]
$$ plain form
17811 75140 74439 65474 53922 54506 46501 43599 45184 48356 37471 43029 59339 68075 68480 62755
17797 62755 50829 37249 40436 26740 21904 14883 25578 28880 33687 31788 41527 59175 69171
17784 69171 67203 59522 47238 26784 21886 24836 46259 58032 56070 66027 77156 76277 84478
17771 84478 97517 91307 74134 79133 84930 90671 87938 84747 87761 96210 89499 102111 123624
17758 123624 136281 131888 140445 130509 121916 120878 130089 135632 143644 155054 172468 202581 215284
17745 215284 229230 239549 250844 268323 278705 300089 314322 326365 350596 373462 426020
17734 426020 485390 534775 579123 659815 761942 918493 1175601 1479709 1780580 2074792
17724 2074792 2427696 2881926 3047086 2837316 2673241 2675425 2793255 3108090 3688771 4569440
$$ packed form
17811G5140p01q965j1552N84q005k902J585L172j0885N558J6310Q736M05n725
17797F2755j1926j3580L187j3696m836p021J0695L302M807j899R739J7648R996
17784F9171j968p681j2284k0454m898K950K1423J1773j962R957J1129q79Q201
17771H4478J3039o210j7173M999N797N741k733l191L014Q449o711J2612K1513
17758A23624J2657m393Q557r936q593j038R211N543Q012J1410J7414L0113J2703
17745B15284J3946J0319J1295J7479J0382K1384J4233J2043K4231K2866N2558
17734D26020N9370M9385M4348Q0692J02127J56551K57108L04108L00871K94212
17724B074792L52904M54230J65160k09770j64075K184J17830L14835N80681Q80669
$$ plain form
17714 4569440 5832383 7790507 11031390 16459209 25730457 40800280 58355612 61210051
17706 61210051 46063936 29665080 19421344 14434423 12333779 12064771 13634847 17572120
17698 17572120 25208268 38634081 55787707 60473794 46352306 29541331 18439935
17691 18439935 12507849 9197176 7039061 5525332 4433627 3624372 3035673 2637091
17683 2637091 2420585 2354286 2361762 2300053 2163891 2006505 1809979 1581191 1355255 1136592
17673 1136592 954783 826887 734651 656502 593555 553689 538966 529014 499811 457668 422986
17662 422986 398901 375225 350409 314353 280260 271208 254674 254189 257270 262189 254576 245849 243773
17649 243773 224556 203458 200868 192620 170139 155940 161814 173701 159202 148629 141112 136928
$$ packed form
17714D569440J262943J958124L240883N427819R271248J5069823J7555332K854439
17706F1210051j5146115j6398856j0243736m986921k100644k69008J570076L937273
17698A7572120P636148J3425813J7153626M686087j4121488j6810975j1101396
17691A8439935n932086l310673k158115j513729j091705q09255n88699l98582
17683B637091k16506o6299P476o1709j36162j57386j96526k28788k25936k18663
17673A136592j81809j27896r2236p8149o2947l9866j4723r952k9203m2143l4682
17662D22986k4085k3676k4816l6056l4093r052j6534m85L081M919p613q727k076
17649B43773j9217k1098k590q248k2481j4199N874J1887j4499j0573p517m184
$$ plain form
17637 136928 129170 133157 135202 116994 109530 107088 105399 110821 110222 99789 84168 87339 94210 88264
17623 88264 85720 99784 99955 89117 67785 50503 50294 60872 72197 73932 78291 73484 70774
17610 70774 56007 64675 83255 72035 61869 58482 70739 83847 76524 63390 67011 62221 46102
17597 46102 46194 53834 64329 70703 66948 69371 72539 78524 93235 111797 126914 112848 94866
17584 94866 72897 72339 75708 69126 38995 35054 53127 57786 74856 94967 98809 103228 79212
17571 79212 47655 24028 12280 5591 21734 41976 54281 57832 59294 56512 54223 47029 45911
17558 45911 48363 72021 82854 72018 77568 71293 69113 76969 72029 56422 55210 69216 78517
17545 78517 70907 95979 101138 101530 101776 90807 76447 59875 50344 44353 54637 56280 49141 47559
$$ packed form
17637A36928p758L987K045j8208p464k442j689N422n99j0433j5621L171O871n946
17623H8264k544J4064J71j0838k1332j7282k09J0578J1325J735M359m807k710
17610G0774j4767Q668J8580j1220j0166l387J2257J3108p323j3134L621m790j6119
17597D6102R2P640J0495O374l755K423L168N985J4711J8562J5117j4066j7982
17584I4866k1969n58L369o582l0131l941J8073M659J7070K0111L842M419k4016
17571G9212l1557k3627j1748o689J6143K0242J2305L551J462k782k289p194j118
17558D5911K452K3658J0833j0836N550o275k180P856m940j5607j212J4006R301
17545G8517p610K5072N159L92K46j0969j4360j6572r531n991J0284J643p139j582
$$ plain form
17531 47559 47444 70213 94830 97662 85438 59297 53604 64465 58174 54012 48981 41775 27192
17518 27192 22816 46359 57541 55478 55747 45234 47919 49094 37371 20719 12516 20523 13148
17505 13148 18609 42610 47258 67415 91616 114291 90142 49203 27100 34517 35766 31105 40633
17492 40633 65172 61585 40011 32909 21750 18571 27566 25732 20087 4095 -9244 14954 32836
17479 32836 29286 49327 60724 50976 53463 37823 22038 26857 33446 43897 48278 28068 10074
17466 10074 10719 23016 11318 3233 5638 30397 38757 37318 39859 25070 21911 26220 22899 21480
17452 21480 17090 12964 13420 11845 15742 33006 36316 57558 95371 156767 225080 226221 159847
17439 159847 98029 67424 35988 17195 17755 18435 6221 -6503 -3572 8538 16701 916 -9824
$$ packed form
17531D7559j15K2769K4617K832j2224k6141n693J0861o291m162n031p206j4583
17518B7192m376K3543J1182k063K69j0513K685J175j1723j6652q203Q007p375
17505A3148N461K4001M648K0157K4201K2675k4149m0939k2103P417J249m661R528
17492D0633K4539l587k1574p102j1159l179Q995j834n645j5992j3339K4198J7882
17479C2836l550K0041J1397r748K487j5640j5785M819O589J0451M381k0210j7994
17466A0074O45J2297j1698q085K405K4759Q360j439K541j4789l159M309l321j419
17452B1480m390m126M56j575L897J7264L310K1242L7813O1396O8313J141o6374
17439A59847o1818l0605l1436j8793N60O80j2214j2724K931J2110Q163j5785j0740
$$ plain form
17426 -9824 -11136 -15742 -16574 -27572 -33581 -8740 1122 -1672 362 7535 1662 -6848 -9282 -13543
17412 -13543 -10106 -12077 -21912 -18370 -6776 -7923 -6513 -17035 -21748 -22490 569 18777 14911 25918
17398 25918 28361 16489 3643 -6588 -235 5822 5820 4940 5850 -392 5491 10538 9018 1462 1487
17383 1487 522 -9623 -10893 -10341 -3147 5151 2324 12460 27029 41173 27246 8640 -7832
17370 -7832 -7310 -7391 -13272 -21689 1437 504 -21386 -19525 -14813 -15651 -6704 -7428 1461 13451 8923
17355 8923 -6081 -10013 -7173 -12434 -11180 -504 9260 -7282 -15797 -4361 6061 15353 17806
17342 17806 6000 8498 11897 19199 17013 2015 8000 -9376 -18343 -24999 -10652 -1628 -8317
17329 -8317 -2884 5079 9359 18431 15853 17916 28661 34631 29449 22260 2035 -20118 -26453 -32360
$$ packed form
17426i824j312m606q32j0998o009K4841R862k794K034P173n873q510k434m261
17412a3543L437j971r835L542J1594j147J410j0522m713p42K3059J8208l866J1007
17398B5918K443j1872j2846j0231O353O057kq80R10o242N883N047j520p556K5
17383A487r65j0145j270N52P194Q298k827J0136J4569J4144j3927j8606j6472
17370g832N22q1n881q417K3126r33k1890J861M712q38Q947p24Q889J1990m528
17355H923j5004l932K840n261J254J0676R764j6542q515J1436J0422R292K453
17342A7806j1806K498L399P302k186j4998N985j7376q967o656J4347R024o689
17329h317N433P963M280R072k578K063J0745N970n182p189k0225k2153o335n907
$$ plain form
17315 -32360 -12820 1538 23088 40104 25377 19430 16618 20494 16490 -2616 12533 14341 5329
17302 5329 -301 11359 7637 -5557 -2852 -17241 -31779 -18385 -3210 4171 -4440 -3144 -6810
17289 -6810 5670 24026 25218 19440 8581 5690 14222 8747 3647 17299 27195 30593 25359 21467
17275 21467 7719 9792 4413 -8920 -6102 50 -1217 -2106 10047 12046 21434 28318 22810 33857
17261 33857 42038 58545 69733 53213 29422 13105 4753 6743 189 -4440 -1016 5899 26194
17248 26194 37026 27623 15657 4466 3966 -6477 -2058 -8952 -22630 -23311 -20826 -28478 -25278 -21906
17234 -21906 -19878 -24220 -15196 -24323 -28016 -23090 -28737 -16652 -25391 -19763 2991 8215 -8695 -14926
17220 -14926 2095 11661 -1078 -2186 290 -4701 -6853 -14088 -24358 -12512 10686 20553 7060
$$ packed form
17315c2360J9540J4358K1550J7016j4727n947k812L876m004j9106J5149J808r012
17302E329n630J1660l722j3194K705j4389j4538J3394J5175P381q611J296l666
17289f810J2480J8356J192n778j0859k891Q532n475n100J3652R896L398n234l892
17275B1467j3748K073n379j3333K818O152j267q89J2153J999R388O884n508J1047
17261C3857Q181J6507J1188j6520k3791j6317q352J990o554m629L424O915K0295
17248B6194J0832r403j1966j1191n00j0443M419o894j3678o81K485p652L200L372
17234b1906K028m342R024r127l693M926n647J2085q739N628K2754N224j6910o231
17220a4926J7021R566j2739j108K476m991k152p235j0270J1846K3198R867j3493
$$ plain form
17207 7060 -13579 -18202 -5550 -1516 1814 12814 20828 10959 15013 17398 25344 20966 21006 15257
17193 15257 20328 26845 24765 16106 7634 7862 31709 72834 103659 157491 226482 295034 311573
17180 311573 263181 173255 93438 63029 64800 71845 71681 90922 137196 209622 298372 328354
17168 328354 262473 173065 128214 104232 76638 74341 61921 55027 53343 42099 32089 32596
17156 32596 18115 8318 -1970 945 23414 30571 20425 -294 -1131 1843 12504 18883 22146
17143 22146 10836 6134 -4937 -11845 -16644 -13298 -17513 -12849 -27246 -18096 -19445 -16018 -18402 -20296
17129 -20296 -10555 -7480 6853 19403 14246 16984 22547 3757 -13010 -18632 -20933 -19023 -18641 -19700
17115 -19700 -10884 -12448 -10813 -9405 -4278 8973 16574 16697 10666 -641 -1648 -7615 -7874 -5050
$$ packed form
17207G060k0639m623J2652M034L330J1000Q014r869M054K385P946m378M0n749
17193A5257N071O517k080q659q472K28K3847M1125L0825N3832O8991O8552J6539
17180C11573m8392q9926p9817l0409J771P045j64J9241M6274P2426Q8750K9982
17168C28354o5881q9408m4851k3982k7594k297j2420o894j684j1244j0010N07
17156C2596j4481r797j0288K915K2469P157j0146k0719q37K974J0661O379L263
17143B2146j1310m702j1071o908m799L346m215M664j4397R150j349L427k384j894
17129b0296R741L075J4333J2550n157K738N563j8790j6767n622k301J910L82j059
17115a9700Q816j564J635J408N127J3251P601J23o031j1307j007n967k59K824
$$ plain form
17101 -5050 -15240 -9280 2574 -11839 -30502 -37548 -25419 -5467 2350 12242 29755 38353 28238
17088 28238 24531 12985 -2264 -5502 -2749 -4580 -91 -5514 -18256 -24211 -14638 -11086 -7701 -9918
17074 -9918 -4582 -11090 -6717 20675 31214 9024 11388 -1038 -7228 -12968 -8736 7663 21244
17061 21244 25553 26366 22562 11701 3347 -839 10276 19287 18574 21795 17447 18096 20578 6677
17047 6677 -180 7271 8457 9365 13348 18227 19682 26341 33798 20894 9637 12807 23901 21734
17033 21734 19237 5468 9528 -5004 -13357 -1943 10809 30125 46627 46358 38034 25747 14706
17020 14706 15564 23888 19095 3979 -4941 -3513 -1729 7372 16620 8645 5909 17349 19922 13723
17006 13723 9309 6988 -3480 -6687 -1701 13616 3728 -17657 -8170 -1732 12795 17953 10528
$$ packed form
17101e050j0190N960J1854j4413j8663p046J2129J9952P817R892J7513Q598j0115
17088B8238l707j1546j5249l238K753j831M489n423j2742n955R573L552L385k217
17074i918N336o508M373K7392J0539k2190K364j2426o190n740M232J6399J3581
17061B1244M309Q13l804j0861q354m186J1115R011p13L221m348O49K482j3901
17047F677o857P451J186R08L983M879J455O659P457j2904j1257L170J1094k167
17033B1734k497j3769M060j4532q353J1414J2752J9316J6502k69q324j2287j1041
17020A4706Q58Q324m793j5116q920J428J784R101R248p975k736J1440K573o199
17006A3723m414k321j0468l207M986J5317r888k1385R487O438J4527N158p425
$$ plain form
16993 10528 4755 -2668 5917 12838 6461 -5651 305 14538 23801 21146 15062 11021 2785 44
16979 44 6779 14699 9029 4857 4543 -5209 -4691 -1637 -9765 -10292 1780 4060 -4494 -10423 -4439 13813
16963 13813 27362 15187 11986 5185 3897 -3659 -11862 -32169 -25776 -13165 -5026 3207 8444
16950 8444 11182 9262 3466 10403 13548 1356 3927 11768 15801 11983 7121 23376 26106 20433
16936 20433 40320 49827 43743 47193 48229 42462 36827 43576 44469 36567 19985 16760 14336 9468
16922 9468 15284 878 -13752 -16460 -23168 -11088 -19122 -16292 -7633 -1342 6226 3045 5181 -747
16908 -747 -1733 -458 11980 24380 34690 29764 34240 28932 12065 -6546 -12705 8198 19992
16895 19992 26926 31498 27918 28112 30743 37363 42870 35405 36299 45173 40384 34213 30897 46115 57840
$$ packed form
16993A0528n773p423Q585O921o377j2112N956J4233R263k655o084m041q236k741
16979D4O735P920n670m172l14r752N18L054q128n27J2072K280q554n929N984J8252
16963A3813J3549j2175l201o801j288p556q203k0307O393J2611Q139Q233N237
16950H444K738j920n796O937L145j2192K571P841M033l818m862J6255K730n673
16936B0433J9887R507o084L450J036n767n635O749Q93p902j6582l225k424m868
16922I468N816j4406j4630k708o708J2080q034K830Q659O291P568l181K136n928
16908g47r86J275J2438J2400J0310m926M476n308j6867j8611o159K0903J1794
16895A9992O934M572l580J94K631O620N507p465Q94Q874m789o171l316J5218J1725
$$ plain form
16880 57840 66709 46698 16950 9264 215 1246 16307 15492 17992 21769 31909 30569 11038
16867 11038 -13134 -15100 -2166 13317 19598 19073 27854 23300 9548 -2197 3991 11225 16506
16854 16506 30582 38207 46593 41404 15803 -6531 -11167 7 13055 19912 4164 -9029 3516
16841 3516 14147 8086 -4548 -1423 -3340 2793 1097 -15035 -2013 7936 6015 13524 28819
16828 28819 19371 5508 -7616 -17624 -20420 -10339 -5375 -11841 -5989 1539 7404 21594 34819
16815 34819 23432 2199 -22009 -33976 -34323 -26195 -22242 -19131 -769 4088 2934 3904 -5590 -9803
16801 -9803 -13472 -19379 -7625 -7976 -6589 7912 462 -8499 -3460 -530 -5989 1526 13744 18837
16787 18837 13836 -312 -3018 528 5979 16819 8320 2715 -11971 -14212 3862 7627 7621 12873
$$ packed form
16880E7840Q869k0011k9748p686r049J031J5061q15K500L777J0140j340j9531
16867A1038k4172j966J2934J5483O281n25Q781m554j3752j1745O188P234N281
16854A6506J4076P625Q386n189k5601k2334m636J1174J3048O857j5748j3193J2545
16841C516J0631o061j2634L125j917O133j696j6132J3022R949j921P509J5295
16828B8819r448j3863j3124j0008k796J0081M964o466N852P528N865J4190J3225
16815C4819j1387k1233k4208j1967l47Q128L953L111J8362M857j154R70r494m213
16801i803l669n907J1754l51J387J4501p450q961N039K930n459P515J2218N093
16787A8837n001j4148k706L546N451J0840q499n605j4686k241J8074L765oN252
$$ plain form
16773 12873 9598 5507 158 -769 -9313 -14557 -9316 -10065 328 -11583 -23729 -18552 -17745 -3638
16759 -3638 -2262 -7224 -9825 -21705 -29345 -33864 -10337 20669 26540 15021 7783 -10108 -15012
16746 -15012 -13204 -19733 -12158 -2117 4908 8469 1189 -22632 -11642 7495 1213 6944 2674
16733 2674 -19550 -24136 -17188 -7963 -3959 -10588 -4872 -7078 -9404 -19642 -17613 -9730 -5716 -18624
16719 -18624 -29244 -21560 -13578 -2601 -3381 -1656 2456 -4997 -6766 -7758 2015 958 -490 -11707
16705 -11707 -25152 -16423 1155 -3840 -3329 5736 7412 -633 -8964 -18361 -27579 -32155 -22934 -15592
16691 -15592 -13973 -6856 -4897 -5984 853 -6249 -11244 -13511 -6303 1515 10392 -1306 -7323 -19742
16677 -19742 -27100 -24781 -15294 -21764 -19468 -5311 -2645 -1746 -878 -8294 -20592 -33681 -37301 -30308
$$ packed form
16773A2873l275m091n349r27q544n244N241p49J0393j1911j2146N177Q07J4107
16759c638J376m962k601j1880p640m519K3527L1006N871j1519p238j7891m904
16746a5012J808o529P575J0041P025L561p280k3821J0990J9137o282N731m270
16733B674k2224m586O948R225M004o629N716k206k326j0238K029P883M014j2908
16719a8624j0620P684P982J0977p80J725M112p453j769r92R773j057j448j1217
16705a1707j3445Q729J7578m995N11R065J676q045q331r397r218m576R221P342
16691a5592J619P117J959j087O837p102m995k267P208P818Q877j1698o017j2419
16677a9742p358K319R487o470K296J4157K666Q99Q68p416j2298j3089l620O993
$$ plain form
16663 -30308 -1104 2503 106 -7163 -25048 -36090 -38777 -37245 -26234 -12279 -12555 -2454 1514
16650 1514 -1731 -2734 -21565 -29869 -9724 -5537 -17101 -29319 -28155 -39481 -26658 -15639 -14015
16637 -14015 -8616 -4955 -6973 -6282 -3604 -12397 -27884 -14033 -4163 -4795 -2542 -6890 -11200 -4889
16623 -4889 -706 -302 8202 -6077 89 -1713 7877 6593 -91 3275 -9283 -5277 8291 4265
16609 4265 -4367 -7817 -17611 -34419 -24484 -23742 -21096 -5697 -11460 -10178 -5488 -5705 -11386 -2392 -1802
16594 -1802 -9650 -20949 -14928 -21653 -33464 -31987 -28236 -10923 -3672 -8636 -11463 -18220 -26719 -22209
16580 -22209 -39476 -23832 -19129 -15037 -15010 -7915 1812 11368 8378 -11938 -20266 -27739 -29395 -28219
16566 -28219 -20748 -19544 -23326 -17124 -4333 120 -9313 -11563 3005 8286 -2602 -9041 -13638 -16264
$$ packed form
16663c0308K9204L607k397p269j7885j1042k687J532J1011J3955k76J0101L968
16650A514l245j003j8831q304K0145M187j1564j2218J164j1326J2823J1019J624
16637a4015N399L661k018O91K678q793j5487J3851R870o32K253m348m310O311
16623d889M183M04Q504j4279O166j802R590j284o684L366j2558M006J3568m026
16609D265q632l450r794j6808R935P42K646J5399n763J282M690k17n681Q994N90
16594a802p848j1299O021o725j1811J477L751J7313P251m964k827o757q499M510
16580b2209j7267J5644M703M092K7P095R727R556k990k0316q328p473j656J176
16566b8219P471J204l782O202J2791M453r433k250J4568N281j0888o439m597k626
$$ plain form
16552 -16264 -30878 -39578 -47160 -33534 -32605 -31876 -37277 -18225 -14987 -14615 -11837 -17583 -25566 -35168
16538 -35168 -37002 -26570 -27945 -18727 -7173 -1974 -11592 -25376 -27399 -31768 -19583 -24465 -32061
16525 -32061 -26454 -27951 -8556 15901 23852 24088 7862 17748 12438 -3893 -11671 -11689 -9584 -21699
16511 -21699 -15311 -5100 -9908 -3000 816 -4247 -9018 -6151 -8184 -2565 8857 20050 19879 13553
16497 13553 4939 -7409 -5690 -10704 -25474 -25311 -22878 -18998 -11802 -6189 -4737 -9757 -26370 -28217
16483 -28217 -16561 -11565 -14287 -16139 -35005 -33950 -22060 -14788 12756 18481 2781 -9758 -12514
16470 -12514 -8382 -7834 1401 17015 15706 1078 -17185 -9677 293 -14949 -16432 -20809 -23557 -24493
16456 -24493 -27622 -31053 -18393 -13836 -19418 -1534 11664 -2818 -21223 -36241 -32074 -33828 -36675
$$ packed form
16552a6264j4614q700p582J3626R29P29n401J9052L238L72K778n746p983r602
16538c5168j834J0432j375R218J1554N199r618j3784k023m369J2185m882p596
16525c2061N607j497J9395K4457P951K36j6226R886n310j6331p778j8K105j2115
16511b1699O388J0211m808O908L816n063m771K867k033N619J1422J1193j71o326
16497A3553q614j2348J719n014j4770J63K433L880P196N613J452n020j6613j847
16483b8217J1656M996k722j852j8866J055J1890P272K7544N725j5700j2539k756
16470a2514M132N48R235J5614j309j4628j8263P508R970j5242j483m377k748r36
16456b4493l129l431J2660M557n582J7884J3198j4482j8405j5018M167j754k847
$$ plain form
16443 -36675 -33422 -25628 -31689 -26684 -21599 -21908 -24088 -15516 -7463 -12298 -6664 -6294 977 9038 7662
16428 7662 8139 -612 -20590 -30152 -23473 -14555 -22813 -19118 -25401 -30419 -19359 -5945 -2952 916
16414 916 -10833 -4545 3228 2740 864 12505 10816 8899 -7100 -5828 2694 -1371 -16967 -18159
16400 -18159 -7014 -4878 -9520 -11079 -13170 -25726 -22254 -22084 -24910 -17631 -16492 -21705 -25515 -21702
16386 -21702 -26657 -26356 -10469 3275 8177 16530 7020 -10692 -22627 -16226 -7543 -13235 -17480 -13293
16372 -13293 -16548 -30469 -31455 -22469 -15342 -13489 -7371 -5036 -11404 -25302 -33522 -35065 -24964 -16980
16358 -16980 -6264 10466 2807 7259 -1861 -5965 -3852 -5093 -9842 -6539 -5199 -20849 -32146
16345 -32146 -25102 -6935 -7964 -2641 -10674 -21795 -14391 -632 7149 7756 -4926 -21702 -19538
$$ packed form
16443c6675L253P794o061N005N085l09k180Q572Q053m835N634L70P271Q061j376
16428G662M77q751j9978r562O679Q918q258L695o283n018J1060J3414K993L868
16414I16j1749O288P773m88j876J1641j689j917j5999J272Q522m065j5596j192
16400a8159J1145K136m642j559k091j2556L472J70k826P279J139n213l810L813
16386b1702m955L01J5887J3744M902Q353r510j7712j1935O401Q683n692m245M187
16372a3293l255j3921r86Q986P127J853O118K335o368j3898q220j543J0101P984
16358a6980J0716J6730p659M452r120m104K113j241m749L303J340j5650j1297
16345c2146P044J8167j029N323q033j1121P404J3759P781O07j2682j6776K164
$$ plain form
16332 -19538 -6810 -8961 -13678 -287 -3609 -13839 -2777 6838 6782 10085 -6466 -11456 -18536 -19689
16318 -19689 -7886 -1862 -12080 -23326 -13233 1874 1978 5968 2883 -11065 -8241 -5862 -10645
16305 -10645 -2821 3604 5846 -7077 -15071 -12159 -22095 -18094 -20300 -6166 -3478 -17036 -18915 -18895
16291 -18895 -27411 -29158 -23864 -17866 -30271 -21781 -13481 -6176 -10341 4563 13336 10688 5522 347
16277 347 -1675 -16680 -23245 -27022 -23591 -42649 -48095 -43954 -25603 -11757 -6841 -11589 -12665 -4000
16263 -4000 2452 1740 -1140 -10240 -17557 -7753 -710 -2628 -10662 -5116 7105 16827 13332 11266 -7506
16248 -7506 -20296 -9871 -8473 -5584 -6761 -15306 -6212 -4236 8495 11196 7461 -20080 -21391 -8491
16234 -8491 -13802 -9613 -9057 3301 7331 5725 -5023 -18739 -21734 -18187 -19696 -29699 -30361 -18321
$$ packed form
16332a9538J2728k151m717J3391l322j0230J1062R615n6L303j6551m990p080j153
16318a9689J1803O024j0218j1246J0093J5107J04L990l085j3948K824K379m783
16305a0645P824O425K242j2923p994K912r936M001k206J4134K688j3558j879K0
16291a8895q516j747N294N998j2405Q490Q300P305m165J4904Q773k648n166n175
16277C47k022j5005o565l777L431j9058n446M141J8351J3846M916m748j076Q665
16263d000O452p12k880r100p317R804P043j918q034N546J2221R722l495k066j8772
16248g506j2790J0425J398K889j177q545R094J976J2731K701l735k7541j311J2900
16234h491n311M189N56J2358M030j606j0748j3716k995L547j509j0003o62J2040
$$ plain form
16220 -18321 -12562 -6944 1151 35 -6997 -8149 -10246 -14262 -19296 -17511 -27183 -31108 -27080 -25559
16206 -25559 -21584 -18469 -25443 -30197 -39897 -32678 -30921 -37327 -41051 -35541 -22600 -13243 -8831 -16868
16192 -16868 -31075 -25789 -15266 -23055 -7341 -12316 -19055 -24519 -25187 -13837 -2358 2621 -3123
16179 -3123 -5921 7085 11437 1384 -1999 -17746 -16927 -11429 -10137 -17206 -18337 -4171 -9237 -12986
16165 -12986 -5824 -4118 -852 1697 -6132 -18112 -24477 -29724 -22129 -3891 -19941 -25364 -23367 -2308
16151 -2308 8765 10916 4954 -12730 -17408 -3853 -10881 -32207 -49650 -51343 -55249 -47982 -23511
16138 -23511 -6406 -2950 -9138 -13042 -14264 -7107 -11183 2650 -2995 -3946 -5536 -3066 -6545 -25636
16124 -25636 -36066 -31156 -14061 -6927 -3462 7706 177 -18720 -33832 -39220 -33576 -28010 -25476
$$ packed form
16220a8321N759N618Q095j116p032j152k097m016n034J785r672l925M028J521
16206b5559L975L115o974m754r700P219J757o406l724N510J2941R357M412q037
16192a6868j4207N286J0523p789J5714m975o739n464o68J1350J1479M979n744
16179c123k798J3006M352j0053l383j5747Q19N498J292p069j131J4166n066l749
16165a2986P162J706L266K549p829j1980o365n247P595J8238j6050n423J997K1059
16151b308J1073K151n962j7684m678J3555p028k1326j7443j693l906P267K4471
16138b3511J7105L456o188l904j222P157m076J3833n645r51j590K470l479j9091
16124b5636j0430M910J7095P134L465J1168p529j8897j5112n388N644N566K534
$$ plain form
16111 -25476 -32661 -33556 -40985 -48639 -46270 -31051 -20596 -28011 -40132 -30371 -15293 -16544 -21661 -6253
16097 -6253 3939 -15460 -19030 -14239 -13476 4780 14787 3038 -7109 954 439 -248 814 -1317
16083 -1317 -10207 -22041 -25549 -25563 -27482 -37018 -24058 -9642 -5114 -7434 -7681 -23369 -12162 -12915
16069 -12915 -10592 -2704 -1970 -8755 -21716 -20289 -26444 -27958 -30903 -39308 -24593 -11586 -25645 -27975
16055 -27975 -23309 -17799 -7114 -15840 -32356 -41322 -29531 -11534 8429 12133 923 -15953 -20279
16042 -20279 -6293 2855 9429 450 -12791 -14663 -16286 -23304 -30433 -35961 -39158 -22316 -9237
16029 -9237 -2645 -6747 -12928 1686 -6062 -9968 10624 34960 27114 11566 11716 15831 16851 812
16015 812 -6625 -24327 -25016 -29439 -13436 5031 679 -9661 -15804 -12731 -18635 -19857 -17822 -8509
$$ packed form
16111b5476p185q95p429p654K369J5219J0455p415j2121R761J5078j251n117J5408
16097f253J0192j9399l570M791P63J8256J0007j1749j0147Q063n15o87J062k131
16083a317q890j1834l508j4j919r536J2960J4416M528k320k47j5688J1207p53
16069a2915K323P888P34o785j2961J427o155j514k945q405J4715J3007j4059k330
16055b7975M666N510J0685q726j6516q966J1791J7997J9963L704j1210j6876m326
16042b0279J3986R148O574q979j3241j872j623p018p129n528l197J6842J3079
16029i237O592m102o181J4614p748l906K0592K4336p846j5548J50M115J020j6039
16015H12p437j7702o89m423J6003J8467m352j0340o143L073n904j222K035R313
$$ plain form
16001 -8509 -14202 -10385 12723 17957 492 -11999 -4751 -1596 -8050 -12592 -9454 -3458 -5296 -1700
15987 -1700 7818 11519 8062 5924 10028 11797 -2886 3225 2629 -6835 259 3222 17412 9128
15973 9128 -335 5388 -14591 -11705 7746 17898 18643 19588 19073 15696 4627 -5116 297 14819
15959 14819 15946 15853 1063 -11759 -30663 -44003 -30849 -20555 1876 -1910 -6149 -5753 -9868
15946 -9868 -6333 -18695 -21445 -15850 -20984 -19480 -10924 -2240 -610 4346 4974 24025 48393 46642
15932 46642 44207 26089 21690 18084 14652 10546 19625 23800 9366 7130 17813 12681 4461 -5575
15918 -5575 -16781 -2463 -12753 -14805 -29623 -44348 -43699 -35493 -27350 -10414 4556 -9724 -14148
15905 -14148 -11264 -23412 -26215 -9746 -4698 4006 16409 20650 4775 -3410 -3898 -13486 -18939 -20548
$$ packed form
16001h509n693L817K3108N234j7465j2491P248L155o454m542L138N996j838L596
15987a700R518L701l457k138M104J769j4683O111n96r464P094K963J4190q284
15973I128r463N723j9979K886J9451J0152P45R45n15l377j1069r743N413J4522
15959A4819J127r3j4790j2822j8904j3340J3154J0294K2431l786m239L96m115
15946i868L535j2362k750N595n134J504Q556Q684J630M956O28J9051K4368j751
15932D6642k435j8118m399l606l432m106R079M175j4434k236J0683n132q220j0036
15918e575j1206J4318j0290k052j4818j4725O49Q206Q143J6936J4970j4280m424
15905a4148K884j2148k803J6469N048Q704J2403M241j5875q185m88r588n453j609
$$ plain form
15891 -20548 -11426 -14666 -17590 -11682 -3889 -7813 -20892 -15372 -8072 -7536 -15156 -14278 -1902 -3382
15877 -3382 -19797 -24198 -14264 -9093 -949 8631 7144 19367 27795 8984 -11577 -19399 -7179
15864 -7179 5406 21318 18248 13560 1935 2224 -1913 -14630 -7891 3453 5664 -1042 1913 15510
15850 15510 10130 4338 13445 -172 -5212 -11365 -7221 1070 10671 12313 4055 -8739 -28966 -49537
15836 -49537 -59675 -47478 -21128 709 6081 14782 8770 -9230 -15827 -6446 -13643 -11806 7946
15823 7946 32269 49047 49223 30956 13296 11183 499 968 -9773 -12405 -4813 -28527 -46896
15810 -46896 -36156 -19916 -2935 4492 1182 2818 6617 6350 -6819 -15637 -14982 -11676 -11099 -2820
15796 -2820 -6428 -395 310 -3439 -8884 -5177 7699 13825 20060 28758 20593 18493 12212 -13278
$$ packed form
15891b0548R122l240k924N908P793l924j3079N520P300N36p620Q78J2376j480
15877c382j6415m401R934N171Q144R580j487J2223Q428j8811k0561p822J2220
15864g179J2585J5912l070m688j1625K89m137j2717O739J1344K211o706K955J3597
15850A5510n380n792R107j3617n040o153M144Q291R601J642q258j2794k0227k0571
15836d9537j0138J2197K6350K1837N372Q701o012j8000o597R381p197J837J9752
15823G946K4323J6778J76j8267j7660k113j0684M69j0741k632P592k3714j8369
15810d6896J0740J6240J6981P427l310J636L799k67j3169q818O55L306N77Q279
15796b820l608O033P05l749n445L707J2876O126O235Q698q165k100o281k5490
$$ plain form
15782 -13278 -23124 3733 17210 19400 11880 -8311 -5933 -1790 8105 1314 1666 2427 2125 6394
15768 6394 14218 17008 2538 -5440 -5349 10291 10696 -2828 5849 6753 -7600 -3743 -11772 -9672 -11102
15753 -11102 -11463 -2416 -2752 4993 2911 -14526 -7814 -1534 -3438 -6475 15043 22079 13824 -2847
15739 -2847 -5613 -6570 8822 26654 13545 14069 14901 17678 10350 3749 -8818 -8934 -12946 -11435 -364
15724 -364 4185 -1696 2265 24907 33343 22435 10574 19870 18901 23108 11661 -9003 -12237 -16164
15710 -16164 -8791 1632 -236 9448 9377 11645 10616 -14457 -8803 -4377 1232 2737 -10235 108
15696 108 5852 -8859 -1733 7788 11909 15352 14978 16467 16607 15058 14906 16703 12758 -2651 -10127
15681 -10127 -7673 -10519 -2010 21543 37024 23761 25267 21919 -926 -7260 -3705 -6582 -3593
$$ packed form
15782a3278r846K6857J3477K190p520k0191K378M143R895o791L52P61l02M269
15768F394P824K790j4470p978R1J5640M05j3524Q677R04j4353L857q029K100j430
15753a1102l61R047l36P745k082j7437O712O280j904l037K1518P036q255j6671
15739b847k766r57J5392J7832j3109N24Q32K777p328o601j2567j16m012J511J1071
15724c64M549n881L961K2642Q436j0908j1861R296r69M207j1447k0664l234l927
15710a6164P373J0423j868R684p1K268j029k5073N654M426N609J505j2972J0343
15696A08N744j4711P126R521M121L443l74J489J40j549j52J797l945j5409p476
15681a0127K454k846Q509K3553J5481j3263J506l348k2845o334L555k877K989
$$ plain form
15668 -3593 -4489 -2891 3839 3130 242 4139 10813 14202 838 -3204 18520 21318 12247 13152 11640
15653 11640 -3491 -5764 -13085 1887 12651 14716 6304 26334 44342 37219 18116 3319 3473
15640 3473 5143 5018 16053 10727 4162 1239 -4826 -7531 4043 16663 25977 26623 17948 2067
15626 2067 -9435 -7525 -11713 -2880 16919 13952 10919 12261 1265 2647 10968 16998 10833 7250
15612 7250 2441 9021 8416 16038 14761 17638 12168 7378 21144 20923 -2795 -1935 -2941 12899 25286
15597 25286 14469 12593 4629 12010 5948 5327 22744 11822 -7579 -2299 12168 15588 14785 8529
15583 8529 5801 14877 40892 51894 33685 15770 23541 37447 40597 38689 23205 15520 13396
15570 13396 21599 25734 20240 22600 21366 39805 36365 13544 -1820 12688 20654 33357 47467
$$ packed form
15668c593q96J598O730p09k888L897O674L389j3364m042K1724K798r071R05j512
15653A1640j5131k273p321J4972J0764K065q412K0030J8008p123j9103j4797J54
15640C473J670j25J1035n326o565k923o065k705J1574J2620R314O46q675j5881
15626B067j1502J910m188Q833J9799k967l033J342j0996J382Q321O030o165l583
15612G250m809O580o05P622j277K877n470m790J3766k21k3718Q60j006J5840J2387
15597B5286j0817j876p964P381o062o21J7417j0922j9401N280J4467L420q03o256
15583H529k728R076K6015J1002j8209j7915P771J3906L150j908j5484p685k124
15570A3396Q203M135n494K360j234J8439l440k2821j5364J4508P966J2703J4110
$$ plain form
15557 47467 52020 30696 26460 27900 23802 21378 13265 26979 33528 27274 12602 11675 8855 26316
15543 26316 44280 43470 37700 22120 7927 409 -27400 -17115 -4216 -8019 5404 13919 33643
15530 33643 52031 48885 36367 31955 29708 22028 18829 29868 33625 27979 34405 39988 35396 29163
15516 29163 19555 6561 -11630 -1350 12806 34728 47837 43283 39180 17338 12082 7996 -6812
15503 -6812 -10609 -759 -470 -2671 4596 18957 21205 15779 9045 16364 21471 15152 -3379 -13189
15489 -13189 7430 30276 31631 17337 -5570 5969 19587 23574 19351 11871 15112 27516 29040
15476 29040 17103 19799 17027 18716 8763 638 10152 15078 11014 26719 36404 45179 38128 20215
15462 20215 28462 46263 36743 26969 23708 23469 19552 14810 14888 17828 24931 32475 28090 25496 14338
$$ packed form
15557D7467M553k1324m236J440m098k424q113J3714O549o254j4672r27k820J7461
15543B6316J7964q10n770j5580j4193p518k7809J0285J2899l803J3423Q515J9724
15530C3643J8388l146j2518m412k247p680l199J1039L757n646O426N583m592o233
15516B9163r608j2994j8191J0280J4156K1922J3109m554m103k1842n256m086j4808
15503f812l797R850K89k201P267J4361K248n426o734P319N107o319j8531r810
15489a3189K0619K2846J355j4294k2907J1539J3618L987m223p480L241J2404J524
15476B9040j1937K696k772J689r953q125R514M926m064J5705R685Q775p051j7913
15462B0215Q247J7801r520r774l261k39l917m742P8K940P103P544m385k594j1158
$$ plain form
15447 14338 9323 3776 17 -3612 -7233 13796 21885 20339 13297 2784 -3154 -1535 2599 9070
15433 9070 20058 15305 -6061 161 25523 21052 8327 6811 -9116 -6648 2901 6076 -476
15420 -476 1168 419 11869 29147 27441 33142 27310 22768 29182 30345 43403 44525 24936 8775
15406 8775 8939 10966 25465 23212 8645 6480 12020 3556 -478 2897 -3759 10290 25225 35484
15392 35484 29278 30955 26444 13181 11648 8919 4175 17978 19718 26320 38190 35700 28630 11565
15378 11565 1281 -7926 87 16863 26260 30259 42740 26310 4610 5112 10560 23266 31430
15365 31430 26452 21802 19291 15735 7289 -429 -16042 -36711 -15858 -15950 -5081 -1794 -4608 -15338
15351 -15338 -37065 -44487 -30245 -17007 -4276 5118 1233 -3451 9682 1731 7366 23964 30339
$$ packed form
15447A4338n015n547l759l629l621K1029Q089j546p042j0513n938J619M134O471
15433I070J0988m753k1366O222K5362m471j2725j516j5927K468R549L175o552
15420d76J644p49J1450J7278j706N701n832m542O414J163J3058J122j9589j6161
15406H775J64K027J4499k253j4567k165N540q464m034L375o656J4049J4935J0259
15392C5484o206J677m511j3263j533k729m744J3803J740O602J1870k490p070j7065
15378A1565j0284r207Q013J6776R397L999J2481j6430k1700N02N448J2706Q164
15365C1430m978m650k511l556q446p718j5613k0669K0853r2J0869L287k814j0730
15351a5338k1727p422J4242J3238J2731R394l885m684J3133p951N635J6598O375
$$ plain form
15338 30339 28266 24559 13549 9335 14292 26279 46910 26350 6685 -815 3447 14079 17387
15325 17387 21218 22506 13145 15083 21123 8006 1197 6053 20504 19787 3645 -10581 -11143 -3727
15311 -3727 -5334 -5449 2118 422 3524 15790 27353 24315 8700 -16378 -23453 -18694 -12065 -6082
15297 -6082 -6488 12882 21850 13489 12103 9970 -15745 -19290 -856 4769 4486 -17969 -41709 -33233
15283 -33233 -26785 -32280 -23523 -6309 2660 -551 9326 10610 5533 5666 13761 16309 11056 14605
15269 14605 7145 2826 -1329 -945 -9882 -15304 -17636 -19970 -28873 -20463 -8494 -14101 -16679 -15502
15255 -15502 -14300 3533 16386 24747 7606 -11431 -7412 -3014 -493 2815 -8756 -11070 -15921
15242 -15921 -29264 -27278 -20142 -21475 -7495 485 6921 647 12114 5811 415 -8691 -1913 1126
$$ packed form
15338C0339k073l707j1010m214M957J1987K0631k0560j9665p500M262J0632L308
15325A7387L831J288r361J938O040j3117o809M856J4451p17j6142j4226n62P416
15311c727j607j15P567j696L102J2266J1563l038j5615k5078p075M759O629N983
15297f082m06J9370Q968q361j386k133k5715l545J8434N625k83k2455k3740Q476
15283c3233O448n495Q757J7214Q969l211R877J284n077J33Q095K548n253L549
15269A4605p460m319m155L84q937n422k332k334q903Q410J1969n607k578J177
15255a5502J202J7833J2853Q361j7141j9037M019M398K521L308j1571k314m851
15242a5921j3343J986P136j333J3980P980O436o274J1467o303n396r106O778L039
$$ plain form
15228 1126 -18608 -32522 -27775 -17022 -11849 -2035 -1507 -5797 3201 21671 28558 24367 23419 33784
15214 33784 32842 9847 -3526 -4032 -8296 6574 11942 6355 2514 7599 6880 5753 14987 -509
15200 -509 6754 28244 37310 24780 39006 48927 28644 12631 2800 -5224 -17899 -12508 -12134 11899
15186 11899 35918 43462 38459 28596 14097 -2660 -269 -156 1303 6318 -5250 -795 11698
15173 11698 18050 19124 27691 20600 11460 23206 34967 14432 11992 15374 14764 16663 15664 17276
15159 17276 5869 10452 14278 7127 16037 15703 12015 11570 21980 23277 27767 37745 40711 23493
15145 23493 20801 20055 16007 12184 14231 16818 16420 8952 5929 18405 18122 25229 28248 43037 31847
15130 31847 18998 20310 18604 13143 6306 8375 128 -3646 -764 11018 18989 34862 39909 32508
$$ packed form
15228A126j9734j3914M747J0753N173R814N28m290Q998J8470O887m191r48J0365
15214C3784r42k2995j3373n06m264J4870N368n587l841N085p19j127R234j5496
15200e09P263K1490R066j2530J4226R921k0283j6013r831q024j2675N391L74K4033
15186A1899K4019P544n003r863j4499j6757K391J13J459N015j1568M455J2493
15173A1698O352J074Q567p091r140J1746J1761k0535k440L382o10J899r99J612
15159A7276j1407M583L826p151Q910l34l688m45J0410J297M490R978K966j7218
15145B3493k692p46m048l823K047K587l98p468l023J2476k83P107L019J4789j1190
15130C1847j2849J312j706n461o837K069q247l774K882J1782P971J5873N047p401
$$ plain form
15116 32508 19606 5446 7199 11969 6829 8190 -210 -921 -10219 -10066 11639 20408 14252 7048
15102 7048 -1925 -12057 -14197 -6955 -8574 -4182 -10888 -13873 -15631 -56 12773 15891 12838 29971
15088 29971 17705 25400 20479 16498 18805 14338 21718 17084 4009 -2279 3578 -10453 -17333 -5379
15074 -5379 18899 27895 23136 24007 19548 24099 21643 12460 15968 9966 714 7754 10907 10786 12088
15059 12088 11881 7359 8300 4113 -6641 -13060 -18002 -25230 -6077 -5562 -61 3079 -10950 -25213
15045 -25213 -25572 -2811 6508 8681 20410 9643 624 -8095 -13513 -14447 1510 8344 13656 11251
15031 11251 3466 2170 12968 10010 -132 -7369 -19019 -25635 -40914 -45791 -42131 -22390 -24921
15018 -24921 -28736 -36174 -38832 -34474 -31889 -27278 -17466 -22178 -26864 -14917 -13886 -13985 260 6053
$$ packed form
15116C2508j2902j4160J753M770n140J361q400p11r298J53K1705Q769o156p204
15102G048q973j0132k140P242j619M392o706k985j758J5575J2829L118l053J7133
15088B9971j2266P695m921l981K307m467P380m634j3075o288N857j4031o880J1954
15074e379K4278Q996m759Q71m459M551k456r183L508o002r252P040L153j21J302
15059A2088k07m522R41m187j0754o419m942p228J9153N15N501L140j4029j4263
15045b5213l59K2761R319K173J1729j0767r019q719n418r34J5957O834N312k405
15031A1251p785j296J0798k958j0142p237j1650o616j5279m877L660J9741k531
15018b4921l815p438k658M358K585M611R812m712m686J1947J031r9J4245N793
$$ plain form
15004 6053 -4598 -22971 -20270 473 4883 -5676 -6948 11116 348 -14328 -2764 14579
14992 14579 14953 12541 3920 -15189 -28476 -28017 -35452 -39233 -34677 -29457 -11717 9273 21684 8721
14978 8721 -7700 -17527 -19543 -11543 -6444 -10348 -25933 -28931 -23849 -17765 -16957 -18937 -29462 -22282
14964 -22282 -3323 1313 6651 6793 -10409 -23186 -38261 -33312 -15516 -4765 -4498 -14968 -17294
14951 -17294 -15194 -6238 -11894 -15603 -15885 -13289 -4648 -7812 -18849 -16546 -19279 -20669 -13511 -10787
14937 -10787 -1471 -7154 -27085 -20980 -4081 -1428 2479 5322 -5245 -11993 -24275 -21185 -13411
14924 -13411 -20495 -24107 -18874 -16556 -15169 -17644 -9519 -9357 10437 4389 -11251 -22090 -16597 -3474
14910 -3474 7095 10319 -662 -11435 -4825 -10760 -15059 -8188 4427 4379 8365 12429 -1199 -16063
$$ packed form
15004F053j0651j8373K701K0743M410j0559j272J8064j0768j4676J1564J7343
14992A4579L74k412q621j9109j3287M59p435l781M556N220J7740K0990J2411j2963
14978H721j6421r827k016Q000N099l904j5585k998N082O084Q08j980j0525P180
14964b2282J8959M636N338J42j7202j2777j5075M949J7796J0751K67j0470k326
14951a7294K100Q956n656l709k82K596Q641l164j1037K303k733j390P158K724
14937a0787R316n683j9931O105J6899K653L907K843j0567o748j2282L090P774
14924a3411p084l612N233K318J387k475Q125J62J9794o048j5640j0839N493J3123
14910c474J0569L224j0981j0773O610n935m299O871J2615m8L986M064j3628j4864
$$ plain form
14896 -16063 -10429 -22358 -21934 -13498 2904 3705 10326 -7583 -11941 -4975 -12128 -14313 -5382 8303
14882 8303 11970 -3068 -9657 -8909 -2282 5407 6714 -7613 -10573 -7956 -9241 1724 13565 1583
14868 1583 -8943 -20284 -24290 -17119 -23023 -22012 -8368 -6191 -9029 -12270 3480 14283 1974
14855 1974 -5490 -4836 -10290 -7069 -4187 -30957 -23089 -2111 9450 -1938 -23495 -28468 -13848
14842 -13848 -9749 -15195 -18015 -18644 -2373 -10111 -23055 -17401 -22448 -20286 -27514 -26363 -9842 -7204
14828 -7204 -17450 -23941 -15321 -23238 -29561 -26637 -7309 1633 -13593 -25142 -21282 -8027 -14128
14815 -14128 -29099 -33038 -10989 -1195 3727 12342 14995 -2776 -5476 -7166 1986 -1565 -8816 -10967
14801 -10967 -19447 -33911 -38892 -26516 -26251 -20470 -10761 -28924 -32897 -26966 -26724 -21575 -19608 -12673
$$ packed form
14896a6063N634j1929M24Q436J6402Q01O621j7909m358O966p153k185Q931J3685
14882H303L667j5038o589P48O627P689J307j4327k960K617j285J0965J1841j1982
14868A583j0526j1341m006P171n904J011J3644K177k838l241J5750J0803j2309
14855A974p464O54n454L221K882k6770P868K0978J1561j1388k1557m973J4620
14842a3848M099n446k820o29J6271p738j2944N654n047K162p228J151J6521K638
14828g204j0246o491Q620p917o323K924J9328Q942j5226j1549L860J3255o101
14815a4128j4971l939K2049R794M922Q615K653j7771k700j690R152l551p251k151
14801a0967q480j4464m981J2376K65N781R709j8163l973N931K42N149J967O935
$$ plain form
14787 -12673 -21586 -31764 -42646 -22021 -12320 2600 8832 5315 -8566 -20281 -25541 -35741 -27612
14774 -27612 -7971 9667 6118 -3589 3948 4668 -9703 -17881 1259 7132 9979 12209 8317 10414
14760 10414 20539 16354 4 -14743 -5164 5086 10735 6979 -4345 -3592 -2958 -5157 -11731 -29366
14746 -29366 -39450 -31102 -18240 -8151 -12393 -11663 -5699 -6042 -12565 -9446 -1451 2129 2488 -7988
14732 -7988 -18851 -6888 18317 17137 7704 2439 11629 -1458 -9289 -15676 1907 4951 -9894
14719 -9894 -29571 -31420 -24741 -5506 -11636 -14573 -32278 -46752 -49628 -45030 -27718 -18757 -11948
14706 -11948 -12717 -22677 -14964 3695 1007 -2897 -11909 -11360 -14275 -27424 -27140 -24949 -14541 -20146
14692 -20146 -26496 -13524 -9206 -7744 -11592 -19711 -26045 -25705 -25387 -14734 -13763 -30258 -34415 -36424
$$ packed form
14787a2673q913j0178j0882K0625R701J4920O232l517j3881j1715n260j0200Q129
14774b7612J9641J7638l549r707P537P20j4371q178J9140N873K847K230l892K097
14760A0414J0125m185j6350j4747R579J0250N649l756j1324P53O34k199o574j7635
14746b9366j0084Q348J2862J0089m242P30N964l43o523L119P995L580L59j0476
14732g988j0863J1963K5205j180r433n265R190j3087p831o387J7583L044j4845
14719i894j9677j849O679J9235o130k937j7705j4474k876M598J7312Q961O809
14706a1948p69r960P713J8659k688l904r012N49k915j3149K84K191J0408n605
14692b0146o350J2972M318J462l848q119o334L40L18J0653R71j6495m157k009
$$ plain form
14678 -36424 -20885 2374 -2074 -2450 -7771 -6397 -9779 -9869 6296 11418 -633 -5558 -2559 -1699
14664 -1699 -12579 -20096 -14146 -20595 -25669 -6312 10324 15140 9284 -4051 -9074 -17377 -19774 -26108
14650 -26108 -22680 -16697 -6851 -266 -3701 -14856 -4868 -3420 -9616 -9099 2916 -2452 -8773 -2039
14636 -2039 10195 10584 4531 4595 1750 -218 -9153 3591 -13067 -18866 -8895 -3570 5654 26950
14622 26950 30174 13719 10349 16870 26204 22194 15250 7906 9556 -1682 -11546 -18761 -15677 -6363
14608 -6363 -8459 -5401 -1592 6681 13541 19869 16079 16130 5348 -4590 -6568 -31971 -21523 -7498
14594 -7498 -12807 -19750 -128 14391 -4229 -3266 -73 -14914 -32324 -27565 -21946 -22883 -19472 -11060
14580 -11060 -20865 -34562 -25053 -27902 -19830 622 -2614 -6358 -10668 -9356 -5971 2378 -1459 -6639
$$ packed form
14678c6424J5539K3259m448l76n321J374l382r0J6165N122j2051m925K999Q60
14664a699j0880p517N950o449n074J9357J6636M816n856j3335n023q303k397o334
14650b6108L428N983R846O585l435j1155R988J448o196N17J2015n368o321O734
14636b039J2234L89o053O4k845j968q935J2744j6658n799R971N325R224K1296
14622B6950L224j6455l370O521R334m010o944p344J650j1238r864p215L084R314
14608f363k096L058L809Q273O860O328l790N1j0782r938j978k5403J0448J4025
14594g498n309o943J9622J4519j8620R63L193j4841j7410M759N619r37L411Q412
14580a1060r805j3697R509k849Q072K0452l236l744m310J312L385Q349l837n180
$$ plain form
14566 -6639 -4566 -16249 -16312 -13823 -11931 -5588 -9244 -23731 -32357 -16064 4748 25748 26598 8891
14552 8891 24313 41343 37669 2016 2452 5161 -1362 8728 22828 18253 8134 5302 5763 -3900
14538 -3900 -13929 -16284 -13129 -10049 -7736 532 -9861 -5746 -7805 -8135 -13600 -7243 5369 13691
14524 13691 5406 -6914 -7634 -9234 -6887 7516 26362 51856 48232 22661 18142 29656 32815
14511 32815 42416 48719 27889 4839 14168 29654 28833 25656 20983 6554 -1562 -1520 -13510 -6875
14497 -6875 4994 13753 9026 6055 15740 12115 -1891 -1417 -5244 -2107 -609 2373 6440 -2795
14483 -2795 -5199 -14354 -10342 1364 -8961 -25958 -24712 -14259 -16022 -15111 -11955 -3277 -2211 -9022
14469 -9022 -13629 -25082 -17468 -3167 -3916 5423 10721 11189 5795 -6877 -3367 -12065 -18265 -19111 549
$$ packed form
14566f639K073j1683o3K489J892O343l656j4487q626J6293K0812K1000Q50j7707
14552H891J5422J7030l674l5653M36K709o523J0090J4100m575j0119k832M61r663
14538c900j0029k355L155L080K313Q268j0393M115k059l30n465O357J2612Q322
14524A3691q285j2320p20j600K347J4403J8846K5494l624k5571m519J1514L159
14511C2815R601O303k0830k3050R329J5486q21l177m673j4429q116M2j1990O635
14497f875J1869Q759m727k971R685l625j4006M74l827L137J498K982M067r235
14483b795k404r155M012J1706j0325j6997J246J0453j763R11L156Q678J066o811
14469i022m607j1453P614J4301p49R339N298M68n394j2672L510q698o200q46J9660
$$ plain form
14454 549 -1471 -15695 -18366 -12158 -4939 -3788 414 6454 11857 19159 -1828 -12776 -13965 -7760
14440 -7760 -2147 3967 9068 8093 8096 7492 -1833 -11626 -18790 -14980 -10180 -10344 -4142 -6762 -2764 -2850 -9614
14423 -9614 -12358 -2767 -15586 -16034 -10168 -12679 -24041 -23426 -17074 -8879 -4781 -5002 -1646 -8150 -7227
14408 -7227 -2498 -6176 -9693 -3167 -2509 -13799 -11057 -3791 12181 17457 1869 -15321 -2583 10847
14394 10847 5984 -5367 -23457 -22802 -19210 -19827 -13264 1105 7404 -1170 -8929 -27153 -33376 -24193
14380 -24193 -6166 -6449 833 11205 12543 -7867 -18174 -17045 -9580 -15687 -35715 -31387 -25324
14367 -25324 -23438 -12029 -2473 -2204 -4445 -7907 -4411 5532 10568 -4308 -12330 -11741 -4016 7339
14353 7339 9898 -10274 -42533 -49459 -34127 -12949 -10842 -17081 -13207 -12316 -12975 -15052 2222 8379
$$ packed form
14454E49k020j4224k671O208P219J151M202O040N403P302k0987j0948j189O205
14440g760N613O114N101r75Lo04r325r793p164L810M800j64O202k620L998q6o764
14423i614k744R591j2819m48N866k511j1362O15O352Q195M098k21L356o504R23
14408g227M729l678l517O526O58j1290K742P266J5972N276j5588j7190J2738J3430
14394A0847m863j1351j8090O55L592o17O563J4369O299q574p759j8224o223R183
14380b4193J8027k83P282J0372J338k0410j0307J129P465o107k0028M328O063
14367b5324J886J1409R556K69k241l462L496R943N036j4876q022N89P725J1355
14353G339K559k0172l2259o926J5332K1178K107o239L874Q91o59k077J7274O157
$$ plain form
14339 8379 -3030 -17818 -25315 -10622 -2824 -4751 -10044 -12683 -2218 -6969 552 -5893 -18147
14326 -18147 -10747 -6195 -9647 -13161 -11478 -23353 -29549 -18717 -1176 -11831 -25361 -27542 -18257
14313 -18257 -5831 -7324 105 -3553 -8707 -8825 -15698 -17309 -10710 -9037 -2601 6285 10212 1394
14299 1394 6785 3573 -3777 8643 12805 6410 9579 13047 3388 10133 23843 12018 10640 19418
14285 19418 14715 7433 -1656 -13313 -12040 -2925 6157 -3638 -6112 -8630 -17415 -18973 -12456 -21850
14271 -21850 -18813 -25291 -28742 -25912 -20346 -19228 -14111 -15875 -16719 -12785 -5362 -8543 -8467 -5453 -23060
14256 -23060 -24604 -21470 -16438 -15362 -27138 -20784 -24843 -22350 -12424 8602 24483 13631 4397
14243 4397 -2967 -5019 -643 5747 1891 -644 -11309 -17606 -27366 -26219 -29033 -31196 -20988 -14893
$$ packed form
14339H379j1409j4788p497J4693P798j927n293k639J0465m751P521o445j2254
14326a8147P400M552l452l514J683j1875o196J0832J7541j0655j3530k181R285
14313a8257J2426j493P429l658n154j18o873j611O599J673O436Q886L927q818
14299A394N391l212p350J2420M162o395L169L468r659O745J3710j1825j378Q778
14285A9418m703p282r089j1657J273R115R082r795k474k518q785j558O517r394
14271b1850L037o478l451K830N566J118N117j764q44L934P423l181P6L014j7607
14256b3060j544L134N032J076j1776O354m059K493R926K1026J5881j0852r234
14243D397p364k052M376O390l856k535j0665o297r760J147k814k163J0208O095
$$ plain form
14229 -14893 -10493 5663 -2327 -23805 -14531 -7236 -25524 -28665 -21394 -18970 -10842 882 -394
14216 -394 -8500 -5397 -14867 -6920 -4988 -7784 -4173 8245 1899 -2803 -11708 -21621 -42346 -26644
14202 -26644 -14882 -9911 426 6696 -3208 -8496 -258 -233 -4917 -8034 -2704 -11032 -26222 -13554
14188 -13554 -12952 -27712 -30152 -16581 -10546 -34294 -32865 -30436 -21437 -23748 -15679 -774 -1282 -1747
14174 -1747 -4238 -12667 -21267 -13537 -9372 -5548 -5643 -10872 -6513 11706 15753 6239 18358 32054
14160 32054 24859 16560 6987 -4043 -9728 71 -1481 4408 4488 6459 -3372 3463 1452 5771 3169
14145 3169 -6978 -5636 694 4882 4742 12878 18203 -1143 -9041 -25939 -28920 -7623 4134 -7151
14131 -7151 -8922 -12928 -14276 -14795 -1447 8684 966 -14691 -21891 -20465 -14736 -3248 -15012 -18256
$$ packed form
14229a4893M400J6156p990k1478R274P295j8288l141P271K424Q128J1724j276
14216c94q106L103r470P947J932k796L611J2418o346m702q905r913k0725J5702
14202b6644J1762M971J0337O270r904n288Q238K5m684l117N330q328j5190J2668
14188a3554O02j4760k440J3571O035k3748J429K429Q999k311Q069J4905n08m65
14174a747k491q429q600P730M165L824r5n229M359J8219M047r514J2119J3696
14160C2054p195q299r573j1030n685R799j552N889Q0J971r831O835k011M319k602
14145C169j0147J342O330M188j40Q136N325j9346p898j6898k981K1297J1757j1285
14131g151j771m006j348n19J3348J0131p718j5657p200J426N729J1488j1764l244
$$ plain form
14117 -18256 -19509 -25270 -17413 -15746 -15397 -20449 -19755 -15979 -34693 -42489 -41356 -31188 -8307 9932
14103 9932 -1422 -9672 -18672 -10842 -6054 -1524 -1266 12659 5830 3789 -4552 -10315 -7812 54
14089 54 -17332 -13552 7811 3912 3547 9973 6977 3284 4273 7500 -6086 7096 11228 4560 -2424
14074 -2424 -14422 -19199 -18168 -10189 -2644 -14376 -14310 -15831 -10854 -5567 -5248 766 -6144 -12144 3670
14059 3670 21866 18945 17830 8687 -11062 -15245 2580 -4640 -8831 -6876 2182 5561 9880 -4217
14045 -4217 -10087 -6128 -8315 -17767 -18976 -24009 -9581 4528 1077 12776 20708 8637 7564 7087
14031 7087 4820 5604 -132 -8618 -8419 -8976 -7167 -1198 -3319 -10601 -10737 -21047 -40222 -39810 -30894
14016 -30894 -16217 -4025 -6685 -5398 -3780 -7723 -32243 -31097 -11740 -14063 -30169 -26362 -20277
$$ packed form
14117a8256j253n761P857J667L49n052O94L776j8714p796J133J0168K2881J8239
14103I932j1354q250r000P830M788M530K58J3925o829k041q341n763K503P866
14089E4j7386L780K1363l899l65O426k996l693R89L227j3586J3182M132o668o984
14074b424j1998m777J031P979P545j1732O6j521M977N287L19O014o910o000J5814
14059C670J8196k921j115r143j9749m183J7825p220m191J955R058L379M319j4097
14045d217n870L959k187r452j209n033J4428J4109l451J1699P932j2071j073m77
14031G087k267P84n736q486J99n57J809N969k121p282j36j0310j9175M12Q916
14016c0894J4677J2192k660J287J618l943k4520J146J9357k323j6106L807O085
$$ plain form
14003 -20277 -7682 5500 6371 2836 -1601 3762 -6857 -23182 -30029 -43827 -31709 -20304 -7537
13990 -7537 -5371 -13028 -5495 -3107 -14561 -8729 -842 -4757 1365 -1738 -8038 -7270 -11962 -22375
13976 -22375 -8630 585 -335 -5910 7848 16344 7254 -17719 -28604 -27376 -24332 -18909 -27725 -25584
13962 -25584 -23384 -19212 -17001 -15766 -18340 -18164 -17143 -14840 -11091 -14845 -19186 -18151 -8602 1526
13948 1526 -2045 -29875 -45703 -25413 -13756 2024 3310 -4498 -9188 -25709 -23388 -12624 -16632
13935 -16632 -8605 -1147 -15705 -21080 -6543 1446 2976 -7193 -23019 -18265 -14031 -10895 -9487
13922 -9487 8736 24972 29740 24069 19771 17634 -3849 1554 7176 8433 3519 1596 -18988 -25188
13908 -25188 -17859 -3749 -17624 -29147 -24289 -20811 -25849 -26144 -23499 -13046 -10242 1261 23402
$$ packed form
14003b0277J2595J3182Q71l535m437N363j0619j6325o847j3798J2118J1405J2767
13990g537K166p657P533K388j1454N832P887l915O122l103o300P68m692j0413
13976b2375J3745R215r20n575J3758Q496r090k4973j0885J228L044N423q816K141
13962b5584K200M172K211J235k574J76J021K303L749l754m341J035R549J0128
13948A526l571k7830j5828K0290J1657J5780J286p808m690j6521K321J0764m008
13935a6632Q027P458j4558n375J4537P989J530j0169j5826M754M234L136J408
13922i487J8223J6236M768n671m298k137k1483N403N622J257m914j923k0584o200
13908b5188P329J4110j3875j1523M858L478n038k95K645J0453K804J1503K2141
$$ plain form
13895 23402 18435 3512 6804 22054 20305 8524 -6462 -14300 -6248 -4658 -10420 365 -6415
13882 -6415 -4326 -893 2170 3835 -16567 -24809 -14344 -22765 -32056 -38302 -39225 -27008 -16667 -14008
13868 -14008 -9205 -3353 -4435 -878 3448 3891 965 3713 18588 16660 -9639 -16862 -2574 12881
13854 12881 9837 5782 5580 -1807 -6433 -11754 -5369 -6648 -8269 -1340 5896 3268 4734 9245 10613
13839 10613 4846 -4393 -8898 12259 17508 11389 18168 8628 4989 7331 3956 -3546 5397 12008
13825 12008 8383 16515 17976 797 1626 12499 9073 3001 -1254 6624 15209 19577 21529 2107
13811 2107 6885 17653 6642 1030 8009 20388 15148 7883 10392 19272 31292 24195 15922 23024
13797 23024 39051 54991 67994 86055 120346 156415 194795 221106 227529 200994 153126 128899
$$ packed form
13895B3402m967j4923L292J5250j749j1781j4986p838Q052J590n762J0785o780
13882f415K089L433L063J665k0402q242J0465q421r291o246r23J2217J0341K659
13868a4008M803N852j082L557M326M43k926K748J4875j928k6299p223J4288J5455
13854A2881l044m055k02p387m626n321O385j279j621O929P236k628J466M511J368
13839A0613n767r239m505K1157N249o119O779r540l639K342l375p502Q943O611
13825A2008l625Q132J461j7179Q29J0873l426o072m255P878Q585M368J952j9422
13811B107M778J0768j1011n612O979J2379n240p265K509Q880J2020p097q273P102
13797B3024J6027J5940J3003J8061L4291L6069L8380K6311O423k6535m7868k4227
$$ plain form
13785 128899 107497 72688 64927 51913 56760 79776 76474 66793 54288 50596 55044 66397 62751
13772 62751 66479 63944 63128 78669 100415 133184 168258 179450 203992 218675 245758 256809
13760 256809 230657 217503 201519 187400 181555 163839 148192 132555 95782 60296 52792 49547
13748 49547 47922 57250 69229 70315 53313 36812 30793 33987 32146 28025 36723 39884 54954
13735 54954 82031 134805 188196 224663 226926 207923 163632 118626 82428 54131 45618 40393
13723 40393 40731 32252 14306 2960 5607 -4064 -13603 -15919 -29216 -18295 -273 10427 6045
13710 6045 -4922 -5748 2010 6585 867 -12481 -11940 -8222 -10259 -4360 3673 -5790 -16472 -12478
13696 -12478 -10391 -21953 -19169 -17828 -7577 1714 867 -4405 26 -10019 -25213 -20012 2879
$$ packed form
13785A28899k1402l4809p761j3014M847K3016l302r681j2505l692M448J1353l646
13772F2751L728k535q16J5541K1746L2769L5074J1192K4542J4683K7083J1051
13760B56809k6152j3154j5984j4119n845j7716j5647j5637l6773l5486p504l245
13748D9547j625R328J1979J086j7002j6501o019L194j841m121Q698L161J5070
13735E4954K7077N2774N3391L6467K263j9003m4291m5006l6198k8297q513n225
13723D0393L38q479j7946j1346K647r671r539k316j3297J0921J8022J0700m382
13710F045j0967q26P758M575n718j3348N41L718k037N899Q033r463j0682L994
13696a2478K087j1562K784J341J0251R291q47n272M431j0045j5194N201K2891
$$ plain form
13683 2879 10119 13647 20202 8159 -1447 644 -7607 -10262 1091 7076 10857 485 10263 1866
13669 1866 -2265 -3375 3656 23186 32409 36945 31366 23914 14630 11257 19287 24193 11653 8874
13655 8874 12612 4360 -13797 -14898 -7794 -16753 -23901 -24838 -40113 -30537 -30108 -11318 1735 405
13641 405 3965 1234 9224 14203 14332 15929 16561 9641 -7237 -10332 3986 14160 19801 8846
13627 8846 -676 5266 6294 4486 -30 -1093 -2447 -15636 -21092 -17625 -5799 -13070 -16469 -26039
13613 -26039 -16925 -10930 -1647 -5542 -3091 14128 17596 16378 1257 -5749 -15460 -31900 -25544 -17804
13599 -17804 -8669 5453 -2772 -1770 -11753 -33619 -34810 -21458 -5091 -11914 -12576 4422 8993
13586 8993 14132 6022 1097 -3637 7401 20538 9278 14263 18728 27316 30062 26326 30158 30460
$$ packed form
13683B879P240L528O555j2043r606K091q251k655J1353N985L781j0372R778q397
13669A866m131j110P031J9530R223M536n579p452r284l373Q030M906j2540k779
13655H874L738q252j8157j101P104q959p148r37j5275R576M29J8790J3053j330
13641D05L560k731P990M979J29J597O32o920j6878l095J4318J0174N641j0955
13627H846r522N942J028j808m516j063j354j3189n456L467J1826p271l399r570
13613b6039R114N995R283l895K451J7219L468j218j5121p006r711j6440O356P740
13599a7804R135J4122q225J002r983k1866j191J3352J6367o823o62J6998M571
13586H993N139q110m925m734J1038J3137j1260M985M465Q588K746l736L832L02
$$ plain form
13572 30460 31646 46251 38792 39929 38190 38801 45268 41178 27959 10490 7754 6090 15772 5967
13558 5967 -3836 2583 20466 49936 58218 46078 35998 28412 32417 34452 37283 34356 45445
13545 45445 58354 55935 36813 44920 53462 36963 32115 39266 35392 47376 52292 44431 52350
13532 52350 45927 31437 34510 54187 46743 38061 21471 21128 19920 30529 35251 32208 33567 21984
13518 21984 33536 30064 23776 38018 49355 50072 56787 37743 31342 36826 13073 3007 11451
13505 11451 23087 45888 68057 63485 60548 32217 15932 41561 37693 33106 29719 28358 30851
13492 30851 33513 39554 45563 34847 36548 39125 41211 23335 29896 50834 59826 60978 66271 71381
13478 71381 73895 72382 77361 86979 89774 93680 93454 99794 103469 96803 84594 91534 86249 83859
$$ packed form
13572C0460J186J4605p459J137j739O11O467m090j3219j7469k736j664R682r805
13558E967r803O419J7883K9470Q282j2140j0080p586M005K035K831k927J1089
13545D5445J2909k419j9122Q107Q542j6499m848P151l874J1984M916p861P919
13532E2350o423j4490L073J9677p444q682j6590l43j208J0609M722l043J359j1583
13518B1984J1552l472o288J4242J1337P17O715j9044o401N484k3753j0066Q444
13505A1451J1636K2801K2169m572k937k8331j6285K5629l868m587l387j361K493
13492C0851K662O041O009j0716J701K577K086j7876O561K0938Q992J152N293N110
13478G1381K514j513M979R618K795L906k26O340L675o666j2209O940n285k390
$$ plain form
13464 83859 85489 91968 89759 82088 78303 87253 80737 77807 66582 51847 60213 70819 94166
13451 94166 120969 136154 140440 148076 176653 197085 207750 205975 175716 154277 140531 118781
13439 118781 104481 108566 102113 104480 100451 101866 94001 78191 65942 56069 66472 65886 64879
13426 64879 75011 94352 105619 96992 105433 101912 97206 98463 93668 90037 89388 81840 88761 90837
13412 90837 82503 63347 45056 57364 58956 80504 117764 141590 154352 164408 161820 156445
13400 156445 158673 159838 151206 130080 120179 123694 128387 144117 155012 173923 171074 163354 176845
13387 176845 175613 173245 189006 195720 176944 177594 189490 204341 208251 214335 221025 227951 230289
13374 230289 249221 252360 267493 280240 276313 253893 265918 273968 274985 281050 307876 329109
$$ packed form
13464H3859J630O479k209p671l785Q950o516k930j1225j4735Q366J0606K3347
13451I4166K6803J5185M286P636K8577K0432J0665j775l0259k1439j3746k1750
13439A18781j4300M085o453K367m029J415p865j5810j2249r873J0403n86j007
13426F4879J0132J9341J1267q627Q441l521m706J257m795l631o49p548O921K076
13412I0837q334j9156j8291J2308J592K1548L7260K3826J2762J0056k588n375
13400A56445K228J165q632k1126r901L515M693J5730J0895J8911k849p720J3491
13387A76845j232k368J5761O714j8776O50J1896J4851L910O084O690O926K338
13374B30289J8932L139J5133J2747l927k2420J2025Q050J017O065K6826K1233
$$ plain form
13362 329109 337172 350416 362378 397925 418343 462080 478742 482084 493446 498170 510581 530816
13350 530816 568134 608472 657552 725307 788115 866730 975427 1112191 1293652 1536517 1856066
13339 1856066 2209012 2440773 2530535 2594552 2672580 2776864 2910958 3136229 3506450 4079702
13329 4079702 4954342 6304883 8336049 11426872 16154973 23196908 32662648 41935507
13321 41935507 45485019 40697134 31414760 22734397 16687174 12924037 10568336 9089919
13313 9089919 8291863 8044278 8286128 8949185 10100027 11627657 12764671 12599428 11466267
13304 11466267 10508004 10345482 11104924 12917006 16177890 21347801 28110883 34152633
13296 34152633 37603901 40633448 45723240 51092413 52212531 47312848 39592936 33517284
$$ packed form
13362C29109Q063J3244J1962L5547K0418M3737J6662L342J1362M724J2411K0235
13350E30816L7318M0338M9080O7755O2808P8615J08697J36764J81461K42865L19549
13339A856066L52946K31761Q9762O4017P8028J04284J34094K25271L70221N73252
13329D079702Q74640J350541K031166L090823M728101P041935R465740R272859
13321D1935507L549512m787885r282374q680363o047223l763137k355701j478417
13313I089919p98056k47585K41850O63057J150842J527630J137014j65243j133161
13304A1466267r58263j62522P59442J812082L260884N169911O763082O041750
13296C4152633L451268L029547N089792N369173J120118m899683p719912o075652
$$ plain form
13288 33517284 31218860 31557348 30690627 26305687 20487205 15856175 13087544 11712620
13280 11712620 11163476 11310483 12155378 13163301 13130409 11703097 9899016 8614925 8072060
13271 8072060 8139332 8806908 10214746 12631821 16560097 22689223 31652564 42415132
13263 42415132 50055081 48833048 39657330 28623657 19933274 14195656 10568047 8190139
13255 8190139 6545136 5353713 4483648 3874667 3426602 3071933 2790839 2529128 2254797
13246 2254797 2004015 1782637 1588431 1444634 1319315 1215902 1122808 1035148 960952 907250
13236 907250 858300 805285 768454 727371 687126 655470 629170 596924 568839 536093 504741
13225 504741 477089 447936 428365 410303 390034 396953 405352 392136 370037 358088 354090 327054
$$ packed form
13288C3517284k298424L38488q66721m384940n818482m631030k768631j374924
13280A1712620n49144J47007Q44895J007923l2892j427312j804081j284091n42865
13271H072060O7272O67576J407838K417075L928276O129126Q963341J0762568
13263D2415132P639949j222033r175718j1033673q690383n737618l627609k377908
13255H190139j645003j191423q70065o08981m48065l54669k81094k61711k74331
13246B254797k50782k21378j94206j43797j25319j03413r3094q7660p4196n3702
13236I07250m8950n3015l6831m1083m0245l1656k6300l2246k8085l2746l1352
13225E04741k7652k9153j9571j8062k0269O919Q399j3216k2099j1949l998k7036
$$ plain form
13213 327054 309546 306288 297287 291815 291918 285234 284894 275257 257788 242135 243430 248242 252026 250893
13199 250893 243619 215737 203599 197198 195803 190093 193883 213193 216149 200379 198989 185662 173785
13186 173785 173417 186759 189467 182635 183988 188087 200147 202440 197734 177094 180076 183764 174512 174680
13172 174680 170637 178434 161909 144018 140681 142621 142319 153432 152901 138000 133768 122993 132000
13159 132000 144511 146489 146331 144896 143073 134771 120002 97686 112967 115241 114540 130615 154746
13146 154746 166979 167027 165119 201177 240687 254079 226576 179435 148207 135104 127512 130747 123851
13133 123851 105557 118119 131500 128340 132432 128842 131821 114229 87937 87257 80812 72416 70171
13120 70171 76460 73275 75117 85636 94888 95931 104285 105461 98102 104588 96722 101479 103060 105336
$$ packed form
13213C27054j7508l258r001n472J03o684l40r637j7469j5653J295M812L784j133
13199B50893p274k7882j2138o401j395n710L790J9310K956j5770j390j3327j1877
13186A73785l68J3342K708o832J353M099J2060K293m706k0640K982L688r252J68
13172A74680m043P797j6525j7891l337J940l02J1113n31j4901m232j0775R007
13159A32000J2511J978j58j435j823q302j4769k2316J5281K274p01J6075K4131
13146A54746J2233M8j908L6058L9510J3392k7503m7141l1228j3103p592L235o896
13133A23851j8294J2562J3381l160M092l590K979j7592k6292o80o445q396k245
13120G0171O289l185J842J0519R252J043Q354J176p359O486p866M757J581K276
$$ plain form
13106 105336 117118 120173 130452 144792 144191 121641 94590 65750 46162 54077 55390 78425
13094 78425 90173 71961 63944 66690 55927 52760 47100 40387 47875 54161 52460 35163 40348
13081 40348 41338 55780 78192 77079 66814 67884 63615 55511 62056 84777 90683 87482 86659 85854
13067 85854 62790 50226 46248 40647 33799 24817 24084 37940 35469 36811 43959 44674 39656 54953
13053 54953 55679 49015 47568 38692 36221 54189 52687 44423 45726 40833 47099 43422 43878 49190 37460
13038 37460 38440 36592 36086 40018 46241 36479 33803 29346 18873 14512 9897 17180 40216 39599 31517
13023 31517 40079 39303 27075 19983 13071 460 -4265 13470 28794 61479 69718 77766 82444
13010 82444 71027 67458 56689 43116 39362 44076 48761 41324 26407 -3131 5591 26266 31721
$$ packed form
13106A05336J1782L055J0279J4340o01k2550k7051k8840j9588P915J313K3035
13094G8425J1748j8212q017K746j0763l167n660o713P488O286j701j7297N185
13081D0348R90J4442K2412j113j0265J070m269q104O545K2721N906l201q23q05
13067H5854k3064j2564l978n601o848q982p33J3856k471J342P148P15n018J5297
13053E4953P26o664j447q876k471J7968j502q264J303m893O266l677M56N312j1730
13038C7460R80j848n06L932O223r762k676m457j0473m361m615P283K3036o17q082
13023C1517Q562p76j2228p092o912j2611m725J7735J5324L2685Q239Q048M678
13010H2444j1417l569j0769j3573l754M714M685p437j4917k9538Q722K0675N455
$$ plain form
12997 31721 39481 43505 39383 33091 41386 38941 27561 34271 39024 34453 35043 37730 44554 34893
12983 34893 25088 16587 7230 -4471 -13596 -10484 3107 19785 28757 33971 22954 32616 44131
12970 44131 42704 54831 54697 41339 35438 30321 35887 47690 47495 29754 30817 46552 52800 51385
12956 51385 58466 35622 20986 26383 47664 59155 63514 48057 45834 58160 61816 59685 62422
12943 62422 47365 31580 15909 15888 27435 20379 18193 34953 43650 33266 42816 38970 30256
12930 30256 20361 17677 19829 12322 -8408 -17894 -18207 -4868 8441 23758 25134 29167 28529 18031
12916 18031 24680 22859 23679 23497 12468 12258 13007 3775 -2010 -17547 4092 15922 21123 24205
12902 24205 38746 44845 41880 52055 56778 63897 54813 46032 43942 54014 60713 48566 55378
$$ packed form
12997C1721P760M024m122o292Q295k445j1380O710M753m571N90K687O824r661
12983C4893r805q501r357j1701r125L112J3591J6678Q972N214j1017R662J1515
12970D4131j427J2127j34j3358n901n117N566J1803j95j7741J063J5735O248j415
12956E1385P081k2844j4636N397K1281J1491M359j5457k223J2326L656k131K737
12943F2422j5057j5785j5671k1J1547p056k186J6760Q697j0384R550l846q714
12930C0256r895k684K152p507k0730r486l13J3339J3309J5317J376M033o38j0498
12916A8031O649j821Q20j82j1029k10P49r232n785j5537K1639J1830N201L082
12902B4205J4541O099k965J0175M723P119r084q781k090J0072O699j2147O812
$$ plain form
12889 55378 80510 81413 79466 69489 63219 52436 49417 58426 63331 71362 61798 44998 38115 32895
12875 32895 26743 18619 23818 26596 12817 -1613 5337 11194 31171 41442 37722 29222 29645 31088
12861 31088 25328 30608 26890 18723 20001 29450 22016 27741 47198 55022 79675 99466 125197
12848 125197 158104 185640 213723 202306 176882 147754 110042 89573 94537 79079 69334 69439
12836 69439 71641 73216 82260 85090 85332 94047 92561 84383 75931 84469 91041 95490 115296 140321
12822 140321 168292 207444 233683 257674 261855 275783 264257 216772 171401 144425 148685 160962
12810 160962 172311 159062 107340 83552 61979 44390 42086 62795 71305 88739 91239 79324
12798 79324 77795 87727 88789 77733 87011 104638 150271 188408 223013 274088 305388 306606 279341
$$ packed form
12889E5378K5132R03j947r977o270j0783l019R009M905Q031r564j6800o883n220
12875C2895o152q124N199K778j3779j4430O950N857J9977J0271l720q500M23J443
12861C1088n760N280l718q167J278R449p434N725J9457P824K4653J9791K5731
12848A25197L2907K7536K8083j1417k5424k9128l7712k0469M964j5458r745J05
12836F9439K202J575R044K830K42Q715j486q178q452Q538O572M449J9806K5025
12822A40321K7971L9152K6239K3991M181J3928j1526m7485m5371k6976M260J2277
12810A60962J1349j3249n1722k3788k1573j7589k304K0709Q510J7434K500j1915
12798G9324j529R932J062j1056R278J7627M5633L8137L4605N1075L1300J218k7265
$$ plain form
12785 279341 226929 177762 134184 99607 68663 63756 56443 53333 66852 62560 57115 56403 45883
12772 45883 30190 33390 34853 31733 40925 44682 25113 18332 23688 15400 21974 35022 34581 45752
12758 45752 50600 47269 44941 31956 39139 52935 65274 61050 61189 76657 93127 100762 84844
12745 84844 80846 72979 64217 46162 41251 52719 58694 57270 68636 82303 71750 55463 53864
12732 53864 61374 67018 68208 69787 69679 66535 93667 109182 109462 99847 82914 80223 100634 96946
12718 96946 95181 113257 133231 133027 115888 100553 111051 109188 100061 95155 91396 100075 105137
12705 105137 96176 80437 85467 101452 120304 119934 147205 194612 239406 283229 305221 309581
12693 309581 292024 261857 227432 187663 160171 134245 118830 107792 110965 118631 116756 127539
$$ packed form
12785B79341n2412m9167m3578l4577l0944m907p313l110J3519m292n445p12j0520
12772D5883j5693L200J463l120R192L757j9569o781N356q288O574J3048m41J1171
12758D5752M848l331k328j2985P183J3796J2339m224J39J5468J6470P635j5918
12745H4844l998p867q762j8055m911J1468N975j424J1366J3667j0553j6287j599
12732E3864P510N644J190J579j08l144K7132J5515K80r615j6933k691K0411l688
12718I6946j765J8076J9974k04j7139j5335J0498j863r127m906l759Q679N062
12705A05137q961j5739N030J5985J8852l70K7271M7407M4794M3823K1992M360
12693C09581j7557l0167l4425l9769k7492k5926j5415j1038L173P666j875J0783
$$ plain form
12681 127539 130607 120440 114209 110852 101551 93737 97177 134170 171128 192078 209114 213924 208016
12668 208016 233037 252017 281851 307305 312194 304943 287911 267472 233840 190404 136754 115594
12656 115594 119456 102770 101363 110274 125586 127183 110169 90805 84673 85417 89796 86642 77450
12643 77450 79536 88366 84967 92825 125487 160184 194333 215118 219563 185847 147634 112745 76861
12630 76861 56140 53652 50127 47035 47671 53549 43728 33450 14806 16092 29755 33861 46402
12617 46402 55018 51287 38631 27256 36927 52247 46233 27515 19957 32231 26193 22995 5925
12604 5925 5221 32929 46350 48891 44736 38102 37682 16562 17767 31964 31788 32810 27110 24121
12590 24121 20202 21823 30962 40217 34687 9880 -1760 9065 28822 43429 45274 32325 6558
$$ packed form
12681A27539L068j0167o231l357r301p814L440L6993L6958K0950J7036M810n908
12668B08016K5021J8980K9834K5454M889p251j7032k0439l3632m3436n3650k1160
12656A15594L862j6686j407Q911J5312J597j7014j9364o132P44M379l154r192
12643G7450K086Q830l399P858L2662L4697L4149K0785M445l3716l8213l4889l5884
12630G6861k0721k488l525l092O36N878r821j0278j8644J286J3663M106J2541
12617D6402Q616l731j2656j1375R671J5320o014j8718p558J2274o038l198j7070
12604E925p04K7708J3421K541m155o634m20k1120J205J4197j76J022n700k989
12590B4121l919J621R139R255n530k4807j1640J0825J9757J4607J845j2949k5767
$$ plain form
12577 6558 14567 23660 30116 33657 21498 11410 17173 16380 9636 11039 7903 9623 -463 -1002
12563 -1002 16236 19195 15669 8669 7840 8112 -3 -4034 5090 19016 8142 -2106 4972 11195
12549 11195 -7455 -12565 -3460 -18610 -26511 -7688 86 10672 17113 19152 23595 20971 2605
12536 2605 -4310 -11985 720 3624 6542 9933 9957 -3840 -17084 -9831 2355 10014 15437 8836
12522 8836 18269 28782 32787 32213 22314 16541 11505 28436 40138 36031 44312 35195 18715 15313
12508 15313 20990 16915 2362 6142 29376 41694 37175 32543 34783 36935 37823 35852 29776 34612
12494 34612 26620 19950 29404 41606 52567 37188 28248 29228 20775 16452 16729 21991 25927 28663
12480 28663 40963 42691 48689 61229 45450 35127 18397 8853 4578 6520 -327 7290 13132
$$ packed form
12577F558Q009R093O456L541j2159j0088N763p93o744J403l136J720j0086n39
12563a002J7238K959l526p000q29K72q115m031R124J3926j0874j0248P078O223
12549A1195j8650n110R105j5150p901J8823P774J0586O441K039M443k624j8366
12536B605o915p675J2705K904K918L391K4j3797j3244P253J2186P659N423o601
12522H836R433J0513M005n74r899n773n036J6931J1702m107Q281r117j6480l402
12508A5313N677m075j4553L780K3234J2318m519m632K240K152Q88j971o076M836
12494C4612p992o670R454J2202J0961j5379q940R80q453m323K77N262L936K736
12480B8663J2300J728N998J2540j5779j0323j6730r544m275J942o847P617N842
$$ plain form
12467 13132 2094 5753 3183 -9008 -14043 -2190 6867 11855 9396 6948 11399 12768 18389 38777
12453 38777 46726 24385 22854 32345 25899 13469 19126 34101 33434 21808 10304 6599 2853
12440 2853 -10943 -13395 -7675 -6118 9569 11478 14975 24068 24290 14987 -12339 -15105 -759 -7711
12426 -7711 -17898 -10933 6972 7920 1346 -1191 16388 13321 20394 15659 18705 24510 17242 17803
12412 17803 7451 -1426 4051 5265 475 -4169 -3840 -5092 5846 20094 29962 33537 22216 6173
12398 6173 11355 26932 43560 64018 67654 70427 73367 68824 69635 66608 63645 52903 55413 53084
12384 53084 77923 98922 107667 113147 131872 171619 209159 222868 209460 178821 142189 127067
12372 127067 119618 116991 106556 93867 97437 106587 110522 122258 126267 131409 139643 135620 126907
$$ packed form
12467A3132j1038L659k570j2191n035J1853R057M988k459k448M451J369N621K0388
12453C8777P949k2341j531R491o446j2430N657J4975o67j1626j1504l705l746
12440B853j3796k452N720J557J5687J909L497R093K22r303k7326k766J4346o952
12426g711j0187O965J7905R48o574k537J7579l067P073m735L046N805p268N61
12412A7803j0352q877N477J214m790m644L29j252J0938J4248R868L575j1321j6043
12398F173N182J5577J6628K0458L636K773K940m543Q11l027k963j0742K510k329
12384E3084K4839K0999Q745N480J8725L9747L7540J3709j3408l0639l6632j5122
12372A27067p449k627j0435j2689L570R150L935J1736M009N142Q234m023q713
$$ plain form
12359 126907 129807 135683 139519 138409 135726 137797 136578 138158 138758 143378 145058 134972 140144 142742
12345 142742 130296 118025 95444 91454 110144 114538 129682 150822 166765 163152 161207 151525
12333 151525 128050 114111 118935 119248 102139 102762 115015 135153 145698 155076 169686 179787 185466
12320 185466 183455 178353 167086 156269 129567 117687 112016 105849 97798 93484 89107 103023 114838
12307 114838 130792 155939 164074 169236 175277 178304 181111 181341 185067 203928 219495 217007 223828
12294 223828 240076 253060 267619 282221 283868 289808 301037 329090 356717 366697 388567 405131
12282 405131 427744 471700 527397 585951 632779 711063 797244 872986 959404 1070305 1195180
12271 1195180 1346652 1532569 1773899 2092386 2493322 2988538 3614172 4388690 5398433
$$ packed form
12359A26907K900N876L836j110k683K071j219J580O00M620J680j0086N172K598
12345A42742j2446j2271k2581l990J8690M394J5144K1140J5943l613j945r682
12333A51525k3475j3939M824L13j7109O23J2253K0138J0545R378J4610J0101N679
12320A85466k011n102j1267j0817k6702j1880n671o167q051m314m377J3916J1815
12307A14838J5954K5147Q135N162O041L027K807K30L726J8861J5567k488O821
12294B23828J6248J2984J4559J4602J647N940J1229K8053K7627R980K1870J6564
12282D05131K2613M3956N5697N8554M6828P8284Q6181P5742Q6418J10901J24875
12271A195180J51472J85917K41330L18487M00936M95216O25634P74518J009743
$$ plain form
12262 5398433 6827389 8986329 12318604 17444687 24948810 34455180 43379598 47331399
12254 47331399 43974192 35502537 26285629 19068692 14272194 11280575 9453922 8422900
12246 8422900 7989954 8119162 8864937 10119572 11343185 11757707 11142279 10157944 9604648
12237 9604648 9912400 11275202 13880049 17886993 22831428 27211727 29620941 30603570
12229 30603570 32448251 36918416 43330845 48760855 50194683 47273475 42537819 38411324
12221 38411324 34792504 30195326 24437759 18918610 14798304 12243849 10958587 10661890
12213 10661890 11119968 11834657 11999414 11160631 9696546 8368937 7563766 7288254 7482973
12204 7482973 8149828 9429184 11606281 15128223 20511501 27917576 36129322 41899519
$$ packed form
12262E398433J428956K158940L332275N126083P504123R506370Q924418L951801
12254D7331399l357207q471655r216908p216937m796498k991619j826653j031022
12246H422900m32946J29208P45775J254635J223613M14522o15428r84335n53296
12237I604648L07752J362802K604847M006944M944435M380299K409214R82629
12229C0603570J844681M470165O412429N430010J433828k921208m735656m126495
12221C8411324l618820m597178n757567n519149m120306k554455j285262k96697
12213A0661890M58078P14689J64757q38783j464085j327609q05171k75512J94719
12204G482973O66855J279356K177097L521942N383278P406075Q211746N770197
$$ plain form
12196 41899519 41872987 35938453 27360769 19588021 14016754 10399323 8064452 6490933
12188 6490933 5377821 4557996 3937878 3484751 3112792 2790105 2505617 2248185 2010170
12179 2010170 1818849 1667834 1514711 1373420 1251321 1133611 1035543 979576 938986 909919
12169 909919 872330 817903 752580 706312 678938 657723 631566 611300 592492 585918 590126 606392
12157 606392 614532 647605 693104 717066 688042 616141 540984 490244 454464 412494 374591 356809
12145 356809 331433 319537 309396 301275 305445 306432 297650 297076 281985 271850 264286 269340 258533
12132 258533 244114 230627 224529 211127 210802 218848 217633 214578 224060 227753 216958 196676 188791
12119 188791 194584 200561 211777 212205 215929 219922 228395 234817 247956 279933 289242 298089 314370
$$ packed form
12196D1899519k6532n934534q577684p772748n571267l617431k334871j573519
12188F490933j113112q19825o20118m53127l71959l22687k84488k57432k38015
12179B010170j91321j51015j53123j41291j22099j17710r8068n5967m0590k9067
12169I09919l7589n4427o5323m6268k7374k1215k6157k0266j8808o574M208J6266
12157F06392Q140L3073M5499K3962k9024p1901p5157n0740l5780m1970l7903j7782
12145C56809k5376j1896j0141q121M170R87q782n74j5091j0135p564N054j0807
12132B58533j4419j3487o098j3402l25Q046j215l055R482L693j0795k0282p885
12119A88791N793N977J1216M28L724L993Q473O422J3139L1977R309Q847J6281
$$ plain form
12106 314370 326863 352849 377649 447548 557696 748104 1054045 1449214 1743843 1747557 1457028
12095 1457028 1065259 754179 574304 461726 388047 350508 323206 298236 278358 254858
12085 254858 241154 246859 256082 275117 289951 315329 330492 324319 303371 318148 325970 322634
12073 322634 304832 272538 246064 236648 235885 228028 244861 255989 274582 304145 330678 356269
12061 356269 409104 508414 658533 872954 1139797 1316154 1261510 1031866 787774 613045
12051 613045 517128 453282 407309 366104 362803 366423 391899 432935 475745 501767 468950 419357
12039 419357 398991 409817 452279 530027 650492 739917 736094 703682 701333 764810 908838
12028 908838 1109935 1249816 1254210 1119928 950410 851624 822920 819228 764664 647078 524653
$$ packed form
12106C14370J2493K5986K4800O9899J10148J90408L05941L95169K94629L714k90529
12095A457028l91769l11080j79875j12578p3679l7539k7302k4970j9878k3500
12085B54858j3704N705R223J9035J4834K5378J5163o173k0948J4777P822l336
12073C22634j7802l2294k6474r416p63p857J6833J1128J8593K9563K6533K5591
12061C56269N2835R9310J50119K14421K66843J76357n4644k29644k44092j74729
12051F13045r5917o3846m5973m1205l301L620K5476M1036M2810K6022l2817m9593
12039D19357k0366J0826M2462P7748J20465Q9425l823l2412k349O3477J44028
12028I08838K01097J39881M394j34282j69518r8786k8704l692n4564j17586j22425
$$ plain form
12017 524653 430311 387299 411362 445342 476763 490272 440557 387255 345634 308364 294836
12006 294836 300510 330024 361890 411581 534864 705071 918334 1125075 1193539 1044734 806011
11995 806011 592648 435475 337697 293393 269478 257406 229836 210399 193187 195807 195090 185057
11983 185057 168994 157553 159660 165630 156046 124900 108592 110726 92602 57415 34068 43608
11971 43608 53624 61546 70755 78991 92359 95181 89959 88058 96274 110167 105396 101887 101340 97867
11957 97867 96319 107540 108559 105505 103479 102863 104037 101991 88672 77318 85846 92195 89987 108872
11943 108872 104030 107963 122248 121878 102085 101521 88232 85923 86712 93052 96336 98637 91314 91450
11929 91450 93241 95152 89090 84774 96920 115988 134238 143309 151516 184893 192985 192270 185778 181684
$$ packed form
12017E24653r4342m3012K4063L3980L1421J3509m9715n3302m1621l7270j3528
12006B94836N674K9514L1866M9691J23283J70207K13263K06741O8464j48805k38723
11995H06011k13363j57173r7778m4304k3915j2072k7570j9437j7212K620p17j0033
11983A85057j6063j1441K107N970r584l1146j6308K134j8124l5187k3347R540
11971D3608J0016P922R209Q236J3368K822n222j901Q216J3893m771l509n47l473
11957I7867j548J1221J019l054k026o16J174k046j3319j1354Q528O349k208J8885
11943A08872m842L933J4285l70j9793n64j3289k309P89O340L284K301p323J36
11929I1450J791J911o062m316J2146J9068J8250R071Q207L3377Q092p15o492m094
$$ plain form
11915 181684 182102 193482 220670 239454 239816 215291 183524 163814 149224 135279 114693 104412
11903 104412 90969 102747 99200 92872 83666 73809 67552 65520 73242 82926 97142 118309 129629
11890 129629 133899 143953 133614 131551 125568 122582 120662 103168 99845 98580 105641 119526 115926
11877 115926 121220 144752 136767 117506 92014 86179 90952 92011 99479 109901 113629 109412 113877
11864 113877 119807 114653 96541 83412 83861 94874 98431 81813 69728 65153 59744 65316 84157
11851 84157 89642 73374 53466 53253 45571 47678 67996 72233 80846 80090 87283 86414 72145 73090
11837 73090 84954 99889 94204 94407 92259 77810 63787 63932 52888 49472 57260 52258 42650 26841
11823 26841 18176 10855 13409 11896 17147 24564 44549 50697 47528 37818 70957 116039 198796
$$ packed form
11915A81684M18J1380K7188J8784L62k4525l1767j9710j4590j3945k0586j0281
11903A04412j3443J1778l547o328r206r857o257k032P722R684J4216K1167J1320
11890A29629M270J0054j0339k063n983k986j920j7494l323j265P061J3885l600
11877A15926N294K3532p985j9261k5492n835M773J059P468J0422L728m217M465
11864A13877N930n154j8112j3129M49J1013L557j6618j2085m575n409N572J8841
11851H4157N485j6268j9908k13p682K107K0318M237Q613p56P193q69j4269R45
11837G3090J1864J4935n685K03k148j4449j4023J45j1044l416P788n002r608j5809
11823B6841q665p321K554j513N251P417J9985O148l169r710L3139M5082Q2757
$$ plain form
11810 198796 260324 275333 260573 224040 191129 174314 177477 163276 137330 139476 148800 155261
11798 155261 144348 148291 168856 196792 221694 250253 323422 422622 508529 569172 607580 642407
11786 642407 635423 555819 433561 351133 341765 364343 385832 390934 366462 345501 320312 317398
11774 317398 320906 328465 320063 275943 245838 241014 248660 266602 286451 302680 332287 379885
11762 379885 415425 404272 372772 336655 304848 302651 329616 378485 445643 506371 553976 529475
11750 529475 454113 392742 322795 269323 261611 271533 283142 274754 259208 260974 275525 288550
11738 288550 274437 264413 260642 262311 259988 259058 252345 239252 238299 254726 242737 223305 242699
11725 242699 260194 284481 300478 314009 305046 311119 331439 340814 332649 318206 347349 393410
$$ packed form
11810A98796O1528J5009j4760l6533l2911j6815L163j4201k5946K146R324O461
11798A55261j0913L943K0565K7936K4902K8559P3169R9200Q5907O0643L8408L4827
11786F42407o984p9604j22258q2428r368K2578K1489N102k4472k0961k5189k914
11774C17398L508P559q402m4120l0105m824P646J7942J9849J6229K9607M7598
11762C79885L5540j1153l1500l6117l1807k197K6965M8869O7158O0728M7605k4501
11750E29475p5362o1371o9947n3472p712R922J1609q388j5546J766J4551J3025
11738B88550j4113j0024l771J669k323r30o713j3093r53J6427j1989j9432J9394
11725B42699J7495K4287J5997J3531q963O073K0320R375q165j4443K9143M6061
$$ plain form
11713 393410 423812 448880 464152 487948 480161 465903 480959 518393 560777 607026 647999 701582
11701 701582 779583 865783 906128 934405 974805 1018773 1094322 1177288 1270937 1362578 1468841
11690 1468841 1606336 1762362 1920915 2099271 2328359 2627706 2984767 3339122 3682812
11681 3682812 4083656 4567593 5208053 6054562 7207339 8778759 10801652 13189053 15795786
11672 15795786 18643495 22221702 27726832 37144706 53280014 80351895 125111252 193260471
11664 193260471 272837236 320642223 299030364 226564074 150481036 96676223 64831582
11657 64831582 46460884 35310573 28267228 23592954 20106630 17206353 14684542 12499440
11649 12499440 10668944 9175386 8023635 7122052 6361034 5672421 5053119 4547753 4132003
$$ packed form
11713C93410L0402K5068J5272K3796p787j4258J5056L7434M2384M6249M0973N3583
11701G01582P8001Q6200M0345K8277M0400M3968P5549Q2966R3649R1641J06263
11690A468841J37495J56026J58553J78356K29088K99347L57061L54355L43690
11681C682812M00844M83937O40460Q46509J152777J571420K022893K387401K606733
11672A5795786K847709L578207N505130R417874J6135308K7071881M4759357O8149219
11664A93260471P9576765M7804987k1611859p2466290p6083038n3804813l1844641
11657F4831582j8370698j1150311p043345m674274l486324k900277k521811k185102
11649A2499440j830496j493558j151751r01583p61018o88613o19302n05366m15750
$$ plain form
11640 4132003 3791387 3490326 3213088 2972095 2765356 2595361 2454759 2308742 2157318
11631 2157318 2025647 1887020 1740731 1603703 1493290 1410294 1349298 1300204 1275804 1262915
11621 1262915 1248641 1222473 1176376 1137952 1094382 1047931 1012940 970654 933337 920467 915756
11610 915756 890948 855103 826175 786442 746189 742284 741550 740014 732245 705151 657041 620554
11598 620554 589432 574127 563117 536549 512534 502692 485637 480544 469392 429067 395599 377112
11586 377112 367251 363798 366083 369426 358368 341349 349352 375279 396824 395925 391280 390199 372185
11573 372185 355092 354466 351642 338853 336830 336795 337480 343880 339127 344305 355318 370967 402150 446657
11559 446657 484744 516343 595323 679042 693256 621024 509006 444471 407926 411443 432353
$$ packed form
11640D132003l40616l01061k77238k40993k06739j69995j40602j46017j51424
11631B157318j31671j38627j46289j37028j10413q2996o0996m9094k4400j2889
11621A262915j4274k6168m6097l8424m3570m6451l4991m2286l7317j2870m711
11610I15756k4808l5845k8928l9733m0253l905p34j536p769k7094m8110l6487
11598F20554l1122j5305j1010k6568k4015r842j7055n093j1152m0325l3468j8487
11586C77112r861l453K285L343j1058j7019Q003K5927K1545q99m645j081j8014
11573C72185j7093o26k824j2789k023l5O85O400m753N178J1013J5649L1183M4507
11559D46657L8087L1599P8980Q3719J4214p2232j12018o4535l6545L517K0910
$$ plain form
11548 432353 472796 475882 459662 437289 424518 419290 420444 391126 355536 325588 280488 242113
11536 242113 232673 262536 324702 421109 504627 609664 718958 721353 625303 501195 430116
11525 430116 403938 391074 380667 399872 397636 386100 345810 322124 311569 305073 308532 324076
11513 324076 352698 366067 358087 353642 341646 334624 332138 358864 384239 393114 429809 486174
11501 486174 567599 621982 581442 495205 428292 402178 385870 381502 393642 441499 504833 591575
11489 591575 707000 858609 1028092 1223107 1559088 2198651 3372047 5299475 7444730
11480 7444730 7802993 5990581 3867653 2429717 1651558 1222321 991978 846476 754828
11471 754828 729192 710942 659269 600283 541302 510708 472386 410198 356964 328993 291789
$$ packed form
11548D32353M0443L086j6220k2373j2771n228J154k9318l5590k9948m5100l8375
11536B42113r440K9863O2166R6407Q3518J05037J09294K395r6050j24108p1079
11525D30116k6178j2864j0407J9205k236j1536m0290k3686j0555o496L459J5544
11513C24076K8622J3369p980m445j1996p022k486K6726K5375Q875L6695N6365
11501D86174Q1425N4383m0540q6237o6913k6114j6308m368J2140M7857O3334Q6742
11489E91575J15425J51609J69483J95015L35981O39563J173396J927428K145255
11480G444730L58263j812412k122928j437936p78159m29237k30343j45502r1648
11471G54828k5636j8250n1673n8986n8981l0594l8322o2188n3234k7971l7204
$$ plain form
11460 291789 269793 255631 257662 245002 221771 212721 209811 212773 227623 227777 213442 188271 183019
11447 183019 195822 205786 205412 203743 218940 222541 217692 219029 242036 283919 342666 363960 336532
11434 336532 293069 253000 201955 181286 165413 163571 167742 154586 154672 147741 144315 128702 126409
11421 126409 131003 139697 140710 142413 161990 179630 170856 168686 163491 161111 159076 175311 166101
11408 166101 133550 104496 99549 102087 102596 104355 106298 92014 77544 75361 77041 81326 95596
11395 95596 91881 82432 73492 79449 79365 80181 88998 96514 92567 88451 76562 78976 83399 81752 84021
11380 84021 79879 73500 68357 68735 74512 78423 81107 75933 63096 64954 76790 83312 79942 71922
11366 71922 67591 62779 56979 60945 76229 82830 93548 89002 89826 98038 95017 107741 115343 127776
$$ packed form
11460B91789k1996j4162K031j2660k3231r050k910K962J4850J54j4335k5171n252
11447A83019J2803R964l74j669J5197L601m849J337K3007M1883N8747K1294k7428
11434C36532m3463m0069n1045k0669j5873j842M171j3156Q6o931l426j5613k293
11421A26409M594Q694J013J703J9577J7640q774k170n195k380k035J6235r210
11408A66101l2551k9054m947K538N09J759J943j4284j4470k183J680M285J4270
11395I5596l715r449q940N957q4Q16Q817P516l947m116j1889K414M423j647K269
11380H4021m142o379n143L78N777L911K684n174j2837J858J1836O522l370q020
11366G1922m331m812n800L966J5284O601J0718m546Q24Q212l021J2724P602J2433
$$ plain form
11352 127776 133191 132776 124657 115146 109001 95830 91756 95280 83674 81768 91329 96727 85848 58531
11338 58531 54814 60096 57012 53770 67597 84992 98163 88819 77350 90357 95796 86921 88675
11325 88675 82644 80432 62341 42950 51325 53793 55212 75374 86208 95203 79058 69282 72559
11312 72559 71376 67544 66604 67646 53260 44496 53206 65479 64856 70216 60779 61675 70294 85255
11298 85255 91086 78201 64480 70036 79918 103180 140077 179476 258614 352797 432474 482185
11286 482185 485686 465274 415414 324100 231446 152509 110379 86704 57663 64814 69555 64148
11274 64148 62401 53929 63937 74894 75482 77969 69893 56637 44998 43353 38042 49279 63064
11261 63064 67690 47429 23227 38939 51651 51806 53131 45668 39468 39398 41550 52057 45554 34457
$$ packed form
11352A27776N415m15q119r511o145j3171m074L524j1606j906R561N398j0879k7317
11338E8531l717N282l084l242J3827J7395J3171r344j1469J3007N439q875J754
11325H8675o031k212j8091j9391Q375K468J419K0162J0834Q995j6145r776L277
11312G2559j183l832r40J042j4386q764Q710J2273o23N360r437Q96Q619J4961
11298H5255N831j2885j3721N556R882K3262L6897L9399P9138R4183P9677M9711
11286D82185L501k0412m9860r1314r2654p8937m2130k3675k9041P151M741n407
11274F4148j747q472J0008J0957N88K487q076j3256j1639j645n311J1237J3785
11261F3064M626k0261k4202J5712J2712J55J325p463o200p0K152J0507o503j1097
$$ plain form
11247 34457 33238 50352 66594 67595 78795 84115 65623 60410 49251 48562 68026 67516 66039
11234 66039 84691 99983 109240 127595 141776 158736 189432 235030 320444 483524 760230
11223 760230 1149357 1518313 1631654 1393889 1003678 661334 442297 315396 231894 160702
11213 160702 129105 126407 112744 101845 87808 68697 58353 52160 55012 57441 61553 50514
11201 50514 48795 61534 78218 75850 66490 57230 65667 74330 70541 58779 40761 38499 31300
11188 31300 29047 40712 47588 41019 33862 38451 42828 50943 47878 53492 56288 63463 75963 86752
11174 86752 113223 145226 197509 286777 370780 407294 402455 393240 414939 394927 309232 237043
11162 237043 199983 165189 141032 135666 144184 142847 131284 106194 85623 76073 65153 64278 70119
$$ packed form
11247C4457j219J7114J6242J001J1200N320j8492n213j1159o89J9464n10j477
11234F6039J8652J5292R257J8355J4181J6960L0696M5598Q5414J63080K76706
11223G60230L89127L68956J13341k37765l90211l42344k19037j26901q3502p1192
11213A60702l1597k698j3663j0899j4037j9111j0344o193K852K429M112j1039
11201E0514j719J2739J6684k368r360r260Q437Q663l789j1762j8018k262p199
11188C1300k253J1665O876o569p157M589M377Q115l065N614K796P175J2500J0789
11174H6752K6471L2003N2283Q9268Q4003L6514m839r215K1699k0012q5695p2189
11162B37043l7060l4794k4157n366Q518j337j1563k5090k0571r550j0920q75N841
$$ plain form
11149 70119 75150 76684 74240 46367 30877 27307 27051 28301 35473 18613 5449 14958 13196 19702
11135 19702 27963 28452 38446 43113 36661 34151 54021 58668 68106 85939 98881 134212 182910
11122 182910 231764 261105 238941 205648 165418 113347 87022 90152 92877 81993 73059 69363
11110 69363 56770 45452 53433 49891 40535 31836 27831 43238 40544 49796 40336 50319 48102 33381
11096 33381 28421 32713 37370 51078 69736 71837 81940 95088 93426 77726 60027 50462 44332
11083 44332 37259 22930 13826 28329 46776 29278 17881 19822 23853 25906 35253 34450 23012
11070 23012 35632 58025 71618 69410 86029 91473 89824 68296 45617 39382 38764 42838 50211
11057 50211 61045 58716 68061 56315 44163 44863 38798 40909 38097 40588 45983 40935 43341 57298
$$ packed form
11149G0119N031J534k444k7873j5490l570k56J250P172j6860j3164R509j762O506
11135A9702Q261M89R994M667o452k510J9870M647R438J7833J2942L5331M8698
11122A82910M8854K9341k2164l3293m0230n2071k6325L130K725j0884q934l696
11110F9363j2593j1318P981l542r356q699m005J5407k694R252r460R983k217j4721
11096C3381m960M292M657J3708J8658K101J0103J3148j662j5700j7699r565o130
11083D4332p073j4329r104J4503J8447j7498j1397J941M031K053R347q03j1438
11070B3012J2620K2393J3593k208J6619N444j649k1528k2679o235o18M074P373
11057E0211J0834k329R345j1746j2152P00o065K111k812K491N395n048K406J3957
$$ plain form
11043 57298 66395 70990 64007 60143 42695 32066 31776 26736 31763 40973 30653 22945 22501 20121
11029 20121 13870 8251 19058 21866 15452 18288 14587 6749 25783 33984 31761 39502 49266 50521
11015 50521 40593 40046 25337 10781 5316 10243 18100 30938 23921 10074 7848 20687 26798
11002 26798 21498 13352 23579 23616 16597 16866 16713 19627 14623 18311 18615 35608 46592 32533 20024
10987 20024 26964 27799 19003 11322 10601 10888 11023 16751 16096 8111 -7262 -10511 -566 6183 12413
10972 12413 4863 67 4472 27213 18620 7319 14130 21996 21411 23792 12899 22848 29014 32890
10958 32890 21691 8447 20707 44627 41931 43828 38799 36604 36193 29378 26664 16833 5361
10945 5361 -1192 -4453 7687 7273 94 311 11735 27329 23451 7598 10289 31179 39683 28197
$$ packed form
11043E7298R097M595o983l864j7448j0629k90n040N027R210j0320p708m44k380
11029B0121o251n619J0807K808o414K836l701p838J9034Q201k223P741R764J255
11015E0521r928n47j4709j4556n465M927P857J2838p017j3847k226J2839O111
11002B6798n300q146J0227L7p019K69j53K914n004L688L04J6993J0984j4059j2509
10987B0024O940Q35q796p681p21K87J35N728o55p985j5373l249R945O749O230
10972A2413p550m796M405K2741q593j1301O811P866n85K381j0893R949O166L876
10958C2890j1199j3244J2260K3920k696J897n029k195m11o815k714r831j1472
10945E361o553l261J2140m14p179K17J1424J5594l878j5853K691K0890Q504j1486
$$ plain form
10931 28197 18947 22916 26630 28355 24500 26500 16453 19983 22932 19294 16475 9826 14112 30216
10917 30216 23327 7415 4180 22798 25999 9960 7244 11826 7364 -5029 -7307 3519 14956
10904 14956 20822 13963 20925 30246 24605 13567 -125 -6333 3708 5703 2283 7873 10273 7234
10890 7234 2868 -1867 -4946 7002 -2066 -5771 -4172 -4158 5859 10092 6992 -2032 -736 10008
10876 10008 15927 17884 16877 5938 -936 18810 19639 2835 9046 14012 948 -8757 -11551 -4986
10862 -4986 -9022 -8444 -7087 -20475 -13322 15614 21545 6625 -6728 -1896 5025 20324 18128 20871
10848 20871 27448 31951 29969 28463 32365 26329 28249 25699 33032 23602 12992 23035 21178 16354
10834 16354 5035 29134 38631 38573 30789 29733 30024 20722 19878 23049 19442 21993 24786 17774 7866
$$ packed form
10931B8197r250L969L714J725l855K000j0047L530K949l638k819o649M286J6104
10917C0216o889j5912l235J8618L201j6039k716M582m462j2393k278J0826J1437
10904A4956N866o859O962R321n641j1038j3692o208J0041J995l420N590K400l039
10890G234m366m735l079J1948r068l705J599J4J0017M233l100r024J296J0744
10876A0008N919J957j007j0939o874J9746Q29j6804O211M966j3064r705k794O565
10862d986m036N78J357j3388P153K8936N931j4920j3353M832O921J5299k196K743
10848B0871O577M503j982j506L902o036J920k550P333r430j0610J0043j857m824
10834A6354j1319K4099R497n8p784j056K91r302q44L171l607K551K793p012r908
$$ plain form
10819 7866 -1924 -26152 -26988 -8214 8549 15880 7484 3539 899 -13963 -12941 -18501 -2052 21140
10805 21140 26217 21312 25736 14476 6125 18521 17845 13235 1748 5440 4842 -5339 -8919 -14115
10791 -14115 -17826 -17254 268 14685 13598 8900 11779 26301 21199 11667 9588 -1548 -33 7363
10777 7363 3302 -10392 -19930 -13189 -3353 2705 7451 9943 13480 13342 15675 22431 16638 18392 9130
10762 9130 3499 6293 17683 20746 25065 28815 25292 12016 13989 6135 -11522 -8538 -10245 -9756
10748 -9756 10673 5892 8784 18496 8181 7849 14167 24476 22315 11431 8836 -1118 4504 4958
10734 4958 11597 7228 1242 1311 -213 433 3296 7938 8295 17960 17036 28685 37017 29964 29991 22725
10718 22725 16368 18619 21367 5543 -1560 -1789 10996 15439 6031 11978 9103 14064 16028 12782
$$ packed form
10819G866r790k4228q36J8774J6763P331q396l945k640j4862J022n560J6449K3192
10805B1140N077m905M424j1260q351J2396o76m610j1487L692n98j0181l580n196
10791a4115l711N72J7522J4417j087m698K879J4522n102r532k079j1136J515P396
10777G363m061j3694r538O741R836O058M746K492L537j38K333O756n793J754r262
10762I130n631K794J1390L063M319L750l523j3276J973p854j7657K984j707M89
10748i756K0429m781K892R712j0315l32O318J0309k161j0884k595r954N622M54
10734D958O639m369n986O9j524O46K863M642L57R665r24J1649Q332p053K7p266
10718B2725o357K251K748j5824p103k29J2785M443r408N947k875M961J964l246
$$ plain form
10704 12782 13889 10407 20779 19852 12362 4433 -7296 843 5494 -1402 -10620 -12271 172 3458
10690 3458 2729 14678 25166 14180 5416 -9992 -13058 2016 12053 14056 18560 15246 25854
10677 25854 40744 50625 57149 47453 26509 15699 27683 25205 6825 -7560 4189 14248
10665 14248 6592 5781 3976 3038 6427 8728 28662 35088 35369 38217 29367 25205 11044 -792
10651 -792 17819 20493 14473 10245 7398 9365 8302 9790 12705 10278 5515 746 15354 24493
10637 24493 20781 16693 13176 926 1783 1864 1554 11182 12260 8323 5563 -670 1583 -533 -14271
10622 -14271 -13083 -13758 -14941 3059 -2325 -17776 -11718 -5939 -6538 -66 18582 20434 19198 10167
10608 10167 3193 -3649 -12358 -19346 -11940 -13336 -14725 -3110 9026 11955 4358 4934 6546 -1427
$$ packed form
10704A2782J107l482J0372r27p490p929j1729Q139M651o896r218j651J2443L286
10690C458p29J1949J0488j0986q764j5408l066J5074J0037K003M504l314J0608
10677B5854J4890R881O524r696k0944j0810J1984k478j8380j4385J1749J0059
10665A4248p656q11j805r38L389K301J9934O426K81K848q850m162j4161j1836
10651g92J8611K674o020m228k847J967j063J488K915k427m763m769J4608R139
10637B4493l712m088l517j2250Q57Q1l10R628J078l937k760o233K253k116j3738
10622a4271J188o75j183J8000n384j5451O058N779n99O472J8648J852j236r031
10608A0167o974o842q709o988P406j396j389J1615J2136K929p597N76J612p973
$$ plain form
10594 -1427 -13948 -19843 -20597 -18319 -16876 -24675 -22673 -12349 -7732 -18381 -3484 6957 -9492
10581 -9492 -7969 3771 4277 15327 27132 21388 14925 16624 6737 -5712 -9856 -16381 -20550 -13803
10567 -13803 -19309 -10180 9317 8493 24596 24120 3418 -11234 -9376 -4849 13431 32466 32754 19823
10553 19823 3905 -5259 2133 13149 9928 -870 -11972 -20376 -28960 -18562 3306 9077 8377
10540 8377 13385 8750 -12496 -18147 -15766 -15759 -9349 -6610 -18280 -8655 4334 124 2224 5079 -9170
10525 -9170 -12418 -18833 -10670 4021 7853 6161 11111 11984 -42 -13376 -8424 -8119 1024 -3015
10511 -3015 -5990 7451 24410 29766 23416 8977 8427 7820 -4225 -15257 -2288 10316 -2133
10498 -2133 -1761 13516 20399 22223 27605 31047 27917 17298 3285 -10259 -13637 -6437 -6267 -2130
$$ packed form
10594a427j2521n895p54K278J443p799K002J0324M617j0649J4897J0441j6449
10581i492J523J1740N06J1050J1805n744o463J699r887j2449m144o525m169O747
10567a3803n506R129J9497q24J6103m76k0702j4652J858M527J8280J9035K88j2931
10553A9823j5918r164P392J1016l221j0798j1102q404q584J0398K1868N771p00
10540H377N008m635k1246n651K381PO410K739j1670R625J2989m210K100K855j4249
10525i170l248o415Q163J4691L832j692M950Q73j2026j3334M952L05R143m039
10511c015k975J3441J6959N356o350j4439n50o07j2045j1032J2969J2604j2449
10498b133L72J5277O883J824N382L442l130j0619j4013j3544l378P200J70M137
$$ plain form
10484 -2130 6306 -474 -7088 -6394 -2879 1150 16525 33808 27693 5908 -11179 522 -4377 -5047
10470 -5047 -645 15138 14268 -4390 -13907 -13577 -106 4088 15531 23168 28318 17136 8262 6383
10456 6383 9741 10891 15951 7112 11226 16074 19115 15951 6073 1693 9914 2039 -3368 -13186 480
10441 480 17800 1015 -1418 2028 -9560 -561 -1929 -2586 -132 -2435 2558 1736 11689 18461 3593
10426 3593 -6362 -16493 -2792 -7516 -10241 -14866 -10405 -3378 -1902 -8102 6497 30306 18137
10413 18137 10507 657 859 -1866 1614 -6347 -1741 6300 18106 18123 21846 11030 1720 9639 3736
10398 3736 -8704 -10889 -14927 -17714 -3182 -9 390 4477 -1261 281 7484 9195 7446 16167
10384 16167 9649 -4468 -11103 -22986 -24410 -6923 -11258 -11779 620 3352 1338 -2159 9617
$$ packed form
10484b130Q436o780o614O94L515M029J5375J7283o115k1785j7087J1701m899o70
10470e047M402J5783q70j8658r517L30J3471M194J1443P637N150j1182q874j879
10456F383L358J150N060q839M114M848L041l164r878m380Q221p875n407r818J3666
10441D80J7320j6785k433L446j1588Q999j368o57K454k303M993q22R953O772j4868
10426C593r955j0131J3701m724k725m625M461P027J476o200J4599K3809j2169
10413A8137p630r850K02k725L480p961M606Q041J1806J7L723j0816r310P919n903
10398C736j2440k185m038k787J4532L173L99M087n738J542P203J711j749Q721
10384A6167o518j4117o635j1883j424J7487m335n21J2399K732k014l497J1776
$$ plain form
10371 9617 25596 33642 24508 14694 13414 14677 9743 14341 13364 4766 4679 6840 3910 -6311 -1915
10356 -1915 13624 26384 28624 32350 27024 8022 6573 10902 19149 8380 1581 10081 7741 4496
10342 4496 2546 1140 -2083 -6877 -2300 4513 5464 -2474 -5211 230 -12334 -17006 -24470 -21361 -10747
10327 -10747 3292 -3930 -8088 -3788 5335 9605 17886 23452 20989 10887 8101 5530 5190 9992
10313 9992 14215 14934 11275 7995 12719 9817 -767 894 3314 16107 7242 6535 8120 -5389
10299 -5389 -2615 -3282 9386 8006 -5654 1747 5262 -1635 10089 9015 9846 21208 8893 4765
10285 4765 1945 3218 2356 -1414 2304 -2416 10002 1795 -5276 -2570 -3653 -5708 1133 -9821
10271 -9821 -5773 -3523 -10337 -14969 -11944 2540 -6103 -19256 -26202 -20621 -4207 6597 24823
$$ packed form
10371I617J5979Q046r134r814j280J263m934M598r77q598q7K161k930j0221M396
10356a915J5539J2760K240L726n326j9002j449M329Q247j0769o799Q500k340l245
10342D496j950j406l223m794M577O813R51p938k737N441j2564m672p464L109J0614
10327a0747J4039p222m158M300R123M270Q281N566k463j0102k786k571l40M802
10313I992M223P19l659l280M724k902j0584J661K420J2793q865p07J585j3509
10299e389K774o67J2668j380j3660P401L515o897J1724j074Q31J1362j2315m128
10285D765k820J273q62l770L718m720J2418q207p071K706j083k055O841j0954
10271i821M048K250o814m632L025J4484q643j3153o946N581J6414J0804J8226
$$ plain form
10258 24823 13125 -7291 -2822 7339 29431 20692 12631 14515 3054 11799 19218 4113 697
10245 697 -620 -10582 -25094 -28354 -29906 -24784 -10559 4487 8910 19026 27712 16214 -6920
10232 -6920 9649 18732 13556 17704 19098 22192 24634 22082 19325 27218 32330 18262 1614 12269
10218 12269 33346 33133 17427 5154 7470 8534 1213 753 8984 13135 6394 12554 14180 21165
10204 21165 29372 25352 20999 26329 24414 15329 2206 -1267 17603 28972 19190 301 5135
10191 5135 1799 -16714 -3045 12302 21278 28431 22093 15382 21376 32565 26084 21472 16315 13257
10177 13257 14941 357 -17338 -25200 -18557 -3416 4480 11799 12644 8195 1005 -3949 248 12696
10163 12696 12914 8872 14739 5550 -4836 -1271 5451 2979 -7435 -2233 7870 6343 -1072 -8049
$$ packed form
10258B4823j1698k0416M469J0161K2092q739q061J884j1461Q745P419j5105l416
10245F97j317r962j4512l260j552N122J4225J5046M423J0116Q686j1498k3134
10232f920J6569R083n176M148J394L094K442k552k757P893N112j4068j6648J0655
10218A2269K1077k13j5706j2273K316J064p321m60Q231M151o741O160J626O985
10204B1165Q207m020m353N330j915r085j3123l473J8870J1369r782j8889M834
10191E135l336j8513J3669J5347Q976P153o338o711N994J1189o481m612n157l058
10177A3257J684j4584j7695p862O643J5141P896P319Q45m449p190m954M197J2448
10163A2696K18m042N867r189j0386L565O722k472j0414N202J0103j527p415o977
$$ plain form
10149 -8049 10163 31300 23546 5827 6493 -249 -5227 -2763 151 -1999 -13979 -22675 -35279 -24236
10135 -24236 -3751 3818 -2307 -2816 -17001 -30373 -31606 -29090 -23345 -793 1492 -13124 -22772
10122 -22772 -21534 -11821 -13020 -11134 -11030 -9274 -12278 -15707 -8508 -2345 13548 22984 27692 20621
10108 20621 14487 -387 -14113 -7398 -4716 2299 2041 -5876 -10043 -3517 -15605 -8528 -12068 -6196
10094 -6196 4960 8257 8200 6561 16957 13334 11167 5204 13640 11349 11460 -449 -2916 15347
10080 15347 7034 7423 12444 16462 18137 20416 16071 2802 -894 -1506 5171 7541 27265 40781
10066 40781 41884 51078 53792 40768 21337 3270 -4279 -15645 -23278 -11249 -12102 -21723 -21594 -16754
10052 -16754 -19927 -31661 -11490 -2677 1199 8426 3894 1248 17899 29384 34658 34920 24935 11939
$$ packed form
10149h049J8212K1137p754j7719O66o742m978K464K914k150j1980q696j2604J1043
10135b4236K0485P569o125n09j4185j3372j233K516N745K2552K285j4616r648
10122b2772J238R713j199J886J04J756l004l429P199O163J5893R436M708p071
10108B0621o134j4874j3726O715K682P015k58p917m167O526j2088P077l540N872
10094f196J1156L297n7j639J0396l623k167n963Q436k291J11j1909k467J8263
10080A5347q313L89N021M018J675K279m345j3269l696o12O677K370J9724J3516
10066D0781J103R194K714j3024j9431j8067p549j1366p633J2029q53r621J29M840
10052a6754l173j1734K0171Q813L876P227m532k646J6651J1485N274K62r985j2996
$$ plain form
10038 11939 22072 17487 21865 22711 14875 1333 -8699 -17826 -22512 -19444 -3187 3132 6576 -764
10024 -764 -11758 -16085 -2763 8392 14661 2729 -8481 -16272 -18908 -12952 -4269 -14577 -6978
10011 -6978 -388 1293 -6501 -11509 -21448 -12219 17655 16140 -3424 -11493 -2803 876 493 -1982
9997 -1982 -13429 -12430 -10490 -11337 -16777 -21710 -25349 -17731 -25896 -40848 -41476 -29278 -12377 -17912 -32071
9982 -32071 -28797 -16477 -13822 -18766 -24172 -24748 -17301 -12742 -16628 -26956 -33069 -35380 -4296 14571
9968 14571 3855 -7628 -7218 753 2155 -4483 -4753 15534 25200 9551 10919 12631 141 -1071
9954 -1071 -9317 -16439 -23328 -15360 -14589 -32934 -42810 -46855 -45788 -14975 8622 6857 11233 10811 5145
9939 5145 -11071 -15778 -7050 -3877 -16205 -15955 5668 15921 11201 12099 18402 19677 12884 17308
$$ packed form
10038A1939J0133m585M378Q46p836j3542j0032r127m686L068J6257O319L444p340
10024g64j0994m327J3322J1155O269j1932j1210p791k636N956Q683j0308P599
10011f978O590J681p794n008r939R229K9874j515j9564q069Q690L679l83k475
9997a982j1447R99J940q47n440m933l639P618q165j4952o28J2198J6901n535j4159
9982c2071L274J2320K655m944n406n76P447M559l886j0328o113k311L1084J8867
9968A4571j0716j1483M10P971J402o638k70K0287R666j5649J368J712j2490j212
9954a071q246p122o889P968P71j8345r876m045J067L0813K3597j765M376m22n666
9939E145j6216m707Q728L173j2328K50K1623J0253m720Q98O303J275o793M424
$$ plain form
9925 17308 30994 31241 19629 6886 4624 1651 14424 25743 17897 19186 32903 20986 8726
9912 8726 14690 17579 8584 7251 1716 -7921 -5377 6702 -1062 -8995 -1588 20628 28176 26535
9898 26535 11883 14193 15293 9014 3250 -4196 -19364 -26643 141 23948 20424 18147 17085 17766
9884 17766 14178 21179 8526 -1821 -12915 -7665 -7986 -19729 -22549 -15300 -24108 -12928 2470
9871 2470 -3331 2833 -8944 -23091 -23562 -25406 -16884 -19759 825 27081 15208 8497 6048 3216
9857 3216 13747 11138 281 -16737 -24233 -13039 -13258 -16785 -12960 -7670 19037 33005 37521 53051
9843 53051 87391 126743 161784 157307 111224 61107 21306 2787 -2178 8831 4222 -11211
9831 -11211 -18893 -19393 -15987 -6956 -5110 -2978 -15850 -14211 -24484 -17324 -6911 3383 9822 14390
$$ packed form
9925A7308J3686K47j1612j2743k262k973J2773J1319p846J289J3717j1917j2260
9912H726N964K889q995j333n535r637K544J2079p764p933P407K2216P548j641
9898B6535j4652K310J100o279n764p446j5168p279K6784K3807l524k277j062O81
9884A7766l588P001j2653j0347j1094N250l21j1743k820P249q808J1180J5398
9871B470n801O164j1777j4147m71j844Q522k875K0584K6256j1873o711k449k832
9857C216J0531k609j0857j7018p496J1194k19l527L825N290K6707J3968M516J5530
9843E3051L4340L9352L5041m477m6083n0117l9801j8519m965J1009m609j5433
9831a1211p682n00L406R031J846K132j2872J639j0273P160J0413J0294O439M568
$$ plain form
9817 14390 6368 -1661 -1359 1657 1440 -4931 1777 8747 16226 12227 9277 17291 17315 18770 12076 19574
9801 19574 24673 10580 -3262 -17411 -25951 -26875 -22985 -19540 -20251 -21281 -14082 -22076 -23580 -22133
9787 -22133 -8402 -16885 -10919 -22299 -15236 -10162 538 8507 12646 17010 31742 37183 31741 25644
9773 25644 32488 44829 42433 28738 11874 -2615 9941 14608 16230 14734 12904 19727 11662
9760 11662 -2862 -2981 7525 6957 7818 7096 7271 11657 12603 13592 -69 -6995 -7966 -10315 -11092 -20051
9744 -20051 -872 10987 14401 5868 -1030 -4406 -14328 -14598 -11134 -12692 -17021 -24681 -29499 -20981
9730 -20981 -5754 1668 4596 11105 24867 14637 9763 -1422 7593 28811 21534 8186 -5641
9717 -5641 302 4336 6375 -5685 -22281 -12374 -15106 -5825 3618 2726 4247 1928 -20320 -16610
$$ packed form
9817A4390q022q029L02L016k17o371O708O970P479l999k950Q014K4J455o694P498
9801A9574N099j4093j3842j4149q540r24L890L445p11j030P199p994j504J447
9787b2133J3731q483N966j1380P063N074J0700P969M139M364J4732N441n442o097
9773B5644O844J2341k396j3695j6864j4489J2556M667J622j496j830O823q065
9760A1662j4524j19J0506n68Q61p22J75M386R46R89j3661o926r71k349p77q959
9744b0051J9179J1859L414q533o898l376r922k70L464j558m329p660m818Q518
9730b0981J5227P422K928O509J3762j0230m874j1185R015K1218p277j3348j3827
9717e641N943M034K039j2060j6596R907k732R281R443q92J521k319k2248L710
$$ plain form
9703 -16610 1344 5606 6351 5042 -6476 -4055 -6607 -17139 -17092 9430 14163 7378 -344 -463 -687
9688 -687 -10242 -15433 -13735 -7845 -5054 11354 3161 14196 33864 35832 17470 9819 5356 5118
9674 5118 5018 4119 -12673 -2579 -2910 -13329 -163 11693 9300 5558 9947 24814 12473 898
9660 898 10982 3768 281 6288 -1912 3637 6909 15922 13617 17956 13218 -4727 -2891 7863
9646 7863 11700 19459 9869 80 -10956 -14877 -21144 -14810 -13013 -20193 -23731 -11985 1187 -58
9632 -58 -746 11211 13167 16740 17617 12707 18329 16964 4027 1107 6171 8164 7177 856 2113 8063
9616 8063 -2031 -805 -2358 -4565 -1819 1179 7248 -5017 -9522 -8132 -6690 -3558 -9256 -15125
9602 -15125 -6287 -11237 -3483 4224 -11133 3353 2323 -3165 4609 11741 12098 9744 -2354 -8081
$$ packed form
9703a6610J7954M262P45j309j1518K421k552j0532M7K6522M733o785p722j19k24
9688f87r555n191J698N890K791J6408q193J1035J9668J968j8362p651m463k38
9674E118j00q99j6792J0094l31j0419J3166J1856k393l742M389J4867j2341j1575
9660H98J0084p214l487O007q200N549L272R013k305M339m738j7945J836J0754
9646G863L837P759r590r789j1036l921o267O334J797p180l538J1746J3172j245
9632e8o88J1957J956L573Q77m910N622j365j2937k920N064J993r87o321J257N950
9616H063j0094J226j553k207K746K998O069j2265m505J390J442L132n698n869
9602a5125Q838m950P754P707j5357J4486j030n488P774P132L57k354j2098n727
$$ plain form
9588 -8081 4500 393 -5780 -15043 -16720 -15514 -4921 5912 15456 18872 5077 1334 12642 28541
9574 28541 27630 21924 26565 17853 13807 12389 4842 -14316 -15036 10712 16716 19905 9039 9179 17188
9559 17188 2248 -13410 -21330 -21696 -13836 -5880 -9876 -3067 -9724 -12529 -8812 -2886 -3827 5188 -1395
9544 -1395 -2366 -7143 -5093 -13167 -21581 -20611 -14808 -11791 -3536 4958 -4319 -2918 -300 6572 16879
9529 16879 10279 20206 17611 13906 28112 25230 21741 19014 11243 2254 3781 10033 8375 7039
9515 7039 2868 5452 23615 18833 7755 3272 2611 7632 4812 -16842 -46472 -38269 -16442 807
9501 807 2328 -4423 -7089 -16119 -26286 -28073 -226 15476 10934 21070 18848 21035 20335 12600
9487 12600 -6327 1961 13205 17939 -1264 -12093 1169 13195 2192 -20746 -21084 -6124 -377
$$ packed form
9588h081J2581m107o173r263j677J206J0593J0833R544L416j3795l743J1308J5899
9574B8541r11n706M641q712m046j418p547j9158p20K5748O004L189j0866J40Q009
9559A7188j4940j5658p920l66P860P956l996O809o657k805L717N926r41R015o583
9544a395r71m777K050q074q414R70N803L017Q255Q494r277J401K618O872J0307
9529A6879o600R927k595l705J4206k882l489k727p771q989J527O252j658j336
9515G039m171K584J8163m782j1078m483o61N021k820k1654k9630Q203K1827J7249
9501H07J521o751k666r030j0167j787K7847J5702m542J0136k222K187p00p735
9487A2600j8927Q288J1244M734j9203j0829J3262J2026j1003k2938l38J4960N747
$$ plain form
9474 -377 -3784 -10558 4954 2080 -4576 -5379 -2609 13813 17121 6382 305 -3182 -12643 -10481 -3371
9459 -3371 -1817 3851 1076 12038 12531 21025 17583 10170 9079 3387 12495 24241 7920 9600
9445 9600 14329 7416 13268 22066 22799 6942 4563 2359 428 4551 5954 4262 11745 18395 26977
9430 26977 11024 8680 8562 18445 15770 7261 -4442 7265 14127 10394 4494 12574 5232 16711
9416 16711 19289 15742 10982 33029 36756 27996 24596 30597 37524 28208 26915 17473 9828 6077
9402 6077 14852 12845 12936 8218 -1789 4 624 3366 25243 29360 14203 10715 21147 19506 14013
9387 14013 20685 19977 7999 15608 23359 24834 27951 23552 -247 -9607 4382 9123 8601 24795
9373 24795 38866 44511 40608 29415 16835 8296 231 3766 10418 15751 27663 26063 26618 20465
$$ packed form
9474c77l407o774J5512k874o656q03K770J6422L308j0739o077l487r461K162P110
9459c371J554N668k775J0962M93Q494l442p413j091n692R108J1746j6321J680
9445I600M729o913N852Q798P33j5857k379k204j931M123J403j692P483O650Q582
9430B6977j5953k344j18R883k675q509j1703J1707O862l733n900Q080p342J1479
9416A6711K578l547m760K2047L727q760l400O001O927r316j293r442p645l751
9402F077Q775k007R1m718j0007J793O20K742K1877M117j5157l488J0432j641n493
9387A4013O672p08j1978P609P751J475L117m399k3799r360J3989M741n22J6194
9373B4795J4071N645l903j1193j2580q539q065L535O652N333J1912j600N55o153
$$ plain form
9359 20465 26845 28718 28642 18503 15701 19684 38897 34591 35646 36385 40364 43209 21670 25755 35011
9344 35011 34818 23733 5962 24962 44758 23921 26135 41900 58270 56442 59892 63106 52547
9331 52547 35967 27008 38894 56275 65006 51847 30314 22618 34894 48729 53844 43094 55183
9318 55183 49639 47474 58811 68463 64924 55971 45186 51537 70674 61701 49076 62787 52044
9305 52044 32520 31076 39577 64554 69871 69990 64330 60988 70786 70274 80833 72805 65743 61315
9291 61315 79838 104793 108841 98799 83635 78048 90590 103233 123047 118732 112413 119200 104050
9278 104050 88411 103587 117994 123076 129853 129455 123236 124019 132569 129763 134571 139991 145896 153368
9264 153368 151531 152495 147625 146985 157927 171295 174851 186118 195353 194120 192264 211537 216389 214664
$$ packed form
9359B0465O380J873p6j0139k802L983J9213m306J055P39L979K845k1539M085R256
9344C5011j93j1085j7771J9000J9796k0837K214J5765J6370j828L450L214j0559
9331E2547j6580q959J1886J7381Q731j3159k1533p696J2276J3835N115j0750J2089
9318E5183n544k165J1337R652l539q953j0785O351J9137q973j2625J3711j0743
9305E2044j9524j444Q501K4977N317J19n660l342R798n12J0559q028p062m428
9291F1315J8523K4955M048j0042j5164n587J2542J2643J9814m315o319O787j5150
9278A04050j5639J5176J4407N082O777l98o219P83Q550k806M808N420N905P472
9264A53368j837R64m870o40J0942J3368L556J1267R235j233j856J9273M852j725
$$ plain form
9250 214664 211414 215088 226957 236648 235577 232517 239257 260674 268705 290152 302774 300471 305465
9237 305465 310987 312108 317981 344729 367144 395279 406503 413180 430728 435894 448087 458129 456643
9224 456643 475063 491562 503198 521405 531509 544381 551587 565830 586337 607467 633289 651273
9212 651273 669717 670727 671919 674535 692325 695577 706670 737689 739363 736122 740164 741382 744931
9199 744931 745865 734823 723666 717851 714814 710325 702123 696590 687661 685653 665467 637968 625193
9186 625193 615868 607428 592149 572779 555269 531301 506185 480938 477851 469103 450643 446852 435695
9173 435695 422230 410756 386457 376046 359647 340279 334727 326869 315574 326791 323151 305061
9161 305061 287675 285527 295491 271432 251425 255144 252794 249380 228729 220318 214684 209193 217430
$$ packed form
9250B14664l250L674J1869R691j071l060O740K1417Q031K1447J2622k303M994
9237C05465N522J121N873K6748K2415K8135J1224O677J7548N166J2193J0042j486
9224D56643J8420J6499J1636J8207J0104J2872P206J4243K0507K1130K5822J7984
9212F51273J8444J010J192K616J7790L252J1093L1019J674l241M042J218L549
9199G44931R34j1042j1157n815l037m489q202n533q929k008k0186k7499j2775
9186F25193r325q440j5279j9370j7510k3968k5116k5247l087q748j8460l791j1157
9173D35695j3465j1474k4299j0411j6399j9368n552p858j1295J1217l640j8090
9161C05061j7386k148R964k4059k0007L719k350l414k0651q411n634n491Q237
$$ plain form
9148 217430 222284 213632 195480 186503 179700 182719 185987 179921 181647 169970 167152 166680 184483 188972
9134 188972 175815 145280 129851 121372 119093 129581 140658 139675 131058 123169 117490 111017 107388
9121 107388 101356 102671 95290 95565 104040 92821 81164 77181 73022 76801 78204 75569 74806 55017
9107 55017 58239 72399 77151 62826 67601 82051 71786 54740 53035 36384 43510 55519 64579
9094 64579 79677 87799 81675 81236 77968 64134 62756 66129 67363 73179 76850 82610 84958 80648
9080 80648 70858 61902 73704 73582 74833 61379 56423 53878 54795 62268 55511 55805 53112 38905 20322
9065 20322 25448 44538 57429 56016 53307 51598 48003 47472 52387 61547 65722 54775 54897 63767
9051 63767 66278 60008 59894 55484 56507 53873 45111 34145 34396 40916 37519 26934 19289 29100 33975
$$ packed form
9148B17430M854q652j8152q977o803L019L268o066J726j1677k818m72J7803M489
9134A88972j3157l0535j5429q479k279J0488J1077r83q617p889n679o473l629
9121A07388o032J315p381K75Q475j1219j1657l983m159L779J403k635p63j9789
9107E5017L222J4160M752j4325M775J4450j0265j7046j705j6651P126J2009R060
9094F4579J5098Q122o124m39l268j3834j378L373J234N816L671N760K348m310
9080H0648r790q956J1802j22J251j3454m956k545R17P473o757K94k693j4207j8583
9065B0322N126J9090J2891j413k709j709l595n31M915R160M175j0947J22Q870
9051F3767K511o270j14m410J023k634q762j0966K51O520l397j0585p645R811M875
$$ plain form
9036 33975 46791 58828 63916 45534 45366 49900 57294 52474 43008 32279 9014 7347 17422
9023 17422 21682 34522 64389 57239 48759 59455 41926 31617 37004 34690 26019 22740 18913
9010 18913 13136 11310 13752 12641 16625 19979 23291 30196 37660 33210 38253 39330 35937 36885 33556
8995 33556 32812 35871 21126 12083 10373 17873 29681 34104 30626 22277 21189 33186 40597 26595
8981 26595 22263 20649 16945 28106 33489 45725 68460 76560 70405 60469 53170 42988 32150
8968 32150 43266 55338 39427 44979 64982 59360 59902 42901 44611 47035 45124 33230 25202
8955 25202 30256 35588 37935 34546 32778 24229 15851 14573 21192 28164 33883 40543 51697 51786 39506
8940 39506 29096 30298 34648 15454 29766 42044 34086 45229 46307 19127 16148 16313 -5602
$$ packed form
9036C3975J2816J2037N088j8382j68M534P394m820r466j0729k3265j667J0075
9023A7422M260J2840K9867p150q480J0696j7529j0309N387k314q671l279l827
9010A8913n777j826K442j111L984L354L312O905P464m450N043J077l393R48l329
8995C3556p44L059j4745r043j710P500J1808M423l478q349j088J1997P411j4002
8981B6595m332j614l704J1161N383J2236K2735Q100o155r936p299j0182j0838
8968C2150J1116J2072j5911N552K0003n622N42j7001J710K424j911j1894q028
8955B5202N054N332K347l389j768q549q378j278O619O972N719O660J1154Q9j2280
8940C9506j0410J202M350j9194J4312J2278p958J1143J078k7180k979J65k1915
$$ plain form
8927 -5602 -11453 5077 6071 6925 13804 14210 20182 19635 25382 19809 24468 34427 18042 -1008 4423
8912 4423 10852 5147 5866 18306 16901 18940 24702 28308 25368 30984 34309 25716 24653 37366 32786
8897 32786 26467 19313 8076 13256 27469 37367 37121 19775 12904 22710 18544 23464 26144 16768
8883 16768 16830 17923 19228 32329 25029 25442 41074 37789 23641 21248 24687 26696 28767 28564 35049
8868 35049 31237 36490 39304 38709 32308 35024 30227 24874 25944 34407 44065 29975 33492 37555 39961
8853 39961 34960 26602 10704 20954 41969 41736 36206 33586 43591 53928 49845 54189 53559 42865
8839 42865 38178 24302 13879 22438 30843 27998 26000 31179 36717 49170 52806 48408 40113 43700
8825 43700 42714 35148 32634 18696 43620 64387 68395 63291 72614 60936 38346 32786 36534 44340
$$ packed form
8927e602n851J6530R94Q54O879M06N972n47N747n573M659R959j6385j9050N431
8912D423O429n705P19J2440j405K039N762L606k940N616L325q593j063J2713m580
8897C2786o319p154j1237N180J4213R898k46j7346o871R806m166M920K680r376
8883A6768O2J093J305J3101p300M13J5632l285j4148k393L439K009K071k03O485
8868C5049l812N253K814n95o401K716m797n353J070Q463R658j4090L517M063K406
8853C9961n001q358j5898J0250K1015k33n530k620J0005J0337m083M344o30j0694
8839D2865m687j3876j0423Q559Q405k845j998N179N538J2453L636m398q295L587
8825D3700r86p566k514j3938K4924K0767M008n104R323j1678k2590n560L748P806
$$ plain form
8811 44340 60477 60004 40176 39141 45239 45903 38086 34970 25261 24104 23717 25678 26475 26673 29194
8796 29194 35641 37044 29229 34457 38701 41757 51260 58659 46602 58945 69067 58068 67988 62444
8782 62444 42666 29752 30959 24705 28561 34611 37751 42130 41436 44196 32661 26872 25315 21401
8768 21401 9638 11545 35783 48431 53506 70387 63131 56246 56547 52011 42226 30412 17279
8755 17279 2348 9979 21641 18898 5716 2665 7739 14659 23885 37999 41276 45304 49047 45658
8741 45658 31018 25767 26036 32255 31322 45725 46407 33068 42871 62339 50033 47056 49790 40621
8727 40621 40579 39588 42391 38291 47637 46907 28498 22818 32576 49310 46359 39514 49929 60560 54356
8712 54356 46199 42014 46712 48310 51652 70814 65382 40110 33315 39780 50058 59533 67218 78442
$$ packed form
8811D4340J6137m73j9828j035O098O64p817l116r709j157l87J961P97J98K521
8796B9194O447J403p815N228M244L056R503P399j2057J2343J0122j0999R920n544
8782F2444j9778j2914J207o254L856O050L140M379o94K760j1535n789j557l914
8768B1401j1763J907K4238J2648N075J6881p256o885L01m536r785j1814j3133
8755A7279j4931P631J1662k743j3182l051N074O920R226J4114L277M028L743l389
8741D5658j4640n251K69O219r33J4403O82j3339R803J9468j2306k977K734r169
8727D0621m2r91K803m100R346p30j8409n680R758J6734k951o845J0415J0631o204
8712E4356q157m185M698J598L342J9162n432k5272o795O465J0278R475P685J1224
$$ plain form
8698 78442 83546 69567 45065 38775 46339 44193 48694 42198 42124 53192 55853 65240 63519 61986
8684 61986 62577 65250 50562 47293 60250 63470 59216 66920 62583 58061 67499 73610 72094 46904
8670 46904 54221 64086 55590 57272 61577 56597 58475 59765 57488 61392 51480 40219 58052 73283
8656 73283 72173 55869 60069 66964 66595 70416 65767 63818 56231 55551 53453 52059 55431 93300 104258
8641 104258 109599 96112 95828 98367 99822 102328 102356 102586 98741 105764 95363 81464 71911 82838
8627 82838 100693 100428 96897 100324 99578 91708 89069 103167 113946 111666 106728 100094 101395 108816
8613 108816 106959 112067 120490 127510 139865 125750 110659 103897 128516 141382 158621 174539 190907
8600 190907 191095 194819 207223 240106 295807 343692 371864 383380 376422 368003 362266 397991 428058
$$ packed form
8698G8442N104j3979k4502o290P564k146M501o496p4J1068K661R387j721j533
8684F1986N91K673j4688l269J2957L220m254P704m337m522R438O111j516k5190
8670D6904P317R865q496J682M305m980J878J290k277L904r912j1261J7833J5231
8656G3283j110j6304M200O895l69L821m649j949p587o80k098j394L372L7869J0958
8641A04258N341j3487k84K539J455K506K8K30l845P023j0401j3899r553J0927
8627H2838J7855k65l531L427p46p870k639J4098J0779k280m938o634J301P421
8613A08816j857N108Q423P020J2355j4115j5091o762K4619J2866J7239J5918J6368
8600A90907J88L724J2404L2883N5701M7885K8172J1516o958q419n737L5725L0067
$$ plain form
8587 428058 447993 477251 493708 486106 493910 480062 467126 465862 440917 417247 374594 334442
8575 334442 306780 278746 260288 242967 220829 193590 184417 182640 181354 174499 169946 156651 161985
8562 161985 155514 144722 133182 123573 125035 126924 120279 127151 138513 143994 145004 157517 169832
8549 169832 164671 151037 138806 131307 119174 95595 90596 101414 110801 119946 97954 91867 86496
8536 86496 83120 95933 114920 125194 122099 104305 98136 78323 67294 83525 68938 69871 75181
8523 75181 77614 62637 67595 78680 77609 72444 75131 90781 94051 100093 98349 106384 131167 122240
8509 122240 100898 93518 105521 120569 142886 141952 136958 144114 147739 150695 146992 156676 142894
8496 142894 106785 83543 65001 40210 46882 56610 60578 73946 81569 68129 68518 79966 80700
$$ packed form
8587D28058J9935K9258J6457p602P804j3848j2936j264k4945k3670m2653m0152
8575C34442k7662k8034j8458j7321k2138k7239r173j777j286o855m553j3295N334
8562A61985o471j0792j1540r609J462J889o645O872J1362N481J010J2513J2315
8549A69832n161j3634j2231p499j2133k3579m999J0818R387R145k1992o087n371
8536H6496l376J2813J8987J0274l095j7794o169j9813j1029J6231j4587R33N310
8523G5181K433j4977M958J1085j071n165K687J5650L270O042j744Q035K4783q927
8509A22240k1342p380J2003J5048K2317r34m994P156L625K956l703R684j3782
8496A42894l6109k3242j8542k4791O672R728L968J3368P623j3440L89J1448P34
$$ plain form
8483 80700 79842 76122 65127 79920 81423 90108 94313 87165 83330 100555 94205 92516 98464 111878
8469 111878 125050 144960 160354 168163 156440 133906 122087 112121 94821 82238 89781 78167
8457 78167 74814 72817 81988 91901 92616 85287 67912 50698 46035 41430 40106 36390 46008 51159
8443 51159 43662 59639 61848 50967 64163 57267 54825 54775 56216 65059 77064 87808 78148 63111
8429 63111 53583 63552 74036 78051 82870 71570 63851 68916 80551 90265 88946 86436 86765 81694
8415 81694 60645 54628 63655 72505 74660 68761 62817 56846 60919 49681 37306 39256 41717 46202
8401 46202 50423 39174 39541 51486 68200 62732 55317 47861 40725 34724 35549 37488 35642 39964
8387 39964 40381 44809 40914 43046 50386 58418 56300 54995 69755 74685 67738 54309 52664 47107
$$ packed form
8483H0700q58l720j0995J4793J503Q685M205p148l835J7225o350j689N948J3414
8469A11878J3172J9910J5394P809j1723k2534j1819r966j7300j2583P543j1614
8457G8167l353j997R171R913P15p329j7375j7214m663m605j324l716R618N151
8443E1159p497J5977K209j0881J3196o896k442n0J441Q843J2005J0744r660j5037
8429F3111r528R969J0484M015M819j1300p719N065J1635R714j319k510L29n071
8415H1694k1049o017R027Q850K155n899n944n971M073j1238j2375J950K461M485
8401D6202M221j1249L67J1945J6714n468p415p456p136o001Q25J939j846M322
8387C9964M17M428l895K132P340Q032k118j305J4760M930o947j3429j645n557
$$ plain form
8373 47107 50110 55103 82567 97269 101249 117577 132609 121038 95207 75154 68105 67466 72874
8360 72874 60434 47575 53019 63781 68964 66649 46391 29828 50740 66626 63634 56288 49995
8347 49995 69414 67899 69956 82663 103723 120088 114022 120824 118518 107232 105951 96363 90044
8334 90044 88078 71576 45461 42982 50859 44759 50056 80446 96693 103736 93940 80319 67281
8321 67281 52991 56762 41168 31713 31916 31506 30199 32433 30046 31971 50787 57513 66882 69787
8307 69787 68268 55694 60706 65339 81120 89855 108754 106952 103340 98343 95590 87731 78917 70598
8293 70598 56520 46427 41140 42418 49875 48464 54586 47268 35976 25199 11614 11857 26632
8280 26632 47362 43547 41077 36290 25602 22444 22603 26024 45550 43211 41786 42638 33512 27133
$$ packed form
8373D7107L003M993K7464J4702L980J6328J5032j1571k5831k0053p049o39N408
8360G2874j2440j2859N444J0762N183k315k0258j6563K0912J5886k992p346o293
8347D9995J9419j515K057J2707K1060J6365o066O802k306j1286j281r588o319
8334I0044j966j6502k6115k479P877o100N297L0390J6247P043r796j3621j3038
8321F7281j4290L771j5594r455K03m10j307K234k387J925J8816O726R369K905
8307F9787j519j2574N012M633J5781Q735J8899j802l612m997k753p859q814q319
8293G0598j4078j0093n287J278P457j411O122p318j1292j0777j3585K43J4775
8280B6632K0730l815k470m787j0688l158J59L421J9526k339j425Q52r126o379
$$ plain form
8266 27133 45167 60748 58552 49822 25260 24948 12957 6748 4171 18253 17966 3965 17783
8253 17783 39680 46810 51321 38058 24810 27230 24748 16343 23636 28075 29386 22349 22958 39255
8239 39255 37490 29534 25047 16592 18113 16813 22945 27740 31244 43485 51910 36546 22325 9770
8225 9770 3854 1191 2695 15359 21568 3912 6668 3154 -6107 -11163 -7783 2992 8617 16974
8211 16974 13365 5933 12963 24290 19451 13574 9480 16914 35643 35776 23294 26773 25039 11499
8197 11499 -2293 2505 10357 17982 11497 -238 -411 7200 2926 -1137 19534 53853 77523 89143
8183 89143 78547 70053 65624 66471 63896 50880 27429 23561 29903 40216 40757 45260 50525 43763
8169 43763 43817 32370 25758 35390 28395 26493 32161 30164 40674 29050 23660 32955 23350 6409
$$ packed form
8266B7133J8034J5581k196q730k4562l12j1991o209k577J4082k87j4001J3818
8253A7783K1897P130M511j3263j3248K420k482q405P293M439J311p037O09J6297
8239C9255j765p956m487q455J521j300O132M795L504J2241Q425j5364j4221j2555
8225I770n916k663J504J2664O209j7656K756l514r261n056L380J0775N625Q357
8211A6974l609p432P030J1327m839n877m094P434J8729J33j2482L479j734j3540
8197A1499j3792M798P852P625o485j1735j73P611m274m063K0671L4319K3670J1620
8183H9143j0596q494m429Q47k575j3016k3451l868O342J0313N41M503N265o762
8169D3763N4j1447o612R632o995j902N668j997J0510j1624n390R295r605j6941
$$ plain form
8155 6409 13455 22336 35284 27919 12209 5616 17816 15691 1397 10231 26607 17560 -3529
8142 -3529 8756 12889 15757 15415 13094 4995 -60 76 6125 16252 27042 39740 39125 30217 15064
8127 15064 15669 18435 33857 45337 33144 45763 57582 48454 49520 40187 28909 44475 58031
8114 58031 55049 36307 28708 46570 57331 51679 40399 32323 24580 18516 30211 42769 46570
8101 46570 44167 39716 48115 59767 56337 36405 19677 20060 17876 32083 45327 52105 47573 38014
8087 38014 37566 25943 18754 18545 10659 18087 23251 20288 26734 25567 29927 33308 39915 45226 43206
8072 43206 34599 21144 3598 9417 15893 28318 39082 30416 38444 44650 32290 16953 22278
8059 22278 18829 3262 8264 24531 46185 74711 66366 48257 42902 31265 30889 38471 42165
$$ packed form
8155F409P046Q881J2948p365j5710o593J2200k125j4294Q834J6376r047k1089
8142c529J2285M133K868l42k321q099n055J36O049J0127J0790J2698o15q908j5153
8127A5064O05K766J5422J1480j2193J2619J1819r128J066r333j1278J5566J3556
8114E8031k982j8742p599J7862J0761n652j1280q076p743o064J1695J2558L801
8101D6570k403m451Q399J1652l430j9932j6728L83k184J4207J3244O778m532r559
8087C8014m48j1623p189k09p886P428N164k963O446j167M360L381O607N311k020
8072D3206q607j3455j7546N819O476J2425J0764q666Q028O206j2360j5337N325
8059B2278l449j5567N002J6267K1654K8526q345j8109n355j1637l76P582L694
$$ plain form
8046 42165 31325 34673 40388 53626 55023 39271 38457 38659 46830 59278 62632 61271 53959 51248
8032 51248 40704 45823 49117 43873 33291 26676 38546 42388 46961 41503 48345 48292 50873 54438
8018 54438 54719 54866 57485 74940 69956 53291 47317 50525 76066 64410 66661 68377 64907 65352
8004 65352 73056 73939 72649 57838 56391 67154 82722 84469 78660 72338 61705 73322 94820
7991 94820 106680 112944 123666 124009 112241 95940 79601 77255 79986 84557 95434 103818 90330
7978 90330 71035 51532 69179 79706 75194 52452 31460 26010 29574 46726 68924 63303 54720
7965 54720 62669 77748 91898 99885 106595 109335 103739 97539 102076 105660 105869 114087 122340 124366
7951 124366 132015 144553 155053 151789 154095 149191 127840 128556 121184 105642 100083 97616 95396 98821
$$ packed form
8046D2165j0840L348N715J3238J397j5752q14K02Q171J2448L354j361p312k711
8032E1248j0544N119L294n244j0582o615J1870L842M573n458O842n3K581L565
8018E4438K81J47K619J7455m984j6665n974L208K5541j1656K251J716l470M45
8004F5352P704Q83j290j4811j447J0763J5568J747n809o322j0633J1617K1498
7991I4820J1860O264J0722L43j1768j6301j6339k346K731M571J0877Q384j3488
7978I0330j9295j9503J7647J0527m512k2742k0992n450L564J7152K2198n621q583
7965E4720P949J5079J4150P987O710K740n596o200M537L584K09Q218Q253K026
7951A24366P649J2538J0500l264K306m904k1351P16p372j5542n559k467k220L425
$$ plain form
7937 98821 84847 52650 59173 58708 52028 40335 49587 71517 58006 41782 43662 45593 46994
7924 46994 48377 47856 59138 69415 74204 75257 59804 60896 55348 63386 68106 68507 53837 59312
7910 59312 58409 55883 50218 50293 50770 44784 40839 44238 40911 54756 68739 64278 57930 65464 56408
7895 56408 36078 27426 15441 9134 3304 8173 19186 15042 14518 20969 31991 20621 16889 36049
7881 36049 41135 38976 29031 29815 20512 24607 33197 28337 14500 13911 1639 1378 7892 17626 19205
7866 19205 19441 20041 -3025 -10356 4890 14520 31379 37939 24060 12189 16258 17437 21488 16429
7852 16429 7265 9306 15884 20587 13953 4249 5852 12585 24687 28714 21725 5564 8745 2271
7838 2271 -18035 -16222 4441 7903 4143 1300 22409 31135 17577 21360 2453 4976 5896 11114
$$ packed form
7937I8821j3974l2197O523m65o680j1693R252K1930j3511j6224J880J931J401
7924D6994J383n21J1282J0277M789J053j5453J092n548Q038M720M01j4670N475
7910E9312r03k526n665P5M77n986l945L399l327J3845J3983m461o348P534r056
7895E6408k0330q652j1985o307n830M869J1013m144n24O451J1022j1370l732J9160
7881C6049N086k159r945P84r303M095Q590m860j3837n89j2272k61O514R734J579
7866A9205K36O00k3066p331J5246R630J6859O560j3879j1871M069J179M051n059
7852A6429r164K041O578M703o634r704J603O733J2102M027o989j6161L181o474
7838B271k0306J813K0663L462l760k843K1109Q726j3558L783j8907K523R20N218
$$ plain form
7824 11114 14727 9117 -6267 -2530 16271 16897 7451 -6873 -13577 -15634 4550 15534 8628 -6281
7810 -6281 -23949 -8130 8837 13963 11483 -6392 -4988 13760 17902 14238 19489 19942 20861 8748
7796 8748 -14011 -9671 -16250 -7451 -3645 2002 7386 17076 13347 8575 19342 14872 -3807 1324
7782 1324 13171 4364 -6437 -7413 -10929 -7576 3412 5632 -3547 -4229 -3190 13396 15489 21364
7768 21364 22378 20103 19127 26690 37921 40310 35975 17918 13450 15324 17399 -143 -2565 -1631
7754 -1631 7104 5063 14945 23556 14983 3478 337 -4575 14098 14453 24741 21470 14870 18215
7740 18215 21183 20740 3485 14547 37482 45662 44827 45955 34158 15970 -10495 -14731 -4417
7727 -4417 -3082 -5812 940 -1349 -3215 1065 2565 23014 21021 14288 11089 -2013 -16891 -20880
$$ packed form
7824A1114L613n610j5384L737J8801O26r446j4324o704k057K0184J0984o906j4909
7810f281j7668J5819J6967N126k480j7875J404J8748M142l664N251M53R19j2113
7796H748k2759M340o579Q799L806N647N384R690l729m772J0767m470j8679N131
7782A324J1847q807j0801r76l516L353J0988K220r179o82J039J6586K093N875
7768B1364J014k275r76P563J1231K389m335j8057m468J874K075j7542k422R34
7754a631Q735k041R882Q611q573j1505l141m912J8673L55J0288l271o600L345
7740A8215K968m43j7255J1062K2935Q180q35J128j1797j8188k6465m236J0314
7727d417J335k730O752k289j866M280J500K0449j993o733l199j3102j4878l989
$$ plain form
7713 -20880 -9592 2417 -7011 -13015 -3524 -6535 -14044 -26371 -18168 -13735 -2645 3541 1563 109
7699 109 -5068 -18147 -14535 -10471 -19667 -10383 2633 8604 -3857 -23798 -12631 -2294 -2100 1061
7685 1061 9448 11140 -8482 -25574 -31418 -5206 2318 4262 14117 14361 16379 22299 28365 30880
7671 30880 26842 6236 -10124 -517 -14386 -25194 -29077 -26865 -24374 -17617 301 13515 2824
7658 2824 10777 26016 21856 6734 7199 20069 22563 17801 9046 -2084 -1693 -3598 3970 -1974
7644 -1974 -10230 -11254 -19515 -21495 -23983 -21069 -4788 11602 16206 3934 -10754 -6381 -12048 -12509
7630 -12509 -2578 1236 -2726 -9440 -15094 2603 19552 4041 -7231 -5249 7446 5869 4620
7617 4620 15991 27414 15569 20446 5912 -14013 -21490 -13581 -6230 -19258 -33355 -36172 -29695
$$ packed form
7713b0880J1288J2009r428o004R491l011p509j2327Q203M433J1090O186j978j454
7699A09n177j3079L612M064r196R284J3016N971j2461j9941J1167J0337J94L161
7685A061Q387J692j9622j7092n844K6212P524J944R855K44K018N920O066K515
7671C0880m038k0606j6360R607j3869j0808l883K212K491O757J7918J3214j0691
7658B824P953J5239m160j5122M65J2870K494m762q755j1130L91j905P568n944
7644a974q256j024q261j980k488K914J6281J6390M604j2272j4688M373n667m61
7630a2509R931L814l962o714n654J7697J6949j5511j1272J982J2695j577j249
7617D620J1371J1423j1845M877j4534j9925p477P909P351j3028j4097k817O477
$$ plain form
7604 -29695 -8979 18409 25767 25478 24397 12205 3783 4989 -2206 4734 9844 6848 6919 11381 2707
7589 2707 -158 -1627 -6436 -9263 -9281 -4692 -2904 -2422 -67 -3648 -5718 3254 6986 8189 16771 17172
7573 17172 8428 -4631 -1802 8786 21045 13585 -2734 -2082 -4765 -16139 -13420 -16609 528
7560 528 22066 22788 14801 9157 -14714 -16805 -17833 -3640 8551 12522 5801 2792 -6345 -14640
7546 -14640 -21116 -23875 -33638 -33617 -20664 -22910 -5624 -182 1470 4227 9788 13876 8466 -4902
7532 -4902 3772 12161 3815 16157 32888 25687 2298 6300 17907 12976 12585 20427 13609 9777
7518 9777 749 -840 -8093 -11554 -11628 -11758 -23231 -28595 -31291 -32494 -26500 -18317 -11576 -7595 -5760
7503 -5760 -4152 -14838 -9285 9396 16756 34123 41581 37813 34278 21041 -193 -1626 -182 4818
$$ packed form
7604b9695K0716K7388P358k89j081j2192q422J206p195O940N110k996P1M462q674
7589B707k865j469m809k827j8M589J788M82K355l581k070Q972L732J203Q582M01
7573A7172q744j3059K829J0588J2259p460j6319O52k683j1374K719l189J7137
7560E28K1538P22p987n644k3871k091j028J4193J2191L971o721l009r137q295
7546a4640o476k759r763K1J2953k246J7286N442J652K757N561M088n410j3368
7532d902Q674Q389q346J2342J6731p201k3389M002J1607m931l91P842o818l832
7518I777r028j589p253l461p4j30j1473n364k696j203N994Q183O741L981J835
7503e760J608j0686N553J8681P360J7367P458l768l535j3237k1234j433J444N000
$$ plain form
7489 4818 4077 1107 2053 -1379 -17278 -33995 -39582 -41179 -22712 -6607 -4869 -12113 -13123 1920
7475 1920 -3100 -18871 -9592 -5621 -7938 -8350 -9089 -1232 2188 -7373 3102 -179 -12879 -21203 -24654
7460 -24654 -11986 -9146 -5022 2954 -1345 -20182 -26514 -20543 -22574 -21012 -16545 -7355 -2462 4391
7446 4391 930 -13414 -9591 -12847 -17986 -997 -12040 -16451 -17208 -23212 -29270 -21275 -13066 -16470
7432 -16470 -11454 -7233 -852 6182 22419 17562 11869 -534 10129 23577 35160 25969 19414
7419 19414 14610 13991 17522 5988 -7035 -16230 -18079 -17142 -13802 2440 4173 -9682 -12193 -10061
7405 -10061 -14974 -21697 -9148 6147 7423 581 -13670 -7288 -1865 -12393 -13459 576 9902
7392 9902 2388 -934 -12536 -11267 -4400 11680 445 -22377 -25400 2287 19110 15798 -9613
$$ packed form
7489D818p41k970R46l432j5899j6717n587j597J8467J6105J738p244j010J5043
7475A920n020j5771R279L971k317m12p39P857L420r561J0475l281j2700q324l451
7460b4654J2668K840M124P976m299j8837o332N971k031J562M467R190M893O853
7446D391l461j4344L823l256n139J6989j1043m411p57o004o058P995Q209l404
7432a6470N016M221O381P034J6237m857n693j2403J0663J3448J1583r191o555
7419A9414m804o19L531j1534j3023r195j849R37L340J6242J733j3855k511K132
7405a0061m913o723J2549J5295J276o842j4251O382N423j0528j066J4035R326
7392I902p514l322j1602J269O867J6080j1235k2822l023K7687J6823l312k5411
$$ plain form
7379 -9613 -14376 -5541 123 3240 -5834 -13729 1756 14518 -373 -14345 -17551 -2254 13421
7366 13421 3106 467 5339 -2190 -5143 3184 9746 5289 6933 -10036 -13737 -4554 -8763 -7987
7352 -7987 -10600 -2284 -7929 -11508 -4662 -2247 -1917 9206 15952 5230 6833 454 -305 -460 -2874
7337 -2874 -4554 1370 -5381 -23138 -31907 -15503 -2316 -4887 -17295 -30441 -21248 -23440 -12014
7324 -12014 -997 -4109 -13529 -9405 1894 337 8146 3255 -9502 -2208 1267 573 4432 1544
7310 1544 5770 7874 4400 7204 18311 14166 1678 5950 8879 -7584 -6330 -8069 -18635 -2062
7296 -2062 -18756 -28755 -19902 -11381 2213 -14721 -12987 909 -8955 -25196 -36295 -33525 -14470
7283 -14470 -3028 -7588 -10421 -4753 -2468 -393 -34 -522 -672 -16825 -29038 -25193 -9441 -10737
$$ packed form
7379i613m763Q835N664L117r074p895J5485J2762j4891j3972l206J5297J5675
7366A3421j0315k639M872p529k953Q327O562m457J644j6969l701R183m209P76
7352g987k613Q316n645l579O846K415L30J1123O746j0722J603o379p59j55k414
7337b874j680N924o751j7757q769J6404J3187k571j2408j3146R193k192J1426
7324a2014J1017l112r420M124J1299j557P809m891j2757P294L475o94L859k888
7310A544M226K104l474K804J1107m145j2488M272K929j6463J254j739j0566J6573
7296b062j6694r999Q853Q521J3594j6934J734J3896r864j6241j1099K770J9055
7283a4470J1442m560k833N668K285K075L59m88j50j6153j2213L845J5752j296
$$ plain form
7269 -10737 1288 -5832 107 5015 8713 2856 -4577 -7216 -3893 -5455 330 9368 31608 23644
7255 23644 -3940 -26568 -19545 -1223 24 4875 13558 6687 10265 20768 17257 -1027 -2278
7242 -2278 -4546 -18073 -4758 9582 532 -17104 -17544 -17558 -15302 -18092 -7525 -1387 4401 247
7228 247 -6013 -12876 -21990 -17128 -20247 -26046 -24308 -3639 455 -4664 -10905 -16183 -21995 -32058 -20118
7213 -20118 -11785 -12634 -9929 3171 5788 3013 -6739 7327 20458 17840 13726 3170 -15535 -5822
7199 -5822 26688 25477 -2755 -9269 -5195 -7412 -1148 9022 7974 6311 -1986 -8851 -5750 -12023
7185 -12023 -16690 2588 2602 -1529 -21166 -31101 -35624 -36625 -29098 -29276 -9701 19672 24272 4003
7171 4003 -12640 -8094 -13047 -7524 -8129 4599 13397 15585 19985 22639 28622 13782 -53 -1834
$$ packed form
7269a0737J2025p120N939M908L698n857p433k639L323j562N785R038K2240p964
7255B3644k7584k2628P023J8322J247M851Q683o871L578J0503l511j8284j251
7242b278k268j3527J3315J4340r050j7636m40j4K256k790J0567O138N788m154
7228B47o260o863r114M862l119n799J738K0669M094n119o241n278n812j0063J1940
7213b0118Q333q49K705J3100K617k775r752J4066J3131k618m114j0556j8705R713
7199e822L2510j211k8232o514M074k217O264J0170j048j663q297o865L101o273
7185a2023m667J9278J4m131j9637r935m523j001P527j78J9575K9373M600k0269
7171D003j6643M546m953N523o05J2728Q798K188M400K654N983j4840j3835j781
$$ plain form
7157 -1834 -3345 -1790 929 -8606 -12168 -5634 -10271 -13752 -3495 14148 15344 3707 -15400 -5592
7143 -5592 18987 18629 13496 16273 29087 16697 -4810 -1091 -4766 -19343 -32588 -17549 -11252
7130 -11252 -5325 -14169 -18884 -17598 -28462 -25260 -30741 -24269 -15221 -31126 -27034 -8145 -5865 -1346
7116 -1346 7989 12824 3876 -5300 -7849 -7942 -8133 -22931 -22908 -14557 -17781 -23714 -19699 -25430 -12392 -5928
7100 -5928 -23112 -20962 -13547 -12318 -24220 -23043 -19394 -18044 -5797 -3946 -16123 -25566 -28754 -28019
7086 -28019 -13877 -2818 -16099 -36553 -43354 -35136 -22546 -18367 -12563 3779 4380 5087 -617 127
7072 127 1122 -2319 -3450 -8526 -5006 955 -6114 -18043 -18353 -16274 -4515 -17504 -22120 -17059 -12966
7057 -12966 411 926 13702 10378 8972 -4741 -9380 -15918 -12868 -17568 -11019 -16752 -18677 -9429
$$ packed form
7157a834j511J555K719r535l562O534m637l481J0257J7643J196j1637j9107R808
7143e592K4579l58n133K777J2814j2390k1507L719l675j4577j3245J5039O297
7130a1252N927q844m715J286j0864L202n481O472R048j5905M092J8889K280M519
7116a346R335M835q948r176k549r3j91j4798K3Q351l224n933M015n731J3038O464
7100e928j7184K150P415J229j1902J177L649J350J2247J851j2177r443l188P35
7086b8019J4142J1059j3281k0454o801Q218J2590M179N804J6342O01P07n704P44
7072A27R95l441j131n076L520N961p069j1929l10K079J1759j2989m616N061M093
7057a2966J3377N15J2776l324j406j3713m639o538L050m700O549n733j925R248
$$ plain form
7043 -9429 -10774 -21006 -19455 -23903 -15854 -21521 -21003 -20558 953 12995 -1982 -7832 4663 19758
7029 19758 15606 2409 -14136 -17634 -18181 -27816 -7967 5502 -6646 -28676 -17217 -6988 212
7016 212 -155 -17493 -14715 -11086 -7881 -12599 -14985 -10096 -10111 -24024 -37029 -25882 -7708 12749
7002 12749 18961 14562 2992 6719 4356 -1793 6047 2214 -5065 6540 17849 12603 4155 4496
6988 4496 -3385 -5403 -13213 -23556 -15665 -14076 -27034 -23388 -21904 -10603 354 -15496 -23922 -16388
6974 -16388 976 -6642 -26276 -15893 -1315 7443 -4394 76 -1752 -15995 -3446 8382 -6633
6961 -6633 110 10332 256 -373 -6060 -16435 -24414 -16164 -16962 -13451 469 -11303 -16679 -15670
6947 -15670 -12810 -6085 1640 4141 6725 9307 7462 8966 22349 -3037 -21289 -15691 -811 -5801
$$ packed form
7043i429j345j0232J551m448Q049n667N18M45K1511J2042j4977n850J2495J5095
7029A9758m152j3197j6545l498n47r635J9849J3469j2148k2030J1459J0229P200
7016B12l67j7338K778L629L205m718k386M889j5j3913j3005J1147J8174K0457
7002A2749O212m399j1570L727k363o149P840l833p279J1605J1309n246q448L41
6988D496p881k018p810j0343P891J589j2958L646J484J1301J0957j5850q426P534
6974a6388J7364p618j9634J0383J4578Q758j1837M470j828j4243J2549J1828j5015
6961f633O743J0222j0076o29n687j0375p979Q250p98L511J3920j1772n376J009
6947a5670K860O725P725K501K584K582j845J504J3383k5386j8252N598J4880m990
$$ plain form
6933 -5801 10369 -2057 -6420 -1658 -6229 -9406 -12338 -8655 -2471 -386 -7145 -4315 -15386 -28695
6919 -28695 -38021 -33140 -26966 -33556 -38204 -13261 -3352 2190 3590 -1302 -2859 -9751 770 1535
6905 1535 -6021 -8851 -9236 -20860 -39595 -23028 -13282 -12517 -31300 -34636 -23280 -20764 -14743 -23488
6891 -23488 -28265 -24767 -16475 -13970 -22259 -17065 -12008 -18109 -10690 -12274 -14437 -15370 -4137 5087 1219
6876 1219 -8218 -10836 -15524 -16077 -18602 -17226 -10954 -8385 3599 -13145 -36762 -42827 -26832 -15338
6862 -15338 -4782 -2361 -7074 -6661 -10034 -26740 -36764 -31847 -29070 -22552 -18684 -10236 -18096 -30785
6848 -30785 -8869 -4165 8433 5478 -13267 1488 14451 -3533 -16906 -22598 -18430 -36494 -42932
6835 -42932 -34499 -39178 -26980 -79 -250 -2717 -15377 -23132 -23256 -15859 -2876 -18030 -33578 -29700
$$ packed form
6933e801J6170j2426m363M762m571l177k932L683O184K085o759K830j1071j3309
6919b8695r326M881O174o590m648K4943R909N542J400m892j557o892J0521P65
6905A535p556k830l85j1624j8735J6567R746P65j8783l336J1356K516O021q745
6891b3488m777L498Q292K505q289N194N057o101P419j584k163r33J1233R224l868
6876A219r437k618m688n53k525J376O272K569J1984j6744k3617o065J5995J1494
6862a5338J0556K421m713M13l373j6706j0024M917K777O518L868Q448p860j2689
6848c0785K1916M704J2598k955j8745J4755J2963j7984j3373n692M168j8064o438
6835d2932Q433m679J2198K6901j71k467j2660p755j24P397J2983j5154j5548L878
$$ plain form
6821 -29700 -15793 -24721 -28530 -8182 -5839 -17040 -28140 -24468 -15441 -4669 2122 -18629 -25791
6808 -25791 -12260 -5345 -11002 1939 -63 -9375 -5983 -17759 -16814 -6946 -5120 -3592 -238 -14416
6794 -14416 -20710 -17471 3954 -2199 -12189 -3149 -14766 -25082 -33924 -27383 -8012 6358 -865
6781 -865 -9129 -8881 -9356 -17753 -20806 8963 29386 27244 27140 18730 10787 6485 2227 -3381 -11999
6766 -11999 -5558 -1306 -21015 -24389 -21180 -14699 -10972 -3058 -1850 12367 9659 6387 5877 2057
6752 2057 15781 -3805 -24977 -31829 -33293 -36895 -23669 -16637 -9779 -10077 -11177 -12724 -7627 -16581
6738 -16581 -14464 -12581 -22144 -22258 -3598 12707 6364 11691 4140 -6210 6790 6244 -351 -1215
6724 -1215 4597 -99 -8682 -5206 22110 15296 -1444 21462 24091 9692 -16886 -15608 5496
$$ packed form
6821b9700J3907q928l809K0348K343j1201j1100L672R027J0772O791k0751p162
6808b5791J3531O915n657J2941k002r312L392j1776R45R868J826J528L354j4178
6794a4416o294L239K1425o153r990R040j1617j0316q842O541J9371J4370p223
6781h65q264K48m75q397l053K9769K0423k142j04q410p943m302m258n608q618
6766a1999O441M252j9709l374L209O481L727P914J208J4217k708l272n10l820
6752B057J3724j9586k1172o852j464l602J3226P032O858k98j100j547N097q954
6738a6581K117J883r563j14J8660J6305o343N327p551j0350J3000n46o595q64
6724a215N812m696q583L476K7316o814j6740K2906K629j4399k6578J278K1104
$$ plain form
6711 5496 26849 36708 45264 33324 23612 1809 -16178 -15507 -20440 -8521 -12629 -17115 -8733 -13679
6697 -13679 -22374 -14231 -12829 -6661 -13707 -2510 10874 23299 9601 -6410 -17037 -17175 -10843
6684 -10843 -13644 -14129 -9462 -10269 -8423 -615 -5555 -10521 -11832 -16011 -20645 -8424 8668 15161 6033
6669 6033 -4089 -30 -1678 707 13650 14723 -1831 -16566 -15407 1092 10666 1377 -13664
6656 -13664 -31112 -36106 -27383 -24697 -37132 -39626 -36450 -46769 -31959 -16328 10806 17702 2033
6643 2033 -6510 795 5277 6561 -17794 -28868 -31541 -43037 -20970 4148 11261 -10339 -10587 -7189
6629 -7189 -7854 -9322 -8112 -8202 1710 9844 4378 5470 12492 27305 56081 66758 65168 52436 41506
6614 41506 35581 44184 49268 42272 46166 50839 58717 69713 101469 117606 145529 192024 264321
$$ packed form
6711E496K1353R859Q556j1940r712k1803j7987O71m933J1919m108m486Q382m946
6697a3679q695Q143J402O168p046J1197J3384J2425j3698j6011j0627j38O332
6684a0843k801m85M667q07J846P808m940m966j311m179m634J2221J7092O493r128
6669F033j0122M059j648K385J2943J073j6554j4735J159J6499R574r289j5041
6656a3664j7448m994Q723K686j2435k494L176j0319J4810J5631K7134O896j5669
6643B033q543P305M482J284k4355j1074k673j1496K2067K5118P113k1600k48L398
6629g189o65j468J210r0R912Q134n466J092P022J4813K8776J0677j590j2732j0930
6614D1506n925Q603N084o996L894M673P878J0996L1756J6137K7923M6495P2297
$$ plain form
6601 264321 379048 592858 982338 1599195 1966860 1561196 950832 545858 350059 250938
6591 250938 212598 172787 137452 106791 79677 51325 33324 29897 26818 31795 30307 25885 24721
6578 24721 22434 45756 59541 50445 45298 24719 3006 -13454 -5793 6838 1126 10722 20823
6565 20823 15106 11509 7816 2249 -10170 -2928 -5079 -9847 4720 16701 25303 23192 23707 25790
6551 25790 22839 19742 21332 7323 910 -2998 -1596 -4474 -12394 -9909 1440 7493 9606 14151
6537 14151 15807 3672 -2364 -189 -5545 -7642 -548 5527 773 -6068 -1004 -9586 1493 507
6523 507 -9670 6492 -5420 -15331 -20733 -13336 298 9284 3303 -13116 -4392 18027 10917 -3405
6509 -3405 -4717 -3991 -3740 5204 -7661 -24113 -5124 -692 -3925 -5993 101 -1971 667 -8966 -4463
$$ packed form
6601B64321J14727K13810L89480O16857L67665m05664o10364m04974j95799r9121
6591B50938l8340l9811l5335l0661k7114k8352j8001l427l079M977j488m422j164
6578B4721k287K3322J3785r096n147k0579k1713j6460P661J2631n712R596J0101
6565B0823n717l597l693n567j2419P242k151m768J4567J1981Q602k111N15K083
6551B5790k951l097J590j4009o413l908J402k878p920K485J1349O053K113M545
6537A4151J656j2135o036K175n356k097P094O075m754o841N064q582J1079r86
6523E07j0177J6162j1912r911n402P397J3634Q986n981j6419Q724K2419p110j4322
6509c405j312P26K51Q944j2865j6452J8989M432l233k068O094k072K638r633M503
$$ plain form
6494 -4463 -309 9342 8070 11633 9335 -3763 -8283 -11870 -1368 685 -9404 -26408 -20494 -12506
6480 -12506 -5356 -5314 2007 13017 16635 15275 -8939 -12339 -24216 -14140 3341 -12223 -13508 -6243
6466 -6243 -138 4096 12437 7268 5076 -8324 -14004 -20283 -20310 -13636 3402 -2104 -10131 -15146 -18397
6451 -18397 -10380 -10224 -19283 -16652 -14309 -9178 1726 12665 10379 7455 3771 1145 -2499 -13904
6437 -13904 -24501 -28198 -24974 -24324 -25275 -19760 -8768 -3187 3565 19200 12399 5918 237 -1632
6423 -1632 -7128 -9215 -13816 -18967 -12955 1452 11152 7507 -13798 -33581 -28156 -30241 -22073 -10538
6409 -10538 -7878 -17916 -28273 -31670 -28446 -30330 -13943 2766 6534 17010 11759 2095 6501
6396 6501 12298 3891 -20455 -21743 -16733 -17855 -11249 -5721 -1043 -8144 -9553 -17295 -11919 1158
$$ packed form
6494d463M154R651j272L563k298j3098m520l587J0502K053j0089j7004N914P988
6480a2506P150M2P321J1010L618j360k4214l400j1877J0076J7481j5564j285P265
6466f243O105M234Q341n169k192j3400n680o279k7O674J7038n506q027n015l251
6451a8397Q017J56r059K631K343N131J0904J0939k286k924l684k626l644j1405
6437a3904j0597l697L224O50r51N515J0992N581O752J5635o801o481n681j869
6423a632n496k087m601n151O012J4407R700l645k1305j9783N425k085Q168J1535
6409a0538K660j0038j0357l397L224j884J6387J6709L768J0476n251r664M406
6396F501N797q407k4346j288N010j122O606N528M678p101j409p742N376J3077
$$ plain form
6382 1158 12220 15164 8562 -20215 -22745 -12669 -15482 -12939 -136 -10225 -17710 -12080 -10589 -7270
6368 -7270 1263 2904 -1799 7247 6779 -4731 -7749 -14288 -15327 -12731 -18980 -6685 7460 8285 -2192
6353 -2192 -4523 -3728 -3326 -1933 568 -5189 -19990 -9501 8057 7023 7326 153 -7530 -9191 -2085
6338 -2085 2074 -6640 -4958 -6286 -4869 4526 4867 4783 -3194 -11681 -27262 -25250 -19166 -19381 -25465 -27096
6322 -27096 -32194 -44325 -38279 -30224 -25018 -25535 -32664 -39461 -31433 -12886 2758 8009 13073 30895
6308 30895 35990 15797 2876 1121 2799 -10432 -19605 -16733 -18539 -11407 712 -6109 -8832 -13107
6294 -13107 -14963 -3508 12001 4615 -14157 -4180 -7195 -8409 -2246 -2873 12799 22746 23330 14439
6280 14439 3910 -14813 -14998 -16653 -13255 -10020 -5902 1781 9031 12428 7640 -1204 -13476 -11599
$$ packed form
6382A158J1062K944o602k8777k530J0076k813K543J2803j0089p485N630J491L319
6368g270Q533J641m703R046m68j1510l018o539j039K596o249J2295J4145Q25j0477
6353b192k331P95M02J393K501n757j4801J0489J7558j034L03p173p683j661P106
6338b085M159q714J682j328J417R395L41q4p977q487j5581K012O084k15o084j631
6322b7096n098j2131O046Q055N206n17p129o797Q028J8547J5644N251N064J7822
6308C0895N095k0193j2921j755J678j3231r173K872j806P132J2119o821k723m275
6294a3107j856J1455J5509p386j8772R977l015j214O163o27J5672R947N84q891
6280A4439j0529j8723j85j655L398L235M118P683P250L397m788q844j2272J877
$$ plain form
6266 -11599 -3237 -7271 -7633 3947 12161 13532 7497 7661 5128 3071 13618 12970 9867 11983 -3090
6251 -3090 -13394 8186 24968 25088 11552 6425 -7667 -13737 -2084 2675 -859 -2439 -13596
6238 -13596 -9942 -8449 -18125 -20842 -19299 -16170 -20155 -20405 -17488 -19126 -12897 -5945 -6378 -11912 -13684
6223 -13684 -7585 -5680 764 9473 10881 12094 6983 554 -9920 -3993 9273 -6220 -7295 -10756
6209 -10756 -2153 1709 -5243 -2208 7526 10171 13701 3192 -122 -610 -11099 -6336 -8067 -4839
6195 -4839 -1605 -18048 -23105 -14164 -5720 -20890 -16834 -12597 -8897 -12767 -14440 -12858 -8889 -5667
6181 -5667 759 9165 15161 18648 16173 22520 21715 21425 15483 6573 -7173 -23814 -33727 -37866 -31443
6166 -31443 -8727 340 -14601 -33317 -36009 -16523 -2212 -3817 1065 -2926 3861 13088 12642 3675
$$ packed form
6266a1599Q362m034l62J1580Q214J371o035J64k533k057J0547o48l103K116j5073
6251c090j0304K1580J6782J20j3536n127j4092o070J1653M759l534j580j1157
6238a3596L654J493r676k717J543L129l985k50K917j638O229O952m33n534j772
6223a3684O099J905O444Q709J408J213n111o429j0474N927J3266j5493j075l461
6209a0756Q603L862o952L035R734K645L530j0509l314m88j0489M763j731L228
6195d839L234j6443n057Q941Q444j5170M056M237L700l870j673J582L969L222
6181e667O426Q406N996L487k475O347q05k90n942q910j3746j6641r913m139O423
6166c1443K2716R067j4941j8716k692J9486J4311j605M882l991O787R227m46q967
$$ plain form
6152 3675 5832 1847 7796 10754 3085 8696 6185 -10929 -22789 -28561 -24559 -26632 -22911 -9488
6138 -9488 7996 15985 3987 2523 10153 15139 17120 10725 15059 14710 9718 9077 10651 11922 13352
6123 13352 5237 9666 3193 -6236 -8195 -9281 -14064 -23842 -8323 -8847 -17592 -8871 -9286 -13105 -28232
6108 -28232 -38046 -25961 -20061 -24028 -23080 -18582 1536 17823 17983 1004 -12236 -1654 4712 -418
6094 -418 -19504 -36782 -23348 -8838 -6410 536 4077 -11802 -12134 5564 2756 -7955 -13674 -15835
6080 -15835 -10187 2980 3410 -7342 -8271 3839 6870 15657 13353 10957 10190 638 7569 11334 5290
6065 5290 13191 10467 5501 13201 4106 -487 -810 -10774 -6067 -3000 -15378 -5982 1549 -20446 -11659
6050 -11659 4564 7222 4142 -5803 -4828 -2558 -8488 -16914 -14244 -5843 -12050 -11973 -861 2943 -5553
$$ packed form
6152C675K157l985N949K958p669N611k511j7114j1860n772M002k073L721J3423
6138i488J7484P989j1998j464P630M986J981o395M334l49m992o41J574J271J430
6123A3352q115M429o473r429j959j086m783r778J5519n24q745Q721m15l819j5127
6108b8232r814J2085N900l967R48M498K0118J6287J60j6979j3240J0582O366n130
6094d18j9086j7278J3434J4510K428O946L541j5879l32J7698k808j0711n719k161
6080a5835N648J3167M30j0752r29J2110L031Q787k304k396p67r552O931L765o044
6065E290P901k724m966P700r095m593l23r964M707L067j2378R396P531k1995Q787
6050a1659J6223K658l080r945R75K270n930q426K670Q401o207P7J1112L804q496
$$ plain form
6035 -5553 -16867 -19950 273 -3530 -861 5194 1629 6223 15757 12173 10276 13888 20972 11693
6021 11693 3998 2261 -9419 -2847 3468 1200 12611 12818 12989 -4750 175 6538 -5103 -9879
6007 -9879 -13259 -10675 563 6094 16494 24973 2220 -9684 2648 3857 -14 -7096 -13243 -22004
5993 -22004 -22032 -10491 -10939 -17459 451 -2751 -3687 -7312 -1307 -16790 -33035 -28411 -28529 -20414 -19356
5978 -19356 -4965 4871 4558 -1388 -1922 -9510 -5839 -551 -13556 -28571 -26138 -17820 -7198 -2263
5964 -2263 -3067 -10638 2824 -5943 -19299 -1581 887 -4859 -2870 -1224 -6584 -1760 4242 4897 -5905
5949 -5905 -896 -2713 -2202 2292 290 -4552 -8979 8076 20751 28121 12858 13287 19688 16239 19488
5934 19488 16480 18351 18189 25587 28887 13687 19939 19793 14829 10880 11349 7630 -12494 -3731 -5290
$$ packed form
6035e553j1314l083K0223l803K669O055l565M594R534l584j897L612P084r279
6021A1693p695j737j1680O572O315k268J1411K07J71j7739M925O363j1641m776
6007i879l380K584J1238N531J0400Q479k2753j1904J2332J209l871p082o147q761
5993b2004k8J1541m48o520J7910l202r36l625O005j5483j6245M624j18Q115J058
5978a9356J4391R836l13n946n34p588L671N288j3005j5015K433Q318J0622M935
5964b263q04p571J3462q767j3356J7718K468n746J989J646n360M824O002O55j0802
5949e905N009j817N11M494k002m842m427J7055J2675P370j5263M29O401l449L249
5934A9488l008J871j62P398L300j5200O252j46m964l949M69l719k0124Q763j559
$$ plain form
5919 -5290 -2941 -7431 -16700 -16354 -3304 409 -8970 -20159 -18880 -25848 -14274 -4196 -474 -6567
5905 -6567 -12095 -19964 -9767 -3440 6600 -11989 -17973 -7141 -7609 -16911 -12985 -4180 471 -5607
5891 -5607 -2711 3322 -6347 3197 6990 9939 5695 12747 -2498 -12916 -4689 -7582 -7101 -17263
5877 -17263 -10802 8928 21394 15665 8230 16952 7170 6935 10080 8829 12514 514 -5069 -9904
5863 -9904 -8374 -25538 -31687 -14236 -4868 -11848 -33118 -37732 -31307 -35907 -28121 -12694 -9647 -2612
5849 -2612 -17383 -15145 -8787 -6258 -16745 -17428 -22075 -12254 17223 26512 12054 -6783 10435 -2925
5835 -2925 2262 2964 5064 -5741 -13224 -17915 -27783 -27415 -19932 -2761 5723 12157 11174 8599 8131
5820 8131 3070 -14262 -18531 -25937 -28676 -18166 -18630 -13615 5320 18368 20452 17324 22289 20502
$$ packed form
5919e290K349m490r269L46J3050L713r379j1189J279o968J1574J0078L722o093
5905f567n528p869J0197O327J0040j8589n984J0832m68r302L926Q805M651o078
5891e607K896O033r669R544L793K949m244P052j5245j0418Q227k893M81j0162
5877a7263O461J9730J2466n729p435Q722r782k35L145j251L685j2000n583m835
5863i904J530j7164o149J7451R368o980k1270m614O425m600P786J5427L047P035
5849b612j4771K238O358K529j0487o83m647R821K9477R289j4458j8837J7218j3360
5835b925N187P02K100j0805p483m691r868L68P483J7171Q484O434r83k575m68
5820H131n061j7332m269p406k739J0510m64N015J8935J3048K084l128M965j787
$$ plain form
5806 20502 9197 3545 -3020 -5453 8095 -8992 -8934 -12398 -13267 6499 9584 7338 1455 -1450
5792 -1450 4402 19930 23887 6111 1835 9082 5845 3495 -363 1378 -5406 -12434 4869 14945
5778 14945 6041 491 -906 -4713 -12461 -19947 -29173 -22880 -9078 -3872 -4787 -5054 -8818 -7826 5021
5763 5021 9643 7073 5978 14863 13903 4387 4400 5635 2144 -4785 2141 10340 9662 1672 -6594 5200
5747 5200 328 6894 2877 -14992 -25270 -6613 -8065 -9171 -11320 -14263 -6028 6935 1495 -305
5733 -305 -11871 -579 12184 15551 7712 -3298 -9158 -22281 -33916 -16195 3219 15825 -1221
5720 -1221 -10310 9545 3287 2101 11582 8679 15822 2890 -23777 -14614 -8845 -18653 -13759 -374
5706 -374 4881 6418 -17697 -10400 -3267 4967 18938 13819 4217 -4738 -14665 -896 -1857 -13998
$$ packed form
5806B0502j1305n652o565k433J3548j7087N8l464q69J9766L085k246n883k905
5792a450N852J5528L957j7776m276P247l237k350l858J741o784p028J7303J0076
5778A4945q904n550j397l807p748p486r226O293J3802N206r15k67l764R92J2847
5763E021M622k570j095Q885r60r516J3J235l491o929O926Q199o78p990q266J1794
5747E200m872O566m017j7869j0278J8657j452j106k149k943Q235J2963n440j800
5733c05j1566J1292J2763L367p839j1010n860j3123j1635J7721J9414J2606j7046
5720a221r089J9855o258j186R481k903P143j2932k6667R163N769r808M894J3385
5706c74N255J537k4115P297P133Q234J3971n119r602q955r927J3769r61j2141
$$ plain form
5692 -13998 -24808 -31350 -24031 -22393 -29181 -35405 -33142 -18398 -9911 356 -7499 -24988 -21887 -1041
5678 -1041 3719 -17258 -29904 -25022 -12136 -17279 -15726 -9049 -18289 -6673 -8701 -27017 -45484
5665 -45484 -48741 -36434 -31832 -20229 -8361 -6434 -21106 -30380 -38472 -30170 -33345 -19747 -11105
5652 -11105 -28471 -29985 -26580 -31614 -17120 -972 1175 3243 14681 11358 6736 -9727 -2431
5639 -2431 10197 16529 18436 22025 9862 12745 16695 11016 13443 2905 -7044 -13323 -12423 -7846
5625 -7846 -6884 -18785 -23014 -3889 -10960 6384 20950 12254 -4342 -16706 -19197 1248 6141
5612 6141 -9596 -17942 4186 7578 1608 -4087 1163 816 1797 -5192 -15239 -30198 -32720 -20946
5598 -20946 -12105 -13435 -18594 -19165 -16845 -12212 7911 26052 20291 291 -5364 -4234 -13208 -16910
$$ packed form
5692a3998j0810o542P319J638o788o224K263J4744Q487J0267p855j7489L101K0846
5678a041M760k0977j2646M882J2886n143J553O677r240J1616k028j8316j8467
5665d5484l257J2307M602J1603J1868J927j4672r274q092Q302l175J3598Q642
5652a1105j7366j514L405n034J4494J6148K147K068J1438l323m622j6463P296
5639b431J2628O332J907L589j2163K883L950n679K427j0538r949o279R00M577
5625g846R62j1901m229J9125p071J7344J4566q696j6596j2364k491K0445M893
5612F141j5737q346K2128L392n970n695N250l47R81o989j0047j4959k522J1774
5598b0946Q841j330n159n71K320M633K0123J8141n761k0000n655J130q974l702
$$ plain form
5584 -16910 -26047 -31526 -17254 -2452 6995 1478 -13576 -19757 -30465 -40837 -37712 -19540 -16549
5571 -16549 -21930 -32053 -14048 -423 -16306 -38802 -29985 -15417 -19477 -32338 -35620 -29532 -28818
5558 -28818 -16927 -19199 -24765 -25839 -25789 -24053 -23194 -20738 -18775 -17249 -8816 -13486 -16945 -12484 2219
5543 2219 739 -7991 -14093 -6599 -12476 -8056 3928 21635 23520 6469 2893 -6809 -16795 -22524
5529 -22524 -16276 -2109 -1698 -14228 -13079 -4548 5265 5724 -4248 -9442 -12056 -14179 -8320 -12633 -12075
5514 -12075 -14562 -9535 -1078 3439 1095 2054 -8483 -21986 -14910 -17441 -8466 2457 9939 8027
5500 8027 -3517 -18986 -11685 -19981 -12348 -5911 -1381 -15281 -21519 -19626 -8676 -23021 -26340 -5896
5486 -5896 -1012 -8352 5241 13221 4660 4955 -4418 -14120 -14993 -16882 -23531 -15030 -4198 7673 1172
$$ packed form
5584a6910r137n479J4272J4802R447n517j5054o181j0708j0372L125J8172K991
5571a6549n381j0123J8005J3625j5883k2496Q817J4568m060j2861l282O088P14
5558b8818J1891k272n566j074N0J736Q59K456J963J526Q433m670l459M461J4703
5543B219j480q730o102P494n877M420J1984J7707J885j7051l576r702r986n729
5529b2524O248J4167M11j2530J149Q531R813M59r972n194k614k123N859m313N58
5514a2075k487N027Q457M517k344R59j0537j3503P076k531Q975J0923P482j912
5500H027j1544j5469P301q296P633O437M530j3900o238J893J0950j4345l319K0444
5486e896M884p340J3593P980q561K95r373r702q73j889o649Q501J0832J1871o501
$$ plain form
5471 1172 -13921 -2864 -2412 -11112 -14983 8904 8611 -16664 -20034 -18518 -13713 -12047 -11637 -11337 -2078
5456 -2078 9236 -627 -6253 -2130 1011 -2589 -12380 -11505 -8004 5891 12863 7685 2818 5439 6481
5441 6481 7280 12333 11480 10920 6460 -16510 -22161 -8963 5914 -1225 4142 1363 -8751 -1186 7083
5426 7083 15805 28899 15956 -3772 -13192 -6719 -4348 1793 4295 1031 5692 13605 6966 -168
5412 -168 -7944 -13505 3804 9515 -866 8548 -2420 -2576 1858 -10806 -31859 -33211 -21611 -5545
5398 -5545 -6755 7386 18090 24779 25657 7377 -6358 9135 17514 5489 2220 18188 6143
5385 6143 -10345 -15402 -16239 -24507 -25847 -32033 -23028 -12387 -12086 -12536 -24599 -30780 -17259 -11748 1990
5370 1990 -7932 -20812 -35305 -27754 -7748 -4234 -13509 -15493 -12179 7944 12844 14141 -439 -3536
$$ packed form
5471A172j5093J1057M52q700l871K3887k93k5275l370J516M805J666M10L00R259
5456b078J1314r863n626M123L141l600r791Q75L501J3895O972n178m867K621J042
5441F481P99N053q53n60m460k2970n651J3198J4877p139N367k779j0114P565Q269
5426G083Q722J3094j2943j9728r420O473K371O141K502l264M661P913o639p134
5412a68p776n561J7309N711j0381R414j0968j56M434j2664k1053j352J1600J6066
5398e545j210J4141J0704O689Q78j8280j3735J5493Q379j2025l269J5968j2045
5385F143j6488n057q37q268j340o186R005J0641L01m50j2063o181J3521N511J3738
5370A990r922j2880j4493P551K0006L514r275j984L314K0123M900J297j4580l097
$$ plain form
5356 -3536 -11894 -19587 -21082 -24830 -29498 -29122 -7797 -1356 -10909 -16236 856 23092 27459 4525
5342 4525 -7146 -9814 -19856 -28640 -26198 -28681 -25026 -19239 -18249 -22497 -6499 -3919 -13637 -14636 -18020
5327 -18020 -6766 -22042 -32905 -25269 -14794 -3266 3381 16366 19467 15686 16178 15249 -7120
5314 -7120 -22497 -12889 -6732 -14180 -16717 -10312 -14680 -5629 7865 2679 4003 9962 10318 -2169
5300 -2169 -12000 -16967 -17742 -27232 -30472 -15223 -13897 -13698 -8559 -2723 4129 14279 20128 20573 14743
5285 14743 -3380 -21789 -15994 -1852 7439 14708 12778 7267 19446 20056 17037 5739 8663 20269
5271 20269 39528 31572 6540 8354 17444 16202 8898 -923 7710 16175 7030 -2275 -8220 1723
5257 1723 8514 8700 10775 8299 3569 2444 -1160 -7938 4434 5960 -2499 -16916 -12253 -13661 -5743
$$ packed form
5356c536q358p693j495l748m668L76K1325O441r553n327J7092K2236M367k2934
5342D525j1671k668j0042q784K442k483L655N787R90m248J5998K580r718r99l384
5327a8020J1254j5276j0863P636J0475J1528O647J2985L101l781M92r29k2369
5314g120j5377R608O157p448k537O405m368R051J3494n186J324N959L56j2487
5300b169r831m967p75r490l240J5249J326J99N139N836O852J0150N849M45n830
5285A4743j8123j8409N795J4142R291P269j930n511J2179O10l019j1298K924J1606
5271B0269J9259p956k5032J814R090j242p304r821Q633Q465r145r305n945R943
5257A723O791J86K075k476m730j125l604o778J2372J526q459j4417M663j408P918
$$ plain form
5242 -5743 -6426 -13005 -38569 -27454 -12569 1797 13950 11251 11602 -56 -15448 -12588 -10464 -8934
5228 -8934 -1017 -7853 -14429 -27502 -20590 -7048 -23167 -30396 -20410 -1412 -1830 6401 9810 14941
5214 14941 11906 24669 14746 13143 12551 1838 -8200 -13491 -7356 3781 3505 -10605 -18552 -19717
5200 -19717 -14516 -14573 1240 15341 8198 -6172 -7895 4446 7898 11817 8147 3259 5857 9703
$$ packed form
5242e743o83o579k5564J1115J4885J4366J2153k699L51j1658j5392K860K124J530
5228h934P917o836o576j3073O912J3542j6119p229R986J8998m18Q231L409N131
5214A4941l035J2763r923j603n92j0713j0038n291O135J1137k76j4110p947j165
5200a9717N201n7J5813J4101p143j4370j723J2341L452L919l670m888K598L846
$$ [...]
##END NTUPLES=NMR SPECTRUM
##END=
