##TITLE=Analysis number 326236
Compound Code cd 03747
Project Code adrs
Chemist Name mariap
##JCAMPDX= 6.0         $$ Bruker NMR JCAMP-DX V2.0
##DATA TYPE= NMR SPECTRUM
##DATA CLASS= NTUPLES
##ORIGIN= Bruker BioSpin GmbH
##OWNER= nmr
$$ XWIN-NMR		Version 3.5
$$ Tue Jan 30 08:56:23 2007 GMT Standard Time (UT+0h)  MAYBRIDGE\nmr@NMR_250MHZ
##.OBSERVE FREQUENCY= 250.131544655141
##.OBSERVE NUCLEUS= ^1H
##.ACQUISITION MODE= SIMULTANEOUS (DQD)
##.ACQUISITION SCHEME= undefined
##.AVERAGES= 16
##.DIGITISER RES= 18
##SPECTROMETER/DATA SYSTEM= dpx250
##.PULSE SEQUENCE= zg30
##.SOLVENT NAME= CDCl3
##.SHIFT REFERENCE= (INTERNAL, CDCl3, 0, 16.522)
##AUDIT TRAIL= $$ (NUMBER, WHEN, WHO, WHERE, WHAT)
$$ ##TITLE= Audit trail, XWIN-NMR		Version 3.5
$$ ##JCAMPDX= 5.01
$$ ##ORIGIN= Bruker BioSpin GmbH
$$ ##OWNER= nmr
$$ C:\u/data/dgb/nmr/ADRS/2220/pdata/1/auditp.txt
$$ ##AUDIT TRAIL=  $$ (NUMBER, WHEN, WHO, WHERE, WHAT)
(   1,<2007-01-30 08:56:00.39 +000>,<MAYBRIDGE\nmr>,<NMR_250MHZ>,
      <created by zg, POWCHK disabled, PULCHK disabled
       configuration hash MD5:
       49 4B E0 1D 92 C2 6B 37 9F E6 65 BC 52 41 86 1D
       data hash MD5: 64K
       2D 77 4B E0 EA 59 AE FA 9D E9 ED F8 70 0C 98 4C>)
(   2,<2007-01-30 08:56:13.77 +000>,<MAYBRIDGE\nmr>,<NMR_250MHZ>,
      <Start of raw data processing
       ef LB = 0.3 FT_mod = 6 PKNL = 1 SI = 32K 
       data hash MD5: 32K
       2B CE 36 64 33 20 9D D7 C8 B8 52 FB A9 F2 7D 3C>)
(   3,<2007-01-30 08:56:15.86 +000>,<MAYBRIDGE\nmr>,<NMR_250MHZ>,
      <apk 
       data hash MD5: 32K
       F4 B2 06 C3 3B 4D 17 90 A9 CB 74 5D F1 A9 70 A3>)
(   4,<2007-01-30 08:56:16.66 +000>,<MAYBRIDGE\nmr>,<NMR_250MHZ>,
      <abs ABSG = 5 
       data hash MD5: 32K
       D2 59 43 8B 8B 23 10 A4 8F BF E5 0D 33 67 E3 95>)
$$ ##END=
$$ 
$$ hash MD5
$$ 55 8C B9 FD 82 79 E3 D2 31 9A C4 E4 54 03 A9 18
##$RELAX= 
##$RELAX= 
##$RELAX= 
##$RELAX= 
##$RELAX= 
##$RELAX= 
##$RELAX= 
$$ Bruker specific parameters
$$ --------------------------
##$DU= <C:\u>
##$EXPNO= 2220
##$NAME= <ADRS>
##$PROCNO= 1
##$TYPE= <nmr>
##$USER= <dgb>
##$AMP= (0..31)
100 100 100 100 100 100 100 100 100 100 100 100 100 100 100 100 100 100 
100 100 100 100 100 100 100 100 100 100 100 100 100 100 
##$AQSEQ= 0
##$AQ_mod= 3
##$AUNM= <au_zg>
##$AUTOPOS= <33 >
##$BF1= 250.13
##$BF2= 250.13
##$BF3= 250.13
##$BF4= 250.13
##$BF5= 500.13
##$BF6= 500.13
##$BF7= 500.13
##$BF8= 500.13
##$BYTORDA= 1
##$CFDGTYP= 0
##$CFRGTYP= 5
##$CHEMSTR= <none>
##$CNST= (0..31)
1 1 145 1 1 1 1 1 1 1 1 1 1 1 1 1 1 1 1 1 1 1 1 1 1 1 1 1 1 1 1 1 
##$CPDPRG= <>
##$CPDPRG1= <>
##$CPDPRG2= <>
##$CPDPRG3= <>
##$CPDPRG4= <mlev>
##$CPDPRG5= <mlev>
##$CPDPRG6= <mlev>
##$CPDPRG7= <mlev>
##$CPDPRG8= <mlev>
##$CPDPRGB= <>
##$CPDPRGT= <>
##$D= (0..31)
0 1 0 0 0 0 0 0 0 0.06 0 0 0 0 0 0 0.0002 0 0 0 0 0 0 0 0 0 0 0 0 0 0 
0 
##$DATE= 1170147359
##$DBL= (0..7)
120 120 120 120 120 120 120 120 
##$DBP= (0..7)
150 150 150 150 150 150 150 150 
##$DBP07= 0
##$DBPNAM0= <>
##$DBPNAM1= <>
##$DBPNAM2= <>
$$ [...]
##$SUBNAM7= <"">
##$SUBNAM8= <"">
##$SUBNAM9= <"">
##$SW= 20.6930455092707
##$SWIBOX= (0..15)
0 0 3 0 0 0 0 0 0 0 0 0 0 0 0 0 
##$SW_h= 5175.983436853
##$TD= 65536
##$TD0= 1
##$TE= 294.16
##$TE2= 300
##$TE3= 300
##$TEG= 300
##$TL= (0..7)
0 120 120 120 120 120 120 120 
##$TP= (0..7)
150 150 150 150 150 150 150 150 
##$TP07= 0
##$TPNAME0= <>
##$TPNAME1= <>
##$TPNAME2= <>
##$TPNAME3= <>
##$TPNAME4= <>
##$TPNAME5= <>
##$TPNAME6= <>
##$TPNAME7= <>
##$TPOAL= (0..7)
0.5 0.5 0.5 0.5 0.5 0.5 0.5 0.5 
##$TPOFFS= (0..7)
0 0 0 0 0 0 0 0 
##$TUNHIN= 0
##$TUNHOUT= 0
##$TUNXOUT= 0
##$USERA1= <user>
##$USERA2= <user>
##$USERA3= <user>
##$USERA4= <user>
##$USERA5= <user>
##$V9= 5
##$VALIST= <valist>
##$VCLIST= <CCCCCCCCCCCCCCC>
##$VD= 0
##$VDLIST= <DDDDDDDDDDDDDDD>
##$VPLIST= <PPPPPPPPPPPPPPP>
##$VTLIST= <TTTTTTTTTTTTTTT>
##$WBST= 1024
##$WBSW= 4
##$XGAIN= (0..3)
0 0 0 0 
##$XL= 0
##$YL= 0
##$YMAX_a= 370838
##$YMIN_a= -529421
##$ZGOPTNS= <>
##$ZL1= 120
##$ZL2= 120
##$ZL3= 120
##$ZL4= 120
##$ABSF1= 16.522
##$ABSF2= -4.171173
##$ABSG= 5
##$ABSL= 3
##$ALPHA= 0
##$AQORDER= 0
##$ASSFAC= 0
##$ASSFACI= 0
##$ASSFACX= 0
##$ASSWID= 0
##$AUNMP= <proc_1d>
##$AZFE= 0.1
##$AZFW= 0.1
##$BCFW= 0
##$BC_mod= 0
##$BYTORDP= 0
##$COROFFS= 0
##$CY= 12.5
##$DATMOD= 1
##$DC= 0
##$DFILT= <>
##$DTYPP= 0
##$F1P= 14.0000005364418
##$F2P= -0.99999901652339
##$FCOR= 0.5
##$FTSIZE= 32768
##$FT_mod= 6
##$GAMMA= 0
##$GB= 0
##$INTBC= 1
##$INTSCL= 1
##$ISEN= 128
##$LB= 0.3
##$LEV0= 0
##$LPBIN= 0
##$MAXI= 10000
##$MC2= 0
##$MEAN= 0
##$ME_mod= 0
##$MI= 0
##$NCOEF= 0
##$NC_proc= -4
##$NLEV= 6
##$NOISF1= 0
##$NOISF2= 0
##$NSP= 0
##$NTH_PI= 0
##$NZP= 0
##$OFFSET= 16.522
##$PC= 1
##$PHC0= 228.5052
##$PHC1= 6.553981
##$PH_mod= 1
##$PKNL= yes
##$PPARMOD= 0
##$PSCAL= 4
##$PSIGN= 0
##$REVERSE= no
##$SF= 250.13
##$SI= 32768
##$SIGF1= 0
##$SIGF2= 0
##$SINO= 400
##$SIOLD= 32768
##$SREGLST= <1H.CDCl3>
##$SSB= 0
##$STSI= 32768
##$STSR= 0
##$SW_p= 5175.98343685301
##$SYMM= 0
##$S_DEV= 0
##$TDeff= 65536
##$TDoff= 0
##$TI= <Analysis number 999999
Compound Code 99
Book Reference 9
Project Code 9>
##$TILT= no
##$TM1= 0
##$TM2= 0
##$TOPLEV= 0
##$USERP1= <user>
##$USERP2= <user>
##$USERP3= <user>
##$USERP4= <user>
##$USERP5= <user>
##$WDW= 1
##$XDIM= 32768
##$YMAX_p= 481678359
##$YMIN_p= -168721
$$ End of Bruker specific parameters
$$ ---------------------------------
##NTUPLES= NMR SPECTRUM
##VAR_NAME=  FREQUENCY,     SPECTRUM/REAL,   SPECTRUM/IMAG
##SYMBOL=    X,             R,               I
##VAR_TYPE=  INDEPENDENT,   DEPENDENT,       DEPENDENT
##VAR_FORM=  AFFN,          ASDF,            ASDF
##VAR_DIM=   32768,         32768,           32768
##UNITS=     HZ,            ARBITRARY UNITS, ARBITRARY UNITS
##FACTOR=    0.157963299565203, 1,           1
##FIRST=     4132.6476996994, 0,             0
##LAST=      -1043.33573715361, 0,           0
##MIN=       -1043.33573715361, -168721,     0
##MAX=       4132.6476996994, 481678359,     0
$$ Real data points
##PAGE= N=1
##DATA TABLE= (X++(R..R)), XYDATA
$$ [...]
28547 -25604 24325 64675 49262 55999 48082 33798 11096 22949 18719 43961 30689 3888
28535 3888 10532 6938 44892 72676 76213 37402 37276 15578 -31590 -20733 -26059 -68899 -72156
28522 -72156 -2540 55540 68352 34681 22535 7414 -8612 2957 -31584 -60325 -26551 -13615
28510 -13615 -15767 -3190 -14403 -22859 -43172 -54143 -27272 7889 26645 14562 12821 24296
28498 24296 39443 34789 43873 27352 11791 11987 -44403 -45691 -8133 -5612 -11274 -15501 9731
28485 9731 32871 23923 14151 -17828 -26951 -45128 -57865 -54721 -39333 -24565 -18544 10387 48385
28472 48385 21255 -9338 1852 4333 -575 19750 33524 34049 -18342 -33886 -7627 24267
28460 24267 30069 37893 55495 26430 13225 -4418 -11650 -24735 -18681 17915 34045 70468
28448 70468 58379 23430 42313 49049 18265 9446 22062 18256 -50347 -82137 -30782 19114
28436 19114 50031 39830 42360 -4899 -5186 32989 23279 20989 18322 19756 6925 14389 -29755
28423 -29755 -5088 49339 74581 71695 36605 58983 46883 37831 3265 -23123 7666 7839
28411 7839 1825 -24952 -35540 -25748 -39850 -24075 -10658 35653 1892 -43928 -41047 -7745
28399 -7745 -16185 -53711 -22321 -4224 17130 1175 -33066 -17698 26641 50017 1094 -1443
28387 -1443 26575 37567 40189 38020 48389 31610 999 -9967 -38098 -37017 803 33599
28375 33599 38416 -5522 -12862 -2703 27381 35198 37111 59421 50758 52358 30455 -22437 -31025
28362 -31025 -5085 15854 21685 11142 12972 -6119 -11750 -4040 -18917 -12736 -31323 -28122 -6335
28349 -6335 -38908 -47380 -36988 -53487 -59346 -54747 -4998 23323 45817 43562 19019 8905 -16415
28336 -16415 -26044 -18162 27328 72792 64161 31233 10107 44522 50521 47096 31604 35674 43922
28323 43922 -1868 -34410 -4129 2855 -11572 -25842 -21288 -18385 2980 3233 15736 48531 49182
28310 49182 23008 8028 -25519 -945 25502 23072 8400 16841 10675 -3884 -6400 -5172 34253
28297 34253 76454 87495 38609 -537 -4671 -8022 -11816 -24456 -11562 -11120 -1599 60438 80289
28284 80289 54340 56544 55157 30025 3665 9480 21963 48539 80135 80097 32166 2508 -23824
28271 -23824 -7345 -2162 12959 46225 51488 47276 31826 9791 -56565 -66511 -12712 5891
28259 5891 -2263 -23937 -54022 -94374 -77155 -38366 20054 38448 88849 56477 9513 1084
28247 1084 6710 -12284 25887 69568 80162 65292 28430 11336 26934 -1525 -57572 -83003
28235 -83003 -55763 -10605 16924 17381 -31761 -3339 52006 13297 -7428 26265 37284 19449
28223 19449 -7082 -9211 -14209 -26543 26079 67681 48542 28857 7064 -1006 8199 16259 45978
28210 45978 31539 -19419 11447 11455 -3725 -19972 -42715 -17498 33705 19558 39117 30277 11261
28197 11261 19920 32411 55634 52193 -14035 -27425 -10563 2984 65691 96863 104026 75897
28185 75897 59036 35656 25756 15442 20021 3224 2778 4991 -14478 -6178 4591 -17336 -13793
28172 -13793 -3311 -15348 -13419 9353 30441 -16428 -18478 19904 77936 70471 34287 17755
28160 17755 3350 32079 53969 46800 40026 41663 43141 19772 -19766 -46612 -25937 -18788 9006
28147 9006 37950 41385 28751 13522 21165 41940 65936 65378 39254 55991 89487 68720 74168
28134 74168 80618 38067 9922 33080 10542 6171 2494 -3545 -906 -7095 -22198 -28696 -5218
28121 -5218 1762 -41019 -38791 -20832 -33461 -36065 -25903 -19475 12906 -9857 4441 38543 2717
28108 2717 -13034 17839 1148 -22062 -49712 -63200 -37101 -25296 -2535 -34574 -43319 -29416
28096 -29416 6463 6814 -706 15035 31960 -9832 -13922 -25639 -37889 -17761 12045 2801 -19210
28083 -19210 -32475 -13949 16185 13029 -14304 14884 36679 9006 5494 11066 17289 26759 66384
28070 66384 63403 4929 -27047 -38616 -29755 -4569 13444 42058 25645 -3818 -37520 -63818
28058 -63818 -44920 10539 18739 -24493 -58913 -65535 -40320 -16467 -7136 -17276 -33422 -24178
28046 -24178 -1255 16549 24427 49599 34847 5431 -29450 17119 21259 7220 -8021 7381
28034 7381 25192 -944 35843 54289 65016 78045 63952 39096 32144 23142 31303 34131 20952
28021 20952 28977 7407 21414 12800 -5032 -754 -16067 6773 27589 -3929 3208 40124
28009 40124 41674 38574 1250 41838 46384 -21998 -64937 -22902 -8902 -1385 -11280 17885 19640
27996 19640 1781 -14730 -9448 -585 -7313 -26604 -16278 4416 5430 22337 45063 12049
27984 12049 -15884 20000 42632 31112 13544 10252 49832 44363 10890 8644 7319 -10468
27972 -10468 -6744 15978 32370 37540 22187 13885 22132 18776 13482 -2098 -28462 -34745 -43067
27959 -43067 -56855 -34097 -28520 -21510 -2944 -26626 -38468 -17982 14995 -4566 -13334 28774
27947 28774 51258 56337 17851 -13209 -19900 19724 23719 32665 -28425 -57334 -12377 10684
27935 10684 -4681 -4264 51291 66488 49942 44379 18361 1578 935 -5209 -10732 -11984 -13821
27922 -13821 -14347 -22199 -14314 17973 44358 14828 -14267 -23462 -39542 -27298 -14638 -41806 -50895
27909 -50895 -46504 -36608 -27512 -23942 -7218 3981 3029 -12804 -17736 8762 22396 4265 -22358
27896 -22358 -31803 -30959 -15768 19360 6246 -19118 -17970 3345 61709 80480 57249 44115
27884 44115 42622 66316 60304 6900 -12050 -10413 -12842 -28483 -32099 -8962 58984 63248 4143
27871 4143 -62568 -73378 -102381 -115788 -73761 -47382 -62398 -52106 -15848 -17164 -29124 -36668
27859 -36668 -6587 22486 26480 13424 -14415 -36383 9401 24205 30504 42162 32279 28014
27847 28014 3547 10007 19544 -5508 28181 40503 48523 56079 78549 87516 116678 72237 57023
27834 57023 70568 49745 51480 40578 26706 13024 27480 23594 4943 -34605 -67578 -54939
27822 -54939 -24945 13509 15995 4218 13663 2078 -33782 -55107 -29356 -24028 -16776 -1498
27810 -1498 16076 25131 62031 62272 14347 -5091 -29156 -50094 -51733 -40741 -24315 -19976 -31134
27797 -31134 -31628 -51803 -2998 60017 93095 82032 68089 55954 66824 48675 49278 20265
27785 20265 -18506 2831 32754 50123 67017 63671 52086 52606 66439 65419 53082 18298
27773 18298 8433 6089 3596 33792 29598 13124 13471 38248 7274 -10071 -12540 16173 22104
27760 22104 25651 -2224 864 -17411 -13471 -21036 -1688 9115 4855 5176 2202 3630 -25473
27747 -25473 -15271 9051 9211 -19542 -19805 4828 21097 10695 12605 13365 9159 4092 4277 5989
27733 5989 -638 -12149 -11842 -3471 -15369 -15352 -21481 -10491 13747 25315 -18902 -34491 30943
27720 30943 50453 -21938 -23767 -11693 -28592 -27492 -8645 3272 21547 35435 18067 -1529
27708 -1529 -14241 5547 -18682 -7500 19772 29014 46524 51319 21617 -2316 3680 20165
27696 20165 45739 36871 12659 52758 88840 96532 71970 71912 52766 63640 27776 -12996 15286
27683 15286 53659 43717 38888 41744 39972 26929 41829 22782 12015 12193 15113 10767 14046
27670 14046 8537 10024 -36938 -71729 -24913 9531 16690 9443 -23868 -7930 40918 51255
27658 51255 34527 58701 64829 23065 -2110 -22742 -44566 -33316 -7697 1159 -5021 -25049
27646 -25049 8491 33146 32001 55827 22141 -8782 -910 -7302 -25173 -15236 17236 2006
27634 2006 -70209 -68742 -27347 -12387 -29711 -36084 -22976 -8693 32501 68849 62302 44922
27622 44922 99833 98316 76996 57653 63206 84920 52774 37495 60015 92115 104169 96687
27610 96687 101571 102892 41490 33548 43181 1850 -53077 -35906 -38806 -44167 -48369 -32344 1540
27597 1540 5725 -5404 18190 57530 63487 24643 -16466 -3730 9217 14020 11507 17042 -3016
27584 -3016 6378 -9740 17191 1065 -36009 -17186 -5673 7574 14293 -11353 -18631 -2681
27572 -2681 4892 48386 62521 49490 52136 3113 -21915 -23449 -5271 29866 38560 40297 53034
27559 53034 49035 66048 80899 64417 48906 51031 13765 20445 38030 23023 14711 62550
27547 62550 65514 40199 36720 23803 1968 -11393 -10133 -7889 -29493 -42517 -4322 31204
27535 31204 7735 783 -10806 -31504 -56804 -66879 -44786 -33391 5287 7368 -6496 -3153
27523 -3153 533 -9568 -14463 39148 43653 -1035 -7754 -6351 -26712 -45457 -25977 -3497 19154
27510 19154 9677 13683 -17941 -34380 -34465 -16155 -11225 -52 32132 21848 34342 38704 56947
27497 56947 32930 18315 4840 1638 13805 -12824 -50713 -14426 -3650 9384 -4665 -22855
27485 -22855 -16365 3313 -18648 -7909 -4905 -17580 18637 17759 -14363 -20686 -4911 15878 22653
27472 22653 25821 32298 23395 29804 43828 53519 43124 9600 17393 14039 26027 33084 51973
27459 51973 61744 40361 -11339 -986 40381 69138 92075 64117 21510 23929 38946 46352
27447 46352 12091 24860 -4267 -32923 -7684 11648 9334 51642 72976 54286 26952 27851
27435 27851 25476 3494 -21265 -27227 -10533 9555 23431 38814 11209 9487 19849 75373
27423 75373 67849 35431 14861 45546 86616 91242 106978 71601 35949 37671 37433 23717 32293
27410 32293 60895 52988 22777 37340 53138 34026 20977 35598 33543 43975 26897 29728
27398 29728 27484 22268 78799 66358 69130 43288 20655 28263 62098 53260 11356 -27520 -33618
27385 -33618 -14586 -11484 -17290 15721 24909 -12037 -23386 -14423 5753 17707 38150 61847
27373 61847 57567 48717 43516 17524 38990 60215 33949 17803 44718 51832 16770 28838
27361 28838 -36305 -47453 -34372 -8824 8419 35967 12538 -37428 -59703 -36658 -24898 -34945
27349 -34945 -23718 -654 11726 -16566 -29573 19851 1133 -9276 -4720 -21724 8555 21451
27337 21451 24613 38651 63561 54124 21557 36445 13836 663 43964 34498 704 1669 -19760
27324 -19760 2325 18022 -21216 -43158 -2183 25845 39317 47883 37542 26832 -18559 -23173
27312 -23173 11926 58342 62205 69674 79862 51760 8106 44153 24306 23768 39452 50490
27300 50490 67075 84659 41684 2432 -9189 -3138 13624 -11135 17810 19414 18301 54088
27288 54088 61327 55031 74467 76756 59575 32996 17788 3297 -47565 -36336 -15814 25736
27276 25736 44582 7117 6203 11287 24667 26985 1003 3697 -2378 -14518 -5313 31214 12006
27263 12006 317 26840 34043 1782 -22279 525 -1656 -15622 -9401 -7474 -16410 -18303 725
27250 725 -6424 -14920 -8443 25617 66041 68803 61913 37702 5847 13336 -10970 -28934 35954
27237 35954 61924 88216 77157 46524 54490 62359 12624 -184 19763 68165 43230 35407
27225 35407 65902 102626 78655 13304 -24648 -15709 31785 28910 46779 62958 84194 70273
27213 70273 45193 24829 37182 55662 69015 6933 -10714 1583 39350 21153 10250 -17776
27201 -17776 -36601 -31311 -8215 17958 24196 8652 24852 42881 39758 33971 63873 79847
27189 79847 75827 78702 98287 77776 87005 91799 127169 156420 131932 105815 64080 58226 19080
27176 19080 12203 -15596 -58140 -69987 -71888 -66655 -53909 -41905 -23605 -22927 -25618 -4458 26603
27163 26603 20042 8532 4759 9767 39004 42200 17564 20382 29052 32952 43243 43306 40827 34251
27149 34251 24722 19671 25280 -11488 12441 49465 62255 56868 -7547 -5160 1580 16049 17103
27136 17103 7628 -3717 -18984 -2012 23623 44305 40050 1657 -5048 12352 9076 -30081
27124 -30081 -43653 6118 37912 8355 -4611 29411 -521 14152 62785 50949 23608 -17341
27112 -17341 -46284 -23726 14989 25983 66493 84859 56334 30105 13585 5885 1637 -12625
27100 -12625 -3961 16119 74859 95708 80939 85210 71485 104592 95400 44475 44358 57455 70878
27087 70878 91025 48926 -8299 2661 35590 34086 290 29415 69538 81320 65810 27386
27075 27386 -7597 -54445 -38281 -16081 9964 60665 69620 33022 3577 -53173 -56173 -23459
27063 -23459 -1681 -772 -37735 -32830 -659 3670 -20093 -25399 -34872 -37741 -25898 -50246 -42803
27050 -42803 -15793 -31799 -54926 -81983 -48712 -49326 -64716 -62821 -62372 -68615 -76091 -68552 -11955
27037 -11955 24962 51676 97280 67463 55635 38481 5689 -21862 -11870 -5489 -14880 31955
27025 31955 69450 51947 5176 -30025 -64332 -55347 -27573 -236 338 -12999 -49986 -20559
27013 -20559 12440 -4429 13135 55305 52899 39614 41582 40182 24092 -11557 -36027 -11964
27001 -11964 -17534 -40502 -29973 -7178 -7670 -18488 -32347 -8768 5715 41287 32326 9143
26989 9143 -1647 10046 -2690 3494 24088 27218 3703 -5869 20004 46986 40896 23194 39486
26976 39486 25047 27215 18035 -30436 -19186 -8020 -35486 -34206 -22539 262 43193 52585
26964 52585 49538 51380 51400 66355 53142 31667 15406 13233 16160 21147 28153 21067 -4335 38921
26950 38921 61678 11384 -46931 -50907 -25189 -11047 -34314 -24549 4174 8762 4286 6346 -3134
26937 -3134 -20273 -15756 -21290 -7834 -5025 3130 9601 635 32694 73262 87524 73955 34028
26924 34028 28423 21526 -24745 -22522 -19450 -40430 -40568 -31009 -62057 -79163 -38928 -18357 -2982
26911 -2982 -21266 -40859 13366 18696 63207 70862 83916 57092 26353 -14019 -50598 -38790
26899 -38790 -38993 -14236 -28861 -2506 45201 65677 20391 -24034 -5793 -19898 13698 46730
26887 46730 43803 19344 11869 12847 30655 41399 9749 -19957 -4957 13957 13100 -2993 -16544
26874 -16544 -24020 2951 21967 26031 17801 -4098 -7528 3914 8740 -4950 17124 4955 -5655
26861 -5655 -25158 -20015 -292 -7608 -40491 -27680 -16791 -29697 -31574 11082 27793 3511
26849 3511 22788 21725 931 3594 -12712 -21106 -28757 -19570 -22614 -38654 -21808 5976 17134
26836 17134 -5729 -16393 8385 -539 7843 12082 -12279 -8432 14963 7894 -5570 -7026 6420
26823 6420 -10598 18831 37636 42798 24872 43925 55187 56539 20131 28809 48845 4171
26811 4171 4433 729 -22067 10330 11819 12787 32848 86152 62111 63799 23271 10749 -1039
26798 -1039 -20547 5936 17353 13918 15394 9161 6325 -23460 -7729 13517 16680 -13160 28969
26785 28969 35203 42094 30085 756 -19040 -11894 -1736 29274 37946 29138 34913 30392 21104
26772 21104 9787 -10850 -42536 -28867 -10271 13873 51127 41385 3553 -424 33609 39856
26760 39856 41215 51962 35605 13920 -19127 -12206 5530 -23358 -38955 -5606 10468 9388
26748 9388 -14181 -7298 -24627 -34903 3667 17747 47084 46202 -959 -1221 -3264 37438 25780
26735 25780 30067 29387 20739 11597 18842 6803 9416 30532 54039 46092 24799 36811 67917
26722 67917 99357 62864 51094 40048 46435 51287 35137 61513 57716 39675 22763 21083
26710 21083 15607 -21668 -37888 -59002 -71684 -82391 -69222 -36051 4907 29753 -3018 21523
26698 21523 56853 33997 12236 1759 7213 20298 2996 4916 2578 35430 52117 26631
26686 26631 41678 84742 44668 3616 -24754 -77664 -58360 -35333 -16504 -52204 -50097 -16414
26674 -16414 -20572 -48238 -49462 -54150 -44048 -8706 14314 38092 37072 28100 35569 64478 66927
26661 66927 18250 955 37128 25646 -21624 -15536 -15504 -31888 -34030 9484 47156 59985 75762
26648 75762 19065 -30818 -49300 -49692 -47018 -66929 -83133 -57042 -20011 -8841 14198 5088
26636 5088 5130 -21402 -19581 -10877 21798 14306 9006 -2917 -2901 3389 15835 19095 37341 40623
26622 40623 8645 1468 -16209 -161 -20662 -742 21227 1372 516 -30472 -36391 -12058
26610 -12058 22871 56801 28854 -23321 -6942 3960 12492 41881 42340 38815 37586 43320 32093
26597 32093 14260 13493 10664 41627 48618 46668 43122 19893 20828 6176 -8999 -9102 7413 41848
26583 41848 54115 35991 3172 1089 -9938 -10039 -16662 -2777 22682 8804 21430 38674
26571 38674 35895 30157 30943 -8290 -14335 -11880 2583 14191 25100 34454 36264 26411 23034 28537
26557 28537 9606 13864 36257 35578 42409 22697 38425 40253 9769 8728 6259 16715 -785
26544 -785 -58497 -86613 -77179 -66432 -69765 -75525 -43809 -16215 7589 -23628 -19570 -37683 -26973
26531 -26973 -4915 10844 20167 69309 58152 14444 -6644 15918 -41561 -45753 -67651 -29111
26519 -29111 -12088 32125 23785 -1755 -3298 -19932 -7893 1256 9047 -13396 7453 -15022
26507 -15022 -3022 13195 -13513 -534 39031 51359 2458 -29589 -23238 -43784 -37056 -14108
26495 -14108 7221 -38598 -76276 -82040 -39603 -8785 -9101 -2722 -25630 -31132 -19818 -21510 -8205
26482 -8205 15165 44336 44017 26516 31835 51115 56767 33877 -2895 -39129 -27100 11479 52885
26469 52885 31869 3159 25971 86647 79005 53434 10620 10366 20910 41260 55210 46206
26457 46206 31841 17643 -3759 -21456 -51508 -36757 20354 16824 16495 26777 29885 13928
26445 13928 -9230 -12308 -9075 127 20850 44987 38018 35195 53559 39966 -486 -47525 -11732
26432 -11732 -24627 -32703 -42741 -32185 -1537 -14053 -15445 4696 21524 28026 29201 26915 10779
26419 10779 -5119 49326 49969 61928 68425 49773 38731 51924 59472 50506 33664 63592 43780
26406 43780 41247 6278 -22807 -16467 -13598 348 377 7824 12852 -4733 -11724 -29752 -8015
26393 -8015 9733 -18547 -43112 -10145 12291 10823 38328 43900 49543 11558 -3101 -2625 -5662
26380 -5662 4050 -15217 -43547 -32414 -18461 14513 48797 62388 62128 16124 -2726 2954 -959
26367 -959 23157 2508 -44459 -29871 -26397 -46908 -64882 -77122 -43050 -7711 17649 28753
26355 28753 63887 68473 7405 451 21376 50384 73071 74293 55813 31384 51330 32283
26343 32283 3586 -13030 -22113 -5568 16961 -17822 -9659 -6668 -27794 -23317 -7445 686 31472
26330 31472 -924 12278 65806 48205 10435 -870 -18554 -43383 -10049 12872 21532 31306
26318 31306 55884 55183 43471 67754 61892 22356 20461 41074 27065 24171 21928 30381 52082
26305 52082 70977 35825 31126 78112 75518 65573 60126 37415 23479 12558 8243 25240 79394
26292 79394 85333 67956 39842 45900 49749 37939 49367 41918 65986 55263 13648 -11855
26280 -11855 -50344 -50651 -31036 -21308 -4159 34712 27158 2131 4932 32738 44741 72598 58797
26267 58797 51107 41996 53873 59685 60278 102601 102697 42459 9871 21917 58056 48092 -14794
26254 -14794 -56957 -48190 -24988 -4964 3288 24236 9387 -27119 -37318 -21904 -14359 -36450
26242 -36450 -22598 -20387 -19753 -16242 -21607 -8235 -24670 -11129 -49938 -17340 14030 -13054 -54827
26229 -54827 -82069 -102726 -101637 -44358 -29892 -32471 -15266 34224 37152 -7796 -53612 -47978
26217 -47978 -38946 -17860 8355 14780 -29245 -43087 -28130 -36628 -1674 21933 -1716 -16993
26205 -16993 9108 30159 21342 13022 30739 44034 58535 46565 30760 7412 -6312 5227
26193 5227 1143 -35680 -36591 -50612 -30534 -18277 9147 29942 35554 41727 28360 15466 15978
26180 15978 44080 54303 9258 -18362 -30464 -14064 -37115 -43559 -1072 36966 53606 29576
26168 29576 25005 23881 7342 -26668 -15477 5358 8421 27871 32923 23179 43140 54764 42538
26155 42538 3149 -28700 16015 51743 38135 23759 27046 14955 4341 19030 7694 43825
26143 43825 36834 21213 11300 16869 3347 7148 1760 -1525 -35878 -74392 -77548 -18610 -29278
26130 -29278 -26946 -3259 47644 91563 84587 39943 -5094 -10653 15600 16859 -695 4480 13557
26117 13557 6205 -9452 3187 13278 20370 25271 9923 -7020 -17156 -36586 2345 37847
26105 37847 34679 4521 2218 23274 14217 -20079 -34075 -51672 -46952 -22294 -4095 -12538 -39502
26092 -39502 -70039 -55187 -61319 -47935 -47677 -28617 579 27752 38997 6720 -39230 -68212
26080 -68212 -52615 -57806 -29053 2153 6698 -30396 -23567 -22889 -65090 -92726 -89546 -112810 -84336
26067 -84336 -24717 -21053 -22849 -55204 -39367 -5439 28523 29297 10013 -3266 -4078 14242 16669
26054 16669 -14379 -25643 -29092 -33612 -27904 -4683 3329 39815 67293 42152 -3398 -16880
26042 -16880 -20690 -92494 -80933 -42605 -30677 -16556 -25757 -13489 -19227 -21056 -22084 -9517 15695
26029 15695 38267 51473 46427 14402 -14703 7365 26802 47963 21715 -19947 -19114 -22644
26017 -22644 9864 15342 23578 41528 82115 104577 90106 100821 100281 95372 48481 4928 -69333
26004 -69333 -72465 -44427 -58836 -58351 -61910 -52685 3267 46291 17727 4066 34545 47912 17571
25991 17571 -23299 -32699 -39217 -12 5129 10543 -8765 -16299 35752 34455 19750 17004 -4815
25978 -4815 23349 20694 13008 7134 -34158 -66901 -55010 -62866 -97923 -72913 -22535 61 -31414
25965 -31414 -64861 -64705 -34204 -32486 -18996 -17781 -5158 -35163 -23115 -26570 10561 31287 32729
25952 32729 44187 53343 65067 41507 7794 -45968 -60931 -39288 28224 57065 11989 -12165
25940 -12165 -22775 -21766 16230 28759 -11295 -2514 18967 17964 37629 78907 66033 46307
25928 46307 27371 66 10732 2702 -27914 -60561 -27993 25484 47672 40778 55054 36241
25916 36241 28251 40515 61258 25958 18957 46274 19615 14938 18223 -27298 -48351 -57754 -25745
25903 -25745 -14084 -9396 -18708 -53705 -37153 -19934 35096 56216 45398 6342 -8784 220
25891 220 35122 35313 13060 1996 -18961 -20219 19370 48157 81074 77189 61175 65244 28336
25878 28336 16279 18846 11833 4863 15527 33864 29855 28542 13629 612 33619 30948 21053
25865 21053 -11849 -7028 -1913 -8811 13648 29487 19941 42936 53857 29236 -25883 -25123 -2467
25852 -2467 2764 -19563 20830 1174 -835 9613 16931 24549 49514 28792 -12758 -42006 -32680
25839 -32680 -13805 -18079 10595 9030 -7576 -50763 -18672 12052 44911 12759 35315 18161
25827 18161 5726 -10265 -27725 -62359 -60981 -46635 -1155 53486 53403 31000 23649 -49960 -44570
25814 -44570 -30133 -2416 6151 24621 27278 -7339 6115 37068 32550 55372 81960 46212
25802 46212 9315 15489 32205 39630 16865 -10133 -5430 38997 63620 73552 47002 37420 56116
25789 56116 37585 6953 -6137 21510 25290 12509 39881 79369 54338 -13895 -2530 47377
25777 47377 46527 13605 5818 2445 -21283 -41251 -2903 18705 2858 28705 33089 43176 36522
25764 36522 7302 -7800 3974 26271 8042 -8179 -10978 13363 12286 -1274 -17450 -34018
25752 -34018 -25510 -10774 13611 -824 8407 -40257 -41726 -25702 -36096 -38120 -38763 -35174 -15537
25739 -15537 -12404 -19699 16609 54099 53671 -1547 -5891 11921 10701 -490 -21942 -18544 -14654
25726 -14654 5540 23308 56118 92718 126369 93525 97662 66285 43059 51733 48442 138
25714 138 -42458 -28857 -58906 -57193 -30637 -4800 -5731 -12473 -12794 11967 38341 43767 394
25701 394 -13828 -15716 -19304 -6563 -6830 -3480 12213 -11571 -13732 -3401 3557 18304 16125 -45363
25687 -45363 -58551 -45796 -30993 -28494 7047 38640 63443 45899 67525 57367 29907 576
25675 576 -27687 -25454 -27496 -3914 24186 9129 7949 4186 9584 -820 -5893 10937 28564
25662 28564 19833 -19117 -20700 -10486 -13682 -28961 -21624 1776 17453 27407 -1823 -44229 -32371
25649 -32371 -6940 -8400 11292 53597 42381 23022 8253 616 24908 18455 -9234 -39233
25637 -39233 -51651 -23221 -26432 -35340 -37326 6362 26532 -7891 -41842 -49762 -57590 -25180 -3867
25624 -3867 -10741 -22156 -46033 -31866 -19253 -12432 7092 3282 -2769 -14649 -9484 -28801 -32207
25611 -32207 -36076 -53253 -5209 12990 -8983 -3930 -26569 -2383 -17991 -66516 -27655 6656
25599 6656 35038 54012 -14725 -60444 -56347 -65691 -51766 -5735 3296 16775 30495 54861
25587 54861 92431 86927 33556 28306 67965 48529 8677 -16076 1857 -7701 -24880 -46636
25575 -46636 -47826 -20512 31013 87371 95184 103290 79229 19103 19738 30078 2179 -9577 -22727
25562 -22727 -16581 -37430 -26591 3758 27885 30295 11771 -8507 -8653 -11636 -5367 -992 -13370
25549 -13370 -15877 -58537 -73660 -43807 -12191 15090 41340 34153 71154 75613 49609 61047
25537 61047 55237 85075 72955 50888 13782 -1975 13912 6558 -10436 25714 19270 -11076
25525 -11076 -65436 -74268 -5513 38029 26107 -23825 -9853 -12253 23378 26459 33849 38145 20983
25512 20983 30813 44471 68506 85836 29482 13212 11443 -6466 -20486 -5396 -10527 -22970
25500 -22970 -24161 -3804 -11446 -19417 16752 25630 -3461 -9271 -3714 19038 25967 -22526 -18062
25487 -18062 2821 37667 65186 54331 50602 25946 39149 22145 -21881 -21191 -28890 -37347 -16782
25474 -16782 64883 60862 42773 34429 44034 21733 -23413 -5683 9057 1009 8751 5119 -9395
25461 -9395 9035 34357 17880 9416 12374 45951 56085 31684 29771 50079 56235 25677 -6077
25448 -6077 -16360 -4919 13127 21300 13380 13462 -14903 -18769 -13161 17279 13156 -41913 -48948 -21779
25434 -21779 5253 21084 37496 48299 29339 83824 91354 40816 4677 52475 63009 23617
25422 23617 -2888 -19279 -27021 -26220 -33331 -48743 -50809 -22098 -15199 -909 9880 -3736 12616
25409 12616 -20988 -16989 9483 45569 33142 13673 36284 57763 41689 5307 -16432 -5274
25397 -5274 27434 39293 31866 -8674 -28865 -61856 -42886 -44697 -29996 -9163 -37041 -35331
25385 -35331 -37692 11802 60872 35665 20007 10834 -23897 -22879 -24272 -26674 -12319 8831 170
25372 170 -15759 -20371 -4377 -17891 -30435 -15472 37301 25319 23977 37027 21891 8148
25360 8148 15379 21866 60598 39388 15256 26827 22922 -502 34503 25263 -5030 -21497 -61290
25347 -61290 -58765 -67678 -41073 -53472 -66206 -71890 -68633 -41592 -22758 -29917 -38646 -34054 -37752
25334 -37752 -26202 12101 32047 16803 -20734 -42187 -28904 13149 46103 26724 19055 48543
25322 48543 56646 25404 -8485 -11889 2045 13808 14510 35015 21539 -14930 -1410 10824
25310 10824 8920 33240 63129 45965 31849 8171 -4558 -14130 12936 23063 45280 48234
25298 48234 37125 -9663 -10390 7708 2178 26235 28126 -2817 -13779 -7148 -42508 -44915 6171
25285 6171 34177 9968 -49661 -72924 -75280 -58200 -30469 -26962 -14044 19496 21348 12925 19652
25272 19652 51855 9950 -49915 -90116 -63507 -38500 -24124 -9389 40609 77797 78735 60061
25260 60061 16813 12071 24455 15261 11345 46577 57162 68331 63562 61181 52625 27420 63530
25247 63530 68341 58402 42338 27469 -6379 -12693 7437 -11581 -37051 -37444 -29505 -46142 -28605
25234 -28605 12898 31151 38972 33180 36019 43619 -5724 -13738 4075 24123 13523 -11413 -21557
25221 -21557 -5624 6297 17470 7183 -37418 -22942 -13859 -17101 1576 24900 48195 6841
25209 6841 -38109 -63319 -41424 -7407 12606 28043 42396 41705 33112 -8484 -9688 -30917 -77935
25196 -77935 -54194 -16105 -3542 -3921 -25377 -21841 -29138 10438 53315 55608 46290 16783 10826
25183 10826 -6840 -19764 -4267 6946 -9007 -43182 -43397 -72536 -55532 -578 53209 59651
25171 59651 49808 53688 86723 79852 42138 -10591 3550 25397 5337 2803 -14003 -17748 -22165
25158 -22165 -58282 -27144 3825 15944 -4014 -2671 4094 -11638 -8530 -8318 -17296 -38542 -7696
25145 -7696 4323 -3205 -11827 13472 14699 10397 -22559 -17434 28771 54593 28987 -13706 -19364
25132 -19364 -29840 1038 19117 52033 12315 18095 17677 17366 5084 260 4869 -15062 -61634
25119 -61634 -53328 -30591 -12711 38137 61884 39871 16908 23339 41447 23737 23913 11592
25107 11592 5363 -1271 17225 -6340 -38594 -25873 -4536 -23850 -14355 -16361 -41679 -52589
25095 -52589 -45254 -66715 -25420 16338 7162 -13798 -24316 -38386 1131 19185 53774 29993
25083 29993 -7776 -25357 1594 6168 -9295 6802 4446 -6508 4044 10793 32080 25166
25071 25166 10778 -17576 -22963 -26153 -41496 -8663 56680 39194 7549 -25741 -37302 -56494
25059 -56494 -33581 10309 10204 8628 14390 -8681 5439 40094 19857 8251 31801 60182
25047 60182 75699 84175 89260 104120 50122 -24477 -53152 -64357 -89128 -17151 15258 9457
25035 9457 -47914 -15342 -935 -1622 22205 41185 46762 49198 50679 22000 15727 -26379 -46782
25022 -46782 -36454 -60769 -19149 27658 6685 -9612 15370 30776 53022 82032 102181 97870
25010 97870 67789 46809 30221 85515 124763 109147 63121 -12498 -55855 -58054 -52696 -76173
24998 -76173 -85894 -59555 -41795 -35856 -11656 -5166 -4927 8124 -10835 -22010 -13392 9784 50328
24985 50328 24832 4065 611 -20352 -36203 -45015 -41083 14046 9074 54682 49203 12256 -15709
24972 -15709 -23704 -31794 -64801 -81346 -67745 -35280 20438 27108 -391 -1339 17849 28066 10566
24959 10566 12597 8121 10927 12025 -21349 -32397 -44396 -52453 -42194 -78467 -21814 19406 -15056
24946 -15056 -48322 -67296 -73014 -71489 -50723 -6654 29401 40453 45894 60085 59235 63124 45089
24933 45089 46140 36439 11509 9469 -19651 -4574 17487 -5453 -14617 -28613 -22289 3243 -20927
24920 -20927 -36320 716 12344 5983 22232 16219 12192 3349 -20028 6222 48365 52409 30990
24907 30990 43006 5543 -38865 -57826 -83487 -96704 -70671 -64561 -72280 -45649 -19484 -1310
24895 -1310 25294 33338 -16678 -34991 -10014 41197 46416 8075 17767 22455 -10785 -19819 -19610
24882 -19610 -35715 -33379 -110 -13166 7142 -11342 -27011 -1529 -24748 -1801 27324 8787
24870 8787 -19345 -45779 -54957 -51666 -352 37972 60225 23280 -2064 35754 19684 -19027
24858 -19027 -5313 2267 -24505 -48143 -60583 -30101 10892 20103 23087 43316 21528 19704
24846 19704 -16202 -26907 -23791 -21590 -20752 820 42355 68417 41053 41119 53272 56441 45111
24833 45111 -34923 -67944 -64042 -33049 -29086 -48429 -10852 -23605 -46235 -14459 22710 11639
24821 11639 7942 3261 8490 32565 50559 77790 24191 -16253 -7342 -5817 -12797 -15274 -22328
24808 -22328 14709 32294 21615 4381 21286 9788 1870 -12940 -38711 -48864 -43732 -4888
24796 -4888 9218 24850 52019 90936 112075 59843 39467 21823 9869 -24421 -60871 -64436
24784 -64436 -10066 39899 5325 -27461 -23358 6328 23506 2575 4900 -26857 -69781 -58146
24772 -58146 -28745 -5949 -10538 208 18355 -16129 -9835 -16821 -21516 -16949 -10740 -4628 -10116
24759 -10116 -48670 -52416 -58932 -30634 10779 37020 17869 4998 -5347 -8635 -33906 -62059
24747 -62059 -57595 15428 27727 18088 7378 -6938 -3091 20720 -10700 -46659 -67253 -71764
24735 -71764 -51633 -38158 -16285 11433 43621 52249 49170 30462 -7101 -23001 -11141 27201
24723 27201 29629 13971 -1599 -51115 -23510 -6864 1052 10171 -13194 -28003 16185 42107
24711 42107 28853 -21813 -2937 24524 55267 37570 2129 -687 1172 19485 13747 12800 -8098
24698 -8098 -13364 7749 28631 12017 -14275 8210 55380 51966 58872 29933 13556 -19463
24686 -19463 -27 -4256 10125 -3108 -42283 -54652 -4935 11211 2592 -56860 -42597 -2049
24674 -2049 5183 13065 30392 -16779 -61985 -45931 -33153 -40571 -3161 -16050 -63910 -54157 -33698
24661 -33698 -35366 -53544 -54537 -83184 -52859 -3062 -725 -6043 -2742 7962 29393 15541 -20511
24648 -20511 -4787 22645 -10431 -47045 -38880 3125 -15795 -284 -3353 492 24608 19732
24636 19732 24576 4833 9993 41068 49074 47504 22537 34848 34470 -12584 -36332 -9965 -17607
24623 -17607 -13661 -45045 -76536 -68585 -34432 -29530 -91438 -108021 -60941 -5419 -26499 -54931
24611 -54931 -29659 -55105 -69988 -22513 65474 45617 9998 -13432 -35437 -16316 1760 -5518
24599 -5518 -35621 -27269 -25587 -30275 -16927 17694 29486 45256 20724 30928 51382 55873 22674
24586 22674 13637 7571 25136 64034 86179 68022 56616 43156 -4258 -33275 -1572 48718
24574 48718 50639 11984 -9007 1285 32123 36004 10452 -21368 -43773 -37069 4297 31904
24562 31904 18900 40715 38124 37498 38704 46278 34663 43962 59850 53677 14497 -1941 26828
24549 26828 29596 67252 74154 50875 20492 35094 69965 40311 29762 26650 20726 27794 19112
24536 19112 2633 -9527 7210 -1433 29286 20258 27353 30599 38168 41428 33810 22284 8652
24523 8652 1121 -5153 -17473 -1129 32897 37148 -7123 -10128 -19831 -38986 -10802 17769 12327
24510 12327 163 6863 -19340 -3888 -43643 -46324 13518 29582 29487 20991 -487 21703 27410
24497 27410 28664 26465 23678 77901 100187 57388 33558 10885 10132 -6243 18967 21488 -17688
24484 -17688 6445 22151 -382 17010 10548 -10657 -24192 -24104 -14849 20995 15147 2803 24201
24471 24201 55391 47179 26185 23824 33985 75987 60315 24247 30730 37295 -3643 -31988
24459 -31988 -21325 -24879 -33145 -14061 -3266 -31396 -43997 22606 62908 56045 62300 52266
24447 52266 51754 56216 50599 20546 -18106 9508 75065 94290 64458 50555 96983 61116
24435 61116 42379 42076 51643 56365 -3604 12712 22826 11434 13592 4423 13407 26398 22864
24422 22864 -7292 7960 -29772 -33639 -37502 -33752 -27027 -22224 -12862 -28517 -19197 -44690 -11180
24409 -11180 13617 23198 7260 25881 29581 21517 18566 12344 -2903 20325 50442 20983 4643
24396 4643 -10587 13656 48999 56972 71553 77571 63007 65794 19626 8967 39897 42764 59270
24383 59270 78785 48686 30187 -11681 -76290 -80638 -58701 -64138 -64968 -54902 -52703 -41141 -30442
24370 -30442 -13492 -7285 -7372 18934 5065 14894 12749 16907 8017 24354 9470 50413 68795
24357 68795 61872 11428 4915 8572 15283 34521 -2191 -30572 -51548 -31889 -48982 -13709
24345 -13709 13744 17342 19891 5064 4964 6697 21984 7525 -2805 5331 18102 35605 55788
24332 55788 27370 32364 37007 44121 18790 16230 10544 98 1020 1930 10815 -36627 -56705 -55080
24318 -55080 -29453 4293 7753 -9043 4061 -4824 3846 10999 2898 -2632 16580 13577 -3294
24305 -3294 -23327 -39355 -42270 -36719 -66070 -57049 -50279 -42071 711 32513 16449 23950 38689
24292 38689 6981 -9191 7950 -14688 -26153 4476 48740 48032 19932 -3530 -2510 -5990
24280 -5990 -24190 -42901 -72455 -75715 -64126 -32883 8441 34015 37743 5093 36840 46312
24268 46312 30106 25565 5328 21601 20303 -7251 -15559 8257 49365 55237 33987 7829
24256 7829 2276 -13404 -28939 -46597 -55806 -47865 -29203 -14125 -6302 12200 1275 28696 20238
24243 20238 -2701 -3228 10709 7066 -3086 -16841 -38820 -48295 -26038 -23478 -36569 -36703 -24227
24230 -24227 -26136 24006 41374 21138 -32362 -53865 -48070 -38163 -10992 -19328 -14715 -17574 -35973
24217 -35973 -65232 -50197 -25582 52081 73985 83546 60807 9808 4938 20453 15187 12468
24205 12468 -22911 -35708 -45652 -56136 -48861 -27052 -11839 -38856 -56803 -45928 -37040 -27508
24193 -27508 -4996 -16070 18405 21573 20796 31949 31875 30948 29140 58022 59486 49979 42867 39297
24179 39297 41807 24047 16636 -24932 -12465 -26451 -2825 3187 2588 2023 31899 60836 86986
24166 86986 69582 35237 -1085 2900 24951 12544 -4739 26097 8661 667 -7846 -48135
24154 -48135 -97050 -103151 -100792 -79218 -43736 -48540 -23838 -18271 -35292 -47978 -47553 -4589 -186
24141 -186 -19046 -43845 -62570 -44591 -34554 -18222 6292 13572 -8116 -12485 -24886 -19576 -12890
24128 -12890 -24658 -33905 -20309 -42776 -21724 7200 12490 -19406 -51079 -27323 -2508 -5526
24116 -5526 5605 -7884 -11149 53657 67326 19868 10502 8111 7130 -3728 20563 41507 62214
24103 62214 77884 71431 38372 27921 13941 4518 7623 -6942 30586 57197 24510 -10744
24091 -10744 -4634 21053 12035 -16737 -47363 6902 36428 57018 49935 27333 10580 10045 11721
24078 11721 26170 5725 -29360 -30033 -5600 6580 23063 1424 53 4085 -21651 -27113 -1436
24065 -1436 20214 23149 17318 11201 9837 -46785 -104572 -80560 -53329 -59595 -45335 -39884 -11576
24052 -11576 -7624 17260 28299 13258 2404 -3923 -2288 17254 54527 68575 64970 44301
24040 44301 7594 -3489 -24394 -43272 -27089 -1696 6375 -1613 -25084 -39124 -26728 3994
24028 3994 -11942 11518 47649 33857 -3303 14402 14854 -20555 -37272 13000 61497 44553
24016 44553 37275 38757 -8975 -38898 -45927 -47015 -44405 -15383 8367 28549 25447 -2088 -1326
24003 -1326 -12901 250 1130 -13642 -58011 -53469 -51986 -29835 -37609 -53045 -39368 18030 8204
23990 8204 -9063 7653 -17979 -34038 -21531 19646 40940 22944 15559 20346 13436 19955 6763
23977 6763 -2973 -14582 -7865 4380 11931 -19223 -12873 10631 -26843 -16969 5793 11904 17898
23964 17898 12144 -12035 -45632 -67850 -33392 5163 -4412 -20996 -19083 -30128 -17604 17872
23952 17872 10334 -20699 -57568 -79942 -91134 -58798 -6825 18719 6607 26259 51788 28549
23940 28549 46823 32405 10605 5825 28673 27852 53395 6221 -45781 -48381 -75758 -80784 -40802
23927 -40802 -32638 -25614 -10975 -22577 -28686 -31003 -36513 -59149 -51829 -11749 -7458 442 1528
23914 1528 30936 10818 -6732 -9880 6476 -42283 -35006 -5257 30558 33407 25063 7581 4902
23901 4902 -2915 -34389 -58094 -63831 -27272 -7139 1330 42706 87042 75635 38189 -8125
23889 -8125 -21647 -14640 12409 21537 12978 26482 39093 33568 61981 57569 47960 66922 46944
23876 46944 23083 16173 8922 6659 27679 34775 16302 -32220 -67124 -35819 12815 3022 -43063
23863 -43063 -48386 -16987 743 -5641 -6782 -29197 -33545 -3045 -24980 -24349 5663 4979 -24447
23850 -24447 -45810 -37793 -43381 -70937 -76570 -17119 -16364 10016 40901 16719 -27118 -25984 -11481
23837 -11481 27025 20007 -27213 -43604 -27230 -12245 17277 19119 6626 38430 40985 57377
23825 57377 16644 -1152 9398 8415 -39076 -57595 -28201 -21295 -33914 -31090 -29667 -41420 -80436
23812 -80436 -50182 -14798 -13863 -21219 -38260 -37363 -33907 -17328 -10280 -20077 -2412 -167 117 3063
23798 3063 -10844 -18900 -13773 -51278 -64610 -45450 -11427 -5179 -7027 -36467 -29832 -27641 -7909
23785 -7909 1507 8491 12849 20466 -4969 -36226 -44580 -45142 -25609 23924 33078 67338 69705 38322
23771 38322 -7494 -28094 -29796 -28216 -51589 -46558 -49544 -14292 12071 2574 -17564 -33809 -33825
23758 -33825 -32018 -28305 -15412 21572 12814 -849 -19897 -39508 -28694 2361 5068 31827
23746 31827 30458 30605 25711 5855 -5274 -4044 -20051 -28273 -24474 -28876 -42863 -55150 -26896
23733 -26896 2384 -43808 -45946 -52261 -70123 -40042 11415 26663 48091 78712 39463 2588
23721 2588 29382 30607 2911 -1875 -18253 -10853 42533 -13344 -29344 -18770 5820 2405 -29347
23708 -29347 -51555 -19526 21206 27290 15281 17177 17697 27154 -5594 -38318 -28365 -35679 -37015
23695 -37015 -14093 28199 12365 -9811 -28939 -41356 -60158 -61001 -48174 -18738 -15570 -29545
23683 -29545 -20737 -14105 19435 48813 35634 -33308 -24585 -7305 3137 38271 64854 40729
23671 40729 21391 9403 5425 12630 33140 5390 -16954 -35069 -28180 -64397 -66263 -14706
23659 -14706 9610 -2486 5812 -13684 1102 -27485 -18123 25053 54082 23712 -27063 -56422
23647 -56422 -36985 -25250 -11047 -18754 -44226 -25484 -30131 -48262 -63172 -53608 -53815 -38903 -29770
23634 -29770 -44622 -89690 -92058 -97674 -66745 -46363 -33900 -3827 -2265 -38987 -33400 -15537
23622 -15537 -43699 -67397 -42375 -22745 -6017 -13025 -38620 -49480 -40871 -15285 -9206 -19383
23610 -19383 -3761 -7253 -1641 27067 45037 50924 44417 78598 63647 22270 -15973 -1598
23598 -1598 18119 7530 -42347 -49382 -22935 -24810 -4171 -2323 -4845 28433 35205 37063 29374
23585 29374 26890 24709 18522 12305 -7469 -18039 -39600 -14654 18319 23202 8908 34274 46445
23572 46445 54567 -5980 -41565 -60859 -55942 -29426 -20106 9867 44711 -13398 -45915 -40311
23560 -40311 -50162 -59142 -35089 -39966 -28062 -18708 -20712 24238 29585 38432 21846 4668 -22722
23547 -22722 -6421 21142 -271 12047 40249 87104 113150 62064 -12527 -43654 -42816 -24758
23535 -24758 28519 16416 -10585 -13715 -9736 -3440 -4295 15649 11660 -6791 50466 84036 83324
23522 83324 67225 52476 20829 16678 31041 46697 34829 -4272 -6161 338 -757 17683
23510 17683 -1932 20646 46828 19546 -10938 -9532 -36064 -39914 -69131 -85717 -53953 -47328
23498 -47328 -38420 -49316 -56134 -23420 20102 -41741 -52301 -44877 -7652 -13553 -8901 -61762 -84049
23485 -84049 -84974 -98611 -94345 -98198 -83714 -41643 -31770 -57088 -76313 -81695 -59969 -1369 21302
23472 21302 -9024 -20455 -4583 -17111 -20746 -22917 -55043 -34745 -30682 -57378 -56606 -26460 -42772
23459 -42772 -49393 -29394 -2055 17377 16338 -46394 -59153 -44656 -71869 -79865 -78726 -70146 -31573
23446 -31573 -3789 -42777 -65448 -56427 -18719 -12434 -25733 -23576 -49883 -100110 -88430 -70916
23434 -70916 -44091 -31713 -53527 -30277 -30988 13448 31601 156 -43507 -67868 -47137 7432
23422 7432 7554 -4521 20508 32831 18210 64601 88149 69928 25213 -25052 -9256 8989
23410 8989 10501 47759 34998 -3325 14546 40892 42351 19215 37557 46531 52241 20710 -14857
23397 -14857 -14621 -10297 27946 12858 -9174 -37411 -29781 6761 6259 -1131 -5084 -1639 -2807 2489
23383 2489 -8192 -56224 -39727 4078 -9370 7678 23566 2615 13184 21137 15673 5842
23371 5842 -39024 -57662 -45479 -10879 -3668 24885 46348 5151 -32818 -39541 -21072 -7876
23359 -7876 -13855 -11679 -33883 -51663 -65605 -38645 -38813 -36611 -22136 16405 9631 -11875 -11209
23346 -11209 -31151 -55609 -59855 -55129 -44772 -38788 -16178 -13719 -27656 -31282 -56441 -63386 -35307
23333 -35307 -20048 -18110 -36116 -78992 -107314 -99895 -64727 -570 36658 26873 24753 16129 -35787
23320 -35787 -47253 -19923 -39146 -45125 -11134 -24493 -43291 -24363 -9602 -45684 -43460 -43138
23308 -43138 -20930 -23993 -39065 -51753 -33748 -25811 1509 5816 -789 19117 21790 51294 50154
23295 50154 67117 18722 -7411 29522 15411 -18987 -14301 24081 33614 15016 13624 31198
23283 31198 22088 21962 -7761 -8896 -9156 -23694 -56916 -43878 -15663 -11743 -48443 -6709 36296
23270 36296 45059 29208 41662 75534 46089 -120 -13562 -20134 -34713 3426 -15177 -27401
23258 -27401 -36580 -26616 3914 21662 18573 25301 49142 48945 57996 -4399 4753 39446 31216
23245 31216 28672 4291 5318 -31428 -49008 -32598 -30893 -32957 -762 1910 -29444 -29894 -19397
23232 -19397 -4129 -19571 -12083 -12496 -9104 -2485 46338 60356 36079 28489 52383 36804 6474
23219 6474 11319 73428 77992 54063 19568 10631 18900 7430 -11905 -21218 -32069 31633 -94
23206 -94 -4824 -8836 -24173 -11733 -3467 17183 -9084 -28091 -28801 -16185 -47026 -39416 -359
23193 -359 14154 25086 -4987 -52202 -17989 -10378 -23202 -29230 -32041 -25890 -35703 -22487 -37940
23180 -37940 -47346 -64517 -70402 -67071 -71799 -39600 -13404 -20116 -40694 -16314 44037 44469 56135
23167 56135 54289 25894 -6361 -44870 -44341 -33802 9074 14131 -20490 -14159 31379 49782 46908
23154 46908 2786 -34098 -10435 14827 21643 8995 10689 29764 14623 1858 -3595 -19019
23142 -19019 -14818 -2121 -4634 -15304 -8182 -3350 -21897 3020 21023 -18672 -14531 -1274 23339
23129 23339 9422 18269 38112 13587 -46969 -61209 -67782 -37924 -42261 -56075 -44844 -59234
23117 -59234 -50160 -32313 -8643 -49727 -91786 -50670 6988 61102 61558 50265 23962 2221
23105 2221 13127 33080 -13411 -35856 -30491 -12146 -27474 -70513 -81582 -79775 -45025 287
23093 287 72197 80840 53472 49501 39585 1829 -27262 -46837 -65871 -92167 -62255 -3072 6732
23080 6732 -34550 -20268 -18333 -30339 -8481 -24026 -20152 10419 -3559 -15918 -6818 4640
23068 4640 -22594 -45962 -30988 -37526 -32204 -8947 -10209 -5363 -9859 -10805 -6316 -6634 1655 -17471
23054 -17471 -10637 32253 50154 24601 -1540 -6897 -20767 -2329 15060 -2017 -16152 -41368
23042 -41368 -64833 -76242 -60402 -62486 -27977 -2473 -27875 -22270 -10370 -23293 -15460 -4892
23030 -4892 -17314 -2625 -20527 -52439 -58716 -39463 -51097 -65368 -42042 -27902 -45062 -37935
23018 -37935 4777 24500 4641 -17112 -22776 -1266 11749 6008 4143 -5240 3939 15840 20529
23005 20529 35599 19386 -7355 -24220 -47114 -36282 -33649 -14510 -793 -11943 -55821 -37204
22993 -37204 -56303 -57075 -46262 -36761 -26292 -55545 -59576 -7825 15953 -255 -12189 -37589
22981 -37589 -25116 5024 39726 33907 938 -35664 -53082 -40920 8306 17019 17908 747
22969 747 -23505 -36014 -11968 1160 -39007 -98928 -119881 -72956 -62034 -54247 -26305 -1077
22957 -1077 -4171 8706 14126 -3891 10927 16934 5977 -42265 -43475 -63394 -55247 -39381 -34983
22944 -34983 12851 30955 28807 45141 23562 15841 23379 36676 8857 -39148 -45428 -51224 -30230
22931 -30230 -4995 -32348 -53678 -45821 -22398 -31355 -42474 -46820 -25665 -19943 -8315 935 30404
22918 30404 11284 -17944 -57031 -49390 -30970 -25601 -19944 -878 -6388 -33652 -20942 36054
22906 36054 28983 6279 -43385 -83156 -71125 -44302 -15404 2632 31220 63071 61932 48227
22894 48227 30933 14095 533 -1862 -13601 -23805 -34774 15981 20761 180 -3531 -12207
22882 -12207 -35747 -26383 19765 9239 -46725 -61920 -31250 -3242 -2086 22551 11955 29045
22870 29045 8539 7368 13667 8205 26953 49473 18842 -23225 12603 26061 35888 37512 47032
22857 47032 -8714 -18666 -8846 -13552 -6531 -16781 -9410 -21975 -46717 1911 67055 57378 42941
22844 42941 49876 73615 52550 11933 1311 -9540 -375 -9373 -54589 -53606 -30785 5272 14250
22831 14250 -3103 -14724 -537 20288 25954 23490 234 2490 -1225 -26407 -39549 -30995 -5411
22818 -5411 -6840 -7360 -4642 20963 19707 -52194 -65234 -28352 -23497 -14784 -27353 -9718 13078
22805 13078 25954 46767 14413 -24760 -30749 -12477 9999 58027 58741 54209 30725 6913
22793 6913 4093 -11280 -45375 -58116 -70423 -54155 -39928 -36937 3417 25672 35728 26625
22781 26625 53838 25732 34841 11873 -20690 -43676 -27314 -30266 -39441 -29143 -28308 6753 24534
22768 24534 42481 52512 29947 9867 7754 49997 30506 55677 74964 94407 80725 93785
22756 93785 71893 -6966 -9542 29748 55044 13580 -14262 -30020 -28979 -13772 -30010 -43276
22744 -43276 -49289 -48807 -3472 15255 -7315 -11550 1839 30599 15373 -7060 7538 6902 -4192
22731 -4192 2731 -382 -19085 -36632 -73889 -55603 1191 37493 57580 35522 18042 -349
22719 -349 6082 -4827 -31024 -46745 -20026 11019 -3336 -16798 -2881 27625 3868 4114 9231
22706 9231 15011 4011 -23118 -40074 -38859 -50049 -21987 -29847 -11680 7329 -6242 -12567 24964
22693 24964 7473 -7599 -15860 12763 9309 4391 951 -22937 -10179 1203 13592 11019 10582
22680 10582 8594 -33106 -9767 8723 33786 27440 4377 32066 24883 1589 -27469 -40542
22668 -40542 -54078 -95382 -103104 -85977 -83517 -102522 -99260 -131553 -104225 -44067 -8543 16886
22656 16886 51189 23904 -5464 -15690 -793 -7817 10668 -8805 -19758 -4659 21659 54987
22644 54987 27131 -243 12665 30346 6976 -6105 2654 5138 24324 4423 -10542 -15462
22632 -15462 4011 14237 8796 2759 -1277 39504 45896 51682 36554 717 4528 13242 39958
22619 39958 -6612 -41969 -12718 16373 49316 12403 28603 47320 17092 2700 24186 -27428
22607 -27428 -56648 -53454 -2290 -12525 -70732 -80283 -47475 -62812 -64119 -38605 -44954 -49270 -53083
22594 -53083 -40905 -21168 -28851 -15992 21444 24077 -9607 16542 46741 42944 -3680 -58826
22582 -58826 -54239 -86243 -89436 -76741 -44506 -25363 -36358 -31913 -34452 -34768 -28009 -16042 -37637
22569 -37637 -57599 -57720 -53528 -34423 -28746 -32242 -11215 19329 34271 -10466 -53281 -42628 -39071
22556 -39071 -35446 -16034 -18030 -42455 -59574 -68889 -65125 -44156 3277 61986 131116 74136
22544 74136 42339 37605 31291 43171 65431 58318 6649 -23220 -14308 -1076 -5576 -13421 -16111
22531 -16111 9925 15989 -16854 -25240 -23717 27209 56658 22623 -28067 -46552 -46899 -36405 -8419
22518 -8419 2010 10899 3749 -32852 -9495 -10566 -40398 -30599 -34109 -43266 -41712 -24410 -15254
22505 -15254 7667 -62517 -107855 -107959 -73292 -63301 -68167 -19224 4937 4425 -9758 -26922 -28689
22492 -28689 -35759 -15098 -38925 -34540 -80962 -114313 -106310 -125628 -117475 -74552 -49637 -13747
22480 -13747 -5921 -13331 -34985 -54078 -45450 -11023 20597 16856 -29273 -74965 -72904 -57050 -17611
22467 -17611 -25518 -25686 -42633 -72745 -76783 -59851 -35763 -4662 -6419 -35746 -61767 -53508 -3119
22454 -3119 -7098 -7838 9597 377 110 4735 -8736 -16684 -20504 -34387 -85678 -92632 -26170 -33143
22440 -33143 -27978 -520 12575 20109 -1083 -2608 1159 1867 -684 -25065 -14053 6404 10572
22427 10572 -2825 8190 890 -2895 -5813 -18615 -8471 22057 34426 28688 2235 -10231
22415 -10231 -7842 -40204 -68394 -53422 -48136 -51620 -74797 -77346 -80250 -36986 -21388 1605 -4929
22402 -4929 -30907 -17838 -11553 -396 -69793 -97456 -125739 -86541 -75833 -53854 -50593 -71565
22390 -71565 -118077 -43151 -24373 -23981 -4300 25187 25328 -30075 -45998 -46463 -35040 -13528 14294
22377 14294 9033 -15800 -26364 -28962 -69239 -74715 -87825 -53663 -36477 -25466 -34688 -55204
22365 -55204 -70640 -35342 -14539 11093 52040 66485 36646 29595 31238 26896 24971 20113 323
22352 323 -6754 -4226 -38985 -57766 -31613 -2506 -22236 -29404 -47501 -82016 -90234 -61076 -2359
22339 -2359 2043 -768 40001 74606 39218 -1884 15272 62268 52203 31686 -502 -28111
22327 -28111 -18846 15767 59851 53862 -20513 -53998 -20287 -31546 -37474 910 25985 15445
22315 15445 21125 20819 17363 14468 -915 -43095 -52379 -29940 -20461 6092 -19882 -53587 -14814
22302 -14814 14797 -9822 -23664 -12471 26053 56935 57589 28708 -6701 27122 44933 35634
22290 35634 31028 25946 -4658 -4405 1111 -7596 -16434 -34708 -36261 -15263 -8276 -22767 -26356 7233
22276 7233 19696 27779 1767 -15417 14515 16422 -23 -8190 -1393 -13522 -16878 -47504 -10402
22263 -10402 14035 59209 73443 56696 63756 47711 73864 50461 32054 53010 31797 17426
22251 17426 20446 17617 14818 -4359 15245 9121 13925 14543 19050 -8920 -55909 -96474 -74411
22238 -74411 -48675 -33115 -28170 -51693 -58666 -33433 -19727 -21319 -33667 -37364 -4825 -13718 -25377
22225 -25377 -12322 -4367 2916 19724 57208 38938 12601 -3596 -9115 13023 -7050 -11924
22213 -11924 -15446 -44387 -20395 32628 23384 -4452 -20585 2880 -10114 -23513 -12802 2827
22201 2827 5084 29804 -17533 -35052 -40766 -10782 -14373 -35863 -41121 -47366 -70690 -25402 -22677
22188 -22677 -20044 18444 42641 56028 38398 13817 5763 31483 19003 2010 -19869 -15937
22176 -15937 -39373 -44200 -37062 -25763 -34246 -42612 -29428 -61447 -76750 -60138 -32514 -40224 -78473
22163 -78473 -55478 -67671 -70592 -42854 -46544 -41925 -71586 -66675 -44854 -23809 -4641 3659 -22293
22150 -22293 -55848 -39172 5828 22355 7108 -33621 -17637 26048 9525 -36219 -48924 -32306
22138 -32306 7960 38727 19500 -22791 -20296 4565 -15455 -17004 -21934 -33268 -49369 -25751
22126 -25751 -49112 -83349 -41968 -2131 -21926 -10387 22089 7873 -24863 -16915 34769 54227
22114 54227 50645 76684 61356 29266 16049 -25924 -38058 -48549 -52195 -76715 -27777 9172
22102 9172 20055 15373 -5198 -18044 -31171 -18631 -6415 770 34247 35307 43907 20511 56922
22089 56922 77300 58530 33153 23390 6605 -28223 -55862 -49540 -34896 -2105 23756 41597
22077 41597 7170 26086 960 42080 65922 70655 17621 -69444 -26738 -10324 -61240 -74527
22065 -74527 -39775 8154 1321 8781 -20512 -33730 -17964 -1712 16230 -924 -16167 -15005
22053 -15005 27508 20780 -6324 -23595 -26201 -543 14346 -11262 -34031 -10693 9234 -4802
22041 -4802 -23624 -10500 1497 -14730 -8310 -489 3742 -26244 -30231 -43811 -39456 -24507 -10518
22028 -10518 -19231 -45014 -64536 -42633 -20806 -7206 -45056 -60314 -48878 -38633 -53843 -42808
22016 -42808 -12663 -15845 -1567 28151 41818 12589 -47301 -37294 -32835 -9620 21674 26145
22004 26145 -2878 723 -16071 -4990 -12457 15356 27470 -5947 -44243 -40156 10309 33754
21992 33754 16465 28457 39965 50330 60535 46244 12835 14826 26272 35924 7423 -24868
21980 -24868 -28015 -17903 -40137 -27819 -16326 -16055 -37913 -11320 14054 -12649 -16250 -6001
21968 -6001 897 -32384 -29053 9763 11298 24771 61160 80709 73186 26204 5759 62722 66012
21955 66012 -6576 -64261 -63291 -45453 -25053 3457 -14124 -45451 -22212 7950 -14329 -29556
21943 -29556 -37573 -41778 -35184 -10142 3945 23577 12453 6270 -9590 6167 7954 -10903 -36810
21930 -36810 -14017 -31343 -32744 -33128 -57771 -52905 -47262 -43977 -34724 -11340 13952 -17069 -37240
21917 -37240 -16556 -57540 -67147 -4952 -4010 -8049 1264 4369 27125 -15352 -65443 -51714 -30598
21904 -30598 -49321 -41565 -23865 -11490 20483 16185 27564 53490 31559 -9554 -44012 -41818
21892 -41818 -32846 -11439 -1504 12254 -26670 -91576 -112091 -53165 -15668 -14924 -47274 -56629 -38613
21879 -38613 -68997 -81026 -78529 -62700 -45487 -21654 40654 61370 23205 -37838 -55716 -40341
21867 -40341 -32183 -26147 -3738 -3818 7243 -13969 -17467 16431 3078 -13855 -40370 -32516 -35111
21854 -35111 5938 23204 26971 14064 14537 48308 23093 -37726 -51047 -63177 -66335 -34228
21842 -34228 -17915 6443 -6836 -7799 2364 7974 -10664 -23194 -23932 -17851 -23686 -43829 -37173
21829 -37173 -9804 11342 17453 29121 606 -5886 21204 5034 -14203 -17532 17539 7856
21817 7856 -5211 -10292 -17280 -33302 -5876 -3772 12581 13981 -11005 -6581 29479 37935 20096
21804 20096 5550 -555 3646 -19852 -42703 -11208 17637 2651 14647 33871 18299 10178
21792 10178 -20397 -14766 -27277 -49769 -58218 -37857 -29915 -19585 10162 4975 -37834 -78052
21780 -78052 -95281 -33391 -21026 10227 -17278 -22615 -39054 -28695 -33217 -16123 -17517 -22664
21768 -22664 -7884 17656 -3777 -44004 -75799 -70761 -30452 -13194 -1823 -8172 -55151 -75595
21756 -75595 -103621 -56584 -1457 21470 -9996 -6606 -3419 -1443 348 -45940 -63756 -26607
21744 -26607 15525 18786 10456 13489 4370 358 -29163 -16912 -27263 -19386 -38701 -34727 -30563
21731 -30563 -44698 -89783 -74415 -5410 -21478 -60553 -58870 -72170 -79012 -79638 -27354 40228
21719 40228 36964 -9927 1238 -9302 -28113 -45790 -29115 -30755 -34323 -15512 3752 8072
21707 8072 -43561 -69844 -72783 -45176 -35064 -21717 -25723 -38453 -56782 -52090 -84398 -80341 -37276
21694 -37276 716 18839 2932 27005 25678 -21889 -37938 -27399 -22711 -52765 -53667 -58512 -39867
21681 -39867 -14227 -5908 -5205 -11869 -16445 -23318 11532 1650 -234 -47215 -47857 -62610 -53175 -12304
21667 -12304 -39531 -41423 -29591 -24252 -24061 -14894 13279 13589 -2325 191 -10643 -19678 -45133
21654 -45133 -60939 -90114 -48501 -20550 -9111 -13954 -10114 -33097 -65355 -52812 -18979 12396
21642 12396 -5661 -37837 -45336 -35566 -20996 -66523 -113983 -102269 -60061 -53117 -9937 4700
21630 4700 -74878 -60713 -38300 -28934 -55854 -83193 -119288 -124790 -97605 -77550 -62385 -51439
21618 -51439 -27160 -44942 -69592 -94007 -81591 -64824 2097 46748 37491 8581 -16424 32244
21606 32244 25011 2731 -13483 -4777 5039 12210 11246 -35854 -74901 -46104 -10976 10172 32139
21593 32139 47798 22682 -26863 -29226 -26280 -31517 -34115 -25793 -45835 -47770 -12277 -36918 -30144
21580 -30144 -45141 -69989 -65597 -17682 20083 41638 20457 15504 40526 55101 7728 5324
21568 5324 66831 87507 69907 37717 618 -16376 -10309 -19920 -60536 -63265 -42927 -64843
21556 -64843 -45421 -19647 21426 26255 15070 2174 -6970 -18913 -20268 -12053 -33703 -40212 -30407
21543 -30407 -68357 -62815 -50171 -55547 -49144 14207 26630 22637 13048 -20226 -16668 -39496 -59925
21530 -59925 -58909 -34864 -14442 -19016 8421 -30556 -72241 -38201 -26145 -30424 -8474 6768
21518 6768 -4195 -10594 -29857 7911 37698 -1133 -14373 -39966 -68730 -67283 -49702 -22074
21506 -22074 14638 36507 46780 60150 34596 -11340 -33477 -34599 -5870 -2473 -25298 -29655
21494 -29655 -11645 -23280 -21309 -548 -10376 -7391 -8425 914 -7959 -6447 -4122 -3748 -1249 21080
21480 21080 13316 -18507 -53591 -52474 -12269 -41056 -74176 -62425 -44754 16863 49548 67423
21468 67423 67442 57761 36847 10882 -27063 -37049 -26889 -12991 -29548 -48844 -83784 -59121 -30049
21455 -30049 -29883 -57528 -23080 -36452 -59019 -79131 -44982 -15613 -2251 -19463 -52528 -67441
21443 -67441 -44480 4231 47656 58313 40372 26440 -54726 -72997 -32267 -42322 -25013 -3258
21431 -3258 -6358 -10192 5890 -31300 -30245 -14086 -31156 -46612 -43945 -60650 -54449 -42640 -28487
21418 -28487 -2696 -36928 -37804 -42106 -48868 -47366 -58044 -80811 -80379 -62023 -4141 -25786 -68310
21405 -68310 -62327 -85430 -76721 -3521 -7671 -33884 -80562 -122512 -92787 -74763 -70733 -65410 -35599
21392 -35599 -12301 21331 73921 57216 45993 74632 96582 73016 26335 3481 13231 26160
21380 26160 29331 27727 30482 14699 1387 -2904 -7100 -19102 -29859 -35311 -43142 -44475 -43919 -25819
21366 -25819 -25824 -27040 -34025 -12752 -25613 -22080 -11044 9592 26197 -7909 -14341 16194 28370
21353 28370 -18220 -30379 -10300 -11301 -21948 -23042 -11240 -5243 2710 -28246 -9892 29890
21341 29890 5888 -17554 -37211 -8350 15197 26899 -6638 -18319 8435 12452 39312 39355
21329 39355 31338 34242 18334 -41647 -12131 -10871 -36641 -45408 -92013 -81105 -54731 -31431
21317 -31431 -1382 1598 -15783 -73077 -72599 -67260 -84996 -59419 -7620 37270 -2216 -16762
21305 -16762 -52075 -60338 -28686 333 -16609 -8379 -23667 -62635 -43243 -55815 -63601 -43319
21293 -43319 -46044 -39095 -58941 -45383 -48099 -21609 -16570 -5201 16947 2792 20675 13664 29736
21280 29736 14542 10771 -7722 -17449 -17503 18726 -6763 -5398 -41235 -46738 -59670 -40828 -31873
21267 -31873 -38355 -33434 -50249 -50854 -34748 -31542 -8204 -5262 -35750 -81730 -85335 -69843 -94035
21254 -94035 -103833 -61684 -33957 -39097 22367 60730 15565 2454 2645 -9104 -3578 -7316 -17022
21241 -17022 25383 18303 -7608 -5800 6852 34986 13680 -20410 -30378 10186 15243 243
21229 243 7105 -5336 11675 23515 -41416 -102591 -85469 -55506 -62495 -42700 -45151 -42851 -40861
21216 -40861 19863 81501 59067 26202 64370 33498 2989 -6346 -36756 -75527 -86044 -71147
21204 -71147 -40826 -20859 -8853 17277 -15756 -91658 -108701 -86145 -46844 -21230 -11852 9960
21192 9960 -43030 -57866 -45795 -32045 -27542 -42009 -65470 -87366 -58361 -19742 21908 -14518
21180 -14518 -62144 -60304 -21340 -9268 7745 41367 -10186 -57849 -59925 -70569 -40395 -35165
21168 -35165 -44642 -55919 -44694 -36411 -51449 -54845 -41026 -33421 -20174 -10855 -47833 -55316 -56608
21155 -56608 -57087 -35502 -2571 -9075 -30022 -22465 23419 18500 49450 81796 51605 15256 -40702
21142 -40702 -29326 -12949 -14861 -15273 -21579 62 -6989 -4455 39636 31626 13699 -4364 -22498
21129 -22498 25 -4557 -43197 -10573 22844 -7981 -23000 -22986 -45029 -21204 2149 7365 -16733
21116 -16733 -32695 -31751 -5695 -9912 1544 -11732 -8939 -46655 -62362 -27569 4202 -7042
21104 -7042 -17190 -20802 -36659 -33935 -39299 -46673 -36492 -31824 -68506 -74275 -51202 -33061 -47574
21091 -47574 -49708 -52694 -53592 2981 25120 1642 -19229 -10622 3386 51040 48140 17444 -9219
21078 -9219 -2219 -30207 -37678 -13285 -24611 -13339 3270 39649 50717 39058 34409 18436
21066 18436 9165 17925 24250 -12531 -8189 2982 -3078 -6973 8118 10197 -5289 -4878 -31455
21053 -31455 -43676 -23257 -20661 -49828 -56976 -37305 -7279 -21264 -46513 -44184 -12044 29966
21041 29966 3044 -47043 -43070 -47313 -43826 -30166 -6875 13781 3292 -6766 -21726 -8169
21029 -8169 -25736 -13405 -8517 -26731 -33733 -4515 20662 5600 8325 -4731 -22626 -85439
21017 -85439 -103397 -62768 -36956 -71183 -91108 -53513 -76247 -69935 -29222 -2269 17334 39670
21005 39670 22040 1380 -10493 -33031 -42756 -46660 -46668 -40628 -74511 -63187 -18403 -53195 -56558
20992 -56558 -52861 -53605 -60890 -32108 -20885 -40963 -61523 -28717 26090 46213 44371 42196 8052
20979 8052 -5433 30731 48988 23348 302 -24791 -10437 -13211 -41445 -35760 -25507 -35133
20967 -35133 -32658 -38248 -59983 -60744 -42269 -9172 -845 4806 -2597 -5707 -25006 8677 15402
20954 15402 -8373 -1477 -21896 -16259 -7139 -14294 -19556 26837 76000 55555 17830 44947 44836
20941 44836 3364 -7012 -39662 -58807 -54271 -50205 -10120 39110 23010 -9884 -54394 -29054
20929 -29054 1978 -55900 -89017 -48563 -41522 -32505 -52773 -13686 1640 -6850 -25094 -22287
20917 -22287 -2966 20177 15204 -16292 -36388 -13565 5434 -12841 -20195 36468 15532 -48673
20905 -48673 -82163 -71110 -48317 -20687 -36206 -53056 5429 59666 51575 68114 50104 31746
20893 31746 15866 -3903 -1436 -13776 -1025 1562 -48785 -69111 -54513 -61945 -68017 -62737 -41205
20880 -41205 -15363 10629 20635 -30787 -55927 -28020 -9202 -36319 -41894 -49087 -62521 -86429
20868 -86429 -60424 -14435 -13243 -22637 -31956 -37469 -35039 -32613 -18408 -37223 -20479 4169 -6792
20855 -6792 -4079 -9413 -18098 -27406 -25734 -48207 -50264 -40100 -29695 -62297 -75250 -67458 -44932
20842 -44932 -24078 -56460 -85089 -71018 -66893 -37485 -29756 -6615 5949 -9774 -36421 -38316
20830 -38316 -29819 -19526 -66665 -22376 1933 -5742 -2954 -8350 -10083 3748 27501 52577 14667
20817 14667 -8606 -41427 -53760 -38756 -32168 -54483 -17985 -19173 -22999 -23440 -78724 -51470 -988
20804 -988 19436 13324 -29403 -46903 -15452 15726 31791 49280 32958 3732 -9654 4833
20792 4833 -24682 -20905 11543 19833 1405 24035 -23813 -11894 15828 5068 12034 20445 2965
20779 2965 -30692 -23896 3721 13248 -16399 -23284 -29286 15589 15818 -5378 -5763 -25595 -31807 -32836
20765 -32836 -60976 -49254 -38428 -5508 8418 38143 37397 40105 30714 17661 37970 30009 21315
20752 21315 -6934 -46171 -65423 -65644 -50669 -35056 -78735 -36927 -17800 -21417 -46494 -31520
20740 -31520 -30271 -35199 -39950 -37722 -2178 47167 54296 33373 -10509 -10343 39714 -4417 -84037
20727 -84037 -94712 -77077 -59975 -29076 -18869 -51271 -77090 -75807 -39292 -11289 -5997 -12581
20715 -12581 -9439 -7754 10147 958 -37851 -45099 -34336 -14144 363 8426 -5467 -15868 -51457
20702 -51457 -43086 -62759 -48570 -15393 -5668 35317 27241 7640 -4214 -40337 -66736 -79437
20690 -79437 -118212 -112898 -95071 -84585 -57775 -26648 38623 18093 -61297 -76181 -53983 -29671
20678 -29671 -2769 13405 11401 -198 -20096 -17479 -4005 -19430 -53859 -54402 -60123 -57623 -53975
20665 -53975 -44263 -58004 -62536 -96761 -89493 -23764 -5421 -40049 -49816 -44899 -65510 -71766 -70759
20652 -70759 -54261 -7358 25091 25673 6814 2171 -2966 7058 6724 32183 27819 19069 -23020
20639 -23020 -38565 -42064 -40431 -33896 -34527 -18580 -31049 -15666 -4705 -368 -10476 12422 22078
20626 22078 19521 -10324 8077 21121 22598 -2029 25820 14134 -6264 -25405 -23331 -49947
20614 -49947 -26642 -4733 12586 26007 12009 10118 21396 15408 -12608 -63694 -56137 -28133
20602 -28133 -37098 -37240 -20836 11273 66258 56400 19105 24210 26350 23329 25935 9554 -15472
20589 -15472 -7674 -8145 -23864 -33939 -14024 16616 23426 19300 -3140 -4895 -25975 -15070 -3528
20576 -3528 -10010 -37273 -40383 -40535 -45359 -38059 -46976 -32442 -12154 -10284 -13216 -48849 -24361 -6387
20562 -6387 -2692 1146 -28190 -22778 -34371 -20706 -9051 -1348 6256 19003 11683 -29090 -66757
20549 -66757 -58329 -24044 -28144 -6675 34759 61843 20800 12466 25281 20233 27936 16635 21751
20536 21751 -3477 -55253 -61940 -27511 -42320 -35749 -6016 -13144 -15062 17084 -20355 -60887
20524 -60887 -44935 -27177 -32648 -21466 8739 17799 26955 35682 45578 67973 42576 52839 65641
20511 65641 28960 1366 9410 17651 12168 -729 -19534 1530 50459 47794 43647 51159 63847
20498 63847 47886 58822 71593 67590 8105 -25570 -20607 6493 25688 -4187 1780 20457
20486 20457 22388 8296 12497 17358 28067 8945 -1254 7827 -87 -25704 -45349 -42428 -29766
20473 -29766 -25020 -24741 -543 9798 -36490 -28855 3100 4303 -21198 -34031 -43268 14409 35164
20460 35164 36694 2449 -12226 17021 22771 22780 -3130 -41238 -47655 -65174 -29207 -17274 -36058
20447 -36058 -32544 -45631 -39747 -33223 -50137 -85522 -114873 -129406 -73329 -31142 -5303 -22461
20435 -22461 -32938 -23661 -13778 6687 9342 20089 2367 -36398 -65824 -74446 -54738 -56201 -39465
20422 -39465 24342 38422 47253 24824 3829 -4581 -7638 8877 2185 -22298 -35514 -25952 -26644
20409 -26644 -42745 -26377 -15021 21547 15658 -20737 -22761 -57485 -77074 -49753 -35484 -54063
20397 -54063 -65651 -31911 -24031 -14256 -2172 -32064 -9349 35245 27374 -11904 3341 3755 -15251
20384 -15251 10326 18543 -15891 -4166 15152 52951 31337 -31053 -41362 7669 29277 23087
20372 23087 8497 -7400 -56986 -82313 -77373 -33867 -24886 1576 2386 9967 -11105 -5259 17413
20359 17413 28922 18733 29638 22530 -11312 -10401 -16284 -49366 -51503 -38899 -12168 -22101 -65650
20346 -65650 -37333 -40994 -64532 -67566 -67429 -57223 -63340 -65785 -49371 -42735 -21319 -12345 3895
20333 3895 28745 50044 49435 40087 36219 11668 5977 35566 50717 10164 -5942 -15983 -61732
20320 -61732 -23681 11784 15149 -957 -3257 -22016 12240 9407 -14659 -5965 30046 21897 -5282
20307 -5282 -25149 -10252 -11015 -33760 -22470 -2715 9396 -25542 -27325 -13183 -32220 13739
20295 13739 34743 30166 -2699 24651 57521 67207 49992 17497 25642 36675 10336 -11540
20283 -11540 -25013 -40054 -43615 -31194 -28523 -44575 -47593 -76432 -48409 -58009 -40230 -30934 -60312
20270 -60312 -80676 -66969 -12248 10024 6840 20633 24578 4465 -38009 -37900 -17740 22337
20258 22337 49884 51410 52046 40034 14337 7821 -4303 -3556 -1028 -13217 -24920 -3380 26181
20245 26181 28581 2657 -31363 -46413 -60259 -75475 -48180 -54999 -111136 -118057 -58881 -6624
20233 -6624 -17176 -35563 -28393 -5558 8627 -21283 -37908 -38715 -53779 -28516 -20641 -24131 -6720
20220 -6720 8333 -2944 3505 18221 17563 1561 -7878 10643 66701 82306 33946 -7046 -22350
20207 -22350 -28699 -32537 -25361 -18320 -13324 -33488 -77515 -84999 -29020 -974 -21401 -8818 32414
20194 32414 42130 10330 20669 1330 -11661 5168 -24012 -27937 -24002 -39672 -24387 10105
20182 10105 34177 45150 22426 14560 10600 3424 -5598 11636 38618 32609 9220 -2733 29035
20169 29035 1048 -7917 16769 10715 -4541 -7993 -15441 -6300 317 -59 42348 68621 92592
20156 92592 71528 27574 -7622 -18571 1742 33008 11930 4977 -17251 -23953 -40885 -32909
20144 -32909 -17300 -17372 -25051 -30950 -58432 -47099 -41550 -51376 -18138 -16496 -19321 16931 22221 23960
20130 23960 41695 23913 2484 -20414 -37105 -58012 -16917 536 -35094 -64870 -105515 -76737
20118 -76737 -52103 -8836 -5006 24367 53383 47828 5839 -12961 5503 -109 22263 24557
20106 24557 50482 58856 38908 35411 55828 106167 99612 69214 22836 12929 15731 23243 -3110
20093 -3110 -33610 -44616 -16991 -14592 -6914 -9602 -3502 -3081 18525 23677 33740 35894 -6017
20080 -6017 -17906 -25990 -51960 -27367 -19231 -40502 -23417 -25639 -40553 -43383 -35140 -33796 -40604
20067 -40604 -15806 -18677 19172 19632 22109 60289 52647 51346 77282 61501 44087 46415 44923
20054 44923 25437 1342 12798 30195 70778 87661 61794 62822 57313 53645 61847 21628
20042 21628 -14168 -17963 3010 39539 33229 -23029 -26316 6954 -4624 -34437 -11676 3970
20030 3970 27661 40655 61931 65105 54261 75442 64319 27477 -2668 -22017 -27592 112
20018 112 -20576 13014 65624 30988 7222 -5916 -12205 15640 10045 16340 19036 12950 -11895
20005 -11895 -26600 -31449 25678 43655 77552 43644 -7765 2914 24593 26440 2243 39473
19993 39473 28294 -41678 -37091 -6756 -12687 -23360 -25027 -22571 -23522 -6550 4658 -18861 -62018
19980 -62018 -54684 -33614 -30834 -28824 -25646 -48121 -74198 -10495 31463 -24363 -46735 -62942
19968 -62942 -37991 5202 1359 -10922 -42963 -72152 -80937 -36387 -52173 -29951 -3273 5998
19956 5998 3339 -19459 -4159 -14507 -8062 5643 -20976 -70147 -97062 -63458 -50976 -9233
19944 -9233 10709 20537 26314 17433 -3482 52953 68925 20946 -26855 -68892 -104716 -97431 -75101
19931 -75101 -42541 -25794 4970 32186 47501 24517 19393 49501 60819 74194 36938 24207
19919 24207 25113 30253 -11380 22501 40514 51254 36895 -597 -18511 -57183 -49846 -3735
19907 -3735 5983 34597 14804 -22422 -5400 -6337 -13642 -6205 -8737 -11283 -15429 4204 13245 33426
19893 33426 67348 65355 43327 24896 17623 -8729 -41326 -39432 -18296 12706 -28848 -47691
19881 -47691 -65803 -22086 18646 46589 55349 31497 55897 49449 63623 77238 54361 20880
19869 20880 25978 358 -4427 16078 47818 78328 54731 9622 -11724 4239 34979 32969
19857 32969 34248 39296 15393 -3684 -28830 -12634 -8808 -22136 -17964 -3926 -19685 13983
19845 13983 26841 28082 19748 20544 24922 27499 43414 64183 104641 106321 102936 108655 57775
19832 57775 16669 17105 19873 38462 67461 18965 -7209 -11680 1184 21127 11325 -29938 -20678
19819 -20678 13729 17598 44282 66672 70329 65297 54597 72440 63405 58731 15415 3619 16533
19806 16533 10444 -27998 -17519 3705 -16597 3444 66002 38129 26306 10085 -19183 -20145
19794 -20145 -14835 -10435 16755 43099 28689 13669 -29573 -27517 -29792 -51245 -58745 -75842 -51260
19781 -51260 -34687 -31187 -31345 -20194 6209 -10879 -51195 -68234 -69208 -69196 -24287 6054 6688 9220
19767 9220 -5813 -11487 -12015 9904 3423 32488 66181 56762 42816 47662 43693 27775 20513
19754 20513 2039 -10081 23923 11783 -42193 -38331 -22461 -49391 -43227 -36685 -30210 -55114
19742 -55114 -90272 -76724 -39240 22808 27976 22690 15022 31728 -9425 -56156 -31604 19042
19730 19042 -10129 -32627 -40643 -26108 -29302 -57264 -17454 6540 37054 30627 950 -34384
19718 -34384 5762 2171 770 -20040 -33809 -43528 -15312 12695 14277 5062 7724 13662 8880
19705 8880 3301 -23178 -24567 -12086 30496 13068 19159 10955 16763 30654 30407 33045 19264
19692 19264 10379 -7179 1623 31902 69959 40558 -13852 11643 18008 16118 42475 3793
19680 3793 -21839 -32436 -49434 -53774 -23741 21479 67906 73986 39922 12842 -16793 -20794
19668 -20794 -5890 14693 25293 17590 18219 914 10724 12693 14482 -8599 7970 7987 -13773
19655 -13773 -31998 -20153 5001 17046 19255 18485 35612 64124 58834 72147 87182 83709 61682
19642 61682 29824 48308 92425 60225 42975 73948 87656 81097 45613 27790 2742 -5117
19630 -5117 1882 21392 48584 70739 73676 60988 43723 -5353 -25784 -35540 -64665 -68794 -74421
19617 -74421 -73468 -80461 -70596 -27578 -591 7336 13154 11807 6180 16431 36483 28580 28742 39103
19603 39103 17472 23990 20791 35418 11272 10144 7376 -24314 -19459 -40910 -33161 7434 22544
19590 22544 8594 23159 30574 -28068 -37586 -21477 -15538 -23232 -16973 -18880 -7857 -33339 -30693
19577 -30693 -16916 -10933 14015 53555 50311 55617 43513 34451 40307 66682 11171 -11273 19143
19564 19143 29054 -8727 -10146 -641 23443 49208 31581 2860 2815 23890 31396 11756 22652
19551 22652 6830 -11839 10286 30828 10913 14666 22796 13261 19795 7335 -11521 -3822 9051
19538 9051 34037 42225 33247 1665 25854 48362 61632 33433 27509 64857 55440 19048 -21686
19525 -21686 6089 20968 5076 -1425 11041 41500 36313 35753 -1362 -47271 -41274 -4760 1038
19512 1038 13484 -44276 -48046 -54833 -52216 -64777 -52723 -54491 -26138 2098 28851 48924 82951
19499 82951 102809 56613 25382 425 4051 36671 55023 64303 49781 32546 20761 38259
19487 38259 61427 80703 80302 67875 38370 36923 27454 -8193 -9468 -2074 2665 -10193 -24845
19474 -24845 -13070 -16206 16932 38509 42533 76495 58233 9970 -40529 -8521 30891 70546
19462 70546 50485 30044 38379 4628 -19623 7846 20204 16612 -27873 -60590 -37952 6165
19450 6165 -8247 5728 45133 60357 58964 31493 23431 -2733 14763 59325 98025 117114
19438 117114 87598 67989 86289 91073 76154 61403 48274 41062 23240 17056 -7072 -13114
19426 -13114 18269 45500 12852 -26597 -34292 -21235 -30648 -56440 -50737 -12370 -8945 -5797 9754
19413 9754 38741 71466 78284 81680 94866 59721 72768 96493 85410 80251 88959 77780 32536
19400 32536 -12673 -16195 -31825 -38834 -25898 4441 12181 33795 57965 61225 34364 22926
19388 22926 18869 7566 26757 52433 79511 79695 58409 27863 49598 55806 52421 53553 15374
19375 15374 23004 56747 53989 51253 65619 85537 67441 51250 38441 43576 75494 85551
19363 85551 53294 37475 54224 53243 46816 45024 27952 -4875 26733 55999 40564 30404
19351 30404 18798 12256 43084 47740 54485 104333 113958 94776 64621 40981 54285 61344 41087
19338 41087 19191 59965 81773 80155 79950 81760 70078 23930 -5921 1258 32724 16976 11399
19325 11399 55231 44902 50129 78356 127434 148543 110879 76312 39769 30365 43622 38212
19313 38212 75821 88786 78321 72617 62724 91283 95181 37867 29392 28270 79055 85885 87716
19300 87716 56077 24409 13221 44029 102909 132605 109360 106672 100894 110728 88412 65612
19288 65612 42826 30931 47490 33497 69581 90825 94944 78141 82651 61840 37345 55188
19276 55188 76998 71363 112461 147671 119789 90251 99757 136418 125938 126201 128053 83509 54361
19263 54361 50256 99828 110081 82628 74733 83348 72657 35428 26602 6124 21345 31485
19251 31485 37797 64564 67955 67854 63356 39936 51272 79846 62148 35805 37055 110393 128564
19238 128564 151305 153627 105559 65858 50085 52933 71579 92009 69062 73307 61596 83094
19226 83094 89381 96593 89601 79950 75563 72820 60746 65748 62728 60848 90378 140965 155639
19213 155639 117838 62349 63543 74003 53739 53533 57992 45906 41765 62116 62404 63083 53899
19200 53899 51700 48152 42009 -7445 -7033 15560 18837 25295 29044 15747 -2743 -8641 -178 -11001
19186 -11001 -16334 -25646 19225 86974 102647 84653 71425 85166 70612 49398 45994 41321
19174 41321 56722 42663 45105 28757 17897 27979 40435 32069 33541 41365 45064 48768 47813
19161 47813 54383 21648 25745 45381 63882 64796 37333 44477 61707 20515 13857 54286 55494
19148 55494 52175 56251 45843 18855 38509 43152 52348 47094 44141 43305 55533 41824 41129 50399
19134 50399 46554 30470 46840 61055 92209 73630 72908 73809 82919 124981 150266 128644 130029
19121 130029 96101 43156 11442 28590 50945 68076 62046 57040 43790 36413 63532 114131
19109 114131 146099 143373 158198 140259 126977 103151 77602 85221 89439 78454 61356 53291
19097 53291 43186 34536 15097 49691 76951 80475 68430 104828 91364 85620 70106 81111
19085 81111 107676 70495 47402 68678 98417 96270 89545 78034 71696 67331 69752 108788 112718
19072 112718 104971 93730 95243 51772 13532 24096 37468 51276 61558 43453 21636 34566
19060 34566 67187 65589 59903 29582 -7083 15062 94709 148150 157560 160415 162939 182024 152388
19047 152388 121915 126459 150235 115313 55172 60639 78042 97764 101952 135471 174236 139404
19035 139404 141685 158587 134437 120101 126642 88120 103579 134172 129351 127086 148459 144970
19023 144970 125358 121277 135381 95157 74873 86234 84062 60446 46535 36313 32392 38872
19011 38872 68877 89979 92445 118990 121355 118733 124236 129089 98031 106821 122303 160595 194963
18998 194963 181255 171905 140542 110746 83524 111636 155137 136832 140678 132824 125252 109649
18986 109649 79456 92738 58073 65971 115116 151679 153528 150364 150738 145357 129478 109358 87002
18973 87002 83166 111357 116267 115971 97090 109835 113356 122436 104697 103524 111877 103002 125501
18960 125501 123415 96837 82852 99315 105667 110259 114961 135006 121979 116035 118351 116114 128211
18947 128211 128990 128582 145332 98879 83853 88651 87085 85733 88259 103032 83691 57112 57231
18934 57231 88680 97686 89928 97337 107237 132049 163480 188003 165033 181625 133983 113781
18922 113781 119143 154771 196705 212337 250577 225810 190960 198157 185539 182896 182993 165808 172433
18909 172433 193296 194169 186776 184341 190081 198076 193949 162701 205629 246788 240783 209507 200194
18896 200194 210566 252376 286927 311881 350512 386437 511965 656617 673994 642442 677682
18885 677682 798703 857388 724145 558964 462170 433046 427502 445628 414877 369706 365895
18874 365895 375285 458817 627097 914904 1232389 1255085 1010378 767295 629236 588556
18864 588556 640876 706329 788330 756236 627634 490906 395798 364726 347020 335208 343652
18853 343652 344223 345763 329083 319377 348987 374549 386589 390820 473617 620705 853917 1087240
18841 1087240 1160400 1051394 981304 938163 934856 903651 874795 909171 991520 1015597 967899
18830 967899 926821 956962 1149245 1418772 1557349 1506994 1410500 1334685 1254075 1196547 1221075
18819 1221075 1259307 1118566 869666 762416 776105 860164 1014621 1205137 1150146 911428
18809 911428 702335 566813 497488 459112 475058 444073 466911 522011 573689 552824 556533
18798 556533 564126 616874 716338 854206 1045558 1192882 1199429 1114184 950683 821775 749516
18787 749516 723106 759553 943723 1090575 1083851 1020617 1006710 1018202 1044456 995922 893107
18776 893107 804867 843021 960579 1069768 1074775 1050491 971445 905448 993922 1274594 1523229
18765 1523229 1373810 1035178 819376 748553 771338 871351 985074 1052088 1147685 1123225
18755 1123225 952025 760207 641703 594569 527696 487440 470088 465863 480540 534744 606845
18744 606845 676179 743795 735019 674450 585796 503574 460585 429659 393546 421685 390832 380774
18732 380774 345607 329755 337630 332358 319299 411322 472704 524571 607342 758777 876577
18721 876577 880768 808187 736761 699858 776866 949855 1180322 1385160 1360954 1171516 958188
18710 958188 770265 683971 654102 653467 639953 584306 554347 565213 639360 781305 970857
18699 970857 1223576 1446281 1409940 1223776 1002956 799615 632126 518681 444189 388286
18689 388286 383988 407481 430335 419409 387153 370068 343335 318998 317922 333833 334163 332564
18677 332564 324606 345195 407560 412319 412594 380496 321265 307518 315701 321356 313680 321561 312865
18664 312865 353638 383970 393582 390495 347381 365262 372023 380766 395795 368275 358365 344610
18652 344610 297467 285961 296564 314172 346140 344707 369072 376543 381393 386338 444830 475037
18640 475037 429741 408145 432275 444321 442109 429559 425333 408013 419457 411675 402457 382873
18628 382873 381297 391388 400476 419024 392445 375434 375629 403832 411437 417483 458755 482325 488648
18615 488648 511516 569040 570089 621499 631074 590512 592087 597631 586671 536717 493466 480636
18603 480636 468119 483886 527315 554403 561009 553678 541103 565102 561081 516575 517233 501676
18591 501676 522689 563431 602546 662375 647589 614781 600349 554682 531282 537007 579608 623450
18579 623450 637448 645091 676245 730553 750031 760898 818292 943895 1014705 1020388 989164 1051951
18567 1051951 1167373 1237915 1157717 1078181 1084073 1174798 1326511 1409107 1397831 1410824 1438325
18556 1438325 1532525 1565524 1566736 1521446 1360276 1144313 1000698 938067 884653 848976 851112
18545 851112 858065 866581 904289 925455 963818 969501 968918 987308 1023684 1031695 1027071 1001876 990224
18532 990224 1015730 979636 973352 1016177 1076578 1185314 1360356 1667708 1917291 1987752 1844150
18521 1844150 1708519 1711676 1886759 2015524 1999923 1934027 1848909 1787992 1763809 1756488 1742713
18510 1742713 1754586 1835038 1983133 2078460 2028336 1907331 1762245 1651981 1645151 1644687 1610418
18499 1610418 1576621 1546982 1499581 1401328 1342732 1330369 1322849 1303832 1302097 1262764 1218872 1202110
18487 1202110 1209307 1248628 1425945 1642738 1818201 1836907 1756772 1587899 1453954 1429355
18477 1429355 1480268 1485310 1512702 1575866 1651948 1768284 1960688 2264515 2816725 3813305
18467 3813305 5034766 5745740 5605819 5199622 4546730 3664042 2893002 2465919 2258629
18458 2258629 2203821 2199718 2255918 2320520 2308733 2125977 1978447 1932572 2002161 2119129 2406289
18447 2406289 2647917 2555027 2419471 2402055 2517806 2757264 3103186 3631168 4395193 5238478
18437 5238478 5830084 6225393 6220416 5378244 4205203 3265278 2661318 2339494 2113278 1905699
18427 1905699 1845340 1854900 1922695 1969232 2034239 2143331 2190949 2267862 2432546 2523291 2419998
18416 2419998 2305771 2227098 2178055 2146350 2153136 2136396 2146653 2139976 2139548 2173052 2235175 2255035
18404 2255035 2320173 2431371 2556256 2684645 2792996 2885714 2981286 3168385 3406479 3590361
18394 3590361 3702448 3870642 3943659 3901841 3930386 4122827 4527763 5158630 5633629 5906975
18384 5906975 6295107 6545042 6647823 6884307 7694951 8978796 10273372 11935785 14889997
18375 14889997 19053504 20299188 17419392 14250722 12625970 12390063 13263149 14610519
18367 14610519 16285894 19008178 23496587 31094895 44626646 69853697 113712727 156378386
18359 156378386 151312363 122759734 108426294 103322483 93723841 72305401 50530862
18352 50530862 36502333 29043814 25311155 24274212 25926720 31074406 41549331 58848328
18344 58848328 73141597 65757206 47442891 32669435 23691252 18416115 15297945 13505660
18336 13505660 12461238 11876903 11576798 11413241 11515028 11981174 12751709 13579941 14244591
18327 14244591 14891735 15755115 16805309 18605146 22000538 28019410 38529844 56558335
18319 56558335 83785428 105313048 97131642 73766034 55535242 46345482 42926677
18312 42926677 42870916 45384774 50509691 59514181 75876326 105976205 160422406 247513876
18304 247513876 344845917 438715467 481678359 455033569 374855326 261005541 169126532
18297 169126532 114822909 85154080 67538762 56052510 48689408 44954758 44742297
18290 44742297 49868933 63333468 83315042 86752005 66742400 45613251 32514830
18283 32514830 25230631 20911607 18376946 17071348 16750711 17089110 17385059 17309435 17159742
18274 17159742 16918993 16343483 15452277 14579946 13853386 13431066 13488932 14024583 15267754
18265 15267754 17280880 20409718 25669564 34868253 50695965 72371382 84053868 73953978
18257 73953978 57051333 46043437 41981974 42390963 46219663 54344735 68952004 93287502
18249 93287502 133979549 202939809 303834598 403137471 465151068 468845718 402965146
18242 402965146 308189116 216743797 147486273 104160002 78902046 63373628 53287710
18235 53287710 47013261 44263244 45160598 50765402 63364281 83959767 102675383 99131790
18227 99131790 75875693 52334838 36832917 27892405 22603989 19128664 16740748 15217004
18219 15217004 14129696 13197152 12520403 12266489 12554092 13297991 13967652 14173522 14020579
18210 14020579 14069759 14782770 16575556 20034651 26309901 37203305 53754529 68907097
18202 68907097 67880063 53122102 38574244 29943973 26239561 25684258 27449215 31895328
18194 31895328 40922783 57151229 78887006 96770834 106906727 115391519 135517005
18187 135517005 156577499 142325933 100028069 62971080 41165445 29653878 23306987
18180 23306987 19229317 16497270 14641009 13551174 13302452 14053991 16263708 19628801
18172 19628801 21174366 18742743 14679139 11260612 8966800 7468172 6393435 5668452
18164 5668452 5213847 4898458 4731919 4692020 4599503 4482241 4481402 4534433 4689515 4667496 4247786
18153 4247786 3773290 3429256 3219142 3092066 3061645 2962853 2868797 2754520 2702950 2626622
18143 2626622 2577826 2615225 2667729 2750573 2814884 2825212 2779686 2660989 2605641 2569512 2519715
18132 2519715 2548850 2576295 2545643 2500796 2520422 2561156 2611032 2693741 2825161 3003084 3315220
18121 3315220 3671127 4086365 4487515 4875804 5266113 5815223 6770768 8422961 11268408
18112 11268408 16263647 25675660 44142713 78732461 109290293 88522123 52816099
18105 52816099 30050769 19167307 13734325 10618213 8467579 6903727 5775035 4964018
18097 4964018 4464228 4221818 4092844 3923842 3679454 3322012 2946268 2681558 2598269 2537057
18087 2537057 2503321 2439947 2337960 2228070 2113421 2060118 1956482 1878627 1872270 1829072 1749864
18076 1749864 1716963 1767240 1786185 1785869 1786719 1832079 1888337 1994190 2026841 1966505 1916182 1893115
18064 1893115 1838230 1862725 1957611 2067258 2181188 2242002 2296920 2444503 2641461 2828121
18054 2828121 2920473 2970321 2949984 2715434 2394181 2142479 1989377 1946529 2032586 2201339
18044 2201339 2477291 2792894 3130842 3229559 2935464 2482425 2130338 1923951 1801807 1707674
18034 1707674 1647808 1606167 1575789 1632070 1681817 1794093 1842205 1844923 1793547 1750619 1665961
18023 1665961 1580830 1536504 1516096 1506988 1522973 1530744 1524272 1585460 1675804 1825383 1929637
18012 1929637 1990823 1988171 1926214 1863313 1880897 1939415 2005383 2124719 2205930 2189450 1992522
18001 1992522 1841864 1816386 1859845 1933530 2123965 2377686 2429801 2208024 1898743 1705656
17991 1705656 1582969 1469891 1381362 1365709 1419336 1473502 1499154 1504792 1503619 1492359 1452432
17980 1452432 1425657 1385841 1359190 1351137 1320819 1310037 1285939 1272482 1298888 1345903 1391821
17969 1391821 1435710 1445390 1424523 1395001 1346272 1307309 1311791 1340953 1377938 1490279 1643284
17958 1643284 1661344 1619333 1517134 1397752 1343421 1357005 1423796 1514592 1502505 1405481 1367059
17947 1367059 1335631 1276892 1269043 1293985 1278888 1306326 1282312 1208122 1130572 1099802 1113465
17936 1113465 1196144 1295055 1310308 1354707 1374020 1376495 1366519 1308431 1271310 1265160 1259942 1266261
17924 1266261 1295310 1322613 1353349 1389631 1412189 1381910 1354481 1289199 1198356 1114001 1087352
17913 1087352 1111611 1181752 1254046 1317538 1307232 1258594 1249480 1247107 1250089 1263007 1288315 1203603
17901 1203603 1124248 1118324 1176462 1233231 1289343 1322363 1311852 1306410 1273894 1229177 1201537 1226995
17889 1226995 1304116 1362142 1452082 1572813 1633517 1613343 1567264 1507013 1506758 1521452 1493051
17878 1493051 1482674 1509673 1518759 1536246 1619053 1679350 1757452 1792462 1793884 1760350 1691495 1693729
17866 1693729 1730956 1725447 1705495 1679024 1726568 1763155 1827273 1894968 1949864 1936131 1893153
17855 1893153 1895533 1882550 1915256 1971135 1953288 1942470 2033212 2153570 2232480 2325115 2402299
17844 2402299 2447660 2505520 2561129 2610280 2682694 2737578 2799914 2905279 3044124 3211141 3430182
17833 3430182 3765919 4096877 4458268 4971662 5756650 6699570 7853938 8946694 9212702
17824 9212702 8599649 7779909 7277148 7142441 7282249 7772988 8535926 9636171 11314985
17815 11314985 13592924 16198907 18472203 20307109 21911191 23794016 26845091 32585455
17807 32585455 42736326 59738725 88973282 140869964 220863059 277010691 242319121
17800 242319121 173407589 126769124 104147719 88642369 77469305 74257598 80747138
17793 80747138 99066984 135235855 199426653 290166919 367994525 395765508 367198044
17786 367198044 300612646 216362281 148638862 107710361 86252714 76996031 77425338
17779 77425338 87282243 104373954 128473491 172413192 244955180 293525651 247008395
17772 247008395 163714091 102803299 69032997 50086366 38584231 31331127 26768850
17765 26768850 23826786 21882999 20034508 18164602 16150347 13874428 11740712 10166925
17757 10166925 9237755 8699532 8263968 7942120 7967054 8354702 8556715 8601483 8544672 7932250
17747 7932250 6774010 5724812 5054349 4712457 4464334 4120667 3788628 3563370 3468855
17738 3468855 3455108 3326284 3075208 2837074 2681089 2563877 2521905 2561219 2670464 2802977
17728 2802977 2847915 2865836 2724476 2421828 2176218 1993290 1844052 1681341 1563558 1534197
17718 1534197 1556896 1511013 1516918 1488340 1445582 1424673 1406841 1430204 1455917 1426255 1349001
17707 1349001 1254570 1127681 1043114 1090275 1116109 1138206 1158873 1142367 1105899 1087393 1085684
17696 1085684 1157287 1261277 1359767 1502318 1638292 1652359 1575608 1526046 1631047 1853002
17686 1853002 2017152 1921875 1627107 1382220 1261775 1248774 1217505 1224022 1236710 1278744 1321073
17675 1321073 1317540 1264946 1274737 1305075 1406559 1583285 1744150 1812919 1804254 1773188 1719988
17664 1719988 1646789 1589818 1514367 1432013 1327460 1177923 1066823 959467 894325 927092
17654 927092 961958 1013303 1032386 1037277 1056004 1094461 1142473 1082228 959710 832303 780917
17643 780917 771746 785040 772014 801800 837444 812403 777128 701628 664990 662233 637061 581793
17631 581793 546930 563021 620368 665950 663057 613520 631141 668457 704510 665008 606852 573125
17619 573125 549852 563788 607333 633048 642136 624275 608557 599685 632852 654119 663135 695579
17607 695579 679353 660727 641081 621173 621988 646648 618871 617242 595124 620064 664717 710323
17595 710323 782857 940965 1105146 1128967 1097263 1004046 905856 843304 811154 779008 734134
17584 734134 681508 665121 670043 647930 610527 649349 682405 733238 780839 795744 784542 767663
17572 767663 732861 713826 707437 703840 692952 631787 625418 646852 647471 654097 660811 631443 561606
17559 561606 529381 528782 558241 530188 547899 590501 652026 704284 718651 729085 710846 703481
17547 703481 718338 684910 693971 687510 682262 710097 773523 886885 1000986 1060356 1087122 1016825
17535 1016825 940658 883764 838027 809518 797172 803851 774070 720294 680496 638400 604838
17524 604838 617141 617334 639189 716115 782438 810686 777688 751350 712591 669840 637827 604914
17512 604914 573252 520747 477269 476844 498106 503644 484827 506790 551872 524480 539217 576708
17500 576708 592374 583305 558041 520530 513510 542778 565050 595613 594127 564298 551621 600119
17488 600119 619794 605790 577558 535781 533044 518847 506907 481074 464915 491342 540244 546457
17476 546457 568888 575876 590335 567612 537456 514916 504760 477060 413490 429145 399976 413668
17464 413668 415158 410213 435244 475148 533705 551003 536426 527506 550703 560336 558902 579709
17452 579709 562658 533317 548417 562344 582519 628300 659810 701983 754289 932559 1116823
17441 1116823 1053421 830827 692006 646577 582345 520085 541665 570427 536233 470248 431033
17430 431033 461804 476319 444543 401050 375018 378117 388886 389307 422974 444109 435912 477985
17418 477985 579343 603737 592924 519896 445668 428784 449454 468271 489161 496767 482770
17407 482770 467452 466864 493672 512205 504190 452006 417430 438503 440076 481079 517364 493554
17395 493554 491803 509993 506854 507190 555074 560955 543265 520450 468857 450525 433476 451823
17383 451823 495386 497000 515445 523755 495436 486842 507311 503329 466303 472784 514701 574156
17371 574156 572721 559726 573833 548418 550479 614872 695570 766571 876213 1033540 1101895
17360 1101895 1071082 1005568 912845 826358 795383 755487 738994 764826 809306 857957 868956
17349 868956 868794 829374 780472 725687 687067 644194 634580 616944 624019 619051 566469 538277
17337 538277 542248 594472 571679 575321 600523 590626 587398 597155 579213 583362 559280 545857 563917
17324 563917 574200 575394 610587 658206 704300 717482 715116 722606 677599 654905 657561 708998
17312 708998 721399 756085 822648 918801 1028461 1098387 1124828 1100557 1043420 927625 827395
17301 827395 792753 834869 862627 892582 891769 886085 832782 767153 774851 774088 773719 742060 738447
17288 738447 769001 756494 735708 700969 680512 723612 720676 736857 732137 724534 687086 638385
17276 638385 648125 641768 616698 609711 570431 579979 598647 670536 701491 795516 960939 1129735
17264 1129735 1289632 1405720 1446973 1358569 1192592 1053706 1003306 993981 1017627 1063069 1134147
17253 1134147 1281269 1478127 1663935 1816044 1979739 2165504 2518747 2789910 2770763 2524813
17243 2524813 2377814 2493201 2784960 2932621 2654892 2221012 1960985 1900722 1939078 1911535
17233 1911535 1745633 1578213 1526107 1584060 1758879 2112814 2564519 2961756 3054189 2777352
17223 2777352 2372409 2177143 2264412 2527809 2688922 2533767 2137626 1809466 1642526 1634763
17213 1634763 1736347 1782352 1679274 1550565 1498857 1569374 1796501 2042536 2181303 2172884
17203 2172884 2040812 1843813 1597390 1381121 1281630 1234780 1214789 1241992 1277792 1354286
17193 1354286 1612328 2090334 2543527 2549615 2148933 1674492 1313879 1090024 933317 849736
17183 849736 826233 752974 788210 893073 1002545 1150396 1300451 1259451 1074006 883768
17173 883768 766731 643255 576485 585387 598040 596929 526669 498768 519848 573115 521733
17162 521733 486873 464563 477985 444637 463718 490282 500870 515939 517788 587699 593875 560573
17150 560573 536291 506632 517760 499413 437655 466508 505662 544321 612512 700537 791941
17139 791941 818493 833164 847760 807243 744755 668033 574177 528789 531317 523186 512690 515319
17127 515319 510669 524739 541399 561349 589819 633797 668780 708404 733396 704587 652345 614049
17115 614049 537010 489742 464230 445460 458333 501669 498496 470352 464735 521626 524306 500811
17103 500811 448956 452989 478126 476927 473259 436194 397300 386033 390986 425143 396794 362621
17091 362621 370574 350983 338622 323229 349327 375290 398746 418900 426631 414018 389557 351734
17079 351734 346703 359299 373655 383902 346291 326990 342134 378424 390325 393616 416526 407305
17067 407305 382238 349890 346485 358787 393657 404998 374932 373347 426566 424033 465972 494778
17055 494778 481954 482276 508383 500342 431480 395722 351633 339671 336905 352285 377996 370454
17043 370454 356355 361101 351798 341449 308859 320726 414005 452108 419731 419257 391838 378713
17031 378713 348830 353696 357073 362930 364179 345369 365994 361154 415284 436002 438511 430877 433598
17018 433598 402285 366096 383477 374878 369667 375209 365302 404029 441598 477175 523385 492799
17006 492799 433236 390818 375949 373949 353154 373214 389117 391881 392415 409193 413216 461093
16994 461093 479739 474003 468808 465322 459352 447597 438435 437496 400632 358775 356019 404351 439158
16981 439158 443968 446156 477429 524791 489354 458270 438513 363985 356874 382473 392742 433273
16969 433273 464525 510848 547851 595711 642961 676042 669166 608933 541993 502144 479901 484495
16957 484495 485226 559738 633634 671841 696945 752392 798251 821188 789735 735314 671867 636869
16945 636869 595565 537592 512646 494147 518808 592750 616566 630690 671940 690669 670643
16934 670643 633586 642100 618153 610693 578591 572941 564813 530689 519122 507221 479174 480791
16922 480791 497487 500442 479693 440558 442496 435897 445679 475383 516714 511375 497271 492647 497197
16909 497197 485731 505119 485314 476203 499230 478510 499146 509216 526933 542975 551197 563980
16897 563980 578100 549535 531238 604414 662492 652867 600697 598039 642921 660876 687956 686613
16885 686613 578424 515592 561890 596650 619310 619062 639766 676718 706023 736427 776015 763035
16873 763035 726236 688699 669926 655193 702278 727088 721449 677930 639622 602609 563420 554884
16861 554884 585573 612022 638113 688356 744699 749981 716586 689640 705438 688839 638719 606097
16849 606097 568273 523557 484674 476550 517101 537507 573335 629980 692607 665547 607867 529269
16837 529269 467470 439118 461135 493554 552550 564382 602453 663953 679127 671219 679503 660620
16825 660620 556165 459826 433228 398985 426577 453674 500844 547396 557422 549598 555054 573763
16813 573763 594316 600920 531730 457609 444900 497349 529147 544223 555015 596571 630773 620786
16801 620786 637335 637822 645136 670505 685885 735439 758393 739101 738360 720149 710148 730540
16789 730540 717170 743522 761759 721281 726003 753340 755588 758312 811695 882025 892146 877845
16777 877845 893871 945836 984857 1015585 984454 977862 974448 997635 1035300 1081280 1110819 1122331
16765 1122331 1133493 1132427 1160778 1193661 1233841 1274994 1293838 1366536 1438144 1508225 1582044
16754 1582044 1609427 1636010 1715458 1807979 1884398 1906972 1990251 2137553 2301773 2443315 2587475
16743 2587475 2732310 2954794 3252946 3596411 4024940 4662652 5654012 6892980 7862757
16734 7862757 8261646 8071797 7518491 7092838 7116375 7465555 7895147 8489476 9400121 10775189
16724 10775189 12647080 14925179 17399512 19802479 22085185 24769672 28936653 36013823
16716 36013823 47793186 67465127 100373504 154326905 226172802 267470251 236644579
16709 236644579 176948501 132864612 107292360 90354195 80303477 78726688 86885742
16702 86885742 107478140 145792648 206816247 281938789 345988330 375575177 354634236
16695 354634236 288568362 209303263 147310369 108925988 88061973 79053533 79484429
16688 79484429 88151379 103178641 126963255 169186751 228406977 257630918 217707146
16681 217707146 150754771 98899549 67485511 48992265 37579831 30161153 25207324
16674 25207324 21869168 19507382 17818226 16509593 14899581 13173790 11579171 10214297
16666 10214297 9107740 8268293 7646988 7231360 7116936 7221445 7195072 7074423 7025105
16657 7025105 6795040 6189806 5271732 4383795 3701494 3279573 2991992 2757046 2578758
16648 2578758 2452236 2336925 2262333 2162075 2056775 1940823 1879554 1758190 1674272 1611025
16638 1611025 1532364 1487638 1478710 1417160 1359461 1346727 1311243 1236962 1183665 1140917 1096760
16627 1096760 1065443 1027917 1031945 984882 947036 920805 855106 793364 812359 835683 802156
16616 802156 743359 730606 757172 752441 804603 854805 835444 803465 804793 807513 802126 746975
16604 746975 690476 666382 639727 634331 655090 649404 683305 679894 671962 672625 603324 583078 667221
16591 667221 686984 669429 658610 681656 717140 804968 876958 806171 721570 684680 662084
16580 662084 641562 643597 596941 584556 581864 646089 731529 783833 823192 842393 844533 813945
16568 813945 758526 702426 634024 601829 604204 592137 641239 697100 775043 752732 728829 715612
16556 715612 625225 567648 486054 392706 401411 466681 510136 557501 602243 577214 530429 490843
16544 490843 453083 381456 328662 317069 327374 351165 373318 397272 403561 400789 381630 366338
16532 366338 394221 356513 256988 265661 279411 286164 314993 322977 289852 249150 211326 216766
16520 216766 255519 292468 296209 316544 315710 298568 298199 287895 270604 304798 309032 258265 274117
16507 274117 298154 305149 329414 350633 357318 358224 364532 417087 446339 441908 404192 391035 406446
16494 406446 374811 392278 396359 398873 423341 451169 393104 354013 352538 365632 357787 334678
16482 334678 331414 334113 352982 398340 414574 427048 405802 364693 321051 277981 275261 291807
16470 291807 307789 311001 295521 300626 315295 300351 343379 330698 342249 386190 407795 428225
16458 428225 440174 400548 370214 345451 357055 381920 384256 376907 336765 321590 369928 385286
16446 385286 390114 365570 386995 401216 406762 381598 363104 355787 374967 392662 376221 356146
16434 356146 347850 359917 334456 290775 270561 285566 320196 350787 349604 351629 345322 327940
16422 327940 326984 291912 265569 277024 302196 323487 326206 304724 305459 294343 282621 305792
16410 305792 340376 358773 350124 344351 381703 338028 307899 280408 268746 245051 244662 274719
16398 274719 281341 300196 341720 388614 393581 358696 344209 290748 249336 234149 224922 207495
16386 207495 234403 264487 337384 369406 398046 441174 501918 555270 556820 577702 569652 518848
16374 518848 467007 414523 390989 376841 353478 344110 358992 385714 437848 455162 449271 479732
16362 479732 517151 536112 527348 556462 587425 602936 573601 551968 543442 512006 499917 468600
16350 468600 396314 369230 367502 352533 338366 340026 346622 329705 363592 377315 405571 465688
16338 465688 480603 517672 541378 565309 556065 509334 491434 484028 495087 490101 511211 472727
16326 472727 456082 444412 438771 423728 429270 446587 447292 417417 411589 423109 456774 440361
16314 440361 452499 439973 422678 405545 370578 365447 358510 400744 437711 415854 406984 401109
16302 401109 348285 334433 351757 339021 320983 325174 358963 370675 383208 414477 445044 459049
16290 459049 477917 476086 467509 458519 450124 448746 438161 420560 400792 339112 274045 255555
16278 255555 255415 314401 329385 340496 352644 328588 334477 352958 398173 415460 398898 407400
16266 407400 427033 408050 399502 419319 431913 393116 440368 478573 470811 446154 403067 403176
16254 403176 358490 334236 323879 371133 395954 366461 350054 337906 395783 405794 427031
16243 427031 502798 519807 530425 501666 455852 434646 369138 348219 316381 305114 320501
16232 320501 334646 319699 320399 339970 308986 331651 345571 300625 265557 256124 285737 295964
16220 295964 328971 339014 340065 331393 270651 261924 287513 296717 274662 274300 334461 416062 488683
16207 488683 540564 547599 529656 443254 393563 333249 332159 370142 408424 422498 406989 412969
16195 412969 396105 379912 373268 368756 408237 456440 516905 540748 530948 494085 464326 464098
16183 464098 438937 438257 480828 566085 653982 754737 929482 1114945 1187864 1051030 897335
16172 897335 772678 705089 661745 619078 576237 614885 726823 844479 1040641 1301672
16162 1301672 1456086 1540703 1521105 1410966 1281166 1191337 1200402 1236250 1297566 1284130 1153783
16151 1153783 1006679 986299 1051569 1138574 1139600 1048311 926191 867097 899256 998937 1193798
16140 1193798 1369109 1448574 1381200 1187138 920552 726555 602201 544010 528653 504354
16130 504354 477445 518268 571860 666571 786069 852090 738834 597773 453891 378610 326380
16119 326380 315672 304359 281504 265246 244917 184374 149556 165669 151577 135289 134962 117961
16107 117961 141495 177611 155315 128804 125660 146833 176930 162428 187217 195607 173679 188104
16095 188104 144067 152524 160869 193227 174621 136594 133294 128931 152381 184137 189424 171804
16083 171804 152762 198909 217968 202508 186550 167653 147821 138461 144060 170493 196321 185560
16071 185560 147857 146000 149605 171336 176420 176354 169145 182967 170558 175999 184541 177353 173040 142500
16057 142500 144462 145077 171209 175600 177009 197654 201039 210576 214662 192121 171352 142299 128298
16044 128298 161689 186387 159568 115279 86532 52724 48036 59428 75128 111715 143058 172433
16032 172433 145132 103604 98835 130706 151725 130247 110210 115374 81193 68278 90046 85572
16020 85572 95690 81167 43159 68282 92928 73811 61037 55319 87683 83672 56297 60327
16008 60327 64297 73830 60076 57080 52795 34868 26794 12961 16699 44070 62473 45081 -11491
15995 -11491 -31399 -26803 24712 36090 78913 133685 134257 122446 108894 124305 121342 81094
15983 81094 51628 41838 29852 31393 34536 59969 72592 64625 36779 24141 15289 -1726 14285
15970 14285 39466 42594 48664 78218 60674 58315 39644 10191 21614 29803 27468 18392 -5616
15957 -5616 593 5921 14024 79334 85158 57316 48893 25617 10476 18502 70846 119285 88840
15944 88840 35980 49518 93471 80368 88863 88058 78195 68022 67941 76621 58708 63139 79519
15931 79519 92830 63318 72520 92866 106737 85185 56005 28659 -14827 18867 46842 -581
15919 -581 2691 22923 18880 32858 49714 41587 34737 29920 13626 -18082 -35152 -18226 -6733
15906 -6733 8684 2541 30224 42996 52025 50862 20350 -36260 -19304 27507 44012 75659
15894 75659 73176 44971 8206 16000 46027 82522 53059 46998 54470 43453 35223 73008 102642
15881 102642 123804 105581 100967 98475 43134 38305 62911 24886 47740 56036 64139 67689 111685
15868 111685 127280 129441 135575 98568 39272 -3974 -4613 17379 31263 83910 105421 59075
15856 59075 21616 42094 32713 41811 58948 64425 30043 55474 81693 109512 76921 27953
15844 27953 10682 31972 61830 95754 97470 56160 -4789 -47694 -27435 -35919 -15108 6529
15832 6529 31031 41234 24123 20184 35818 16320 763 22581 38954 53121 63226 56792
15820 56792 65993 51845 29130 26909 19829 40288 6915 14222 27987 -8004 20684 34931
15808 34931 38881 9644 -24584 -14619 25504 15736 36128 30716 33202 62188 66358 64915 91740
15795 91740 87381 83477 110521 107111 103771 87170 111710 138447 142244 156764 130135 83854 68749
15782 68749 105288 129410 152263 161943 166994 233835 253853 242143 194649 171059 193612 194180
15770 194180 193425 157231 149986 201656 225805 207077 163696 133566 143503 138866 141643 166731 200346
15757 200346 186902 148602 134674 125698 86809 74691 106759 112122 114992 103682 85426 91640
15745 91640 88630 84154 71802 72021 87287 57970 21410 57506 61455 62188 71308 86777 66358
15732 66358 63772 42956 28937 50687 64970 82495 85973 96639 68958 34907 68266 63827
15720 63827 50826 57881 57024 37926 50226 69664 67366 56060 28421 24834 67022 71572 51522
15707 51522 969 -23029 13205 76800 96384 128075 107416 94022 107058 101475 119838 129959
15695 129959 137123 116425 95821 57032 64430 56663 31894 41074 60325 82106 80677 50840
15683 50840 44747 44297 64871 44831 19452 8099 17866 7733 -797 43770 66484 72517 54756
15670 54756 35151 60340 69788 61631 63050 40873 20161 25598 58210 78198 66568 63957 69335
15657 69335 38102 1698 15017 21593 39174 30084 54444 55004 51977 19991 -36894 -15682 24460
15644 24460 17553 825 12098 13930 -11725 -32872 -17402 28870 68580 65361 31760 6108
15632 6108 2506 5023 23877 15859 12448 5044 -624 -11054 7936 27264 41766 39020 39244 21431
15618 21431 21350 13215 57858 74413 45889 37742 31619 31053 56957 60651 68800 73866 31682 1899
15604 1899 23702 62838 59311 49440 15483 7985 19142 25641 16550 1260 -34439 -41240 -20888
15591 -20888 -26486 -6828 27451 52200 6696 -24926 4940 66557 76817 73391 17759 -12836
15579 -12836 -15208 -3845 -30644 779 10958 -9991 -741 -2774 -40945 -10199 -21320 -19902
15567 -19902 -22289 -49488 -40191 -30876 -50918 -57766 -52475 37005 54334 51368 29650 4523 46305
15554 46305 69360 51080 47284 32058 16588 6749 -6770 -580 -22945 -36483 -62845 -69574
15542 -69574 -32493 27629 74838 81952 87892 109388 152564 114658 100780 108392 93723 90774
15530 90774 91384 65175 77680 87483 123896 165411 209752 205251 167560 127859 119708 146354 179708
15517 179708 151535 161124 142728 112680 122104 162805 169913 152123 186218 174369 127589 76997
15505 76997 49687 59877 95632 162240 208092 193560 162020 149177 135669 155907 128729 73064
15493 73064 63930 81309 93599 126194 132192 115829 112041 104085 108077 92528 37931 44060 92589
15480 92589 74348 41406 13576 -1691 -33962 -14838 12818 31317 -615 -23407 7162 23391
15468 23391 -1844 -18163 4116 1581 -13013 -7035 -11160 -3501 13779 17166 -15137 -48710 -31858
15455 -31858 -32347 -47783 -36177 -28726 -47096 -38354 2500 38959 23568 43259 29224 19590 -10214
15442 -10214 -31616 -11326 66 -12989 -41039 -33083 -30133 -18247 -12657 -17778 4528 15346
15430 15346 10766 995 -12642 -3886 539 3828 -20274 -23896 -18726 -1598 14232 16326 15766 16986
15416 16986 -5900 -11142 -18808 -49576 -37252 13046 -2993 5982 -1506 -35299 -12272 46558
15404 46558 39046 11264 -4470 -2713 -9912 28233 5456 -23696 -27372 -30908 -36877 -6002 21757
15391 21757 45863 55503 41240 -11762 -24334 -11281 -17077 -11759 29249 47768 2210 -25771
15379 -25771 9345 -7219 -21572 -24843 -30978 -14502 -14795 -12015 -9137 18460 50903 48428 35893
15366 35893 32567 7474 2191 -40176 -20599 4324 -2331 -10174 4435 1794 1355 3131 5983
15353 5983 -34883 -28547 -27477 14598 9178 -28990 -19484 4477 14239 20265 26444 16374 -719
15340 -719 13915 30078 22364 -2606 -321 795 14313 5177 -2998 -26471 -52569 -47091 -23173
15327 -23173 24161 -3929 -28296 -31389 -49536 -28014 -12853 -21106 -22379 -52542 -79668 -88174
15315 -88174 -95893 -66198 -55417 -49409 -25939 529 4389 -27707 -14274 -16637 -74099 -126616
15303 -126616 -120556 -57503 -18955 -22524 -38028 -62658 -31940 -2358 18573 9030 -6448 945
15291 945 -14366 -13145 3509 -23360 -36004 -47969 -51889 -70357 -84243 -44757 -35610 -49098 -42437
15278 -42437 -38814 -33399 -43156 -44110 -17504 -10293 -26248 16352 70930 65757 44049 -24055 -51218
15265 -51218 -43118 17335 41883 49187 -18740 -69038 -51536 -38616 -47691 -26166 6603 41034
15253 41034 16955 -59306 -66586 -20013 -47686 -53837 -16715 12240 20087 -22929 -34587 -35343 -32004
15240 -32004 14437 22615 4305 -38049 -21420 -3 4524 -13982 -53128 -60972 -49626 -23118
15228 -23118 -6430 -40351 -46451 -40075 -36782 -46758 -31440 -46651 -53214 -31400 -14640 20518 -4896
15215 -4896 1945 526 -4509 37137 41343 -12827 10150 7952 -33484 -64482 -64512 -33093 -34280 -65601
15201 -65601 -34116 -5350 -5017 -13615 3014 -23551 -30514 -41750 -60147 -95164 -127073 -130458 -70494
15188 -70494 -71287 -80318 -84836 -62354 -56363 -43801 -38649 -8299 -434 -34046 -52032 -27549 -11427
15175 -11427 28599 68192 37863 15685 -14903 -11427 -27851 -18275 -31853 -24799 -5682 -9879
15163 -9879 -56660 -58758 -36234 -16355 -27365 -16075 -4502 -11688 -41063 -59007 -27840 -20787
15151 -20787 -13257 -9583 2103 32539 14996 -32094 -21115 15905 5281 -34401 -51718 -4048
15139 -4048 33476 40263 37839 -2991 -51771 -70191 -51508 -44535 -16112 -32950 -47889 -24102
15127 -24102 -18760 -13870 8323 -9627 -54819 -66896 -49294 -49572 -49610 -30474 3891 4061 13254 18177
15113 18177 -16310 -61373 -73173 -38288 -26506 -52435 -51648 -59792 -72471 -38643 -30256 -39479 -60572
15100 -60572 -56790 -37081 -38245 -42595 -66756 -63905 -22365 -1622 -3586 -24128 -39548 -26385 -21768
15087 -21768 -45442 -59377 -23230 1081 15765 -9864 -71034 -85713 -62870 -59138 -32060 -65370
15075 -65370 -98402 -99438 -85374 -61273 -64511 -77599 -88781 -99521 -96176 -77726 -38978 -79132
15063 -79132 -90656 -71383 -81553 -80529 -79525 -47020 -52515 -56949 -23356 -8034 -5937 35767 17009
15050 17009 -8599 -55611 -26291 30889 36740 16051 7059 -18370 -47357 -58702 -34936 -49986
15038 -49986 -101300 -111824 -152843 -136122 -66728 -50795 -49190 -70183 -57664 -23028 -44499 -14505
15026 -14505 -13151 -20311 -14435 258 -22329 -57572 -42077 -15041 2740 -22400 -54981 -48186
15014 -48186 -37300 -51194 -64487 -74742 -107274 -120415 -118963 -82782 -76135 -67865 -70691 -61644 -55712
15001 -55712 -44959 -32764 -27761 -1198 21748 13562 6079 15925 17524 -5540 -15806 -442 -31352
14988 -31352 -37041 -13836 -18982 -29736 -49001 -54227 -73320 -64933 -91755 -112754 -109987 -69985 -61582
14975 -61582 -87629 -101630 -66450 -8436 -14734 -7751 -36295 -26281 -28763 -57404 -7301 -27773
14963 -27773 -50015 -56298 -41146 -57082 -57621 -56590 -71533 -64781 -71568 -49420 -61464 -91890 -92399
14950 -92399 -93037 -93906 -92375 -47698 -19732 -38844 -58584 -35112 -47612 -95706 -99430 -109298 -81314
14937 -81314 -49638 -21212 -13551 -31245 -15895 -41864 -48357 -46832 -2280 6547 -16718 13563
14925 13563 27869 15533 15125 7120 17269 7524 -31248 -12294 21500 25250 5051 -12150 -39248
14912 -39248 -22532 -23631 -40554 -13932 -29541 -67554 -65177 -93986 -79708 -93159 -110069 -66675
14900 -66675 -25842 4027 53868 62262 43464 898 -31188 -49012 -71437 -73070 -37928 -54833
14888 -54833 -89446 -77772 -54313 -40304 -31440 -17811 -37199 -61568 -51947 -53566 -52659 -51831 -17150
14875 -17150 -13203 -24442 -13734 11163 11817 -19639 -56350 -47006 -32634 -29366 -67656 -81708 -44963
14862 -44963 -29165 -41552 -16509 -32236 -60367 -83672 -49210 -17335 -35454 -6807 -10855 -12817
14850 -12817 -23227 -14281 -15189 -15172 -56771 -58078 -44216 -28820 17643 43505 -18460 -96078 -117681
14837 -117681 -77524 -57101 -64162 -30654 14520 17573 -122 -27265 -39329 -54019 -56349 -28846
14825 -28846 -29766 5434 24885 -19547 -41283 -28251 -18962 -15742 -18306 -80083 -113412 -74808 -26767
14812 -26767 18475 24095 49673 81806 83882 51019 40721 34763 -10315 -58751 -84347 -111412
14800 -111412 -137165 -145206 -120705 -68197 -69191 -75938 -67295 -80341 -75699 -68845 -72998 -83276 -63230
14787 -63230 -53949 -76681 -60205 -23101 -38316 -67727 -52141 -15730 -3886 -19802 -40520 -31763
14775 -31763 2379 12677 -29201 -33160 -61131 -81634 -81925 -70840 -17925 -35144 -48544 -61726
14763 -61726 -48135 -14719 -13971 -37929 -67132 -54848 -11110 -24161 -20222 28736 50110 34392
14751 34392 16980 -25607 -34553 -26026 -39720 -14485 19131 -14893 6883 39910 27974 4923
14739 4923 -2775 -24060 -30698 -29614 -25885 -71436 -66857 -93094 -88710 -79635 -47520 -21268 -29358
14726 -29358 -16738 -16048 -21748 -48946 -108783 -83140 -26920 13729 23823 961 -31099 -52467
14714 -52467 -69891 -75875 -86096 -83061 -101644 -82952 -92002 -72453 -65596 -77468 -84713 -86511 -65045
14701 -65045 -36939 -37920 -25278 -25367 -59425 -65045 -55331 -53858 -44428 -59736 -78054 -68158 -67747 -71909
14687 -71909 -63698 -45768 -33376 -21012 -39378 -40072 -35597 -8764 20805 -6021 -40348 -49672 -46002
14674 -46002 -38455 -33805 -12347 -23296 -44349 -62811 -73669 -62785 -28674 -28291 -23664 -17628 -16561
14661 -16561 3140 10322 1178 -1060 -2845 -25817 -51172 -35815 12453 38986 23562 -5027
14649 -5027 -20542 -7437 -19931 -13274 -21292 -27689 -18448 -10182 -22736 -5746 3440 -24707 -112314
14636 -112314 -120387 -105718 -93556 -108551 -160992 -129340 -44693 2256 31883 -16688 -48732 -62775
14624 -62775 -84288 -72361 -30624 -16540 -32308 -35305 -11878 -16139 -4656 8284 -43793 -78523
14612 -78523 -63683 -47850 -32659 -25321 -11527 -48003 -40911 -9292 -26929 -18017 -74434 -91150
14600 -91150 -46367 12874 17174 -18392 -23153 -39478 -73940 -115370 -105190 -70392 -94426 -95909
14588 -95909 -88165 -51991 -60916 -68470 -75880 -76622 -78025 -41291 -13679 -7390 -11117 -23976 -52168
14575 -52168 -63448 -70988 -60631 -31990 -59041 -97319 -31325 16605 22975 -12905 -30727 -34721
14563 -34721 -66285 -86428 -69354 -57327 -145902 -168721 -122368 -79035 -53158 -68102 -49917 -39659
14551 -39659 -62401 -44956 -38395 -46635 -37095 -33693 -13530 -11818 -10112 -12865 -11109 9016 7928
14538 7928 13273 567 -5253 -42448 -54621 -66368 -66328 -83918 -102825 -114434 -114938 -84354 -46038
14525 -46038 -71060 -77890 -64077 -30285 -29625 -55698 -43479 -34578 -39758 -76505 -99343 -12574 -1460
14512 -1460 -14310 -26746 -54487 -89367 -73527 -12382 -5538 -2457 -19110 -32723 -41209 -53740
14500 -53740 -69713 -71383 -60176 -37506 -49133 -45151 -17676 -19180 9364 50301 26364 -9839
14488 -9839 -61409 -58959 -65045 -26196 -4728 -14666 -11919 21461 21705 19868 28061 -21261 -40590
14475 -40590 -18003 -20854 -14457 27789 -12905 -53801 -73791 -66149 -62058 -73694 -54398 -52391 -50115
14462 -50115 -48894 -48134 -57970 -37120 -20745 31732 98009 24888 -31205 -33219 -40861 -21142 -3678
14449 -3678 15698 28584 13562 -39337 -73827 -69181 -47494 -62091 -51952 -15288 42554 11815
14437 11815 576 16920 6078 -65863 -40962 -417 14484 -16505 -60389 -66277 -60027 -43537
14425 -43537 -62518 -58051 -32774 -32149 -53292 -56198 -37234 2677 -8974 -13817 -24906 -29827 -22893
14412 -22893 -27913 -37983 -18799 -19210 -21536 -40808 -25638 19644 2889 -5487 25724 53208 14420
14399 14420 -19700 -35229 -62443 -51447 -58143 -39544 -10891 -25788 -37692 -11345 -41608 -53093
14387 -53093 -75928 -35732 -1808 -62652 -76445 -83341 -88552 -76774 -44738 -24062 -26280 -31122
14375 -31122 -35199 -59951 -81215 -82991 -100299 -98248 -63488 -27295 -68007 -118504 -105946 -68452
14363 -68452 -62559 -23601 966 -3506 -17185 -18480 -16873 -18264 -17876 874 -1257 40031 72176
14350 72176 72043 34165 20405 -5738 34165 35995 21502 -22605 -37187 -41019 -53271 -71814
14338 -71814 -69782 -47587 -49533 -32076 -59238 -85506 -54457 -29252 -26328 -31846 -29471 -44982 -39140
14325 -39140 -29508 -36330 -87550 -81840 -66907 -61209 -46743 -45660 -97523 -69953 -32241 -20480 -45510
14312 -45510 -47627 -34712 -64879 -67329 -52499 -22243 -8601 -33111 -38658 15889 31595 -9791
14300 -9791 -28348 -43201 -46433 -56165 -23601 17422 31411 31308 49206 21902 -15034 -3965 25495
14287 25495 38179 34163 23984 16257 21146 -12292 -39796 -52063 -57627 -89986 -101254 -63349
14275 -63349 -31938 -23554 -52457 -19015 -10088 30915 49800 16538 -1042 -4900 -15061 -18196
14263 -18196 -24161 -38245 -47038 -46441 -49052 -52367 -71075 -48016 -79118 -57318 -35466 -44822 -14673
14250 -14673 -14553 -48491 -76067 -65236 -71847 -44262 -15922 -16722 -24314 -482 11807 1710 -14240
14237 -14240 -22094 -41262 -60275 -70972 -85443 -29505 34041 62737 56922 41452 24007 -5145
14225 -5145 -59750 -73706 -78113 -125908 -107297 -99497 -111289 -112563 -91469 -22403 2434 18762
14213 18762 33537 33427 -17949 -13271 -26131 -39415 -11931 10507 26213 56408 47324 -245
14201 -245 -16442 -14510 -4599 9158 -24168 -37370 18028 12707 8717 19513 31720 857 -36651
14188 -36651 -42359 -41798 -38954 -9030 19093 5335 3684 -41508 -76500 -75131 -68032 -52962 -7591
14175 -7591 13172 5607 -58502 -75238 -36337 -35960 9746 38519 20193 19921 2344 -10682 -5657
14162 -5657 -16253 -23852 -25187 -27616 -3637 40553 55684 85307 78228 57951 46833 51385 28856
14149 28856 -31990 -47842 -40453 -56493 -34426 -31247 -39526 -38375 -30909 -21100 -42190 -37682 -19609
14136 -19609 -24839 -18302 -25676 -73272 -102420 -122942 -114844 -58381 -44095 -33293 -46031 -22179
14124 -22179 25598 5350 -46141 25448 38515 48219 54672 37065 -8483 -19946 3772 24040
14112 24040 19419 7951 10519 14598 32218 37383 15824 16242 10750 -9806 -29084 -39050 -28162
14099 -28162 10408 220 -17404 15793 27950 39910 29564 -6132 -42357 -32871 -30987 -29426
14087 -29426 -38844 -57795 -34325 -4292 39922 12265 -16992 2484 5393 10179 -1822 10275
14075 10275 11533 30434 19478 -8243 -27 31253 4355 -51927 -38330 -23112 -46221 -62253
14063 -62253 -54716 -57491 -47027 -59538 -60822 -78872 -69705 -65528 -80947 -94876 -72565 -54098 -44990
14050 -44990 -17155 -26233 -31127 15660 6541 -17287 -42644 -62245 -19301 7155 9408 -25300
14038 -25300 -10207 -14766 -49675 -47930 -61641 -67210 -68701 -49168 -18969 -22550 -53494 -21104 13454
14025 13454 9658 -36615 -13617 18394 42497 37446 13566 59156 59340 76566 71483 41126 3991
14012 3991 -36087 -40659 -67596 -76528 -78250 -45501 -26597 -23755 -23648 -22413 -29913 -46769 -53111 -40742
13998 -40742 -41656 -65331 -18458 18376 13873 -16562 -46361 -21494 -7410 -13500 -28976 -58217
13986 -58217 -21590 -2815 2453 -29623 -60540 -61591 -78565 -33257 9367 5245 -34335 -50602
13974 -50602 -38518 -30345 8892 17789 -4090 -26338 -13303 23039 23778 16922 40168 60298 59059
13961 59059 28992 7702 -4344 13754 16697 -940 -28120 -22404 -15601 -15095 -24811 -25128 -21904
13948 -21904 -11518 -15150 -26279 -28582 -42428 -28098 -49490 -33976 -21745 -15998 -41343 -39707
13936 -39707 -26911 -40544 -19772 -3050 3848 -34723 -52287 -16259 -59942 -83656 -54522 -40510
13924 -40510 -26790 -13380 -34890 -55329 16021 41754 35226 45096 31042 68579 106516 100545
13912 100545 67609 29370 10792 16757 -35798 -57144 -18949 -26057 -70487 -69235 -71772 -62749
13900 -62749 -73116 -58553 -60322 -52842 -54420 -43800 -37637 -21108 -8671 -23767 -34727 -27727 -41643
13887 -41643 -40492 -55106 -41095 -72655 -49682 -33673 -58731 -35048 -12635 -19242 -11077 -19754
13875 -19754 -27006 -21794 -36159 -54920 -68139 -69705 -73922 -61650 -77799 -47373 -17757 -2286
13863 -2286 1510 23405 17954 -1589 -11911 22982 18605 -9282 -51596 -33795 -33526 -38840 -49335
13850 -49335 -32669 -28841 -6432 -21281 -37939 -24419 -39549 4911 43415 24726 4219 7874
13838 7874 22466 54427 42665 -15181 -44114 -7967 24591 37873 35986 10949 19761 25046
13826 25046 -3243 -10049 -37835 -32432 -41064 -36051 -25117 14216 -2188 -35218 -44513 -25711 -2491
13813 -2491 25652 -3653 -23072 8455 21251 40776 81244 74178 42544 13937 4983 -7042
13801 -7042 825 24309 28990 14168 -16687 -5659 56593 54668 19515 26585 33954 41985 31165
13788 31165 10135 21577 31800 -423 -42841 -15972 23605 29247 -2624 -4815 -25447 -23851
13776 -23851 12471 8967 24341 1126 -14123 -9877 5610 4140 -26085 -30617 -43059 -17512
13764 -17512 41044 24222 -12259 -13652 5722 59224 88488 101677 63047 33407 -6577 -5542
13752 -5542 6591 44129 41781 39544 29727 31868 26606 26167 9892 -27952 -1309 -3 -4060 7688
13738 7688 19113 60124 68342 54235 33651 26300 4413 19764 23343 11243 -35684 -14968
13726 -14968 -29929 -42413 -42091 -48304 -55880 -25891 32528 29707 29303 14537 60623 56095 60589
13713 60589 48867 48075 78158 47608 34964 56677 59531 51474 18165 11719 7793 -6017 -6664
13700 -6664 -4013 -10796 -29831 -41479 -31933 -9298 -922 16879 61618 74421 84324 65030 86537
13687 86537 99386 66165 2027 2979 5582 10040 40496 57770 66069 48140 2662 -39965 -9066
13674 -9066 3316 8759 4897 -1767 27021 31485 15190 13302 18707 6545 10174 18910 8425
13661 8425 7599 17366 10889 19746 20210 -13796 -47248 -98949 -87414 -44740 21686 6508 -9226
13648 -9226 -17023 -8538 12867 38726 15638 -23373 -27968 -948 15385 11663 1702 -9468 36286
13635 36286 70966 82621 70515 46366 44500 51952 68019 110216 136445 123555 94292 63987
13623 63987 17280 13500 15426 34846 62090 65135 36888 30562 610 -26219 -15645 7996
13611 7996 -12685 -57327 -57013 18015 16709 39515 38107 16004 25863 38776 30352 47352 55782
13598 55782 55120 73501 96050 88192 38088 24100 53025 29545 1493 30569 2587 -20352
13586 -20352 -24518 4387 34728 26480 -23233 -50533 -31325 1555 23769 295 -18381 16874
13574 16874 28217 4586 7480 6742 12936 -21555 -57716 -18079 -13297 -6080 -5587 -3975 -19901
13561 -19901 -29464 -3479 18348 11095 -3148 -43203 -42453 -14300 -3249 15592 13537 1278 -5347
13548 -5347 12299 -3665 -10924 4089 10999 4569 2600 3579 -9484 -19335 16365 31600 21988
13535 21988 8677 -13633 -13991 -14319 -11580 -11890 -4324 30921 34756 45928 35376 -16822 -41506
13522 -41506 -44010 -31997 -29482 -34493 -41319 -45637 -5082 31360 23583 30859 20877 -1226 -9102
13509 -9102 -1972 -30340 124 22721 27800 6616 8757 28074 -22856 -6786 18738 30649
13497 30649 68029 62563 53678 77000 60699 44630 53714 17013 9521 14736 8867 13018 12452
13484 12452 45972 65628 32273 41196 2413 -11623 -55484 -99846 -69037 -54488 -45872 -45393
13472 -45393 -56053 -68585 -60803 -76740 -85023 -52999 -15841 -3598 -7531 15628 -26565 -49972
13460 -49972 -23230 -9217 -10305 -11840 -12310 -29049 -76702 -81806 -52591 -27347 -46335 -49295 -30749
13447 -30749 -4955 11680 42067 74795 64219 17113 -24034 -41169 -52680 7641 22546 9353
13435 9353 14669 -3623 -2647 -12705 27939 22514 -28304 -39126 -22890 -5142 1923 33146 29414
13422 29414 -5353 -44708 -63880 -29461 -5068 -24585 -59688 -48416 -15153 7997 -22540 -44687
13410 -44687 2547 45083 54673 22652 31450 4023 3552 33745 76961 99868 39801 -2269
13398 -2269 1536 -14498 -4852 -27951 -11713 -1349 -13726 -11488 -17992 31536 37925 -19270 -24313
13385 -24313 -17464 2587 57712 72815 42710 12796 7253 24569 60033 40184 6554 -25921
13373 -25921 -27931 -14433 -39241 -28693 -24570 -33834 -23812 1085 -21911 -41905 -29851 -31467
13361 -31467 -9843 8229 38755 51403 55993 77749 79001 68015 91319 79830 67417 42397
13349 42397 41694 54327 70425 79683 79847 41917 25535 20364 56639 111733 116796 76778 68456
13336 68456 69156 28672 -27439 -34001 12581 -16541 -62703 -13474 30575 45559 44328 53634 61131
13323 61131 45772 2425 18667 15447 15079 13881 28526 22018 68459 117221 95604 57046 45386
13310 45386 65456 88828 88648 76751 71320 69397 79640 62225 54980 48163 18333 3820 12388
13297 12388 18405 32901 35050 60283 95218 74231 38117 -3097 -3353 12649 -31806 24554
13285 24554 57465 55143 47306 52660 92951 135237 108378 95557 98565 93810 65039 56215 85921
13272 85921 99219 102360 92399 102300 111258 116561 103175 133642 186087 193702 232243 239477 211416
13259 211416 150453 141839 139002 131070 102723 102992 141469 150549 105588 110897 149063 157888 153280
13246 153280 123266 85211 49516 62364 56305 37306 72616 114578 124750 128355 114027 108757
13234 108757 89516 72446 75789 96058 95494 72386 89455 114557 128846 98121 82352 99933
13222 99933 70215 57601 92907 101442 91908 53827 97022 90776 54373 23158 2033 23141
13210 23141 31478 19319 3144 26230 21437 -18458 -1784 25294 12210 37964 81149 73155
13198 73155 94842 64863 49015 44283 21125 6350 51643 58308 34398 21021 61653 74498
13186 74498 85639 102563 105076 98336 99766 87439 62760 30905 -24955 -37128 -14917 21359
13174 21359 21214 42913 55570 59721 62676 39352 55786 61089 36182 -7303 24242 107593 143678
13161 143678 102106 81853 66157 79239 104598 103121 70391 74653 61945 75902 53033 53971
13149 53971 91489 98797 108737 141301 110602 85808 64171 72670 89368 69543 63400 60419 66568
13136 66568 81714 37617 21652 39964 44800 74831 82829 43390 41562 76584 97787 120573
13124 120573 159220 133825 102093 92489 92973 73682 79752 84156 127896 121097 92837 76792 57456
13111 57456 44173 32791 40993 36037 6853 43238 96833 154897 109548 103367 92799 63554
13099 63554 25377 1082 171 8373 48263 61290 20739 -12892 -8667 42897 87653 115570
13087 115570 92444 78826 71901 85232 49434 46912 25579 35268 53496 48269 67802 59447
13075 59447 51613 25268 47456 124008 126021 121893 83627 79770 57265 52464 27488 19986 35851
13062 35851 56322 35472 -5591 13592 15134 8182 41862 54926 77190 63986 53250 82786
13050 82786 81661 26300 -30307 -27450 23887 22773 8350 25127 6817 13874 47289 84853
13038 84853 85954 80888 105376 95492 81538 86927 76477 65530 39709 33098 38741 36113 5030
13025 5030 17732 17252 23926 20063 -8030 22949 32613 36259 34085 32209 46293 33323 24050 46526
13011 46526 58451 34030 28435 50140 59358 28762 5444 34759 8993 -9855 20966 39279
12999 39279 29036 89823 114831 96103 103971 107225 82297 44519 84779 85291 69641 83337
12987 83337 83722 93421 90012 97103 115484 52636 19912 43029 79542 117457 107817 88086 88811
12974 88811 70187 57951 44165 54122 49185 58571 48582 23924 -7518 10438 61256 49915
12962 49915 49116 66323 80634 84597 86287 114120 118604 93687 76070 63373 59123 73779 66424
12949 66424 103965 109787 91649 83023 93908 135238 158272 150809 107585 73465 89874 117020
12937 117020 119823 102073 59868 41454 33293 25645 33232 72144 84413 87583 60339 53388 34091
12924 34091 32433 57258 72473 65044 78828 78369 65990 98515 131919 110700 106123 54225 27043
12911 27043 61715 92629 69874 46652 19463 41752 41034 63373 87244 71092 97698 131817
12899 131817 121995 84705 94307 165037 187163 169018 107893 69635 92977 87700 88468 92932 93971
12886 93971 71369 60558 86471 88273 80267 87879 88429 81693 87695 108510 86966 33104 16741
12873 16741 23786 22001 28465 32777 51187 79641 79531 80061 77944 82936 88080 83258 104520 136954
12859 136954 123646 119148 127494 96564 68403 78128 114109 133872 144088 113839 130844 155077
12847 155077 128478 84233 89909 107166 95485 91870 77524 84978 100832 81599 85413 122711
12835 122711 126491 94473 65623 65332 102245 120142 125403 133813 121915 82050 103782 121459
12823 121459 130036 84207 116113 130264 132448 139567 147216 160079 135686 118850 122450 139658
12811 139658 139196 102117 116931 130384 125139 128608 163385 140074 117149 108575 82749 68783
12799 68783 49815 36771 28451 41928 46930 59143 61998 58276 45274 43077 18957 6674 35840
12786 35840 48689 54818 49379 33730 43140 44088 31548 21831 35366 74891 43865 48463 81505
12773 81505 81175 60190 43372 54399 67600 110215 90305 80415 63981 81741 122446 153366
12761 153366 144170 123207 160724 218963 205207 160428 170925 139330 115853 100601 78293 90258
12749 90258 88493 88378 93354 109355 88310 79366 110847 81178 90374 100011 122858 102741 90456
12736 90456 70728 81877 78982 51442 32649 51948 85653 112010 90550 101621 111715 108613
12724 108613 111891 108239 106332 112010 103343 123473 124347 104110 85397 81278 106796 152489 161144
12711 161144 172889 166433 164382 185603 198466 163842 144542 138343 148823 151159 131489 167364
12699 167364 179689 174099 183428 198611 217753 199011 171349 145563 140664 157110 150583 152719
12687 152719 149496 172180 192664 185634 164853 144970 155913 160977 161426 157025 146986 126781 176369
12674 176369 202952 217817 210261 239825 237498 213595 211489 221162 196347 171255 156268 178279
12662 178279 204329 193321 174065 135957 128046 124379 124413 144267 119114 135495 163358 100856
12650 100856 89526 94176 83483 70623 80377 102862 112308 107588 117914 114745 110512 84413 85641
12637 85641 81541 70825 83376 114035 152883 144528 114628 108684 75768 21587 6732 29871
12625 29871 50607 87225 69518 70909 62008 73085 95823 112661 99902 91097 97040 66335
12613 66335 -1034 6909 54147 58029 44084 69224 75539 59822 62574 67061 97988 139278 156369
12600 156369 97070 72864 64422 99747 105096 120734 151521 133567 102642 96559 97890 124366
12588 124366 143151 106708 120863 115552 89445 63827 69811 60965 102406 70824 67681 132506
12576 132506 150003 95205 85884 61877 13309 44271 51545 67329 54201 38628 54642 61013
12564 61013 64865 101173 98516 74734 99457 105082 118113 101116 98026 113315 121527 102291 79092
12551 79092 52969 71473 81850 73784 80626 72819 46881 36850 67369 79679 91887 92379 88112
12538 88112 87434 55998 46817 43293 49764 71395 67056 79318 95041 124592 102380 108724 85016
12525 85016 48328 55833 64423 117376 141589 133592 83131 61328 94192 107994 69096 86465
12513 86465 103271 100844 94511 92952 117124 124823 120052 106446 102846 74085 63563 8657 18013
12500 18013 71594 84284 88425 66853 39365 45893 23072 50751 86350 114796 118460 89918
12488 89918 64864 104182 108008 82505 94738 105370 97926 75558 97572 98463 104889 100307 67753
12475 67753 52536 72906 55581 64142 85542 89443 69994 67022 108415 84785 51380 22619
12463 22619 -7931 -12161 -22080 6903 83738 90631 78226 53658 65107 40522 7667 -35509
12451 -35509 -13727 25710 54510 63501 97434 61162 34772 39313 55990 51613 37412 80856
12439 80856 74899 69338 41525 49446 25838 -142 -17041 -19167 -25567 7139 57120 59740 32372
12426 32372 53468 65396 45177 29902 10049 -2392 394 11158 1786 24710 34226 57781
12414 57781 63758 69377 91709 97193 112061 88850 91654 119462 94232 71480 86597 98696
12402 98696 90317 72556 44637 43697 33904 54405 63317 65935 65761 53623 23896 586 217 37256
12388 37256 70001 74179 38787 47912 67544 54434 36865 50041 77026 96401 104218 52883
12376 52883 45744 37234 42506 89165 91737 34026 11591 -7356 -1313 9878 37900 72301 83521
12363 83521 73727 66984 46028 38434 17175 19964 25842 43540 52002 42651 26350 8365 20051
12350 20051 24706 41227 54411 76317 83536 58438 21063 9394 22026 62801 65851 40761
12338 40761 20258 31029 22537 11444 20309 26115 77900 66556 51039 86969 114990 77677
12326 77677 36635 42773 63731 62304 69042 57647 70044 79684 74744 49910 53755 40347 71891
12313 71891 78018 51364 35950 47198 62200 47113 41646 33368 27414 60968 65965 68685 66223
12300 66223 69784 86277 86969 63799 78001 90987 42675 44873 32691 19273 -4183 21711
12288 21711 49613 68630 59896 69788 33528 -978 2295 1517 18846 31721 10088 25669 24903
12275 24903 6498 12335 3729 -50366 -32393 6493 28443 56493 80091 93211 102937 86341
12263 86341 60493 51492 10865 -12766 -5097 -12968 -20622 24599 67040 47392 22035 8027
12251 8027 39742 46838 52622 72670 71157 86600 92502 79218 47629 60183 92086 139009 105016
12238 105016 75115 104096 109221 78124 73505 77198 76527 60336 54475 82755 75263 56857 56103
12225 56103 24512 9617 23893 81964 113895 78582 45998 26137 47203 79194 96137 91406
12213 91406 25555 22745 40427 65665 36758 13975 -1929 -20465 -34992 -46699 -49756 -7840
12201 -7840 10164 27847 7334 39310 61245 101533 70507 35398 51728 89968 63569 64112
12189 64112 44677 24759 7063 22867 11427 -2183 6537 3708 19480 55914 46551 -25982
12177 -25982 -28619 -136 20169 14074 38029 64897 66169 97881 86386 49893 21359 18370
12165 18370 19085 40319 69552 93327 100039 93155 68713 100576 97204 56177 35822 37093 55898
12152 55898 10652 -12028 -18416 14985 59226 53799 17717 11903 341 7 28283 45410 39936
12139 39936 93125 142938 114556 105283 72260 59883 114823 100628 73065 61787 83707 90988
12127 90988 89620 118529 133679 157584 147699 104106 88664 94749 115448 102174 95330 122692
12115 122692 185463 207425 184258 110909 42476 25690 36611 65230 94990 105269 86658
12104 86658 83343 43944 20517 25678 39631 15473 14808 30162 39963 70941 96054 121697 124611
12091 124611 77045 45477 23532 8080 35629 43705 3965 -10175 -15633 -14326 -13313 984
12079 984 27914 51938 84672 95038 73142 42762 50943 47653 20895 39576 55263 49806 61371
12066 61371 49384 54401 101932 101187 80535 81749 73405 39064 -5837 -1752 43854 58470 67603
12053 67603 66378 46595 36038 21368 30453 44387 32677 -27365 -7365 24533 34731 29645
12041 29645 25618 26672 13255 18231 22999 25086 8558 10931 3415 5410 5777 -43744 -28679 -22598
12027 -22598 1028 -13892 6387 24535 41685 21742 50828 75047 67518 83137 87681 110772
12015 110772 123556 113637 109239 101680 83940 67125 50128 54309 51970 55436 23515 -11103 1009
12002 1009 -11225 -48900 -69711 -38640 47695 59108 88664 99892 79433 27273 17841 23597
11990 23597 -5444 -11398 3171 -2514 -4421 -14894 29385 37491 26066 54872 80645 68613
11978 68613 81871 86104 63962 44954 11459 -24935 -22071 9526 58251 30726 22269 42947
11966 42947 36533 37183 53525 50273 52481 26107 20705 24999 35840 17720 26675 17908 23474 20767
11952 20767 13886 28429 51858 65206 48725 29319 39504 76587 78836 54537 18771 7774
11940 7774 393 41547 39079 18776 62196 88389 105677 65333 35743 18198 59466 52805
11928 52805 41100 71599 118732 120504 103076 74683 76649 59757 38820 56260 92873 85640
11916 85640 38783 38222 61737 52086 68036 82935 81236 40444 32327 78541 93786 72018 74192
11903 74192 66294 78907 100372 91076 76704 63761 93515 62439 65703 60826 41743 14559
11891 14559 -1471 -4661 -13384 -53186 -48340 12012 83843 83274 87935 84507 98265 93207 81722
11878 81722 63849 82949 86753 20039 1022 1419 -3430 23172 49036 66473 64391 86739 61180
11865 61180 53390 67370 56355 44322 52982 20035 32251 34504 63246 80965 60315 49163
11853 49163 108286 138482 105128 60934 51225 70073 40981 6848 -10915 8158 24331 30915
11841 30915 35323 11936 -21854 8588 42163 34735 10982 -7181 22006 46867 52067 39998
11829 39998 33922 55266 52594 93283 110492 113780 134571 126026 65996 34650 29213 3164 13502
11816 13502 -19331 -14072 5679 42822 52850 27414 17965 -3986 13909 27691 62749 83558
11804 83558 63238 60047 65192 31136 -457 -11719 -14715 11372 21550 16282 -5221 6857
11792 6857 35469 45888 62507 49423 48570 36325 61160 91428 81089 59226 79251 108914
11780 108914 130636 112748 97979 142043 140891 68736 32052 44368 73281 92302 111698 103280
11768 103280 80884 85810 66163 60592 45955 29926 34490 40303 44441 39146 50066 55649 61725
11755 61725 96659 117999 106417 68837 73399 79767 53122 62023 67983 65956 77461 96232 115484
11742 115484 101970 111843 76006 18446 21232 26513 747 5331 65528 95725 78879 68027
11730 68027 56706 17357 25088 52018 57120 62913 46848 -19224 -3222 61394 90448 52797
11718 52797 31298 36591 22079 33687 66928 50874 12444 10244 -16900 -1485 -4577 54578
11706 54578 107253 103836 102990 76526 65298 51052 30125 46713 36692 21839 59764 60032 59801
11693 59801 38117 26228 17898 8362 57987 100926 86607 27936 -21405 -4400 5043 -21541
11681 -21541 -23827 -42683 -62432 -74570 -61812 -21999 513 46843 60114 26853 7914 13206
11669 13206 54646 32974 7584 17201 1817 -14365 29129 43552 34697 26609 9185 -9964
11657 -9964 -10836 -27536 -54827 -65144 -44085 -38812 -42468 -16961 14368 5659 -2592 -3573 -17276
11644 -17276 11133 23839 23293 -6204 -2141 42135 53935 43229 17875 -38221 -62974 -15818
11632 -15818 15049 33001 32703 29469 18541 40679 23011 -12469 538 5147 -15577 -48742
11620 -48742 -44891 -11830 8049 -4606 -25719 -11856 8279 37833 51397 12715 -29256 -23307
11608 -23307 35710 28266 -14713 9449 8978 -3939 44072 20516 -6389 -8567 -6226 -9690 -1759
11595 -1759 -7792 -1745 -7525 10166 17739 24810 13329 15138 17311 15414 23604 28227 -824 -12102
11581 -12102 -21154 -16074 1534 -30660 -42057 -40062 -57754 -20263 34477 -13453 -44215 -44158 -20011
11568 -20011 10950 23515 20264 15261 17822 30017 22603 16305 -25537 -24816 -24189 -33191 -26622 -6422
11554 -6422 -9165 -28970 -45733 -24811 -28317 -32302 -25065 -38279 -12567 14299 27105 -419 -13402
11541 -13402 -34059 -35146 -9886 -4225 13632 24367 53137 86812 49806 35961 19729 18022
11529 18022 6189 -9806 19411 39356 61367 43029 -18364 -28894 2310 -6521 -28750 -27609
11517 -27609 -10487 11019 19344 -16663 -44238 -37294 18378 67526 41522 22501 47694 40938
11505 40938 66591 51668 23802 37922 47078 50078 70734 44161 8673 9505 14488 15999 14780
11492 14780 18098 61006 25022 -2080 -23216 -11415 -742 -4593 -10840 -35238 -1209 1608
11480 1608 21115 13331 -2519 -13465 -13854 -12327 -19863 -8595 35875 13877 1586 -13937 -16416
11467 -16416 -48058 -17705 10272 -9435 -40142 -62726 -53198 -27544 -38410 -39964 -5345 8320
11455 8320 1259 -3879 -34336 -13223 -42742 -69704 -55609 -43560 5002 36602 32552 -6903
11443 -6903 -56091 -61804 -17982 9043 -7334 -39911 -57706 -7304 40891 75836 41764 16048
11431 16048 9183 -3042 14590 25020 29882 73 9708 -6573 -30012 -17306 50861 53911
11419 53911 22079 372 -30454 21542 37516 -3951 -12291 -13498 -38538 -53971 -44796 -35996
11407 -35996 -4905 33716 -4694 -23711 -23092 -9336 5585 22816 33915 15553 3302 17529
11395 17529 -13072 -7631 -31686 -48027 -53389 -23348 -20615 -37081 -23498 -27367 -7229 20162
11383 20162 46758 42107 6281 -16567 -2510 -10351 -34709 -34670 -43235 -33205 -51340 -33134 8197
11370 8197 8223 -905 11572 25638 28114 21817 27088 13876 -15091 -11056 -12803 -17378 -5631 30579
11356 30579 15800 19961 -12099 -55741 -29853 22815 9747 7124 5172 -14284 -15962 -29671
11344 -29671 -4669 25224 17615 -14940 5365 41891 28907 41930 38451 26849 46133 56885
11332 56885 50471 23279 25148 33797 30437 33013 23418 14374 -3591 -34283 -81594 -84672 -56377
11319 -56377 -11588 36578 63907 44332 25368 -3150 -16383 -40126 -34926 -12058 -54911 -62947
11307 -62947 15835 64235 83869 79514 44543 58677 52960 18188 -29078 -53767 -32638 -21658
11295 -21658 15745 -518 -5123 44218 65607 39677 50457 45291 2070 -4116 6310 32963
11283 32963 23039 -65248 -77168 -62269 -49430 -44917 -20925 -27183 -46178 -38850 -22325 -39401
11271 -39401 -59292 -39992 -26758 -20899 -32903 2400 7339 7647 20135 12859 -29455 -19514 33456
11258 33456 25650 -2554 -28727 -3330 -9331 11890 39631 40583 29137 12123 -642 -41084
11246 -41084 -62312 -73920 -74303 -70971 -29767 -42192 -26401 9065 14778 -3528 -9010 -31377 -23236
11233 -23236 8254 12803 -939 6404 32109 10855 -862 27953 26086 11296 -5698 23169
11221 23169 1660 -6329 -7158 -27799 6710 40145 99158 125524 111656 86782 35500 15927
11209 15927 -3398 11779 21387 2842 7314 43868 60907 60811 90150 97243 70112 68725 46826
11196 46826 7530 -8817 11642 8410 10433 21412 41049 38568 15238 21798 17220 4672 -9887
11183 -9887 -27231 -21436 -6018 9035 -50662 -71852 -61419 -51112 -55003 -23821 -22595 -16219 -28580
11170 -28580 -28650 -48482 -31230 9808 9777 -22031 -27734 -42818 -33333 -16825 -19044 -10813 5028 31112
11156 31112 47632 18419 32365 39564 -13082 -8513 11590 19413 -663 15672 24435 25923 36941
11143 36941 -5116 -61102 -41976 -24697 -20011 30440 -2687 -49893 -13721 -14379 -19500 4616
11131 4616 21549 14636 24565 21290 16247 19030 80683 121499 100541 15456 -44383 -20677 -392
11118 -392 1486 12015 33435 3438 -1686 -241 -7175 19 41940 55487 49461 28453 62762
11105 62762 62684 67572 66562 16123 1799 -15316 -21914 -44141 -22938 -11424 -35778 -30129 -14574
11092 -14574 -3887 31301 20061 -48307 -58698 -22627 -9945 9181 -5844 7907 36151 62031
11080 62031 25936 24013 30648 -11143 -30709 -1852 13828 18706 1720 -5688 -3376 -41478 -38496
11067 -38496 -10597 17916 39771 38396 4212 12988 55177 78451 66659 34469 9259 25757
11055 25757 6628 -36739 -59002 -35681 -12207 -22133 -24467 -24256 14902 -32680 -28027 1510 45379
11042 45379 62679 54988 24777 28965 2623 8179 -18465 -28896 -58654 -31491 -3684 -1051
11030 -1051 12817 -6603 -19051 -23540 -37542 -10447 37039 33665 23384 15063 34203 18627
11018 18627 17033 41246 31236 42088 35147 28504 49198 50927 60333 38985 35341 29182 46305
11005 46305 28749 9373 25758 24994 65948 88703 76364 78886 71298 58894 15483 -14226
10993 -14226 -1365 5845 8854 22307 63164 107359 82256 59354 61192 18804 -3794 62687
10981 62687 59886 22357 -3139 -27494 -18179 25485 45892 54899 56325 36908 4576 -5218 -14728
10968 -14728 -33873 -10602 -44512 -71524 -36623 -4455 -7110 -8554 -8898 12649 31368 59317
10956 59317 58084 65238 72160 9812 -5178 7967 24579 23266 8280 12151 10446 -8567 -7711
10943 -7711 -32216 -68529 -22866 -6212 1222 -8715 31733 48913 5346 4470 22904 14039 15841
10930 15841 10854 26203 63649 48568 29833 15321 226 16114 35089 61255 116501 94128
10918 94128 27932 11528 9834 32687 6174 -26076 17016 52749 57394 50012 29518 -17075
10906 -17075 14642 50633 15236 -16375 -8823 -7059 -3952 22718 39770 39971 12356 -41270 924
10893 924 40105 18015 5829 -14100 -373 -13310 -17167 -2489 23928 18940 24211 4999 6503
10880 6503 2890 -39591 -19959 -30116 -18558 -30851 -32840 -4562 18117 -16 5885 15367 -9630
10867 -9630 9239 36672 95096 111713 42605 -6493 -41688 -46607 -41025 -11370 -12543 -4949 13483
10854 13483 28917 20816 10044 31785 10957 -35968 -58572 -41115 -12307 46444 20954 21243
10842 21243 25104 19552 6221 -28806 -1805 5540 -4149 -5628 16444 51648 54498 47933 71566
10829 71566 72999 46122 59172 71347 57363 57032 72578 79989 44226 36120 71052 61696 25438
10816 25438 25317 36154 14198 -13336 -12776 7671 53415 50633 32762 75724 74509 29174 9117
10803 9117 33185 70761 64021 24480 -28983 -38724 -33151 -63936 -84879 -37100 1203 29631
10791 29631 54780 31619 40348 25368 -27481 13614 15454 13943 6 -20754 14126 3513
10779 3513 -11506 -47743 -52105 -51546 -56036 16235 40711 387 902 59083 82585 69347 52504
10766 52504 28077 57489 82526 54617 44433 9668 11171 15823 6973 -2501 -9172 -19372 5639
10753 5639 26414 72787 83025 57805 10169 195 21112 47402 26903 19046 26475 33337 46145
10740 46145 63308 58622 78846 76949 63737 56306 61610 77205 89879 111394 77885 62687
10728 62687 55568 12541 8713 9159 31158 37958 64990 34843 -3951 15692 26419 43697 32337
10715 32337 20682 405 18935 55323 21962 57753 53000 31864 29766 36814 58852 28023
10703 28023 -13963 13184 24964 22131 27704 57403 31605 15385 -83 -11080 -12570 9654
10691 9654 36516 68896 33912 5890 15020 57080 112773 90347 81986 40933 18579 35820
10679 35820 47074 43990 10945 10612 33336 17079 21581 17940 21581 5558 626 29675 20673
10666 20673 -29976 -16405 14350 64822 43927 25301 54281 83669 77981 70190 83034 85434
10654 85434 51059 50182 63751 56082 53914 79756 108835 107081 32682 13910 20241 39710 40262
10641 40262 23063 25562 71102 82116 71427 84875 62840 45571 37714 22571 -18870 -3203
10629 -3203 37606 45244 13703 12140 47266 33003 13128 62838 108466 80426 36268 18476
10617 18476 41300 60566 53420 71419 74575 18099 49408 80094 88471 100690 116042 131431
10605 131431 114873 88073 92463 106231 120591 121790 74190 68754 89239 81546 71400 75041
10593 75041 105455 53520 33101 28862 26922 25490 -23208 -26400 46305 73651 60223 77386
10581 77386 86336 69327 60795 73938 73007 53775 48030 42280 53523 55528 45114 39826 44197
10568 44197 48731 27664 70777 91925 48199 -8627 -15298 14745 66966 53048 23165 -17003
10556 -17003 5209 19668 62693 90165 90889 65773 29559 -15524 20620 51048 16045 7041
10544 7041 -3324 6675 29417 50048 69178 47808 46717 35165 34849 17383 32499 66924 55816
10531 55816 -4899 -24539 48668 84617 56536 50086 59560 19530 69672 111139 117364 132549
10519 132549 124737 101408 84239 90577 85686 67144 56003 24138 -19676 6108 34774 49741
10507 49741 44186 38962 15475 -4267 34405 68024 60272 47031 28936 22938 46642 33540
10495 33540 37841 1155 -808 27030 30939 49228 71133 46479 36729 54911 64528 66524 93594
10482 93594 94582 80580 72385 46002 46654 73338 76582 104277 132628 123114 92330 127245 142076
10469 142076 98273 96540 114045 84471 129936 114062 69646 33909 58040 93188 83373 71476
10457 71476 88600 96755 79488 75780 110849 139148 127501 136339 105671 118031 104780 89242
10445 89242 109475 103287 94606 120127 139875 147005 147161 130960 115778 105163 119094 120285 89856
10432 89856 84740 85115 20806 33349 90104 116844 90920 71188 78630 78727 87378 110592 100209
10419 100209 101221 69466 71809 78139 66569 46934 52818 59100 95549 96851 117975 113012 135583
10406 135583 121411 110121 96811 107699 86246 42447 48457 102958 161354 166181 144998 132268
10394 132268 85192 78854 73141 95163 89710 43781 65569 88742 56587 69446 55607 54019
10382 54019 63574 93923 122409 114770 80960 62948 80915 101988 110422 111452 118813 147776 123914
10369 123914 101554 102364 114041 124048 79255 27661 37799 70697 104473 118618 120993 107216
10357 107216 80889 72252 110267 139420 100252 48559 25095 66276 110166 126559 113898 121978
10345 121978 133975 94983 67701 75589 75486 59016 44792 90809 125586 137580 119349 95105
10333 95105 56232 52198 82095 71863 49955 54992 54944 61069 22923 22289 27249 28144 27199 44565
10319 44565 98602 133614 156015 158589 134595 133466 145968 139844 99751 86325 99227 113518
10307 113518 97263 55228 56851 81994 74131 56707 61198 71834 78466 67846 45972 31101
10295 31101 32807 48091 69077 67619 88964 71369 108943 116456 126155 122475 129677 156169 177602
10282 177602 166502 138487 141096 157873 119262 105975 121955 165205 182065 168369 180715 145449
10270 145449 167964 158680 143760 135268 120865 128086 139618 144188 113168 130965 115982 99530
10258 99530 86558 80203 91584 101644 71497 117304 146702 136237 154568 137481 143982 161061
10246 161061 112785 85982 87781 77906 58335 52251 61658 71844 92236 133856 167140 179542
10234 179542 173214 162286 155581 171943 145866 112236 159073 156240 164170 160893 141840 133998 133578
10221 133578 163438 139126 142486 170302 168712 171032 170366 167411 168675 157878 136780 141212 158631
10208 158631 131586 128240 96543 80867 83152 101013 93783 89327 116598 148061 207953 180535
10196 180535 124093 136000 141195 87871 64749 60871 89117 87766 79568 74470 129536 128044 81500
10183 81500 79093 112495 104388 99073 76861 83816 78376 62683 80933 92237 95297 88644 109051
10170 109051 136897 117768 127787 157540 136442 100338 69412 103015 141921 141408 146829 81733
10158 81733 76529 77446 101396 102693 114802 153160 159863 134394 112425 84863 83397 78674 108717
10145 108717 118969 101837 107020 116725 110869 97064 101996 158702 164274 183901 199074 201123 138634
10132 138634 125229 92279 35635 47235 58693 91666 123396 107944 123566 154870 164588 160981
10120 160981 177762 167267 141649 131305 122839 109641 137023 141172 125792 119023 108003 117212
10108 117212 152095 156222 133589 163593 170286 122354 147228 194076 206687 203363 202436 190806
10096 190806 167872 162935 172180 187362 167662 159124 143060 168868 181982 207776 220128 230117
10084 230117 224778 209972 222043 225882 233839 246959 258183 263663 271908 306989 369585 432859
10072 432859 520709 601138 790045 941507 995122 1018126 977753 882340 779055 632641 507073
10061 507073 410705 344126 284169 242855 222554 212556 218541 179104 211610 233197 210964 210437
10049 210437 222663 221180 183316 187273 229231 244933 197148 184793 206396 199714 189446 202076
10037 202076 227332 209768 213992 211942 207599 188622 184682 201200 184790 146733 146966 157353 134389
10024 134389 96641 124147 157323 125437 150906 207993 226748 164025 158822 153864 126135 78008
10012 78008 110693 153688 154799 146860 163147 174795 198999 192123 174497 167679 162998 151128 161001
9999 161001 205005 199749 200528 190926 174028 191195 194666 169308 159003 192754 185725 199569 206735
9986 206735 180628 168546 182472 186029 205620 199355 215366 158231 124325 120662 157190 145232
9974 145232 122997 140335 176026 181237 169100 186954 176259 184380 196655 178344 169985 203697
9962 203697 248618 233990 255483 282100 260996 265781 277856 272715 268240 277698 300052 259804
9950 259804 234141 226106 206940 162909 157799 176570 181676 171008 212178 239382 232337 220061
9938 220061 202297 170924 175342 174025 200517 229285 228296 207964 172245 129109 141100 159817
9926 159817 168290 160503 191970 214576 227186 242432 226065 182276 175158 192784 178406 174695
9914 174695 176662 164897 170451 182035 176077 192499 175571 186076 196043 217978 195269 177588
9902 177588 155854 162293 178133 181491 188472 184340 162808 154795 149688 158042 162601 215073 243473
9889 243473 205798 191167 206215 202134 171199 149703 201467 218665 224171 229481 194812 173362
9877 173362 167908 138620 120420 171885 179356 172943 170762 205840 192173 160188 159998 157512 164122
9864 164122 205593 235387 232249 272572 239272 204347 204987 173355 156923 186979 225910 240928
9852 240928 211039 166477 194056 241226 231178 227366 203781 219239 241975 238609 282292 290952
9840 290952 241256 249800 265138 253017 244531 217425 237536 259802 250461 249062 200130 167984
9828 167984 191680 222390 243075 285974 296687 279774 263709 285973 295403 265393 285389 274077
9816 274077 259125 246176 227219 238663 253935 239869 278500 311782 289047 265312 269464 279320
9804 279320 252982 278251 280465 265918 271249 281820 322453 327185 307755 298474 280659 241808
9792 241808 216739 221574 279708 296419 281195 278207 281858 299215 295214 282917 287134 317763 324620
9779 324620 305535 276708 292833 300112 333717 335801 344687 327695 301496 298240 276984 273293 264844
9766 264844 264348 282425 292139 288521 282820 290669 312740 335788 331478 310287 299674 327459 301014
9753 301014 286327 306873 283291 279584 307600 298278 352093 346525 326774 334550 352852 348331 349160
9740 349160 357130 363023 336175 332194 371013 376915 384598 401453 402492 373576 342288 342106 346192
9727 346192 373786 392769 352570 294208 316883 352332 368753 376822 376487 361259 332830 348481
9715 348481 407012 448527 443970 433411 430731 407172 388799 429511 462799 451349 402014 351848
9703 351848 372656 384218 368205 393403 385899 371426 330119 360404 369130 342895 371800 367559
9691 367559 366437 352629 289704 233062 227283 252481 272622 294696 269692 265762 271948 284660
9679 284660 311843 330678 330267 322219 330902 365620 380163 374549 333342 358745 392374 397786 410638
9666 410638 394509 353196 345078 331927 319983 332478 362102 380982 354113 406263 408750 374963
9654 374963 385599 381228 348780 336351 318693 317237 321519 337387 347985 348577 355861 366342 332737
9641 332737 332973 362214 346143 329027 345957 354864 368871 375267 381065 366754 397887 391712 402470
9628 402470 427121 437250 409410 403915 420831 413647 362629 381811 415105 425424 384718 366594
9616 366594 373766 388093 382136 367769 353830 346533 335674 324583 287071 257157 245821 245272 246717
9603 246717 269751 252041 257410 298386 314486 305252 340514 338189 293392 301157 319708 318463 322765
9590 322765 339218 332644 336709 329970 325876 302425 313649 289937 270964 282691 312824 282868
9578 282868 267183 285810 308686 316018 262572 267830 290394 298483 306130 313266 332974 351509 337988
9565 337988 299653 298753 330577 345317 311711 279700 270785 263797 268385 275629 290615 270336 254931
9552 254931 276592 277680 277830 267240 264476 265175 244561 231197 258319 260041 288549 292350 292110 283258
9538 283258 262943 262844 263222 277659 224754 219434 251141 258329 265506 307551 319711 315129 313259 322758
9524 322758 317446 285235 293197 280221 288524 288579 279324 228930 188498 201867 246715 266945 249743
9511 249743 209924 205304 214601 259412 276920 266485 274664 207022 187928 232104 292665 304388
9499 304388 305138 335966 371004 353611 347819 338872 309545 288016 308344 311676 309746 300733 293463
9486 293463 316046 298660 274457 246619 238714 205052 184780 208284 251764 257313 302701 339280
9474 339280 344751 343932 314693 333747 319561 315594 327648 322737 297680 268295 290280 342994 305626
9461 305626 239630 245298 250162 236095 253007 308129 297826 264127 228203 237290 243315 257330
9449 257330 265591 289698 278112 279082 261157 244582 232217 235116 236837 233241 250667 252401 245172
9436 245172 235285 241344 247968 256694 311516 321216 288447 282239 292447 296939 275064 277401 266806
9423 266806 258135 310567 318181 333864 350741 315212 288825 264414 263320 280655 264550 222679
9411 222679 203657 212261 228120 227117 269515 274666 288297 330574 326307 321367 284699 311351 348040
9398 348040 354226 329785 329653 327805 283928 304956 302179 278877 318283 343228 327910 305895 264023
9385 264023 234078 242181 283621 282968 316651 318610 301465 272046 265038 276219 314761 301881 288988
9372 288988 286710 283347 277493 271620 258323 260526 270239 257381 254390 283574 326438 344333 329228
9359 329228 309658 279640 261983 245910 247805 281058 259677 215175 186965 191045 202736 230272
9347 230272 233281 243396 240740 271661 257390 226708 236721 256602 325421 368459 336436 294389
9335 294389 321459 298190 260846 280561 308797 350111 369977 363205 323952 306315 297894 314202
9323 314202 300096 274899 293981 295450 283097 275009 317380 324117 281326 275350 289601 312013
9311 312013 341814 305544 310070 326275 327738 315854 299000 273707 285634 321184 337637 319186
9299 319186 287128 277354 290899 300061 356847 356486 351639 330686 306328 293592 300410 256518 211909
9286 211909 258174 288350 295783 270203 219757 259872 299909 337012 308774 284818 259170 247909
9274 247909 265542 310995 312125 286783 280516 286072 297693 335760 321037 328023 339592 350671
9262 350671 328345 324524 350594 364784 361815 366965 347780 333641 300618 296297 288732 283083 289610
9249 289610 283042 282938 278937 278606 278471 293217 278881 264308 290025 270838 238120 253834 287914
9236 287914 277992 315754 334349 332302 312939 301451 278143 286776 308111 354537 364485 348623
9224 348623 332284 326053 336769 338891 337033 359289 387438 360605 304007 291597 324094 356561
9212 356561 354060 328545 342074 351818 370616 383761 398135 387851 380130 385805 385163 388720 365440
9199 365440 369984 418985 438667 429798 462063 470503 439691 421520 419439 436241 443551 468107 431060
9186 431060 382265 366771 370813 406855 453644 473136 485735 436304 422553 425840 413496 427273
9174 427273 404442 420696 431749 461096 476431 490615 488733 487130 529422 533020 524765 562255
9162 562255 570896 598958 576521 553790 544723 526507 543603 565461 583259 601802 623304 637418
9150 637418 625921 630807 624606 598661 587856 590573 642397 700115 729358 708356 681946 689929
9138 689929 715139 722187 714640 700461 711219 701323 698143 678683 638588 657739 670900 660450
9126 660450 717729 751619 748635 775755 762446 768510 861022 897149 913437 877063 902517 880065
9114 880065 882714 915435 961152 981331 961904 939292 930422 930060 933185 957081 1012553 1047220 1006683
9101 1006683 946061 950752 986298 1018138 1029802 1001293 964733 963943 967228 991197 1037390 1079941
9089 1079941 1097303 1059557 1005891 1030166 1062221 1082903 1069870 1046292 1064425 1102304 1083385
9078 1083385 1100392 1113956 1097265 1066293 1065786 1037634 1045319 1050174 1053717 1059180 1080250 1080107 1011685
9065 1011685 989335 978488 975316 969581 936570 877021 809693 783385 803661 847709 862588 829831
9053 829831 761787 755911 790481 792105 798775 782960 797341 754036 692724 695894 701840 685885 731711
9040 731711 737024 740140 733392 701994 674884 666866 649833 643712 649608 619772 617789 679809 713839
9027 713839 685654 631733 605722 603964 597856 561843 521100 518629 502489 511505 498529 518616
9015 518616 543224 552429 557748 573503 502047 455283 464847 469221 497591 473808 428520 427180 426208
9002 426208 401356 378013 416974 437599 413686 441827 487421 421100 379085 358845 359028 362146
8990 362146 366822 385567 371984 356883 367772 341336 289626 245885 275641 343004 323059 300042
8978 300042 307567 294568 272281 259205 283016 267724 264105 329710 350747 327618 327333 339419
8966 339419 335563 282225 279174 239613 244148 262261 287453 270101 251002 226859 233070 225934 210628
8953 210628 199776 185660 193605 216921 214190 224483 247922 253985 253207 210209 167871 147231 154518
8940 154518 185117 196875 207135 227280 249119 241114 276703 276899 242235 235302 228954 211736 221246
8927 221246 207433 180263 186365 192984 188136 207119 235551 235023 262042 264082 221127 205987 194285
8914 194285 197259 179243 179756 241736 288204 256652 242506 258121 274611 305512 346675 346013 377048
8901 377048 437470 586783 753398 974405 1330836 1896360 2407559 2377658 1874979 1326660
8891 1326660 926975 686201 554655 458418 394859 369092 327489 313282 270221 262392 220450
8880 220450 183393 195142 172548 202172 238423 205118 247376 272503 260796 271387 279766 244899
8868 244899 224511 221661 194617 224079 211796 179284 157855 158757 189155 189160 200353 217268 166372
8855 166372 161339 177309 204006 208976 203813 208550 175723 211695 264904 287503 267683 208864
8843 208864 213816 256266 246576 281995 302099 302216 276258 294780 275613 257169 279182 283991 234851
8830 234851 229140 209764 221672 221058 233940 243014 243226 256078 298662 307962 285967 328446 311318
8817 311318 247179 225847 229786 259740 264010 219760 163916 139892 150769 158718 173119 224523
8805 224523 244196 262863 243716 244170 223335 214940 203155 216714 254759 218024 219367 239248
8793 239248 278114 282746 304995 296797 272573 228430 237295 275311 293066 257415 267986 270733
8781 270733 269501 283518 239292 252588 256859 261631 268748 277542 296132 272338 257183 240869 255205
8768 255205 211878 173962 185027 171942 177320 154245 209409 297432 324777 319603 316833 321091
8756 321091 298970 277179 253420 221247 236656 248203 212970 212100 196528 202768 215389 229835
8744 229835 212901 214972 211592 204179 203244 197303 198835 192745 186653 200746 214685 262755 291428
8731 291428 259124 269234 291857 265755 251479 226678 194297 196969 223181 218330 249446 286768
8719 286768 292560 278692 314988 286962 263700 290973 278988 347432 395172 384724 354498 371819
8707 371819 405947 389062 380772 322068 290413 295445 314726 272885 251324 250952 260463 260955 259920
8694 259920 273431 274671 277132 303841 345086 354872 363933 368755 385296 404785 425934 455635 458797
8681 458797 443652 445079 463812 467119 472392 474824 469757 443422 439592 441071 398716 372273 404143
8668 404143 414108 427888 463875 533704 524578 515753 532862 546797 559376 621129 703650 774770
8656 774770 824932 901670 910236 918437 970278 1008707 1032037 1066644 1089574 1135624 1174030 1195759
8644 1195759 1168524 1112055 1108678 1069526 1026833 1008546 949013 918257 882489 837050 782500 788494
8632 788494 796583 782564 782968 786026 777987 752292 726885 705432 672174 705869 689214 613895 582263
8619 582263 505901 422803 385716 353695 397734 380608 400348 413241 353518 324657 300592 239874
8607 239874 193312 185576 218534 215833 216775 210522 205407 202812 206451 221252 201452 174189 189610
8594 189610 209518 208650 194846 162337 139945 175342 196718 184010 150615 156225 196063 188908
8582 188908 150250 147301 128842 83363 71652 108704 91496 80347 72463 93273 86011 27002
8570 27002 23600 35442 46309 44842 73178 73803 69946 60752 49090 33505 24171 56094 66672
8557 66672 77620 85514 105637 103678 84782 55980 53178 54065 95387 107725 60729 22229 26364
8544 26364 16300 32218 36313 65582 54732 11221 9105 36068 98070 121040 136828 87056
8532 87056 83393 103250 87727 47120 44090 18984 48243 65377 52437 47952 41373 93385 138534
8519 138534 123961 122717 126222 85926 46618 41370 48370 49533 26307 41629 73901 126162 133096
8506 133096 118665 116220 108137 86201 77111 17298 -17025 2662 26848 18382 -433 34467
8494 34467 47354 50250 81183 86024 88896 109544 114562 145152 142193 146887 155970 142378 129097
8481 129097 93717 30714 -37770 -12861 23957 63424 41130 -6524 10552 47865 90241 114029
8469 114029 160591 164560 120215 67789 39670 58930 72305 44575 47948 55790 125461 138035
8457 138035 128171 116231 119615 68537 63454 73353 76280 37814 58681 92665 121663 116372 71490
8444 71490 26198 39623 58624 77617 73810 62913 67550 76445 45109 -2806 4422 32450 39682
8431 39682 22569 8824 60531 45009 20765 33274 34827 55927 52685 45072 49070 58904 78542
8418 78542 112080 80021 78060 127189 153180 193487 172923 159193 179409 161241 134188 109291
8406 109291 98193 117717 75558 34376 25326 6790 -22539 -6964 20632 77296 111476 110368
8394 110368 68005 55853 42647 26065 19267 16357 42469 50304 83069 89074 74026 36570
8382 36570 -5405 833 37136 56558 75267 57691 34328 42096 51040 55222 62290 66612 69428
8369 69428 45394 64926 61389 32150 41761 76767 33280 -5486 -35073 -3281 17723 -6399
8357 -6399 11620 -1503 360 33859 45087 47868 53417 17425 33850 37789 68184 79884 67679
8344 67679 57398 70136 74618 57917 56867 69172 54901 28878 20660 38102 37045 21151 14870
8331 14870 23898 64313 56226 66041 40888 -240 -5340 -1896 36512 41147 43854 68170 63626
8318 63626 61234 55462 30210 26065 -4864 23093 74735 67447 46493 44646 -9148 -1408 33153
8305 33153 43034 45416 8949 27287 32310 14463 -2733 10375 13286 -26041 -30709 17886 89399
8292 89399 101861 114583 105620 113831 84572 93300 77167 51709 60641 25931 52323 22762 -8010
8279 -8010 21894 31289 40167 24553 17490 15580 -9680 1457 6027 1443 -14788 -10914 -9212 8316
8265 8316 14332 -6634 -8782 -30083 -61094 -13263 -13100 5758 46133 41284 60769 58927 28533
8252 28533 7541 -6691 860 8388 34314 36555 48316 20128 28305 14695 -16137 4091 97842
8239 97842 89563 84026 77439 94933 79884 43753 17550 -3706 11517 13341 -1580 -18020 4546
8226 4546 36127 38298 10321 -2381 18455 4421 -7355 -31019 -30718 -4987 -16295 -16509 -40776
8213 -40776 -8480 23358 52144 26097 -21713 -45375 11926 27012 45694 97945 110844 80190
8201 80190 62976 39665 71778 69239 31103 54287 90536 76157 75364 123379 205403 329257
8189 329257 469488 641891 574302 396772 245544 172627 145802 129972 102754 81196 76954
8178 76954 63817 39115 30344 2674 10042 34478 51968 25203 24832 3929 25673 67166 70662
$$ [...]
##END NTUPLES=NMR SPECTRUM
##END=
