##TITLE=Analysis number 325623
Compound Code cd 09182
Book Reference 97088
Project Code adrs fraglib
Chemist Name jom
##JCAMPDX= 6.0         $$ Bruker NMR JCAMP-DX V2.0
##DATA TYPE= NMR SPECTRUM
##DATA CLASS= NTUPLES
##ORIGIN= Bruker BioSpin GmbH
##OWNER= nmr
$$ XWIN-NMR		Version 3.5
$$ Fri Jan  5 10:09:15 2007 GMT Standard Time (UT+0h)  MAYBRIDGE\nmr@NMR_250MHZ
##.OBSERVE FREQUENCY= 250.131544655141
##.OBSERVE NUCLEUS= ^1H
##.ACQUISITION MODE= SIMULTANEOUS (DQD)
##.ACQUISITION SCHEME= undefined
##.AVERAGES= 16
##.DIGITISER RES= 18
##SPECTROMETER/DATA SYSTEM= dpx250
##.PULSE SEQUENCE= zg30
##.SOLVENT NAME= DMSO
##.SHIFT REFERENCE= (INTERNAL, DMSO, 0, 16.522)
##AUDIT TRAIL= $$ (NUMBER, WHEN, WHO, WHERE, WHAT)
$$ ##TITLE= Audit trail, XWIN-NMR		Version 3.5
$$ ##JCAMPDX= 5.01
$$ ##ORIGIN= Bruker BioSpin GmbH
$$ ##OWNER= nmr
$$ C:\u/data/dgb/nmr/ADRS/390/pdata/1/auditp.txt
$$ ##AUDIT TRAIL=  $$ (NUMBER, WHEN, WHO, WHERE, WHAT)
(   1,<2007-01-05 10:08:57.40 +000>,<MAYBRIDGE\nmr>,<NMR_250MHZ>,
      <created by zg, POWCHK disabled, PULCHK disabled
       configuration hash MD5:
       49 4B E0 1D 92 C2 6B 37 9F E6 65 BC 52 41 86 1D
       data hash MD5: 64K
       7F EE 9B 92 D3 A9 26 A2 B2 4A AB 04 77 53 4C 53>)
(   2,<2007-01-05 10:09:08.60 +000>,<MAYBRIDGE\nmr>,<NMR_250MHZ>,
      <Start of raw data processing
       ef LB = 0.3 FT_mod = 6 PKNL = 1 SI = 32K 
       data hash MD5: 32K
       7B D1 3E 2C 50 C3 D7 FA C4 D7 98 C8 73 8B 5A 5E>)
(   3,<2007-01-05 10:09:10.31 +000>,<MAYBRIDGE\nmr>,<NMR_250MHZ>,
      <apk 
       data hash MD5: 32K
       B6 1E 6A 00 AA 2A F5 BE 61 EF 6C 81 F7 E5 1E 74>)
(   4,<2007-01-05 10:09:10.99 +000>,<MAYBRIDGE\nmr>,<NMR_250MHZ>,
      <abs ABSG = 5 
       data hash MD5: 32K
       BB 58 0F 3C 59 6E E1 25 23 AC 0F C8 11 BC 41 F4>)
$$ ##END=
$$ 
$$ hash MD5
$$ 17 C6 5B 18 D4 EC BD FB 1F 7C 06 D8 24 58 2E D6
##$RELAX= 
##$RELAX= 
##$RELAX= 
##$RELAX= 
##$RELAX= 
##$RELAX= 
##$RELAX= 
$$ Bruker specific parameters
$$ --------------------------
##$DU= <C:\u>
##$EXPNO= 390
##$NAME= <ADRS>
##$PROCNO= 1
##$TYPE= <nmr>
##$USER= <dgb>
##$AMP= (0..31)
100 100 100 100 100 100 100 100 100 100 100 100 100 100 100 100 100 100 
100 100 100 100 100 100 100 100 100 100 100 100 100 100 
##$AQSEQ= 0
##$AQ_mod= 3
##$AUNM= <au_zg>
##$AUTOPOS= <28 >
##$BF1= 250.13
##$BF2= 250.13
##$BF3= 250.13
##$BF4= 250.13
##$BF5= 500.13
##$BF6= 500.13
##$BF7= 500.13
##$BF8= 500.13
##$BYTORDA= 1
##$CFDGTYP= 0
##$CFRGTYP= 5
##$CHEMSTR= <none>
##$CNST= (0..31)
1 1 145 1 1 1 1 1 1 1 1 1 1 1 1 1 1 1 1 1 1 1 1 1 1 1 1 1 1 1 1 1 
##$CPDPRG= <>
##$CPDPRG1= <>
##$CPDPRG2= <>
##$CPDPRG3= <>
##$CPDPRG4= <mlev>
##$CPDPRG5= <mlev>
##$CPDPRG6= <mlev>
##$CPDPRG7= <mlev>
##$CPDPRG8= <mlev>
##$CPDPRGB= <>
##$CPDPRGT= <>
##$D= (0..31)
0 1 0 0 0 0 0 0 0 0.06 0 0 0 0 0 0 0.0002 0 0 0 0 0 0 0 0 0 0 0 0 0 0 
0 
##$DATE= 1167991736
##$DBL= (0..7)
120 120 120 120 120 120 120 120 
##$DBP= (0..7)
150 150 150 150 150 150 150 150 
##$DBP07= 0
##$DBPNAM0= <>
##$DBPNAM1= <>
$$ [...]
##$SUBNAM7= <"">
##$SUBNAM8= <"">
##$SUBNAM9= <"">
##$SW= 20.6930455092707
##$SWIBOX= (0..15)
0 0 3 0 0 0 0 0 0 0 0 0 0 0 0 0 
##$SW_h= 5175.983436853
##$TD= 65536
##$TD0= 1
##$TE= 294.16
##$TE2= 300
##$TE3= 300
##$TEG= 300
##$TL= (0..7)
0 120 120 120 120 120 120 120 
##$TP= (0..7)
150 150 150 150 150 150 150 150 
##$TP07= 0
##$TPNAME0= <>
##$TPNAME1= <>
##$TPNAME2= <>
##$TPNAME3= <>
##$TPNAME4= <>
##$TPNAME5= <>
##$TPNAME6= <>
##$TPNAME7= <>
##$TPOAL= (0..7)
0.5 0.5 0.5 0.5 0.5 0.5 0.5 0.5 
##$TPOFFS= (0..7)
0 0 0 0 0 0 0 0 
##$TUNHIN= 0
##$TUNHOUT= 0
##$TUNXOUT= 0
##$USERA1= <user>
##$USERA2= <user>
##$USERA3= <user>
##$USERA4= <user>
##$USERA5= <user>
##$V9= 5
##$VALIST= <valist>
##$VCLIST= <CCCCCCCCCCCCCCC>
##$VD= 0
##$VDLIST= <DDDDDDDDDDDDDDD>
##$VPLIST= <PPPPPPPPPPPPPPP>
##$VTLIST= <TTTTTTTTTTTTTTT>
##$WBST= 1024
##$WBSW= 4
##$XGAIN= (0..3)
0 0 0 0 
##$XL= 0
##$YL= 0
##$YMAX_a= 252165
##$YMIN_a= -267338
##$ZGOPTNS= <>
##$ZL1= 120
##$ZL2= 120
##$ZL3= 120
##$ZL4= 120
##$ABSF1= 16.522
##$ABSF2= -4.171173
##$ABSG= 5
##$ABSL= 3
##$ALPHA= 0
##$AQORDER= 0
##$ASSFAC= 0
##$ASSFACI= 0
##$ASSFACX= 0
##$ASSWID= 0
##$AUNMP= <proc_1d>
##$AZFE= 0.1
##$AZFW= 0.1
##$BCFW= 0
##$BC_mod= 0
##$BYTORDP= 0
##$COROFFS= 0
##$CY= 12.5
##$DATMOD= 1
##$DC= 0
##$DFILT= <>
##$DTYPP= 0
##$F1P= 14.0000005364418
##$F2P= -0.99999901652339
##$FCOR= 0.5
##$FTSIZE= 32768
##$FT_mod= 6
##$GAMMA= 0
##$GB= 0
##$INTBC= 1
##$INTSCL= 1
##$ISEN= 128
##$LB= 0.3
##$LEV0= 0
##$LPBIN= 0
##$MAXI= 10000
##$MC2= 0
##$MEAN= 0
##$ME_mod= 0
##$MI= 0
##$NCOEF= 0
##$NC_proc= -5
##$NLEV= 6
##$NOISF1= 0
##$NOISF2= 0
##$NSP= 0
##$NTH_PI= 0
##$NZP= 0
##$OFFSET= 16.522
##$PC= 1
##$PHC0= 218.4107
##$PHC1= 8.215474
##$PH_mod= 1
##$PKNL= yes
##$PPARMOD= 0
##$PSCAL= 4
##$PSIGN= 0
##$REVERSE= no
##$SF= 250.13
##$SI= 32768
##$SIGF1= 0
##$SIGF2= 0
##$SINO= 400
##$SIOLD= 32768
##$SREGLST= <1H.DMSO>
##$SSB= 0
##$STSI= 32768
##$STSR= 0
##$SW_p= 5175.98343685301
##$SYMM= 0
##$S_DEV= 0
##$TDeff= 65536
##$TDoff= 0
##$TI= <Analysis number 999999
Compound Code 99
Book Reference 9
Project Code 9>
##$TILT= no
##$TM1= 0
##$TM2= 0
##$TOPLEV= 0
##$USERP1= <user>
##$USERP2= <user>
##$USERP3= <user>
##$USERP4= <user>
##$USERP5= <user>
##$WDW= 1
##$XDIM= 32768
##$YMAX_p= 334176325
##$YMIN_p= -610759
$$ End of Bruker specific parameters
$$ ---------------------------------
##NTUPLES= NMR SPECTRUM
##VAR_NAME=  FREQUENCY,     SPECTRUM/REAL,   SPECTRUM/IMAG
##SYMBOL=    X,             R,               I
##VAR_TYPE=  INDEPENDENT,   DEPENDENT,       DEPENDENT
##VAR_FORM=  AFFN,          ASDF,            ASDF
##VAR_DIM=   32768,         32768,           32768
##UNITS=     HZ,            ARBITRARY UNITS, ARBITRARY UNITS
##FACTOR=    0.157963299565203, 1,           1
##FIRST=     4132.6476996994, 0,             0
##LAST=      -1043.33573715361, 0,           0
##MIN=       -1043.33573715361, -610759,     0
##MAX=       4132.6476996994, 334176325,     0
$$ Real data points
##PAGE= N=1
##DATA TABLE= (X++(R..R)), XYDATA
$$ [...]
$$ plain form
15808 110795 158107 232980 210454 93200 -2550 -245685 -245450 -184896 -116031 -196353 -230000
15797 -230000 -105911 3145 -35206 -33659 -72757 -47171 65259 114930 23269 227 36487
15786 36487 140176 29862 -104604 -97801 -172292 -252747 -270460 -152781 71425 13905 -165721
15775 -165721 -209131 17478 100974 50892 -41696 -97350 6695 82722 158317 41148 -117902
15764 -117902 13122 -13740 -240374 -198801 -120680 -63689 -24823 -13357 30002 17701 59451
15753 59451 81284 -32693 -95223 -141892 -15436 -38277 -201906 -192344 -205990 -181877 40396
15742 40396 44728 -82912 -105051 -154176 -12595 50915 -64220 -243183 -267972 -122679 -116864
15731 -116864 -181924 -68176 -7720 -56992 -19963 -180622 -353462 -246265 -95990 -2756
$$ packed form
15808A10795M7312P4873k2526j17254r5750k43135K35O0554O8865q0322l3647
15797b30000J24089J09056l8351J547l9098K5586J12430M9671r1661k3042L6260
15786C6487J03689j10314j34466O803p4491q0455j7713J17679K24206n7520j79626
15775a65721m3410K26609Q3496n0082r2588n5654J04045P6027P5595j17169j59050
15764a17902J31024k6862k26634M1573P8121N6991L8866J1466M3359j2301M1750
15753E9451K1833j13977o2530m6669J26456k2841j63629R562j3646K4113K22273
15742D0396M332j27640k2139m9125J41581O3510j15135j78963k4789J45293N815
15731a16864o5060J13748O0456m9272L7029j60659j72840J07197J50275R3234
$$ plain form
15721 -2756 32871 -157209 -192584 -101222 -69649 -59 61988 -126977 -201863 36876 -4878
15710 -4878 -31015 -221512 -218358 -132036 -67328 -50744 -59549 -34978 -91948 -84508 -49863 -62024
15698 -62024 -200495 -259225 -84546 -93698 7444 96387 20768 -115148 -96876 -123616 -135616
15687 -135616 70800 27702 74655 94898 8571 41726 173362 209247 -2991 -171784 -133360
15676 -133360 -22984 -10706 -41357 -70816 -10205 212572 -41230 -223657 -112845 -27605
15666 -27605 7384 -98408 -88520 -139996 -138491 -169480 -325961 -365629 -220764 -211631 -217154 -221159
15654 -221159 -222847 -293316 -174884 134887 196345 81891 -1041 -55951 -133534 -239716 -62802
15643 -62802 48422 -65183 -191074 -268254 -254678 -104324 -40083 -38333 -147161 -149059 54220
$$ packed form
15721b756L5627j90080l5375R1362L1573O9590O2047j88965p4886K38739m1754
15710d878k6137j90497L154Q6322O4708J6584q805K4571n6970P440L4645j2161
15698f2024j38471n8730J74679r152J01142Q8943p5619j35916J8272k6740j2000
15687a35616K06416m3098M6953K0243q6327L3155J31636L5885k12238j68793L8424
15676a33360J10376J2278l0651k9459O0611K22777k53802j82427J10812Q5240
15666b7605L4989j05792R888n1476J505l0989j56481l9668J44865R133n523m005
15654b21159j688p0469J18432L09771O1458j14454q2932n4910p7583j06182J76914
15643f2802J11224j13605j25891p7180J3576J50354O4241J750j08828j898K03279
$$ plain form
15632 54220 -10510 -141879 -244882 -272512 -350290 -307922 -426465 -279750 49384 108587 54901
15621 54901 -19626 96578 -64387 -92529 -91976 3193 -49004 -88356 -105378 -124327 -64456 -87822
15609 -87822 -158798 -105266 -37064 -32680 -59562 -92988 156850 104737 -67554 107769 159329
15598 159329 128049 72830 -25956 -44137 120413 47169 -98112 -187095 -135040 -127460 -318435
15587 -318435 -379955 -402582 -176208 44358 135549 223209 170285 129254 117132 129449 155118
15576 155118 66595 30512 -146083 -324790 -300562 -174587 -227793 -228423 -205344 -120980 16371
15565 16371 -156812 -270934 -120870 -8486 -127855 -2314 175736 190798 138505 -45709
15555 -45709 -73603 -37613 88385 98335 47886 9442 -191754 -231963 -188895 -197713 -164630 -137221
$$ packed form
15632E4220o4730j31369j03003k7630p7778M2368j18543J46715L29134N9203n3686
15621E4901p4527J16204j60965k8142N53R5169n2197l9352j7022j8949N9871k3366
15609h7822p0976N3532O8202M384k6882l3426K49838n2113j72291J75323N1560
15598A59329l1280n5219r8786j8181J64550p3244j45281q8983N2055P580j90975
15587c18435o1520k2627K26374K20566R1191Q7660n2924m1031j2122J2317K5669
15576A55118q8523l6083j76595j78707K4228J25975n3206o30K3079Q4364J37351
15565A6371j73183j14122J50064J12384j19369J25541J78050J5062n2293j84214
15555d5709k7894L5990J25998R950n0449l8444k01196m0209M3068q818L3083K7409
$$ plain form
15543 -137221 -224284 -312406 -381566 -273758 -336752 -434494 -325550 -209421 -242961 -188490 -38224
15532 -38224 135026 41332 -18174 141439 208089 -55283 -208559 -90122 -121513 -260097
15522 -260097 -222854 -196846 -212226 -202019 -48827 146576 167088 141057 -41836 -28000 66327
15511 66327 105018 200573 215157 71757 125473 70824 100869 28671 -143387 -191204 -320923
15500 -320923 -390134 -324939 -295824 -73052 152828 59243 -57000 -199458 -333343 -329373 -132263
15489 -132263 -49334 135872 162218 154229 145994 -128542 -76601 -93269 -340395 -134948 -73481
15478 -73481 -179539 -205895 -193252 -40374 -39942 100435 176044 154976 109878 18919 -51960
15467 -51960 1247 -149782 -69594 145092 61132 -160580 -47522 -173614 -200338 115606
$$ packed form
15543a37221q7063q8122o9160J07808o2994r7742J08944J16129l3540N4471J50266
15532c8224J73250r3694n9506J59613O6650k63372j53276J18437l1391j38584
15522b60097L7243K6008j5380J0207J53192J95403K0512k6031j82893J3836R4327
15511F6327L8691R5555J4584j43400N3716n4649L0045p2198j72058m7817j29719
15500c20923o9211O5195K9115K22772K25880r3585j16243j42458j33885L970J97110
15489a32263Q2929J85206K6346p989q235k74536N1941j6668k47126K05447O1467
15478g3481j06058k6356J2643J52878M32J40377P5609k1068m5098r0959p0879
15467e1960N3207j51029Q0188K14686q3960k21712J13058j26092k6724L15944
$$ plain form
15457 115606 236560 114482 40652 -38041 -37948 22693 -12726 -111312 -193250 -276662 -230437 -48044
15445 -48044 -58132 -69714 -59125 -180178 -51519 22825 -35479 -111160 -105505 106022 94869
15434 94869 -62137 -101126 -82836 -221151 -154151 -24147 -62022 -96752 -36209 -24305 28268
15423 28268 89611 117257 63634 102208 62353 45958 26499 83714 114446 151716 173396 -347
15411 -347 -96705 -68253 70882 58721 -15210 2923 15181 146242 184679 16881 -104676
15400 -104676 -172961 -101838 -168244 -290813 -231487 -135281 -107134 -53506 1957 -2669 -41883
15389 -41883 -86392 -23409 3757 -64511 -46913 63777 96445 77979 -58858 -271872 -311696
15378 -311696 -253113 -198711 -198221 -303131 -287459 -179887 57384 59753 -2205 -105141 -61211
$$ packed form
15457A15606J20954j22078p3830p8693R3O0641l5419r8586q1938q3412M6225J82393
15445d8044j0088j1582J0589j21053J28659P4344n8304p5681N655K11527j1153
15434I4869j57006l8989J8290j38315O7000J30004l7875l4730O0543J1904N2573
15423B8268O1343K7646n3623L8574l9855j6395j9459N7215L0732L7270K1680j73743
15411c47r6358K8452J39135j2161p3931J8133J2258J31061L8437j67798j21557
15400a04676o8285P1123o6406j22569N9326R6206K8147N3628N5463m626l9214
15389d1883m4509O2983K7166o8268J7598J10690L2668j8466j36837k13014l9824
15378c11696N8583N4402M90j04910J5672J07572K37271K369o1958j02936M3930
$$ plain form
15367 -61211 -26573 177435 133016 150107 146335 90164 119502 65784 -40346 -141364 52851
15356 52851 116630 204745 154135 76432 56995 -62650 -131777 -137629 -135957 -43955 -50489 -175899
15344 -175899 -90935 -133545 -345761 -296335 8951 -6080 -145857 -68241 26597 -20203 -61044
15333 -61044 64957 124479 130188 52880 84703 -105301 -144477 -86911 -12972 36789 114107
15322 114107 154866 106382 163562 217680 156970 130556 34998 24878 57005 25561 -11938
15311 -11938 41985 213464 321021 191920 124416 23796 -64032 6090 -60566 -155269 -223046
15300 -223046 -289884 -277151 -243949 -241239 -346254 -167306 -40763 -15862 43232 -83844 -39313
15289 -39313 143782 135788 127641 58257 -116978 -233156 -105317 -65317 28627 134167 76909
$$ packed form
15367f1211L4638K04008m4419J7091l772n6171K9338n3718j06130j01018J94215
15356E2851O3779Q8115n0610p7703j9437j19645o9127n852J672R2002o534j25410
15344a75899Q4964m2610k12216M9426L05286j5031j39777P7616R4838m6800m0841
15333f1044J26001N9522N709p7308L1823j90004l9176N7566P3939M9761P7318
15322A14107M0759m8484N7180N4118o0710k6414r5558j0120L2127l1444l7499
15311a1938N3923J71479J07557j29101o7504j00620q7828P0122o6656r4703o7777
15300b23046o6838J2733L3202K710j05015J78948J26543K4901N9094j27076M4531
15289c9313J83095p994q147o9384j75235j16178J27839M0000R3944J05540n7258
$$ plain form
15278 76909 -9887 -20150 139986 192993 25589 102629 260107 150120 186567 170627 62168
15267 62168 203799 333693 250429 123908 40889 -28433 -18455 -47556 -184215 -82080 -89561
15256 -89561 -155128 -177897 -143914 -155587 -118393 -190751 -224955 -93506 -104065 -24979 -65540
15245 -65540 -168713 -188681 -103015 -111345 -124124 -162664 -15458 9268 73431 15557 -27737
15234 -27737 -111769 -144 97079 125229 -4395 -51775 -130084 -188199 -208435 -97369 -171413
15223 -171413 -256346 -217242 -240100 -349038 -355936 -293787 -178784 -184267 -175104 9748 45305
15212 45305 -81281 -339491 -268455 -107079 105195 189377 79449 82264 -18798 33920 23431
15201 23431 -23672 -16301 -121811 -139161 -82542 -23899 -33450 -52726 3075 -39885 -154910 -8530
$$ packed form
15278G6909q6796j0263J60136N3007j67404P7040J57478j09987L6447j5940j08459
15267F2168J41631J29894q3264j26521q3019o9322R978k9101j36659J02135p481
15256h9561o5567k2769L3983j1673L7194p2358l4204J31449j0559P9086m0561
15245f5540j03173j9968Q5666q330j2779l8540J47206K4726O4163n7874m3294
15234b7737q4032J11625R7223K8150j29624m7380p8309n8115k0236J11066p4044
15223a71413q4933L9104k2858j08938o898O2149J15003n483R163J84852L5557
15212D5305j26586k58210P1036J61376K12274Q4182j09928K815j01062N2718j0489
15201B3431m7103P371j05510j7350N6619N8643r551j9276N5801m2960j15025J46380
$$ plain form
15189 -8530 120639 90274 -774 -80629 -133116 -181357 -134742 56956 92652 95403 1811 34785
15177 34785 190778 240954 163962 75477 95055 21650 -147977 -195322 -90264 -1191 31447
15166 31447 14888 115595 233573 47470 -148567 -239756 -100604 107389 177812 -83436
15156 -83436 -211967 -111003 -196296 -296043 -176060 15766 80230 -38727 -71304 43902
15146 43902 26092 32118 131572 95523 -53907 -36928 9287 -90772 -295327 -297657 -256815
15135 -256815 -184795 -195552 -148796 -126201 -28905 5322 95662 165211 85317 -29588 -157568
15124 -157568 -275812 -372235 -236680 4671 112510 138637 217584 170360 22927 -101432
15114 -101432 -216220 -131351 -33103 30480 -2666 -155523 -238452 -200505 -81161 13957 147754
$$ packed form
15189h530J29169l0365r1048p9855n2487m8241M6615J91698L5696K751r3592L2974
15177C4785J55993N0176p6992q8485J9578p3405j69627m7345J05058Q9073L2638
15166C1447j6559J00707J17978j86103j96037r1189J39152K07993P0423k61248
15156h3436j28531J00964q5293r9747J19983J91826O4464j18957l2577J15206
15146D3902j7810O026R9454l6049j49430J6979M6215j00059k04555k330M0842
15135b56815P2020j0757M6756K2595R7296L4227R0340O9549p9894j14905j27980
15124a57568j18244r6423J35555K41351J07839K6127P8947m7224j47433j24359
15114a01432j14788Q4869R8248O3583l3146j52857q2929L7947J19344R5118J33797
$$ plain form
15103 147754 109016 65721 -1641 4316 62903 10146 53316 45357 -73835 -156216 -77518 -12774
15091 -12774 -64831 -88369 -109829 -127349 -103746 -23659 -83579 -152265 -40474 46077 53470 -42811
15079 -42811 -154673 -129796 -64841 20380 59446 -19297 -55618 183642 309005 209838 164418
15068 164418 51781 75140 43607 73999 -35342 79631 18186 -179476 -68054 147097
15058 147097 148941 -20382 -83689 -182116 -71697 -32535 -56825 -81608 12840 67539 219726
15047 219726 293426 318264 244414 48756 7060 114569 128054 89540 19828 22064 166850
15036 166850 360839 298833 167642 -54007 -77866 -161399 -113742 18333 31909 1715 89371
15025 89371 272469 102951 -102244 -139116 31101 40107 -9739 -49967 69036 82417 97110
$$ packed form
15103A47754l8738m3295o7362N957N8587n2757M3170p959j19192q2381P8698O4744
15091a2774n2057k3538k1460j7520K3603Q0087n9920o8686J11791Q6551P393r6281
15079d2811j11862K4877O4955Q5221L9066p8743l6321K39260J25363r9167m5420
15068A64418j12637K3359l1533L0392j09341J14973o1445j97662J11422K15151
15058A47097J844j69323o3307r8427J10419L9162k4290k4783R4448N4699J52187
15047B19726P3700K4838p3850j95658m1696J07509J3485l8514o9712K236J44786
15036A66850J93989o2006j31191k21649k3859q3533M7657J32075J3576l0194Q7656
15025H9371J83098j69518k05195l6872J70217R006m9846m0228J19003J3381J4693
$$ plain form
15014 97110 233372 84695 125479 158826 102139 124386 -11864 -97224 -263741 -123659 -66134
15003 -66134 -173228 -51033 -100901 -96205 -66233 68724 55513 83628 42529 -170889 -102638
14992 -102638 5182 122189 195650 171373 96850 188739 85324 191609 251754 195528 182839
14981 182839 229797 150523 -53216 -33017 -77680 -159847 -61487 127923 125299 152823 240432
14970 240432 -2399 -111987 -36646 62678 91175 59656 19854 -53464 -74104 118649 212595
14959 212595 186464 27050 -115098 -120049 11046 30194 77686 -42349 -115798 -136197 -24836
14948 -24836 87830 66413 58757 66119 33234 -222469 -268433 -186759 -188927 -157602 -87340 -214463
14936 -214463 -265575 -160667 -64838 -46163 28014 14187 87782 53695 48245 53633 28764 55747
$$ packed form
15014I7110J36262j48677M0784L3347n6687K2247j36250q5360j66517J40082N7525
15003f6134j07094J22195m9868M696K9972J34957j3211K8115m1099k13418O8251
14992a02638J07820J17007P3461k4277p4523R1889j03415J06285O0145n6226j2689
14981A82839M6958p9274k03739K0199m4663q2167R8360J89410k624K7524Q7609
14970B40432k42831j09588P5341R9324K8497l1519l9802p3318k0640J92753R3946
14959B12595k6131j59414j42148m951J31095J9148M7492j20035p3449k0399J11361
14948b4836J12666k1417p656P362l2885k55703m5964Q1674k168L1325P0262j27123
14936b14463n1112J04908R5829J8675P4177j3827P3595l4087n450N388k4869K6983
$$ plain form
14924 55747 -56978 -174717 -168249 -3658 -9220 -216199 -143193 54275 84501 122294 346119
14913 346119 373840 325100 131736 -17553 3526 -43985 -35595 24136 54061 23901 -34752
14902 -34752 -133377 -43430 19661 -8419 103208 142958 106909 4081 -120702 -207659 3878
14891 3878 -9834 -140624 -47765 28057 -28168 -26027 -53983 51155 267538 328794 215833
14880 215833 67232 -113188 -105916 -110964 -56571 -11419 143853 159029 69361 5400 106447
14869 106447 171959 64712 14728 16365 -69418 -76640 -12663 29396 77485 83353 30701 5739
14857 5739 -85319 -65977 17738 -222297 -304394 -218823 -220497 -291331 -335431 -391866 -317311 -212812
14845 -212812 -82000 -186707 -295472 -252243 -179148 -52983 -155704 -251067 -148118 -218856
$$ packed form
14924E5747j12725j17739O468J64591n562k06979P3006J97468L0226L7793K23825
14913C46119K7721m8740j93364j49289K1079m7511Q390N9731K9925l0160n8653
14902c4752r8625Q9947O3091k8080J11627L9750l6049j02828j24783q6957K11537
14891C878j3712j30790R2859P5822n6225K141k7956J05138K16383O1256j12961
14880B15833j48601j80420P272n048N4393M5152J55272J5176q9668o3961J01047
14869A06447O5512j07247m9984J637q5783p222O3977M2059M8089N868n2652k4962
14857E739r1058J9342Q3715k40035q2097Q5571j674p0834m4100n6435P4555J04499
14845b12812J30812j04707j08765M3229P3095J26165j02721r5363J02949p0738
$$ plain form
14835 -218856 -148437 -135893 -316127 -324690 -186414 6730 98695 81181 42335 20968 -63823
14824 -63823 -50218 -69239 96652 67420 -63369 91087 320539 194848 95688 -47024
14814 -47024 -131745 -236122 -184897 131252 235183 174484 139711 214291 203757 43094 24007
14803 24007 -49445 -86340 42049 24937 -56014 11325 32296 82039 83508 175313 222037 180670
14791 180670 82047 -15390 169096 272186 321670 215464 211538 377796 180276 90619 35592
14780 35592 89844 64163 -52958 -50295 -149002 -247673 -120337 -48797 -153924 -175223 -82465
14769 -82465 124884 199133 61346 -110380 116554 145690 68616 -60212 -159765 -355767
14759 -355767 -316588 -188924 -130768 -116420 -137391 -274061 -243275 -33523 93365 43285 -10687
$$ packed form
14835b18856P0419J2544j80234q563J38276J93144R1965j7514l8846k1367q4791
14824f3823J3605j9021J65891k9232j30789J54456K29452j25691r9160j42712
14814d7024q4721j04377N1225L16149J03931o0699l4773P4580j0534j60663j9087
14803B4007p3452l6895J28389j7112q0951O7339K0971M9743J469R1805M6724m1367
14791A80670r8623r7437J84486J03090M9484j06206l926J66258j97520q9657n5027
14780C5592N4252k5681j17121K663r8707r8671J27336P1540j05127k1299R2758
14769h2465K07349P4249j37787j71726K26934K9136p7074j28828r9553j96002
14759c55767L9179J27664N8156J4348k0971j36670L0786K09752J26888n0080n3972
$$ plain form
14748 -10687 30259 39966 -61311 -29026 84139 54404 -10208 -88288 -28599 76140 18683
14737 18683 -29575 180866 223407 141382 234095 194747 265787 126787 -8410 17335 59137
14726 59137 214494 271807 167524 -2271 -228608 -165361 124091 250462 328245 319126 199788
14715 199788 22698 7832 116518 72603 56690 69463 -78136 -270932 -180819 -32194
14705 -32194 66406 89958 -102032 -223209 -180492 -143197 -9098 58967 24397 31886 -55338
14694 -55338 -61096 8446 18065 23391 -103730 -247692 -185184 8629 198424 107810 127091
14683 127091 167179 28689 -47893 -168717 -114899 -151976 90337 209908 164105 236289 269746
14672 269746 220824 184063 103846 218641 34070 -145217 -198916 -148827 -113765 -146246 -193662
$$ packed form
14748a0687M0946R707j01277L2285J13165k9735o4612p8080N9689J04739n7457
14737A8683m8258K10441M2541q2025R2713l9348P1040j39000j35197K5745M1802
14726E9137J55357N7313j04283j69795k26337O3247K89452J26371P7783r119j19338
14715A99788j77090j4866J08686m3915j5913J2773j47599j92796R0113J48625
14705c2194R8600K3552j91990j21177M2717L7295J34099O8065l4570P489q7224
14694e5338n758O9542R619N326j27121j43962O2508J93813J89795r0614J9281
14683A27091M0088j38490p6582j20824N3818l7077K42313J19571m5803P2184L3457
14672B69746m8922l6761q0217J14795j84571j79287n3699N0089L5062l2481m7416
$$ plain form
14661 -193662 -94378 -11103 107187 207611 232694 138749 -29204 -121622 -88528 -72946 -88405
14650 -88405 39327 170418 118568 111453 22410 -172189 -200383 -99071 -123127 -181157 2227
14639 2227 44397 -71386 -59465 -147329 -148741 -203192 -251732 -145093 -76644 67174 183827
14628 183827 269238 209940 -19667 -38909 -21667 80904 201462 123032 59584 14956 67617
14617 67617 183151 254856 44026 33955 -79088 -68447 -67032 -174630 -212668 -122287 -76138
14606 -76138 52832 49720 -169290 -180589 -89306 84917 32679 -135439 -163167 -113942 -44827
14595 -44827 -2174 -118406 -196105 -161666 -105529 -308669 -369539 -308228 -73607 19310 59993
14584 59993 1263 -111282 -83873 13483 -10878 -1140 299331 309969 87844 -23285 -124440
$$ packed form
14661a93662R9284Q3275J18290J00424K5083r3945j67953r2418L3094J5582j5459
14650h8405J27732J31091n1850p115q9043j94599k8194J01312k4056n8030J83384
14639B227M2170j15783J1921q7864j412n4451m8540J06639O8449J43818J16653
14628A83827Q5411n9298k29607j9242J7242J02571J20558p8430o3448m4628N2661
14617F7617J15534P1705k10830j0071j13043J0641J415j07598l8038R0381M6149
14606g6138J28970l112k19010j1299R1283J74223n2238j68118k7728M9225O9115
14595d4827M2653j16232p7699L4439N6137k03140o0870O1311K34621R2917M0683
14584E9993n8730j12545K7409R7356k4361R738L00471J0638k22125j11129j01155
$$ plain form
14573 -124440 -19489 71256 82211 19910 16330 126086 301436 270813 12688 -103931 -23787
14562 -23787 132991 122390 116617 245868 41635 -19332 -106985 -149628 -67986 25004 -106468
14551 -106468 -4684 -157591 -221850 -38251 195758 109957 37469 -9869 -40393 -58907 -56433
14540 -56433 -23035 -198080 -245396 -113389 18053 -4743 51919 96516 -68555 -256846 -247623
14529 -247623 18198 -118221 -259178 -152827 -199416 -213215 -20632 104431 58601 15580
14519 15580 168522 122454 163365 135543 192250 179010 138311 257357 276133 339668 384388
14508 384388 233048 164153 90133 159054 53363 45100 61867 139710 47595 15419 -64258
14497 -64258 47785 113782 309000 331322 71365 11798 -19219 -13521 111758 -6407 -4653
$$ packed form
14573a24440J04951R0745J0955o2301l580J09756J75350l0623k58125j16619Q0144
14562b3787J56778j0601n773J29251k04233o0967q7653m2643Q1642R2990j31472
14551a06468J01784j52907o4259J83599K34009q5801p2488m7338l0524j8514K474
14540e6433L3398j75045m7316J32007J31442k2796N6662M4597j65071j88291R223
14529b47623K65821j36419j40957J06351m6589j3799J92583J25063m5830m3021
14519A5580J52942m6068M0911k7822N6707j3240m0699J19046J8776O3535M4720
14508C84388j51340o8895p4020O8921j05691q263J6767P7843r2115l2176p9677
14497f4258J12043O5997J95218K2322k59957n9567l1017N698J25279j18165J754
$$ plain form
14486 -4653 70446 146674 168370 43453 56888 128326 17703 -194204 -219781 -193460 -260748
14475 -260748 -191898 -97998 -182678 -184209 -125886 -59141 4508 -64611 -31136 93734 178537
14464 178537 271335 177252 -181060 -217486 -63552 49786 -12123 15012 -10270 -75589 -930
14453 -930 53594 -52886 139946 197086 157640 28329 -80369 -146589 -39146 19674 39977
14442 39977 -75688 -177613 -66510 19911 284005 332565 282959 195259 188786 158346 -18897
14431 -18897 46129 145852 197677 67910 49378 173652 212076 115363 121370 -14056 57972
14420 57972 216301 188557 -10469 -103686 -42453 -63887 -27871 -13893 -53642 -83481 -5787
14409 -5787 67262 132263 -33428 -167931 -272253 -264362 -298265 -210810 -176857 -157577 -889
$$ packed form
14486d653P5099P6228K1696j24917J3435P1438j10623k11907k5577K6321o7288
14475b60748O8850R3900q4680j531N8323O6745O3649o9119L3475J24870Q4803
14464A78537R2798r4083l58312l6426J53934J13338o1909K7135k5282o5319P4659
14453i30N4524j06480J92832N7140l9446j29311j08698o6220J07443N8820K0303
14442C9977j15665j01925J11103Q6421K64094M8560m9606q7700o473l0440j77243
14431a8897O5026R9723N1825j29767j8532J24274L8424r6713O007j35426P2028
14420E7972J58329k7744j99026r3217O1233k1434L6016J3978l9749k9839P7694
14409e787P3049O5001j65691j34503j04322P891l3903Q7455L3953J9280J56688
$$ plain form
14398 -889 39086 16231 3878 -9255 16246 49976 29334 88551 -76869 -158782 -81599 56170
14386 56170 165264 84887 -62508 166721 177808 54023 70289 240932 288481 74730
14376 74730 -112915 -179639 4863 52514 -104651 -2496 30195 12757 -131810 -216482 -169252
14365 -169252 -81462 -63548 -85044 -178903 -68501 -73585 35039 3040 -32285 -170721 -310542
14354 -310542 -290294 -219768 -85757 -74356 38254 190947 178371 10341 156188 313030
14344 313030 258563 214888 96046 91346 124962 28302 -67053 -198263 -275223 -137550 156874
14333 156874 180944 92476 -84580 -20293 -46752 -19695 121287 202000 262834 204083 154148
14322 154148 152117 113593 -94363 -199411 -278902 -181627 -43707 91191 -26333 -150953
$$ packed form
14398h89L9975k2855j2353j3133K5501L3730k0642N9217j65420q1913P7183J37769
14386E6170J09094q0377j47395K29229J1087j23785J6266J70643M7549k13751
14376G4730j87645o6724J84502M7651j57165J02155L2691j7438j44567q4672M7230
14365a69252Q7790J7914k1496r3859J10402n084J08624l1999l5325j38436j39821
14354c10542K0248P0526J34011J1401J12610J52693j2576j68030J45847J56842
14344C13030n4467m3675j18842m700L3616r6660r5355j31210p6960J37673K94424
14333A56874K4070q8468j77056O4287k6459K7057J40982Q0713O0834n8751m9935
14322A54148k031l8524k07956j05048p9491R7275J37920J34898j17524j24620
$$ plain form
14312 -150953 -96336 -30322 90395 256192 273886 275185 213884 258243 187367 37933 15894
14301 15894 107662 30752 102658 125369 74630 -16902 -77633 -131511 -160686 -171269 -145689 -96948
14289 -96948 -106813 12833 133301 185268 142004 3114 -123315 -158918 -137866 -45182 79723
14278 79723 19256 -106937 -76420 -242561 -134436 -80755 -71984 -149516 -207203 -269445 -226211
14267 -226211 -166045 -240365 -175519 -6164 119163 55345 107926 129686 96210 80589 -75566
14256 -75566 -68286 -34117 32135 132651 138886 71288 82146 228284 293103 274415 31604
14245 31604 -111466 15215 189827 105655 -9709 -20590 142611 337172 374413 239356
14235 239356 210223 271787 351362 428536 385218 383952 407135 259301 254322 240061 80135
$$ packed form
14312a50953N4617O6014J20717J65797J7694J299o1301M4359p0876j49434k2039
14301A5894R1768p6910P1906K2711n0739r1532o0731n3878k9175j0583K5580M8741
14289i6948r865J19646J20468N1967m3264j38890j26429l5603K1052R2684J24905
14278G9723o0467j26193L0517j66141J08125N3681Q771p7532n7687o2242M3234
14267b26211O0166p4320O4846J69355J25327o3818N2581K1760l3476j5621j56155
14256g5566P280L4169O6252J00516O235o7598J0858J46138O4819j8688k42811
14245C1604j43070J26681J74612q4172j15364j0881J63201J94561L7241j35057
14235B39356k9133O1564P9575P7174m3318j266K3183j47834m979j4261j59926
$$ plain form
14224 80135 113609 175684 143943 8944 -28931 54933 184222 191473 94940 74783 250607
14213 250607 454793 361195 318691 340075 278618 159054 106767 52110 30093 700 4888
14202 4888 11033 32045 -58577 -66621 7521 -126162 -129338 18839 82891 92728 27281 50726
14190 50726 80022 14230 19089 11965 -47721 -21349 73143 96460 116799 129855 164353 177416
14178 177416 229308 332395 225969 114908 189974 70821 -1035 21151 83494 -4924 -28479
14167 -28479 -62304 -33299 -38906 154369 251941 28252 -54343 -100986 -173271 -192352 -164782
14156 -164782 -33109 -17797 43923 -82938 -127285 -120429 -12834 -30927 7854 137592 103735
14145 103735 47672 -2533 31989 -28845 -33014 50776 70550 117923 250925 234295 220001
$$ packed form
14224H0135L3474O2075l1741j34999l7875Q3864J29289P251r6533k0157J75824
14213B50607K04186r3598m2504K1384o1457j19564n2287n4657k2017k9393M188
14202D888O145K1012r0622q044P4142j33683l176J48177O4052R837o5447K3445
14190E0726K9296o5792M859p124n9686K6372R4492K3317K0339J3056L4498J3063
14178A77416N1892J03087j06426j11061P5066j19153p1856K2186O2343q8418k3555
14167b8479l3825K9005n607J93275R7572k23689q2595m6643p2285j9081K7570
14156a64782J31673J5312O1720j26861m4347O856J07595j8093L8781J29738l3857
14145A03735n6063n0205L4522o0834m169Q3790J9774M7373J33002j6630j4294
$$ plain form
14134 220001 275593 210390 38230 55680 54500 67131 198033 -18958 -166713 -195622 -6938
14123 -6938 99081 269841 300675 155737 61240 23187 9793 -91096 -30598 51673 3962
14112 3962 39782 -73072 -221945 -341861 -302030 -155229 -72147 115520 286137 269039 100007
14101 100007 -98068 -105721 -55691 48501 52762 80278 112409 143171 77295 156910 167201
14090 167201 73236 108382 234195 284249 144243 13700 59654 -21942 -49242 -234747 -303630
14079 -303630 -177510 -83900 5495 59336 -43536 49849 251087 235221 140377 152225 181014
14068 181014 263408 146424 35743 49842 -93383 -131557 -236065 -188211 -149985 -224718 -294632
14057 -294632 -239433 -139660 -80510 -21890 29263 -8794 -30503 -85181 -103509 -169527 -160390 -110898
$$ packed form
14134B20001N5592o5203j72160J7450j180J2631J30902k16991j47755k8909J88684
14123f938J06019J70760L0834j44938r4497l8053j3394j00889O0498Q2271m7711
14112C962L5820j12854j48873j19916L9831J46801Q3082J87667J70617j7098j69032
14101A00007j98075p653N0030J04192M261K7516L2131L0762o5876P9615J0291
14090A67201r3965L5146J25813N0054j40006j30543M5954q1596k7300j85505o8883
14079c03630J26120R3610Q9395N3841j02872R3385K01238j5866r4844J1848K8789
14068A81014Q2394j16984j10681J4099j43225l8174j04508M7854L8226p4733o9914
14057b94632N5199R9773N9150N8620N1153l8057k1709n4678j8328o6018R137M9492
$$ plain form
14045 -110898 -6060 -36899 -108760 -166775 -214499 -251032 -200649 100055 171982 69161 -70439
14034 -70439 -93704 -183262 -95588 18765 72159 -3623 -301781 -425424 -305618 -258258 -170290
14023 -170290 -104667 -56439 83147 -21579 -118167 -48931 -36207 -48420 -170164 -181711 -266001
14012 -266001 -135151 -6812 20364 -90494 -115083 -37887 6262 48266 16991 -15757 -134537
14001 -134537 -268731 -65213 -84721 -123935 12513 55711 -99460 -97927 -190993 -302178 -276375
13990 -276375 -192954 -130480 -98214 -146220 -267530 -345660 -255275 -63024 -36604 -46968 122690
13979 122690 297190 231892 101157 140911 9988 1444 64260 68133 50961 -29625 -94626
13968 -94626 -42791 63294 -2444 105208 123661 4041 -20559 15249 -81253 -229982 -314812
$$ packed form
14045a10898J04838l0839p1861n8015m7724l6533N0383L00704P1927j02821j39600
14034g0439k3265q9558Q7674J14353N3394p5782k98158j23643J19806M7360Q7968
14023a70290O5623M8228J39586j04726r6588O9236J2724j2213j21744j1547q4290
14012b66001J30850J28339K7176j10858k4589P7196M4149M2004l1275l2748j18780
14001a34537j34194K03518j9508l9214J36448M3198j55171J533r3066j11185K5803
13990b76375Q3421O2474L2266m8006j21310p8130R0385J92251K6420j0364J69658
13979A22690J74500o5298j30735L9754j30923q544O2816L873j7172q0586o5001
13968i4626N1835J06085o5738J07652J8453j19620k4600L5808r6502j48729q4830
$$ plain form
13957 -314812 -329504 -174753 -235304 -243663 -58032 134096 61815 73498 70477 93446 151728
13946 151728 219 2953 -167944 -137751 -94192 -105392 -60954 150016 341509 310838 207260
13935 207260 124107 239458 75473 -10399 74575 64613 -47062 -213787 -138129 55418 -5197
13924 -5197 14742 92999 137632 190113 319817 451803 251683 129616 160710 176580 119621
13913 119621 147439 223238 127453 -162810 -267519 -34883 85444 53177 -56727 -158209
13903 -158209 -223745 -248854 -119061 -98251 -64132 -154907 -210050 -175606 -253425 -257917 -54793
13892 -54793 -237 -106630 -106686 -153568 -245641 -184716 -206535 -275965 -246275 -66272 -25705 94129
13880 94129 134218 3440 -90449 -102001 -95505 -246095 -226997 66715 138618 35610 53498
$$ packed form
13957c14812j4692J54751o0551q359J85631J92128p2281J1683l021K2969N8282
13946A51728j51509K734j70897L0193M3559j1200M4438K10970J91493l0671j03578
13935B07260q3153J15351j63985q5872Q4974r962j11675j66725P5658J93547o0615
13924e197J9939P8257M4633N2481J29704J31986k00120j22067L1094J5870n6959
13913A19621K7818P5799r5785k90263j04709K32636J20327l2267j09904j01482
13903a58209o5536k5109J29793K0810L4119r0775n5143L4444p7819m492K03124
13892e4793N4556j06393n6m6882r2073O0925k1819o9430K9690J80003M0567J19834
13880I4129M0089j30778r3889j1552O496j50590J9098K93712P1903j03008J7888
$$ plain form
13869 53498 98631 190368 126580 150942 106018 77033 51019 -58055 -199945 -92077 61379
13858 61379 57204 124758 -106905 -186043 -165210 -130064 106359 -57936 -156079 -115340 -16652
13847 -16652 -13421 -89107 -45969 -137464 104306 149364 28506 -72937 34148 110106 183031
13836 183031 276736 72020 -13582 146548 62809 -18408 -202566 -261026 -279832 -217319 -91302
13825 -91302 -174055 -184195 -122841 -112575 -79544 -197727 -6294 139357 237742 119110 126426
13814 126426 278517 192833 244839 254707 165096 112427 279752 289870 312057 229402 21366
13803 21366 -173431 -334441 -306314 -191005 -148120 -84686 19800 178547 -13645 -268026
13793 -268026 -266031 -123995 24777 39992 51034 58374 99450 115511 100776 143990 77008
$$ packed form
13869E3498M5133R1737o3788K4362m4924k8985k6014j09074j41890J07868J53456
13858F1379m175O7554k31663p9138K0833L5146K36423j64295r8143M0739R8688
13847a6652L231p5686M3138r1495K41770M5058j20858j01443J07085P5958P2925
13836A83031R3705k04716q5602J60130q3739q1217j84158n8460j8806O2513J26017
13825i1302q2753j0140O1354J0266L3031j18183J91433J45651R8385j18632P316
13814A26426J52091q5684N2006R868q9611n2669J67325J0118K2187q2655k08036
13803B1366j94797j61010K8127J15309M2885O3434J04486J58747j92192k54381
13793b68026J995J42036J48772J5215J1042P340M1076J6061j4735M3214o6982
$$ plain form
13782 77008 80410 72701 42979 -45649 -3261 163026 223916 169712 28537 -76614 -114708
13771 -114708 -75064 -9952 -43846 99055 198160 128194 159495 117728 -25062 -120374 -184708
13760 -184708 -96484 149555 24081 -11331 10554 -42407 -53765 58846 -33101 -131545 -20503
13749 -20503 127045 129355 47555 63731 -98920 -112626 -102363 -154020 -253362 -276161 -287040
13738 -287040 -53391 -27869 -58318 -115335 1265 98334 204023 158611 208211 90106 -179740
13727 -179740 -149770 14399 -87358 -240433 -273701 -274339 -170169 -110220 -36583 -24248 -56813
13716 -56813 -89261 -49928 -53532 -71254 -102445 -22876 24496 7400 -29488 -59435 -145683 -169805
13704 -169805 -136602 -143331 -139330 -155939 -259747 -152621 7953 -46269 -104400 -53463 -54393 4340
$$ packed form
13782G7008L402p709k9722q8628M2388J66287O0890n4204j41175j05151l8094
13771a14708L9644O5112l3894J42901R9105o9966L1301m1767j42790r5312o4334
13760a84708Q8224K46039j25474l5412K1885n2961j1358J12611r1947r8444J11042
13749b0503J47548K310q1800J6176j62651j3706J0263n1657r9342k2799j0879
13738b87040K33649K5522l0449n7017J16600R7069J05689m5412M9600j18105k69846
13727a79740K9970J64169j01757j53075l3268o38J04170N9949P3637J2335l2565
13716e6813l2448L9333l604j7722l1191P9569M7372j7096l6888k9947q6248k4122
13704a69805L3203o729M001j6609j03808J07126J60574n4222n8131N0937r30N8733
$$ plain form
13692 4340 24929 61346 93957 104906 -13214 -26592 -157620 -367900 -267524 -36926 109462
13681 109462 13881 -34338 -176907 -63004 -36623 37828 48522 -11038 118241 336445 503769
13670 503769 372326 248696 311224 251008 189984 137770 187255 166871 128724 126300 71511
13659 71511 144568 243516 188027 30614 -23012 -79968 -69609 -54419 -25481 -9298 -101275
13648 -101275 -71952 -24597 -168096 -176466 -157582 -23761 -36586 -61641 -205800 -170211 5345
13637 5345 88553 96236 2094 -58378 9107 -16063 140342 130603 91264 76293 -16523 -53758
13625 -53758 229580 268012 36438 -61992 -119639 -176647 -28710 118418 262858 171262 -151791
13614 -151791 -165868 -98276 -30297 59345 68594 -18360 -46693 -53450 -159211 -1786 -61323
$$ packed form
13692D340K0589L6417L2611J0949j18120j3378j31028k10280J00376K30598J46388
13681A09462r5581m8219j42569J13903K6381P4451J0694n9560J29279K18204J67324
13670E03769j31443j23630O2528o0216o1024n2214M9485k0384l8147k424n4789
13659G1511P3057R8948n5489j57413n3626n6956J0359J5190K8938J6183r1977
13648a01275K9323M7355j43499q370J8884J33821j2825k5055j44159L5589J75556
13637E345Q3208P683r4142o0472O7485k5170J56405r739l9339j4971r2816l7235
13625e3758K83338L8432k31574r8430n7647n7008J47937J47128J44440r1596l23053
13614a51791j4077O7592O7979Q9642R249q6954k8333o757j05761J57425n9537
$$ plain form
13603 -61323 -44735 114109 51948 127122 272263 232346 231993 221569 239907 165857 76250 17881
13591 17881 26777 137395 59400 -133837 -106377 -177918 -129682 -69864 -193360 -90472 -54511
13580 -54511 -119463 -105690 -65177 -21466 -11963 -88906 -11223 -53760 -166258 -94225 32758
13569 32758 7645 63310 -68727 -209427 -170229 -7378 37395 152183 148316 19839 7778
13558 7778 -104202 -14587 -69597 -79531 -67096 -83158 -7449 61768 42436 150846 176212 44484
13546 44484 135805 89359 -157266 -115177 -125976 -140270 -238578 -375082 -401162 -382061 -295388
13535 -295388 -196929 -28330 143140 11583 4152 5532 113661 162615 81598 121776 139406
13524 139406 76788 42811 35745 -20900 55554 66524 158759 -2578 -69227 -129615 -150135
$$ packed form
13603f1323J6588J58844o2161P5174J45141l9917l53j0424J8338p4050q9607n8369
13591A7881Q896J10618p7995j93237K7460p1541M8236N9818j23496J02888L5961
13580e4511o4952J3773M0513M3711R503p6943P7683m2537j12498P2033J26983
13569C2758k5113N5665j32037j40700L9198J62851M4773J14788l867j28477j2061
13558G778j11980Q9615n5010r934J2435j6062P5709O9217j9332J08410K5366j31728
13546D4484R1321m6446k46625M2089j0799j4294r8308j36504k6080J9101Q6673
13535b95388R8459J68599J71470j31557p431J380J08129M8954q1017M0178J7630
13524A39406o2618l3977p066n6645P6454J0970R2235j61337o6649o0388k0520
$$ plain form
13513 -150135 13494 116451 157291 215925 229268 -31036 -331299 -343144 -265224 66542
13503 66542 217917 288048 181608 194138 102617 120859 218583 231860 130355 107641 99361
13492 99361 -41517 54128 83724 78853 29923 -225835 -248409 -96731 -138064 -102101 -147514
13481 -147514 -155034 -45147 -4128 78791 -48674 -69515 -68593 -21335 -47275 -2654 -59691 -122460
13469 -122460 -185477 -300171 -104617 -100822 -135242 -147025 -65023 47312 105588 35706 -18045
13458 -18045 -32556 -71293 -118575 -65961 8348 56689 149478 223356 359939 321267 311199
13447 311199 275829 52835 63644 141630 358184 424836 307123 354723 291692 263203 272685
13436 272685 287378 100081 -26603 15990 -19341 -54115 57907 73758 111506 170976 166876
$$ packed form
13513a50135J63629J02957M0840N8634J3343k60304l00263j1845P7920L31766
13503F6542J51375P0131j06440J2530r1521J8242R7724J3277j01505k2714q280
13492I9361j40878R5645K9596m871m8930k55758k2574J51678m1333L5963m5413
13481a47514p520J09887M1019Q2919j27465k0841R22M7258k5940M4621n7037o2769
13469a22460o3017j14694J95554L795l4420j1783Q2002J12335N8276o9882n3751
13458a8045j4511l8737m7282N2614P4309M8341R2789P3878J36583l8672j0068
13447C11199l5370k22994J0809P7986K16554O6652j17713M7600o3031k8489R482
13436B72685J4693j87297j26684M2593l5331l4774J12022J5851L7748N9470m100
$$ plain form
13425 166876 110117 56636 30243 244683 525345 393038 381116 181508 62349 170628
13415 170628 241642 157947 68789 84976 144978 137672 63146 306 -125061 -152471 4615
13404 4615 239 57290 49043 74854 99075 227110 231131 117103 100187 163910 156029 225925
13392 225925 60931 -42834 -86452 -168003 -152601 -109147 -30188 -115448 -128290 48548 223674
13381 223674 248250 40702 -34096 -103047 25848 50794 10322 75331 64771 18977 67675
13370 67675 186297 323001 308289 169106 56749 176710 248988 215818 263918 235836 246719
13359 246719 174383 213232 233586 137947 145460 185190 255722 271940 180336 162113 21096
13348 21096 -45310 -21736 51581 33886 -60717 -250548 -223563 -152444 -54529 10722 96728
$$ packed form
13425A66876n6759n3481k6393K14440K80662j32307j1922j99608j19159J08279
13415A70628P1014q3695q9158J6187O0002p306p4526o2840j25367k7410J57086
13404D615m376N7051q247K5811K4221J28035M021j14028j6916O3723p881O9896
13392B25925j64994j03765m3618q1551J5402M3454P8959q5260j2842J76838J75126
13381B23674K4576k07548p4798o8951J28895K4946m0472O5009j0560m5794M8698
13370F7675J18622J36704j4712j39183j12357J19961P2278l3170M8100k8082J0883
13359B46719p2336L8849K0354r5639P513L9730P0532J6218r1604j8223j41017
13348B1096o6406K3574P3317j7695r4603j89831K6985P1119R7915O5251Q6006
$$ plain form
13337 96728 77376 -13957 75127 -36733 37376 -48686 -77973 13323 98340 117345 79323
13326 79323 90597 -3925 71973 185614 154972 -19510 -14102 33599 -32067 32081 152220
13315 152220 87336 81678 2228 -102516 -246206 -340659 -295610 -245505 -135048 -102350 8183
13304 8183 64777 60614 -82950 -125516 -69328 -117364 -129689 -133029 -8479 -60842 -26596 -122558
13292 -122558 35221 80078 -12819 -113677 -2452 144615 279719 295991 68581 -47939
13282 -47939 -91523 -142713 -84175 -79936 75242 -33326 -88316 -73976 -140939 -97408 97918
13271 97918 99009 -33806 72213 87031 7423 -56228 -93348 75975 108814 86145 63459
13260 63459 -32543 54310 106259 -68833 -125266 100504 384226 416478 437474 425610 300925
$$ packed form
13337I6728j9352r1333Q9084j11860P4109q6062k9287R1296Q5017J9005l8022
13326G9323J1274r4522P5898J13641l0642j74482N408M7701o5666O4148J20139
13315A52220o4884n658p9450j04744j43690r4453M5049N0105J10457L2698J10533
13304H183N6594m163j43564m2566N6188m8036j2325l340J24550n2363L4246r5962
13292a22558J57779M4857r2897j00858J11225J47067J35104J6272k27410j16520
13282d7939m3584n1190N8538M239J55178j08568n4990J4340o6963M3531J95326
13271I7918J091j32815J06019J4818p9608o3651l7120J69323L2839k2669k2686
13260F3459r6002Q6853N1949j75092n6433K25770K83722L2252K0996j1864j24685
$$ plain form
13249 300925 260579 206920 209295 217194 87420 -83182 -91639 -65278 86578 138364 127238
13238 127238 178912 257360 93821 54853 66109 159760 200979 230089 190628 254125 130263
13227 130263 114969 238133 271407 463520 472989 289731 145701 148855 152981 167386 199659
13216 199659 164791 -29741 -114099 -43888 30728 76135 168344 145168 78387 -43291 -76518
13205 -76518 -110555 -44532 -32223 -86074 -30007 6772 -38419 25915 -80728 -134754 -41149
13194 -41149 -46735 45363 237477 269677 112502 -63479 -31731 96782 95695 73796 158893
13183 158893 156044 107298 -13121 7204 11825 141203 149988 116701 108313 65619 39760 77089
13171 77089 161632 18886 -47896 -112592 -51710 51774 123992 163842 61197 -152883 -55202
$$ packed form
13249C00925m0346n3659K375P899j29774j70602q457K6361J51856N1786j1126
13238A27238N1674P8448j63539l8968J1256R3651M1219K9110l9461O3497j23862
13227A30263j5294J23164L3274J92113R469j83258j44030L154M126J4405L2273
13216A99659l4868j94532q4358P0211P4616M5407R2209k3176o6781j21678l3227
13205g6518l4037O6023J2309n3851N6067L6779m5191O4334j06643n4026R3605
13194d1149n586R2098J92114L2200j57175j75981L1748J28513j087k1899Q5097
13183A58893k849m8746j20419K0325M621J29378Q785l3287q388m2694k5859L7329
13171G7089Q4543j42746o6782o4696O0882J03484P2218L9850j02645k14080R7681
$$ plain form
13160 -55202 54071 74754 57628 45867 88387 110061 65755 44725 71332 191372 251513
13149 251513 121956 203682 226911 244577 319071 303638 269185 263717 318256 230861 218143
13138 218143 219937 156792 180987 151380 110143 -215482 -257684 -89351 -43361 -32415 57334
13127 57334 121747 18504 3985 -8754 -91143 -126446 44695 -119285 -183351 2327 101893
13116 101893 -23826 -95277 -43072 -55545 -46465 66371 146172 168663 88306 -62373 -98752
13105 -98752 -68985 -70422 -26191 -61540 33623 75617 79482 133947 75196 47809 108167 79011
13093 79011 -198536 -296869 -324803 -211105 -35707 44605 113920 123655 16653 55092 4489
13082 4489 2343 173155 161972 113509 189524 196464 116141 157252 112717 -17048 -68136 4337
$$ packed form
13160e5202J09273K0683j7126j1761M2520K1674m4306k1030K6607J20040O0141
13149B51513j29557Q1726K3229J7666P4494j5433l4453n468N4539q7395j2718
13138B18143J794o3145K4195k9607m1237l25625m2202J68333M5990J0946Q9749
13127E7334O4413j03243j4519j2739q2389l5303J71141j63980o4066J85678R9566
13116A01893j25719p1451N2205j2473R080J12836P9801K2491q0357j50679l6379
13105i8752K9767j437M4231l5349R5163M1994L865N4465n8751k7387O0358k9156
13093G9011k77547r8333k7934J13698J75398Q0312O9315R735j07002L8439n0603
13082D489k146J70812j1183m8463P6015O940q0323M1111m4535j29765n1088P2473
$$ plain form
13070 4337 -13565 -157598 -67491 -15564 85544 155422 153811 123227 -20076 -163706 -119352
13059 -119352 -67647 -17079 110188 202092 113403 12338 6268 -20340 44176 158737 108794
13048 108794 -110490 -174416 -149854 108390 150714 91826 170867 104932 107242 34393 78455
13037 78455 78380 -26593 101086 -22618 -76532 -130273 -128478 62573 174425 342391 285039
13026 285039 139751 52364 85139 26970 -52028 -55431 2547 -53188 -115756 -32689 97233
13015 97233 45348 -73171 -43076 105177 192588 146767 31097 -25940 -120662 -177291 -254470
13004 -254470 -289826 -270141 -307348 -115309 102839 67852 96853 289351 404227 190351
12994 190351 84020 88716 71365 43258 191066 306406 281809 115394 -36060 -39101 -120529
$$ packed form
13070D337j7902j44033R0107N1927J01108O9878j611l0584j43303j43630M4354
13059a19352N1705N0568J27267R1904q8689j01065o070k6608O4516J14561m9943
13048A08794k19284o3926K4562K58244M2324n8888P9041o5935K310p2849M4062
13037G8455p5j04973J27679j23704n3914n3741J795J91051J11852J67966n7352
13026B85039j45288q7387L2775n8169p8998l403N7978n5735o2568Q3067J29922
13015I7233n1885j18519L0095J48253Q7411m5821j15670n7037r4722n6629p7179
13004b54470l5356J9685l7207J92039K18148l4987K9001J92498J14876k13876
12994A90351j06331M696j7351k8107J47808J15340k4597j66415j51454l041q1428
$$ plain form
12983 -120529 -130562 24560 159608 117408 45318 63943 108003 116368 -1289 3828 12950
12972 12950 72370 101404 112485 170116 232182 75219 31818 -8421 -74261 -65979 -101826 -27202
12960 -27202 -48890 -113069 -48745 32562 84013 105783 104958 152425 240070 250934 206386 168710
12948 168710 179843 99275 20061 -25360 -87072 -153695 85763 162998 -29375 1589 110011
12937 110011 74918 4388 218899 218444 5228 43231 119860 153318 269446 378858 495890
12926 495890 347264 59844 14761 11996 64744 35930 -76339 -111616 -179675 -189243 -103449
12915 -103449 -191033 -129189 -152188 -137908 54919 67230 -167106 -144949 -144245 -180539 19946
12904 19946 35050 -43305 -28621 -105687 -68603 -88947 -211842 -135793 16225 29450 99807
$$ packed form
12983a20529j0033J55122J35048m2200p2090J8625M4060Q365j17657N117R122
12972A2950N9420K9034J1081N7631O2066j56963m3401m0239o5840Q282l5847P4624
12960b7202k1688o4179O4324Q1307N1451K1770q25M7467Q7645J0864m4548l7676
12948A68710J1133q0568p9214m5421o1712o6623K39458P7235j92373L0964J08422
12937A10011l5093p0530K14511m55k13216L8003P6629L3458J16128J09412J17032
12926D95890j48626k87420m5083k765N2748k8814j12269l5277o8059r568Q5794
12915a03449q7584O1844k2999J4280J92827J2311k34336K2157P04l6294K00485
12904A9946J5104p8355J4684p7066L7084k0344j22895P6049J52018J3225P0357
$$ plain form
12893 99807 -17001 -30549 -20225 -166558 -154537 -150616 -101239 142830 315524 147728 -103950
12882 -103950 -14020 128970 235330 2870 -90952 -85271 -63019 -105596 -212051 -50425 113249
12871 113249 83639 17969 -77325 134897 229253 39406 -229086 -121672 81010 100690
12861 100690 217822 346225 356009 111148 -92958 -100445 -61902 -14440 -17553 -134867 -251854
12850 -251854 -150308 -26445 82435 187774 -3214 -259471 -350031 -393434 -333087 -251936
12840 -251936 -4537 150555 136058 146475 98444 -40769 -215266 -217464 821 125826
12830 125826 61329 -72257 20442 21502 103257 304369 415454 267931 173649 44683 17337
12819 17337 54237 152282 198400 80733 -46462 -36401 136318 232344 357009 410853 484767
$$ packed form
12893I9807j16808j3548J0324j46333J2021L921M9377K44069J72694j67796k51678
12882a03950Q9930J42990J06360k32460r3822N681K2252m2577j06455J61626J63674
12871A13249k9610o5670r5294K12222R4356j89847k68492J07414K02682J9680
12861A00690J17132J28403R784k44861k04106p487L8543M7462l113j17314j16987
12850b51854J01546J23863J08880J05339j90988k56257r0560m3403O0347Q1151
12840b51936K47399J55092j4497J0417m8031j39213j74497k198K18285J25005
12830A25826o4497j33586R2699J060Q1755K01112J11085j47523r4282j28966k7346
12819A7337L6900R8045M6118j17667j27195J0061J72719R6026J24665N3844P3914
$$ plain form
12808 484767 392271 117426 -63895 -29786 37044 26866 55046 270050 265536 312036 337175
12797 337175 258632 252915 356440 548342 486389 243603 364564 389923 430971 373965 238909
12786 238909 285517 341863 284625 217033 106649 92338 259724 379209 298725 221546 140042
12775 140042 138092 187504 315932 356697 261553 144578 147174 306883 265851 290490 343741
12764 343741 421160 341277 110088 109821 88315 -32169 -12242 -34 5494 216985 100906
12753 100906 -230478 -199770 68978 236658 181223 52183 211466 355727 329424 221329
12743 221329 100908 129306 126578 71531 185016 299127 224575 5811 160910 186243 233447
12732 233447 396163 426919 396191 324269 167548 26564 97614 -22913 -51201 114504
$$ packed form
12808D84767r2496k74845j81321L4109O6830j0178K8180K15004m514M6500K5139
12797C37175p8543n717J03525J91902o1953k42786J20961K5359M1048n7006j35056
12786B38909M6608N6346n7238o7592j10384j4311J67386J19485q0484p7179q1504
12775A40042j950M9412J28428M0765r5144j16975K596J59709m1032K4639N3251
12764C43741P7419p9883k31189k67k1506j20484J9927J2208N528K11491j16079
12753A00906l31384L0708K68748J67680n5435j29040J59283J44261k6303j08095
12743B21329j20421K8398k728n5047J13485J14111p4552k18764J55099K5333M7204
12732B33447J62716L0756l0728p1922j56721j40984P1050j20527k8288J65705
$$ plain form
12722 114504 275352 203090 66355 -30668 -93345 -109874 -7952 49215 98848 209975 158692
12711 158692 63871 121171 122889 176890 340075 361168 257531 146085 87615 211139 254209
12700 254209 100465 36494 129528 140637 24139 -29424 94131 135527 164958 135993 133421
12689 133421 36089 81108 259209 203476 225235 397792 348853 235903 314622 327451 352925
12678 352925 444535 345483 110382 141806 196420 225942 224376 223501 361937 469270 513139
12667 513139 531474 508620 444339 240556 65813 184839 297229 212526 262029 240961 351712
12656 351712 280369 266229 251048 233333 115871 91785 -6645 -39106 168086 105890 275567
12645 275567 335820 259158 234645 231009 261762 178184 10777 -10546 -67436 170962 419565
$$ packed form
12722A14504J60848p2262j36735r7023o2677j6529J01922N7167M9633J11127n1283
12711A58692r4821N7300J718N4001J63185K1093j03637j11446n8470J23524M3070
12700B54209j53744o3971R3034J1109j16498n3563J23555M1396K9431k8965k572
12689A33421r7332M5019J78101n5733K1759J72557m8939j12950P8719J2829K5474
12678C52925R1610r9052k35101L1424N4614K9522j566q75J38436J07333M3869
12667E13139J8335k2854o4281k03783j74743J19026J12390q4703M9503k1068J10751
12656C51712p1343j4140j5181j7715j17462k4086r8430l2461K07192o2196J69677
12645B75567O0253p6662k4513l636L0753q3578j67407k1323n6890K38398K48603
$$ plain form
12634 419565 540926 450601 338609 161546 177393 173950 50584 -57716 -107317 -35200 114725
12623 114725 154035 121211 130408 306499 187587 576 -106850 88683 184226 135113 121719
12612 121719 120797 196866 182115 179389 166006 198701 285776 336608 299785 202485 192548 399112
12600 399112 467520 285181 92092 97916 162025 276846 249093 139821 221309 263432 257948
12589 257948 249696 351461 241016 224921 179320 225676 236976 408072 423545 365887 344066
12578 344066 298014 413875 460077 496079 515505 384074 389022 424925 432978 156950 344169
12567 344169 492603 496856 371154 282212 301988 354729 387539 349502 356072 276273 186979
12556 186979 97426 -24504 72904 171774 189155 289421 407287 385094 441118 355011 422827
$$ packed form
12634D19565J21361r0325j11992j77063J5847l443j23366j08300m9601P2117J49925
12623A14725L9310l2824R197J76091j18912j87011j07426J95533R5543m9113j3394
12612A21719r22P6069j4751k726j3383L2695Q7075N0832l6823r7300r937K06564
12600C99112O8408j82339j93089N824O4109J14821k7753j09272Q1488M2123n484
12589B57948q252J01765j10445j6095m5601M6356J1300J71096J5473n7658k1821
12578C44066m6052J15861M6202L6002J9426j31431M948L5903Q053k76028J87219
12567C44169J48434M253j25702q8942J9776N2741L2810l8037O570p9799q9294
12556A86979q9553j21930R7408R8870J7381J00266J17866k2193N6024q6107O7816
$$ plain form
12545 422827 502065 472380 440671 415358 331047 344982 388755 374228 521420 568614 543098
12534 543098 403307 217616 77046 85568 146808 302755 314128 265655 234682 302986 426891
12523 426891 246404 228974 128394 19068 -28162 112406 152815 7169 31188 304887
12513 304887 423263 345995 349438 451857 662222 731305 655163 576954 587867 541784 304194
12502 304194 304600 424900 568247 452037 339449 251727 297646 310895 303068 342897 205712
12491 205712 225376 287584 285090 234723 423055 657605 653544 662827 585734 396069 370765
12480 370765 372438 395218 449269 595318 591174 460770 431277 512959 732700 834651 760204
12469 760204 746465 646628 524848 419093 464659 382646 384929 365226 391484 305394 270737
$$ packed form
12545D22827P9238k9685l1709k5313q4311J3935M3773j4527J47192M7194k5516
12534E43098j39791j85691j40570Q522O1240J55947J1373m8473l0973O8304J23905
12523D26891j80487j7430j00580j09326m7230J40568M0409j45646K4019K73699
12513C04887J18376p7268L443J02419K10365O9083p6142p8209J0913m6083k37590
12502C04194M06J20300J43347j16210j12588q7722M5919J3249p827L9829j37185
12491B05712J9664O2208k494n0367J88332K34550m061R283p7093j89665k5304
12480C70765J673K2780N4051J46049m144j30404k9493Q1682K19741J01951p4447
12469G60204j3739r9837j21780j05755M5566q2013K283j9703K6258q6090l4657
$$ plain form
12458 270737 307355 348034 438406 463618 294751 409457 445044 498307 443490 528713 729177
12447 729177 795328 667432 590686 627526 564755 503155 470175 419037 436894 512590 380863
12436 380863 290283 264843 137024 129806 292853 475350 502946 548317 421791 377084 521133
12425 521133 488185 450904 455505 369362 400055 517585 695375 737587 684472 597193 518438
12414 518438 700901 687900 659992 688043 678028 667845 687514 482140 434008 547532 442055
12403 442055 368883 598682 596413 579145 597056 503046 643714 616807 546747 595404 526986
12392 526986 499311 494695 797821 969653 838253 693003 763155 735523 557000 547260 620758
12381 620758 761216 694525 512865 431474 513977 596394 499721 427436 558945 533645 510279
$$ packed form
12458B70737L6618M0679R0372K5212j68867J14706L5587N3263n4817Q5223K00464
12447G29177O6151j27896p6746L6840o2771o1600l2980n1138J7857P5696j31727
12436C80863r0580k5440j27819p218J63047J82497K7596M5371j26526m4707J44049
12425E21133l2948l7281M601q6143L0693J17530J77790M2212n3115q7279p8755
12414E18438J82463j3001k7908K8051j0015j0183J9669k05374m8132J13524j05477
12403D42055p3172K29799k269j7268J7911r4010J40668k6907p0060M8657o8418
12392E26986k7675m616L03126J71832j31400j45250P0152k7632j78523r740P3498
12381F20758J40458o6691j81660q1391Q2503Q2417r6673p2285J31509k5300k3366
$$ plain form
12370 510279 592611 655073 677004 662353 843889 848867 820719 812415 741420 678334 857058
12359 857058 851023 797867 754497 639183 685138 924380 943201 931790 820147 771354 773241
12348 773241 649898 727302 734832 853020 858612 762036 645322 727961 825077 762710 802940
12337 802940 910842 918374 894841 898704 904369 880755 826953 664858 662952 854876 926530 810291
12325 810291 620693 645763 631354 746380 793136 854990 925990 943216 802659 743475 806771
12314 806771 911881 725630 671865 701861 884548 906294 831594 815557 979682 1000754 943822
12303 943822 992197 949533 1007567 1169087 1216227 1073868 935513 848390 977910 1120460
12293 1120460 1118150 1113579 1091552 1134792 1145054 963563 761642 844365 911357 972975 994849
$$ packed form
12370E10279Q2332O2462K1931j4651J81536M978k8148q304p0995o3086J78724
12359H57058o035n3156m3370j15314M5955K39242J8821j1411j11643m8793J887
12348G73241j23343P7404P530J18188N592r6576j16714Q2639R7116o2367M0230
12337H02940J07902P532k3533L863N665k3614n3802j62095j906J91924P1654j16239
12325H10291j89598K5070j4409J15026M6756O1854P1000J7226j40557n9184O3296
12314H06771J05110j86251n3765K9996J82687K1746p4700j6037J64125K1072n6932
12303I43822M8375m2664N8034J61520M7140j42359j38355q7123J29520J42550
12293A120460k310m571k2027M3240J0262j81491k01921Q2723O6992O1618K1874
$$ plain form
12282 994849 1020331 1106220 1059848 876360 742537 900894 981893 1188040 1179129 1344138 1578142
12271 1578142 1457327 1305537 1331108 1372918 1313789 1193962 1075970 917217 888494 1081791
12261 1081791 1079192 1049209 1097010 1150118 1273920 1378573 1324256 1221689 1166401 1142064 1089652
12250 1089652 1063768 1029612 1246270 1424108 1212499 1152367 1214927 1267942 1185389 1167821 1126122
12239 1126122 1231206 1267993 1400512 1489884 1452110 1502580 1488493 1450732 1414163 1400617 1543788
12228 1543788 1424331 1487274 1710721 1802188 1582198 1532698 1676701 1766427 1767477 1671537 1600028
12217 1600028 1619416 1687313 1579592 1533008 1676405 1816891 1851600 2006806 1954194 2012371
12207 2012371 2071060 2051484 1803629 1758252 1651066 1626347 1815625 1990779 1841755 1688042
$$ packed form
12282I94849K5482Q5889m6372j83488j33823J58357Q0999K06147q911J65009K34004
12271A578142j20815j51790K5571M1810n9129j19827j17992j58753k8723J93297
12261A081791k599k9983M7801N3108J23802J04653n4317j02567n5288k4337n2412
12250A089652k5884l4156K16658J77838k11609o0132O2560N3015q2553j7568m1699
12239A126122J05084L6787J32519Q9372l7774N0470j4087l7761l6569j3546J43171
12228A543788j19457O2943K23447R1467k19990m9500J44003Q9726J050r5940p1509
12217A600028J9388O7897j07721m6584J43397J40486L4709J55206n2612N8177
12207B012371N8689j9576k47855m5377j07186k4719J89278J75154j49024j53713
$$ plain form
12197 1688042 1802566 1875768 1942747 2111019 2044607 2021944 2046589 2227240 2301767 2315727 2401983
12186 2401983 2435078 2313432 2254246 2346260 2217210 2195188 2218422 2217793 2227819 2400624 2310027
12175 2310027 2329828 2470171 2618657 2730882 2704572 2696708 2805002 2917357 2970307 2635692
12165 2635692 2453908 2593179 2684131 2786449 2679670 2732694 2677013 2613229 2765831 2993131
12155 2993131 3163887 3192503 3203838 3127621 3177940 3254490 3212970 3147002 3117079 3340753 3389455
12144 3389455 3301116 3326913 3444316 3573312 3494331 3510728 3504527 3490282 3490754 3578300 3715389
12133 3715389 3664494 3655635 3626523 3604145 3663513 3695310 3700728 3857424 4073892 3985345 3890208
12122 3890208 3914027 4108792 4183264 4273056 4500872 4617494 4641480 4532627 4478049 4569657
$$ packed form
12197A688042J14524P3202O6979J68272o6412k2663K4645J80651P4527J3960Q6256
12186B401983L3095j21646n9186R2014j29050k2022K3234o29J0026J72805r0597
12175B310027J9801J40343J48486J12225k6310p864J08294J12355N2950l34615
12165B635692j81784J39271R0952J02318j06779N3024n5681o3784J52602K27300
12155B993131J70756K8616J1335p6217N0319P6550m1520o5968k9923K23674M8702
12144C389455q8339K5797J17403J28996p8981J6397o201j4245M72Q7546J37089
12133C715389n0895q859k9112k2378N9368L1797N418J56696K16468q8547r5137
12122C890208K3819J94765P4472Q9792K27816J16622K3986j08853n4578R1608
$$ plain form
12112 4569657 4786677 4935244 4887945 4936628 4964702 5235709 5367573 5269090 5178153 5091984
12102 5091984 5131422 5230115 5341904 5471955 5664256 5871000 5871827 5899603 6005718 5970244 5980798
12091 5980798 6119718 6356683 6384975 6363287 6512716 6735839 6785854 6684505 6786405 6783724
12081 6783724 6932296 7099405 7309382 7479016 7531755 7674122 7749346 7768335 7790585 7965171
12071 7965171 8156799 8416084 8504335 8713320 8621603 8574491 8884307 9225065 9348607 9468375
12061 9468375 9510105 9542386 9638545 9874364 10046996 10224903 10365017 10524696 10648924 10696669
12051 10696669 10861931 11149682 11415096 11582865 11870444 12132691 12557326 12802776 12766810
12042 12766810 12741079 12980065 13235690 13347720 13637869 13829508 14032012 14285654 14747060
$$ packed form
12112D569657K17020J48567m7299M8683K8074K71007J31864r8483r0937q6169
12102E091984L9438R8693J11789J30051J92301K06744Q27K7776J06115l5474J0554
12091E980798J38920K36965K8292k1688J49429K23123N0015j01349J01900k681
12081F783724J48572J67109K09977J69634N2739J42367P5224J8989K2250J74586
12071G965171J91628K59285Q8251K08985r1717m7112L09816L40758J23542J19768
12061I468375M1730L2281R6159K35819J72632J77907J40114J59679J24228M7745
12051A0696669J65262K87751K65414J67769K87579K62247M24635K45450l5966
12042A2766810k5731K38986K55625J12030K90149J91639K02504K53642M61406
$$ plain form
12033 14747060 15080348 15179827 15350476 15750575 16401845 16784927 17016023 17177454 17538193
12024 17538193 17922873 18227977 18760554 19120104 19508436 19965433 20328833 20531547 20991326
12015 20991326 21503798 21947582 22402338 22887958 23090844 23612165 24215046 24729086 25032000
12006 25032000 25581269 26343837 26873438 27379918 27982258 28483935 29118807 29800283 30336760
11997 30336760 31037963 31656826 32275613 32839446 33376954 33809527 34384228 34991759 35828627
11988 35828627 36593672 37389962 38152723 38812468 39680697 40357135 40885907 41509250 42078974
11979 42078974 42804440 43565909 44337802 44957357 45609245 46173633 46874734 47460427 48010254
11970 48010254 48587879 48963263 49418244 49948713 50455859 50743530 51074562 51474727 51774139
$$ packed form
12033A4747060L33288R9479J70649M00099O51270L83082K31096J61431L60739
12024A7538193L84680L05104N32577L59550L88332M56997L63400K02714M59779
12015B0991326N12472M43784M54756M85620K02886N21321O02881N14040L02914
12006B5032000N49269P62568N29601N06480O02340N01677O34872O81476N36477
11997C0336760P01203O18863O18787N63833N37508M32573N74701O07531Q36868
11988C5828627P65045P96290P62761O59745Q68229O76438N28772O23343N69724
11979D2078974P25466P61469P71893O19555O51888N64388P01101N85693N49827
11970D8010254N77625L75384M54981N30469N07146K87671L31032M00165K99412
$$ plain form
11961 51774139 52125904 52260329 52356917 52589828 52665256 52759628 52900473 52991217 52955005 52837392
11951 52837392 52528164 52417817 52383768 52071127 51695551 51176301 50840538 50325442 49835088
11942 49835088 49558152 49202706 48661774 48086881 47579550 46938885 46474932 45866383 45144017
11933 45144017 44499499 43777271 43076005 42252164 41767649 41179069 40578006 40114329 39403079
11924 39403079 38639007 37811466 37085005 36509287 36052297 35315254 34664745 34186112 33445432
11915 33445432 32906794 32409514 31727967 31128187 30698130 30045685 29417969 28769546 28101343
11906 28101343 27544833 26945223 26397777 25887734 25467203 25107125 24637101 24147573 23758180
11897 23758180 23232740 22555171 22054464 21528448 21115119 20936112 20687503 20291246 19990444
$$ packed form
11961E1774139L51765J34425R6588K32911P5428R4372J40845R0744l6212j17613
11951E2837392l09228j10347l4049l12641l75576n19250l35763n15096m90354
11942D9835088k76936l55446n40932n74893n07331o40665m63953o08549p22366
11933D5144017o44518p22228p01266q23841m84515n88580o01063m63677p11250
11924C9403079p64072q27541p26461n75718m56990p37043o50509m78633p40680
11915C3445432n38638m97280o81547n99780m30057o52445o27716o48423o68203
11906B8101343n56510n99610n47446n10043m20531l60078m70024m89528l89393
11897B3758180n25440o77569n00707n26016m13329j79007k48609l96257l00802
$$ plain form
11888 19990444 19689398 19132493 18619717 18437106 18276603 18012685 17639849 17068784 16601843
11879 16601843 16320112 16058749 15866795 15626000 15354185 15065400 14841207 14645877 14326996
11870 14326996 14014585 13816102 13521734 13307628 12988223 12766310 12664419 12477765 12186317
11861 12186317 11786274 11659848 11600125 11381186 11238970 11314717 11073424 10879196 10572005 10399337
11851 10399337 10313409 10179783 10139395 10095125 9895070 9692324 9423825 9316867 9177019 9229607
11841 9229607 9076777 8893568 8914229 8737972 8536371 8295344 8168870 7967523 7604839 7622164
11831 7622164 7638359 7550360 7484664 7420246 7293258 7318118 7233889 7048717 6977988 7047917 7012911
11820 7012911 6868133 6846035 6806783 6750527 6584718 6457572 6281559 6158653 6047708 5883007
$$ packed form
11888A9990444l01046n56905n12776j82611j60503k63918l72836n71065m66941
11879A6601843k81731k61363j91954k40795k71815k88785k24193j95330l18881
11870A4326996l12411j98483k94368k14106l19405k21913j01891j86654k91448
11861A2186317m00043j26426n9723k18939j42216P5747k41293j94228l07191j72668
11851A0399337q5928j33626m0388m4270k00055k02746k68499j06958j39848N2588
11841I229607j52830j83209K0661j76257k01601k41027j26474k01347l62684J7325
11831G622164J6195q7999o5696o4418j26988K4860q4229j85172p0729O9929l5006
11820G012911j44778k2098l9252n6256j65809j27146j76013j22906j10945j64701
$$ plain form
11810 5883007 5750113 5785892 5662653 5443452 5356235 5237378 5344048 5468157 5581722 5628810
11800 5628810 5533672 5380270 5129833 4874143 4840181 4803152 4829187 4814683 4718922 4698600 4704449
11789 4704449 4611320 4675640 4674967 4600663 4486490 4356677 4395218 4321340 4228725 4227730 4187587 4095477
11777 4095477 3990176 3997740 4153037 4172139 4064900 3952280 3758031 3767453 3806611 3721448 3486263
11766 3486263 3540548 3728567 3734114 3792536 3711308 3606746 3430381 3361822 3396628 3326103 3251380
11755 3251380 3210108 3177689 3098953 2981615 2918880 2985049 3017205 2982657 2855353 2767444 2754283
11744 2754283 2828460 2836745 2694320 2758758 2846588 2868017 2850878 2783744 2734266 2810785 2804563
11733 2804563 2784214 2972520 2894539 2761311 2668096 2641698 2615979 2367503 2290424 2311466 2456326
$$ packed form
11810E883007j32894L5779j23239k19201q7217j18857J06670J24109J13565M7088
11800E628810r5138j53402k50437k55690l3962l7029K6035j4504r5761k0322N849
11789D704449r3129O4320o73p4304j14173j29813L8541p3878r2615r95m0143r2110
11777D095477j05301P564J55297J9102j07239j12620j94249R422L9158q5163k35185
11766C486263N4285J88019N547N8422q1228j04562j76365o8559L4806p0525p4723
11755C251380m1272l2419p8736j17338o2735O6169L2156l4548j27304q7909j3161
11744B754283P4177Q285j42425O4438Q7830K1429j7139o7134m9478P6519o222
11733B804563k0349J88306p7981j33228r3215k6398k5719k48476p7079K1042J44860
$$ plain form
11722 2456326 2541281 2484794 2640765 2586042 2446521 2491596 2493338 2287258 2232213 2255543 2285889
11711 2285889 2171643 2045463 2133041 2179483 2212875 2280504 2232954 2159171 2224301 2253743 2357440
11700 2357440 2431139 2324631 2276164 2103055 1993081 1898384 1960171 2018336 1895970 1766372
11690 1766372 1783461 1708007 1760927 1739862 1813628 2014631 2039296 1909679 1969842 1948236 1908929
11679 1908929 1943638 1821818 1881253 1741673 1751177 1740488 1743073 1714384 1582855 1550455 1684876
11668 1684876 1579679 1589466 1637379 1599415 1638180 1756194 1708457 1514168 1461137 1474542 1386935
11657 1386935 1495130 1474685 1570442 1572127 1564643 1627062 1781481 1651241 1673073 1682571 1666869
11646 1666869 1674419 1535119 1365773 1439344 1402843 1463410 1503747 1540115 1360537 1412849 1548073
$$ packed form
11722B456326Q4955n6487J55971n4723j39521M5075J742k06080n5045K3330L0346
11711B285889j14246j26180Q7578M6442L3392O7629m7550p3783O5130K9442J03697
11700B357440P3699j06508m8467j73109j09974r4697O1787N8165j22366j29598
11690A766372J7089p5454N2920k1065P3766K01003K4665j29617O0163k1606l9307
11679A908929L4709j21820N9435j39580R504j0689K585k8689j31529l2400J34421
11668A684876j05197R787M7913l7964L8765J18014m7737j94289n3031J3405q7607
11657A386935J08195k0445R5757J685p484O2419J54419j30240K1832R498j5702
11646A666869P550j39300j69346P3571l6501O0567M0337L6368j79578N2312J35224
$$ plain form
11635 1548073 1573312 1509777 1326384 1277094 1071830 925745 1056110 1129907 1223246 1269854
11625 1269854 1378905 1513550 1659266 1490802 1265125 1290557 1241332 1276553 1134026 1019126
11615 1019126 996563 900576 920316 944352 1008106 985951 1058536 1131992 1088019 1171183 1130866
11604 1130866 1112820 1223521 1104652 922607 898464 888571 852522 916712 1098092 984773
11594 984773 799683 803894 869519 809945 701468 858104 926570 993960 986459 979892 1045990
11583 1045990 1217131 1118169 1195426 1338396 1245380 1196391 993910 843047 747720 734231
11573 734231 936321 1083922 1052289 1042483 1045354 1014281 1008717 1034910 1071336 989848 784271
11562 784271 781365 842168 1048863 987648 933630 1007053 1003282 1095667 1241410 1162731 1099869
$$ packed form
11635A548073K5239o3535j83393m9290k05264j46085J30365P3797R3339M6608
11625A269854J09051J34645J45716j68464k25677K5432m9225L5221j42527j14900
11615A019126k2563r5987J9740K4036O3754k2155P2585P3456m3973Q3164m0317
11604A130866j8046J10701j18869j82045k4143r893l6049O4190J81380j13319
11594I84773j85090M211O5625n9574j08477J56636O8466O7390p501o567O6098
11583A045990J71141r8962P7257J42970r3016m8989k02481j50863r5327j3489
11573G34231K02090J47601l1633r806K871l1073n564K6193L6426q1488k05577
11562G84271k906O0803K06695o1215n4018P3423l771R2385J45743p8679o2862
$$ plain form
11551 1099869 941603 898855 927105 1099367 1120887 881622 815076 788033 715454 715963 735901
11540 735901 744231 919951 1031954 1024603 879831 741542 622029 604749 581419 497421 467057
11529 467057 525451 573032 625542 616585 747283 798142 844630 803809 644110 446206 600802
11518 600802 699704 624813 576264 552318 760503 814240 669728 448557 391557 285173 231460
11507 231460 453810 656142 582671 564520 625617 690818 553426 463688 443467 566785 701790
11496 701790 699850 774575 916960 776183 671038 628659 602818 625962 488684 296702 318430
11485 318430 544927 733816 475234 421353 309215 381790 491423 418440 420856 565174
11475 565174 553352 442448 352871 414493 437351 289437 218931 210904 213407 431722 464224
$$ packed form
11551A099869j58266m2748K8250J72262K1520k39265o6546k7043p2579N09J9938
11540G35901Q330J75720J12003p351j44772j38289j19513j7280k3330q3998l0364
11529D67057N8394M7581N2510q957J30698N0859M6488m0821j59699j97904J54596
11518F00802R8902p4891m8549k3946K08185N3737j44512k21171n7000j06384n3713
11507B31460K22350K02332p3471j8151O1097O5201j37392q9738k0221J23318J35005
11496G01790j940P4725J42385j40777j05145m2379k5841K3144j37278j91982K1728
11485C18430K26497J88889k58582n3881j12138P2575J09633p2983K416J44318
11475E65174j1822j10904q9577O1622K2858j47914p0506q027K503K18315L2502
$$ plain form
11464 464224 500796 526265 502467 408580 370350 391039 370384 252284 288289 320410 331699
11453 331699 389179 493689 583905 511905 402877 420327 530326 569206 482204 459491 288547
11442 288547 310847 565670 764789 649389 482294 281111 199722 272291 556520 585424
11432 585424 357917 290557 522334 594080 437530 353151 449908 544117 535878 511506 435527
11421 435527 497907 475573 413373 368115 437728 436757 386127 256426 295844 479515 442378
11410 442378 330924 330727 267975 372175 420484 418441 507790 468764 346090 470331 419382
11399 419382 176356 165645 277047 447214 532107 621069 566373 524546 568353 416939 317200
11388 317200 189934 44330 81066 142866 98538 116815 175584 208798 302477 296798 266507
$$ packed form
11464D64224L6572K5469k3798r3887l8230K0689k0655j18100L6005L2121J1289
11453C31699N7480J04510R0216p2000j09028J7450J09999L8880q7002k2713j70944
11442B88547K2300K54823J99119j15400j67095k01183q1389P2569K84229K8904
11432E85424k27507o7360K31777P1746j56550q4379R6757R4209q239k4372p5979
11421D35527O2380k2334o2200m5258O9613r71n0630j29701L9418J83671l7137
11410D42378j11454j97o2752J04200M8309k043Q9349l9026j22674J24241n0949
11399D19382k43026j0711J11402J70167Q4893Q8962n4696m1827M3807j51414r9739
11388C17200j27266j45604L6736O1800m4328J8277N8769L3214R3679n679l0291
$$ plain form
11377 266507 336960 276601 144912 199313 317789 163912 44794 111032 140177 264342
11367 264342 312256 247363 256416 269781 184878 311388 295388 304151 316085 432386 365690
11356 365690 159457 264257 310938 165798 213211 440481 516512 495421 419696 374041 347912
11345 347912 177087 170634 237360 277670 302455 311092 395133 411147 311156 339282 316132 367485
11333 367485 330142 278647 221416 287867 281847 371678 109298 131640 144581 47643 -56381
11322 -56381 15905 101863 293834 436847 436418 342023 203296 245743 322579 378242 305431
11311 305431 257465 251359 229185 285804 322923 273443 226216 225462 218689 180455 210247 401202
11299 401202 342920 109379 115233 256123 146538 221819 131357 -6443 106443 267326
$$ packed form
11377B66507P0453o0359j31689N4401J18476j53877j19118O6238K9145J24165
11367B64342M7914o4893R053J3365q4903J26510j6000Q763J1934J16301o6696
11356C65690k06233J04800M6681j45140M7413K27270P6031k1091p5725m5655k6129
11345C47912j70825o453O6726M0310K4785Q637Q4041J6014r9991K8126k3150N1353
11333C67485l7343n1495n7231O6451o020Q9831k62380K2342J2941r6938j04024
11322e6381P2286Q5958J91971J43013m29r4395j38727M2447P6836N5663p2811
11311C05431m7966o106k2174N6619L7119m9480m7227p54o773l8234K9792J90955
11299D01202n8282k33541N854J40890j09585P5281r0462j37800J12886J60883
$$ plain form
11289 267326 308235 150391 41412 63158 222514 290178 318019 315121 261713 264796 224379
11278 224379 28571 -22461 -43618 -66412 -57258 9898 -17095 125015 275666 387366 189291
11267 189291 -3136 4052 122414 354479 537252 574117 470654 352285 333252 368775
11257 368775 322036 218751 48726 147838 191965 145967 74101 193809 408383 444909 248854
11246 248854 264727 430627 438569 282210 238269 210631 125411 148774 367546 506078 491024
11235 491024 494499 374445 352281 484816 418346 409896 191838 41001 215406 193270 34238
11224 34238 -72114 9327 -143143 -86759 -153665 -327438 -366334 -171455 151543 173136 165740
11213 165740 144253 124203 43211 54752 23115 29549 38476 80445 5414 52854 11670 168989
$$ packed form
11289B67326M0909j57844j08979K1746J59356O7664K7841k898n3408L083m0417
11278B24379j95808n1032k1157k2794R154O7156k6993J42110J50651J11700j98075
11267A89291j92427P188J18362K32065J82773L6865j03463j18369j9033L5523
11257C68775m6739j03285j70025R9112M4127m5998p1866J19708K14574L6526j96055
11246B48854J5873J65900P942j56359m3941k7638q5220K3363K18772J38532j5054
11235D91024L475j20054k2164J32535o6470q450k18058j50837J74405k2136j59032
11224C4238j06352Q1441j52470N6384o6906j73773l8896J94879L22998K1593p396
11213A65740k1487k0050q0992J1541l1637O434Q927M1969p5031M7440m1184J57319
$$ plain form
11201 168989 200473 -35729 -82493 93786 99882 154996 372320 435744 472174 418515 510458
11190 510458 464103 286263 61816 18954 118714 104092 58964 1949 122092 172591 133069
11179 133069 142204 142022 76972 53065 97353 144794 221792 183109 94766 219696 181195 189444
11167 189444 242058 106846 -182 103785 124606 -29393 25119 317743 385221 278292
11157 278292 295002 100595 -122911 55508 64986 124403 278507 283045 164199 33487 95977
11146 95977 36147 31622 -19445 -89033 -144447 -133225 -14479 201447 336560 447595 442281
11135 442281 355967 286441 211544 245581 180967 124410 228282 167560 96988 -29584 -36356
11124 -36356 57710 283347 298663 234964 315633 216383 28788 -8426 75650 158034 262628
$$ packed form
11201A68989L1484k36202m6764J76279O096N5114K17324O3424L6430n3659R1943
11190E10458m6355j77840k24447m2862R9760j4622m5128n7015J20143N0499l9522
11179A33069R135j82o5050k3907M4288M7441P6998l8683q8343J24930l8501Q249
11167A89444N2614j35212j07028J03967K0821j53999N4512K92624O7478j06929
11157B78292J6710j94407k23506J78419R478N9417J54104M538j18846j30712O2490
11146I5977n9830m525n1067o9588n5414J1222J18746K15926J35113J11035n314
11135D42281q6314o9526p4897L4037o4614n6557J03872o0722p0572j26572o772
11124c6356R4066K25637J5316o3699Q0669r9250j87595l7214Q4076Q2384J04594
$$ plain form
11113 262628 242231 215796 321131 512287 704333 525257 208149 199359 204615 19173 33994
11102 33994 -6102 72265 222927 311055 281071 133205 295212 364593 123698 -9723 53851
11091 53851 102625 -18793 -155539 44021 173672 242086 301467 445143 220756 83352
11081 83352 -31357 -212770 -115465 -15482 -139677 -207516 -246038 -124150 75734 132942 49023
11070 49023 64012 306375 362819 337877 214361 102252 203138 354143 147780 -103762
11060 -103762 -177530 86567 290386 359216 352631 325197 345257 302649 352073 495767 528803
11049 528803 442843 356801 424065 621943 729896 814558 702390 709603 709696 657381 639919 658083
11037 658083 498580 525850 774209 1254139 1448346 1396994 1340091 1211093 1059845 946716
$$ packed form
11113B62628k0397k6435J05335J91156J92046j79076l17108q790N256j85442J4821
11102C3994m0096P8367J50662Q8128k9984j47866J62007O9381k40895j33421O3574
11091E3851M8774j21418j36746J99560J29651O8414N9381J43676k24387j37404
11081H3352j14709j81413R7305R9983j24195o7839l8522J21888J99884N7208q3919
11070D9023J4989K42363N6444k4942j23516j12109J00886J51005k06363k51542
11060a03762p3768K64097K03819O8830o585k7434K0060m2608M9424J43694L3036
11049E28803q5960q6042O7264J97878J07953Q4662j12168P213R3n2315j7462J8164
11037F58083j59503K7270K48359M79930J94207n1352n6903j28998j51248j13129
$$ plain form
11027 946716 1096242 1179405 1016432 1114072 1316443 1506935 1503445 1524223 1388971 1108166
11017 1108166 1084422 1063849 890403 802168 939670 1164193 1335836 1590578 1489152 1253436
11007 1253436 1095564 889938 727108 679572 561259 519041 592546 568057 625968 644622
10997 644622 674036 655232 591434 379019 385815 408049 300749 271271 297275 93531 -87122
10986 -87122 -83032 29645 32508 -58998 -216612 -135836 6508 86603 110327 138571 65666
10975 65666 116117 146678 20180 -70464 -132517 -17498 228063 172112 122690 222814 116426
10964 116426 102871 174101 60503 -50439 -115340 -50736 28202 39792 31823 -1458 -9954
10953 -9954 8991 -24287 -123235 -39535 83078 -28869 -35715 -119310 -121665 34562 98453 49632
$$ packed form
11027I46716J49526Q3163j62973R7640K02371J90492l490K0778j35252k80805
11017A108166k3744k0573j73446q8235J37502K24523J71643K54742j01426k35716
11007A253436j57872k05626j62830m7536j18313m2218P3505k4489N7911J8654
10997F44622K9414j8804o3798k12415O796K2234j07300k9478K6004k03744j80653
10986h7122M090J12677K863r1506j57614Q0776J42344Q0095K3724K8244p2905
10975F5666N0451L0561j26498r0644o2053J15019K45561n5951m9422J00124j06388
10964A16426j3555P1230j13598j10942o4901O4604P8938J1590p969l3281q496
10953i954J8945l3278r8948Q3700J22613j11947o846q3595k355J56227O3891m8821
$$ plain form
10941 49632 55733 142687 112995 81271 -14156 -37858 -135222 3359 117244 -42198 -288313
10930 -288313 -255029 -114679 -39703 -138995 -159883 -191309 -153074 -100503 -71017 -18571 -113851
10919 -113851 5784 -54202 -134440 -67356 64444 144483 183363 21480 -91070 -142657 50661
10908 50661 129611 -57132 -162290 56825 92742 32564 41479 -150470 -133013 -24791 -28339
10897 -28339 -47250 -42423 -238628 -296167 -319332 -414178 -442071 -466143 -353373 -93144 -4948
10886 -4948 47243 -55439 142439 211101 42778 -148220 -109167 -296234 -408867 -308350
10876 -308350 -303378 -293801 -240642 -187142 -178157 -129755 -240392 -345194 -367984 -284935 -212983 -213119
10864 -213119 -145328 -255746 -361687 -264978 -214569 -63718 -102171 -84900 97863 38091 -82761
$$ packed form
10941D9632O101Q6954k9692l1724r5427k3702r7364J38581J13885j59442k46115
10930b88313L3284J40350P4976r9292k0888l1426L8235N2571K9486N2446r5280
10919a13851J19635n9986q0238O7084J31800Q0039L8880j61883j12550n1587J93318
10908E0661P8950j86743j05158K19115L5917o0178Q915j91949J7457J08222l548
10897b8339j8911M827j96205n7539k3165r4846k7893k4072J12770K60229Q8196
10886d948N2191j02682J97878O8662j68323j90998L9053j87067j12633J00517
10876c08350M972R577N3159N3500Q985M8402j10637j04802k2790Q3049P1952j36
10864b13119O7791j10418j05941R6709N0409J50851l8453J7271J82763n9772j20852
$$ plain form
10853 -82761 61185 284958 315505 160261 193253 97626 20973 5163 -101833 -12163 129382
10842 129382 33312 41216 47481 96084 -14639 -52711 61833 99856 -100359 -170337 -119896
10831 -119896 -21587 25829 65534 165373 73192 -39487 135059 149400 13929 -39319 -79811
10820 -79811 -80119 19993 19945 -102220 -228929 -194620 -17538 32603 82462 166828 69371 -152785
10808 -152785 -133882 -182538 -166315 -14930 51049 73341 19107 -147852 -207277 -68865 -105850
10797 -105850 -200700 -281069 -285333 6255 10205 -66306 -148013 -211890 -134768 -147412 -213560 -354182
10785 -354182 -405152 -249440 -137884 -102128 -197140 -360879 -259286 -172761 -65078 -9912
10775 -9912 164659 177190 212562 75436 -104830 -331366 -295569 -308767 -234801 -198927 -329
$$ packed form
10853h2761J43946K23773L0547j55244L2992r5627p6653j5810j06996Q9670J41545
10842A29382r6070P904O265M8603j10723l8072J14544L8023k00215o9978N0441
10831a19896R8309M7416L9705R9839r2181j12679J74546J4341j35471n3248m0492
10820g9811l08J00112m8j22165j26709L4309J77082N0141M9859Q4366r7457k22156
10808a52785J8903m8656J6223J51385O5979K2292n4234j66959n9425J38412l6985
10797a05850r4850q0369m264K91588L950p6511q1707o3877P7122j2644o6148j40622
10785c54182n0970J55712J11556L5756r5012j63739J01593Q6525J07683N5166
10775i912J74571J2531L5372j37126j80266k26536L5797j3198P3966L5874J98598
$$ plain form
10764 -329 135751 73672 68766 -178716 -228030 -269222 -382183 -206106 -31917 -139353 -104609
10753 -104609 -92629 -75118 18203 23570 87738 -53402 -67660 33786 -104019 -115218 -56181
10742 -56181 -68585 162990 176602 115261 -97677 -68219 13164 -107133 -168458 -306352 -271069
10731 -271069 -82520 31912 -99393 -182345 -190225 -57891 187227 44114 -130433 -98805
10721 -98805 -39317 38555 171415 249350 342655 356079 345877 243827 53057 -26563 20657
10710 20657 16721 -40425 -24795 53262 40852 -57477 -7616 -20446 1527 20977 -3731 -19314
10698 -19314 82971 41388 -52835 -200899 -287206 -340371 -335002 -235267 -90610 -209939 -119285
10687 -119285 -24872 59791 32315 -113454 -268104 -279141 -229757 -19111 -118853 -408943 -346833
$$ packed form
10764c29J36080o2079m906k47482m9314m1192j12961J76077J74189j07436L4744
10753a04609J1980J7511R3321N367O4168j41140j4258J01446j37805j1199N9037
10742e6181j2404K31575J3612o1341k12938K9458Q1383j20297o1325j37894L5283
10731b71069J88549J14432j31305q2952p880J32334K45118j43113j74547L1628
10721i8805N9488P7872J32860P7935R3305J3424j0202j02050j90770p9620M7220
10710B0657l936n7146J5630P8057j2410r8329M9861j2830K1973J9450k4708j5583
10698a9314J02285m1583r4223j48064q6307n3165N369R9735J44657j19329R0654
10687a19285R4413Q4663k7476j45769j54650j1037M9384K10646r9742k90090O2110
$$ plain form
10676 -346833 -279989 -122832 -395 179685 231882 124457 -31543 -88231 -244835 -399899
10666 -399899 -272788 -7551 121881 171099 214237 260493 258512 133713 -89701 -146061 -4972
10655 -4972 -6587 185958 310487 489579 437492 375151 410913 483599 407702 450732 615601
10644 615601 738192 883528 1035461 1217952 1359750 1557018 1921315 2159858 2484927 3242175
10634 3242175 4138644 5115734 6344606 7271216 7644787 7641261 7894129 8339511 8939230 10049994
10624 10049994 11913822 14570417 18278970 23842562 31401638 40867733 52650304 67424800
10616 67424800 84033656 98627107 106047066 105059181 99108350 92900950 89842022 91671415
10608 91671415 99398614 114329596 137310936 168333274 203267259 231153194 239129094
$$ packed form
10676c46833O6844J57157J22437J80080N2197j07425j56000n6688j56604j55064
10666c99899J27111K65237J29432M9218M3138M6256j981j24799k23414n6360J41089
10655d972j615J92545J24529J79092n2087o2341L5762P2686p5897M3030J64869
10644F15601J22591J45336J51933J82491J41798J97268L64297K38543L25069P57248
10634C242175Q96469R77090J228872R26610L73571l526K52868M45382N99719J110764
10624A0049994J863828K656595L708553N563592P559076R466095J1782571J4774496
10616F7424800J6608856J4593451P419959r87885n950831o207400l058928J829393
10608I1671415P727199J4930982K2981340L1022338L4933985K7885935P975900
$$ plain form
10601 239129094 225450785 201383584 179173618 164994073 160999857 168075448 186612701
10594 186612701 217649498 259526218 303937828 334176325 332694978 300490279 256132785
10587 256132785 216358150 187989971 171903354 167272954 172919809 188447218 211304975
10580 211304975 234496753 246001124 235698336 206297434 170767746 140289878 118649509
10573 118649509 105532832 99376113 98667142 102270328 108484716 113782786 113610300 104885872
10565 104885872 89492654 72255518 56946072 45087116 36292648 29749648 24997773
10558 24997773 21453994 18561213 16391551 14653943 13133705 12001519 10941749 9889538
10550 9889538 8871230 8093131 7537850 7051843 6561875 5998166 5810704 5417322 4952252
$$ packed form
10601B39129094j3678309k4067201k2209966j4179545l994216P075591J8537253
10594A86612701L1036797M1876720M4411610L0238497j481347l2204699m4357494
10587B56132785l9774635k8368179j6086617m630400N646855J5527409K2857757
10580B11304975K3191778J1504371j0302788k9400902l5529688l0477868k1640369
10573A18649509j3116677o156719p08971L603186O214388N298070j72486q724428
10565A04885872j5393218j7237136j5309446j1858956q794468o543000m751875
10558B4997773l543779k892781k169662j737608j520238j132186j059770j052211
10550I889538j018308p78099n55281m86007m89968n63709j87462l93382m65070
$$ plain form
10541 4952252 4726026 4538610 4156252 3849086 3645452 3392105 3325364 3215620 3221635 3226912
10531 3226912 3175675 2985744 3012302 2992099 2760151 2447773 2282796 2259305 2277769 2196007
10521 2196007 2090584 2123371 2136280 2097537 2039960 2056027 2002727 2083794 2078700 1908786 1627695
10510 1627695 1780760 2038510 1972821 1759689 1622742 1626984 1723597 1584733 1491798 1534266
10500 1534266 1495614 1451259 1348331 1449233 1335485 1182522 1152008 1239056 1193558 1082748
10490 1082748 1038228 1144192 1230779 1228755 1234158 1258099 1371388 1333510 1342610 1428760 1451144
10479 1451144 1137662 1098675 1105797 1236412 1190209 1079200 905060 879378 867723 713152
10469 713152 734191 763126 796525 972440 1138778 1193065 1174432 1146702 1169939 1092236 951942
$$ packed form
10541D952252k26226j87416l82358l07166k03634k53347o6741j09744O015N277
10531C226912n1237j89931K6558k0203k31948l12378j64977k3491J8464q1762
10521B196007j05423L2787J2909l8743n7577J6067n3300Q1067n094j69914k81091
10510A627695J53065K57750o5689k13132j36947M242R6613j38864r2935M2468
10500A534266l8652m4355j02928J00902j13748j52963l0514Q7048m5498j10810
10490A082748m4520J05964Q6587k024N403K3941J13289l7878R100Q6150K2384
10479A451144l13482l8987P122J30615m6203j11009j74140k5682j1655j54571
10469G13152K1039K8935L3399J75915J66338N4287j8633k7730K3237p7703j40294
$$ plain form
10458 951942 983416 947621 838828 957209 862414 815517 781725 765116 781858 844758 974570
10447 974570 1045772 924512 903838 1054769 1005845 818861 810445 859604 814491 837759 980131
10436 980131 874312 714477 764133 683974 601772 533099 560859 493850 497215 640499 775125
10425 775125 750866 683061 520413 505329 544559 687538 806710 954822 953495 750715 627316
10414 627316 595818 695425 738277 588818 386632 337089 420992 388592 530482 617650 558735
10403 558735 667583 585818 450240 492996 609750 787748 795060 767208 688187 636864 507090
10392 507090 467147 403830 542490 566503 496140 627731 720591 665757 527446 408981 419090
10381 419090 516362 530587 604009 656329 692336 817289 844784 763052 799972 682204 511914
$$ packed form
10458I51942L1474l5795j08793J18381r4795m6897l3792j6609J6742O2900J29812
10447I74570P1202j21260k0674J50931m8924j86984q416M9159m5113K3268J42372
10436I80131j05819j59835M9656q0159q2202o8673K7760o7009L365J43284J34626
10425G75125k4259o7805j62648j5084L9230J42979J19172J48112j327k02780j23399
10414F27316l1498R9607M2852j49459k02186m9543Q3903l2400J41890Q7168n8915
10403E58735J08848q1765j35578M2756J16754J77998P312k7852p9021n1323j29774
10392E07090l9943o3317J38660K4013p0363J31591R2860n4834j38311j18465J0109
10381D19090R7272J4225P3422N2320L6007J24953K7495q1732L6920j17768j70290
$$ plain form
10370 511914 235635 180862 291101 381555 446337 484393 577334 609143 618206 537398 314156
10359 314156 351083 489709 536717 568663 541967 475227 625515 618431 434856 430531 420038
10348 420038 177200 191654 270794 224732 300065 370409 273966 314410 400440 459225 516572
10337 516572 567767 471123 276334 346075 328031 185871 253583 315591 430298 545946 451866
10326 451866 397942 340283 277958 209198 219339 358205 361368 232171 332643 523814 463152
10315 463152 402501 436817 297710 279906 411270 365340 369055 207859 198022 103543 125107
10304 125107 96713 189386 443457 454342 221014 229635 373288 487810 440280 294422 346560
10293 346560 502457 665287 727902 754007 575109 485939 191230 41948 64449 88375
$$ packed form
10370E11914k76279n4773J10239R0454O4782L8056R2941L1809R063q0808k23242
10359C14156L6927J38626M7008L1946k6696o6740J50288p084j83575m325j0493
10348D20038k42838J4454P9140m6062P5333P0344r6443M0444Q6030N8785N7347
10337E16572N1195r6644j94789O9741j8044j42160O7712O2008J14707J15648r4080
10326D51866n3924n7659o2325o8760J0141J38866L163j29197J00472J91171o0662
10315D63152o0651L4316j39107j7804J31364m5930L715j61196r837r4479K1564
10304A25107k8394R2673K54071J0885k33328Q621J43653J14522m7530j45858N2138
10293C46560J55897J62830O2615K6105j78898q9170k94709j49282K2501K3926
$$ plain form
10283 88375 197654 319240 253853 352373 339508 265491 419826 632091 594943 472122 479327
10272 479327 524006 562834 364166 291703 191141 286746 423164 400415 395415 338655 222821
10261 222821 156615 -54700 -20879 -108155 -30617 235369 445386 446281 191267 -2354 -93237
10250 -93237 151464 316245 292341 143977 -7659 -68394 -1383 237643 287789 105134
10240 105134 73916 123108 168284 199772 287515 323400 448868 412961 377086 333249 182749
10229 182749 46437 -37211 66830 300833 326843 154216 87490 317710 363966 268728
10219 268728 305833 237308 86633 -26784 54138 39885 -47835 98813 311251 347899 303798
10208 303798 317461 283482 301928 361525 315388 381793 390462 208129 143459 213003 184259
$$ packed form
10283H8375J09279J21586o5387R8520j2865p4017J54335K12265l7148j22821P205
10272D79327M4679L8828j98668p2463j00562R5605J36418k2749n000n6760j15834
10261B22821o6206k11315L3821q7276P7538K65986K10017Q95k55014j93621r0883
10250i3237K44701J64781k3904j48364j51636o0735O7011K39026N0146j82655
10240A05134l1218M9192M5176L1488Q7743L5885J25468l5907l5875m3837j50500
10229A82749j36312q3648J04041K34003K6010j72627o6726K30220M6256r5238
10219B68728L7105o8525j50675j13417Q0922j4253q7720J46648K12438L6648m4101
10208C03798J3663l3979J8446N9597m6137O6405Q669j82333o4670O9544k8744
$$ plain form
10197 184259 340062 422383 255330 218836 319139 345631 258604 172653 159956 239608 297750
10186 297750 381932 498472 611381 725786 720100 573792 544049 615111 769195 744647 646733
10175 646733 628177 552460 584208 628687 647363 838675 1062756 1325021 1380666 1397983 1433493
10164 1433493 1413250 1185237 1066662 1084696 1127654 1113092 1264644 1496923 1822210 1986736
10154 1986736 1836224 1713472 1550461 1303533 1251941 1217023 1293324 1253435 1377436 1504475
10144 1504475 1423537 1541842 1535903 1353382 1191463 924314 659393 544186 617459 785492
10134 785492 912816 1061127 1072726 910307 839752 836657 805938 739236 790298 753838 446540
10123 446540 193381 -32668 5693 249804 469405 384155 297222 109507 -56752 -266656
$$ packed form
10197A84259J55803Q2321j67053l6494J00303K6492q7027q5951j2697P9652N8142
10186B97750Q4182J16540J12909J14405n686j46308k9743P1062J54084k4548r7914
10175F46733j8556p5717L1748M4479J8676J91312K24081K62265N5645J7317L5510
10164A433493k0243k28013j18575J8034M2958j4562J51552K32279L25287J64526
10154A986736j50512j22752j63011k46928n1592l4918P6301l9889J24001J27039
10144A504475q0938J18305n939j82521j61919k67149k64921j15207P3273J68033
10134G85492J27324J48311J1599j62419p0555l095l0719o6702N1062l6460l07298
10123D46540k53159k26049L8361K44111K19601q5250q6933j87715j66259k09904
$$ plain form
10113 -266656 -272748 -90719 -30281 97877 233691 366568 437925 425456 408122 312672 301573
10102 301573 176979 205724 322751 568742 419780 122129 31465 -128518 -93335 44430
10092 44430 165172 185448 178819 145841 69397 -5673 -7644 12311 70684 163516 112822 118358
10080 118358 159327 98820 -92735 -4037 98249 265226 369933 129839 85604 75862 206835
10069 206835 225767 170476 105808 70306 -11179 -33955 67732 300988 379737 268387 308408
10058 308408 335824 343605 429085 401038 368664 385518 275040 208500 352959 370424 287769
10047 287769 175758 42676 118932 122728 205402 268678 313061 233701 180909 87882 135882
10036 135882 76294 123531 191286 252882 236840 74955 78102 147924 -3235 -88305 -17353
$$ packed form
10113b66656o092J82029O0438J28158J35814J32877P1357j2469j7334r5450j1099
10102C01573j24594K8745J17027K45991j48962k97651r0664j59983L5183J37765
10092D4430J20742K0276o629l2978p6444p5070j971J9955N8373R2832n0694N536
10080A18358M0969o0507j91555Q8698J02286J66977J04707k40094m4235r742J30973
10069B06835J8932n5291o4668l5502q1485k2776J01687K33256P8749j11350M0021
10058C08408K7416P781Q5480k8047l2374J6854j10478o6540J44459J7465q2655
10047B87769j12011j33082P6256L796Q2674O3276M4383p9360n2792r3027M8000
10036A35882n9588M7237O7755O1596j6042j61885L147O9822j51159q5070P0952
$$ plain form
10025 -17353 86399 208732 256685 382681 478746 383990 269179 55943 -239714 -336469
10015 -336469 -145762 -1084 -49774 63809 151168 178341 168074 126601 135720 67549 -27218
10004 -27218 -58029 -38291 8636 44401 153510 303989 434636 373906 300761 295452 225799
9993 225799 167539 201193 222380 154987 92779 37706 -44025 -26691 -18079 163667 269649
9982 269649 310973 40256 -111731 -93595 130936 259481 232744 150216 72586 4079 -183952
9971 -183952 -214855 -222217 -264231 -189564 -100548 -144014 -88798 63373 58386 -109349 -14095 83152
9959 83152 254190 136040 10049 70271 343921 447040 443862 306170 402878 538371 544952
9948 544952 380928 255821 345285 458535 306674 179752 197414 338676 299225 388797
$$ packed form
10025a7353J03752J22333M7953J25996R6065r4756j14811k13236k95657r6755
10015c36469J90707J44678m8690J13583Q7359K7173j0267m1473R119o8171r4767
10004b7218l0811J9738M6927L5765J09109J50479J30647o0730p3145n309o9653
9993B25799n8260L3654K1187o7393o2208n5073q1731J7334Q612J81746J05982
9982B69649M1324k70717j51987J8136K24531J28545k6737q2528p7630o8507j88031
9971a83952l0903p362m2014P4667Q9016m3466N5216J52171m987j67735R5254R7247
9959H3152J71038j18150j25991O0222K73650J03119l178j37692R6708J35493O581
9948E44952j64024j25107Q9464J13250j51861j26922J7662J41262l9451Q9572
$$ plain form
9938 388797 408889 153467 28312 -1780 -85302 22506 65903 71826 92297 95250 207045
9927 207045 284088 287490 250491 72280 32210 26411 30848 -48683 -151449 -150145 -76197 -24980
9915 -24980 754 40658 57642 71385 72292 230818 414768 530569 403934 462936 572015
9904 572015 382136 333190 372679 249559 51648 49409 144342 175754 52722 97794 126690
9893 126690 106777 135360 209144 92399 55558 46190 119000 74598 249341 235562 63907
9882 63907 -161677 -89180 -128243 -101892 46339 53566 92465 100090 89028 8611 -9682 -132035
9870 -132035 -28661 150535 193636 147581 30646 -33095 -5546 -17891 -74002 -54745 -176928
9859 -176928 -295048 -471848 -370128 -28345 104318 -1025 -165055 -158575 -17572 -5463
$$ packed form
9938C88797K0092k55422j25155l0092q3522J07808M3397N923K0471K953J11795
9927B07045P7043L402l6999j78211m0070n799M437p9531j02766J304P3948N1217
9915b4980K5734L9904J6984J3743R07J58526J83950J15801j26635N9002J09079
9904E72015j89879m8946L9489j23120j97911k239R4933L1412j23032M5072K8896
9893A26690j9913K8583P3784j16745l6841r368P2810m4402J74743j3779j71655
9882F3907k25584P2497l9063K6351J48231P227L8899P625j1062q0417j8293j22353
9870a32035J03374J79196M3101m6055j16935o3741K7549j2345n6111J9257j22183
9859a76928j18120j76800J01720L41783J32663j05343j64030O480J41003J2109
$$ plain form
9849 -5463 63125 66856 190424 270180 194269 95516 103941 32445 144065 224340 204337 174976
9837 174976 -69423 -64215 7869 47154 -94713 -307471 -298893 -203535 -229034 -220406 -107827
9826 -107827 10288 126269 127076 -189544 -159259 -51610 -13819 -25458 -99663 -55368 -41373
9815 -41373 121535 78965 80973 134043 -4614 3689 -11717 -82941 -8979 130515 139791 56045
9803 56045 63690 222260 221283 115742 147715 46316 4083 5375 92484 53846 -48011 -41432
9791 -41432 -78109 -96856 -62574 -218632 -171993 -61360 -59901 -263742 -247776 -160834 -196808
9780 -196808 -223546 -131177 1324 -22488 21223 8693 121924 120728 41569 36557 58297 143315
9768 143315 55224 116039 89107 -22338 -65821 -68622 95431 197422 -24039 -92664 38344
$$ packed form
9849e463O8588L731J23568P9756p5911r8753Q425p1496J11620Q0275k0003k9361
9837A74976k44399N208P2084L9285j41867k12758Q578R5358k5499Q628J12579
9826a07827J18115J15981Q07l16620L0285J07649L7791j1639p4205M4295J3995
9815d1373J62908m2570K008N3070j38657Q303j5406p1224P3962J39494R276q3746
9803E6045P645J58570r77j05541L1973j01399m2233J292Q7109l8638j01857O579
9791d1432l6677j8747L4282j56058M6639J10633J459k03841J5966Q6942l5974
9780a96808k6738R2369J32501k3812M3711j2530J13231j196p9159n012K1740Q5018
9768A43315q8091O0815k6932j11445m3483k801J64053J01991k21461o8625J31008
$$ plain form
9757 38344 40574 -73353 -108154 -61916 60648 -18566 33384 127702 147040 105362 160117 36652
9745 36652 -112938 -104464 -29594 129287 300659 105430 -211341 -249668 -240166 -109678 -67142
9734 -67142 -193636 -218875 -160217 -47367 -27304 126970 172633 68429 156427 165014 56141
9723 56141 14779 58123 14692 86664 -21414 -31401 85100 49068 69477 -42579 -2297
9712 -2297 116929 136674 109667 729 -61613 33993 48947 -96430 -58982 75115 197719
9701 197719 121847 145756 122891 130910 122317 183102 178401 14740 -207491 -237875 -251430 -234106
9689 -234106 -175226 -125693 -68429 1493 -102682 -181651 -181066 -25824 51197 83564 4314 54790
9677 54790 124129 104933 3232 -34871 -61566 5545 102855 203341 221551 49690 56497
$$ packed form
9757C8344K230j13927l4801M6238J22564p9214N1950R4318J9338m1678N4755j23465
9745C6652j49590Q474P4870J58881J71372j95229l16771l8327R502J30488M2536
9734f7142j26494k5239N8658J12850K0063J54274M5663j04204Q7998Q587j08873
9723E6141m1362M3344m3431P1972j08078r987J16501l6032K0409j12056M0282
9712b297J19226J9745k7007j08938o2342R5606J4954j45377L7448J34097J22604
9701A97719p5872K3909k2865Q019q593O0785m701j63661k22231l0384j3555J7324
9689b34106N8880M9533N7264O9922j04175p8969N85J55242P7021L2367p9250N0476
9677E4790O9339j9196j01701l8103k6695O7111R7310J00486J8210j71861O807
$$ plain form
9666 56497 141884 285545 256158 261499 377322 410641 557552 665013 814124 1190435 1984665
9655 1984665 3211566 5132262 6975608 6656812 4767796 2986876 1898639 962791 563624
9646 563624 543598 581003 445989 268766 347291 335464 217703 175761 176388 159286 97527
9635 97527 63864 136391 244370 186735 164798 38422 -139140 -142557 94028 101803 108601 92589
9623 92589 45029 84334 203018 189704 96185 -45292 -5065 82369 138919 77182 -146354
9612 -146354 -124214 -15968 94025 -138004 -325115 -167890 -128480 140498 342757 299661
9602 299661 288940 187204 231882 258595 255156 238092 254377 276604 304946 301168 86909 91698
9590 91698 274026 366476 159899 130457 108830 15720 -14760 -42230 -172775 -111411 -5892
$$ packed form
9666E6497Q5387J43661k9387N341J15823L3319J46911J07461J49111L76311P94230
9655A984665J226901J920696J843346l18796j889016j780920j088237r35848l99167
9646E63624k0026L7405j35014j77223P8525j1827j17761m1942O27j7102o1759
9635I7527l3663P2527J07979n7635k1937j26376j77562l417K36585P775O798j6012
9623I2589m7560L9305J18684j3314r3519j41477M0227Q7434N6550o1737k23536
9612a46354K2140J08246J09993k32029j87111J57225L9410K68978K02259m3096
9602B99661j0721j01736M4678K6713l439j7064J6285K2227K8342l778k14259M789
9590I1698J82328R2450k06577k9442k1627r3110l0480k7470j30545O1364J05519
$$ plain form
9579 -5892 -51565 -66856 -88542 -176340 -176751 -290589 -164820 -118241 -162104 -99934 -49276 -44830
9567 -44830 -91445 -139719 -131935 -268914 -263822 -212893 -65004 119656 135176 234745 311640 281113
9555 281113 46254 41588 155615 104201 41502 123953 219787 53443 -70814 -35182 -49770
9544 -49770 -3062 -30294 -57235 -172662 -170369 -34853 -145821 -1970 46768 42641 89722
9533 89722 113738 206008 163368 24209 30271 113360 100750 -85518 -164368 -331477 -344731
9522 -344731 -377892 -295146 -142094 -84112 2454 77313 79463 -139685 -376710 -353947 -279956
9511 -279956 -193417 40755 236645 236490 206407 333207 184543 174662 146919 28239 -218619
9500 -218619 -268707 -79978 137877 103820 105989 207448 178688 301189 293266 220103 171384
$$ packed form
9579e892m5673j5291k1686q7798m11j13838J25769M6579m3863O2170N0658M446
9567d4830m6615m8274P784j36979N092N0929J47889J84660J5520R9569P6895l0527
9555B81113k34859m666J14027n1414o2699Q2451R5834j66344j24257L5632j4588
9544d9770M6708k7232k6941j15427K293J35516j10968J43851M8738m127M7081
9533H9722K4016R2270m2640j39159O062Q3089j2610j86268p8850j67109j3254
9522c44731l3161Q2746J53052N7982Q6566P4859K150k19148k37025K2763P3991
9511b79956Q6539K34172J95890j55l0083J26800j48664r881k7743j18680k46858
9500b18619n0088J88729K17855l4057K169J01459k8760J22501p923p3163m8719
$$ plain form
9489 171384 292026 226860 32343 -74597 -15937 -75606 -132464 -76363 -171585 -156541 -73465
9478 -73465 -66251 147112 157163 211297 213860 138081 235865 326147 21801 -160354 -15291
9467 -15291 4319 -113821 -127626 -869 129287 122593 152169 119852 61533 145251 176958
9456 176958 141426 167002 171164 48330 68619 148226 37334 -75186 -134004 -174582 -82950
9445 -82950 -88731 -11450 7229 -49987 -42639 -86541 -94495 -108105 -81529 -29498 135033 87663
9433 87663 65246 -42713 -138722 40728 67176 112873 185217 214965 165149 107104 20246
9422 20246 61617 180632 -4957 -39397 71100 130657 187962 158820 117820 226411 194611
9411 194611 18551 -44752 -142838 -20878 44630 -19872 -119095 -147281 50204 145870 80314
$$ packed form
9489A71384J20642o5166j94517j06940N8660n9669n6858N6101r5222J5044Q3076
9478g3465P214K13363J0051N4134K563p5779R7784R0282l04346j82155J45063
9467a5291J9610j18140j3805J26757J30156o694K9576l2317n8319Q3718L1707
9456A76958l5532K5576M162j22834K0289P9607j10892j12520n8818m0578R1632
9445h2950n781P7281J8679n7216P348m3902p954j3610K6576N2031J64531m7370
9433H7663k2417j07959r6009J79450K6448M5697P2344K9748m9816n8045q6858
9422B0246M1371J19015j85589l4440J10497N9557N7305k9142m1000J08591l1800
9411A94611j76060o3303r8086J21960O5508o4502r9223k8186J97485R5666o5556
$$ plain form
9400 80314 19588 -11509 70301 138 -156460 -171210 -76437 164824 302507 281446 304340
9389 304340 167909 111792 1817 -138547 -184245 23793 81249 65176 40574 56817 -10203
9378 -10203 70928 857 -43150 113676 280527 214057 179184 86390 11170 -153158 -345612
9367 -345612 -308189 -103523 9724 2467 111986 19400 63610 133733 146569 102084 23739
9356 23739 133606 113032 -3759 -53866 62366 103319 196095 197889 184121 82705 62315
9345 62315 43739 -7542 14122 158408 118088 110112 14792 -70628 42913 48210 70861 -55116
9333 -55116 -200935 -225423 -146659 -185151 -87393 4830 137850 175084 254303 289085 181074
9322 181074 -21899 79311 56726 13375 9984 -55149 -4720 113422 45660 -67264 -124860
$$ packed form
9400H0314o0726l1097Q1810p0163j56598j4750R4773K41261J37683k1061K2894
9389C04340j36431n6117j09975j40364m5698K08038N7456j6073k4602J6243o7020
9378a0203Q1131p0071m4007J56826J66851o6470l4873r2794p5220j64328j92454
9367c45612L7423K04666J13247p257J09519r2586M4210P0123J2836m4485p8345
9356B3739J09867k0574j16791n0107J16232M0953R2776J794j3768j01416k0390
9345F2315j8576n1281K1664J44286m0320p976r5320q5420J13541N297K2651j25977
9333e5116j45819k4488P8764l8492R7758R2223J33020L7234P9219L4782j08011
9322A81074k02973J01210k2585m3351l391o5133N0429J18142o7762j12924n7596
$$ plain form
9311 -124860 -40467 8257 57209 56763 -53696 129215 100552 52488 1906 -1239 -62626 -196880
9299 -196880 -208980 -43954 64078 123808 149708 116593 81204 56963 -169701 -192325 -161155
9288 -161155 -200785 -166802 6221 104632 121624 87954 -54170 -223511 -274202 -427636 -393986
9277 -393986 -266028 -247571 -184643 -32649 66475 74647 114115 -109114 -77762 3827 7765
9266 7765 46198 39962 19672 -83010 43308 248379 148215 -75571 -116002 57828 138560
9255 138560 131985 -62085 -197120 -175878 -24702 80907 -98267 -47622 -24393 47409 -99104
9244 -99104 -47667 -110401 -130469 -21586 -25137 -55107 -44109 51347 36576 -58244 43692 152596
9232 152596 207444 302964 259512 213732 72576 -14435 -177191 -218530 -276737 -140930 161048
$$ packed form
9311a24860Q4393M8724M8952m46j10459J82911k8663m8064n0582l145o1387j34254
9299a96880j2100J65026J08032N9730K5900l3115l5389k4241k26664k2624L1170
9288a61155l9630L3983J73023R8411J6992l3670j42124j69341n0691j53434L3650
9277c93986J27958J8457O2928J51994R9124Q172L9468k23229L1352Q1589L938
9266G765L8433o236k0290j02682J26318K05071j00164k23786m0431J73830Q0732
9255A38560o575j94070j35035K1242J51176J05609j79174N0645K3229P1802j46513
9244i9104N1437o2734k0068J08883l551k9970J0998R5456j4771r4820J01936J08904
9232A52596N4848R5520m3452m5780j41156q7011j62756m1339n8207J35807L01978
$$ plain form
9221 161048 257207 163871 214719 226703 197015 171316 206268 261171 242715 188302 44015
9210 44015 62581 161935 238664 -202067 -425727 -243519 -128513 -142251 -302634 -75585 168086
9199 168086 230797 200769 138698 122085 180613 136177 125943 180673 224787 154264 245988 119828
9187 119828 82143 287717 249858 173123 10639 -291686 -505580 -311279 -110527 -144856
9177 -144856 -277578 -318339 -192643 -102613 -70208 57998 82471 3368 -85326 105265 148582
9166 148582 76488 6713 -7915 210746 178741 56155 -50328 -62210 -14539 71207 123499
9155 123499 242662 207333 272318 249117 387981 283784 175313 -20429 46183 17814 -173975
9144 -173975 -169329 -122848 -55364 103614 81259 57100 -144145 -156257 -225845 -190508 -209766
$$ packed form
9221A61048R6159r3336N0848J1984k9688k5699L4952N4903j8456n4413j44287
9210D4015J8566R9354P6729m40731k23660J82208J15006j3738j60383K27049K43671
9199A68086O2711l0028o2071j6613N8528m4436j0234N4730M4114p0523R1724j26160
9187A19828l7685K05574l7859p6735j62484l02325k13894J94301K00752l4329
9177a44856j32722m0761J25696R0030L2405J28206K4473p9103q8694J90591M3317
9166A48582p2094o9775j4628K18661l2005j22586j06483j1882M7671Q5746N2292
9155A23499J19163l5329O4985k3201J38864j04197j08471j95742O6612k8369j91789
9144a73975M646M6481O7484J58978k2355k4159k01245j2112o9588L5337j9258
$$ plain form
9133 -209766 -243407 -101112 43733 137069 92942 -184638 -226601 -144787 -252200 -256921 -137637
9122 -137637 -62276 138858 125842 -13089 23592 210011 280017 300895 223567 49076 -202667
9111 -202667 -267918 -222176 -84359 128150 221486 219357 181910 87848 56506 85019 134416
9100 134416 45925 184949 157995 -56236 -82142 -188066 -218384 -204608 -198699 16118 199315
9089 199315 292980 350306 236812 161669 14977 -93233 79498 98225 -213404 -152603 -94775
9078 -94775 -114315 40689 -68957 -42477 -81897 -148125 -294247 -163072 42551 123360 38107
9067 38107 67298 181257 122613 45932 1653 -47235 35930 -40713 -114301 23804 194944
9056 194944 -77388 -322893 -348832 -104006 -73426 59339 183576 107043 16484 186525
$$ packed form
9133b09766l3641J42295J44845R3336m4127k77580m1963Q1814j07413m721J19284
9122a37637P5361K01134j3016j38931L6681J86419P0006K0878p7328j74491k51743
9111b02667o5251M5742J37817K12509R3336k129l7447r4062l1342K8513M9397
9100A34416q8491J39024k6954k14231k5906j05924l0318J3776N909K14817J83197
9089A99315R3665N7326j13494p5143j46692j08210J72731J8727l11629O0801N7828
9078i4775j9540J55004j09646K6480l9420o6228j46122J31175K05623Q0809q5253
9067C8107K9191J13959n8644p6681m4279m8888Q3165p6643p3588J38105J71140
9056A94944k72332k45505k5939K44826L0580J32765J24237p6533r0559J70041
$$ plain form
9046 186525 182516 162672 130251 121054 86278 -47690 20481 -34813 -54819 -93614 3887 -49091
9034 -49091 -180643 -357887 -518851 -502904 -245083 -184543 -225992 -187286 -63224 113833 229627
9023 229627 226611 106934 142799 189407 294001 313255 244221 195797 76061 56537 128986
9012 128986 91782 -21144 -84919 16232 1626 -13621 -68634 1544 -62121 -134683 -208520
9001 -208520 -130337 -86843 -73286 -118367 -246758 -383584 -410839 -269673 -232417 -100825 -24779
8990 -24779 -62080 61329 6100 -5585 114549 103336 -116692 -223717 -94347 -136529 -166570
8979 -166570 -75807 252626 547359 350681 131840 -8688 -74597 -147942 -65982 60230
8969 60230 163143 178779 53693 94513 25813 11034 94315 158453 226065 90959 122528
$$ packed form
9046A86525m009j9844l2421r197l4776j33968O8171n5294k0006l8795R7501n2978
9034d9091j31552j77244j60964J5947K57821O0540m1449L8706J24062J77057J15794
9023B29627l016j19677L5865M6608J04594J9254o9034m8424j19736j9524P2449
9012A28986l7204j12926o3775J01151j4606j5247n5013P0178o3665p2562p3837
9001b08520P8183M3494J3557m5081j28391j36826k7255J41166L7256J31592P6046
8990b4779l7301J23409n5229j1685J20134j1213k20028j07025J29370m2182l0041
8979a66570R0763L28433K94733j96678k18841j40528o5909p3345Q1960J26212
8969F0230J02913J5636j25086M0820o8700j4779Q3281O4138O7612j35106L1569
$$ plain form
8958 122528 62830 160196 183237 133322 81655 48135 43735 -71059 -60122 -66641 -39333 5843
8946 5843 44158 -60592 -90669 -63483 -38357 -29282 -6997 -68564 69927 182746 225898 99687
8934 99687 -91134 -103499 -116195 51803 528 80298 205052 219040 141532 -12180 -144
8923 -144 -60724 15441 -13202 -136777 -94986 -11902 80301 39543 -71861 24113 187708 231717
8911 231717 209975 271072 291401 234523 -7481 -87974 19844 -126669 -30004 -89398 -148488
8900 -148488 -64433 -8820 -130808 -186685 -18127 82463 211542 146909 -14471 -154467
8890 -154467 -84019 -122845 -199645 -13476 99493 122015 206815 302889 196821 108221 -16791
8879 -16791 -156876 -209577 -273930 -294745 -238638 -434862 -524674 -372079 -198644 -124339 -4446
$$ packed form
8958A22528n9698R7366K3041m9915n1667l3520m400j14794J0937o519K7308M5176
8946E843L8315j04750l0077K7186K5126R075K2285o1567J38491J12819M3152j26211
8934I9687j90821j2365j2696J67998n1275P9770J24754J3988p7508j53712J2036
8923a44o0580P6165k8643j23575M1791Q3084R2203m0758j11404R5974J63595M4009
8911B31717k1742O1097K0329n6878k42004q0493J07818j46513R6665n9394n9090
8900a48488Q4055N5613j21988n5877J68558J00590J29079o4633j61380j39996
8890a54467P0448l8826p6800J86169J12969K2522Q4800R6074j06068q8600j25012
8879a6791j40085n2701o4353k0815N6107j96224q9812J52595J73435P4305J19893
$$ plain form
8868 -4446 -16337 -90857 -62624 -133723 -144919 13114 42080 -7063 -6365 99115 310890 286768
8856 286768 -36148 -210495 -180327 -119810 -136225 -195181 119289 338901 75347 -13761 153779
8845 153779 103362 111 -20626 -29187 92308 151088 97137 -168298 -116235 -3638 6407
8834 6407 -59180 -53544 46477 151431 209792 73750 -210566 -255447 -125249 4093 26446
8823 26446 -111250 -159073 -157752 -180770 -187235 -143640 -56671 -28778 -91863 39467 37909 -271
8811 -271 33566 -26913 -55831 -352585 -335497 -149636 -102855 -80383 -196887 -224695 -297630 -290680
8799 -290680 -167473 -54963 -64674 -148704 -171326 -106200 -46501 -39383 -56557 -86023 -38403 196083
8787 196083 156496 109499 167694 143192 297208 347526 202581 122534 54911 122833 324460
$$ packed form
8868d446j1891p4520K8233p1099j1196J58033K8966m9143O98J05480K11775k4122
8856B86768l22916j74347L0168O0517j6415n8956L14470K19612k63554q9108J67540
8845A53779n0417j03251k0737q561J21495N8780n3951k65435N2063J12597J0045
8834F407o5587N636J00021J04954N8361j36042k84316m4881J30198J29342K2353
8823B6446j37696m7823J321k3018o465M3595Q6969K7893o3085J31330j558l8180
8811b71L3837o0479k8918k96754J7088J85861M6781K2472j16504k7808p2935O950
8799b90680J23207J12510r711q4030k2622O5126N9699P118j7174k9466M7620K34486
8787A96083l9587m6997N8195k4502J54016N0318j44945q0047o7623O7922K01627
$$ plain form
8776 324460 188581 38818 33238 176925 189050 149208 183204 213729 218191 174004 -20868
8765 -20868 -149484 -94517 138742 378783 436678 317127 177939 41607 -87553 -70185
8755 -70185 -18471 -144260 -232060 -247926 -179036 -199323 -334374 -433825 -342310 -159087 -166643
8744 -166643 -160165 -89866 -47153 -6247 32149 10169 -2451 100083 229842 109153 14693
8733 14693 73017 -4860 -126257 -204187 -174949 -63075 15555 70328 -148919 -212988 -100741
8722 -100741 -39200 63233 1795 -46532 4744 -115100 -136621 -192259 -256897 -241861 -140993
8711 -140993 25353 -15603 -74087 -212268 -241378 -245991 -89379 72156 7983 -31215 -60406
8700 -60406 35556 128074 114766 180968 254217 175074 93151 278726 445657 469962 434020
$$ packed form
8776C24460j35879j49763n580J43687J2125l9842L3996L0525M462m4187j94872
8765b0868j28616N4967K33259K40041N7895j19551j39188j36332j29160J7368
8755g0185N1714j25789q7800j5866O8890k0287j35051r9451R1515J83223p556
8744a66643O478P0299M2713M0906L8396k1980j2620J02534J29759j20689r4460
8733A4693N8324p7877j21397p7930K9238J11874P8630N4773k19247o4069J12247
8722a00741O1541J02433o1438m8327N1276j19844k1521n5638o4638J5036J00868
8711a40993J66346m0956n8484j38181k9110m613J56612J61535o4173l9198k9191
8700f0406R5962R2518j3308O6202P3249p9143q1923J85575J66931K4305l5942
$$ plain form
8689 434020 343874 168792 79661 9440 27476 -107321 -312164 -242875 -116491 -79029 -61334
8678 -61334 -58561 -178693 -209904 -88831 -136623 -122470 -194003 -191815 -40179 116725 19438
8667 19438 -64665 -37984 -51029 -98379 59695 80258 -82275 -126916 -885 45965 -129549
8656 -129549 -217074 -147141 9970 249318 282020 105519 29131 141148 164092 241561 210407
8645 210407 204833 223477 144880 62110 17215 -25552 -147954 -356227 -246499 23167 113211
8634 113211 121418 -63949 -98153 -22948 141934 110225 -26409 -84642 96809 132465 -31918
8623 -31918 -72034 -58846 -35587 -148112 -110215 -81575 -191608 -192458 -104234 -150202 -168034 -87816
8611 -87816 -107119 -192060 -15926 57299 122269 71380 -32296 -224983 -95626 90716 146649
$$ packed form
8689D34020r0146j75082q9131p0221J8036j34797k04843O9289J26384L7462J7695
8678f1334K773j20132l1211J21073m7792J4153p1533K188J51636J56904r7287
8667A9438q4103K6681j3045m7350J58074K0563j62533m4641J26031M6850j75514
8656a29549q7525O9933J57111K39348L2702j76501p6388J12017K2944P7469l1154
8645B10407n574J8644p8597q2770m4895m2767j22402k08273J09728K69666R0044
8634A13211Q207j85367l4204P5205J64882l1709j36634n8233J81451L5656j64383
8623c1918m0116J3188K3259j12525L7897K8640j10033q50Q8224m5968j7832Q0218
8611h7816j9303q4941J76134P3225O4970n0889j03676j92687J29357J86342N5933
$$ plain form
8600 146649 90327 110023 108314 -15480 -23696 50371 48582 -19982 -163568 -113847 -161242 -72077
8588 -72077 20154 93274 185117 237034 128354 -23511 -15682 135638 91033 192789 296749
8577 296749 166378 22948 -19931 -53407 3483 100117 92720 -7426 29290 -47259 -46364 25574
8565 25574 59253 15472 -32318 -74766 -284047 -334391 -318199 -343851 -429309 -541865 -346534
8554 -346534 -150631 -68345 -79434 -101084 11447 35537 123552 263402 313882 301031 132240
8543 132240 -11367 -3276 2912 124947 89158 -91857 -50631 -125420 -333914 -266572 -58505
8532 -58505 56125 27611 -18766 41461 -76035 -302321 -304803 -145511 -159314 -283257 -259482
8521 -259482 20657 224137 138426 18628 -36331 -28004 85900 170773 47164 -153381 -217245
$$ packed form
8600A46649n6322J9696j709j23794q216P4067j789o8564j43586M9721m7395Q9165
8588g2077R2231P3120R1843N1917j08680j51865P829J51320m4605J01756J03960
8577B96749j30371j43430m2879l3476N6890R6634p397j00146L6716p6549Q95P1938
8565B5574L3679m3781m7790m2448k09281n0344J6192k5652q5458j12556J95331
8554c46534J95903Q2286j1089k1650J12531K4090Q8015J39850N0480j2851j68791
8543A32240j43607Q091O188J22035l5789j81015M1226p4789k08494O7342K08067
8532e8505J14630k8514m6377O0227j17496k26286k482J59292j3803j23943K3775
8521b59482K80139K03480q5711j19798n4959Q327J13904Q4873j23609k00545o3864
$$ plain form
8510 -217245 -152226 -214727 -213070 -141420 -17239 60456 167498 245180 165115 186377 182703 175418
8498 175418 1516 64059 34335 20726 -19330 28094 25265 -30739 -100794 -85491 83612
8487 83612 200641 200298 -35420 -83351 -62907 -111516 -169456 -272997 -302952 -221472 -27538
8476 -27538 131286 164393 -19175 32995 -90078 -161479 -282731 -148110 -50348 115376 389762
8465 389762 301128 104110 33180 83386 88193 -20069 68744 133041 124015 115785 58604 -96733
8453 -96733 -233273 -249835 -326546 -374126 -304149 -156637 -121822 -87212 -107877 -48782 -21790
8442 -21790 -69788 3195 13708 32314 -40308 -25457 136303 197322 195298 88838 -23135
8431 -23135 -80639 -54796 -55677 -141312 -204901 -172124 -82789 34772 152402 66800 -83217 -604
$$ packed form
8510b17245O5019o2501J657P1650J24181P7695J07042P7682q0065K1262l674p285
8498A75418j73902O2543k9724j3609m0056M7424k829n6004p0055J5303J69103
8487H3612J17029l43k35718m7931K0444m8609n7940j03541k9955Q1480J93934
8476b7538J58824L3107j83568N2170j23073p1401j21252J34621R7762J65724K74386
8465C89762q8634j97018p0930N0206M807j08262Q8813O4297r026q230n7181j55337
8453i6733j36540j6562p6711m7580O9977J47512L4815L4610k0665N9095K6992
8442b1790m7998P2983J0513J8606p2622J4851J61760O1019k024j06460j11973
8431b3135n7504K5843q81q5635o3589L2777Q9335J17561J17630q5602j50017Q2613
$$ plain form
8419 -604 -47118 -91950 -73687 -187608 -247867 -89591 8145 69345 91816 96913 97854 6342
8407 6342 73826 -37696 -324054 -280305 -209368 -79572 -39491 -100395 -68624 -79470 -92256
8396 -92256 -287645 -388226 -185256 -17699 36075 113972 104804 104799 101550 162560 209936 256120
8384 256120 361448 244508 77929 -11141 -73843 -129549 -114887 -120183 37753 42542 22640
8373 22640 -42210 -107230 -100279 -189069 -124795 -28845 -74986 -44568 78882 64934 158178 100125
8361 100125 -89211 -47395 95327 -27397 -224886 -182672 -40408 -71390 -156456 -141878 -152224
8350 -152224 -220387 -217620 -304868 -202223 -5428 100663 283790 291940 115242 1082 26801
8339 26801 46084 145333 130485 130396 63920 -44360 44568 97186 131344 82883 134490 36705
$$ packed form
8419f04m6514m4832J8263j13921o0259J58276R7736O1200K2471N097R41r1512
8407F342O7484j11522k86358M3749P0937J29796M0081o0904L1771j0846j2786
8396i2256j95389j00581K02970J67557N3774P7897r168nl249O1010M7376M6184
8384B56120J05328j16940j66579q9070o2702n5706J4662n296J57936M789j9902
8373B2640o4850o5020O951q8790O4274R5950m6141L0418J23450j3948R3244n8053
8361A00125j89336M1816J42722j22724j97489M2214J42264l0982q5066J4578j0346
8350a52224o8163K767q7248J02645J96795J06091J83127Q150j76698j14160K5719
8339B6801J9283R9249j4848q9o6476j08280Q8928N2618L4158m8461N1607r7785
$$ plain form
8327 36705 -103137 -185752 -119267 -2264 27761 -42861 -148347 -98845 -302805 -406013 -404750
8316 -404750 -297329 -53717 150779 256365 181755 9249 -79206 -153542 -52349 62935
8306 62935 140737 82418 12859 42377 52709 -194283 -305434 -75213 50587 21139 66673
8295 66673 39090 -8680 -81389 -27786 -62610 -149057 -66555 -241689 -276623 -206640 -247971 -135360
8283 -135360 -96135 -20585 -101977 -98377 -65359 131016 175020 229997 115417 -21310 -60909
8272 -60909 62124 85459 77981 89579 21815 -42088 96613 249157 300875 250712 361267
8261 361267 299744 149705 213828 123781 -194448 -254216 -162819 -46674 -86123 -166227 -159057
8250 -159057 -208369 -210577 -246669 -271955 -152612 -53351 52104 145509 200553 149944 -4717
$$ packed form
8327C6705j39842q2615O6485J17003L0025p0622j05486M9502k03960j03208J263
8316d04750J07421K43612K04496J05586p4610j72506q8455p4336J01193J15284
8306F2935P7802n8319o9559K9518J0332k46992j11151K30221J25800k9448M5534
8295F6673k7583m7770p2709N3603l4824q6447Q2502j75134l4934O9983m1331J12611
8283a35360L9225P5550q1392L600L3018J96375M4004N4977j14580j36727l9599
8272f0909J23033K3335p478J1598o7764o3903J38701J52544N1718n0163J10555
8261C61267o1523j50039O4123r0047l18229n9768R1397J16145l9449q0104P170
8250a59057m9312k208l6092k5286J19343R9261J05455R3405N5044n0609j54661
$$ plain form
8239 -4717 -54776 -49432 -39247 47800 47965 -4630 100210 70336 -90217 -44620 -24623 172664
8227 172664 207325 312789 266657 232842 166860 163121 155952 179651 193677 114712 20350 -77473
8215 -77473 -90210 -58033 8879 26613 -30744 -81732 46718 40234 5202 60159 -28360 -21762
8203 -21762 -111477 -48599 98550 158622 177918 94166 28835 -143323 -170888 -43293 52343
8192 52343 12796 -134609 -214728 -248357 -113928 -53023 -91646 -204764 -233303 -197832 -206979
8181 -206979 -102969 -202072 -178661 -105921 17176 109408 73463 -28222 -30533 -117533 -16117
8170 -16117 156611 204597 163295 139796 158700 159469 192690 110663 240373 231652 35370 -215139
8158 -215139 -437765 -357644 -179323 -118278 -165540 -140390 -68444 -137719 -98942 -6351 -35096
$$ packed form
8239d717n0059N344J0185Q7047J65n2595J04840k9874j60553M5597J9997J97287
8227A72664L4661J05464m6132l3815o5982l739p169K3699J4026p8965r4362r7823
8215g7473j2737L2177O6912J7734n7357n0988J28450o484l5032N4957q8519O598
8203b1762q9715O2878J47149O0072J9296q3752o5331j72158k7565J27595R5636
8192E2343l9547j47405q0119l3629J34429O0905l8623j13118k8539L5471r147
8181b06979J04010r9103K3411P2740J23097R2232l5945j01685k311q7000J01416
8170a6117J72728M7986m1302k3499J8904P69L3221q2027J29710q721j96282k50509
8158b15139k22626Q0121J78321O1045m7262K5150P1946o9275L8777R2591k8745
$$ plain form
8147 -35096 -84562 -43412 -49725 -16899 218525 93814 45955 29527 -25092 -357 94907 203603
8135 203603 210483 197682 246244 11272 -105600 -165039 -163499 -138443 24168 174923 324666
8124 324666 298945 22012 -145995 -168557 -23673 58430 -6089 -68735 -74698 9873 161172
8113 161172 92278 2061 218370 105652 72554 149183 161369 47620 70264 41989 50466
8102 50466 207349 147655 46869 -30220 72424 29908 -183782 -171954 -207777 -199307 -142202
8091 -142202 -129599 -125919 -258798 -332097 -290223 -192134 -110988 -108987 -95243 -150929 -50956 42719
8079 42719 34876 185389 217899 76949 -22975 -58748 -32283 -11078 -51412 -147934 -146166 -39727
8067 -39727 -26120 -27566 156086 39195 -19944 16084 70664 61262 17279 115966 229402 252051
$$ packed form
8147c5096m9466M1150o313L2826K35424j24711m7859j6428n4619K4735R5264J08696
8135B03603O880j2801M8562k34972j16872n9439J540K5056J62611J50755J49743
8124C24666k5721k76933j68007k2562J44884Q2103o4519o2646n963Q4571J51299
8113A61172o8894r0217K16309j12718l3098P6629J2186j13749K2644k8275Q477
8102E0466J56883n9694j00786p7089J02644m2516k13690J1828l5823Q470N7105
8091a42202J2603L680j32879p3299M1874R8089Q1146K001J3744n5686R9973R3675
8079D2719p843J50513L2510j40950r9924l5773K6465K1205m0334r6522J768J06439
8067c9727J3607j446J83652j16891n9139L6028N4580r402m3983R8687J13436K2649
$$ plain form
8055 252051 99582 147542 170943 -23911 -111733 -143957 -226959 -135691 -69442 -120092 -114221
8044 -114221 -68301 -98693 -78485 8140 -71786 -153598 18807 122262 59710 -114365 -125942
8033 -125942 -258892 -192700 -226852 -294388 -219834 -90055 -39635 61971 122453 296645 293904
8022 293904 264076 273316 306808 305360 304816 409109 435033 451509 242308 93375 -91013 -103009
8010 -103009 103871 73353 90276 -28948 -203163 -186649 -118932 68800 192919 226624 97872
7999 97872 -25711 -119547 -174707 -279366 -246149 -233069 -160018 -117666 4940 -8674 -34404
7988 -34404 49417 -44762 -223557 -253189 -167070 -211921 -151590 -43114 -87912 26679 173635
7977 173635 281276 173621 -30678 -110862 -101478 -227016 -204415 -159803 -207502 -291214 -213597
$$ packed form
8055B52051j52469M7960K3401j94854q7822l2224q3002R1268O6249n0650N871
8044a14221M5920l0392K0208Q6625p9926q1812J72405J03455o2552j74075j1577
8033a25942j32950O6192l4152o7536P4554J29779N0420J01606O0482J74192k741
8022B93904k9828R240L3492j448n44J04293K5924J6476k09201j48933j84388j1996
8010a03009K06880l0518J6923j19224j74215J6514O7717J87732J24119L3705j28752
7999I7872j23583r3836n5160j04659L3217J3080P3051M2352J22606j3614k5730
7988c4404Q3821r4179j78795k9632Q6119m4851O0331J08476m4798J14591J46956
7977A73635J07641j07655k04299q0184R384j25538K2601M4612m7699q3712P7617
$$ plain form
7966 -213597 -119614 11208 -9951 -32280 -103413 -41139 -82579 -176010 -72610 -78702 -115006
7955 -115006 -89812 130948 284312 268109 241129 179047 3505 -148654 -121400 -177794 -194432
7944 -194432 -249582 -187900 4009 -64240 -79861 -148085 -277033 -154957 -28932 -127524 -181178
7933 -181178 -184382 -196222 -141431 -60180 -47894 -66999 -68286 -16709 -73797 4914 62323 18619
7921 18619 -80120 -151907 -137299 -10410 158662 335760 267941 103737 91291 180375 169760
7910 169760 145789 -22044 -265736 -309569 -117937 -241898 -308794 -299645 -184318 -326573 -373872
7899 -373872 -151646 -41463 -88199 -92027 -166665 -231199 -225962 -157668 -24452 -154994 -167365
7888 -167365 -147012 -235864 -200807 -68904 52694 113493 47007 -25543 -43317 32247 20582
$$ packed form
7966b13597R3983J30822k1159k2329p1133O2274m1440r3431J03400o092l6304
7955a15006K5194K20760J53364j6203k6980o2082j75542j52159K7254n6394j6638
7944a94432n5150O1682J91909o8249j5621o8224j28948J22076J26025r8592n3654
7933a81178l204j1840N4791Q1251J2286j9105j287N1577n7088P8711N7409m3704
7921A8619r8739p1787J4608J26889J69072J77098o7819j64204j2446Q9084j0615
7910A69760k3971j67833k43692m3833J91632j23961o6896R149J15327j42255m7299
7899c73872K22226J10183m6736l828p4638o4534N237O8294J33216j30542j2371
7888a67365K0353q8852L5057J31903J21598O0799o6486p2550j7774P5564j1665
$$ plain form
7877 20582 14911 -1084 -120834 -82085 20573 41873 106819 42367 20383 107862 -16633
7866 -16633 -111297 -14941 -53350 -128225 -156217 -196740 -238253 -254823 -237914 -137735 -69638 -97865
7854 -97865 -129989 -221300 -254131 -121549 -46479 -55691 -1088 -22319 -31750 -108550 -152472 -79630
7842 -79630 43749 111172 -11905 -128812 -47330 -25921 14684 78084 89702 40303 88917
7831 88917 91286 -52221 -131848 33584 61223 5425 209261 254136 177387 -1564 -34773
7820 -34773 -47963 -221773 -243996 -21688 -84385 -166028 75657 127346 127917 138878 -13991
7809 -13991 -129168 -70802 -35354 -76989 62528 185275 17443 -44134 -113455 -105847 -101872
7798 -101872 -170404 -188928 -55247 44955 16997 -196006 -300759 -408177 -212638 1452
$$ packed form
7877B0582n671j5995j19750L8749J02658K1300O4946o4452k1984Q7479j24495
7866a6633r4664R6356l8409p4875k7992m0523m1513j6570J6909J00179O8097k8227
7854i7865l2124r1311l2831J32582P5070r212N4603k1231r431p6800m3922P2842
7842g9630J23379O7423j23077j16907Q1482K1409M0605O3400J1618m9399M8614
7831H8917K369j43507p9627J65432K7639n5798K03836M4875p6749j78951l3209
7820c4773j3190j73810k2223K22308o2697q1643K41685N1689N71J0961j52869
7809a3991j15177N8366L5448m1635J39517J22747j67832o1577o9321P608L975
7798a01872o8532j8524J33681J00202k7958k13003j04753j07418J95539K14090
$$ plain form
7788 1452 -56278 59106 162962 207419 195377 185997 79776 -18606 151270 102973 74014
7777 74014 70697 77507 107987 42585 -75904 -25820 -42633 -163140 -292160 -370644 -372807 -338182
7765 -338182 -87422 6716 -208053 -158058 -60995 -27374 -54764 140482 125428 25443 130384
7754 130384 134588 244353 163158 87867 52077 7791 18601 105158 32982 -9506 -2997 -31089
7742 -31089 -57470 -85475 -9886 76454 -105477 -124616 -235428 -220129 -301796 -281261 -202361
7731 -202361 -124112 -120886 -397613 -571310 -601458 -579148 -252782 85075 140606 53828 15685
7720 15685 31883 -52800 -59025 86734 -85522 -246221 -213656 -157149 39589 211374 234730
7709 234730 310279 317440 84257 -148922 -330851 -374603 -208061 -96602 -134043 -81248 144397
$$ packed form
7788A452n7730J15384J03856M4457j2042r380j06221r8382J69876m8297k8959
7777G4014l317O810L0480o5402j18489N0084j6813j20507j29020p8484k163L4625
7765c38182K50760R4138k14769M9995R7063L3621k7390J95246j5054r9985J04941
7754A30384M204J09765q1195p5291l5790m4286J0810Q6557p2176m2488O509k8092
7742c1089k6381k8005P5589Q6340j81931j9139j10812J5299q1667K0535P8900
7731b02361P8249L226k76727j73697l0148K2310L26366L37857N5531q6778l8143
7720A5685J6198q4683o225J45759j72256j60699L2565N6507J96738J71785K3356
7709B34730P5549P161k33183k33179j81929m3752J66542J11459l7441N2795K25645
$$ plain form
7698 144397 184061 154747 68441 7138 -77979 -53148 115408 124760 125694 205608 161286 -61582
7686 -61582 -32108 6185 -74351 -52748 -47966 36961 68861 48291 58725 62396 126873 52664
7674 52664 -9769 -111951 -263705 -322533 -246117 -151560 -119412 -103932 -2683 -40250 -118754
7663 -118754 -149108 -156959 -106003 -48226 -13342 -1611 -69860 -123538 -164847 -126684 -72090 -67473
7651 -67473 -30470 -94901 -225161 -256743 -305297 -309062 -300865 -68958 30850 175009 103448 2935
7639 2935 -118251 -218884 -103647 72626 57714 -63423 -67891 -76001 -145675 -161187 -315726
7628 -315726 -280955 -174162 -88734 -99590 -108113 -62451 -81202 -203797 -140912 20811 55017
7617 55017 38489 69445 -26150 -114179 -193618 -90516 -98999 -131185 -23248 78315 200989
$$ packed form
7698A44397L9664k9314q6306o1303q5117K4831J68556R352R34P9914m4322k22868
7686f1582K9474L8293q0536K1603M782Q4927L1900k0570J0434L671O4477p4209
7674E2664o2433j02182j51754n8828P6416R4557L2148J5480J01249l7567p8504
7663a18754l0354p851N0956N7777L4884J1731o8249n3678m1309L8163N4594M617
7651f7473L7003o4431j30260l1582m8554l765Q197K31907R9808J44159p1561j00513
7639B935j21186j00633J15237J76273j4912j21137m468q110o9674j5512j54539
7628c15726L4771J06793Q5428j0856q523M5662j8751j22595O2885J61723L4206
7617E5017j6528L0956r5595q8029p9439J03102q483l2186J07937J01563J22674
$$ plain form
7606 200989 123371 -5947 46781 60704 -923 -22225 43706 63240 10269 92820 24223
7595 24223 -24692 -159912 -188440 -169650 -116712 -215484 -171281 -30110 -61899 -104870 -123396
7584 -123396 -4317 23469 181192 179408 41704 -228398 -335985 -304539 -166777 -58925
7574 -58925 8870 -80039 -134731 -151882 -75087 -34588 26977 24313 -138645 -274583 -171104
7563 -171104 -69808 -14282 -76160 -107441 -74124 69518 231724 229051 109877 75477 -33075
7552 -33075 -104422 -263998 -400468 -318426 -26127 261419 348316 270586 148482 88529 45802
7541 45802 135587 227288 143189 44712 -72696 -200154 -392444 -516445 -496996 -364364 -221639
7530 -221639 -140653 -99786 -2555 -3398 141669 342502 217707 17593 64247 110725 77702
$$ packed form
7606B00989p7618j29318N2728J3923o1627k1302O5931J9534n2971Q2551o8597
7595B4223m8915j35220k8528J8790N2938r8772M4203J41171l1789m2971j8526
7584a23396J19079K7786J57723j784j37704k70102j07587L1446J37762J07852
7574e8925O7795q8909n4692j7151P6795M0499O1565k664j62958j35938J03479
7563a71104J01296N5526o1878l1281L3317J43642J62206k673j19174l4400j08552
7552c3075p1347j59576j36470Q2042K92299K87546Q6897p7730j22104n9953m2727
7541D5802Q9785R1701q4099r8477j17408j27458j92290j24001J9449J32632J42725
7530b21639Q0986M0867R7231q43J45067K00833j24795k00114M6654M6478l3023
$$ plain form
7519 77702 337644 499145 316546 63066 -45410 19774 55193 -16698 -13424 33043 63103
7508 63103 -124 6568 -173339 -275219 -226821 -225436 -237641 -209535 -112676 -84446 29045 -16064
7496 -16064 26887 98526 125745 -120173 -103802 181514 174600 150025 164385 69201 127800 197583
7484 197583 265810 264914 28245 -166465 -140696 -84468 -45499 -97056 -276850 -324549 -236106
7473 -236106 -18821 63582 -48309 -150821 -130023 -120752 -386809 -317595 -233434 -314717 -317246
7462 -317246 -165138 -15585 73341 26538 -85530 -285996 -234645 -17602 -171166 -215643
7452 -215643 -141090 -105308 -108659 -208430 -32251 120635 93264 -58811 -158848 -346923 -241694
7441 -241694 44735 248945 329620 116431 -87005 -142547 7762 234791 159648 -46331
$$ packed form
7519G7702K59942J61501j82599k53480j08476O5184L5419p1891L274M6467L0060
7508F3103o3227O692j79907j01880M8398J385j2205K8106R6859K8230J13491m5109
7496a6064M2951P1639K7219k45918J6371K85316o914k4575J4360r5184N8599O9783
7484A97583O8227q96k36669j94710K5769N6228L8969n1557j79794m7699Q8443
7473b36106K17285Q2403j11891j02512K0798R271k66057O9214Q4161q1283k529
7462c17246J52108J49553Q8926m6803j12068k00466N1351K17043j53564m4477
7452b15643P4553L5782l351r9771J76179J52886k7371j52075j00037j88075J05229
7441b41694K86429K04210Q0675k13189k03436n5542J50309K27029p5143k05979
$$ plain form
7431 -46331 -162220 -158098 -101215 -64934 3030 -56091 -144833 -223729 -217879 -208628 -157901 -222628
7419 -222628 -213840 -95530 -42553 -15270 -190064 -190062 -145916 -129143 -247755 -254888 -171990 -83797
7407 -83797 10189 -136696 -189162 -151636 -41340 61336 42303 -73435 -172805 -88128 -22865
7396 -22865 -16487 -155813 -250304 -112541 -159066 -124567 -178720 -338602 -287329 -165920 -235027
7385 -235027 -339981 -121715 11547 35158 -116422 -107502 -2559 33680 131659 75036 -73796
7374 -73796 -211357 -40961 -106289 -77631 -72363 -214376 -187184 -65716 55588 82549 7362
7363 7362 -25299 -57378 -114368 -149933 -54092 -7921 -216153 -294989 -148876 -106106 -98334 5358
7351 5358 -53704 8532 -38367 -113728 -210216 -106566 -84053 -76075 91597 119905 80543 -55344
$$ packed form
7431d6331j15889M122N6883L6281O7964n9121q8742p8896N850R251N0727o4727
7419b22628Q788J18310N2977K7283j74794KM4146J6773j18612p133Q2898Q8193
7407h3797R3986j46885n2466L7526J10296J02676j9033j15738r9370Q4677O5263
7396b2865O378j39326r4491J37763m6525L4499n4153j59882N1273J21409o9107
7385b35027j04954K18266J33262K3611j51580Q920J04943L6239R7979n6623j48832
7374g3796j37561J70396o5328K8658N268j42013K7192J21468J21304K6961p5187
7363G362l2661l2079n6990l5565R5841M6171k08232p8836J46113M2770P772J03692
7351E358n9062O2236m6899p5361r6488J03650K2513P978J67672K8308l9362j35887
$$ plain form
7339 -55344 -122504 -39939 -19505 -59924 128839 206317 229906 197009 172232 42863 -6638
7328 -6638 52916 -84206 -114145 -102446 -203055 -241672 -101019 46598 133558 51181 -14510
7317 -14510 91778 76056 63195 88138 11745 23428 142112 178664 212348 104374 -116823
7306 -116823 -128081 -219719 -352727 -209296 -30802 -3892 79017 -70988 -141786 -87087 -114682
7295 -114682 -11529 146552 277556 363220 242408 89325 139645 123107 62679 -76060
7285 -76060 -196764 -53023 123091 168653 97989 -76664 -212150 -186870 -188059 -253090 -228269
7274 -228269 -213005 -144284 -94532 -33776 87549 68681 -24655 -164275 -106109 98069 106660
7263 106660 16941 -24267 -102530 -44756 -3969 -230843 -301790 -91302 117322 74872 4512
$$ packed form
7339e5344o7160Q2565K0434m0419J88763P7478K3589l2897k4777j29369m9501
7328f638N9554j37122k9939J1699j00609l8617J40653J47617Q6960q2377o5691
7317a4510J06288j5722j2861K4943p6393J1683J18684L6552L3684j07974k21197
7306a16823j1258r1638j33008J43431J78494K6910Q2909j50005p0798N4699k7595
7295a14682J03153J58081J31004Q5664j20812j53083N0320j6538o0428j38739
7285g6060j20704J43741J76114M5562p0664j74653j35486K5280j189o5031K4821
7274b28269J5264O8721M9752O0756J21325j8868r3336j39620N8166K04178Q591
7263A06660q9719m1208p8263N7774M0787k26874p0947K10488K08624m2450p0360
$$ plain form
7252 4512 -107917 -69912 -43175 13373 62897 171361 74566 -105388 -160166 -58160 -18522
7241 -18522 102382 213115 99369 66552 145328 178082 108660 9526 -90143 -276080 -180135
7230 -180135 34723 -106418 -62708 -27258 15424 11018 -29557 -148636 -99861 9389 -52832
7219 -52832 -38736 92519 59441 -33274 76002 108875 194024 64313 -48805 -21609 -85448
7208 -85448 -102355 -3108 51598 115307 137055 251162 83108 -84875 -315302 -433175 -413764
7197 -413764 -164236 188247 312535 188871 -12774 -123591 -78431 -190353 -228763 -336212
7187 -336212 -318642 -276650 -207494 -179959 -207303 -190493 -10395 45840 48866 80833 86128 142748
7175 142748 212982 173553 -16518 -165905 -168034 -116231 -63237 -81574 -80857 -153905 -82049 -107213
$$ packed form
7252D512j12429L8005K6737N6548M9524J08464r6795j79954n4778J02006L9638
7241a8522J20904J10733j13746l2817P8776L2754o9422r9134r9669j85937R5945
7230a80135K14858j41141M3710L5450M2682m406m0575j19079M8775J09250o2221
7219e2832J4096J31255l3078r2715J09276L2873Q5149j29711j13118K7196o3839
7208h5448j6907R9247N4706O3709K1748J14107j68054j67983k30427j17873J9411
7197d13764K49528L52483J24288j23664k01645j10817M5160j11922l8410j07449
7187c36212J7570M1992O9156K7535k7344J6810J80098N6235L026L1967N295N6620
7175A42748P0234l9429j90071j49387k129N1803N2994j8337P17p3048P1856k5164
$$ plain form
7163 -107213 -106137 -165231 -267309 -161046 -70785 -112308 -125677 -17784 64174 8223 152080
7152 152080 249702 309736 166898 -54091 -59515 -103857 -6203 187874 352045 239405 103449
7141 103449 105140 158327 182348 87306 158035 95608 23180 -133481 -8377 24191 41696
7130 41696 45110 42900 -68386 -211104 -170865 -44858 93020 -25539 -193414 -304732 -191892
7119 -191892 -268032 -356049 -216956 -110378 -84018 -182817 -236295 -152871 -317047 -248254 -129914
7108 -129914 -11747 104882 141053 54222 -208453 -282187 -135103 -106118 75066 232968
7098 232968 224924 83325 -3096 41768 191122 220023 -5240 -87909 -99165 -5216 78515
7087 78515 88061 17948 -50915 -110077 -111398 1502 71874 45942 80411 111874 22959 -98129
$$ packed form
7163a07213J076n9094j02078J06263R0261m1523j3369J07893Q1958n5951J43857
7152A52080R7622O0034j42838k20989n424m4342R7654J94077J64171j12640j35956
7141A03449J691N3187K4021r5042P0729o2427p2428j56661J25104L2568J7505
7130D1696L414k210j11286j42718M0239J26007J37878j18559j67875j11318J12840
7119a91892p6140q8017J39093J06578K6360r8799n3478Q3424j64176O8793J18340
7108a29914J18167J16629L6171q6831k62675p3734J47084K8985J81184J57902
7098B32968q044j41599q6421M4864J49354K8901k25263q2669j1256R3949Q3731
7087G8515R546p0113o8863n9162j321J12900P0372k5932L4469L1463q8915j21088
$$ plain form
7075 -98129 -138757 -58890 -22663 -148180 -197382 -357301 -252295 -28598 173225 191639 181626
7064 181626 71419 -55671 -18886 -51888 -49386 -43783 36553 -57036 -249342 -399006 -397263
7053 -397263 -169888 -35964 -33567 -38045 -29093 76050 -27828 19383 23648 85433 195652
7042 195652 154361 61990 -126922 -109066 -110309 -196797 -145295 -48639 87359 190284 126221
7031 126221 158928 70340 33697 -14898 -41687 -125736 -188170 -149825 -227306 -230735 -228121 -163589
7019 -163589 -94688 74310 124902 -37478 -60975 -78861 -89986 -79407 -36228 -93189 -222987
7008 -222987 -159202 -122186 -235267 -205537 -97065 42605 90159 99626 229751 312250 342196
6997 342196 298139 192652 52700 23146 63128 4816 43734 135192 83186 -63302 -76671
$$ packed form
7075i8129m0628P9867L6227j25517m9202j59919J05006K23697K01823J8414j0013
7064A81626j10207j27090L6785l3002K502N603Q0336r3589j92306j49664J743
7053c97263K27375J33924K397m478Q952J05143j03878M7211M265O1785J10219
7042A95652m1291r2371j88912J7856j243q6488N1502R6656J35998J02925o4063
7031A26221L2707q8588l6643m8595k6789q4049o2434L8345p7481l429K614O4532
7019a63589O8901J68998N0592j62380k3497j7886j1125J0579M3179n6961j29798
7008b22987O3785L7016j13081K9730J08472J39670M7554R467J30125Q2499K9946
6997C42196m4057j05487j39952k9554L9982n8312L8918R1458n2006j46488j3369
$$ plain form
6986 -76671 -265039 -382405 -201801 -63143 -50995 -27607 6640 115807 150353 3743 134129
6975 134129 301678 148174 83132 53171 -14916 76705 4988 -67654 -46429 -24000 -183535
6964 -183535 -258732 -155377 36912 49857 -92043 -178550 -83858 52397 8 -95597 -185689
6953 -185689 -174004 -120782 -114375 -99225 -62529 -146652 -242249 -209087 -240679 -200479 -183701 -283184
6941 -283184 -229837 -20807 259200 242752 362861 308487 153303 102946 78071 -56863 -247964
6930 -247964 -302840 -342123 -539437 -528434 -476227 -441440 -430419 -326846 -202620 -78787 17275
6919 17275 35988 66405 -43389 -160716 -139021 60756 151797 37717 -185488 -263169 -260551
6908 -260551 -247882 -153633 -56803 -8484 34202 66494 43165 -60379 -161531 -316533 -397333
$$ packed form
6986g6671j88368j17366J80604J38658J2148K3388L4247J09167L4546j46610J30386
6975A34129J67549j53504o5042k9961o8087R1621p1717p2642K1225K2429j59535
6964a83535p5197J03355J92289J2945j41900q6507R4692J36255n2389r5605r0092
6953a85689J1685N3222O407J5150L6696q4123r5597L3162l1592M0200J6778r9483
6941b83184N3347K09030K80007j6448J20109n4374j55184n0357k4875j34934j91101
6930b47964n4876l9283j97314J1003N2207L4787J1021J03573J24226J23833R6062
6919A7275J8713L0417j09794j17327K1695J99777R1041j14080k23205p7681K618
6908b60551J2669R4249R6830M8319M2686L2292k3329j03544j01152j55002q0800
$$ plain form
6897 -397333 -328193 -32751 102387 38041 19195 -13534 54517 222715 204359 83555 34268
6886 34268 20530 -41141 -12387 113470 63099 -89251 -84641 71627 128801 -54218 -263173
6875 -263173 -321850 -274644 -192423 -248704 -174969 -111343 -169860 -121764 -111904 -152800 -83970 -73543
6863 -73543 -190655 -124158 -46630 78130 279298 294271 231887 284502 268888 81086 -2813
6852 -2813 -92069 -54798 -99629 -55231 -54751 -165854 -99836 -160082 -192274 -32884 66174 117823
6840 117823 41354 -53755 -46220 -124537 -263462 -218571 -191820 -243598 -69436 -10748 -73851
6829 -73851 -77849 -154574 -131400 -130711 -7893 82407 11414 -150794 30315 44733 -43411 -113993
6817 -113993 -183433 -124881 -48266 79554 188766 231093 130108 110471 4593 -170161 -310452
$$ packed form
6897c97333O9140K95442J35138o4346j8846l2729O8051J68198j8356j20804m9287
6886C4268j3738o1671K8754J25857n0371j52350M610J56268N7174j83019k08955
6875b63173n8677M7206Q2221n6281P3735O3626n8517M8096R860m0896O8830J0427
6863g3543j17112O6497P7528J24760K01168J4973o2384N2615j5614j87802q3899
6852b813q9256L7271m4831M4398M80j11103O6018o0246l2192J59390R9058N1649
6840A17823p6469r5109P535p8317j38925M4891K6751n1778J74162N8688o3103
6829g3851l998p6725K3174O89J22818R0300p0993j62208J81109J4418q8144p0582
6817a13993o9440N8552P6615J27820J09212M2327j00985j9637j05878j74754j40291
$$ plain form
6806 -310452 -443799 -425848 -441120 -256234 -169059 -254657 -56301 -34014 -73040 -188379 -231613
6795 -231613 -79638 -49267 -90625 -38443 -5668 33688 812 103058 162289 117777 122665
6784 122665 109150 88463 71898 272361 290824 232877 174622 137982 173361 160876 148278
6773 148278 188482 67251 -187848 -80823 153487 162274 19437 -117490 -236228 -205033
6763 -205033 -154032 -209432 -201991 -187666 -149813 139345 86661 123659 97669 46866 -106677
6752 -106677 -169239 -173953 -290320 -224701 -124478 -205592 -258042 -97121 -111427 -231261 -287635
6741 -287635 -157106 -119843 -177070 -6446 -109300 -86761 -199447 -364367 -46761 136449
6731 136449 168983 225667 -35658 -99975 -66807 -115821 -125280 33930 70705 82743 -209846
$$ packed form
6806c10452j33347J7951j5272J84886Q7175q5598J98356K2287l9026j15339m3234
6795b31613J51975L0371m1358N2182L2775L9356l2876J02246N9231m4512M888
6784A22665j3515k0687j6565K00463J8463n7947n8255l6640L5379j2485j2598
6773A48278M0204j21231k55099J07025K34310Q787j42837j36927j18738L1195
6763b05033N1001n5400P441J4325L7853K89158n2684L6998k5990n0803j53543
6752a06677o2562m714j16367O5619J00223q1114n2450J60921j4306j19834n6374
6741b87635J30529L7263n7227J70624j02854K2539j12686j64920L17606J83210
6731A36449L2534N6684k61325o4317L3168m9014r459J59210L6775J2038k92589
$$ plain form
6720 -209846 -322472 -477157 -324413 -130061 -136927 -201930 -166427 -199986 -150027 76412 223243
6709 223243 176584 122038 205686 248999 188677 -11991 158782 93381 19506 6401 -69670
6698 -69670 -31388 -77156 -87313 45432 113518 76024 22566 19236 191109 168874 -7797
6687 -7797 -93599 -181291 -99932 62747 112501 153752 147249 201521 74264 46995 162199 286116
6675 286116 308475 248436 -9299 -193583 -227056 -346041 -386476 -378935 -337513 -181502 -179294
6664 -179294 -153408 -64998 -55284 -140915 -87996 -72002 -29949 -7361 -143137 -76690 -64405 8664
6652 8664 65239 40085 48935 -40973 -105020 -60405 94510 17816 36416 -101298 -102893 -202908
6640 -202908 -29069 26220 31814 95077 134149 -35957 -44788 127139 294023 255369 94700
$$ packed form
6720b09846j12626j54685J52744J94352o866o5003L5503l3559M9959K26439J46831
6709B23243m6659n4546Q3648M3313o0322k00668J70773o5401p3875j3105p6071
6698f9670L8282m5768j0157J32745O8086l7494n3458l330J71873k2235j76671
6687g797q5802q7692Q1359J62679M9754M1251o503N4272j27257k7269J15204J23917
6675B86116K2359o0039k57735j84284l3473j18985m0435P541M1422J56011K208
6664a79294K5886Q8410R714q5631N2919J5994M2053K2588j35776O6447J2285P3069
6652H664N6575k5154Q850q9908o4047M4615J54915p6694J8600j37714j595j00015
6640b02908J73839N5289N594O3263L9072j70106q831J71927J66884l8654j60669
$$ plain form
6629 94700 -2582 -57859 -295638 -240212 -11006 38015 135779 36248 -125728 -72583 -83317
6618 -83317 -217814 -437811 -372295 -191283 -158274 -253918 -263021 -97149 59115 99880 -15037
6607 -15037 -94737 -134654 -148412 -92797 58409 97593 35604 41861 97861 170964 133981 113225
6595 113225 266092 225542 150588 262362 270338 278955 240171 191928 228871 147434 -34726
6584 -34726 -216549 -168430 -134402 -9949 17790 106525 344385 369429 212415 97580 -7451
6573 -7451 -100233 -43767 -119197 -108255 147808 246248 355933 222656 235872 228801 53811
6562 53811 76676 34269 86459 134556 105556 45462 -108183 -38833 150990 239171 229965 202775
6550 202775 86417 -34768 -48821 -44327 3380 -7203 -47249 -14040 -84487 -141558 -20312
$$ packed form
6629I4700r7282n5277k37779N5426K29206M9021R7764r9531j61976N3145j0734
6618h3317j34497k19997O5516J81012L3009r5644r103J65872J56264M0765j14917
6607a5037p9700l9917j3758N5615J51206L9184o1989O257N6000P3103l6983k0756
6595A13225J52867m0550p4954J11774P976Q617l8784m8243L6943q1437j82160
6584c4726j81823M8119L4028J24453K7739Q8735K37860K5044j57014j14835j05031
6573g451r2782N6466p5430J0942K56063R8440J09685j33277J3216p071j74990
6562E3811K2865m2407N2190M8097k9000o0094j53645O9350J89823Q8181r206k7190
6550B02775j16358j21185j4053M494M7707j0583m0046L3209p0447n7071J21246
$$ plain form
6539 -20312 -37965 12362 10403 -287600 -423308 -262705 38142 157962 239669 126313 96245
6528 96245 174640 96752 -131515 -238344 -78310 19752 58510 43646 70025 -59097 -107117
6517 -107117 49424 -37323 5824 49824 99586 93266 -86528 -221108 -279604 -295256 -234447
6506 -234447 -189558 -365089 -351367 -26586 41502 -82836 -146769 -239856 -174227 -79594 9969
6495 9969 74243 74998 -66314 -117762 84057 204139 188521 223658 239540 156035 -102549 -81602
6483 -81602 14755 8817 42399 -38367 -210056 -416381 -303740 -212084 -120706 51607 -3866
6472 -3866 -73159 -148985 -185626 -111476 -40010 -155245 -131417 -93858 127829 340297 286067
6461 286067 145778 -3104 -47769 -6983 35587 3399 101112 189935 188534 86899 23000
$$ packed form
6539b0312j7653N0327j959k98003j35708J60603L00847J19820Q1707j13356l0068
6528I6245P8395p7888k28267j06829J60034R8062L8758j4864K6379j29122m8020
6517a07117J56541q6747M3147M4000M9762o320j79794j34580n8496j5652O0809
6506b34447M4889j75531J3722L24781O8088j24338o3933r3087O5629R4633Q9563
6495I969O4274P55j41312n1448K01819J20082j5618L5137J5882q3505k58584K0947
6483h1602R6357n938L3582q0766j71689k06325J12641R1656R1378J72313n5473
6472c866o9293p5826l6641P4150P1466j15235K3828L7559K21687K12468n4230
6461B86067j40289j48882m4665M0786M2570l2188R7713Q8823j401j01635o3899
$$ plain form
6450 23000 -14054 88729 64626 21067 56376 -35042 -64341 15716 -126118 -350494 -338343
6439 -338343 -274950 -240895 -111481 -174303 -24966 41231 -58071 -124219 -218900 -287136 -264279
6428 -264279 -115717 -10911 65603 2318 -305811 -296394 -176262 -13054 56122 40670 -108963
6417 -108963 -278120 -362390 -238090 -14861 -164564 -253988 -297387 -312659 -386408 -450090 -334886
6406 -334886 -144605 64368 207972 73129 4423 24377 167371 195677 5426 -52014
6396 -52014 -104124 -149918 -96935 14105 111199 162596 205909 326619 218669 -202809 -114283
6385 -114283 1697 62259 36058 -68185 -54316 63088 122009 49306 -74029 -210714 -185111
6374 -185111 38932 -38490 34454 256973 180660 176829 57763 -32762 13301 73449 -42052
$$ packed form
6450B3000l7054J02783k4103m3559L5309r1418k9299Q0057j41834k24376J2151
6439c38343O3393L4055J29414o2822J49337O6197r9302o6148r4681o8236K2857
6428b64279J48562J04806P6514o3285l08129R417J20132J63208O9176j5452j49633
6417a08963j69157q4270J24300K23229j49703q9424m3399j5272p3749o3682J15204
6406c34886J90281K08973J43604j34843o8706J9954J42994K8306j90251n7440
6396e2014n2110m5794N2983J11040R7094N1397M3313J20710j07950m21478Q8526
6385a14283J15980O0562k6201j04243J3869J17404N8921p2703j23335j36685K5603
6374a85111K24043p7422P2944K22519p6313l831j19066r0525M6063O0148j15501
$$ plain form
6363 -42052 41005 130074 181596 312081 244627 220756 165961 36456 100513 72803 2006
6352 2006 -128803 -74829 -139693 -161274 -69598 28271 -45535 -85764 11557 -21566 31530 15953
6340 15953 60525 83237 133024 65544 -17223 -153656 -29310 181341 263188 203548 67630
6329 67630 10635 65202 38984 105766 197367 -17758 -129080 -138456 -27106 76461 75100
6318 75100 -58993 -96390 -194016 -167692 -209286 -158327 -197994 -282182 -130395 118177 53001
6307 53001 -74295 -81181 48415 -4524 -47014 -138094 105615 135635 -74425 61216 152655
6296 152655 122482 174139 159398 165552 32730 -106551 -117091 84590 101395 174026 158375
6285 158375 -6085 -115963 -167877 -36670 178371 161778 71733 169800 189723 27858 7458
$$ packed form
6363d2052Q3057Q9069N1522J30485o7454k3871n4795j29505O4057k7710p0797
6352B006j30809N3974o4864k1581R1676R7869p3806m0229R7321l3123N3096j5577
6340A5953M4572K2712M9787o7480q2767j36433J24346K10651Q1847n9640j35918
6329F7630n6995N4567k6218O6782R1601k15125j11322r376J11350J03567j361
6318G5100j34093l7397r7626K6324m1594N0959l9667q4188J51787K48572o5176
6307E3001j27296o886J29596n2939m2490r1080K43709L0020k10060J35641R1439
6296A52655l0173N1657j4741O154j32822j39281j0540K01681J6805P2631j5651
6285A58375j64460j09878n1914J31207K15041j6593r0045R8067J9923j61865k0400
$$ plain form
6274 7458 -9503 -27087 111620 304880 302751 119207 -172419 -165156 -79372 -85689 -158365 -119069
6262 -119069 -126899 -285227 -366931 -285443 -240740 -234716 19952 261066 178681 205182 -60237
6251 -60237 -197305 -184503 -237381 -243499 -217479 -79350 -29817 22069 2404 -115833 -142441
6240 -142441 -194411 -47790 -127720 -106764 5934 16011 -27415 -48555 87593 9188 -23163
6229 -23163 -99225 1741 229226 12713 -225165 -84512 41065 94044 -44646 -245609
6219 -245609 -293797 -195022 -107284 72850 159949 52340 -57851 -76969 -37290 92957 237823
6208 237823 103731 -161525 -98934 51708 -45625 -59706 132400 194345 144235 123157 56408
6197 56408 182232 236502 102618 59786 16053 -27559 -20231 -35763 -111743 -61246 -18824 85427
$$ packed form
6274G458j6961j7584J38707J93260k129j83544k91626P263Q5784o317p2676L9296
6262a19069p830j58328q1704Q1488M4703O024K54668K41114q2385K6501k65419
6251f0237j37068J2802n2878o118K6020J38129M9533N1886j9665j18237k6608
6240a42441n1970J46621p9930K0956J12698J0077m3426k1140J36148p8405l2351
6229b3163p6062J00966K27485k16513k37878J40653J25577N2979j38690k00963
6219b45609m8188R8775Q7738J80134Q7099j07609j10191j9118L9679J30247J44866
6208B37823j34092k65256O2591J50642r7333j4081J92106O1945n0110k1078o6749
6197E6408J25824N4270j33884m2832m3733m3612P328j5532p5980N0497M2422J04251
$$ plain form
6185 85427 84016 91874 126587 60579 -71834 -20087 -8306 23101 84295 107217 74340 -52841
6173 -52841 -100888 30153 183445 17636 -62628 46193 -11055 -40222 108588 83692 102855
6162 102855 117116 5835 -71495 -9166 -72219 -115742 -35887 -41102 -103395 -79680 -165450 -222556
6150 -222556 -269615 -84415 102006 134716 90817 155189 83074 -79869 -200878 -256740 -266460
6139 -266460 -173366 -215691 -207449 -56679 58975 6473 26990 142919 64363 -164736 -118676
6128 -118676 -22373 39473 97257 9886 -106728 -204276 -186760 -45330 170320 148340 -72506
6117 -72506 -35214 -125423 -180219 -57430 -36774 22345 315472 408866 203823 172730 168052
6106 168052 95151 5170 -179128 -62038 -71207 -205787 -110199 108431 171940 119958 129914
$$ packed form
6185H5427j411P858L4713o6008j32413N1747J1781L1407O1194K2922l2877j27181
6173e2841m8047J31041J53292j65809q0264J08821n7248k9167J48810k4896J9163
6162A02855J4261j11281p7330O2329o3053m3523P9855n215o2293K3715q5770n7106
6150b22556m7059J85200J86421L2710m3899O4372p2115j62943j21009n5862r720
6139b66460R3094m2325Q242J50770J15654n2502K0517J15929p8556k29099M6060
6128a18676R6303O1846N7784q7371j16614r7548J7516J41430K15650k1980k20846
6117g2506L7292r0209n4796J22789K0656N9119K93127R3394k05043l1093m678
6106A68052p2901q9981j84298J17090r169j34580R5588K18630O3509n1982R956
$$ plain form
6095 129914 183018 180450 37056 -115000 -79270 -30639 76214 123079 140863 200514 75855
6084 75855 78921 47722 74053 107931 283178 341432 146084 120958 64066 -68672 -58139
6073 -58139 -148083 -197024 -219865 -77881 -57371 -42075 -51848 33488 -179021 -363302 -392049
6062 -392049 -292747 -48938 -40209 -98279 -54705 -97532 -92207 77838 76215 72124 218339 167480
6050 167480 107289 120895 95496 -4953 -144391 -189293 -212058 -85963 -251038 -412576 -309392
6039 -309392 -164330 -84535 -228612 -130196 -123983 -341756 -274519 -285836 -244875 -152142 55406
6028 55406 -137295 -221667 -149501 -51008 171094 201779 192896 59178 62406 78471 125416 79492
6016 79492 -81385 -156682 -165343 -118252 -165354 -91657 10705 -66286 -187520 -105969 214009
$$ packed form
6095A29914N3104k568j43394j52056L5730M8631J06853M6865J7784N9651j24659
6084G5855L066l1199K6331L3878J75247N8254j95348k5126n6892j32738J0533
6073e8139q9944m8941k2841J41984K0510J5296r773Q5336k12509j84281k8747
6062c92049R9302K43809Q729n8070M3574m2827N325J70045j623m091J46215n0859
6050A67480o0191J3606k5399j00449j39438m4902k2765J26095j65075j61538J03184
6039c09392J45062P9795j44077R8416O213k17773O7237j1317M0961R2733K07548
6028E5406j92701q4372P2166R8493K22102L0685q883j33718L228J6065M6945m5924
6016G9492j60877p5297q661M7091m7102P3697J02362p6991j21234Q1551L19978
$$ plain form
6005 214009 323488 60197 -22064 -40391 44222 115783 119206 101738 20091 13740 108280 109709
5993 109709 244340 299546 132839 30446 24014 -18955 -63699 -127274 -222300 -280190 -152494
5982 -152494 -101277 57670 157241 230765 150061 117340 10522 58465 104614 119789 -5097
5971 -5097 14655 108923 253069 191003 82733 -67084 -116204 33567 272128 266230 95631
5960 95631 -20411 66839 95527 -27406 -122944 34229 31809 -104864 -191526 -136336 -14824
5949 -14824 -7381 -107839 -162292 -187145 -135592 -277686 -251476 -38950 -27761 -219008 -293969
5938 -293969 -294094 -334492 -258061 -63931 142924 234591 166378 284926 313987 269128 242272
5927 242272 291358 397762 354737 223927 150821 -94381 -81920 120925 238700 264288 378234
$$ packed form
6005B14009J09479k63291q2261j8327Q4613P1561L423j7468q1647o351R4540J429
5993A09709J34631N5206j66707j02393o432m2969m4744o3575r5026n7890J27696
5982a52494N1217J58947R9571P3524q0704l2721j06818M7943M6149J5175j24886
5971e097J9752R4268J44146o2066j08270j49817m9120J49771K38561n898j70599
5960I5631j16042Q7250K8688j22933r5538J57173k420j36673q6662N5190J21512
5949a4824P443j00458n4453k4853N1553j42094K6210K12526J1189j91247p4961
5938b93969j25m0398P6431J94130K06855R1667o8213J18548K9061m4859k6856
5927B42272M9086J06404m3025j30810p3106k45202J2461K02845J17775K5588J13946
$$ plain form
5916 378234 359422 338624 204353 170940 39066 -69453 9050 -357 -15225 29796 -38708
5905 -38708 -41261 -48822 -120769 -62874 138491 173842 49706 -81628 -110705 22855 115103
5894 115103 161520 -59854 -75763 -20066 -67846 31627 -75536 -82652 -105838 -60652 97416
5883 97416 188927 213733 131663 -52358 -114989 -54946 -29028 140956 317637 229544 116865
5872 116865 110006 138005 138465 -65662 -148892 -120384 -289229 -269218 -227172 -251755 -249876 -176726
5860 -176726 -100783 -182255 -170962 -16018 -59636 -303321 -382999 -202332 -162387 -55646 -133176
5849 -133176 -67136 95077 122832 82999 144428 78974 105877 68193 36147 -2011 62157
5838 62157 69731 70446 37172 -73327 -221055 -336332 -301474 -228068 -148780 76722 31502 -151305
$$ packed form
5916C78234j8812k0798j34271l3413j31874j08519P8503r407j4868M5021o8504
5905c8708k553p561p1947N7895K01365L5351j24136j31334k9077J33560R2248
5894A15103M6417k21374j5909N5697m7780R9473j07163p116k3186M5186J58068
5883I7416R1511K4806q2070j84021o2631O0043K5918J69984J76681q8093j12679
5872A16865o859K7999M60k04127q3230K8508j68845K0011M2046k4583J879P3150
5860a76726P5943q1472J1293J54944m3618k43685p9678J80667L9945J06741p7530
5849a33176O6040J62213K7755l9833O1429o5454K6903l7684l2046l8158O4168
5838F2157P574P15l3274j10499j47728j15277L4858P3406P9288K25502m5220j82807
$$ plain form
5826 -151305 -304437 -125529 77048 126033 236435 191373 53246 13463 -99443 -126665
5816 -126665 -32389 36386 108644 111386 95740 -78586 -132548 -36764 -83577 -107994 -4239
5805 -4239 -21105 -105860 36248 381 -8286 -23943 166166 221019 128797 124979 120526 112634
5793 112634 111857 153004 150315 221676 173094 -28843 -28561 -87487 -110220 -38916 -63465 -43708
5781 -43708 56128 -92991 -196648 -15749 118322 127125 105627 147370 104352 -37576 -118991
5770 -118991 -312356 -225681 -56657 74134 -10052 -40213 93031 100094 -109430 -133116 -56205
5759 -56205 152205 273532 326624 311146 385126 305993 182533 186275 170816 38529 84907
5748 84907 80162 6036 192567 174958 62381 -31998 -8556 172326 326372 291718 447461
$$ packed form
5826a51305j53132J78908K02577M8985J10402m5062j38127l9783j12906k7222
5816a26665R4276O8775P2258K742j5646j74326n3962R5784m6813k4417J03755
5805d239j6866q4755J42108l5867q667j5657J90109N4853r2222l818m453p892
5793A12634p77M1147k689P1361m8582k01937K82n8926k2733P1304k4549J9757
5781d3708R9836j49119j03657J80899J34071Q803k1498M1743m3018j41928q1415
5770a18991j93365Q6675J69024J30791q4186l0161J33244P063k09524k3686P6911
5759e6205K08410J21327N3092j5478P3980p9133j23460L742j5459j32287M6378
5748H4907m745p4126J86531j7609j12577r4379K3442J80882J54046l4654J55743
$$ plain form
5737 447461 307960 90443 101217 70319 59091 132243 72738 102851 258266 265592 113097
5726 113097 -8341 149539 108046 -170992 -316551 -238972 -137749 -55635 -22117 63721 69366
5715 69366 -62712 -151823 -166588 -169014 -204936 -145173 45877 143297 155049 97992 172578 135573
5703 135573 89107 131591 171793 118870 25136 -133280 -65347 35369 117028 -4392 -22193
5692 -22193 25291 104903 66024 -14235 -167467 -249795 -144976 -52993 16847 905 -3829 19239
5680 19239 134699 8451 -86737 -89204 14036 119156 231321 287881 286909 211808 261093
5669 261093 165685 -71500 -163123 -47424 -33070 -113254 -105891 -271291 -292334 -174251 -148240
5658 -148240 -223281 -300301 -257920 -131924 75077 40518 -63551 -56251 -70808 -203769 -87076
$$ packed form
5737D47461j39501k17517J0774l0898j1228P3152n9505L0113J55415P326j52495
5726A13097j21438J57880m1493k79038j45559P7579J01223Q2114L3518Q5838N645
5715F9366j32078q9111j4765k426l5922N9763J91050R7420J1752n7057P4586l7005
5703A35573m6466M2484M0202n2923r3734j58416O7933J00716Q1659j21420j7801
5692b2193M7484P9612l8879q0259j53232q2328J04819R1983O9840j5942m734K3068
5680A9239J15460j26248r5188k467J03240J05120J12165N6560r72p5101M9285
5669B61093r5408k37185r1623J15699J4354q0184P363j65400k1043J18083K6011
5658a48240p5041p7020M2381J25996K07001l4559j04069P300j4557j32961J16693
$$ plain form
5647 -87076 14554 153591 289614 272071 74344 -23675 71304 72832 89984 108548 108685 107029
5635 107029 24360 150310 84441 -27990 94119 117988 183378 228727 323752 222827 101741
5624 101741 63943 -45634 33558 -6978 -274615 -382197 -373255 -246404 -136634 -87825 -76587
5613 -76587 -19074 -14252 -5910 116036 243202 331642 199910 249047 180737 55743 33161
5602 33161 53198 61087 91930 55207 6906 52883 62782 58778 1001 54883 37994 144492
5590 144492 171492 19290 -157868 -51661 -33334 -21319 45039 131525 23258 -1414 -11177
5579 -11177 183772 283571 220932 66320 91068 41243 -86368 -151547 -126576 36270 70743
5568 70743 87293 -99094 -114227 -12779 144278 63148 95424 161308 31399 -119262 -208685
$$ packed form
5647h7076J01630J39037J36023j7543j97727r8019R4979J528J7152J8564J37j656
5635A07029q2669J25950o5869j12431J22109K3869O5390M5349R5025j00925j21086
5624A01741l7798j09577P9192m0536k67637j07582Q942J26851J09770M8809J1238
5613g6587N7513M822Q342J21946J27166Q8440j31732M9137o8310j24994k2582
5602C3161K0037P889L0843l6723m8301M5977R899m004n7777N3882j6889J06498
5590A44492K7000j52202j77158J06207J8327J2015O6358Q6486j08267k4672r763
5579a1177J94949R9799o2639j54612K4748m9825j27611o5179K4971J62846L4473
5568G0743J6550j86387j5133J01448J57057q1130L2276O5884j29909j50661q9423
$$ plain form
5557 -208685 -97022 -49087 75129 140969 201355 208060 110650 61502 -3044 -198569 -213906
5546 -213906 -105030 -121245 -147244 -135998 -20499 -54553 -150638 -127533 -38016 -67144 -7177
5535 -7177 35077 131188 64502 -40135 -40456 -30796 19108 41256 68895 87408 66878 -56309
5523 -56309 -73689 -102634 24097 33650 22411 27364 -31195 -130243 -106746 -271010 -281087 -115347
5511 -115347 -78484 -84219 77199 155524 144603 171303 168237 70166 84392 341648 269828 26360
5499 26360 -2924 108354 153185 135719 96325 44388 -92349 -218217 -91538 -62490 -67330
5488 -67330 30803 -126909 -227346 -82979 19411 -40266 -106503 -203534 -164865 21949 13053
5477 13053 110683 115817 88947 13804 -97428 -41155 -102700 -79470 -94768 -971 68180 75056
$$ packed form
5557b08685J11663M7935J24216O5840O0386O705r7410m9148o4546j95525j5337
5546b13906J08876j6215k5999J1246J15499l4054r6085K3105Q9517k9128N9967
5535g177M2254R6111o6686j04637l21R660M9904K2148K7639J8513k0530j23187
5523e6309j7380k8945J26731R553j1239M953n8559r9048K3497j64264j0077J65740
5511a15347L6863n735J61418P8325j0921K6700l066r8071J4226K57256p1820k43468
5499B6360k9284J11278M4831j7466l9394n1937j36737j25868J26679K9048m840
5488f7330R8133j57712j00437J44367J02390n9677o6237r7031L8669J86814q896
5477A3053R7630N134k6870p5143j11232N6273o1545K3230j5298R3797O9151O876
$$ plain form
5465 75056 74168 85897 -88484 -217116 -143178 -97720 -88938 -102123 -103265 -92335 -80921 30376
5453 30376 131846 105903 -101935 -231141 -178884 -109826 -195557 -130138 -34558 -54853 -56506
5442 -56506 -13393 -117357 -229617 -45423 18380 26043 -123701 -220466 -270098 -194557 -132356
5431 -132356 -180340 -215223 -184632 4194 91306 -40685 -114748 -56902 -40593 -203547 -394631
5420 -394631 -325501 -396509 -296025 -177327 -72627 -52875 1000 54786 -19414 -99650 -256146
5409 -256146 -273856 -341120 -326145 -365863 -391111 -355146 -240343 9087 117928 84037 44418
5398 44418 93327 88436 57739 10306 -178058 -122074 -149643 -209963 -47435 -191778 -256462
5387 -256462 11160 116443 -45783 -43836 -52967 -249984 -345348 -292021 -95891 19851 192730
$$ packed form
5465G5056q88J1729j74381j28632P3938M5458Q782j3185j142J0930J1414J11297
5453C0376J01470k5943k07838j29206N2257O9058q5731O5419R5580k0295j653
5442e6506M3113j03964j12260J84194O3803P663j49744r6765m9632P5541O2201
5431a32356m7984l4883L0591J88826Q7112j31991p4063N7846J6309j62954j91084
5420c94631O9130p1008J00484J18698J04700J9752N3875N3786p4200q0236j56496
5409b56146j7710o7264J4975l9718k5248L5965J14803K49430J08841l3891l9619
5398D4418M8909m891l0697m7433j88364N5984k7569o0320J62528j44343o4684
5387b56462K67622J05283j62226J947r131j97017r5364N3327J96130J15742J72879
$$ plain form
5376 192730 142567 93308 -94545 -53858 -74346 -136636 -288503 -178237 -228835 -143488 -48603
5365 -48603 27043 187248 308200 222923 163509 171364 104769 74712 134821 204288 123621 30799
5353 30799 100209 155638 219500 205296 177647 133394 12727 5991 151591 279915 188379
5342 188379 -1400 -206385 -268386 -61381 -21088 -94792 -135106 -249910 -190979 -163254 -79767
5331 -79767 69865 124727 170045 167879 137028 -77698 -99281 -100147 50428 -104273 -212316
5320 -212316 -71064 194243 126294 -81229 -100716 42255 177996 285073 294574 297584 166072
5309 166072 170688 171622 212289 211959 203374 198248 216624 156712 179009 76556 -71633 -36443 -86173
5296 -86173 -173079 -60181 -28036 -94645 -161942 -156605 -72204 73332 289130 210185 1814
$$ packed form
5376A92730n0163m9259j87853M0687k0488o2290j51867J10266n0598Q5347R4885
5365d8603P5646J60205J20952q5277n9414P855o6595l0057O0109O9467q0667r2822
5353C0799O9410N5429O3862j4204k7649m4253j20667o736J45600J28324r1536
5342A88379j89779k04985o2001K07005M0293p3704m0314j14804N8931K7725Q3487
5331g9767J49632N4862M5318k166l0851k14726k1583q66J50575j54701j08043
5320b12316J41252K65307o7949k07523j9487J42971J35741J07077R501L010j31512
5309A66072M616R34M0667l30q585n126J8376n9912K2297j02453j48189L5190m9730
5296h6173q6906J12898L2145o6609o7297N337Q4401J45536K15798p8945k08371
$$ plain form
5285 1814 -86917 -136257 -106840 -60232 -64653 -32740 92097 81991 -70503 -71500 102054 195069
5273 195069 74986 -3279 -24955 -8530 156754 163975 77747 143519 217567 194352 26769
5262 26769 37138 93509 192168 122922 76791 -101313 -188934 -139958 -122318 -158390 -190870 -43149
5250 -43149 -101588 -126108 -179785 -45134 -47576 -18961 5090 -2826 53635 44360 145776 25557
5238 25557 -174370 -121758 29179 188463 273618 144128 -163896 -233297 -127371 -14598
$$ packed form
5285A814q8731m9340K9417M6608m421L1913J24837j0106j52494r97J73554R3015
5273A95069j20083p8265k1676J6425J65284P221q6228O5772P4048k3215j67583
5262B6769J0369N6371R8659o9246m6131j78104q7621M8976J7640l6072l2480J47721
5250d3149n8439k4520n3677J34651k442K8615K4051p916N6461r275J01416j20219
5238B5557j99927N2612J50937J59284Q5155j29490l08024o9401J05926J12773
$$ [...]
##END NTUPLES=NMR SPECTRUM
##END=
