##TITLE=Analysis number 325887
Compound Code cd 11100
Project Code adrs
Chemist Name fudan
##JCAMPDX= 6.0         $$ Bruker NMR JCAMP-DX V2.0
##DATA TYPE= NMR SPECTRUM
##DATA CLASS= NTUPLES
##ORIGIN= Bruker BioSpin GmbH
##OWNER= nmr
$$ XWIN-NMR		Version 3.5
$$ Thu Jan 18 09:42:01 2007 GMT Standard Time (UT+0h)  MAYBRIDGE\nmr@NMR_250MHZ
##.OBSERVE FREQUENCY= 250.131544655141
##.OBSERVE NUCLEUS= ^1H
##.ACQUISITION MODE= SIMULTANEOUS (DQD)
##.ACQUISITION SCHEME= undefined
##.AVERAGES= 16
##.DIGITISER RES= 18
##SPECTROMETER/DATA SYSTEM= dpx250
##.PULSE SEQUENCE= zg30
##.SOLVENT NAME= DMSO
##.SHIFT REFERENCE= (INTERNAL, DMSO, 0, 16.522)
##AUDIT TRAIL= $$ (NUMBER, WHEN, WHO, WHERE, WHAT)
$$ ##TITLE= Audit trail, XWIN-NMR		Version 3.5
$$ ##JCAMPDX= 5.01
$$ ##ORIGIN= Bruker BioSpin GmbH
$$ ##OWNER= nmr
$$ C:\u/data/dgb/nmr/ADRS/1340/pdata/1/auditp.txt
$$ ##AUDIT TRAIL=  $$ (NUMBER, WHEN, WHO, WHERE, WHAT)
(   1,<2007-01-18 09:41:22.74 +000>,<MAYBRIDGE\nmr>,<NMR_250MHZ>,
      <created by zg, POWCHK disabled, PULCHK disabled
       configuration hash MD5:
       49 4B E0 1D 92 C2 6B 37 9F E6 65 BC 52 41 86 1D
       data hash MD5: 64K
       E0 9C EB 05 B5 CD AC C4 DA 00 01 62 BE C2 40 8D>)
(   2,<2007-01-18 09:41:41.79 +000>,<MAYBRIDGE\nmr>,<NMR_250MHZ>,
      <Start of raw data processing
       ef LB = 0.3 FT_mod = 6 PKNL = 1 SI = 32K 
       data hash MD5: 32K
       26 C9 B8 D6 5A 45 E6 FF 1B B2 55 F1 A7 33 60 CD>)
(   3,<2007-01-18 09:41:47.00 +000>,<MAYBRIDGE\nmr>,<NMR_250MHZ>,
      <apk 
       data hash MD5: 32K
       F1 33 42 F6 22 DF D2 84 49 6C 0C 8A ED 22 64 2A>)
(   4,<2007-01-18 09:41:48.60 +000>,<MAYBRIDGE\nmr>,<NMR_250MHZ>,
      <abs ABSG = 5 
       data hash MD5: 32K
       B1 B4 B6 E1 B1 12 B5 EC C3 A4 E0 D1 DB BA 04 9D>)
$$ ##END=
$$ 
$$ hash MD5
$$ 89 46 99 F1 C8 92 11 C2 42 DA 20 96 1E 5D 83 9C
##$RELAX= 
##$RELAX= 
##$RELAX= 
##$RELAX= 
##$RELAX= 
##$RELAX= 
##$RELAX= 
$$ Bruker specific parameters
$$ --------------------------
##$DU= <C:\u>
##$EXPNO= 1340
##$NAME= <ADRS>
##$PROCNO= 1
##$TYPE= <nmr>
##$USER= <dgb>
##$AMP= (0..31)
100 100 100 100 100 100 100 100 100 100 100 100 100 100 100 100 100 100 
100 100 100 100 100 100 100 100 100 100 100 100 100 100 
##$AQSEQ= 0
##$AQ_mod= 3
##$AUNM= <au_zg>
##$AUTOPOS= <3 >
##$BF1= 250.13
##$BF2= 250.13
##$BF3= 250.13
##$BF4= 250.13
##$BF5= 500.13
##$BF6= 500.13
##$BF7= 500.13
##$BF8= 500.13
##$BYTORDA= 1
##$CFDGTYP= 0
##$CFRGTYP= 5
##$CHEMSTR= <none>
##$CNST= (0..31)
1 1 145 1 1 1 1 1 1 1 1 1 1 1 1 1 1 1 1 1 1 1 1 1 1 1 1 1 1 1 1 1 
##$CPDPRG= <>
##$CPDPRG1= <>
##$CPDPRG2= <>
##$CPDPRG3= <>
##$CPDPRG4= <mlev>
##$CPDPRG5= <mlev>
##$CPDPRG6= <mlev>
##$CPDPRG7= <mlev>
##$CPDPRG8= <mlev>
##$CPDPRGB= <>
##$CPDPRGT= <>
##$D= (0..31)
0 1 0 0 0 0 0 0 0 0.06 0 0 0 0 0 0 0.0002 0 0 0 0 0 0 0 0 0 0 0 0 0 0 
0 
##$DATE= 1169113280
##$DBL= (0..7)
120 120 120 120 120 120 120 120 
##$DBP= (0..7)
150 150 150 150 150 150 150 150 
##$DBP07= 0
##$DBPNAM0= <>
##$DBPNAM1= <>
##$DBPNAM2= <>
##$DBPNAM3= <>
$$ [...]
##$SUBNAM7= <"">
##$SUBNAM8= <"">
##$SUBNAM9= <"">
##$SW= 20.6930455092707
##$SWIBOX= (0..15)
0 0 3 0 0 0 0 0 0 0 0 0 0 0 0 0 
##$SW_h= 5175.983436853
##$TD= 65536
##$TD0= 1
##$TE= 294.16
##$TE2= 300
##$TE3= 300
##$TEG= 300
##$TL= (0..7)
0 120 120 120 120 120 120 120 
##$TP= (0..7)
150 150 150 150 150 150 150 150 
##$TP07= 0
##$TPNAME0= <>
##$TPNAME1= <>
##$TPNAME2= <>
##$TPNAME3= <>
##$TPNAME4= <>
##$TPNAME5= <>
##$TPNAME6= <>
##$TPNAME7= <>
##$TPOAL= (0..7)
0.5 0.5 0.5 0.5 0.5 0.5 0.5 0.5 
##$TPOFFS= (0..7)
0 0 0 0 0 0 0 0 
##$TUNHIN= 0
##$TUNHOUT= 0
##$TUNXOUT= 0
##$USERA1= <user>
##$USERA2= <user>
##$USERA3= <user>
##$USERA4= <user>
##$USERA5= <user>
##$V9= 5
##$VALIST= <valist>
##$VCLIST= <CCCCCCCCCCCCCCC>
##$VD= 0
##$VDLIST= <DDDDDDDDDDDDDDD>
##$VPLIST= <PPPPPPPPPPPPPPP>
##$VTLIST= <TTTTTTTTTTTTTTT>
##$WBST= 1024
##$WBSW= 4
##$XGAIN= (0..3)
0 0 0 0 
##$XL= 0
##$YL= 0
##$YMAX_a= 389828
##$YMIN_a= -414448
##$ZGOPTNS= <>
##$ZL1= 120
##$ZL2= 120
##$ZL3= 120
##$ZL4= 120
##$ABSF1= 16.522
##$ABSF2= -4.171173
##$ABSG= 5
##$ABSL= 3
##$ALPHA= 0
##$AQORDER= 0
##$ASSFAC= 0
##$ASSFACI= 0
##$ASSFACX= 0
##$ASSWID= 0
##$AUNMP= <proc_1d>
##$AZFE= 0.1
##$AZFW= 0.1
##$BCFW= 0
##$BC_mod= 0
##$BYTORDP= 0
##$COROFFS= 0
##$CY= 12.5
##$DATMOD= 1
##$DC= 0
##$DFILT= <>
##$DTYPP= 0
##$F1P= 14.0000005364418
##$F2P= -0.99999901652339
##$FCOR= 0.5
##$FTSIZE= 32768
##$FT_mod= 6
##$GAMMA= 0
##$GB= 0
##$INTBC= 1
##$INTSCL= 1
##$ISEN= 128
##$LB= 0.3
##$LEV0= 0
##$LPBIN= 0
##$MAXI= 10000
##$MC2= 0
##$MEAN= 0
##$ME_mod= 0
##$MI= 0
##$NCOEF= 0
##$NC_proc= -4
##$NLEV= 6
##$NOISF1= 0
##$NOISF2= 0
##$NSP= 0
##$NTH_PI= 0
##$NZP= 0
##$OFFSET= 16.522
##$PC= 1
##$PHC0= 211.4799
##$PHC1= 9.076688
##$PH_mod= 1
##$PKNL= yes
##$PPARMOD= 0
##$PSCAL= 4
##$PSIGN= 0
##$REVERSE= no
##$SF= 250.13
##$SI= 32768
##$SIGF1= 0
##$SIGF2= 0
##$SINO= 400
##$SIOLD= 32768
##$SREGLST= <1H.DMSO>
##$SSB= 0
##$STSI= 32768
##$STSR= 0
##$SW_p= 5175.98343685301
##$SYMM= 0
##$S_DEV= 0
##$TDeff= 65536
##$TDoff= 0
##$TI= <Analysis number 999999
Compound Code 99
Book Reference 9
Project Code 9>
##$TILT= no
##$TM1= 0
##$TM2= 0
##$TOPLEV= 0
##$USERP1= <user>
##$USERP2= <user>
##$USERP3= <user>
##$USERP4= <user>
##$USERP5= <user>
##$WDW= 1
##$XDIM= 32768
##$YMAX_p= 360231224
##$YMIN_p= -484209
$$ End of Bruker specific parameters
$$ ---------------------------------
##NTUPLES= NMR SPECTRUM
##VAR_NAME=  FREQUENCY,     SPECTRUM/REAL,   SPECTRUM/IMAG
##SYMBOL=    X,             R,               I
##VAR_TYPE=  INDEPENDENT,   DEPENDENT,       DEPENDENT
##VAR_FORM=  AFFN,          ASDF,            ASDF
##VAR_DIM=   32768,         32768,           32768
##UNITS=     HZ,            ARBITRARY UNITS, ARBITRARY UNITS
##FACTOR=    0.157963299565203, 1,           1
##FIRST=     4132.6476996994, 0,             0
##LAST=      -1043.33573715361, 0,           0
##MIN=       -1043.33573715361, -484209,     0
##MAX=       4132.6476996994, 360231224,     0
$$ Real data points
##PAGE= N=1
##DATA TABLE= (X++(R..R)), XYDATA
$$ [...]
18232A8894K404K1313k3232m1147k706J9R727J167J4723Q217j3005p015L505j7090
18218b4226J1102J4071N932M903K4849O5k0710n2193r960J0632l225j4974n009
18205e8743K7893J0953L279l535K806J8261j335l672J3050n91j1902j3058J4161
18192b433K7885M304L840j5418l1616K1107K7949j4824L301R80k5830l459J2478
18179H264J8871l652j410L980J2901j0150m840o900K2619J6746k6187k1294q334
18166F14j666l897Q03J9276J3147j0074j9528k4217l960J0253J4662J2170K3219
18153C0802Q96M72P89o733l1207q591k0528j0658J2928K2947n331O457M404j2710
18139a6063q883O513k993l0435k0130J1127K4838M963L435j1007K8330J1034l196
$$ y = [18894, 21298, 42611, 19379, -21768, -24474, -24455, -14728, -13561, 1162, 9379, -3626, -10641, -7136, -24226, -13124, 947, 6879, 11782, 36631, 36696, 15986, -36207, -46167, -35535, -38760, -53734, -58743, -30850, -19897, -16618, -20153, -17347, 914, -421, -4093, 8957, 8366, -3536, -16594, -2433, 25452, 29756, 33596, 18178, -13438, 7669, 35618, 20794, 24095, 25075, -755, -4214, 8264, 27135, 23483, 22073, 26053, 38954, 28804, 23964, 17064, 39683, 56429, 30242, 8948, 614, -1052, -4949, -4146, 15130, 28277, 18203, -1325, -25542, -29502, -19249, -4587, 7583, 30802, 31698, 32170, 32959, 26226, -4981, -13572, -34100, -44758, -31830, -8883, -14214, -7757, -3353, -16063, -24946, -18433, -21426, -51861, -71991, -60864, -36026, -31063, -27628, -38635, -10305, 729, -2467]
18126b467J1495j8622j5346k9492J2872L4757M669J141p428j7916K25J1572J1847
18113b693M947J7377l738l7282k7706m427n855p707q393J343P681K145P972j1093
18099f7429K4013L0990n532J5104L1408L540O645J7692o616l4858j7193q00K978
18086e8R472O072j5818j0055m417L236Q543n293r334J5111Q929j7184J415J1546
18072B165K9294l4681j6204j3203q084J5357J5231j93n006K0723r902q703m663
18059a7869j9318N655R852O641J3098j693j8671J7590k13J513L442j593J7993
18046A6427J2510o634r692p975r317J5893K5139m976K511j1750M050k220J047
18033B5013J4627J1161q767M350Q072k0279j8926l631L215K435L407L1092K0830
$$ y = [-2467, 9028, -9594, -24940, -54432, -41560, -6803, -2134, -993, -8421, -26337, -26112, -14540, -2693, 2254, 19631, 15893, -21389, -49095, -53522, -59377, -67084, -75477, -74134, -66453, -64308, -56336, -67429, -43416, -12426, -17958, -2854, 28554, 32094, 38739, 56431, 49815, 14957, -2236, -3036, -58, 9414, 15486, -332, -10387, -14804, -11568, -3025, -8318, -17652, -2541, 6388, -10796, -9381, 2165, 31459, -3222, -19426, -32629, -40713, -25356, -10125, -10318, -15324, 5399, -4503, -13206, -17869, -37187, -31532, -21680, -15039, -1941, -3634, -22305, -4715, -4928, -3415, 27, -1566, 16427, 28937, 22303, 12611, 4636, -4681, 11212, 36351, 31375, 33886, 22136, 26186, 23966, 25013, 39640, 50801, 42034, 46384, 54456, 34177, 15251, 11620, 14835, 17270, 20677, 51769, 72599]
18020G2599N203j5778o515L496p617m947K3918O199j1674j0730j4560k178J157
18007C8573j8230J9160P028j6021j2221O531k8920J2311n882M778O405k0201k280
17994h969J2966L54j6764o106m553K0245K2357j0282j0861j8943J3917J3774j3255
17981f120J6110P554J3431j435l3729o701N0241K6744J5567j1534j3741l2174
17969B4213o092J0140q573l524j8539j1192Q580k161j41J811j6818k0402K1950
17956b0748o963p318m906J767J3242Q138j182J5114n496j9452R146J00M9273r427
17942B1288l1361n527K1755J5050k0834k4000K2499K583o097J2078N211N13R227
17929B2385Q676o523k8449M864q160J0966J3272p33J7608j8283k7959N014J5228
$$ y = [72599, 77802, 62024, 55509, 59005, 51388, 46441, 70359, 76558, 64884, 54154, 39594, 37416, 38573, 20343, 39503, 46531, 30510, 18289, 24820, -4100, 8211, 2329, 7107, 13512, -6689, -8969, 3997, 4351, -12413, -18519, -23072, -2827, 19530, 9248, -1613, -20556, -6639, 7135, -6120, 9990, 17544, 30975, 29540, -4189, -10890, 39351, 66095, 81662, 70128, 56387, 24213, 18121, 28261, 19688, 16164, -2375, -13567, -4987, -7148, -7289, -5478, -22296, -42698, -20748, -27711, -35029, -39935, -38168, -24926, -16788, -17970, -2856, -8352, -27804, -18658, -18558, 30715, 21288, -10073, -15600, 6155, 21205, 371, -23629, -1130, 1453, -4644, 7434, 12645, 13158, 22385, 31061, 24538, -3911, 953, -7207, 3759, 17031, 16298, 33906, 15623, -12336, -7322, 7906]
17916G906j8708j2151J1343J8745j1979K8q245K858J7436j261J1684O948J8505
17903D3109R340k5560j6028J0532k780p331o380J940L091K4881k250l805k4834
17890C925j0048R412K3307L061j299j5332j7027j3096j858J2958K5468q447j9914
17877h890k0627M383p861K1756N35M285J9317J0374K4363k1653l3235m336K3088
17864A1499M4033o65l0180k4550M495l3983L408J7589J717K5401K0989q660m3255
17851a2162k0058j926L0186Q464n177k1913Q951O333j8403q151q012j1065j4381
17838f7314M2310J8283M208n801r179j4682J2902N940k5160r963R304J5872O39
17825b2641Q507J1596J1734o895K2932j9371r898L1521Q671j0618l993J2530J2248
$$ y = [7906, -10802, -22953, -11610, 7135, -4844, -4816, -13061, -10203, 7233, 5972, 17656, 24604, 43109, 52449, 26889, 10861, 21393, 18613, 11282, 4902, 6842, 9933, 34814, 32564, 28759, 3925, -6123, 3289, 26596, 29657, 28358, 13026, -4001, -17097, -18955, -5997, 19471, 11024, -8890, -29517, -25134, -32995, -11239, -10704, -6419, 12898, 23272, 47635, 25982, -7253, -11589, 11499, 55532, 54867, 24687, 137, 4632, -29351, -25943, -8354, -6637, 18764, 39753, 31093, -12162, -32220, -34146, -3960, 4504, -673, -22586, -13635, -7302, -25705, -33856, -41868, -52933, -67314, -25004, -6721, -2513, -8314, -17493, -32175, -19273, -13333, -38493, -48456, -39152, -23280, -22641, -14134, -2538, 9196, 2301, 25233, 5862, -4036, 27485, 36156, 25538, 21545, 34075, 46323]
17812D6323k3925l331J1784J1015J70M408k6098k5387J9874j8131J197J954k33
17799c80M220m583k183o349M720K4620J6649j4016J4731K5278k4827k7786k0215
17786a0121O701M479J8646K4814k415J4024J1686l4541k1734J9210L186n091j1012
17773A7832m21L680k982j5200J8025j0561l4352j3520K8137k201j3603K1702Q232
17760D768K1359L3141J5225j7917k7152j0763j3258j2164J257K6271j7320j1504
17748h057K4261k016j6686j0078K6473P908N458o576M626j680r17j0773M012L509
17734A9464N984l861p16J7097j0998k7707J038L2009R019o106J912j122K270L074
17720D1357l3890m3137p933J9479K2329J5458J9824j6358j5378o937K4322K8114
$$ y = [46323, 22398, 19067, 30851, 41866, 42036, 46444, 20346, -5041, 14833, -3298, -2101, -147, -380, 3840, -743, -2926, -9275, -4555, 20065, 36714, 22698, 37429, 62707, 37880, 10094, -10121, -3420, 1059, 19705, 44519, 42104, 56128, 67814, 33273, 11539, 30749, 33935, 28844, 17832, 17411, 21091, 18109, 2909, 20934, 10373, -23979, -37499, -9362, -11563, -25166, -3464, 4768, 26127, 59268, 74493, 56576, 29424, 18661, 5403, -6761, -5504, 20767, 3447, -8057, 16204, 14188, -2498, -12576, 13897, 21805, 27263, 20687, 25313, 23633, 22716, 11943, 15955, 19464, 25448, 21587, 20871, 37968, 26970, -737, 301, 32310, 41329, 35223, 37135, 36013, 38283, 41357, 7467, -35670, -43603, -24124, -1795, 13663, 33487, 17129, 1751, -5186, 19136, 47250]
17708D7250l0766l6895J6407J588J1789N571P735j4893k3524p911L3024J0392
17696A9767N18o788J306j6770K823l1528J654J220l228k698J9686J2367L1565
17683B9894P379j7725O984j5945j6909j24J1520L3184k418r469q224j5571J825
17670D401J2001K3803J8327o846j2299L0367n15L47j3451l3607O029l7471k9762
17657c8676J3206J5186m812J2388j9754M218J8699o641r133j2417K1094L01n336
17644a1677J4314P036j7101J719L6131L4213l62q273n2266j6176J9409L1238J6094
17631E4299l8517o6006J8779L1214J3881r695M53L7464K3604k3129k0619j4785
17619F943k393O183K1895J8005L930N660k3945L607j243j9600k2644j34K2515
$$ y = [47250, 16484, -20411, -4004, -2416, 9373, 14944, 22679, 7786, -15738, -23649, 9375, 19767, 20285, 13497, 14803, -1967, 856, -30672, -29018, -27798, -31026, -33724, -14038, -1671, 29894, 37273, 19548, 26532, 10587, -6322, -6446, 5074, 38258, 35840, 26371, 18147, 2576, 4401, 16402, 40205, 58532, 51686, 39387, 69754, 69239, 69586, 56135, 22528, 28557, -8914, -38676, -25470, -10284, -15096, -2708, -22462, -18244, 455, -6186, -15319, -27736, -6642, -6341, -11677, 2637, 9673, -7428, -5709, 30422, 64635, 64273, 56000, 3734, -12442, 6967, 38205, 54299, 15782, -50224, -31445, -231, 13650, 3955, 4408, 41872, 65476, 42347, 21728, 6943, 4550, 10733, 32628, 50633, 54563, 60223, 36278, 39885, 38642, 19042, -3602, -3736, 18779]
17606A8779K6009N523k1991K7441k754J0461l035k7908j6975q134n239R708l378
17593H507q462n21j5903K4061K3215K1326j4081m8106j3843J6173J5404l412n83
17580C775j4985o845J0881J4569K303j8415R490J789k0725J0664J8478J9570q979
17567B1570J7867R127j5056q791L1397Q853J140l0075M634J1688q487k917k0789
17554B0161J9578k4025k0850l554j736J5397J5952q11p93Q562Q907J033r014l1816
17540c009j7786j023J2140J005N147k115j7508J2328Q267R166Q942j1506J3199
17527A7247l817r567j5196L684j0162j2139J0528J9629K1567J4827j5876K117
17515B2842q23j9764p448K3715J6531j2373P877l3753j2276K4913K741k4188R881
$$ y = [18779, 44788, 50311, 28320, 55761, 53007, 63468, 60433, 32525, 15550, 7416, 2177, 11885, 8507, 45, -476, -16379, 7682, 30897, 52223, 38142, -9964, -23807, -7634, 7770, 4358, 3775, -11210, -18055, -7174, 7395, 9698, -8717, 773, 2562, -18163, -7499, 10979, 30549, 21570, 39437, 48564, 33508, 24717, 56114, 64967, 66107, 36032, 40666, 52354, 43867, 40950, 20161, 39739, 15714, -5136, -8690, -10426, 4971, 20923, 20112, 19319, 27881, 36788, 37821, 28807, -3009, -20795, -21818, -9678, -8673, -3526, -5641, -23149, -10821, -2554, 6612, 15554, 4048, 17247, 13430, 3863, -11333, -7649, -17811, -29950, -19422, 207, 21774, 36601, 20725, 22842, 22019, 2255, -5193, 18522, 35053, 22680, 30557, -3196, -15472, 9441, 12182, -12006, -2125]
17502b125K1918J661j3280k2806K105L2283J4549j6514J1468K740J0327k487j800
17489C8039J2518J6059k6014k6418J1468K3230m435n92l935M898j3348k2158N846
17476A5158M73L5080R249j8966q753r375k0440p721j0382n92K1036K39K0313m557
17462B0762N504r005K528R442l067k5430N961J331j3280k308M0029P330K3687
17449F3484J7796k0295o475j1649k5003J6315K0205j3974l111M131k043l861j1086
17436B4434j3631K274J2075k960O320k1939m373j8172L8625j7990k737O67K5291
17423B7884p4k2939J7798J5930k178K7850k6303l0185K1323R838o411J3933p490
17410C8976l2260K3454N1176r370L080j4896P441j1844j935J6856m387k6341q209
$$ y = [-2125, 19793, 21454, 8174, -14632, -12527, 19756, 34305, 17791, 29259, 31999, 42326, 39839, 38039, 50557, 66616, 40602, 14184, 25652, 48882, 44447, 43855, 39920, 44818, 31470, 9312, 15158, 15631, 50711, 59960, 40994, 32241, 22866, 2426, -5295, -15677, -16269, 4767, 5006, 25319, 20762, 26266, 17261, 19789, 29231, 26164, 734, 6695, 8026, -5254, -7562, 32467, 39797, 63484, 81280, 60985, 54510, 42861, 17858, 34173, 54378, 40404, 37293, 41424, 39381, 35520, 24434, 10803, 13077, 25152, 22192, 28512, 6573, 2200, -15972, 22653, 4663, 1926, 2593, 27884, 27810, 4871, 22669, 38599, 36421, 64271, 37968, 7783, 29106, 38944, 32533, 46466, 38976, 6716, 30170, 81346, 71976, 75056, 60160, 67601, 55757, 53822, 70678, 66291, 39950, 31741]
17397C1741P622M3672J4780k8935l6943K951J8490M083R234q521j4003j5034l5398
17384f261j4288J9489K1976L709P339J03q280L55O04K264J079O597l04o485N168
17369C3065J4060K915r699l467L0939j0153p039L5956K600R859j4832Q413J267
17356I3884l07m427n545l8356l3824J0351J6060p325k092k677k50r76j3238J3551
17342B4829J7704J9697Q817k6400j4672l0281o255K028K327J0488j413K847K4098
17329C3814J7108l155L883q098j2928L262n96q153j1365K429J0012J0864q025
17316B9052K6563R352k511l1968k4748j4542K6670J6210o343k9190J5564K4105
17304C8214J4311l228J2212o07n928K347L7168j3358j4686J2526p960k842K434
$$ y = [31741, 39363, 83035, 97815, 68880, 31937, 34888, 53378, 57461, 66695, 58174, 44171, 29137, -6261, -20549, -1060, 20916, 24625, 31964, 32067, 23787, 24142, 24746, 27010, 28089, 34686, 34382, 27897, 33065, 47125, 50040, 40341, 36874, 67813, 57660, 50621, 86577, 89177, 99036, 84204, 92617, 93884, 93577, 89150, 83605, 45249, 11425, 21776, 37836, 30511, 28419, 25742, 25492, 24516, 11278, 24829, 42533, 62230, 71047, 44647, 29975, -306, -6561, -4533, -2206, 8282, 6869, 9716, 33814, 50922, 47767, 51650, 43552, 30624, 33886, 33290, 25137, 13772, 16201, 26213, 37077, 29052, 55615, 64967, 62456, 30488, 5740, -8802, 17868, 34078, 27735, -1455, 14109, 38214, 52525, 49297, 61509, 60902, 54974, 57321, 94489, 81131, 66445, 78971, 71011, 68169, 70603]
17291G0603k4604m196p059l0975K240J7148p141R318J6592O860M054L833j466
17278E5207o131j999k9146m533L5288J4063J9587l888o2288l3469K1819L1556
17266C6066J2711p51k3837k1009L4055J0716m390j2103k357Q870j5897L511j4520
17253A1065J154O872O827Q534J0128J0828j2799k7918P148J9060O659m573j5840
17240B7145J2865J1122o896M230L076p91J4576j2859k4526R502J5931k3790k2654
17227F931R865Q759k5Q941j0130L680r558j9501L1214K3739L935J8571N901j906
17213H0416p503k9596l259j9169r014K5064K7110m77k1050J4924J4658j7940l2448
17200B1716J9043J0056J1563J1508K1259k1580l1415K309K2245q902k2059j014
$$ y = [70603, 45999, 41803, 34744, 3769, 6009, 23157, 16016, 25334, 41926, 48786, 52840, 56673, 55207, 49076, 47077, 17931, 13398, 48686, 62749, 82336, 78448, 16160, -17309, 4510, 36066, 48777, 48026, 24189, 3180, 37235, 47951, 43561, 31458, 29101, 37971, 22074, 25585, 11065, 12219, 19091, 25918, 34452, 44580, 55408, 42609, 14691, 21839, 40899, 47558, 42985, 27145, 40010, 51132, 44236, 48466, 51542, 50751, 65327, 52468, 27942, 37444, 53375, 29585, 6931, 16796, 25555, 25530, 34471, 24341, 28021, 18463, -1038, 30176, 53915, 57850, 76421, 82322, 80416, 72913, 43317, 40058, 20889, 11875, 36939, 64049, 63572, 42522, 57446, 72104, 54164, 21716, 40759, 50815, 62378, 73886, 95145, 73565, 42150, 44459, 66704, 57802, 35743, 34729]
17188C4729q259J7607L7468j8771j0500j2976p782j3620M989J8023R836O973j4385
17175D3332j1909J1342K6717J6960j8219j2272k4461J7034K7460l736l387k3334
17163D5527j1153l743M1285L4122r426o81j1177k6869J7522K7857J8389P666k019
17150A27300q497j7990L365j6936K606J5078k5800j5394j8015L755J3605J9952
17138H3029j340k6698j7168k7964J1382J3742K7005J2690j0007J5880j923k0925
17126E7703O3J9488L9861o602j1854m357n172k2343Q334J0517n923q507j9307
17113E1901j3593K1571l946j6697O802J9114M989q65K4506P636O245k4698j8063
17100F4902N214K6201n460O657m137l7325P827J2921R683J3938P993N249P596
$$ y = [34729, 26470, 44077, 81545, 62774, 52274, 39298, 31516, 17896, 22885, 40908, 50744, 57717, 43332, 31423, 42765, 69482, 86442, 68223, 55951, 31490, 48524, 75984, 72248, 68861, 45527, 34374, 30631, 71916, 106038, 96612, 95931, 84754, 57885, 75407, 103264, 121653, 129319, 127300, 118803, 100813, 104178, 87242, 89848, 104926, 79126, 63732, 45717, 49472, 63077, 83029, 81689, 54991, 37823, 9859, 21241, 34983, 61988, 74678, 64671, 80551, 78628, 57703, 57766, 77254, 117115, 110513, 98659, 94302, 89130, 66787, 75121, 85638, 79715, 71208, 51901, 38308, 59879, 55933, 39236, 46038, 65152, 70141, 69276, 93782, 101418, 107663, 82965, 64902, 70116, 96317, 90857, 97514, 93377, 56052, 63879, 76800, 86483, 100421, 108414, 113663, 121259]
17087A21259o366J0283o639J494j0939j0498j2039m0827K1025M2327o995j3165
17075H8920j3761j2564k369K5960N315J0418J2464j824k2076k7355l956L2679
17063I1851J4329j7053o052l460j128K8706j3084k4546J445k9726j1156m714L2785
17050E8197L9125J6587J7410Q464j4498k6131j5307K5836P806o622k7966o630
17038G6271m837K7047M1046M752l1479j0612R317p61J2286J649n946n615J1670
17025A24788J7427P828n3346m0793M633K0372J7558Q030Q138o668j1509P040O956
17012A10454j2663K1779k306J2044P191j1294J2848K3991J6272j9955j9751P699
17000A46309r291J3628O186m161k1681n657j5002k3555N654J3495k570k904l806
$$ y = [121259, 114893, 125176, 118537, 120031, 109092, 98594, 86555, 45728, 66753, 109080, 102085, 88920, 75159, 62595, 60226, 86186, 91501, 101919, 114383, 112559, 90483, 63128, 59172, 91851, 106180, 89127, 83075, 79615, 78487, 107193, 94109, 69563, 71008, 41282, 30126, 25412, 58197, 97322, 113909, 131319, 139783, 125285, 99154, 83847, 109683, 117489, 110867, 82901, 76271, 71434, 98481, 139527, 144279, 112800, 102188, 111505, 110744, 123030, 124679, 118733, 113118, 124788, 142215, 150043, 96697, 55904, 60537, 80909, 98467, 106497, 114635, 107967, 96458, 103498, 110454, 97791, 119570, 117264, 129308, 136499, 125205, 138053, 162044, 178316, 158361, 138610, 146309, 137018, 150646, 156832, 152671, 130990, 125333, 110331, 86776, 92430, 105925, 103355, 100451, 96645]
16987I6645N890J1999j4474k1752O973Q995J042K5939J1146j2296k2066N420J6347
16974A19808O082l678M516K211K4881J6913l0522j017o873j5711k4887p942j027
16961H2754J9469K2910J2492J0103J5164m21j2513j9566P375R195O22r14k881
16948A43789j5409k0687O665j7624K3653M3899J2567j572Q892J2810k275l5687
16936A59021k2625J2294J0126l46J1111q59j4150r455n78j3899K7921j1732l008
16923A43821p02J7541P380J310J480R650J1098R386j0635l764K0027J0393r660
16910B07325k2495K984N733J0489K4240j8388Q433j586l7476J661P833o559J5328
16897A97522K1446p720j5659j94k450J4296M081J686L8928R467l586l0797j703
$$ y = [96645, 102535, 114534, 100060, 78308, 85281, 94276, 95318, 121257, 132403, 120107, 98041, 103461, 119808, 125890, 122212, 126728, 128939, 153820, 170733, 140211, 139194, 132321, 116610, 91723, 83781, 82754, 102223, 125133, 137625, 147728, 162892, 162471, 149958, 130392, 137767, 146962, 147584, 146670, 143789, 128380, 107693, 114358, 96734, 120387, 164286, 176853, 175281, 184173, 196983, 194708, 159021, 136396, 148690, 158816, 158470, 169581, 168722, 154572, 145117, 144539, 130640, 158561, 146829, 143821, 143119, 160660, 168040, 169350, 170830, 180480, 191578, 200964, 190329, 186565, 206592, 216985, 207325, 184830, 187814, 193547, 204036, 228276, 209888, 218321, 216735, 179259, 180920, 188753, 182194, 197522, 218968, 211248, 195589, 195395, 192945, 207241, 211322, 213008, 251936, 261403, 257817, 227020, 225317]
16884B25317m140J6446J7491k9528N024L639o085j5470J1504K6099N479q307r110
16871B38359R583q152l306J90O972J3307J3788L9001K6121K0795q777j5824K0091
16858C52148M4403P3910K7619l676l3800n8433q3047m1687K1624K2078J3443J5244
16846C49826j0110p207p823k7408j5802o359L1110K556N140l986r05N582J5437
16833C30051p33j4911L2197N368r205j5724J6436N2694M7640L7609K7503N9626
16821E68551J10655J41152R9361m5565j42205j14371o3870m1347o0840k4261Q590
16810D35850j4623m0982o921k355J2214J0963m764k4694K098M1397N015L622R725
16797D26545L9869r495k6501j3818m779J8926R526K2200N4633j3885k131M7949
$$ y = [225317, 221177, 237623, 255114, 225586, 230610, 234249, 228164, 212694, 224198, 250297, 255776, 247469, 238359, 247942, 239790, 236484, 236674, 243646, 256953, 270741, 309742, 335863, 356658, 347881, 332057, 352148, 396551, 470461, 498080, 494404, 460604, 402171, 319124, 277437, 299061, 321139, 334582, 349826, 339716, 332509, 324686, 297278, 281476, 275117, 306227, 308783, 313923, 309937, 309032, 314614, 330051, 329318, 314407, 346604, 351972, 342767, 327043, 343479, 396173, 443813, 481422, 508925, 568551, 679206, 820358, 919719, 874154, 731949, 617578, 553708, 512361, 451521, 427260, 435850, 421227, 380245, 373324, 370969, 383183, 394146, 389382, 364688, 366786, 408183, 413198, 416820, 426545, 466414, 456919, 430418, 416600, 411821, 430747, 440273, 462473, 517106, 503221, 501090, 549039]
16785E49039O8058O5321M4010o818p0100k9463m0132l7330m6904n623N009K4896
16773E19963J3344p236j1148q579k9855l0009O439L0277J9997k416j0553j2776
16761D77448N793j6075J8266K7533J5382J7334K4909k8140m0530j8460n910r581
16749D67969J7500m242J8179j4415k0112R590L1807M8365m243R478P736P164L9321
16736F14097k0149m7113N946K7141K0560N921j9005J3549J1219k407j3221L3988
16724F30526k0089r769K1433J2928j332J1530L0635J7177r08k8475j6296J1032
16712F58392K2856J2261O677M016M4627Q294j088K3913K5272N4063K5507J020
16700H85810J2429O989M7635M823p383M736K5644L2600j0240j4117K7383K0710
$$ y = [549039, 617097, 682418, 726428, 719610, 649510, 620047, 579915, 542585, 495681, 490058, 495067, 519963, 533307, 526071, 514923, 506344, 476489, 446480, 452919, 483196, 503193, 500777, 490224, 477448, 483241, 467166, 485432, 512965, 528347, 545681, 570590, 542450, 501920, 483460, 477550, 467969, 485469, 481227, 499406, 484991, 464879, 474469, 506276, 554641, 550398, 559876, 567612, 574776, 614097, 593948, 546835, 552781, 579922, 600482, 606403, 587398, 600947, 612166, 609759, 596538, 630526, 610437, 600668, 622101, 635029, 633697, 645227, 675862, 693039, 692131, 663656, 647360, 658392, 681248, 693509, 700186, 704202, 748829, 757123, 756035, 779948, 805220, 859283, 884790, 885810, 898239, 905228, 952863, 957686, 950303, 955039, 980683, 1013283, 1003043, 988926, 1016309, 1037019]
16688A037019J5732K8170j7888J2626K6100J6786N1039K2926k2564m586k542L5446
16676A198264K6271Q835J6909K5778K9233K3867N3707L8124K1721L9890K0671
16665A503270K7400Q828L6556K1912O0742O7976N8830N4230L3139N1956O2426
16654A987265L7339K5835K6127M3812K4232K4975L8935K8012O4356M5141l692
16643B342337J8808O0542O2543P7765M7469K7232N3995Q0295O4590K5120N2608
16632B913304O4227O5991Q5132J00627P5992Q1438Q6787J30513J06473J25820
16622C836304J21610J09586J10187J30459J43108J25452J31633J32276J39696
16613D980311J49913K01743K15499J95117K11908J91009K19924K86965K64335
$$ y = [1037019, 1052751, 1080921, 1063033, 1075659, 1101759, 1118545, 1169584, 1192510, 1169946, 1165360, 1162818, 1198264, 1224535, 1233370, 1250279, 1276057, 1305290, 1329157, 1382864, 1420988, 1442709, 1482599, 1503270, 1530670, 1539498, 1576054, 1597966, 1658708, 1726684, 1785514, 1839744, 1872883, 1924839, 1987265, 2024604, 2050439, 2076566, 2120378, 2144610, 2169585, 2208520, 2236532, 2300888, 2346029, 2342337, 2361145, 2421687, 2484230, 2561995, 2609464, 2636696, 2690691, 2770986, 2835576, 2860696, 2913304, 2977531, 3043522, 3128654, 3229281, 3305273, 3386711, 3473498, 3604011, 3710484, 3836304, 3957914, 4067500, 4177687, 4308146, 4451254, 4576706, 4708339, 4840615, 4980311, 5130224, 5331967, 5547466, 5742583, 5954491, 6145500, 6365424, 6652389, 6916724]
16604F916724K68180K90633L30884L16090L46560L91821M07310M45272M72140
16595A0185614N04840N79410O17236O66735O93515P74854Q54788R31376R86567
16586A6794935J054576J171387J237098J307657J426254J516914J587329J669427
16578B7765577J708621J683819J651160J573420J431337J249329J011167P90683
16570C8865113M78883J80751o3308l00887n08376o38157p02621p10057o69048
16561C5932293o16064n43431m35092k92015j36399K2861J97047L89772N81812
16552C5100784P74578R75019J172046J391733J614188J831851K053920K263196
16544D7177315K474624K675890K772772K814739K776084K689919K473336K173209
$$ y = [6916724, 7184904, 7475537, 7806421, 8122511, 8469071, 8860892, 9268202, 9713474, 10185614, 10690454, 11269864, 11887100, 12553835, 13247350, 14022204, 14876992, 15808368, 16794935, 17849511, 19020898, 20257996, 21565653, 22991907, 24508821, 26096150, 27765577, 29474198, 31158017, 32809177, 34382597, 35813934, 37063263, 38074430, 38865113, 39343996, 39524747, 39461439, 39160552, 38652176, 38014019, 37311398, 36601341, 35932293, 35316229, 34772798, 34337706, 34045691, 33909292, 33932153, 34129200, 34518972, 35100784, 35875362, 36850381, 38022427, 39414160, 41028348, 42860199, 44914119, 47177315, 49651939, 52327829, 55100601, 57915340, 60691424, 63381343, 65854679, 68027888]
16536F8027888J687821J124814N04354j14497p48059j337501j852122k257250
16528F5035448k551095k695004k745858k744483k626643k519413k349863k162930
16520D4640159j978653j777352j526231j313989j076848q58883o62263m98616
16512C4947324k85165j00795M9578K58465L64641N17568O40013P21616P59837
16503C7873082P70876P57112O41767M61227J85310m1259l11598n96941q94865
16494C8844711j141743j390694j563797j651398j690984j732413j728584j656823
16486B6288275j549457j509328j433935j345838j266251j152907j069918r90693
16478A5969948r45753q68440p70811p55704o73685o17863n74696n41604n19458
$$ y = [68027888, 69715709, 70840523, 71344877, 71230380, 70482321, 69144820, 67292698, 65035448, 62484353, 59789349, 57043491, 54299008, 51672365, 49152952, 46803089, 44640159, 42661506, 40884154, 39357923, 38043934, 36967086, 36108203, 35445940, 34947324, 34662159, 34561364, 34610942, 34869407, 35234048, 35751616, 36391629, 37113245, 37873082, 38643958, 39401070, 40042837, 40504064, 40689374, 40648115, 40336517, 39739576, 38844711, 37702968, 36312274, 34748477, 33097079, 31406095, 29673682, 27945098, 26288275, 24738818, 23229490, 21795555, 20449717, 19183466, 18030559, 16960641, 15969948, 15024195, 14155755, 13384944, 12629240, 11955555, 11337692, 10762996, 10221392, 9701934]
16469I701934m88044m41471l85602l65100l43026l53853l30849k84929k54142
16460F454918k37712k37056k14336k17857k34826k01038j80848j70018j60552
16451D600675j65322j33648j16470j21205j31873j47951j12920r6692r7413q5257
16441C391924q2343q4591n1279p1518o0527o4185p8295q8192q8591n6283n5299
16430B610821m8673p6645p4374n7993o5769m6263m1729m6841o0876o7130m9563
16419A974965o3432p4931p0877m2102j3353L269k1877l8235R817K965j391k0783
16407A644035k3304o0590k7499l029k0808k2669j5469j9258j4383J6225K4402
16396A477653j3009k0137p4094j9639R923l6572n1748qN964k0055k0660k3917
$$ y = [9701934, 9213890, 8772419, 8386817, 8021717, 7678691, 7324838, 6993989, 6709060, 6454918, 6217206, 5980150, 5765814, 5547957, 5313131, 5112093, 4931245, 4761227, 4600675, 4435353, 4301705, 4185235, 4064030, 3932157, 3784206, 3671286, 3574594, 3477181, 3391924, 3309581, 3224990, 3173711, 3102193, 3041666, 2977481, 2899186, 2810994, 2722403, 2666120, 2610821, 2562148, 2485503, 2411129, 2353136, 2287367, 2241104, 2199375, 2152534, 2091658, 2024528, 1974965, 1911533, 1836602, 1765725, 1723623, 1710270, 1713539, 1691662, 1653427, 1663244, 1666209, 1664818, 1644035, 1620731, 1560141, 1532642, 1529613, 1508805, 1486136, 1470667, 1451409, 1437026, 1453251, 1477653, 1464644, 1444507, 1370413, 1350774, 1360697, 1324125, 1272377, 1272369, 1278333, 1258278, 1237618, 1213701]
16384A213701l3508m2440j2362k501k986q417j2320p83l3524l6779r583R870o877
16371A021491k9036n245J2565K4887j9715m4333J5255j899R80M220j5382j5073
16359I48715k6559j8898j3291j8541J027M053J1601n466k3948j603K6022l913
16347H79199k3245k5308m387n4l2393J0930j6651k1155j8837j871J938l622j5457
16334G29087l341L483l4411j8470K8837M8425j0729n8279j6592K4432n626j2301
16322F74515K9795r194k6573k8667j4417J9257J2111N39q233J333j2287l2545
16310F05634n652K89q679J9915L863l1306k2099R442K2371k1064r603k8343k6096
16297E08672L12Q009J9193L2210j6579j2407R409J2367K0076K4324K5717N1060
$$ y = [1213701, 1180193, 1137753, 1125391, 1122890, 1119904, 1111487, 1099167, 1098384, 1064860, 1028081, 1018498, 1028368, 1021491, 992455, 987210, 999775, 1024662, 1004947, 960614, 975869, 973970, 974950, 979170, 963788, 948715, 922156, 903258, 889967, 871426, 872453, 876506, 888107, 882641, 858693, 857090, 883112, 879199, 855954, 830646, 826259, 826205, 793812, 804742, 788091, 766936, 748099, 746228, 748166, 744544, 729087, 725746, 729229, 694818, 676348, 705185, 753610, 742881, 684602, 668010, 692442, 686816, 674515, 704310, 695116, 668543, 639876, 625459, 644716, 656827, 657366, 649133, 650466, 638179, 605634, 599982, 600271, 591592, 611507, 615370, 584064, 561965, 571407, 593778, 572714, 563111, 534768, 508672, 508984, 516993, 536186, 568396, 551817, 539410, 548819, 561186, 581262, 605586, 631303, 682363]
16285F82363O9526M6572l4464q6620p3682l4631m0400m4923m0600K1598J2087
16274D76826j6327k6933J022M0302P916J565m1207l7050K3243J5865P190J4881
16262D67293L381k3216j7508M297J7221K6226p299J7790q003Q891M7290M3015
16250E79378Q0294J62174J57177L2094j21474j33695j03960p2788m8258m5887
16240D85055k6023m2282m8054J0500K5977J0312J8308n380k8603m9139j218L2756
16228C82209P327L493O659k2051k1518L1926j754l5352p074J1084J6945K4765
16216C96659L685k34J9068N9815P4590N3445l2302o6577l7271k539n8719n1244
16204C58376j7010K7829K172k1822k907J5866M705j0420l8147m916K1201J0440
$$ y = [682363, 751889, 798461, 763997, 677377, 603695, 569064, 528664, 483741, 443141, 464739, 476826, 460499, 433566, 434588, 474890, 482806, 484371, 443164, 406114, 429357, 445222, 452412, 467293, 470674, 447458, 429950, 434247, 451468, 477694, 470395, 488185, 480182, 489073, 536363, 579378, 659672, 821846, 979023, 1011117, 889643, 755948, 651988, 579200, 530942, 485055, 459032, 416750, 368696, 379196, 405173, 415485, 433793, 428413, 399810, 350671, 349453, 382209, 389536, 393029, 399688, 377637, 356119, 388045, 386291, 350939, 343865, 354949, 371894, 396659, 400344, 400110, 419178, 478993, 553583, 607028, 574726, 508149, 470878, 468339, 409620, 358376, 341366, 369195, 371367, 349545, 346638, 362504, 367209, 356789, 318642, 313726, 334927, 345367]
16192C45367J470N363K966j9730j3205j0462k7559N243K3828J0163j546j5453
16180C06445p790J6668K7958J1740p030j7874K1505J963q759J90N631k402j7090
16167C31155k5698j6788M10K5323j3359n403N10p787J3737J5280K1245J072m595
16154C35102J1294l1388k3430R616R737k727j3717k303j2051K6055N091k1770
16142B89509J4911N885k0084j1824k002K2378K3879m518l8435j8863m940J5580
16130B71476L4736m524j3223Q991J8789j5214k6201R944J7019L1550r617l7307
16118B86419j3652Q59P49K6016J822j9247k69j102L021m835P30k0763L214O283
16104B69245q385l50J8172M428J3547L545j7595j0769n236j8536J1189j1419Q906
$$ y = [345367, 346837, 352200, 355166, 335436, 322231, 311769, 284210, 289453, 313281, 323444, 321898, 306445, 298655, 315323, 343281, 355021, 347991, 330117, 351622, 353585, 344826, 345016, 350647, 348245, 331155, 305457, 288669, 289079, 314402, 301043, 295640, 296150, 288363, 302100, 317380, 338625, 339697, 335102, 346396, 315008, 291578, 301194, 310931, 308204, 294487, 292184, 280133, 306188, 311279, 289509, 304420, 310305, 290221, 278397, 276395, 298773, 322652, 318134, 279699, 260836, 255896, 271476, 306212, 301688, 288465, 297456, 316245, 301031, 274830, 284774, 301793, 333343, 323726, 286419, 272767, 273626, 274375, 300391, 302213, 282966, 282697, 281595, 284616, 279781, 280511, 259748, 262962, 269245, 260860, 260510, 278682, 283110, 296657, 300202, 282607, 271838, 266602, 248066, 259255, 247836, 256742]
16091B56742K4595Q671J5470J3951m525j8835q320J2279K816q98m477l5363P736
16078B69842n476M570J8224J2090N928J9131o507q530J3035J4546j2429j8984
16066C05440K5339k293l047l751p102J3117R057j5086j1341M173m5549m1348J4605
16053B42214P745J8856k186j5629K4706O502l0148k776J1409j0168K5612J5106
16041B91243j6485j1836R79J0368R642K0827J4347j4256p297p341j0224M513Q726
16028B93206r875P401K7413R307l216l157N265q270j6154n455K9064K285q958
16015C18856k3966j2849J1754J0751J7765n067K3536J1438k2106Q022N283J8473
16003C61890J0609O952k2767k1872j7787L073k128o154M143p772L400Q392L672
$$ y = [256742, 281337, 290008, 305478, 319429, 314904, 296069, 287749, 300028, 302844, 301946, 297469, 262106, 269842, 264366, 268936, 287160, 299250, 305178, 324309, 317802, 309272, 322307, 336853, 324424, 305440, 330779, 328486, 325439, 321688, 314586, 327703, 336760, 321674, 310333, 314506, 268957, 227609, 242214, 249959, 268815, 266629, 251000, 275706, 282208, 252060, 249284, 260693, 250525, 276137, 291243, 274758, 262922, 263901, 274269, 283911, 304738, 319085, 304829, 297532, 290191, 279967, 284480, 293206, 283331, 290732, 318145, 327452, 324236, 321079, 326344, 318074, 301920, 296465, 325529, 327814, 318856, 294890, 282041, 293795, 304546, 322311, 317244, 340780, 352218, 330112, 338134, 343417, 361890, 372499, 379451, 356684, 334812, 317025, 320098, 317970, 311816, 315959, 308187, 311587, 319979, 323651]
15990C23651K0054j1582k2450j1978k598J0236K3020k3073k046o024k2597J1415
15978B86028j477L5658Q530J7913L399l8415j2859R430j1409J0528Q139O891M167
15965C26523J2828m983J6644K0861K2271o436l0484n908k73J4241l486O798O966
15952C75562R799M97l195n97P262R411j2344o77n943k696J2163J6623l891j0545
15938C91429j6239J7625L270j3084k7294M63N7973j0188o235K2678J4837j803
15926D33432j5780j7685J845l670M647J4112J4239J0718j7110l6849m5697n957
15914C36245K9901P834J6671N575R518n465p462J6793P529o387l1304R075J4663
15901D03186J0783N3740J8420r356r831j3355l0620k1046R028K7279L725j1844
$$ y = [323651, 343705, 332123, 309673, 297695, 295097, 305333, 328353, 305280, 303234, 297210, 274613, 286028, 284551, 320209, 328739, 346652, 350051, 311636, 298777, 308207, 296798, 307326, 315465, 322356, 326523, 339351, 334368, 351012, 371873, 394144, 387708, 357224, 351316, 351043, 365284, 361798, 368596, 375562, 385361, 385858, 382663, 382066, 389328, 398739, 386395, 385718, 379775, 377079, 389242, 405865, 401974, 391429, 375190, 392815, 396085, 383001, 355707, 356170, 414143, 403955, 397720, 420398, 435235, 433432, 417652, 399967, 401812, 398142, 402789, 416901, 431140, 441858, 424748, 387899, 342202, 336245, 366146, 373980, 390651, 396226, 405744, 400279, 392817, 409610, 417139, 410752, 379448, 388523, 403186, 413969, 467709, 486129, 476773, 466942, 453587, 422967, 401921, 410949, 438228, 441953, 430109]
15889D30109J3504J383P437L1759R570n007o165l683k2303N65J8595J5226K4506
15876E15496L415k6887j453J1323K7931m171J919J7525n194q840p208j149J1586
15863E34293K6945j5713l2510J5065l75J7908j0093l0370j7018N691N250J8989
15851E18062j498Q860j2189N075J1743J4998k924j4763K337J6688K6048J5992
15839E88429k102J6823J7163o369J580j2194J59R850M524M736Q808k0047M25j0434
15825F01351J7890j226M484M2725L4378r089K202q371o941K2504J4200L0672K2038
15812G66817p321k0010k680J5905J0094J6872J2864j0771n593K371j0121j804
15800G66623L935Q964m127J3466J6413j1402q627j1246J1320K4896L4635R893
$$ y = [430109, 443613, 444996, 452433, 484192, 493762, 488755, 482590, 478907, 456604, 457169, 475764, 490990, 515496, 518911, 492024, 490571, 501894, 529825, 525654, 527573, 545098, 539904, 531064, 523856, 522707, 534293, 561238, 545525, 513015, 528080, 527705, 545613, 535520, 505150, 488132, 493823, 499073, 518062, 516564, 525424, 513235, 518310, 530053, 545051, 542127, 527364, 529701, 546389, 572437, 588429, 586327, 603150, 620313, 613944, 615524, 603330, 603489, 613339, 617863, 622599, 631407, 611360, 611785, 601351, 619241, 618015, 622499, 665224, 699602, 690513, 692715, 684344, 677403, 699907, 714107, 744779, 766817, 759496, 739486, 736806, 752711, 762805, 779677, 792541, 781770, 776177, 778548, 768427, 766623, 770558, 779522, 775395, 788861, 805274, 793872, 785245, 773999, 785319, 810215, 844850, 854743]
15788H54743L4625L2757j3009j7255J9540K9331J8727k849J8799N1401O7842N9132
15776A153784J7508N7636R3564J45812J85173K19781K63867K72989J05285r0750
15766B424649j90009k44148k18260j78776j13917p8909p0277n1142l8909n245
15756A235057k0787k3757j3570J9381k377l885j3992J4460L9972J1278p880k69
15744A233631k3635J0031P315p478J5274K3732j6034j1472j7416L737j5355N106
15732A207436K0860K1192R849J0785o945J716k1546J3482K2293l1195k8262P285
15720A226950K2311Q393K5226L9967NJ1087Q418j2378K914J6962j1190K1894L2439
15707A392998K1358K155K5596j3375m259Q630n510j3403Q350Q108L0572O1609
$$ y = [854743, 889368, 922125, 909116, 891861, 911401, 940732, 959459, 956610, 975409, 1026810, 1094652, 1153784, 1171292, 1228928, 1322492, 1468304, 1653477, 1873258, 2137125, 2410114, 2515399, 2424649, 2234640, 1990492, 1772232, 1593456, 1479539, 1400630, 1330353, 1279211, 1240302, 1235057, 1214270, 1190513, 1176943, 1196324, 1193947, 1190062, 1176070, 1190530, 1230502, 1241780, 1233900, 1233631, 1209996, 1220027, 1227342, 1219864, 1235138, 1258870, 1242836, 1231364, 1213948, 1217685, 1202330, 1207436, 1228296, 1249488, 1259337, 1270122, 1263177, 1264893, 1243347, 1256829, 1279122, 1247927, 1219665, 1226950, 1249261, 1257654, 1282880, 1322847, 1322852, 1333939, 1342357, 1329979, 1332893, 1349855, 1338665, 1360559, 1392998, 1414356, 1416511, 1442107, 1428732, 1424473, 1433103, 1427593, 1414190, 1422540, 1430648, 1461220, 1522829]
15695A522829J3415r431Q995J8765L1397K0486K4370K4625K1220K944R127r692
15683A679050k565J0553L7831M8686j732q580M0339L3990L4526N8759R096j8521
15671A921432p603M0626N0366K1131J2820J9918M9421J8254J7118K7559J3210
15660B184252L4780J5696K0981M8766M4522L2740q504L3823K1843M7892L7537
15649B514328M9622M2080K6715K2028N1238L8687L4371L4312L5133l14L9842M8874
15637B936916P1991P5527P7433P1335L7576M3053M8505M8129N8284J06910J00078
15626C675737M8275Q9458J00863Q0945R1057Q0498J00984J05882J03770P7285
15616D554754P4937Q5412Q7762R1044Q3376J02491Q5968Q7693Q7651Q4567P0493
$$ y = [1522829, 1536244, 1526813, 1535808, 1554573, 1585970, 1606456, 1630826, 1655451, 1676671, 1679615, 1688742, 1679050, 1676485, 1687038, 1724869, 1773555, 1771823, 1763243, 1803582, 1837572, 1872098, 1930857, 1939953, 1921432, 1913829, 1954455, 2004821, 2025952, 2038772, 2058690, 2108111, 2126365, 2143483, 2171042, 2184252, 2219032, 2234728, 2255709, 2304475, 2348997, 2381737, 2373233, 2407056, 2428899, 2476791, 2514328, 2563950, 2606030, 2632745, 2654773, 2706011, 2744698, 2779069, 2813381, 2848514, 2848200, 2888042, 2936916, 3008907, 3084434, 3161867, 3233202, 3270778, 3313831, 3362336, 3410465, 3468749, 3575659, 3675737, 3724012, 3813470, 3914333, 3995278, 4086335, 4166833, 4267817, 4373699, 4477469, 4554754, 4629691, 4715103, 4802865, 4893909, 4977285, 5079776, 5165744, 5253437, 5341088, 5425655, 5496148]
15605E496148P6251Q3845J09321R1557J03787J04778P3602Q4247R9606J27946
15595F451088J29155R8796Q7210J42532J44363J39683J39130J13620J30308J50928
15585G726813J63395J57078J29075J45691J89703K06640J90832J77422J85075
15576I271724K09288K16844J95088J92105K24772K60793K94695K76374K58578
15567A1400261K60689K92508K95670L03527L24928L35907L46965L57697L85557
15558A4303709L97837M16072M51908M33318M81005N07063N01288N38567N63552
15549A8594319O03131O47457P01592O95166P04336P48031P83440Q23340Q80152
15540B5180964R12247R59090J004911J074784J128882J186315J264201J368083
$$ y = [5496148, 5572399, 5656244, 5765565, 5857122, 5960909, 6065687, 6139289, 6223536, 6323142, 6451088, 6580243, 6679039, 6766249, 6908781, 7053144, 7192827, 7331957, 7445577, 7575885, 7726813, 7890208, 8047286, 8176361, 8322052, 8511755, 8718395, 8909227, 9086649, 9271724, 9481012, 9697856, 9892944, 10085049, 10309821, 10570614, 10865309, 11141683, 11400261, 11660950, 11953458, 12249128, 12552655, 12877583, 13213490, 13560455, 13918152, 14303709, 14701546, 15117618, 15569526, 16002844, 16483849, 16990912, 17492200, 18030767, 18594319, 19197450, 19844907, 20546499, 21241665, 21946001, 22694032, 23477472, 24300812, 25180964, 26093211, 27052301, 28057212, 29131996, 30260878, 31447193, 32711394, 34079477]
15532C4079477J439807J496385J590231J680750J759090J879872J993094K132511
15524D8051217K259185K367768K532632K708175K894430L054907L242039L428418
15516G0538771L650289L877126M089699M302740M527783M774341M988983N197072
15508A05946804N386113N578142N723594N772686N788790N752671N646614N457120
15500A51052534N186805M751783M212606L542988K841814K024609J194266K64776
15492A75072181o24314j463520k296413l105924l787166m361028m802517n138999
15484A49492300n438804n645727n724917n719007n683888n584156n457296n321673
15476A04916832n111008m884190m667412m468404m215126m015266l795422l583232
$$ y = [34079477, 35519284, 37015669, 38605900, 40286650, 42045740, 43925612, 45918706, 48051217, 50310402, 52678170, 55210802, 57918977, 60813407, 63868314, 67110353, 70538771, 74189060, 78066186, 82155885, 86458625, 90986408, 95760749, 100749732, 105946804, 111332917, 116911059, 122634653, 128407339, 134196129, 139948800, 145595414, 151052534, 156239339, 160991122, 165203728, 168746716, 171588530, 173613139, 174807405, 175072181, 174447867, 172984347, 170687934, 167582010, 163794844, 159433816, 154631299, 149492300, 144053496, 138407769, 132682852, 126963845, 121279957, 115695801, 110238505, 104916832, 99805824, 94921634, 90254222, 85785818, 81570692, 77555426, 73760004, 70176772]
15468G0176772l379928l189888l002855k826078k712836k553814k376284k261979
15460D7873110k139404j978923j870570j755852j667127j577536j530377j422488
15452C3930833j321101j271186j211789j117372j039404j021028r63077r21872
15444B5064004q78324q48158p97585p56259p25983o69623o50073o08820n88140
15435A8541039n97344n80738n10529n18965n01134m75973m43442m23677m16477
15426A4072760l80964l46782l78118l73754l47530k96660k78502k78558k79894
15417A1111998k80768k72450k82409k69499k32152k37304k07252k45702k16896
15408H867566k11595k06485j67443j88041j78621j63886j71500k09829j55731
$$ y = [70176772, 66796844, 63606956, 60604101, 57778023, 55065187, 52511373, 50135089, 47873110, 45733706, 43754783, 41884213, 40128361, 38461234, 36883698, 35353321, 33930833, 32609732, 31338546, 30126757, 29009385, 27969981, 26948953, 25985876, 25064004, 24185680, 23337522, 22539937, 21783678, 21057695, 20388072, 19737999, 19129179, 18541039, 17943695, 17362957, 16852428, 16333463, 15832329, 15356356, 14912914, 14489237, 14072760, 13691796, 13345014, 12966896, 12593142, 12245612, 11948952, 11670450, 11391892, 11111998, 10831230, 10558780, 10276371, 10006872, 9774720, 9537416, 9330164, 9084462, 8867566, 8655971, 8449486, 8282043, 8094002, 7915381, 7751495, 7579995, 7370166, 7214435]
15399G214435j21377j49230j61611j50032j29541j27784j42453j05903q8741j48389
15389E889374j41327q6161j13075j16127j02867j01606j05529j32460p5286r2398
15379D822538r7404q6076p0967r9808j04670n3407m8284m1567n2064p1783o5569
15368D030939m1122j7105j3971m8856o2058l3905K563P26l7177n1663j5906k7222
15356C685243m5633j8142k7189l2816o2653k4375k0421l4449m3532m4419k7937
15345C303677j9702n1703l8291m1338l8163l9773l6966n7605n2260j2648m2144
15334B873084m3418q575n8434m3770M312j4791n6149o7017j4362r155k4601k2246
15322B514878l7793l4710l2210j729M380l5813l8389k6704j7010j8553j5391k2312
$$ y = [7214435, 7093058, 6943828, 6782217, 6632185, 6502644, 6374860, 6232407, 6126504, 6037763, 5889374, 5748047, 5661886, 5548811, 5432684, 5329817, 5228211, 5122682, 4990222, 4914936, 4822538, 4725134, 4639058, 4568091, 4468283, 4363613, 4310206, 4261922, 4220355, 4168291, 4096508, 4030939, 3989817, 3972712, 3958741, 3909885, 3847827, 3813922, 3816485, 3817211, 3780034, 3728371, 3712465, 3685243, 3639610, 3621468, 3594279, 3561463, 3498810, 3474435, 3454014, 3419565, 3376033, 3331614, 3303677, 3283975, 3232272, 3193981, 3152643, 3114480, 3074707, 3037741, 2980136, 2927876, 2915228, 2873084, 2829666, 2821091, 2762657, 2718887, 2723199, 2708408, 2652259, 2585242, 2570880, 2561725, 2537124, 2514878, 2477085, 2442375, 2410165, 2408436, 2412816, 2377003, 2338614, 2311910, 2294900, 2276347, 2260956, 2238644]
15310B238644l5636J249o731n4631k0150j4959m0334l2380l809k9984k1210l7153
15298A942916j2621p13j9161l4192N813k7061l2974j4829l2652q141j0829l1171
15286A724385J7294L331J1588j3173n3115l2421k8334l0335j1473j4653j6995
15275A556099k7931P204J1518m7471j2502K9404k7746P812K2061k0362r728k7736
15263A460622l827j9780j4546k8365j4731j9951n563j8528k7780n392J8045q820
15251A311384j7355p612J699N707k5989k0740j4510j7823R031K0193J4840k9238
15239A229587j2098J4985P604J048K628j9730J2666R381J9728L1280M1210Q013
15227A346302J3750L8513M3227P1917J19433J45118K03225K41098K66807J39893
$$ y = [2238644, 2203008, 2204257, 2197526, 2142895, 2122745, 2107786, 2067452, 2035072, 2031263, 2001279, 1980069, 1942916, 1930295, 1929582, 1910421, 1876229, 1882042, 1854981, 1822007, 1807178, 1774526, 1766385, 1755556, 1724385, 1741679, 1745010, 1756598, 1743425, 1690310, 1657889, 1629555, 1599220, 1587747, 1573094, 1556099, 1528168, 1535372, 1546890, 1499419, 1486917, 1516321, 1488575, 1496387, 1518448, 1498086, 1488358, 1460622, 1456795, 1437015, 1422469, 1394104, 1379373, 1359422, 1353859, 1335331, 1307551, 1302159, 1320204, 1311384, 1294029, 1286417, 1288116, 1293823, 1267834, 1247094, 1232584, 1214761, 1223792, 1243985, 1258825, 1229587, 1217489, 1232474, 1240078, 1241126, 1243754, 1224024, 1236690, 1246071, 1265799, 1297079, 1338289, 1346302, 1360052, 1398565, 1441792, 1513709, 1633142, 1778260, 1981485, 2222583, 2489390, 2629283]
15217B629283o7872k28340k87501k52178j87290j43200r9105r3522n3589n7926
15207A158760k6603m0744l452j0990l6613n7960m3531j7791k295J1182O122k6326
15195I09759k9490p277k8350q766K855R184o805k3946j8954p318j3095k3096j0602
15182G44099l556k0893j226J2596J3884J0287q664J6108l0461k2118j5Q87l0152
15169F80776n514J2021p212j5722J463K0129J256l6732Q565j3575j0644l799j3826
15156F17186J6360J5202R267j8940k1446P244K58J982r08k5034j2586J2803J053
15143F02441j8923J0919n997k5787r072J204O863Q888q141m0384J329J074R834
15130E34248m856k4142j1454J1748J9213q878k3834P415J1255N115J6365j5664
$$ y = [2629283, 2561411, 2333071, 2045570, 1793392, 1606102, 1462902, 1363797, 1270275, 1216686, 1158760, 1132157, 1091413, 1087961, 1076971, 1040358, 982398, 938867, 921076, 918781, 929963, 936085, 909759, 880269, 872992, 844642, 835876, 838731, 847915, 841110, 817164, 798210, 790892, 777797, 754701, 744099, 740543, 719650, 718424, 731020, 744904, 755191, 746527, 762635, 732174, 710056, 710041, 710928, 680776, 675262, 687283, 680071, 664349, 665812, 685941, 687197, 650465, 659030, 645455, 634811, 631012, 617186, 633546, 648748, 658015, 639075, 617629, 624873, 625131, 627113, 626205, 601171, 588585, 601388, 602441, 583518, 594437, 588440, 562653, 553581, 554785, 561648, 570536, 562395, 522011, 523340, 524414, 534248, 529392, 505250, 493796, 505544, 524757, 515879, 492045, 499460, 510715, 515830, 532195, 516531]
15118E16531j694K5176J0535K937j37q847m5734k2320j2752l0694j5020J7007
15106D34988J7833J3381j5331m348n741N790J0898m693k3432N230L4706K6039
15094D95320l4606n1359J011k520k1035k597P998K1491R330k469r608K8597J9205
15081D58758r445k8454k465O674O286j2809j4170J3969R336k0153K1123J1873
15069D40523l6656n556K4261q859j5780p56j4612q395J0247l770j3146p45j0596
15056C56160p355n67J9462Q951M200o172j8690N276J606J0476m766M127J9699
15043C92407m0334k4466O466K2652q312J915R779j2464l0900l751K6645J3803
15031C53440k0281j2742J09L1185J4855J1025l309m0055m1526j1793R489j9121
$$ y = [516531, 514837, 540013, 550548, 553485, 553348, 544501, 498767, 476447, 463695, 433001, 417981, 434988, 452821, 466202, 450871, 446523, 440782, 446572, 457470, 452777, 429345, 434575, 469281, 495320, 460714, 409355, 410366, 407846, 386811, 384214, 392212, 413703, 423033, 420564, 410956, 439553, 458758, 449313, 420859, 418394, 425068, 431354, 418545, 404375, 418344, 427680, 407527, 428650, 440523, 403867, 398311, 422572, 413713, 397933, 397177, 382565, 374170, 384417, 380647, 367501, 366756, 356160, 348805, 348238, 367700, 376651, 380851, 374679, 355989, 361265, 362871, 373347, 368581, 372708, 392407, 352073, 327607, 334073, 356725, 348413, 350328, 360107, 347643, 316743, 312992, 339637, 353440, 333159, 320417, 320526, 351711, 366566, 377591, 374282, 334227, 292701, 280908, 290397, 271276]
15019B71276k3319K0303J7901L1167j283k3350q556M77L7731K0562o4360m0329
15007B38220J7727J9217J881k9890j8889M262M845q990J4758K7151K5818J5457
14995C11567O097J472k8805l4416j5312N557K7143L9580K1295j3052m7271q05
14983B73050J0850o526K055N247k2970K254J9656k521q787J5094L4311J1187K534
14970C35434k2026M855j9910m817j5819m363J2539k6064k186P246o913j7740k2573
14957B17663k673J4965O415L105r777Q473Q559j3376j0823J8810L537n337R004
14944B48545Q448J54k4179l1608m704o345n362j7601M738N831K9115P895j4567
14931B00360J3430j1969J8827m264j0813J3717J16j3669j0863Q034L5574K0173
$$ y = [271276, 247957, 268260, 286161, 317328, 316045, 292695, 284139, 284616, 322347, 342909, 278549, 238220, 255947, 275164, 277045, 247155, 228266, 232528, 237373, 228383, 243141, 270292, 296110, 311567, 317664, 319136, 290331, 255915, 240603, 246160, 273303, 312883, 334178, 321126, 273855, 273050, 283900, 277374, 279429, 284676, 261706, 263960, 283616, 281095, 272308, 287402, 321713, 332900, 335434, 313408, 318263, 298353, 293536, 277717, 273354, 285893, 259829, 257643, 264889, 257976, 240236, 217663, 214990, 229955, 236370, 239475, 229698, 238171, 246730, 233354, 222531, 241341, 244878, 239541, 248545, 256993, 257147, 232968, 201360, 196656, 190311, 184949, 167348, 172086, 177917, 207032, 214927, 200360, 213790, 201821, 220648, 216384, 205571, 219288, 219404, 205735, 194872, 202906, 238480, 258653]
14919B58653j1856l425K340k2126k0125p215M389m127j1835l579j745K0819K926
14906B03094Q741p393Q961r315J1202j034k4055j660K1036J5752o094k1340r710
14893A88185m607K052K943p780P591P332m141k3321J9677j8495p583J0043k2134
14880A49762J1258k1031R102p930J3084O533l288Q546p553J6851K0102k4238j3855
14867A57343L694k2310j8414K3866J009M514L553N642J8403r182k3404J2741J002
14854A58457m361j776O442O737R292j8081j3343q886p99J6351L2918J2123r658
14841A85416r816k741J9850L0328n238j6581J0142k3567l0180j9844R835j3338
14829A34266l1385J0414j151J7826N201K6705N08n930p54O397j1202Q598M628
$$ y = [258653, 246797, 243372, 245712, 223586, 203461, 196246, 200635, 196508, 184673, 181094, 179349, 200168, 203094, 211835, 204442, 213403, 204088, 215290, 214256, 190201, 188541, 209577, 225329, 219235, 197895, 188185, 183578, 185630, 188573, 180793, 188384, 195716, 191575, 168254, 187931, 169436, 161853, 171896, 149762, 161020, 139989, 149091, 141161, 154245, 160778, 157490, 166036, 158483, 175334, 195436, 171198, 157343, 161037, 138727, 120313, 144179, 145188, 149702, 153255, 158897, 177300, 168118, 144714, 157455, 158457, 154096, 152320, 158762, 165499, 174791, 156710, 143367, 134481, 133682, 150033, 182951, 195074, 185416, 175600, 172859, 192709, 223037, 217799, 201218, 211360, 187793, 157613, 137769, 147604, 134266, 102881, 113295, 112144, 129970, 135171, 161876, 162384, 156454, 155700, 162097, 150895, 159493, 164121]
14816A64121m572j0359p717l7819N251j3195J3759L2221L5985j2213j0903m420
14804A50139r268j5863J2330O559O575n529p194j051P410j4230J0573j9055j1263
14791A10133j4096J4725K0402J5130j5710J4765K7117k2273r048K3046j7321l001
14779A43869N643k9044J108J8545L3029r810k9776n323j5394N164N348k913R07
14766A21353R213J9370J514M050l5003k504K8566k7481k3410j4799J7165L6238
14754A34272q799j193KM122O132o499j1367Q971n788N488L485l361n123l1967
14740H8375J188K659O393j6867k751M110Q754J6574L92k3389k1373K9407J931
14727I5403K4375J2031P083k0439N190J8425n359j5023k200J3624m042M360q822
$$ y = [164121, 159549, 149190, 141473, 103654, 108905, 95710, 109469, 141690, 177675, 165462, 154559, 150139, 140871, 125008, 137338, 143897, 150472, 144943, 137749, 136698, 144108, 129878, 140451, 121396, 110133, 96037, 110762, 131164, 146294, 130584, 145349, 172466, 150193, 141145, 164191, 146870, 143869, 149512, 120468, 121576, 140121, 173150, 163340, 133564, 128241, 112847, 118011, 123359, 120446, 121353, 130566, 149936, 151450, 155500, 120497, 117993, 146559, 119078, 95668, 80869, 98034, 134272, 125473, 124280, 124282, 128404, 134536, 128037, 116670, 125641, 119853, 125341, 128826, 125465, 120342, 88375, 89563, 92222, 98615, 81748, 78997, 83107, 91861, 108435, 108827, 85438, 64065, 93472, 95403, 119778, 131809, 138892, 118453, 123643, 142068, 136709, 121686, 119486, 133110, 129068, 133428, 124606]
14714A24606J0992j6256o816J585l2938N414K5970L3156j4721j6735J550L445
14702A19252K8377j55j5204k5179P175k6995O976J6146j8574N209Q50N877O009
14689A09764M783k103q266k2283J0909K7232J565p81n003l300l4573r123J0081
14676G8902N015j1775k196J8423K0789m776K13J5147j4440l998J8966K7319j1274
14663A36315j4530n104Q810j464k4773L075R593N195J4112o417J0745k2968l9562
14650G3027j8335l563l556R983r629J3753M6833R063J9978l354M350l564k5881
14637A09105k1422R978l728l2586j3802J9296J0622m002o538K0019M135K372j4499
14624G8950J7985j904n753J2372p985j9613n088l205K87q713k4852O070M69j0549
$$ y = [124606, 135598, 119342, 112526, 114111, 81173, 86587, 112557, 145713, 130992, 114257, 115807, 119252, 147629, 147474, 132270, 107091, 114266, 87271, 94247, 110393, 91819, 97028, 97878, 103755, 109764, 114547, 112444, 104178, 81895, 92804, 120036, 121601, 120820, 115817, 112517, 77944, 68821, 78902, 83917, 72142, 69946, 88369, 109158, 104382, 104595, 119742, 105302, 101304, 120270, 147589, 136315, 121785, 116681, 125491, 124027, 99254, 102329, 111922, 117117, 131229, 124812, 135557, 112589, 73027, 54692, 51129, 47573, 57556, 47927, 61680, 108513, 117576, 137554, 134200, 138550, 134986, 109105, 87683, 97661, 93933, 61347, 47545, 66841, 77463, 73461, 66923, 86942, 91077, 93449, 78950, 96935, 95031, 89278, 101650, 93665, 74052, 68964, 65759, 66046, 57333, 32481, 38551, 39020, 28471]
14610B8471L6999P109J9712L0824M610j2977k4700j7611L422J6594K5319q798
14598A08974j4492r989Q183N746j0696q606L174R981R992n808r334J4783P244
14585A09152r400j5355j1424l448q246P556R483J5503q080J3960K025J5416m973
14572A12169m877j6897m0033J2184K6409K3221j1659j6817j2475J218J5048j6747
14560G0744r422L165m326r755J1487K0568L216j3432j1962Q171K1411J3669m983
14547I8551K0696J1434q22r106k4420k5165J0843J4949P008q805m472o459m1476
14534D2756j7604j9602P475J2104L085J4595J8655P53P553j6055m956J5163J3880
14521G7802R734j6780k9973M495J9263J718N265L5889K692j8586k6389l9792m833
$$ y = [28471, 65470, 72579, 92291, 123115, 127725, 114748, 90048, 72437, 75859, 92453, 117772, 108974, 94482, 84493, 92676, 98422, 87726, 79120, 82294, 92275, 102267, 96459, 87125, 101908, 109152, 99752, 84397, 72973, 69525, 61279, 68835, 78318, 93821, 85741, 99701, 101726, 117142, 112169, 107292, 90395, 50362, 62546, 88955, 112176, 100517, 83700, 71225, 72443, 87491, 70744, 61322, 64487, 60161, 50406, 61893, 82461, 85677, 72245, 60283, 68454, 89865, 103534, 98551, 119247, 130681, 129859, 120753, 96333, 71168, 82011, 96960, 103968, 95163, 90691, 84232, 42756, 25152, 5550, 13025, 25129, 28214, 42809, 61464, 62217, 69770, 53715, 48759, 63922, 77802, 87536, 70756, 40783, 45278, 64541, 66259, 71524, 107413, 110105, 91519, 65130, 25338, 20505]
14508B0505O060J4400J0066O275j4544L588Q027K0267k469K326o165m395R594
14495G3535j3774L4838J955l0261l0678J9410K2247j573q860j5185K086J1757
14483F5497k403J329L90J4937k990N119J7557j5110j9917J2310m363K568O482
14470H1406Q539L0713n978m3309j8359J1974j723q382j3464j5395N947K0519J405
14457E3893J4939j6649J4270M127k4377J3179J1635J2041k4808j9124j98r219
14445B9709j1653l626R013P418J3439J9464K1130K034m8576k6358M103J8333K0795
14432E5225J4090l6412n956P485R053J2487L742p611j4683p79q822o079o306J0258
14418B5692L586J902Q503L1464M0024r937k4836k3205q625q537k437J1216p164
$$ y = [20505, 26565, 40965, 51031, 57306, 42762, 46350, 54377, 74644, 72175, 74501, 68336, 63941, 73535, 59761, 94599, 96554, 66293, 35615, 55025, 77272, 75699, 66839, 51654, 53740, 65497, 63094, 64423, 64813, 79750, 76760, 81879, 99436, 84326, 64409, 76719, 72356, 74924, 81406, 89945, 120658, 114680, 71371, 53012, 64986, 63263, 54881, 41417, 26022, 31969, 52488, 53893, 68832, 52183, 66453, 70580, 46203, 59382, 71017, 83058, 58250, 39126, 38928, 29709, 18056, 14430, 23443, 30861, 44300, 63764, 84894, 86928, 38352, 11994, 16097, 34430, 55225, 69315, 32903, 26947, 34432, 43485, 55972, 59714, 52103, 37420, 36641, 27819, 21740, 15434, 25692, 29278, 31180, 39683, 71147, 111171, 101234, 76398, 53193, 44568, 36031, 33594, 44810, 37646]
14405C7646j5911J5829n487k14J8483J6218J2921K228n64r600k1804r870M0641
14392H0516J2526m019m2316l674m957k8741k030J0547Q558K1515L0632M473l4174
14379D8856m3399r411N2194L021J0842L319j6668m336j5235j3673l926R449L5306
14366E6339R726q551o657j1331l1462j7971r325K6599J1739J008L3335L218k8522
14353B8145N156K4468j024n241j7693j3729J2329m967Q99N014o062R030J1009
14340D7334j1525o650J6606K8102P249R462J7632j3567j7306j2793l6319O256
14328C4481k546o02J1185j7669k86J8408J3880j1618j1531K597J9672q645j7054
14315C0272K0422N70k3603j6667Q5L203k3636J0879m461O2K6030J8664j288k7515
$$ y = [37646, 21735, 37564, 32077, 31863, 50346, 66564, 79485, 81713, 81149, 71549, 49745, 39875, 80516, 93042, 89023, 46707, 43033, 38076, 9335, 7305, 17852, 26410, 47925, 78557, 83030, 48856, 5457, -3954, 48240, 51261, 62103, 65422, 48754, 44418, 29183, 15510, 11584, 21033, 56339, 66065, 57514, 50857, 39526, 8064, -9907, -19232, 7367, 19106, 20114, 53449, 56667, 28145, 33301, 57769, 56745, 51504, 33811, 20082, 32411, 27444, 28343, 33357, 27295, 36325, 47334, 35809, 29159, 45765, 73867, 81116, 90578, 108210, 94643, 77337, 64544, 28225, 34481, 31935, 31333, 42518, 24849, 24563, 42971, 56851, 45233, 33702, 36299, 55971, 47326, 30272, 50694, 51264, 27661, 10994, 11079, 14282, -9354, 1525, -2936, -2874, 23156, 41820, 40532, 13017]
14301A3017k9202O754K9163L3300J6764j1451k0315k1471j1071J507K570k201
14289G364q280O748M352J4912J1954K8688L3831k3418j2767n179j6050j8154O750
14276C0751n099J7431R663l434j4704l0510j056k7J0466L6965J6032J1045J3174
14263I0697q453k4859j8866l302J7073j4153o12k0046k9932M512J5195K756Jr30
14249I081J3845Q760J1201O326J3924j6418k1510J725J7029K138K335J7958K2257
14236H8651j576n843m840L706k2561l0733l146K891j515Q416M2003K9762k269
14223A02946m3711k7483l4383k210K5157L125l6696q640k121K6410K2067j5711
14211H750J6360Q562j8979m72l594K4729M5391R145j6672m3838n0779j6276J7651
$$ y = [13017, -16185, -9431, 19732, 53032, 69796, 58345, 38030, 16559, 5488, 6995, 9565, 7364, -916, 5832, 10184, 25096, 37050, 65738, 99569, 76151, 63384, 58205, 42155, 24001, 30751, 25652, 43083, 52746, 49312, 34608, 4098, 3042, 3015, 13481, 50446, 66478, 77523, 90697, 82244, 57385, 38519, 35217, 52290, 38137, 37525, 17479, -12453, -7941, 7254, 10010, 10011, 9081, 22926, 31686, 42887, 49213, 63137, 46719, 25209, 26934, 43963, 46101, 48436, 66394, 88651, 87075, 81232, 76392, 80098, 57537, 26804, 23658, 26549, 25034, 33450, 75453, 105215, 102946, 59235, 31752, -2631, -4841, 20316, 23441, -13255, -21895, -24016, 2394, 24461, 8750, 25110, 33672, 14693, 14221, 10627, 35356, 80747, 89892, 73220, 29382, -21397, -37673, -20022]
14198b0022K3061J1479K897J0622j2162l284l259O482M1586o017n066l280j5915
14185B7122j1241j0466N063J2506K09O123P222Q510l0793n296m272N32J4496k3702
14171c987r047R541J6356j6275P723L3440m174O90P993j7580j7576K635O919j5357
14157A301k8056m792j1500p105J6210M0269J0873l672K2258J8443M2382o662j2052
14144G7897N704j5651j0267N845p680k8856L1158J2588j298J4906q817j1413k1609
14131D2507j785J6030J182j8123j5331j0234N088l052N1k7646j1259M888O892
14118a0792K0526K4773M621j0918j8158j1948K657K3121K5514j3147q76L0405
14106F5778k5634l3105r540R938j8156J0999J3704Q492j911p921o390J2430J2354
$$ y = [-20022, 3039, 14518, 17415, 28037, 15875, 12591, 9332, 15814, 57400, 51383, 46317, 43037, 27122, 15881, 5415, 10478, 22984, 23193, 29316, 36538, 45048, 14255, 8959, 4687, 5219, 19715, -3987, -13034, -3493, 12863, -3412, 4311, 37751, 33577, 34267, 42260, 24680, 7104, 9739, 16658, 1301, -26755, -31547, -43047, -50152, -33942, 6327, 17200, 13528, 35786, 54229, 96611, 89949, 77897, 83601, 67950, 57683, 63528, 55848, 26992, 58150, 70738, 69440, 84346, 75529, 64116, 42507, 40722, 56752, 57934, 39811, 24480, 14246, 19334, 16282, 16333, -11313, -22572, -17684, -10792, 9734, 34507, 39128, 28210, 10052, -1896, 761, 23882, 49396, 36249, 35373, 65778, 40144, 7039, -2501, 7437, -10719, 280, 13984, 22476, 20565, 12644, 6254, 18684, 31038]
14093C1038p566Q201j4949j7974o853m468j766J0116J0189L652o778K943R261
14080A5046k831k8973p869J8499J1909L683r763n910M5636k3054k2194M534N819
14067D532p206J596J6774K0057K241O608p87N93j1901j6920k310q827m633j6298
14053a6481N394m107k7591l94J4591j0356l267K8177L2696K1016M387j3162l287
14040B7616Q444j2398j5569o054Q371J6496j8468m4349K3489N311p077K809J9880
14027H501L874R411J5333N003j8156q511j6562p382P129K2571P086J0080l7912
14014D65j0871K8937P569j3424l8701K5253J4494o474n069J0288L6695N226l9683
14001A4705o534J3470L79k478N011j9109k7365R914l770J3965K8176n359n220
$$ y = [31038, 23472, 31673, 16724, -1250, -8103, -12571, -14337, -4221, 5968, 9620, 2842, 5785, 15046, 12215, -16758, -24627, -6128, 5781, 9464, -299, -6209, 39427, 16373, -5821, -1287, 4532, -2674, -1078, 15696, 35753, 37994, 44602, 43815, 44408, 32507, 15587, 13277, 4450, -183, -16481, -11087, -15194, -42785, -43179, -28588, -38944, -42211, -14034, 18662, 39678, 44065, 30903, 27616, 36060, 23662, 8093, 2039, 10410, 26906, 8438, -35911, -12422, -7111, -14188, -11379, 8501, 12375, 21786, 37119, 42122, 23966, 15455, -1107, -8489, -1360, 21211, 28297, 38377, 465, -10406, 18531, 26100, 12676, -26025, -772, 13722, 7248, 2179, 12467, 49162, 54388, 14705, 8171, 21641, 22020, 19542, 24553, 5444, -21921, -12007, -15777, -1812, 26364, 21005, 15785]
13988A5785M6261K5j5206N342L738n000l9245P556J2084J00K615r752M431j8698
13974A0036j345K1344k014P80q915j3294N514J473m868O809J0479j0391j4921
13961F87J3760M5001O097l0577k9112R42J2357M103R805l0943p754J5810P587
13948A7763j0555j0268J2572L321k3854K9217J463k8574m787j0595M7728M1921
13936F5352L789k5383n1366j9266M71J9353q224k976L4890k909j6197K165K1459
13923B1158k2983j6842J0665k408j4628L1K878J6829L3996K3268j9808m621p031
13910B0504N117K4924K9564K0024k4314k1371P961m029l1553j1368P886J144l556
13897B0933k7302l6023K1882K3152J4416K9233P91j9813J8418r70O285J4534j160
$$ y = [15785, 62046, 62071, 46865, 52207, 55945, 50945, 11700, 19256, 31340, 31440, 34055, 24303, 28734, 10036, 8691, 30035, 28021, 28801, 19886, 6592, 12106, 13579, 8711, 15520, 25999, 15608, 687, 14447, 59448, 65545, 34968, 5856, 6798, 19155, 23258, 33063, 2120, -5634, 10176, 17763, 7208, -3060, 9512, 12833, -11021, 18196, 19659, -8915, -13702, -24297, 23431, 65352, 69141, 43758, -7608, -26874, -26403, -7050, -15274, -18250, 16640, 13731, -2466, -301, 21158, -1825, -18667, -8002, -10410, -25038, -25007, -22129, -5300, 28696, 51964, 32156, 27535, 20504, 25621, 50545, 80109, 100133, 75819, 54448, 62409, 58380, 26827, 15459, 23345, 24489, 20933, -6369, -42392, -20510, 2642, 17058, 46291, 47082, 27269, 45687, 44717, 51002, 65536, 64376]
13884F4376R819k107j4373l0592l0346l9492j0429N5517M202j6518J1566L0113
13872C1736j8901k9445O338k893p431K0176J4383o776o881O82O246p614j737J363
13858g54l493r804j3131k3540N328J3834J2932L7283j85Q17j2323l0052q464K4151
13844g401J9325J7660j215k6661n009L375J1431k0946J7425K083J0748k466q85
13831A7464K1574j1697j1252K139n26o890M140O186O618q096o086K1730J0528
13818D5832k439j8027K0043o839k908k760j3510l0669r641p493l219L4845m485
13805a270L6584K9254J0318j6343M210k3797k306K9604m253l5257l302J1605j8160
13792A6887k5749k3052q104J4038O270O727k3977K7365L0955J145Q508k2175k7663
$$ y = [64376, 74195, 72088, 57715, 27123, -3223, -42715, -53144, 2373, 6575, -9943, 1623, 31736, 12835, -16610, -10272, -13165, -20596, -420, 13963, 7187, 306, 988, 7234, -380, -2117, -754, -4247, -14051, -27182, -50722, -45394, -31560, -18628, 18655, 18470, 19287, 6964, -23088, -31552, -7401, 11924, 29584, 28369, 1708, -3301, 74, 11505, -9441, 7984, 10067, 20815, 18349, 17464, 39038, 27341, 16089, 18228, 17702, 10812, 14952, 21138, 27756, 19660, 13574, 35304, 45832, 43393, 25366, 45409, 38570, 35662, 32902, 19392, -11277, -20918, -28411, -31630, 3215, -1270, 35314, 64568, 74886, 58543, 62753, 38956, 36650, 66254, 62001, 26744, 23442, 35047, 16887, -8862, -31914, -40018, -25980, -19710, -12983, -36960, -9595, 21360, 22505, 31013, 8838, -18825]
13779a8825J605J9509R666J9900l861j1536j1113j0738K9275K0092j8434K452
13767B7992K388r044k270J6865j3263p421k735j4845L1742P366j1756Q22M091
13754B9932n640J2558q43K367k0478k1534J5034q48j698k2795J9513K5491L219
13741C4278r649l280j3253P555k0717j2118L0402R066K7492L2898N626J261l5419
13728E4142j1385j3388k4425l3543O410K8282n002l5356J4595K3618K5788J8369
13716D8105L2117j5247o2395k3447k684K1541L0300k708q679l2856P892j6367
13704b4428J0330J6230N05J2923m90j3371L7255Q502K394J5447k7574l0376k2212
13691a4865M64K1955J4117k073L600k4361k6489r954l030K8076N7681K7197K0042
$$ y = [-18825, -17220, 2289, 11955, 31855, 27994, 16458, 5345, -5393, 23882, 43974, 25540, 27992, 30380, 21336, 19066, 35931, 22668, 15247, 12512, -2333, 29409, 36775, 25019, 25841, 29932, 24292, 36850, 36007, 38374, 17896, -3638, 11396, 10548, 8850, -13945, 5568, 31059, 34278, 24629, 21349, 8096, 15651, -5066, -17184, 13218, 22284, 49776, 82674, 88300, 89561, 54142, 42757, 29369, 4944, -28599, -22189, 6093, 1091, -34265, -19670, 3948, 29736, 48105, 80222, 64975, 2580, -20867, -23551, -2010, 28290, 25582, 16903, -15953, -8061, -24428, -14098, 2132, 2637, 15560, 15070, 1699, 38954, 47456, 49850, 65297, 37723, 7347, -14865, -14401, 7554, 21671, 19598, 23198, -1163, -27652, -37606, -40636, -12560, 45121, 72318, 92360]
13678I2360K399l8169l7996j7392L491J9433N462j8072j5847K8885N036j6272
13666A3318K9282J6049K4977K5482l0811m7133j6283M545j0289p311K6749j3993
13654A4582J0175j212N17j3111p892m335j6865J2334l487Q151J7667J5914P881
13641D0319j9951k927M582o800j6961J4036J5049p968P05j4154j0652j3755Q841
13628i636l332j9111N962K810k3356j0009p284N724N971K0157L5739K0062J1587
13615C5284J2876l3089q923J7349J6513J072J7133J5855l0617k9393m1731M820
13603b2851K7904K1147J0126j4063J6095J3007k6187j2226q883J4781K3283K2957
13591F5090J6560N105k275L3834J3484K0385M7283Q2470J14891K05357L50108
$$ y = [92360, 94759, 56590, 18594, 1202, 4693, 24126, 29588, 11516, -4331, 24554, 29590, 13318, 42600, 58649, 83626, 109108, 78297, 31164, 14881, 19426, 9137, 1826, 28575, 14582, 24757, 23545, 24062, 10951, 3059, -1276, -18141, -5807, -9294, -1143, 16524, 32438, 40319, 20368, 17441, 22023, 15223, -1738, 12298, 27347, 19379, 20084, 5930, -4722, -18477, -9636, -12968, -32079, -26117, -23307, -46663, -56672, -63956, -58232, -52261, -32104, 3635, 23697, 35284, 48160, 15071, 6148, 23497, 40010, 41082, 58215, 74070, 43453, 14060, -27671, -22851, 5053, 26200, 36326, 22263, 38358, 51365, 25178, 12952, 4069, 18850, 42133, 65090, 81650, 86755, 84480, 118314, 131798, 152183, 199466, 281936, 396827, 602184, 952292]
13580I52292M84873J17614m28536m25703k56231j62971j00426j7398k624j6223
13570A44667o992J0753k0013k4733m1167j8845K1489L5500K2735J2193k6793J6460
13558A25254L4473J8069p372L2686O4401O7557J26178K29394L81056P51774R84092
13547B807562M16833o97599r87163o13858l01109j54093j21943q9786l1127l0268
13537A97449k6887p199j233K326k1917k3667j6322K1160K3185J2840n774j8155
13525A35806k6272K642N8320M0507J5329K7338Q7370J87188L66417N28869K92059
13514A715573l44199n16873l49984j68272j06481p2464k0662o044k2889l4340
13504G3365j0987o17l714j1942J8642P594j6224K4826Q942o838j1488k5616o473
$$ y = [952292, 1437165, 1554779, 1126243, 700540, 444309, 281338, 180912, 163514, 160890, 144667, 137675, 148428, 128415, 103682, 62515, 43670, 65159, 100659, 123394, 135587, 108794, 125254, 159727, 177796, 170424, 203110, 267511, 335068, 461246, 690640, 1071696, 1823470, 2807562, 3224395, 2526796, 1539633, 925775, 624666, 470573, 348630, 258844, 227717, 197449, 170562, 163363, 162130, 164456, 142539, 118872, 102550, 123710, 146895, 159735, 153961, 135806, 109534, 112176, 170496, 211003, 226332, 253670, 341040, 528228, 894645, 1423514, 1715573, 1371374, 854501, 504517, 336245, 229764, 157300, 136638, 130594, 107705, 73365, 62378, 61761, 58047, 46105, 64747, 72341, 56117, 80943, 89885, 83047, 71559, 45943, 39470]
13491C9470p112J1887l374j097l489q971K4222k4770m2991k7035J2510J8720j7089
13478b9119R298L1965k210n388J5744J5749K0204j3994k3352n792p879J8889r204
13465A4911n615O469k6487r879p515M987R742j0862q999L816k7689R149K6605
13452b1367Q719L3539K2534p375j867j4059K082L497k0410M940J9304q490j2168
13439H879r995J7290K6409k9150n455m874j0316r341J5354r253o206J4272j722
13426d108j0021P643K8119J5127k1004j0085P700N977J5648j9886r943n750l2666
13413c3249J6789O646M470j6008j2905k985J3934L6806J6295M223J798r940k3474
13400B400j6814l1717j4956L2708K8153K0736n528q040j1690j3976M715j0070
$$ y = [39470, 32358, 44245, 40871, 39774, 36285, 27314, 51536, 26766, -16225, -43260, -30750, -12030, -29119, -19821, 12144, 9934, 4546, 20290, 36039, 56243, 42249, 18897, 13105, 5226, 24115, 14911, 9296, 15765, -10722, -20601, -28116, -23129, -13387, -24249, -33248, -29432, -57121, -47972, -21367, -12648, 20891, 43425, 36050, 34183, 20124, 22206, 25703, 5293, 10233, 29537, 21047, 8879, -1116, 16174, 42583, 13433, 7978, 3104, -7212, -16553, -1199, -10452, -16658, -2386, -4108, -14129, -6486, 21633, 36760, 15756, 5671, 13371, 19348, 34996, 15110, 5167, -583, -33249, -16460, -9814, -5344, -21352, -34257, -37242, -23308, 13498, 29793, 34016, 35814, 25874, 2400, -14414, -46131, -61087, -28379, -226, 20510, 14982, 6942, -4748, -18724, -14009, -24079]
13388b4079J1868J1960j53k2296J407J1233J3773K6327r558J890J0394q118k4154
13375D94j7585J5047O806M839n690K973J8834k618r168L729j651j6957k974J2120
13361H199L293j1372K490L303l913M1560J6348n878j9339Q33j3371k984R425j1513
13347A7081j2771O475M944J4058j3801j8968k2001k7043J854M9640L0356m695
13335B5129r189k0254m615q141O437j4538J964l653O698R122Q966K2251k635j0160
13321G382J9115j982q090m289r674J1215J3608j3159k0722k2491j5420J752M2250
13308e05L3775k1640l077p82N690Q935m950k0321j0362p913j9119j6017R884J917
13294d4485R70J5481O0021n150l6474J7442K8525j8719j2347j6108N673J285R910
$$ y = [-24079, -12211, -251, -404, -22700, -21293, -10060, 3713, 30040, 20482, 22372, 32766, 24648, 494, -17091, -2044, 4762, 9601, 3911, 6884, 25718, 23100, 13932, 17661, 16010, -947, -3921, 8199, 11492, 120, 2610, 5913, 2000, 43560, 59908, 54030, 34691, 35524, 22153, 19169, 28594, 17081, 4310, 10785, 15729, 29787, 15986, -2982, -24983, -52026, -50172, -532, 29824, 25129, 15940, -4314, -8929, -17070, -10633, -25171, -23207, -26860, -20162, -11040, -2074, 20177, 17542, 7382, 26497, 24515, 16425, 12136, 2462, 13677, 27285, 14126, -6596, -29087, -44507, -42755, -505, 33270, 11630, 8553, 7771, 13461, 22396, 17446, -2875, -13237, -21150, -40269, -56286, -46402, -44485, -43515, -28034, 31987, 26837, -9637, 7805, 36330, 17611, 5264, -10844, -5171, -3886, 6024]
13281F024o701k1731j946L0729m834o495O682R503j3243m032q096J3387l380k8445
13267c2578o652J1471K1123Q854N971j096j6558J4515r691j0110l802M532L655
13254a0366J0621j000L152L2423O50j6452O61j651j231k7732k326N530J8882J4336
13240B5497j683j2564k3184k3096q210J8674M608k3422k252J2503k986M662J5294
13227a6159K2893Q014q25o900o457R419K597p813N077n693j0002J3093j6419k459
13213a1634K5004M555o92j4599k9621j4800p829J88L5191J4216j2772l2898N726
13200c9965K6455J6894J7106l639k5415q06j1265k2727J0617k881o705j2234J0505
13187d4060M3345P00j4247j6886J3577K555j7020k254J9766K181j7151L138J8251
$$ y = [6024, -677, -22408, -24354, 6375, 1541, -4954, 1728, 11231, -2012, -6044, -14140, -753, -4133, -32578, -39230, -27759, -6636, 2218, 8189, 7093, -9465, 5050, -4641, -14751, -18553, -14021, -10366, 255, -745, 2407, 34830, 35480, 19028, 19689, 18038, 16807, -10925, -13251, -7721, 11161, 25497, 23814, 11250, -11934, -35030, -43240, -24566, -19958, -43380, -45632, -33129, -36115, -31453, -16159, 6734, 14748, 13923, 7023, 566, 9985, 12582, 4769, 9846, 4153, -5849, 7244, -9175, -11634, 13370, 17925, 17233, 2634, -26987, -41787, -49616, -49428, -14237, -21, -12793, -45691, -39965, -13510, 3384, 20490, 16851, -8564, -9370, -20635, -43362, -32745, -35626, -42331, -54565, -44060, -715, -15, -14262, -31148, -17571, -15016, -32036, -34290, -14524, -12343, -29494, -26356, -8105]
13174h105o089k041J6149J5670m949k0215J3473N323K519j6162n576M244P705
13161A946K6132J6341r247j5674n4705k8601J7871K7154L1318M244j9485l89P578
13148D483k8132k3580M602O884r136K257Q735J7914J3362L5603j386k9600k8988
13135b6982j0070l135n010j9808K134L6818m793J889P543k149k5468m992L9665
13122a4358J8693k4229q340j0055K7783m511Q02P388J5855K5191K7903M8254o333
13109A04043j7554J4339j1020Q02R656j3497k8489r594j6004o284p045J1320o964
13096B3709M025m407K969n044J1627L3465L236j3852j8590j4834l7785J1569N4914
13083E1002o055j5255k5409j7668K5030L4756j5249j2134K5339J0817l8058k1899
$$ y = [-8105, -14194, -16235, -86, 15584, 10635, -9580, 3893, 9216, 11735, -4427, -10003, -5759, 1946, 28078, 44419, 35172, 19498, -35207, -63808, -45937, -18783, 12535, 16779, -2706, -3095, 4483, -23649, -47229, -42627, -35743, -44879, -42622, -33887, -15973, -2611, 32992, 31606, 2006, -26982, -37052, -40187, -45197, -65005, -62871, -26053, -30846, -28957, -21414, -23563, -49031, -54023, -14358, 4335, -19894, -28234, -38289, -10506, -15017, -14215, -6827, 9028, 34219, 62122, 110376, 104043, 86489, 100828, 89808, 90610, 100266, 86769, 58280, 48686, 32682, 26398, 19353, 30673, 23709, 27734, 23327, 26296, 21252, 32879, 66344, 69580, 55728, 37138, 22304, -15481, -3912, 51002, 44947, 29692, 4283, -13385, 11645, 46401, 31152, 19018, 44357, 55174, 17116, -4783]
13071d783R570M5384L8926n3200k7836j1004l3293p496R010L3244J8532M688L0619
13058E2361Q661K688k384J9788M3491k944l5053j7991n922l0958K0037L5609m817
13045H2566R085K7596j3212J2797K107r043J411K6721L6641O1242O0860R0252
13033C89023J77783K18480K30141K09220J12458m0254j73558k14283j78351j11379
13023F19280o6565l3327l9830J5250N9789P7475R2312J61053K26337K29748Q6176
13012A427698j05698k38045k14795j42783j20338j05661o8466m8498m0351k0803
13002C22260O462L712K7785P7428P1011R3315J14674J56059K23662K06877M1417
12991A344662j52759k21915j86455j49395j16853m5209j9466j5414L2198O4774
$$ y = [-4783, 4787, 50171, 89097, 35897, 8061, -2943, -36236, -43732, -34722, -1478, 17054, 21742, 52361, 61022, 63710, 61326, 81114, 124605, 121661, 86608, 68617, 62695, 31737, 51774, 87383, 82566, 91651, 119247, 106035, 118832, 120939, 111896, 113307, 140028, 176669, 237911, 298771, 389023, 566806, 785286, 1015427, 1224647, 1337105, 1296851, 1123293, 909010, 730659, 619280, 552715, 519388, 479558, 494808, 554597, 632072, 724384, 885437, 1111774, 1341522, 1427698, 1322000, 1083955, 869160, 726377, 606039, 500378, 431912, 383414, 343063, 322260, 328722, 332434, 360219, 437647, 508658, 601973, 716647, 872706, 1096368, 1303245, 1344662, 1191903, 969988, 783533, 634138, 517285, 472076, 452610, 437196, 469394, 534168]
12981E34168J09075J27043J93456K17485J43008j3802j39300k13114k16131j67638
12971E74250j29857r2228m1754q1129m5701j8108j2409m8534r959Q166L0832l6843
12959I6726l9444m998J560P911L167j6505J3250P729j2420k7336p348j179j3087
12946H026j9392N082o70J4557j0163N814J2501r896M117J0745J6354P365J7627
12933F2067O018L933R622o753m581q330j8644l166k8603j401n624J9569p54j8664
12919D689j251o779k298J124R48j9512K6279J1926j7953j6772J6274J5516j161
12906A1030J8569R216p710j2832l668j2742O859J6881p914l734K0885J1628O674
12893E3142o849j0648k3003K924p754l3955K0316K5664J0446k5040m0418L601
$$ y = [534168, 643243, 770286, 963742, 1181227, 1324235, 1310433, 1171133, 958019, 741888, 574250, 444393, 352165, 310411, 229282, 183581, 165473, 153064, 104530, 94571, 102737, 133569, 96726, 57282, 52284, 53844, 61755, 64922, 48417, 61667, 69396, 56976, 29640, 22292, 21113, 8026, -11366, -6284, -6954, 7603, -2560, 3254, 15755, 5859, 9976, 20721, 37075, 44440, 62067, 68085, 72018, 81640, 74887, 70306, 61976, 43332, 40166, 11563, 10162, 4538, 24107, 23353, 4689, 3438, -3341, -5639, -4515, -3567, -23079, 3200, 15126, -2827, -19599, -3325, 12191, 11030, 29599, 38815, 31105, 18273, 14605, 1863, 8722, 25603, 17689, 13955, 34840, 46468, 53142, 46293, 35645, 12642, 15566, 7812, -26143, -5827, 19837, 30283, 5243, -35175, -31574]
12881c1574J4473O887J4191K3438J6227J0931J568Q759p440k6258j9088l341L1799
12868D0572J5557j1432j0488k884l635L0377J5318j4033k6992K0556L3134J4537
12856A00587j7998k0762m790J8926J8287n094j9707j6224R174J8882R257L379
12844I3917K0318M8982N3438J4914q188K0986J6483j7433n631k5382l5122j3440
12832A63842J1397l6124m9871l80K8471L9050Q718L567L3599L8925M0292P380
12820B88866l9236o2716m9456l8747L876Q795L0958J0730m037O59L293k8050j6366
12807A08569o056K7134M2388L523J0782J4442M445l5141l9934l7928j6138L297
12795G9383l750R433J7984Q725J1422J8178J1981K0245K0658K6520o219m1157
$$ y = [-31574, -17101, -10214, 3977, 27415, 43642, 54573, 56141, 64900, 57460, 31202, 12114, 8773, 40572, 56129, 44697, 34209, 31325, 27690, 58067, 73385, 59352, 32360, 52916, 86050, 100587, 82589, 61827, 57037, 75963, 94250, 89156, 69449, 53225, 62399, 81281, 90538, 93917, 114235, 163217, 216655, 231569, 223381, 244367, 260850, 243417, 237786, 212404, 177282, 163842, 175239, 139115, 89244, 88864, 117335, 156385, 165103, 168670, 202269, 241194, 281486, 288866, 249630, 186914, 137458, 98711, 102587, 111382, 142340, 153070, 149033, 149692, 152985, 124935, 108569, 102513, 129647, 172035, 175558, 186340, 200782, 205227, 170086, 130152, 92224, 76086, 79383, 75633, 85066, 103050, 111775, 123197, 141375, 153356, 173601, 194259, 220779, 214560, 173403]
12783A73403n9853k4338O2K775j3259j5453l630L796l0233l681j3022m7359k9004
12770e9796J3675M8691K303j6826k7455q340K8230J5797n689K0693j4088j4749
12758a7554j9987j6847M265K0883J9595J933j3220j4497l9505K4982R055K546
12746c8351K0606n182J1569q799k068K234r348k2164K413K1929J7323L967l3043
12733c8914k6585j5823l10p573k5105P059p403j6313n7687l5171M592K7056j4647
12720b06824j2111j2763m2876m4368m1158j7487K6498Q8270K53710L68154K81276
12709F40321O3057l2474o6702o5467r0379r1196r5057p3728n2741n4876j5085
12698F5673j591Q9664K61645L34800K43218N1309m8317j03170p2678p0991o2867
$$ y = [173403, 113550, 89212, 89274, 92049, 78790, 63337, 59707, 63503, 33270, 29589, 16567, -30792, -59796, -46121, 2570, 4873, -11953, -39408, -47748, -19518, -3721, -9410, 11283, -2805, -17554, -37541, -54388, -50123, -29240, -9645, -7712, -20932, -35429, -74934, -49952, -40897, -38351, -17745, -22927, -11358, -20157, -22225, -19991, -29339, -51503, -49090, -27161, -9838, -5871, -38914, -65499, -81322, -81632, -89205, -114310, -107251, -114654, -130967, -188654, -223825, -219233, -192177, -206824, -218935, -231698, -274574, -318942, -360100, -377587, -351089, -262819, -9109, 359045, 640321, 703378, 670904, 604202, 538735, 448356, 357160, 262103, 188375, 135634, 80758, 65673, 64082, 153746, 415391, 750191, 993409, 1044718, 996401, 893231, 820553, 749562, 686695]
12687F86695n1988k5569r164p0332p0110n0001l4426l5906m8708j4426K5024J01979
12675D03068K90065L72260J94825L4915l5386p5835n2575n7289q8755j06896o7818
12664H10579k8220n2473j3711R0145J70283L20386L39511J68606K1836l5308m8481
12653A743153o6833n4137k9338k33j1846l6828k0623M3077K3172k4053N51j7580
12641A548482J5418K5323M5785N6435N3269N6769P7793Q1987R0357P5169L6292
12630B163079L9622M6130L4094K8314Q5858J54603J31087J49074J66832J52985
12620C151678J48688J79886K27838K60350K54121K92605M09470M82910N85402
12611E992948N39836L07509J40463J33037K74520M14508M96981O30391Q59452
$$ y = [686695, 634707, 609138, 599974, 529642, 459532, 409531, 375105, 339199, 290491, 276065, 301089, 403068, 693133, 1065393, 1260218, 1295133, 1259747, 1183912, 1131337, 1074048, 985293, 878397, 810579, 782359, 729886, 716175, 806320, 976603, 1296989, 1636500, 1805106, 1826942, 1791634, 1743153, 1676320, 1622183, 1592845, 1592612, 1580766, 1543938, 1523315, 1566392, 1589564, 1565511, 1566062, 1548482, 1563900, 1589223, 1635008, 1691443, 1744712, 1801481, 1879274, 1961261, 2051618, 2126787, 2163079, 2202701, 2248831, 2282925, 2311239, 2397097, 2551700, 2682787, 2831861, 2998693, 3151678, 3300366, 3480252, 3708090, 3968440, 4222561, 4515166, 4924636, 5407546, 5992948, 6532784, 6840293, 6980756, 7113793, 7388313, 7802821, 8299802, 8930193, 9789645]
12602I789645J071579J287902J587347K020962K408568K644624K766238K917180
12594B6494045L436290M771367O966144J0263800J5181972K2900958L5047871
12587A25062447N1813835O5134110M9514560o654305n3262074n6822763m1386209
12580A33399601k6973123j6871798r607630l873259J225550O549844J3094320
12573I6943505K2228234L5782999N3492168O4695661M0519898k1736537o2258618
12566B29667310n9146121m1927338k7499707j7741475j1272702o950948m119119
12559F1009900k069061m27789J023376K687838N103277Q992818J5092518K4623378
12551A16036255L8766945N5926635O1875590K8388361l2281458o0541183n1565566
$$ y = [9789645, 10861224, 12149126, 13736473, 15757435, 18166003, 20810627, 23576865, 26494045, 29930335, 34701702, 41667846, 51931646, 67113618, 90014576, 125062447, 176876282, 242010392, 291524952, 284870647, 231608573, 174785810, 133399601, 106426478, 89554680, 79947050, 76073791, 77299341, 83849185, 96943505, 119171739, 154954738, 208446906, 273142567, 313662465, 291925928, 229667310, 170521189, 128593851, 101094144, 83352669, 72079967, 65129019, 61009900, 58940839, 58513050, 59536426, 62224264, 67327541, 76320359, 91412877, 116036255, 154803200, 210729835, 272605425, 300993786, 268712328, 208171145, 156605579]
12544A56605579l4863091k2204125j3563459p471602k513248K375490Q042341
12537H6407885J5530872K6247451M1226610N7534678N7601215J5453618m4046205
12530B55956124o4900627n2939507l6267567k4219504j6411704j1336999q043952
12523D1836264n760667m119848l122854k740660k810182k859183k618098k152716
12515A5652056j744346j435210j186012r94108q11744o46270m82609l27648j49142
12506G874967j17145k58836n39823o88012o29793n04033l96299l22424k75271
12497D143331k03555j75259j76632j83736j55549j52722j48875j30548j11852
12488B704603j02554j15750j26369j22294j18236o4663m2586m2584m9530l9734
$$ y = [156605579, 121742488, 99538363, 85974904, 78503302, 75990054, 78365544, 86407885, 101938757, 128186208, 169412818, 226947496, 284548711, 300002329, 255956124, 191055497, 138115990, 101848423, 77628919, 61217215, 49880216, 41836264, 36075597, 31955749, 28832895, 26092235, 23282053, 20422870, 17804772, 15652056, 13907710, 12472500, 11286488, 10292380, 9480636, 8834366, 8351757, 8024109, 7874967, 7757822, 7498986, 6959163, 6271151, 5641358, 5137325, 4741026, 4418602, 4143331, 3939776, 3764517, 3587885, 3404149, 3248600, 3095878, 2947003, 2816455, 2704603, 2602049, 2486299, 2359930, 2237636, 2119400, 2054737, 2012151, 1969567, 1920037, 1880303]
12478A880303l8603n9284o5551p4421q8579r1875q7347o7484p3719o1346l6486
12467A135608n9322p8454j07345j04359r0388j11186q8373q0329k796J68614K42037
12456H23707J69329Q5977J9618n3986p5810o4361p3205p1913j23908r7838r9598
12445D38012j03728p4273O4765K43635K78417J38658L6442K8601k2337m6645o5174
12434I16373m2645m1813o9094k6836l5626q9386j12374q1227r1719r3798j02525
12423A29330m2980Q6524K45568K64440J31632K0732k1386l8285l7149n9063o8351
12412F11012n5073p7464p1839r0672j33668l3693J37963L03349K64467J40969
12402I95351L5728m0025l1086k3232j7243j6577k4070l7350j0541J9362J912j0371
$$ y = [1880303, 1841700, 1782416, 1716865, 1642444, 1553865, 1461990, 1374643, 1307159, 1233440, 1172094, 1135608, 1076286, 997832, 890487, 786128, 695740, 584554, 496181, 415852, 413056, 581670, 823707, 993036, 1079013, 1098631, 1044645, 968835, 904474, 831269, 759356, 635448, 537610, 438012, 334284, 260011, 324776, 568411, 846828, 985486, 1021928, 1050529, 1028192, 981547, 916373, 873728, 831915, 762821, 735985, 700359, 610973, 498599, 417372, 325653, 231855, 129330, 86350, 172874, 418442, 682882, 814514, 835246, 813860, 775575, 738426, 679363, 611012, 555939, 478475, 406636, 315964, 182296, 148603, 286566, 589915, 854382, 995351, 1031079, 991054, 959968, 936736, 919493, 902916, 878846, 841496, 830955, 850317, 852229, 841858]
12390H41858q911l9353l7666m2534j943k0494J910l914L3079J086j7896j7691
12378F87531l9924j5033M661k2214l1207L0362k4456k5154l8923n835K1995J4234
12366E56037j1241o50J844o32L291N807k2283j2041K914k6996j4974n637J0874
12353D86313J628j1412j626m247k3009j7389J1318K3m205J3370J5383j6409k5590
12340D24148J025K899j2215l0141J6129M7272K9979J5127N971j8799j9650k2767
12328D38978l7783J4447p308j5657j3133k4061j9527N961M4127l37k2633j5172
12316C47902p132k0012k7082N644K6082k9185k1014k5901j0887M7282P310j283
12304B91724k7103o048J1540m806k617R078L08J44M3424J3377l797l110j7191
$$ y = [841858, 832947, 793594, 755928, 713394, 711451, 690957, 692867, 688953, 722032, 723118, 705222, 687531, 647607, 632574, 637235, 615021, 583814, 614176, 589720, 564566, 525643, 519808, 541803, 556037, 544796, 544146, 545990, 545358, 548649, 554456, 532173, 520132, 523046, 496050, 481076, 475439, 486313, 487941, 476529, 474903, 470656, 447647, 430258, 441576, 441599, 437394, 450764, 466147, 449738, 424148, 425173, 428072, 415857, 385716, 401845, 449117, 479096, 494223, 500194, 481395, 461745, 438978, 401195, 415642, 408334, 392677, 379544, 355483, 335956, 341917, 386044, 385707, 363074, 347902, 340770, 320758, 293676, 299320, 325402, 296217, 275203, 249302, 238415, 285697, 293007, 291724, 264621, 258573, 270113, 265307, 262690, 271768, 272076, 272220, 315644, 329021, 325224, 322114, 304923]
12291C04923m5221j6097P289K2158k1975j8101j0608p694R938K2839K6793J7163
12279B91407m885k6508k7493l0143k8941J0666L4490L1033J5829K5298p952L1031
12267C13832J5264o710k2385j9715l4158k4921l8458q078O331J2710M4123L5012
12255B72847o014j8533M257j114k8136J0636N7294N0601L5868N5960R9692J49379
12243F82737J81592J53795L4102j19036j70179j10467q7927j3092l063j6526J4247
12232E46183L3333M6519J06987J91835K89860M09933L39446n4925l84303l92591
12222A132277k57470j36308p0264m3949n7069o1324K0969L2431M8342R5896J59644
12211H63175J53256P0099p6996k05624j90325j09359o9844n4375o1864n2409J512
$$ y = [304923, 259702, 243605, 250894, 273052, 251077, 232976, 222368, 214674, 224612, 247451, 274244, 291407, 286522, 260014, 232521, 202378, 173437, 184103, 218593, 249626, 265455, 290753, 282801, 313832, 329096, 322386, 300001, 280286, 246128, 221207, 182749, 174671, 181002, 193712, 237835, 272847, 266833, 248300, 252557, 251443, 223307, 233943, 291237, 341838, 377706, 433666, 533358, 682737, 864329, 1018124, 1052226, 933190, 763011, 652544, 564617, 551525, 548462, 531936, 546183, 579516, 626035, 733022, 924857, 1214717, 1624650, 1964096, 1909171, 1524868, 1132277, 874807, 738499, 668235, 624286, 567217, 505893, 526862, 559293, 607635, 703531, 863175, 1016431, 1086530, 1009534, 803910, 613585, 504226, 434382, 380007, 318143, 265734, 267246]
12200B67246j6242j4691p994M502j643J2202j616k7915L325l7265m8015J8264
12188A50158L3619L652P352l819R055J5782L980L228k6861l686O201k396r557
12175A86708j5334O462q470J5954l2465j3925j3188M724p24N992K5342j506k2562
12162A37008J0474P742K9526N9800N9285M8731J29872J86046K72645Q8876k34804
12151G95201k45350j52433p3744o8578q571J1670K8759N6784R276K3916J6106
12140C93036K9511P9913R5825J59045K26296K52515K01235P9534j30563k15099
12130A171248j65057j05689o2505o6146l2927M4018J27627K54341K95322K22387
12120A682619Q7981O7669Q0415p0052k20589k10602j42926l6413J55744M05981
$$ y = [267246, 251004, 236313, 228319, 232821, 231178, 243380, 241764, 213849, 217174, 179909, 131894, 150158, 183777, 187429, 194781, 190962, 200017, 215799, 219779, 223007, 196146, 192460, 198661, 196265, 186708, 171374, 177836, 169366, 185320, 152855, 138930, 125742, 130466, 129742, 135734, 161076, 159570, 137008, 147482, 155224, 184750, 244550, 303835, 352566, 482438, 668484, 941129, 1030005, 795201, 549851, 397418, 323674, 255096, 246525, 258195, 286954, 343738, 353014, 376930, 393036, 422547, 502460, 598285, 757330, 983626, 1236141, 1437376, 1516910, 1386347, 1171248, 1006191, 900502, 837997, 771851, 738924, 782942, 910569, 1164910, 1460232, 1682619, 1770600, 1838269, 1918684, 1848632, 1628043, 1417441, 1274515, 1238102, 1393846, 1799827]
12110A799827O34272M33994l99885p20320n01539k60585j32995q3722R301Q6670
12100H65018J22401J60673K07734J40061p8023k25660k34576j90797j52160r6925
12090E17746p9594o4804j0311R2953K61746M49268N41992N02783L26338J72311
12080B710428N8094J04105L13795K33533l84036p57514n44764l21066k03417r4144
12070A115014j514N8686J56801L84185O08593N61052j33292p02541o07502l74010
12060A065472k34571j32966o5734j7964r683m2022o6622l0514o348K5364m579
12049D79833Q20L1900k0022j6247K0854K4073K5806J4858J0838J8519L4154Q8022
12037G13408J15655K10213L68561N91319O18347j3756o66622n53428k72774j52012
$$ y = [1799827, 2434099, 2868093, 2468208, 1747888, 1246349, 985764, 852769, 769047, 778348, 865018, 987419, 1148092, 1355826, 1495887, 1417864, 1192204, 957628, 766831, 614671, 517746, 438152, 373348, 363037, 455990, 717736, 1167004, 1708996, 2211779, 2538117, 2710428, 2768522, 2872627, 3186422, 3419955, 3035919, 2278405, 1733641, 1412575, 1209158, 1115014, 1113500, 1172186, 1328987, 1713172, 2321765, 2882817, 2749525, 2046984, 1439482, 1065472, 830901, 697935, 632201, 614237, 604554, 562532, 495910, 465396, 459048, 484412, 479833, 480653, 512553, 492531, 476284, 497138, 521211, 547017, 561875, 572713, 591232, 625386, 713408, 829063, 1039276, 1407837, 1999156, 2617503, 2603747, 1937125, 1383697, 1110923, 958911]
12027I58911r9884n4323j436M1916J00768K03538K19854L458k09006k24469j50707
12016G88620o9576J2348K1177k6279P930L806J0284R857L1257K3634M883M0833
12004H58774L7000J4901L4095O2610N6591L4139O5813J01559N6989Q9632Q5212
11993A497315O3826R8512J83649K82402L24904J54383o2752o4990J4055Q5011
11983B576315J67897K19265K53712K79387L16558L64163M39467N27534O20399
11974E764697O96621Q69453J027761J223271J555631K047800K691276L555906
11966A9432416M788565O761201R834138J4879306K3517086L7732383N7396269
11959A74341364O9590083L8956866l1396564o9679705n8527756l7645750k3499014
$$ y = [958911, 859027, 804704, 803268, 845184, 945952, 1149490, 1369344, 1372802, 1163796, 939327, 788620, 719044, 731392, 752569, 726290, 734220, 738026, 748310, 758167, 789424, 813058, 817941, 858774, 895774, 910675, 944770, 1007380, 1063971, 1098110, 1163923, 1265482, 1322471, 1412103, 1497315, 1561141, 1659653, 1843302, 2125704, 2450608, 2604991, 2542239, 2477249, 2491304, 2576315, 2744212, 2963477, 3217189, 3496576, 3813134, 4177297, 4616764, 5144298, 5764697, 6461318, 7330771, 8358532, 9581803, 11137434, 13185234, 15876510, 19432416, 24220981, 30982182, 40816320, 55695626, 79212712, 116945095, 174341364, 243931447, 282888313, 251491749, 181812044, 123284288, 85638538, 62139524]
11952F2139524j5171043j0222075p179396n252435m019162l134575k452066j949526
11944A2759246j607359j346437j145870r84517q80302p64122o16720n48112m36676
11935D429131l56268k86238k85414k79825k46142k36336k26241j52948j23410
11926B236309j57760j32008o5344j3494j8346n4400o2601j05322r0328n6039q2405
11915A398262q1060l2815k8637q9256q4156n7568m6688o4065o0453k6851n8658
11904G68055l8374p199j1955n793j0959p185j111j9946n0033m0345k9836p3j0042
11891E35204o922p6p74k7020l6176l0568l182L837l406l8752J7210J1113l7461
11878C83027l6459o289M720p400m909l210L831m220l642l3087p486j1838J92J434
$$ y = [62139524, 46968481, 36746406, 29567010, 24314575, 20295413, 17160838, 14708772, 12759246, 11151887, 9805450, 8659580, 7675063, 6794761, 6030639, 5413919, 4865807, 4429131, 4072863, 3786625, 3501211, 3221386, 2975244, 2738908, 2512667, 2359719, 2236309, 2078549, 1946541, 1881197, 1867703, 1849357, 1794957, 1732356, 1627034, 1536706, 1480667, 1398262, 1317202, 1284387, 1255750, 1166494, 1082338, 1024770, 978082, 914017, 853564, 826713, 768055, 729681, 722482, 710527, 704734, 693775, 686590, 685479, 665533, 615500, 575155, 545319, 545246, 535204, 528282, 528206, 527432, 500412, 464236, 433668, 430486, 434323, 430917, 392165, 409375, 420488, 383027, 346568, 340279, 344999, 337599, 332690, 329480, 333311, 329091, 325449, 292362, 284876, 273038, 273230, 274664]
11864B74664J4976j0135o505j9723n713k8820J725k2636o139k5262N212J5950
11852A87594R401O335L693k2229j3478j9767k7292l1886o722j7918k3696m7242
11840c207k4321l7834k0026n2114p3706p6185n4240l3942N4800K74057K96109
11829B49391J47285L4822Q172L3534o445k3796k3044k4072j6456k770M218j0801
11817C70038m4257m2284K646J3913K4836Q611m323r707n390k741r757K425l7123
11804B66887l6107M194m83j7055J0112m935k3536j5013R800J2443j131o307L326
11791B02195J1737l823j6626m107n09q980j2538n941j0967K32p303M499k893r254
11777A35722R616r001K093j0880j8089J6551M7282M7094J0923q834j8023l7439
$$ y = [274664, 289640, 279505, 273000, 253277, 247564, 218744, 220469, 197833, 191694, 166432, 171644, 187594, 196995, 203330, 207023, 184794, 171316, 151549, 124257, 92371, 85649, 67731, 44035, -3207, -27528, -65362, -85388, -137502, -211208, -287393, -341633, -375575, -320775, -46718, 249391, 396676, 431498, 439670, 473204, 466759, 442963, 419919, 395847, 379391, 376621, 380839, 370038, 325781, 283497, 286143, 300056, 324892, 333503, 329180, 319473, 314083, 311342, 301585, 304010, 266887, 230780, 234974, 234491, 217436, 227548, 222613, 199077, 184064, 193864, 206307, 205176, 198869, 202195, 213932, 210109, 193483, 189376, 188867, 179887, 167349, 161408, 150441, 150673, 143370, 147869, 144976, 135722, 145338, 136337, 138430, 127550, 109461, 126012, 173294, 220388, 231311, 222477, 204454, 167015]
11765A67015M201Q573J3070j768l812m564k1173o373k1287J7018K7385k7316j976
11752A48993J3446J8938J7121K5710J8928l5143j3290k3683j8825o668m984n577
11740A34966J5799q582k2053m753J6206k7860r086J3752L7536J7229k430M263
11728A64987l4880k0870k627k728k8055j5790m520M4060M934j3848K7930k3741
11716I4852j5484K6404k944N32L5989N9320j6741j5012K2340L3056L3955j5024
11704B41243l682l4854m3508K843L164j651l7169M865K1151L8291L3046N0598
11692B74337K2856L1215j893p6750n0508l043n0275k0128n354q659j0390J3096
11680A14504R703K4870N726K9072J8754k4697m6997r106P288p606m2634j1238
$$ y = [167015, 171216, 179789, 192859, 191091, 187279, 182715, 161542, 155169, 133882, 150900, 178285, 150969, 148993, 162439, 181377, 198498, 224208, 243136, 207993, 194703, 171020, 152195, 145527, 140543, 134966, 150765, 142183, 120130, 115377, 131583, 103723, 94637, 108389, 145925, 163154, 160724, 164987, 130107, 109237, 106610, 103882, 75827, 60037, 55517, 99577, 104511, 90663, 118593, 94852, 79368, 105772, 102828, 103360, 139349, 198669, 181928, 166916, 189256, 222312, 256267, 241243, 237561, 202707, 159199, 162042, 165206, 163555, 126386, 131251, 152402, 190693, 223739, 274337, 297193, 328408, 326515, 249765, 199257, 196214, 145939, 125811, 120457, 111798, 101408, 114504, 124207, 149077, 154803, 183875, 202629, 177932, 130935, 121829, 129117, 121511, 78877, 67639]
11668F7639L717j6768K2055J9601p893k689r871Q036M36l0859j8569K0300j913
11655E3222j6037m999p030j0358j2030j4174l823J0356J5050L3469L74L738J3916
11642F1674k9378k5713J0287K8020P14k3831N066R795L228l2996j3990j8914R440
11629a6598K6059l130j4056J4313p962J1584O8969M0735P713o5n047j1167j5707
11616I5641M768N7642P6797J56562K00670K49266R4212j78160k16910j22982p4129
11605C43377n7113N361j806j248j359K9217N2624J57621K79288M98354N25250
11594A829566o2243n39042m30028k58878j97391j44379r3641n4267k9761k2346
11584b410j2674J7430J07387K64967M18961L14598n1812k35148k03900j85354
$$ y = [67639, 71356, 54588, 76643, 96244, 88351, 85662, 75791, 83827, 84263, 53404, 34835, 55135, 53222, 37185, 32186, 25156, 14798, 2768, -11406, -15229, -4873, 10177, 43646, 44020, 47758, 61674, 32296, 6583, 16870, 44890, 45604, 21773, 26839, 36634, 39862, 6866, -7124, -26038, -16598, 9461, 6331, -7725, 6588, -1374, 10210, 79179, 119914, 127627, 127562, 122515, 111348, 95641, 100409, 158051, 234848, 391410, 592080, 841346, 935558, 757398, 540488, 417506, 343377, 286264, 291625, 289819, 288571, 287212, 316429, 369053, 526674, 805962, 1304316, 1829566, 1767323, 1228281, 798253, 539375, 341984, 197605, 103964, 49697, 19936, -2410, -15084, 2346, 109733, 374700, 793661, 1108259, 1056447, 821299, 617399, 432045]
11574D32045j24627r0758j13448j03676p0394l6379o8005o1181M4984L43984N90074
11563G42619K67810n0338r3200o3886p9290q7877r3802o1084n9830m8145p4812
11552B98165m7371l267M9864J65623J87376Q3762r625k1189l3042m0835k0823
11541F08638k2079j2033k9706k8027k7066l531M653k5694m1858m5889J833J3388
11529C92629M395K510l077J4909J9622l921K3504M5767j1561j2665r705j0106
11517D52301K190J2123J8665l10j0658J4415K7227J0095K6418N0261R930j9913
11505E92744J89K1664K3603L9789K9960K0989K5579Q302L64K1092K3467J6808
11493H24550O5808O6974P6062M0799K4116K5797N4453R6273M6947P1370P8739
$$ y = [432045, 307418, 216660, 103212, -464, -70858, -107237, -175242, -236423, -191439, 152545, 742619, 1010429, 960091, 866891, 803005, 723715, 635838, 542036, 480952, 421122, 372977, 298165, 250794, 247527, 297391, 463014, 650390, 734152, 724527, 703338, 670296, 629461, 608638, 586559, 574526, 544820, 516793, 489727, 486196, 490849, 465155, 423297, 377408, 379241, 392629, 397024, 399534, 396457, 411366, 430988, 427067, 450571, 496338, 484777, 472112, 462407, 452301, 454491, 466614, 485279, 484969, 474311, 488726, 515953, 526048, 552466, 602727, 612657, 592744, 592933, 614597, 638200, 677989, 707949, 728938, 754517, 762819, 763183, 784275, 807742, 824550, 890358, 957332, 1033394, 1074193, 1098309, 1124106, 1178559, 1274832, 1321779, 1393149, 1471888]
11482A471888P4952N4442P0144Q4830J62439K25078K71562K45415J90685J78180
11472C029615K23725L23738M06698M92371N36594P43092R41061J103495J223320
11463I023709J443588J974812K883167M292012O457237J0221507J7079437K8694110
11455H2069579M2688673L8359567m275523l7623708l4414887k1800273j2576291
11448E2427137p099739l559025n74140K457828O030076J1192964J9919294L6012476
11440A16806871O5162342J02232217P6029794n0430263j00528154p1019097m1438867
11433I6814843k4104687j4447590q604869m681627j666244J198557M731989R805681
11425E9046053J7702645K9490158L7705184J7118331k6581356m0941082l0228956
$$ y = [1471888, 1546840, 1601282, 1671426, 1756256, 1918695, 2143773, 2415335, 2660750, 2851435, 3029615, 3253340, 3577078, 3983776, 4476147, 5012741, 5755833, 6696894, 7800389, 9023709, 10467297, 12442109, 15325276, 19617288, 26074525, 36296032, 53375469, 82069579, 124758252, 163117819, 158842296, 121218588, 86803701, 65003428, 52427137, 45327398, 41768373, 41194233, 43652061, 49682137, 60875101, 80794395, 116806871, 181969213, 284201430, 360231224, 309800961, 209272807, 138253710, 96814843, 72710156, 58262566, 49657697, 44976070, 43309826, 44508383, 49240372, 59046053, 76748698, 106238856, 143944040, 161062371, 134481015, 93539933, 63310977]
11418F3310977j8776161j1590772p466719m981467l508151k549643j882199j464410
11410A1091455j251661j211059j060176r22632p71145o07091m81177l95249l57113
11401D034152l26535k94745k45408k40016j92724j59144j39864j56770j30755
11392B148191j22282r2045j00347q5705n2962p6188q6528n8171m9300n4307o1071
11381A309285n3880o1160o8772o7380l695l0615n4426l1532k2804k4582l0392
11370H60047k1610j1570O661j4283n8050n2417l648K1367l9609o5265l9278j6033
11358E66312J074p387k5688m7324j7142J4283r670K455J5294k2854r633j7258
11346D42462j9182J4649j3580l1437l1764Q521j3729m6947l2858j7985k2410k7588
$$ y = [63310977, 44534816, 32944044, 25477325, 20495858, 16987707, 14438064, 12555865, 11091455, 9839794, 8628735, 7568559, 6645927, 5874782, 5267691, 4786514, 4391265, 4034152, 3707617, 3412872, 3167464, 2927448, 2734724, 2575580, 2435716, 2278946, 2148191, 2025909, 1933864, 1833517, 1747812, 1694850, 1618662, 1532134, 1473963, 1424663, 1370356, 1309285, 1255405, 1194245, 1125473, 1058093, 1054398, 1023783, 969357, 937825, 915021, 890439, 860047, 838437, 826867, 833528, 819245, 761195, 708778, 705130, 726497, 686888, 621623, 582345, 566312, 567386, 559999, 534311, 486987, 469845, 484128, 474458, 476913, 492207, 469353, 459720, 442462, 423280, 437929, 424349, 392912, 361148, 369669, 355940, 308993, 276135, 258150, 235740, 208152]
11334B08152l4583l4212k4774n4331p5847j05939J0559J62752J87673R2334N548
11323C37332n4570m0731J7989m1322p3565o9383o9612q7805r9606j43602j59334
11312d84209K9622M55286M75603J38767j924j2759m2801l2033m1266l7947k5505
11301D20834p983M4064L0517L9971J23777L00438K98295K6948j36992j49481j03517
11290H86871m8197m0348m8358l0433j1375l832P5659J63090K48456M77221N54935
11279B223689J04569m86082n00672l30085j92303j16734n7581l3507j4512j9990
11269E76792r104N1609R1980J31382J80238J42317l6097k16088j90899j26521
11259E95609r1499m4790m7487m7407q180j8402k520P377K7644J7496Q728m079
$$ y = [208152, 173569, 139357, 114583, 60252, -15595, -121534, -110975, 51777, 239450, 331784, 337332, 282762, 242031, 260020, 218698, 145133, 75750, 6138, -81667, -181273, -324875, -484209, -454587, 699, 476302, 615069, 613145, 600386, 557585, 525552, 484286, 446339, 420834, 412851, 456915, 487432, 527403, 651180, 951618, 1249913, 1276861, 1139869, 990388, 886871, 838674, 798326, 749968, 719535, 708160, 704328, 779987, 943077, 1191533, 1668754, 2223689, 2328258, 1842176, 1341504, 1011419, 819116, 702382, 644801, 611294, 596782, 576792, 567688, 619297, 711277, 842659, 1022897, 1165214, 1129117, 913029, 722130, 595609, 504110, 459320, 411833, 364426, 356246, 337844, 335324, 342701, 370345, 387841, 396569, 392490]
11247C92490j9600k5520m8527j0859J2683j5475R231P743n369P828K604k5594
11235B81635k0461K6998P727j0554P325k0202m975K2413L08j9672k3866l8341
11223B08335r201L05J2631J0916k6619R664N0427l3011p374Q655j3541Q002k2375
11210A96814k8335R393k695k8322O669J9391l660K231K0375J6532j8846l0424
11198A59123M98O259j5215j7675p780L0249q939l9639K566J2025Q984n255L7192
11185A62393K2834J5211r718k7144k187M025j0060j526J3266o06k174j0952j2713
11172A40649k916K3165J2650Q646m562k8435j5230k4144j940K4459r940J9873
11160A42275J9905k4242k3865o437K1329J5058k5594K4943o23J468k5126r568
$$ y = [392490, 372890, 347370, 298843, 287984, 300667, 285192, 294423, 302166, 296797, 304625, 307229, 281635, 261174, 288172, 295899, 285345, 292670, 272468, 267493, 289906, 290214, 270542, 246676, 208335, 199134, 199439, 212070, 222986, 196367, 206031, 256458, 223447, 216073, 224728, 211187, 219189, 196814, 168479, 177872, 175177, 146855, 153524, 172915, 169255, 171486, 191861, 208393, 189547, 159123, 159621, 165880, 150665, 132990, 125210, 155459, 146520, 106881, 109447, 121472, 130456, 125201, 162393, 185227, 200438, 190720, 163576, 161389, 165414, 155354, 153828, 167094, 166488, 164314, 153362, 140649, 137733, 160898, 173548, 182194, 177632, 149197, 133967, 109823, 107883, 132342, 122402, 142275, 162180, 137938, 114073, 107636, 128965, 144023, 118429, 143372, 142749, 144217, 119091, 109523]
11148A09523m447l716r516j3402J427J612R241J6891N10J0097P481R655K1563
11135A56919j2487q159q302j1822l1236k6848q429P187J6072J8703K2159K734
11123A16491J7343R290L124J0108j3734j0048j3227k8189R919l949J3942R618
11111A20688j684r281o708j6380q229J5239K3608K9020K6957j6450k9953K648
11099A29475Q84j6080r056O574O382l4965m45R855L4379Q800r192o982L711j3124
11085A10216n258k197j7002J1986j6330j7294o482Q720j2881O249K378j2773L6221
11072H5553J7666j6173J7005K8147j0032j0749l7173j3446J0374k1119l149j1282
11060C5622Q545M4759K4110K3523m220k0011J3862j0661P436J6086J226O317K1035
$$ y = [109523, 105076, 101360, 91844, 78442, 79869, 81481, 90722, 107613, 108123, 118220, 125701, 135356, 156919, 144432, 136273, 127971, 116149, 84913, 58065, 49636, 56823, 72895, 91598, 113757, 116491, 133834, 143124, 146248, 156356, 142622, 132574, 119347, 91158, 101077, 97128, 111070, 120688, 119004, 109723, 103015, 86635, 78406, 93645, 117253, 146273, 173230, 156780, 126827, 129475, 130359, 114279, 105223, 111797, 118179, 83214, 82769, 92624, 127003, 135803, 126611, 119629, 123340, 110216, 104958, 102761, 85759, 97745, 81415, 64121, 57639, 66359, 53478, 59727, 62105, 49332, 85553, 103219, 87046, 104051, 132198, 122166, 111417, 74244, 60798, 71172, 50053, 46904, 35622, 44167, 88926, 113036, 136559, 132339, 112328, 126190, 115529, 122965, 139051, 140277, 146594, 167629]
11047A67629j8471j2407O267M603K1703L5817R921L2193L0419k0604N938L2560
11035B95568L1988M6830K1434j3071o546k5431m4755j2865J9651O3577M4082K1853
11023D42315J4114K746K5137o156n2457m5983n9727l0785j785m461l2084K0937
11011B71811M1868M8475n936k5682m4714o174j3187m5651m4071q178M019N154
10999A77734L233L966J3361J3215l1836l2080m8815j0631K3347j152N540N588
10987A21470k0870j6986J0700q834J8932n907j9820j1434J5238J8638p50j9102
10975H1275j7411q859j8574k0788R251K9828O05J5908K1155r767J042L6228k2240
10962I7653m5841j3651K3055K4969k2271n0859l3743J8280K3272K959J3239J0079
$$ y = [167629, 149158, 136751, 143018, 147621, 169324, 205141, 215062, 247255, 277674, 257070, 263008, 295568, 327556, 374386, 395820, 382749, 376203, 350772, 306017, 293152, 312803, 376380, 420462, 442315, 456429, 459175, 484312, 478156, 425699, 379716, 319989, 289204, 287419, 282958, 250874, 271811, 313679, 362154, 356218, 330536, 285822, 279648, 266461, 220810, 176739, 168561, 172580, 177734, 180967, 184933, 198294, 211509, 179673, 147593, 98778, 88147, 111494, 110342, 115882, 121470, 100600, 83614, 94314, 85480, 104412, 98505, 78685, 67251, 82489, 101127, 100377, 81275, 63864, 55005, 36431, 15643, 24894, 54722, 55327, 71235, 92390, 82623, 83665, 119893, 97653, 51812, 38161, 61216, 86185, 63914, 13055, -20688, -2408, 20864, 23823, 37062, 47141]
10950D7141L159k0177P73O688K3197J3429J3571J2960m6366j5782k078j9345J6205
10937C3375K400L1433K9687k8366k8861N383J5595N04l764j8455j5252J0712J691
10924C6082O910J7343j5158J9345K2204q519K4913p331j5970j8043O673J8851
10912H7300L731k8109k8628R259O725L927J0955K5201Q379k1411p803k2529j0388
10899C6609j837K4890n767k8895n850J285K3697k870L307L2511N612j1559p520
10886F3613P144M85j0542m7558P937K5608J4346Q635J6211L461j6813j3347J8938
10873G8118j2318r457K9326j89j0553q221J53K0134j8046j9902j8665o960k05
10860B3215j454K3316K9544n184k545J2118j8400j1846K0920M940K1959M584j0790
$$ y = [47141, 50300, 30123, 30896, 37584, 60781, 74210, 87781, 100741, 54375, 38593, 36515, 17170, 33375, 35775, 67208, 96895, 68529, 39668, 45051, 60646, 61150, 57386, 38931, 23679, 34391, 36082, 42992, 60335, 45177, 64522, 86726, 78207, 103120, 95789, 79819, 61776, 68449, 87300, 91031, 62922, 34294, 43553, 50278, 54205, 65160, 90361, 98740, 77329, 69526, 46997, 36609, 34772, 59662, 53895, 25000, 19150, 20435, 44132, 41262, 44569, 77080, 82692, 71133, 63613, 70757, 71242, 60700, 13142, 21079, 46687, 61033, 69668, 85879, 89340, 72527, 59180, 78118, 65800, 56343, 85669, 85480, 74927, 66706, 66859, 86993, 68947, 49045, 30380, 23420, 23215, 21761, 45077, 74621, 69437, 66892, 79010, 60610, 48764, 69684, 74624, 96583, 101167, 90377]
10847I0377k5096j4664k606J6570j1825J344O492J0712j9944Q413J1728j5534
10835E5967p329K5316L4526R109j0631L154K6665J5016l2522j2554j7405k6050
10823F3262K2740J9949k7293r096J5097k5852k6975J8736L4281N76j3215P71L225
10810G6206j8428k7628j9919J2635n459J197j5449J3256N344k3054j8832L060
10798a7071K491P953J6429q032p015j2403p253J3716j957j5235L5049L7491k6106
10785A8057Q335j4131j9935J2965J2062M986K0226J1578R072J8769l7827j9523
10773B4634J9339K8994k7326n414J0544K5847j9393l5802j8943j3579M034J6076
10761I011k3868k1513K729K0924K463j0353l7685N717J0345j2390m563r292L784
$$ y = [90377, 65281, 50617, 48011, 64581, 52756, 54100, 60592, 71304, 51360, 59773, 71501, 55967, 48638, 73954, 108480, 117589, 106958, 110112, 136777, 151793, 119271, 106717, 89312, 63262, 86002, 105951, 78658, 69562, 84659, 58807, 31832, 50568, 84849, 85425, 72210, 72981, 76206, 57778, 30150, 10231, 22866, 17407, 18604, 3155, 16411, 21755, -1299, -20131, -17071, -14580, -6627, 9802, 1770, -5245, -17648, -24901, -11185, -13142, -28377, 6672, 44163, 18057, 26392, 12261, -7674, 5291, 17353, 22339, 42565, 54143, 63215, 81984, 44157, 24634, 43973, 72967, 45641, 40227, 50771, 76618, 57225, 21423, 2480, -11099, -7065, 9011, -14857, -36370, -33641, -12717, -10254, -20607, -58292, -52575, -42230, -54620, -59183, -68475, -64691]
10748f4691L0418K2218o906j3740J0875J0028j0890o182j4691j181p869K0200
10736c2411K1135K1953j764k8171N095L079J1176J9516M7991K8992q629N252J397
10723I4611l2406j5063M122R774K3388J2418M4287O0737P039L1681j033l2507
10711B07048k7645k7081p060j5965K4083N1804M1107K5892k9958m920k3194j1749
10699B02362j4940K0258K163j2175k630J3800K2121j261K7973M348n463m926j9072
10686B32558p701k5472j7821J237q254J5851O592J6863J6177M845J0762j4483
10674B31154p193L8700Q240p757m32K850K2841N4863K9174M5826O9227J05224
10662E92717J69574K01760J45030k3530j19160j31460j03227n8557l1233k1219
$$ y = [-64691, -34273, -12055, -18961, -32701, -21826, -11798, -22688, -28870, -43561, -44742, -52611, -32411, -11276, 10677, 8913, -19258, -14163, -11084, 92, 19608, 67599, 96591, 87962, 93214, 94611, 62205, 47142, 51264, 61038, 84426, 96844, 141131, 201868, 208907, 240588, 239555, 207048, 179403, 152322, 145262, 129297, 153380, 205184, 246291, 272183, 242225, 237305, 214111, 202362, 187422, 207680, 209843, 197668, 195038, 208838, 230959, 229698, 257671, 262019, 256556, 251630, 232558, 224857, 199385, 181564, 182801, 174547, 190398, 196990, 213853, 230030, 234875, 245637, 231154, 223961, 262661, 270901, 263144, 262712, 265562, 288403, 343266, 372440, 418266, 487493, 592717, 762291, 964051, 1109081, 1085551, 966391, 834931, 731704, 673147, 641914, 620695]
10652F20695m162L1740P3620J06271J66514K27977L61576M90023L10320j67071
10642B217503l93871k89524k03159j22341p1026M028N4312O5816J11476J77128
10632A550342K46490K74902K87633K67179J83575P9392L8487J06119K82867M79536
10622C796522O77497J000757J344265J775340K308771K929383L346576K988963
10614B0168074J713830J06768r09343j026398n23203L13144J417354K779228M295388
10605B8334842N961398O932125N787860K034232k233729m346139m103181k649114
10597C5718294q17553J148366L273314N611289P801158Q608496O160252J24631
10589F7628247n910547q353777p591584n570930l364044j223886P64515K632388
$$ y = [620695, 616533, 648273, 721893, 828164, 994678, 1222655, 1584231, 2074254, 2384574, 2217503, 1823632, 1534108, 1330949, 1208608, 1137582, 1141610, 1195922, 1261738, 1373214, 1550342, 1796832, 2071734, 2359367, 2626546, 2810121, 2889513, 2928000, 3034119, 3316986, 3796522, 4474019, 5474776, 6819041, 8594381, 10903152, 13832535, 17179111, 20168074, 21881904, 21988672, 21079329, 20052931, 19529728, 19842872, 21260226, 24039454, 28334842, 34296240, 41228365, 47016225, 49050457, 46816728, 42470589, 38367408, 35718294, 34900741, 36049107, 39322421, 44933710, 52734868, 61343364, 67503616, 67628247, 61717700, 53363923, 45772339, 40201409, 36837365, 35613479, 36377994, 39010382]
10581C9010382M133372M399212K321024j861577n605515o821441n944761m354798
10573B5275898k797337j489491l83045M96279J000831Q91268q7465j688020l006422
10564A8212496l387420l044627k411761j812641j362615j026950p82917o02753
10556C780812m59958l57632k92984k67360k30521k35467j88372j80288j07402
10547A460828j04317j12581r1453p9615p1765n4488m0850m9253o4661n3179l7470
10536G01196k4729j79j9170k8469k7121l0357l0125j8754l4301m4117k0525j7184
10524D06165j5568O382J7302j554k0491l0103k1702k612j6070J2610J0946n7504
10512B87801j4668J9471J2058n634p767j1291p495l4540J8352j200q354j2444
$$ y = [39010382, 43143754, 47542966, 49863990, 48002413, 42396898, 35575457, 29630696, 25275898, 22478561, 20989070, 20606025, 21102304, 22103135, 22994403, 22906938, 21218918, 18212496, 14825076, 11780449, 9368688, 7556047, 6193432, 5166482, 4383565, 3780812, 3320854, 2963222, 2670238, 2402878, 2172357, 1936890, 1748518, 1568230, 1460828, 1356511, 1243930, 1152477, 1072862, 1001097, 946609, 905759, 856506, 791845, 738666, 701196, 676467, 676288, 657118, 628649, 601528, 571171, 541046, 522292, 487991, 443874, 423349, 406165, 390597, 396979, 414281, 412727, 392236, 362133, 340431, 337819, 321749, 334359, 345305, 287801, 273133, 292604, 304662, 299028, 291261, 279970, 272475, 237935, 256287, 255087, 246733, 234289]
10500B34289j5817j3310r74J2231k3262n0941J036n210j3627o234J9773p439k0135
10487A10380M435P984Q514J9533O556j7169k4173m9748k2861l814j8058q878K3953
10474C6654K2243J0148J892q474k6861J1294M950k5938N178J1290K1475L6053
10462I9904L0067Q884K6583J331m1854m470L553j362j1275J6131J9147K691K6090
10449A75420K9985L4309J32p346j6956k6593j7404l3596K0820K2463r912K6846
10437A98168j3605k8446M1621o002m867j2694N065l1466k1574J5202N215j5892
10425A30725J7960L5211O657n621O785k482o470l062q730k0034p501J0129j9300
10412A34267J8309k684j1786o952p034k550M228j5059p829M8537O326J7450K5343
$$ y = [234289, 218472, 205162, 204188, 216419, 193157, 142216, 143252, 138042, 124415, 118181, 137954, 130515, 110380, 114815, 122799, 131313, 150846, 157402, 140233, 116060, 66312, 43451, 39637, 21579, 12701, 36654, 58897, 69045, 70937, 62463, 35602, 46896, 51846, 25908, 31086, 42376, 63851, 99904, 129971, 138855, 165438, 166769, 124915, 120445, 123998, 122636, 111361, 127492, 146639, 149330, 175420, 205405, 239714, 239846, 232500, 215544, 188951, 171547, 137951, 158771, 181234, 171322, 198168, 184563, 156117, 197738, 191736, 186869, 174175, 179240, 147774, 126200, 141402, 146617, 130725, 148685, 183896, 190553, 184932, 191717, 189235, 182765, 179703, 170973, 150939, 143438, 153567, 134267, 152576, 149892, 138106, 131154, 124120, 121570, 125798, 110739, 102910, 151447, 157773, 175223, 200566]
10399B00566j3054l7104j8238j5646r668J2403N82M216p820J0142J3739K3204
10387A63322q861j6577J0452K3660K824k6350q216l529l0340q445j5567j0001
10375G2372J1345p707q621Q001P282j1285m371J997k0337r753J5232R355J2395
10362G5905R708J5331J1583l966j6998m060R123K759k0622L639Q349p296R517
10349I2972m309n570j2407K0634J8498o927J137O501j6676k3865p38k6308j9491
10336B3451J2966M3582l508k3601j6462m619L1884K8578m553q944k0710l316j3757
10323D0991J660O54J0599J3308Q387p9j4931k7527J0731K7981K5741k3953k9421
10310D4141j8054K2545K7611p965k1990J6970j4418m8187P18N4035M7617k4342
$$ y = [200566, 187512, 150408, 132170, 116524, 106856, 119259, 119841, 124057, 116237, 126379, 140118, 163322, 154461, 137884, 148336, 171996, 174820, 148470, 140254, 136725, 106385, 97940, 82373, 72372, 83717, 76010, 67389, 75390, 82672, 71387, 67016, 69013, 48676, 38923, 54155, 63510, 75905, 85613, 100944, 112527, 108561, 91563, 87503, 96626, 99385, 78763, 82402, 90751, 83455, 92972, 88663, 83093, 70686, 91320, 109818, 102891, 104028, 110529, 93853, 69988, 69250, 42942, 23451, 36417, 79999, 76491, 52890, 36428, 31809, 63693, 92271, 87718, 78774, 58064, 54748, 40991, 42651, 43305, 53904, 67212, 75599, 75520, 60589, 33062, 43793, 71774, 97515, 73562, 44141, 26087, 48632, 76243, 68278, 46288, 63258, 48840, 653, 1371, 55406, 103023, 78681]
10298G8681j6179Q52J2556n774o209J2977N774K0622p639k4744n287m680Q493
10285F9443R781j6579q644J061n518n046k1795K013K8150O150L992J8050k3043
10272E8015k9502p128R872J0345J5056N734J6053k916M404j7652N988L870J393
10259G3532j9407l63n27j3437j2596j1436l0836K3783M2206J9477j4230K3587
10247G9753J4861k6595P585K8628j6678j8555j1096O548j2379l2956j9345J6674
10235A6445K7446Q382n45m513p194O512j5014j7812L2084K7785J9053o802k6640
10222E9187j4831j1258M664J0588M271L8068J5584M279J2943N005o770j2299l3698
10209G5733m1793k6165j276P586K8680J6850n120j4213K6538j2370j0156J6389
$$ y = [78681, 62502, 63354, 75910, 70136, 63927, 76904, 82678, 103300, 95661, 70917, 65630, 60950, 69443, 79224, 62645, 54001, 55062, 49544, 44498, 22703, 24716, 52866, 59016, 63008, 81058, 58015, 28513, 21385, 31257, 41602, 56658, 62392, 78445, 75529, 79933, 62281, 68269, 72139, 73532, 54125, 53762, 53235, 39798, 27202, 15766, -15070, 8713, 50919, 70396, 56166, 79753, 94614, 68019, 75604, 104232, 87554, 68999, 57903, 64451, 52072, 19116, -229, 16445, 43891, 52273, 51728, 47215, 40021, 46533, 31519, 13707, 45791, 73576, 92629, 85827, 59187, 44356, 33098, 37762, 48350, 52621, 90689, 106273, 110552, 123495, 128500, 121730, 109431, 75733, 33940, 7775, 6499, 14085, 42765, 59615, 54495, 40282, 66820, 54450, 44294, 60683]
10197F0683k9924K2246L3756j0405k1984l3799P526J9782j85K8270J6257j7232
10185G4991o175j8798J3443J8538J3636L4379K7497n754k9306K6255M215k6243
10173A26678K2369P278M7812J9890O771J3689O0670M9489J3483m2661m0590l7481
10161B47397j9603q526R527L9776M1839M7897N8763m49l4970l4950j5117m4131
10149B87453l1640j7911p047N052K1388J0742K7731Q905j9814m039n6786m4952
10137A79082J696j8786o878j0047k3431J9585J5631R795R63J4730j4731l2261
10125A35348l9070K60j9427j3177m818j2274p531O414K0437P461j4404J9729L594
10112H2542O764j5262k0891M002J2996N985p638J4590K4119r357l3151k8513J8650
$$ y = [60683, 30759, 53005, 86761, 76356, 54372, 20573, 28099, 47881, 47696, 75966, 92223, 74991, 68816, 50018, 63461, 81999, 95635, 130014, 157511, 151757, 122451, 148706, 152921, 126678, 149047, 156325, 204137, 224027, 230798, 244487, 305157, 354646, 368129, 325468, 284878, 247397, 227794, 219268, 228795, 268571, 310410, 358307, 417070, 416621, 381651, 346701, 331584, 287453, 255813, 237902, 230855, 235907, 257295, 268037, 295768, 304673, 284859, 280820, 224034, 179082, 180778, 161992, 155114, 145067, 121636, 141221, 156852, 166647, 167610, 182340, 167609, 135348, 96278, 96538, 77111, 63934, 59116, 46842, 39311, 45725, 66162, 73623, 59219, 78948, 82542, 89306, 74044, 53153, 57155, 70151, 76136, 68498, 83088, 107207, 97850, 64699, 36186, 54836]
10099E4836J607L770k734K3438O392L584l3237j8882N160K5255J1488m7992k4318
10086H367R618M100J147R176Q287J1302R320K0015k9280l0782k1034j4144J3956
10073D8J9155K3380L3053K3413r979q035M976M982q416j0445j8587r591J0281
10060E4235l988K3924J4614k6897o607j7110O208J5135k0595j6296K3090J7259
10048F2972J4773k0017j9567m255J3001O377j8052k2037J1880K8009K9998j8143
10036F4939k6059j6198N391Q738k7010k0874K2821O276R152J5552j6514l2856
10024f642j0918K3574J9331J7143k0019j0254J0806J6272K5441k2422k371K5239
10012F5180j64l2302p338L3633J581J0887N308k0814J0441l800k7576k1307k342
$$ y = [54836, 56443, 60213, 57479, 80917, 87309, 90893, 57656, 38774, 43934, 69189, 80677, 32685, 8367, 17985, 22085, 23232, 32408, 40695, 51997, 61317, 81332, 52052, 21270, 236, -13908, 48, 19203, 42583, 75636, 99049, 89070, 81035, 86011, 90993, 82577, 72132, 53545, 43954, 54235, 50247, 74171, 88785, 61888, 55281, 38171, 44379, 59514, 38919, 22623, 45713, 62972, 77745, 57728, 38161, 33906, 46907, 53284, 35232, 13195, 25075, 53084, 83082, 64939, 38880, 22682, 28073, 36811, 9801, -11073, 11748, 18024, 27176, 42728, 26214, -6642, -17560, 6014, 25345, 42488, 22469, 12215, 23021, 39293, 64734, 42312, 39941, 65180, 65016, 32714, 25376, 59009, 60590, 71477, 76785, 55971, 66412, 62612, 35036, 13729, 11387]
9999A1387J4773K304m2816m615J6403K6613J1523o5K2188M2056k5203l9201j316
9986C4031k8567k5781J1040K9381L0888P450j4813k0156k394Q757O454P816K3673
9973F7779J4272o347l9505n0948R210K5959l159J8722r603j0883N782L3140j591
9960E2828q640J1387L027m855m9764r276J2196L181L906K099j0617r49N873J1979
9946B2375q621m6N266K941j6606k3701K1275J1293J6758N354J5118J1873p250
9933E6029j1534j0746M751J9357j8180J1116J321k2149j5040L957K1290J4311
9921E4483Q295j4060R118J3419J661o411J1756j3231n895j3711o930j8517j8472
9908A505r005o162K72J1790K6999J0004R067K3898j3832m0607j9901L877k0807
$$ y = [11387, 26160, 28464, -14352, -18967, -2564, 24049, 35572, 35507, 57695, 99751, 74548, 35347, 34031, 5464, -20317, -9277, 20104, 50992, 58442, 43629, 23473, 21079, 29836, 36290, 44106, 67779, 82051, 75704, 36199, -14749, -5539, 20420, 17261, 35983, 26380, 15497, 21279, 54419, 52828, 44188, 55575, 58602, 53747, 3983, -5293, 6903, 10084, 13990, 16089, 5472, 4523, 10396, 22375, 13754, 13708, 18974, 21915, 5309, -18392, 2883, 14176, 30934, 36288, 51406, 63279, 56029, 44495, 33749, 38500, 57857, 39677, 50793, 52114, 29965, 14925, 18882, 40172, 54483, 62778, 48718, 57836, 71255, 72916, 66505, 78261, 65030, 59135, 45424, 38494, 19977, 1505, -7500, -13662, -13390, -1600, 25399, 35403, 44470, 68368, 54536, 13929, -5972, -2095, -22902]
9895b2902P273K2328j0320j3128j6482O394K3219J8306j0324o654J5575J5183
9883B8468k912L183J8945j2260J8905l402j863J6355J3939q957p446j95Q765j1553
9869E9972j0686j7025k3998k1458k931K8085J9709K9926j079j2821J6377j695
9857F2376j8484l5234L444L7636J810l906l09K313j1725k5528j9569K526K0426
9844A5776k001j4399K2275L7962J5145j7852l0493k013R336K088j7593j1643r389
9831b801J7625j0570k670J1482o840J2671P215j9969l764M506R308J3764j7820
9818A2137N518J6930m714P902j516K1733j6512l6505j0346P999j4829L7249p16
9805B4330j9275J4366J6679J075J2878R533j7941k0888j162Q910J2440R907L524
$$ y = [-22902, -15629, 6699, -3621, -16749, -33231, -26837, -3618, 14688, 4364, -2290, 13285, 28468, 25556, 28739, 47684, 35424, 54329, 50927, 49064, 65419, 79358, 70401, 62955, 62760, 71525, 59972, 49286, 32261, 8263, -13195, -16126, 11959, 31668, 61594, 60515, 47694, 64071, 62376, 43892, 8658, 12102, 49738, 51548, 47642, 47333, 49646, 37921, 12393, -7176, -4650, 15776, 13775, -624, 21651, 59613, 74758, 56906, 26413, 24400, 33736, 35824, 18231, 6588, -2801, 14824, 4254, 1584, 13066, 6226, 18897, 26112, 6143, 2379, 6885, 16193, 29957, 12137, 17655, 34585, 29871, 37773, 36257, 57990, 41478, 4973, -5373, 2626, -12203, 25046, 24330, 5055, 19421, 36100, 37175, 50053, 59586, 41645, 20757, 19595, 28505, 40945, 50852, 54376]
9792E4376l987j6583J7670J2095K461k0726k6046n036j5894J0792K1221J8293
9780D8636K0409j2756l5925J2875L0332l412l9854p964L74l1767J6487L3110L1315
9767F1860J7794j2261r248l7858k625O579P454Q936j059m0671k2034L5284J4438
9754B6589M801j486j4380J9785L8648j3395J6832K966k5833j5339k6189J05L03
9741A3407j3344l0203J3770K3054K8938K8104k5911k7137K1479k448j7529k30
9729A1950J7762m691K282q860k4224n828M467L4908K570k9291k0105J3454m461
9716a0067n314J0973j8549K6209L7385k5152r870J5356p894K4806K2936k283k9780
9703B8756j2712j5373l3465P301L4066J5743K1142J8088O610l5421k6688K6759
$$ y = [54376, 50389, 33806, 51476, 63571, 66032, 45306, 19260, 14224, -1670, 9122, 30343, 48636, 69045, 56289, 20364, 33239, 63571, 60159, 20305, 12341, 12715, -19052, -2565, 30545, 61860, 79654, 67393, 58145, 20287, 17662, 24241, 31695, 40631, 39572, -1099, -23133, 12151, 26589, 31390, 29904, 15524, 35309, 73957, 60562, 77394, 80360, 54527, 39188, 12999, 13104, 13407, 63, -30140, -16370, 6684, 35622, 63726, 37815, 10678, 32157, 29709, 12180, 11950, 29712, 25021, 27303, 18443, -5781, -11609, -7142, 27766, 30336, 1045, -19060, -5606, -10067, -15381, -4408, -22957, 3252, 40637, 15485, 5615, 20971, 13077, 37883, 60819, 58536, 28756, 16044, 671, -32794, -25493, 8573, 24316, 45458, 63546, 70156, 34735, 8047, 34806]
9691C4806L9764O436l6322O894m420q013J3094J0254k1643k5605J1191J2556J3908
9678E2900J7876K871J9115j2430k8165j1406n83p687q48j8304j7394k00L580J7746
9664A7071J0327j4188J5628J0721j4371j4419q793o4o286K0435p448j3040R159
9651D732j004J8431K79L0982j355j6771j3760j2781j0201J0987K7050L3958r234
9638F1313r648k2930k9968J403J8722k543J258J2214j7849o724K5807n881l197
9625B1977K206J9529N115J7263j8025j4826L610L633j5228k6998j94L0107j947
9612B6222O236M4925J2908L371Q240n1510q637j3389j7281M3477K7828k6293l8460
9599A7637p711K2520J8917J4640r609p83j4935j7869j4488J3498k1897N594l263
$$ y = [34806, 74570, 81006, 44684, 51578, 47158, 39145, 52239, 62493, 40850, 15245, 26436, 38992, 52900, 70776, 73647, 92762, 80332, 52167, 40761, 40178, 32491, 31643, 13339, -4055, -4255, -675, 17071, 27398, 13210, 28838, 39559, 25188, 10769, 1976, 1912, -4374, 16061, 8613, -4427, 4732, 3728, 22159, 22438, 53420, 52065, 35294, 21534, 8753, -1448, 9539, 36589, 70547, 61313, 51665, 28735, -1233, 170, 18892, 16349, 17607, 29821, 11972, 5248, 31055, 25174, 21977, 24183, 43712, 48827, 66090, 48065, 33239, 36849, 40482, 25254, -1744, -1938, 28169, 26222, 32458, 77383, 90291, 93662, 101902, 50392, 41755, 28366, 11085, 54562, 82390, 56097, 17637, 9926, 32446, 51363, 66003, 56394, 55611, 40676, 22807, 8319, 21817, -80, 5514, 2251]
9586B251Q87J7945K2554j0930J088J4522o568j6573K7703P551N012J3448K6886
9573A05776N032l1719m633L5694J9269k0900l7556J469K1159j0266j788J1168
9561I2705k1658k2050j9556j1216J48J8327J543k1616m922j4375j7363k5208J2413
9548c2828j289N98K261K7626J320Q800K0458o964K2k3463j7649K4068J1321j0849
9534C432k50k245j1713K1572J1547J3292k411k2729L899L2432K9101q28m7363
9521B7736k3974J3202K3801J3530j6688j8229l993j3234K3046L292r396j0327
9509H766o034j365J2105K9538J603k1036j6435j7871K3496j0467q798j9348J4460
9496a1386L2847R561j8530P542K5074K4721q155J447j0026r657L975k7375k4347
$$ y = [2251, 3138, 21083, 43637, 32707, 33795, 48317, 41749, 25176, 52879, 60430, 65442, 78890, 105776, 110808, 79089, 74456, 110150, 129419, 108519, 70963, 72432, 93591, 83325, 81537, 92705, 71047, 48997, 29441, 18225, 18373, 36700, 38243, 16627, 11705, -2670, -20033, -45241, -32828, -34117, -33519, -31258, -3632, -2312, 6488, 26946, 19982, 20004, -3459, -21108, 2960, 14281, 3432, 3182, 937, -10776, 10796, 22343, 35635, 33224, 10495, 14394, 46826, 75927, 75099, 27736, 3762, 16964, 40765, 54295, 37607, 19378, 15385, 2151, 25197, 28489, 19093, 8766, 2732, 1367, 13472, 43010, 44613, 23577, 7142, -10729, 12767, 2300, -6498, -25846, -11386, 21461, 31022, 12492, 20034, 45108, 69829, 61674, 63121, 53095, 43438, 47413, 20038, -4309]
9483d309j6951J1633R487p075j6749j2997J7294J4512Q331K069r566J1155O239
9470A3073k7765m72K8083L2044r836o854O540J6435j5917p922M121K485J6339
9457E0354R672m5070l5514R180L0505J3441J1896j557k1634j188J6964k0175q22
9444A6052K3159K4815k0819M336J997j4736j6422k426J8917J6855J0877j2358
9432E0247Q180p864k3495K212j4494k1021J9065p91l6464l787K6941M988J6936
9419B0653J5209P530j9594r176j9888M956O109K055P45j9637P990K3266Q957n57
9405B8618K1277M125j9935O406j8761l1155n485n909P577Q840p638J9599J4123
9392B1682n457n905J7178J9568j3803j1754J2810J7607j0241j286k2926J9288
$$ y = [-4309, -21260, -9627, -140, -7215, -23964, -36961, -19667, -5155, 3176, 5245, -4321, 6834, 13073, -14692, -15164, 12919, 44963, 35127, 28273, 34813, 51248, 35331, 27409, 31530, 34015, 50354, 60026, 14956, -20558, -11378, 19127, 32568, 44464, 42907, 21273, 20085, 37049, 16874, 16052, 39211, 64026, 43207, 47543, 49540, 34804, 18382, 15956, 34873, 51728, 62605, 50247, 58427, 50563, 27068, 29280, 14786, -6235, 12830, 12039, -24425, -28212, -1271, 3717, 20653, 35862, 43392, 23798, 14622, -5266, -310, 5799, 7854, 8599, -11038, -3048, 20218, 29175, 28618, 49895, 54020, 34085, 40491, 21730, -9425, -14910, -20819, -13242, -4402, -12040, 7559, 21682, 16225, 10320, 27498, 47066, 33263, 21509, 34319, 51926, 41685, 40399, 17473, 36761]
9380C6761k7920m3584n677P486j3718J9687K3158n501k502K1385O128j1679o871
9367b847j7019j6825K884K3460J15K613K4803J2266R30l762j6046n734n749r614
9353a0525K6965O449K1274P890l2149l6593k480K6667J1935p622R43J4153r580
9340A7327l5928R507L6779j9095m245j101k5433M816M3273j0401L561J5524j9109
9327A5475j3363J3925o873J5949K1166j2810k9436R688J3968j1015q157j2200
9315c683Q033j6540p710l520N257M653L3101J0096k2522o239J3428J566k504k201
9301A1215K2174j3440K4755L2035k2197k2943j746o071j6133k3494j4713K921
9289b7637K2221J404K8750K8220L277j3591j3697J55k0525l4134k917p633Q996
$$ y = [36761, 8841, -34743, -40420, -32934, -46652, -26965, -3807, -9308, -11810, 9575, 15703, 4024, -2847, -19866, -36691, -33807, -10347, -10232, -7619, 17184, 29450, 30380, 26618, 10572, 4838, -911, -10525, 16440, 22889, 44163, 52053, 19904, -16689, -19169, 7498, 19433, 11811, 12754, 26907, 17327, -18601, -9094, 27685, 8590, 4345, 3244, -22189, -17373, 25900, 15499, 19060, 34584, 15475, 2112, 16037, 9164, 25113, 46279, 33469, 4033, 13721, 27689, 16674, 8517, -3683, 4350, -12190, -19900, -23420, -18163, -13510, 19591, 29687, 7165, 926, 14354, 15920, 13416, 11215, 33389, 19949, 44704, 76739, 54542, 31599, 29853, 23782, 7649, -15845, -30558, -27637, -5416, -4012, 24738, 52958, 56235, 42644, 28947, 29102, 8577, -25557, -28474, -36107, -27111]
9276b7111J1728J1594p260K2736Q574J9843l843k4502j3608J9012K1525J1781
9264E0469K670j8861k6186l7822l3440j703L3122J8279J6845J8340p983k3942
9252a0212J6663J6750J2796P259j1517m242J6737j7469k8420j9482q40J1453K2712
9239A2188K5944k20j5722l975J6377q866Q325k628l1588J780k4887Q314J5021
9226F3R234M6137L5132m532k2169j7822l3269q578J2352j657k1885p28J4421M2419
9212D9118N927j5721j8990k6906j9709j3584P574J9308J4236J5977L0834l090
9200D4974m4750k732M183j4910O379K2153l882k2870j8754k193P140K5303n156
9187e115j3364j378j1391m324j7428K4222O495m65K3240L8140L1112k614j9819
$$ y = [-27111, -15383, -3789, -11049, 11687, 20261, 40104, 36261, 11759, -1849, 17163, 38688, 50469, 53139, 34278, 8092, -29730, -63170, -64873, -31751, -13472, 3373, 21713, 13730, -10212, 6451, 23201, 35997, 43256, 31739, 27497, 44234, 26765, -1655, -21137, -21977, -10524, 12188, 38132, 37912, 22190, 18215, 34592, 25726, 34051, 31423, -165, 1615, -23272, -14958, 63, 9297, 55434, 90566, 86034, 63865, 46043, 12774, 4196, 16548, 14891, -6994, -7722, 6699, 49118, 55045, 39324, 20334, -6572, -26281, -39865, -32291, -12983, 1253, 17230, 48064, 44974, 224, -2508, 1675, -13235, -6856, 15297, 11415, -11455, -30209, -32402, -25262, 41, -5115, -18479, -19857, -31248, -35572, -53000, -28778, -22283, -22748, 492, 38632, 69744, 67130, 47311]
9174D7311l2109L842k0703J598L2132N071p007j1300l1174l910N284J0492Q547
9161H074p621Q984J3146j525q774J5959J1740J1627n797j1743k360N456m41l914
9147C2811j8363j3702P574N214o705p819k3714J0436J891M545K402O542k5548
9134b4436N833J759M220J1180L786l478k9915l977M0549j177k0746N459m24j6836
9120b8203Q377K0401J675n561j808J0954j0504j870R874M143j8328r521K3689
9107C318j6854j3287R752J1457L3462K6759j387k0576k4302n27j5527j7286l515
9094b8513J4325k482L19K2868K2914J3717Q720r088k0399K963Q866o073J630j004
9080B8763o735J8077K2504j9416k7902J580J3696J838R113j2231L471j2907k1470
$$ y = [47311, 15202, 19044, -1659, -61, 32071, 37142, 30135, 18835, -12339, -16249, -10965, -473, 8074, 453, 9437, 22583, 21058, 12284, 28243, 39983, 51610, 45813, 34070, 31710, 37166, 36725, 32811, 14448, 746, 8320, 13534, 6829, -990, -24704, -14268, -12377, -7832, -5430, 1112, -24436, -18603, -16844, -12624, -1444, 2342, -1136, -31051, -35028, 5521, 4344, -16402, -10943, -11367, -28203, -19826, 575, 2250, -3311, -5119, 5835, -4669, -6539, 3335, 7478, -10850, -20371, 3318, -13536, -26823, -17071, -5614, 27848, 54607, 53220, 32644, 8342, 7815, -7712, -24998, -28513, -14188, -16670, -16351, 6517, 29431, 43148, 51868, 42780, 22381, 25344, 34210, 28137, 29767, 28763, 22028, 40105, 62609, 43193, 15291, 16871, 30567, 32405, 41518, 29287, 32758, 19851, -1619]
9067a619p076o677O391M1203l74l395M455r85J5992K1568m013j5294m2815p365
9053dO75L8802J5551l4997M471M428L470O611J5096j3656j4542N036k787j6306
9039A1848r584m306j2119j1203m205J7506J2864J7510O615j3474J4066R601k7897
9026G222N832R840J963P565j6222K16N246J8721M986m5019l2878J3595L2697q591
9012E173L79j8561j6293K980K2607J9204j6916k1947j718Q234J2770L708j50n032
8998e562o862p243J9381L0897R534j741j2751j9674J0010J8932k3067j4236K4042
8985B1660M444R433M516k3195j1061L3970K8568j4566m5151k8820J3945L2485
8973B6228J2849m0956p582j835K460K3399J3140n251o134K8803Q284r600k3900
$$ y = [-1619, -8695, -15372, -8981, 32222, 31848, 28453, 32908, 31923, 47915, 69483, 65470, 50176, 7361, -4, 671, 39473, 55024, 20027, 24498, 28926, 32396, 39007, 54103, 40447, 25905, 30941, 28154, 11848, 2264, -2042, -14161, -25364, -29569, -12063, 801, 18311, 24926, 11452, 25518, 35119, 7222, 13054, 22894, 24857, 32422, 16200, 16416, 21662, 40383, 45369, 350, -32528, -18933, 13764, 5173, 5552, -13009, -29302, -26322, -3715, 15489, -1427, -23374, -25092, -16858, -4088, -380, -530, -5562, -12424, -19667, -286, 30611, 40145, 38404, 25653, 5979, 15989, 34921, 11854, -2382, 21660, 26104, 35537, 40053, 16858, 5797, 39767, 68335, 53769, 8618, -20202, -6257, 26228, 39077, -1879, -9461, -11296, -8836, 14563, 27703, 22452, 16318, 45121, 53405, 43805, 19905]
8960A9905k2894r246J4807j4597r349o098m319L838J8503k9410J800o15J3682
8947b3993K5140M5j1403j2744k7718Q940Q832K1720L4231n0748j0505L9953J8152
8934A9902K214j2240j3329q793O095q620r743K0699k834j5578o01n336j4563r599
8920e2326q57n555K348K3772L6596N0972J1026k3947k7503j3003j8953J595K9014
8907A3179K1810P030J4106m541J826k0115j5009l1373o242J1135J0085L267k3772
8894a8614k0772j9254M132J1595k0994J0377M0600J9099j4505R92j1151J7209
8882a286k941n977R953r755j4080J358k5388K301M6605R630n836n490J873j0123
8868i156j83J2751j5904K4225O50q185J740L377j6381k275K754J4378k5660R036
$$ y = [19905, -2989, -12235, 2572, -12025, -21374, -27472, -31791, -27953, -9450, -38860, -37060, -37675, -23993, 1147, 1192, -10211, -22955, -50673, -41733, -32901, -11181, 23050, -27698, -38203, 1750, 19902, 22116, 9876, -3453, -12246, -6151, -14771, -24514, -3815, -6649, -22227, -22828, -28164, -42727, -52326, -53183, -58738, -56390, -32618, 3978, 54950, 65976, 42029, 14526, 1523, -17430, -15835, 13179, 34989, 42019, 56125, 51584, 53410, 33295, 18286, -13087, -19329, -8194, 1891, 5158, -18614, -39386, -58640, -54508, -42913, -63907, -53530, -12930, 6169, -8336, -7344, -18495, -1286, -4227, -10204, -251, -10006, -24086, -22728, -48116, -45815, 790, 10420, 4584, -906, 967, -9156, -9339, 3412, -12492, 11733, 12383, 4198, 5938, 9315, -7066, -9341, -6587, 7791, -17869, -8833]
8854h833J3042K1868R620R152j6080J229K5726j4791k8876M449p593r191N935
8841E657J7719M175q586J4554O98M357j5545j8189j7424Q494K176j74M564J0876
8827A3352j6931q558o311M9034k731j7106j1697j6216n140K2573n54M997j9933
8814a5221j5011L8063L1761k1816l0410J4882J9303j309l14j7583j5172P137k769
8801h459J714R879P219j996k999J0671P235j5542r625j1265q905q716r255J5515
8787b4529O058K7405p415j3540K1129K082j5802K195J430j3228L483L345l5211
8774d2598M290L4883K8564J2287j5443K5755m61j9060J200L131K5080O954j4795
8761D9787P692o779l4774N811J2557j2063j2673k492j8230j3640J7273K811j3836
$$ y = [-8833, 4209, 26077, 35697, 44849, 28769, 29998, 55724, 40933, 12057, 16506, 8913, -278, 5657, 23376, 27551, 18965, 33519, 34217, 38574, 23029, 4840, -12584, -4090, -1914, -2088, 2476, 13352, -3579, -12137, -18448, 30586, 27855, 10749, -948, -17164, -22304, 269, -285, 4712, -15221, -30232, 7831, 39592, 17776, -12634, 2248, 21551, 20242, 19928, 2345, -12827, -5690, -8459, -6745, 3134, 10353, 8357, 5358, 16029, 23264, 7722, -1903, -13168, -22073, -30789, -40044, -24529, -18471, 8934, 1519, -12021, 9108, 11190, -4612, -2417, -987, -14215, -10732, -7387, -42598, -38308, -3425, 25139, 37426, 21983, 47738, 47277, 28217, 29417, 32548, 57628, 64582, 49787, 57479, 50700, 15926, 21737, 34294, 22231, 9558, 7066, -11164, -24804, -7531, -4720, -18556]
8748a8556L643l07O911K3695J6729o247l9558l6338J4275L2208N408J4554l775
8735A2642j0246P529O978k429J542j5293r403k077q234j1776Q953m679K778o186
8721b9901M763L1262p975j8545j271k757m948M71j8402q40K1052L0228j327l045
8707a235Q289J0463p232J020o514n600K6489J686q933j4639K508K0572j8892M347
8693A2329j1697M764O999j0389Q498K1488K3889l402l0717j4775j464j1548J3753
8680G728J6518L192j5773Q297j7721Q272Q924k1604j3903n938j7625q270J9775
8667b8128K5603O175K357J338m319K5383l1342j2085R047N708l934J634J166N749
8653D352p208P462j0373M81J2584K4081j8886k1966J2502j1770k5480L5439J9830
$$ y = [-18556, -14913, -15220, -8309, 15386, 32115, 25868, -13690, -50028, -35753, -3545, 1863, 16417, 12642, 2396, 9925, 16903, 14474, 16016, 723, -8680, -10757, -18991, -30767, -21814, -26493, -23715, -29901, -25138, 6124, -1851, -20396, -21667, -24424, -29372, -28901, -47303, -48143, -27091, 3137, 1810, -1235, 7054, 17517, 10285, 11305, 4791, -809, 25680, 27366, 18433, 3794, 6302, 26874, 7982, 12329, 632, 5396, 12395, 2006, 10504, 31992, 55881, 52479, 21762, 6987, 5523, -6025, 7728, 24246, 27438, 11665, 19962, 2241, 10513, 19437, -2167, -16070, -22008, -39633, -47903, -28128, -2525, 3650, 6007, 7345, 3026, 28409, -2933, -15018, -5971, -263, -4197, -2563, -1397, 4352, -2856, 4606, -5767, -5286, 7298, 31379, 12493, -9473, 3029, -8741, -34221, 1218, 21048]
8640B1048R51k0043J3785r718o064J5340K7103k0458j8450j3411L4711m170J115
8627B1739L3936L5122n25k1871k1342k2029K7144k5724k0465O909l5202m86L4046
8614A1252Q214k470P96r385K138q464l7784K859Q6R094L8438J2151k4152k5734
8600b2961L490J3813q849j4978N309K4952K3745p318p711k6678o1M9865J5294
8587D7912K7139k6051k0856p305M0l428J6456l291l1992l3905q634K6231J9999
8574B315l017K6741N742p336K9198k360j7949k1579j3744j8485k6564n899J4210
8561c8727M7608J2918k7958k3305j3586J8882J5814L4761j6203K111j9159j0433
8549a7277Q779n112J138K3629K916K2091o703m421k1012m075R394J4923k6495
$$ y = [21048, 21999, 1956, 15741, 6023, -41, 15299, 42402, 21944, 3494, -9917, 24794, 20624, 21739, 55675, 90797, 90272, 68401, 47059, 25030, 52174, 26450, 5985, 12894, -22308, -22794, 11252, 19466, 16996, 17792, 8407, 10545, 2081, -35703, -32844, -32758, -23664, 14774, 26925, 2773, -22961, -19471, -5658, -14507, -29485, -24176, 776, 24521, 17203, 9492, -17186, -17247, 32618, 47912, 75051, 49000, 28144, 20839, 20879, 17451, 33907, 30616, -1376, -35281, -43915, -17684, 2315, -702, 26039, 31781, 24445, 53643, 51283, 33334, 11755, -1989, -20474, -47038, -52937, -38727, 8881, 21799, -6159, -29464, -43050, -24168, -8354, 26407, 10204, 12315, -6844, -17277, -8498, -13610, -12472, 11157, 14073, 36164, 29461, 25040, 4028, -47, 9347, 24270, -2225]
8536b225j5949M797K8303J965k504j4500j6526r780Q502J097L120L728J0646N344
8522F018J265J3015k3571n522Q856O290N716o381j7177j8072P038J3679J58q723
8508a7411R886j0803o655J7472L844K420L086j0857j3361N0336K3357j9469l832
8495B8013o533J9492j7240j3499j4122j1064o115R937J8596j100j8244l1280N272
8482c7887l5J5515M752L318R660L7527Q776j0524O765J7100m780j566P445m179
8468E1887n074l759M794J4894k8203j7371J6155k5220k1965l653R473J9390l695
8455G653J2789m875P526N050K6378R956l6540k0721k870j2466P684N35k1043K942
8441a8002J8443j1722R662J0359Q677j3499o789R173P370K27K3433J3147P621
$$ y = [-2225, -18174, -13377, 14926, 16891, 14387, -113, -16639, -26419, -17917, -16820, -13700, -9972, 674, 6018, 7283, 20298, -3273, -8795, 61, 6351, 12067, 5686, -11491, -29563, -22525, -8846, -8688, -17411, -7525, -18328, -24983, -7511, -3667, -1247, 1839, -9018, -22379, 27957, 51314, 31845, 28013, 21480, 40972, 23732, 10233, -3889, -14953, -21068, -11131, 7465, 6365, -11879, -43159, -37887, -37922, -22407, -17655, -14337, -4677, 32850, 41626, 31102, 37867, 54967, 50187, 48621, 56066, 51887, 46813, 43054, 47848, 62742, 34539, 17168, 33323, 8103, -13862, -17515, -8042, 11348, 7653, 20442, 15567, 23093, 28143, 54521, 64477, 27937, 7216, 4346, -8120, -436, 99, -20944, -18002, 441, -11281, -1619, 8740, 17417, 3918, -2871, 6302, 13672, 13899, 37332, 50479, 58100]
8428E8100k6420j4367Q547l710j5933L033J6238k762k0260j266J0538J4777J01
8415B6616j2593j3405J843J7077L029r558j7737J513J1688n134o431q51o290L0149
8401A9916k502l729k258j8450l725K1439p382j1679k1434j1312J7653L1872j8741
8388a0332j8871Q604M0565L4305k0302l7059q152N869K4681P153P616j0941J7688
8375D0824O278k0955Q163l49K1440j7018k5031M60j4112K0736J8613j109l6546
8362A394M664L4093K8824o08k2748M826M4035N0374K3509J2053P240K4809j5876
8349A96589k8057J467L8704R089N6405J10402J91936L16491N79972J023124J546083
8338D042205R78359q57402j509549j031683n35608k94456j97762j23948q9594
$$ y = [58100, 31680, 17313, 25860, 22150, 6217, 9250, 25488, 22726, 2466, 1200, 11738, 26515, 26616, 14023, 618, 2461, 19538, 22567, 13009, -4728, -3215, 8473, 3339, -3092, -3943, -10233, 19916, 17414, 13685, 11427, -7023, -10748, 10691, 3309, -8370, -29804, -41116, -23463, 8409, -10332, -29203, -20599, 19966, 54271, 33969, -3090, -11242, -5373, 19308, 26461, 34077, 23136, 40824, 47102, 26147, 34310, 33961, 55401, 38383, 13352, 13812, -300, 20436, 39049, 37940, 1394, 6058, 40151, 68975, 68367, 45619, 50445, 94480, 144854, 168363, 180416, 187656, 212465, 196589, 168532, 169999, 208703, 217792, 274197, 384599, 576535, 893026, 1472998, 2496122, 4042205, 5020564, 4163162, 2653613, 1621930, 1086322, 791866, 594104, 470156, 380562]
8329C80562p2488p6363l3108o424j7874j6585K9294J8595k8704j4468k1581O538
8317A47394l377j71q270K2126k8657k1804J8512M8558K6334M4230J4101P269L4082
8304C00327N5261N3101R0641J35930J68385K96057N05410Q92433J677607K906611
8294G081763K731870r14760l100781k241763j245366o99440m07051k59139k01976
8285G43357j35729q0200p8206p7520m8207k1090j5607J159k1343k0741m351k9715
8273B11807l1930m4648j8784j232J1596L0829L4087j7750k9503m5826r038J1200
8261A00808N5241L5316L8520L3935M7350R3504J55517K05911L73802O89243J191399
8250C020546J413110J63251j332353j271789p22885l84398k49009j66126q7077
$$ y = [380562, 308074, 231711, 198603, 192179, 174305, 157720, 187014, 205609, 176905, 162437, 140856, 147394, 144017, 143846, 135576, 157702, 129045, 107241, 125753, 174311, 200645, 244875, 258976, 266245, 300327, 355588, 408689, 499330, 635260, 803645, 1099702, 1605112, 2497545, 4175152, 7081763, 9813633, 8898873, 5798092, 3556329, 2310963, 1611523, 1204472, 945333, 743357, 607628, 527428, 449222, 371702, 323495, 302405, 286798, 287957, 266614, 245873, 241522, 211807, 179877, 135229, 116445, 115213, 126809, 157638, 191725, 173975, 144472, 98646, 89608, 100808, 156049, 191365, 229885, 263820, 311170, 404674, 560191, 766102, 1139904, 1829147, 3020546, 4433656, 4596907, 3264554, 1992765, 1269880, 885482, 636473, 470347, 383270]
8241C83270q0937n0090m1375j0353L639K021n3272l7504j9669n226l1964n439
8229E3101p880k1545K5412L596j0525k9217O094K5053j7698n216J15j7107Q81
8216E064K835j457J9878J7148j5234N370j0155L314k715n332J5482J0106k7976
8203A6328j1649j8452r73L6955K2526j2957J1543Q344j9657J0337l633R777K0932
8190F9421k179m279R612P816l8170r145Q103J7587M94j238j0275j3671K0632J4730
8176F9438o952r675j0328p778j8407j8737J0358Q939P74J794J111L6091n66k408
8162E3654J4106j558j970j3031P313R524k811j2770o078J0814j7387l1277j8673
8149a0144K4511J3833j7935j6971J6322O349m6793Q106J5117O944k6374N495R602
$$ y = [383270, 302333, 252243, 210868, 200515, 204154, 206175, 152903, 115399, 95730, 90504, 58540, 53101, 45221, 23676, 49088, 52684, 42159, 12942, 19036, 44089, 26391, 21175, 21290, 4183, 5064, 7899, 6442, 26320, 43468, 28234, 33604, 23449, 26763, 24048, 18716, 34198, 44304, 16328, 4679, -13773, -14746, 22209, 44735, 31778, 43321, 51665, 32008, 42345, 38712, 48489, 69421, 67242, 62963, 72575, 80391, 42221, 33076, 41179, 58766, 59260, 58022, 47747, 34076, 54708, 69438, 62486, 52811, 42483, 34705, 16298, -2439, 7919, 16858, 17632, 19426, 20537, 56628, 56062, 53654, 67760, 66202, 64232, 51201, 58514, 68038, 65227, 52457, 46379, 57193, 39806, 8529, -10144, 14367, 28200, 10265, -6706, 9616, 15965, -30828, -22722, -7605, -661, -27035, -21540, -11938]
8136a1938K2290J4668q742m142M063J5717j6023k0592j2548k2020J0928O485K1094
8123g60Q018J483J3102M875N776j2499n79J4875n764j0970J3481K7778K699j6595
8109D4920J5719m17r928j5866j7366P291l307j983k0500l8842K428L0405Q853
8096A407J1758k78j0593l2233j1804l178K4500N912j8906J6537r83J6857j237
8083b241k727r9j1744m998k8429K9093K1036l815R788O967k098K080J7510M442
8069C4765j7766k9956k2578j620M1120K6516m833k2138j4890J206P388j1913r367
8056b4066O468j049P999K9648J3059n342j9631o756J4736J2453J3336k1947J77
8043A9085R034J3807j899l0124k312J6196K3727k324l5065l528N512K6970O3743
$$ y = [-11938, 10352, 25020, 16278, 12136, 16199, 31916, 15893, -4699, -17247, -39267, -28339, -21854, -760, 7258, 8741, 21843, 26718, 32494, 19995, 19416, 34291, 28527, 17557, 31038, 58816, 61515, 44920, 60639, 60222, 50294, 34428, 17062, 24353, 21046, 19063, -1437, -40279, -37851, -7446, 1407, 13165, 12887, 2294, -29939, -41743, -44921, -20421, -14509, -33415, -16878, -17861, -1004, -2241, -4968, -5067, -16811, -21809, -50238, -21145, -109, -3924, 5864, 12831, 10733, 12813, 30323, 34765, 16999, -12957, -35535, -37155, 3965, 30481, 25648, 3510, -11380, -10174, -2786, -14699, -24066, -17598, -18647, -10648, 19000, 32059, 26717, 7086, 330, 15066, 27519, 40855, 18908, 19085, 28119, 41926, 40027, 9903, 7591, 23787, 47514, 45190, 10125, 6597, 12109, 39079, 102822]
8030A02822n560n1869m7073n804m181k595J3863j5544p359m378O799m731k6070
8017e1680L7390L4286J452K348k8676p610K3351J8194J5420j598R831q277j3157
8004C1274o934j4362m733L395P880o591k9625K061J7065L7072K1960j7043l0340
7991A1079P232J7010l47j4247l488L6026J8355l6066l2283P795o915l8079R648
7978b4280k950p93m980n128M978J8284J5804p20k6557j9450K4261R167J3219O221
7964G076l405O94J4737j1828k9844j7131J1212M256r93J0279n865j1808K722K0150
7950i748r207k218R319J9100O57j13J182J5197k027J0119J3066m4209l5557N279
7936b9160K7650L697m351J0824K3463o465j9484j4549J2967J3980j6295j5199
$$ y = [102822, 97262, 45393, -1680, -7484, -11665, -14260, -397, -15941, -23300, -27678, -20879, -25610, -51680, -14290, 19996, 21448, 23796, -4880, -12490, 10861, 29055, 44475, 42877, 52708, 44431, 31274, 24340, 9978, 5245, 8640, 16520, 9929, -19696, -17635, -570, 36502, 58462, 41419, 11079, 18311, 35321, 34974, 20727, 17239, 53265, 71620, 35554, 3271, 11066, 4151, -33928, -24280, -27230, -28023, -33003, -38131, -33153, -14869, 935, 215, -26342, -45792, -21531, -12364, 855, 7076, 3671, 4365, 19102, 7274, -22570, -39701, -28489, -24233, -25226, -14947, -20812, -32620, -29898, -9748, -18955, -21173, -11854, 7246, 7903, 7790, 8972, 24169, 22142, 32261, 45327, 1118, -34439, -29160, -1510, 2187, -2164, 8660, 32123, 25658, 6174, -8375, 4592, 18572, 2277, -12922]
7924a2922k7641L552N6697J0876l6638r35J9991j8505k2397K0146K5646O627k6296
7911a799m1765Q28K0840J3561K8543P092j2799q991j258K0838J7862o881M266
7898D0337p015P352m951j0489l234J8140j203r573j6937m017K0173k2240j4311
7885g968J0113k4931N03O32k3592m072J4651J2418L1589K4182k9217k2657k734
7872b1083J1685n232k108k677J8902Q590M451J6000p278o533l7348r57J9541P481
7858C434j9734L1298J4487P459j112k6297o723K0873j6568m946R630o286j4526
7845i011j3538K98J7465p397m8046N269K820L390K1529J6096J0405J207r560k4847
7831c3920m2272Q764L0338L5492K7584L1407J6658Q206l7230l2526N913j7028
$$ y = [-12922, -40563, -37011, 19686, 30562, -6076, -7011, 12980, -5525, -27922, -7776, 17870, 24497, -1799, -43564, -42736, -21896, -8335, 20208, 27300, 14501, 5510, 4252, 25090, 42952, 36071, 40337, 33322, 40674, 35723, 25234, 22000, 40140, 38937, 29364, 12427, 8410, 28583, 6343, -7968, 2145, -22786, -22283, -21651, -45243, -49315, -34664, -22246, 9343, 33525, 4308, -18349, -21083, -9398, -14630, -16738, -19415, -513, 8077, 12528, 28528, 21250, 14717, -22631, -23588, -4047, 3434, -16300, 14998, 29485, 36944, 35832, 9535, 2812, 23685, 7117, 2171, 11801, 5515, -9011, -22549, -22251, -4786, -12183, -60229, -54960, -52140, -48750, -27221, -11125, -720, 487, -9073, -33920, -76192, -67428, -37090, -1598, 25986, 57393, 74051, 82257, 45027, 12501, 18414, 1386]
7819A386J0254K7339p947j4165J938q722k9525k7668j7341o786Q894L8134J5460
7806h749j3156J2735p933J9025J9797Q529k208k9019l2739Q209N149J320N019
7793a4021J4911j3108L545N289q874R389J2589J620j6154m2516K113M523l511
7780d4205K6865M219m921r130J4318K5709j3195k1835J9688J7101J5349k636M695
7767C2022k086r218L112J0212j8376j1716j2844R732k107K059L508j3004j1285
7754a9991p976l633K1406J363Q127l161j5789k1319O227Q359K48J3302k4801O933
7740c0705N34L330K8326M0025j0684l3380m3826o819L363K7646L8510K1230j1754
7727B5796j8022M052j3135o320J5691m0996k647K0436K3907k4835j1226R545p69
$$ y = [1386, 11640, 38979, 31032, 16867, 18805, 10083, -19442, -47110, -64451, -71237, -62343, -24209, -8749, -21905, -9170, -17103, 1922, 21719, 30248, 28040, -979, -33718, -25509, -20360, -19040, -14021, 890, -12218, -8673, -3384, -12258, -2869, 9720, 11340, -4814, -47330, -45217, -40694, -44205, -17340, -13121, -18042, -27172, -12854, 12855, -340, -22175, -2487, 14614, 29963, 27327, 32022, 29936, 20718, 23830, 34042, 15666, 3950, -8894, 838, -1269, 790, 4298, -8706, -19991, -27967, -31600, -10194, -8831, -704, -3865, -19654, -40973, -34746, -26387, -26139, -12837, -37638, -30705, -30171, -26841, 1485, 41510, 30826, -2554, -46380, -53199, -49836, -22190, 16320, 37550, 25796, 7774, 11826, -1309, -7629, 8062, -32934, -35581, -15145, 8762, -16073, -27299, -17754, -18523]
7714a8523J8150J0984J2485j8775O984J9466k0265J4247j070O117j1533k5897
7702g630R00L195j4986K400K5720J5300k2222k3307j894j8005K2441K5107L0062
7689C7081R342J8316o35m5376l6185j1548K2781o13k1358n962N597J5727j763
7676a4596J5841J7153j0987q035j2578k3330K931L3610L1791R921j0532n966M947
7663C0170J620r438L557p534O642l685P718j4361P565J3673q519j8351q032l132
7649b107k055J8394O53j0721j2867p650j6545q264K2053N467j740J4132K6931
7636B5681P242k5320l093M940R319l0363k2180l661K4420L304j4062J6096j5698
7623b3375M508o892J9902K28q754K6148J4840k4066J6355J5688Q607l703j5548
$$ y = [-18523, -373, 10611, 23096, 4321, 11305, 30771, 10506, 24753, 23683, 29800, 18267, -7630, -6730, -3535, -18521, -16121, 9599, 24899, 2677, -20630, -22524, -40529, -18088, 7019, 37081, 46423, 64739, 64104, 18728, -17457, -29005, -6224, -6837, -28195, -34157, -28560, -12833, -14596, 1245, 18398, 7411, -624, -13202, -36532, -33601, 9, 31800, 41721, 31189, 25223, 30170, 31790, 22352, 25909, 18375, 25017, 21332, 29050, 14689, 22254, 35927, 27408, 9057, 1025, -2107, -4162, 14232, 14885, 4164, -8703, -16353, -32898, -41162, -19109, -13642, -15382, -1250, 25681, 32923, 7603, 4510, 9450, 18769, -11594, -33774, -37435, -13015, -9711, -23773, -7677, -23375, -18867, -25759, -5857, -5629, -14383, 11765, 26605, 2539, 18894, 34582, 43189, 39486, 23938]
7610B3938J1418l70j0522k0283j056j7356K4919O452j9317k1269L640N572k3887
7597c8121J5160K1010J4680K685N21J4086k0546l1946k0678l598J5170j16K4874
7584f819J1373J5892L5733k5421k0993j2359o937R779P634r602o23j4954j8235
7571c5532k0328J4019M9959K7346j9248j0849j0915J9243Q407K301l2703r832
7559a8132K727m12P688q655R771Q625j3989p133n956l926N867K3734n259j9596
7545b4646L2277O056p785K4514K610r582j3128O446q190o265J9172J6422J0418
7532D8319k2608R70q980j0106M032L6902R030l3805L076q879j3970J2668J578
7519A8227J2502k7970n367J3866J0359l1737Q566K998o927J2305P934k6309j9549
$$ y = [23938, 35356, 34986, 24464, 4181, 3125, -14231, 10688, 17140, -2177, -23446, -19806, -14234, -38121, -22961, -1951, 12729, 15414, 15935, 30021, 9475, -22471, -43149, -46747, -31577, -31693, -6819, 4554, 20446, 56179, 30758, 9765, -2594, -9531, 248, 7882, -1720, -2343, -17297, -35532, -55860, -41841, 8118, 35464, 16216, 5367, -5548, 13695, 22102, 24403, -8300, -18132, -15405, -15817, -8129, -16784, -7013, 1612, -12377, -19510, -25466, -29392, -23525, 209, -5050, -24646, 7631, 13687, 5902, 30416, 33026, 23444, 10316, 16762, 8572, 2307, 21479, 37901, 48319, 25711, 26681, 17701, 7595, 11627, 48529, 57559, 23754, 26830, 17951, 3981, 16649, 18227, 30729, 2759, -2608, 11258, 21617, -10120, -1554, 1444, -5483, 6822, 14756, -11553, -31102]
7506c1102K933j6815J2022L1207K6533K8865K802j1319j8531k8947o283J183L7142
7493B9690K784l8088L8599J0658l1862J993J2688L620j8647j5881J4643j4386
7481d189J1112p717j9293J4584j592l3229j6104K0147K4732L9288m520j4700J0212
7468A8731N483l0536Q018K8976r242J5395m770o094j0211m495J014K665J0016
7455B4950k5909k1645j2195j0250P606K9460K2821l349Q743j2248j4418j862Q298
7442BP178l454M113j1123j7269q915L432N318o519r278K3067L574q323k3440m176
7427d5813O74N011J7904m44N146J9442o62j2681J1684p628j8633J7852J2205N13
7413D570J430J2963J3634M668n128J7109j6389l3523K3884k666j7625m125Q912
$$ y = [-31102, -28169, -44984, -32962, -1755, 24778, 53643, 56445, 45126, 26595, -2352, -8635, -7452, 29690, 32474, -5614, 32985, 43643, 11781, 13774, 26462, 30082, 11435, -4446, 10197, -4189, 6923, -794, -20087, -5503, -7095, -40324, -56428, -36281, -11549, 27739, 23219, 8519, 18731, 24214, -6322, 1696, 30672, 21430, 36825, 32055, 25961, 15750, 11255, 12269, 14934, 24950, -959, -22604, -34799, -45049, -37443, -7983, 14838, 11489, 20232, 7984, -6434, -8296, 2, 7180, 3726, 7839, -3284, -20553, -29468, -26036, -20718, -27237, -36515, -13448, -9874, -18197, -41637, -45813, -45139, -40128, -22224, -22668, -17522, 1920, 1258, -11423, 261, -7367, -26000, -8148, 4057, 4570, 6000, 18963, 32597, 37265, 32137, 49246, 32857, -666, 23218, 20552, 2927, -1198, 7714]
7400G714N893k2759q794m86O012j2811q786R992J3430J0602O786K0316j5628Q717
7386B0198K4586j0195n036Q594P691j2361K434J1889m886n293k4556j6646J1418
7373G837L4351l150n121Q424l745l4498J629l991l200j8350K3780J5738M910j8914
7359E700J9021J1693j9826J3086M189K8973P503m486r508n676n17m067K016k2149
7345B5952j9018J172k4028k6770O90L3564K0410K86l8857r936M3235K952l4403
7332b4751O44O905o364M444k44J185o755q089m914R924k643L3954J4935j7035
7318A196n212J9557p4K5891j3756k2727k3964J4242J6381N368m820J6141p428
7305B0795j8724j1906o934O61o482L4967K3832q985J773n435l4281l7403j388
$$ y = [7714, 13607, -9152, -17946, -18432, -12420, -25231, -34017, -24025, -10595, 7, 6793, 27109, 11481, 20198, 44784, 34589, 29553, 38147, 45838, 33477, 35911, 47800, 42914, 37621, 13065, -3581, 7837, 42188, 39038, 33917, 42341, 38596, 4098, 5727, 1736, -1464, -19814, 3966, 19704, 24614, 5700, 24721, 36414, 16588, 29674, 33863, 62836, 70339, 65853, 56345, 50669, 50152, 46085, 48101, 25952, 6934, 8106, -15922, -42692, -42002, -8438, 11972, 12258, -26599, -36535, 6700, 9652, -24751, -24107, -17202, -23566, -19122, -19366, -18181, -24936, -33025, -37939, -28015, -30658, 3296, 18231, 1196, -4016, 15541, 15467, 41358, 27602, 4875, -19089, -4847, 11534, 16902, 12082, 28223, 20795, 2071, -9835, -16769, -16108, -22590, 12377, 36209, 27224, 28997, 23562, -10719, -48122, -49510]
7292d9510k08J8396N278O437J2572m269j4743J7976J3618P09r694j0228K0787
7279G121M679J1714L3285L615l024o964k0784k46j2444K5847o14j1064j6629L823
7265A8315j6909j7468j1592j4590q871K4900k4816k8654J9175J0538L456j032
7253d7548R506K0819J7598k2886L525o611n636o348L5J1094n740k0321K4499L2737
7239D723l225k7575p183j5003M2689L3532K9120k3377l9518j8138K0332j4245
7227a7868L694J0913k7032k0514J4085L1990J7555j9867m1688k9039L4603M5125
7215A957N092k1324k7441j6493k4488J4153K6019J9707j798O019m101q158K8568
7202b288m589j2617k1212r802k786R326J983P952k069L507R885o469J3278p56
$$ y = [-49510, -49718, -31322, -26044, -19607, -7035, -11304, -26047, -8071, 5547, 6256, -3438, -13666, 7121, 11800, 23514, 56799, 60414, 57390, 50426, 29642, 29396, 16952, 42799, 42185, 31121, 14492, 18315, 1406, -16062, -27654, -42244, -51115, -26215, -51031, -79685, -60510, -49972, -46516, -47548, -38042, -17223, 375, -22511, -18986, -25597, -31233, -37581, -37546, -26452, -32192, -52513, -28014, 4723, 1498, -26077, -33260, -48263, -5574, 27958, 57078, 33701, -5817, -23955, -3623, -17868, -14174, -3261, -30293, -50807, -36722, -4732, 12823, -7044, -48732, -77771, -43168, 1957, 7049, -14275, -41716, -58209, -82697, -68544, -42525, -22818, -24616, -18597, -22698, -30856, -2288, -6877, -19494, -40706, -50508, -53294, -43968, -41985, -34033, -36102, -32595, -22710, -29179, -15901, -16657]
7188a6657m248k352n318k2709m0829J1949L4220J0714L273J2525N149K3084P690
7175A6491j4541j7781l192o627J0655j9708J4528J8240K3582J9906j8673j3370
7163I510k52j7971K8198J5374n421j089k376l433j120p269j25J1172J3927k2020
7149A7105k3707k3451M838j6296J3886K7722l881l846K8725j349j7361K349j0440
7136e706j6938J2459K955K491K5746n168K8858L765k5891j9542k755k297P405
7123E382J4397l0248k4340n34r458r78j294K5685J7877j7192m926j5839K0630
7110b0838J6509m0635j4861K4220M541j1125O687l604m70J8341L7738J8215K937
7097C7655j473r232k0181k1058k2211J224J2990J8174L595k010k2989J9514J7170
$$ y = [-16657, -20905, -23257, -28575, -51284, -92113, -80164, -45944, -35230, -31957, -19432, -14283, 8801, 16491, 1950, -15831, -19023, -25650, -14995, -34703, -20175, -1935, 21647, 41553, 22880, 9510, 9258, -8713, 19485, 34859, 29438, 28349, 25973, 22540, 21420, 14151, 14026, 25198, 39125, 17105, -6602, -30053, -25215, -41511, -27625, 97, -3784, -7630, 21095, 19746, 2385, 4734, -5706, -22644, -10185, -7230, -4739, 21007, 15839, 44697, 48462, 22571, 3029, 274, -2023, 5382, 19779, -10469, -34809, -35343, -44801, -45779, -47073, -21388, -3511, -20703, -25629, -41468, -20838, -4329, -44964, -59825, -35605, -31064, -42189, -35502, -39106, -39576, -21235, 16503, 34718, 37655, 36182, 26950, 6769, -14289, -36500, -35276, -22286, -4112, -517, -2527, -25516, -6002, 11168]
7084A1168J3914q72k3584j6267L665r667p508J700J9878M5331j9763m8773j9619
7071e0397K9672K7464r920k0804m010J8519J4561k558R479k8828k8524q406j883
7058e5635J356K3746j24Q838Q91L933J4569Q669m365o517j0357j526J9937k1254
7044a7839p196k467k0910P873K3563J391m708j6086j2202J1497R003J2721K0671
7031E311J4130k3179k0611P835L584K874j1728q394l196j5540k6800K6272L6963
7018a2479j0201r307P177L3430j6127l0717J1746j5289j04P028N277K3629J1514
7005E577m64r779j089M959k492J6915J2680r518j016j2951P114Q302J43p816J1540
6990B2105Q202K227O077n283J3149j2345n589K3661L0712k8890m1551j5076J3297
$$ y = [11168, 25082, 24210, 626, -15641, -11976, -21643, -29151, -27451, -7573, 37758, 17995, -30778, -50397, -20725, 6739, -3181, -23985, -27995, -9476, 5085, 2527, 12006, -16822, -45346, -53752, -55635, -54279, -30533, -30657, -21819, -20928, -16995, -2426, 6243, 1878, -4639, -14996, -16522, 3415, -17839, -25035, -27502, -48412, -40539, -16976, -15585, -20293, -36379, -48581, -37084, -28081, -15360, 5311, 19441, -3738, -24349, -16514, -12930, -10056, -21784, -30178, -33374, -48914, -75714, -49442, -12479, -22680, -31987, -24810, 8620, -7507, -38224, -26478, -41767, -41871, -34843, -29566, -5937, 5577, 5113, -4666, -5755, -796, -3288, 13627, 26307, 16789, 15773, 2822, 9936, 18238, 18381, 10565, 22105, 30307, 32534, 38611, 33328, 46477, 34132, 28543, 52204, 82916, 54026, 12475, -2601, 10696]
6977A0696J2644L1477j6599j5646P044j7425j1420J7855K1888j3050j4684l9122
6965b6342q674N609j1417l01K0925K4657q519l9755J050N822K499j1614J5487
6952c0573J0360k224n213L668K3799J8352J1289j1994Q032l674j7979N259q755
6939C47L868J4194J0382K2186k1416k7469P81r943K1542P309l5517p980O872j8998
6925c3842J8704p862k0444K4948J6383r228Q83K2519J6996j4139l3820J6366J755
6912g81L078K502L2674o09k0507M951K6453K413k0071k9222p674j13P007J882
6898A983r659j1016M741Q885K452j898L354j2507J87J3265o18n504j3637M554
6884a5418J1998J0079j6035m144l979j252P522n846n108J8856l626k5881J8008
$$ y = [10696, 23340, 54817, 38218, 22572, 29616, 12191, 771, 18626, 40514, 27464, 12780, -26342, -35016, -29407, -40824, -41125, -20200, 4457, -4062, -43817, -42767, -36945, -34446, -46060, -30573, -20213, -22437, -27650, -23982, -183, 18169, 29458, 17464, 25496, 21822, 3843, 9102, 347, 4215, 18409, 28791, 50977, 29561, 2092, 2873, -7070, 14472, 21781, -13736, -21716, -14844, -33842, -15138, -23000, -43444, -18496, -2113, -11341, -10458, 12061, 29057, 14918, -18902, -2536, -781, 2297, 4799, 37473, 36864, 16357, 21308, 47761, 50174, 30103, 881, -6793, -6906, 101, 1983, -7676, -18692, -13951, -5066, -2614, -4512, -1158, -13665, -13478, -213, -831, -6335, -19972, -15418, -3420, 6659, -9376, -13520, -17499, -18751, -11229, -17075, -22183, -3327, -6953, -32834, -14826]
6871a4826K5982J8212R115k1619k3929L243j1872r350O106J6393P049K22j3286
6858h560L640J3337l477K955N314r890J871l070j2330P146p35p676j1380J5899
6844f956N678j0468P164k2632j7798j4250J6015K1939J5004J4503l698k291M939
6831G149J3915j2068l474l97l8150l5280J7054K9010K3317j724k8464J151r716
6818c7677K3107k1465N4R910k4652K6213M4930J3233j2317p899J4316j1574J200
6805A7379M200K700k8520L746Q20k1465j2175k5828o22M557k187J3665K6522J3126
6791d082k980L2944k981N113j9927j452J4534j2756n706O460Q081l288n709p702
6777E49k1315P468k475k1955M766j6344N912K3088J6779O93k5772N395o897K588
$$ y = [-14826, 11156, 29368, 38483, 16864, -7065, -3822, -15694, -25044, -18938, -2545, 4504, 4726, -8560, -4920, 8417, 4940, 7895, 13209, 3319, 5190, 2120, -10210, -3064, -3799, -11475, -22855, -6956, -1278, -11746, -4582, -27214, -45012, -59262, -43247, -21308, -6304, 8199, 4501, 2210, 7149, 21064, 8996, 5522, 5125, -33025, -68305, -51251, -22241, 1076, -648, -29112, -27961, -37677, -14570, -36035, -35981, -26071, -50723, -24510, 20420, 33653, 21336, 13437, 27753, 16179, 17379, 21579, 24279, -4241, -495, 325, -21140, -33315, -59143, -59765, -55208, -57395, -43730, -17208, -4082, -7062, 25882, 22901, 28014, 8087, 6635, 21169, 8413, 2707, 9167, 17248, 13960, 8251, 549, -20766, -13298, -15773, -37728, -32962, -49306, -43394, -20306, -3527, -2834, -28606, -23211, -30108, -27520]
6763b7520j3729n138L6780M022P327J4235K0009k4571l7027J0813j532j5004J1557
6750a9778L788k1719Q611L3585K4033l343J5990J8133m3608m6999O676K8989j6006
6737a1648l2924m031M365O278q46j6663k549j614K7887J2544o948j1436m743R894
6723c2434L6261L527k8169N887J0427j4528R738K0621l534j2774R53m884j2484
6710b1393L7079J0229l4810j6151O942R929L493l592M916O734L877k848K2926
6697B7331l659l8325p881N96j0316J6357J3050j236l312J0037K9957J1530j9036
$$ y = [-27520, -41249, -46387, -9607, -5585, 1742, 15977, 35986, 11415, -25612, -14799, -16331, -31335, -19778, -15990, -37709, -29098, 4487, 28520, 25177, 41167, 59300, 15692, -31307, -24631, 4358, -11648, -44572, -48603, -44238, -37960, -38806, -55469, -58018, -59632, -31745, -19201, -26149, -37585, -42328, -32434, 3827, 7354, -20815, -14928, -4501, -19029, -9291, 11330, 7796, -4978, -4025, -8909, -21393, 15686, 25915, -8895, -25046, -18104, -8175, -4682, -8274, -3358, 3376, 7253, 4405, 27331, 23672, -14653, -22534, -21938, -32254, -15897, -2847, -4083, -7395, 2642, 32599, 44129, 25093]
$$ [...]
##END NTUPLES=NMR SPECTRUM
##END=
