##TITLE=Analysis number 325392
Compound Code cd 11242
Project Code adrs
Chemist Name fudan
##JCAMPDX= 6.0         $$ Bruker NMR JCAMP-DX V2.0
##DATA TYPE= NMR SPECTRUM
##DATA CLASS= NTUPLES
##ORIGIN= Bruker BioSpin GmbH
##OWNER= nmr
$$ XWIN-NMR		Version 3.5
$$ Tue Jan  2 11:09:37 2007 GMT Standard Time (UT+0h)  MAYBRIDGE\nmr@NMR_250MHZ
##.OBSERVE FREQUENCY= 250.131544655141
##.OBSERVE NUCLEUS= ^1H
##.ACQUISITION MODE= SIMULTANEOUS (DQD)
##.ACQUISITION SCHEME= undefined
##.AVERAGES= 16
##.DIGITISER RES= 18
##SPECTROMETER/DATA SYSTEM= dpx250
##.PULSE SEQUENCE= zg30
##.SOLVENT NAME= CDCl3
##.SHIFT REFERENCE= (INTERNAL, CDCl3, 0, 16.5409)
##AUDIT TRAIL= $$ (NUMBER, WHEN, WHO, WHERE, WHAT)
$$ ##TITLE= Audit trail, XWIN-NMR		Version 3.5
$$ ##JCAMPDX= 5.01
$$ ##ORIGIN= Bruker BioSpin GmbH
$$ ##OWNER= nmr
$$ C:\u/data/dgb/nmr/ADRS/80/pdata/1/auditp.txt
$$ ##AUDIT TRAIL=  $$ (NUMBER, WHEN, WHO, WHERE, WHAT)
(   1,<2007-01-02 11:09:15.77 +000>,<MAYBRIDGE\nmr>,<NMR_250MHZ>,
      <created by zg, POWCHK disabled, PULCHK disabled
       configuration hash MD5:
       49 4B E0 1D 92 C2 6B 37 9F E6 65 BC 52 41 86 1D
       data hash MD5: 64K
       20 77 2B D3 A4 27 41 DA 13 92 D0 9B 78 A6 17 83>)
(   2,<2007-01-02 11:09:28.21 +000>,<MAYBRIDGE\nmr>,<NMR_250MHZ>,
      <Start of raw data processing
       ef LB = 0.3 FT_mod = 6 PKNL = 1 SI = 32K 
       data hash MD5: 32K
       20 66 FB 39 F8 F8 22 55 3C F2 3F 4C FA 14 9C 12>)
(   3,<2007-01-02 11:09:30.35 +000>,<MAYBRIDGE\nmr>,<NMR_250MHZ>,
      <apk 
       data hash MD5: 32K
       FC 37 09 FC 36 ED 79 A3 10 1B D6 88 BA 01 A2 77>)
(   4,<2007-01-02 11:09:31.10 +000>,<MAYBRIDGE\nmr>,<NMR_250MHZ>,
      <abs ABSG = 5 
       data hash MD5: 32K
       CC 2C 52 08 C2 D9 18 1B 4F 48 A4 DF 49 11 29 03>)
$$ ##END=
$$ 
$$ hash MD5
$$ AB F5 5D FA E9 FA 15 E0 09 9B 52 E1 6D 55 4C 54
##$RELAX= 
##$RELAX= 
##$RELAX= 
##$RELAX= 
##$RELAX= 
##$RELAX= 
##$RELAX= 
$$ Bruker specific parameters
$$ --------------------------
##$DU= <C:\u>
##$EXPNO= 80
##$NAME= <ADRS>
##$PROCNO= 1
##$TYPE= <nmr>
##$USER= <dgb>
##$AMP= (0..31)
100 100 100 100 100 100 100 100 100 100 100 100 100 100 100 100 100 100 
100 100 100 100 100 100 100 100 100 100 100 100 100 100 
##$AQSEQ= 0
##$AQ_mod= 3
##$AUNM= <au_zg>
##$AUTOPOS= <12 >
##$BF1= 250.13
##$BF2= 250.13
##$BF3= 250.13
##$BF4= 250.13
##$BF5= 500.13
##$BF6= 500.13
##$BF7= 500.13
##$BF8= 500.13
##$BYTORDA= 1
##$CFDGTYP= 0
##$CFRGTYP= 5
##$CHEMSTR= <none>
##$CNST= (0..31)
1 1 145 1 1 1 1 1 1 1 1 1 1 1 1 1 1 1 1 1 1 1 1 1 1 1 1 1 1 1 1 1 
##$CPDPRG= <>
##$CPDPRG1= <>
##$CPDPRG2= <>
##$CPDPRG3= <>
##$CPDPRG4= <mlev>
##$CPDPRG5= <mlev>
##$CPDPRG6= <mlev>
##$CPDPRG7= <mlev>
##$CPDPRG8= <mlev>
##$CPDPRGB= <>
##$CPDPRGT= <>
##$D= (0..31)
0 1 0 0 0 0 0 0 0 0.06 0 0 0 0 0 0 0.0002 0 0 0 0 0 0 0 0 0 0 0 0 0 0 
0 
##$DATE= 1167736154
##$DBL= (0..7)
120 120 120 120 120 120 120 120 
##$DBP= (0..7)
150 150 150 150 150 150 150 150 
##$DBP07= 0
##$DBPNAM0= <>
##$DBPNAM1= <>
##$DBPNAM2= <>
##$DBPNAM3= <>
$$ [...]
##$SUBNAM7= <"">
##$SUBNAM8= <"">
##$SUBNAM9= <"">
##$SW= 20.6930455092707
##$SWIBOX= (0..15)
0 0 3 0 0 0 0 0 0 0 0 0 0 0 0 0 
##$SW_h= 5175.983436853
##$TD= 65536
##$TD0= 1
##$TE= 294.16
##$TE2= 300
##$TE3= 300
##$TEG= 300
##$TL= (0..7)
0 120 120 120 120 120 120 120 
##$TP= (0..7)
150 150 150 150 150 150 150 150 
##$TP07= 0
##$TPNAME0= <>
##$TPNAME1= <>
##$TPNAME2= <>
##$TPNAME3= <>
##$TPNAME4= <>
##$TPNAME5= <>
##$TPNAME6= <>
##$TPNAME7= <>
##$TPOAL= (0..7)
0.5 0.5 0.5 0.5 0.5 0.5 0.5 0.5 
##$TPOFFS= (0..7)
0 0 0 0 0 0 0 0 
##$TUNHIN= 0
##$TUNHOUT= 0
##$TUNXOUT= 0
##$USERA1= <user>
##$USERA2= <user>
##$USERA3= <user>
##$USERA4= <user>
##$USERA5= <user>
##$V9= 5
##$VALIST= <valist>
##$VCLIST= <CCCCCCCCCCCCCCC>
##$VD= 0
##$VDLIST= <DDDDDDDDDDDDDDD>
##$VPLIST= <PPPPPPPPPPPPPPP>
##$VTLIST= <TTTTTTTTTTTTTTT>
##$WBST= 1024
##$WBSW= 4
##$XGAIN= (0..3)
0 0 0 0 
##$XL= 0
##$YL= 0
##$YMAX_a= 506033
##$YMIN_a= -473269
##$ZGOPTNS= <>
##$ZL1= 120
##$ZL2= 120
##$ZL3= 120
##$ZL4= 120
##$ABSF1= 16.54092
##$ABSF2= -4.152254
##$ABSG= 5
##$ABSL= 3
##$ALPHA= 0
##$AQORDER= 0
##$ASSFAC= 0
##$ASSFACI= 0
##$ASSFACX= 0
##$ASSWID= 0
##$AUNMP= <proc_1d>
##$AZFE= 0.1
##$AZFW= 0.1
##$BCFW= 0
##$BC_mod= 0
##$BYTORDP= 0
##$COROFFS= 0
##$CY= 12.5
##$DATMOD= 1
##$DC= 0
##$DFILT= <>
##$DTYPP= 0
##$F1P= 14.0000005364418
##$F2P= -0.99999901652339
##$FCOR= 0.5
##$FTSIZE= 32768
##$FT_mod= 6
##$GAMMA= 0
##$GB= 0
##$INTBC= 1
##$INTSCL= 1
##$ISEN= 128
##$LB= 0.3
##$LEV0= 0
##$LPBIN= 0
##$MAXI= 10000
##$MC2= 0
##$MEAN= 0
##$ME_mod= 0
##$MI= 0
##$NCOEF= 0
##$NC_proc= -2
##$NLEV= 6
##$NOISF1= 0
##$NOISF2= 0
##$NSP= 0
##$NTH_PI= 0
##$NZP= 0
##$OFFSET= 16.54092
##$PC= 1
##$PHC0= 234.7729
##$PHC1= -5.988082
##$PH_mod= 1
##$PKNL= yes
##$PPARMOD= 0
##$PSCAL= 4
##$PSIGN= 0
##$REVERSE= no
##$SF= 250.129995265606
##$SI= 32768
##$SIGF1= 0
##$SIGF2= 0
##$SINO= 400
##$SIOLD= 32768
##$SREGLST= <1H.CDCl3>
##$SSB= 0
##$STSI= 32768
##$STSR= 0
##$SW_p= 5175.98343685301
##$SYMM= 0
##$S_DEV= 0
##$TDeff= 65536
##$TDoff= 0
##$TI= <Analysis number 999999
Compound Code 99
Book Reference 9
Project Code 9>
##$TILT= no
##$TM1= 0
##$TM2= 0
##$TOPLEV= 0
##$USERP1= <user>
##$USERP2= <user>
##$USERP3= <user>
##$USERP4= <user>
##$USERP5= <user>
##$WDW= 1
##$XDIM= 32768
##$YMAX_p= 286340929
##$YMIN_p= -30651
$$ End of Bruker specific parameters
$$ ---------------------------------
##NTUPLES= NMR SPECTRUM
##VAR_NAME=  FREQUENCY,     SPECTRUM/REAL,   SPECTRUM/IMAG
##SYMBOL=    X,             R,               I
##VAR_TYPE=  INDEPENDENT,   DEPENDENT,       DEPENDENT
##VAR_FORM=  AFFN,          ASDF,            ASDF
##VAR_DIM=   32768,         32768,           32768
##UNITS=     HZ,            ARBITRARY UNITS, ARBITRARY UNITS
##FACTOR=    0.157963299565203, 1,           1
##FIRST=     4137.38030571434, 0,            0
##LAST=      -1038.60313113867, 0,           0
##MIN=       -1038.60313113867, -30651,      0
##MAX=       4137.38030571434, 286340929,    0
$$ Real data points
##PAGE= N=1
##DATA TABLE= (X++(R..R)), XYDATA
$$ [...]
$$ plain form
19341 459 2368 7308 10259 13329 7250 6412 8359 13259 5597 -1450 -654 -2856 -5794 -7156 -8992
19326 -8992 -9911 -12072 -8926 -6329 -10852 -11217 -5914 -7827 -7594 -5097 -4975 -6323 -5672 -3396 -3243 -6248
19310 -6248 -11985 -11896 -10569 -7761 720 4754 8014 9922 8925 8320 5541 5587 8712 4399 -6894 -12743
19294 -12743 -11221 -8344 -4724 -5486 -12697 -9409 -5745 -7550 -10352 -7108 -6274 -8459 -8146 790 -255
19279 -255 -10754 -9958 -882 6575 9075 8915 7907 -1047 -4754 -4473 -3281 -4023 -2213 -902 4602 6819
19263 6819 -4266 -5767 -1132 -4022 -7327 -13524 -14133 -15007 -14590 -5380 -6270 -7972 -5031 215 -761 -3841
19247 -3841 -6700 -12039 -12969 -10345 -11930 -16626 -14020 -9024 -739 1396 -3993 -2834 1266 -2760 -5601
19232 -5601 -5334 -2321 6418 10596 8417 10247 10896 7090 2243 -129 -2002 -1548 1845 694 -2779
$$ packed form
19341D59J909M940K951L070o079q38J947M900p662p047P96k202k938j362j836
19326h992r19k161L146K597m523l65N303j913K33K497J22j348O51K276J53l005
19310f248n737Q9J327K808Q481M034L260J908r97o05k779M6L125m313j1293n849
19294a2743J522K877L620p62p211L288L664j805k802L244Q34k185L13Q936j045
19279b55j0499P96R076P457K500j60j008q954l707K81J192p42J810J311N504K217
19263F819j1085j501M635k890l305o197o09q74M17R210q90j702K941N246r76l080
19247c841k859n339r30K624j585m696K606M996Q285K135n389J159M100m026k841
19232e601K67L013Q739M178k179J830O49l806m847k372j873M54L393j151l473
$$ plain form
19217 -2779 -4085 -1334 -3403 -3124 31 1493 -3703 -5987 -9545 -13886 -5855 609 -9041 -17173 -16302
19202 -16302 -10809 -10044 -11586 -5618 -1994 6987 5399 1114 -6858 -16754 -14561 -6371 -8820 -3462 -6148
19187 -6148 -1451 2392 3751 1748 4137 12460 7056 2503 -770 -1508 -5303 -11119 -9326 -8629 -4204
19172 -4204 -2262 6010 14317 11670 10242 15046 17717 9571 8703 2663 -4765 -7011 -7782 -5086 -6437
19157 -6437 1281 4277 5402 -817 -6779 -2428 850 1713 2633 5031 4260 -579 -2966 -9761 -12580
19142 -12580 -13639 -12932 -10215 -4924 -7380 -10667 -15506 -13265 -5383 -6058 -5691 -259 -1290 -4537 -3893
19127 -3893 -1867 585 -6040 -6907 -3210 -4294 -9055 -9999 -12180 -6362 2241 8182 1948 -6507 -4653
19112 -4653 -1518 3718 8497 9122 3373 -523 -5309 -9491 -12367 -14118 -8497 -5218 -4953 -10331 -4346
$$ packed form
19217b779j306K751k069K79L155J462n196k284l558m341Q031O464r650q132Q71
19202a6302N493P65j542N968L624Q981j588m285p972r896K193Q190k449N358k686
19187f148M697L843J359k003K389Q323n404m553l273p38l795n816J793O97M425
19172d204J942Q272Q307k647j428M804K671q146q68o040p428k246p71K696j351
19157f437P718K996J125o219n962M351L278Q63R20K398p71m839k387o795k819
19142a2580j059P07K717N291k456l287m839K241P882o75L67N432j031l247O44
19127c893K026K452o625q67L697j084m761r44k181N818Q603N941o234q455J854
19112d653L135N236M779O25n749l896m786m182k876j751N621L279K65n378N985
$$ plain form
19097 -4346 2831 3339 3864 -1585 -2489 -6927 -5962 -626 -1445 -2480 2761 4535 2713 154 -5222 -1882
19081 -1882 -2691 -4510 -4242 -3320 -1340 -4069 -2096 -775 -5929 -13864 -11730 -4384 -2241 -8845 -9699 -8882
19065 -8882 -10259 -3544 -1560 4204 4896 132 -4846 -6152 -313 1119 -3289 -11576 -9056 -1464 -315
19050 -315 -1884 -8240 -7715 -3988 -1585 -152 4746 1648 -163 2438 -2865 -5507 -3120 -741 -3156
19035 -3156 4676 505 -74 6092 10024 5863 -3352 -6630 -4478 -5137 -11923 -12207 -8139 -5745 -5813 -6820
19019 -6820 -6038 -2900 -4015 -401 3371 6423 4248 5077 2967 4638 -1355 -248 -1668 -5701 -3505
19004 -3505 2198 6386 6353 6925 11008 6386 1664 -274 -1043 -2328 673 1473 -4483 -6270 -5684 -2990
18988 -2990 -3401 -7875 8 8602 5728 2193 -498 4693 6172 4807 2997 1519 -4644 -3185 1765
$$ packed form
19097d346P177N08N25n449r04m438R65N336q19j035N241J774j822k559n376L340
19081a882q09j819K68R22J980k729J973J321n154p935K134P346K143o604q54Q17
19065h882j377O715J984N764O92m764m978j306N839J432m408q287K520P592J149
19050c15j569o356N25L727K403J433M898l098j811K601n303k642K387K379k415
19035c156P832m171n79O166L932m161r215l278K152o59o786k84M068K394o8j007
19019f820P82L138j115L614L772L052k175Q29k110J671n993J107j420m033K196
19004c505N703M188l3N72M083m622m722j938p69j285L001Q00n956j787N86K694
18988b990m11m474P883Q594k874l535k691N191J479j365j810j478o163J459M950
$$ plain form
18973 1765 3820 2764 -4320 -8029 -3787 -3059 -3678 -4944 -8519 -6205 -271 4742 6661 3204 -5342
18958 -5342 -6230 2225 -1000 -4514 902 202 63 5543 2554 -1583 -7906 -7602 -3432 -4416 -4085 -685
18942 -685 -1268 -2714 -2455 -609 -702 -1691 8271 14864 19562 15269 12320 6214 5836 7817 5041 7402
18926 7402 6539 3547 -1029 -819 1114 -1054 -5873 -10449 -10602 -11033 -13789 -7454 -5381 -5728 -6764 -1044
18910 -1044 5586 1536 1911 2321 6852 2765 -4472 -3531 3236 -1942 -4559 -3651 -4903 -7341 -2612 920
18894 920 3751 2615 -3083 -3640 -1954 1045 3550 995 -2760 7438 10732 12142 12363 3218 -2970
18879 -2970 -9701 -11049 -3027 -688 4790 4338 -3626 -4044 -1401 328 -1714 -1216 -4196 -1469 -11
18864 -11 -709 -2566 5352 12315 15195 17662 12671 7318 3822 8380 7053 5659 11628 8668 839
$$ packed form
18973A765K055j056p084l709M242P28o19j266l575K314N934N013J919l457q546
18958e342q88Q455l225l514N416p00j39N480k989m137o323L04M170r84L31L400
18942f85n83j446K59J846r3r89R962O593M698m293k949o106l78J981k776K361
18926G402q63k992m576K10J933k168m819m576j53m31k756O335K073l47j036N720
18910a044O630m050L75M10M531m087p237R41O767n178k617R08j252k438M729L532
18894I20K831j136n698n57J686K999K505k555l755J0198L294J410K21r145o188
18879b970o731j348Q022K339N478m52p964m18K643J729k042M98k980K727J458
18864a1o98j857P918O963K880K467m991n353l496M558j327j394N969k960p829
$$ plain form
18849 839 5600 2664 -1574 1343 3001 1742 987 1718 -305 -3335 -10457 -12539 -4003 -5901 -4059
18834 -4059 3088 4232 1001 3650 4547 5197 2192 -2160 -1229 -6351 -1893 2268 8662 11770 5556
18819 5556 2378 -962 -4327 5359 8635 5526 -3220 -6401 -4952 -6066 -1936 4895 3998 -8728 -6757
18804 -6757 -5328 -790 976 -658 1036 2321 -952 1838 1789 -854 1329 -1736 953 -477 -3962
18789 -3962 -2945 -65 1405 4541 5297 6763 1751 189 -4007 2735 5644 3307 4287 5377 2784
18774 2784 4083 -1628 -2826 3135 9883 26208 50611 73632 67793 36451 18006 4106 -6243
18761 -6243 -5258 -4172 -6964 -7130 -4098 -6781 -9635 -9372 -14655 -10033 -3545 3585 3420 -3350 -1561 2503
18745 2503 -2052 -10649 -11087 -6814 -2149 233 4913 5254 -905 -9473 -15009 -13732 -8924 -4208 -3253
$$ packed form
18849H39M761k936m238K917J658j259p55P31k023l030p122k082Q536j898J842
18834d059P147J144l231K649Q97O50l005m352R31n122M458M161O394L108o214
18819E556l178l340l365R686L276l109q746l181J449j114M130O831q97j2726J971
18804f757J429M538J766j634J694J285l273K790m9k643K183l065K689j430l485
18789c962J017K880J470L136P56J466n012j562m196O742K909k337R80J090k593
18774B784J299n711j198N961O748J6325K4403K3021n839l1342j8445j3900j0349
18761f243R85J086k792j66L032k683k854K63n283M622O488P130j65o770J789M064
18745B503m555q597m38M273M665K382M680L41o159q568n536J277M808M716R55
$$ plain form
18730 -3253 451 3692 683 1654 3432 7343 7930 2647 -261 -4282 -11558 -17686 -11281 -7418 -7688
18715 -7688 -8000 -9545 -4726 607 6020 -1454 -6354 -9088 -3000 -2433 2274 3427 4740 3476 2243
18700 2243 -5085 -9659 -6370 192 3838 2138 2207 2237 -2235 -6852 -2656 1345 9130 17114 12116 -2509
18684 -2509 -7006 -1756 40 -65 373 -3504 -2858 6328 13471 16157 14419 6404 256 2841 5412
18669 5412 4944 -1318 -3670 -5593 -1010 -252 -5890 -9675 -8209 -11948 -10517 -7756 -15511 -19016 -10141
18654 -10141 -6576 -3399 -3832 -141 3148 -2673 -2782 -585 7966 -4086 -12332 -7591 -5228 -6373 -5738
18639 -5738 569 1656 -6992 -2787 2879 3578 -513 -1844 -5173 -7473 -10189 -9044 -6899 -8295 -3248
18624 -3248 -581 -1715 -2706 -5760 -11144 -9216 -5945 -2022 -3832 -3888 -4039 -8235 -15045 -19244 -10108 -10175
$$ packed form
18730c253L704L241l009R71J778L911N87n283k908m021p276o128O405L863k70
18715g688l12j545M819N333N413p474m900k734O088N67M707J153J313j264j233
18700B243p328m574L289O562L646j700O9L0m472m617M196M001P785P984m998j4625
18684b509m497N250J796j05M38l877O46R186P143K686j738q015o148K585K571
18669E412m68o262k352j923M583P58n638l785J466l739J431K761p755l505Q875
18654a0141L565L177m33L691L289n821j09K197Q551j2052q246M741K363j145O35
18639e738O307J087q648M205N666O99m091j331l329k300k716J145K145j396N047
18624c248K667j134r91l054n384J928L271L923j810n6j51m196o810m199R136o7
$$ plain form
18608 -10175 -13665 -15667 -20302 -13822 -1762 1317 687 -5360 -7128 -6154 -6801 2988 4767 -2845 -7445
18593 -7445 -8438 -8262 -9662 -9493 -12741 -9075 -7130 -5011 467 3886 5297 1826 -977 -6455 -7674
18578 -7674 -4690 -5194 -1090 -5008 -4376 -5344 -2889 -6972 -9604 -10062 -4633 -4223 -8510 -8230 -9304 -10816
18562 -10816 -8167 -10605 -10276 -10684 -5075 -693 -3622 -8878 -11806 -14902 -4790 -4766 -11 3201 2004
18547 2004 -3422 -7417 -4964 -8656 -9184 -11777 -15069 -12466 -11990 -8604 -4805 -2620 -6578 -14059 -26312
18532 -26312 -20651 -4835 -1679 -1846 -6059 -6246 -8767 -10749 -10577 -8426 -11214 -10848 -8068 -8484 -10290
18517 -10290 -7174 -5368 -7603 -8706 -8109 -9970 -10404 -4238 -2138 -2253 -3753 -1966 -5522 1758 3195
18502 3195 -8916 -9393 -4445 -172 8081 10943 8350 1704 -5473 -6780 -8441 -9693 -12919 350
$$ packed form
18608a0175l490k002m635O480J2060L079o30o047j768R74o47R789J779p612m600
18593g445r93J76j400J69l248L666J945K119N478L419J411l471k803n478j219
18578g674K984n04M104l918O32r68K455m083k632m58N429M10m287K80j074j512
18562a0816K649k438L29m08N609M382k929n256k928l096J0112K4M755L212j197
18547B004n426l995K453l692n28k593l292K603M76L386L799K185l958p481j2253
18532b6312N661J5816L156j67m213j87k521j982J72K151k788L66K780m16j806
18517a0290L116J806k235j103N97j861m34O166K100j15j500J787l556P280J437
18502C195j2111m77M948M273Q253K862k593o646p177j307j661j252l226J3269
$$ plain form
18488 350 11351 6355 646 -6400 -8029 -2467 518 2159 2982 3936 5058 3772 2877 1348 -3202
18473 -3202 -8991 -10926 -9450 -6126 -7090 -4390 -2957 -2427 -1578 -3203 -6279 -10603 -9856 -9185 -9015 -10476
18457 -10476 -4084 4182 7349 1779 -7056 -3635 -6096 -9542 -9443 -5486 -1851 3042 6414 3911 -3531
18442 -3531 -5944 -3159 1577 -1636 -1469 -1202 -1071 4211 -331 1356 3855 -351 -5300 -4840 -8708 -2293
18426 -2293 672 -7038 -15374 -22589 -14617 -7027 -981 -4393 -11889 -20928 -22060 -14772 -14447 -12254 -2025
18411 -2025 1051 -2075 -3336 -4562 -6622 -3546 2191 10588 7029 3747 5140 6503 -2557 -2114 3851
18396 3851 6863 6399 4099 7749 6542 9684 1169 -2274 1960 3648 -210 -6263 -6829 -2167 -3951
18381 -3951 -4724 -4550 -4917 -9567 -9363 -4556 223 -245 -4724 -8205 -10095 -8357 -5770 -3277 2388 -971
$$ packed form
18488C50J1001m996n709p046j629N562K985J641Q23R54J122j286q95j529m550
18473c202n789j935J476L324r64K700J433N30Q49j625l076m324P47O71J70j461
18457a0476O392Q266L167n570q835L421k461l446R9L957L635M893L372k503p442
18442c531k413K785M736l213J67K67J31N282m542J687K499m206m949M60l868O415
18426b293K965p710q336p215P972P590O046l412p496r039j132P288L25K193J0229
18411b025L076l126j261j226k060L076N737Q397l559l282J393J363r060M43N965
18396C851L012m64k300L650j207L142q515l443M234J688l858o053n66M662j784
18381c951p73J74l67m650K04M807M779m68m479l481j890J738K587K493N665l359
$$ plain form
18365 -971 -6288 -5567 -2143 -3465 -1651 869 4355 -2933 -5752 -4989 -9103 -11703 -12090 -13166 -20269 -21860
18349 -21860 -15603 -11893 -10751 -8299 -4487 -4522 -2465 -6422 -3592 3913 4205 137 -3370 -6273 -12441
18334 -12441 -13523 -10742 -12995 -20158 -18621 -14375 -12060 -9662 -1613 9818 11605 7078 1174 -3098
18320 -3098 -6594 -8868 -8974 -16225 -20666 -16687 -10316 -10065 -15523 -16153 -9660 -3373 -586 -4808 -4090 -3747
18304 -3747 -1866 2673 11701 11213 5605 2142 4750 4167 240 -5306 -5574 -5226 -6780 -11067 -7865 -13565
18288 -13565 -18618 -19275 -10382 -6069 -8345 -11679 -12524 -12274 -11355 -10833 -12713 -10970 -10054 -8134 -7413 -2786
18272 -2786 -607 -2579 -7447 -10355 -8157 -8981 -11929 -15001 -8162 -10586 -18854 -18351 -15990 -12013 -5949
18257 -5949 -850 -2956 -3918 -5257 -8167 -8192 -1541 -5720 -13915 -7792 127 -3417 -5459 -11288 -11639 -14767
$$ packed form
18365i71n317P21L424j322J814K520L486p288k819P63m114k600l87j076p103j591
18349b1860O257L710J142K452L812l5K057l957K830P505K92m068l507k903o168
18334a2441j082K781k253p163J537M246K315K398Q049J1431J787m527n904m272
18320c098l496k274j06p251m441L979O371K51n458o30O493O287K787m222P18L43
18304c747J881M539R028m88n608l463K608n83l927n546k68L48j554m287L202n700
18288a3565n053o57Q893M313k276l334q45K50R19N22j880J743R16J920P21M627
18272b786K179j972m868k908K198q24k948l072O839k424q268N03K361L977O064
18257e949N099k106r62j339k910k5O651m179q195O123P919l544k042n829l51l128
$$ plain form
18241 -14767 -7725 3881 -707 -1633 694 2432 2098 -7916 -11584 -10501 -16693 -20005 -13723 -4077
18227 -4077 345 -2697 -6810 -10350 -8666 -13425 -20135 -19808 -11524 -8949 -12223 -16416 -13453 -16766 -26805
18212 -26805 -30383 -22118 -20045 -16324 -10903 -6096 -5138 -2685 -398 -1829 -3364 1604 2369 -3679 -7124
18197 -7124 -11245 -16908 -15824 -15322 -19947 -21656 -18273 -17464 -11304 -9295 -15512 -20734 -18976 -18325 -19497
18182 -19497 -18231 -17113 -16732 -20476 -15528 -18097 -20390 -20288 -15182 -6664 -4187 -2745 -5759 -8306 -10442
18167 -10442 -10684 -7843 -4934 -9210 -7991 -9340 -12003 -14788 -14566 -16484 -17689 -10012 -7127 -6237 -1687
18152 -1687 3092 1093 -4566 -3769 -5475 -11425 -7748 123 -40 -4156 -4097 -1452 1880 1695 3180 12831
18136 12831 17929 10636 12389 5655 2739 1364 8342 21414 33271 37141 42817 49494 62035 71025
$$ packed form
18241a4767P042J1606m588r26K327J738l34j0014l668J083o192l312O282R646
18227d077M422l042m113l540J684m759o710L27Q284K575l274m193K963l313j0039
18212b6805l578Q265K073L721N421M807R58K453K287j431j535M968P65o048l445
18197g124m121n663J084N02m625j709L383Q09O160K009o217n222J758O51j172
18182a9497J266J118L81l744M948k569k293J02N106Q518K477J442l014k547k136
18167a0442k42K841K909m276J219j349k663k785K22j918j205P677K885Q90M550
18152a687M779j999n659P97j706n950L677P871j63m116N9K645L332j85J485R651
18136A2831N098p293J753o734k916j375O978J3072J1857L870N676O677J2541Q990
$$ plain form
18122 71025 82121 107994 143605 193408 239401 306448 422476 598330 880997 1373536 2312498
18111 2312498 4110119 7338413 12287758 15353609 11398252 6311704 3661691 2393576
18103 2393576 1698549 1291277 1021666 815019 662800 553666 482167 428249 378802 332550
18093 332550 299508 271851 247313 224788 194683 172118 163772 150360 135416 125403 113748 98613
18081 98613 89927 92428 98822 91278 89763 92893 95227 82979 72093 61693 59357 54430 54857 50122
18067 50122 55999 48110 47319 49551 52154 47690 43912 41082 32296 33074 34329 42486 38617 33679 39059
18052 39059 39291 27608 19978 17327 23185 31451 33853 35039 33577 29878 34548 31928 28189 32564
18038 32564 33375 28694 31629 27035 19731 16160 20054 17721 21962 24924 21492 19981 24188 18031 22103
$$ packed form
18122G1025J1096K5873L5611M9803M5993O7047J16028J75854K82667M92539R38962
18111B312498J797621L228294M949345L065851l955357n086548k650013j268115
18103B393576o95027m07272k69611k06647j52219j09134p1499n3918m9447m6252
18093C32550l3042k7657k4538k2525l0105k2565q346j3412j4944j0013j1655j5135
18081I8613q686K501O394p544j515L130K334j2248j0886j0400k336m927M27m735
18067E0122N877p889p91K232K603m464l778k830q786P78J255Q157l869m938N380
18052C9059K32j1683p630k651N858Q266K402J186j462l699M670k620l739M375
18038C2564Q11m681K935m594p304l571L894k333M241K962l432j511M207o157M072
$$ plain form
18023 22103 19474 12993 16032 14484 7235 9050 14091 18582 16110 12670 11222 12676 19777 14394
18009 14394 8146 5261 10950 16603 23506 22252 16537 16931 24534 21349 8225 6610 12693 9932
17995 9932 8607 8358 18405 26207 22181 16446 15846 12697 14626 20304 15438 14800 19564 16007 11549
17980 11549 6642 3343 9852 13152 10441 4905 9399 13991 9465 3881 3243 1998 12890 15142
17966 15142 5463 708 7281 5885 1998 -841 4993 8992 5967 3927 7467 9083 3591 -1382
17952 -1382 1944 3344 858 -831 12007 22367 22239 19839 19139 20715 14457 8918 5172 6570 6561
17937 6561 3691 1788 4970 8474 4101 2188 7480 10241 9728 5618 2282 1211 3667 1108 -215
17922 -215 2223 9155 8710 -1904 -4370 -938 -1245 -3987 522 -1102 -2686 5802 3632 2231 3278
$$ packed form
18023B2103k629o481L039j548p249J815N041M491k472l440j448J454P101n383
18009A4394o248k885N689N653O903j254n715L94P603l185j3124j615O083k761
17995I932j325k49J0047P802m026n735o00l149J929N678m866o38M764l557m458
17980A1549m907l299O509L300k711n536M494M592m526n584o38j245J0892K252
17966A5142r679m755O573j396l887k839N834L999l025k040L540J616n492m973
17952a382L326J400k486j689J2838J0360j28k400p00J576o258n539l746J398r
17937F561k870j903L182L504m373j913N292K761n13m110l336j071K456k559j323
17922b15K438O932m45j0614k466L432l07k742M509j624j584Q488k170j401J047
$$ plain form
17907 3278 7336 6507 7872 6509 9821 2892 897 2705 3191 2535 803 1275 4931 7152 1053 -6407
17891 -6407 -5471 -517 6151 6087 -1232 3416 8679 11506 9428 8363 5817 582 2746 4269 4266 -3187
17875 -3187 -1663 2414 12040 16270 18355 15607 13119 10612 66 -8607 -5569 -964 5722 10111
17861 10111 5603 9622 9522 4928 4680 2459 5555 8391 15228 15114 11044 3186 2246 -205 4799
17846 4799 1197 2154 2477 6926 12133 10386 -359 -3536 1846 2528 2916 -3911 -2075 -243 7289
17831 7289 3858 -6299 -3970 3153 6618 -822 -1884 -2262 4082 4415 -595 -16 2723 -2277 -9347
17816 -9347 -7464 -1968 1476 4128 -5244 -8698 -5192 -532 -2873 -1649 856 8568 7100 2330 -3592
17801 -3592 -11528 -8981 -2750 -3813 -5872 619 5734 9447 7604 8848 13715 14080 13630 13170 9235
$$ packed form
17907C278M058q29J365j363L312o929j995J808M86o56j732M72L656K221o099p460
17891f407R36M954O668o4p319M648N263K827k078j065k546n235K164J523lp453
17875c187J524M077R626M230K085k748k488k507j0546q673L038M605O686M389
17861A0111m508M019j00m594k48k221L096K836O837j14m070p858r40k451N004
17846D799l602R57L23M449N207j747j0745l177N382O82L88o827J836J832P532
17831G289l431j0157K329P123L465p440j062l78O344L33n010N79K739n000p070
17816i347J883N496L444K652r372l454L506M660k341J224K505P712j468m770n922
17801c592p936K547O231j063k059O491N115L713j843J244M867L65m50m60l935
$$ plain form
17786 9235 11684 8928 3090 -3393 -8812 -331 12116 13750 17142 17456 10314 4217 691 -895 3208
17771 3208 8607 8017 368 -3999 -8575 -4891 -3279 3198 6654 2855 5654 6496 822 3782 9068
17756 9068 7779 1483 -2507 -229 904 2517 2340 1833 6252 6210 7970 6371 5440 5402 6908 10331
17740 10331 9551 4416 8388 1597 -8661 -8734 -314 2372 -1435 662 2240 334 -4784 -6869 -8601
17725 -8601 -7204 -2286 -10199 -10301 -4805 -5053 -3015 -2744 -3125 4918 6529 1836 -6070 -11054 -6824 -4143
17709 -4143 145 6534 9636 6829 1766 -1358 2343 4807 8785 11034 12214 13938 13425 9422 6624
17694 6624 4980 3611 -2984 -6757 -3381 1276 6162 2555 1841 4567 9303 8409 8259 6160 1203
17679 1203 3220 14514 16418 16998 8623 2124 5648 9564 7139 283 -3923 -3635 -6276 1052 2450
$$ packed form
17786I235K449k756n838o483n419Q481J2447J634L392L14p142o097l526j586M103
17771C208N399n90p649m367m576L684J612O477L456l799K799Q42n674K960N286
17756I068j289o296l990K278J133J613j77n07M419m2J760j599r31l8J506L423
17740A0331p80n135L972o791j0258p3Q420K686l807K097J578j906n118k085j732
17725h601J397M918p913j02N496k48K038K71l81Q043J611m693p906m984M230K681
17709d143M288O389L102k807n063l124L701K464L978K249J180J724n13m003k798
17694F624j644j369o595l773L376M657M886l607p14K726M736q94j50k099m957
17679A203K017J1294J904N80q375o499L524L916k425o856m206K88k641P328J398
$$ plain form
17664 2450 3781 9718 10228 4162 8393 -2829 -10821 -4418 -586 -4180 -4492 -3681 -4595 -5763 -6507 -6669
17648 -6669 1550 6614 2107 228 -1459 -1084 -5825 -5227 -2253 2364 2951 993 7399 9268 14025
17633 14025 9788 12455 12731 9172 12946 15078 16991 16544 17790 19540 15047 8849 3679 -4338 1359
17618 1359 8828 10168 5793 5597 3338 1927 -1971 -5616 835 3376 3350 -408 -2930 -2987 -2536 -1896
17602 -1896 -4498 1309 5490 179 4474 8894 8081 6699 1955 -1324 -3563 -4620 -2513 141 -5264
17587 -5264 -5966 -473 651 4661 6605 -53 -7361 -4877 -5833 -2115 -1056 -5979 -7362 700 -1978
17572 -1978 -2402 -198 3738 7250 7705 3816 6549 6511 4886 2089 1578 -1786 -2453 -8440 -13433 -10489
17556 -10489 -8179 -2956 3706 5700 1506 -2908 -4525 -5161 -1469 813 6159 12101 14286 9426 6851
$$ packed form
17664B450J331N937N10o066M231j1222p992O403L832l594l12Q11r14j168p44j62
17648f669Q219N064m507j879j687L75m741N98K974M617N87j958O406J869M757
17633A4025m237K667K76l559L774K132J913m47J246J750m493o198n170q017N697
17618A359P469J340m375j96k259j411l898l645O451K541k6l758k522n7M51O40
17602a896k602N807M181n311M295M420q13j382m744l279k239j057K107K654n405
17587e264p02N493J124M010J944o658p308K484r56L718J059m923j383Q062k678
17572a978m24K204L936L512M55l889K733l8j625k797n11l364o67n987m993K944
17556a0489K310N223O662J994m194m414j617o36L692K282N346N942K185m860k575
$$ plain form
17541 6851 8009 7102 7188 12759 14467 10874 8489 7593 7153 7314 4008 6996 11338 11364 14948 16005 12748
17524 12748 12745 9798 6843 261 4612 7704 9227 8058 2149 -4056 -5887 -10029 -8069 91 4593
17509 4593 4197 -3773 -9817 1083 4846 3861 3709 -280 -5386 -3663 878 6384 2885 1506 639
17494 639 -7877 -13107 -8505 509 3140 -2104 1906 3203 10935 14373 10387 9020 7136 5965 4264
17479 4264 -3332 -4613 -3816 -3396 -1317 3657 2676 -5464 -5796 2193 3763 -399 -3334 -2818 2821 7330
17463 7330 10877 8182 5585 6835 6359 -64 -927 -1211 859 715 6673 11093 9042 3534 890 4181
17447 4181 7550 9649 23654 38493 55788 80751 91090 61685 32668 17143 15122 14048 8661
17434 8661 6447 6474 7197 9553 12132 3662 2433 8827 8726 3885 6575 12595 14482 10925 4695 1666
$$ packed form
17541F851J158r07Q6N571J708l593k385q96m40J61l306K988M342K6L584J057l257
17524A2748lk947k955o582M351L092J523j169n909o205j831m142J960Q160M502
17509D593l96p970o044J0900L763r85j52l989n106J723M541N506l499j379q67
17494F39q516n230M602R014K631n244M010J297P732L438l986j367j884j171j701
17479D264p596j281P97M20K079M974r81q140l32P989J570m162k935N16N639M509
17463G330L547k695k597J250m76o423q63k84K070j44N958M420k051n508k644L291
17447D181L369K099J4005J4839J7295K4963J0339k9405k9017j5525k021j074n387
17434H661k214K7P23K356K579q470j229O394j01m841K690O020J887l557o230l029
$$ plain form
17418 1666 -137 -634 -214 3772 3995 3037 7384 14987 17324 10347 9472 5045 3772 5095 -614 1000
17402 1000 -5783 -6000 -4003 -4567 -2005 1985 625 4127 4500 4241 9323 10925 12465 5110 -1280 2534
17386 2534 -121 -2761 -1661 2561 3763 6950 6556 3158 3853 2394 1344 -240 -839 1392 1698 878
17370 878 -11818 -16888 -12099 -5413 -905 1753 -4 839 775 5448 3570 -1029 -5831 -6195 -3465 -4611
17354 -4611 -1660 -392 1322 2547 2920 2785 4861 5494 3693 7448 11355 6372 5955 675 310 5458
17338 5458 8171 8406 4616 -4208 -5828 -1543 5297 12923 15831 18708 20774 8471 -997 1002 2527
17323 2527 -4327 -8272 -5648 1295 7878 7723 8368 8698 8584 4181 549 223 -9128 -8809 -2515 -9619
17307 -9619 -12649 -10969 -11111 -13126 -6821 -5211 -3528 -3398 -2723 1427 -2143 -11594 -15610 -9923 -10158 -9736
$$ packed form
17418A666j803m97M20L986K23r58M347P603K337o977q75m427j273J323n709J614
17402A000o783k17J997n64K562L990j360L502L73k59N082J602J540p355o390L814
17386B534k655k640J100M222J202L187l94l398O95j459j050j584n99K231L06q20
17370H78j2696n070M789O686M508K658j757Q43o4M673j878m599m802l64K730j146
17354d611K951J268J714J225L73j35K076O33j801L755L907m983m17n280l65N148
17338E458K713K35l790q824j620M285O840P626K908K877K066j2303r468J999J525
17323B527o854l945K624O943O583j55O45L30j14m403l632l26r351L19O294p104
17307i619l030J680j42k015O305J610J683J30O75M150l570r451m016N687k35M22
$$ plain form
17291 -9736 -8158 -2483 -1997 -715 -2798 -3324 -4613 -7849 -7342 -2230 -4324 -4083 -1745 -2777 -3681 690
17275 690 8160 5408 1734 -5790 -8446 -304 725 720 -130 788 2265 -5434 -10277 -1999 5746 6875
17259 6875 882 -2593 3270 1298 -1195 2100 -1831 -1952 3155 3984 -1021 -2488 -7171 -7865 -5295
17244 -5295 193 3344 3982 1868 1732 -4239 -8148 -10843 -11750 -8463 -4762 -460 3103 10947 3358
17229 3358 4489 6430 2995 3342 6600 9791 14711 16401 5145 -3664 -6061 -5729 -7109 -1731 1442
17214 1442 -3817 -5081 -10981 -13712 -14225 -11274 -9172 -8028 -1808 3330 276 -8881 -11582 -3928 2445
17199 2445 1916 8393 2158 -4016 -6915 -4434 -8923 -11520 -6132 404 -2205 -3514 -7116 1176 4086
17184 4086 4095 865 7904 12011 9248 317 2011 3868 -49 -2013 -3793 3583 5795 3899 -2145
$$ packed form
17291i736J578N675M86J282k083n26j289l236N07N112k094K41K338j032r04M371
17275F90P470k752l674p524k656Q142J029nq50R18J477p699m843Q278P745J129
17259F875n993l475N863j972k493L295l931j21N107Q29n005j467m683o94K570
17244e295N488L151O38k114j36n971l909k695r07L287L701M302L563P844p589
17229C358J131J941l435L47L258L191M920J690j1256q809k397L32j380N378L173
17214A442n259j264n900k731n13K951K102J144O220N138l054r157k701P654O373
17199B445n29O477o235o174k899K481m489k597N388O536k609j309l602Q292K910
17184D086Rl230P039M107k763q931J694J857l917j964j780P376K212j896o044
$$ plain form
17169 -2145 -8174 -7276 -1169 -2261 -6355 -3958 -3790 -5126 -1456 1427 -945 -5019 -5430 -9990 -5450
17154 -5450 -8921 -7828 -10236 -11566 -4031 4640 465 2808 5686 3812 -1661 2494 6859 4781 555
17139 555 2503 -4371 -5237 -4242 -694 3251 8320 13623 15585 12855 8568 5093 894 -329 4673
17124 4673 5452 2795 3376 1727 -6694 -3848 2047 2743 1029 -4553 -7370 -8075 -8838 -13320 -14457 -10250
17108 -10250 -6327 -7295 -6147 -6362 -4231 -10251 -9225 -5900 -4783 -2912 5824 3634 430 -374 671
17093 671 428 2824 7198 10743 8853 3740 967 3751 9524 12364 8046 6782 1463 -7650 -10324
17078 -10324 -6886 -5967 -5712 -3700 1732 6520 9907 7235 -1255 -4818 -2956 -5354 -8215 -11187 -7977
17063 -7977 -2772 1346 5542 7441 4557 2098 -1511 -7823 -6287 -11500 -9000 4267 3649 -2643 -954
$$ packed form
17169b145o029Q98O107j092m094K397J68j336L670K883k372m074m11m560M540
17154e450l471J093k408j330P535Q671m175K343K878j874n473M155M365k078m226
17139E55J948o874q66R95L548L945N069N303J962k730m287l475m199j223N002
17124D673P79k657N81j649q421K846N895O96j714n582k817p05p63m482j137M207
17108a0250L923r68J148k15K131o020J026L325J117J871Q736k190l204q04J045
17093F71k43K396M374L545j890n113k773K784N773K840m318j264n319r113k674
17078a0324L438R19K55K012N432M788L387k672q490l563J862k398k861k972L210
17063g977N205M118M196J899k884k459l609o312J536n213K500J3267o18o292J689
$$ plain form
17048 -954 9381 8226 7518 8150 5440 -1010 -5340 -6547 -3965 -5153 -9349 -7080 4878 3209 -753
17033 -753 133 616 -58 2356 45 742 953 -2161 -1341 6589 14588 12825 8623 5900 -75 -1139
17017 -1139 2507 2689 -513 -4955 -7170 -3144 -3170 2147 4487 -834 -3319 -1799 722 3772 7148
17002 7148 7458 1879 92 -3427 -7299 -3739 -5739 -8953 -7510 -10993 -5705 -5368 -8331 -11959 -11228
16987 -11228 -8021 -3745 -2398 -4093 -795 -545 128 5555 3556 -3394 -1975 5082 8036 8041 4779 -286
16971 -286 724 -1043 -4368 -7808 -3262 -925 2508 -2300 -1235 9999 8193 4831 4414 7976 167
16956 167 -4522 2595 1284 37 -4350 -5618 -12574 -17539 -13586 -1907 3556 -1200 -3659 -8108 -8648
16941 -8648 -8589 -7195 -3061 2863 383 -3780 -6657 -4251 -8771 -4561 3933 5322 2364 -137 7969
$$ packed form
17048i54J0335j155p08O32k710o450m330j207K582j188m196K269J1958j669l962
17033g53Q86M83o74K414k311O97K11l114Q20P930P999j763m202k723n975j064
17017a139L646J82l202m442k215M026k6N317K340n321k485J520K521L050L376
17002G148L10n579j787l519l872L560k000l214J443l483N288L37k963l628P31
16987a1228L207M276J347j695L298K50O73N427j999o950J419P057K954Nl262n065
16971b86J010j767l325l440M546K337L433m808J065J1234j806l362m17L562p809
16956A67m689P117j311j247m387j268o956m965L953J1679N463m756k459m449n40
16941h648N9J394M134N924k480m163k877K406m520M210Q494J389k958k501Q106
$$ plain form
16926 7969 3604 -1428 395 -199 -11 -9825 -6570 -1502 -2225 -5933 -6765 -3793 3800 6330 1579 1548
16910 1548 1604 8727 10828 2736 3843 8347 5197 2956 78 4533 3708 3411 4808 9977 6274 -1019
16894 -1019 -85 5837 3391 2618 -7905 -9388 -9713 -4429 -4490 -7176 -4629 -4324 -5642 -4829 -5699 5855
16878 5855 10383 9471 13564 10641 4477 2367 7660 12598 14876 8567 1791 -4966 -3247 -5967 -2865
16863 -2865 3775 2569 -1428 -440 1029 -3619 -247 1181 -2414 -8732 -11127 -9886 -4569 104 2471
16848 2471 -2446 2776 2377 -816 26 5117 7210 1486 -2658 -3799 -6087 -8931 -4614 -1106 -2918
16833 -2918 -6105 -2880 -1289 3125 4061 8762 6289 -4612 -5186 -4433 -8271 -8472 -11650 -15450 -9943
16818 -9943 -4689 -3613 -862 1020 -5632 -9621 -11579 -9691 -3019 3483 4311 5143 1953 -1468 -1474 5860
$$ packed form
16926G969m365n032J823n94J88r814L255N068p23l708q32K972P593K530m751l1
16910A548N6P123K101q092J107M504l150k241k878M455q25k97J397N169l703p293
16894a019R34N922k446p73j0523j483l25N284o1k686K547L05j318Q13q70J1554
16878E855M528r12M093k923o164k110N293M938K278o309o776o757J719k720L102
16863b865O640j206l997R88J469m648L372J428l595o318k395J241N317M673K367
16848B471m917N222l99l193Q42N091K093n724m144j141k288k844M317L508j812
16833b918l187L225J591M414R36M701k473j0901n74P53l838k01l178l800N507
16818i943N254J076K751J882o652l989j958J888O672O502Q28Q32l190l421oP334
$$ plain form
16802 5860 8774 8557 7097 -1253 -9410 -10614 -7274 293 7555 5545 2572 -10088 -9722 -6682 -2035
16787 -2035 -1727 6286 13780 13197 13367 2591 -6688 -15028 -13693 -12141 -16064 -18934 -13651 -11782 -11923
16772 -11923 -14305 -10666 -8250 -4328 -4593 -9285 -8890 -6145 -5106 -2245 -4086 -2044 -203 1863 1392
16757 1392 -5464 -12662 -9573 -6829 -4458 -4980 -13567 -14263 -11632 -14468 -12713 -6888 -2951 1377 -1611
16742 -1611 -1908 2729 -654 -752 1944 635 -2736 -6812 -5967 -1219 -4318 -4754 -6722 -9477 -10956 -6799
16726 -6799 -5744 -766 -1834 -4374 -4032 -2428 -1503 1328 1423 4269 7159 8146 1025 -1937 217 2122
16710 2122 -1622 7484 9579 7245 3900 597 -293 2585 2623 -4461 2447 453 2512 5479 6075 223
16694 223 -1685 -1944 -1912 6536 7530 4416 8178 10059 5750 1207 -4152 -8410 -7650 -8079 -3926 -2427
$$ packed form
16802E860K914k17j460q350q157j204L340P567P262k010k973j2660L66L040M647
16787b035L08Q013P494n83J70j0776r279q340J335J552l923k870N283J869j41
16772a1923k382L639K416L922k65m692L95K745J039K861j841K042J841K066m71
16757A392o856p198L089K744K371n22q587o96K631k836J755N825L937M328k988
16742a611k97M637l383r8K696j309l371m076Q45M748l099m36j968k755j479M157
16726f799J055M978j068k540L42J604R25K831R5K846K890R87p121k962K154J905
16710B122l744R106K095k334l345l303q90K878L8p084O908j994K059K967N96n852
16694B23j908k59L2Q448R94l114L762J881m309m543n359m258P60m29M153J499
$$ plain form
16678 -2427 -9026 -9395 -3083 3027 9327 12114 1212 -4448 -5426 -9881 -6216 -878 -4301 -1551 -22
16663 -22 -5263 -5128 -855 2864 -475 2389 6744 9422 8933 5880 -967 -2339 -9965 -13717 -4845 -778
16647 -778 -1396 186 -1578 162 -478 3205 6745 7423 2060 -3820 -8568 -4087 -1053 -10222 -16053 -12558
16631 -12558 -7166 -7908 -11432 -7721 -188 -3406 -3421 -689 2855 2927 -892 -2564 -5187 -6188 -6686 3008
16615 3008 8482 11959 6244 3937 1397 7621 2150 -1483 -1826 708 1006 2774 5239 3847 -3420
16600 -3420 -8759 -6905 -4160 -1890 3775 870 5120 8397 1801 -4297 -4131 -3440 -1522 4308 4730
16585 4730 5571 6273 4387 2289 342 922 -6324 -13491 -13840 -5090 -2791 -4897 -3773 -7379 -6526 -5007
16569 -5007 -8517 -10537 -10175 -3983 -2461 3790 3331 -3267 -5997 -9177 -13211 -8109 -3130 -2062 1060
$$ packed form
16678b427o599l69O312O110O300K787j0902n660r78m455L665N338l423K750J529
16663b2n241J35M273L719l339K864M355K678m89l053o847j372p626l752Q872M067
16647g78o18J582j764J740o40L683L540O78n363n880m748M481L034r169n831L495
16631a2558N392p42l524L711P533l218j5K732L544P2l819j672k623j001m98R694
16615C008N474L477n715k307k540O224n471l633l43K534K98J768K465j392p267
16600c420n339J854K745K270N665k905M250L277o596o098J66O91J918N830M22
16585D730Q41P02j886k098j947N80p246p167l49Q750K299k106J124l606Q53J519
16569e007l510k020L62O192J522O251m59o598k730l180m034N102M979J068L122
$$ plain form
16554 1060 2631 -475 -6549 -5676 -689 1571 361 3776 10351 10268 13337 9861 9793 4841 1312 7909
16538 7909 6333 1557 -259 -5815 -2473 9390 13201 7521 -2005 -119 -352 -699 3133 10702 11956
16523 11956 7394 -1997 -9321 -555 -44 -5855 -6592 -7408 -7994 -2603 -130 -2121 -3663 -4104 -2801 3311
16507 3311 1797 6105 7432 4118 -1904 -4565 4323 8157 5676 1064 -2091 -7159 -7910 -6466 -4645
16492 -4645 -4517 515 1409 908 -2386 -6260 -1794 288 -2745 -6384 -4648 -5325 -5620 -4005 -7469 -6614
16476 -6614 -4712 -2918 -2580 1339 -4163 -10988 -8391 -10378 -9397 -3314 871 -1094 -2826 -4149 -4335
16461 -4335 -5948 -8703 -4551 -2674 -839 -172 677 17 -3145 -1004 3128 4697 5103 5086 4173 1006
16445 1006 4296 489 2867 6487 1464 -1079 -946 -4834 -10988 -3841 2674 2702 -3867 -2141 4266
$$ packed form
16554A060J571l106o074Q73M987K260j210L415O575q3L069l476o8m952l529O597
16538G909j576m776j816n556L342J1863L811n680r526J886k33l47L832P569J254
16523A1956m562r391p324Q766N11n811p37q16n86N391K473j991j542m41J303O112
16507C311j514M308J327l314o022k661Q888L834k481m612l155n068p51J444J821
16492d645J28N032Q94n01l294l874M466K082l033l639J736o77k95J615l464Q55
16476f614J902J794L38L919n502o825K597j987R81O083M185j965j732j323j86
16461d335j613k755M152J877J835O67Q49o60l162K141M132J569M06j7r13l167
16445A006L290l807K378L620n023k543J33l888o154P147O515K8o569J726O407
$$ plain form
16430 4266 4742 6438 1619 -2699 -2000 -755 -4813 -6340 -4459 -3689 -7500 -55 4896 -7425 -13785
16415 -13785 -9598 -2214 -2297 -9724 -11266 -7686 -2318 322 -7393 -8881 -11074 -6153 -176 -3976 -4372
16400 -4372 2035 1481 -6281 -10264 -9024 -7670 -6018 -6261 -8251 -7956 4321 1482 -3681 -4394 -5673
16385 -5673 -72 -2624 -8551 -2351 1521 -1256 2694 3989 -2640 1748 7640 2764 2912 6170 3212
16370 3212 3228 -5074 -6052 -9280 -618 -926 317 2748 -642 -699 -44 2576 15664 19377 13658 4671
16354 4671 -768 -6766 -2539 2876 4329 3897 -738 -6265 -5551 -11151 -15105 -15918 -17367 -11050 -7051
16339 -7051 -541 -2824 -1412 3025 -3506 -5040 -3021 -2592 -4871 -14067 -15397 -9523 1427 4324 6256
16324 6256 4371 2665 4130 2552 -6575 -6456 -551 3329 386 -3340 -1130 3189 10894 6123 2415
$$ packed form
16430D266M76J696m819m318O99J245m058j527J881P70l811P445M951j2321o360
16415a3785M187P384q3p427j542L580N368K640p715j488k193M921N977l800l96
16400d372O407n54p762l983J240J354J652k43j990K95J2277k839n163p13j279
16385e673N601k552n927O200L872k777L950J295o629M388N892m876J48L258k958
16370C212J6q302r78l228Q662l08J243K431l390n7O55K620J3088L713n719q987
16354D671n439n998M227N415J453m32m635n527P14n600l954q13j449O317L999
16339g051O510k283J412M437o531j534K019M29k279r196j330N874J0950K897J932
16324F256j885j706J465j578r127J19N905L880k943l726K210M319P705m771l708
$$ plain form
16309 2415 836 -4424 -4081 2240 4616 4367 3933 10907 11224 14427 12085 -2124 -9357 -4842 -8348
16294 -8348 -6541 -6804 -12037 -15675 -12526 -5082 -6740 1459 5815 251 -1069 1018 2270 -1459 -730
16279 -730 1217 -2234 -5071 -1197 9169 14186 19154 21467 18783 16901 16458 13675 10649 11633 11891
16264 11891 7273 -5004 -8244 -6027 -6061 -4518 214 4228 5959 3652 -3402 -216 240 -365 1501
16249 1501 2691 492 -7238 -10748 -4398 1354 1307 -1386 4849 10820 13653 13011 4461 262 1849
16234 1849 -2255 -2295 3106 -713 -7039 -8076 -4019 -905 928 -254 -3299 -1340 6418 7892 6358
16219 6358 8559 8877 6042 -24 -7602 -7738 -11121 -9521 -3496 397 406 -5040 -4751 -759 -369 -422 -2205
16202 -2205 -2568 -1905 2641 1379 -3239 5140 8623 4701 3434 2507 256 -2878 -4236 3436 5773
$$ packed form
16309B415j579n260L43O321K376k49m34O974L17L203k342j4209p233M515l506
16294h348J807k63n233l638L149P444j658Q199M356n564j320K087J252l729P29
16279g30J947l451k837L874J0366N017M968K313k684j882m43k783l026R84K58
16264A1891m618j2277l240K217l4J543M732M014J731k307p054L186M56o05J866
16249A501J190k199p730l510O350N752m7k693O235N971K833o42q550m199J587
16234A849m104m0N401l819o326j037M057L114J833j182l045J959P758J474j534
16219F358K201L18k835o066p578j36l383J600O025L893Rn446K89L992L90n3j783
16202b205l63O63M546j262m618Q379L483l922j267r27k251l134j358P672K337
$$ plain form
16187 5773 -3853 -5087 -6315 -2185 -438 -1468 -1389 -7954 -2459 -1732 -1965 -7503 -2972 -9545 -15262 -12095
16171 -12095 -7785 -4403 -4580 500 358 -2434 -302 -26 1756 1651 43 -11559 -11849 -7512 -15412
16156 -15412 -21540 -18340 -14094 -8404 -4075 -638 2867 3702 1758 22 -2601 -4601 -2593 -7582 -7781
16141 -7781 -8493 -6041 -2989 983 4180 5822 7374 11276 2596 -181 3156 2424 810 3687 5533
16126 5533 8567 3252 -5176 -1685 -2898 -2770 994 -2720 1967 578 -1022 1386 -228 367 -5095
16111 -5095 -8335 -5599 -9415 -13386 -7458 -3635 836 8777 8468 5540 -4120 -12571 -9040 -5278 -1786
16096 -1786 3652 -3645 -2895 -2943 -4924 -3659 -2731 517 4407 12272 9410 97 -3024 -12065 -13792 -2794
16080 -2794 5008 10223 6423 2043 8501 7200 5081 3259 3301 1576 3602 6088 6128 -47 -1325 -2628
$$ packed form
16187E773r626j234j228M130J747j030P9o565N495P27k33n538M531o573n717L167
16171a2095M310L382j77N080j42k792K132K76J782j05j608j1602k90M337p900
16156a5412o128L200M246N690M329L437L505Q35j944j736k623k000K008m989j99
16141g781p12K452L052L972L197J642J552L902q680k777L337p32j614K877J846
16126E533L034n315q428L491j213J28L764l714M687j389j600K408j614N95n462
16111e095l240K736l816l971N928L823M471P941l09k928r660q451L531L762L492
16096a786N438p297P50m8j981J265R28L248L890P865k862r313l121r041j727J0998
16080b794P802N215l800m380O458j301k119j822M2j725K026K486M0o175j278j303
$$ plain form
16064 -2628 -2128 1401 4217 3024 4139 5478 -681 2249 1841 -2876 -9331 -5214 -6781 -200 475
16049 475 -3125 -6465 -8551 -7772 -6435 -1445 -262 -526 -4962 -1018 5138 2493 -6441 -5547 -7059 -5057
16033 -5057 -5786 -9998 -7939 -7588 -5436 2851 10081 10214 4389 703 339 -5190 -6346 -4928 -2572 -8758
16017 -8758 -818 3590 2010 5940 3263 -854 -5995 -8855 -5258 3524 855 -2320 -921 1890 3578
16002 3578 -4770 -1241 -1889 1869 6791 11118 5537 1885 2492 457 4426 6322 1308 -3173 -3013
15987 -3013 328 -1488 -7365 -10013 -14691 -8464 -5428 -8440 -9806 -13112 -11813 -9590 -11758 -10642 -9158
15972 -9158 -6732 -9129 -6471 -8634 -10168 -11260 -10124 -5614 -1264 -7294 -11358 -4908 -3305 -9315 -8417
15957 -8417 -8500 -8567 -6469 -7067 -5289 -3140 -9020 -7649 -10076 -10926 -9798 -8649 -3922 -1868 -3483 -5048
$$ packed form
16064b628N00L529K816j193J115J339o159K930m08m717o455M117j567O581O75
16049D75l600l340k086P79J337M990J183k64m436L944O156k645q934Q94j512K002
16033e057p29m212K059L51K152Q287P230J33n825l686l64n529j156J418K356o186
16017h758P940M408j580L930k677m117n141k860L597Q782k669l175J399K811J688
16002C578q348L529o48L758M922M327n581l652O07k035L969J896n014m481J60
15987c013L341j816n877k648m678O227L036l012j366l306J299K223k168J116J484
15972i158K426k397K658k163j534j092J136M510M350o030m064O450J603o010Q98
15957h417q3o7K098n98J778K149n880J371k427q50J128J149M727K054j615j565
$$ plain form
15941 -5048 -1386 -1159 3699 2830 -2101 -1147 5115 8106 12270 13692 11453 9809 5681 1781 -374
15926 -374 4465 9739 3255 3318 2248 4571 7614 11173 8876 5522 -5690 -5220 -2032 387 -869
15911 -869 1174 5025 3088 -5106 -8795 -6795 -8036 -14132 -17738 -19729 -17343 -9880 -12651 -12144 -5269
15896 -5269 -2743 -3677 2455 8359 11547 8116 101 -9296 -12370 -14083 -19748 -16849 -591 5378 -871
15881 -871 -92 558 -1891 -4059 -4847 -1495 2710 -3851 -1805 5474 2973 -6214 -7142 -9751 -14416 -12583
15865 -12583 -3731 3365 5212 9277 1471 -1555 -1231 -2012 -7022 -11510 -15084 -8322 -7219 -8581 -7489
15850 -7489 -5347 3408 9437 7558 -3969 -6907 -10147 -7680 -6027 -3943 1174 2978 -386 -8223
15836 -8223 -10765 -5429 -5067 -3998 -7514 -6540 -5965 -9103 -4113 -546 1298 841 -4051 -979 -6539 -8480
$$ packed form
15941e048L662K27M858q69m931R54O262K991M164J422k239j644m128l900k155
15926c74M839N274o484O3j070K323L043L559k297l354j1212M70L188K419j256
15911h69K043L851j937q194l689K000j241o096l606j991K386P463k771N07O875
15896e269K526r34O132N904L188l431q015r397l074j713n665K899J6258N969o249
15881h71P79O50k449k168p88L352M205o561K046P279k501r187r28k609m665J833
15865a2583Q852P096J847M065p806l026L24p81n010m488l574O762J103j362J092
15850g489K142Q755O029j879j1527k938l240K467J653K084N117J804l364p837
15836h223k542N336L62J069l516R74N75l138M990L567J844m57m892L072n560j941
$$ plain form
15820 -8480 -14271 -21996 -19023 -13150 -4623 5374 6910 4923 1517 3731 1135 -5686 -1093 1807 -797
15805 -797 1784 4288 6898 4761 5717 9858 6169 2369 2140 2775 2321 -529 781 2699 4060 -1746
15789 -1746 832 5715 8377 5121 -715 -9012 -4194 -245 529 673 -4135 -6429 -4361 -2524 -1058
15774 -1058 -1510 -3764 -5667 -7484 -9936 -560 5717 3618 6242 2235 -1635 -1167 -703 -3334 -4576
15759 -4576 -7207 -2185 9340 10432 5889 3608 -2700 2756 4587 5973 -3900 -8902 -33 8722
15745 8722 5782 2305 -2939 -4476 1885 -1126 -1472 -9335 -6673 -4695 2968 4804 3688 8966 13387
15730 13387 17129 20145 24291 18570 13778 13340 4089 6674 5438 5496 3986 -226 -5155 -8689 -10714
15715 -10714 -11724 -8524 -3567 -5043 5472 8913 2002 -3663 -5870 993 1563 2766 13943 21003
$$ packed form
15820h480n791p725K973N873Q527R997J536j987l406K214k596o821M593K900k604
15805g97K581K504K610k137R56M141l689l800k29O35m54k850J310J918J361n806
15789a746K578M883K662l256n836q297M818L949P74J44m808k294K068J837J466
15774a058m52k254j903j817k452R376O277k099K624m007l870M68M64k631j242
15759d576k631N022J1525J092m543k281o308N456J831J386r873n002Q869Q755
15745H722k940l477n244j537O361l011l46p863K662J978P663J836j116N278M421
15730A3387L742L016M146n721m792m38r251K585j236N8j510m212m929l534k025
15715a0714j010L200M957j476J0515L441o911n665k207O863N70J203J1177P060
$$ plain form
15701 21003 14933 6524 -2153 -188 -6044 -6073 -3378 -325 -1458 -4666 1892 348 -5964 -10617 -6223
15686 -6223 -3649 1347 -106 -3595 -7696 -904 7578 4681 -2008 -6836 -5168 -8600 -14733 -21939 -18067
15671 -18067 -13793 -7935 -7943 -10943 -12228 -11471 -10054 107 6063 2919 -1234 -3693 -3496 4457 5318 -2858
15655 -2858 -4681 -3646 -6323 -7984 -3530 -632 -1742 -2591 -1213 -7081 -10759 -12464 -7548 1445 5914
15640 5914 -2866 -8662 -3529 -8271 -9925 -2648 -2805 164 8269 4409 960 4587 7739 6127 4374
15625 4374 3613 396 2974 5214 3777 7883 -2041 -6126 -3459 -3567 -3763 -5943 1841 4608 5767
15610 5767 -2035 -4287 1580 1687 -1420 1004 -1148 -4110 -4570 -8901 375 7366 10059 12932 17565
15595 17565 15898 10430 4441 5772 3955 -646 -633 -7676 -13004 -10035 -857 -562 1564 4374 2059
$$ packed form
15701B1003o070q409q677J965n856k9K695L053j133l208O558j544o312m653M394
15686f223K574M996j453l489m101O792Q482k897o689m828J668l432o133p206L872
15671a8067M274N858ql000j285P57J417J0161N956l144m153k459J97P953Q61q176
15655b858j823J035k677j661M454K898j110q49J378n868l678j705M916Q993M469
15640E914q780n796N133m742j654P277j57K969Q105l860l449L627L152j612j753
15625D374p61l217K578K240j437M106r924m085K667j08j96k180P784K767J159
15610E767p802k252N867J07l107K424k152k962m60m331R276O991K693K873M633
15595A7565j667n468n989J331j817m601J3p043n328K969R178K95K126K810k315
$$ plain form
15580 2059 6660 2729 1042 5888 3994 131 -736 588 845 -1506 -3831 -2285 -2705 -5623 -4294
15565 -4294 -6142 -7574 -1129 3271 3643 -1106 239 -154 -132 -2817 2478 10598 6343 -1636 -1186 8101
15549 8101 4486 -1352 563 -3745 -611 1184 2343 1312 2608 -464 -2533 -1960 -990 -1406 -7154
15534 -7154 -10521 -3011 11409 12707 12012 11675 1625 -5949 -2638 1324 1988 -5219 -9979 -8378 341
15519 341 4046 10840 11654 5282 -1799 -6120 -2579 -4329 -8392 -11057 -3756 -1355 -1362 339 501 8643
15503 8643 14078 16116 4650 -1116 -10033 -11536 -7373 -9083 -5701 1883 7469 2683 5018 8186
15489 8186 6276 -408 -3376 -3214 1862 -1126 -8329 -9885 -5039 3774 6681 136 -984 453 -638
15474 -638 -3652 -4516 -7544 -12928 -8972 -6518 -5422 -4920 -10083 -3708 -1655 -2182 -299 -499 -1739 -2281
$$ packed form
15580B059M601l931j687M846j894l863q67J324K57k351k325J546m20k918J329
15565d294j848j432O445M400L72m749J345l93K2k685N295Q120m255p979M50R287
15549H101l615n838J915m308L134J795J159j031J296l072k069N73R70m16n748
15534g154l367P510J4420J298o95l37j0050p574L311L962O64p207m760J601Q719
15519C41L705O794Q14o372p081m321L541j750m063k665P301K401pJ701J62Q142
15503H643N435K038j1466n766q917j503M163j710L382P584N586m786K335L168
15489H186j910o684k968J62N076k988p203j556M846Q813K907o545j120J437j091
15474f38l014q64l028n384L956K454J096N02n163O375K053n27J883k00j240n42
$$ plain form
15458 -2281 -1712 912 -536 -9774 -13576 -11597 -11230 -15392 -19434 -14060 -7122 -3496 -3347 -4375 -1009
15443 -1009 1465 -2655 2390 -6630 -9107 -285 -2161 -7644 -3642 -1715 -1214 -6090 -3977 -5751 -6223
15428 -6223 -822 1655 -2602 -858 -4994 -6907 -1918 -9056 -5532 3778 9427 8085 5806 1033 -4039
15413 -4039 -9800 -9475 -3798 3721 6518 6666 3561 -5092 -7626 -5134 -2939 -3712 -725 -1273 -13625
15398 -13625 -8631 -8859 -8704 -7692 -4538 -8 3522 3980 1101 3412 8507 13940 10605 3969 6446
15383 6446 6857 1039 -2424 -1956 -2310 820 -907 456 -563 1378 2945 2587 5060 5770 7737 6874
15367 6874 668 -2924 -2189 2843 2989 1637 160 3372 8692 1889 1473 3370 1458 2650 331
15352 331 -63 758 6127 5054 3002 5898 -1562 -8695 -8124 -4664 -6311 -7439 1005 4338 7323 8874
$$ packed form
15458b281N69K624j448r238l802J979L67m162m042N374O938L626J49j028L366
15443a009K474m120N045r020k477Q822j876n483M002J927N01m876K113j774m72
15428f223N401K477m257J744m136j913M989p138L524R310N649j342k279m773n072
15413d039n761L25N677P519K797J48l105q653k534K492K195p73K987n48j2352
15398a3625M994k28J55J012L154M530L530M58k879K311N095N433l335o636K477
15383F446M11n818l463M68l54L130j727J363j019J941J567l58K473P10J967q63
15367F874o206l592P35N032J46j352j477L212N320o803m16J897j912J192k319
15352C31l94Q21N369j073k052K896p460p133N71L460j647j128Q444L333K985J551
$$ plain form
15336 8874 -1662 -4123 -741 907 3329 5763 6425 3900 -1068 1223 2722 2294 2105 3 -1789
15321 -1789 -7154 -8313 -7708 -3625 5843 11067 10854 2767 3736 3942 -1291 4659 1108 384 4010 545
15305 545 -7804 -7638 -1119 1789 1320 297 159 -241 313 -5892 -5941 -4147 4365 8045 7426 9072 10926
15288 10926 9714 4150 -291 -3714 -4734 5235 3640 2875 2376 -6688 -2183 6033 5113 -1588 -6399
15273 -6399 -5125 -4695 -1497 1389 4333 2646 -505 -5073 -5556 -6619 -7580 -3219 -210 3304 3119 1060
15257 1060 -912 -133 -2163 -1277 -4356 1745 7070 4125 9875 12438 4407 -285 469 -4128 -7553
15242 -7553 -11146 -8011 -7338 -9654 -9058 -4163 -6869 -9625 -7651 -8252 -8066 -5034 -6515 -3416 4322 4231
15226 4231 -4339 -582 2593 5268 1502 167 -991 -3929 -4517 -2489 -1543 -2436 -6639 -8251 -10391
$$ packed form
15336H874j0536k461L382J648K422K434O62k525m968K291J499m28j89k102j792
15321a789n365j159O05M083R468N224k13q087R69K06n233N950l551p24L626l465
15305E45q349J66O519K908m69j023j38m00N54o205m9J794Q512L680o19J646J854
15288A0926j212n564m441l423j020R969j595p65m99r064M505Q216r20o701m811
15273f399J274M30L198K886K944j687l151m568m83j063r61M361L009L514j85k059
15257A060j972P79k030Q86l079O101N325k945N750K563q031m692P54m597l425
15242g553l593L135O73k316N96M895k706k756J974o01J86L032j481L099P738r1
15226D231q570L757L175K675l766j335j158k938n88K028R46q93m203j612k140
$$ plain form
15211 -10391 -9417 -11968 -4630 3035 11067 2521 -3989 -8739 -11748 -7560 -4382 909 -350 -2436 -5918
15196 -5918 -608 1740 6227 3423 614 6001 9006 3898 119 7332 12132 8910 3252 -4207 -8993
15181 -8993 -2139 -2792 -3405 -3561 3719 11707 7083 -5468 -12278 -9082 -7460 -6539 -6281 -11568 -8312 -1308
15165 -1308 -7076 -4835 -6037 -4558 -9847 -6121 -1891 1451 2937 1046 -2170 -8572 -4747 1229 4560
15150 4560 6283 7929 5438 9809 8148 7066 3968 389 -2375 -3893 2898 3603 -7491 -14696 -4214
15135 -4214 -708 -5397 -7884 -9503 -9890 -290 8712 12056 13839 3847 -1035 -4672 -4308 -2312 923
15120 923 4496 -2438 -3672 -1984 2153 5424 8020 12362 10623 6260 2213 5063 13733 15109 5901
15105 5901 2563 380 -4268 -4624 -2558 -1369 -2173 -8434 -9259 -5254 -5096 -2070 4579 2018 -2196 -3486
$$ packed form
15211a0391R74k551P338P665Q032q546o510m750l009M188L178N291j259k086l482
15196e918N310K348M487k804k809N387L005n108l779P213M800l222n658p459m786
15181h993O854o53o13j56P280P988m624j2551o810L196J622R21K58n287L256P004
15165a308n768K241j202J479n289L726M230L342J486j891l216o402L825N976L331
15150D560J723J646k491M371j661j082l098l579k764j518O791P05j1094p205J0482
15135d214L506m689k487j619l87R600R002L344J783r992m882l637L64J996L235
15120I23L573o934j234J688M137L271K596M342j739m363m047K850Q670J376r208
15105E901l338k183m648l56K066J189q04o261q25M005J58L026O649k561m214j290
$$ plain form
15089 -3486 4233 4004 -6726 -5652 1732 1881 5492 5205 -5026 -10412 -9392 -6981 -4612 -2907 7974
15074 7974 7409 -1152 -2191 -3731 -558 1001 71 2416 43 -3783 -2266 -8958 -4887 3536 7614
15059 7614 8184 6566 4160 68 -3636 -1270 -7531 -4089 -199 -2761 -4627 -3004 -1892 -5136 -6839
15044 -6839 -824 2944 4330 2013 5146 7594 10311 16276 9209 850 447 -1696 -5687 -5901 -6087
15029 -6087 -7590 -2651 -6564 -3206 1306 3087 5047 -2068 480 6455 7660 3850 3086 28 -4574
15014 -4574 -4868 -1285 1976 8742 6242 1756 306 6245 12591 2191 -6601 -3723 -5818 -570 257
14999 257 817 -394 1554 2418 -422 1110 -978 -836 4608 961 -3574 -4312 2851 4552 1448 807
14983 807 -2433 -469 3658 2143 2587 1712 1348 -512 -145 -126 735 8689 6594 1741 2380 -4905 -7703
$$ packed form
15089c486P719k29j0730J074P384J49L611k87j0231n386J020K411K369J705J0881
15074G974n65q561j039j540L173J559r30K345k373l826J517o692M071Q423M078
15059G614N70j618k406m092l704K366o261L442L890k562j866J623J112l244j703
15044f839O015L768J386k317L133K448K717N965p067q359m03k143l991k14j86
15029f087j503M939l913L358M512J781J960p115K548N975J205l810p64l058m602
15014d574k94L583L261O766k500m486j450N939O346j0400q792K878k095N248Q27
14999B57N60j211J948Q64k840J532k088J42N444l647m535p38P163J701l104o41
14983H07l240J964M127j515M44q75l64j860L67J9Q61P954k095m853O39p285k798
$$ plain form
14966 -7703 -86 3731 1067 3259 2210 4334 6533 3192 1283 1668 -2543 -7014 -5786 1151 9208
14951 9208 12839 10804 3807 389 -7609 -2716 4818 11703 14465 12372 8714 6621 5218 -250 -457
14936 -457 -5958 -7689 -402 1592 2898 5103 -1627 -548 6767 5448 -1600 2860 -1447 400 3429
14921 3429 -2174 -7393 -6286 -1325 -2347 3 2928 3839 1318 -2586 -3822 -2262 -5464 -5982 90
14906 90 4405 6752 12591 15152 13839 7784 4334 8963 4182 2986 289 -3533 -3397 242 713 1925
14890 1925 1142 1781 28 -201 2244 4728 6011 11207 10440 5075 1243 -4204 -7770 -4035 -3301 -1169
14874 -1169 -1936 -3227 -2445 5984 13089 10695 3294 -7213 -12476 -12616 -7880 -5736 -651 6870 11921
14859 11921 15219 8724 10536 9923 -974 -4940 -5931 -5903 1682 1519 -4436 -2625 1766 2711 -2808 -7081
$$ packed form
14966g703P617L817k664K192j049K124K199l341j909L85m211m471J228O937Q057
14951I208L631k035o997l418p998M893P534O885K762k093l658k093j403n468k07
14936d57n501j731P287J994J306K205o730J079P315j319p048M460m307J847L029
14921C429n603n219J107M961j022K350K925R11k521l904j236J560l202n18O072
14906I0M315K347N839K561j313o055l450M629m781j196k697l822J36L639M71J212
14890A925p83O39j753k29K445K484J283N196p67n365l832n447l566L735P34K132
14874a169p67j291P82Q429P105k394p401j0507n263j40M736K144N085P521N051
14859A1921L298o495J812o13j0897l966r91K8P585j63n955J811M391R45n519m273
$$ plain form
14843 -7081 -6591 -1498 -192 1405 4433 5417 5144 4109 3418 -2030 -5683 -3150 1271 1785 -823 3098
14827 3098 3289 -7132 -14928 -12012 -10966 -2107 3565 3346 12075 10255 13317 12828 9996 10982 9040
14812 9040 6541 663 -3499 4960 -4020 -4007 -4319 91 9389 7427 7111 4349 6404 6142 7598 13163
14796 13163 9107 3100 6508 15268 17811 13477 7482 -2657 -8338 -17658 -13403 -12727 -12703 -2149 3874
14781 3874 -548 -2943 -5295 -11301 -15017 -6415 1146 4816 5349 3767 3431 1920 -3159 -1572 -6099
14766 -6099 -8474 -8656 -11631 -2548 -1147 -3436 -4172 -1535 -2454 2474 6427 -859 -2601 -3170 -8011 -8552
14750 -8552 -11205 -10652 -11470 -9429 -6572 -9950 -13661 -11759 -13607 -11655 -14431 -8722 -6583 -6408 -3674
14735 -3674 -7352 -14753 -15361 -8314 -1580 -2808 -6629 -6816 -8780 -8970 -9524 -6210 -8629 -13399 -16997 -23347
$$ packed form
14843g081M90N093J306J597L028R84k73j035o91n448l653K533M421N14k608L921
14827C098J91j0421p796K916J046Q859N672k19Q729j820L062m89k832R86j942
14812I040k499n878m162Q459q980J3l12M410R298j962l16k762K055k62J456N565
14796A3163m056o007L408Q760K543m334n995j0139n681r320M255O76K4J0554O023
14781C874m422k395k352o006l716Q602P561L670N33j582l36j511n079J587m527
14766f099k375j82k975R083J401k289p36K637r19M928L953p286j742n69m841n41
14750h552k653N53q18K041K857l378l711J902j848J952k776N709K139J75K734
14735c674l678p401o08P047O734j228l821j87j964j90n54L314k419m770l598o350
$$ plain form
14719 -23347 -21184 -9226 -4113 -2843 -1464 -7143 -7380 -2845 -4125 893 3188 7727 7296 3609 1685
14704 1685 2853 203 2869 7447 13485 12246 11640 9202 6318 7237 3778 2062 -5695 -12054 -11768
14689 -11768 -11661 -6100 -5759 -3293 307 1961 -550 -6733 -8771 -646 -4793 -5115 -1483 627 -6199
14674 -6199 -5917 -3123 -5185 -9119 -8525 -6956 -9264 -5421 -1568 -5264 -9211 -13741 -7386 1088 6169
14659 6169 16263 17610 9726 4775 6528 6711 -3188 -6685 -4923 -3242 4591 9253 11521 7347 6432
14644 6432 5546 2861 -1786 1103 8289 8608 11851 12068 11272 5277 809 1202 430 2842 2935 4794 2363
14627 2363 3440 1698 2334 4980 3543 -1336 -1061 1932 8695 14353 4583 519 -4198 -1787 -7030
14612 -7030 -811 10583 14323 10121 8477 7311 2134 2055 -2176 -5375 -3369 -2190 -3671 -3946 -4690
$$ packed form
14719b3347K163J1958N113J270J379n679k37M535j280N018K295M539m31l687j924
14704A685J168k650K666M578O038j239o06k438k884R19l459j716p757o359K86
14689a1768J07N561L41K466L600J654k511o183k038Q125m147l22L632K110o826
14674f199K82K794k062l934N94J569k308L843L853l696l947m530O355Q474N081
14659F169J0094J347p884m951J753J83r899l497J762J681P833M662K268m174r15
14644F432q86k685m647K889P186L19L243K17p96n995m468L93p72K412R3J859k431
14627B363J077j742O36K646j437m879K75K993O763N658r770m064m717K411n243
14612g030O219J1394L740m202j644j166n177p9m231l199K006J179j481k75p44
$$ plain form
14597 -4690 -2658 2377 -1358 -6279 -12685 -11071 -2563 -472 -6670 -20499 -21207 -18290 -9994 395
14583 395 658 988 -5766 -6474 -5474 -4356 -4025 -6696 -6390 -683 -5397 -8486 -7397 2681 -2360 -6382
14567 -6382 -1303 -102 1631 10845 10828 4714 -399 6309 8884 -745 1183 3913 325 1092 4066
14552 4066 7141 4700 -2432 -3704 1294 5017 2090 -239 1052 2320 -1435 -2801 -2363 -12150 -14386
14537 -14386 -14896 -13388 -13096 -9815 -10331 -5588 1144 5450 2814 4522 2942 3697 9075 7476 2191
14522 2191 -620 -613 430 5910 9079 6473 1576 -199 89 -336 474 11098 18863 9953 4669 8622
14506 8622 13291 11654 6917 4741 -2234 2271 2791 -3931 -6316 -9057 -3545 -900 -606 -1781 3566
14491 3566 4787 3655 -1022 -6748 13 795 -4568 -6753 -6927 -10208 -4484 6768 10483 8878 9818
$$ packed form
14597d690K032N035l735m921o406J614Q508K091o198j3829p08K917Q296J0389
14583C95K63L30o754p08J000J118L31k671L06N707m714l089J089J0078n041m022
14567f382N079J201J733R214j7o114n113O708K575r629J928K730l588P67K974
14552D066L075k441p132j272M998L723k927k329J291J268l755j366M38r787k236
14537a4386n10J508K92L281n16M743O732M306k636J708j580P55N378j599n285
14522B191k811PJ043N480L169k606m897j775K88m25Q10J0624P765q910n284L953
14506H622M669j637m737k176o975M505N20o722k385k741N512K645K94j175N347
14491C566J221j132m677n726O761P82n363k185j74l281N724J1252L715j605R40
$$ plain form
14476 9818 3475 -129 1419 -6198 -12777 -5643 1468 4222 -5116 -10074 -4666 -3445 -8060 -6719 -5801
14461 -5801 2823 4168 -6338 -12937 -11114 -4449 529 6689 2102 -1214 1356 -296 -6460 -593
14447 -593 -16 1342 2309 -3915 -4880 509 4547 5081 11344 3781 -4277 -6311 -6686 -6043 -270 -1099 -10708
14430 -10708 -11703 -3736 -3736 -5052 -3600 1407 -825 -7990 -5621 712 1862 3005 301 -1524 3936
14415 3936 11415 5579 2766 5227 14319 14399 8920 3493 1461 -205 -3377 -6136 -10417 -9377 -2969
14400 -2969 3099 6225 4360 1121 4491 8514 6913 3816 6157 3736 712 793 -4181 -2726 -4594
14385 -4594 -4933 1582 13067 16806 21529 15144 8109 4623 1692 2025 -1321 -3499 1222 524 -6603
14370 -6603 -5754 1870 -2860 -8676 -4354 2589 1531 -1616 -3347 -6588 -9515 -7716 914 2989 -1072
$$ packed form
14476I818o343l604J548p617o579P134P111K754r338m958N408J221m615J341R18
14461e801Q624J345j0506o599J823O665M978O160m587l316K570j652o164N867
14447e93N77J358R67o224r65N389M038N34O263p563q058k034l75O43N773q29r609
14430a0708r95P967%j316J452N007k232p165K369O333J150J143k704j825N460
14415C936P479n836k813K461R092Q0n479n427k032j666l172k759m281J040O408
14400b969O068L126j865l239L370M023j601l097K341k421l024Q1m974J455j868
14385d594l39O515J1485L739M723o385p035l486k931L33l346k178M721o98p127
14370f603Q49P624m730n816M322O943j058l147j731l241k927J799Q630K075m061
$$ plain form
14355 -1072 -347 -1604 -2358 -2102 3170 5506 4936 7083 5420 -3366 -3672 -7112 -2902 -425 -3876 -1831
14339 -1831 -3172 623 3409 794 2971 1526 -6134 -3811 -4449 -2054 -5153 -1491 -2711 -4415 -9287
14324 -9287 -11049 -6406 -5467 -7976 -1817 1511 -10280 -19552 -17358 -10657 -4998 -3099 -2987 -5761 -7874
14309 -7874 -7283 -797 1779 -587 -3192 -3863 -593 5188 6366 5430 -916 -4434 -4889 -4956 -2294 -1637
14293 -1637 -475 2430 -2590 5121 8748 2696 2246 1927 819 6038 3096 -1819 2583 3685 1999
14278 1999 1379 855 -4086 -1901 52 -2000 -4252 -2216 -3023 -5361 -5113 -2558 -898 2780 -6400 -6575
14262 -6575 1593 2849 2038 -3775 -5007 -5754 -4328 -5149 -4702 -1740 -975 7945 10295 15633 17292 16471
14246 16471 9930 8346 3471 963 152 2395 4531 -2019 2523 4482 3445 3936 881 2992 2670
$$ packed form
14355a072P25j257p54K56N272K336n70K147j663q786l06l440M210K477l451K045
14339a831j341L795K786k615K177j445p660K323o38K395l099L662j220j704m872
14324i287j762M643R39k509O159L328j1791r272K194O701N659J899J12k774k113
14309g874N91O486K576k366k605o71L270N781J178r36o346l518m55o7K662O57
14293a637J162K905n020P711L627o052m50l19j108N219k942m915M402J102j686
14278A999o20n24m941K185J953k052k252K036q07k338K48K555J660L678r180j75
14262f575Q168J256q11n813j232p47J426q21M47K962P65Q920K350N338J659q21
14246A6471o541j584m875k508q11K243K136o550M542J959j037M91l055K111l22
$$ plain form
14231 2670 1581 -3330 -5776 -7542 -1985 -3564 766 3733 554 -7079 -3955 -3050 -4222 -11512 -10098
14216 -10098 -2094 3009 10404 7117 9013 17186 20059 12444 10580 17521 11508 4772 4804 4926 7633
14201 7633 14851 11783 8130 5122 6550 9781 4570 10977 5061 -2172 -7054 -6679 -847 -3678 -1872
14186 -1872 -1900 -2354 -4181 -9521 -10045 1953 2979 4224 7447 7580 4432 4619 -1483 -7060 -6524 -629
14170 -629 654 4223 11989 12309 11088 8374 4101 5155 9730 13621 18514 15415 9838 200 -2952
14155 -2952 4493 1209 -2305 -2920 -4648 33 2830 2929 -1103 -8577 -13204 -11915 -15241 -14926 -8989 -14013
14139 -14013 -17277 -10086 -8069 -13876 -18887 -13708 -11014 -14808 -19570 -21717 -13222 4351 9204 10444
14125 10444 8380 9952 15135 11570 8453 7027 4380 3041 2373 5839 -420 -3329 -1573 566 2529
$$ packed form
14231B670j089m911k446j766N557j579M330K967l179p633L124R05j172p290J414
14216a0098Q004N103P395l287J896Q173K873p615j864O941o013o736L2J22K707
14201G633P218l068l653l008J428L231n211O407n916p233m882L75N832k831J806
14186a872k8m54j827n340n24J1998J026J245L223J33l148J87o102n577N36N895
14170f29J283L569P766L20j221k714m273J054M575L891M893l099n577r638l152
14155b952P445l284l514o15j728M681K797R9m032p474m627J289l326L15N937n024
14139a4013l264P191K017n807n011N179K694l794m762k147Q495J7573M853J240
14125A0444k064J572N183l565l117j426k647j339o68L466o259k909J756K139J963
$$ plain form
14110 2529 6566 5707 730 2051 3329 3609 -382 5114 8569 8861 4017 7742 10095 7616 1923
14095 1923 -2895 1050 7642 8975 5815 9813 6163 5248 7204 7760 1046 4870 3349 11816 11456
14080 11456 8425 6780 1191 3513 2167 -150 -2952 -92 75 -3269 -3632 1613 6039 33 -4659
14065 -4659 -5434 -6804 -4063 -3623 -2108 -971 -492 6087 4635 3113 5711 5150 6220 546 -1864 319
14049 319 1428 1090 -1658 -535 -267 -768 -3096 -1807 6608 1380 -3436 -462 1416 5811 5145 -3793
14033 -3793 -3809 1605 4585 -670 156 8020 11027 10691 5771 2730 446 353 1348 332 -3560 -2347
14017 -2347 5191 6877 4908 2472 3285 4745 7126 8480 2489 -2978 -90 1701 -5314 2508 8166
14002 8166 7149 3629 6536 12401 5199 1394 -2438 -4925 1089 1687 -6216 -8580 -7870 -4713 1251
$$ packed form
14110B529M037q59m977J321J278K80l991N496L455K92m844L725K353k479n693
14095A923m818L945O592J333l160L998l650r15J956N56o714L824j521Q467l60
14080A1456l031j645n589K322j346k317k802K860J67l344l63N245M426o006m692
14065d659p75j370K741M40J515J137M79O579j452j522K598n61J070n674k410K183
14049C19J109l38k748J123K68n01k328J289Q415n228m816K974J878M395o66q938
14033c793j6N414K980n255Q26P864L007l36m920l041k284r3R95j016l892J213
14017b347P538J686j969k436Q13J460K381J354n991n467K888J791p015P822N658
14002H166j017l520K907N865p202l805l832k487O014N98p903k364P10L157N964
$$ plain form
13987 1251 739 2517 8548 10045 8941 -172 -8920 -8040 329 4974 5214 4684 76 -4055 -1120 629
13971 629 -1785 -878 2907 4527 3249 -3860 -6029 -1579 3100 5271 2164 -2379 -497 -6360 -1802
13956 -1802 5182 -626 -6521 -72 3302 5365 997 237 -1296 -10331 -11397 -4582 -4958 -6251 -9686
13941 -9686 -10107 -5040 -1009 1890 4997 2983 4669 -2520 -1251 3650 3122 783 -296 4236 8228
13926 8228 1952 -1286 651 -200 379 6316 13990 18986 12483 2379 -4904 -2942 -6722 -3170 1444
13911 1444 6112 5880 1106 -1015 2160 -481 35 5481 5684 3193 4470 3384 4225 4559 7098 7574
13895 7574 8612 9733 9444 11790 2977 -1833 -6433 -1264 -2378 -5941 -2182 4161 2396 5446 10061
13880 10061 9007 9025 385 -7992 40 6387 1443 7968 12358 5767 5076 6671 8951 16981 22424
$$ packed form
13987A251n12J778O031J497j104r113q748Q80Q369M645K40n30m608m131K935J749
13971F29k414R07L785J620j278p109k169M450M679K171l107m543J882n863M558
13956a802O984n808n895O449L374K063m368p60j533r035j066O815l76j293l435
13941i686m21N067M031K899L107k014J686p189J269M901n28k339j079M532L992
13926H228o276l238J937q51N79N937P674M996o503j0104p283J962l780L552M614
13911A444M668k32m774k121L175k641N16N446K03k491J277j086Q41L34K539M76
13895G574J038J121k89K346q813m810m600N169j114l563L759O343j765L050M615
13880A0061j054J8q640q377Q032O347m944O525M390o591o91J595K280Q030N443
$$ plain form
13865 22424 27170 16273 813 -4587 -3094 -2203 -874 -2336 -6886 -234 4202 -1885 -5006 -8004
13851 -8004 -7614 -3627 1144 5497 8352 3196 5908 6171 -1059 -2536 -516 2165 5010 -1370 -3687
13836 -3687 1848 12655 16598 8704 -2856 -11537 -7961 4626 7459 1729 -2397 1019 1401 -3095
13822 -3095 -10628 -7814 -3182 -11165 -17317 -11184 -6196 -6027 -8010 -9260 -10156 -17 4265 -375 -4092
13807 -4092 -907 -516 6728 13027 11317 966 -3402 -815 3069 10910 8983 2075 -3682 -8203 -6274
13792 -6274 -6215 -5766 -820 -1700 7316 17291 13677 9454 12809 13888 10396 11688 9396 7447 3658 10310
13776 10310 12514 5742 5747 2998 -684 3206 -2089 -4193 2718 6475 6143 185 -5264 616 5905
13761 5905 3465 4368 3542 -8 -3487 -1030 1050 -10382 -14119 -6306 -5241 -4216 -5885 -11097 -17100
$$ packed form
13865B2424M746j0897j5460n400J493Q91J329j462m550O652M436o087l121k998
13851h004L90L987M771M353K855n156K712K63p230j477K020K681K845o380k317
13836c687N535J0807L943p894j1560q681L576J2587K833n730m126L416L82m496
13822c095p533K814M632p983o152O133M988J69j983j250q96J0139M282m640l717
13807d092L185L91P244O299j710j0351m368K587L884P841j927o908n757m521J929
13792f274N9M49M946q80R016R975l614m223L355J079l492J292k292j949l789O652
13776A0310K204o772Nk749l682L890n295k104O911L757l32n958n449N880N289
13761E905k440R03q26l550l479K457K080j1432l737P813J065J025j669n212o003
$$ plain form
13746 -17100 -7616 -7712 -5542 2020 2885 6991 8416 4840 8021 12081 4002 -7983 -5994 -1319 2490
13731 2490 2289 2287 246 1488 1685 2063 -640 -1108 4620 -1851 -12605 -12933 -8846 -7092 -2793 -1415
13715 -1415 -5559 1823 9709 4542 5192 9636 13077 7043 6286 9824 15623 11481 7030 3976 -1329
13700 -1329 -2569 -2110 -2659 -4073 -4075 5854 2951 3240 8834 4099 -468 4341 3180 3402 -1058 -1943 -4476
13683 -4476 -10752 -5930 -343 -6828 -5533 -3648 3182 4038 -3121 -7688 -3313 -2622 1149 -751 -731 3831
13667 3831 13760 7831 7072 5483 5001 3846 -2914 -444 2869 -688 -2235 1161 6226 10853 8910
13652 8910 8723 13616 12399 1790 -3923 -3544 -2141 1354 2405 -3289 -4959 -1119 416 6716 5739
13637 5739 91 -3618 -1154 1691 1176 -299 -1687 6264 14481 14325 5599 437 638 2847 -2617
$$ packed form
13746a7100R484r6K170P562Q65M106J425l576L181M060q079j1985J989M675L809
13731B490k01kk041J242J97L78k703m68N728o471j0754l28M087J754M299J378
13715a415m144P382P886n167O50M444L441o034p57L538N799m142m451l054n305
13700a329j240M59n49j414kR929k903K89N594m735m567M809j161K22m460q85k533
13683d476o276M822N587o485J295J885O830Q56p159m567M375O91L771j900K0M562
13667C831R929n929p59j589m82j155o760K470L313l557j547L396N065M627j943
13652H910j87M893j217j0609n713L79J403L495J051n694j670L840J535O300r77
13637E739n648l709K464K845n15j475j388P951Q217j56q726n162K01K209n464
$$ plain form
13622 -2617 -5935 -1123 3289 2610 6325 6127 8397 1738 -1581 -1619 1638 7047 8747 10215 4062 2528
13606 2528 7491 8454 8031 1390 6277 2167 -6 1517 3645 -1008 -795 2332 4265 10856 17044
13591 17044 13608 2918 -2233 -2623 -3398 -5374 -6527 -6952 -6283 -5455 -1721 -2712 -2976 789 10454 16323
13575 16323 13944 4170 -1694 -1694 -3256 -5390 -3676 2413 7379 6772 3702 4702 3165 926 -287
13560 -287 693 4312 3454 3522 3066 -5513 -9177 -11100 -5228 -7508 -9030 -6516 50 4854 7511 6939
13544 6939 4613 472 -7425 -9359 -8417 -10350 -8666 -6078 -189 -6803 -8369 -4103 4097 9287 8107
13529 8107 11160 9293 1028 -996 -1432 4033 6438 -5580 -3794 -7611 -7852 -1357 -127 -4326 -838
13514 -838 3916 5189 6424 2893 3959 7891 11015 11738 11157 11014 6295 2658 5697 8532 4880 1393
$$ packed form
13622b617l318M812M412o79L715j98K270o659l319l8L257N409J700J468o153j534
13606B528M963R63m23o641M887m110k173J523K128m653K13L127J933O591O188
13591A7044l436j0690n151l90p75j976j153m25O69Q28L734r91k64L765R665N869
13575A6323k379r774n864%j562k134J714O089M966o07l070J000j537k239j213
13560b87R80L619q58O8m56q579l664j923N872k280j522K514O566M804K657n72
13544F939k326m141p897j934R42j933J684K588N889o614j566M266Q200N190j180
13529H107L053j867q265k024m36N465K405j2018J786l817k41O495J230m199L488
13514h38M754J273J235l531J066L932L124P23n81j43m719l637L039K835l652l487
$$ plain form
13498 1393 -1265 -1798 4917 340 -3487 -3077 -625 8673 13976 10461 5691 6448 7444 -523 -3834 -3339
13482 -3339 -3504 630 3593 11854 28038 42083 43241 39428 31140 27499 29045 24659 17159 5172
13468 5172 1475 4136 5777 7799 13089 8190 -93 647 9878 12185 13984 15614 9573 2600 1731
13453 1731 -145 1173 8753 5879 10124 13282 18295 13334 9831 9520 7375 -1344 -7082 -5803 -7395
13438 -7395 -6342 -1718 -1245 -4381 75 -417 -5749 -5556 1912 3185 1029 2511 1577 905 -552 -2538
13422 -2538 -6662 -10456 -9857 -7018 -3319 -3018 -3930 2511 5325 5700 7593 6775 3997 2027 3743 1028
13406 1028 1337 7621 11713 17372 16994 9582 1454 5183 3303 1635 -3608 -883 3433 1053 -4285
13391 -4285 -1735 4203 -145 -7032 457 633 -1719 -585 -1404 7569 4573 4592 6042 1827 646 -4807
$$ packed form
13498A393k658n33O715m577l827M10K452R298N303l515m770P57R96p967l311M95
13482c339j65M134K963Q261J6184J4045J158l813q288l641J546m386p500j1987
13468E172l697K661J641K022N290m899q283P40R231K307J799J630o041o973q69
13453A731j876J318P580k874M245L158N013m961l503l11k145q719n738J279j592
13438g395J053M624M73l136M456m92n332J93P468J273k156J482r34o72j457j986
13422b538m124l794N99K839L699L01r12O441K814L75J893q18k778j970J716k715
13406A028L09O284M092N659l78p412q128L729j880j668n243K725M316k380n338
13391d285K550N938m348o887P489J76k352J134q19Q973k996J9J450m215j181n453
$$ plain form
13375 -4807 -5350 -3219 -243 2314 -1527 2985 1502 5574 6744 3443 1247 97 -2222 -586 -1652
13360 -1652 -1299 -4576 -7179 -4399 310 1871 3845 4162 7291 -1997 -7629 -2140 -3111 -1601 4372
13345 4372 1362 -8669 -7370 664 4733 1277 -886 -625 1004 5658 -5061 1470 5961 449
13331 449 1220 1024 -3055 398 -1908 -5694 -5488 -9384 -15085 -13441 -13868 -17041 -11946 -6719 -648 4872
13315 4872 966 -419 -4243 3879 8806 6927 853 -375 1716 -6726 -8407 5866 11911 15010
13301 15010 14225 8286 9075 7116 889 -2182 -3229 -4815 -4520 -2960 -1675 -8879 -7762 2565 4953
13286 4953 6598 3632 3433 1214 -1766 3137 9268 -142 -1621 -5320 -5622 -3751 -81 -6808 -14207
13271 -14207 -10828 -9573 -2307 -2996 -6221 -4106 -2727 -2588 566 -4572 -11368 -12755 -16814 -11792 -3473
$$ packed form
13375d807n43K131K976K557l841M512j483M072J170l301k196j150k319J636j066
13360a652L53l277k603K780M709J561J974L17L129r288n632N489r71J510N973
13345D372l010j0031J299Q034M069l456k163K61J629M654j0719O531M491n512
13331D49P71j96m079L453k306l786K06l896n701J644m27l173N095N227O071N520
13315D872l906j385l824Q122M927j879o074j228K091q442j681J4273O045L099
13301A5010p85n939P89j959o227l071j047j586K95J560J285p204J117J0327K388
13286D953J645k966j99k219k980M903O131r410j479l699l02J871L670o727p399
13271a4207L379J255P266o89l225K115J379J39L154n138o796j387m059N022Q319
$$ plain form
13256 -3473 -3187 1557 2826 2716 5757 7801 859 -1252 -3 -130 3317 -2393 -5713 -5242 -1255 -6978
13240 -6978 -4216 -2542 5453 13537 11288 5844 -211 -5405 -5045 -2872 2433 -187 -2203 -3879 -1872
13225 -1872 -1025 8148 7549 820 1341 8506 11530 15526 16469 13318 7564 8283 10648 8427 7348 6569
13209 6569 5942 4619 -2021 -5590 -6126 -6388 -2898 1489 5532 7655 8679 10648 7240 2922 -4691
13194 -4691 -5125 -6899 -5054 -1945 7816 8945 3721 -3252 -2701 2590 5167 2242 9790 4388 403
13179 403 5570 6771 12200 16827 18207 15171 13674 10496 4686 716 -2357 1324 925 -7210 -5432
13164 -5432 -1319 -1484 -7523 -5947 -5173 -1094 -912 1169 4925 2903 9573 4897 -3650 -962 4166
13149 4166 7912 7627 2750 6902 9637 6223 9664 13458 7622 -75 -1179 -1632 -2930 1686 6545
$$ packed form
13256c473K86M744J269j10L041K044o942k111J249j27L447n710l320M71L987n723
13240f978K762J674P995Q084k249n444o055n194L60K173N305k620k016j676K007
13225a872Q47R173n99o729N21P165L024L996R43l151n754P19K365k221j079p79
13209F569o27j323o640l569n36k62L490M387M043K123J024J969l408m318p613
13194d691m34j774J845L109R761J129n224o973N51N291K577k925P548n402l985
13179D03N167J201N429M627J380l036j497l178n810l970l073L681l99q135J778
13164e432M113j65o039J576P74M079J82K081L756k022O670m676q547K688N128
13149D166L746k85m877M152K735l414L441L794n836p697j104m53j298M616M859
$$ plain form
13134 6545 5316 3791 5977 2066 -3422 -11870 -11061 -625 3771 1053 3006 8451 12437 10392 12675
13119 12675 8975 -1907 970 4156 1639 -686 2475 1555 912 4835 8554 12670 13226 18503 16318
13104 16318 16454 9417 -3733 -7442 -11690 -14427 -13769 -8878 -1782 -2812 -3433 -2838 1263 2927 7702
13089 7702 10467 8406 6255 5156 6290 1688 -769 1106 -400 3197 6738 9970 6630 274 -6261
13074 -6261 -2711 2168 4638 679 4164 11712 18931 24956 18404 9808 7185 6069 2045 5778 6752
13059 6752 6859 4941 4360 4280 4987 2704 4978 15466 14156 10372 21202 24572 18474 16461 16350 15283
13043 15283 15319 9804 9352 15449 14303 14663 17157 20397 17691 15179 10153 6761 6743 5583 10763 8065
13027 8065 4260 1819 7142 1722 -1702 -569 -418 -3303 -5943 955 1475 -1512 4133 4789 8387
$$ packed form
13134F545j229j525K186l911n488q448Q09J0436M396k718J953N445L986k045K283
13119A2675l700j0882K877L186k517k325L161r20o43L923L719M116N56N277k185
13104A6318J36p037j3150l709m248k737O58M891P096j030o21N95M101J664M775
13089G702K765k061k151j099J134m602k457J875j506L597L541L232l340o356o535
13074f261L550M879K470l959L485P548P219O025o552q596k623j116m024L733R74
13059F752J07j918n81q0P07k283K274J0488j310l784J0830L370o098k013j11j067
13043A5283L6n515m52O097j146L60K494L240k706k512n026l392j8j160N180k698
13027H065l805k441N323n420l424J133J51k885k640O898N20k987N645O56L598
$$ plain form
13012 8387 7790 6026 2412 372 2193 1058 -1563 4311 5247 2226 4453 2228 9947 21238 12802
12997 12802 8641 7477 74 -4670 -4550 -2265 -3665 1138 1210 5286 8921 5067 2460 4426 4862
12982 4862 4561 5837 13316 16885 20547 17514 11744 12449 14762 17104 12547 11669 14046 12887 3011
12967 3011 617 648 -2437 -525 -1131 3158 4304 3434 8413 9758 1489 544 7214 12087 4708 791
12951 791 584 -3021 -6877 -2033 1854 6704 6291 1534 -428 1329 8372 16099 13229 6134 7292
12936 7292 10338 8175 1546 -5974 -7950 -8453 -10968 -8645 -3637 7984 11148 9955 5737 1287 3461
12921 3461 13405 11688 3177 3589 8562 9954 13390 7915 -2104 -4874 -2380 -2482 1967 7506 4831
12906 4831 7338 16311 19969 16094 12222 19520 19955 5877 2102 -1330 -6107 -5020 5688 3962
$$ packed form
13012H387n97j764l614k040J821j135k621N874R36l021K227k225P719J1291q436
12997A2802m161j164p403m744J20K285j400M803P2M076L635l854k607J966M36
12982D862l01J276P479L569L662l033n770P05K313K342m557q78K377j159r876
12967C011k394L1l085J912o06M289J146q70M979J345q269r45O670M873p379l917
12951G91k07l605l856M844L887M850m13m757j962J757P043P727k870p095J158
12936G292L046k163o629p520j976n03k515K323N008J1621L164j193m218m450K174
12921C461R944j717q511M12M973J392L436n475j0019k770K494j02M449N539k675
12906D831K507Q973L658l875l872P298M35j4078l775l432m777J087J0708j726
$$ plain form
12892 3962 8042 9111 10941 7171 11296 19061 16370 12468 13503 13236 9053 8291 9069 2763 -1611
12877 -1611 1188 16856 25684 22304 16154 13394 10068 8917 6628 7791 12608 14500 13916 17402 19451
12862 19451 15278 8878 12044 16152 16346 18024 17617 17706 19447 18026 18919 19250 15672 17931 26969 26881
12846 26881 33453 36663 29322 20298 20258 27105 34248 32091 27243 24125 24293 24139 29886 39701 41759
12831 41759 36837 36242 31292 25561 29561 31492 34316 34104 42929 53793 57825 74537 110996 152904
12817 152904 204833 297114 433817 629673 875996 1123839 1296967 1326582 1223440 1004292
12807 1004292 746784 522753 363652 261716 204585 165425 143493 122981 110593 97647
12797 97647 77267 71302 68873 64770 64777 69461 75609 81906 110826 145809 163921 153807 119543 84876
$$ packed form
12892C962M080J069J830l770M125P765k691l902J035k67m183p62P78o306m374
12877a611K799J5668Q828l380o150k760l326j151k289J163M817J892n84L486K049
12862A9451m173o400L166M108J94J678m07Q9J741j421Q93L31l578K259R038q8
12846B6881O572L210p341r024m0O847P143k157m848l118J68j54N747R815K058
12831D1759m922n95m950n731M000J931K824k12Q825J0864M032J6712L6459M1908
12817A52904N1929R2281J36703J95856K46323K47843J73128K9615j03142k19148
12807A004292k57508k24031j59101j01936n7131l9160k1932k0512j2388j2946
12797I7647k0380n965k429m103PM684O148O297K8920L4983J8112j0114l4264l4667
$$ plain form
12783 84876 65412 49982 41418 36525 30377 35243 34847 30080 24227 18900 13284 14811 15009 14075 19600
12768 19600 20442 17773 11444 10555 10703 10703 13521 20202 23140 22877 13893 16136 20752 13131 4589 1951
12752 1951 39 -2658 -8032 -2002 12926 20673 18572 11960 3443 2297 3116 5930 11139 8590 6646
12737 6646 954 1326 9727 8577 8833 15103 12065 7509 872 -207 -2896 -5058 -6239 -3732 3609
12722 3609 9093 9704 5832 7403 12194 14501 15273 19711 20316 20698 19440 16717 10933 15401 17785 11912
12706 11912 2164 1280 4205 211 -6146 -2521 3391 3614 -2120 -7757 -7639 -4397 -1784 -1917 4088
12691 4088 12796 16311 18545 21615 35243 52961 62206 65204 67541 72479 76772 71410 59497 37189
12677 37189 22143 17791 10650 1476 -2466 2346 7747 12720 13013 14863 10359 14208 18661 25033
$$ packed form
12783H4876j9464j5430q564m893o148M866l96m767n853n327n616J527J98r34N525
12768A9600Q42k669o329q89J48%K818O681K938k63q984K243M616p621q542k638
12752A951j912k697n374O030J4928P747k101o612q517j146Q19K814N209k549j944
12737F646n692L72Q401j150K56O270l038m556o637j079k689k162j181K507P341
12722C609N484O11l872J571M791K307P72M438O05L82j258k723n784M468K384n873
12706A1912r748q84K925l994o357L625N912K23n734n637J18L242K613j33O005
12691D088Q708L515K234L070J3628J7718R245K998K337M938M293n362j1913k2308
12677C7189j5046m352p141r174l942M812N401M973K93J850m504L849M453O372
$$ plain form
12663 25033 33558 40034 45156 46810 36409 31001 36625 30186 22092 13390 10111 14114 15656 10351
12649 10351 5106 2354 2828 -5602 -4649 3971 2190 225 1245 5660 16105 23261 35426 51713
12635 51713 68136 87463 108416 130997 142874 152197 164728 162817 162156 157618 138631 125019 112055
12622 112055 96917 88597 78293 76549 79472 78677 68773 54455 42384 32064 30423 31279 37450
12609 37450 34612 32780 37352 38962 36910 41058 41580 39509 47505 52047 45534 37373 30516 32931 43334
12594 43334 55197 54040 41517 37880 34182 25317 21088 22984 23865 25533 25824 26568 24624 12563
12580 12563 3258 85 1742 27 3043 618 5581 18630 33901 43986 50742 51839 52336 62065
12566 62065 76314 75982 62801 59523 58371 60960 55377 46854 29559 20710 20340 19656 21135 29362
$$ packed form
12663B5033Q525O476N122J654j0401n408N624o439q094q702l279M003J542n305
12649A0351n245k752M74q430R53Q620j781j965J020M415J0445P156J2165J6287
12635E1713J6423J9327K0953K2581J1877R323J2531j911o61m538j8987j3612j2964
12622A12055j5138q320j0304j744K923p95r904j4318j2071j0320j641Q56O171
12609C7450k838j832M572J610k052M148N22k071P996M542o513q161o857K415J0403
12594D3334J1863j157j2523l637l698q865m229J896Q81J668K91P44j944j2061
12580A2563r305l173J657j715L016k425M963J3049J5271J0085O756J097M97R729
12566F2065J4249l32j3181l278j152K589n583q523j7295q849l70o84J479Q227
$$ plain form
12552 29362 30790 27324 25287 24700 30517 35241 37990 37559 32749 26383 24806 27022 26008 30733 35755
12537 35755 49347 56409 47280 35162 22998 21507 25815 27407 32351 39654 43518 38919 38778 42231
12523 42231 45959 45772 50352 51374 46036 42852 42877 42916 55228 63017 59550 49316 36610 29051 31582
12508 31582 45877 73417 103056 150576 205622 236125 234096 208566 170064 142111 126867 118933
12496 118933 118359 118072 125537 118308 114785 115741 120709 132169 136219 123190 105499 103321 104869 114243
12482 114243 127995 136480 150073 151912 162505 162752 162299 171751 183341 196100 221475 255237 279492
12469 279492 284808 258172 227197 202887 177869 167505 156775 152055 154556 143054 141275 147493
12457 147493 154701 154623 153322 155585 158811 154056 147402 144890 140310 151895 163016 162802 170564 175632
$$ packed form
12552B9362J428l466k037n87N817M724K749m31m810o366j577K216j014M725N022
12537C5755J3592P062r129j2118j2164j491M308J592M944P303L864m599j41L453
12523D2231L728j87M580J022n338l184K5L9J2312P789l467j0234j2706p559K531
12508C1582J4295K7540K9639M7520N5046L0503k029k5530l8502k7953j5244p934
12496A18933n74k87P465p229l523R56M968J1460M050j3029j7691k178J548R374
12482A14243J3752Q485J3593J839J0593K47m53R452J1590J2759K5375L3762K4255
12469B79492N316k6636l0975k4310k5018j0364j0730m720K501j1502j779O218
12457A47493P208p8j301K263L226m755o654k512m580J1585J1121k14P762N068
$$ plain form
12443 175632 186213 203214 221217 240501 263961 286940 303789 322608 343797 366789 399219
12432 399219 426451 438884 451485 464909 482584 511860 549536 587774 597398 588120 602162 626872
12420 626872 647123 663277 691987 730659 758753 779217 800442 836410 893227 973884 1091412
12409 1091412 1256486 1434319 1594703 1719411 1782078 1794413 1777082 1775958 1827842 1925252 2059016
12398 2059016 2227995 2421616 2634145 2869395 3148578 3487942 3892164 4404690 5068066
12389 5068066 5922562 7037445 8494435 10456834 13146802 16856071 22096743 29775829
12381 29775829 41676808 60753549 90536644 131803664 179211362 222607856 244961396
12374 244961396 241969323 215661222 170456556 123818233 85555243 58976753 42518171
$$ packed form
12443A75632J0581J7001J8003J9284K3460K2979J6849J8819K1189K2992L2430
12432C99219K7232J2433J2601J3424J7675K9276L7676L8238R624r278J4042K4710
12420F26872K0251J6154K8710L8672K8094K0464K1225L5968N6817Q0657J17528
12409A091412J65074J77833J60384J24708O2667J2335j7331j124N1884R7410J33764
12398B059016J68979J93621K12529K35250K79183L39364M04222N12526O63376
12389E068066Q54496J114883J456990J962399K689968L709269N240672P679086
12381B9775829J1900979J9076741K9783095M1267020M7407698M3396494K2353540
12374B44961396k992073k6308101m5204666m6638323l8262990k6578490j6458582
$$ plain form
12367 42518171 32233788 25286213 20237256 16453180 13593164 11421301 9756567 8438572
12359 8438572 7370644 6485142 5756496 5157804 4666422 4250354 3908645 3618814 3365992
12350 3365992 3143092 2942206 2741976 2540642 2336920 2137506 1965981 1827247 1712906
12341 1712906 1612787 1524674 1448463 1376594 1303960 1237983 1164767 1087925 1011330 941887 882756
12330 882756 820741 764541 723749 681054 643766 613457 587301 557159 531715 510678 488648
12319 488648 474390 462532 458659 457469 454381 448282 435350 423043 411357 406576 405430 405071 407040
12306 407040 403955 402723 396680 386710 384086 375464 363088 348452 340004 325309 318131 303280 297201
12293 297201 293896 279465 274129 265467 260874 257152 241932 225566 210027 196041 180638 166600
$$ packed form
12367D2518171j0284383o947575n048957l784076k860016k171863j664734j317995
12359H438572j067928q85502p28646n98692m91382m16068l41709k89831k52822
12350C365992k22900k00886k00230k01334k03722j99414j71525j38734j14341
12341A712906j00119q8113p6211p1869p2634o5977p3216p6842p6595o9443n9131
12330H82756o2015n6200m0792m2695l7288l0309k6156l0142k5444k1037k2030
12319D88648j4258j1858l873j190l088o099j2932j2307j1686m781j146l59J969
12306D07040l085j232o043r970k624q622j2376j4636q448j4695p178j4851o079
12293B97201l305j4431n336q662m593l722j5220j6366j5539j3986j5403j4038
$$ plain form
12281 166600 155773 157307 170266 178187 180304 175266 172498 173639 166067 165084 163537 169655 167235 166793
12267 166793 170950 171619 176368 178479 172922 169398 163351 164850 173097 171901 168383 180831 202671 230003
12253 230003 257968 284731 304474 293807 259579 214416 164522 133747 137409 161649 189163 201051
12241 201051 202485 192294 184109 171010 158870 149385 145759 146797 151586 149243 146390 144154 139279
12228 139279 136237 131389 119223 109564 100997 111680 125271 142068 153808 149427 150391 161608 173878
12215 173878 173454 160173 154463 149230 146687 138944 132135 124658 113117 107988 105634 103649 99176 95396
12201 95396 96086 102327 102897 101787 96783 101330 108611 110378 109271 98384 89966 80906 67486 58209
12187 58209 50580 44518 55578 55191 59162 59704 67084 75965 79624 81415 84628 94367 94877 94343 105072
$$ packed form
12281A66600j0827J534J2959P921K117n038k768J141p572r83j547O118k420m42
12267A66793M157O69M749K111n557l524o047J499Q247j196l518J2448K1840K7332
12253B30003K7965K6763J9743j0667l4228m5163m9894l0775L662K4240K7514J1888
12241B01051J434j0191q185j3099j2140r485l626J038M789k343k853k236m875
12228A39279l042m848j2166r659q567J0683J3591J6797J1740m381R64J1217J2270
12215A73878m24j3281n710n233k543p743o809p477j1541n129k354j985m473l780
12201I5396O90O241N70j110n004M547P281J767j107j0887q418r060j3420r277
12187E8209p629o062J1060l87L971N42P380Q881L659J791L213R739N10n34J0729
$$ plain form
12172 105072 103031 96806 93446 89676 80363 70419 66159 61165 64398 69964 65716 70896 67580 62581
12158 62581 54004 50681 55817 55310 56524 52101 50568 55681 57903 58410 61116 62449 56031 58250 60498
12143 60498 60697 60682 64884 71655 75266 77841 76004 71533 73041 74645 78653 81479 86784 91197 89184
12128 89184 84300 79839 76174 72623 67380 71666 75612 71537 69051 61969 49804 45195 43978 41734
12114 41734 49368 62234 75454 81068 84008 86604 84549 78700 72393 71011 69300 68981 71721 69023
12100 69023 67243 63763 54886 49986 45932 40762 36766 36261 37608 39620 40380 38965 34864 31737 33133
12085 33133 37833 41121 44322 39411 35535 43583 50452 55863 48370 42012 44867 43511 40480 42709
12071 42709 46734 51831 45424 38527 48308 51966 45496 43172 48879 60437 69244 63588 59346 55836
$$ packed form
12172A05072k041o225l360l770r313r944m260m994L233N566m248N180l316m999
12158F2581q577l323N136n07J214m423j533N113K222N07K706J333o418K219K248
12143F0498J99j5M202O771L611K575j837m471J508J604M008K826N305M413k013
12128H9184m884m461l665l551n243M286L946m075k486p082j2165m609j217k244
12114D1734P634J2866J3220N614K940K596k055n849o307j382j711l19K740k698
12100F9023j780l480q877m900m054n170l996n05J347K012P60j415m101l127J396
12085C3133M700L288L201m911l876Q048O869N411p493o358K855j356l031K229
12071D2709M025N097o407o897R781L658o470k324N707J1558Q807n656m242l510
$$ plain form
12057 55836 53390 50265 49087 49096 56742 58891 55190 53751 51218 49991 50506 47907 45458 50634 49464
12042 49464 46744 37570 31854 34630 42162 43453 41446 44966 40619 38838 41547 40774 42820 46962 48813
12027 48813 54014 57727 56441 51180 44469 38648 40644 44234 42340 41934 44715 49412 43503 40603 43765
12012 43765 41032 43542 40699 39300 36380 40290 43003 44111 46266 44500 41108 37440 30856 33562
11998 33562 39528 47933 43737 37804 32946 31214 39888 42262 36910 40889 45986 48251 49180 44683 43510
11983 43510 47408 57052 52922 49369 52848 52467 45393 43283 43661 46028 43880 41109 47195 51572 50439
11968 50439 41897 39686 45237 48977 54089 62040 64783 64666 66879 64811 54141 47486 44530 41292
11954 41292 50657 52148 45687 43156 40305 35736 42502 50542 56070 66180 74093 87414 110828 133626
$$ packed form
12057E5836k446l125j178RP646K149l701j439k533j227N15k599k449N176j170
12042D9464k720r174n716K776P532J291k007L520m347j781K709p73K046M142J851
12027D8813N201L713j286n261o711n821J996L590j894m06K781M697n909k900L162
12012D3765k733K510k843j399k920L910K713J108K155j766l392l668o584K706
11998C3562N966Q405m196n933m858j732Q674K374n352L979N097K265R29m497j173
11983D3510L898R644m130l553L479l81p074k110L78K367k148k771O086M377j133
11968E0439q542k211N551L740N112P951K743j17K213k068j0670o655k956l238
11954D1292R365J491o461k531k851m569O766Q040N528J0110P913J3321K3414K2798
$$ plain form
11940 133626 164852 215698 301989 433808 622908 856671 1111208 1299324 1350434 1266202
11930 1266202 1048170 788292 560537 395188 289118 218345 175264 145493 124544 119404
11920 119404 114931 99620 88311 77899 72292 63531 54675 49439 46150 37478 30548 28187 36836
11907 36836 37055 36903 30764 30942 34398 41475 39083 37718 37170 40182 40802 35005 29252 32180 38608 35893
11891 35893 35805 31467 39737 45367 46495 47925 45346 44903 40637 36465 30792 35796 35059 36364 32032
11876 32032 22394 19683 29530 35664 28542 30081 30427 30628 25731 32346 36743 33796 32037 29450 34404
11861 34404 42936 42727 39437 37825 32561 28220 30887 34349 32408 22890 19504 13000 16530 22049 29544
11846 29544 25947 25555 21656 19668 21897 26677 37296 40001 41389 41208 36006 30858 34626 37189 39541
$$ packed form
11940A33626L1226N0846Q6291J31819J89100K33763K54537J88116N1110q4232
11930A266202k18032k59878k27755j65349j06070p0773m3081k9771k0949n140
11920A19404m473j5311j1309j0412n607q761q856n236l289q672o930k361Q649
11907C6836K19j52o139J78L456P077k392j365n48L012O20n797n753K928O428k715
11891C5893q8m338Q270N630J128J430k579m43m266m172n673N004p37J305m332
11876C2032r638k711R847O134p122J539L46K01m897O615M397k947j759k587M954
11861C4404Q532k09l290j612n264m341K667L462j941r518l386o504L530N519P495
11846B9544l597l92l899j988K229M780J0619K705J388j81n202n148L768K563K352
$$ plain form
11831 39541 37495 40023 35150 29751 26701 23247 16200 15757 10490 13028 16635 16783 20447 25657 27407
11816 27407 23679 24018 20550 20362 24491 24602 28743 29289 25244 22948 23451 24431 26135 29471 28384 28355
11800 28355 35020 37703 37822 32037 26225 25409 24509 31164 36279 33128 37053 34330 32058 34698 30644
11785 30644 24887 23016 28564 33256 34543 30376 31272 29454 28194 27821 24876 23949 31331 33377 28494
11770 28494 26918 24182 23602 31785 38706 39856 43732 37716 39485 38262 34626 33045 35624 28723 22832
11755 22832 21868 25076 24549 27708 33477 26494 20119 21848 25589 23435 18706 19056 20679 28228 31196
11740 31196 28149 24589 26563 24068 26335 28734 27696 25354 27929 30813 31772 30810 32002 27296 21738
11725 21738 24962 32217 24114 17223 23828 30970 30989 36068 39932 42532 46010 46078 43385 42884 35933 30798
$$ packed form
11831C9541k046K528m873n399l050l454p047m43n267K538L607J48L664N210J750
11816B7407l728L39l468j88M129J11M141N46m045k296N03R80J704L336j087k9
11800B8355O665K683J19n785n812q16r00O655N115l151L925k723k272K640m054
11785C0644n757j871N548M692J287m167Q96j818j260l73k945r27P382K046m883
11770B8494j576k736n80Q183O921J150L876o016J769j223l636j581K579o901n891
11755B2832r64L208n27L159N769o983o375J729L741k154m729L50J623P549K968
11740C1196l047l560J974k495K267K399j038k342K575K884R59r62J192m706n558
11725B1738L224P255q103o891O605P142J9N079L864K600L478O8k693n01o951n135
$$ plain form
11709 30798 26340 25988 26357 26717 27330 27209 27533 28682 27648 29052 32602 33133 35050 40886 33851 35580
11693 35580 36604 35157 27319 18200 17118 20633 18336 23959 28119 27072 27741 27383 20995 21270 24994
11678 24994 21351 18793 15831 18776 19258 21063 22560 20267 22124 22725 17885 20115 19310 15576 15124
11663 15124 13692 21309 20566 25090 29292 30449 32412 38867 35500 32343 28486 26390 21031 17180 17796
11648 17796 18635 23299 30324 34055 32132 26911 25522 22585 19104 21367 25300 25827 31598 34181 34755
11633 34755 32836 21770 17580 23521 24576 21882 27405 31791 34620 31069 29326 25805 31651 37641
11619 37641 32331 23438 21900 21567 19739 20376 18538 17546 18255 23988 29158 31912 30030 31834 33496
11604 33496 23416 14905 10460 10524 15092 14900 21356 25249 23968 22778 24976 23937 27864 28962 30810
$$ packed form
11709C0798m458l52L69L60O13j21L24J149j034J404L550N31J917N836p035J729
11693C5580J024j447p838r119j082L515k297N623M160j047O69l58o388K75L724
11678B4994l643k558k962K945M82J805J497k293J857O01m840K230q05l734m52
11663A5124j432P617p43M524M202J157J963O455l367l157l857k096n359l851O16
11648A7796Q39M664P025L731j923n221j389k937l481K263L933N27N771K583N74
11633C4755j919j1066m190N941J055k694N523M386K829l551j743l521N846N990
11619C7641n310q893j538l33j828O37j838r92P09N733N170K754j882J804J662
11604C3496j0080q511m445O4M568j92O456L893j281j190K198j039L927J098J848
$$ plain form
11589 30810 29415 34020 36210 34838 31930 27903 23962 23141 26686 27622 19405 20379 22850 24770 23391
11574 23391 23500 25383 24107 24500 25850 21418 22957 30678 26137 27842 37939 31425 25944 27751 29880
11559 29880 29300 28598 28669 27139 25979 31323 36845 36477 33128 34284 32281 30481 26467 27241 30440 29801
11543 29801 27288 27999 33301 29639 24207 20704 19974 27282 28060 23290 29255 22980 23382 30416 30866 27005
11527 27005 27377 28322 25344 22138 25512 31942 26093 21167 17551 15568 20537 27416 34682 29588 18540
11512 18540 15376 22556 25041 27100 31398 31243 22800 23602 21142 21961 25137 30631 28115 30785 30076
11497 30076 29497 29202 28316 21215 21850 22435 21818 13347 14328 17079 19302 24966 29701 24795 21018 20724
11481 20724 15174 20664 23699 32625 40853 42169 40657 39307 34281 26517 17638 23630 31894 33092
$$ packed form
11589C0810j395M605K190j372k908m027l941q21L545R36q217R74K471J920j379
11574B3391J09J883j276L93J350m432J539P721m541J705J0097o514n481J807K129
11559B9880n80p02P1j530j160N344N522l68l349J156k003j800m014P74L199o39
11543B9801k513P11N302l662n432l503p30P308P78m770N965o275M02P034M50l861
11527B7005L72R45k978l206L374O430n849m926l616j983M969O879P266n094j1048
11512A8540l164P180K485K059M298j55q443Q02k460Q19L176N494k516K670p09
11497C0076n79k95q86p101O35N85o17q471R81K751K223N664M735m906l777k94
11481B0724n550N490L035Q926Q228J316j512j350n026p764q879N992Q264J198
$$ plain form
11467 33092 36387 33286 30132 25922 26981 26708 25635 20538 16848 19232 24689 24244 21788 27071 22103
11452 22103 19520 20007 27241 31281 30636 29348 35071 40709 36297 38819 36060 26918 27680 26458 21275
11437 21275 20295 22624 27180 25115 28459 27267 21403 22515 25487 23279 25557 23529 24879 24697 31907
11422 31907 28491 30683 32477 36614 34057 22958 24131 27286 22953 16231 18663 18607 16600 14946 17502
11407 17502 19080 16340 18353 21141 20037 19789 15932 14487 22300 22254 21836 18171 14141 18043 24074
11392 24074 28076 25113 21008 20574 20273 21427 24106 23210 25928 32987 34278 32877 30158 36128 30141
11377 30141 28046 26864 23096 24927 25725 28398 30060 34621 41199 36884 31257 28236 32048 31212 33209
11362 33209 25540 22662 25943 25967 29023 30285 37956 39872 40225 32487 30039 36531 37173 36780 37847 39751
$$ packed form
11467C3092L295l101l154m210J059k73j073n097l690K384N457m45k456N283m968
11452B2103k583M87P234M040o45j288N723N638m412K522k759r142P62j222n183
11437B1275r80K329M556k065L344j192n864J112K972k208K278k028J350j82P210
11422C1907l416K192J794M137k557j1099J173L155m333o722K432n6k007j654K556
11407A7502J578k740K013K788j104k48l857j445P813m6m18l665m030L902O031
11392B4074M002k963m105m34l01J154K679q96K718P059J291j401k719N970n987
11377C0141k095j182l768J831P98K673J662M561O578m315n627l021L812q36J997
11362C3209p669k878L281K4L056J262P671J916L53p738k448O492O42l93J067J904
$$ plain form
11346 39751 39258 32568 26935 28053 33220 35996 41573 51350 47426 39968 39546 44714 50957 61097 66197
11331 66197 73597 73855 72473 66060 57356 55039 52553 50129 46711 46567 40134 39807 31817 32021 34846
11316 34846 35804 34409 35783 42716 48719 45584 41655 38185 41037 39094 31446 29346 28600 34894 37537
11301 37537 44552 41723 40285 45014 46175 53406 57420 55169 49679 42318 42418 47534 57492 70323
11287 70323 96974 133378 161974 170772 149058 111341 81546 67380 61122 55207 43548 41092
11275 41092 42475 46168 37175 31285 35161 33512 37196 46929 46110 40413 36921 43391 41249 34225 30998
11260 30998 36487 40558 42446 40262 36487 33758 34610 41366 42569 43757 46983 54351 60828 56579 55624
11245 55624 57169 65421 83935 108412 138086 168742 186626 170441 131944 103527 86174 71467
$$ packed form
11346C9751m93o690n633J118N167K776N577R777l924p458m22N168O243J0140N100
11331F6197P400K58j382o413q704k317k486k424l418j44o433l27p990K04K825
11316C4846R58j395J374O933O003l135l929l470K852j943p648k100p46O294K643
11301C7537P015k829j438M729J161P231M014k251n490p361J00N116R958J2831
11287G0323K6651L6404K8596Q798k1714l7717k9795j4166o258n915j1659k456
11275D1092J383L693q993n890L876j649L684R733q19n697l492O470k142p024l227
11260C0998N489M071J888k184l775k729Q52O756J203J188L226P368O477m249r55
11245E5624J545Q252J8514K4477K9674L0656J7884j6185l8497k8417j7353j4707
$$ plain form
11233 71467 55628 48070 43728 42926 45531 48429 45370 41279 43784 44240 41291 39197 37929 35226 33291
11218 33291 32454 34222 37806 36389 34751 41945 42054 39767 39133 37085 38298 37378 32711 34759 33886 34922
11202 34922 41644 46870 52607 56663 55938 62262 69260 85359 95011 80717 65512 53713 52320 53649
11188 53649 54196 52642 49935 38547 34240 32894 31441 29378 35964 41295 33595 38509 45889 51513
11174 51513 51024 53727 47519 43836 42103 42991 43751 43528 39125 42125 40926 39332 40173 43470 45990 48208
11158 48208 52259 43887 40938 41490 41531 43012 32759 35475 41385 44893 50638 52972 52200 53663 49704
11143 49704 47294 44884 44244 44861 48298 54199 55636 48684 42763 34024 35131 38389 37027 47401 53083
11128 53083 53629 47358 43170 38771 44729 47929 54527 49043 44750 48936 49941 46468 45603 41906 43468
$$ packed form
11233G1467j5839p558m342q02K605K898l059m091K505M56k949k094j268k703j935
11218C3291q37J768L584j417j638P194J09k287o34k048J213r20m667K048q73J036
11202C4922O722N226N737M056p25O324O998J6099R652j4294j5205j1799j393J329
11188E3649N47j554k707j1388m307j346j453k063O586N331p700M914P380N624
11174E1513m89K703o208l683j733Q88P60k23m403L000j199j594Q41L297K520K218
11158D8208M051q372k949N52M1J481j0253K716N910L508N745K334p72J463l959
11143D9704k410k410o40O17L437N901J437o952n921q739J107L258j362J0374N682
11128E3083N46o271m188m399N958L200O598n484m293M186J005l473q65l697J562
$$ plain form
11113 43468 49313 49174 45028 39819 34939 38505 38955 32141 30728 40630 50865 50331 50787 50318 44565
11098 44565 39835 35826 40099 40368 43605 50503 52839 60641 61490 58126 54727 61946 62173 60444 59614
11083 59614 52860 49265 47432 44250 46106 48596 55533 56191 53605 55502 54801 50832 50420 52979 45669
11068 45669 40485 40936 40118 38652 44544 43207 44971 43888 44101 40449 38474 35902 43134 48882 50553
11053 50553 54573 50737 44648 44578 42060 36566 36757 38726 41977 41307 43025 39745 38733 44789 47454
11038 47454 42620 45574 45919 45418 42373 44503 49503 55471 52252 52997 49005 44853 45987 46427 45561 46907
11022 46907 49787 50775 53170 47831 43074 48696 49819 61760 72690 77457 79935 81016 82281 72675
11008 72675 67747 62636 58369 55087 52476 49566 41976 38617 40321 40617 45700 44170 50846 50475 44542
$$ packed form
11113D3468N845j39m146n209m880L566M50o814j413R902J0235n34M56m69n753
11098D4565m730m009M273K69L237O898K336P802Q49l364l399P219K27j729q30
11083E9614o754l595j833l182J856K490O937O58k586J897p01l969m12K559p310
11068D5669n184M51q18j466N892j337J764j083K13l652j975k572P232N748J671
11053E0553M020l836o089p0k518n494J91J969L251o70J718l280j012O056K665
11038D7454m834K954L45n01l045K130N000N968l219P45l992m152J134M40q66J346
11022D6907K880R88K395n339m757N622J123J1941J0930M767K478J081J265r606
11008G2675m928n111m267l282k611k910p590l359J704K96N083j530O676l71n933
$$ plain form
10993 44542 44225 45814 50995 52744 54758 55766 54695 53523 52904 44974 45281 50819 52386 52887 50039
10978 50039 44655 41272 46066 48218 49647 47944 46784 49306 50795 52116 51568 56278 64988 64055 59462
10963 59462 62294 65234 68557 61072 54399 57407 51601 46435 53281 56546 58415 62897 65091 65288 64424
10948 64424 66863 69562 69981 68167 65348 67956 75661 77430 75891 70477 69120 79932 77302 74640
10934 74640 79385 83540 90382 94851 92186 95477 92336 84974 81325 79847 73780 71540 74432 79730
10920 79730 78986 84168 89627 86071 81609 79096 86223 92555 99373 114380 128755 136247 147711 156231
10906 156231 160342 156995 153087 158379 156691 149908 142084 135062 124536 118922 116133 111857 105806 95782
10892 95782 94958 95058 88620 85377 81883 80638 85688 90771 94807 94784 94127 102401 104036 103371 107921 105331
$$ packed form
10993D4542l17J589N181J749K014J008j071j172o19p930L07N538J567N01k848
10978E0039n384l383M794K152J429j703j160K522J489J321n48M710Q710r33m593
10963E9462K832K940L323p485o673L008n806n166O846L265J869M482K194J97q64
10948F4424K439K699M19j814k819K608P705J769j539n414j357J0812k630k662
10934G4640M745M155O842M469k665L291l141p362l649j478o067k240K892N298
10920G9730p44N182N459l556m462k513P127O332O818J5007J4375P492J1464Q520
10906A56231M111l347l908N292j688o783p824p022j0526n614k789m276o051j0024
10892I5782q24J00o438l243l494j245N050N083M036k3o57Q274J635o65M550k590
$$ plain form
10876 105331 95664 94118 100848 106422 104757 98184 102030 101169 97381 97966 104220 103935 107590 117728 129058
10861 129058 144483 167807 197100 192282 164836 138753 124105 115971 106562 111934 114590 109975 108487
10848 108487 106880 115194 130332 132811 131384 131274 127804 131268 137775 144489 145296 132556 117794 122654
10834 122654 116452 106348 105399 107532 116525 125030 121155 125607 126927 123582 121683 117556 116551 119792
10820 119792 126361 127810 122294 115343 120017 120550 120481 123921 121671 113397 115004 114776 110178 118436 129343
10805 129343 139031 146148 149290 156254 152767 153699 159925 155417 152960 155777 160294 165393 169708 168195
10791 168195 170574 170415 168875 162409 158994 162035 168022 172622 185205 207610 236584 256780 269318
10778 269318 275965 269115 249766 230514 211427 210975 220236 226722 225074 228061 238988 244428 252479
$$ packed form
10876A05331r667j546O730N574j665o573L846q61l788N85O254k85L655J0138J1330
10861A29058J5425K3324K9293m818k7446k6083j4648q134r409N372K656m615j488
10848A08487j607Q314J5138K479j427j10l470L464O507O714Q07j2740j4762M860
10834A22654o202j0104r49K133Q993Q505l875M452J320l345j899m127j005L241
10820A19792O569J449n516o951M674N33o9L440k250q274J607k28m598Q258J0907
10805A29343R688P117L142O964l487R32O226m508k457K817M517N099M315j513
10791A68195K379j59j540o466l415L041N987M600J2583K2405K8974K0196J2538
10778B69318O647o850j9349j9252j9087m52R261O486j648K987J0927N440Q051
$$ plain form
10765 252479 258243 260892 256890 259344 259000 257968 262941 276214 283887 288855 292886 297497 304262 311914
10751 311914 313600 309690 314616 330385 347705 360347 365294 366455 369082 378829 392279 386521 377683
10738 377683 375215 379591 386021 391229 397358 400517 412424 414323 415455 416331 413699 426789 447333 459402
10724 459402 463343 471951 483097 503220 530237 547933 571311 593785 614960 632228 646516 664001
10712 664001 683871 709147 738571 766339 803007 835695 862698 888674 920155 949165 978748
10701 978748 1011079 1046909 1082488 1118778 1157994 1201680 1244517 1285219 1325331 1374183 1431457
10690 1431457 1487102 1558298 1635353 1717139 1818034 1929932 2046063 2169417 2299693 2445576
10680 2445576 2605497 2784989 2975295 3182291 3419080 3681519 3972155 4308727 4694880
$$ packed form
10765B52479N764K649m002K454l44j032M973J3273P673M968M031M611O765P652
10751C11914J686l910M926J5769J7320J2642M947J161K627R747J3450n758q838
10738C77683k468M376O430N208O129L159J1907J899J132Q76k632J3090K0544J2069
10724D59402L941Q608J1146K0123K7017J7696K3378K2474K1175J7268J4288J7485
10712F64001J9870K5276K9424K7768L6668L2688K7003K5976L1481K9010K9583
10701I78748L2331L5830L5579L6290L9216M3686M2837M0702M0112M8852N7274
10690A431457N5645P1196P7055Q1786J00895J11898J16131J23354J30276J45883
10680B445576J59921J79492J90306K06996K36789K62439K90636L36572L86153
$$ plain form
10671 4694880 5119879 5600067 6163080 6818271 7584662 8500681 9594486 10922712 12542681
10662 12542681 14533837 17014687 20126985 24126715 29351534 36278841 45528082 57828308
10654 57828308 73749697 93012793 113370766 129610188 135026915 126643881 108602279
10647 108602279 88099098 69890813 55393849 44322291 35940202 29536490 24586788
10640 24586788 20726736 17677887 15238798 13255692 11620786 10260319 9109885 8123733
10632 8123733 7286883 6569476 5950320 5412712 4939799 4522233 4156321 3830818 3548171
10623 3548171 3288132 3056774 2854572 2679816 2518410 2367172 2228026 2100071 1979139
10614 1979139 1866422 1766445 1676036 1587975 1507737 1425295 1343071 1272313 1198636 1139087 1077877
$$ packed form
10671D694880M24999M80188N63013O55191P66391R16019J093805J328226J619969
10662A2542681J991156K480850L112298L999730N224819O927307R249241J2300226
10654E7828308J5921389J9263096K0357973J6239422N416727q383034j8041602
10647A08602279k0503181j8208285j4496964j1071558q382089o403712m949702
10640B4586788l860052l048849k439089j983106j634906j360467j150434r86152
10632H123733q36850p17407o19156n37608m72913m17566l65912l25503k82647
10623C548171k60039k31358k02202j74756j61406j51238j39146j27955j20932
10614A979139j12717r9977r0409q8061q0238q2442q2224p0758p3677n9549o1210
$$ plain form
10603 1077877 1019444 973905 929492 892228 861472 825892 794730 761717 727407 701832 685374
10592 685374 669914 653075 628353 608684 588886 571240 559940 546575 534890 523636 518750 507659
10580 507659 499729 488932 482267 474069 463700 453172 438072 424763 413666 399545 385424 377021
10568 377021 372970 366143 351066 339711 325594 310969 300619 296707 280652 264673 257039 251768
10556 251768 242876 239362 242392 251651 246184 237734 235976 233621 232877 236165 234096 232169 237891 240568
10542 240568 237494 235698 230999 235663 241020 243024 246544 250177 239407 231645 227404 227798 234788 246514
10528 246514 256450 261616 256377 246128 230668 214297 201987 197953 205818 214345 217375 213071 207010
10515 207010 196891 191593 188264 181684 173546 169672 170043 170857 172813 170894 163697 155496 150534 145838
$$ packed form
10603A077877n8433m5539m4413l7264l0756l5580l1162l3013l4310k5575j6458
10592F85374j5460j6839k4722j9669j9798j7646j1300j3365j1685j1254m886j1091
10580E07659p930j0797o665q198j0369j0528j5100j3309j1097j4121j4121q403
10568C77021m051o827j5077j1355j4117j4625j0350l912j6055j5979p634n271
10556B51768q892l514L030R259n467q450j758k355p44L288k069j927N722K677
10542B40568l074j796m699M664N357K004L520L633j0770p762m241L94O990J1726
10528B46514R936N166n239j0249j5460j6371j2310m034P865Q527L030m304o061
10515B07010j0119n298l329o580q138l874L71Q14J956j919p197q201m962m696
$$ plain form
10501 145838 147101 150436 162670 162527 159678 156924 153409 162016 170739 167853 170275 170186 170417 176507 175673
10486 175673 168460 156128 150865 146103 145446 143794 138628 132168 133032 133149 130816 129478 134203 133423 130999
10471 130999 133650 135198 135327 129419 128935 122609 115787 109149 112133 105207 101348 106484 108456 101656 102438
10456 102438 113413 116596 121784 123776 128225 131736 139131 150689 152912 146578 138068 132716 125598 118243
10442 118243 109158 110041 117686 115338 110963 111005 106329 109004 102691 98893 94012 93025 102328 104288 110705
10427 110705 111721 108964 102038 102076 103460 101266 102111 98955 100499 100539 101230 109161 114841 114514 114781 120397
10411 120397 125552 125756 127548 131030 140906 138565 134163 134937 133893 144390 156056 173359 194155 198315
10397 198315 211427 243735 301295 388090 525285 708974 934787 1154621 1315086 1362260
$$ packed form
10501A45838J263L335J2234j43k849k754l515Q607Q723k886K422q9K31O090q34
10486A75673p213j2332n263m762o57j652n166o460Q64J17k333j338M725p80k424
10471A30999K651J548J29n908m84o326o822o638K984o926l859N136J972o800P82
10456A02438J0975L183N188J992M449L511P395J1558K223o334q510n352p118p355
10442A18243r085Q83P645k348m375M2m676K675o313l798m881r87R303J960O417
10427A10705J016k757o926L8J384k194Q45l156J544M0O91P931N680l27K67N616
10411A20397N155K04J792L482R876k341m402P74j044J0497J1666J7303K0796M160
10397A98315J3112L2308N7560Q6795J37195J83689K25813K19834J60465M7174
$$ plain form
10387 1362260 1281974 1107251 887515 683111 521475 417654 344679 299988 269573 246170
10377 246170 224233 204119 193318 186676 179718 173759 171607 173206 179594 194511 217878 260648 329045
10364 329045 449636 655095 970491 1344168 1635114 1654877 1382505 994959 679376 476823
10354 476823 353149 275791 229748 203620 188690 172872 163728 157145 151364 137133 135277 132234
10342 132234 121814 113594 111242 111666 102916 97390 96570 100018 102442 107871 107984 106388 108347 107851 106266
10327 106266 99305 97081 100090 104065 108634 103445 99320 96255 98868 104182 109809 117603 130962 141172
10313 141172 143178 137184 122899 108677 98351 89329 85808 85250 86918 84174 93955 98295 99439 107376
10299 107376 108692 112359 114208 110629 107506 105443 108101 113752 110384 99285 88354 90011 91882 93962
$$ packed form
10387A362260q0286j74723k19736k04404j61636j03821p2975m4691l0415k3403
10377B46170k1937k0114j0801o642o958n959k152J599O388J4917K3367M2770O8397
10364C29045J20591K05459L15396L73677K90946J9763k72372l87546l15583k02553
10354D76823j23674p7358m6043k6128j4930j5818r144o583n781j4231j856l043
10342A32234j0420q220k352M24q750n526q20L448K424N429J13j596J959m96j585
10327A06266o961k224L009L975M569n189m125l065K613N314N627P794J3359J0210
10313A41172K006n994j4285j4222j0326r022l521n58J668k744R781M340J144P937
10299A07376J316L667J849l579l123k063K658N651l368j1099j0931J657J871K080
$$ plain form
10285 93962 98546 92735 96493 97790 95989 96726 99954 112871 122591 119705 120415 129969 133653 134454 131442
10270 131442 124560 115967 111368 104992 103016 107725 109045 104232 100646 89924 85324 80181 79082 80663
10256 80663 92237 97947 106983 126002 138078 144687 153328 166810 193227 220691 245940 263315
10244 263315 268002 267152 257346 248366 234103 215425 196754 182818 165739 149664 137582 129542 127577
10231 127577 131465 140990 148944 150904 155841 149340 136651 124196 120546 125510 131746 150318 172926
10218 172926 196350 222899 242784 266544 281989 280888 268613 264993 261145 255064 251628 240740
10206 240740 219045 198658 179139 173595 165078 153665 147876 145267 139363 136221 137172 133089 125118
10193 125118 126724 135358 134678 143486 145603 151486 162249 178607 189028 188465 191194 193555 204219 218997
$$ packed form
10285I3962M584n811L758J297j801P37L228J2917R720k886P10R554L684Q01l012
10270A31442o882q593m599o376j976M709J320m813l586j0722m600n143j099J581
10256H0663J1574N710R036J9019J2076O609Q641J3482K6417K7464K5249J7375
10244B63315M687q50r806q980j4263j8678j8671j3936j7079j6075j2082q040j965
10231A27577L888R525P954J960M937o501j2689j2455l650M964O236J8572K2608
10218A72926K3424K6549J9885K3760J5445j101j2275l620l848o081l436j0888
10206B40740k1695k0387j9519n544q517j1413n789k609n904l142R51m083p971
10193A25118J606Q634o80Q808K117N883J0763J6358J0421n63K729K361J0664J4778
$$ plain form
10179 218997 229265 237547 239499 238378 226627 209983 190300 176738 172974 171884 174131 175328 177048
10166 177048 177178 175249 171643 160902 154023 156430 155514 152753 157568 157943 154633 160207 168632 171362 172440
10151 172440 166551 163881 171673 174920 182419 200653 211268 211719 199391 186095 175180 171217 178578
10138 178578 184926 191395 189914 185677 186130 184304 194749 203570 207018 197988 189474 191194 182851 179324
10124 179324 186323 196506 218867 254017 291649 323291 336784 318577 285714 255013 230409 221187
10112 221187 223922 247397 267413 280155 292049 299790 304516 302300 298862 291610 284695 290613 295446
10099 295446 300538 308717 321263 317818 313645 313042 321230 329108 346681 367472 414702 477922 552322
10086 552322 609993 619053 567555 499589 443835 415636 411518 411653 421334 436486 451741 461874
$$ packed form
10179B18997J0268Q282J952j121j1751j6644j9683j3562l764j090K247J197J720
10166A77048J30j929l606j0741o879K407r16k761M815L75l310N574Q425K730J078
10151A72440n889k670P792L247P499J8234J0615M51j2328j3296j0915l963P361
10138A78578O348O469j481m237M53j826J0445Q821L448r030q514J720q343l527
10124A79324O999J0183K2361L5150L7632L1642J3493j8207l2863l0701k4604r222
10112B21187K735K3475K0016J2742J1894P741M726k216l438p252o915N918M833
10099B95446N092Q179J2546l445m173o03Q188P878J7573K0791M7230O3220P4400
10086E52322N7671R060n1498o7966n5754k8199m118J35R681J5152J5255J0133
$$ plain form
10074 461874 471913 479949 488322 495122 491283 481874 472639 470342 479820 493556 510439 530827 551732
10061 551732 573153 607260 644771 681005 712637 740777 776702 812919 849868 883600 929150
10050 929150 1002208 1096084 1221443 1376061 1526408 1644811 1718329 1761335 1798174 1844302 1872190
10039 1872190 1818723 1678217 1517847 1397586 1319500 1277159 1255519 1248873 1255940 1274998 1315978
10028 1315978 1371444 1452897 1543463 1646639 1758886 1872339 1986609 2102655 2228105 2354292
10018 2354292 2515057 2716634 2964638 3266665 3628320 4042318 4498340 4979105 5421969
10009 5421969 5785905 6079008 6375552 6767640 7366757 8259661 9510193 11171096 13306416
10000 13306416 16041542 19694846 24946344 33072943 46139995 66832716 97147311 136114596
$$ packed form
10074D61874J0039Q036Q373O800l839r409r235k297R478J3736J6883K0388K0905
10061E51732K1421L4107L7511L6234L1632K8140L5925L6217L6949L3732M5550
10050I29150P3058R3876J25359J54618J50347J18403P3518M3006L6839M6128K7888
10039A872190n3467j40506j60370j20261p8086m2341k1640o646P067J9058M0980
10028A315978N5466Q1453R0566J03176J12247J13453J14270J16046J25450J26187
10018B354292J60765K01577K48004L02027L61655M13998M56022M80765M42864
10009E421969L63936K93103K96544L92088N99117Q92904J250532J660903K135320
10000A3306416K735126L653304N251498Q126599J3067052K0692721L0314595L8967285
$$ plain form
9992 136114596 178203886 213461125 232051628 228690748 204602129 166518537 124682235
9985 124682235 88365989 61619768 44151388 33426182 26797502 22527822 19651929
9978 19651929 17566519 15817486 14224325 12903086 12057356 11768781 12010393 12752497 13985296
9969 13985296 15643409 17603550 19847835 22784086 27325396 34944956 48084565 70750664
9961 70750664 108438274 164939831 232480002 283250665 286340929 239171697 170175104
9954 170175104 111372336 73444695 51290899 38087716 29686008 23979890 19904646
9947 19904646 16828502 14297754 12103583 10248528 8780196 7650115 6808251 6216552
9939 6216552 5849069 5678050 5578056 5306126 4758517 4077996 3473426 3014524 2670345 2409682
$$ packed form
9992A36114596M2089290L5257239J8590503l360880k4088619l8083592m1836302
9985A24682235l6316246k6746221j7468380j0725206o628680m269680k875893
9978A9651929k085410j749033j593161j321239q45730k88575K41612P42104J232799
9969A3985296J658113J960141K244285K936251M541310P619560J3139609K2666099
9961G0750664L7687610N6501557O7540171N0770663L090264m7169232o8996593
9954A70175104n8802768l7927641k2153796j3203183q401708n706118m075244
9947A9904646l076144k530748k194171j855055j468332j130081q41864n91699
9939F216552l67483j71019r9994k71930n47609o80521o04570m58902l44179k60663
$$ plain form
9929 2409682 2210455 2048185 1909403 1777247 1664694 1575676 1511248 1457007 1400721 1346739
9919 1346739 1299782 1246773 1170504 1077134 989613 896978 825525 768948 722006 680176 639000
9908 639000 595546 556588 515493 497495 487551 469241 436799 409249 395600 386803 384978 367363
9896 367363 347476 328859 312633 309918 317627 331126 339772 346680 357458 355585 346583 345028 338639
9883 338639 328746 324588 318154 298298 275427 248202 230949 227766 225012 226081 230714 240088 251944
9870 251944 270541 286627 292720 296941 283632 265125 237706 200184 161961 141461 146804 160768
9858 160768 173127 188741 199833 199719 185046 176941 184275 190814 194791 207093 218840 229400 240109
9845 240109 243242 231737 210682 189836 170896 162927 167184 183747 217088 252459 296792 341759
$$ packed form
9929B409682j99227j62270j38782j32156j12553q9018o4428n4241n6286n3982
9919A346739m6957n3009p6269r3370q7521r2635p1453n6577m6942m1830m1176
9908F39000m3454l8958m1095j7998r944j8310l2442k7550j3649q797j825j7615
9896C67363j9887j8617j6226k715P709J3499Q646O908J0778j873r002j555o389
9883C38639r893m158o434j9856k2871k7225j7253l183k754J069M633R374J1856
9870B51944J8597J6086O093M221j3309j8507k7419l7522l8223k0500N343J3964
9858A60768J2359J5614J1092j14j4673q105P334O539L977J2302J1747J0560J0709
9845B40109L133j1505k1055k0846j8940p969M257J6563L3341L5371M4333M4967
$$ plain form
9833 341759 374938 369288 307204 220696 170955 192326 257400 316539 356171 410435 506164 652585
9821 652585 788710 725354 531412 393608 331175 314092 320504 330399 332515 323510 305337 293381
9809 293381 284717 285308 305824 338286 390764 464941 624739 907224 1351920 1948741 2537765
9798 2537765 2771764 2515410 2027975 1548359 1149156 843617 627305 485010 389958 323655
9788 323655 273627 236832 211898 188909 165624 147819 135933 128108 118131 113579 107095 103603 111211
9775 111211 112563 90174 71712 53124 41462 33043 24497 25531 28834 33652 42596 57049 75627
9762 75627 96665 119183 136287 148675 168033 180484 183311 184658 194266 199732 192466 184876 170262
9749 170262 152071 133695 121916 111841 98963 87068 80139 71205 67799 64875 49301 40997 33711
$$ packed form
9833C41759L3179n650o2084q6508m9741K1371O5074N9139L9632N4264R5729J46421
9821F52585J36125o3356j93942j37804o2433j7083O412R895K116r005j8173j1956
9809B93381q664N91K0516L2462N2478P4177J59798K82485M44696N96821N89024
9798B537765K33999k56354m87435m79616l99203l05539k16312j42295r5052o6303
9788C23655n0028l6795k4934k2989k3285j7805j1886p825r977m552o484l492P608
9775A11211J352k2389j8462j8588j1662q419q546J034L303M818Q944J4453J8578
9762G5627K1038K2518J7104J2388J9358J2451K827J347R608N466p266p590j4614
9749A70262j8191j8376j1779j0075j2878j1895o929q934l406k924j5574q304p286
$$ plain form
9736 33711 21364 16775 20220 16861 9883 5989 5367 13414 24642 27780 36010 42442 50978 57072
9722 57072 58968 62655 65282 65630 63654 67125 66663 61110 59890 58798 57061 64761 64135 57152 54592
9707 54592 48975 41204 32714 27523 26510 24405 13395 2157 4618 12589 24834 44933 79431
9694 79431 118556 168974 230445 272128 275715 239250 186153 136098 98981 70381 50413 47983
9682 47983 43819 43321 41962 38862 30145 23650 21740 23235 20844 19759 18169 13328 14907 17347 27878
9667 27878 41210 45948 44219 41681 37605 35894 39265 38479 35990 36150 22425 11715 4341 7464
9653 7464 12859 16332 12301 11798 12015 15385 19079 21312 24702 33275 47567 57053 66668 81066 105663
9638 105663 128995 154753 161280 143948 115251 95564 77940 56057 41032 35767 36986 35459
$$ packed form
9736C3711j2347m589L445l359o978l894o22Q047J1228L138Q230O432Q536O094
9722E7072J896L687K627L48j976L471m62n553j220j092j737P700o26o983k560
9707E4592n617p771q490n191j013k105j1010j1238K461P971J2245K0099L4498
9694G9431L9125N0418O1471M1683L587l6465n3097n0055l7117k8600j9968k430
9682D7983m164m98j359l100q717o495j910J495k391j085j590m841J579K440J0531
9667B7878J3332M738j729k538m076j711L371p86k489J60j3725j0710p374L123
9653G464N395L473m031n03K17L370L694K233L390Q573J4292R486R615J4398K4597
9638A05663K3332K5758O527j7332k8697j9687j7624k1883j5025n265J219j527
$$ plain form
9626 35459 29454 27141 27123 26354 24154 26018 21658 19712 16341 16766 19921 24974 33964 34562 36027 35457
9610 35457 38126 40776 41981 37308 34560 29952 29374 37270 46314 55850 49410 49133 57912 73959 90452
9595 90452 108644 138722 184665 251932 354026 508910 716762 946135 1144340 1264374 1263786
9584 1263786 1136204 926805 698179 496536 353405 267080 206631 160376 123923 106498
9574 106498 81335 62078 52370 58074 55148 47718 48147 56378 60788 60314 58442 60854 73858 84412
9560 84412 96659 110890 130671 159774 207690 288746 429473 662782 1000914 1373442 1595325
9549 1595325 1516898 1186580 802427 515743 346412 249103 182831 138209 105547 80069 65860
9538 65860 54543 52176 49179 35988 26069 22626 18112 21388 21974 22459 15465 8610 7674 4753 628
$$ packed form
9626C5459o005k313j8p69k200J864m360j946l371M25L155N053Q990N98J465n70
9610C5457K669K650J205m673k748m608n78P896R044R536o440k77Q779J6047J6493
9595I0452J8192L0078M5943O7267J02094J54884K07852K29373J98205J20034n88
9584A263786j27582k09399k28626k01643j43131q6325o0449m6255l6453j7425
9574A06498k5163j9257r708N704k926p430M29Q231M410m74j872K412J3004J0554
9560H4412J2247J4231J9781K9103M7916Q1056J40727K33309L38132L72528K21883
9549A595325p8427l30318l84153k86684j69331r7309o6272m4622l2662k5478j4209
9538F5860j1317k367k997j3191r919l443m514L276N86M85o994o855r36k921m125
$$ plain form
9523 628 -443 3715 7266 3285 -8028 -5946 -8376 -5149 2786 7854 3994 1759 1169 -2551 -11786
9508 -11786 -13591 -16990 -9775 -2390 6589 8321 7479 9674 5864 1220 -2657 -4026 -11703 -19087 -14906
9493 -14906 -3337 -5504 -15401 -15066 -8452 -4766 -2339 -6968 -6243 -10856 -6543 -7230 -1054 3958 1431
9478 1431 -2559 -6573 -6598 -10031 -11593 -8656 -4908 604 -2533 -7788 -16326 -14181 -9767 -9296 -13791 -16189
9462 -16189 -14917 -12779 -12930 -12967 -12608 -5002 1661 -1240 -1232 5086 1742 -6792 -4232 -2401 -2514 -4694 -1362
9445 -1362 2639 5826 6186 170 -3040 911 1759 -7631 -7930 -4523 218 58 -4092 -128 11463 15226
9429 15226 10899 7894 8102 7490 -1254 -884 -6251 -8111 -4822 -8500 -7386 -10472 -5102 1897 1211 -1048
9413 -1048 6336 9961 8698 6585 -4060 -7823 -6242 -6816 -16291 -17282 -11834 -13190 -8365 -3075 14
$$ packed form
9523F28j071M158L551l981j1313K082k430L227P935N068l860k235n90l720r235
9508a1786j805l399P215P385Q979J732q42K195l810m644l877j369p677p384M181
9493a4906J1569k167r897L35O614L686K427m629P25m613M313o87O176N012k527
9478A431l990m014k5l433j562K937L748N512l137n255q538K145M414M71m495k398
9462a6189J272K138j51l7L59P606O663k901QO318l344q534K560J831j13k180L332
9445a362M001L187L60o016l210L951Q48r390k99L407M741j60m150L964J1591L763
9429A5226m327l005K08o12q744L70n367j860L289l678J114l086N370O999o86k259
9413a048P384L625j263k113j0645l763J581n74r475r91N448j356M825N290L089
$$ plain form
9398 14 -120 1675 7339 6840 9599 9008 6845 3175 -871 886 1492 2680 1287 -5265 -9557 -5001
9382 -5001 -6056 -5921 -10312 -8160 -8365 -3084 3779 7326 5242 6551 3772 1308 -4312 -8709 -10352
9367 -10352 -11428 1738 5787 3009 2855 -3438 -7294 -7633 -7623 -9772 -17052 -21127 -8507 -778 2350
9352 2350 -616 -6068 -7126 -11995 -5942 -6014 -8951 -8415 2952 -1972 -6918 567 -1225 -3393 -2647 -3671
9336 -3671 -5929 -3176 359 2654 9227 12028 9277 7103 501 6628 10786 8942 -1555 -15589
9322 -15589 -16727 -13232 -12846 -21091 -22256 -15674 -11439 -9485 -8934 -6177 -9129 -14915 -18985 -20295 -11069
9307 -11069 -7434 -3295 -9198 -13806 -17965 -21678 -21029 -13410 -9267 -2646 4927 5209 -972 2412 192
9292 192 -5781 -6085 -5037 -10973 -14829 -19073 -23608 -16029 -10665 -13191 -8386 -5128 -13713 -13315 -5334 2355
$$ packed form
9398A4j34J795N664m99K759n91k163l670m046J757O06J188j393o552m292M556
9382e001j055J35m391K152k05N281O863L547k084J309k779k464n620m397j643
9367a0352j076J3166M049k778j54o293l856l39J0k149p280m075J2620P729L128
9352B350k966n452j058m869O053p2k937N36J1367m924m946P485j792k168P46j024
9336c671k258K753L535K295O573K801k751k174o602O127M158j844j0497j4034
9322a5589j138L495L86q245j165O582M235J954N51K757k952n786m070j310R226
9307a1069L635M139n903m608m159l713O49P619M143O621P573K82o181L384k220
9292A92n973l04J048n936l856m244m535P579N364k526M805L258q585L98P981P689
$$ plain form
9276 2355 -2747 -3834 -88 2421 -3061 -8987 -10769 -13382 -8881 -8435 -9071 -10586 -9283 -13125 -18519
9261 -18519 -21370 -20027 -14446 -12520 -9444 -14311 -19589 -22745 -23284 -15879 -12647 -6057 -1619 -5775 -9379
9246 -9379 -20871 -21265 -16689 -10860 -12172 -15089 -19081 -17649 -10659 -4411 -2610 146 7687 5235 -423
9231 -423 -3028 -6874 -8038 -9062 -3629 -5197 469 4563 -2376 -8531 -743 -674 -8788 -5023 -2016 -9396
9215 -9396 -11253 -3438 1313 2267 -977 -3410 -945 2658 -3717 -17216 -19837 -13717 -6270 -6025 -9980
9200 -9980 -13913 -16166 -12849 -6557 320 -494 -3089 -6160 -1142 918 -1984 -2155 -2283 -7372 -9223 -18537
9184 -18537 -16297 -13180 -9757 -8682 1729 6389 1254 -8630 -10629 -9931 -7798 -7076 -5312 -9053 -11566
9169 -11566 -5541 4011 -8038 -15405 -10328 -12934 -17619 -12584 -4451 -8206 -6359 -3309 -4096 -7586 -9273
$$ packed form
9276B355n102j087L746K509n482n926j782k613M501M46o36j515J303l842n394
9261a8519k851J343N581J926L076m867n278l156n39P405L232O590M438m156l604
9246i379j1492l94M576N829j312k917l992J432O990O248J801K756P541k452n658
9231d23k605l846j164j024N433j568N666M094o939o155P788O9q114L765L007p380
9215i396j857P815M751R54l244k433K465L603o375j3499k621O120P447K45l955
9200i980l933k253L317O292O877q14k595l071N018K060k902j71j28n089j851r314
9184a8537K240L117L423J075J0411M660n135r884j999O98K133P22J764l741k513
9169a1566O025R552j2049p367N077k606m685N035Q133l755J847L050p87l490j687
$$ plain form
9154 -9273 -7582 1446 1721 5040 -1403 -10865 -14019 -16788 -21775 -14361 -10267 -9095 -6812 -6738 -8717 -8717
9138 -8717 -8775 -7690 -6032 -3893 -1519 -592 -4050 -5988 -1778 -1177 -1849 -5368 -3199 2614 3186 -4323
9122 -4323 -6979 -5872 -12717 -14065 -11737 -11902 -8155 -13534 -19305 -15845 -10166 -13389 -14135 -4306 1133
9107 1133 428 -642 -8451 -16138 -12370 -12375 -16941 -15531 -14408 -13927 -14954 -13063 -6878 -14194 -15424 -16945
9091 -16945 -15173 -7090 -3546 -5277 -6847 -10909 -11828 -10417 -11621 -10907 -12305 -6489 1343 -720 -3334
9076 -3334 -4497 -6554 -1281 -3432 -6466 -4443 -5337 -13849 -16664 -14683 -13319 -15095 -24089 -30651 -24297
9061 -24297 -17972 -13916 -19319 -21879 -20049 -18076 -13070 -4259 -4771 -7211 -6632 -10614 -11790 -14946 -16223
9046 -16223 -7284 -2665 -4351 3088 7486 4329 2551 3574 3844 -1044 3399 8972 6333 3502 -3821
$$ packed form
9154i273J691R028K75L319o443r462l154k769m987P414M094J172K283P4j979%
9138h717n8J085J658K139K374R27l458j938M210O01o72l519K169N813N72p509
9122d323k656J107o845j348K328j65L747n379n771L460N679l223p46R829N439
9107A133p05j070p809p687L768nm566J410J123M81j027J891O185p316j230j521
9091a6945J772Q083L544j731j570m062r19J411j204P14j398N816P832k063k614
9076c334j163k057N273k151l034K023q94q512k815J981J364j776q994o562O354
9061b4297O325M056n403k560J830J973N006Q811n12k440N79l982j176l156j277
9046a6223Q939M619j686P439M398l157j778J023K70m888M443N573k639k831p323
$$ plain form
9031 -3821 -3701 -5244 -9636 -3511 -3772 516 -5243 -15157 -15713 -9066 -1507 -2800 -6149 -6646 -5082 -11652
9015 -11652 -12846 -7393 -10406 -16373 -14451 -14837 -13149 -8070 329 5126 2798 1385 6515 2646 -6486
9000 -6486 -6231 -8873 -13930 -12375 -7227 -16377 -14312 -8731 -3391 -4338 -3001 -460 -9310 -11803 -6341
8985 -6341 503 2284 -5075 -5922 -7377 -12576 -9126 -4407 -10747 -17964 -18521 -17155 -14893 -9219 -10791
8970 -10791 -6943 -3212 -4025 -6345 -8324 -1858 464 19 -7488 -11861 -12076 -11523 -7195 -1719 -1571 -2645
8954 -2645 -1359 -2887 -7655 -13287 -10582 -2722 4733 3086 -656 -8928 -11480 -11808 -9103 -7034 -3283
8939 -3283 -5460 -5979 -6033 -7481 -7694 -6614 -8794 -4211 -1569 -12754 -16450 -11909 -5451 -7075 -7730 -11556
8923 -11556 -14877 -6024 -1601 -5909 -14291 -13133 -10435 -11934 -8597 -200 -1006 -3370 -3550 -9718 -11999
$$ packed form
9031c821J20j543m392O125k61M288n759r914n56O647P559j293l349m97J564o570
9015a1652j194N453l013n967J922l86J688N079Q399M797k328j413N130l869r132
9000f486K55k642n057J555N148r150K065N581N340r47J337K541q850k493N462
8985f341O844J781p359q47j455n199L450M719o340p217n57J366K262N674j572
8970a0791L848L731q13k320j979O466K322m45p507m373k15N53M328N476J48j074
8954b645J286j528m768n632K705P860P455j647l742q272k552l28K705K069L751
8939c283k177n19n4j448k13J080k180M583K642j1185l696M541O458j624o55l826
8923a1556l321Q853M423m308q382J158K698j499L337Q397q06k364j80o168k281
$$ plain form
8908 -11999 -13878 -11448 -10786 -11576 -8718 -4120 -1819 -4113 -2036 -1408 -6724 -5330 644 -6241 -8991
8893 -8991 -8160 -8314 -13707 -16812 -12369 -6687 -1965 50 -7741 -12385 -15652 -14560 -6609 -4037 694
8878 694 5290 5303 1483 -3565 -11158 -5460 -6506 -11561 -9395 -2977 -3960 -6608 -139 6432 1218 -10662
8862 -10662 -5634 -7921 -9035 -4698 2137 1728 1211 7808 16008 12940 1692 -3090 4058 10472 13270
8847 13270 22365 39394 72396 119118 167359 193922 168833 113257 70596 47874 27257 21856
8835 21856 17698 10630 8217 9832 3815 -834 -4537 -3210 2197 8751 12158 6624 -337 5076 8527
8820 8527 6106 2406 5924 3182 1094 1127 3212 6729 7785 4078 5159 3716 1554 -2918 -5872
8805 -5872 -3188 -12381 -24720 -26290 -19426 -7770 -3203 -8434 -10002 -8635 -2971 -1957 7143 11258
$$ packed form
8908a1999j879K430O62p90K858M598K301k294K077O28n316J394N974o885k750
8893h991Q31j54n393l105M443N682M722K015p791m644l267J092P951K572M731
8878F94M596J3l820n048p593N698j046n055K166O418r83k648O469O571n214j1880
8862a0662N028k287j114M337O835m09n17O597Q200l068j1248m782P148O414K798
8847A3270R095J7029L3002M6722M8241K6563k5089n5576m2661k2722k0617n401
8835B1856m158p068k413J615o017m649l703J327N407O554L407n534o961N413L451
8820H527k421l700L518k742k088L3K085L517J056l707J081j443k162m472k954
8805e872K684r193j2339j570O864J1656M567n231j568J367N664J014R100M115
$$ plain form
8791 11258 8977 5686 5006 2965 2558 5066 -479 -8218 -5764 -3163 1899 2984 3704 3618 -2732 453
8775 453 2676 816 3878 2628 1093 -4599 -11499 -6892 -632 3512 8031 7564 4483 2717 2144 13487
8759 13487 12138 11202 9873 8222 7921 3993 2796 2769 -10086 -13092 -7630 -5832 -3138 -3605 6940
8744 6940 16797 15834 9157 5611 167 1449 2152 1453 3377 55 332 165 -2969 -3685 3063 1414
8728 1414 -1825 -7271 -7566 5530 7706 5621 5622 -305 -5130 -13504 -20456 -18602 -12731 -8515 -4081 -4709
8712 -4709 -4219 3049 6869 3024 1683 6261 12520 10297 4785 5557 1418 -6527 -12653 -10849 -12367
8697 -12367 -17025 -18219 -18587 -13731 -9639 -3883 -1588 1131 -503 -1995 -5074 -1896 578 574 3330 1753
8681 1753 1136 424 -132 574 -5082 -7654 -6339 -8093 -9998 -1175 -3240 -1887 652 -3159 1531 7841
$$ packed form
8791A1258k281l291o80k041m07K508n545p739K454K601N062J085P20q6o350L185
8775D53K223j860L062j250j535n692o900M607O260M144M519m67l081j766n73J1343
8759A3487j349r36j329j651l01l928j197k7j2855l006N462J798K694m67J0545
8744F940R857r63o677l546n444J282P03o99J924l322K77j67l134p16O748j649
8728A414l239n446k95J3096K176k085Jn927m825q374o952J854N871M216M434o28
8712d709M90P268L820l845j341M578O259k223n512P72m139p945o126J804j518
8697a2367m658j194l68M856M092N756K295K719j634j492l079L178K474mK756j577
8681A753o17p12n56P06n656k572J315j754j905Q823k065J353K539l811M690O310
$$ plain form
8665 7841 8230 5612 4747 4021 -4701 -4637 254 3012 3817 -2533 -6355 -2298 -1640 -2683 6205 2896 -2621
8648 -2621 -3994 -10133 -8358 1341 7676 7618 6601 7027 253 -1761 -1047 1521 1437 -175 -2719 3994
8632 3994 9590 9585 4749 -1244 -1272 -2193 -1741 3210 -2446 -3232 -656 475 -5018 -12597 -10938 -4889 -3038
8615 -3038 1697 173 -2031 700 -5237 -9798 -160 9751 11308 17989 14981 10268 11881 7126 -1622
8600 -1622 -522 94 -1971 3670 6602 1041 981 8083 11005 8807 -1682 -3312 3832 7353 5662
8585 5662 8448 9704 11153 149 706 4451 10144 20137 20434 21461 27304 40441 62186 85793
8571 85793 95572 78889 55307 41656 37757 43522 48491 46955 45006 50751 58795 62290 59522 52487
8557 52487 43610 42807 41626 33269 27970 24134 22462 17952 16052 18939 13075 6905 2362 -2516 4446
$$ packed form
8665G841L89k618q65p26q722O4M891K758Q05o350l822M057O58j043Q888l309n517
8648b621j373o139J775R699O335n8j017M26o774k014P14K568q4j612k544O713
8632C994N596nm836n993k8r21M52M951n656p86K576J131n493p579J659O049J851
8615c038M735j524k204K731n937m561R638R911J557O681l008m713J613m755q748
8600a622J100O16k065N641K932n561o0P102K922k198j0489j630P144L521j691
8585E662K786J256J449j1004N57L745N693R993K97J027N843J3137K1745K3607
8571H5793R779j6683k3582j3651l899N765M969j536j949N745Q044L495k768p035
8557E2487q877q03j181q357n299l836j672m510j900K887n864o170m543m878O962
$$ plain form
8542 4446 10665 14633 10807 7655 11310 18756 17852 19213 18051 16728 21648 26793 38324 68550 98744
8527 98744 134618 138372 102258 59278 38151 26169 24402 19425 16161 16146 18698 23051 21480 14296
8513 14296 7897 11810 12268 12224 10713 10216 8145 6367 9040 12243 4436 2997 -636 -4633 -514 -1194
8497 -1194 2828 3513 -798 -914 2818 -31 1614 -273 4771 9174 12050 18694 26476 44258 66243
8482 66243 78060 63124 39224 21699 7626 10004 6627 3154 2708 985 5216 1435 -1225 -6501
8468 -6501 -3162 9402 13311 11507 4234 -617 3572 765 -5633 -8507 -1346 4593 5335 1111 -4774
8453 -4774 -8264 -6957 -6576 -5209 -4061 -2861 -3180 -5990 -811 4247 -686 139 8195 16072 8357 8588
8437 8588 8882 15335 28387 41214 61009 86624 126169 163282 158160 119702 85734 56962 41552
$$ packed form
8542D446O219L968l826l152L655P446r04J361j162j323M920N145J1531L0226L0194
8527I8744L5874L754l6114m2980k1127j1982j767m977l264j5K552M353j571p184
8513A4296o399L913M58m4j511m97k071j778K673L203p807j439l633l997M119o80
8497a194M022O85m311j16L732k849J645j887N044M403K876O644P782J7782K1985
8482F6243J1817j4936k3900j7525j4073K378l377l473m46j723M231l781k660n276
8468f501L339J2564L909j804p273m851M189k807o398k874P161N939P42m224n885
8453d774l490J307L81J367J148J200l19k810N179N058m933Q25Q056P877p715K31
8437H588K94O453J3052J2827J9795K5615L9545L7113n122l8458l3968k8772j5410
$$ plain form
8424 41552 30986 26205 19431 12908 4691 906 -6365 -1439 4840 6799 6513 7134 3091 1946 4938
8409 4938 10202 10357 13470 17326 21561 22169 17897 10326 10408 5195 8149 13104 14808 14047 14172 14598 19154
8392 19154 33163 48320 59590 83293 118121 163975 234682 307551 326239 265703 186569 124741
8380 124741 84938 59614 41639 31193 22626 16275 19653 23404 26114 34044 46152 53526 56286
8367 56286 49353 40848 35772 27653 19520 14057 19076 21333 15168 8738 -769 -192 10064 19711 21315
8352 21315 16218 9936 4823 11849 16865 20498 26830 28917 34959 48443 75008 105464 133063 148007
8338 148007 135202 99761 63524 43107 35989 36064 38329 41672 50893 58335 63266 57439 38431 27496
8324 27496 22802 22509 21734 18092 17181 18067 15668 8474 5456 3872 4458 898 -3292 -4700 -4777 -3301
$$ packed form
8424D1552j0566m781o774o523q217l785p271M926O279J959k86O21m043j145K992
8409D938N264J55L113L856M235O08m272p571Q2n213K954M955J704p61J25M26M556
8392A9154J4009J5157J1270K3703L4828M5854P0707P2869J8688o0536p9134o1828
8380A24741l9803k5324j7975j0446q567o351L378L751K710P930J2108P374K760
8367E6286o933q505n076q119q133n463N019K257o165o430r507N77J0256R647J604
8352B1315n097o282n113P026N016L633O332K087O042J3484K6565L0456K7599J4944
8338A48007j2805l5441l6237k0417p118P5K265L343R221P442M931n827j9008j0935
8324B7496m694k93p75l642r11Q86k399p194l018j584N86l560m190j408p7J476
$$ plain form
8308 -3301 -3383 -3837 -6770 -10676 -14599 -10633 -7507 -8266 -5112 -12510 -17336 -15185 -9184 -6039 -2505 369
8292 369 1998 4446 8268 4788 -754 2236 -2760 -9418 -11991 -6883 -4589 -5175 -9433 -9568 -13982 -16875
8276 -16875 -15488 -7446 -6286 852 8813 6726 2789 4233 1652 7915 12507 12681 16391 9808 449
8261 449 4398 5229 366 6292 8208 6430 5091 -329 -4303 -8158 -7058 -3218 20 3327 5704
8246 5704 3244 2878 1212 187 -1199 -10935 -9500 -5000 -4127 -2126 1114 1105 140 637 -1637 1088 7535
8229 7535 11184 7722 2557 -1159 2251 3941 1499 3345 7383 12509 8581 8448 8879 4834 -2923
8214 -2923 2342 5956 1992 -3799 -5221 -6286 -4277 -2014 -7356 -5592 -7309 -8070 -6656 -9067 -4793
8199 -4793 -163 -2554 2163 7807 4355 4655 669 3052 3400 1464 477 -2439 6316 10915 4991 3242
$$ packed form
8308c301q2m54k933l906l923L966L126p59L154p398m826K151O001L145L534K874
8292C69J629K448L822l480n542K990m996o658k573N108K294n86m258j35m414k893
8276a6875J387Q042J160P138P961k087l937J444k581O263M592J74L710o583r359
8261D49L949Q31m863N926J916j778j339n420l974l855J100L840L238L307K377
8246E704k460l66j666j025j386r736J435M500Q73K001L240rr65M97k274K725O447
8229G535L649l462n165l716L410J690k442J846M038N126l928j33M31m045p757
8214b923N265L614l964n791j422j065K009K263n342J764j717p61J414k411M274
8199d793M630k391M717N644l452L00l986K383L48j936r87k916Q755M599n924j749
$$ plain form
8183 3242 -806 -5732 -4155 -2392 1707 1932 -5726 -4341 6026 11458 11232 5951 -101 -2084 2361
8168 2361 -2856 -2175 1737 -4488 -7939 -8143 -509 3515 -1908 -2734 -2036 127 -678 -3018 -5018 -6184
8152 -6184 -11680 -10102 -3235 5927 9316 9041 7530 8836 1587 -5434 -13037 -16997 -9499 -1905 -741
8137 -741 -920 5731 10366 11780 7410 12399 4915 -4038 -12827 -15264 -15658 -15416 -11161 -7232 -9401 -15327
8121 -15327 -12319 -5273 -4357 -6121 -3650 -2425 968 1730 -1868 4464 7119 3729 2517 -1973 -4694
8106 -4694 -4545 70 2977 5556 3984 5315 1270 -4011 -6280 -8994 -1656 -1923 139 -3701 -4710
8091 -4710 -6679 -1134 0 -1324 -1338 -2545 2003 1484 -1628 -7342 4021 12940 14875 11522 6784
8076 6784 3166 5985 6125 7924 8069 1595 1496 3960 4613 4854 6549 13090 17326 15015 11480 18142
$$ packed form
8183C242m048m926J577J763M099K25p658J385J0367N432k26n281o052j983M445
8168B361n217O81L912o225l451k04P634M024n423q26O98K163q05k340k000j166
8152f184n496J578O867R162L389k75j511J306p249p021p603l960P498P594J164
8137g41j79O651M635J414m370M989p484q953q789k437l94K42M255L929k169n926
8121a5327L008P046R16j764K471J225L393P62l598O332K655l390j212m490k721
8106d694J49M615K907K579j572J331m045n281k269k714P338k67K062l840j009
8091d710j969N545J134j324j4j207M548n19l112n714J1363Q919J935l353m738
8076F784l618K819J40J799J45o474r9K464O53K41J695O541M236k311l535O662
$$ plain form
8060 18142 13100 5412 -2926 -12951 -12420 -14130 -7605 -3880 -3773 -6152 -3829 2456 -654 -6331 -5132
8045 -5132 -5275 -7045 -4423 -1288 767 3825 11424 9503 9299 7030 5923 2201 -370 254 5607 5294
8029 5294 205 -744 -232 1465 -2418 -3668 -4330 -11807 -10921 -7135 335 6416 5815 3854 -7411 -10960
8013 -10960 -5991 -3920 -8153 -5461 -4791 -4261 -253 7116 6744 2381 6444 11706 8455 1960 -2143
7998 -2143 -2037 3953 101 -5248 -11854 -15563 -12844 -9941 -2824 -999 -8912 -13314 -8335 -9519 -10120
7983 -10120 -7208 1211 4943 3166 5354 4921 2491 -122 -6014 -5077 1087 10191 10672 10563 11756 11621
7967 11621 2961 -1879 -3615 -6166 -9583 -11442 -14842 -12226 -7848 -2331 -2768 -1071 -9045 -6217 -5776
7952 -5776 -970 1615 2124 1532 1811 2838 1871 3251 5287 3512 -287 -10479 -7015 -2937 -4583 -7058
$$ packed form
8060A8142n042p688q338j0025N31j710O525L725J07k379K323O285l110n677J199
8045e132j43j770K622L135K055L058P599j921k04k269j107l722k571O24N353l13
8029E294n089r49N12J697l883j250o62p477Q86L786P470O081o01j961j1265l549
8013a0960M969K071m233K692O70N30M008P369l72m363M063N262l251o495m103
7998b143J06N990l852n349o606l709K719K903P117J825p913m402M979j184o01
7983a0120K912Q419L732j777K188m33k430k613n892R37O164R104M81j09J193j35
7967A1621q660m840j736k551l417j859l400K616M378N517m37J697p974K828M41
7952e776M806K585N09n92K79J027r67J380K036j775l799j0192L464M078j646k475
$$ plain form
7936 -7058 -2389 7125 -305 -496 246 5286 2395 1672 -885 -9244 -6117 -4166 -172 2513 -2605 -6550
7920 -6550 -10289 -3949 -904 -5315 -487 5979 4814 -3237 -9616 -3987 -1569 -7584 -8067 -4869 -1029
7905 -1029 -1727 -6677 -8417 -783 4003 6163 3245 3320 -2428 125 -1376 -5434 -292 4037 293 -1819
7889 -1819 -4389 -4236 -5061 1851 4681 2708 337 4971 7565 -2841 -5908 -678 3764 2856 5143
7874 5143 11111 8212 4765 -1077 -1792 -5892 -3291 204 1408 -1208 -12405 -16420 -12567 -7902 -10509
7859 -10509 -13504 -5277 2677 5990 6480 3084 3568 3093 3467 469 2243 1479 698 -7941 -9995 -5193
7843 -5193 -2183 -1338 -4176 -4230 903 253 -4475 -9152 -3887 3295 2395 450 331 -1270 3334 8981
7827 8981 2526 -233 -3699 -2318 -435 -2600 -7553 -12682 -6748 -4198 -1741 -164 -5264 -8393 -7114
$$ packed form
7936g058M669R514p430j91P42N040k891p23k557q359L127J951L994K685n118l945
7920f550l739O340L045m411M828O466j165q051o379N629K418o015m83L198L840
7905a029o98m950j740P634M786K160k918P5n748K553j501m058N142M329l744k112
7889a819k570J53q25O912K830j973k371M634K594j0406l067N230M442r08K287
7874E143N968k899l447n842p15m100K601L495J204k616j1197m015L853M665k607
7859a0509k995Q227P954L313M90l396M84m75L74k998J774p64p81q639k054M802
7843e193L010Q45k838n4N133o50m728m677N265P182r00j945j19j601M604N647
7827H981o455k759l466J381J883k165m953n129N934K550K457J577n100l129J279
$$ plain form
7812 -7114 -9398 -10696 -10094 -7782 -3672 2723 -159 -1154 -3216 -108 -1844 -6338 -10434 -2243 3288
7797 3288 3119 7810 7239 -1338 5538 9050 11614 7973 -3061 -7903 -5837 -296 1971 5038 -746
7782 -746 -7331 -13712 -9367 -590 3873 4852 4951 8079 11762 11157 2141 -6660 -1672 -2350 -742 -8355
7766 -8355 -18258 -13016 -9196 -14682 -18415 -16123 -10595 -9232 -11144 -9361 -8923 -13318 -6810 -3393 -4172
7751 -4172 -2892 -9181 -6035 3529 399 -711 4373 2281 3697 7860 13540 22799 22554 7477 -1387
7736 -1387 -7699 -8421 -4154 4740 10544 6158 -1994 -7666 -6938 -2413 -5352 -8949 -11416 -9451 -5187
7721 -5187 -1815 1078 2970 5782 377 -2278 -2641 -6748 -8067 -5179 -6290 -918 -1897 -5833 -6519 -4613
7705 -4613 -1373 652 -4319 -8191 -10777 -6639 -4845 -8815 -4234 5367 5607 4982 5402 3983 5852 1209
$$ packed form
7812g114k284j298O02K312M110O395k882r95k062L108j736m494m096Q191N531
7797C288j69M691n71q577O876L512K564l641j1034m842K066N541K267L067n784
7782g46o585o381M345Q777M463R79R9L128L683o05r016q801M988o78J608p613
7766h355r903N242L820n486l733K292N528J363j912J783M38m395O508L417p79
7751d172J280o289L146R564l130j110N084k092J416M163N680R259k45j5077q864
7736a387o312p22M267Q894N804m386q152n672P28M525k939l597k467J965M264
7721e187L372K893J892K812n405k655l63m107j319K888j111N372r79l936o86J906
7705d613L240K025m971l872k586M138J794l970M581R601K40o25M20j419J869m643
$$ plain form
7689 1209 2052 417 -3949 -1064 -4317 -8377 -10424 -9075 -818 -1055 -1313 -166 -26 -1851 -6950 -8274
7673 -8274 -8852 -10621 -10168 -9221 -4511 2553 -1798 -8965 887 27 -1137 3422 23 -4847 -7777 -4131
7657 -4131 393 -5775 -11451 -11194 -6541 -2728 -10248 -12979 -4705 143 4734 14298 13467 7391 1096
7642 1096 -1957 -11849 -16115 -12259 -14214 -5051 -2126 -2279 -1976 -1775 -5151 -5545 -3084 2393 3745 -3982
7626 -3982 -12432 -10999 -7508 -8697 -4612 -1241 1175 6389 14281 17131 10394 4132 862 6748 11599
7611 11599 9527 4520 5457 2820 1200 -941 -5852 -7493 1161 1453 -2800 -1561 -1044 -3994 -4866 -11857
7595 -11857 -10986 -8169 -7053 -8305 -7535 -13382 -12832 -5749 -4431 -5209 -10039 -7731 -493 -2802 -3803 -4086
7579 -4086 -1661 2092 -1071 4496 12468 25872 22431 15996 14690 4557 -5137 -8126 -11987 -18368
$$ packed form
7689A209Q43j635m366K885l253m060k047J349Q257k37k58J147J40j825n099j324
7673h274n78j769M53R47M710P064m351p167R852q60j164M559l399m870k930L646
7657d131M524o168n676K57M653L813p520k731Q274M848M591R564q31o076o295
7642A096l053r892m266L856j955R163K925j53L03K01l376l94K461N477J352p727
7626c982q450J433L491j189M085L371K416N214P892K850o737o262l270N886M851
7611A1599k072n007R37k637j620k141m911j641Q654K92m253J239N17k950q72o991
7595a1857Q71K817J116j252P70n847N50P083J318p78m830K308P238k309j001k83
7579d086K425L753l163N567P972J3404l441o435j306j0133r694k989l861o381
$$ plain form
7565 -18368 -19640 -16511 -11796 -14874 -12252 -7788 -5675 -366 -216 -1142 1407 5079 4637 -3054 -10001
7550 -10001 -8639 -8000 -7120 -9972 -15374 -14322 -4230 1747 11682 19592 18442 11173 -3820 -12821 -18921
7535 -18921 -18775 -6945 -2925 1210 -4473 -10624 676 6117 -263 -3671 -6935 -4923 403 4562
7521 4562 6052 10580 13002 10040 7404 11911 15353 7252 5844 9570 5199 -7128 -11374 -13116 -7723
7506 -7723 -5717 -3901 -4548 -3293 -5294 -7553 -683 3197 1440 3155 237 5331 5153 3781 1588
7491 1588 -844 -4115 -5565 -9080 -14226 -21831 -24696 -22263 -15635 -10504 -13315 -14291 -10065 -4199 -495
7476 -495 -3411 -7661 -5434 -3712 -15866 -18876 -12428 -7316 -10724 -7191 -3734 2868 6927 1927 1068
7461 1068 6785 4025 4524 8804 11989 8037 1680 -2663 -4200 -9327 -9285 -8987 -8075 -7896 3269 6770
$$ packed form
7565a8368j272L129M715l078K622M464K113N309J50r26K549L672m42p691o947
7550a0001J362O39Q80k852n402J052J0092N977R935P910j150p269j4993r001o100
7535a8921J46J1830M020M135n683o151J1300N441o380l408l264K012N326M159
7521D562J490M528K422k962k636M507L442q101j408L726m371j2327m246j742N393
7506g723K006J816o47J255k001k259O870L880j757J715k918N094j78j372k193
7491A588k432l271j450l515n146p605k865K433O628N131k811r76M226N866L704
7476d95k916m250K227J722j2154l010O448N112l408L533L457O602M059n000q59
7461A068N717k760M99M280L185l952o357m343j537n127M2K98R12J79J1165L501
$$ plain form
7445 6770 6189 2171 -1286 5566 8928 6613 8014 3025 -3006 -3416 2922 7684 5714 2970 1748
7430 1748 -3810 -4671 2143 3429 9556 5377 2009 9217 7738 3808 352 7986 7729 312 -4257
7415 -4257 -1041 1281 -2185 -5113 -1949 -3859 -9777 -4816 -3322 -5318 -1985 -2566 -2080 -7024 -11136
7400 -11136 -8036 -6189 2109 9108 8985 2441 -7928 -7606 -8738 -11988 -7156 -2945 -12011 -13228 -4891
7385 -4891 -3893 -8563 -5282 -2060 -1446 2605 4091 -1523 -7468 -5859 -4409 -5190 -5697 -2217 -2513 -8971
7369 -8971 -10508 -9691 -11309 -8906 -3983 -893 -1402 -37 -2661 -5501 -9963 -10821 -1416 -3305 -8221 -3395
7353 -3395 4434 112 -5109 -4973 -10397 -12478 -13226 -9925 -5356 -13884 -13015 -5956 -276 -6730 -9745 -6414
7337 -6414 -6342 -4686 -3103 -2897 -8272 -8351 -9304 -14860 -16069 -14253 -4576 3545 3737 680 2833 8083 5438
$$ packed form
7445F770n81m018l457O852L362k315J401m989o031m10O338M762j970k744j222
7430A748n558q61O814J286O127m179l368P208j479l930l456P634k57p417m569
7415d257L216K322l466k928L164j910n918M961J494j996L333n81M86m944m112
7400a1136L100J847Q298O999j23o544j0369L22j132l250M832M211r066j217Q337
7385d891R98m670L281L222O14M051J486n614n945J609J450p81n07L480k96o458
7369h971j537Q17j618K403M923L090n09J365k624k840m462q58R405j889m916M826
7353c395P829m322n221J36n424k081p48L301M569q528Q69P059N680o454l015L331
7337f414P2J656J583K06n375p9r53n556j209J816R677Q121J92l057K153N250k645
$$ plain form
7320 5438 -378 -5251 -7235 -1299 -2716 -5709 -7891 -10906 -5505 1467 7497 4921 2171 4623 283
7305 283 3249 74 -2513 -4086 4101 10066 8814 3985 -3957 -4240 -2930 -491 -2679 -6714 -7995
7290 -7995 -9194 -10853 -12697 -9116 -11595 -14294 -14741 -17631 -22217 -19846 -19693 -12510 594 3753 -1541
7275 -1541 -1050 8378 8830 2227 -1905 2321 4692 -1318 -2431 -2926 -1279 -1386 -3359 -4599 -5661 -5666 -2774
7258 -2774 3218 1146 -3425 -7252 -10264 -10666 -9687 -11766 -4838 181 -534 -50 2264 6071 310 -12616
7242 -12616 -14779 -14952 -10040 -619 3639 -689 346 921 -3573 -10272 -9982 -7687 -13088 -15723 -10721
7227 -10721 -7862 -11162 -11723 -4923 -7651 -4140 -2916 -2150 1264 7853 8227 3533 -3955 -4377 -1933 -1843
7211 -1843 -4033 -10129 -9580 -11834 -8555 -4258 -4026 -3881 -2473 -5248 -5376 -10942 -7244 -9330 -10646 -7977
$$ packed form
7320E438n816m873j984N936j417k993k182l015N401O972O030k576k750K452m340
7305B83K966l175k587j573Q187N965j252m829p942k83J310K439k188m035j281
7290g995j199j659j844L581k479k699m47k890m586K371J53P183J3104L159n294
7275a541M91R428M52o603m132M226K371o010j113m95J647j07j973j240j062nK892
7258b774N992k072m571l827l012m02R79k079O928N019p15M84K314L807n761j2926
7242a2616k163j73M912R421M258m328J035N75m494o699K90K295n401k635N002
7227a0721K859l300n61O800k728L511J224P66L414O589L74m694p488m22K444R0
7211a843k190o096N49k254L279M297K32J45J408k775j28n566L698k086j316K669
$$ plain form
7195 -7977 -4591 -1302 2434 5511 1140 -2465 -5582 -2145 2050 -424 3245 2460 -1006 -837 5151
7180 5151 -1328 -2070 -2083 -2360 -417 -377 -2816 -3835 -2180 3744 278 -4232 -7514 -3647 -5318 -8243
7164 -8243 -5889 449 -2586 -12431 -14000 -14889 -13680 -8576 -4110 -9469 -8555 -5573 -5142 -13015 -13814 -10693
7148 -10693 -6534 -3763 -1460 616 -1158 1352 827 4221 -1452 -1008 4187 2096 -2909 -2962 -2849 982
7132 982 621 2039 9810 8328 2155 5819 6258 3678 730 3544 2567 6332 9742 5931 9404 10664
7116 10664 9048 8186 6065 1425 950 6718 4084 -728 -2009 -3599 -8765 -4728 4918 5889 5472 9372
7100 9372 7268 -316 -6831 -9857 -16061 -19679 -13500 -10372 -8045 -5114 -8298 -2133 -5338 -7280 -751
7085 -751 702 -2964 -4505 -10673 -3512 -3121 997 4098 3020 994 -6112 -12001 -8172 -8383 -6511 -5968
$$ packed form
7195g977L386L289L736L077m371l605l117L437M195k474L669p85l466J69N988
7180E151o479p42j3k77J943M0k439j019J655N924l466m510l282L867j671k925
7164h243K354O338l035r845j569q89J209N104M466n359R14K982M31p873p99L121
7148a0693M159K771K303K076j774K510n25L394n673M44N195k091n005n3J13L831
7132I82l61J418P771j482o173L664M39k580k948K814r77L765L410l811L473J260
7116A0664j616q62k121m640m75N768k634m812j281j590n166M037R646R71m17L900
7100I372k104p584o515l026o204l618O179L128K327K931l184O165l205j942O529
7085g51J453l666j541o168P161L91M118L101j078k026p106n889L829k11J872N43
$$ plain form
7069 -5968 -8859 -5236 -3649 -812 2060 2851 2275 4432 8399 5339 4249 4442 -2432 -2756 4044 7746
7053 7746 9614 10573 9933 12921 15259 6863 -315 -2795 -1146 1059 35 2002 3639 410 1734
7038 1734 3774 1014 -6301 -4685 -1965 -3213 3504 12282 13604 7601 -4414 -528 -73 -3887 -9094
7023 -9094 -3832 -2734 -654 -1666 3231 2037 64 -1219 -5372 -2601 -3902 -5002 -783 -4057 -6887
7008 -6887 -1352 809 3216 8201 6057 -5002 -4854 -1388 -237 -1012 -7445 -8061 -10174 -1392 12282
6993 12282 14198 10364 3217 2222 6696 10199 3828 220 -3748 -7048 -5997 -3598 667 1960 1763
6978 1763 691 -4869 191 5053 4705 2769 4 -3459 -3909 2845 -6229 -7888 -5268 -8226 -4913
6963 -4913 -3947 -1178 -1654 -746 -456 1174 5331 -372 -400 2550 2872 3673 1296 8937 17651 23232 20919
$$ packed form
7069e968k891L623J587K837K872P91n76K157L967l060j090J93o874l24O800L702
7053G746J868R59o40K988K338q396p178k480J649K205j024J967J637l229J324
7038A734K040k760p315J616K720j248O717Q778J322o003j2015L886M55l814n207
7023i094N262J098K080j012M897j194j973j283m153K771j301j100M219l274k830
7008f887N535K161K407M985k144j1059J48L466J151p75o433o16k113Q782J3674
6993A2282J916l834p147r95M474L503o371l608l968l300J051K399M265J293j97
6978A763j072n560N060M862l48j936k765l463m50O754r074j659K620k958L313
6963d913R66K769m76R08K90J630M157n703k8K950L22Q01k377P641Q714N581k313
$$ plain form
6946 20919 12665 9248 2824 -258 -1367 -10255 -11436 -8557 -6451 -7462 -3744 1764 -83 1360 3015
6931 3015 -5445 -8074 -6809 -8973 -9378 -2791 -4525 -5137 6291 10231 4187 -554 1126 55 -7181
6916 -7181 -5633 -1063 -7398 -4233 2430 6215 5909 7418 2591 4311 8214 2447 -2633 -1103 1982
6901 1982 6291 7921 9228 4727 1218 2233 -3471 -3030 -2662 -7115 -9071 -4816 -1074 4872 8977
6886 8977 6520 6910 8903 10993 2343 -4217 -7078 -7321 -1707 5405 6957 5887 8659 -1145 -8607
6871 -8607 -7785 -6154 -7897 -1228 10169 12083 9533 4902 2132 -693 -4534 -5296 -4071 1149 6746
6856 6746 4712 4154 2169 6853 7993 2866 424 6127 6727 5883 9141 9278 12512 8324 2640 10326
6840 10326 10494 14159 9449 1954 -320 -102 -1035 4274 5682 5367 6324 10211 2908 -3919 -547 -556 621
$$ packed form
6946B0919q254l417o424l082j109q888j181K879K106j011L718N508j847J443J655
6931C015q460k629J265k164m05O587j734o12J1428L940o044m741J680j071p236
6916g181J548M570o335L165O663L785l06J509m827J720L903n767n080J530L085
6901A982M309J630J307m501l509J015n704M41L68m453j956M255L742N946M105
6886H977k457L90J993K090q650o560k861k43N614P112J552j070K772r804p462
6871h607Q22J631j743O669J1397J914k550m631k770k825l841p62J225N220N597
6856F746k034n58j985M684J140n127k442N703O00q44L258J37L234m188n684P686
6840A0326J68L665m710p495k274K18r33N309J408l15R57L887p303o827L372rJ177
$$ plain form
6823 621 5230 3797 6174 7143 2219 -2816 -2796 1039 2029 -64 724 -5807 -8268 -3895 619 2705
6807 2705 1360 3489 3421 1835 -3283 -4241 -2817 -3815 247 1046 -6571 -4321 578 2335 -1434 -1387 -671
6790 -671 3764 3821 4601 95 -3836 -4792 -3053 -4819 -3001 -10186 -11495 -1051 4317 10290 6972 6458
6774 6458 7014 3963 7563 11956 6641 9281 11103 9764 4828 289 -2563 320 -678 -4792 -10970
6759 -10970 -17774 -12766 -2149 -3319 883 4950 1083 -3578 2402 1481 1378 1005 11436 21634 16537
6744 16537 9637 9270 8064 3918 1614 -3703 -4462 -2378 -360 -6426 -1595 8073 3427 -5677 -12944
6729 -12944 -9082 -1503 1759 1320 602 2280 6380 10343 9327 6911 4851 8691 16468 16644 7886
6714 7886 7686 12368 15479 11289 7235 5629 5329 -471 -3703 3086 9875 10178 12064 4612 275 1003
$$ packed form
6823F21M609j433K377R69m924n035K0L835R90k093P88o531k461M373M514K086
6807B705j345K129o8j586n118r58J424r98M062P99p617K250M899J757l769M7P16
6790f71M435N7P80m506l931r56J739j766J818p185j309J0444N368N973l318n14
6774F458N56l051L600M393n315K640J822j339m936m539k852K883r98m114o178
6759a0970o804N008J0617j170M202M067l867m661N980r21j03l73J0431J0198n097
6744A6537o900l67j206m146k304n317p59K084K018o066M831R668m646r104p267
6729a2944L862P579L262m39p18J678M100L963j016k416k060L840P777J76q758
6714G886k00M682L111m190m054j606l00n800l232O789O789L03J886p452m337P28
$$ plain form
6698 1003 11089 10915 11010 13778 12649 20071 35590 50146 60135 56465 33766 19572 19592 16467 14386
6683 14386 4963 6515 6580 11565 10087 7748 2035 1287 4751 7135 -2992 -8454 -7286 2333 2074
6668 2074 -1412 -421 2938 6774 6280 8544 -465 -82 4446 6497 6088 1445 -102 -7768 -4195 335
6652 335 4245 6057 9735 18305 23405 19921 11915 5317 3859 4186 1757 893 2167 1482 1955 1357
6636 1357 4141 11115 18035 19578 17913 13065 16680 19797 20752 22615 17819 14926 13314 7674 8545
6621 8545 8916 7491 6406 8105 10134 3485 4324 2620 6721 10127 12138 15556 16826 17124 19391 21398
6605 21398 16301 15678 21605 19300 22041 30156 45266 62753 101124 130167 108766 71560 52552
6592 52552 44131 50856 61152 73222 81665 91512 110326 138268 174673 229068 300605 390725 539921
$$ packed form
6698A003J0086j74R5K768j129P422J5519J4556R989l670k2699j4194K0l125k081
6683A4386r423J552O5M985j478k339n713p48L464K384j0127n462J168R619k59
6668B074l486R91L359L836m94K264r009L83M528K051m09m643j547p666L573M530
6652C35L910J812L678Q570N100l484q006o598j458L27k429q64J274o85M73n98
6636A357K784O974O920J543j665m848L615L117R55J863m796k893j612n640Q71
6621H545L71j425j085J699K029o649Q39j704M101L406K011L418J270K98K267K007
6605B1398n097o23N927k305K741Q115J5110J7487L8371K9043k1401l7206j9008
6592E2552q421O725J0296J2070Q443R847J8814K7942L6405N4395P1537R0120J49196
$$ plain form
6579 539921 826742 1365823 2316246 3720902 4421038 3063710 1605522 905742 584201
6570 584201 422708 333058 268557 207528 153788 115724 96709 88706 76485 62344 55380 47726
6558 47726 48087 52157 69056 108049 129019 94141 52738 30898 23737 16031 11704 7407 8451
6545 8451 14634 13231 4068 -1194 -5485 -2526 512 -3915 -5612 -3618 -606 7432 4028 -6517 -14901
6530 -14901 -11219 786 4182 4583 6381 5053 4472 -1616 -2289 970 5697 7867 516 -6255 -3278
6515 -3278 65 -6905 -7069 -4553 -2418 -1448 -4397 -6323 -1103 1916 -2828 -2324 -741 -5303 -8541 -9857
6499 -9857 -5173 -5255 -10402 -12277 -10542 -4615 3596 2427 -1941 -4904 -2805 -3163 -9262 -12032 -11812 -14721
6483 -14721 -13597 -8708 -8546 -10878 -6021 -3866 -6584 -2367 1511 3985 3416 13735 11383 1744 -161
$$ packed form
6579E39921K86821N39081R50423J404656P00136j357328j458188o99780l21541
6570E84201j61493q9650o4501o1029n3740l8064j9015q003j2221j4141o964p654
6558D7726L61M070J6899L8993K0970l4878m1403k1840p161p706m327m297J044
6545H451O183j403r163n262m291K959L038m427j697J994L012Q038l404j0545q384
6530a4901L682J2005L396M01J798j328n81o088o73L259M727K170p351o771K977
6515c278L343o970j64K516K135R70k949j926N220L019m744N04J583m562l238j316
6499i857M684q2n147j875J735N927Q211j169m368k963K099l58o099k770K20k909
6483a4721J124M889J62k332M857K155k718M217L878K474n69J0319k352r639j905
$$ plain form
6468 -161 -427 978 2391 -2462 -2862 -7293 -8627 -6180 -7710 -13389 -15274 -12708 -9013 -5957 -11099 -12373
6452 -12373 -11870 -9005 -3888 -6279 -13202 -19494 -12181 -6490 206 -1844 -9593 -12123 -1993 2342 7064
6437 7064 6687 584 -3317 -1434 -2012 -1734 -2886 -11792 -13761 -5103 -3973 -4078 -2436 -3387 -3804 -3076 -2665
6420 -2665 -10118 -9814 -7338 -5819 -4160 -983 -5977 -3906 -6402 -5354 -6476 -2015 1398 2036 2400 1449
6404 1449 -3983 -8893 -8970 -3239 -5388 -2784 -2470 1841 446 -2694 -2173 4092 -4492 -15771 -15405 -14860
6388 -14860 -10870 1133 346 -2701 -169 1105 3709 2198 -2410 2437 2876 -1164 -7198 -8422 -7340
6373 -7340 -4641 183 3732 2498 4191 5651 2562 -2646 -9341 -10850 -11824 -7481 150 3445 6260
6358 6260 4569 -1719 -1148 1456 1488 5958 5551 80 3397 6826 3636 -1766 -8627 -7667 -6131 -6550
$$ packed form
6468a61k66J405J413m853m00m431j334K447j530n679j885K566L695L056n142j274
6452a2373N03K865N117k391o923o292P313N691O696k050p749k530J0130M335M722
6437G064l77o103l901J883n78K78j152q906j969Q658J130j05J642r51m17P28M11
6420b665p453L04K476J519J659L177m994K071k496J048j122M461L413O38L64r51
6404A449n432m910p7N731k149K604L14M311j395l140N21O265q584j1279L66N45
6388a4860L990J2003p87l047K532J274K604j511m608M847M39m040o034j224J082
6373g340K699M824L549j234J693J460l089n208o695j509r74M343P631L295K815
6358F260j691o288N71K604L2M470m07n471L317L429l190n402o861R60J536m19
$$ plain form
6342 -6550 -10590 -8192 -6369 -6584 -2238 -1130 -588 -4985 -5518 2841 5303 2640 -1683 -2143 -4161 -2518
6326 -2518 -2465 -5896 -8929 -11380 -12176 -8318 -2645 -2902 -981 -6147 -5355 -2208 -2192 -4265 -3217 -2160 -2906
6309 -2906 -5184 -9170 -13731 -8699 -6275 -9116 -6550 1913 5445 9550 12643 8590 2147 -1944 -5621
6294 -5621 -5412 -7853 -5997 -2429 -3467 -7291 -5499 -14797 -14747 -11977 -1052 6238 5934 2612 548 -2116
6278 -2116 -5604 -3531 -2223 963 -3907 -3906 -2676 -1313 -3635 -2648 -4792 -13182 -11495 1389 6664 2548
6262 2548 -6924 -3715 1029 591 3 3088 -2242 -3458 -4605 -8506 -1701 6170 3709 1013 67 1638
6246 1638 1251 -3767 1974 4131 4436 3842 -2789 -166 4402 4311 2647 -355 -5553 -6836 2681 9546
6230 9546 9251 6869 7704 5088 466 -2849 -5025 -4434 4139 3375 -8289 -12935 -10667 -14914 -15227 -8993
$$ packed form
6342f550m040K398J823k15M346J108N42m397n33Q359K462k663m323m60k018J643
6326b518N3l431l033k451p96L858N673k57J921n166P92L147J6k073J048J057p46
6309b906k278l986m561N032K424k841K566Q463L532M105L093m053o443m091l677
6294e621K09k441J856L568j038l824J792r298N0K770J0925P290l04l322k064k664
6278b116l488K073J308L186m870JJ230J363k322R87k144q390J687J2884N275m116
6262B548r472L209M744m38n88L085n330j216j147l901O805P871k461k696r46J571
6246A638l87n018N741K157L05n94o631K623M568r1j664l002n198j283R517O865
6230I546k95k382Q35k616m622l315k176N91Q573p64j1664m646K268m247l13O234
$$ plain form
6214 -8993 -6533 -1986 -2815 100 2681 3936 -3081 -3305 1252 8793 1506 -1134 8904 18039 22762
6199 22762 20631 15568 15150 10832 0 -3657 -8573 -4183 3611 8674 6220 -1359 -3376 -2577 -735
6184 -735 1655 3682 4265 4440 3906 12715 11676 1719 -306 -911 4325 1830 -5853 -10988 -18822 -17871
6168 -17871 -18616 -13501 -8587 -10640 -8434 -5053 -207 7229 7461 5167 8704 7491 5528 6700 5187
6153 5187 368 -381 2850 618 -2733 -1802 44 1760 9397 7228 238 680 -1540 -2572 -452 47
6137 47 -9054 -9873 -9158 -3693 4173 9038 7390 -1596 -8402 -9909 -6206 -9059 -11246 -9332 -7145 -7273
6121 -7273 -12055 -5921 1334 29 -2104 -3902 3645 4918 7644 11002 20851 12289 6316 8415 3539
6106 3539 -4273 -9070 -6973 -3555 -3352 1886 2457 4365 4267 3051 2413 5459 3115 158 -1550 -5128
$$ packed form
6214h993K460M547q29K915K581J255p017k24M557P541p287k640J0038R135M723
6199B2762k131n063m18m318j0832l657m916M390P794N063k454p579k017P99J842
6184g35K390K027N83J75n34Q809j039r957k025o05N236k495p683n135p834R51
6168a7871p45N115M914k053K206L381M846P436K32k294L537j213j963J172j513
6153E187m819p49L231k232l351R31J846J716P637k169o990M42k220j032K120M99
6137D7r101q19P15N465P866M865j648q986o806j507L703k853k187J914K187j28
6121g273m782O134P255j305k133j798P547J273K726L358R849q562n973K099m876
6106C539p812m797K097L418K03N238N71J908r8j216o38L046k344k957j708l578
$$ plain form
6090 -5128 -345 2078 1164 1228 1570 -1531 -6954 -4642 -219 7254 7515 1755 -760 -3576 -3264 4537
6074 4537 10074 11333 5695 38 -3271 -2662 3739 258 -1855 -1543 30 -6867 -13100 -17798 -19397
6059 -19397 -13733 -9719 -8042 -6707 -5273 -6722 -177 10281 7380 3684 5624 7844 2826 186
6045 186 4557 5531 7511 4905 7044 12456 2229 -4213 -8823 -16435 -16720 -7047 44 -1376 -5783
6030 -5783 -14232 -15779 -12342 -12255 -8783 -3962 -1000 -6988 -10512 -886 5059 2965 -1515 -3380 1117
6015 1117 1600 662 -2308 -4172 -4636 3557 6514 6630 663 310 5776 -851 -5084 -8072 -10180 -7605
5999 -7605 -4325 1929 10046 8328 9066 9963 6386 1176 4909 8691 14114 13742 12119 8356 3968 4856
5983 4856 6474 2986 6792 2504 -2120 -2720 5520 6880 7678 3080 27 -3229 -999 -2449 -2594 -2246
$$ packed form
6090e128M783K423r14O4L42l101n423K312M423P473K61n760k515k816L12P801
6074D537N537J259n638n657l309O09O401l481k113L12J573o897o233m698j599
6059a9397N664M014J677J335J434j449O545J0458k901l696J940K220n018k640
6045A86M371R74J980k606K139N412j0227o442m610p612k85R673P091j420m407
6030e783q449j547L437Q7L472M821K962n988l524R626N945k094m480j865M497
6015A117M83r38k970j864m64Q193K957J16n967l53N466o627m233k988k108K575
5999g605L280O254Q117j718P38Q97l577n210L733L782N423l72j623l763m388Q88
5983D856J618l488L806m288m624o00Q240J360P98m598l053l256K230j450j45L48
$$ plain form
5967 -2246 -3401 -3851 -2187 -2785 -4705 -9688 -6468 -2500 -1343 -2681 2204 -1042 -1460 4985 8948 5506
5951 5506 -174 -938 404 -8571 -9519 -6238 -3914 -861 -5841 -10490 -8105 -5546 -7709 698 5906
5936 5906 2265 257 -2898 -5670 -3100 -56 -2581 -5783 -4622 9807 15239 9034 7062 7908 6632
5921 6632 4287 3823 2120 3770 1800 -4001 -3877 -8065 -6610 -7006 -4429 -1069 -1868 -2901 -939 4062
5905 4062 9710 11384 7265 3944 5917 7897 1526 2455 2911 2692 -4286 -8908 -6367 -6077 -14998 -14222
5889 -14222 -11855 -13791 -16400 -15001 -10728 -9520 -12364 -14173 -6836 3348 6360 663 -8409 -8626 -5911
5874 -5911 -4091 -5677 462 2789 -974 -2341 -3976 -3551 -5941 -7734 -10989 -8252 -8308 -9277 -10225 -18661
5858 -18661 -20765 -15405 -10225 1362 9701 165 -2925 -2620 -6830 1903 4282 -1321 -9873 -13919 -7486
$$ packed form
5967b246j155m50J664n98j920m983L220L968J157j338M885l246m18O445L963l442
5951E506n680p64J342q975r48L281K324L053m980m649K385K559k163Q407N208
5936E906l641k008l155k772K570L044k525l202J161J4429N432o205j972Q46j276
5921F632k345m64j703J650j970n801J24m188J455l96K577L360p99j033J962N001
5905D062N648J674m119l321J973J980o371R29M56k19o978m622K541K90q921P76
5889a4222K367j936k609J399M273J208k844j809P337J0184L012n697r072k17K715
5874e911J820j586O139K327l763j367j635M25k390j793l255K737n6r69r48q436
5858a8661k104N360N180J1587Q339r536l090L05m210Q733K379n603q552m046O433
$$ plain form
5843 -7486 -2789 1554 358 -1106 -4083 -3180 2327 3102 3167 682 -1178 4093 3931 4975 8282 -1341
5827 -1341 -3013 6459 6631 5783 9112 11326 6714 8852 15602 10279 -2435 -7517 2676 5899 3384
5812 3384 -149 -5525 -9227 -11059 -7347 -5859 -4622 766 6676 2386 -1866 3050 -192 -1817 -3248
5797 -3248 -2266 -2222 -5251 119 -1298 -2699 -9041 -5505 -6709 -5913 -3519 -1256 855 2371 6478 6777
5781 6777 6111 3890 -2328 -718 -3756 -4103 -1798 73 -502 -2819 -5890 -8267 -6648 -5343 2270 3946
5765 3946 -958 -4150 -7819 -11684 -7928 -9152 -9539 -6143 510 -6337 -11953 -7061 -899 -1793 -8592
5750 -8592 -6576 -3767 -1935 -4942 -2731 -542 -1171 -2641 -4644 -3364 -709 3775 -2264 -8639 -10516
5735 -10516 -14109 -16607 -11034 -7755 -4674 4658 669 -4796 -1783 -5230 -2512 -1753 -2242 -614 709
$$ packed form
5843g486M697M343j196j464k977R03N507P75O5k485j860N271j62J044L307r623
5827a341j672R472J72q48L329K214m612K138O750n323j2714n082J0193L223k515
5812C384l533n376l702j832L712J488J237N388N910m290m252M916l242j625j431
5797c248R82M4l029N370j417j401o342L536j204P96K394K263K111J516M107K99
5781F777o66k221o218J610l038l47K305J871n75k317l071k377J619J305P613J676
5765C946m904l192l669l865L756j224l87L396O653o847n616M892O162q94o799
5750h592K016K809J832l007K211K189o29j470k003J280K655M484o039o375j877
5735a0516l593k498N573L279L081R332l989n465L013l447K718P59m89J628J323
$$ [...]
##END NTUPLES=NMR SPECTRUM
##END=
