##TITLE=Analysis number 325811
Compound Code gk 00720
Project Code adrs
Chemist Name aci
##JCAMPDX= 6.0         $$ Bruker NMR JCAMP-DX V2.0
##DATA TYPE= NMR SPECTRUM
##DATA CLASS= NTUPLES
##ORIGIN= Bruker BioSpin GmbH
##OWNER= nmr
$$ XWIN-NMR		Version 3.5
$$ Mon Jan 15 14:19:57 2007 GMT Standard Time (UT+0h)  MAYBRIDGE\nmr@NMR_250MHZ
##.OBSERVE FREQUENCY= 250.131544655141
##.OBSERVE NUCLEUS= ^1H
##.ACQUISITION MODE= SIMULTANEOUS (DQD)
##.ACQUISITION SCHEME= undefined
##.AVERAGES= 16
##.DIGITISER RES= 18
##SPECTROMETER/DATA SYSTEM= dpx250
##.PULSE SEQUENCE= zg30
##.SOLVENT NAME= CDCl3
##.SHIFT REFERENCE= (INTERNAL, CDCl3, 0, 16.522)
##AUDIT TRAIL= $$ (NUMBER, WHEN, WHO, WHERE, WHAT)
$$ ##TITLE= Audit trail, XWIN-NMR		Version 3.5
$$ ##JCAMPDX= 5.01
$$ ##ORIGIN= Bruker BioSpin GmbH
$$ ##OWNER= nmr
$$ C:\u/data/dgb/nmr/ADRS/1050/pdata/1/auditp.txt
$$ ##AUDIT TRAIL=  $$ (NUMBER, WHEN, WHO, WHERE, WHAT)
(   1,<2007-01-15 14:19:32.90 +000>,<MAYBRIDGE\nmr>,<NMR_250MHZ>,
      <created by zg, POWCHK disabled, PULCHK disabled
       configuration hash MD5:
       49 4B E0 1D 92 C2 6B 37 9F E6 65 BC 52 41 86 1D
       data hash MD5: 64K
       11 DF 27 64 0C 54 C7 AB 22 85 26 74 FD A9 39 CD>)
(   2,<2007-01-15 14:19:48.37 +000>,<MAYBRIDGE\nmr>,<NMR_250MHZ>,
      <Start of raw data processing
       ef LB = 0.3 FT_mod = 6 PKNL = 1 SI = 32K 
       data hash MD5: 32K
       F0 20 CF 35 93 82 8F E0 C5 70 5E 1C 68 69 19 3C>)
(   3,<2007-01-15 14:19:49.98 +000>,<MAYBRIDGE\nmr>,<NMR_250MHZ>,
      <apk 
       data hash MD5: 32K
       38 75 BE 0C 4D 6C 91 58 1D FB 4B 86 B3 75 0F 9F>)
(   4,<2007-01-15 14:19:50.72 +000>,<MAYBRIDGE\nmr>,<NMR_250MHZ>,
      <abs ABSG = 5 
       data hash MD5: 32K
       24 F2 F5 0D 8A DC 40 D0 47 7D FB 8E 50 8C E0 E7>)
$$ ##END=
$$ 
$$ hash MD5
$$ 74 1D AC 60 09 33 A1 4D C2 D3 FD 30 E4 49 CB B7
##$RELAX= 
##$RELAX= 
##$RELAX= 
##$RELAX= 
##$RELAX= 
##$RELAX= 
##$RELAX= 
$$ Bruker specific parameters
$$ --------------------------
##$DU= <C:\u>
##$EXPNO= 1050
##$NAME= <ADRS>
##$PROCNO= 1
##$TYPE= <nmr>
##$USER= <dgb>
##$AMP= (0..31)
100 100 100 100 100 100 100 100 100 100 100 100 100 100 100 100 100 100 
100 100 100 100 100 100 100 100 100 100 100 100 100 100 
##$AQSEQ= 0
##$AQ_mod= 3
##$AUNM= <au_zg>
##$AUTOPOS= <32 >
##$BF1= 250.13
##$BF2= 250.13
##$BF3= 250.13
##$BF4= 250.13
##$BF5= 500.13
##$BF6= 500.13
##$BF7= 500.13
##$BF8= 500.13
##$BYTORDA= 1
##$CFDGTYP= 0
##$CFRGTYP= 5
##$CHEMSTR= <none>
##$CNST= (0..31)
1 1 145 1 1 1 1 1 1 1 1 1 1 1 1 1 1 1 1 1 1 1 1 1 1 1 1 1 1 1 1 1 
##$CPDPRG= <>
##$CPDPRG1= <>
##$CPDPRG2= <>
##$CPDPRG3= <>
##$CPDPRG4= <mlev>
##$CPDPRG5= <mlev>
##$CPDPRG6= <mlev>
##$CPDPRG7= <mlev>
##$CPDPRG8= <mlev>
##$CPDPRGB= <>
##$CPDPRGT= <>
##$D= (0..31)
0 1 0 0 0 0 0 0 0 0.06 0 0 0 0 0 0 0.0002 0 0 0 0 0 0 0 0 0 0 0 0 0 0 
0 
##$DATE= 1168870771
##$DBL= (0..7)
120 120 120 120 120 120 120 120 
##$DBP= (0..7)
150 150 150 150 150 150 150 150 
##$DBP07= 0
##$DBPNAM0= <>
##$DBPNAM1= <>
##$DBPNAM2= <>
##$DBPNAM3= <>
$$ [...]
##$SUBNAM7= <"">
##$SUBNAM8= <"">
##$SUBNAM9= <"">
##$SW= 20.6930455092707
##$SWIBOX= (0..15)
0 0 3 0 0 0 0 0 0 0 0 0 0 0 0 0 
##$SW_h= 5175.983436853
##$TD= 65536
##$TD0= 1
##$TE= 294.16
##$TE2= 300
##$TE3= 300
##$TEG= 300
##$TL= (0..7)
0 120 120 120 120 120 120 120 
##$TP= (0..7)
150 150 150 150 150 150 150 150 
##$TP07= 0
##$TPNAME0= <>
##$TPNAME1= <>
##$TPNAME2= <>
##$TPNAME3= <>
##$TPNAME4= <>
##$TPNAME5= <>
##$TPNAME6= <>
##$TPNAME7= <>
##$TPOAL= (0..7)
0.5 0.5 0.5 0.5 0.5 0.5 0.5 0.5 
##$TPOFFS= (0..7)
0 0 0 0 0 0 0 0 
##$TUNHIN= 0
##$TUNHOUT= 0
##$TUNXOUT= 0
##$USERA1= <user>
##$USERA2= <user>
##$USERA3= <user>
##$USERA4= <user>
##$USERA5= <user>
##$V9= 5
##$VALIST= <valist>
##$VCLIST= <CCCCCCCCCCCCCCC>
##$VD= 0
##$VDLIST= <DDDDDDDDDDDDDDD>
##$VPLIST= <PPPPPPPPPPPPPPP>
##$VTLIST= <TTTTTTTTTTTTTTT>
##$WBST= 1024
##$WBSW= 4
##$XGAIN= (0..3)
0 0 0 0 
##$XL= 0
##$YL= 0
##$YMAX_a= 637830
##$YMIN_a= -644259
##$ZGOPTNS= <>
##$ZL1= 120
##$ZL2= 120
##$ZL3= 120
##$ZL4= 120
##$ABSF1= 16.522
##$ABSF2= -4.171173
##$ABSG= 5
##$ABSL= 3
##$ALPHA= 0
##$AQORDER= 0
##$ASSFAC= 0
##$ASSFACI= 0
##$ASSFACX= 0
##$ASSWID= 0
##$AUNMP= <proc_1d>
##$AZFE= 0.1
##$AZFW= 0.1
##$BCFW= 0
##$BC_mod= 0
##$BYTORDP= 0
##$COROFFS= 0
##$CY= 12.5
##$DATMOD= 1
##$DC= 0
##$DFILT= <>
##$DTYPP= 0
##$F1P= 14.0000005364418
##$F2P= -0.99999901652339
##$FCOR= 0.5
##$FTSIZE= 32768
##$FT_mod= 6
##$GAMMA= 0
##$GB= 0
##$INTBC= 1
##$INTSCL= 1
##$ISEN= 128
##$LB= 0.3
##$LEV0= 0
##$LPBIN= 0
##$MAXI= 10000
##$MC2= 0
##$MEAN= 0
##$ME_mod= 0
##$MI= 0
##$NCOEF= 0
##$NC_proc= -4
##$NLEV= 6
##$NOISF1= 0
##$NOISF2= 0
##$NSP= 0
##$NTH_PI= 0
##$NZP= 0
##$OFFSET= 16.522
##$PC= 1
##$PHC0= 228.339
##$PHC1= 5.969346
##$PH_mod= 1
##$PKNL= yes
##$PPARMOD= 0
##$PSCAL= 4
##$PSIGN= 0
##$REVERSE= no
##$SF= 250.13
##$SI= 32768
##$SIGF1= 0
##$SIGF2= 0
##$SINO= 400
##$SIOLD= 32768
##$SREGLST= <1H.CDCl3>
##$SSB= 0
##$STSI= 32768
##$STSR= 0
##$SW_p= 5175.98343685301
##$SYMM= 0
##$S_DEV= 0
##$TDeff= 65536
##$TDoff= 0
##$TI= <Analysis number 999999
Compound Code 99
Book Reference 9
Project Code 9>
##$TILT= no
##$TM1= 0
##$TM2= 0
##$TOPLEV= 0
##$USERP1= <user>
##$USERP2= <user>
##$USERP3= <user>
##$USERP4= <user>
##$USERP5= <user>
##$WDW= 1
##$XDIM= 32768
##$YMAX_p= 411216673
##$YMIN_p= -111150
$$ End of Bruker specific parameters
$$ ---------------------------------
##NTUPLES= NMR SPECTRUM
##VAR_NAME=  FREQUENCY,     SPECTRUM/REAL,   SPECTRUM/IMAG
##SYMBOL=    X,             R,               I
##VAR_TYPE=  INDEPENDENT,   DEPENDENT,       DEPENDENT
##VAR_FORM=  AFFN,          ASDF,            ASDF
##VAR_DIM=   32768,         32768,           32768
##UNITS=     HZ,            ARBITRARY UNITS, ARBITRARY UNITS
##FACTOR=    0.157963299565203, 1,           1
##FIRST=     4132.6476996994, 0,             0
##LAST=      -1043.33573715361, 0,           0
##MIN=       -1043.33573715361, -111150,     0
##MAX=       4132.6476996994, 411216673,     0
$$ Real data points
##PAGE= N=1
##DATA TABLE= (X++(R..R)), XYDATA
$$ [...]
14151e189K105J0056L1130J3944K2318J73r170J909j7603J6870Q265j5550j8144
$$ -5189 -3084 6972 38102 52046 74364 74537 65367 67276 49673 66543 74808 59258 41114
14138D1114R782K0649J1707M328l0324k0089k0102k7245m715J3317K6143j3820
$$ 41114 50896 71545 83252 87580 57256 37167 17065 -10180 -14895 -1578 24565 10745
14126A0745j5370M730L0611R371O060R662j4782j1157m972j2229o452o996j492
$$ 10745 -4625 105 30716 40087 46147 55809 41027 29870 24898 12669 6217 -779 -2271
14113b271n224J3361J3725k1423K923J4484O465r331j9386O302R772K190r681
$$ -2271 -7495 5866 19591 -1832 1091 15575 22040 12709 -6677 -375 9397 11587 1906
14100A906J4249N347J4270M877R111K4209O692m628k7556l57j3214j7273K52L868
$$ 1906 16155 21502 35772 40649 49760 73969 80661 76033 48477 48120 34906 17633 17885 21753
14086B1753q79M566J7693l4057k059K7509K5525k6024j4223L2996J2204k103P362
$$ 21753 20874 25440 43133 9076 7017 34526 60051 34027 19804 52800 65004 62901 70263
14073G0263Q396R476N001q850k3974k8444j3826P950K840O58L1910J1659Q606
$$ 70263 78659 88135 93136 84286 60312 31868 18042 25992 28832 29490 61400 73059 81665
14060H1665k2205k3452k882Q372K2031l707J8281l534k6806l095K0906j5702j408
$$ 81665 59460 36008 33126 41498 63529 59822 78103 74569 47763 44668 65574 49872 48464
14047D8464j839r459l6800j7849K2768J4177j4211J8242K7504J4326K854o256
$$ 48464 46625 37166 366 -17483 5285 19462 5251 23493 50997 65323 68177 61921
14035F1921j0767K2695K762k6189k3307J039L8766J2016K779J3738J7299j0835
$$ 61921 51154 73849 76611 50422 27115 28154 66920 78936 81715 95453 112752 101917
14023A01917m274K2775K5797P1939M0417M9252N4114P96l4954p8414m4461k8962
$$ 101917 97643 120418 146215 218154 258571 307823 361937 362733 327779 249365 204904 175942
14011A75942l9271l5028j7519J8964k027N37o388O152m424R316Q183j3902j4440
$$ 175942 136671 101643 84124 103088 101061 101598 95210 101362 96938 106254 114437 100535 86095
13998H6095J2183j0946n232L0575K3982j8437j9399l5112k660J4517K2096J3174
$$ 86095 98278 87332 82100 112675 136657 118220 98821 63709 61049 75566 97662 110836
13986A10836j52o125M198J6555N6156q536K050K7538J1532M8905Q4549J02677
$$ 110836 110684 104559 108757 125312 181468 172932 174982 202520 214052 262957 347506 450183
13974D50183J49637J79861J39750L0205o4612j47889j88758j26114q1768k1503
$$ 450183 599820 779681 919431 949636 885024 737135 548377 422263 340495 318992
13964C18992k2751l6422j8749n9077m4883j3236K3616O169k7365R20J4979j1992
$$ 318992 296241 259819 241070 181993 137110 123874 147490 153659 126294 127214 142193 130201
13952A30201k8898j2665J7696K7793K0854j9858l9132Q540K113m678j3675J2320
$$ 130201 101303 88638 106334 134127 154981 135123 95991 104531 106644 101966 88291 100611
13940A00611L8298j2484q084p365K9233J5380M5993R930K9390O8342J35576J64799
$$ 100611 138909 126425 118341 110976 140209 155589 201582 211512 240902 309244 444820 609619
13928F09619K11250J74708O2568l4137j32596j71693r5822k4990L8366N7015P0491
$$ 609619 820869 995577 1058145 1024008 891412 719719 623897 598907 637273 694288 764779
13917G64779O269p4989j17236j04033o3073n7593m7132l2500j1968l8276j5036
$$ 764779 771048 696059 578823 474790 411717 354124 306992 274492 262524 224248 209212
13906B09212n7763n701j7146L102K5966O501n923k0128M287J4766J2867J2577
$$ 209212 151449 145748 128602 131704 157670 164171 158248 138120 142407 157173 170040 182617
13894A82617J6702o329l8751o980N3205M2197J3265J6823M6106N6636M1048M4938
$$ 182617 199319 192990 154239 147259 200464 242661 255926 272749 318855 375491 416539 461477
13882D61477P2558N3775L3218J8776J6188O0199J29535K06249L12302L17636K61585
$$ 461477 534035 587810 621028 639804 655992 716191 845726 1051975 1364277 1681913 1943498
13871A943498j2880k31158l28285l35186k14816j31677j25858j01310n6413p2120
$$ 1943498 1930618 1699460 1371175 1035989 821173 689496 563638 462328 405915 333795
13861C33795o3262j9756J7577K2655P801l5775j8610j5713k0898J1283J5080P176
$$ 333795 270533 250777 268354 291009 298810 263035 244425 228712 207814 219097 234177 241353
13849B41353L5825M1981P7009P7969L0634j7764o7290n9542j7613r39p108J6160
$$ 241353 277178 319159 396168 474137 504771 487007 419717 360175 342562 341623 334515 350675
13837C50675M0672k023K1197L3150N9477J11469J70722K73090L18950L14392K60679
$$ 350675 391347 389324 410521 443671 503148 614617 785339 1058429 1377379 1691771 1952450
13826A952450M7405j85963l35038l38460k46308j99208j27641p1090o1206l5344
$$ 1952450 1999855 1813892 1478854 1140394 894086 694878 567237 496147 434941 399597
13816C99597m0087l7633k8446J7645K4912M1638J9770l6372j073K0778K1454L8778
$$ 399597 359510 321877 293431 311076 335988 377626 397396 361024 359951 380729 402183 440961
13804D40961O9067J64990J86412J79542J09655q1947j88373k01668j39840r6503
$$ 440961 510028 675018 861430 1040972 1150627 1068680 880307 678639 538799 442296
13794D42296n8407j7297k2228K1698J5430P394J2016K7304K6459R4190J00704
$$ 442296 383889 366592 344364 366062 381492 388886 400902 428206 454665 548855 649559
13783F49559Q4983O4792L1448m4474j03348j31177j06160o7379l1279l0405r696
$$ 649559 734542 799334 830782 786308 682960 551783 445623 378244 346965 316560 306864
13772C06864m977o607l2057q94J8716J3091J593Q6J8973M4572P1774O2405O4495
$$ 306864 301887 295280 263223 262329 281045 294136 295729 295815 314788 359360 431134 493539 558034
13759E58034P0067R8128J66978K14017J25905m0836j76290k20826j95378j34138
$$ 558034 628101 726229 893207 1107224 1233129 1192293 1016003 795177 599799 465661
13749D65661o8054m8600m9232M680J3120l0698p250J4672J7849j1337J2322K2671
$$ 465661 397607 349007 299775 304455 317575 286877 279627 294299 312148 300811 313133 335804
13737C35804j3391l3583k3186J665O441q951j0081Q258K225J1012o843l3545J0931
$$ 335804 322413 288830 265644 267309 273750 264799 254718 262976 265201 276213 269370 235825 246756
13724B46756J4063L129P956k1282J6688K8018K1928L8196M9953J5273K4754L8266
$$ 246756 260819 263948 271904 250622 267310 295328 317256 355452 405405 420678 445432 483698
13712D83698O8065Q4892M0401j7558m6121p3227p5466n3579k1784j4725k2588
$$ 483698 551763 636655 677056 659498 613377 540150 464684 411105 389321 374596 352008
13701C52008k1104J358K0048Q339j5312r185j9285r149J098K1405l0861k8204
$$ 352008 330904 332262 352310 360649 345337 336152 316867 307718 308816 330221 299360 271156
13689B71156P414K1529j5315J4711J3621K6371J628P391Q298J2973J2274j4209
$$ 271156 278570 300099 284784 299495 313116 339487 341115 348506 356804 369777 382051 367842
13677C67842j7764L022J5862O5688L7180K6060J2781J1197j4118J4933L246l4652
$$ 367842 350078 353100 368962 434650 471830 497890 510671 521868 507750 522683 525929 491277
13665D91277p248K0715K6437J6457q899j5937L0680J0446l4812j8220J8118K5042
$$ 491277 484029 504744 531181 547638 538739 522802 553482 563928 529116 510896 529014 554056
13653E54056r959j9178k0486n0600j1948M647k6058J1321J5167K6585K0106R934
$$ 554056 544097 524919 504433 453833 441885 446532 420474 431795 446962 473547 493653 503587
13641E03587M4623L0168J8196K5709Q4569M8323J8987j2720n339L0889L017J1203
$$ 503587 548210 578378 596574 622283 706852 755175 774162 761442 756103 786992 790009 801212
13629H01212N1942N7841N9286R517j7657l4072k3971k6846k3088J979L4018J4721
$$ 801212 853154 910995 970281 979798 962141 928069 904098 877252 854164 856143 890161 904882
13617I04882j3145k7312K3497K4824p285l0359m050J5696L2757J8499n678k1121
$$ 904882 891737 864425 887922 912746 905461 875102 871052 886748 919505 938004 932326 911205
13605I11205k5377k4625k016m411M9040M1231J7755K3571M8184P0265Q4611R2796
$$ 911205 885828 861203 859187 854776 903816 945047 962802 986373 1034557 1104822 1189433 1282229
13593A282229R9544J16929R1870J8893k975o544l2709k8122J2062P3539J23967
$$ 1282229 1381773 1498702 1590572 1609465 1606490 1599946 1567237 1539115 1551177 1624716 1748683
13582A748683R0112R6024L7318R495j936K9474N6308J06081J48303J40246J18286
$$ 1748683 1838795 1934819 1972137 1981632 1979696 2009170 2065478 2171559 2319862 2460108 2578394
13571B578394J43448J92842J97790J98195K16278L02645L85033N13990P33372
$$ 2578394 2721842 2914684 3112474 3310669 3526947 3829592 4214625 4728615 5461987
13562E461987R58434J264599J788599K747973M355930O843716R874096J1286818
$$ 5461987 6420421 7685020 9473619 12221592 16577522 23421238 33295334 44582152
13554D4582152Q293343J469178n899892r755469r657892p496199n090842l302104
$$ 44582152 52875495 54344673 48444781 38689312 29031420 21535221 16444379 13142275
13546A3142275k168778j528466j151350q50336o38716n10632m16978k65274j85704
$$ 13142275 10973497 9445031 8293681 7443345 6804629 6293997 5877019 5611745 5426041
13537E426041j60571j47689r8978k5787K3236L6764J18831J51124J88765K38677
$$ 5426041 5265470 5117781 5018803 4993016 5016252 5053016 5171847 5322971 5511736 5750413
13527E750413L63076M62429N72474O47202O53798O54102Q00274J078164J421944
$$ 5750413 6113489 6575918 7148392 7795594 8449392 9103494 9903768 10981932 12403876
13518A2403876J955611K649118L613214N084879P562447J1806083J8762962K8515898
$$ 12403876 14359487 17008605 20621819 25706698 33269145 45075228 63838190 92354088
13510I2354088L5816860L0157383J0499274j4410365l0423894l2292148k5776556
$$ 92354088 128170948 158328331 168827605 154417240 123993346 91701198 65924642
13503F5924642j7538021j1246722p303769m980307l688820k861090k233302j671720
$$ 65924642 48386621 37139899 29836130 24855823 21167003 18305913 16072611 14400891
13495A4400891j277245j001587p84095o46135n42220m81832m08050l03390k36348
$$ 14400891 13123646 12122059 11337964 10691829 10149609 9667777 9259727 8956337 8719989
13486H719989j48192j3073M9261J86479L03656M32793O08251P15588P35296P74560
$$ 8719989 8571797 8558724 8607985 8794464 9098120 9530913 10139164 10854752 11590048 12364608
13476A2364608R02629J169069J555537K088936K813494L823334N254050P569543
$$ 12364608 13267237 14436306 15991843 18080779 20894273 24717607 29971657 37541200
13468C7541200J1529819J8164205K7855767L6789738L4442781J7026508p597224
$$ 37541200 49071019 67235224 95090991 131880729 166323510 183350018 175752794
13461A75752794k5647811k8199028j9614099p390397J872745M749558K513759
$$ 175752794 150104983 121905955 102291856 94901459 96774204 101523762 104037521
13454A04037521k16904o67051k856280r356493j4923585j5932776j3221287r490737
$$ 104037521 103820617 103153566 100297286 90940793 76017208 60084432 46863145 37372408
13446C7372408o443439m435242l149477k477375k067939j667919j342147j078574
$$ 37372408 30928969 26493727 23344250 20866875 18798936 17131017 15788870 14710296
13438A4710296q24789n42532l05076p0587J17820K30405L30447M18916N95139
$$ 14710296 13885507 13342975 13037899 12967312 13085132 13315537 13645984 14064900 14660039
13429A4660039Q79031J236790J661104K100552K676447L571884N087403P580376
$$ 14660039 15539070 16775860 18436964 20537516 23213963 26785847 31873250 39453626
13421C9453626J1284579J5064787J5541565J1196956M791895J128001M110751
$$ 39453626 50738205 65802992 81344557 92541513 97333408 98461409 102572160
13414A02572160J3900201K7995666L9606429L8722107K5076661R933776N676935
$$ 102572160 116472361 144468027 184074456 222796563 247873224 257807000 263483935
13407B63483935L527892j5823626l9569585m8440519m2571825l0604489k0100986
$$ 263483935 267011827 251188201 211618616 163178097 120606272 90001783 69900797
13400F9900797j3147818q999051o465462m909364l901492l231306k666090k054292
$$ 69900797 56752979 47753928 41288466 36379102 32477610 29246304 26580214 24525922
13392B4525922j428684q50288k79816K54172Q70859J709603K994590N127669Q451089
$$ 24525922 23097238 22246950 21967134 22221306 23092165 24801768 27796358 32924027 41375116
13383D1375116J2487449J3775650P782526k446045r219792j0246633p511506l833176
$$ 41375116 53862565 67638215 75420741 72974696 63754904 53508271 45996765 42163589
13375D2163589o29260J678060L293376N159565Q183283J3215827K1236459L2570239
$$ 42163589 41534329 43212389 46505765 51665330 59848613 73064440 94300899 126871138
13367A26871138M3068705M3011775K9803099J2973794N986083O126857q767267
$$ 126871138 169939843 212951618 242754717 255728511 261714594 267841451 259074184
13360B59074184l4590092m8215253m5483287l4077007k2748136j4788380r857144
$$ 259074184 224484092 176268839 130785552 96708545 73960409 59172029 49314885
13353D9314885o732485m709426l479072k754907k188117j484773o12261K80860
$$ 49314885 42582400 37872974 34393902 31638995 29450878 27966105 27353844 27634704
13345B7634704J123873K041284L196208N056257Q183360J3487787K2324137L4790447
$$ 27634704 28758577 30799861 33996069 39052326 47235686 60723473 83047610 117838057
13337A17838057M3746011L1304491k959706l0782208l8767267l2230714k1655019
$$ 117838057 161584068 192888559 189928853 159146645 120379378 88148664 66493645
13330F6493645j3220925p777998m369648k077767j79853J842162M634195Q566183
$$ 66493645 53272720 45494722 41125074 39047307 38867454 40709616 45343811 53909994
13322E3909994J2438913J3271608R835731M680515J879208J561337k232533j0009019
$$ 53909994 66348907 79620515 89456246 94136761 96015969 97577306 95344773 85335754
13314H5335754j5277013j5504185j2421398q721593n828136l850402k496277j595051
$$ 85335754 70058741 54554556 42133158 33411565 27583429 23733027 21236750 19641699
13306A9641699r86513n96992k71602J15032O40646J195867J757451K422834L444235
$$ 19641699 18655186 18058194 17786592 17901624 18542270 19738137 21495588 23918422 27362657
13297B7362657N027648P777332J2513306K0505236L2408360M3414881L6883984
$$ 27362657 32390305 40167637 52680943 73186179 105594539 149009420 185893404
13290A85893404M672417k7457897m0028103l5753627k5236170j6166927j0259420
$$ 185893404 190565821 163107924 123079821 87326194 62090024 45923097 35663677
13283C5663677o683851m529395l361718k750155k380450k050131j689008j273986
$$ 35663677 28979826 24450431 21088713 18338558 15958108 13907977 12218969 10944983
13275A0944983r30217o39669m58892m33957m82044m48414m12712l88013l34342
$$ 10944983 10014766 9375097 8916205 8482248 8000204 7551790 7139078 6751065 6416723
13266F416723l02774k27542j45001p3912M2580R4559J10895J58423K59107M06994
$$ 6416723 6113949 5886407 5741406 5667494 5710074 5804633 5915528 6073951 6333058 6740052
13256F740052N39497O47691Q15243J119887J655274K521554L924122O383760J0089166
$$ 6740052 7279549 7927240 8742483 9862370 11517644 14039198 17963320 24347080 34436246
13247C4436246J3686922J2399903L366402p152153j2414380j2035077q994692
$$ 34436246 48123168 60523071 63889473 56737320 44322940 32287863 23293171
13240B3293171n999250l856398k490451j669721j262555j043768q85810p36347
$$ 23293171 17293921 13437523 10947072 9277351 8014796 6971028 6085218 5348871
13232E348871o03022m56050l68792k51224j70832j22521j56916k29033k44325
$$ 5348871 4745849 4289799 3921007 3669783 3498951 3376430 3219514 2990481 2746156
13223B746156k14526j40653j34958j25344r9062o7959k1241n3750o3960n7856
$$ 2746156 2531630 2390977 2256019 2130675 2031613 1963654 1942413 1888663 1824703 1766847
13213A766847l3102m1019m5932j00446j07493o9845k3612J588J361m9877l4153
$$ 1766847 1733745 1692726 1646794 1546348 1438855 1369010 1345398 1346986 1348347 1298470 1264317
13202A264317L7856M4056L8196K4833k8974m6714l0039l7968p5132p7579o6708
$$ 1264317 1302173 1346229 1384425 1409258 1380284 1333570 1303531 1265563 1190431 1112852 1046144
13191A046144k2372l5087k4061M348M7925J9573K0880J5294M8775L8252K9059
$$ 1046144 1023772 988685 964624 968972 1016897 1036470 1057350 1072644 1121419 1159671 1188730
13180A188730l9984q6997p8105o7063j5559L0857L4848K1951k9224j3479k9855
$$ 1188730 1148746 1061749 983644 916581 901022 931879 966727 988678 959454 945975 916120
13169I16120j01061l6475J6236P121j5787m5819l2954J491K4606N674j411J0228
$$ 916120 815059 778584 794820 801941 786154 740335 707381 708872 733478 739152 737741 747969
13157G47969J7320M0204M5418K0682K7282k3183l7352o7573p1668m7163k8641
$$ 747969 765289 805493 850911 871593 898875 875692 838340 770767 699099 651936 623295
13146F23295j8323k210L1134K0614l87o61p774j6823M8238M6569L5601r336J2971
$$ 623295 604972 602762 633896 654510 654123 653462 645688 628865 677103 723672 759273 749937 762908
13133G62908m190k2624P2154J31484J80044K02243K04793K43423K64298J11700
$$ 762908 758718 736094 808248 939732 1119776 1322019 1526812 1770235 2034533 2146233
13123B146233j78488l29060l43128l11100j91185r9682o0635l3468l1015l3592
$$ 2146233 1967745 1638685 1295557 984457 793272 693590 632955 599487 568472 534880
13113E34880J111j4107O180p614r26J0137O727l7442l9941P073p38N26P380j4154
$$ 534880 535991 521884 528064 520450 519524 529661 536388 498946 459005 466078 465340 465866 473246 459092
13099D59092j0167j1265k106M617j1543j757M3208M0628M478K1042J76m4336p083
$$ 459092 448925 437660 435554 440171 428628 426871 470079 510707 515185 536227 536403 492067 484984
13086D84984N6952J03475J61057J38097J23024R71r5306j53494j46640j21922
$$ 484984 541936 645411 806468 944565 1067589 1068560 973254 819760 673120 551198
13076E51198j10528o9567l2329N276K6547M187l0375k4514l9304J6301J7943O050
$$ 551198 440670 371103 338774 344050 370597 374784 344409 319895 280591 296892 314835 320885
13064C20885l5533l2386k68O265j6205J8850m941N229k3412p492L1691K4884K1205
$$ 320885 285352 252966 252698 258963 242758 261608 256667 261896 238484 230992 262683 287567 308772
13051C08772O676J4736j4398j1056K9931L0850J5485L3532K11M2885P6254J34442
$$ 308772 315448 330184 315786 304730 334661 365511 380996 414528 414739 457624 533878 668320
13039F68320J81674K15290J37042K7575r5192j84274k02487j38097p7973l8208
$$ 668320 849994 1065284 1202326 1229901 1134709 950435 747948 609851 531878 493670
13029D93670j4136r102J9658P9678J33546K55608L74435L03917L0347k21139l40772
$$ 493670 479534 470432 490090 569768 703314 958922 1333357 1637274 1667621 1446482 1105710
13018A105710k79832k09806j64291q6853l9597j5146k6225j1569k1580P37N936
$$ 1105710 825878 616072 451781 364928 325331 310185 283960 272391 250811 251548 257484
13007B57484K5317J7593j3208j9177J1365J6048J801k3654O252N3369K4172J00165
$$ 257484 282801 300394 287186 268009 279374 295422 297223 273569 279821 333190 357362 457527
12995D57527J06589J30784J74861J84625N8877p4611j51235j55833r5495L091
$$ 457527 564116 694900 869761 1054386 1113263 1038652 887417 731584 636089 639180
12985F39180J2207J1432k2215m4901k7265j103J1591R208m0148q3811o5066r557
$$ 639180 651387 662819 640604 595703 568438 567335 578926 588134 547986 464175 399109 389552
12973C89552m3179o2902l2926K556k3481l5859J388J9695j0046k1819k2872j349
$$ 389552 346373 283471 250545 253101 229620 193761 195149 214844 204798 182979 160107 158758
12961A58758J588J3000k2613r907n279j6912L1806K6468K4397K5992M1343O2021
$$ 158758 160346 173346 150733 140826 135547 118635 150441 176909 201306 227298 268641 330662
12949C30662M7938O8380O4886O4654O7206J3737N5410J16435J87502J53952R9962
$$ 330662 378600 446980 511866 576520 643726 657463 712873 829308 1016810 1170762 1270724
12938A270724J2536n6801n1723J8388Q1438M8762j43922k32401k11740j44362
$$ 1270724 1283260 1226459 1174736 1193124 1274562 1323324 1179402 947001 735261 590899
12928E90899j20749r0052m2360n5036m5383k0744J4730J2804m4081r503j6407
$$ 590899 470150 380098 337738 282702 237319 216575 231305 244109 200028 190525 174118
12917A74118n304J6878J9733J9362K6617L0905L9336L0268N7951L3992j0685k0093
$$ 174118 168814 185692 205425 224787 251404 282309 321645 351913 409864 443856 433171 413078
12905D13078o029l4107l6208o779M1287M4842O0855R6820J42955J95862J64064
$$ 413078 407049 372942 336734 329955 371242 416084 476939 573759 716714 912576 1076640
12894A076640Q6818q437n4076l5305K5034J28271P1258q1951j95969k17323j93335
$$ 1076640 1163458 1155021 1100945 1065640 1090674 1218945 1290203 1208252 1012283 794960 601625
12883F01625r8946n7487n9905m9976m5696j396j4376k7695k8229k2362j9886J9803
$$ 601625 502679 445192 385287 335311 289615 288219 273843 246148 217919 195557 175671 195474
12871A95474L9965K8844K4235L9875P6788Q8203J17708K27171J89372R826j46271
$$ 195474 235439 264283 288518 328393 405181 493384 611092 838263 1027635 1037461 891190
12860H91190j69051j43572j17045p3245l4498k755n904K8906O5767P0107L8479
$$ 891190 722139 578567 461522 388277 353779 351024 345120 374026 439793 509900 548379
12849E48379K1428J80p1057m5436l1733K9014L8403J147l2679q8569n2997m2809
$$ 548379 569807 569987 498930 453494 421761 450775 489178 490325 457646 369077 316080 273271
12837B73271l3487k2692l0706l6493k3607L3810K3648k8451j9604K7785L2628
$$ 273271 239784 217092 186386 149893 126286 160096 183744 155293 135689 163474 196102
12826A96102M302K4659M0886K7871M3826J02874J77118J95619J92599P5820j18356
$$ 196102 200404 225063 265949 293820 337646 440520 617638 813257 1005856 1081676 963320
12815I63320j91627j83104j39651q6329l0137j5738q108m30j4203j2116j5637
$$ 963320 771693 588589 448938 362609 332472 316734 308626 308196 293993 281877 266240
12804B66240m5418n7481l3358N842j7647j1493j6820l950N4m009j4409k6351l550
$$ 266240 220822 163341 129983 135825 118178 106685 89865 85915 85969 81960 67551 41200 37650
12791C7650M1023J2729M8999J3832m865j6042q359J9509J1828k640l2249j5528
$$ 37650 78673 91402 140401 154233 149368 133326 124967 144476 156304 153664 121415 105887
12779A05887j7908K7620L9696j2513K1668R4209O8312L1493M001n5166l8779N741
$$ 105887 87979 115599 155295 142782 164450 258659 326971 358464 362465 307299 268520 274261
12767B74261j3467l6726j4953J1696l4567l0741k4941n691Q765r035n0828J754
$$ 274261 260794 224068 209115 220811 186244 155503 130562 124871 133636 124601 73773 75527
12755G5527J4381j3968J009K849j1836J8674J3084J3509l2952J2121L3465J9498
$$ 75527 89908 75940 76949 79798 67962 86636 99720 113229 80277 92398 125863 145361
12743A45361K0829m516k7616j1575j4379j4210l925K4078j0717j6989P825K7150
$$ 145361 166190 161674 134058 122483 108104 93894 89969 114047 103330 86341 94166 121316
12731A21316k2656k3881J3695R241p961J0531l2r058k7828q475J786O229J9720
$$ 121316 98660 74779 88474 97715 89754 100285 100253 91195 63367 54892 56678 62907 82627
12718H2627K1037j3322q618p216P796J9600p903J1942J2741N901q822Q433j6883
$$ 82627 103664 90342 81724 74508 82304 101904 94001 105943 118684 124585 115763 124196 107313
12705A07313m0009j1791J8714j629n163R908L754O958j8837k365K0719J6193J462
$$ 107313 67304 55513 74227 72598 67435 77343 81097 88055 69218 66853 87572 103765 105227
12692A05227k4705j6470P150K4411R347J905J2615n393R26j2353R8O860L674k8361
$$ 105227 80522 64052 71202 95613 104960 106865 119480 114087 115013 102660 102758 109618 113292 84931
12678H4931k328J9164p843j0774o783l893R349K0888K4472M2841L0185R194k0767
$$ 84931 82603 101767 93924 83150 76367 72474 81823 102711 127183 170024 200209 209403 188636
12665A88636l5042l0958j4837k1052p721p188J7360K8332M962n943r803k4371
$$ 188636 153594 122636 107799 86747 79026 71838 89198 117530 122492 116549 106746 82375
12653H2375j8933L4346P2273J0663J299O8026J10670J42377N6263n3300q9793
$$ 82375 63442 97788 170061 180724 182023 250049 360719 503096 559359 506059 416266
12642D16266q6168j8452k3228j2021q544l2512j3871k8827l5218J106J172j8j9528
$$ 416266 330098 311646 288418 276397 267853 235341 221470 192643 157425 158531 159703 159685 140157
12629A40157k0778J6995j283m3296k4804N384J926n668j021j4067k4797J8495
$$ 140157 119379 136374 135091 91795 66991 72375 74301 68633 67612 53545 28748 47243
12617D7243K1565j981j790J1460q386k0481k4095P709L1412j0454P963l289r7
$$ 47243 68808 66827 65037 76497 68111 47630 23535 31244 62656 52202 60165 56876 56779
12604E6779L0183n04J1320j8359j2028Q900n357K850j5495q073P380J2731L6947
$$ 56779 86962 86458 97778 79419 67391 76291 70934 73784 58289 50216 57596 70327 107274
12591A07274Q639Nj9081p445J7705L498k5843l246J5644L8241M6171N8809R1760
$$ 107274 115913 115918 96837 89392 107097 110595 84752 81506 97150 135391 181562 240371 332131
12578C32131J48230J66087K3234r9672j50772j44329q6452l1764J8077K8995m2556
$$ 332131 480361 646448 669682 570010 419238 274909 188457 156693 174770 203765 161209
12567A61209m8954j3352M840J3984J5357R7R16K9130m3511j4718j8864j2716J908
$$ 161209 112255 98903 103743 117727 133084 133181 134097 163227 119716 104998 86134 73418 75326
12554G5326J144p929l186o401J301J1228k7595j3577k588K1283R072j1352l5395
$$ 75326 76470 68541 65355 58954 60255 71483 43888 30311 27723 49006 58078 46726 11331
12541A1331k1302K6910L5244K1503L0079O061j0245J7854k7833k5931M684J1099
$$ 11331 -9971 16939 52183 73686 103765 109826 99581 117435 89602 63671 68355 79454
12529G9454l1079m516Q654L8846K7340K5101k2630k3046O616j4475k139K5874
$$ 79454 48375 43859 52513 91359 118699 143800 121170 98124 104740 90265 88126 114000
12517A14000Q925J3777j8778k4976j8549l8488o453k0120k950O543J1427K1773
$$ 114000 122925 136702 117924 92948 74399 35911 29458 9338 6388 12931 24358 46131
12505D6131L0061L2361j4255j8576l3151R611J4413K4461K7775K4650J4449L5733
$$ 46131 76192 108553 94298 75722 42571 52182 66595 91056 118831 143481 157930 193663
12493A93663m525m2548j3143J5250l549n366j078J7950M6853N8832N2361J7841
$$ 193663 189138 146590 133447 148697 145148 139782 138704 156654 203507 262339 314700 332541
12481C32541J9989l045k1138n1029j9556J677j6439O425J5332P834J5954j46l688
$$ 332541 352530 349485 328347 277318 257762 259439 243000 249425 264757 272591 288545 288399 284711
12468B84711q507m6073m4393k3192j6010k2922j6266M348j164O99k5J4300k863
$$ 284711 276204 230131 185738 162546 146536 123614 107348 111696 110532 111231 111206 125506 122643
12455A22643J260L6741J2382K684M1836M9048K5050j9350M2k0128j3966K099K2249
$$ 122643 123903 160644 173026 175710 217546 266594 291644 272294 272336 252208 238242 240341 262590
12442B62590K0408P3216R9771R5981Q0804P9111L8974M595k096r329o3204o0717
$$ 262590 282998 356214 455985 551966 632770 711881 750855 755450 753354 744025 680821 620104
12430F20104M40N6165O9041N0170K1457k7107n6789j01399r2147o9587j00704
$$ 620104 620544 676709 745750 795920 817377 790270 733481 632082 539935 470348 369644
12419C69644r3942m9744k272J4233j2556o60P111n42j9590l0668j1147J5449L2551
$$ 369644 275702 225958 223686 237919 225363 224703 231814 231272 211682 181014 169867 185316 217867
12406B17867K9875j4112r77J0802J4968P949J0725K1485K2434J1567N0294J03276
$$ 217867 247742 233630 232653 243455 258423 266372 277097 298582 321016 332583 382877 486153
12394D86153J08830P3860J08703P0893N27k7723n2417l3013k182P525M6338M4158
$$ 486153 594983 668843 777546 848439 848966 821243 768826 735813 733631 741156 787494 831652
12382H31652J6863j6142k8663q8244q8703p7131p6158r1484o3196n3181k6630
$$ 831652 848515 832373 803710 715466 626763 549632 473474 381990 318794 265613 238983
12371B38983K9675n995j9151k0973K4352j4890j8898j8622m280K0790j1467j5765
$$ 238983 268658 262663 243512 222539 246891 232001 213103 194481 190201 210991 199524 183759
12359A83759m253l8962m2238P663J8637K1387M1058K2920J0669K6808M2035J3464
$$ 183759 179506 140544 98306 105969 124606 145993 187051 209971 220640 247448 289483 302947
12347C02947J9025R302J0005o076n811m892J2174J0803j924J883l1474k78k9158
$$ 302947 321972 331274 341279 335203 329392 324500 336674 347477 345553 347436 315962 315684 286526
12334B86526l5594j1316o476j8166k3791j9591k2147o955k0353Q473M639k338
$$ 286526 250932 239616 233140 214974 191183 171592 149445 142490 122137 130610 135249 132911
12322A32911j6653J2070K3250M6q167j0939j6059M182k5342j916R053k1032j2636
$$ 132911 116258 128328 151578 151624 143457 132518 116459 120641 95299 93383 102436 81404 68768
12309F8768J2860j446j4708J992k5958J010L3216R497j4693j1941k68k6756N76
$$ 68768 81628 80182 65474 67466 41508 42518 75734 85231 70538 58597 58329 31573 32149
12296C2149J6514n047j5332K769l406L572j3039J5102L0827L380j8674q862R245
$$ 32149 48663 43616 28284 31053 27647 31219 18180 33282 64109 67489 48815 39953 49198
12283D9198J3314j319J4655J7135J0328j0210j4481q873j8700o542J2408K6054
$$ 49198 62512 61193 75848 92983 103311 93101 78620 69747 51047 44505 56913 82967
12271H2967o376j3824k807m314J417k0600Q626L4984m84j5576r721J6741K911
$$ 82967 76591 62767 59960 55646 57063 36463 45089 80073 79589 64013 54292 71033 73944
12258G3944l611j1303j004J3555R847l511j7189j9068K696j3153o839K2911j3322
$$ 73944 70333 59030 58026 71581 81428 77917 60728 41660 44356 31203 24364 47275 33953
12245C3953n207K9021J4707K886j9883j6886K1131K8369p48j8924j3446J2504
$$ 33953 28746 57767 72474 75360 55477 38591 59722 88091 87343 68419 54973 67477
12233F7477j0167m3648o785K6588l665j560J9977J0882l0469j4602J6306J6097
$$ 67477 57310 13662 6877 33465 29800 28240 48217 59099 28630 14028 30334 46431
12221D6431r826r498Q645K2780j5022L153n933k209O725k2642R721R795r668K613
$$ 46431 36605 27107 35752 58532 43510 46663 40730 38521 45246 22604 32325 42120 32452 35065
12207C5065K3780L7013l1238l9192M268J4774j6256R029Q5J5063N236R480M1325
$$ 35065 58845 95858 64620 25428 29696 44470 28214 37243 37328 52391 57627 67107 108432
12194A08432L4127N9931J13970R3534l6137o5292q0316r1797m6054l3694P797
$$ 108432 142559 202490 316460 409994 373857 308565 228249 136452 90398 56704 64501
12183F4501n04l7177l586j2306J0260K1522J808r391j2666l796n685j0643m32
$$ 64501 63997 26820 23234 10928 21188 42710 44518 35127 22461 18665 12980 2337 1905
12170A905J3087M690q589M677K8499J1575l0367l429M165J6602R91l3123m1952
$$ 1905 14992 19682 11093 15770 44269 55844 25477 22048 26213 42815 43806 10683 -31269
12157c1269J8357K2047l0409J7394J1702M0334J830R159j4707q090J1204Q367
$$ -31269 -12912 9135 -21274 -3880 7822 48156 49986 59145 44438 36348 47552 55919
12145E5919q597r803l0189l378J1346L3063P726l1182j7113q812J88P971P882
$$ 55919 47322 37519 7330 3952 15298 48361 56087 24905 7792 -1020 -832 7139 15021
12132A5021K0592p233k4099j0384Q587J1652Q320j4987m716O148K3145m062n657
$$ 15021 35613 28380 4281 -6103 2484 14136 22456 7469 2753 8901 32046 27984 22327
12119B2327j8074p519J2386n789k4067K607K5453J4159n920K4091P785L133r971
$$ 22327 4253 -3266 9120 3331 -20736 -18129 7324 21483 15563 39654 47439 50572 40601
12106D0601k3237k6728K2894J0203o706M304N792k4738j0546J1266j506J4427
$$ 40601 17364 -9364 13530 23733 17027 21331 27123 2385 -8161 3105 1599 16026
12094A6026M27k4416j9182L031J8156n051J8362K3483P515M267J1484j3675k6243
$$ 16026 16453 -7963 -27145 -24114 -5958 -11009 7353 30836 38351 42618 54102 40427 14184
12081A4184l2003O202L174J8982j895j0061j865J229R766l683j8987n817N6610
$$ 14184 -17819 -11617 -8443 10539 8644 -1417 -3282 -2053 7713 4030 -14957 -20774 35836
12068C5836L9973j461R31j5819l0789j4470j2404m911o70O809J0544j0535j2828
$$ 35836 75809 74348 75279 59460 28671 14201 1797 -3114 -3784 3025 13569 3034 -9794
12055i794r439n832j8947k0411j927N9120O329j1544J1649R813k223j2506m429
$$ -9794 -19233 -25065 -44012 -64423 -66350 -7230 -901 -12445 -796 9017 6794 -5712 -10141
12042a0141j021K7411J8007k2252o792j3592j1657K2688N330m1756J1574K8828
$$ -10141 -11162 16249 34256 12004 5212 -8380 -20037 2651 7981 -33775 -22201 6627
12030F627J5246j4437l3823R493J3101p566l251L60M8351J0206k187o287j8302
$$ 6627 21873 7436 -26387 -16894 -3793 -11359 -14610 -14250 34101 44307 42120 35833 17531
12017A7531K276J7096K1427J2474Q68j7503J349l2340m8391J2261K9488J8644
$$ 17531 19807 36903 58330 70804 71672 54169 55518 23178 -25213 -12952 16536 35180
12005C5180m210j919J0222j9073m0646j5714K2311L7344l226o0795J4288J1794
$$ 35180 30970 29051 39273 20200 -20446 -36160 -13849 23495 20269 -40526 -26238 -14444
11993a4444l0425P707J6360k0035j0822J5066K8295K7159J7031R78k758l2777
$$ -14444 -44869 -37162 -20802 -40837 -51659 -36593 -8298 18861 35892 36870 34112 1335
11981A335j9954j3878j047q001J9991K5574L210p84j1134m839J1935J3923j4890
$$ 1335 -18619 -32497 -33544 -41545 -21554 4020 7230 6446 -4688 -9527 2408 16331 1441
11968A441j5525M244k4884j2890J0406L5669M6077P106l2804m6818P321l207j1031
$$ 1441 -14084 -9840 -34724 -47614 -37208 -1539 44538 51644 18840 -27978 -20657 -23864 -34895
11955c4895k2859J0308K6459K2535k348j2846j7697L82M3876m946J1227j3669
$$ -34895 -57754 -47446 -20987 1548 -800 -13646 -31343 -30961 12915 7969 19196 5527
11943E527k3957k3036l0456N384J3195J3431J7564J934j84K2709L015r703O033
$$ 5527 -18430 -41466 -71922 -66538 -53343 -39912 -22348 -20414 -20598 2111 5126 -4577 1456
11930A456j0166J369J3300q695M376m237L386l16k208J4874q452j2438j004j5259
$$ 1456 -8710 -7341 5959 -2736 1640 -2597 789 473 -1735 13139 4687 -7751 -8755 -24014
11916b4014k1665J2853K8171R586K2200J3186K2201r55l4531l0283j1541j0846
$$ -24014 -45679 -32826 -4655 4931 27131 40317 62518 61563 27032 -3251 -14792 -25638
11904b5638K696L4379J373K7184r198j9288m394O504k4030J6014k897j1733M301
$$ -25638 -22942 11437 12810 39994 30796 11508 7114 13618 -10412 5602 2705 -9028 -4727
11891d727M5j6009J1636n802j9474Q056Q589j3560k6022J9058K5042r783L2490
$$ -4727 -4682 -20691 -9055 -14857 -34331 -26275 -17686 -31246 -57268 -38210 -13168 -22951 9539
11878I539K2798j6322j7067J9128J2063k2952r381r988p230M205l634j3976P612
$$ 9539 32337 16015 -1052 18076 30139 7187 -2194 -12182 -19412 -15207 -18841 -32817 -25205
11865b5205J4715J6776K0577Q971j2657j7079j3538J2134K8496j6019j2699Q115
$$ -25205 -10490 6286 26863 35834 23177 6098 -7440 4694 33190 17171 4472 12587
11853A2587K4019P648P670J1294l5732r663r032m0150j416o840Q386q32O161L3417
$$ 12587 36606 44254 51924 63218 27486 17823 8791 -31359 -32775 -39615 -31229 -32061 -25900 7517
11839G517J4903J361k1831j2010L870J9487P291j0157j5852l934q284J6834J3839
$$ 7517 22420 23781 1950 -10060 -6190 13297 20588 10431 -5421 -9355 -17639 -805 13034
11826A3034o76j7883J487j9620l398j1397o171j375n063L599J5843J7407J290
$$ 13034 12358 -5525 -4038 -23658 -27056 -38453 -44624 -45999 -51062 -47463 -31620 -14213 -12923
11813a2923J0158K7054j7344k462j7678k060J4084J2962J051k324k5516L967k4389
$$ -12923 -2765 24289 6945 4483 -13195 -15255 -1171 11791 12842 10518 -14998 -11031 -35420
11800c5420j8405K1864P901Q45K9381j551j1266K168k865k0919J1929M1695k668
$$ -35420 -53825 -31961 -24060 -23215 6166 4615 -6651 -4483 -7348 -28267 -16338 25357 22689
11787B2689k5693j1058J1056K9070k2932l5075q234R759Q904O306j704P709k3113
$$ 22689 -3004 -14062 -3006 26064 3132 -31943 -40177 -30418 -21514 -15208 -16912 -9203 -32316
11774c2316l332n789j4678k995K0338K2998L901j302n813k881Q005L835N149J4761
$$ -32316 -35648 -41437 -56115 -59110 -38772 -15774 -11873 -13175 -18988 -21869 -13864 -10029 -4880 9881
11760I881J151j7974q543q447K8832K4548j1551N970L817k739o078l1471k1956
$$ 9881 11032 -6942 -15485 -23932 4900 29448 17897 23867 27684 24945 18867 -12604 -34560
11747c4560L102Q082K1229R958L946j3913m2923p258P192Q188K4740K1175K3732
$$ -34560 -31458 -23376 -2147 7811 11757 -2156 -45079 -52337 -45145 -36957 -12217 8958 32690
11734C2690m606j1547j3397L149P161j5263k1963j8230J6797L7757P09k0615P315
$$ 32690 28084 16537 3140 6289 13450 -1813 -23776 -42006 -25209 12548 13257 -7358 -43
11721d3R090N008N472K3859P863j2224j5958J457j4328l1450j8480k4515J7967
$$ -43 9047 14055 19527 43386 51249 39025 23067 24524 10196 -21254 -39734 -64249 -46282
11708d6282K4904L170j9560P950J1794K1502R132Q919k899k7282o249P666J4422
$$ -46282 -21378 -18208 -37768 -29818 -18024 3478 12610 21529 18630 -8652 -14901 -7235 7187
11695G187j6757K15k294j0331J6694Q249r134L52j17J5063M182j2681j572O757
$$ 7187 -9570 -9355 -11649 -21980 -5286 2963 -6171 -5819 -5936 9127 13309 628 -944 5813
11681E813l799M908l277q129J8477j5835j3963M830J9142M486q438j334n1433
$$ 5813 2014 6922 3645 -4484 13993 -1842 -15805 -10975 8167 12653 4215 2881 -48552
11668d8552L411N0051N1551K2966q538L35Q243J6805J4290J4290J7271j4859j1221
$$ -48552 -45141 4910 56461 79427 70889 71224 79467 96272 110562 124852 142123 127264 116043
11655A16043j6550m4355n3066j3715K491L5552M088j6274N2o981n689m0148l4842
$$ 116043 99493 55138 2072 -11643 -9152 26400 30488 14214 14266 7285 1596 -38552 -73394
11642g3394J7992J6013J7492R743j0930k1974J7092J8988l5728q354K0940J7703
$$ -73394 -55402 -39389 -21897 -12154 -23084 -45058 -27966 -8978 -44706 -53060 -32120 -14417
11630a4417K1936Q160n645Q523k2677l2819R788M882J5624o349P055J3597L024
$$ -14417 7519 15679 10034 18557 -4120 -36939 -27151 -22269 -6645 -12994 -5939 7658 10682
11617A0682j6540j7281k786L284N769J5080n255K3817k351J5017J768j2252Q2
$$ 10682 -5858 -23139 -25925 -22641 -16872 -1792 -7047 16770 14419 29436 31204 18952 19034
11604A9034l5348k0237Q899N044j1657m600k1162k3261O001M3755K2965J2421
$$ 19034 -16314 -36551 -27652 -22608 -34265 -38865 -60027 -83288 -77287 -33532 -10567 1854
11592A854k8204j4785J8124J4491J7366k1099J024q731p430m1938K474K4138L6404
$$ 1854 -26350 -41135 -23011 -8520 8846 -12253 -11229 -19960 -27390 -69328 -66854 -42716 -6312
11579f312j49m264Q6o833K9307O863J2155q598j8624K2335K5467l429n334o904
$$ -6312 -6461 -10725 -10639 -17472 11835 18698 30853 22255 3631 25966 51433 48004 42670 35766
11565C5766j637j3611R6M2605k736j1256N1121K7975K2478K9175K3721n940k9200
$$ 35766 34129 20518 20614 63219 60483 49227 100348 128323 150801 179976 203697 197757 168557
11552A68557m4457m4510n3813m891j9699J7257K4751r618k7074k7417P739l111
$$ 168557 124100 79590 25777 20886 1187 18444 43195 33577 6503 -20914 -13175 -16286
11540a6286J3204n069j8522K0464K9244j6033k831r942J0880k8476j3639k3132
$$ -16286 -3082 -8151 -26673 -6209 23035 7002 4171 -5771 5109 -23367 -37006 -60138
11528f0138o262m299K2815L8132M4330M680k3511K88k280j0280O591p907k2752
$$ -60138 -66400 -70699 -47884 -9752 34578 39258 15747 16035 13755 3475 10066 2159 -20593
11515b0593j7820K2563K2871K1585P620j8802l884j830J947k0278k2332j4901
$$ -20593 -38413 -15850 7021 28606 36226 17424 13540 11710 13657 -6621 -28953 -43854
11503d3854P430O94J2573k670M682j1440j2970m029j0641j2785J3120J1493K1148
$$ -43854 -36424 -35730 -23157 -25827 -21145 -32585 -45555 -49584 -60225 -73010 -59890 -48397 -27249
11490b7249K4751M1137J308p533M819J1164J0663j2012j7727k3862L098N93M224
$$ -27249 -2498 38639 39947 32414 37233 48397 59060 47048 29321 5459 8557 9150 13374
11477A3374J6141l133l1710k1164r52n567K1525R585N7799L849m5828n337o837
$$ 13374 29515 26382 -5328 -26492 -27444 -33011 -11486 -1901 55898 59747 13919 8582 1745
11464A745j1044j3601k077P738j8409L284j9913l464N078J5604R310n48M379j5147
$$ 1745 -9299 -22900 -24977 -17239 -35648 -32364 -52277 -55741 -50663 -35059 -25749 -26297 -21918 -37065
11450c7065k5313K3714K0228j7671J2331J2093K43p247N467N148q59j0242q503
$$ -37065 -62378 -38664 -18436 -36107 -23776 -11683 -11440 -18687 -13220 -8072 -8931 -19173 -27676
11437b7676n31K524O061J936l386k3737j1596N454L1868O472J975j0623k2818
$$ -27676 -28207 -25683 -19622 -17686 -21072 -44809 -56405 -50951 -19083 -12611 -10636 -21259 -44077
11424d4077o689J3462N758J9422J2255K847p243k9276j6845K2925J9159l3582
$$ -44077 -50766 -37304 -31546 -12124 131 2978 -4265 -33541 -50386 -27461 -8302 -41884
11412d1884j1786K8178K5123J6852j894K0348p651l2825j436m728k4945Q664K8828
$$ -41884 -53670 -25492 -369 16483 14589 34937 27286 -5539 -6975 -11703 -36648 -27984 844
11399H44J3827p177k8834j6132p62J2724K3891r378N296j4424j7650J0583J2262
$$ 844 14671 7494 -21340 -37472 -38234 -25510 -1619 -10997 -5701 -20125 -37775 -27192 -14930
11386a4930N21P326j8315l146k0826m114p598q005J9978K5064J458r783j162J6847
$$ -14930 -14409 -7083 -25398 -28544 -49370 -53484 -61082 -69087 -49109 -24045 -22587 -32370 -33532 -16685
11372a6685J4266Q067j0742k1174J1685l285O079k6701P188J8117j9817J2412
$$ -16685 -2419 5648 -5094 -26268 -14583 -17868 -11789 -38490 -31302 -13185 -33002 -20590
11360b0590j7669P869M6058R711l4312k433J2807j3010k7075o727J5812P6J2228
$$ -20590 -38259 -30390 15668 25379 -8933 -11366 1441 -11569 -38644 -45371 -29559 -29483 -17255
11347a7255K4730K1976p194M157qQ313k8759j1585J1540m4j4428j8223j7132r384
$$ -17255 7475 29451 22257 26414 26406 34719 5960 -5625 5915 5871 -8557 -26780 -43912 -53296
11333e3296J3456N2110L0706J4638j2170k6998k5160q489r676J0672J6056j9998
$$ -53296 -39840 12270 42976 57614 45444 18446 -6714 -15203 -24879 -14207 1849 -18149
11321a8149r37J577R780J937J3642p232J0862J0786j7597j9254J1370J2013M855
$$ -18149 -19086 -17509 -7729 -5792 7850 618 11480 22266 4669 -14585 -3215 8798 13653
11308A3653l036j397j8024l249j1480m652K339J5367L0372M325r536J2137r897
$$ 13653 10617 9220 -8804 -12053 -23533 -28185 -25846 -10479 19893 24218 14682 26819 16922
11295A6922J181J1318l8514l3459j1493K3619p858q228R441K0758M1834P6685
$$ 16922 18103 29421 -9093 -42552 -54045 -30426 -38284 -46512 -37071 -16313 25521 102206
11283A02206N3690L4222M7022M077o3183o1721l3029l5597q972M306l4670q619
$$ 102206 155896 190118 237140 241217 178034 116313 83284 47687 38715 43021 8351 -268
11271b68r697k5627J6675L079N844J9573P439o237M514O517j2698O516Q010k8107
$$ -268 -9965 -35592 -18917 -15838 -9994 9579 17018 10781 15295 21812 9114 15630 23640 -4467
11257d467k5584j2967K418j889J1648J3842k2702j5660K1071K4994j7059O898
$$ -4467 -30051 -43018 -40600 -42489 -30841 -16999 -39701 -55361 -34290 -9296 -26355 -19457
11245a9457p68J2119j1910J1932j3651j6404K3374L6584j6120j2066P706Q106
$$ -19457 -20225 -8106 -20016 -8084 -21735 -38139 -14765 21819 5699 -6367 1339 9445
11233I445k4762J9771K8653j8775J2629k6330Q311K4026l316n128J9680j1442
$$ 9445 -15317 4454 33107 14332 26961 631 8942 32968 29652 24524 44204 32762
11221C2762j2300j1816O182K8177l7568l1938L803M3474Q211L019n630p62n857
$$ 32762 20462 8646 14828 43005 5437 -26501 -22698 20776 28987 32006 26376 25614 19757
11208A9757k1632j7205J0190O009K7168N805K5946q080M221j0601j467o652n976
$$ 19757 -1875 -19080 -8890 -2881 24287 30092 56038 47958 52179 41578 40111 33459 27483
11195B7483P69l3155j3008J7523P844l0853p723K7551j950j3171m904j7778r679
$$ 27483 28252 -4903 -17911 -388 7456 -23397 -31120 -3569 -5519 -18690 -23594 -41372 -51051
11182e1051K3460K4824J086M259M5522M0598J1866j8709k4147o093l7303m1260
$$ -51051 -27591 -2767 -1681 2578 48100 88698 100564 81855 57708 51615 14312 -26948
11170b6948n3284j9022j1896K4954K0230K8688J2248n854j5326J6082J143k9018
$$ -26948 -80232 -99254 -111150 -86196 -65966 -37278 -25030 -30884 -46210 -30128 -28985 -58003
11158e8003K4671J4579J9390K8039K4382j4k9733k4035R692j8977j3883r125q90
$$ -58003 -33332 -18753 637 28676 53058 53044 23311 -724 8968 -10009 -23892 -33017 -33907
11145c3907J4972J5465K811j0668o483K0024L666j6418p189r48r763K0067K1065
$$ -33907 -18935 -3470 -659 -11327 -17810 2214 5880 -10538 -17727 -18675 -28438 -8371 12694
11132A2694J8964k6306p926p333n166J469K3330R051j7133l0034j3528k3755j3865
$$ 12694 31658 5352 -2574 -9907 -15073 -13604 9726 18777 1644 -28390 -41918 -65673 -79538
11119g9538m682K7877M3418J4987j6308j7465Q060M382J9706J0850j9972q265
$$ -79538 -84220 -56343 -12925 2062 -14246 -31711 -23651 -19269 437 11287 -8685 -16950
11107a6950K276m585j2611M053N868L777J9139J4596o647j2816k5431r369J0548
$$ -16950 -14674 -19259 -31870 -27817 -21949 -18172 967 15563 8916 -3900 -29331 -38700 -28152
11094b8152O841J8349K0912R947j0697r209j3826P322J3658K5088k1581j8769
$$ -28152 -21311 -2962 17950 27897 17200 7991 -5835 1487 15145 40233 18652 -117
11082a17j4861j0158j0076K4263L1710L0317l591j4480N47q734m356m042J5248
$$ -117 -14978 -25136 -35212 -10949 20761 51078 47487 33007 33554 24820 20464 16422 31670
11069C1670j8355j8247R815n830k0562r824L622l5085M859j4857J580M3907K0980
$$ 31670 13315 -4932 4883 -947 -21509 -31333 -27711 -62796 -57937 -72794 -71214 -27307 -6327
11056f327O782J996l653L8361K0749j0173k5900j9706J0896K466j0333Q315m233
$$ -6327 455 2451 -1202 37159 57908 47735 21835 2129 13025 15491 5158 13473 9240
11043I240K03Q73j8251J982J5378j9077J4132J3314K874o286J7352J2561k1961
$$ 9240 9443 10316 -7935 -5953 9425 -9652 4480 17794 20668 14382 31734 44295 22334
11030B2334j8094n594K970L0679J0606m986m352K0782J7778J0042j5167m82j4829
$$ 22334 4240 -1354 1616 32295 42901 37915 33563 54345 72123 82165 66998 66516 51687
11017E1687j3767N99j2092J943J2072j9222R194P564J5247K3111o693k5757m4570
$$ 51687 37920 38519 26427 28370 40442 21220 30414 37978 53225 76336 69643 43886 -684
11004f84k5991N827K9392L0232K3339l0491l0045j0600K0347J0909j353j6613
$$ -684 -26675 -20848 8544 38776 62115 31624 1579 -9021 11326 22235 20882 4269
10992D269O624r506n493k0435R28P191K5199Q731o976k5933j956M0469j5664Q355
$$ 4269 10893 1387 -4106 -24541 -23613 -16422 8777 17508 10532 -15401 -17357 23112 7448 15803
10978A5803R700O450j8968j7805k4716J8941J6816N065j8148k1026k024Q475k0425
$$ 15803 25503 31953 12985 -4820 -29536 -10595 6221 11286 -6862 -27888 -29912 -21437 -41862
10965d1862J3971j1085n084j3950N71K5668R597K0576K504j9294k3008j589K1855
$$ -41862 -27891 -38976 -44060 -58010 -57439 -31771 -22174 -1598 906 -18388 -41396 -42985 -21130
10952b1130J6172j180L6923J5494q906j4907J9477L399l6577j3527M612k0784
$$ -21130 -4958 -6138 30785 46279 37373 22466 41943 45342 8765 -4762 -150 -20934
10940b0934J0216J6078j7521j3032k3187j6733J3417K4359M062K0010q427K821
$$ -20934 -10718 5360 -12161 -25193 -48380 -65113 -51696 -27337 -23275 -3265 -11692 -8871
10928h871K606j0378J3889o621J0180K6210m043R392M417j2248m4017K838l580
$$ -8871 -6265 -16643 -2754 -9375 805 27015 22972 32364 36781 24533 -19484 -16646 -20226
10915b0226R662q367J1582J6509L852j6156J6901L646J0444Q343K0970k0390k5075
$$ -20226 -10564 -18931 -7349 9160 13012 -3144 13757 17403 27847 36190 57160 36770 11695
10902A1695N79k2931N67K705j682J7755Q207K369J5078Q647O867J16j9515R837
$$ 11695 12274 -10657 -10090 -7385 -9067 8688 16895 19264 34342 42989 49856 49972 30457 40294
10888D0294O636r912j8539j8365N19j2669N551P5K044j6748P695J6812J0854j3589
$$ 40294 46930 37018 18479 114 633 -12036 -6485 -6410 -4366 -21114 -13419 3393 14247 658
10874F58R099J9400N511K178j0409r147J4858K5189J9732k6488k0593L647j2195
$$ 658 9757 29157 34668 36846 26437 17290 32148 57337 77069 50581 29988 33635 21440
10861B1440l2869l3233M722J5362q562m318j426K2997P959N384p913m849j0407
$$ 21440 -11429 -44662 -39940 -24578 -33140 -37458 -38884 -15887 -7928 -2544 -10457 -15306 -25713
10848b5713j9862J4247L954O46l954k2579M0489K8604k0258q099J0331J9529k273
$$ -25713 -45575 -31328 -27374 -26728 -30682 -53261 -12772 15832 -4426 -12525 -2194 17335 15062
10835A5062j9009q033R84M081R300j9066k634N037J6288j4214N195J8188J0733
$$ 15062 -3947 -11980 -10996 -6915 2385 -16681 -19315 -14278 2010 -12204 -7009 11179 21912
10822B1912l2866N203K1660O081K194j6916p531P864J3225l9497n606J0996p65
$$ 21912 -10954 -5751 15909 21990 24184 7268 -263 7601 20826 -18671 -24277 -13281 -14046
10809a4046J12K0162J2818K305k6681k2154m872K880J3544L3333L903m0400j2267
$$ -14046 -13934 6228 19046 21351 -5330 -27484 -32356 -29476 -15932 17401 21304 -19096 -31363
10796c1363k3358m829J1937L8744J0821J1001Q193j2370q128j1205q090K6001
$$ -31363 -54721 -59550 -47613 -8869 1952 12953 21146 8776 648 -10557 -18647 7354
10784G354r832o770j4940k2452J1936L381q397j6242P531m049K1014Q512J8251
$$ 7354 -2478 -9248 -24188 -46640 -34704 -31323 -39720 -55962 -48431 -52480 -31466 -22954 -4703
10771d703K1384K4624k9856j4940j8919Q63l197j0724J9754J30J5571j8095j5929
$$ -4703 16681 41305 11449 -3491 -22410 -21547 -24744 -35468 -15714 -15584 -13 -18108 -34037
10758c4037K6641J9729m433J3564P981J6110k7979j9282K6659K3750p356K768
$$ -34037 -7396 12333 7900 21464 29445 45555 17576 -1706 24953 48703 41347 44115
10746D4115k751j7926r933j5913K4520n14k5988k8845m360K1328L1210N597k5979
$$ 44115 41364 23438 13505 -2408 22112 21598 -4390 -33235 -37595 -16267 14943 20540 -5439
10733e439J5370K3174Q738J5112Q294k2648k6918k767r308K9950M2548K0287m1824
$$ -5439 9931 33105 41843 56955 65249 42601 15683 12916 3608 33558 76106 96393 54569
10720E4569k3535o856J28p626J1297r626j0438p915k0338L666O035J6688J8575
$$ 54569 31034 24178 24306 16680 27977 18351 7913 -2 -20340 -16674 -10639 6049 24624
10707B4624r722L18q153K0649J8990l8476l0887J1805J9317p727l117M381L163
$$ 24624 14902 15220 7067 27716 46706 8230 -22657 -10852 8465 738 -2379 2002 5165
10694E165p852j8276j182j765R044j2916R035L912Q108j0129J138J3989P348J1771
$$ 5165 -2687 -20963 -22145 -23910 -14866 -27782 -18747 -14835 -6727 -16856 -15718 -1729 5619 17390
10680A7390J7626k5094j5961l1187p281K5552O356J67J2778k033q213O200j2859
$$ 17390 35016 9922 -6039 -37226 -44507 -18955 -12599 -12432 346 -1687 -9900 -3700 -16559
10667a6559K421j5287J5361l909k249L0617K1730j2607L413p609n034K2810K3691
$$ -16559 -14138 -29425 -14064 -17973 -20222 10395 32125 19518 22931 15322 10288 33098 56789
10654E6789p858l2558n308k325K4829Q932l0153M626J7711J1821k2603k9986L5779
$$ 56789 48931 16373 11065 8740 33569 42501 12348 16974 34685 46506 23903 -6083 29696
10641B9696L063m731j9325n47Q158j7813J3648J9123L3988K3189M061P923N1980
$$ 29696 32759 28028 8703 8156 16314 -1499 12149 31272 65260 88449 92510 100433 152413
10628A52413P6517N1557j9719n3701r0653n2850L0041q515m3214j7735k0873J0733
$$ 152413 228930 280487 260768 207067 116414 63564 93605 85090 41876 24141 3268 14001
10616A4001j4115k0037K4988M1204j3698O583K7057O1172j5204m9758m5331j5502
$$ 14001 -114 -20151 4837 46041 32343 38926 65983 127155 111951 62193 16862 1360
10604A360P047k1653j8566K5912J8233j9742j7133q10J5609q030P571M399J5741
$$ 1360 8407 -13246 -31812 -5900 12333 -7409 -24542 -25352 -9743 -17773 -10202 -5803 9938
10591I938Q139J4330j2812j7451j3493k2369O387L019J5566R607K5008Q646P227
$$ 9938 18077 32407 19595 2144 -11349 -33718 -27331 -24312 -8746 861 25869 34515 41742
10578D1742P457L352l2646l2048J660l142K1117K4922l780j1416O33k154o649
$$ 41742 49199 52551 19905 -12143 -10483 -13625 7492 32414 28634 17218 17851 15697 9048
10565I048J9493j791o445l5355k2443Q459J933K594J0796k120K766L3816r383
$$ 9048 28541 26750 20305 -15050 -37493 -29034 -27101 -24507 -13711 -15831 -13065 20751 11368
10552A1368N902j6126k617J4202J6431K5384J4253p985M30k2710m2918O99L0412
$$ 11368 17270 1144 -1473 12729 29160 54544 68797 60812 61242 38532 -4386 -3687 26725
10539B6725J4276N625J6104J3621l2888p565j2046q719N039q925J0638J7204j3699
$$ 26725 41001 46626 62730 76351 43463 35898 23852 15133 20172 11247 21885 39089 25390
10526B5390j3481R099n800l5961M605K3660K1822L552K0225N0356L9790j1670
$$ 25390 11909 21008 15208 -20753 -16148 7512 29334 32886 53111 103467 143257 131587
10514A31587m7624j0939p039j0436r860j7558R478j4945k6099q874L7606J2199
$$ 131587 83963 73024 65985 55549 45689 28131 37609 22664 -3435 -12309 25297 37496
10502C7496Q632O147m1166k5536L329J5180m39m715R659M706p827J9875q121j3650
$$ 37496 46128 52275 11109 -14427 -11098 4082 3643 -1072 8587 13293 5466 25341 17220 3570
10488C570L189j040J648k7441k9114L477J1139L3276L6165J1438r078k1771O546
$$ 3570 6759 5719 7367 -20074 -49188 -45711 -34572 -1296 34869 46307 37229 15458 22004
10475B2004r700J535j8468l8121J5466K4795p284m756L9250M135p586j1368j3307
$$ 22004 12304 13839 -4629 -42750 -27284 -2489 -9773 -14529 24721 28856 21270 9902 -3405
10462c405P79j9114J813j1581K299j989L631O469K158r185L303K5843P940J1705
$$ -3405 -2626 -21740 -19927 -31508 -29209 -31198 -27567 -21098 -18940 -28125 -24822 1021 8961 20666
10448B0666j6432P110Q406q597n770R664L1296q82l7428K5071K9140J5216O666
$$ 20666 4234 11344 19750 11153 5383 15047 46343 45461 8033 33104 62244 77460 84126
10435H4126k1276l6577j3399J0312p135q432M46Q18K8382M982l1778P532O550
$$ 84126 62850 26273 12874 23186 16051 7619 8065 8883 37265 42247 10469 18001 24551
10422B4551J4033J9274j196k827p751N875J743L0283J2258j4555m0287j8133K459
$$ 24551 38584 57858 56662 53835 46084 51959 53702 83985 96243 81688 41401 23268 25727
10409B5727J5197j1910j7457j5722K267K7929K2730J2776R803L8162k5145k0934
$$ 25727 40924 29014 11557 -4165 -1898 26031 48761 61537 71340 109502 84357 63423
10397F3423P013j191M63p658N865J3945m740J0296m275j4966k9089n325j0045
$$ 63423 70436 69245 69708 62050 67915 81860 77120 87416 83141 68175 39086 33761 23716
10384B3716P565n40j2205j3355K003L320J3758M429N028K2861K819p201Q66K481
$$ 23716 31281 30741 18536 5181 7184 10504 24262 28691 33719 56580 59399 52198 53064 55545
10370E5545J470l642k464j2389o205l265L4096J9532Q46j893r793l8131N94J2425
$$ 55545 57015 53373 50909 38520 32315 29050 63146 82678 83524 81631 71838 33707 34301 46726
10356D6726J1575j1798O372P193j4525N171J7893p356K063k6766j6171J4006K1189
$$ 46726 58301 46503 52875 60068 45543 50714 68607 61251 63314 36548 20377 34383 55572
10343E5572n173R530J9131k1190l665p152J1003J8767J4329j8414j3410j1032
$$ 55572 50399 59929 79060 57870 54205 47053 58056 76823 91152 72738 59328 48296
10331D8296J7383J3076M692j0459K0320q740n229J3246P48o888K3693L6279K0343
$$ 48296 65679 78755 83447 72988 93308 84568 79339 92585 93333 86445 110138 146417 166760
10318A66760J5818L16j1125J0502J5293M6793J5592j7267j3354J8400L3676J8132
$$ 166760 182578 182894 171769 182271 197564 244357 259949 242682 229328 247728 281404 299536
10306B99536K9632K8941O6789J03651J22095Q5987L0880K6254P6038K18044M00575
$$ 299536 329168 358109 424898 528549 650644 736631 767511 793765 869803 1087847 1488422
10295A488422O47168J105852J911988K483337J262202r31748k015220j931760
$$ 1488422 2135590 3241442 5153430 7636767 8898969 7967221 5952001 4020241
10287D020241j323528p99604n00597l39634k05156j16974r9867q3458o5592n2625
$$ 4020241 2696713 1897109 1396512 1056878 851722 734748 634881 551423 485831 433206
10277D33206m5221k4012m2386m0769k3293K79o366J5357K0063J7037J3317L0654
$$ 433206 387985 363973 321587 280818 257525 257804 251438 266795 286858 303895 317212 347866
10265C47866J5515M0456O8528J55499K63335L47501J14168j88852k86619k52060
$$ 347866 363381 403837 472365 627864 891199 1238700 1352868 1164016 877397 625337
10255F25337j65659j00953m2810n5132k2761j9564k3295l7730J4192M0391J417
$$ 625337 459678 358725 315915 260783 238022 218458 195163 157433 171625 212016 213433
10244B13433j7773k2418k7748O231N256m7590P27L3652O08j015R267J0347j8582
$$ 213433 195660 173242 145494 151725 156981 109391 110118 143770 144378 143363 152630 162977 144395
10231A44395n112P871r432p34J8512M6526K3751k8962K3050L3482M8036M6852
$$ 144395 139283 147154 137722 136988 155500 202026 225777 196815 219865 253347 301383 348235
10219C48235O1662Q7546M5875M4417R8955K07228L02701J27703j02192j99545
$$ 348235 409897 497443 543318 587735 686690 893918 1196619 1324322 1222130 1022585
10209A022585j54267n2998J3992P8504J10237J78016K73355M01928N93709R27761
$$ 1022585 868318 815320 829312 907816 1018053 1196069 1469424 1871352 2465061 3392822
10199C392822J641697K888189M075292K722865q72449l039317l294471k472598
$$ 3392822 5034519 7922708 11998000 14720865 13848416 10809099 7514628 5042030
10191E042030j567866r50239o02432l97070k52299j71021j57619j47051j06506
$$ 5042030 3474164 2523925 1921493 1524423 1272124 1101103 943484 796433 689927
10182F89927m8007p3151p6805r436q219N769j1342k190m082j0692k7929j7911
$$ 689927 641920 568769 491964 482528 474309 480078 468736 466546 462464 451772 423843 405932
10170D05932m4940n0254l5333j5214J5844J5014O131j7291m2936k5146j6201o474
$$ 405932 360992 310738 275405 260191 276035 291049 297180 279889 236953 211807 195606 189132
10158A89132K0814K1363j8951j6529J9195J9458K1632m835K0913m131j2814M266
$$ 189132 209946 231309 212358 195829 215024 234482 256114 251279 272192 268061 255247 259513
10146B59513j2168J7068P210k531j4419q880n299l006j29l815J4408R445O586
$$ 259513 247345 264413 271623 269092 254673 245793 240494 237488 237359 233544 247952 257397 263983
10133B63983J4244K877M967L6907K3425L7633P9137O9677J9165N914J5752m133
$$ 263983 278227 281104 286071 322978 346403 384036 463173 532850 552015 557929 573681 569548
10121E69548L0277N5463O1884Q2999O1555R2942J51723K24524K84127M08419N26064
$$ 569548 599825 655288 717172 800171 861726 954668 1106391 1330915 1615042 2023461 2549525
10110B549525P85373J309206K180800L777729O118732O448731J000778m123593
$$ 2549525 3334898 4644104 6824904 10602633 16721365 23170096 24170874 20047281
10102B0047281n720847m701538k983474j758861j062751p70723o11010m74774
$$ 20047281 14326434 9624896 6641422 4882561 3819810 3049087 2438077 1963303
10094A963303l33320k54131k02920j59033j08909q0063j00783o2524l4800l5428
$$ 1963303 1629983 1375852 1172932 1013899 904990 824927 724144 661620 626820 591392
10084E91392l6082m5462l2421P207j0483l4862k6028m1473l7933P260j6336M711
$$ 591392 555310 509848 477427 484634 474151 439289 413261 371788 333855 341115 324779 329490
10072C29490r326n334K1584L4069J7422O2895N6050k7414p8380m4453k8659J5617
$$ 329490 320164 314830 336414 370483 387905 450800 506850 479436 401056 356603 327944 343561
10060C43561J7032l7883m9694l9354k2940j7063k6772j2572k7768k9703P10J2702
$$ 343561 360593 322710 273016 233662 210722 193659 166887 154315 126547 96844 97554 110256
10048A10256O618R410J5429r80K4272O893q869J4679M3624Q4081J08970R1744
$$ 110256 116874 126284 141713 140733 165005 171898 163029 177708 221332 305413 414383 506127
10036E06127j7199p6223o1162l1097m5724m7524k9963j9905l9851N096l147J4108
$$ 506127 488928 412705 351543 320446 274722 227198 197235 177330 137479 142575 139428 153536
10024A53536Q0437J27517J68048N5912r4974j27218o7869Q298o57j9526P442j8919
$$ 153536 233973 361490 529538 585450 490476 363258 295389 303687 303030 283504 290946 272027
10012B72027l2536l0430m59j5895k0521j0461Q274l4426k6837p051O07r58K0614
$$ 272027 239491 209061 208602 192707 172186 161725 169999 135573 108736 101685 102292 101334 121948
9999A21948M016J3871J5435q989J588q797J0083L5329j0363k866J1127J528k3659
$$ 121948 125964 139835 155270 146281 147869 139072 149155 184484 174121 171255 182382 183910 160251
9986A60251m607r754R348O431j3442k851J0268J9854L4892N578j8183l2686P175
$$ 160251 155644 145890 155238 161669 148227 145376 155644 175498 210390 215968 197785 165099 172274
9973A72274J3403J2472p807l5529J1942k46j4798j6072J3372M5752L2105J6445
$$ 172274 185677 198149 190342 154813 166755 166509 151711 135639 149011 194763 226868 243313
9961B43313o202j2189j0560j0598j1487j529P336j3791j7793j9451R776J8825
$$ 243313 237111 224922 214362 203764 192277 190748 198084 184293 166500 147049 156825 175650
9949A75650L1193L5451m734l7715l776P068P52J8574M6459K0039K3289J8832k842
$$ 175650 206843 242294 237560 199845 196069 203137 203889 222463 268922 288961 312250 331082 328240
9936C28240o928K87n203K5500K9724J1820p273L4834K3390l2648k322J7340j8646
$$ 328240 321312 321599 316396 341896 371620 383440 376167 411001 434391 401743 399421 416761 398115
9923C98115K0994P141R058L2818K0669J2840O5721Q7940J06480J00125P2007J22459
$$ 398115 419109 426250 435308 468126 488795 501635 567356 655296 761776 861901 933908 1056367
9911A056367K42990K81297R8132q3000j09998j7674J00615J47990K56793L85909
$$ 1056367 1299357 1580654 1678786 1595786 1485788 1468114 1568729 1716719 1973512 2359421
9901B359421N64752Q19621J261471J973963L437758O117122R003065O354386j841379
$$ 2359421 2924173 3743794 5005265 6979228 10416986 16534108 25537173 31891559 30050180
9892C0050180o801991p384575n377571l305744j957618j191580p97085n19338
$$ 30050180 23248189 15863614 10486043 7180299 5222681 4031101 3234016 2714678
9884B714678l48015k06199l6786Q2114l6201k55232l01771k37294j59851o7934
$$ 2714678 2366663 2160464 2123678 2205792 2169591 1914359 1612588 1375294 1215443 1147509
9874A147509L8599Q5642P1723o4154j91632j79363j35372k9120J3048O3354L9800
$$ 1147509 1186108 1271750 1343473 1279319 1087687 908324 772952 743832 756880 820234 860034
9863H60034o5335r7216j17363j04214n4906l7974o0046k4711k0926k0805j956
$$ 860034 794699 697483 580120 475906 421000 383026 322980 298269 277343 256538 254582
9852B54582K3378j6481j2788O521J143r537J2470l2262Q290K6447m974J3572K2522
$$ 254582 277960 261479 248691 255212 256355 246818 259288 227026 235316 261763 256789 270361 292883
9839B92883L6824J03925J31962J04088n3173j05013q1564q2162m6291K2916O829
$$ 292883 329707 433632 565594 669682 616509 511496 429932 347770 301479 324395 331224
9828C31224K837j9183M5678R7093J48644K40105M14286O51964O59825K88010k61107
$$ 331224 334061 314878 360556 457649 606293 846398 1260684 1912648 2572473 2860483 2599376
9817B599376o01795n83504m38830k68545k06600r9539k9055l3406n2417k9742
$$ 2599376 1997581 1414077 975247 706702 500102 400563 371508 338102 285685 255943
9807B55943j0089j5688l4887k5748r877o346P039L599K2276J827j8735l1138l2984
$$ 255943 245854 230166 195279 169531 159654 153308 160347 163946 186222 188049 169314 138176 105192
9794A05192J2491K5281J8678k601j1696k4097j7009J7461J7486k0520k0511k1811
$$ 105192 117683 142964 161642 159041 147345 123248 106239 123700 141186 120666 100155 78344
9782G8344P272j0809m961O886M3556K2004r430p395j3627J0069n397k2341n993
$$ 78344 85616 74807 69846 76732 120288 142292 132862 125467 111840 121909 116512 94171 88178
9769H8178k0142J7935J232J7211J3924Q298K5717o511k0214j7297k7348J9291
$$ 88178 68036 85971 87203 104414 118338 126636 152353 145842 125628 108331 80983 100274
9757A00274J153N15j7470j0522R736K861N635n260J0352J9629o896p702J2147
$$ 100274 101427 101942 84472 73950 83686 86547 92182 86922 97274 116903 110007 102305 114452
9744A14452K0196n213k6453k1798J2414k8629j9776K0547J5199J1451L7250j7290
$$ 114452 134648 129435 102982 81184 93598 64969 45193 65740 80939 92390 129640 112350
9732A12350l2081K9981J5950m565k5406p444O288p952N56J2618j3647j7463P444
$$ 112350 80269 110250 126200 121635 96229 88785 95073 87121 87677 100295 86648 69185 76629
9719G6629J1002j6878J2693r070n674K7705j827j934q833q825K662L0257j3346
$$ 76629 87631 70753 83446 74376 68702 96407 94580 92646 83813 74988 77650 107907 94561
9706I4561k4667R203J0810j1616O153M7566J6440j2980k2528J607j1063l1310
$$ 94561 69894 79097 89907 78291 84444 132010 148450 135470 112942 114549 103486 72176
9694G2176j8726Q367J2439J2256O1584M5871o572j1817k8175l7605k2629j8629
$$ 72176 53450 61817 74256 86512 148096 193967 187395 175578 147403 109798 87169 68540
9682F8540J8368j1011o44R960J4176R639q698J3887M172k4124Q237J6907L32j3420
$$ 68540 86908 75897 75253 85213 99389 109028 100330 114217 118389 94265 102502 119409 119741 106321
9668A06321k1096k427j1242l0544p247K9442K2457j3271r511N3498l491n4140
$$ 106321 85225 82798 71556 41012 33765 63207 85664 72393 62882 116380 112889 58749
9656E8749r490Q859J0176l599j9372j5351J465L3213J7503l000j4998J7264J0704
$$ 58749 49259 58118 68294 64695 45323 29972 31437 64650 82153 79153 64155 81419 92123
9643I2123M555m961o38L44o074R336l8634l179L2411q159j7529M336k0006l478
$$ 92123 96678 91717 91079 91423 85349 94685 56051 52872 85283 77124 59595 63931 43925 40447
9629D0447N507q938j6863K0932q904j9158L7021K3274l390R758J0699j0795l231
$$ 40447 45954 37016 20153 41085 32181 13023 50044 73318 69928 79686 90385 79590 76359
9616G6359p978J7075K0571O76o0583k6464L1201P0052L0675o573k8536l2002n098
$$ 76359 68381 85456 106027 106703 46120 19656 50857 120909 151584 145011 116475 84473 79375
9603G9375N138j2755j4998J0676J6561Q98k7153l1286K2343k0158M865M6451j6130
$$ 79375 84513 71758 56760 67436 83997 84895 57742 26456 48799 28641 33506 79957 63827
9590F3827k5806o065K0765J2363Q558J1661q91Q40J4021j9454J8662n57M523P593
$$ 63827 38021 31956 52721 65084 73642 85303 84412 85252 99273 79819 98481 97924 102447 110040
9576A10040j049O653n813j9036p002l94P515J1995k7579j378k626l513J2369N216
$$ 110040 108991 115644 109831 90795 83793 83399 90914 102909 75330 73952 71326 67813 80182 85398
9562H5398L577Q295L981k854j1631L7039R244n1877l3004q965M1114L6959J620
$$ 85398 88975 97270 101251 98397 86766 123805 133049 81172 48168 39203 80317 117276 118896
9549A18896J416k0018k7222n567p494j2070J6920K4929l0610J5864J9721j5911
$$ 118896 120312 100294 73072 67505 60011 47941 64861 89790 59180 75044 94765 78854
9537G8854J7657l970Q327J2192J9388K609r509k6682O705J3976K400L937k1726
$$ 78854 96511 92541 100868 113060 132448 135057 125548 98866 105571 119547 121947 125884 104158
9524A04158K54j6689N767J8505J8012m432j8176l1203m0849j8552K2593o826J1736
$$ 104158 104412 87723 93490 111995 130007 125575 107399 76196 35347 16795 39388 32562 44298
9511D4298K5423N277L6643J4647k4504Q191J370l824q423k4439r256j9204j0795
$$ 44298 69721 74998 111641 126288 101784 109975 111345 107521 99098 74659 65403 46199 35404
9498C5404J0200O785j4770K2647K8876K3188J3357J703K56k453k4031j6291j4383
$$ 35404 45604 52389 37619 60266 89142 112330 125687 127390 127646 125193 101162 84871 70488
9485G0488P029O0827N0557L3573P812K422j6360m2068j4915l477r128k401o792
$$ 70488 77517 138344 188901 222474 230286 232708 216348 174280 159365 155888 146760 144359 137567
9472A37567m397L5377p94l1144M645K7489R841j0344l3707j4214j9151r364o443
$$ 137567 133170 168547 167753 136609 141254 168743 178584 168240 134533 120319 101168 91804 85361
9459H5361k65J4552l000P672J3727j4612j3659j5144k2922J6957J1033J5054M1168
$$ 85361 85096 99648 96648 104320 118047 103435 89776 74632 51710 68667 79700 94754 135922
9446A35922K1072N234L417J1826j7993j5283L425k9321l4014J87K3946q006r637
$$ 135922 156994 162228 165645 177471 159478 144195 147620 118299 84285 84472 108418 100412 90775
9433I0775n689Q099O684O573o056K4423N667J262J6722j9424l9472k4712J7349
$$ 90775 85086 93185 99869 106442 100386 124809 130476 131738 148460 129036 89564 64852 82201
9420H2201k1144o592k989J9944L0289k0104O442J1677L818l032N142k3j6840j4614
$$ 82201 61057 54465 51476 71420 101709 81605 88047 99724 103542 100510 105652 105629 88789 74175
9406G4175p527j87L3186J5165J1895L7024M911k7993k7517l719K970K1857l3551
$$ 74175 66648 66461 99647 114812 126707 163731 168642 140649 113132 109413 112383 134240 100689
9393A00689q543K0894L2277o863o043L297J2349j4937p34L4044Q281l176J3216
$$ 100689 92146 113040 145317 138454 132411 135708 148057 133120 132386 166430 174711 171535 184751
9380A84751j146j1852m194m201r419j255o696L095J4118l7979l623K5903J2196
$$ 184751 183605 171753 167559 163358 153939 152684 145988 149083 163201 125222 121599 147502 159698
9367A59698n548k1823k08j6128J3771L308j9829j624k4731J4416L6688j5923K4589
$$ 159698 154150 132327 132119 115991 129762 133070 113241 111617 86886 101302 137990 122067 146656
9354A46656M9373J5983k9272m2281J2029J1929N857m258j743L6055L4891J352
$$ 146656 196029 212012 182740 140459 152488 164417 170274 166016 164273 200328 235219 236571
9342B36571m2825N657P985J5888M924q839n825j7874j7631j8407O134M0732L9590
$$ 236571 193746 199403 207388 223276 228200 219361 213536 195662 178031 159624 165758 206490 246080
9329B46080K057Q950J9518K7099O2602M5968R9410J85823K24119J79774L2897
$$ 246080 248137 257087 276605 303704 366306 412274 511684 697507 921626 1101400 1134297
9318A134297j09117k18755k13336j19141n0547m8143k8349n0464m1951j3116K6104
$$ 1134297 1025180 806425 593089 473948 423401 375258 346909 296445 254494 241378 267482
9307B67482K1738k0038j1306q701o822j1523j4663j2136J8601L5529J0861J80
$$ 267482 289220 269182 257876 249175 242353 230830 216167 204031 222632 258161 269022 269202
9295B69202j0074k0423l314J8176L6108L4354j0092j2170j6599J8455M3695J8327
$$ 269202 259128 238705 235391 253567 289675 324029 313937 301767 285168 303623 347318 365645
9283C65645L0863M1101P2717R1913J15439J90267L06498M68884M53661R7533k55260
$$ 365645 396508 437609 510326 602239 717678 907945 1214443 1683327 2136988 2234521 1979261
9272A979261m19839l58782k33870r0900k8330P7014J59100J96417J07582p7550
$$ 1979261 1559422 1200640 966770 875870 847540 924554 1083654 1280071 1387653 1310103
9262A310103k04084k26164j92008j41871q0337m9189L8j9100l8299p216k8989
$$ 1310103 1106019 879855 687847 545976 465639 416450 416488 397388 359089 351873 322884
9251C22884j189J4174N834j7570q527k7072k034J7214J2319K7452J0367K318J0079
$$ 322884 321695 335869 341703 324133 315606 288534 286500 303714 316033 343485 353852 356170 366249
9238C66249K0624O193K3712K6372O7057R5134J33821K09232K12656O6204q7616
$$ 366249 386873 393066 416778 443150 510207 605341 739162 948394 1161050 1227254 1139638
9227A139638j54781j27350n2728M9408J20004K20983L74326M85466L20228q5897
$$ 1139638 984857 857507 804779 854187 974191 1195174 1569500 2054966 2375194 2289297
9217B289297l52534m57517m16294k74720j60312j22259o3474k2895j0945J793
$$ 2289297 1936763 1479246 1062952 788232 627920 505661 442187 419292 408347 410140
9207D10140m8268m4310l4541k3159n588K425L2362j1409k2456K5736K0834J7728
$$ 410140 361872 317562 283021 259862 254274 256699 289061 277652 255196 280932 301766 319494
9195C19494l4930K5004J2743k662K774j0406l8868j4432k430J4850L0386m554
$$ 319494 284564 309568 322311 319649 322423 312017 273149 258717 256287 271137 301523 296969
9183B96969k866K9545N3904J1558J0866R0663J37662J74247K66861K48925N6811
$$ 296969 294103 323648 377552 389110 399976 490639 628301 802548 1069409 1318334 1375145
9172A375145j43004k15034j76085j39582j03087o7681n1224k1554o306m2628n9377
$$ 1375145 1232141 1017107 841022 701440 598353 530672 479448 457894 451588 408960 349583
9161C49583k8061K1365R181r661j9883L3772K6202k8623j0598J321l7996k7089
$$ 349583 321522 342887 352068 342407 322524 356296 382498 353875 343277 344598 306602 279513
9149B79513Q710q279K3113j813O973K1130J1060K4897K0082L4441j53R780k7875
$$ 279513 288223 279944 303057 301244 308217 329347 340407 365304 385386 419827 419674 429454 401579
9136D01579l4981j0638J6939J0919K2740L6200M3555N9405M9641L6316K5142R905
$$ 401579 366598 355960 372899 383818 406558 442758 486313 545718 595359 631675 656817 666722
9124F66722j3283j0911j0310j5855J7860Q0649O1649J0127L8976J27730J61289
$$ 666722 653439 642528 632218 616363 634223 714872 776521 786648 825624 953354 1114643
9113A114643J35316J02166p138q5825j38911j57000j37360j06667r6540o4900
$$ 1114643 1249959 1352125 1344987 1259162 1120251 963251 825891 719224 622684 557784
9103E57784m6536k3254j1127q058q490o015J3350K9410L4694L9116L6009l146
$$ 557784 511248 487994 476867 468809 460319 454304 467654 497064 531758 570874 606883 603737
9091F03737r706j86j4931k6799J5813j5726L7421O0224N1131K1685L5524O0500
$$ 603737 594031 593845 578914 552115 567928 552202 589623 649847 700978 722663 758187 818687
9079H18687N6627K0768P7543J39895K18633K63142K31136R4283L1272N4591J42588
$$ 818687 875314 896082 973625 1113520 1332153 1595295 1826431 1920714 1951986 2006577 2149165
9068B149165K19212K02299j559k30332l79494l89087k76095j99836j79115j15316
$$ 2149165 2368377 2570676 2569117 2338785 1959291 1570204 1294109 1094273 915158 799842
9058G99842q0662n3120k2391n4700j895J3245l762m55N4737L4325j5409L6501
$$ 799842 719180 666060 643669 588969 587074 600319 596557 596102 650839 685164 669755 706256
9046G06256J8982K1939k412r788m162K3899L0922K7334K3023J1211L2095M4483
$$ 706256 725238 747177 744765 734977 730815 754714 785636 812970 835993 847204 879299 923782
9034I23782L3970N7169J51890K36979L33868M03538L50334J28031j44557k72094
$$ 923782 957752 1014921 1166811 1403790 1737658 2141196 2491530 2619561 2475004 2202910
9024B202910k15593j21398k5697n2688j22624k14289k00268j41199j26807r2805
$$ 2202910 1987317 1865919 1840222 1787534 1664910 1450621 1250353 1109154 982347 889542
9014H89542m3105n0778p0050m4091q610M5608K0351K0591M250k8217j9877P147
$$ 889542 846437 795659 725609 681518 672908 718516 738867 759458 763708 735491 715614 722761
9002G22761M5445R0271J16849L9659o6235k3502p05L7705K9572L4162K9608L6425
$$ 722761 768206 858477 975326 1014985 948750 925248 924543 962248 991820 1025982 1055590 1092015
8990A092015R3730P4918L8605M6649O0972J31037J88233J85816N8347p0136j68248
$$ 1092015 1185745 1260663 1299268 1345917 1406889 1537926 1726159 1911975 1970322 1900186 1731938
8979A731938j42323j37441j20803p0952m6691j3155o405l502m466L9920L5763
$$ 1731938 1589615 1452174 1331371 1260419 1213728 1200573 1194168 1190666 1186200 1226120 1261883
8968A261883O5688N8117L0674O8796R1432Q8725N2074K0661K8681L2798O9462
$$ 1261883 1327571 1385688 1416362 1485158 1576590 1665315 1717389 1738050 1766731 1799529 1868991
8957A868991R6234R8095P0533N6196K7223M1034K6789K6931N9919J18689J72688
$$ 1868991 1965225 2063320 2133853 2190049 2217272 2258306 2285095 2312026 2371945 2490634 2663322
8946B663322K33645L20680K37137J33413J23282J56201J88812K15539K21449K42098
$$ 2663322 2896967 3217647 3454784 3588197 3711479 3867680 4056492 4272031 4493480 4735578
8936D735578L86581M99021O24343P67978Q96880J006824J020874J107081J325359
$$ 4735578 5122159 5621180 6245523 7013501 7910381 8917205 9938079 11045160 12370519
8927A2370519J811861K550134L595492N280746P987836J2613928K0599049L3315846
$$ 12370519 14182380 16732514 20328006 25608752 33596588 46210516 66809565 100125411
8919A00125411M5651666L7680371K771152k8862072l9868493l4542744k3975772
$$ 100125411 145777077 183457448 186228600 157366528 117498035 82955291 58979519
8912E8979519j5231643r698169o429473m542340l326173k489026j855833j373737
$$ 58979519 43747876 34049707 27620234 23077894 19751721 17262695 15406862 14033125
8904A4033125r90262o26178m03156l57176l60805l50851l34599j88784J576J18635
$$ 14033125 13042863 12416685 12013529 11656353 11295548 10944697 10610098 10421314 10422890 10541525
8894A0541525K31515L27809M64944O39088Q34181J156982J484764J785210J992050
$$ 10541525 10773040 11100849 11565793 12204881 13039062 14196044 15680808 17466018 19458068
8885A9458068J990182K107397K580401L473683M842264O841428R887802J4744755
$$ 19458068 21448250 23555647 26136048 29609731 34451995 41293423 51181225 65925980
8877F5925980K2856398L7258918O2098240R3199850Q9032482J8538065n1617827
$$ 65925980 88782378 126041296 188139536 281339386 370371868 388909933 337292106
8870C37292106p8943847o8807957m4224987k1496443k708209J5700901L4105516
$$ 337292106 258348259 189540302 145315315 123818872 121110663 136811564 170917080
8863A70917080L9325175J4828012k1301418m1541573m1824255l1614110k1069467
$$ 170917080 210242255 225070267 203768849 162227276 120403021 88788911 67719444
8856F7719444j3927815r652761p017280n180990l920278k924251k157938j570594
$$ 67719444 53791629 44138868 37121588 31940598 28020320 25096069 22938131 21367537
8848B1367537j072044o89992m98641l45187j94796R5579M35690P10311Q90460
$$ 21367537 20295493 19605501 19106860 18761673 18566877 18662456 19098146 19808457 20698917
8839B0698917J042985J324357J776305K471526L533759N183134P662927J1602383
$$ 20698917 21741902 23066259 24842564 27314090 30847849 36030983 43693910 55296293
8831E5296293J7959139K8056521M1195110M4566293K0156543j4289427l1608398
$$ 55296293 73255432 101311953 142507063 187073356 207229899 192940472 161332074
8824A61332074k8859315j5074341J554537K0312023M5900604P9854391R6735326
$$ 161332074 132472759 117398418 118952955 139264978 185165582 265019973 361755299
8817C61755299M9261265l0742938p8930433q4105017o4575485m2626661k7268483
$$ 361755299 411016564 380273626 301343193 217238176 152662691 110036030 82767547
8810H2767547j7979920j2423646q949070o694042n081287l854439k943730k224696
$$ 82767547 64787627 52363981 43414911 36720869 31639582 27785143 24841413 22616717
8802B2616717j644069j489661j509689j431081j197245r55650o86771m14449k22422
$$ 22616717 20972648 19482987 17973298 16542217 15344972 14389322 13702551 13288102 13065680
8793A3065680j85853k39462k77987j80318K261K66089N29503P05131P48811P24957
$$ 13065680 12879827 12640365 12362378 12182060 12184321 12450410 12979913 13685044 14433855 15158812
8783A5158812Q10257J164458J780055K639634L914075N893628R056443J4420396
$$ 15158812 15969069 17133527 18913582 21553216 25467291 31360919 40417362 54837758
8775E4837758K3536490L6704043M5674386L0820918n318046l3098927m0311840
$$ 54837758 78374248 115078291 160752677 191573595 186255549 153156622 112844782
8768A12844782l3063363k2262267j3930157q910268o205853m653022l532241k604886
$$ 112844782 79781419 57519152 43588995 34678727 28472874 23819852 20287611 17682725
8760A7682725j837704j177500o13066j77168j6287j13841l98691o54028p66816
$$ 17682725 15845021 14667521 14054455 13877287 13861000 13747159 13348468 12694440 11927624
8751A1927624p95407p17526n91883n29641n44567n37825l85932k22855j5031J49449
$$ 11927624 11132217 10414691 9822808 9293167 8748600 8210775 7824843 7601988 7586957 7736406
8741G736406K89867L93437L32929J6904k86968m15557k96833n8631J39465K55141
$$ 7736406 8026273 8419710 8752639 8769543 8482575 8067018 7770185 7711554 7851019 8106160
8731H106160L93700N61919O79110Q10628R82945J237766J570417J730232J672450
$$ 8106160 8499860 9061779 9740889 10551517 11534462 12772228 14342645 16072877 17745327
8722A7745327J833767K433433K977935L354199M480557P121389J2032143K0258891
$$ 17745327 19579094 22012527 24990462 28344661 32825218 39946607 51978750 72237641
8714G2237641L2054605M1799387L5576499Q903196k0100702l4448722l3433413
$$ 72237641 104292246 146091633 181668132 190571328 170470626 136021904 102588491
8707A02588491k5461624j7770171j2357317q727013o276489m505307l192432k248784
$$ 102588491 77126867 59356696 46999379 38272366 31995877 27490570 24298138 22049354
8699B2049354j484941q94299l26592J61651N92691O18722K23267k08695l98731
$$ 22049354 20564413 19670114 19343522 19505173 20097864 20716586 20939853 20731158 20332427
8690B0332427l67142j83014K01896O25878J053602J495290J958350K537507L498172
$$ 20332427 19965285 19782271 19984167 20610045 21663647 23158937 25117287 27654794 31152966
8681C1152966M864897O649367Q646543J1136195J5779781K4566453L7524221M8196092
$$ 31152966 36017863 42667230 51313773 62449968 78229749 102796202 140320423 188516515
8673A88516515M3131624J9730777k093102k472974K1779772N5384916O1828976
$$ 188516515 231648139 251378916 249285814 246812840 268592612 323977528 385806504
8666C85806504J8377673m1148433p4495107p4326923n6752617l8743830k6313073
$$ 385806504 404184177 363035744 288540637 214213714 157461097 118717267 92404194
8659I2404194j8355846j3028544r335951o819862n122597l887164k918785k002683
$$ 92404194 74048348 61019804 51683853 44863991 39741394 35854230 32935445 30932762
8651C0932762j330555q57013m85699k22412o3362k05732n22684n35443j18440
$$ 30932762 29602207 28745194 28259495 28037083 27973721 27767989 27245305 26709862 26591422
8642B6591422N26218J110608J528336J956993K650924L752250N345941P647536
$$ 26591422 27117640 28228248 29756584 31713577 34364501 38116751 43462692 51110228
8634E1110228J0964213J5890800K4379351L9635837O3918827Q8682113Q3935131
$$ 51110228 62074441 77965241 102344592 141980429 205899256 294581369 378516500
8627C78516500L2700173k9159706n9525433n1030102k1938460O86840k337910
$$ 378516500 411216673 382056967 322531534 271501432 249562972 250249812 247911902
8620B47911902k3646295m0575841m2839745l4707328k4499092j6745190j1710550
$$ 247911902 224265607 183689766 140850021 106142693 81643601 64898411 53187861
8613E3187861q399493o231905m848290l969115l286818k637816k011438j527560
$$ 53187861 44788368 38556463 33708173 29739058 26452240 23814424 21802986 20275426
8605B0275426j223249r28501o35101m55620m35792m66039m25247k61396j9984
$$ 20275426 19052177 18123676 17488575 17032955 16597163 16131124 15705877 15444481 15424497
8596A5424497J87059L44862N46721Q16754J193828J853744K864378M297400O560685
$$ 15424497 15611556 15956418 16503139 17319893 18513721 20367465 23231843 27529243 34089928
8587C4089928J0341304J6712904K6718279L7964186L9562123K0361850j0478678
$$ 34089928 44431232 61144136 87862415 125826601 165388724 185750574 175271896
8580A75271896l2306775l7044093l0282425k0739157j3206973q342288n668572
$$ 175271896 142965121 105921028 75638603 54899446 41692473 33350185 27681613
8573B7681613m401059l591768k772786k075860j617024j296266j089682r99975
$$ 27681613 23280554 19688786 16916000 14840140 13223116 11926850 10837168 9837193
8565I837193r02850q84245p72491o23846n43832m40489l79036l16862k28789j95294
$$ 9837193 8934343 8050098 7277607 6653761 6109929 5669440 5290404 4973542 4744753 4549459
8555D549459j45013r1845q1273j61052j77763k25240k41208j94693j76656j56421
$$ 4549459 4404446 4312601 4231328 4070276 3892513 3667273 3426065 3231372 3054716 2898295
8545B898295j12974r7609r6977q1598o3907l1539L6195P6365J7581l8235l5912
$$ 2898295 2785321 2687712 2590735 2509137 2445230 2413691 2449886 2526251 2543832 2505597 2469685
8534B469685m3689j0150Q2167J54628K14757J79228l1491j56762k18121j79760
$$ 2469685 2425996 2415846 2498013 2652641 2867398 3046626 3015135 2858373 2640252 2460492
8524B460492j41125q0184p5187m6625o0143m3235n5340o0137l5207l3619N3707
$$ 2460492 2319367 2239183 2163996 2117371 2057228 2013993 1958653 1898516 1863309 1829690 1883397
8513A883397R5335J47306K15463J48504o1684k02972k19588j58907j33544j19925
$$ 1883397 1978732 2126038 2341501 2490005 2428321 2225349 2005761 1846854 1713310 1593385
8503A593385o4237o1249n6258m7601k6358l0300j8296n1299l8153O454L8446N7490
$$ 1593385 1529148 1467899 1411641 1364040 1337682 1307382 1289086 1237787 1199634 1206088 1244534 1302024
8491A302024L6196o090k8961n035n626m8143m4491J462j4873l3954J473L1284
$$ 1302024 1338220 1332130 1303169 1298134 1292508 1244365 1199874 1201336 1186463 1152509 1153982 1185266
8479A185266M8042N3127K4515J2514J214p497p776J2513k6734r918R3111K32080
$$ 1185266 1233308 1286435 1310950 1323464 1324678 1317181 1309405 1321918 1295184 1285266 1378377 1610457
8467A610457M01282M84972L27250j9315l45781m18638l43470j98411p8455J0416
$$ 1610457 2011739 2496711 2823961 2804646 2458865 2040227 1696757 1498346 1419891 1430307
8457A430307J01148J85816J47389p282j84216k10742j69474j11603m3673n8225
$$ 1430307 1531455 1717271 1864660 1857378 1673162 1462420 1292946 1181343 1137670 1079445
8447A079445l9138J7219K057k3142m8679m5467j5208l8108m7393k5755r502J3572
$$ 1079445 1040307 1057526 1059583 1036441 987762 942295 927087 888979 841586 815831 806329 819901
8435H19901L5929M9936M6930J1123p354l5270l7637l3843j9558J1932J7820L1840
$$ 819901 855830 905766 952696 963819 956465 921195 883558 849715 830157 842089 859909 891749
8423H91749P0369J63551K21943J81550K6246j34781j70219j07585k6670K5260
$$ 891749 962118 1125669 1347612 1529162 1555408 1420627 1250408 1142823 1116153 1141413
8413A141413J69422L16557M54370L91197J6743l01303m51523l63742k34699j28077
$$ 1141413 1310835 1627392 2081762 2472959 2489702 2188399 1736876 1373134 1138435 1010358
8403A010358r9784q4165n9215l8539o3558p7758l0370k0778j4264P554K4823j678
$$ 1010358 910574 826409 767194 728655 665097 587339 556969 536191 521927 529481 554304 552626
8391E52626K4123M2302Q4848R4273M0325l5197q9565r7228n0185j6813l6714k4523
$$ 552626 576749 619051 703899 798172 838497 803300 713735 616507 566322 549509 512795 488272
8379D88272k6103k4804P698K7772O063J5881k2227l8944K067K0980O6151J14606
$$ 488272 462169 437365 445063 472835 478898 494779 472552 433608 435675 456655 522806 637412
8367F37412J63103K28690K05945M3676j11208j63400j78877j50968n2615l2777
$$ 637412 800515 1029205 1235150 1278826 1167618 1004218 825341 674373 621758 588981
8357E88981n5561n2518m6990l9719r118r657l7961k4257J110J8005N3174L0466
$$ 588981 533420 480902 433912 394193 385075 375418 337457 313200 314310 332315 385489 415955
8345D15955J0756L3089L2538Q881m1623o0263k5349q053p93K780p838j4000m9079
$$ 415955 426711 459800 492338 501219 459596 399333 373984 365931 365138 367918 360080 346080 297001
8332B97001k5238J3728J6618j1488j5784o99P489j9641p022K2355K7873P794J6942
$$ 297001 271763 285491 302109 290621 274837 274138 281627 261986 254964 277319 305192 312986 329928
8319C29928L3568K2096K112J9402K4942N1286L3572K0818J5532N4086J33462J90382
$$ 329928 363496 385592 387704 407106 432048 483334 516906 537724 553256 607342 740804 931186
8307I31186J93471J31461M816r4822j90157j96869j42355q0720o7901m3369k9987
$$ 931186 1124657 1256118 1260934 1166112 975955 779086 636731 556011 488110 444741 414754
8296D14754n1450j0155k33k8018j4414p256K8205J179l664o955q372K5019l058
$$ 414754 363304 353149 352916 324898 310484 303228 331433 332612 328948 321993 313621 338640 335582
8283C35582O835N112r545J7589n169j4668M2742O0232L0035J2534M5847N9467
$$ 335582 342417 347529 337984 355573 350404 335736 378478 438710 468745 481279 527126 586593
8271E86593Q4732J46543K27079K83705K42078J04600j4710j5015J32018K75749
$$ 586593 671325 817868 1044947 1328652 1570730 1675330 1660620 1645605 1777623 2053372
8261B053372K75250K2570k63410m16918l81939k70210j96620j27548r4565q9118
$$ 2053372 2328622 2351192 2087782 1670864 1288925 1018715 822095 694547 599982 510864
8251E10864o9940n2329k8233m3681j8981J7143J8128J2659l7828N026K691j1246
$$ 510864 440924 388595 360362 316681 297700 314843 332971 345630 307802 312828 315519 304273
8239C04273j0460J8248K7201k5886J7782L0674J2563j0539K2003L3980M6583N5417
$$ 304273 293813 312061 339262 313376 331158 361832 374395 363856 385859 419839 466422 521839
8227E21839Q1865J43754K50778M16378M73138L66916P3160k27411l23681k05573
$$ 521839 603704 747458 998236 1414614 1887752 2254668 2327828 2100417 1776736 1571163
8217A571163j16165k2945l6830j45347k21277k41677j94289j06288j03266q1693
$$ 1571163 1454998 1432053 1395223 1249876 1028599 786922 592633 486345 383079 301386
8207C01386l6314j7364P93n14q913j9638P266P849n770q250m483L827J2126M890
$$ 301386 265072 247708 248501 247987 239074 219436 226702 234551 228781 220531 216048 219875 232001 236891
8193B36891j712M395K303J001k8728l5915L3883m287J9644L3903K3957L0729M3507
$$ 236891 235179 239574 241877 242878 214150 178235 212118 207831 227475 261378 285335 316064 359571
8180C59571R7897J52101K18649J76855O0740o7850j74881k02120j53002r2034
$$ 359571 457468 609569 828218 1005073 1065813 997963 823082 620962 467960 375926
8170C75926o2177n7570l9316l5250j8447j1055j4736l6008L2665J4661J249j7764
$$ 375926 313749 256179 216863 181613 163166 152111 137375 101367 134032 148693 149942 132178
8158A32178j6228k4348j0304P889L1709l425J860n150j4383J6830K4222J1323
$$ 132178 115950 91602 81298 89187 120896 117471 119331 114181 99798 116628 140850 152173
8146A52173j2497J5563J1438l7405k1845j1905j7466L3576j1687m955M6687J5618
$$ 152173 139676 155239 166677 129272 107427 95522 78056 111632 99945 94990 141677 157295
8134A57295j1117o938O35k2273n775l848k3991j7808J6129J3551k3975J3356K8838
$$ 157295 146178 139240 139875 117602 111827 107979 83988 66180 82309 95860 71885 85241 114079
8121A14079J3403k9529o152Q81j4808k0673R541N1949J2648k5854k0453r97M496
$$ 114079 127482 97953 91801 92682 77874 57201 66742 118691 131339 105485 85032 84035 88531
8108H8531k390j941L688J6899K7323M467l1156m302L986J9603K0464o960j2336
$$ 88531 86141 84200 87888 104787 132110 136577 105421 101119 105105 124708 145172 138212 125876
8095A25876J6084K9056k2785n4148j1174J061J2437J9144Q637l1675K883M536
$$ 125876 141960 171016 148231 94083 82909 83970 96407 115551 124188 92513 95396 99932
8083I9932p076j6025m655k576J9147j4313J6863K2364k4221l976J2853R934M936
$$ 99932 92856 76831 72176 69600 88747 74434 91297 113661 89440 85464 98317 108251 113187
8070A13187M901l0964j516Q511K3869n854l2415k5911R763K5906o007J2245K7073
$$ 113187 118088 87124 85608 94119 117988 112134 79719 53808 63571 89477 83470 95715 122788
8057A22788j5865L447K2414K393K898J1215J2206j3566n7525L559K1598j4453
$$ 122788 106923 110370 132784 135177 138075 149290 161496 147930 90405 93964 115562 101109
8045A01109Q402K2712j8672J728j2948r030j7136p70J383N151l254J6223J5637
$$ 101109 109511 132223 113551 115279 102331 93301 76165 75395 76778 81929 78675 94898 110535
8032A10535Q45q450J99l3783k3462K4829M9862J7459j1401O670Q760K567j6826
$$ 110535 111380 102930 103129 69346 45884 70713 120575 138034 126633 133303 142063 144630 127804
8019A27804M85O710j7595k7208k2021O736J4619M967L078J4351J0262M1324k090
$$ 127804 128289 134999 117404 90196 68175 74911 89530 94497 97575 111926 122188 163512 161422
8006A61422j5327L5553L7310q774j2983j5121m6686j1090j2113m3919j2183K79
$$ 161422 146095 181648 218958 210184 197201 182080 135394 124304 112191 68272 56089 56368
7994E6368k1186o989L1532L3485k008J429J4249l2332j2167N262J4744M4634l622
$$ 56368 35182 28193 59725 93210 91202 92631 106880 74548 62381 67643 82387 127021 123399
7981A23399k8524k063q602K2700O561q815j1493k9417k3808J8286J0323M370J0811
$$ 123399 94875 92812 84210 106910 113471 104656 93163 63746 39938 58224 68547 72917 83728
7968H3728j6090L057n330N967J4623j6559J602j5569R760J8974L9415J8901K0622
$$ 83728 67638 70695 65365 71332 85955 69396 70998 55429 65189 84163 123578 142479 163101
7955A63101j438k7004r621l2412j9018J2873n554J120m908j6369P339K4826j0113
$$ 163101 161663 134659 125038 92626 73608 86481 80927 82047 77139 60770 68109 92935 82822
7942H2822J814j4127n358r715r059m046M148j8983P960K2948J7935L443L888K0774
$$ 82822 84636 70509 65151 55436 46377 42331 46479 27496 35456 58404 76339 79782 83670 104444
7928A04444J6341j5408j4963k0799M3342J789o369j3981K2065j8788p361P224
$$ 104444 120785 105377 90414 69615 112957 114746 108377 94396 116461 97673 90312 97536
7916I7536p46l4637o008J6335J7170j8062l3773M601K4852K2438K3103j1190k2215
$$ 97536 96790 62153 56145 72480 89650 71588 37815 42416 67268 89706 112809 101619 79404
7903G9404k9514j0530K4153J0022n064m765p664l397p12J3963k798j372j1960
$$ 79404 49890 39360 63513 73535 68471 63706 56042 52645 51933 65896 63098 61726 49766
7890D9766P811J9348K9014P07m4870k5K3180M280j3556j8392j1855J127j5997
$$ 49766 57577 76925 105939 106646 61776 61751 84931 89211 75655 57263 45408 46535 30538
7877C0538J2445K8862o516k0272l4567M559J4907n018r314K0512K9175J6317k2532
$$ 30538 42983 71845 65329 45057 10490 15049 29956 24938 15624 36136 65311 81628 59096
7864E9096l0875j8831J4435K4845J4481p532l4469k884r193j9471K4812J1206
$$ 59096 28221 9390 23825 48670 63151 55619 21150 18266 9073 -10398 14414 25620
7852B5620Q340J6019J4828K779j3607k671K138q749J2081q87k4702k458M232K5716
$$ 25620 33960 49979 64807 67586 53979 51308 53446 44697 56778 55891 31189 28731 32963 58679
7838E8679j6620k6859J6535l3228j4796K0994K1757K5133M781j7822j3664N058
$$ 58679 42059 15200 31735 -1493 -16289 4705 26462 51595 56376 38554 24890 29948
7826B9948q813O18O394j4196o483J624K5227K0855M191j2236j0874J3130q89j5549
$$ 29948 21135 21753 28147 13951 7468 9092 34319 55174 59365 47129 36255 49385 48496 32947
7812C2947j0771R204M876o334j6039n963K1571K8977j5859k8713n190J9682K167
$$ 32947 22176 31380 36256 29922 13883 7920 29491 58468 42609 13896 8706 28388 30555
7799C0555P063J6603K4364K7028o975k8727m0750j4669N756J0452o11k7240k1946
$$ 30555 37618 54221 78585 105613 98638 69911 29161 14492 20248 30700 30089 2849 -19097
7786a9097L5620L1126k3470J2358Q625p452J0528J0831l1855o236L946m904p40
$$ -19097 16523 47649 24179 36537 45162 37710 48238 59069 27214 20978 24924 20020 19280
7773A9280j6593J0630L0874P2j1188m17j443J0127L87M49J9349j4724O691J7866
$$ 19280 2687 13317 44191 44263 33075 32658 31215 41342 41729 42178 61527 46803 53494 71360
7759G1360m022p558k0696n096J614k1407j5911J4437K4399j0107J3773L173k4296
$$ 71360 67338 59780 39084 33988 35602 14195 -1716 12721 37120 27013 40786 43959 19663
7746A9663j950J4669J1936K5405J8143k7308r711q329q528l5793l379K9950J3004
$$ 19663 17713 32382 44318 69723 87866 60558 50847 42518 33990 -1803 -5182 24768 37772
7733C7772K9291N62k6292m1485M938J2103N389M356K226P039R819j8023k4136
$$ 37772 67063 67625 41333 -152 4786 16889 22278 26634 28860 35899 45718 27695 3559
7720C559R684J2092L413J5020k0321k5393K3469J3569l624j7766j8694k524p632
$$ 3559 13243 25335 28748 43768 23447 -1946 21523 35092 31468 13702 -4992 -7516 -15148
7707a5148J9308L5678q058L45J8168j372m673N941J580q722p880n314j3062N647
$$ -15148 4160 39838 31780 32125 50293 48921 44248 50189 51769 43047 35167 29853 16791 22438
7693B2438J7142J5558J1260j8658j8103Q852j0557j5693J1880Q577l9180m578
$$ 22438 39580 55138 66398 47740 29637 38489 27932 12239 24119 32696 -6484 -11062
7681a1062L548M296Q814j9865k2314K7894N647J0294r324M587R796o94k3455j3707
$$ -11062 -7514 -3218 5596 -14269 -36583 -8689 -3042 7252 -2072 2515 12311 11617 -11838 -25545
7667b5545J6080N039K0718K0800K0784l371m2718n299k809r281L2001J5853l5145
$$ -25545 -9465 -4426 16292 37092 57876 54505 11787 6488 3679 -5602 26399 42252 7107
7654G107L414J3923r599O863Q779o924j7061p894J4313K3191L3882N63N735j6777
$$ 7107 10521 24444 14845 21708 30487 23563 6502 -1392 12921 36112 69994 70557 76292 59515
7640E9515j7104j7595j2646M533Q567o066j5172J7912k3777j6992K013j6401j1986
$$ 59515 42411 24816 12170 16703 25270 19204 4032 21944 -1833 -18825 -16812 -33213 -45199
7627d5199J1046K3990j0057n488J2294L4332j4674K9598n691k6823j616K8969
$$ -45199 -34153 -10163 -20220 -25708 -13414 20918 6244 35842 30151 3328 1712 30681
7615C0681o898j9295L411J7581J2006J5643q190J3244r768Q729R0R121q614j6480
$$ 30681 23783 4488 7899 25480 37486 53129 44939 58183 48415 57144 57234 66355 57741 41261
7601D1261l3333k3308j6481l2333j0312K3890p606n23J2016j1006J6772M7714
$$ 41261 7928 -15380 -31861 -64194 -74506 -50616 -58222 -58745 -46729 -57735 -40963 6751
7589F751K631J1299j70l2772L0350Q039j2816k55l491l168J4850J7649j2375p746
$$ 6751 9382 20681 20511 -12261 18089 26128 13312 13057 9566 6398 21248 38897 26522 18776
7575A8776n078M343N651J0900o960k901j0198J6082J2869L563j5250j243j0468
$$ 18776 13698 18041 23692 34592 27632 24731 14533 30615 43484 47047 31797 30554 20086
7562B0086j480J0701Q380j3874l05p257j3211J0870K1562J098j5172k722K113
$$ 20086 18606 29307 37687 23813 23508 16251 3040 13910 35472 36570 21398 18676 20789
7549B0789J3149M290k8562Q369J66L054J038j067j188j4666M366J5049j2931k5738
$$ 20789 33938 38228 9666 18035 18201 21255 22293 21226 20038 5372 9738 24787 11856 -13882
7535a3882J5012J9813K1407j4641k7907j327k176n832k1652Q45K8600K2224j1798
$$ -13882 1130 20943 42350 27709 -198 -1525 -3701 -9533 -31185 -30340 -1740 20484 8686
7522H686j6648K1230M6019n953k6312k8981K529j0749J6689J9343J3064l0960
$$ 8686 -7962 13268 59287 53334 27022 -1959 570 -10179 6510 25853 38917 7957
7510G957J851L733p543l2259k1250L0853K2242q435n1565K1438M2211J8058l298
$$ 7957 9808 13541 5998 -26261 -47511 -16658 5584 -2851 -54416 -32978 9233 27291 23993
7497B3993K7555M2k0507j6296J9069j362k5174M565J2289L457j2898o24O581o538
$$ 23993 51548 51590 31083 14787 33856 32494 7320 11885 24174 27631 14733 14109 20690 14152
7483A4152J0696K4762j2766k2417j485k52k2674M76k1909K8745K1515l268J7467
$$ 14152 24848 49610 36844 14427 12942 12690 -9984 -9508 -31417 -2672 18843 15575 33042
7470C3042l751j4960k033r649O691k1021K9456j0736l9828j2988J6666N6457R249
$$ 33042 29291 14331 12298 2649 9340 -11681 17775 7039 -32789 -45777 -29111 27346 36595
7457C6595j7070j8118p486k0420k446l793K5376K763p976m152N872K7927M405
$$ 36595 19525 1407 -6079 -26499 -28945 -32738 -7362 -4599 -12575 -16727 -10855 17072 21477
7444B1477J6340j4462l4200J0664K6247J1918l2896m4088q275J9060K0044J6100
$$ 21477 37817 23355 -10845 -181 26066 37984 5088 -39000 -47275 -28215 -8171 7929
7432G929Q105j5467r632k3591n22M1797J6711l0719j7286M0005j8671m6502J6948
$$ 7929 16034 567 -9065 -32656 -33178 8619 25330 -5389 -22675 17330 -1341 -47843 -30895
7419c0895Q729k3040R09L6587J2481j1549K739K2560J4036K6033j9177k3598j183
$$ -30895 -22166 -45206 -44297 -7710 4771 -6778 -4039 18521 32557 58590 39413 15815 14632
7406A4632o616K7268j5255k8528k8714n962J8066K6108K2499j6453q359p423M289
$$ 14632 8016 35284 20029 -8499 -37213 -43175 -25109 999 23498 7045 -1314 -8737 -4448
7393d448r046Q123J3074Q840J9175j9916k1848N033K011j7082o843o976O837L3602
$$ -4448 -13494 -5371 7703 16543 35718 15802 -6046 -1013 998 -16084 -22927 -29903 -23066 10536
7379A0536L4901K761J8795k8506m7563O010l295q155p557O738L265n264l4974
$$ 10536 45437 48198 66993 38487 -9076 -3066 -6361 -14516 -22073 -15335 -12070 -17334 -52308
7366e2308k949J9965L452j5639O017K0649J7140M6133J507n0553j4984k082p91
$$ -52308 -55257 -35292 -31840 -47479 -41462 -20813 -3673 42460 43967 -6586 -21570 -23652 -24443
7353b4443K0235J6800J1226J6452j4218k8905j167J9851K425j2786q315j4219
$$ -24443 -4208 12592 23818 40270 26052 -2853 -4020 15831 18256 5470 -2845 -17064
7341a7064K1989l60j569k3650R468J8647n814K1461j5143n263K1507J0979n911
$$ -17064 4925 4565 2996 -20654 -11186 7461 1647 23108 7965 2702 24209 35188 29277
7328B9277L1344J2210n2784n0867J2470J8370J7234k9699k4599L7563P050j4867
$$ 29277 60621 72831 20047 -30820 -18350 20 17254 -12445 -37044 519 7569 -7298
7316g298O415J2558q114l01m143N786P801j0720q693J4103M9961p555l6953k9792
$$ -7298 -883 11675 3561 3260 -883 4903 12704 1984 -6709 7394 57355 49800 12847 -16945
7302a6945J3781n73k862q647J4988j810J917K4160j6579j8668J777j0646J6907
$$ -16945 -3164 -3737 -6599 -15246 -258 -2068 -151 24009 7430 -11238 -9461 -20107 -3200
7289c200J8877q164q683n635j1135n255J4972N369J0008K7617M953k2142J7051
$$ -3200 15677 7513 -1170 -6805 -17940 -23195 -8223 -2854 7154 34771 39724 17582 34633
7276C4633K782r958j1457j1762j1321k0574M1R679L942q717j1365J8532J1208
$$ 34633 37415 27457 16000 4238 -7083 -27657 -27616 -17937 -13995 -22712 -34077 -15545 -4337
7263d337j5775j8103J1046K2446J0849J3031p780j3429l41m121l985O779K638
$$ -4337 -20112 -38215 -27169 -4723 6126 19157 11377 -2052 -2393 -6514 -10499 -3720 -1082
7250a082R266J9182K9607l5430j2333K2909K1757M53j7089k6815O194J2431l7899
$$ -1082 8184 27366 56973 21543 9210 32119 53876 54329 37240 10425 16619 29050 -8849
7237h849n066m376P439L4395m536K999P619J9029k1773k3805k5786j6853J3955
$$ -8849 -13915 -18291 -10852 23543 19007 22006 29625 48654 26881 3076 -22710 -39563 -25608
7224b5608k0598J4911L0106k665q082K3735J2386o940J0402J7782j7194N301n839
$$ -25608 -46206 -31295 -1189 -3854 -11936 11799 24185 17245 27647 45429 28235 33536 27697
7211B7697j1193j9791j5167j879o426p938P408K8606L1013p729l5023K279J8744
$$ 27697 16504 -3287 -18454 -20333 -26759 -34697 -27289 1317 32330 24601 -10422 -8143 10601
7198A0601o218J3651K425N308P052o090J8995J2515k7697l2606L412O168l0025
$$ 10601 4383 18034 20459 25767 32819 26729 45724 58239 30542 -2064 1348 7516 -22509
7185b2509m2991J945J3875J7619K1799J874j0462J4081N350j6766R821k9R283
$$ -22509 -65500 -63555 -49680 -32061 -10262 -8388 -18850 -4769 581 -16185 -6364 -6393 2890
7172B890l845P529K0497J6397L856j1456l065J5619j5654j6745l847K1368N926
$$ 2890 -955 6574 27071 43468 47324 35868 32803 48422 32768 16023 12176 33544 39470
7159C9470j7010N128O582p09j128J6079J726q696m2093j7674K6968K0887l248
$$ 39470 22460 27588 34170 33461 32333 48412 50138 41442 -651 -18325 8643 29530 26282
7146B6282o013k0734O511J5509j4126k2411j1845L330K815J0381j637k9364M01
$$ 26282 20269 -465 6046 21555 7429 -14982 -26827 -23497 -20682 -10301 -11938 -41302 -40901
7133d0901O001N275r27N862k5267r555K6486K668k53L4210K4320M132J4367k470
$$ -40901 -34900 -29625 -30552 -24690 -49957 -59512 -33026 -30358 -30611 3599 27919 32051 46418 43948
7119D3948k3302n939n657k6011k3521J5613j6944K1731J4636J3427K4128J3724
$$ 43948 20646 14707 9050 -16961 -40482 -24869 -41813 -20082 -5446 7981 32109 45833
7107D5833j8155J1919q279M105q758j2477k0660n132O350k0070o497j0640o951
$$ 45833 27678 39597 31318 35423 26665 14188 -6472 -11604 -5254 -25324 -31821 -42461 -49412
7094d9412P068K2476J5599L801m290l72l574N603j962J442K464j3559N726L451
$$ -49412 -42344 -19868 -4269 -468 -4758 -5130 -8704 -3101 -5063 -3621 -1157 -14716 -8990 -5539
7080e539l0396J7431K3529J3374K950n518K8792L677m421p0K639l7283m933k3395
$$ -5539 -35935 -18504 5025 18399 21349 15831 44623 48300 43879 43809 46448 9165 4232 -19163
7066a9163o744J5966l192r852r78Q8K9526L521J1201l4532n218J4886j976j4311
$$ -19163 -25907 -9941 -13133 -22985 -23963 -23875 5651 9172 20373 -14159 -19377 -4491 -6467 -20778
7052b0778R906Q714O061Q329J2076J4960R309J4577j3828j2694o48J0627k2351
$$ -20778 -10872 -2158 3903 12232 24308 39268 48577 63154 49326 36632 35984 46611 24260
7039B4260k6716J934J007q909J8624M0977j0104j4849j5919J7878o307k3541n256
$$ 24260 -2456 -522 485 -8424 10200 51177 41073 26224 10305 28183 21876 -1665 -6921
7026f921k219n703J3463J7936N453j5687k7482Q569M68l098K1575j6354k3847
$$ -6921 -9140 -14843 -1380 16556 22009 6322 -21160 -12591 -12123 -15221 6354 -10000 -33847
7013c3847o82J1917j0583J0960J3441L0420j9449Q723j4678j5671J9310O149k5172
$$ -33847 -34529 -22612 -33195 -22235 -8794 21626 2177 10900 -3778 -19449 -139 6010 -19162
7000a9162r75K9433K4435n95j3005K374L800m547j9057j0546P436k4996L1586
$$ -19162 -20137 9296 33731 33136 20131 22505 26305 21758 2701 -7845 -409 -25405 6181
6987F181R839j6292J3880K7123J5573J5393j3353j8282k1219o257j3484k1562
$$ 6181 16020 -272 13608 40731 56304 71697 58344 40062 18843 12586 -898 -22460
6975b2460j3711k423O935m93j1592j5759O244K377K37J1771K3265K3155J9879
$$ -22460 -36171 -38594 -31659 -32152 -43744 -59503 -53259 -50882 -50645 -38874 -15609 7546 27425
6962B7425j5915N715l356j2871o478L0797J7331m0241j4097K3665K8607k4699
$$ 27425 11510 17225 13869 998 -5480 25317 42648 2407 -11690 11975 40582 15883
6950A5883n216J186m643R317j2438j0264Q007Q798Q146P591l0174j5889j5285
$$ 15883 10667 11853 7210 16527 4089 -6175 1832 10630 18776 26367 -3807 -19696 -34981
6937c4981J2375O016r114K369K6186R870k1489j2487j47j4060j3348N952K7818
$$ -34981 -22606 -16590 -25704 -23335 2851 12721 -8768 -21255 -21402 -35462 -48810 -42858 -15040
6924a5040O55j016K9158K1426k1398j6544j9908J7742Q3j9194o51k587N362O811
$$ -15040 -14385 -15401 13757 35183 13785 -2759 -22667 -4925 -4842 -24036 -24687 -27274 -21912 -15101
6910a5101L351p201j1456J2859K7255P305J934j8184j127K0231K9173n738q548
$$ -15101 -11750 -18951 -30407 -17548 9707 17012 18946 762 -365 19866 49039 43301 34753
6897C4753j8323k5918m201o270K969J9091q982l3528J6093J2541j0345L090n551
$$ 34753 16430 -9488 -13689 -19959 -16990 2101 -6881 -40409 -24316 -11775 -22120 -19030 -24581
6884b4581o519k700k030Q119j9063J9840K1133r308J2029q16J9863J8324j1890
$$ -24581 -31100 -33800 -35830 -27711 -46774 -26934 -5801 -15109 -3080 -3896 15967 34291 22401
6871B2401j467r888o254o7R066M502m240k1362K171J2433J9360L1302m560k6522
$$ 22401 20934 11046 4792 4725 13791 18293 14053 -7309 -5138 7295 26655 57957 53397 26875
6857B6875k164Q316J2697q365k286J5783k8589k1507L626Q67j8336l208K5102
$$ 26875 24711 33027 45724 37359 35073 50856 22267 760 4386 5253 -13083 -16291 8811
6844H811R834k180k2208j0389L896J2334j550J8317n019j0727n793j3500m596
$$ 8811 18645 16465 -5743 -16132 -12236 98 -1452 16865 11846 1119 -4674 -18174 -22770
6831b2770N651K4804P562q859O1L722l8488O192K3395P290K9705l925r691p15
$$ -22770 -17119 7685 15247 6388 6449 10171 -28317 -22125 1270 8560 38265 34340 24649 23934
6817B3934k0582l6095q609K0252J9997J178K314O56j6270k5190J1524L0851J2735
$$ 23934 3352 -32743 -41352 -21100 -1103 75 2389 3045 -13225 -38415 -26891 3960 16695
6804A6695J98j8791j9113J0920j0272j7835K0378L6447j8579l901m136k4867J6869
$$ 16695 16893 -1898 -21011 -10091 -20363 -38198 -17820 18627 48 -3853 -7989 -32856 -15987
6791a5987J6058P805j5015j4210j1879n788K750J2071K7244r055k869m42k1200
$$ -15987 71 7876 -7139 -21349 -33228 -39016 -36266 -24195 3049 -6006 -8875 -9317 -30517
6778c0517O362k4520n467J7689n984k0732J9743L0283J0201N834p100R175M0558
$$ -30517 -24155 -48675 -54142 -36453 -42437 -63169 -43426 -13143 -2942 2892 -4208 4967 45525
6765D5525J1759m491l5641m195o3Q519K4995K7247p748l8304q927K0700J9556
$$ 45525 57284 52793 17152 12957 12894 21413 46408 73655 65907 27603 18676 39376 58932
6752E8932j8271q670l190k0729k7904j2918O803L421O818n949L933k4109j0756
$$ 58932 40661 31991 28801 8072 -19832 -32750 -25947 -22526 -15708 -21657 -17724 -41833 -52589
6739e2589J9322J9545q612R969J2436k908N561K5883k6567r110J6251K8252n246
$$ -52589 -33267 -13722 -22334 -12365 71 -2837 2724 28607 2040 -7070 9181 37433 32187
6726C2187J650k625r675O902Q313N774p215j4101k5160k0210Q91K7120K0558J4004
$$ 32187 33837 31212 21537 28439 36752 42526 35311 21210 -3950 -24160 -23269 3851 24409 38413
6712C8413J3596M926k4097p370M243R252J3002q479j2485O834k417k655q784k2214
$$ 38413 52009 56935 32838 25468 29711 38963 51965 43486 31001 37835 35418 32763 23979 1765
6698A765O603o342k9152J525M257R541L049K5222m24J524K344M658j027j7640
$$ 1765 8368 2026 -27126 -25601 -21344 -11803 -8754 16468 16044 17568 19912 24570 23543 5903
6684E903r228k743J0316L517J8673K2757R936j3330k3568l1718l4311j277N25
$$ 5903 -3325 -6068 4248 7765 26438 49195 59131 45801 22233 -9485 -43796 -45073 -44548
6671d4548K7634K2683K8139J9149j9569k4364k4536N808J6661j4356m124K8864
$$ -44548 -16914 5769 33908 53057 33488 9124 -15412 -9604 7057 -7299 -11423 17441
6659A7441K7730J8739J6559l0271r591n071j0080N18P186r990p859j0329j3333
$$ 17441 45171 63910 80469 50198 40607 35536 25456 25974 33160 23170 15311 4982 -8351
6646h351J4000K0212r637j2114m599J1955n78Q530L374p201l0985p825j0977J3967
$$ -8351 5649 25861 16224 4110 -489 11466 10888 19418 22792 15591 -15394 -23219 -34196 -20229
6632b0229k4Q012p35j6631M158K6932R137j6996J2599J9479m807l720k3039l0548
$$ -20229 -20253 -12241 -12976 -29607 -25449 1483 10620 -6376 6223 25702 20895 17175 -5864 -36412
6618c6412n975J0366K2307j7836l067J3817m711r985n643P757m377r315J9933
$$ -36412 -42387 -32021 -9714 -27550 -30617 -16800 -21511 -31496 -37139 -29382 -33759 -43074 -23141
6605b3141L0768j8425j0069M412M733J6609M503j2711k3514j4439O527l614N644
$$ -23141 7627 -10798 -20867 -16455 -11722 4887 9390 -3321 -26835 -41274 -34747 -38361 -32717
6592c2717L4878L7267j5217k3704l251j1754N272r62O935j7884O880R062p73K7950
$$ -32717 2161 39428 24211 507 -2744 -14498 -9226 -10188 -3253 -21137 -14257 -5195 -5968 21982
6578B1982K0467j0985p546l2033l5279J9588K8490J7527j4841j4386J134J0676
$$ 21982 42449 31464 23918 -8115 -43394 -23806 4684 22211 7370 -7016 -5882 4794
6566D794K3276O221j5722J762J6264K436n735k8199k2430n923k0035J3424K9947
$$ 4794 28070 34291 18569 20331 36595 39031 33296 5097 -17333 -23256 -43291 -29867 80
6553H0j0523m901l741k5195K9403K3301M78m4719o145J8168n531o646J9282J2297
$$ 80 -10443 -15344 -19085 -44280 -14877 8424 8902 -35817 -41962 -23794 -29325 -35971 -16689 -4392
6539d392j836r478J8580p354J6839j453k99o657n266k1393Q996K0118J0187k4828
$$ -4392 -6228 -15706 2874 -4480 12359 10906 10607 3950 -1316 -22709 -13713 6405 16592 -8236
6525h236j3796j6217J832L443j3063N2J8549J0429K2256J9400K0463J3402N226
$$ -8236 -22032 -38249 -36417 -32974 -46037 -45985 -27436 -17007 5249 24649 45112 58514 63740
6512F3740p228j0408P831l692j46l1435k2929l004j559J015q112J9326K4379J1599
$$ 63740 56512 46104 53935 50243 50097 18662 -4267 -7271 -8830 -7815 -15927 3399 27778 39377
6498C9377j6610k2750l229j0536j7364q723j1505k318K0280k874J6530N364L3532
$$ 39377 22767 17 -3212 -13748 -31112 -39835 -51340 -53658 -33378 -36252 -19722 -14358 19174
6485A9174P665o8789n1290K9345L8787J9077l971j2442l6787R521J3201J6892
$$ 19174 26839 -41950 -93240 -63895 -25108 -6031 -10002 -22444 -59231 -49710 -36509 -19617
6473a9617M5199j2473J4458K5985m120j1614j8282J8876n721n769m358k9245k2262
$$ -19617 25582 13109 27567 53552 49432 37818 19536 38412 32691 26922 22564 -6681 -28943
6460b8943R351J1058L828m188J8202O800k0429N124J0295r139k688q245j2853
$$ -28943 -19592 -8534 -4706 -8894 9308 16108 -4321 803 11098 1959 -729 -8974 -21827
6447b1827J8319l522q535J8628k3585r971J8505J0477O519K8802J280k9638k5648
$$ -21827 -3508 -7030 -15565 3063 -20522 -30493 -11988 -1511 5008 33810 35090 5452 -20196
6434b0196J642J3485k730P339j2245k578O966j597j0291Q520J7311J4520J3901
$$ -20196 -18554 -5069 -7799 -460 -12705 -15283 -8317 -9914 -20205 -11685 5626 20146 34047
6421C4047k5002K834m624k3776J0967l258j123j1822K3267J731p911J5880j0668
$$ 34047 9045 11879 7255 -16521 -5554 -8812 -9935 -21757 1510 3241 -4670 11210 542
6408E42n435M774N673J77R250p105j1955m459N8j5958P559j7831J2037N224l694
$$ 542 -4893 -119 5554 5731 14981 7876 -4079 -8538 -8480 -24438 -16879 -34710 -22673 -17449 -21143
6393b1143j1111j3695M840r822n746p860J5294P591K166O015K7238N112q956N560
$$ -21143 -32254 -45949 -41109 -50931 -56677 -64537 -49243 -41652 -39486 -33471 -6233 -1121 -10077 -4517
6379d517o864l7930j595J5892J7814K6686L1644l85K688Q076j3785k3033n65p877
$$ -4517 -11381 -49311 -50906 -35014 -17200 9486 41130 40745 43433 51509 37724 14691 14126 6249
6365F249l4858Q86Q985K2814p162k4071r065o63M667J0390L900J2642j5389Q016
$$ 6249 -28609 -27723 -18738 4076 -3086 -27157 -36222 -36885 -32218 -21828 -17928 -5286 -20675 -12659
6351a2659l557o041K341j445j0712k747K476k488M516j7065q543L967q368J9433
$$ -12659 -16216 -22257 -19916 -21361 -32073 -34820 -32344 -34832 -30316 -47381 -55924 -51957 -60325 -40892
6337d0892M4638K6132k7089l2072l1943j0471K0745o493L2825J5250j8807J0936
$$ -40892 3746 29878 2789 -29283 -61226 -71697 -50952 -57445 -24620 -9370 -28177 -17241
6325a7241k471m1981l2767L3562L5411r579j6365J8330M5687Q392k2871K814K149
$$ -17241 -19712 -61693 -94460 -60898 -25487 -35066 -51431 -33101 12586 20978 -1893 921 3070
6312C070L234q056j6228o589j142N258J0346J182k2207q018L953K4900j781j8977
$$ 3070 6304 -1752 -17980 -24569 -25711 -20453 -10107 -8925 -31132 -39150 -35197 -10297 -12078 -31055
6298c1055J5300K9330L1326n862n896j2744j6507R292l594m514j1965p31J1487
$$ -31055 -15755 13575 44901 39039 33143 20399 3892 13184 9590 5076 -6889 -7620 3867
6285C867j4640l852J3958r448J005J0880J8503q567j3595M297j952k9938R275
$$ 3867 -10773 -14625 -667 -10115 -9110 1770 20273 11706 -1889 2408 456 -29482 -20207
6272b0207j1703q346N850J1029r997J5748M314k6498O872j3367m660K0078J2253
$$ -20207 -31910 -40256 -34406 -23377 -33374 -17626 -13312 -39810 -32938 -46305 -50965 -30887 -18634
6259a8634K9703j8055j2757j1239k6m729m162j5013o096K642k0496K1871K5016
$$ -18634 11069 -6986 -19743 -30982 -31008 -35737 -39899 -54912 -61008 -58366 -78862 -56991 -31975
6246c1975K6773L6064l3847j6966J2008L627j3776k1161J8730N266J2685O87j4878
$$ -31975 -5202 30862 -2985 -19951 -7943 -4316 -18092 -39253 -20523 -15257 -2572 -1885 -16763
6233a6763J6049J9460n213k904R809k1092j5460j5503J6828M384r974K381J8702
$$ -16763 -714 18746 13533 10629 20438 -654 -16114 -31617 -14789 -10405 -20379 -17998 704
6220G04K2257K008m944k779O78j9442O220Q529K8658J0083j3083j9991P839j3002
$$ 704 22961 24969 20025 17246 17924 -1518 4702 13231 41889 51972 38889 18898 26737 13735
6206A3735J0193K261o515k1995M756O792q633J6600j1422k6496j9289K4307J4362
$$ 13735 23928 26189 19674 -2321 2435 9227 594 17194 5772 -20724 -40013 -15706 -1344
6193a344J0960l2689l4953N495L1882m99j165q79m12j1372J3154K4217Q640k2280
$$ -1344 9616 -23073 -58026 -52531 -20649 -21148 -22313 -23192 -23604 -34976 -21822 2395 11035 -11245
6179a1245l4373p943K6712j58J7819k10M873J1659k619k682k648l0122M185Q501
$$ -11245 -45618 -53561 -26849 -27007 -9188 -9398 -4525 7134 4515 1833 -815 -30937 -26752 -18251
6165a8251J9711J2344k0812R517k40k566P500q289k0762N203K9326P780k6550
$$ -18251 1460 13804 -7008 2509 2269 -297 7203 -1086 -21848 -16645 12681 20461 -6089
6152f089k5068L0975K4596j556k9698J131n325k9358r190l090J4674J8279k1551
$$ -6089 -31157 -182 24414 22858 -6840 -5709 -11034 -40392 -49582 -52672 -37998 -19719 -41270
6139d1270o776J3809O694o50p9J6655n787l9033J212J6200J1767j4952K492N592
$$ -41270 -48046 -34237 -27543 -28193 -28272 -11617 -17404 -56437 -55225 -39025 -27258 -42210 -39718 -34126
6125c4126k1696m387J0282J9444K3368l2607P275J689N509N87K9830M144j733
$$ -34126 -55822 -60209 -49927 -30483 -7115 -39722 -32447 -30758 -25249 -24662 5168 9312 7579
6112G579m169O249k8362l4601o812l57J4620M0041J973k581k3321o395n110J1882
$$ 7579 3410 9659 -18703 -53304 -60116 -60473 -45853 -5812 -3839 -6420 -29741 -36136 -41246 -29364
6098b9364L443K1070K3255j0886j1408L2681L372l7694k8749l541J9413J5051
$$ -29364 -25921 -4851 18404 7518 -3890 28791 32163 -5531 -34280 -37821 -18408 -3357
6086c357l6502j1284J1608L3555K1071q56k2013k4397j657K7620L1179k5726m2902
$$ -3357 -39859 -51143 -39535 -5980 15091 14235 -7778 -32175 -33832 -6212 24967 -759 -43661
6073d3661j0878q155J869J5881q241k409M8621K1820R484O494j4764k9342O728
$$ -43661 -54539 -62694 -60825 -44944 -53185 -55594 -6973 14847 24331 30825 16061 -13281 -6553
6060f553j2477O193M807j0648K813k3351K3927J9525l44p558n843J9143M73j0700
$$ -6553 -19030 -12837 -8030 -18678 -15865 -39216 -15289 4236 3892 -3666 -9509 9634 10107 -593
6046e93k230P119Q091l333k672n242J7233J2097j0119o494M094j2510J1197n105
$$ -593 -2823 4296 12387 9054 6382 1140 18373 30470 20351 13857 17951 5441 16638 11533
6032A1533R61j1501k6043K1567K4564K3786l868q620j8718N02J4226l2690l3659
$$ 11533 12494 993 -25050 -3483 21081 44867 40999 32379 13661 14163 28389 -4301 -37960
6019c7960o217J1657K1347M836k2933o486N722j5529O331J3614M038K457Q93o158
$$ -37960 -44177 -32520 -11173 -6337 -29270 -35756 -30034 -45563 -39232 -25618 -21580 -19123 -18230 -24388
6005b4388j0720J3911K5604J622j7259J3160O043k0165R915L49J2980K0339J55
$$ -24388 -35108 -21197 4407 6029 -11230 1930 7973 -12192 -2277 -1928 11052 31391 31546
5992C1546k2689j3750n97j0237k596J4615Q344k0677n845j2526K630O242K4929
$$ 31546 8857 -4893 -5490 -15727 -18323 -3708 4636 -16041 -21886 -34412 -31782 -25540 -611
5979f11P705n621j3967j8402R419L432q67J9989l984K4769k1113k663J794J2358
$$ -611 7094 1473 -12494 -30896 -21477 -18045 -18912 1077 -2907 21862 749 -1914 -120 12238
5965A2238j3405k7374J5045P452j4387K310J4328n954M203J6974M277j3702J3772
$$ 12238 -1167 -28541 -13496 -6044 -20431 -18121 -3793 -9747 -5544 11430 15707 2005 15777
5952A5777P570j2231j257O989k4861k0979R670L7050l935k3588P972K1872J1649
$$ 15777 23347 11116 9859 16848 -8013 -28992 -19322 17728 13793 -9795 -1823 20049 31698
5939C1698L794j2408j130j2523J6431n713q793J8880m319k6967n398j762k863
$$ 31698 35492 23084 21954 9431 25862 20149 11356 30236 25917 -1050 -6448 -8210 -11073
5926a1073O60j6470J8366J5796k3974l7522j119M6968K0364j7091J2884J9786
$$ -11073 -10413 -26883 -8517 7279 -16695 -54217 -55336 -8368 11996 -5095 7789 27575
5914B7575n855l7499k9855j339K6009M133P022J3753j8837j4359R619J6005n27
$$ 27575 21720 -15779 -45634 -46973 -20964 -16831 -9809 3944 -14893 -29252 -19633 -3628 -4155
5901d155J8486l396j3140J2748P842P087Q722l6626j3084J8087j6871j0499J3731
$$ -4155 14331 10935 -2205 10543 18385 25472 34194 -2432 -15516 2571 -14300 -24799 -11068
5888a1068n341n993k721L227J1429M699O182p119k4395R509J889r881q545J939
$$ -11068 -16409 -22402 -25123 -21896 -10467 -5768 414 -6705 -31100 -21591 -19702 -29583 -38128 -36189
5874c6189j6833j0214J1614K0092R087n545k160J7427K37j9260J2530n044K36
$$ -36189 -53022 -63236 -51622 -31530 -22443 -27988 -30148 -12721 -12484 -31744 -19214 -24258 -24022
5861b4022K919J5019j4163j7195J5305K1992j1565j8080q834n717J7469j5428
$$ -24022 -21103 -6084 -20247 -37442 -22137 -145 -11710 -29790 -38624 -44341 -26872 -42300
5849d2300J6915M324j759P402O353p59k0180l033K3440J5986o789j0594K385J0787
$$ -42300 -25385 -21061 -22820 -15418 -9065 -9824 -30004 -33037 -9597 6389 -400 -10994 -8609 2178
5835B178K8534o50j1507J363J528j6657j2585k2619j8311j6553m408K6102K2558
$$ 2178 30712 30062 18555 19918 21446 4789 -7796 -30415 -48726 -65279 -69687 -43585 -21027
5822b1027K203k9459N348L6948M140J5405j183J4955j093n399k1607j8124n7K4260
$$ -21027 -18824 -48283 -42935 -5987 -1847 13558 12375 27330 26237 20838 -769 -18893 -18950 5310
5808E310J6524k2986m1758n263M3285J1669j0002P295K5916R300j193K3020K320
$$ 5310 21834 -1152 -42910 -48173 -4888 6781 -3221 4074 29990 39290 38097 61117 63437
5795F3437j2393j9715j5245l8643j975K2567j1993K809M279M407J2455m899L715
$$ 63437 51044 31329 16084 -22559 -24534 -1967 -13960 -11151 -6872 -2465 9990 5091 8806
5782H806J4032l263p685L413K6793j6376j6733k5454o275j0423m198k1747k9560
$$ 8806 22838 19575 11890 15303 42096 25720 8987 -16467 -22742 -33165 -37363 -59110 -88670
5769h8670P282M7833L1636k052j0003J4231M270J5058J6722l124J4796N42l8488
$$ -88670 -81388 -33555 -1919 -3971 -13974 257 4527 19585 36307 33183 47979 48521 10033
5756A0033j293K3452k9703j7481J6318R095r008M425O703K035N015o797l3148
$$ 10033 8740 32192 2489 -14992 1326 10421 1413 5838 12541 14576 19591 12794 -20354
5743b0354l8715J7891K7575Q923j7974j0790K7474j913n394J153J127j4998K837
$$ -20354 -59069 -41178 -13603 -4680 -22654 -33444 -5970 -7883 -13277 -12124 -10997 -25995 -23158
5730b3158K3602J0806l6652k9139J9909K0448M9009L0755m2418m6099K2646r09
$$ -23158 444 11250 -25402 -54541 -34632 -14184 34825 65580 23162 -22937 -291 -1200
5718a200j1052p205j132J9502j6767K291J5275R643l830K1881j4432m008q746
$$ -1200 -12252 -19457 -20589 -1087 -17854 -15563 -288 9355 5525 27406 12974 8966 220
5705B20K492o653L645Q666j4351j4855k3114P845M0595J7390Q460K697j58j7000
$$ 220 2712 -3941 -296 8370 -5981 -20836 -43950 -36105 4490 21880 30340 33037 32879 15879
5691A5879j9868k3321J7341N016j1510j904L2664J2490O375m5380l1268n269L4026
$$ 15879 -3989 -27310 -9969 -4953 -16463 -18367 14297 26787 33162 -12218 -43486 -48755 -14729
5678a4729K2795l2103p510q834J1535q069P609K5106J0217k7540L200j4062P719
$$ -14729 8066 -24037 -31547 -40381 -28846 -36915 -29306 -4200 6017 -21523 -18323 -32385 -24666
5665b4666J5740K4734p452l6052J3706L0313l100j9622Q370Q50n898l9095j5713
$$ -24666 -8926 15808 8356 -27696 -13990 16323 13223 -6399 1971 2821 -3077 -42172 -57885
5652e7885L0370M1224K5094j4271k0002j937N745J40k4715l601J0278k4078k347
$$ -57885 -27515 13709 38803 24532 4530 2593 8338 8478 -16237 -19838 -9560 -33638 -35985
5639c5985J1619k1413k0048M0825L9037L715J9714M632j8974j2685j5905r494
$$ -35985 -24366 -45779 -65827 -25002 14035 17750 37464 42096 23122 10437 -5468 -14962
5627a4962J0203K638m495K787p362o274j5459K41j2253O161J8337j890o207m846
$$ -14962 -4759 -2121 -6616 -3829 -11191 -17465 -32924 -32683 -44936 -38775 -20438 -22328 -28535 -33381
5613c3381J9539j1725k0503L544O388L8002J447M739M489k4021l6429N84J2724
$$ -33381 -13842 -25567 -46070 -42526 -36138 1864 3311 8050 12539 -11482 -47911 -47327 -34603
5600c4603L4496j188J9693L461J1108K6111m0731l3972m036k5885j4856o38k3595
$$ -34603 -107 -1295 18398 21859 32967 59078 18347 -15625 -19661 -45546 -60402 -61040 -84635
5587h4635R791L8793L3154j7574l7075q742K6109J4398J3139J5326K630j2586
$$ -84635 -74844 -36051 -2897 -20471 -57546 -66288 -40179 -25781 -12642 2684 5314 -7272
5575g272n593J8203J4927k1289j3850j0071l0302K3808L0681K1246k4224j5418
$$ -7272 -12865 5338 20265 -1024 -14874 -24945 -55247 -31439 -758 20488 -3736 -19154
5563a9154J7385J1564j8057k510m021J0089R959p409l8281n967K6831o906j2084
$$ -19154 -1769 9795 -8262 -10772 -14793 -4704 5255 -2154 -40435 -46402 -19571 -26477 -38561
5550c8561N96J8987R815J1126r803l9017j1112J4567L3196J6615r131r727J7250
$$ -38561 -37965 -18978 -9163 1963 -7840 -46857 -57969 -43402 -10206 6409 -2722 -12449 4801
5537D801L01k0512N462J1779j1634p158N897k457o075k0535M020J4448j03L313
$$ 4801 5102 -15410 -9948 1831 -9803 -16961 -11064 -13521 -19596 -40131 -36111 -21663 -21766 -18453
5523a8453K7335P305j853p336k462j3314q095M058j3906q620p210J0785Q545j5686
$$ -18453 8882 16187 14334 6998 4536 -8778 -16873 -12815 -26721 -35341 -42551 -31766 -23221 -38907
5509c8907L0671l033j2501j9899l0048Q20P034L3013J4334j4282n708j0374J3002
$$ -38907 -8236 -11269 -23770 -43669 -73717 -72897 -65863 -32850 -18516 -32798 -38506 -48880 -35878
5496c5878K2829L727r799l220K7748q393J1393j00J2768q266j1947J982j0693
$$ -35878 -13049 -9322 -19121 -22341 5407 -2986 8407 8307 21075 12809 862 2844 -7849
5483g849O034J1915j3910j4762J4795K0332j1587O104J9966J7987j4663m794k364
$$ -7849 -1815 10100 -3810 -18572 -3777 16555 4968 11072 31038 49025 34362 29568 27204
5470B7204j4573l1523j0240r951L0682J3006k0155n451l269j7874p091O106L3323
$$ 27204 12631 -18892 -29132 -39083 -8401 4605 -15550 -21001 -24270 -42144 -49235 -43129 -9806
5457i806K6150K883m208j7373j1555j063N9K0234J461q573j4581M855K4641J5603
$$ -9806 16344 19227 15019 -2354 -13909 -14972 -14913 5321 6782 -1791 -16372 -11517 13124 28727
5443B8727Q103k3397r95K0179j4712J2503n73l0052P812Q990O371k2378j3708
$$ 28727 36830 13433 12438 32617 17905 30408 29835 -217 7595 16585 22956 578 -13130
5430a3130J5422K5030j4782l6332j4915J4742K0303p267m560K1592j4770j5517
$$ -13130 2292 27322 12540 -23792 -38707 -23965 -3662 -10929 -15489 6103 -8667 -24184
5418b4184L499J7064P895j669n239n472R666L3700j3512j3745K6622J3507m9054
$$ -24184 -20685 -3621 4274 2605 -2634 -8106 1560 35260 21748 8003 34625 48132 -922
5405i22r477K5046J345J5605k1744k7940J5097J2750j6085O789J2851j2997m0543
$$ -922 -10399 14647 15992 31597 9853 -18087 -2990 9760 -6325 464 13315 318 -40225
5392d0225j0443K5764r674j3342K117L0446K1477J4284J8604j6444j3567j6441
$$ -40225 -50668 -24904 -34578 -47920 -45803 -15357 6120 20404 39008 22564 8997 -7444
5380g444k243J6585R769o357k1925j5365q356J4743J3798Q368J2065J7447k3268
$$ -7444 -9687 6898 16667 10310 -11615 -26980 -35336 -20593 -6795 1573 13638 31085 7817
5367G817j9624J0379J4410k2989J2852j3778j7170K0981J3946k8345q867K567
$$ 7817 -11807 -1428 12982 -10007 2845 -10933 -28103 -7122 6824 -21521 -30388 -27821
5355b7821Q577K533J2420R149n1178j07M110j7399Q531J1770K5574K4610R063
$$ -27821 -19244 -16711 -4291 4858 -46320 -46427 -42317 -59716 -51185 -39415 -13841 10769 19832
5342A9832N940k3601o917j82k292K9278J073M554O335k7860J285m74o522j4019
$$ 19832 25772 2171 -4746 -4928 -7220 22058 23131 27685 34020 6160 7445 6971 449 -13570
5328a3570l6613p842J0578K081j3467O292N957J7105R182J9038O059j1692q590
$$ -13570 -50183 -58025 -47447 -45366 -58833 -52541 -46584 -29479 -20297 -1259 4800 -6892 -15482
5315a5482j6582l0590j1424J2856M3956K3481j8558n130O623L201O067J1554k05
$$ -15482 -32064 -62654 -74078 -61222 -17266 6215 -12343 -17473 -10850 -7649 -1582 9972 9767
5302I767K0481J0853j2482m4328j9698R835K804r826N128n551N468K1622J1077
$$ 9767 30248 41101 28619 -15709 -35407 -25572 -22768 -32594 -27466 -33017 -27549 -5927 5150
5289E150R725j7569l5694k1656J3690J7649M696J4757Q489k497r293J264k0223
$$ 5150 14875 -2694 -38388 -60044 -46354 -28705 -24009 -9252 -763 -3260 -12553 -11289 -31512
5276c1512k530R666O840k4516k0592j441J8762J2699J5465K6718K6047J6001O256
$$ -31512 -34042 -24376 -17536 -42052 -62644 -64085 -45323 -32624 -17159 9559 35606 51607 57863
5263E7863j9665m4409j5062k552r917J4996J2563j6279r768K465M22m445j1323
$$ 57863 38198 -6211 -21273 -23825 -33742 -18746 -6183 -22462 -32230 -29765 -29343 -33788 -45111
5250d5111r819J6382R16K7914O311j7688L965J6820J6458j4009J1044l108j981
$$ -45111 -54930 -38548 -37632 -9718 -3407 -21095 -17130 -310 16148 2139 13183 10075 8094
5237H094J1956k8406l808J2377m599M163J0854k8875K557P99k4955N113M0870
$$ 8094 20050 -8356 -12164 213 -4386 -223 10631 -18244 -15687 -14888 -39843 -34730 6140
5224F140J5778m408M736N050p998k8269j2752K0598O180j826k5864R549Q438L284
$$ 6140 21918 17510 22246 27296 19298 -8971 -21723 -1125 5055 3229 -22635 -13086 -4648 -1364
5210a364j3360j7578O038r743J5830L7897l900l4810j7013L4849M2097p966l0570
$$ -1364 -14724 -32302 -26264 -36007 -20177 17720 13820 -20990 -38003 -3154 38943 30977 407
5197D07J6753M323j3077K907m790j804j4227p932j7465j2478K4456J0027K636
$$ 407 17160 21483 8406 11313 6523 4719 -9508 -17440 -34905 -47383 -22927 -12900 -10264
5184a0264n900K4118N684r796k0486j4492j3852R089q881l0681P280K4045M5318
$$ -10264 -16164 7954 13638 3842 -16644 -31136 -44988 -35899 -44780 -75461 -68181 -44136 1182
5171A182J3541l0735j1035J0975l414L60N3425R987n4484p701n266j8616P017
$$ 1182 14723 -16012 -27047 -16072 -19486 -19126 34299 44286 -10198 -17899 -23165 -41781 -34764
5158c4764N251N15p480q827Q917N689K384O532M951L0838J7896j434R566j3828
$$ -34764 -29513 -28998 -36478 -45305 -36388 -30699 -28315 -21783 -16832 14006 31902 30468 40034 26206
5144B6206l8814o678r016J5012l862j9833J9778K9930j2277k2587k0336j1635
$$ 26206 -12608 -19286 -28302 -13290 -17152 -36985 -17207 12723 446 -22141 -42477 -54112
5132e4112J5024J4999n17o012J5367K2266o708k868J5755k0198q39M061N040j3531
$$ -54112 -39088 -24089 -24606 -30618 -15251 7015 307 -2561 13194 -7004 -7843 -3782 1258 -12273
5118a2273k8035J02J7996R45O115q57j400K3069K7729l293j7531J4774J598k6740
$$ -12273 -40308 -40206 -22210 -21265 -15150 -16007 -17407 5662 33391 30098 12567 27341 28939 2199
5104B199j8535m95N601n072j7297R46J0578j3085J4711K0962R737j5570k536j1564
$$ 2199 -16336 -16831 -11230 -16302 -33599 -32653 -22075 -35160 -20449 513 10250 -5320 -7856 -19420
5090a9420M372J9996P561j7252J501Q013N746N360j3140n388J3045l703j4936
$$ -19420 -15048 4948 12509 -4743 -3242 4771 10517 15877 2737 -2651 10394 6691 -8245
5077h245j7237J25m209P218J6511P659j4627k2105K0467J0878Q566J0J1501L215
$$ -8245 -25482 -25357 -29566 -22348 -5837 1822 -12805 -34910 -14443 -3565 5001 5011 16512 19727
5063A9727r380n014l0149j8076O376J5549J516K487J3205l1528j4463O977J3790
$$ 19727 10347 5333 -24816 -42892 -36516 -20967 -19451 -16964 -3759 -35287 -49750 -42773 -28983
5050b8983O428k9245J376R721R318J5983R548j6208O750k6314L267J2537J9873
$$ -28983 -22555 -51800 -50424 -40703 -31385 -15402 -5854 -22062 -15312 -41626 -38359 -25822 -5949
5037e949K5132J713n570J084o555k7039n447J3832j0103j9393K9277K5782J3554
$$ -5949 19183 20896 15326 16410 9855 -17184 -22631 -8799 -18902 -38295 -9018 16764 30318
5024C0318j4964m5734R360J6768k0252N017L3256j6836J4645Q731K7550l761j9281
$$ 30318 15354 -30380 -21020 -4252 -24504 -19487 13769 -3067 11578 20309 47859 44098 24817
5011B4817k825O597j167R621k7233O280r159K805j0674R159l344l557J0437K3810
$$ 24817 21992 28589 27422 37043 9810 16090 6931 9736 -938 8221 4877 1320 11757 35567
4997C5567p512j7647k7475L4778J8474k1884l771l1734o822J1000J1057K8949
$$ 35567 28055 10408 -17067 17711 36185 14301 10530 -21204 -28026 -17026 -5969 22980
4985B2980K8685j7242p557k518N974l2845l701L642k1453j7003Q192Q366J6294
$$ 22980 51665 34423 26866 24348 30322 -2523 -6224 -2582 -24035 -41038 -32846 -24480 -8186
4972h186Q170p33j5783M269j1947k349J1827K0407m070j6437k6436j691m721M049
$$ -8186 -16 -749 -16532 -12263 -24210 -26559 -14732 5675 1605 -14832 -41268 -42959 -47680 -43631
4958d3631K3348m199j036o504R348J2399k1147P636K4604j69j2148O343P227j0782
$$ -43631 -20283 -24482 -25518 -32022 -22674 -10275 -31422 -23786 818 649 -11499 -5156 2071 -8711
4944h711O676q602K4j4435j2228L1321Q345J3680k0303r523m624L926j8766k590
$$ -8711 -2035 -10637 -10613 -25048 -37276 -5955 2390 16070 -4233 -13756 -18380 -14454 -33220 -35810
4930c5810K4609J3592l504m57K5624J5735l0701q200J0590J0894J7366n331j0104
$$ -35810 -11201 2391 -1113 -1570 24054 39789 9088 888 11478 22372 39738 34407 24303
4917B4303m9353J887Q3J7208q71j8927l178j1727l1093J8411K0475J8766Q550
$$ 24303 -25050 -23163 -23080 -5872 -6743 -25670 -28848 -40575 -71668 -53257 -32782 -14016 -5466
4904e466l827L1280R923j5812k9153m153K159j3057J9421J125k1932l4616j5646
$$ -5466 -9293 21987 31910 16098 -13055 -17208 -15049 -28106 -8685 -7560 -29492 -64108 -79754
4891g9754K9308M3561R905J7628q506r105J3192k139l3442j5034K5596K5621j3665
$$ -79754 -50446 -6885 3020 20648 12142 3037 16229 14090 -19352 -34386 -8790 16831 3166
4878C166j560K2235p105l4681P284J4396M5968k095l3761o057l4119K891J976
$$ 3166 1606 23841 16736 -17945 -10661 3735 49703 47608 13847 7790 -26329 -23438 -21462
4865b1462J0849L0056L4199j8192m6885O543j620J8401l114O558m850l5788j3414
$$ -21462 -10613 19443 53642 35450 -11435 -4892 -6512 11889 8775 15333 10483 -25305 -38719
4852c8719N390Q865j4419K4063K697Q662Q327L63m2671l7827J3822L2398J791
$$ -38719 -33329 -24464 -38883 -14820 -12123 -3461 4866 5229 -37442 -75269 -61447 -29049 -27258
4839b7258j2505L0787J8105j3737m2034J4195L4007j833n127K7977m872K1054
$$ -27258 -39763 -8976 9129 -4608 -46642 -32447 1560 -273 -5400 22577 17705 38759
4827C8759R737l179N957K1420k2971j9981J251Q889j3828j6524P690j402m0683
$$ 38759 48496 45317 51274 72694 49723 29742 30993 39882 26054 9530 17220 15818 -24865
4814b4865k0903K1837K5625J5656K0113M1k7720j1923r907j4469K829J0191J5610
$$ -24865 -45768 -23931 1694 17350 37463 37504 9784 -2139 -12046 -26515 -23686 -13495 2115
4801B115m393k0835O800p673K2510L2751k455k1268l6652n245p019m63K7773J2388
$$ 2115 -2278 -23113 -16313 -23986 -1476 31275 28820 7552 -29100 -34345 -41364 -41827 -14054 -1666
4787a666J9047P890j1634k7651j7340J8986m404J580Q575K9846J990j2271J0674
$$ -1666 17381 25271 13637 -14014 -31354 -12368 -16772 -15192 -6617 23229 25219 12948 23622
4774B3622j0254q738l7M0526L842j0493j696m722j6424j0451J6703o806r861m494
$$ 23622 13368 4630 4593 45119 48961 38468 36772 32050 15626 5175 21878 15072 5211 717
4760G17k8265K196j2457j6254M0122L1090j2914o561J8943j1404l74P529k777
$$ 717 -27548 -25352 -37809 -54063 -13941 17149 4235 -2326 16617 5213 4839 12368 9591
4747I591n402j5522J2490L2808k3615j2472j5885q149K139j8573n919j537L0373
$$ 9591 4189 -11333 1157 33965 10350 -2122 -18007 -26156 -24017 -42590 -48509 -50046 -19673
4734a9673J6779j4636q975J4449J2330R32j1742N416J5181M654M864j0051m6774
$$ -19673 -2894 -17530 -26505 -12056 274 1206 -10536 -5120 10061 14715 19579 9528 -37246
4721c7246j2788K3348M4310K1906n92k4931J845m052k3947J578j8255r442j9579
$$ -37246 -50034 -26686 17624 39530 38938 14007 15852 11800 -12147 -10569 -28824 -38266 -57845
4708e7845J9165J5389Q094m698Q564K1249n411l4594k682J3417j4153k847K4854
$$ -57845 -38680 -23291 -15197 -19895 -11331 9918 4507 -30087 -32769 -19352 -33505 -36352 -11498
4695a1498p213J173N784l8598q755N904j615K3810J6491O069n403j0781M781J509
$$ -11498 -18711 -17538 -11754 -50352 -59107 -53203 -54818 -31008 -14517 -8448 -13851 -24632 -19851 -18342
4681a8342K1763K2904J3886m1676k2972R596j8299j153o90N89J3250j7292k38
$$ -18342 3421 26325 40211 -1465 -24437 -14841 -33140 -34293 -34983 -34394 -21144 -38436 -38674
4668c8674K1955L6994j7200o760n374j5390J3305K566k756K1670K7305n396j3001
$$ -38674 -16719 20275 3075 -3685 -9059 -24449 -11144 -8578 -11334 10336 37641 32245 19244
4655A9244J565R15J601J2676K1263j4333k3948k4123j4003k4164K231J9719M548
$$ 19244 20809 21724 23325 36001 57264 42931 18983 -5140 -19143 -43307 -41076 -21357 -16809
4642a6809l0055K1511J5885J3060j2383j9443r672J7326K7299k2550R198J6960
$$ -16809 -46864 -25353 -9468 3592 -8791 -28234 -37906 -20580 6719 -15831 -6633 10327
4630A0327o296k9389j0071J1118J8653J0971r349o984j5493k0338L5346J8514
$$ 10327 4031 -25358 -35429 -24311 -5658 5313 -4036 -11020 -26513 -46851 -11505 7009
4618G009j87J2112j7573j5343j4275r783K3803j589k907J4927J5569J0879j0634
$$ 7009 6822 18934 1361 -13982 -28257 -38040 -14237 -15826 -18733 -3806 11763 22642 12008
4605A2008k5796k8453k541N223l8490M018L69j4237j7134K6980L8503J4701K8876
$$ 12008 -13788 -42241 -44782 -39559 -78049 -74031 -73662 -87899 -105033 -78053 -39550 -24849 4027
4592D027J7358k8650l1055j2627j9236L7426K3892K8787K626j1940j1853r654
$$ 4027 21385 -7265 -38320 -50947 -70183 -32757 -8865 19922 22548 10608 -1245 -10899
4580a0899O828l350R344j0619l826L386M998K6180r356j5172p01J3393L3393j0633
$$ -10899 -4071 -7421 1923 -8696 -12522 -9136 -4138 22042 12686 -2486 -3187 10206 43599 32966
4566C2966l1093K491M634k7270j6774L527J8767K2130R023N592O223j1244l2836
$$ 32966 1873 4364 8998 -18272 -35046 -31519 -12752 9378 18401 23993 30216 18972 -13864
4553a3864j5512J0986l342J426J8916p546l690o071j9304j6007J7878j935M012
$$ -13864 -29376 -18390 -21732 -20306 -1390 -8936 -12626 -18697 -38001 -54008 -36130 -38065 -34053
4540c4053K4977K5397J4735k2655q371o665j3488j7768J1753J3155k1938k9821
$$ -34053 -9076 16321 31056 8401 30 -6635 -20123 -37891 -26138 -12983 -34921 -64742
4528f4742l395p970J6725J1857j3318J5551N5053L2792M411m5621m3821j365K6494
$$ -64742 -68137 -76107 -59382 -47525 -60843 -45292 9761 42553 46964 1343 -42478 -43843 -17349
4515a7349R050J8044l794J933k4915Q653K562n726J1747L1116J4058j3654n402
$$ -17349 -8299 9745 5951 7884 -17031 -8378 -5816 -11542 205 31321 45379 31725 26323
4502B6323l2274j1150J8701Q997j7822r256j678N363N721r154j3102l5J0460O683
$$ 26323 -5951 -17101 1600 10597 -7225 -16481 -18159 -12796 -7075 -16229 -29331 -29366 -18906 -12223
4488a2223j6010k6116J1709m968j1112J4225n977j3830J6936M2015p961j1169
$$ -12223 -28233 -54349 -42640 -47608 -58720 -44495 -50472 -64302 -47366 -5351 -13312 -24481
4476b4481R414j3115J9944K8720j0197j743k6991j1503M5630J0460L015q968J5112
$$ -24481 -15067 -28182 -8238 20482 10285 8542 -18449 -29952 15678 26138 29153 20185 35297
4463C5297J219k3495Q980K9017l3702j5577m81J3918M339k2370J3775n492l190
$$ 35297 36516 13021 22001 51018 17316 1739 1258 15176 19515 -2855 10920 5428 2238
4450B238m054m790L534J5903O342L793m324q332K430r957l2745r493j045P899
$$ 2238 -1816 -6606 -3072 12831 19173 22966 18642 10310 12740 2783 -29962 -39455 -40500 -32601
4436c2601K0704L1454K3851k5106k4153K224Q794K1234j8054j0828j7285J0365
$$ -32601 -11897 19557 43408 18302 -5851 -3627 5167 26401 8347 -2481 -19766 -9401
4424i401J9437k751K418M58L519k2853k2017R800O730k3189J545L1169P051j1451
$$ -9401 10036 7285 9703 10161 13680 -9173 -31190 -21390 -14660 -37849 -36304 -5135 1916 -9535
4410i535N230l3j1053j2477Q951J3206j3864j8324N54M4606K0890J8349k8040
$$ -9535 -4305 -4338 -15391 -27868 -18917 -5711 -19575 -37899 -37345 7261 28151 46500 18460
4397A8460l7706j5188K9470K8544m224m8648j7124M130K4143J4514L903J8540
$$ 18460 -19246 -34434 -4964 23580 19356 -29292 -46416 -42286 -18143 -3629 274 18814
4385A8814J0589L802q487k0213p746K7424Q884k297l167k4329j3929J6618n720
$$ 18814 29403 33205 24718 4505 -3241 24183 33067 30770 27603 3274 -10655 5963 243
4372B43K1764K20j5969l6622j0747j0211k057J3876J223j1934R077K6743M0121
$$ 243 22007 22227 6258 -30364 -41111 -51322 -53379 -39503 -38280 -50214 -41137 -14394 25727
4359B5727m787K0913M617j125q702j3706j3682k6895k1009J4076L0715k4720o590
$$ 25727 20940 41853 46470 45345 36643 22937 9255 -17640 -38649 -24573 6142 -18578 -25168
4346b5168j5424j6238J3115L956m38l60j8869n807K5377K4669J9714J9303K3119
$$ -25168 -40592 -56830 -43715 -39759 -40197 -40557 -59426 -65233 -39856 -15187 4527 23830 46949
4333D6949k4989K243J4950l157R516K322Q012l946n5943m4226J852N412m260J3263
$$ 46949 21960 24203 39153 35996 45512 47834 55846 51900 -4043 -48269 -46417 -41005 -45265 -32002
4319c2002K4923l945p937n433J3729K6713K1308K1847k0777j7993l476k896j225
$$ -32002 -7079 -11024 -18961 -24394 -10665 16048 37356 59203 38426 20433 16957 14061 12836
4306A2836k4141m424L7547j0102p574j2582n10o747j9576r773j4811J2398m333
$$ 12836 -11305 -15729 21818 11716 4142 -8440 -8950 -15697 -35273 -45046 -59857 -47459 -51792
4293e1792L8546J5800k0583k2776J7923J6924N735R269L0548m450Q03k762k9737
$$ -51792 -13246 2554 -18029 -40805 -22882 -5958 -223 9046 39594 35144 35947 33185 3448
4280C448q284L5391K7841m387j2466r19k2196r133j766J0021J4163k5775j1607
$$ 3448 -4836 30555 58396 54009 41543 40624 18428 9295 7529 17550 31713 5938 -5669
4267e669k631k7674k3136j3038j575L9161L4490n456m348K4613j0386l2245K197
$$ -5669 -8300 -35974 -59110 -72148 -73723 -34562 -72 -5528 -9876 14737 4351 -27894 -25697
4254b5697K2584J1168j5908k641j3196J114J4228K641l4886N885o031j2702L906
$$ -25697 -3113 8055 -7853 -10494 -23690 -22576 -8348 -5707 -40593 -34708 -40739 -53441 -49535
4241d9535M5069j2525J9514J6572k2378n2627L479J3773M23r200j1043Q5J4173
$$ -49535 -4466 -16991 2523 19095 -3283 -55910 -52431 -38658 -38235 -47435 -58478 -58393 -44220
4228d4220L4916L1960j2859j8908j5455K1829J8012q321j1275j5170j1500K524
$$ -44220 -9304 22656 9797 -9111 -24566 -2737 15275 6954 -4321 -19491 -30991 -28467
4216b8467J1212J5694j7178p534J5882M2326J5173m2897k9846n370N964m052K2559
$$ -28467 -17255 -1561 -18739 -26273 -10391 31935 47108 4211 -25635 -31005 -25041 -29093 -6534
4203f534q17K1331K681k3809j395K499k7986O928K7102q041j7070N038Q560J1408
$$ -6534 -7351 13980 16661 -7148 -8543 -6044 -34030 -27102 0 -8041 -25111 -20073 -11513 -105
4189a05K763o966L225J0268J2446n916R439j1700l9221J7301k31j0249m764J618
$$ -105 2658 -4308 -1083 9185 21631 15715 25154 13454 -25767 -8466 -8697 -18946 -23710 -22092
4175b2092J566K0028O039j9851q360K211p522Q977L4038o464k4501k3213J3384
$$ -22092 -20526 -498 5541 -14310 -22670 -20459 -27981 -19004 15034 8570 -15931 -39144 -25760
4162b5760J6311M902L646Q050l6609K028L8034L2901K484k9717j5273k0268m120
$$ -25760 -9449 -4547 -901 7149 -29460 -27432 10602 43503 45987 16270 997 -19271 -23391
4149b3391k042m679J9455N917j7965j6252K7697L922l714j2031k7722K6673K3703
$$ -23391 -25433 -30112 -10657 -4740 -22705 -38957 -11260 -7338 -11052 -23083 -50805 -24132 -429
4136d29J4046J7807r982k93k0012K2129k130K571j8208O587J8260K1373K2493
$$ -429 13617 31424 21442 21149 1137 23266 21136 23707 5499 12086 30346 51719 74212
4123G4212M219j3595j9896j2158K0776k400n477j7813l8369k6434O399j4886r353
$$ 74212 78431 64836 44940 32782 53558 51158 45681 27868 -10501 -36935 -30536 -45422 -54775
4110e4775K6674j4637p821K5698M296q008J9666M490l089N970n57j5661J3903
$$ -54775 -28101 -42738 -50559 -24861 -20565 -28573 -8907 -4417 -7506 -1536 -2093 -17754 -3851
4097c851K1892J592m5352k0660k516p777R937L3583K90n315k0954j6629j9505
$$ -3851 18041 19633 -25719 -46379 -48895 -56672 -46735 -13152 -12862 -18177 -39131 -55760 -75265
4084g5265K5495J8878k298J7364K8269Q254J3784n358J9475j4256k1485k9289
$$ -75265 -49770 -30892 -33190 -15826 12443 20697 34481 29123 48598 34342 12857 -16432
4072a6432k123j737j1194k1886L6133O420O502K0969j9194l653k8537q068P064
$$ -16432 -18555 -20292 -31486 -53372 -17239 -10819 -4317 16652 -2542 -6195 -34732 -42800 -35736
4059c5736L441J1008j7796j2622J4190j6847M440J8301n648K644K3440P450j3925
$$ -35736 -32295 -21287 -39083 -51705 -37515 -54362 -49922 -31621 -37269 -34625 -11185 -3735 -17660
4046a7660n061J9603K0054P057J2374Q495j7074l2736k140K0704l0172m580L0149
$$ -17660 -22721 -3118 16936 23993 36367 44862 27788 -4948 -7088 13616 -16556 -21136 9013
4033I013J0464j2363k2067l7790l907L2817k579R875L2320L1871J9095k2024k9182
$$ 9013 19477 7114 -14953 -52743 -56650 -23833 -26412 -16537 15783 47654 66749 44725 15543
4020A5543P203J31M14k307p800k945k058j9792L0184J7567J6289k1080j7941j0340
$$ 15543 22746 22877 23291 20984 13184 10239 8181 -11611 18573 36140 52429 31349 13408 3068
4006C068l6043o673J7231J1792J6619k19Q690J0002j221m2002k8230j756r77N1376
$$ 3068 -32975 -39648 -22417 -10625 5994 5775 14465 24467 23246 -18756 -46986 -48742 -49719 1657
3992A657M8516n615l3049j4281r700l02L837p551m1136k4483J3586L8577N788
$$ 1657 50173 44558 11509 -2772 -12472 -12774 -8937 -16488 -57624 -82107 -68521 -29944 -24156
3979b4156J5050K240p545L710j0124n216j0457L0485Q335k1714k086P077K6220
$$ -24156 -9106 -6866 -14411 -10701 -20825 -26041 -36498 -6013 2322 -19392 -21478 -14401 11819
3966A1819O509j3480k0317N834P787Q386k483j6006j7151J8934K6634p111r277
$$ 11819 18328 4848 -15469 -9635 -1848 6538 4055 -11951 -29102 -10168 16466 9355 78
3953G8J2786j4692j8207j712j2370k3696n367J2985J1822L929k3282j2240j8313
$$ 78 12864 -1828 -20035 -21747 -34117 -57813 -63180 -50195 -38373 -34444 -57726 -69966 -88279
3940h8279K9578M1201J3167j1963K1768L0001J423k6013P513J0165J428l662j0260
$$ -88279 -58701 -17500 -4333 -16296 5472 35473 36896 10883 18396 28561 29989 26327 16067
3927A6067k6521j9889k173J9327N3902K8463j4865p2783k4207N487l954M6800
$$ 16067 -10454 -30343 -32516 -13189 40713 69176 54311 -18472 -42679 -37192 -41146 5654
3915E654L2788j5374k1941j2713k838J4821rJ3530R420m511n869O533P548p925
$$ 5654 38442 23068 1127 -11586 -14424 397 388 13918 23338 18827 12958 19491 27039 19114
3901A9114k7867l5917P501K5446K0390n155L023n102P480m179k0939J244O178
$$ 19114 -8753 -44670 -37169 -11723 8667 3512 6535 1433 8913 4734 -16205 -14961 -8783
3888h783J1484J030l2328J2491J8756j9771j5116l2840j8528M6169K9246P92O013
$$ -8783 2701 3731 -28597 -16106 2650 -17121 -32237 -65077 -83605 -37436 -8190 -7398 -1385
3875a385R512L268J0391l295j819m735O258J0132j6365m0082p666O470K6925K9725
$$ -1385 8127 11395 21786 18491 16672 11937 18195 28327 11962 -28120 -35786 -29316 -2391 27334
3861B7334J5307P93k6260m8699k3327J9911K3208K9738l470j6479r333L1018l97
$$ 27334 42641 43434 17174 -31525 -54852 -34941 -11733 18005 14535 -1944 -11277 19741 19344
3848A9344J434j2606Q903q685j607L872k2810l0274M6617K0645l0J2585l3059
$$ 19344 20778 8172 17075 8390 6783 10655 -12155 -42429 4188 24833 24803 37388 4329
3835D329r937j0041J7473L5329j3735p424K2283j1331q620k5107j1316K5013J3087
$$ 4329 -5608 -15649 1824 37153 23418 15994 38277 26946 18326 -6781 -18097 6916 20003
3822B0003k2249l721L830j1130O068k5403N71j5209L051P958P486K646q218j3438
$$ 20003 -2246 -5967 -2137 -13267 -7199 -32602 -32031 -47240 -44189 -36231 -28745 -26099 -34317 -47755
3808d7755K6595J7094j7893J2174L4384J707o645k9018R741J9949O781j2850p692
$$ -47755 -21160 -4066 -21959 -9785 24599 26306 19661 -9357 384 20333 27114 14264 6572
3795F572j2279L471N674k333Q267k5826l598J1672K4257J559k3338K836q533m79
$$ 6572 -5707 -2236 3438 1105 9372 -16454 -20052 -8380 15877 17436 -5902 -3066 -11599 -12078
3781a2078M107k6965R356Q068j0624k3577Q719J0843M914K8749Q091j6185p388
$$ -12078 -7971 -34936 -25580 -17512 -28136 -51713 -42994 -32151 -27237 1512 9603 -6582 -13970
3768a3970j8455J487L3922Q692j6832q936J4867J121M859j61J472n964J3175k8206
$$ -13970 -32425 -30938 2984 11676 -5156 -14092 775 1896 6755 6594 8066 2102 15277 -12929
3754a2929j9092K29J5384N95p504p498Q313K9783J0139R994p118r869j6014k02
$$ -12929 -32021 -31792 -16408 -15813 -23317 -30815 -22502 7281 17420 27414 20296 10427 -5587 -5789
3740e789o29L7l8916l970J2056N5117J0684k5492l0979J4297q332k8137J5171
$$ -5789 -6418 -6381 -45297 -49267 -37211 17906 28590 3098 -27881 -13584 -21916 -50053 -34882
3727c4882J1032J8598j1346j0200J9735L5596J322j1371J2256J0887j276l3342
$$ -34882 -23850 -5252 -16598 -26798 -7063 28533 29855 18484 30740 41627 40351 7009
3715G009o832K846n01Q915K453J6642k0792k4322R075Q259j4836N569r90J2400
$$ 7009 177 3023 2522 11437 13890 30532 9740 -14582 -5507 2752 -12084 -6515 -7505 4895
3701D895q71p183R709k481n665J3531R316k578Q736Q954q770k0337j7884J7497
$$ 4895 4024 -3159 6550 4069 -1596 11935 21251 18673 27409 36363 27593 7256 -10628 6869
3687F869j3397p246n05j2000L872L5697q47j2937n520m143k3492J6357j212r737
$$ 6869 -6528 -13774 -14279 -26279 -22407 13290 12443 -494 -6014 -10157 -33649 -17292 -18504 -28241
3673b8241J0516j7372J6322K4561j569j2534j7034j6249J4883M4930J98K5495
$$ -28241 -17725 -35097 -18775 5786 4217 -8317 -25351 -41600 -26717 18213 18411 43906
3661D3906P507j1075j2515k953k3875J2546N079J1641k0843l8565l4180r542j5503
$$ 43906 51413 40338 27823 24870 995 13541 18620 30261 9418 -29147 -63327 -72869 -88372
3648h8372r594J9254L5454L7536l390K79K088k0125J5134m872Q687l484r414k3174
$$ -88372 -97966 -78712 -43258 -5722 -9112 -8833 -6745 -26870 -11736 -16608 -7921 -11405 -20819 -43993
3634d3993n405k6062M729J5463K5621m284M761J1798P273k6243k2446K4745K3534
$$ -43993 -49398 -75460 -70731 -55268 -29647 -33931 -29170 -17372 -10099 -36342 -58788 -34043 -10509
3621a0509K4246K0586l832q093R57K263j0008j8864K166k6754M730K0539k418
$$ -10509 13737 34323 30491 22398 23355 25618 15610 -3254 -1088 -27842 -23112 -2573 -4991
3608d991m107J4153K9865j5818k9234j0892J907r263m780M230j9909k0286J2675
$$ -4991 -9098 5055 34920 19102 -10132 -21024 -19117 -28380 -33160 -28930 -48839 -69125 -56450
3595e6450J7170K9677J1384K7666K3182k6219k8751J5755L966K1527J245r577
$$ -56450 -39280 -9603 1781 29447 52629 26410 -2341 13414 17380 38907 40152 30575
3583C0575k3798r000k413K945P449n920k4319P812J7k900J0207j4779J1614P573
$$ 30575 6777 -2223 -4636 -1691 5758 -162 -24481 -16669 -16652 -19552 -9345 -24124 -12510 -4937
3569d937J3156M498k147N692p686j2606J7478R441J5228J1787k4723j4688N096
$$ -4937 8219 12717 10570 16262 8576 -4030 13448 22889 38117 49904 25181 10493 15589
3556A5589l118Q913l59J588k0175k2044r552M655L291m35M71k236K060J6957j0922
$$ 15589 12471 21384 21025 22613 2438 -19606 -29158 -24503 -21212 -21647 -21176 -23412 -21352 -4395 -15317
3541a5317Q128J6148P840K144j5292j4037O727j1198j5023L564p646l484L802
$$ -15317 -7189 8959 16799 18943 3651 -10386 -3659 -14857 -29880 -26316 -33962 -37446 -33644
3528c3644K2109o428j2492k818J0899p285Q842j837J0261r8P404l447k119j9038
$$ -33644 -11535 -17963 -30455 -33273 -22374 -29659 -20817 -22654 -12393 -12491 -5087 -8534 -10653 -29691
3514b9691l707L0848p143J7235L0448k2885k6135j1096J5351R6k4660n1871P329
$$ -29691 -33398 -2550 -9693 7542 37990 15105 -11030 -22126 -6775 -6679 -31339 -83210 -75881
3501g5881L0854L5165J5497j3991l3309q17J0664K7016K4883p008k103O54K75
$$ -75881 -45027 -9862 5635 -8356 -41665 -42482 -31818 -4802 20081 13073 10970 11624 11899
3488A1899q778j9291j7121J1833J7822j8523j4466J6824J4671L441K0804K832
$$ 11899 3121 -16170 -33291 -21458 -3636 -22159 -36625 -19801 -5130 -1689 19115 21947
3476B1947J636m30P18n393J1586L080P733K2359k1853k2714M611o434R503J1544
$$ 21947 23583 23153 23871 18478 30064 33144 40877 63236 41383 18669 23280 16846 26349 37893
3462C7893j6700j9538n93m9o56K798k3553k622J9956N995J638k4356n531j48J183
$$ 37893 21193 1655 1062 1013 357 3155 -20398 -23020 -3064 2931 4569 -19787 -25318 -25466 -24283
3447b4283J5905J6399m608M513K4037p134j5549M60J589j1135k4839K2026j3809
$$ -24283 -8378 8021 3413 7926 31963 24829 9280 9740 11329 194 -24645 -2619 -16428
3434a6428l787n021J7463K7482o724j422j0646k6839m02o091n814k116M804J3233
$$ -16428 -20215 -25236 -7773 19709 12985 11563 917 -25922 -26324 -32415 -38229 -40345 -35541 -22308
3420b2308J3325o00l172O73K8063M016j6615J1861n09K2971j1322J0140p050j0348
$$ -22308 -8983 -9583 -12755 -12082 15981 19997 3382 15243 14734 37705 26383 36523 29473 19125
3406A9125j2383M061o717M976J454O147m4024M736L0241K453O312J8912r833M626
$$ 19125 6742 10803 4086 9062 10516 16663 -27361 -22625 7616 10069 16381 35293 25460 30086
3392C0086J2700r972l59j5063j5562q736J864p364R482K6874J2886j3547j0756
$$ 30086 42786 32814 32455 17392 1830 -6906 -5042 -12406 -2924 23950 36836 23289 12533
3379A2533O906j165j3938M24J1763P628J291k0650l9419l3854O959J9735K1617
$$ 12533 19439 18274 4336 4760 16523 24151 25442 4792 -34627 -68481 -61522 -41787 -20170
3366b0170K9759j2216l5693l989P731Q255J0515N363L257K4019J0022j1697l3614
$$ -20170 9589 -2627 -38320 -42309 -34578 -26323 -15808 -10445 -7188 16831 26853 15156 -18458
3353a8458j5951j543M217K1329K4759P68K1712M910j4293j0341K6168L044j9898
$$ -18458 -34409 -35952 -31735 -10406 14353 15121 36833 41743 27450 17109 43277 46321 26423
3340B6423k1684O151J3025J3037N922j4093j8077j7668J0852l71l037K0249n928
$$ 26423 4739 10890 23915 36952 42874 28781 10704 -6964 3888 3517 480 20729 14801
3327A4801j0844m0141j5051K992M7920K2279r566P182L2507o344m2287r555J3763
$$ 14801 3957 -36184 -51235 -48243 -323 21956 12390 19572 52079 45735 3448 -6107 7656
3314G656r691j8885L028R845K2171K1374j6120r588J3884k6512j5636J3225J216
$$ 7656 -2035 -20920 -17892 -8047 14124 35498 19378 9790 23674 -2838 -18474 -5249 -4033
3301d033L090k02J0558k0608q490P493J9191K2525k7514j5210O946p636Q416j824
$$ -4033 -943 -1145 9413 -11195 -19685 -12192 6999 29524 2010 -13200 -6254 -13890 -5474 -7298
3287g298j0931r917J306L0155r715l1791K045J2767O208J366J5812K1828k150
$$ -7298 -18229 -28146 -26840 3315 -6400 -38191 -36146 -23379 -17171 -15805 7 21835 19685
3274A9685k2369k6779k6925K9529L0478J8708r89l0963j0675Q477J8634K317R92
$$ 19685 -2684 -29463 -56388 -26859 3619 22327 21338 -9625 -20300 -11823 6811 9128 10120
3261A0120O6J503q700J2256J1228j4305k2024j1926j3216j8758j61l070K3100
$$ 10120 10186 11689 2989 15245 26473 12168 -9856 -21782 -34998 -53756 -53917 -56987 -33887
3248c3887M239N361L105j1680N892P2J6093J8649j6793K826L413J0883J1189J6177
$$ -33887 -29648 -24287 -21182 -32862 -26970 -26898 -10805 7844 -8949 -6123 -2710 8173 19362 35539
3234C5539k5603k7192K5535L729J0614j038j7373J620J8108J0622k0003j4636
$$ 35539 9936 -17256 8279 12008 22622 21584 4211 5831 23939 34561 14558 -78
3222g8p084J144j2358l925J3356J768K340J1526K465K0153Q243j1039K2477L062
$$ -78 -7162 -6018 -18376 -22301 -8945 -7177 -4837 6689 9154 29307 37550 26511 48988 52050
3208E2050k993n336J5073j2399K824j530k7243k4813P032K5297l4331k5002r441
$$ 52050 49057 43721 58794 46395 49219 47689 20446 -4367 2665 27962 -6369 -31371 -40812
3195d0812J1616J7225J828N098K800l0316p719L5054N86j6530J0052P519J4638
$$ -40812 -29196 -11971 -10143 -5045 -2245 -32561 -40280 -5226 -4640 -21170 -11118 -3599 11039
3182A1039k5207Q738q55k9726L3091J7847j200o205J3338J6655l0009k4423M976
$$ 11039 -14168 -5430 -6285 -36011 -2920 14927 13727 7522 20860 37515 7506 -16917 -11941
3169a1941O841J3206J0876J2495K98J120k4677K0739L189j7644R541J5225M555
$$ -11941 -5100 8106 18982 31477 31775 32895 8218 28957 32146 14502 24043 39268 43823
3156D3823k3213m4425l6350O368n302L912O855J824J4156P795K3360Q760n851
$$ 43823 20610 -23815 -60165 -53797 -59099 -55187 -48332 -46508 -32352 -24557 -1197 7563 1712
3143A712J9358J2854p741n088j042J3846l478o400j0867p426K7348M868J9542
$$ 1712 21070 33924 26183 21095 20053 33899 30421 24021 13154 5728 33076 37944 57486
3130E7486l0755k6523p32j9154J0288L3273J0247K1774r567l4183j4002j2074
$$ 57486 26731 208 -524 -19678 -9390 23883 34130 55904 46337 12154 -1848 -13922
3118a3922P944k2636P48m448L3080J5865O598m3267k3499O567K6384Q729P744
$$ -13922 -5978 -28614 -27866 -32314 766 16631 23229 -20038 -43537 -36970 -10586 -1857 5887
3105E887r493j6396K1067J9039q046O724J9687n9476j4615K980J6180j3886J4531
$$ 5887 -3606 -20002 1065 20104 12058 18782 38469 -21007 -35622 -32642 -16462 -30348 -15817
3092a5817J8759J0674l112k9624k4599L819k590J0925l874j9106l839J9022J3123
$$ -15817 2942 13616 10504 -19120 -43719 -39900 -42490 -31565 -35439 -54545 -58384 -39362 -26239
3079b6239K1116O27J9485M310j5432j8903j3851n332J3518q481n631J392j7679
$$ -26239 -5123 -4496 14989 19299 3867 -15036 -28887 -34219 -20701 -29182 -34813 -33421 -51100
3066e1100M202J2489J0339J8111k1344j1808K1165P051R44R082N432J0283l3540
$$ -51100 -46898 -34409 -24070 -5959 -27303 -39111 -17946 -10895 -9951 -869 4563 14846 -18694
3053a8694n281K9962P841j9482R99J3084j7527j8993L7018K1013l0258M783K0591
$$ -18694 -23975 5987 13828 -5654 -4655 8429 -9098 -28091 8927 29940 -318 4465 25056
3040B5056j13k6414l629P973J0255J209j0802o819Q3K754k753P398J6190M30J6530
$$ 25056 24943 -1471 -5100 2873 13128 14337 3535 -3284 -3201 -447 -3200 4198 20388 20818 37348
3025C7348K477j1752p404j2330j4022J2736K5670J3827k5683k4877N059J2599
$$ 37348 39825 28073 20669 8339 -5683 7053 32723 46550 20867 -4010 1049 13648
3013A3648R7k1164J715J7838M414j2481P788J4426l010j0865j5372r238m350o073
$$ 13648 13745 -7419 -5704 12134 16548 4067 11855 26281 23271 12406 -2966 -12204 -16554 -22627
2999b2627q520J0359J2116l019j301K7318K6416j1116n329K5605L7804q561l8206
$$ -22627 -31147 -20788 -8672 -11691 -12992 14326 40742 29626 24297 49902 87706 79145 40939
2986D0939j6698L1397r985l3787K4098N277j7359J2008J3155r814j6539l2887
$$ 40939 24241 55638 45653 11866 35964 41241 23882 35890 49045 39231 22692 -10195
2974a0195P491J9482L746j6903j4231j2128J6469L6559J9488j3747m1906j7484
$$ -10195 -2704 16778 20524 3621 -10610 -22738 -6269 30290 49778 36031 -5875 -23359
2962b3359m782j569l970N899J6760K2276j0680K3637L1853p777k3601j4982k2277
$$ -23359 -28141 -29710 -33680 -27781 -11021 11255 575 24212 56065 48288 24687 9705 -12572
2949a2572k0432k7396J8308K3905J4597J1012J381k135Q50L252p829o441j3920
$$ -12572 -33004 -60400 -42092 -18187 -3590 7422 8803 6668 7518 10770 2941 -3500 -17420
2936a7420N469r083j9932Q823j2869J9098J3278q334k0087J764N15K321j4082
$$ -17420 -11951 -21034 -40966 -32143 -45012 -25914 -12636 -20970 -41057 -39293 -38778 -36457 -50539
2923e0539J4500l203K3064R28p594q981Q323O372K856K1858J6448L052o811M106
$$ -50539 -36039 -39242 -16178 -15250 -22844 -31825 -23502 -17130 -14274 7584 24032 27084 20273 24379
2909B4379q849m903L6235p280n5600j8870j0667k4855M253K5371K0773P052j8250
$$ 24379 15530 10627 46862 39582 -16018 -34888 -45555 -70410 -66157 -40786 -20013 -12961 -31211
2896c1211k3748j5930R033L5949K4729p243l8692j9841K3904K8570J2006N537
$$ -31211 -54959 -70889 -61856 -25907 -1178 -8421 -47113 -66954 -43050 -14480 -2474 3063
2884C063L075k6447l0364k178K8386J9749J8375o968l0912l6921J5831Q938p466
$$ 3063 6138 -20309 -50673 -52851 -24465 -4716 13659 6691 -24221 -61142 -45311 -36373 -43839
2871d3839J0897L8812L7124L1022j5135k2497j4649j2609k1124q938J9638J122
$$ -43839 -32942 5870 42994 74016 58881 36384 21735 9126 -11998 -20936 -1298 -176
2859a76P67O427M987j4804M516J6509k1846m0667j6486J6152N371J6249j4126
$$ -176 591 7018 12005 -2799 1717 18226 -3620 -44287 -60773 -44621 -39250 -23001 -37127
2846c7127J2805m784J1574O755J4292p723j3688k565M833o884n716q399q437J6588
$$ -37127 -24322 -29106 -17532 -10777 3515 -4208 -17896 -20461 -15628 -22512 -28228 -36627 -45064 -28476
2832b8476J7450r609k29J906K0303L729K024j2484o964J5803M2624j6808J1443
$$ -28476 -11026 -20635 -20864 -18958 1345 5074 7098 -5386 -12350 3453 46077 29269 40712
2819D0712p09k6832k0575J4831J9810K2095R638o786o276j7773j1067M853J4337
$$ 40712 40003 13171 -7404 7427 27237 49332 58970 52184 45908 28135 17068 21921 36258
2806C6258L529k1614L2661O917l3002N102k591j250J4372j253P162j8722M885
$$ 36258 39787 18173 50834 57751 24749 29851 27260 26010 40382 39129 46291 27569 32454
2793C2454J0608l8391l1271J0010K6879J7603K940J4170j5255j7839j1787K17
$$ 32454 43062 4671 -26600 -16590 10289 27892 30832 45002 29747 11908 121 338
2781C38P362K654J7085O97l278k0841j8307q533J1594J8653l7697o359J3379J3456
$$ 338 7700 10354 27439 28136 24858 4017 -14290 -22823 -11229 7424 -30273 -36632 -23253 -9797
2767i797k238k2342k0249j091R546J1581J7682j4488K413J2433j376L917k304
$$ -9797 -12035 -34377 -54626 -55717 -46171 -34590 -16908 -31396 -28983 -16550 -17926 -14009 -16313
2754a6313R859J263L262n437k4290k0141Q913j6409K3012K7914j6493J5103J8633
$$ -16313 -6454 -5191 -1929 -7366 -31656 -51797 -42884 -59293 -36281 -8367 -24860 -9757 8876
2741H876j5458k4997J6909J5449r442j3034j0849j0280K2622P768O361m222L501
$$ 8876 -6582 -31579 -14670 779 -8663 -21697 -32546 -42826 -20204 -12436 -6075 -10297 -6796
2728f796J9034K417R021L0270j6768j2302N576l3j2581r867Q372k524k3110P996
$$ -6796 12238 14655 23676 53946 37178 24876 30452 30419 17838 7971 16343 13819 -9291 -1295
2714a295j0589k2180P760M1641o986p520L797J2770l4210j7485Q351M36L3141
$$ -1295 -11884 -34064 -26304 15337 8351 831 4628 17398 -16812 -34297 -25946 -25510 7631
2701G631K099r734j4724L299k415J2054O15q594L777k778J1347J8631K896q856
$$ 7631 9730 -4 -14728 -11429 -13844 -1790 -1175 -9769 -5992 -8770 2577 21208 24104 15248
2687A5248q301J189M777q645k8614j0385J3860K3335k313Q640J1754Q311J8585
$$ 15248 6947 8136 12913 4268 -24346 -34731 -20871 2464 151 8791 20545 28856 47441
2674D7441k500k0781R356K8344j4864j2352j5653l6053P353J5553Q52K202K7183
$$ 47441 44941 24160 33516 61860 46996 34644 18991 -17062 -9709 5844 6696 8898 36081
2661C6081j879j0375K702j234o691k700l2957K418R821K496j0054K7324j8658
$$ 36081 34202 23827 26529 25295 18604 15904 -17053 -14635 -4814 -2318 -12372 14952 -3706
2648c706j3096r882j0355J6203r114J7184P243J3736j5488l740r011k5187l278
$$ -3706 -16802 -26684 -37039 -20836 -29950 -12766 -5523 8213 -7275 -11015 -20026 -45213 -48491
2635d8491K9881M317R004l9640J9739O443k6001J0816L1051m288k1009J8865P039
$$ -48491 -18610 -14293 -5289 -44929 -25190 -18747 -44748 -33932 -2881 -7169 -28178 -9313 -2274
2622b274J5916M119J5522m129n214p602j830m389N279J1956p774J585K0913N536
$$ -2274 13642 17761 33283 29154 23940 16338 14508 10119 15398 27354 19580 21165 42078 47614
2608D7614k8528k8738n669L7874J4726k6388n400J854O2M152q226k8672N605J7052
$$ 47614 19086 -9652 -15321 22553 37279 10891 5491 7345 7407 11559 3333 -25339 -19734 -2682
2594b682J4073K1430r541k6405j2404m336J6178O591J7793q075N108o950L0466
$$ -2682 11391 32821 23280 -3125 -15529 -19865 -3687 2904 20697 12622 17730 10780 41246
2581D1246k462J2524m629j1866m530N332N50P207q319k0029k9909k333Q810j4879
$$ 41246 38784 51308 46679 34813 30283 35615 36165 43372 35053 15024 -14885 -17218 -8408 -23287
2567b3287L34R234K6938L6838J6086J1565j6059l9173l7456m281o556Q631n902
$$ -23287 -22953 -13719 13219 50057 66143 77708 61649 22476 -14980 -19261 -25817 -17186 -23088
2554b3088J0287J9319Q386J836j2531j8754Q032L9975M016j8542j1495j6046k4474
$$ -23088 -12801 6518 14904 16740 4209 -14545 -6513 33462 37478 18936 7441 -8605 -33079
$$ [...]
##END NTUPLES=NMR SPECTRUM
##END=
