##TITLE=Analysis number 325620
Compound Code km 00085
Book Reference 181923
Project Code adrs fraglib
Chemist Name jom
##JCAMPDX= 6.0         $$ Bruker NMR JCAMP-DX V2.0
##DATA TYPE= NMR SPECTRUM
##DATA CLASS= NTUPLES
##ORIGIN= Bruker BioSpin GmbH
##OWNER= nmr
$$ XWIN-NMR		Version 3.5
$$ Fri Jan  5 09:37:48 2007 GMT Standard Time (UT+0h)  MAYBRIDGE\nmr@NMR_250MHZ
##.OBSERVE FREQUENCY= 250.131544655141
##.OBSERVE NUCLEUS= ^1H
##.ACQUISITION MODE= SIMULTANEOUS (DQD)
##.ACQUISITION SCHEME= undefined
##.AVERAGES= 16
##.DIGITISER RES= 18
##SPECTROMETER/DATA SYSTEM= dpx250
##.PULSE SEQUENCE= zg30
##.SOLVENT NAME= DMSO
##.SHIFT REFERENCE= (INTERNAL, DMSO, 0, 16.522)
##AUDIT TRAIL= $$ (NUMBER, WHEN, WHO, WHERE, WHAT)
$$ ##TITLE= Audit trail, XWIN-NMR		Version 3.5
$$ ##JCAMPDX= 5.01
$$ ##ORIGIN= Bruker BioSpin GmbH
$$ ##OWNER= nmr
$$ C:\u/data/dgb/nmr/ADRS/360/pdata/1/auditp.txt
$$ ##AUDIT TRAIL=  $$ (NUMBER, WHEN, WHO, WHERE, WHAT)
(   1,<2007-01-05 09:37:26.63 +000>,<MAYBRIDGE\nmr>,<NMR_250MHZ>,
      <created by zg, POWCHK disabled, PULCHK disabled
       configuration hash MD5:
       49 4B E0 1D 92 C2 6B 37 9F E6 65 BC 52 41 86 1D
       data hash MD5: 64K
       40 FC AE E2 2D 67 1C 64 BC B6 F8 7D B7 54 FF D5>)
(   2,<2007-01-05 09:37:38.60 +000>,<MAYBRIDGE\nmr>,<NMR_250MHZ>,
      <Start of raw data processing
       ef LB = 0.3 FT_mod = 6 PKNL = 1 SI = 32K 
       data hash MD5: 32K
       F9 10 33 C4 CC 32 CE 4D A7 4E E2 CF D3 5E B5 82>)
(   3,<2007-01-05 09:37:40.21 +000>,<MAYBRIDGE\nmr>,<NMR_250MHZ>,
      <apk 
       data hash MD5: 32K
       00 ED 7F F3 8A BF 96 B9 2E 0F F8 78 ED 7F C4 58>)
(   4,<2007-01-05 09:37:41.01 +000>,<MAYBRIDGE\nmr>,<NMR_250MHZ>,
      <abs ABSG = 5 
       data hash MD5: 32K
       F6 F8 EE EA 5D B6 B5 4F BE B3 10 50 DE 69 31 D8>)
$$ ##END=
$$ 
$$ hash MD5
$$ FB 40 12 B0 E2 F9 E5 35 13 F9 02 E9 BA 59 3D 9E
##$RELAX= 
##$RELAX= 
##$RELAX= 
##$RELAX= 
##$RELAX= 
##$RELAX= 
##$RELAX= 
$$ Bruker specific parameters
$$ --------------------------
##$DU= <C:\u>
##$EXPNO= 360
##$NAME= <ADRS>
##$PROCNO= 1
##$TYPE= <nmr>
##$USER= <dgb>
##$AMP= (0..31)
100 100 100 100 100 100 100 100 100 100 100 100 100 100 100 100 100 100 
100 100 100 100 100 100 100 100 100 100 100 100 100 100 
##$AQSEQ= 0
##$AQ_mod= 3
##$AUNM= <au_zg>
##$AUTOPOS= <25 >
##$BF1= 250.13
##$BF2= 250.13
##$BF3= 250.13
##$BF4= 250.13
##$BF5= 500.13
##$BF6= 500.13
##$BF7= 500.13
##$BF8= 500.13
##$BYTORDA= 1
##$CFDGTYP= 0
##$CFRGTYP= 5
##$CHEMSTR= <none>
##$CNST= (0..31)
1 1 145 1 1 1 1 1 1 1 1 1 1 1 1 1 1 1 1 1 1 1 1 1 1 1 1 1 1 1 1 1 
##$CPDPRG= <>
##$CPDPRG1= <>
##$CPDPRG2= <>
##$CPDPRG3= <>
##$CPDPRG4= <mlev>
##$CPDPRG5= <mlev>
##$CPDPRG6= <mlev>
##$CPDPRG7= <mlev>
##$CPDPRG8= <mlev>
##$CPDPRGB= <>
##$CPDPRGT= <>
##$D= (0..31)
0 1 0 0 0 0 0 0 0 0.06 0 0 0 0 0 0 0.0002 0 0 0 0 0 0 0 0 0 0 0 0 0 0 
0 
##$DATE= 1167989845
##$DBL= (0..7)
120 120 120 120 120 120 120 120 
##$DBP= (0..7)
150 150 150 150 150 150 150 150 
##$DBP07= 0
##$DBPNAM0= <>
##$DBPNAM1= <>
$$ [...]
##$SUBNAM7= <"">
##$SUBNAM8= <"">
##$SUBNAM9= <"">
##$SW= 20.6930455092707
##$SWIBOX= (0..15)
0 0 3 0 0 0 0 0 0 0 0 0 0 0 0 0 
##$SW_h= 5175.983436853
##$TD= 65536
##$TD0= 1
##$TE= 294.16
##$TE2= 300
##$TE3= 300
##$TEG= 300
##$TL= (0..7)
0 120 120 120 120 120 120 120 
##$TP= (0..7)
150 150 150 150 150 150 150 150 
##$TP07= 0
##$TPNAME0= <>
##$TPNAME1= <>
##$TPNAME2= <>
##$TPNAME3= <>
##$TPNAME4= <>
##$TPNAME5= <>
##$TPNAME6= <>
##$TPNAME7= <>
##$TPOAL= (0..7)
0.5 0.5 0.5 0.5 0.5 0.5 0.5 0.5 
##$TPOFFS= (0..7)
0 0 0 0 0 0 0 0 
##$TUNHIN= 0
##$TUNHOUT= 0
##$TUNXOUT= 0
##$USERA1= <user>
##$USERA2= <user>
##$USERA3= <user>
##$USERA4= <user>
##$USERA5= <user>
##$V9= 5
##$VALIST= <valist>
##$VCLIST= <CCCCCCCCCCCCCCC>
##$VD= 0
##$VDLIST= <DDDDDDDDDDDDDDD>
##$VPLIST= <PPPPPPPPPPPPPPP>
##$VTLIST= <TTTTTTTTTTTTTTT>
##$WBST= 1024
##$WBSW= 4
##$XGAIN= (0..3)
0 0 0 0 
##$XL= 0
##$YL= 0
##$YMAX_a= 338596
##$YMIN_a= -372567
##$ZGOPTNS= <>
##$ZL1= 120
##$ZL2= 120
##$ZL3= 120
##$ZL4= 120
##$ABSF1= 16.522
##$ABSF2= -4.171173
##$ABSG= 5
##$ABSL= 3
##$ALPHA= 0
##$AQORDER= 0
##$ASSFAC= 0
##$ASSFACI= 0
##$ASSFACX= 0
##$ASSWID= 0
##$AUNMP= <proc_1d>
##$AZFE= 0.1
##$AZFW= 0.1
##$BCFW= 0
##$BC_mod= 0
##$BYTORDP= 0
##$COROFFS= 0
##$CY= 12.5
##$DATMOD= 1
##$DC= 0
##$DFILT= <>
##$DTYPP= 0
##$F1P= 14.0000005364418
##$F2P= -0.99999901652339
##$FCOR= 0.5
##$FTSIZE= 32768
##$FT_mod= 6
##$GAMMA= 0
##$GB= 0
##$INTBC= 1
##$INTSCL= 1
##$ISEN= 128
##$LB= 0.3
##$LEV0= 0
##$LPBIN= 0
##$MAXI= 10000
##$MC2= 0
##$MEAN= 0
##$ME_mod= 0
##$MI= 0
##$NCOEF= 0
##$NC_proc= -3
##$NLEV= 6
##$NOISF1= 0
##$NOISF2= 0
##$NSP= 0
##$NTH_PI= 0
##$NZP= 0
##$OFFSET= 16.522
##$PC= 1
##$PHC0= 211.5417
##$PHC1= 8.167112
##$PH_mod= 1
##$PKNL= yes
##$PPARMOD= 0
##$PSCAL= 4
##$PSIGN= 0
##$REVERSE= no
##$SF= 250.13
##$SI= 32768
##$SIGF1= 0
##$SIGF2= 0
##$SINO= 400
##$SIOLD= 32768
##$SREGLST= <1H.DMSO>
##$SSB= 0
##$STSI= 32768
##$STSR= 0
##$SW_p= 5175.98343685301
##$SYMM= 0
##$S_DEV= 0
##$TDeff= 65536
##$TDoff= 0
##$TI= <Analysis number 999999
Compound Code 99
Book Reference 9
Project Code 9>
##$TILT= no
##$TM1= 0
##$TM2= 0
##$TOPLEV= 0
##$USERP1= <user>
##$USERP2= <user>
##$USERP3= <user>
##$USERP4= <user>
##$USERP5= <user>
##$WDW= 1
##$XDIM= 32768
##$YMAX_p= 400183344
##$YMIN_p= -210188
$$ End of Bruker specific parameters
$$ ---------------------------------
##NTUPLES= NMR SPECTRUM
##VAR_NAME=  FREQUENCY,     SPECTRUM/REAL,   SPECTRUM/IMAG
##SYMBOL=    X,             R,               I
##VAR_TYPE=  INDEPENDENT,   DEPENDENT,       DEPENDENT
##VAR_FORM=  AFFN,          ASDF,            ASDF
##VAR_DIM=   32768,         32768,           32768
##UNITS=     HZ,            ARBITRARY UNITS, ARBITRARY UNITS
##FACTOR=    0.157963299565203, 1,           1
##FIRST=     4132.6476996994, 0,             0
##LAST=      -1043.33573715361, 0,           0
##MIN=       -1043.33573715361, -210188,     0
##MAX=       4132.6476996994, 400183344,     0
$$ Real data points
##PAGE= N=1
##DATA TABLE= (X++(R..R)), XYDATA
$$ [...]
20681 18089 20384 25487 26559 17010 -2356 -501 -15944 -12221 5949 -20716 -27895 -18874 -11626
20668 -11626 2095 13827 1211 -35897 -57111 -44804 -18078 -2897 -17115 -25846 -24121 -999
20656 -999 -26564 -33570 -3160 8179 8971 20958 7568 -19415 -10957 10839 -7786 -16367 -16456 3800
20642 3800 11262 14209 6239 -23090 -23591 -18397 -8701 -12750 1006 -24864 -29897 -35314 -34926 -39377
20628 -39377 -14141 17095 45572 61283 47906 18941 28624 29914 28884 -1667 -28423 -21674
20616 -21674 -10088 -12799 -14920 19540 8371 -22317 -45863 -38180 -2116 17876 15522 13584 -1413
20603 -1413 -261 -78 7015 8748 13420 21364 23363 15206 18467 11579 4971 -14039 -24662 -30501
20589 -30501 -47757 -39007 -30988 -26859 -15876 -12142 -24153 -52652 -50482 -37020 -16360 -30587 -19424
20576 -19424 -20314 -20882 -9728 356 -1940 -8954 -14184 -12250 -18165 -15123 -15077 -30680 -29381 -32255 -27036
20561 -27036 -16638 -32922 -41459 -26561 -32261 -20861 14174 14860 5440 21680 1769 -18532 -18043
20548 -18043 2682 12822 -3073 -10839 -2801 -30500 -49546 -6071 13359 19089 36329 2405
20536 2405 -10175 1412 6372 19101 -2606 -8776 -5723 -946 -21085 -24520 -14647 -16525 -22700
20523 -22700 -33256 -28101 -24375 -17070 12773 23279 22379 33049 16987 16659 -2631 -15521 -5168
20510 -5168 2283 -599 3643 -10294 -18959 -34198 -52510 -43920 -53502 -44982 -23007 -2372 -2267 2376
20496 2376 589 8948 -1863 -15586 -4069 3552 -7565 -32997 -28841 -16338 -16549 13250 34027
20483 34027 27333 9594 -14375 -23740 -19565 -4851 13752 26922 727 -26797 -5143 15723
20471 15723 3952 -3861 -20149 -15545 -23194 -15553 -17291 -24138 -12637 -27440 -20382 -7340 2520
20458 2520 2785 -17870 -31156 -16495 -8431 -19673 -22845 -26727 -7094 1434 2679 2618 -2695 -18108
20444 -18108 3593 22472 12521 -2997 -4365 -8569 5237 12880 21813 22904 5564 -13540 -25443
20431 -25443 -28516 -21429 -2499 -438 -11899 -16672 -3789 5640 5517 3587 8023 31932 34308 4901
20417 4901 -20656 -39236 -55934 -67552 -56153 -78844 -51669 -11124 5095 -16174 -810 3711
20405 3711 -16808 -17330 -20752 -5190 -14527 -21905 -26292 -34103 -5672 15685 19691 28512 2368 -2626
20391 -2626 -14846 -28801 -24592 -8641 -17844 -33956 1961 37347 13333 -5365 -5273 -4961 -19789
20378 -19789 -45980 -39972 -22225 -23875 -1844 35659 42705 42719 12148 -8987 -7788 -3346 4851
20365 4851 20293 26234 14358 14724 -1548 -8808 -10961 -12993 -22527 -28888 -27975 -10453 10985 20814
20351 20814 24529 22808 33597 25910 30345 38522 17340 -1712 -10418 -16981 -16608 -6445 -24621
20338 -24621 -26294 -25607 -26047 -17330 -34449 -50819 -40558 -31285 -33183 -19627 -13217 14297 17996 -24088
20324 -24088 -58121 -63383 -46754 -24287 -17449 2918 -3883 -12924 -16844 -12424 6289 -11665 -27802
20311 -27802 -35681 -27438 -14550 -13481 -35580 -24540 1282 14830 21432 34663 45898 26752
20299 26752 11456 -4473 -32566 -38719 -5956 -14816 -18600 5222 22649 22270 28463 34172 31416
20286 31416 24776 22267 6226 -5834 -10685 -21237 -3381 21444 26811 26271 32581 22081 12521
20273 12521 -1718 7215 14950 23495 8840 15132 10304 5074 -7176 -3194 -3683 -10992 -4075 2741
20259 2741 10947 -7916 -25277 -3218 12687 7024 7710 2133 -4403 -8670 -10036 -21884 -30302 -29246
20245 -29246 -24440 -16070 -4116 -3560 -12268 -16311 -16809 3183 -2521 -32804 -28840 -20579 -15775 -11617
20231 -11617 7852 22499 23974 -5298 -29393 -44655 -22788 2061 -25416 -42146 -44127 -28905
20219 -28905 -13838 -11302 11068 8297 -15030 -3945 9775 -15585 -28121 -10055 20 16100
20207 16100 5198 -627 1329 4851 7262 -7031 -16773 -6558 20390 9651 724 15278 7767
20194 7767 -4862 -13281 -23761 1476 18995 32696 33584 30852 7840 -9435 -12370 -8430 6752
20181 6752 13412 -114 -3105 -8108 -18287 -14928 -17683 -17674 -22343 9947 14362 -12346 -3190 15400
20167 15400 10721 -6528 -8052 -13232 10529 21695 16693 -14318 -44298 -38902 -36498 -50478 -31528
20154 -31528 -10455 -22470 -51902 -50438 -34000 -32407 -20528 -35056 -39647 -25072 -17356 -26662 -45709
20141 -45709 -47873 -44968 -33493 -1294 -2988 -9879 -3839 -9031 -18387 -10115 -2849 -22494 -8457
20128 -8457 7941 1410 4457 8608 18287 30899 44340 31413 6105 -7326 -16374 -19953 -48291
20115 -48291 -35427 852 18622 3527 7523 15665 -2697 -8236 -1772 -4399 -14803 -20578 -11088
20102 -11088 -14920 -18262 -16110 -21484 -3559 175 421 -16207 -18145 -12994 -10293 -103 16879 22999
20088 22999 11367 3866 -764 5321 15674 14487 12150 6380 20493 -5652 -1429 -8743 -22797
20075 -22797 -35696 -28973 -15203 7004 7122 28362 14999 -7758 -14599 -28694 -29233 1064 1768
20062 1768 -15111 -10203 10238 8538 5620 -17254 -20573 -12824 -43104 -50898 -31587 -14260 -15712
20049 -15712 -13516 -8292 1469 -6117 -12135 -12202 -1197 8653 -3227 -8059 3597 7241 1814 -15039
20035 -15039 -11142 6369 10264 26551 25192 991 -3701 1660 -4137 -12663 -11542 -10886 -9250 723
20021 723 1037 4693 34461 42781 26765 -3055 -9840 -1599 26529 15592 -2523 -14537 -27612
20008 -27612 -50618 -34644 -25206 -3665 313 -4107 -808 15805 27629 23212 22128 19387 32552
19995 32552 28876 28106 24501 36935 31715 23378 27997 8370 13459 21179 2591 2196 16387 -14144
19981 -14144 -30362 -30179 -25638 -401 17692 25038 18991 27677 -346 -1208 14918 1559 1308 5000
19967 5000 -19912 -26112 4560 12096 4595 -424 -12623 -21975 -16801 4716 18480 442 -3043
19954 -3043 18818 43810 59242 63120 30136 -239 -16771 -4204 25703 26023 16419 16707 -7632
19941 -7632 -11773 -5951 7305 17103 40509 44440 17581 11021 -2391 -8608 -27368 -9788 22601
19928 22601 20192 -8574 -4593 -27531 -23107 3009 -7592 -785 1740 -8273 -22070 -45401 -51846
19915 -51846 -47124 -47107 -19320 33961 25966 10013 -12664 -18677 -32320 -38571 -54245 -37063 -11649
19902 -11649 -5019 -1363 8414 15562 16301 35774 37712 26746 515 -13427 -28836 -18383 -16441
19889 -16441 -7903 -119 -9015 -26222 -6818 5689 16987 8081 20930 29964 8988 14284 16172
19876 16172 -267 -5692 2250 16981 14914 40896 35648 28053 19663 -281 -8710 -24407 -33857
19863 -33857 -17256 -4030 -6339 978 2622 2828 5669 -12134 -98 21259 22385 15623 25354
19850 25354 39650 33244 45327 22825 33690 37145 6176 -21958 -9160 8235 6751 3147
19838 3147 -7657 21033 979 3224 776 -5640 -6951 -13392 -6619 17483 2739 -25919 -19085
19825 -19085 -6076 -14203 -6750 -15248 -28571 -39479 -44303 -30338 -2594 -7190 -19424 -11658 -10046
19812 -10046 -2549 9143 -10925 -28471 -13603 -12614 -9263 -10283 -3385 -15711 -24440 3572 8623
19799 8623 -20214 -20939 -10394 19090 14967 -5008 -6304 7236 -4033 -6505 -19357 -20959 2334
19786 2334 16509 12844 -3871 -39855 -53801 -49018 -46956 -33833 -42852 -54156 -53285 -35395 -53852
19773 -53852 -57412 -24714 21939 6813 -6987 -17344 -29240 -15986 -110 7932 -16219 -14758
19761 -14758 -6678 -5274 -24366 -18139 -6239 -22823 -12963 1899 7938 15048 19250 19645 4904
19748 4904 10286 15389 8520 -7879 9498 31071 27393 4504 1616 13512 13631 13875 6509 -1217
19734 -1217 6684 33358 22670 294 -47492 -51457 -32764 8824 6924 -5363 -2188 2931 -8673
19721 -8673 -2940 181 606 -8559 5459 11042 -2074 -38003 -19423 -3135 -4844 -10420 -13390 -11066
19707 -11066 8217 13046 3727 10600 34068 29496 25739 15898 15137 17617 11267 -4196 -19261 -22220
19693 -22220 -26328 -32369 -35958 -39295 -7187 3950 13976 21250 -423 -27642 -32536 6055 16454
19680 16454 -14124 -24529 -9388 21165 57471 53613 41446 14146 11220 5472 16061 -6706
19668 -6706 -32009 -23494 -30251 -9783 12705 10636 -457 -19819 -40768 -18307 -2918 5384 21504
19655 21504 16222 5971 575 24271 27305 33929 41717 45482 37418 15440 3972 -10107 -32826
19642 -32826 -21635 2745 2818 -4528 -8343 2172 4949 -29463 -39937 -48332 -40625 -31036 -1220
19629 -1220 -7583 -17811 -1119 -9501 -7235 -15390 -27636 -18272 -15026 -2632 2585 -20509 -26759
19616 -26759 -19432 -5328 15029 18564 9230 -9560 -18942 -11910 -3246 11916 14263 -7763 -28658
19603 -28658 -32690 -23208 -17877 -21462 -21405 -20085 5760 7812 1716 -13974 -17374 7682 20663 3647
19589 3647 2836 5588 19057 -5750 -9930 -12895 -24608 -49233 -35144 -12192 -1375 -6086 -20434
19576 -20434 -7202 -10708 -32664 -35883 -34864 -36754 -48429 -62148 -50603 -40181 -30970 -26754 -32778
19563 -32778 -35325 -18474 -21314 -15053 122 5868 13339 8247 -7828 -7255 -1696 21963 53979
19550 53979 43519 17776 -5450 -10203 -19398 -30070 -47622 -32276 -20737 4118 39508 27528
19538 27528 -9127 -19226 -970 -33483 -42721 -30656 -12929 -33932 -24211 -7079 14263 -4404
19526 -4404 -16241 -17345 -21236 -9991 4054 -2756 -7785 5442 -12552 -34170 -52047 -51683 -44038
19513 -44038 -25174 -5643 -32087 -35694 -10135 -6771 18769 35775 11731 -25773 -17131 9207
19501 9207 28486 36642 27886 -6761 -10528 314 -8947 -11775 -4433 -14571 -39119 -35173 -24986
19488 -24986 -22049 -13936 -16913 -2158 -4584 -93 -10054 -9798 -12334 18170 13749 13639 21561 34332
19474 34332 22677 -7611 -35130 -32409 -39469 -44811 -31147 -3622 12860 24250 23999 23068 26299
19461 26299 30058 22788 -9138 -30350 -13712 475 -28043 -51900 -57099 -55264 -33788 -15271
19449 -15271 14986 13756 -8738 -10294 -13635 5994 9794 -6653 -19759 6470 25763 8387
19437 8387 -28881 -19069 -10208 4163 -10139 -25177 -24593 -5464 10940 24405 25401 -5573 -35150
19424 -35150 -44040 -34927 -9872 -6413 -11673 -4538 16973 21607 -2403 -34282 -40767 -36883 -18957
19411 -18957 -20395 -12890 4494 316 -3827 -13802 -7344 291 4717 23617 29787 33507 18789 6627
19397 6627 -553 828 -6162 -3019 -22220 -28022 -41357 -38838 -34735 -25227 -23339 -27662 -19423 -8627
19383 -8627 1880 24145 37055 53733 36233 -1026 -26430 -31136 -43433 -40237 -21415 19520
19371 19520 14524 -15 -14217 -3976 5244 -1800 -19736 -4161 -16243 -17306 -33214 -37808 -30396
19358 -30396 -31716 -27199 -19904 -15895 -21681 -5093 2751 13651 11415 -12095 -17078 -35986 -20419
19345 -20419 -5784 2379 13405 12443 -2971 13780 19479 37055 22538 5830 -18128 -20668 -18184
19332 -18184 -26704 -43502 -34013 -9435 7634 -205 -3756 28272 50710 29291 4262 7623 2782
19319 2782 9792 14747 4579 398 26532 53371 38502 24694 38769 38514 37291 32062 34357
19306 34357 17070 10939 7127 12501 10951 18015 31536 27173 4580 -3824 2981 -1100 -7311 -12032
19292 -12032 -7962 -19506 -14228 6086 20112 3118 -10120 25938 32032 10886 9877 7279 3833
19279 3833 224 -23506 -31818 -22083 -18421 -30445 -18466 4383 17072 4437 23871 40255 43439
19266 43439 37148 17542 7267 27327 36966 15595 -8898 -22113 -7049 22502 16687 -3734
19254 -3734 -20984 -40911 -28849 -2791 10332 -6051 -21120 -8829 -2162 7962 24785 34563
19242 34563 27530 7668 -2287 -17564 -26820 -12527 -18946 -34828 -33965 -16524 -9164 -9934 -16409 5064
19228 5064 40991 37163 8527 -19993 -31821 -27345 -4426 3552 -351 -750 12743 -5750 -15624
19215 -15624 -30820 -29481 -28744 -11147 -9104 -7658 -23420 -17779 -23212 -28226 -27807 -33281 -23255 3160
19201 3160 9807 -24798 -34961 -35329 -28730 -32500 -10693 10803 23970 17893 -23058 -41325 -50293
19188 -50293 -37926 -45189 -38958 -28782 -18487 6074 -11038 -22463 -32422 -30496 -10768 6739
19176 6739 20918 17210 -7377 -6960 13502 30634 33195 8331 -8660 98 12917 13784 -2206
19163 -2206 -18634 -23769 -23397 1383 17990 28500 38335 13494 -5520 -7242 3040 8576 23482
19150 23482 31585 17955 5163 6600 -8786 -455 262 -19645 -27510 -12359 -5925 3980 -842
19137 -842 -17844 -39015 -50505 -33352 -27198 -38103 -46691 -29870 179 22903 46883 58321
19125 58321 19771 -12448 -1963 8914 -613 -13152 -3288 -6020 -31014 -39915 -27233 -539
19113 -539 4399 7306 4008 11841 19614 8685 23713 15156 -13035 -19057 -35204 -32579 -22628 2663
19099 2663 8631 5224 8659 -3446 9052 17917 -10682 -10570 -7183 -6186 -15336 -8709 6919 17346
19085 17346 29704 15402 -14024 -25048 -33213 -12661 8303 19602 -1613 -14973 -11304 -266
19073 -266 837 -2023 -26555 -53103 -71171 -52147 -35294 -19964 -26203 -32689 -30329 -47426 -42614
19060 -42614 -27545 -23956 -30140 -38568 -31181 -27569 -27038 -25580 -34276 -29252 -18213 -4912 7916 33367
19046 33367 23358 693 -6925 15125 21850 16455 -23013 -46588 -51177 -44622 -39427 -44886 -33956
19033 -33956 -20260 -22829 -22100 -19081 5784 4123 8986 7574 -2513 -8628 2840 -18356 -15410
19020 -15410 -5670 -1661 -11851 1797 13183 11952 -2139 -17264 -13874 -747 -28857 -54197
19008 -54197 -45727 -11024 14093 32017 28366 7666 -18003 -11845 5453 26551 9215 12502
18996 12502 27547 26337 7999 -4389 9667 15817 12550 12098 5699 -5062 -23480 -32571 -13939
18983 -13939 -3501 -23083 -1947 7550 -73 10707 -884 -3360 -10967 -29425 -36427 -31732 -12908
18970 -12908 -16171 -13766 544 -22182 -30384 603 11286 -9583 -22691 -11526 -14381 -26721
18958 -26721 -18396 -28518 -30536 -21744 -22120 -24828 -30896 -17825 4420 16562 -8764 -27819 -45665
18945 -45665 -39718 -7633 -11352 -26592 -37652 -46809 -43730 4994 23807 18428 6083 7134 4812
18932 4812 -2072 4143 15208 7642 6366 2801 8321 13117 -2462 -20325 -20397 -2648 12101 20500
18918 20500 -713 -21734 -15433 -13226 1607 -3580 -18074 -18486 -10502 -2618 15883 20328 -5887
18905 -5887 -14072 -2085 -3807 7878 19157 20401 735 -6581 -22034 -27483 -21339 -11485 -15492
18892 -15492 -27102 -23639 -3686 32527 23204 -23277 -41816 -20294 -16962 -29299 -38569 -50420
18880 -50420 -48845 -48627 -29440 -2945 -5863 -14802 -35594 -34010 -7729 -1229 14126 23800 -1160
18867 -1160 2858 -7260 6828 21484 47183 45452 46772 27519 2258 -22117 -10734 17380
18855 17380 24929 15291 8587 11159 -18724 -30524 -19713 -928 8953 -409 -39433 -31934 -44884
18842 -44884 -56300 -48517 -29143 -44357 -27772 -7387 -4778 1453 6658 -11839 -5709 -13777 -24057
18829 -24057 -2356 14390 8502 -14570 -21029 -14838 -19269 -12507 19251 14854 14780 26202 29376 13466
18815 13466 -1231 -14401 -17816 -14959 -23903 -29864 -7687 -1879 -13914 763 12608 26354 33976
18802 33976 19951 -2757 -26205 -52004 -58099 -36443 -18094 -9722 -5306 -18772 -11308 -16306 -9690
18789 -9690 -7398 6432 7702 23139 48853 49533 34695 22514 8888 -18620 -16202 1956 15164
18776 15164 -6216 -2412 -7879 -4251 6733 40977 43145 20866 -9030 16199 21035 12331 -4245
18763 -4245 -1789 -19404 -2432 7028 1966 225 -15755 -46781 -58532 -35983 -26671 -16727 -9362
18750 -9362 2763 7934 24538 40298 57687 41646 21641 23128 29778 7484 -19265 -12799 -1093
18737 -1093 -2006 -16852 -42207 -37153 -22064 -5387 -8487 5547 12151 -10774 -31600 -22607 -8627
18724 -8627 -453 -14663 -8786 9334 6241 1767 -1481 -6894 -42140 -61839 -48707 -42731 -28037
18711 -28037 10508 7990 -4054 15413 31335 16974 17678 36343 18820 -4199 -27071 -6783
18699 -6783 740 -14581 -12109 -14124 -4802 -6596 -10522 -23468 -3622 6099 -27243 -46289 -28875
18686 -28875 -10591 -6681 -6550 2749 -3447 -14332 -13255 -5688 -20815 -22943 -13068 -18264 -23567 -27004
18672 -27004 946 -2285 -9822 -20461 -20180 -16598 -17616 -7407 12735 14864 24355 3515 -33164
18659 -33164 -43450 -22326 -20628 -20103 -23510 -19528 -31777 -19587 -27190 -48080 -59354 -35259 -14937
18646 -14937 -30480 -20763 2808 -1916 -18729 -17779 -14022 -11005 -7989 -13285 -15838 -24185 -27793 -16522
18632 -16522 1187 -19658 -38721 -28571 -7585 -3709 6605 -5306 -33180 -27424 -38370 -37669
18620 -37669 -24283 -29340 -41613 -32016 -6261 4968 -8704 -5915 17352 -1819 -18159 -14489
18608 -14489 -18560 -8793 -2909 -3478 543 11283 20155 42374 57448 29926 -11908 -24844 -32726
18595 -32726 -15668 -9027 -17171 -5627 2178 2584 -413 5675 11610 11485 -6584 6857 -8864 -4131
18581 -4131 13915 6966 10258 29862 35877 55093 34343 2962 15154 19701 2952 -9944 -20543
18568 -20543 -20340 -42128 -54394 -26124 -14617 -16726 -9263 -40921 -46101 -4559 20779 37142 44913
18555 44913 26652 -2212 -21959 -33605 -52145 -44465 -27156 -905 13934 16133 23187 1430
18543 1430 -13498 -8143 12611 8191 -12186 -1004 -8213 -21257 -7531 -19854 -16541 -16236 -1301
18530 -1301 14313 29595 43381 50427 50883 30844 32555 33154 7446 14917 12246 -10201 -29244
18517 -29244 -21926 2786 5701 17453 -1297 2080 -13264 -26720 -7487 12196 27456 34445
18505 34445 13312 15610 36041 36600 11162 -9931 -47491 -28451 -18498 -14512 13174 6319 404
18492 404 3182 -8249 -18312 -18422 -10340 -6656 -7676 -4878 -8464 4454 9561 16719 9732 2672
18478 2672 -343 8489 24190 14307 -3695 1711 9405 -11318 -22808 -28677 -6402 12724 16804
18465 16804 5832 13104 -9569 -5111 7214 9119 12742 1230 -4261 3569 -9865 -26913 -9874
18452 -9874 -5640 -27940 -2869 14167 18139 37060 20132 783 -4357 -1143 -13676 -41885 -19849
18439 -19849 -11872 -23030 -30595 -36002 -46571 -56565 -47044 -37204 -28976 -31797 553 5177 -5139
18426 -5139 -6831 -15973 -8414 1859 -6509 -9096 -6542 -14397 -28558 -15331 -10199 -37897 -43092 -52639
18412 -52639 -57519 -47014 -31896 -10041 -18367 -18313 -17314 -26402 -11284 -3348 5809 -4440 -16837 -35336
18398 -35336 -28644 -7069 -5303 -8935 -24110 -33837 -12049 -17829 -37296 -29873 -9587 -15830 -10199
18385 -10199 6668 3262 -24869 -40716 -29139 -19419 -21849 -2775 -2506 -164 -9664 -17540 -9597
18372 -9597 -17071 -8612 4041 5344 21124 22294 32362 65367 39243 21765 13952 10125 -6034
18359 -6034 -23856 -9402 -5477 -6554 -460 12468 -7829 -25403 -25592 -18647 5647 2416 8896
18346 8896 5068 4030 -12311 -19048 -19122 172 23889 7016 -15752 -32219 -37830 -38013 -22515 6345
18332 6345 10859 -3481 -33 1708 -3159 -191 8041 -2039 17601 10968 -8026 4151 7138
18319 7138 -25119 -9900 4325 3590 10709 -3392 -20826 -44311 -43143 -31005 -4696 7401 13773
18306 13773 11223 -234 -29364 -8091 4092 -1860 -5806 14905 33887 31807 8499 16614 33113
18293 33113 8148 7158 26040 40161 42445 31852 22690 16342 16038 4729 -17125 -20452 -36832
18280 -36832 -40601 -48666 -13540 -751 -20939 -14411 18659 17882 3006 4795 -6938 -2721 -6796
18267 -6796 -21393 -49834 -36671 -26424 -30694 -16589 -3520 -9177 -29274 -20610 -10249 -25495
18255 -25495 -32571 -36195 -44998 -28548 -28439 -44899 -54562 -50170 -55558 -64997 -32961 -6612 24358
18242 24358 22029 17973 3774 858 -2999 -23768 -45252 -38525 -23595 16345 37970 34425 41509
18229 41509 44251 30347 5096 -10130 16825 36564 46217 11850 -955 3686 6719 25475
18217 25475 -5368 -25083 -41012 -25208 296 -3394 -27815 -32645 3679 -3640 -13460 -6741 -5657
18204 -5657 -5073 9712 12825 12680 -14475 -32129 -21280 -24060 -12651 31699 33949 23800 17060
18191 17060 2292 23341 11137 -11363 -19125 -10399 -16790 -21256 -17713 -17743 -16006 -24855 4970 -2445
18177 -2445 759 2501 17132 33222 23133 15316 27113 -8240 -20813 -32391 -25198 -15034 -17783
18164 -17783 -31790 -39170 -20450 -4320 -2114 3318 -4114 -8006 6730 4115 717 -5959 -16855
18151 -16855 -6508 15587 19304 10134 4438 -6597 -29598 -43982 -51091 -31776 -12994 -11836 -2863
18138 -2863 6721 -14179 -3933 8474 17450 19357 5265 16643 13419 29983 28988 17559 4474
18125 4474 31162 22911 -2205 -6764 -22003 -48679 -45532 -36058 -15308 -15166 -8067 -34525 -37978
18112 -37978 -27290 -343 30883 28435 6257 -4802 -2164 18672 28171 5416 -17436 -13916
18100 -13916 -6332 255 -10172 -34714 -33965 -945 18093 3143 -10 -29957 -24913 -24452 -34272
18087 -34272 -25078 -30141 -5793 21610 8417 -14800 -16898 -2266 5131 3646 13900 -9738 -25369
18074 -25369 -25671 -50481 -43059 -17356 -4290 2285 -888 24476 30106 15692 30782 15767 13647
18061 13647 -1655 -27087 -33516 -32128 -34173 -23232 13248 6089 -10549 -19546 -37643 -23690 -18622
18048 -18622 -33212 -15821 10753 17353 33478 17121 -2944 -7799 223 22586 17843 24998 22635
18035 22635 15749 7004 -3381 25222 9780 -16010 11760 35888 25330 -7889 -29903 -27841
18023 -27841 977 26068 28862 24141 31364 26343 11896 17826 20707 1707 2398 23400 46008
18010 46008 29791 2310 10963 62 -6434 -30809 -43072 -25752 -9076 -26651 -23763 1472
17998 1472 -6071 -29922 -23892 -26737 -22657 -1134 13796 414 -25452 -22930 -15608 10594 20731
17985 20731 16509 -8064 -39331 -46251 -25595 -36322 -44956 -23315 2215 1517 -23756 -10310 9833
17972 9833 8384 53 18241 -3715 -1851 11171 11196 -16529 -52489 -39606 -29243 -15375 -12190
17959 -12190 -8419 5014 13574 -11701 -21861 -19226 -27800 -15298 -14301 -39346 -27603 1577 -19194
17946 -19194 -33554 -18798 2691 1066 -24696 -30375 -4463 6659 10842 6718 36021 39929 34690
17933 34690 28211 10140 6273 21567 32004 45751 50904 42595 25638 24651 15469 15376 -2293 2936
17919 2936 -13642 -14147 -12889 -12175 -7783 9818 5070 -13789 -30318 -25254 -46917 -53728 -34214 -36908
17905 -36908 -32384 -29373 -42089 -25290 3085 12183 -1031 19610 7069 -23316 -23914 -6731 -20363
17892 -20363 -20901 6314 24576 37325 15086 -2013 -187 8025 3133 12355 9796 -9495 -29849
17879 -29849 -17832 -7536 -3948 31353 33738 23065 14277 26298 15485 1334 -6585 -16619
17867 -16619 -27114 -37603 -38156 -41258 -17268 15372 29601 5464 -14303 6889 7648 -8524 -8931
17854 -8931 -24861 -31196 -13811 5894 5804 8136 -11459 -32792 -38177 -41535 -27734 -8591 -19378
17841 -19378 -32017 -4239 -9345 -18593 -22228 -16765 -18885 -32772 -40834 -19284 -22377 -19419 -19169 -15136
17827 -15136 -13760 -5605 -8971 -17440 -3743 3403 7205 3601 -3691 -2304 -18507 -22734 -10097 -720
17813 -720 12256 445 7358 -980 -11262 -28286 -46945 -33482 9479 23367 12878 12456 -14708
17800 -14708 -29775 -32887 -37057 -29547 -21015 -28460 -33825 -24429 -5384 -8349 -6029 3727 -10903 -15013
17786 -15013 -22037 -13361 -16059 -16395 -20248 -9724 22429 34360 38540 41700 37453 35183 22280 16179
17772 16179 19553 2116 -8881 -3909 5549 -20229 -30962 -26880 -33153 -24851 -11539 -11089 18698
17759 18698 16863 -7849 6574 18799 5709 18702 25178 7493 -13032 -6508 -8115 -6080 -25841
17746 -25841 -3933 16087 26332 8544 1581 -12710 -10661 -22679 -26349 -19681 -26091 -27311 -20206
17733 -20206 -14545 -12009 -25606 -28810 -51480 -41067 -32069 -27430 -15839 -28536 -34595 -23636 -19979
17720 -19979 -30661 -32924 -51082 -51499 -24194 -5351 -19127 -32650 -35467 -9880 -2293 6315 34460
17707 34460 25060 -8206 -12523 -4222 -19434 -28511 -10969 -23345 -35043 -22751 -11178 -5993 -13749
17694 -13749 -35714 -22175 -13650 -26455 -65672 -63422 -40023 -13404 -11535 8106 5942 -4532
17682 -4532 -30461 -34313 -18067 -926 -25060 -25586 -4724 10678 42547 29043 29478 16712 15496
17669 15496 722 -10789 -22972 -9827 -1800 5708 -4664 -33609 -42482 -15877 5038 -3079
17657 -3079 -16837 -28965 -38736 -41769 -26390 -14235 5471 -8892 -14256 -4521 9759 897 -3629
17644 -3629 12271 5672 7687 6471 -453 6402 7723 13139 16325 -19713 -29741 -18002 -14875 -23313
17630 -23313 -25201 -13809 -19637 -49201 -62413 -44064 -26719 -20984 -16620 -10530 -21833 -18021 -20167
17617 -20167 2375 18570 43595 25934 2212 -13843 -4872 19104 7247 5039 -4680 1521
17605 1521 5639 10237 14998 9073 -4873 -23572 -18320 12062 21585 -5063 -21028 -37791 -22326
17592 -22326 -9720 19147 21827 -15589 -18782 -5581 -19231 -47271 -59173 -41142 -40670 -32544 -25936
17579 -25936 -39028 -39167 -42784 -15269 3837 9139 -5640 -9701 -2244 -293 -3848 -1221 7166 -1851
17565 -1851 -17195 -8018 -1343 -7453 -3353 -4655 -12686 -11025 -10557 -22560 -20603 -30158 -21540 -3622
17551 -3622 5238 15195 24791 10952 -11162 -6680 11928 27350 20243 -9285 -35296 -25696 -15542
17538 -15542 -17257 -21339 -9461 -10902 -21103 -14372 -4832 2111 9776 4622 1893 -30548 -13123
17525 -13123 4466 -3973 -6739 -5543 8087 5945 3738 -8831 -15100 8437 22070 10022 12081
17512 12081 7383 5855 6856 2267 -10712 -28805 -42267 -36352 -30358 -17781 -25304 -18562 -15669
17499 -15669 -3596 4474 -899 4776 -6936 -6789 4445 -9259 -23119 -34110 -21611 -29080 -31248
17486 -31248 -30339 -32756 -41756 -33235 -9307 -21719 -20155 -10049 -40130 -38556 -45377 -53465 -58886 -38722
17472 -38722 -36533 -41602 -21498 -15331 -21641 -14922 14272 16262 9600 12696 -8175 -26303 -16422
17459 -16422 -18697 -24424 -23967 -5171 1871 7353 -3055 -34250 -24216 -16441 -32137 -40486 -23047
17446 -23047 -6239 -27478 -41008 -34528 -11578 -7866 -23 7495 -3800 -24031 -5220 15871
17434 15871 33552 24335 35548 19370 -4942 -3656 -9349 -19703 -10688 8120 12095 22 -683
17421 -683 -14482 -34153 -37160 -41597 -39273 -28025 -34113 -45605 -27777 3665 -24237 -50827 -32831
17408 -32831 -9099 -26199 -37975 -21690 -47 27576 31567 2327 -14772 -6581 10846 32237
17396 32237 28737 -904 -25454 -20932 -5723 -7765 -965 -113 -689 26468 44062 56953 47257
17383 47257 -116 -27295 -21250 -12064 -4897 -26205 -25526 -9437 -15505 -30558 -32077 -19122 -25701
17370 -25701 -14431 -35190 -28865 -31364 -23255 -28342 -41897 -20081 -13542 -3472 -14299 -19964 -11643
17357 -11643 -11299 -16675 -21149 -16333 -11457 -10822 -18146 -34303 -32329 -14619 -7725 -18970 -39236 -45312
17343 -45312 -33772 -50073 -42243 -13627 1591 439 7339 22329 12455 -1592 6730 -1571 5920
17330 5920 1625 -4982 -1675 20894 27659 25157 36128 58812 47747 16717 -6184 -20107 -4159
17317 -4159 -19911 -9292 -16486 -14991 -16724 -18457 -29534 -37391 -12198 9158 -7182 -26429 -35826
17304 -35826 -25827 -41300 -27312 -5369 8978 6233 -4409 -33182 -47781 -55718 -40356 -25363
17292 -25363 -36564 -29221 -26179 -37606 -60499 -41904 -23658 -34081 -36028 -32017 -26145 -8813 -7986
17279 -7986 17724 23175 4014 -4583 -3582 -17890 -12429 -795 -22996 -11656 -1194 3736 -7352
17266 -7352 -14672 -4639 12481 14078 2026 -21608 -19939 -14609 -21280 -19826 -6249 13070 409
17253 409 -4672 -16022 1099 -11650 -1116 -12764 -23579 16546 17536 -13938 -6138 220 -3737
17240 -3737 -394 2130 -5087 -22287 -15403 -33161 -41945 -32492 -9729 -6840 1277 5319 -4372 -23032
17226 -23032 -34440 -29119 -41272 -29729 -23641 -29392 -28439 -25942 -13965 -17522 -14526 -23143 -37017
17213 -37017 -50576 -63581 -56901 -34866 -13246 21233 48789 35498 1084 -29187 -41350 -32145
17201 -32145 -5071 -3744 -9621 -25519 -27459 -17942 -30855 -27975 -18200 -14818 -18300 -1710 13905
17188 13905 10843 -20921 -17788 -1612 15115 24027 19136 21478 5821 5420 747 -2100 532 -19837
17174 -19837 -31403 -29451 -13930 17258 23908 38155 33541 8910 -7282 -7754 -10807 -26892 -27411
17161 -27411 3482 -17727 -33599 -8364 37872 27044 6303 -1649 -4728 -23212 -12684 8787
17149 8787 1344 -13672 14071 36294 22481 -9434 -7225 20159 31735 909 14083 20877
17137 20877 -5390 -19737 -27154 -31749 -23019 -9442 -2504 5994 674 -3649 2189 18299 15755
17124 15755 12488 23369 19497 -7474 -16817 -18039 -8121 -22987 -21204 -23893 -8503 -4818 -16076
17111 -16076 -38038 -69392 -60266 -27739 -34967 -21456 -5665 -7416 -17450 -40949 -42750 -19192
17099 -19192 14313 14527 -15324 -31356 -36414 -51830 -70307 -72368 -67359 -68581 -74582 -71529 -45384
17086 -45384 -33417 -31245 -23855 -26065 -26300 -21599 -42828 -65753 -62643 -56787 -39811 -29743 -24853
17073 -24853 808 18269 10039 3360 -3871 -19981 -33202 -32232 -32369 -21255 -9665 6868 -5076
17060 -5076 -33297 -35591 -16096 -3777 -3945 -23547 -19564 -16531 -15172 -18277 -29324 -23778 -14358 -514
17046 -514 6299 -13399 -17802 -19593 -18303 -17296 -10339 -9976 -4483 -16584 -10550 -2173 -165 -10796
17032 -10796 4695 38476 43453 52825 51036 36296 -2447 -24510 -9731 -4739 -30851 -28709 -21216
17019 -21216 -14808 -16203 -19434 1025 20029 17890 23811 37424 33154 -7881 -4331 -3824 -298 -5018
17005 -5018 -2552 21007 28639 9320 12649 4098 -17163 -25120 -19092 -2094 9933 16975 15776
16992 15776 8432 15646 17305 -790 -4248 -6249 -6025 -5091 -6493 443 7454 3001 4858 6257 -8967
16977 -8967 -10096 -13598 -13346 13249 12718 16786 21939 19996 -8672 -12802 -6331 -10828 -23959 -26675
16963 -26675 -30980 -38384 -54627 -44358 -34312 -21440 -29508 -62128 -76979 -67969 -50685 -51583 -49942
16950 -49942 -53045 -43622 -18806 -5642 -6448 -19306 -23922 -28188 -37651 -25900 -1154 17720 -15465
16937 -15465 -10762 2711 -4854 7897 -16277 -29571 -45533 -44566 -27886 11834 20868 11742 -1757
16924 -1757 -11843 -11692 -3419 5269 246 13483 1602 9731 5998 -6826 -11793 -21728 -15463 -17241
16910 -17241 -12378 -22742 -16775 -8992 3395 35503 58957 33049 17530 5169 -8876 -7921 11270
16897 11270 27059 25262 30392 13385 -33185 -52565 -17911 -9244 -9231 -29797 -38663 -37052 -19100
16884 -19100 -4059 5694 16722 820 4413 -5521 -4475 -12092 -163 -8504 -14928 2336 22531
16871 22531 22245 8067 8606 4934 15227 -15006 -50794 -48399 -17644 2052 20895 14702 -4976
16858 -4976 -24564 -19340 -3033 78 9574 -10625 10826 27991 15426 22171 25148 16397 4294
16845 4294 -3074 -5364 -18417 -10869 -13510 -30937 -23093 -17597 -16751 -38772 -48163 -53659 -48942 -14409
16831 -14409 7824 29314 1317 -24936 -30662 -17833 -14970 -31264 -30399 -1977 -4089 -312 7205
16818 7205 -6949 -19211 -19956 -19865 -20791 -17161 -17628 -18037 -28336 -13819 22284 10422 -11916 -11252 -20440
16803 -20440 -21177 -9134 -9955 -6689 -5121 5055 -7206 4077 25115 36846 20046 -5822 -23375
16790 -23375 -3330 -5281 -6155 -3733 -13338 -9900 2182 -611 -19342 -42872 -39458 -25929 -9255
16777 -9255 -9907 -7413 -992 15172 9358 -26417 -28214 -1624 15839 24012 24350 23199 17294 -6317
16763 -6317 -19650 -2675 -4795 -13718 -23114 -25352 -28484 -641 14803 724 -12324 -23429 -13806
16750 -13806 7051 3280 2098 -13116 -20721 7465 24973 24459 19085 9003 -21796 -17949 24731
16737 24731 18009 -4701 -967 21645 45106 37053 20923 32208 18079 11297 -3149 -14248
16725 -14248 -17572 -5143 -45457 -51657 -19973 -2314 2907 -8195 -6173 -18584 -27885 -19940 2626
16712 2626 17943 30021 10441 -9577 -15544 -38100 -23224 -1998 14103 13883 16566 19611 1709
16699 1709 -16466 -20924 -19800 -29870 -7941 14912 18211 23124 31787 40908 49655 33995 31590
16686 31590 34116 17640 12206 11309 12387 -2261 -8691 2246 -18571 -17648 1474 28951 20065
16673 20065 10003 -6506 -26650 -24568 -25883 -7257 21621 15782 2446 419 -17971 -41863
16661 -41863 -26678 -24275 -18939 -1805 8582 -7897 12201 10363 2787 -910 -10435 -23411 -22314
16648 -22314 -2965 17164 18364 18679 -1559 -2452 13185 20024 10794 7964 23303 13011 2191
16635 2191 4978 -22047 -30364 -13291 -14835 -34780 -28224 -4060 451 -6440 4465 5693 -4107
16622 -4107 4423 17375 27604 29675 20644 11038 9737 720 -7147 -19666 -19666 -19530 -16363 -3079 -12221
16607 -12221 -16474 20494 -3401 -17433 -25834 -21002 -25858 -27589 -36946 -48430 -3807 24615 30549
16594 30549 10968 4757 -6115 -12556 -3374 10810 8862 -14655 -22028 -5182 23923 4284 -6799
16581 -6799 -10715 18702 38903 48636 36772 5766 -4047 25039 9702 3294 5749 -2371 3427
16568 3427 13860 11366 22153 33174 40571 25787 12639 32127 54518 62947 41798 56414
16556 56414 67466 61051 89061 127578 176371 233248 279093 344659 403915 466377 520536 527461
16544 527461 490177 427122 353324 286753 254246 216225 172553 154870 137102 124655 86295
16533 86295 67335 57262 40826 38189 25951 30836 38467 43704 37326 24771 22660 12090 -3549
16520 -3549 -5132 -26224 -22018 -5170 9434 1443 -3453 -16481 -31311 -23014 -23571 -12151 12872
16507 12872 -1829 -14491 -5555 11041 13796 14520 11781 23616 21254 16340 -9978 -34507 -32673
16494 -32673 -22983 -2936 36493 49513 54867 30772 14374 7477 -838 -4195 -19880 -19777 -12134
16481 -12134 -9711 -15291 -7079 5505 11814 25469 34793 29138 5864 23791 28386 8053 10660
16468 10660 12619 22872 -536 1263 -10299 -9428 -19102 -50824 -53342 -52248 -53251 -25966 -7222
16455 -7222 14185 23381 25578 32385 30493 19448 -16169 -36149 -41815 -40783 -32646 -18322 -34273
16442 -34273 -31087 -25304 -22101 -11227 -887 -17257 -42545 -41583 -20088 -29778 -24182 -27279 -29664
16429 -29664 740 6898 433 16718 6773 3480 14645 37526 49943 44677 26830 32903 47912
16416 47912 35612 22288 14067 20582 -284 -14025 -2758 -1085 16454 11573 5020 3166 14263
16403 14263 17374 -22042 -51263 -15352 13889 -8338 -8181 -3982 6674 8096 18206 35045 36594
16390 36594 41968 37389 18754 28306 48754 49957 26500 12673 30390 41895 25905 19717 14470
16377 14470 9342 21068 29515 36481 23356 14242 -1948 8078 7022 3215 2373 13527 30077
16364 30077 31425 4157 8405 21521 -13104 -15637 4357 11059 21890 -5532 -3448 -12142 -4349
16351 -4349 -7911 -8377 22044 34018 22258 35371 29831 28386 22335 24302 21794 28057 36428 30948
16337 30948 40237 59041 30365 -18271 -13451 -5939 -20056 -18452 -24549 -9867 2068 8267 24255
16324 24255 25011 27788 39713 21473 608 -20687 3204 18917 5369 22088 10681 200
16312 200 24272 24987 22788 27687 42376 71068 62546 40656 43211 44730 38941 23207 28137 12843
16298 12843 4876 6851 -16785 2453 25755 22778 27202 -2232 6680 14620 30176 17670 4885
16285 4885 -11319 -13842 -27103 -33345 2657 10992 -1758 21648 52557 34883 36362 51182 44988
16272 44988 31813 33559 26886 9113 -9312 -15266 5229 29242 36338 40688 41392 35238 41090
16259 41090 39416 19456 23363 39696 27273 2556 3269 15027 22338 28907 38984 19108 15371
16246 15371 11691 4041 8049 15873 25757 17992 25867 49792 60453 90165 113054 115464 102462
16233 102462 90277 75095 56142 63503 70184 64768 43524 66002 56194 33164 9436 8826 33057
16220 33057 30159 27277 26921 44789 64333 66380 45130 38104 23870 10269 2061 7905 15501
16207 15501 -730 -8696 16379 11898 11052 18028 21901 -3962 -3459 -523 6110 13313 30346 40717
16193 40717 60642 41926 28034 24380 8420 17388 12144 26051 37116 31332 20719 13172 -1164
16180 -1164 2671 7341 23684 20540 14469 13397 6014 39357 72222 76272 54483 45299 47663 55066
16166 55066 51014 56499 33174 22212 15261 18005 24554 31616 39199 29724 37661 42256 27427 15812
16152 15812 12121 -3194 22080 29157 14834 3604 13861 31802 42231 29624 23309 16572
16140 16572 6676 9558 14347 -2747 7918 56461 78381 59990 35743 21408 18852 39477
16128 39477 50526 59469 61154 62114 59111 59347 47000 52140 42003 44721 70779 63456 75822 88798
16114 88798 95751 91865 112569 143328 147718 147597 147826 149546 109772 91183 78204 78085 57510 47460
16100 47460 32850 31106 50274 61396 49117 28966 6104 21362 58257 78416 71322 55482
16088 55482 37002 42546 44248 31299 47407 58490 82891 92982 64047 52656 66174 56995
16076 56995 38776 34507 62552 55797 67820 83396 75456 72473 101022 122657 123451 136560 125548
16063 125548 139582 135397 102121 114623 115551 125825 118188 97415 84774 78467 92124 123527
16051 123527 130686 147707 145235 129365 141127 151594 157883 167921 180895 186399 189137 201109
16039 201109 205899 215756 235642 233749 233055 231591 217230 210032 222117 233241 227644 231625 248814
16026 248814 264436 286479 294403 302372 319652 365424 405281 440646 482218 533556 542722 584836
16014 584836 627068 670517 727257 772753 867975 998085 1139393 1313449 1544336 1783230
16004 1783230 1965541 2145599 2321945 2491489 2692856 2961106 3312188 3783816 4378393
15995 4378393 5007571 5754151 6747846 8087298 10071886 13103871 17911095 25585098 37388795
15986 37388795 54308455 76381770 101393459 119246000 126411110 126738612 115083382
15979 115083382 94947100 71254559 50539143 35484578 25128253 18316708 13897766
15972 13897766 10985663 9002061 7602303 6606704 5854070 5207650 4639839 4099597 3594574
15963 3594574 3172725 2806176 2537727 2383143 2304175 2239438 2129356 2004871 1834277 1626758
15953 1626758 1385393 1202738 1077331 973177 874366 809045 761514 721203 689254 660520
15943 660520 629926 594559 556586 532995 541881 512158 492835 457201 422718 408397 402341 371835
15931 371835 352200 344067 337026 328479 293932 263716 242329 227228 223326 228763 247797 255056 257895
15918 257895 273665 272197 261283 244579 256930 275033 265845 228408 191103 191634 197368 207145 204790
15905 204790 195579 196664 171332 177641 191519 180199 183798 167830 166590 168317 184196 205569 218627
15892 218627 214694 205248 202413 209018 198888 192811 191493 176029 167006 157276 152661 140785 153746
15879 153746 181373 193912 210230 215893 214944 223820 228008 251650 265567 271664 314529 360851 394330
15866 394330 433261 454386 481267 517318 552035 593550 616431 612804 596240 538554 475929 427841
15854 427841 388864 347784 316286 308597 319227 299154 273384 253820 233612 237827 269070 289929
15842 289929 255584 267997 280922 280895 279447 288987 306179 310809 321354 325740 304772 304273 324606
15829 324606 332287 338586 344300 344083 358263 347404 348555 369725 387357 420669 443022 458507 482768
15816 482768 511266 535859 556741 564722 583824 616640 674340 703580 731862 763651 799224 835303
15804 835303 880125 907905 949949 1005292 1057482 1099177 1128085 1151593 1201244 1236116 1277305
15793 1277305 1339097 1372445 1418770 1463121 1492112 1518535 1514123 1521192 1539811 1533900 1529775 1516852
15781 1516852 1483381 1456056 1413721 1396473 1373110 1359855 1298027 1222727 1186713 1160777 1097332
15770 1097332 1054487 1010051 979386 933399 895844 863917 815654 765801 744296 701275 649744
15759 649744 597943 551809 509378 495106 469726 475906 442263 422811 410944 403900 392600 375703
15747 375703 371606 358731 346625 337663 315369 303723 300925 281485 251529 236016 240059 228038
15735 228038 229425 223462 217366 222229 214500 205688 176143 114328 107728 122439 141397 143766 119881
15722 119881 120322 126009 147830 125648 123416 128129 129327 124826 105923 94900 73065 79814 91068
15709 91068 83199 63314 42171 58902 65233 62812 45455 46567 56731 55449 52625 58310 58018
15696 58018 54061 57401 58862 42284 45691 45536 53837 78590 78783 71680 52377 62622 54001 61679
15682 61679 76575 56884 34988 39951 40032 34668 38310 37926 40772 40672 41403 55036 52174 32105
15668 32105 37118 45784 37998 59083 62181 57899 67513 81044 61522 51310 57455 51796 29818
15655 29818 43101 70266 57582 19568 19848 31706 36947 25091 36397 67174 47829 23757
15643 23757 17459 10105 33536 57782 64253 66308 61090 63985 69107 65430 67435 62063 28443 11514
15629 11514 18699 13553 13029 41752 47800 31917 30976 34732 13127 19555 36484 52957 56011 41280
15615 41280 30391 56013 56642 75466 73136 59510 48415 31062 32859 66324 57086 38680 30331
15602 30331 40751 45137 55786 73242 50382 28711 7737 23405 26335 18662 8516 14521
15590 14521 25872 29452 34379 64522 66153 56557 70808 78577 82763 89451 97740 94893 91406 82763
15576 82763 80604 74392 46643 42273 48659 69068 81189 67421 36814 29585 16812 -1242 5614
15563 5614 23677 30299 27783 17351 17024 1982 8725 8991 -6477 -3057 22499 34087 25397 2166
15549 2166 -1407 20398 23036 28470 29590 23899 20097 19192 12142 30131 25997 12584 9853 43546
15535 43546 40140 24442 25237 22069 18905 26015 61329 74611 51984 53273 41749 23506 27645
15522 27645 29632 34324 53766 62213 50789 39536 43115 42493 46151 82281 86019 44975 33072
15509 33072 33743 39540 43458 44929 39468 21455 -3956 -2382 12930 41249 28158 17196 20582
15496 20582 20398 23584 39557 28302 19534 31171 16378 26109 24175 39366 32021 23848 46855
15483 46855 44824 28112 23507 17827 28452 40746 27196 9757 47861 55056 48635 49520 44871
15470 44871 47353 37702 33561 45929 74763 117233 130774 148917 173596 181026 195985 197920 185447
15457 185447 188632 192405 196743 185987 157883 140868 148458 125386 115731 112427 86886 95138 93193
15444 93193 80794 86637 101788 116247 105523 112439 106031 76540 51641 82629 106001 109104
15432 109104 93257 102487 102210 88227 54896 81425 105680 133930 157415 155435 173580 198094
15420 198094 205836 242989 311283 381956 444531 525147 583991 614399 632767 589023 520979 442846
15408 442846 362637 275939 238160 226408 208524 202572 205884 198553 178237 166942 159827 127899
15396 127899 107601 109708 120370 140401 146096 153460 174272 163328 166432 168330 173646 165164 171834
15383 171834 212837 221169 193286 209778 223986 216063 198872 195752 213102 223133 219327 220880
15371 220880 222703 248779 279112 342017 379545 400534 420870 431407 475743 524289 555448 561840
15359 561840 581914 620610 665042 710435 777047 842429 944536 1055875 1175289 1268326 1428302
15348 1428302 1645395 1891614 2182821 2530997 2975910 3537877 4241165 5080387 6049231
15339 6049231 7331862 9211178 12014764 15995437 21346186 28133326 35954939 44905298
15331 44905298 56382217 71584416 85158488 87491773 83342853 81245805 86247016 88256693
15323 88256693 79567374 65249438 51546982 41601831 33614852 26540467 20479406 15761319
15315 15761319 12345192 9965299 8266386 6979292 5922721 5009848 4246543 3599770
15307 3599770 3100099 2695643 2337836 2071599 1869468 1683276 1521209 1377059 1242844
15298 1242844 1140984 1081636 1000032 936690 878022 840369 783720 721383 678041 635118 615562
15287 615562 610315 599065 558304 524970 504411 487010 440882 413593 388293 357559 336761 324931
15275 324931 322789 321299 324371 314165 316832 277991 262691 264677 255423 250104 251607 247832 225182
15262 225182 225691 228367 236910 228506 224252 207995 205235 180237 169206 188503 176488 144885 152803
15249 152803 159198 140318 128338 128894 119320 128870 148621 138240 138913 136279 143357 132274 111394
15236 111394 119756 147898 150864 113883 114921 110060 116022 109314 107698 125034 112028 100265 90809
15223 90809 78973 78855 105698 117318 122824 120051 92231 76557 62309 67317 55592 59913 79020
15210 79020 74110 86541 83005 64465 73390 96010 112915 118597 111008 92427 92256 72722 61629
15197 61629 57978 76649 92695 87175 88551 83486 69436 52946 36143 52895 91131 82014 64301
15184 64301 62552 63677 86304 97818 80926 56913 39635 41330 43833 53708 38827 46538 51899
15171 51899 51735 59411 50406 24679 4209 -8898 -1396 28024 52267 64505 54393 51009 46661
15158 46661 43293 54503 43424 28928 28296 39119 40371 32162 8585 17411 34075 55374 52280
15145 52280 40766 35738 46143 45243 46665 29843 47936 75299 62689 25842 11481 9376 7098
15132 7098 1762 -12358 11391 17142 29134 50276 55438 53111 21739 31992 26562 14255 17693
15119 17693 -7645 -4322 -11246 3009 18922 28577 20590 15487 429 6017 3610 -3781 11511
15106 11511 16955 18682 41951 48948 38656 30948 23179 -4305 -10622 -18645 -20303 -15953 -5016
15093 -5016 -10775 -28006 -15961 4566 8857 32255 53454 34114 10491 -3372 12011 18466
15081 18466 8721 5288 -12086 11889 33498 52588 29508 20205 63931 74420 40261 22165
15069 22165 8604 19565 15803 11088 19780 26343 13463 8520 12973 31855 17021 20002 39157
15056 39157 31387 26387 12503 12790 37198 24982 5040 4342 13341 23714 21356 26289 53568
15043 53568 33469 16551 12874 25913 18977 19314 21158 28481 34430 27462 42910 35977 15280
15030 15280 -6358 -13507 -14231 -14462 -8356 -8313 997 5590 -411 25503 24715 6628 -9737 -19732 -44245
15015 -44245 -49059 -20575 -7795 -4522 -8872 2955 3666 10313 -1861 -19187 -31531 -30474 650
15002 650 17102 -10327 6619 20775 10510 -1035 869 2251 -24904 -24507 -35858 -41821 -19325
14989 -19325 -4873 8357 -4766 -8916 -1877 20555 52121 38836 37330 15289 -7944 -13967
14977 -13967 -22083 -12941 -18432 -10161 16998 15891 -8425 -29517 -31511 -22374 -8957 -4018 -26271
14964 -26271 -28406 -10394 -2512 -1049 13203 20170 -352 -22739 -14527 -8102 22682 29522 9465
14951 9465 -16318 -14650 4251 -3504 -17336 -25477 -19129 -23203 -9545 -8540 14404 32067 30739
14938 30739 39366 37890 18604 13371 29238 46677 26053 14476 -3371 -23626 -22833 -25242 -13681
14925 -13681 9325 3834 9564 5641 -3174 -17321 -12043 7747 8484 20244 32216 26754 14170
14912 14170 13954 11317 16163 25289 11543 5706 13696 17958 13339 13491 17021 13647 11483 7404 -627
14897 -627 5072 21286 18527 17920 18964 14877 20244 34688 50829 32143 15201 13348 4572 -31885
14883 -31885 -27265 -2784 -16381 -24070 -10829 4596 3975 3428 4476 9761 38758 53474 44468
14870 44468 8079 -2537 20652 15473 25603 32407 1893 -13258 -25624 -39448 -1211 40487
14858 40487 51113 31202 27535 25660 13966 32413 11426 -10409 -18422 -20351 17602 18808 -5688
14845 -5688 -8734 -6006 -5684 28203 47564 55807 32198 19052 5780 12594 23945 18908 11440
14832 11440 22024 44455 56678 15662 2716 9325 5698 3601 2423 11395 -1236 -1061 -681
14819 -681 -20574 -38253 -48461 -56722 -38200 -3089 17612 -3067 -43416 -18447 4274 5431
14807 5431 -9777 -11990 -20454 -15761 -3029 -2076 5477 44605 67100 84628 83842 73708 97787
14794 97787 117079 163687 228809 275304 326018 367156 384717 385031 393489 409342 399956 397506 357851
14781 357851 296056 233205 204306 155686 116613 107629 92711 90580 54344 56909 56793 38971
14769 38971 50456 54000 55553 62230 56563 52397 39747 10636 -3180 -13901 -11230 -1174 -6121
14756 -6121 -13117 -264 -711 5902 11855 16013 8150 10756 -9272 10206 14067 -15394 -36966 -16053
14742 -16053 -5431 -14752 7616 -1090 -29108 -31608 14145 10118 -5779 13871 1942 3714 13916
14729 13916 -9618 -5726 5002 10894 3167 -17166 -23478 -10804 19160 2484 -13882 3067
14717 3067 9863 -8554 -4839 -10849 -8394 23444 31331 9388 11879 17137 25002 15398 10262 12784
14703 12784 -1726 -2697 9647 48220 38059 27859 15505 845 5133 7847 -5585 -4441 215
14690 215 8862 15955 6391 12012 948 951 961 15729 3140 -6729 7175 5444 -15548 -14696 -7903
14675 -7903 -1730 -12530 -12390 -5505 -14172 -23517 -153 5260 -18694 -9793 -12397 -18595 -15930 -13863
14661 -13863 -26058 -15806 -19721 -18250 -25268 -46181 -47063 -59368 -67422 -66380 -74604 -39707 -44414
14648 -44414 -39745 -30874 -15613 -20112 -14914 -3408 -4819 4098 2474 -2058 -32239 -29176 6838
14635 6838 732 -8390 7222 2154 1781 -16143 -20894 -7167 -19268 -17261 2034 -843 2526 -1216
14621 -1216 -4160 -17701 -27002 -49976 -80811 -77957 -38044 -22877 -29894 -24167 -23313 -26245 -34497 -17021
14607 -17021 -3060 19072 21981 32872 30725 9140 -3598 -3053 -1118 32681 53245 39383 25944
14594 25944 -24666 -44346 -46317 -30076 -14126 -4431 -5235 -9589 -2635 -30646 -1027 13196 -14699
14581 -14699 -25265 -20075 -18601 -32536 -37587 -21084 -12500 -12781 -27140 -12835 3120 -17633 -6461
14568 -6461 -3218 -34502 -38071 -31141 -11209 22282 16771 9183 2849 -5494 -12472 -9851 -4979 -4332
14554 -4332 4574 10411 10908 10887 7788 8013 3755 -1264 11197 13550 8736 24496 11727 4606 -5868
14539 -5868 -19472 -20943 -10369 -12802 5521 12806 18176 24037 24598 39944 23153 367 8409
14526 8409 14234 27478 26919 2110 -5501 -5052 1219 -4092 -21385 -29247 -16376 -23728 -24933 -33796
14512 -33796 -41151 -51496 -37937 -36514 -27498 -41362 -29997 -12639 -20877 -7893 15689 2155
14500 2155 198 8428 15848 -420 6890 2122 -8459 -25614 -33052 -17821 -11322 2010 7672
14487 7672 9779 -6614 -2598 -5586 -22983 -27698 -29409 -32553 -26304 -17649 -12908 -37494 -50532 -27107
14473 -27107 -15491 -2400 -2877 -11875 -17530 -7894 8410 -11651 -30642 -24384 -23985 -33767 -15734
14460 -15734 -10845 -6078 -20806 -19245 -3691 3270 4201 -18845 -42161 -39361 -32166 -14525 16100
14447 16100 15549 4334 11835 7123 5407 9980 7263 27543 53389 47679 18730 3146 348
14434 348 -2981 7134 6213 -15 -8785 -19427 -19271 -10920 -12485 -21940 -17533 -14419 -23396 -14725 -19108
14419 -19108 -40404 -52244 -15541 9728 -10035 -28764 -19179 -8904 -25687 -48202 -48953 -27023
14407 -27023 -15071 -25251 -16016 7076 20907 24079 37477 21824 4103 10541 23115 21722
14395 21722 4544 -3756 10531 10510 10424 37411 50686 58162 30516 13041 10866 18097 20993 13187
14381 13187 4620 9302 20296 19954 7968 -1156 1550 -1748 16314 35563 42985 45553 30765
14368 30765 16928 6 -18038 -14416 11239 4012 7252 8668 -487 -7006 2245 27891 66097
14355 66097 54353 44222 36655 12098 5467 26175 15534 -14027 -25209 -8738 -14773 -34876
14343 -34876 -35547 -32865 -11885 -8747 2560 13729 -1466 -10680 -6752 19045 10077 18456 3550
14330 3550 -468 -24692 -35138 -24835 -28945 -36125 -24963 -23105 -37034 -24789 -15938 -27714 -49488
14317 -49488 -18371 3550 8748 10738 1000 -14798 -8942 -218 14149 13984 -3781 -42630 -43917
14304 -43917 -42751 -24408 -15341 -1355 -2295 2970 2110 3272 5125 6712 21295 8340 -22766 -61667
14290 -61667 -61650 -37986 -5870 1532 -4621 -1363 3202 -12270 -18758 -38851 -18174 -17607 -5862 -6122
14276 -6122 -8683 -19339 -14728 -3958 2085 -10112 -12506 -19671 -12533 -13689 -19765 -52531 -76346
14263 -76346 -52364 -21072 -9931 -14972 1432 -2611 -15266 -4828 -4394 7834 11052 295 -27213
14250 -27213 -30802 -23888 -21304 7570 21136 16505 -5474 -39647 -34961 -27707 -22218 -18049 -19636
14237 -19636 -7937 -10724 -17775 -9577 6013 16201 4439 5180 -12827 -14239 -7537 -7283 -3912 2431
14223 2431 -14722 -18418 -3489 9573 7858 -1844 4098 10705 16395 10362 6295 -527 3681 10950
14209 10950 15826 14971 15768 8078 8768 2919 21471 21418 26856 38706 31368 26381 34475 51341 47986
14194 47986 43560 24594 18699 38226 46666 65526 71764 78733 59088 31113 22007 13264 28754
14181 28754 28366 3831 3305 11545 12203 3261 12829 16082 29391 46537 39260 31215 25988 -3820
14167 -3820 -3568 -28778 -25843 -16182 -12590 6099 11241 -20393 -23317 -2565 12242 145 5627
14154 5627 34255 32323 31984 19441 24544 44181 48833 37856 13975 -9730 -36330 -16996 12743
14141 12743 1469 12299 27363 47206 60115 44954 43269 38574 29302 20798 2672 -13490
14129 -13490 -24921 -30708 -9014 -12761 -2929 268 -7481 -28434 -33417 -18902 14007 5651 -3231
14116 -3231 -2298 -30637 -43325 -29375 -16936 -3981 -651 800 22142 21354 12520 6355 13655 24400
14102 24400 17147 9670 5380 -474 -4521 -1625 10425 20287 46230 47671 19029 41606 49825
14089 49825 49953 60755 67998 58200 33160 6421 2683 -24076 -48756 -38670 -27171 -7180 11845
14076 11845 -12679 -37329 -41142 -8613 -20 -7821 -5870 -24334 -4762 21095 36471 36033 27262
14063 27262 2974 -8122 7527 7032 -10266 -10126 -4513 1318 -8535 -8909 -14165 -21613 -20978 4387
14049 4387 30304 19492 17856 11013 -8000 3933 12446 1683 1822 -4419 -3535 -12116 -13814 -10780
14035 -10780 -19114 -389 6150 -2124 5493 19675 -4068 -6845 13176 -12737 -35489 -15584 -8637
14022 -8637 -29107 -27872 -32383 -42659 -46470 -48575 -20365 -5794 6457 13657 7172 -18307 -23181
14009 -23181 -25235 -26258 -22639 -43537 -62306 -57554 -37377 -7740 -855 70 -6942 -2310 -15366
13996 -15366 -37099 -40084 -51779 -50595 -36141 -29225 -32747 -27489 -36879 -49145 -13995 -17676 -44696
13983 -44696 -41038 -30891 -29578 -30119 -16291 6657 24832 26337 17070 2469 -7979 -20138 -3678
13970 -3678 8856 -7287 -8420 -6353 -18510 -8362 5100 18553 -5453 -26227 -5078 -3466
13958 -3466 -12972 -24624 25066 55617 46847 38524 43187 45170 34447 22626 14221 -6393 -11285
13945 -11285 -27556 -31529 -14129 6287 12324 20280 14811 9005 212 -13268 -35682 -47006 -48055
13932 -48055 -31495 -4393 2609 -2346 -5600 8823 22265 3311 -16991 -7771 -13286 -7144 -10643
13919 -10643 -12043 10801 24069 55 -15165 -1913 9837 4884 -6779 10801 11811 16181
13907 16181 7354 -2319 -5034 4960 19305 33236 28898 5979 984 12133 20327 16674 17230 7910
13893 7910 7027 16102 -5392 -34086 -21383 -9262 -10026 -9121 -19437 -2810 -6431 4175 6844 -4061
13879 -4061 2062 -792 340 17325 44715 45109 36641 50737 57455 53557 23962 3560 -7481
13866 -7481 4694 14337 34499 42216 29435 9875 -51 11966 14375 12648 8132 3376 7568
13853 7568 4766 12113 14115 -8434 -17427 -14706 -28932 -37949 -8512 -4686 -31442 -29744 -19099
13840 -19099 -11203 -14114 -42396 -47834 -45793 -51706 -39198 -13675 -5591 -20561 -34151 -26011 -14990
13827 -14990 -8358 -22714 -21451 10171 38714 23841 15050 4171 -14619 -31012 -14031 -9024
13815 -9024 -20200 -40744 -21371 -24219 -21265 -10519 -2147 26662 31898 16950 14824 33072 20466
13802 20466 17865 31057 27494 5737 -12333 12392 25414 15442 14997 17124 -3593 -8543 -21444
13789 -21444 -28574 -22720 -22302 -21430 -29808 -19967 -14895 10112 18042 17458 -15010 -41014 -40817 -24633
13775 -24633 -4934 29892 40374 44118 32002 25992 16408 6618 -15595 -17380 588 12670 24113
13762 24113 4733 10981 22073 26247 5691 -11762 -387 -5475 -5351 -936 -6850 -5915 -27304
13749 -27304 -44063 -16012 -524 -20222 -33060 -21388 1584 11326 -15255 -35901 -20246 -35922
13737 -35922 -45557 -43761 -20111 -16512 -9157 -25776 -52883 -39100 -34182 -29941 -27098 -14397 -2846
13724 -2846 25348 43093 26203 -4182 -28179 -27959 6893 25581 2116 -11436 -25724 -14795
13712 -14795 -9947 -1636 12348 11300 -3262 -15322 -19305 -21767 -7687 -37169 -37461 -28552 -14845
13699 -14845 -18527 -36641 -38178 -33743 -11319 29385 17071 -20861 -40238 -25398 -23189 -1050
13687 -1050 523 -27528 -43806 -30550 -11168 1027 10203 6235 -909 3276 -1913 2586 9104
13674 9104 4372 800 866 -7162 -15079 7732 24948 8722 -14849 -8344 -2538 -11339 -12588 -22026
13660 -22026 -38187 -34080 -30792 -44608 -52362 -51168 -47673 -47342 -34460 -28227 -24237 -26658 -10778 16423
13646 16423 41950 40606 28018 3457 17373 15292 -7650 2993 4795 9505 -12421 -7285 -10251
13633 -10251 -255 5035 2843 1095 8903 9442 9964 -6915 -2110 21059 33718 41777 22136 -712
13619 -712 -10675 -9466 -2962 -12800 -14890 -21546 -22076 -7717 -10859 -13160 -41265 -42602 -36529 -29486 -14563
13604 -14563 20776 35738 43456 32646 21171 2068 -9639 -23732 -5244 -4872 -12282 -9441 -16471
13591 -16471 -32601 -40483 -17981 10912 5697 -2828 -9096 -13839 -7099 12483 28716 -190 -6638
13578 -6638 -18326 -23367 -6816 3116 19813 34666 18317 129 -4771 -30796 -39554 -29587 -39929
13565 -39929 -42210 -46331 -30542 -21830 -28885 -46512 -41435 -31617 -27636 -16356 -8788 -27401 -55265
13552 -55265 -42820 -43351 -48453 -46081 -56358 -32493 -20522 -16211 -26508 -25503 -9330 -14167 -25362
13539 -25362 -39230 -30197 6713 3322 -11692 -19757 -1626 3079 -9626 -29186 -24458 -24395 9163
13526 9163 27793 21483 -6891 -27625 -28791 -24113 -27664 -39016 -36952 -16965 -9033 -12897 -7777
13513 -7777 5407 3731 -2836 -1898 9598 32959 39510 38923 17495 -4627 -18983 -1763 20509
13500 20509 15182 16031 -5493 -24255 -19733 -28183 -27796 -32966 -27849 -7376 19709 -1255 463 -3597
13486 -3597 3374 9187 3031 2063 18466 40876 35530 14495 -7888 -18635 -7984 13659 19689
13473 19689 9840 5552 18835 21176 11950 16883 14548 26796 30078 -4995 4390 38516 25771
13460 25771 6602 7927 -1331 9892 -7453 -4684 6540 -18082 -35662 -22101 -25751 -25530 2971
13447 2971 30377 25164 21961 23985 6158 -5223 2741 -13414 -37011 -40069 -24663 -39527 -50686
13434 -50686 -36558 -37772 -43129 -25779 -19264 -12963 -6730 -13871 -8879 -9691 -9471 -20136 -27783 -8515
13420 -8515 377 106 4871 17242 13025 5845 10403 -13205 -25577 -15362 1179 3749 3358 9737
13406 9737 7016 6913 -1382 -24424 -30182 -32117 -39016 -10155 775 7990 11417 22755 17086 -589
13392 -589 -9446 -6139 -15286 -5619 -4571 -16009 -30047 -43296 -30809 -39328 -32835 -27689 -24596 -25471
13378 -25471 -12867 -8712 -25169 -5402 -14231 -39092 1987 24719 -1741 -13091 -5105 4810
13366 4810 6702 3274 -16645 -1764 7366 16815 23593 28081 5923 -22090 -26393 -4268 5893
13353 5893 -980 12656 6849 -6799 -21926 -7713 6529 -1425 -21806 -35752 -19622 -21427 -42124
13340 -42124 -30186 -9623 -2210 -15450 -7802 6390 -13307 -27766 -27306 -10288 6738 -3361
13328 -3361 -6251 -17896 -19628 -22586 -28194 -5731 8601 37788 32555 25614 35398 31313 14626
13315 14626 426 -19982 -9019 -20604 -30373 -28816 -29735 -30941 -12352 1957 7757 9290 12428
13302 12428 -4530 -6209 12683 26899 23435 -480 -30917 -18756 -11046 -4284 9981 -2140
13290 -2140 -15718 -7008 -1085 -11713 387 17662 11849 4682 -13949 -16044 -4906 10005 -7346
13277 -7346 -6425 -17830 -16107 -3279 -6822 -24255 -38691 -27130 -9137 22792 30077 42472 25363
13264 25363 -14604 -19023 -31183 -30277 -38541 -45263 -42966 -26378 -28961 -25831 -17470 -17865 -31628 -30652
13250 -30652 -31516 -26210 -7349 5957 -10268 -17345 -17328 -17027 -13314 -15797 -23432 13675 26258 35689
13236 35689 49143 60717 67996 76989 67737 77699 85113 72987 51712 30480 11646 12579 37520
13223 37520 31636 8836 6091 18050 3630 14199 23506 5821 -409 -11255 -9398 -25383 -8551
13210 -8551 18111 16445 27561 34945 25985 11938 30947 22145 36901 44828 33878 10486 16660
13197 16660 36635 49071 53197 84199 107353 116104 146365 148746 149862 150957 150337 142265 114471
13184 114471 67256 37877 35546 41163 36672 28432 29159 39795 21471 17575 3045 4524 26567
13171 26567 2462 -2803 -27511 -34743 -35646 -34480 -29517 -17454 -9520 10138 31022 28134 8543
13158 8543 -2355 21832 48878 51693 41094 25187 25884 60110 69722 60640 57601 84901 121100
13145 121100 163759 185208 177801 151505 105163 62480 49312 34997 23546 22258 1925 -12830
13133 -12830 3749 3846 19044 34893 45737 45527 20583 9777 28530 44432 39466 13120 -3469
13120 -3469 8003 44092 49452 8294 -20768 -28207 -37112 -10525 16199 367 -10820 -7203 -11822
13107 -11822 2975 13744 39624 47987 42285 35102 34086 43058 51391 48226 54946 67572 44180
13094 44180 4819 -3021 -13706 -7105 8516 20220 29500 19957 -1321 -15740 -10080 6049 6447
13081 6447 19866 29983 23909 15767 15829 -4897 -27135 -47733 -24630 -6406 23104 35255 15652
13068 15652 -13596 -5106 18514 25655 23676 23977 30421 39705 24861 8650 -1164 -14354 -8320
13055 -8320 -841 -15992 -1082 25142 28931 32238 10645 -6460 -17293 -25438 -32997 -33294 -32020
13042 -32020 -13311 4000 21755 25490 -1949 -7900 -6431 2056 -8679 -5460 9094 12963 -1890
13029 -1890 -9816 -8368 -5507 -144 -9489 17186 19862 -360 -2715 -6515 -14236 -12142 -16257 -42578
13015 -42578 -21647 -33671 -44853 -30858 -13169 -1496 9789 -10541 1301 15158 33933 44121
13003 44121 30317 -1036 12975 38027 32284 27234 24075 17176 37995 36599 8824 10141 11130
12990 11130 20369 16026 10477 1761 4246 -5370 -15175 -4935 -12025 3063 1076 3139 19811 14315
12976 14315 7628 19704 16496 17281 18701 12590 28187 22746 -28855 -50717 -30421 -11898 2851
12963 2851 7874 -27893 -50405 -34215 -24298 -3133 15708 33137 28138 -3385 -10556 -7484 2589
12950 2589 23862 9388 21144 40661 27884 12982 2345 -6450 -28567 -44068 -41580 -34995
12938 -34995 -50643 -44069 -10869 -27721 -43800 -33410 -29102 -22713 -20061 -7395 -20 6178 -8542
12925 -8542 -4899 22429 33271 44300 23645 27827 44769 44270 39960 27677 4498 -4937 -9776
12912 -9776 -9935 11816 9877 -207 -1676 798 2523 3343 -3067 -32112 -28094 -19813 -28012 -24287
12898 -24287 -37274 -16629 -1049 29840 31442 4729 -8283 5660 24446 3028 -7198 9283
12886 9283 29251 21096 8348 -1828 6363 7195 19890 16591 5507 -12747 -18620 -5933 -10722
12873 -10722 -8559 -9682 -17095 12654 11733 -13679 2300 4413 9150 -9212 -6118 4504 -13980
12860 -13980 -29189 -854 36783 59345 33091 12863 14183 4385 387 -7014 -6834 8612 7055
12847 7055 3191 -16420 -28170 2258 23664 46648 42656 19205 -3703 -14027 -24400 -31340
12835 -31340 -17235 -30602 -43883 -4940 596 14472 4201 9978 24745 38728 37503 17712
12823 17712 -23342 -23368 10541 42197 34752 512 -5860 -7259 -21267 -20067 -20097 -26807 7625 59895
12809 59895 52680 24351 14784 7686 25047 48150 46842 52136 39334 14707 -15421 -19976 -19309
12796 -19309 -12745 -14453 -1081 -5148 -20471 -26828 -22162 -4840 -18120 -5145 -7117 10173 25025
12783 25025 18394 26698 36059 35718 57600 59976 42773 30833 44711 39295 35155 32958 8988
12770 8988 8521 10295 4517 -14027 -2767 15911 5017 -31754 -22380 -25400 -24560 -426 3847 7516
12756 7516 24487 13232 15573 33503 60308 51624 53533 36696 11799 -8779 314 17271 8912
12743 8912 8154 23437 13039 -4639 -10024 -14136 -12453 2198 29848 49758 65538 38629 12307
12730 12307 -7264 -11899 -5715 2814 18681 23676 2307 6169 891 -9006 1125 12362 26745
12717 26745 56637 56172 44225 47127 30695 16925 24185 27160 44389 40524 39710 37262 32571 -3258
12703 -3258 -2674 -20336 -28337 -33336 -21200 -17619 14060 17555 20848 37553 27454 32204 22475 11380
12689 11380 -9103 -37079 -34781 12624 22124 20527 12336 10308 12118 10873 7523 -5848 -1153
12676 -1153 4725 14509 22382 1154 -7406 -2805 2779 31642 43092 19242 5815 11801 9135
12663 9135 7749 2564 7778 14134 5138 1036 -23549 -20885 1899 1119 7483 7463 3259 -2084 -1180
12648 -1180 29289 17123 -7729 12716 22842 24748 30127 31567 38626 37488 23027 13789 19744
12635 19744 41609 39822 14237 19217 6475 19526 21355 112 -19883 -9263 -600 -9795 -11420
12622 -11420 -5348 -1075 7013 -13333 -26919 -6043 5842 6240 9683 15225 21318 15343 20277 47298
12608 47298 7319 -3995 -1508 -2560 -8353 -19598 -10794 -3992 19383 12726 12098 2498 18288
12595 18288 21950 -1795 8109 38909 44389 38401 21273 31639 29994 13176 7419 2909 1357
12582 1357 11140 23946 34056 32970 34030 18460 1269 25867 37342 31972 29926 26075 17991
12569 17991 -10081 -10117 -18955 3436 1878 -9392 -22399 12932 23565 17143 25269 14543 21486
12556 21486 45083 49255 33975 30740 28078 38223 60092 58299 50322 22994 10779 16079 10429
12543 10429 5030 7654 8731 23349 9021 2357 11723 5576 -4727 -8879 10557 30641 33812
12530 33812 25342 22829 14855 23827 15916 10583 6296 38657 31628 25673 9810 13724 15349 33912
12516 33912 36911 35846 42826 25370 24601 10708 -6297 -14755 -23626 -15756 -6898 -2432 1138 -3244
12502 -3244 10831 18698 47569 68941 71966 53293 38532 38369 38875 28514 20223 16300 14549 -4198
12488 -4198 -3753 -7249 22460 45755 64984 42825 15030 6977 17448 32168 54232 57151 53400
12475 53400 33071 17015 26023 32114 19835 4591 23290 45951 53390 52726 27703 14194 52003
12462 52003 82014 67389 63031 63145 52656 51757 70430 76775 65514 65438 51809 63210 50239
12449 50239 44584 55082 61249 34343 24797 33181 28608 36034 49986 48372 60886 47744 20139
12436 20139 33419 46122 35240 12043 29640 56073 64128 50208 33173 33455 53462 63342
12424 63342 47097 56290 35502 18539 8333 24778 38760 24336 32965 35438 38090 62427
12412 62427 77443 64298 55918 62419 70700 36835 28984 41002 25894 21856 25226 25845 24102
12399 24102 26193 11512 3071 -9572 9999 40862 51424 30559 33588 36783 37393 32030 36268
12386 36268 16159 22062 54957 70562 59127 55607 49394 52212 49751 43446 51188 28842 15174
12373 15174 32490 51379 66832 70425 62376 64180 52125 45283 50938 61704 68662 71716 49092
12360 49092 42040 56960 66521 62396 92354 104553 99403 92493 105422 102506 72298 59779 60008
12347 60008 68084 83558 86514 69463 47341 48385 47725 57760 59857 66352 54570 43167 62426
12334 62426 82491 93319 70426 55375 40542 47947 66581 70507 53445 48847 42026 42806 65223
12321 65223 65889 79138 96098 105531 95014 78474 83480 92360 99531 106285 91518 97011 94512
12308 94512 102519 83310 65647 53816 43749 36938 51049 78000 91147 91746 102124 89628
12296 89628 70189 71627 82989 92704 90697 94886 90769 96737 102634 91517 97561 120873 118333
12283 118333 116924 125665 125695 132630 121175 104227 96899 110232 104714 114933 132489 120325 113789
12270 113789 101787 94017 102691 96803 98535 73257 64948 73836 101529 122926 124055 90490 81314
12257 81314 85624 73063 85951 101346 101651 92333 79453 88878 94634 103118 128650 117097 107381
12244 107381 100739 98281 108219 109434 95370 100627 121120 123954 146524 153192 166831 161776 138040
12231 138040 139791 149495 161017 178461 171711 146954 119144 114967 114412 126883 142275 165057 140514
12218 140514 123252 150034 161744 169262 146792 140855 138970 157307 147715 148659 155840 146710 138869
12205 138869 146528 171255 173968 158645 176456 214452 212003 204717 187350 195872 207507 180100
12193 180100 177266 171774 176762 163932 177978 200962 194646 188130 183041 192722 197284 227924 235139
12180 235139 220565 185058 195454 199020 198360 187087 170847 170657 190322 203461 198868 212024 226588
12167 226588 228426 243297 258943 227297 213228 215974 209653 231100 232643 231748 216740 221046 224228
12154 224228 222851 212942 233121 270645 277903 265203 273598 288345 278719 248003 245244 266927 277747
12141 277747 285007 262999 277679 313391 320214 306314 322221 341416 333101 331481 328568 328812 330458
12128 330458 330463 310406 322051 333466 326788 316893 354010 369103 379492 364918 353037 362625 361164
12115 361164 375295 392513 404323 420958 427777 441437 433587 453768 449536 418208 407475 408325
12103 408325 403911 401328 410796 417012 418952 439232 443752 463172 467988 472627 527824 556630 542125
12090 542125 527159 533186 522184 507701 535848 542551 535483 535927 538020 545234 558299 578295 579873
12077 579873 577039 584755 611583 646940 655273 633189 662623 688982 695334 719754 705719 703548
12065 703548 724161 750833 758192 739663 745473 769610 804154 843886 842600 858141 892468 916951
12053 916951 901466 915795 941277 947210 955794 971394 974993 999119 1004610 1025479 1041446 1062143
12041 1062143 1084061 1093343 1123310 1159629 1178523 1190894 1228953 1250503 1269922 1311614 1357799
12030 1357799 1391527 1418418 1451421 1465314 1488169 1527917 1559595 1591752 1631110 1688141 1718729
12019 1718729 1752097 1797469 1869100 1926420 1941488 1978350 2016965 2066588 2083497 2127869 2183680
12008 2183680 2262663 2343319 2422418 2508419 2581213 2655071 2718432 2778289 2848950 2945748 3052002
11997 3052002 3137753 3231093 3337721 3438034 3560798 3684812 3810793 3920557 4042389 4214169
11987 4214169 4383086 4543379 4707100 4872345 5070018 5268069 5460347 5638224 5840906
11978 5840906 6069552 6332831 6589472 6847021 7155359 7484829 7815274 8147134 8491485
11969 8491485 8860610 9260545 9662289 10111724 10576135 11058013 11534895 12063208 12660180
11960 12660180 13271121 13868143 14483653 15116187 15768931 16423145 17087062 17785155 18458263
11951 18458263 19126150 19831930 20496635 21100630 21657564 22186038 22644757 23034430 23325295
11942 23325295 23543805 23677344 23733657 23705357 23584771 23361685 23042088 22656076 22221619 21714986
11932 21714986 21150577 20547809 19945010 19323291 18662468 17988320 17298546 16599517 15957909
11923 15957909 15336038 14700521 14057713 13438110 12860275 12314625 11795745 11285641 10803378
11914 10803378 10345779 9904224 9495479 9119688 8732139 8350080 8000931 7672445 7382127
11905 7382127 7101652 6835467 6558778 6309227 6071138 5843131 5638906 5436809 5234917
11896 5234917 5027896 4839928 4681202 4537961 4366796 4214871 4064276 3936584 3828672
11887 3828672 3692183 3585452 3480849 3388470 3285539 3193577 3105675 3012430 2939163 2866137
11877 2866137 2795107 2740921 2674758 2564674 2497580 2437826 2369804 2301008 2245208 2173711 2099095
11866 2099095 2074515 2019423 1955378 1892212 1854673 1811646 1763981 1729966 1702673 1673837 1655411
11855 1655411 1610417 1550507 1495891 1475639 1474193 1434757 1397108 1365563 1340784 1316996 1289059
11844 1289059 1258148 1232352 1202493 1189749 1175583 1140356 1118440 1111885 1112368 1077365 1049580 1014950
11832 1014950 982815 976244 983725 978224 946769 919388 901409 870741 861994 841419 830192 828158
11820 828158 819230 823524 841118 812348 793472 795543 782232 771479 759431 752370 746407 738870 707513
11807 707513 681616 673292 694637 699081 684160 669704 650059 640842 642118 646393 624389 577104
11795 577104 549641 573337 577877 577377 544108 513189 516217 533092 514367 499748 501346 489623
11783 489623 469783 422729 424028 448106 449865 445950 447256 465044 463856 462867 442877 443531 440085
11770 440085 423508 441256 433769 445096 440810 435175 412402 415077 393123 357025 334489 336149
11758 336149 360867 375823 372657 376067 355531 333375 316090 302697 306016 298461 294612 292615 292169
11745 292169 299951 304749 292183 274540 271497 254419 253860 264947 248585 242147 233696 238026 247007
11732 247007 274158 269178 263444 270957 288501 287053 281240 255913 260488 274853 242109 228177 240920
11719 240920 243803 236913 239512 251569 246317 232538 204733 222051 240528 246488 230401 237617 248465
11706 248465 241805 222328 222301 210116 203098 211137 204568 192055 190717 206764 208585 193742 208720
11693 208720 215651 209089 181164 184231 189969 189878 184796 165099 160890 163948 158641 193787 218312 220972
11679 220972 203125 190652 187913 193429 196543 194943 181578 168295 145563 145735 157147 134656 102576
11666 102576 119358 141266 162031 161753 127388 133584 145029 137855 137304 147415 138890 133612 142368
11653 142368 128909 99214 120573 154169 153122 123461 122923 136217 139531 125050 128287 123274 123013
11640 123013 128222 134161 122629 111084 101861 106655 123704 141772 142978 133714 122968 113407 107694
11627 107694 127681 114896 91259 77893 82857 98339 110943 116480 76781 63686 72818 103544
11615 103544 121674 113464 96139 95128 91340 72855 60042 63259 58710 63332 57149 62109 93064
11602 93064 115239 101152 61581 66412 78468 80107 82221 77621 72219 68095 72916 56439 57730
11589 57730 68893 70574 79593 93103 81050 85217 69630 70593 82450 87337 72288 69572 78079
11576 78079 81442 88966 104718 108143 103721 114047 106672 98242 83212 67013 38812 37279 58180
11563 58180 83034 82860 91269 98657 97522 100954 76790 72024 80311 97055 83719 69793 68011
11550 68011 49276 25546 28669 27028 30354 42467 43658 54618 64352 76131 83327 61869 51763
11537 51763 77753 82355 76972 80714 92989 99810 102036 96312 113564 107314 86643 50356 46239
11524 46239 53971 64868 47661 42494 47250 31522 43147 32575 24989 26554 39619 50901 33293
11511 33293 36743 35450 33188 54726 65737 53833 60594 83416 72288 91938 87737 69143 80954
11498 80954 64098 61855 46797 57101 79507 59865 45019 63640 73881 36986 17192 32142
11486 32142 61702 46251 41220 44347 45676 27385 32343 25174 6508 37126 59774 76370 64226
11473 64226 38720 35422 32815 28633 39422 50924 41398 34496 50615 32482 2274 8991 22036
11460 22036 25085 21102 21537 32837 31917 18666 5752 10033 27395 43283 51578 26099 28044
11447 28044 44404 35876 5364 1358 17993 34044 26130 36166 27680 29419 49243 48906 24928
11434 24928 12019 6484 -2889 -24035 8763 14583 13941 17925 23971 23562 37672 59431 47464
11421 47464 22268 17378 20346 11292 -1235 10179 11171 17985 26897 14178 7674 5842 20736
11408 20736 50020 56407 48724 49770 29741 7218 5013 8798 7063 6468 19482 33214 41097
11395 41097 27216 4294 30097 33705 14040 24605 50003 56867 36979 18787 25348 26795
11383 26795 19089 49330 70390 66219 55701 48448 25361 -3617 -14471 -1 8130 -7404
11371 -7404 -24854 -21705 -7833 4531 12783 42335 49487 51716 37778 31433 33832 57076 51087
11358 51087 64436 75797 36911 21130 37657 42827 39078 61326 70056 78775 85783 60123 28005
11345 28005 815 13350 43438 38094 42820 42147 25634 -833 1312 14436 18117 23839 33081
11332 33081 28032 20008 10662 -5715 -1632 -441 1638 15821 32796 39479 15585 -12303 -14578
11319 -14578 13952 -2342 -3847 4559 31270 20903 16017 37749 67134 46867 32238 3292
11307 3292 14336 33101 35073 40182 35868 23952 2369 21532 26179 29139 33328 31830 20890
11294 20890 9430 -3176 4125 -10756 8201 35448 57011 31915 16170 15319 -1177 -2603
11282 -2603 -28410 -40294 -44762 -18371 -8269 -18138 1635 8172 4116 4997 10450 -1009 -10110
11269 -10110 -14884 -3208 18860 15785 27824 34070 21360 10336 38389 41525 29766 22491 40602
11256 40602 49279 34785 24390 26842 25175 15225 8275 -4460 -22170 -12113 -15204 -23207 -11150
11243 -11150 -12704 -19087 -9691 2324 8255 21073 5284 4125 34473 52127 42447 34006 10038
11230 10038 -12233 3354 10860 328 -5484 -11102 -11365 -21302 -20194 -2387 520 -9843 2303
11217 2303 23222 39700 46265 35113 17545 -126 1100 25364 16054 27151 19689 14609 21003
11204 21003 38086 36016 19667 454 7024 31963 27172 38269 42019 36254 22334 23089 21655
11191 21655 3821 -2413 17808 3910 14890 9314 -886 -15687 -19904 -16548 -30413 -35494 -28310
11178 -28310 -42307 -51016 -40138 -28706 -3210 21357 31729 43240 24978 -3815 -36767 -40040
11166 -40040 -10736 2950 -2818 -5083 -2544 -10695 -23352 -24017 -10731 6415 19377 -5887 -37307
11153 -37307 -36756 -11727 4222 -4937 -8288 6868 -7742 -5025 -7885 -3729 -11351 -16736 -12942 -3940
11139 -3940 243 10289 18223 7761 -663 12472 23799 32029 27643 15508 -8002 16087 16186
11126 16186 6586 -7745 -31603 -32178 -18747 5193 19957 2492 -15890 -28023 -31343 -15918
11114 -15918 7894 6913 -4812 -5041 -19373 -18513 -7825 -13979 -31304 -33137 -28120 -28151 -12828 -19070
11100 -19070 -9355 9441 -1801 -15832 -17351 -3510 24865 19317 -4370 -25960 -11608 -30956
11088 -30956 -44202 -23807 -17111 -8430 -1091 -7656 -4791 30761 55897 31304 24655 18461 14704
11075 14704 10557 -1675 -5596 12466 32379 44196 28235 18279 2669 11346 32368 48178
11063 48178 50675 37444 20232 24001 20366 6801 -4720 12571 -1744 -12692 -6045 7491
11051 7491 8429 30 5183 14173 18904 32090 45237 60701 75798 72314 64892 66657 56455 70343
11037 70343 107894 151114 170513 169996 177027 180655 158277 126915 117689 139548 164383 172690 155792
11024 155792 167387 211086 238436 278415 299177 249866 185706 152943 141741 104621 104756 123643
11012 123643 146177 184545 239229 263540 238573 192856 149065 123852 109234 101367 99456 88143
11000 88143 85021 85261 104006 115323 119155 96217 63830 46462 17167 -5637 -15919 -17050 2921
10987 2921 -3288 -3549 4883 -9286 -27212 -18237 -11694 -5264 14743 323 -9331 -5974 -3296 9672
10973 9672 25233 39328 25196 -3801 -11418 11336 24966 8092 -3932 -5943 -21397 -19877
10961 -19877 -11653 -5084 -4502 4224 -927 2273 4649 5051 -4974 25934 41563 37393 36921 23544
10947 23544 7197 21996 43925 83903 111211 89575 85051 92229 80931 70019 80901 87222
10935 87222 81334 79280 73328 62620 40958 17855 20051 21529 11595 15030 34292 54847 39592
10922 39592 -1950 -34467 -60217 -59113 -30001 2636 6879 -1518 -8081 -17172 6313 14648 -857
10909 -857 17486 35780 13620 1333 -8216 -2370 5745 -22931 -39334 -35855 -18239 13539 32867
10896 32867 32066 14206 37553 33092 17725 20871 15718 13560 19068 23208 41060 28533 10047
10883 10047 52185 48113 11833 19754 30053 6982 9191 -6192 -15416 6220 29457 50781
10871 50781 51545 50002 19411 3202 -7870 -22758 -34323 -15850 256 24590 40877 29276
10859 29276 28259 62832 53746 30990 34134 66138 58462 63491 50979 51092 53418 46172 26910
10846 26910 11772 21470 39719 44941 53273 51359 42047 30941 29778 10980 11313 29688 34507
10833 34507 43975 47080 51626 43781 22300 16332 11850 29575 56457 31083 14591 16935 26274
10820 26274 31335 37594 25808 6368 -16983 -15864 -3065 -8722 -24539 -23743 1145 12426 23290
10807 23290 20352 -4161 -20583 -22112 -1069 10260 37937 28115 3341 293 32254 21333
10795 21333 16730 32902 62616 75504 74192 64472 41953 44034 38035 46005 24943 -3824 -10646
10782 -10646 -15943 -9601 -9437 -17218 -6084 5944 2986 10342 39881 17144 -7759 11668 16724
10769 16724 24301 36195 52045 45132 19933 -7759 -16843 -10713 8468 20737 -10488 -26630
10757 -26630 -28416 -23864 -33663 -8787 5652 17701 1905 -15226 -8319 26695 32971 28068 9635
10744 9635 4988 22935 45683 49695 33410 23966 25068 17080 22318 42335 59935 76736 77398
10731 77398 59439 52996 76406 80795 109716 110225 105677 98478 73741 77606 90284 92764 100689
10718 100689 106637 118192 125193 107920 95662 93210 83802 69840 78069 71803 79855 71081 76787
10705 76787 82990 93864 86154 80461 91337 92286 89017 70127 41177 40583 29485 49229 57116
10692 57116 56609 77647 116117 120788 111911 93741 97389 96039 70502 49462 55694 57243 51253
10679 51253 55617 60732 56563 43887 43016 65710 80471 72919 76443 92785 96535 80524 78360
10666 78360 99944 118076 126104 136570 149915 138046 136139 147729 136359 139866 151293 186775
10654 186775 242197 289293 325782 338266 363194 399888 417355 395199 348909 320280 310035
10643 310035 318889 331798 343980 332551 360314 408558 474746 516193 593867 678936 795364
10632 795364 913550 1015158 1060103 1097097 1188635 1299715 1451094 1646728 1917758 2268809
10622 2268809 2766907 3448060 4382219 5673622 7354693 9442680 11740247 13778741 14982949
10613 14982949 15152720 14664901 14133084 14032032 14592473 15909181 18099504 21285651 25473853
10604 25473853 30105603 33733271 34860088 33298475 30216367 27136789 24955398 23998122
10596 23998122 24472548 26593904 30415696 35753054 41515640 45472107 45539696 41784525
10588 41784525 36104296 30610118 26521417 24096263 23246672 23838805 25807947 28762001
10580 28762001 31761514 33257837 32076809 28511739 23908670 19701867 16585219 14601147
10572 14601147 13633494 13471808 13932666 14719443 15393987 15407188 14385115 12478491 10217302
10563 10217302 8143110 6499800 5296323 4443459 3807240 3349816 3020171 2784505 2636006
10554 2636006 2551947 2501359 2498669 2511932 2547818 2638659 2799146 2971294 3253258 3621402 4036710
10543 4036710 4563175 5195360 6048003 7141563 8535900 10192590 12126409 14220555 16151281
10534 16151281 17471301 17835346 17116691 15534546 13563162 11553316 9725896 8204720
10526 8204720 6955602 5969372 5165860 4507236 3999337 3559742 3188475 2869000 2564417
10517 2564417 2328063 2094287 1892529 1744076 1613021 1501746 1404937 1310976 1209924 1113554
10507 1113554 1017387 950414 910294 858130 797380 763613 737889 697903 656422 619404 578078
10496 578078 540005 504555 502269 506288 496613 483923 425150 419008 442540 443597 431123 424729 406325
10483 406325 404851 426021 413396 402536 396738 407659 396702 383188 353574 347421 355196 385260
10471 385260 396391 403184 404007 400293 427657 443976 490193 503232 507648 519730 522775 529153 518857
10458 518857 511497 513397 522011 526774 528340 512031 493359 484618 474133 476813 476276 477551 485290 473137
10444 473137 452773 436431 427069 413619 418172 386629 347805 317604 287738 277397 275563 259239
10432 259239 246260 268876 279832 282173 272744 265294 273035 251944 237646 263408 278833 261248
10420 261248 265200 248633 245071 262127 275644 288853 276617 286453 302194 317380 321644 305435
10408 305435 319790 347856 342892 332770 309197 294484 297479 282726 285219 294617 301693 311933
10396 311933 314665 304866 297367 296493 292377 304177 297154 282810 287867 309292 287796 307891 323761
10383 323761 339527 343889 325592 299240 312708 354968 380509 369107 371712 384779 393206 405224
10371 405224 405173 426008 442464 458841 488871 515690 507360 526443 553039 581788 595869 609061
10359 609061 605961 637612 674385 689193 704884 731679 741350 748373 791359 882101 958853 1019618
10347 1019618 1088924 1136210 1187596 1256469 1314957 1387740 1498844 1601146 1720887 1853417
10337 1853417 1990205 2156630 2331000 2516886 2672669 2844782 3005243 3194410 3453967
10328 3453967 3785477 4170855 4590264 5050033 5524742 6029059 6516372 6998674 7446789
10319 7446789 7829797 8140223 8397262 8579052 8677434 8723316 8719037 8616162 8427005 8193169
10309 8193169 7873288 7452641 6970706 6484772 6006681 5530063 5075723 4663993 4307975
10300 4307975 3956589 3647788 3372269 3147952 2934279 2732691 2569524 2430774 2310537
10291 2310537 2200015 2106628 2009286 1936211 1866754 1796271 1753711 1685639 1636896 1605461 1590841
10280 1590841 1570815 1528091 1526485 1515054 1505053 1509887 1500127 1500253 1506876 1487680 1508073 1510574 1529116
10267 1529116 1573920 1637708 1708783 1748561 1793790 1855804 1955057 2087202 2227137 2371097 2467191
10256 2467191 2505281 2478933 2440543 2400082 2388574 2429635 2502887 2615107 2738158 2869777 3009070
10245 3009070 3176990 3345235 3548527 3742643 3959562 4184257 4400277 4620996 4887306
10236 4887306 5170383 5467629 5802742 6238157 6789037 7485087 8317084 9313011 10410673
10227 10410673 11465842 12494113 13458080 14479254 15694452 17323906 19496904 22311900
10219 22311900 25843667 30187700 35548354 42268689 50934046 62739059 79805482 105408211
10211 105408211 143983983 199922700 272436352 343624217 386641730 400183344 377924950
10204 377924950 325327962 264530038 215671840 191847700 193031731 216973868 258608387
10197 258608387 300616242 317372210 313161625 306043506 307720018 300727110 265448166
10190 265448166 212378516 159208282 119366020 92278523 73805610 60820561 51297143
10183 51297143 43895655 37920083 33062977 29152582 26023966 23436951 21253709 19309955
10175 19309955 17553793 15985140 14664803 13586905 12565582 11531813 10562110 9711523
10167 9711523 9016609 8424789 7890770 7404485 6940591 6565136 6207463 5863324 5559157
10158 5559157 5292457 5068838 4906640 4753541 4589467 4397512 4192788 3999537 3799413
10149 3799413 3628834 3498421 3370063 3264392 3160804 3061205 2979982 2870435 2732160 2631099
10139 2631099 2522869 2439853 2370715 2317102 2244692 2185727 2149596 2113086 2056819 2007867 1926020
10128 1926020 1869541 1822408 1773806 1741375 1719253 1685997 1658913 1637064 1582704 1531997 1499913
10117 1499913 1459106 1421603 1398007 1363549 1324414 1301922 1255423 1217295 1196784 1160119 1153666
10106 1153666 1147114 1124922 1104945 1102450 1114115 1095782 1058435 1023620 996169 985196 963659 939898
10094 939898 923480 909584 893020 889505 868834 864409 911517 912496 935928 953420 961968 970985 975358
10081 975358 959028 920799 889048 845904 834250 814479 827889 861659 883102 874807 872194 854672
10069 854672 832224 812787 783152 751966 719178 685564 690194 704955 716009 705825 667761 635890
10057 635890 616373 610565 602860 591273 607082 605836 625181 603812 579746 570623 557599 533680
10045 533680 528837 514515 505587 460978 440381 461289 469638 460187 451660 455005 439864 432174 446986
10032 446986 468487 458434 426411 403609 383536 375493 387375 398716 417399 413633 391717 379842
10020 379842 360574 354414 343784 343156 360872 358018 352027 369626 399338 402176 390586 383188 393108
10007 393108 382749 319405 304250 303166 296693 291893 279138 268974 246846 231684 224834 238335
9995 238335 251366 248651 251772 286578 291090 280188 268404 240903 216409 223665 234133 238799 258184
9982 258184 270573 270607 272753 268404 259933 251392 242256 223982 231682 224739 230664 238851 238297 243062 224734
9967 224734 226586 234405 224291 243371 261006 251680 250652 235354 207056 237293 283268 278671 286260
9954 286260 273978 276519 274227 269470 285137 292677 292257 278865 281707 254286 225912 225406 249241
9941 249241 291393 307579 268382 222339 205756 178650 177542 212202 213484 236587 271496 316378
9929 316378 366732 433452 468070 438522 357276 294221 275176 252039 227348 233044 243198 247679
9917 247679 238739 195132 187562 189154 175543 161340 171785 192988 193502 208400 215281 201708 191767
9904 191767 180602 173588 168524 179258 165481 147609 130350 114445 132724 150334 147945 157496
9892 157496 151800 165178 160127 125514 98828 104568 108788 113077 124036 131873 123873 110278 123636
9879 123636 111604 110603 102035 106574 131789 159386 199258 214236 195013 186353 163291 137785
9867 137785 120421 112920 118828 132672 141496 138378 134741 139519 151395 146818 170186 156093 145895
9854 145895 160244 168131 149748 166377 177290 173830 179751 168236 142665 140932 147091 115083 81741
9841 81741 81179 83147 111345 116010 129273 140140 151579 149817 146721 148167 138454 143727 164588 166999
9827 166999 157601 142431 157564 166640 191696 195912 191215 173149 167991 166992 169202 170017 187922 216198
9813 216198 237330 285033 320403 328525 372756 424665 520270 641409 835682 1133129 1497481
9802 1497481 1864851 2104849 2138313 1995430 1704009 1373463 1093275 891879 749808 681953
9792 681953 662125 642592 681213 753287 873805 1010015 1260175 1524810 1676456 1711326 1652095
9781 1652095 1639583 1612507 1468536 1224324 971754 759104 580422 459434 375056 317898
9771 317898 282867 262574 257073 230053 220948 225014 209108 207008 205771 189679 181826 166186 151390
9758 151390 145251 153742 180520 188639 175140 163633 162892 152359 138006 141901 121656 143335 164978
9745 164978 152230 107951 106123 112445 120052 117054 103956 73900 78313 95832 101846 106031 96700
9732 96700 122341 145819 124203 112018 112823 140126 159944 136527 97764 101375 110559 119394 118844
9719 118844 110669 94554 64076 54428 94599 102091 119404 115221 121045 138589 115006 107465 85440
9706 85440 66935 45405 54086 82808 96181 119507 108722 107841 100723 98530 112131 124810 139749
9693 139749 120188 102537 106632 112549 96658 69214 84202 64897 31541 43025 55380 50473
9681 50473 32861 42641 58282 67450 58000 63466 64845 68783 76544 60847 47708 61895 74856
9668 74856 67449 46764 40914 29980 46525 63690 64531 54763 69926 80871 70281 77136 103710
9655 103710 166789 220029 284549 425303 638708 755625 666873 481933 316184 235653 200666
9644 200666 161537 132496 107358 91010 72022 78953 93605 57765 57031 80376 73242 38132
9632 38132 39857 47027 73914 92499 79632 46040 32215 41659 63077 77439 75061 75215 71168
9619 71168 67963 90380 75942 49456 51445 34694 28149 18805 42781 48895 65941 77463 76859
9606 76859 73246 72286 60774 72919 65358 51884 39547 46876 59866 71915 75028 86608 71688
9593 71688 49483 26226 17709 9256 34215 42122 60185 59186 51478 49789 35178 52253 61699
9580 61699 74058 66749 73298 106106 121345 118817 109053 84758 82025 75200 66066 37926 35538
9567 35538 50535 47122 52229 44644 46832 55265 56796 52465 62005 67459 97003 85474 74282 62511
9553 62511 57499 49373 48056 53436 72148 80603 70357 69280 39883 20927 23702 39955 45840
9540 45840 48025 37119 41629 56040 64614 79537 66014 49222 51075 67024 70483 58160 47311
9527 47311 39165 38908 38897 61852 64219 52877 22179 24838 28934 24204 26651 27535 23509 37788 41943
9512 41943 34394 46663 44062 21543 37171 86113 86730 61592 48441 52464 51466 41527 44072 32760
9498 32760 39696 53998 34891 36279 27408 52704 64037 55247 53964 54615 42236 37326 47785
9485 47785 31339 57227 83507 74937 60909 37268 36380 44134 64100 67086 24287 9422 13910
9472 13910 19165 27560 25044 36154 33694 36553 57088 73974 59984 34797 18673 17514 30076
9459 30076 59402 58811 49295 50829 65773 72796 49580 21104 -1754 9406 18840 39604 48773
9446 48773 38398 20704 44585 57970 48772 62266 70413 61610 52697 32254 28626 32525 23101
9433 23101 22844 54224 59231 42209 31978 25917 28093 -1368 -15923 -4997 10884 21486 7053
9420 7053 9777 24779 14236 19614 39214 28958 8848 -4673 -18301 648 18312 25972 38098
9407 38098 41886 44480 56677 35117 35789 59497 55418 76540 89875 65517 31778 25563 29293
9394 29293 43644 83649 82397 78668 62936 44618 26356 18721 23107 27862 24408 29576 44627
9381 44627 30007 17595 48777 37017 26850 45887 44255 17045 19686 40475 41262 43611 43584
9368 43584 29393 4755 -7578 -8287 -10609 -5975 21079 24775 29222 38405 9352 30419 51810
9355 51810 57287 44850 47699 40375 19708 17146 12608 27029 5204 -2072 7294 6283 17041
9342 17041 36569 21291 4345 28714 35857 21655 -2383 9493 14755 2775 -443 13277
9330 13277 34467 40683 24704 39027 23044 24340 31339 10773 -10827 -14361 -10887 -3066 20019
9317 20019 28458 27331 45431 51907 53220 39179 48809 38414 28447 35735 46463 38412 46418 41811
9303 41811 32890 48579 46720 24193 6047 22554 17518 28053 37019 29303 19368 3466 -6324
9290 -6324 414 13335 21926 29609 22001 15625 8549 4978 -89 -4324 -12383 -22198 -39584 -30399
9276 -30399 -26009 -34261 -14969 -650 1608 -6406 -7141 -9263 -4770 -20840 -26997 -3823 18061 50738
9262 50738 43030 38977 44748 45998 52264 36572 25978 42727 59366 45674 38602 48412 40114
9249 40114 21654 3539 22325 29589 43079 58000 55174 26016 5718 8714 30154 47711
9237 47711 35836 30486 43754 37947 19120 27417 17701 19446 38899 33059 17292 30944 40889
9224 40889 39460 38377 37481 24990 27419 26604 21892 17493 7515 6726 18557 2039 -12733 14169
9210 14169 15903 15221 23028 31081 27469 31231 61583 53231 51285 36283 17309 22165 13900 21446
9196 21446 33595 28335 1363 5665 12042 28747 21384 9201 18583 7405 -16445 -4639 18325
9183 18325 31457 47499 56275 54848 55977 56708 49650 45928 63000 27894 -5493 8686 24431
9170 24431 27124 21977 15338 36185 55854 46514 43445 49732 47963 58410 77729 57792 19404
9157 19404 -17842 -19094 -10242 -8964 5871 13195 6797 -823 -1841 1676 22620 17058 48034 35965
9143 35965 30210 25218 16008 21087 41068 11879 1618 11716 39510 72776 69123 37699 30818
9130 30818 26043 17541 14399 12901 -10441 3046 27818 45398 45391 30593 24564 43181 46025 50555
9116 50555 25841 19516 8413 6398 14510 35613 33901 12194 16909 18528 3668 236 15342
9103 15342 38232 24024 16657 35132 58826 60694 48784 43865 19569 24960 35399 24526 28657
9090 28657 24591 22253 43491 51808 42845 30852 16205 3316 7621 7273 13732 13562 5932 6305
9076 6305 1974 26756 33762 20627 -1041 -8373 16939 7884 -5348 -6363 -1119 4387 7332 18039
9062 18039 8649 20200 45238 27623 17302 24081 17316 -4644 19635 29060 13211 998 -6814
9049 -6814 -2693 5320 8613 615 6796 2952 -10368 -9114 -4106 -1417 5973 -8154 -16960 -4638
9035 -4638 17334 24564 22184 19329 33662 36350 30410 8029 30942 45283 23075 -160 1237
9022 1237 14436 30309 22183 10693 27769 52161 44871 35796 23653 -8894 12371 37870 44323
9009 44323 43699 19129 1195 6033 6566 -16733 -13845 10426 32126 29479 20772 17337 6902 -8695
8995 -8695 27207 31805 32021 50774 36840 38881 60930 52315 46678 13222 3051 21470 17528
8982 17528 9282 -3311 20916 39110 32698 13772 33895 37611 11835 -8549 -4555 34328 41916
8969 41916 27996 26125 19660 26009 22509 29370 27896 23516 33828 39157 45598 54204 34712 3173
8955 3173 -6660 -4270 -16023 -29979 -12488 -495 18351 44374 34407 19868 37361 43114 23074
8942 23074 982 12264 25419 17651 -11539 -3175 -3039 14675 15242 33345 33318 29434 47645 33463
8928 33463 26642 9942 4818 -2318 9706 22049 20079 3977 -18276 -23553 -632 23698 36316
8915 36316 38752 45642 42679 43930 60305 63100 9840 -8249 -2810 66 -7767 -17013 -13123 -3714
8901 -3714 13766 30932 24548 5960 -8669 -20438 -14262 13943 38799 28170 9676 7764 32490
8888 32490 13798 12051 18501 28146 23036 32360 19663 28038 36717 32540 25495 27852 43766 39789
8874 39789 34368 34232 15273 16357 34627 29511 33473 45813 36453 23917 30010 31192 16408 10419
8860 10419 -288 -8185 -4406 3429 5129 811 8825 -2021 -21530 -19346 -4654 -8715 -901 7799
8846 7799 -4361 2169 15398 28557 33056 13793 23185 24974 -433 1072 -3594 -1527 26733
8833 26733 34804 -6557 -22695 -20398 -22621 -26318 -39666 -40152 -32130 -8796 13681 5118 1816 3989
8819 3989 -11173 -21068 -26319 -10763 -12992 -2100 13344 20826 49878 50112 56251 46554 24667 2927
8805 2927 6795 8519 5627 17167 55949 29872 25038 45495 28238 23653 19788 7675 12193
8792 12193 24320 17191 4835 4972 4479 -7671 -30607 -13523 4561 -10913 -24968 -37166 -28603
8779 -28603 -32151 -24050 -7173 -21212 -39549 -15846 1698 -5310 1693 -1801 -9057 -3184 -3287 -3133
8765 -3133 8156 23949 23967 9126 4944 21532 16798 13390 -8299 12898 32284 35940 52798
8752 52798 46288 22084 13934 20841 -12435 -13521 5911 -11454 -8738 -27210 -7778 6938 7889
8739 7889 9263 26779 22101 23270 27252 18679 22680 28987 15699 -21472 -45676 -25325 -7420
8726 -7420 18835 55665 73984 70189 47804 41171 59843 44603 16625 11683 4834 15226 20841
8713 20841 13378 -6822 -2859 20674 38082 10974 8559 26558 7776 24035 10854 14239 35128
8700 35128 38925 22740 5587 -8039 -23449 -8818 31168 34844 9901 15648 14303 8682 29602
8687 29602 27184 45099 34432 21359 37895 43266 16506 44387 69958 53690 23509 34571
8675 34571 65118 62479 14995 1861 15878 19354 9998 5423 22253 41808 45479 18592 15786
8662 15786 21650 15053 32878 32583 24368 34367 24505 -6698 -19030 -31391 -18028 -23320 -19906 -11807
8648 -11807 11596 32924 27130 21987 -9547 -34988 -28242 -17838 -14102 7526 48662 59927 80453
8635 80453 89730 87542 75501 86395 117410 159233 178030 190150 182186 160562 124941 103039
8623 103039 93512 101818 75681 65462 32556 30972 41127 46960 36246 42713 45514 34395 38477
8610 38477 52633 50461 47787 26149 2180 3532 16937 32415 41435 38604 17746 -1584 245
8597 245 6499 21060 11900 2728 -347 13339 33507 35865 47270 71385 122844 174223 274009
8584 274009 374714 452136 444526 381428 290809 207128 157159 130637 98339 58040 48686 20064
8572 20064 32145 54320 54728 57233 67163 71963 63430 59699 60762 37835 40362 35697 25112 12898
8558 12898 4904 14246 12903 10757 31016 26003 17689 29214 19049 4456 5868 18303 21658
8545 21658 21956 47806 77501 102105 131885 166995 206013 218768 224496 183682 135757 106815
8533 106815 83587 76013 52982 48103 28194 20138 25461 18126 4398 3634 5144 -5958 -614
8520 -614 28034 13059 11105 21198 13750 4342 -926 -6494 -2420 9659 29022 28229 44264 47325
8506 47325 40380 27641 29565 54593 33343 5809 -10619 -2394 27632 22352 -3958 -7220 -5759
8493 -5759 -306 4065 3742 9931 3420 7214 16769 6256 27840 40819 29368 -13909 -36710 -5004
8479 -5004 8573 16937 -1925 -13046 2422 7978 -7730 -5218 2833 194 -1780 1501 986 -1114
8465 -1114 24752 39409 37167 35703 23937 -3148 -8498 -23409 -10042 15642 20673 7583 -25180
8452 -25180 -44842 -24481 -5194 12605 17660 19998 33940 24261 32515 45581 60596 53318 33789
8439 33789 38185 27169 23969 35705 67787 68471 40585 25611 14577 6386 22944 22964 -10819
8426 -10819 -41928 -37997 -31471 -34695 -24443 -14146 10657 10151 -1092 1125 29946 46375 42096
8413 42096 15266 -2247 -1613 6015 32392 385 -19546 -26148 -19534 9383 6474 5444 10031
8400 10031 3219 -6245 9283 12442 1888 -7459 -9609 -17713 -9261 8217 4398 -618 -957 1977
8386 1977 6141 14098 10323 -11477 3240 12020 29529 37307 24542 2535 -20202 -23715 -28269
8373 -28269 -39881 -18648 -4664 8342 -930 28938 59225 67060 45454 33381 40695 28479
8361 28479 10112 -11346 -18097 -21762 -19773 -10584 -8139 4488 -3077 -2553 -8214 -8168 313 17189
8347 17189 1246 -26076 -26655 -14584 -11500 -8403 -12983 -12939 -6126 9768 -1418 -11896 -9593 -1726
8333 -1726 -5081 5071 32466 51576 40656 23878 5957 -4455 -14215 -20700 -10513 5405 22341
8320 22341 14579 2165 -4740 -83 -22992 -14862 -449 6313 -1369 10027 -2361 -14894 15210
8307 15210 32749 47857 53178 43286 19597 21344 37621 23163 22014 21457 20750 20440 9123 8564
8293 8564 -20582 1979 42604 60295 58377 56286 47170 41966 29032 -8948 9677 4307 6737
8280 6737 24077 38474 30795 17140 2533 -12405 141 14820 11069 -6390 -11612 10998 27994
8267 27994 34383 12542 -22286 -19980 -9293 -20182 3887 25347 13415 7870 -5820 -21645
8255 -21645 -17952 -9254 -784 3148 -6170 -5617 -4932 -8798 21712 41652 52262 48258 61975 62035 35493
8240 35493 8158 1695 4040 6125 14124 32563 35016 14796 19922 12477 16968 8033 -8486 -8926
8226 -8926 -7231 -791 -35644 -39503 -32512 -28390 -10021 9420 21571 34637 38065 11792 18751
8213 18751 27980 22859 -7408 868 -4036 -20103 -36980 -26495 -6780 6304 15460 19388 23724
8200 23724 23710 16930 11299 17237 7780 -22183 -19055 -8747 7285 15441 39173 40537 28431 34739
8186 34739 22446 31954 42725 17066 -7340 -8628 -3418 -12168 -5169 -5879 16236 20086 12434 -28801
8172 -28801 -43897 -27128 -9403 -6721 -266 19611 13644 -26938 -28761 -32166 -15630 -14910 -15093 -26192
8158 -26192 -37763 1735 33920 27156 18813 3855 -14769 1152 3843 -289 -15339 -21369 -20039
8145 -20039 -27046 -22523 -20563 -14868 -8842 -5601 -7280 -5409 -4756 -5625 3521 11207 13630 -77 10991
8130 10991 26109 31374 22547 4377 -8291 10489 2119 16600 12705 5076 -7629 -978 -541
8117 -541 -28155 -18562 16142 16804 12923 28592 -2561 -2206 31459 34349 16324 27774 10249 8025
8103 8025 -4788 5119 29113 35701 36685 38220 33951 14617 17964 9864 -6576 -20932 -17334 3453
8089 3453 -16005 -20075 -9408 -15082 -20067 -33289 -21200 -9487 -20523 -26747 -32905 6169 18235
8076 18235 7802 5946 5124 8540 -17096 -54600 -58080 -39815 -36797 -29117 -9987 16185 10827
8063 10827 -4523 14151 2022 -5628 626 15810 11451 -3202 -5370 -4238 -18830 -45236 -29182
8050 -29182 5086 28293 27688 10626 -23572 -38882 -39668 -25970 -23794 -20868 -4188 5219 4435 -3538
8036 -3538 -8744 3922 -3993 -10209 6163 1972 -3374 8229 18646 16249 -11271 -13672 -3490
8023 -3490 -27379 -43951 -49777 -53155 -28806 -23665 -37534 -46535 -18719 8531 9233 -11297 -15958
8010 -15958 -28223 -9476 19621 15171 14495 -6924 -17922 -7002 19461 34917 11888 6568 26272
7997 26272 35065 29990 -18086 -48918 -42384 1579 45522 55990 23280 11897 3352 6299 -9360
7984 -9360 -9081 33057 39479 36067 26971 31447 30133 25511 26508 15099 3586 4921 -6433 5346
7970 5346 14884 50332 48315 36659 32976 23761 17897 29341 20146 28191 20837 13797 42657 30957
7956 30957 10084 -4257 13291 2637 -7919 -48876 -27979 -13242 -14551 -11723 -25266 -29447
7944 -29447 -26974 4198 29837 48919 28501 38 -4159 20459 28785 42332 32399 26306 39814
7931 39814 35495 28229 18319 11629 10743 -3818 -6508 2323 -177 9404 32929 50268 33070 6542
7917 6542 -13701 -13310 13035 18807 9716 4633 17171 27669 33364 42598 30309 12059 1704
7904 1704 -14744 -29543 -20586 -772 -5987 -13360 -16593 -21144 -10063 9418 9630 -7415 -24423
7891 -24423 -38674 -14224 -4551 4416 11595 -10858 -22697 -22281 -40555 -33925 -26025 -21253 -14769 -11456
7877 -11456 7053 -20470 -23786 -5723 6531 5895 13185 -14766 2809 25435 38057 30020 7354
7864 7354 9678 19530 12991 -3673 828 -1136 -1587 10612 -3476 -11222 -20487 -46706 -50307 -25825
7850 -25825 -5388 15323 -10877 -23157 -16660 -20605 -22361 -3695 2209 995 1663 1044 1058 -36210
7836 -36210 -33947 -32249 -31788 -20043 -16494 -12224 -27665 -26789 -9983 -19338 -4198 22889 49792 34778
7822 34778 9480 -3142 7545 20450 12522 1421 1563 12252 19236 7795 -1765 -16608 -5819
7809 -5819 -4877 -2705 11555 22343 7305 7852 10133 9341 8327 15739 39940 52815 30664 13703
7795 13703 7818 -7357 7612 41272 59169 59165 44839 33459 28164 30962 20857 6639 -10124
7782 -10124 -405 -4429 -10165 2506 -13348 -16529 -15751 -5815 -13389 -2464 15856 14227 15036 9184
7768 9184 15828 20206 3669 -24272 -10188 13410 27567 25277 32492 17868 3789 -18338 -34608
7755 -34608 -24674 -5894 -4076 -5300 -2213 3657 -10135 -25429 -25632 -8863 4725 -18202 -30046
7742 -30046 -19886 -22120 -15338 -14227 -15291 -29944 -39790 -6763 6856 6856 3806 29463 31114 26409
7728 26409 38294 38227 34132 35086 18620 -282 18842 15134 808 7301 11029 -1272 -17899 -14268
7714 -14268 -11289 -11483 2498 6976 10807 6442 -11478 -29881 -25201 -8774 12977 9182 -3220
7701 -3220 -3953 4130 3355 -17698 -33786 -52026 -37873 -6572 22237 18587 21188 30262 -24387 -43398
7687 -43398 -38149 -31469 -11964 -15045 -25722 -11468 -231 4785 13991 14677 -1876 -26702 -19646
7674 -19646 -20901 -4419 34917 54608 42842 28804 31188 37947 65395 55222 20470 18519 2850
7661 2850 -3698 -9111 -2188 8879 2899 -15633 -19473 -4048 -6604 -14403 -20948 -27477 -28961 -16615
7647 -16615 -14340 -2715 3176 5429 23256 16166 13463 13712 -6974 891 1329 -4629 659 -3185
7633 -3185 -1608 6746 7461 106 12469 14913 13075 6390 1109 -9327 -21487 -29498 -22119 -2162
7619 -2162 -7093 -19617 -22330 38197 43346 19101 -11993 -13918 -6197 -7786 2554 -1442 -5540 -10297
7605 -10297 -29204 -51738 -37377 -23655 -19928 -21237 -5749 8569 11385 3788 -2655 -6814 -21947
7592 -21947 -20827 -20939 -14951 -16220 -9041 -4181 19029 39683 29224 3194 1605 296 6098 -17011
7578 -17011 -11143 -7987 -1930 14639 -24042 -34692 -21370 -26048 -19953 -12568 -7617 -4653 -8857 -9948
7564 -9948 5487 26113 25531 14384 -3934 -13868 -6216 4193 9049 10294 -12339 -27020 -22041
7551 -22041 -5225 6395 12495 -17727 -36717 -6492 -15126 -33913 -22005 -18403 -13642 1900 -2833
7538 -2833 -1204 10308 25940 9065 -5007 -22404 -11435 -672 -1223 -10813 3317 6888 -773
7525 -773 -17003 -14218 -8496 -4835 13086 20740 36622 35651 3802 -16067 4751 31563 40649 41762
7511 41762 27102 4282 -11157 -1384 11192 16370 4430 -1219 -7562 -26471 -9058 8556 12003
7498 12003 9999 -17652 454 30502 12916 -5956 3926 -5481 4745 31670 22553 1892 10330
7485 10330 26814 30196 17184 8474 10530 4700 9139 10428 14066 -9705 -27717 -34931 -40382 -39552
7471 -39552 -13557 -668 -4287 2374 10287 3722 5861 6460 -4003 -17504 -19440 -40108 -35253 -25087
7457 -25087 -24565 -44635 -27672 -23097 -31179 -35532 -34244 -5934 1268 -3316 28245 38334 8660
7444 8660 1505 8096 -12392 -5748 3144 9525 24 190 4449 15485 13602 22990 35814 26399
7430 26399 3218 6482 19582 32776 24902 10564 7646 12515 3348 -861 -14263 -39544 -25331
7417 -25331 -13506 -23408 -21108 -20203 -1688 -405 -15268 -23814 -25265 -6552 2049 1584 10882 -12460
7403 -12460 -14779 26762 26808 17999 20091 22944 12715 13230 26028 20684 16758 18481 31418 24640
7389 24640 13066 -1819 3659 -12277 -33593 -44198 -29796 -2766 19943 16669 11165 5771 15142
7376 15142 10322 157 -18397 -29559 -26086 -16012 3158 -4588 12417 30222 29735 18180 11008
7363 11008 5696 11481 2802 2163 -3902 1459 15091 15163 -21832 -46302 -36306 -9414 12018 15252
7349 15252 -2139 -19578 -37046 -32931 -23652 -12036 524 -7530 -17426 -8456 -7100 -28584 -30925
7336 -30925 -22613 -18378 2176 12232 -8781 -835 4998 -12406 -13644 -19771 -21626 -24326 -15639 8019
7322 8019 37761 40392 35626 38688 10704 -16487 -23712 -912 15499 10167 -7110 -28840 -30330
7309 -30330 -14531 -1852 250 21305 45967 25130 4313 -15091 -17261 -2283 -15052 -30152
7297 -30152 -52388 -61260 -40461 -17969 -26602 -27903 -33184 -32250 -18506 -9252 -17498 -6344 -6996 -12591
7283 -12591 -21784 -6050 24339 23636 -1420 -9895 5034 8652 -20335 -32620 -27660 -14012 4043
7270 4043 -4591 -29374 -15064 -19494 -29251 -31872 -23126 -33991 -17491 291 13145 28998 53521
7257 53521 43367 8389 -7202 -7977 -9425 -9741 8885 1056 -23674 -19913 -4523 12878 8256
7244 8256 -23209 -41886 -51628 -42891 -26078 -17368 -12184 -28296 -43917 -32700 -15675 2781 -5935
7231 -5935 -12253 -18180 -24071 -39686 -35097 -27105 -8958 -4436 -3866 822 3985 32884 37743 26858
7217 26858 6058 -19176 -33394 -23316 1887 2845 -1186 -17398 2298 -2099 -8124 -8113 -11227 5809
7203 5809 2404 7256 2606 -8064 -5024 8363 52885 60902 41465 1928 -26290 -33691 -27937
7190 -27937 -23053 -41484 -43652 -22572 -6437 -9834 -4678 3983 11508 13841 20767 14212 -10743 -11982
7176 -11982 1082 -568 -1272 -25667 -29747 -18674 -27560 -10778 6870 31710 20843 15913 -8239
7163 -8239 -38173 -24638 5032 2083 -19515 -23380 -34142 -12791 -11778 -16475 -34349 -46837 -20892
7150 -20892 -10303 -9828 -10658 -25347 -39333 -42951 -37106 -42773 -25430 -21438 -25445 -6307 29217 30586
7136 30586 18419 3154 -2706 -16451 3221 19741 -7152 -49127 -42196 -28455 -27300 16433
7124 16433 34608 22021 11812 19542 22489 13818 6456 4459 -6195 -7521 -16988 -32858 -41440
7111 -41440 -25179 -4052 7912 -5580 -28975 -27296 -21786 -34135 -42997 -19668 -15754 3370 -6071
7098 -6071 -12350 5154 17051 5010 -5252 -17260 -10255 6730 17993 20869 -2311 -159 -34506
7085 -34506 -66661 -48299 -22625 -23358 -7409 6011 7668 -567 -15683 -36093 -20681 6507 3409
7072 3409 7906 4556 -2196 9691 28874 29692 12751 -24448 -38099 -21397 -21366 -27379 -31385 -37642
7058 -37642 -30378 -24914 -33526 -20908 -10979 9187 11525 3576 -1037 -33901 -60158 -49662 -26945
7045 -26945 5514 36610 30489 25296 23640 43706 57180 36007 9168 -11134 -14183 -14583 -16314
7032 -16314 -6232 -21433 -30261 -10872 34124 29255 30035 21000 7977 -7403 -5071 -6465 -23387
7019 -23387 -15405 -1192 -29560 -43415 -22747 7276 2429 -5791 -10188 -15180 -1831 -5489 -9638
7006 -9638 -20284 -20860 -17958 -23558 -20791 -15137 -23652 -24489 -41427 -34673 -16898 -11528 -20202 -22517 -31346
6991 -31346 -21142 -960 10543 -19870 -25722 -21677 -10796 -2489 -8333 3975 19852 18823 16203
6978 16203 10693 1444 8473 14779 -890 5789 15948 -2896 3035 -8057 -16087 -277 8049
6965 8049 10442 9101 11493 10581 4196 12662 7611 -15649 -23381 -9660 -17920 -20033 -5929 10498
6951 10498 1956 -4654 10873 9581 7160 8904 26473 30224 11407 5463 7036 -3029 -5097 -19521
6937 -19521 -12781 1259 -6443 -4378 4150 -16140 -5844 -12205 -18107 -22371 -25038 -1580 -9509 12220
6923 12220 38391 25542 6610 -22209 -31007 -24727 -23358 -34085 -35421 -27951 -22330 -32097 -13440
6910 -13440 4934 -588 -27302 -54809 -65951 -31842 -3267 -11210 16447 16344 -2045 22037 41240
6897 41240 41363 32260 16287 -13117 -30943 -10774 3616 -13405 3294 16138 2626 -5288 -18608
6884 -18608 -17547 5820 28460 13191 6689 2591 -2785 -2037 -11203 -13086 -28153 -50837 -52110 -54710
6870 -54710 -31461 -19798 -36318 -37368 -23458 -34704 -28212 -15296 -24640 -31348 -20651 11620 6166
6857 6166 22332 16237 2694 -3607 -9307 -1802 -6763 -15556 7468 21683 14378 5782 5242 -28052
6843 -28052 -45808 -33788 -10412 -12271 -6637 4415 -15770 -24260 -24189 -11755 202 7172 -5959
6830 -5959 11562 20490 4675 -6069 -7855 -414 8532 6958 11349 14370 4773 10258 -1602 -4736
6816 -4736 16301 21076 -5908 5539 -12554 -49213 -40618 5463 38674 45681 23370 17165 40852
6803 40852 53029 26223 24765 43126 26698 24331 32976 18174 -27199 -27481 -3303 -4435 441
6790 441 28178 38683 23983 18172 1472 -15550 -34463 -23961 -20720 -22759 -21020 -22586 -12386
6777 -12386 -16141 -14133 -5657 4552 947 1201 12260 109 -9284 3635 13369 6414 -707 9813
6763 9813 13478 -11324 -30360 -13348 -5669 -985 -1120 2768 9969 17220 10187 16465 -4785 -21812
6749 -21812 2132 18131 1446 -7166 -2990 18385 37952 46256 32332 47838 56899 25681 13078
6736 13078 16386 8000 -5406 -8965 -4871 -11269 -15726 -12653 -17382 -18163 -12927 -4951 1808 10002 -10970
6721 -10970 -41894 -62000 -55595 -55300 -66402 -60836 -44704 -39730 -27610 -25690 -36269 -24757 -22074
6708 -22074 -23846 -16073 -1306 5537 3701 -9207 -5973 14661 -15737 -24953 9827 22465 5635
6695 5635 -13967 -23556 -26932 -11481 -17790 -14239 1261 18747 20084 11828 5753 -3377 -21326 -39718
6681 -39718 -28771 -13556 -6415 17698 28568 25715 16685 6858 12931 13727 -10153 -17715 -6095
6668 -6095 -11763 -1639 -1608 -13876 -25002 -11526 -2054 -5198 -12345 -18249 -38308 -37254 3960 23283
6654 23283 22997 17809 16850 20833 24763 18167 13600 -1060 730 -15964 -28694 -7210 15164 6189
6640 6189 -25366 -36878 -38597 -26527 -33716 -43803 -22926 -8070 -18133 -23813 -4703 638 -8020
6627 -8020 6020 4897 8877 -6209 -15813 6738 26088 34161 4269 -2478 -4081 -3492 -13570 -24560
6613 -24560 -11093 5396 14382 26606 7650 -15197 -26231 -17101 -8271 -20421 -42454 -38852 -29117
6600 -29117 -17542 973 -13687 9872 24204 12500 35711 30030 20542 9010 1618 -14417
6588 -14417 -11965 -20155 -29424 -29978 -27405 -47696 -51540 -38558 -33990 -17261 -7952 -3419 3162 -9045
6574 -9045 -38768 -66387 -44493 -15410 2228 -6298 -15262 -32765 -27981 645 1709 7704 11357
6561 11357 -14853 -30273 -23863 -19898 -14583 -26070 -14780 -14069 -23317 7999 9382 -8612 -28780
6548 -28780 -31735 -22699 -24333 -30614 -33435 -32030 -33914 -23902 3126 -7789 -7174 -15733 -32494 -24617
6534 -24617 -8511 -15721 -12276 -10609 -7231 -1925 -6556 -12020 -9484 1924 3470 2783 4007 5241
6520 5241 16279 38350 49708 41294 25747 6017 -4970 -9798 -35576 -36798 -48652 -29320 -17785
6507 -17785 -9965 -4108 -4757 -22661 -27172 -35948 -43733 -37482 -44574 -50290 -48235 -38225 -39376 -28554
6493 -28554 -5994 17014 13634 9485 16303 7281 -9434 2114 -1276 9364 3979 4609 3593 -5092
6479 -5092 14605 28771 43042 46995 21178 15534 -3510 -32774 -19653 -11707 -4025 -6704 1406
6466 1406 -14481 -14599 949 24730 11951 -30008 -16565 4450 9350 7747 20810 22750 31667
6453 31667 36741 28264 6446 966 13953 13358 -1058 20827 6480 -11182 -2909 13331 27835
6440 27835 11709 8051 -705 -20672 -32537 -42913 -44196 -14483 4371 21086 11819 802 14101
6427 14101 51757 73834 48067 16582 4976 12770 9017 -3495 -6430 -11817 -11850 8804 27393
6414 27393 25241 11145 -6560 7062 -14149 -5657 -12631 -6616 17673 22201 15891 2333 -3685
6401 -3685 -30946 -37878 -36270 -43157 -50793 -35476 -12452 -24829 -23120 5234 -1596 -18171 -15036
6388 -15036 -16556 -28632 -20330 -10228 -3919 -9491 -16039 -12369 -2724 3236 11103 15703 13260 27825
6374 27825 18380 -14941 -31118 -37361 -39509 -23371 -9098 -11563 -5142 10538 9587 -10350 -11489
6361 -11489 4018 -5499 -47395 -63501 -48180 -25569 -42942 -34715 -32959 -17944 7165 13717 -3755
6348 -3755 11184 -12578 -15831 -2030 1870 25028 37213 41389 7695 -34580 -43060 -20544 7313
6335 7313 1682 -9334 -18123 -23334 -26781 -43703 -45431 -8165 -298 -1835 23090 19293 -10539 -18373
6321 -18373 -3924 -10915 -35558 -21904 -10499 -8574 -17910 -29248 -25152 -19426 -14073 -35761 -34832
6308 -34832 -39761 -47927 -27544 -12104 14235 25892 921 -22730 -40915 -37213 -29320 -16455 -3930
6295 -3930 485 5192 -8951 -33524 -35228 -39968 -20120 -1025 -241 -18340 -17036 -20587 -21841 -12535
6281 -12535 -15405 -15654 9961 -4578 -25964 -20949 -7149 -5146 -19949 -5405 5076 25748 44549
6268 44549 32308 8012 5738 -19512 -53263 -46632 -45475 -31002 -28663 -12581 -19509 -21142 -3136
6255 -3136 -9294 -37396 -45165 -25854 -12125 -14985 -113 -969 -24237 -22001 -15789 -38160 -20076
6242 -20076 1381 12776 5891 -2367 -8516 -2693 1921 16916 2372 876 6175 -2904 5970 5937
6228 5937 6458 -16394 -14306 -26857 -19583 -12495 -2785 174 -8234 -19565 -1065 12273 -6778 -14691
6214 -14691 -9063 -23143 -43030 -56345 -46255 -24460 -15660 -14735 -13116 -18990 -3140 9262 -11408
6201 -11408 -6247 -7559 -1722 634 -3371 -10651 -1326 8995 9479 -2708 -22470 -27060 -21375 -14865
6187 -14865 13 4174 974 -234 12924 18687 19947 17709 -8587 -12064 -19904 -29191 -24699 -24882
6173 -24882 -34804 -15169 1117 -1070 11240 19748 11502 22117 -2783 -7755 21752 8541 -23615
6160 -23615 -23466 -21757 -26376 -21247 -25002 -19428 -17707 -17890 -16036 -11275 9279 18773 18579 22041 26415
6145 26415 18302 2806 13827 -10756 -29253 -28117 -33150 -34291 -29435 -20712 -20882 -33414 -27560 -14214
6131 -14214 -22774 -20553 -34134 -38088 -7566 -11515 1424 11014 -7703 -35068 -69585 -49869 -45465
6118 -45465 -49528 -40685 -42559 -35020 -18218 -15043 -13007 -136 -9680 -21131 -8962 -8932 9516 -796
6104 -796 -2932 9971 12217 359 -8182 5823 18531 -1426 -27429 -24849 -25358 -24828 -38098 -40784
6090 -40784 -5851 -318 -19853 -31729 -42675 -41294 -38198 -20598 -10021 -35145 -54018 -35519
6078 -35519 -3195 7501 13489 22817 24359 33448 26592 12158 21470 10426 526 -13288 -8907
6065 -8907 1143 -5952 -25748 -16061 12821 4369 3278 -20119 -31540 -21555 -1832 -577 -15583
6052 -15583 -8608 -15452 -32450 -28569 -23230 -12550 -4353 -13749 -59625 -63626 -35391 -9718 2186
6039 2186 14435 4665 104 -22807 -27677 -41405 -53253 -51370 -59879 -47986 -26043 3000 3193
6026 3193 -6668 -2058 14837 38080 25304 -12042 -16882 -15804 -6559 -22353 -23415 451 21952
6013 21952 -12417 -19729 -25020 -26211 -22546 -5382 -21466 -36589 -19895 5620 15260 -21139 -44340
6000 -44340 -43472 -27565 -25583 -40654 -50048 -13501 -3189 -4642 22817 6688 -11487 -10972 -10448 -2647
5986 -2647 -12013 -17961 -774 5461 25538 25511 -14692 -44286 -69265 -55891 -14557 8037 658
5973 658 -2502 9679 20076 2579 -13883 -13795 4735 10796 2849 -2351 4647 9421 17618 15547
5959 15547 5398 -22663 -5268 28580 37822 35136 3493 -9463 -3328 18856 -5265 -30038
5947 -30038 -18969 -14482 -18752 -24665 -2845 7012 -11024 -28587 -32358 -11920 -22783 -13491 -5398
5934 -5398 -412 -2678 -12048 71 14270 -7810 -26459 -33158 -29559 -29157 -34337 -60926 -35795 1965
5920 1965 1082 -4868 -16002 -31907 -15718 -15217 -24512 -23516 -34569 -41225 -48525 -48658 -14580 -13559 -23805
5905 -23805 -10670 -13934 -23856 -12641 6003 8617 -377 -16504 -31512 -33799 -23479 -2530 -9896
5892 -9896 -35846 -36145 -36401 -25147 -7124 15882 20136 -13388 -25127 -18186 4917 15570 8445
5879 8445 10413 28849 22200 1862 -8067 -12661 12578 11996 -20461 -34130 -28748 -42763 -46513 -28333
5865 -28333 -24905 1088 29686 45432 11745 -18639 -8664 7940 22571 -4399 -11864 5699
5853 5699 14635 27754 20100 10693 -1385 -5055 7687 10342 -783 -19447 -22186 -37157 -33048
5840 -33048 -33414 -32005 -11158 1667 7254 -1705 2838 8826 1378 -8388 -12305 683 2387 -81
5826 -81 -2088 2525 20057 7406 -25253 -36172 -6217 -3703 -9111 2535 -6073 -20047 -22019 -29203
5812 -29203 -27974 -3503 8356 23095 25064 10769 1789 -17871 -5385 22437 24539 6337 10595
5799 10595 6325 -11267 -16747 -9790 -22127 -29532 -26834 -25964 -23880 -11627 -9508 21067 23870 12099
5785 12099 -6106 6837 15098 -528 -7254 -5828 -327 -23735 -23469 -25250 -9294 16693 20297
5772 20297 3724 -6833 -15658 -24109 -33494 -7177 5492 -4475 -15289 -10755 -7167 -17833 -20872
5759 -20872 -19081 -7412 -11253 -15092 -7759 -7837 -28523 -18953 8797 12586 24254 20353 34297 15895
5745 15895 -21183 -37932 -23982 -4889 10179 1235 -7929 -15339 -18617 -17400 -7540 -2994 -9223
5732 -9223 -6331 -1338 7277 -5555 -4956 -15023 -17010 -14977 -2200 21642 32855 19830 26972 35472
5718 35472 17446 -4949 366 9204 13890 -5171 -12974 -5817 -5822 -11899 -6797 18270 7784 -2824
5704 -2824 4107 -4899 -40412 -42314 -14261 11664 19266 24913 17104 6949 -8580 -3185 -25442
5691 -25442 -24718 -32455 -25724 -24994 -25665 -28868 -29287 -13672 17997 13935 -4779 1692 20426 31200
5677 31200 15276 9829 43173 54990 37794 67 -16164 -10078 -1481 -63 -12853 2977 -8776
5664 -8776 -19019 -15146 -4904 12308 4196 9043 9939 3284 7026 20262 25000 12967 -7011 -13224
5650 -13224 -16448 -8778 -7446 -12690 -11345 8743 9530 -8722 -31543 -28786 -19101 -33692 -37856 -26571
5636 -26571 -39950 -34784 -7143 -4294 -3152 -9304 -20188 -7378 7466 -603 -24660 -36338 -29447
5623 -29447 -17050 -7558 12826 8886 14498 27551 11558 -18547 -35011 -32859 -1071 1941 -3413
5610 -3413 16031 15911 7284 2631 7644 -2686 -4273 -20199 -32120 -38013 -22028 -16926 -16532 -54018
5596 -54018 -41900 -20492 -37348 -57574 -44618 -19066 -23747 -40153 -32292 -36745 -52792 -42272
5584 -42272 -30069 -5430 5912 -5357 3198 8691 1557 -4006 -6152 -14216 -10507 -8514 -2412 -19712
5570 -19712 -11068 -12152 -9834 -16758 -19638 -13588 -8140 -12150 -1013 -12840 -8852 3664 11004 19606
5556 19606 18244 3362 -7106 -32386 -23035 -12471 -10815 -22981 -16753 7970 2165 4543 -1257
5543 -1257 -13177 -10983 -16589 -46229 -36035 -27435 -25989 -16778 251 -25392 -33662 -31358 -12951
5530 -12951 -20722 -19721 -21765 -27454 -23329 8867 46978 51330 52997 42467 32896 -596 -14786
5517 -14786 -12659 -27830 -28635 -15408 -23359 -12635 100 17018 20379 17757 8578 2693 10706 -9210
5503 -9210 4999 29464 31995 15607 -5227 -20338 -17723 -21068 -12486 -38059 -28889 -23428 -15152
5490 -15152 -18714 2231 -7758 -5894 3840 -5499 -6022 -14083 -18152 -5984 5122 21151 26131 23001
5476 23001 20428 19948 20266 23314 11936 -15595 -16432 -1602 2505 22369 21016 -6256 22524 46009
5462 46009 44920 30544 -4619 -5698 -4775 6432 12035 -24322 -32491 -16853 -3880 10125 13025
5449 13025 221 -24161 -30177 -15868 -10056 18573 12030 13214 22655 -25725 -58214 -28807 -2284
5436 -2284 -1415 2636 13140 20505 29822 31707 19116 9069 -15245 -7637 -7581 9636 24197 35162
5422 35162 28310 20200 4248 1445 1231 -8286 -13714 2639 11873 14143 18815 25228 1698 -9814
5408 -9814 -10257 178 10326 18121 16247 10452 20404 13681 -2255 10030 15280 30344 30792 29179
5394 29179 6471 -5038 1118 8635 -10194 -37677 -36926 -19752 -4935 -6968 4974 12126 8163
5381 8163 10150 -6201 -688 463 -16938 -11134 3003 5199 -3202 -19517 -50391 -57786 -45115
5368 -45115 -38204 -28743 -23110 -23951 -30905 -20334 575 -2294 -21977 -20015 -31584 -36864 -20263 -22757
5354 -22757 -17534 -10684 -14023 -49974 -58205 -29091 -20956 -21466 -14842 -16432 -22168 -17902 -22166 -20929
5340 -20929 -2107 8120 1875 4717 3369 -16208 -20802 -11388 19084 9876 5574 12526 22528
5327 22528 14417 9742 -5891 -13477 -21115 -46804 -36029 -1376 12010 -8839 -27614 -35647 -51490
5314 -51490 -34947 -24239 -29837 -10223 -35861 -35490 -42304 -48701 -37169 -27901 -18452 -2565 -19836
5301 -19836 -34844 -49931 -64020 -41025 -14007 -447 -683 -22838 666 27922 46362 11977
5289 11977 -13167 -7437 -12028 -10807 -3058 4055 -3009 -558 -7352 -17644 -21312 -32776 -58546 -44793
5275 -44793 -22929 -21128 -39919 -49365 -29695 -40327 -24910 -3544 15516 18084 23385 55967 54620
5262 54620 58455 15476 13164 13496 -18321 9886 15013 9923 21446 18465 4261 -8317 1992
5249 1992 7699 23837 633 -37425 -53096 -39715 -46124 -54154 -33122 -5291 41152 42729 24779
5236 24779 17435 -2490 -24032 -16329 -6536 3730 11378 15861 12966 7652 1803 18970 4266
5223 4266 8597 6877 12677 1452 -4588 7976 6263 410 -14446 -19750 -11911 -4423 -2102 4895
5209 4895 16550 7361 -27028 -34219 -18562 -10488 -11340 -31284 -46061 -38463 -27542 -26170 -7212
5196 -7212 4042 -2526 -4823 -19955 -19011 10167 11059 9314 6726 9675 -5740 -26383 -28114 -5974
5182 -5974 -10280 -8261 2054 -212 -13214 -18292 -9231 1498 8289 -11829 -2703 932 3621 20664
5168 20664 26575 16173 71 -7448 15435 18276 18838 5843 -6591 -22764 -48246 -50380 -41796
5155 -41796 -36367 -31334 -22084 -9497 -993 1701 11759 14140 22618 23571 20521 9411 405 -23987
5141 -23987 -9284 2659 4938 4969 10067 -9304 -23030 -19720 -20535 -14571 -30500 -33993 -6227 11598
5127 11598 -7831 -13323 -8712 360 7482 -4265 -31976 -23705 -12110 -22392 -26411 3280 -12499
5114 -12499 -17104 1463 -11626 -28722 -43868 -15157 30534 47004 41251 29798 9332 -16258
5102 -16258 -12616 -3186 11710 5420 2087 -26565 -32912 -22537 -20944 692 825 -18203 -4975
5089 -4975 -18385 -8120 5820 18025 12410 -1654 -15985 -25155 -11726 -6863 864 -688 -7746
5076 -7746 -9521 8312 1953 1974 6574 -509 6121 11079 16820 -11927 -42853 -53277 -48640 -24100
5062 -24100 -35228 -47617 -23181 -22962 -24755 4105 -3024 -14801 -32761 -35864 4034 18656 -7821
5049 -7821 -15953 2838 18524 44477 46140 -4790 -52982 -43477 -15450 14074 8395 -6570 -1305
5036 -1305 23184 3841 -21669 -30587 -26942 -25375 -11987 -29180 -20229 20762 11976 -16537 -18943
5023 -18943 -5744 861 -19788 -28939 -40280 -55333 -62119 -52246 -49774 -43689 -25724 -33895 -14830
5010 -14830 7428 1060 13305 24798 24105 23085 14636 -19332 -12593 8170 653 17001 26047
4997 26047 27594 30947 12719 17872 5918 -1213 -24061 -37254 -43308 -28408 -18548 -20051 -36453
4984 -36453 -19241 -8083 100 -9333 -34721 -56372 -45279 -25408 2294 -14924 -34175 -21085
4972 -21085 -9149 -8302 -23630 -39097 -18108 -11765 -5661 -9592 -1938 -23145 -40354 -39296 -23802
4959 -23802 -19101 -16584 -1643 16338 27897 38532 31061 14259 2557 -25819 -26961 -765 -10572
4946 -10572 -19149 -6556 4725 -6022 3758 8336 -345 973 17302 13322 -16859 -7395 3021
4933 3021 17501 36441 25535 11366 28649 15935 5281 10716 3496 -27068 -40627 -45106 -26907
4920 -26907 -9091 -6204 -3651 -10816 8758 19207 6142 -9761 -26562 -31079 -28253 -13723 7861
4907 7861 -1993 -12896 -9919 4060 -11889 -34350 -29485 -5666 -12555 -36780 -39122 -29661 -20991
4894 -20991 -26025 -19941 -13041 -23392 -36671 -32325 -15273 -137 -19915 -31333 -3798 -16316 -34610
4881 -34610 -37355 -35011 -37459 -44094 -28433 2455 8077 10620 -20576 -36189 -34128 -8298 -19804
4868 -19804 7472 5835 1787 21326 30631 18368 8180 -227 -14448 -22867 -33556 -35810 -41641
4855 -41641 -24154 -15852 -368 6688 -1034 -7767 -10215 -11352 556 14891 -527 12927 17431
4842 17431 -26813 -59016 -65283 -58401 -39790 -685 16562 -1004 -24861 -19148 -20900 -35261 -33534
4829 -33534 -28067 -28795 -44689 -31510 -12571 -11502 -14400 -9508 -25415 3951 11256 24559 18395
4816 18395 3475 -17154 -40166 -51525 -10897 11206 15533 3311 16013 29974 6198 -14623
4804 -14623 -43038 -46789 -31070 -20972 -22454 -902 7556 -18699 -42747 -38766 -19439 -9432 -39753
4791 -39753 -49787 -67049 -50349 -21912 -21698 -51185 -52697 -23855 -9121 5151 9077 -9496 -32632
4778 -32632 -33419 -17030 -24728 -32454 -36692 -36703 -40361 -69220 -70762 -38739 -33086 -33780 -13903 -20588 -28363
4763 -28363 -14555 -16128 -17443 -3110 20408 23294 20608 19277 21291 6848 16717 35902 28457
4750 28457 15373 14773 -766 833 3772 -19437 -35482 -21174 -22768 -9292 12225 3917 25099
4737 25099 40509 -436 -35802 -35108 -50526 -49470 -28069 -14169 -4057 19067 10507 -855 8500
4724 8500 -6678 -4612 8951 19090 2895 16475 22549 11559 -9810 -26690 -28541 -6517 -35987
4711 -35987 -34235 -22092 -18181 -13189 3431 52 -7391 17270 -8421 -5581 4596 -9384 -14068
4698 -14068 -15242 -17089 -18568 -43090 -46221 -30436 -20315 509 8715 223 -2618 469 -22470
4685 -22470 -33543 -17857 -15850 -24935 -30823 -20544 -25720 -42512 -34758 -28581 1749 11890 -15785
4672 -15785 -33903 -17914 -8972 -15376 -19329 -25390 -48474 -21277 -13397 -35546 -39382 -28686 -18955
4659 -18955 -35530 -44116 -48774 -33888 -30264 -28391 -22663 -22344 -35932 -33125 -19181 -1761 -21287
4646 -21287 -21729 -25004 -35913 -9902 8069 -4628 -13894 -11537 5768 23429 15811 7836 -9579
4633 -9579 -29595 -36841 -21108 -34811 -50590 -55342 -62261 -60666 -53678 -31306 -18089 -36412 -33014
4620 -33014 -16232 -12525 -12057 -16949 -20684 -34321 -43970 -38100 -22055 -5974 -11683 -50705 -55928 -21482
4606 -21482 23666 12437 13181 13494 3263 -13092 -19255 -23719 -13768 -15051 -13684 6236 5578 -6003
4592 -6003 -26393 -19604 -2859 4372 20051 20544 9082 16344 26133 38868 38920 14063 -22275 -44223
4578 -44223 -34316 12695 49358 67061 65341 23128 -37 -7062 -947 11978 5983 -3642 10447
4565 10447 38669 31187 -20104 -19804 -5719 -17141 -21657 -33502 -30645 -22665 -28877 -27596 -27685 -13677
4551 -13677 -5286 -14143 -27330 -22650 -13260 -19732 -32570 -14791 -3083 11226 13618 2838 -7297
4538 -7297 -14490 -10896 -9954 -26922 -20091 -14053 -20366 -19291 4667 13557 -2075 -17449 -20653 -17784
4524 -17784 -17648 -38942 -40725 -15799 1263 -4106 -23429 -24392 -32859 -36529 -40890 546 11168 -14524
4510 -14524 -48826 -44145 -40419 -50724 -35696 -38806 -35657 -25778 2307 -10677 -19583 -28977 -29521 -26020
4496 -26020 -1528 16930 9872 11787 26877 32881 17895 5382 -7015 -17782 -21475 -521 -5510
4483 -5510 -24566 -41587 -15478 5108 9503 42155 57230 39689 -490 -28303 -43206 -37635
4471 -37635 -27925 -28114 -17616 274 32116 18379 11188 9917 27270 31092 7301 8661 14692
4458 14692 20583 27912 42625 28812 12668 28591 2877 -20708 -21834 -16813 -14631 -20072 -22540
4445 -22540 -19148 -16774 7032 15778 -1712 -19682 -9986 5372 6202 -17967 -27320 -12110 17351
4432 17351 12913 15612 9088 1649 -2160 -34574 -28044 -18836 -12291 12127 35817 44962 27592 24493
4418 24493 31508 20174 22773 10995 -4122 -22747 -12502 6057 -4513 -5594 -18137 -3288
4406 -3288 12685 16111 12913 27830 28126 30073 32899 25989 464 -28851 -38087 -27486 -15135 -34156
4392 -34156 -52806 -33643 -20935 -14685 -16506 5130 15483 13718 6348 -10886 -15730 5830 32258
4379 32258 46788 73681 62565 27894 -10267 -17911 -6067 25555 12355 699 7933 7902 9466
4366 9466 10783 20736 44237 30303 17792 2160 8110 14741 -1307 -15410 -11864 -17428 -4767
4353 -4767 -9151 -33550 -27317 -16595 -18571 -23650 -30215 -49608 -46357 -45387 -46805 -42217 -59943 -58672
4339 -58672 -40797 -32199 -10137 2874 8680 15168 774 -6351 -15052 -34927 -35400 -16514 -22946
4326 -22946 -17193 3026 18644 11366 -13220 -12103 -24289 -14159 -18903 -2208 -7951 -18906 -2166
4313 -2166 3734 3306 -1106 -6970 -14375 -17667 3676 24166 35132 32026 29143 20053 -211 -5223
4299 -5223 3050 -15916 -20749 -41830 -42337 -36443 -13100 -9358 -12758 -5053 5680 -9281 -18239 -36600
4285 -36600 -10558 -1826 -20519 -11511 238 -5424 17803 -213 -23990 -13478 -27849 -19460 12026
4272 12026 45859 51344 50743 29432 -6388 -12227 3616 11278 1552 -5329 -11291 1383 -8390 -20502
4258 -20502 -14572 -22016 -28439 -42046 -54976 -47881 -19902 -24571 -36770 -31366 -13154 -17562 -12191
4245 -12191 5848 -1759 -24225 -11408 13541 23403 6687 -9336 -26961 -30697 -28793 -1198 14344
4232 14344 909 15749 36883 35245 32237 41550 35571 21604 24396 24425 18817 -5188 -11762 815
4218 815 23678 23239 10140 10311 4058 -33008 -42629 -32090 -35692 -29820 -21208 -10985 -2083 11116
4204 11116 23797 5934 -22263 -28655 -18509 -28727 -27310 -10188 -9484 -10591 -22528 -35161 -32111
4191 -32111 5670 49817 43580 25742 25453 29635 17101 -1311 -6635 -1800 -5137 -8620 2840
4178 2840 14696 -590 3719 17106 -2672 -7883 4378 18598 2632 -3002 -31820 -31565 -17603
4165 -17603 -9137 8047 20801 20163 9143 23157 22142 25009 24306 16537 6019 272 -10637 3085
4151 3085 9002 -3463 8673 25751 38685 34998 30505 65419 67521 28004 3796 9985 5704
4138 5704 17436 7793 -2962 3817 25767 31395 8072 -464 -12375 -39824 -47980 -14714 -11359
4125 -11359 -22756 -34706 -103 15657 7663 -4313 6577 -77 -20060 -27511 11560 15824 9078
4112 9078 29606 39174 14544 -8399 -18546 -42585 -39986 -29243 -22535 -12488 72 -20026 -16626
4099 -16626 -17566 -12450 4429 -17886 -31355 -31324 -10468 -357 -7132 -27480 -23292 -15327 20717 21836
4085 21836 1862 -12259 -23976 -36196 -36700 -28464 -39451 -42638 -23932 -16814 -13941 -30608 -42467
4072 -42467 -42970 -38602 -26112 -8883 -29111 -11926 -13536 -9248 -23871 -22905 -19374 6236 35442
4059 35442 37571 14247 30996 10861 -5348 -12012 -30961 -29054 -23094 -30120 -24208 -32478 -21121
4046 -21121 3503 7426 -8756 -36524 -18699 -8908 -17215 -20305 3852 19514 34322 6390 -25377
4033 -25377 -11323 -21920 -45336 -42911 -7815 106 10304 16496 -5558 -11077 -18829 -25942 -16971
4020 -16971 -10839 -14548 -12056 5275 -14644 2325 18744 39140 36101 24595 -3149 -22636 -31845
4007 -31845 -22720 -12820 -20248 2844 29880 10225 -14204 -19280 -4021 15417 20163 21765 867
3994 867 12525 30402 23488 25762 19693 16110 16101 18136 19829 20927 20677 10443 3840 11143 20679
3979 20679 27723 14650 -8743 -18839 -22067 -12220 -589 -1129 -23818 -31819 -19520 -3029 -1487
3966 -1487 -1353 -15414 -19556 -12743 -28155 -26965 -8333 -376 -7643 -19775 -18932 -5918 -398 8498
3952 8498 1695 -10867 -2381 2924 3381 -28985 -20265 5448 3191 -17358 -9796 -27772 -33789 -8176
3938 -8176 -17491 -34756 -37960 -10412 13707 20713 22453 12652 -3308 -5215 20227 24943 31992 9510
3924 9510 -15489 -12006 -13251 -17481 -34390 -22872 -1125 -24786 -23177 -14137 -12887 -416 5677
3911 5677 -679 -24854 -42898 -24168 -8948 -6804 -22717 -59920 -46647 -27745 -8815 -13169 -40743
3898 -40743 -67775 -71347 -72014 -66094 -43546 -18572 -13286 -26063 -4604 11072 9431 -35 -4688
3885 -4688 -18532 -4273 1659 -4321 -14036 -35109 -31318 586 18988 19381 31578 11047 -12470
3872 -12470 -2240 4143 15922 20215 22068 5742 -4982 -2947 -17958 -27302 -27403 -30928 -27064 -11198
3858 -11198 -24002 -31330 -33942 -32691 -31035 -29319 -18348 -8873 68 1640 3851 -24679 -39840 -15686
3844 -15686 15541 13908 -10476 -6539 -4746 -12525 -4983 -6602 -7726 -7267 2118 -5767 -36637 -43297
3830 -43297 -51893 -36112 -25515 -23430 -13017 -7608 -13143 -12543 -15118 -7239 189 15207 10918 5246
3816 5246 3681 -1908 -6975 10932 12780 13322 -3851 -17309 -10052 8440 21221 20755 2621 5973
3802 5973 5131 -8521 -15044 -7570 -10714 -22832 -27856 -25302 -10138 10611 19595 23944 22685 7939
3788 7939 6675 -4154 821 29965 43753 14506 -10396 -7200 -13505 -30056 -41150 -33861 -1927
3775 -1927 6314 11436 -8036 -8925 -4093 598 19353 8047 5225 5671 -18278 -9520 8627 -8749
3761 -8749 -28287 -24530 -11431 -8388 -6708 1351 7958 2303 -15503 -29625 -33418 -16560 -23873 -23398
3747 -23398 -9904 -8726 -7964 2909 8582 -11609 -11817 -17344 -21183 -17068 -6508 -3245 -11163 -34100
3733 -34100 -41401 -23642 -5435 18020 1106 -7385 -13103 579 -14809 -9750 -1259 5813 13258
3720 13258 11048 -1027 14105 13589 10081 13480 2648 -14943 -23151 -35888 -33897 -8365 22411
3707 22411 21868 17359 961 -4010 -12679 -27035 -13145 -5378 8641 4422 11484 41336 46262 31716
3693 31716 17620 -2620 -27908 -3426 2129 -457 2288 6096 11704 39419 62285 39705 18705
3680 18705 -9533 -27710 -42991 -30586 -23336 -16045 -18656 3338 25800 17711 2858 -7799 -13357
3667 -13357 -10429 -10386 -15947 -21126 -27305 -30284 2121 12876 4355 -10245 -27761 -20047 1034 10558
3653 10558 -5881 -2362 -4845 -4596 16992 29853 -9927 -53041 -44647 -37301 -22419 -8916 -14153
3640 -14153 -19354 -22237 -31814 -38739 -50220 -39805 -47801 -42352 -55881 -48464 -11410 -23782 -52561
3627 -52561 -49578 -42735 -16599 -9989 -6582 -3430 13745 22478 6919 -12508 -22340 -25856 -31065 -19671
3613 -19671 3887 -8166 -22606 -23793 -17994 -24967 -30570 -32537 -53461 -46793 -10495 6679 -1363
3600 -1363 -5392 -1231 9393 21507 24664 13416 2199 21712 28720 31015 25452 13651 19269
3587 19269 16022 9382 -2545 -9908 -11781 -18485 -22702 -5959 3765 18394 9790 21914 24394 7055
3573 7055 -8884 -15728 -7401 7820 28915 29117 6318 -2506 -9727 -15444 -39382 -21807 -38044
3560 -38044 -51105 -39652 -29177 -15368 -2997 8405 -6700 -34635 -22942 -22521 -33894 -24431
3548 -24431 3746 10949 -9888 -34370 -37955 -26484 17725 39191 19690 10268 -18212 -36007
3536 -36007 -33850 -8003 13029 25072 19962 -4800 -14733 -6569 -13438 4651 16773 16199 21726
3523 21726 5723 20453 24008 -3384 -10924 -12584 -40224 -42486 -32695 -12422 -17317 -16113 -1159
3510 -1159 8506 24558 28218 5703 -9611 -16452 -16220 -20917 -23947 -15807 -27541 -45427 -27700 369
3496 369 1481 -161 -12435 -6369 1464 -1458 11883 3532 5847 8915 13194 3530 -200 13313
3482 13313 15852 -2576 -11814 -45153 -67532 -55410 -21969 19857 27522 -7161 -7715 -7500 7059
3469 7059 25762 16272 6480 -12740 5265 32956 11427 -11651 -18433 -2537 -29351 -54252 -41043
3456 -41043 -28169 -27371 -10622 4159 4308 12571 3478 513 13648 24348 20178 406 -32839
3443 -32839 -17092 -5130 7318 2479 12881 5493 -15859 -6688 1519 -6576 -23453 -46598 -58314
3430 -58314 -67482 -96557 -98207 -63323 -26781 -20501 4262 22506 15047 5415 -18708 -36638 -10470
3417 -10470 -902 -7082 9677 -14579 -20038 2190 -4626 -26513 -6497 6111 1835 -12215 -26162
3404 -26162 -32912 -22069 -23851 -21770 -29141 -12557 791 -19876 -29280 -11682 -9848 -9558 2247
3391 2247 -8931 -28710 -36461 -30853 -23445 -13996 4071 7847 1759 5654 19326 11074 7315 -23357
3377 -23357 -25303 2108 -17366 -11309 -3548 9582 20346 8280 -17762 -10873 -7237 12590 7426
3364 7426 -593 6996 36475 45717 30462 32219 39371 29368 -3091 1393 32352 41467 36208 24470
3350 24470 27375 16100 1460 -19634 -13275 -7654 -10611 -17776 -6028 -8586 -6504 -6407 -4615 -8460
3336 -8460 -7596 -4632 -7150 -28743 -26784 -18332 -6326 -7950 -2953 -13302 -26844 -16595 -18435 -36591
3322 -36591 -27266 -7772 -1276 -13142 -10072 -7412 3810 -8903 -30385 -32109 -10301 26636 39746
3309 39746 34799 38355 32815 23657 12884 -1314 17975 24943 20525 3230 121 1789 2916 -8557
3295 -8557 -21994 -4380 13987 31935 45009 59873 64869 43242 5954 -5447 31470 37380
3283 37380 29447 41969 44905 54835 35798 15542 1819 5870 1520 -547 20331 28614 41114
3270 41114 54271 63110 38190 21255 16615 -302 -10754 -5603 -26091 -37084 -37793 -15467 9165
3257 9165 4159 13369 17470 -7117 -3581 -5568 -1387 5755 -1207 -6543 5955 -9321 -20658 -10014
3243 -10014 13194 34979 28697 31177 21818 -4969 -2095 -21464 -26632 -6510 -7777 -10461 -2751
3230 -2751 20302 4212 1823 3075 -7680 -6291 -5922 -7337 -11770 -37003 -40178 -26775 -19875 -17498
3216 -17498 -529 -1923 -9364 -9743 -6192 1679 3478 15023 11876 -1576 -9552 -11396 -16170 -19249
3202 -19249 -13745 -3688 25629 35362 12862 -5168 -34347 -19156 -2839 5493 8650 10385 24367
3189 24367 16064 6216 -10603 -2701 4637 10345 10006 -1467 -2363 27335 47632 40745 36448 50227
3175 50227 52148 46932 28681 25710 18131 7 -9471 -27006 -23043 -26351 -39588 -19795 8093
3162 8093 2019 -12932 -22742 -39348 -37626 -29072 -17960 -924 23882 6704 8596 -2659 -21299
3149 -21299 -19060 -14490 -8219 1029 18675 21990 3958 25909 22794 24332 8893 8698 9036 17006
3135 17006 3843 -7680 7816 1856 -17791 -8488 21567 19065 16183 6283 9591 10252 8237 21255
3121 21255 -5117 -17079 4294 24932 22740 30130 40275 43389 18350 396 -4677 1232 -28534
3108 -28534 -23867 3203 3327 6734 -9348 -7256 25937 40738 31099 12378 1749 -7227 -2040
3095 -2040 18835 23467 -12711 -42040 -21554 10929 -2383 -12863 -7533 -19329 -31713 -37324 -45869
3082 -45869 -25086 -30122 -36569 -22083 4893 46918 38832 15823 -2666 -20499 -13393 -25192 -25075
3069 -25075 -22832 -38155 -57766 -43019 -24676 -22638 -42965 -60127 -45838 -33013 -42565 -49503 -68675
3056 -68675 -71202 -73443 -66161 -39286 -22326 -19768 -4535 13436 51273 87391 66906 32196 12478
3043 12478 13144 39808 45273 24906 14607 -13631 -11833 4266 6932 -2156 10371 22845 5659
3030 5659 -1423 224 447 7524 -9377 -2365 5338 6574 3212 15072 9579 -7544 -4249 9568
3016 9568 -11708 -29918 -14176 -4747 -6970 3064 15146 34194 36479 15051 -3717 -14571 -9355
3003 -9355 -6172 -8529 913 12717 37248 41858 30408 6454 -984 -16980 -18988 -28859 -34682 -11983
2989 -11983 7453 -4556 -7975 -8851 -5902 20200 4713 9330 8842 16063 20209 26250 40342 27270
2975 27270 -4788 -30282 -29389 -24288 -51817 -43259 -6325 2582 5211 -3337 -23969 -43018 -31385
2962 -31385 -25571 -36751 -21229 799 -8615 -14387 -5647 9951 -8527 -2945 -6245 16401 20337
2949 20337 9185 -5554 -14167 8009 -1841 -26828 -36981 -9405 -11971 -20237 -8828 -11970 -565
2936 -565 -428 -17641 -28484 -40793 -41273 -20622 -7575 -19286 -13031 -3517 -2113 6099 2424 -9259
2922 -9259 -9151 -17119 -31809 -2742 28964 38506 27308 35597 23824 25673 25465 8861 -1712 -7106
2908 -7106 -15073 -3430 -10358 -22855 -32576 -21938 -18053 -8777 -18410 -29050 -7770 6959 -4829
2895 -4829 -12569 -1506 -955 2124 11620 21445 2198 -3430 -2449 -11997 -4403 9243 701 -6019 -4327
2880 -4327 -3064 -16437 -20059 1227 4249 3744 19774 12705 5518 -1721 -14109 4107 24054 35860
2866 35860 38969 17848 -6666 -15980 -36011 -25456 -11548 8563 26416 28502 47606 21893
2854 21893 11463 46604 36498 18016 10557 10073 -16720 -42409 -32734 -5851 -5118 -6754 -321
2841 -321 2234 -5269 -26683 -18718 -1213 16099 39875 19349 -2143 708 3848 -5098 -37038
2828 -37038 -37766 -14566 -12128 -12240 -14758 -8998 12328 18845 10684 -11998 -25833 -8019 31988 22789
2814 22789 15512 11237 21597 21885 12714 -496 -6485 -1906 -2633 -20648 -33461 -8972 7404 25346
2800 25346 26382 9874 -16708 -12803 3230 8269 -768 13222 24078 8172 47 -3321 3630
2787 3630 18701 17698 23590 3816 -25716 -42935 -45488 -26210 -988 3669 11672 -1201 -26704
2774 -26704 -34372 -18460 -22945 -26273 7268 16868 267 -4301 -10394 -15107 -15402 -15819 -14641 -6861
2760 -6861 -26337 46 -2694 -8019 1021 6879 13315 13016 24472 39031 36112 2624 -5582 4817
2746 4817 25462 21780 4364 -4149 7434 20299 5980 -9520 17580 39239 47792 59738 45578
2733 45578 20172 9763 20996 -370 -20729 -13589 12530 5703 -2753 774 10190 23897 18248
2720 18248 -15968 -34582 -42916 -39248 -21554 -10829 -4314 92 9259 12010 29741 36393 13059
2707 13059 -20776 -44679 -35473 -19665 2163 18265 14377 23813 10918 -14948 -35890 -21140
2695 -21140 -9685 -2686 -2525 -6653 -3656 2174 -9151 -25618 -41561 -47059 -18254 7020 -5330
2682 -5330 -14637 -5223 -8163 -13042 -13220 -10849 -5013 -6191 -8668 -36468 -41843 -43416 -28175 -4401
2668 -4401 -4541 -20142 -31101 -33442 -34094 -15539 -7120 1325 -8790 12240 4511 29083 32998 19691
2654 19691 -6044 -24903 -5587 3752 7838 -4150 -10493 14314 34310 26697 29265 5874 12747
2641 12747 6903 1323 -1203 2697 -11151 -1523 -9522 -24109 -18487 -31793 -21485 8994 -13227
2628 -13227 -31475 -43165 -21992 -19237 -13715 -3914 -7382 -27358 -24954 -5597 -13442 -11196 9728
2615 9728 42566 62007 40542 38024 34225 41040 36445 18402 -6102 -32495 -2835 5043 6286
2602 6286 -4405 3431 10994 279 14510 2783 -12301 -25950 -34555 -38037 -33937 -19352 -567
2589 -567 19498 24151 7176 7693 3415 8207 11389 23125 5357 -3948 -17359 -17397 -3838 -14191
2575 -14191 -27021 -32446 -244 37670 17306 9122 -4774 -11223 -15793 -18735 -12364 16638 28396
2562 28396 19571 12824 19838 20273 3840 10638 8624 -14364 -4625 13585 5350 5131 -10862 -23960
2548 -23960 -17531 -615 16144 6690 -4221 -8 14803 24924 11922 2325 23265 43117 38858
2535 38858 42773 19504 -11635 -15754 -1470 7798 -10839 -2237 37328 40010 29848 17072 24687
2522 24687 35965 -7295 -11511 9498 30575 8349 -1376 2464 -7792 -10362 -18237 -20391 -5259
2509 -5259 -11657 -15611 -16816 -9394 12011 23677 35049 41682 43969 19906 9186 7272 31663
2496 31663 23671 -3342 -795 32847 63459 58345 22648 23339 29761 18772 19688 29033 15147 2338
2482 2338 -11365 -9455 3229 5648 -23569 -26112 -13120 -19382 -3972 -10693 -25887 -106 11514
2469 11514 14859 189 1444 8618 30059 29660 9663 -3919 21572 19516 1686 -7028 1706
2456 1706 -2591 -17410 -37389 -45037 -29486 -18030 17239 25656 26087 35722 38248 10269 5719 16387
2442 16387 40293 42052 27735 5541 2253 -2475 -1382 4997 -9022 -15275 455 12809 26662
2429 26662 19306 12281 11982 2245 -24390 -5808 -5101 -1991 -13172 -13324 14384 20499 2089 -15126
2415 -15126 -12887 -2411 19957 4200 -11853 19625 39456 24330 1325 19002 8815 -3539
2403 -3539 -5894 1337 17161 31337 30629 10672 -9084 -18422 -22564 -16137 -1226 -4942 6232 22139
2389 22139 20315 2193 -23471 -26234 -37229 -15306 -12687 -11706 1440 -2908 -26647 -20504 -1757
2376 -1757 -13803 -19000 -12586 -12130 -27557 -28700 -1690 -19735 -17347 7725 10056 -134 -5688 6832
2362 6832 6526 5285 -13325 -44886 -34809 -21395 -15505 8521 2720 -26007 -40992 -34901 -6401
2349 -6401 9326 -5331 12204 17240 12784 7690 14815 35043 27413 -10884 -23417 -15022 -15516 -15850
2335 -15850 -7633 11438 19854 16326 20505 50278 41257 25724 34769 23431 33013 29591 16911
2322 16911 3884 -5190 2681 30575 34271 29415 13515 -761 8655 7661 -12473 -28896 -29566 -22800
2308 -22800 -27087 -15133 -2006 4878 16580 4123 21347 15147 1336 -11820 -4910 -77 11512
2295 11512 15077 18778 17761 41061 36648 9986 -31035 -31395 -23154 -10507 -5261 -5888 4124 429
2281 429 -13982 -26339 -6215 16719 25545 28488 29713 8229 -4532 11835 10395 9721 10240 307
2267 307 -26264 -8794 -6556 -9889 5510 -7240 4050 17002 19544 15842 11505 11880 13921 27744
2253 27744 40972 25680 19042 13440 -17064 -33406 -35423 -20422 -6892 -15522 -11411 -2486 -14620
2240 -14620 -16474 2425 11593 12657 -6691 -902 -115 3404 1636 -21061 -14904 -21504 -1912 8201
2226 8201 -2241 2284 13828 32740 52439 37901 30734 11999 -13574 -11620 -9150 -13216 -27280
2213 -27280 -15616 -11070 -428 20529 8480 14470 9737 8017 14659 -8929 -10808 26972 28366
2200 28366 -15854 -33346 -16941 -22714 -34622 -48325 -33344 -28875 -8829 3276 -2455 -23018
2188 -23018 -22749 -5534 10517 -4724 -17615 -25036 -4796 -10564 -12898 -4350 -1994 -17695 -34294
2175 -34294 -39392 -42390 -25422 -4686 -4497 -12406 -1163 7875 9430 14116 16660 8239 10512 -7902
2161 -7902 -19019 -23153 -37456 -36043 -9786 -6682 -20631 -21599 -5455 -1199 -7590 -1469 4080 5891
2147 5891 -1566 1544 549 10866 23887 28961 30001 29588 3934 10303 35138 53715 53560 23801
2133 23801 -682 -10962 -8783 -5919 -11249 -5518 10636 18587 18579 28613 22027 16107 3407 -20324
2119 -20324 -27999 -20980 -5589 15989 -8404 -31890 -44329 -36996 -21705 -7864 5581 18372
2107 18372 12856 15078 3604 -9141 -20247 1535 25548 30980 39320 34126 30358 39688 57724
2094 57724 52836 53565 60703 35302 -8355 -31206 -22841 -22897 -50022 -31303 -22169 -15702 -18134 463
2080 463 8683 12820 28175 14521 1100 -4854 -10467 -14012 3913 5320 -14882 -20181 -31732 -48187
2066 -48187 -30592 514 17544 14950 -918 -14675 -4420 -9424 -4667 2753 5723 -12936 -13215
2053 -13215 -15259 -29389 -31360 -16587 -8835 -3249 13577 25289 12704 13199 14333 21002 25150 14442
2039 14442 -39442 -53261 -15927 5171 -1700 -4734 -497 10612 6351 10202 24330 44692 32071
2026 32071 19935 25876 23503 9173 8319 17006 15235 4254 -3263 11106 21511 25305 17447 4591
2012 4591 16930 26889 18343 23900 30776 41462 31052 19592 19349 220 -13641 -18188 -26949 -20694
1998 -20694 -27288 -16065 -15644 -30989 -25456 -28529 -31167 2185 -5471 -16885 -20742 -1135 -4796 -23428
1984 -23428 -27766 -8398 21181 28036 22546 29846 38783 13596 -2813 10039 22805 36333 8631
1971 8631 5373 14442 12514 31367 31558 26869 14644 14145 14893 5985 16189 28663 16976 -1627
1957 -1627 -6296 -2251 -4393 -15588 -16499 -9232 -37563 -39184 -31785 -31444 -30901 -29894 -31026 -26833 -36143
1942 -36143 -8461 -9117 -23058 -26183 -34211 -34201 -40575 -31567 -10890 5777 9770 17471 14625 -11405
1928 -11405 -32670 -36170 -26220 -23677 650 13695 6361 -6253 -2436 -12651 -5854 301 8747
1915 8747 9168 30089 45752 47233 10108 -9005 4903 27081 31761 14693 13752 18301 22662 13918
1901 13918 306 21078 40019 22206 -4469 -9775 -15812 -51350 -41416 5419 52761 78257
1889 78257 53731 57124 38508 20630 24049 9686 -10002 23166 44706 8816 -6210 -4138
1877 -4138 -3996 26437 15922 -811 19552 20864 31704 21090 -3158 -6559 11009 25257 24709
1864 24709 4923 9015 23839 24050 31939 21984 13031 2814 7525 27547 28699 28119 33255 30978
1850 30978 25301 11552 407 17545 -16106 -46820 -42020 -23609 -16985 -32686 -11588 18726
1838 18726 20212 -11583 1561 9702 18038 -3939 -27232 -33692 -20177 -23479 -779 29219 24757
1825 24757 18589 3361 6866 12350 18269 25631 35183 37526 44626 56739 35572 21903 20405 20976
1811 20976 26434 45989 26115 12783 -3278 -9289 -7408 14607 9669 3904 -1820 26643 28303
1798 28303 24395 28822 26929 25029 21817 25730 42056 42023 31616 40068 50300 21350 7528 5616
1784 5616 -6351 -919 12406 -7089 -16668 1673 28026 10439 27317 43130 24309 16888 5692
1771 5692 19941 50325 47133 49005 59308 53136 27727 15455 15815 53996 27712 15642 15148
1758 15148 21463 24438 37754 30060 26907 17345 26192 22189 14224 2264 -12127 -2415 -16066 -9377
1744 -9377 -5184 -12562 -9952 -8073 -21720 -9977 12641 28499 34871 31966 17757 7269 -77
1731 -77 -5248 5648 8998 10378 401 8041 6703 -12693 -26449 -36805 -39887 -36019 -4348 13639
1717 13639 13785 11229 11582 33751 48426 41670 33638 25499 9186 6536 18698 6775 9892 10177
1703 10177 4193 24485 41390 32572 20580 -8866 -8117 11659 19304 49863 61872 48773 22861
1690 22861 17279 20159 28950 30221 32296 10548 -24475 -29207 -35394 -14750 7255 24582 4251
1677 4251 -5909 -10162 -25522 -22068 -3747 1961 11363 28509 11736 -695 8685 31197 43178
1664 43178 24605 13700 20981 18400 32096 50967 39571 28532 42633 19330 3573 -13262
1652 -13262 -11119 -13565 -9696 -7797 5911 4299 -2519 20539 10904 -9154 -35040 -44304 -22678
1639 -22678 -3623 16993 33241 30980 21061 2862 3998 7717 -3442 -32240 -52062 -53503 -38555
1626 -38555 -397 11733 50238 55256 30258 -10067 -32626 -18310 -8287 13847 34437 20126
1614 20126 -9356 803 -1628 -7249 -6953 -5416 2667 25038 39671 20877 72 3702 20719
1601 20719 25220 3324 6875 27338 19933 11203 6819 5120 2686 -5988 4570 -10288 -35159
1588 -35159 -31021 -19364 -9004 15089 27213 16567 2109 -3471 12163 15345 24196 20119 25026
1575 25026 31747 15168 7990 15857 32670 23540 25622 28918 7432 8644 11538 11844 2387 15238
1561 15238 19971 5314 -2962 19696 33093 47219 67391 53042 39132 37560 19682 -10995
1549 -10995 -5381 24145 48490 50607 43856 27555 15211 -6949 -15837 -42128 -56846 -11550 17556
1536 17556 971 7068 31906 40586 31534 6017 -17056 -37438 -2985 4116 11480 22040 7836
1523 7836 5126 -7827 -15025 -5499 9064 11640 14423 12524 -13983 -15463 -6924 8831 16301 37449
1509 37449 39556 30193 749 -681 -8645 -10495 -9491 -14490 -25767 -222 9647 414 24767 33172
1495 33172 28218 38896 61773 61190 37262 26338 26162 -861 -1623 3228 9420 15690 16604 -4405
1481 -4405 15036 30077 17001 -4041 -2956 -11 -3357 -4838 -5770 -26919 -19541 -3697 -15165
1468 -15165 -38373 -27962 -13211 -5063 -2684 7926 13507 -9367 -4729 8296 11802 28538 24269
1455 24269 21272 7228 9240 23390 17781 10096 16051 -2002 -11942 1791 28262 11682 15125
1442 15125 18941 32318 39969 14721 4885 16719 30983 20257 15828 41067 44458 34110 24611
1429 24611 35283 12595 -13698 -17726 -21776 7884 16244 11314 16163 21281 8636 -26074 -18026
1416 -18026 10157 1663 9787 14434 11752 2541 6164 8448 -10998 -20433 7555 12187 5665 -23427
1402 -23427 -15670 -20476 -7957 9090 21356 8188 3246 7086 8642 4072 -13840 -10053 -13462
1389 -13462 -20363 -19828 -24899 -36191 -2740 7237 -9073 3567 38498 63908 62590 59825 32258
1376 32258 5080 -15545 -3799 15140 30952 24510 15321 -1453 1435 2129 -14320 -27497 -26585
1363 -26585 -35732 -35713 -30118 -22203 6404 18564 -16562 -51913 -62602 -40325 -10596 -6183 -23630
1350 -23630 -13696 11335 4515 -15118 -10917 -3259 -864 -32037 -33452 -21652 -9857 -24786 -9490
1337 -9490 808 15077 32044 37509 47189 30937 2141 -18362 -5209 16106 23539 20469 7193
1324 7193 8610 5748 -685 5157 1887 17425 2722 18023 2945 -19655 -7952 20494 37724
1311 37724 36659 45741 42883 30160 14288 17387 32553 28389 576 5041 18864 7777 -21159
1298 -21159 -19995 -4059 -1448 7711 14532 -14375 -17337 -2231 4298 26590 20884 7367 -8717
1285 -8717 1630 -261 2201 3955 20435 30786 26261 23887 8894 28488 21882 -2543 2273
1272 2273 25554 19696 -3539 -6712 1543 21740 35455 57392 53657 48822 39964 3253 -15645
1259 -15645 -21008 -5870 11901 21916 7844 23958 15398 -13095 -10238 14872 25016 -1356
1247 -1356 329 -16971 -22763 -21475 -21340 -15363 -4756 2010 -23679 -30034 -15732 -10562 -2653 446
1233 446 -10320 -21663 -12985 -12430 -9114 -25563 -52382 -61113 -52511 -27586 -22452 -33910 -6020 16048
1219 16048 12750 11236 -3945 -9364 -1585 196 -28819 -33202 -15310 4777 -2700 -19128 -9101
1206 -9101 -5884 -20447 -2935 7467 2938 38784 41030 29402 4260 -13728 -25350 -9662 8749
1193 8749 7061 20552 -783 18765 23288 21034 15380 14968 3695 -19526 10254 22415 -6816
1180 -6816 -13855 25636 29929 27772 5781 -8663 -40352 -43234 -19910 -8474 -18843 -25235 -3271
1167 -3271 1050 -9096 14907 23621 27907 31029 32346 26525 36483 27801 4663 9440 19945 37335
1153 37335 28683 -2591 5438 4635 6267 17270 4988 1760 11560 20976 2237 -1243 3063 10460
1139 10460 -18272 -33257 -14792 -28073 -24697 -41408 -61595 -66618 -69069 -64427 -54501 -8338 4910
1126 4910 -7246 -7990 12746 7745 3397 42311 63971 64388 40832 25230 17649 13195 25814 14060
1112 14060 18979 21658 466 -15180 1817 18433 29257 21271 12673 7098 -4217 -9437 -7702
1099 -7702 8084 3020 12814 11226 5437 -29645 -30967 -1346 7778 21074 17431 21624 36415 32137
1085 32137 15774 -3341 1947 18978 23779 36991 32586 17438 6803 7283 -12054 -9778 -4489
1072 -4489 -4337 6900 -4493 4396 2182 -17054 -6698 316 4277 293 -9901 -13973 -559 -10364
1058 -10364 -15170 -22018 -27978 -11030 -2965 -24053 -17845 -2048 15917 21034 25569 13976 2734
1045 2734 10194 17053 12218 -907 -3624 7611 -9652 5918 13617 12897 14986 10265 14999 15388
1031 15388 7656 21983 30560 25777 40012 25546 10501 574 -7510 -10510 -13137 -16123 -18001 5370
1017 5370 4144 5709 6477 5116 4980 -2575 -1194 6361 21801 35858 31122 26048 42226 26370
1003 26370 9228 22086 13961 27897 50826 64381 64512 52663 32150 32514 34279 51517 66948
990 66948 52897 27911 24889 16535 8494 33481 52772 42407 31830 13426 -8094 -10968 -15319
977 -15319 -10270 -3850 24502 26049 1731 16074 36119 36349 15488 -10515 -37068 -33260 -3851
964 -3851 17993 12318 5489 6296 20670 23808 18508 28446 26607 19504 17768 31928 38206 35129 15079
949 15079 16995 4384 4572 8439 9554 12053 24798 14756 8277 21091 12501 41580 24972 2995
935 2995 7677 1873 -8066 -5628 12147 19899 18227 45649 59914 47694 36697 805 -24842
922 -24842 -15908 6146 29163 25388 17373 32511 15793 22504 7339 -2205 13546 22057 19725
909 19725 25710 29833 36225 22758 -693 -9924 -23717 -28875 -31591 -30750 -13122 523 25330 27134
895 27134 20487 28053 33658 18138 10739 8161 25897 34074 18856 15876 23960 26378 35442 48218
881 48218 53306 35436 17779 -1858 -12736 -2011 1394 2127 3252 -11294 -4647 14478 -1353
868 -1353 -14218 1201 7554 8967 17368 23772 34917 21653 -5508 3905 4183 29631 30825 -2882
854 -2882 16013 40660 18617 8755 -9902 -4820 13197 7481 11378 3760 5668 9702 25969 28579
840 28579 40363 36728 16968 30673 39030 35874 10273 -8780 -22410 -35389 -41846 -32817 -38693
827 -38693 -42666 -33239 -26591 -12599 -13400 -3711 -13093 -19927 -28963 -29839 -36766 -31376 -21200 6953 1722
812 1722 -11235 -26349 -31693 -188 1133 99 6629 -2605 9551 -12251 -22454 -22651 -9628 -5837
798 -5837 3590 -460 -7956 8376 33838 31017 22810 14550 38885 61181 66316 51059 27449 30732
784 30732 28388 43457 47084 33683 40986 53191 34681 18569 19078 23795 17381 286 5087 22971
770 22971 23825 41738 49738 28332 16165 20820 41626 36246 13791 10600 -15020 -2782 19288
757 19288 9562 13783 22343 43504 32733 21094 32376 23777 19616 20911 18554 36030 38373 34131
743 34131 26413 34514 16823 10482 13419 9563 14867 21035 19014 29699 2383 -22958 -7232 5293
729 5293 8020 -7960 1531 36070 39705 26445 11242 20241 2583 -13024 2021 27529 16878
716 16878 -2253 25297 52406 62899 58072 65974 43001 -7217 -33158 -26078 -28787 -15434 12346
703 12346 26197 24408 7572 -4291 6166 -6253 -20826 414 17615 -4741 -1482 -4184 -17487
690 -17487 -19596 -15994 -14097 -19817 -30775 -16057 -16001 -2290 22282 2863 17424 15703 17520 19354
676 19354 29542 21800 10664 14547 36546 25868 14206 7185 -15966 -26613 -12486 9997 3510
663 3510 -17777 -35853 -37979 -7404 6207 6003 5878 21681 32106 30695 25074 -1188 -12737 -3181
649 -3181 25697 33994 14507 14214 16021 6536 10602 16211 11098 23114 18739 -10030 -13022 18809
635 18809 24604 21320 9118 -5009 -5208 26498 40007 8576 -19655 13183 -3265 -27408 -8566
622 -8566 1944 1111 -3940 -1668 6675 5669 -16174 -23674 1902 7663 2756 -380 -4948 -6481 -2305
607 -2305 18061 21608 8220 16060 23786 37448 38867 27212 20574 30758 12510 -5282 -9328
594 -9328 -9523 -26460 -25420 -27028 -36858 -24058 11186 4033 -2828 3626 4658 -6335 1114 8026
580 8026 17977 44194 54224 50502 30878 37333 54754 61180 33132 23049 19446 17563 29214
567 29214 41749 33028 5005 4017 10972 -5961 -16219 11092 7849 809 20931 25010 34115 44035
553 44035 32591 19884 37401 43195 48177 30384 -6074 -10788 -6567 4713 13378 31830 32396
540 32396 15401 4960 28451 27375 16616 35222 44833 33982 1862 10595 39334 36446 54629
527 54629 58202 47060 35832 19074 11466 6282 -581 -7842 -18623 -23692 -7209 3255 5770
514 5770 -2951 2816 28428 31899 16771 12268 1201 7611 7544 6934 8062 19870 46683 44300 29803
499 29803 12995 -1410 4775 9329 976 6516 31467 35354 37222 21752 -4145 -1076 7497 -7702
485 -7702 -3617 7371 15887 23191 -3300 170 -5769 -10217 -545 22275 23428 20305 5862 -200
471 -200 14422 23686 26465 22977 21790 23028 28541 27537 -10299 -24300 -9031 -13773 8009 -5433
457 -5433 -4189 -6856 -6945 5878 33714 33813 10527 5664 -4659 -12701 -20113 -23942 -39630 -45739 -34269
442 -34269 -1972 28642 25837 2199 2543 -3316 -15850 -7103 -1024 10635 10240 8145 17341 25842
428 25842 23305 34823 66614 64324 43237 50262 54447 63942 59316 50528 32227 18862 34979
415 34979 39119 23635 23536 31859 23113 6910 12237 17149 604 97 -19946 -12602 -4799 -13131 -6297
400 -6297 22461 -3198 -25427 -12909 4256 12727 -7310 10796 -6384 -27984 -16768 -6710
388 -6710 -11646 -1880 -9135 -24243 -1014 6685 15936 25813 13469 23327 18642 -9376 -25098 -8128
374 -8128 1107 29581 65635 66615 45254 33328 20513 29525 33257 9035 -5209 8798 18691
361 18691 17944 2468 13905 10082 16743 32989 21497 8206 17625 21616 17984 28655 17637
348 17637 13467 -2992 -6217 4412 15005 21150 20902 20524 19785 32727 24546 -1282 -17648 -10383
334 -10383 20615 49565 31661 26863 16344 4431 37576 46827 28090 16793 -149 -15006
322 -15006 7550 16778 -6022 -13574 -968 26890 25559 15702 261 -1368 21916 52781 42324
309 42324 37669 28402 27239 6510 -3712 14706 21865 19097 8941 15395 3623 -9463 -20619
296 -20619 -8660 10608 23556 32696 21158 32404 39632 42366 35297 17231 5134 2950 -3718
283 -3718 264 18734 49122 60686 54893 48928 50775 42926 43312 30655 13143 41 -2941 1145
269 1145 6794 2663 -7323 -11455 -9151 -24601 -19282 -23353 -12131 -5058 -4616 -555 20789 18139 28046
254 28046 10747 6205 -8487 -13652 16996 25662 30757 41002 37495 12280 31338 52231 41519
241 41519 39041 22790 -9269 -12707 4067 13217 2710 13578 14676 10215 20079 21993 9330
228 9330 -3096 21568 17878 17010 20580 13328 2918 9070 3316 7074 6729 -5704 -488 12471
214 12471 20053 28555 19064 -4605 -32539 -26753 -8288 9124 29450 20819 11151 7246 2214 13837
200 13837 24767 36915 33857 13972 18253 19262 8486 5499 3853 -2727 5861 14220 3749 -1620
186 -1620 -13107 -24452 -18400 15289 28021 4750 2525 4378 1697 22666 29164 25112 26887 25496
172 25496 18092 6237 18523 18907 12257 -1949 784 3587 896 7557 11596 15845 23838 28672
158 28672 17351 32652 44100 24053 8087 9512 13148 22869 34843 19968 27243 20590 7087
145 7087 18540 12491 -5056 181 17256 21933 17752 20262 28195 29005 34961 22398 -1110 -2700
131 -2700 4652 16101 27433 31667 16332 25357 23851 22864 22995 22801 24913 42029 41308 31305 31006
116 31006 24267 11553 23630 15933 5280 5755 7247 -2849 11612 37889 26633 -1928 3963
103 3963 18699 23176 14192 12494 8282 -13591 -26696 -23285 -18387 -1773 10589 640 6633 13132
89 13132 7407 732 -1640 -13532 -19917 -18525 -1286 -4749 -79 12508 30864 27423 22397 10474
75 10474 8764 26499 20511 68 2614 14823 3180 6220 21475 22907 33587 39136 24573
62 24573 23287 29778 30245 35034 39583 12586 -153 7048 12398 5230 7612 20183 22887 240
48 240 5739 26677 26836 21609 9660 12761 12687 10375 539 -4452 -3868 4382 6789 13895 16100 19950
32 19950 27333 34455 23995 15887 21190 7620 8093 21100 21003 11928 15647 16513 13349 10115 11527
17 11527 15058 14732 13038 16191 21403 16761 11186 13047 36832 32783 9558 3893 11511 14206 6388
2 6388 13543 23967
0 23967
$$ Imaginary data points
##PAGE= N=2
##DATA TABLE= (X++(I..I)), XYDATA
32767 65405 72585 76583 61865 61006 68746 73972 78924 67659 69560 71274 68081 55168 59809 59653
32753 59653 60172 88047 99912 81707 73768 74339 93576 109033 105686 123674 105968 95780 81986
32740 81986 83797 94440 104233 94233 91970 94985 104761 107458 121798 128817 128877 115949 121003 125334
32726 125334 115423 117874 127454 133446 130999 140808 135858 126949 120332 115228 110511 101241 106242 107362
32712 107362 108853 109434 119175 124363 135461 151470 155450 139927 130547 132912 142068 135101 134944 123328
32698 123328 118782 126333 142360 145241 152223 160764 162836 148492 141828 137790 126098 121546 127269
32685 127269 150778 168620 169778 160427 160353 133572 124847 134089 140942 129891 121608 140746 156684
32672 156684 143743 128076 153019 146096 128308 126754 123530 126124 125894 138148 139701 142436 140587
32659 140587 156626 155049 155413 150884 131686 142941 166438 164720 143256 131550 137494 157650 171259
32646 171259 168693 153670 148188 154846 153909 156355 180663 184719 168904 157906 174791 185395 183925
32633 183925 172501 165132 175084 178245 172707 173481 175759 189868 200811 184501 180232 186995 178399
32620 178399 166950 148424 152440 160941 170297 192269 190371 178386 165741 180047 192301 166166
32608 166166 167323 194574 200268 206972 201828 195129 198646 189602 182406 202350 217440 212336 219611
32595 219611 230661 214861 206183 203666 186467 197251 200910 195683 198596 202969 182874 174484 193601
32582 193601 213160 219262 227608 216480 208918 225166 224287 220197 219303 218118 235309 226646 216854 240750
32568 240750 248155 228490 208024 209651 216459 211151 211753 207600 201855 180086 185314 199596 228760
32555 228760 246463 224746 197183 196980 210065 221575 238704 238573 237387 226291 222292 236842 253763
32542 253763 239944 244314 233857 220816 233172 247544 241877 233351 227920 237217 246947 256670 264078
32529 264078 251183 240913 233376 220439 209821 225514 228224 225324 229691 223679 231540 248674 236106
32516 236106 222964 221628 239896 234169 233629 238151 257991 251850 253600 242786 237231 242631 247237
32503 247237 264356 276952 280282 280932 269481 267065 258820 248604 254191 268134 265281 257574 240275
32490 240275 252793 273863 287786 282244 278378 280703 266404 274971 290323 282739 273013 281502 299006
32477 299006 280884 257491 263328 289121 313142 319478 279187 265345 266947 262462 279835 289009
32465 289009 297613 298255 290295 286933 299923 312284 320726 313533 305764 294825 273011 260507 261094
32452 261094 272493 268147 261665 246552 246358 269889 277257 278247 305897 302882 292391 314238 323951
32439 323951 333879 337201 341710 340575 326789 320992 331532 314462 294013 272134 247508 263511
32427 263511 274825 270713 263484 253238 265310 275115 280854 265006 278357 309445 314488 302850
32415 302850 279706 271150 260565 246583 249356 270181 286158 281190 304060 331936 296031 274608
32403 274608 276275 279935 285039 277135 281504 288617 284936 280199 304243 318345 321161 323660 322542 311842
32389 311842 329500 336358 323819 328360 326484 306651 320607 305154 301785 315713 314983 324889 337023
32376 337023 332982 314838 326489 311860 280029 282720 295732 306985 309647 309222 301888 298041 288348
32363 288348 280760 281712 286056 294029 289825 267313 272238 306964 322823 335211 338454 345887 332007
32350 332007 322270 338945 367730 340845 306825 307367 318728 331774 318119 302286 296134 290032
32338 290032 299015 307263 318857 327967 325744 313639 302342 299882 291635 295455 295727 285561 289651
32325 289651 307038 334193 331166 325425 325716 324219 341580 344126 366329 381769 370469 346974 318569
32312 318569 321756 324351 340643 351163 339417 346612 339800 339190 338141 333115 347087 358697 359506
32299 359506 344419 335378 333022 319583 323312 330394 341273 350966 324047 296312 307035 319735
32287 319735 321653 309801 329234 341914 318643 324083 329061 333276 334542 317337 319960 330662 328597
32274 328597 359483 363510 340315 358759 370446 372964 363314 345986 357655 366519 334279 313643
32262 313643 326091 320040 285283 277970 301097 319847 342186 351127 366890 355579 349071 343856
32250 343856 318702 333107 358794 359473 346068 343339 335165 322909 324169 324213 333667 317858 325490
32237 325490 338185 345523 351400 348741 330063 292786 293270 306820 306406 327748 327070 311007 324740
32224 324740 311608 301678 320408 315244 299777 306862 308179 316022 326130 330268 358220 356460 333886
32211 333886 319554 307067 313327 329557 326314 309831 313801 301717 299352 308587 304210 301831 290968
32198 290968 292029 311545 310696 333711 329936 318127 292111 265390 260365 285644 321412 323544 336793
32185 336793 338081 341982 355032 342425 342447 344373 311159 296454 293737 331252 332498 318205 348306
32172 348306 360041 354010 339744 341181 353260 350010 340147 334687 337761 347428 336221 330254 346888
32159 346888 364852 358631 344339 349162 338093 354716 383668 343628 299383 292627 301095 317513
32147 317513 339694 337992 327147 335816 338296 356592 378663 355760 340401 346143 329385 364469
32135 364469 364743 354206 326742 330857 361392 383942 378544 379743 386590 397572 393308 359873 348380
32122 348380 345711 375705 365017 347664 341512 332102 328153 311181 323229 337059 339216 341066 345885
32109 345885 337588 306850 321740 334395 337247 357389 381049 366537 344316 324537 313536 306774
$$ [...]
##END NTUPLES=NMR SPECTRUM
##END=
