##TITLE=Analysis number 325645
Compound Code km 01560
Book Reference 270043
Project Code adrs fraglib
Chemist Name jom
##JCAMPDX= 6.0         $$ Bruker NMR JCAMP-DX V2.0
##DATA TYPE= NMR SPECTRUM
##DATA CLASS= NTUPLES
##ORIGIN= Bruker BioSpin GmbH
##OWNER= nmr
$$ XWIN-NMR		Version 3.5
$$ Fri Jan  5 15:18:05 2007 GMT Standard Time (UT+0h)  MAYBRIDGE\nmr@NMR_250MHZ
##.OBSERVE FREQUENCY= 250.131544655141
##.OBSERVE NUCLEUS= ^1H
##.ACQUISITION MODE= SIMULTANEOUS (DQD)
##.ACQUISITION SCHEME= undefined
##.AVERAGES= 16
##.DIGITISER RES= 18
##SPECTROMETER/DATA SYSTEM= dpx250
##.PULSE SEQUENCE= zg30
##.SOLVENT NAME= DMSO
##.SHIFT REFERENCE= (INTERNAL, DMSO, 0, 16.522)
##AUDIT TRAIL= $$ (NUMBER, WHEN, WHO, WHERE, WHAT)
$$ ##TITLE= Audit trail, XWIN-NMR		Version 3.5
$$ ##JCAMPDX= 5.01
$$ ##ORIGIN= Bruker BioSpin GmbH
$$ ##OWNER= nmr
$$ C:\u/data/dgb/nmr/ADRS/610/pdata/1/auditp.txt
$$ ##AUDIT TRAIL=  $$ (NUMBER, WHEN, WHO, WHERE, WHAT)
(   1,<2007-01-05 15:17:33.63 +000>,<MAYBRIDGE\nmr>,<NMR_250MHZ>,
      <created by zg, POWCHK disabled, PULCHK disabled
       configuration hash MD5:
       49 4B E0 1D 92 C2 6B 37 9F E6 65 BC 52 41 86 1D
       data hash MD5: 64K
       71 59 79 BD 8D 8A 5C D3 21 6E BB 52 6E F9 A9 FD>)
(   2,<2007-01-05 15:17:48.27 +000>,<MAYBRIDGE\nmr>,<NMR_250MHZ>,
      <Start of raw data processing
       ef LB = 0.3 FT_mod = 6 PKNL = 1 SI = 32K 
       data hash MD5: 32K
       F5 67 F9 30 C9 06 D4 92 8E 72 96 EC 20 25 E3 1F>)
(   3,<2007-01-05 15:17:50.05 +000>,<MAYBRIDGE\nmr>,<NMR_250MHZ>,
      <apk 
       data hash MD5: 32K
       C4 42 F7 D9 19 FA 52 06 09 A3 84 6B FD 81 A5 9A>)
(   4,<2007-01-05 15:17:50.95 +000>,<MAYBRIDGE\nmr>,<NMR_250MHZ>,
      <abs ABSG = 5 
       data hash MD5: 32K
       3E 65 8A F3 3A 9B B3 97 51 C4 0B C0 63 04 55 7E>)
$$ ##END=
$$ 
$$ hash MD5
$$ 3D 49 7B FD C0 56 99 85 B9 DD B2 93 05 3C 0B F4
##$RELAX= 
##$RELAX= 
##$RELAX= 
##$RELAX= 
##$RELAX= 
##$RELAX= 
##$RELAX= 
$$ Bruker specific parameters
$$ --------------------------
##$DU= <C:\u>
##$EXPNO= 610
##$NAME= <ADRS>
##$PROCNO= 1
##$TYPE= <nmr>
##$USER= <dgb>
##$AMP= (0..31)
100 100 100 100 100 100 100 100 100 100 100 100 100 100 100 100 100 100 
100 100 100 100 100 100 100 100 100 100 100 100 100 100 
##$AQSEQ= 0
##$AQ_mod= 3
##$AUNM= <au_zg>
##$AUTOPOS= <2 >
##$BF1= 250.13
##$BF2= 250.13
##$BF3= 250.13
##$BF4= 250.13
##$BF5= 500.13
##$BF6= 500.13
##$BF7= 500.13
##$BF8= 500.13
##$BYTORDA= 1
##$CFDGTYP= 0
##$CFRGTYP= 5
##$CHEMSTR= <none>
##$CNST= (0..31)
1 1 145 1 1 1 1 1 1 1 1 1 1 1 1 1 1 1 1 1 1 1 1 1 1 1 1 1 1 1 1 1 
##$CPDPRG= <>
##$CPDPRG1= <>
##$CPDPRG2= <>
##$CPDPRG3= <>
##$CPDPRG4= <mlev>
##$CPDPRG5= <mlev>
##$CPDPRG6= <mlev>
##$CPDPRG7= <mlev>
##$CPDPRG8= <mlev>
##$CPDPRGB= <>
##$CPDPRGT= <>
##$D= (0..31)
0 1 0 0 0 0 0 0 0 0.06 0 0 0 0 0 0 0.0002 0 0 0 0 0 0 0 0 0 0 0 0 0 0 
0 
##$DATE= 1168010252
##$DBL= (0..7)
120 120 120 120 120 120 120 120 
##$DBP= (0..7)
150 150 150 150 150 150 150 150 
##$DBP07= 0
##$DBPNAM0= <>
##$DBPNAM1= <>
$$ [...]
##$SUBNAM7= <"">
##$SUBNAM8= <"">
##$SUBNAM9= <"">
##$SW= 20.6930455092707
##$SWIBOX= (0..15)
0 0 3 0 0 0 0 0 0 0 0 0 0 0 0 0 
##$SW_h= 5175.983436853
##$TD= 65536
##$TD0= 1
##$TE= 294.16
##$TE2= 300
##$TE3= 300
##$TEG= 300
##$TL= (0..7)
0 120 120 120 120 120 120 120 
##$TP= (0..7)
150 150 150 150 150 150 150 150 
##$TP07= 0
##$TPNAME0= <>
##$TPNAME1= <>
##$TPNAME2= <>
##$TPNAME3= <>
##$TPNAME4= <>
##$TPNAME5= <>
##$TPNAME6= <>
##$TPNAME7= <>
##$TPOAL= (0..7)
0.5 0.5 0.5 0.5 0.5 0.5 0.5 0.5 
##$TPOFFS= (0..7)
0 0 0 0 0 0 0 0 
##$TUNHIN= 0
##$TUNHOUT= 0
##$TUNXOUT= 0
##$USERA1= <user>
##$USERA2= <user>
##$USERA3= <user>
##$USERA4= <user>
##$USERA5= <user>
##$V9= 5
##$VALIST= <valist>
##$VCLIST= <CCCCCCCCCCCCCCC>
##$VD= 0
##$VDLIST= <DDDDDDDDDDDDDDD>
##$VPLIST= <PPPPPPPPPPPPPPP>
##$VTLIST= <TTTTTTTTTTTTTTT>
##$WBST= 1024
##$WBSW= 4
##$XGAIN= (0..3)
0 0 0 0 
##$XL= 0
##$YL= 0
##$YMAX_a= 307034
##$YMIN_a= -280592
##$ZGOPTNS= <>
##$ZL1= 120
##$ZL2= 120
##$ZL3= 120
##$ZL4= 120
##$ABSF1= 16.522
##$ABSF2= -4.171173
##$ABSG= 5
##$ABSL= 3
##$ALPHA= 0
##$AQORDER= 0
##$ASSFAC= 0
##$ASSFACI= 0
##$ASSFACX= 0
##$ASSWID= 0
##$AUNMP= <proc_1d>
##$AZFE= 0.1
##$AZFW= 0.1
##$BCFW= 0
##$BC_mod= 0
##$BYTORDP= 0
##$COROFFS= 0
##$CY= 12.5
##$DATMOD= 1
##$DC= 0
##$DFILT= <>
##$DTYPP= 0
##$F1P= 14.0000005364418
##$F2P= -0.99999901652339
##$FCOR= 0.5
##$FTSIZE= 32768
##$FT_mod= 6
##$GAMMA= 0
##$GB= 0
##$INTBC= 1
##$INTSCL= 1
##$ISEN= 128
##$LB= 0.3
##$LEV0= 0
##$LPBIN= 0
##$MAXI= 10000
##$MC2= 0
##$MEAN= 0
##$ME_mod= 0
##$MI= 0
##$NCOEF= 0
##$NC_proc= -3
##$NLEV= 6
##$NOISF1= 0
##$NOISF2= 0
##$NSP= 0
##$NTH_PI= 0
##$NZP= 0
##$OFFSET= 16.522
##$PC= 1
##$PHC0= 210.3567
##$PHC1= 10.48539
##$PH_mod= 1
##$PKNL= yes
##$PPARMOD= 0
##$PSCAL= 4
##$PSIGN= 0
##$REVERSE= no
##$SF= 250.13
##$SI= 32768
##$SIGF1= 0
##$SIGF2= 0
##$SINO= 400
##$SIOLD= 32768
##$SREGLST= <1H.DMSO>
##$SSB= 0
##$STSI= 32768
##$STSR= 0
##$SW_p= 5175.98343685301
##$SYMM= 0
##$S_DEV= 0
##$TDeff= 65536
##$TDoff= 0
##$TI= <Analysis number 999999
Compound Code 99
Book Reference 9
Project Code 9>
##$TILT= no
##$TM1= 0
##$TM2= 0
##$TOPLEV= 0
##$USERP1= <user>
##$USERP2= <user>
##$USERP3= <user>
##$USERP4= <user>
##$USERP5= <user>
##$WDW= 1
##$XDIM= 32768
##$YMAX_p= 330656045
##$YMIN_p= -126988
$$ End of Bruker specific parameters
$$ ---------------------------------
##NTUPLES= NMR SPECTRUM
##VAR_NAME=  FREQUENCY,     SPECTRUM/REAL,   SPECTRUM/IMAG
##SYMBOL=    X,             R,               I
##VAR_TYPE=  INDEPENDENT,   DEPENDENT,       DEPENDENT
##VAR_FORM=  AFFN,          ASDF,            ASDF
##VAR_DIM=   32768,         32768,           32768
##UNITS=     HZ,            ARBITRARY UNITS, ARBITRARY UNITS
##FACTOR=    0.157963299565203, 1,           1
##FIRST=     4132.6476996994, 0,             0
##LAST=      -1043.33573715361, 0,           0
##MIN=       -1043.33573715361, -126988,     0
##MAX=       4132.6476996994, 330656045,     0
$$ Real data points
##PAGE= N=1
##DATA TABLE= (X++(R..R)), XYDATA
$$ [...]
20933 11749 -10675 -13044 -27825 -1102 32922 46400 64491 65450 31229 5742 2905 34910
20921 34910 66103 56503 48622 57257 39608 22907 19658 19573 23050 18604 -9095 -15470 -8077 -19151
20907 -19151 -24108 -8833 39181 10455 -28609 -62494 -91384 -94218 -84312 -58887 -34255 12868
20895 12868 37423 25034 32730 21947 10002 -7919 -6570 -233 39059 49797 52401 70158
20883 70158 44214 26196 38563 22999 6232 19132 574 7258 21359 21768 19838 21736 43330
20870 43330 23617 40027 54560 49095 52638 18711 -14584 -22001 -19581 -24213 -23858 -6122 11818
20857 11818 30721 25875 20161 13088 7641 9517 27363 29437 21167 27276 45517 65550 69670
20844 69670 29837 -6875 -3141 -998 -1154 -16437 -28360 -29331 -48051 -41358 -42161 -28708 -12847
20831 -12847 758 -15428 -22282 -27050 -4171 -5197 45942 61749 50814 50977 58152 64649 28583
20818 28583 -13503 -12489 -11924 14810 61070 35251 23046 27658 44795 43885 27931 22856 13521
20805 13521 15396 56723 82994 85424 82820 90694 59968 47521 66858 50909 25757 51332
20793 51332 44969 25261 37771 43183 40273 18781 23179 35378 21521 1645 6797 -3756 614
20780 614 12650 26434 -2821 -25531 -25264 -19994 -23097 -36905 -21126 33974 74676 69529 79363
20767 79363 90779 67282 67750 64314 57197 40655 24353 19987 20230 28274 5693 -6679 9918
20754 9918 25455 38040 56509 36306 21167 20097 30851 41399 22293 41467 42202 17650
20742 17650 15259 11882 -6252 -14685 -541 14503 6771 47699 62539 22847 18052 29493 31714
20729 31714 66470 95038 132386 121078 65870 41079 50041 32103 40458 36296 42684 36854 32366
20716 32366 34242 42413 33733 52615 62945 40640 19701 5505 36139 56938 41621 63777
20704 63777 56466 82270 86386 61586 37698 31211 36409 61372 54046 25662 39233 43477 49069
20691 49069 27087 21748 25848 10207 35914 77079 73205 64701 50737 65517 70173 72700 58428
20678 58428 57116 63371 39456 -2168 -27564 -53652 -53582 -49658 -25412 29 13015 35718 42854
20665 42854 42231 40712 53346 63169 37836 36592 34115 41499 66359 89792 88914 60374 50801 57581
20651 57581 23085 7866 17650 35871 37035 34922 47129 27909 40884 41384 6022 26894 41112
20638 41112 10778 -4771 24654 61528 98695 73038 59843 82217 96772 83291 67167 91967
20626 91967 112625 117725 87316 71869 64125 48900 101820 126866 93756 82427 85780 85831 84297
20613 84297 78308 74448 72666 84085 107541 146669 149480 161981 167004 192986 184627 167848 185255
20600 185255 221646 262990 319180 410893 521973 649876 764217 815681 808601 791463 714065
20589 714065 619523 581158 583575 604197 640811 661776 666867 623085 631705 648162 700112 710162
20577 710162 741181 825873 958771 1128663 1332867 1505442 1611533 1674121 1739922 1830592
20567 1830592 2003232 2229383 2439313 2616717 2770900 2969555 3276353 3720588 4406821
20558 4406821 5403445 6829631 8974657 12283266 17391047 25534300 38137783 56092328
20550 56092328 77940126 97438085 107562752 104991962 90736229 69624010 49127070
20543 49127070 33718939 23477821 16983698 12774143 9963462 8054435 6698761 5675418
20535 5675418 4941561 4386730 3921649 3507817 3140725 2795405 2463115 2158839 1967192
20526 1967192 1851088 1817297 1799730 1755967 1619420 1435435 1252627 1069517 932901 857760
20516 857760 788718 713581 679400 653818 685132 666513 634558 637590 641197 662492 675879 726060
20504 726060 787610 836390 830900 745378 628725 517316 412126 352240 314836 268628 225563
20493 225563 216739 221615 181822 162601 152667 140863 159240 187763 181222 174735 178438 162421 122060
20480 122060 100643 78255 93141 96170 95783 73235 69872 66659 77044 101512 110821 68080 26734
20467 26734 44377 75596 85276 75907 55735 64828 62206 52559 89367 105780 74858 60304 70879
20454 70879 50882 29631 47115 32528 29119 28537 28026 60103 82018 83082 66884 90862 88950
20441 88950 78779 54354 35014 32448 22822 21036 8244 20156 33113 56267 86458 112978
20429 112978 98438 111717 118452 110688 121953 153406 188200 215599 221461 196672 159830 145417
20417 145417 101709 45482 19929 32620 29552 12700 35925 22192 -5567 -6813 14342 20879
20405 20879 26065 24519 42357 58110 43830 14553 18241 6444 2146 9215 17363 8006 10693
20392 10693 4669 5214 513 -156 13365 8146 3990 -23811 -17517 7601 350 -27270 8555 23084
20378 23084 11982 -17825 -17244 30318 14224 -11641 -9825 -11047 -7269 -35656 -36038 -25019 -44474
20365 -44474 -42066 -11132 26886 44806 50092 63435 48297 7062 -15680 -17543 -43612 -17021
20353 -17021 -14344 -20059 -39070 -39246 -41436 -21300 4714 -10615 -38609 -23635 21329 29217 29010
20340 29010 21001 -1735 -8572 -437 2320 -6919 6184 11987 -10011 -27922 -56053 -27555 335
20327 335 -15371 -29683 -23388 -6524 -20647 -16011 9236 -4190 -27613 -42637 -27851 -29293 -15744
20314 -15744 -13951 -6986 -44645 -41694 -14383 14599 13474 -6743 15448 -2009 1832 19568 3626
20301 3626 -23065 -52040 -41966 -8008 46848 85723 47040 39059 9217 -16933 -23157 -9661
20289 -9661 -37625 -44737 -35823 -28575 -43742 -40446 -38809 -47213 -18842 22330 29758 24114 11993
20276 11993 202 188 -16570 -23884 -20965 -10420 -36007 -32055 -19066 10172 -179 -35455 -21356
20263 -21356 -4135 11231 14847 -24631 -23664 -27249 -9950 -26118 -25555 -31638 -14037 3134 -1717
20250 -1717 -22113 -19477 -36772 -32062 -19487 6786 15800 -13235 -36677 -6410 9740 -30618
20238 -30618 -39860 -10857 17798 16343 17282 4802 -3539 7519 5603 -37562 -29857 -31084 15891
20225 15891 19894 11649 26949 8884 19043 22668 6445 3359 -24141 -30765 -32325 -24090 -17802
20212 -17802 6313 24399 -19087 -35376 -21753 -14909 -11511 -7306 -9222 -967 -4495 -17270 18290
20199 18290 21577 9372 12886 8149 16755 46363 54098 31277 31188 40730 4613 -29550 -56590
20186 -56590 -48794 -8329 -3232 2296 6282 371 -5046 -4666 -19130 -47435 -64911 -43533 -15516
20173 -15516 -11960 -16457 -13302 13708 31954 760 -36703 -41254 -42183 -28737 -4413 -3839 -5819
20160 -5819 7527 6321 22770 21580 -962 -7213 -10944 -25262 753 -7969 -44098 -44036 -21314
20147 -21314 -17717 14459 -669 -10070 299 36768 19792 2669 -24795 -56535 -55884 -29286
20135 -29286 -28455 1278 16068 -3376 -40498 -43451 -41697 -11118 -4329 -1608 14027 -17602 -13172
20122 -13172 -8095 -5409 -25155 -19971 15457 9923 -20231 -20930 -14318 5433 -10211 -3493 21641
20109 21641 22460 33043 36862 12129 -16973 -36161 -42173 -57809 -38256 2295 36770 18538
20097 18538 -8882 4997 26586 31440 -2654 -6119 21622 42066 21624 11642 23197 66666
20085 66666 86200 54429 46747 69800 42020 507 -17838 -31050 -7939 -2325 -2599 -34925
20073 -34925 -63889 -48287 -42805 -40307 -43217 -17057 -25944 -35500 -55767 -56660 -54555 -25600 -22039
20060 -22039 -9735 -15059 -15690 377 9671 9369 -2828 13325 44122 43430 3709 -11952 -2053
20047 -2053 -7400 -19595 -10518 -38491 -33165 -23744 -24676 -22453 -41883 -46004 -31941 -35868 -31964 -40763
20033 -40763 -62527 -53353 -16053 5677 11235 19029 7954 -29824 -35458 -28615 -3031 -15946 -17411
20020 -17411 -30416 -35113 -33196 -26174 -16442 -57494 -43018 9489 11153 4399 9834 6513 -26919
20007 -26919 -48224 -6449 35550 22829 -13204 -12099 34393 59752 65904 48932 29361 11704
19995 11704 -15846 -16619 -25020 -2028 17364 15332 27723 6275 -33655 -14780 -37444 -64744
19983 -64744 -61785 -68722 -54316 -33913 -21363 -32710 1119 1157 -9034 -4871 -15596 -22106 -43948
19970 -43948 -36404 -38273 -30853 -13140 34009 52364 34330 35969 64364 90019 125542 184647
19958 184647 240456 289893 360146 427794 428617 405846 350130 302734 248064 201020 139250 126397
19946 126397 87163 62230 68887 61231 61703 79584 96127 84763 78507 81110 62858 50513 47021
19933 47021 38485 11712 21115 38821 49519 7674 -23091 10120 30681 11242 -19934 -45395
19921 -45395 -72413 -56098 -37040 -44458 -34139 -34492 -36122 -34945 -12835 8223 -9804 5403 -6740
19908 -6740 18215 49578 32124 15398 33377 13598 10405 -7904 -11909 -17354 -26309 -25981 -37475
19895 -37475 -28596 -45005 -56695 -52662 -42698 -10336 -13592 -15673 -21927 -23746 -34546 -18218 6947
19882 6947 5377 -4834 -561 5300 23526 14973 16007 8157 11687 15006 19159 -1570 -5327 2118
19868 2118 303 -2581 -33529 -24921 -19665 -7592 -11187 -32892 -39767 -33679 -39261 -30380 -17707 6143
19854 6143 13129 21710 33743 33085 -4711 -8681 -16110 -11297 4044 8188 5123 2380 -4646 -7893
19840 -7893 -4842 -14098 -19544 4098 26141 37013 37252 23391 8669 3739 2873 -291 -3921 -23818
19826 -23818 -47105 -49229 -44870 -58855 -65751 -49132 -31936 -1062 -4804 -15169 2180 -3062 -17200
19813 -17200 -866 11354 -11924 -44013 -31532 -12636 25630 37903 35987 20650 -12537 -20352
19801 -20352 -12858 -3822 -5469 13985 67971 44244 -3340 -9040 -20158 -12765 1219 5527 8126
19788 8126 -22650 -9406 7698 -27354 -35780 -26428 9117 14735 23556 29365 45203 51189 27722
19775 27722 20039 -245 -36159 -40757 -27981 -22645 -37887 -26626 5322 3610 -15599 -30546
19763 -30546 -10188 7207 -12645 -49888 -41159 -20370 -1035 -10774 -7785 14990 9801 -1778
19751 -1778 -1465 -16126 -12353 13455 29942 27963 25284 23852 15293 2686 -11917 -30067 -51226
19738 -51226 -39053 -43831 -47110 -41483 -45120 -55203 -44717 -38268 -25309 -37283 -35363 2982 17430
19725 17430 9454 21959 27422 40709 16711 -10395 -25679 -24109 -16622 1442 27287 2475
19713 2475 -25249 -29002 -31685 101 1562 -9 -15549 -18793 -17837 4074 -17336 -56293 -55212
19700 -55212 -7544 20903 42556 34389 6702 -3359 -10880 -19147 -17104 -9802 -40098 -23286 36125
19687 36125 34772 22870 24832 20569 -3378 -4562 -10258 -37291 -68270 -81413 -89835 -66838 -36130
19674 -36130 -48735 -72351 -65439 -38127 -48276 -69224 -46585 -12642 452 21283 21181 2739
19662 2739 -12216 -11583 -18692 17590 34964 22129 12450 -12748 -15271 -7798 -3989 3579 -10557
19649 -10557 -2321 14364 -3387 -824 13625 -5062 -8839 11878 -219 10517 -1464 1295
19637 1295 44815 61347 47406 38532 5538 -33842 -16990 -265 -7210 -30970 -92462 -70249
19625 -70249 -38085 -12108 -11829 7083 15044 -26467 -70039 -69422 -80869 -87852 -81139 -71518 -70254
19612 -70254 -59621 -19262 10645 -4091 -15776 -15214 7651 26311 38580 51480 29790 31964
19600 31964 42834 22204 12898 23262 53014 43348 31950 14878 33422 41851 40475 21867
19588 21867 18595 37944 29575 2774 -18531 -34958 -8807 -33139 -49959 -26777 -4575 11930
19576 11930 32436 868 11658 9578 -2401 -3914 19638 10974 12640 -9441 -20924 -20290 -3954
19563 -3954 16884 49983 67440 58851 67831 65998 47617 49129 52501 36531 24059 -2739 3060
19550 3060 8950 2839 1636 6769 7705 11569 29808 12977 -14381 -46619 -46904 -40518 -23115 -7526
19536 -7526 -12090 -8603 -16960 -21707 -24253 -39474 -21670 -16029 -21879 -25986 -43674 -33631 -44835
19523 -44835 -26612 -10885 11051 18654 30686 10778 2636 13378 27575 15144 -16361 -16699
19511 -16699 -5890 16505 40533 38802 28737 -6417 -6356 14206 33934 50497 28684 -7471
19499 -7471 -37429 -62841 -58785 -59918 -76645 -60445 -13384 4861 -16536 -6694 9801 -19156
19487 -19156 -32795 -6617 13156 -6070 -7608 -14195 -39842 -28851 15899 5678 -11413 -6646
19475 -6646 5157 -4537 -23286 -43499 -39858 -34538 -15277 -9672 2366 -33880 -52817 -34704 -19215
19462 -19215 -20014 -28389 -14366 -13346 -48691 -60645 -22741 7675 33857 8860 -11160 -30123
19450 -30123 -33849 -47458 -61885 -50657 -38107 -13422 -16754 -24380 -587 6009 13448 13755 26937
19437 26937 31408 6982 7282 -4828 -2281 -22472 -27630 -39871 -47449 -30125 -24046 -50575 -71362
19424 -71362 -86179 -76901 -51301 -45539 -25305 -27962 -35029 -19058 2839 24651 36548 14021
19412 14021 12012 14113 12883 22495 18833 18776 -3551 -10574 25054 25317 3233 -2983 4560 10438
19398 10438 8687 -4969 -13772 -22916 -32255 -12143 -34347 -39241 -31232 -16949 528 -3861 307
19385 307 -23076 -21730 -19319 -19656 -38575 -34597 -50964 -41004 -16492 -1165 27465 6510 -19719
19372 -19719 -17636 -45386 -69966 -82181 -47652 -7084 -533 -11004 8716 3162 -34534 -44331
19360 -44331 -36029 -73388 -58176 -50661 -61067 -38943 -26649 8743 28710 26789 4546 4767 -18408
19347 -18408 -21567 -14702 -4936 -13315 3985 9832 21540 13641 -10474 -9231 -5034 13600 23126
19334 23126 34139 12399 -11268 -1057 4842 -3761 12489 28791 46682 55584 51223 45155 5699
19321 5699 -25010 -34817 -31404 -22962 -18672 -14586 1530 -1051 4999 21975 9959 18019 54235
19308 54235 4467 4572 19536 2095 -4680 16895 22206 -1373 -2875 -1134 -26299 -50402 -31102
19295 -31102 3272 -640 -14125 -16148 -25280 -22080 -9843 11269 -14275 -16090 -22318 -29896 -51665
19282 -51665 -72268 -34050 -28719 -19575 -3530 -7391 15893 40733 31526 19441 -6720 -12665 -23327
19269 -23327 -20504 -5189 -20511 -1748 22471 19929 13539 -2718 -3894 1188 17051 20204 35550
19256 35550 35362 8389 -3480 -22029 -22543 -42874 -54019 -48981 -26159 -25426 -11323 -6062 -8598
19243 -8598 -4267 -14058 2827 21352 24999 -1782 -9913 -15590 -5543 -19035 -36839 -54363 -39190
19230 -39190 -22732 -12488 -9205 -3555 13144 15626 1608 3091 11699 18746 14086 5826 -21907
19217 -21907 -23111 -55275 -61623 -35093 -40814 -31409 -35015 -14404 -36584 -44694 -23166 -23536 8650
19204 8650 16368 31792 25423 11535 -631 -18291 10524 20137 22668 5480 -39005 -51956 -12745
19191 -12745 -22181 -31374 -13714 -8192 16216 28549 -16393 -23295 -26345 -52482 -60057 -42719 -30648
19178 -30648 -17037 -22264 -47983 -33079 -17673 -3661 8845 35448 56232 39797 26227 29772
19166 29772 28479 22777 -16709 -34872 -3422 22351 8943 636 2951 21467 19927 -9323 363
19153 363 735 -26609 -39604 -39353 -51302 -60281 -20263 -15491 -4454 -3531 -1560 32155 35745 5562
19139 5562 7141 14048 21612 19570 16564 15247 -2191 -21489 868 5431 -1589 9798 32122
19126 32122 15744 -6655 -18229 -22821 -32298 -27232 -84 -14298 -22815 -32124 -33842 15091 36437
19113 36437 53895 42442 21084 16550 -6542 -38904 -23783 -18786 -11912 19706 38735 36953
19101 36953 6535 -9950 -19699 -19771 -13318 3060 4113 5905 8898 2401 8474 22871 36151 48727
19087 48727 33308 -9441 -35637 -27517 -21709 -6062 678 21656 33345 12684 -8947 -19741
19075 -19741 -33284 353 -769 -4411 13026 1363 6621 -11542 -26498 -30634 -48856 -51691 -36574
19062 -36574 -3281 -136 -14678 -20731 -13201 21777 30392 5737 4732 46871 47929 22966 -15462
19049 -15462 -19257 -10896 -3045 27600 41738 25938 8454 39121 43890 21990 17546 25456 36621
19036 36621 47440 55790 43846 24668 21433 13170 12640 13900 -30055 -68318 -70757 -32204 -18162
19023 -18162 -18481 -26803 -19604 -32428 -48363 2139 6314 663 -22694 -22808 -13453 12861 21096 28218
19009 28218 46564 49982 37375 12452 -26046 -47520 -32100 -20534 -27790 -26858 -27110 -25527 -13991
18996 -13991 -1746 -6628 -3660 10285 32185 36319 26601 -5123 -5341 10274 6952 23365 25169
18983 25169 6548 17987 -22772 -48034 -14315 -12996 -36025 -30771 -28577 -16452 -9540 -132 -9783
18970 -9783 -7486 -18507 -40114 -21775 -6842 -18685 -25054 9692 12816 19168 5028 1336 17722
18957 17722 32417 49091 64578 79087 75295 75935 61828 14004 -30447 -45525 -59925 -51989
18945 -51989 -26594 2468 -13715 -20750 -64082 -62547 -18351 -7637 -22346 -23995 -21038 8109
18933 8109 12745 -20574 -15268 -21796 -22055 -17067 -11336 2536 28477 32469 1782 -4260 8913 24514
18919 24514 53848 62663 65336 47663 20723 28976 11398 7730 670 -4336 -3020 -10374 -3849
18906 -3849 -14831 -3383 28239 36525 39391 48620 41486 3429 -21687 -18074 -3340 -8851 -2657
18893 -2657 -5288 -16406 -27133 -28652 -27199 -15973 -38300 -55724 -15025 -2526 -39522 -57887
18881 -57887 -52912 -25603 -21637 -26675 -25912 -39179 -37095 -7656 -2309 -41216 -45105 -46424 -51215 -35811
18867 -35811 -20764 2389 26831 16748 249 2648 -357 -6169 -33002 -35644 -20244 -12170 -18250
18854 -18250 4596 18494 18702 28147 20876 23751 19987 14224 9001 -8508 -29365 -31106 -26695 -23754
18840 -23754 -8434 -5525 -15355 -18667 -25401 -63969 -46770 -12348 -3488 3852 8002 2726 4679
18827 4679 -29028 -48591 -18363 -11326 -24177 -38801 -26932 -28458 -48641 -22705 -1442 -640 6834
18814 6834 -11641 -7830 22133 44289 48997 62905 26456 19177 21511 15246 -5015 11183 29663
18801 29663 36722 66108 54982 22779 -4636 -1740 1556 -17890 -9050 12803 14827 -3328 -450
18788 -450 34853 40063 13863 -12378 -28704 -21970 -4472 5794 17308 28961 20490 12967 2602
18775 2602 -9335 -2757 -18472 -15450 -22692 -52116 -45716 -23153 -13376 -7097 12405 29751 23671
18762 23671 27566 32094 39019 3 -25287 -20946 -13657 -1045 829 761 4352 6826 -3568 -13399
18748 -13399 -38418 -28355 -19863 -6900 4195 1793 -24317 -36479 -23971 -21085 -18657 -8708 -15158
18735 -15158 -15066 -42024 -45603 -32851 -28904 -16832 1534 6212 6556 -2363 -6265 -20103 -18617 -16721
18721 -16721 -18270 4011 -14830 -12629 6158 6661 -7684 14249 19559 -13286 -5507 -3845 -20508
18708 -20508 -19245 -9333 4677 -5181 -4510 -10778 -21771 9387 38292 45836 41302 32485 -4050
18695 -4050 -6437 -46036 -53492 -42915 -12065 -3504 -26060 -19188 -43376 -66292 -26077 -13694 -15014
18682 -15014 -17583 -10254 -10375 -4252 -1202 -3884 -4288 9298 -13615 -22835 -26062 -27940 -37342 -18317
18668 -18317 -871 -17159 -12797 -10189 -16590 -41192 -51526 -46840 -40179 -58642 -40045 -23550 -14855
18655 -14855 -13729 -28894 -13712 -22325 -32551 -2125 35792 17868 27139 23790 19901 33906 53356
18642 53356 1761 -17822 -1725 -11233 -24710 -18289 -21473 -42819 -32112 -11073 3389 -21100
18630 -21100 -53900 -38327 -4690 -7388 -19663 -3220 4263 19371 12068 -8110 -30657 -35262
18618 -35262 -1756 34182 33209 3215 -2192 15816 9826 5601 -34884 -62386 -62272 -33311 -9236
18605 -9236 8855 10322 -985 -8182 8361 18704 8044 11885 13170 4386 545 12286 -2805
18592 -2805 -6632 -2985 7201 5737 -10880 -25506 -14017 2851 -19871 4181 25382 17797 12370
18579 12370 -26071 -11563 22250 6693 -17010 -52789 -44966 -48351 -35257 -4262 -24760 -1235
18567 -1235 2612 -29104 -42957 -33763 -10364 -10086 -18148 -19663 -3190 11720 30676 57010 18450
18554 18450 -23729 -33821 -46603 -26248 2207 13429 17379 -3438 13111 15874 6797 13013
18542 13013 9891 -1546 20633 34521 20741 15641 -4044 145 29373 34300 32510 -6890 -13310
18529 -13310 -13466 -17201 -20956 -19631 -21655 -9562 12267 -19487 -56031 -48544 -29429 -14245 -18686
18516 -18686 -19771 -7841 1553 9482 3926 -11467 -34826 -29729 12363 13153 24205 15310 -29861
18503 -29861 -63829 -55578 -44174 -25995 3779 -6139 -36325 -16566 43611 37791 17966 15806
18491 15806 14699 -2085 -13142 -34499 -12913 25361 -13912 -36241 -49680 -52487 -50142 -33396
18479 -33396 -4655 15093 -12782 -44810 -30287 -8099 27127 29461 -6647 2094 33431 30452
18467 30452 4182 1641 11171 -13045 -2650 -147 5016 -8267 -19754 -22725 -31267 -18491 21188
18454 21188 33819 41774 -303 4068 28304 6246 -20407 -34016 -32461 -20802 18845 26441
18442 26441 -10773 -33429 -28812 -6876 11331 27722 22243 4167 -21501 -19488 -34736 -35785
18430 -35785 -33877 -33416 -38283 -51191 -43678 -13741 5834 1819 -3535 4830 -5908 10143 -5440
18417 -5440 -13249 -9340 -3894 -24590 -38482 -30202 -109 1078 8219 -7814 -14056 7454 37580
18404 37580 41453 39872 39016 34337 23181 20699 -7246 -21011 -33604 -51979 -36529 -18128 -7711
18391 -7711 -13100 -23795 -5218 41552 60144 25690 21531 24842 53183 54850 34860 -185 15971
18378 15971 17083 10813 -5864 -8105 -8693 13041 28046 23906 41060 44616 8197 -31276 -17398
18365 -17398 13057 31707 14994 33492 45024 20149 9130 -11177 -35362 -27584 3728 -14651
18353 -14651 -24402 -16157 8952 -26508 -36761 -28606 -10840 6569 11198 -13404 -35417 -71808
18341 -71808 -95595 -68015 -26441 -40239 -62431 -60194 -47602 -5857 -1305 -2520 -11212 3773
18329 3773 17828 5354 -9629 8537 12165 -10613 12780 26421 -6545 -508 -3962 -19995
18317 -19995 -29417 -54691 -46972 -32935 -10887 9170 397 -8351 -3256 2535 21765 28475 -1298
18304 -1298 -1898 8588 26793 60673 21651 -10163 -19493 -2864 11764 12974 -10242 14026 4797
18291 4797 25711 30109 22786 13692 20272 274 -10981 -14677 -15187 -20150 -5239 10804 -1969
18278 -1969 -20412 -10725 17849 13276 16969 11313 7603 5682 -8560 -23845 -50857 -63753 -65238
18265 -65238 -33263 7387 5443 -18135 -18755 -15897 -24320 -12645 -12678 -45356 -56992 -43699 -56149
18252 -56149 -53128 -19798 -1572 -11332 220 -3164 -25321 -32542 -15847 3779 12952 5929 -10319
18239 -10319 -1862 13893 10015 8678 3250 11343 17899 27683 -8225 -28495 -33905 -55134 -30612
18226 -30612 -38575 -40273 -11100 33308 50919 38959 14365 13748 8141 8880 -4043 18104 -817
18213 -817 -52587 -67525 -13564 27026 18686 -4212 -29758 -59722 -75701 -48312 -13823 -4256
18201 -4256 907 3573 -2272 8470 8016 5186 1630 25759 43860 10943 -20789 1223 19074
18188 19074 16200 12492 24348 28556 257 -18217 2116 -3214 4078 -6094 -10052 -25902 -14928
18175 -14928 -6293 -11010 -21088 -25482 -16015 744 11164 8898 -508 -7797 21732 33747 33241
18162 33241 42713 38296 33937 24730 14519 2177 8631 29520 9186 1208 -6351 -30489 -5028
18149 -5028 -19613 -5348 17944 27165 5973 -19919 -39520 -22923 -5424 -7017 -29306 -26583
18137 -26583 -7948 24532 32057 -2422 -19115 -14491 -475 4252 18249 37790 38210 17778 21380
18124 21380 -3067 -22663 -13874 4782 9460 467 20473 49317 19323 -2652 4727 412 -9221
18111 -9221 -30840 -41714 -19408 -1367 2038 15327 14712 34631 26634 4708 -25275 -18178 6731
18098 6731 6429 -11105 -31223 -4870 -3820 7735 29090 608 -24370 -23149 -21807 -38995 -62499
18085 -62499 -62991 -32965 3205 26862 29062 -466 -28930 -978 17915 7684 -10169 -22103
18073 -22103 -21412 -15355 -34748 -25085 -20097 -10724 -34864 -36051 -16756 8763 53059 76485 68854
18060 68854 77876 48164 29278 36689 22668 16104 11866 -16961 -25543 -42784 -16955 -9295 1823
18047 1823 -11201 2605 40246 30639 28957 34792 16174 17595 2616 -2700 29232 51187 34941
18034 34941 22446 128 -9317 2620 -796 23828 17229 25347 27050 41985 65316 42938 12432
18021 12432 -20068 -11689 -21593 -42687 -65291 -67463 -47307 -25518 -7860 -7374 -9845 -11353 22684
18008 22684 33250 19428 27332 22808 -20768 -44262 -38665 -28761 -14561 -5436 -8861 -22741 -12081
17995 -12081 6331 8900 -36323 -20740 -9229 -4401 -31417 -18162 4506 -20198 -39402 -17336
17983 -17336 -22118 -35534 -48679 -39925 -34553 -18100 -2210 -9107 -7046 -29056 -45065 -55986 -33320
17970 -33320 -5814 7581 -10046 -10913 -13396 -15331 -5465 -5866 -20401 -25728 -34718 -19907 -26241 -33608
17956 -33608 -6861 5323 -16670 -2809 15001 33727 41925 49864 29849 13901 17795 -15285
17944 -15285 -37562 -27943 -31658 -43325 -34181 -32805 -30439 -15502 5804 16867 -1399 -1702 -14729
17931 -14729 -37776 -27042 4244 10624 5013 -12222 -17466 -42749 -49163 -32171 -47811 -47590 -12883
17918 -12883 -7752 2403 -25721 -71192 -60927 -51943 -39167 -36738 -40585 -28782 -12259 4774
17906 4774 -2990 -38708 -44494 -32881 -33161 -37723 -31303 -18722 32557 32725 -8718 -44057 -72844
17893 -72844 -78557 -60477 -44332 -27371 9286 8327 -643 13269 1065 -43155 -62063 -45900
17881 -45900 -10093 32487 59596 66495 27926 -15456 -17939 -9817 9843 7273 39287 39235 19214
17868 19214 26461 23819 -3608 -4986 6240 -3801 -4134 30162 55680 47141 4988 5242 -1812
17855 -1812 6428 4845 -9073 -7185 11814 7501 -4827 -30334 -22618 -29335 -30061 -33094 -40255 -50957
17841 -50957 -33199 -21641 576 2235 -14946 -3858 16572 28351 15047 2354 -8295 4696
17829 4696 -17988 -29448 3990 38408 37829 27960 20781 4969 18991 29611 26150 19768 21829
17816 21829 26400 -12985 804 17349 21375 16021 20292 62119 59437 36500 29761 26388 -1614
17803 -1614 -7168 -5681 19562 57869 38530 13892 40 10443 28212 59110 35902 8384
17791 8384 -21382 -30811 -41767 -21090 -20783 -26796 -4960 1434 -10314 -20244 -8136 -19828 -16306
17778 -16306 -19738 -12253 -25517 -27010 4355 30007 28180 13382 -21620 -8824 11931 18448 18734
17765 18734 -15024 -20718 -17457 -15955 1699 15738 -5322 8902 40839 15666 -21175 2686
17753 2686 -3503 3379 7000 16734 15340 13702 14154 -3888 -24939 -29494 -17407 -6515 15214 34832
17739 34832 33241 24366 14085 18352 17169 34116 8464 -5255 -21260 -11107 -14566 -5040 -9329
17726 -9329 -8758 -17607 -30005 -17896 7827 33007 31150 9362 -2748 -17413 -27191 -39511 -55845
17713 -55845 -56677 -33008 -48953 -48059 -50313 -42745 -931 -1086 2850 27796 30704 15611 18524 24996
17699 24996 23674 26988 50145 63437 55720 57038 17439 -2768 924 18162 13449 18108 26884
17686 26884 29153 28937 32832 25450 19459 28960 57700 80628 114031 170033 185400 210726 294657
17673 294657 357486 390390 391820 428047 417500 374432 309482 243446 211164 189300 145088 95108
17661 95108 73677 88128 84254 55861 58982 22517 27854 15871 3345 17223 14797 -2366
17649 -2366 -7745 -27901 4400 20439 14898 6183 26980 49440 47334 36715 22641 10090 -2454
17636 -2454 -6123 2431 21380 30902 28889 20245 37495 49702 20729 -20186 -7320 4549 -13087
17623 -13087 -30053 -49644 -44342 -50635 -38226 -37230 -42006 -38656 -45822 -56743 -50351 -21263 -8025
17610 -8025 -13005 -46348 -33779 -7220 2217 -9810 -49080 -57682 -45469 -40035 -65659 -71850 -76604
17597 -76604 -74968 -77656 -64815 -48757 -22567 -7719 -20600 -27083 -14249 9037 14352 2351
17585 2351 8560 4907 -22147 -23925 -16336 -35561 -36328 -30785 -33762 -36240 593 -4321 -25496 -34336
17571 -34336 -18299 -1664 17247 4618 -6206 -6919 -15763 -33741 -22044 -8016 3399 24468
17559 24468 17758 -6083 -13768 -15641 2103 -5704 -44521 -37687 -32021 -43626 -43180 -24967 -25590 -43351
17545 -43351 -15759 -14530 22914 35829 27077 14817 19415 18298 15876 18338 24069 -3343 -20367
17532 -20367 -24389 -7584 41496 35229 2157 -18857 -25389 -19260 8978 24003 20966 -12458 1397
17519 1397 19525 -6416 -14524 -9443 -25271 -3703 26566 29738 19148 4711 -15111 -19033 -31055
17506 -31055 -30831 -14732 -10376 -36426 -55258 -28795 8389 -4613 -31302 -37676 -15678 -14441 -9433
17493 -9433 -3986 17868 13265 -8437 -19393 -8197 5877 13658 11566 11798 5678 30286 46019
17480 46019 41815 8815 -25010 -8356 11915 514 1698 17847 8500 -5416 -1663 12661
17468 12661 -11935 -56633 -47987 -21653 -19960 -52222 -32485 21438 14971 20030 21299 5040 38478
17455 38478 28775 14813 14609 11652 -18754 -2774 3814 -3804 -3436 9093 10094 23207 7867
17442 7867 -4214 9265 8140 -9037 -21359 -18775 -21968 -8923 1603 -895 -3441 -13951 -18029
17429 -18029 -22302 -32404 -33450 -20752 -24768 -25155 -21957 -16871 -7954 13408 39646 41378 29563
17416 29563 -9672 -9032 -14322 151 7318 10674 24312 44162 42224 49438 38089 22853 25579
17403 25579 -2633 -28090 -28823 -21355 -19622 -3614 7388 11201 -9152 -17767 207 -5023 -6076
17390 -6076 11181 37536 44684 53551 41744 21209 15343 9976 -1288 -5129 7802 -4273 10853
17377 10853 4840 1596 26533 66568 40448 12722 9704 -21469 -4529 16966 26437 15348
17365 15348 23445 39840 34517 56931 68578 55500 94004 88942 64807 36820 41616 59805
17353 59805 59988 56444 43313 4433 -30386 -57277 -35792 -16440 -13828 85 18742 17618 10875
17340 10875 -5222 -15419 -22 39366 55208 39474 6296 -16379 6859 22315 3351 -17348
17328 -17348 21610 13511 -9503 -29139 -39620 -25576 -20638 -12052 -3639 -28339 -33122 -21728 -12058
17315 -12058 -811 9489 -7972 4633 43659 32776 5114 -6081 -2850 14729 26182 2768
17303 2768 -12501 3878 15412 6850 6869 8614 1307 -12269 -27624 -14657 -36160 -45915 -41755
17290 -41755 2893 21058 45155 61969 60291 42075 14776 7754 6332 19249 14938 21464 31254
17277 31254 30965 31663 42933 14423 -33894 -43586 -8554 6175 40953 26286 1981 31850 34560
17264 34560 38209 48917 64241 48692 25103 28694 15853 6555 -7596 4603 28464 21942
17252 21942 231 -7952 -28746 -23938 12376 14700 5857 14396 21382 11541 1740 2895 -2419 -10502
17238 -10502 -6265 281 -23643 -40377 -40754 -61239 -84779 -107369 -113435 -126988 -100206 -44906 -47123
17225 -47123 -38819 -34690 -8817 -30592 -56170 -25148 -7961 -9484 30489 56419 54098 35598
17213 35598 16581 13998 11223 -28133 -43684 -62937 -59067 -47918 -28861 -19343 -10469 -5291 1643
17200 1643 -434 -6121 8511 1086 1126 27828 25529 45914 46455 29374 36914 22572 6387 653
17186 653 35586 51649 42910 27429 22778 53881 92311 77549 55558 66378 69935 57083 62570
17173 62570 70914 115879 158413 134314 111164 78475 67565 78942 115229 117737 101520 96760
17161 96760 123087 110899 117707 115815 122311 153675 168020 169733 180400 166669 177242 216037
17149 216037 231303 230204 243237 273084 283068 291728 309230 296008 302993 352317 404494 426346
17137 426346 412055 485490 572360 635778 722805 844400 997775 1133011 1303349 1458140
17127 1458140 1586276 1716808 1832989 1979969 2142775 2350382 2590356 2909985 3271727
17118 3271727 3721917 4416672 5389754 6770041 8882165 12083137 16974402 24149901 34071085
17109 34071085 46866582 61667114 75189329 83457231 86175608 85371011 80259025 69203261
17101 69203261 54767769 41149355 30247757 22145955 16408473 12461363 9774757 7918464
17093 7918464 6593561 5644855 4912935 4357843 3895686 3517542 3193684 2849819 2533464
17084 2533464 2293780 2144209 2022140 1879787 1733552 1629879 1520908 1424087 1298020 1140764
17074 1140764 1008181 889850 814038 780481 700154 628794 572977 486264 413078 391682 384509
17063 384509 384860 382635 335789 320379 308874 310447 323866 313937 299771 284595 285303 269037 248752
17050 248752 229469 215153 219914 210298 182591 168384 160404 143034 158214 165268 143565 129880
17038 129880 107671 129636 152775 153940 141951 134739 146869 139410 123664 85408 34754 40212
17026 40212 94246 130904 120684 105915 85527 75282 94469 96859 87010 83811 102136 117960
17014 117960 126718 110964 80587 75297 79573 64188 97588 125771 125682 121890 103394 110491 118257
17001 118257 120050 99413 87888 102254 137471 143043 149185 146675 135522 108696 110917 124105
16989 124105 96724 102045 124823 144994 162269 175301 204080 258659 270198 264310 295187 275536
16977 275536 274567 294751 253661 221263 188848 180019 165383 161271 176348 176976 180307 154548 126506
16964 126506 130048 129930 130318 104166 84296 78215 70985 78727 78923 65690 46723 43648 30100 23445
16950 23445 -4201 -1758 687 11916 21658 25103 21741 24700 37835 58307 64992 61968 36168
16937 36168 61374 44768 13445 42604 58389 29311 36942 29382 12371 17015 15773 5408
16925 5408 -14437 -4156 3793 18390 62928 53057 24677 40660 65161 81905 102707 54070
16913 54070 21463 20825 -10783 -4246 11055 20124 8184 1196 7451 25938 16929 12853 22555
16900 22555 30973 35863 60059 38760 17423 36135 24712 21819 50935 65428 48671 11001
16888 11001 7115 5991 -14671 -28733 -32419 -29406 -18900 -125 -10056 973 24532 22632 17724
16875 17724 15583 5622 12580 9684 25076 28037 11882 11339 3423 -8317 -41514 -38859 -29433 -13736
16861 -13736 10345 30611 41227 46259 39568 61646 94713 71306 60029 52884 25778 22561
16849 22561 34159 15442 -20266 -45347 -23548 5302 2073 -8371 -7727 2416 33336 26781
16837 26781 29081 44437 54076 49174 57274 46636 25918 8806 15172 49188 82284 74343 40962
16824 40962 8736 -32578 -31925 -15212 -8594 -32098 -35879 -16209 4214 -20261 -31094 -13287
16812 -13287 -7762 7642 2331 -6595 -39430 -44819 2131 17340 28554 11069 -7558 -4403 18719
16799 18719 18689 15283 13777 -6530 -44726 -31571 2463 -8264 -24498 -41045 -52443 -32869 5518
16786 5518 15870 -13193 -39113 -28123 -16230 -13867 -15579 -10011 -14601 -22637 -12557 14012 7053
16773 7053 -20656 -40122 -37248 -25866 -46830 -54634 -34826 -41230 -26955 -51658 -47710 -41393 -34272
16760 -34272 -23407 -31503 -50085 -42752 -31334 -39195 -20709 30647 5628 -14101 16656 22093
16748 22093 17264 6689 18189 26805 26989 29915 34422 31489 37795 45126 34409 3159 16288
16735 16288 43723 40741 21261 9046 -8084 -34233 -61699 -40218 -9972 8055 26135 -10157
16723 -10157 -23579 -1458 7407 -2438 1807 3776 -694 -4434 -2455 -18244 7353 11903 1992
16710 1992 23058 64215 91897 55028 40763 25563 31536 26478 8341 -729 12084 25560
16698 25560 17109 -10474 -13956 -21668 -25196 -26039 -35126 -29732 -36834 -34652 -1288 -4229 -23559 -46366
16684 -46366 -24079 -2065 -32087 -31448 -18348 1547 -10461 -6618 6161 18247 35830 41417
16672 41417 29375 30421 31789 591 -27638 -22935 -7607 -2076 -1799 10692 34536 14363 4444
16659 4444 9861 12824 5433 16302 44267 21430 3925 10059 8689 -6812 -31400 -39664 -31934
16646 -31934 -32464 -34746 -27204 -15359 5031 -17189 -4409 6568 -6465 -39448 -31270 -3588 -16415
16633 -16415 -1900 11901 14999 13531 -13180 -40102 -13998 7952 9386 2782 -39132 -43932 -33752
16620 -33752 -30671 3283 5896 -513 -8871 17467 23518 7543 13058 28005 35418 17635 -8578
16607 -8578 -19777 -45108 -5403 23936 14316 25695 28781 -673 -11367 -13572 -13730 -24090 -5202
16594 -5202 -1419 -10638 -31189 -34785 -9708 1591 10253 4297 -25888 -36845 -40917 -21860 -17680
16581 -17680 -32578 -42148 -2392 8140 8280 -6169 -16372 -17034 -36490 -30259 -7544 -25816 -33131
16568 -33131 -16648 -2425 19540 12445 4476 7071 5311 14567 13587 20249 28643 10221 -15508
16555 -15508 -47475 -30610 13587 26135 10103 2723 11899 5138 -19707 -29049 3794 22624
16543 22624 43209 68215 92820 126816 187232 220458 267225 313792 382058 399049 409999 374163
16531 374163 380934 352203 296240 235897 189996 145828 95380 77859 63627 73383 75866 68144
16519 68144 82668 79531 47366 38419 25350 11683 710 -2451 34113 27746 12642 19623 44639
16506 44639 51457 40697 53734 70987 83073 90586 75599 59891 37063 36044 57473 36024
16494 36024 25195 30826 25825 6691 34019 55795 32206 4429 -8086 -17585 -15129 -29360
16482 -29360 -16572 -33328 -17191 16771 -3580 -12491 -20409 -13149 759 35128 27537 17605 19020
16469 19020 25464 35963 44707 14151 -1895 -8158 -23868 -30825 -8072 -31069 -46846 -22792
16457 -22792 -1840 20282 6631 -6598 -11109 -9355 -6056 6241 1480 -3938 9808 -3958 -2721
16444 -2721 27328 22366 -11654 -58261 -55587 -36599 -18957 12346 -4580 -28127 -15399 11490
16432 11490 8917 -7021 5640 -17637 -11086 8732 15238 65 -17288 -35396 -40619 -33839 -50183
16419 -50183 -48122 -4753 7880 32640 18530 -636 -14849 -2793 -11316 -7765 -7578 -11346 1044
16406 1044 13908 7639 16572 15098 -1254 -5188 -7417 -16537 -28475 -12416 -24053 -34822 -8882
16393 -8882 19744 8357 -3976 -30061 -27229 -23450 -58822 -57161 -7705 19608 28970 20885 20574
16380 20574 24212 13317 2309 24447 -4299 -20566 -3812 19379 -5523 -30498 -13466 10435
16368 10435 33032 2367 -39991 -35571 1653 24061 -7401 -20038 -14887 17618 -2309 3186
16356 3186 41032 39986 18138 -923 14566 10880 -25094 -4613 -19312 -25872 -30535 -19445 -14631
16343 -14631 -20023 -23948 -10548 -18885 -29396 -16900 3189 -8582 -3932 -5045 -22672 -44799 -50227
16330 -50227 -38785 -22046 -16473 -16208 -12441 -17464 -35944 -38554 -40327 -27566 -17566 -23344 -10767
16317 -10767 -37085 -50301 -56009 -56269 -42893 -34118 -16046 -19416 -6022 4794 -28288 -32095 16804
16304 16804 18332 -23876 -34324 -47229 -41455 -22570 14471 31699 29387 24438 1161 2496 -5309
16291 -5309 -20955 611 -23628 -14322 -14609 -24761 -25954 -23646 -3353 2594 -4817 -18691 -18560 3359
16277 3359 40238 40740 26827 15443 32484 29489 3916 -1134 -619 6714 -9613 -27574 -32833
16264 -32833 -41531 -49475 -22184 14683 7113 -15714 -11306 -32264 -34216 -38031 -21023 12331 15976
16251 15976 7879 -23936 -29738 -6623 -27364 -45589 -29849 -36918 -44472 -30400 -29392 -17843 -9097
16238 -9097 -7972 -18669 -33205 -17639 8232 16685 -4998 -15208 -26247 -4103 -20798 -42007
16226 -42007 -60863 -27428 -12922 -3600 -12869 3397 -8315 -39040 -4836 11345 19176 12179
16214 12179 -7161 -6371 -23969 -30080 -42673 -23509 -25325 -27862 -12999 -468 11991 8026 18725
16201 18725 -5133 -40257 -40260 -30156 -24977 -39795 -43643 -58862 -35408 14882 10696 -7410 17529
16188 17529 7183 22170 39454 53570 24403 -6912 -21375 -17672 -28627 -12841 15139 2710
16176 2710 -5912 21673 43498 8973 -13669 -12498 -19286 2906 17260 11572 26991 28112 19153
16163 19153 1867 -22741 -20265 -14894 22048 28119 38490 38597 4566 -768 1891 19988 26061
16150 26061 34509 45365 26554 31771 28405 41154 33687 3238 -1315 -24906 -20999 -5380 -2167
16137 -2167 3739 -12138 -19418 -19079 -9534 21975 52368 22622 38511 58330 79199 126574 148963
16124 148963 136751 135843 143470 157832 160373 162132 158382 110949 91771 71426 66814 77837 50336
16111 50336 47554 59552 56024 42268 25858 39713 58557 38874 -14605 -23047 -9457 7191
16099 7191 1764 -23470 -57195 -26364 -9261 11622 36095 27243 43775 35429 6034 -7306
16087 -7306 -15564 -49248 -65906 -58070 -59003 -59523 -51886 -48085 -37168 -22046 -38326 -25121 -40237
16074 -40237 -20998 -3251 8211 -18071 -12950 -10564 -19108 5623 12775 31296 18750 -32079
16062 -32079 -43789 -47625 -40578 -21759 9617 27147 29329 12513 4839 -1271 -373 -1879 5036
16049 5036 -23243 -27467 -35426 -27441 -19095 -19245 -33837 -36227 -31469 -10894 9741 17159 10346 5763
16035 5763 4932 19556 -325 1628 20523 53973 56634 40237 7491 4203 19675 -6091 -16135
16022 -16135 334 6531 -13737 -17527 -10808 3534 -5102 -3816 1462 7631 4195 -16748 -21187
16009 -21187 -18843 -26956 -37113 -29522 -16733 -35469 -31925 640 -7469 -24781 -14726 -9309 -11382
15996 -11382 -2945 7454 -1112 -12132 -2478 -10273 -7569 27006 25691 9062 9648 1403 20751
15983 20751 12453 3427 -370 2565 2121 -7611 -17404 4613 -10863 -36633 -26808 -41705 -25753
15970 -25753 4028 13646 4573 9742 10085 1441 -8552 8159 31262 40415 45408 21034 1900
15957 1900 -6437 -20917 -30060 -28892 5099 14751 -71 24683 32990 25960 4688 -26319 -8625
15944 -8625 -25264 -39771 -28891 2567 15413 22498 28765 9285 7575 7631 25104 42547 15367
15931 15367 -21885 -50826 -64835 -67103 -36870 -15531 -22181 6265 14906 -445 -3586 -13111 -6660
15918 -6660 -128 -3171 -19634 -43889 -56074 -24193 1035 -23551 -14824 21678 27173 25194 30301
15905 30301 28031 -816 9330 10512 -15100 -8625 29537 -756 -26194 -3464 -23866 -13918
15893 -13918 -44313 -63317 -42893 -10528 3118 9487 5445 -24799 -36307 -50259 -60161 -47339
15881 -47339 -5768 -21827 -34487 -13063 -40457 -54803 -22309 -12801 2390 14526 28477 21847
15869 21847 -2768 -35199 -48767 -51564 -33952 -8098 1859 -9639 -11765 -21860 -18228 -15433 -8051
15856 -8051 -10239 -28443 -44820 -65876 -38741 19931 38506 26546 14187 18744 6120 -16689
15844 -16689 -31706 -49823 -49806 -17172 12517 -728 -7622 14904 33001 23669 31073 26400 14076
15831 14076 28348 5146 -23826 -8237 10986 10249 12751 28152 39004 28379 6596 14662
15819 14662 5206 -2353 11287 -13567 -41151 -30333 -16600 -23796 -4616 15856 21125 16963 -8101
15806 -8101 -48675 -68108 -45787 -19207 -8158 3026 -223 -20513 -30052 -11281 7966 -2189
15794 -2189 -17893 -33444 -22623 -23597 -14634 -5120 -7593 -25634 868 13093 -14320 -34034 -8503
15781 -8503 -19221 -22115 -25568 -34351 -2472 -13435 -33601 -19796 13517 91 -12273 -13315 -17038
15768 -17038 -35077 -9082 17169 10510 9870 -30499 -38376 -31267 -18719 -15254 8042 14351 886
15755 886 -9065 -16507 -38489 -28594 -35708 -49466 -29907 -26995 -23010 -39372 -61118 -42093 -14978
15742 -14978 -7759 -4927 -15958 -974 18204 -17294 -19863 -18242 7637 13950 3601 -8190 14942
15729 14942 10482 11619 -5503 -6699 -12145 -19967 -33422 -24706 -15957 -13660 -18416 -44522 -57254
15716 -57254 -63961 -73946 -51631 -39193 -42681 -43889 -16743 -5159 10485 -1413 -44085 -45429 -32771
15703 -32771 -36608 -41022 -31611 -5132 -3463 163 -13900 -39828 -40049 -5289 -16810 -7425 11159
15690 11159 23021 25909 47112 44293 -2128 -41556 -39049 890 28349 40975 38122 40905 26280
15677 26280 -3855 -7987 20070 59442 82062 126487 167877 189593 207882 211204 224034 172924
15665 172924 129289 105699 59988 22660 20131 4418 146 -7950 22425 42807 34871 17776
15653 17776 27169 20593 9223 -10787 -22672 -18556 4460 6218 10015 -39 6632 3490 -16762
15640 -16762 -19352 -15082 -35391 -62150 -53159 -62462 -48068 -25960 -7967 -3133 -2002 -6436 -14068
15627 -14068 -16787 -4091 15891 -15854 -14711 -6865 12832 30617 9966 5318 -12533 -12986 -4406
15614 -4406 30089 20997 6873 6106 6344 23844 52804 54673 39709 2908 -10864 987 14868
15601 14868 6429 -14805 -29394 -24963 -18348 -37143 -9336 -928 -23531 -35880 -26650 -5501 -9486
15588 -9486 -6657 3820 -4663 -10115 -18218 5087 55888 88337 23422 -799 29047 8923 -43175
15575 -43175 -41948 -29458 -50344 -41083 -9358 19920 16230 -10023 -1618 -10460 -25619 -2085 17329
15562 17329 -2345 -25021 -62689 -68556 -51186 -40050 -37971 -3941 7732 20213 9240 14803
15550 14803 25125 44058 20882 -22190 -31770 -36325 -38274 -36819 -12209 -21635 -48677 -43210 -51158
15537 -51158 -32541 -12768 -16770 -1164 -14469 -36223 -28269 8169 17330 54128 44203 13264
15525 13264 18868 30781 42883 27183 14056 20090 21763 10369 6075 35322 110947 123342
15513 123342 104147 82360 69524 29075 -4683 -25675 -12122 -19179 -24921 -30844 -16907 -4524
15501 -4524 -21042 -38688 -33813 -12286 -11481 -28355 -10864 -21854 -25101 3223 1887 -2769 -3075
15488 -3075 8748 20904 1668 -10229 -5920 13781 5221 -15921 -10279 -12102 3979 31810 23246
15475 23246 -15352 -23156 -7089 12074 23634 28452 11148 37705 50009 9376 28884 33521
15463 33521 46709 19562 -13283 -39753 -40020 -37384 -38032 -34642 -31933 16365 41286 2001 -50113
15450 -50113 -81579 -103257 -73942 -50526 -21105 -9572 -12801 -38146 -48059 -34579 -39417 -60911
15438 -60911 -41595 1522 -13397 -13099 -14507 3298 16604 23184 10612 10762 8683 -16740 -12211
15425 -12211 -17115 -38523 -19499 -22875 -52176 -74266 -66598 -30308 -41127 -10830 33343 29588
15413 29588 15459 9191 -2417 -8139 12797 11031 4488 12721 35579 23530 25827 15220 1285
15400 1285 -49172 -42253 -11327 5335 -1642 -37862 -28538 -1741 16384 8382 -4969 126 3736
15387 3736 -3356 -18182 -32341 -70746 -61915 -18024 33981 22777 1931 -7535 -11361 -24937 -10779
15374 -10779 -16068 -5178 191 8131 -5107 -30553 -43699 -23407 -19650 -5711 -225 -5640 -8628
15361 -8628 -17326 -21139 -35634 -39722 -34534 -13062 -13795 -5605 15983 -5095 -53169 -68236 -87848
15348 -87848 -75091 -66029 -61954 -37851 -44168 -44409 -26422 -28435 -23653 -34675 -36963 -53417 -25415
15335 -25415 4746 -25303 -36152 -31113 3512 -9148 -13772 -2609 32640 39164 27832 3752
15323 3752 -35397 -43078 -18945 -2295 -8392 -3194 10166 10450 28725 48091 75333 40798 1898
15310 1898 10705 11602 -1551 -21255 -17699 -4642 15634 12547 -13688 14336 15260 -4139 -6258
15297 -6258 11116 15129 19456 30702 31562 7340 12750 4187 -10350 -3642 42743 44272 29631
15284 29631 -17051 -30516 -8454 17853 30238 23507 -7186 -14961 -28701 -22740 -20512 -29360 -19019
15271 -19019 -16368 -19810 21339 25862 14088 16176 10006 12354 21881 16200 13861 5478 7858 26375
15257 26375 50831 50583 28086 10378 8749 3250 -1153 26217 49840 26603 6464 25003 18824
15244 18824 355 -24361 -69002 -81417 -51096 -5759 4770 -22989 -15110 -19115 -60915 -57576
15232 -57576 -49265 -46378 -18050 5322 18017 -7046 -9714 3199 -19920 -35205 -14442 -39878
15220 -39878 -49981 -17495 -16149 -18184 -17523 -9144 351 -26540 -32333 3179 7589 -17557 -29220
15207 -29220 -26753 617 -3699 7693 11519 9392 17311 12723 20100 7961 -3521 -8064 -19841
15194 -19841 31 13830 16772 -15693 -41609 496 16820 10767 -6022 6216 14498 -2560
15182 -2560 5868 31827 -2595 -6146 4535 8948 13292 12781 130 -20270 -9716 8221 882
15169 882 2041 31983 29545 17178 12285 26328 28276 529 -16135 -3414 -14500 -14546 10273
15156 10273 17070 15114 5135 5126 -2787 -2096 11877 -3688 -9856 -11960 -4293 16723 1636 7099
15142 7099 23179 18220 28612 12055 2370 13557 7428 5634 -5920 120 31205 35551 52592
15129 52592 42393 34070 45201 39006 12821 1345 9569 30853 14240 24357 20840 24960 9383
15116 9383 -5280 -7942 -40027 -61410 -12229 -1915 -12080 -3891 2196 15844 -1288 -2862 -13670
15103 -13670 -20190 -13793 -29573 -58585 -66732 -66976 -97812 -73941 -66571 -40560 -927 14695 4065
15090 4065 22009 39431 3192 -18850 -9161 10221 2889 -2896 -9332 8703 -6097 -38293 -31350
15077 -31350 -23656 -16936 -21076 -18202 -22345 -4855 -3015 3406 8236 -12781 -4127 -28941 -13267
15064 -13267 -7835 3849 -4180 -5777 -6474 -9243 -5037 -700 -1588 -2439 -2118 10714 2835 -11827 -27552
15049 -27552 -15675 -16614 -22312 -47793 -35415 -19544 -20370 -20118 -16917 -27154 -26164 -21204 4569 15554
15035 15554 15719 -22545 -21649 -7754 19962 15965 -7722 -31590 -58442 -69707 -50401 -26071 -8999
15022 -8999 -24425 -33747 -16341 -7471 -22186 -16856 -29638 -29508 -42049 -58128 -74143 -39077 -19301
15009 -19301 -10902 -8736 9215 -4793 8386 7586 -11799 18918 45645 42229 8879 437 -9122
14996 -9122 -2067 -12671 33325 43422 22958 6347 5253 -1387 -17985 -16216 -22404 -22488 -20002 4725
14982 4725 40392 20256 17451 27085 2799 9382 -13831 -44100 -54678 -25174 -12852 -13482 -14576
14969 -14576 -65074 -80509 -36437 -9781 -3266 37653 62030 45237 34821 24715 23893 14316
14957 14316 -15558 -18566 19011 5135 3204 17156 18418 3793 -5358 -30181 -34956 -53911 -69567
14944 -69567 -60731 -57890 -42603 -4463 7002 27829 16428 16383 -2065 -13245 -4696 19853 45744
14931 45744 72556 42184 -3486 3619 18411 49673 52868 25451 -16436 -35766 -32943 -19191
14919 -19191 15740 24994 26255 19475 1667 -14065 -53019 -42058 -28580 -16478 -10888 -14585 2664
14906 2664 28454 35847 24167 7235 2914 -3324 16767 33774 23119 24839 10836 4808 14727
14893 14727 30062 31096 -2774 -1135 11020 -8168 4963 24122 21112 12801 1911 -23788
14881 -23788 -23742 -40931 -37946 -16712 -1327 -18144 -4191 35073 43599 14868 -11921 -15393 6194
14868 6194 -2824 -395 25245 17730 -17199 -12064 -11243 -8637 1198 15495 12903 26748 21203 8990
14854 8990 10041 17995 11095 619 -28345 -40983 -10731 2134 1157 14428 -167 -19660 -26695
14841 -26695 -22856 -45266 -18173 -10585 -46086 -51577 -82621 -94122 -72359 -38663 -2388 24244
14829 24244 -9437 -37940 -34597 -26861 -40163 -33527 -64450 -45635 -41524 -50985 -54929 -47037 3628
14816 3628 -15826 -54652 -49242 -35039 -47018 -2225 5917 14219 -4682 -22331 -9822 2647
14804 2647 33813 28732 10086 24512 38518 7913 9 2209 10383 -2559 22509 49193 47712
14791 47712 25871 3794 -4177 15138 11672 909 -2169 -11511 -18958 -23926 -3745 22850 45949
14778 45949 66127 46771 36740 28143 -143 -7832 7522 26607 35882 31745 30325 23357 26901
14765 26901 30500 3406 -8355 18993 48475 46644 18917 -5775 -29268 -23468 -34471 -52771
14753 -52771 -68695 -52311 -21943 12273 13179 -5964 -2157 -147 764 4438 4731 15375 -2198
14740 -2198 -33088 -41836 -6031 28496 6234 -1431 -8094 -16636 -12578 21213 26009 -11347 -11431 -8186
14726 -8186 -13252 5923 13929 -3987 -48430 -72038 -28336 14054 -16446 -51740 -59529 -29444
14714 -29444 -13436 -36780 -17587 -5980 -11587 -26588 -43696 -34812 -33414 -28041 -1359 8214 12602
14701 12602 16018 28432 33609 5273 -10078 -36272 -45456 -33927 -38563 -51617 -21788 -8714
14689 -8714 -33631 -12474 20917 15891 7746 16910 12118 3020 6900 1448 3250 7164 -1590 -12773
14675 -12773 -16271 -47537 -54602 -13544 21674 24846 11085 6309 2094 -9551 -17481 12596 63435
14662 63435 52019 20539 20827 17676 841 -2445 -4787 -8145 3124 17893 21031 22943 37819
14649 37819 40538 43560 9967 -10944 2942 -4090 -21590 1937 -6149 -3403 4265 -9074 -12715
14636 -12715 -4968 20488 34518 27160 580 4227 8222 7554 10844 21709 53368 55210 42528
14623 42528 31608 25874 27573 41960 42864 -597 -22102 -34888 -6562 19693 3618 -11043
14611 -11043 15807 -6436 2120 214 -5865 -3396 7598 -6580 -46253 -61992 -51004 -34382
14599 -34382 -29517 -27061 -7317 -272 9324 28851 13934 13983 18552 7575 -32291 -46152 -27881
14586 -27881 -15301 3934 23641 3028 -7081 -16473 -17575 12680 7924 -25236 -44665 -36806
14574 -36806 -34740 -51161 -27390 -37950 -40061 -40616 -30719 -36364 -36073 -30893 -40302 -59564 -40790 -23091
14560 -23091 -24252 -30566 -15225 -20080 -4314 4360 -21195 -42623 -55251 -45147 -26557 -47490
14548 -47490 -47964 -5380 -13276 -27119 -31435 -15858 4720 9959 22467 8763 18404 10996 -4410
14535 -4410 -6176 6013 5352 -8587 -5029 9837 24826 32273 39552 23015 5791 -1364 -18592
14522 -18592 -20159 -4764 5134 -15262 -17608 13810 26806 -7516 -33339 -35277 -48307 -54674 -54238
14509 -54238 -52772 -37139 -33181 -30108 1259 -20499 -35780 -18536 9480 26677 49364 33346
14497 33346 36412 42115 28325 15485 -5454 -25649 -30974 -36627 -16900 -7557 -22859 -30016 -61212
14484 -61212 -61195 -2341 31642 52116 39187 27932 20216 -3506 -14150 -797 30667 34486 7473
14471 7473 14176 611 10910 17328 28012 32256 38695 42485 33554 10667 -11452 14659 18854
14458 18854 23373 18456 13571 4879 -2668 3575 4262 20303 26277 27361 -9114 -12763 9159 21445
14444 21445 29173 37823 38627 28257 29257 41485 55249 41334 17961 10641 -5518 -8587 -3392
14431 -3392 -10902 -29817 -22805 -75 -10824 6726 26568 20194 -2134 30059 53545 53441 45767
14418 45767 25794 12809 -10163 -24746 -28235 -14955 -3092 -8779 -5504 9859 26302 -3462
14406 -3462 -17852 -9945 8040 11254 7496 4921 14455 -22234 -23936 2030 29856 44981 26148
14393 26148 -592 -13545 -35972 -42077 -25835 -30533 -33236 -24539 19859 33812 45000 64566
14381 64566 43208 7501 -15164 -42273 -47385 -13755 12280 8415 -12473 -28170 -35472 -15469
14369 -15469 -1083 -24151 -64961 -10615 20957 43552 29324 4998 -2309 -26353 -5063 -16644
14357 -16644 -26007 -39053 -27805 -3729 8792 18590 16542 13704 10197 -10941 -20639 -38678 -38802
14344 -38802 -33642 -35541 -8683 18691 2661 2110 36200 16391 37533 52329 18304 20238 32398
14331 32398 34097 14197 -13776 -30839 -44655 -26877 21971 8960 -15367 9344 32766 31780
14319 31780 23071 1606 -29688 -52784 -65659 -58285 -33551 -19826 -13693 -5779 -1448 2738 -27385
14306 -27385 -60360 -56046 -54228 -54571 -37394 -32606 -8390 15220 -13720 -7793 1467 16351 40545
14293 40545 28214 20707 4488 -4151 9412 -421 8625 -10093 -32056 9815 22648 -16843
14281 -16843 -15260 -30293 -54720 -32101 -20809 -27395 -47879 -52606 -62049 -61228 -57279 -32006 367
14268 367 12667 21962 28363 -1049 -20923 -16190 -11213 -15642 -47386 -51127 -44494 -40109 -18121 -22928
14254 -22928 -30184 -18631 5115 -5437 -15807 -25051 -20105 -18159 -12297 -9748 -2303 8082 3175
14241 3175 -11093 -3985 -2196 -3295 -27009 -36180 -28623 -18681 -1060 3476 -15712 -27677 -41222
14228 -41222 -50265 -37641 -20804 -20103 -8284 -7716 -12537 -18831 -29187 -20446 -15846 -20237 -28840 -27096
14214 -27096 2552 47977 65696 63311 43780 33419 35630 36518 21393 27872 19170 20123 39496
14201 39496 75806 66144 56859 38829 25847 29261 27688 23941 16680 7433 6854 14105 40176 8211
14187 8211 4048 23368 37143 18037 4593 -566 1112 19451 7210 -9470 -15269 -22434 -13007
14174 -13007 -48095 -84201 -77536 -49725 -18124 -3918 -3078 -32642 -29630 11487 8939 -1013 -4177
14161 -4177 -9166 -27550 -12406 -2617 -26165 -32325 6712 -10095 -51015 -45634 -18619 21301 -14943
14148 -14943 -40042 -41644 -25149 -17403 10240 26678 28802 29909 9680 -2186 -15733 -45020
14136 -45020 -45940 -24221 6377 16258 10468 7362 -26693 -36649 1158 -39818 -48181 -12542 18132
14123 18132 46913 70099 43595 15437 -4768 -3991 9390 10013 525 -12162 -28050 -17364 19443
14110 19443 18485 -478 7312 35387 50175 30130 24395 16867 19321 -24553 -23171 -16434 -8118
14097 -8118 4678 -794 6402 16293 26498 7782 -7472 33364 35811 7630 7861 8349 6448 8520
14083 8520 18840 5670 15642 4331 -31323 -34891 -9785 794 21189 47758 27961 28696 31845
14070 31845 19226 3689 -13632 8909 -2769 -16734 -6175 5228 -11321 -16151 -6692 -11012
14058 -11012 1487 12092 15407 -591 -3220 15730 30855 39923 24264 8374 13528 23913
14046 23913 -4019 -23842 -37926 -14677 -13084 -15370 -30614 -21334 -18809 -20304 2565 20458 11846
14033 11846 -547 30025 35786 19279 6713 1731 22911 25007 11634 15608 8097 5116 5529
14020 5529 16023 7186 -26662 -36009 -19703 -40724 -47728 -15443 7906 17002 -21752 -30428 -22456
14007 -22456 -17840 -5264 -3205 -9917 -23102 -24705 -15331 -44908 -47315 -23577 -7596 -12616 -49142
13994 -49142 -80783 -61068 -47526 -25185 -29297 -18873 8269 -9816 -28024 -32477 -27399 -27075 -8849
13981 -8849 22298 -5682 -15708 -6464 -19560 2798 17568 18339 25901 25553 -15394 -15531 -16270 -4098
13967 -4098 15279 6650 8280 27664 24350 -24500 -45686 565 34516 27608 19342 37896 53999
13954 53999 42046 37371 44243 80036 111290 98614 67235 32801 29947 22305 16909 -11526 -24283
13941 -24283 3092 18230 3445 -15054 -27341 -21835 -35321 -3306 10153 38352 41165 71975
13929 71975 53837 38182 11554 -29462 -46548 -36732 -42943 -41209 -19529 -10961 -22823 -24236 2596
13916 2596 43405 8420 -19336 -28362 -30382 -24415 -13925 -5939 -39871 -66358 -60215 -58254 -39860
13903 -39860 -19172 -18938 -19878 421 42622 55767 46445 11157 607 -8775 -13629 -11267 8097
13890 8097 14021 8662 -20590 -21845 2728 48445 78679 55630 19073 628 5841 3145 10444
13877 10444 35839 39999 55283 67106 44106 25029 12759 7979 -948 -20432 -36816 -20006
13865 -20006 -29943 -26158 -4032 -2965 5100 27855 23126 27288 40426 40803 16986 29996 29248 -2862
13851 -2862 4166 16708 18545 -14238 -48309 -39752 -11206 -1498 -9995 -14398 -20802 -11086 9033
13838 9033 16010 -8915 -24799 555 -9759 -8659 -27246 -31807 -34141 -21601 -3352 -2907 -33010
13825 -33010 -30275 -37874 -46046 -22255 3066 22677 24963 11215 3485 -1360 2833 -10072 -11465
13812 -11465 -1917 19671 34578 47930 37201 38719 37546 21572 13868 -17705 -18882 -18287 -1415
13799 -1415 -12630 -3525 10876 -6978 -15124 -17073 -26117 -46942 -47944 -38807 2171 -9778 -6795
13786 -6795 -14299 -5231 9894 33763 22273 14487 13619 45156 52891 41927 27055 4978 1817
13773 1817 -11218 -7899 -19579 -12689 -11657 3170 5361 28723 23438 14749 501 863 21658
13760 21658 27989 -688 -2983 -29134 -53232 -48216 -37019 -20252 9908 10717 -11228 -13402 2859
13747 2859 -10507 -15242 150 23493 46079 24174 -5678 -6347 -16060 -30434 -9229 -1411 10727
13734 10727 8317 -4392 14112 12619 131 13408 27328 6310 -15130 11739 18190 -23667
13722 -23667 -47357 -52045 -31853 -34434 -39777 -15550 23703 19379 -11721 -33101 -33106 -52818 -64431
13709 -64431 -36659 -7145 -19757 -24121 -5661 10 -3839 -1610 -2804 4353 37290 53238 42023
13696 42023 29785 20274 -18789 -20812 15445 13400 25304 38180 45799 70545 39512 26370
13684 26370 28213 3180 10558 12593 7528 -17246 -14688 2028 17812 1316 -21853 -726 -25630
13671 -25630 -27418 -8595 -7111 -24341 -18840 31188 34744 38037 17040 13512 20877 10109 -19216
13658 -19216 -7453 -22371 -6468 22419 40364 26755 -3814 -4350 -5261 32631 49942 55774 47537
13645 47537 27409 39108 37343 25159 32578 47663 11610 2926 27091 36197 38067 27036 1158
13632 1158 18293 3016 -31663 -42454 -38871 -40467 -11105 26922 58426 39870 26638 23446
13620 23446 -7727 -23827 2603 28931 23180 25477 12567 16685 30452 32246 55797 56144 62414
13607 62414 51809 30689 22234 12525 19890 -11907 -28890 -3002 1508 -1592 -5874 -26896 -29603
13594 -29603 -14087 -6247 -20249 -13434 -3681 9148 -3104 7078 46308 65412 70328 60766 47836
13581 47836 31051 21826 -2823 -9000 -7129 4703 21784 -71 -16928 -40332 -23395 21636
13569 21636 19559 7803 -2763 3939 48271 51930 52219 67167 62151 41123 16455 -11319 22392
13556 22392 51329 52294 51307 39571 32149 15550 26212 39440 44895 9513 15220 2580 -18420
13543 -18420 -13509 -169 16869 8361 -20310 -51164 -36880 107 5196 10607 11855 2059 -17220
13530 -17220 -30509 -38784 -9071 18678 18240 36203 38955 25360 6609 -4008 7528 6210 32255
13517 32255 10300 12694 11607 15658 35585 27135 22240 15815 14717 45583 53629 34865 18763
13504 18763 39424 72793 82301 24650 15828 21392 23898 5875 -5037 15950 20558 23073 10987
13491 10987 -13173 -20415 -29399 -34297 -46639 -26331 -51875 -79337 -33327 -16381 -10451 6119
13479 6119 27157 34734 45980 24748 8521 5927 -10412 -3761 11042 33581 16437 20864 28050
13466 28050 36896 28044 -4457 -11776 14071 35694 43619 22091 4874 -3238 -5314 -1529 9441
13453 9441 5546 -3927 -29635 -43233 -29919 3670 37638 23689 6152 23777 5079 -10839
13441 -10839 -20016 -20752 -2103 4837 -473 -17935 5191 12328 25806 51336 42758 39957 13243
13428 13243 -3027 -2078 -3428 31078 9404 5111 20558 27208 5912 -21942 -33386 -8861 12005
13415 12005 -833 -22673 859 18966 16117 8621 29656 12795 -5304 -12070 -17536 -10047 -2996
13402 -2996 -22885 -40470 -56844 -49279 8121 47253 51429 23010 11081 32174 41937 41624 45463
13389 45463 82298 102690 70842 38112 14707 46411 54388 23552 13358 27528 30054 46430
13377 46430 24944 9825 2041 -98 -8078 -8527 -6172 10193 35591 31615 -12300 -13430 -23936
13364 -23936 -28031 -32157 -21394 -6559 -24026 -3498 28883 60510 73141 72212 40721 20100
13352 20100 22465 28739 4364 -25019 -21741 -2180 -12078 21954 30202 25811 17237 27207 31084
13339 31084 45076 26284 16756 4284 -6667 -11538 -28211 -27894 -3584 5445 3541 -13357 -34641
13326 -34641 -44439 -18972 -3670 30090 30332 13592 24628 23701 12859 18425 38866 35709 25842
13313 25842 45583 66092 47059 91808 88996 65042 24752 8116 26923 43201 28609 7412
13301 7412 5587 22827 39115 44393 31591 56276 47758 34294 30009 7557 -19259 -28868 -10121
13288 -10121 -11864 6791 3176 6947 10883 5898 2248 4282 -43561 -54872 -18984 459 43
13275 43 -9455 -7352 5114 38255 20262 5649 8882 35883 23711 596 -10054 -19109 -28032
13262 -28032 -5220 22173 28774 8579 3437 -18171 -40682 -13398 -12522 -42 2585 23095 -1249
13249 -1249 11986 12746 -2719 7146 16807 20658 -3377 -38071 -46143 -10279 26501 30197 34097
13236 34097 10154 7044 5976 -6873 -11599 19727 28405 29705 19521 18334 -2267 -5637 -3405
13223 -3405 6817 2826 22275 10833 -27344 -14801 -6381 -37728 -28477 -13221 -19729 -21726 -20633
13210 -20633 -1761 -1307 5110 25909 26434 26877 21931 15830 42664 49526 80914 39087 -8786 -3821
13196 -3821 -3670 -8727 -6291 -2014 18650 35046 34173 38807 47871 40785 41842 32269 63461 44165
13182 44165 26946 28538 40127 67894 56738 29076 22644 14986 -13354 -2912 7165 -21265
13170 -21265 -26620 7092 23818 -21367 -35976 -27995 -6272 21499 17522 -11551 -17167 25891
13158 25891 34189 25309 23334 7103 10558 20342 8418 3101 10580 16305 48747 57013 18923
13145 18923 -13982 -27010 2099 14140 9914 -12472 -15916 2881 -41185 -73268 -49711 -32034
13133 -32034 6765 29380 25660 33619 2649 8093 -6702 -43033 -62667 -29652 -11470 -11890 -21383
13120 -21383 -16606 -2858 6280 3590 19731 29241 -21111 -14941 12785 30353 20346 -7167 -10864
13107 -10864 27689 40168 65968 57124 47108 21338 -157 -12786 5902 20892 43582 47925
13095 47925 47662 24840 9629 27528 32588 41557 41066 59342 40909 12817 5257 1253 5093
13082 5093 -1480 -2139 11665 22730 5233 -22647 -23738 24981 63573 72310 52756 43179 4242
13069 4242 -5757 2742 11899 17236 19448 20560 16974 31949 59710 57397 52624 68362 38554 6787
13055 6787 -28709 -52367 -23189 4890 21484 29519 42133 30446 49609 14277 6188 7575
13043 7575 -5036 -21838 -18965 5585 4175 5274 44030 40461 35243 29081 31054 42550 34980
13030 34980 40808 30683 33299 30111 32850 10266 18049 37250 27042 26342 41279 83127 70523
13017 70523 69769 31111 18517 -19009 -22836 16430 31386 30696 25063 23179 -8861 -17443 10903
13004 10903 18616 18376 11832 27520 8849 1708 9426 26487 27729 53136 41892 9512 8391
12991 8391 17001 21710 37958 34027 32055 11762 -9538 -35976 -61244 -57647 -52785 -41185 14294
12978 14294 61225 50040 37901 41737 40237 20567 7664 14928 44591 38270 35040 21882 16783
12965 16783 47927 54017 55509 57375 58036 63738 57139 20318 7170 -18037 -3580 11949 9722
12952 9722 6540 11315 32610 23144 2644 11081 15097 28291 5939 -27110 -19800 -12956 -15421
12939 -15421 3761 -8749 -19860 -24522 -22146 5155 21893 26632 30960 28217 -11582 -30907 -6244
12926 -6244 -261 5354 7875 22843 59210 50191 30632 16228 21132 51340 71022 55243 34536
12913 34536 25029 24048 19042 23058 66723 69759 78438 60805 33101 16191 28003 -1005 -9935
12900 -9935 -14101 -216 32250 21104 1191 513 26494 50637 35506 5059 13131 51406 73106
12887 73106 54784 27936 40948 63996 56877 65405 51436 56832 78896 69109 57842 46074
12875 46074 39865 -12497 -16894 -9177 20587 21520 10304 29829 16847 4582 16883 38356 28242
12862 28242 27105 40045 12563 10614 27217 39880 32803 13948 13109 -1168 15703 11542 36851
12849 36851 47586 54234 69093 99106 92799 96238 100292 118085 108394 82408 76725 62809 57532
12836 57532 66341 95703 90326 72835 52534 22708 52631 69689 62984 78645 78818 67703 50347
12823 50347 41460 47808 49401 24144 21812 5252 -19418 2111 39658 56164 28552 34847 86371
12810 86371 114647 98163 74220 72875 59863 45643 37750 47490 59798 40536 43797 41645 33313
12797 33313 22754 -2715 14337 -2169 10224 34492 16391 17444 26444 23420 46053 35470
12785 35470 44431 55473 22897 28203 44482 39925 78783 92161 94084 77845 67515 80664
12773 80664 64787 77708 62982 28379 -1420 28381 43019 41817 30148 18264 16467 34078
12761 34078 36287 51910 66205 69273 47633 47843 48549 50909 35777 30176 61958 58460 43740
12748 43740 66708 71257 61022 57744 62726 77610 93866 85544 75127 79387 107778 94180 82278
12735 82278 83259 70950 66697 67145 37866 13618 32236 55913 53120 31890 38364 22041 27073
12722 27073 42602 29671 27636 28776 22760 21995 37075 33578 50793 61442 69041 74948 77546
12709 77546 74635 54810 34687 63165 81314 23185 19325 55792 44086 49929 60265 76325
12697 76325 70337 55291 63336 73939 78354 89091 93367 67288 57960 45553 26242 32989 40338
12684 40338 42614 47991 29231 50597 78953 58005 47805 34592 36255 42838 33517 54802 66381
12671 66381 89807 97864 70803 67226 64042 56459 33666 37593 42897 17551 -7870 6764 45138
12658 45138 55812 57868 60644 76853 88708 55575 30156 29650 60356 51750 68151 51647 53712
12645 53712 32232 35473 55542 74038 92715 99554 103642 92924 60837 48604 49411 88398 121949
12632 121949 114412 89529 76874 84208 47329 42553 33041 14117 19116 24870 9435 35424 68960
12619 68960 76003 87331 91512 107079 107014 107847 94490 101400 93004 81430 80689 87261 70523 45762
12605 45762 54325 54422 31696 22944 29177 68004 94042 71741 44911 55383 69019 76285 76251 59959
12591 59959 66393 59217 68617 54648 27419 37162 47187 42889 55635 72857 100871 89128 77661
12578 77661 54348 43090 50261 76591 86039 95798 96754 78981 69699 70634 99077 107191 103803 114977
12564 114977 117529 144533 159203 131712 141195 145274 114945 93897 76077 71348 100908 127346
12552 127346 127353 124434 126348 147956 130524 119032 98389 56080 47280 83986 123353 115806 100322
12539 100322 103283 94494 72810 105906 133985 126011 103019 106771 98868 101739 139190 148037 130064
12526 130064 141153 158393 140238 115644 103607 92110 58944 67581 65606 68272 75541 73443
12514 73443 89395 103648 95856 104039 92204 74339 98284 85231 83128 72558 99568 111238
12502 111238 93104 113861 134349 138524 123421 93999 82838 100983 94442 95466 59132 40610
12490 40610 71120 76131 59024 81772 123368 128031 119744 118663 132224 123803 106250 107620 99341
12477 99341 111897 121029 90562 88812 109182 89270 100582 127312 150307 125440 101650 112041
12465 112041 126212 125614 140417 136367 136834 143763 133109 132231 122975 128226 139832 108551 120855
12452 120855 145223 162261 173909 142107 104146 103478 157913 177524 203137 211365 191593 152422
12440 152422 179213 183363 166868 165415 159471 157647 176963 173421 137041 120546 116464 94920 147075
12427 147075 162474 160048 181947 173988 146806 140953 162202 165406 158061 152873 182017 191421 162986
12414 162986 153518 131884 102336 105128 134283 148177 191652 213796 180960 161379 182851 173771
12402 173771 166069 181021 200743 201062 183925 183941 187123 198053 186744 147326 143052 152709 179231
12389 179231 201604 208112 242821 262745 243940 211734 198883 162053 167821 188708 200729 205077
12377 205077 217938 231310 196846 199688 217458 262212 238221 218559 214915 217191 208493 196514
12365 196514 171853 157863 162237 167181 200437 201053 208732 194642 222680 262293 279410 233714
12353 233714 218089 216037 214699 188954 147700 141048 185150 208838 219446 211028 213186 197816
12341 197816 221199 234450 222196 209598 221936 260032 265346 248805 247282 244934 200183 167248
12329 167248 180657 184677 183826 185049 180246 169061 206830 219535 227326 248112 245716 235210 229434
12316 229434 231876 241360 252938 279598 318096 313257 277588 242276 201776 187258 214848 213919
12304 213919 238375 267278 270038 270410 271329 252316 223336 237022 245089 229754 233753 249751 299669
12291 299669 330247 307499 296108 300475 307779 327403 336615 314490 283315 261416 287030 307548
12279 307548 294897 305743 321718 328855 349350 348190 369437 358742 345422 335791 319766 364787
12267 364787 404119 399783 367401 327042 363303 371036 356483 356633 356963 353878 345482 386184 389444
12254 389444 368147 370492 347064 347504 345765 367976 376975 386797 397299 408799 410960 413622 396947
12241 396947 379698 379464 420882 439684 411955 402056 405612 411132 411108 420681 435657 442565 424549
12228 424549 423410 431594 442829 448641 466970 489138 500287 498900 495915 481087 472327 475099 497139
12215 497139 496350 509883 507959 502801 526022 507812 509227 507713 502118 516321 500684 489589 491915
12202 491915 513292 506135 505591 523473 522120 526189 527610 561550 583842 560339 572033 566618 564966
12189 564966 545741 582939 640082 639501 652285 605999 610964 653826 662106 649016 644553 661140
12177 661140 657425 660653 650317 649751 677124 706532 690485 694001 658892 643862 644506 678621 713466
12164 713466 744398 760211 741918 735259 718758 725069 747141 738845 748873 762695 784155 774615
12152 774615 765339 777312 784419 784441 778761 782048 775586 778157 785008 806487 866329 886695 877323 883902
12138 883902 911504 879478 871258 877471 898460 893970 889533 889575 908418 931384 924374 916402 940639
12125 940639 979355 1009975 1011602 1004830 1030811 1040209 1045929 1043295 1043750 1035071 1029334 1034385 1063063
12112 1063063 1078505 1079080 1076917 1095984 1115846 1131351 1157172 1177620 1181438 1185656 1160775 1173930
12100 1173930 1168701 1149279 1146147 1174681 1204953 1233161 1221542 1227504 1261671 1286293 1306563 1311588
12088 1311588 1320240 1332331 1374124 1414087 1405032 1392558 1379063 1372770 1387851 1419039 1474640 1486708
12076 1486708 1499996 1534751 1540047 1512434 1540736 1557557 1567557 1597838 1641708 1672957 1671612 1670356
12064 1670356 1693101 1714972 1736353 1770635 1799327 1825213 1836027 1827759 1821468 1825231 1862635 1882775
12052 1882775 1901939 1943880 1947186 1967687 2007680 2054906 2111729 2124867 2112206 2127616 2148683
12041 2148683 2176937 2181693 2196674 2215504 2222976 2252300 2300902 2354906 2393875 2391285 2389316 2409329
12029 2409329 2439851 2471840 2502178 2525598 2557646 2602843 2637520 2653642 2685549 2711298 2747380
12018 2747380 2763378 2793191 2846055 2912920 2931057 2967093 2986344 2982916 2997182 3021937 3092113
12007 3092113 3104629 3128789 3159727 3204039 3232096 3259368 3282046 3340202 3394412 3425118 3472121
11996 3472121 3507841 3535144 3572637 3609048 3647836 3654836 3660264 3699847 3752372 3789174 3824142 3878811
11984 3878811 3915201 3970650 4014012 4021075 4057442 4095103 4145049 4171789 4215175 4215239 4250564 4331695
11972 4331695 4388336 4423171 4464487 4518290 4550981 4561314 4565774 4597242 4610013 4642626 4683981
11961 4683981 4723472 4741663 4756296 4793163 4829148 4857631 4877245 4896606 4916088 4937878 4972018
11950 4972018 5005487 5001044 4991661 4988883 5002881 5047555 5070638 5111838 5126289 5108666 5077858 5059557
11938 5059557 5085064 5105592 5109825 5107903 5108417 5093215 5083085 5069884 5080884 5068960 5084601 5089930
11926 5089930 5088177 5100839 5088170 5086104 5076102 5060667 5040437 5026692 5032687 5028480 5014315 5010429
11914 5010429 5029810 5024537 4984937 4942453 4929623 4946637 4991988 5047774 5106728 5246234 5467534
11903 5467534 5758945 6035939 6219043 6220279 5978349 5601961 5289009 5058322 4872994 4724510
11893 4724510 4610058 4511288 4438283 4361965 4311558 4224962 4167444 4114983 4058781 4012110 3967374
11882 3967374 3928859 3893366 3860314 3829325 3802744 3783943 3747874 3735688 3708375 3656941 3590328
11871 3590328 3540474 3506718 3438437 3411218 3388846 3367810 3313853 3295140 3269378 3225185 3152859
11860 3152859 3109083 3110659 3098184 3071711 3015121 2963701 2961434 2922981 2870539 2848348 2818287 2797575
11848 2797575 2771847 2726382 2702654 2677595 2640742 2604391 2565513 2535593 2505861 2510119 2493407
11837 2493407 2461752 2451304 2462653 2451630 2422119 2383084 2347749 2319268 2298119 2270636 2248709
11826 2248709 2222816 2211612 2172864 2132448 2107638 2056727 2023364 2018553 1993457 1956063 1943882
11815 1943882 1932720 1924454 1921191 1870284 1834583 1820219 1824373 1844091 1838345 1812744 1780139 1783743
11803 1783743 1763347 1700494 1685002 1663156 1652269 1640630 1626019 1617567 1603497 1579600 1530671
11792 1530671 1484740 1489926 1477695 1465416 1480769 1495356 1439343 1411507 1427740 1389894 1354365
11781 1354365 1339325 1336493 1341896 1319002 1304258 1264592 1265750 1276449 1282014 1275403 1277858 1235921
11769 1235921 1201544 1202753 1201598 1192440 1182701 1187102 1169310 1156677 1147006 1086624 1042210 1039415 1087928
11756 1087928 1102637 1095952 1106026 1094266 1109980 1101206 1059570 1061761 1052253 1022741 1027440 1033851
11744 1033851 1108533 1157231 1194684 1251195 1293995 1263911 1218091 1187246 1134620 1048664 992276
11733 992276 966660 894247 846306 843751 860621 859715 859278 870772 868205 857415 841224 838301 820938
11720 820938 790425 820216 829366 831184 793067 782419 767841 752783 740374 734893 730438 739962
11708 739962 722113 701613 714559 723955 721494 728264 734375 704915 696101 682969 661157 668160 658253
11695 658253 650180 685266 697935 667053 652599 652865 648758 676893 683775 674772 646778 642563 636884
11682 636884 632038 630485 643553 600128 577128 571870 571580 559893 546299 532049 518416 519973 576401
11669 576401 598946 605620 594214 600483 618803 620203 600335 587500 593098 572861 538805 498841
11657 498841 471986 490904 511601 507893 483527 462671 435041 467654 488324 509950 538137 525956
11645 525956 518412 510894 514577 537664 544614 547376 530102 506704 508274 517009 481752 462980 442978
11632 442978 428597 439777 452905 442454 414342 419493 437732 448651 478664 510518 511794 500250
11620 500250 508532 496637 487184 458343 404368 320189 208776 100941 34807 30791 62913 121235
11608 121235 164830 188263 216143 210227 218820 208144 219844 235908 272871 294506 303918 279523
11596 279523 250529 237715 262373 282746 297693 309671 298607 277788 318897 334434 310941
11585 310941 300480 279800 286973 294310 297143 317028 309302 310052 317877 312028 318932 325552 324908 318867
11571 318867 332609 345832 317074 305605 318269 331470 341403 364435 353903 359660 380089 379727
11559 379727 381851 401019 413040 407570 401415 402236 414122 442811 432302 439781 456875 457841 477239
11546 477239 486530 510008 518915 538260 528705 560672 617838 629811 666105 654966 662311 700171
11534 700171 748245 813247 838806 892612 947522 1008893 1061786 1085089 1109590 1151641 1156322 1222742
11522 1222742 1315985 1388493 1461311 1555463 1697626 1815306 1959644 2134326 2362529 2641910
11512 2641910 3033467 3552351 4212613 4951266 5697297 6312226 6736381 7017789 7382143
11503 7382143 7963695 8807465 9991903 11636459 13820927 16522682 19832366 24000802
11495 24000802 29617388 37695374 49963772 69064711 99085428 145163116 209848529
11488 209848529 281080879 328305278 330656045 288326342 219540422 155011633 109548286
11481 109548286 80239716 61250888 48545122 39821270 33562539 28725797 24755984
11474 24755984 21331154 18409686 15960236 13954657 12314385 11086552 10190272 9586253
11466 9586253 9202313 8807304 8283001 7592717 6823633 6085041 5471175 4998399 4596309
11457 4596309 4251749 3960287 3716450 3479481 3253855 3075578 2917903 2726564 2567030
11448 2567030 2415367 2268303 2149856 2049724 1978888 1918317 1874673 1802261 1741612 1717626
11438 1717626 1670838 1608020 1532725 1453078 1396348 1384008 1352595 1302850 1283647 1270538 1216706
11427 1216706 1183960 1180994 1147326 1137271 1113987 1051478 987773 953650 954260 916294 897134 906497
11415 906497 876039 851347 831655 816351 829719 811305 798852 820455 832873 817049 788323
11404 788323 730889 696019 652074 647715 681229 697598 700277 674773 645053 628586 622021 607499
11392 607499 624223 628331 624680 605985 601391 601810 602368 587244 581494 565617 562940 551286 528137
11379 528137 509980 506346 505771 526742 572507 589677 601690 624673 637035 632762 593805 614272
11367 614272 626363 649946 676011 736830 823279 936735 1032591 1064072 1004601 880556 728106
11356 728106 647090 590219 542874 520165 460700 399833 415670 453289 442171 427816 409480
11345 409480 395796 373194 355818 375099 371154 352505 332451 323680 312020 308147 306491 330782
11333 330782 332423 305984 266990 246450 237575 219253 222048 246355 271735 281603 314889 330831
11321 330831 347502 363667 383995 363412 343072 330217 356711 338936 322036 314534 287579 278215
11309 278215 265142 257200 258761 252598 226346 224886 218768 207481 254222 281266 301051 318733
11297 318733 303582 330663 317911 255158 191768 174909 175636 191894 199906 201655 208476 192131
11285 192131 189126 201259 194222 179811 172601 161145 184073 208294 193610 190175 197883 169901
11273 169901 146550 103014 101359 111333 135122 138946 117261 134729 170117 193585 187295 185359
11261 185359 188489 209166 250327 228516 230012 236136 210540 189383 166971 160067 168432 171110 154645
11248 154645 147527 171667 203219 223084 234113 247586 250940 196007 158447 194379 212382 217471
11236 217471 215141 194799 187811 205365 185593 154444 143586 135213 113967 100589 93286 105443
11224 105443 141337 167431 160220 156395 155681 158558 158031 170886 181074 205070 185461 168613 158333
11211 158333 167758 188320 199282 228940 220771 202828 184584 177677 154005 123515 130258 115680
11199 115680 123515 109631 129670 139836 140246 125751 110303 92357 78315 62962 76279 82114
11187 82114 65775 83015 96540 111161 116417 88651 91600 103629 105253 106931 138072 132974 119110
11174 119110 88592 63024 89163 113757 108366 93779 102989 112794 131290 121612 100693 81153
11162 81153 82946 86997 105144 109579 84093 64166 79753 82985 106274 94468 86118 102301 94717
11149 94717 77561 100159 98035 96444 102373 103749 105288 122084 127190 142029 146977 117676 107015
11136 107015 123088 118198 104256 89133 69576 102665 136197 139267 101293 89785 90665 105974
11124 105974 102039 83742 72205 97033 97957 89671 77900 63947 68855 121297 124726 121828 136084
11111 136084 138817 121339 140760 145699 143899 143832 118493 104515 88964 106087 116391 86267 92766
11098 92766 105811 117383 104231 86914 91003 84931 103198 111006 140356 132105 109331 107131 103730
11085 103730 81383 79177 120138 158516 163887 169992 176006 186280 201204 225927 257877 304186
11073 304186 394093 484412 656371 928765 1260168 1574994 1765490 1742565 1491841 1162507
11063 1162507 860549 673871 512130 404710 336751 270373 233986 202477 190297 186857 191078
11052 191078 164983 169003 187093 197425 196991 202259 218320 262784 283666 269205 257112 234738
11040 234738 238182 235778 245469 212366 232889 291694 323957 336944 365119 354609 328479 289086
11028 289086 274486 287591 298350 293438 308910 337301 389453 405024 423506 394265 325125 325144
11016 325144 322454 297541 275657 271828 287366 313271 311961 313550 313976 285265 270515 248175 234246
11003 234246 187879 167768 172114 187362 226411 251842 241856 226495 194659 163604 114339 107581
10991 107581 88557 55990 56352 75930 71808 101020 112011 79315 86538 94200 97137 75130 62995
10978 62995 60969 41613 54365 92995 82727 84492 62414 32413 15280 34932 66104 64564
10966 64564 34567 38297 43255 42901 48052 33533 17894 27304 44994 29399 7648 3578 53610
10953 53610 72052 72046 63980 32265 25867 63843 123550 142792 143823 123872 132400 153715 182819
10940 182819 237556 334242 415223 503435 641507 816744 1020940 1196762 1269311 1255700 1228097
10929 1228097 1109537 918998 730332 572214 455316 402421 346376 300054 281420 261878
10919 261878 201885 170975 155854 131967 115135 135668 129359 71189 56258 51609 17943 4731
10907 4731 33158 36674 44879 45688 27794 38627 64149 87385 85238 45070 34438 31933 58275
10894 58275 75934 81640 48623 35280 38369 42282 31185 30461 42911 5895 6273 2203 -32535
10881 -32535 -14851 12855 21533 22626 49527 50807 16589 30071 64345 67262 60591 63425 60444
10868 60444 65583 83044 104413 105028 95006 88595 98597 118520 112106 82516 67608 21955 23590
10855 23590 30625 40425 29513 29421 60971 66108 44724 35534 48760 77159 70160 47760 56266
10842 56266 65771 81466 101014 111763 90230 106411 108324 76322 46246 44429 77253 74499
10830 74499 71040 85171 68733 59285 53418 41513 27391 41399 28665 28520 66091 95763 58729
10817 58729 10234 26972 67888 44312 18873 -14971 -35570 -22619 -40157 -30299 -8232 12680
10805 12680 17390 17333 21854 11911 19768 49925 75227 66045 62664 81075 75321 37434 23806 40572
10791 40572 45581 52404 67826 92019 125088 183983 235947 266470 281351 263616 253112 234702
10779 234702 180789 113707 53395 54197 52872 47840 54274 57448 52752 56165 37872 43247 64170
10766 64170 52690 33522 45962 82042 53642 36051 24718 45945 68770 80253 57444 47070
10754 47070 52101 74400 76301 74870 109051 117545 104446 84567 63522 50434 21843 20859 41186
10741 41186 55786 42571 54714 60580 51309 26298 23479 24664 19137 17505 15241 13464 14444 16629
10727 16629 23485 18234 -9235 -3835 -1649 2724 -41728 -59489 -73206 -71569 -37010 -52460 -72755
10714 -72755 -34973 -123 6979 1056 -1599 8499 -668 -38465 -61686 -64057 -54989 -45493 -26953
10701 -26953 -1422 -2180 -17241 -32975 -33086 -34915 -41544 -16565 -17002 -27590 9775 51746 75872
10688 75872 118903 119931 117871 126760 125262 131766 128046 137192 180225 243555 246269 205144 186778
10675 186778 168731 150326 130274 123396 104060 95941 88083 82265 85094 95874 105871 110119 139341
10662 139341 158477 147466 110462 31894 -29465 -36043 -32469 -57668 -91516 -78296 -49461 -32218
10650 -32218 14691 33793 86890 102718 98253 124874 188076 211532 221504 246773 258395 274505
10638 274505 356741 437397 527367 637442 820027 1074916 1320252 1492874 1575424 1598812
10628 1598812 1629617 1724475 1885853 2160732 2571258 3097475 3829591 4858354 6257226
10619 6257226 8063860 10331746 13158685 16381094 19254904 20797904 20732477 19659322
10611 19659322 18516956 17985082 18386843 19895543 22680134 26999436 32851736 39528226
10603 39528226 45065212 46943164 44563967 40015195 35748495 33024332 32235106 33510550
10595 33510550 36992850 42813083 50679574 59196110 65213928 65310480 59366404 50856004
10587 50856004 43139682 37612226 34423784 33378243 34397047 37295299 41621315 46080323
10579 46080323 48456121 46736939 41232849 34437868 28559426 24379216 21799416 20589576
10571 20589576 20463916 21165269 22371895 23444846 23501450 21979411 19146527 15908878 13052302
10562 13052302 10850095 9275543 8189355 7481869 7025889 6817683 6781046 6936924 7216065
10553 7216065 7618321 8157806 8698296 9199047 9788127 10472243 11202949 12122565 13350915
10544 13350915 15012469 17193495 19946565 23459132 27939587 33820517 41862759 53153828
10536 53153828 69354343 92632778 125060734 167266308 213552318 244498889 250389815
10529 250389815 247584318 233074769 194176957 148240800 111853279 86044266 67957782
10522 67957782 55067521 45613052 38500686 33058873 28725632 25100678 21906813 19202967
10514 19202967 17018066 15241669 13790756 12654879 11737200 10931915 10177570 9470014 8739565
10505 8739565 7997884 7300208 6672958 6126295 5693952 5340276 4993479 4672655 4389691
10496 4389691 4134958 3901381 3684676 3496298 3344888 3187034 2996607 2846293 2710242
10487 2710242 2605129 2542771 2437049 2335498 2263329 2160382 2045949 2022525 1984023 1949003
10477 1949003 1918032 1895535 1843690 1764700 1727876 1678125 1618070 1578612 1536033 1500990 1488832
10466 1488832 1442437 1404590 1420091 1376910 1333961 1281388 1246756 1199141 1176793 1187594 1171316
10455 1171316 1144188 1122862 1121271 1096988 1057615 1025638 1013336 975245 947155 967729 967204 943546
10443 943546 922520 908866 894613 874593 854899 841695 776387 699984 693525 702005 715704 709599
10431 709599 696663 701348 685010 689796 695944 696157 715190 714111 689915 667309 665327 657294 658442
10418 658442 652551 616697 618932 635331 648263 648771 640202 684281 746759 773321 812278 904825
10406 904825 975193 1042204 1062396 1042907 1020544 954301 834419 748056 685878 623945 593677
10395 593677 561148 531714 536953 538853 515616 512904 517496 475069 455360 443017 397546 404260
10383 404260 417705 388539 346523 328835 333108 335800 329312 327443 349575 353829 339204 335783 339403
10370 339403 350825 404025 433992 412981 375957 353660 359536 367556 343394 320848 326135 301123
10358 301123 298205 313395 342484 352816 328146 293342 285863 300054 302518 324245 327304 310562
10346 310562 299555 312264 334235 353593 339838 335638 353781 342655 322310 297912 277272 250126
10334 250126 257812 272208 279744 288210 263737 250269 248165 247074 228181 228017 215564 231847 243830
10321 243830 217379 224811 225082 206795 161740 152852 183830 201988 243482 240110 226984 243869
10309 243869 274017 265284 247318 254724 252743 230799 214076 216770 216731 218621 224802 227135 191601
10296 191601 164500 179582 196589 230527 199256 188987 162555 178208 221870 228775 207879 185725
10284 185725 183989 186580 195797 182172 185404 215207 253962 256096 242326 223494 214890 218889 196703
10271 196703 201825 219201 235831 249261 200033 196262 212048 203809 196663 171423 128263 112238
10259 112238 119197 139991 158023 184657 165279 147228 172034 164918 150524 171301 161555 134385
10247 134385 136673 137616 120692 121557 136043 134650 145677 130941 127651 147650 162277 153023 159083
10234 159083 161355 177317 165245 158730 165897 122429 121650 139033 144471 142082 154084 139852 108487
10221 108487 119802 136116 149381 133673 119472 74926 53730 102103 133992 152471 146636 154520
10209 154520 147934 117209 131215 164830 183410 173347 160556 172345 169758 160760 157946 133378
10197 133378 134301 139432 146124 188306 223826 222785 257272 293844 373016 460861 552254 690156
10185 690156 768048 781672 778547 728375 632819 544307 492318 430682 400075 369205 344275 314295
10173 314295 310510 303432 281569 294004 337487 369030 402017 433939 440986 415558 387101 354953
10161 354953 352600 350171 341778 367879 392352 431072 487375 533835 524413 495108 435193 387751
10149 387751 356733 339712 344953 351699 364724 395486 422976 413635 427769 407651 356269 305388
10137 305388 296407 306803 343633 355510 375511 420789 466431 514507 602334 681671 832515
10126 832515 1017747 1207323 1365392 1371999 1361749 1275622 1096858 905351 729284 604609
10116 604609 499380 409903 348952 309272 296380 286141 254986 229018 222392 251059 226219
10105 226219 178389 155452 166964 172164 155590 183782 185942 142794 110954 86255 94762 96349
10093 96349 125489 109537 111323 119905 134555 142000 140357 118617 119006 148380 150735 130642 139712
10080 139712 157758 114217 90149 81655 67510 74193 129906 138520 102814 76838 53014 92484
10068 92484 114076 84551 25843 4871 35164 68710 89632 108662 95457 79055 81109 84024
10056 84024 59920 18651 4423 23405 31151 19009 28266 48483 45350 83342 88797 95710 121616
10043 121616 92971 68240 79060 79595 87554 109209 113291 97301 93141 81674 69116 57665
10031 57665 55498 68022 67239 49671 20343 17772 34794 55190 83201 88122 66851 62299 67508
10018 67508 64048 70370 89576 97321 71653 56046 49378 57996 83405 103880 97893 96049 86657
10005 86657 84502 69354 106607 106328 88915 77263 60255 61174 47892 55419 62933 58698 39509
9992 39509 49883 66495 75364 58409 54632 58253 78831 68891 57454 48532 61529 67582 55703
9979 55703 58268 56473 72105 70778 84055 63835 55134 54098 70750 82142 79764 52172 91820
9966 91820 84355 66045 61134 76606 68002 49176 54221 23760 11541 36298 80741 96350 70534
9953 70534 66698 79033 85753 72165 47106 32034 52245 62130 67493 48983 41846 41623 51321
9940 51321 66272 42657 16697 3087 33969 45176 58047 45883 1182 -3073 57115 79203
9928 79203 100763 127924 116659 90133 74980 50044 70639 80113 68497 51525 64919 55805
9916 55805 48753 51970 46808 48212 31935 23607 3753 -12818 14722 25327 35552 64116 71614
9903 71614 85095 106195 91295 82275 99581 133360 83838 23344 28614 64481 66168 63301 65888
9890 65888 38939 31099 42884 55840 35650 10733 22516 70230 91142 97977 70173 53703
9878 53703 33736 23513 31486 23662 11190 893 29177 42449 60243 65634 53108 35347
9866 35347 70277 90949 90809 93037 85943 91913 102670 110368 109784 118566 107990 102336 87724 84740
9852 84740 71465 37226 66586 84924 85343 88665 102958 95465 71664 44758 60002 58527 59149
9839 59149 80270 69928 44163 41762 34711 29224 25091 57311 83176 76573 39774 56271 58097
9826 58097 60771 55798 43367 42420 71822 56376 52695 36554 38554 47002 52668 47978 49869 57220
9812 57220 64108 77803 72889 86866 65284 65555 62852 76589 69116 40506 62964 72762 71872 60135
9798 60135 43850 38821 26341 47345 49637 48864 43362 75255 60101 61728 79041 68281 83975
9785 83975 66576 13122 847 37796 73115 86135 115757 122775 105270 62357 34644 59535
9773 59535 43293 69159 92139 90155 78722 69578 65578 76793 63069 57695 74315 76811 48365
9760 48365 27462 33631 30185 37174 40251 38612 14901 2812 49171 49816 44740 38844 25252 -6787
9746 -6787 15891 54023 67383 38747 31487 46924 58811 65376 44358 46381 48295 37460 33536
9733 33536 52216 52517 26782 13311 24750 34291 35973 23288 24466 2568 -525 -3052 13785
9720 13785 33205 30918 13077 20643 22555 27784 32090 6898 11876 7670 42467 75233 92633
9707 92633 124006 104971 82545 43794 47919 63906 47718 37621 39052 46935 58128 61518 56389
9694 56389 76882 75290 55151 67281 61308 54838 33933 55528 68675 60815 48173 49294 52357
9681 52357 59017 62084 26567 -32918 -21099 11600 6190 -7544 137 -4695 -4613 -30816 -28454 -15026
9667 -15026 917 30319 41857 31254 19882 30324 32407 10769 -33574 -2304 21781 13541
9655 13541 34528 71132 115198 141603 153161 197261 208119 150118 111798 98462 43996 35884
9643 35884 45413 36558 39731 62816 45578 52148 70052 76213 48936 62055 75715 66463 45427
9630 45427 42872 32767 26877 44821 64671 88650 65201 76391 109963 102639 49456 28936
9618 28936 41277 37124 31196 40424 38182 25535 35305 28450 42936 65405 75953 62688 14468
9605 14468 19090 50639 40740 37497 57851 47111 53606 45087 33081 21714 16201 -668 -9117
9592 -9117 15774 62519 37591 13191 14753 43444 30329 36830 25719 -13299 -33779 -7725
9580 -7725 47535 66767 71642 67798 88377 115104 93416 63831 53252 39109 -2714 -11615 39765
9567 39765 27943 30694 48337 71427 62923 12339 -1508 -10462 8569 18343 11003 31903 34588
9554 34588 47297 77480 76635 28632 20077 26196 17182 3997 -4580 8063 45575 31158 -11153
9541 -11153 -7097 15569 10699 10595 14071 8327 5482 22169 21379 25861 36348 62851 58243 41641
9527 41641 57110 59434 62795 63846 28802 14314 27776 30236 6992 18748 48412 29271 40437
9514 40437 30910 14774 -536 -3156 19018 40786 28709 9404 42873 69512 46096 12769
9502 12769 7085 8735 -19256 -23020 23422 39042 9293 22384 9328 8869 8346 30941 28966
9489 28966 16904 -423 -10043 -11106 -10239 -28435 -42349 -11467 25906 56251 57004 53061 51488
9476 51488 48308 52656 53863 57252 44701 48959 37898 18827 10041 -16484 -3200 31283 68254
9463 68254 63418 31455 29865 23456 23243 13627 41767 48207 13500 13408 46429 55124 37643 18645
9449 18645 11466 -3268 -13265 15423 20148 18240 26908 41916 15529 3587 -643 -33693 -24177
9436 -24177 -1536 6757 20244 55630 50288 10960 -24452 -29747 -24625 -21145 -24180 -16257 3565
9423 3565 56082 42357 25944 5614 -18448 6226 29610 14717 3723 24067 33838 8414
9411 8414 10084 45880 75787 80029 61498 54196 48849 56230 39254 26070 38401 53834 51667
9398 51667 57976 80721 73176 70052 85495 71376 65302 74637 42187 17488 21190 29278 14477
9385 14477 29146 39895 23970 42781 59093 58970 37464 15981 10054 22752 39859 40395 21557
9372 21557 12501 16364 29198 45982 33479 26973 35135 31631 31542 35434 30485 42226 40380 32668
9358 32668 53439 42535 34141 66679 78249 69525 10721 -3379 26698 25638 27481 28821 15376
9345 15376 10466 23119 3465 -24495 -18786 -24509 -25181 -38692 -18699 9067 9572 17535 15369 34935
9331 34935 56024 34337 -3143 7751 27860 38176 34920 29940 25898 23537 -13835 -41350 -15905
9318 -15905 18420 45415 31996 -10990 -19632 2480 23352 43787 45672 60970 53936 45850 55371
9305 55371 57703 12499 15173 26509 41470 35007 39045 38233 44772 44346 55068 98438 90596 64351
9291 64351 39914 26301 12888 44104 70894 97191 81909 51809 67553 67227 39768 -4741
9279 -4741 -11965 8865 25726 25323 26843 13829 28871 35604 23847 26429 19511 -28742 -37562 -31737
9265 -31737 -50728 -54959 -26248 28410 28660 26152 32512 31519 36017 -14969 -33130 -296 20471
9252 20471 11248 1165 17283 36034 16126 -824 -17757 -12944 12853 9243 37290 80113
9240 80113 94998 66251 30756 38587 18266 2451 24040 37919 40618 33277 31434 16800 22290
9227 22290 20531 -10055 -19897 1724 18119 10155 16594 23735 32133 56593 41188 36357 39929
9214 39929 27632 17438 -3847 -16858 -6908 39090 42218 15643 30248 51124 49157 18792
9202 18792 17716 18405 22114 35877 47072 26998 24060 13111 11685 31190 42207 33358 6193
9189 6193 -16713 -26683 -14320 -17004 -4985 -24416 14660 45780 30650 37305 49952 58246 35672
9176 35672 48778 53228 31792 53097 49979 43815 52539 64316 51112 43614 36333 38475 28039
9163 28039 14160 44545 72393 72907 30695 -10673 -17031 13087 -6791 -2745 9617 17844 3563
9150 3563 45246 63440 38105 34336 41748 8461 19224 24460 13470 25917 3681 -6944 -15537
9137 -15537 -6799 23289 32395 23062 -14422 -50397 -21963 16502 42300 38331 49150 44988 41871
9124 41871 6000 -5278 -8631 -26819 -22663 -13689 -37783 -42688 -20839 -9998 6307 -15329 -23516
9111 -23516 -18858 -18722 -6098 -20257 -18051 -18115 -23820 -30442 -15917 -11045 14313 26106 9428 16445
9097 16445 21679 14894 -15838 -34426 -38677 -722 21158 20738 21028 366 10342 22258 30487 38996
9083 38996 41343 22400 22440 18599 16335 13662 34200 55437 42073 41076 38251 -5170 -34635 -54959
9069 -54959 -43531 -22064 -18893 -19999 481 4546 2760 20200 15754 4759 -1442 -4887 8982
9056 8982 53222 49547 8246 3467 -20241 -30934 -30421 -26112 1944 27229 15945 -2603 -10980
9043 -10980 1290 27163 18426 2148 24673 18213 -25677 -50874 -28255 -1696 39923 57889
9031 57889 32444 5781 2577 22267 -6090 -10061 -14502 -250 -11714 -18248 -12295 -2631 -4784
9018 -4784 -9026 29984 43290 42775 34381 26730 50202 68497 83313 44846 28999 32073 2239
9005 2239 -11199 2215 3590 4315 17542 19489 -22623 -36196 -37464 -44401 -37330 -22420 -10330
8992 -10330 -18982 -21974 4422 40051 44814 46320 30559 20041 17424 -2423 73 10744 -21041
8979 -21041 -30644 -20633 -1827 5387 16071 19881 2638 -18421 -31270 -15842 20622 31090
8967 31090 26311 12469 1972 -17281 5942 67646 74876 53769 20432 15180 3581 22279
8955 22279 41131 29242 19903 -24960 -35786 5816 54420 29458 -9531 -14222 -7093 -6343 2271
8942 2271 16378 38879 33124 49728 26318 -19340 -22816 775 9605 32940 28105 38039 25267
8929 25267 1336 -2503 8800 22960 40960 26195 10986 -15659 -15242 16233 22014 27816 19320
8916 19320 14323 34819 29365 13603 7904 23624 55201 34498 -5091 -27890 -20103 2677 18700
8903 18700 16191 -5019 3143 27416 3686 -8571 24120 54367 52688 33736 7391 -8457
8891 -8457 -21216 -28565 -11411 11272 -5947 13760 28769 32996 -621 -15872 -14837 -24036 -23602
8878 -23602 -13750 -11564 -17946 -25106 8334 42373 14534 -2871 5641 -5193 -7407 360 42950
8865 42950 63922 53487 57363 42466 36132 -34032 -59420 -31483 26084 35308 25888 15200 -848
8852 -848 -37283 -58559 -36011 -35154 -46339 -27391 -11671 -16272 -16236 -20666 -34879 -27954 -21219 -12890
8838 -12890 -13587 -11568 12765 2333 24960 22413 6493 1105 -21079 -33515 -23872 -10121 -18003
8825 -18003 10071 14098 -13900 -28244 -3428 48791 56153 50197 63608 60400 23102 -1424 -19607
8812 -19607 -16144 21438 50542 40330 13220 24458 50164 56826 30969 1300 13769 39816
8800 39816 33968 21450 -10036 -35884 -11743 -11268 -24659 -30301 -32575 -13207 -18863 -15697 -26436
8787 -26436 -19913 -19710 -26895 -12858 -8913 -535 -10 -29829 -44833 -54152 -52794 -43621 -25854 -11783
8773 -11783 -7504 3259 -19436 -45478 -45324 -10105 -403 -16974 -61210 -26816 -29094 -33973 -29728
8760 -29728 -19161 -8486 -3429 16740 39773 40561 21087 -2123 5158 26412 23948 4089 3866
8747 3866 30855 49377 28345 34663 25082 14264 45497 41273 -16794 -36665 -47637 -17468 -9584
8734 -9584 -18651 -17516 -1769 18594 13721 5740 5550 8221 -12112 8523 21319 8961 16935 9976
8720 9976 27939 2618 -8033 -1065 4981 -13798 -14082 18404 2101 18059 38628 43666 38361
8707 38361 13171 9714 13294 17518 39497 54375 38111 30013 -16395 -18291 1449 2674 -15666
8694 -15666 -11911 -2160 -8726 -16971 -22973 -12739 -24993 -62145 -53399 -31199 2663 36969 19329
8681 19329 20936 12816 1197 -2851 -10756 -6089 11101 19450 30270 41245 34936 34905 878 -22939
8667 -22939 -39202 -37785 -50581 -20473 14360 5272 -8204 45192 77636 54484 28627 8522
8655 8522 -14164 -41834 -26665 -16344 3177 4928 -2656 -12609 -32967 -15221 8270 -13039 -42403
8642 -42403 -36642 -7583 -23658 -27611 -813 14539 -10703 -57736 -62339 -38513 30035 48831
8630 48831 66872 66752 50505 21067 -21422 -25797 -14599 -5231 -11829 11109 25348 -12159 -25245
8617 -25245 -21317 -17325 -10267 20663 54898 49236 29199 27114 29897 11840 2777 90 25765
8604 25765 27736 14700 29568 32045 11009 731 11778 16517 -11488 -28326 -30094 -21080 -22245
8591 -22245 11805 52132 41923 10442 27910 27400 -19415 -54336 -48603 -20622 -5558 7400
8579 7400 36860 28686 -3761 -44151 -17678 21471 38214 36663 45155 24585 15788 27693 22718
8566 22718 39717 28863 30445 29327 -3017 2107 9362 36793 19396 -7731 1342 -4936 -854
8553 -854 640 -3245 -6801 6072 -1678 -19879 -5769 12442 14181 11814 17233 8072 5889 28575
8539 28575 20661 3744 4953 5094 10457 9503 29453 29027 33495 51848 72661 42521 4680 17558
8525 17558 20902 6658 -8788 14989 22171 49524 55181 29151 -18633 -52408 -36114 17913
8513 17913 25803 34194 27876 25222 36106 23325 44914 46650 44462 40042 52911 74190 76990
8500 76990 21084 -3059 -7299 -2992 -11474 2827 -18477 -40288 -32929 -30576 -30795 -28888 5227
8487 5227 36834 48020 48299 38431 35691 30906 20172 14458 -10171 -19215 -20608 -23383 -22712 -13500
8473 -13500 -34263 -54529 -49729 -60862 -39193 -29212 -38540 -51324 -38820 -15084 5652 10062 -748
8460 -748 -310 -706 -24068 -14835 -1802 -17748 -44299 -48381 -53013 -57066 -36283 6367 38817 53977
8446 53977 29748 238 22988 43595 38906 43843 25851 14220 32011 42428 55485 51450
8434 51450 25842 22362 24766 7916 8309 14416 -11507 -21474 -16430 -6726 -11393 -16822 -1013 17469
8420 17469 8761 -8378 -11073 -9010 22519 25423 8577 -26565 -48963 -52199 -10472 14837 35545
8407 35545 53379 36210 30328 9803 10426 14392 -10117 -38964 -46791 -42287 -24103 5479 30831
8394 30831 31744 18325 5402 11406 26588 36642 28756 -3949 -22245 -18769 -34926 -34204 9789
8381 9789 33059 28360 12431 -73 -3263 -25904 -38448 -19278 -23584 -35455 -17978 -15207 -6651
8368 -6651 7730 -4446 -9722 -9498 -9123 -22073 -15862 -18411 -12092 2738 2292 -25722 -35221 -49159
8354 -49159 -9819 4458 -7451 1186 21484 1650 20946 55712 41636 18454 493 -14055
8342 -14055 -12938 -11515 -12734 30457 57894 53813 39646 11998 -3649 -10046 -20483 -20640 6725
8329 6725 24591 22352 -2239 -19463 -13066 -968 9790 -2675 4328 -14655 -13385 -2890 917
8316 917 15824 8469 9808 15587 2139 -3292 -3890 -31442 -7141 43103 18807 -16496 -7961 34898
8302 34898 56396 50828 39482 45389 38736 52572 53214 37495 32885 47912 41885 59779 52524
8289 52524 53999 25085 15615 9880 4356 16177 -1689 8025 24718 41603 27346 25895 8589
8276 8589 8336 -8584 -25976 -15402 3207 12269 6141 9826 5151 -4770 -16639 -41704 -53057
8263 -53057 -33139 -41395 -36270 -8655 -10837 -18896 -15834 -2545 12290 7551 9991 74 25456
8250 25456 82196 84290 70087 39119 42565 38086 -2819 -20354 -22101 -27140 2623 -20227 -48495
8237 -48495 -33546 -32095 -26541 -9204 -1902 32 3465 5654 16839 17440 -321 -34260 -18261
8224 -18261 9132 -1101 -13616 -4816 10946 38862 44221 39816 36810 59188 36486 5059 21933
8211 21933 29778 3723 -23001 -16692 5349 7739 12584 -21352 -54297 -49102 -36427 -15260 -24993
8198 -24993 -15117 -18968 -20668 -31104 -47945 -27041 -22190 6928 22919 5551 3292 -4392 -1581
8185 -1581 15169 38194 63605 56690 16782 -3435 -3552 5303 -8545 -46783 -78348 -73832 -40486
8172 -40486 -35316 -44216 -38334 -24722 -11986 -6500 14438 40708 29022 25754 7551 -26103 -15724
8159 -15724 -1282 5206 -15244 -24908 -32164 -33391 -8586 126 -780 -23967 -28115 -5892 15095
8146 15095 12347 30097 35587 21341 6752 -28503 -14942 -17578 -10952 19464 39274 29716 28027
8133 28027 14489 17102 2649 619 -9176 -29993 -35065 -6239 21869 41536 31653 54490 66057
8120 66057 37471 19484 3634 -22178 -27121 -6478 -3428 -743 -7492 4774 14728 43314 75810
8107 75810 55034 24732 9876 -5379 4493 14702 -17520 -31374 -5675 -9000 22486 10525
8095 10525 -11419 -4038 -10844 -42044 -19496 -8365 17270 6747 17298 53281 68568 44296
8083 44296 3343 32512 44117 36136 13149 -2917 8456 3504 8574 20440 34122 32641 -522
8070 -522 -6256 11416 36165 30256 15642 -4429 7778 11086 2742 11961 7636 -20295 -43165
8057 -43165 529 5418 -12026 -15512 -26486 -26311 -14844 -15309 7139 37574 48876 15057 31294
8044 31294 57908 65912 34008 40078 49953 63279 36655 4102 -6050 13605 11948 20661 3215
8031 3215 -10772 -38400 -52055 -31161 -26671 -37943 -20800 -7855 7912 14112 -3087 23413
8019 23413 14253 7561 -7571 -6076 21558 23497 2867 38507 54936 33918 51057 40257 -1438
8006 -1438 22336 29707 12427 -18218 -29758 -957 22782 39886 34002 47090 29095 19918 11888
7993 11888 -9592 -39259 -24912 8036 10221 16006 5692 9560 23823 15154 15053 6604 15103
7980 15103 13318 37908 46792 62858 63364 61080 33489 30511 27786 45077 34692 37446 23654
7967 23654 25263 11106 333 -5322 -7809 21256 18780 9693 33892 8583 -15031 -32337 -17543
7954 -17543 -6967 -4413 34928 23141 -17652 -29455 -26637 -11851 -23090 -54651 -52988 -36937
7942 -36937 -2750 16102 -7469 -11297 -5805 -22822 -25918 -6393 -4977 46485 32985 -647 26577
7929 26577 56965 77357 46018 23257 7646 6622 744 -28485 -19720 6892 5078 -1698 956
7916 956 -10705 -37598 -27626 4265 23311 26780 29919 -18545 -44486 -30311 -3203 -6687 -25599
7903 -25599 -11518 -23931 -41974 -35315 -10395 12824 19931 28803 2678 -11694 -35350 -33768 -12895
7890 -12895 -8413 4822 -6420 -4895 17677 22881 10303 -3984 -9131 5737 9948 14031 11405
7877 11405 -18994 -14130 -17351 177 -3453 -13729 -5814 -22414 -25516 -674 -986 2324 -1910 7023
7863 7023 12535 16919 17329 20731 7154 6080 11136 7207 7553 17285 28809 7649 -21923 -16016
7849 -16016 -18611 6207 35321 38833 6333 -7981 -4447 -9585 -2809 1563 -2748 25072 41348
7836 41348 4458 -10717 3358 11738 9730 -15866 -21185 -24303 -15214 9524 -4724 4676 2310
7823 2310 -12333 -11272 -21813 -14385 -604 -5004 11156 38092 60538 50409 31796 17015 2629
7810 2629 -9259 -359 20084 27498 -37064 -48996 -54173 -32378 2102 22744 2845 23109 11261
7797 11261 10956 14298 33197 30594 34376 28422 17860 15780 7075 -3402 -14181 -28129 -35507 -37499
7783 -37499 -16211 18723 11702 18172 8092 3260 -15609 -18327 -14015 -43942 -56483 -24916 -7556
7770 -7556 -1906 -13533 13856 11312 -3100 -7267 2871 25204 34708 7679 14168 36392 23248
7757 23248 17160 2872 1245 -4049 12567 28285 10051 -11620 -2016 32410 51024 40161 42478
7744 42478 48068 18246 11644 -5935 -10637 -18903 9007 25739 11736 -18341 -19881 -15370 4896
7731 4896 20583 10361 -16204 14239 22027 32357 56014 50338 7698 -42758 -43078 -17556 18922
7718 18922 20429 1624 6905 33814 36184 12843 6104 -6775 17515 9623 1194 17404 21493
7705 21493 -6070 -2460 -1304 -16083 -396 30274 44249 26906 1570 5455 -6855 -28501
7693 -28501 -47930 -18700 13255 18016 10803 27091 13810 -8773 -17573 -14128 15122 20464 -20277
7680 -20277 -27872 -9414 -10410 -25349 -30413 -49428 -29052 -24386 -68452 -90351 -60932 -21540 -39533
7667 -39533 -26590 7039 18796 29001 18208 13266 13921 -4801 -13123 8570 21641 17304 1333
7654 1333 -34351 -41952 -23013 -23268 -16358 20725 23484 -14677 -35322 -26857 -23225 -9876 -15197 -13677
7640 -13677 -15681 -8424 -16354 -3097 4578 5456 2711 20818 14249 -3647 -12357 -21610 31346 67689
7626 67689 55885 4275 -13770 -15519 -20171 -16419 13418 11216 31130 32821 22757 2183 5607
7613 5607 15222 13194 30739 49487 22811 8504 -1878 -29445 -4533 14920 6997 -36423 -38512
7600 -38512 -22491 -9530 -39738 -29029 -33032 -15073 -5435 -24250 -30285 -51352 -64895 -50564
7588 -50564 -19074 -26286 -42924 -74682 -82652 -119880 -107622 -60105 -34515 12498 35586 15945
7576 15945 19782 5598 -15139 -31557 -40626 -57180 -62882 -53036 -22332 -5593 -9792 -24280 -23547
7563 -23547 -8034 -6741 -1517 -2322 -31621 -25692 11963 41843 51174 23369 -24725 -34778 25975
7550 25975 15574 -8008 -4569 1432 -13576 -34217 -22325 218 11142 26444 28137 27112 41851
7537 41851 33596 51610 50712 33118 24545 10030 659 36925 21680 737 528 714 11534 30153
7523 30153 5944 -24069 -37583 -36028 -57420 -47934 -14371 -21208 -60096 -42591 -3069 -37114
7511 -37114 -49623 -43887 -40536 -40805 -33827 -5318 -17626 735 29300 36433 6189 4153 31937
7498 31937 19160 5241 12987 5792 -13023 -85 -17601 -26576 -17049 -10120 -27551 -20224 -12317
7485 -12317 -3674 -9157 -12774 -27391 -29917 -49264 -48665 -65412 -39546 -7340 -20879 -13389 -19458
7472 -19458 -18946 -43997 -60391 -53743 -26504 -27481 -14601 -12603 7959 19879 -676 -17365 -32112
7459 -32112 -34703 -43869 -81209 -94675 -57181 -44195 -80335 -89929 -67184 -43707 -46211 -39270 -10088
7446 -10088 -2630 -14428 -27254 -10708 3470 17523 37988 35464 46545 34526 -21648 -39353
7434 -39353 8140 21517 13644 -9538 -15586 -42414 -42190 -44280 -59451 -64203 -37706 -39110 -22193
7421 -22193 -26791 -22994 4974 -1679 11063 160 -18677 9375 12115 7275 7071 -15957 -21935
7408 -21935 -16189 -5151 26404 28017 32045 11748 1269 -9265 -25568 -44641 -25091 -15752 -5257
7395 -5257 -7040 -7674 15286 -392 33172 59938 69511 21687 -4269 12822 15877 -14583 -38924
7382 -38924 -24257 -44678 -69507 -77993 -53405 -921 35165 38767 45245 28083 1847 -8041 -19959
7369 -19959 -19678 -15516 -25058 7544 11967 -2943 8387 -995 18631 13154 6980 9436 17402 17094
7355 17094 -15659 -24718 4912 15365 -16124 -26464 -46999 -50321 -14717 10397 23368 16278
7343 16278 -7638 -30953 -15920 -15717 -21379 -25184 -33064 -45516 -1397 43001 53070 20361 6449
7330 6449 807 23799 29750 2499 -33204 -33126 -18604 -7152 -16386 -22262 -27100 -13715 1626 18991
7316 18991 -4729 -6212 1931 -5889 20697 12516 -13522 -17567 13941 4845 -22922 -14447 6368
7303 6368 8136 -20200 -11741 15426 46335 17239 2313 20697 15411 -2526 -22337 -24654 1153
7290 1153 -18887 -8449 4021 -7263 -9292 -14205 -5803 -18772 -9187 11523 19563 -7810 -3180
7277 -3180 17833 -1933 -9583 -1232 -4127 -711 -29799 -53165 -53451 -19928 -91 -15323 -19817
7264 -19817 -26153 -33124 -20254 -15303 7995 -13453 -30765 -32989 -46510 -89754 -77701 -40243 -26563
7251 -26563 -25063 -16599 -27547 -228 6860 -849 -11809 2937 -19010 -53232 -32304 -26785 2402
7238 2402 1158 14826 869 30231 34824 -103 -29752 -31625 -38351 -15947 9464 -8966 -9243
7225 -9243 -22842 -42312 -15909 22106 20695 15360 16348 7710 5967 29752 34021 28825 46443 29936
7211 29936 9285 -1776 15826 26368 44433 28454 -28133 -30781 -24865 -42673 -24695 -792
7199 -792 2520 16263 -8363 -3747 38750 51453 32825 28742 22013 50297 65564 42501 40206
7186 40206 39153 -8183 -33399 -32189 -21052 1166 8478 -14511 2608 -786 -16606 -31267 -30098
7173 -30098 -20002 -10018 10975 20144 -11723 -19116 -34799 -37132 -57434 -66979 -45513 -35532 -24225
7160 -24225 -29542 -42215 -50670 -16018 6779 8760 -21049 -35991 -28983 1529 22457 37422 48919
7147 48919 35655 9947 -551 18856 35288 40637 41467 29650 31117 35171 36806 24031 -1354
7134 -1354 -8485 -14086 -18171 -30972 -26801 -42572 -25719 2143 22646 17896 8101 41728 23279
7121 23279 15088 2902 -25303 -40182 -48207 -46853 -53909 -55025 -25957 -4615 9983 -7082 16355
7108 16355 30934 40073 4366 -25374 3337 10977 8051 -5859 9100 21113 22478 11023 9130
7095 9130 18409 19089 -12012 -26598 -9032 24343 34543 10895 -23910 3808 31032 11017 -7330
7082 -7330 5784 -10078 -8379 11417 36307 28919 17626 1780 2530 13674 -13610 -18918 -379
7069 -379 4211 13303 14138 4588 -2729 6427 5364 -3182 -9212 -14793 -13323 9331 19312 23963 31755
7054 31755 38917 31133 12358 10933 15514 16682 31928 13151 -8422 -21000 -19850 495 17156
7041 17156 19105 327 30633 52905 37644 7295 14119 27031 72457 91945 82452 56872
7029 56872 46283 51167 54764 31478 10472 -920 -7968 -7250 10550 -4618 -24668 -45912 -78361
7016 -78361 -66315 -56713 -52386 -53394 -48919 -28016 -40150 -27892 -36528 -3527 6422 6593 961 -8835
7002 -8835 -8446 -8407 -8108 -6775 3810 25248 19047 19501 6495 20493 8497 7603 10920 -19571 -60668
6987 -60668 -57041 -52242 -65138 -35674 -40095 -44552 -19310 -3884 -27148 -47505 -48690 -28378 -9958
6974 -9958 3273 13683 13463 -3441 -6840 -5412 6661 15454 18138 22490 18512 7349 -7472 682
6960 682 -6819 -15600 -43910 -45555 -30055 -30421 -44345 -80623 -56410 -24640 -25369 -28823 -32276 -32114
6946 -32114 -10674 -2032 4767 -16762 -18600 -7772 -11611 -2212 -8895 -45119 -64952 -73445 -19950
6933 -19950 -9192 -2529 -9840 -37211 -37164 -1114 23525 38375 21134 20498 40317 15889 2217
6920 2217 3093 -15339 -5822 -23212 -22207 -9961 -35241 -45770 -39794 -52926 -37076 -20473 -14022
6907 -14022 -33508 -20644 -8660 11017 34953 22830 -12313 -30107 -22840 -1615 -6036 -16080
6895 -16080 -21399 -14725 -17417 -18076 7289 11709 -8416 -21554 -17491 -10488 -18265 -36506 -19942 -3564
6881 -3564 16382 13479 -2745 -22341 -5417 -20722 -17509 -9897 -9152 17950 29458 34838 34370 33671
6867 33671 23512 25244 -3842 -16525 5786 44263 68697 47477 24946 54084 45306 29033
6855 29033 22382 32154 16706 4093 -32460 -32524 -23282 -15162 -30656 -13344 -6594 -21028 -28323 -17275
6841 -17275 -4331 -1635 -4946 -44110 -46466 -36498 -42639 -18045 8782 14827 20553 -6589 3757
6828 3757 14809 2178 -18470 -1119 -43555 -47393 -46203 -48099 -41728 -38839 -16529 6127 13745
6815 13745 -1903 -16450 -19061 -15889 -2740 6867 -1290 -12261 -17946 -16038 4734 -3385 -18494
6802 -18494 -55236 -39668 -13093 -28612 -15956 -22030 -29468 11062 17556 -4430 -19704 -52972
6790 -52972 -43175 -13184 16718 24117 29567 -13347 -36721 -13720 -26317 -55705 -55856 -49025 -28553
6777 -28553 -34493 -32559 -28975 -63872 -44875 -9613 -28679 -41007 -20509 -23543 -42353 -16429 -3240
6764 -3240 -23427 -28951 -12508 -5232 10044 14323 7389 7359 5853 -44137 -80234 -53534 -11553 -288
6750 -288 5726 10143 1361 -14533 -632 3487 -583 8918 16000 7398 23522 657 -21605 -33651
6736 -33651 -11462 -14611 -20131 -52368 -45599 -32756 -42435 -37582 -23967 -34258 -35324 619 23389
6723 23389 20662 17058 20972 -13235 -17811 -15806 -8076 986 -7100 3065 1280 21776 22665 -24066
6709 -24066 -39673 -34028 -33902 -13070 5116 28887 28601 1318 -11135 -9613 -3241 8910 30525
6696 30525 -10161 -52722 -47274 -10366 -2007 -2115 -4281 -1236 -11815 -40820 -44328 -35209 -23385
6683 -23385 -21153 3635 17652 36796 35499 46864 70404 55565 27483 1318 6707 -2245 22894
6670 22894 39089 4483 -21902 -52145 -33212 -16313 -36873 -26677 2161 37203 43654 12966
6658 12966 -20165 -41439 -4433 22051 10895 9425 22291 16437 15791 31116 43117 33268 27802
6645 27802 35315 32248 11453 4748 52350 50393 2316 -14215 -15116 -32618 -46624 -44930 -23577
6632 -23577 -6268 14484 31093 41604 25197 20098 9446 27536 75111 75616 46634 21029
6620 21029 16624 -20574 -28529 1286 -8078 22741 12200 -18055 -35056 -43998 -21969 -28735 -27849
6607 -27849 -18795 1138 36539 42491 44092 36721 44546 6388 10109 28762 25069 24628 1063 -21220
6593 -21220 -16866 -12761 23916 46730 46054 45714 62048 84730 40835 11989 -23626 -16521 4878
6580 4878 23499 27471 25643 -13432 -46861 -17064 -8821 -36869 -29985 -38406 -64030 -75992 -77829
6567 -77829 -56986 -18893 11636 18841 6615 17803 4750 -23102 -4962 3043 21147 3630
6555 3630 -9919 -8073 -940 -3690 16294 11549 -9328 -16223 -36391 -40807 -23992 -10564 -19968
6542 -19968 -14168 -6692 1309 -27969 -15632 11522 23985 28432 9561 -17980 -7990 29994 35735
6529 35735 2030 -38892 -42355 -28956 -23940 18207 15363 8888 -1093 117 -17647 -37098 -26937
6516 -26937 -9299 -4565 -30582 -40204 -42339 -33953 -41133 -49622 -56763 -55893 -52756 -24349 -33130 -74462
6502 -74462 -56411 -57144 -32907 -2889 20400 18012 35385 31869 25861 11898 -31462 -67728 -54698
6489 -54698 -10916 487 -16136 -31707 -37811 -54215 -37925 -15331 -33949 -44611 -22006 -22441
6477 -22441 -39823 -68509 -53689 -18108 -20509 -53461 -41894 -35046 -33130 -27134 9855 51116 41943
6464 41943 36095 32560 -11242 -25683 -759 38608 31498 -17290 -21932 -23565 -41595 -37564 -17325
6451 -17325 -10427 11069 25787 7892 4404 13979 -3349 3171 311 -1469 13310 -8738 -14336
6438 -14336 -12562 -26396 -7431 -4321 5477 -8690 -29753 -20176 1862 12116 -3593 1078 642
6425 642 2313 3788 -17767 -17020 -19699 3744 3695 18688 1802 -15636 -27451 -8337 -1653 -37318
6411 -37318 -33845 -31299 -6937 -6155 -32972 471 21287 6244 -48930 -64096 -17434 -4269 -21680
6398 -21680 -40849 -40326 -37402 -7942 11787 343 -5923 -13186 -19554 4089 33778 50341 23899
6385 23899 24295 13711 -17572 -44445 -37677 -30243 1137 13481 -6702 -2151 5258 -16368 -22934
6372 -22934 -19997 -18154 -4157 19235 12386 -15789 -39184 -13284 15781 27294 12443 -662
6360 -662 7310 1063 -10512 -1231 -4407 -9961 -17936 -36100 -40806 -21144 -20743 -39092 -9420 6755
6346 6755 -16361 -50919 -57834 -5003 11631 13880 7362 18222 -14236 -30054 -16547 -7641 -11812
6333 -11812 -15153 -42182 -32663 -19618 638 -2908 -4883 -17029 -18191 -24277 -19141 -13590 -8585 -11111
6319 -11111 -661 4134 8573 -4355 -12486 -2742 -13620 -10246 -41874 -66969 -73440 -49405 -30705
6306 -30705 -35577 -36779 -27956 -27749 -22429 -18668 -25035 -72985 -71022 -69654 -52235 -22914 2940 13362
6292 13362 -1948 4981 -4598 -4422 -10722 1542 19480 5560 -28411 -44594 -29784 -19659 10559
6279 10559 26577 3542 -13227 -19121 -32080 -22678 -21485 -15052 -15779 -35729 -42555 -36132 7351
6266 7351 30672 -6362 -3453 -2401 -21203 -26000 -37401 -19637 -16483 -18254 -32069 -51931 -61045
6253 -61045 -12408 9633 -3598 -6982 -12905 -950 8951 26465 24967 -3530 -10418 -29634 -47897
6240 -47897 -56597 -41392 -28560 -23470 -23985 5483 7821 -15682 -13279 2679 -18524 -36176 -42831
6227 -42831 -18867 3341 1604 10923 5489 -8513 -163 39881 20737 24678 45034 25774 13709
6214 13709 -6105 -2905 17047 16597 15906 -7592 -24347 -47609 -68618 -68633 -59726 -44456 -28160 -17400
6200 -17400 13241 9771 -3226 15398 19005 35779 10508 -26003 -45508 -51311 -41364 -49245 -44925
6187 -44925 -35736 -31677 -31336 -26671 1691 -1331 12836 27012 30463 20879 -14251 -42182 -33751 -32995
6173 -32995 -29994 -12691 8447 10218 -11354 -15546 -24187 -8855 34267 45638 24035 -2358 13993
6160 13993 44678 15616 -21554 -52768 -35050 -37077 -30513 -33464 -52209 -28198 -3829 23832
6148 23832 29478 28600 1400 4924 18080 22474 -10332 -19095 -22930 -30773 -22191 -30986 -37735 -22910
6134 -22910 -10260 -6846 -37303 -39687 20957 42539 27500 26351 56915 49554 12751 -37833 -61455
6121 -61455 -64514 -67561 -51359 -38677 -55767 -50461 -45050 -58350 -55495 -38489 -18430 29524 35314
6108 35314 40917 69847 55398 51037 12671 -5769 -12109 -31303 -32495 -10806 11650 24117 28478
6095 28478 24692 35108 12630 -6148 -12734 -3615 -35867 -57412 -58580 -59285 -53581 -16599 -15597
6082 -15597 -39388 -57515 -45668 -30720 -32382 -49347 -31046 360 19762 -8484 -27061 -18694
6070 -18694 -19464 -34134 -44033 -44930 -17802 -6620 3475 -13951 -17394 -21488 -13505 -154 4160 -20381
6056 -20381 -6302 11117 40343 18039 8089 12426 23762 16864 -14463 6677 35142 17261
6044 17261 6213 26088 12443 -40154 -68712 -48207 -40332 -37357 -21862 -5284 -8153 -6069 9404
6031 9404 24215 30977 21501 638 -21489 -24178 -18247 -28700 -9840 -7518 -20637 -20528 -19347 -9700
6017 -9700 -6707 -14337 -21811 -25581 -30967 -1633 20775 1369 -2319 -1940 -5079 -31238 -39235 -12054
6003 -12054 30403 15257 4657 14459 16333 5760 19886 25445 11694 16383 15379 21984 30436
5990 30436 10344 -922 -4462 -840 -25850 -40096 -27093 -49354 -62266 -66127 -70167 -58323 -49524
5977 -49524 -38009 -44508 -63981 -55770 -22057 -5882 2845 3598 6355 -16884 -32615 -37145 -38510
5964 -38510 -24895 -2131 26728 31156 17889 -17490 -32124 -24986 -26441 -18634 -10772 -12506 5629
5951 5629 -8702 -3211 -2937 5622 -11739 -51931 -56450 -22962 -22992 -8248 3894 17068 3264 -31296
5937 -31296 -58252 -51256 -14426 15393 13827 -18119 -13879 -13680 -36727 -50589 -22622 -12861 -35086
5924 -35086 -36034 -36482 -22010 -7245 21348 14381 5399 -8379 -8009 24704 21400 22351 52718 36208
5910 36208 15348 4723 4852 17092 15500 10024 -4093 1085 -5600 -17204 -27576 -20189 -37392
5897 -37392 -52369 -48555 -37889 -23776 -55041 -70272 -51885 -32377 -45260 -80928 -98353 -78961
5885 -78961 -59434 -32993 -3069 23582 22115 8214 -22625 -30914 -39691 -70555 -61864 -34215 -50310
5872 -50310 -39442 -8736 -9862 -29484 -17656 17145 38446 19034 -14723 -42740 -11660 23210
5860 23210 17512 10095 -15156 -10329 22 10271 14045 13960 6739 -17867 -34579 -31140 -13299 -28194
5846 -28194 -34863 -37259 -24756 -5897 12325 35996 34198 11863 -20478 -31203 -28357 -36868 -58345
5833 -58345 -36951 -14488 6704 18840 12218 16231 -11498 -38488 -43232 -40750 -27625 -32948 -6921
5820 -6921 -11396 -17912 16799 -7384 -33647 -23599 3469 39823 56282 25145 -1851 -18786
5808 -18786 -13107 7075 31037 30259 16150 -2387 -2276 -9961 4659 -22548 -53718 -68214 -44624
5795 -44624 -37262 -51904 -53308 -35406 -23293 -38776 -53419 -36442 -17485 5890 12444 -8765
5783 -8765 -4234 15555 36710 30894 16768 -1135 5513 -25358 -27097 -35025 -34561 -20624 -687
5770 -687 -11484 -32304 7205 10307 -3592 18845 14495 13026 17518 9164 -7625 -4150 10308
5757 10308 -8577 -26384 -26608 -51262 -57937 -37091 -29824 -39823 -50258 -45407 -11584 27577 29347
5744 29347 -319 4091 198 9225 22744 15679 -85 -4253 -14591 -23829 -17631 -23979 -26931 -20666
5730 -20666 -17400 -32052 -37150 -10307 9729 30720 24590 12391 22296 32016 38216 5184 -13360
5717 -13360 -10684 -41760 -13958 24077 20689 -2463 -18927 -18782 -26609 -26360 -23140 -49955 -51676 -12442
5703 -12442 -3862 6507 -21534 -57467 -31260 -5584 22687 44554 10306 -6509 11245 27771
5691 27771 53525 39079 -349 -404 4454 30762 57922 65328 27233 13706 -1428 -1649 -160
5678 -160 -15592 -29224 -29632 -21359 -22864 -19903 -31718 -63337 -29392 -4280 -8691 -40007 -67620
5665 -67620 -63848 -24966 -23544 -2072 6438 -9930 -41436 -36032 -7185 -3398 -32807 -42561 -23427
5652 -23427 -34417 -12332 -13576 -7603 -46353 -49084 -38648 -38150 -48460 -41691 -18582 19981 50723
5639 50723 53850 10608 -10474 -1304 -9967 -3371 -4899 16178 10469 -546 -17787 4122 21149
5626 21149 4749 -34531 -43134 -27120 -1301 20248 18174 15020 40677 44556 34588 22338 17662
5613 17662 50660 35894 30868 16601 10178 11509 14537 3511 -23316 -33331 -48935 -27370 904
5600 904 25872 27492 7391 8890 39468 30765 4599 6296 -11449 -49877 -52903 -54529 -29234
5587 -29234 -18126 -21320 -49940 -73207 -68320 -46078 -26434 -30324 -46692 -24059 7547 1459 24332
5574 24332 47559 37515 13790 -4920 -23945 -16043 -11134 13048 16989 13336 28855 41875 27805
5561 27805 -10839 -18750 -18547 -12447 -23187 -38434 -38833 -25886 -11373 5182 27846 29748 16791
5548 16791 24236 20733 -10648 -41806 -30602 -28682 -32766 -35526 -34212 -15362 -2155 15969 42448
5535 42448 17368 -12110 -40779 -46934 -14754 -29670 -27228 -4601 -11309 -14038 -16633 -4689 1537
5522 1537 13206 7344 13509 -7047 -16174 -25153 -24496 -37169 -32155 -12710 8532 7547 13412 -8667
5508 -8667 -34005 -20262 754 829 -360 -19129 -34020 -53934 -51120 -39955 -1963 10121 -16735
5495 -16735 -49623 -52499 -65074 -62702 -40000 -10772 -7915 -17485 -19758 -16165 -32630 -52752 -55341
5482 -55341 -32284 -18066 -22269 -21338 -20958 -10914 -19186 -31685 -65244 -68497 -35861 -27479 -37528
5469 -37528 -45462 -19300 -11866 -9151 1651 3487 -11986 -12784 -15431 -38605 -14063 -30387 -34346
5456 -34346 -44038 -73650 -58408 -6063 1873 -4399 3284 12068 -449 7181 -10774 4239 10166
5443 10166 -1238 -2872 -3983 -9080 -1652 13064 21212 -5696 -37997 -32232 -18964 -16337 -19848
5430 -19848 2748 29154 20218 5069 19832 42833 28755 25575 2742 7405 5667 -12016 -15402
5417 -15402 -9550 -14271 -5792 3286 14856 9674 25309 28210 7238 -5400 -11137 1775 -17151
5404 -17151 -58485 -44963 -25756 -23711 -22796 -27023 -32403 -26933 -30308 -23744 -6418 -12276 108 33161
5390 33161 33235 -9645 -12848 9412 -12547 -29868 -9454 19157 24754 10731 -16372 -40858 -9420
5377 -9420 14332 26903 532 -28948 -54908 -43499 -59823 -56311 -33655 -785 5594 -28926
5365 -28926 -36947 -8741 -27465 -23823 -51132 -47406 -12323 -12546 -40677 -30884 -29675 -33671 -39433 -21395
5351 -21395 -7859 -34257 -58014 -60882 -27515 9573 17154 -13315 -38206 -41527 -26104 14270
5339 14270 2259 -6415 -5415 -140 21029 24523 38486 30161 26986 18247 -19281 -10774 3957
5326 3957 -5067 -46125 -35725 -12265 -3885 35607 50021 32265 5615 -9681 -22245 -17862 3811
5313 3811 27600 16980 14697 15410 14164 12680 45427 40202 33615 4528 1430 633 10395 26409
5299 26409 4355 -12608 -18336 -27284 -28104 -48599 -55486 -65948 -39960 -24479 -19341 -8392 -31731
5286 -31731 -51125 -44736 -28014 -29656 -19803 -2182 10797 14686 43797 45272 48082 30545 -7723
5273 -7723 -19592 -25336 -26001 -57239 -31265 733 9524 -21103 -24594 8572 29165 16181 -9289
5260 -9289 1539 -32583 -39314 -1234 2554 10693 18972 44474 38840 37019 18490 10086 -15422
5247 -15422 -36850 -31916 11827 1973 -1248 28826 24186 -4061 -16855 7304 14075 -21279 -48674
5234 -48674 -59031 -25496 10453 15759 25402 15300 10940 35859 32807 46539 16846 -554 12794
5221 12794 -8738 -263 -4766 -32891 -52679 -76840 -65526 -45712 -35518 -30163 -25743 -15407 -20388
5208 -20388 -27022 23871 45199 36596 13337 -6127 -8957 2104 29947 3489 -12105 -15325 -16883
5195 -16883 7847 28561 25305 13782 -9548 -10059 -4534 -10140 -8703 18994 7890 -24548 -17135
5182 -17135 -5246 8076 -12216 -38925 -35796 -52866 -64610 -36977 -31126 -33691 -27271 -19842 -37377
5169 -37377 -43021 -20683 -7637 -13738 366 -22025 -41899 -30960 -33705 -39951 -27938 -18893 -42605
5156 -42605 -41720 -12714 22240 29029 4226 -908 -19722 -13795 -5412 -9549 -1332 -3969 -9775 -6585
5142 -6585 -27184 -14029 4444 7428 -1436 8257 -430 -18495 -30823 -41736 -43561 -50742 -17605
5129 -17605 -31472 -21504 -26432 -19867 -10280 2191 -4992 4866 20758 19383 -9282 -12212 4476
5116 4476 -10887 -899 9292 38006 42208 18861 18205 5830 6002 8411 9432 1980 12276 21612
5102 21612 21925 18882 20962 25138 18116 27368 43852 30488 3594 1392 -15076 -27913 -13943
5089 -13943 12994 23019 14653 -3239 -23591 -31517 -50088 -26334 -46318 -45215 -1858 21799
5077 21799 5544 -24586 -37667 -27977 -28536 -27996 -40356 -27031 -4072 14581 11132 -5418 -28529
5064 -28529 -24234 -14767 -23310 -11060 -2685 -21974 -43345 -14199 -4552 -25496 -9644 13711 9510
5051 9510 -7642 -31608 -37067 -56023 -48234 -54539 -52509 -17295 -30771 -16947 2986 11126 27672
5038 27672 12562 -16010 -40555 -37037 -40010 -15714 1043 4929 17526 4080 16322 37875
5026 37875 29328 4713 10718 40739 44201 27433 31788 5084 -5230 1638 -13347 483 10536
5013 10536 -1486 -5189 -14721 -13556 -928 603 5622 -8583 -67257 -91291 -53591 -28670 -3004
5000 -3004 -2119 -564 -6161 2106 -6820 3360 9794 23349 23281 40743 33460 29813 24925 -10188 -27093
4985 -27093 -15147 -30643 -24811 -7135 982 -4203 23557 45966 22087 12551 2907 1581 25839
4972 25839 53812 38393 -13763 -45155 -61993 -53087 -42201 -24267 -36810 -47551 -31409 -9315
4960 -9315 21912 32954 7486 -8175 12953 28917 28982 15945 -26002 5907 10650 -7512 9398
4947 9398 -5000 -18068 -23358 -20253 -12201 9455 6685 365 520 3390 20475 37021 38080 10203
4933 10203 -15878 -10939 55 -11804 646 37741 34666 -2011 6644 24648 7484 -10677
4921 -10677 -31487 -27852 -28642 1123 -9299 -17030 -24681 2280 12471 5305 -140 -8186 -9533 -5505
4907 -5505 -548 11334 29560 21043 -7906 3716 7939 30029 22112 21658 -3632 -20228 8731
4894 8731 25932 24646 31662 3477 -37665 -55516 -52120 -19094 8569 2290 -37873 -20365 7826
4881 7826 36719 25008 -12690 -13994 -9871 -23389 -33394 -27920 -20814 -1437 11005 19474 5545
4868 5545 -13330 -40121 -29811 -24788 -19639 -7584 -8922 -37627 -16504 4922 8482 10955 -8577
4855 -8577 -20151 -41577 -34897 3760 9040 -3678 -2484 -3961 11209 12945 -21652 -22152 -36252
4842 -36252 -59130 -45998 -35644 -37426 -46168 -22066 -5969 -1232 -10232 -7850 -26515 -42158 -8818
4829 -8818 -13626 -16283 -23723 -3845 -17475 -20831 -36034 -34780 -38296 -43415 -42280 -43414 -31132 -31306
4815 -31306 -52707 -46318 -50543 -42284 -28723 -18474 -29647 -13253 -1337 14849 -7514 -9632 815
4802 815 -8793 2121 1056 14089 18819 22134 16141 23325 32307 45628 13013 -13114 1494 30563
4788 30563 15148 -32348 -30701 -13969 -24827 -13115 3225 24635 22167 31063 31268 42839 38102
4775 38102 5992 -7067 -9506 -9991 1054 13501 6302 -21451 -35783 -2092 38567 29181 34367
4762 34367 37011 39751 29984 20413 21025 11848 31749 30771 25749 6590 1749 12201 -4597 -3104
4748 -3104 1415 -22248 -39952 -53105 -58372 -69703 -62681 -44268 -27847 -4369 -34197 -38544 -22825
4735 -22825 -4345 9628 815 -29840 -28034 -27527 -43416 -38724 -10056 -7561 17590 19316 27486
4722 27486 29017 6281 21604 7463 32974 35227 6372 15050 47428 51522 43914 31201 32690
4709 32690 28190 33157 29824 30027 9805 5022 1711 4297 -12089 2601 21406 17496 -9960 -41664
4695 -41664 -21595 -10681 -2080 170 -11617 -10700 -11087 -44314 -60266 -39083 -34184 -29272 -2559
4682 -2559 -16370 -46082 -42414 -23737 3220 -4317 -35999 -47806 -37853 -2411 -14786 -11917 6629
4669 6629 12837 15221 2914 -12584 -8735 -14113 10942 39010 49196 24105 -10537 -15190 -27449
4656 -27449 -23537 -38906 -51030 -56963 -51658 -26209 9065 -22851 -53319 -59030 -46912 -22180 -7644
4643 -7644 5374 -6409 -6399 -5376 -32635 -6818 23964 -15763 -29763 -41954 -37908 -4519 -6099
4630 -6099 -8484 -16923 -48763 -70341 -81905 -43346 -33325 -29229 -19830 -40027 -25273 -20111 -14677
4617 -14677 -19822 8590 837 -35899 -67059 -67966 -36812 -35826 -53207 -45356 -22460 -15610 -23028 -15085
4603 -15085 -40235 -30940 -34181 -69894 -59978 -6680 -5821 -32298 -41085 -16013 -8590 -25178 -31363
4590 -31363 -29410 4131 9807 21523 35889 38055 -14186 -56992 -53075 -29677 2247 21889 31361
4577 31361 25619 27507 43121 22639 -223 3458 -11851 -18507 -2288 -16110 -14541 -18152 -38217
4564 -38217 -35803 -43556 -61398 -39722 -26438 -1991 29493 2282 3053 17041 401 11336 1290
4551 1290 1128 18760 3779 5206 13011 16774 5497 20215 20511 2295 17668 -1294 -20078
4538 -20078 -18926 -3379 260 -19919 -2016 -3225 18618 4014 -14422 -1371 21 -21162 -11915
4525 -11915 1983 26906 40747 32560 32143 33421 6071 -32574 -34229 -7332 7986 -11419 -17113
4512 -17113 -19336 -13218 744 -9417 -34325 -44328 -20048 -12894 -24453 -52635 -80734 -81593 -59731
4499 -59731 -22327 -8506 -13907 -21190 -24258 -19007 -43105 -54136 -42323 -38170 -6374 -6345 -5953 14233
4485 14233 48435 45291 50975 55842 42596 23930 10750 10749 112 -12474 8243 -2696 -38655
4472 -38655 -34231 13209 7950 -30714 -49569 -37560 -44843 -48902 -29372 -20389 -17751 -2910 19778
4459 19778 31663 21511 24572 17517 110 -13082 -37541 -24349 -30669 -29377 -24930 -22126 -25762
4446 -25762 -33581 -22173 -23364 -35483 -43392 -23004 -28073 -34577 -53283 -52496 -30187 -4572 12038
4433 12038 -1145 -18150 -10565 -9065 -7301 -12065 3985 25168 -3776 -52930 -26734 -19415 -17420
4420 -17420 728 -32477 -57078 -92354 -78871 -50082 -28853 -43745 -19613 15392 29215 15216
4408 15216 -7297 -10920 4586 9404 -2459 -20906 8295 7727 -20048 -11359 1932 9654 1912
4395 1912 9796 -21463 -33611 -31960 -4944 1814 -7951 -9713 -30711 -40788 -21902 19313 29759
4382 29759 25653 24540 19257 13056 -12950 -13261 -30414 -30990 -503 19997 8926 -1332 39011
4369 39011 40144 7690 -23852 -28077 -9160 13257 25130 -6852 -10847 6524 2646 8447 10913
4356 10913 19644 24990 9853 28925 6844 2327 29950 40501 17387 11825 39055 17998 16615
4343 16615 23535 -6708 11804 21385 15972 8634 -12973 -17886 -15573 -6860 -10886 -24770 -17611 1962
4329 1962 4577 -28634 -51371 -45122 -40604 -23294 -12365 -6624 2750 17854 15989 -31345 -54825
4316 -54825 -57015 -24962 -11315 1688 10524 15835 14423 37666 32561 -3419 -10958 -3173 7113
4303 7113 3698 3717 -4713 -116 -2575 19039 27445 -8099 19152 18945 -20195 -16050 -3595 14166
4289 14166 31781 19532 18331 2270 -4593 -26516 -34477 -32788 -15108 -18241 175 -5785 -2220
4276 -2220 1474 10400 -510 -21882 -2945 14535 -9802 -12988 -11261 -44772 -62344 -32320 -19189
4263 -19189 -18541 -17037 -20234 17014 36873 38838 24280 -9940 -7223 -14414 -19767 -16529 -22030 -7915
4249 -7915 -1760 28610 27315 1642 949 37839 48889 63642 76946 68740 59963 59495 48159 28796
4235 28796 10595 3236 -12834 8455 -59 -2651 -18240 -6953 9262 611 -23893 -49732 -38324
4222 -38324 -10372 24536 43914 16625 20106 8345 -11678 -28067 -37522 -30212 -43700 -41482 -42014
4209 -42014 -36077 -54703 -48332 -15816 -19660 -7655 2121 -1242 13287 14863 12111 14392 -6343
4196 -6343 -10033 1328 -15292 -26685 -50389 -34951 6414 23709 39593 15628 -26695 -23092
4184 -23092 12706 21242 -5411 -17271 -2567 2132 -3790 -646 2568 -2809 -8441 -26490 -12262
4171 -12262 -4664 -15534 -32857 1283 2921 -36774 -47318 -35506 -20846 7138 6163 -4891 -13468
4158 -13468 -16831 1964 16083 15762 6652 11387 4046 1126 -13521 -13327 3124 22653 10956 14413
4144 14413 19357 -2775 -37016 -19570 17769 45748 9906 -6920 6650 -30370 -28868 -29696 -28111
4131 -28111 -24021 -42575 -69364 -100125 -72230 -34351 -21545 -12543 -19331 -37857 -37800 -13401 -2144
4118 -2144 -8831 -1896 7730 -10254 -26191 -31025 4391 5957 -5689 -104 -4696 -8030 5 -8732
4104 -8732 -23903 -31594 -28062 -5810 -402 5685 29759 30939 48573 35433 4271 -18434 -8946
4091 -8946 -16908 -22520 9200 26039 4866 37383 70246 71481 23504 30593 32851 16164 9558
4078 9558 26021 3692 -50270 -73443 -40218 -31008 -31505 -15334 30605 33150 22540 6586 -742
4065 -742 -11520 -18036 -4672 -15197 -35846 -17478 6619 -131 -19696 -14732 -27254 -28707 -27727
4052 -27727 -35193 -36039 -26710 -19573 -30251 -36125 -11542 -30210 -17460 -3689 -3804 -4075 -6844 -5541
4038 -5541 -29174 -43297 -15209 674 25078 26493 3088 -8119 -17612 -21570 -5207 -7732 -23287
4025 -23287 -8211 7381 11797 8436 -6628 -16160 -33683 -6757 7767 19486 36865 19059
4013 19059 8859 3210 8077 163 -11339 -28634 -41986 -24276 -19387 -31526 -34591 -25609 -19363
4000 -19363 -32052 -25262 8892 1052 -38665 -38232 -37998 -28760 1646 6082 1621 -2271 -7548 9487
3986 9487 13231 31558 -7344 -29095 -1228 26167 12100 19930 15116 -5122 11617 22384 -879
3973 -879 -11479 -30009 -13351 -6820 -6050 -10023 -45278 -44050 -29420 -33676 -44459 -49997 -28962 -18975
3959 -18975 20226 13956 -13730 -12705 -20697 14224 37029 28047 3922 -14733 -28341 -22523 -4699
3946 -4699 21732 36749 24594 -11701 -25185 -3584 -5670 3813 25380 25559 20447 -2724 -1839
3933 -1839 6218 -16533 -15545 24056 7463 9433 2921 67 662 31424 39311 23450 18120 -5296
3919 -5296 -14263 -5643 2951 4139 19123 -14960 -28943 -3556 -3839 -10983 13444 43498 27161
3906 27161 29701 50830 52140 18248 7948 -4947 -20917 -5406 -7366 -39137 -37005 -34590 -50407
3893 -50407 -39174 -24281 -25036 -42482 -42375 -34492 -52321 -52169 -21644 9669 -12905 -33245 -14564
3880 -14564 -13197 -16141 -35728 -61973 -50007 9371 188 -3840 -3277 -14984 -10557 -10929 -11095 10025
3866 10025 28586 5285 -26768 -29095 -15779 -14284 -10933 -2989 -11991 -10179 -7652 -9499 -12225 -26442
3852 -26442 -35918 -13154 11230 40274 8597 89 11883 13329 28423 23146 16376 18283 18503
3839 18503 42398 40534 19954 30117 35520 28915 8741 -12081 -11489 3291 20466 18960 -2217
3826 -2217 -2435 -12534 10718 -996 -2085 4638 7738 -8247 -7751 -16885 -5194 11806 32365 31113
3812 31113 20874 10072 16316 9763 18555 -12596 -28094 -43452 -43333 -16573 8368 794 8851
3799 8851 19372 19286 -11085 -8838 11735 17530 -30437 -69684 -93105 -61979 -20732 -40942 -79923
3786 -79923 -64908 -35488 -29783 -31755 -25323 -4867 21192 18247 -9429 -14326 -53771 -75084 -30673
3773 -30673 -3968 -6229 -29113 -15601 11868 63144 52803 50011 49642 30001 -4505 -16789 -2723
3760 -2723 -4732 -11294 -22606 -30718 -28251 -36444 -44417 -32139 -12601 1836 7051 -13249 -10000 -21522
3746 -21522 -41444 -33803 -10742 7187 6908 1208 -14003 -24569 -6444 2672 4331 6008 4117
3733 4117 13210 21395 9653 8116 28412 11966 24908 51481 20659 7317 10978 -9859 -466
3720 -466 8983 12771 5297 2709 18348 23132 27018 25467 18908 15208 9658 -14156 -20703 16374
3706 16374 24228 40332 94390 82858 47091 31061 15595 14398 2174 7613 -26527 -5161
3694 -5161 30449 41171 32690 4785 7822 675 -32220 -19248 15696 30584 63204 86241 74889
3681 74889 51312 23712 3193 -19068 -30454 -38939 -29534 2178 32073 29434 -4912 -31784
3669 -31784 -61896 -74062 -72768 -71940 -50919 1045 23295 20979 6406 4231 -3104 -4246 -10804
3656 -10804 22277 5039 16544 3251 -14480 -21873 -35150 -14036 4803 15197 28529 20943
3644 20943 2282 -2269 -15624 -14825 344 23650 -761 6712 93 -18732 -7145 -2877 -16950
3631 -16950 -7243 6202 11208 -6806 -32562 -29612 -11741 -20899 -55502 -61973 -53059 -37735 -2788
3618 -2788 41127 38854 8565 -5552 -12359 -13499 6777 -13596 -11514 11209 -4626 -17015 -18886
3605 -18886 3603 27321 7673 21336 16291 20499 12321 18248 10399 -11402 -5303 -7432 -6624 -31670
3591 -31670 -18143 5108 10878 -8294 -4236 -657 -15201 -27931 21920 46514 34663 -2698
3579 -2698 -12167 21102 33053 54382 44360 21953 5943 23568 23273 12747 4921 -2730 2362
3566 2362 -7261 -30862 -57087 -54233 -33506 -36069 -43040 -29341 -21126 -47135 -58086 -37891 -27152
3553 -27152 3878 5528 -2416 31763 55773 50345 38869 16134 -9129 -12785 -16844 -3344 -20637
3540 -20637 -19973 23009 27263 33590 40302 41114 57493 53989 -9 -1839 -5529 -11455 -11348 -20135 -23970
3525 -23970 -31558 -43295 -39885 -16696 -10493 -31704 -48637 -19512 -5002 -25157 -46534 -37760 11469
3512 11469 11192 -25713 -21628 -5833 -1711 2654 -452 -11007 -14119 1654 6553 -28351 -71728
3499 -71728 -49496 -17276 -15435 -8972 17895 9767 177 -23421 -28209 -36465 -30860 -25342 -8089
3486 -8089 -30365 -46306 -30505 -33667 -14569 -1987 -10784 -16659 458 6686 8181 -21852 -34719
3473 -34719 -5289 -10415 -10137 5516 1619 -65 -14281 -6126 8224 10335 16525 23275 18044 39256
3459 39256 26900 22696 21459 21106 20237 14444 -19119 -53741 -45691 -12233 25521 14170 9573 18793
3445 18793 1815 -31338 -44847 -25925 -2004 -13013 -29014 -35891 -12441 2959 13494 15283
3433 15283 -12757 -10546 -5683 -16502 -35611 -25058 -12147 -5066 -3621 4018 2836 2097 24056
3420 24056 35294 21830 -10005 6391 -6639 -33614 661 25047 1635 -11809 -27875 -20171
3408 -20171 5609 -2979 -12258 12943 28118 52110 35854 32969 38448 24928 -686 -7271 -5810
3395 -5810 -4168 -14477 -29755 -17353 -1122 6587 6130 -16487 -24876 11692 11102 -4338 -581 10127
3381 10127 -17179 -19936 16249 42834 37400 13146 -315 -5634 -14157 -12517 -25402 -36237 -26650
3368 -26650 -23443 -19903 -1146 -9887 -31907 -34166 -18584 -22740 13398 22676 33224 19726 17807
3355 17807 11578 -13195 -22817 -33374 -37204 -36092 -10632 -1482 5530 16637 -575 -6964 11938
3342 11938 8367 7300 -1541 2032 35675 42993 31140 35298 20301 9959 22867 4728 16553
3329 16553 24137 30175 30889 24948 4155 -3556 -25688 -34656 -23573 -36074 -34177 -15393 -16587 -11455
3315 -11455 -10039 -404 -9625 8070 15861 10563 23684 67193 48608 17957 34130 45789 33832
3302 33832 26667 20987 16230 -18723 -40709 -23315 9552 9397 53 -8519 -492 10411 -1289
3289 -1289 -10993 -30998 -18779 -23961 -37164 -2481 15311 -10437 -31545 -55506 -30427 -29576 -42532
3276 -42532 -50969 -38733 -37783 -35068 -24512 -13403 6140 38880 39720 27034 35496 25047 9750
3263 9750 13992 -82 -4041 28377 30847 33765 36087 32263 21353 15425 -7819 -14388 -21665 -16072
3249 -16072 -28250 -37334 -35966 -35647 -55862 -54034 -35817 -6285 874 16601 12432 3132 -18121
3236 -18121 -16228 -17149 2680 7173 -2619 -32567 -29859 -8336 -7908 9905 46379 62444 33328
3223 33328 1039 -2691 -15493 -33112 -6292 -20451 -35306 -28471 -12248 -35779 -42356 -6935
3211 -6935 9562 9198 9197 15747 -3933 -32729 -18610 -9764 -675 -2884 5425 11496 -6781 -22015
3197 -22015 -2741 -15070 -27870 -22104 -15924 -32748 -17072 -16285 -10625 10305 10566 -4324 12545
3184 12545 31502 18304 20464 11478 16095 7654 6086 -2575 -6881 -10288 -2005 -8508 -11842 -12353
3170 -12353 6854 14892 5825 7165 -10327 -16241 -25929 21740 46629 46694 20464 24948 28876 9795
3156 9795 -29880 -52900 -43237 -34206 -40438 -42440 -29292 13793 21723 14678 24630 39589 31247 -16010
3142 -16010 -625 -3650 -12974 21013 10348 2399 -553 -910 -3874 -1333 34264 52019 49818 49425
3128 49425 3170 -30388 -20740 883 20994 23611 22640 11628 -24282 -29496 -9923 -9363 -21633
3115 -21633 19156 54297 14778 5371 22616 20099 40106 68642 54510 36532 23097 10797
3103 10797 15625 17259 38420 20383 -1623 6916 38220 35111 24076 -2820 5725 4568 5342
3090 5342 -24123 -33874 8854 38522 40251 -9026 -39157 -13717 -26537 -35009 -10239 3445 -25319
3077 -25319 -28363 -13824 -16095 -55622 -69970 -33838 4673 16508 173 -4260 -6784 -18315 -28195
3064 -28195 -27469 -45516 -56014 -37446 -11369 11844 2613 -8614 12796 38369 53353 51873 45232
3051 45232 54752 41365 7179 -27318 -45371 -25754 11808 7186 -8570 16129 -4573 -8765
3039 -8765 -20551 -30624 -4439 14182 -6810 -23930 -15377 -13154 9256 9693 16564 44080 53503
3026 53503 40385 17449 12527 -1152 -30983 -39530 9920 -23760 -64096 -45266 -58344 -68338
3014 -68338 -28404 -8730 -2892 -14923 -50146 -60151 -34121 -9800 -22175 -26893 -15006 -33113
3002 -33113 -26087 -19502 -8108 4796 24255 23219 28779 32827 19812 11047 26041 37361 46419
2989 46419 15734 10425 15536 -6094 -24355 -1802 31735 7983 -24949 -42242 -49680 -51697 -11613
2976 -11613 -10587 1147 20765 30000 2644 -4311 -27250 -27995 -22299 -858 7039 -4811 -11041
2963 -11041 -13204 -14169 -2755 25459 54091 54406 41878 16908 1108 -11254 -14450 14240 24802
2950 24802 4572 -14569 -21133 -13819 -10502 -583 -3883 11764 18169 1929 -8837 11977 -8983
2937 -8983 -8728 16710 36825 21351 8788 31382 65844 38117 -1816 -8619 23504 64910 82320
2924 82320 61508 42990 13031 25297 49874 54302 35883 18122 -1325 -13245 -21265 -18015
2912 -18015 -20745 -16387 -25300 -28826 -37140 -20030 6096 6556 -572 5428 23660 34231 70877 62127
2898 62127 40030 10925 -13708 -15640 -14492 -22136 -9918 11154 -10478 -47893 -56718 -17478 6390
2885 6390 -1609 -24199 -26104 -13690 -4965 -20228 -15046 -6850 -12589 2619 29474 21392 21058 14334
2871 14334 1540 -11424 -3824 -1943 3647 -12586 -26170 11239 4970 15037 2218 5686 3470
2858 3470 17779 21870 1433 12902 19624 8519 11485 18531 19756 4462 -12857 -32248 2300
2845 2300 30535 25663 33266 2978 3308 18796 25461 27604 4775 17982 19664 -29818 -20354 5704
2831 5704 1459 -14801 -23953 2563 10327 13996 6963 15130 -9048 8641 22869 9071 14143
2818 14143 28497 -1990 -8808 11256 22663 19120 14460 11368 -10793 -23999 -28739 -51211 -64104
2805 -64104 -38767 -18286 -3578 7402 43642 45841 20277 1665 -8471 -11930 20864 16764
2793 16764 -27744 -45225 -36054 -25714 17192 46318 57585 29953 12316 21603 14703 4545
2781 4545 2967 -3124 -16490 -6094 21602 37054 35711 21309 -9508 -37282 -42361 -58831 -52308
2768 -52308 -45088 -65889 -77575 -73320 -20026 -15196 -8650 -3427 1667 3895 5485 19471 4148
2755 4148 -18332 -16930 -10108 -33865 -37775 -2586 8967 -23557 -10489 -7669 3614 39832 7266
2742 7266 -17373 -3783 24520 40133 21260 -11781 -8112 7179 34972 52847 34970 10405
2730 10405 -3614 -2753 -8047 -34794 -19181 -16196 -24445 -22962 -27247 -24587 -17281 2215 35533 40690
2716 40690 18138 33201 35978 -4332 -22233 -24679 -8604 3236 -1397 -22839 -28526 -14664 3970
2703 3970 14776 94 15948 46747 25967 -19262 -24773 -10125 -24886 -35903 -48923 -39176
2691 -39176 -42713 -14618 -7359 81 6404 4409 27971 51153 58553 45486 44545 42118 25777 44788
2677 44788 33805 -7809 -1746 15063 -2943 7967 346 -8939 2570 10672 3541 -27520 -38445
2664 -38445 -71685 -67659 -54729 -54011 -52502 -13447 949 10622 19555 15658 36260 63556 47782
2651 47782 26177 7046 7109 11945 30759 48146 48168 38941 10983 -31527 -33809 -16610 12039 29993
2637 29993 13065 13000 4168 -5633 20330 12086 4433 5075 26064 30524 15141 17376 -6560 -27241
2623 -27241 -17012 23949 42562 41198 63369 54482 26623 19013 27574 14635 22733 20609 13606
2610 13606 13754 -14467 -6127 -447 -14256 -20852 -35698 -39420 -39197 8245 28239 39361 3050
2597 3050 -24150 -3371 17650 21281 12911 14107 8939 32079 33573 16194 -1486 344 25922
2584 25922 59108 57597 54913 13134 9141 11694 6280 12400 19569 12438 2770 -5530 16907 31879
2570 31879 3550 -11496 3881 29995 33695 26833 -12095 -7429 14158 18017 -12096 -24024 -19496
2557 -19496 -26442 -10306 16051 19507 18952 -10565 -49960 -17172 17188 16442 -2131 3871 11189
2544 11189 22933 17251 11955 5050 -27889 -16634 10070 30684 18869 2346 23961 22579 109
2531 109 11913 26057 -12017 -982 32562 47211 44636 78040 71027 38121 24869 10391 2537
2518 2537 -14540 12121 7247 -12932 -38936 -50813 -34693 -18588 -3072 -17945 -36633 -51140
2506 -51140 -10326 23568 18084 17682 39950 39139 24754 19820 -439 -18024 -14240 26358 47079
2493 47079 29590 28713 32238 9752 7423 13979 8225 -16739 -2901 10533 36705 41800 38715
2480 38715 53929 28229 1094 -6631 -21002 18964 54147 43335 43878 10219 -22754 -27405 -16470
2467 -16470 591 -3382 -3645 17157 19632 21722 -3157 -8435 -7593 3752 -10292 783 19902
2454 19902 7061 2605 8140 10023 8007 15893 4700 -7559 2104 20796 18166 -17592 -25259
2441 -25259 -13819 -899 2838 16428 11434 11958 23311 49254 26692 21369 10890 -6754 1126
2428 1126 6720 22094 22123 12424 18257 15570 3041 -7265 -13387 -14397 -12372 1307 -32958 -60094
2414 -60094 -50902 -42181 -29207 -16969 -27017 -26098 -31420 -27542 -35992 -46599 -45540 -49341 -36875 -43300
2400 -43300 -34259 -29548 -8747 7894 8926 563 15502 20206 45208 29461 -839 23539 23127
2387 23127 19167 41113 19595 20691 -12280 -13617 -7734 -15590 -22070 -46289 -39092 -18616 11213
2374 11213 11692 19769 35015 41703 29440 40704 60203 48941 31270 16032 12523 16092 145
2361 145 -19195 -28269 -12422 -370 -16796 -21427 -34194 -32612 -24498 -19799 -40345 -44628 -25708
2348 -25708 -17539 16725 50326 47842 26035 -7262 -13231 5095 26818 20920 4261 12141 30779
2335 30779 18108 11681 5203 90 -17924 -26816 -12107 12654 41736 49757 58219 52821 23268
2322 23268 6228 9028 -35159 -51303 -33444 -63938 -76713 -45458 -275 28386 -3032 -28432
2310 -28432 -30231 -17654 327 21033 15297 27565 52614 65777 55379 22668 -6540 -33827
2298 -33827 -27600 -11791 -14807 -15837 8844 22018 9794 -11450 11771 43409 50770 26118 16234
2285 16234 46872 47071 17218 4851 5954 19032 24551 -27305 -21863 -2101 11979 184 -1230
2272 -1230 5670 -13701 -21432 -21090 -47303 -9783 -16369 -56403 -59091 -53697 -59631 -48006 -62862 -64784
2258 -64784 -36306 -13356 -26154 -12233 -33207 -34630 -8917 12658 21893 23452 14598 16937 50131
2245 50131 56438 32618 24036 -17907 -48374 -42622 -24542 -21163 -25136 -18307 -8368 5705 -11494
2232 -11494 -27735 -42894 -33624 4394 -2101 -22292 -23556 -30235 -7584 1 -12138 12792 24334
2219 24334 -2970 1610 -31921 -30825 -1801 40300 30150 9855 5745 9634 14465 -2582 -22835
2206 -22835 -3358 34195 21786 7600 361 10997 4918 9066 22244 7408 6237 4724 2179
2193 2179 1022 22826 52223 75683 35499 -22609 -35780 -25629 -15114 2774 3355 -11364 -45313
2180 -45313 -43531 -19327 -22726 -37591 -31061 -4287 -4705 -28435 -28547 17927 17764 36666 53820 27486
2166 27486 -8629 23900 56220 37021 14998 -23772 -39492 -26737 -2389 29395 -12151 -43391
2154 -43391 -36921 -35223 -15381 -2250 -14394 -28485 -42500 -49756 -41757 -27843 -10896 -6105 -20719
2141 -20719 -4457 4634 7443 -403 -8887 -25692 -10078 -19897 -37655 -32966 -26271 9859 55636
2128 55636 81781 79078 66799 67648 54656 19467 -8301 -7267 21605 36197 34441 49835 42205
2115 42205 23270 20503 18031 -3824 -4238 3296 6632 47171 58877 21084 16139 23146 6916
2102 6916 25753 43266 52224 59187 34847 33226 15303 6057 3363 -9302 11730 16130 9128
2089 9128 -6427 4641 23689 30743 1180 -17070 -16646 8825 5516 713 10532 -2392 -15339
2076 -15339 -28306 -64376 -88418 -60895 -38986 -20124 24200 20210 -27524 -5080 30946 32373
2064 32373 33867 640 -30028 -60836 -58799 -38500 -4832 -15435 -8251 18865 21297 3505 3382
2051 3382 -16130 -18946 -39151 -30557 -30571 -33218 -8432 -5303 1223 23863 8676 -2584 23887 41804
2037 41804 58155 59985 44067 40780 40795 20930 -11365 -15179 -11964 -17835 -27127 -42003 -45576 -21202
2023 -21202 -3920 -22433 -15727 -17475 5589 25195 15129 5016 -24333 -32321 -12200 483
2011 483 12975 -1227 -28220 -28410 -15922 26274 34403 26546 7362 -10960 -12609 -27221 -5903
1998 -5903 23859 28870 -12327 -35131 -21996 9246 19852 13616 1104 -15943 2503 14109
1986 14109 -13733 -11509 2051 20810 32472 2679 -22777 8403 11562 -6872 -5502 8868
1974 8868 11343 -13322 -28554 12608 28181 6629 11211 21268 13001 -8145 -17469 -13525 7850
1961 7850 6347 -28404 -15450 9756 1003 -6786 6333 8086 17795 16256 21320 22330 -4297 -25667
1947 -25667 -36156 -22154 6418 23236 19507 11571 18983 -3774 -16990 -25991 2897 46007 54281
1934 54281 1373 -40142 -37908 -42449 -45577 -50690 -29515 10866 2299 3186 22334 32325 24972 24244
1920 24244 20872 15395 -1003 -31843 -19631 1471 18921 27068 39815 57171 51269 59420 36279
1907 36279 -3618 15991 34425 4150 -18027 -10750 -26523 -37453 -19210 -26850 -33887 -46226
1895 -46226 -56578 -47131 2214 45371 22507 7664 -8419 -5640 -7656 24918 50036 56429 22777
1882 22777 -5521 -8842 -8820 5646 22151 18735 -11646 -17681 -16029 -33713 -32418 -30694 -27921 1149
1868 1149 9194 20659 13107 2494 -23675 -31264 -18352 -20660 11521 -171 -15521 -1712 8906
1855 8906 24537 28030 15837 -8019 -9724 -16237 -1808 -1888 -8273 -19994 6261 9037 -6531 -5589
1841 -5589 3677 21741 -13396 -13411 7565 12425 31154 30175 24742 4630 -18375 -3068 -11925 -23440
1827 -23440 -7973 -6096 4243 10382 12443 13644 27370 32608 64890 55935 26376 1167 -5296
1814 -5296 25981 17116 8818 -991 -38962 -43414 -26676 -12225 17874 45285 21860 14944 15346
1801 15346 27752 23881 9940 -8904 -2251 10319 36046 31696 42787 30354 35687 21636 17996
1788 17996 -3324 -9710 -9510 -14318 1892 12915 152 4258 13259 24275 48427 56348 49863
1775 49863 56238 38238 -19322 -35114 -27154 -3683 8530 602 26825 52768 64445 53630
1763 53630 23749 21716 32435 51819 63988 33096 -486 -37375 -24189 14637 9408 -17984
1751 -17984 -39933 -38650 -12791 14762 -20036 -43173 -55451 -61794 -47791 -60697 -30796 -13436
1739 -13436 -1570 -3289 -1836 -7437 8589 13182 4188 -4364 -12239 14873 35895 60842 53196
1726 53196 33341 45231 46842 27983 5681 -13836 -16662 -11446 9740 20401 26066 22414 9392
1713 9392 20449 17061 -4270 -41135 -44602 -53666 -46864 -22054 -1268 10345 -9319 -6588 -1386
1700 -1386 -9671 -16605 -19585 -13828 9377 -5114 -16489 -10587 -32328 -55329 -47367 -30328 -25209
1687 -25209 -10758 115 -26094 -15773 -18061 -5548 21751 20019 38173 14883 26574 40917
1675 40917 26505 32218 38248 5350 -20817 11078 25403 36826 34748 19160 8658 18403 7304
1662 7304 -1313 -18478 -22539 -33778 -47371 -55555 -18816 -20400 -29095 -9407 6372 -4016 -5597
1649 -5597 -2916 3721 1714 6077 26582 -5190 -3050 -8866 3930 35514 31193 4137 4037 -26950
1635 -26950 -33802 -54066 -59052 -6221 29641 15388 17337 -4788 -22096 -21760 -42089 -10748 9663
1622 9663 -11560 -17931 992 -4423 7195 19128 48047 33615 18965 26105 37546 30123 10559
1609 10559 6696 -3042 9553 -20831 -34668 -1872 17137 957 -12470 -8459 2465 27852
1597 27852 31117 19217 -10738 -21184 11213 3510 -22314 -14355 -28065 -31268 -32373 -14394 17988
1584 17988 20433 10024 -1658 10550 22034 18777 -3946 -39883 -37861 -22074 -2179 18527
1572 18527 -26335 -24945 -14383 -12071 -23038 -34835 -17350 -12082 -38563 -44670 -21442 7753 -124
1559 -124 -16612 -20337 -31379 -20625 -8100 -8150 -24 36541 35090 42104 57106 27428 4667 28992
1545 28992 -1593 -18813 -23071 -12067 13852 24511 8416 -26670 -18346 -25320 -40831 -36916 -39766
1532 -39766 -38764 -54400 -77406 -51766 -24353 -14211 16852 49457 51355 23208 18117 19755 -27041
1519 -27041 -27887 -10671 10067 30464 41212 43457 65353 62880 28838 5325 -6797 -14553 8747
1506 8747 16395 571 -24320 -38498 -28743 -28221 10612 45836 75444 67378 68679 54793 33009
1493 33009 48860 70002 62823 -6953 -46252 -22877 -22106 1105 16089 5661 6564 160 -3923
1480 -3923 4351 19783 12248 21547 21603 13719 26145 28163 43074 58307 49284 12395 15115 16946
1466 16946 27411 41039 39146 33863 14676 -15553 -21871 -44662 -14081 9312 -2607 -32959
1454 -32959 -31968 340 -32657 -59281 -52647 -22741 -6238 10822 13457 7682 3145 -7865 -5064
1441 -5064 -17318 8259 22413 11214 6988 -11379 -12791 -10885 22539 57535 70505 50917 18702
1428 18702 24100 39873 37801 27720 28268 13677 2676 -25062 -4250 -10175 2979 5730 7728
1415 7728 15338 15588 55609 54536 50040 35884 2988 -20175 -39387 -45128 -39824 -32163 -45152 -37307
1401 -37307 -6994 13858 21439 39601 15555 -24922 -22668 18234 13743 38519 49389 29174
1389 29174 36250 105169 108843 73805 52976 50699 59207 3981 -34999 -16949 7834 18925 4611
1376 4611 -23718 4362 29269 21659 7730 3754 -3619 25780 34107 19471 2308 17608 25456
1363 25456 25728 33152 55600 25007 8294 9315 30312 28355 41553 30647 22410 13402 13041 -2564
1349 -2564 -27297 -34760 -34998 -19208 -18442 -11865 29321 51846 22403 620 -1219 20360 15792 -2231
1335 -2231 11438 29267 38376 52587 30052 26691 27274 39625 24440 15281 19016 4679 -3877
1322 -3877 -20451 -25557 -9016 29084 63743 47741 53449 44129 44044 32579 34635 41727 19689 27264
1308 27264 29234 15043 13933 15253 23375 18237 -10697 -41839 -50885 -33067 -24374 -12528 1139
1295 1139 -14505 -29355 -13648 12317 14686 -22885 -7114 6431 11263 17926 38381 14332 43250
1282 43250 36102 45611 47115 24899 26918 13351 8469 -2452 -9044 -21248 -15809 -7099 783 -8785
1268 -8785 -14467 -28553 -32447 -22415 -32583 -50795 -48525 -34600 -30315 -6300 -5376 -9036 -19371
1255 -19371 -20219 2226 3794 21325 22435 -3484 3229 41283 37300 20436 8287 -17630 -13563
1242 -13563 625 -3209 -18684 -37512 -17850 -21295 -41816 -8527 14363 445 20185 30515
1230 30515 33003 44740 55171 74525 74156 53704 54400 60851 51381 41597 5948 -19431 -23053 -31418
1216 -31418 -33973 -24169 -18597 -6940 24774 44411 22976 15972 38385 39897 31230 36486 28440
1203 28440 573 -11731 14266 35335 29266 27332 29899 14479 23626 12144 4114 3595 27029
1190 27029 9885 2222 -16404 7122 32043 -1330 -34299 -34486 -19993 -5806 -13847 -49932 -67217
1177 -67217 -36965 6530 9157 8097 1372 4548 11250 18592 -8859 -9686 -2919 23775 18703 2886
1163 2886 -26326 -41830 -18660 1997 25923 27674 18310 37651 18358 -4185 9046 7672 10442
1150 10442 30482 34042 36621 58722 44319 20698 16018 -9821 -21703 26182 50162 62739
1138 62739 46962 39310 56188 27920 -32206 -71967 -71844 -38945 -42422 -13470 12615 44313 35249
1125 35249 15152 11242 4304 -3167 -24535 1648 29056 41104 24117 22504 15790 6728 -267
1112 -267 -3317 -5817 9400 8298 4883 13525 32159 24204 23262 24762 7738 -14452 -38115 -30070
1098 -30070 11824 25614 11036 16444 16593 -2755 925 -15861 -13835 -1517 -4265 -17724 -6909
1085 -6909 4010 -4250 -15373 -4296 -8058 528 -12431 -9219 -12129 -14694 13950 38938 62670
1072 62670 44505 25099 22389 -4807 -20592 -11382 -626 -16856 11502 35473 41750 34898 30375
1059 30375 -5281 1308 39110 40369 4641 -14384 -7148 -16718 -14134 -16847 -26912 -32760 -23790
1046 -23790 -26142 -24473 -43090 -38811 -14501 -15593 -27410 -34151 -8542 34030 46251 36361 32349
1033 32349 37653 42873 53018 36911 62450 68351 43998 -2096 -5344 8541 17258 21506 30931
1020 30931 14484 -2733 -10193 -24289 -33508 -39045 -39705 -14154 18110 20348 42103 24316 -1341
1007 -1341 5101 31275 53112 102791 118222 94038 64626 62030 36432 41412 23209 10274 26264
994 26264 45816 31593 981 -12708 -13645 2611 537 8123 30044 18572 20676 12374 15383
981 15383 31392 32052 31106 34856 4386 -9197 -15160 3720 27045 21784 28586 54498 48759 44030
967 44030 35816 -5532 -37280 -33377 3649 11337 12012 7085 -12436 -30087 -39633 -16208 26020
954 26020 23444 11678 15179 12474 10681 -8088 -18873 11131 8295 -20530 -27347 -39462 -31809
941 -31809 -7506 12249 32545 35738 32048 743 -5319 -635 23949 40632 41684 16890 -15871
928 -15871 -30119 -26114 -12879 14763 21839 20317 9425 1308 -26373 -11503 2495 5311 28889
915 28889 20129 -10921 2656 4820 6876 -1110 5194 31245 46907 38253 17013 6668 -17180
902 -17180 -19807 -8951 -8889 -21228 9704 13513 26614 38580 17908 2985 19698 17233 10215
889 10215 8970 5889 13149 19303 9060 19587 18062 29442 16161 -1194 -19898 -35359 -12386
876 -12386 25692 35232 12648 25153 -11483 -15909 -13571 -4751 5035 -4235 -12308 -8091 -3292 -6513
862 -6513 -30815 -43333 -37566 -5867 9740 24567 -1912 -27799 -3327 9237 17433 10981 -26279
849 -26279 -20418 13700 6985 -14072 -3745 -23231 -17626 4276 13926 28789 20356 22107 39027
836 39027 62919 52021 43659 47137 41834 42426 44538 58495 44901 30979 45886 32631 22920
823 22920 33726 23857 31559 7322 351 -12960 -4745 -334 15150 17546 7273 7011 3532 2263
809 2263 5146 30064 20605 -1834 18909 35319 41242 34901 43635 52895 49741 17788 24836 52230
795 52230 53045 48002 21600 4791 10454 36998 31631 18375 -22960 -15127 12560 14751 24022 37202
781 37202 43342 25999 19288 36664 50056 53672 56315 47826 78603 82896 60286 36612 32662
768 32662 30250 9997 22311 18945 12926 32150 31145 35918 17327 40 -40 16325 24672 23660
754 23660 20338 13792 43646 53092 42196 21774 11678 9830 879 -25193 -30814 -8869 -1339
741 -1339 -2153 -28856 -23054 -8762 23918 6254 -2321 -14289 -29701 -29085 -48315 -19335 3585
728 3585 55340 73619 78660 85160 76692 64765 51530 42921 38125 53575 45217 -79 12093
715 12093 24543 18310 29401 42853 48878 40509 37419 51917 46276 37622 24315 32715 81219
702 81219 74049 48100 27728 32196 3479 -39239 -53605 -22730 7479 18587 9286 3523 6820
689 6820 24226 37939 25573 23505 18464 12260 15880 9060 20605 21751 13637 13114 28483 37012
675 37012 40602 21055 -1714 -28777 10508 42985 47062 31496 40563 50052 53927 22768 8456
662 8456 56775 49511 35746 49620 52239 56149 40825 10652 10925 42643 37814 49372 58904 68310
648 68310 72617 54960 51085 46794 56669 52113 41014 37056 41851 50657 36038 12703 -21100 -37778
634 -37778 -17357 -15078 -3986 8976 20950 29805 41937 29587 -1173 -9078 8466 11795 26320
621 26320 30538 63100 44025 23837 24877 25571 9547 -1296 19465 34526 33057 45265 40952
608 40952 9329 4407 10362 48148 65277 57089 23360 -28274 -14473 -7754 7045 -11585 -147
595 -147 5073 25738 33610 48968 44085 24040 18225 -2111 -8238 5866 38796 20709 36948
582 36948 36216 11299 -9949 -11276 -11714 10598 779 -22046 -38185 -9810 -904 13949 11199 -10797
568 -10797 -12255 -10087 4920 17964 37879 85068 84675 67247 73396 41969 13261 24691 34699
555 34699 33167 31522 38385 40454 21459 6082 18319 6049 9604 33534 49390 42941 33812
542 33812 30013 27791 6275 -22473 -6267 -4590 -10930 19413 37845 1408 8088 30051 31897
529 31897 36161 36919 27304 10611 -10449 -77 18635 23198 8341 -4677 13770 7697 -14683
516 -14683 7999 32841 43165 51601 50750 41630 24240 30064 39333 39455 32509 44455 77479 56140
502 56140 21066 13675 32892 12153 -31535 -18865 18643 14470 -2763 7043 315 -8781 -4864
489 -4864 -20486 740 37967 48990 34459 13506 28218 40495 53152 34783 10277 -20288
477 -20288 4271 13094 30501 23863 23246 41862 45404 26129 9794 -343 27113 45129 38134
464 38134 34192 63675 81402 75482 76140 62232 42487 31296 52510 52719 47184 64092 53170
451 53170 24065 2559 -3072 36012 70185 61847 44265 10979 17881 12021 3620 27655 40949
438 40949 27636 38231 37916 15562 33314 42691 43566 45428 48030 46817 16434 1065 -8592 -16004
424 -16004 -17240 -16512 -1181 48921 65041 80359 72820 67314 66802 52004 47077 68297 74398 84024
410 84024 76433 77356 125635 75639 56689 49787 22421 40588 40250 15801 26585 36457 18229
397 18229 471 -5432 24733 34004 49363 77929 68615 15238 16679 33544 41947 33205 12497
384 12497 17641 58943 55441 27461 5372 19892 44289 55124 39059 27944 18926 1735 11946
371 11946 21215 9554 9090 9311 18823 22318 43460 19761 -3849 -7578 -11571 6374 8921 28850
357 28850 49870 35088 33623 28118 15629 -7463 -4902 6148 30222 24815 17629 40654 43710
344 43710 44332 64234 58749 17371 -16464 -21591 5063 58904 94382 92753 89925 91981 68132
331 68132 46395 38052 38072 33828 25655 28684 47542 63039 58659 57897 29378 4630 12952 24354
317 24354 20030 36018 36738 24157 29876 30899 34498 35276 44269 12107 -15938 2902 33009 38131
303 38131 29581 15116 -7146 8819 13916 48955 63383 81075 77426 46210 23685 12754 17984
290 17984 19924 5985 26080 37604 46757 57249 64101 64681 42422 29687 12132 -3767 -9536
277 -9536 17151 21384 16871 27284 38623 27149 9220 14389 38830 70080 63860 58437 62994
264 62994 40299 7631 -12915 13666 20965 18476 35466 35832 6521 5704 -1219 5214 9599 11350
250 11350 15805 33939 34030 10909 31729 39352 18222 -9379 -22609 523 1871 13786 29121
237 29121 23589 4222 5163 25281 348 -4297 4851 17096 -4906 -28659 -2680 30101 34983
224 34983 34976 11047 -8558 -19276 -29614 -30582 3315 -3608 -2884 11325 11930 -11455 -23393 10462
210 10462 17008 5863 26 16336 33768 22008 28697 19027 7691 18558 27789 58878 65699
197 65699 53594 23784 1040 6251 33955 48023 45242 25846 17329 24393 59311 73390 72848
184 72848 79036 51769 5553 8947 7522 -3970 -7299 -7200 14783 35963 54659 55038 47574 50671
170 50671 63684 86013 94309 80934 59595 38837 38736 50738 20826 10405 2124 -2549 8488
157 8488 23592 32093 21115 4173 14292 25527 36163 37419 37136 40781 42858 41363 64051 78764
143 78764 78769 55344 40127 40066 66868 69044 59523 71974 52164 38201 35909 33320 35475 49851
129 49851 46781 22608 33500 40744 34262 39576 35772 24739 51489 48821 39288 33697 35532 43649
115 43649 52258 46162 36451 35546 42256 53481 44555 25842 46564 55867 35550 34900 48008 55276
101 55276 53761 50971 44109 45641 58167 65224 50953 52388 62435 50740 30456 27785 49449
88 49449 52221 30604 27959 29117 17216 15081 13616 19029 1751 -6760 -5735 3360 5005 16628
74 16628 9420 9301 6485 7980 10181 -7246 -6662 -3203 4838 17141 23808 27955 44566 33117 6167
59 6167 5242 20713 27464 45915 52881 43322 44038 54946 63772 55737 44555 36130 24563 22721 23687
44 23687 16476 20454 39708 49414 39549 38168 46333 57009 57137 37773 33448 14414 13108 22484
30 22484 35042 47555 71308 68682 51148 48758 48197 47967 41536 14860 6408 22968 26283 25347
16 25347 40443 40585 56855 65411 53885 37315 25136 33368 25585 5896 -7253 16762 12944
3 12944 7303 6975 7302
0 7302
$$ Imaginary data points
##PAGE= N=2
##DATA TABLE= (X++(I..I)), XYDATA
32767 92511 101664 103165 86853 92170 98796 80931 73428 75559 108023 119482 98675 73908 84967
32754 84967 87850 86651 89674 88329 77155 81629 72267 68579 74850 74743 64476 78763 79213 93860
32740 93860 90184 95680 102045 77735 93292 84569 82499 77212 91774 89735 88809 84448 91557 106736
32726 106736 98605 85603 85368 101111 99738 108312 111021 110560 130570 135525 140402 161867 162078 157440
32712 157440 126248 104457 103166 103269 102638 113920 115367 101771 119435 128489 112812 95859 114223
32699 114223 117482 110456 110459 123516 117628 101494 112288 111843 104252 99212 100152 114315 124295 110881
32685 110881 94854 95484 114173 122718 133128 130194 135622 125882 108330 117129 120465 123578 111067
32672 111067 106623 126107 115839 118335 128376 121902 111908 104240 120804 127461 116649 143080 166405
32659 166405 158969 168677 179547 180180 161139 176718 184568 177905 173029 170045 179031 192943 187888
32646 187888 195484 173465 148147 142668 147925 162376 170618 158104 170436 164297 161138 168572 171508
32633 171508 172785 174856 178148 172585 175563 187272 203346 193032 187044 169046 180641 181132 182429
32620 182429 172481 178455 173030 174673 168145 175624 180707 172771 163586 157060 184620 156871 138706
32607 138706 148656 168480 191372 202594 212099 204655 193195 188539 178268 170388 195109 206925
32595 206925 198195 183880 181390 183743 194674 201141 200788 172677 162931 184969 190733 196054 205872
32582 205872 220761 227586 231212 222929 196711 198654 228423 231706 222016 215293 231481 253568 221907
32569 221907 206745 207093 194380 214433 238062 232907 215710 212891 220859 206805 206789 240719 233667
32556 233667 240895 219237 189499 207187 226522 231024 220195 229900 228760 206119 198606 216536
32544 216536 214515 222227 216879 207607 212471 237761 236170 224284 233924 246166 246474 215401 229859
32531 229859 248624 247314 274429 276912 258208 256890 263439 278537 276215 278057 254784 240842 233404
32518 233404 240494 258200 261395 242503 264990 267979 232408 221501 238679 236305 234628 240883 222210
$$ [...]
##END NTUPLES=NMR SPECTRUM
##END=
