##TITLE=Analysis number 325638
Compound Code km 01974
Book Reference 24294
Project Code adrs fraglib
Chemist Name jom
##JCAMPDX= 6.0         $$ Bruker NMR JCAMP-DX V2.0
##DATA TYPE= NMR SPECTRUM
##DATA CLASS= NTUPLES
##ORIGIN= Bruker BioSpin GmbH
##OWNER= nmr
$$ XWIN-NMR		Version 3.5
$$ Fri Jan  5 14:15:21 2007 GMT Standard Time (UT+0h)  MAYBRIDGE\nmr@NMR_250MHZ
##.OBSERVE FREQUENCY= 250.131544655141
##.OBSERVE NUCLEUS= ^1H
##.ACQUISITION MODE= SIMULTANEOUS (DQD)
##.ACQUISITION SCHEME= undefined
##.AVERAGES= 16
##.DIGITISER RES= 18
##SPECTROMETER/DATA SYSTEM= dpx250
##.PULSE SEQUENCE= zg30
##.SOLVENT NAME= CDCl3
##.SHIFT REFERENCE= (INTERNAL, CDCl3, 0, 16.5223)
##AUDIT TRAIL= $$ (NUMBER, WHEN, WHO, WHERE, WHAT)
$$ ##TITLE= Audit trail, XWIN-NMR		Version 3.5
$$ ##JCAMPDX= 5.01
$$ ##ORIGIN= Bruker BioSpin GmbH
$$ ##OWNER= nmr
$$ C:\u/data/dgb/nmr/ADRS/540/pdata/1/auditp.txt
$$ ##AUDIT TRAIL=  $$ (NUMBER, WHEN, WHO, WHERE, WHAT)
(   1,<2007-01-05 14:15:01.67 +000>,<MAYBRIDGE\nmr>,<NMR_250MHZ>,
      <created by zg, POWCHK disabled, PULCHK disabled
       configuration hash MD5:
       49 4B E0 1D 92 C2 6B 37 9F E6 65 BC 52 41 86 1D
       data hash MD5: 64K
       81 D6 CD 65 23 47 E2 9B E5 2E 67 86 9D 3C 32 20>)
(   2,<2007-01-05 14:15:13.34 +000>,<MAYBRIDGE\nmr>,<NMR_250MHZ>,
      <Start of raw data processing
       ef LB = 0.3 FT_mod = 6 PKNL = 1 SI = 32K 
       data hash MD5: 32K
       11 83 23 30 59 36 95 69 4E 14 96 42 30 0C DB 86>)
(   3,<2007-01-05 14:15:15.03 +000>,<MAYBRIDGE\nmr>,<NMR_250MHZ>,
      <apk 
       data hash MD5: 32K
       F5 3D 3D D4 38 A8 B0 4E BF 5B 8E CE EB 9E 85 B7>)
(   4,<2007-01-05 14:15:15.75 +000>,<MAYBRIDGE\nmr>,<NMR_250MHZ>,
      <abs ABSG = 5 
       data hash MD5: 32K
       D3 A5 F6 17 29 DB 43 80 C0 C0 8C 0D 59 C4 85 35>)
$$ ##END=
$$ 
$$ hash MD5
$$ 1B 3C 5F 88 EF 15 85 0A EC 76 6D 32 DF 2E 1D A0
##$RELAX= 
##$RELAX= 
##$RELAX= 
##$RELAX= 
##$RELAX= 
##$RELAX= 
##$RELAX= 
$$ Bruker specific parameters
$$ --------------------------
##$DU= <C:\u>
##$EXPNO= 540
##$NAME= <ADRS>
##$PROCNO= 1
##$TYPE= <nmr>
##$USER= <dgb>
##$AMP= (0..31)
100 100 100 100 100 100 100 100 100 100 100 100 100 100 100 100 100 100 
100 100 100 100 100 100 100 100 100 100 100 100 100 100 
##$AQSEQ= 0
##$AQ_mod= 3
##$AUNM= <au_zg>
##$AUTOPOS= <54 >
##$BF1= 250.13
##$BF2= 250.13
##$BF3= 250.13
##$BF4= 250.13
##$BF5= 500.13
##$BF6= 500.13
##$BF7= 500.13
##$BF8= 500.13
##$BYTORDA= 1
##$CFDGTYP= 0
##$CFRGTYP= 5
##$CHEMSTR= <none>
##$CNST= (0..31)
1 1 145 1 1 1 1 1 1 1 1 1 1 1 1 1 1 1 1 1 1 1 1 1 1 1 1 1 1 1 1 1 
##$CPDPRG= <>
##$CPDPRG1= <>
##$CPDPRG2= <>
##$CPDPRG3= <>
##$CPDPRG4= <mlev>
##$CPDPRG5= <mlev>
##$CPDPRG6= <mlev>
##$CPDPRG7= <mlev>
##$CPDPRG8= <mlev>
##$CPDPRGB= <>
##$CPDPRGT= <>
##$D= (0..31)
0 1 0 0 0 0 0 0 0 0.06 0 0 0 0 0 0 0.0002 0 0 0 0 0 0 0 0 0 0 0 0 0 0 
0 
##$DATE= 1168006500
##$DBL= (0..7)
120 120 120 120 120 120 120 120 
##$DBP= (0..7)
150 150 150 150 150 150 150 150 
##$DBP07= 0
##$DBPNAM0= <>
##$DBPNAM1= <>
$$ [...]
##$SUBNAM7= <"">
##$SUBNAM8= <"">
##$SUBNAM9= <"">
##$SW= 20.6930455092707
##$SWIBOX= (0..15)
0 0 3 0 0 0 0 0 0 0 0 0 0 0 0 0 
##$SW_h= 5175.983436853
##$TD= 65536
##$TD0= 1
##$TE= 294.16
##$TE2= 300
##$TE3= 300
##$TEG= 300
##$TL= (0..7)
0 120 120 120 120 120 120 120 
##$TP= (0..7)
150 150 150 150 150 150 150 150 
##$TP07= 0
##$TPNAME0= <>
##$TPNAME1= <>
##$TPNAME2= <>
##$TPNAME3= <>
##$TPNAME4= <>
##$TPNAME5= <>
##$TPNAME6= <>
##$TPNAME7= <>
##$TPOAL= (0..7)
0.5 0.5 0.5 0.5 0.5 0.5 0.5 0.5 
##$TPOFFS= (0..7)
0 0 0 0 0 0 0 0 
##$TUNHIN= 0
##$TUNHOUT= 0
##$TUNXOUT= 0
##$USERA1= <user>
##$USERA2= <user>
##$USERA3= <user>
##$USERA4= <user>
##$USERA5= <user>
##$V9= 5
##$VALIST= <valist>
##$VCLIST= <CCCCCCCCCCCCCCC>
##$VD= 0
##$VDLIST= <DDDDDDDDDDDDDDD>
##$VPLIST= <PPPPPPPPPPPPPPP>
##$VTLIST= <TTTTTTTTTTTTTTT>
##$WBST= 1024
##$WBSW= 4
##$XGAIN= (0..3)
0 0 0 0 
##$XL= 0
##$YL= 0
##$YMAX_a= 286712
##$YMIN_a= -348246
##$ZGOPTNS= <>
##$ZL1= 120
##$ZL2= 120
##$ZL3= 120
##$ZL4= 120
##$ABSF1= 16.5223
##$ABSF2= -4.170872
##$ABSG= 5
##$ABSL= 3
##$ALPHA= 0
##$AQORDER= 0
##$ASSFAC= 0
##$ASSFACI= 0
##$ASSFACX= 0
##$ASSWID= 0
##$AUNMP= <proc_1d>
##$AZFE= 0.1
##$AZFW= 0.1
##$BCFW= 0
##$BC_mod= 0
##$BYTORDP= 0
##$COROFFS= 0
##$CY= 12.5
##$DATMOD= 1
##$DC= 0
##$DFILT= <>
##$DTYPP= 0
##$F1P= 14.0000005364418
##$F2P= -0.99999901652339
##$FCOR= 0.5
##$FTSIZE= 32768
##$FT_mod= 6
##$GAMMA= 0
##$GB= 0
##$INTBC= 1
##$INTSCL= 1
##$ISEN= 128
##$LB= 0.3
##$LEV0= 0
##$LPBIN= 0
##$MAXI= 10000
##$MC2= 0
##$MEAN= 0
##$ME_mod= 0
##$MI= 0
##$NCOEF= 0
##$NC_proc= -3
##$NLEV= 6
##$NOISF1= 0
##$NOISF2= 0
##$NSP= 0
##$NTH_PI= 0
##$NZP= 0
##$OFFSET= 16.5223
##$PC= 1
##$PHC0= 224.5157
##$PHC1= 7.253364
##$PH_mod= 1
##$PKNL= yes
##$PPARMOD= 0
##$PSCAL= 4
##$PSIGN= 0
##$REVERSE= no
##$SF= 250.129999924764
##$SI= 32768
##$SIGF1= 0
##$SIGF2= 0
##$SINO= 400
##$SIOLD= 32768
##$SREGLST= <1H.CDCl3>
##$SSB= 0
##$STSI= 32768
##$STSR= 0
##$SW_p= 5175.98343685301
##$SYMM= 0
##$S_DEV= 0
##$TDeff= 65536
##$TDoff= 0
##$TI= <Analysis number 999999
Compound Code 99
Book Reference 9
Project Code 9>
##$TILT= no
##$TM1= 0
##$TM2= 0
##$TOPLEV= 0
##$USERP1= <user>
##$USERP2= <user>
##$USERP3= <user>
##$USERP4= <user>
##$USERP5= <user>
##$WDW= 1
##$XDIM= 32768
##$YMAX_p= 458535902
##$YMIN_p= -412419
$$ End of Bruker specific parameters
$$ ---------------------------------
##NTUPLES= NMR SPECTRUM
##VAR_NAME=  FREQUENCY,     SPECTRUM/REAL,   SPECTRUM/IMAG
##SYMBOL=    X,             R,               I
##VAR_TYPE=  INDEPENDENT,   DEPENDENT,       DEPENDENT
##VAR_FORM=  AFFN,          ASDF,            ASDF
##VAR_DIM=   32768,         32768,           32768
##UNITS=     HZ,            ARBITRARY UNITS, ARBITRARY UNITS
##FACTOR=    0.157963299565203, 1,           1
##FIRST=     4132.72307790427, 0,            0
##LAST=      -1043.26035894874, 0,           0
##MIN=       -1043.26035894874, -412419,     0
##MAX=       4132.72307790427, 458535902,    0
$$ Real data points
##PAGE= N=1
##DATA TABLE= (X++(R..R)), XYDATA
$$ [...]
16600C19213l2055l6323l1385m4997l8903k6891k9194M05K4319K8015P4939L6571
16588B43714L5560L377q5746p0151o3574l6750l5839M855N062K4369J3564J2581
16576E1022L3807j0649o769K3574j1069o5976m8132q1109j3177J8396J2159P021
16564i0902J9755Q832k0101J5083L3921Q951P386o880K5915J233j1363k1411J992
16551b7589j5924k0735J0212J6706J5988K8023K1338j0213k4523j6894J671J0702
16539a1238K1555M606J1854j975J0724o512m6070J000K1100K945J6887O653j9183
16526A2346J1034K9479k0290m1271j1281J4032j6205r516L3154L0339J4043k6239
16514A9625j1969K6937j8562j4286m012L728L9348j4730j6665J2319k8339J2063
$$ y = [319213, 287158, 250835, 219450, 174453, 135550, 108659, 79465, 79870, 104189, 132204, 207143, 243714, 279274, 282651, 196905, 126754, 63180, 26430, -9409, -4554, 508, 24877, 38441, 51022, 84829, 74180, 67411, 90985, 79916, 13940, -34192, -115301, -128478, -110082, -97923, -90902, -71147, -62315, -82416, -67333, -33412, -24461, -17075, -23955, 1960, 3193, -8170, -29581, -27589, -43513, -64248, -54036, -37330, -21342, 6681, 28019, 17806, -6717, -23611, -21940, -11238, 10317, 14923, 26777, 24802, 35526, 29014, -17056, -16056, 5044, 7989, 24876, 31529, 12346, 23380, 52859, 32569, -8702, -19983, -5951, -22156, -31672, 1482, 31821, 45864, 19625, 7656, 34593, 16031, 1745, -2267, 1461, 40809, 26079, 9414, 21733, -6606, 5457]
16502E457J2365K772L195J7470r418k7069N644P738Q669m466j466k9773J7043
16489H161P160p764k3046n380p983j0731j8235l94l502j2174J2604M419M016J1039
16475d1810K3845J7448J9562j0022Q332K0675k282l8283o540J4323k6928n258
16463b6938K0444J0497j0121n0700k0221j2288j569K6828K6964K274r195N377
16451c8648k551k712L8089K5578n542j8158k0346p73M6119O664j7606j3164L564
16438E14j9829k8519j5710l0213Q689K0214k1439p865R188K9437M347l8093M1750
16425d7529O6155k5533J8286K3045P200l5805k6364l0775J5944L3841j0694m764
16413a6993J2843m162J1645L407j9860k6909j1745o093K220K2027M261j3094k5955
$$ y = [5457, 17822, 20594, 23789, 41259, 31841, 4772, 10416, 18154, 26823, 22357, 20891, -8882, 8161, 15321, 7557, -15489, -20869, -28852, -39583, -57818, -58212, -61714, -73888, -61284, -56865, -52849, -41810, -17965, -517, 19045, 9023, 17355, 38030, 35748, -2535, -9075, 5248, -21680, -26938, -6494, 4003, -6118, -56818, -77039, -89327, -90896, -64068, -37104, -34830, -44025, -38648, -41199, -43911, -5822, 19756, 14214, -3944, -24290, -25063, 21056, 27720, 10114, -3050, 514, -19315, -47834, -63544, -93757, -85068, -64854, -86293, -94158, -84970, -55533, -51186, -89279, -47529, 18626, -6907, 11379, 34424, 41624, 5819, -20545, -51320, -35376, -1535, -12229, -16993, -4150, -8312, 3333, 6740, -13120, -40029, -51774, -57867, -55647, -33620, -29359, -42453, -68408]
16400f8408K1929J7714N591L0954M800J6697j0256j2467k7186R562K2346l6462
16388b5186J684J7599J3382l4428K280M83l234j9728j199M167j5760l0217K1526
16375f8631M0388o088J1696K5766R596n552o585L271K574m663k0991j4879k4824
16362e8922o97L478o269J0445r594J0415L6489k404R529k1913m0786j7170R435
16349g7964Q727k178L1308Q619n76M815K2670K1664j7172k3222J2884J0192r968
16336a0201j145J3479p327Q310L3351J0503J1298j1303l5386J1095k7899k0684
16324b5909P875j8486k2959J5236J488K1373N0347k387k7883k7566n677L3945
16312f03J5909n830k2387O468M436l2088j8034K8952O873j1141k3936r457K9357
$$ y = [-68408, -46479, -28765, -23174, 7780, 12580, 29277, 19021, 6554, -20632, -11070, 11276, -25186, -23502, -5903, 7479, -26949, -24669, -24186, -27420, -47148, -48347, -44180, -59940, -90157, -68631, -28243, -34331, -22635, 3131, 12727, 7175, 590, 3861, 6435, 1772, -19219, -34098, -58922, -59619, -56141, -62410, -51965, -61559, -51144, -14655, -17059, -7530, -29443, -70229, -87399, -77964, -69237, -71415, -40107, -31488, -32064, -27249, -4579, 17085, -87, -23309, -10425, -233, -10201, -11346, 2133, -5194, 3116, 36467, 46970, 58268, 46965, 11579, 22674, -5225, -25909, -18034, -36520, -59479, -44243, -42755, -21382, 28965, 26578, -1305, -28871, -34548, -603, 15306, 9476, -12911, -6443, -2007, -34095, -52129, -23177, -16304, -27445, -51381, -60838, -31481]
16299c1481k010K2162K4319k671o303j0039k5798l8910j6107R800L3231l195j6542
16286f3544J9209K8153r678n741l547j6486k9878j6260M0522p418L578L9775K8885
16273G570J3453k585j2309k677J717j1776j6210n243o632M506Q830K1440j1620
16260a1536j5231m517P925j4485J0627K4122k6387k3518K9569j3496L448r693
16248d3172l0329n719L7810M1642J3754j5577k1180P70J8089J1489j6406j276
16236a0105O898j3832n059m920j1728N109k6400k819J0487j3917m935J3151k3463
16223h1533R327N918k023K2606N495m0436o45L3671J1029l0179k7524N1099M3319
16210A24k954k2619l102m177j4409L408K6348r080k630J116k5385K0267K8277
$$ y = [-31481, -33491, -11329, 12990, 10319, 4016, -6023, -31821, -70731, -86838, -77038, -43807, -47002, -63544, -44335, -16182, -25860, -31601, -35148, -51634, -81512, -97772, -57250, -64668, -61090, -21315, 7570, 21023, 18438, 6129, 3452, 5169, -6607, -22817, -28060, -34692, -30186, -21356, 84, -11536, -26767, -31284, -23359, -37844, -27217, -3095, -29482, -53000, -23431, -36927, -33479, -43172, -73501, -79220, -41410, 232, 13986, -1591, -22771, -22001, -3912, 7577, -8829, -10105, -3207, -17039, -22098, -27018, -38746, -33637, -60037, -62856, -52369, -66286, -71221, -58070, -81533, -72206, -66288, -68311, -45705, -40210, -80646, -81291, -47620, -36591, -66770, -94294, -43195, 124, -2830, -25449, -28551, -32728, -47137, -43729, -17381, -26461, -29091, -27975, -53360, -33093, -4816]
16197d816j1053j451m149M3569L9772j2719J7336L3706K2125M9996L3502l4661
16185A71157o1295n118j8164j8532j1727J3264L9168K2645L1297M8922N3662J3568
16173B78847r12O402m0304k7284j8560K1160K6813L0525K3228p732m0934J556
16161B52805K3436K2422o741n8057p0449l3549J3373L6094L3169K2807J0868J815
16149B47993m7805m2095m6610k8711k0253L212J1222K5325L0112M2664l846J955
16137A73163q722l0980k4512l2853l159o309k0152j6652m7875L4338K0233k6831
16125I689J127J1917m253J923M0868j0759q141l6894l0613j7660J8096K3334k7413
16112b8779j7903n528K8656J5434k1426j6092m552j398K1062J5261K626K143j758
$$ y = [-4816, -15869, -17320, -21469, 22100, 61872, 49153, 66489, 100195, 122320, 172316, 205818, 171157, 109862, 104744, 86580, 68048, 56321, 69585, 108753, 131398, 162695, 211617, 265279, 278847, 277935, 284337, 244033, 216749, 198189, 219349, 246162, 276687, 299915, 292183, 251249, 252805, 276241, 298663, 291922, 233865, 163416, 129867, 143240, 179334, 212503, 235310, 246178, 247993, 200188, 158093, 111483, 82772, 62519, 65731, 76953, 102278, 132390, 175054, 171208, 173163, 164441, 133461, 108949, 76096, 72937, 66628, 46476, 29824, -18051, 16287, 36520, 9689, 10816, 22733, 18480, 20403, 61271, 50512, 42371, 5477, -25136, -42796, -24700, -1366, -28779, -46682, -52210, -23554, -8120, -29546, -45638, -50190, -51588, -30526, -15265, -12639, -10496, -12254]
16099a2254J2965K0541o343j6297j5118k1775o993M609P795l4296p58L9762J2650
16086a5512l0029j6787q481j6385Q943P501k898J6363J8238Q765r779n449J072
16073d4438K665M4358J8162j145j2260K638K0421M961k2188l141j8670J387m041
16060a1291P130O983p829j8238m452p839K5430J2156p547Q438k076J91j1193k9307
16046c9444l953L7666r301Q340r515q740J1149J7668j5550p276j6735n253P497
16033c3447j0055m842R246K0200O405K3475O101O818m7579l5719L991j7290J4199
16020e8497J5318K5329J4142q889P764j3474k4114J5119K4009P993M3400j2130
16008C5970m5730k0728J302K0036L195l562J1944k7872l9713K2379M255J3979
$$ y = [-12254, 711, 21252, 14909, -1388, -16506, -38281, -45274, -40665, -32870, -67166, -67924, -28162, -15512, -45541, -62328, -70809, -87194, -78251, -70750, -73648, -57285, -39047, -30282, -40061, -45510, -44438, -41773, 2585, 20747, 19602, 7342, 9980, 30401, 35362, 13174, 10033, -8637, -7250, -11291, -4161, 2822, -5007, -23245, -27697, -35536, -10106, 2050, -5497, 2941, 865, 1056, -10137, -39444, -43397, -5731, -15032, -6692, -16207, -24947, -13798, 3870, -11680, -18956, -35691, -40944, -33447, -43502, -48344, -39098, -18898, -12493, 10982, 17083, 23901, -23678, -59397, -55406, -72696, -58497, -43179, -17850, -3708, -12597, -4833, -18307, -42421, -27302, -3293, 4700, 48100, 35970, -9760, -30488, -29186, -9150, -5955, -9517, 2427, -25445, -65158, -42779, -38524, -24545]
15996b4545M4195N782k934p183p298J7324O429J1728l3844k4029J3710N825k4003
15983a8843k401k1201J2134K1695P256R3j1143j0406Q060K6901O938k8321l804
15970a3042J7202J1984j417M402J6265k4163k5979N463K6985K1866l218j3518
15958B2830J947l557p814j0589K744R291j5033J9756K0530k183j6503j1883K6349
15945C5885r926k465j015p944L0891k0858l9583r742K2714P386J8267K6990M357
15932E4957P23l3113q364P079J6151l448Q037k963O945l4379l0312j1440K606
15919b7521K6988N628j1985o028o559n0392j5241N33j865J7261J6202J4751m332
15906d2560J4952M7694J549l3407j8587M566K902J2086Q917K0968m35J2723R647
$$ y = [-24545, 19650, 25432, 22498, 15315, 8017, 25341, 31770, 43498, 9654, -14375, -665, 5160, -18843, -21244, -42445, -30311, -8616, -1360, -1267, -12410, -22816, -14756, 12145, 19083, -9238, -13042, 4160, 16144, 14727, 19129, 35394, 11231, -14748, -9285, 17700, 39566, 36348, 22830, 24777, 21220, 13406, 2817, 5561, 14852, -181, 19575, 40105, 37922, 21419, 9536, 35885, 25959, 23494, 22479, 14535, 45426, 24568, -15015, -24757, -2043, 5343, 23610, 50600, 54957, 55680, 22567, 14203, 21282, 37433, 33985, 42022, 39059, 46004, 11625, -18687, -30127, -27521, -533, 5095, -6890, -12918, -19477, -69869, -85110, -84577, -86442, -69181, -52979, -38228, -42560, -27608, 20086, 21635, -11772, -30359, -25793, -22891, -10805, -1888, 19080, 18645, 31368, 41015]
15893D1015J4435p389k9681j3191r593l8222l0995j3658J4615k3776k2126J0833
15881a07733K0425K7129N1601K8052J7443l4505l5732L4063J2642o659k7670q50
15869b1794l909p616J6752K4749J0050j3635N306m951j4549j7794J6037j9506
15857c0860j9435k3657L4607J1168j7474k3253O644O729m708j893L9715K043j5911
15844c6285Q954q766Q045O193m232k5507n034k920K1291K8071o789o1527q488
15831h6994K9323J3855K4420j2845k8340K084Q944J4225M7189K2290l0661l7426
15819c3936l5773o095Q620L158k2428K6014J3695K6490Q490R614k9711j0595P593
15806c4864J5857O303K7370l470k968K0787K716o034j6179m1886k3894K4080O3117
$$ y = [41015, 55450, 48061, 18380, 5189, -4404, -42626, -73621, -87279, -72664, -96440, -118566, -107733, -87308, -60179, -8578, 19474, 36917, 2412, -33320, 743, 13385, 6726, -20944, -21794, -25703, -33319, -16567, 8182, 18232, 4597, 9903, 4952, -9597, -27391, -11354, -30860, -50295, -73952, -39345, -28177, -45651, -68904, -62260, -55531, -60239, -62132, -22417, -20374, -36285, -27331, -36097, -28052, -21859, -26091, -51598, -56632, -59552, -38261, -10190, -16979, -78506, -86994, -57671, -43816, -19396, -32241, -60581, -58497, -49553, -35328, 11861, 34151, 3490, -33936, -69709, -75804, -67184, -64026, -86454, -60440, -46745, -20255, -11765, -2151, -31862, -42457, -34864, -19007, -12704, 14666, 11196, 8228, 29015, 31731, 25697, 9518, -32368, -56262, -32182, 30935]
15793C0935J7045m9150j9326J8930J7795O298m6333j8233M2241O688J191r145
15781a064n64J1438j8824m872j1297k4916n121J2562K1005j1805N241J0924j4981
15768c2274j6960l292P270K820o791J6720J8309L3891j7511l7445j1401J1805
15756c4859J5175P034L2010Q094j895k9036j2658j1392P825J5034J6836p541j5361
15743a0734r477j7258J4964K9138J6178j262j3115k0721l1362Q23L4187N329j8701
15730b2011p820J488J0512n6q626J9746L3534q397L620j9082k5375R588J2076
15717h03P88k77k535Q044j179j2985n023K6983R076L427j1723M15J4702j3465
15703A5445j15r113j2588J7121j0993L354q887j0623m6234j8158J4460L3715j0465
$$ y = [30935, 47980, -1170, -20496, -1566, 16229, 22527, -23806, -42039, 202, 6890, 8081, -1064, -1628, 9810, -9014, -13886, -25183, -50099, -55220, -42658, -21653, -33458, -28217, -17293, -32274, -49234, -52526, -45256, -42436, -49227, -32507, -14198, 19693, 2182, -35263, -46664, -34859, -19684, -12650, 19360, 27454, 25559, -3477, -16135, -27527, -19702, -4668, 12168, 4627, -10734, -20211, -37469, -22505, 6633, 22811, 21549, 8434, -12287, -43649, -42826, -8639, -3310, -22011, -29831, -28343, -17831, -17887, -26513, -6767, 26767, 18370, 21990, 2908, -22467, -12879, -803, -15, -292, -2827, 5217, 4038, -8947, -13970, 13013, 22089, 25516, 13793, 14208, 28910, 15445, 15330, 6217, -6371, 10750, -243, 3111, -5776, -16399, -62633, -80791, -66331, -32616, -43081]
15690d3081J6944J5851k1106J1168k2818p304K8095L6283j0420l3763J1882K1063
15678B794N03j8111k950M1385k4855k6634J2627k2537l0035K6725K6630Q902o017
15665a1573j8368Q918J7908N484K2772O860J3523J2852k9275k3572l9442l290
15653c7203K9238j3637K521o940K528J7987j9136j3596j9713J1911L4616j2327
15641b3751J0452q431l292N707J3021J8386J441M855k1480l9284n89K1067j2068
15628c3966q35P911O654k65J8006K3048M669o080L849j8553k559P692j079l0593
15614b2101k9098J0368J8782j5113L201J9116O373Q334l60l954n153j6576M1548
15601A5367M9167M734n2430j5839J4870J3327j1399l1332J893Q737m904j7563
$$ y = [-43081, -26137, -10286, -31392, -20224, -43042, -50346, -22251, 14032, 3612, -30151, -18269, 2794, 3297, -14814, -17764, 23621, -1234, -27868, -15241, -37778, -67813, -41088, -14458, -5556, -11573, -29941, -21023, -3115, 2369, 25141, 32001, 45524, 58376, 29101, 5529, -33913, -37203, -7965, -21602, -19081, -26021, -23493, -5506, -24642, -38238, -57951, -46040, -11424, -23751, -13299, -21730, -25022, -19315, -6294, 12092, 13533, 18388, -3092, -42376, -42965, -21898, -33966, -34801, -26890, -20236, -20501, -2495, 20553, 25222, 19142, 22991, 4438, 1879, 9571, 8492, -22101, -51199, -40831, -22049, -37162, -33961, -14845, -8472, -138, -498, -4452, -9605, -26181, 15367, 64534, 69268, 16838, 999, 15869, 29196, 17797, -13535, -11642, -2905, -7809, -25372]
15589b5372q035K6050j2383k3837q364J7266L6717L1059j1086k3865j1428J6197
15577B919k0974m3391L271J8742o950j4289j8775q990K8696K4608L0431J1485
15565F783j5460j1523K2366j0686j8398M07O584M4651m738j417P575j1849k4731
15552a0436L1502J4429k5281j8018N1J7358Q211j8094n053q640j1037K6166J2423
15539A3581p403M283L614j1181j845q396p040p165j2521O853k96J6062K3430L154
15525A5130Q664J0489J228j6495q620K9587l117o785k4211k5392n364J9449j1656
15512a7093o562Q280j4393o490J3845L5779k7869k7985J714L1522O672J8163M467
15499B0050n983k1434k1190n481M0517Q648r673k6327k2532r149L668L009M4579
$$ y = [-25372, -33407, -7357, -19740, -43577, -51941, -34675, 2042, 33101, 22015, -1850, -13278, 2919, -18055, -61446, -58175, -39433, -46383, -60672, -79447, -88437, -59741, -35133, -4702, 6783, -8677, -20200, 2166, -8520, -26918, -26511, -19927, 24724, 19986, 18569, 26144, 14295, -10436, 21066, 35495, 10214, -7804, -7753, 9605, 17816, -278, -5331, -13971, -25008, 1158, 13581, 6178, 10461, 14075, 2894, 1049, -7347, -14387, -21552, -34073, -27220, -27516, -11454, 11976, 15130, 23794, 34283, 35511, 19016, 10396, 39983, 36866, 30081, 5870, -19522, -24886, -5437, -17093, -23655, -15375, -29768, -36258, -22413, 13366, -14503, -42488, -40774, -9252, -2580, 15583, 20050, 14067, -7367, -28557, -34038, 6479, 15127, 5454, -20873, -43405, -52554, -48886, -45877, -1298]
15486a298P197l6636k3890M6121O205q335K5438M0295j5113o497j1500k3601j4509
15473a6123l1384M607K6357J5527n459m273o950P136q230O070J6950q901n755
15460a0428K39l9211j636M4423L7051M840j3851l213k1934k1321J6609K2424j1645
15447B347k2391k0467K546J0348m348J4904j508l476k2230N776L4526J2394k7641
15434a9220l2829K7459R625R179P402J4487k8559N488l967k6536L875M937l0879
15421e9538j0152K0714j856n530K2038L5008P240p206j6452k5342k428L3401R309
15408g94K735k0769k3915L1504J8448K4708j4202j8558N65k4297j1608q976m268
15395d9427J3718K902p191j3444J5123N3130k536m0776k7411J8192L4024J805
$$ y = [-1298, 5899, -30737, -54627, -8506, -2301, -10636, 14802, 55097, 39984, 33487, 21987, -1614, -16123, -47507, -42900, -16543, -1016, -6475, -10748, -17698, -10562, -18792, -12722, 4228, -4673, -10428, -10189, -49400, -51036, -6613, 30438, 35278, 21427, 18214, -3720, -25041, -8432, 13992, 2347, -20044, -40511, -37965, -27617, -31965, -17061, -18569, -22045, -44275, -38499, -3973, 8421, -19220, -52049, -24590, -14965, -5786, 1616, 16103, -12456, -6968, -10935, -37471, -33596, -28659, -59538, -69690, -48976, -50832, -56362, -34324, 684, 7924, 718, -15734, -41076, -43504, -10103, -794, 1941, -18828, -42743, -11239, 7209, 31917, 17715, -843, -278, -24575, -36183, -45159, -49427, -35709, -32807, -39998, -53442, -38319, 14811, 12275, -28501, -55912, -37720, -3696, -1891]
15383a891J5599L2510L480k5950j7166n933k2296k8326Q583k588l295L8507k632
15370a1398k9245N749j5232J9053K7826K2163l6942j6424Q721J2079j2618n7684
15358h3952q193M4072J4628o21R303O315R272j3936j1755K7428J3479L2364j5287
15345B3117n106o22j2644l5968K6632J9412m155j056j2491k585j785j3677L133
15332a7795M3207j538j1048l8446l4719J5511M08J5882K2606K4175j0732l087
15320D424j5256p895j2832K966K1806J7911o235J2448l1244l4734j2671k1358
15308h2670K4883J9061M882K7570J727j3554k5426J6903K0574R388J0827R738
15296B3903j5607j3997K406m862J9834J4759q302l446o350j6144k1652N894J1184
$$ y = [-1891, 13708, 46218, 49698, 23748, 6582, 649, -21647, -49973, -41390, -43978, -47273, -8766, -11398, -40643, -34894, -50126, -31073, -3247, 18916, -18026, -34450, -25729, -13650, -26268, -83952, -92145, -48073, -33445, -34066, -24763, -18448, -9176, -23112, -34867, -7439, 6040, 38404, 23117, 18011, 17389, 4745, -31223, -4591, 14821, 10666, 9610, -2881, -5466, -7251, -20928, -17795, 25412, 23874, 12826, -25620, -60339, -44828, -44420, -28538, -5932, 18243, 7511, 4424, -10832, -18727, -31559, -28593, -6787, 11124, 4889, 17337, -13907, -48641, -61312, -82670, -57787, -38726, -33844, -6274, -4547, -18101, -43527, -26624, -6050, 3338, 14165, 23903, 8296, -5701, -3295, -8157, 11677, 26436, 18134, 14688, 8338, -7806, -29458, -23564, -12380]
15283a2380q592m87k7810m412M2777J4311K0684J3156J7514j1221m3231o292J7865
15270A1882K553J5577K7012j2622k0268l2026m3954K0924k342j9443j0228J6758
15258d6177K7188J5780o177k2383J9305m85r802J835J6172K3136m381l3609m173
15245b3771J6946K2992O617L463p863j2086l2824M481O015j6696q944j0940q435
15232f1045J0362K4438j0672J2396J6666J4577k9970k2213L6287j3354j6840K0832
15220a8536J3080J2519j2838j6902r979J2573J9592j5380j5235j0814k2067J8997
15208d4990K0951k886N044P708J20L1489P460l857J510Q0o64r592l7732J5482
15194i877j2653K9677J6006j1577K7667K548k6777L878j8340p814K5581K8244
$$ y = [-12380, -20972, -21459, -49269, -53681, -10904, 3407, 24091, 37247, 54761, 43540, 309, -5983, 11882, 14435, 30012, 57024, 44402, 24134, -7892, -51846, -30922, -33264, -52707, -62935, -46177, -18989, -3209, -9386, -31769, -12464, -12949, -22751, -20916, -4744, 18392, 14011, -19598, -23771, -6825, 16167, 22784, 26247, 18384, 6298, -26526, -22045, -16030, -32726, -41670, -52610, -61045, -50683, -26245, -36917, -24521, -7855, 6722, -23248, -45461, -9174, -22528, -39368, -18536, -5456, 7063, -5775, -22677, -32656, -20083, -491, -15871, -31106, -41920, -63987, -44990, -24039, -26925, -21881, -14173, -14053, 17436, 24896, 21039, 22549, 22629, 21965, 12373, -25359, -9877, -22530, 7147, 23153, 11576, 39243, 41791, 15014, 18892, 552, -7262, 18319, 46563]
15182D6563K338j1415k4446j4618J1288J1640j3645r173j1777k896Q951l102K2955
15169A2663j9228n495K4359L0587k5896j2058N048K7581k5886J6014k597k7702
15157b610J1193K1571J9218n820j1421j9535N008J461j7942J8298J1436j3795
15145A7062j7053j6517Q32L492p851J2194j401J4689J2633m3974o4881K3946L5383
15132c1446P798J091J7281M350K550k8598J5500k9727j8291K2613N438m841L0431
15119e851J6022j8058q770q3K9938j7148q378r639m398N5982J7104j80J344r596
15105C8289j4069o241j7392j5415j264K1109j725l2948Q553L9J0944q8K4850q827
15091E815K057o54J3414k566k6865p032J235o668J1910P22R694m298J6443O02
$$ y = [46563, 48901, 37486, 13040, -1578, 9710, 21350, 7705, -1468, -13245, -16141, -7190, -10292, 12663, -6565, -12060, 12299, 42886, 16990, 4932, 9980, 37561, 11675, 27689, 25092, -2610, 8583, 30154, 49372, 43552, 32131, 12596, 17604, 19065, 1123, 19421, 30857, 17062, 9, -16508, -15676, -12184, -20035, -7841, -9242, 5447, 18080, -25894, -90775, -66829, -31446, -23648, -22557, -5276, -926, 1624, -26974, -11474, -41201, -59492, -36879, -31441, -36282, -5851, 10171, -7887, -16657, -16740, 13198, -3950, -12328, -21967, -26365, 29617, 46721, 46541, 47885, 38289, 24220, 17979, 587, -14828, -16092, 5017, 3292, -29656, -21103, -21064, -10120, -10208, 14642, 5815, 7872, 7218, 20632, 18066, -8799, -15831, -14596, -21264, -9354, -8632, 1062, -3236, 13207, 13809]
15077A3809j2713k2440m269O2J4665J2977k823m134k9428k124J7765j8834K449
15064c5038K2698N337l3576J4858J2509k0891k7528L5471J8285L669j0671j8609
15052c3486q94j0509j7958N4136K5698k9997p180J3572M698L4206k9507p663k1003
15039b5887l1293L7548J3635J2154J52o895K5883J6408l2669k7978j4027q849
15027d1818N151J0916J4757J554k4091J1214r753m432K5239o164P684J2816O306
15014I379N882k7918R120Q006L573J8284o663j0127p02j0880k4566Q601J6844
15001a167j3234m741o151O949K1821j5992j2064K0988l739j2398L2227J0318L329
14988B6146n895l0706k4898K0834O24N3j72J5459p451m4253K8170M3894j8267
$$ y = [13809, 1096, -21344, -25613, -25551, -10886, 2091, -732, -4866, -34294, -36418, -18653, -37487, -35038, -12340, -7003, -40579, -25721, -13212, -34103, -61631, -26160, -7875, -4206, -14877, -33486, -34380, -44889, -62847, -8711, 16987, -13010, -20190, -6618, -1920, 32286, 2779, -4884, -25887, -57180, -19632, -5997, 6157, 6309, -586, 25297, 41705, 9036, -18942, -32969, -41818, -36667, -25751, -10994, -9440, -33531, -22317, -32070, -36502, -11263, -17427, -9743, 3073, 9379, 15261, -12657, -3537, 4469, 8042, 26326, 19663, 9536, 8834, -2046, -26612, -18011, -1167, -14401, -19142, -25293, -18344, 3477, -12515, -24579, -3591, -7330, -19728, 12499, 22817, 26146, 20251, -10455, -35353, -14519, -13895, -13842, -14014, 1445, -6006, -50259, -22089, 21805, 3538]
14975C538j4286l134L2285o340j1881Q47j4160M015j1j117j3962J3794J0051j4393
14961a4754j4895Q411j7501P919L2254k018j0665j8511j6099J7978L489L84J0476
14948a3532L006k8779Q604J6777P236N652P857o542j0497O719p310j3003r476
14935c3288J8954N677l061J0819j2575M605o617K7238l713M853K2248N897J3292
14922E4329L1968k2836l2560k6500j7951j0885j7002J9296J7435L4511p326N90
14910B3069J6064N823o447k2179k3478P837J9703J988L501N05o781j4593k9529
14897b4517k5920O26K8428m731K0134m836j3642n086k2538J4693L582J2262K9780
14884H235j8087r577j025J3614L878k0106j5603O914O402k2529l6221j5993J7818
$$ y = [3538, -10748, -13882, 18403, 12063, 182, 1029, -13131, -9116, -9127, -10244, -24206, -10412, -361, -14754, -29649, -21238, -38739, -30820, 1434, -584, -11249, -29760, -45859, -27881, -24392, -24008, -13532, -10526, -39305, -30701, -13924, -6688, -1036, 6821, 279, -10218, -3499, -10809, -23812, -33288, -14334, -8657, -11718, -899, -13474, -8869, -15486, 11752, 8039, 12892, 35140, 41037, 54329, 86297, 63461, 30901, 4401, -13550, -24435, -41437, -22141, -4706, 29805, 22479, 23069, 39133, 44956, 38509, 16330, -7148, 689, 20392, 22380, 25881, 26386, 19605, 5012, -24517, -50437, -49811, -21383, -26114, -5980, -10816, -24458, -29544, -52082, -37389, -33807, -21545, 8235, -9852, -19429, -20454, -6840, -2962, -23068, -38671, -31757, -25355, -47884, -84105, -100098, -82280]
14871h2280O6384M0365Q905k5561j7591J8523j1321m1228K0204M743K0198K9086
14859C0427k0434l1551k772N295R02N753M5539J0106l0978m704N806q140k0201
14846a4952j9424K464K5599K629J6424K9160r463j2643k9480j6277L39j4032P794
14833c1862q233j2123J7282J2299J1917q031J3850j9762l9461o59J9115L2279
14821a3389O227K1087j5858j4001k955o157O776j4091k1431J4496j1613J3428
14809c7481Q031J0783K4429O128J2517R943k5536j2874k1336O320J2138r805J2810
14796c933J0040k3206k0041J3154Q855O550j8800L5501K1767j0420J0145K1555
14784E1167m808j9101l8268J3469P043q929m62K5238R427k5972k4671j1480k6097
$$ y = [-82280, -15896, 24469, 33374, 7813, -9778, 8745, -2576, -43804, -23600, -18857, 1341, 30427, 9993, -21558, -24330, -19035, -18133, -12380, 33159, 43265, 12287, 7583, 13389, 5249, -14952, -34376, -31912, -6313, -3684, 12740, 41900, 32437, 19794, -9686, -25963, -25624, -39656, -31862, -40095, -52218, -34936, -22637, -10720, -18751, -4901, -24663, -64124, -64783, -45668, -13389, -7162, 13925, -1933, -15934, -18889, -25046, -18270, -32361, -53792, -39296, -50909, -37481, -29450, -18667, 5762, 11890, 24407, 34350, 8814, -4060, -25396, -19076, -6938, -16743, -3933, 6107, -17099, -37140, -23986, -15131, -8581, -27381, 8120, 29887, 19467, 29612, 51167, 46359, 27258, -11010, 2459, 9502, 573, 111, 25349, 34776, 8804, -15867, -27347, -53444]
14771e3444P495K308L399J1149j4145J5365M480j7087p870k1963l544j1125K7512
14758e7470L8321K5579j918p777J0252J3921Q094J5490L687n851k2423o397j3972
14745d64l002J1757K105R016K428Q507p635j6524k3119j8711K1634K0660J4805
14732B1457j2K6240L4871k646n317j6247k651l0438k9729K5637N639k9854m2064
14719d5114j5441M7743P403l2565l271o130j1393O361J158k195k2192j9001o838
14706a01475L4515L0195l958k4766J9493L6947l581j3129j3170Q906j7894K1873
14694b6044J5794j8631j6605L3840K5294o371K4086K9962J780k6016n9705k1058
14682d3674J2431K367J0812k3091l353Q271L5828K4046k1627m6803J089K4114
$$ y = [-53444, -45949, -43641, -40242, -29093, -43238, -27873, -23393, -40480, -48350, -70313, -73857, -84982, -57470, -19149, 6430, 4512, -3265, 6987, 20908, 29002, 44492, 48179, 42328, 19905, 13508, -464, -3466, 8291, 10396, 19412, 21840, 30347, 22712, 6188, -16931, -35642, -14008, 6652, 21457, 21445, 47685, 82556, 79910, 74593, 58346, 55695, 25257, -4472, 21165, 26804, -3050, -45114, -60555, -12812, -5409, -37974, -41245, -47375, -58768, -52407, -51249, -53444, -75636, -94637, -101475, -66960, -36765, -40723, -65489, -45996, -9049, -12630, -25759, -38929, -30023, -47917, -26044, -10250, -28881, -45486, -11646, 13648, 7277, 31363, 61325, 63105, 37089, -22616, -43674, -31243, -28876, -18064, -41155, -44508, -36237, -409, 23637, 2010, -44793, -43704, -19590]
14670a9590N6361L0202k735k3828j9542J2136K4061m0478l4279L0924M1027j4783
14658C9476k2790j3262L8045P047l9806k0732j7237J044K3189J7899k432k704
14646G737j054k010m4709K5854K2233J9680J1919k3576m4429k8437m00M085J6937
14633c6170J4600n075r25p895K358o425k2307N824J6939J408J1773M100J8578
14620c217o240o352j3272J6657J5137J7016Q388K2419n386l5203l415P064k3811
14607a0215R900K1812K7112m902r96K9319k3758j7070p832K4389Q427M0253K2047
14594A18486n2293p1705m4290J1839k1619j0231N077J8558L4697O609j1990j5284
14582c2146l9106n0222L1835M1552K0345M537L212N4924Q565k9379k3690N928
$$ y = [-19590, 36771, 66973, 64238, 40410, 20868, 33004, 57065, 16587, -17692, 13232, 54259, 39476, 16686, 3424, 41469, 48516, 8710, -12022, -29259, -28215, -5026, 12873, 10441, 7737, 6683, 4673, -40036, -14182, 8051, 27731, 39650, 16074, -28355, -56792, -57192, -53107, -36170, -21570, -26645, -27570, -35465, -33107, -39532, -61839, -56015, -39076, -37668, -25895, -21795, -3217, -9457, -15809, -29081, -12424, 2713, 19729, 28117, 50536, 45150, 9947, 6532, 13596, -10215, -315, 21497, 48609, 43707, 42711, 72030, 48272, 31202, 23370, 47759, 56186, 96439, 118486, 66193, -5512, -49802, -37963, -59582, -69813, -64736, -46178, -11481, -4872, -16862, -32146, -71252, -121474, -89639, -48087, -27742, -23205, -19993, 34931, 43496, 14117, -9573, -3645]
14570c645Q798J1400j6027n2201K1232J3687p754J7620N333L50R397j9076l0392
14557d1278O952M447l056L942J7929K9380J9358O584P7k7282Q224R740P137k8932
14543A3222k5881K6187K3786l3784j9733k1933K874K882l942J3207L3250K2230
14531C2365j2853j3798K006j0470K4578K221p763k0463q961p595L855M238J3020
14518C80Q038l040j7371J3521K6093k283j9079k688N17K391j0766N390Q795j0506
14504f08j4571N906O234J0064J0640m427l0838R037L0511Q806K490j8179K0347
14491C5412O816J4935j8504p771j0584j1411k089m647k9456k0547J4721J6972
14479a6153j2887j9511K6802j0464j7423o675L0218M5613J4111k9844J48J1802
$$ y = [-3645, 5153, 16553, 526, -51675, -30443, -16756, -24510, -6890, -1557, -1207, 8190, -10886, -41278, -34326, -29879, -32935, -28993, -11064, 18316, 37674, 44258, 44335, 17053, 25277, 35017, 42154, 13222, -12659, 13528, 37314, 3530, -16203, -38136, -35262, -32380, -36322, -23115, 10135, 32365, 19512, 5714, 7720, -2750, 21828, 24049, 16286, -4177, -13138, -20733, -16878, -12640, 380, 8418, 5378, -11993, 1528, 27621, 25338, 6259, 3571, 4088, 6479, -4287, 1103, 9898, -608, -15179, -9273, -3039, 7025, 17665, 13238, -17600, -8563, 21948, 30754, 33244, 15065, 35412, 42228, 57163, 38659, 30888, 20304, 8893, 6804, 2157, -27299, -47846, -33125, -16153, -29040, -48551, -21749, -32213, -49636, -56311, -26093, 19520, 33631, 3787, 3935, 15737]
14467A5737j2769K506n763K1952J2366j6076j5145j4921k9083j3634j2789R41
14455f6678J837K143j0110J4485K8215K1814K7195j3854l0523P283M7341P536
14443C6684j5402n981j0886j3026k051J6192N84l9576m4632m463L6546L1372J8192
14430C553k0527J5910M1585j2171k421m803J223K1032N833l1375m042k0167L346
14417c024j1663k0313K909O432j1915k2094M1955J6052q983j9041J6049J7749
14405D113K211N620L8098o72l5007j8263J3050j2580N341j921o832M664J1097
14392H919R398J2974p025l3644l5899J9821J8479j303J6075k821j995L2634J1701
14379D7314k9325k5495n233R076K351K2063K6272j2388j5403J1020k0312n6471
$$ y = [15737, 2968, 5474, -289, 21663, 34029, 17953, 2808, -12113, -41196, -54830, -67619, -66678, -64841, -62698, -72808, -58323, -30108, -8294, 18901, 5047, -25476, -18193, 29148, 36684, 21282, 15301, 4415, -8611, -10662, 5530, 6114, -33462, -78094, -82557, -46011, -14639, 3553, -16974, -1064, 40521, 28350, 25929, 21126, 22349, 43381, 49214, 17839, 13797, -6370, -3024, -14687, -35000, -32091, -25659, -37574, -59668, -17713, -1661, -10644, -29685, -13636, 4113, 6324, 11944, 50042, 49370, 14363, -3900, 9150, -3430, 1911, -10, -6842, -2178, 8919, 18317, 31291, 24266, -9378, -45277, -25456, -6977, -8280, 7795, 4974, 2979, 35613, 47314, 17989, -7506, -12739, -3663, -1312, 20751, 47023, 34635, 19232, 30252, 9940, -46531]
14367d6531K2762J6013q1k503j0067j9102N287K9352j7148m495N213J5719J5716
14354A0135J4205J3357p131l90n917k2210J399j2931q343L3938J6604r430Q596
14341C1882j2581j1686q527J8985J2709r496o390p35J6923m476n964r578N763
14328A6829k3888j2963K6904K0358j3657m1167m790K682l571O620j535l4613K2215
14315d0576J5892q236n498K2333M2338r470j6260j9475K519J5214r15K087L927
14302C880L819k1314k5384J0823J6113l0048J4846M3587J4659K3030l054k1799
14290B9158l6410k3415q21L5215l760j6118J230K0823K7106N360o707l4008M132
14277A785r105o21J0873P160J4486J2434J2872q609n115J0410O528K3586L137
$$ y = [-46531, -23769, -7756, -7837, -10340, -20407, -39509, -34222, -4870, -22018, -26513, -21300, -5581, 10135, 24340, 37697, 30566, 30176, 24259, 2049, 3448, -9483, -17826, 16112, 32716, 23286, 31882, 19301, 7615, -912, 18073, 30782, 21286, 14896, 14161, 31084, 26608, 20644, 11066, 16829, -7059, -20022, 6882, 27240, 13583, -27584, -32374, -29692, -33263, -26643, -28178, -62791, -40576, -24684, -32920, -38418, -16085, 26253, 16783, 523, -18952, -16433, -1219, -2134, -47, 3880, 7699, -13615, -38999, -28176, -12063, -42111, -27265, 16322, 30981, 54011, 50957, 29158, -7252, -30667, -31488, 3727, -33, -16151, -14921, 5902, 33008, 38368, 31661, -2347, 1785, -7320, -7941, 2932, 10092, 24578, 37012, 49884, 41275, 36160, 46570, 53098, 76684, 79821]
14264G9821l9553k8629m978J5818J2343j3921j3712j7220K781m716j1588j8494
14252d2048J1734N8243J3208k9639J1938J5817l2609m2142L231J2004J7740R527
14240G004R01j5985J0015k396j1119O396j6322K341j9468J623J5595L3559k0987
14227h843J084l391J4907P680j0505O42m028o125L9551j5580k7389J419r020J327
14213a8271k1578P791R441K4989o315J7768J2432j6687J7453k8040r598Q12N927
14200c876l211R156J7278J3136j5727k6316j0273p392o58l786J4767L3847J7807
14187C4752j8920Q12k1109j5939l527J6289K787l705K3966j8680J0773J6262k4985
14174a224k3876o87J5239j0558J0382o969R185L6240J6039n6J7919l0048J245
$$ y = [79821, 40268, 11639, 6661, 22479, 34822, 20901, 7189, -10031, -7250, -11966, -23554, -42048, -30314, 27929, 41137, 11498, 23436, 39253, 6644, -35498, -32267, -20263, -2523, 7004, 7905, -8080, 1935, -461, -11580, -5184, -21506, -19165, -38633, -37010, -21415, 12144, -8843, -7759, -11150, 3757, 11437, 932, 1574, -2454, -8579, 30972, 15392, -11997, -10578, -19598, -18271, -39849, -32058, -22617, 2372, -3943, 13825, 26257, 9570, 27023, -1017, -10615, -9803, -3876, -7087, 2069, 19347, 32483, 16756, -9560, -19833, -27225, -27883, -31669, -16902, 16945, 34752, 15832, 16644, -4465, -20404, -23931, -7642, -4855, -8560, 15406, -3274, 7499, 23761, -1224, -25100, -25787, -10548, -21106, -10724, -17693, -8508, 27732, 43771, 43715, 61634, 31586, 32831]
14161C2831o728l8115Q46K9665p783j6547N88K8122J0100j7011o152K9414M32
14148C9662O817k3986p173j9026k1254J6451K3152k4218j0677L1008M759K597
14136A8112j4113K599K139n291j5665P419K917j6762J2345J0100P629j0804J51
14123G76M986k2594Q410j4773k2576k6212j6181L6878K1406J5709j4929Q892o423
14110b6631L172j78l168j3785q223j2860j3424K3342K4180J4602J4188K6477j092
14097B6600o481p701j0301M269J5673j2263k9199J8116K2067k5550l789J9402
14085A0843n267J090O650j7797k7535l5511K4976J6407j9225J4432M0557r516
14073A04k8263r960K4570J3652j019k3663j0802O926J5889j6447j8727O194Q688
$$ y = [32831, 26103, -12012, -11166, 18499, 10716, -5831, -5243, 22879, 32979, 15968, 9816, 39230, 39662, 46479, 22493, 15320, -3706, -24960, -8509, 14643, -9575, -20252, 10756, 15515, 18112, 3999, 6598, 8737, 3446, -12219, -4800, -1883, -18645, -6300, 3800, 11429, 625, 776, 5762, -16832, -8422, -23195, -45771, -71983, -88164, -51286, -29880, -14171, -29100, -20208, -26631, -23459, -23637, -26805, -40590, -48813, -61673, -75097, -51755, -27575, -12973, 1215, 27692, 26600, 20119, 12418, 2117, 6386, 22059, 9796, -19403, -1287, 20780, -4770, -8559, 10843, 5576, 6666, 13316, -4481, -32016, -67527, -42551, -26144, -45369, -30937, 9620, 104, -28159, -38119, -13549, 103, -916, -24579, -35381, -28455, -12566, -29013, -47740, -41546, -32858]
14060c2858P382Q919j2377K6147o085K4766J5730O298J5269p585j7757O760j5516
14047A9093l9151J4880L0712j5744o024j7178j3846J447J4826J742l64J5744J3861
14034A9998j7050j8284J7000Q03l107R509m07m535k3298j5474Q919K1791J2867
14021H732J6772n516q411j2650j5629k7237q117m62j184J8743Q416j8382K3457
14008b1468J5099k7050J4212N651P199K5278L8772j1360k4083j1929p152l370
13996b01J4329L6592l186j0604j4504k2579o286m707m706L212J4549R848K332
13983A4089N937k5426k6978j1111J5745N924L269P651K7753m776M974k566j2407
13970B078k9321k264K9589J0170o614J8378L869j439j1673k0726J1389J3993o512
$$ y = [-32858, -25476, -16557, -28934, -2787, -8872, 15894, 31624, 37922, 53191, 45606, 27849, 34609, 19093, -20058, -5178, 25534, 9790, 3766, -13412, -27258, -25811, -10985, -9243, -9607, 6137, 19998, 2948, -15336, 1664, 2467, -640, 8869, 8462, 3927, -19371, -34845, -25926, -4135, 8732, 25504, 19988, 11577, -1073, -16702, -43939, -52056, -52518, -53702, -34959, -26543, -44925, -21468, -6369, -33419, -19207, -13556, -6357, 18921, 57693, 46333, 22250, 10321, 3169, -201, 14128, 50720, 47534, 36930, 22426, -153, -6439, -11146, -15852, -12640, 1909, 11757, 14089, 20026, -5400, -32378, -43489, -27744, -21820, -18551, -10900, 16853, 12077, 17051, 14485, 2078, -27243, -29507, 82, 10252, 3638, 22016, 25885, 24446, 12773, -7953, 3436, 17429, 10917]
13957A0917o596k309q666K136r58J8647K6537K8204k324m323N698j6737k0084
13944C0142j3081j1828k1235j2377L1346J2176O68K7253m6264j4874K1028K6256
13932B9210M4123L1662l1116m0265k7362k4658j3345j5092J4103Q606q413O063
13920b6484K1735K313J0429l478o047Q408J0571j4672r290J5526J6950J5038J3051
13907E4050l0987j9061J4798j4023J3239Q79O799n885l245k3574K970l4281k6076
13894f4397J980K7142L9359p787k5617K49L286Q104m011q804J7931k3341j2943
13881d8849K3647J2658J901L107J3977J5787k570k6438j4853O738j2907j3062
13869d0864j3160K5581N0306K079j7178n086J1814J0220M914k469l511J7511k4053
$$ y = [10917, 4321, 2012, -6654, -4518, -5476, 13171, 39708, 67912, 65588, 61265, 66963, 50226, 30142, 17061, 5233, -16002, -28379, 2967, 15143, 15811, 43064, -3200, -18074, 2954, 29210, 73333, 104995, 73879, 33614, 6252, -18406, -31751, -46843, -32740, -24134, -32547, -26484, -4749, -2436, 7993, 4515, -1532, 6876, 17447, 2775, -6515, 9011, 25961, 40999, 54050, 23063, 4002, 18800, 4777, 18016, 18895, 25694, 19809, 16564, -7010, -4040, -38321, -64397, -62417, -35275, 4084, -3703, -29320, -29071, -25785, -17681, -21692, -30496, -12565, -35906, -48849, -25202, -12544, -10643, -7536, 6441, 22228, 19658, -6780, -21633, -14895, -27802, -40864, -54024, -28443, 21863, 23942, 6764, 1678, 13492, 23712, 28626, 26157, 22646, 40157, 16104]
13856A6104r130m052j6187N712J8295Q053J2552J3840n673k9204k5660n422j1395
13843c2167J1163L5695M167O701j5605j9220O661n77P053J2222Q097K2797J1125
13830E8112R434J707j9467R385j2761n366Q898p360j6554j0669M575k8798J4189
13817E325K4947m272J0219k366J924J9358J542l2512k7815o231j9083J935j4903
13804d1932K215j0566P248L1539k949m471P474k1463k0112L0483L4969P781L8940
13791E9156K756n914j7793m4712P176J3182J2299M247j9997R987K1906l2100n1753
13778d1560q59p664J061K9704K7893k786j7649k5415J2623L4834J5471L529m514
13765B4668J280J1327J2969k0172n065j6334M1055R137k1121m5052m3957L426
$$ y = [16104, 6974, 2922, -13265, -7553, 10742, 18795, 31347, 45187, 39514, 10310, -15350, -20772, -32167, -21004, 14691, 18858, 25559, 9954, -9266, -2605, -3182, 3871, 16093, 24190, 46987, 58112, 67546, 69253, 49786, 59171, 46410, 41044, 49942, 42582, 26028, 15359, 19934, -8864, 5325, 30272, 26000, 36219, 33853, 35777, 55135, 56677, 24165, -3650, -9881, -28964, -27029, -41932, -39717, -50283, -43035, -11496, -14445, -18916, -11442, -32905, -53017, -22534, 12435, 20216, 59156, 61912, 55998, 38205, -6507, 669, 13851, 26150, 30397, 10400, 20387, 42293, 10193, -41560, -42419, -50083, -49022, -19318, 8575, 5789, -11860, -37275, -24652, 10182, 25653, 29182, 24668, 25948, 37275, 50244, 30072, 25007, 8673, 49728, 58865, 37744, -7308, -51265, -47839]
13753d7839O622J1934N703q483J0189n948J8194J0917k0070K800K9633R740n097
13740A8295k1777j0253o816j5369n813j1620J0596J8638K3196K4512K7019L95
13728E1003j1288l6233k2558k7381J9474m288N44L6180K7788R457j4369l9560
13716a1231K2240j2247L842J9929j6084j5953L2515Q583k8869k7866r747R211
13704b5677R611J5502k403R708K2352k513j6296j7884j5986K844Q517j3864k7595
13691e3684L7751K7742j0525n346N131N678n802k5907k4383L3487K1093j6455
13679a1220J4469k690J713r740n029Q024J5133j0605K752K1532K0634j2147K1676
13666E4502N801k5921j2103m950P460J2112m580J853n827l0634L22J719j4819
$$ y = [-47839, -41217, -29283, -23580, -32063, -21874, -27822, -9628, 1289, -18781, -15981, 13652, 23392, 18295, -3482, -13735, -20551, -35920, -41733, -53353, -42757, -24119, -923, 23589, 50608, 51003, 39715, 3482, -19076, -46457, -26983, -31271, -30727, 5453, 33241, 42698, 28329, -11231, 11009, -1238, 2604, 22533, 6449, -9504, 23011, 31594, 2725, -25141, -34888, -25677, -16066, -564, -2967, 6741, 29093, 26580, 10284, -7600, -23586, -20742, -12225, -26089, -53684, -15933, 11809, 1284, -4062, 1069, 6747, 945, -24962, -49345, -15858, 5235, -11220, 3249, 559, 2272, -7468, -12497, -4473, 10660, 55, 2807, 24339, 44973, 32826, 54502, 60303, 34382, 22279, 17329, 24789, 36901, 32321, 34174, 28347, -2287, -1965, -246, -15065]
13653a5065j2037K2433K7485R075m740J497K0767L9309Q898l1778n86j4244o391
13640D4623R386K1699k3516k0026J2072l076k0764j5486j2376K4122K6544j3832
13628B9370P779k5468J519O5920K2688m8859m8554p502J1612n059m374J4834l4171
13615b0265m0302K372M2528K9513j0183P672K6685J2884j483k5236o244j587J7467
13602C3821J779j8723j0092j342o440K3845o092j4844J4023j8743j8628J5701
13590e735K1363L2097J007l6241k9182M968M144q604J3376N709K1659J5813k5325
13577A5049l2833N912Q296P38o254k181J281J1172K385Q710Q74J3255J521n329
13563B2596O730m008Q900j5543J1153J7948j0350j2037K8288n879k5248l1441
$$ y = [-15065, -27102, -4669, 22816, 31891, 27151, 28648, 49415, 88724, 97622, 65844, 65258, 51014, 44623, 54009, 75708, 52192, 32166, 44238, 41162, 20398, 4912, -7464, 16658, 43202, 29370, 37149, 11681, 13200, 79120, 101808, 52949, 4395, -3107, 8505, 3446, -928, 13906, -20265, -60567, -58195, -15667, 13846, 3663, 11335, 38020, 50904, 49421, 24185, 17941, 16354, 33821, 35600, 16877, 6785, 5443, -997, 22848, 16756, 1912, 15935, -2808, -21436, -5735, 15628, 47725, 48732, 12491, -16691, -11723, -7579, -16183, -2807, 2902, 24561, 40374, 15049, -17784, -11872, -3576, -2838, -9092, -11273, -9992, 1180, 3565, 12275, 13149, 26404, 27925, 22596, 29326, 25318, 34218, 18675, 29828, 47776, 37426, 25389, 53677, 47798, 22550, -8891]
13551h891k7430J7581R179k6230j9953K4946J3687k463J0852K5115o637j5844
13539f088J9568J5505m5590j172O823j9574Q044M788k3449L567L1669J5341j1943
13526b511Q476J0325N339J6448R992n5893l9097j295K879n702k932M6123J2536
13513D688m0233J7031J6067j7403R132P59k2699n354K728L9520J024j0050k2872
13500b7662k7329K8645J5906p377l0926P317K5910K1203r638l1315K886M064J6283
13487a2033J0602n574J1643K1030L8766r539n2445j9694L607l231j1329R557M972
13474a3668M874K7338p21j0928l29L6316R129r488j1889j1905P490J3038m054
13461C5203m1502j5191O707K3190K8538j4291M209r35J130k9111j0691m920N839
$$ y = [-8891, -36321, -18740, -9561, -35791, -55744, -30798, -17111, -19574, -8722, 16393, 9756, -6088, 13480, 28985, -16605, -17777, -10954, -30528, -22484, -17696, -41145, -37578, -5909, 9432, -2511, 5965, 16290, 21629, 38077, 48069, -7824, -46921, -48216, -45337, -51039, -53971, -7848, 4688, -35545, -18514, -2447, -19850, -10718, -9959, -32658, -38012, -35284, 4236, 5260, -4790, -27662, -54991, -26346, -10440, -17817, -48743, -41426, -15516, 5687, -3951, -35266, -32380, -28316, -12033, -1431, -7005, 4638, 25668, 64434, 54895, 2450, -17244, -13637, -16868, -28197, -18640, -13668, -8794, 18544, 17823, 6895, 6566, 42882, 52011, 42523, 30634, 18729, 26219, 39257, 35203, -6299, -21490, -14783, 8407, 36945, 22654, 26863, 25928, 27058, -2053, -12744, -17664, -11825]
13448a1825k1827j571K6948M218K838J6690J7158m1205r985J7862L1802j8805
13436A2298r922j7057K376J3528j664j3271J8416l848j1302l822l142K0095R828
13423A2513N51j7633l1158k7806K9672L7851j610M984J3767J3542j6588P091J7285
13410D2461O975k8071r136J1205R385j3527j3201J622j1956l03J7691K2311P13
13397C6169k7656j0015m685j2388l099J0959L1478j3418L2359L1694M764j5698
13385F0464m157j1484p978j8858o205P962O479J1080m2482R400L5379J305M894
13372D5799k6670l277n449K0009J2714L692N042j3238j3472K034m591o181l308
13359A3104l443j5330p755K6766Q17K916Q278J1089k641n678m6220Q64k099Q179
$$ y = [-11825, -33652, -35223, -8275, -4057, -1219, 15471, 32629, -8576, -18561, -699, 31103, 12298, 2376, -14681, -12305, 1223, -441, -13712, 4704, 856, -10446, -14268, -17410, 2685, 12513, 13064, -4569, -35727, -63533, -33861, 3990, 2380, 7364, 21131, 34673, 18085, 25176, 42461, 49436, 21365, 12229, 23434, 32819, 19292, 6091, 7713, -4243, -4546, 13145, 35456, 36169, 8513, -1502, -6187, -18575, -21674, -10715, 20763, 7345, 39704, 71398, 76162, 60464, 56307, 44823, 36845, 17987, 11782, 19744, 26223, 37303, -5179, 4221, 39600, 40905, 45799, 19129, 15852, 10403, 30412, 43126, 46818, 51860, 38622, 25150, 27184, 22593, 16412, 13104, 9661, -5669, -13424, 13342, 14159, 17075, 25353, 36442, 33801, 28123, -18097, -17233, -19332, -11153]
13345a1153M565Q100M0695J157K255K287J3090j1795j6246J325j2289r819P474
13332A9646l025L0418K7585l2828k3498k9839J5469J7264M951j6354j7128m39
13320g778L4429K7408J4678n310j2280K561l6006m8984q147L5638L0970l827J1781
13307C5133j5085k0583N034J2210N940j8676k2655K1832K3780J0741k8125j7271
13295g725K6905p618j5746o814K4129L1674J8848L892j6296j3237j6806J0779
13283C1985J7350M594J353k5314j5713J0473N276J3515k866J8965l406k0974n292
13270B9946r034j8627j3608k69K4982j1844k0903k8736q117J2309L2391Q559m028
13257f979J022k0655p952p967n682L6845K5009K4174M083k1566j2065Q197p222
$$ y = [-11153, -6588, 1512, 42207, 43364, 45619, 47906, 60996, 49201, 32955, 34280, 21991, 12172, 19646, 16621, 47039, 74624, 41796, 18298, -11541, 3928, 21192, 26143, 9789, -7339, -7778, 26651, 54059, 68737, 63427, 51147, 53708, 17702, -31282, -39429, -3791, 27179, 23352, 35133, 20048, -535, 4499, 16709, 22649, 3973, -18682, 3150, 26930, 37671, 9546, -7725, 19180, 11562, -4184, -10998, 13131, 44805, 63653, 67545, 51249, 38012, 21206, 31985, 49335, 53929, 55282, 29968, 14255, 24728, 30004, 43519, 40653, 59618, 56212, 35238, 29946, 20912, 2285, -11323, -11592, 13390, 1546, -19357, -48093, -56210, -43901, -11510, -2951, -6979, -5957, -26612, -34564, -42531, -48213, -11368, 13641, 37815, 41898, 20332, 8267, 16464, 9242]
13244I242p884l548L301N991J2794K1700J9971j7464P065r26p918J0495M968k6889
13230C0898l9137j3205J2808J8990j9147j7122n853J8006l344J2673j0449Q248
13218f634J0068M067L5139L907P78j2475j115j4375j4084K4184j4428j1540L6661
13205D0153J8607n095j3090j0164r696j1990P875m908k0698j6622k205o0q047
13192c5940K2928P683J5941j25p018K4962K0289L232q80j0838P440P175L177J1449
13178F9475j5365j0172N082k2948q63Q457k2210j90j8307K8028k811R623l264
13165B4535k2187j2937J9762j029J0299L5383K4750k4768j6219Q900L433j1365
13153C8557p467L019o854l933l01j0274j4437j5615K8860L5507L686L8876r299
$$ y = [9242, 1358, -2190, 1111, 7102, 19896, 41596, 61567, 44103, 51168, 50242, 42324, 52819, 57787, 30898, -8239, -21444, -8636, 10354, -8793, -25915, -31768, -13762, -17106, -4433, -14882, -6634, 3434, 7501, 42640, 46547, 47325, 34850, 33735, 19360, 5276, 29460, 15032, 3492, 40153, 58760, 53665, 40575, 30411, 20715, 8725, 16600, 11692, -9006, -25628, -27833, -27893, -35940, -13012, -5329, 10612, 10487, 3469, 28431, 48720, 51952, 51072, 40234, 47674, 54849, 58026, 69475, 54110, 43938, 49020, 26072, 25209, 33666, 11456, 11266, -7041, 20987, 18176, 27799, 24535, 2348, -10589, 9173, 8144, 18443, 53826, 78576, 53808, 37589, 46489, 49922, 38557, 31090, 34109, 27255, 23322, 23021, 12747, -1690, -17305, 11555, 47062, 50748, 89624, 80325]
13140H0325m1798q43p89j2590k5217K167J8282k255L620R120J4882j8215J7480
13127D4169J9878m232j2556l4218M81Q944q309j1489Q246J6003K8233j0561n375
13114C9214j4807O691L1769J486j3433o072L5445l350O154K1062M926J4244M458
13101A27787n586J7293K8419L9947M4793J20035J50297K49279M27119N91825M68552
13090B259760m2032n23726o03620l84812j98037j33411q4501p3624m9110k6216
13080A40671K469L4966J0717j2224j5412l6473n4345k1466K8195k176l0442o861
13068C7619q352k5319j782J2788K6875l165J3173n063r793m488j3441j4860O39
13055D831j6445M316M3824K0221k6608P564J7092K1274L011o844m0344j4984k3378
$$ y = [80325, 38527, 37684, 36895, 24305, -912, 1255, 19537, 17282, 20902, 30022, 44904, 26689, 44169, 64047, 59815, 47259, 13041, 13522, 22466, 14157, 2668, 10914, 26917, 55150, 44589, 39214, 24407, 31098, 62867, 64353, 50920, 44848, 80293, 76943, 83097, 104159, 109085, 123329, 127787, 122201, 139494, 167913, 207860, 252653, 372688, 522985, 772264, 1199383, 1791208, 2259760, 2217728, 1694002, 1090382, 705570, 507533, 374122, 289621, 215997, 166887, 140671, 143140, 178106, 188823, 176599, 161187, 124714, 70369, 48903, 77098, 74922, 44480, 37619, 29267, 3948, 2166, 14954, 41829, 38664, 51837, 46774, 36981, 32493, 19052, 4192, 4831, -11614, -7298, 36526, 56747, 30139, 37703, 54795, 76069, 79080, 72236, 31892, 16908, -6470]
13042f470r957m081L3105Q817j2627Q764k102k2117O205j899j2623M014M2109
13029C1138K0539q063l0683k6820J5994N524k519N182M2827Q159q063k1855J0842
13016D2202j6991r407K1285M505k2859q88k637M582m855O998K9143o853K834J0355
13002E7414K5948j0644r272j6063k0406j0K5744n538K623M274l6098j3176P517
12989A2313J6464K3097J495M457J3923J6441o276k155Q242J2097m994k3450j8750
12976E2904J246J7436j8202k62j439l3340J7386M3199q956j4766m2745j6669Q399
12963D191K7663J9721j9648P016J5030J9705j472j0249J5504j5141J1855q833
12951F5342k846l2471k1970K9556n237n119J618j382O590K785m209K602K2459
$$ y = [-6470, -16427, -20508, 12597, 21414, 8787, 17551, 15449, -6668, -463, -2362, -14985, -10971, 31138, 51677, 43614, 12931, -13889, 2105, 7629, 5110, 10292, 53119, 61278, 53215, 31360, 42202, 25211, 15804, 37089, 41594, 18735, 17847, 15210, 19792, 14937, 21935, 51078, 44225, 47059, 57414, 83362, 72718, 63446, 47383, 26977, 26967, 52711, 47173, 49796, 54070, 17972, 4796, 12313, 28777, 51874, 53369, 57826, 71749, 88190, 81914, 79759, 88001, 100098, 95104, 71654, 52904, 54150, 71586, 53384, 53122, 51683, 18343, 35729, 78928, 69972, 55206, 12461, -4208, 4191, 31854, 51575, 31927, 38943, 53973, 73678, 72206, 61957, 77461, 62320, 74175, 65342, 62496, 30025, 8055, 37611, 32374, 27255, 28873, 27491, 34081, 36866, 32657, 35259, 57718]
12938E7718L631j1922P498l0836k7789J4888O830J3850Q184K6141N997j0330o645
12925E7215k5867K403J1392m248J0518q147l766J0265N588K342J045K2842L6037
12912A17619j713j806j765j6325j3317J414l5675r914O817L1606L0450j1686l7285
12899E8420j2793n362O936j435L3425M6442K7665J4242o869l0350k6591k6196
12887G7534l820j3580K0222L6364J4545Q6803Q2372O0746M2622j2878m7940o1874
12875B81116p8125l5209k291p879j2452n490k3116j3164p012P499j4166l16J4752
12862A04147K7273K4322j2451k8239J4174L3570j374l0814M79J8836J1650l3349
12850A28224j1453k9962j0197j6732k6917j1891K2267k819J565L3556O538j6486
$$ y = [57718, 61349, 49427, 56925, 26089, -1700, 13188, 20018, 33868, 42052, 68193, 74190, 63860, 57215, 31348, 33751, 45143, 40895, 51413, 43266, 39500, 49765, 55353, 57695, 58740, 81582, 117619, 115906, 114100, 112335, 96010, 82693, 84107, 48432, 38518, 45335, 76941, 107391, 95705, 58420, 45627, 40265, 47201, 45766, 79191, 125633, 153298, 167540, 160671, 130321, 103730, 77534, 73714, 60134, 80356, 116720, 131265, 218068, 300440, 361186, 403808, 390930, 342990, 281116, 202991, 167782, 165491, 157612, 145160, 139670, 116554, 103390, 96378, 103877, 89711, 89395, 104147, 131420, 155742, 143291, 115052, 129226, 162796, 161422, 130608, 131087, 149923, 161573, 128224, 116771, 86809, 76612, 59880, 32963, 21072, 43339, 40520, 42085, 75641, 82179, 65693]
12838F5693l3340l006J6892L7027o04J3530L2529k955l7795J0821K5990k2558
12826A02224j3565m607j1966m350R647K5325K7486N709j4943K2634j5707n0780
12814G7107k9019O247L7901K8290J429k949j7993j5873k684N263j6883K5328L177
12801I9341N775n856k1474j6435J4356N7900J9011j626q349K8092K4181k2102
12789A72814j4107K4278m617Q864M1208K6327J182L989k5961M235L1181K5642
12777B95035l952l3582K172j2007m724k2896J3565K3859J3662k8482L7758M0208
12765C20616J7633L5560j1287N5450O1648P0594O7157M3571J02567J41704J54696
12754A059909J22615l1297m78356o34331l86083o4876N9229O8706M8956N1180
$$ y = [65693, 32353, 29347, 46239, 83266, 82662, 96192, 128721, 125766, 87971, 98792, 124782, 102224, 88659, 84052, 72086, 67736, 77383, 102708, 130194, 135903, 120960, 143594, 127887, 77107, 48088, 54335, 92236, 120526, 121955, 119006, 101013, 85140, 82456, 87719, 70836, 96164, 99341, 105116, 99260, 77786, 61351, 75707, 133607, 152618, 150992, 142643, 170735, 194916, 172814, 158707, 182985, 178368, 187232, 228440, 254767, 255949, 259938, 233977, 238212, 269393, 295035, 291083, 257501, 259673, 247666, 242942, 220046, 233611, 257470, 271132, 242650, 280408, 320616, 338249, 373809, 362522, 417972, 479620, 550214, 617371, 660942, 763509, 905213, 1059909, 1182524, 1151227, 672871, 38540, -347543, -412419, -353190, -284484, -235528, -184348]
12744a84348N5947M0320M4258L080k3070K3528L5003M2462N1930O9612P3414Q2916
12732C15052L5949m6962r3998l9100n342m5304m8241j1366l195K0512K2776M7094
12720A47875J6513J1500J8124j1290j5148l3324k3534L1893L6028n390K8343K0255
12708B21845j0474K207j9651k0749L1706J6320k1397K1134L8191K3188J3002p407
12696B87915Q716L2270M4608J2366L313L7197k1650j8493Q534Q211m444o403N45
12683C92685N2409P0723K2253M4883Q1547O4703N8793K4929K8362k8919K3345
12672H35713M0529M4999L3944R364P1500J14732P2885J4339k4646L7276Q5572
12661A336207N2069P5385J15991Q8589N6591N5574J00381J28086J69617J94428
$$ y = [-184348, -128401, -88081, -43823, -40743, -63813, -40285, -5282, 37180, 89110, 158722, 232136, 315052, 351001, 304039, 210041, 170941, 165599, 120295, 72054, 60688, 57493, 78005, 100781, 147875, 164388, 175888, 194012, 182722, 167574, 134250, 110716, 142609, 178637, 173247, 201590, 221845, 211371, 213578, 193927, 173178, 204884, 221204, 199807, 220941, 259132, 282320, 295322, 287915, 296631, 328901, 373509, 385875, 389188, 426385, 404735, 386242, 394776, 402987, 398543, 392140, 392685, 445094, 515817, 538070, 582953, 664500, 729203, 787996, 812925, 841287, 812368, 835713, 876242, 921241, 955185, 964549, 1036049, 1150781, 1223666, 1238005, 1213359, 1250635, 1336207, 1388276, 1463661, 1579652, 1668241, 1724832, 1780406, 1880787, 2008873, 2178490, 2372918]
12651B372918K20667K73823L45513L10464K93000L77688N74033P42075Q29184
12642F339365R50395J149888J410271J790234J988718J799031J893797K806753
12634B0128452M405093O432578R453356J4278503K2738046L8171115O4847681
12627A80454824J03862801J24392333M9825944o9166721j31124867r7280276n4938793
12620A06025245l1441723j8999018j2174995q232833n785433m165972l057373
12613B2167898k292458j998514k146104k296397j965743j462988j053873p92574
12605H159247o15789n78958n43270n32489m60276l37389l13715k84185k58139
12596D235037k49959k62212k46599k48268k31176j95008j43126j47387j35455
$$ y = [2372918, 2593585, 2867408, 3212921, 3523385, 3816385, 4194073, 4768106, 5510181, 6339365, 7289760, 8439648, 9849919, 11640153, 13628871, 15427902, 17321699, 20128452, 24533545, 30966123, 40419479, 54697982, 77436028, 115607143, 180454824, 284317625, 408709958, 458535902, 389369181, 258244314, 160964038, 106025245, 74583522, 55584504, 43409509, 35176676, 29391243, 25225271, 22167898, 19875440, 17876926, 15730822, 13434425, 11468682, 10005694, 8951821, 8159247, 7543458, 6964500, 6421230, 5888741, 5428465, 5091076, 4777361, 4493176, 4235037, 3985078, 3722866, 3476267, 3227999, 2996823, 2801815, 2658689, 2511302, 2375847]
12587B375847j23078j43056j72405j54660r6865p3165r2059j07934p5429o6192
12577A271004q3488o7042o0152p1691o7759j896J8276J316j174l1328m0337l7861
12565H27868k1763l2026k6565j1628j9326n2298j1251l8746L509K391m1261J1800
12553E90704j8062J7544j5842j6681J1419J8037p142l3511k6245q897k0252j0690
12541D80382o185K6408J6664j2798m5154k4137k6077j25K453r436o533j0596J6455
12528D01321R576N0958J1941j1397r344j046J5146L5514K0768m0866m3825k593
12516D36153J7230k3826j3277j2471M3191M9145K5485J5409J0388K0653N9945
12505F28025M5761Q4781Q1326N9543N1542r1234k76588m48113l81490j27992K9236
$$ y = [2375847, 2252769, 2109713, 1937308, 1782648, 1685783, 1612618, 1520559, 1412625, 1337196, 1271004, 1187516, 1120474, 1060322, 988631, 920872, 918976, 937252, 938568, 937394, 906066, 865729, 827868, 806105, 774079, 747514, 735886, 716560, 664262, 653011, 614265, 617774, 620165, 578904, 590704, 572642, 590186, 574344, 557663, 569082, 587119, 579977, 546466, 520221, 511324, 491072, 480382, 474197, 500605, 517269, 504471, 459317, 435180, 409103, 408978, 411431, 401995, 395462, 384866, 401321, 410897, 461855, 473796, 462399, 453055, 452009, 467155, 502669, 523437, 482571, 438746, 436153, 453383, 429557, 416280, 403809, 447000, 496145, 521630, 537039, 547427, 568080, 628025, 673786, 758567, 839893, 899436, 950978, 859744, 583156, 135043, -246447, -374439, -345203]
12494c45203M9096Q8994L1952K5493K9906O4308L3571M020R876P728N802J3474
12482A9017o946L0232K3151P079q214p837j4947k6192m8670K1490K8996J2501
12470B9660r358l0434n409j2154R494L2291K0155O23q695K4564L4592J521N165
12457I2015K7192N285Q791j7001j1879N7395K0756J1104j4236k4306M528p870
12445A51774j3655p494l0772j3066k5232k6318k600K165l63k1061k1410K5218
12433A7186L4372L0233J4678J2353M0233K0061k1265k7331K371J0699O359K9870
12421A69819L3695L7202O2273J28548K48901L03147K33628N7987j84240k95467
12411G95493k72661j99699q1467n1866m7923k8720j0041j6708r460K0753Q094
$$ y = [-345203, -296107, -207113, -175161, -149668, -119762, -55454, -21883, -17863, -7987, -259, 5543, 19017, 12071, 42303, 65454, 72533, 64319, 56482, 41535, 15343, -33327, -11837, 17159, 29660, 20302, -10132, -15541, -27695, -18201, 14090, 34245, 34868, 26173, 50737, 85329, 86850, 92015, 119207, 124492, 133283, 116282, 104403, 161798, 182554, 193658, 179422, 155116, 159644, 151774, 138119, 130625, 99853, 86787, 61555, 35237, 32637, 34802, 34439, 13378, -8032, 17186, 51558, 81791, 96469, 108822, 149055, 169116, 147851, 120520, 122891, 133590, 139949, 169819, 203514, 240716, 302989, 431537, 680438, 983585, 1217213, 1275200, 1090960, 795493, 522832, 323133, 241666, 189800, 141877, 113157, 103116, 86408, 76948, 97701, 105795]
12400A05795l9339o3467m6858j4217P739J912K2224K7645J2986l704J622L7243
12388D9581p01m5153l7963L0349K8364J1454k3517k1043N755J0119n404j2761
12376a0920K383K9360K2495j2653m0463L517J6609L5012J5784r932N151l4141
12364B2202k8164k3585K5652L7114J802l2942l480m045M521j4018K1749l762j2088
12351i044J7175J1834Q728j905l3784J024J9741K7565M309m2740k2579R095J3291
12338B710j2898j3623L7878M677J2863P884o606k1591k9939L652J0593J5016P018
12325A7634Q89k453J9202r715j0426J31m0405j2194N4829J8674k4958k3802j2094
12312b4688K7937K3985K1319O856k662q52q766J6366L2054J9707j3758l4427k140
$$ y = [105795, 66456, 2989, -43869, -58086, -50347, -48435, -26211, 1434, 14420, 10716, 12338, 49581, 48880, 3727, -34236, -3887, 24477, 35931, 12414, -8629, -2874, 7245, 1841, -10920, -8537, 20823, 43318, 30665, -9798, -6281, 10328, 45340, 61124, 51192, 56343, 22202, -5962, -29547, -3895, 33219, 35021, 2079, -1401, -5446, -925, -14943, 6806, 3044, -9044, 8131, 19965, 28693, 26788, -6996, -5972, 13769, 41334, 45643, 2903, -19676, -10581, 2710, -10188, -23811, 14067, 18744, 31607, 39491, 32885, 11294, -18645, -14993, -4400, 10616, 17634, 18523, 16070, 35272, 25557, 15131, 15262, -25143, -37337, 17492, 36166, 11208, -12594, -24688, 3249, 27234, 48553, 55409, 52747, 51895, 43129, 59495, 91549, 111256, 97498, 63071, 60931]
12299F0931K240j4469j8349j7747J4490J0860J3874j4499l2776m448K1569M2747
12287F4423K3355K3671J224j9131j6423M090m737L797j8869j4563o848k5576j2111
12274B302j1634L47M0098K0805L0804O4543N9301O7290J35501K01534J80288l988
12262G87191j80531k04084j40302j00362j6572l0844m0453q927k4040r191O593
12251C8478L0447O587m04j6653k0949j8214r06L164l740j845m915k1431k0781
12238c1162Q06O060K7449o606j6371l528K0887L3994m7051j5820L2429K7543j3854
12225A4776q621J1339n677r755J3595N138q313o721j5240o548R702P855j9500
12212a7970m729N443j8595K385j5803J8096O385L407O011j2657J1318M1423J0692
$$ y = [60931, 63171, 48702, 30353, 12606, 27096, 37956, 51830, 37331, 4555, 107, 21676, 64423, 87778, 111449, 112673, 93542, 77119, 81209, 76472, 80269, 61400, 46837, 39989, 14413, 2302, -9332, -8985, 31113, 51918, 82722, 147265, 206566, 273856, 409357, 610891, 791179, 787191, 606660, 402576, 262274, 161912, 145340, 114496, 74043, 65116, 41076, 31885, 38478, 68925, 75512, 75108, 58455, 37506, 19292, 18386, 21550, 17810, 15965, 11050, -10381, -31162, -30356, -24296, 3153, -3453, -19824, -23352, -2465, 31529, -15522, -31342, 1087, 28630, 14776, 6155, 17494, 11817, 2062, 15657, 20795, 12482, 5761, -9479, -16027, -6325, 1530, -17970, -22699, -17256, -35851, -33466, -49269, -31173, -24788, -21381, -15370, -28027, -16709, 24714, 35406]
12199C5406j1155M756O045k1436R969l6412k4449J6035K9973K6312j6565j4619
12187C860j8682L2443L0220J2622j193l0106k0406L4246j0693j4646M369p312
12175A4722l8397k6070L1522K5716J7074J3090k0179K06J3006L697L5864K3132
12163I3383k754J053L0339L8004J9390P2896J24536J70445K33890L84887N68207
12152A734276M63464l1141n40126n53426l51836k11659j28796j00302q1538n3381
12142A45535o877j554k1497l3165R411K053l426M0240L1909R389M4122M1570l9465
12129B18245o2410o0988l9328l3778j6537p431j699J5902K1544N26j2312j6782
12117D952k3895M569J9248J4908J0259k0735l5879j0157J1820K5356J0417l7139
$$ y = [35406, 24251, 29007, 35052, 13616, 23585, -12827, -37276, -21241, 8732, 35044, 18479, 3860, -14822, 17621, 47841, 60463, 59270, 29164, 8758, 43004, 32311, 17665, 22034, 14722, -23675, -49745, -18223, 7493, 24567, 37657, 17478, 17684, 30690, 34387, 70251, 93383, 90629, 91682, 122021, 160025, 179415, 252311, 376847, 547292, 781182, 1166069, 1734276, 2197740, 2166599, 1626473, 1073047, 721211, 509552, 380756, 280454, 198916, 145535, 138658, 137104, 115607, 82442, 91853, 93906, 90480, 130720, 162629, 172018, 216140, 257710, 218245, 155835, 94847, 55519, 21741, 5204, -2227, -3926, 11976, 33520, 34046, 21734, 4952, -18943, -14374, 4874, 19782, 30041, 9306, -26573, -36730, -24910, 446, 10863, -26276]
12105b6276N052K5218k679j2483j9007L0693J5451k1960k024J037K1229J8127
12093C2378m738M390n177Q621k4767j7480O36Q672Q790j4442J066r651p161J1282
12079g581o268j1161K9704L3799k5441m8722J2501M2112J1747J530j4560j9731
12067b071j3714k5377j4115l530K4566Q402n793n632J7637J0973j8838j8688l879
12054e0059K0991J4245l5544k1177J6982L4366k532j3427L3208K8316K4319K5397
12042G5085k3664l7994p783r374n043K4118q147j4091K3709k80k5223l6957J3034
12029c2610J4499K6301J6758j072j1478L568J0976L330l2121k246l052j390j754
12016a0291l0760k2335K619m595j0106L4248K4460k994K0804J3466l4274l0088
$$ y = [-26276, -21224, 3994, 1315, -11168, -30175, 518, 15969, -5991, -8015, -6978, 14251, 32378, 27640, 32030, 26853, 35474, 10707, -6773, -6137, 2535, 11325, -3117, -2051, -11702, -18863, -7581, -13849, -25010, 4694, 38493, 13052, -35670, -23169, 18943, 30690, 32220, 17660, -2071, -15785, -41162, -55277, -58807, -34241, -25839, -31632, -37264, -19627, -8654, -27492, -46180, -50059, -29068, -14823, -50367, -71544, -54562, -20196, -22728, -36155, -2947, 25369, 49688, 75085, 51421, 13427, 5644, -3730, -8773, 15345, 7198, -6893, 16816, 16536, -8687, -45644, -32610, -18111, 8190, 24948, 23876, 12398, 15966, 26942, 30272, -1849, -4095, -7147, -8537, -10291, -41051, -63386, -60767, -65362, -75468, -41220, -16760, -19754, 1050, 14516, -19758, -49846]
12004d9846n959N1783l75L427L275n455j5621j4390m564k7780p767k705J9645
11991e6332j4216j3611J2786K9393J7352J5167K3486m496j2550J0076q520l5026
11979c6491j9664r22R987J7583K427k4400K048k6141l06M3743J6240M583j660
11966a2973o211l762M892j804k2623R209m105j5395M710R104L1927j163q907j3854
11952c0955J5798J1113l5060O447Q296J1592j7282N518K2014J4779l856J422K1803
11939C1629j9331k7124k370O903n490k900M54j0509j247N4210k594j2005O991
11926A6617k7753n1903k513L5574J9387J7109J0898L8449j730l5712k0096l142
11914d815L351L50J8520J0580n44p482J3961l825k019k78J1828k5244J601p198
$$ y = [-49846, -55805, -4022, -4397, -970, 2305, -3150, -18771, -33161, -37725, -65505, -73272, -75977, -56332, -70548, -84159, -71373, -41980, -24628, -9461, 14025, 9529, -3021, 7055, -1465, -36491, -56155, -57077, -47090, -29507, -27080, -51480, -49432, -75573, -75879, -32136, -15896, -11313, -12973, -19184, -22946, -18054, -19858, -42481, -33272, -37377, -52772, -48062, -38958, -7031, -8194, -17101, -30955, -15157, -4044, -39104, -32657, -24361, -12769, -30051, -24533, -2519, 12260, 8404, 9826, 31629, 12298, -14826, -17196, -10293, -15783, -18683, -18229, -28738, -29985, 24225, 21631, 9626, 16617, -11136, -63039, -65552, -29978, -10591, 6518, 17416, 55865, 54135, 18423, -1673, -4815, -1464, -1114, 17406, 27986, 27442, 19960, 33921, 30096, 28077, 27799, 39627, 14383, 15984, 8786]
11900H786k0014j0193j0928q093m455O826N388k0471L883J2892j5850L1580O263
11887a4386j1596J1698l0983p88j1933L088J5120n497L819K0220K843l4278J0869
11874d1804j2046l726J9574N792J0197n746J3290j6278J0511P76k2448L715J5906
11861b2287J2152n222L1080J4233N304j9477l6110K9867J0705k4653O600K6591
11849B8783j4297n07J5961j5130j1544k0114Q908K8407K6027J5315j4671j8200
11837B8938k3131j5521m379O51J1716K1431J2396k4981j9207N788Q964p468J4644
11824I841l385p563j0369j2388J7290K3418j8150o431K6858K4046K029k4465j093
11811A9638k9366m2575q822L424J6679J0194J1492K1899L558o503j8295o578R087
$$ y = [8786, -11228, -21421, -32349, -40442, -44897, -38071, -32683, -53154, -49271, -36379, -52229, -20649, -14386, -25982, -14284, -45267, -46055, -57988, -54900, -39780, -45277, -41458, -21238, -18395, -52673, -41804, -53850, -57576, -38002, -32210, -22013, -27759, -14469, -30747, -20236, -19460, -41908, -38193, -22287, -10135, -15357, 15723, 29956, 35260, 15783, -20327, 9540, 20245, -4408, 2192, 28783, 14486, 13979, 29940, 14810, 3266, -16848, -7940, 20467, 46494, 61809, 47138, 28938, 5807, -9714, -14093, -13442, -1726, 19705, 32101, 7120, -12087, -6299, 2665, -4803, 9841, 6456, -1107, -11476, -23864, -6574, 16844, -1306, -7737, 19121, 43167, 45196, 20731, 19638, -9728, -52303, -61125, -57701, -41022, -30828, -19336, 2563, 6121, -382, -18677, -25255, -16168]
11798a6168K4888K8422j2330j567Q585k0939j3413J4874L7614J1149j9617k7276
11786A4222l378J2553l6131k0159k3416J283K7919L7894j0688R599Q142n958k9960
11773a8078j6065p680M271M6079o451k5957J904J7303Q057L451k8221R947M5682
11760C4242o564l4623k2250J4455j6078J6957j699J1905K1520K1212j9436l6773
11748a7132j3318O749J6633R644j6846K3160K1068K2651l4570j9744p612L7292
11736B7975K765k8201m110k1087k2624o728L614K6817J0650k875M422K2170J1081
11723B3869J2163q704j9631j0804j6488J3863L6781p704k8485n925J0771K0880
11711B0586k2616k770P644l6918n39p882n568L842k314K424K5738M6228k360j0206
$$ y = [-16168, 8720, 37142, 24812, 23245, 31830, 10891, -2522, 12352, 49966, 61115, 41498, 14222, 10844, 23397, -12734, -32893, -56309, -55026, -27107, 10787, 99, 9698, 17840, 11882, -18078, -34143, -41823, -37552, 8527, 2076, -23881, -21977, -4674, 3383, 6834, -21387, -11440, 34242, 27678, -6945, -29195, -14740, -30818, -13861, -15560, -3655, 17865, 39077, 19641, -17132, -30450, -23701, -7068, 2576, -14270, 8890, 29958, 52609, 18039, -1705, -9317, 27975, 30740, 2539, -1571, -22658, -45282, -52010, -48396, -21579, -10929, -13804, -9382, 12788, 23869, 36032, 27328, 7697, -3107, -19595, -5732, 31049, 23345, -5140, -11065, -294, 20586, -2030, -4800, 2844, -34074, -34613, -42495, -48063, -44221, -46535, -44111, -18373, 27855, 25495, 15289]
11697A5289k3929L3672J8904l5329j6524l482j4545M7088j7939m4537l073K1000
11685b3405p489j6338L168j369j2951K2738n597j9572P557J6452J9225J2278J3822
11672H519j3687J2496K8608j6484j6897R428J6052q424p330j7814j4444K2727
11660B750q230p17k9556J7530J7848J2561J6504j3165k0310o606j1515O222L8490
11647B1806J3708m0432J0437J2397J8626j4498m6335j706M262K5987R473N606
11635A9331L6056p779m3941q142J0748p578J3574p01Q995j3153j2477p089Q661
11622c495J929j4048J8338J0251K413J3343Q740j6070Q494L474j7618j0088J7142
11609B2805L6016L88j855R553q408m1006k3689j4622K23O310j2308n876K6722
$$ y = [15289, -8640, 25032, 43936, 8607, -7917, -11399, -25944, 21144, 3205, -41332, -44405, -23405, -30894, -47232, -44064, -45433, -58384, -35646, -41243, -60815, -53258, -36806, -17581, -5303, 8519, -5168, 7328, 35936, 19452, 2555, 11983, 28035, 19611, 12281, -5533, -19977, 2750, -5480, -6197, -35753, -18223, -375, 12186, 28690, 15525, -4785, -11391, -22906, -16684, 21806, 35514, -4918, 5519, 17916, 36542, 22044, -24291, -25997, -21735, 4252, 13725, 19331, 55387, 47608, 3667, -4475, 6273, -1305, 12269, 11568, 20563, 7410, -5067, -12156, -3495, -1566, -15614, 2724, 12975, 15388, 28731, 37471, 21401, 29895, 33369, 15751, 5663, 22805, 58821, 59209, 57354, 66907, 58499, 17493, -6196, -20818, -20595, -14285, -26593, -32469, -5747]
11596e747K7168J7850J1628k2587k6521j4628J3545K6024J0893P35J7805p445
11584D8720k211r882l75m225k6601O359K417O300N572m6766j1109P902r870M202
11570b9567K2864J3763K6558Q104j3258m7805m162L324K0089K1775J2503l478
11558C0710j0279K0127r694l6677j9769L1173M644K572J5956m930K3968k1817
11546B5984j7937J0305J7978k504p74Q247q344l7322l2515l2411M1189K4133K2909
11533A8938J9548L862N027r461k9352o184K1933k7890l3823r03J5270M4078P08
11520B1751j6087m1755M814J0829k164j63J0292O490k273n529P036J4323j4365
11507f801j2841K4865R553j4574o525J7636P976j0204j6431n616K8737P27L601
$$ y = [-5747, 21421, 39271, 50899, 28312, 1791, -12837, 708, 26732, 37625, 38360, 56165, 48720, 46509, 36627, 36252, 32027, 5426, 11785, 14202, 20502, 26074, -20692, -31801, -23899, -33769, -29567, -6703, 7060, 33618, 41722, 28464, -19341, -23503, -20179, -90, 21685, 34188, 30710, 20431, 40558, 30864, -5813, -25582, 5591, 10235, 12807, 28763, 23833, 47801, 25984, 8047, 18352, 36330, 33826, 33052, 41299, 32955, -4367, -36882, -69293, -28104, -3971, 18938, 38486, 42348, 47375, 37914, 8562, 2378, 24311, -3579, -37402, -38305, -23035, 21043, 21751, 5664, -36091, -31277, -20448, -22612, -22775, -12483, -5993, -8266, -13795, -6759, 7564, -6801, -19642, 5223, 14776, 202, -6323, 11313, 19289, 9085, -7346, -12962, 15775, 16502, 20103]
11494B0103j140j8565M708K0097J5789M8714M8778O3819L7740k0654o9475p6705
11482G3209l9731m8279J3228P068M0655J5053j2550j2667j2909j8222l3105k89
11470b8539N02J4041j2041P584J4349L102J4685j635J9603J3790j1924j6299j2548
11457D670n393k8324L148l603J2364P067O021K6326j258K993l5405k7446L429
11444c5411M8983l359l1694k1152l5354J1961K9632J1524L0316J015J9441K496
11432B8398j564k1626l3872J6834J4093o814N770j9944k2891J3007L660p748K2497
11419a0200r464J4377j428J6166J371j0230m3109r547O413J7914O280n781K6490
11406g48O219o085p664j3990J383K190J3223J04L4971n629l1229j4078J7796K7640
$$ y = [20103, 18963, 398, 5106, 25203, 40992, 89706, 138484, 202303, 240043, 219389, 149914, 73209, 33478, -14801, -1573, 5495, 46150, 61203, 48653, 35986, 23077, 4855, -28250, -28539, -28037, -13996, -26037, -18453, -4104, -1002, 13683, 12048, 31651, 45441, 33517, 17218, 4670, -723, -29047, -25899, -29502, -17138, -10071, -4050, 22276, 21018, 24011, -11394, -38840, -35411, 13572, 10213, -21481, -42633, -77987, -66026, -36394, -24870, 5446, 6461, 25902, 28398, 26834, 5208, -28664, -11830, 2263, -4551, 1219, -18725, -41616, -28609, -24949, -32697, -10200, -19664, -5287, -6715, 9451, 10822, 592, -42517, -52064, -45651, -27737, -21457, -27238, -748, 5471, -614, -8278, -22268, -20885, -18695, -5472, -5368, 29603, 23974, -7255, -21333, -3537, 24103]
11392B4103j8345j8406L0865J6008n820r24r723O371k0050k5822J5286o829N16
11379a2770j1786J9766O741q596k3600p506L7409K1958j1078q086q940m753l41
11366a1582J2214O496n182o698l559K4209O657n22J3205J6971L654k1479j4267
11353B0117l2990R745K2058j2861k431j8861k9038K5489L2075j8333K6566q023
11341A3513m6566l8151J6451N1229L5457r275J286J4298l6473o702P691Q036J1823
11328B2617q412j5046m5036l370L2349L7933O600j3767J4284J866k3629J1368
11316A7757J2383l851n616r775M275J4155l0206j9643K8762J6126k3083L214j6082
11303a1584J6158q601l063q353k175J8617J5152K5406j6787l1055K482j5662m4562
$$ y = [24103, 5758, -12648, 18217, 34225, 28405, 27481, 17758, 24129, 4079, -21743, -6457, -13286, -12770, -24556, -4790, 1951, -6645, -30245, -37751, -342, 21616, 10538, 2452, -6488, -11241, -11582, 632, 7128, 1946, -4752, -8311, 15898, 22555, 22033, 35238, 52209, 55863, 34384, 20117, -12873, -3128, 18930, 6069, 3638, -15223, -44261, -18772, 13303, -5030, 21536, 13513, -33053, -71204, -54753, -3524, 31933, 22658, 23944, 38242, 1769, -4933, 2758, 10794, 22617, 14205, -841, -45877, -49247, -16898, 21035, 27635, 13868, 28152, 30018, 6389, 17757, 30140, 26289, 20673, 10898, 15173, 29328, -878, -20521, 8241, 24367, 1284, 4498, -11584, 4574, -4027, -7090, -15443, -17618, 999, 16151, 41557, 24770, -6285, -3803, -19465, -64027]
11290f4027l855P980L7210J1911O116L5247L6144m6238j4497K6795K0461l0799
11278B2448k5905J0749l271k0437R078J2350r821K5226P643n994r199j4049k6982
11265b8164o050J3294P090P903J239r653N858k410K2224j0268K2527J61l4973
11252a1222j4578J7492K995j9648K3210L7402j4782k4038J4224j6758j7599J781
11240b1521M3315M7223m685m5693m4519J5299K7081R3k4135k2556K4055L6919
11228C0876J8334M153K591R78l704J9137R044l5504j7894M313q175j5566M792
11215A3375k3464l2678j3324K6146L7954J3710k274k687j4071Q077M236K612Q33
11202A8445L289m521q272N346J2187J8686j0600k7425o660j2179m473N903N048
$$ y = [-64027, -67882, -59902, -22692, -10781, -4665, 30582, 66726, 20488, 5991, 32786, 53247, 22448, -3457, 7292, 4021, -16416, -7338, 5012, -4809, 20417, 28060, 22066, 12867, -1182, -28164, -34214, -20920, -13830, -5927, -4688, -14341, -8483, -10893, 11331, 1063, 23590, 23751, -11222, -25800, -8308, -5313, -24961, -1751, 35651, 20869, -3169, 11055, -5703, -23302, -21521, 21794, 69017, 64332, 18639, -25880, -10581, 16500, 16593, -7542, -30098, -6043, 30876, 49210, 53363, 55954, 56932, 53228, 72365, 81409, 45905, 28011, 32324, 24149, 8583, 13375, -10089, -42767, -56091, -29945, 8009, 21719, 19445, 16758, 2687, 10764, 15000, 17612, 18445, 21734, 17213, 8941, 14287, 26474, 45160, 34560, 7135, 475, -11704, -16177, -10274, -5226]
11189e226n283L381M264K8759J4572l674l2437J8778J1929O222j3717J251L921
11176C2740J4966J3489L27k1349k4731j3660K0772m212J064k025J199K700j1445
11163I835m949k5170k1384K5129K8382O181j2105P07j631L2978K9712p061k336
11150E8288k774n947l4937j703J302j9528L2333l256r989O549j3077Q356j1322
11137D295J4721K7507J9971j2582j6536l487o349K1245J5381o968o346k1825l7041
11124h014l366J7313n359p124J7013J1040K0187J962J5383j43K5825J1931k7279
11111F9369q175j4197J112N635K2266N875L954j230o11J7028J3946K4665N5640
11098A95277Q2930R5766J66867K40814L65340M74831L36253k9695l72370m51289
$$ y = [-5226, -10509, -7128, -2864, 25895, 40467, 36793, 4356, 23134, 35063, 41285, 27568, 28819, 32740, 47706, 61195, 61522, 40173, 15442, 1782, 22554, 18342, 19406, 17381, 18580, 21280, 9835, 4886, -20284, -41668, -16539, 11843, 18024, 5919, 6626, 4995, 37973, 67685, 60624, 58288, 55514, 49567, 14630, 12927, 14229, -5299, 27034, 23778, 13789, 20338, 7261, 15617, 4295, 19016, 46523, 66494, 53912, 37376, 33889, 27540, 48785, 64166, 57198, 50852, 29027, -8014, -11380, 5933, 574, -6550, 10463, 21503, 41690, 43652, 59035, 58892, 84717, 96648, 69369, 61194, 46997, 48109, 53744, 76010, 81885, 85839, 84609, 83998, 101026, 114972, 139637, 195277, 278207, 373973, 540840, 781654, 1146994, 1621825, 1958078, 1928383, 1556013, 1104724]
11088A104724l57869k17367j37680j07368p0246k4703K639k2521l6722l2556n885
11077I4446m905q966K4049k0590j9732L23k0090J3545J210k026L94j5944J4642
11064E6356J9488k2290j8880J0562J2846L482L286P856J6752j9827r652j0344
11052D9635l6889j0439L7272L5486p703k1930j117k4452M070P444J3340J1905
11040E6622M701k3251k9020J2210L6372l0681k9566k102K6531J2813l3820j7165
11028a6356o561N426K4610R99J3711k910L939L525j2480k4439J6707J3605J0744
11015C0520N918k9263j7475L8180J7724L0782o93j0784K5353R794J5067l814k4471
11002H6838k2627j1929r074j9396J5561o038n1698J1309N2824R604k2115l2613
$$ y = [1104724, 746855, 529488, 391808, 284440, 214194, 189491, 192130, 169609, 132887, 100331, 94446, 89541, 80575, 104624, 84034, 64302, 64625, 44535, 58080, 59290, 57264, 57658, 41714, 56356, 75844, 53554, 34674, 45236, 58082, 61564, 64850, 72706, 89458, 69631, 59979, 49635, 12746, 2307, 39579, 75065, 67362, 45432, 44315, 19863, 23933, 31377, 44717, 56622, 61323, 38072, 9052, 21262, 57634, 26953, -2613, -4715, 21816, 34629, 809, -16356, -22917, -17491, 7119, 8118, 21829, 18919, 22858, 26383, 13903, -10536, 6171, 19776, 30520, 36438, 7175, -10300, 27880, 45604, 76386, 75693, 64909, 90262, 100056, 115123, 111309, 86838, 64211, 52282, 43208, 23812, 39373, 33335, -18363, -7054, 45770, 55374, 33259, 646]
10990F46K88J864k114J3591K0317o268l3512j1211k097K723J5943J5247K5331
10977D0748k5277J6442K7801J4792J4106j372J9415Q999k0471k0370Q744J0389
10965I3946j6878j773q012j2885n770j1987k685K8895K9149L1939M371l4038o948
10952H7324j3320o089j6352k6320J1495N670j1840K7691N4525J7683q56j3818
10940A15793k6575K8343j04m3899k7455K4813Q42k8383m8815M264J8248K5847
10928D2919L5162K8281r358R140P426K4086K5645k2126l1703k8094m302K7393
10916A04469Q846J0730L2178M3714J8994M9556R2747O0395J0138n1413j01894
10905B78460p1854j4335j6049n36j509P040j5608j7101J3845o35l4655k4578r117
$$ y = [646, 934, 2798, 684, 14275, 34592, 28324, -5188, -16399, -18496, -15773, 170, 15417, 40748, 15471, 31913, 59714, 74506, 88612, 87240, 106655, 115654, 95183, 74813, 83557, 93946, 77068, 75295, 67283, 54398, 48628, 36641, 33956, 62851, 92000, 123939, 128310, 94272, 87324, 74004, 67915, 51563, 25243, 36738, 42408, 30568, 58259, 112784, 130467, 129611, 115793, 89218, 117561, 117457, 73558, 46103, 70916, 71758, 43375, -5440, -1176, 17072, 42919, 78081, 106362, 97004, 106144, 113570, 137656, 163301, 141175, 109472, 81378, 77076, 104469, 113315, 124045, 156223, 199937, 218931, 268487, 361234, 421629, 431767, 380354, 278460, 206606, 192271, 176222, 175686, 174177, 181217, 165609, 148508, 162353, 161718, 127063, 102485, 93368]
10892I3368k2082Q697L082m620J9912J7555m031J12J5354J7404J0369J0270J0563
10879A75953J2421k1172l6484l0785l1823l645j5823K9708Q437K0191J622k2033
10867H6567k7202k715P327K7125K2078p817n731j4419k9516l564l393k543Q813
10854E5010K2449L6668J3275j6194k4584K823K8135J1601l688k6175j4660r621
10842G5039L1657L2230J451j0004j4263j9158N835K1839m80n1328l3534k0982
10830A8302K2099N4938J5313J2522J0811l056O29K618K1279L401k157J3072K8746
10817A98517M4756K0109l6987m202Q262M328k449k3438J7608K3355J3916k7307
10805B36468J2736M0345J5595j2007j5499J3659j3455j0994P313J7034K3469L8438
$$ y = [93368, 71286, 79983, 83065, 78445, 98357, 115912, 111881, 111993, 127347, 144751, 155120, 165390, 175953, 188374, 167202, 130718, 99933, 68110, 64465, 48642, 78350, 86787, 106978, 108600, 86567, 59365, 56650, 63977, 91102, 113180, 105363, 99632, 85213, 55697, 52133, 48740, 46197, 55010, 77459, 114127, 127402, 111208, 86624, 89447, 117582, 129183, 125495, 99320, 84660, 75039, 106696, 138926, 140377, 130373, 116110, 96952, 102787, 124626, 124146, 72818, 39284, 18302, 40401, 95339, 110652, 123174, 133985, 130929, 131558, 134176, 155455, 158856, 156699, 169771, 198517, 243273, 263382, 226395, 222193, 230455, 234783, 232334, 208896, 226504, 249859, 263775, 236468, 249204, 289549, 305144, 293137, 277638, 291297, 277842, 266848, 274161, 291195, 314664, 353102]
10793C53102P7610M6621M919K2828L6914N4099J25330J67634J41401Q1701o7906
10782A044253l90021n42241l73289j02932K1275N5245N5755K7727N4083M2154
10772a07991K5211K1850N011q046J2383K8558J6190K5431l546K9771M0125k1901
10760F3046P388j5829k4439j7309k4140l2102L2103N5464K8825M0066J4610J4708
10748A42391o433m398k055j4421J3817N1632J1936j9600j5898k1176K2189N3173
10736B11157O324j2475k5578l4599M4825P0713J1935k4890J0179L2544J9067P91
10724C09993k9884K3488L9836K2712R231N231O615o44J4719K6147K2850M4314
10712D94608L1755N3873K9885M4522N5174L9323L0635K4194M0241O1024N6800
$$ y = [353102, 430712, 477333, 482252, 505080, 541994, 596093, 721423, 889057, 1030458, 1112159, 1044253, 654232, 111991, -261298, -364230, -342955, -287710, -231955, -204228, -150145, -107991, -82780, -60930, -55919, -63965, -51582, -23024, -6834, 18597, 15051, 44822, 84947, 63046, 70434, 54605, 30166, 12857, -11283, -43385, -11282, 44182, 73007, 113073, 127683, 142391, 135958, 131560, 129505, 115084, 128901, 180533, 192469, 172869, 156971, 135795, 157984, 211157, 217481, 205006, 179428, 144829, 189654, 260367, 272302, 247412, 257591, 290135, 309202, 309993, 280109, 303597, 343433, 366145, 375376, 380607, 387222, 386578, 401297, 427444, 450294, 494608, 526363, 580236, 610121, 654643, 709817, 749140, 779775, 803969, 844210, 905234, 962034]
10701I62034K2980N0713N1664M0263N9236L8904J3696L5173O2409P3514Q5914
10690A496500O7259P8507Q1797N6132O9922J26716J60877J81763K15937K68643
10680B804053L03139K96280L11387L34401M10622N64192P17475Q05293Q75169
10671G422011R36011J132958J297389J574574K027781K779000L868005N260543
10663B6298272P280982J0469834J5611744K4503804L9960400O4925625R6339815
10656B85390476J03824357L9375012n8875638j10188537r0427349n5517625l3037873
10649H0542823k0380421j3247689r099239o514766m868208l838628l189441k655361
10641A6749070k199029j790850j434386j114715q78603o91518o25809o15321n95931
$$ y = [962034, 985014, 1035727, 1087391, 1127654, 1186890, 1225794, 1239490, 1274663, 1337072, 1410586, 1496500, 1563759, 1642266, 1724063, 1780195, 1850117, 1976833, 2137710, 2319473, 2535410, 2804053, 3107192, 3403472, 3714859, 4049260, 4459882, 5024074, 5741549, 6546842, 7422011, 8358022, 9490980, 10788369, 12362943, 14390724, 17169724, 21037729, 26298272, 33579254, 44049088, 59660832, 84164636, 124125036, 189050661, 285390476, 389214833, 428589845, 369714207, 259525670, 169098321, 113580696, 80542823, 60162402, 46914713, 37815474, 31300708, 26432500, 22593872, 19404431, 16749070, 14550041, 12759191, 11324805, 10210090, 9331487, 8639969, 8014160, 7398839, 6802908]
10632F802908n47436m63611l70844l38532l04022k94185k84569k50912k75069
10623C673728k38747k15868k04485j57015j69768j68499j33787j92327k07184
10614A986048j27817q9364j03255r3757q8132o1791q5955p7559n2829o7291n6163
10603A082135o1296n8530k3850j9221J4498K7830q944l8594n8528n2563m063j8319
10591G80555k0101n0164l2027j1726k5565j2987j6882r777Q88k0418K065O309
10579E90170J9075R400q436k0353k2625k2067l396k5671q726o75Q593p479m972
10566E02838O835J5476j1517j3947J0800N2851O3134O2561Q5300J85410K00275
10555A160016J01012o6512k01098j82135j29652p2786M055k8975m7407m3579p145
$$ y = [6802908, 6255472, 5791861, 5421017, 5082485, 4778463, 4484278, 4199709, 3948797, 3673728, 3434981, 3219113, 3014628, 2857613, 2687845, 2519346, 2385559, 2193232, 1986048, 1858231, 1768867, 1665612, 1571855, 1483723, 1421932, 1335977, 1258418, 1205589, 1138298, 1082135, 1020839, 962309, 938459, 919238, 933736, 961566, 952622, 914028, 855500, 802937, 798874, 780555, 760454, 710290, 678263, 666537, 640972, 627985, 611103, 601326, 602214, 581796, 583861, 590170, 609245, 618645, 610209, 589856, 567231, 545164, 541768, 516097, 507371, 506696, 515289, 507810, 502838, 509673, 525149, 513632, 499685, 510485, 563336, 626470, 689031, 774331, 959741, 1160016, 1261028, 1194516, 993418, 811283, 681631, 608845, 612900, 583925, 536518, 492939, 485794]
10544D85794k3334M5916J8768P040J4186K4901R076K1420M3901O6112M5032M4614
10532H03426R8075N1543r6423k85752m21665l31638j29205K5237M1649L7412P0733
10521a36608M3978M6626k0065j4118J7130N4042K8749P276m24L011J3304q534
10509C4367k066P848k5740Q811J455k4695p048K7204K1568o463k1039o520j2481
10496d799p27k313L5583K3213K3039J1830J2689k8636q584J0524K3696k2873j50
10483G2492L8750P8939J1841k0370j065J0189l3119k7615j4554J1875K1709k5817
10471A23255l6262J505M490j4339k9526J878k8146j294L1940K9117k337J3940
10459I4221k5306k1419L0190J0397m107j3462J7944p341o46K546P769J5523J9382
$$ y = [485794, 462460, 508376, 527144, 534184, 548370, 573271, 582347, 603767, 647668, 713780, 758812, 803426, 901501, 953044, 856621, 570869, 149204, -182434, -311639, -286402, -244753, -207341, -136608, -92630, -46004, -66069, -80187, -63057, -9015, 19734, 27010, 26586, 29597, 42901, 34367, 32301, 40149, 14409, 23220, 24675, -20, -7068, 20136, 41704, 35241, 14202, 7682, -4799, -5526, -7839, 27744, 50957, 73996, 85826, 98515, 69879, 61295, 71819, 95515, 72642, 72492, 111242, 190181, 202022, 181652, 180587, 190776, 157657, 130042, 115488, 127363, 149072, 123255, 86993, 88498, 92988, 78649, 49123, 51001, 22855, 21561, 53501, 82618, 80281, 94221, 68915, 47496, 77686, 88083, 83976, 70514, 88458, 81117, 80471, 83017, 90786, 106309, 125691]
10446A25691j8668j2019J9563q515k6652j3899m88j3369K1627K9032m65j8704
10434H3134k1275j2281k2016l6431j3613Q828k1609j4042l1668K3685L5689R533
10422a2066N338o640r988L7479j6180j0892n172k794K9849J8455k5524m0404j2605
10409e1144K7412P689Q02o271M3876L3692k6993k9630Lo91j5174j511L1182K6970
10395D0212j6901k3649J0644L3759L4737j0849k5417j8179P977O243j1711R417
10383C6283K3370N860k7897j9250j609l9024j2490K595j818n480l0089J3893L0474
10370b5182q131M427K1668o311n047L2794r588k9740n988k8707R999o320j1536
10357f7662M2146m231p838M6046M247J0539j223P10R567k655J9219Ok1077q15
$$ y = [125691, 107023, 95004, 114567, 106052, 79400, 65501, 65013, 51644, 73271, 102303, 101838, 83134, 61859, 49578, 27562, -8869, -22482, -13654, -35263, -49305, -80973, -57288, -21599, -12066, -6728, -13368, -23356, 14123, -2057, -12949, -18121, -20915, 8934, 27389, 1865, -38539, -51144, -23732, -16043, -15241, -21512, 22364, 56056, 29063, -567, -564, -1255, -16429, -17940, 13242, 40212, 23311, -338, 10306, 44065, 78802, 67953, 42536, 24357, 32334, 38577, 26866, 36283, 59653, 65513, 37616, 18366, 16757, -22267, -34757, -32162, -33980, -39460, -69549, -55656, -25182, -33313, -28886, -7218, -13529, -18576, 14218, 4630, -25110, -31098, -59805, -49806, -56126, -67662, -25516, -29747, -37585, 8461, 12708, 23247, 22024, 22734, 32301, 29646, 48865, 48871, 27794, 26979]
10343B6979J1483J5059J9453n797k3673q457K15J740m134k0762k4166P050J6187
10330A1177k6770P218J1392K9776k3210k0615K582j5635K5487L5878j9096j0099
10318H085K544n20J2677m832k421l0764o195J4241M797j000R899Q525K1961o51
10304C6346J3710j605l334j4994M284J9014k3118j9098j2329K2040J6987j6052
10292B1851j085J348o244j6203j2026j8489k5816K0564L9366N1964j2918j3290
10280B9022N857l5414j4063L8442J7896j0087k1117k6958o09k1291k722j7515
10268e8559K2199K4447l577k4726j5486J4194J8528q744R217L6139j7794l122
10256g284m363k449J6666K6592p525l497J0837j9614j0693Q867j7901m0319L3552
$$ y = [26979, 38462, 53521, 72974, 67177, 43504, 35047, 35262, 37002, 32868, 12106, -12060, -5010, 11177, -15593, -8375, 3017, 32793, 9583, -11032, -8450, -24085, 1402, 37280, 18184, 8085, 10629, 10109, 22786, 17954, 15533, -15231, -21426, -7185, -2388, -3388, 6511, 15036, 36997, 36346, 50056, 48451, 45117, 30123, 34407, 53421, 30303, 11205, -1124, 20916, 37903, 21851, 20766, 22114, 15870, -333, -12359, -30848, -56664, -36100, 3266, 55230, 42312, 29022, 34879, -535, -14598, 23844, 41740, 31653, 10536, -16422, -17031, -38322, -41044, -58559, -36360, -11913, -15490, -40216, -55702, -41508, -22980, -31724, -22507, 13632, -4162, -7284, -11647, -14096, 2570, 29162, 21637, 18140, 28977, 9363, -1330, 7537, -10364, -50683, -17131]
10243a7131L4804j1991J3956l668K3662K0376j6370J7531l1833l12o685l665M9392
10230F8066J0928l420L2025M0326l5567k3924K2850O239J2256N9653N9568L1035
10218B80035R5275J51868K36474L76379M63745L25177j6117l79414m54845l08588
10208G69989k01703j41474j31735p5810m6100j7996l5077j0800K6541R388m8254
10197I6969j0978k9187l871J4828J227k1123j9606k196j2163J8283L2427L4422
10185I9032j3971k1202k0623R934k229k6962j5545k617q838M618J1876J7190N608
10172C6271j5988p402o927m690K739k1818j5530k621J5208M410r195j5669K8776
10159a2436R465J5620k246o303J1120l2146l743j725k8682J9138K7801n421k0773
$$ y = [-17131, 17673, 5682, 19638, 15970, 39632, 60008, 43638, 61169, 29336, 29024, 22339, 18674, 68066, 78994, 75574, 107599, 147925, 112358, 88434, 111284, 117523, 129779, 189432, 249000, 280035, 375310, 527178, 763652, 1140031, 1603776, 1928953, 1912836, 1533422, 1078577, 769989, 568286, 426812, 295077, 219267, 173167, 155171, 120094, 109294, 135835, 145223, 96969, 85991, 56804, 52933, 67761, 68988, 47865, 28259, 26063, 13900, 32183, 64610, 99032, 85061, 63859, 43236, 53170, 50941, 23979, 8434, 5817, -3021, 1597, 13473, 30663, 36271, 20283, 12881, 5954, 1264, 4003, -17815, -33345, -35966, -20758, -16348, -25543, -41212, -12436, -2971, 12649, 10403, 4100, 15220, -16926, -20669, -22394, -51076, -31938, -4137, -9558, -30331]
10146c0331j9581M544J5422l6449k4921J620J4677N0902o556o315R449k2018K5181
10133b4376K1593K7368J9589p476l4820j1553o698j8441N539M0702Q547k1283
10121a309j967J6218j4978J4045K2204k685k743n228l7603j2127P630M544p390
10108b1389J1293J50K8443L534j9217J8674l370k4306n527R036l0976j0106k7183
10095g0944j1455J853K013Q407Q745L147L1582K6161k3534k610K2205O060q65
10082G65j2422O166Q584J5789j3102o632l931j5633J1512J5084L3232M629r797
10069C4244J8663K8132L2319J6843k7842l6537q44L8261L5018J1388M3505N2323
10057B45473O6083J16754J70405K47419M81756Q77615J601591K025079L39822
$$ y = [-30331, -49912, -45368, -29946, -66395, -91316, -89696, -75019, -24117, -30673, -36988, -27539, -49557, -24376, -2783, 24585, 44174, 36698, 1878, -9675, -16373, -34814, -29275, 11427, 19974, -1309, -3276, 12942, -2036, 12009, 34213, 31528, 28785, 23557, -14046, -26173, -18543, -13999, -21389, -10096, -9946, 18497, 22031, 2814, 21488, 18118, -6188, -11715, -2679, -33655, -43761, -70944, -82399, -80546, -78533, -70126, -61381, -58234, -26652, -491, -24025, -26635, -4430, 1630, 765, -11657, -5491, 3093, 18882, 5780, -852, -4783, -20416, -8904, 6180, 39412, 44041, 34244, 52907, 81039, 113358, 130201, 102359, 65822, 64978, 103239, 138257, 149645, 193150, 245473, 311556, 428310, 598715, 846134, 1327890, 2205505, 3807096, 5832175, 6171997]
10048F171997j562815k060075j058619n23918k86477j53742j29055j12085m8266
10039B36945l7847l0480j7331k5738l439J2259l5202j1692K5665k452l4373k0538
10027E5777j4604m601P918n292q735k8524j6398J2100J7048J2929K5192j1731
10015D1079J979o63J8230k1079K1596k5159j010p88j93R248n40K5077j8807o290
10001D2680j2043j154k6475J787J8924l184k1937k3678j9675J4290M4220J5049
9989B8804j4106m404k771j7287m740K342j9055J9659J9014L0761Q245j3224k2484
9976A0754K6543M960j8428J656K7523r304O003k1339k2613J6101J8235k7819J1554
9963B3826k386J4829j3600k0623J5086j299m0414k2212K5791j9866j5360K3497
$$ y = [6171997, 4609182, 2549107, 1490488, 966570, 680093, 526351, 397296, 285211, 236945, 199098, 168618, 151287, 125549, 122110, 134369, 99167, 87475, 113140, 110688, 76315, 55777, 41173, 36572, 44490, 39198, 30463, 1939, -14459, -2359, 14689, 27618, 52810, 41079, 43058, 42395, 60625, 39546, 61142, 35983, 34973, 34185, 33992, 43240, 42700, 67777, 48970, 42680, 30637, 29483, 3008, 4795, 23719, 20535, -1402, -25080, -44755, -30465, 13755, 28804, 14698, 10294, 7523, -9764, -14504, -12162, -31217, -11558, 7456, 38217, 46462, 33238, 10754, 37297, 42257, 23829, 25485, 53008, 43704, 49707, 28368, 5755, 21856, 40091, 12272, 23826, 21440, 36269, 22669, 2046, 17132, 15833, -24581, -46793, -21002, -40868, -56228, -32731]
9951c2731K0386K3610m214j4110K872j5603M495J9055N4484O552k402N813m557
9938F3650L1632K1926K4466K2577O6872J30818K55336M36689P56076P25752r8571
9927B437223p60166o96302l75651k07230j01848q2167n1908j8997j8691j3044
9917A11219k449J3152p563l0522k5550k1089o922p410j0492K0777O214q059j3098
9904A8208R365J2591r10N730k6620J5161K7151J1469l8006j191j1702l5598J0622
9891c730K1412R130J6005L175J4517j5336J126J9661j572j7857o215J642k531
9878C9427J2928k043q949N4067J32228J27144J70783K61131K92232J24429j15239
9867A088138k69042k89545j97571j19122q1750n4057l7715J4694M960j2907k781
$$ y = [-32731, -12345, 11265, 7051, -7059, -4187, -19790, -15295, 3760, 58244, 64796, 62394, 68207, 63650, 95282, 117208, 141674, 164251, 231123, 361941, 617277, 1053966, 1810042, 2535794, 2437223, 1677057, 980755, 605104, 397874, 296026, 213859, 161951, 142954, 124263, 111219, 108770, 121922, 114359, 83837, 58287, 37198, 30276, 22866, 12374, 33151, 39365, 31306, 18208, 27573, 40164, 39254, 44984, 18364, 33525, 60676, 72145, 34139, 32948, 21246, -14352, -3730, 17682, 26812, 42817, 45992, 60509, 45173, 46299, 65960, 64388, 46531, 40316, 41958, 39427, 52355, 50312, 41363, 95430, 227658, 354802, 525585, 786716, 1078948, 1203377, 1088138, 819096, 529551, 331980, 212858, 131108, 77051, 39336, 54030, 58990, 46083, 43302]
9856D3302J2579K0062j8142n793j5704N116p366l1929k436j1217j7008L0125K7881
9843B9470j135m412k2165j829J9538j3426k4018j1951L605K3602R732l2584K1781
9830c792J3665J4496P267l6465q398J4161J1128J5468K7901O82j5148n312K55
9817C5908j4069m29l451l0450k60K111P523K0549P173k9998j5424l974l0253l823
9803e8867K0325M1759L484M2r153R695m739k5058K585l358l571j7983j0117L8124
9789a6832K3133k424K8444L4914k6153p432m858j7236J686o103J4399j3414j4435
9776f311n039K2211J4789k3216M296k5104l1035K4974J227j038J8362J9978j6801
9763b707j4687l0113j5404M3309K9923j8392j3459j0357J7093M454j5542K6573
$$ y = [43302, 55881, 75943, 57801, 52008, 36304, 41420, 34054, 2125, -311, -11528, -28536, 1589, 29470, 28335, 23923, 1758, -71, 19467, 6041, -17977, -29928, -26323, -2721, 7011, -25573, -3792, 9873, 24369, 31636, -4829, -13227, 934, 12062, 27530, 55431, 56113, 40965, 35653, 35908, 21839, 21410, 17959, -12491, -12751, -10640, -3117, 17432, 24605, -5393, -20817, -24791, -55044, -58867, -38542, 3217, 6701, 6743, -2410, 7285, 2546, -22512, -19927, -23285, -26856, -44839, -54956, -16832, 6301, 3877, 32321, 67235, 41082, 33650, 28792, 11556, 13242, 7139, 21538, 8124, -6311, -11350, 10861, 25650, 2434, 6730, -18374, -49409, -24435, -23208, -24246, -5884, 14094, -2707, -17394, -47507, -62911, -19602, 10321, -8071, -21530, -31887, -14794, -10340, -25882, 691]
9751F91J7422J5075k1349k6772k2638J314L4596n36k6701R915K2798m688j0554
9738a1427Q098J3581J3646J3080k8485K913J006q607l616N15O302p790j3140j6702
9724c0626J4282P806K3814J3252j6712k1853q071l486L89N793k4435K432K4885
9711a2530j634O825L7529L8421o011k0443l2443n367N863m447j7716j897Q136
9698e714m473k64k780q860k3130J6081K759J0712j9247j1169N564j474n91J415
9684d1171J4513k0856M463k1438L830M216j616r334J9558K2909m368L1070K3849
9671B5625j632j5120p090K306l588r852m0759p081P622L0498J6271n79n986q531
9657a7896J4733Q205m485j258J7258j5707j8764L8265J5969l0648k4371K533K7815
$$ y = [691, 18113, 33188, 11839, -14933, -37571, -36257, -1661, -2197, -28898, -18983, 3815, -873, -11427, -3329, 10252, 23898, 36978, 8493, 11406, 12412, 3805, 189, 704, 7006, -784, -13924, -30626, -16344, -8538, 15276, 28528, 11816, -10037, -18108, -21594, -21205, -15412, -39847, -37415, -12530, -14164, -7339, 30190, 68611, 62600, 42157, 9714, 4347, 10210, 5763, -11953, -13850, -5714, -10187, -10451, -13231, -22091, -45221, -29140, -26381, -15669, -34916, -46085, -40521, -41995, -42586, -41171, -26658, -47514, -43051, -64489, -60659, -56443, -58059, -67393, -47835, -24926, -29294, 1776, 25625, 23993, 8873, 1783, 4089, 501, -9351, -50110, -57191, -49569, -19071, -2800, -3379, -9365, -17896, -3163, 5042, 557, -701, 16557, 850, -17914, 20351, 36320, 5672, -18699, -16166, 11649]
9644A1649j1653J0300r920p359Q209j3311j1897j013J2734M0420J9776J284q446
9631D0773J1560J080j2380k445j1131l503l8k1303m316K6927J5260k3277k6241
9618i034j0094j5626J0772L3281j6622J8816Q972k505j9197Q069K5287Q039j9097
9605B1061Q808j9965n455K5146Q960k195j8448j2793K1211j0970j4291j5697m000
9592a8628K4579O279l2766m3335J7938K7381J5237K1594Q173J9051q877k2520
9580A4106N0J0059P528q226k6024l2621j9368J2765l2454K6944P3671K2288k7158
9567B1560J184L233j4605j441J907O279j071P632j3560j044j8096j9903K230R018
9553a6677J3268L4028l4288m0434K612L3478M8434j806l5818n856q185J3055K8113
$$ y = [11649, -4, 10296, 376, -6983, 1226, -12085, -23982, -24995, -12261, 28159, 47935, 49219, 40773, 52333, 53413, 41033, 38588, 27457, 23954, 23916, 2613, -1703, 25224, 40484, 17207, -9034, -19128, -34754, -23982, 9299, -7323, 11493, 20465, 17960, -1237, 6832, 32119, 40158, 21061, 29869, 9904, 4449, 29595, 38555, 36360, 17912, 5119, 26330, 15360, 1069, -14628, -18628, 5951, 12230, -20536, -63871, -45933, -18552, -3315, 18279, 26452, 45503, 36626, 14106, 14156, 24215, 31743, 23517, -2507, -35128, -54496, -41731, -74185, -47241, 26430, 48718, 21560, 22744, 25977, 11372, 9931, 11838, 18117, 17046, 24678, 11118, 10074, -8022, -27925, -25695, -16677, -3409, 30619, -3669, -44103, -41491, -8013, 40421, 38615, 2797, -3059, -11244, 1811, 29924]
9540B9924J7399j683J246J4979j3412j9590j0519Q067k00n372j8627J0422M449
9527A7083j4293k823K229L515L3516l5883l6435K2235M0896J5443K954k7862M111
9514B4686J2959M626l2242m169K1713L032J6065J2110k4116k9807k6407L1742
9502A0192L5854K1192p532n0140m1969j3376K4238K4394L6558K3616j8814r629
9490C4584q477k7161p39R899k4077j0181L156K3322m10J071k758j3077J471L021
9476a0356J2426m854k5900o119L9376k1320K1674J9818N324k698k4508k373m747
9463d257l0183N5149L1672n658j1423R903j230J2052j0707k3838k0863K985o411
9450b809j2126J1581Q670p825N635j9084L1355K5590j2259J1376P559o856j9913
$$ y = [29924, 47323, 45640, 46886, 61865, 48453, 28863, 18344, 26411, 26211, 20839, 2212, 12634, 17083, 2790, -33, 2196, 5711, 39227, 3344, -33091, -10856, 30040, 45483, 48437, 20575, 24686, 37645, 42271, 10029, 5860, 27573, 30605, 46670, 58780, 34664, 4857, -21550, 10192, 46046, 67238, 59706, 9566, -32403, -45779, -21541, 2853, 39411, 63027, 44213, 34584, 26107, -1054, -1793, 8106, -15971, -26152, -22996, 326, -84, 987, -1771, -14848, -13377, -10356, 2070, -2784, -28684, -34803, 4573, -16747, 4927, 24745, 30069, 27371, 2863, 490, -4257, -34440, 20709, 52381, 46723, 35300, 45203, 43973, 56025, 45318, 21480, 617, 3602, -2809, -14935, -3354, 5316, -2509, 3126, -15958, 15397, 40987, 28728, 40104, 47663, 40807, 20894]
9437B0894j8730K2062j426j7330J9372N590j346k9641J6228J0207J1210r606k5343
9424B141k2935K1460J1437j5128K3601K4095O324m661M651L21k2661L3967L1619
9411I4231q10j9412j1662l3048m1242k4583J8774j6219j5440N378J9095K975P647
9398a4316J8577K8822K3619l120j4636j7994k5341M450J3588R305L644L123K460
9385C2181k2155J3200N985j6276p35p611j0077j6191P683J5914L5695l6297j4023
9372a2707M3080K8303j647l449q955J4711l822j0974k2012J52J6359j0953J0176
9359C8262K241J1549J1145k0540k835R987l1918j686K358l12O013k522n131L3536
9345E0147J1836k3586j2762q318m436N849K2069J580k7211k260K6831J5435J4166
$$ y = [20894, 2164, 24226, 22800, 5470, 24842, 30432, 29086, -555, 15673, 25880, 37090, 27484, 2141, -20794, 666, 12103, -3025, 20576, 44671, 50995, 46334, 50985, 51306, 28645, 62612, 94231, 93421, 74009, 62347, 29299, -11943, -36526, -17752, -33971, -49411, -44033, -24938, -21963, -14316, 4261, 33083, 56702, 53582, 38946, 20952, -4389, 61, 13649, 22954, 26598, 29721, 32181, 10026, 23226, 29211, 12935, 12200, 4589, -5488, -21679, -13996, 1918, 37613, 1316, -12707, 30373, 58676, 57029, 53580, 44625, 59336, 55514, 44540, 22528, 22680, 39039, 28086, 38262, 40503, 52052, 63197, 42657, 39822, 49809, 17891, 16205, 18563, 18251, 24264, 21742, 16611, 50147, 61983, 38397, 25635, 17317, 12881, 18730, 40799, 42379, 15168, 12908, 39739, 55174, 69340]
9332F9340J1738j7806j1278p738o791J3412Q944K377o898j3628j454j7173o985
9319A6060L78j8617k3582j9068R719K4925K9926N338k516p912J3531M1787J205
9306G1174k4342J1078r74k8752j3051k244m569N009K2113K7406K8792j8697N57
9293G3500J9978K3091o13n0354L594K1281l3806k9720k233r216j4067J8202j2612
9280G025J1018K2182k0469l820P616M1109k0815j9675J5084M0107M049k7097L3802
9267I0116L0665N946k8264j3846J4624J800q640j697l2782k443K3854J2909k020
9254I0222l2007j4751K2631j8049q715K7175Q9K6326p628K5248P588k333J7508
9241A33304j797N820j6882j7533O679O647l2013k1343J9790J3055k5671L6099
$$ y = [69340, 81078, 63272, 51994, 44256, 37465, 50877, 59821, 62198, 55300, 41672, 40218, 23045, 16060, 16438, -2179, -25761, -44829, -35110, -10185, 19741, 25079, 22563, 14651, 28182, 69969, 71174, 46832, 57910, 56936, 28184, 15133, 12889, 8320, 13329, 35442, 62848, 91640, 72943, 73500, 93478, 116569, 115956, 65602, 69196, 90477, 56671, 26951, 24718, 15502, 1435, 19637, 7025, 18043, 40225, 19756, 15936, 23552, 64661, 43846, 24171, 39255, 79362, 83411, 56314, 90116, 120781, 126727, 98463, 84617, 99241, 101041, 92401, 90704, 57922, 55479, 79333, 92242, 90222, 58215, 43464, 66095, 48046, 39331, 66506, 66595, 92921, 85293, 110541, 118129, 115796, 133304, 131507, 137327, 120445, 102912, 109591, 116238, 84225, 62882, 82672, 95727, 70056, 106155]
9229A06155O756k0701j180J4813J8530K7012n206K697K0655J2970M695k746k1
9216A84429J7779q949J4406p644p526l0099j4054L4802J1389l5446o850J8294
9204A70531J9194O508r287k8017r821R409K3234J8234J5304J6225K1503M085r818
9191B47284R743J0434K6998j7617o543j493q247R787k0070J0647j0867l5757J6309
9178B30608L8509J4242J3006K9774K3491O092J8858R036p902Q501N3389L2278
9166D69882L3449p226n005K5837K3554p54L578K6827K0632K2629L8345J9905J7757
9153F89410K0772K7129K8205N2258M6250Q352J0347K6691N0278M8599L2831K8062
9141A069184P5069M5330L3310N8104M6405O6073O0531P2518J10557J00904R7742
$$ y = [106155, 112911, 92210, 91030, 105843, 124373, 151385, 146179, 148876, 169531, 182501, 187196, 184450, 184429, 202208, 193259, 207665, 200021, 192495, 162396, 148342, 183144, 194533, 159087, 152237, 170531, 189725, 196233, 186946, 158929, 149108, 158517, 181751, 199985, 215289, 231514, 253017, 257102, 247284, 257027, 267461, 294459, 276842, 270299, 268806, 260559, 270346, 250276, 260923, 250056, 214299, 230608, 269117, 283359, 296365, 326139, 349630, 355722, 374580, 383616, 375714, 384215, 437604, 469882, 503331, 496105, 491100, 516937, 540491, 539737, 543315, 570142, 590774, 613403, 651748, 671653, 689410, 710182, 737311, 765516, 817774, 864024, 872376, 882723, 909414, 959692, 1008291, 1041122, 1069184, 1144253, 1189583, 1222893, 1280997, 1327402, 1393475, 1454006, 1526524, 1637081, 1737985, 1835727]
9130A835727R8952J20606R4858J23509J11951Q9563J07943J58678J56646J38977
9120C037410J62946J39471J62281J80030J52939J43265J45243J63900J31570J13101
9110D532156P1385Q1613Q5900O2668K1633k6942o3088n8799q1642q3743j13449
9099D427692j64421j74918j38872j16735j67336j69249j48966j61067j20586j31823
9089B933719j53640j12523j50371j37305j05510j19176j01471j23383j09973o6800
9079A753567o5242r6136n4184n6462j15131p6476m8212l6511p0585n9831k9664
9068A045133j9063l1415o0252m2229l75k5195n9928n8597j1585j233m83l6824
9056F97954j8173k442k7196l8623m990j5620k9627k2342n2143m0044J2713M365
$$ y = [1835727, 1934679, 2055285, 2150143, 2273652, 2385603, 2475166, 2583109, 2741787, 2898433, 3037410, 3200356, 3339827, 3502108, 3682138, 3835077, 3978342, 4123585, 4287485, 4419055, 4532156, 4603541, 4685154, 4771054, 4833722, 4855355, 4828413, 4765325, 4706526, 4624884, 4541141, 4427692, 4263271, 4088353, 3949481, 3832746, 3665410, 3496161, 3347195, 3186128, 3065542, 2933719, 2780079, 2667556, 2517185, 2379880, 2274370, 2155194, 2053723, 1930340, 1820367, 1753567, 1688325, 1592189, 1538005, 1481543, 1366412, 1289936, 1241724, 1205213, 1134628, 1074797, 1045133, 1026070, 994655, 934403, 892174, 891799, 866604, 806676, 748079, 736494, 735261, 734778, 697954, 679781, 677339, 650143, 611520, 606530, 590910, 561283, 538941, 486798, 446754, 459467, 463832]
9044D63832m468k0147q943j0194k4721O509K3871J9461j27m6848m7450l2490j7002
9031C01283K306k8449k3818L412o166k0694l9564m306K287k212m2037p312L5426
9018A70156J4514j8218j0889J9491j5287R55L8196k186j8282J6631m743k8867
9006A61471k3601K5058J7471M2067m012j2492k9686k8204J3034N0174j3231m1667
8994A56382J5646L722l2521J3128k206j6450j1907L319j0686K8360J4576n4236
8982A07127l7546K6521K3725n890l502J3808k7052q042R791J7430O278k8854N807
8969I9601n758o595L7209J0007n627k9843k4475k485q410J2113N130j3140l5564
8956C2163q982P70O693J3008J9877M7198K9796k4566k4442M65j4097p184L4865
$$ y = [463832, 459364, 439217, 430274, 420080, 395359, 401868, 425739, 445200, 445073, 398225, 350775, 318285, 301283, 303589, 275140, 251322, 254734, 248568, 227874, 188310, 184004, 186291, 184079, 142042, 134730, 170156, 184670, 166452, 155563, 175054, 159767, 160722, 198918, 196732, 178450, 195081, 190338, 161471, 137870, 162928, 180399, 222466, 218454, 205962, 176276, 148072, 161106, 211280, 198049, 156382, 172028, 175750, 143229, 156357, 154151, 137701, 125794, 129113, 118427, 146787, 161363, 107127, 69581, 96102, 119827, 113937, 110435, 124243, 97191, 89149, 98940, 116370, 122648, 93794, 99601, 93843, 87248, 124457, 134464, 128837, 98994, 74519, 72034, 63624, 75737, 80867, 67727, 32163, 23181, 23951, 30644, 43652, 63529, 110727, 140523, 115957, 91515, 91980, 77883, 70699, 105564]
8943A05564k8523j1011o183p842K3394M8062P979k5784j5045J3674J1549l7164
8931G8670Q879R053j9318m96j7086j7889J1704n485j2238m345K597J0722j9034
8918B5734j2553j0780M786L3043J1213J4743L0524j3811l9596n156l6342p33N758
8905F830j6119p794J0262L279L564L7772j799j9445J8511k018k4525J0414N63
8892A9495K4835o56j9726j7548M768J5244n984K1261k2028j0686Q417L1309j3600
8879C5101k0289j8775K0993J2762N2187J7467l2119k5269m2824j7498M4001L4219
8867E9956j7546j7016K0307O272q596n574j1750j7837M201J7393j1999j3553k7400
8854b3142n952K3884L3423N584o974p860K22j1055R917J5599k815k3311j1518
$$ y = [105564, 77041, 66030, 59847, 52005, 75399, 123461, 131440, 105656, 90611, 104285, 115834, 78670, 87549, 96602, 77284, 76788, 59702, 41813, 53517, 48032, 35794, 31449, 34046, 44768, 25734, 13181, 2401, 7187, 40230, 51443, 66186, 96710, 82899, 43303, 38147, 1805, 1072, 6830, -9289, -17083, -6821, -3542, 22, 37794, 35995, 16550, 35061, 33043, 8518, 18932, 19495, 44330, 43674, 23948, 6400, 11168, 26412, 20428, 41689, 19661, 8975, 17392, 48701, 35101, 14812, -3963, 17030, 29792, 81979, 99446, 67327, 42058, -766, -18264, 25737, 59956, 42410, 25394, 45701, 51973, 43377, 37803, 26053, 8216, 12417, 29810, 17811, 4258, -23142, -29094, -5210, 28213, 33797, 26823, 18963, 19185, 8130, 18047, 33646, 30831, 7520, -3998]
8841c998n21J8215J4365P969J2576j5828j3971k2828J3572K7139J6814m0406j7727
8828d629L998L407r609K4067R172j4286N778K8392J7583N445j8910k7258k976
8815B0174O912J4661n808J6318k4173p0436N044N2898M107J421M787J1832n606
8802C2131j2722j0574N434J895J3707K597R977k3042k2453j1489Q210j1538j1491
8789b9358L0924j43L341K7451p55p438J3084Q203j5014k7664n470l566J3808r360
8775a957J0291k7966o153n499J4932L7749J7640j5020J654j2399N216j3277j0003
8762d792K152J0936n999k4368k896m253Q269K1532P910K1347r001l6307m082m532
8748b4084o251L9268J0350J8871O857j1031p52O863k6122j4823r138K3074k6783
$$ y = [-3998, -4519, 13696, 28061, 36030, 48606, 32778, 18807, -4021, 9551, 36690, 53504, 13098, -4629, -631, 2776, -6833, 17234, 26406, 12120, 17898, 46290, 63873, 69318, 50408, 23150, 20174, 27086, 41747, 35939, 52257, 28084, -42352, -37308, 15590, 19697, 21118, 25905, 37737, 32131, 19409, 8835, 14269, 16164, 29871, 32468, 42445, 19403, -3050, -14539, -6329, -17867, -29358, 1566, 1423, 4764, 32215, 31460, 24022, 37106, 45309, 30295, 2631, -2839, -6405, 7403, -1957, 8334, -19632, -25785, -31284, -16352, 21397, 39037, 24017, 25671, 13272, 18488, 5211, -4792, -2640, 8296, 2297, -22071, -24967, -29220, -20951, 581, 8491, 29838, 20837, -15470, -19552, -24084, -30335, 8933, 19283, 38154, 45011, 33980, 33228, 40091, 13969, -854, -9992, 13082, -13701]
8735a3701q323J5749M984M256n3133O34L1601K3206J6859N628j6872L766j7907
8722c253N260J2111j8426k1081l828j9926K2085O228J0676J7320J0036N051M194
8709B6447q146M676k8973l8888j8913O225J4284J4614J3296R010J2221k1771k040
8696a7958J3426j4624J9686J5955m46p223n469L17K9364M0734K5849l271j7435
8683G8905p795l7320m4768J263K3694J8375J2153m5264m536k8306M015K6493K6568
8670B3477K0752j1477o562P66p843k0482q969k2872k511J1755l520K1687k397
8657h196j3164L4960L142J6919K6638l0998k6400M14J6981J2172J082l322K506
8644C2734j3483o595K5846J3074m4658k0157M370M721J9511Q667O102j5059K0752
$$ y = [-13701, -22024, -6275, -1291, 2965, -50168, -49534, -17933, 5273, 22132, 27760, 10888, 14654, -3253, 2007, 14118, -4308, -25389, -29217, -49143, -27058, -20830, -10154, 7166, 17202, 22253, 26447, 18301, 22977, -5996, -44884, -63797, -57572, -43288, -28674, -15378, -6368, 5853, -15918, -17958, -4532, -19156, 530, 16485, 16039, 8816, 3347, 3664, 33028, 73762, 99611, 96340, 78905, 71110, 33790, -10978, -9715, 13979, 32354, 44507, -757, -5293, -33599, -29584, -3091, 23477, 44229, 32752, 26190, 26956, 19113, -1369, -10338, -33210, -35721, -23966, -27486, -5799, -8196, -21360, 13600, 16742, 33661, 60299, 29301, 2901, 3315, 20296, 32468, 33550, 30228, 32734, 19251, 12656, 38502, 51576, 6918, -13239, -8869, -4148, 15363, 24030, 30132, 15073, 35825]
8631C5825M710q763k3165r449n035R527M604j9226L918Q863J8916J8885k5696
8618A3914k9489J3041K3097j844M829J9163l2673k3449j3951J1236J6541l6135
8606c5720k5003K3854L3806O801M473q405j7285l24K9898n236l3216o835K3562
8593i630K4279J6078n032k4592k847j3587K367J7689M4943O773o3690l5521K8563
8580a4207K3594K5286K8454m6770l1916Q195j6439k0475P24j5893q133k343J8391
8567e1532P254P942L6122K3450K0856K657j5129l0923o651n660m590j0308K0591
8554e921r510k814J6868L1376J2625o3415k5744K6061K2371J3609j4231K3137
8542B4412L813l1381n582N1656M3221J360k8779l4778Q056J2562l5647j4440L8444
$$ y = [35825, 40535, 31772, 8607, -842, -5877, 3650, 8254, -10972, -7054, 1809, 20725, 39610, 13914, -15575, -2534, 20563, 18719, 23548, 42711, 10038, -13411, -27362, -16126, 415, -35720, -60723, -36869, -3063, 3738, 8211, -194, -17479, -17803, 12095, 6859, -26357, -33192, -9630, 14649, 30727, 25695, 1103, -1744, -15331, -12964, 4725, 49668, 56441, -7249, -42770, -14207, 9387, 34673, 63127, 16357, -15559, -7364, -23803, -44278, -43554, -59447, -67580, -69923, -51532, -44278, -36336, -214, 23236, 44092, 46749, 31620, 697, -5954, -11614, -16204, -26512, -5921, -15431, -18245, -1377, 29999, 42624, -20791, -46535, -20474, 1897, 15506, 1275, 24412, 28225, -3156, -8738, 42918, 86139, 87499, 58720, 23942, 31998, 44560, 8913, -5527, 32917]
8529C2917j0005m69M834k4141J944K5955o052K675j326q713r425m767K7423k0396
8515A0454q122j741j057J9888J237j3096J4417J5979R57k4785j7294N141k005
8502b7p805N226K7556K649k285J149J3010O375K9585L8681l8004l5291j4982k9436
8488c599k5616P056P704n130K2705J5633K5371r552k8842j5209p592J4434n681
8475h318k2637M166J5902r83j6211M835p648M114o706l539R170K1610K3042m174
8461A2623K6695K970l4447n0606M085K9065M937k8743k0770L4835J1210q332k6119
8448d2597j6931j336J3793N421l771K254J2639K4603J8795K799L0661J0262k6986
8435B9606l0735n0693j537l043J4335J7789K0464k1154L1626L7828o682j8084
$$ y = [32917, 22912, 22443, 27277, 3136, 5080, 31035, 24983, 27658, 26332, 17619, 8194, 3427, 30850, 10454, 2332, 591, -466, 19422, 20659, 7563, 21980, 37959, 38916, 14131, -3163, 1978, -27, -7832, -2606, 24950, 27599, 25314, 26463, 39473, 45848, 75433, 114114, 76110, 40819, 25837, -3599, -29215, -22159, -14455, -19585, 3120, 18753, 44124, 34572, 5730, -9479, -17071, -2637, -8318, -30955, -26789, -10887, -11870, -28081, -23246, -30894, -26780, -33486, -37025, -27855, -6245, 16797, 12623, 39318, 42288, 7841, -42765, -38680, -9615, -4678, -33421, -54191, -19356, -8146, -16478, -42597, -59528, -60864, -47071, -41650, -45421, -43167, -30528, -5925, 12870, 15669, 46330, 56592, 29606, -1129, -51822, -53359, -56402, -42067, -24278, -3814, -24968, 6658, 44486, 37804, 19720]
8423A9720J0153J0969j9645l4339j9592J4966o419J14P187j9811j0992j902O452
8410d3139K7375o074J1156K283k251j772r465K0565K5534N706L842j2411r852
8397A1497r868l473k376k6524L0785l276p761j3066j4677o817m006L2841K0663
8384C942J0942k3411p899m584Q597k8438l1177J7572O6985J9293k7494l2150j0244
8371c8066N561o317J6330J3504J7079J5952K0849k6403j7071k0159j055J751k4399
8358d2444n142J783k474L0735J8412k4136k4116J7507K6966M900m0450K831R071
8345b6557J8858J0014J3685O031k1239q990j0569K6489j8466P665K3127j1443
8333H605l1144o980K700R009M200P793J1347p185J811J3617J9166O465N223j9904
$$ y = [19720, 29873, 40842, 21197, -13142, -32734, -17768, -24187, -24073, -16886, -36697, -47689, -49591, -43139, -15764, -21838, -10682, -8399, -10650, -12422, -21887, -1322, 24212, 29918, 33760, 21349, 11497, 1629, -1844, -4220, -30744, 41, -3235, -10996, -24062, -38739, -45556, -49562, -16721, 3942, 14884, -8527, -16426, -21010, -12413, -40851, -72028, -54456, 12529, 31822, 4328, -27822, -38066, -32505, -38822, -22492, -8988, 8091, 24043, 44892, 18489, 1418, -18741, -19796, -18045, -42444, -47586, -45803, -48277, -17542, 870, -23266, -47382, -29875, -2909, 1991, -38459, -35628, -26557, -7699, 2315, 16000, 22031, 792, -8198, -18767, 7722, -10744, -3079, 20048, 8605, -22539, -29519, -26819, -17810, -13610, -5817, 5530, -1655, 156, 13773, 32939, 39404, 44627, 24723]
8319B4723k5279o492L048j517l2581m17L1120R101o72k3001j8716L7203M5811
8306D2331q917m778L6512J4254j1902k3986k5401j966J2251K948P881l7616K0907
8293B2518M027l3401J273Q694L1136n583o026J9828N727j3694l725N587m848L701
8279C5214k887k2301J0919k1331r593j3971K1992K5647j8254p177L5081r032k5609
8266a302j044M165K4648k2257K7701P187l4542j3125j6532Q180j4463l7060K3192
8253d5252J5423L3953J3609J159k6087r362o647l23j4504L0028K1159J4029q197
8240A8988j0416o733N741L9039K1474j4949l6220k5482m428k5640J523N421O700
8227b4982L387Q776L418K5405K966n360J364m003j7192r926O103L706n886k1417
$$ y = [24723, -556, -7048, -4000, -5517, -38098, -38515, -7395, 1706, 1034, -21967, -40683, -3480, 42331, 33414, 28636, 65148, 79402, 67500, 43514, 18113, 16147, 28398, 31346, 39227, 1611, 22518, 26545, -6856, -5583, 3111, 34247, 28664, 22638, 42466, 48193, 34499, 30774, 36361, 31513, 35214, 32327, 10026, 20945, -386, -9979, -23950, -1958, 23689, 5435, -1742, 33339, 24307, -1302, -2346, 1819, 26467, 4210, 31911, 39098, 4556, -8569, -25101, -16921, -31384, -68444, -45252, -29829, 4124, 17733, 18892, -7195, -16557, -23204, -23527, -38031, -8003, 13156, 27185, 18988, 8572, 1839, 7580, 46619, 68093, 53144, 16924, -8558, -12986, -38626, -37103, -31682, -24982, -21595, -12819, -9401, 16004, 18970, 13610, 14974, 10971, -6221, -16147, -10044, -6338, -12224, -33641]
8213c3641J9064K5674J1345q335j0762j0563k5684k4587o346K4726M3196r430
8201e343k3582R786P232L2886j914j3952j6494J654p706j9961N646J6241J2080
8188c427l5300k1192L4241Q225q849L5756p568j8678k1826J3433M6975K0577K6398
8175F8765n770k3289j6252K8431J793l3923l7013k3936q940J1122J7110k3620
8163d5522R499N643L6274K5923k1092O204K0752k8878n1711j2097j6441p12J4944
8150e7214K3037L5715K350Q35q199L178l923m351J0351j4759N183K7415j595l2416
8136a4393l2865Q826Q717P843n914Q648M6536l128j6652J0854m0836l3046J0376
8123d5034K9126L105j6405m453K6846j3084k9412J1613M2066M2203J793k4711
$$ y = [-33641, -14577, 11097, 22442, 14107, 3345, -7218, -32902, -57489, -63835, -39109, 4087, -5343, -28925, -19139, -11907, 20979, 19065, 5113, -11381, -9727, -17433, -37394, -31748, -15507, -3427, -38727, -59919, -25678, -17453, -26302, 9454, 1886, -16792, -38618, -25185, 21790, 42367, 68765, 62995, 39706, 23454, 51885, 53678, 19755, -17258, -41194, -50134, -39012, -21902, -45522, -36023, -30380, 5894, 31817, 10725, 16929, 37681, 8803, -42908, -55005, -71446, -72158, -57214, -34177, 1538, 3888, 4723, -3476, -298, -4221, -8572, 1779, -12980, -7797, 19618, 18023, -14393, -47258, -38432, -29715, -21872, -27786, -19138, 27398, 24270, 7618, 18472, -22364, -55410, -45034, -15908, -12803, -29208, -33661, -6815, -19899, -49311, -37698, 4368, 46571, 48364, 23653]
8111B3653k7087j6459k130N967p065J4659J2702r363l6483k3485l648M752k280
8098f6267K0180L4536L3414J0755R980l345K1303q432n6176l5871J2103j1515
8086c9335M609p882J8324J7689m20O929J0012k3230Q39J5608o35L228K8209k2501
8072A1444l0060K1264j0634n44K0740L0730j0477k6851k4229J1938K6900n20l0247
8059a0546O722L3191l176j6163k2574r860n915j7630j4120J4288K5752J7377n618
8046h272j0917J3614R114m549J5063P843l8598j3317j3944J5669M263j7924j6742
8033e8697r483J1698J7431J2897j8612J4123J2244J3558J3556j503J5736j6094
8021F854k5308l95J0902m591J2867l534l5540Q261J3161k457j4495M8833O977
$$ y = [23653, -3434, -19893, -22023, -16056, -23121, -8462, 4240, -5123, -41606, -65091, -68739, -63987, -66267, -46087, -11551, 21863, 32618, 42598, 39253, 60556, 52124, -4052, -39923, -27820, -39335, -34726, -42608, -24284, -6595, -7015, -86, 9926, -13304, -12465, 3143, 2508, 5736, 33945, 11444, -18616, 2648, -7986, -8530, 12210, 42940, 32463, 5612, -18617, -6679, 20221, 19701, -10546, -3824, 29367, 26191, 10028, -12546, -22406, -28321, -45951, -60071, -45783, -20031, -2654, -8272, -19189, -5575, 3539, -1010, 14053, 21896, -16702, -30019, -43963, -28294, -24031, -41955, -58697, -68180, -56482, -39051, -26154, -44766, -30643, -18399, -4841, 8715, 7212, 22948, 6854, -18454, -18849, -7947, -12538, 329, -3205, -38745, -30484, -17323, -19780, -34275, 14558, 21535]
8008B1535o818N516J0113m42j1026j3585j4374J6161Q775l9052j7250K2516J3109
7995d822J618M169J1771J4478O989k1327j5738N990Q06J7536m304j0681l210L71
7981C646q71j1972K5482j8233J2601j81j2883J735J0350Q129R06k912j823k516
7967A1458m1299J5340L1455l194J5554m171k0996k8794K0858K5420P93j3148J9043
7954B8319l913J3735p392k8623J111j116k3526j3728Q33K5868j8043L353L3612
7941A0490K8821o349Q401j2282j3134l213o931q864N93P195j4066k5095J0012
7928b4422L7470K2677l3716p177P435k672l3671k5706j1755K3098M3234J0489
7916E284r335J2732l289n833M4455j790m7200m2256m4894K2805M0323l122K6800
$$ y = [21535, 14717, 20233, 30346, 29904, 18878, 5293, -9081, 7080, 15855, -23197, -40447, -17931, -4822, -3204, 965, 12736, 27214, 34203, 12876, -2862, 3128, 3934, 21470, 17166, 6485, 3275, 3646, 2775, -9197, 16285, -1948, 10653, 10472, -2411, -676, 9674, 17803, 18709, 15797, 13974, 11458, -29841, -14501, 16954, 13760, 29314, 25143, 4147, -24647, -3789, 21631, 22424, 9276, 28319, 24406, 38141, 30749, 2126, 3237, 2121, -21405, -35133, -34300, -8432, -26475, -23122, 10490, 39311, 32962, 41363, 29081, 15947, 12734, 5803, -3061, -2468, 4727, -9339, -34434, -24422, 13048, 35725, 2009, -5168, 2267, -405, -34076, -59782, -71537, -48439, -5205, 5284, -4051, 8681, 5392, -441, 44014, 42224, -4976, -47232, -92126, -69321, -28998, -32120, -5320]
7903e320K6611K3763K060m712k831k0937n164K9229m153m502J987J3490j3268
7890C6253l1716m3489m381n34M743J2846J8244J9720K4671P620j5108n234k6156
7877b521l543j9636k7615j1370K6448M2535r039j9161N102l1149L947k8048K7385
7864d6665L7348J7348j9665M499L045J3395J1016j1836L053J8711m134K188J121
7851B9424j0532j2610m0110J1934K9157Q99J0135N024J503j8748j787M2782M961
7838E2032j9824j9308k1378j0082j7490j906j4023Q770J2446J4382K9199j0218
7826B600j639M3160K0150n0305l134J353K515l380L047O141Q866o46M872p581
7812B6019j6329j5242k7j6367j1092J4175J839K8922L9991k4787o191r277M133
$$ y = [-5320, 21291, 45054, 47114, 42402, 39571, 18634, 13470, 42699, 38546, 34044, 36031, 49521, 36253, 4537, -38952, -43333, -43867, -39124, -26278, -8034, 11686, 36357, 43977, 28869, 23635, -2521, -6064, -25700, -53315, -64685, -38237, 4298, -4741, -23902, -18800, -49949, -46002, -74050, -46665, -9317, 8031, -11634, -7135, -4090, 9305, 20321, 8485, 11538, 30249, 26115, 28303, 29424, 18892, 6282, -33828, -21894, 7263, 8162, 18297, 23321, 24824, 6076, 4289, 47071, 52032, 32208, 12900, -8478, -18560, -36050, -37956, -51979, -43209, -30763, -16381, 12818, 2600, 961, 44121, 64271, 13966, 10832, 12185, 14700, 11320, 14367, 20508, 29374, 28728, 33600, 26019, 9690, -5552, -5579, -21946, -33038, -18863, -17024, 11898, 51889, 27102, 20911, 11634, 15767]
7799A5767p908Q330J7024N566J290J6624j0194l6952p780J514l0402j5259J2483
7786b9897p687q607J3364L6903R915k1693k7314K8708L5322k2340j1837J3974
7774H811j7994m3287K838J6563N97L385K8725j4697k7716j0252J4707j1988j1864
7761f2172K4047L2081r394j2446J5865m050o18R902q08L671l736j8659J0816K6199
7747A0698j7651j0947J8865L200k0660j5252O78o529P992q512M659K8672R979
7734E192k0407k548J2943J9834J2204j8130K114K4044J9520j5891m3108K2996
7722A8763m870n2979l0223N4686K5299l7018j8593J1036n612o910J4112L3177
7710H68l0613j5967q623M175r415j46J3784L0770K2708Q349l1642k0594Q59L353
$$ y = [15767, 7859, 16189, 33213, 38779, 40069, 56693, 46499, 9547, 1767, 3281, -27121, -42380, -29897, -37584, -46191, -32827, 4076, 13991, -7702, -35016, -6308, 29014, 6674, -5163, 8811, -9183, -52470, -49632, -33069, -32472, -29087, -362, -15059, -42775, -53027, -38320, -50308, -62172, -38125, -6044, -15438, -27884, -12019, -16069, -16687, -6785, -7593, -3922, -7658, -26317, -15501, 10698, -6953, -17900, 965, 4165, -16495, -31747, -31069, -37598, -29606, -38118, -33459, -4787, 5192, -15215, -17763, -4820, 15014, 27218, 9088, 11202, 35246, 54766, 38875, -4233, 18763, 13893, -39086, -69309, -14623, 10676, -26342, -44935, -33899, -39511, -46421, -32309, 868, -29745, -45712, -54335, -50160, -59575, -59721, -45937, -15167, 7541, 15890, -15752, -36346, -35487, -32134]
7696c2134m337K5827J2927j6191r840J4830j3519J1268O728q802r015J4676j9097
7683b6679k2525j2904J075L9325j3127M813K4026J1067l9058j2628k7092k5879
7671i9586p022M0199M9385K1684k768n425M217k981M862P38m465M52l905j7904
7657b2519j4846K8559K9021l211k7729j9729p298N143L3279K7349L036p134q317
7644A5604n499J5481j813k6636j8594j3901j5302j3663K7760L58K182j1741L2154
7631a3610o54j54l483j3816L6357j772j1153k2956k1873M200J0902J6945l0083
7618e1150j6180J1712J1318J1353j005K8927j3266K284q528r915o173j6486Q788
7605d8321L1805L7m865P862J5428k8474r81J2467J575P392J7093O379q463j0879
$$ y = [-32134, -36471, -10644, 2283, -13908, -23748, -8918, -22437, -11169, -4441, -13243, -22258, -7582, -26679, -49204, -62108, -61033, -21708, -34835, -30022, -5996, 5071, -33987, -46615, -73707, -99586, -106608, -66409, -17024, 4660, 1892, -3533, 684, -2297, 2565, 3303, -1162, -710, -4615, -22519, -37365, -8806, 20215, 17004, -10725, -30454, -37752, -32609, 670, 28019, 31055, 23921, 15604, 10105, 25586, 23773, -2863, -21457, -35358, -50660, -64323, -36563, -36205, -34023, -45764, -13610, -14264, -14418, -17901, -31717, 4640, 2868, -8285, -31241, -53114, -48914, -38012, -21067, -51150, -67330, -55618, -44300, -32947, -33952, -5025, -18291, -16007, -24535, -34450, -40623, -57109, -48321, -16516, -16479, -21344, -13482, 1946, -26528, -27509, -15042, -13467, -6075, 11018, 17397, 8934, -1945]
7591a945K5372k4808J5058L62K681j1815j9391K513L39k2338Q914L2901r766J4687
7577A2764l277l6644l6865K4819J3918O806J0411K9297J2790j897l9425J3896
7565F593M644j3581r331k9130k490j612l0102P818K8616J6530J372P805K4509
7552A1641J3545j7410N753L138o932l9637j3832J0577J5550k5496M889L3571o68
7539e311k5275O976J3427j7411r905j4279L5776J3927K4470J8733n795l041R731
7526D2023K4836j7671l0364j261m601l2847k9127p19K6294K8784n674j0051L863
7513f515q263j2069k320K4775R137j1533k2021J6803L3230j2552j9171k401k1455
7500c4355R764J366J009o340q41j2818J8920J578P324J833j1395j0697J6024J7128
$$ y = [-1945, 23427, -1381, 13677, 14039, 16720, 4905, -14486, -11973, -11634, -33972, -25058, 7843, -1923, 12764, 9487, -27157, -64022, -39203, -25285, -18479, -8068, 21229, 34019, 32122, -7303, 6593, 11237, -2344, -11675, -40805, -43295, -44907, -75009, -67191, -38575, -22045, -20673, -12868, 11641, 25186, 7776, 13529, 16667, 9735, -29902, -43734, -33157, -17607, -43103, -38214, -4643, -5311, -30586, -23610, -10183, -27594, -37499, -51778, -16002, -2075, 22395, 41128, 35333, 32292, 42023, 66859, 49188, 18824, 17563, 12962, -19885, -49012, -49731, -23437, 5347, -327, -10378, -6515, -14778, -26847, -29167, -4392, 4745, -6788, -28809, -12006, 21224, 8672, -10499, -12900, -34355, -24591, -23225, -22216, -28556, -29397, -42215, -23295, -21717, -14393, -12560, -23955, -34652, -18628, -1500]
7486a500k1166k2619K1708j957j5125K1738O928n786k4418J584M1943K7694p783
7473B1241P995n7j6075n0000j0569J3987K7949K3719q808l475j1962j8859J7152
7460g762M3676J0197j0273m6238o909L4388j2911J474R383N032O109K488P71l6125
7446f700J4413k1596l1317m223j7329P676K3111j842k425J5041O797j2673k5199
7433e6266P332O840J860J0052r218J0685j5584k1187J8086K7771k3429o107K3551
7420b5614n205K3560K4435j2035j5015J4037J5687K5991L993k5388j8844L739
7408I341L33L7848L1598j3602k5996L516q087r805j5316j3013j3789Q801R512
7395A341P371j2124M858P638m229j4961j1024j3438J4258N8266p38m9661m5645
$$ y = [-1500, -22666, -45285, -23577, -25534, -40659, -18921, -11993, -17779, -42197, -40613, 1330, 29024, 21241, 29236, 29179, 13104, -36896, -47465, -33478, -5529, 18190, 9382, 5907, -6055, -24914, -7762, 35914, 46111, 35838, -10400, -17309, 17079, 4168, 5642, 15025, 20057, 26166, 28654, 29425, -6700, 7713, -13883, -45200, -49423, -66752, -59076, -35965, -37807, -40232, -25191, -18394, -31067, -56266, -48934, -42094, -40234, -30182, -39400, -28715, -44299, -65486, -47400, -19629, -43058, -49165, -25614, -30819, -7259, 17176, 5141, -9874, 4163, 19850, 45841, 49834, 24446, 5602, 9341, 9674, 47522, 79120, 65518, 39522, 43038, 34951, 25146, 9830, -3183, -16972, -8171, 1341, 8712, -3412, 1446, 9084, 4855, -10106, -21130, -34568, -20310, 37956, 37218, -12443, -58088]
7382e8088j187K6674K2657l158L567j9184L026J0211J217J152J4375j9682j5689
7369c4109n322O579O441K3019k3315r430J3709%L744L7916j5841j3772m95J3739
7355B863k349J27l1450P678J5938L157p470j9460J537K4005j6951m0085Q28K2311
7341c9321J3548K0326J8781p07j4515k7928Q740P735M799R314K628k5053J524
7328b0129K6139p277j0050O599O635J5240k779j3885j2412N21L1039J7771l4784
7315B628m846m192l3230K9259Q975k7122K355l628O356J3855O188k520p615j944
7301a5481k0503J9434M3871K1274J2521r801m0847j1638J090m0610j2550K7949
7289b5291j5336j1066L533K8061J2094k573j8485j0126J658k8919l101M358J0907
$$ y = [-58088, -59275, -32601, -9944, -13102, -9535, -28719, -25693, -15482, -14265, -13113, 1262, -18420, -34109, -39431, -32852, -26411, -3392, -26707, -36137, -22428, -22428, -18684, 19232, 3391, -10381, -10876, 2863, 514, 641, -30809, -23131, -7193, -4036, -11506, -30966, -29429, -5424, -22375, -62460, -61632, -39321, -25773, -5447, 13334, 12627, -1888, -29816, -21076, -13341, -8542, 772, 3400, -21653, -20129, 6010, -1267, -11317, -4718, 1917, 17157, 14378, 493, -11919, -11398, 19641, 37412, 2628, -2218, -6410, -39640, -10381, -1406, -28528, -26173, -29801, -23445, -9590, -3402, -5922, -13537, -15481, -35984, -16550, 27321, 48595, 61116, 51315, 10468, -1170, -80, -40690, -53240, -25291, -40627, -51693, -48160, -20099, -8005, -10578, -29063, -39189, -37531, -66450, -69551, -65193, -54286]
7276e4286K4174L0770q254k8606J2829J8049k2927r545l112K5407j5348m917P705
7263b8061K5091L557j3327m44J3136J4165m668j3404j3811m349k9642j4568K1354
7250d4971K7495L063j8244j2455n510L247J0179Q559L3491J9096q705o369P539
7237A6415J5847L277p4r240J006n4480o855L7255J3456m463k5459k7362k9713
7224g0390O839L2169k7305O728K5890L4902k193l4522k39p723J6287L8602R341
7211B8386j3758j7234k4347K756j1335Q622k314L950K2524J4521j2042J9579K2804
7198D2112m4944k9716r794p72N4958n104j3981r688o647j356Q726R087j343L052
7184e410J0336q398J65N175q865J8923L694l6109k3632J6610J5523K8515O904
$$ y = [-54286, -30112, 658, -7596, -36202, -23373, -5324, -28251, -37796, -40908, -15501, -30849, -35766, -28061, -2970, 587, -12740, -13184, -48, 14117, 9449, -3955, -17766, -22115, -51757, -66325, -44971, -17476, -14413, -32657, -45112, -50622, -47375, -37196, -28637, 4854, 23950, 15245, 8876, 16415, 32262, 35539, 35465, 26225, 27231, -27249, -34104, 3151, 16607, 12144, -13315, -40677, -70390, -63551, -31382, -58687, -51959, -26069, 8833, 6640, -27882, -28121, -35844, -19557, 19045, 28386, 14628, -2606, -26953, -24197, -35532, -26910, -29224, -25274, -2750, 11771, -271, 19308, 42112, -2832, -32548, -42342, -43114, 11844, 6740, -7241, -16929, -23576, -24932, -16206, -7119, -8462, -5410, 4926, -3472, -3307, 1868, -6997, 11926, 15620, -20489, -44121, -27511, -11988, 16527, 23431]
7171B3431j8579j2241k0647p160J5583j130j1405K7828L859k4525j282J5138k7061
7158c8191J7761M955K4759l2427j5362J3236R495K1582L260J805j2446j4690R989
7145f274L2930j9205K316K659q879j2977r196k409J5045L4154O724k2040j4422
7132a574j003j096r762L642l905J2378P799J047p363r380L2k4943k77K9941K0203
7117A5739l249m628j1130J2784K4576k7452k4672N82P144o214m409j995J1515
7104a1409j3964m0245K321P525m767p376L1740K6403J6458J733P007k853o176
7091F397l692j9756L193R851k401j2310J2092K0431L759k2203p535k7567j7203
7078e6944O890K4703n50J9744R142K0667L129j7310k3030L8667K655k5119j0839
$$ y = [23431, 4852, -7389, -28036, -35196, -19613, -20743, -32148, -4320, -461, -24986, -26268, -11130, -38191, -20430, -15475, 9284, -23143, -38505, -25269, -15774, 5808, 9068, 10873, -1573, -16263, -6274, 26656, 7451, 9767, 12426, 3547, -9430, -18626, -21035, -5990, 28164, 34888, 12848, -1574, -2577, -3673, -13435, -9793, -13698, -1320, 6479, 7526, 163, -9217, -9185, -34128, -34405, -4464, 15739, 12490, 7862, -3268, 9516, 34092, 6640, -18032, -17450, -10306, -16520, -20929, -22924, -11409, -25373, -65618, -63297, -55772, -60539, -67915, -36175, -9772, 6686, 8419, 15426, 12573, 6397, 2705, -17051, -13858, -4007, -6408, -18718, -6626, 13805, 17564, -4639, -12174, -39741, -56944, -50054, -25351, -25901, -6157, 2985, 23652, 26781, 9471, -13559, 25108, 27763, 2644, -8195]
7065h195J4216K5981j0990m4316j791j7638K062K7931L286J3772j2072m9071j8713
7052g5538K7901O0215n771j1588K6597O468m3574n431J5517J3768J6971k6958
7040a423j7105o28l594l2086K699O569Q981l2212K4080K3238n342k2380j2737
7027f1940O936O039J1317J1811J5309R960j7833K1290Q241k8394J9831J0962O531
7014B0060j2472m1j2869K4739Q284p169j9247k2982j1890K799J7793J668L1353
7001B0026Q341l7198j8277K1486j5053M527p805k5360J6655P033j1163k137K7475
6988a1450J2148m337o368Q198n668K7020L257k3087J7631J6139k7108m2059J8071
6975a7613K8832j9210O665K7611P467j7424j1658k3728p049k7537k60M661K1099
$$ y = [-8195, 6021, 32002, 21012, -23304, -25095, -42733, -40671, -12740, -9454, 4318, -7754, -56825, -75538, -47637, 12578, 6807, -4781, 21816, 28284, -15290, -20721, -5204, 8564, 25535, -1423, -18528, -19156, -22750, -54836, -52137, -45568, -36587, -68799, -44719, -21481, -26823, -49203, -61940, -55004, -48965, -37648, -25837, -10528, -568, -18401, 2889, 11130, -17264, 2567, 13529, 20060, 7588, 7547, -5322, 19417, 27701, 20532, 1285, -21697, -33587, -30788, -12995, -11327, 20026, 28367, -8831, -27108, -5622, -20675, -16148, -23953, -49313, -32658, -25625, -36788, -38925, -11450, 698, -3639, -10007, -1809, -7477, 19543, 22800, -287, 17344, 33483, 6375, -35684, -17613, 11219, -7991, -1326, 26285, 33752, 16328, 4670, -19058, -26107, -53644, -53904, -49243, -28144]
6962b8144P635j3456J027q53K2152J9578J0002P812J0J625j5014N748N085J2840
6948C6047J5227r345j816J2905k2131q322k1116Q854J2899j1309M531l929O966
6935A9461j1650r759J0741k6251p822k2607k1377L5923L2919Q901j513P736k3895
6922i193J3821l5447m0595j1235J9404J9355j524j0441J8242j9508j1519O443
6910f2197J9730O149j48K5929j8429k6575K0987R212p227P738J0427R58J4517
6897A071N1706K6606j7753l2705k5796k4896n991N2475K1677N028j3835Q892Q515
6884E4994l1032l815j7664k5582j2750J9003J704j410L793L8437J8406j8882l8128
6871a2926l1130j6336J3763k3479n099M5478N1039k1932m5055j8120K2215R544
$$ y = [-28144, -20509, -33965, -32938, -33791, -11639, 7939, 17941, 25753, 25763, 27388, 12374, 18122, 23207, 36047, 51274, 41929, 40113, 53018, 30887, 22565, 1449, 10303, 23202, 11893, 16424, 12495, 19461, 7811, -1948, 8793, -17458, -25280, -47887, -69264, -33341, -422, 8479, 6966, 14702, -9193, 4628, -30819, -71414, -82649, -63245, -43890, -45414, -55855, -37613, -57121, -68640, -62197, -42467, -36318, -36466, -10537, -28966, -55541, -34554, -25342, -32569, -24831, -14404, -13446, 1071, 52777, 79383, 61630, 28925, 3129, -21767, -27758, 24717, 46394, 51422, 37587, 46479, 54994, 23962, 20147, 2483, -23099, -35849, -16846, -15142, -16552, -12759, 25678, 44084, 25202, -12926, -44056, -60392, -46629, -70108, -75207, -29729, 21310, -622, -45677, -63797, -41582, -32038]
6859c2038N0173K1262p844q224j5812o887K9160Q723k0031l8668J1990K5876j3623
6846D057l1654j5340P280R336R940R631j7377l8069N283N2207L3665K58j6091
6833A3126P54J8323K14q979k2053j1421P245m679o192o755Q046j2461P096K6511
6819H775R949n949k3159N228l696J9289L606l808j1244J1486R337k757K1136P251
6805D5444r435j9472n975K2423j4151k6191o550J5670O423k2188J8372R979k0742
6792f393L89J7133j5653j9077L957L537m972J3484p296j3725j8500L6005M5610
6779C4499o792k0769R425P062j5579r618k8423j0611J8821K8565j7791k2898O848
6766b7261P47J5210J2896l2272l792P570o439L0700J4830J7529R544l4463k4041
$$ y = [-32038, 18135, 39397, 31553, 23329, 7517, 630, 29790, 38513, 18482, -20186, -8196, 17680, 4057, -27597, -42937, -35657, -26321, -16381, -6750, -24127, -62196, -56913, -4706, 28959, 29217, 13126, 13880, 32203, 32417, 23438, 1385, -10036, -2791, -7470, -13662, -20417, -12371, -24832, -17736, 8775, 18724, 12775, -10384, -5156, -8852, 10437, 14043, 10235, -1009, 10477, 19814, 17057, 38193, 45444, 36009, 16537, 10562, 32985, 18834, -7357, -13907, 1763, 8186, -14002, 4370, 14349, -6393, -6004, 11129, -4524, -23601, -19644, -16107, -21079, -7595, -14891, -28616, -47116, -11111, 34499, 27707, 6938, 16363, 23425, 7846, -1772, -30195, -40806, -21985, 6580, -11211, -34109, -27261, -26514, -11304, 1592, -30680, -34472, -26902, -33341, -2641, 12189, 29718, 39262, 4799, -19242]
6753a9242K4530k1082K6479J5380j7757P195J3297j0057k8490j1518j1505k1543
6741e4313K8056M0369Q140k0899k0292l5787L045L7083K3890J576O926J1443J9423
6728D8660j404k5414l4704J633O428k2802k0611k1039j5218j1664O7L1453N4006
6715a0609L5835N728M010j8448R097R439q361n5986k5388J075K6629M4660K085
6702A9766l7057o269K4659j734j0881l5178l434K3919O762M481K4206J6879M238
6689C0357j2478q699j9373Q47L9726l163J283o554N830K2853o904j3995J5949
6676D5679n044j1056J5228O086j4783j7831j9668O088K4565j649j151m7258j435
6663b2229J2790R095k381k658K3891J6183J237k65J4752k2339n1579j1169k2304
$$ y = [-19242, 5288, -15794, 10685, 26065, 8308, 15503, 28800, 18743, -9747, -21265, -32770, -54313, -26257, 14112, 22252, 1353, -18939, -54726, -51681, -14598, 9292, 10868, 17794, 29237, 48660, 47256, 21842, -12862, -11229, -4801, -27603, -48214, -69253, -84471, -96135, -96068, -64615, -10609, 25226, 30954, 34964, 16516, 25613, 35052, 26691, -29295, -54683, -53608, -26979, 17681, 19766, -17291, -23560, 1099, -635, -11516, -46694, -50128, -26209, -19447, -14966, 9240, 26119, 30357, 17879, 9180, -10193, -9346, 30380, 27217, 28500, 21946, 27776, 50629, 43725, 29730, 45679, 40635, 29579, 44807, 50893, 36110, 18279, -1389, 4699, 29264, 27615, 26464, -20794, -22229, -9439, -344, -2725, -5383, 18508, 34691, 35928, 35663, 50415, 28076, -23503, -34672, -56976]
6650e6976Q962L0363j8204J5627J2553k4992J592j271O175J6093m54J2565k2235
6637b0202l215j788j4328j5882L6159M5202J3157l510l7232j7301N3606L8319
6625G2985J206l879l7410n468j0749L5526j4904q478J9227N486J4987M3853M4870
6612A57252M5870K3427Q3720J80118K64343N42792R22819Q44425j57001r98062
6602A909703q69373m17133k03736r7174q5571m7644m9219l9934J2567L588j4612
6591A01462k3277k8904J2682j100J5518R716M196J5507j0568m0605k8292j1392
6579A4943J3602J2129m2905k4338n533J5865K4176K1425L682p724J4548j2279
6567B7591k0604k553K0919K3397O852k2560k1855l1208j2710J1045n184j1130
$$ y = [-56976, -48014, -17651, -35855, -20228, -7675, -32667, -31075, -32346, -26171, -10078, -10532, 2033, -20202, -23417, -25205, -39533, -55415, -19256, 25946, 39103, 35593, -1639, -18940, 34666, 72985, 74191, 70312, 32902, 27434, 16685, 52211, 37307, 28829, 48056, 53542, 68529, 112382, 157252, 203122, 226549, 310269, 490387, 754730, 1297522, 2220341, 3064766, 2907765, 1909703, 1040330, 623197, 419461, 322287, 236716, 189072, 139853, 99919, 112486, 116074, 101462, 78185, 49281, 61963, 60863, 76381, 86097, 90293, 105800, 95232, 54627, 26335, 14943, 28545, 40674, -2231, -26569, -32102, -16237, 7939, 29364, 33046, 25322, 39870, 27591, 6987, 4434, 25353, 48750, 55602, 33042, 11187, -20021, -32731, -21686, -26870, -38000]
6555c8000Q383M0861l666K015j4574k0401J6437j6895j5128n318K3754k394j895
6542b6821j5195J2824K3807J4158J772j2327j955j5843j7929J7048J9290M307
6530C136r915n641J4711K0285k8031K856K5016j5023r158k7399J5389m878j5022
6517c3674K0483j9649m920n112K0472j3858j0462j5076j2090J4899K4355J516
6505c3116q165J0855Q221K9501k8778q882P578j1920J8442J7150J240K5398P714
6492C5238j0593j8045k9449m778K9151j1386N23L600j1028l2567J6023L7348L889
6479G926j0784P640J0063r957j8684K3174J5348L966M643k313j9792p347k7991
6466b4108J3613l473m5351j7048J4786P000L0193M4996J1357l9075l9909j5950
$$ y = [-38000, -29617, 11244, 7578, 9593, -4981, -25382, -8945, -25840, -40968, -46286, -22532, -24926, -26821, -42016, -29192, -5385, 8773, 10545, -1782, -3737, -19580, -37509, -20461, -1171, 3136, -6779, -12420, 2291, 22576, -5455, -2599, 22417, 7394, -1764, -29163, -13774, -18652, -33674, -13191, -32840, -37760, -42872, -22400, -36258, -46720, -61796, -73886, -58987, -34632, -33116, -41281, -30426, -22205, 7296, -21482, -30364, -22786, -34706, -16264, 886, 2126, 27524, 35238, 24645, 6600, -22849, -27627, 1524, -9862, -9339, -5739, -16767, -49334, -33311, 4037, 7926, -2858, 4782, 14845, 4888, -13796, 9378, 24726, 28692, 33335, 31022, 11230, 3883, -24108, -10495, -13968, -59319, -76367, -61581, -54581, -24388, 20608, 31965, -7110, -47019, -62969]
6454f2969M1308K2920N628n395j9297k6054j1428J8524K5977n576J4562K7031
6442B5231n392o431l9051L193M2477P231j5230j3340M653Q827j4125O527O750
6429A1320j1401K6333M510l7493m4401N801j9939O809K2343J0528m195K3323L4633
6416B8171j8173l8477M787J2342n891J6456K4054N410j8189K164m0095J5999K1876
6403A0434M1104n518k3709k2763k6420n958j2864q266K3481L957j4785L8995J3061
6390A0749j3609k0506K3503o607n367Q664M495L593N003K0854M482J1820k0197
6377B6877j3438k7480J1208O1477J9920j7826j3561j5507j7631j7076J4446J8232
6365B9641j7712p550l0923J1558L4838J7555R280j1420J4933j028q608R334j8452
$$ y = [-62969, -21661, 1259, 6887, 1492, -17805, -43859, -55287, -36763, -10786, -16362, -1800, 25231, 19839, 13408, -25643, -22450, 20027, 27258, 12028, -1312, 3341, 12168, -1957, 4570, 11320, -81, 26252, 30762, -6731, -51132, -45331, -65270, -58461, -36118, -25590, -29785, -6462, 28171, 9998, -28479, -23692, -11350, -17241, -785, 23269, 28679, 10490, 12654, -27441, -11442, 10434, 51538, 46020, 22311, -452, -26872, -32830, -45694, -53960, -30479, -26522, -41307, -2312, 10749, -2860, -23366, 137, -6470, -11837, -3173, 1322, 4915, 9918, 30772, 35254, 47074, 26877, 13439, -14041, -2833, 58644, 78564, 60738, 47177, 31670, 14039, -3037, 11409, 29641, 11929, 4379, -26544, -14986, 19852, 37407, 46687, 35267, 50200, 49172, 40564, 49898, 31446]
6352C1446l5839k6322J7996J7243K6448k7326K190O764P288l2493k859J7296J1674
6339A3506j0307j7020o269j4585j7083J3226K8016K063P470K3380p346j3592j8041
6326a6582K2414R656j5398R445p689N630q080k1930l1530n982M952M80j1469J361
6312f4722L5687K4763P046j4526M482O063j4272M01r05K3311j551q254K4430J9358
6298D1311k0659l2772R673J4261J1337k7566j5150K0784j2464N035J7131j6186
6286e265L29j7667n765J5118l028m740M7410K7188J5933j2158k3356O404j9830
6273B0573m3833l7841j1209K9946K0993l675J1804j065k3418J2719j4497j5163
6261e4666J1519K5796R288R764J0539J456j4545r524J0904j2375k2513L506j7665
$$ y = [31446, -4393, -30715, -12719, 4524, 30972, 3646, 5836, 12600, 19888, -12605, -15464, 1832, 13506, 3199, -13821, -20090, -34675, -51758, -38532, -10516, -8453, -983, 22397, 15051, 1459, -16582, 5832, 15488, 90, 9535, 1846, 7476, -604, -22534, -54064, -60046, -55094, -54614, -66083, -64722, -29035, -4272, 2774, -11752, -7270, -1207, -15479, -15078, -15983, 7328, 5777, -2477, 21953, 41311, 20652, -12120, -2447, 11814, 23151, -4415, -19565, 1219, -11245, -6210, 10921, -5265, -4936, -22603, -28368, -13250, -16278, -21018, 26392, 53580, 69513, 57355, 33999, 40403, 20573, -23260, -61101, -72310, -42364, -21371, -25046, -13242, -14307, -37725, -25006, -39503, -54666, -43147, -17351, -8063, 1701, 12240, 13696, -849, -10373, 531, -11844, -34357, -30851, -48516]
6248d8516K6854O363k8611l2810K8775N505J46L349J1200k8475J7788K0877j127
6235a8682j4069K1199K0886K3481O750k1311j7943J1495k4638j2683n349K3363
6223g501L7442k0040m0303n682j8606K1041J3981L0188J4757l6827q629J0104
6211a0075P639J0879J1942k3483k5166j044N920l291R563R290L256q450N830L937
6197c253N905N5178M872j6248J7614l3806j4160J483k220j1099n676L088q267
6184f589K8155K1548k6310j7891J3909L7400L7827l0354l2020r338o490K355J436
6171A3638L0472n287k9864k0078k2205k4906J5603J9830K184J5350K8497m05j9964
6158B865k4887N459L0302Q00l154J6731j9009o308M348j187o346J3922L7816Q999
$$ y = [-48516, -21662, -15299, -43910, -76720, -47945, -42440, -42294, -38945, -27745, -56220, -38432, -17555, -18682, -32751, -11552, 9334, 32815, 39565, 18254, 311, 11806, -12832, -25515, -30864, -7501, 29941, 9901, -30402, -36084, -54690, -33649, -19668, 10520, 25277, -11550, -20179, -10075, -2436, 8443, 20385, -3098, -28264, -29308, -23388, -26679, -17116, -7826, -4570, -13020, -7190, -3253, 2652, 57830, 62702, 46454, 64068, 30262, 16102, 17585, 15365, 4266, -1410, 1678, -6589, 21566, 43114, 16804, -1087, 12822, 50222, 88049, 57695, 25675, 16337, 9847, 12202, 13638, 44110, 38823, 8959, -11119, -33324, -58230, -42627, -22797, -20613, -5263, 23234, 22829, 2865, -22022, -16563, 13739, 14539, 11385, 28116, 9107, 2799, 7147, 5960, -386, 13536, 51352, 60351]
6144F0351j0819o2983o1287j6775L0214L4550j3863n011K7000n802k6792L97j9659
6131g0479k634J1358J5781J7797J4466N245R787j756q231r877k44Q79M040L7442
6117B3574K5068j3663J8967k0106j6712R949l4914j9558J611l511M3750J6819
6105C1274K109n211k0944r532Q910k3228k1435K3856n179J0950O274o027L49j9383
6091b7217m08J44k7481k1804L0988j7611N895K8179K5596o653j7313J6629K1568
6078A0512J6988k8140k4154J1060J2522R667j6567L072K269q65J3650J1796o003
6065A5807l3352j5687J1801K220k0208j0849J7512J6745M064J6955P866J5904
6053B8778j3032j663l574L71j9734o200O245R175R627q634q070J4353r671j827
$$ y = [60351, 49532, -13451, -74738, -91513, -61299, -26749, -40612, -45623, -18623, -24425, -51217, -50820, -70479, -73113, -61755, -45974, -28177, -13711, -8466, 1321, -435, -8666, -18543, -18787, -17908, -13868, 23574, 48642, 34979, 53946, 33840, 17128, 27077, -7837, -27395, -25784, -29295, 14455, 31274, 33383, 28172, 7228, -2304, 6606, -16622, -38057, -14201, -19380, -8430, -2156, -8183, -7834, -27217, -27625, -27481, -54962, -76766, -45778, -63389, -57494, -29315, -3719, -10372, -27685, -11056, 10512, 27500, -640, -24794, -13734, -1212, 8455, -8112, -5040, -2771, -3636, 10014, 21810, 15807, -17545, -33232, -21431, -19211, -39419, -50268, -32756, -16011, -11947, 5008, 12874, 28778, 15746, 14083, 10509, 10880, -8854, -15054, -8809, 366, 9993, 1359, -6711, 7642, -2029, -3856]
6039c856n629l3266j6633N2974M4139j5842k2429j1201j1075o788n355k3572J8418
6026d0115J9093J7839J4200m357m63k9174r518J7569j0370J5003j6487o832J6
6013c3596p967J2045N7633P904k8968o663J5199J919l2609j9951j2578L1762o492
6000b2362Q038q09p439O918J8482J6577M6706J1733l6503j3831j4634q19K4192
5987C6249j3052j9922j8716k926J5268J0777K0072j6681o026O071L91K844j2636
5974A713J9989N985N336p875k0435R952l9554k7947j3308N565J5380j309K1308
5961b5200M0926N744J0225K6861L054l3239k0437j087m926J0144K2424j6448k0888
5948b847j3475p887K0686n6k8455j3002J015Q363J204J4365j6665L3944J7385
$$ y = [-3856, -9485, -42751, -59384, -6410, 37729, 21887, -542, -11743, -22818, -29606, -34961, -58533, -40115, -21022, -3183, 11017, 6660, 6197, -22977, -32495, -14926, -25296, -10293, -26780, -33612, -33596, -41563, -29518, 28115, 36019, 7051, 388, 15587, 17506, -15103, -35054, -47632, -15870, -22362, -14324, -15133, -22572, -15654, 2828, 19405, 66111, 77844, 41341, 27510, 12876, 12057, 36249, 23197, 3275, -15441, -18367, -3099, 7678, 27750, 11069, 5043, 11114, 11505, 14349, 1713, 21702, 27687, 33023, 25148, 4713, 14665, -24889, -52836, -66144, -60579, -45199, -46508, -25200, 15726, 21470, 31695, 58556, 61610, 28371, 7934, 6847, 1921, 12065, 34489, 18041, -2847, -16322, -24209, -3523, -3579, -32034, -45036, -44021, -35658, -34454, -20089, -36754, -2810, 14575]
5935A4575j988m367k7153M0284R392n034j4331Q734k0780k1130k0533L370K902
5922c6059O05J20J0353j758K6808p99k2265O254L3727M983l1274O725J4041J6078
5908B7539K0556k6692j785m012n239K4049O787j0540k2153M857j7752K5352N743
5895B6710L238m165J3249j3498q025q003k214L411q468k8360J0493O849n138L206
5881a0715P008J8167o372m212k68k0779j554M87K1672j1091J894L2065P753j4925
5867A9130j9468n930K023M1938j056k3681j0667p924K767j1954O842j022j0519
5854a9521K2671k7994M0743n827K486j20p356k7260l5761p050j1502k76L1268
5841d5499K9303j576R730j758j5975J5656L4984l06l853J4K701k3518k9205M261
$$ y = [14575, 12587, 8220, -18933, 21351, 30743, 25709, 11378, 20112, -668, -21798, -42331, -38961, -36059, -35454, -35334, -24981, -26739, 69, -730, -22995, -16741, 16986, 21969, -9305, -2580, 11461, 27539, 48095, 21403, 19618, 15606, 10367, 34416, 41203, 30663, 8510, 13367, -4385, 20967, 26710, 29948, 25783, 39032, 25534, 17509, 9506, 7292, 10703, 2235, -26125, -15632, -8783, -13921, -10715, -3707, 14460, 8088, 3876, 3608, -17171, -18725, -18238, 3434, -7657, -5763, 26302, 34055, 19130, -338, -6268, -4245, 37693, 36637, 12956, 2289, -5635, -2868, -14822, -7980, -9002, -19521, 3150, -24844, 15899, 10072, 12558, 12438, 5082, -22178, -57939, -64989, -76491, -76767, -45499, -16196, -17772, -8042, -9800, -25775, -10119, 24865, 24559, 20706, 20720, 23421, -97, -29302, -25041]
5827b5041n659J5073L0269k1637j5980l670r767j1260K7097J8439N505j5220R556
5814b295J1536k3109j9633K4637K9697P051j1613K4326o920k8699q000K1287k0948
5801b683k919q013l3105n100J7935J1026L3402o739j0717j936R89j3096K0820
5788a36p673L435O014J0276k4586l4582Q124L6758J9407m3241l9618K2161J7640
5775b6021k2347J7965J6132k5331P488L2095o207j134p250j895J3271J1707J0952
5762A9425j1726j2725R154R997m553M975K708M469j0025n094J4762K1146k824
5749C9689J5332r367n336j3742L825K2452M985J9020j9182k6647k2924j9110J2564
5736A559n322R841Q719m579j7783k0072j8744O888L344Q844K0938k2070o774K9329
$$ y = [-25041, -30700, -15627, 14642, -6995, -22975, -26645, -36412, -47672, -20575, -2136, 3369, -11851, -2295, 9241, -13868, -33501, -8864, 20833, 27884, 16271, 40597, 33677, 4978, -3022, 18265, -2683, -5602, -13615, -46720, -51820, -33885, -22859, 10543, 3804, -6913, -8849, -7860, -20956, -136, -7809, -4374, 1640, 11916, -12670, -47252, -39128, -2370, 17037, -26204, -65822, -43661, -26021, -48368, -30403, -14271, -39602, -32114, -19, -6226, -7360, -14610, -16505, -3234, 8473, 19425, 7699, -5026, 4128, 14125, 9572, 14547, 17255, 21724, 11699, 6605, 21367, 42513, 39689, 55021, 45654, 40318, 26576, 30401, 52853, 57838, 76858, 57676, 31029, 8105, -11005, 1559, -3763, 6078, 14797, 10218, -7565, -27637, -46381, -39493, -36149, -27305, -6367, -28437, -35211, -5882]
5722e882J2627k646k3217o30j5010l8243o516K5461L1637M168j3637j2395k004
5709d6287P302J0110k2206j6330L9045K7431j5279l653J0975j4489q306J1225
5697b0462j5301J7635R833L50J6243q731L0432P074j9060j4571q890J2897k621
5684D828K7007k5730k6123k2863O010J6852j596j1677L7425J0683m4454J2597
5672a7041J8630P748O815l910K907j4743J059J7178K73k0213j49J8881J064k183
5658A6316l728L6968J0427j7479k5113J3409J4736j0344r453j648k4070l829l9067
5645d2875o718L3742J6510J0695l013K1836K4416k3161l7181j577M868J1166k969
5632E739K7586K594l9588m4551J6759J772K3273J9249r001l497j6212l1382J3907
$$ y = [-5882, 6745, 4099, -19118, -19748, -34758, -73001, -79517, -54056, -22419, -18251, -31888, -44283, -46287, -38985, -28875, -51081, -67411, -28366, -935, -16214, -19867, -8892, -23381, -31687, -20462, -35763, -18128, -8295, -7945, 8298, -433, 29999, 37073, 18013, 3442, -5448, 7449, 4828, 31835, 6105, -20018, -42881, -36871, -20019, -21615, -33292, 4133, 14816, -29638, -17041, 1589, 9337, 16152, 12242, 15149, 406, 1465, 18643, 18916, -1297, -1446, 17435, 18499, 16316, 12588, 49556, 59983, 42504, 17391, 30800, 45536, 35192, 25739, 24091, 21, -3808, -42875, -49593, -15851, 659, 11354, 8341, 30177, 54593, 31432, -5749, -7326, -2458, 8708, 5739, 33325, 35919, -3669, -48220, -31461, -29689, -6416, 12833, 3832, 335, -15877, -47259, -33352]
5619c3352J1120k023j3131O906q402k6186J0866L1317o68P242m312J0652M767
5606e204K0206j7648l4563k9601k291P797j3027o442J9200J7781Q048j29J2111
5593b3762K4932K9068N727l403k1973m745R117l54o10j5132j8783R596R363r313
5579a0272P086R654J359l645j9494J5595k0246j0015P424M4830L1230l3510q840
5566A1156p748k0841M64j7270k022L34J8509J2107L989R401K5841k3652j7035
5553f767P895K1067K1283K3793j1605m1952l126j3631L927k023l8975n750K1433
5540b4431R142J5922j2110L315R158o201j4348J183L9521n988j8668r662M519
5527h648K2380J0296J1319k4802O43m303j0435M013q578k831p787k7212L16L1496
$$ y = [-33352, -22232, -24255, -37386, -30480, -38882, -65068, -54202, -22885, -23553, -16311, -20623, -9971, -5204, 15002, -2646, -37209, -66810, -69101, -61304, -74331, -80773, -61573, -43792, -35744, -35873, -23762, 1170, 30238, 35965, 32562, 10589, 5844, 14961, 14607, 13997, -1135, -19918, -10322, -959, -10272, -3186, 6468, 7827, 4182, -15312, 283, -19963, -29978, -22554, 22276, 53506, 19996, 11156, 3408, -17433, -16969, -34239, -36261, -35927, -17418, -5311, -1322, 8079, 33920, 10268, -6767, 1128, 22195, 43478, 67271, 55666, 13714, 10588, -3043, 884, -1139, -40114, -45864, -24431, -15289, 633, -11477, -8162, 996, -5205, -19553, -18370, 21151, 15163, -3505, -13167, -8648, 13732, 24028, 35347, 10545, 11188, 6885, -3550, 463, -8115, -10946, -18733, -45945, -45629, -14133]
5513a4133M13k6904J9887M316j9081K376P299J5825q60Q876J5148k2156P80K1457
5499A3243J060K03M433k8328k1536j5789K0981J8009p880J6814J2106J591k4956
5486a0049o306K7222p994l9619J9467R380J112j0023l609q877j2928Q768K1799
5473a1657M389k863j309r0j9514J2655J882J6617J0404j6787m591J4651R201M912
5459A7900j1663r12n681l8215l7144J2326K5705J4475J4923Q928P112M767J1026
5446B3547j725K548P965j2969k2061l0562K888K8412p193k5329K5970Q320M571
5433D382L2542o966n956j7339j0111n23J1274r855o916L6146R491J1314L809k2948
5419B8344m7009O117J0378J5395r646L131p473K8j2577j882J3421J5145j0040
$$ y = [-14133, -13720, -40624, -20737, -16421, -35502, -33126, -25827, -10002, -10862, -1986, 13162, -8994, -8214, 13243, 14303, 14506, 18939, -9389, -30925, -46714, -25733, -7724, -15604, 1210, 13316, 14907, -10049, -16355, 10867, 2873, -36746, -17279, -7899, -6787, -16810, -20419, -29296, -42224, -33456, -11657, -7268, -10131, -11440, -11530, -31044, -18389, -16507, 110, 10514, -6273, -10864, 3787, 12988, 17900, 6237, 5325, -356, -38571, -75715, -63389, -37684, -23209, -8286, 642, 7754, 12521, 23547, 21822, 24370, 32335, 19366, -2695, -33257, -30369, -1957, -9150, -34479, -8509, -189, 4382, 36924, 29958, 24002, 6663, -3448, -3971, 7303, -2552, -9468, 26678, 36169, 47483, 51292, 28344, -18665, -12548, -2170, 13225, 3579, 6710, -763, -735, -13312, -15194, -1773, 13372, 3332]
5406C332K7781Q835j7462k164L9369l444o0244k5675J4487K3144L225k9519q0
5393a8415J768J805J537l867j6723J0182J060M96J5024J8102J5106n096j1433
5380I546j7347j650N8778K779n7542j5708J9766O122m505Q476M216j3461k2726
5367b3256p940Q030k8183j2899N885n712J1683K5384L1515k252j7114L4700K6838
5354D6679o202k0790K0347J7101j1396l0600Q393J9409j6007m1613k3380L751
5342c4308M868k1393J3135J7469j7516P926M2080J4764j6346j4435j5550R563
5330i743M103r67j5520j8462K2961J7134j8645l7762J0798j5915J5935J9493j145
5317b7735o154K3769R935K0576J7051J7121n976j9538l4484k8095J7867J7668
$$ y = [3332, 31113, 39948, 22486, 20322, 59691, 56247, -3997, -29672, -15185, 7959, 11184, -18335, -18415, -16647, -14842, -13305, -17172, -33895, -23713, -22653, -22157, -7133, 10969, 26075, 20979, 9546, -7801, -9451, 49327, 52106, -5436, -21144, -1378, 4744, 239, 8715, 12931, -530, -23256, -31196, -23166, -51349, -64248, -58363, -64075, -52392, -27008, 4507, 2255, -14859, 19841, 46679, 40477, 19687, 40034, 57135, 45739, 15139, 23532, 42941, 26934, -14679, -38059, -34308, -29440, -50833, -37698, -20229, -37745, -29819, 12261, 27025, 10679, -3756, -19306, -9743, -5640, -6607, -22127, -40589, -17628, -494, -19139, -56901, -46103, -62018, -46083, -26590, -27735, -33889, -10120, -185, 20391, 37442, 54563, 48587, 29049, -5435, -33530, -15663, 2005]
5305B005J5131K1981O312l0587j1498L717J878J8689J1028j0596l8708j2549q16
5292b4013p110l616K0588M9404p768j3932j1261j3997r892k6717r096K0171J8876
5279a8363L1223l396r540J749j9751j2289j9197p989k038R806R184R380K659k6972
5265e5534L705Q677J8305P471K7272J5509j3155q186n401o316O28J1077J805J312
5251G169J2801j694m3941p68j0635P540J9895Q498R268o357n742J626J1805J539
5237A1004k2584j039K867k5183m92N286J9157J2836O46j3816K2630J6728n2607
5224b4567l112M570l8094L7907K8467O539j3359K677K0304j4696Q994j650R032
5211B3012p008o926j3865l5524J0604j1918j172J5475P028M7051L1994n170k1477
$$ y = [2005, 17136, 39117, 45429, 14842, 3344, 7061, 8939, 27628, 38656, 28060, -10648, -23197, -24013, -31123, -34739, -14151, 35253, 27485, 13553, 2292, -11705, -21597, -48314, -57410, -37239, -18363, 12860, 9464, -76, 1673, -18078, -30367, -49564, -57553, -59591, -49785, -40601, -31221, -28562, -55534, -51829, -43152, -24847, -17376, 9896, 25405, 12250, 4064, -1337, -7653, -7025, 4052, 5857, 7169, 19970, 18276, -25665, -26433, -37068, -29528, -9633, -1135, 8133, 1776, -3966, -2340, 9465, 11004, -11580, -12619, -9752, -34935, -35427, -30141, -10984, 1852, 2498, -11318, 11312, 28040, -24567, -27679, -23109, -61203, -23296, 5171, 11710, -1649, 1028, 21332, 6636, 15630, 13980, 23012, 16004, 9078, -4787, -40311, -29707, -41625, -42797, -27322, -20294, 26757, 58751, 53581, 32104]
5198C2104k7778j4001Q13O051J6162o626k173J0916k0163k6252L0321K8315M900
5185C2589J4355j725j7859j1625k5853J1358M027M246o152P420J5428l8568L0327
5172A7968K7560k6030j1960J1843R408j5798M722j4130K5091o485k7705p830J6488
5159C142K2174k2844P883O376j0049q118L1304J590j6718j2780j2771k3698L648
5146c0861K0583J084j2440j4963o048J7295J3579j276N142M642O265N378j7697
5133i317k4592j8711J1081K3156P61j0581j7188J4022L0698J9415R72J7122J5765
5120E2603j8973m8032o1153n793K8085L0044N2608K5371l1619k5343L1j0930J1383
5107a718l39l1934R141M0149m652j3080K838J1264J7633q748m975K0091j6942
$$ y = [32104, 4326, -9675, -8862, -2811, 13351, 6725, 4552, 15468, -4695, -30947, -626, 27689, 32589, 46944, 45219, 27360, 15735, -10118, 1240, 5267, 9513, 3361, 10781, 26209, -12359, 17968, 45528, 19498, 7538, 19381, 28789, 12991, 17713, 3583, 28674, 22189, -5516, -13346, 3142, 25316, 2472, 10355, 16731, 6682, -1436, 29868, 31458, 14740, 1960, -10811, -34509, -30861, -10278, -9194, -21634, -36597, -42645, -25350, -11771, -13047, -7905, -3263, 3002, 8380, -9317, -33909, -52620, -41539, -18383, -17622, -28203, -45391, -31369, -671, 18744, 19716, 36838, 52603, 33630, -14402, -75555, -81348, -53263, -23219, 29389, 54760, 23141, -2202, -2171, -13101, -1718, -2057, -33991, -24850, 15299, 10647, -2433, 405, 11669, 29302, 20554, 15579, 35670, 18728]
5094A8728J030J3012j7139l9760K12J4012k2266j6411k0757K53L748k938J7055
5081e1221R517P026J7474J8833l116J0847j7942M966N8158J4818n1968l1913J9395
5068D874j3214n0809j2880J2337K7333j1112p533Q865K228J1034K0639l1433m0407
5055h0078l3671K2068L6327J7932K8729j4600L2O123k4757N0706J2168R138o492
5042B3625j4432o013K361j3729K0730l276R598J1098p290R41j1525p303N284j6154
5028f085J0556J1995n623r593j3728p504J5421J5953J3792O145j7383r296J7423
5015B2073J1105m5352k3347J5827J0972q001m172j2160p773J1936K8373J8740
5003A8221j1721J2085K5106j3250j3665J4122P29j605q558k4300p08p10j0177
$$ y = [18728, 19758, 32770, 15631, -24129, -23917, -9905, -32171, -48582, -69339, -69086, -65338, -68276, -51221, -41704, -34678, -17204, 1629, -1487, 9360, -8582, -3616, 54542, 69360, 17392, -14521, 4874, -8340, -59149, -72029, -59692, -32359, -43471, -51004, -42139, -39911, -28877, -8238, -39671, -80078, -113749, -91681, -55354, -37422, -8693, -23293, -23261, -17138, -41895, 8811, 20979, 30117, 23625, 9193, 3180, 5541, -8188, 12542, 9266, 18864, 29962, 22672, 23613, 12088, 4785, 10069, -6085, 4471, 16466, 10843, 1250, -12478, -19982, -4561, 11392, 25184, 31329, 13946, 4650, 22073, 33178, -12174, -35521, -19694, -8722, -16723, -20895, -33055, -40828, -28892, -519, 18221, 6500, 18585, 43691, 30441, 16776, 30898, 31627, 30022, 21464, -2836, -3544, -4254, -14431]
4990a4431R248q693L3353J593o558r778r489M016L3241l141k091J3060m3028K656
4976d2K312k116j8136k2824J2803o551k9155J9610r989j5588J6898L8517K7530
4963A3269R071j7584j9402J4636j9741O451K6815k5811j8232M801n74J6108R984
4950b09J3990j318k520j6835k153Q929r308j870K5171k1467j0958N242J9281J3919
4936A9894n151k2574l773o480M121L498K78l307m5009n217M732J6410K8855J2140
4922a583q417j1178L3605k329L422J119J1018J4580j4980j4580M3236J5446k1295
4909D8064n1793j7886M368k159J7752K3477P083m108R813k859r077k3920k7727
4896b8972O076p852J322J1738J280j2690K078J0225L615k252k1439L257Q909J5463
$$ y = [-14431, -5183, -13876, 19477, 21070, 14512, 4734, -4755, -739, 32502, 29361, 27270, 40330, -2698, -42, 2270, 154, -17982, -40806, -28003, -34554, -63709, -44099, -54088, -69676, -52778, -14261, 13269, 22340, 4756, -14646, -10, -19751, -13300, 13515, -12296, -30528, -25727, -26301, -10193, -209, 13781, 12463, 9943, -6892, -9045, -116, -9424, -11294, 13877, -7590, -18548, -13306, 5975, 19894, 14743, -7831, -11604, -18084, -13963, -10465, -10187, -13494, -58503, -63720, -58988, -42578, -13723, -1583, -10000, -21178, 12427, 10098, 13520, 14639, 25657, 40237, 25257, 10677, 53913, 69359, 48064, -3729, -21615, -17247, -19406, -1654, 21823, 28906, 24798, 34611, 31752, 22675, -1245, -28972, -22896, -30748, -29426, -17688, -16408, -29098, -27020, -16795, -13180, -15432, -36871, -33614, -24705, -9242]
4882i242J77j0339J3120N134n695R530J2592j0604j9898K3118j528j0957O123
4869A531j9694l0955N9M2917j292m719k606R897O177Q507r9j3198k5469k10p789
4854c6943J1367K8894k291n007L637l697K666M823J2293k409r966k4017O379l034
4840a7305j9457K8736M5801o775l660j2998p643P62J617K5773l500p571k5507
4827a727j2044K1228L0649K157q038N652k1583o041L0088O632j048j2893k1898
4814A1134k4760j2120N03J1751J8484l2775j7562j5292r063K4819K026l6545Q891
4801g0509P812k3577J6440L7248K4262r540K0790M3907k4442k7153j628r091l448
4788a8929k6768K0098M4610j137k2335K708k0535l7100N105K6142K933K6387K1025
$$ y = [-9242, -9065, -19404, -6284, -1150, -6845, 2685, 15277, 4673, -15225, 7893, 6365, -4592, 1531, -18163, -49118, -49059, -6142, -7434, -12153, -14759, -4862, 1315, 9822, 9723, -3475, -28944, -29154, -36943, -25576, 3318, 1027, -3980, -343, -4040, -1374, 3449, 15742, 13333, 3367, -20650, -14271, -17305, -36762, -8026, 37775, 31000, 27340, 14342, 6699, 7461, 9078, 34851, 31351, 23780, -1727, -13771, 7457, 38106, 40263, 32225, 37877, 16294, 10253, 40341, 46973, 45925, 33032, 11134, -13626, -25746, -25243, -13492, 4992, -27783, -45345, -60637, -69700, -44881, -42855, -79400, -70509, -62697, -86274, -69834, -32586, -8324, -17864, 2926, 46833, 22391, -4762, -6390, -15481, -18929, -45697, -25599, 19011, 17874, -4461, -1753, -22288, -59388, -54283, -28141, -25208, 1179, 22204]
4775B2204J7509j814k7131l145M375K4922K745m721j8575r149J6833K0527o020
4762C8560r922r313j3151o492k3499J5949J1292j7357J0385J9782K6936P13J1836
4749E5719J0842j1808l1931m953m76j1294j1994q919L0861P033J2675j7210j9637
4736a092J2444P233J8869K408j8209m8008l2210K5498J5921P185K8989j1760j8619
4723a1351O744k6786m839m545J1475K9512J522P852j0211J5951M935L812J0990
4710C5061J3077k7331k4103L290k958O651K526N021q15j6746k2201L247r240q628
4696d3149J6019L4747R377j33J431O341j8473k0094J8422K444K1062K890k0206
4683A0678j6203O875J0527l48j2675j5777j2119j431l72K4759N6226j3766l4672
$$ y = [22204, 39713, 37899, 10768, 7623, 11998, 36920, 39665, 34944, 16369, 7220, 24053, 44580, 38560, 28638, 19325, 6174, -318, -23817, -7868, 3424, -13933, -3548, 16234, 43170, 43883, 55719, 66561, 54753, 22822, 17869, 17393, 6099, -5895, -14814, 16047, 23080, 35755, 18545, -1092, 11352, 18585, 37454, 39862, 21653, -26355, -58565, -33067, -17146, -9961, 19028, 7268, -11351, -4607, -31393, -36232, -40777, -29302, 210, 1732, 9584, -627, 15324, 20259, 24071, 35061, 48138, 20807, -3296, -6, -2964, 3687, 6213, 11234, 10419, -6327, -28528, -25281, -34521, -43149, -27130, 7617, 16994, 16861, 18292, 24633, 6160, -13934, 4488, 6932, 27994, 30884, 10678, -5525, 1350, 11877, 11529, -1146, -16923, -29042, -30473, -30845, -6086, 50140, 36374, 1702]
4670A702J7008L1665O317q076k2698j0850k8034j350P868j709N694Q428q004j9321
4656b1360l2198Q060K979j3366J9667J2497K841J9806K7951j2398j558k120K1702
4643C2503K9191J4707k0817j0777j8703l3664j753K0807J5791j9407k4534j0935
4631b7591J9301K1979J469l7427k274j0161N149K082q002j5537k7322K3987L5963
4618a8384L0293K0743M824P046l3972k7499R320J6774j237n174j6812k0152J7258
4605a6972K273l632J4058j2602j3118o32J6388k07j1133Q350M813n909k4306N731
4591c6898Q300n958J2653K8146J2698J1542j797l5514J2248q691j1197j3149L126
4578b4491L4250l43P863p097k0045l562k3092J7658J0282j5545j0827P760L4843
$$ y = [1702, 18710, 50375, 56692, 48616, 25918, 15068, -12966, -14316, -6448, -8157, -2463, 5965, -2039, -21360, -53558, -45498, -42519, -55885, -36218, -23721, -20880, -1074, 26877, 14479, 12921, 10801, 32503, 61694, 76401, 55584, 44807, 26104, -7560, -9313, 11494, 27285, 7878, -16656, -27591, -8290, 13689, 15158, -22269, -24543, -34704, -29555, -27473, -35475, -51012, -78334, -54347, -18384, 11909, 32652, 37476, 44522, 10550, -16949, -7629, 9145, 7908, 2734, -14078, -34230, -16972, -14699, -18331, -4273, -16875, -29993, -30625, -14237, -14444, -25577, -17227, -12414, -18323, -42629, -36898, -28598, -34556, -21903, 6243, 18941, 30483, 28686, -6828, 5420, -3271, -14468, -27617, -24491, 9759, 9416, 17279, 10182, -9863, -13425, -36517, -18859, -8577, -24122, -34949, -27189, 7654]
4565G654M192k8967L118k625Q263J4414k085K597k795J294K9658k4079j8909J1829
4551C559l441j5737L161K3805j4856N085K5511Q851q086K7992j9686m0663j3162
4538a7667p02K8720J4689J9773K12j5263j4797l1772o704Q769K5155K1761R408
4525D1582r627j770m46k939j1468j7873J0332J4350j4213K7563M4940j4167m0345
$$ y = [7654, 11846, -17121, -14003, -16628, -8365, 6049, 3964, 6561, 3766, 5060, 34718, 10639, -8270, 3559, 118, -15619, -12458, 11347, -3509, 1576, 27087, 35938, 27852, 55844, 36158, -4505, -17667, -18369, 10351, 25040, 44813, 45025, 29762, 14965, -16807, -23511, -14742, 10413, 32174, 41582, 31955, 30185, 29739, 26800, 15332, -2541, 7791, 22141, 7928, 35491, 80431, 66264, 25919]
$$ [...]
##END NTUPLES=NMR SPECTRUM
##END=
