##TITLE=Analysis number 325639
Compound Code km 03152
Book Reference 23018
Project Code adrs fraglib
Chemist Name jom
##JCAMPDX= 6.0         $$ Bruker NMR JCAMP-DX V2.0
##DATA TYPE= NMR SPECTRUM
##DATA CLASS= NTUPLES
##ORIGIN= Bruker BioSpin GmbH
##OWNER= nmr
$$ XWIN-NMR		Version 3.5
$$ Fri Jan  5 14:22:54 2007 GMT Standard Time (UT+0h)  MAYBRIDGE\nmr@NMR_250MHZ
##.OBSERVE FREQUENCY= 250.131544655141
##.OBSERVE NUCLEUS= ^1H
##.ACQUISITION MODE= SIMULTANEOUS (DQD)
##.ACQUISITION SCHEME= undefined
##.AVERAGES= 16
##.DIGITISER RES= 18
##SPECTROMETER/DATA SYSTEM= dpx250
##.PULSE SEQUENCE= zg30
##.SOLVENT NAME= DMSO
##.SHIFT REFERENCE= (INTERNAL, DMSO, 0, 16.522)
##AUDIT TRAIL= $$ (NUMBER, WHEN, WHO, WHERE, WHAT)
$$ ##TITLE= Audit trail, XWIN-NMR		Version 3.5
$$ ##JCAMPDX= 5.01
$$ ##ORIGIN= Bruker BioSpin GmbH
$$ ##OWNER= nmr
$$ C:\u/data/dgb/nmr/ADRS/550/pdata/1/auditp.txt
$$ ##AUDIT TRAIL=  $$ (NUMBER, WHEN, WHO, WHERE, WHAT)
(   1,<2007-01-05 14:22:29.75 +000>,<MAYBRIDGE\nmr>,<NMR_250MHZ>,
      <created by zg, POWCHK disabled, PULCHK disabled
       configuration hash MD5:
       49 4B E0 1D 92 C2 6B 37 9F E6 65 BC 52 41 86 1D
       data hash MD5: 64K
       4F E3 04 9D 5F 56 31 E4 B9 5B 6E B5 F2 3D A3 89>)
(   2,<2007-01-05 14:22:44.03 +000>,<MAYBRIDGE\nmr>,<NMR_250MHZ>,
      <Start of raw data processing
       ef LB = 0.3 FT_mod = 6 PKNL = 1 SI = 32K 
       data hash MD5: 32K
       C1 56 3F 9E C9 FA C7 08 00 95 54 7C 7C 8B 99 46>)
(   3,<2007-01-05 14:22:45.69 +000>,<MAYBRIDGE\nmr>,<NMR_250MHZ>,
      <apk 
       data hash MD5: 32K
       C8 E5 15 5D C8 D3 A0 D9 20 E6 16 F9 87 87 48 AE>)
(   4,<2007-01-05 14:22:46.47 +000>,<MAYBRIDGE\nmr>,<NMR_250MHZ>,
      <abs ABSG = 5 
       data hash MD5: 32K
       2A F9 05 35 C2 A4 84 50 CB 39 34 2D 80 A1 09 32>)
$$ ##END=
$$ 
$$ hash MD5
$$ BC 8C 46 62 74 47 F9 BA 9D 5A AF 3B 53 6B 8C 36
##$RELAX= 
##$RELAX= 
##$RELAX= 
##$RELAX= 
##$RELAX= 
##$RELAX= 
##$RELAX= 
$$ Bruker specific parameters
$$ --------------------------
##$DU= <C:\u>
##$EXPNO= 550
##$NAME= <ADRS>
##$PROCNO= 1
##$TYPE= <nmr>
##$USER= <dgb>
##$AMP= (0..31)
100 100 100 100 100 100 100 100 100 100 100 100 100 100 100 100 100 100 
100 100 100 100 100 100 100 100 100 100 100 100 100 100 
##$AQSEQ= 0
##$AQ_mod= 3
##$AUNM= <au_zg>
##$AUTOPOS= <55 >
##$BF1= 250.13
##$BF2= 250.13
##$BF3= 250.13
##$BF4= 250.13
##$BF5= 500.13
##$BF6= 500.13
##$BF7= 500.13
##$BF8= 500.13
##$BYTORDA= 1
##$CFDGTYP= 0
##$CFRGTYP= 5
##$CHEMSTR= <none>
##$CNST= (0..31)
1 1 145 1 1 1 1 1 1 1 1 1 1 1 1 1 1 1 1 1 1 1 1 1 1 1 1 1 1 1 1 1 
##$CPDPRG= <>
##$CPDPRG1= <>
##$CPDPRG2= <>
##$CPDPRG3= <>
##$CPDPRG4= <mlev>
##$CPDPRG5= <mlev>
##$CPDPRG6= <mlev>
##$CPDPRG7= <mlev>
##$CPDPRG8= <mlev>
##$CPDPRGB= <>
##$CPDPRGT= <>
##$D= (0..31)
0 1 0 0 0 0 0 0 0 0.06 0 0 0 0 0 0 0.0002 0 0 0 0 0 0 0 0 0 0 0 0 0 0 
0 
##$DATE= 1168006948
##$DBL= (0..7)
120 120 120 120 120 120 120 120 
##$DBP= (0..7)
150 150 150 150 150 150 150 150 
##$DBP07= 0
##$DBPNAM0= <>
##$DBPNAM1= <>
$$ [...]
##$SUBNAM7= <"">
##$SUBNAM8= <"">
##$SUBNAM9= <"">
##$SW= 20.6930455092707
##$SWIBOX= (0..15)
0 0 3 0 0 0 0 0 0 0 0 0 0 0 0 0 
##$SW_h= 5175.983436853
##$TD= 65536
##$TD0= 1
##$TE= 294.16
##$TE2= 300
##$TE3= 300
##$TEG= 300
##$TL= (0..7)
0 120 120 120 120 120 120 120 
##$TP= (0..7)
150 150 150 150 150 150 150 150 
##$TP07= 0
##$TPNAME0= <>
##$TPNAME1= <>
##$TPNAME2= <>
##$TPNAME3= <>
##$TPNAME4= <>
##$TPNAME5= <>
##$TPNAME6= <>
##$TPNAME7= <>
##$TPOAL= (0..7)
0.5 0.5 0.5 0.5 0.5 0.5 0.5 0.5 
##$TPOFFS= (0..7)
0 0 0 0 0 0 0 0 
##$TUNHIN= 0
##$TUNHOUT= 0
##$TUNXOUT= 0
##$USERA1= <user>
##$USERA2= <user>
##$USERA3= <user>
##$USERA4= <user>
##$USERA5= <user>
##$V9= 5
##$VALIST= <valist>
##$VCLIST= <CCCCCCCCCCCCCCC>
##$VD= 0
##$VDLIST= <DDDDDDDDDDDDDDD>
##$VPLIST= <PPPPPPPPPPPPPPP>
##$VTLIST= <TTTTTTTTTTTTTTT>
##$WBST= 1024
##$WBSW= 4
##$XGAIN= (0..3)
0 0 0 0 
##$XL= 0
##$YL= 0
##$YMAX_a= 310679
##$YMIN_a= -314190
##$ZGOPTNS= <>
##$ZL1= 120
##$ZL2= 120
##$ZL3= 120
##$ZL4= 120
##$ABSF1= 16.522
##$ABSF2= -4.171173
##$ABSG= 5
##$ABSL= 3
##$ALPHA= 0
##$AQORDER= 0
##$ASSFAC= 0
##$ASSFACI= 0
##$ASSFACX= 0
##$ASSWID= 0
##$AUNMP= <proc_1d>
##$AZFE= 0.1
##$AZFW= 0.1
##$BCFW= 0
##$BC_mod= 0
##$BYTORDP= 0
##$COROFFS= 0
##$CY= 12.5
##$DATMOD= 1
##$DC= 0
##$DFILT= <>
##$DTYPP= 0
##$F1P= 14.0000005364418
##$F2P= -0.99999901652339
##$FCOR= 0.5
##$FTSIZE= 32768
##$FT_mod= 6
##$GAMMA= 0
##$GB= 0
##$INTBC= 1
##$INTSCL= 1
##$ISEN= 128
##$LB= 0.3
##$LEV0= 0
##$LPBIN= 0
##$MAXI= 10000
##$MC2= 0
##$MEAN= 0
##$ME_mod= 0
##$MI= 0
##$NCOEF= 0
##$NC_proc= -4
##$NLEV= 6
##$NOISF1= 0
##$NOISF2= 0
##$NSP= 0
##$NTH_PI= 0
##$NZP= 0
##$OFFSET= 16.522
##$PC= 1
##$PHC0= 217.2581
##$PHC1= 5.115045
##$PH_mod= 1
##$PKNL= yes
##$PPARMOD= 0
##$PSCAL= 4
##$PSIGN= 0
##$REVERSE= no
##$SF= 250.13
##$SI= 32768
##$SIGF1= 0
##$SIGF2= 0
##$SINO= 400
##$SIOLD= 32768
##$SREGLST= <1H.DMSO>
##$SSB= 0
##$STSI= 32768
##$STSR= 0
##$SW_p= 5175.98343685301
##$SYMM= 0
##$S_DEV= 0
##$TDeff= 65536
##$TDoff= 0
##$TI= <Analysis number 999999
Compound Code 99
Book Reference 9
Project Code 9>
##$TILT= no
##$TM1= 0
##$TM2= 0
##$TOPLEV= 0
##$USERP1= <user>
##$USERP2= <user>
##$USERP3= <user>
##$USERP4= <user>
##$USERP5= <user>
##$WDW= 1
##$XDIM= 32768
##$YMAX_p= 523750279
##$YMIN_p= -294695
$$ End of Bruker specific parameters
$$ ---------------------------------
##NTUPLES= NMR SPECTRUM
##VAR_NAME=  FREQUENCY,     SPECTRUM/REAL,   SPECTRUM/IMAG
##SYMBOL=    X,             R,               I
##VAR_TYPE=  INDEPENDENT,   DEPENDENT,       DEPENDENT
##VAR_FORM=  AFFN,          ASDF,            ASDF
##VAR_DIM=   32768,         32768,           32768
##UNITS=     HZ,            ARBITRARY UNITS, ARBITRARY UNITS
##FACTOR=    0.157963299565203, 1,           1
##FIRST=     4132.6476996994, 0,             0
##LAST=      -1043.33573715361, 0,           0
##MIN=       -1043.33573715361, -294695,     0
##MAX=       4132.6476996994, 523750279,     0
$$ Real data points
##PAGE= N=1
##DATA TABLE= (X++(R..R)), XYDATA
$$ [...]
17587A03976O676o2201m2071q2101j10958P908j19K1315j160j4123Q3228Q9701
$$ 103976 110652 48451 6380 -75721 -186679 -178771 -178890 -157575 -158735 -172858 -89630 71
17575G1N4044j3532L1100p3138J1799K7943o4633m9960N0145K0251n1073J8231
$$ 71 54115 40583 71683 -1455 10344 38287 -26346 -76306 -26161 -5910 -56983 -38752
17563c8752J319P3949R3475p6761p105J3951l2164J6670j8503r9280n7698J9776
$$ -38752 -37433 36516 129991 53230 46125 60076 27912 44582 26079 -73201 -130899 -111123
17551a11123R3612J22560q4363j3610N0534Q760q6694o0879o81L7040r533K3377
$$ -111123 -17511 105049 20686 7076 57610 66370 -20324 -81203 -81884 -44844 -54377 -31000
17539c1000M1391K3215j2216j6343J3877p1312n671K2826L8996Q8600r880k1266
$$ -31000 10391 33606 21390 5047 18924 -52388 -58059 -35233 3763 92363 82483 61217
17527F1217Q224l7807r248j2550r3883j00789R608O8443P8185N0031l5260m0332
$$ 61217 69441 31634 22386 9836 -84047 -184836 -175228 -106785 -28600 21431 -13829 -54161
17515e4161j10635N1146k5314L0048Q3168K0119J6473j15866K3178N7613K7513
$$ -54161 -164796 -113650 -138964 -108916 -25748 -5629 10844 -105022 -81844 -24231 3282
17504C282L5235j8882L4155q495o5829K4776m892K0182N8014N3692n9780l2877
$$ 3282 38517 19635 53790 45295 -20534 4242 -650 19532 77546 131238 71458 38581
17492C8581n202l0808l0980l0480L6441J7725M6003m8347l9989L3504N371j6894
$$ 38581 33379 2571 -28409 -58889 -22448 -4723 41280 -7067 -47056 -13552 -8181 -25075
17480b5075N7923K6284n6447j15403L1536R3100M924m3564K1480l4087P5227R2591
$$ -25075 32848 59132 2685 -112718 -81182 11918 16842 -26722 -5242 -39329 35898 128489
17468A28489J5426J4946o5148n4109o5482l3685J2261K3332K6789J805K0388N581
$$ 128489 143915 158861 93713 39604 -25878 -59563 -47302 -23970 2819 4624 25012 30593
17456C0593m6161l474M6582j6930l2390k8593k3683q078L124N0225k0894p0833
$$ 30593 -15568 -19042 27540 10610 -21780 -50373 -74056 -82134 -79010 -28785 -49679 -120512
17444a20512J7652Q9645J9161m5193m7265O2629K5366K0468l0439l0005j3054
$$ -120512 -102860 -13215 5946 -39247 -86512 -23883 1483 21951 -8488 -38493 -51547
17433e1547q576P3766O018L193P0535M7428j8013j435n4734m2876r924n0179Q556
$$ -51547 -60123 13643 19661 22854 93389 140817 122804 121369 66635 23759 13835 -36344 -27788
17420b7788p4579q420N867O252p807K0955K5985M6067k2645o9624O0143N1821
$$ -27788 -102367 -110787 -104920 -98668 -106475 -85520 -59535 -13468 -36113 -105737 -45594 6227
17408F227q4525o4654K0993N6813O4173n6269j7427K7919K5808N2320N5366k7983
$$ 6227 -78298 -142952 -121959 -65146 -973 -57242 -74669 -46750 -20942 31378 86744 58761
17396E8761j4699m2210L0541K57m4590l5721R4727j7088q8529L9895J5527j6929
$$ 58761 44062 1852 32393 32650 -11940 -47661 47066 29978 -58551 -18656 -3129 -20058
17384b0058j9643l6048N0026j1707L9L3937j9759k6883J10409J9991K3609l0148
$$ -20058 -39701 -75749 -25723 -37430 -37391 -3454 -23213 -50096 60313 80304 103913 73765
17372G3765j0539l0060J2592j29040l8332L8176L3062L7594J371J0214N6439J815
$$ 73765 63226 33166 45758 -83282 -121614 -83438 -50376 -12782 -11411 -1197 55242 57057
17360E7057n8950n1877j0401p434r753P4730K5063n2186l7002l2217L4866K7268
$$ 57057 -1893 -53770 -64171 -71605 -81358 -6628 18435 -33751 -70753 -102970 -68104 -40836
17348d0836k234k8230l788k2908k190R447J4908o776J9904k3629J5324K7085J4212
$$ -40836 -43070 -71300 -75088 -97996 -100186 -90739 -75831 -82607 -62703 -86332 -71008 -43923 -29711
17335b9711q5708k6377J4456m2910L7257M9263L9851J400J1134o493l4157M0222
$$ -29711 -115419 -141796 -127340 -170250 -132993 -83730 -43879 -42479 -31345 -37838 -71995 -31773
17323c1773R9060j13o9589K6609K4058q5367n4390j6880O5372K3755K9388n7724
$$ -31773 67287 67174 -2415 24194 48252 -37115 -91505 -108385 -43013 -19258 10130 -47594
17311d7594o7926L6341J01336L9777o4891m1062K5020J5335k9797j7474J6322
$$ -47594 -115520 -79179 22157 61934 -2957 -44019 -18999 -3664 -33461 -50935 -34613
17300c4613P320K5630J1134j4993r4393M6427J05j3340J61039P775j08115k9046
$$ -34613 -27293 -1663 9471 -5522 -99915 -53488 -53383 -66723 94316 102091 -6024 -35070
17288c5070L2070m9000j2124N2774o6969N600l0197M3477N831N2461P2329q678
$$ -35070 -3000 -52000 -64124 -11350 -78319 -72719 -102916 -59439 -53608 -1147 71182 62504
17276F2504j3829m895n3210n4120R496J1466Q7363k0338k3603M6508K4231l6550
$$ 62504 48675 43780 -9430 -63550 -54054 -42588 44775 24437 834 47342 71573 35023
17264C5023o0905k0778K5346k9388k5781K4339J30q735N6079N6456M5826Q4522
$$ 35023 -25882 -46660 -21314 -50702 -76483 -52144 -52014 -60749 -4670 51786 97612 182134
17252A82134p7848j72541k6545r721J8956r0616K313O3206p3894L7148R0911K3031
$$ 182134 104286 -68255 -94800 -104521 -85565 -176181 -173868 -110662 -184556 -147408 -56497 -33466
17240c3466j22556k5524R8095Q7203L3880j9538q1118j3218K981k3590k6643R763
$$ -33466 -156022 -181546 -83451 3752 37632 18094 -63024 -76242 -73261 -96851 -123494 -113731
17228a13731L6991q674j9326N8871p787L5686J0958l5187R036l7950p216k2694
$$ -113731 -76740 -85414 -104740 -45869 -53656 -17970 -7012 -42199 -33163 -71113 -78329 -101023
17216a01023o9361j7307Q8771L7505N2617j4555k8479R497N0077M3132J2210n9172
$$ -101023 -170384 -187691 -98920 -61415 -8798 -23353 -51832 -42335 7742 50874 63084 3912
17204C912n0684p6568J0648R2500M4128o6610K1235J1686K4072n9064l8072J4758
$$ 3912 -46772 -123340 -112692 -20192 23936 -42674 -21439 -9753 14319 -44745 -82817 -68059
17192f8059j2052l1109N0972K4242N9878O5576N466n3843m5623K0024l3388K0831
$$ -68059 -80111 -111220 -60248 -36006 23872 89448 94914 41071 -4552 15472 -17916 2915
17180B915k0843M8245L6739m6171o2569L1716L3847n0518r47J5603o1841m8603
$$ 2915 -17928 30317 67056 20885 -41684 -9968 23879 -26639 -27586 -11983 -73824 -122427
17168a22427k0075n6888M5537J64285P2874M9241n8316j4769M2516P514k0408
$$ -122427 -142502 -199390 -153853 10432 83306 132547 74231 59462 101978 109492 89084
17157H9084j5472n4585N5455J8881J3219m0200q0922L9570M7328p4622j352m0243
$$ 89084 73612 19027 74482 93363 106582 66382 -14540 25030 72358 -2264 -3616 -43859
17145d3859K0668K7723N0748N4520L9846l3554m4557o1006K919K120n0758r0742
$$ -43859 -23191 4532 55280 109800 149646 116092 71535 10529 13448 15568 -35190 -125932
17133a25932j433K626j6924N3294P0853M648Q797l8601o011J6832J2719q3015
$$ -125932 -127365 -124739 -141663 -88369 -17516 -12868 -4071 -42672 -48683 -31851 -19132 -102147
17121a02147o581j958J5251l5364J208O1250Q4532j7869J2234L142L1036J09584
$$ -102147 -108728 -110686 -95435 -130799 -129591 -68341 16191 -1678 10556 13698 44734 154318
17109A54318J6839p6178o7979J8126m0655k5809O0649R142L927m8165o8039L863
$$ 154318 171157 94979 27000 45126 4471 -21338 39311 48453 52380 4215 -63824 -59961
17097e9961O5859o9468M6215L4151j0470J130l1246p1630m0243O2653M7788j6022
$$ -59961 5898 -63570 -17355 16796 6326 7456 -23790 -95420 -135663 -73010 -25222 -41244
17085d1244k2639k1704P5515L0458l5545o6597n3201l484Q8254J4424j5924L5179
$$ -41244 -63883 -85587 -10072 20386 -15159 -81756 -134957 -138441 -50187 -35763 -51687 -16508
17073a6508j793P8591J26228j1907l0809j40915k1832K0423l8777J690k0266L8250
$$ -16508 -18301 60290 186518 174611 143802 2887 -18945 1478 -37299 -35609 -55875 -17625
17061a7625M2385j8503l6148K3407P5763J2443m6188n3816n8537K3276P3818q598
$$ -17625 24760 6257 -29891 -6484 69279 81722 35534 -18282 -76819 -53543 20275 11677
17049A1677j960K1082O9929m0074P099n3244J6456M3458n7711l7097k7789J2758
$$ 11677 9717 30799 100728 60654 67753 14509 30965 74423 16712 -20385 -48174 -35416
17037c5416j3667j9117k0943L5548Q1543P8272M0940o5670j25110J2625l5241
$$ -35416 -49083 -68200 -89143 -53595 27948 106220 147160 81490 -43620 -30995 -66236
17026f6236k8619L6370N8011L1192K2048M1830N3762m1899n3474l4453n4109J2898
$$ -66236 -94855 -58485 -474 30718 52766 94596 148358 106459 52985 18532 -35577 -22679
17014b2679k694K0220p7321m0405N3257K8221L5961M1017q8750q8412k72j5919
$$ -22679 -25373 -5153 -82474 -122879 -69622 -41401 -5440 35577 -53173 -141585 -141857 -157776
17002a57776m5N8502K278N4808O741n4220k4297L5272L1400Q4339K7627J9986
$$ -157776 -157821 -99319 -97041 -42233 -35492 -89712 -114009 -78737 -47337 37002 64629 84615
16990H4615r3662k0666L5498O0416l1619k3367j62020p035N6613M760m1417L4063
$$ 84615 -9047 -29713 5785 66201 34582 11215 -150805 -157840 -101227 -96467 -137884 -103821
16978a03821j2278n042m161k7956K7K1754j7533K1765J5712N5053R5326o3237
$$ -103821 -116099 -121141 -125302 -153258 -153231 -131477 -149010 -127245 -111533 -56480 38846 -24391
16966b4391k2270K4138J9639J0495J02663j3515n1274m6149k2775n9419J16550
$$ -24391 -46661 -22523 -2884 7611 110274 96759 45485 -664 -23439 -82858 33692
16955C3692p214o2199k1177l2010m2862L2109K7712m30O6193J7978m0566j7056
$$ 33692 26478 -35721 -56898 -88908 -131770 -99661 -71949 -72379 -6186 11792 -28774 -45830
16943d5830Q3652m1246n6775j683M3440Q623q672k4566l8736J6504K2985O7571
$$ -45830 37822 -3424 -60199 -61882 -18442 -9819 -18491 -43057 -81793 -65289 -42304 25267
16931B5267O9255P354n2988m8628q5692K9630P6113m9773p2377j4691Q3109L8986
$$ 25267 94522 101876 48888 260 -85432 -55802 20311 -29462 -101839 -116530 -33421 5565
16919E565j06394l6284O3818n2768N5712L6094M2493l249l0773p7294L7326J27720
$$ 5565 -100829 -137113 -73295 -126063 -70351 -34257 8236 4987 -25786 -103080 -65754 61966
16907F1966J8690o502j11398p700J7958N1892j01498l1517N7082Q0788Q0359j0580
$$ 61966 80656 74154 -37244 -44944 -26986 24906 -76592 -108109 -51027 29761 110120 99540
16895I9540l9509j2220J5901J6702L3912k0687O0340L2204m3403k112j04448k8407
$$ 99540 60031 47811 63712 80414 114326 93639 153979 186183 142780 140668 36220 7813
16883G813n5857K013O802M8067K830j32766q1534Q6548l7848j308M3261P7222
$$ 7813 -48044 -46031 -39229 8838 11668 -121098 -202632 -116084 -153932 -155240 -111979 -34757
16871c4757L7143l6798k3205j5791m0443J4983K7859J9158N8009p331k2023N1386
$$ -34757 2386 -34412 -57617 -73408 -113851 -98868 -71009 -51851 6158 -1173 -23196 28190
16859B8190O8710m6729m4059J28p788m4528n8304l6263K7110R996J9708K333j4368
$$ 28190 96900 50171 6112 6240 -1548 -46076 -104380 -140643 -113533 -103537 -83829 -81496 -95864
16846i5864Q2016K4266j4076o5049o5306j2901J4949L8866P7138l3383K4679L6547
$$ -95864 -13848 10418 -3658 -68707 -134013 -146914 -131965 -93099 -15961 -49344 -24665 11882
16834A1882J8268M8830M2695K0247j14360p3415m27M9050J0791n6899n6252N5093
$$ 11882 30150 78980 121675 141922 27562 -45853 -46280 2770 13561 -43338 -99590 -44497
16822d4497M8359m9692k6314R0647P315l6144J7391l2687J04265Q1348m7799q4483
$$ -44497 3862 -45830 -72144 18503 25818 -10326 7065 -25622 78643 159991 112192 27709
16810B7709R080p386M5126L0225j898k9619r6702m8073l6556J49L3220N5602M592
$$ 27709 36789 29403 74529 104754 102856 73237 -23465 -71538 -108094 -107945 -74725 -19123 -14531
16797a4531j4119k7742l1527j7662l7277R219J2070m5718O0251L9129m4562j11948
$$ -14531 -28650 -56392 -87919 -105581 -142858 -133639 -121569 -167287 -107036 -67907 -112469 -224417
16785b24417O9270M0644q1976j5051R2944J22602O5636K8477O3145o3708o7490
$$ -224417 -155147 -114503 -196479 -211530 -118586 4016 69652 98129 161274 97566 30076
16774C0076J0950M2641P0113o286q8836q1537n3313j4135j5739R7546j13q7210
$$ 30076 41026 83667 153780 147494 58658 -22879 -76192 -90327 -106066 -8520 -8633 -95843
16762i5843O1865L6527J9756N6334R9547j1162p8642n626k5729m704J4349n9333
$$ -95843 -33978 2549 22305 78639 178186 167024 88382 82756 57027 52323 66672 7339
16750G339n4235m9704l2853L3434L0843j5267J2021N9302O462o4762M7716N5228
$$ 7339 -46896 -96600 -129453 -96019 -65176 -80443 -68422 -9120 -2658 -67420 -19704 35524
16738C5524N6030q5479o1921O5677M2855k730l6709q1789K0742O1719J05343L7520
$$ 35524 91554 6075 -55846 9831 52686 49956 13247 -68542 -47800 13919 119262 156782
16726A56782m1571j9904j3358m7814q5633n3601m9060J09655L4618j6643K7066
$$ 156782 115211 95307 81949 34135 -51498 -105099 -154159 -44504 -9886 -26529 537
16715E37M6704j5997p1392k5166P4278J0284M0826r8375k006K3062N7266L858
$$ 537 47241 31244 -40148 -65314 8964 19248 60074 -38301 -40307 -17245 40021 43879
16703D3879k3024o7737k8553l238L5007P5413m9850J2385J4284l180q6520o2717
$$ 43879 20855 -46882 -75435 -78673 -43666 31747 -18103 -5718 8566 5386 -81134 -143851
16691a43851Q952n1177n7980J3920o4559Q4236N4197K5659m660M6390n916M60
$$ -143851 -134899 -186076 -244056 -230136 -294695 -210459 -156262 -130603 -135263 -88873 -94789 -94329
16679i4329P89m0249K7888K0530P7859j4097K2234k346k7483j4633p0203L5425
$$ -94329 -93540 -133789 -105901 -85371 -7512 -21609 625 -1721 -29204 -43837 -114040 -78615
16667g8615j5414k3310N4984K3491j09788N2298N8045L7741N8204L2590j00529
$$ -78615 -94029 -117339 -62355 -38864 -148652 -96354 -38309 -568 57636 90226 -10303
16656a0303p663J4972p3313N0026k1801K3749n3694L748N4188n4133K0278L2120
$$ -10303 -17966 -2994 -76307 -26281 -48082 -24333 -78027 -74279 -20091 -74224 -53946 -21826
16644b1826R179j2225K3800K3721l0400K7771K8898m305m7168m6213K2226J8438
$$ -21826 -12647 -24872 -1072 22649 -7751 20020 48918 44613 -2555 -48768 -26542 -8104
16632h104m354m4084J0280l5988j22996J09973J32363R5447O0239k5948o6648
$$ -8104 -12458 -56542 -46262 -82250 -205246 -95273 37090 132537 192776 166828 100180
16621A00180m3030L5753Q5179l471j16408j37517m2214J6515P3574k9562k1386
$$ 100180 57150 92903 178082 174611 58203 -79314 -121528 -105013 -31439 -61001 -82387
16610h2387j9007k2591K7459L3319L44L5476k0825o3200J1279M7339P149p0712
$$ -82387 -101394 -123985 -96526 -63207 -62863 -27387 -48212 -111412 -100133 -52794 -45645 -116357
16598a16357N646M0820O1711l2077j6162J3807J6513K2742O239M0790P6614K096
$$ -116357 -110711 -69891 -8180 -40257 -56419 -42612 -26099 -3357 2882 43672 120286 122382
16586A22382p8207m0849O735n836k2753J9468l6430o3426M088N0332j277J0838
$$ 122382 44175 3326 10061 4225 -18528 940 -35490 -98916 -94828 -44496 -45773 -34935
16574c4935o9540K2953M9804L5327k8071j1572L296O7280j00869j24692M3904
$$ -34935 -104475 -81522 -31718 3609 -24462 -36034 -32738 34542 -66327 -191019 -147115
16563a47115N1857l2935o1282K9615K2133K0324N1781J3528K2929r7770o0238
$$ -147115 -95258 -128193 -189475 -159860 -137727 -117403 -65622 -52094 -29165 -126935 -187173
16552a87173p9622M8138J28162O3527l9770J467k4967K1706N8118j0714n4120
$$ -187173 -266795 -218657 -90495 -26968 -66738 -65271 -90238 -68532 -10414 -21128 -75248
16541g5248l1909L2580O7346m5651n1210m1673K3798Q9498K4779K6378K7991J5602
$$ -75248 -107157 -74577 -7231 -52882 -104092 -145765 -121967 -32469 -7690 18688 46679 62281
16529F2281L2646K5508p4344K8012K3096k3276m8763p2230n5244m1696N837n0328
$$ 62281 94927 120435 46091 74103 97199 73923 25160 -47070 -102314 -144010 -138173 -188501
16517a88501j5352N9711N7975N4542k4205k0525J8238P2425P2517q627l4850M6085
$$ -188501 -203853 -144142 -86167 -31625 -55830 -76355 -58117 14308 86825 78198 43348 89433
16505H9433K085j15905j5650L4131k387O321l459j7841m1779J4482k8536j5994
$$ 89433 91518 -24387 -40037 -5906 -8293 -1972 -5431 -23272 -65051 -50569 -79105 -95099
16493i5099Q7698L0051O453N5317N2189l6985J4720P820n5359p0419P2191R4345
$$ -95099 -7401 22650 29103 84420 136609 99624 114344 122164 66805 -3614 68577 162922
16481A62922m7374k9176m2305m5502o5015j7328J0566J7494l7531Q1156J5160
$$ 162922 115548 86372 44067 -1435 -66450 -83778 -73212 -55718 -93249 -12093 3067
16470C067m1823k622J7853K2009K6887n2087k9635K0077l5111K5621j7650N2683
$$ 3067 -38756 -41378 -23525 -1516 25371 -26716 -56351 -36274 -71385 -45764 -63414 -10731
16458a0731L791j9858p5115N4845M5442L2549K2261N5172K013p2996k8474l1058
$$ -10731 -6940 -26798 -101913 -47068 -1626 30923 53184 108356 110369 37373 8899 -22159
16446b2159R44K7956j1429j7078J5523K7041p480j7355m1581O077L2957Q485o7734
$$ -22159 -21215 6741 -4688 -21766 -6243 20798 13318 -4037 -45618 -39541 -6584 1901 -65833
16433f5833o6882L8386k1260K952k3132J15640N8982J4642j18675o4085O1321
$$ -65833 -132715 -94329 -115589 -112637 -135769 -20129 38853 53495 -65180 -129265 -67944
16422f7944k039K3006N7388J3495q018m0495l8281M1544N2138n0449K3391O1368
$$ -67944 -69983 -46977 10411 23906 15888 -24607 -62888 -21344 30794 -19655 3736 65104
16410F5104P071k9845J0978l6422K0104N493k5714l8179j5280m6432J6566L4765
$$ 65104 72175 42330 53308 16886 36990 42483 16769 -21410 -36690 -83122 -66556 -31791
16398c1791l0795J1058K881K8518j8640k5681k8481O9765M9352K7658J4877n965
$$ -31791 -62586 -51528 -48647 -20129 -38769 -64450 -92931 -23166 26186 53844 68721 62756
16386F2756K8681j8618j3531m1342P498J13972l1336k0502J564r532k4821p3305
$$ 62756 91437 72819 59288 17946 25444 139416 108080 87578 89142 79610 54789 -18516
16374a8516O159o313J5025O767p8809L6899O9900k9309r8115O9486N1186N8880
$$ -18516 -12357 -18670 -3645 3122 -75687 -38788 31112 1803 -96312 -26826 24360 83240
16362H3240n1505K8j7188k6028N537N1119k5428r2005l3894j8358L6031J02466
$$ 83240 31735 31763 14575 -11453 -5916 45203 19775 -72230 -106124 -124482 -88451 14015
16350A4015p948l8801j0531j8776q64l1865n1148J06764M759o8784j5107O075
$$ 14015 6067 -32734 -43265 -62041 -62905 -94770 -145918 -39154 -34395 -103179 -118286 -112211
16338a12211q806J6378N362N8830L5812M5397J919n2295K4160m41n9498n1329
$$ -112211 -121017 -104639 -99277 -40447 -4635 40762 42681 -9614 14546 14105 -45393 -96722
16326i6722L2915M5222j8176j3084O9296N2720J8905m4438J4762j3124o0177k302
$$ -96722 -63807 -18585 -36761 -49845 19451 72171 91076 46638 61400 48276 -11901 -14203
16314a4203m8257j36655K0896l437N5163M8664L7239J8383m905N4960L8855q5978
$$ -14203 -62460 -199115 -178219 -181656 -126493 -77829 -40590 -22207 -27112 27848 66703 -19275
16302a9275l1540k9579N3135L9409P7105J7157N430o390j8384n1469L2715P6786
$$ -19275 -50815 -80394 -27259 12150 89255 106412 111842 105452 87068 35599 68314 145100
16290A45100r6097j3471O6444j2055q4044q6379O1250J5810l4270L1987l3480
$$ 145100 49003 35532 101976 89921 5877 -80502 -19252 -3442 -37712 -5725 -39205
16279c9205R349k8052l9507J7479N9135K641K311N1188M6514l3871j8966m1644
$$ -39205 -29856 -57908 -97415 -79936 -20801 -18160 -15849 35339 81853 47982 29016 -12628
16267a2628m3033n1462L5134Q1662p3790M1812J03888O6980L0649j28377r5342
$$ -12628 -55661 -107123 -71989 9673 -64117 -22305 81583 148563 179212 50835 -44507
16256d4507K3481L96P494n2566k1051J7097K7364j5775m351m8625m371N8780K6875
$$ -44507 -21026 -20630 -13136 -65702 -86753 -69656 -42292 -58067 -62418 -111043 -115414 -56634 -29759
16243b9759m814M288j28952m3166J10693J66041K1109j10163n0021n3617k5797
$$ -29759 -34573 -30285 -159237 -202403 -91710 74331 95440 -14723 -64744 -118361 -144158
16232a44158P3890P8676j9856k6100q6602p2105J5834O8222q649Q4830n4464j29269
$$ -144158 -70268 8408 -11448 -37548 -124150 -196255 -180421 -112199 -120848 -36018 -90482 -219751
16220b19751K7129m9316J09334R9018N0350m4435l9460K8930O2756R1348j2385
$$ -219751 -192622 -241938 -132604 -33586 16764 -27671 -67131 -38201 24555 115903 103518
16209A03518n4728p3571j09316j9004J23351L7590k2518J2980J8351n7144n0867
$$ 103518 48790 -24781 -134097 -153101 -29750 7840 -14678 -1698 16653 -40491 -91358
16198i1358N3444j534m8879M6011j7079m3316j8248J0400O8696K5245j5939Q1470
$$ -91358 -37914 -39448 -88327 -42316 -59395 -102711 -120959 -110559 -41863 -16618 -32557 48913
16186D8913P0482K8126O400r8318j14135M6096P9826L9244j9261j10265l7246
$$ 48913 119395 147521 153921 55603 -58532 -12436 67390 106634 87373 -22892 -60138
16175f0138j0644L6857k5498q400M3647k6509N126M0282N9207J8271j7905j18206
$$ -60138 -70782 -33925 -59423 -67823 -24176 -50685 -45559 -5277 53930 72201 54296 -63910
16163f3910N3646M5119o0779J0865k1026m0015k9247O795J2663K6172K8020m52
$$ -63910 -10264 34855 -25924 -15059 -36085 -76100 -105347 -98552 -85889 -59717 -31697 -32149
16151c2149L6212k5680K7362k8825m369J4156Q889m5266n1526M5255L2952r416
$$ -32149 4063 -21617 5745 -23080 -27449 -13293 -4404 -49670 -101196 -55941 -22989 -32405
16139c2405n8147m6153K6805L7299N3597l3929n9081L7313Q1165j1681N942k5086
$$ -32405 -90552 -136705 -109900 -72601 -19004 -52933 -112014 -74701 6464 -5217 725 -24361
16127b4361K6984r930j1266j23369n0929N2200J00564m6163n4749m0498P596N0038
$$ -24361 2623 -7307 -18573 -141942 -192871 -140671 -40107 -86270 -141019 -181517 -173921 -123883
16115a23883J2055L0353O2894P0742K6801p6331q8535l0563m1363o8210k9904
$$ -123883 -111828 -81475 -18581 52161 78962 2631 -85904 -116467 -157830 -226040 -255944
16104b55944M4810k7408m3241J18934K1401K8196J1863L9313K2948M555K6173
$$ -255944 -211134 -238542 -281783 -162849 -141448 -113252 -101389 -62076 -39128 -34573 -8400
16093h400q702L6278K2228J8459r371K6557r2005q239M4585M0916k9890o7365
$$ -8400 -17102 19176 41404 59863 50492 77049 -14956 -23195 21390 62306 32416 -34949
16081c4949q409J7968K6114L9129M9298j1438q3483J2760k847k437j7283j2363
$$ -34949 -43358 -25390 724 39853 89151 77713 -5770 6990 4143 1706 -15577 -27940
16069b7940K6089l9004l5472K7948m5245j7371r830K850O6190M5896m8630l5398
$$ -27940 -1851 -40855 -76327 -48379 -93624 -110995 -120825 -117975 -51785 -5889 -54519 -89917
16057h9917M6264K6567n1274n2803J5872O9168q41L3577N0008N7517l5541r7840
$$ -89917 -43653 -17086 -68360 -121163 -105291 -36123 -36964 -3387 46621 104138 68597 -29243
16045b9243j2300M1160m5949o9969L9125L8602P714L9606J2967m0921o2328P229
$$ -29243 -41543 -383 -46332 -116301 -77176 -38574 -30860 8746 21713 -19208 -81536 -74307
16033g4307O117k6030R55N127K2872J9976Q0230l8406l73N5052l463j31963j2503
$$ -74307 -68190 -94220 -93265 -88138 -65266 -45290 34940 -3466 -3839 51213 47750 -84213 -96716
16020i6716K355j4745J03699k8112J7532J3587p9338M1219O0367p874K0229j6141
$$ -96716 -94361 -109106 -5407 -33519 -15987 -2400 -81738 -40519 19848 11974 32203 16062
16008A6062K9179N9561k0253l7598j48478J0823Q231M1073M5321o6819n7197j1352
$$ 16062 45241 104802 84549 46951 -101527 -90704 -82473 -41400 3921 -62898 -120095 -131447
15996a31447P6376M6765m7661q532Q062J5065K0408J3320J7702P412P279j8552
$$ -131447 -55071 -8306 -55967 -64499 -56437 -41372 -20964 -7644 10058 17470 24749 6197
15984F197k8927k7753K5304M0094o5562j00672Q3146J1129J1117K0759K1489k2361
$$ 6197 -22730 -50483 -25179 14915 -50647 -151319 -68173 -57044 -45927 -25168 -3679 -26040
15972b6040N8188N0850k7445n4739J3833n4918j7815L8016j500n5930r326J3196
$$ -26040 32148 82998 55553 814 14647 -40271 -58086 -20070 -21570 -77500 -86826 -73630
15960g3630L9207n912k479k6617R619k490M7071k2116m7733M8061M296m6170k4460
$$ -73630 -34423 -40335 -42814 -69431 -59812 -62302 -15231 -37347 -85080 -37019 -32723 -78893 -103353
15947a03353J8147P6131K9226J7815j5928j0731n3961n1284M8916P3502n6998
$$ -103353 -85206 -9075 20151 37966 22038 11307 -42654 -93938 -45022 28480 -28518
15936b8518m3463Q784l616l2032Q0553P0961k962p4843N686K2309K6833M1675
$$ -28518 -71981 -63197 -66813 -98845 -18292 52669 49707 -25136 -19450 2859 29692 71367
15924G1367m8395M2221m567K3163n586K123k2539l2624J8834j8038j3924r0904
$$ 71367 22972 65193 60626 83789 78203 80326 57787 25163 43997 25959 12035 -78869
15912g8869n8940l8477J9432N9024J7524j1992j3708K5938k1027l3503J26218
$$ -78869 -137809 -176286 -156854 -97830 -80306 -92298 -106006 -80068 -101095 -134598 -8380
15901h380J2234k5792M6363q7234o0467j2927M0835J6653l2288j4863P5365R9327
$$ -8380 3854 -21938 24425 -62809 -123276 -136203 -95368 -78715 -111003 -125866 -50501 48826
15889D8826m9015J8295O3041L8187N4163o3472p690o9931m9867R400l2113J9804
$$ 48826 -189 18106 81147 119334 173497 110025 102335 32404 -17463 -8063 -40176 -20372
15877b0372Q652j04880j301J26584Q4181L909l039n0686k2508K2127L5082j829
$$ -20372 -11720 -116600 -117901 8683 92864 96773 93734 43048 20540 42667 77749 75920
15865G5920r4138j49711K0935O8293O7477L1915o7871O716M5541q4514p1132k9989
$$ 75920 -18218 -167929 -146994 -78701 -11224 20691 -47180 -40464 5077 -79437 -150569 -180558
15853a80558M4768O2817L0211L30N9158K0120m1307r90M7103J9437m8273n2175
$$ -180558 -135790 -72973 -42762 -42432 16726 36846 -4461 -5451 41652 61089 12816 -39359
15841c9359o3767k9999K4474l1534K8626K6096N7076N237n2501q42Q8626O4669
$$ -39359 -103126 -133125 -108651 -140185 -111559 -85463 -28387 -23150 -75651 -76493 12133 76802
15829G6802k5639N9818K7117o8013j25684k9749L1752m0950n8440L588M8551J2693
$$ 76802 51163 110981 138098 70085 -55599 -85348 -53596 -94546 -152986 -149398 -100847 -88154
15817h8154J5069Q095P9355l9029j03082L7145Q2426N3107q2224K7449m6571j12550
$$ -88154 -73085 -64990 14365 -24664 -127746 -90601 -8175 44932 -37292 -9843 -56414 -168964
15805a68964N56M4421N6874J15252J2235o2075M917R550M3816M8592j2108n4960
$$ -168964 -168408 -123987 -67113 48139 60374 -1701 3216 12766 56582 105174 93066 38106
15793C8106p1113q4843K9269j5262J8980M6077K0144L4204K2359L934K7971M4493
$$ 38106 -33007 -117850 -88581 -103843 -84863 -38786 -18642 15562 37921 41855 69826 114319
15781A14319l9824o5661j2499k0078j9492o2846K3045j089o5187J7631k4534j706
$$ 114319 74495 8834 -3665 -23743 -43235 -106081 -83036 -84125 -149312 -131681 -156215 -157921
15769a57921L8579K5710J6017O7700J8763j07245j14629O0284R9785L2085L3274
$$ -157921 -119342 -93632 -77615 -9915 8848 -98397 -213026 -152742 -52957 -20872 12402
15758A2402N633l4453k6403O359m2347j11173O8607J08011M4513J0079J3974j1739
$$ 12402 18035 -16418 -42821 -36462 -78809 -189982 -121375 -13364 31149 41228 55202 43463
15746D3463n7797n8102O6196K0660j0609J0873L0385N6445J8218n5481q0282r2444
$$ 43463 -14334 -72436 -6240 14420 3811 14684 45069 101514 119732 64251 -16031 -108475
15734a08475M5411L1480m9407n8893j6729R440Q9716n831n047l027m9776j05972
$$ -108475 -63064 -31584 -80991 -139884 -156613 -147173 -57457 -63288 -68335 -71362 -121138 -227110
15722b27110J4135J32934Q4425N1384p2992n3642k1027N5177J7353P679k3343
$$ -227110 -212975 -80041 4384 55768 -17224 -70866 -91893 -36716 -19363 -11684 -35027
15711c5027o101M9253m5550k0536P5863m7603n9691J6277R1464n1905r5512r289
$$ -35027 -41128 8125 -37425 -57961 17902 -29701 -89392 -73115 18349 -33556 -129068 -138357
15699a38357J5931J00600P5133m4670l1690p7173j6905q1900L4385O4013M2509
$$ -138357 -122426 -21826 53307 8637 -23053 -100226 -117131 -199031 -164646 -100633 -58124
15688e8124n3749O28R840L7210N3954J7111j6820M5058P4735j00194n2564k3520
$$ -58124 -111873 -111245 -101405 -64195 -10241 6870 -9950 35108 109843 9649 -42915 -66435
15676f6435J06389M5916o794l5119P1889K5192k5340r5490n5137j3613j9711M9558
$$ -66435 39954 85870 79076 43957 115846 141038 115698 20208 -34929 -48542 -68253 -18695
15664a8695n2536J5648J01695p742J1418K5279p9155O6616j4108K7924L9042K271
$$ -18695 -71231 -55583 46112 38370 49788 75067 -4088 62528 48420 76344 115386 117657
15652A17657n8227J8976k2786o8408m0613p567L6026r622k3406p4756N4062O4087
$$ 117657 59430 78406 55620 -12788 -53401 -60968 -24942 -34564 -57970 -132726 -78664 -14577
15640a4577P0147J1608o6840j6680R1297M5861r7472n3366m1209l7791J971k6457
$$ -14577 55570 67178 338 -16342 74955 120816 23344 -30022 -71231 -109022 -107051 -133508
15628a33508o781M5093j5551P5357R253M5127m1593p9650l6580R8728J12385K8420
$$ -133508 -140289 -95196 -110747 -35390 -26137 18990 -22603 -102253 -138833 -40105 72280 100700
15616A00700j5776L7443K3123p4229q0684p515n462M9365L2496O16j8514N0060
$$ 100700 84924 122367 145490 71261 -9423 -16938 -22400 26965 59461 60077 41563 91623
15604I1623O046j20375o149N1931m243k6760J0093m1835k2206m4594N1729m561
$$ 91623 97669 -22706 -28855 23076 18833 -7927 2166 -39669 -61875 -106469 -54740 -59301
15592e9301J6568J3678k5334r7878K0050L0526P8544n5811j6727K463L1243n088
$$ -59301 -42733 -29055 -54389 -152267 -132217 -101691 -23147 -78958 -95685 -93222 -61979 -67067
15580f7067j9490P064K5979r630j062q343J01655j2315o6223K822O7595L9196
$$ -67067 -86557 -79493 -53514 -63144 -64206 -72549 29106 16791 -49432 -46610 20985 60181
15568F0181J2157O7925L4336o6595r9410m6434Q609k7372O1388m2455m1524k8805
$$ 60181 72338 140263 174599 108004 8594 -37840 -29231 -56603 4785 -37670 -79194 -107999
15556a07999Q3530M097n2082L5711P2703K063m0655k8679K1835l674k3184J7550
$$ -107999 -24469 -20372 -72454 -36743 35960 38023 -2632 -31311 -9476 -13150 -36334 -18784
15544a8784M3903K3977Q28m2378k9666k4112J35517N0553o1610q698R75l1316
$$ -18784 25119 49096 49924 7546 -22120 -46232 89285 139838 78228 69530 70505 39189
15532C9189l8681Q4982p732p2585L5483J147l3683j0445J3562P608l8133m1944
$$ 39189 508 85490 77758 5173 40656 41803 8120 -2325 11237 18845 -19288 -61232
15520f1232L601q7527j6749R4447M7674p9429K5131P5575J3897J01540N4971L0191
$$ -61232 -57631 -145158 -161907 -67460 -19786 -99215 -74084 1491 15388 116928 171899 202090
15508B02090J1788m7054o3766M8994o929l0254k1535M4212o803l9899n7765l4265
$$ 202090 213878 166824 103058 152052 145123 114869 93334 137546 130743 90844 33079 -1186
15496a186l8265o9106p5542K5518J34523N3073N2898J5893j9556J8078n285n6975
$$ -1186 -39451 -108557 -184099 -158581 -24058 29015 81913 97806 78250 96328 91043 34068
15484C4068J2970r023p3981J4979O196j06627L2902R0956K4383K4148n0955q2154
$$ 34068 47038 38015 -35966 -20987 -14791 -121418 -88516 2440 26823 50971 16 -82138
15472h2138k2842O0717q3728o5203Q1336K8412N003K3110K0895L3529j630k7221
$$ -82138 -104980 -44263 -127991 -193194 -111858 -83446 -78443 -55333 -34438 -909 -2539 -29760
15460b9760K135n6459J3066j2952P5492J5431m714m1532l3266J2267L8913o2021
$$ -29760 -27625 -84084 -71018 -83970 -8478 6953 2239 -39293 -72559 -60292 -21379 -83400
15448h3400o215O968q6M1808L6356J1326j1799L3158p9513j04753R066O8838L359
$$ -83400 -89615 -82647 -82733 -40925 -4569 6757 -5042 28116 -51397 -156150 -147084 -78246 -74887
15435g4887M7815J8979O0584m5797p7347K8491l6129q670J4613J6337q096L3559
$$ -74887 -27072 -8093 52491 6694 -70653 -42162 -78291 -86961 -72348 -56011 -64107 -30548
15423c0548l0177j7670J9968R0823L2698J408n0168m7295j9205j5216K3007M5163
$$ -30548 -60725 -78395 -58427 32396 65094 66502 16334 -30961 -50166 -65382 -42375 2788
15411B788N7448N3548j02056p8063n9874L6052R8226L0520J4765m6074q7532J6381
$$ 2788 60236 113784 11728 -66335 -126209 -90157 8069 38589 53354 7280 -80252 -63871
15399f3871J7377k8375O8031P8205j0470j4474l0023j0331k4990q902j318n9235
$$ -63871 -46494 -74869 -6838 71367 60897 46423 16400 6069 -18921 -27823 -29141 -88376
15387h8376j098K5492j4051n5996n269N2077L0990N8499m514J4499k7716k4771
$$ -88376 -89474 -63982 -78033 -134029 -139298 -87221 -56231 2268 -2246 12253 -15463 -40234
15375d0234j5594j2772J6458m6292L3548N8924l6092k806k0552k0375M31p1273
$$ -40234 -55828 -68600 -52142 -98434 -64886 -5962 -42054 -44860 -65412 -85787 -85356 -156629
15363a56629j696O931Q5132L4514r8757K9926L1564M2622K8443J8168J9622j8493
$$ -156629 -158325 -151394 -66262 -31748 -130505 -100579 -69015 -26393 2050 20218 39840 21347
15351B1347n9553L8022M2262n0290j00421l3653N5578K4350n9820K3088Q2533
$$ 21347 -38206 -184 42078 -8212 -108633 -142286 -86708 -62358 -122178 -99090 -16557
15340a6557j3262M4746j6313n0747M2637J6898m6727n2427Q3826Q2721K1468p1294
$$ -16557 -29819 14927 -1386 -52133 -9496 7402 -39325 -91752 -7926 74795 96263 24969
15328B4969m3529O3408m9387o1563j3857Q945L3382M2436k5993L6486l5430m3830
$$ 24969 -18560 44848 -4539 -66102 -79959 -71014 -37632 4804 -21189 15297 -20133 -63963
15316f3963q229l5373O8261N5694N9167n3467L4227o6509j04892l0791J17145
$$ -63963 -72192 -107565 -39304 16390 75557 22090 56317 -10192 -115084 -145875 -28730
15305b8730K0061j8764K4000r48L1733M6628p5485J1758J2604N8052Q6405k8598
$$ -28730 -8669 -27433 -3433 -4381 27352 73980 -1505 10253 22857 80909 167314 138716
15293A38716m1570l1691m1753M799n9781J10655J339K0754M841n8376n3816k4694
$$ 138716 97146 65455 23702 28501 -31280 79375 80714 101468 106309 47933 -5883 -30577
15281c0577j2732Q8316j0525j5736N1092n3737k781P0598K0270k4942m5521r3980
$$ -30577 -43309 45007 34482 18746 69838 16101 13320 83918 104188 79246 33725 -60255
15269f0255j6526j1385l160N0037L9176n8482K7434K1930K7284n269k1257m3681
$$ -60255 -76781 -88166 -91326 -41289 -2113 -60595 -33161 -11231 16053 10784 -10473 -54154
15257e4154J0278J07923M5292j3023l0453J11520l4044o8797n3317r41O4582o790
$$ -54154 -43876 64047 109339 96316 65863 177383 143339 74542 21225 20284 84866 78076
15245G8076M6754J7189Q865r2543q5627n922K4651m570j1744M4353K0604k7131
$$ 78076 124830 142019 150884 58341 -27286 -33208 -8557 -13127 -24871 19482 40086 12955
15233A2955l3905k5125J5604k9122r3874l0508L9297J51890m7280o0368O4629
$$ 12955 -20950 -46075 -30471 -59593 -153467 -183975 -144678 7212 -40068 -100436 -35807
15222c5807N392k0511o9419k0644M7140L111m4042l484J184k9754K2237O6867
$$ -35807 -30415 -50926 -120345 -140989 -93849 -90738 -134780 -138264 -137080 -166834 -144597 -77730
15210g7730P0544n0303l7865P8165N4487n1741m5245N4562k0599o0020O965N7505
$$ -77730 -7186 -57489 -95354 -17189 37298 -14443 -59688 -5126 -25725 -85745 -78780 -21275
15198b1275p476r683n4275j9677n9731J0545K028K7349j0895l5734J12408L6206
$$ -21275 -28751 -38434 -92709 -112386 -172117 -161572 -159544 -132195 -143090 -178824 -66416 -30210
15186c0210n7530M9821M5905l6294J5753j5917j2599l0796l8153N7501J21394
$$ -30210 -87740 -37919 7986 -28308 -12555 -28472 -41071 -71867 -110020 -52519 68875
15175F8875M5377q7032o8984P2515o838M9540J9916K6983P6233J4888q9628j09746
$$ 68875 114252 27220 -41764 30751 23913 73453 93369 120352 196585 211473 121845 12099
15163A2099J7786k2638q8741J6064J12580R8814n1404l6523p7516m434J2665l6427
$$ 12099 29885 7247 -81494 -65430 47150 145964 94560 58037 -19479 -23913 -11248 -47675
15151d7675l3569M9905N7279o42m4505K4683k4329J0699M4252o9312j1389J02867
$$ -47675 -81244 -31339 25940 25298 -19207 5476 -18853 -8154 36098 -33214 -44603 58264
15139E8264N9130m0739q2416J6645r690J4648j1111P833L5208q828J5019O5528
$$ 58264 117394 76655 -5761 10884 1194 15842 4731 12564 47772 38944 53963 119491
15127A19491M7708K1689k9316p6094k0483n6130q01l0131l3025j1560L9590o1288
$$ 119491 167199 188888 159572 83478 62995 6865 6064 -24067 -57092 -68652 -29062 -90350
15115i0350K7392M0459L6526L5824l7835K0067J6748m9343m4376j777O649M0469
$$ -90350 -62958 -22499 14027 49851 12016 32083 48831 -512 -44888 -46665 -40016 453
15103D53q469j0560N5218K5354n9852l2323O8274M5519m7898n984J9087M6165
$$ 453 -8016 -18576 36642 61996 2144 -30179 38095 83614 35716 29732 48819 94984
15091I4984K3148m4388m5428q685M1043l2711j18892j0305J6093M8772N5885r977
$$ 94984 118132 73744 28316 19631 60674 27963 -90929 -101234 -85141 -36369 19516 9539
15079I539j4758O3080N1600k6551r2711j6150Q7166K2815m6167k0140l1393j5646
$$ 9539 -5219 57861 109461 82910 -9801 -25951 61215 84030 37863 17723 -13670 -29316
15067b9316K1304P9823J3747j16293j5664K6548J05786k5558n4928k8243q078
$$ -29316 -8012 71811 85558 -30735 -46399 -19851 85935 60377 5449 -22794 -30872
15056c0872P4709K0131o8452J0205N651q8597l1808j4727j066M8881K2861P1k8362
$$ -30872 43837 63968 -4484 5721 11372 -77225 -109033 -123760 -124826 -75945 -53084 -53013 -81375
15043h1375J2483P6463K9062j5222n0748L4147M778j8817q1744j4066k0676J1791
$$ -81375 -68892 7571 36633 21411 -29337 4810 9588 -9229 -90973 -105039 -125715 -113924
15031a13924m9877j3638P0307M9572K0711l209L7808K0776l3050l987J6354J2917
$$ -113924 -163801 -177439 -107132 -57560 -36849 -40058 -2250 18526 -14524 -18511 -2157 10760
15019A0760M9618j939k6713L335j07260O078P3185M373j15535Q6583N6304L4499
$$ 10760 60378 58439 31726 35061 -72199 -66121 7064 11437 -104098 -17515 38789 73288
15007G3288K1505o8963L7276j3498m6628P1844l9926q0093K7118L3848l8527m8396
$$ 73288 94793 25830 63106 49608 2980 74824 34898 -45195 -18077 15771 -22756 -71152
14995g1152p138J5265R7430K1812J7409j6707j4424o9248k4696Q0193Q1539m0303
$$ -71152 -78290 -63025 34405 56217 73626 56919 42495 -26753 -51449 28744 110283 69980
14983F9980r1160P644O2072j427j14076j7682J00237M8387m5197J1359k4667m2333
$$ 69980 -21180 -13536 48536 47109 -66967 -84649 15588 63975 18778 30137 5470 -36863
14971c6863J4764J2386r964j1259K5283j6247L2749O5203k4116L9927k1562p4005
$$ -36863 -22099 -9713 -19677 -30936 -5653 -21900 10849 76052 51936 91863 70301 -3704
14959c704O777J0838p7456k3892j10152Q616J15721R0877L5168n6205j8488J0067
$$ -3704 3073 13911 -63545 -87437 -197589 -188973 -73252 17625 52793 -3412 -21900 -11833
14947a1833J696P5124n2908p5255q6055L8877j0075q1763n7293Q4931J67384J863
$$ -11833 -10137 64987 12079 -63176 -149231 -110354 -120429 -202192 -259485 -174554 -7170 -5307
14935e307k4646k2685R1206M8326j3986l2322K5657M8241K0323l9302q9092j36963
$$ -5307 -29953 -52638 38568 86894 72908 40586 66243 114484 134807 95505 6413 -130550
14923a30550J2357J07001M7393o987o455o4018j3079P8004L3936M060j8384L6730
$$ -130550 -118193 -11192 36201 29214 22759 -41259 -54338 23666 57602 61662 43278 80008
14911H0008k1646J0362m079n5435M8645O3806j2092P322n3007q6710l349j1833
$$ 80008 58362 68724 64645 9210 57855 121661 109569 116891 63884 -22826 -26175 -38008
14899c8008P3657M1272p7893m2772L3120L6896Q1119J17994k0429j80906r2974
$$ -38008 35649 76921 -972 -43744 -10624 26272 107391 225385 204956 24050 -68924
14888f8924o081P8766l235O7825K1167j1020P8546m9904j14309j7214q2276r1997
$$ -68924 -75005 3761 526 68351 89518 78498 157044 107140 -7169 -24383 -106659 -198656
14876a98656N2448Q9153M8078n7929k3042J6000k825o318J6221j4923n638P0726
$$ -198656 -146208 -57055 -8977 -66906 -89948 -73948 -76773 -83091 -66870 -81793 -87431 -16705
14864a6705J1601k445L0161j3117R196L205M699O5615j0841J737R355k1271m9811
$$ -16705 -5104 -7549 22612 9495 18691 21896 26595 92210 81369 83106 92461 71190 21379
14851B1379p8976m8556O3610R4844l7592o9483k1949P0541L9976k5827O7017l3475
$$ 21379 -57597 -106153 -42543 52301 14709 -54774 -76723 -6182 33794 7967 74984 41509
14839D1509o8840n7538J5973O9731m6977j54737r2230R3355J25358K9711M3558
$$ 41509 -27331 -84869 -68896 835 -46142 -200879 -293109 -199754 -74396 -44685 -1127
14828a127J5584r6764q3211l8050R5118R5613L3354o5425P9754Q3212M4157m4838
$$ -1127 14457 -82307 -165518 -203568 -108450 -12837 20517 -44908 34846 118058 162215 117377
14816A17377p951n9886N3713K9603k5024j3028l5819p4093o5546M6258J40756
$$ 117377 109426 49540 103253 132856 107832 94804 58985 -15108 -80654 -34396 106360
14805A06360j3628k4595K4971m2811q3118L0104M1867k3457p0641m370m5298M3698
$$ 106360 92732 68137 93108 50297 -32821 -2717 39150 15693 -54948 -59318 -104616 -60918
14793f0918p699L4025K263L9461l1361m2989k9526m44n1298N3057J07447q605
$$ -60918 -68617 -34592 -32329 7132 -24229 -67218 -96744 -97188 -148486 -95429 12018 3413
14781C413m0969M948K7439O0238m7219p2259m67M4571J6885N7859O113K5258l8677
$$ 3413 -37556 -32608 -5169 55069 7850 -64409 -64876 -20305 -3420 54439 60552 85810 47133
14768D7133m5938J2296j0264m1000n6583r6489m0816J1484Q1933J9666k7468J668
$$ 47133 1195 13491 3227 -37773 -94356 -190845 -231661 -220177 -138244 -118578 -146046 -144378
14756a44378K6617O4466k7486M3212J18965n9109L7315N6539K5945l0028J5180
$$ -144378 -117761 -53295 -80781 -37569 81396 22287 59602 116141 142086 112058 127238
14745A27238J5405l6307m9320o6690o2936R436j0M517K3439J4593o0696j203O6058
$$ 127238 142643 106336 57016 -9674 -72610 -63174 -63184 -58667 -35228 -20635 -81331 -82534 -16476
14732a6476M1646L1143l2544j5064P449J03678k6392J6567P1078N667l5388K4465
$$ -16476 25170 56313 23769 8705 16154 119832 93440 110007 181085 186752 151364 175829
14720A75829q2972p3271Q1964k4850r9145k681k177n9394R939j02859n1450m303
$$ 175829 92857 19586 101550 76700 -22445 -25126 -27303 -86697 -76758 -179617 -231067 -235370
14708b35370P5655r233K7511R1766P5351J3733n831n7636l7221O5545K2130p5439
$$ -235370 -159715 -168948 -141437 -49671 25680 39413 33582 -24054 -61275 4270 26400 -49039
14696d9039l0136l3268O3379K8004R8053K784q1116p6790L7815O0036k8541k9272
$$ -49039 -79175 -112443 -49064 -21060 76993 79777 -1339 -78129 -40314 19722 -8819 -38091
14684c8091K0081n8676p426M6742L9479n5849o0011N757M6805K6087j9734J871
$$ -38091 -18010 -76686 -84112 -37370 2109 -53740 -113751 -107994 -61189 -35102 -54836 -52965
14672e2965j0017j4416l130J1926K6679P186J8968j7466o9830R635r375N595M6084
$$ -52965 -62982 -77398 -80528 -68602 -41923 -34737 -15769 -33235 -103065 -93430 -102805 -97210 -51126
14659e1126n0635j0073P8772O7446k003o770q0322L8349L0137O8737L3173p4909
$$ -51126 -101761 -111834 -33062 34384 32381 25611 -54711 -16362 13775 82512 115685 40776
14647D0776j11367K8434J00257L5949n9037k9161m4823K5461N9755O6848K7879
$$ 40776 -70591 -42157 58100 94049 35012 5851 -38972 -13511 46244 113092 140971
14636A40971m1557j6618l9071J3547q7212k2246N3022L7128k7208m8942m3993
$$ 140971 99414 82796 43725 57272 -29940 -52186 836 37964 10756 -38186 -82179
14625h2179k3940J351m3184R937L5091j6645q4429j4509Q9865J50013P3630p9797
$$ -82179 -106119 -104768 -147952 -138015 -102924 -119569 -203998 -218507 -128642 21371 95001 15204
14613A5204o3870k3564o0761Q357K3974M9921Q2579K351n0213k0316k9390L1207
$$ 15204 -48666 -72230 -132991 -124634 -100660 -50739 31840 34191 -16022 -36338 -65728 -34521
14601c4521K0454n8260j7135K5416O2617J6287K0474J9355n5548N1355N2988L8894
$$ -34521 -14067 -72327 -89462 -64046 -1429 14858 35332 54687 -861 50494 103482 142376
14589A42376J4396p8597k13K4962j1399l0661l7715l8615M55J566n4746m14L099
$$ 142376 156772 78175 77962 102924 91525 60864 23149 -15466 -15011 -13445 -68191 -68605 -65506
14576f5506j293K538M3776m4956j5712J3279M3983r3574J5640J57254M1675q6161
$$ -65506 -66799 -64261 -20485 -65441 -81153 -67874 -23891 -117465 -101825 55429 97104 10943
14564A0943j12832j64282J3167p990L1988M7402R2221k8255o2822O6535J8047
$$ 10943 -101889 -266171 -253004 -260994 -229006 -181604 -89383 -117638 -180460 -113925 -95878
14553i5878O7885J22381l8368n7957k3249j076L3390K8665P329l5342r9635K284
$$ -95878 -27993 94388 56020 -1937 -25186 -26262 7128 35793 43122 7780 -91855 -89571
14541h9571M5009N9329L3296j7179o9487m6552M667J8382n9446J7401K8405N3228
$$ -89571 -44562 14767 48063 30884 -38603 -85155 -80488 -62106 -121552 -104151 -75746 -22518
14529b2518K6001l6845m1313P535J9225m390j6131l759L381O0521k7933J3557
$$ -22518 3483 -33362 -74675 -67140 -47915 -52305 -68436 -72195 -68814 -8293 -36226 -22669
14517b2669n322n0052k2018j8023K959J7401J6751J30098J03109j40656o9329
$$ -22669 -27991 -78043 -100061 -118084 -115125 -97724 -80973 49125 152234 11578 -57751
14506e7751o640M3223o5583n3789O5275R874o7445o7387O221N4075N7202P5250
$$ -57751 -64391 -21168 -86751 -140540 -75265 -65391 -132836 -200223 -194002 -139927 -82725 -7475
14494g475L6692k7356M3085J467j958m7421m0163K8182L8232K8156j4125J3032
$$ -7475 29217 1861 44946 46413 44455 -2966 -43129 -14947 23285 51441 37316 50348
14482E0348J01233O5973k4666r1659o1222J594l6463M0101o4366n0668n3850K4141
$$ 50348 151581 217554 192888 101229 40007 41601 5138 45239 -19127 -69795 -123645 -99504
14470i9504N1858M3810Q1039l9986p1583L9165n6562j8551l3259J1323q1774l1421
$$ -99504 -47646 -3836 77203 37217 -34366 4799 -51763 -70314 -103573 -92250 -174024 -205445
14458b05445N8098O1627P166j5896P9452Q8702N0072N3820R171L6241j02973n1690
$$ -205445 -147347 -85720 -78554 -94450 -14998 73704 123776 177596 186767 223008 120035 68345
14446F8345o4777j5648Q1832M5617n6580m756j8271M3905k1382m5789j07762p8308
$$ 68345 3568 -12080 69752 115369 58789 54033 35762 79667 58285 12496 -95266 -173574
14434a73574P4332L416K6076J7032L8130P0381m3457q5754p3482j3063N0118Q3638
$$ -173574 -99242 -95826 -69750 -52718 -14588 55793 12336 -73418 -146900 -159963 -109845 -26207
14422b6207N6286l3265j11846P5085M9685l1349p3238J8727J4868P579j187l8658
$$ -26207 30079 -3186 -115032 -39947 9738 -21611 -94849 -76122 -61254 -53675 -54862 -93520
14410i3520m1851L5409J36415M6048O226P703k4343k3470J7386O5956k9102n9971
$$ -93520 -135371 -99962 36453 82501 88727 96430 72087 48617 66003 131959 102857 42886
14398D2886m6390r3152m3430K8534L7921j120k3136j3810J15351j0121j4895R774
$$ 42886 -3504 -96656 -140086 -111552 -73631 -74751 -97887 -111697 3654 -6467 -21362 -11588
14386a1588O5471J89K4257K9263J049o1482L8968n8473j12081N863L7900N6022
$$ -11588 53883 54072 78329 107592 108641 47159 86127 27654 -84427 -78564 -40664 15358
14374A5358J1613q0070J2016r839l3609J4984r900Q0245K1192r0457m0676O332
$$ 15358 26971 -53099 -41083 -50922 -84531 -69547 -79447 798 21990 -68467 -109143 -102811
14362a02811k1998l530n1429K738K0427J4513R9766L7298q0710L47J6417M540
$$ -102811 -124809 -128339 -179768 -177030 -156603 -142090 -42324 -5026 -85736 -85389 -68972 -64432
14350f4432K4604L6819K4034j2796O6665P5240m354n4631q3256j03955j3782n940
$$ -64432 -39828 -3009 21025 8229 74894 150134 145780 91149 7893 -96062 -109844 -115784
14338a15784J72424O1828p2082j8649K8296n4075M7721O0128p3381Q903J0937
$$ -115784 56640 118468 46386 27737 56033 1958 49679 109807 36426 45329 56266
14327E6266l2913Q694j2090k847m2303N5081M2909P46n945O2456l4151l3392r782
$$ 56266 23353 32047 19957 17110 -25193 29888 72797 73543 67598 130054 95903 62511 52729
14314E2729r2621j5538N5098n55J9087K4155p635j4396l0028J5268J6313p1825
$$ 52729 -39892 -55430 -332 -887 18200 42355 34720 20324 -9704 5564 21877 -49948
14302d9948j6846o0594m9711N3686J6026k8781L3294L6790R9381Q809k9801L3346
$$ -49948 -66794 -127388 -177099 -123413 -107387 -136168 -102874 -66084 33297 42106 12305 45651
14290D5651k3611l1568m139L575l5217l8426n6790P2254M7184l8297K406M0658
$$ 45651 22040 -9528 -13667 -10092 -45309 -83735 -140525 -68271 -21087 -59384 -56978 -16320
14278a6320K4407k9447q2953k0755o184N6852N1058m0869m2051l2202k8189N5217
$$ -16320 8087 -21360 -104313 -125068 -131252 -74400 -23342 -64211 -106262 -138464 -166653 -111436
14266a11436M0285k6201P1996O609n972L5470k7973k5314p3152j0305N5013N6830
$$ -111436 -71151 -97352 -25356 -18747 -24719 10751 -17222 -42536 -115688 -125993 -70980 -14150
14254a4150P5989j7956l8200K7908m4521N9886m1820q57K1400M8554r2069n8774
$$ -14150 61839 43883 5683 33591 -10930 48956 7136 6279 27679 76233 -15836 -74610
14242g4610O4009l5401K3844O5629M181L2037K2812n1857n8506J0652o1275p1953
$$ -74610 -10601 -46002 -22158 43471 47652 79689 102501 50644 -7862 2790 -58485 -130438
14230a30438K9020n28K0021J986N2361m6843l0649L8246P1575j470n4353P2584
$$ -130438 -101418 -101946 -81925 -79939 -27578 -74421 -105070 -66824 4751 3281 -51072 21512
14218B1512j1137k5809K9638R536j56633k4172M5631j641l7566O0861P1345Q4748
$$ 21512 10375 -15434 14204 23740 -132893 -157065 -111434 -113075 -150641 -89780 -18435 66313
14206F6313k3769p2252P048n2953O2158J24951l3887j01802l065P3895n117k033
$$ 66313 42544 -29708 -22660 -75613 -13455 111496 77609 -24193 -27258 46637 41520 39487
14194C9487j3603P3197K1596m2485j15639l0550R5764M9872p278j966m8614J4818
$$ 39487 25884 99081 120677 78192 -37447 -67997 27767 77639 70361 68395 19781 34599
14182C4599N3081J14848M3130l7473r4130l9392j20260l7856P4233J29479j9530
$$ 34599 87680 202528 245658 208185 114055 74663 -45597 -83453 -9220 120259 100729
14171A00729j14305p0107O0789J9719m782q206k3777m8648O937J11099O6460K3324
$$ 100729 -13576 -83683 -22894 -3175 -7957 -16163 -39940 -88588 -81651 29448 95908 119232
14159A19232N6121j27294j26265K6227M0918m5387j7543L23L2141R3089K5784
$$ 119232 175353 48059 -78206 -51979 -11061 -56448 -73991 -73668 -41527 51562 77346
14148G7346k8043o6881L5529j364l0271m7628p304m491K457n0972P1449J09721
$$ 77346 49303 -17578 17951 16587 -13684 -61312 -68616 -73107 -70650 -121622 -50173 59548
14136E9548P1296j6478r1298J0483l0762M4977q1736Q760N8673K8162K4521l1783
$$ 59548 130844 114366 23068 33551 2789 47766 -33970 -25210 33463 61625 86146 54363
14124E4363p8821J2113N9971j3959K6841J0498o2156j2493L4621o5873j15109
$$ 54363 -24458 -12345 47626 33667 60508 71006 8850 -3643 30978 -34895 -150004
14113a50004O2036M5744J04780M9603o5680m7928j5511O0072K7344m5697m1302
$$ -150004 -87968 -42224 62556 112159 46479 -1449 -16960 43112 70456 24759 -16543
14102a6543p998M9680k632k8802k5855J7858R2824M3154n2286m1579k4008J5023
$$ -16543 -24541 25139 22507 -6295 -32150 -14292 78532 121686 69400 27821 3813 18836
14090A8836j511K3576k7331K7402N7634J1575q172K3721n9516k8817L512m5969
$$ 18836 17325 40901 13570 40972 98606 110181 102009 125730 66214 37397 40909 -5060
14078e060n5382p350K1844M1151L9060K5497N0068q3171o4044n3940K3051J25313
$$ -5060 -60442 -67792 -45948 -4797 34263 59760 109828 26657 -37387 -91327 -68276 57037
14066E7037Q4420j0847j3647k0025j9881K0653l0962k6749n1888l308L5999K8128
$$ 57037 141457 130610 116963 96938 77057 97710 66748 39999 -11889 -15197 20802 48930
14054D8930m8269j59652m1052Q4401J03950L5784J7819J36509j1204j7481k2969
$$ 48930 661 -158991 -200043 -115642 -11692 24092 41911 178420 167216 149735 126766
14043A26766j07139l3018j30163N7052R0931J8763l0808k321l6987M6161k6827
$$ 126766 19627 -13391 -143554 -86502 4429 23192 -7616 -9937 -46924 -763 -27590
14032b7590m2952L844J7330l1737k6466J3464n2409Q41Q4714R854k6617K2357
$$ -27590 -70542 -66698 -49368 -81105 -107571 -94107 -146516 -145675 -60961 -51107 -77724 -55367
14020e5367M1494K2010L3727k9623j27458O7581N5568L4069k754l297M4413J2208
$$ -55367 -13873 8137 41864 12241 -115217 -47636 7932 42001 39247 35950 80363 92571
14008I2571O858j9923J1772N2169O790j23216k6698L419k1642j4789j60918L5623
$$ 92571 99429 79506 91278 143447 150237 27021 323 3742 -17900 -32689 -193607 -157984
13996a57984N4517k1410L1848L5393l5459Q529J14116j8699m2873q953J4620O5414
$$ -157984 -103467 -124877 -93029 -57636 -93095 -84566 29550 10851 -32022 -40975 -26355 39059
13984C9059M3094k4796q819k2001m8361j5891n9167R9880L8164j28484K1002J34525
$$ 39059 82153 57357 48538 26537 -21824 -37715 -96882 2998 41162 -87322 -66320 68205
13972F8205N3104J1662n9167k6956n7179m2621N2835J3235l6730P390Q2225P7684
$$ 68205 121309 132971 73804 46848 -10331 -52952 -117 13118 -23612 -16222 66003 143687
13960A43687n1878r420o0503J6708L5182M0332n4234m1466m6932N451M0845N4330
$$ 143687 91809 82389 21886 38594 73776 114108 59874 18408 -28524 -23073 17772 72102
13948G2102L5115K4157m7342r0595K3987J3536j0129o935N942m8496q4177J0012
$$ 72102 107217 131374 84032 -6563 17424 30960 20831 13896 19838 -28658 -112835 -102823
13936a02823J4857L960K8544n213k6947j9282O8888K3130J263l1781K1639l9848
$$ -102823 -87966 -84006 -55462 -60675 -87622 -106904 -38016 -14886 -13623 -45404 -23765 -63613
13924f3613l2010J06686M5310l6874M799L8567J6111l7626K474m0189P9757M2377
$$ -63613 -95623 11063 56373 19499 24298 62865 78976 41350 43824 3635 83392 125769
13912A25769l9601J0517M9346n2823J1374O729L8760M0931p8023m4612P7907R242
$$ 125769 86168 96685 146031 93208 104582 111311 150071 191002 112979 68367 146274 155516
13900A55516o0076l0149k0625J8197O892J87k3905N4144n6298j1041P903k1840
$$ 155516 95440 65291 44666 62863 69755 69942 46037 100181 43883 32842 40745 18905
13888A8905J0326k7650l6544j8851j9877N997N97k2530k6599J13574L9457L5130
$$ 18905 29231 1581 -34963 -53814 -73691 -67694 -67097 -89627 -116226 -2652 36805 71935
13876G1935J8349k6513m0032n1372M8968L9654L0339l5285n8377j9039m5389l0947
$$ 71935 90284 63771 23739 -27633 21335 60989 91328 56043 -2334 -21373 -66762 -97709
13864i7709P1635K3855q4275l0515M2854M4617Q774L4605j9557j2819O6701N0998
$$ -97709 -26074 -2219 -86494 -117009 -74155 -29538 -20764 13841 -5716 -18535 48166 99164
13852I9164L9914j4793j24855o6931n0287L211j684L6647M2098p384j2833R6401
$$ 99164 139078 124285 -570 -67501 -117788 -114577 -116261 -79614 -37516 -44900 -57733 38668
13840C8668K4365K6835l3759m8155O916M945k1272k2004m5248l0610K0879n2767
$$ 38668 63033 89868 56109 7954 14870 19815 -1457 -23461 -68709 -99319 -78440 -131207
13828a31207j9834J3547Q7743J5245k0245Q0219Q9847m0651j01460k0676J113
$$ -131207 -151041 -137494 -49751 -34506 -54751 25468 115315 74664 -26796 -47472 -46359
13817d6359p0879J5800K5219Q8773j5067q3421M4486K641p688N3362l085p2164
$$ -46359 -117238 -101438 -76219 12554 -2513 -85934 -41448 -38807 -46495 6867 3782 -68382
13805f8382J099J6317J4072j3877J9316q876k0151j5797j7969O6273L3748j2005
$$ -68382 -67283 -50966 -36894 -50771 -31455 -40331 -60482 -76279 -94248 -27975 5773 -6232
13793f232K152J2031r9779j6029L0926P6252K2610J1232n6536r5441k3779Q3315
$$ -6232 -4080 7951 -91828 -107857 -76931 -679 21931 33163 -23373 -118814 -142593 -59278
13781e9278L3895j2900K1730J7501j044n7637j3173R5182M1412L8485q6832l0133
$$ -59278 -25383 -38283 -16553 948 -96 -57733 -70906 24276 65688 104173 17341 -12792
13769a2792m7998q9766M3792j1586L7627M6092L0931m1640m4852r060k7886j4675
$$ -12792 -60790 -150556 -106764 -118350 -80723 -34631 -3700 -45340 -90192 -99252 -127138 -141813
13757a41813M2510O0746K8737k4134R676J9659R76j3692o34O9800R4295N0830
$$ -141813 -99303 -38557 -9820 -33954 -24278 -4619 -3643 -17335 -17969 51831 146126 196956
13745A96956j10387j4537j0438o7491p0706j0850l1585J4350N9571K172K1477
$$ 196956 86569 72032 61594 -5897 -76603 -87453 -119038 -104688 -45117 -42945 -21468
13734b1468L9k5684O1384k4060p7046p8407L9787k2128M2237K7102K5121M6342
$$ -21468 -21429 -47113 14271 -9789 -86835 -165242 -125455 -147583 -105346 -78244 -53123 -6781
13722f781M8794l0973m9618K3829M6297P8427J8561q5984j13625K364P3017K2940
$$ -6781 42013 11040 -38578 -14749 31548 109975 128536 42552 -71073 -68709 4308 27248
13710B7248P002L66k6187K6055p537L0262m3550o0167O4323m9200n0649O6198
$$ 27248 34250 34616 8429 34484 26947 57209 13659 -46508 17815 -31385 -82034 -15836
13698a5836P8542k6267o644P8792l543k3901k5512o2904l0918j7408k8650M5604
$$ -15836 62706 36439 29795 108587 105044 81143 55631 -7273 -38191 -55599 -84249 -38645
13686c8645Q0269n030r4533n9802N3217K2536l7484m9635O9049M8045J2149r421
$$ -38645 41624 36594 -57939 -117741 -64524 -41988 -79472 -129107 -60058 -12013 136 -9285
13674i285P070l1652p5860j7536J22212R9751M6238r8690j13690P1008N893L5273
$$ -9285 -2215 -33867 -109727 -127263 -5051 94700 140938 42248 -71442 -434 5459 40732
13662D0732O3669M1140n7833l0175K3769L187p0892p5794R7419R5587p1061o2544
$$ 40732 104401 145541 87708 57533 81302 84489 13597 -62197 35222 130809 59748 -2796
13650b796k5415L7917n3669k6944N2625N0147J5149o826L1908O9169P233l6908
$$ -2796 -28211 9706 -43963 -70907 -18282 31865 47014 40188 72096 141265 148498 111590
13638A11590q3535K412J0257l1021r5488K5819J26851l7092k2629n1245p567K7174
$$ 111590 28055 30467 40724 9703 -85785 -59966 66885 29793 7164 -44081 -51648 -24474
13626b4474J0751j218Q4618J63430r7839j57388q0031L8631j444p3507N042Q388
$$ -24474 -13723 -14941 69677 233107 135268 -22120 -102151 -63520 -64964 -138471 -133429 -125041
13614a25041J3064K3904M6210N142L3423M4948J8560n6247j9427j769n8001p4500
$$ -125041 -111977 -88073 -41863 -36721 -3298 41650 60210 3963 -15464 -17233 -75234 -149734
13602a49734J0291L7732K7570q078j3867r976K1913J18939P0128o6328K4119M3282
$$ -149734 -139443 -101711 -74141 -82219 -96086 -106062 -84149 34790 104918 38590 62709 105991
13590A05991M3528m4137n8369n9335J9779J3236J5775n3400m2454M5657P8478
$$ 105991 149519 105382 47013 -12322 7457 20693 36468 -16932 -59386 -13729 64749
13579F4749k1320m6421p769l1451j5582L9450l8710j8986L1152K6359k738k2250
$$ 64749 43429 -2992 -10761 -42212 -57794 -18344 -57054 -76040 -44888 -18529 -21267 -43517
13567d3517M3748P7496l9129m8244k5243N2629M2328O3630n5928l0750J6291m3303
$$ -43517 231 77727 38598 -9646 -34889 17740 60068 123698 67770 37020 53311 10008
13555A0008p8289m1593K2744K4287Q2737Q3975K5206j0139r9465L5430K0511N2483
$$ 10008 -68281 -109874 -87130 -62843 19894 103869 129075 118936 19471 54901 75412 127895
13543A27895r985k6013m9924l2561l0982J13609L4225J3686j820p4457k4691q2428
$$ 127895 117910 91897 41973 9412 -21570 92039 126264 139950 138130 63673 38982 -43446
13531d3446m6318n5088J64424R3481j7464m8905q9848Q3552O7136K594p6606p6278
$$ -43446 -89764 -144852 19572 113053 95589 46684 -43164 40388 107524 110118 33512 -42766
13519d2766o8417j6614J732N049N2260j0224n8525O0480j3353M3873J12603j0121
$$ -42766 -111183 -127797 -126065 -121016 -68756 -78980 -137505 -77025 -90378 -46505 66098 55977
13507E5977K3443m1504r1188M4885K1392o3584n938N1727J1690n6275o2862l4667
$$ 55977 79420 37916 -53272 -8387 13005 -50579 -56517 -4790 6900 -49375 -112237 -146904
13495a46904L0841L2881Q3590M0937j4448O6175k7024n8628m1024o192m0981j7862
$$ -146904 -116063 -83182 408 41345 26897 93072 66048 7420 -33604 -39796 -80777 -98639
13483i8639L1126k615l863o0671p0561Q336L4569M6018k7131O9919M916m1739
$$ -98639 -67513 -70128 -73991 -134662 -205223 -196887 -162318 -116300 -143431 -73512 -68596 -110335
13471a10335n5791m6441M8130J02449o697M1307k309k36O3729J6797k872r567
$$ -110335 -166126 -212567 -164437 -61988 -68685 -27378 -29687 -29923 33806 50603 47731 38164
13459C8164n7722M3840J594l1813J4013J4548m6595J120J03655l5158j01449l8206
$$ 38164 -19558 24282 25876 -5937 8076 22624 -23971 -22851 80804 45646 -55803 -94009
13447i4009R4369O4513m5224o2108J4531j1547l005M4418j2161L8761j8863p0890
$$ -94009 360 64873 19649 -42459 -27928 -39475 -42480 1938 -10223 28538 9675 -61215
13435f1215q7434N9576O6116O6769M770n5670M3809K8269J4837j15105K1696q65
$$ -61215 -148649 -89073 -22957 43812 48582 -7088 36721 64990 79827 -35278 -13582 -14447
13423a4447M2326q524o1719J7664Q6872k0090k7710J4923k3082n2817J6564K798
$$ -14447 27879 19355 -42364 -24700 62172 42082 14372 29295 6213 -46604 -30040 -27242
13411b7242o1331K7336K0838L1273R3519O7832j6717m0256K8818n9110k3348K4876
$$ -27242 -88573 -61237 -40399 -9126 84393 152225 135508 95252 124070 64960 41612 66488
13399F6488J889m9179L4697j1614K8897L1967J7906K2607m3349j1948r2678Q8108
$$ 66488 68377 19198 53895 42281 71178 103145 121051 143658 100309 88361 -4317 83791
13387H3791M207p8154J1715N0352P8939N541J1290n2404n6332n7425k0620L0089
$$ 83791 87998 9844 21559 71911 150850 156391 167681 115277 58945 1520 -19100 10989
13375A0989J3405N5078J6971n0150n7613o0233P0520N7640l5634k0124J2415o5696
$$ 10989 24394 79472 96443 46293 -11320 -71553 -1033 56607 20973 849 13264 -52432
13363e2432K8613J19352L444k9999K3815m0068j13552M943r066m5833L1326J08493
$$ -52432 -23819 95533 98977 68978 92793 52725 -60827 -55884 -64950 -110783 -79457 29036
13351B9036j6036j6086l4715P210Q417M5839L8426l558K3006J2235n9106n9320
$$ 29036 13000 -3086 -37801 -30591 -22174 23665 62091 58533 81539 93774 34668 -24652
13339b4652N778K0733K2367l4708k0217K0565L6473j4392K7726n431K4632j4477
$$ -24652 -18874 1859 24226 -10482 -30699 -10134 26339 11947 39673 34242 58874 44397
13327D4397k5976j3927k1519o2819J6660Q5358k7170k7423M6035P4136Q318R593
$$ 44397 18421 4494 -17025 -79844 -63184 22174 -4996 -32419 13616 87752 96070 105663
13315A05663K3571n4886p8446n9940K7944J2671m8120j299j5996N1601K6246K9172
$$ 105663 129234 74348 -4098 -64038 -36094 -23423 -71543 -72842 -88838 -37237 -10991 18181
13303A8181K1392m5558l6110O0950J6729r7260M2885J9392j345Q0585n7743o4061
$$ 18181 39573 -5985 -42095 18855 35584 -61676 -18791 601 -744 79841 22098 -41963
13291d1963P0744o0087K8685m195L9145L8192L013k8126m2290K5414j4667k9733
$$ -41963 28781 -31306 -2621 -6816 32329 70521 73534 45408 3118 28532 13865 -15868
13279a5868K8185m9244l6739q385p5021j5679N8772k043K9189K3051O5223M2044
$$ -15868 12317 -36927 -73666 -82051 -157072 -172751 -113979 -116022 -86833 -63782 1441 43485
13267D3485j1173o7962L828J7005P2034q785K2450K6345P5782p0374j18225j2510
$$ 43485 32312 -35650 -31822 -14817 57217 48432 70882 97227 173009 102635 -15590 -28100
13255b8100O0537L1439O674R05J3726k3182j7450k067k9424l2208J2245L5057
$$ -28100 32437 63876 70550 71455 85181 61999 44549 42482 13058 -19150 -6905 28152
13243B8152K8847l9325k1309N4529J8597O074M6777k7591n2680K631j0834K6731
$$ 28152 56999 17674 -3635 50894 69491 75565 122342 94751 42071 44702 33868 60599
13231F0599M2990l6225p5912p673J0056K3386m1355k8353K1392P4747O1484r322
$$ 60599 103589 67364 -8548 -16221 -6165 17221 -24134 -52487 -31095 43652 105136 95814
13219I5814J6358M125K6704J6357j6192j9644l7334n086J2780J5766J8896M7757
$$ 95814 112172 116297 143001 159358 143166 123522 86188 81102 93882 109648 128544 176301
13207A76301m3255p3065N3802N4205m4451r5094m3445M7121n2620o8272J2690
$$ 176301 133046 59981 113783 167988 123537 28443 -15002 32119 -20501 -88773 -76083
13196g6083L4683N1272M4252p486r0702j7088J0924K8216K1818r697j0532Q230
$$ -76083 -41400 9872 54124 46638 -44064 -61152 -50228 -22012 -194 -9891 -20423 -12193
13184a2193k0181M479P1736N0245l091R6208j9051m7361o7538L305J9877k2125
$$ -12193 -32374 -27895 43841 94086 90995 187203 168152 120791 53253 56558 76435 54310
13172E4310M2152o1186n0979J2026o473J0467L3969o4024K0052M5008J8404J4067
$$ 54310 96462 35276 -15703 -3677 -10150 317 34286 -29738 -9686 35322 53726 67793
13160F7793l9007J5192p552j4220j9508J12R629l8467L274k1954j1504R8174J5317
$$ 67793 28786 43978 36426 22206 2698 2810 12439 -26028 -22754 -44708 -56212 41962 57279
13147E7279k0913l6333o315J2473o923J7968k586L2036M4771N5074L8219m3597
$$ 57279 36366 33 -6282 6191 -732 17236 14650 46686 91457 146531 184750 141153
13135A41153j45242l6423j0007j3567L8638N7122j0512j2543M4070J05851l1682
$$ 141153 -4089 -40512 -50519 -64086 -25448 31674 21162 8619 52689 158540 126858
13124A26858j9939R753O5884j7j09671p0412J610N4500P8060k1526r4367K1426
$$ 126858 106919 116672 182556 182539 72868 2456 4066 58566 136626 115100 20733 42159
13112D2159M2323k5866r464o3424o3661J6106P6413m0663N2954J07307j593r5971
$$ 42159 84482 58616 49152 -14272 -77933 -61827 14586 -26077 26877 134184 132591 36620
13100C6620k9753K2193L8192j3624N2616p9212J6213L281j5021J022K4721k5016
$$ 36620 6867 29060 67252 53628 106244 27032 43245 46526 31505 32527 57248 32232
13088C2232n6415l3627M1165m808j2034K3712O3794j4304p845L1095k0269O120
$$ 32232 -24183 -57810 -16645 -21453 -33487 -9775 54019 39715 31870 62965 42696 48816
13076D8816J5173l4470l4373m4850J7022L5491L9243K1723o7568L1342L9710k603
$$ 48816 63989 29519 -4854 -49704 -32682 2809 42052 63775 -3793 27549 67259 64656
13064F4656J1753L0782l3946l448m0679m0459L0688Q7230o491P378o8078l9528
$$ 64656 76409 107191 73245 69797 29118 -11341 19347 106577 100086 107464 39386 -142
13052a42q4166M003N8714Q639L519k2512j7570Q5225K4558K3447q4379l6613J5084
$$ -142 -84308 -80305 -21591 -12952 -9433 -31945 -49515 35710 60268 83715 -664 -37277 -22193
13039b2193J0656L133J8454m430O2623L2210M3723n3096j71415l0913J00228l4534
$$ -22193 -11537 -8404 10050 5620 68243 100453 144176 91080 -80335 -111248 -11020 -45554
13027d5554o4421J04694R0939K335m8023r8210o289K7618J5228J2117N2503M5284
$$ -45554 -109975 -5281 85658 87993 39970 -58240 -64529 -36911 -21683 -9566 42937 88221
13015H8221p1523j00862p7116k7033J9641J14888O1228p2807l9378m3860K1075
$$ 88221 16698 -84164 -161280 -188313 -168672 -53784 7444 -65363 -104741 -148601 -127526
13004a27526j538P8450K0511O439P0354l3075M3330L0085l4545K4585J23207M5089
$$ -127526 -129064 -50614 -30103 -23664 46690 13615 56945 87030 52485 77070 200277 245366
12992B45366j23825j10203r618n695j987m0764l8189M8844O773j4611N9503K998
$$ 245366 121541 11338 1720 -3975 -5962 -46726 -84915 -36071 -29298 -43909 15594 18592
12980A8592N0356j01185L4872M4102l4570J5189L5950Q951j13451k8340J08235
$$ 18592 68948 -32237 2635 46737 12167 27356 63306 72257 -41194 -69534 38701
12969C8701N2104R799j0834m1286l1786j4587j3279j7347m4237J1670M8155M1788
$$ 38701 90805 100604 89770 48484 16698 2111 -11168 -28515 -72752 -61082 -12927 28861
12957B8861M0517N3853m9006K1003m2074m8378o6576J4970M9826j7769M8141n054
$$ 28861 69378 123231 74225 95228 53154 4776 -61800 -46830 2996 -14773 33368 28314
12945B8314Q1168l5262j868m0265M5713k6456J42734R843o106j1080o6678l9098
$$ 28314 109482 74220 72352 32087 77800 51344 194078 203921 197815 186735 120057 80959
12933H0959q512k1675k0519M622j0458n5577L625K1089j4457j7407k765o710Q6634
$$ 80959 72447 50772 30253 34875 24417 -31160 -27535 -6446 -20903 -38310 -41075 -47785 38849
12920C8849k0562q1807j1126L7363Q9170N574O9352M1433j5572q6364J4755Q5971
$$ 38849 18287 -63520 -74646 -37283 51887 57461 126813 168246 152674 66310 81065 167036
12908A67036P2894K4783p3195J3753J8880n5522j28416p0239L3093M5709N42p1252
$$ 167036 239930 264713 191518 205271 224151 168629 40213 -30026 3067 48776 49318 -21934
12896b1934l6811m1026J210L1348J6494k1091O9396J14989K2773n4676l0991Q0754
$$ -21934 -58745 -99771 -98561 -67213 -50719 -71810 -2414 112575 135348 80672 49681 130435
12884A30435L751m2116m199m2677j41233L9689N0245N121M2929o1M4295J6828
$$ 130435 134186 92070 87871 45194 -96039 -56350 -6105 -984 41945 41884 86179 103007
12872A03007j680n4942n1258P990M1872M5689J4949l4925l6905J6483q2100j50632
$$ 103007 101327 46385 -4873 3117 44989 90678 105627 70702 33797 50280 -31820 -182452
12860a82452q307Q1380M4007j919j155J8468M7139k355m970R18M2424M1742k0515
$$ -182452 -190759 -109379 -65372 -67291 -68446 -49978 -2839 -5194 -10164 -9246 33178 74920 54405
12847E4405j9402M0203L5529n1844l2956p6223m2470K252M9193k332m2846J5267
$$ 54405 35003 75206 110735 58891 25935 -50288 -92758 -90506 -41313 -43645 -86491 -71224
12835g1224Q3526J13789j3283j01740n712M5897l3382n1490p943n2407L0149M1387
$$ -71224 12302 126091 112808 11068 5356 51253 17871 -33619 -41562 -93969 -63820 -22433
12823b2433j7864l2962k1637M9181N2968K4116k6048o2129M987P5774J6136N4302
$$ -22433 -40297 -73259 -94896 -45715 7253 31369 5321 -56808 -51821 23953 40089 94391
12811I4391K9580p0650J4258n8940o9461J8073K8120L7302L0602K3678o2257q2684
$$ 94391 123971 53321 67579 8639 -60822 -42749 -14629 22673 53275 76953 14696 -67988
12799f7988K6421J14411L5625j12412k4262P130p519l720o8761Q545k343j3058
$$ -67988 -41567 72844 108469 -3943 -28205 -21075 -28594 -32314 -101075 -92530 -94873 -107931
12787a07931r644P8354K8475l516J4604o4457k3897N0761O8952p9441K0670R9935
$$ -107931 -117575 -39221 -10746 -14262 342 -64115 -88012 -37251 31701 -47740 -27070 72865
12775G2865J2448J540m9039k4178j872Q6454J8638p9319m6096R928L4104J5294
$$ 72865 85313 86853 37814 13636 11764 98218 116856 37537 -8559 1369 35473 50767
12763E0767o3653l2590O452J16640N4720n1083l5334k0071m2275l5432j8606K8481
$$ 50767 -12886 -45476 -39024 77616 132336 81253 45919 25848 -16427 -51859 -70465 -41984
12751d1984J609K2991o6948K6907J16312L7249p6526o3556j2609j9510Q2411N0716
$$ -41984 -40375 -17384 -84332 -57425 58887 96136 19610 -43946 -56555 -76065 6346 57062
12739E7062l454L0845m3670o3862n0445K5542K7031j1848m7672M1169k3301M0148
$$ 57062 53608 84453 40783 -23079 -73524 -47982 -20951 -32799 -80471 -39302 -62603 -22455
12727b2455N3193p987K7239k2452M9569J1993k4196l5014p7053j6898n0414L3385
$$ -22455 30738 22751 49990 27538 77107 89100 64904 29890 -47163 -64061 -114475 -81090
12715h1090O0822k181N3542K1630m239M930N3199o5279j770j568M4573m448q1475
$$ -81090 -20268 -22449 31093 52723 48484 53414 106613 41334 39564 37996 82569 78121 -3354
12702c354q615R2072o0385p0335J23716K3396r442L4578k2869j26071n0355L8360
$$ -3354 -11969 80103 19718 -50617 73099 96495 87053 121631 98762 -27309 -77664 -39304
12690c9304L4391N7910n2123o418O0613K5949K1036j03224M8840J1057p730K2276
$$ -39304 -4913 52997 874 -5544 55069 81018 102054 -1170 47670 58727 50997 73273
12678G3273Q63N3390K0906m3198r4805J1180l3726l4385J741l0341K7932j5525
$$ 73273 74136 127526 148432 105234 10429 21609 -12117 -46502 -44761 -75102 -47170 -62695
12666f2695k476L2470K0309N566K8528n1088l688m726j3461m0297N4569q8844
$$ -62695 -65171 -32701 -12392 -6826 21702 -29386 -33074 -37800 -51261 -91558 -36989 -125833
12654a25833Q930L0878l0500K5639K0729R8394K7906Q0610k8381o4427L4628k0417
$$ -125833 -116903 -86025 -116525 -90886 -70157 28237 56143 136753 108372 43945 78573 58156
12642E8156m0151R0154K0887o0763l8072K395j12880k5933L5472j9633L2733m1585
$$ 58156 18005 108159 129046 68283 30211 32606 -80274 -106207 -70735 -90368 -57635 -99220
12630i9220j6603J12965P4805r570m6672M5929K5588K0963p1598l7069P8474o1265
$$ -99220 -115823 -2858 71947 62377 15705 61634 87222 108185 36587 -482 77992 16727
12618A6727o6254P8215J1694L6709k5973q8536q1078J51975O376j3851r855R3721
$$ 16727 -49527 28688 40382 77091 51118 -37418 -118496 33479 39855 26004 16149 109870
12606A09870J02443K2223j0861j7915j09841j29488k0275N5921L6197O0630j2566
$$ 109870 212313 234536 223675 205760 95919 -33569 -53844 2077 38274 98904 86338
12595H6338l8533m0124M0251K9067J6125n690K1615o0170j23666m5590M8524m8328
$$ 86338 47805 7681 47932 76999 93124 87434 109049 48879 -74787 -120377 -71853 -120181
12583a20181M3769R3309k2060Q6742N7605m0872L5389j8693n8224J9413O3453
$$ -120181 -76412 16897 -5163 81579 139184 98312 133701 115008 56784 76197 139650
12572A39650P193n9277n694m4511p5441L756J27077j4574m562N7024j5422j3183
$$ 139650 146843 87566 81872 37361 -38080 -34324 92753 78179 73617 130641 115219 102036
12560A02036L6305l7900m1717L3456m0466o4887l3432O1996J1842R50k0733k7709
$$ 102036 138341 100441 58724 92180 51714 -13173 -46605 15391 27233 28183 7450 -20259
12548b0259j8646J734o525K4258o6910P6406R5170q320o7204k1345R099L7859
$$ -20259 -38905 -37171 -43696 -19438 -86348 -9942 85228 76908 9704 -11641 -2542 35317
12536C5317K7240L7137l0053Q492J13186m4677k7621n6372J8185p4921M012L2541
$$ 35317 62557 99694 69641 78133 191319 146642 119021 62649 80834 5913 9925 42466
12524D2466J8747J9796n5098o3385l6540L2092n930J03391o721j3875M1233n9762
$$ 42466 61213 81009 25911 -37474 -74014 -41922 -47852 55539 48818 34943 76176 16414
12512A6414o6110j371M6945L3903j2263O759n8450J1978K9231k1852o0135q4715
$$ 16414 -49696 -51067 -4122 29781 17518 24277 -34173 -22195 7036 -14816 -74951 -159666
12500a59666Q1824N0904r4226j2243J0680O3345N8156O2860M2318p071j8500L2568
$$ -159666 -77842 -26938 -121164 -133407 -122727 -59382 -1226 61634 103952 96881 78381 110949
12488A10949n082k1913J1009P7208L297k7284m8231o5229j0227l0701J6288N1034
$$ 110949 105867 83954 94963 172171 175468 148184 99953 34724 24497 -6204 10084 61118
12476F1118M7412k4365k5269J32043J32469o1858j02521J5822Q6535P1542n1325
$$ 61118 108530 84165 58896 190939 323408 261550 159029 174851 261386 332928 281603
12465B81603j25475j11813k0333k7655j9999R5136J8816j780K9210j00894q2330
$$ 281603 156128 44315 23982 -3673 -23672 71464 90280 88500 117710 16816 -65514
12454f5514k3148K5339M7441M6677J04528l8107l0129n2722r6067k1787R8341
$$ -65514 -88662 -63323 -15882 30795 135323 97216 67087 14365 -81702 -103489 -5148
12443e148L6400k7138p680J8310o1240n4416R8939P9576o1647k2532O0794K3960
$$ -5148 31252 4114 -3566 14744 -46496 -100912 -1973 77603 15956 -6576 54218 78178
12431G8178K0761L3413R513L8111L5370m1115l9284j4649r8360j12913N9779J01955
$$ 78178 98939 132352 141865 179976 215346 174231 134947 120298 21938 -90975 -31196 70759
12419G0759J2091P8674O5939j1842p4680m8136j4116l5846p5004l9204l7843R5672
$$ 70759 82850 161524 227463 215621 140941 92805 78689 42843 -32161 -71365 -109208 -13536
12407a3536R6935L6844j01831o6688N5414R4460J5782P464J7709k7020m0419m954
$$ -13536 83399 120243 18412 -48276 7138 101598 117380 124844 142553 115533 75114 70160
12395G0160k9174n2345M943l212j804M7388O2903L612p7630r134J8760m5848j7929
$$ 70160 40986 -11359 -6416 -9628 -11432 35956 98859 102471 24841 15707 34467 -11381 -29310
12382b9310N0768K917R6938O7591J9631j8691j42857j19900J781Q2624J40916
$$ -29310 21458 24375 121313 188904 208535 189844 46987 -72913 -71132 11492 152408
12371A52408O4645j05441l8742Q800O1089k276o63M4559j8561k9935o8193o3676
$$ 152408 217053 111612 72870 81670 142759 140483 139820 184379 165818 135883 67690 4014
12359D014q644R6920k0675q091n1579M617l8097l7184J77423Q9287P1869P511
$$ 4014 -4630 92290 71615 63524 11945 16562 -21535 -58719 118704 207991 279860 287371
12347B87371j23416n5020J310K0145P750j3545r0127q3257N0675O1378j1692m9236
$$ 287371 163955 108935 110245 130390 138140 124595 34468 -48789 1886 63264 51572 2336
12335B336k6394j2947M726M9553n154m0322L1342K4650o9158l3042N8390L2965
$$ 2336 -24058 -37005 -32279 17274 12120 -28202 3140 27790 -41368 -74410 -16020 16945
12323A6945l6913M2189N619N9752N351j39179k7006M3869P2793M6847j11145l3474
$$ 16945 -19968 22221 27840 87592 92943 -46236 -73242 -29373 43420 90267 -20878 -54352
12311e4352J14468J0326m3093j4838m0428M021R1931N2592p3557r8491J1549O0741
$$ -54352 60116 70442 27349 12511 -27917 -23896 68035 120627 47070 -51421 -39872 20869
12299B0869L0209j3550M5147P6331L9814J1160K8931K5217r213n745L6478P705
$$ 20869 51078 37528 82675 159006 198820 209980 238911 264128 254915 249170 285648 293353
12287B93353J6241O2490N0P4006J06534K07651J60468K23045N07885R51496J568351
$$ 293353 309594 372084 372134 446140 552674 760325 920793 1143838 1651723 2603219 4171570
12276D171570K091557J554509o49077k509799j866237r60572o00552l14828k18506
$$ 4171570 6263127 7817636 7168559 4658760 2792523 1831951 1231399 916571 698065
12267F98065k06828p2824j4621p6092k5920K4628j9960n3855m7299l2058q9387
$$ 698065 491237 418413 403792 327700 301780 326408 306448 252593 205294 173236 83849
12256H3849j4739n123O8060N8178l1760l1419j15881l2472L3706Q7082k2119k9054
$$ 83849 69110 63987 132047 190225 158465 127046 11165 -21307 12399 99481 77362 48308
12244D8308p121k365M3821N4594j1237j4266l1372M8366l1732j8952o0632l4118
$$ 48308 41187 38822 82643 137237 126000 111734 80362 128728 96996 78044 17412 -16706
12232a6706K9151o743k9642l2351J4389k4483k6560m305o0562n04J19789L2099
$$ -16706 12445 5702 -23940 -56291 -41902 -66385 -92945 -97250 -157812 -158316 -38527 -6428
12220f428m8185q43l5266K26P8030P3928K1110n6m1400l3684J06693n3081k1868
$$ -6428 -54613 -55456 -90722 -90496 -12466 61462 82572 82516 41116 7432 114125 61044 39176
12207C9176j24878L6788K4478j8873K1291L6685j1301J123K9956K4856j9175m0787
$$ 39176 -85702 -48914 -24436 -43309 -22018 14667 3366 4489 34445 59301 40126 -661
12195f61q488J8756L1063j4086o396k7651K5466O1641L3225L3594J4798j16631
$$ -661 -9149 9607 40670 26584 20188 -7463 18003 79644 112869 146463 161261 44630
12183D4630n173O8184j323J3715Q1334J37074J45394m459k8578k9870m9338l0552
$$ 44630 39457 107641 106318 120033 201367 338441 483835 479376 450798 420928 371590 341038
12171C41038j19850j20335k4469J8396N771q5200n7156K945J9038j6707J7277
$$ 341038 221188 100853 76384 94780 100551 15351 -41805 -38860 -19822 -36529 -19252
12160a9252J00854K3240K2431l9783k9236j3057K8626l2849n6398Q02k7644k9206
$$ -19252 81602 104842 127273 87490 58254 45197 73823 40974 -15424 -14622 -42266 -71472
12148g1472Q0936L4803m0511k8774L8154O8398j9445o5414O1106J22490J28607
$$ -71472 9464 44267 3756 -25018 13136 81534 62089 -3325 57781 180271 308878
12137C08878k5193l6149p7833j5882l5156j2767n651j0665P805k201l1202m8378
$$ 308878 283685 247536 169703 153821 118665 105898 100247 89582 97387 95186 63984 15606
12125A5606l7618P7181L7981P367J9605M3589M5035K6429K888m4382r485K9371
$$ 15606 -22012 55169 93150 100517 120122 163711 208746 235175 238063 193681 184196 213567
12113B13567M2522r5199j4456n7372N0570j3945j04421R8332L7126P1588L3137
$$ 213567 256089 160890 146434 89062 139632 125687 21266 119598 156724 228312 261449
12102B61449j5242q2028o9156j8881J08235q6231p661n4603o1463M9846N7327
$$ 261449 246207 164179 95023 76142 184377 98146 90485 35882 -25581 24265 81592
12091H1592K8458N1443K2249n1647j4138O053J4304P5408M6379P7950q319J9747
$$ 81592 110050 161493 183742 132095 117957 124010 138314 213722 260101 338051 329732 349479
12079C49479M2549p2046l7341k3429k5432Q133m6121m82l6044j18253r7756k5544
$$ 349479 392028 319982 282641 259212 233780 241913 195792 195310 159266 41013 -56743 -82287
12067h2287N5735M1926n1292k7381L4531J08355N0626P151K3770j11546l5965
$$ -82287 -26552 15374 -35918 -63299 -28768 79587 130213 137364 161134 49588 13623
12056A3623m8843j1165K7638J40621K22270J20738J11330J03060J06939M9844
$$ 13623 -35220 -46385 -18747 121874 344144 464882 576212 679272 786211 836055
12046H36055Q2165j4755j59168j00599l9418J6699L5523J6917n7388r5088k6927
$$ 836055 918220 903465 744297 643698 604280 620979 656502 673419 616031 520943 494016
12035D94016K8435k0970j248j0638k3654m3646l4717r0959J1216J38860m1803
$$ 494016 522451 501481 500233 489595 465941 422295 387578 296619 307835 446695 404892
12024D04892p1327K6448K4060R1469R7360J4841q6894n0666N5303m1472l5456
$$ 404892 333565 360013 384073 475542 572902 587743 500849 450183 505486 464014 428558
12013D28558k7641N2266K8381j2756k444J08252O1644L8724j3562J08583m7159
$$ 428558 400917 453183 481564 468808 466364 574616 636260 674984 661422 770005 722846
12002G22846l9784N8693k1902r603J5428j9265l8922l5705R2146N2403J7405N0834
$$ 722846 683062 741755 719853 710250 725678 706413 667491 631786 723932 776335 793740 844574
11990H44574o1934L2345J25406J14840M0148q761J8635n0525m1975Q435O042J5717
$$ 844574 782640 814985 940391 1055231 1095379 1086618 1105253 1054728 1012753 1021188 1027230 1042947
11978A042947N4257k8775O3744P5012P1481R8102J33136o494O7914R6416M6783
$$ 1042947 1097204 1068429 1132173 1207185 1278666 1376768 1509904 1503410 1571324 1667740 1714523
11967A714523L3490j7785Q0350O889L0320J21008J23318R7187O8778J34720K28901
$$ 1714523 1748013 1730228 1810578 1817467 1847787 1968795 2092113 2189300 2258078 2392798 2621699
11956B621699K09162L14784L11332K43952J38481R5220K46651L25850K77846L18278
$$ 2621699 2830861 3145645 3456977 3700929 3839410 3934630 4181281 4507131 4784977 5103255
11946E103255M43784N14290O48339O81264P71775R04530J078561J221756J481047
$$ 5103255 5547039 6061329 6709668 7390932 8162707 9067237 10145798 11367554 12848601
11937A2848601J904349K233376K685237L568701M635361O188871Q665719J2259498
$$ 12848601 14752950 16986326 19671563 23240264 27875625 34064496 42730215 54989713
11929E4989713J8096019K7778075M3619102O8298475R9692146J21193421R0083328
$$ 54989713 73085732 100863807 144482909 212781384 312473530 433666951 523750279
11922E23750279j7045002j19982966j28735393q6419785n1982788l2055578k0718647
$$ 523750279 506705277 386722311 257986918 171567133 119584345 87528767 66810120
11915F6810120j3977436r836551p281714n515041m266995l467352k928574k447237
$$ 66810120 52832684 42996133 35714419 30199378 25932383 22465031 19536457 17089220
11907A7089220j994608j597256j389613j205910j075645r07211p61740o19025
$$ 17089220 15094612 13497356 12107743 10901833 9826188 8918977 8157237 7538212
11899G538212m87144m03634l72774k88683q1574J02825K91044M40523N37829N11440
$$ 7538212 7051068 6647434 6274660 5985977 5904403 6007228 6298272 6738795 7276624 7788064
11889G788064N88764P26438O46771M15466P2098m01633q28500r94507q91416q70881
$$ 7788064 8376828 9103266 9750037 10165503 10237601 9835968 9007468 8012961 7121545 6250664
11879F250664q19122o81015o98782o52188m45647l29749l49252k79753k41042
$$ 6250664 5431542 4750527 4051745 3399557 2953910 2624161 2274909 1995156 1754114
11870A754114j90503p6975L060j02612k08094o6763o4582o1930r8851q6646k2484
$$ 1754114 1563611 1486636 1489696 1387084 1178990 1112227 1047645 985715 886864 800218 777734
11859G77734N0637J8229p5702m5579Q160O366r376l031k0950l0867r1467k8677
$$ 777734 828371 846600 770898 725319 733479 739845 730469 727438 706488 675621 584154 555477
11847E55477m2908j5494k8104j30300L2927N6093k4645J1253r364l3784j0700
$$ 555477 512569 497075 468971 338671 371598 427691 403046 414299 404935 371151 360451
11836C60451k3500q8300k1663m6768L481L5220R70N3867K3135l9956r2271n0059
$$ 360451 336951 248651 226988 180220 183701 218921 219891 273758 296893 256937 164666 114607
11824A14607m7357J225R4040P2170k3326l6636K46M8721P074l1356r7069j08378
$$ 114607 67250 68475 162515 234685 211359 174723 174969 223690 230764 199408 102339 -6039
11812f039P44L6038N2651L6912l5661k9392j02900J2549p4137n8911N2397j7693
$$ -6039 -5295 30743 83394 120306 84645 55253 -47647 -35098 -109235 -168146 -115749 -133442
11800a33442j05914j6281K9238O5755J36790J97099J85998N6077q8329m6516L0533
$$ -133442 -239356 -255637 -226399 -160644 -23854 173245 359243 415320 326991 280475 311008
11789C11008Q5331r4413n6403k2312J16727J27275M4294p8000p7047p727l7001
$$ 311008 396339 301926 245523 223211 339938 467213 511507 433507 356460 348733 311732
11778C11732K6184o7255m1190j6385J2792k1431k0154n0110q3054l3137q391P4430
$$ 311732 337916 270661 229471 213086 225878 204447 184293 134183 51129 17992 9601 84031
11766H4031J35017L6860k1382j5468N0023L2016p0034q5806l4126K3548L2783
$$ 84031 219048 255908 234526 219058 269081 301097 231063 145257 111131 134679 167462
11755A67462j3993r022n617O5967P060J168r997j3365J4318K7281j3038r66o149
$$ 167462 153469 144447 138830 204797 211857 213025 203028 189663 203981 231262 218224 217258 211109
11742B11109j38891j66404M9556K6208K0107P2923L7907l903L6629L9512j733
$$ 211109 72218 -94186 -44630 -18422 1685 74608 112515 108612 145241 184753 183020
11731A83020m7118l6651l9337n7945m9991l5764P5638j4283K5894N3582M800R490
$$ 183020 135902 99251 59914 1969 -48022 -83786 -8148 -22431 3463 57045 61845 71335
11719G1335P3350R0083K9560m4644k8139J4530j2950M9282k9583l6985p6082k7970
$$ 71335 144685 234768 264328 219684 191545 206075 193125 242407 212824 175839 99757 71787
11707G1787K7506l9450J8054L9807K4211J8401m4967n3908O9158P4203k4527p654
$$ 71787 99293 59843 77897 117704 141915 160316 115349 61441 130599 204802 180275 172621
11695A72621j3650m4711m5790q0730J5933K1187k1088M8199L0491R4959p6403
$$ 172621 158971 114260 68470 -12260 3673 24860 3772 51971 82462 177421 101018
11684A01018j56043k8347m4060n0402J26812J21188P3340k1295J211l9677K4104
$$ 101018 -55025 -83372 -127432 -177834 -51022 70166 143506 122211 123422 83745 107849
11673A07849J143L272m515P081l047K8956n3885n1933m071K4568q9823M6123N1561
$$ 107849 108992 112264 107749 114830 111783 140739 86854 34921 30850 55418 -34405 11718 63279
11660F3279n777Q5103j6124o9259q273O2254r7379J14676P8995n2098L4616p3105
$$ 63279 57502 142605 126481 57222 48949 111203 13824 128500 207495 155397 190013 116908
11648A16908q4857m59j6005L5477o2194k5899j2725K8588K1132N932K7378K9269
$$ 116908 32051 31592 15587 51064 -11130 -37029 -49754 -21166 -34 5898 33276 62545
11636F2545J299N8341J4024m9532m6437J0207o0649l4338N9385O9151m5169k9570
$$ 62545 63844 122185 136209 86677 40240 50447 -10202 -44540 14845 83996 38827 9257
11624I257K0587L4586j8462r9078R0986K2130R863M6165n3381N3622J50290r7205
$$ 9257 29844 64430 45968 -53110 37876 60006 69869 116034 62653 116275 266565 169360
11612A69360j26933m3829M7778M1400j1897o7555M0865L854L3941j1876m5363
$$ 169360 42427 -1402 46376 87776 75879 8324 49189 53043 86984 75108 29745
11601B9745l1597J7561J2879L846p702o8326P1304N0280J9091k2423j4806M7892
$$ 29745 -1852 15709 28588 32434 24732 -43594 27710 77990 97081 74658 59852 107744
11589A07744K7451p1169q7894R4050J16244M799n5345J4298N411o9782n5700k445
$$ 107744 135195 64026 -23868 70182 186426 191225 135880 150178 155589 85807 30107 27662
11577B7662r0876n1913L0019J15063l6940p1461M7281M1903m0722n8108q0091
$$ 27662 -63214 -115127 -85108 29955 -6985 -78446 -31165 10738 -29984 -88092 -168183
11566a68183K0182Q155k0965M6063M4635M0828K3710k0192j6494l8535K5497n3833
$$ -168183 -148001 -139846 -160811 -114748 -70113 -29285 -5575 -25767 -42261 -80796 -55299 -109132
11554a09132K2272P3785l3875l0651L7267j7571K0875J4790o087J6303L9348k4533
$$ -109132 -86860 -13075 -46950 -77601 -40334 -57905 -37030 -22240 -28327 -12024 27324 2791
11542B791O562p3802K8110L1111J244k2876m2679l3177M3781K6136N4907L4882
$$ 2791 9353 -64449 -36339 -5228 -3984 -26860 -69539 -102716 -58935 -32799 22108 56990
11530E6990K0475K114j6352J8494l992m6084k3568K08J01643j6217k6604m5323
$$ 56990 77465 79579 63227 81721 77729 31645 8077 8285 109928 93711 67107 21784
11518B1784k5147M6616j62O5378O5819j1331l3052L056k3058j3971j9037N65J225
$$ 21784 -3363 43253 43091 108469 174288 162957 129905 132961 109903 95932 76895 77460 78685
11505G8685n1078m0906J996L0014L8238N1379k4511o7609j3796m9205n1309l4397
$$ 78685 27607 -13299 -11303 18711 56949 108328 83817 16208 2412 -46793 -98102 -132499
11493a32499K3053p944k2703m0806m3128n3228N737N3411N9725J57181Q624q3539
$$ -132499 -109446 -117390 -140093 -180899 -224027 -277255 -271518 -218107 -158382 -1201 7423 -76116
11481g6116K896M9948L6426J934l0804n2309l2295n329m079q07L2621L2088M8041
$$ -76116 -73220 -23272 13154 15088 -15716 -68025 -100320 -105649 -109728 -110535 -77914 -45826 2215
11468B215j2667n7159K1664Q7228j3910k3439O5973J454J1214k2504o1668k8385
$$ 2215 -10452 -67611 -45947 41281 27371 3932 69905 71359 82573 60069 -1599 -29984
11456b9984l3450l5283j03863P467N4917r72P1878P100q434K4323M1530N613m0691
$$ -29984 -63434 -98717 -202580 -195113 -140196 -141168 -69290 -62190 -70624 -46301 -4771 842 -39849
11443c9849j6079L0580q096L2510K6186M0421M6940q4015l5879n1841M4718K2449
$$ -39849 -55928 -25348 -33444 -934 25252 65673 112613 28598 -7281 -59122 -14404 8045
11431H045m0191k3091k9298j5577J37897L5767K7945J09185l9164o7623r9955
$$ 8045 -32146 -55237 -84535 -100112 37785 73552 101497 210682 171518 103895 3940
11420C940n4151O1949O2443m6895N241R906m7926j4145K1619K9567P8372K6580
$$ 3940 -50211 11738 74181 27286 32527 42433 -5493 -19638 1981 31548 109920 136500
11408A36500j03047m8699j39648L708J50198Q8287R2233K8740k7143o2358j5280
$$ 136500 33453 -15246 -154894 -151186 -988 87299 179532 208272 181129 118771 103491
11397A03491M482j5613j2049J10j5160m5196k1468k3938L6785k5954q1132O7346
$$ 103491 107973 92360 80311 80421 65261 20065 -1403 -25341 11444 -14510 -95642 -28296
11385b8296J0496k1178P314m6277O7264R1227l9392J5592L7654J8287l2041r4835
$$ -28296 -17800 -38978 -31664 -77941 -10677 80550 41158 56750 94404 112691 80650 -14185
11373a4185j1568J3841N4438O7146K7646n2429K904N2172j3026q3248l1038j00508
$$ -14185 -25753 -11912 42526 109672 137318 84889 87793 139965 126939 43691 12653 -87855
11361h7855J6877K2853p174M4269N6270Q992q8752p9188n127L8017R0209L0795
$$ -87855 -70978 -48125 -55299 -11030 45240 54232 -34520 -113708 -118835 -80818 9391 40186
11349D0186R0757p5011m6666j04412J2746R1587q593O8415L5304k4951K5993K0227
$$ 40186 130943 55932 9266 -95146 -82400 9187 594 69009 104313 79362 105355 125582
11337A25582j4473j34037l6340N7718j628n1011l0327J2116M6659P2137o3752
$$ 125582 111109 -22928 -59268 -1550 -3178 -54189 -84516 -72400 -25741 46396 -17356
11326a7356m8829N3526K7098k1690R3972P2697k5419j829m9076O619r098o6075
$$ -17356 -66185 -12659 14439 -7251 86721 159418 133999 132170 83094 89713 80615 14540
11314A4540l9125K613l7061p9106p3498r844Q0155K4673O0731m497L6462J13762
$$ 14540 -24585 -21972 -59033 -138139 -211637 -221481 -141326 -116653 -55922 -60419 -23957 89805
11302H9805P7592M2974k7801j03391k9853J5095J76r090L7932O6173l8815R3397
$$ 89805 167397 210371 182570 79179 49326 64421 64597 55507 93439 159612 120797 214194
11290B14194Q63p6121j10665j05912j2052J09456l6240l4315l026P9240K9831
$$ 214194 215057 138936 28271 -77641 -89693 19763 -16477 -50792 -53818 25422 55253
11279E5253q818q9635j9805L0135R8061K3972j4778J02534Q257k2668r2198j02287
$$ 55253 46435 -43200 -63005 -32870 65191 89163 74385 176919 185176 162508 70310 -31977
11267c1977J8492P8464m6420Q289Q302k3344q0389n2878Q8901J9631Q0840N1909
$$ -31977 -13485 64979 18559 26848 35150 11806 -68583 -121461 -32560 -12929 67911 119820
11255A19820L5021l0128l4269L4040o73j690j0159l1916n1778k7130N9735J0017
$$ 119820 154841 124713 90444 124484 123811 122121 111962 80046 28268 1138 60873 70890
11243G0890l4903n185k4908q2849M6319Q6457P443m2671j5937K4033r103L7039
$$ 70890 35987 30802 5894 -76955 -30636 55821 63264 20593 4656 28689 19586 56625
11231E6625l8693M851K385K8163m353k4363p8202R63M0546Q8781k5990p5720m1515
$$ 56625 17932 22783 25168 53331 48978 24615 -53587 -52624 -12078 76703 50713 -25007 -66522
11218f6522K6128N2392l9961p0553R5039Q8521m9382R1195P0830l216K6512n5381
$$ -66522 -40394 11998 -27963 -98516 -3477 85044 35662 126857 197687 194471 220983 165602
11206A65602n0592L1002J4456j4320m6837O4423n8055o1177m4218J0379m3508
$$ 165602 115010 146012 160468 146148 99311 163734 105679 44502 284 10663 -32845
11195c2845l3151j7244k8562N0026M2671j2078m3628o3307k4516N8067K368k0441
$$ -32845 -65996 -83240 -111802 -61776 -19105 -31183 -74811 -138118 -162634 -104567 -102199 -122640
11183a22640J5397O1467M2044J3000o330K8034q4407J5887M4492k0185N1002Q80
$$ -122640 -107243 -45776 -3732 9268 2938 30972 -53435 -37548 6944 -13241 37761 38641
11171C8641K6791o8825q1457O9293M6587K2245j7891j25N6258N3323M893m1770
$$ 38641 65432 -3393 -84850 -15557 31030 53275 35384 35259 91517 144840 149733 107963
11159A07963q381L5699J5871m5325j2713p4360O028N0752k2384m789j6786p0778
$$ 107963 99582 135281 151152 105827 93114 18754 24782 75534 53150 48361 31575 -39203
11147c9203j2059o978J6081J4235o169m6217K0400O9693m5256L012o3894r5588
$$ -39203 -51262 -58240 -42159 -27924 -34093 -80310 -59910 9783 -35473 -32461 -96355 -191943
11135a91943N2272M1566N0340L5457O441L1659k6671K8828K7908J8317o573L0979
$$ -191943 -139671 -98105 -47765 -12308 -5867 25792 -879 27949 55857 74174 67601 98580
11123I8580r366q7538m9347k3832O1062O8038N9795j1510K9982p4556o8704M4637
$$ 98580 89214 1676 -47671 -71503 -10441 57597 117392 105882 135864 61308 -7396 37241
11111C7241o8611j00688K8644Q5283L2688k0555j43576m4127P9846J00366Q8325
$$ 37241 -31370 -132058 -103414 -18131 14557 -5998 -149574 -193701 -113855 -13489 74836
11100G4836K4668Q6659Q705j3031n3081m2405q3607n9376J8106J0905M5479k1593
$$ 74836 99504 186163 194868 181837 128756 86351 2744 -56632 -38526 -27621 17858 -3735
11088c735m812k3117q8555n0954L2117J11165k6441n4996o8623K7485J45379L6314
$$ -3735 -8547 -31664 -120219 -171173 -139056 -27891 -54332 -109328 -177951 -150466 -5087 31227
11076C1227n0195Q0953n8671o5221O498r019O4763Q966k3051O4944J3344P6961
$$ 31227 -18968 61985 3314 -61907 -55409 -64428 335 9301 -13750 51194 64538 141499
11064A41499k5017J4678l8820Q128l123Q5245r700j11747q3635N1634j0521Q3278
$$ 141499 116482 131160 92340 100468 97345 182590 172890 61143 -22492 29142 18621 101899
11052A01899K0286k2479J6057J966O4559P3545M1870K5211N678O3614N6998n3193
$$ 101899 122185 99706 115763 117729 182288 255833 297703 322914 328592 392206 449204 396011
11040C96011j22062J3703O4365Q6575J1423J5017J13857R3390K2043m15k246o4317
$$ 396011 273949 287652 352017 438592 450015 465032 578889 672279 694322 693907 691661 627344
11028F27344J1073K2192n0056k2057K0501J95270K08790k84o7247r3973j31947
$$ 627344 638417 660609 610553 588496 608997 804267 1013057 1012773 945526 851553 719606
11017G19606l4388m6262L2095l1310m7065N4616J06557O3399q9453o3239o5796
$$ 719606 685218 638956 671051 639741 592676 647292 753849 817248 727795 664556 598760
11006E98760n9023m2203q2671l6255j11761M295j3461l0777L30k0688m8058o4515
$$ 598760 539737 497534 414863 378608 266847 271142 257681 226904 227234 206546 158488 93973
10994I3973o3684j2384O0681J1046k6052o485L224N954O7167N1884R959j7788
$$ 93973 30289 17905 78586 89632 63580 57095 60319 66273 133440 185324 195283 177495
10982A77495l0103n6247k95l11l4064K6663k5936q1990r7137K312Q0998M5795
$$ 177495 147392 91145 90850 90539 56475 83138 57202 -24788 -121925 -119613 -38615 7180
10970G180N1933J01113o7889k5811P4631j9945O3928q1647p9294p5993K9027k1470
$$ 7180 59113 160226 92337 66526 141157 121212 185140 103493 24199 -51794 -22767 -44237
10958d4237k3484N042m1506k8268M6296M8128J7032N5828j674k9460j0455O0522
$$ -44237 -67721 -62679 -104185 -132453 -86157 -38029 -20997 34831 33157 3697 -6758 53764
10946E3764J0165R621j15138K2078O9872N8849J6143N4749p5579j20873n4390
$$ 53764 63929 73550 -41588 -19510 50362 109211 125354 180103 104524 -16349 -70739
10935g0739L5380n3785O9975J5905Q56o8833K070l794n17L2042J6922n3383k0137
$$ -70739 -35359 -89144 -19169 -3264 -2408 -71241 -69171 -72965 -73482 -41440 -24518 -77901 -98038
10922i8038j5026K4241M2024j9302P1149k1722n3098K3111Q5448j18298k2271
$$ -98038 -113064 -88823 -46799 -66101 5048 -16674 -69772 -46661 38787 -79511 -101782
10911a01782M0605k919l965l4580J95o5580J1755O5911M5666k6845J4060L4641
$$ -101782 -61177 -64096 -68061 -102641 -102446 -168026 -156271 -90360 -44694 -71539 -57479 -22838
10899b2838K9646L6147J1963o7140J859J6050k7508n9436n5073J8817J16615J3276
$$ -22838 6808 42955 54918 -12222 -10363 5687 -21821 -81257 -136330 -117513 -898 12378
10887A2378j9361n2594q506R993L8395j8854K4927R0430O3031j2271j41191q0554
$$ 12378 -6983 -59577 -68083 -58090 -19695 -38549 -13622 76808 139839 127568 -13623 -94177
10875i4177K1329J9354L0519N1355m2103o5220L1176O5351N3879K1726N0365o5484
$$ -94177 -72848 -53494 -22975 28380 -13723 -78943 -47767 17584 71463 93189 143554 78070
10863G8070j377M6293M2706K5441K3763O5811o8602j27659m369N5612N0205J4913
$$ 78070 76693 122986 165692 191133 214896 280707 212105 84446 80077 135689 185894 200807
10851B00807o2662m2384M3598j9933O028J4733l868M8478k0776n5446J7952k1277
$$ 200807 138145 95761 139359 119426 125454 140187 136319 184797 164021 108575 126527 105250
10839A05250m8788k237J7874M0727K5648l5834k8138l5180J8021m134J874P9180
$$ 105250 56462 54225 72099 112826 138474 102640 74502 39322 57343 53209 55083 134263
10827A34263J5988l8423m5486q0153l9349L0227N8298M1571k8090o2284k9074
$$ 134263 150251 111828 66342 -13811 -53160 -22933 35365 76936 48846 -13438 -42512
10816d2512R079M9566K4018M4828j10383j32396R1270J3315k3657p937L3669j1037
$$ -42512 -33433 16133 40151 84979 -25404 -157800 -66530 -53215 -76872 -84809 -51140 -62177
10804f2177M2900J1460J6442J833j5515N5460R9410k4053q2315m667N1971P5718
$$ -62177 -19277 -7817 8625 10458 -5057 50403 149813 125760 43445 38778 90749 166467
10792A66467k6897j0020p9620p9755J4208Q2663J3804k0989J15346l5697q2082
$$ 166467 139570 129550 49930 -29825 -15617 67046 80850 59861 175207 139510 57428
10781E7428n017m6153M2615N6567K8582n343o5623o348J13977J0528K4899j2155
$$ 57428 52411 6258 48873 105440 134022 128679 63056 56708 170685 181213 206112 193957
10769A93957j3961m8341q2521p346M679l6777L6382L8651K0207n3220o315l310
$$ 193957 179996 131655 49134 41788 46467 9690 46072 84723 104930 51710 45395 42085
10757D2085p493L4889l9313J122N3829N1674q891k5404k2869n3468p648M7310
$$ 42085 34592 69481 30168 31290 85119 136793 127902 102498 79629 26161 18513 65823
10745F5823M0379o0157J6265L9254L9894N91M6452r026n0666l2049m681O1161
$$ 65823 106202 46045 62310 101564 141458 142049 188501 179475 128809 96760 92079 153240
10733A53240p8182J495j9102O8931O5499J25144L2210j47651n2770n4634K2348
$$ 153240 75058 76553 57451 126382 191881 317025 349235 201584 148814 94180 116528
10722A16528J3083j3464Q9067K6893J01859K2095l0889j4310P3372r243r3864
$$ 116528 129611 116147 205214 232107 333966 356061 325172 310862 384234 374991 281127
10711B81127m8528L5782M0849k3677N1949J03791P9748J5377n3908K5759n2954
$$ 281127 232599 268381 309230 285553 337502 441293 521041 536418 482510 508269 455315
10700D55315N0229Q0169n6049j6238l4316k4715K2619k2114n201N1946L7482j1374
$$ 455315 505544 585713 529664 513426 479110 454395 477014 454900 449699 501645 539127 527753
10688E27753L2986K2681M0914j15413k1932O6053O7201p7684j79252J2379m149
$$ 527753 560739 583420 624334 508921 486989 553042 620243 542559 363307 375686 371537
10677C71537j6168P0680N7417J6419L7932R6937p7458L0865k2272m3813P8789
$$ 371537 355369 426049 483466 499885 537817 634754 557296 588161 565889 522076 600865
10666F00865J36283P0610N4699J0455p981j9006N1201K5476r708K0847P0889K0947
$$ 600865 737148 807758 862457 872912 864931 845925 897126 922602 912894 933741 1004630 1025577
10654A025577O9124J11832J61824M7430n626L9076J04401L4627n6398L1540M0961
$$ 1025577 1094701 1206533 1368357 1415787 1410161 1449237 1553638 1588265 1531867 1563407 1604368
10643A604368L2044O5850O2579J24453J87124J97146J79964K14623M08824N63327
$$ 1604368 1636412 1702262 1764841 1889294 2076418 2273564 2453528 2668151 3076975 3640302
10633C640302O42781P01743N74437K47922P4864R0887K62807M71385P92312J181567
$$ 3640302 4283083 4984826 5559263 5807185 5882049 5972936 6235743 6707128 7499440 8681007
10623H681007J629782K216410K957540L830037M950681O091140P288713Q098490
$$ 8681007 10310789 12527199 15484739 19314776 24265457 30356597 37645310 45743800
10615D5743800P234644M205478J57509k448344k764149j272999J167163M240765
$$ 45743800 52978444 57183922 57341431 54893087 52128938 50855939 52023102 56263867
10607E6263867P621607J1344811J4898246J6575612J3617570N024149n301293
$$ 56263867 63885474 75230285 90128531 106704143 120321713 125345862 120044569
10600A20044569j1346313j1092552p228073k059183L468351R198815J5084035
$$ 120044569 108698256 97605704 90377631 88318448 91786799 100985614 116069649
10593A16069649J9781755K0754660J4549746P44948j4234053k1875595k0587728
$$ 116069649 135851404 156606064 171155810 171900758 157666705 135791110 115203382
10586A15203382j5030601q635235k808606K467893P287619J0544270J0578243
$$ 115203382 100172781 91537546 88728940 91196833 98484452 109028722 119606965
10579A19606965N536628m286428j3790433j7732343j5793132j1478780p135963
$$ 119606965 125143593 120857165 107066732 89334389 73541257 62062477 54926514
10572E4926514l630051p10379J438532K650930K273320j61810m073942p505841
$$ 54926514 51296463 50586084 52024616 54675546 56948866 56787056 52713114 45207273
10564D5207273q789213p946364o300801m687003l458432k479267j821295j428659
$$ 45207273 36418060 28471696 22170895 17483892 14025460 11546193 9724898 8296239
10556H296239j165113r20203o59850o13221n29795m93729l85420l31162l06245
$$ 8296239 7131126 6210923 5551073 4937852 4408057 3914328 3528908 3197746 2891501
10547B891501k66083l37000k83304k34790j09309q0087j35393j12090o5069j21339
$$ 2891501 2625418 2288418 2005114 1770324 1661015 1580928 1445535 1333445 1268376 1147037
10537A147037l8253m6114q2597j0132l075o8104j07959J872n9107p0083l0643
$$ 1147037 1108784 1062670 980073 969941 966866 898762 790803 792675 733568 663485 632842
10526F32842q4915p7020j5600k9324n7070J11840J18756o2312j16520j20808P883
$$ 632842 547927 470907 455307 425983 368913 480753 599509 537197 420677 299869 307752
10515C07752K978M2658q7410L893J00382o4833j39950m9923J0810l053J4865k9359
$$ 307752 310730 353388 265978 269871 370253 305420 165470 115547 126357 123304 138169 108810
10503A08810J0813O9815J9926K2619P333o3518L194P7015n2420j22076r0246m3327
$$ 108810 119623 189438 209364 231983 239316 175798 178992 256007 203587 81511 -8735 -52062
10491e2062M9368O0200K4687O932r1215o5669J9950N5587N5627j06157l739N5964
$$ -52062 -2694 57506 82193 89125 -2090 -67759 -47809 7778 63405 -42752 -46491 9473
10479I473K802M7534p527M9584L6422Q248q6907o3841K9679q9873o9531o0479
$$ 9473 12275 59809 52282 101866 138288 146536 59629 -4212 25467 -64406 -133937 -194416
10467a94416P1046J05641r964M8472L4506K2886K6330J820L8864M1537p1847j7683
$$ -194416 -123370 -17729 -27693 20779 55285 78171 104501 106321 145185 186722 114875 97192
10455I7192K0110M7789q706m025j2130k7144n468M9117J10712r0355k4930l8695
$$ 97192 117302 165091 156385 152360 140230 113086 107618 156735 267447 177092 152162 113467
10443A13467j6922M6014K8722l5360l9766L6824M9894N4909J2240k2362p4417
$$ 113467 96545 142559 171281 135921 96155 132979 182873 237782 250022 227660 153243
10432A53243n3712Q0882M8511o6961o5273k5238K6470O027k9735n8622m7241Q1692
$$ 153243 99531 180413 228924 161963 96690 71452 97922 103949 74214 15592 -31649 50043
10420E0043R9695K6887P324K0848n806j55574K9944J4135j7082m3908l1921N9844
$$ 50043 149738 176625 183949 204797 198991 43417 73361 87496 70414 26506 -5415 54429
10408E4429O3251P1873m0218q752M5685l0707Q909l5187m3334O2844l9170p8358
$$ 54429 117680 189553 149335 140583 186268 155561 164470 129283 85949 148793 109623 31265
10396C1265r192L0137j8182K387O0569m789l3467M796J9768m4010j9210m0983
$$ 31265 22073 52210 34028 36415 96984 92195 58728 63524 83292 39282 20072 -20911
10384b0911N1138Q5117P2254k2082m7689L6460j6249m6754J434q898k7983m2357
$$ -20911 30227 115344 187598 165516 117827 154287 138038 91284 92718 83820 55837 13480
10372A3480J0388N0226J1745o5638J6858R5160P9283l9776o6903n7266k0750J5143
$$ 13480 23868 74094 85839 20201 37059 132219 211502 171726 104823 47557 26807 41950
10360D1950l0678o286R4839q458q0828O466M5761n5745O2618J5956j51516j14640
$$ 41950 11272 4986 99825 91367 10539 17005 62766 7021 69639 85595 -65921 -180561
10348a80561K2301J14755L2805j7030j1416L2468j4780J5082O4260n8913o7902
$$ -180561 -158260 -43505 -10700 -27730 -39146 -6678 -21458 -6376 57884 -1029 -68931
10337f8931O0627j1591J3845P2707l012q037N052l9340q1060o9923M7449M9559
$$ -68931 -8304 -19895 -6050 66657 63645 55608 60660 21320 -59740 -129663 -82214 -32655
10325c2655J1510O0582M2595L993k8493p85L8464J5147o6412q688m647j347m9917
$$ -32655 -21145 39437 82032 86025 57532 56747 95211 110358 43946 35258 30611 29264 -20653
10312b0653n7203J8423k8685J5653L8211j2816L477P4567k6173q4485l593K5620
$$ -20653 -77856 -59433 -88118 -72465 -34254 -47070 -43593 30974 4801 -79684 -83277 -57657
10300e7657K8422N362k9826j0928O2868l04Q824O1525O4517J4869n2020j03991
$$ -57657 -29235 -23873 -53699 -64627 -1759 -2063 6761 68286 132803 147672 95652 -8339
10288h339m8030P175J9640R5009M9065q5218K264R258L5414J8146p9709k8149
$$ -8339 -56369 -49194 -29554 65455 114520 29302 31566 40824 76238 94384 14675 -13474
10276a3474N6961J7754L6243N3716n521n4785l8081N0820P6693M8019K9069n5839
$$ -13474 43487 61241 97484 151200 145679 90894 52813 103633 180326 228345 257414 201575
10264B01575J5656K9315j30789l9462K7407l1047l6187J45455Q7126p7405j67024
$$ 201575 217231 246546 115757 76295 103702 72655 36468 181923 269049 191644 24620
10253B4620k9674L7361M609n9657r7431K5067N7897O4006P7151K9596K4473J1581
$$ 24620 -5054 32307 36916 -22741 -120172 -95105 -37208 26798 103949 133545 158018 169599
10241A69599j7448k05511l3168J7802O208k4547m8746J8064Q9374K1573J2395
$$ 169599 152151 -53360 -86528 -68726 -62518 -87065 -135811 -117747 -28373 -6800 5595
10230E595J2j8483m0396J7351L0064n6288p2898K0331j8306k3969R5938J30470
$$ 5595 5607 -12876 -53272 -35921 -5857 -62145 -135043 -114712 -133018 -156987 -61049 69421
10218F9421J7480m9559r0273n1024J25N0569M4050l6355K9233J2545R57l8370
$$ 69421 86901 37342 -52931 -103955 -103830 -53261 -9211 -45566 -16333 -3788 -2831 -41201
10206d1201l3058N7763O9706O7465n8711p396M6918J8582J0319L5071J9205k8032
$$ -41201 -74259 -16496 53210 120675 61964 54568 101486 120068 130387 165458 184663 156631
10194A56631K4855j6115j3512P203q2558o5646q6847j2736J18811P9827o3879
$$ 156631 181486 165371 151859 159062 76504 10858 -75989 -88725 30086 109913 46034
10183D6034J7258M9573L8057N7389M1985K6484Q4489j0410j13333J44m8784m6656
$$ 46034 63292 112865 150922 208311 250296 276780 361269 350859 237526 237670 188886 142230
10171A42230P5905J11904R9392J50503L8860l8455n2536q9181J7414M053j05189
$$ 142230 218135 330039 429431 579934 618794 580339 527803 438622 456036 460089 354900
10160C54900k8969J32554K27125J26307M5294L9375l0683j07940j52163q3279
$$ 354900 325931 458485 685610 811917 857211 896586 865903 757963 605800 522521
10150E22521o2228R821O2809k5515K2431J08608R8718k5877l8990K1349m0697
$$ 522521 460293 470114 532923 507408 529839 638447 737165 711288 672298 693647 652950
10139F52950j25490j13858n3789m7503j5206j5991l4607o03L0267q743j01689
$$ 652950 527460 413602 359813 312310 297104 281113 246506 245903 276170 267427 165738
10128A65738j00710M2434J1160m4609N032m0616j5221J3739N1928Q0607J4364
$$ 165738 65028 107462 118622 74013 79045 38429 23208 36947 88875 169482 183846
10117A83846p8267p2532o9011n5250J2000K729Q2474k2848o1238J1399n3724M6685
$$ 183846 105579 33047 -35964 -91214 -79214 -76485 5989 -16859 -78097 -66698 -120422 -73737
10105g3737N5434j3786l5019J6357K2252K1496j37968q6663P8651J26175P2007
$$ -73737 -18303 -32089 -67108 -50751 -28499 -7003 -144971 -231634 -152983 -26808 45199
10094D5199m6140k7587p354l946J8458o4117o2609N0155P5845K9508K288Q272
$$ 45199 -941 -28528 -35882 -39828 -21370 -85487 -148096 -97941 -22096 7412 9700 17972
10082A7972K9132J1882r2632j7324k9816P0076M9019j2604n4623J3597J01034
$$ 17972 47104 58986 -33646 -50970 -80786 -10710 38309 25705 -28918 -15321 85713
10071H5713p008p1495p6553Q1874N3202q2582o3394K6660m2892M5304J9834j4190
$$ 85713 78705 7210 -69343 12531 65733 -16849 -80243 -53583 -96475 -51171 -31337 -45527
10059d5527L11k0616P0617Q3110j06292L0119N1179m8796K0340J103n9925o1960
$$ -45527 -45216 -65832 4785 87895 -18397 11722 62901 14105 34445 35548 -24377 -86337
10047h6337l8707L3367M3223k6439P6967O7463n236n1845l7549j847J8178l0628
$$ -86337 -125044 -91677 -48454 -74893 2074 69537 64301 12456 -25093 -26940 -8762 -39390
10035c9390K7817R5275j8935j2429m6287r7226M0166K9634l4603r420p918K9324
$$ -39390 -11573 83702 64767 52338 6051 -91175 -51009 -21375 -55978 -65398 -73316 -43992
10023d3992k3531K2875O4454j4340m4193R679P793j6525k3552k0572l6701j21816
$$ -43992 -67523 -44648 19806 5466 -38727 -29048 -21255 -37780 -61332 -81904 -118605 -240421
10011b40421j8229Q9150Q4508L097K0637O5796n6689o8919P3561O165m2058N4836
$$ -240421 -258650 -169500 -84992 -81895 -61258 4538 -52151 -121070 -47509 -41344 -83402 -28566
9999b8566K7783L8559k0330k2297p4197p1445M5252p285k9994J40242L3658J3245
$$ -28566 -783 37776 17446 -4851 -79048 -150493 -105241 -112526 -142520 -2278 31380 44625
9987D4625J8977L2936q914J7286K6850n5518r5680k5148K8638O0559l9598q732
$$ 44625 63602 96538 87624 104910 131760 76242 -19438 -44586 -15948 44611 5013 -3719
9975c719j7572p3076o2682L6979N4104J1850O1033P932l4706M8712p047j09347
$$ -3719 -21291 -94367 -157049 -120070 -65966 -54116 6917 14849 -19857 28855 21808 -87539
9963h7539q022K0711L9588o1525k4021l7419P8005M3542k9137K1876J2724k1379
$$ -87539 -95561 -74850 -35262 -96787 -120808 -158227 -80222 -36680 -65817 -43941 -31217 -52596
9951e2596o512J7290K9039j0155n4948L9714J2049Q747K9485O0339o6016k365
$$ -52596 -59108 -41818 -12779 -22934 -77882 -38168 -26119 -17372 12113 72452 6436 4071
9939D071J3672M688l7450k7542J8941q4161N1560J62533J90837n544m7481q3356
$$ 4071 17743 22431 -15019 -42561 -23620 -107781 -56221 106312 297149 291605 244124 160768
9927A60768j4452r3423n6529k7053K1708K1204n0707j2493M2083k7748J8064L3262
$$ 160768 146316 52893 -3636 -30689 -8981 12223 -38484 -50977 -8894 -36642 -18578 14684
9915A4684o4374j07262N5061R5586J3818O9140l3984j7058K1453P8419j4055j5546
$$ 14684 -49690 -156952 -101891 -6305 7513 76653 42669 25611 47064 125483 111428 95882
9903I5882J549o2640k2348L0255N5824k3841J6042k1133M0776K1000p1354m7175
$$ 95882 97431 34791 12443 42698 98522 74681 90723 69590 110366 131366 60012 12837
9891A2837R922l0565J9528P2870j3377K7659n4799o8577K1291j0126K8111r92
$$ 12837 22759 -7806 11722 84592 71215 98874 44075 -24502 -3211 -13337 14774 13782
9879A3782o5536J5117K1506K0463o127j4265j5311J385O453k2183K9648J5583
$$ 13782 -51754 -36637 -15131 5332 -795 -15060 -30371 -28986 -22533 -44716 -15068 515
9867E15J7702o0694q7381q6215n629M435M8662M9089J2343M5279K6364q0122r4848
$$ 515 18217 -42477 -129858 -216073 -221702 -217267 -168605 -119516 -107173 -61894 -35530 -115652 -210500
9854b10500N3408P4066K1519r5568J8167N2133J2319J84K1475Q325N0752R947
$$ -210500 -157092 -83026 -61507 -157075 -138908 -86775 -74456 -74272 -52797 -44472 6280 16227
9842A6227o1350p888k5400Q5665O6629j3547m0295k2680J2742o4142l6141L5530
$$ 16227 -45123 -53011 -78411 7254 73883 60336 20041 -2639 10103 -54039 -90180 -54650
9830e4650O4188K8715k1618n9494M4996K7019m6622K3955J06009n385j4333j081
$$ -54650 9538 38253 16635 -42859 2137 29156 -17466 6489 112498 107113 92780 91699
9818I1699J6970Q105p7865p4256q549L4487m1665J0123p738k3637o738L7209j11148
$$ 91699 108669 116774 38909 -35347 -43896 -9409 -51074 -40951 -48689 -72326 -79064 -41855 -153003
9805a53003O8156O467L0586M308l8119J4979k2423K2719R4208L5097q2214n5523
$$ -153003 -84847 -78380 -47794 -43486 -81605 -66626 -89049 -66330 27878 62975 -19239 -74762
9793g4762Q602L3816K042p522p3359k3385p786O8098L4338K3743r4919L3367P3178
$$ -74762 -66160 -32344 -30302 -37824 -111183 -134568 -142354 -74256 -39918 -16175 -111094 -77727 -4549
9780d549J2530O0583J1069j05068o8645m7130J00516P3312J445p5680l2234K4159
$$ -4549 7981 68564 79633 -25435 -94080 -141210 -40694 32618 34063 -41617 -73851 -49692
9768d9692K3670l7872m8473N8179k2553K6011K2762J3707K7698j977N9736K611
$$ -49692 -26022 -63894 -112367 -54188 -76741 -50730 -27968 -14261 13437 11460 71196 73807
9756G3807o3057k7550n9779j5208J15733k0435N7221j4528p6795J6511j7935l9961
$$ 73807 10750 -16800 -76579 -91787 23946 3511 60732 46204 -30591 -14080 -32015 -71976
9744g1976P0654L1317j29789J997N2745M7815K6641p1501p8784o466j3088L7405
$$ -71976 -1322 29995 -99794 -97797 -45052 2763 29404 -42097 -120881 -127347 -140435 -103030
9732a03030Q789p2910J712P7097J9005L8776K8073o3426O7925J6292p180J9841
$$ -103030 -94241 -167151 -165439 -88342 -69337 -30561 -2488 -65914 2011 18303 11123 30964
9720C0964j0460r95k5169N7186j2468Q885q522O341q207l9697k8864k7171O5180
$$ 30964 20504 19509 -5660 51526 39058 47943 39421 45762 37555 -2142 -31006 -58177 7003
9707G003k0466N0345M8090J9376K5819p143p0566p0284r073K7568j287o944K2977
$$ 7003 -13463 36882 84972 104348 130167 123024 52458 -17826 -26899 669 -618 -7562 15415
9694A5415L1965L0953m6484m9944j0155O0083O2332j3235l4878k3297M5238O0422
$$ 15415 47380 78333 31849 -18095 -28250 31833 94165 80930 46052 22755 67993 128415
9682A28415K7880l9028p2056K3362m4079J9742L4005q1101q0290l5052K4006M0416
$$ 128415 156295 117267 45211 68573 24494 44236 78241 -2860 -83150 -118202 -94196 -53780
9670e3780n1061K4093M7469N8767o9114N7155R0403o1868k5572k8583M8001L0007
$$ -53780 -104841 -80748 -33279 25488 -43626 13529 103932 42064 16492 -12091 35910 65917
9658F5917k3526m3081K3920L288N286J10716J73260J2703j10207j71600q6870
$$ 65917 42391 -690 23230 26518 31804 142520 315780 328483 218276 46676 -40194
9647d0194M7948q943p7223k7778Q9490P4165p4265q7921j5028J02863k0457R771
$$ -40194 7754 -1189 -78412 -106190 -16700 57465 -16800 -104721 -119749 -16886 -37343 -27572
9635b7572K3009L6211R915n9932m4467n0165j1234N7622J6086L7365M0026J5196
$$ -27572 -4563 31648 41563 -18369 -62836 -113001 -124235 -66613 -50527 -13162 26864 42060
9623D2060P2858k0992n3028N680n7188l376L6037L7642O8313m7380k1879k3079
$$ 42060 114918 93926 40898 46578 -10610 -13986 22051 59693 128006 80626 58747 35668
9611C5668n6088Q756m0255O2313K8435R7442K6680p6836o3457j78393K8607J21882
$$ 35668 -20420 -11664 -51919 10394 38829 136271 162951 86115 22658 -155735 -127128 -5246
9599e246K6506L902j6905m9802M6520L5018o328o6864o2272N5607J4896n9265
$$ -5246 21260 25162 8257 -41545 4975 39993 33665 -33199 -95471 -39864 -24968 -84233
9587h4233j5355N2455J3021p325j05577k1898J10295J20472L2075j4548r6687
$$ -84233 -99588 -47133 -34112 -41437 -147014 -168912 -58617 61855 93930 79382 -17305
9576a7305o7010P090k5992r761P7013o1306M0021K1679j1631J6803K603j3798
$$ -17305 -84315 -77225 -103217 -112978 -35965 -97271 -57250 -35571 -47202 -30399 -27796 -41594
9564d1594p2018L9959Q7340M357q1711L4391j81j4134q8274M957M4055L6259k1765
$$ -41594 -113612 -73653 13687 18044 -63667 -29276 -29457 -43591 -131865 -126908 -82853 -46594 -68359
9551f8359L7749P0032K7745j6011M2693k7715q316j5834l4962L1967m3918j43563
$$ -68359 -30610 39422 67167 51156 93849 66134 57818 41984 7022 38989 -4929 -148492
9539a48492r8058Q8859Q2287R988O7959P9278j5777J3068k5O958j166j10879j04098
$$ -148492 -246550 -157691 -75404 -65416 2543 81821 66044 79112 79087 86045 84879 -26000 -130098
9526a30098r8944L4508J31344K6079k0750K7749N856O0600O9114r533o0439k3870
$$ -130098 -229042 -194534 -63190 -37111 -57861 -30112 -24256 36344 105458 95925 35486 11616
9514A1616n3004k6775Q9217M9228k6394n9345l8808O935N3407n8320k0556J7928
$$ 11616 -41388 -68163 21054 70282 43888 -15457 -54265 -47330 6077 -52243 -72799 -54871
9502e4871M0106O1788N232J7013o9757q714J3130j9561m5795j1734L9892M423
$$ -54871 -14765 47023 52255 69268 -489 -9203 3927 -15634 -61429 -73163 -33271 -28848
9490b8848k4526L179O4057l7079l8813M205L8790L7135P88l1164p4390m0122P3494
$$ -28848 -53374 -50195 13862 -23217 -62030 -57825 -19035 18100 18888 -12276 -86666 -126788 -53294
9477e3294L5740J4162k65N1762J9205r5690J3214N5067K2214n8691k1059J4467
$$ -53294 -17554 -3392 -3657 48105 67310 -28380 -15166 39901 62115 3424 -17635 -3168
9465c168L7394K0042M946j25045l0863N4341L3327l2964q0580J8266M2267j9066
$$ -3168 34226 54268 59214 -65831 -96694 -42353 -9026 -41990 -122570 -104304 -62037 -81103
9453h1103k9397L2696Q3071l296k1307K0716j7868m0153j6684L873J3293k1851
$$ -81103 -110500 -77804 5267 1971 -19336 1380 -16488 -56641 -73325 -69452 -56159 -78010
9441g8010Q8848J11723m6040o1143o224l4988l6218r1328O392M14K794M1244l8702
$$ -78010 10838 122561 76521 15378 9154 -25834 -62052 -153380 -146988 -146574 -143780 -102536 -141238
9428a41238M8917R9418R8l7088k5170R1040o3921o5872P2410P531m985k8906m7935
$$ -141238 -92321 7097 7195 -29893 -55063 35977 -27944 -93816 -21406 -13875 -18860 -47766 -95701
9415i5701J9032K3852n9706r2765J5814K1332K6056R6231r062J1732M2086l8166
$$ -95701 -76669 -52817 -112523 -205288 -189474 -168142 -142086 -45855 -54917 -43185 -1099 -39265
9403c9265p1980o3634m8622P498L3840J07312j4638o4937O7000R8178O7460K6819
$$ -39265 -111245 -174879 -223501 -216003 -182163 -74851 -89489 -154426 -87426 10752 78212 105031
9391A05031J1774o0035m8639N8101J2357k2302j7010Q626M9847p0108j24087k3142
$$ 105031 116805 56770 8131 66232 78589 56287 39277 47903 97750 27642 -96445 -119587
9379a19587N3726K1959q482N2576r171K6392j9780m7360l4117M1765m916k8191
$$ -119587 -65861 -43902 -52384 192 -8979 17413 -2367 -49727 -83844 -42079 -46995 -75186
9367g5186L8794N164k5498M9470K4128n2977p3912O8124L3804j6373m4448O255
$$ -75186 -36392 -31228 -56726 -7256 16872 -36105 -110017 -41893 -8089 -24462 -68910 -62655
9355f2655J8082P064r091Q0813N3514M2258N4972L1779q7053j22984K2093n905
$$ -62655 -44573 -37509 -46600 34213 87727 129985 184957 216736 129683 6699 28792 22887
9343B2887l6640M102M2520l8695m7827k5997Q267j8836L8196J08016J1480k5322
$$ 22887 -13753 -9651 32869 -5826 -53653 -79650 -71383 -90219 -52023 55993 67473 42151
9331D2151l1360j5252J9817J5710K2862n1433l5819j02753N263k715O9631p752
$$ 42151 10791 -4461 15356 31066 53928 2495 -33324 -136077 -130814 -133529 -63898 -71650
9319g1650K9964K5055P0391n318m2794k2224L9289M0876j2787q9918l300k3615
$$ -71650 -41686 -16631 53760 48442 5648 -16576 22713 63589 50802 -39116 -42416 -66031
9307f6031J3493L641j3283L6157R8777J09700j17051j25501k8822L1856o280k7281
$$ -66031 -52538 -48897 -62180 -26023 72754 182454 65403 -60098 -88920 -57064 -63344 -90625
9295i0625j0731L873J8042N8720L5980j01556j38190M7988O6598P1108q573n7173
$$ -90625 -101356 -97483 -79441 -20721 15259 -86297 -224487 -176499 -109901 -38793 -47366 -104539
9283a04539k2067K4618O7778N0541J5178J2312k2644m6676j0092Q3977j2088l9457
$$ -104539 -126606 -101988 -34210 16331 31509 43821 21177 -25499 -35591 48386 36298 -3159
9271c159m5776O9611P3662P7223k8292l392j3229o5421j2739M842K8441n1494
$$ -3159 -48935 20676 94338 171561 143269 139877 126648 61227 48488 53330 81771 30277
9259C0277K4314K1539P2429M9009n6368j44661m9969N9261P2646K1286n111J674
$$ 30277 54591 76130 148559 197568 141200 -3461 -53430 5831 78477 99763 94652 96326
9247I6326J9426R573n8732o3963n8312M5416Q5821K1206l1968O6682l0372l9406
$$ 96326 115752 125325 66593 2630 -55682 -10266 75555 96761 64793 131475 101103 61697
9235F1697P447k6720L5747l912R9833O0914k0456P8623k7200j41894j06040k6287
$$ 61697 69144 42424 78171 74259 174092 235006 214550 293173 265973 124079 18039 -8248
9223h248K9383K457m4055K3047R9718L5952p510m2456j8601o1516n4260L2669
$$ -8248 21135 23592 -20463 2584 102302 138254 130744 88288 69687 8171 -46089 -13420
9211a3420J1822L1636M8658k38k5060K7117M9423M0745k9623q1309n3524L714
$$ -13420 -1598 30038 78696 78458 53398 80515 129938 170683 141060 59751 6227 9941
9199I941m1970O1138j4786M3090L2511P0290J3774l3325j3219n6738k9054N7901
$$ 9941 -32029 29109 14323 57413 89924 160214 173988 140663 127444 70706 41652 99553
9187I9553j8270N508l701m9437l6090P5875K0904J8363l3193J6579j14218L8478
$$ 99553 81283 86791 83090 33653 -2437 73438 94342 112705 79512 96091 -18127 20351
9175B0351O8715l9709L0095o3052L568N7209N8747o1451q9493j996K5579N7338
$$ 20351 89066 49357 79452 16400 19968 77177 135924 74473 -15020 -17016 8563 65901
9163F5901n73J5362J9998p389l9506J9104O160q413j3515l682J679J7764K5173
$$ 65901 65328 80690 100688 93299 53793 72897 79057 70644 57129 53447 55126 72890 98063
9150I8063L7042o4095J2512j750M9222N2635o2684k2637j5078P7487R2733m6110
$$ 98063 135105 71010 83522 81772 130994 183629 120945 98308 83230 160717 253450 207340
9138B07340j04412n8593k6812M8179l026J739M1214N5453l461k2181Q5139l0021
$$ 207340 102928 44335 17523 65702 62676 64415 105629 161082 157621 135440 220579 190558
9126A90558J9288j21078j15128K734M9409n3714L958L1777p1562o0851N8067J53041
$$ 190558 209846 88768 -26360 -23626 25783 -27931 -23973 7804 -63758 -124609 -66542 86499
9114H6499L0600j12835J9628M4404J1369n1555q392N5410p7844p6809L3525J4718
$$ 86499 117099 4264 23892 68296 79665 28110 19718 75128 -2716 -79525 -46000 -31282
9102c1282r6396m293K9515Q4089j7422q4606m891J3572m0300J4880M742J9682
$$ -31282 -127678 -131971 -102456 -18367 -35789 -120395 -125286 -111714 -152014 -137134 -132392 -112710
9090a12710Q0195n6490m210L5827k6507L875k6487P0014R346P0144M9529j9378
$$ -112710 -32515 -89005 -93215 -57388 -83895 -80020 -106507 -36493 -27147 42997 92526 73148
9078G3148J1332M3070m831j29700j13047J8084M7334L8505K3930N1200m9773k2717
$$ 73148 84480 127550 122719 -6981 -120028 -101944 -54610 -16105 7825 59025 9252 -13465
9066a3465k8792O8605j6895L8814Q6027j09791o2121M573N3989O1347K359k2279
$$ -13465 -42257 26348 9453 48267 134294 24503 -37618 -33045 20944 82291 84650 62371
9054F2371k1534k1381j0274q7281j5262O1187k6014n819K986O9563n615k8796
$$ 62371 40837 19456 9182 -78099 -93361 -32174 -58188 -64007 -61021 8542 2927 -25869
9042b5869m910P382J7314j2089m6842n4713m0136K5432K5880P4027N5565m2356
$$ -25869 -30779 -23397 -6083 -18172 -65014 -119727 -159863 -134431 -108551 -34524 21041 -21315
9030b1315N0758P4964n5174m178n1322q8033n1021J9155P8852R0331j1952r8001
$$ -21315 29443 104407 49233 45055 -6267 -94300 -145321 -126166 -47314 43017 31065 -66936
9018f6936l1133N8996n1180m9805N0956P0030L150N4926M282K7899O6177l368
$$ -66936 -98069 -39073 -90253 -140058 -89102 -19072 -15922 39004 43286 71185 137362 133994
9006A33994p5350r9555K8798k28K5090N3121o2317l5936L5603l2119o6959l014
$$ 133994 58644 -40911 -12113 -12341 12749 65870 3553 -32383 3220 -28899 -95858 -98872
8994i8872l4316M1190N1273k9817J6954K8249J997J4907K088k734r2160q2505
$$ -98872 -133188 -91998 -40725 -70542 -53588 -25339 -23342 -8435 -6347 -9081 -101241 -183746
8982a83746o620J10179J02431p0811j8275J36506J2399n9402n625J6298J7622
$$ -183746 -190366 -80187 22244 -48567 -66842 69664 82063 22661 17036 33334 50956
8971E0956M0815l4325o9643M8921O1132j0618m6552o6122j0478k426j1782j8537
$$ 50956 91771 57446 -12197 36724 97856 87238 40686 -25436 -35914 -38340 -50122 -68659
8959f8659R662n528m8016L1368J28393K7550m4160j7174L3132k4299l5719M1330
$$ -68659 -58997 -64525 -112541 -81173 47220 74770 30610 13436 46568 22269 -13450 27880
8947B7880q22m2585p3658J5875L6842P8975K6225m1169k0240j657p6564L520K9889
$$ 27880 27058 -15527 -89185 -73310 -36468 42507 68732 27563 7323 5666 -70898 -67378 -37489
8934c7489j5430L3271M7369j8629m9491l6423n8070P75N3004N5929n971K870m593
$$ -37489 -52919 -19648 27721 9092 -40399 -76822 -134892 -134117 -81113 -25184 -31155 -28285 -32878
8921c2878m5719o048L8330K6560l5966L924M4068N3768q8578K175P8442M777o7988
$$ -32878 -78597 -84645 -46315 -19755 -55721 -51797 -7729 46039 -42539 -40364 38078 42855 -25133
8908b5133P7056p115l3165m5167j4528M1874J6149l555K1232N6338K3335q5929
$$ -25133 51923 44808 11643 -33524 -48052 -6178 9971 6416 27648 83986 107321 21392
8896B1392m0666j4877j7624R7736K4391p4267n3610O1058M2507O8073m24r9093
$$ 21392 -19274 -34151 -51775 45961 70352 -3915 -57525 3533 46040 114113 113689 14596
8884A4596k646J3896K3065M6492k4967k3485N461N6628j8269j3812L6371L537
$$ 14596 11950 25846 48911 95403 70436 46951 52412 109040 90771 76959 113330 116867
8872A16867K3729p9193k1356m3593L7285J5114N6730L1855p1948j06472l4408
$$ 116867 140596 61403 40047 -3546 33739 48853 105583 137438 65490 -40982 -75390
8861g5390m8913k0411J27156R8205M661k7334M6191k8604j3682j9846L4642l6659
$$ -75390 -124303 -144714 -17558 80647 85308 57974 104165 75561 61879 42033 76675 40016
8849D0016J744k1301l6432k4723J9011k7238n6258o0809J06173R8573Q8059P0207
$$ 40016 41760 20459 -15973 -40696 -21685 -48923 -105181 -165990 -59817 38756 126815 197022
8837A97022p3188O1007K8723n5428m8467q7482j04007n9901j030q833L9969j6604
$$ 197022 123834 184841 213564 158136 109669 22187 -81820 -141721 -142751 -151584 -111615 -128219
8825a28219K3117J4449r664J9916N4921J7150k62o9050p658l0169L4535P1588
$$ -128219 -105102 -90653 -100317 -80401 -25480 -8330 -8592 -77642 -85300 -115469 -80934 -9346
8813i346p175K9999Q88l1489l5200J1106m4673l2911N8056R0427m3473K2293o1416
$$ -9346 -16521 13478 14366 -17123 -52323 -41217 -85890 -118801 -60745 29682 -13791 8502 -52914
8800e2914k3543J8704K1220L597j2843P2999j064m1156m5464j7544M7926J00171
$$ -52914 -76457 -57753 -36533 -32936 -45779 27220 26156 -15000 -60464 -78008 -30082 70089
8788G0089K1026j9908o1255j7467J03261J401q6645m7290l6844Q763o6966p91
$$ 70089 91115 71207 9952 -7515 95746 97147 10502 -36788 -73632 -64869 -131835 -132626
8776a32626O9533P2157P802j12776p1704J1012O9319L5039J7628j2059J15811
$$ -132626 -63093 9064 16866 -95910 -167614 -156602 -87283 -52244 -34616 -46675 69136
8765F9136L0845l5255m402o0594o9881J7629K2942o460K3897n2328o8480j5260
$$ 69136 99981 64726 60324 -270 -70151 -52522 -29580 -36040 -12143 -64471 -132951 -148211
8753a48211J21645L9528J2153L269r1068p5489K3950P5261J7309o1436J5363J13400
$$ -148211 -26566 12962 25115 28384 -62684 -138173 -114223 -38962 -21653 -83089 -67726 45674
8741D5674J9990n3599o2717K1915P0795M4832m7342m6260j174K5704O0407q625
$$ 45674 65664 12065 -50652 -28737 42058 86890 39548 -6712 -7886 17818 78225 69600
8729F9600j7831K961k1122j0063k0273m4366O7362J25590J4402n8127p6299m4564
$$ 69600 51769 54730 33608 23545 3272 -41094 26268 151858 166260 108133 31834 -12730
8717a2730L5471m702m2801L4444Q9470Q943l9684j08770K785M3368L4978j3761
$$ -12730 22741 18039 -24762 9682 99152 108095 68411 -40359 -37574 5794 40772 27011
8705B7011p4087l5563r566j3061n0603J45495J09102o9038Q075j9051l9216j3422
$$ 27011 -47076 -82639 -92205 -105266 -155869 -10374 98728 29690 37765 18714 -20502 -33924
8693c3924K5449M9630L0510M0831M4034N3983n1016k8446N0569K7195j5178m3143
$$ -33924 -8475 41155 71665 112496 156530 210513 159497 131051 181620 208815 193637 150494
8681A50494L2490j9753r4718j08075q6683J38260K4089J7604K5442N0651n5750
$$ 150494 182984 163231 68513 -39562 -126245 12015 36104 53708 79150 129801 74051
8670G4051k8065l9767M8459P1711L4493l8617k0984q1020p8160J25743J9064M2039
$$ 74051 45986 6219 54678 126389 160882 122265 101281 20261 -57899 67844 86908 128947
8658A28947M829j361n1756R1752M8110k5597L648n8309l4569J6040r817k0551
$$ 128947 133776 132415 80659 172411 220521 194924 198572 140263 105694 121734 111917 91366
8646I1366P4219M6009j8820k4947Q2M2576K8282r5428M5851m255j0580L9343L7377
$$ 91366 165585 211594 192774 167827 167909 210485 238767 143339 189190 184935 174355 213698 251075
8633B51075K1406n4819r372N5857L6251q1347p190k8374L0519Q6319o2328J3137
$$ 251075 272481 217662 208290 264147 300398 219051 211861 183487 214006 300325 237997 251134
8621B51134J22291k9018n4367j03059n7814J9379N5311N6665L9650n120J9348
$$ 251134 373425 344407 290040 186981 129167 148546 203857 260522 300172 295052 314400
8610C14400p6358n4649P2883L5499N963N9030P3819O1694M0275O1864Q3704J07804
$$ 314400 238042 183393 256276 291775 297738 356768 430587 492281 532556 594420 678124 785928
8598G85928L9202o4878J9991Q7843Q4271K8193J13672l4087j00357M1551o8784
$$ 785928 825130 760252 780243 868086 952357 980550 1094222 1060135 959778 1001329 932545
8587I32545o0991m9739n6215K1669m8302r1659m2218j5221p3369P167O1504l7294
$$ 932545 871554 821815 765600 787269 738967 647308 605090 589869 516500 523667 585171 547877
8575E47877r9806L0371O5145o647J00852P3958n6903p7103m6257p3102j03394
$$ 547877 448071 478442 543587 536940 637792 711750 654847 577744 531487 458385 354991
8564C54991o5647P5951K2624n6384k0647J3657n6812r995N726o8293J2815Q2944
$$ 354991 289344 365295 387919 331535 310888 324545 267733 257738 263464 195171 207986 290930
8552B90930l810q7378l4688o0360m0774j6846m3263n6141P4340P8012k8121m6172
$$ 290930 287120 199742 165054 104694 63920 47074 3811 -52330 22010 100022 71901 25729
8540B5729M3427N1733j08794q519P7540k5889k6062j2580r7168M6343M0727M0836
$$ 25729 69156 120889 12095 3576 81116 55227 29165 16585 -80583 -34240 6487 47323
8528D7323R1761M7334o988m2018l2113j991N1010r5759r4959j9941k1876O1739
$$ 47323 139084 186418 179430 137412 105299 103308 154318 58559 -36400 -56341 -78217 -16478
8516a6478m700o7143O4947p568M261k2324M8129J3680Q8213m2949m6517n9444
$$ -16478 -21178 -88321 -23374 -30942 -26681 -49005 -876 12804 101017 58068 11551 -47893
8504d7893n4275J6676J0876R8809O5502j8530k0102O96j2695O2298k5382R966
$$ -47893 -102168 -85492 -74616 24193 89695 71165 51063 51759 39064 101362 75980 85946
8492H5946n1722N463j4417j9460O5130L3544k7925o7784m5102m1466l432L2264
$$ 85946 34224 39687 25270 5810 70940 104484 76559 8775 -36327 -77793 -81225 -48961
8480d8961N7063Q022O8809L221R294O4657M3506m5393p6819k9043p058m623k9903
$$ -48961 8102 16124 84933 88154 97448 162105 205611 160218 83399 54356 47298 42675 12772
8467A2772L2213M0275j3639k1868L1771m1662m1833l7137O1799N1353M1233p9953
$$ 12772 44985 85260 71621 49753 81524 39862 -1971 -39108 22691 74044 115277 35324
8455C5324r165l8659L5508M9179L8551l1286p9817J0636k4926K1087K6201K9662
$$ 35324 26159 -12500 23008 72187 110738 79452 -365 10271 -14655 6432 32633 62295
8443F2295N0070j9860j5760j2391K401N2647j9145k5263k9187J7427J0276k408
$$ 62295 112365 92505 76745 64354 66755 119402 100257 74994 45807 63234 73510 71102
8431G1102l2295K0944L3835k0508Q311j6315J1547R561m0617N8356O4406Q48l2356
$$ 71102 38807 59751 93586 73078 81389 65074 76621 86182 45565 103921 168327 169175 136819
8418A36819l1135N0602j04539o2485m0923M6164M6196Q0026M5492m589r1861k2652
$$ 136819 105684 156286 51747 -10738 -51661 -5497 40699 120725 166217 161628 69767 47115
8406D7115j168J54713M1181l142m6573p9519p3187M6180K2886k6795L431l989
$$ 47115 45947 200660 241841 238699 192126 112607 39420 85600 108486 81691 85122 81133
8394H1133m0567M3164p42L2240l9850J3403N9581J0806n4275p2325j9303j7156
$$ 81133 40566 83730 82988 115228 75378 88781 148362 159168 104893 32568 13265 -3891
8382c891J4804K352J2702J0290n59j9920J2617l1637J717Q765M830R712J4276
$$ -3891 10913 13265 25967 36257 35698 15778 28395 -3242 -1525 7240 12070 21782 36058
8369C6058L6346j5826o6355j4323P3756n021k8952j4126Q969l3787k4842j3973
$$ 36058 72404 56578 -9777 -24100 49656 44635 15683 1557 10526 -23261 -48103 -62076
8357f2076k0168R0356N9834J1434J5805N1460p6374n5950L0402k099N4990J5200
$$ -62076 -82244 8112 67946 79380 95185 146645 70271 14321 44723 42624 97614 112814
8345A12814j18568p5859n1370J6162O8716l0082Q6110O5876l259M3884n4772j11506
$$ 112814 -5754 -81613 -132983 -116821 -48105 -78187 7923 73799 70540 114424 59652 -51854
8333e1854o5061M0832m3269J4664Q708M7889P9590j692l9902J4817J54143K9979
$$ -51854 -116915 -76083 -119352 -104688 -95980 -48091 31499 29807 -10095 4722 158865 188844
8321A88844q6103o1701m2551R3377L2748k8743o1880k1265m7433M2390n0247N7214
$$ 188844 102741 41040 -1511 91866 124614 95871 33991 12726 -34707 7683 -42564 14650
8309A4650N6981r1911M5794J19734n0383q7085N7492K0950m0407m3372J6592K7104
$$ 14650 71631 -20280 25514 145248 94865 7780 65272 86222 45815 2443 19035 46139
8297D6139q3200k6459L1352K2669J0847R3743M2801j54364k5449Q2786L7081J6284
$$ 46139 -37061 -63520 -32168 -9499 1348 95091 137892 -16472 -41921 40865 77946 94230
8285I4230k246m6728L8175O587n0181o5550Q154L8329L587K1611r700o8713P0579
$$ 94230 91984 45256 83431 90018 39837 -25713 -17559 20770 24357 45968 36268 -32445 38134
8272C8134n1832q570K489K9309l3506l8091M124L2175L913N9615O2111l1542M5108
$$ 38134 -13698 -22268 -19779 9530 -23976 -62067 -57943 -25768 -21855 37760 99871 68329 113437
8259A13437r966q191Q166p127n3322m787l7795n6903k0347M3269P3179Q254K3504
$$ 113437 103471 95280 103446 96319 42997 38210 415 -56488 -76835 -33566 39613 47867 71371
8246G1371O65o6782p288j0220M6215N9610r076o0029n8750L6761P2451Q4540j2589
$$ 71371 72036 5254 -2034 -12254 33961 93571 84495 24466 -34284 2477 74928 159468 146879
8233A46879q9730J8764n9846n6747N4946L9477L8192M190m8941J8591L0647o8957
$$ 146879 57149 75913 16067 -40680 14266 53743 91935 96125 47184 65775 96422 27465
8221B7465o1050M9087L0672M5253J7348q6579q4274k7184M9426j590k1525K8425
$$ 27465 -33585 15502 46174 91427 108775 22196 -62078 -89262 -39836 -41426 -62951 -34526
8209c4526q2853k8737N1490M2070k8318K7743K4317q3005j0571N4534M4901L7992
$$ -34526 -117379 -146116 -94626 -52556 -80874 -53131 -28814 -111819 -122390 -67856 -22955 15037
8197A5037K8807P3254m6114m4549p8907k3436N734J38527L2568l2265L5749Q2200
$$ 15037 43844 117098 70984 26435 -52472 -75908 -70174 68353 100921 68656 104405 186605
8185A86605m4669j27930j36700K0312M0343m114N394R2909O3361L0548n760j6599
$$ 186605 141936 14006 -122694 -102382 -62039 -66153 -60759 32150 95511 126059 120299 103700
8173A03700l9054M3383k4335p2636l6841M4777R9854q7373n073k432N235Q9726
$$ 103700 64646 108029 83694 11058 -25783 18994 118848 31475 26402 23970 29205 118931
8161A18931m576n3590j4970q2599k6986K7752L3904j5981J3827N6749K657k555
$$ 118931 114355 60765 45795 -36804 -63790 -36038 -2134 -18115 -4288 52461 55118 52563
8149E2563j2842j8593q3363M2100R5488L6537K17K5757p1387j5099o6596l0094
$$ 52563 39721 21128 -62235 -20135 75353 111890 112107 137864 66477 51378 -15218 -45312
8137d5312j7754N0921n2894p2744j6942M5220J8828J3071p1917j2517P1239N1582
$$ -45312 -63066 -12145 -65039 -137783 -154725 -109505 -90677 -77606 -149523 -162040 -90801 -39219
8125c9219M8853j3808L6687O2624k3263m614L7510L1577R1190J7558K9333J8004
$$ -39219 9634 -4174 32513 95137 71874 67260 104770 136347 227537 245095 274428 292432
8113B92432l4965l161l215q5536Q515o890n8199r5713L116O8054L6227j10931
$$ 292432 257467 254306 251091 165555 174070 167180 108981 13268 16384 84438 120665 9734
8101I734L5388p786M7193o968m0858n2037K1427K8006l909r3595n5608M3491R0272
$$ 9734 45122 37336 84529 77561 36703 -15334 6093 34099 30190 -63405 -119013 -75522 14750
8088A4750Q6863L8433L0691p3017j21271L3760R535L3180J235p381N7252j1416
$$ 14750 101613 140046 170737 97720 -23551 10209 19744 52924 54159 46778 104030 92614
8076I2614m888k5518L603k3844K2286J6886Q1539K6933m191N224l8852k4695n6250
$$ 92614 87726 62208 65811 41967 64253 81139 162678 189611 185420 190644 151792 127097 70847
8063G0847k320m810N25L9259n1877k8488o023Q098j4411j5986J07286n8255q8539
$$ 70847 68527 63717 64242 103501 51624 23136 17113 25211 10800 -5186 102100 43845 -44694
8050d4694q105L9530J9988r208O5099q3502k0588o818J07201M6968j2659r0919
$$ -44694 -52799 -13269 6719 -2489 62610 -20892 -41480 -48298 58903 105871 93212 2293
8038B293k0785M1507l4654J71250O7139p4742j0219j9921M4509M9891j1143q702
$$ 2293 -18492 23015 -11639 159611 226750 152008 141789 121868 166377 216268 205125 196423
8026A96423p1470J6061J51354n2767j42156K0725j6986J09165L9836M8247M4j3030
$$ 196423 124953 141014 292368 239601 97445 118170 101184 210349 250185 298432 298476 285446
8014B85446J0304l200J4313l5836n2610k6154J6193J21874J2093j12592k2815
$$ 285446 295750 292550 306863 271027 218417 192263 208456 330330 342423 229831 207016
8003B07016M9517M7792M2650J1588q7564k2520M093P2480J0719N7765l8123K3878
$$ 207016 256533 304325 346975 358563 270999 248479 252572 325052 335771 393536 355413 379291
7991C79291P8893J42850M1733L7117M7939K9732Q5332K2907p693Q787L8048j9041
$$ 379291 458184 601034 642767 679884 727823 757555 842887 865794 858101 866888 904936 885895
7979H85895L1619M1253L4234k3499q7921j5649l5735p1648j10064j48253j20273
$$ 885895 917514 958767 993001 969502 881581 865932 830197 758549 648485 500232 379959
7968C79959o339p5369o3282j3635m7362k5192Q5985l4291l9753N5922l0894m5407
$$ 379959 373620 298251 234969 221334 173972 148780 234765 200474 160721 216643 185749 140342
7956A40342n5486K7023J0322K2228m267N0575n1647L5619J32320J10939R0856
$$ 140342 84856 111879 122201 144429 140162 190737 139090 174709 307029 417968 508824
7945E08824k8696M4617P5512L4594p266M7688j9189O5108O1079P6874O5230Q8316
$$ 508824 480128 524745 600257 634851 627585 675273 656084 721192 782271 859145 924375 1012691
7933A012691j9124j18715j22777j74020j12210o0240q7625m8389m3899l8820j7686
$$ 1012691 993567 874852 752075 578055 465845 405605 317980 269591 225692 186872 169186
7922A69186R8059P028r3950j00008k6319o321Q8289N5978j6331O8740Q5294K2114
$$ 169186 267245 274273 180323 80315 53996 47675 135964 191942 175611 244351 329645 351759
7910C51759l7952j5582k2369p7424l9399j311J7805N9685k2393l8049j1043o2200
$$ 351759 313807 298225 275856 198432 159033 157722 175527 235212 212819 174770 163727 101527
7898A01527m6851R2774J49757N0588n5055p9487p0531m5361k8439l254O7908m14
$$ 101527 54676 147450 297207 347795 292740 213253 142722 97361 68922 65668 133576 133162
7886A33162n4902J365K3114p9660j18371J6399k2381M4207J17610j7843j3941
$$ 133162 78260 79625 102739 23079 -95292 -78893 -101274 -57067 60543 42700 28759
7875B8759m669R30N5018P098o315K5450p256q3774k8504J27491M0617j27594n6727
$$ 28759 24090 25020 80038 87136 80821 106271 99015 15241 -13263 114228 154845 27251 -29476
7862b9476J0744K8678j3113j8257N8116M4409N6008L248p4452n5608l2236J3889
$$ -29476 -18732 9946 -3167 -21424 36692 81101 137109 140357 65905 10297 -21939 -8050
7850h050K193l3672P2227J9234j5264N1018m0048k3096P013K4488K3844K4241
$$ -8050 -5857 -39529 32698 51932 36668 87686 47638 24542 31555 56043 79887 104128
7838A04128j5939j2797l7781n5719J405L8496o30K175P5993p77r8337o9430j0229
$$ 104128 88189 75392 37611 -18108 -16703 21793 21163 23338 99331 98554 217 -69213 -79442
7825g9442O020M7625l6649o0641p888Q2087O7907L7344p3097L2773r4052p7220
$$ -79442 -73422 -25797 -62446 -123087 -130975 -48888 19019 56363 -16734 16039 -78013 -155233
7813a55233Q3463M2104J4077j4384J5242J05911K1540O66q8998l0857j1212m8592
$$ -155233 -71770 -29666 -15589 -29973 -14731 91180 112720 113386 24388 -6469 -17681 -66273
7801f6273K2261Q6775n6255m9591J0792j3544l1583o0905Q461Q899Q0296L9304
$$ -66273 -44012 42763 -13492 -63083 -52291 -65835 -97418 -158323 -149862 -140963 -60667 -21363
7789b1363j543P240N1872j2927J9906n2206r9624K7565R7315j3730m4788l5553
$$ -21363 -22906 -15666 36206 23279 43185 -9021 -108645 -81080 16235 2505 -42283 -77836
7777g7836j6873N136J20153M2748J3094q0222r3707K1594J40625O3315j7070J3030
$$ -77836 -94709 -89573 30580 73328 86422 6200 -87507 -65913 74712 138027 120957 133987
7765A33987n2340q5614l3478m4805N0562M4359p351q3818j2401m7112M8394J4360
$$ 133987 81647 -3967 -37445 -82250 -31688 12671 5320 -78498 -90899 -138011 -89617 -75257
7753g5257M6708L6429p1840o6629J0040O8254k5786k0874j0119L3679Q3326J0730
$$ -75257 -28549 7880 -63960 -130589 -120549 -52295 -78081 -98955 -109074 -75395 7931 18661
7741A8661l5642Q988N9340p8995l4661m5688O9701J1522k319l7192K1425L6617
$$ 18661 -16981 -7993 51347 -27648 -62309 -107997 -38296 -26774 -29093 -66285 -44860 -8243
7729h243j6258P0055O5899j2709J9800p5252N974K8052j1899K2811M5798q265
$$ -8243 -24501 45554 111453 98744 118544 43292 49266 77318 65419 88230 134028 125763
7717A25763r0623k1650J3493o3653m3913o2776L133K2915M9966L5155L1655k2515
$$ 125763 35140 13490 26983 -36670 -80583 -143359 -140226 -117311 -67345 -32190 -535 -23050
7705b3050K8363P0566j8442O26j963J2226k3312o1077l7008K6558q388K7602n3737
$$ -23050 5313 75879 57437 58063 56100 68326 45014 -16063 -53071 -26513 -34901 -7299 -61036
7692f1036m9598n5448l8690K1425N1536O7707P6115j03017p4741N1331R6343N8165
$$ -61036 -110634 -166082 -204772 -183347 -131811 -64104 12011 -91006 -165747 -114416 -18073 40092
7680D0092k7197l4137K6502m1599o0659j4957m6919N7232L2931n830l6196k2344
$$ 40092 12895 -21242 5260 -36339 -96998 -111955 -158874 -101642 -68711 -74541 -110737 -133081
7668a33081L5293r903J04758N0730l5593M7211O227j07842j9917r6089j987P2882
$$ -133081 -97788 -107691 -2933 47797 12204 59415 65642 -42200 -62117 -158206 -160193 -87311
7656h7311J6839q121K3220m2766R9834k762o4354j4126J18177R1245j3041p3612
$$ -87311 -70472 -78593 -55373 -98139 1695 -1067 -65421 -79547 38630 129875 116834 43222
7644D3222m7789N9163n0150p0776l3771K4379m9914m988L1177O3099K4169o8106
$$ 43222 -4567 54596 4446 -66330 -100101 -75722 -125636 -130624 -99447 -36348 -12179 -80285
7632h0285P733N3667N8355p3458K2282M2526K2824K988j07879M8013O0543n5514
$$ -80285 -72552 -18885 39470 -33988 -11706 30820 53644 56632 -51247 -3234 57309 1795
7620A795p7080R713Q9090K1010l6991L729j0607J9991r786N0504q328l081m1204
$$ 1795 -75285 -65572 23518 44528 7537 11266 659 20650 10864 61368 53040 49959 8755
7607H755m1229j7131L568N3897P8003N7310o1746j04161N6185K4457j5659p4465
$$ 8755 -32474 -49605 -46037 7860 85863 143173 81427 -22734 33451 57908 42249 -32216
7595c2216N3115P6152M4082o6204o8053l9460M1175K9495N6744L6816p4126r3349
$$ -32216 20899 97051 141133 74929 6876 -32584 8591 38086 94830 131646 57520 -35829
7583c5829m2222R858J8389p072m5041q434m812J0703K6307O8867m2937J1826O7589
$$ -35829 -78051 -68193 -49804 -56876 -101917 -110351 -115163 -104460 -78153 -9286 -52223 -40397 27192
7570B7192Q2769q4986o5275l135Q5705K6375j5459M485P0101M101q6744n0107
$$ 27192 109961 24975 -40300 -43435 42270 68645 53186 57671 127772 131873 45129 -4978
7558d978K7253n7299Q7445K6882j11058p9878J7859L7185m9024m3273o061J2220
$$ -4978 22275 -35024 52421 79303 -31755 -111633 -93774 -56589 -105613 -148886 -154947 -142727
7546a42727J3617O1766K0603L2262p495N187M2038j4475J0702m0418l7493m670
$$ -142727 -129110 -67344 -46741 -14479 -21974 -16787 25251 10776 21478 -18940 -56433 -61103
7534f1103M1496N3218P9658J06768o3137r1117p8241q382Q666J284K9028L595
$$ -61103 -19607 33611 113269 220037 156900 65783 -12458 -20840 -12174 -10890 18138 21733
7522B1733k3333J1340M1579P4779L8846p8686j11860J5462j36800K8670J13773
$$ 21733 -1600 9740 51319 126098 164944 86258 -25602 -10140 -146940 -118270 -4497
7511d497J00175j8776j4271l7203r5219K9306L0528J2270N9598K3110Q3977l1762
$$ -4497 95678 76902 62631 25428 -69791 -40485 -9957 2313 61911 85021 168998 137236
7499A37236j29976j13711J1349K3526R3089K6474j7408M4185R2939R6089J2857
$$ 137236 7260 -106451 -95102 -71576 21513 47987 30579 74764 167703 263792 276649
7488B76649n6833r6664l7804K8851M0332j21562q3986M5983M8216K9198k3563
$$ 276649 219816 123152 85348 114199 154531 32969 -51017 -5034 43182 72380 48817
7477D8817k0945j0502O8037k92k1460j0421n5807L5232N1635Q301J5785q6179
$$ 48817 27872 17370 85407 85115 63655 53234 -2573 32659 84294 92595 108380 22201
7465B2201n8825l8716K3343P3009K232m353l5554P7520J47948L1850p0263j43435
$$ 22201 -36624 -75340 -51997 21012 23244 18891 -16663 60857 208805 240655 170392 26957
7453B6957n1922P3146N5862J277K7475o8566r7830K4011O1386j9067r8237N4099
$$ 26957 -24965 48181 104043 105320 132795 64229 -33601 -9590 51796 32729 -65508 -11409
7441a1409J09883k6105j4242M9631j2768j17076j811J31443K421q8201J7113k3154
$$ -11409 98474 72369 58127 107758 94990 -22086 -23897 107546 109967 21766 38879 15725
7429A5725o7600N954J00887O1072q9358o3441l4933J5284L4991k0539l7153k4084
$$ 15725 -51875 -45921 54966 116038 26680 -36761 -71694 -56410 -21419 -41958 -79111 -103195
7417a03195K0566K42o5789J32714M1976l6109L3172m3261j1564L1887O3897J7053
$$ -103195 -82629 -82387 -148176 -15462 26514 -9595 23577 -19684 -31248 639 64536 81589
7405H1589l1373O66l7279m1162l4789L0038j881J8212J7352J4166N725j2855m9870
$$ 81589 50216 50882 13603 -27559 -62348 -32310 -34191 -15979 1373 15539 21264 8409 -41461
7392d1461k4909K1405K9556j4525L8625n1884p0480K6736K2384J0164Q2396N8368
$$ -41461 -66370 -44965 -15409 -29934 8691 -43193 -113673 -86937 -64553 -54389 28007 86375
7380H6375M5632k5144q8880j15661l2155J3009M3599k915K1433K0812j1882n0958
$$ 86375 132007 106863 17983 -97678 -129833 -116824 -73225 -76140 -54707 -33895 -45777 -96735
7368i6735J405P1711O7862j9066j20828o7351r756O8951K3313l0543M0284K8128
$$ -96735 -95330 -23619 44243 25177 -95651 -163002 -172758 -103807 -80494 -111037 -70753 -42625
7356d2625M3927M375k0127M5308j7057P9963l1321l3211K2686l4110o2453l024
$$ -42625 1302 5677 -14450 30858 13801 93764 62443 29232 51918 17808 -44645 -47669
7344d7669P8481k3361m7638O064L499N1439R0397m2610p3870k8249N2561M6140
$$ -47669 30812 7451 -40187 -34123 -30624 20815 111212 68602 -5268 -33517 19044 65184
7332F5184n6040o2892O508J2222M1262l5002k5353k7988j8884R4753J1894K7966
$$ 65184 9144 -53748 -47240 -35018 6244 -28758 -54111 -82099 -100983 -6230 5664 33630
7320C3630J05842m6026r2560m8872K8398p8603p18L7215L0523L0129j3478k6854
$$ 33630 139472 93446 886 -47986 -19588 -98191 -98909 -61694 -31171 -1042 -14520 -41374
7308d1374p0850K5124J1514K1863k8325K1162L2317K0393o0685k098l00n2968
$$ -41374 -112224 -87100 -75586 -53723 -82048 -60886 -28569 -8176 -68861 -70959 -71259 -124227
7296a24227M4768K1432P1187K5339o5839Q4315M9296L7312k6013M5423Q9294k399
$$ -124227 -79459 -58027 13160 38499 -27340 56975 106271 143583 117570 162993 252287 249888
7284B49888o2782L189j35860J1611p5577o4275O2337O9450M9572j4604r5455N4825
$$ 249888 187106 190295 54435 66046 -9531 -73806 -11469 57981 107553 92949 -2506 52319
7272E2319l3758j4554M5330L4523L4652n3278m6932j07077m7202K1580O7954k3612
$$ 52319 18561 4007 49337 83860 118512 65234 18302 -88775 -135977 -114397 -46443 -70055
7260g0055l1908N7938N909K355o827l7226p5679P468L5575K5524J4912n9127O732
$$ -70055 -101963 -44025 -38116 -35761 -42588 -79814 -155493 -148025 -112450 -86926 -72014 -131141 -124409
7247a24409k6282k1878J7928j920N1885Q4573k4657j1282R590q8658j11440M7243
$$ -124409 -150691 -172569 -154641 -156561 -104676 -20103 -44760 -56042 -46452 -135110 -246550 -199307
7235a99307O2692L9130L5182o4366O9987L3887L2969n6525q0564J6229N3835J5331
$$ -199307 -136615 -97485 -62303 -126669 -56682 -22795 10174 -46351 -126915 -110686 -56851 -41520
7223d1520K0155P8337k8960j28148O7890O6872k055p3721m2358L2648R9648l1360
$$ -41520 -21365 56972 28012 -100136 -32246 34626 32571 -41150 -83508 -50860 48788 17428
7211A7428n6507J5262j21983p8262P0279J16211j5794l6127M673J3927J6473K183
$$ 17428 -39079 -23817 -145800 -224062 -153783 -37572 -53366 -89493 -84820 -70893 -54420 -52237
7199e2237K5017M3968J8393n7499k8706K3485o409o4061N5212O2470l2003l3020
$$ -52237 -27220 16748 35141 -22358 -51064 -27579 -33988 -98049 -42837 19633 -12370 -45390
7187d5390K0750Q3408l5797q5576l0383J4896j4708J5123J0276k295o3254j26032
$$ -45390 -24640 58768 22971 -62605 -92988 -78092 -92800 -77677 -67401 -69696 -132950 -258982
7175b58982M7620Q0384k0380k2898l337j2985Q5563R610l483j9319J13584O730
$$ -258982 -211362 -130978 -151358 -174256 -177593 -190578 -105015 -95405 -98888 -118207 -4623 2107
7163B107p0905M6586q9349j0616K245M4958K3159l0985K9185P8323m3826k1560
$$ 2107 -68798 -22212 -111561 -122177 -119932 -74974 -51815 -82800 -53615 24708 -19118 -40678
7151d0678L6102n267o9342O9508m088m9331n0722L6963J1304K5120j4733l8811
$$ -40678 -4576 -9843 -79185 -9677 -13765 -63096 -113818 -76855 -65551 -40431 -55164 -93975
7139i3975j624n0919L332L8567P2350L5346q7723q609j984N350o00P7053n6199
$$ -93975 -95599 -146518 -143186 -104619 -32269 3077 -84646 -93255 -95239 -89889 -90489 -13436 -69635
7126f9635r823K9972m6159M7647q9073r6563P5352Q0040l0551k2566K4023L981
$$ -69635 -79458 -49486 -95645 -47998 -137071 -233634 -158282 -78242 -108793 -131359 -107336 -103355
7114a03355O5967L6255l8365o856K3886N7919m8111j9180N0357k6133k9597L6508
$$ -103355 -37388 -1133 -39498 -46354 -22468 35451 -12660 -31840 18517 -7616 -37213 -705
7102g05O7607n4765j09051l8660P5996M0818o1849j03L8533k2397J0652j3115
$$ -705 66902 12137 -96914 -135574 -59578 -18760 -80609 -80712 -42179 -64576 -53924 -67039
7090f7039l0911M3332M5226j7460k4582o5115L3515M6594l3577N591l7750l5894
$$ -67039 -97950 -54618 -9392 -26852 -51434 -116549 -83034 -36440 -70017 -64426 -102176 -138070
7078a38070P6392m5203R8044N9352r8682K2298j7884K665M7167j10042m1531M4484
$$ -138070 -61678 -106881 -8837 50515 -48167 -25869 -43753 -41088 6079 -103963 -145494 -101010
7066a01010L8300J6836Q0342j0729L329K6294n9297p7610P3480N6627J7770j11773
$$ -101010 -62710 -45874 34468 23739 27068 53362 -5935 -83545 -10065 46562 64332 -47441
7054d7441J063K6381m5013j3962M6191M9375K7975K0395p299o5782J5673K5588
$$ -47441 -46378 -19997 -65010 -78972 -32781 16594 44569 64964 57665 -8117 7556 33144
7042C3144J4472R092P3725M8287n1260m4987Q936J0497l9481l8289m1406j1319
$$ 33144 47616 56708 130433 178720 127460 82473 91409 101906 62425 24136 -17270 -28589
7030b8589m0214R044j924M4084l2329o8721N5841P0887J1904n7471o573M8555
$$ -28589 -68803 -59759 -61683 -17599 -49928 -118649 -62808 8079 19983 -37488 -44061 4494
7018D494J6120K5045K3726n7189O112o0136K198Q2381P578n4515j23239j2512
$$ 4494 20614 45659 69385 12196 18308 -41828 -39630 42751 50329 -4186 -127425 -139937
7006a39937q061J5330J08377J06957M7781J583r275p6053M8655L9348o7137r8377
$$ -139937 -147998 -132668 -24291 82666 130447 132030 122755 46702 95357 134705 67568 -30809
6994c0809j788J54475l6613o5346j5607l6835l9147k7766Q9363J01470m3993q4446
$$ -30809 -32597 121878 85265 19919 4312 -32523 -71670 -99436 -10073 91397 47404 -37042
6982c7042j0893J01450K2140M1863L7735l3819o5806m6327O4105l8733M9930n7560
$$ -37042 -47935 53515 75655 117518 155253 121434 55628 9301 73406 34673 84603 27043
6970B7043O4503m1251l6524l418O7210j7631n3102l4800q0709M096L8560l6196
$$ 27043 91546 50295 13771 10353 77563 59932 6830 -27970 -108679 -104583 -66023 -102219
6958a02219l7067l5754N087L2831o89K0041L9275O46R1102R652p1026p0112L9452
$$ -102219 -139286 -175040 -169953 -137122 -137811 -117770 -78495 -77849 13253 22905 -48121 -118233 -78781
6945g8781J7877N3170K7776l8351j2956l9416q936m5373Q8880k8083m0629K0969
$$ -78781 -60904 -7734 20042 -18309 -31265 -70681 -79617 -124990 -36110 -64193 -104822 -83853
6933h3853P6446K5117M1849k7098M8855Q3549o6838j544M6973k0640n8413q8269
$$ -83853 -7407 17710 59559 32461 81316 164865 98027 96483 143456 122816 64403 -23866
6921b3866k4213L2748l3335j09133M4642Q7730k6501L5458P3092k6722m314N7847
$$ -23866 -48079 -15331 -48666 -157799 -113157 -25427 -51928 -16470 56622 29900 25586 83433
6909H3433r866o2468l0042m4711n9677R269K8861m1770N0284K785n678O0725L8250
$$ 83433 73567 11099 -18943 -63654 -123331 -114062 -85201 -126971 -76687 -73902 -79580 -18855 19395
6896A9395l6126j09196k4645K1782M3422J5987L5668k0442k2422r037O9156L9564
$$ 19395 -16731 -125927 -150572 -128790 -85368 -69381 -33713 -54155 -76577 -85614 -16458 23106
6884B3106Q188o829N31q724m4797n9502j2622k1646J6196N6300P6451L3261K8665
$$ 23106 31294 24465 24996 16272 -28525 -88027 -100649 -122295 -106099 -49799 26652 59913 88578
6871H8578l0989j9808L5247N0923l7361J926N541N0821k8206q6347l8867L6464
$$ 88578 57589 37781 73028 123951 86590 88516 94057 144878 116672 30325 -8542 27922
6859B7922O7181L4459o5526q8657K311l6968j0080R7587R0264K3871m3821k7688
$$ 27922 95103 129562 64036 -24621 -22310 -59278 -69358 28229 118493 142364 98543 70855
6847G0855m4323l4316J9890j1461q7102l2217R946J1541n1841l0469K2856K5140
$$ 70855 26532 -7784 12106 645 -86457 -118674 -108728 -97187 -149028 -179497 -156641 -131501
6835a31501M4478K8329M2960k6547k5249r921r8233N6438K6721P6173p771J2056
$$ -131501 -87023 -58694 -15734 -42281 -67530 -77451 -175684 -119246 -92525 -16352 -24123 -12067
6823a2067m2012K1210o82j847L4451m2754j2144N8985L5861P828M2875q48L7209
$$ -12067 -54079 -32869 -33551 -35398 -947 -43701 -55845 3140 39001 46829 89704 88856 126065
6810A26065L2513J5965o4689k2601l3412j15458k3300K3191N4161L4863p0074
$$ 126065 158578 174543 109854 87253 53841 -61617 -84917 -61726 -7565 27298 -42776
6799d2776m3331L6895J33229L2850J4106p9384p2403L8392K555O5499o9847m1440
$$ -42776 -86107 -49212 84017 116867 130973 51589 -20814 17578 20133 85632 15785 -25655
6787b5655l6745K3405k8404r670r4369j1748J9218Q1138L4245M1280p2907J0033
$$ -25655 -62400 -38995 -67399 -77069 -171438 -183186 -163968 -82830 -48585 -7305 -80212 -70179
6775g0179J14325J6480Q01j6508j2378K0650J8389l7244j1336J913l8456J5244
$$ -70179 44146 60626 61427 44919 32541 53191 71580 34336 23000 24913 -13543 1701
6763A701P5410M4317n3704o199O065n340q8382O51o031j6987n1282L140J9698
$$ 1701 77111 121428 67724 61525 67590 62250 -26132 -25481 -31512 -48499 -99781 -96641 -76943
6750g6943J09502l2947k5789j5631K313R996j1429J7782n437L6983L6447J4531
$$ -76943 32559 -388 -26177 -41808 -39495 -29499 -40928 -23146 -28583 8400 44847 59378
6738E9378j8482N2826j2872J534J3438l7278q3620L3709J4284k644m5485K6424
$$ 59378 40896 93722 80850 82384 95822 58544 -25076 8633 22917 20273 -25212 1212
6726A212R135l1514m5944L8781m9301K8404j3267J1362O3129O9800n1614M3042
$$ 1212 10347 -21167 -67111 -28330 -77631 -49227 -62494 -51132 11997 81797 30183 73225
6714G3225N906L7943j5531n4719l3575N0747l9810m1323M653M12L3652k8680K2839
$$ 73225 79131 117074 101543 46824 13249 63996 24186 -17137 -12484 -12072 21580 -7100 15739
6701A5739Q0188q002l0218j6824j12786M6756j2227k368M9050N7334l6611m7394
$$ 15739 95927 87925 57707 40883 -71903 -25147 -37374 -39742 9308 66642 30031 -17363
6689a7363Q690l22k3365R791j5684o5987n3110o948J949P5417R7190M0774k209
$$ -17363 -8673 -8995 -32360 -22569 -38253 -104240 -157350 -164298 -162349 -86932 10258 51032 48823
6676D8823J0248K7162q3004q0211m8795K0383Q874j9826m4669Q3114K167q3913
$$ 48823 59071 86233 3229 -76982 -125777 -105394 -96520 -116346 -161015 -77901 -75734 -159647
6664a59647K762O6347P3032L1176l1241M9164P3561n3269k0778N3613j7934m4931
$$ -159647 -156885 -90538 -17506 13670 -17571 31593 105154 51885 31107 84720 66786 21855
6652B1855n5946K4890Q087q6385J7393J10166J4256p5868j4838L6302O6551N3320
$$ 21855 -34091 -9201 -1114 -87499 -70106 40060 54316 -21552 -36390 -88 66463 119783
6640A19783n353k6387m0066l6586j4843P446J302K9103M1127P4775p495k9464
$$ 119783 114430 88043 47977 11391 -3452 3994 5296 34399 75526 150301 142806 113342
6628A13342j10571m7942j9750L3793N528J12303L6521k6562m2222j513l1175n6340
$$ 113342 2771 -45171 -64921 -31128 -25600 86703 123224 96662 54440 52927 21752 -34588
6616c4588j1333J35922Q0263m5231k5061j08776j27060R161Q0956R1946M818J2110
$$ -34588 -45921 90001 170264 125033 99972 -8804 -135864 -126703 -45747 46199 51017 63127
6604F3127j6944p885p4881m9585K4161N7290p3531o8035n0229j6375J29816Q9692
$$ 63127 46183 38298 -36583 -86168 -62007 -4717 -78248 -146283 -196512 -212887 -83071 6621
6592F621J1064l1565J1727K6100j3686k8549l3916J0797O39l1193Q8827R7381
$$ 6621 17685 -13880 -2153 23947 10261 -18288 -52204 -41407 -40768 -71961 16866 114247
6580A14247l7754m5895R4372P2667m2862k2854r4620j15193L8675L093r140J7238
$$ 114247 76493 30598 124970 197637 154775 131921 37301 -77892 -39217 -36124 -45264 -28026
6568b8026j8694J0971J3628K0998o1980o3048j6810L6929N0459k2005l6282L0562
$$ -28026 -46720 -35749 -22121 -1123 -63103 -126151 -142961 -106032 -55573 -77578 -113860 -83298
6556h3298M2897p0497J8015j2719L2405L6721k8257L0401R759n7143l347J6401
$$ -83298 -40401 -110898 -92883 -105602 -73197 -36476 -64733 -34332 -24573 -81716 -85063 -68662
6544f8662L2224m7921m5778k2930j5109M9846M988L6741J12979L7050q8864l2544
$$ -68662 -36438 -84359 -130137 -153067 -168176 -118330 -113342 -76601 36378 73428 -15436 -47980
6532d7980L3799O884j900K7576J4700j0425m5706p8701m4606K3976J0701K3896
$$ -47980 -14181 -7297 -9197 18379 33079 22654 -23052 -101753 -146359 -122383 -111682 -87786
6520h7786L3237j6455m3546j9477R2843P9427J2550p9074m0411k8274M6320K568
$$ -87786 -54549 -71004 -114550 -134027 -41184 38243 50793 -28281 -68692 -96966 -50646 -48078
6508d8078K0416l6311k7501O3558R75K1321N6000m5997k8322L4577O0865l292
$$ -48078 -27662 -63973 -91474 -27916 -26941 -5620 50380 4383 -23939 10638 71503 68211
6496F8211m3575m4831j4081m2427L7845M6562K8980m1475j6717L6657l2053q7576
$$ 68211 24636 -20195 -34276 -76703 -38858 7704 36684 -4791 -21508 15149 -16904 -104480
6484a04480M3124M5633K2315q409j1328N3431K1905J2246K795k7151J9902K5858
$$ -104480 -61356 -15723 6592 -1817 -13145 40286 62191 74437 77232 50081 69983 95841
6472I5841M0139q5141r5197k1082L9096P9787P420o1299p3106K7725N1556K3372
$$ 95841 135980 50839 -44358 -65440 -26344 53443 60863 -436 -73542 -45817 5739 29111
6460B9111n1731N81K8692j0566l6240n790M9104L0186K0993K1163r0215o969P324
$$ 29111 -22620 -22039 6653 -3913 -40153 -45943 3161 33347 54340 75503 -14712 -21681 -14357
6447a4357P282l7201k3857j6242L2633M4982J7315k8018N3235k0602p0952k3152
$$ -14357 -7075 -44276 -68133 -84375 -51742 -6760 10555 -17463 35772 15170 -55782 -78934
6435g8934j9179L5517M6502k419M3829l9731j0530K8884J2468o6568n7345L9294
$$ -78934 -98113 -62596 -16094 -18513 25316 -14415 -24945 3939 16407 -50161 -107506 -68212
6423f8212J02672J0129K5039n9580p3978r997L4518J13483Q351k9083m1442N3692
$$ -68212 34460 44589 69628 10048 -63930 -73927 -39409 74074 82425 53342 11900 65592
6411F5592K8852n5695n889K2180p273J4386q1924o893k2784p1800k0727L8888
$$ 65592 94444 38749 32860 55040 47767 62153 -19771 -26664 -49448 -121248 -141975 -103087
6399a03087J05378J1035n481j7589r636l2329J3900K5245O6798m2771k5307q6584
$$ -103087 2291 13326 7845 -9744 -19380 -51709 -37809 -12564 54234 11463 -13844 -100428
6387a00428m9243M5777J4884N6920M2448k212m9370J7649k133M6422j5353j1829
$$ -100428 -149671 -103894 -89010 -32090 10358 8146 -41224 -23575 -25708 20714 5361 -6468
6375f468j7997M6457L8732n326m9344o139l5217O229o3400M5083J3004r6325k9960
$$ -6468 -24465 21992 60724 55398 6054 -85 -35302 -29073 -92473 -47390 -34386 -130711 -160671
6362a60671J2677O1328P4320L6598K7855p5964J9478N0066j2674k3645N8384J8560
$$ -160671 -147994 -86666 -12346 24252 52107 -23857 -4379 45687 33013 9368 67752 86312
6350H6312l2384o0387J3034P387o0876m2322K8470K0371R5871p587j56779k9461
$$ 86312 53928 -6459 6575 13962 -46914 -89236 -60766 -40395 55476 47889 -108890 -138351
6338a38351j0486l6803M1976N1200P4439L422N4078j3318q120j8988N4320q794
$$ -138351 -148837 -185640 -143664 -92464 -18025 -14603 39475 26157 18037 -951 53369 44575
6326D4575o2492m095J5828j0736n7042R718N0511P864K8727l0888j4050L4339
$$ 44575 -17917 -22012 -6184 -16920 -73962 -64244 -13733 -5869 22858 -8030 -22080 12259
6314A2259L5455k7661J25L1162O783m2549j5087M6756k0690o0408J1057P5515
$$ 12259 47714 20053 20178 51340 58123 15574 487 47243 26553 -33855 -22798 52717
6302E2717J9824m6029j1777K0622m7409K2734j1394o3350O2285o3452o390P3754
$$ 52717 72541 26512 14735 35357 -12052 10682 -712 -64062 -1777 -65229 -71619 2135
6290B135k5422k5534L3575J1065m2554k5452p022P6327L2111k7897O3128J07575
$$ 2135 -23287 -48821 -15246 -4181 -46735 -72187 -79209 -2882 29229 1332 64460 172035
6278A72035M3649p0493m8757k4410j6814L582j2753p5126l4166q619M4967J2192
$$ 172035 215684 145191 96434 72024 55210 58792 46039 -29087 -63253 -71872 -26905 -14713
6266a4713P8337p030N386m4154L1999k0400p2214L1782J7204K5011M8611r8906
$$ -14713 63624 56594 61980 17826 49825 29425 -42789 -11007 6197 31208 79819 -19087
6254a9087N296P2916O5609j2060m8878j7971K8669k9269q8752J3434J16387K3394
$$ -19087 -13791 59125 124734 112674 63796 45825 74494 45225 -43527 -30093 86294 109688
$$ [...]
##END NTUPLES=NMR SPECTRUM
##END=
