##TITLE=Analysis number 325765
Compound Code mo 00855
Project Code adrs
Chemist Name endeavour
##JCAMPDX= 6.0         $$ Bruker NMR JCAMP-DX V2.0
##DATA TYPE= NMR SPECTRUM
##DATA CLASS= NTUPLES
##ORIGIN= Bruker BioSpin GmbH
##OWNER= nmr
$$ XWIN-NMR		Version 3.5
$$ Fri Jan 12 10:27:57 2007 GMT Standard Time (UT+0h)  MAYBRIDGE\nmr@NMR_250MHZ
##.OBSERVE FREQUENCY= 250.131544655141
##.OBSERVE NUCLEUS= ^1H
##.ACQUISITION MODE= SIMULTANEOUS (DQD)
##.ACQUISITION SCHEME= undefined
##.AVERAGES= 16
##.DIGITISER RES= 18
##SPECTROMETER/DATA SYSTEM= dpx250
##.PULSE SEQUENCE= zg30
##.SOLVENT NAME= CDCl3
##.SHIFT REFERENCE= (INTERNAL, CDCl3, 0, 16.4498)
##AUDIT TRAIL= $$ (NUMBER, WHEN, WHO, WHERE, WHAT)
$$ ##TITLE= Audit trail, XWIN-NMR		Version 3.5
$$ ##JCAMPDX= 5.01
$$ ##ORIGIN= Bruker BioSpin GmbH
$$ ##OWNER= nmr
$$ C:\u/data/dgb/nmr/ADRS/960/pdata/1/auditp.txt
$$ ##AUDIT TRAIL=  $$ (NUMBER, WHEN, WHO, WHERE, WHAT)
(   1,<2007-01-12 10:27:39.59 +000>,<MAYBRIDGE\nmr>,<NMR_250MHZ>,
      <created by zg, POWCHK disabled, PULCHK disabled
       configuration hash MD5:
       49 4B E0 1D 92 C2 6B 37 9F E6 65 BC 52 41 86 1D
       data hash MD5: 64K
       EC 2D 99 19 59 45 A9 F0 AF C0 81 BC DE CF 22 A0>)
(   2,<2007-01-12 10:27:50.73 +000>,<MAYBRIDGE\nmr>,<NMR_250MHZ>,
      <Start of raw data processing
       ef LB = 0.3 FT_mod = 6 PKNL = 1 SI = 32K 
       data hash MD5: 32K
       A7 65 1A C7 E3 A0 D3 9F 80 F1 BD C8 BD AA 23 8C>)
(   3,<2007-01-12 10:27:52.47 +000>,<MAYBRIDGE\nmr>,<NMR_250MHZ>,
      <apk 
       data hash MD5: 32K
       B8 5B 46 3E 13 01 3A 45 50 B3 9E FC 0F A6 FC 4B>)
(   4,<2007-01-12 10:27:53.22 +000>,<MAYBRIDGE\nmr>,<NMR_250MHZ>,
      <abs ABSG = 5 
       data hash MD5: 32K
       4A F3 57 BB 91 12 6B 0A 4C 49 8F CB 87 DD ED 83>)
$$ ##END=
$$ 
$$ hash MD5
$$ 22 FD 6E FE CA D8 84 DD 0E E8 8A CF C6 C6 B0 0A
##$RELAX= 
##$RELAX= 
##$RELAX= 
##$RELAX= 
##$RELAX= 
##$RELAX= 
##$RELAX= 
$$ Bruker specific parameters
$$ --------------------------
##$DU= <C:\u>
##$EXPNO= 960
##$NAME= <ADRS>
##$PROCNO= 1
##$TYPE= <nmr>
##$USER= <dgb>
##$AMP= (0..31)
100 100 100 100 100 100 100 100 100 100 100 100 100 100 100 100 100 100 
100 100 100 100 100 100 100 100 100 100 100 100 100 100 
##$AQSEQ= 0
##$AQ_mod= 3
##$AUNM= <au_zg>
##$AUTOPOS= <7 >
##$BF1= 250.13
##$BF2= 250.13
##$BF3= 250.13
##$BF4= 250.13
##$BF5= 500.13
##$BF6= 500.13
##$BF7= 500.13
##$BF8= 500.13
##$BYTORDA= 1
##$CFDGTYP= 0
##$CFRGTYP= 5
##$CHEMSTR= <none>
##$CNST= (0..31)
1 1 145 1 1 1 1 1 1 1 1 1 1 1 1 1 1 1 1 1 1 1 1 1 1 1 1 1 1 1 1 1 
##$CPDPRG= <>
##$CPDPRG1= <>
##$CPDPRG2= <>
##$CPDPRG3= <>
##$CPDPRG4= <mlev>
##$CPDPRG5= <mlev>
##$CPDPRG6= <mlev>
##$CPDPRG7= <mlev>
##$CPDPRG8= <mlev>
##$CPDPRGB= <>
##$CPDPRGT= <>
##$D= (0..31)
0 1 0 0 0 0 0 0 0 0.06 0 0 0 0 0 0 0.0002 0 0 0 0 0 0 0 0 0 0 0 0 0 0 
0 
##$DATE= 1168597658
##$DBL= (0..7)
120 120 120 120 120 120 120 120 
##$DBP= (0..7)
150 150 150 150 150 150 150 150 
##$DBP07= 0
##$DBPNAM0= <>
##$DBPNAM1= <>
##$DBPNAM2= <>
$$ [...]
##$SUBNAM7= <"">
##$SUBNAM8= <"">
##$SUBNAM9= <"">
##$SW= 20.6930455092707
##$SWIBOX= (0..15)
0 0 3 0 0 0 0 0 0 0 0 0 0 0 0 0 
##$SW_h= 5175.983436853
##$TD= 65536
##$TD0= 1
##$TE= 294.16
##$TE2= 300
##$TE3= 300
##$TEG= 300
##$TL= (0..7)
0 120 120 120 120 120 120 120 
##$TP= (0..7)
150 150 150 150 150 150 150 150 
##$TP07= 0
##$TPNAME0= <>
##$TPNAME1= <>
##$TPNAME2= <>
##$TPNAME3= <>
##$TPNAME4= <>
##$TPNAME5= <>
##$TPNAME6= <>
##$TPNAME7= <>
##$TPOAL= (0..7)
0.5 0.5 0.5 0.5 0.5 0.5 0.5 0.5 
##$TPOFFS= (0..7)
0 0 0 0 0 0 0 0 
##$TUNHIN= 0
##$TUNHOUT= 0
##$TUNXOUT= 0
##$USERA1= <user>
##$USERA2= <user>
##$USERA3= <user>
##$USERA4= <user>
##$USERA5= <user>
##$V9= 5
##$VALIST= <valist>
##$VCLIST= <CCCCCCCCCCCCCCC>
##$VD= 0
##$VDLIST= <DDDDDDDDDDDDDDD>
##$VPLIST= <PPPPPPPPPPPPPPP>
##$VTLIST= <TTTTTTTTTTTTTTT>
##$WBST= 1024
##$WBSW= 4
##$XGAIN= (0..3)
0 0 0 0 
##$XL= 0
##$YL= 0
##$YMAX_a= 309910
##$YMIN_a= -388883
##$ZGOPTNS= <>
##$ZL1= 120
##$ZL2= 120
##$ZL3= 120
##$ZL4= 120
##$ABSF1= 16.44976
##$ABSF2= -4.243412
##$ABSG= 5
##$ABSL= 3
##$ALPHA= 0
##$AQORDER= 0
##$ASSFAC= 0
##$ASSFACI= 0
##$ASSFACX= 0
##$ASSWID= 0
##$AUNMP= <proc_1d>
##$AZFE= 0.1
##$AZFW= 0.1
##$BCFW= 0
##$BC_mod= 0
##$BYTORDP= 0
##$COROFFS= 0
##$CY= 12.5
##$DATMOD= 1
##$DC= 0
##$DFILT= <>
##$DTYPP= 0
##$F1P= 14.0000005364418
##$F2P= -0.99999901652339
##$FCOR= 0.5
##$FTSIZE= 32768
##$FT_mod= 6
##$GAMMA= 0
##$GB= 0
##$INTBC= 1
##$INTSCL= 1
##$ISEN= 128
##$LB= 0.3
##$LEV0= 0
##$LPBIN= 0
##$MAXI= 10000
##$MC2= 0
##$MEAN= 0
##$ME_mod= 0
##$MI= 0
##$NCOEF= 0
##$NC_proc= -3
##$NLEV= 6
##$NOISF1= 0
##$NOISF2= 0
##$NSP= 0
##$NTH_PI= 0
##$NZP= 0
##$OFFSET= 16.44976
##$PC= 1
##$PHC0= 228.0181
##$PHC1= 6.310462
##$PH_mod= 1
##$PKNL= yes
##$PPARMOD= 0
##$PSCAL= 4
##$PSIGN= 0
##$REVERSE= no
##$SF= 250.130018067776
##$SI= 32768
##$SIGF1= 0
##$SIGF2= 0
##$SINO= 400
##$SIOLD= 32768
##$SREGLST= <1H.CDCl3>
##$SSB= 0
##$STSI= 32768
##$STSR= 0
##$SW_p= 5175.98343685301
##$SYMM= 0
##$S_DEV= 0
##$TDeff= 65536
##$TDoff= 0
##$TI= <Analysis number 999999
Compound Code 99
Book Reference 9
Project Code 9>
##$TILT= no
##$TM1= 0
##$TM2= 0
##$TOPLEV= 0
##$USERP1= <user>
##$USERP2= <user>
##$USERP3= <user>
##$USERP4= <user>
##$USERP5= <user>
##$WDW= 1
##$XDIM= 32768
##$YMAX_p= 591231294
##$YMIN_p= -182935
$$ End of Bruker specific parameters
$$ ---------------------------------
##NTUPLES= NMR SPECTRUM
##VAR_NAME=  FREQUENCY,     SPECTRUM/REAL,   SPECTRUM/IMAG
##SYMBOL=    X,             R,               I
##VAR_TYPE=  INDEPENDENT,   DEPENDENT,       DEPENDENT
##VAR_FORM=  AFFN,          ASDF,            ASDF
##VAR_DIM=   32768,         32768,           32768
##UNITS=     HZ,            ARBITRARY UNITS, ARBITRARY UNITS
##FACTOR=    0.157963299565203, 1,           1
##FIRST=     4114.57887532033, 0,            0
##LAST=      -1061.40456153268, 0,           0
##MIN=       -1061.40456153268, -182935,     0
##MAX=       4114.57887532033, 591231294,    0
$$ Real data points
##PAGE= N=1
##DATA TABLE= (X++(R..R)), XYDATA
$$ [...]
$$ plain form
17044 -11628 -32637 -53168 -25408 -17540 -18661 -12501 -7985 -16607 -36366 -49099 2719 9703 1379
17031 1379 -18505 -25821 -24842 -41871 -60978 -39567 -29899 -24734 -20397 -30909 -31496 -18786 -705
17018 -705 -32726 -40607 -41832 -24250 -9784 -8756 -24907 -59472 -32942 -36573 -26721 -11272 -2268
17005 -2268 21506 20403 16183 -15597 3772 3693 16435 35121 11852 -23785 -26580 -13851 -859
16992 -859 19962 -2334 -50124 -78222 -32204 1384 4313 7331 28092 22586 -17750 -33618 -25133
16979 -25133 -375 -10997 1508 10930 -6864 -14315 10936 -13921 -38451 -3484 20295 10454
16967 10454 17230 -11833 -43232 -38329 -23483 -24698 -3805 9154 33144 51382 44730 20689
16955 20689 7369 9505 -3077 -24618 -41013 -34031 -33891 -26608 -18284 -25645 -36022 -15926 -29925
$$ packed form
17044a1628k1009k0531K7760P868j121O160M516q622j9759j2733N1818O984q324
17031A379j9884p316R79j7029j9107K1411R668N165M337j0512n87J2710J8081
17018g05l2021p881j225J7582J4466J028j6151l4565K6530l631R852J5449R004
17005b268K3774j103m220l1780J9369p9J2742J8686k3269l5637k795J2729J2992
16992h59K0821k2296m7790k8098M6018L3588K929L018K0761n506m0336j5868Q485
16979b5133K4758j0622J2505R422j7794p451K5251k4857k4530L4967K3779r841
16967A0454O776k9063l1399M903J4846j215K0893J2959K3990J8238o652k4041
16955B0689j3320K136j2582k1541j6395O982J40P283Q324p361j0377K0096j3999
$$ plain form
16942 -29925 -45149 -50191 -42454 -29728 -29059 -16016 -11763 -10823 -508 -23740 -29899 -13034 -28274
16929 -28274 -41461 -43229 -46010 -44261 -38712 -32996 -27009 -25951 2093 22201 -5084 -14420 -2075
16916 -2075 -26877 -46277 -31068 25068 39107 47798 44142 46016 5936 -38873 -13086 -19266 -25389
16903 -25389 -847 27162 28035 6354 17419 12445 -1688 -15929 -14123 -4783 -18320 -61870 -40666
16890 -40666 -35042 -42298 -66452 -79489 -45816 -7282 12904 13541 3497 -13668 5839 46139
16878 46139 48029 44088 63057 66132 75882 53856 53395 81628 122801 113223 120262 206673 307857
16865 307857 396407 478328 646179 806942 964665 1053458 1044617 980728 854534 730266 597171
16854 597171 438431 299140 213861 144001 81467 58647 62316 81048 82393 73513 70291 38092
$$ packed form
16942b9925j5224n042P737J2726O69J3043M253R40J0315k3232o159J6865j5240
16929b8274j3187j768k781J749N549N716N987J058K8044K0108k7285r336J2345
16916b075k4802j9400J5209N6136J4039Q691l656J874m0080m4809K5787o180o123
16903b5389K4542K8009Q73k1681J1065m974j4133j4241J806R340j3537m3550K1204
16890d0666N624p256k4154j3037L3673L8534K0186O37j0044j7165J9507M0300
16878D6139J890l941J8969L075R750k2026m61K8233M1173r578P039Q6411J01184
16865C07857Q8550Q1921J67851J60763J57723Q8793q841o3889j26194j24268j33095
16854E97171j58740j39291q5279o9860o2534k2820L669J8732J345q880l222l2199
$$ plain form
16842 38092 -4280 10064 16837 -25566 -5894 4248 14818 2346 -12746 -12003 -13136 -13075 -2383
16829 -2383 -15570 3369 7995 -16139 7079 16118 -27624 -41562 -47548 -31416 -36387 -37293 -33110
16816 -33110 -18372 -32077 -56245 -62742 -22241 -27567 -50907 -57363 -64773 -45329 -39135 -51049 -71364
16803 -71364 -61496 -50534 -30428 -19326 12857 -9648 -44609 -45963 -28523 -3543 17600 17401
16791 17401 32117 -201 -13133 -6972 33775 48212 37119 8893 21020 29326 11072 -4873
16779 -4873 -21241 -11023 15088 -3246 -9770 -45403 -74914 -95228 -79070 -68703 -59134 -38130
16767 -38130 -33413 -31653 1032 -12950 -28544 -18775 -45510 -36516 -50286 -65608 -42922 -45554 -13372
16754 -13372 -17997 -21972 -25607 -52192 -73561 -76786 -77305 -44418 -33626 -45778 -37486 3159 -17444
$$ packed form
16842C8092m2372J4344O773m2403J9672J0142J0570j2472j5092P43j133O1J0692
16829b383j3187J8939M626k4134K3218R039m3742j3938n986J6132m971r06M183
16816c3110J4738j3705k4168o497M0501n326k3340o456p410J9444O194j1914k0315
16803g1364R868J0962K0106J1102L2183k2505l4961j354J7440K4980K1143j99
16791A7401J4716l2318j2932O161M0747J4437j1093k8226J2127Q306j8254j5945
16779d873j6368J0218K6111j8334o524l5633k9511k0314J6158J0367R569K1004
16767c8130M717J760L2685j3982j5594R769k6735Q994j3770j5322K2686k632L2182
16754a3372m625l975l635k6585k1369l225n19L2887J0792j2152Q292M0645k0603
$$ plain form
16741 -17444 -42652 -25228 -17400 840 26517 18093 10162 6207 318 -18170 4408 15178 9165
16728 9165 -39504 -39433 3985 286 -40154 -44951 -17556 -4559 -17950 -25223 -41865 -53285 -42448
16715 -42448 -58123 -25878 -30658 -44561 -49212 -40528 -42732 -22307 -23727 5352 13556 -1205 -18618
16702 -18618 -27028 -28778 -29147 -16707 -24272 -49622 -85190 -89978 -57007 -37231 -54231 -61946 -34513
16689 -34513 -20839 -21346 -37990 -67041 -46382 -25456 5494 19335 -15185 -55588 -65451 -57963
16677 -57963 -43751 -38089 -55751 -46170 -32652 -58713 -67337 -55872 -53649 -68380 -63036 -33642 -24964
16664 -24964 3297 -2291 -30094 -47278 -57621 -63006 -47656 -33172 -68539 -65877 -28708 -42657
16652 -42657 1633 13347 -11693 -29057 -44147 -62635 -21894 -43054 -73613 -63892 -34232 -20324
$$ packed form
16741a7444k5208J7424P828J8240K5677q424p931l955n889j8488K2578J0770o013
16728I165m8669P1M3418l699m0440m797K7395J2997j3391p273j6642j1420J0837
16715d2448j5675L2245m780j3903m651Q684k204K0425j420K9079Q204j4761j7413
16702a8618q410j750l69J2440p565k5350l5568m788L2971J9776j7000p715K7433
16689c4513J3674n07j6644k9051K0659K0926L0950J3841l4520m0403r863P488
16677e7963J4212N662j7662R581J3518k6061q624J1465K223j4731N344K9394Q678
16664b4964K8261n588k7803j7184j0343n385J5350J4484l5367K662L7169j3949
16652d2657M4290J1714k5040j7364j5090j8488M0741k1160l0559R721K9660J3908
$$ plain form
16640 -20324 -26556 -25041 -3987 -11436 7705 45408 53841 24737 -22607 -44273 -46011 -28599 -8760
16627 -8760 -5634 -9692 -25940 -58758 -87832 -31244 -726 -2179 -8544 7769 15419 -13237 -37137
16614 -37137 -72956 -113442 -92823 -78332 -38275 -25499 -63081 -96333 -46236 -6225 -5811 -32594
16602 -32594 -24918 -18323 8571 202 -2781 4885 -21034 -9534 26945 11367 -11736 -65499 -71451
16589 -71451 -35749 -49389 -57974 -60651 -25415 16997 -12492 -40013 -61403 -48654 -41809 -36757
16577 -36757 -14408 6832 31451 29156 24530 17847 20853 18547 10349 -35694 -50413 -25400 10337
16564 10337 10447 -8177 -13555 -29397 -38268 -22207 2078 31564 18124 -29192 -31275 -11648 -14069
16551 -14069 -23563 -23647 -32518 -63925 -54058 -63963 -81117 -85250 -46982 4998 454 -8545 17004 45954
$$ packed form
16640b0324o232J515K1054p449J9141L7703Q433k9104m7344k1666j738J7412J9839
16627h760L126m058j6248l2818k9074N6588L0518j453o365J6313P650k8656k3900
16614c7137l5819m0486K0619J4491M0057J2776l7582l3252N0097M0011M14k6783
16602c2594P676O595K6894q369k983P666k5919J1500L6479j5578k3103n3763n952
16589g1451L5702j3640q585k677L5236M2412k9489k7521k1390J2749O845N052
16577c6757K2349K1240K4619k295m626o683L006k306q198m6043j4719K5013L5737
16564A0337J10j8624n378j5842q871J6061K4285K9486j3440m7316k083J9627k421
16551a4069r494q4q871l1407R867r905j7154m133L8268N1980m544q999K5549K8950
$$ plain form
16537 45954 46400 48512 25707 8170 -23143 -45252 -54577 -20721 -21072 -17919 -2667 24851 48708
16524 48708 39643 49321 27707 -24493 -17402 -25977 -42337 -37568 -1128 -3075 -5837 35870 8989
16511 8989 3915 657 -42907 -70724 -78732 -57492 -19945 -13267 -18967 -52518 -67319 -43691 -43319
16498 -43319 -57452 -54049 -56499 -46230 -28107 -9270 -24779 -13882 15802 17482 -7594 6309
16486 6309 9258 -20017 -43870 -48577 -44634 -2665 10706 29181 67395 59047 12715 -29575 -44160
16473 -44160 -57456 -71999 -66424 -47091 -32569 -11713 -28628 2312 50149 16074 -1149 608
16461 608 -19476 -42739 -32770 -10287 -100 -22387 -60334 -58188 -26906 -5563 48166 83914
16449 83914 66702 31310 -12567 -21617 -59665 -97061 -97001 -94129 -84717 -52070 -26894 -13543 -37422
$$ packed form
16537D5954M46K112k2805j7537l1313k2109r325L3856l51L153J5252K7518K3857
16524D8708r065R678k1614n2200P091q575j6360M769L6440j947k762M1707k6881
16511H989n074l258m3564k7817q008K1240L7547O678n700l3551j4801K3628L72
16498d3319j4133L403k450J0269J8123J8837j5509J0897K9684J680k5076J3903
16486F309K949k9275k3853m707L943M1969J3371J8475L8214q348m6332m2290j4585
16473d4160j3296j4543N575J9333J4522K0856j6915L0940M7837l4075j7223J757
16461F08k0084k3263R969K2483J0187k2287l7947K146L1282K1343N3729L5748
16449H3914j7212l5392m3877r050l8048l7396O0K872R412L2647K5176J3351k3879
$$ plain form
16436 -37422 -27673 -1063 -13696 -23554 -20039 -13513 -4366 -36306 -49980 -53129 -46663 -20480 -26547
16423 -26547 -59883 -48519 -44132 -25065 -38792 -31159 -1263 -11683 -8609 18917 4311 -22688
16411 -22688 -29486 -27984 -9382 -4192 -27304 -22304 -15798 -21115 -25474 5271 9629 13558 1358
16398 1358 8990 8541 12563 -22367 -47025 -46509 -9257 14663 19930 49514 33758 21546 17538
16385 17538 15772 -11854 -19923 -10437 -4916 10989 55386 90833 56840 35965 20068 34833
16373 34833 48141 2673 2387 23248 28030 4745 -13205 -24325 -36685 -23599 -34131 -58919
16361 -58919 -55326 -35009 -18576 -22400 -29362 -19168 -19572 -855 28054 50602 71876 28078 -17527
16348 -17527 -18146 6720 24507 19353 -2713 -8089 -20180 -16971 -12636 -7101 30858 37685 -2477
$$ packed form
16436c7422R749K6610j2633r858L515O526R147l1940j3674l149O466K6183o067
16423b6547l3336J1364M387J9067j3727P633K9896j0420L074K7526j4606k6999
16411b2688o798J502J8602N190k3112N000O506n317m359L0745M358L929j2200
16398A358P632m49M022l4930k4658N16L7252K3920N267K9584j5756j2212m008
16385A7538j766k7626q069R486N521J5905M4397L5447l3993k0875j5897J4765
16373C4833J3308m5468k86K0861M782k3285j7950j1120j2360J3086j0532k4788
16361e8919L593K0317J6433l824o962J0194m04J8717K8909K2548K1274m3798m5605
16348a7527o19K4866J7787n154k2066n376j2091L209M335N535L7959O827m0162
$$ plain form
16335 -2477 -10619 7094 7817 -11958 -18718 -3377 24606 14883 -12438 -8532 1365 -2590 -4884 -10524
16321 -10524 -31125 -43793 -53641 -36059 -24291 -16401 699 -23972 -27639 -9612 -18212 -45145
16309 -45145 -38954 -44751 -51453 -91347 -94804 -28939 5973 7123 -24770 -55189 -52027 -55622 -55428
16296 -55428 -23862 -29442 -44877 -55838 -15870 -17433 -17103 -26152 -31421 -12484 -2376 -13415 -35158
16283 -35158 -28636 -13071 1255 18295 -15306 -20102 -29772 -54531 -65726 -57096 -35911 -13825
16271 -13825 767 -24812 1002 34799 11080 -31092 -33990 -21516 -38146 -61687 -37768 -56497
16259 -56497 -62671 -66973 -64704 -57053 -42386 -5953 2763 -68 -34899 -41149 -66137 -45484 -33697
16246 -33697 -38240 10146 -14833 -32709 -15309 -25461 -6056 5657 -22450 -23775 6904 33473
$$ packed form
16335b477q142J7713P23j9775o760J5341K7983r723k7321L906R897l955k294n640
16321a0524k0601j2668r848J7582J1768P890J7100k4671l667J8027q600k6933
16309d5145O191n797o702l9894l457O5865L4912J150l1893l0419L162l595J94
16296e5428L1566n580j5435j0961L9968j563L30r049n269J8937J0108j1039k1743
16283c5158O522J5565J4326J7040l3601m796r670k4759j1195Q630K1185K2086
16271a3825J4592k5579K5814L3797k3719m2172k898J2474j6630k3541K3919j8729
16259e6497o174m302K269P651J4667L6433Q716k831l4831o250k4988K0653J1787
16246c3697m543M8386k4979j7876J7400j0152J9405J1713k8107j325L0679K6569
$$ plain form
16234 33473 29648 279 -20211 -48470 -67673 -29187 -37897 -70388 -65635 -72717 -39204 -20746
16222 -20746 -27611 -27397 -20985 9810 2950 -15824 -50528 -38432 -91 -13241 -37830 -22324 -4867
16209 -4867 1913 11252 37416 -3322 -39324 -34489 -1506 11039 5290 24413 47831 18896 -11505
16196 -11505 -15638 -39774 -32732 2898 21897 6858 -944 -10206 8817 6112 -5708 -38398 -34357
16183 -34357 -66908 -68984 -38734 -18065 -27159 -49360 -58890 -31629 -20462 -23350 -40004 -44424 -7096
16170 -7096 23788 36780 17128 12320 -5803 -62436 -92022 -58384 -30000 -19090 -1234 -55614
16158 -55614 -79062 -61504 -63941 -83794 -73135 -62117 -59849 -42497 -14510 -19881 -40425 -45742
16146 -45742 -50775 -52654 -33008 -11540 -22764 -28365 8175 9209 -22271 -20310 -35797 -35611 -32622
$$ packed form
16234C3473l825k9369k0490k8259j9203L8486q710l2491M753p082L3513J8458
16222b0746o865K14O412L0795o860j8774l4704J2096L8341j3150k4589J5506J7457
16209d867O780R339K6164m0738l6002M835L2983J2545n749J9123K3418k8935l0401
16196a1505m133k4136P042L5630J8999j5039p802r262J9023k705j1820l2690M041
16183c4357l2551k076L0250K0669r094k2201r530K7261J1167k888j6654m420L7328
16170g096L0884J2992j9652m808j8123n6633k9586L3638K8384J0910J7856n4380
16158e5614k3448J7558k437j9853J0659J1018K268J7352K7987n371k0544n317
16146d5742n033j879J9646K1468j1224n601L6540J034l1480J961j5487J86K989
$$ plain form
16133 -32622 -23314 -49706 -51026 -43619 3344 -18803 -45093 -44304 -54207 -25471 -2233 -2082 9832
16120 9832 18340 25289 48551 43875 9385 -29581 -30377 -16306 -41928 -70524 -82818 -70837 -27322
16107 -27322 -3662 1260 -20174 -45028 -42607 -29875 6849 5636 -27071 -23302 -1923 -14183
16095 -14183 -25999 8514 -1920 -34924 -27600 -44383 -44274 -33992 -46259 -65982 -85361 -50574
16083 -50574 -38414 -39495 -35944 -26593 -59170 -57219 14380 15988 -32288 -55293 -73559 -73594 -80148
16070 -80148 -114293 -99862 -61473 -96846 -99668 -74639 -45916 -35489 -43047 -38187 -13298 -26585
16058 -26585 -40961 -14341 -44264 -39937 -46901 -43733 -32046 -20635 -30749 -49039 -48769 -40655 -50773
16045 -50773 -52206 -46300 -63341 -89925 -50135 -17046 -12182 -5876 -23944 -40514 -11723 9615
$$ packed form
16133c2622R308k6392j320P407M6963k2147k6290P89r903K8736K3238J51J1914
16120I832Q508O949K3262m676l4490l8966p96J4071k5622k8596j2294J1981M3515
16107b7322K3660M922k1434k4854K421J2732L6724j213l2707L769K1379j2260
16095a4183j1816L4513j0434l3004P324j6783J09J0282j2267j9723j9379L4787
16083e0574J2160j081L551R351l2577J951P1599J608m8276k3005j8266l5o554
16070h0148l4145J4431L8389l5373k822K5029K8723J0427p558M860K4889j3287
16058b6585j4376K6620k9923M327o964L168J1687J1411j0114j8290K70Q114j0118
16045e0773j433N906j7041k6584L9790L3089M864O306j8068j6570K8791K1338
$$ plain form
16033 9615 19073 17968 20300 -14951 -7775 5754 16365 16453 3011 8492 5589 -6071 34142 25711
16019 25711 53670 59707 72467 48617 6626 -12230 -55883 -33338 -3189 -20258 -11706 -4182
16007 -4182 -12955 -10772 -30868 -34740 -21233 -8254 13535 4648 -20314 -51618 -45359 -21141 29904
15994 29904 69411 51688 18676 -17079 -39938 -34542 -26820 -57589 -94986 -75325 -44321 -32848
15982 -32848 -31621 -12713 169 6841 13065 -3419 -17333 11031 34060 29897 -329 -28974
15970 -28974 -48637 -57006 -52535 -45234 -35874 -14047 15049 3690 -33301 -47103 -70844 -76155 -75207
15957 -75207 -62053 -61722 -61442 -33329 -10144 21701 21297 7981 8957 15074 -11611 -5951 -11541 -3807
15943 -3807 17050 33727 -10240 -7612 20351 36259 -23040 -43940 -53499 -57629 -22761 -8788
$$ packed form
16033I615R458j105K332l5251P176J3529J0611Q8j3442N481k903j1660M0213q431
16019B5711K7959O037J2760k3850m1991j8856m3653K2545L0149j7069Q552P524
16007d182q773K183k0096l872J3507J2979K1789q887k4962l1304O259K4218N1045
15994B9904L9507j7723l3012l5755k2859N396P722l0769l7397J9661L1004J1473
15982c2848J227J8908J2882O672O224j6484j3914K8364K3029m163l0226k8645
15970b8974j9663q369M471P301R360K1827K9096j1359l6991j3802k3741n311R48
15957g5207J3154L31K80K8113K3185L1845m04j3316R76O117k6685N660n590P734
15943c807K0857J6677m3967K628K7963J5908n9299k0900r559m130L4868J3973
$$ plain form
15931 -8788 -35835 -31890 -12500 -24017 -28536 -7162 11121 22263 7199 -8023 -22930 -15651
15919 -15651 -29664 -19337 -30205 -13011 -8757 9136 -530 -5093 14314 -30286 -51634 -23695
15907 -23695 -27940 -92484 -116681 -85915 -73497 -24518 -11280 24976 11805 -22146 -31316 -35409
15895 -35409 -45214 -52580 -31017 4002 10453 11123 -9308 17879 69321 70308 38341 18941 39072
15882 39072 13717 -13983 -22078 8902 17847 1830 3633 10195 17171 9883 -17620 -22848 -11910
15869 -11910 -35022 -57023 -35414 -29251 -24045 -32120 -37717 -49986 -23303 6503 -31477 -49977
15857 -49977 -33509 5832 20199 -10464 -15869 -8911 -12492 -47675 -58501 -56702 -53953 -45795 -51178
15844 -51178 -49664 -61413 -52556 -29452 -31670 -26640 24513 13306 -954 7773 37303 33533 17543
$$ packed form
15931h788k7047L945J9390j1517m519K1374J8283J1142j5064j5222j4907P279
15919a5651j4013J0327j0868J7194M254J7893r666m563J9407m4600k1348K7939
15907b3695m245o4544k4197L0766J2418M8979J3238L6256j3171l3951r170m093
15895c5409r805p366K1563L5019O451O70k0431K7187N1442R87l1967j9400K0131
15882C9072k5355k7700q095L0980Q945j6017J803O562O976p288k7503n228J0938
15869a1910k3112k2001K1609O163N206q075n597j2269K6683K9806l7980j8500
15857d9977J6468L9341J4367l0663n405O958l581l5183j0826J799K749Q158n383
15844e1178J514j1749Q857K3104k218N030N1153j1207j4260Q727K9530l770j5990
$$ plain form
15831 17543 20274 22739 28811 24813 20485 253 -226 -31287 -44812 -11565 6799 -3724 9847
15818 9847 -1377 -10400 945 8248 -1677 -2750 -6007 4324 24214 2207 -16781 -13902 -24047
15805 -24047 -25606 -45063 -37896 -8132 -1944 -7985 -13446 -22451 -27662 -1506 -9569 -2567 -7497 -18472
15791 -18472 -12646 -32350 -41976 -41445 -31566 1945 7460 -8089 -18925 -6172 20834 538 -57423
15778 -57423 -80976 -27615 -14054 6166 19675 -9645 -8675 -19139 -23008 -35853 -19221 9012
15766 9012 16771 25479 15554 -6621 9919 58579 58490 47688 14472 4376 5116 -17835 -25354 -21078
15752 -21078 -61027 -45025 -17801 -35883 -9801 20757 26025 44588 21207 14281 11787 -19093
15740 -19093 -41838 -52525 -26985 -5780 -25139 -29356 -20461 3970 28356 15589 -21586 -29179
$$ packed form
15831A7543K731K465O072l998m328k0232m79l1061j3525L3247J8364j0523J3571
15818I847j1224r023J1345P303r925j073l257J0331J9890k2007j8988K879j0145
15805b4047j559j9457P167K9764O188o041n461r005n211K6156q063P002m930j0975
15791a8472N826j9704r626N31R879L3511N515j5549j0836J2753K7006k0296n7961
15778e7423k3553N3361J3561K0220J3509k9320R70j0464l869j2845J6632K8233
15766I012P759Q708r925k2175J6540M8660q9j0802l3216j0096P40k2951p519M276
15752b1078l9949J6002K7224j8082K6082L0558N268J8563k3381o926k494l0880
15740a9093k2745j0687K5540K1205j9359m217Q895K4431K4386j2767l7175p593
$$ plain form
15728 -29179 -8505 13781 18693 44650 39993 40362 27162 6049 -22818 -7117 16334 -2412
15716 -2412 -18753 -15734 -17582 -52601 -37252 -14340 -6099 6141 25823 16497 -608 5566 -21681
15703 -21681 -28532 -16262 -22929 -5735 -35707 -89829 -83116 -59758 -41597 -57236 -34143 4550
15691 4550 308 1078 26408 36503 34963 -12988 -11193 -35606 -36061 -941 -27615 -59807 -41884
15678 -41884 -32273 -11459 1283 -24146 -42189 -50150 -6440 6978 -5846 11597 41523 29028
15666 29028 -5023 -32657 -3848 -6163 -18726 -12292 -10889 -3654 17353 6774 -21569 -35467
15654 -35467 -29347 -14190 19498 14534 3117 25602 13192 14482 12117 -14305 -2509 -5599 -33424
15641 -33424 -23595 -5321 12321 8705 5687 7355 -13533 -23300 -5757 25243 16073 -3651 -14840
$$ packed form
15728b9179K0674K2286M912K5957m657L69j3200k1113k8867J5701K3451j8746
15716b412j6341L019j848l5019J5349K2912Q241J2240J9682r326j7105O174k7247
15703b1681o851J2270o667J7194k9972n4122O713K3358J8161j5639K3093L8693
15691D550m242P70K5330J0095j540m7951J795k4413m55L5120k6674l2192J7923
15678d1884R611K0814J2742k5429j8043p961M3710J3418j2824J7443K9926j2495
15666B9028l4051k7634K8809k315j2563O434J403P235K1007j0579k8343j3898
15654c5467O120J5157L3688m964j1417K2485j2410J290k365k6422J1796l090k7825
15641c3424R829J8274J7642l616l018J668k0888r767J7543L1000r170j9724j1189
$$ plain form
15628 -14840 -48178 -44777 -39901 -27687 -21087 -64079 -86213 -65203 -40811 -37897 -6842 20673
15616 20673 51861 32363 10064 -35709 -69388 -12713 10598 39800 61452 21888 -11701 15120
15604 15120 -8217 -27780 -9494 -3234 -11062 -16851 -9137 -46973 -62695 -51940 -41220 -31669 -12845
15591 -12845 -1311 16884 20999 -11325 -4382 19483 46566 33322 -7659 -5949 8993 8025 -12109
15578 -12109 -3235 6095 27685 51676 18766 15540 51637 69313 17034 2329 -8969 -18515
15566 -18515 -12248 3418 -3288 -2776 10605 36187 12523 25984 11734 39463 53429 69099
15554 69099 74625 39288 -3478 -35644 -59233 -90386 -73110 -11505 12655 -4303 -451 -3124
15542 -3124 -34173 -40682 -46407 -34091 -29772 -22569 -29503 -53869 -64924 -65738 -61111 -57312 -18483 -699
$$ packed form
15628a4840l3338L401M876J2214O600m2992k2134K1010K4392K914L1055K7515
15616B0673L1188j9498k2299m5773l3679N6675K3311K9202K1652l9564l3589K6821
15604A5120k3337j9563J8286O260p828n789P714l7836j5722J0755J0720R551J8824
15591a2845J1534J8195M115l2324O943K3865K7083j3244m0981J710J4942r68k0134
15578a2109Q874R330K1590K3991l2910l226L6097J7676n2279j4705j1298r546
15566a8515O267J5666o706N12J3381K5582k3664J3461j4250K7729J3966J5670
15554F9099N526l5337m2766l2166k3589l1153J7276O1605K4160j6958L852k673
15542c124l1049o509n725J2316M319P203o934k4366j1055q14M627L799L8829J7784
$$ plain form
15528 -699 -9850 -8699 21721 71238 67375 47662 33718 23891 5920 24325 60425 58762 60211
15515 60211 24534 7778 -7330 -33664 -36740 -63621 -37990 35915 7634 -20891 -16344 7045
15503 7045 24832 59452 36690 29703 -10889 -36201 -35824 -27538 -12215 -11142 -11846 18253 25422
15490 25422 -9201 -16553 -17604 9068 12732 -1849 -10007 11099 24563 50280 40265 44914 15084
15477 15084 -10998 -27244 -43096 -52807 -54845 -67162 -79521 -47476 -15252 -8772 14470 4469
15465 4469 -21068 -26193 -3727 1982 -16224 -20573 -193 -20594 -13985 13467 7293 10078 34448
15452 34448 23916 15812 26119 26493 41066 35265 7317 -65727 -96795 -58278 -33410 -20977
15440 -20977 -1296 15541 48482 47252 42867 30734 21904 -944 -16186 -33137 -5796 8512
$$ packed form
15528f99r151J151L0420M9517l863j9713j3944r827j7971J8405L6100j663J449
15515F0211l5677j6756j5108k6334l076k6881K5631P3905k8281k8525M547K3389
15503G045J7787L4620k2762o987m0592k5312L77Q286J5323J073p04L0099P169
15490B5422l4623p352j051K6672L664j4581q158K1106J3464K5717j0015M649k9830
15477A5084k6082j6246j5852r711k038j2317j2359L2045L2224O480K3242j0001
15465D469k5537n125K2466N709j8206m349K0380k0401O609K7452o174K785K4370
15452C4448j0532q104J0307L74J4573n801k7948p3044l1068L8517K4868J2433
15440b0977J9681J6837L2941j230m385j2133q830k2848j5242j6951K7341J4308
$$ plain form
15428 8512 1388 21175 20070 43149 50152 31868 20263 1552 -20866 -19182 6140 16947 3085
15415 3085 15079 15798 -34806 -60884 -42405 -26304 -10333 31247 42807 48580 45219 13941 -12906
15402 -12906 -7089 -3869 -12938 -32108 -39802 -42305 -62866 -42837 -14180 -35617 -38051 -24861 -4054
15389 -4054 20425 8789 -19617 -20713 -38741 -13319 16332 12685 2459 3697 6488 12164 7128
15376 7128 -15070 -48076 -25733 -5574 -10792 -15483 -12276 -21466 -38414 -24244 -41497 -37687 -29574
15363 -29574 -580 -33567 -8914 -1058 -19607 -8450 11551 5375 -10622 9619 35181 -1081
15351 -1081 -12604 -34189 -38377 -29958 -42434 -38755 -19857 8636 -10015 -67968 -65767 -79101 -57751
15338 -57751 -16492 -16911 -4319 3609 -31631 -7343 12693 -4145 -17474 22973 40344 19555
$$ packed form
15428H512p124J9787j105K3079P003j8284j1605j8711k2418J684K5322J0807j3862
15415C085J1994P19n0604k6078J8479J6101J5971M1580J1560N773l361l1278k6847
15402a2906N817L220r069j9170p694k503k0561K0029K8657k1437k434J3190K0807
15389d054K4479j1636k8406j096j8028K5422K9651l647j0226J238K791N676n036
15376G128k2198l3006K2343K0159n218m691L207r190j6948J4170j7253L810Q113
15363b9574K8994l2987K4653P856j8549J1157K0001o176j5997K0241K5562l6262
15351a081j1523k1585m188Q419j2476L679J8898K8493j8651n7953K201j3334K1350
15338e7751M1259m19J2592P928l5240K4288K0036j6838j3329M0447J7371k0789
$$ plain form
15326 19555 -10474 -30718 -25515 -42312 -11957 24668 -8277 -38488 -75017 -60139 14773 30239
15314 30239 -96 -17040 -38460 -20843 10503 23482 43130 123 -32498 -50347 -66620 -45514
15302 -45514 -9954 -17528 -30655 -19339 8867 14187 5729 -4072 -1183 -27791 -40983 -69371 -63079
15289 -63079 -72618 -81735 -96022 -71194 -25109 -438 -23639 -10738 1080 -20452 -30088 -26575
15277 -26575 -43225 -22948 -17708 -1199 -19552 -36500 -36442 -41502 -36251 -31676 -6090 13925 2703
15264 2703 -32351 -41077 -44071 -45998 -25550 -26267 -6809 -25035 -30248 -41484 -50012 -44070 -60794
15251 -60794 -79542 -93686 -66742 -41772 -21365 -3305 -6305 -915 -1061 -29981 -5635 32396
15239 32396 81953 50729 -22540 -24891 4362 -12253 -52081 -74070 -64526 -70633 -102073 -90058
$$ packed form
15326A9555l0029k0244N203j6797L0355L6625l2945l0211l6529J4878P4912J5466
15314C0239l0335j6944k1420J7617L1346J2979J9648m3007l2621j7849j6273K1106
15302d5514L5560p574j3127J1316K8206N320q458r801K889k6608j3192k8388O292
15289f3079r539r117j4287K4828M6085K4671k3201J2901J1818k1532r636L513
15277b6575j6650K0277N240J6509j8353j6948N8n060N251M575K5586K0015j1222
15264B703l5054q726k994j927K0448p17J9458j8226n213j1236q528N942j6724
15251f0794j8748j4144K6944K4970K0407J8060l000N390j46k8920K4346L8031
15239C2396M9557l1224p3269k351K9253j6615l9828k1989R544o107l1440J2015
$$ plain form
15227 -90058 -66109 -67849 -32240 -12636 -48811 -46538 -35690 -49871 -40775 -36081 -39350 -36652 -58751
15214 -58751 -51093 -42308 -25310 -1982 -12820 -1430 29131 19066 -5357 -2377 12273 44297
15202 44297 70252 28060 -20756 -50317 -51616 -36843 -9755 34701 55893 47193 39438 23132
15190 23132 20047 39557 31649 47529 44178 27036 -3748 -12120 -18986 -40565 -41828 -16556 5225
15177 5225 24353 24820 -2767 -44014 -16399 -1455 -42244 -7091 24118 25769 3584 29867
15165 29867 22116 3541 -10774 -1877 -20679 -11270 -17228 -36979 -37739 -22042 -8355 36975 29923
15152 29923 23312 4930 -51803 -89974 -77290 -85549 -106905 -89624 -26886 37632 45853 11144
15140 11144 -8125 4655 19679 -19213 -17600 710 2036 7849 28523 27822 29266 21405 26160
$$ packed form
15227i0058K3949j740L5609J9604l6175K273J0848j4181R096M694l269K698k2099
15214e8751P658Q785J6998K3328j0838J1390L0561j0065k4423K980J4650L2024
15202D4297K5955m2192m8816k9561j299J4773K7088M4456K1192q700p755j6306
15190B3132l085J9510p908J5880l351j7142l0784q372o866k1579j263K5272K1781
15177E225J9128M67k7587m1247K7615J4944m0789L5153L1209J651k2185K6283
15165B9867p751j8575j4315Q897j8802R409n958j9751p60J5697J3687M5330p052
15152B9923o611j8382n6733l8171J2684q259k1356J7281O2738O4518Q221l4709
15140A1144j9269J2780J5024l8892J613J8310J326N813K0674p01J444p861M755
$$ plain form
15127 26160 7813 10611 -7248 10407 18435 56176 55881 12652 -16649 -9084 -19853 -43994 -40602
15114 -40602 -4173 -2811 -28516 -6724 10040 6407 3912 27837 31353 -18255 -50187 -59839 -43734
15101 -43734 4840 -5999 -54580 -80557 -42258 -27081 -33409 -14527 -18790 -484 23999 16528
15089 16528 20217 31980 -28807 -67605 -71135 -49395 -35273 -30411 -34946 -22083 -33337 -26195 -16418
15076 -16418 -40551 -49742 -40407 -61603 -70696 -61498 -2817 2765 -1646 -11500 -54524 -60505 -40498
15063 -40498 -18776 -19891 -24484 -9789 -12949 -27873 -28607 -36306 -43573 -36295 -30714 -43008 -50685 -31458
15049 -31458 -56395 -44849 -11869 2305 -15149 -20491 -4121 2931 -2599 -4580 -6441 -21711 -34096
15036 -34096 -30514 -8446 8658 13289 28018 32515 38245 43996 45083 33292 52167 68023 34112
$$ packed form
15127B6160j8347K798j7859J7655Q028L7741k95m3229k9301P565j0769k4141L392
15114d0602L6429J362k5705K1792J6764l633k495K3925L516m9608l1932r652J6105
15101d3734M8574j0839m8581k5977L8299J5177o328J8882m263J8306K4483p471
15089A6528L689J1763o0787l8798l530K1740J4122M862m535J2863j1254P142R777
15076a6418k4133r191R335k1196r093R198N8681N582m411r854m3024n981K0007
15063d0498K1722j115m593J4695l160j4924p34p699p267P278N581j2294p677J9227
15049c1458k4937J1546L2980J4174j7454n342J6370P052n530j981j861j5270j2385
15036c4096L582K2068J7104M631J4729M497N730N751J087j1791J8875J5856l3911
$$ plain form
15023 34112 2632 -11805 8841 20645 9877 18384 7261 -27434 -32012 -36655 -23941 -10
15011 -10 23758 -10195 -37249 -27049 -4032 -23669 -25869 -7963 28345 86580 148499 232523
14999 232523 204598 129747 68392 26876 46945 58143 89668 89857 41396 -9982 -44716 -55083
14987 -55083 -61405 -55777 -53767 -47344 -5741 -34127 -57500 -41236 -47776 -42838 -29444 26195 23984
14974 23984 3529 -40926 -57793 -61642 -46595 -14926 -13899 -7231 8026 6023 818 -2910 -2742
14961 -2742 -32497 -77256 -45980 -22367 -10120 -13451 -33948 -32557 -5432 28514 37190 15649
14949 15649 -12568 11441 8255 14081 35048 41809 42780 50253 42067 43351 11770 -26380 -19225
14936 -19225 1910 5320 3535 -31399 -57143 -74381 -61372 -68172 -111250 -91737 -57377 -14935
$$ packed form
15023C4112l1480j4437K0646J1804j0768Q507j1123l4695m578m643J2714K3931
15011a0K3768l3953k7054J0200K3017j9637k200J7906L6308N8235O1919Q4024
14999B32523k7925p4851o1355m1516K0069J1198L1525J89m8461n1378l4734j0367
14987e5083o322N628K010O423M1603k8386k3373J6264o540M938J3394N5639k211
14974B3984k0455m4455j6867l849J5047L1669J027O668J5257k003n205l728J68
14961b742k9755m4759L1276K3613J2247l331k0497J391K7125L3946Q676k1541
14949A5649k8217K4009l186N826K0967O761R71P473q186J284l1581l8150P155
14936a9225K1135L410j785l4934k5744j7238J3009o800m3078J9513L4360M2442
$$ plain form
14924 -14935 -14188 -820 -9132 -15040 -13724 -18473 -25321 -6604 -3260 15799 -2378 -25575 -26621
14911 -26621 -65601 -71630 -46348 -31991 -67311 -64211 -49760 -43262 -41766 -36723 -37713 -55397 -55542
14898 -55542 -63299 -56310 -31647 -37371 -31291 -40162 -35333 22603 27700 -10145 -39104 -31427 -17486
14885 -17486 -8233 -35104 -40409 -28485 -41427 -38620 -15296 -13346 -2946 5297 21054 25394 11958
14872 11958 4542 15645 10867 -9366 -19991 -4365 46414 63895 47976 25949 16110 50846
14860 50846 97132 78693 39613 29801 9895 -26219 -13792 14504 2071 -21047 -45768 -49985
14848 -49985 -31909 -9450 -11401 -20950 -29079 1545 -9456 8298 16688 -13718 -35209 -51567
14836 -51567 -43506 -74525 -48619 -48157 -38447 -10225 -4170 18452 -4785 -20437 1101 28175 37248
$$ packed form
14924a4935P47J3368q312n908J316m749o848J8717L344J9059j8177k3197j046
14911b6621l8980o029K5282J4357l5320L100J4451O498J496N043r90j7684j45
14898e5542p757O989K4663n724O080q871M829N7936N097l7845k8959P677J3941
14885a7486R253k6871n305J1924j2942K807K3324J950J0400Q243J5757M340j3436
14872A1958p416J1103m778k0233j0625J5626N0779J7481j5919k2027r839L4736
14860E0846M6286j8439l9080r812j9906l6114J2427K8296j2433k3118k4721m217
14848d9985J8076K2459j951r549q129L0624j1001J7754Q390l0406k1491j6358
14836e1567Q061l1019K5906M62R710K8222O055K2622k3237j5652K1538K7074R073
$$ plain form
14823 37248 26716 13167 36742 28180 36373 -5519 -23106 -23903 -15718 -12985 16121 37027 7786
14810 7786 -16851 -18566 -21968 -15323 -11336 -15170 -17265 -15923 -7315 -1854 20728 33503 43639 49615
14796 49615 38193 8315 24178 12179 2060 -6897 -17331 -34468 -27214 -12460 11179 16030
14784 16030 -10821 -2769 -18040 -40498 -31129 -12332 8650 8659 -19587 -12099 -6182 1893 -19007
14771 -19007 -38132 -3251 36461 18015 -6901 -2040 -10110 7767 5060 -26975 -48629 -45574
14759 -45574 -32587 -29660 378 29089 7791 32965 67930 55614 14930 -42752 -52135 -28597
14747 -28597 -9796 -13162 8389 24560 19875 41811 12619 -42969 1091 -923 -23713 -41202
14735 -41202 -26975 -30704 -37939 -19599 -24085 -25814 -23223 -38653 -52337 -79263 -63331 -13843 32928
$$ packed form
14823C7248j0532j3549K3575q562Q193m1892j7587p97Q185K733K9106K0906k9241
14810G786k4637j715l402O645L987l834k095J342Q608N461K2582J2775J0136N976
14796D9615j1422k9878J5863j1999j0119q957j0434j7137P254J4754K3639M851
14784A6030k6851Q052j5271k2458R369J8797K0982Rk8246P488N917Q075k0900
14771a9007j9125L4881L9712j8446k4916M861q070J7877k707l2035k1654L055
14759d5574J2987K927L0038K8711k1298K5174L4965j2316m0684n7682r383K3538
14747b8597J8801l366K1551J6171m685K1936k9192n5588M4060k014k2790j7489
14735d1202J4227l729p235J8340m486j729K591j5430j3684k6926J5932M9488M6771
$$ plain form
14722 32928 -4198 839 4561 -35234 -15341 33198 60943 12833 -15896 164 36895 52433
14710 52433 25860 -29535 -62775 -65107 -33608 -40040 -30219 -4 795 -10306 -994 11162 13035
14697 13035 -14607 -27152 -69946 -74649 -40597 3410 28475 -7942 -57914 -65893 -51815 -20795
14685 -20795 -1273 12393 -3637 -30563 -25922 -20066 -18503 -27758 -21867 13549 39183 23948 -15355
14672 -15355 6090 20124 -4561 8736 32856 48366 54627 39735 26928 -7775 -34373 -33512
14660 -33512 9813 25506 15274 29136 43115 47868 18598 -4301 -13107 -17373 -23783 -18733 1512
14647 1512 4922 8795 21917 -12418 -21972 12560 27161 35010 2036 -33217 -64491 -36692 -15127
14634 -15127 -10550 27179 28271 16907 18357 -3199 -24690 -6449 27604 8593 -26985 -37626
$$ packed form
14722C2928l7126N037L722l9795J9893M8539K7745m8110k8729J6060L6731J5538
14710E2433k6573n5395l3240k332L1499o432R821L0215P99j1101R312J2156J873
14697A3035k7642j2545m2794m703L4052M4007K5065l6417m9972p979J4078L1020
14685b0795J9522J3666j6030k6926M641N856J563r255N891L5416K5634j5235l9303
14672a5355K1445J4034k4685J3297K4120J5510O261j4892j2807l4703k6598Q61
14660c3512M3325J5693j0232J3862J3979M753k9270k2899q806m266o410N050K0245
14647A512L410L873J3122l4335r554L4532J4601P849l2974l5253l1274K7799K1565
14634a5127M577L7729J092j1364J450k1556k1491J8241L4053j9011l5578j0641
$$ plain form
14622 -37626 -21926 -28425 -10671 -755 29504 -15293 -60968 -19982 -2073 -24500 -24206 -16222 -4013
14609 -4013 923 15079 25406 14078 27711 52814 58704 47262 40318 31960 26946 23858 -10544
14596 -10544 3309 -5909 14496 15076 192 6467 18519 15402 6254 4291 5064 -1623 10393 386
14582 386 -34455 -8676 3211 -1782 -1405 -36873 -18836 11183 20713 21987 33740 17842 23888
14569 23888 8543 -7287 -22427 -22037 3561 3827 -38265 -30694 12376 5898 23445 15646 -9953
14556 -9953 -41558 -24050 -7064 -21117 -34738 -41811 -31211 -42135 -61109 -56197 -9703 -13710
14544 -13710 -32452 -31385 15237 33826 47211 54999 107780 79137 17172 -11572 -28444 -26587
14532 -26587 -49924 -61240 -33956 4242 -18739 -51056 -41851 -13416 -17809 -39216 -26446 -2394
$$ packed form
14622c7626J5700o499J7754R916L0259m4797m5675M0986J7909k2427K94P984J2209
14609d013M936J4156J0327j1328J3633K5103N890j1442o944q358n014l088l4402
14596a0544J3853r218K0405N80j4884O275J2052l117r148j963P73o687J2016j0007
14582C86l4841K5779J1887m993L77l5468J8037L0019R530J274J1753j5898O046
14569B3888j5345j5830j5140L90K5598K66m2092P571M3070o478J7547p799k5599
14556i953l1605J7508J6986j4053j3621p073J0600j0924j8974M912M6494m007
14544a3710j8742J067M6622J8589J3385P788N2781k8643o1965k8744j6872J857
14532b6587k3337j1316K7284L8198k2981l2317R205K8435m393k1407J2770K4052
$$ plain form
14520 -2394 14295 11932 -1111 -27327 -45398 -42510 -45032 -57794 -37234 -46575 -32844 -12116 -7880
14507 -7880 9407 11540 -4759 5346 26160 19725 29921 34253 21318 848 44719 25254
14495 25254 -30314 -46775 -47807 -62268 -37603 -36179 -77646 -52533 -14342 -21048 -21980 -16543 18855
14482 18855 36198 30970 34657 25881 22152 7668 26744 62269 43039 44383 41504 14689 -4580
14469 -4580 -10554 -2927 5248 2769 -489 23346 2702 15406 26741 45898 50778 27679 41513
14456 41513 41520 34654 36551 2153 6028 -10269 -18144 -33427 -57088 -36516 -11294 -22888 -32846
14443 -32846 -38349 -62586 -56713 -14619 11923 29400 27288 27747 6451 2140 -37284 -54502 -22680
14430 -22680 -6668 284 -4493 -46809 -68114 -50438 -29114 5455 11671 -10656 -22892 -14759
$$ packed form
14520b394J6689k363j3043k6216j8071K888k522j2762K0560r341J3731K0728M236
14507g880J7287K133j6299J0105K0814o435J0196M332j2935k0470M3871j9465
14495B5254n5568j6461j032j4461K4665J424m1467K5113L8191o706r32N437L5398
14482A8855J7343n228L687q776l729j4484J9076L5525j9230J344k879k6815j9269
14469d580n974P627Q175k479l258K3835k0644J2704J1335J9157M880k3099J3834
14456D1513Po866J897l4398L875j6297p875j5283k3661K0572K5222j1594r958
14443c2846n503k4237N873M2094K6542J7477k112M59k1296m311l9424j7218L1822
14430b2680J6012O952m777m2316k1305J7676K1324L4569O216k2327j2236Q133
$$ plain form
14418 -14759 -44252 -45577 -12035 12483 -15580 -7122 -17570 -15154 12391 27284 -6864 -9874
14406 -9874 2278 -37633 -21246 31663 63291 79429 81694 65010 38431 6600 -16878 -23682
14394 -23682 -18645 11511 35368 5194 -11991 -28832 3989 43089 26092 10119 -26754 -33318
14382 -33318 -17443 -41905 -45228 -76460 -62443 -69761 -47311 -40294 -31997 -30691 1328 17406 1780
14369 1780 -6901 -11935 3321 9982 -5522 8755 -7581 -5575 19215 30318 20575 10812 -11589
14356 -11589 -8907 -7360 -3838 8314 -1220 -32420 -15237 -2922 458 2682 -870 14072 8735
14343 8735 -17429 -37816 -26482 -11228 -4410 12550 15543 11370 10233 20190 12736 -33309 -44288
14330 -44288 -47239 -52485 -145 44588 39306 14906 -42196 -36922 -20330 -6914 2837 -944 -1491
$$ packed form
14418a4759k9493j325L3542K4518k8063Q458j0448K416K7545J4893l4148l010
14406i874J2152l9911J6387N2909L1628J6138K265j6684k6579l1831k3478o804
14394b3682N037L0156K3857l0174j7185j6841L2821L9100j6997j5973l6873o564
14382c3318J5875k4462l323l1232J4017p318K2450P017Q297J306L2019J6078j5626
14369A780q681n034J5256O661j5504J4277j6336K006K4790J1103r743r763k2401
14356a1589K682J547L522J2152r534l1200J7183J2315L380K224l552J4942n337
14343H735k6164k0387J1334J5254O818J6960K993m173j137R957p454m6045j0979
14330d4288k951n246N2340M4733n282k4400n7102N274J6592J3416R751l781n47
$$ plain form
14317 -1491 -11881 -79208 -88170 -84842 -85423 -79255 -79829 -60676 -74856 -67784 -43632 3283 41093
14304 41093 -1610 -26077 -9046 11891 -2118 8337 29521 5308 -1290 10432 203 -32187
14292 -32187 -6271 6955 -19283 -36295 3381 43749 51155 28373 33087 17287 5521 17244
14280 17244 -3875 -20739 -20633 -20630 12510 19115 -4962 -14826 -31851 -31124 -12232 10171 -1047 -14174
14266 -14174 -36011 -46781 -45144 -47072 -29437 -27209 -6075 -6057 -28395 -24056 -12841 -2412 34091
14253 34091 16804 -7053 -30436 -19690 13315 16579 -9180 -15859 -7906 -18985 -31368 -49326
14241 -49326 -32414 -34408 -20443 14252 48817 29184 23 -2951 15586 -511 -15616 -963
14229 -963 -26865 -43140 -17373 7790 -6186 -32760 -4492 -7122 -41857 -41481 -17648 -14451 -6803
$$ packed form
14317a491j0390o7327q962L328n81O168n74J9153j4180P072K4152M6915L7810
14304D1093m2703k4467J7031K0937j4009J0455K1184k4213o598J1722j0229l2390
14292c2187K5916J3226k6238j7012L9676M0368P406k2782M714j5800j1766J1723
14280A7244k1119j6864J06LL3140O605k4077r864j7025P27J8892K2403j1218j3127
14266a4174k1837j0770J637j928J7635K228K1134J8k2338M339J1215J0429L6503
14253C4091j7287k3857k3383J0746L3005L264k5759o679P953j1079j2383j7958
14241d9326J6912j994J3965L4695L4565j9633k9161k974J8537j6097j5105J4653
14229i63k5902j6275K5767K5163j3976k6574K8268k630l4735L76K3833L197P648
$$ plain form
14216 -6803 -13915 -22149 -11861 -379 -45703 -16365 -10929 -10783 -6395 3837 28713 53814 60802
14203 60802 90549 73238 49792 38814 36207 45799 52335 50260 40621 10525 284 28404 35212
14190 35212 41541 36908 27907 28818 36889 59278 33238 6226 -9555 -25709 -48512 -35543 1798
14177 1798 10145 -10665 -20590 23278 25524 12663 8122 7590 -28617 -16585 -6430 22553 50200
14164 50200 70401 46711 59890 49056 23467 -37378 -38643 -13921 -4912 1300 -1371 -47634
14152 -47634 -52003 -13654 5448 14105 13375 -10962 -29746 -25844 9490 36380 44751 76050 69903
14139 69903 55593 30543 13430 714 -21961 -21686 -12734 -20668 17065 42310 38347 4621 -17585
14126 -17585 -31558 -12725 7531 13711 6556 21577 32821 12663 26433 52395 23695 5302
$$ packed form
14216f803p112q234J0288J1482m5324K9338N436J46M388J0232K4876K5101O988
14203F0802K9747j7311k3446j0978k607R592O536k075r639l0096j0241K8120O808
14190C5212O329m633r001R11Q071K2389k6040k7012j5781j6154k2803J2969L7341
14177A798Q347k0810r925M3868K246j2861m541n32l6207J2032J0155K8983K7647
14164E0200K0201k3690J3179j0834k5589o0845j265K4722R009O212k671m6263
14152d7634m369L8349J9102Q657p30k4337j8784L902L5334K6890Q371L1299o147
14139F9903j4310k5050j7113j2716k2675K75Q952p934L7733K5245l963l3726k2206
14126a7585j3973J8833K0256O180p155J5021J1244k0158J3770K5962k8700j8393
$$ plain form
14114 5302 5421 19235 28359 20212 -3698 -19116 -11715 15321 11866 -2105 -6402 13820 2019
14101 2019 552 14447 -12154 -7509 -6381 25823 11873 8827 8637 20114 24362 5610 -2530
14088 -2530 -3475 6215 -21492 -14211 -7804 5458 13011 49986 38788 23907 36519 28233 31028
14075 31028 53895 63898 87842 84380 45981 28493 54758 85245 73784 76728 48906 25987
14063 25987 33632 32832 37204 55894 88547 105129 103652 68221 16099 -11868 4064 11036 18430
14050 18430 55974 88415 79111 60721 36433 51289 64465 87121 69796 71141 52100 48144
14038 48144 52636 46798 62099 78690 59580 36756 31514 28623 8736 15564 32010 51735 39726
14025 39726 40640 97023 116975 80580 53986 58049 42763 55483 52115 38879 38378 36951 66499
$$ packed form
14114E302J19J3814R124q147k3910j5418P401K7036l455j3971m297K0222j1801
14101B019j467J3895k6601M645J128L2204j3950l046j90J1477M248j8752q140
14088b530r45R690k7707P281O407J3262P553L6975j1198j4881J2612q286K795
14075C1028K2867J0003K3944l462l8399j7488K6265L0487j1461K944k7822k2919
14063B5987P645q00M372J8690L2653J6582j477l5431n2122k7967J5932O972P394
14050A8430L7544L2441r304j8390k4288J4856J3176K2656j7325J345j9041l956
14038D8144M492n838J5301J6591j9110k2824n242k891j9887O828J6446J9725j2009
14025C9726R14N6383J9952l6395k6594M063j5286J2720l368j3236n01j427K9548
$$ plain form
14012 66499 56728 45053 28102 65963 103147 97799 87185 70525 75782 52399 70708 87092
14000 87092 99142 65362 42031 60366 59810 36537 42014 44723 39979 56504 66096 66315 106155
13987 106155 112213 112610 89918 76798 84484 66038 70430 75042 71222 91112 69222 26639 20697
13974 20697 32435 19428 7407 -14081 -7470 5553 11384 -5111 3015 13683 33468 34926
13962 34926 13201 -5023 -23132 1176 -11517 -10792 18199 39264 15534 -32160 -22509 -5770
13950 -5770 -27489 -54231 -30435 -2702 -1117 -34971 -59890 -56254 -46236 -58851 -48152 -23596
13938 -23596 -20253 -37929 -37549 -26935 -952 13075 22944 25990 40262 45892 25017 -22197 -9079
13925 -9079 39889 62156 50871 -10251 -58381 -77474 -18395 6429 15749 -8217 -21406 4900
$$ packed form
14012F6499r771j1675j6951L7861L7184n348j0614j6660N257k3383J8309J6384
14000H7092J2050l3780k3331J8335n56k3273N477K709m744J6525R592K19L9840
13987A06155O058L97k2692j3120P686j8446M392M612l820J9890k1890m2583n942
13974B0697J1738j3007j2021k1488O611J3023N831j6495Q126J0668J9785J458
13962C4926k1725j8224j8109K4308j2693P25K8991K1065k3730m7694R651J6739
13950e770k1719k6742K3796K7733J585l3854k4919L636J0018j2615J0699K4556
13938b3596L343j7676L80J0614K5983J4027R869L046J4272N630k0875m7214J3118
13925i079M8968K2267j1285o1122m8130j9093N9079K4824R320k3966j3189K6306
$$ plain form
13913 4900 16433 -20841 -33410 -13886 5742 29008 37319 63353 49788 22912 31781 39394
13901 39394 56320 35475 49973 32762 50476 50983 36584 21510 17255 30878 16404 -7945
13889 -7945 -18198 -31648 -33928 -62626 -54258 -21046 -9772 -32439 3361 26009 6127 26152
13877 26152 43525 53801 24203 26920 16972 12753 -4201 6161 -5441 -3991 -26157 -23234 -6406
13864 -6406 26606 6775 -2962 -18499 -32563 -32162 -10826 -16847 -17673 -65929 -51923 -26170 -4203
13851 -4203 -2476 16211 11671 14087 -3681 3235 -2202 -39941 -34645 9601 31975 15477 5785
13838 5785 12557 44687 31134 26103 13737 -21177 -10865 7688 23957 21312 416 -21542
13826 -21542 -20080 -21022 -44440 -42010 -13549 15488 15346 31933 34275 4296 -1432 -10526 -18048 -9821
$$ packed form
13913D900J1533l7274j2569J9524J9628K3266Q311K6034j3565k6876Q869P613
13901C9394J6926k0845J4498j7211J7714N07j4399j5074m255J3623j4474k4349
13889g945j0253j3450k280k8698Q368L3212J1274k2667L5800K2648j9882K0025
13877B6152J7373J0276k9598K717r948m219j6954J0362j1602J450k2166K923J6828
13864f406L3012j9831r737j5537j4064M01K1336o021q26m8256J4006K5753K1967
13851d203J727J8687m540K416j7768O916n437l7739N296M4246K2374j6498r692
13838E785O772L2130j3553n031j2366l4914J0312J8553J6269k645k0896k1958
13826b1542J462r42k3418K430K8461K9037j42J6587K342k9979n728r094p522Q227
$$ plain form
13812 -9821 -3164 5094 2305 27448 22513 43549 34143 21113 -8121 -14199 -19634 838 31143
13799 31143 35191 -6570 -31040 -1720 42867 37736 22437 36166 68407 45826 47928 41538
13787 41538 19060 -12966 -24462 -22954 -20936 -15573 28822 68082 53429 16489 -1264 -38459
13775 -38459 -36198 -39562 -64774 -44725 -5055 24663 30823 32756 50156 54580 32449 37505 31088
13762 31088 38577 55827 58035 10283 182 937 -11026 -25712 -24472 -6904 -27040 -22889 -11124
13749 -11124 -8889 -3621 27557 45792 14514 -34067 -40193 -4534 -399 123 19573 -1023 -128
13736 -128 -34380 -34098 -21835 -15498 1569 12915 20526 21553 20150 7136 -26999 -33258 -5985
13723 -5985 13788 -4464 -37236 -55252 -57399 -56818 -48750 -54336 -53805 -42224 -35170 -20455 -38777
$$ packed form
13812i821O657Q258k789K5143m935K1036r406j3030k9234o078n435K0472L0305
13799C1143M048m1761k4470K9320M4587n131j5299J3729L2241k2581K102o390
13787D1538k2478l2026j1496J508K018N363M4395L9260j4653l6940j7753l7195
13775c8459K261l364k5212K0049L9670K9718O160J933J7400M424k2131N056o417
13762C1088P489J7250K208m7752j0101P55j1963j4686J240J7568k0136M151J1765
13749a1124K235N268L1178J8235l1278m8581o126L5659M135N22J9450k0596Q95
13736a28l4252K82J2263O337J7067J1346P611J027j403j3014l4135o259K7273
13723e985J9773j8252l2772j8016k147N81Q068n586N31J1581P054J4715j8322
$$ plain form
13710 -38777 -24589 -6766 -33091 -54070 -76104 -55468 -29647 -9578 -10360 -14003 -33790 -39665
13698 -39665 9552 30237 44077 59691 68673 39021 -15761 -34482 -20972 -14840 -17624 -11464
13686 -11464 5788 27168 23071 19874 14906 -9869 -21156 9276 33049 3484 28123 40764
13674 40764 28390 29582 16148 10732 42593 41695 55088 51239 22962 2114 361 -5787 -2574
13661 -2574 6545 31551 11709 5213 31261 48067 28694 28144 25368 26072 3248 -20728 -16621
13648 -16621 32444 36178 29044 40750 12007 4888 17542 19820 6862 12048 11518 19238 30203
13635 30203 16381 -21091 -30502 -28452 -54838 -68262 -48718 -21039 -59304 -35086 8737 9350
13623 9350 5409 2543 -12385 -14637 -5947 -6627 -17854 -37079 -22015 19945 9380 -7001 -10078
$$ packed form
13710c8777J4188J7823k6325k0979k2034K0636K5821K0069p82l643j9787n875
13698c9665M9217K0685J3840J5614Q982k9652n4782j8721J3510O132k784O160
13686a1464J7252K1380m097l197m968k4775j1287L0432K3773k9565K4639J2641
13674D0764j2374J192j3434n416L1861q98J3393l849k8277k0848j753o148L213
13661b574R119K5006j9842o496K6048J6806j9373n50k776P04k2824k3976M107
13648a6621M9065L734p134J1706k8743p119J2654K278j2958N186n30P720J0965
13635C0203j3822l7472r411K050k6386j3424J9544K7679l8265K4218M3823O13
13623I350l941k866j4928k252Q690o80j1227j9225J5064M1960j0565j6381l077
$$ plain form
13610 -10078 -17822 -20320 -10993 28228 41619 50583 52342 -4103 -36602 -35409 -31139 -70 36836
13597 36836 16246 -1913 13712 25365 -4599 -25751 -42403 -45493 -30210 -26002 21834 59037
13585 59037 73945 61329 47520 32751 35680 29669 17097 5701 -17233 -30578 -18982 -7628
13573 -7628 -5743 -18866 -15397 28615 21613 -3981 -4086 -18526 -32911 -8084 1223 2203 -8817
13560 -8817 -19536 13927 -3325 11423 43954 58807 86712 94566 112097 112890 81743 26436
13548 26436 4356 -2932 -8493 -20156 702 8040 10292 -1835 -10537 -20122 -7009 -24882 -16105
13535 -16105 9912 32255 14469 18180 -2832 -22494 -9136 -3896 -16884 -9843 19829 25943
13523 25943 19258 6307 -3386 -47643 -42359 -34789 -25470 -21080 -8510 805 -36360 -19710 20573
$$ packed form
13610a0078p744k498R327L9221J3391Q964J759n6445l2499J193M270L1069L6906
13597C6836k0590j8159J5625J1653k9964k1152j6652l090J5283M208M7836L7203
13585E9037J4908j2616j3809j4769K929o011j2572j1396k2934j3345J1596J1354
13573g628J885j3123L469M4012p002k5594j05j4440j4385K4827R307R80j1020
13560h817j0719L3463j7252J4748L2531J4853K7905P854J7531P93l1147n5307
13548B6436k2080p288n561j1663K0858P338K252j2127q702r585J3113j7873Q777
13535a6105K6017K2343j7786L711k1012j9662J3358N240j2988P041K9672O114
13523B5943o685j2951r693m4257N284P570R319M390J2570R315l7165J6650M0283
$$ plain form
13510 20573 22308 28007 81999 97565 48318 19857 10983 1798 -6662 -6360 -11923 13656 -22384
13497 -22384 -44697 -6800 -4701 -21489 -34584 -7142 -2333 -9700 -8606 12446 -8492 -32486
13485 -32486 -5491 19872 15542 -4684 -12550 -6708 -22484 -51816 -42365 7840 42071 26313
13473 26313 18727 -4294 16492 21243 -214 7727 17041 8605 906 -14936 -16442 -45061 -25803
13460 -25803 -24342 10989 -11109 -56197 -58257 -35058 -22287 6662 33971 10564 -10481 -15770
13448 -15770 -13848 -11832 -17198 -44260 -45593 -38143 -55460 -15193 -7761 -42361 -41230 -27703 -18261
13435 -18261 -18991 -23024 6345 18775 -5015 -3625 -17806 -16637 -25230 -17058 -24086 -17710 1454
13422 1454 -13143 18477 24798 44189 33283 30979 29523 36114 5013 31444 23222 2209 8154
$$ packed form
13510B0573J735N699N3992J5566m9247k8461q874r185q460L02n563K5579l6040
13497b2384k2313L7897K099j6788j3095K7442M809p367J094K1052k0938k3994
13485c2486K6995K5363m330k0226p866N842j5776k9332R451N0205L4231j5758
13473B6313p586k3021K0786M751k1457P941R314q436p699j5842j506k8619J9258
13460b5803J461L5331k2098m5088k060K3199J2771K8949K7309k3407k1045n289
13448a5770J922K016n366k7062j333P450j7317M0267P432l4600J131J3527R442
13435a8261p30m033K9369J2430k3790J390j4181J169q593Q172p028O376J9164
13422A454j4597L1620O321J9391j0906k304j456O591l1101K6431q222k1013N945
$$ plain form
13409 8154 3942 28764 36254 -4119 -23607 -29636 -69396 -45402 1170 18595 14889 -18838 -38491
13396 -38491 -40975 -73474 -84770 -66412 -38612 -4506 -37146 -61081 -63819 -59811 -42201 -35238
13384 -35238 -35639 -32182 -9152 -3296 -31641 -57676 -47879 -53702 -59299 -54117 -27493 -34706 -49647
13371 -49647 -27900 3258 39676 26062 29849 13376 -6044 -32307 -10605 8887 -10631 -47671
13359 -47671 -70037 -62599 -35463 184 12613 13479 736 -1944 18539 22308 2839 3639 -1137
13346 -1137 -2765 31334 42542 17223 12834 -9841 -27328 -25344 -7648 -33067 -32200 -12189 -24564
13333 -24564 1446 6734 15395 9229 -11359 29880 20415 35 9483 30777 -7495 -22451 -43417
13320 -43417 -31975 -32044 -16796 -650 -17371 -3691 4190 27723 26151 -7734 2030 1808 14237
$$ packed form
13409H154m212K4822P490m0373j9488o029l9760K3994M6572J7425l706l3727j9653
13396c8491k484l2499j1296J8358K7800L4106l2640k3935k738M008J7610O963
13384c5238m01L457K3030N856k8345k6035R797n823n597N182K6624p213j4941
13371d9647K1747L1158L6418j3614L787j6473j9420k6263K1702J9492j9518l7040
13359d7671k2366P438K7136L5647J2429Q66j2743k680K0483L769j9469Q00m776
13346a137j628L4099J1208k5319m389k2675j7487J984J7696k5419Q67K0011j2375
13333b4564K6010N288Q661o166k0588M1239r465k0380R448K1294l8272j4956k0966
13320d3417J1442o9J5248J6146j6721J3680P881K3533j572l3885R764k22J2429
$$ plain form
13307 14237 24535 16756 16865 5732 18092 11734 3573 29642 35595 22067 20259 31722 56651
13294 56651 81511 61740 35208 32321 51946 31870 -13988 -12311 21710 -13298 -22018 -20558
13282 -20558 -17132 -17801 2982 28320 43112 62684 47830 26170 58120 34970 -1214 7870
13270 7870 -18037 -53921 -70046 -50195 -28317 -39221 -49117 -36300 -26611 -45750 -5992 -25608
13258 -25608 -52675 -59380 -35010 -19024 -17287 -14078 5905 -7391 42944 51336 30624 45091
13246 45091 57382 62437 52668 50256 38458 29946 27422 39644 31902 25509 -2893 -23516 -28990
13233 -28990 9266 49512 34743 17987 -12197 -58620 -39450 24814 28444 13435 -19566 -27797
13221 -27797 -42958 -42514 -8964 2872 -34022 -21385 -23086 5794 -37182 -45021 -42239 -45521 -50838
$$ packed form
13307A4237J0298p779J09j1133J2360o358q161K6069N953j3528j808J1463K4929
13294E6651K4860j9771k6532k887J9625k0076m5858J677L4021l5008q720J460
13282b0558L426o69K0783K5338J4792J9572j4854k1660L1950k3150l6184R084
13270G870k5907l5884j6125J9851K1878j0904r896J2817R689j9139L9758j9616
13258b5608k7067o705K4370J5986J737L209J9983j3296N0335Q392k0712J4467
13246D5091J2291N055r769k412j1798q512k524J2222p742o393k8402k0623n474
13233b8990L8256M0246j4769j6756l0184m6423J9170O4264L630j5009l3001q231
13221b7797j5161M44L3550J1836l6894J2637j701K8880m2976p839K782l282n317
$$ plain form
13208 -50838 -24735 -16163 -23859 -28522 -2307 -11146 -11424 6319 -1516 -11561 -11953 -17581 -18250 1632
13194 1632 16419 22869 42884 50902 57760 37156 12572 16308 -14298 -20095 284 436 -14038
13181 -14038 -2786 -5766 11668 -29122 -23552 -32729 -18367 -43829 -69457 -39674 35084 53707
13169 53707 39811 12821 22713 34867 56708 57250 25721 -18649 -11517 -33576 -40822 -23099 -14388
13156 -14388 -25697 -26473 1139 -2505 -19774 -30312 -32287 -7119 11003 -8198 -28945 -35896 -32541
13143 -32541 -33774 -47213 -42474 -27805 -12703 -21186 -36470 -10374 4270 -16878 -5927 3227
13131 3227 -6060 3524 25033 78048 62673 47880 -8579 -17281 -5032 4283 8153 54007 27549
13118 27549 -12808 -28119 -22514 -5150 -11855 -48291 -66270 -67797 -78195 -56490 -35991 -48430
$$ packed form
13208e0838K6103Q572p696m663K6215q839k78J7743p835j0045l92n628o69J9882
13194A632J4787O450K0015Q018O858k0604k4584L736l0606n797K0379J52j4474
13181a4038J1252k980J7434m0790N570r177J4362k5462k5628K9783P4758J8623
13169E3707j3896k6990R892J2154K1841N42l1529m4370P132k2059p246J7723Q711
13156a4388j1309p76K7612l644j7269j0538j975K5168J8122j9201k0747o951L355
13143c2541j233j3439M739J4669J5102q483j5284K6096J4644k1148J0951R154
13131C227r287R584K1509N3015j5375j4793n6459q702J2249R315L870M5854k6458
13118B7549m0357j5311N605J7364o705l6436j7979j527j0398K1705K0499j2439
$$ plain form
13106 -48430 -47698 -16634 21660 13427 1616 3544 22703 39155 45128 13010 19989 43886 20629
13093 20629 -19294 -21302 -10845 -5458 -15113 18755 30063 26743 6577 -685 -22788 -47170 -46118
13080 -46118 -13890 3560 9282 -16252 -2019 13383 10379 5356 3189 22012 36673 26284
13068 26284 18959 12390 5558 -21242 -9618 17333 12277 5581 631 -19930 -68758 -88345 -22101
13055 -22101 26489 -5108 -34200 -43896 -47641 -27776 -6068 20208 8930 41383 10936 3189
13043 3189 35958 8596 1912 -1895 9627 13459 3013 -13293 6609 25492 32317 32068 44216
13030 44216 56462 40417 30222 15068 15864 9194 -10195 -9827 6982 24964 29819 11496 9637
13017 9637 29882 55466 87123 66298 9734 17616 54628 37547 24839 31875 11044 -13842
$$ packed form
13106d8430P32L1064L8294q233j1811J928J9159J6452N973l2118O979K3897k3257
13093B0629l9923k008J0457N387r655L3868J1308l320k0166p262k2103k4382J052
13080d6118L2228J7450N722k5534J4233J5402l004n023k167J8823J4661j0389
13068B6284p325o569o832k6800J1624K6951n056o696m950k0561m8828j9587O6244
13055b2101M8590l1597k9092r696l745J9865K1708K6276j1278L2453l0447p747
13043C189L2769k7362o684l807J1522L832j0446j6306J9902J8883O825k49J2148
13030D4216J2246j6045j0195j5154P96o670j9389L68J6809J7982M855j8323j859
13017I637K0245K5584L1657k0825n6564P882L7012j7081j2708P036k0831k4886
$$ plain form
13005 -13842 15570 40742 17864 -2836 6018 12012 19419 35872 41247 12555 -34912 -7249
12993 -7249 -13225 -35707 -30354 6615 1159 3860 6704 7915 -15319 -46012 -62898 -50944 -42493
12980 -42493 -16993 2675 7315 569 -2261 -33104 -44384 -22767 -13065 -40860 -67848 -46978
12968 -46978 -18380 -5416 -21880 -15232 7816 24244 61211 49451 33055 29657 16148 -2870
12956 -2870 -8309 -4203 -26373 -2640 17323 26712 32517 26755 16121 -2879 -7909 -15359 -23660
12943 -23660 -8783 6092 11644 44632 46304 29537 17492 -5895 4060 -10371 9021 56008
12931 56008 52911 27260 4049 11167 -4695 21495 17207 -15616 -24110 -12804 -5433 -36084 -32073
12918 -32073 -16096 -34657 -23916 20446 4695 -34049 -40538 -38396 -37088 -46446 -46005 -27321 -27022
$$ packed form
13005a3842K9412K5172k2878k0700Q854N994P407J6453N375k8692m7467K7663
12993g249n976k2482N353L6969n456K701K844J211k3234l0693j6886J1954Q451
12980d2493K5500J9668M640o746k830l0843j1280K1617R702k7795k6988K0870
12968d6978K8598J2964j6464O648K3048J6428L6967j1760j6396l398j3509j9018
12956b870n439M106k2170K3733J9963R389N805n762j0634j9000n030p450q301
12943b3660J4877J4875N552L2988J672j6767j2045k3387R955j4431J9392M6987
12931E6008l097k5651k3211P118j5862K6190m288l2823q494J1306P371l0651M011
12918c2073J5977j8561J0741M4362j5751l8744o489K142J308r358M41J8684K99
$$ plain form
12905 -27022 -20715 -30630 -20710 -6740 32792 60252 83153 85731 30576 -1097 -1606 -23141 1124
12892 1124 -17447 -41565 -15325 -19252 -49772 -17508 -6881 -3073 34619 23631 3117 15552
12880 15552 -20929 -41603 -34405 -39519 -33227 -34702 -34540 -30636 -50900 -57210 -18082 -11293 16152
12867 16152 62382 69535 14862 -19112 -25532 -21566 -5365 36960 7381 9355 -1031 11335
12855 11335 -11073 -1835 12164 -7105 1951 -6874 -29001 -16164 4389 -7366 -22285 -42747
12843 -42747 -29101 -27694 -4179 -1606 -5926 -10697 -6012 -3278 5909 16556 16079 32323 32768 -2062
12829 -2062 -18596 -20517 -10871 -17038 -7737 2276 8133 -27718 -56793 -46712 -12480 22660 24310
12816 24310 7967 7610 17117 -24371 -65953 -62338 -57716 -29013 -4019 -6631 -27469 -26813 9544
$$ packed form
12905b7022O307r915R920J3970L9532K7460K2901K578n5155l1673n09k1535K4265
12892A124j8571k4118K6240l927l0520L2264J0627L808L7692j0988k0514J2435
12880A5552l6481k0674P198n114O292j475J62L904k0264o310L9128O789K7445
12867A6152M6230P153n4673l3974o420L966J6201M2325k9579J974j0386J2366
12855A1335k2408R238J3999j9269R056q825k2127J2837K0553j1755j4919k0462
12843d2747J3646J407K3515K573m320m771M685K734R187J0647m77J6244M45l4830
12829b062j6534j921R646o167R301J0013N857l5851k9075J0081L4232L5140J650
12816B4310j6343l57R507m1488m1582L615M622K8703K4994k612k0838O56L6357
$$ plain form
12803 9544 -20880 -45112 -24701 16103 30380 22970 -8647 -14103 10648 8573 22101 51883
12791 51883 50175 19458 -6798 13826 31124 22818 14086 -19878 -53941 -45973 12994 38664
12779 38664 43480 69878 40285 50191 43378 -6668 -70667 -81593 -27257 15783 -16936 -39173
12767 -39173 -69138 -87630 -67770 -54399 -40652 -24312 -27732 -35381 -9492 -12283 3443 12488
12755 12488 -7426 4995 22816 40588 19497 14666 54299 52027 52801 34334 37564 49610 70037
12742 70037 60094 39182 30579 -1745 -17493 -20982 -49369 -48896 -41004 -20050 -36169 -44527 -34190
12729 -34190 -44947 -76299 -78816 -5722 35046 30017 -14492 -41908 -43523 -46609 -16269 10723
12717 10723 21810 22770 36302 35483 -1439 -20799 -26899 -15158 -8741 8663 -3402 45246 51986
$$ packed form
12803I544l0424k4232K0411M0804J4277p410l1617n456K4751k075J3528K9782
12791E1883j708l0717k6256K0624J7298q306q732l3964l4063P968N8967K5670
12779C8664M816K6398k9593R906o813n0046o3999j0926N4336M3040l2719k2237
12767c9173k9965j8492J9860J3371J3747J6340l420p649K5889k791J5726R045
12755A2488j9914J2421J7821J7772k1091m831L9633k272P74j8467L230J2046K0427
12742G0037r943k0912q603l2324j5748l489k8387M73P892K0954j6119q358J0337
12729c4190j0757l1352k517P3094M0768n029m4509k7416j615l086L0340K6992
12717A0723J1087R60J3532q19l6922j9360o100J1741O417J7404j2065M8648O740
$$ plain form
12704 51986 27137 27312 27020 10115 29668 50173 53732 22923 25992 6028 12373 40186 24624
12691 24624 -14121 -24937 -29187 -4399 25900 38341 22159 -11490 -41599 -29961 -27401 -4774
12679 -4774 -1762 -14010 1362 2712 22089 1336 -17845 -8491 13683 17861 -23398 -21245 1672
12666 1672 -33331 -57525 -20993 4123 2926 18966 39480 56432 52803 31942 27241 -5511
12654 -5511 -10326 -13504 400 -21741 -34870 -44229 -50659 -15528 -10196 -10997 17613 48031 34340
12641 34340 55334 76628 66911 56041 13947 3140 23760 11326 -7463 9791 29352 43403
12629 43403 40015 17527 -4205 17614 46022 31568 -11630 -26464 29351 49883 36347 5036
12617 5036 -40110 -74554 -67921 -42613 -9648 38465 12069 16583 59981 69718 44590 24655
$$ packed form
12704E1986k4849J75k92j6905J9553K0505L559l0809L069j9964O345K7813j5562
12691B4624l8745j0816m250K4788L0299J2441j6182l3649l0109J1638K560K2627
12679d774L012j2248J5372J350J9377k0753j9181R354K2174M178m1259K153K2917
12666A672l5003k4194L6532K5116j197J6040K0514J6952l629k0861m701l2752
12654e511m815l178J3904k2141j3129r359o430L5131N332q01K8610L0418j3691
12641C4340K0994K1294r717j0870m2094j0807K0620j2434j8789J7254J9561J4051
12629D3403l388k2488k1732K1819K8408j4454m3198j4834N5815K0532j3536l1311
12617E036m5146l4444O633K5308L2965M8113k6396M514M3398R737k5128j9935
$$ plain form
12605 24655 23668 -6974 -55437 -67433 -49041 -53459 -46924 -30420 -26026 15109 42327 63552 87607
12592 87607 78386 43025 33176 58324 32710 28020 32600 48736 50301 24698 7678 -6120 7433
12579 7433 4735 22768 42607 14091 26905 32319 27402 -3277 1898 12848 9893 11993 49079
12566 49079 90129 80175 47352 37841 43296 44678 63919 32119 37839 40285 20076 61422 75368
12553 75368 55889 30548 25641 36449 36252 17344 15404 60033 82723 65554 69095 78670 119791
12540 119791 143212 140851 108023 74869 73035 93050 115826 122031 144258 157297 153091 112522
12528 112522 162544 239813 217285 158082 109270 89590 78680 70232 83310 112724 136302 166855
12516 166855 178357 190489 196400 191056 167055 166884 223959 253429 265111 258348 255247 231592 201008
$$ packed form
12605B4655r87l0642m8463j1996J8392m418O535J6504M394M1135K7218K1225K4055
12592H7607r221l5361r849K5148k5614m690M580J6136J565k5603j7020j3798J3553
12579G433k698J8033J9839k8516J2814N414m917l0679N175J0950k955K100L7086
12566D9079M1050r954l2823r511N455J382J9241l1800N720K446k0209M1346J3946
12553G5368j9479k5341m907J0808j97j8908j940M4629K2690j7169L541R575M1121
12540A19791K3421k361l2828l3154j834K0015K2776O205K2227J3039m206m0569
12528A12522N0022P7269k2528n9203m8812j9680j0910q448J3078K9414K3578L0553
12516A66855J1502J2132N911n344k4001j71N7075K9470J1682o763l101k3655l0584
$$ plain form
12503 201008 168413 142710 109657 123158 127675 122297 117127 153178 207875 211860 218262 208685 185022
12490 185022 215344 190645 163745 205409 230975 243157 249119 276407 291751 256261 229553 211671
12478 211671 215224 219631 193431 184120 175294 155218 148286 125297 121363 112577 104740 122693 148571
12465 148571 156056 138608 131586 156459 196133 200464 197905 198309 200972 187516 161347 157244 155562
12452 155562 140210 139097 117665 121907 115804 107258 124053 82328 59081 63778 108902 110162 74594
12439 74594 66095 75333 49272 25533 39075 70521 94494 78652 68735 72301 59833 26494
12427 26494 42911 64662 80219 58380 67876 84819 93696 107899 151782 174264 186404 250829
12415 250829 233310 143499 109790 98855 102920 95893 118737 145218 156434 133864 129962 101067
$$ packed form
12503B01008l2595k5703l3053J3501M517n378n170L6051N4697L985O402r577k3663
12490A85022L0322k4699k6900M1664K5566J2182N962K7288J5344l5490k6708j7882
12478B11671L553M407k6200r311q826k0076o932k2989l934q786p837J7953K5878
12465A48571P485j7448p022K4873L9674M331k559M04K663j3456k6169m103j682
12452A55562j5352j113k1432M242o103q546J6795m1725k3247M697M5124J260l5568
12439G4594q499R238k6061k3739J3542L1446K3973j5842r917L566j2468l3339
12427B6494J6417K1751J5557k1839R496J6943Q877J4203M3883K2482J2140O4425
12415B50829j7519q9811l3709j0935M065p027K2844K6481J1216k2570l902k8895
$$ plain form
12403 101067 109001 106723 75030 45416 46005 62571 63224 84318 57698 24051 12767 21827 11156
12390 11156 24773 26715 44618 38767 58167 82976 38892 31164 9516 29258 79199 88705
12378 88705 69563 61051 62522 81396 82218 85998 97042 66928 36210 28249 59253 71146 48860
12365 48860 46247 27019 81911 118255 126839 99821 83326 39439 44031 77240 55690 39830
12353 39830 39367 24085 13686 34413 47145 54196 66426 88785 98263 52484 22353 30839 62894
12340 62894 89246 77321 67638 61175 37657 51814 69814 57366 37100 40271 58514 90485
12328 90485 119261 68273 31815 55839 78756 66371 51037 67776 78445 75930 80191 72265
12316 72265 35771 8587 6223 -25845 -12807 -16878 23044 38780 32236 23173 40018 48725 37636
$$ packed form
12403A01067P934k278l1693k9614N89J6566O53K1094k6620l3647j1284R060j0671
12390A1156J3617J942J7903n851J9400K4809m4084p728k1648J9742M9941R506
12378H8705j9142q512J471J8874Q22L780J1044l0114l0718p961L1004J1893k2286
12365D8860k613j9228N4892L6344Q584k7018j6495m3887M592L3209k1550j5860
12353C9830m63j5282j0399K0727J2732P051J2230K2359R478m5779l0131Q486L2055
12340F2894K6352j1925r683o463k3518J4157J8000j2448k0266L171J8243L1971
12328I0485K8776n0988l6458K4024K2917j2385j5334J6739J0669k515M261p926
12316G2265l6494k7184k364l2068J3038m071L9922J5736o544r063J6845Q707j1089
$$ plain form
12303 37636 5776 -27661 -31473 -35578 -43082 -42308 -51127 -38080 -16695 6228 15328 -6719 26957
12290 26957 46900 40649 37630 48142 75381 60453 32150 18932 3910 -29764 -37370 -23953
12278 -23953 -4621 16260 -11475 -1301 24593 40922 36080 24126 18344 3700 -3493 11196
12266 11196 1751 14040 47495 58467 60127 67460 51456 8066 11971 -16640 -9063 -20985 -23633
12253 -23633 -4844 -18637 -16854 2509 40031 63062 47174 38811 15297 -20966 -25367 -17204
12241 -17204 -25279 8155 2938 1969 23234 49853 48886 19166 -6675 -15336 -78 14888 38962
12228 38962 38836 -8089 -9029 31384 55718 36211 7632 13337 11100 11795 6242 21054 -15147
12215 -15147 -47503 -77689 -39863 -15278 -14396 -20984 -27090 -11575 -22015 -9515 26861 52165
$$ packed form
12303C7636l1860l3437l812m105p504P74q819J3047K1385K2923R100k2047L3676
12290B6957J9943o251l019J0512K7239j4928k8303j3218j5022l3674p606J3417
12278b3953J9332K0881k7735J0174K5894J6329m842j1954n782j4644p193J4689
12266A1196r445J2289L3455J0972J660P333j6004m3390L905k8611P577j1922k648
12253b3633J8789j3793J783J9363L7522K3031j5888q363k3514l6263m401Q163
12241a7204q075L3434n217r69K1265K6619r67k9720k5841q661J5258J4966K4074
12228C8962j26m6925r40M0413K4334j9507k8579N705k237O95n553J4812l6201
12215a5147l2356l0186L7826K4585Q82o588o106J5515j0440J2500L6376K5304
$$ plain form
12203 52165 1358 -36674 -18299 -1657 15006 17444 14583 32383 64612 46649 57928 43699
12191 43699 32907 16922 18256 16271 4393 6931 32822 37964 37726 22966 31584 13610 -20767
12178 -20767 -14460 -7439 -31233 -28797 -62520 -62771 -59074 -42091 2656 48845 45471 23868 5957
12165 5957 13956 12945 3557 11630 2347 16868 20828 11096 40696 38198 -15227 -42966 -7365
12152 -7365 32335 -5514 -26762 -12719 -12941 -24852 -27509 5921 20222 21366 410 -9322 5930
12139 5930 21524 18483 7108 15223 -7972 -17162 2505 38029 36267 11606 9541 5462 27790
12126 27790 -8128 -18931 1774 -16026 -14322 -5939 40991 38683 28227 26165 25587 57654 48050
12113 48050 16534 -5385 -17985 -4609 -2148 -8952 -56495 -45536 -23632 -11384 18585 21639
$$ packed form
12203E2165n0807l8032J8375J6642J6663K438k861J7800L2229j7963J1279j4229
12191D3699j0792j5985J334j985j1878K538K5891N142k38j4760Q618j7974l4377
12178b0767O307P021k3794K436l3723k51L697J6983M4747M6189l374k1603j7911
12165E957P999j011r388Q073r283J4521L960r732K9600k498n3425k7739L5601
12152g365L9700l7849k1248J4043k22j1911k657L3430J4301J144k0956r732J5252
12139E930J5594l041j1375Q115k3195r190J9667L5524j762k4661k065m079K2328
12126B7790l5918j0803K0705j7800J704Q383M6930k308j0456k062n78L2067r604
12113D8050l1516k1919j2600J3376K461o804m7543J0959K1904J2248K9969L054
$$ plain form
12101 21639 22332 40532 43225 51406 32094 13827 2258 8580 50268 73025 65334 43607 41679
12088 41679 38073 20557 34796 28405 2061 -9844 760 24199 15967 17302 194 -17354
12076 -17354 -57251 -72846 -58442 -43965 -31280 -25773 -23817 -42051 -39473 -57009 -29274 -1115
12064 -1115 948 17 -6955 -9699 4073 14956 4084 -31665 -20925 20003 43934 44967 33999
12051 33999 10135 -9224 -18636 15667 32889 10057 -15730 25016 60765 60654 32931 1437
12039 1437 -11725 1237 -3777 -11048 25726 9953 17356 43628 56295 10652 31053 35789 8830
12026 8830 -5261 -11645 29923 57486 34880 22009 711 8587 8693 -22756 -22011 -15835 7862
12013 7862 28514 55813 80078 76267 46198 31690 45307 58275 19551 -12849 -17934 -42742
$$ packed form
12101B1639O93J8200K693Q181j9312j8267j1569O322M1688K2757p691k1727j928
12088D1679l606j7516J4239o391k6344j1905J0604K3439q232J335j7108j7548
12076a7354l9897j5595J4404J4477J2685N507J956j8234K578j7536K7735K8159
12064a115K063r31o972k744J3772J0883j0872l5749J0740M0928K3931J033j0968
12051C3999k3864j9359r412L4303J7222k2832k5787M0746L5749j11k7723l1494
12039A437j3162J2962n014p271L6774j5773P403K6272J2667m5643K0401M736k6959
12026H830j4091o384M1568K7563k2606j2871k1298P876J06l1449P45O176K3697
12013G862K0652K7299K4265l811l0069j4508J3617J2968l8724l2400n085k4808
$$ plain form
12001 -42742 -41358 -28955 -25865 -5580 2826 5391 13816 5668 4689 1780 20441 25499 43722 58130
11987 58130 80080 97817 30008 18702 4457 12745 18784 5781 10781 5501 15022 35987 53222
11974 53222 58821 70509 37608 13125 27357 43856 24239 -10376 -21124 -24823 -6335 -655
11962 -655 41844 39007 7679 11712 22633 7236 2611 35890 40119 25701 17051 20140 37713
11949 37713 29867 33862 43033 36479 37741 11133 -2685 -19778 -3213 -3762 23579 -416 -40916
11936 -40916 -37031 -30248 -22938 -22569 25122 53940 23064 -19809 -18518 -26397 -21446 135 56998
11923 56998 73365 68535 55138 47720 27801 8183 36001 11564 -774 14190 33897 52325
11911 52325 16064 4456 -1077 181 -1329 -3439 -4336 -16341 14390 21513 34646 5998 -6060
$$ packed form
12001d2742J384J2403L090K0285Q406K565Q425q148r79k909J8661N058J8223J4408
11987E8130K1950J7737o7809j1306j4245Q288O039j3003N000n280R521K0965J7235
11974E3222N599J1688l2901k4483J4232J6499j9617l4615j0748l699J8488N680
11962f55M2499k837l1328M033J0921j5397m625L3279M229j4418q650L089J7573
11949C7713p846L995R171o554J262k6608j3818j7093J6565n49K7341k3995m0500
11936d0916L885O783P310L69M7691K8818l0876m2873J291p879M951K1581N6863
11923E6998J6367m830j3397p418j9919j9618K7818k4437j2338J4964J9707J8428
11911E2325l6261j1608n533J258j510k110q97j2005L0731P123J3133k8648j2058
$$ plain form
11898 -6060 1705 4374 2939 -8571 -7602 8853 22884 23709 17962 -12457 -16526 -9755 29780 21593
11884 21593 46914 25220 -3096 225 15479 58112 63431 35753 5903 842 11650 -7465
11872 -7465 -47425 -37936 11666 21191 -17438 -2216 7670 -31446 -41877 -21618 -8391 -38397
11860 -38397 -31326 -10517 -29438 -28333 -11190 -35014 -20880 12774 -1149 -7442 -7037 -21700 37072
11847 37072 38120 14005 -4771 -17982 -16628 -35163 -21008 -4822 33125 72735 91014 62383
11835 62383 22736 -5801 31143 36658 49752 37678 18406 -22350 -56442 -59684 -20708 -15456
11823 -15456 -23886 -45545 -29998 -13490 -1506 -5117 26696 71688 61291 58656 62150 80858
11811 80858 93471 68749 66599 52609 52362 72371 98192 52514 13465 -270 7646 -5113
$$ packed form
11898f060P765K669j435j1510R69J6455J4031Q25n747l0419m069O771L9535q187
11884B1593K5321k1694k8316L321J5254M2633N319k7678k9850n061J0808j9115
11872g465l9960R489M9602R525l8629J5222R886l9116j0431K0259J3227l0006
11860c8397P071K0809j8921J105J7143k3824J4134L3654j3923o293M05j4663N8772
11847C7072J048k4115j8776j3211J354j8535J4155J6186L7947L9610J8279k8631
11835F2383l9647k8537L6944N515J3094j2074j9272m0756l4092l242L8976N252
11823a5456q430k1659J5547J6508J1984l611L1813M4992j0397k635L494J8708
11811H0858J2613k4722k150j3990k47K0009K5821m5678l9049j3735P916j2759
$$ plain form
11799 -5113 22260 45253 19815 13656 -17519 -46017 -35789 -53089 -41087 6321 21668 3914
11787 3914 3568 3405 -9342 8134 9643 52230 34558 26687 72715 63355 72438 90019 59022
11774 59022 31121 3901 -979 -5543 -7260 14438 5590 -10835 -30174 -18455 22525 41006
11762 41006 65218 49939 26146 770 -13461 -28139 -8596 32153 12687 -12554 -10384 2775
11750 2775 -11611 -68301 -84779 -41859 11605 27632 28729 50205 30258 21482 -1643 15297
11738 15297 37053 29041 25491 52256 70215 84268 62228 57453 49031 37107 18713 37269
11726 37269 23974 27286 10583 11996 12022 7641 4490 22021 1674 -6939 21424 23708 39976
11713 39976 16422 6968 -16255 -46811 -69140 -48589 -30338 -22649 -41155 -41835 -46046 -50409 -43555
$$ packed form
11799e113K7373K2993k5438o159l1175k8498J0228j7300J2002M7408J5347j7754
11787C914l46j63j2747J7476J509M2587j7672p871M6028r360R083J7581l0997
11774E9022k7901k7220m880m564j717K1698q848j6425j9339J1719M0980J8481
11762D1006K4212j5279k3793k5376j4231j4678J9543M0749j9466k5241K170J3159
11750B775j4386n6690j6478M2920N3464J6027J097K1476j9947q776k3125J6940
11738A5297K1756q012l550K6765J7959J4053k2040m775q422j1924j8394J8556
11726C7269j3295L312j6703J413K6m381l151J7531k0347q613K8363K284J6268
11713C9976k3554r454k3223l0556k2329K0551J8251P689j8506o80m211m363O854
$$ plain form
11700 -43555 -44986 -19288 -16860 -42303 -13724 19352 -9914 -8833 28520 69350 35555 12900
11688 12900 -3472 -9411 -28807 -28112 -9859 5594 -2305 29312 29165 20923 48919 75826 104370
11675 104370 112146 68208 52414 57760 33867 15665 34889 42554 27128 47636 81492 46348
11663 46348 34171 10538 10452 -38952 -38742 10913 66739 45822 46831 64350 45311 -1325 -31331
11650 -31331 -36756 -22744 22226 32396 31113 31496 30813 26659 18230 6386 32092 51174 26019
11637 26019 25060 15762 20444 14240 8338 17493 4025 15280 51800 54232 40408 37539 46907 58049
11623 58049 69844 99962 89554 76367 37265 11851 5561 20280 14283 -24816 -72907 -47219
11611 -47219 19782 21616 -5920 -18662 -18323 17072 -9803 -27426 593 42944 40386 42431 11099
$$ packed form
11700d3555j431K5698K428k5443K8579L3076k9266J081L7353M0830l3795k2655
11688A2900j6372n939j9396O95J8253J5453p899L1617j47q242K7996K6907K8544
11675A04370P776m3938j5794N346k3893j8202J9224P665j5426K0508L3856l5144
11663D6348j2177k3633q6m9404K10M9655N5826k0917J009J7519j9039m6636l0006
11650c1331n425J4012M4970J0170j283L83o83m154q429j1844K5706J9082k5155
11637B6019r59r298M682o204n902R155j3468J1255L6520K432j3824k869R368J1142
11623E8049J1795L0118j0408j3187l9102k5414o290J4719n997l9099m8091K5688
11611d7219O7001J834k7536j2742L39L5395k6875j7623K8019M2351k558K045l1332
$$ plain form
11598 11099 26901 30488 49399 41884 44036 22815 28298 4215 647 9481 2864 -1075 20385
11585 20385 44164 30335 3782 -11179 -32056 -11799 -3003 18661 17590 21337 25893 9953
11573 9953 -1301 10067 30914 21980 9730 -3595 20071 19810 -21493 -30827 35402 61030 48422
11560 48422 44833 36777 19664 1840 28185 35776 35742 9026 15091 19907 39813 43107 19166
11547 19166 1813 -2979 -10776 -19747 -27375 -20298 6310 13654 13785 -35506 -63285 -26965 27334
11534 27334 42685 23704 13985 -5946 8000 14768 13066 21840 43000 44948 35736 18113 4917
11521 4917 -15820 -23554 -28927 677 39705 46967 54944 73292 66400 61829 40124 40757 32771 36356
11507 36356 52236 66583 43656 41314 82365 81034 23934 12079 63939 80205 78602 68463
$$ packed form
11598A1099J5802L587J8911p515K152k1221N483k4083l568Q834o617l939K1460
11585B0385K3779j3829k6553j4961k0877K0257Q796K1664j071L747M556j5940
11573I953j1254J1368K0847q934j2250j3325K3666k61m1303r334O6229K5628j2608
11560D8422l589q056j7113j7824K6345P591l4k6716O065M816J9906L294k3941
11547A9166j7353m792p797q971p628P077K6608P344J31m9291k7779L6320N4299
11534B7334J5351j8981r719j9931J3946O768j702Q774K1160J948r212j7623j3196
11521D917k0737p734n373K9604L9028P262P977J8348o892m571k1705O33p986L585
11507C6356J5880J4347k2927k342M1051j331n7100j1855N1860J6266j603j0139
$$ plain form
11495 68463 65525 79191 81712 70522 54215 45147 63712 68304 69059 125714 118661 82754 72305
11482 72305 92435 103501 136095 179783 232555 244031 317702 365116 407008 510874 691146
11471 691146 979327 1485046 2209436 2911395 3104331 2701043 2009551 1383635 964602 728400
11461 728400 573909 443794 370417 321238 300548 300821 278397 208810 171037 169200 159177 115641
11449 115641 65859 62001 39059 61064 73566 47509 62413 52795 37180 49256 48079 56910
11437 56910 70286 79661 74306 91605 97497 105765 91504 100102 117526 124297 109695 81839 62226
11424 62226 42242 30678 31672 46512 77388 86919 84570 53647 21979 24676 7398 -2494 -25009
11411 -25009 -11670 2223 32171 61299 54417 30011 45050 47550 22492 31264 60119 27386
$$ packed form
11495F8463k938J3666K521j1190j6307r068J8565M592P55N6655p053l5907j0449
11482G2305K0130J1066L2594M3688N2772J1476P3671M7414M1892J03866J80272
11471F91146K88181N05719P24390P01959J92936m03288o91492o25916m19033k36202
11461G28400j54491j30115p3377m9179k0690K73k2424o9587l7773j837j0023m3536
11449A15641m9782l858k2942K2005J2502k6057J4904r618j5615J2076j177Q831
11437E6910J3376R375n355J7299N892Q268j4261Q598J7424O771j4602k7856j9613
11424F2226j9984j1564R94J4840L0876R531k349l0923l1668K697j7278r892k2515
11411b5009J3339J3893K9948K9128o882k4406J5039K500k5058Q772K8855l2733
$$ plain form
11399 27386 39014 68646 69779 38926 -9571 -4261 -3726 -14015 42787 71987 36756 4164
11387 4164 -9897 6568 40575 62929 102518 118891 118974 67617 68566 67542 73837 38696 39053 39191
11373 39191 45918 37225 16907 12277 39183 63874 76229 62169 87571 123868 172800 163123
11361 163123 136326 112895 116034 91550 49683 58519 52014 18048 5292 31097 39939 65956
11349 65956 136430 162417 117691 102233 116912 100468 106100 120421 123665 108543 103268 110550
11337 110550 100112 94108 105304 83025 89074 105893 89422 58680 36162 35074 42032 26544
11325 26544 21365 45145 31252 34488 55693 99648 111466 158986 193978 283319 388340 431834
11313 431834 395415 342922 240577 185132 147066 107528 129174 135007 143003 138295 102005 124116
$$ packed form
11399B7386J1628K9632J133l0853m8497N310N35j0289N6802K9200l5231l2592
11387D164j4061J6465L4007K2354L9589J6373Q3n1357R49j024O295l5141L57J38
11373C9191O727q693k0318m630K6906K4691J2355j4060K5402L6297M8932r677
11361A63123k6797k3431L139k4484m1867Q836o505l3966j2756K5805Q842K6017
11349F5956P0474K5987m4726j5458J4679j6444N632J4321L244j5122n275P282
11337A10550j0438o004J1196k2279O049J6819j6471l0742k2518j088O958j5488
11325B6544n179K3780j3893L236K1205M3955J1818M7520L4992Q9341J05021M3494
11313D31834l6419n2493j02345n5445l8066l9538K1646N833P996m708l6290K2111
$$ plain form
11301 124116 81408 29101 37355 54126 34967 21996 69700 80705 64862 66447 78237 95272
11289 95272 61093 29873 68181 69285 97360 117659 135539 133845 130896 104558 88871 61671
11277 61671 31448 54250 51344 51697 67264 105686 147536 141990 134182 135111 146791 134646 127756
11264 127756 125667 118747 106794 110828 97222 75600 78651 98419 131921 138200 131245 133340 155498
11251 155498 166548 192017 177336 170773 174339 156947 148291 163240 154591 192996 181212 165163
11239 165163 136125 83322 37302 4658 5335 -1898 35185 55306 40669 52400 93352 103769
11227 103769 107159 105891 82173 68242 32446 21619 7807 32998 35149 53960 38442 4371
11215 4371 -56875 -119163 -136103 -71193 -9407 50247 64412 92919 139006 155786 182836 163359
$$ packed form
11301A24116m2708n2307Q254J6771j9159j2971M7704J1005j5843J585J1790J7035
11289I5272l4179l1220L8308J104K8075K0299J7880j694k949k6338j5687k7200
11277F1671l0223K2802k906L53J5567L8422M1850n546p808R29J1680j2145o890
11264A27756k089o920j1953M034j3606k1622L051J9768L3502O279o955K095K2158
11251A55498J1050K5469j4681o563L566j7392q656J4949q649L8405j1784j6049
11239A65163k9038n2803m6020l2644O77p233L7083K0121j4637J1731M0952J0417
11227A03769L390j268k3718j3931l5796j0827j3812K5191K151J8811j5518l4071
11215D371o1246o2288j6940O4910O1786N9654J4165K8507M6087J6780K7050j9477
$$ plain form
11203 163359 137552 139970 110178 137987 153759 170796 150765 103703 143292 200204 223447 252780
11191 252780 316628 438183 559240 662353 703218 714291 638148 577332 521949 499781 513288
11180 513288 494922 440004 435983 427020 386920 345019 347067 369808 362024 357843 386614 388682 393903
11167 393903 389611 395694 448421 482958 478643 442063 427667 407700 407065 395197 413687 432161
11155 432161 466975 459600 456365 444991 441240 423268 411693 460740 472381 466461 429368 416791
11143 416791 437976 425276 426487 458885 506429 547762 593750 619876 646061 642590 672245 693385
11131 693385 705832 750704 800335 857332 888593 895702 931472 939954 988651 1051254 1120735 1118768
11119 1118768 1077786 1037605 992796 986139 1032923 1082915 1118013 1160097 1206931 1289539 1334025
$$ packed form
11203A63359k5807K418k9792K7809J5772J7037k0031m7062L9589N6912K3243K9333
11191B52780O3848J21555J21057J03113M0865J1073p6143o0816n5383k2168J3507
11180E13288j8366n4918m021q963m0100m1901K048K2741p784m181K8771K068N221
11167C93903m292O083N2727L4537m315l6580j4396j9967o35j1868J8490J8474
11155D32161L4814p375l235j1374l751j7972j1575M9047J1641n920l7093j2577
11143D16791K1185j2700J211L2398M7544M1333M5988K6126K6185l471K9655K1140
11131F93385J2447M4872M9631N6997L1261P109L5770Q482M8697O2603O9481j967
11119A118768m0982m0181m4809o657M6784M9992L5098M2084M6834Q2608M4486
$$ plain form
11108 1334025 1353403 1350131 1367611 1396657 1478142 1625560 1731095 1836168 1944178 2040215 2194291
11097 2194291 2394127 2541780 2713929 2897914 3128333 3404694 3737757 4063355 4343366
11088 4343366 4665975 5051495 5589048 6286209 7220182 8381721 9474430 10091648 10238944
11079 10238944 10420802 10992566 11961110 13283842 15126151 17703059 21177069 25467855
11071 25467855 30327292 35870749 43072397 53736222 70706696 98653516 146054762
11064 146054762 226951021 354025483 504204551 591231294 551464122 419818003 285737433
11057 285737433 192181470 134919512 100297486 78906665 65807180 58620482 55564679
11050 55564679 53746717 49459441 41787245 33188029 26147694 21182773 17837726 15700443
$$ packed form
11108A334025J9378l272J7480K9046Q1485J47418J05535J05073J08010R6037J54076
11097B194291J99836J47653J72149J83985K30419K76361L33063L25598K80011
11088D343366L22609L85520N37553O97161R33973J161539J092709O17218J47296
11079A0238944J81858N71764R68544J322732J842309K576908L474010M290786
11071B5467855M859437N543457P201648J0663825J6970474K7946820M7401246
11064A46054762Q0896259J27074462J50179068Q7026743l9767172j31646119j34080570
11057B85737433r3555963n7261958l4622026k1390821j3099485p186698l055803
11050E5564679j817962m287276p672196q599216p040335m964921l345047k137283
$$ plain form
11042 15700443 14316594 13432103 12923527 12259745 11106354 9585156 8226478 7094488
11034 7094488 6201111 5513783 4915707 4458004 4150760 3967636 3849324 3673403 3470267
11025 3470267 3297848 3119229 2948960 2759406 2544805 2434027 2367284 2286157 2239380 2151294
11015 2151294 2050159 1938043 1858335 1747133 1668906 1627284 1627586 1630446 1629038 1632540 1649464 1689369
11003 1689369 1750828 1758092 1642478 1448342 1274324 1167910 1069171 982415 929574 857135 820078
10992 820078 791188 737772 673163 644793 624455 583048 592008 632509 682076 702506 704962 680114
10980 680114 662454 606033 557986 512068 478911 455864 466613 475100 468876 488946 451039 403378
10968 403378 392559 385169 385883 355450 336657 335829 318192 313656 300836 302537 315354 295527 246307
$$ packed form
11042A5700443j383849q84491n08576o63782j153391j521198j358678j131990
11034G094488q93377o87328n98076m57703l07244j83124j18312j75921k03136
11025C470267j72419j78619j70269j89554k14601j10778o6743q1127m6777q8086
11015B151294j01135j12116p9708j11202p8227m1622L02K860j408L502J6924L9905
11003A689369O1459P264j15614j94136j74018j06414r8739q6756n2841p2439l7057
10992H20078k8890n3416o4609k8370k0338m1407Q960M0501M9567K0430K456k4848
10980F80114j7660n6421m8047m5918l3157k3047J0749Q487o224K0070l7907m7661
10968D03378j0819p390P14l0433j8793q28j7637m536j2820J701J2817j9827m9220
$$ plain form
10955 246307 231647 246315 246358 253911 272872 266323 253715 237952 218689 197917 173556 162493
10943 162493 132622 109121 104053 127876 149110 189798 220812 234945 183612 134432 190583 283253
10931 283253 345349 334927 329399 325866 285931 277113 287918 262537 222842 182013 199906 213034
10919 213034 205987 165470 166710 187219 194726 165280 149646 181008 262232 319398 388299 421560
10907 421560 381723 321666 252058 204986 190802 228188 264397 255901 238167 211105 173288 162122
10895 162122 157596 178603 197372 217965 196753 219363 227918 221819 201020 203379 213755 201469
10883 201469 164762 167728 127015 99470 115185 161954 202786 284862 333395 326022 256815 211292
10871 211292 177618 129543 80292 64320 104823 106066 91058 112268 145033 160713 150843 98151
$$ packed form
10955B46307j4660J4668M3P553J8961o549j2608j5763j9263k0772k4361j1063
10943A62493k9871k3501n068K3823K1234M0688L1014J4133n1333m9180N6151R2670
10931B83253O2096j0422n528l533l9935q818J0805k5381l9695m0829J7893J3128
10919B13034p047m0517J240K0509P507k9446j5634L1362Q1224N7166O8901L3261
10907D21560l9837o0057o9608m7072j4184L7386L6209q496j7734k7062l7817j1166
10895A62122m526K1007J8769K0593k1212K2610Q555o099k0799K359J0376j2286
10883B01469l6707K966m0713k7545J5715M6769M0832Q2076M8533p373o9207m5523
10871B11292l3674m8075m9251j5972M0503J243j5008K1210L2765J5680r870n2692
$$ plain form
10859 98151 61888 75237 87139 59774 41929 42812 54055 77522 65083 64944 53754 45969 40085
10846 40085 40162 55603 69379 106087 105355 76279 39078 -1438 -4258 -8670 -21899 -11893 20931
10833 20931 23651 17801 14138 66287 72009 62584 103803 131129 106658 86084 64381 65899 103290
10820 103290 105941 80162 65475 97764 97412 81083 78304 87927 92723 103333 93153 105604 126954
10807 126954 118086 138090 162540 165653 145035 109733 88969 68551 76314 76806 64192 61190 49950
10794 49950 63802 93238 128610 153115 170388 257577 301124 289238 223064 156360 96970 65500
10782 65500 63373 76111 75750 52602 69691 63842 54591 56645 30851 -6182 -28097 -19882 -177
10769 -177 13617 36667 28016 19802 50433 31015 8266 -8290 -689 -1888 -8569 17342 50558
$$ packed form
10859I8151l6263J3349J1902k7365j7845Q83J1243K3467j2439j39j1190p785n884
10846D0085P7J5441J3776L6708p32k9076l7201m0516k820m412j3229J0006L2824
10833B0931K720n850l663N2149N722r425M1219K7326k4471k0574k1703J518L7391
10820A03290K651k5779j4687L2289l52j6329k779R623M796J0610j0180J2451K1350
10807A26954q868K0004K4450L113k0618l5302k0764k0418P763M92j2614l002j1240
10794D9950J3852K9436L5372K4505J7273Q7189M3547j1886o6174o6704n9390l1470
10782F5500k127J2738l61k3148J7089n849r251K054k5794l7033k1915Q215J9705
10769a77J3794K3050q651q214L0631j9418k2749j6556P601j199o681K5911L3216
$$ plain form
10756 50558 75967 84135 88755 72631 62045 66786 60943 58981 54256 68987 57346 56562 40896
10743 40896 17498 16613 36750 59702 60854 76999 97924 118709 107516 93246 126922 117377
10731 117377 64106 55394 54460 68230 58629 24988 47624 73825 84796 99593 89777 50055
10719 50055 65031 66386 41017 8900 44976 73993 69123 76206 73646 61887 22945 -33542
10707 -33542 -37154 -22335 -39749 -15541 -7082 1051 11265 -196 36721 43466 25672 11560
10695 11560 -1698 -13220 -11355 -25133 -23429 11132 19635 35082 26728 31452 5652 -15294 2780
10682 2780 7659 585 16818 55205 84656 106266 107663 97222 77507 65521 79854 98452
10670 98452 95896 104977 128745 166237 173380 182631 182134 167824 154767 182618 217575 202546 212010
$$ packed form
10756E0558K5409Q168M620j6124j0586M741n843j962m725J4731j1641p84j5666
10743D0896k3398q85K0137K2952J152J6145K0925K0785j1193j4270L3676r545
10731A17377n3271q712r34J3770r601l3641K2636K6201J0971J4797r816l9722
10719E0055J4976J355k5369l2117L6076K9017m870P083k560j1759l8942n6487
10707c3542l612J4819j7414K4208Q459Q133J0214j1461L6917O745j7794j4112
10695A1560j3258j1522J865j3778J704L4561Q503J5447q354M724k5800k0946J8074
10682B780M879p074J6233L8387K9451K1610J397j0441j9715j1986J4333J8598
10670I8452k556R081K3768L7492P143R251m97j4310j3057K7851L4957j5029R464
$$ plain form
10657 212010 271604 362738 484884 652526 889127 1348412 2021359 2757129 3156096 2876130
10647 2876130 2160311 1474398 1024227 737994 562745 474656 408923 374914 337170 311577
10637 311577 273057 223518 178540 147678 129868 122935 132448 126531 108133 74896 40071 46177
10625 46177 72596 76682 57279 75230 113279 131405 87873 86713 108011 142893 232533 239574
10613 239574 216358 215923 205737 189562 226573 261521 257088 210294 176497 166275 135482 100216
10601 100216 148791 157776 124134 48697 30325 44176 73467 120360 126854 115384 80366 53554
10589 53554 95521 155991 143175 120577 86773 75658 66744 92473 90870 80459 73252 105116
10577 105116 110030 95179 114910 140903 124795 110176 105993 120232 176195 234653 244269 240194
$$ packed form
10657B12010N9594R1134J22146J67642K36601M59285O72947P35770L98967k79966
10647B876130p15819o85913m50171k86233j75249q8089o5733l4009l7744k5593
10637C11577l8520m9539m4978l0862j7810o933R513n917j8398l3237l4825O106
10625D6177K6419M086j9403J7951L8049J8126m3532j160K1298L4882Q9640P041
10613B39574k3216m35j0186j6175L7011L4948m433m6794l3797j0222l0793l5266
10601A00216M8575Q985l3642p5437j8372J3851K9291M6893O494j1470l5018k6812
10589E3554M1967O0470j2816k2598l3804j1115q914K5729j603j0411p207L1864
10577A05116M914j4851J9731K5993j6108j4619m183J4239N5963N8458R616m075
$$ plain form
10565 240194 247990 247921 238894 228286 196602 209725 256978 263825 197709 183664 174486 178510 196539
10552 196539 201162 212064 159782 128551 125570 137239 160214 153772 137238 127840 110898 139190
10540 139190 142279 123451 101918 92124 106534 148493 149405 152616 202845 249239 254407 247058 210852
10527 210852 165637 165351 145188 121548 77649 71184 81322 82133 69137 85015 82676 72547 100180
10514 100180 122993 106681 75855 52855 27146 -24194 -5317 54389 56777 64369 81101 78845
10502 78845 70084 43272 23811 -2557 8189 33543 15462 -6075 399 47852 91244 101222
10490 101222 91512 83705 100895 97310 84254 82909 72123 78538 81401 91742 82886 100373 81064
10477 81064 51016 71724 113057 90881 62782 68738 48232 6646 9658 -6243 24271 45875
$$ packed form
10565B40194P796o9r027j0608l1684J3123M7253O847o6116j4045r178M024J8029
10552A96539M623J0902n2282l1231k981J1669K2975o442j6534r398j6942K8292
10540A39190L089j8828k1533r794J4410M1959R12L211N0229M6394N168p349l6206
10527B10852m5215k86k0163k3640m3899o465J0138Q11j2996J5878k339j0129K7633
10514A00180K2813j6312l0826k3000k5709n1340J8877N9706K388P592J6732k256
10502G8845q761k6812j9461k6368J0746K5354j8081k1537O474M7453M3392R978
10490A01222r710p807J7190l585j3056j345j0786O415K863J0341q856J7487j9309
10477H1064l0048K0708M1333k2176k8099N956k0506m1586L012j5901L0514K1604
$$ plain form
10465 45875 72731 47761 41841 46372 49837 68692 47452 33849 6825 -3126 2374 21988 38098
10452 38098 47886 34569 21261 41140 40991 38459 72909 95502 95297 106327 150727 166386 176909
10439 176909 186630 197330 195477 256887 327736 359555 353709 351712 388997 441513 471627 480663
10427 480663 475204 408833 348246 339023 291771 265702 231644 161515 98884 82079 118567 108841
10415 108841 140621 131208 117630 128671 164869 195711 164198 126596 117309 107277 108834 131830
10403 131830 117998 112220 118365 113194 96506 107725 118393 98409 83347 107002 133245 160455
10391 160455 214621 262976 343926 415566 475945 585948 729780 834215 865760 878082 884569
10380 884569 852755 785156 704730 625615 558483 460246 366847 273256 190922 148887 157348 148411
$$ packed form
10465D5875K6856k4970n920M531L465J8855k1240j3603k7024r951N500J9614J6110
10452C8098R788j3317j3308J9879j49k532L4450K2593k05J1030M4400J5659J0523
10439A76909R721J0700j853O1410P0849L1819n846j997L7285N2516L0114R036
10427D80663n459o6371o0587r223m7252k6069l4058p0129o2631j6805L6488r726
10415A08841L1780r413j3578J1041L6198L0842l1513l7602r287j0032J557K2996
10403A31830j3832n778O145n171j6688J1219J0668j9984j5062K3655K6243K7210
10391A60455N4166M8355Q0950P1640O0379J10003J43832J04435L1545J2322O487
10380H84569l1814o7599q0426p9115o7132r8237r3399r3591q2334m2035Q461q937
$$ plain form
10368 148411 119010 100566 101825 104787 105017 132143 124619 87094 75885 69766 71632 58553 39531
10355 39531 5749 -783 33807 65987 51223 36721 25448 13549 42392 38925 32940 34928
10343 34928 21646 8459 11419 14873 -10895 -26832 -29946 -27516 -17761 -24249 -27688 13303 20511
10330 20511 28645 39311 37419 30800 -8407 -46331 -18644 -16708 -22268 -50107 -57926 -40493 -6996
10317 -6996 -27857 -50804 -58298 -13094 10674 -11840 -17886 -12548 5735 11033 11722 26820 50491
10304 50491 57133 45568 18077 15488 17504 19867 29140 16599 -6698 -7875 -5066 8556 14329
10291 14329 22893 26921 14473 24615 2313 -19989 -7204 19631 26865 -889 44178 49509
10279 49509 59249 80903 35951 11716 48664 66255 41176 59813 56106 49532 34885 23868
$$ packed form
10368A48411k9401j8444J259K962K30K7126p524l7525j1209o119J866j3079j9022
10355C9531l3782o532L4590L2180j4764j4502j1273j1899K8843l467n985J988
10343C4928j3282j3187K960L454k5768j5937l114K430R755o488l439M0991P208
10330B0511Q134J0666j892o619l9207l7924K7687J936n560k7839p819J7433L3497
10317f996k0861k2947p494M5204K3768k2514o046N338J8283N298O89J5098K3671
10304E0491O642j1565k7491k589K016K363R273j2541k3297j177K809J3622N773
10291A4329Q564M028j2448J0142k2302k2302J2785K6835P234k7754M5067N331
10279D9509R740K1654m4952k4235L6948J7591k5079J8637l707o574j4647j1017
$$ plain form
10267 23868 -10670 -6764 22261 26993 -1640 1018 22482 46420 19520 -10537 14122 42863
10255 42863 43453 24346 20424 21738 53007 60465 60294 59333 30986 11614 -4257 -9893 11183 43529
10241 43529 67056 108799 98311 80104 49542 47440 66940 40693 18264 39696 79102 63627
10229 63627 49104 66200 56178 48157 32825 44704 44945 64702 42119 -10507 -27322 -35072
10217 -35072 2356 -105 -3852 7572 28293 2199 -33172 -16996 23574 102326 113594 124138
10205 124138 140554 142578 123687 115028 134286 151228 161748 163037 122778 133908 140740 139463
10193 139463 113328 97982 82369 26688 6369 45967 64668 40280 27122 26659 65642 89240
10181 89240 80999 33411 14625 13588 66351 33046 36692 83090 90165 88513 67090 12824 5740
$$ packed form
10267B3868l4538L906K9025M732k8633K658K1464K3938k6900l0057K4659K8741
10255D2863N90j9107l922J314L1269P458j71r61k8347j9372j5871n636K1076L2346
10241D3529K3527M1743j0488j8207l0562k102J9500k6247k2429K1432L9406j5475
10229F3627j4523J7096j0022q021j5332J1879K41J9757k2583n2626j6815p750
10217c5072L7428k461l747J1424K0721k6094l5371J6176M0570P8752J1268J0544
10205A24138J6416K024j8891q659J9258J6942J0520J289m0259J1130O832j277
10193A39463k6135j5346j5613n5681k0319L9598J8701k4388j3158m63L8983K3598
10181H9240q241m7588j8786j037N2763l3305L646M6398P075j652k1423n4266p084
$$ plain form
10168 5740 32839 26862 -2678 -17531 -8659 -18865 20383 5536 19677 44678 59179 57246
10156 57246 42402 45823 36297 42355 67541 89542 54732 23325 24473 44994 54191 42220 38403
10143 38403 53761 26903 16878 15401 257 -12015 -15064 -4653 12949 37285 31507 11841
10131 11841 35429 49057 49836 67410 72092 41350 44313 56370 26416 -17817 -20875 -7084 -19730
10118 -19730 -6461 -24518 -83459 -95956 -84739 -43851 -24024 -29679 -22704 14691 41614 22459
10106 22459 33597 35268 28257 -5278 -18651 -16801 -4400 -7669 17527 38864 -15808 -33196
10094 -33196 -25742 21278 41414 8845 1231 3496 25292 19767 11599 9736 -13489 -3613 -12162
10081 -12162 -38979 -42560 -41543 -48755 -58415 -55191 -31821 -27522 -6310 21188 -17648 -17964 -16361
$$ packed form
10168E740K7099n977k9540j4853Q872j0206L9248j4847J4141K5001J4501j933
10156E7246j4844L421r526O058K5186K2001l4810l1407J148K0521R197j1971l817
10143C8403J5358k6858j0025j477j5144j2272l049J0411J7602K4336n778j9666
10131A1841K3588J3628P79J7574M682l0742K963J2057k9954m4233l058J3791j2646
10118a9730J3269j8057n8941j2497J1217M0888J9827n655O975L7395K6923j9155
10106B2459J1138J671p011l3535j3373J850J2401l269K5196K1337n4672j7388
10094c3196P454M7020K0136l2569p614K265K1796n525q168j863k3225R876q549
10081a2162k6817l581J017p212r660L224K3370M299K1212K7498l8836l16J603
$$ plain form
10068 -16361 -46774 -62348 -43052 -52024 -79403 -69834 -26143 26075 7057 34099 36305 10790
10056 10790 -11684 -4402 6384 11456 30732 39738 -1739 -18298 22263 10538 -441 -19920
10044 -19920 -35476 -65010 -70572 -42937 -42236 -21195 -6330 -27867 -12074 -10019 29463 26766 1613
10031 1613 -18638 -23440 -30768 -23475 -18173 -45125 -46645 -49129 -23393 -9908 -8728 -5156 -13212 -17911
10017 -17911 -52239 -51842 -46187 -30321 -7937 29805 2963 -17994 -4928 -6515 7529 23523
10005 23523 11357 -29767 -34814 -14381 -1718 16272 28890 -3917 -24125 -9610 25603 15831
9993 15831 30260 29617 24086 25130 11457 10584 -3603 -9355 -1386 15306 29201 3317 -560 12139
9979 12139 11595 7848 13341 38031 37153 11993 17178 22808 18032 18405 22069 10841 -14151 -38793
$$ packed form
10068a6361l0413j5574J9296q972k7379R569M3691N2218j9018K7042K206k5515
10056A0790k2474P282J0786N072J9276R006m1477j6559M0561j1725j0979j9479
10044a9920j5556k9534n562K7635P01K1041J4865k1537J5793K055L9482k697k5153
10031A613k0251m802p328P293N302k6952j520k484K5736J3485J180L572q056m699
10017a7911l4328L97N655J5866K2384L7742k6842k0957J3066j587J4044J5994
10005B3523j2166m1124n047K0433J2663J7990J2618l2807k0208J4515L5213r772
9993A5831J4429o43n531J044j3673q73j4187n752P969J6692J3895k5884l877J2699
9979A2139n44l747N493K4690q78k5160N185N630m776L73L664j1228k4992k4642
$$ plain form
9965 -38793 -23046 -10515 -12605 16995 33613 25508 21245 -21349 -29124 -17640 3535 -15606 -17083
9952 -17083 9509 -11644 -10170 -7402 -22674 -15594 7866 -5892 11336 5324 4778 -36321 -56347
9939 -56347 -40004 -39195 -17711 5671 4025 -25150 -8819 -25295 -35856 -35766 -44982 -62344 -43257
9926 -43257 -24788 -4457 -3190 -3119 -13087 -32716 -12037 1818 13045 -17449 -36323 -29414 -33012
9913 -33012 -24088 -26870 -23411 18762 933 -10306 -5266 -19984 -4117 26576 22500 20720 34712
9900 34712 18685 -33007 -48863 -64918 -67140 -53184 -31050 -16170 1981 22165 21911 10892
9888 10892 30497 40600 33812 10536 -12525 -7643 -10445 -720 -16845 -5097 9503 10334 6055
9875 6055 -2062 5126 22443 30362 11108 -1749 4870 -14178 -30038 -18171 458 9747 14989
$$ packed form
9965c8793J5747J2531k090K9600J6618q105m263m2594p775J1484K1175j9141j477
9952a7083K6592k1153J474K768j5272P080K3460j3758J7228o012n46m1099k0026
9939e6347J6343Q09K1484K3382j646k9175J6331j6476j0561R0r216j7362J9087
9926d3257J8469K0331J267P1r968j9629K0679J3855J1227l0494j8874O909l598
9913c3012Q924k782L459M2173j7829j1239N040j4718J5867L0693m076j780J3992
9900C4712j6027n1692j5856j6055k222J3956K2134J4880J8151K0184k54j1019
9888A0892J9605J0103o788k3276k3061M882k802R725j6125J1748J4600Q31m279
9875F055q117P188J7317P919j9254j2857O619j9048j5860J1867J8629R289N242
$$ plain form
9862 14989 6005 4326 -37486 -54415 -19160 20460 14736 41073 24255 -15501 -1435 18306
9850 18306 -16968 -48012 -60548 -78128 -39491 24294 49287 38438 24112 8498 643 -3707
9838 -3707 15693 17436 -14171 -44709 -41726 -67668 -78344 -20174 40517 32588 26719 8104 -3592
9825 -3592 -25362 14209 25727 18296 21777 4231 13210 -3103 -33259 -10049 7998 9053 -11395
9812 -11395 -3868 -5373 -14750 -15808 -11578 -7598 7138 6804 17121 12598 35681 49661 30825 46760
9798 46760 34127 21856 28844 17883 32580 17233 -7664 17113 17032 -4335 -11153 -6682 -6833
9785 -6833 6717 -23506 -45179 -49426 -45956 -18340 -17046 4111 29094 8635 -10857 10873 15808
9772 15808 -19839 257 21786 -4284 -20857 -16898 12760 40364 72079 71060 57318 17023
$$ packed form
9862A4989q984j679m1812j6929L5255L9620n724K6337j6818l9756J4066J9741
9850A8306l5274l1044j2536j7580L8637O3785K4993j0849j4326j5614p855m350
9838c707J9400J743l1607l0538K983k5942j0676N8170O0691p929n869j8615j1696
9825c592k1770L9571J1518p431L481j7546Q979j6313l0156K3210J8047J055k0448
9812a1395P527j505r377j058M230L980J4736l34J0317m523K3083J3980j8836J5935
9798D6760j2633j2271O988j0961J4697j5347k4897K4777q1k1367o818M471j51
9785f833J3550l0223k1673m247L470K7616J294K1157K4983k0459j9492K1730M935
9772A5808l5647K0096K1529k6070j6573L959K9658K7604L1715j019j3742m0295
$$ plain form
9760 17023 -4333 -24857 -45291 -16405 33431 53551 48247 37186 43922 70404 85347 85058 61835
9747 61835 17697 2755 -3058 -22899 -12541 13646 15834 -26027 -17506 10152 45478 55378 66403
9734 66403 68934 51173 21893 12541 2459 -26511 -48943 -43374 -52825 -41749 -22546 -20909 -15837
9721 -15837 -16918 -23165 -48649 -65940 -42639 -47976 -34811 5715 28188 37076 23118 37091 27179
9708 27179 16454 22493 46898 42591 35979 25808 -4232 -4509 -18479 -11569 24194 9480 -33773
9695 -33773 -39998 -33685 -1648 -23670 -31058 -8894 -4924 -43064 -40490 -35198 -58648 -35319 -4723
9682 -4723 30630 11273 16801 26252 -509 -20705 -8434 -12769 8851 21911 12746 13085 25717
9669 25717 20345 -9839 12 -4375 3610 11269 38601 44100 64328 68969 53579 41194 51557
$$ packed form
9760A7023k1356k0524k0434K8886M9836K0120n304j1061O736K6482J4943k89k3223
9747F1835m4138j4942n813j9841J0358K6187K188m1861Q521K7658L5326R900J1025
9734F6403K531j7761k9280r352j0082k8970k2432N569r451J1076J9203J637N072
9721a5837j081o247k5484j7291K3301n337J3165M0526K2473Q888j3958J3973r912
9708B7179j0725O039K4405m307o612j0171l0040k77j3970O910L5763j4714m3253
9695c3773o225O313L2037k2022p388K2164L970l8140K574N292k3450K3329L0596
9682d723L5353j9357N528R451k6761k0196J2271m335K1620J3060r165L39J2632
9669B5717n372l0184R851m387P985P659K7332N499K0228M641j5390j2385J0363
$$ plain form
9656 51557 53471 52945 36771 29277 65095 79631 73800 71416 86916 122019 110475 120132 104042
9643 104042 87944 97013 108654 104948 100325 99737 59061 35798 30865 75075 95726 90142 89260
9630 89260 90384 82022 98862 103633 76315 79813 86701 72286 36227 33553 44540 69802 100233
9617 100233 108364 102592 95523 89585 81843 56690 31809 37796 14933 -14494 -12940 35559 63313
9604 63313 80026 98695 105738 96796 47524 15691 29064 30291 69610 77472 76832 60632 57715
9591 57715 63358 34977 22400 31716 48508 43381 12354 10859 27238 28134 -5256 -30876 -36430
9578 -36430 -15301 -18431 -5764 16451 255 -49682 -32630 -25237 -13637 25511 32230 22329 27176
9565 27176 3144 -44916 -33140 1263 2024 -2810 -16120 11413 60750 40508 18469 43420
$$ packed form
9656E1557J914n26j6174p494L5818J4536n831k384J5500L5103j1544R657j6090
9643A04042j6098R069J1641l706m623n88m0676k3263m933M4210K0651n584q82
9630H9260J124q362J6840M771k7318L498O888j4415l6059k674J0987K5262L0431
9617A00233Q131n772p069n938p742k5153k4881N987k2863k9427J554M8499K7754
9604F3313J6713J8669P043q942m9272l1833J3373J227L9319P862o40j6200k917
9591E7715N643k8381j2577R316J6792n127l1027j495J6379Q96l3390k5620n554
9578c6430K1129l130J2667K2215j6196m9937J7052P393J1600L9148O719r901M847
9565B7176k4032m8060J1776L4403P61m834j3310K7533M9337k0242k2039K4951
$$ plain form
9553 43420 51120 47780 -7260 -62807 -40949 -7812 18489 39721 12876 20969 42622 54304
9541 54304 53571 62096 928 -32208 -17378 25054 12761 1439 6266 -17794 -14503 -39972 -35486
9528 -35486 5864 29851 42480 43722 42026 35547 48187 27662 -23355 -24409 -34667 1355 37126
9515 37126 58153 51345 30446 11963 24065 12191 17105 26904 20768 8840 12695 19845 13062
9502 13062 -44101 -83631 -84924 -76015 -66334 -57676 11783 32858 41177 60410 22658 -15891 4086
9489 4086 24832 -17308 -53373 -51780 -27114 -840 18396 1844 -5880 -17139 -11912 3976 3695
9476 3695 21185 28559 53412 4536 -27092 -30019 -41058 -35335 -8600 -2283 -32846 -42511 -39753
9463 -39753 -11467 -49322 -31604 -14939 -21416 -3696 20674 19175 15228 -12123 -37660 -19779
$$ packed form
9553D3420P700l340n5040n5547K1858L3137K6301K1232k6845Q093K1653J1682
9541E4304p33Q525o1168l3136J4830M2432j2293j1322M827k4060L291k5469M486
9528c5486M1350K3987J2629J242j696o479J2640k0525n1017j054j0258L6022L5771
9515C7126K1027o808k0899j8483J2102j1874M914R799o136j1928L855P150o783
9502A3062n7163l9530j293Q909R681Q658O9459K1075Q319J9233l7752l8549J9977
9489D086K0746m2140l6065J593K4666K6274J9236j6552p724j1259N227J5888k81
9476C695J7490P374K4853m8876l1628k927j1039N723K6735O317l0563r665K758
9463c9753K8286l7855J7718J6665o477J7720K4370j499l947k7351k5537J7881
$$ plain form
9451 -19779 25547 25151 -6282 -33733 -67259 -72572 -27447 7118 -15344 -13869 18966 30065 6169
9438 6169 25130 43444 43185 25815 942 35772 29523 7854 -14086 -37467 -42373 -37769 -33231
9425 -33231 -38771 -29100 -3879 -259 -24907 -2564 17148 19720 32475 23382 7714 24484 40163
9412 40163 37762 26005 31506 24605 8481 -14706 -39382 -47861 -39067 -1968 18979 29902 31900
9399 31900 35815 44385 27672 13818 -2977 -9884 -38364 -38345 -38466 -38902 -43168 -3855 40867 18299
9385 18299 2936 -6893 -1389 44527 55316 48946 36761 11561 -19255 -29059 -57880 -47672 -35001
9372 -35001 -10132 189 16550 5334 8034 14315 27589 21196 7118 -2004 -18039 1865 11566
9359 11566 -23298 -51594 -57005 -35617 -2904 -9588 -13282 -14997 -24130 -21618 -41204 -41446 -20959
$$ packed form
9451a9779M5326l96l1433k7451l3526n313M5125L4565k2462J475L2835J1099k3896
9438F169J8961J8314k59j7370k4873L4830o249k1669k1940k3381m906M604M538
9425c3231n540R671K5221L620k4648K2343J9712K572J2755r093j5668J6770J5679
9412D0163k401j1757N501o901j6124k3187k4676q479Q794L7099K0947J0923J998
9399C1900L915Q570j6713j3854j6795o907k8480J9j21m36m266L9313M4722k2568
9385A8299j5363r829N504M5916J0789o370j2185k5200l0816r804k8821J0208J2671
9372c5001K4869J0321J6361j1216K700O281J3274o393j4078r122j6035J9904R701
9359A1566l4864k8296n411K1388L2713o684l694j715r133K512j9586k42K0487
$$ plain form
9346 -20959 -10910 4869 8529 1736 9965 -4326 -48388 -12165 -588 2488 10825 9538 45096
9333 45096 26865 -11756 17737 15257 -14103 -19 4642 -19786 -21112 -4184 45227 80756
9321 80756 47335 13053 36951 45451 -6052 -25467 5866 9264 12571 11663 18538 20667 56143
9308 56143 33214 13722 47697 36660 -6116 30894 34955 -1782 -42886 -49449 -27986 -24473
9296 -24473 -19817 -19551 -11712 5510 -24299 10771 3563 -40737 -24586 6185 11833 22404 28485
9283 28485 31958 23135 18528 6023 -15933 -13863 -33762 -16007 -127 5379 -6729 4433 15909
9270 15909 51022 53637 40495 19853 23326 28846 5396 917 26285 40684 34165 -7283 22453
9257 22453 29514 30287 32185 -1749 -20857 7445 17510 26511 35344 16897 22844 13570 34411
$$ packed form
9346b0959J0049J5779L660o793Q229j4291m4062L6223J1577L076Q337j287L5558
9333D5096j8231l8621K9493k480k9360J4084M661k4428j326J6928M9411L5529
9321H0756l3421l4282K3898Q500n1503j9415L1333L398L307r08O875K129L5476
9308E6143k2929j9492L3975j1037m2776L7010M061l6737m1104o563K1463L513
9296b4473M656K66P839J7222k9809L5070p208m4300J6151L0771N648J0571O081
9283B8485L473q823m607j2505k1956K070j9899J7755J5880N506j2108J1162J1476
9270A5909L5113K615j3142k0642L473N520k3450m479K5368J4399o519m1448K9736
9257B2453P061P73J898l3934j9108K8302J0065R001Q833j8447N947r274K0841
$$ plain form
9244 34411 16752 40945 97157 107054 80376 59203 45223 74940 79325 70083 77053 76070 92592
9231 92592 87402 59100 52674 59882 50391 36877 14179 43153 50187 56570 98953 100516 87254
9218 87254 48654 -3961 14377 16919 30556 25879 29668 78296 118589 113371 110969 109271 80175
9205 80175 34088 24079 22286 64793 94586 110351 122105 128984 122523 109705 75556 77968 70935
9192 70935 119281 150298 154666 152034 180108 217515 217989 251625 268464 261488 265800 291398 306614
9179 306614 338335 368947 399150 453339 511962 560989 648688 751004 833233 954839 1097750
9168 1097750 1273258 1479872 1786313 2205953 2736113 3517432 4631810 6271249 8771493
9159 8771493 12416426 17233314 21876150 23429359 20708935 16053086 11788303 8650490
$$ packed form
9244C4411j7659K4193N6212R897k6678k1173j3980K9717M385r242O970r83J6522
9231I2592n190k8302o426P208r491j3514k2698K8974P034O383M2383J563j3262
9218H7254l8600n2615J8338K542J3637m677L789M8628M0293n218k402j698k9096
9205H0175m6087j0009j793M2507K9793J5765J1754O879o461j2818l4149K412p033
9192G0935M8346L1017M368k632K8074L7407M74L3636J6839o976M312K5598J5216
9179C06614L1721L0612L0203N4189N8623M9027Q7699J02316Q2229J21606J42911
9168A097750J75508K06614L06441M19640N30160P81319J114378J639439K500244
9159H771493L644933M816888M642836J553209k720424m655849m264783l137813
$$ plain form
9151 8650490 6470958 4958963 3914575 3178274 2587340 2104985 1759990 1504736 1309846
9142 1309846 1135907 979030 865148 770662 693725 628829 564716 534238 495226 430733 397392
9131 397392 356003 305678 256274 259795 291228 293613 278086 241860 227516 277109 255137 223345
9119 223345 221787 191300 163701 129783 134276 137594 157017 183758 208724 170924 100898 88310
9107 88310 57635 41096 82034 95062 59698 64094 44544 53516 57159 70568 57263 26348
9095 26348 19714 35300 67245 94755 50161 35909 45928 37578 44743 55182 883 355 21219
9082 21219 88375 117474 98184 55732 52307 20971 -2265 27196 66269 75576 78593 72142 38892
9069 38892 22007 59372 75978 110971 117933 85419 53121 29366 6568 -5343 -4865 5698
$$ packed form
9151H650490k179532j511995j044388p36301n90934m82355l44995k55254j94890
9142A309846j73939j56877j13882r4486p6937o4896o4113l0478l9012o4493l3341
9131C97392m1389n0325m9404L521L1433K385j5527l6226j4344M9593k1972l1792
9119B23345j558l0487k7599l3918M493L318J9423K6741K4966l7800p0026j2588
9107H8310l0675j6539M0938J3028l5364M396j9550Q972L643J3409j3305l0915
9095B6348o634J5586L1945K7510m4594j4252J0019q350P165J0439n4299n28K0864
9082B1219O7156K9099j9290m2452l425l1336k3236K9461L9073R307L017o451l3250
9069C8892j6885L7365J6606L4993O962l2514l2298k3755k2798j1911M78J0563
$$ plain form
9057 5698 -4261 -41650 -19765 -17317 -15245 4600 29156 65704 62886 11838 -103 5825 10548
9044 10548 40300 46853 35552 21700 38960 45275 42291 65805 36001 11108 -11617 -3802 -1524
9031 -1524 17182 53809 15774 -2730 7318 50931 46183 41867 27061 15475 12684 -19549 -26616
9018 -26616 -5977 -9270 5893 28745 5976 5406 -2055 22858 8908 -8715 -14628 -35786 -7369
9005 -7369 33996 48071 44534 18163 6864 53664 63098 75236 51003 28785 -10577 -6689 9486
8992 9486 -6840 3955 1262 -3447 7866 5268 -10573 -12946 15816 17571 -12979 1594 5642
8979 5642 537 2526 22807 604 -27804 -8647 2176 -7218 5306 34837 59274 62659 5961
8966 5961 -32704 -63967 -81220 -67295 -62638 -46947 -21851 -33665 -36512 13210 11686 4814 -26855
$$ packed form
9057E698r959l7389K1885K448K072J9845K4556L6548k818n1048j1941N928M723
9044A0548K9752O553j1301j3852J7260O315k984K3514k9804k4893k2725P815K278
9031a524J8706L6627l8035j8504J0048M3613m748m316j4806j1586k791l2233p067
9018b6616K0639l293J5163K2852k2769n70p461K4913j3950j7623n913k1158K8417
9005g369M1365J4075l537k6371j1299M6800R434J2138k4233k2218l9362L888J6175
8992I486j6326J0795k693m709J1313k598j5841k373K8762J755l0550J4573M048
8979E642n105J989K0281k2203k8408J9157J0823r394J2524K9531K4437L385n6698
8966E961l8665l1263j7253J3925M657J5691K5096j1814k847M9722j524o872l1669
$$ plain form
8953 -26855 -18852 8529 25478 33651 13265 27958 39142 34116 68388 57402 45921 30132
8941 30132 10005 2349 900 3952 21124 2575 26625 64733 6941 -19853 -19492 7802 1156
8928 1156 -7013 2954 22215 7061 -8697 -36420 -46019 -18895 17688 -829 25490 67046 70835
8915 70835 47447 38559 18582 1678 8965 13638 7534 24684 29030 40448 36924 41586 34791
8902 34791 12829 13141 15678 842 -26725 -32003 -54245 -45791 -35304 -2678 -14726 -47767 -13204
8889 -13204 43271 13668 4717 14949 -15116 -15041 12597 15068 19635 6514 13840 33500 42787
8876 42787 17317 14194 48359 38164 28895 38835 61347 121719 138353 90963 57877 53478 58354
8863 58354 84341 69045 27556 22146 19499 17880 45261 69747 40322 3202 -22601 4597
$$ packed form
8953b6855Q003K7381J6949Q173k0386J4693J1184n026L4272j0986j1481j5789
8941C0132k0127p656j449L052J7172j8549K4050L8108n7792k6794L61K7294o646
8928A156q169R967J9261j5154j5758k7723r599K7124L6583j8517K6319M1556L789
8915G0835k3388q888j9977j6904P287M673o104J7150M346J1418l524M662o795
8902C4791k1962L12K537j4836k7567n278k2242Q454J0487L2626j2048l3041L4563
8889a3204N6475k9603q951J0232l0065P5K7638K471M567j3121P326J9660R287
8876D2787k5470l123L4165j0195r269R940K2512O0372J6634m7390l3086m399M876
8863E8354K5987j5296m1489n410k647j619K7381K4486k9425l7120k5803K7198
$$ plain form
8851 4597 7563 10874 40398 62765 41165 54082 49133 3290 10761 45628 24892 3900 21436
8838 21436 30423 26615 21935 30085 41086 50790 62390 44993 25659 32542 48611 53186 31554
8825 31554 58155 91314 147572 155495 111686 106433 67982 59503 53629 41256 49799 73588 94777
8812 94777 89207 76921 57070 22363 33748 73151 83398 69520 24056 42150 97900 105419
8800 105419 46211 40765 59118 114228 171676 189808 176853 140635 102364 80359 81000 121230
8788 121230 160944 221288 234704 251576 246686 253917 244475 233706 262317 331739 432451 540030
8776 540030 667833 760237 831758 793113 648927 534733 424817 336137 307490 338333 325076
8765 325076 282888 230386 210229 207049 196583 148920 126569 166938 187847 196518 203664 169515
$$ packed form
8851D597K966L311K9524K2367k1600J2917m949m5843P471L4867k0736k0992J7536
8838B1436Q987l808m680Q150J1001R704J1600j7397j9334O883J6069M575k1632
8825C1554K6601L3159N6258P923m3809n253l8451q479n874j2373Q543K3789K1189
8812I4777n570j2286j9851l4707J1385L9403J0247j3878m5464J8094N5750P519
8800A05419n9208n446J8353N5110N7448J8132j2955l6218l8271k2005O41M0230
8788A21230L9714O0344J3416J6872m890P231r442j0769K8611O9422J00712J07579
8776E40030J27803R2404P1521l8645j44186j14194j09916q8680k8647L0843j3257
8765C25076m2188n2502k0157l180j0466m7663k2351M0369K0909Q671P146l4149
$$ plain form
8753 169515 154132 164983 151364 145231 151282 183309 209485 192353 218145 285823 322309 334747
8741 334747 338078 325381 333333 343684 367197 408332 442169 500371 599407 744570 832254 762343
8729 762343 607248 483123 417510 363301 309778 296658 277042 271801 245561 217928 210102 230378
8717 230378 226550 244416 211830 178520 158030 141428 124256 114332 136487 137065 136535 155576 150353
8704 150353 133426 118381 89674 95481 123198 115593 136768 118310 108168 125517 101660 96328
8692 96328 101276 97964 102578 120874 114632 111157 143219 163742 133193 122663 106504 103397 97070
8679 97070 55269 32002 48789 111960 119340 115509 109211 89869 87021 114773 107624 112299 85867
8666 85867 84074 104710 153975 157180 147650 121904 81301 46189 29371 18551 15787 4081 17555
$$ packed form
8753A69515j5383J0851j3619o133O051L2027K6176j7132K5792O7678L6486J2438
8741C34747L331j2697P952J0351K3513M1135L3837N8202R9036J45163Q7684o9911
8729G62343j55095j24125o5613n4209n3523j3120j9616n241k6240k7633p826K0276
8717B30378l828J7866l2586l3310k0490j6602j7172r924K2155N78n30J9041n223
8704A50353j6927j5045k8707N807K7717p605K1175j8458j0142J7349k3857n332
8692I6328M948l312M614J8296o242l475L2062K0523l0549j0530j6159l107o327
8679I7070m1801k3267J6787O3171P380l831o298j9342k848K7752p149M675k6432
8666H5867j793K0636M9265L205r530k5746m0603l5112j6818j0820k764j1706J3474
$$ plain form
8653 17555 59202 87388 106471 99099 102723 116276 115726 76192 61345 41543 68878 41876 7872
8640 7872 25091 70671 95573 51250 24286 40204 58063 59934 61835 76811 65667 55523
8628 55523 41960 46880 74612 95259 43571 11921 27972 47893 52464 48503 41902 56893 69099
8615 69099 66657 70637 103790 113228 110808 97538 81211 89502 121959 118153 122230 119247 153754
8602 153754 159758 147114 145550 152247 146705 148173 165294 188564 255790 289868 310341 287259 323257
8589 323257 347222 361784 363451 364466 338434 294246 288982 282948 214380 196080 162522 116101
8577 116101 92222 80206 44988 28234 74758 85330 79672 66231 56449 87769 96821 64103
8565 64103 71192 74641 57840 49562 5855 -6243 20294 48680 53621 44815 43599 62246 98394
$$ packed form
8653A7555M1647K8186J9083p372L624J3553n50l9534j4847j9802K7335k7002l4004
8640G872J7219M5580K4902m4323k6964J5918J7859J871J901J4976j1144j0144
8628E5523j3563M920K7732K0647n1688l1650J6051J9921M571l961o601J4991J2206
8615F9099k442L980L3153R438k420j3270j6327Q291L2457l806M077k983L4507
8602A53754O004j2644j564O697n542J468J7121K3270O7226L4078K0473k3082L5998
8589C23257K3965J4562J667J015k6032m4188n264o034o8568j8300l3558m6421
8577A16101k3879j2016l5218j6754M6524J0572n658j3441r782L1320R052l2718
8565F4103P089L449j6801q278m3707j2098K6537K8386M941q806j216J8647L6148
$$ plain form
8552 98394 90725 87533 78952 62745 4368 23214 59466 90715 118460 118161 91449 54769 39793
8539 39793 60040 60987 48186 51797 36116 41506 64577 88837 79172 90369 78497 80392 73569
8526 73569 66441 65979 64863 49047 3580 -1080 3889 8825 -7699 -2736 8222 12199 3489 33118
8512 33118 11621 -8880 1316 43241 31426 68463 98274 76704 68524 65337 71856 50758
8500 50758 46607 30783 25553 35086 62231 63105 66003 17607 2498 2856 20883 64679 59082 28827
8486 28827 26033 38071 56786 36499 25417 27655 26177 17908 3433 8521 1371 -1619 -5285
8473 -5285 8312 30388 18232 9123 15550 27507 392 -39729 -43692 -17252 13161 11937 -23333
8460 -23333 -13860 -2192 -5892 -30003 -7830 -6139 -5059 17167 60361 50751 30870 23744 22248
$$ packed form
8552I8394p669l192q581j6207n8377J8846L6252L1249K7745k99k6712l6680j4976
8539C9793K0247R47j2801L611j5681N390K3071K4260r665J1197j1872J895o823
8526G3569p128m62j116j5816m5467m660M969M936j6524M963J0958L977q710K9629
8512C3118k1497k0501J0196M1925j1815L7037K9811k1570q180l187O519k1098
8500E0758m151j5824n230R533K7145Q74K898m8396j5109L58J8027M3796n597l0255
8486B8827k794J2038J8715k0287j1082K238j478q269j4475N088p150k990l666
8473e285J3597K2076j2156r109O427J1957k7115m0121l963K6440L0413j224l5270
8460b3333R473J1668l700k4111K2173J691J080K2226M3194r610j9881p126j496
$$ plain form
8447 22248 28390 28737 30699 62307 81678 63399 20987 44375 73160 85452 58268 49122 40587
8434 40587 18992 20495 16658 24899 41677 52250 25630 -18000 -29285 1674 16947 -17897
8422 -17897 -48059 -21264 17545 52733 42724 61180 55318 48108 1840 11717 12040 18634 43952
8409 43952 52530 61190 60526 12019 -6362 12844 20595 51008 64229 58229 66727 37098 2486
8396 2486 -23950 -13165 -17264 -5912 18605 22211 10334 10485 11494 -8177 -121 689 -15802 -31182
8382 -31182 -43198 4263 32416 -3588 -34868 -59908 -45424 -33332 -13036 -7299 2047 -18517
8370 -18517 -17584 -6961 496 6473 38929 2649 -13627 10169 15254 -11517 -20686 -48817 -13365
8357 -13365 31714 38270 -961 -29034 -44684 -36515 16919 50025 55361 47220 22773 -35806 -30271
$$ packed form
8447B2248O142L47J962L1608J9371j8279m2412K3388K8785J2292k7184r146q535
8434D0587k1595J503l837Q241J6778J0573k6620m3630j1285L0959J5273l4844
8422a7897l0162K6795L8809L5188j0009J8456n862p210m6268R877L23O594K5318
8409D3952Q578Q660o64m8507j8381J9206P751L0413J3221o000Q498k9629l4612
8396B486k6436J0785m099J1352K4517L606j1877J51J009j9671Q056Q10j6491j5380
8382c1182j2016M7461K8153l6004l1280k5040J4484J2092K0296N737R346k0564
8370a8517R33J0623P457N977L2456l6280j6276K3796N085k6771r169k8131L5452
8357a3365M5079O556l9231k8073j5650Q169N3434L3106N336q141k4447n8579N535
$$ plain form
8344 -30271 -4148 -7095 17178 21458 41279 14826 -23142 -21031 -6908 17424 2430 22314
8332 22314 13518 -37616 -49736 -40227 -34314 -21691 -19680 -15284 -38175 -40373 1273 38623 18295
8319 18295 6601 15989 18846 58844 65418 3289 -32913 -28639 -4056 9081 -20461 -59068 -61486
8306 -61486 -21487 11590 -14475 -9999 -6303 -39117 -42161 -14710 -5634 -26840 -17056 -16921 -59351
8293 -59351 -78460 -28991 -14168 -23608 10036 35100 25661 25170 3499 6979 3052 -12333 -19520
8280 -19520 6287 48180 78496 47925 3186 -23609 -38345 -14732 -47973 -42831 -36074 -25854
8268 -25854 -14083 18556 45782 23674 -3350 -12785 -22656 -25463 -25710 28149 55064 57415 25545
8255 25545 -14758 -27387 -9180 -15749 15744 33177 14579 20682 39082 23196 -20357 -20094 -6892
$$ packed form
8344c0271K6123k947K4273M280J9821k6453l7968K111J4123K4332j4994J9884
8332B2314q796n1134j2120R509N913J2623K011M396k2891k198M1646L7350k0328
8319A8295j1694R388K857L9998O574o2129l6202M274K4583J3137k9542l8607k418
8306f1486L9999L3077k6065M476L696l2814l044K7451R076k1206R784J35m2430
8293e9351j9109M9469J4823r440L3644K5064r439m91k1671L480l927j5385p187
8280a9520K5807M1893L0316l0571m4739k6795j4736K3613l3241N142O757J0220
8268b5854J1771L2639K7226k2108k7024r435r871k807k47N3859K6915K351l1870
8255B5545m0303j2629J8207o569L1493J7433j8598O103J8400j5886m3553K63J3202
$$ plain form
8242 -6892 5320 16184 15568 18726 36611 10910 -32925 -7399 -12662 -30786 -44506 -19761 3106
8229 3106 3989 7686 7479 -29938 -34575 -15257 18237 24142 33179 29116 3192 2328 9897 20045
8215 20045 21110 -5715 -24803 -27905 -25208 -4274 -26449 -8114 4783 -13705 13874 36134
8203 36134 24460 1243 -31951 -33476 -40773 -36332 -23021 5530 34191 48429 42425 44986 37480
8190 37480 -5015 -49066 -73029 -59656 -32111 -14279 -27140 -45543 13166 50653 26343 10773
8178 10773 37589 19581 -26648 -30855 -39161 -48017 -34555 -23031 -38895 -26259 -5180 3800 -25346
8165 -25346 -60881 -47048 -28654 -12279 -15887 -39541 -45970 -8648 -36573 -60154 -67969 -62261 -31174
8152 -31174 -38385 -34060 -28790 -24666 -7560 -39112 -42299 -11511 12572 -30691 -44483 -26105 -12040
$$ packed form
8242f892J2212J0864o16L158J7885k5701m3835K5526n263j8124j3720K4745K2867
8229C106Q83L697k07l7417m637J9318L3494N905R037m063k5924q64P569J0148
8215B0045J065k6825j9088l102K697K0934k2175J8335J2897j8488K7579K2260
8203C6134j1674k3217l3194j525p297M441J3311K8551K8661J4238o004K561p506
8190C7480m2495m4051k3963J3373K7545J7832j2861j8403N8709L7487k4310j5570
8178A0773K6816j8008m6229m207q306q856J3462J1524j5864J2636K1079Q980k9146
8165b5346l5535J3833J8394J6375l608k3654o429L7322k7925k3581p815N708L1087
8152c1174p211M325N270M124J7106l1552l187L0788K4083m3263j3792J8378J4065
$$ plain form
8139 -12040 -3611 -14229 -12300 28323 52214 30574 -7467 8396 21450 1706 896 18263 30102
8126 30102 23100 5211 -18149 -51744 -49473 -12357 1813 -12457 -23547 15034 12774 -16404
8114 -16404 -44146 -23047 22556 64710 92775 83911 74697 79087 91400 83094 87877 53759 48958
8101 48958 8663 5387 8599 2508 -5255 -13397 -11227 25846 45145 55975 52891 39985 11617
8088 11617 405 4524 -30438 -49625 -27882 -31154 -26647 2036 37211 19361 -22104 -34026
8076 -34026 -36642 -13993 -40717 -67020 -53906 -71609 -107346 -135943 -112518 -28215 16374 14025
8064 14025 32352 40527 49206 38376 61142 84758 66448 61737 51474 36868 36341 28258 1611
8051 1611 -26977 -17567 29 7871 18170 -19275 -19525 -19290 7185 -23564 -30570 19510 7387
$$ packed form
8139a2040Q429j0618J929M0623K3891k1640l8041J5863J3054j9744q10J7367J1839
8126C0102p002j7889k3360l3595K271L7116J4170j4270j1090L8581k260k9178
8114a6404k7742K1099M5603M2154K8065q864r214M390J2313q306M783l4118m801
8101D8958m0295l276L212o091p763q142K170L7073J9299J0830l084j2906k8368
8088A1617j1212M119l4962j9187K1743l272M507K8683L5175j7850m1465j1922
8076c4026k616K2649k6724k6303J3114j7703l5737k8597K3425Q4303M4589k349
8064A4025J8327Q175Q679j0830K2766K3616j8310m711j0263j4606n27q083k6647
8051A611k8588R410J7596P842J0299l7445k50K35K6475l0749p006N0080j2123
$$ plain form
8038 7387 -24808 -3689 40605 79352 19273 8967 19060 9331 19063 23881 34481 61515 74195
8025 74195 44755 40983 40902 47133 27780 44717 43245 18370 45682 49549 51218 67581 30467
8012 30467 4906 18655 18798 29188 17293 27068 24610 7413 28207 21913 -5429 919 16500
7999 16500 39790 35864 43376 27921 -9777 -5113 -14 14613 25032 -15601 11373 11453 5227
7986 5227 -185 -8247 1282 24839 23838 26849 1366 16039 24975 6231 11409 10272 -23072 -64239
7972 -64239 -82257 -49586 -4781 -6436 17122 61889 48522 42409 27540 27699 25691 34701 56818
7959 56818 45645 23302 11902 8652 7573 17762 20553 29193 72002 121495 96756 51672 44572
7946 44572 60117 99132 99909 65711 40225 44532 45138 37387 42251 49363 22294 25756 57447 48229
$$ packed form
8038G387l2195K1119M4294L8747o0079j0306J0093r729R732M818J0600K7034J2680
8025G4195k9440l772q1O231j9353J6937j472k4875K7312L867J669J6363l7114
8012C0467k5561J3749J43J0390j1895R775k458j7197K0794o294k7342O348J5581
7999A6500K3290l926P512j5455l7698M664N099J4627J0419m0633K6974Q0o226
7986E227n412q062R529K3557j001L011k5483J4673Q936j8744N178j137l3344m1167
7972f4239j8018L2671M4805j655K3558M4767j3367o113j4869J59k008R010K2117
7959E6818j1173k2343j1400l250j079J0189K791Q640M2809M9493k4739m5084p100
7946D4572J5545L9015P77l4198k5486M307O06p751M864P112k7069L462L1691r218
$$ plain form
7932 48229 -7952 -11492 30930 35633 7346 -9519 -32469 -7728 13225 48867 41949 30847
7920 30847 -1156 15875 65533 96072 102461 77849 56500 -8415 -20651 -4222 7441 3112
7908 3112 17411 7175 -32560 -11945 16905 17540 17520 13343 26459 61405 49305 65351 52630
7895 52630 33930 5181 -8954 -11354 -35282 -37690 -41863 -45924 -43110 -11611 -692 -6147 9077
7882 9077 10520 10597 6156 -13439 -1569 -9489 -21019 -31719 -22523 -32451 -21275 -27739 -27254 13003
7868 13003 11811 11475 -10032 -34768 -32201 -23375 25195 52301 33459 12390 -30494 -39440 -8090
7855 -8090 -17310 -14857 -28705 -16146 -11711 -7258 -24953 -50960 -18555 7342 34327 14913 1023
7842 1023 -20109 -28729 -50518 -46770 -62214 -77839 -59902 -26766 5168 2480 -14777 -17281 -22685
$$ packed form
7932D8229n6181l540M2422M703k8287j6865k2950K4741K0953L5642o918j1102
7920C0847l2003J7031M9658L0539O389k4612k1349o4915j2236J6429J1663m329
7908C112J4299j0236l9735K0615K8850O35k0m177J3116L4946j2100J6046j2721
7895E2630j8700k8749j4135k400k3928k408m173m061K814L1499J0919n455J5224
7882I077J443P7m441j9595J1870p920j1530j0700R196r928J1176o464M85M0257
7868A3003j192l36k1507k4736K567Q826M8570K7106j8842k1069m2884q946L1350
7855h090r220K453j3848J2559M435M453j7695k6007L2405K5897K6985j9414j3890
7842A023k1132q620k1789L748j5444j5625J7937L3136L1934k688j7257k504n404
$$ plain form
7829 -22685 -14032 -6998 -2012 -46058 -51732 -39165 -18705 -18253 -12045 -32539 -24166 7774 1819 -13964
7815 -13964 -33093 -17641 44577 55107 51399 54153 34430 36686 32351 33439 -15290 -48234 -66762
7802 -66762 -75455 -45454 -51913 -31327 -24723 -47553 -72675 -49676 -51657 -59687 -26417 15455 59333
7789 59333 66472 40610 26886 19333 20076 21306 7322 4430 1504 4701 31058 -6570 -24550
7776 -24550 -51915 -41116 -854 62064 27535 -29432 -28679 -7981 -3888 460 3193 -9749 -19375
7763 -19375 -41730 -37642 -21207 -1001 4750 -2470 -7404 15483 27642 -1938 -24028 -2063 -7742
7750 -7742 -38965 -72151 -55893 -46679 -35870 -33141 -45376 -41881 12230 19328 14971 8177 -16590
7737 -16590 -57290 -49232 -37418 -58182 -77727 -48939 -16361 4034 40029 20195 -14404 -38609
$$ packed form
7829b2685Q653P034M986m4046n674J2567K0460M52O208k0494Q373L1940n955j5783
7815a3964j9129J5452O2218J0530l708K754j9723K256m335J088m8729l2944j8528
7802f6762q693L0001o459K0586O604k2830k5122K2999j981q030L3270M1872M3878
7789E9333P139k5862j3724p553P43J230j3984k892k926L197K6357l7628j7980
7776b4550k7365J0799M0262O2918l4529n6967P53K0698M093M348K733j2942r626
7763a9375k2355M088J6435K0206N751p220m934K2887J2159k9580k2090K1965n679
7750g742l1223l3186J6258R214J0809K729j2235L495N4111P098m357o794k4767
7737a6590m0700Q058J1814k0764j9545K8788L2578K0395L5995j9834l4599k4205
$$ plain form
7725 -38609 5453 38808 40793 17567 25997 36248 31309 772 -3144 15484 20698 13466 1740
7712 1740 19457 10820 30292 -9962 -33059 -863 15609 9368 -6072 -32087 -43267 -44522 -22925
7699 -22925 17698 24632 1534 -14930 -60880 -56300 -3694 39163 66040 46022 -6216 -49853
7687 -49853 -56383 -73566 -51331 -26825 -16080 -36169 -33804 -24154 -48942 -50257 -50281 -60329 -62980
7674 -62980 -47005 -31200 -91 -26176 -41047 -14415 5736 -23296 -73442 -77794 -10439 6970
7662 6970 2875 9144 23919 41377 -1962 -41660 -34254 -21317 -23996 -45683 -42951 -51768 -36365
7649 -36365 -33560 -14539 -17915 -3171 25873 49825 27424 9318 24264 13495 10635 9534 12449
7636 12449 -34604 -38517 -23048 -31610 -30831 -59377 -53877 -33067 5295 19707 -12752 -10463 -30925
$$ packed form
7725c8609M4062L3355J985k3226Q430J0251m939l0537l916J8628N214p232j1726
7712A740J7717q637J9472m0254k3097L2196J6472o241j5440k6015j1180j255K1597
7699b2925M0623O934k3098j6464m5950M580N2606M2857K6877k0018n2238m3637
7687d9853o530j7183K2235K4506J0745k0089K365R650k4788j315k4j0048k651
7674f2980J5975J5805L1109k6085j4871K6632K0151k9032n0146m352O7355J7409
7662F970m095O269J4775J7458m3339l9698P406J2937k679k1687K732q817J5403
7649c6365K805J9021l376J4744K9044K3952k2401j8106J4946j0769k860j101K915
7636A2449m7053l913J5469q562P79k8546N500K0810L8362J4412l2459K289k0462
$$ plain form
7623 -30925 -21510 -37445 -49216 -40331 -4892 324 1840 5608 15472 11200 2598 -37986 -62189
7610 -62189 -56792 -78601 -116182 -101557 -92863 -54608 -54076 -48094 -30162 -23662 -44890 -34243 -19842
7597 -19842 -27350 -31909 -33383 -40600 -17497 -7824 -13140 -10792 -12846 -6443 -13731 -11456 -25817 -31605
7583 -31605 -46312 -29036 -20143 -17168 -32809 8258 25190 -902 -6763 -33909 -46397 -37951 -18488
7570 -18488 11643 40797 41404 24539 -24128 -51850 -63536 -77427 -78188 -81825 -53720 -92879 -66273
7557 -66273 -53776 -28234 -9254 -40935 -20246 30892 74986 69891 8105 -49684 -25116 -1001
7545 -1001 -31871 -30835 -29841 10273 -15084 -23153 3124 10358 14590 20224 27769 10298 -6082 -7820
7531 -7820 17313 179 -14517 -5705 10307 13215 5707 11505 21299 27196 13525 1716 -10815
$$ packed form
7623c0925R415j5935j1771Q885L5439N216J516L768R864m272q602m0584k4203
7610f2189N397k1809l7581J4625Q694L8255N32N982J7932O500k1228J0647J4401
7597a9842p508m559j474p217K3103R673n316K348k054O403p288K275j4361n788
7583c1605j4707J7276Q893K975j5641M1067J6932k6092n861k7146j2488Q446J9463
7570a8488L0131K9154O07j6865m8667k7722j1686j3891p61l637K8105l9159K6606
7557f6273J2497K5542J8980l1681K0689N1138M4094n095o1786n7789K4568K4115
7545a001l0870J036R94M0114k5357q069K6277P234M232N634P545j7471j6380j738
7531g820K5133j7134j4696Q812J6012K908p508N798R794N897j3671j1809j2531
$$ plain form
7518 -10815 -4728 -21807 -7595 31475 85071 81538 68013 77896 57845 31659 24536 22228 32757
7505 32757 33578 46879 42742 28773 50067 53126 4656 5146 31044 11332 -11384 -34070 -38042
7492 -38042 -50145 -54598 -69531 -91123 -63443 -40157 -14151 -11086 1910 -27436 -30844 -17020
7480 -17020 -13282 7517 18070 12387 15495 5290 -38416 -28344 -39184 -61527 -59377 -39561 395
7467 395 8082 -23982 -45272 -54120 -4305 26578 7647 -55955 -77823 -67723 -33184 15485 22639
7454 22639 16158 -2825 5239 4439 -17084 -23994 -12225 -64975 -63142 -45882 -12913 -17377 11820
7441 11820 2202 3336 -26104 -28109 -10536 -11197 1242 12306 21211 42462 43552 -8506 -29678
7428 -29678 12751 32161 52556 32654 -14861 -48013 -54879 -54954 -40188 -19053 -11418 -27780 -11575
$$ packed form
7518a0815O087j7079J4212L9070N3596l533j3525R883k0051k6186p123k308J0529
7505C2757Q21J3301m137j3969K1294L059m8470M90K5898j9712k2716k2686l972
7492c8042j2103m453j4933k1592K7680K3286K6006L065J2996k9346l408J3824
7480a7020L738K0799J0553n683L108j0205m3706J0072j0840k2343K150J9816L9956
7467C95P687l2064k1290q848M9815L0883j8931o3602k1868J0100L4539M8669P154
7454B2639o481j8983Q064q00k1523o910J1769n2750J833J7260L2969m464K9197
7441A1820r618J134k9440k005J7573o61J2439J1064Q905K1251J090n2058k1172
7428b9678M2429J9410K0395j9902m7515l3152o866p5J4766K1135P635j6362J6205
$$ plain form
7415 -11575 -42262 -56413 -83086 -73061 -34530 -37536 -22995 -43159 -57944 -58934 -59951 -32525 -20497
7402 -20497 -14696 -26483 -45539 -51259 -53498 -51535 -35505 514 33756 30737 35133 33650 23668
7389 23668 6874 -16518 -14948 -31700 -23602 -34793 -63078 -69928 -59076 -101719 -105337 -85832 -44775
7376 -44775 -28438 -3293 25095 29670 15486 -18975 -14896 -16339 12915 30636 41041 14422
7364 14422 -26250 -40180 -32437 -34493 -34096 -12862 -20423 -56537 -76717 -23625 -39632 -5595 -15528
7351 -15528 -32692 -26429 -1651 4702 -191 -9337 26953 25604 44344 23304 -12920 -37197 -3351
7338 -3351 8345 -29853 -26213 -6426 -22103 -17993 -26145 -8171 -33320 -49981 -46212 -39358 -19544
7325 -19544 -19208 -11635 -55679 -59914 -61671 -58087 -21240 -16160 -66785 -69672 -57974 -31269 -7340
$$ packed form
7415a1575l0687j4151k6673J0025L8531l006J4541k0164j4785r90j017K7426J2028
7402b0497N801j1787j9056n720k239J963J6030L6019L3242l019M396j483r982
7389B3668j6794k3392J570j6752Q098j1191k8285o850J0852m2643l618J9505M1057
7376d4775J6337K5145K8388M575j4184l4461M079j443K9254J7721J0405k6619
7364A4422m0672j3930P743k056L97K1234p561l6114k0180N3092j6007L4037r933
7351a5528j7164O263K4778O353m893r146L6290j349J8740k1040l6224k4277L3846
7338c351J1696l8198L640J9787j5677M110q152J7974k5149j6661L769O854J9814
7325a9544L36P573m4044m235j757L584L6847N080n0625k887J1698K6705K3929
$$ plain form
7312 -7340 -12802 -27645 -43864 -47289 -49092 -39449 -47383 -51626 -32070 -19743 -29999 -14599 -27757
7299 -27757 -20874 -2943 -33231 -37949 -28889 14823 28534 -913 -17782 3935 5209 -7142 -23806
7286 -23806 -32730 -53135 -49553 -37848 -31141 -13151 3606 13079 25600 26892 -7374 -17456 10497
7273 10497 981 4788 17519 29526 16293 32823 27078 644 -15588 12814 8593 -17325 -42193
7260 -42193 -25178 -31597 -37216 -10390 -16078 -3141 -15364 -15476 22775 51557 105499 103717 60980
7247 60980 -5459 -52338 -43986 -30001 -35982 -38718 -17200 3916 -8801 -7178 15133 36423 -1018
7234 -1018 -17104 16075 618 -8870 -16156 -61063 -108122 -107552 -77953 -75441 -94652 -64534 -92730
7221 -92730 -106093 -38954 -32594 -29274 -17125 2731 18838 45114 36408 -15480 -70761 -54476
$$ packed form
7312g340n462j4843j6219l425j803R643p934m243J9556J2327j0256J5400j3158
7299b7757O883J7931l0288m718R060M3712J3711k9447j6869K1717J274j2351j6664
7286b3806q924k0405L582J1705O707J7990J6757R473J2521J292l4266j0082K7953
7273A0497r516L807J2731J2007j3233J6530n745k6434j6232K8402m221k5918k4868
7260d2193J7015o419n619K6826n688J2937j2223j12L8251K8782N3942j782m2737
7247F0980o6439m6879Q352J3985n981k736K1518K1116j2717J623K2311K1290l7441
7234a018j6086L3179j5457r488p286m4907m7059N70K9599K512j9211L0118k8196
7221i2730j3363O7139O360L320J2149J9856J6107K6276q706n1888n5281J6285
$$ plain form
7209 -54476 -31564 -27212 -38146 -28328 -1673 23460 31291 34345 -9184 -25440 -30432 5012 -1817
7196 -1817 -16881 -34057 -22854 3969 15416 28217 10851 2688 -7581 2946 -8061 -23822
7184 -23822 -16299 -22920 -8785 -26033 -57936 -66310 -51262 -20809 -24395 -25882 -55363 -66432 -39796
7171 -39796 -24047 -23930 -71862 -113526 -58076 8526 -11129 -4806 -13705 -22951 -5641 -1692 17508
7158 17508 20393 10865 -18536 -43037 -50972 -33125 -20699 14744 28023 -892 -16070 5680
7146 5680 2771 -5286 -17 -11682 -23820 -21209 -47386 -20164 -7749 -24958 -27657 -27459 -44241
7133 -44241 -51914 -22656 13090 9213 11497 9118 -12261 -31962 -55259 -36396 -40113 -19208 -24716
7120 -24716 -24796 -11862 7805 23668 25682 7866 -45752 -56284 -47170 -92844 -109830 -73270 -51011
$$ packed form
7209e4476K2912M352j0934R818K6655K5133P831L054m3529j6256m992L5444o829
7196a817j5064j7176J1203K6823J1447J2801j7366q163j0269J0527j1007j5761
7184b3822P523o621J4135j7248l1903q374J5048L0453l586j487k9481j1069K6636
7171c9796J5749J17m7932m1664N5450O6602j9655O323q899r246J7310L949J9200
7158A7508K885r528k9401k4501p935J7847J2426L5443J3279k8915j5178K1750
7146E680k909q057N269j1665j2138K611k6177K7222J2415j7209k699J98j6782
7133d4241p673K9258L5746l877K284k379k1379j9701k3297J8863l717K0905n508
7120b4716q0J2934J9667J5863K014j7816n3618j0532R114m5674j6986L6560K2259
$$ plain form
7107 -51011 -36583 -27908 -7401 998 -16401 9561 -16050 -22356 -26202 -2290 19831 38501 46036
7094 46036 53734 18919 -23258 -39134 -32861 -41963 -13369 5318 2410 -40275 -35517 -29605 -9962
7081 -9962 29602 75507 61158 60094 63482 43723 27788 26106 11492 24907 -14178 -54396 -64852
7068 -64852 -64422 -80760 -82376 -49707 -8584 25332 58622 47237 -18858 -76758 -47795 -5495
7056 -5495 1553 -31545 -66380 -68358 -35432 14735 16833 -5894 1484 22324 20227 1043 1272
7043 1272 25472 31115 10528 31022 32526 1353 -25645 -28878 -5770 28156 37374 36463 33384
7030 33384 -7357 -41987 -50934 -51211 -50683 -47132 -43665 -36871 -28624 -50545 -58856 -40763 -12758 -29079
7016 -29079 -30577 -16202 -22754 -11742 -46271 -54638 -31648 -39718 -67761 -48506 -7539 -2679 -30531
$$ packed form
7107e1011J4428Q675K0507Q399j7399K5962k5611o306l846K3912K2121J8670P535
7094D6036P698l4815m2177j5876O273r102K8594J8687k908m2685M758N912J9643
7081i962L9564M5905j4349j064L388j9759j5935j682j4614J3415l9085m0218j0456
7068f4852M30j6338j616L2669M1123L3916L3290j1385o6095n7900K8963M2300
7056e495P048l3098l4835j978L2926N0167K098k2727P378K0840k097j9184K29
7043A272K4200N643k0587K0494J504l1173k6998l233K3108L3926R218r11l079
7030C3384m0741l4630q947k77N28L551L467O794Q247k1921q311J8093K8005j6321
7016b9079j498J4375o552J1012l4529q367K2990q070k8043J9255M0967M860k7852
$$ plain form
7003 -30531 -1351 26690 15863 15093 20524 -4678 -20496 -3593 16173 -26610 -25492 -4001 22102
6990 22102 -7535 -28643 -10925 9839 -25380 -6527 36116 28168 33363 19833 -13293 -17980
6978 -17980 2928 18042 31630 32915 19568 24819 35700 -5179 -19289 -7540 3493 -10635
6966 -10635 -45890 -47973 -60446 -106274 -105272 -47266 -13841 -31837 -49371 -20520 -2715 -15927
6954 -15927 -2087 11846 1294 3679 11139 23851 8291 24164 10114 -721 -19438 -44560
6942 -44560 -64707 -72972 -52786 -20914 -30526 19177 39951 -3030 -19693 -1145 -374 -6565 12445
6929 12445 12895 -722 25325 17211 7140 -8452 -28397 -12433 -12050 -11925 -2348 8340 19194
6916 19194 9318 -12921 -10910 -5616 -20349 -35133 -44287 -47968 -47994 -3313 -3155 11739 30886 78993
$$ packed form
7003c0531K9180K8041j0827p70N431k5202j5818J6903J9766m2783J118K1491K6103
6990B2102k9637k1108J7718K0764l5219J8853M2643p948N195j3530l3126m687
6978a7980K0908J5114J3588J285j3347N251J0881m0879j4110J1749J1033j4128
6966a0635l5255k083j2473m5828J002N8006L3425j7996j7534K8851J7805j3212
6954a5927J3840J3933j0552K385P460J2712j5560J5873j4050j0835j8717k5122
6942d4560k0147q265K0186L1872r612M9703K0774m2981j6663J8548P71o191J9010
6929A2445M50j3617K6047q114j0071j5592j9945J5964L83J25R577J0688J0854
6916A9194r876k2239K011N294j4733j4784r154l681k6M4681J58J4894J9147M8107
$$ plain form
6902 78993 71652 33071 32062 10492 -45194 -80170 -43106 -29131 -49770 -44725 -57276 -43991
6890 -43991 -27109 -22058 -49115 -56996 -33201 -24083 -29232 1723 21818 38695 14638 -17588 -47570
6877 -47570 -62751 -37059 20804 226 -22955 -9803 5425 19887 -9288 -25963 1883 17852
6865 17852 35654 53322 17008 -40675 -70574 -51608 -1835 -6620 -26919 -22969 -39249 -45473
6853 -45473 -10468 4156 -12880 -9138 -21422 -12508 -9526 10782 10586 4160 -9411 -28688 -26101
6840 -26101 13873 -15472 -23455 -10682 -16906 -7577 -6311 -13232 -14771 -28105 1544 -2845 -38150
6827 -38150 -14851 -862 33343 32749 -10051 -40704 -14996 2346 -3218 102 3614 -20268 -37634
6814 -37634 -17127 9089 42376 35530 44253 65788 45274 47852 32886 13529 43251 36395 -5809
$$ packed form
6902G8993p341l8581j009k1570n5686l4976L7064J3975k0639N045j2551J3285
6890d3991J6882N051k7057p881K3795R118n149L0955K0095J6877k4057l2226k9982
6877d7570j5181K5692N7863k0578k3181J3152J5228J4462k9175j6675K7846J5969
6865A7852J7802J7668l6314n7683k9899J8966M9773m785k0299L950j6280o224
6853d5473L5005J4624j7036L742j2284Q914K982K0308j96o426j3571j9277K587
6840b6101L9974k9345p983J2773o224R329J266o921j539j3334K9649m389l5305
6827c8150K3299J3989L4205n94m2800l0653K5708J7342n564L320L512k3882j7366
6814c7634K0507K6216L3287o846Q723K1535k0514K578j4966j9357K9722o856m2204
$$ plain form
6801 -5809 -2868 -2833 7212 7029 27993 41805 8905 -11700 11292 29576 36863 35130 722 -15081
6787 -15081 -43402 -49914 -42398 -8083 31091 46200 33330 2808 -3410 -2937 -11358 -7645 -30842
6774 -30842 8938 15674 -11196 -20198 -28992 -27993 -11133 70 39685 79687 73411 46039 16468
6761 16468 270 18261 26279 52788 74190 61040 95311 104687 91678 86753 97213 106955 126171
6748 126171 103564 131014 161079 206136 228102 248361 232861 172212 140140 140139 134269 119903 103210
6735 103210 89827 138497 170828 187792 217550 220776 261008 336834 476662 668008 911314
6724 911314 1282977 1819642 2603950 3624390 4495709 4481534 3537016 2465826 1679957 1165543
6714 1165543 843910 645360 483933 367598 280560 241320 203038 168330 136583 100447 97067
$$ packed form
6801e809K941L5J0045j83K0964J3812l2900k0605K2992J8284P287j733l4408j5803
6787a5081k8321o512P516L4315L9174J5109j2870l0522o218M73q421L713k3197
6774c0842L9780O736k6870r002q794R99J6860J1203L9615M0002o276k7372k9571
6761A6468j6198J7991Q018K6509K1402j3150L4271R376j3009m925J0460R742J9216
6748A26171k2607K7450L0065M5057K1966K0259j5500o0649l2072jn870j4366j6693
6735A03210j3383M8670L2331J6964K9758L226M0232P5826J39828J91346K43306
6724I11314L71663N36665P84308J020440Q71319j4175r44518j071190p85869n14414
6714A165543l21633j98550j61427j16335q7038l9240l8282l4708l1747l6136l380
$$ plain form
6703 97067 79125 94712 128671 142301 152715 138345 134374 140917 114911 93389 50885 68527
6691 68527 80766 57879 33843 29624 18752 -8735 4419 38745 45813 38642 37082 54814 60268
6678 60268 49927 27356 29381 38636 2593 -159 14439 16956 -4439 -22361 -12022 -24399 -9933
6665 -9933 21060 60383 36877 -14387 -26285 -47917 -28668 -14329 -9789 7039 -1476 -7200 -4308
6652 -4308 -30927 -54643 -26126 -9297 -46276 -59287 -68924 -30438 9756 44993 55363 19105
6640 19105 -29144 -36582 -56038 -77456 -39993 6410 12894 -8820 -50108 -61790 -64786 -25879
6628 -25879 -23661 -52840 -72120 -44659 -43447 -22319 -9053 6916 20780 34235 16851 -4426
6616 -4426 -25304 -17482 2195 -2115 27970 83339 99128 80484 40682 69726 112084 207856
$$ packed form
6703I7067j7942J5587L3959J3630J0414j4370l971O543k6006k1522m2504J7642
6691F8527J2239k2887k4036m219j0872k7487J3154L4326P068p171j560J7732N454
6678F0268j0341k2571K025R255l6043k752J4598K517k1395j7922J0339j2377J4466
6665i933L0993L9323k3506n1264j1898k1632J9249J4339M540J6828q515n724K892
6652d308k6619k3716K8517J6829l6979j3011r637L8486M0194L5237J0370l6258
6640A9105m8249p438j9456k1418L7463M6403O484k1714m1288j1682k996L8907
6628b5879K218k9179j9280K7461J212K1128J3266J5969J3864J3455j7384k1277
6616d426k0878P822J9677m310L0085N5369J5789j8644l9802K9044M2358R5772
$$ plain form
6604 207856 349568 454851 393864 263765 179450 136311 70314 44815 50807 46842 53289 57616
6592 57616 60552 48528 60045 56634 43929 44359 33790 23044 14999 -14667 -41248 -56362 -39508
6579 -39508 -18254 11023 25450 64737 68336 50520 33220 -4464 -11781 1093 -26330 -44518
6567 -44518 -17322 -12179 -9479 -29287 -63607 -71788 -59194 -5234 11505 13483 10632 29816 14719
6554 14719 -36655 -25478 -21922 -18511 -18193 -15719 -16334 -18008 -30943 -7067 23710 -1515 -15708
6541 -15708 -23787 -23631 -5985 -25636 -20355 -6891 9981 12315 3909 -6251 -17046 -6141 25026
6528 25026 28240 20151 -26662 -38567 -43229 -41650 -6635 16149 -9606 3293 5605 -10932 -35708
6515 -35708 -31722 -10173 -8471 -24147 -29732 -35519 9600 24585 11120 3502 -15837 -41433 -43780
$$ packed form
6604B07856J41712J05283o0987j30099q4315m3139o5997k5499N992l965O447M327
6592E7616K936j2024J1517l411j2705M30j0569j0746q045k9666k6581j5114J6854
6579c9508K1254K9277J4427L9287L599j7816j7300l7684p317J2874k7423j8188
6567d4518K7196N143K700j9808l4320q181J2594N3960J6739J978k851J9184j5097
6554A4719n1374J1177L556L411L18K474o15j674j2935K3876L0777k5225j4193
6541a5708q079J56J7646j9651N281J3464J6872K334q406j0160j0795J0905L1167
6528B5026L214q089m6813j1905m662J579L5015K2784k5755J2899K312j6537k4776
6515c5708L986K1549J702j5676n585n787M5119J4985j3465p618j9339k5596k347
$$ plain form
6502 -43780 -20260 -33543 -57344 -46229 -51910 -34436 -21059 -17136 -15175 -39131 -38526 -45278 -78935
6489 -78935 -81755 -20540 -8838 -64338 -41229 -26102 -35501 -8234 46860 75224 64524 27427
6477 27427 28964 24739 -21561 -38481 -31591 -66167 -76707 -33131 -20992 502 39165 64752
6465 64752 78549 36184 17402 18670 24761 13694 9143 -21469 -14067 -4013 -888 201 6038
6452 6038 23010 31310 2993 -48335 -57913 -55716 -59112 -38291 -25406 -22457 -39823 -52746 -18566
6439 -18566 -25533 -26466 28111 -12439 -85829 -128470 -114277 -96556 -55017 -17540 -7855 11579 14631
6426 14631 -8218 18485 44870 3935 -22875 -44141 -59525 -51050 -60683 -20760 -4279 12964
6414 12964 -650 10526 23630 21880 7035 -5478 -11450 -55668 -63629 -35739 -1830 18143
$$ packed form
6502d3780K3520j3283k3801J1115n681J7474J3377L923J961k3956O05o752l3657
6489g8935k820O1215J1702n5500K3109J5127r399K7267N5094K8364j0700l7097
6477B7427J537m225m6300j6920O890l4576j0540M3576J2139K1494L8663K5587
6465F4752J3797m2365j8782J268O091j1067m551l0612P402J0054L125J089N837
6452F038J6972Q300k8317n1328r578K197l396K0821J2885K949j7366j2923L4180
6439a8566o967r33N4577m0550p3390m2641J4193J7721M1539L7477R685J9434L052
6426A4631k2849K6703K6385m0935k6810k1266j5384Q475r633L9923J6481J7243
6414A2964j3614J1176J3104j750j4845j2513n972m4218p961K7890L3909J9973
$$ plain form
6402 18143 -8383 -18533 -37246 -57357 -50167 -33331 -9272 -27383 -14707 -2685 8348 4480
6390 4480 -25571 -16847 -13044 -60213 -76397 -67923 -46767 -28303 -16677 -51422 -72065 -99874 -63145
6377 -63145 -34293 -2183 25249 20465 -2078 2966 19637 25275 6038 -18134 -9426 -5396 -24404
6364 -24404 -26011 -22170 7939 -8452 -25607 15428 27233 41646 56420 33252 -14997 -26212
6352 -26212 4491 22741 38636 32873 19385 3170 14300 52276 88113 82113 65549 68714
6340 68714 48216 12781 -8378 -13945 -20222 -37491 -36753 -49117 -30067 13107 -3918 -59786 -87913
6327 -87913 -88213 -68584 -95274 -100128 -74345 -73991 -42752 18091 14097 13284 15957 1331 387 -33552
6313 -33552 -48980 -63395 -63584 -54087 -38666 -38202 -4017 7407 -13944 -10065 -8845 2184 5634
$$ packed form
6402A8143k6526j0150j8713k0111P190J6836K4059j8111J2676J2022J1033l868
6390D480l0051Q724L803m7169j6184Q474K1156J8464J1626l4745k0643k7809L6729
6377f3145K8852L2110K7432m784k2543N044J6671N638j9237k4172Q708M030j9008
6364b4404j607L841L0109j6391j7155M1035J1805J4413J4774k3168m8249j1215
6352b6212L0703J8250J5895n763j3488j6215J1130L7976L5837o000j6564L165
6340F8714k0498l5435k1159n567o277j7269P38j2364J9050M3174j7025n5868k8127
6327h7913l00J9629k6690m854K5783L54L1239O0843l994q13K673j4626r44l3939
6313c3552j5428j4415j89R497J5421M64L4185J1424k1351L879J220J1029L450
$$ plain form
6300 5634 -25606 -37575 -9902 -153 -34942 -38613 -20345 -35359 -45967 -27366 6904 18767
6288 18767 20510 20913 12597 7733 2438 -16862 -15275 -32402 -38600 -33031 1343 -3831 13608 5532
6274 5532 -19667 -22947 2554 24491 1744 -50943 -24228 -784 -25682 -3983 1353 -2467 15768
6261 15768 -15111 -38315 -47193 -54508 -33866 -28996 -42948 -36497 -19093 -33062 -42207 -39601 -12892
6248 -12892 26767 47469 45319 25498 18886 -22289 -31216 -33951 -2806 8935 -11394 -27455 -1545
6235 -1545 -759 18777 44780 22447 -1836 3718 -8858 -22019 -28826 -17038 -9000 -26072 -26696
6222 -26696 14564 -1876 -20222 15374 -37862 -54033 -34096 -66933 -73722 -46222 -47819 -35746
6210 -35746 -40666 1817 36183 6374 -5780 18667 41049 3871 -42465 -31405 -31203 -26613 -36610
$$ packed form
6300E634l1240j1969K7673R749l4789l671J8268j5014j0608J8601L4270J1863
6288A8767J743M03q316m864n295j9300J587j7127o198N569L4374n174J7439q076
6274E532k5199l280K5501K1937k2747n2687K6715K3444k4898K1699N336l820J8235
6261A5768l0879k3204q878p315K0642M870j3952O451J7404j3969r145K606K6709
6248a2892L9659K0702k150j9821o612m1175q927k735L1145J1741k0329j6061K5910
6235a545P86J9536K6003k2333k4283N554j2576j3161o807J1788Q038j7072o24
6222b6696M1260j6440j8346L5596n3236j6171J9937l2837o789K7500j597J2073
6210c5746m920M2483L4366k9809j2154K4447K2382l7178m6336J1060K02M590r997
$$ plain form
6197 -36610 -48713 -49887 -47151 -36624 -15074 -11545 12670 -15487 -35256 -23596 -11420 -16064 -25207
6184 -25207 -18619 10713 35513 34165 -13353 -24237 -23538 -42382 -39487 -45117 -39663 -23259 -29818
6171 -29818 6089 13985 -34097 -33827 -24597 11570 40262 34919 18459 -13519 -41195 -31317 -11709
6158 -11709 23499 52761 21671 -11751 -46311 -83386 -64124 -39274 -37578 -51714 -51346 -41909 -17658
6145 -17658 -2417 -9143 -17857 -48508 -73919 -53291 -55071 -53664 -15355 -28219 -49032 -34445 -19805
6132 -19805 -23443 -13579 2766 27245 33236 50814 58610 32716 14768 3124 -31785 -51484 -35504
6119 -35504 8463 22776 34173 51160 27947 11048 16707 29153 47566 39917 41427 25654
6107 25654 -1679 -11617 -27804 -43578 -47638 -9531 19610 -8380 -59037 -66444 -17074 -12407 -15322
$$ packed form
6197c6610j2103j174K736J0527K1550L529K4215k8157j9769J1660J2176m644r143
6184b5207O588K9332K4800j348m7518j0884O99j8844K895n630N454J6404o559
6171b9818L5907P896m8082K70R230L6167K8692n343j6460l1978k7676R878J9608
6158a1709L5208K9262l1090l3422l4560l7075J9262K4850J696j4136L68R437K4251
6145a7658J5241o726q714l0651k5411K0628j780J407L8309j2864k0813J4587J4640
6132a9805l638R864J6345K4479N991J7578P796k5894j7948j1644l4909j9699J5980
6119c5504M3967J4313J1397J6987k3213j6899N659J2446J8413p649J510j5773
6107B5654k7333r938j6187j5774m060L8107K9141k7990n0657p407M9370M667k915
$$ plain form
6094 -15322 3757 -19858 -28766 -46878 -44081 -38734 -17669 11168 9302 -9834 -31757 -9386 -688
6081 -688 5637 -4479 -2979 -4246 -33120 -42351 -27671 -14738 21106 37677 31994 5049 -36150
6068 -36150 -44845 -13634 17658 16101 -8547 -37734 -24970 2636 1114 -23651 -36017 -59963
6056 -59963 -87637 -83630 -85961 -67463 -69947 -44335 -25969 -52871 -37743 -7684 -7024 -18325 1406
6043 1406 6220 -24564 -32888 -31988 -43298 -58104 -58201 -14752 -24155 -38433 -25238 -7172 -2609 26936
6029 26936 27605 24063 39433 37015 23970 1325 -8124 11754 -13515 -17404 -22185 -13233 -23240
6016 -23240 -37874 -25557 -26507 -25026 -37112 -35412 1629 3245 14886 2128 5298 17356 -3915
6003 -3915 854 31874 54005 38674 5889 -12297 -15327 30150 11877 -2704 37558 44677 23756
$$ packed form
6094a5322J9079k3615q908j8112K797N347K1065K8837j866j9136k1923K2371Q698
6081f88O325j0116J500j267k8874r231J4680J2933L5844J6571n683k6945m1199
6068c6150q695L1211L1292j557k4648k9187J2764K7606j522k4765j2366k3946
6056e9963k7674M007k331J8498k484K5612J8366k6902J5128L0059O60j1301J9731
6043A406M814l0784q324R00j1310j4806r7M3449r403j4278J3195J8066M563K9545
6029B6936O69l542J5370k418j3045k2645r449J9878k5269l889m781Q952j0007
6016b3240j4634J2317r50J481j2086J700L7041J616J1641j2758L170J2058k1271
6003c915M769L1020K2131j5331l2785j8186l030M5477j8273j4581M0262P119k0921
$$ plain form
5990 23756 -9998 -11228 -33027 -35378 -53706 -41410 4899 -27246 -21245 -4919 -17916 -13627 -35493
5977 -35493 -52757 -23992 -18416 2831 19100 23375 33562 21784 8438 21612 19561 8102
5965 8102 -10117 -10965 -20930 -12339 20327 12113 17562 27964 17514 -14102 -786 16256 26151
5952 26151 7950 -2511 -8728 14594 18376 -5226 -28203 -41694 -46403 -25827 -29147 -45146 -42226
5939 -42226 -6751 -368 -22676 -43833 -56368 -47765 -28306 -19772 -18836 -31874 -47116 -25968 -29391
5926 -29391 -32039 3458 17855 5880 4056 27142 14475 2551 2977 -59272 -49637 -19344 -25023
5913 -25023 -60111 -61195 -65815 -48000 -44207 -24320 -9856 -25886 -17873 -20594 -28304 -12465 -9982
5900 -9982 -33618 -59075 -61871 -46430 -30534 -13679 -19765 -57740 -57228 -27796 933 18725 -10631
$$ packed form
5990B3756l3754j230k1799k351j8328J2296M6309l2145O001J6326j2997M289k1866
5977c5493j7264K8765N576K1247J6269M275J0187j1778j3346J3174k051j1459
5965H102j8219q48r965Q591L2666q214N449J0402j0450l1616J3316J7042R895
5952B6151j8201j0461o217K3322L782k3602k2977j3491m709K0576l320j5999K920
5939d2226L5475O383k2308k1157j2535Q603J9459Q534R36j3038j5242K1148l423
5926b9391k648L5497J4397j1975j824K3086j2667j1924M26o2249R635L0293n679
5913b5023l5088j084m620J7815L793J9887J4464j6030Q013k721p710J5839K483
5900i982k3636k5457k796J5441J5896J6855o086l7975N12K9432K8729J7792k9356
$$ plain form
5887 -10631 -53910 -37126 -39900 -69818 -68613 -76190 -104778 -111084 -83698 -105419 -86316 -34310 -5018
5874 -5018 -12115 6330 4798 -8722 -7853 9241 22436 30362 26358 54709 2303 -47786 -19766
5861 -19766 -2035 -11777 703 -9415 -30296 13175 29535 8667 -30359 -40343 -21668 -26940
5849 -26940 -17051 -32430 -32555 -20281 -7990 -22940 -30495 -1272 -221 -26391 -6314 38784 23404
5836 23404 -58203 -72417 -46269 -31380 -10144 -55021 -71275 -40494 -15512 8838 -4074 -14798
5824 -14798 -31716 -48383 -45154 -7226 -29294 -30638 -51875 -67608 -59922 -67219 -72225 -87219 -78715
5811 -78715 -66581 -26468 -38994 -7366 30293 14692 -4331 4707 -16043 -3891 -24664 -23337
5799 -23337 11879 6285 -18946 -32151 -22515 -21443 7484 19791 17312 35927 41062 29618 27755
$$ packed form
5887a0631m3279J6784k774k9918J205p577k8588o306K7386k1721J9103N2006K9292
5874e018p097J8445j532j3520Q69J7094J3195P926m004K8351n2406n0089K8020
5861a9766J7731r742J2480j0118k0881M3471J6360k0868l9026r984J8675n272
5849b6940R889j5379j25J2274J2291j4950p555K9223J051k6170K0077M5098j5380
5836B3404q1607j4214K6148J4889K1236m4877j6254L0781K4982K4350j2912j0724
5824a4798j6918j6667L229L7928k2068j344k1237j5733P686p297n006j4994Q504
5811g8715J2134M0113j2526L1628L7659j5601j9023R038k0750J2152k0773J327
5799b3337L5216n594k5231j3205R636J072K8927J2307k479J8615N135j1444j863
$$ plain form
5786 27755 14484 10744 5773 -2204 24442 42173 20184 -7201 -23612 -10218 -18721 -52032 -30216
5773 -30216 -14818 -2139 20233 55342 71681 40195 -186 -37078 -42908 -51690 -58266 -59503 -48878
5760 -48878 -35783 -59249 -55694 -60723 -53337 -27747 -19886 2154 -7792 -33799 -44608 -41137 -19721
5747 -19721 29597 41740 37496 20933 8318 17977 8815 31894 45312 80305 72817 18995 -23451
5734 -23451 -61607 -47969 -24675 7373 35949 37547 39804 25415 -9463 8454 2502 -19610
5722 -19610 -13477 -19894 -32657 -15687 40117 68728 63241 3403 -28247 -21660 -12003 9575 21689
5709 21689 2903 12481 31299 29280 34645 30860 5531 -6158 -32760 -13827 19968 18541 22853
5696 22853 10961 17985 8852 22277 2869 -11557 -18991 -26511 -1935 -5779 -7722 46067 41935
$$ packed form
5786B7755j3271l740m971p977K6646J7731k1989k7385j6411J3394q503l3311K1816
5773c0216J5398J2679K2372L5109J6339l1486m0381l6892n830q782o576j237J0625
5760d8878J3095k3466L555n029P386K5590P861K2040r946k6007j0809L471K1416
5747a9721M9318J2143m244j6563j2615R659r162K3079J3418L4993p488n3822m2446
5734b3451l8156J3638K3294L2048K8576J598K257j4389l4878J7917n952k2112
5722a9610O133o417j2763J6970N5804K8611n487n9838l1650O587R657K1578J2114
5709B1689j8786R578J8818k019N365l785k5329j1689k6602J8933L3795j427M312
5696B2853j1892P024r133J3425j9408j4426p434p520K4576l844j943N3789m132
$$ plain form
5683 41935 20336 -2379 19605 21388 4092 17387 6890 -11789 -28891 -29738 -40321 -9384
5671 -9384 39213 71427 66047 48400 54063 48175 12108 5685 -7421 -19520 -13889 147 2987
5658 2987 1633 -3 30099 48754 38395 29184 59355 23357 1731 7501 -5867 -20546 -3862
5645 -3862 -5939 10563 3330 740 5386 29848 39530 43502 57157 32581 10878 4130 16407
5632 16407 3521 16321 33348 -4255 -37867 -19010 -6080 24638 42515 56223 -1401 -21967
5620 -21967 -10546 3684 -10855 -14673 -21062 15606 1434 -21112 -12041 29951 17995 -29910
5608 -29910 -25900 6646 25930 15805 21056 -20748 -29436 -8087 -5120 -27569 -63516 -17518 -17201
5595 -17201 -18823 -17243 -25687 -2881 32273 58155 60795 47353 1202 -12114 19983 26676 8076
$$ packed form
5683D1935k1599k2715K1984J783j7296J3295j0497j8679j7102q47j0583L0937
5671i384M8597L2214n380j7647N663n888l6067o423j3106j2099N631J4036K840
5658B987j354j636L0102J8655j0359r211L0171l5998k1626N770j3368j4679J6684
5645c862k077J6502p233k590M646K4462R682L972J3655k4576k1703o748J2277
5632A6407j2886J2800J7027l7603l3612J8857J2930L0718J7877J3708n7624k0566
5620b1967J1421J4230j4539l818o389L6668j4172k2546R071M1992j1956m7905
5608b9910M010L2546J9284j0125N251m1804q688K1349K967k2449l5947M5998L17
5595a7201j622J580q444K2806L5154K5882K640j3442m6151j3316L2097O693j8600
$$ plain form
5582 8076 -43812 -31797 -36978 -69062 -69879 -45074 -27115 -14444 -4058 -11631 -35786 -27891 -29229
5569 -29229 -38615 -50417 -29411 -7776 -8347 -21496 -54344 -53013 -36378 280 43841 19514 8199
5556 8199 2136 -15183 -31452 -23915 -25947 6063 15128 -6493 -16024 -26120 -16088 9307 23209
5543 23209 8104 -14850 -48268 -53267 -22013 -21896 -6856 -17326 -44445 -17549 21553 29267 13180
5530 13180 37364 35614 1002 -20896 17467 46537 45137 14390 10236 -8175 -43057 -43582 -50406
5517 -50406 -50558 -50905 -50065 -51989 -64590 -65307 -50104 -48390 -18295 814 -25193 -20754 -37390 -66760
5503 -66760 -37061 -49515 -39005 6538 -30675 -45325 -45192 6255 8295 14146 17199 12568 27215
5490 27215 20289 -9691 7432 7977 -4419 468 45653 15216 -29494 -30258 -33261 -8099 -5966
$$ packed form
5582H076n1888J2015n181l2084q17K4805J7959J2671J0386p573k4155P895j338
5569b9229r386j1802K1006K1635n71j3149l2848J331J6635L6658M3561k4327j1315
5556H199o063j7319j6269P537k032L2010R065k1621r531j0096J0032K5395J3902
5543B3209j5105k2954l3418m999L1254J17J5040j0470k7119K6896L9102P714j6087
5530A3180K4184j750l4612k1898L8363K9070j400l0747m154j8411l4882n25o824
5517e0406j52l47Q40j924j2601p17J5203J714L0095J9109k6007M439j6636k9370
5503f6760K9699j2454J0510M5543l7213j4650J33N1447K040N851L053m631J4647
5490B7215o926k9980J7123N45j2396M887M5185l0437m4710p64l003K5162K133
$$ plain form
5477 -5966 -30635 -35288 -7134 -11652 8584 15742 23329 31799 58548 14978 2710 7453 -2789
5464 -2789 9261 26338 15823 21450 3244 2071 -20885 -45150 -67729 -81979 -64153 -43060
5452 -43060 -39157 -7406 35685 16353 769 13681 20071 25756 -10769 -17536 -16283 -35056 -17238
5439 -17238 -12421 6649 -17325 -53700 -54597 -55769 -29383 -12444 -10887 -13696 5656 19788 22149
5426 22149 8396 -21282 -9409 -25733 -18305 -31480 -28321 -30462 -39191 -65668 -80988 -70891 -45923
5413 -45923 -40460 -25479 -13727 -18067 -104 29122 19796 -8288 -24602 -9648 -19972 -20445 -2699
5400 -2699 -7434 -20925 -29240 -24448 -2294 4966 17286 23024 13024 -20521 -47190 -51874 -18106
5387 -18106 -9189 4540 -15555 -7516 15921 28359 -11859 -18661 -1788 -8382 -26505 -27678 -15080
$$ packed form
5477e966k4669m653K8154m518K0236P158P587Q470K6749m3570j2268M743j0242
5464b789J2050J7077j0515N627j8206j173k2956k4265k2579j4250J7826K1093
5452d3060L903L1751M3091j9332j5584J2912O390N685l6525o767J253j8773J7818
5439a7238M817J9070k3974l6375q97j172K6386J6939J557k809J9352J4132K361
5426B2149j3753k9678J1873j6324P428j3175L159k141q729k6477j5320J0097K4968
5413d5923N463J4981J1752m340J7963K9226r326k8084j6314J4954j0324m73J7746
5400b699m735j3491q315M792K2154P260J2320N738j0000l3545k6669m684L3768
5387a8106Q917J3729k0095Q039K3437J2438m0218o802J6873o594j8123j173J2598
$$ plain form
5374 -15080 -9649 -19392 -9140 -9869 -48158 -67321 -56402 -58349 -71103 -44165 -5939 20352 2699
5361 2699 -5969 -32517 -55460 -17560 14332 -15216 -37306 -49111 -15907 18084 40494 17579
5349 17579 6342 12806 43370 37499 10944 15658 -5083 -13062 12634 18115 9156 6127 14535
5336 14535 1698 -14789 -1657 6712 -630 -20093 -6503 3638 -17627 -31172 -34274 -28116 -64684
5323 -64684 -69198 -75038 -61862 -31300 -10093 28137 29453 14935 8563 5158 -24976 -59449 -44090
5310 -44090 -35969 -41915 -82271 -86251 -44357 -23545 1052 -6275 -21528 -7506 -43036 -57725 -69980
5297 -69980 -52245 -55207 -64169 -66757 379 26527 -11745 -23223 -12708 -28361 -46357 -32118
5285 -32118 -24069 -207 13675 21068 -31743 -34807 -14416 24216 54866 61933 37179 -20308 -56358
$$ packed form
5374a5080N431r743J0252p29l8289j9163J0919j947j2754K6938L8226K6291j7653
5361B699q668k6548k2943L7900L1892k9548k2090j1805L3204L3991K2410k2915
5349A7579j1237O464L0564n871k6555M714k0741p979K5696N481q959l029Q408
5336A4535j2837j6487J3132Q369p342j9463J3590J0141k1265j3545l102O158l6568
5323f4684m514n840J3176L0562K1207L8230J316j4518o372l405l0134l4473J5359
5310d4090Q121n946m0356l980M1894K0812K4597p327j5253J4022l5530j4689j2255
5297f9980J7735k962q962k588O7136K6148l8272j1478J0515j5653j7996J4239
5285c2118Q049K3862J3882P393n2811l064K0391L8632L0650P067k4754n7487l6050
$$ plain form
5272 -56358 -24792 -6812 24240 53722 41358 -8645 -23199 -10293 -18114 -38537 -57758 -68478
5260 -68478 -16848 33297 35794 13815 -12360 -25909 11932 33062 37413 18050 28537 18325
5248 18325 -16388 -17563 -8019 -12564 -18830 35661 52911 20149 16842 13190 29085 57348 35796
5235 35796 -17601 -25606 -2883 15947 13315 44728 34209 27613 46476 65790 41439 21175
5223 21175 -33345 -75733 -38972 -33757 -31765 -32141 -38505 -6571 -32577 -31810 -31038 -15944 12442 -18845
5209 -18845 -30116 -23298 -7292 -9051 -19278 -29165 4370 39175 45034 31983 14483 21498 13521
5196 13521 -23803 -38197 -27165 -37141 -20238 -23251 -1190 31645 30299 25124 5647 -8290 9838
5183 9838 9043 13581 60265 78705 76281 58256 61684 66991 37201 13960 44046 9944 24685
$$ packed form
5272e6358L1566J7980L1052K9482j2364n0003j4554J2906p821k0423j9221j0720
5260f8478N1630N0145K497k1979k6175j3549L7841K1130M351j9363J0487j0212
5248A8325l4713j175R544m545o266N4491J7250l2762l307l652J5895K8263k1552
5235C5796n3397q005K2723J8830k632L1413j0519o596J8863J9314k4351k0264
5223B1175n4520m2388L6761N215J992l76o364L1934k6006P67P72J5094K8386l1287
5209a8845j1271O818J6006j759j0227r887L3535L4805N859j3051j7500P015p977
5196A3521l7324j4394J1032r976J6903l013K2061L2835j346n175j9477j3937J8128
5183I838p95M538M6684J8440k424j8025L428N307k9790k3241L0086l4102J4741
$$ plain form
5170 24685 43383 39143 16152 -35224 -51812 -43090 -48378 -47154 -13500 -3199 9403 -6440 -22902
5157 -22902 -3465 -49677 -49439 -21421 9605 34843 12083 16729 -7436 -17415 -42755 -42371 -49838
5144 -49838 -13181 7915 -31114 -49786 -53879 -52427 -49508 -39940 -31438 -29875 -18136 -36164 -42529
5131 -42529 1813 4829 -26140 -10872 -2294 -3816 -5443 11662 36667 27513 10394 897 3114
5118 3114 1762 32047 36635 -7123 -44565 -32850 -24741 -17357 7264 -13444 11151 3450 -11087
5105 -11087 1688 -29041 -40216 1723 77036 75764 54725 42294 25826 16784 22050 -5537
5093 -5537 -39212 -62343 -69268 -58291 -71719 -71876 -47035 -24678 -14655 -26917 -34489 -8435 9633
5080 9633 3010 7146 -33205 -41679 -21892 -21884 -29059 -38988 -13945 113 -3601 16087 10576 -26648
$$ packed form
5170B4685J8698m240k2991n1376j6588Q722n288J224L3654J0301J2602j5843j6462
5157b2902J9437m6212K38K8018L1026K5238k2760M646k4165r979k5340L84p467
5144d9838L6657K1096l9029j8672m093J452K919R568Q502J563J1739j8028o365
5131d2529M4342L016l0969J5268Q578j522j627J7105K5005r154j7119r497K217
5118C114j352L0285M588m3758l7442J1715Q109P384K4621k0708K4595p701j4537
5105a1087J2775l0729j1175M1939P5313j272k1039j2431j6468r042N266k7587
5093e537l3675k3131o925J0977j3428j57K4841K2357J0023j2262p572K6054J8068
5080I633o623M136m0351q474J9787Qp175r929K5043J4058l714J9688n511l7224
$$ plain form
5066 -26648 -4062 9630 25949 18040 17864 -7749 -8970 -5022 7894 18034 9612 1254 -36695
5053 -36695 -19499 -15871 2492 19661 7917 2596 -6256 -2013 -3599 11381 23570 20990 14052
5040 14052 4019 -14677 -4709 -14745 18070 33453 22396 3705 -4119 9768 31501 23413
5028 23413 4442 -13881 -40044 -48790 -63476 -56790 -54091 -80932 -90979 -62984 -47312 -6476
5016 -6476 17039 -10457 -12828 -4572 -3122 -17207 -1868 -3265 -13424 -2959 -4345 -36025 -62208
$$ packed form
5066b6648K2586J3692J6319p909j76k5613j221L948J2916J0140q422q358l7949
5053c6695J7196L628J8363J7169j1744n321q852M243j586J4980J2189k580o938
5040A4052j0033j8696R968j0036L2815J5383j1057j8691p824J3887K1733q088
5028B3413j8971j8323k6163q746j4686O686K699k6841j0047K7995J5672M0836
5016f476K3515k7496k371Q256J450j4085J5339j397j0159J0465j386l1680k6183
$$ [...]
##END NTUPLES=NMR SPECTRUM
##END=
