##TITLE=Analysis number 324752
Compound Code mo 00946
Book Reference 451/189
Project Code adrs
Chemist Name evam
##JCAMPDX= 6.0         $$ Bruker NMR JCAMP-DX V2.0
##DATA TYPE= NMR SPECTRUM
##DATA CLASS= NTUPLES
##ORIGIN= Bruker BioSpin GmbH
##OWNER= nmr
$$ XWIN-NMR		Version 3.5
$$ Thu Nov 30 08:47:37 2006 GMT Standard Time (UT+0h)  MAYBRIDGE\nmr@NMR_250MHZ
##.OBSERVE FREQUENCY= 250.131544655141
##.OBSERVE NUCLEUS= ^1H
##.ACQUISITION MODE= SIMULTANEOUS (DQD)
##.ACQUISITION SCHEME= undefined
##.AVERAGES= 16
##.DIGITISER RES= 18
##SPECTROMETER/DATA SYSTEM= dpx250
##.PULSE SEQUENCE= zg30
##.SOLVENT NAME= CDCl3
##.SHIFT REFERENCE= (INTERNAL, CDCl3, 0, 16.522)
##AUDIT TRAIL= $$ (NUMBER, WHEN, WHO, WHERE, WHAT)
$$ ##TITLE= Audit trail, XWIN-NMR		Version 3.5
$$ ##JCAMPDX= 5.01
$$ ##ORIGIN= Bruker BioSpin GmbH
$$ ##OWNER= nmr
$$ C:\u/data/dgb/nmr/ADRS/1460/pdata/1/auditp.txt
$$ ##AUDIT TRAIL=  $$ (NUMBER, WHEN, WHO, WHERE, WHAT)
(   1,<2006-11-30 08:46:53.99 +000>,<MAYBRIDGE\nmr>,<NMR_250MHZ>,
      <created by zg, POWCHK disabled, PULCHK disabled
       configuration hash MD5:
       49 4B E0 1D 92 C2 6B 37 9F E6 65 BC 52 41 86 1D
       data hash MD5: 64K
       6B 6B BC 1F 38 CB B6 F7 7B 17 87 3A 9E 22 07 24>)
(   2,<2006-11-30 08:47:19.03 +000>,<MAYBRIDGE\nmr>,<NMR_250MHZ>,
      <Start of raw data processing
       ef LB = 0.3 FT_mod = 6 PKNL = 1 SI = 32K 
       data hash MD5: 32K
       10 47 A4 32 2C 00 CF 2E F3 CC 32 42 D4 E6 B4 2B>)
(   3,<2006-11-30 08:47:21.58 +000>,<MAYBRIDGE\nmr>,<NMR_250MHZ>,
      <apk 
       data hash MD5: 32K
       A5 A6 9A 76 46 E2 E5 59 CC 49 A6 38 64 A5 7C 93>)
(   4,<2006-11-30 08:47:22.50 +000>,<MAYBRIDGE\nmr>,<NMR_250MHZ>,
      <abs ABSG = 5 
       data hash MD5: 32K
       98 BF F1 85 5A 4F 0B DC 28 8A D9 DC 5F DF C0 8F>)
$$ ##END=
$$ 
$$ hash MD5
$$ 9B 50 EE 38 E6 29 81 70 A4 CF A7 98 7F 30 5F C6
##$RELAX= 
##$RELAX= 
##$RELAX= 
##$RELAX= 
##$RELAX= 
##$RELAX= 
##$RELAX= 
$$ Bruker specific parameters
$$ --------------------------
##$DU= <C:\u>
##$EXPNO= 1460
##$NAME= <ADRS>
##$PROCNO= 1
##$TYPE= <nmr>
##$USER= <dgb>
##$AMP= (0..31)
100 100 100 100 100 100 100 100 100 100 100 100 100 100 100 100 100 100 
100 100 100 100 100 100 100 100 100 100 100 100 100 100 
##$AQSEQ= 0
##$AQ_mod= 3
##$AUNM= <au_zg>
##$AUTOPOS= <2 >
##$BF1= 250.13
##$BF2= 250.13
##$BF3= 250.13
##$BF4= 250.13
##$BF5= 500.13
##$BF6= 500.13
##$BF7= 500.13
##$BF8= 500.13
##$BYTORDA= 1
##$CFDGTYP= 0
##$CFRGTYP= 5
##$CHEMSTR= <none>
##$CNST= (0..31)
1 1 145 1 1 1 1 1 1 1 1 1 1 1 1 1 1 1 1 1 1 1 1 1 1 1 1 1 1 1 1 1 
##$CPDPRG= <>
##$CPDPRG1= <>
##$CPDPRG2= <>
##$CPDPRG3= <>
##$CPDPRG4= <mlev>
##$CPDPRG5= <mlev>
##$CPDPRG6= <mlev>
##$CPDPRG7= <mlev>
##$CPDPRG8= <mlev>
##$CPDPRGB= <>
##$CPDPRGT= <>
##$D= (0..31)
0 1 0 0 0 0 0 0 0 0.06 0 0 0 0 0 0 0.0002 0 0 0 0 0 0 0 0 0 0 0 0 0 0 
0 
##$DATE= 1164876404
##$DBL= (0..7)
120 120 120 120 120 120 120 120 
##$DBP= (0..7)
150 150 150 150 150 150 150 150 
##$DBP07= 0
##$DBPNAM0= <>
##$DBPNAM1= <>
$$ [...]
##$SUBNAM7= <"">
##$SUBNAM8= <"">
##$SUBNAM9= <"">
##$SW= 20.6930455092707
##$SWIBOX= (0..15)
0 0 3 0 0 0 0 0 0 0 0 0 0 0 0 0 
##$SW_h= 5175.983436853
##$TD= 65536
##$TD0= 1
##$TE= 294.16
##$TE2= 300
##$TE3= 300
##$TEG= 300
##$TL= (0..7)
0 120 120 120 120 120 120 120 
##$TP= (0..7)
150 150 150 150 150 150 150 150 
##$TP07= 0
##$TPNAME0= <>
##$TPNAME1= <>
##$TPNAME2= <>
##$TPNAME3= <>
##$TPNAME4= <>
##$TPNAME5= <>
##$TPNAME6= <>
##$TPNAME7= <>
##$TPOAL= (0..7)
0.5 0.5 0.5 0.5 0.5 0.5 0.5 0.5 
##$TPOFFS= (0..7)
0 0 0 0 0 0 0 0 
##$TUNHIN= 0
##$TUNHOUT= 0
##$TUNXOUT= 0
##$USERA1= <user>
##$USERA2= <user>
##$USERA3= <user>
##$USERA4= <user>
##$USERA5= <user>
##$V9= 5
##$VALIST= <valist>
##$VCLIST= <CCCCCCCCCCCCCCC>
##$VD= 0
##$VDLIST= <DDDDDDDDDDDDDDD>
##$VPLIST= <PPPPPPPPPPPPPPP>
##$VTLIST= <TTTTTTTTTTTTTTT>
##$WBST= 1024
##$WBSW= 4
##$XGAIN= (0..3)
0 0 0 0 
##$XL= 0
##$YL= 0
##$YMAX_a= 240955
##$YMIN_a= -287530
##$ZGOPTNS= <>
##$ZL1= 120
##$ZL2= 120
##$ZL3= 120
##$ZL4= 120
##$ABSF1= 16.522
##$ABSF2= -4.171173
##$ABSG= 5
##$ABSL= 3
##$ALPHA= 0
##$AQORDER= 0
##$ASSFAC= 0
##$ASSFACI= 0
##$ASSFACX= 0
##$ASSWID= 0
##$AUNMP= <proc_1d>
##$AZFE= 0.1
##$AZFW= 0.1
##$BCFW= 0
##$BC_mod= 0
##$BYTORDP= 0
##$COROFFS= 0
##$CY= 12.5
##$DATMOD= 1
##$DC= 0
##$DFILT= <>
##$DTYPP= 0
##$F1P= 14.0000005364418
##$F2P= -0.99999901652339
##$FCOR= 0.5
##$FTSIZE= 32768
##$FT_mod= 6
##$GAMMA= 0
##$GB= 0
##$INTBC= 1
##$INTSCL= 1
##$ISEN= 128
##$LB= 0.3
##$LEV0= 0
##$LPBIN= 0
##$MAXI= 10000
##$MC2= 0
##$MEAN= 0
##$ME_mod= 0
##$MI= 0
##$NCOEF= 0
##$NC_proc= -4
##$NLEV= 6
##$NOISF1= 0
##$NOISF2= 0
##$NSP= 0
##$NTH_PI= 0
##$NZP= 0
##$OFFSET= 16.522
##$PC= 1
##$PHC0= 225.4765
##$PHC1= 10.02761
##$PH_mod= 1
##$PKNL= yes
##$PPARMOD= 0
##$PSCAL= 4
##$PSIGN= 0
##$REVERSE= no
##$SF= 250.13
##$SI= 32768
##$SIGF1= 0
##$SIGF2= 0
##$SINO= 400
##$SIOLD= 32768
##$SREGLST= <1H.CDCl3>
##$SSB= 0
##$STSI= 32768
##$STSR= 0
##$SW_p= 5175.98343685301
##$SYMM= 0
##$S_DEV= 0
##$TDeff= 65536
##$TDoff= 0
##$TI= <Analysis number 999999
Compound Code 99
Book Reference 9
Project Code 9>
##$TILT= no
##$TM1= 0
##$TM2= 0
##$TOPLEV= 0
##$USERP1= <user>
##$USERP2= <user>
##$USERP3= <user>
##$USERP4= <user>
##$USERP5= <user>
##$WDW= 1
##$XDIM= 32768
##$YMAX_p= 392832969
##$YMIN_p= -317487
$$ End of Bruker specific parameters
$$ ---------------------------------
##NTUPLES= NMR SPECTRUM
##VAR_NAME=  FREQUENCY,     SPECTRUM/REAL,   SPECTRUM/IMAG
##SYMBOL=    X,             R,               I
##VAR_TYPE=  INDEPENDENT,   DEPENDENT,       DEPENDENT
##VAR_FORM=  AFFN,          ASDF,            ASDF
##VAR_DIM=   32768,         32768,           32768
##UNITS=     HZ,            ARBITRARY UNITS, ARBITRARY UNITS
##FACTOR=    0.157963299565203, 1,           1
##FIRST=     4132.6476996994, 0,             0
##LAST=      -1043.33573715361, 0,           0
##MIN=       -1043.33573715361, -317487,     0
##MAX=       4132.6476996994, 392832969,     0
$$ Real data points
##PAGE= N=1
##DATA TABLE= (X++(R..R)), XYDATA
$$ [...]
$$ plain form
19730 101277 22693 64031 148582 46121 22353 91745 88396 93641 121883 127449 51263 37794
19718 37794 -25127 -5013 103722 135142 147846 106029 34863 72746 -811 95642 221158
19707 221158 130428 -29331 -98913 -108838 -25738 2525 -85518 -61740 -44913 -49400 -35952 33512
19695 33512 119840 31813 39100 12178 74732 144595 124512 135424 50696 -6210 76686 121599
19683 121599 108727 54508 14167 -10804 -51936 -116865 -87799 -61540 -121207 -105903 4421
19672 4421 53058 43124 42543 59688 102747 48631 -110417 -128666 -76892 -71437 -70680 -100433 -136552
19659 -136552 -92892 -38155 18632 43249 82675 163802 188047 104094 62183 -83028 -143564
19648 -143564 -127446 -107725 -55145 -20877 34690 69298 95355 90147 98709 58213 -18615 21159
$$ packed form
19730A01277p8584M1338Q4551j02461k3768O9392l349N245K8242N566p6186j3469
19718C7794o2921K0114J08735L1420J2704m1817p1166L7883p3557R6453J25516
19707B21158r0730j59759o9582r925Q3100K8263q8043K3778J6827m487J3448O9464
19695C3512Q6328q8027P287k6922O2554O9863k0083J0912q4728n6906Q2896M4913
19683A21599j2872n4219m0341k4971m1132o4929K9066K6259n9667J5304J10324
19672D421M8637r934n81J7145M3059n4116j59048j8249N1774N455P57k9753l6119
19659a36552M3660N4737N6787K4617L9426Q1127K4245q3953m1911j45211o0536
19648a43564J6118J9721N2580L4268N5567L4608K6057n208Q562m0496p6828L9774
$$ plain form
19636 21159 41732 -75796 -66578 -77094 -113781 -85448 5503 42084 36499 3043 -39976 -70755
19624 -70755 -46643 -54540 -84008 -94164 27818 74292 146115 142926 38528 -11267 3188 -48060
19612 -48060 -72995 -77276 -15965 42706 88443 100525 37090 14653 -4105 -20388 -147658 -148632
19600 -148632 -40751 29081 6806 -92535 -96129 -85433 -91347 -82428 -119494 -147680 -102721 -29943
19588 -29943 73813 80249 4327 -52280 -59347 -90687 -79459 -126128 -104380 -96784 -161341 -109618
19576 -109618 -84640 -72771 -97176 -101070 -109644 -124235 -71640 212 52296 70947 18957 -101046
19564 -101046 -131685 -139207 -112391 -96802 -14104 29256 35772 14916 59427 107450 87476 45514
19552 45514 1614 1494 71678 14048 -33251 -90472 -20842 -13338 -58383 -105305 -104281 -4273
$$ packed form
19636B1159K0573j17528R218j0516l6687K8333R0951L6581n585l3456m3019l0779
19624g0755K4112p897k9468j0156J21982M6474P1823l189j04398m9795J4455n1248
19612d8060k4935m281O1311N8671M5737J2082o3435k2437j8758j6283j27270r74
19600a48632J07881O9832k2275r9341l594J0696n914Q919l7066k8186M4959P2778
19588b9943J03756O436p5922n6607p067l1340J1228m6669K1748P596o4557N1723
19576a09618K4978J1869k4405l894q574j4591N2595P1852N2084J8651n1990j20003
19564a01046l0639p522K6816J5589Q2698M3360O516k0856M4511M8023j9974m1962
19552D5514m3900j20P0184n7630m7299n7221O9630P504m5045m6922J024J00008
$$ plain form
19540 -4273 36792 32959 69652 64831 86235 65654 38518 12310 -55430 -111631 -129694 -143754
19528 -143754 -132293 -28735 41372 -5661 -21704 -13541 -44600 32158 55840 17976 30384
19517 30384 -12363 92153 117210 95583 69654 87547 64194 -12032 -33883 -37806 76029
19506 76029 138129 163721 167773 68692 75241 127282 114329 -41663 -59151 -95358 -19418 30578
19494 30578 -34634 -91126 -66618 6369 -17595 -100351 -120557 -14641 41685 85957 129119
19483 129119 95538 122406 112672 97708 73742 86062 61924 -53184 -29784 -19971 -50311 -64047
19471 -64047 -96917 -153341 -176414 -111956 -8502 -23908 -11480 -107379 -141989 -106535 -90960
19460 -90960 17435 58125 50177 146138 130041 25480 -51156 -84586 -7403 36325 58206
$$ packed form
19540d273M1065l833L6693m821K1404k0581k7136k6208o7740n6201j8063j4060
19528a43754J1461J03558P0107m7033j6043Q163l1059P6758K3682l7864J2408
19517C0384m2747J04516K5057k1627k5929J7893k3353p6226k1851l923J13835
19506G6029O2100K5592M052r9081O549N2041j2953j55992j7488l6207P5940M9996
19494C0578o5212n6492K4508P2987k3964q2756k0206J05916N6326M4272M3162
19483A29119l3581K6868r734j4964k3966J2320k4138j15108K3400R813l0340j3736
19471f4047l2870n6424k3073O4458J03454j5406J2428r5899l4610L5454J5575
19460i0960J08395M0690p948R5961j6097j04561p6636l3430P7183M3728K1881
$$ plain form
19449 58206 75232 75730 45929 30120 74111 -18826 31382 109965 94811 40197 51312 41434
19437 41434 96927 59390 17773 -16349 -65787 -160368 -190008 -107333 -39077 -77442 -41508 34518
19425 34518 139251 147863 134428 87329 43123 123674 100139 44597 46985 6494 -70541 -82991
19413 -82991 23114 37379 -717 51603 61825 58866 65469 47687 29075 27244 97179 92352
19401 92352 43738 -57850 -7656 7950 -2270 -44268 -63923 -70441 -15715 66978 138281 120729
19389 120729 43878 -7546 -44841 -5184 66969 146038 147651 125747 97073 68824 104584 77999
19377 77999 87842 155297 149741 69694 27432 -10019 -54824 -101505 -18807 -20883 -23401 37637
19365 37637 51711 -566 -11676 -20454 -35924 59513 69724 -36293 -72012 -16640 -26977 596
$$ packed form
19449E8206J7026M98k9801j5809M3991r2937N0208P8583j5154n4614J1115r878
19437D1434N5493l7537m1617l4122m9438r4581k9640Q2675O8256l8365L5934P6026
19425C4518J04733Q612j3435m7099m4206Q0551k3535n5542K388m0491p7035j2450
19413h2991J06105J4265l8096N2320J0222k959O603j7782j8612j831O9935m827
19401I2352m8614j01588N0194J5606j0220m1998j9655o518N4726Q2693P1303j7552
19389A20729p6851n1424l7295L9657P2153P9069J613k1904k8674k8249L5760k6585
19377G7999R843O7455n556q0047m2262l7451m4805m6681Q2698k076k518O1038
19365C7637J4074n2277j1110q778j5470R5437J0211j06017l5719N5372j0337K7573
$$ plain form
19353 596 47438 86463 91980 52812 5396 5688 -35493 -75293 -120617 -153789 -138450 -82349 -85954
19340 -85954 -104495 -70748 -59657 -46067 38817 46919 76510 124323 108209 146131 199947 160342
19328 160342 70818 83164 8481 37047 103921 115540 29696 -16418 76141 64329 11665
19317 11665 65340 41071 15885 69308 203774 146756 26009 -11481 39556 120317 70610
19306 70610 100789 91558 49897 -6165 -64737 -5637 19410 -38423 -31759 12494 -66558 -48940
19294 -48940 22163 35005 126600 167173 202366 194493 133445 65153 79893 99977 58845 50904
19282 50904 50139 92983 62353 -32151 -72066 -42630 -26597 -20154 -50127 -76640 -8251 -35091
19270 -35091 17654 53410 29440 -40891 -51477 -6501 -41703 -33309 -8890 70230 111303 75909
$$ packed form
19353E96M6842L9025N517l9168m7416K92m1181l9800m5324l3172J5339N6101l605
19340h5954j8541L3747J1091J3590Q4884Q102K9591M7813j6114L7922N3816l9605
19328A60342q9524J2346p4683K8566O6874J1619q5844m6114R2559j1812n2664
19317A1665N3675k4269k5186N3423J34466n7018j20747l7490N1037Q0761m9707
19306G0610L0179r231m1661n6062n8572N9100K5047n7833O664M4253p9052J7618
19294d8940P1103J2842R1595M0573L5193p873o1048o8292J4740K0084m1132p941
19282E0904p65M2844l0630r4504l9915K9436J6033O443k9973k6513O8389k6840
19270c5091N2745L5756k3970p0331j0586M4976l5202Q394K4419P9120M1073l5394
$$ plain form
19258 75909 20735 17874 59568 51798 162355 197983 137609 23487 -107146 -85256 -33298
19247 -33298 51113 32995 -8378 -35422 -46653 -79688 39395 106095 52900 37966 110855
19236 110855 81752 122504 154595 131468 144407 132214 123959 128703 129149 137557 206092 270960
19224 270960 268767 248059 237434 305030 429368 482341 494298 503960 518280 460910 360012
19213 360012 302419 326803 409456 429579 393853 308071 255971 321111 383155 441852 507551
19202 507551 501765 492925 451808 448665 423503 424795 415262 425816 532137 519349 473461 395380
19190 395380 273253 162732 160869 110498 20684 11217 8969 63588 93221 51814 104035 115488
19178 115488 217181 203471 179304 272077 359944 374091 365728 315605 175571 155907 186866
$$ packed form
19258G5909n5174k861M1694p770J10557L5628o0374j14122j30633K1890N1958
19247c3298Q4411j8118m1373k7044j1231l3035J19083O6700n3195j4934P2889
19236A10855k9103M0752L2091k3127J2939j2193q255M744M46Q408O8535O4868
19224B70960k193k0708j0625O7596J24338N2973J1957R662J4320n7370j00898
19213C60012n7593K4384Q2653K0123l5726q5782n2100O5140O2044N8697O5699
19202E07551n786q840m1117l143k5162J292r533J0554J06321j2788m5888p8081
19190C95380j22127j10521j863n0371q9814r467k248N4619K9633m1407N2221J1453
19178A15488J01693j3710k4167R2773Q7867J4147q363n0123j40034j9664L0959
$$ plain form
19167 186866 257439 285884 318755 409217 467606 525599 505808 561624 585939 483461 475532
19156 475532 387398 315688 394043 436786 421986 341747 253010 303972 399807 439074 486301
19145 486301 599716 483744 373341 282812 78592 9722 10324 115594 200048 230029 226963
19134 226963 175934 134625 93376 99835 153021 140979 153581 164769 97406 85757 47746 29488
19122 29488 9216 33861 101213 52882 -24485 -48939 -37416 2854 -10693 22435 44702 145736
19110 145736 194633 182059 172549 131383 -17164 -73263 -107933 -80930 -33922 -21426 -5787
19099 -5787 134140 142235 61310 76741 19348 -57047 -4040 49028 101976 72686 55253 87171
19087 87171 83019 71875 -52320 -85721 -61368 -21106 -5875 -1798 40557 29821 14860 45420
$$ packed form
19167A86866P0573K8445L2871R0462N8389N7993j9791N5816K4315j02478p929
19156D75532q8134p1710P8355M2743j4800q0239q8737N0962R5835L9267M7227
19145D86301J13415j15972j10403r0529k04220o8870O02J05270Q4454K9981l066
19134B26963n1029m1309m1249O459N3186j2042J2602J1188o7363j1649l8011j8258
19122B9488k0272K4645O7352m8331p7367k4454J1523M0270j3547L3128K2267J01034
19110A45736M8897j2574r510m1166j48547n6099l4670K7003M7008J2496J5639
19099e787J39927Q095q0925J5431n7393p6395N3007N3068N2948k9290j7433L1918
19087H7171m152j1144j24195l3401K4353M0262J5231M077M2355j0736j4961L0560
$$ plain form
19075 45420 37439 -34224 -3576 22919 -29064 -13071 23300 106379 108389 90578 62163 -3771
19063 -3771 -95762 -134006 -106210 -27711 32776 112051 128499 144667 118673 36973 26987 78434
19051 78434 62677 58996 23239 89724 130898 123949 57309 -63658 -78500 10602 78942 105127
19039 105127 152960 184315 165238 124349 5568 -13738 13344 33130 40928 69463 62962 83072
19027 83072 103381 65336 70875 121627 80546 28405 48355 70627 52386 19764 -13776 -39135
19015 -39135 24483 34460 58072 -12944 -17446 15842 -5333 51098 36055 70733 54800 139953
19003 139953 145907 64865 12913 21499 16155 -138551 -115659 -12324 3197 29452 75590 121370
18991 121370 80024 75684 34168 24288 73059 20846 -20348 49294 118103 187699 125805 104025
$$ packed form
19075D5420p981p1663L0648K6495n1983J5993L6371Q3079K010j7811k8415o5934
19063c771r1991l8244K7796P8499O0487P9275J6448J6168k5994q1700r986N1447
19051G8434j5757l681l5757O6485M1174o949o6640j20967j4842Q9102O8340K6185
19039A05127M7833L1355j9077m0889j18781j9306K7082J9786P798K8535o501K0110
19027H3072K0309l8045N539N0752m1081n2141J9950K2272j8241l2622l3540k5359
19015c9135O3618R977K3612p1016m502L3288k1175N6431j5043L4678j5933Q5153
19003A39953N954q1042n1952Q586n344j54706K2892J03335J5521K6255M6138M5780
18991A21370m1346m340m1516r880M8771n2213m1194O9642O8809O9596o1894k1780
$$ plain form
18979 104025 26269 -21434 -23022 4127 -47676 -132 -13822 -2617 -33793 72167 154377
18968 154377 139031 70615 39350 45119 87750 50321 60383 69660 13528 24361 62772 17663
18956 17663 -26321 -61324 -27572 -35048 -9531 35913 37405 92265 73887 39596 49307 157069
18944 157069 348592 359655 196284 124648 170909 271443 261446 185136 190640 261076 283438
18933 283438 183322 56727 68272 151839 139397 153236 247415 361385 431807 359602 320667
18922 320667 316922 230287 187590 212141 129576 97063 120474 166725 109328 83496 50446 24881
18910 24881 94446 50558 60601 59572 40985 63116 16638 42927 74929 102114 74633 46477
18898 46477 109011 180741 244700 254807 206047 188172 259904 316414 311439 336188 262845 80669
$$ packed form
18979A04025p7756m7703j588K7149n1803M7544j3690J1205l1176J05960Q2210
18968A54377j5346o8416l1265N769M2631l7429J0062R277n6132J0833L8411m5109
18956A7663m3984l5003L3752p476K5517M5444J492N4860j8378l4291R711J07762
18944A57069J91523J1063j63371p1636M6261J00534r997p6310N504P0436K2362
18933B83438j00116j26595J1545Q3567j2442J3839R4179J13970P0422p2205l8935
18922C20667l745q6635m2697K4551q2565l2513K3411M6251n7397k5832l3050k5565
18910B4881O9565m3888J0043j029j8587K2131m6478K6289L2002K7185k7481k8156
18898D6477O2534P1730O3959J0107m8760j7875P1732N6510m975K4749p3343j82176
$$ plain form
18886 80669 99953 230030 305653 315996 310543 281558 262656 323167 331625 268398 299429 320548
18874 320548 293367 153029 102213 104997 142506 218328 149781 59711 40023 45518 65119 59342
18862 59342 127843 184228 210661 162453 92529 49320 95016 115978 113903 126662 139071 143096
18850 143096 127195 76395 109220 112034 123499 207377 251443 205488 120473 143245 141756 73169
18838 73169 93255 157435 126021 98196 160776 183675 242845 314766 291932 274508 298351 277191
18826 277191 342694 402789 430812 465718 432944 460328 452534 388639 413224 549891 485197
18815 485197 401702 415500 470443 566504 562979 600101 706017 758386 758830 676186 659803 667224
18803 667224 658960 598940 509943 424053 404223 321728 334590 306790 294091 283145 324925 390069
$$ packed form
18886H0669J9284J30077P5623J0343n453k8985j8902O0511Q458o3227L1031K1119
18874C20548k7181j40338n0816K784L7509P5822o8547r0070j9688N495J9601n777
18862E9342O8501N6385K6433m8208o9924m3209M5696K0962k075J2759J2409M025
18850A43096j5901n0800L2825K814J1465Q3878M4066m5955q5015K2772j489o8587
18838G3169K0086O4180l1414k7825O2580K2899N9170P1921k2834j7424K3843k1160
18826B77191O5503O0095K8023L4906l2774K7384p794o3895K4585J36667o4694
18815D85197q3495J3798N4943R6061l525L7122J05916N2369M44q2644j6383P421
18803F67224q264o0020q8997q5890j9830q2495J2862k7800j2699j0946M1780O5144
$$ plain form
18791 390069 462656 450330 421174 357233 329348 283699 409215 519944 505865 466427 490871
18780 490871 513850 469767 377259 407395 491252 595825 586883 634644 836337 954055 1038107
18769 1038107 1202836 1331272 1476949 1706141 1614441 1394085 1302441 1299785 1305407 1306597 1242438
18758 1242438 1211161 1222974 1200963 1157601 1111034 1029936 1098101 1144824 1152751 1172131 1240315
18747 1240315 1263889 1186671 1031626 972402 902977 850828 801811 754751 711327 745730 793890
18736 793890 775417 704645 729492 781654 797423 748831 720668 820558 904399 975199 969292 934582
18724 934582 974902 1081204 1106327 1170153 1273911 1363354 1439035 1489368 1574593 1781914 1904704
18713 1904704 2002329 2271999 2555575 2803603 3158025 3659896 4251565 4808714 5261626 5628756
$$ packed form
18791C90069P2587j2326k9156o3941k7885m5649J25516J10729j4079l9438K4444
18780D90871K2979m4083r2508L0136Q3857J04573q942M7761K01693J17718Q4052
18769A038107J64729J28436J45677K29192r1700k20356r1644k656N622J190o4159
18758A242438l1277J1813k2011m3362m6567q1098O8165M6723P927J9380O8184
18747A240315K3574p7218j55045n9224o9425n2149m9017m7060m3424L4403M8160
18736G93890j8473p0772K4847N2162J5769m8592k8163R9890Q3841P0800n907l4710
18724I34582M0320J06302K5123O3826J03758Q9443P5681N0333Q5225K07321J22790
18713A904704R7625K69670K83576K48028L54422N01871N91669N57149M52912L67130
$$ plain form
18703 5628756 6221114 7000616 8051291 9529264 11560527 14041147 16753274 19123285
18695 19123285 20446455 20465124 19946356 19809961 20684333 22525063 25208498 28866481 34030725
18686 34030725 41438839 51861602 66075422 84747642 107363997 129622652 144945779
18679 144945779 144694538 130975074 110936769 89585375 70080298 54568403 44320143
18672 44320143 39383665 38699884 40868157 44820666 48472115 49426624 45346832 37285203
18664 37285203 28464043 21314517 16563076 13616013 11882691 10896576 10238320 10072525
18656 10072525 10228589 10449919 10651856 10964784 11355410 11848320 12540823 13286083 14324318
18647 14324318 15796553 17744170 20589135 24631208 30023779 36922725 45387005 54570868
$$ packed form
18703E628756N92358P79502J050675J477973K031263K480620K712127K370011
18695A9123285J323170J8669n18768j36395Q74372J840730K683435L657983N164244
18686C4030725P408114J0422763J4213820J8672220K2616355K2258655J5323127
18679A44945779k51241j3719464k0038305k1351394j9505077j5511895j0248260
18672D4320143m936478o83781K168273L952509L651449R54509m079792q061629
18664C7285203q821160p149526m751441k947063j733322r86115o58256j65795
18656A0072525J56064K21330K01937L12928L90626M92910O92503P45260J038235
18647A4324318J472235J947617K844965M042073N392571O898946Q464280R183863
$$ plain form
18639 54570868 62331717 66024247 64066293 59491456 56083655 56313635 61081913 70736471
18631 70736471 85727377 106292266 130962881 156614092 177966103 188669264 183770637
18624 183770637 159016735 121816596 86134811 59289364 42592589 32776186 26856610
18617 26856610 23254638 21270719 20522681 20749630 21746816 23299216 24649859 24850335 22832451
18608 22832451 18723206 14297379 10748553 8438130 7024310 6224143 5724915 5344568
18600 5344568 4952161 4522940 4059287 3554233 3085406 2703587 2466973 2387330 2269449 2153425
18590 2153425 2054273 2008959 1817260 1598900 1540014 1528912 1423141 1348523 1232724 1233129 1186518
18579 1186518 1070432 1062380 1027297 977757 995641 907575 837212 761123 672878 619138 642190
$$ packed form
18639E4570868P760849L692530j957954m574837l407801K29980M768278R654558
18631G0736471J4990906K0564889K4670615K5651211K1352011J0703161m898627
18624A83770637k4753902l7200139l5681785k6845447j6696775r816403n919576
18617B6856610l601972j983919p48038K26949R97186J552400J350643K00476k017884
18608B2832451m109245m425827l548826k310423j413820q00167m99228l80347
18600E344568l92407m29221m63653n05054m68827l81819k36614p9643j17881j16024
18590B153425r9152m5314j91699k18360n8886j1102j05771p4618j15799M05m6611
18579A186518j16086q052l5083m9540J7884q8066p0363p6089q8245n3740K3052
$$ plain form
18568 642190 610120 608964 647488 655417 631290 599705 534513 488860 451983 438609 383087 409572
18556 409572 500629 454198 384885 403772 351981 393772 426153 434783 458549 457527 466131 483273
18544 483273 492276 565024 538840 465053 517965 570846 597557 616842 629012 683861 677832 721666
18532 721666 796254 805501 727352 629132 554252 510449 576877 686575 753190 761248 817844 865329
18520 865329 927720 891079 921133 906510 893149 950318 930868 851603 700102 550216 568925
18509 568925 575046 570911 536292 552306 499053 333697 298216 319476 416315 449255 488145 519385
18497 519385 468979 466312 541536 402878 330206 318616 284232 340603 340614 364604 422773 461526
18485 461526 532758 597827 615805 574878 584012 636861 613876 638098 610320 582512 566199 599544
$$ packed form
18568F42190l2070j156L8524P929k4127l1585o5192m5653l6877j3374n5522K6485
18556D09572R1057m6431o9313J8887n1791M1791L2381Q630K3766j022Q604J7142
18544D83273R003P2748k6184p3787N2912N2881K6711J9285J2170N4849o029M3834
18532G21666P4588R247p8149r8220p4880m3803O6428J09698O6615Q058N6596M7485
18520H65329O2391l6641L0054j4623j3361N7169j9450p9265j51501j49886J8709
18509E68925O121m135l4619J6014n3253j65356l5481K1260R6839L2940L8890L1240
18497E19385n0406k667P5224j38658p2672j1590l4384N6371J1K3990N8169L8753
18485D61526P1232O5069J7978m0927R134N2849k2985K4222k7778k7808j6313L3345
$$ plain form
18473 599544 556555 525364 523968 596439 669583 722697 804759 846942 862009 891707 836897 807792
18461 807792 682651 635403 544296 542867 495195 365379 284795 275645 349594 365324 398458
18450 398458 379195 358789 434426 468281 443760 412584 332759 279752 186812 202159 243303
18439 243303 269125 254667 285313 272040 198341 173597 176113 173219 166613 199945 211468 179514
18427 179514 298810 358236 375237 396058 388828 391435 471912 483675 446451 400534 389029 495877
18415 495877 494530 405717 305243 236161 250406 368922 394895 349846 347794 360953 401408
18404 401408 341187 267772 339423 421656 407337 348549 377992 413314 309427 325568 330377
18393 330377 341165 421949 500599 577039 687715 754381 768654 776117 810540 780861 667796
$$ packed form
18473E99544m2989l1191j396P2471P3144N3114Q2062M2183J5067K9698n4810k9105
18461H07792j25141m7248r1107j429m7672j29816q0584r150P3949J5730L3134
18450C98458j9263k0406P5637L3855k4521l1176p9825n3007r2940J5347M1144
18439B43303K5822j4458L0646j3273p3699k4744K516k894o606L3332J1523l1954
18427A79514J19296N9426J7001K0821p230K607Q0477J1763l7224m5917j1505J06848
18415D95877j347q8813j00474o9082J4245J18516K5973m5049k052J3159M0455
18404D01408o0221p3415P1651Q2233j4319n8788K9443L5322j03887J6141M809
18393C30377J0788Q0784P8650P6440J10676O6666J4273P463L4423k9679j13065
$$ plain form
18382 667796 653914 663628 629002 616675 573034 666215 686800 684867 766825 799177 788940 761126
18370 761126 757169 745358 604342 602561 654836 718962 730049 642760 622327 679162 679604 631609
18358 631609 560058 586036 525062 556439 618127 695516 751184 762421 832329 797872 777697
18347 777697 804011 824483 879344 921143 910641 974710 1074833 1167857 1192054 1233306 1372863
18336 1372863 1444489 1456194 1567778 1672988 1877520 2055769 2291473 2573963 2785488 3145224
18326 3145224 3529015 3781746 3917580 4049534 4249556 4488694 4855588 5138813 5393695
18317 5393695 5839451 6516119 7339272 8559141 10159837 12112583 14536000 17653077 21025817
18308 21025817 23808065 26503357 28715412 28996098 29015188 29830839 30852728 32880005 36877970
$$ packed form
18382F67796j3882R714l4626j2327m3641R3181K0585j933Q1958L2352j0237k7814
18370G61126l957j1811j41016j781N2275O4126J1087q7289k0433N6835M42m7995
18358F31609p1551K5978o0974L1377O1688P7389N5668J1237O9908l4457k0175
18347G77697K6314K0472N4861M1799j0502O4069J00123R3024K4197M1252J39557
18336A372863P1626J1705J11584J05210K04532J78249K35704K82490K11525L59736
18326C145224L83791K52731J35834J31954K00022K39138L66894K83225K54882
18317E393695M45756O76668Q23153J219869J600696J952746K423417L117077L372740
18308B1025817K782248K695292K212055K80686J9090Q15651J021889K027277L997965
$$ plain form
18299 36877970 43066518 51823742 63867636 80205997 101758074 125437120 144920361
18292 144920361 162847267 174627339 167191324 151556518 133503764 108878283 85507151
18285 85507151 68500140 56699269 49848051 47656531 48609223 50057215 50800835 51243874
18277 51243874 48224324 41547436 34961884 28534157 22304222 17512882 14374863 12483232
18269 12483232 11300699 10365930 9827254 9678963 9660988 9864461 10145537 10680824 11547318
18260 11547318 12574767 13729549 15282586 17336753 20029211 23634901 28351248 34137229
18252 34137229 40145886 45227867 49866141 53164526 52836545 51607263 51835816 53283138
18244 53283138 57614338 66066865 77566937 91054178 106497090 120569205 125798675
$$ packed form
18299C6877970O188548Q757224J2043894J6338361K1552077K3679046J9483241
18292A44920361J7926906J1780072p436015j5634806j8052754k4625481k3371132
18285H5507151j7007011j1800871o851218k191520R52692J447992P43620M43039
18277E1243874l019550o676888o585552o427727o229935m791340l138019j891631
18269A2483232j182533r34769n38676j48291j7975K03473K81076N35287Q66494
18260A1547318J027449J154782J553037K054167K692458L605690M716347N785981
18252C4137229O008657N081981M638274L298385l27981j229282K28553J447322
18244E3283138M331200Q452527J1500072J3487241J5442912J4072115N229470
$$ plain form
18237 125798675 125775612 122760974 106083187 84449337 67031840 49740600 35170546
18230 35170546 25956683 20508291 17245681 15478947 14691995 14656738 15102078 15478664 15573940
18221 15573940 15538017 14506989 12400559 10521231 8708468 6931208 5595907 4718848
18213 4718848 4190593 3803214 3446248 3217057 3016416 2892051 2876128 2805830 2742379 2709468
18203 2709468 2642087 2553173 2337182 2194233 2062469 1980607 1907681 1798526 1665466 1520072
18193 1520072 1474082 1460714 1399881 1307892 1329833 1392588 1433070 1407147 1305821 1179729 1049005
18182 1049005 1023247 1038465 988811 921358 947012 944497 909233 915176 893722 855386 902533 883460
18170 883460 802377 779064 796144 702427 683014 731568 736774 698034 666475 581127 580677 612606
$$ packed form
18237A25798675k3063l014638j6677787k1633850j7417497j7291240j4570054
18230C5170546r213863n448392l262610j766734p86952l5257M45340L76586R5276
18221A5573940l5923j031028k106430j879328j812763j777260j335301q77059
18213D718848n28255l87379l56966k29191k00641j24365j5923p0298o3451l2911
18203B709468o7381q8914k15991j42949j31764q1862p2926j09155j33060j45394
18193A520072m5990j3368o0833r1989K1941O2755M0482k5923j01326j26092j30724
18182A049005k5758J5218m9654o7453K5654k515l5264N943k1454l8336M7147j9073
18170H83460q1083k3313J7080r3717j9413M8554N206l8740l1559q5348m50L1929
$$ plain form
18158 612606 699257 785952 846985 904987 1025708 1115544 1164012 1294620 1379449 1458296 1506766
18147 1506766 1611954 1798820 1866649 1941207 1912932 1927938 2066717 2205053 2350968 2468459
18137 2468459 2487453 2477379 2518200 2650871 2730268 2773291 2905572 3088510 3254776 3558586
18127 3558586 3945973 4523034 5237830 6149006 7291069 8589477 10237697 12153081 14263421
18118 14263421 16607857 19369652 22894023 27790710 35030725 45994221 61749759 81487195
18110 81487195 105636800 139717075 173450661 149674972 90798857 53011444 34136737
18103 34136737 23746173 17321611 13130834 10365872 8540489 7188261 6029350 5146805
18095 5146805 4493745 3894143 3438966 3048207 2787112 2620122 2484712 2339254 2165374
$$ packed form
18158F12606Q6651Q6695O1033N8002J20721Q9836M8468J30608Q4829P8847M8470
18147A506766J05188J86866O7829P4558k8275J5006J38779J38336J45915J17491
18137B468459J8994j0074M0821J32671P9397M3023J32281J82938J66266L03810
18127C558586L87387N77061P14796R11176J142063J298408J648220J915384K110340
18118A4263421K344436K761795L524371M896687P240015J0963496J5755538J9737436
18110H1487195K4149605L4080275L3733586k3775689n8876115l7787413j8874707
18103C4136737j0390564o424562m190777k764962j825383j352228j158911q82545
18095E146805o53060n99602m55177l90759k61095j66990j35410j45458j73880
$$ plain form
18086 2165374 2068957 1925607 1718659 1492365 1299806 1228553 1149741 1033660 1037071 1028651 995138
18075 995138 952059 888835 818480 725970 742594 683146 583538 539211 573097 545574 440719
18064 440719 444251 462544 419204 367749 338163 314701 398123 421390 411360 346277 322666 297365
18052 297365 298592 257188 190648 166374 143519 98306 123755 179346 256005 281492 278131 291008
18040 291008 211924 182415 152384 165243 202294 143340 137453 144605 149974 170607 224869 226509
18028 226509 223249 252357 213679 129818 146974 203809 166569 214154 193838 121770 50439 33555
18016 33555 44666 88992 -12654 -73554 -81109 -105357 -128424 -58518 48057 60927 52951 139752
18004 139752 201020 210770 120377 120107 149479 70894 78178 41166 -692 38108 93656 53844
$$ packed form
18086B165374r6417j43350k06948k26294j92559p1253p8812j16081L411q420l3513
18075I95138m3079o3224p0355r2510J6624n9448r9608m4327L3886k7523j04855
18064D40719L532J8293m3340n1455k9586k3462Q3422K3267j0030o5083k3611k5301
18052B97365J227m1404o6540k4274k2855m5213K5449N5591P6659K5487l361J2877
18040B91008p9084k9509l0031J2859L7051n8954n887P152N369K0633N4262J640
18028B26509l260K9108l8678q3861J7156N6835l7240M7585k0316p2068p1331j6884
18016C3555J1111M4326j01646o0900p555k4248k3067O9906J06575J2870p976Q6801
18004A39752O1268R750r0393k70K9372p8585P284l7012m1858L8800N5548l9812
$$ plain form
17992 53844 53327 256187 374900 301507 197539 112832 18783 -118779 -38827 19100 24604
17981 24604 -63143 -75203 -72652 -117980 -146293 -127813 -154998 -165399 -95041 -100596 -57007 -88058
17969 -88058 -126288 -107891 -66965 17294 67927 76731 100394 80366 -24586 -51959 -3293 13932
17957 13932 58747 78906 183278 112903 117334 87732 38755 20327 43063 51683 67632 102746
17945 102746 76332 17580 56111 97398 166463 157501 191618 207305 206811 132410 41138 21463
17933 21463 32914 9197 -14148 -27991 -11771 105952 102041 113180 64767 49857 42257 -7112
17921 -7112 32084 44500 5226 -12362 12154 41748 37515 42677 21888 -61725 -43671 62793
17909 62793 58889 -47447 -77625 -85179 -142521 -183309 -231790 -169256 -45611 -46469 -79129 -182357
$$ packed form
17992E3844n17K02860J18713p3393j03968q4707r4049j37562P9952N7927N504
17981B4604q7747j2060K551m5328k8313J8480k7185j0401P0358n555M3589l1051
17969h8058l8230J8397M0926Q4259N0633Q804K3663k0028j04952k7373M8666J7225
17957A3932M4815K0159J04372p0375M431k9602m8977j8428K2736Q620J5949L5114
17945A02746k6414n8752L8531M1287O9065q962L4117J5687m94p4401r1272j9675
17933B1463J1451k3717k3345j3843J6220J17723l911J1139m8413j4910p600m9369
17921g112L9196J2416l9274j7588K4516K9594m233N162k0789q3613J8054J06464
17909F2793l904j06336l0178p554n7342m0788m8481O2534J23645q58l2660j03228
$$ plain form
17897 -182357 -206247 -81248 -71125 -90802 -42615 -9195 -14396 60467 62550 19326 -32921 -31276
17885 -31276 -25854 -55773 -27537 -170 71559 69751 -41927 -111329 -90602 -30026 -7461 -141977
17873 -141977 -210124 -131091 -84132 -42988 47927 53598 96639 27652 46517 12268 23339 34531
17861 34531 -10642 29374 106741 51239 89471 89387 75793 111536 56038 26764 5977 14752
17849 14752 -44437 -101690 -111874 -105993 -22447 80022 68027 3893 -65676 -36843 8340 -26018
17837 -26018 -53394 715 11620 -6575 4505 -30368 -102035 -57353 4343 73529 26896 -62339
17825 -62339 -157380 -183816 -111943 27407 1160 -88049 -169524 -182170 -105534 -50075 -69667
17814 -69667 -137985 -143205 -81364 -98690 -47271 -24235 24162 90445 58857 4203 14620 35357
$$ packed form
17897a82357k3890J24999J0123j9677M8187L3420n201P4863K083m3224n2247J645
17885c1276N422k9919K8236K7367P1729j808j11678o9402K0727O0576K2565j34516
17873a41977o8147P9033M6959M1144R0915N671M3041o8987J8865l4249J1071J1192
17861C4531m5173M0016P7367n5502L8232q4j3594L5743n5498k9274k0787Q775
17849A4752n9189n7253j0184N881Q3546J02469j1995o4134o9569K8833M5183l4358
17837b6018k7376N4109J0905j8195J1080l4873p1667M4682O1696O9186m6633q9235
17825f2339r5041k6436P1873J39350k6247q9209q1475j2646P6636N5459j9592
17814f9667o8318n220O1841j7326N1419K3036M8397O6283l1588n4654J0417K0737
$$ plain form
17802 35357 83797 121465 168875 156381 45417 -42281 -50747 -13055 56213 96478 145641 149893
17790 149893 101254 143249 217396 272647 392025 483259 554081 551100 481273 384518 350079
17779 350079 411167 504755 446128 503665 449385 401241 359006 424197 492975 479711 447680
17768 447680 352004 362810 397306 300293 175560 156552 224543 193927 218765 128627 65224
17757 65224 79217 114065 98218 126661 175355 104510 69300 85695 32491 -15534 -55757 -77058
17745 -77058 -37531 -21455 -4315 56212 63956 99168 44362 6339 121615 137355 134707 179725
17733 179725 184397 230062 243143 384085 425323 445869 457697 446254 378938 312431 333463
17722 333463 181389 147772 156204 233965 251602 217749 208718 330009 374020 436544 488982
$$ packed form
17802C5357M8440L7668M7410j2494j10964q7698q466L7692O9268M0265M9163M252
17790A49893m8639M1995P4147N5251J19378R1234P0822k981o9827r6755l4439
17779C50079O1088R3588n8627N7537n4280m8144m2235O5191O8778j3264l2031
17768D47680r5676J0806L4496r7013j24733j9008O7991l0616K4838r0138o3403
17757F5224J3993L4848j5847K8443M8694p0845l5210J6395n3204m8025m0223k1301
17745g7058L9527J6076J7140O0527P744L5212n4806l8023J15276J5740k648M5018
17733A79725M672M5665J3081J40942M1238K0546J1828j1443o7316o6507K1032
17722C33463j52074l3617Q432P7761J7637l3853r031J21291M4011O2524N2438
$$ plain form
17711 488982 530134 464606 401643 357087 289729 241266 184061 201147 140966 163347 142824
17700 142824 35771 79759 70871 27453 45783 60616 51692 -20219 -25993 -18766 -71910 -59893
17688 -59893 -51549 -10859 1336 -44328 -114160 -109618 -57002 34145 22266 55854 -26747 -81823
17676 -81823 -98117 -100351 -154197 -190864 -221919 -133262 19174 60857 22264 -59238 -105358 -64490
17664 -64490 -32824 5796 26011 24953 109991 176832 89342 -2051 12483 -12770 -13652 -41602
17652 -41602 -61919 -52537 -66340 -59406 -24031 -1898 -29066 -2473 -23332 -110961 -128690 -74077
17640 -74077 -48524 -20311 60768 76230 141459 180069 77980 -19173 -101555 -38194 -28679 -16269
17628 -16269 -22464 -66967 -115793 -175862 -95521 -52132 -137939 -63488 42756 -22274 -56360 -59021
$$ packed form
17711D88982M1152o5528o2963m4556o7358m8463n7205J7086o0181K2381k0523
17700A42824j07053M3988q888m3418J8330J4833q924p1911n774P227n3144J2017
17688e9893Q344M0690J2195m5664o9832M542N2616R1147j1879L3588q2601n5076
17676h1823j6294k234n3846l6667l1055Q8657J52436M1683l8593q1502m6120M0868
17664f4490L1666L8620K0215j058Q5038O6841q7490r1393J4534k5253q82k7950
17652d1602k0317R382j3803O934L5375K2133k7168K6593k0859q7629j7729N4613
17640g4077K5553K8213Q1079J5462O5229L8610j02089r7153q2382O3361R515J2410
17628a6269o195m4503m8826o0069Q0341M3389q5807P4451J06244o5030l4086k661
$$ plain form
17616 -59021 -107349 -104392 -107862 -144712 -54456 10303 -1214 6932 30244 28181 79362 29987
17604 29987 47 19550 14707 39832 -4117 -73649 -97119 -80360 -42468 -32849 -59195 -161758
17592 -161758 -140748 -97963 -11203 36177 34462 -65026 -91724 -76680 37295 78691 12577
17581 12577 51898 61725 6108 46472 81757 43868 -6191 -13942 -45547 -79588 -140163 -162326
17569 -162326 -145856 -165335 -194992 -117536 2922 -38474 -67226 -21250 -35731 -14017 -63235
17558 -63235 -126771 -162126 -134133 -128581 -131309 -208645 -147780 -168229 -178174 -218214 -229973 -116824
17546 -116824 -98219 -102719 -81289 -162823 -166329 -173189 -147355 -68581 -62986 -70285 16253 28402
17534 28402 -70154 -53743 -97287 -145908 -168327 -175710 -166507 -123996 -132944 -81048 -109972 -131940
$$ packed form
17616e9021m8328K957l470l6850R0256O4759j1517Q146K3312k063N1181m9375
17604B9987k9940J9503m843K5125m3949o9532k3470J6759L7892R619k6346j02563
17592a61758K1010M2785Q6760M7380j715r9488k6698J5044J13975M1396o6114
17581A2577L9321R827n5617M0364L5285l7889n0059p751l1605l4041o0575k2163
17569a62326J6470j9479k9657P7456J20458m1396k8752M5976j4481K1714m9218
17558f3235o3536l5355K7993N552k728p7336O0865k0449r945m0040j1759J13149
17546a16824J8605m500K1430q1534l506o860K5834P8774N595p299Q6538J2149
17534B8402r8556J6411m3544m8621k2419p383R203M2511q948N1896k8924k1968
$$ plain form
17522 -131940 -31265 -102407 -155647 -178710 -155325 -120938 -99540 -70978 -73599 -51918 -72175
17511 -72175 -96485 -50043 41682 22399 -26295 68589 47234 -22208 -37485 -64472 -65831 -69986
17499 -69986 -123080 -86876 -130234 -146756 -145517 -166928 -148739 -169495 -199383 -173718 -44271 44026
17487 44026 97434 82918 38646 -12146 -41984 -111243 -124674 -57764 -15344 -92487 -59165 -45833
17475 -45833 -84554 -59999 -52285 -99911 -139183 -125494 -114355 -118570 -114730 -136009 -81648 -37301
17463 -37301 -57602 -130533 -173951 -131646 -82297 -44530 29840 93754 138312 178878 239924 173371
17451 173371 136108 73248 65291 129435 228017 298364 299994 498967 642527 831087 881679
17440 881679 539045 285727 154744 103279 129065 175227 116814 27005 -63279 -86601 -110012
$$ packed form
17522a31940J00675p1142n3240k3063K3385L4387K1398K8562k621K1681k0257
17511g2175k4310M6442R1725j9283m8694R4884k1355o9442j5277k6987j359m155
17499f9986n3094L6204m3358j6522J239k1411J8189k0756k9888K5665J29447Q8297
17487D4026N3408j4516m4272n0792k9838o9259j3431O6910M2420p7143L3322J3332
17475d5833l8721K4555P714m7626l9272J3689J1139m215L840k1279N4361M4347
17463c7301k0301p2931m3418M2305M9349L7767P4370O3914M4558M0566O1046o6553
17451A73371l7263o2860p957O4144R8582P0347J630J98973J43560J88560N0592
17440H81679l42634k53318j30983n1465K5786M6162n8413q9809r0284k3322k3411
$$ plain form
17429 -110012 -106616 -120362 -31461 105013 65897 -34427 -54844 -58130 -15300 31853 88613
17418 88613 80080 25464 -38763 -63905 -27802 -18543 -22143 -42873 -38514 -17159 -59505 -4373
17406 -4373 620 16884 26871 37952 -12348 21489 -18165 -17815 -45075 8349 40388 53185 74168
17393 74168 107724 58202 2380 -108080 -195652 -210988 -186510 -170822 -106327 -76668 -54599
17382 -54599 -38155 -18274 -12610 -62103 -27259 21974 -14552 -51229 -131607 -120433 -123624 -62047
17370 -62047 25170 -1792 -66188 8282 -61260 -102077 -64532 -21232 -9619 -87180 -56609 -554
17358 -554 30678 49415 29633 38052 1082 -3476 -88206 -94333 -58318 -24326 -36242 -20579 21054
17345 21054 -36153 56622 45457 -31942 112369 116255 18558 -36939 28854 113842 30551 82192
$$ packed form
17429a10012L396j3746Q8901J36474l9116j00324k0417l286M2830M7153N6760
17418H8613q533n4616o4227k5142L6103R259l600k0730M359K1355m2346N5132
17406d373M993J6264R987J1081n0300L3837l9654L50k7260N3424L2039J2797K0983
17393G4168L3556m9522n5822j10460q7572j5336K4478J5688O4495K9659K2069
17382e4599J6444J9881N664m9493L4844M9233l6526l6677q0378J1174l191O1577
17370f2047Q7217k6962o4396P4470o9542m0817L7545M3300J1613p7561L0571N6055
17358e54L1232J8737j9782Q419l6970m558q4730o127L6015L3992j1916J5663M1633
17345B1054n7207R2775j1165p7399J44311L886r7697n5497O5793Q4988q3291N1641
$$ plain form
17333 82192 89533 65652 49375 16824 -27161 -50031 -82957 -110277 -80616 -91806 -102883 -79046
17321 -79046 -11493 84324 89160 58141 -3924 -19295 7478 92059 89467 -8026 -71657 -83676
17309 -83676 -65855 -81376 -14832 -22699 -163006 -119373 -97571 -50887 30281 79802 39873 39243
17297 39243 37018 -8939 -110599 -182007 -114193 -76638 -84201 -11253 19387 26156 38459 -2488
17285 -2488 -130159 -113200 -48901 -29700 -68813 -150919 -126572 -104982 -56228 -34566 -82198 -19458
17273 -19458 -67533 -138261 -106405 -118570 -27931 -45637 -80613 -46164 -95943 21360 72217
17262 72217 18244 -85034 -121678 -166826 -158463 -168129 -96996 -57615 -66860 -71916 -61691 -60245
17250 -60245 -89806 -91506 -84226 -95415 -22919 -57779 -112175 -117026 -118883 -121823 -99617 -43219 58371
$$ packed form
17333H2192P341k3881j6277l2551m3985k2870l2926k7320K9661j1190j1077K3837
17321g9046O7553R5817M836l1019o2065j5371K6773Q4581k592r7493o3631j2019
17309h3676J7821j5521O6544p867j40307M3633K1802M6684Q1168M9521l9929o30
17297C9243k225m5957j01660p1408O7814L7555p563P2948L0640O769J2303m0947
17285b488j27671J6959O4299J9201l9113q2106K4347K1590M8754K1662m7632O2740
17273a9458m8075p0728L1856j2165R0639j7706l4976L4449m9779J17303N0857
17262G2217n3973j03278l6644m5148Q363r666P1133L9381r245n056J0225J446
17250f0245k9561j700P280j1189P2496l4860n4396m851j857k940K2206N6398J01590
$$ plain form
17237 58371 109179 154960 132712 63065 23624 3700 9356 23454 25201 -1424 36613 16440
17225 16440 37225 61689 2912 -50508 -53694 -82173 4243 69609 -19458 -28562 -60985 -5797
17213 -5797 9952 18331 -30458 -57165 -49877 -54082 -32860 46038 76762 59611 -18002 -66
17201 -66 80262 75014 34809 7888 -35955 -44887 -12495 13939 26808 -6166 -22656 -20722 75258
17188 75258 66623 29573 16214 -70835 -57156 -5274 -15972 6353 67890 66309 -15121 -48662
17176 -48662 -54971 -44460 -17163 -46784 -51754 19588 101871 62071 -2323 -102502 -137662 -55020
17164 -55020 -30401 -96141 -173188 -170067 -215276 -266115 -233752 -142586 -7811 41965 28946 26824
17152 26824 26037 -26949 -8373 19062 -35444 -99155 -136880 -126543 -87652 53427 30986 -92648
$$ packed form
17237E8371N0808M5781k2248o9647l9441j9924N656J4098J747k6625L8037k0173
17225A6440K0785K4464n8777n3420l186k8479Q6416O5366q9067r104l2423N5188
17213e797J5749Q379m8789k6707P288m205K1222P8898L0724j7151p7613J7936
17201f6Q0328n248m0205k6921m3843q932L2392K6434J2869l2974j6490J934R5980
17188G5258q635l7050j3359q7049J3679N1882j0698K2325O1537j581q1430l3541
17176d8662o309J0511K7297k9621m970P1342Q2283l9800o4394j00179l5160Q2642
17164e5020K4619o5740p7047L121m5209n0839L2363R1166J34775M9776j3019k122
17152B6824p87n2986J8576K7435n4506o3711l7725J0337L8891J41079k2441j23634
$$ plain form
17140 -92648 -140511 -99240 -127142 -141844 -158373 -83473 -71914 -69868 -58358 -97603 -139881 -16815
17128 -16815 32609 1722 61607 114053 70327 25650 68107 134704 69552 -67213 -88875
17117 -88875 -97712 -138706 -175346 -84819 -32136 337 17061 3981 536 -2816 10932 90042
17105 90042 36730 -33481 -80771 -40781 -27512 -80727 5121 41100 -54751 -160214 -186638
17094 -186638 -149874 -148990 -177020 -140043 -40089 -45758 -91254 -103029 -85073 -50295 -99438 -99417 -60521
17081 -60521 -29304 25188 250 -14036 -2540 -54897 -41676 -48727 -109137 -147575 -96644 -106671
17069 -106671 -119118 -11590 102737 153888 157292 125895 88822 78603 44600 51140 29856
17058 29856 34880 103138 89840 -16494 -9443 11819 96637 177935 93834 -59470 -21862 17738
$$ packed form
17140i2648m7863M1271k7902j4702j6529P4900J1559K046J1510l9245m2278J23066
17128a6815M9424l0887N9885N2446m3726m4677M2457O6597o5152j36765k1662
17117h8875q837m0994l6640R0527N2683L2473J6724j3080l445l352J3748P9110
17105I0042n3312p0211m7290L9990J3269n3215Q5848L5979r5851j05463k6424
17094a86638L6764Q84k8030L6977R9954n669m5496j1775J7956L4778m9143K1L8896
17081f0521L1217N4492k4938j4286J1496n2357J3221p051o0410l8438N0931j0027
17069a06671j2447J07528J14327N1151L404l1397l7073j0219l4003O540k1284
17058B9856N024O8258j3298j06334P051K1262Q4818Q1298q4101j53304L7608L9600
$$ plain form
17046 17738 30652 11746 -12423 80464 54777 4256 -126398 -142640 -115046 -106562 -79869 -71144
17034 -71144 -43953 -21709 -29902 -88624 -69706 -43748 -18223 -8477 28696 -28876 -56814 27032
17022 27032 14703 -17776 2399 -36008 -117197 -99514 -61768 -43115 22176 34180 26370 -1522
17010 -1522 -41274 -93966 -86938 3739 62682 -25561 -64815 -83334 12130 73073 51302 4663
16998 4663 18990 111055 98970 -14008 18201 77771 83782 84482 -21658 -63725 -83853 -57845
16986 -57845 -91349 -95664 -99054 -34498 -67506 -80150 -47113 -61156 -68582 -67361 -22749 30751
16974 30751 36151 42618 -33366 -58798 -24769 65614 -59459 -165715 -52074 -30204 -89980
16963 -89980 -131071 -115667 -127505 -90525 -66699 505 116634 133797 150311 96294 72276
$$ packed form
17046A7738J2914j8906k4169R2887k5687n0521j30654j6242K7594Q484K6693Q725
17034g1144K7191K2244q193n8722J8918K5958K5525R746L7173n7572k7938Q3846
17022B7032j2329l2479K0175l8407q1189J7683L7746J8653O5291J2004p810k7892
17010a522l9752n2692P028R0677N8943q8243l9254j8519R5464O0943k1771m6639
16998D663J4327R2065j2085j12978L2209N9570O011P00j06140m2067k0128K6008
16986e7845l3504m315l390O4556l3008j2644L3037j4043p426J221M4612N3500
16974C0751N400O467p5984k5432L4029R0383j25073j06256J13641K1870n9776
16963h9980m1091J5404j1838L6980K3826O7204J16129J7163J6514n4017k4018
$$ plain form
16952 72276 83057 11423 -45980 -23748 54358 43965 92568 52562 35788 57885 72703 34835
16940 34835 64948 44940 45810 18683 -74478 -56179 -23687 2663 36713 75092 26396 1795
16928 1795 -14128 -59870 -39909 -1359 30766 47111 4278 -121205 -182253 -123915 -77708 14559
16916 14559 107605 62369 -22840 13511 125632 128237 84862 125863 181329 133614 94514 12723
16904 12723 -1892 -58831 -97352 -68386 16641 151333 161998 79772 49596 1234 -59015
16893 -59015 -56247 -9683 -15356 -53844 -39620 -26612 -28391 -78824 -116807 -53136 4853 -42668
16881 -42668 -75225 -7891 -44622 -32617 3925 101979 29702 -63417 -99785 -34618 -49452 -65962
16869 -65962 -49381 -46555 -165390 -158605 -215709 -227341 -159946 -83859 -74528 -11658 -18061 -35742
$$ packed form
16952G2276J0781p1634n7403K2232P8106j0393M8603m0006j6774K2097J4818l7868
16940C4835L0113k0008Q70k7127r3161J8299L2492K6350L4050L8379m8696k4601
16928A795j5923m5742J9961L8550L2125J6345m2833j25483o1048N8338M6207R2267
16916A4559R3046m5236q5209L6351J12121K605m3375M1001N5466m7715l9100q1791
16904A2723j4615n6939l8521K8966Q5027J34692J0665q2226l0176m8362o0249
16893e9015K768M6564n673l8488J4224J3008j779n0433l7983O3671N7989m7521
16881d2668l2557O7334l6731J2005L6542R8054p2277r3119l6368O5167j4834j6510
16869f5962J6581K826j18835O785n7104j1632O7395P6087R331O2870o403j7681
$$ plain form
16857 -35742 -73625 -153849 -124399 -103401 20487 100002 156855 158295 147296 44412 45603 48860
16845 48860 -4629 -44637 2649 11357 -23295 -2961 46615 107775 87351 59976 45265 -35570
16833 -35570 1590 -41350 -41046 -47975 -55604 -135904 -109737 -22563 4626 64405 123661 85641
16821 85641 49162 22846 53757 57623 74484 -6830 -29284 -26867 -55398 -57284 -19194 -18955 -71784
16808 -71784 -42436 56608 -68928 -196517 -155775 -44924 -16442 -5923 -13537 -39847 -27577
16797 -27577 -66626 -141444 -77581 -35656 -104197 -66650 13398 28890 40525 -25202 -129596
16786 -129596 -90605 -98597 -73770 -39216 -63794 -683 62313 19073 -18184 -10301 36240 53432
16774 53432 73082 16790 -24271 -116005 -34450 -32774 -15353 -19366 -4777 -22531 -99973 -165325
$$ packed form
16857c5742l7883q0224K9450K0998J23888P9515N6853J440j0999j02884J191L257
16845D8860n3489m0008M7286Q708l4652K0334M9576O1160k0424k7375j4711q0835
16833c5570L7160m2940L04o929p629q0300K6167Q7174K7189N9779N9256l8020
16821H5641l6479k6316L0911L866J6861q1314k2454K417k8531j886L8090K39n2829
16808g1784K9348R9044j25536j27589M0742J10851K8482J0519p614k6310J2270
16797b7577l9049p4818O3863M1925o8541L7547Q0048J5492J1635o5727j04394
16786a29596L8991p992K4827L4554k4578O3111O2996m3240l7257P883M6541J7192
16774E3432J9650n6292m1061r1734Q1555J676J7421m013J4589j7754p7442o5352
$$ plain form
16762 -165325 -169320 -195818 -150972 -16065 34680 65255 16885 -60591 -69834 -828 102047
16751 102047 68442 64633 95828 140838 31108 -31667 -62912 -82400 -135859 -74531 -30715
16740 -30715 -66204 -164826 -240558 -166764 -109695 -134856 -52023 -13527 -21898 -6068 -3327 -22068
16728 -22068 13699 -39153 -48298 -55492 -32953 -29316 -54501 -63124 -125402 -64631 4600 23320
16716 23320 59238 31569 15917 47611 15425 -58932 -129377 -180273 -196251 -85515 -11078
16705 -11078 -47543 -85615 -13728 -52390 -74068 -35777 -71874 -1570 -13786 -40985 -10279 -782
16693 -782 6083 -16448 -85144 -63629 -21265 -35456 -102290 -49052 -37294 -50585 6915 -3956
16681 -3956 -77894 -108690 -30800 31752 101898 108886 110255 93848 74244 26185 -38570 -74706
$$ packed form
16762a65325l995k6498M4846J34907N0745L0575m8370p7476r243O9006J02875
16751A02047l3605l809L1195M5010j09730o2775l1245j9488n3459O1328M3816
16740c0715l5489r8622p5732P3794N7069k5161Q2833L8496q371J5830K741j8741
16728b2068L5767n2852r145p194K2539L637k5185q623o2278O0771O9231J8720
16716B3320L5918k7669j5652L1694l2186p4357p0445n0896j5978J10736P4437
16705a1078l6465l8072P1887l8662k1678L8291l6097P0304j2216k7199L0706R497
16693g82O865k2531o8696K1515M2364j4191o6834N3238J1758j3291N7500j0871
16681c956p3938l0796P7890O2552P0146O988J369j6407j9604m8059o4755l6136
$$ plain form
16669 -74706 -82588 -64798 -13355 45022 33853 -51303 -76150 -53112 -34504 -47491 -57601 -7132
16657 -7132 -61566 -21037 61818 76053 49961 64207 96534 150947 115883 61376 17035 105669
16645 105669 118804 99550 139022 166650 154836 58388 -60821 -98780 -79881 -111394 3128
16634 3128 25852 6366 3527 -47418 -110116 -72384 -106870 -171551 -176360 -72284 48711 76035
16622 76035 56887 48868 48947 81874 101304 130812 126352 46514 60317 25193 12259 53721 40744
16609 40744 -3207 -89224 -58267 -37599 -63815 -35167 -45138 -22694 -2047 -6022 -53767 -14406
16597 -14406 38480 96470 144034 133910 111553 115620 154457 140438 108089 70582 95210 70785
16585 70785 59248 38655 107719 114234 115500 18232 2347 76385 85211 -22917 -72702 -114604
$$ packed form
16669g4706p882J7790N1443N8377j1169q5156k4847K3038J8608j2987j0110N0469
16657g132n4434M0529Q2855J4235k6092J4246L2327N4413l5064n4507m4341Q8634
16645A05669J3135j9254L9472K7628j1814r6448j19209l7959J8899l1513J14522
16634C128K2724j9486k839n0945o2698L7732l4486o4681m809J04076J20995K7324
16622G6035j9148q019P9L2927J9430K9508m460p9838J3803l5124j2934M1462j2977
16609D0744m3951q6017L0957K0668k6216K8648r971K2444K0647l975m7745L9361
16597a4406N2886N7990M7564j0124k2357M067L8837j4019l2349l7507K4628k4425
16585G0785j1537k0593O9064O515J266r7268j5885P4038Q826j08128m9785m1902
$$ plain form
16573 -114604 -95664 -37834 -25937 -39435 -171357 -184235 -149021 -115562 -84115 -84311 -3379 67027
16561 67027 42278 16290 -33622 -12478 9309 -51321 -70307 -35965 -32790 29983 23850 2705
16549 2705 -94572 -170847 -128006 -71988 3552 51233 16030 -70987 -104447 -44733 -31745 -26354
16537 -26354 -3352 69393 75294 48530 13685 -56746 -61673 -103134 -96214 -30872 -49192 14204
16525 14204 -38066 26124 26908 -45117 -15392 -31736 -37965 -59914 -139484 -46818 -43658 -59567
16513 -59567 -35508 -17666 -13607 -110330 -131186 -56235 23098 1644 -19452 -274 39260 55570
16501 55570 74274 90039 19534 -14391 -128301 -218458 -276895 -184186 -55465 -78571 -11743
16490 -11743 94566 99210 12686 -8729 24051 8884 -105647 -154417 -73609 -8845 -28810
$$ packed form
16573a14604J8940N7830J1897j3498j31922j2878L5214L3459L1447j96Q0932P0406
16561F7027k4749k5988m9912K1144K1787o0630j8986L4342L175O2773o133k1145
16549B705r7277p6275M2841N6018P5540M7681l5203q7017l3460N9714J2988N391
16537b6354K3002P2745N901k6764l4845p0431m927m1461O920O5342j8320O3396
16525A4204n2270O4190P84p2025K9725j6344o229k1949p9570R2666L160j5909
16513e9567K4059J7842M059r6723k0856P4951P9333k1454k1096J9178L9534J6310
16501E5570J8704J5765p0505l3925j13910r0157n8437R2709J28721k3106O6828
16490a1743J06309M644q6524k1415L2780j5167j14531m8770Q0808O4764j9965
$$ plain form
16479 -28810 -46348 34052 26544 3197 -18821 -4960 -59625 -53178 1740 9491 6532 -8019
16467 -8019 34319 52814 -4169 10405 -53811 -89984 -68966 22642 53293 -3483 -42209 -75321
16455 -75321 -110037 1189 32184 -6612 8247 75223 83623 29239 -37283 -95705 -43255 -46390
16443 -46390 -91269 -101276 -56362 -20468 -24702 26051 22920 19993 -9216 -7278 6447 -36202
16431 -36202 -26055 -10687 8202 62091 24183 -34736 19580 44338 56130 9640 -37378 -52508
16419 -52508 -46564 -99497 -178105 -122457 -65466 17727 5581 -44298 -53239 -33458 -22272 -37814
16407 -37814 18103 58540 43695 58552 -6867 -26757 -11007 -50533 -80534 -73090 -87275 -82239
16395 -82239 -27042 -35439 -48568 19726 63606 74470 96889 83873 62022 -12715 -77546 -6301
$$ packed form
16479b8810j7538Q0400p508k3347k2018J3861n4665O447N4918P751k959j4551
16467h019M2338J8495n6983J4574o4216l6173K1018R1608L0651n6776l8726l3112
16455g5321l4716J11226L0995l8796J4859O6976Q400n4384o6522n8422N2450l135
16443d6390m4879j0007M4914L5894m234N0753l131k927k9209J938J3725m2649
16431c6202J0147J5368J8889N3889l7908n8919N4316K4758J1792m6490m7018j5130
16419e2508N944n2933p8608N5648N6991Q3193j2146m9879q941J9781J1186j5542
16407c7814N5917M0437j4845J4857o5419j9890J5750l9526l0001P444j4185N036
16395h2239N5197q397j3129O8294M3880J0864K2419j3016k1851p4737o4831P1245
$$ plain form
16383 -6301 2694 28502 72939 55078 115906 150554 91199 43019 31036 55922 63993 37642
16371 37642 -10016 -15964 49068 53658 49241 134751 53977 -17613 4209 -22246 -53544 -101057
16359 -101057 -80762 -127365 -74824 -56042 -36082 -52693 -38944 -41461 -27900 -2328 59717 82590
16347 82590 -33523 -14454 -24974 -35762 -41510 -13533 -34406 -9204 47639 -26532 -141531
16336 -141531 -120992 -75145 -49333 -19106 74840 169948 100287 32620 80086 12821 -83829
16325 -83829 -98562 -93986 -56141 -7632 38354 80724 86651 61839 6472 -6635 -31387 -32888
16313 -32888 -75565 -78053 -84007 -26762 -94515 -62150 2664 35560 -50798 -71906 -110744 -102994
16301 -102994 -20585 -61440 -110231 -62260 -46165 -63257 -151263 -156005 -114526 -169868 -101186 56379
$$ packed form
16383f301Q995K5808M4437j7861O0828L4648n9355m8180j1983K4886Q071k6351
16371C7642m7658n948O5032M590m417Q5510q0774p1590K1822k6455l1298m7513
16359a01057K0295m6603N2541J8782J9960j6611J3749k517J3561K5572O2045K2873
16347H2590j16113J9069j0520j0788n748K7977k0873K5202N6843p4171j14999
16336a41531K0539M5847K5812L0227R3946R5108o9661o7667M7466o7265r6650
16325h3829j4733M576L7845M8509M5986M2370N927k4812n5367j3107k4752j501
16313c2888m2677k488n954N7245o7753L2365O4814L2896q6358k1108l8838P750
16301a02994Q2409m0855m8791M7971J6095j7092q8006m742M1479n5342O8682J57565
$$ plain form
16289 56379 54245 9083 -15901 57221 122312 124241 110796 116908 101688 49769 -8210 -26603
16277 -26603 77719 111663 110285 43309 53723 46716 82383 53120 9759 -85356 -59586 -2227
16265 -2227 71593 52402 33380 -34736 -118883 -111887 -98852 -83622 -31270 -10298 -13628 6177
16253 6177 53528 29545 -38251 -165721 -132112 -18336 79141 62877 -50663 -130115 -44684
16242 -44684 14561 5881 -5640 11038 28890 55757 57913 26208 8146 -40604 -81172 -45586
16230 -45586 3678 -29782 -126051 -143774 -76730 -10927 -4609 -36009 -83248 -114737 -55781 -20431
16218 -20431 -37690 18194 37370 -78449 -113122 -14102 28535 78524 7376 234 40997 33068
16206 33068 31212 -5421 -50978 -49512 26633 71976 30720 -12198 26966 2079 -50557 -70802
$$ packed form
16289E6379k134m5162k4984P3122O5091J929j3445O112j5220n1919n7979j8393
16277b6603J04322L3944j378o6976J0414p007L5667k9263m3361r5115K5770N7359
16265b227P3820j9191j9022o8116q4147O996J3035J5230N2352K0972l330J9805
16253F177M7351k3983o7796j27470L3609J13776R7477j6264j13540p9452Q5431
16242d4684N9245q680j1521J6678J7852K6867K156l1705j8062m8750m0568L5586
16230d5586M9264l3460r6269j7723O7044O5803O318l1400m7239l1489N8956L5350
16218b0431j7259N5884J9176j15819l4673R9020M2637M9989p1148p142M0763p929
16206C3068j856l6633m5557J466P6145M5343m1256m2918L9164k4887n2636k0245
$$ plain form
16194 -70802 -421 41085 6006 -30586 83635 38151 36201 -37453 -147937 -170510 -155519
16183 -155519 -101225 -7687 29207 -11795 -13784 -19184 -66320 -56261 -75799 -157142 -153259 -53432
16171 -53432 3628 -67899 -45939 -12976 -3845 -113148 -137114 -48620 -45761 -34170 17828 -13019
16159 -13019 -73985 -75588 -23342 90496 50920 -15580 10236 1838 -62387 -111608 -89028 -121905
16147 -121905 -137053 -65075 -137842 -216537 -225951 -219022 -227023 -239765 -136769 -95297 -76398 45291
16135 45291 32078 776 -10614 -23305 -182809 -118227 -162764 -198142 -94014 6327 -6055
16124 -6055 -47826 -49748 -49609 30093 15047 13442 26059 -69909 -66236 -119146 -74157 -92706 -85601
16111 -85601 -28380 -23321 -24472 23803 44673 34918 41228 104989 112807 51828 67528 133739 122605
$$ packed form
16194g0802P0381M1506l5079l6592J14221m5484j950p3654j10484k2573J4991
16183a55519N4294R3538L6894m1002j989n400m7136J0059j9538q1343L883R9827
16171e3432N7060p1527K1960L2963R131j09303k3966Q8494K859J1591N1998l0847
16159a3019o0966j603N2246J13838l9576o6500K5816q398o4225m9221K2580l2877
16147a21905j5148P1978p2767p8695r414O929q001j2742J02996M1472J8899J21689
16135D5291j3213l1302j1390j2691j59504O4582m4537l5378J04128J00341j2382
16124f055m1771j922J39P9702j5046j605J2617r5968L673n2910M4989j8549P105
16111h5601N7221N059j151M8275K0870r755O310O3761P818o0979J5700O6211j1134
$$ plain form
16098 122605 106407 63403 -17617 -30307 35621 9377 -21299 -84099 -158154 -177471 -108953
16087 -108953 -65051 -45295 -4603 -21011 -23229 28937 18413 93753 103060 123522 76965 66149
16075 66149 99960 59352 139974 117206 58653 131444 129672 40390 64869 72101 10900 -22575
16063 -22575 -62142 8219 80539 108710 88404 28574 12768 -63506 -149824 -95132 31218
16052 31218 51798 2794 -31891 41146 86099 40105 29103 94525 78139 34947 -22071 -62814
16040 -62814 -84476 -43340 72305 89147 89794 85632 21881 -33564 -41483 -6795 -26416 -54083
16028 -54083 -77387 -79520 -133046 -146931 -64190 137 -16040 -37667 36683 5058 -7250 30646
16016 30646 -28123 -54204 -71478 -80456 -87854 21633 77076 -10200 -51202 -10211 78284 87952
$$ packed form
16098A22605j6198m3004q1020j2690O5928k6244l0676o2800p4055j9317O8518
16087a08953M3902J9756M0692j6408k218N2166j0524P5340R307K0462m6557j0816
16075F6149L3811m0608Q0622k2768n8553P2791j772q9282K4479P232o1201l3475
16063b2575l9567P0361P2320K8171k0306n9830j5806p6274q6318N4692J26350
16052C1218K0580m9004l4685P3037M4953m5994j1002O5422j6386m3192n7018m0743
16040f2814k1662M1136J15645J6842O47m162o3751n5445p919L4688j9621k7667
16028e4083k3304k133n3526j3885Q2741O4327j6177k1627P4350l1625j2308L7896
16016C0646n8769k6081j7274q978p398J09487N5443q7276m1002M0991Q8495R668
$$ plain form
16004 87952 52220 -17673 66371 79719 84995 69099 36746 -3966 -32390 -31836 -35186 -16892
15992 -16892 -19938 -113148 -140796 -102064 -50673 83825 105107 -23324 -123461 -143260 -118768
15981 -118768 -182116 -129004 -99693 -55455 41331 28411 9191 -4217 16738 20430 23575 -60395
15969 -60395 -86332 -99365 -48773 10210 10706 76379 145321 62270 42412 69141 -26257 4425
15957 4425 32848 -41997 -294 68539 125575 138550 96005 41721 -72499 -54985 16095 41396
15945 41396 -2642 -36897 -84222 -110359 -77484 -110836 -31029 1449 -20123 -31558 50674 4366
15933 4366 31670 59694 33297 -43681 -33351 39097 121489 106727 73840 90795 189828 138007
15921 138007 102312 29656 -52300 -5233 -10903 -31272 -20621 -51333 -140468 -163367 -51619
$$ packed form
16004H7952l5732o9893Q4044J3348N276j5896l2353m0712k8424N54l350J8294
15992a6892l046r3210k7648L8732N1391J34498K1282j28431j00137j9799K4492
15981a18768o3348N3112K9311M4238R6786j2920j9220j3408K0955L692L145q3970
15969f0395k5937j3033N0592N8983M96O5673O8942q3051j9858K6729r5398L0682
15957D425K8423p4845M1703O8833N7036J2975m2545n4284j14220J7514P1080K5301
15945D1396m4038l4255m7325k6137L2875l3352P9807L2478k1572j1435Q2232m6308
15933D366K7304K8024k6397p6978J0330P2448Q2392j4762l2887J6955R9033n1821
15921A38007l5695p2656q1956M7067n670k0369J0651l0712q9135k2899J11748
$$ plain form
15910 -51619 71856 51400 -15369 23547 -13582 -107422 -94100 -82927 -141458 -65157 1009
15899 1009 21695 4804 15451 32025 -38668 -25754 13743 44458 -5128 -95033 -140785 -115036
15887 -115036 -2157 14913 3339 33331 -12029 -68734 -119155 -167758 -130872 -81983 -56615
15876 -56615 57808 88580 7556 -11399 34396 16321 5369 6610 125159 164710 27813
15865 27813 -4221 -73248 -91782 -66618 -51586 -30945 7864 40972 14807 30733 72342 110191
15853 110191 106579 123686 55731 -307 -49086 -68659 -95890 -69984 -50242 -8508 -80525 -62332
15841 -62332 7229 -3519 -33414 -110726 -37021 -48964 -119155 -116442 -90463 -112998 -56940 -44406
15829 -44406 -83852 -101403 -9299 -23922 -10958 -20065 -43253 -80409 10392 102792 98378 96740
$$ packed form
15910e1619J23475k0456o6769L8916l7129r3840J3322J1173n8531P6301O6166
15899A009K0686j6891J0647J6574p0693J2914L9497L0715m9586q9905m5752K5749
15887a15036J12879J7070j1574K9992m5360n6705n0421m8603L6886M8889K5368
15876e6615J14423L0772q1024j8955M5795j8075j0952J241J18549L9551j36897
15865B7813l2034o9027j8534K5164J5032K0641L8809L3108k6165J5926M1609L7849
15853A10191l612J7107o7955n6038m8779j9573k7231K5906J9742M1734p2017J8193
15841f2332O9561j0748k9895p7312P3705j1943p0191K713K5979k2535N6058J2534
15829d4406l9446j7551R2104j4623J2964r107k3188l7156R0801R2400m414j638
$$ plain form
15817 96740 125428 125632 93821 103602 50963 4368 17543 36432 21973 -28885 -66035 34263
15805 34263 80570 37864 -3707 -44682 -51202 -83343 -33744 38278 40488 -58400 -75534 -109962
15793 -109962 -75356 -65057 -52734 -5259 -17167 -46476 -39501 35978 95711 31750 12124 -40988
15781 -40988 -44718 34000 162898 128060 -30543 -89128 7635 31108 111380 96124 76349
15770 76349 833 10049 5062 -4230 -72865 -76332 -43998 -29192 -24041 -64999 -13771 10269 4612
15757 4612 1247 -23757 -81583 -54666 -39622 -71310 -145816 -120751 -50504 -37136 -35328 -49802
15745 -49802 -2298 34592 -8794 -30713 24413 -7920 -129253 -192433 -156401 -55938 -57200
15734 -57200 -65300 -55556 -13129 52895 41841 93469 129101 84161 -48169 -110473 -144275 -94414
$$ packed form
15817I6740K8688K04l1811R781n2639m6595J3175J8889j4459n0858l7150J00298
15805C4263M6307m2706m1571m0975o520l2141M9599P2022K210r8888j7134l4428
15793a09962L4606J0299J2323M7475j1908k9309O975P5479N9733o3961j9626n3112
15781d0988l730P8718J28898l4838j58603n8585R6763K3473Q0272j5256j9775
15770G6349p5516R216m987r292o8635l467L2334J4806N151m0958N1228K4040n657
15757D612l365k5004n7826K6917J5044l1688p4506K5065P0247J3368J808j4474
15745d9802M7504L6890m3386k1919N5126l2333j21333o3180L6032J00463j262
15734e7200q100R744M2427O6024j1054N1628L5632m4940j32330o2304l3802M9861
$$ plain form
15722 -94414 -18449 4956 65685 24019 1529 -26612 34931 106581 77602 41792 -11225 -58515
15710 -58515 1180 45637 69250 95599 93560 -12640 -143874 -129310 -19909 18877 10190
15699 10190 41878 -27343 -26887 12587 -9036 -30673 -70643 -121648 -73131 -49642 -87456 -110028
15687 -110028 -139357 -154356 -117356 -93838 211 92698 3240 -66747 -385 -1260 48415 98006
15675 98006 81757 -9639 -34592 -90769 -60679 -3955 -18188 -81677 -70317 12864 -52173 14884
15663 14884 8399 -3153 -19934 21958 39737 -6201 80202 100253 52108 20085 16758 28872
15651 28872 -13436 -126808 -223269 -215223 -193271 -157573 -172520 -122050 -18961 38789 34891 -12998
15639 -12998 -32721 1805 4520 -22001 22036 21613 -70710 -93434 -20801 -26636 -73652 -128156
$$ packed form
15722i4414P5965K3405O0729m1666k2490k8141O1543P1650k8979l5810n3017m7290
15710e8515N9695M4457K3613K6349k039j06200j31234J4564J09401L8786q687
15699A0190L1688o9221M56L9474k1623k1637l9970n1005M8517K3489l7814k2572
15687a10028k9329j4999L7000K3518R4049R2487q9458o9987O6362q75M9675M9591
15675I8006j6249r1396k4953n6177L0090N6724j4233o3489J1360Q3181o5037O7057
15663A4884o485j1552j6781M1892J7779m5938Q6403K0051m8145l2023l327J2114
15651B8872m2308j13372r6461Q046K1952L5698j4947N0470J03089N7750l898m7889
15639a2998j9723L4526K715k6521M4037m23r2323k2724P2633n835m7016n4504
$$ plain form
15627 -128156 -87435 17921 94213 125577 85053 62487 -26786 -69680 -52922 -51772 -54374 -45523
15615 -45523 -36425 -36293 34347 81465 109719 74025 57791 109041 92389 90125 101490 81747
15603 81747 34582 51663 36938 -23483 -38692 1019 59556 122829 52174 -54855 -93298
15592 -93298 -57552 -123596 -121672 -77190 -82051 -81255 -127567 -97901 -5493 15802 35273 46286
15580 46286 454 -18194 54195 82012 72481 73193 70487 42898 -38767 34566 96581 87257 15749
15567 15749 -44198 -4407 33253 60968 81248 92779 120971 24760 -74780 -37521 18083 -17551
15555 -17551 -84242 -116506 -109233 -108443 -12071 -45769 -69885 -104674 -120106 -108764 -83302 724
15543 724 -34051 -91107 -65347 -21582 -27302 -73326 -90466 -45283 21286 109208 79039 17092
$$ packed form
15627a28156M0721J05356P6292L1364m0524k2566q9273m2894J6758J150k602Q851
15615d5523R098J32P0640M7118K8254l5694j6234N1250j6652k264J1365j9743
15603H1747m7165J7081j4725o0421j5209L9711N8537O3273p0655j07029l8443
15592i3298L5746o6044J924M4482m861P96m6312K9666R2408K1295J9471J1013
15580D6286m5832j8648P2389K7817r531P12k706k7589q1665P3333O2015r324p1508
15567A5749n9947L9791L7660K7715K0280J1531K8192r6211r9540L7259N5604l5634
15555a7551o6691l2264P273P90R6372l3698k4116l4789j5432J1342K5462Q4026
15543G24l4775n7056K5760M3765n720m6024j7140M5183O6569Q7922l0169o1947
$$ plain form
15531 17092 -23935 -71384 -76884 -40010 -339 33465 68803 53489 98696 65938 -74230 -125297
15519 -125297 -166690 -133655 -67137 -44667 37962 94888 112596 157053 234424 189452 183700 111513
15507 111513 141827 221343 176563 134978 79565 44034 42829 104864 157326 65192 -48660
15496 -48660 -55797 21851 62207 94665 97687 93180 31074 -79297 -102682 -162942 -106839 -105884
15484 -105884 -157942 -204179 -146002 -57528 -31291 -42999 68261 65435 -42801 -84028 -43526
15473 -43526 -33522 47902 13220 15878 49860 52908 122892 70312 14125 -10821 -75327 -73730
15461 -73730 -32240 25143 8444 -58015 -66638 -4224 37175 -36615 -47939 -77624 -121773 -104442
15449 -104442 -57048 -4113 3010 -32147 -52107 -96762 -54686 54036 -29103 -104775 -87272
$$ packed form
15531A7092m1027m7449n500L6874L9671L3804L5338j5314M5207l2758j40168n1067
15519a25297m1393L3035O6518K2470Q2629N6926J7708M4457P7371m4972n752p2187
15507A11513L0314P9516m4780m1585n5413l5531j205O2035N2462r2134j13852
15496d8660p137P7648M0356L2458L022m507o2106j10371k3385o0260N6103R55
15484a05884n2058m6237N8177Q8474K6237j1708J11260k826j08236m1227M0502
15473d3526J0004Q1424l4682K658L3982L048O9984n2580n6187k4946o4506J597
15461g3730M1490N7383j6699o6459q623O2414M1399p3790j1324k9685m4149J7331
15449a04442M7394N2935P123l5157j9960m4655M2076J08722q3139p5672J7503
$$ plain form
15438 -87272 -50668 -67199 -85498 -42471 -46885 -82573 -176433 -168567 -100607 -25994 -30946 45480
15426 45480 25666 -11 -73075 -60416 24473 6340 -19836 -58954 17875 72949 76723 -2782
15414 -2782 -15162 17659 55180 27173 -12964 6347 -27334 -57414 -37232 -20850 -59463 -492
15402 -492 58936 117089 162381 119970 54984 -90177 -195805 -165273 -93052 -44013 -69043 -179285
15390 -179285 -167828 -43557 28775 76741 38095 8710 43117 50465 -1575 -49302 -11938
15379 -11938 82493 61733 -3692 -5867 -41879 -86652 -13210 9088 125066 174542 174269 171083
15367 171083 134644 33894 18166 49585 35545 2662 -26605 -46360 -78201 -69999 -15328
15356 -15328 35173 21836 -69624 -44233 -97390 -54380 -25699 -33366 -21472 60243 -6902 -89453
$$ packed form
15438h7272L6604j6531j8299M3027m414l5688r3860P866O7960P4613m952P6426
15426D5480j9814k5677p3064J2659Q4889j8133k6176l9118P6829N5074L774p9505
15414b782j2380L2821L7521k8007m0137J9311l3681l0080K0182J6382l8613N8971
15402d92N9428N8153M5292m2411o4986j45161j05628L0532P2221M9039k5030j10242
15390a79285J1457J24271P2332M7966l8646k9385L4407P348n2040m7727L7364
15379a1938R4431k0760o5425k175l6012m4773P3442K2298J15978M9476k73l186
15367A71083l6439j00750j5728L1419j4040l2883k9267j9755l1841Q202N4671
15356a5328N0501j3337r1460K5391n3157M3010K8681p667J1894Q1715o7145q2551
$$ plain form
15344 -89453 -15672 76916 31414 -39440 -64299 -93286 -69577 13500 31844 27451 54927 96134
15332 96134 44816 13738 57646 16661 97785 112246 120803 86953 22966 31135 -20445 -47062
15320 -47062 -32070 -3062 7106 46132 35451 -22985 18348 41866 83700 106610 34731 81316
15308 81316 15397 -97003 -11197 -2664 -2977 43177 33125 -24875 -48659 -327 -37236 -54952
15296 -54952 -109428 -107155 -47322 -14664 -35323 33322 159657 105040 91304 35458 -6190 3603
15284 3603 -18668 -45994 44973 -4863 -87848 -86661 -32594 -43730 -47041 -81464 -47906 59045
15272 59045 19980 17482 8918 38872 60665 71006 115495 114499 103857 131106 126106 97011 28026
15259 28026 -96137 -168381 -126653 12627 136929 206811 193019 124186 94532 119055 93114
$$ packed form
15344h9453P3781R2588m5502p0854k4859k8987K3709Q3077J8344m393K7476M1207
15332I6134n1318l1078M3908m0985Q1124J4461Q557l3850o3987Q169n1580k6617
15320d7062J4992K9008J0168L9026j0681n8436M1333K3518M1834K2910p1879M6585
15308H1316o5919j12400Q5806Q533l13M6154j0052n8000k3784M8332l6909j7716
15296e4952n4476K273N9833L2658k0659O8645J26335n4617j3736n5846m1648R793
15284C603k2271k7326R0967m9836q2985J187N4067j1136l311l4423L3558J06951
15272E9045l9065k498q564K9954K1793J0341M4489r96j0642K7249n000k9095o8985
15259B8026j24163p2244M1728J39280J24302O9882j3792o8833k9654K4523k5941
$$ plain form
15248 93114 -56228 -140594 -70092 -13045 -81656 -143024 -149981 -111986 -66027 -53910 -93080 -184180
15236 -184180 -137444 -72013 -57127 -46026 -79658 -43376 31085 67389 80288 87359 36018 17834
15224 17834 62004 1142 -12791 15355 -4427 -37932 -337 31917 80851 175754 179345 89687
15212 89687 26274 10356 12135 -46369 -47340 -27183 22774 21229 63292 91413 8988 24140
15200 24140 5337 66424 143833 101211 -5859 -34392 -115808 -173043 -176643 -119656 -70939 -113957
15188 -113957 -146606 -152506 -66666 -19702 26996 77846 55620 8233 -30814 -10243 1845 -11488
15176 -11488 -50692 -101827 -146181 -130956 -66967 -94945 -30458 22345 37082 -15706 -80226 -95604
15164 -95604 -75100 -79419 -110008 -91829 12964 9532 -58552 -40239 -37758 -100985 -110811 -140275
$$ packed form
15248I3114j49342q4366P0502N7047o8611o1368o957L7995M5959J2117l9170r1100
15236a84180M6736O5431J4886J1101l3632L6282P4461L6304J2899P071n1341j8184
15224A7834M4170o0862j3933K8146j9782l3505L7595L2254M8934R4903L591q9658
15212H9687o3413j5918J779n8504r71K0157M9957j545M2063K8121q2425J5152
15200B4140j8803O1087P7409m2622j07070k8533q1416n7235l600N6987M8717m3018
15188a13957l2649n900Q5840M6964M6698N0850k2226m7387l9047K0571J2088j3333
15176a1488l9204n1135m4354J5225O3989k7978O4487N2803J4737n2788o4520j5378
15164i5604K0504m319l0589J8179J04793l432o8084J8313K481o3227r826k9464
$$ plain form
15152 -140275 -114565 -92245 -63875 -147267 -97529 -82093 -73399 -38484 -7082 -4198 -29712 -94162
15140 -94162 -81680 -42454 12726 63760 25514 15560 97737 181993 240348 229335 211346 185307
15128 185307 132550 125958 69681 4423 -6034 -1109 42882 33035 25597 58681 27913 8304
15116 8304 27917 1859 74439 54548 -25075 -971 -65112 -50708 -28657 16178 2341 -70694
15104 -70694 -102021 -37021 -13313 -31333 -6520 79679 66488 32531 38095 17066 74131 42097
15092 42097 -49470 -58572 3980 587 -20968 27905 -34722 -51695 -72454 -104003 -12598 44534
15080 44534 -1913 63369 69088 36524 5837 135136 147914 54334 32282 319 -80440 -68675
15068 -68675 -13278 67291 110260 71725 33432 42115 25760 22802 49075 74259 66024 134400
$$ packed form
15152a40275K5710K2320K8370q3392M9738J5436Q694L4915L1402K884k5514o4450
15140i4162J2482L9226N5180N1034l8246r954Q2177Q4256N8355j1013j7989k6039
15128A85307n2757o592n6277o5258j0457M925M3991r847p438L3084l0768j9609
15116H304J9613k6058P2580j9891p9623K4104o4141J4404K2051M4835j3837p3035
15104g0694l1327O5000K3708j8020K4813Q6199j3191l3957N564k1029N7065l2034
15092D2097r1567r102O2552l393k1555M8873o2627j6973k0759l1549R1405N7132
15080D4534m6447O5282N719l2564l0687J29299J2778r3580k2052l1963q0759J1765
15068f8675N5397Q0569M2969l8535l8293Q683j6355k958K6273K5184q235O8376
$$ plain form
15056 134400 75214 -43647 -75210 -87159 -132574 -55608 30424 149220 131722 150798 223835
15045 223835 146909 16532 -58982 -108831 -39907 40650 -4553 -19930 -58171 -23481 24995
15034 24995 33311 25546 40028 114084 182149 166358 178164 206599 115740 123649 110612 32602
15022 32602 69115 143641 250353 305056 318875 417018 592466 636671 761208 879128 1034625
15011 1034625 1268519 1747928 2380004 3111316 3984262 5169691 6417098 5503078 3173070
15002 3173070 1797138 1162784 810915 630247 585557 478087 397036 296209 205778 145380
14992 145380 101786 128405 118042 78576 75757 59382 53321 33229 -48857 -924 100777 96590
14980 96590 94971 33632 64309 119655 131833 50808 77368 151673 158126 145279 62205 50218
$$ packed form
15056A34400n9186j18861l1563j1949m5415P6966Q6032J18796j7498J9076P3037
15045B23835p6926j30377p5514m9849O8924Q0557m5203j5377l8241L4690M8476
15034B4995Q316p765J4482P4056O8065j5791J1806K8435r0859P909j3037p8010
15022C2602L6513P4526J06712N4703J3819R8143J75448M4205J24537J17920J55497
15011A034625K33894M79409O32076P31312Q72946J185429J247407r14020k330008
15002C173070j375932o34354l51869j80668m4690j07470q1051j00827r0431o0398
14992A45380m3594K6619j0363l9466k819j6375o061k0092q2086M7933J01701m187
14980I6590j619o1339L0677N5346J2178q1025K6560P4305O453j2847q3074j1987
$$ plain form
14968 50218 120761 132132 64223 67838 95772 117909 147846 100753 16581 -39005 -72347 -89479
14956 -89479 -86256 -58909 -79158 -43795 11014 31101 26298 701 49542 54322 92029 105455
14944 105455 20870 46336 52819 32907 -20084 -75344 -28801 -57746 -27496 48091 16036 57543
14932 57543 46856 24520 38388 -8498 -81308 -135609 -190327 -172656 -133865 358 58873
14921 58873 48240 19430 -30894 6496 -68723 -54911 -2854 -47892 -2631 84348 62148 -39490
14909 -39490 -137865 -118925 -40340 -17095 -24614 31755 42049 38879 -7145 -140836 -220823 -139950
14897 -139950 -38216 26543 17826 4696 73540 18107 -12432 35509 23149 27767 7925 42766
14885 42766 78717 77105 -15351 -13926 22582 24725 70467 89826 3291 840 68381 132883
$$ packed form
14968E0218P0543J1371o7909L615K7934K2137K9937m7093q4172n5586l3342j7132
14956h9479L223K7347k0249L5363N4809K0087m803k5597M8841M780L7707J3426
14944A05455q4585K5466O483j9912n2991n5260M6543k8945L0250P5587l2055M1507
14932E7543j0687k2336J3868m6886p2810n4301n4718J7671L8791J34223N8515
14921E8873j0633k8810n0324L7390p5219J3812N2057m5038M5261Q6979k2200j01638
14909c9490r8375J8940P8585K3245p519N6369J0294l170m6024j33691p9987Q0873
14897a39950J01734O4759q717j3130O8844n5433l0539M7941j2360M618j9842L4841
14885D2766L5951j612r2456J425L6508K143M5742J9359q6535k451O7541O4502
$$ plain form
14873 132883 145725 150452 16042 -75540 5312 129215 199226 64627 3711 54466 193934
14862 193934 153769 189336 223928 193584 193501 188205 148698 92556 90850 173249 144206 62166
14850 62166 53443 4275 18404 95991 96156 62853 34186 -471 38663 107399 163238 125748
14838 125748 87011 11762 -39979 662 36442 26027 97557 106869 83019 37377 -1056 12882
14826 12882 35485 -2129 40156 132907 144727 115202 128453 146159 80243 25900 57729 33689
14814 33689 15392 18660 23995 25126 -5674 20854 72370 76740 37883 4722 39109 55524
14802 55524 54908 -21090 -37702 -79026 -39837 44954 12239 -1330 46966 41020 26658 39652
14790 39652 49034 35819 -62400 -37996 -8902 56692 96341 31575 -19549 -25963 -64504 -49904
$$ packed form
14873A32883J2842M727j34410r1582Q0852J23903P0011j34599o0916N0755J39468
14862A93934m0165L5567L4592l0344q3n296l9507n6142j706Q2399k9043q2040
14850F2166q723m9168J4129P7587J65l3303k8667l4657L9134O8736N5839l7490
14838A25748l8737p5249n1741M0641L5780j0415P1530R312k3850m5642l8433J3938
14826A2882K2603l7614M2285R2751J1820k9525J3251J7706o5916n4343L1829k4040
14814C3689j8297L268N335J131l0800K6528N1516M370l8857l3161L4387J6415
14802E5524o16p5998j6612m1324L9189Q4791l2715j3569M8296n946j4362J2994
14790C9652R382j3215r8219K4404K9094O5594L9649o4766n1124o414l8541J4600
$$ plain form
14778 -49904 3843 29555 30732 137994 213726 124628 16044 -69905 -50243 -17204 27802
14767 27802 3809 -46635 -9555 5986 -36507 -9664 21241 -16390 -36577 -11429 75504 123311
14755 123311 150724 96252 80148 80079 81554 -34267 -162762 -216725 -169262 -71604 -72595 -67963
14743 -67963 -132813 -115215 -53021 26501 53552 93667 77900 13605 -7652 8012 -53644 6192
14731 6192 94464 91015 146554 96711 87978 92258 100243 148238 92592 62811 95635 142830 164926
14718 164926 196934 240087 230657 233531 231801 166356 59443 148215 188568 123581 163617 167873
14706 167873 164770 129957 138683 105028 -11340 17892 229428 234461 298826 379710 411643 436310
14694 436310 420076 436270 589819 691134 862424 1265220 1630421 1876652 2083964 2139290
$$ packed form
14778d9904N3747K5712J177J07262P5732q9098j08584q5949J9662L3039M5006
14767B7802k3993n0444L7080J5541m2493K6843L0905l7631k0187K5148Q6933M7807
14755A23311K7413n4472j6104o9J475j15821j28495n3963M7463R7658r91M632
14743f7963o4850J7598O2194P9522K7051M0115j5767o4295k1257J5664o1656N9836
14731F192Q8272l449N5539m9843q733M280P985M7995n5646k9781L2824M7195K2096
14718A64926L2008M3153r430K874j730o5445j06913Q8772M0353o4987M0036M256
14706A67873l103l4813Q726l3655j16368K9232K11536N033O4365Q0884L1933K4667
14694D36310j6234J6194J53549J01315J71290M02796L65201K46231K07312N5326
$$ plain form
14684 2139290 2041083 1843500 1566696 1274693 982515 796559 632382 516711 339026 236307
14674 236307 228552 231966 219481 191691 210539 219242 188052 90926 21037 -31471 -13647 68160
14662 68160 80932 12610 -8196 8938 -48427 -118422 -71034 65071 95394 109048 173737
14651 173737 265779 242800 221841 188165 109231 66549 3104 -18439 46438 101031 44569
14640 44569 21534 127388 103852 126996 108947 97483 75096 79519 115118 71907 76906 96928
14628 96928 45948 56088 191667 175698 127300 76996 67539 11081 -4221 35015 54086 78473
14616 78473 77569 23254 -821 -3862 63893 78572 27331 -9821 -24126 -57770 -18289 2082
14604 2082 -20559 -32177 38092 142926 144001 100107 93503 138611 198102 161977 62151 30626
$$ packed form
14684B139290r8207j97583k76804k92003k92178j85956j64177j15671j77685j02719
14674B36307p755L414j2485k7790J8848Q703l1190r7126o9889n2508J7824Q1807
14662F8160J2772o8322k0806J7134n7365o9995M7388J36105L0323J3654O4689
14651A73737R2042k2979k0959l3676p8934m2682o3445k1543O4877N4593n6462
14640D4569k3035J05854k3536K3144j8049j1464k2387M423L5599m3211M999K0022
14628I6928n0980J0140J35579j5969m8398n0304r457n6458j5302L9236J9071K4387
14616G8473r04n4315k4075l041O7755J4679n1241l7152j4305l3644L9481K0371
14604B082k2641j1618P0269J04834J075m3894o604M5108N9491l6125r9826l1525
$$ plain form
14592 30626 38203 41192 128926 147698 85838 85703 41266 -33697 -13998 41396 96954 76415
14580 76415 62152 71870 36770 33904 61716 105664 147731 105934 91398 18333 48751 57105
14568 57105 52278 13086 12244 -52925 -47142 35798 102851 121364 141893 150233 167964 174301 128460
14555 128460 125696 76169 68940 12470 7008 -42061 -11187 -26994 -51404 17013 160624 141818
14543 141818 117289 97951 14442 -61686 1367 36728 -7863 2007 33544 118472 149558 110321
14531 110321 34145 9217 -17625 -6109 40656 158593 148163 83678 84787 127706 96559
14520 96559 125312 138987 158008 92093 101593 20302 82872 211282 220669 193084 124500 50010
14508 50010 67307 59825 -14408 -28309 28454 51088 65555 165283 201431 172113 123475 49197
$$ packed form
14592C0626P577K989Q7734J8772o1860j35m4437p4963J9699N5394N5558k0539
14580G6415j4263R718l5100k866K7812M3948M2067m1797j4536p3065L0418Q354
14568E7105m827l9192q42o5169N783Q2940O7053J8513K0529Q340J7731O337m5841
14555A28460k764m9527p229n6470n462m9069L0874j5807k4410O8417J43611j8806
14543A41818k4529j9338q3509p6128O3053L5361m4591R870L1537Q4928L1086l9237
14531A10321p6176k4928k6842J1516M6765J17937j0430o4485J109M2919l1147
14520I6559K8753J3675J9021o5915R500q1291O2570J28410R387k7585o8584p4490
14508E0010J7297p482p4233j3901N6763K2634J4467R9728L6148k9318m8638p4278
$$ plain form
14496 49197 27052 113623 172783 169017 141970 94331 87745 154193 173097 242879 253687 193783
14484 193783 191750 283797 363285 388074 343003 292024 294720 305814 362543 351851 266467 201684
14472 201684 172414 156555 160251 87821 58034 57083 37658 -13381 58547 88497 31158 10158
14460 10158 -57526 -2524 13736 88878 77040 100756 84926 61824 143671 144189 114392 82785
14448 82785 81721 145460 159434 103434 78942 37589 71966 179929 217499 318709 362436
14437 362436 324374 334044 337379 281536 192414 158018 232695 279956 294424 213716 142585 39840
14425 39840 -8293 66965 92187 118256 128786 138691 15983 -20034 48006 92948 24410 29655
14413 29655 22367 29779 -31621 -60620 3463 68402 -43406 -124637 -153429 -61135 103529 157959
$$ packed form
14496D9197k2145Q6571N9160l766k7047m7639o586O6448J8904O9782J0808n9904
14484A93783k033R2047P9488K4789m5071n0979K696J1094N6729j0692q5384o4783
14472B01684k9270j5859L696p2430k9787r51j9425n1039P1928K9950n7339k1000
14460A0158o7684N5002J6260P5142j1838K3716j5830k3102Q1847N18k9797l1607
14448H2785j064O3739J3974n6000k4492m1353L4377J07963L7570J01210M3727
14437C62436l8062R670L335n5843q9122l4396P4677M7261J4468q0708p1131j02745
14425C9840m8133P5258K5222K6069J0530R905j22708l6017O8040M4942o8538N245
14413B9655p288P412o1400k8999O4083O4939j11808q1231k8792R2294J64664N4430
$$ plain form
14401 157959 114633 160435 139165 151745 176525 141519 80152 -7059 -21357 -86371 -138396
14390 -138396 -111153 -98200 -118769 -67531 19519 181624 243875 86222 17685 80055 215882
14379 215882 263087 281493 315201 443004 492644 476265 493016 577354 706191 751255 815669
14368 815669 888465 919743 928216 958297 1076299 1225886 1269491 1283125 1225129 1249186 1152023
14357 1152023 1014287 892239 718228 595523 572589 496073 437626 330089 224934 221840
14347 221840 232291 289548 293906 285868 252923 196327 248073 290932 255263 258853 299026 242019
14335 242019 248755 268257 356552 406187 372777 305769 271742 311998 313834 341705 460210 486390
14323 486390 514847 481533 402710 364562 422717 467314 500990 514391 523337 487931 383042
$$ packed form
14401A57959m3326M5802k1270J2580K4780l5006o1367q7211j4298o5014n2025
14390a38396K7243J2953k0569N1238Q7050J62105O2251j57653o8537O2370J35827
14379B15882M7205J8406L3708J27803M9640j6379J6751Q4338J28837M5064O4414
14368H15669P2796L1278Q473L0081J18002J49587M3605J3634n7996K4057r7163
14357A152023j37736j22048j74011j22705k2934p6516n8447j07537j05155l094
14347B21840J0451N7257M358q038l2945n6596N1746M2859l5669L590M0173n7007
14335B42019O736J9502Q8295M9635l3410o7008l4027M0256J836K7871J18505K6180
14323D86390K8457l3314p8823l8148N8155M4597L3676J3401Q946l5406j04889
$$ plain form
14312 383042 397598 418328 520748 622280 662108 626756 667116 706058 702445 739883 693022
14301 693022 712694 682857 684551 744795 806083 922185 927583 881815 952786 1028681 1108392 1136919
14289 1136919 1111712 1090312 1104062 1144005 1133125 1169194 1266077 1308809 1367144 1527114 1688770
14278 1688770 1825029 1887451 1966501 2061964 2115242 2227148 2408944 2533877 2732858 3061240
14268 3061240 3441153 3863190 4321818 4830353 5386170 5994155 6552273 7334301 8303663
14259 8303663 9420668 10732941 12456592 14713563 17369282 20449903 23900487 27645069
14251 27645069 31767058 36241076 41328254 47465484 55005186 64606452 77387369 94540280
14243 94540280 117762893 149086389 190407858 240506902 293694057 343224938 378543708
$$ packed form
14312C83042J4556K0730J02420J01532L9828l5352M0360L8942l613L7438m6861
14301F93022J9672k9837J694O0244O1288J16102N398m5768P0971P5895P9711K8527
14289A136919k5207k1400J3750L9943j0880L6069R6883M2732N8335J59970J61656
14278A688770J36259O2422P9050R5463N3278J11906J81796J24933J98981L28382
14268C061240L79913M22037M58628N08535N55817O07985N58118P82028R69362
14259H303663J117005J312273J723651K256971K655719L080621L450584L744582
14251B7645069M121989M474018N087178O137230P539702R601266J2780917J7152911
14243I4540280K3222613L1323496M1321469N0099044N3187155M9530881L5318770
$$ plain form
14236 378543708 392832969 381405823 343990276 290773330 229941814 171993481 123733880
14229 123733880 87364992 63661951 48844150 39241172 32945674 28722789 25824965
14222 25824965 23622759 21671773 19912860 18131520 16086164 14102300 12247569 10583969
14214 10583969 9192234 8039513 7133672 6473107 5942990 5552198 5196768 4866300 4569694
14205 4569694 4337498 4118721 3882132 3673054 3455659 3226674 2995173 2845868 2730109
14196 2730109 2474321 2263797 2143164 2041733 1888231 1688383 1661029 1687747 1683423 1609144
14186 1609144 1537583 1445933 1372027 1420334 1354789 1290852 1238392 1164160 1089882 1093369 1152509
14175 1152509 1208761 1154787 1042688 939858 861721 838497 750037 689096 671070 644685 669193
$$ packed form
14236C78543708J4289261j1427146l7415547n3216946o0831516n7948333m8259601
14229A23733880l6368888k3703041j4817801r602978o295498m222885k897824
14222B5824965k202206j950986j758913j781340k045356j983864j854731j663600
14214A0583969j391735j152721r05841o60565n30117l90792l55430l30468k96606
14205D569694k32196k18777k36589k09078k17395k28985k31501j49305j15759
14196B730109k55788k10524j20633j01431j53502j99848k7354K6718m324p4279
14186A609144p1561r1650p3906M8307o5545o3937n2460p4232p4278L487N9140
14175A152509N6252n3974j12099j02830p8137k3224q8460o0941j8026k6385K4508
$$ plain form
14164 669193 662824 727636 801023 711357 695134 696694 631032 568611 597098 560998 594714 701033
14152 701033 662313 660307 681716 612768 531337 512370 485225 382123 376275 437685 488459 482918
14140 482918 428746 378994 395035 457768 525804 576797 701389 707833 585494 495530 504353
14129 504353 573782 677296 646516 526244 448865 469933 504555 554470 600362 643710 650743
14118 650743 630873 536139 439089 349864 322363 246492 168791 155293 133618 111415 -36371
14107 -36371 -36291 30720 14739 76643 201297 138364 117905 151955 129015 98492 179585 254053
14095 254053 276321 268499 325273 347199 353028 385110 398308 474685 393763 345096 309437 276053
14083 276053 269083 322063 424116 360223 254237 253811 338206 386793 362876 365921 381830 365914
$$ packed form
14164F69193o369O4812P3387q9666j6223J560o5662o2421K8487l6100L3716J06319
14152G01033l8720k006K1409o8948q1431j8967k7145j03102n848O1410N0774n541
14140D82918n4172m9752J6041O2733O8036N0993J24592O444j22339q9964Q823
14129E04353O9429J03514l0780j20272p7379K1068L4622M9915M5892M3348P033
14118F50743j9870r4734r7050q9225k7501p5871p7701j3498k1675k2203j47786
14107c6371Q0O7011j5981O1904J24654o2933k0459L4050k2940l0523Q1093P4468
14095B54053K2268p822N6774K1926N829L2082J3198P6377q0922m8667l5659l3384
14083B76053o970N2980J02053o3893j05986m26Q4395M8587k3917L045J5909j5916
$$ plain form
14071 365914 333452 235763 251305 239584 229815 286166 319436 229898 177203 182035 183242 137856
14059 137856 111300 217497 238662 228741 229910 244425 243844 313765 298470 187003 129786 102088
14047 102088 71613 61735 -26571 -42306 28121 49376 16767 15577 52523 -13221 -36436 23050
14035 23050 105523 72246 104802 105874 90758 74740 69092 53754 7246 7566 9085 21058 89022
14022 89022 137347 182715 168345 119875 138868 109388 143858 252348 269223 191607 217231
14011 217231 308001 274977 151988 143856 221593 297519 216242 191663 131344 56822 -20725
14000 -20725 8532 62866 71627 89720 82529 71259 38239 110857 154271 143749 111999 192210
13988 192210 237369 217974 203227 233082 102683 35694 20387 100209 133353 134240 28977
$$ packed form
14071C65914l2462r7689J5542j1721r769N6351L3270q9538n2695M832J207m5386
14059A37856k6556J06197K1165r921J169J4515n81O9921j5295j11467n7217k7698
14047A02088l0475r878q8306j5735P0427K1255l2609j190L6946o5744k3215N9486
14035B3050Q2473l3277L2556J072j5116j6018n648j5338m6508L20J519J1973O7964
14022H9022M8325M5368j4370m8470J8993k9480L4470J08490J6875p7616K5624
14011B17231R0770l3024j22989q132P7737P5926q1277k4579o0319p4522p7547
14000b0725K9257N4334Q761J8093p191j1270l3020P2618M3414j0522l1750Q0211
13988A92210M5159j9395j4747K9855j30399o6989j5307P9822L3144Q87j05263
$$ plain form
13977 28977 12689 -3269 37 79337 153367 44465 21082 71714 111569 155295 170566 193590
13965 193590 207371 259013 286656 169909 120038 66879 94553 127776 161947 71347 43143
13954 43143 -2671 47292 58482 53376 55830 104425 130001 144039 179036 111605 54345 33215
13942 33215 6392 -5824 19053 57018 78249 54634 35628 -17209 -88481 -76480 2319 -52786
13930 -52786 -138242 -74894 70531 90665 -41956 17788 122359 84783 10055 18367 61949
13919 61949 48076 56798 129500 101877 91172 123847 137595 93974 125053 136960 101800 67798
13907 67798 52433 -19803 -44456 21559 52252 47138 53833 12727 9158 80876 64790 101425
13895 101425 75190 121015 142646 77778 -63688 -92148 -78284 -17037 -22326 -34575 -13789
$$ packed form
13977B8977j6288j5958L306P9300P4030j08902k3383N0632L9855M3726J5271K3024
13965A93590J3781N1642K7643j16747m9871n3159K7674L3223L4171r0600k8204
13954D3143m5814M9963J1190n106K454M8595K5576J4038L4997o7431n7260k1130
13942C3215k6823j2216K4877L7965K1231k3615j9006n2837p1272J2001P8799n5105
13930e2786q5456O3348J45425K0134j32621N9744J04571l7576p4728Q312M3582
13919F1949j3873Q722P2702k7623j0705L2675J3748m3621L1079J1907l5160l4002
13907F7798j5365p2236k4653O6015L0693n114O695m1106l569P1718j6086L6635
13895A01425k6235M5825K1631o4868j41466k8460J3864O1247n289j2249K0786
$$ plain form
13884 -13789 -20218 -7452 34102 27748 47700 97043 120500 75252 65365 90557 142549 210021
13872 210021 172405 150005 127316 100991 42257 -29709 22484 109878 134139 118279 123634 99480
13860 99480 98371 90758 139399 82650 73226 17702 10328 93821 115898 38583 88757 91582 41440
13847 41440 62518 -18563 -62151 -28320 -31108 -48996 -1811 106479 40827 45442 59088 78647
13835 78647 52932 42887 37058 -17015 -10945 -15050 6263 944 -48975 -15657 20784 74733
13823 74733 120180 203112 164818 90041 11659 52665 79456 33419 -27729 -27739 -66047 -42461
13811 -42461 -33590 -60461 -104740 -68471 29337 24876 30523 167960 188053 173229 354376 436200
13799 436200 474184 501342 522641 564382 562593 600139 627097 626540 626255 619875 615538 693807 950410
$$ packed form
13884a3789o429J2766M1554o354J9952M9343K3457m5248r887K5192N1992O7472
13872B10021l7616k2400k2689k6325n8734p1966N2193Q7394K4261j5860N355k4154
13860I9480j109p613M8641n6749r424n5524p374Q3493K2077p7315N0174K825n0142
13847D1440K1078q1081m3588L3831k788j7888M7185J08290o5652M615J3646J9559
13835G8647k5715j0045n829n4073O070m105K1313n319m9919L3318L6441N3949
13823G4733M5447Q2932l8294p4777p8382M1006K6791m6037o1148j0l8308K3586
13811d2461Q871k6871m4279L6269R7808m461N647J37437K0093j4824J81147Q1824
13799D36200L7984K7158K1299M1741j789L7546K6958n57k85o380m337P8269K56603
$$ plain form
13786 950410 1218694 1529273 1718690 1883400 2133065 2194951 2063741 1832409 1537122 1217577
13776 1217577 968973 677986 508036 399704 279029 262732 195338 141516 140600 144177 97208
13765 97208 64718 164858 154569 140566 200818 140702 158486 104066 41705 -24559 -13471
13754 -13471 -65205 -42809 66122 105697 26208 44247 81555 8010 9901 38268 74851 115825
13742 115825 82379 22326 31708 82481 93355 88812 90793 93571 103584 153515 141957 182929
13730 182929 197310 143768 144646 143368 165923 170496 134821 25237 -61847 -117553 -130096 -127745
13718 -127745 -156703 -97965 31433 155226 148027 59505 4657 -9848 10321 44949 90661
13707 90661 58225 51867 32733 19309 47253 56636 117874 95210 20521 21659 123127 180521
$$ packed form
13786I50410K68284L10579J89417J64710K49665O1886j31210k31332k95287l19545
13776A217577k48604k90987j69950j08332j20675j6297o7394n3822r16L577m6969
13765I7208l2490J00140j0289j4003O0252o0116J7784n4420o2361o6264J1088
13754a3471n1734K2396J08931L9575p9489J8039L7308p3545J891K8367L6583M0974
13742A15825l3446o0053R382N0773J0874m543J981K778J0013M9931j1558M0972
13730A82929J4381n3542Q78j278K2555M573l5675j09584q7084n5706j2543K351
13718a27745k8958N8738J29398J23793p199q8522n4848j4505K0169L4628M5712
13707I0661l2436o358j9134j3424K7944R383O1238k2664p4689J138J01468N7394
$$ plain form
13695 180521 103078 77345 138008 169390 214224 194283 112204 41836 16456 39160 -30971
13684 -30971 -42457 -51891 -95450 -182577 -135471 -120397 -58535 -10648 103260 86973 -24757
13673 -24757 -68655 26491 39420 40335 -37580 63984 61727 19961 44626 14280 -45669 -45552
13661 -45552 -55866 -44828 24223 120883 90308 -5790 3158 -57405 -91273 -46696 2502 7970
13649 7970 -19552 -14193 31235 72554 94625 171413 134706 136125 90116 5433 52527 122387
13637 122387 175770 169454 84554 -3279 -87877 -82312 11368 -23996 37082 19815 45887 94460
13625 94460 170049 209939 164822 151335 142146 99119 65888 39584 26862 -309 -59745 -21054
13613 -21054 -31528 -49573 6109 10836 -57320 -77545 -59358 28558 53468 80039 30762 2579
$$ packed form
13695A80521p7443k5733O0663L1382M4834j9941q2079p0368k5380K2704p0131
13684c0971j1486r434m3559q7127M7106J5074O1862M7887J13908j6287j11730
13673b4757m3898R5146J2929R15p7915J01564k257m1766K4665l0346n9949J17
13661d5552j0314J1038O9051R6660l0575r6098Q948o0563l3868M4577M9198N468
13649G970k7522N359M5428M1319K2071P6788l6707J419m6009q4683M7094O9860
13637A22387N3383o316q4900q7833q4598N565R3680l5364O1078j7267K6072M8573
13625I4460P5589L9890m5117j3487r189m3027l3231k6304j2722k7171n9436L8691
13613b1054j0474j8045N5682M727o8156k0225J8187Q7916K4910K6571m9277k8183
$$ plain form
13601 2579 38428 50129 111679 166751 132241 77577 5442 -28770 38342 142713 159272 70301
13589 70301 4582 -78902 -46917 51859 98978 138920 152579 137184 97588 87845 81123 41667
13577 41667 80475 41459 4406 -12373 15808 73104 105580 63572 51355 45241 25236 -601
13565 -601 20079 77511 150376 222803 207332 229712 219095 214821 217652 153063 159912 149869 153505
13552 153505 70292 68067 30018 52155 59890 104925 173904 156245 93359 116403 96987 60120
13540 60120 14252 22659 64402 90443 77115 3940 -19726 -20478 -22934 -19665 -9964 32797 105411
13527 105411 118874 112432 54510 5196 -33968 14361 4813 -50925 -75184 -54890 37388 48371
13515 48371 -35128 -50919 -41947 62311 44188 -26780 -69213 -33176 22947 -20880 8519 69311
$$ packed form
13601B579L5849J1701O1550N5072l4510n4664p2135l4212O7112J04371J6559q8971
13589G0301o5719q3484L1985R8776M7119L9942J3659j5395l9596r743o722l9456
13577D1667L8808l9016l7053j6779K8181N7296L2476m2008j2217o114k0005k5837
13565f01K0680N7432P2865P2427j5471K2380j0617m274K831o4589O849j0043L636
13552A53505q3213k225l8049K2137P735M5035O8979j7659o2886K3044j9416l6867
13540F0120m5868Q407M1743K6041j3328p3175k3666p52k456L269R701M2761P2614
13527A05411J3463o442n7922m9314l9164M8329r548n5738k4259K0294R2278J0983
13515D8371q3499j5791Q972J04258j8123p0968m2433L6037N6123m3827K9399O0792
$$ plain form
13503 69311 120683 68091 3266 6164 -23687 92849 85196 -15526 13078 8734 106602 52430
13491 52430 -26079 3262 -31847 -83602 -131197 -99941 -83275 5353 14408 -120 27717 76545
13479 76545 37055 30150 5890 43688 98669 141519 180918 49034 -45043 -37767 -1585 -34427
13467 -34427 23438 45418 31780 -78390 -119742 -97086 -50978 3846 19181 70505 91528
13456 91528 99432 93696 129467 196371 185265 99792 44301 49498 21534 9581 -13307 -75320
13444 -75320 -47564 -47355 -39528 19844 61761 64600 91131 161116 189928 266877 340676 444624
13432 444624 525621 478879 431735 340790 245394 272780 249600 207612 172561 107196 102243 98172
13420 98172 41585 46072 59798 33684 78399 63796 52695 52974 138304 129647 92576 80321
$$ packed form
13503F9311N1372n2592o4825K898k9851J16536p653j00722K8604m344R7868n4172
13491E2430p8509K9341l5109n1755m7595L1256J6666Q8628R055j4528K7837M8828
13479G6545l9490o905k4260L7798N4981M2850L9399j31884r4077P276L6182l2842
13467c4427N7865K1980j3638j10170m1352K2656M6108N4824J5335N1324K1023
13456I1528P904n736L5771O6904j1106q5473n5491N197k7964j1953k2888o2013
13444g5320K7756K09P827N9372M1917K839K6531O9985K8812P6949P3799J03948
13432D44624Q0997m6742m7144r0945r5396K7386k3180m1988l5051o5365m953m071
13420I8172n6587M487J3726k6114M4715j4603j1101K79Q5330q657l7071j2255
$$ plain form
13408 80321 22586 -48019 -114371 -107283 43943 150382 141902 183399 173993 60656 48413 148204
13396 148204 202940 181662 151851 64619 -21436 -23435 28559 62060 17269 -26087 -43588 -19488
13384 -19488 6050 7720 5775 9107 -5643 44076 33584 143509 189252 222050 303769 347004
13372 347004 248142 144189 43515 20649 60196 29553 -20363 54824 84318 105647 126311
13361 126311 121666 200452 237421 222114 190838 192124 255482 328891 399100 444280 512625 652756
13349 652756 691314 761202 852198 904283 1008504 1067956 1042822 1130189 1178178 1064858 852238
13338 852238 719970 630721 479360 329924 347361 354083 247059 224260 171291 107789 37656
13327 37656 13259 -7112 16940 83660 153067 172239 153327 58833 185889 166916 143109
$$ packed form
13408H0321n7735p0605o6352P088J51226J06439q480M1497r406j13337j2243R9791
13396A48204N4736k1278k9811q7232q6055j999N1994L3501m4791m3356j7501K4100
13384a9488K5538J670j945L332j4750M9719j0492J09925M5743L2798Q1719M3235
13372C47004r8862j03953j00674k2866L9547l0643m9916P5187K9494K1329K0664
13361A26311m645P8786L6969j5307l1276J286O3358P3409P0209M5180O8345J40131
13349F52756L8558O9888R0996N2085J04221N9452k5134Q7367M7989j13320k12620
13338H52238j32268q9249j51361j49436J7437O722j07024k2799n2969o3502p0133
13327C7656k4397k0371K4052O6720O9407J9172j8912r4494J27056j8973k3807
$$ plain form
13316 143109 172958 119372 154232 143916 74268 83417 126117 183512 146646 146630 153828 114788
13304 114788 120425 127058 82900 -10819 94980 147402 89290 -44965 -113442 -27886 -29297 -66471
13292 -66471 -51638 -33903 11881 23072 5405 504 -34421 -21927 -8142 45903 136798 158154
13280 158154 85530 42544 45719 114490 161258 112560 123658 98655 90535 59369 48857 42802
13268 42802 -36118 34767 116464 55794 -8786 -47420 -82901 -119094 -60877 8726 104747 62703
13256 62703 -40504 -55683 31448 124294 101626 68846 130553 97681 70 29714 141269
13245 141269 99912 190553 285820 193709 75663 22250 1548 85867 244486 291299 225889
13234 225889 109719 90853 138497 164810 169293 88351 73438 158442 187134 181634 108796 57479
$$ packed form
13316A43109K9849n3586L4860j0316o9648R149M2700N7395l6866j6P198l9040
13304A14788N637O633m4158r3719J05799N2422n8112j34255o8477Q5556j411l7174
13292f6471J4833J7735M5784J1191j7667m901l4925J2494J3785N4045R0895K1356
13280A58154p2624m2986L175O8771M6768m8698J1098k5003q120l1166j0512o055
13268D2802p8920P0885Q1697o0670o4580l8634l5481l6193N8217O9603R6021m2044
13256F2703j03207j5179Q7131R2846k2668l2780O1707l2872r7611K9644J11555
13245A41269m1357R0641R5267r2111j18046n3413k0702Q4319J58619M6813o5410
13234B25889j16170j8866M7644K6313M483q0942j4913Q5004K8692n500p2838n1317
$$ plain form
13222 57479 12900 -113239 -86963 14410 83244 41373 30943 -37283 -116040 -78654 1252
13211 1252 81552 72821 29218 45594 120228 145036 110517 74632 -3366 -40859 -78961 -170693
13199 -170693 -87347 -12839 -46845 -78755 -64835 23355 49743 -37038 -108034 -58491 38465
13188 38465 4307 -48581 31231 50115 44226 -638 -48592 12162 75902 80468 67085 15865
13176 15865 -49965 -35510 -44646 -51019 -13965 -35064 -93346 -14678 52915 45146 46521 62436
13164 62436 12799 57174 43843 7566 -112621 -173806 -108529 -7102 22565 30229 114902
13153 114902 80468 91429 156640 98513 11213 -30943 34645 130742 165156 231763 229694 118249
13141 118249 55927 44447 96775 144476 90238 -27962 -4106 10273 -52861 24717 118217
$$ packed form
13222E7479m4579j26139K6276J01373O8834m1871j0430o8226p8757L7386P9906
13211A252Q0300q731m3603J6376P4634K4808l4519l5885p7998l7493l8102r1732
13199a70693Q3346P4508l4006l1910J3920Q8190K6388q6781p0996M9543R6956
13188C8465l4158n2888P9812J8884n889m4864m7954O0754O3740M566j3383n1220
13176A5865o5830J4455r136o373L7054k1099n8282P8668O7593p769J375J5915
13164F2436m9637M4375j3331l6277j20187o1185O5277J01427K9667P664Q4673
13153A14902l4434J0961O5211n8127q7300m2156O5588R6097L4414O6607k069j11445
13141A18249o2322j1480N2328M7701n4238j18200K3856J4379o3134P7578R3500
$$ plain form
13130 118217 122017 80097 55881 -46778 -61748 23832 -37175 -96143 977 23259 6449
13119 6449 -8388 47237 170715 169644 120642 71416 108013 46313 78525 38108 5453 42589
13107 42589 104814 96548 124701 165389 124644 51323 75196 37855 -19044 -19052 37102 -37669 -62001
13094 -62001 -57243 -153273 -89185 -44823 42882 55319 -20176 -73498 -52007 11544 76743 58922
13082 58922 34115 -12299 12819 21253 48270 11048 -73478 -49633 -4947 22013 23007 -49428
13070 -49428 -22041 34130 -14560 -92183 -70452 49975 130241 57448 4974 51177 4800
13059 4800 -42064 25260 79772 9504 -7996 -2000 -42418 -90314 -96188 34224 109559 93231
13047 93231 53656 138258 113945 97440 106742 72276 -6789 352 -17609 -23601 -38552 -62641
$$ packed form
13130A18217L800m1920k4216j02659j4970Q5580o1007n8968R7120K2282j6810
13119F449j4837N5625J23478j071m9002m9226L6597o1700L2212m0417l2655L7136
13107D2589O2225q266K8153M0688m0745p3321K3873l7341n6899qN6154p4771k4332
13094f2001M758r6030O4088M4362Q7705J2437p5495n3322K1491O3551O5199j7821
13082E8922k4807m6414K5118Q434K7017l7222q4526K3845M4686K6960R94p2435
13070d9428K7387N6171m8690p7623K1731J20427Q0266p2793n2474M6203m6377
13059D800m6864O7324N4512p0268j7500N996m0418m7896n874J30412P5335j6328
13047I3231l9575Q4602k4313j6505R302l4466p9065P141j7961n992j4951k4089
$$ plain form
13035 -62641 -103949 -151502 -157644 -92507 79557 183540 228259 252284 306246 258453 154437
13024 154437 70376 87630 117912 97469 59666 33651 6791 28030 20017 101377 159921 173430
13012 173430 139201 98556 30262 -89893 -60376 -39043 -39444 -4217 28969 -48225 -47206 -18091
13000 -18091 28285 -10801 -62380 -44678 3187 93781 115351 19813 60089 35546 26199 -3045
12988 -3045 20824 36988 -39210 -33726 -27289 -58683 -68290 -49865 -14543 12433 73685 88593
12976 88593 90833 113763 139479 55053 36290 -35707 -51578 -17358 17408 -10457 2873 -17890
12964 -17890 -52804 63572 110603 111346 98763 47914 -36968 -66980 -41578 28388 73050 124080
12952 124080 79890 118057 84106 73989 -39813 -63143 -78177 -29869 79721 74731 -15924
$$ packed form
13035f2641m1308m7553o142O5137J72064J03983M4719K4025N3962m7793j04016
13024A54437q4061J7254L0282k0443l7803k6015k6860K1239q013Q1360N8544J3509
13012A73430l4229m0645o8294j20155K9517K1333m01L5227L3186p7194J019K9115
13000a8091M6376l9086n1579J7702M7865R0594K1570r5538M0276k4543r347k9244
12988c045K3869J6164p6198N484O437l1394r607J8425L5322K6976O1252J4908
12976H8593K240K2930K5716q4426j8763p1997j5871L4220L4766k7865J3330k0763
12964a7890l4914J16376M7031P43j2583n0849q4882l0012K5402O9966M4662N1030
12952A24080m4190L8167l3951j0117j13802k3330j5034M8308J09590m990r0655
$$ plain form
12941 -15924 -22145 -8313 75189 55275 65299 85397 88594 109886 94327 148691 75804 30113
12929 30113 76089 82384 71360 25690 -10324 -74156 -138339 -114074 -92885 -80783 -94325 -118881
12917 -118881 1969 54331 60221 76954 15459 17790 85511 9555 -105228 -138689 -151156
12906 -151156 -130843 15207 163167 118769 71895 48129 85046 39629 55168 77411 34663
12895 34663 19313 2779 -29678 -21587 30366 6172 -27315 -105722 -142494 -157447 -166711 -171782
12883 -171782 -86905 20870 43432 83950 88541 81621 50791 -1292 -31285 -47628 -49061 -69093
12871 -69093 -62818 5021 39465 -15245 -51053 -64072 -91662 -94579 -67088 -126529 -152038 -4781
12859 -4781 13349 -84506 -91119 -86956 -53831 -53522 -7187 35643 93400 104177 45393 -34008 -94825
$$ packed form
12941a5924o221J3832Q3502j9914J0024K0098L197K1292j5559N4364p2887m5691
12929C0113M5976O295j1024m5670l6014o3832o4183K4265K1189J2102j3542k4556
12917a18881J20850N2362N890J6733o1495K331O7721p5956j14783l3461j2467
12906a51156K0313J46050J47960m4398m6874k3766L6917m5417J5539K2243m2748
12895C4663j5350j6534l2457Q091N1953k4194l3487p8407l6772j4953r264n071
12883a71782Q4877J07775K2562M0518M591o920l0830n2083k9993j6343j433k0032
12871f9093O275O7839L4444n4710l5808j3019k7590k917K7491n9441k5509J47257
12859d781J8130r7855o613M163L3125L09M6335M2830N7757J0777n8784p9401o0817
$$ plain form
12846 -94825 -51229 -8333 25831 7552 17343 26514 18992 36683 70265 95460 51634 44670
12834 44670 58294 46088 43094 -13639 -32493 -60159 -89364 -107808 -49947 -41114 -50231 -74181
12822 -74181 -97667 -55800 -195 19467 36933 32598 71511 84196 126468 120120 52083 -63508
12810 -63508 1733 76456 -20481 -80412 -79913 -112098 -89557 -83725 -28584 74806 112899 102376
12798 102376 -8287 -62733 -91062 -127800 -57004 2686 -59560 -108943 -109329 -124831 -65094 -64934
12786 -64934 -63002 10057 19557 -29830 25790 74713 -14978 -59284 -16068 -39496 -35088 -82843
12774 -82843 -13629 21609 24275 69377 12774 -81355 -53445 -37845 -117333 -76683 -13886 66703
12762 66703 63235 50647 -5102 -28762 217 54317 25701 -14450 -12016 13479 40915 30945
$$ packed form
12846i4825M3596M2896L4164j8279R791R171p522J7691L3582K5195m3826o964
12834D4670J3624j2206k994n6733j8854k7666k9205j8444N7861Q833r117k3950
12822g4181k3486M1867N5605J9662J7466m335L8913J2685M2272o348o8037j15591
12810f3508O5241P4723r6937n9931M99l2185K2541N832N5141J03390L8093j0523
12798A02376j10663n4446k8329l6738P0796N9690o2246m9383l86j5502N9737J60
12786f4934J932P3059R500m9387N5620M8923q9691m4306M3216k3428M408m7755
12774h2843O9214L5238K666M5102n6603r4129K7910J5600p9488M0650O2797Q0589
12762F6703l468j2588n5749k3660K8979N4100k8616m0151K434K5495K7436r970
$$ plain form
12750 30945 59163 111039 175321 141448 99183 81688 97164 104702 56035 48523 47267 30661
12738 30661 7744 116558 97006 -39896 -139362 -143721 -28346 -11804 32521 86264 94822
12727 94822 62635 71959 98222 98196 82902 102299 134713 75266 -2198 -2425 -33772 1151 111054
12714 111054 172510 22990 -75861 -83090 -120522 -111090 -91354 -39040 -26457 26724 86662 100215
12702 100215 73868 85727 89634 29645 1602 -94972 -100369 -113444 -93848 -33693 2688 -36819
12690 -36819 -92691 -68802 -75127 -9210 12010 -74216 -75305 28860 40316 -25637 -62290 -25711
12678 -25711 43797 39607 32495 20529 -2421 -31522 -23229 -91618 -109517 -22229 -33478 -26765
12666 -26765 12062 19878 37721 47981 77666 154672 143146 93471 80147 -10433 24108 -4391
$$ packed form
12750C0945K8218N1876O4282l3873m2265j7495J5476P538m8667p512j256j6606
12738C0661k2917J08814j9552j36902r9466m359J15375J6542M4325N3743Q558
12727I4822l2187R324K6263k6j5294J9397L2414n9447p7464k27l1347L4923J09903
12714A11054O1456j49520r8851p229l7432R432J9736N2314J2583N3181N9938J3553
12702A00215k6347J1859L907n9989k8043r6574n397j3075J9596O0155L6381l9507
12690c6819n5872K3889o325O5917K1220q6226j089J04165J1456o5953l6653L6579
12678b5711O9508m190p112j1966k2950k9101Q293o8389j7899Q7288j1249O713
12666b6765L8827P816J7843J0260K9685P7006j1526m9675j3324r0580L4541k8499
$$ plain form
12654 -4391 -41226 -48242 -106580 -106453 -77861 -8426 4732 -88811 -44024 -58788 -60035 -12433 30919
12641 30919 51171 42069 -27794 -12879 -44707 -6698 -57854 -74848 -58014 1153 58096 70301
12629 70301 98620 193393 302383 293994 240063 284467 466426 617858 779835 894682 658186
12618 658186 346162 203928 166281 102310 71263 60554 60461 109700 131530 115448 47760 41402
12606 41402 17341 -82653 -47781 75137 106344 98101 58711 -6423 -32610 -39652 5314 11530
12594 11530 35962 15327 62360 81827 86486 125725 184639 124938 73889 18752 -6623 3224
12582 3224 50926 154821 192189 171783 163223 96124 6590 -54185 -129636 -97087 -44642 -9813
12570 -9813 3490 15905 -1751 -25820 21460 55292 94696 5662 20406 22181 64133 142094
$$ packed form
12654d391l6835p016n8338J27K8592O9435J3158r3543M4787j4764j247M7602M3352
12641C0919K0252r102o9863J4915l1828L8009n1156j6994J6834N9167N6943J2205
12629G0301K8319R4773J08990q389n3931M4404J81959J51432J61977J14847k36496
12618F58186l12024j42234l7647o3971l1047j0709r3M9239K1830j6082o7688o358
12606D1402k4061r9994L4872J22918L1207q243l9390o5134k6187p042M4966O216
12594A1530K4432k0635M7033J9467M659L9239N8914n9701n1049n5137k5375R847
12582C224M7702J03895L7368k0406q560o7099q9534o0775p5451L2549N2445L4829
12570i813J3303J2415j7656k4069M7280L3832L9404q9034J4744J775M1952P7961
$$ plain form
12558 142094 197792 90943 8563 23993 123293 195796 255685 232498 153460 150084 187644
12547 187644 166239 84495 81603 45181 35200 1424 -33814 -16047 -25003 -28083 7780 95758
12535 95758 52080 19436 -4592 -28451 -5519 -71764 -114898 47158 155145 78700 81394
12524 81394 90948 88343 -12449 -28211 21579 23781 -38405 -52572 -59055 -22172 -23180 -6217
12512 -6217 17740 -8391 -21317 -61369 -54387 -778 -48528 -58060 -34872 -23280 -31366 35793
12500 35793 -43302 -84624 -99077 -145665 -92724 -89825 -120995 -110919 -74503 -94937 -136081 -135600
12488 -135600 -24219 62887 69745 31667 91524 25417 -4783 5709 -23325 -61290 12410
12477 12410 -32715 -125645 -35533 -34975 -63583 -96051 -101763 -5178 22109 10627 -27028 -47097
$$ packed form
12558A42094N5698j06849q2380J5430R9300P2503N9889k3187p9038l376L7560
12547A87644k1405q1744k892l6422r981l3776l5238J7767q956l080L5863Q7978
12535I5758m3678l2644k4028k3859K2932o6245m3134J62056J07987p6445K694
12524H1394R554k605j00792j5762M9790K202o2186j4167o483L6883j008J6963
12512f217K3957k6131j2926m0052O982N3609m7750r532K3188J1592q086O7159
12500C5793p9095m1322j4453m6588N2941K899l1170J0076L6416k0434m1144M81
12488a35600J11381Q7106O858l8078N9857o6107l0200J0492k9034l7965P3700
12477A2410m5125r2930R0112N58k8608l2468n712R6585K7287j1482l7655k0069
$$ plain form
12465 -47097 -10661 27994 -76929 -17199 95656 98677 15503 -58391 -36689 -53817 29154
12454 29154 -11520 -24444 14469 54666 -16935 -62760 31132 116375 93371 35291 -18990 -72125
12442 -72125 -116943 -22831 55190 53182 71808 147944 125271 68244 93768 94241 80585 14462
12430 14462 -17618 52280 64964 132404 108781 51386 118604 90873 74686 52118 -24837 -98435
12418 -98435 -98752 -2621 53745 103628 121892 157000 76784 12374 16320 -19522 -81837 -52845
12406 -52845 -3450 63177 70965 29213 61822 116171 114062 54198 53841 89113 98812 83854 92230
12393 92230 16103 -70001 -81135 -58590 -71264 -56167 -50597 -25107 5857 7972 -22718 -25260
12381 -25260 8900 110445 59415 -33526 -41971 -3405 26978 44953 90190 107484 36761 81840
$$ packed form
12465d7097L6436L8655j04923N9730J12855L021q3174p3894K1702j7128Q2971
12454B9154m0674j2924L8913M0197p1601m5825R3892Q5243k3004n8080n4281n3135
12442g2125m4818R4112P8021k008J8626P6136k2673n7027K5524M73j3656o6123
12430A4462l2080O9898J2684O7440k3623n7395O7218k7731j6187k2568p6955p3598
12418i8435l17R6131N6366M9883J8264L5108q0216o4410L946l5842o2315K8992
12406e2845M9395O6627P788m1752L2609N4349k109n9864l57L5272R699j4958Q376
12393I2230p6127q6104j1134K2545j2674J5097N570K5490L0964K115l0690k542
12381b5260L4160J01545n1030r2941q445L8566L0383J7975M5237J7294p0723M5079
$$ plain form
12369 81840 21465 9685 27057 91488 70181 132645 196582 125985 113638 135560 117769 88206
12357 88206 10121 -89979 -77230 -35840 -56752 -74183 -15456 -1258 31598 22348 -52629 -79158
12345 -79158 -79451 -92537 -5016 1765 -72610 -54694 12430 18849 42585 75910 141855 122777
12333 122777 132879 47601 14475 83916 50518 25390 -2094 -93747 -116562 -111629 -53690 -36210
12321 -36210 -140103 -160100 -136091 -160346 -135718 -124081 -11975 53991 29453 -38550 -112768
12310 -112768 -15767 -30689 2214 54073 84114 43803 8561 44932 47496 733 -31989 66534
12298 66534 142087 180460 133491 15760 -49591 -71209 -104008 -55854 23731 56936 94251
12287 94251 86523 -5807 -83317 -56321 -69092 1893 7101 -20269 2498 51854 -7234 -25563
$$ packed form
12369H1840o0375j1780J7372O4431k1307O2464O3937p0597j2347K1922j7791k9563
12357H8206p8085j00100J2749M1390k0912j7431N8727J4198L2856r250p4977k6529
12345g9158k93j3086Q7521O781p4375J7916O7124O419K3736L3325O5945j9078
12333A22777J0102q5278l3126O9441l3398k5128k7484r1653k2815M933N7939J7480
12321c6210j03893j9997K4009k4255K4628J1637J12106O5966k4538o8003p4218
12310a12768R7001j4922L2903N1859L0041m0311l5242L6371K564m6763l2722R8523
12298F6534P5553L8373m6969j17731o5351k1618l2799M8154P9585L3205L7315
12287I4251p728r2330p7510K6996j2771P0985N208k7370K2767M9356n9088j8329
$$ plain form
12275 -25563 31709 82933 88143 -3069 -6133 695 23084 3139 -39416 -8431 38594 -2611
12263 -2611 -46036 262 -51960 5940 45779 68899 70776 76258 56478 71820 -3403 16381
12251 16381 11110 -48723 -52171 -90884 -99187 -52310 -92155 -7525 76818 132316 118313 114719
12239 114719 147237 116593 43214 84327 74108 55265 -15531 12681 -44603 -140196 -126800
12228 -126800 -99062 -90474 -62143 -32021 -21309 -59095 -29079 -22028 34739 32550 -3286 50107
12216 50107 -2204 18522 25106 28104 62310 17756 18810 -6731 -66610 -2936 1283 -110998
12204 -110998 -139801 -140506 -125126 -64712 -12469 25077 -24809 1254 -26868 16683 47045 -15215
12192 -15215 -137527 -182849 -157158 -128906 -12015 -36229 -91207 -43954 5240 49904 64555
$$ packed form
12275b5563N7272N1224N210r1212l064O828K2389j9945m2555L0985M7025m1205
12263b611m3425M6298n2222N7900L9839K3120J877N482j9780J5342p5223J9784
12251A6381n271n9833l448l8713q303M6877l9845Q4630Q4343N5498j4003l594
12239A14719L2518l0644p3379M1113j0219j8843p0796K8212n7284r5593J3396
12228a26800K7738Q588K8331L0122J0712l7786L0016P051N6767k189l5836N3393
12216E0107n2311K0726O584K998L4206m4554J054k5541n9879O3674M219j12281
12204a10998k8803p05J5380O0414N2243L7546m9886K6063k8122M3551L0362o2260
12192a5215j22312m5322K5691K8252J16891k4214n4978M7253M9194M4664J4651
$$ plain form
12181 64555 115989 123535 88052 97959 156498 103535 48428 71050 97332 73244 60595 92582
12169 92582 89879 40862 -7026 24467 67853 145742 105961 12647 6310 -6796 18407 55832
12157 55832 123651 85946 35729 -10764 -77889 -115531 -99757 -77476 -51347 8539 98420 83998
12145 83998 99209 77267 104210 122382 80983 82157 89234 30714 47753 44803 -16313 -56732
12133 -56732 -23843 22723 -1386 -79283 -30321 -14507 -4593 -107355 -7459 33300 28913 15628
12121 15628 25872 19300 18797 -57255 -113773 -83920 -1754 43469 40553 -15666 -19390 -13311 5885
12108 5885 -8259 -30059 -61648 -133364 -138308 -95350 10603 56219 93011 82097 19709 23314
12096 23314 7254 87182 139602 114 -29532 -20204 46785 110695 76982 28126 7721 -27377
$$ packed form
12181F4555N1434P546l5483R907N8539n2963n5107K2622K6282k4088j2649L1987
12169I2582k703m9017m7888L1493M3386P7889l9781r3314o337j3106K5203L7425
12157E5832O7819l7705n0217m6493o7125l7642J5774K2281K6129N9886Q9881j4422
12145H3998J5211k1942K6943J8172m1399J174P077n8520J7039k950o1116m0419
12133e6732L2889M6566k4109p7897M8962J5814R914j02762R9896M0759m387j3285
12121A5628J0244o572n03p6052n6518K9853Q2166M5223k916n6219l724O079J9196
12108E885j4144k1800l1589p1716m944M2958J05953M5616L6792j0914o2388L605
12096B3314j6060P9928N2420j39488k9646R328O6989O3910l3713m8856k0405l5098
$$ plain form
12084 -27377 -46906 61475 54588 -8055 57487 26148 -13531 -37272 35170 129275 21488
12073 21488 45770 60050 8001 -12566 26863 -19725 -72325 -12284 28926 64360 -25374 -3855
12061 -3855 -5823 18973 15870 13497 66105 99664 75708 44887 25771 74037 73089 60144 84847
12048 84847 -8996 -130325 -133934 -86719 -45795 -97370 -191214 -163881 -13945 47579 5029
12037 5029 -14953 11856 -10401 -16393 -13832 7235 76678 64849 24444 -25160 -41265 -43634
12025 -43634 -99006 -97319 -64615 -481 21199 -24819 -39724 -70245 -16993 82164 49428 71886
12013 71886 21979 -18029 -4646 -40918 -47096 -4966 4496 -20603 -11174 -14649 23278 -4365
12001 -4365 -22748 -5634 92270 110631 117197 48800 11999 -15839 -21543 -21575 -14012 15267 76555
$$ packed form
12084b7377j9529J08381o887o2643O5542l1339l9679k3741P2442R4105j07787
12073B1488K4282J4280n2049k0567L9429m6588n2600O0041M1210L5434q9734K1519
12061c855j968K4796l103k373N2608L3559k3956l0821j9116M8266r48j2945K4703
12048H4847r3843j21329l609M7215M0924n1575r3844K7333J49936O1524m2550
12037E029j9982K6809k2257n992K561K1067O9443j1829m0405m9604j6105k369
12025d3634n5372J687L2704O4134K1680m6018j4905l0521N3252R9157l2736K2458
12013G1886m9907m0008J3383l6272o178M2130R462k5099R429l475L7927k7643
12001d365j8383J7114R7904J8361O566o8397l6801k7838n704l2P563K9279O1288
$$ plain form
11988 76555 71201 69791 68691 75712 38425 -8256 2612 -49394 5516 108786 82318 91452
11976 91452 90415 19336 -52779 -91121 -31333 -37097 -43726 -48650 -31320 -12916 -2491 7316 105479
11963 105479 135383 140756 149790 156322 156421 153346 105977 57553 10373 -35813 -16066 -26549 -45274
11950 -45274 3221 -17512 -17814 -92797 -127526 -117995 -103182 -105008 -107249 -46093 26370 60356 -50971
11937 -50971 -52577 -77882 -172984 -121462 -1979 -2685 -24845 623 85957 90557 12612 -41916
11925 -41916 -102711 -92642 -30264 -17613 -72374 -126345 -86012 -23130 -134516 -238547 -188811
11914 -188811 -122296 -124673 -114130 -9472 -63259 -95515 -149089 -42745 12824 -77411 -163862
11903 -163862 -236605 -151318 -116907 -132320 -143416 -57169 58535 45261 14597 -48081 -45718
$$ packed form
11988G6555n354j410j100P021l7287m6681J0868n2006N4910J03270k6468R134
11976I1452j037p1079p2115l8342N9788n764o629m924J7330J8404J0425R807R8163
11963A05479K9904N373R034O532R9l075m7369m8424m7180m6186J9747j0483j8725
11950d5274M8495k0733l02p4983l4729R531J4813j826k241O1156P2463L3986j11327
11937e0971j606k5305r5102N1522J19483p06k2160K5468Q5334M600p7945n4528
11925d1916o0795J0069O2378J2651n4761n3971M0333O2882j11386j04031M9736
11914a88811O6515k377J0543J04658n3787l2256n3574J06344N5569r0235q6451
11903a63862p2743Q5287L4411j5413j1096Q6247J15704j3274l0664o2678K363
$$ plain form
11892 -45718 -32284 6356 57673 -16546 21306 -16509 -91863 -162502 -94347 -53847 18689 9965
11880 9965 -12039 51311 85544 132434 147861 94407 65142 91034 44345 -14284 -31400 -58966
11868 -58966 885 121924 116288 41541 79254 70355 29513 9326 -10548 -12104 -67303 -142781
11856 -142781 -173563 -174775 -174378 -194345 -141967 -77376 -77502 16027 81817 130851 26414 -78236
11844 -78236 -21339 14657 55694 52119 41853 21826 13357 -22462 -92966 -112053 -70506 -44842
11832 -44842 -21993 23335 32955 4444 -68326 -46242 94561 89449 14987 -24195 23689 -2449
11820 -2449 -13433 -28601 25399 15637 54357 71913 -3932 9972 21298 24717 1032 1834 -30848
11807 -30848 -88042 -22755 38480 30380 18028 49251 14701 21058 9490 -10928 72415 62280
$$ packed form
11892d5718J3434L8640N1317p4219L7852l7815p5354p0639O8155M0500P2536q724
11880I965k2004O3350L4233M6890J5427n3454k9265K5892m6689n8629j7116k7566
11868e8966N9851J21039n636p4747L7713q899m0842k0187j9874j556n5199p5478
11856a42781l0782j212L97j9967N2378O4591j26R3529O5790M9034j04437j04650
11844g8236N6897L5996M1037l575j0266k0027q469l5819p0504j9087M1547K5664
11832d4842K2849M5328R620k8511p2770K2084J40803n112p4462l9182M7884k6138
11820b449j0984j5168N4000r762L8720J7556p5845J3904J1326L419k3685Q02l2682
11807c0848n7194O5287O1235q100j2352L1223l4550O357j1568k0418Q3343j0135
$$ plain form
11795 62280 53543 118301 173201 145727 9392 -3329 68477 98846 120301 130849 141768 152082
11783 152082 131731 -8998 -22024 -19158 -65191 -72449 -92359 -157712 -125172 -91979 -18354 22919
11771 22919 67837 67728 38944 -1847 -4376 -67479 -62482 -55751 -39080 -5285 -64146 -33371 17111
11758 17111 21042 -77006 -92997 -84886 -80572 -33251 -8755 -1406 -57559 -37049 93 -17126
11746 -17126 -988 -13024 24139 -16450 -118608 -148819 -134163 -139827 -110724 -149827 -43981
11735 -43981 -12866 -74073 -149552 -130372 -21874 -5457 -2371 -27880 -41794 -52904 -63906 989
11723 989 69881 13296 -50457 -133469 -107393 -54667 -20287 -90937 -49462 4780 9775 -68255
11711 -68255 -74033 -64859 -372 40078 62180 111422 89723 62282 -62175 -135729 -82359 26586
$$ packed form
11795F2280q737O4758N4900k7474j36335j2721P1806L0369K1455J0548J0919J0314
11783A52082k0351j40729j3026K866m6033p258j9910o5353L2540L3193P3625M1273
11771B2919M4918j09k8784m0791k529o3103M997O731J6671L3795n8861L0775N0482
11758A7111L931r8048j5991Q111M314M7321K4496P349n6153K0510L7142j7219
11746a7126J6138j2036L7163m0589j02158l0211J4656n664K9103l9103J05846
11735d3981L1115o1207p5479J9180J08498J6417L086k5509j3914j1110j1002O4895
11723I89O8892n6585o3753q3012K6076N2726L4380p0650M1475N4242M995p8030
11711f8255n778R174O4487M0450K2102M9242k1699k7441j24457p3554N3370J08945
$$ plain form
11699 26586 31449 -18976 -17697 -23984 -99750 -112180 -99407 -171437 -106633 -25965 2456 -9335
11687 -9335 -159155 -147312 -114034 -32188 35218 23452 -37890 -74762 -98129 -64817 -16575 -22420
11675 -22420 -66309 -40008 36705 -16830 -89355 -133250 -80693 -77379 -87584 -44090 53373 13174
11663 13174 -48705 -37212 21842 -22848 2290 29369 -67961 -109808 -79700 -9579 7664 -7037
11651 -7037 -33765 -63389 -29598 17808 46310 77457 36035 17197 -1093 42230 -7613 -23435
11639 -23435 25721 145440 108678 61139 80238 71418 -13941 4294 -15118 -106052 -108343 -5204
11627 -5204 46412 2216 33408 8027 -30564 -24502 -14957 14362 -21494 12972 17972 -23947
11615 -23947 -56730 -12883 -11580 30799 113937 183007 168249 80412 -7313 -56111 -19199 77376
$$ packed form
11699B6586M863n0425J279o287p5766j2430J2773p2030O4804Q0668K8421j1791
11687i335j49820J1843L3278Q1846O7406j1766o1342l6872k3367L3312M8242n845
11675b2420m3889K6301P6713n3535p2525m3895N2557L314j0205M3494R7463m0199
11663A3174o1879J1493N9054m4690K5138K7079r7330m1847L0108P0121J7243j4701
11651g037k6728k9624L3791M7406K8502L1147m1422j8838j8290M3323m9843j5822
11639b3435M9156J19719l6762m7539J9099q820q5359J8235j9412r0934k291J03139
11627e204N1616m4196L1192k5381l8591O062R545K9319l5856L4466N000m1919
11615b3947l2783M3847J303M2379Q3138O9070j4758q7837q7725m8798L6912R6575
$$ plain form
11603 77376 52693 -69192 -100360 -84561 -156761 -112457 -58555 -7778 16931 -17879 29985
11592 29985 14369 -81592 -55722 -58208 -54979 -648 -3965 -36322 -25086 -51986 8247 57625
11580 57625 17971 -15229 -7515 -20591 -41714 -52549 -45775 -73755 -9733 14767 25049 76712
11568 76712 108673 83646 -14187 -66929 -36011 41735 39501 94516 122907 140477 138417 6368
11556 6368 22822 88880 48923 9385 101283 179049 154339 136921 104890 -4690 -29236 37916
11544 37916 37979 64400 5302 -17283 -37552 -112099 -68818 26447 25229 20568 -46998 10775 41422
11531 41422 4016 -29848 -17048 -34673 -102052 -95355 -67813 -18860 28305 12763 20122 26780
11519 26780 9285 -59825 -126368 -142096 -32433 65939 172219 242702 199305 95354 3386
$$ packed form
11603G7376k4683j21885l1168J5799p2200M4304N3902N0777K4709l4810M7864
11592B9985j5616r5961K5870k486L229N4331l317l2357J1236k6900O0233M9378
11580E7625l9654l3200P714j3076k1123j0835O774k7980O4022K4500J0282N1663
11568G6712L1961k5027r7833n2742L0918P7746k234N5015K8391J7570k060j32049
11556F368J6454O6058l9957l9538R1898P7766k4710j7418l2031j09580k4546O7152
11544C7916O3K6421n9098k2585k0269p4547M3281R5265j218m661o7566N7773L0647
11531D1422l7406l3864J2800j7625o7379O697K7542M8953M7165j5542P359O658
11519B6780j7495o9110o6543j5728J09663R8372J06280P0483m3397j03951r1968
$$ plain form
11508 3386 -23210 26830 19900 -45440 -33541 -33785 32477 114779 79245 4804 34576 76282
11496 76282 12712 -37727 13505 67438 30893 -28190 9824 76899 141420 102438 7393 -30054
11484 -30054 -76731 4151 90492 106216 135645 92648 27351 -25633 -61354 -15287 -3927 -21699
11472 -21699 9046 55868 75073 92934 120186 107784 33956 -14861 -16586 -26235 -62321 -20452
11460 -20452 19273 114385 121015 64630 72825 94204 60550 94679 150409 225418 234969 125691
11448 125691 112056 219023 257351 321557 448480 490596 474113 478324 406567 386839 325733
11437 325733 211563 142805 185003 177830 122474 31629 -36160 48068 119313 130095 106765
11426 106765 73076 80880 82505 77392 41681 -77790 -140728 -100830 -115513 -45461 701 20772
$$ packed form
11508C386k6596N0040o930o5340J1899k44O6262Q2302l5534p4441K9772M1706
11496G6282o3570n0439N1232N3933l6545n9083L8014O7075O4521l8982r5045l7447
11484c0054m6677Q0882Q6341J5724K9429m2997o5297n2984l5721M6067J1360j7772
11472b1699L0745M6822J9205J7861K7252j2402p3828m8817j725r649l6086M1869
11460b0452L9725R5112O630n6385Q195K1379l3654L4129N5730P5009R551j09278
11448A25691j3635J06967L8328O4206J26923M2116j6483M211p1757j9728o1106
11437C25733j14170o8758M2198p173n5356r0845o7789Q4228P1245J0782k3330
11426A06765l3689P804J625n113l5711j19471o2938L9898j4683P0052M6162K0071
$$ plain form
11414 20772 -32618 -23071 -68419 -95918 -110388 -36052 8741 9704 34949 90227 125148 135508
11402 135508 91673 114027 80243 16401 -112964 -144781 -147654 -151258 -71306 -146572 -222668 -163863
11390 -163863 -30248 63563 107378 26931 -17731 -31250 -79587 -98241 -80065 87298 34969
11379 34969 -34459 -52547 -40786 42097 76670 127659 110234 74662 85198 16438 -63973 -142437
11367 -142437 -123808 -74532 -61265 -53251 -60017 -49127 25 -76660 -99365 7745 -17889 -33824
11355 -33824 16225 -45262 -40724 -91175 -125423 -118566 -79137 -49963 -74787 -191858 -189673 -80645
11343 -80645 -52013 -67360 29848 92686 86457 113874 96490 76027 22159 -5099 -24873 -67398
11331 -67398 -9578 -13141 -90472 -17285 101232 44246 55477 99262 56688 53490 104536 102636
$$ packed form
11414B0772n3390R547m5348k7499j4470P4336M4793R63K5245N5278L4921J0360
11402A35508m3835K2354l3784o3842j29365l1817k873l604P9952p5266p6096N8805
11390a63863J33615R3811M3815q0447m4662j3519m8337j8654J8176J67363n2329
11379C4969o9428j8088J1761Q2883L4573N0989j7425l5572J0536o8760q0411p8464
11367a42437J8629M9276J3267Q014o766J0890M9152p6685k2705J07110k5634j5935
11355c3824N0049o1487M538n0451l4248O857L9429K9174k4824j17071K185J09028
11343h0645K8632j5347R7208O2838o229K7417j7384k0463n3868k7258j9774m2525
11331f7398N7820l563p7331P3187J18517n6986J1231M3785m2574l198N1046j900
$$ plain form
11319 102636 26631 8941 11159 -10855 -33002 21937 7115 -57507 -68155 -144722 -95265 -70670
11307 -70670 -149527 -149789 -79051 -54205 -40576 -908 61182 158736 149543 45677 -21626 -35578
11295 -35578 15693 58379 137417 259497 296932 253972 249982 264448 233032 282151 236512 278039
11283 278039 249420 159834 84124 96721 158635 67574 10169 -35352 -64260 -98195 -24699
11272 -24699 39340 44051 51826 53928 75493 156915 206138 130015 142357 94256 51700 104684
11260 104684 66794 14600 -20544 34215 60092 78464 52657 -8918 -11742 1724 -4045 32450
11248 32450 5459 -103467 -96479 -6153 -36633 19322 -8079 -45530 -96759 -73795 -36395 -50043
11236 -50043 -50474 30571 36242 10702 -60733 -2857 -35766 22915 101043 77466 39215 77649
$$ packed form
11319A02636p6005j7690K218k2014k2147N4939j4822o4622j0648p6567M9457K4595
11307g0670p8857k62P0738K4846J3629L9668O2090R7554r193j03866o7303j3952
11295c5578N1271M2686P9038J22080L7435m2960l990J4466l1416M9119m5639M1527
11283B78039k8619q9586p5710J2597O1914r1061n7405m5521k8908l3935P3496
11272b4699O4039M711P775K102K1565Q1422M9223p6123J2342m8101m2556N2984
11260A04684l7890n2194l5144N4759K5877J8372k5807o1575k824J3466n769L6495
11248C2450k6991j08926O988R0326l0480N5955k7401l7451n1229K2964L7400j3648
11236e0043m31Q1045N671k5540p1435N7876l2909N8681P8128k3577l8251L8434
$$ plain form
11224 77649 104917 38682 84020 101553 33788 12720 19152 -21781 -10862 -7477 15065 57190
11212 57190 56966 110563 68075 81904 162795 142046 52733 57791 39147 -28771 27168 63865
11200 63865 -9437 -8590 -19563 -32703 -10253 6507 69607 77943 97433 105926 18409 -65948
11188 -65948 -121781 -130041 -65685 -49167 -77541 -121133 -89332 -11343 77654 69093 5261 -51922
11176 -51922 -65947 -66553 -81736 -35168 6815 -30995 -86446 -27795 30175 -48057 -126427 -79728
11164 -79728 -42162 -1889 60632 43081 2306 -59539 -22275 79480 117739 86645 13989
11153 13989 69858 76663 11248 -117842 -178221 -221907 -226587 -121692 -78244 -54549 -19205 -49945
11141 -49945 -68350 71187 120175 78803 32444 130444 170394 141554 81942 75734 50258 122574
$$ packed form
11224G7649K7268o6235M5338J7533o7765k1068O432m0933J0919L385K2542M2125
11212E7190k24N3597m2488J3829Q0891k0749q9313N058j8644o7918N5939L6697
11200F3865p3302Q47j0973j3140K2450J6760O3100Q336J9490Q493q7517q4357
11188f5948n5833q260O4356J6518k8374m3592L1801P7989Q8997q561o3832n7183
11176e1922j4025o06j5183M6568M1983l7810n5451N8651N7970p8232p8370M6699
11164g9728L7566M0273O2521j7551m0775o1845L7264J01755L8259l1094p2656
11153A3989N5869O805o5415j29090o0379m3686m680J04895M3448K3695L5344l0740
11141d9945j8405J39537M8988m1372m6359R8000L9950k8840n9612o208k5476P2316
$$ plain form
11129 122574 157881 81821 41636 72294 -4566 -70012 -76094 -110391 -79790 -9218 37620 24464
11117 24464 77676 76383 -2617 -103764 -29738 -15918 18057 25660 72751 56565 61363 50376
11105 50376 122723 146689 26056 19579 61081 90037 41158 -51089 -22719 5070 -32339 -57986
11093 -57986 -121233 -213404 -207463 -127302 -61722 -44838 -18250 -10362 -24714 47295 159910 116743
11081 116743 11611 -9568 -52283 -100753 -101983 -66801 -105915 -88769 24163 31544 15676
11070 15676 35784 -71432 -158952 -145036 -143956 -127023 -17736 -9616 18432 57114 -30120 -42685
11058 -42685 -32080 -15704 37057 -152 -4504 -50245 -74808 -64225 -90694 -130295 -63921 -64427
11046 -64427 -69676 -110919 -116066 -4720 120737 77787 126438 186260 90763 24778 -19094 -13770
$$ packed form
11129A22574L5307p6060m0185L0658p6860o5446o082l4297L0601P0572M6838j3156
11117B4464N3212j293p9000j01147P4026J3820L3975P603M7091j6186M798j0987
11105E0376P2347K3966j20633o477M1502K8956m8879r2247K8370K7789l7409k5647
11093e7986o3247r2171N941Q0161O5580J6884K6588P888j4352P2009J12615m3167
11081A16743j05132k1179m2715m8470j230L5182l9114J7146J12932P381j5868
11070A5676K0108j07216q7520J3916J080J6933J09287Q120K8048L8682q7234j2565
11058d2685J0605J6376N2761l7209m352m5741k4563J0583k6469l9601O6374n06
11046f4427n249m1243n147J11346J25457m2950M8651N9822r5497o5985m3872N324
$$ plain form
11034 -13770 84395 67129 -10330 -44884 -85555 -36968 -18308 -117949 -173961 -149651 -87730 -30806
11022 -30806 -115884 -109243 -82051 -72189 -62966 -14401 -26325 -14724 3949 -34611 -59124 -79440
11010 -79440 -21492 4223 7956 52581 70133 141483 130416 155115 150854 45059 10180 -25690
10998 -25690 -210 -69742 -175920 -198454 -198507 -165438 -104430 -119462 -74155 -25758 -22174 -50435
10986 -50435 -138981 -172991 -208709 -140331 -101527 -168884 -211764 -167479 -176284 -156500 -109405 -34219
10974 -34219 -36532 22068 -10864 -116868 -72949 23330 20039 -60304 -49223 31301 71815 -13893
10962 -13893 -95318 -43661 -22220 -66787 -99554 -49806 -8625 -66955 -136216 -98188 -140826 -125693
10950 -125693 -136925 -102379 -41061 -3227 -28341 -17762 -14088 -54133 5028 48849 63464 44636
$$ packed form
11034a3770R8165j7266p7459l4554m0671M8587J8660r9641n6012K4310O1921N6924
11022c0806q5078O641K7192R862R223M8565j1924J1601J8673l8560k4513k0316
11010g9440N7948K5715L733M4625J7552P1350j1067K4699m261j05795l4879l5870
10998b5690K5480o9532j06178k2534n3L3069O1008j5032M5307M8397L584k8261
10986e0435q8546l4010l5718O8378L8804o7357m2880M4285q805J9784M7095P5186
10974c4219k313N8600l2932j06004M3919R6279l291q0343J1081Q0524M0514q5708
10962a3893q1425N1657K1441m4567l2767M9748M1181n8330o9261L8028m2638J5133
10950a25693j1232L4546O1318L7834k5114J0579L674m0045N9161M3821J4615j8828
$$ plain form
10938 44636 40555 121280 103661 86593 104032 115792 30461 9492 -50427 -159627 -141603 -57740
10926 -57740 25570 5641 -46819 -49421 -26565 -13054 -438 5601 48385 95120 94132 37755
10914 37755 2240 -29622 -31437 -59025 -32995 -61916 -77001 18567 30859 -38147 -108440 -122130
10902 -122130 -143172 -156669 -121016 -75089 -120582 -160373 -174394 -97459 -44308 -79994 -57587
10891 -57587 -30301 -63897 -60241 -38996 -60093 -24201 -2329 -17553 -78506 -51369 25309 86841
10879 86841 30334 -41386 -28094 53230 11966 -79679 -97162 -87892 -110543 -108793 -14932 -14022
10867 -14022 -67125 -156797 -181246 -132426 -114525 -94758 -148694 -133520 -119197 -76996 -68705 -54841
10855 -54841 22902 -9170 -70360 -92819 -61585 3484 -9134 -52520 -142290 -109608 -103622 -140733
$$ packed form
10938D4636m081Q0725j7619j7068J7439J1760q5331k0969n9919j09200J8024Q3863
10926e7740Q3310j9929n2460k602K2856J3511J2616O039M2784M6735r88n6377
10914C7755l5515l1862j815k7588K6030k8921j5085R5568J2292o9006p0293j3690
10902a22130k1042j3497L5653M5927m5493l9791j4021P6935N3151l5686K2407
10891e7587K7286l3596L656K1245k1097L5892K1872j5224o0953K7137P6678O1532
10879H6841n6507p1720J3292Q1324m1264r1645j7483R270k2651J750R3861R10
10867a4022n3103q9672k4449M8820J7901J9767n3936J5174J4323M2201Q291J3864
10855e4841P7743l2072o1190k2459L1234O5069j2618m3386q9770L2682N986l7111
$$ plain form
10843 -140733 -107549 -81581 -153457 -102573 -104248 -30905 -22572 -98452 -143881 -105365 -127936 -148503
10831 -148503 -218138 -211970 -156425 -211111 -214874 -184352 -107455 39760 18043 -50529 -18470 70925
10819 70925 134749 151274 135557 118603 119745 163657 38873 -46827 61892 138989 145361 73440
10807 73440 14840 -44515 -129120 -161870 -107311 -50514 -90436 -113982 -145607 -121411 -99223 -101984
10795 -101984 -65684 -25665 5410 4512 34540 22024 -71049 -103491 -47669 12851 68712 16227
10783 16227 12618 10252 -13167 -105811 -97645 -43029 -25144 -42835 4063 -18401 20198 4834
10771 4834 -63720 -1784 -26617 -61266 -52781 -109043 -56670 91028 99352 57035 76139 74671
10759 74671 72705 89236 74667 63544 -32234 -80045 -101231 -102173 22913 25243 -5140 63629
$$ packed form
10843a40733L3184K5968p1876N0884j675P3343Q333p5880m5429L8516k2571k0567
10831a48503o9635O168N5545n4686l763L0522P6897J47215k1717o8572L2059Q9395
10819G0925O3824J6525j5717j6954J142M3912j24784q5700J08719P7097O372p1921
10807G3440n8600n9355q4605l2750N4559N6797l9922k3546l1625K4196K2188k761
10795a01984L6300M0019L1075q98L0028j2516r3073l2442N5822O0520N5861n2485
10783A6227l609k366k3419r2644Q166N4616J7885j7691M6898k2464L8599j5364
10771D834o8554O1936k4833l4649Q485n6262N2373J47698Q324m2317J9104j468
10759G4671j966J6531j4569j1123r5778m7811k1186r42J25086K330l0383O8769
$$ plain form
10747 63629 64353 27579 43677 28007 59031 63637 -27457 -152102 -126287 -82870 -84988 -52836
10735 -52836 21329 58527 34060 -30061 -39918 -89084 -113052 -119106 -91435 55666 130489 92437
10723 92437 -8424 -19435 36546 -131 -65548 -137717 -40220 -49595 -19011 36728 136597 245510
10711 245510 282991 159005 71587 77475 50188 28693 92210 49228 -22330 -86850 -55560
10700 -55560 -45869 -82241 -87536 5128 -12724 36589 38781 61990 149670 102483 59496 138068
10688 138068 140024 95473 77537 98107 182171 146857 25650 -24261 78972 168142 156838
10677 156838 166344 88423 24842 102597 160528 232741 291369 410424 376625 272352 246411
10666 246411 218815 191783 177241 165803 175184 96579 74974 59367 59216 35243 -10348 -21904
$$ packed form
10747F3629P24l6774J6098j5670L1024M606r1094j24645K5815M3417k118L2152
10735e2836P4165L7198k4467o4121r857m9166k3968o054K7671J47101P4823l8052
10723I2437j00861j1011N5981l6677o5417p2169R7497r375L0584N5739R9869J08913
10711B45510L7481j23986q7418N888k7287k1495O3517m2982p1558o4520L1290
10700e5560R691l6372n295R2664j7852M9313K192K3209Q7680m7187m2987P8572
10688A38068J956m4551j7936K0570Q4064l5314j21207m9911J03233Q9170j1304
10677A56838R506p7921o3581P7755N7931P2213N8628J19055l3799j04273k5941
10666B46411k7596k7032j4542j1438R381p8605k1605j5607j51k3973m5591j1556
$$ plain form
10654 -21904 -68929 15649 67262 156546 155545 58751 113529 151308 167476 94413 130203 158397
10642 158397 183826 141364 96429 48828 34294 122830 104023 69661 76130 100849 76412 85883
10630 85883 106110 46388 -43232 -6303 29630 -37567 -65421 -66189 -142542 -45619 -22513 -67190
10618 -67190 -23195 54728 40770 -20778 -65407 -119044 -51534 20018 -32781 -20855 -22933 -13048
10606 -13048 -55329 -66364 -41328 -74246 -78437 -68148 -36272 -29856 -107014 -119769 -144130 -175585
10594 -175585 -167975 -128235 -65198 -41961 -857 44425 30905 95078 -6254 -46688 -32667
10583 -32667 -43848 -89215 -140128 -62733 9313 -47609 -96800 -185825 -174271 -204729 -176704 -162904
10571 -162904 -167440 -112164 -88193 -53050 -74089 -103637 -110846 -153941 -138080 -22322 27141 -9690
$$ packed form
10654b1904m7025Q4578N1613Q9284j001r6794N4778L7779J6168p3063L5790K8194
10642A58397K5429m2462m4935m7601j4534Q8536j8807l4362O469K4719k4437R471
10630H5883K0227n9722q9620L6929L5933o7197k7854p68p6353R6923K3106m4677
10618f7190M3995P7923j3958o1548m4629n3637O7510P1552n2799J1926k078R885
10606a3048m2281j1035K5036l2918m191J0289L1876O416p7158j2755k4361l1455
10594a75585P610L9740O3037K3237M1104M5282j3520O4173j01332m0434J4021
10583c2667j1181m5367n0913P7395P2046n6922m9191q9025J1554l0458K8025J3800
10571a62904m536N5276K3971L5143k1039k9548p209m3095J5861J15758M9463l6831
$$ plain form
10559 -9690 -69086 -141853 -169628 -97482 -99253 -48404 13979 -4920 -38264 -8043 -13050 4399
10547 4399 -94540 -179851 -90876 30541 7568 5612 34412 102397 167808 119652 92352 131856
10535 131856 150972 150451 172584 116687 52619 71805 17242 40693 32313 66027 16564 -48106
10523 -48106 -104232 -99046 -64943 71321 89144 65158 7336 45012 91203 102517 25363 -18053
10511 -18053 -5811 99800 120744 125361 67816 39385 95800 87190 53283 106248 73052 66617
10499 66617 -31793 -891 -19456 45393 7923 -28038 -106686 -184169 -170634 -135163 -134140 -67439
10487 -67439 -92356 -109717 -148869 -116069 -155216 -169082 -99822 -65592 -36125 -49633 -113617 -66105
10475 -66105 -12242 25656 92961 157260 219482 178831 63925 -65992 -45814 42045 53931
$$ packed form
10559i690n9396p2767k7775P2146j771N0849O2383j8899l3344L0221n007J7449
10547D399r8939q5311Q8975J21417k2973j956K8800O7985O5411m8156k7300L9504
10535A31856J9116n21K2133n5897o4068J9186n4563K3451q380L3714m9463o4670
10523d8106n6126N186L4103J36264J7823k3986n7822L7676M6191J1314p7154m3416
10511a8053J2242J05611K0944M617n7545k8431N6415q610l3907N2965l3196o435
10499F6617r8410L0902j8565O4849l7470l5961p8648p7483J3535L5471J023O6701
10487f7439k4917j7361l9152L2800l9147j3866O9260L4230K9467j3508o3984M7512
10475f6105N3863L7898O7305O4299O2222m0651j14906j29917K0178Q7859J1886
$$ plain form
10464 53931 -12129 15825 22336 70181 17695 -45604 -76892 -26380 50184 129842 120799 77012
10452 77012 43855 2658 -32658 -26603 -41516 -51396 926 -28668 17044 30998 24486 54834
10440 54834 30816 16169 37128 76131 56546 102764 58616 73306 57543 18668 -85830
10429 -85830 -38414 -10959 57209 63148 29550 56382 135968 125663 20294 -49349 -124511 -108984
10417 -108984 -121651 -118474 -77453 -89924 -173940 -172194 -131330 -135472 -81374 -92625 -158812 -89823
10405 -89823 -43988 22598 59762 6230 -20078 -20952 -15090 -4276 6095 -41622 -113821 -105977
10393 -105977 -37785 -19804 -11350 72895 71359 -31064 -42069 -53 22599 -8277 44502 -4866
10381 -4866 -136280 -177340 -121920 -179158 -181762 -169739 -178692 -127982 -32699 48313 34762 -146
$$ packed form
10464E3931o6060K7954O511M7845n2486o3299l1288N0512P6564P9658r043m3787
10452G7012l3157m1197l5316O055j4913r880N2322k9594M5712J3954o512L0348
10440E4834k4018j4647K0959L9003j9585M6218m4148J4690j5763l8875j04498
10429h5830M7416K7455O8168N939l3598K6832P9586j0305j05369o9643p5162J5527
10417a08984j2667L177M1021j2471q4016J746M0864m142N4098j1251o6187O8989
10405h9823M5835O6586L7164n3532k6308q74N862J0814J0371m7717p2199P844
10393a05977O8192J7981Q454Q4245j536j02423j1005M2016K2652l0876N2779m9368
10381d866j31414m1060N5420n7238k604J2023q953N0710R5283Q1012j3551l4908
$$ plain form
10369 -146 -12449 12370 94515 172020 205358 119415 91671 95800 101436 120068 51488 -1505
10357 -1505 -935 51152 64756 2895 -30890 13498 25375 34387 55374 39759 -71079 -165532
10345 -165532 -160627 -60968 -48210 -68270 -17726 23974 34647 43959 161331 142697 46647 31237
10333 31237 50288 -23657 -50889 -55282 -70475 -77060 797 57792 107297 91116 14168 -35539
10321 -35539 -56509 14440 34839 43174 99629 33277 -30317 -18653 -19782 71605 189696 165965
10309 165965 99452 78190 21124 62585 109552 102467 65438 32383 30615 -10583 -64118 -38115
10297 -38115 -46441 -140482 -123318 -113225 -3775 54902 21137 -49633 -45532 -90140 -72547 36331
10285 36331 92775 77760 98108 118957 131436 111907 -14034 -45845 59168 103627 101425
$$ packed form
10369a46j2303K4819Q2145P7505L3338q5943k7744M129N636J8632o8580n2993
10357a505N70N2087J3604o1861l3785M4388J1877R012K0987j5615j10838r4453
10345a65532M905R9659J2758k0060N0544M1700J0673R312J17372j8634r6050j5410
10333C1237J9051p3945k7232m393j5193o585P7857N6995M9505j6181p6948m9707
10321c5539k0970P0949K0399Q335N6455o6352o3594J1664j129R1387J18091k3731
10309A65965o6513k1262n7066M1461M6967p085l7029l3055j768m1198n3535K6003
10297c8115q326r4041J7164J0093J09450N8677l3765p0770M101m4608J7593J08878
10285C6331N6444j5015K0348K0849J2479j9529j25941l1811J05013M4459k202
$$ plain form
10274 101425 98119 137531 116340 121055 -2158 -86088 -66000 -59308 -85958 -131798 -186223 -171743
10262 -171743 -120352 -66384 -95758 -120754 -126880 -71583 -120560 -181544 -165671 -105118 -111695 -166624
10250 -166624 -231888 -212495 -116335 5729 22121 -29185 -70697 -61143 39702 102320 95833
10239 95833 42801 -42838 14187 24291 49200 -8891 -5782 1258 -27823 16186 -21319 -22387
10227 -22387 -4734 30966 4206 94877 135003 39635 -36695 -14227 -8586 -6720 2304 -28816
10215 -28816 -79989 -77562 -52314 35374 30545 17013 136090 202355 118038 -22221 -120121 -127498
10203 -127498 -7782 103286 118832 -11262 -57049 -21061 25656 41356 -41396 -34002 32968
10192 32968 32400 18346 -2089 18783 32849 23690 62540 93582 82707 71870 113741 166857
$$ packed form
10274A01425l306L9412k1191M715j23213q3930K0088O692k6650m5840n4425J4480
10262a71743N1391N3968k9374k4996o126N5297m8977o0984J5873O0553o577n4929
10250a66624o5264J9393R6160J22064J6392n1306m1512R554J00845O2618o487
10239I5833n3032q5639N7025J0104K4909n8091L109P040k9081M4009l7505j068
10227b2387J7653L5700k6760R0671M0126r5368p6330K2468N641J866R024l1120
10215b8816n1173K427K5248Q7688m829j3532J19077O6265q4317j40259r7900p377
10203a27498J19716J11068J5546j30094m5787L5988M6717J5700q2752P394O6970
10192C2968n68j4054k0435K0872J4066r159L8850L1042j0875j0837M1871N3116
$$ plain form
10180 166857 125919 74861 -30474 -115528 -122940 -112681 -85748 -49292 -85193 -119332 -82468
10169 -82468 -56095 -24943 -27031 -10704 -17219 -51801 -11327 30098 50105 26849 18530 14739
10157 14739 -18755 -15257 -74798 -41379 43383 20983 -22791 72452 114920 75347 -48919 -64558
10145 -64558 -120760 -217780 -213675 -143225 -70407 -54678 -103059 32909 119568 88134 52044 62464
10133 62464 29321 14345 -50264 -136218 -101880 -75841 -60428 -57931 -8183 -8401 -96037 -95315 48335
10120 48335 94856 16130 -3478 18588 19430 52245 22106 -62984 -97843 -139274 -116635 -2495
10108 -2495 36582 -2836 -45260 -60873 -57494 -86168 -82928 -41805 -19274 -18347 -17098 -28778 18983
10095 18983 90601 65045 -32208 -133440 -115334 -118859 -18947 33511 69512 20013 -1067 9156
$$ packed form
10180A66857m0938n1058j05335q5054p412J0259K6933L6456l5901l4139L6864
10169h2468K6373L1152k088J6327o515l4582M0474M1425K0007k3256q319l791
10157A4739l3494L498n9541L3419Q4762k2400m3774R5243M2468l9573j24266j5639
10145f4558n6202r7020M105P0450P2818J5729m8381J35968Q6659l1434l6090J0420
10133F2464l3143j4976o4609q5954L4338K6039J5413K497M9748k18q7636P22J43650
10120D8335M6521p8726j9608K2066Q42L2815l0139q5090l4859m1431K2639J14140
10108b495L9077l9418m2424j5613L379k8674L240M1123K2531R27J249j1680M7761
10095A8983P1618k5556r7253j01232J8106l525R9912N2458L6001m9499k1080J0223
$$ plain form
10083 9156 -2267 20317 -10534 36472 9825 8220 31284 -14954 -88881 -92543 -40950 -11807
10071 -11807 -103387 -39239 -13441 -102269 -94677 -18784 16272 16934 -9434 -68631 -85872 -108414
10059 -108414 -71012 -26123 10449 6276 17734 49150 43665 12558 52180 76479 167654 84206
10047 84206 -6472 -93896 -89371 -74753 -53870 -86110 -35162 -59190 -131896 -129744 -40540 -24338
10035 -24338 -39023 -38798 -95322 -119445 -133617 -51437 -33853 -5063 -3653 -53485 -52613 -87725 20724
10022 20724 19933 -34835 -72335 -169799 -226469 -171984 -117302 -77699 -34503 -102549 -98021 -44969
10010 -44969 -38213 -17876 12017 121704 68211 -31315 -56544 -61162 -54632 -115365 -113621 -104739
9998 -104739 -171433 -169078 -110098 -4220 26138 42176 37832 -37395 -72935 -53819 -74354 -116333
$$ packed form
10083I156j1423K2584l0851M7006k6647j605K3064m6238p3927l662N1593K9143
10071a1807r1580O4148K5798q8828P592P5893L5056O62k6368n9197j7241k2542
10059a08414L7402M4889L6572m173J1458L1416n485l1107L9622K4299R1175q3448
10047H4206r0678q7424M525J4618K0883l2240N0948k4028p2706K152Q9204J6202
10035b4338j4685K25n6524k4123j4172Q2180J7584K8790J410m9832Q72l5112J08449
10022B0724p91n4768l7500r7464n6670N4485N4682L9603M3196o8046M528N3052
10010d4969O756K0337K9893J09687n3493r9526k5229m618O530o0733J744Q882
9998a04739o6694K355N8980J05878L0358J6038m344p5227l5540J9116k0535m1979
$$ plain form
9986 -116333 -110316 -37818 -11052 65992 94625 71708 31056 63430 -10663 -18499 -39973 -36645
9974 -36645 11339 -8763 -38802 -97561 -90239 -97157 -37200 -34697 22635 121741 58803 -30865
9962 -30865 -71903 15681 23443 22035 -42400 -120176 -115128 -155219 -108516 -54724 -61053 -72851 -95305
9949 -95305 -79691 27190 47936 -17715 -33563 46919 47512 -42362 -127995 -44710 -51569 14177
9937 14177 78211 78226 44855 -9279 -24281 -23254 -42271 -28334 -21282 -29710 -49651 -75123 -97481
9924 -97481 -88065 -16389 10732 104011 111981 56880 81008 54869 4689 -65622 -36120 34213
9912 34213 -12486 -23668 -76120 -186950 -111182 46143 79889 54064 -2376 -95457 -143739
9901 -143739 -115256 -76217 -41136 -29249 -46531 -23826 -60344 4531 9407 -52548 -25762 -62153
$$ packed form
9986a16333O017P2498K6766P7044K8633k2917m0652L2374p4093p836k1474L328
9974c6645M7984k0102l0039n8759P322o918N9957K503N7332R9106o2938q9668
9962c0865m1038Q7584P762j408o4435p7776N048m0091M6703N3792o329j1798k2454
9949i5305J5614J06881K0746o5651j5848Q0482N93q9874q5633Q3285o859O5746
9937A4177O4034J5l3371n4134j5002J027j9017J3937P052q428j9941k5472k2358
9924i7481R416P1676K7121R3279P970n5101K4128k6139n0180p0311K9502P0333
9912C4213m6699j1182n2452j10830P5768J57325L3746k5825n6440r3081m8282
9901a43739K8483L9039L5081J1887j7282K2705l6518O4875M876o1955K6786l6391
$$ plain form
9889 -62153 -77678 -71214 -40714 32701 37977 7897 4452 -34168 -9371 32414 26021 86379 122925
9876 122925 121616 15348 -31554 -51250 -129602 -102773 -79608 -89048 -125928 -124878 -98325 43451
9864 43451 43056 29440 46899 96637 33199 -543 -15913 -52827 -152319 -140918 -2022 30138
9852 30138 153494 221093 181705 143465 110962 96340 85303 62142 4305 13497 77101 150308
9840 150308 143927 49598 30283 30111 3649 38717 62022 27208 110217 126056 80196 14957
9828 14957 66137 43320 -68398 -35095 16076 15851 53077 129784 127010 109129 5795 -75640
9816 -75640 -21526 51594 6918 -90657 -80770 -79381 -47347 4651 -55417 41498 -20338 -135403
9804 -135403 -90765 48745 29803 26976 43728 101062 86403 132139 115067 37173 15450 -24303
$$ packed form
9889f2153j5525O464L0500P3415N276l0080l445l8620K4797M1785o393O0358L6546
9876A22925j309j06268m6902j9696p8352K6829K3165r440l6880J050K6553J41776
9864D3451l95j3616J7459M9738o3438l3742j5370l6914r9492J1401J38896L2160
9852C0138J23356O7599l9388l8240l2503j4622j1037k3161n7837R192O3604P3207
9840A50308o381r4329j9315j72k6462L5068K3305l4814Q3009J5839m5860o5239
9828A4957N1180k2817j11718L3303N1171k25L7226P6707k774j7881j03334q1435
9816g5640N4114P3120m4676r7575R887J389L2034N1998o0068R6915o1836j15065
9804a35403M4638J39510j8942k827J6752N7334j4659M5736j7072p7894k1723l9753
$$ plain form
9792 -24303 -13959 72786 60098 15039 14465 82393 84862 81251 19385 -75216 -163325 -106684 -37965
9779 -37965 69703 90018 35961 35673 -34272 -85901 -84632 -115619 -188287 -162712 -59438 -49663
9767 -49663 -101871 -174405 -269890 -167144 -48014 -57994 -75721 26581 87309 103194 49894
9756 49894 3560 -93030 -109346 -107012 -116663 -110482 -36126 -28281 -23073 -50252 -104558 -164113 -106701
9743 -106701 -134817 -183525 -122865 -73539 -39936 -6171 -47207 -6933 7188 21309 47032 96100
9731 96100 74175 42175 6104 577 -19669 -27303 34226 68794 -1378 -61761 -34655 19547
9719 19547 17160 59609 76113 -11910 -49359 -111593 -88987 -1473 26164 20344 64725 118957
9707 118957 171903 87005 15261 75134 71217 78702 22782 -30345 46644 231 104 47468
$$ packed form
9792b4303J0344Q6745j2688m5059n74O7928K469l611o1866r4601q8109N6641O8719
9779c7965J07668K0315n4057k88o9945n1629J269l0987p2668K5575J03274R775
9767d9663n2208p2534r5485J02746J19130r980j7727J02302O0728J5885n3300
9756D9894m6334r6590j6316K334r651O181P4356P845N208k7179n4306n9555N7412
9743a06701k8116m8708O0660M9326L3603L3765m1036M0274J4121J4121K5723M9068
9731I6100k1925l2000l6071n527k0246p634O1529L4568p0172o0383K7106N4202
9719A9547k387M2449J6504q8023l7449o2234K2606Q7514K7637n820M4381N4232
9707A18957N2946q4898p1744N9873l917P485n5920n3127P6989m6413j27M7364
$$ plain form
9695 47468 97426 96082 83950 1823 -40424 -90366 -71164 48941 66341 116393 150783 155371
9683 155371 86116 152475 137309 154399 175384 41185 -79804 -34305 47515 36905 17559
9672 17559 -6613 28037 70208 86736 68031 12702 23399 98891 57834 3720 -16064 -77616
9660 -77616 -86387 -62445 -63982 -67484 -26044 -34438 64785 121557 50172 -16329 47934 17652 84339
9647 84339 100996 44698 20634 -79946 -15518 39457 84735 98701 157451 134927 96116 89048
9635 89048 51992 79979 33267 -14793 -31449 -85776 -1784 -1883 -53628 36888 145372 137430
9623 137430 48360 -76479 -141213 -128388 9628 99277 99497 88729 -11520 -91796 -37637
9612 -37637 27865 70753 48523 78023 141339 79987 18994 34993 117712 149308 75672 17069
$$ packed form
9695D7468M9958j344j2132q2127m2247m9942J9202J20105J7400N0052L4390M588
9683A55371o9255O6359j5166J7090K0985j34199j20989M5499Q1820j0610j9346
9672A7559k4172L4650M2171J6528j8705n5329J0697P5492m1057n4114j9784o1552
9660g7616q771K3942j537l502M1440q394R9223N6772p1385o6501O4263l0282O6687
9647H4339J6657n6298k4064j00580O4428N4975M5278J3966N8750k2524l8811p068
9635H9048l7056K7987m6712m8060j6656n4327Q3992r9n1745R0516J08484p942
9623A37430q9070j24839o4734J2825J38016Q9649K20j0768j00249q0276N4159
9612c7637O5502M2888k2230K9500O3316o1352o0993J5999Q2719L1596p3636n8603
$$ plain form
9600 17069 19691 59313 87186 63812 22924 22315 -49963 -19572 -940 80698 123766 111042
9588 111042 55664 21511 -21524 -4340 -33247 -75304 -76077 -2466 51194 149744 89840 87633
9576 87633 99773 125715 31495 -12374 -12742 42744 58670 61271 77921 43311 78350 185207
9564 185207 221770 259182 161679 134829 100581 142706 200841 160358 72814 116738 136755 197761
9552 197761 256169 270457 276931 257964 194175 141111 162968 253752 163819 102523 45558 54962
9540 54962 133009 145472 146864 193926 210812 195014 227045 284281 320765 349730 342604 270571
9528 270571 187676 206804 215424 228544 237572 279246 368327 443909 467471 515703 440311 478415
9516 478415 483059 484525 512952 514153 460888 433908 448110 493486 485781 462343 530380 606085
$$ packed form
9600A7069K622L9622K7873k3374m0888o09p2278L0391J8632Q1638M3068j2724
9588A11042n5378l4153m3035J7184k8907m2057p73P3611N3660R8550n9904k207
9576H7633J2140K5942r4220m3869l68N5486J5926K601J6650l4610L5039J06857
9564A85207L6563L7412r7503k6850l4248M2125N8135m0483q7544M3924K0017O1006
9552A97761N8408J4288O474j8967o3789n3064K1857R0784q9933o1296n6965R404
9540E4962P8047J2463J392M7062J6886j5798L2031N7236L6484K8965p126p2033
9528B70571q2895J9128Q620J3120R028M1674Q9081P5582K3562M8232p5392L8104
9516D78415M644J466K8427J201n3265k6980J4202M5376p705k3438O8037P5705
$$ plain form
9504 606085 565785 635793 684952 688623 628611 723989 759664 819705 891947 900894 922025 1040513
9492 1040513 1079862 1168199 1265347 1291531 1347243 1359212 1413619 1453364 1576612 1718420 1832021
9481 1832021 1932687 1967383 2100629 2249492 2453499 2651595 2845372 3099603 3365830 3615642
9471 3615642 3810210 3987247 4223649 4493511 4888158 5329747 5720600 6025792 6424301 6781274
9461 6781274 7205844 7637696 8011258 8374896 8766736 9133846 9461500 9698727 9909305 10013861
9451 10013861 9973785 9882611 9715788 9395097 8971586 8522589 8057686 7566995 7048935 6632519
9441 6632519 6263403 5811344 5378555 5020258 4700607 4401230 4139679 3938785 3692224 3456719
9431 3456719 3272776 2996589 2756591 2558020 2333810 2240702 2070718 1942638 1842058 1768212
$$ packed form
9504F06085m0300P0008M9159L671o0012R5378L5675O0041P2242Q947K1131J18488
9492A040513L9349Q8337R7148K6184N5712J1969N4407L9745J23248J41808J13601
9481A832021J00666L4696J33246J48863K04007J98096J93777K54231K66227K49812
9471C615642J94568J77037K36402K69862L94647M41589L90853L05192L98509L56973
9461F781274M24570M31852L73562L63638L91840L67110L27654K37227K10578J04556
9451A0013861m0076r1174j66823l20691m23511m48997m64903m90691n18060m16416
9441F632519l69116m52059m32789l58297l19651k99377k61551k00894k46561k35505
9431C456719j83943k76187k39998j98571k24210r3108j69984j28080j00580p3846
$$ plain form
9421 1768212 1599930 1648597 1611739 1527505 1398901 1290227 1203671 1200014 1102181 989737 918583
9410 918583 930414 978667 866152 781090 784646 838872 856507 872515 780345 725561 668666 599207
9398 599207 594348 612279 646244 569162 491232 555232 536035 474573 498525 533648 520215 515318
9386 515318 478024 467148 436760 434287 428597 503966 499016 434099 298479 279776 342630 359811
9374 359811 371502 312189 294061 218371 223886 269555 289008 275638 216271 208733 198397 132335
9362 132335 63442 76317 139527 144322 6085 10219 -8675 -8234 10178 139491 193857 105561
9350 105561 33832 53904 12386 36614 48900 127396 135711 88043 39836 9583 67496 97509
9338 97509 102070 87304 -1081 -13714 98992 224935 250792 181016 171155 192431 119812 109904
$$ packed form
9421A768212j68282M8667l6858q4234j28604j08674q6556l657r7833j12444p1154
9410I18583J1831M8253j12515q5062L556N4226J7635J6008r2170n4784n6895o9459
9398E99207m859J7931L3965p7082p7930O4000j9197o1462K3952L5123j3433m897
9386E15318l7294j0876l0388k473n690P5369m950o4917j35620j8703O2854J7181
9374C59811J1691n9313j8128p5690N515M5669J9453j3370n9367p538j0336o6062
9362A32335o8893J2875O3210M795j38237M134j8894M41J8412J29313N4366q8296
9350A05561p1729K0072m1518K4228J2286P8496Q315m7668m8207l0253N7913L0013
9338I7509M561j4766q8385j2633J12706J25943K5857o9776r861K1276p2619r908
$$ plain form
9326 109904 88387 37793 8231 17075 42397 118668 170908 142026 168477 214989 200874 110973
9314 110973 155070 246935 216368 190011 201812 185144 93683 100013 124377 114871 25399 -44473
9302 -44473 -30863 57968 62396 -9591 50856 52494 45570 101558 129144 164725 154247 47043
9290 47043 9749 559 53647 30805 15161 50233 108058 171323 152572 119039 121176 136147
9278 136147 95857 25017 -19656 60776 71518 29615 41039 27567 11663 108332 137284 64722
9266 64722 106629 56276 48658 75655 41415 -985 -11652 -18614 -20463 1226 59868 50945 50761
9253 50761 28975 104662 119045 111896 151939 102071 106911 54791 78153 26279 6581 94947
9241 94947 57514 -11427 -33518 30362 85321 40602 44728 98669 71125 -58281 -126755 -158512
$$ packed form
9326A09904k1517n0594k9562Q844K5322P6271N2240k8882K6451M6512j4115q9901
9314A10973M4097R1865l0567k6357J1801j6668r1461O330K4364r506q9472o9872
9302d4473J3610Q8831M428p1987O0447J638o924N5988K7586L5581j0478j07204
9290D7043l7294r190N3088k2842j5644L5072N7825O3265j8751l3533K137J4971
9278A36147m0290p0840m4673Q0432J0742m1903J1424j3472j5904R6669K8952p2562
9266F4722M1907n0353p618K6997l4240m2400j0667o962j849K1689N8642q923j84
9253E0761k1786P5687J4383p149M0043m9868M840n2120K3362n1874j9698Q8366
9241I4947l7433o8941k2091O3880N4959m4719M126N3941k7544j29406o8474l1757
$$ plain form
9229 -158512 -42112 -6874 -15387 23107 85334 12622 27872 16144 -73701 -106702 -87143 -26227
9217 -26227 47057 35727 -3150 88007 163848 40670 -56828 -131097 -79123 17754 126940
9206 126940 193859 190979 126975 90972 132500 109124 89022 66168 3608 -16423 7870 14581
9194 14581 -62860 -151783 -108753 -35248 2375 6344 34896 34805 43164 23637 69414 181670 137228
9181 137228 88589 4385 -13940 -28952 30355 -19593 27975 4848 30738 -1716 -46938 -18592
9169 -18592 -122148 -105162 -39442 -30135 -65722 -69269 -76806 -32517 -31186 -80068 -75030 -61337 -22760
9156 -22760 -36181 -34928 76881 95573 26105 -36983 -10422 54556 26667 -37167 6699 43293
9144 43293 -5379 -21268 -37474 -22416 -55054 -130092 -59094 22930 33136 96293 102802 94672
$$ packed form
9229a58512J16400L5238q513L8494O2227p2712J5250j1728q9845l3001J9559O0916
9217b6227P3284j1330l8877R1157P5841j23178r7498p4269N1974R6877J09186
9206A26940O6919k880o4004l6003M1528k3376k0102k2854o2560k0031K4293O711
9194A4581p7441q8923M3030P3505L7623L969K8552r1Q359j9527M5777J12256m4442
9181A37228m8639q4204j8325j5012N9307m9948M7568k3127K5890l2454m5222K8346
9169a8592j03556J6986O5720R307l5587l547p537M4289J331m8882N038J3693L8577
9156b2760j3421J253J11809J8692o9468o3088K6561O4978k7889o3834M3866L6594
9144D3293m8672j5889j6206J5058l2638p5038P0998Q2024J0206O3157O509q130
$$ plain form
9132 94672 67087 109950 104045 45210 -12779 -96605 -125819 -76476 -17405 -80697 -138146 -93569
9120 -93569 -53647 -27691 -6142 76440 84692 10107 -33751 -47810 2914 41890 -4634 11023
9108 11023 18717 -60502 -66877 -41299 -17056 11446 -36573 -91874 -60045 -78473 13245 -54404
9096 -54404 -91733 -84836 -29789 15271 -49749 -134886 -130397 -157454 -152063 -102858 -52742 45973
9084 45973 22253 -7806 24218 -12328 -17458 25927 -54690 -89018 -123415 -136679 -102806 -35203
9072 -35203 -67968 -104549 -88113 -66327 23445 101182 155368 81916 -7511 -127113 -181864 -120298
9060 -120298 -55538 5636 105202 138561 202397 159575 12064 -19954 -36329 -3338 -10273 11199
9048 11199 48749 80061 -58020 -140673 -110348 -2130 53511 39551 -17653 28443 5231
$$ packed form
9132I4672k7585M2863n905n8835n7989q3826k9214M9343N9071o3292n7449M4577
9120i3569L9922K5956K1549Q2582Q252p4585m3858j4059N0724L8976m6524J5657
9108A1023P694p9219o375K5578K4243K8502m8019n5301L1829j8428R1718o7649
9096e4404l7329O897N5047M5060o5020q5137M489k7057N391M9205N0116R8715
9084D5973k3720l0059L2024l6546n130M3385q0617l4328l4397j3264L3873O7603
9072c5203l2765l6581J6436K1786Q9772P7737N4186p3452q9427j19602n4751O1566
9060a20298O4760O1174R9566L3359O3836m2822j47511l2018j6375L2991o935K1472
9048A1199L7550L1312j38081q2653L0325J08218N5641j3960n7204M6096k3212
$$ plain form
9037 5231 -25419 -64759 -76931 4583 2767 -13048 30894 -69314 -126408 -174863 -218056 -84342
9025 -84342 26682 8128 51622 18343 -55668 -45361 -52895 -5763 1491 -161736 -159488 -78529
9013 -78529 2814 47155 57577 -16203 -85318 -14048 19371 77621 76352 -7974 -46451 -35205
9001 -35205 -69775 -101526 -71050 -59433 -38664 -3732 25636 100899 76994 48747 34448 70607
8989 70607 131271 112529 -13200 -82818 -103868 -115664 -119687 -90489 -66284 -61790 9139 40772
8977 40772 71943 47168 -92228 -112314 -70012 -49463 -16336 -26402 10645 -4964 11707 27207
8965 27207 -39711 -86202 -134235 -58919 -42092 -29189 -25301 -22079 -7992 21440 -11088 -49838
8953 -49838 -72334 -10811 51341 69138 43820 735 52501 28910 -93901 -107430 -54252 -9658
$$ packed form
9037E231l0650l9340j2172Q1514j816j5815M3942j00208n7094m8455m3193J33714
9025h4342J11024j8554M3494l3279p4011J0307p534M7132P254j63227K248Q0959
9013g8529Q1343M4341J0422p3780o9115P1270L3419N8250j269q4326l8477J1246
9001c5205l4570l1751L0476J1617K0769L4932K9368P5263k3905k8247j4299L6159
8989G0607O0664j8742j25729o9618k1050j1796m023K9198K4205M494P0929L1633
8977D0772L1171k4775j39396k0086M2302K0549L3127j0066L7047j5609J6671J5500
8965B7207o6918m6491m8033P5316J6827J2903L888L222J4087K9432l2528l8750
8953d9838k2496O1523O2152J7797k5318m3085N1766k3591j22811j3529N3178M4594
$$ plain form
8941 -9658 20251 -63124 -28182 5637 21879 59163 50986 59433 45789 11409 84749 75511 76763
8928 76763 52811 -23593 -68172 -68728 -62270 38857 126119 108356 36344 51641 104829 116404
8916 116404 18682 -1927 15293 19913 -37683 -68908 -20618 -29873 -54482 -57184 -92440 -55298
8904 -55298 -25002 -5310 -79191 -18461 91881 81014 10838 25150 108580 276910 247964
8893 247964 209484 131391 11694 -5064 71380 104640 216743 169294 88818 47763 91883
8882 91883 100455 126149 129686 92893 71287 75933 1494 5690 66882 114183 202418 205016 288856
8869 288856 344646 260471 162568 125818 162621 167445 196743 200726 101891 62937 42497 54827
8857 54827 120158 22316 -17319 27881 18520 -7523 -103965 -164465 -92692 86019 141348 130449
$$ packed form
8941i658K9909q3375L4942L3819J6242L7284q177Q447j3644l4380P3340r238J252
8928G6763k3952p6404m4579n56O458J01127Q7262j7763p2012J5297N3188J1575
8916A16404r7722k0609J7220M620n7596l1225M8290r255k4609k702l5256L7142
8904e5298L0296J9692p3881O0730J10342j0867p0176J4312Q3430J68330k8946
8893B47964l8480p8093j19697j6758P6444L3260J12103m7449q0476m1055M4120
8882I1883Q572K5694L537l6793k1606M646p4439M196O1192M7301Q8235K598Q3840
8869B88856N5790q4175r7903l6750L6803M824K9298L983r8835l8954k0440J2330
8857E4827O5331r7842l9635M5200r361k6043r6442o0500P1773J78711N5329j0899
$$ plain form
8845 130449 42648 44347 -24415 -32683 -26034 -27224 -24384 -52430 -34918 22793 25058 42704 -2238
8832 -2238 -17153 -16491 9757 -25757 -63327 -17172 46415 66081 -10979 -63178 -24000 -41513
8820 -41513 -68465 -12126 79735 115756 114273 138436 105426 168757 211533 173843 106145 67956
8808 67956 43327 -9591 -41005 -115083 -126766 -110878 -65220 -33844 -60579 -43733 7227 155280
8796 155280 147395 -22569 -144328 -119353 32831 44575 -9052 -77890 -110347 -45463 -20401
8785 -20401 -75421 -114378 -52783 -99821 -96591 -66617 -95592 -70470 -52020 -66726 -87027 19125
8773 19125 71702 83282 75316 21433 -60799 -31133 -34543 21919 17694 -13485 35916 96850
8761 96850 86092 64848 63372 18495 -14524 16692 -9028 -359 -33348 -120781 -82617 -54976
$$ packed form
8845A30449q7801J699o8762q268O649j190K840k8046J7512N7711K265J7646m4942
8832b238j4915O62K6248l5514l7570M6155O3587J9666p7060n2199L9178j7513
8820d1513k6952N6339R1861L6021j483K4163l3010O3331M2776l7690o7698l8189
8808F7956k4629n2918l1414p4078j1683J5888M5658L1376k6735J6846N0960J48053
8796A55280p885j69964j21759K4975J52184J1744n3627o8838l2457O4884K5062
8785b0401n5020l8957O1595m7038L230K9974k8975K5122J8450j4706k0301J06152
8773A9125N2577J1580p966n3883q2232K9666l410N6462m225l1179M9401O0934
8761I6850j0758k1244j476m4877l3019L1216k5720Q669l2989q7433L8164K7641
$$ plain form
8749 -54976 -6877 48999 30676 101298 92206 97450 70012 91249 67195 36747 9963 14326
8737 14326 49358 105091 94580 86721 122024 79721 81170 119399 16457 -84760 -59134 3057
8725 3057 95473 35434 -8176 -24700 81336 128293 45929 38426 8956 -11888 -2161 12592
8713 12592 64339 22236 7478 126268 129537 119415 93884 142173 139826 125161 132515 193354
8701 193354 139374 93956 139099 172956 166812 118728 44902 35184 32518 37753 123881 186947
8689 186947 177951 161395 154674 165167 153810 207560 203120 172035 87741 45561 -50568 -66514
8677 -66514 -63149 -108703 -2479 35003 -22660 11362 134055 114850 94103 57184 63508 146405
8665 146405 103151 28872 -2882 81432 172195 110700 -5397 -10293 22919 66401 80672 61828
$$ packed form
8749e4976M8099N5876j8323P0622r092N244k7438K1237k4054l0448k6784M363
8737A4326L5032N5733j0511p859L5303m2303J449L8229j02942j01217K5626O2191
8725C057R2416o0039m3610j6524J06036M6957q2364p503k9470k0844R727J4753
8713A2592N1747m2103j4758J18790L269j0122k5531M8289k347j4665P354O0839
8701A93354n3980m5418M5143L3857o144m8084p3826r718k666N235Q6128O3066
8689A86947q996j6556o721J0493j1357N3750m440l1085q4294m2180r6129j5946
8677f6514L365m5554J06224L7482n7663L4022J22693j9205k0747l6919O324Q2897
8665A46405m3254p4279l1754Q4314R0763o1495j16097m896L3212M3482J4271j8844
$$ plain form
8653 61828 40926 158410 166131 64309 85171 107587 136375 216932 218032 168519 125331 84194
8641 84194 105285 151381 124244 161392 166642 239586 269155 265659 266256 205175 214138 230724 229326
8628 229326 266473 372339 388982 386273 386156 484660 546830 558853 567441 538077 522547 547220
8616 547220 580291 537083 483126 475200 424907 381131 326210 314128 389283 476359 471720 438676
8604 438676 379290 364367 349543 368229 299062 190139 160312 239878 227046 280819 312100
8593 312100 349112 278807 242003 135985 49888 70936 69330 68847 87799 97543 41890 -37093
8581 -37093 -34529 129342 110072 8437 -11601 9470 34741 92989 98377 81235 100456 108566
8569 108566 143280 143776 129268 24630 -41158 -9497 28868 -16589 -53285 38509 110946 100094
$$ packed form
8653F1828k0902J17484P721j01822K0862K2416K8788Q0557J100m9513m3188m1137
8641H4194K1091M6096k7137L7148N250P2944K9569l496N97o1081Q963J6586j398
8628B29326L7147J05866J6643k709j17R8504O2170J2023Q588k9364j5530K4673
8616E47220L3071m3208n3957p926n0293m3776n4921j2082P5155Q7076m639l3044
8604D38676n9386j4923j4824J8686o9167j08923k9827P9566j2832N3773L1281
8593C12100L7012p0305l6804j06018q6097K1048j606m83J8952R744n5653p8983
8581c7093K564J63871j9270j01635k0038K1071K5271N8248N388j7142J9221Q110
8569A08566L4714M96j4508j04638o5788L1661L8365m5457l6696R1794P2437j0852
$$ plain form
8557 100094 17678 -21808 178 48921 51062 25758 38167 -15937 -53904 -44492 53285 123543
$$ packed form
8557A00094q2416l9486K1986M8743K141k5304J2409n4104l7967R412R7777P0258
$$ [...]
##END NTUPLES=NMR SPECTRUM
##END=
