##TITLE=Analysis number 322083
Compound Code mo 07483
Project Code adrs
Chemist Name fudan
##JCAMPDX= 6.0         $$ Bruker NMR JCAMP-DX V2.0
##DATA TYPE= NMR SPECTRUM
##DATA CLASS= NTUPLES
##ORIGIN= Bruker BioSpin GmbH
##OWNER= nmr
$$ XWIN-NMR		Version 3.5
$$ Tue Sep 12 12:36:49 2006 GMT Daylight Time (UT+1h)  MAYBRIDGE\nmr@NMR_250MHZ
##.OBSERVE FREQUENCY= 250.131544655141
##.OBSERVE NUCLEUS= ^1H
##.ACQUISITION MODE= SIMULTANEOUS (DQD)
##.ACQUISITION SCHEME= undefined
##.AVERAGES= 16
##.DIGITISER RES= 18
##SPECTROMETER/DATA SYSTEM= dpx250
##.PULSE SEQUENCE= zg30
##.SOLVENT NAME= CDCl3
##.SHIFT REFERENCE= (INTERNAL, CDCl3, 0, 16.3917)
##AUDIT TRAIL= $$ (NUMBER, WHEN, WHO, WHERE, WHAT)
$$ ##TITLE= Audit trail, XWIN-NMR		Version 3.5
$$ ##JCAMPDX= 5.01
$$ ##ORIGIN= Bruker BioSpin GmbH
$$ ##OWNER= nmr
$$ C:\u/data/dgb/nmr/ADRS/620/pdata/1/auditp.txt
$$ ##AUDIT TRAIL=  $$ (NUMBER, WHEN, WHO, WHERE, WHAT)
(   1,<2006-09-12 12:36:27.28 +100>,<MAYBRIDGE\nmr>,<NMR_250MHZ>,
      <created by zg, POWCHK disabled, PULCHK disabled
       configuration hash MD5:
       E2 DF 36 D8 04 B2 41 60 5A D7 A3 38 5A 4B D0 FE
       data hash MD5: 64K
       0A 06 B5 F7 EA 64 1D 02 B3 08 D9 E0 B3 04 64 A9>)
(   2,<2006-09-12 12:36:40.71 +100>,<MAYBRIDGE\nmr>,<NMR_250MHZ>,
      <Start of raw data processing
       ef LB = 0.3 FT_mod = 6 PKNL = 1 SI = 32K 
       data hash MD5: 32K
       B3 62 DD 24 25 DA AF 32 6D B9 E5 D1 2A 01 1B 49>)
(   3,<2006-09-12 12:36:42.85 +100>,<MAYBRIDGE\nmr>,<NMR_250MHZ>,
      <apk 
       data hash MD5: 32K
       2F 3E 8C FD 11 C5 0A C3 98 BE 18 99 55 37 1A 77>)
(   4,<2006-09-12 12:36:43.71 +100>,<MAYBRIDGE\nmr>,<NMR_250MHZ>,
      <abs ABSG = 5 
       data hash MD5: 32K
       53 27 02 C8 C0 00 75 E0 77 C1 D0 EA 97 D6 C6 4B>)
$$ ##END=
$$ 
$$ hash MD5
$$ 6C B6 6C FA 2B 5A CB 62 41 F4 6F 5B EB 4B 5C F3
##$RELAX= 
##$RELAX= 
##$RELAX= 
##$RELAX= 
##$RELAX= 
##$RELAX= 
##$RELAX= 
$$ Bruker specific parameters
$$ --------------------------
##$DU= <C:\u>
##$EXPNO= 620
##$NAME= <ADRS>
##$PROCNO= 1
##$TYPE= <nmr>
##$USER= <dgb>
##$AMP= (0..31)
100 100 100 100 100 100 100 100 100 100 100 100 100 100 100 100 100 100 
100 100 100 100 100 100 100 100 100 100 100 100 100 100 
##$AQSEQ= 0
##$AQ_mod= 3
##$AUNM= <au_zg>
##$AUTOPOS= <48 >
##$BF1= 250.13
##$BF2= 250.13
##$BF3= 250.13
##$BF4= 250.13
##$BF5= 500.13
##$BF6= 500.13
##$BF7= 500.13
##$BF8= 500.13
##$BYTORDA= 1
##$CFDGTYP= 0
##$CFRGTYP= 5
##$CHEMSTR= <none>
##$CNST= (0..31)
1 1 145 1 1 1 1 1 1 1 1 1 1 1 1 1 1 1 1 1 1 1 1 1 1 1 1 1 1 1 1 1 
##$CPDPRG= <>
##$CPDPRG1= <>
##$CPDPRG2= <>
##$CPDPRG3= <>
##$CPDPRG4= <mlev>
##$CPDPRG5= <mlev>
##$CPDPRG6= <mlev>
##$CPDPRG7= <mlev>
##$CPDPRG8= <mlev>
##$CPDPRGB= <>
##$CPDPRGT= <>
##$D= (0..31)
0 1 0 0 0 0 0 0 0 0.06 0 0 0 0 0 0 0.0002 0 0 0 0 0 0 0 0 0 0 0 0 0 0 
0 
##$DATE= 1158060985
##$DBL= (0..7)
120 120 120 120 120 120 120 120 
##$DBP= (0..7)
150 150 150 150 150 150 150 150 
##$DBP07= 0
##$DBPNAM0= <>
##$DBPNAM1= <>
##$DBPNAM2= <>
##$DBPNAM3= <>
$$ [...]
##$SUBNAM7= <"">
##$SUBNAM8= <"">
##$SUBNAM9= <"">
##$SW= 20.6930455092707
##$SWIBOX= (0..15)
0 0 3 0 0 0 0 0 0 0 0 0 0 0 0 0 
##$SW_h= 5175.983436853
##$TD= 65536
##$TD0= 1
##$TE= 296.16
##$TE2= 300
##$TE3= 300
##$TEG= 300
##$TL= (0..7)
0 120 120 120 120 120 120 120 
##$TP= (0..7)
150 150 150 150 150 150 150 150 
##$TP07= 0
##$TPNAME0= <>
##$TPNAME1= <>
##$TPNAME2= <>
##$TPNAME3= <>
##$TPNAME4= <>
##$TPNAME5= <>
##$TPNAME6= <>
##$TPNAME7= <>
##$TPOAL= (0..7)
0.5 0.5 0.5 0.5 0.5 0.5 0.5 0.5 
##$TPOFFS= (0..7)
0 0 0 0 0 0 0 0 
##$TUNHIN= 0
##$TUNHOUT= 0
##$TUNXOUT= 0
##$USERA1= <user>
##$USERA2= <user>
##$USERA3= <user>
##$USERA4= <user>
##$USERA5= <user>
##$V9= 5
##$VALIST= <valist>
##$VCLIST= <CCCCCCCCCCCCCCC>
##$VD= 0
##$VDLIST= <DDDDDDDDDDDDDDD>
##$VPLIST= <PPPPPPPPPPPPPPP>
##$VTLIST= <TTTTTTTTTTTTTTT>
##$WBST= 1024
##$WBSW= 4
##$XGAIN= (0..3)
0 0 0 0 
##$XL= 0
##$YL= 0
##$YMAX_a= 521288
##$YMIN_a= -577537
##$ZGOPTNS= <>
##$ZL1= 120
##$ZL2= 120
##$ZL3= 120
##$ZL4= 120
##$ABSF1= 16.3917
##$ABSF2= -4.30147
##$ABSG= 5
##$ABSL= 3
##$ALPHA= 0
##$AQORDER= 0
##$ASSFAC= 0
##$ASSFACI= 0
##$ASSFACX= 0
##$ASSWID= 0
##$AUNMP= <proc_1d>
##$AZFE= 0.1
##$AZFW= 0.1
##$BCFW= 0
##$BC_mod= 0
##$BYTORDP= 0
##$COROFFS= 0
##$CY= 12.5
##$DATMOD= 1
##$DC= 0
##$DFILT= <>
##$DTYPP= 0
##$F1P= 14.0000005364418
##$F2P= -0.99999901652339
##$FCOR= 0.5
##$FTSIZE= 32768
##$FT_mod= 6
##$GAMMA= 0
##$GB= 0
##$INTBC= 1
##$INTSCL= 1
##$ISEN= 128
##$LB= 0.3
##$LEV0= 0
##$LPBIN= 0
##$MAXI= 10000
##$MC2= 0
##$MEAN= 0
##$ME_mod= 0
##$MI= 0
##$NCOEF= 0
##$NC_proc= -4
##$NLEV= 6
##$NOISF1= 0
##$NOISF2= 0
##$NSP= 0
##$NTH_PI= 0
##$NZP= 0
##$OFFSET= 16.3917
##$PC= 1
##$PHC0= 133.0094
##$PHC1= 23.85855
##$PH_mod= 1
##$PKNL= yes
##$PPARMOD= 0
##$PSCAL= 4
##$PSIGN= 0
##$REVERSE= no
##$SF= 250.130032590083
##$SI= 32768
##$SIGF1= 0
##$SIGF2= 0
##$SINO= 400
##$SIOLD= 32768
##$SREGLST= <1H.CDCl3>
##$SSB= 0
##$STSI= 32768
##$STSR= 0
##$SW_p= 5175.98343685301
##$SYMM= 0
##$S_DEV= 0
##$TDeff= 65536
##$TDoff= 0
##$TI= <Analysis number 999999
Compound Code 99
Book Reference 9
Project Code 9>
##$TILT= no
##$TM1= 0
##$TM2= 0
##$TOPLEV= 0
##$USERP1= <user>
##$USERP2= <user>
##$USERP3= <user>
##$USERP4= <user>
##$USERP5= <user>
##$WDW= 1
##$XDIM= 32768
##$YMAX_p= 452512501
##$YMIN_p= -384505
$$ End of Bruker specific parameters
$$ ---------------------------------
##NTUPLES= NMR SPECTRUM
##VAR_NAME=  FREQUENCY,     SPECTRUM/REAL,   SPECTRUM/IMAG
##SYMBOL=    X,             R,               I
##VAR_TYPE=  INDEPENDENT,   DEPENDENT,       DEPENDENT
##VAR_FORM=  AFFN,          ASDF,            ASDF
##VAR_DIM=   32768,         32768,           32768
##UNITS=     HZ,            ARBITRARY UNITS, ARBITRARY UNITS
##FACTOR=    0.157963299565203, 1,           1
##FIRST=     4100.05664146092, 0,            0
##LAST=      -1075.92679539209, 0,           0
##MIN=       -1075.92679539209, -384505,     0
##MAX=       4100.05664146092, 452512501,    0
$$ Real data points
##PAGE= N=1
##DATA TABLE= (X++(R..R)), XYDATA
$$ [...]
24354e3562K6036O781K0285n258l558l4506m7345J8262L7507K4457M7700J717
$$ -53562 -27526 -20745 -460 -5718 -9276 -43782 -91127 -72865 -35358 -10901 36799 38516
24342C8516J5257p312l6891r825k843p770P45p669j610l349k1581l2529L7920
$$ 38516 53773 46461 9570 -255 -3098 -10868 -10123 -17792 -19402 -22751 -44332 -76861 -38941
24329c8941R389j243n983n37l252J6482j4680J512J6953j3628m274L1446K2222
$$ -38941 -29552 -30795 -36778 -37315 -40567 -24085 -38765 -37253 -20300 -33928 -38202 -6756 15466
24316A5466K2738l9567l4242K663o917j1977n438J4721o180O149Q81l6591k3129
$$ 15466 38204 -1363 -35605 -32942 -39859 -51836 -57274 -42553 -48733 -42584 -41703 -78294 -101423
24303a01423M4253O2004k5986k1501j5745J040K0059M4209O6144L491O078k4024
$$ -101423 -57170 4834 -21152 -42653 -58398 -57358 -37299 6910 73054 76545 82623 58599
24291E8599n7810j7119j2828K7829J874k1992j4329k6221j2039L5215J7609k2878
$$ 58599 789 -16330 -29158 -1329 545 -21447 -35776 -61997 -74036 -38821 -21212 -44090
24279d4090M3010L6468N942j6183P406M970k8279n9963J2383K1267n844Q420m149
$$ -44090 -1080 35388 41330 25147 32553 37523 9244 -50719 -38336 -17069 -22913 -14493 -18642
24266a8642K0236O948j7180j3863J665J8979M934n478M286L0830K8290j1142k6054
$$ -18642 1594 8542 -8638 -22501 -20836 -1857 3077 -2401 1885 32715 61005 49863 23809
24253B3809j6184K990K4571j4020R629O684K8404J4306l0310j9355l9784l2342
$$ 23809 7625 10615 35186 21166 30795 37479 65883 80189 49879 30524 -9260 -41602
24241d1602K7171P78k0250m2846K0928K7243P090M8223K4026l0802j4316J5000
$$ -41602 -14431 -13653 -33903 -76749 -55821 -28578 -21488 26735 50761 19959 5643 20643
24229B0643j7249j6664M129J5330l8387k8706M42q237L1105k500J2077J788L5054
$$ 20643 3394 -13270 -9141 6189 -32198 -60904 -60462 -68699 -37594 -40094 -28017 -26229 8825
24216H825L9075k0218m3684q542k8096J0498p769J066O984j7368j4616M3556O4475
$$ 8825 47900 27682 -16002 -24544 -52640 -42142 -49911 -48845 -41861 -59229 -73845 -30289 34186
24203C4186m677N444L0863j3342N958m8960m0982r006L7917j1J2524M150J5962
$$ 34186 29509 34953 65816 52474 58432 9472 -31510 -40516 -2599 -2610 9914 14064 30026
24190C0026P954l3549o7759J7039M0463K829J0257J2616r589L878J4137r963P005
$$ 30026 37980 4431 -63328 -46289 -5826 -2997 7260 19876 10287 14165 28302 18339 25344
24177B5344l5167k8886l462j700K281M8952J5646J3502n438j7236l5040k3488
$$ 25344 -9823 -38709 -42171 -43871 -41590 7362 23008 36510 31072 13836 -21204 -44692
24165d4692k9002J187J4476Q625l3333O0301M9038j6424j1248j6903j0938K3951
$$ -44692 -73694 -72507 -58031 -49406 -82739 -22438 26600 10176 -1072 -17975 -28913 -4962
24153d962L3126O473L121l2953k6453K9565M9884l7906q294J0017o823o502K6096
$$ -4962 28164 34637 37758 4805 -21648 7917 57801 19895 11601 21618 14795 8293 34389
24140C4389j799j3364J4184J2835J0099o619K1555k1928k7137o344L534J5797
$$ 34389 32590 19226 33410 46245 56344 49725 71280 49352 22215 15871 19405 35202
24128C5202J7188j6477p404M614k7691j3865r274L1045j1750k0707k9088l8371
$$ 35202 52390 35913 28509 33123 5432 -8433 -17707 13338 1588 -19119 -48207 -86578
24116h6578M0115K6732N7935j2204j3976L172M7124n229J22K7717j3820l223o932
$$ -86578 -46463 -19731 38204 26000 12024 15196 62320 57091 57213 84930 71110 67887 60955
24103F0955m0793q536l0600j8272J2382N411j9283l834O468R884l8796O797L6856
$$ 60955 20162 11626 -18974 -37246 -24864 -19453 -38736 -42570 -36102 -26218 -65014 -58217 -21361
24090b1361J7994O810j4009L2358m2954q791j3283N546J4307L0540l1821j5680
$$ -21361 -3367 3443 -10566 21792 -21162 -29953 -43236 -37690 -23383 7157 -24664 -40344
24078d0344P958J2725o442l9855j4769L9312K3586M5274J7811n7j1531l1717j7094
$$ -40344 -32386 -19661 -26103 -65958 -80727 -41415 -17829 27445 45256 45199 33668 1951 -15143
24065a5143J2560K3598l7386M392l741J2950K0207K4403l9322k7088l106J3292
$$ -15143 -2583 21015 -16371 -11979 -15720 -2770 17437 41840 2518 -24570 -27676 -14384
24053a4384O918j0693r436K175J3885o06K2523l9717j9438o897J0983J0364K0567
$$ -14384 -7466 -18159 -27595 -25420 -11535 -12141 10382 -29335 -48773 -55670 -44687 -34323 -13756
24040a3756L489M644J4795K7461r539n889O126j8249m1131n0439m155R27J5039
$$ -13756 -10267 -5623 9172 36633 27094 21205 27331 9082 -32049 -82488 -86643 -85716 -70677
24027g0677R556j426J1342R220J2175J4740P856O180j9872O832L3701o644J5288
$$ -70677 -61121 -62547 -51205 -41985 -29810 -15070 -7214 -1034 -20906 -14074 19627 12983 28271
24014B8271L858m658M1752P990l8331l8924q508j4233l3579N12j4512J568L1084
$$ 28271 32129 27471 69223 77213 38882 -42 -8550 -22783 -56362 -55850 -70362 -68794 -37710
24001c7710M0097L3409M2160j7974l9005n0455L9138L2764k5902k2912l3355j0025
$$ -37710 2387 35796 77956 59982 20977 -29478 9660 42424 16522 -6390 -39745 -49770
23989d9770K3638K6973M253J7419j2474m6902J79K7553L8482Q466N42l0137p921
$$ -49770 -26132 841 5094 22513 10039 -36863 -36684 -9131 29351 37817 38359 8222 301
23976C01l921k21K1838J2072J1656L595o914J1838J6093k1674j6722P613k5455
$$ 301 -3620 -3841 17997 30069 41725 45320 38406 50244 66337 44663 27941 35554 10099
23963A0099j4400j1236k3847k3602M8716L7528J5001j1403l5222k2467Q27J513
$$ 10099 -4301 -15537 -39384 -62986 -14270 23258 38259 26856 -8366 -30833 -30006 -28493
23951b8493m5020Q183M4225m1516l6180L4295K7729M9738J4516k9561j7882J2185
$$ -28493 -73513 -65330 -21105 -62621 -98801 -64506 -36777 12961 27477 -2084 -19966 -7781
23939g781j6713l8200J1694J0669J2198K5683n106k4163K433L307K3931J7455
$$ -7781 -24494 -62694 -51000 -40331 -28133 -2450 -7556 -31719 -29286 -25979 -2048 15407
23927A5407p637l3697J411J6177K6339j7880j5787j465M485N601K224J0794M932
$$ 15407 7770 -25927 -24516 -8339 18000 120 -15667 -17132 -12647 -7046 -4822 5972 10904
23914A0904j9586k2633K6737j6826j96K3025o501M689P892l4869l1727P508O0180
$$ 10904 -8682 -31315 -4578 -21404 -21600 1425 -5076 -387 7505 -27364 -59091 -51583 8597
23901H597K2785J0649L519l2331j3026J7055m380m6982r30l1012j8604L5876N3109
$$ 8597 31382 42031 45550 13219 193 17248 12868 -34114 -35044 -66056 -84660 -48784 4325
23888D325L8533r100J0296k7962K1778m555k2126r581m311j3218n691J1543K1224
$$ 4325 42858 33758 44054 16092 37870 33315 11189 1608 -2703 -15921 -21612 -10069 11155
23875A1155j1679l4242K3243J6224J0003p465k1032J2368j0741m197K9726k3371
$$ 11155 -524 -34766 -11523 4701 14704 7239 -13793 -1425 -12166 -16363 13363 -10008
23863a0008j4739P532j689r529j3946K5056L3558k2309n69K4054O112Q135J1569
$$ -10008 -24747 -17215 -18904 -28433 -42379 -17323 16235 -6074 -6643 17411 23523 31658 43227
23850D3227j0717j4096r42p648P203j0667n288m110q850j9187K581J0207K6369
$$ 43227 32510 18414 17472 9824 17027 6360 1072 -3038 -11888 -31075 -28494 -18287 8082
23837H082Q499q523k9279Q034Q182l0457k3608j1525Q568O376K5856J3763o847
$$ 8082 16581 8058 -21221 -13187 -5005 -35462 -59070 -70595 -62027 -55651 -29795 -16032 -22879
23824b2879q077K7092k2456P224K5517J0560q742j6681j4180j8940J7418K3688
$$ -22879 -30956 -3864 -26320 -19096 6421 16981 8239 -8442 -22622 -41562 -24144 -456
23812d56j7601J1797j709M00K2852k2657J0834m48j3467l181r944M485K8415P637
$$ -456 -18057 -6260 -7969 -7569 15283 -7374 3460 3012 -10455 -13636 -23580 -19095 9320 16957
23798A6957n4976j4985j3604k9089J9983L3273K3094o05P575k2038J6700L3258
$$ 16957 -38019 -53004 -66608 -95697 -75714 -42441 -19347 -19952 -12377 -34415 -17715 15543
23786A5543J564l172j9627q45o366q120m461J617J5121Q62J0397m441o247r04
$$ 15543 17107 13935 -5692 -6537 -12903 -21023 -25484 -23867 -8746 -7884 2513 -1928 -8175 -9079
23772i079K2404p878k4054n1010j197L7496J8912J737k1830J1615P431l319o5
$$ -9079 13325 5447 -18607 -69617 -70814 -33318 -14406 -12669 -34499 -22884 -15453 -18772 -18837
23759a8837K0085j4857l9782j5711M7955J7398K5232K4623j6051K976k7043j4944
$$ -18837 1248 -13609 -53391 -69102 -21147 -3749 21483 46106 30055 33031 5988 -8956
23747h956J822k136K0820P619r336k2972J6117k3211m5856J974N3114J1595k0181
$$ -8956 -7134 -9270 11550 19169 9833 -13139 2978 -20233 -66089 -64115 -11001 594 -19587
23734a9587q809j18J3514Q553K2298l2011j09K924O070k5551J7262L6J1158O117
$$ -19587 -28396 -28514 -15000 -6447 15851 -16160 -16269 -13345 -7275 -32826 -15564 -15528 -4370 1747
23720A747L260p169k0624R928R15o402j1175J6952J7063Q608J7856j6489k6159
$$ 1747 5007 -2162 -22786 -12858 -11943 -18345 -29520 -12568 4495 13103 30959 14470 -11689
23707a1689j5953L3261k0815J9356J7998J4167k9076k5733l0125k666M3285K6844
$$ -11689 -27642 5619 -15196 4160 22158 36325 7249 -18484 -48609 -51275 -7990 18854
23695A8854l6253J189j3614j5386K9723p930m0991R522J6574j6815J3129J8649
$$ 18854 -17399 -16210 -29824 -45210 -15487 -23417 -64408 -54886 -38312 -55127 -41998 -23349
23683b3349O80L5555O321j5605k8100j9572J5870K7392k3008J5360K7546q678
$$ -23349 -22669 12886 19207 3602 -24498 -44070 -28200 -808 -23816 -8456 19090 10412
23671A0412M096K050J910k2238k041j6803m495m037l1538m869K7239O474j1417
$$ 10412 14508 16558 18468 -3770 -5811 -22614 -27109 -31146 -62684 -67553 -40314 -33840 -45257
23658d5257L2449k820l1231R821j2351K9301J4536J8588N1759k269k8700j4754
$$ -45257 -12808 -15628 -46859 -37038 -49389 -20088 -5552 13036 64795 62526 33826 19072
23646A9072j0580K2910k40K264m05m4333k4518j6867j8467K5862K1739P088k7
$$ 19072 8492 31402 31162 33426 33021 -11312 -35830 -52697 -71164 -45302 -23563 -16475 -16502
23633a6502K5323j199j3800r356k5125n537L395K7742M346o001m164j9853r555
$$ -16502 8821 7622 -6178 -15534 -40659 -46196 -42801 -15059 -10713 -16714 -20878 -40731 -50286
23620e0286L1217J5915l6433K053K0912K3365J5842J0381r833k242R201j3928
$$ -50286 -19069 -3154 -39587 -37534 -16622 6743 22585 32966 23133 20891 30092 16164
23608A6164o528k9186j556M2941O0053j4901j9790m2443k2975q594n5686J7531
$$ 16164 9636 -19550 -21106 21835 81888 66987 47197 4754 -18221 -26815 -82501 -64970
23596f4970J8589J5653k752p93j2837J4411k1929k5264L1551K9251L2586L0070
$$ -64970 -46381 -30728 -33480 -34273 -47110 -32699 -54628 -79892 -48341 -19090 13496 43566
23584D3566l2164j184L5643M017r083k1198m4036q193J3101m776l6406q742k9037
$$ 43566 11402 10218 45861 49878 40795 19597 -24439 -32632 -19531 -24307 -60713 -69455 -98492
23571i8492K3119n54J9705L6902M26K7802j1675J5229R994Q57j3530p660j6479
$$ -98492 -75373 -75927 -56222 -19320 -18894 8908 -2767 12462 22456 23313 9783 2123 -14356
23558a4356J2888k2595K4656L2548k919k9098q882Q914l423J7977J35O830n149
$$ -14356 -1468 -24063 593 33141 30222 1124 -7758 1156 -2267 15710 15845 22675 17526
23545A7526j0646J4894j1211k9450O755J5686q827r55l2795j4875K8385J9338
$$ 17526 6880 21774 10563 -18887 -12132 3554 -5273 -6228 -39023 -53898 -25513 -6175
23533f175L424Q783L3320k4084k6944P541J2292J9123J6210l0876l8795K5449
$$ -6175 -2751 6032 39352 15268 -11676 -4135 8157 27280 43490 12614 -26181 -732
23521g32L4749M881j126l530k2536k7291L605J1790k738k1415j5323J3735l2284
$$ -732 34017 38898 37772 34242 11706 -15585 -11980 -190 -2928 -24343 -39666 -25931 -58215
23508e8215P341L5700O3776M7017l3431n7087L962k3819j9189m11K4949L4931
$$ -58215 -50874 -15174 48602 95619 62188 5101 9063 -14756 -33945 -34356 -9407 25524
23496B5524R498M635R862M376l7992n699Q045k0704p792r116l6518l309n253o629
$$ 25524 35022 39657 49519 53895 15903 10204 18249 -2455 -10247 -19363 -55881 -59190 -64443 -71072
23482g1072j6947J6447J3249o890M460q889j1408K6796O2428O371m7577L7349
$$ -71072 -88019 -71572 -58323 -65213 -60753 -69642 -81050 -54254 8174 14545 -33032 4317
23470D317q69m0136l2415r394M4692R73m4348j4783Q658K8089M6959q606k4544
$$ 4317 3448 -36688 -69103 -78497 -33805 -32832 -77180 -91963 -83305 -55216 -8257 -16863 -41407
23457d1407l925M733L848L5720r247j7267j8148M1428j3827j7544q075K2725O3529
$$ -41407 -45332 -40599 -36751 -1031 -10278 -27545 -45693 -4265 -18092 -35636 -43711 -20986 42543
23444D2543P494N395k7261m6617O055j1186J5792N259p560l661J1713J416P998
$$ 42543 50037 55432 28171 -18446 -12391 -23577 -7785 -2526 -10086 -13747 -2034 -618 7380
23431G380J0159l6137k2194l419K066K633j1518k6737L0008O3834j6312p877k3779
$$ 7380 17539 -18598 -40792 -44211 -42145 -39512 -51030 -77767 -47759 16075 -237 -8114 -31893
23418c1893K0919J1722j7261o148N766l6073j2294M8578M4266K4943m868m8683
$$ -31893 -10974 748 -16513 -22661 -16895 -52968 -65262 -16684 27582 52525 47657 -1026
23406a026k4092O01M2758N058j2636l1459l3110K4270N2269L0879j1694l9922
$$ -1026 -25118 -24517 18241 23299 10663 -20796 -53906 -29636 22633 53512 41818 1896
23394A896j0880k3314P583L808m3838K0253M8350K3822k2358j4069q156O12j1921
$$ 1896 -8984 -32298 -24715 -20907 -64745 -44492 3858 27680 5322 -8747 -16903 -16291 -28212
23381b8212l3146k0803N4278l521R122j3882Q530L6936K7221k724j9434k6481
$$ -28212 -61358 -82161 -27883 -31404 -22282 -36164 -27634 9302 36523 33799 14365 -12116
23369a2116K0095N884k2552k6844j0511K8902k7508o308R806J0014P934P566J4415
$$ -12116 7979 13863 -8689 -35533 -46044 -17142 -44650 -50958 -41152 -31138 -23204 -15638 -1223
23356a223J1229O321j7329p37O070o928L091L3663k3509m7650N160J2547K07m432
$$ -1223 10006 16327 -1002 -1739 4331 -2597 494 34157 10648 -37002 -31842 -19295 -19088 -23520
23342b3520l6J2854J5936l5614n48K7014K4262j2592j8326K7421j807k166J104
$$ -23520 -23556 -10702 5234 -30380 -30928 -3914 20348 7756 -10570 16851 15044 12878 13982
23329A3982m1016N693P023j8493k1117P134k84j4940J1262L1080L8636r218j6475
$$ 13982 -27034 -21341 -14318 -32811 -53928 -46794 -47078 -62018 -50756 -19676 18960 9742 -6733
23316f733k0338J9965R288K5663J2596r690o3119l7399J8228J0625j4687J3959
$$ -6733 -27071 -7106 2182 27845 40441 30751 -32368 -69767 -51539 -40914 -55601 -41642
23304d1642J9120J1312M70j2440l1103J2218K0731j8604j8279K0158J1399j3356
$$ -41642 -22522 -11210 -10740 -23180 -54283 -42065 -21334 -39938 -58217 -38059 -26660 -40016
23292d0016L3063m20j2626K6856j9357l2837Q678L4048K3175J276j2637j4440
$$ -40016 -6953 -7373 -19999 6857 -12500 -45337 -36659 -2611 20564 21840 9203 -5237
23280e237P9n031j8867k0100j8770L4062K7566k1589k2825K9695K5646l132p778
$$ -5237 -5158 -10189 -29056 -49156 -67926 -33864 -6298 -27887 -50712 -21017 4629 1497 -6281
23267f281K2971L446k1647J8971L0768m3776k1026r926J3429j5152K8803J0773
$$ -6281 16690 20136 -1511 17460 48228 4452 -16574 -26500 -13071 -28223 580 11353
23255A1353j5069k0221k0395J2233Q897L830o607l4076K5927J2255r978K2253
$$ 11353 -3716 -23937 -44332 -32099 -23202 -19372 -25979 -60055 -34128 -21873 -31851 -9598
23243i598J7705j5727m749L7667J9146m996j9064k671L889l4656k3475J8856J1979
$$ -9598 8107 -7620 -12369 25298 44444 39448 20384 17713 21602 -13054 -36529 -17673 -5694
23230e694k9891n058j4164j2027K6884L979J5604j362Q32J5657O969m6780j2622
$$ -5694 -35585 -40643 -54807 -66834 -39950 -35971 -20367 -21729 -20897 -5240 1729 -45051 -57673
23217e7673M6199K4736j9491r431p06k3688n529r168j4479K1733j1935j4261L8094
$$ -57673 -11474 13262 -6229 -15660 -16366 -40054 -45583 -54751 -69230 -47497 -59432 -73693 -35599
23204c5599N9812J437p1542j1901K8656R32k3237r591M3374J4406o7m4239k2411
$$ -35599 24213 25650 -45892 -57793 -29137 -28205 -51442 -61033 -17659 -3253 -3320 -47559 -69970
23191f9970L008L1363M5762K9296j6452l0120j4041J9712k8194k0828k9289R131
$$ -69970 -66962 -35599 10163 39459 23007 -7113 -21154 -1442 -29636 -50464 -79753 -70622
23179g0622K7797J2614L9567j2864n1228k7905j3300K2971J8397J4997l8583P988
$$ -70622 -42825 -30211 9356 -3508 -54736 -82641 -95941 -72970 -54573 -39576 -78159 -70171
23167g0171O377j7416M7095K0711K8449P778M653q503k3785j0692K424J91j9122
$$ -70171 -63794 -81210 -34115 -13404 15045 22823 27476 18973 -4812 -15504 -13080 -12889 -32011
23154c2011j8106P597j7636P377j4028J8649M7170M2099k2620k4502K3927N139
$$ -32011 -50117 -42520 -60156 -52779 -66807 -48158 -988 41111 18491 -6011 17916 23055
23142B3055k1295l0246j0703J6380J6295R899J5114N218p796K9940J6778k8476
$$ 23055 1760 -28486 -39189 -22809 -6514 3385 18499 23717 15921 45861 62639 34163
23130C4163l9714j684J4603L913K919J4032n419j0792k8169n0599j9015j220K3090
$$ 34163 -5551 -7235 7368 11281 14200 28232 22813 12021 -16148 -66747 -85762 -86982 -63892
23117f3892K2315L5195J2967K3617n1396l7954L1671N7784R722o372k267J7108
$$ -63892 -41577 -6382 6585 30202 -21194 -59148 -27477 30307 40029 33657 31390 48498
23105D8498j1449j9261j4132j5203j0650l4521j9226o076K0698L3778J4163K8199
$$ 48498 37049 17788 3656 -11547 -22197 -56718 -75944 -82020 -61322 -27544 -13381 14818
23093A4818j835o807n849l1365J6110L7607j0546j7076L0350j0342m3800J9793
$$ 14818 12983 6176 327 -31038 -14928 22679 12133 -4943 25407 15065 -28735 -8942
23081h942M7116Q408m2119m6852J4956M4620J8202q906m6211K0664J6503k7780
$$ -8942 38174 46582 4463 -42389 -27433 17187 35389 26483 -19728 936 17439 -10341
23069a0341k0576L6224J9743m2875J1705M884k0518K473K4675k9841l63K1221
$$ -10341 -30917 5307 25050 -17825 -6120 -1236 -21754 -19281 5394 -24447 -24810 -3589
23057c589l247J2449O269j0036J8417l0454r819L3236R567n84o187N843J4410
$$ -3589 -6836 5613 11882 1846 20263 -10191 -20010 13226 22793 22209 16022 21865 36275
23044C6275R991R980O88Q711P45k6801k0033k0708l089L2704O246j7601l1211
$$ 36275 46266 56246 56934 65645 66390 39589 19556 -1152 -4241 28463 34709 17108 -14103
23031a4103r03K4133J7066k7551k5565l3975O094L3863k911j1484J972K0706j2326
$$ -14103 -15006 9127 26193 -1358 -26923 -60898 -54804 -20941 -23852 -35336 -33364 -12658 -24984
23018b4984J2182L133k1124J0424L5487K0485k6269n962J2596l327L987L957m8439
$$ -24984 -12802 -9669 -30793 -20369 15118 35603 9334 3372 15968 12641 16628 20585 -27854
23005b7854o0907M1276M3264N166K7134k3993L967K2380K3787k3321l6218k0419
$$ -27854 -88761 -47485 -4221 945 28079 4086 8053 30433 54220 30899 -5319 -25738
22993b5738l049q054J5323j071K6848k7883m7415j3396K8507K0398j0811K6574
$$ -25738 -28787 -36841 -21518 -22589 4259 -23624 -71039 -84435 -55928 -35530 -46341 -19767
22981a9767K8519p720k1675j0998j05o728J1746j0191M9065J3245n2556q321j5288
$$ -19767 8752 1032 -20643 -31641 -31746 -38474 -26728 -36919 12146 25391 -27165 -35486 -50774
22968e0774r942p739R909K6803r73J5722r422K5939J0978L622L164J3220M772
$$ -50774 -60716 -68455 -58546 -31743 -32716 -16994 -26416 -477 10501 14123 17287 30507 35279
22955C5279m00m034J1740k3976l5881K8296J7732K3633M710l9266l2636j9902
$$ 35279 34879 30845 42585 18609 -17272 11024 28756 52389 57099 17833 -14803 -34705
22943c4705j2919N0416K1212L564k3403m2859K6633N0838j3747j7218j4610R902
$$ -34705 -47624 2792 24004 27568 4165 -38694 -12061 38777 25030 7812 -6798 3104
22931C104J0289J107q803j5143p984K496J1343J5838P475L6424J0621m4831l1069
$$ 3104 13393 14500 5697 -9446 -17430 -14934 -3591 12247 19722 56146 66767 21936 -9133
22918i133M044M8897j3057m9841j9161M0558O560j2644O964M5621M1762l2039
$$ -9133 -5089 43808 30751 -19090 -38251 2307 8867 -3777 3187 48808 90570 58531
22906E8531l288m7649k6861m816L3788m528k2351k0384P536K3711q466K0953P757
$$ 58531 55243 7594 -19267 -24083 9705 5177 -17174 -37558 -30022 -6311 -14777 6176 13933
22893A3933J404k513J3624l0523j0153K3692L41o973k9853l0225M2232j5409L2485
$$ 13933 15337 12824 26448 -4075 -14228 9464 9805 2832 -27021 -57246 -15014 -30423 2062
22880B062L3667K0544j0717l117p822k5819q228J1939K7067J5061Q291k1051k8999
$$ 2062 35729 56273 45556 42439 34617 8798 570 12509 39576 54637 62928 41877 12878
22867A2878k4671L1245O869p318L0456k040m1670o479L4058L9562j7738l2408
$$ 12878 -11793 19452 26321 19003 49459 47419 5749 -730 33328 72890 55152 22744
22855B2744O428j7720m8013L582Q47K4988q21J84j728M4923K2813l7471N444J3142
$$ 22744 29172 11452 -36561 -32979 -32132 -7144 -7965 -7781 -9509 35414 58227 20756 26200 39342
22841C9342k5347q208k4474k3341k0422M6794M1358K392l8029l1330k6743K7998
$$ 39342 13995 5787 -18687 -42028 -62450 -15656 25702 28094 -9935 -41265 -68008 -40010
22829d0010j7873k730m913J9686J4545K6101N647j5626l0448j603L2319J1207
$$ -40010 -57883 -60613 -65526 -45840 -31295 -5194 453 -15173 -45621 -47224 -14905 -3698
22817c698J711M578j0825J231l9123J2625M3581K2372k0335J8504O919k9051j5171
$$ -3698 -1987 2591 -8234 -7003 -46126 -33501 10080 32452 12117 30621 37540 8489 -6682
22804f682p629J9399l0049N686K5094L5779k0811k6367p809M611k7777j4502K4557
$$ -6682 -14311 5088 -24961 -19275 5819 41598 20787 -5580 -13389 -8778 -36555 -51057 -26500
22791b6500L855N9584j6666m4742J028k13M190J7007J1032m370j4963N018L0389
$$ -26500 -22645 36939 20273 -24469 -23441 -23654 -19464 -2457 8575 4205 -10758 -5740 24649
22778B4649K19j4459J2651n500r881k7211N166K7684J0034J8015J2046k2592o265
$$ 24649 24868 10409 23060 17560 7679 -19532 -14366 13318 23352 41367 53413 30821 24556
22765B4556K9028K1258m1531m7528k9544K6916J8114J9K553J5594k663q124j4799
$$ 24556 53584 74842 33311 -14217 -43761 -16845 1269 1288 3841 19435 16772 8648 -6151
22752f151m1973K8400J9423m0712j8484K2343K5992j994j2880K9713J4132J5548
$$ -6151 -48124 -19724 -301 -41013 -59497 -37154 -11162 -13156 -26036 3677 17809 33357
22740C3357j0654l9239m812J0954K1215K0800p699J1340l0264j9157J0703j221
$$ 33357 22703 -16536 -21348 -10394 10821 31621 23922 35262 4998 -14159 -3456 -4677
22728d677n360j838L0373j4022J2223O933k5855k5632L0957J9272L194j2645J2725
$$ -4677 -10037 -11875 18498 4476 16699 23632 -2223 -27855 3102 22374 25568 12923 25648
22715B5648N099K5110P27o2995n7329k1384L989J8020K3395l7506J6502L6452
$$ 25648 30747 55857 56584 -6411 -63740 -85124 -81135 -63115 -39720 -77226 -60724 -24272
22703b4272r703K228K9775J8758j4554k5923k9905L339L1870R262m057O239j3739
$$ -24272 -33975 -31747 -1972 16786 2232 -23691 -53596 -50257 -18387 -9125 -13182 -6943 -20682
22690b0682K3312J1084k323j2484k0476J5065j5158j9295J4634j1631r760O155
$$ -20682 2630 13714 11391 -1093 -21569 -6504 -21662 -40957 -26323 -37954 -47714 -41559
22678d1559m4849L5461M3213J210O75M263J9973P219P433j3683j7772j9370L243
$$ -41559 -86408 -50947 -7734 -6524 -5849 -1586 18387 25606 33039 19356 1584 -17786 -14543
22665a4543P782J2290R727l826l1674N243o629N0247n38k3258K2219K0717n1766
$$ -14543 -6761 5529 15256 11430 -20244 -15001 -21630 28617 28079 4821 27040 47757 -4009
22652d009K5474j8787j7000l3393L3212M2794J840j5264k1148k2068j0428K2089
$$ -4009 21465 2678 -14322 -47715 -14503 28291 30131 14867 -6281 -28349 -38777 -16688
22640a6688K6106k3890K55K3014K3720r960l879m2782O092K5832K6565N202L56
$$ -16688 9418 -14472 -14217 8797 32517 22557 18678 -24104 -18012 7820 34385 39587 39943
22627C9943r476j2511P329J9741J3239l0487l7848k5758l3644n735N7666L5782
$$ 39943 30467 17956 25285 45026 58265 27778 -10070 -35828 -69472 -75207 -17541 18241
22615A8241l1090j9650M588k0239K2918J6154M419o4062R567L9006q557N344n68
$$ 18241 -12849 -32499 -27911 -48150 -25232 -9078 -4659 -68721 -59154 -20148 -28705 -23361 -23929
22602b3929j346L618K7161l963j4101Q047K129J0490J4058o715j0320J4915p576
$$ -23929 -25275 -21657 5504 1541 -12560 -4513 -2384 8106 22164 15449 5129 20044 12468
22589A2468l0093n6699m9692K2716J6179M5296L4411m2383p90j2103K3396J8926
$$ 12468 -17625 -74324 -124016 -101300 -85121 -39825 -5414 -47797 -48587 -60690 -37294 -18368
22577a8368k604J9152J8590j1682p656L8824q056j4946K6676o800n1939K8054
$$ -18368 -20972 -1820 16770 5088 -2568 36256 28200 13254 39930 33130 -18809 9245
22565I245R836p349k741R352J7795m869l4238k0801K1755M3435K3081J4952K0
$$ 9245 19081 11732 8991 18343 36138 31269 -2969 -23770 -2015 41420 64501 79453 79473
22552G9473k0026k8850m127l6535J9169K7047J7435J365k0064l7811k7490N066
$$ 79473 59447 30597 26470 -10065 9104 36151 53586 54951 34887 -2924 -30414 -25348
22540b5348L0286l7823k9635j652r677J3860j428r671O897R532q35p94q788l449
$$ -25348 4938 -32885 -62520 -64172 -73849 -59989 -61417 -71088 -64191 -54659 -55494 -56288 -65076 -68525
22526f8525K2326N0861J5919k7509J9479J1558K8979k6304K77k6717j034J8630
$$ -68525 -46199 4662 20581 -6928 12551 24109 53088 26784 27061 344 -690 17940
22514A7940k0369K2537J9875o533j8999K2205r91l926j7726L2642K7511k198l6200
$$ 17940 -2429 20108 39983 33450 14451 36656 35665 31739 14013 46655 74166 71968 35768
22501C5768J705k2817k4985j7125L3096R577k4597k0727j6976Q700K0672N374
$$ 35768 37473 14656 -10329 -27454 5642 15219 -9378 -30105 -47081 -38381 -17709 -12335
22489a2335J1551n023j2804K1852N713J0389m590p393K4487K4069m5128l447J4282
$$ -12335 -784 -5807 -18611 3241 8954 19343 14753 7360 31847 55916 10788 7341 21623
22476B1623L1708k0517l5142k3278J5619L8679j8271J7676p611L000Q881k8695
$$ 21623 53331 32814 -2328 -25606 -9987 28692 10421 28097 20486 23486 32367 3672
22464C672j3269M228j404L3066J5196K2416l251k194j9162l3354J2213j5225m9805
$$ 3672 -9597 -5369 -6773 26293 41489 63905 60654 58460 39298 5944 18157 2932 -46873
22451d6873J3189q573K7187K3870m8260Q524M7258k3251j0942m44J1060r916m2536
$$ -46873 -33684 -42257 -15070 8800 -39460 -30936 16322 -6929 -17871 -18315 -7255 -17171 -59707
22438e9707J5623L4210K5676j0117l1097l1252l1012K5295L5960O3901l2008R979
$$ -59707 -44084 -9874 15802 5685 -25412 -56664 -87676 -62381 -26421 37480 5472 15451
22426A5451K0155k7331J2188m023k4826l1182J5520K0666L189J3184M3135J4170
$$ 15451 35606 8275 20463 16440 -8386 -39568 -24048 -3382 -193 12991 56126 70296
22414G0296o9504m6999N876K2664L3108L4J4899L1820J7516j8160J2871j7005
$$ 70296 792 -46207 -40331 -17667 15441 15475 30374 62194 79710 61550 74421 57416
22402E7416l5106j8170j9479K9544k9276P079j921k1172P94K3974K8295Q142N772
$$ 57416 22310 4140 -15339 14205 -15071 -7992 -9913 -31085 -30291 -6317 21978 30120 35892
22389C5892P7K0323L905l1375l3275m850K9941J41l7959k4827J494J0053M8080
$$ 35892 35969 56292 60197 28822 -4453 -9303 20638 20779 -17180 -42007 -40513 -30460 17620
22376A7620M1797n961l2231k527L7634n220j012Q297L25l6265K4751J1439j577
$$ 17620 59417 53456 21225 18698 56332 51112 50100 58397 58722 22457 47208 58647 57070
22363E7070r691k0169L1469K1479m9694j2665L4829R761l921l1867m5723p837
$$ 57070 47379 27210 58679 80158 30464 17799 52628 62389 58468 26601 -19122 -26959
22351b6959K3058n961l4884L3435K3289K5909M6760j8479n5225k4699m134J7209
$$ -26959 -3901 -9862 -44746 -11311 11978 37887 84647 66168 10943 -13756 -17890 -681
22339f81O0320K4577l4038n2367n8592J0248J4668j8835K4372J2556K3864l186
$$ -681 59639 84216 50178 -2189 -60781 -50533 -35865 -54700 -30328 -17772 6092 2906
22327B906l9975m2531K6697L5080j6946j3151O0825L390k8382l69R824N535R915
$$ 2906 -37069 -79600 -52903 -17823 -34769 -47920 12905 16295 -12087 -12456 -2632 2903 12818
22314A2818J1548k1185k538R21K4259L9925K7045j0103k6766l6186j6913k8682
$$ 12818 24366 3181 643 1564 25823 65748 92793 82690 55924 19738 2825 -25857
22302b5857J8175L3074J8614k031K6349p357k1358k2582l741j1359j074K0532
$$ -25857 -7682 25392 44006 41975 68324 60967 39609 17027 13286 1927 853 21385
22290B1385j1272j4146O588J2435L5889J3531q039n3217j5141P126J2500Q061
$$ 21385 10113 -4033 2555 14990 50879 64410 56371 3154 -11987 -4861 7639 15700
22278A5700k4078l561L622j5392p305q91M5281M7516k2485J6148K5256k5556l0168
$$ 15700 -8378 -11939 -8317 -23709 -31014 -31905 13376 60892 38407 54555 79811 54255 24087
22265B4087r398J3381l3021j6839m2499L455K2751J6255l809J6762n78p359j6125
$$ 24087 14689 28070 -4951 -21790 -64289 -60834 -38083 -21828 -25637 -8875 -9453 -16812 -32937
22252c2937P400L0527N70p3001m7787K3841N0730K8539O335k0679n217K1933N2098
$$ -32937 -25537 4990 5560 -67441 -115228 -91387 -40657 -12118 -5783 -26462 -31679 -9746 42352
22239D2352K8247m430k4867n2587l4563k3090J2707r884M5111L2502J8866j5752
$$ 42352 70599 66169 41302 -11285 -45848 -68938 -56231 -66115 -21004 11498 30364 14612
22227A4612j5928q022j2693J6743K0077k1709k3298j5789N54j8421K0678j274
$$ 14612 -1316 -9338 -22031 -5288 14789 -6920 -30218 -46007 -45453 -63874 -43196 -44470
22215d4470k8428L2667M6994J814J5433k2066m25k5081k4220j4855P93L1435q172
$$ -44470 -72898 -40231 6763 8577 24010 1944 1519 -23562 -47782 -62637 -61844 -30409 -38581
22202c8581L46K7252J8822M4360o764n7211J5697L4056O779P404N801m9020l5596
$$ -38581 -38235 -10983 7839 52199 45435 -11776 3921 37977 44756 52160 57961 8941 -26655
22189b6655j4348J9853K396Q667K1134j1371j9325j3190r567K3463j1007k4756
$$ -26655 -41003 -21150 -18754 -10087 11047 -324 -19649 -32839 -42406 -18943 -29950 -54706
22177e4706J4320L7796K3616j1882p505k5904m916J552K2423J4443L280K1834
$$ -54706 -40386 -2590 21026 9144 1639 -24265 -29181 -27629 -5206 9237 12517 34351
22165C4351j6929r326k1305j3121K5942N3613j2838n6106J4525K2329K2439J0087
$$ 34351 17422 8096 -13209 -26330 -388 53225 40387 -15719 -1194 21135 43574 53661
22153E3661j1949m5886k5827J0836M26K038j6895k7384J1158K5217J0056k022
$$ 53661 41712 -4174 -30001 -19165 -18739 -16701 -33596 -60980 -49822 -24605 -14549 -16571
22141a6571n304K3250L6387l4212n6193j4974J3430M0719K2615q083R476l1320
$$ -16571 -21875 1375 37762 3550 -52643 -67617 -54187 -13468 9147 1064 10540 -20780
22129b0780K6288L408j0867j1418J9345J3628l2809k6080Q39K1637K7289o735
$$ -20780 5508 8916 -1951 -13369 5976 19604 -13205 -39285 -38446 -16809 10480 3745
22117C745j7446K4897J6921k591k4528j4993K3791K8305l1453l8848K4745K5085
$$ 3745 -13701 11196 28117 25526 998 -13995 9796 38101 6648 -32200 -7455 17630
22105A7630L0647j3362l8501K4499K2366k951j6772J2653n0311k1166k4885K2750
$$ 17630 48277 34915 -3586 20913 43279 40328 23556 36209 -14102 -35268 -60153 -37403
22093c7403M5853J1337l1806k9806P128P396N389N910J8340J1680L1459J7793
$$ -37403 8450 19787 -12019 -41825 -34697 -27301 -21912 -16002 2338 14018 45477 63270
22081F3270j8855m0016l7496K869J7199k836n814J6066M0595J1924Q519M761k2010
$$ 63270 44415 4399 -33097 -30228 -13029 -15865 -21679 -5613 34982 46906 55425 60186 38176
22068C8176j526m3697j4319o707q071K430N3916J5013p717O390N488O25k6610
$$ 38176 36650 -7047 -21366 -28073 -36144 -33714 20202 35215 27498 33888 39376 40001 13391
22055A3391l1249k5296J4405K4011K2986L2309L5869m4520j3632J179p650L1733
$$ 13391 -17858 -43154 -28749 -4738 18248 50557 86426 41906 28274 29453 21803 53536
22043E3536P04k7144k0610M2089j5801j4388r020j1442J9112k0671O836l211m7643
$$ 53536 54240 27096 6486 48575 32774 18386 9366 -2076 17036 -3635 3201 -10 -47653
22030d7653J3907O8119K0223l2090o447J977j5322k3229l0448J1696M3870N530
$$ -47653 -33746 34373 54596 22506 16059 18036 2714 -20515 -50963 -39267 4603 10133
22018A0133j4764p137n796J3422K4489K3828p33J8908J4697J9612Q593m8297l8294
$$ 10133 -4631 -11768 -17564 -4142 20347 44175 43442 62350 77047 96659 105252 56955 18661
22005A8661k154n218j2933k1949l513J0201P605l1365j2619J7944L159K0937M8482
$$ 18661 16507 11289 -1644 -23593 -27106 -16905 -9300 -40665 -53284 -35340 -32181 -11244 37238
21992C7238M235O693k2076m4922k1628L2361P194k2397J245k5224n910N582J6146
$$ 37238 41473 48166 26090 -18832 -40460 -8099 -905 -23302 -22057 -47281 -53191 -47609 -31463
21979c1463l5934K4248N2522J996p911j358P285J337K2109j7683L840K368K862
$$ -31463 -67397 -43149 9373 11369 3458 2100 9385 10722 32831 15148 18988 21356 24218
21966B4218J3544L6354m146o801j2989l3910n8635j0974K4128K5468K3728j4373
$$ 24218 37762 74116 69970 63169 50180 16270 -42365 -53339 -29211 -3743 19985 5612
21954E612l5236j1851J7327n495Q183R275n89j3591L1937r463K6430N3599k5729
$$ 5612 -29624 -41475 -24148 -29643 -21460 -12185 -12774 -26365 5572 -3891 22539 76138 50409
21941E0409j7627K3253K7725k2023m0066l3518k264L0055n137K741N9260K3389
$$ 50409 32782 56035 83760 61737 21671 -11847 -14111 15944 10807 13548 72808 96197
21929I6197l1529m888r626n1599j3222Q395J0969K5203J3483p199k7405l9773
$$ 96197 64668 59780 50154 -1445 -14667 -6272 4697 29900 43383 36184 8779 -30994
21917c0994J2188K0153J2060L537L0947P896k3461k2781J0775J0956R840J1717
$$ -30994 -18806 1347 13407 16944 47891 55787 32326 9545 20320 31276 41116 52833
21905E2833k342k807N500j0165N68p073j1235L319r606l0916L1986L9616m733
$$ 52833 50491 47684 53184 43019 43587 36514 25279 28598 18992 -11924 20062 59678 54945
21892E4945k7680j7862M052R694Q698r850k6555J0238p769K2374j2030K5021Q601
$$ 54945 27265 9403 13455 23149 31847 21997 -4558 5680 -2089 20285 8255 33276 41877
21879D1877l7161r480L741k3011M0432N5322K1071k4859O390J6039j2389l2121
$$ 41877 4716 -4764 -1023 -24034 16398 71720 92791 67932 74322 90361 77972 45851
21867D5851k4714M468q364N266O399k6211J3329K6390q567m1507P32P976o807
$$ 45851 21137 25605 17241 22507 28906 2695 16024 42414 33847 -7660 -6928 1048 -5759
21854e759P87r438J73J4929K707L0249j1181l3204l767L3689j2624n546R119K2778
$$ -5759 -4972 -14410 -14237 692 3399 33648 22467 -10737 -14504 19185 6561 1015 10134 32912
21840C2912l1422j8789j4025O677o741p682J2959M1276M5990P884k6887l0975
$$ 32912 1490 -17299 -31324 -24647 -31388 -39070 -26111 15165 61155 69039 42152 11177
21828A1177J5379J3068r199j5329n2224k6850P032L4839M2350K1055j4345J7175
$$ 11177 26556 39624 30425 15096 -37128 -63978 -56946 -22107 20243 41298 26953 44128
21816D4128P906l447j1629j7268J7847M4204Q076r804l4366j4978J3454o310o413
$$ 44128 52034 48587 36958 19690 37537 81741 89817 80013 45647 30669 44123 37813 31400
21803C1400o313Q42Q277j1615k7519l1051p015P022N5043K7114j3709L736k691
$$ 31400 25087 25929 34206 22591 -4928 -35979 -42994 -35972 19071 46185 32476 36212 33521
21790C3521J812O587k3930n8641P017L8511J4059K1925j3857k028K6982k0658
$$ 33521 35333 41920 17990 -40651 -33634 4877 18936 40861 27004 24976 51958 31300
21778C1300k2841o4405K107N8654M3410k1424j8754o75M733J2273L687l83J6594
$$ 31300 8459 -55946 -53839 4815 48225 26801 8047 7372 12105 24378 28065 27682 44276
21765D4276r014O562J0999k0665J3186J8184j2652k6915k1980J1470l3419j2384
$$ 44276 35262 41824 52823 32158 45344 63528 50876 23961 1981 13451 -19968 -32352
21753c2352j6188K1497J894M8904R733m2447P71L2402J1307m703o9772k7596L1849
$$ -32352 -48540 -27043 -25149 23755 33488 -8959 -8188 24214 35521 30818 -38954 -66550 -34701
21740c4701K3130J3202m396o091K1197j7505k6739J1307k6742L7268K0787p141
$$ -34701 -11571 1631 -2765 -8856 12341 -5164 -31903 -20596 -47338 -10070 10717 3576
21728C576k1620p545n776k3481j5369J0592L8089N4945K3032o370P040l7010k6376
$$ 3576 -18044 -25589 -31365 -54846 -70215 -59623 -21534 33411 56443 50073 57113 20103 -6273
21715f273m279J9723K0098j5293l5498K3476j9105j6105K6561j808j5265K6625
$$ -6273 -10552 9171 29269 13976 -21522 1954 -17151 -33256 -6695 -8503 -23768 2857
21703B857n663L3421R236R162j1855j7791L4648q684n1060k9946j0248j4646J6368
$$ 2857 -2806 30615 39851 49013 37158 19367 54015 45331 -5729 -35675 -45923 -60569 -44201
21690d4201j283K1159k5379j4883J0152K2101o103J6975L9345J5561k7122l2603
$$ -44201 -45484 -24325 -49704 -64587 -54435 -32334 -38437 -21462 17883 33444 6322 -26281
21678b6281j8329k5077J3183K0942K8831K608K6578K4284j8728j7295r965P157
$$ -26281 -44610 -69687 -56504 -35562 -6731 -4123 22455 46739 28011 10716 751 7908
21666G908L5215k580j5935K0977J1009k4534p929k5536l334O1328m8469m0787
$$ 7908 43123 40543 24608 45585 56594 32060 24131 -1405 -4739 56589 8120 -32667
21654c2667J2826M5418L971m2291j0170J8850L6200k422J3934k5096p8646l438
$$ -32667 -19841 25577 29548 -12743 -22913 -4063 32137 29715 43649 18553 -60093 -63531
21642f3531M5306N801J1505J2537n173j0391P928K8301L7759N367j2404k1484
$$ -63531 -18225 -12424 -919 11618 6445 -3946 3982 32283 70042 75409 63005 41521
21630D1521k4808j4949n752L1450J1832K3994q522J6558k6236m7463k1404k1381
$$ 41521 16713 1764 -3988 27462 39294 63288 54766 71324 45088 -2375 -23779 -45160
21618d5160k435j5815m293M8347L7312J9878j8219k3009J117Q851J1133k319J5136
$$ -45160 -47595 -63410 -67703 -19356 17956 37834 19615 -3394 -2277 6574 17707 15388 30524
21605C0524k526M2013J3984j6646l1878k0720j8257l3901J3202K9746N864P666
$$ 30524 27998 70011 83995 67349 35471 14751 -3506 -37407 -24205 5541 11405 19071
21593A9071k9908O560M3879K1069j5230k2696K3023R9k174j3138l5512j5998L9957
$$ 19071 -10837 -4277 39602 60671 45441 22745 45768 45867 43693 30555 -4957 -20955 19002
21580A9002L566J1085m1339N733j3229N697L0181L4152m495N232k5233k8678J3707
$$ 19002 22568 33653 -7686 -1953 -15182 -9485 20696 54848 50353 55585 30352 1674 15381
21567A5381R831J0295K9942q530n3435k8500l1099m346K734K4556L7001l363r379
$$ 15381 25212 35507 65449 56919 3484 -25016 -56115 -60461 -57727 -33171 3830 467 -8912
21554h912L7100q931k0600l1644Q761O11K9878J5178P583J450K791R392k0638
$$ -8912 28188 19257 -1343 -32987 -24226 -23615 6263 21441 29024 30474 33265 42657 22019
21541B2019J2024m250l1692o906J1857K4771K1185L0337K1470m0045j5111n298
$$ 22019 34043 29793 -1899 -8805 3052 27823 49008 79345 100815 60770 45659 40361
21529D0361n689L0539L6867m8768m3355j2684P535L2127K5873K8751o611k3128
$$ 40361 34672 65211 102078 53310 9955 -2729 4806 36933 62806 91557 84946 61818
21517F1818j5915n1463k23J9453J2413o719o6500j640J5667k07L9483R912J3015
$$ 61818 45903 -5560 -5783 13670 26083 19364 -47136 -48776 -33109 -33316 6167 16079 29094
21504B9094j1434j303j1169k5778l3291l402K790N1035M9005j9094j5417j2937
$$ 29094 17660 16357 5188 -20590 -53881 -57283 -54493 -3458 45547 26453 11036 -1901
21492a901N86j7517P505O645O440K3579M8458p61m7341J428L6807J4126j2946
$$ -1901 -1315 -18832 -11327 -4682 1758 25337 73795 73034 25693 27121 63928 78054 65108
21479F5108j2696k2728k9974j4616l0234J6024L6391J023J8301N473J0544K2606
$$ 65108 52412 29684 -290 -14906 -45140 -29116 7275 8298 26599 32072 42616 65222
21467F5222j2486j5523M0266r940k0611k5884Q126J6502J4949j7619l4010j8198
$$ 65222 52736 37213 77479 67539 46928 21044 29170 45672 60621 43002 8992 -9206
21455i206N909J5524L2297L5975J8365l571l7147j4402j9029p943J0537L1869
$$ -9206 -3297 12227 44524 80499 98864 95293 58146 43744 24715 16772 27309 59178
21443E9178Q115m1218j2029n224Q634M531J0220O021p760l0449r366L431K7447
$$ 59178 67293 26075 14046 8822 17456 21987 32207 38228 30468 19 -9347 -5916 21531
21430B1531j211k1081J4453L346J7720K7349n499j1892l4363r317r10J5702N419
$$ 21531 20320 -761 13692 17038 34758 62107 56608 44716 10353 1036 126 15828 21247
21417B1247r043k5861O55J0338p348K5312J2596n370K5026j415k8888k0636m447
$$ 21247 12204 -13657 -13002 -2664 -10012 15300 27896 22526 47552 46137 17249 -3387 -7834
21404g834R38M5219l227m2604j9955n347J3993K2180N2563J1601j9678n479k1954
$$ -7834 -6896 38323 35096 -7508 -27463 -32810 -18817 3363 55926 67527 47849 42370 20416
21391B0416l506R358J6302R236J7959j5243l6336j0764m0170L9823P338j9891
$$ 20416 16910 26268 42570 51806 69765 54522 18186 7422 -32748 7075 14413 -5478
21379e478L6220j0698K3012K0543n224r369n1350j2852K6577k4241J2495K5187
$$ -5478 30742 20044 43056 63599 58375 49006 -2344 -15196 11381 -12860 -365 24822
21367B4822N6180K5006j5559m8249j6508j0216J8227j5838N042J5370O4165k6044
$$ 24822 81002 106008 90449 42200 25692 15476 33703 17865 22907 38277 102442 76398
21355G6398j9294k977l5325O491p331O390J9509n0729k2155J1521K2744K9221
$$ 76398 57104 54127 18802 25293 17962 24352 43861 -6868 -29023 -17502 5242 34463
21343C4463K7288m1146k4145L395K1217N728K870l159j1309N439j3911j1388l960
$$ 34463 61751 20605 -3540 -145 21072 26800 29670 26511 15202 20641 6730 -4658 -8618
21330h618N4914K6008k0596J7545K6029l2909m4203j2953J7289O002J340m84k984
$$ -8618 46296 72304 51708 69253 95282 62373 18170 5217 22506 28508 29848 29364 26380
21317B6380j6747J0214J4012K0318l6874l3441K6306P7745j0403m0096m992k059
$$ 26380 9633 19847 33859 54177 17303 -16138 10168 87913 77510 37414 32422 30363
21305C0363L570J2373j6728K751L8348q527l1173j0764j5192j2622J9339J5769
$$ 30363 33933 46306 29578 32329 70677 62150 30977 20213 5021 -7601 11738 27507
21293B7507M0726K1070O742o201J1087m789j6498M584o752J5386N261l6293j1547
$$ 27507 68233 89303 96045 89844 100931 96142 79644 84228 77476 92862 98123 61830 50283
21280E0283L6311o32j0581K3739j6169j9294j0355l6903j0932K8264K5533K572
$$ 50283 86594 85962 75381 99120 82951 63657 53302 16399 5467 33731 59264 61836
21268F1836r465m3438l4451L6043J9906l1474Q735J4330K193L8683J2901k0597
$$ 61836 52371 8933 -25518 10525 30431 -1043 7692 22022 24215 62898 75799 55202
21256E5202l7238M619j2749L0340J9331J2555n874M766j8158q639j4671j9948
$$ 55202 17964 22583 9834 40174 59505 72060 66186 70952 52794 44155 29484 9536
21244I536j7962J1863n1038m3458L4933P0474m243j7848K0823M4123K8809j296
$$ 9536 -8426 3437 -47601 -91059 -56126 14348 10105 -7743 13080 57203 86012 84716
21232H4716l2193o124L3593L322k7042j7683k2487N391L625K020O1932K9205m0513
$$ 84716 52523 46399 79992 83314 56272 38589 16102 21493 25118 27138 89070 118275 77762
21219G7762j9385m8335P722j4961o917P341K1081k5394j9737M2579J3584m789
$$ 77762 58377 10042 17764 2803 -4114 3227 24308 -1086 -20823 21756 35340 30551
21207C0551j1723J2144k5650K1730K7727P459K1203P344o166m8410J4277k481
$$ 30551 18828 30972 5322 27052 54779 62238 83441 90785 84619 36209 50486 48005
21195D8005j4134O386k9162j4534K0715R536j252K5883n165j6106q804K7782j946
$$ 48005 33871 40257 11095 -3439 17276 26812 25560 51443 46278 30172 21368 49150 47204
21182D7204K728L4271J3842l4633k3359J8317Q729O191l281J9054n292o193p022
$$ 47204 49932 84203 98045 63412 40053 58370 67099 73290 70009 89063 83771 77578 70556
21169G0556m5967n96J062J008K3212j9908l922J7309N034L7873N2990k0265l3689
$$ 70556 24589 23993 25055 26063 49275 29367 25445 42754 47788 85661 138651 118386 84697
21156H4697k7156o2248L282N1257L773L151j7985Q507r817N944k3989K3688q941
$$ 84697 57541 -4707 -1425 49832 53605 56756 38771 47278 37461 43405 19416 43104 34163
21143C4163O378J6310k0789r179j6294k1232K3973K6997k4363k1443K3686K8658
$$ 34163 40541 56851 36062 26883 10589 -10643 13330 40327 15964 -5479 18207 46865
21131D6865j8013J3691Q415j3384K555o106J6114k479k6492j7807L7633K9411
$$ 46865 28852 42543 50958 37574 40129 34023 50137 47658 21166 3359 40992 70403
21119G0403J3345j5075k8779K3580J9665k9273j1978R625J6675j1353p047K869
$$ 70403 83748 68673 39894 63474 83139 53866 41888 51513 68188 56835 49788 52657
21107E2657l501J7565k9006L9992p221k3123J5472l81o263j4888m8361k6652o21
$$ 52657 49156 66721 37715 77707 70486 47363 62835 62454 56191 41303 -7058 -33710 -34331
21094c4331M533K2747J7187M8345M557O615P283r294l8089O057k1990K1492K356
$$ -34331 -29798 -7051 10136 58481 63038 69653 76936 67642 29553 35610 13620 35112 37468
21081C7468k4803o05K1204N163M678p660L310n637j614J2475J5795j7843r972
$$ 37468 12665 12060 33264 38427 43105 35445 38755 33118 31504 43979 59774 41931 31959
21068C1959j0396n15J974K4674j3598r602L1391J989q950L9747O100p023j1649
$$ 31959 21563 21048 23022 47696 34098 24496 55887 57876 48926 88673 94773 87750 76101
21055G6101k3258N379J5839j6035R037j4718k9053R666R346L253J906J4136J3581
$$ 76101 52843 58222 74061 58026 67063 52345 23292 32958 42304 45557 47463 61599 75180
21042G5180m9232K1012R029K4409l091k2443L336J5773L6695J4099j1309l6781
$$ 75180 25948 46960 55989 80398 77307 54864 58200 73973 110668 124767 113458 76677
21030G6677N196J9384K6549j3276m359j4840j2055k4811j2370n893j2570j511
$$ 76677 81873 101257 127806 114530 110171 95331 83276 58465 46095 40202 27632 26121
21018B6121K6663N2974M4845L584m7047k3510P627k8638L2078K2491r356L157
$$ 26121 52784 105758 150603 154187 107140 83630 91257 62619 94697 117188 107832 110989
21006A10989K3483l1287o0856j6165M3272o240j6911J4235j283K8845N90l7791
$$ 110989 134472 103185 42329 26164 69436 63196 46285 60520 59237 88082 88672 50881
20994E0881j0457R32N178K9363K0139K0318J8382J8420M1l8926o5999N314M4542
$$ 50881 40424 41356 46534 75897 96036 116354 134736 153156 153197 114271 48272 53586 98128
20981I8128l6700k8616K925P974O323J967L3122J0932l7466j3973J3069N9844
$$ 98128 61428 32812 35737 43711 50034 52001 85123 96055 58589 44616 57685 117529
20969A17529k4088k0198j4278k5607J1483K6126k522K9762K1886n06K6918l935
$$ 117529 93441 73243 58965 33358 44841 70967 68445 98207 120093 119587 146505 142570
20957A42570k9318j1821N1942J7735k8483m802k8858q847P056L3719k9618l5116
$$ 142570 113252 101431 153373 171108 142625 137823 108965 100118 107174 140893 111275 76159
20945G6159M5004J041j7350n3354n4967K8676L9619J6462J3430M3415J4276l9588
$$ 76159 121163 122204 104854 51500 -3467 25209 64828 81290 94720 138135 152411 112823
20933A12823m7451r919K1479j098l815Q728J708J2423K1377j2955k7157k2246
$$ 112823 65372 55453 76932 75834 72019 80747 82455 94878 116255 103300 76143 53897
20921E3897l2450j1642L3342K5111L4794l938j5214J9726j3448k0080J0271k9328
$$ 53897 21447 9805 43147 68258 103052 99114 83900 103626 90178 70098 80369 51041
20909E1041K219K7543j2002j5679O221L4602J9391j8270l8401J7036J7721J8455
$$ 51041 53260 80803 68801 53122 59343 93945 113336 95066 56665 73701 91422 109877
20897A09877K0677J5533J0280r8k3635j0581k0385j5031p444k1000J9924L2024
$$ 109877 130554 146087 156367 156269 132634 122053 101668 86637 79193 58193 78117 110141
20885A10141K2694j0672m1126l1067j6666j6695N8382L5582K1012J2039j8857
$$ 110141 132835 122163 81037 49970 33304 16609 74991 110573 131585 143624 124767
20874A24767k8278j1656P035K9328K6291k2784n190J947L786l915k0397J0652
$$ 124767 96489 84833 91868 121196 147487 124703 119513 121460 125246 121331 100934 111586
20862A11586k6696j9682K2670M015j9358O80K8483M5882N682m0651J83K2550J4
$$ 111586 84890 65208 87878 91893 72535 73215 101698 147580 153262 112611 112794 135344 135358
20849A35358k1873r812K2012K0959k8721l7045q607L4495J7533K6569l0494l6077
$$ 135358 113485 103673 125685 146644 117923 80878 72271 106766 124299 150868 120374 84297
20837H4297K5211K7470k537n3533k4914M4688L2890J399J6732K0830j3178l0920
$$ 84297 109508 136978 134441 80908 55994 100682 133572 134971 151703 172533 159355 128435
20825A28435k0288p349J1157J5457M998l3891M540L2543J1834N771o440K3750
$$ 128435 108147 100798 111955 127412 132410 98519 103059 135602 147436 153207 146767 170517
20813A70517J4723j6693O606J9122M268R22k0007l62m1227j6691J0761o329q880
$$ 170517 185240 168547 175153 194275 198543 199465 179458 179096 137869 121178 131939 125610 116730
20800A16730L1125L8179k5061l3458M899J9826K547j590L077N655K2847K901l3668
$$ 116730 147855 186034 160973 127515 132414 152240 154787 153197 156274 161929 184776 187677 154009
20787A54009N803k4637J3665K4613K2115L0784k8487O30K8427K7399N0645L7607
$$ 154009 159812 135175 148840 173453 195568 226352 197865 198495 226922 254321 304966 342573
20775C42573l4851j9859k4467J6792K2318M5112K6754J9559j9485r182K3877J7163
$$ 342573 307722 287863 263396 280188 302506 347618 374372 393931 374446 365264 389141 406304
20763D06304O2642N6307M9118Q8473Q0540Q0613L0866L9956P3294M0858P048K6085
$$ 406304 468946 525253 574371 662844 743384 823997 854863 894819 968113 1008971 1016019 1042104
20751A042104P4576M9190J9831M0050k835j1861r5265j19685p6452p6772n4860
$$ 1042104 1116680 1165870 1185701 1225751 1222916 1211055 1115790 996105 919653 842881 788021
20740G88021J8598O9868O2877P7347O3922P6097O7867J4023k4126l2478k215j4465
$$ 788021 806619 876487 939364 1016711 1080633 1156730 1224597 1238620 1214494 1182016 1179801 1165336
20728A165336k5271J630K0246N8107Q5482P90p5834j06099o3966n0800n8222l2119
$$ 1165336 1140065 1141695 1161941 1220048 1305530 1306320 1230486 1124387 1060421 1009621 951399 919280
20716I19280J4095j0661o1857k5146Q807R409r234l4874n7958p2405p7427o6771
$$ 919280 933375 922714 860857 835711 844518 853927 844693 809819 751861 679456 602029 535258
20704E35258r2154o5594k054R71r704M4437m7665n3985o5342J163Q0596J5158
$$ 535258 443104 377510 375456 376427 366723 411160 363495 309510 244168 245331 325927 341085
20692C41085K20J1942k8061O544J2425m8525m9416J1054L1841j6758k8685J0321
$$ 341085 341305 353247 325186 331730 344155 295630 246214 257268 289109 272351 243666 253987
20680B53987K9809m3203l2691k6659J1760L1612o394k3090L826K5479K4139L1433
$$ 253987 283796 240593 207902 181243 193003 224615 218221 195131 198957 224436 248575 280008
20668B80008j8230l7756j5811Q721J7383k9127k3871j2975K3831J3029J6470p201
$$ 280008 261778 224022 208211 216932 234315 205188 181317 168342 192173 205202 221672 214471
20656B14471l3591K6745j3448M350r950k822r579o542o121o716p985O055l6339
$$ 214471 180880 207625 194177 198527 188577 185755 176176 169634 163513 156797 148812 154867 118528
20643A18528J4975K8720Q59p275j4554J4779J9225j070j8005j590J1083J0185
$$ 118528 133503 162223 163082 155807 141253 156032 175257 174187 156182 154592 165675 175860
20631A75860K9387k8046j7202j3963o952r890j7843L7001M0314k2120l4113K5451
$$ 175860 205247 177201 159999 146036 139084 129194 111351 148352 188666 166546 132433 157884
20619A57884P103r744J8137N2506Q286J9680k0532k2398k1226j5397k1598p150
$$ 157884 164987 155243 173380 225886 234172 253852 233320 210922 189696 174299 152701 145551
20607A45551j0148K3721J8441J2409L2216l5625n5722l7745M9811K5175p716J2918
$$ 145551 135403 159124 177565 189974 222190 186565 130843 93098 142909 168084 160368 173286
20595A73286J4791L3305J3480l3773j5490p716k5636k3530L001J7218L4710J7558
$$ 173286 188077 221382 234862 201089 185599 177883 152247 128717 131718 148936 183646 201204
20583B01204R129l1492j9965K3320K4944o717J7582L2784j6235r518m4508J1680
$$ 201204 210333 178841 158876 182196 207140 200423 218005 250789 234554 225036 180528 192208
20571A92208m34J760J3722k468j1692j6042J4859J023j4406N40P034K5953N0504
$$ 192208 191774 193534 207256 204788 193096 177054 191913 192936 178530 179070 186104 212057 262561
20558B62561k0039n2583m039j0483n502J7981J4464L6429K4115l5199j8455N6212
$$ 262561 242522 189939 185900 175417 169915 187896 202360 238789 262904 227705 209250 265462
20546B65462J7270j1015N711j0556J4759j5165J1984j3046j6140n227O715j2116
$$ 265462 282732 271717 277428 266872 281631 266466 278450 265404 249264 244037 250752 238636
20534B38636k5995J3679N721l9840j5175M0636J8657j261K2444m4676p293j0436
$$ 238636 212641 226320 232041 192201 177026 217662 236319 235058 257502 212826 205533 195097
20522A95097J5293m53q663M851J1859o50J4276L5158j7086J0921L8956k861M020
$$ 195097 210390 209937 201274 206125 217984 217334 231610 266768 249682 260603 299559 296698 300718
20509C00718m5177k9167j3244K289P920J5042m592n9384L2235M6862J9308p745
$$ 300718 255541 226374 213130 215419 223339 238381 233789 174405 206640 253502 272810 265065
20497B65065K532r195j9746K7154l23P38Q761p5515j9311J612L7977Q236J0993
$$ 265065 267597 258402 238656 265810 265487 266225 274986 199471 180160 181772 219749 227985 238978
20484B38978J5218P257n468R058K4151m0625J9335j6210k6870J5943j587K5096
$$ 238978 254196 261453 255985 265043 289194 248569 267904 251694 224824 240767 239180 264276
20472B64276O9420l224m3285J2258J0206L4771M9580n5556p7410j6041M4480M1342
$$ 264276 333696 330472 287187 299445 309651 344422 394002 338446 261036 244995 289475 330817
20460C30817J4246R130m36j2124j5592l6737L0512N2057k642n140r688J0556k0076
$$ 330817 345063 354193 353757 341633 326041 289304 319816 371873 369231 364091 354403 364959 344883
20447C44883J5749M4443p854K3234L6382J9169k0578j1521J07171Q3764P6631
$$ 344883 360632 405075 397221 420455 456837 476006 455428 443907 551078 634842 711473
20436G11473M4502N4499Q8627O0048P3215J08257N2326M4371L7495K7548M4351
$$ 711473 755975 810474 899101 959149 1032364 1140621 1192947 1237318 1274813 1302361 1346712
20425A346712M7507k6314l2827k6281L0356O942k5611m1578m1365o622K1594l148
$$ 1346712 1394219 1367905 1335078 1308797 1339153 1346095 1320484 1278906 1237541 1230919 1252513 1249365
20413A249365p0264n5293j4556l9584k9673l602N1432Q3669N0365N3447R0592
$$ 1249365 1179101 1123808 1109252 1069668 1039995 1036393 1087825 1171494 1221859 1275306 1365898
20402A365898P8498Q0631P4124L2441L6756K3390O8039P3712M4898j9018n0512
$$ 1365898 1444396 1525027 1599151 1631592 1668348 1691738 1759777 1833489 1878387 1859369 1808857
20391A808857J2550K754j8862m0799q3796p7727o2412j03171o6807r8377r9126
$$ 1808857 1821407 1824161 1805299 1764500 1680704 1602977 1540565 1437394 1370587 1272210 1173084
20380A173084o2603k2527p2040l2884j0125o703k2887l1311j6751k7248k5788
$$ 1173084 1110481 1087954 1015914 983030 972905 966202 943315 912004 895253 868005 842217
20369H42217j5983L2578j5197l2081k1834j492j1436j331k543M550j1101j4093
$$ 842217 826234 858812 843615 811534 789700 788208 776772 775441 772898 777448 766347 752254
20357G52254L4307K5894K4757k7839k1602k2288r385m3447n4585k0511M3595j8140
$$ 752254 786561 812455 837212 809373 787771 765483 756098 712651 658066 637555 681150 663010
20345F63010q092K5545J0909P966k893r798q700k6810Q725K1582P376L7824k6346
$$ 663010 654918 680463 691372 699338 696445 686647 677947 651137 659862 681444 688820 726644 700298
20332G00298j0964k6381o517L1306j1707R20R577M280k855J0335j5208l3227K1116
$$ 700298 689334 662953 656436 687742 676035 676955 686532 690812 687957 698292 683084 649857 670973
20319F70973L2653M0172j4030k2768R678L0617J3542N0177J5311m4389L075j5639
$$ 670973 703626 743798 729768 707000 716678 747295 760837 811014 826325 781936 785011 769372
20307G69372j247L2824M0419K5571j043J6486L7192M2281L304k015k392L0450
$$ 769372 768125 800949 841368 866939 865896 882382 919574 961855 965159 963144 960752 991202
20295I91202J6054N4387N9533M1852P522J1783J7113L444m8856j6767J8045Q2804
$$ 991202 1007256 1061643 1121176 1163028 1170550 1182333 1199446 1202890 1154034 1137267 1155312 1238116
20283A238116O1964j5603J5633R9376J04599N3648O1728K6726P903M1543M702
$$ 1238116 1300080 1284477 1300110 1399486 1504085 1557733 1619461 1646187 1654090 1695633 1700335
20272A700335J5982J5548J7857P006L5859K9408J4120L5719P0793p168j073K2965
$$ 1700335 1716317 1731865 1749722 1756728 1792587 1821995 1836115 1871834 1942627 1935459 1934386 1957351
20260A957351J9002q476L657M2087L8243J679K6719J908l2208j6530N3719J2386
$$ 1957351 1976353 1967877 1971534 2013621 2051864 2053543 2080262 2082170 2049962 2033432 2087151 2099537
20248B099537k8915M9338M6144J3614j887J7938N3663N3474L4309M1821M3971
$$ 2099537 2070622 2119960 2166104 2179718 2177831 2195769 2249432 2302906 2337215 2379036 2423007
20237B423007O3378N8086N5521R3271J02465J14928J16636J10229J45268J85170
$$ 2423007 2486385 2544471 2599992 2693263 2795728 2910656 3027292 3137521 3282789 3467959
20227C467959J72180J66211J48778K14467J65307R5403L21p0362o6931N0431R6093
$$ 3467959 3640139 3806350 3955128 4169595 4334902 4430305 4430626 4360264 4293333 4343764 4439857
20216D439857J52905J44275J39917J59502K41283L63960M56422N23496M94206
$$ 4439857 4592762 4737037 4876954 5036456 5277739 5641699 6098121 6621617 7115823
20207G115823M82812M85510M12337L42114L23118K43549J26984P9535J17897J90994
$$ 7115823 7598635 8084145 8496482 8838596 9161714 9405263 9532247 9611782 9729679 9920673
20197I920673L71303N24170N85034P08366P95933R94209J260295J638170K143409
$$ 9920673 10291976 10816146 11401180 12109546 12905479 13899688 15159983 16798153 18941562
20188A8941562K694604L192069L786024M347277M801967N388667O167184O921012
$$ 18941562 21636166 24828235 28614259 32961536 37763503 43152170 49319354 56240366
20180E6240366Q242495R620370R821749Q598877P082312O337969O084677O365021
$$ 56240366 64482861 74103231 83924980 92523857 99606169 105944138 112028815 118393836
20172A18393836N441883J994802R43161M393720Q761664J2053571J3856902J3775215
$$ 118393836 123835719 125830521 126773682 131167402 139929066 151982637 165839539 179614754
20164A79614754J1780353P824574Q01617o277016r319863j2323242j5410628j2871099
$$ 179614754 191395107 199219681 200021298 193744282 184424419 172101177 156690549 143819450
20156A43819450o040900K072535R417477J3864704J4815883J4110877J3803760
$$ 143819450 137778550 139851085 149268562 163133266 177949149 192060026 205863786
20149B05863786J4110554J3393488P416835n639080j5141280j4046679q109246
$$ 205863786 219974340 233367828 240784663 235145583 220004303 205957624 197848378
20142A97848378l001909k377652o071651q482380p436779m876532k522767k119775
$$ 197848378 194846469 192468817 186397166 177914786 170478007 165601475 163078708 160958933
20134A60958933n380633q101474o433273l582254k081115j481019j127741j200255
$$ 160958933 155578300 147476826 141043553 137461299 135380184 133899165 132771424 131571169
20126A31571169k393212p022575j3401051j5344211j3131760j0044248p580934
$$ 131571169 129177957 122155382 108754331 93410120 80278360 70234112 62653178
20119F2653178n893329m637521l797793l222507k648096k253926j930439j739606
$$ 62653178 56759849 52122328 48324535 45102028 42453932 40200006 38269567 36529961
20111C6529961j625970j479322j303748j144729j139159j046657r38778r28879
$$ 36529961 34903991 33424669 32120921 30976192 29837033 28790376 27851598 26922719
20103B6922719q78214r08675r32568q85120q49205p74575p02661n83738m16632
$$ 26922719 26044505 25135830 24203262 23318142 22468937 21694362 20991701 20407963 19991331
20094A9991331k97339k24955j47319j59407j74369k13692k66652k94898m37808
$$ 19991331 19693992 19469037 19321718 19162311 18987942 18774250 18507598 18212700 17774892
20085A7774892o47686q62685r56016q65263p59782o55515o14515n92092n23964
$$ 17774892 17127206 16264521 15308505 14443242 13683460 13027945 12413430 11821338 11297374
20076A1297374m57911l94120l45532l21944l03612k70455k64501k80919k65959
$$ 11297374 10839463 10445343 10099811 9777867 9474255 9203800 8939299 8658380 8392421
20067H392421k60800k28846j96188k15877k22825k20920j99420j74332j37417
$$ 8392421 8131621 7902775 7706587 7490710 7267885 7046965 6847545 6673213 6535796
20058F535796j80313j79952j69568j47510j16719j16688j38280j34779j27736
$$ 6535796 6355483 6175531 6005963 5858453 5741734 5625046 5486766 5351987 5224251
20049E224251j42597j33502j69220j56465j21076j15371q3387p8786j60490j51830
$$ 5224251 5081654 4948152 4778932 4622467 4501391 4386020 4302633 4223847 4063357 3911527
20039C911527j19387o2210n9852q5563q6446j13731j21345j06852q4575r5275
$$ 3911527 3792140 3729930 3670078 3584515 3498069 3384338 3262993 3156141 3071566 2976291
20029B976291n3272m5088m9967o2821p5793o6415n8219n3939m1631m3940q6758
$$ 2976291 2923019 2877931 2827964 2765143 2689350 2622935 2564716 2510777 2469146 2425206 2338448
20018B338448r7034n5909l4080n9201p2129l8996n5703p1779m0469m8558p7919
$$ 2338448 2241414 2185505 2151425 2092224 2020095 1981099 1925396 1853617 1813148 1764590 1686671
20007A686671p7499m1071p7900n6344k7809m2664m2688k0897l8199q8555m2993
$$ 1686671 1609172 1568101 1490201 1433857 1406048 1363384 1320696 1299799 1261600 1173045 1130052
19996A130052m1375k7102l2485k2535k0707M996l4937q3852j4581J202l9380n5448
$$ 1130052 1088677 1061575 1029090 1006555 985848 990844 955907 872055 857474 858676 819296 763848
19984G63848m5177l8202Q0k2398k4399l728r755J0084n0919k1258l0845p9570
$$ 763848 718671 680469 680549 658151 633752 630024 620269 630353 579434 558176 527331 447761
19972D47761j7832K3106J7805p871n9238p769L7471K2221n4341m5836o078N794
$$ 447761 429929 453035 470840 462969 403731 395962 433433 455654 401313 355477 349399 355193
19960C55193k8525j6664N5326p031n7931l0937N587M8418j2983m5510l5183p923
$$ 355193 326668 310004 365330 358299 300368 269431 275018 323436 310453 264943 229760 221837
19948B21837q268O140J4867r04k1082k6582l4327K2483N5822J7243k7658l0025
$$ 221837 213569 219709 234576 233672 212590 186008 151681 174164 229986 247229 219571 189546
19936A89546M895k958j4167n19M5595J9662j5888j4027N268j3025N85o144J0785
$$ 189546 194441 191483 177316 176797 222392 242054 226166 212139 217407 204382 204967 198823 209608
19923B09608L0907j323k5204k1782l2357K0650N0265O99p647o714k6010k5120
$$ 209608 240515 239192 213988 192206 159849 180499 230764 231463 223816 217102 191092 165972
19911A65972j8492j7987J9588J2369K2007J6195l6967K8107J8698k61k3864k9315
$$ 165972 147480 129493 149081 161450 183457 199652 162685 190792 209490 209229 185365 156050
19899A56050j64k3031j7044j6060j7531N465j673o28o498r949K266R021M0171
$$ 156050 155886 132855 115811 99751 82220 87685 86012 85384 78886 68937 71203 80224 120395
19886A20395N9218o419l6413l2681q237j675J2713P60k3008l0533n6019J3000
$$ 120395 179613 173194 136781 104100 95863 94188 106901 107661 84653 54120 -1899 11101
19874A1101K8325M5708J7870k1087k1185l2365O680K014k0893o1838l3275l0046
$$ 11101 39426 85134 103004 81917 60732 28367 35047 37061 16168 -45670 -78945 -108991
19862a08991J8472K2886K4741J4577k029J1978K5571k0589J0236O198J0583l5874
$$ -108991 -90519 -67633 -42892 -28315 -30344 -18366 7205 -13384 -3148 3050 13633 -22241
19850b2241l5991j8585k9601q499N927k353m05J6968R566K124L4066O762l404
$$ -22241 -58232 -76817 -106418 -114917 -108990 -111343 -111748 -94780 -85214 -83090 -49024 -42262 -45666
19837d5666L5179n80R019j4004k1378q361L1651J8742J2117k6941n197J5058J6658
$$ -45666 -10487 -11067 -2048 -16052 -37430 -45791 -14140 4602 16719 -10222 -15419 -361 16297
19824A6297k2585k3288n598K7101n734k8075M7393L4601j3954l4057K2850l146
$$ 16297 -6288 -29576 -35174 -8073 -13807 -41882 5511 40112 26158 -7899 14951 11805
19812A1805k4149j0602L811j6101j4804M331J6802r705k864M2017k8677k9545
$$ 11805 -12344 -22946 -19135 -35236 -50040 -45709 -28907 -38612 -41476 541 -28136 -57681
19800e7681j2210K489o195j2622k0358N98L5584L2405L699k5710j400K2135l441
$$ -57681 -69891 -67402 -73597 -86219 -106577 -105979 -70395 -37990 -34291 -60001 -61401 -39266 -42707
19787d2707m850J2303m322o382k175k4811J4949K4823J3527j8922j6077m730j9484
$$ -42707 -47557 -35254 -39576 -45958 -48133 -72944 -57995 -33172 -19645 -38567 -54644 -59374 -78858
19774g8858L2358l3763j0985j1677r923J1624J0229l0247r856K4129R129p728
$$ -78858 -46500 -80263 -91248 -102925 -112848 -101224 -90995 -121242 -131098 -106969 -97840 -105568
19762a05568N424N862l4277J3015L7802j424k2014j1349K633J5281P32J5740k225
$$ -105568 -100144 -94282 -128559 -115544 -77742 -79166 -101180 -112529 -109896 -94615 -93883 -78143 -80368
19749h0368J9187K6658J298j1921p393l2282k5285j5743N6944O481j6054j9547
$$ -80368 -61181 -34523 -33225 -45146 -52539 -84821 -110106 -125849 -68905 -62424 -78478 -98025
19737i8025J919l981K5339O88K802l768j1845L1393m276K9855j1248m8510j7577
$$ -98025 -96106 -100087 -74748 -74060 -71258 -75026 -86871 -55478 -59754 -29899 -41147 -89657 -107234
19724a07234j484m0891l0423K6827J1096J5442M874J8354J5401L419J359j1310
$$ -107234 -108718 -149609 -180032 -153205 -142109 -126667 -121793 -103439 -88038 -84619 -83260 -94570
19712i4570j4510j4326K1239K0796j6319J0661k4658L0930p099m0592j1784K6688
$$ -94570 -109080 -123406 -102167 -81371 -97690 -87029 -111687 -80757 -87856 -128448 -140232 -113544
19700a13544K1246k7694p581K7854L8475K3405O532l1718J4808m37J0211K3810
$$ -113544 -92298 -119992 -127573 -99719 -61244 -37839 -31307 -63025 -48217 -48654 -38443 -14633
19688a4633j877m432Q582O03q433J905j4609R951N827l5079j3823J1638j0814
$$ -14633 -16510 -20942 -12360 -11757 -20190 -18285 -32894 -22943 -17116 -52195 -66018 -54380 -65194
19675f5194Q764J9230Q406M024L6051p13L136K3930j918k1668l3149n465n17J0824
$$ -65194 -56430 -37200 -28794 -24770 11281 10568 13704 37634 35716 14048 -19101 -24566 -25083 -14259
19661a4259J1792j3644k8008m484J77N23J0820O43K5020K0008l6052l5057N1455
$$ -14259 -2467 -16111 -44119 -48603 -48426 -47903 -37083 -36440 -11420 8588 -27464 -62521 -11066
19648a1066L0446J0860J0112l0826j3028J061J711j9857k4568Q443n64l9221k2280
$$ -11066 19380 30240 40352 9526 -3502 -2441 -730 -20587 -45155 -36712 -37276 -76497 -98777
19635i8777L2125M7056J3391j3777l29j0153K494j6996K704J8191L1706L9529
$$ -98777 -66652 -19596 -6205 -19982 -20311 -30464 -27970 -44966 -42262 -24071 7635 47164
19623D7164J4170k6131m2159M0812j6146m5395J0582N7864q375j6470k931j8332
$$ 47164 61334 35203 -6956 33856 17710 -27685 -17103 40761 32386 15916 12985 -5347
19611e347l41K3976j824J34l0919j8236J8001J5911L8376L5549k3120j3534k0653
$$ -5347 -5688 18288 16464 16598 -14321 -32557 -14556 1355 39731 75280 52160 38626 17973
19598A7973n213o687j8494O839M4366P4916M6963J7697K2551P6620L8740P7877
$$ 17973 12760 6073 -12421 -5582 38784 113700 160663 178360 200911 277531 316271 394148
19586C94148Q8474N5988L5830N3919O6209l29j526Q325Q464R386K9688O8476K2921
$$ 394148 482622 538610 574440 628359 694568 694239 692713 701038 709502 718888 748576 817052 839973
19573H39973K8029Q2393P7664K2663m0389k1980J0518j3320m2813l3341K7620
$$ 839973 868002 950395 1028059 1050722 1010333 988353 998871 985551 942738 909397 937017
19562I37017M9654L6387O9037J20540N7648J5146j8955N280j9010o654q8378j32806
$$ 937017 986671 1023058 1092095 1212635 1270283 1285429 1266474 1271754 1252744 1246090 1157712 1024906
19550A024906p1800m0085q0397k7475K4442J4988l1646k7254Q632j0385j4912
$$ 1024906 953106 913021 832624 805149 829591 844579 812933 785679 794311 783926 769014
19539G69014o394j7476j787k5912k7978k5346p7684j09942j04452p0964m0058
$$ 769014 762620 745144 743357 717445 689467 664121 586437 476495 372043 301079 261021
19528B61021J5121j6527l4969k8602p828K5137k4984j5592J5613k7528k2495k5239
$$ 261021 276142 259615 224646 196044 188216 213353 188369 172777 188390 160862 138367 113128
19516A13128j7989K573j4987M8223O3820N659L802k1155l0616p440o183k9107
$$ 113128 95139 97712 82725 130948 194768 200427 204229 183074 152458 145018 138835 109728
19504A09728l0504k0493l0994J8873J9493J4949K6715J5861l339p838K6939K5180
$$ 109728 79224 58731 27737 46610 66103 81052 107767 123628 120289 112451 139390 164570
19492A64570l2514j5961n706j1662q956k6383q345Q275m409o546M056j9834k7068
$$ 164570 132056 116095 110389 98727 89771 63388 55043 63318 58909 52363 56419 36585 9517
19479I517n978K8326L3206K223m7780l851l178R531q559p463M328L0039K1691
$$ 9517 3539 31865 65071 67294 19514 15663 12485 22016 13457 5994 10322 40361 62052
19466F2052M3434L4268N957j3091l5359l857L6005K1802m0021k4089j132K3521
$$ 62052 105486 139754 145711 132620 97261 93404 129409 151211 111190 87101 85969 109490
19454A09490K0214m1357K0777j3418l0617j3063j8263n7288R314L4316M0246K1561
$$ 109490 129704 88347 109124 95706 65089 52026 33763 -23525 -14211 20105 60351 81912
19442H1912O754n561K2069j2006j858J1973N393j5025p926J3937j0277K9930l0662
$$ 81912 88666 83105 105174 93168 91310 103283 108676 93651 85725 99662 89385 119315 88653
19429H8653m9101p652m0812J8234Q103K729J0220m528K5487Q521k965k7038J8278
$$ 88653 39552 31900 -8912 9322 17425 20154 30374 25846 51333 59854 56889 29851 48129
19416D8129k4081L162L8928J4620L3411Q543K1697p938j04J4492M416M92N105
$$ 48129 24048 27210 66138 80758 114169 122712 144409 136471 136367 150859 155275 155767 160872
19403A60872l3920j3203n0016m2323M359k873k0297O258L0491R739J9905m2478
$$ 160872 126952 113749 63733 21410 25769 22896 2599 8857 39348 49087 68992 26514
19391B6514M927O995O236O206l59J6783p254m094N632j0521k862J8527m124o232
$$ 26514 31441 38436 44672 50878 50519 67302 60048 55954 61586 51065 48203 66730 62606 56374
19377E6374K4598J5771k582m618L260j2764j2556L2356k1701j1034j4494m600
$$ 56374 80972 96743 94161 89543 92803 80039 67483 99839 78138 67104 52610 48010
19365D8010K8067j2114k9302j3524L45j0695n357P477R243K7517k0158j888L2058
$$ 48010 76077 63963 34661 21137 21482 10787 5430 12907 22150 49667 29509 27621 59679
19352E9679J0513r728Q553K1079m461k9497k3237j8436L461M3910N927j3930L5705
$$ 59679 70192 60464 69017 90096 85635 56138 32901 14465 17926 61836 67763 53833 89538
19339H9538J0372K7584j1929l0144j5942L4376K2401l326j2147j3068j5336j0048
$$ 89538 99910 127494 115565 85421 69479 103855 126256 122930 110783 97715 82379 72331
19327G2331K7025k7207n5695j8060N0261M9504L4783M067j4041M57r864J6002
$$ 72331 99356 72149 16454 -1606 48655 98159 132942 137009 122968 123425 113561 129563
19315A29563o246K3200N54r288j9496k5357p770j0235M87l816J6653K8561J5227
$$ 129563 123317 146517 147071 137783 118287 92930 85160 74925 75412 71596 88249 116810 132037
19302A32037j529n456k9012J9707Q1476J01511P3096N0840L473K7273O2831O7852
$$ 132037 130508 125052 96040 115747 197223 298734 371830 422670 426143 453416 516247 584099
19290E84099P5109l1487n9824l2867o836N5404J5548p964J1410m9011j09918q0308
$$ 584099 659208 627721 567897 535030 528194 583598 599146 591182 602592 553581 443663 363355
19278C63355q1649o1576P889L0166l862k9090o2597k9032O941R133J4830R938
$$ 363355 281706 220130 228019 258185 254323 225233 162636 133604 140545 149678 164508 174446
19266A74446j8438j4468J801J6300N5799R3951P7780P1863R2592L4258l146K2639
$$ 174446 156008 141540 143341 159641 215440 309391 387171 459034 551626 585884 582738 605377
19254F05377m0089p0851q7797q9892j4849K9929R282q651K6968J02263J03638
$$ 605377 565288 494437 406640 316748 301899 331828 341110 332459 359427 461690 565328
19243E65328J06372J36762J37151J34486J10319J08097R6511M7514J07523M3616
$$ 565328 671700 808462 945613 1080099 1190418 1298515 1395026 1442540 1550063 1593679
19233A593679M3017J55622J68768R7424L6894j1446n1330j65282l33161l24310
$$ 1593679 1636696 1792318 1961086 2058510 2095404 2083958 2032628 1867346 1534185 1209875
19223A209875k66463j32238q9148o9206p3919o1859k7967K5951k1373o1195j4438
$$ 1209875 943412 811174 722026 652820 578901 517042 489075 515026 493653 432458 418020
19212D18020L4043q565k6413M0217O0090N9887J20178J27655J13451J05589J02031
$$ 418020 452063 443498 417085 457302 517392 577279 697457 825112 938563 1044152 1146183
19201A146183Q2616R0402m978j32931j65860j72236j17453j00440q1654j4341
$$ 1146183 1228799 1319201 1314223 1181292 1015432 843196 725743 625303 543649 529308
19191E29308J070M9637M5302N5237R0040L2271M4367M9824O3018P5460J7561K5500
$$ 529308 530378 580015 625317 680554 770594 802865 847232 897056 960074 1035534 1053095 1078595
19179A078595J23502J60629J49026J43351J20941L7004n3359l8542r0388k45222
$$ 1078595 1202097 1362726 1511752 1655103 1776044 1813048 1759689 1721147 1630759 1385537
19169A385537l20505j87585j44963r6853p0030n3105m0891k2259k1829J9962J7646
$$ 1385537 1065032 877447 732484 635631 565601 512496 471605 449346 427517 447479 465125
19158D65125n0133l4432j6961K0929L7733J3782j4897N1206O8916J00584O0342
$$ 465125 414992 380560 363599 384528 422261 436043 421146 472352 541268 641852 702194
19147G02194L5660j799K8756M7686N1854j2631j46460j68792p6563l5482l3242
$$ 702194 737854 736055 764811 812497 864351 851720 705260 536468 459905 424423 391181
19136C91181J1610P13J0727K7184j9742m3107n806J9077k5752l7233l3147q817
$$ 391181 402791 403504 414231 441415 421673 378566 372760 391837 366085 328852 295705 286888
19124B86888J3340J0413L9145K128L1756Q2956O6518J8853j868q547j3560L9196
$$ 286888 300228 310641 349786 351914 383670 466626 533144 551997 550129 541582 528022 567218
19112E67218P7567m0097o8793Q97J2554J6552J1765O953l0745j4330L3874P0604
$$ 567218 644785 604688 535895 536792 549346 565898 577663 584616 553871 539541 573415 644019
19100F44019k5232r6682m5134l6533o1046k5511q958k4247k6344l010R658L0786
$$ 644019 618787 522105 476971 440438 379392 353881 344923 320676 294332 291322 300980 331766
19088C31766J4047L0330P214n110N020k4019r068K0948J653J8636M8147L373j0329
$$ 331766 345813 376143 383357 378247 383267 359248 350180 371128 372781 391417 439564 442937 432608
19075D32608J3165J7115K0180N037M7099J29398J13863J11990Q9426N5433R2207
$$ 432608 445773 462888 483068 488105 535204 664602 778465 890455 979881 1035314 1127521
19064A127521P7519J09485m152k23651j24533l696N1003Q2466O3660N5523P8892
$$ 1127521 1205040 1314525 1310373 1086722 962189 958493 1009496 1091962 1155622 1211145 1290037
19053A290037M9865M3828q3082l06868k61749j17744n2828m8035m6826m9811j2682
$$ 1290037 1339902 1383730 1300648 993780 732031 614287 561459 513424 466598 416787 404105
19042D04105l27k5409l8744j6799j4568J0553M2888l3201n9065l0508j2770J3735
$$ 404105 403778 378369 339625 322826 308258 318811 361699 328498 269433 238925 226155 239890
19030B39890J0246M0255O7767N931J0849k975K5131N7064J8639O9573Q3461R7830
$$ 239890 250136 290391 358158 364089 374938 371963 397094 454158 472797 542370 625831 723661
19018G23661Q4052J07400O1418K7167N4910K4321j69924j70049m9191M7706J12198
$$ 723661 807713 915113 976531 1003698 1058608 1082929 913005 742956 693765 741471 853669
19007H53669N0202P4694K7911J3303O0425P497j86749j81843j04594k9887q0332
$$ 853669 903871 978565 1006476 1019779 1080204 1087701 900952 719109 614515 584628 504296
18996E04296l5179r643j2179k7484k8788q181k6321k0576J2374J3343J9387K8867
$$ 504296 469117 459474 447295 419811 391023 382842 356521 335945 348319 361662 381049 409916
18984D09916P304j8501K8362L6530O8082K2874n188J5003K4222L6734J3761N1814
$$ 409916 417220 398719 427081 463611 531693 554567 549379 564382 588604 625338 639099 690913
18972F90913L1228N5931O1098N2118N2840P9198J41649J95454L39441M93280P74202
$$ 690913 722141 778072 839170 891288 944128 1023326 1164975 1360429 1699870 2193150 2967352
18961B967352J084375J218334J122894J156871J350991J392577J388354J013483
$$ 2967352 4051727 5270061 6392955 7549826 8900817 10293394 11681748 12695231
18953A2695231o67393j248091o37172k79673j450867j944708j366807q60308n38280
$$ 12695231 12027838 10779747 10142575 9862902 8412035 6467327 5100520 4240212 3701932
18944C701932l70819k75278k00638j75071p7604n024R5409J99217L76952O54703
$$ 3701932 3331113 3055835 2855197 2680126 2602522 2597498 2692907 2892124 3269076 3923779
18934C923779J008300J216794J167947J181421J340582J405767J364424J069250
$$ 3923779 4932079 6148873 7316820 8498241 9838823 11244590 12609014 13678264
18926A3678264n61483j307977p13563l05534j388146k095006j456464r24872n63457
$$ 13678264 13116781 11808804 11095241 10789707 9401561 7306555 5850091 4925219 4361762
18917D361762m12364k65331j70251j36608l3171M1718J02162K17334L96125O68140
$$ 4361762 3949398 3684067 3513816 3377208 3344037 3385755 3487917 3705251 4101376 4769516
18907D769516J141511J617527J742607J602179J734318K015420J985517J820951
$$ 4769516 5911027 7528554 9271161 10873340 12607658 14623078 16608595 18429546
18899A8429546N26676j610978j549291n92036r09564k745099k605093j682757
$$ 18429546 18956222 17345244 15795953 15203917 14294353 11549254 8944161 7261404
18891G261404j095945p70253n08292l39424k39227j52324j05735L4259J42535
$$ 7261404 6165459 5395206 4886914 4547490 4308263 4155939 4050204 4084463 4226998
18882D226998K78730N59598J069014J551341J680989J561439J616736J899802
$$ 4226998 4505728 5065326 6134340 7685681 9366670 10928109 12544845 14444647
18874A4444647J888096J798340P26249j547498j699296p11372p61964k596051
$$ 14444647 16332743 18131083 18857332 17309834 15610538 14899166 14137202 11541151
18866A1541151k579140j744340j152953q08462n76702m12745l47836l05385k58735
$$ 11541151 8962011 7217671 6064718 5256256 4679554 4266809 3918973 3613588 3354853
18857C354853j94950j65931j38574j35955n3054m7506l9369n7910r153P2657J00950
$$ 3354853 3159903 2993972 2855398 2719443 2666389 2618883 2579514 2521604 2512451 2585108 2686058
18846B686058J50221J17165M3083L3105L4146J29343K09628P0298j9222k2370
$$ 2686058 2836279 2953444 2996527 3029632 3063778 3193121 3402749 3473047 3453825 3431455
18836C431455L3113O4571M5723J0912p5041k57869k80102j58901m2296k8289m2309
$$ 3431455 3464568 3529139 3574862 3585774 3510733 3252864 2972762 2813861 2771565 2743276 2700967
18825B700967j41474k28217j95221j18779l7952m379J8875j2459Q904Q642K154
$$ 2700967 2559493 2331276 2136055 2017276 1979324 1974945 1993820 1981361 1990265 1998907 2001061
18814B001061M3380P007m8357k2572p8o018P5739Q6968N0793O0123P4209J72914
$$ 2001061 2044441 2051448 2003091 1980519 1980441 1974423 2050162 2137130 2187923 2248046 2322255 2495169
18802B495169R3371P1447k9028q9095j0357J22369J45905N229k0109Q9037J92956
$$ 2495169 2588540 2659987 2630959 2541864 2531507 2653876 2799781 2805010 2784901 2873938 3066894
18791C066894K09390J44259J04145J62170J99213K39838K77034K28364J45001
$$ 3066894 3276284 3420543 3524688 3686858 3886071 4125909 4402943 4631307 4776308
18782D776308K56749L03363M69338Q52503J454191J824319J586926J048376Q68914
$$ 4776308 5033057 5336420 5805758 6658261 8112452 9936771 11523697 12572073 13440987
18773A3440987Q85132J054352J405229o24460k517344j370118K11761J806950
$$ 13440987 14326119 15380471 16785700 16161240 13643896 12273778 12485539 14292489
18765A4292489L199273L547582K643077J768618J634579J502559K269942Q22119
$$ 14292489 17491762 21039344 23682421 25451039 27085618 28588177 30858119 31680238
18757C1680238n701454o374080l981540k369130j470215r40720o68161m84677
$$ 31680238 25978784 19604704 15623164 13254034 11783819 10843099 10174938 9690261
18749I690261l61966l46289l52450k19173j1631J52141K52655K53517K03823J20209
$$ 9690261 9328295 8982006 8629556 8410383 8398752 8550893 8803548 9057065 9260888 9381097
18739I381097J74611K48459K94265M03489M48981O00276Q82595J288749J669428
$$ 9381097 9555708 9804167 10098432 10501921 10950902 11551178 12433773 13722522 15391950
18730A5391950K070909K563886L445979M568598O262958R819519J6351733K4834544
$$ 15391950 17462859 20026745 23472724 28041322 34304280 44123799 60475532 85310076
18722H5310076K9432985K6185627J9995836J8688343K0383453K6184779L4493286
$$ 85310076 114743061 140928688 160924524 179612867 199996320 226181099 260674385
18715B60674385J0374451j2812643n525571N087250J6955441K3724225K7441238
$$ 260674385 271048836 258236193 252710622 257797872 274753313 298477538 325918776
18708C25918776K0647160k0173535l7335116k3782179p476037j1949562m3488826
$$ 325918776 346565936 326392401 289057285 265275106 257799069 245849507 202360681
18701B02360681m3362550k8697476j8126176j1657107p618864m854798k644184
$$ 202360681 158998131 130300655 112174479 100517372 92898508 88043710 85399526
18694H5399526n52647K310359P213909J4613410K1563142K2456738J7256230J2582946
$$ 85399526 84846879 87157238 94371147 108984557 130547699 153004437 170260667 182843613
18686A82843613J1623470J1430959J5828172P809495k4103019k0998638N531394
$$ 182843613 194467083 205898042 221726214 229535709 205432690 184434052 189965446
18679A89965446L3087627M9210579M5111013L0366282K3572690K2050986K5155734
$$ 189965446 223053073 272263652 317374665 347740947 371313637 393364623 418520357
18672D18520357L3992144l1785626j00851881p7673848m5567907k6069142j4010331
$$ 418520357 452512501 420726875 319874994 242201146 196633239 170564097 156553766
18665A56553766l520402Q313440J9236929K3987584K1607167J8719741K2077805
$$ 156553766 153033364 161346804 180583733 204571317 226178484 244898225 266976030
18658B66976030K8351004L6332560L1863312j1648606l2028534k1198070j3565016
$$ 266976030 295327034 331659594 363522906 351874300 319845766 298647696 285082680
18651B85082680m324591p175031m3157881m9323973l3219543k0889676j3946786
$$ 285082680 280758089 273583058 230425177 181101204 147881661 126991985 113045199
18644A13045199r923071p146915n298595m295793l531300m471735n166178l418209
$$ 113045199 103122128 95975213 90676618 86380825 82849525 78377790 73211612 69793403
18636F9793403j325415J79651N27725l9409o45551n02053l32107M98969j272120
$$ 69793403 68467988 68647639 69175364 69135955 68490404 67988351 67656244 68155213 66883093
18627F6883093p149640p367395n262966l634683k619108k003231j623325j196560
$$ 66883093 59733453 52366058 47103092 43468409 40849301 38846070 37222745 36026185
18619C6026185o95710j65607L59234N11489K98314O614O6780K39684N84140P23241
$$ 36026185 35330475 35164868 35524102 36035591 36333905 36340519 36407299 36646983 37231123 37954364
18609C7954364j116381k285623j711703j007317m92109K19934O91041k73385l65106
$$ 37954364 36837983 34552360 32840657 31833340 31341231 31561165 32252206 31978821 31613715
18600C1613715K08199P96517J146918R78781J063901O64433j612364j607982m82179
$$ 31613715 31821914 32618431 33765349 34744130 35808031 36472464 34860100 33252118 32769939
18591C2769939j706375k589866j944580j251210q06611m41347o10807k018040
$$ 32769939 31063564 28473698 26529118 25277908 24471297 24029950 23419143 21401103
18583B1401103k312022j663702j152089r19966p06145o06286n27386m71013l99067
$$ 21401103 19089081 17425379 16273290 15353324 14647179 14040893 13513507 13042494 12643427
18574A2643427l78846l26472k25149k39653k51864k42883k57359k02553n1790
$$ 12643427 12264581 11938109 11712960 11473307 11221443 10978560 10721201 10518648 10466858
18565A0466858R8296L05786M34997O83325P17118M67455L23003L20943L27627
$$ 10466858 10565154 10870940 11305937 11989262 12706380 13173835 13496838 13817781 14145408
18556A4145408M79073r2072j706520j719727j047005o98494m44490k94796k37893
$$ 14145408 14624481 14532409 12825889 11106162 10059157 9360663 8916173 8621377 8383484
18547H383484l6304J83572M24958O81067P44118N13097L00423K90865K94297M79806
$$ 8383484 8347180 8530752 8955710 9636777 10380895 10893992 11194415 11485280 11779577 12259383
18537A2259383N180j744396j811167j183962p98531n50483l94695k99857k89307
$$ 12259383 12264563 10520167 8709000 7525038 6726507 6176024 5781329 5481472 5192165
18528E192165k77392k58970j61618j41659q3639j18644r7805p2730q5518j06193
$$ 5192165 4914773 4655803 4494185 4352526 4268887 4150243 4052438 3979708 3894190 3787997
18518C787997n5452l9915p4421n2266j15712j13326j11421q3631j6376l7723l2736
$$ 3787997 3732545 3692630 3618209 3565943 3450231 3336905 3225484 3141853 3125477 3087754 3055018
18507C055018l0141j41200j85209j41168j07222j23580r0695m6533m0602p2000
$$ 3055018 3024877 2883677 2698468 2557300 2450078 2326498 2235803 2189270 2148668 2076668
18497B076668o0030r0687p8446k767j6310n3401p9543n1775k9735l9907k4936
$$ 2076668 2016638 1925951 1847505 1844738 1828428 1775027 1695484 1643709 1613974 1574067 1549131
18486A549131l3233o8452o1773k9856j1269R693k0460j9987j1194j6909k5178
$$ 1549131 1515898 1447446 1385673 1355817 1344548 1354241 1333781 1313794 1302600 1285691 1260513
18475A260513l5217m6632O638l2392l3311j7662m2262n3789l0716q377K4308K2424
$$ 1260513 1225296 1178664 1185302 1152910 1119599 1101937 1059675 1005886 975170 966793 991101 1013525
18463A013525N374j8304k0826M5985L8031N588k9562k4235l5404l771k0979l1369
$$ 1013525 1018899 1000595 979769 1025754 1063785 1069373 1039811 1015576 980172 976401 955422 924053
18451I24053l8636m242L3104k4707m5478l698K3345l055m3548l9250J4264L856
$$ 924053 885417 881175 914279 889572 844094 840396 863741 860686 817138 777888 792152 796008
18439G96008J3670j7292n4977k4650L1273l0463J0182j6219J3670k0436p7374
$$ 796008 809678 792386 737409 712759 744032 713569 723751 707532 721202 700766 623392
18428F23392k2106J1703m384m2515L890k6497j3415M746j4962k7753K7983L0063
$$ 623392 601286 612989 608605 566090 569980 543483 530068 534814 519852 492099 520082 550145
18416E50145q131r130N032m689O662o958m843Q567j1351M7386M1578m464r512
$$ 550145 542014 532884 537916 533227 539889 532931 528088 536655 525304 572690 614268 609804 600292
18403F00292o2563l0405N7762M613k1995m5936q239l1091l9741j7552k2050J4825
$$ 600292 537729 507324 565086 569699 547704 501768 493529 462438 422697 405145 383095 397920
18391C97920o6285l7888K5011M9678n743l2239R144J0763M581J0665n878m0N516
$$ 397920 331635 293747 318758 368436 362693 330454 339598 350361 354942 365607 359729 359689 365205
18378C65205J158p091j4441n7338j2871k23k7615l8238j7811l2645J440K9856
$$ 365205 366363 359272 344831 287493 274622 274399 246784 208546 190735 158090 159530 189386
18366A89386L4422O442m151n0237j0911L5314K8364o831j6963J1405L343n891
$$ 189386 223808 230250 226099 175862 164951 200265 228629 221798 204835 216240 219583 213692
18354B13692L3252K7475l7698j4602n509P1K3626p639n236j8768j738J6962k0699
$$ 213692 246944 274419 236721 222119 216610 216681 240307 232668 227432 208664 206926 223888 203189
18341B03189k6831m752K9576J4446p982l2300M3437L7896J920k5629j8973k2242
$$ 203189 176358 171606 201182 215628 207646 175346 218783 256679 258599 232970 213997 191755
18329A91755J2157j5122j1147q965M1793n827K2992m659j5765j162l4263j2976
$$ 191755 203912 188790 177643 168678 210471 204644 227636 222977 207212 206050 171787 158811
18317A58811o088J6012L4901N942k5855k516m1317k6465l416m005r140k1706j3310
$$ 158811 152723 168735 203636 209578 183723 181207 139890 113425 110009 106004 96864 75158 61848
18304F1848J1422J2707K918K6121n820l4249L156K2461L7277P050j2030n3818
$$ 61848 73270 85977 88895 115016 109196 74947 78103 100564 137841 144891 132861 79043
18292G9043k4848L6048K9094k9387J2406r449m1824k6857O170L4889J6864n781
$$ 79043 54195 90243 119337 89950 102356 92907 51083 24226 30396 65285 82149 76368
18280G6368k7363k0720J1962J2160J4050j4460J0574J915N101P949k6764K573
$$ 76368 49005 28285 40247 52407 66457 51997 62571 64486 69587 77536 50772 53345
18268E3345j3061l8981K4198K860j2859q785L6618M5788K2085K4587o4481o487
$$ 53345 40284 1303 25501 28361 15502 6717 43335 89123 111208 135795 71314 64827
18256F4827J7886O64k1547m4632k1800R946K896J5620j6352M0460Q271j7269K891
$$ 64827 82713 83377 61830 17198 -4602 5344 8240 23860 7508 47968 56239 38970 41861
18243D1861N3399O1993M4459k7110K0878L9547p624k011L848J0123j1813n209
$$ 41861 95260 157253 201712 174602 195480 235027 227403 225392 229240 239363 227550 222341
18231B22341j203l6450J3527Q405k5802M802N591Q610m405K0290K8624K4317P8031
$$ 222341 221138 184688 198215 206620 180818 185620 191211 199821 195416 215706 244330 268647 346678
18218C46678J14020J10172M5518K3265P4975Q3584N0402k2877k0025l7597j2962
$$ 346678 460698 570870 616388 639653 714628 798212 848614 825737 805712 768115 755153
18207G55153L447M1045N0561l0755j23451j17508j03787q4466n1278J7477N3025
$$ 755153 758600 799645 850206 819451 696000 578492 474705 390239 338961 356438 409463
18196D09463N3151M7864Q3087J12616O7456J9832K8642L8781Q0311L2806q9078
$$ 409463 462614 510478 593565 706181 773637 793469 822111 860892 941203 974009 884931
18185H84931j52465r1182k7081m2906l9869j5272L490J2487l8282m5531K477j5833
$$ 884931 732466 641284 614203 571297 531428 516156 519646 532133 493851 448320 450797 434964
18173D34964K5589J3604Q402M8899R3479J21628K15105K72354K77332K85660K09612
$$ 434964 460553 474157 482559 531458 624937 746565 961670 1234024 1511356 1797016 2006628
18162B006628J81769J78499J59891R595j12572k04745k24363j38519j11876n5412
$$ 2006628 2188397 2366896 2526787 2536382 2423810 2219065 1994702 1856183 1744307 1688895
18152A688895j9057j00344j51761j56824j59141j50418r3180p0003k5391J3134
$$ 1688895 1669838 1569494 1417733 1260909 1101768 951350 858170 788167 762776 775910
18142G75910J826p049P0242J17011J10899J36071R7728J17262R4231J21472O6189
$$ 775910 777736 770687 840929 957940 1068839 1204910 1302638 1419900 1514131 1635603 1701792
18131A701792m5765p2484j77441j74067j32023l5976j8065L0688R7964J46000
$$ 1701792 1656027 1583543 1406102 1232035 1100012 1064036 1045971 1076659 1174623 1320623
18121A320623J56275K10651L66424N69977R01470J565152K956980M647420N273231
$$ 1320623 1476898 1687549 2053973 2623950 3525420 5090572 8047552 12694972 17968203
18112A7968203M286073K846685K449980K170054K883685L406921n350048r253821
$$ 17968203 22254276 25100961 27550941 29720995 32604680 36011601 30661553 21407732
18104B1407732o013595l617998k319348j542313j108535q07998o14565m79927
$$ 21407732 15394137 11776139 9456791 7914478 6805943 5997945 5383380 4903453
18096D903453m70516m26435l45672k68570k47548j93044j52269j57366j58059
$$ 4903453 4432937 4006502 3660830 3392260 3144712 2951668 2799399 2642033 2483974
18087B483974j07979o6685p4584q4003q904J5236j6680m1671n0524k1814j7461
$$ 2483974 2375995 2309310 2234726 2150723 2141819 2157055 2140375 2098704 2048180 2026366 2008905
18076B008905l6958n0481j58338j88791j15249p6896l9377o2131n8663o746k2000
$$ 2008905 1971947 1921466 1763128 1574337 1459088 1382192 1342815 1280684 1222021 1215275 1193275
18065A193275j1717k4740q1550o6443m9797m1421J3077k8096k1275l8490j8991
$$ 1193275 1181558 1156818 1075268 1008825 959028 917607 930684 902588 881313 842823 823832
18054H23832j1921J444o987j9183l3431m3997m3318k6572J0321q775N541j4952
$$ 823832 811911 813355 806368 787185 753754 709757 666439 639867 650188 641413 646954 632002
18042F32002L750k841k5388k6691m6425l3205j5338J5610P330m5398j2914q381
$$ 632002 635752 632911 607523 580832 534407 501202 485864 501474 508804 463406 450492 442111
18030D42111J6842j0038j7801q25k1654m0209M6491P96p332J4998l5562n2647
$$ 442111 458953 448915 431114 430289 408635 368426 414917 415713 408381 423379 387817 335170
18018C35170k7765K928M91Q804l990r824m656o87j2995r930o240n191K3156j2794
$$ 335170 307405 310333 310824 319628 315638 305814 301158 300471 287476 277546 271306 266115 289271 276477
18004B76477n5520L1831J5091p041P945J4751K2704j6598l1476m7346Q412K4428
$$ 276477 220957 252788 267879 260838 268783 283534 306238 289640 258164 210818 219230 243658
17992B43658j1960k713j1439J1006k108j9937k0095j5319P478n5J2224m795k6446
$$ 243658 231698 228985 217546 228552 226444 206507 186412 171093 178571 178516 190740 185945 159499
17979A59499l0373m3246K0697j3801k415N366j8368l1575j7080M1884J0061k4772
$$ 159499 129126 85880 106577 92776 90361 95727 77359 45784 28704 70588 80649 55877
17967E5877J0391M0791O333J2540J2660R586n429j8473j7555J2844o235j2641
$$ 55877 66268 107059 113392 125932 138592 148178 142749 124276 106721 119565 113330 100689
17955A00689J4211j1662L847m9906m5083j1158L1558M6844O226K4699J9609m1495
$$ 100689 114900 103238 107085 57179 12096 938 32496 79340 85566 110265 129874 88379
17943H8379m2782M6550L0134J8142L420j5690K276J7473n645k5795O997j2900
$$ 88379 45597 92147 122281 140423 143843 128153 130429 147902 142257 116462 123459 110559
17931A10559n5135k5322L9460J6594P00j9846l0588k7043O482K6392l916J879
$$ 110559 55424 30102 69562 86156 86856 67010 36422 9379 15861 42253 38337 40216
17919D0216J2044q983r044K4799L4936j8209j0113m4277k3768j98N310k8946j4208
$$ 40216 52260 43277 34233 59032 93968 75759 65646 21369 -2399 -2597 2713 -26233 -40441
17906d0441Q3905Q1206j7399j1570k998N165L1643r59j0710J1404l7851k4362
$$ -40441 43464 124670 107271 95701 92703 97868 129511 128552 117842 129246 91395 67033
17894F7033L896J5580j8540l558J7034k3725j8640O064N7661N952l0832L502N7966
$$ 67033 70929 86509 67969 64411 81445 57720 39080 45144 102805 108757 77925 81427 139393
17881A39393J0359k736R93K1156n488m8802j9433j3311K1937l0994j0244k0425
$$ 139393 149752 147016 148009 169165 163677 114875 95442 82131 104068 73074 62830 42405
17869D2405J0965o300J0051J0624K1626k0201l2872J9404L2169m919j6541l5432
$$ 42405 53370 47070 57121 67745 89371 69170 36298 55702 87871 82952 66411 30979
17857C0979j8878L8373K0986K14p224Q396L3162J7433J3348k3237n8185M189L416
$$ 30979 12101 50474 71460 71674 64450 72846 106008 123441 136789 113552 55367 59556 62972
17844F2972j4271j3076k4494J4857M878K6787K951p146J6874j3181K2727K7581
$$ 62972 48701 35625 11131 25988 30866 57653 60604 53458 70332 57151 79878 107459
17832A07459N944J0611k2342p4212Q24K0202k4517p876j028J3326o810j1023q980
$$ 107459 113403 124014 101672 27460 28284 48486 23969 16093 15065 28391 21581 10558 1578
17819A578m355M579K5316L3891l660k4725N1181J8855j5194n0512M110K0772J6073
$$ 1578 -2777 1802 27118 61009 57349 32624 83805 102660 87466 36954 41064 61836 77909
17806G7909K8651O295L637n251j4301J2554R562m577l3999k8475k39L1825J1270
$$ 77909 106560 112855 116492 111241 96940 109494 119056 114479 80480 52005 51766 83591 94861
17793I4861j5250K5992K717r495l9822J2845J9327j9921l6134k4745J1901M4848
$$ 94861 79611 105603 108320 98825 59003 71848 91175 71254 35120 10375 22276 67124
17781F7124k5967j0339j8987J4918O1516Q692q896L57m9880l2994k3223k6413
$$ 67124 41157 30818 11831 26749 88265 96957 88061 88418 38538 5544 -17679 -44092
17769d4092j2203O0513N8197K6012J0653p677l0651m617R028k021j9757l1167
$$ -44092 -56295 4218 62415 88427 99080 91403 60752 56135 65163 63142 43385 12218
17757A2218K6118M086N1425L789l4065Q010Q678l8971l7983j3917k531j1927j9299
$$ 12218 38336 42422 93847 97636 63571 71581 80259 41288 3305 -10612 -13143 -25070 -44369
17744d4369k0204Q529j7789L4824O2411M4941k964j3636k0042j9977m132q960
$$ -44369 -64573 -56044 -73833 -39009 23402 68343 65379 51743 31701 11724 7592 -1368
17732a368Q636P416K3254N759o3882j0938J0399M3987R280k0458R492J4768K2900
$$ -1368 7268 14684 37938 43697 -20185 -31123 -20724 23263 32543 12085 21577 36345 59245
17719E9245o846J078k1950k2608j35Q231Q299k3743k5128M6193K6569J917j548
$$ 59245 52399 53477 31527 8919 8784 17015 25314 1571 -23557 22636 49205 51122 49574
17706D9574l509j5334r714k1417r256M3975Q681k2449q916O282J7464n567N239
$$ 49574 46065 30731 21017 -400 -9656 34319 43000 20551 11635 17917 35381 29814 35053
17693C5053j0690P357L3818K657J115Q501L1269l2079j3037J3391K3721K4256
$$ 35053 24363 31720 65538 68195 69310 77811 109080 77001 63964 77355 101076 125332
17681A25332J7758N5199L854L905o56M628J0411J8008J105k6313l2572k820J2685
$$ 125332 143090 198289 202143 206048 205392 210020 220431 238439 239544 213231 180659 177839 190524
17668A90524O508R945k0703n0259o7793j7640P985J2052K8636J6447l4514l3036
$$ 190524 197032 206977 186274 136015 68222 50582 58567 70619 99255 115702 81188 48152
17656D8152K046j5806J8795j1184q84R59m7928j7650M5453M0614J0947l1767L3670
$$ 48152 50198 34392 53187 42003 41119 42078 -5850 -23500 21953 62567 73514 41747 75417
17643G5417J0131k664K208k550M9086K1000k8255L3266K1385l94j5173k8404l8640
$$ 75417 85548 82884 85092 82542 131628 152628 124373 157639 179024 178630 163457 135053 96413
17630I6413J3366J863L6179K6236L4567M913m0997l6547J729j192N5418L0016
$$ 96413 109779 111642 147821 174057 208624 213537 172540 135993 137722 136530 191948 221964
17618B21964k724n3902n4146m1106m939J5017j9024r85J4950J7016n56l1327M8815
$$ 221964 219240 165338 111192 70086 65147 80164 61140 60155 75105 92121 91565 60238 109053
17605A09053J4181q606j7952J6087r463q207m4511m5753K2347J8397k577l5712
$$ 109053 123234 114628 96676 112763 103300 95093 50582 4829 27176 45573 42996 7284
17593G284q297M6901k3353l2688p230m306o552N489O17J995j3367Q945L5352J7281
$$ 7284 -1013 45888 22535 -10153 -17383 -21689 -28241 -22752 -22135 -20140 -33507 -24562 10790 28071
17579B8071P443J3152n895r794m4733k4819Q092J8331K2821J4297j44J5298k9465
$$ 28071 35514 48666 42771 32977 -11756 -36575 -28483 -10152 12669 26966 26822 42120 12655
17566A2655n2841K1066l287J1358M301k1652j8336J6084n982o770m181j6647K8711
$$ 12655 -40186 -19120 -22407 -11049 -6748 -28400 -46736 -30652 -36634 -43404 -47585 -64232 -35521
17553c5521L0195J425k3696l5597o188m5554J836L8403M4631K234P659L649J555
$$ -35521 -5326 -3901 -27597 -63194 -69382 -114936 -113100 -74697 -30066 -27832 -20173 -16524 -14969
17540a4969k6784N687p425J4560K1153j5216j4692j0998L6806M5798M0328k0634
$$ -14969 -41753 -36066 -43491 -28931 -7778 -22994 -37686 -48684 -11878 33920 74248 53614
17528E3614j3499k4761k6340J0611J4363j1020j9502j0307k3574K7173J3680P430
$$ 53614 40115 15354 -10986 -375 13988 2968 -16534 -26841 -50415 -23242 -9562 -2132
17516b132k8632l1074J8062J1816j0008K781j0104M707N1405K8348l1446k9760
$$ -2132 -30764 -61838 -43776 -31960 -41968 -39187 -49291 -44584 6821 35169 3723 -26037
17504b6037K0407P069j9408J146L480k427p691K1047R643n475J5570j5014L3497
$$ -26037 -5630 1439 -17969 -16823 -13343 -15770 -23461 -2414 7229 1754 17324 2310 35807
17491C5807l649k0089l8046Q313n673K1675N675l1428o679L8992K6893N315l2681
$$ 35807 32158 12069 -25977 -17664 -23337 -1662 4013 -27415 -34094 4898 31791 37106 4425
17478D425r073n700M94P848j8553l6962j3053K2686M7495M5004J0288J0677j8573
$$ 4425 -4648 -10348 -9854 -2006 -20559 -57521 -70574 -47888 -393 44611 54899 65576 47003
17465D7003J889q523j6903L6837M4472j4737m4581k7522Q470O369q840p48l868
$$ 47003 48892 40369 23466 60303 104775 90038 45457 17935 26405 32774 23934 23186 19318
17452A9318K6613n248M46n324j8916L5316M8648N872J5571N2820K9378n41K5091
$$ 19318 45931 40683 41129 35805 16889 52205 100853 106725 122296 175116 204494 203953 229044
17439B29044L5865k1766o7082p1057j8315j3291n1614j1015k2055Q149O384n46
$$ 229044 264909 243143 176061 105004 86689 73398 21784 10769 -11286 -3137 3247 2701
17427B701J0395m633O639j6786o422L068j9582j2490k1844O9036J6971J3325M503
$$ 2701 13096 8463 15102 -1684 -8106 -5038 -24620 -37110 -58954 10082 27053 40378 44881
17414D4881J9506j2151m7768K7963K0690K432j0585l4581J7051O119N463k9357
$$ 44881 64387 52236 4468 32431 53121 55553 44968 10387 27438 33557 39020 9663
17402I663j6844r746J4951k2189k6559L9660k034k1218J7265r05J1610J7911K2671
$$ 9663 -7181 -16927 -1976 -24165 -50724 -11064 -13098 -34316 -17051 -17956 -6346 11565 34236
17389C4236p188l4610j9336k6316L2411L9515K1134k2981q343j2991j8390K7013
$$ 34236 27048 -7562 -26898 -53214 -20803 18712 39846 16865 8522 -4469 -22859 4154
17377D154P4658L1289n3857n0219n069K3803K3214Q02R398k3618j4148j9939k1083
$$ 4154 78812 110101 56244 6025 956 24759 47973 48775 58173 34555 20407 468 -20615
17364b0615j464J8551M172M1524K1848m889p979j4380J4792N7397p503k7779n6503
$$ -20615 -22079 -3528 644 42168 64016 59127 51148 36768 51560 108957 101454 73675 17172
17351A7172j6791j9574J4307K3983j8280n658j137L474k61K071K6202L4610j0437
$$ 17172 381 -19193 -4886 19097 817 -4841 -5978 -2504 -2765 -694 25508 60118 49681
17338D9681m496p605q839q0M282k2008l0104r488J2358K3573O08l1819L079K0546
$$ 49681 45185 37580 28741 28661 32943 10935 -19169 -28657 -16299 7274 7882 -23937 -20858 -312
17324c12j0566j9051m029p207j726j855N0596L9756k0236l4500L0363O290K7773
$$ -312 -10878 -29929 -33958 -41165 -42891 -44746 5850 45606 25370 -9130 21233 27523 55296
17311E5296J9240k5203J4262J5011J5634N942j3534l3136j0856J0834R239j7333
$$ 55296 74536 49333 63595 78606 94240 100182 86648 53512 42656 53490 62729 45396
17299D5396j8423J7384J8562L148j401J1561p0r323j760m1698l5131j9680P297
$$ 45396 26973 44357 62919 66067 64666 76227 76157 66834 65074 23376 -11755 -31435 -24138
17286b4138K0131K3865O010J624k8930j7128M9964k0751m237K7347L2695j2296
$$ -24138 -4007 19858 25868 27492 -1438 -18566 31398 10647 6410 33757 66452 54156
17274E4156K221j7085n7752j7120J8969K4070L5209M971o7703k7532L8348J5344
$$ 54156 56377 39292 -18460 -35580 -16611 7459 42668 47639 -20064 -47596 -9248 6096
17262F096o015j2035L769k4702j5163N1271K3415k3931n055K2203K2917j030n7090
$$ 6096 81 -11954 -8185 -32887 -48050 3221 26636 2705 -2350 19853 42770 41740 -15350
17249a5350r963K1660l1792L1514j3963k2837j941K8242J041J0901L4815J3732
$$ -15350 -25313 -3653 -35445 -3931 -17894 -40731 -42672 -14430 -13389 -2488 32327 46059
17237D6059j6308o682k9416k7467J0815L1503N480M368k6593k656J0048l9242
$$ 46059 29751 23069 -6347 -33814 -22999 8504 13984 18352 -8241 -10897 -849 -40091
17225d0091L5127O6539l196m1150p6K957J3395j9482N264J3154J2693l7669l5044
$$ -40091 -4964 61575 58379 17229 17153 20110 33505 14023 19287 32441 45134 7465 -27579
17212b7579J0768j4662M375Q303K4182P777N760k730j1456m9531l9822J7066M0730
$$ -27579 -16811 -31473 -27098 -18795 5387 13164 18924 16194 4738 -44793 -84615 -67549 -26819
17199b6819L0007M1173J2131k2126K811n3960R506N3585l610l3154j8282R143
$$ -26819 3188 44361 56492 34366 37177 -16783 -7277 46308 42698 9544 -8738 405
17187D05N285J2320J7627M7528K8817k0142o598k4558j1517m1776j4131k574l2384
$$ 405 5690 18010 35637 83165 111982 91840 85242 60684 49167 7391 -6740 -9314 -41698
17174d1698j5460K3460k0308J4661N2799j9494k8968m310M705j621J592l6252
$$ -41698 -57158 -33698 -54006 -39345 13454 -6040 -35008 -39318 -34613 -36234 -34642 -70894
17162g0894J9189N5602N3365j2262j7831k246j9174j9205m93j5265q04j573l910
$$ -70894 -51705 3897 57262 45000 27169 24923 5749 -13456 -13949 -29214 -30018 -31591 -35501
17149c5501l8477R404L0026L316J553K3411K5651Q717P90R758k5120K3149J1234
$$ -35501 -73978 -64574 -34548 -31232 -29679 -6268 19383 28100 28890 38648 13528 36677 47911
17136D7911m9856p262k5487l4328K0344K4826K5902L8807Q506o2666j6223L767
$$ 47911 -1945 -9207 -34694 -69022 -48678 -23852 2050 40857 49363 -13303 -29526 -25759
17124b5759j9926K9275K6916J6083J0493K3988k2836l2655K7111m019l5024o3811
$$ -25759 -45685 -16410 10506 26589 37082 61070 38234 5579 32690 28671 -6353 -70164
17112g0164P636L0517K6903N5844M238m1004Q057k0752l969j9922j5258l5377
$$ -70164 -62528 -32011 -5108 50736 54974 13970 22027 1275 -2694 -22616 -37874 -73251
17100g3251J5319K1073K1598L8959K1421K166K2848j9307n319J873l1394l0266
$$ -73251 -57932 -36859 -15261 23698 45119 47285 70133 50826 45507 47380 15986 -14280
17088a4280J2232k3162O686K8632l68l8161J6362M564J1150P456R989K3474K0119
$$ -14280 -2048 -25210 -18524 10108 9740 -28421 -12059 -7495 3655 11111 21100 44574 64693
17075F4693p069l8423P37N79k8785j3698J138K0321J0596k8631m2730r613K1698
$$ 64693 57624 19201 19938 20517 -8268 -21966 -20828 -507 10089 -18542 -61272 -70885 -49187
17062d9187L0862M535l8605j2885J1702K4552K5020O088R932N916k1657N160P386
$$ -49187 -18325 -13790 -52395 -65280 -53578 -29026 -4006 2082 12014 17930 -3727 1433 8819
17049H819n837K211q022k8129n3128J4273N0582J0144R55m99j6393n617k996K8905
$$ 8819 2982 5193 -2829 -30958 -84086 -69813 -19231 -9087 -8132 -8631 -25024 -30641 -33637 -4732
17035d732l763K31J8318K9830k4605n6024n408N9976o27j9488L720k720k0494
$$ -4732 -8495 -8264 10054 39884 15279 -40745 -46153 13823 13196 -6292 -2572 -5292 -25786
17022b5786J4787J1686L0047k4655k1162M815o310J2569M057L575o771K591m552
$$ -25786 -10999 687 30734 6079 -15083 -10268 -16578 -4009 48 3623 -3148 -557 -5109
17009e109j10K4277P268k2377R425o337j6482K5079O407q879Q898J5566K102J6641
$$ -5109 -5219 19058 26326 3949 13374 7037 -9445 15634 22041 13162 22060 37626 39728 56369
16995E6369k4828j7242n7547o0282q981N3456O7773M5009j3485l8164k3443k8273
$$ 56369 31541 14299 -43248 -103530 -112511 -59055 8718 53727 40242 2078 -21365 -49638
16983d9638k641K2283N0009J1238K454j2987k1492O882L4248R176J4901o596l2740
$$ -49638 -52279 -29996 20013 31251 33705 20718 -774 6108 40356 49532 64433 57837 25097
16970B5097j9231k3962o841L1226j7515j0940J2508l2117K582M1478L5828o758
$$ 25097 5866 -18096 -24937 6289 -11226 -22166 -9658 -41775 -39193 2285 38113 31355
16958C1355j1909r110R978o393j106N871j7758m4755o813L0671M530j3708k0094
$$ 31355 19446 10336 20314 13921 12815 18686 928 -43827 -50640 -19969 -15439 -29147 -49241
16945d9241j083K2220O240K6864o507l0877k0128k6304O0633P66l098J9966o7
$$ -49241 -50324 -28104 -21864 5000 -1507 -32384 -52512 -78816 -18183 -17417 -20515 -549 -616
16932f16n2698k188K2413j592P723P593l3557j5231j5504L27j0274J7772K9432
$$ -616 -53314 -55502 -33089 -34681 -26958 -19365 -52922 -68153 -83657 -83330 -93604 -75832 -46400
16919d6400L8102K5537K9064l0559k8044o169r539k2940r818K0997J6308L3084
$$ -46400 -8298 17239 46303 15744 -12300 -18469 -28008 -50948 -60766 -39769 -23461 9623
16907I623l5786o5196M929L2629K0572p056m3387K3429O4305J4499M289M0369
$$ 9623 -26163 -91359 -86430 -53801 -33229 -40285 -83672 -60243 4062 18561 22850 63219
16895F3219p243o1247l3989k0665K2351N6721K1482n4650k0621J1009J1479K2987
$$ 63219 55976 -5271 -39260 -59925 -37574 19147 40629 -14021 -34642 -23633 -12154 10833
16883A0833K5201k8369K972P039n4467k3610L0863K2233L2158K1928j1706M0564
$$ 10833 36034 7665 10637 17676 -36791 -60401 -29538 -7305 24853 46781 35075 75639
16871G5639j2953p9086L295J0773N125M660R87j0957l686J8696J2588k4959k0689
$$ 75639 62686 -16400 -13105 -2332 2793 7453 8440 -2517 -6203 12493 25081 122 -20567
16858b0567K275q113Q51J608J2197J4799K1226J5429Q447m1964j6552K8147j6115
$$ -20567 -18292 -26405 -25554 -23946 -11749 3050 24276 39705 48152 6188 -10364 17783 1668
16845A668j6231O370P669K490J6906M8778k1778j7800l6782k1352l9319J613O856
$$ 1668 -14563 -8193 -524 1966 18872 67650 45872 28072 -8710 -30062 -69381 -67768 -60912
16832f0912L0247K1098K0302J505j368O019k2288l2562O640J9645J5495J1558
$$ -60912 -30665 -9567 10735 12240 10872 16891 -5397 -37959 -31319 -11674 3821 15379
16820A5379k0585j6712J4838N315L6260j6351j0395K3665m324k5339K900j364
$$ 15379 -5206 -21918 -7080 -1765 34495 18144 7749 31414 27090 1751 4651 3287
16808C287j3422l1564r376J1287J7547K0173M08J3337j2140J5971j5j8333j3437
$$ 3287 -10135 -41699 -51075 -39788 -22241 -2068 -1660 11677 -463 15508 15493 -2840 -16277
16795a6277r550j7471L795J8796L2410J3515j7818j9930L4371J536r657j9648
$$ -16277 -25827 -43298 -39503 -20707 11703 25218 7400 -12530 21841 23377 13720 -5928
16783e928K5903J4379Q150K735J7707j4853l9199L7407o087j8175J9337K444j2150
$$ -5928 19975 34354 42504 45239 62946 48093 8894 46301 40214 22039 41376 43820 31670
16770C1670R051J8340p725l4519o257r212l5665o204O1671J8801l1478l8414J8816
$$ 31670 40721 59061 51336 16817 10560 1348 -34317 -40521 21150 39951 8473 -29941 -11125
16757a1125J0558j5694k1698K151R393J1675o84Q90r829m918O947J05K5589r049
$$ -11125 -567 -16261 -37959 -35808 -26415 -14740 -15424 -14534 -24363 -29281 -22334 -22229 3360 -5689
16743e689j4724j1083j0260j6433L0955K0083L3358J5722l2041K9010J0863k9328
$$ -5689 -20413 -31496 -41756 -58189 -27234 -7151 26207 41929 9888 38898 49761 20433
16731B0433j5435q82K8708r440K5849m2711m3336p007m732l78N6456m5509l3084
$$ 20433 4998 4116 32824 23384 49233 6522 -36814 -43821 -48553 -48931 7525 -37984 -71068
16718g1068J4006M3584N6094M1251n3719n1198K1393Q099k000j1200q199n019
$$ -71068 -57062 -13478 42616 83867 30148 -21050 343 8442 6442 -4758 -12957 -17976
16706a7976j1052L2922L2520l69j8461m345Q170k2947o396K1641k695n6994K4318
$$ -17976 -29028 3894 36414 36045 17584 13239 21409 -1538 -7934 13707 11012 -45982 -21664
16693b1664N6379j5801j4685K8048n115N46r383k1396J911J4272m53O021K7618
$$ -21664 34715 18914 4229 32277 27162 27708 18325 -3071 -1160 13112 12659 18680 46298
16680D6298n594K09j7890L803j5588N274K581j3102k3454J1745J4026q782l70
$$ 46298 40704 40913 23023 26826 11238 16512 19093 5991 -17463 -5718 8308 -474 -844
16667h44J9426L8794j243l138l4963j8731J2512o790l245K0169m2829j5599L2119
$$ -844 18582 57376 56133 52995 18032 -699 11813 5023 1778 21947 -20882 -36481 -4362
16654d362J5568m291J9104M950j011m4907l9973k3200L4738K1633j9801M1945
$$ -4362 11206 6915 26019 30969 29958 -14949 -54922 -78122 -43384 -21751 -41552 393
16642C93m045L449J0143J128q470K5112j025n0766n740O440L9302J3382k6545
$$ 393 -3652 -203 9940 11068 2598 27710 26685 -24081 -29821 -23381 15921 29303 2758
16629B758k691Q743J2378l2979m3353m94K0726J1940j920j2292J8078k6241j6986
$$ 2758 67 8810 21188 -11791 -55144 -55638 -34912 -22972 -24892 -37184 -19106 -45347 -62333
16616f2333J3676N3107J4164Q646m066n461j7148K9141J6375n345K1898n199m9188
$$ -62333 -48657 4450 18614 27260 23194 17733 585 29726 46101 40756 62654 57455 8267
16603H267q541K9387K2381j7655J7141j988n1341l9357j4063N716L0254K1621
$$ 8267 -274 29113 51494 33839 50980 48992 -2349 -41706 -55769 -50053 -19799 1822
16591A822K20j4905K252J5368o529O072J3687J1170P879N601l9361j6432j461
$$ 1822 2042 -12863 -10611 4757 -1772 4300 17987 29157 37036 42637 3276 -13156 -14617
16578a4617m0820m1109K2723M8183L4640J8282O949j3666P853l877n848K1992
$$ -14617 -55437 -96546 -73823 -25640 9000 27282 34231 20565 28418 24541 18693 40685
16566D0685j1964j6087l3506l2344j3520L0976K4849j5657m2771N671K3197J307
$$ 40685 28721 12634 -20872 -53216 -66736 -35760 -10911 -26568 -69339 -63668 -40471 -39164
16554c9164j4298L3561k456r191L645R06r137L116L5775K6668K8054j8484r6L850
$$ -39164 -53462 -19901 -22357 -31548 -27903 -26997 -36134 -33018 2757 29425 57479 38995 38899 42749
16540D2749o238l6704K4053R222j0611K7408j0055j8005k9214r963K726J4497
$$ 42749 36511 -193 23860 33082 22471 49879 39824 21819 -7395 -17358 -14632 -135
16528a35J0588P918O253k5331j450L0967j1420k854k141k6462q447J2164K5633
$$ -135 10453 18371 24624 -707 -2157 28810 17390 14536 12395 -14067 -22514 -10350 15283
16515A5283j4350K0307Q152k9796J0078P36l997J9194j1948m5805J0282J5744
$$ 15283 933 21240 29392 -404 9674 10410 6413 25607 13659 -32146 -21864 -6120
16503f120J285o815J6559K8896k2394l359J994k061l807j850j8085j1390M5860
$$ -6120 -4835 -11650 4909 33805 11411 8052 10046 7985 4178 2328 -15757 -27147 18713
16490A8713N450k8660j1482j2779q804k7106O749M7883R462j6626J2876O7417
$$ 18713 24163 -4497 -15979 -28758 -37562 -64668 -57919 -10036 -574 -17200 -4324 63093
16478F3093K1440j8562k8317J1566j1531m4118O517J5820K682k637J6855n572
$$ 63093 84533 65971 37654 49220 37689 -6429 88 15908 18590 15953 32808 27236
16466B7236p576J5751j0793j6283k9774k0002N270K3039l077j7625j7743j9540
$$ 27236 19660 35411 24618 8335 -21439 -41441 -36171 -13132 -16209 -33834 -51577 -71117
16454g1117M3031K4053l9383k0937P861J5178j4039l2570J9422j0674J6286j0472
$$ -71117 -28086 -4033 -43416 -64353 -56492 -41314 -55353 -87923 -68501 -79175 -62889 -73361
16442g3361m75J9990J3051J5677J2085L65R243Q547k8245m5487N008L9419K0677
$$ -73361 -73836 -53846 -40795 -25118 -13033 -12668 -3425 5122 -23123 -68610 -63602 -24183 -3506
16429c506m084l335P614k9064L870K4199K4974k0666j5946N437O585J0519K4208
$$ -3506 -7590 -10925 -3311 -32375 -28505 -4306 20668 2 -15944 -10507 -3922 6597 30805
16416C0805l319j1152m945l827J1862L856N060O021q672n2978m1607L9826p240
$$ 30805 27486 16334 11389 7562 19424 23280 28340 34361 25689 -27289 -68896 -29070 -36310
16403c6310Q311M25Q42j4452j4137O887J9619K7621L2849L6186j7849k5279J7822
$$ -36310 -27999 -27574 -26732 -41184 -55321 -48434 -28815 -1194 31655 67841 49992 24713 42535
16390D2535q34l1255k4678L424K2304l1530j1088n15r657K3169j639P269l863
$$ 42535 41701 10446 -14232 -10808 11496 -20034 -31122 -31637 -41294 -18125 -19764 -12495 -16358
16377a6358M1191L2364l0415m4027N183M345J0522j5865N204J3096j9527J0m5826
$$ -16358 24833 57197 26782 -17245 -12062 -7717 2805 -13060 -7856 5240 -14287 -14277 -60103
16364f0103k3252M6213M3497L7120J6823K316q775l4200l3626m6304Q916M3512
$$ -60103 -83355 -37142 6355 43475 60298 62614 53839 19639 -13987 -60291 -51375 -7863
16352g863J1403j1645L786L9857P128K1391j5470l6357k8067J309N879k1601p795
$$ -7863 3540 -8105 -4319 35538 42666 64057 48587 12230 -15837 -14528 -8649 -30250 -38045
16339c8045J7329N1915Q125K2647L3109k1059j0550k4232j0595k0889j2011L2473
$$ -38045 -20716 31199 39324 61971 95080 74021 63471 39239 28644 7755 -4256 28217
16327B8217n426R77m1770R499R487K4268K1777l621l6468j1358M5226k4193m2575
$$ 28217 22791 23768 -18002 -8503 984 25252 47029 43408 6940 -4418 40808 16615 -25960
16314b5960J8836L5877J2819M293j9776j5301m0668k5314k1398K6903M4803R863
$$ -25960 -7124 28753 41572 45865 26089 10788 -29880 -55194 -76592 -49689 -4886 4977
16302D977l0593j2751K463l78r074L426j4589N600p675l0500M9993O484K4041
$$ 4977 -25616 -38367 -35904 -36282 -45356 -41930 -56519 -50919 -58594 -89094 -39101 -32617 -8576
16289h576N504j687j2505J5559p61M3514J595k1101j5508k4513l1518P403M886
$$ -8576 -3072 -4759 -17264 -1705 -2466 41048 42643 21542 6034 -18479 -49997 -42594 -37708
16276c7708N358K7309l0485j2544R076r040j7745N3658L9343l4302L4551J4350
$$ -37708 -32350 -5041 -35526 -48070 -38994 -48034 -65779 -12121 27222 -7080 27471 41821
16264D1821n325l8378J079O542q876K1157J1803J5099M655k5121j3777k8943k0165
$$ 41821 36496 -1882 -803 5739 -3137 18020 29823 44922 49577 24456 10679 -18264 -38429
16251c8429l494M555P955K5051O320j7570j5607k3699K549j010L263R746n967
$$ -38429 -41923 -37368 -29413 -4362 1958 -15612 -31219 -54918 -52369 -53379 -50116 -40370 -46337
16238d6337k6337k8499N9334k702j5803L1241J6508M298p407P856j7900M081j888
$$ -46337 -72674 -101173 -41839 -44541 -60344 -29103 -12595 -8297 -15704 -7848 -25748 -21667 -23555
16225b3555J0211J1552M1607m047n1874m8830k8368L4193N0478l9940J0831K3415
$$ -23555 -13344 -1792 39815 35768 -16106 -64936 -93304 -59111 -8633 -48573 -37742 -14327
16213a4327q784K3324j8506j4243q285K5197k2781K0834J1240p261N369j0480
$$ -14327 -23111 213 -18293 -32536 -40821 -15624 -38405 -17571 -6331 -13592 -8223 -18703
16201a8703m586J6608K1104k3172P704J0049l0297m0498K4303M0987K6597l7336
$$ -18703 -23289 -6681 14423 -8749 -1045 9004 -21293 -61791 -37488 3499 30096 -7240
16189g240j5530N495K0103J2321K0163J0041N088q727l6746j751M3635j990j3074
$$ -7240 -22770 -17275 2828 15149 35312 45353 50441 41714 4968 3217 46852 44862 31788
16176C1788n3400J4192K9855p79k9263O492r737p207M313l6685k9216J1806N4678
$$ 31788 -21612 -7420 22435 21656 -7607 -1115 -10852 -18059 -13746 -50431 -79647 -67841 -13163
16163a3163K8328L8963l7020l7449N752J8039r166L3711n963M995J8267k4203
$$ -13163 15165 54128 17108 -20341 -14589 3450 -5716 27995 22032 27027 45294 21091
16151B1091N005K820k7631j5591K9364j2230J2500k8821l1583m343L4624O2807
$$ 21091 26096 28916 1285 -14306 15058 2828 15328 -13493 -45076 -49419 -14795 48012
16139D8012J0904l1753K3273P358P412k5935k6516j1250k1073J4346O5138J8925
$$ 48012 58916 27163 50436 57794 65206 39271 12755 1505 -19568 -5222 59916 78841
16127G8841q0245o1818j9194P857K2949l23K7326M290J68k5877k1603K0938M4926
$$ 78841 -1404 -63222 -82416 -74559 -51610 -51933 -24607 -20317 -20149 -46026 -67629 -46691 -1765
16114a765L0017l966j5436P82k6195j7295L6180J7226j8530j5192o727J2459M008
$$ -1765 28252 24286 8850 9632 -16563 -33858 2322 19548 1018 -14174 -20901 -8442 -4434
16101d434k264J9975J4328k8325l1836j2287j6277M5059N0326n939r394l4362
$$ -4434 -6698 13277 27605 -720 -32556 -44843 -61120 -16061 34265 28326 18932 -15430
16089a5430j4278J0520k9750J4751K713j4465j4082J1007J5486R334k236K0357
$$ -15430 -29708 -19188 -48938 -34187 -31474 -45939 -60021 -49014 -33528 -24194 -26430 -6073
16077f073N281J0031j37J7916J6204k5917N749L3716J606l5185j6627K5385k0536
$$ -6073 -792 9239 9102 27018 43222 17305 23054 56770 58376 23191 6564 31949 11413
16064A1413j0690q72l980l0361J2369L6763J1315M32j7721R596r140n940k424
$$ 11413 723 -149 -4129 -34490 -22121 14642 25957 26389 8668 18264 9124 3184 760
16051G60r968m493L305M212L1744J3666j7928l2883j2002P997k1092k7680R674
$$ 760 -9208 -13701 -10396 -6184 25560 39226 21298 -11585 -23587 -15590 -36682 -64362 -54688
16038e4688L4631r681k9027l6466R674N6257M1808j5909j2315M3684J5407P789
$$ -54688 -20057 -29738 -58765 -95231 -85557 -29300 12508 -3401 -15716 27968 43375 51164
16026E1164j0055m4477M233L220P834K8046o107m8692j5405m767M523J4208L2844
$$ 51164 41109 -3368 865 4085 11919 39965 33858 -14834 -30239 -35006 -30483 -16275 16569
16013A6569J4119j481J0296j6379k6532r291M3654K40m753J4576l440r606l8248
$$ 16569 30688 29207 39503 23124 -3408 -12699 30955 31195 26442 41018 37578 27972 -10276
16000a0276j1974J0607L3296j9934k9904j3567O267k1069j8K8869J1596J9584
$$ -10276 -22250 -11643 21653 1719 -28185 -41752 -35485 -56554 -56572 -27703 -16107 3477
15988C477j0869m5118J7710L330l642j5775K0204P181j8034j4244J1677R120L7883
$$ 3477 -7392 -52510 -34800 -31470 -35112 -50887 -30683 -23502 -41536 -55780 -44103 -34983 2900
15975B900J565J1185k3289k882K950p972q799K717l671L1952N3333k3325n0701
$$ 2900 4465 15650 -7639 -10521 -7571 -15543 -24342 -21625 -25296 6656 59989 36664 -14037
15962a4037K773Q185K3647J4232M925o5110k5159L9193M4122K6367J0383L670
$$ -14037 -11264 -3079 20568 34800 39725 -25385 -50544 -11351 32771 59138 69521 73191
15950G3191L0508L1124m2383k4174J1061k1833r932J0200j1379L0642k0648p7094
$$ 73191 103699 134823 92440 68266 79327 57494 47562 57762 46383 77025 56377 -20717
15938b0717M486M2425n652k7160o91p982n906J4062J9001k0582l2464j4700P7805
$$ -20717 -16231 26194 20542 -6618 -7309 -15291 -21197 -7135 11866 -8716 -41180 -55880 21925
15925B1925L5567R767J3115n5019m3342J3K0720J6778k7056J9398Q660j6169l88
$$ 21925 57492 67259 80374 25355 -17987 -17974 2746 19524 -7532 11866 20526 4357 3969
15912C969k5682o5203J1890L6974M8831N853L9984K8308k2218k7942k269k3798
$$ 3969 -21713 -86916 -75026 -38052 10779 16632 56616 84924 62706 34764 32495 8697
15900H697j4444R718k2709j0177q159j7334M524K5394J3764K1339k6693m3893
$$ 8697 -5747 3971 -18738 -28915 -37074 -54408 -49884 -24490 -10726 10613 -16080 -59973
15888e9973j0841L801K8645o754j3579J7331O435j2462m857K1986J4696N254O459
$$ -59973 -70814 -67013 -38368 -45122 -58701 -41370 -34935 -47397 -52254 -30268 -15572 -10318 -3859
15875c859M3543k5725L760M2905k0223r466l1809Q914j0197j8286k2510K9568
$$ -3859 39684 13959 17719 60624 40401 30935 -874 8040 -2157 -20443 -42953 -13385
15863a3385K7260J3137N009o211j2796m9047J0210L4963j1493j0967j2861k0511
$$ -13385 13875 27012 32021 25810 13014 -36033 -25823 9140 -2353 -13320 -26181 -46692
15851d6692L1428J6375K8220K737l0072m205J4862L324j7203k5497j5944k0879
$$ -46692 -15264 1111 29331 32068 1996 -2209 12653 15977 -1226 -26723 -42667 -63546
15839f3546l379J0641J4708L7301L8829m0598l5992K8728M2523q388Q316K2984
$$ -63546 -66925 -56284 -41576 -4275 34554 -6044 -42036 -13308 29215 20827 29143 52127
15827E2127j0368j0302l375L3355J8493J6762j8335j6250l8380q567p944r296
$$ 52127 41759 31457 28082 61437 79930 96692 78357 62107 23727 15160 7216 -2080
15815b080n965J1465J8416L804j9778k2299j8083K206J2480J4311m081K4860L0319
$$ -2080 -8045 3420 21836 25640 5862 -16437 -34520 -32314 -19834 -5523 -9604 15256 45575
15802D5575l86J6069K0871P867k3660m0433l6457m1691l264J5305L3314L5845
$$ 45575 45189 61258 82129 89996 66336 25903 -10554 -52245 -55509 -40204 -6890 28955
15790B8955j3211J4874J807o698j7253k526J4633k2539K9953L412l1434J8356
$$ 28955 15744 30618 32425 25727 8474 5948 20581 -1958 27995 31407 -27 18329
15778A8329K2712j3517j2251j9584l289K8571L3253K5776j9882n1756j8441j7012
$$ 18329 41041 27524 15273 -4311 -7600 20971 54224 80000 60118 8362 -10079 -27091
15766b7091o129Q832J813J496l1993j9796j3701K5155N4293Q038l0707r496M5160
$$ -27091 -33220 -24388 -22575 -21079 -53072 -72868 -86569 -61414 -7121 917 -29790 -39286 5874
15753E874K9824k6499n854L2658k8332m8753J4116l369K8862J2759m8861k8118
$$ 5874 35698 9199 3345 36003 7671 -41082 -26966 -30335 -1473 11286 -37575 -65693
15741f5693j6592j2810L7216K1293J8377K4198M2331l6844j8535K9732j2392l2960
$$ -65693 -82285 -95095 -57879 -36586 -18209 5989 48320 11476 -7059 22673 10281 -22679
15729b2679Q794j5369P724K2883k072J1421k1457l7353L0449J8397Q153m725K8987
$$ -22679 -13885 -29254 -21530 1353 -719 10702 -10755 -48108 -17659 738 8891 4166 33153
15716C3153l866m4576k0808Q978Q931k0949k0758K9294M5759L5566k8827j6788
$$ 33153 29287 -15289 -36097 -27119 -18188 -39137 -59895 -30601 15158 50724 21897 5109
15704E109k877L5327j2989j8671J9901K7119K6589R124q605m755l6432J5760k8055
$$ 5109 2232 37559 24570 5899 25800 52919 79508 88632 80027 75272 38840 54600 26545
15691B6545j6188P869J6460J9446Q553K9857J1449J08j4139o403k7626l8010o795
$$ 26545 10357 18226 34686 54132 62685 92542 103991 104099 89960 83557 55931 17921 11126
15678A1126K8518L3214r830l9780l8154Q180J6201J7457N876J5417p677k4935
$$ 11126 39644 72858 63028 23248 -14906 -6726 9475 26932 32808 48225 40548 15613
15666A5613L1141K5665l4713l0226l5747m174K2027L964P873j6695j1195O682
$$ 15613 46754 72419 37706 7480 -28267 -32441 -10414 -6450 1423 -15272 -26467 -19785
15654a9785K7874L3380K7001o261l9317M56J0703k5908p971K208k0013r973J7441
$$ -19785 8089 41469 68470 62209 22892 23348 34051 8143 172 2380 -17633 -27606 -10165
15641a0165j0331p163L3297j960l4691L730k09J6457J8860M6014j5494m7240K1694
$$ -10165 -20496 -27659 5638 3678 -31013 -27283 -27492 -11035 7825 53839 38345 -8895 12799
15628A2799J1015j2847J5373K0596k7637k6670J3795L3821k137k1271k2482O488
$$ 12799 23814 10967 26340 46936 19299 -7371 6424 40245 38108 16837 -5645 843
15616H43r886K4782K3515J1144j8411m9599KQ327L601J5945O0885K6846o0390
$$ 843 -9043 15739 39254 50398 31987 -17612 -17610 -9283 -5682 10263 71148 97994 37604
15603C7604k3637J2857J84O059k3850p289J1916q63J3418R033k0205r650K269
$$ 37604 13967 26824 27008 33067 9217 1928 13844 12981 26399 35432 15227 5577 7846
15590G846j2151j9223m24K2905O1838r140k7976l968j4473m227k2393Q504N595
$$ 7846 -4305 -23528 -23952 -1047 60791 51651 23675 19707 5234 1007 -21386 -12882 -7287
15577g287K7240j51j458K2504O870J8118k1991j5084m575j2621j7527K2253J1735
$$ -7287 19953 19802 18344 40848 47718 65836 43845 28761 24186 11565 -5962 16291 28026
15564B8026j1822k851O306j2804p360j469l6944k1307L5663M1571r956r90M3295
$$ 28026 16204 13353 19659 6855 -505 -1974 -38918 -60225 -24562 17009 7053 6063 49358
15551D9358k0318k3368K090q036l0908J9983l390o279j5352J7968L4535L5944
$$ 49358 29040 5672 7762 -274 -31182 -11199 -14589 -20868 -36220 -18252 16283 52227
15539E2227l8711R667J7411J5139m6700o7000l001L6803P555j259K2338J0520
$$ 52227 13516 23183 40594 55733 9033 -57967 -60968 -24165 -16610 -17869 4469 14989
15527A4989k8937R469j4000j1136R175J3548n100p19L7810M622o616J9696l7885
$$ 14989 -13948 -4479 -18479 -29615 -20440 -6892 -11992 -12711 25099 29721 23105 42801 4916
15514D916R210M303j982j6536J8427P010K3645j0628q420k4199Q782J1127k6755
$$ 4916 14126 18429 16447 -89 18338 25348 48993 38365 29945 5746 14528 25655 -1100
15501a100q3289L1700J1744m464N3789J923l468j140l2972l7766j3512L1710m774
$$ -1100 -84389 -52689 -40945 -45409 8380 10303 6835 5695 -27277 -65043 -78555 -46845 -51619
15488e1619M1915N864l4788j9292J4963K3289R876j09j3588O055Q530L234K9187
$$ -51619 -9704 -3840 -38628 -57920 -42957 -19668 -9792 -9901 -23489 -17434 -8904 -5670 23517
15475B3517K9235k3070l7276J3973K4311J6974k8351p456j5655J2140m734K0835
$$ 23517 52752 29682 -7594 6379 30690 47664 19313 11857 -3798 8342 3608 24443
15463B4443n300j9142q92k1987j0484j478p816N3204K9257j6232o38P561k7151
$$ 24443 19143 1 -891 -22878 -33362 -34840 -42656 10548 39805 23573 22935 30496 3345
15450C345k7209j4839M761R831J5010Q229j9170l8824j2491L2356L5260L6422
$$ 3345 -23864 -38703 -33942 -24111 -9101 -872 -20042 -58866 -71357 -39001 -3741 32681
15438C2681J0329R859k028j36K5232J4340o296k8229l4733k4717J1609K3346j5868
$$ 32681 43010 52869 50841 50705 75937 90277 83981 55752 21019 -3698 7911 31257 15389
15425A5389m4173j6688J037M7180K4578j0841l1978j6462K7630J6375k8201N060
$$ 15389 -28784 -45472 -44435 2745 27323 16482 -15496 -31958 -4328 12047 -16154 -11094
15413a1094L9991J0963k2670r196j0361r498j2882p190J4515M8054J4145J8786
$$ -11094 28897 39860 17190 7994 -2367 -11865 -24747 -31937 -17422 30632 44777 63563
15401F3563m5783j4556J7263n529K3991r862k1617o86k6280l601K3242L223p531
$$ 63563 17780 3224 20487 14958 38949 29087 7470 6784 -19496 -23097 145 3368 -4163
15388d163k4910o971J4553K9313J6466K067J813k3676k7554k4884R043Q604M77
$$ -4163 -29073 -36044 -21491 7822 24288 26355 28168 4492 -23062 -47946 -38903 -30299 -29822
15375b9822p792j8926K0673K4572L9874r292j6209j273L0349J6579m0573l8095
$$ -29822 -37614 -56540 -35867 -11295 28579 19287 3078 1805 32154 48733 8160 -29935
15363b9935L5221L2046j6987k192Q662K4990j962J8049j6375k2129k0489p185
$$ -29935 5286 37332 20345 18153 26815 51805 49843 67892 51517 29388 8899 1714
15351A714L937O998j3834k116J2190r144k6026m233K1090j2535K6103J5390j9825
$$ 1714 5651 12649 -1185 -3301 8889 -255 -26281 -30514 -9424 -21959 4144 19534 -291
15338b91j1442l1304J9782L4053N366r371N17J0193k3196m238L4243l0040j2542
$$ -291 -11733 -43037 -23255 10798 16164 6793 7310 17503 -5693 -9931 24312 -5728 -18270
15325a8270O784k173J5602P940m829J3139J3711q134O632l2610j1300J3403p687
$$ -18270 -11486 -13659 1943 9883 5054 18193 31904 23770 30402 -2208 -13508 -105 -7792
15312g792k1376L33J4840q23L1473j4526N949J2899m963l1403K2935K5476p138
$$ -7792 -29168 -28835 -13995 -14818 16655 2129 8078 20977 16014 -15389 7546 33022 25884
15299B5884j349K331j8572k0231k2473r014J4630M829L5428K2295R036Q477n15
$$ 25884 24535 26866 8294 -11937 -34410 -43424 -28794 -23965 11463 33758 42794 51271 50756
15286E0756K2843J5956j8150o817R282j5421R208Q669j0602m510k1178j8295m2574
$$ 50756 73599 89555 71405 64588 73870 58449 67657 76326 65724 61214 40036 21741 -20833
15273b0833m9031K3106M2385Q884m638J1634J6598J8479L257l0515Q894m032O305
$$ -20833 -69864 -46758 -4373 4511 -127 11507 28105 46584 49841 19326 28220 24188 30493
15260C0493k3560M2967L7229l878k9342l6217m5527j2498L5605l77k4364J8475
$$ 30493 6933 49900 87129 83251 53909 17692 -27835 -40333 -4728 -5105 -29469 -10994
15248a0994o48R59l2116L211P243K793O676K0840K7343K1662J0508j652o3201
$$ -10994 -11642 -10683 -42799 -39588 -32345 -29552 -22876 -2036 25307 46969 57477 55825 -7376
15235g376o7456L50N5837K8655j9856l394q08J4467m44j619J8851J116R881J22
$$ -7376 -74832 -74482 -18645 10010 -9846 -13240 -14048 419 -25 -1644 17207 18323 28204 28326
15221B8326R26K2760j207J545K576Q271N240j7761k1190k6499k6041n213L86p42
$$ 28326 29252 52012 50805 52350 54926 63197 68437 50676 29486 2987 -23054 -28267 -27881 -28623
15207b8623O272J7770J9052N815L7197l7988l5767o572J269J8098j0962J2400
$$ -28623 -22351 -4581 14471 20286 57483 19495 -16272 -22844 -21575 -3477 -14439 -2039
15195b039J3940P483j6925j2568m3123j8369M7250K5768p119k6264l785J940p726
$$ -2039 11901 19384 2459 -10109 -53232 -71601 -24351 1417 -5702 -31966 -35751 -33811 -41537
15182d1537j5060K9079J2328K6360N532k4789j9845n9K0535L3284j314k8576p977
$$ -41537 -56597 -27518 -15190 11170 16702 -8087 -27932 -27991 -7456 25828 24514 -4062 -12039
15169a2039k566j2281k6483L9917N6557o326n2207j3038j9055J4061q979j0614
$$ -12039 -14605 -26886 -53369 -13452 43105 36779 -15428 -28466 -47521 -33460 -42439 -53053
15157e3053L5577M7193j174q434j9266o48J5751l4299j2166K4295L4419j0930
$$ -53053 -17476 29717 28543 20109 843 195 15946 -18353 -30519 -6224 28195 17265
15145A7265j8927p298m1773r474M6753M9429N957j0733k9235k2127K3532j0269
$$ 17265 -1662 -8960 -50733 -60207 -13454 35975 41932 31199 1964 -20163 3369 -6900
15133f900n233k0276K0034k3072R390J3470J1904k1594K26P960J4410k7064j4040
$$ -6900 -12133 -32409 -12375 -35447 -26057 -12587 -683 -22277 -22051 -14091 319 -26745 -40785
15120d0785L3325R426l3428j8391j061k1068p553L7411L4785L8534k6385j8749
$$ -40785 -7460 1966 -31462 -49853 -50914 -71982 -79535 -42124 -7339 31195 4810 -13939
15108a3939k0745J3296k6843j0423K0250K7497n22l7743L6182L6260Q943p7934
$$ -13939 -34684 -21388 -48231 -58654 -38404 -10907 -11429 -49172 -12990 23270 32213 -45721
15096d5721n1291n881N0301L9179K3841k4422p312L527p319L7534J0082j65l6590
$$ -45721 -97012 -102893 -52592 -13413 10428 -13994 -21306 -17779 -25098 12436 22518 22353 -14237
15083a4237j3862K03m124j886K1429j583L1856L0234n839k5491j8021j3388n149
$$ -14237 -28099 -27896 -32020 -33906 -12477 -14060 17796 48030 42191 16700 -1321 -14709 -19858
15070a9858P889o758k447K8820J6581j9k5040j8216J7101P712j8521Q649J0111
$$ -19858 -11969 -18727 -21174 7646 24227 24208 -832 -19048 -1947 5765 -12756 -4107 6004
15057F004L5686r369l7310k4117q240P551M3705L7891l19j7195l0891R930o331
$$ 6004 41690 32321 -4989 -29106 -37346 -29795 13910 51801 51482 34287 3396 13326 6995
15044F995J0082k8034j9143J6787J5486K2507K681k0886j6129Q750J1100J1261
$$ 6995 17077 -10957 -30100 -13313 2173 24680 27361 6475 -9654 -904 10196 21457
15032B1457J2187K1969k3991l9837j6550J2971o712j6896J4625M6036l386k6106
$$ 21457 33644 55613 31622 -8215 -24765 -11794 -18506 -35402 -20777 25259 21873 -4233
15020d233J7047O143j1371J6518J5991n0242m408J276J6131L0085J2677j2582
$$ -4233 12814 18957 7586 24104 40095 -10147 -14555 -13279 2852 32937 45614 33032
15008C3032N311l4366j8908J8192L2934k4525n780j3309p503j4977j4700J4651
$$ 33032 38343 3977 -14931 3261 36195 11670 5890 -7419 -14922 -29899 -44599 -29948
14996b9948K1579R897j9692K4083L3921K580k0209K605Q6871J24894J63350J61977
$$ -29948 -8369 1528 -18164 5919 39840 42420 22211 24816 111687 236581 399931 561908
14984E61908P1035L9555N3499Q0508Q7820p5623k40460k04001j22146n2220k7955
$$ 561908 632943 672498 725997 806505 894325 818702 578242 374241 252095 199875 171920
14973A71920l3681M570K7361j9473k5304l4299R346n1425k9507J2884J8173q173
$$ 171920 138239 142809 170170 150697 125393 91094 100440 49015 19508 32392 50565 42392
14961D2392p092k9789m6635J5196J6654Q346K9974R564j1126J0157j2282m438
$$ 42392 35300 5511 -41124 -25928 -9274 -928 29046 38610 27484 37641 25359 20921
14949B0921R361k7918J9413j2376p386M5171J9740q32j692k6519n4096k0862K1825
$$ 20921 30282 2364 21777 9401 2015 47186 66926 66094 64402 37883 -16213 -37075 -15250
14936a5250K8646q006j8420k851L2398K1754k95l1814k9312q083j534K2554O053
$$ -15250 13396 5390 -13030 -15881 16517 38271 37976 6162 -23150 -31233 -32767 -10213 -4160
14923d160J4497j1571L339k970k4400l8647j3069L9685K9880M390j6431K1317
$$ -4160 10337 -1234 2105 -865 -25265 -63912 -76981 -37296 -7416 -3026 -19457 1860
14911A860O870k992o960m321j723j5006K7920Q457J8672P349K67N96k1235j8379
$$ 1860 8730 5738 -1222 -5543 -7266 -22272 5648 14105 32777 40126 40393 40989 19754 1375
14897A375p032o537P170K5136J4527J6279K4772L2065m9917l3383r175J1786j6732
$$ 1375 -5657 -12194 -5024 20112 34639 50918 75690 107755 57838 24455 15280 27066 10334
14884A0334k3416m6013o163J4731R505r803J7933P9789M0402j6034o865j0546
$$ 10334 -13082 -59095 -65258 -50527 -41022 -50825 -32892 46897 87299 71265 64400 53854
14872E3854n3203J5646K2688q073k9808R218M2962J9305l6019n5539l7409N582
$$ 53854 651 16297 38985 30912 1104 10322 53284 72589 36570 -18969 -56378 -50796
14860e0796J28k0698J9619k1426L2476N2531r050O189j0727k3827M648n529L815
$$ -50796 -50668 -71366 -51747 -73173 -40697 11834 2784 8973 -1754 -25581 -20933 -26462 -22647
14847b2647m176m305J5306Q228J6487J7764J1482l6557m2999M4438J9071m111
$$ -22647 -26823 -31128 -15822 -7594 8893 26657 38139 1582 -41417 3021 22092 17981
14835A7981K8485j2690j7363K8127n34j8469k2550l0426j2334J6853J1028L605
$$ 17981 46466 33776 16413 44540 44006 25537 2987 -27439 -39773 -22920 -11892 -8287
14823h287k779m803J7233Q657J508O494J9542j1332k5875k4419n257P932L9507
$$ -8287 -11066 -15869 1364 10021 11529 18023 37565 26233 358 -24061 -29318 -21386 18121
14810A8121K8830J323l6089J782K9573k879j4177J1933K899R409j7967P860J8630
$$ 18121 46951 48274 12185 13967 43540 40661 26484 38417 41316 50725 32758 40618 59248
14797E9248j3923j5467J9855k631k2083k6641m8124P229J9054K1593L657L344
$$ 59248 45325 29858 49713 47082 24999 -1642 -49766 -42537 -23483 -1890 1767 5111
14785E111n0656O475J8855K3882M4183J6909r20J3742Q786n140m4212k7205R782
$$ 5111 -45545 -39070 -20215 3667 47850 64759 63839 77581 86367 81227 37015 9810 19592
14772A9592k052p710K015j0810l879K5505J3481q430j7176k7944L775o376J7675
$$ 19592 17540 9830 11845 1035 -2844 22661 36142 27712 10536 -17408 -13633 -20009 -2334
14759b334r809J101P864N407J522j3471j9582l0489R528L4122J6389K2325k1285
$$ -2334 -12143 -11042 -3178 2229 3751 -9720 -29302 -59791 -50263 -16141 248 22573 1288
14746A288J4297K7496j2857k9909r11L3369K911K3054K9027p804m3707k6975k7253
$$ 1288 15585 43081 30224 315 -596 32773 35684 58738 87765 79961 36254 9279 -17974
14733a7974L063P5757k40J9471j7944k9906k1054J9532K1802k7960k8089j964
$$ -17974 -14911 60846 60606 80077 62133 32227 11173 30705 52507 24547 -3542 -5506
14721e506K2077J8284L2457l1718m7631n050L1j2496K6727J6194L4551K3529k03
$$ -5506 16571 34855 67312 35594 -12037 -17087 -17056 -29552 -2825 13369 47920 71449 71246
14708G1246j2769J6212l4250O365n721L728O57j6780n399m30k1501k7384J1038
$$ 71246 58477 74689 40439 46804 41083 44811 45468 28688 23289 22859 1358 -26026 -14988
14695a4988J5793N478l289l651J7270o439k046n842r267M5272N977k8098J3069
$$ -14988 805 6283 2994 -657 16613 10174 8128 2286 -6981 38291 44268 16170 29239
14682B9239L039J7264j4375k7874O073j0690J5358k2124k0724l774j9707l0299
$$ 29239 32278 49542 35167 7293 13366 2676 18034 -4090 -24814 -28588 -48295 -78594
14670g8594O787K9135K9314K2416J3702l347n300m1048r987L9250M6570l2141
$$ -78594 -71807 -42672 -13358 9058 22760 19413 14113 -26935 -36922 2328 48898 16757
14658A6757k4595N230N030O433n744R253L869m686k1580J2004Q368l6160l3434
$$ 16757 -7838 -2608 2422 8855 3111 12364 16233 11547 -10033 1971 10339 -25821 -59255
14645e9255N1211K3582j2717k0075k1574K4318L392L52K0113j252j5762K8835
$$ -59255 -8044 15538 2821 -17254 -38828 -14510 -11118 -10766 9347 8095 -7667 21168
14633B1168j9925m442j7507J3565O133k9104l6663L1686Q372J0226J0859J128
$$ 21168 1243 -3199 -20706 -7141 -1008 -30112 -66775 -35089 -26717 -16491 -5632 -4504
14621d504R678R019J2911k2727R275L775r673K8462N6875j1029k4560j7282m9939
$$ -4504 5174 14193 27104 4377 13652 17427 7754 36216 93091 82062 57502 40220 -9719
14608i719k5069j0602J5320k364J5340L8668r922K7439q052l1171k3656N149J2894
$$ -9719 -34788 -45390 -30070 -32434 -17094 21574 11652 39091 31039 -132 -23788 -18639 -5745
14595e745J7482k4879k7187K5066K1862J4524k2585l9971l421K1137Q500q996
$$ -5745 11737 -13142 -40329 -15263 6599 21123 -1462 -41433 -44854 -23717 -15217 -24213
14583b4213J4077p899j6252R053m499j2844k1443J2694N2960J0035K0863j6557
$$ -24213 -10136 -18035 -34287 -25234 -29733 -42577 -64020 -51326 1634 11669 32532 15975
14571A5975k9858m2145q092j481j8386J8910M907p120K7356j7643R720j885R09
$$ 15975 -13883 -56028 -64120 -65601 -83987 -65077 -60170 -67290 -39934 -57577 -47857 -49742 -48833
14558d8833K0862J1833p729Q07O110J2926P948K4784j4280m0976k06K6630k0505
$$ -48833 -27971 -16138 -23867 -23060 -16950 -4024 3924 28708 14428 -26548 -26754 -124 -20629
14545b0629k3214k0122j1170L5370K9169R288M684l03p129n047n479k5181R236
$$ -20629 -43843 -63965 -75135 -39765 -10596 -1308 3376 3073 -4056 -9103 -14582 -39763 -30527
14532c0527L1500K2548k2282m905o228J6860M2065L7563K0730l4359l2987m1414
$$ -30527 973 23521 1239 -3666 -9894 6966 49031 86594 107324 72965 39978 -1436
14520a436l204p416k6854j2960L3832R851j7618K2378K8922l931k2110n4076l339
$$ -1436 -4640 -12056 -38910 -51870 -18038 -8187 -25805 -3427 25495 21564 -546 -54622 -57961
14507e7961J7646L0274j7134k0887L9086J8478J6331j0701K4967J4138p026N259
$$ -57961 -40315 -10041 -27175 -48062 -8976 9502 25833 15132 40099 54237 47211 52470
14495E2470l0477l3659K0489o821m326L0677r788m3153j1814J9870K6349M4199
$$ 52470 21993 -11666 8823 2002 -2324 28353 18565 -24588 -36402 -16532 9817 54016
14483E4016l3886k1745L3928k2723j3853r642l1318k7452K6690J1502J5903L6716
$$ 54016 20130 -1615 32313 9590 -4263 -13905 -45223 -72675 -45985 -34483 -18580 18136
14471A8136L8603k9759k1351l2784j9943L3721K1533q477J3950M228k6577r763
$$ 18136 56739 26980 5629 -27155 -47098 -13377 8156 -321 13629 17857 -8720 -18483
14459a8483P768J4114K1482K0377j9300J0939J2228m2196l7806J072k5488p773
$$ -18483 -10715 3399 24881 45258 25958 36897 49125 6929 -30877 -29805 -55293 -63066
14447f3066K0971k949o0561K1446L6674L8370j3947k6176r095N0216L0995j7914
$$ -63066 -42095 -45044 -105605 -84159 -47485 -9115 -23062 -49238 -58333 -8117 22878 4964
14435D964Q239J5364k2834m8679j304L6938M7346j128k1225m17J9186L2180J1424
$$ 4964 13203 28567 5733 -42946 -44250 -7312 40034 38906 17681 17264 36450 68630 80054
14422H0054j6997n007k3698k041L1170k585j7466k2578L4329j5411o349J1541
$$ 80054 63057 58050 34352 32311 63481 60896 43430 20852 55181 39770 33421 44962
14410D4962Q039K1778j9068l3063Q75K2445p361J820l837n3640j8058K8294J1072
$$ 44962 53001 74779 55711 22648 23523 45968 38607 40427 36590 -17050 -35108 -6814 4258
14397D258j1509p623J0568j9339r948L8702n480K0296L4807J5929l1763k6354
$$ 4258 -7251 -14874 -4306 -23645 -33593 5109 -371 19925 54732 70661 38898 12544
14385A2544l4676Q610J4265j7183k6508K8782M4896N105j8608K2080j3814n1365
$$ 12544 -22132 -13522 743 -16440 -42948 -14166 30730 35835 17227 39307 25493 -25872
14373b5872K8783L5475l549J1806P927n61j4252j9353K495p766k48L1193Q283
$$ -25872 2911 38386 34837 46643 54570 54009 39757 20404 22899 15133 14885 46078 54361
14360E4361k4673k7148n720j4171m4316j7049j24R893L9038M8227l3320J946L3436
$$ 54361 29688 2540 -3180 -17351 -61667 -78716 -78840 -68947 -29909 18318 -15002 -13056 20380
14347B0380p848k0127L3385J1123q534O837k165n384l1513J6236k0066r74j9258
$$ 20380 12532 -7595 25790 36913 28379 35216 33051 27667 -3846 12390 -7676 -8650 -27908
14334b7908j5466k967O4377K8773j3285l7233J9901J0375n250o284m74k9761k2845
$$ -27908 -43374 -46341 18036 46809 33524 -3709 16192 26567 21317 15033 14559 -15202 -38047
14321c8047J5604K494l9440k4894K9066L6255P747l7727q894M4316L0487k858
$$ -38047 -22443 -19949 -59389 -84283 -55217 -18962 -11215 -48942 -57836 -13520 16967 14109
14309A4109k4334k5917M7500L714k0465K447J2292l2334l0899j3905K4965j4693
$$ 14109 -10225 -36142 11358 15072 -5393 -2946 9346 -22988 -53887 -67792 -42827 -57520
14297e7520o920J5896P888l4550j9321L4960N3055J0223k144K0436K4470j4954
$$ -57520 -64440 -48544 -40656 -75206 -94527 -59567 -6512 3711 1567 22003 46473 31519
14285C1519J880L6601J2222l0700m7295O394l7813J5728k310K9780J0237J041
$$ 31519 33399 70000 82222 51522 4227 10621 -27192 -11464 -13774 16006 26243 27284
14273B7284J681k2117k2217L2508K6113J2845j95K031k6138k7926K1078K0624
$$ 27284 28965 6848 -15369 17139 43252 56097 55902 57933 31795 3869 24947 45571
14261D5571J7856j0810m6816j7535j5647K7751q285k2423j017p07K4803P983j0960
$$ 45571 63427 52617 5801 -11734 -27381 370 -7915 -30338 -31355 -32062 -7259 724 -10236
14248a0236l2748J2205M7l1179O3070J3188m063J0058K493L6792J7537k2276M526
$$ -10236 -42984 -30779 -30732 -61911 1159 14347 10284 20342 22835 59627 77164 54888 59414
14235E9414n1539m8227k0179N680j3804J5615Q004J1064L0339J0019l7281J541
$$ 59414 7875 -40352 -60531 -54851 -68655 -53040 -45036 -33972 -3633 6386 -30895 -29354
14223b9354J8749m5024P933L1666J6637J1691j1030M785K3172J2826n212j9481
$$ -29354 -10605 -55629 -47696 -16030 607 12298 1268 6053 29225 42051 36839 17358
14211A7358J4434j4776p288O260K7405l3410j8012J4271O455R24q96o371j2619
$$ 17358 31792 17016 9728 15988 43393 9983 -8029 6242 12697 13621 12725 6354 -6265
14198f265k188K6960M0453j4730O037J0062L623k8448p703o068j6466l0267K3174
$$ -6265 -8453 18507 58960 44230 50267 60329 63952 35504 27801 21733 5267 -25000 -1826
14185a826J8255l788l2772K2240K2033k294k3537O313m0019k2072Q885j9787Q347
$$ -1826 16429 12641 -20131 2109 24142 21848 -1689 4624 -35395 -57467 -48582 -68369 -60022
14172f0022L7262J2755K4134l80j2834J1653M83K3355J370k9035l0250k8752J7501
$$ -60022 -22760 -10005 14129 13749 915 12568 13051 36406 37776 8741 -21509 -50261 -32760
14159c2760K4808k0453o174P474L4948K4512Q357j282m0427j8421l3263J0333
$$ -32760 -7952 -28405 -34579 -27105 7843 32355 40712 39430 -997 -19418 -52681 -42348
14147d2348J5656j2206J4457M6780J2971l9440n1021r02k3223R44L0242J3712
$$ -42348 -26692 -38898 -24441 22339 35310 -4130 -55151 -56053 -79276 -78332 -48090 -34378
14135c4378K0317k1863j1781k5145m320J3375j5664M8637M5192J3146o050l6525
$$ -34378 -14061 -35924 -47705 -72850 -77170 -63795 -79459 -30822 14370 27516 21466 -15059
14123a5059J3889Q086J1001k2482N345J2884J6439j0541n1606K9218J5682J5623
$$ -15059 -1170 6916 17917 -4565 780 13664 30103 19562 -32044 -2826 12856 28479
14111B8479K7456q07n5686l9289J5865j3116J5194K9171j4718p385J5595J3745
$$ 28479 55935 55128 -558 -39847 -23982 -37098 -21904 7267 -7451 -14836 759 14504
14099A4504j4804k0452J701l585j9713n0638L9233K3982k207K9364j8278O048
$$ 14504 -300 -20752 -19051 -22636 -42349 -92987 -53754 -29772 -31979 -2615 -20893 -14845
14087a4845M500O601k3750L3010L1977j038j9748m5416p4796j3942L8875J5340
$$ -14845 -10345 -3744 -27494 5516 37493 36455 16707 -28709 -103505 -117447 -78572 -63232
14075f3232N249O3471L6845J4983O324j4928l2434K2710L4780l4526o9073j4299
$$ -63232 -57983 5488 42333 57316 63640 48712 16278 38988 73768 39242 -29831 -44130
14063d4130L2835l2360k5881K2564J0066j3779k6220j2590M7097L3651j0601k4187
$$ -44130 -11295 -43655 -69536 -46972 -36906 -50685 -76905 -89495 -42398 -8747 -19348 -43535
14051d3535p164J5513r352k5178M6352J9665j7925M310j1594j8089k1050p444
$$ -43535 -50699 -35186 -44538 -69716 -23364 -3699 -21624 -17314 -28908 -46997 -68047 -75491
14039g5491J2798R926L2471L6536k4312j3041J6869R506l0004K0242l2849l4989
$$ -75491 -62693 -52767 -20296 16240 -8072 -21113 -4244 5262 -24742 -4500 -37349 -72338
14027g2338n598L6681L4335J1174J2689J5943k0637j2387J1053M1759M4193o223
$$ -72338 -77936 -41255 -6920 4254 16943 32886 12249 -138 10915 52674 96867 90644
14015I0644m7904j6465j1032m0984k8668j5959j2461K7022K3762k9572k7907q605
$$ 90644 42740 26275 15243 -25741 -54409 -70368 -82829 -55807 -32045 -61617 -89524 -98129
14003i8129P9094M2983J9506Q004k1585l7241J0712K069K325O535M579R611j0082
$$ -98129 -19035 23948 43454 51458 29873 -7368 3344 5413 7738 14273 18852 28463 18381
13990A8381J2119k60l2779q181p542M860M200R980N498J6870K3626l532L4106
$$ 18381 30500 30240 -2539 -10720 -18262 -13402 -9202 778 6276 23146 46772 43240 77346
13977G7346M459k5586j8218m0477o7266l643M1547J4216M762J7711q629n416O187
$$ 77346 81805 56219 38001 -2476 -69742 -73385 -31838 -17622 -12860 4851 -3778 -9194 -3007
13964c007n5158L7J1436R085M3388n426J5061P328M058k8973P172l6135k4969
$$ -3007 -58165 -58128 -46692 -37607 5781 355 15416 22744 26802 -2171 5001 -31134 -56103
13951e6103K383n514K5831O53l1665q289K6037J5427p09k6626K4925M6650L9002
$$ -56103 -53720 -59234 -33403 -32750 -64415 -72704 -46667 -31240 -31949 -58575 -33650 13000 52002
13938E2002j7888j3075j9284l241l6770j1194J5353m622K7848K1219o026j2538
$$ 52002 34114 21039 1755 -1486 -38256 -49450 -34097 -38719 -10871 10348 4322 -8216
13926h216M3909j509n7055l7125j2992K2776J3887K9932J7601L5134Q943M2829
$$ -8216 35693 34184 -22871 -59996 -72988 -50212 -36325 -6393 11208 46342 55285 98114
13914I8114K5603m4931M371k6311k2189l081J0685r319m0746j4511J2674k2078
$$ 98114 123717 78786 83157 56846 34657 31576 42261 32942 -7804 -22315 -9641 -31719
13902c1719j3980J0769O078J1781j6665O652j1258k8724N1897M2134J5372M4069
$$ -31719 -45699 -34930 -28852 -17071 -33736 -27084 -38342 -67066 -15169 26965 42337 86406
13890H6406L2904p0452n1534P378O083J6006J8859r27o3659j2322L0890J25n024
$$ 86406 119310 48858 -2676 4702 10785 26791 45650 44723 -18936 -31258 -368 -243 -5267
13877e267q400n582m043K4764j030j5469J165K503j1206J0043Q471q378j1101
$$ -5267 -13667 -19249 -23292 1472 442 -15027 -13862 -11359 -22565 -12522 -4051 -12429 -23530
13864b3530l8640j1339M838M1748J3651Lk1370K393j4198j7898j6q725K3514k6650
$$ -23530 -62170 -73509 -68671 -26923 -13272 -13269 -34639 -32246 -46444 -64342 -64358 -73083 -49569 -76219
13850g6219L614J0649j806L5915O62nN819m1493l2409O791L753j3120p295J2947
$$ -76219 -72605 -61956 -63762 -27847 -27185 -27190 -21371 -62864 -95273 -88482 -84729 -97849 -105144 -92197
13836i2197j6297K9610j755M2359J3090j7293q409K3483M946J4896l6500p408
$$ -92197 -108494 -78884 -80639 -38280 -25190 -42483 -50892 -27409 -22463 -7567 -44067 -51475
13824e1475L8919j7005j4507k1041j8162K9286J54L755J4451K5438n466Q9K0397
$$ -51475 -12556 -29561 -44068 -65109 -83271 -53985 -53831 -50076 -35625 -10187 -15653 -15564 4833
13811D833j6860l5222k1181K053J3339Q061K3370K2266K1947j4164j3312R837
$$ 4833 -12027 -47249 -68430 -66377 -53038 -44977 -21607 659 22606 8442 -4870 4967
13799D967k4160L1274R500O988Q226k2156L784n116K0222R228k3033j3243k014
$$ 4967 -19193 12081 21581 28569 36795 14639 18423 13307 33529 42757 19724 6481 4467
13786D467N620J3766k0711k655N055Q375K6j7308o684j045P36K4954k9278n6117
$$ 4467 10087 23853 3142 487 5542 13917 13943 -3365 -10049 -11094 -10358 14596 -14682 -70799
13772g0799k1003K5358J8104K2463q304J5306j1048p851K4416K7538J4964K9165
$$ -70799 -91802 -66444 -48340 -25877 -34181 -18875 -29923 -37774 -13358 14180 29144 58309
13760E8309j9512j3632k148J716k6446m9278l0475J2432Q92K4083M1899j7862
$$ 58309 38797 25165 23017 24733 -1713 -50991 -81466 -69034 -68142 -44059 -2160 -20022
13748b0022m281J3862R077j6217k1143N092M852j8137J2616N395k2008m2919j2521
$$ -20022 -24303 -10441 -1364 -17581 -38724 -33632 -28780 -46917 -34301 -28906 -50914 -93833 -106354
13735a06354J8254j8738J2049M5201K5091L1120j4335q270K9442K3310l2533k7458
$$ -106354 -88100 -106838 -94789 -49588 -24497 6623 -7712 -15982 13460 36770 4237 -23221
13723b3221N609j7170m42K2185O245j9851l5927j0348P139J3005K9627j5977m088
$$ -23221 -17612 -34782 -35224 -13039 -6794 -26645 -62572 -72920 -65781 -52776 -23149 -39126 -43214
13710d3214J9149m772j1554j8263k0465Q65K7782L1414J0475k1931p789k173j972
$$ -43214 -24065 -28837 -40391 -58654 -79119 -78254 -50472 -19058 -8583 -30514 -38303 -40476 -42448
13697d2448p676o185p430L5856K7434l462k2325o558L0469j1959j2817P385K0004
$$ -42448 -50124 -56309 -63739 -27883 -449 -3911 -26236 -32794 -2325 -14284 -27101 -19716 288
13684B88K7773M44l4300o6091R956J6488L397k7456J7332q070P972J8208o2252
$$ 288 28061 28505 -5795 -71886 -61930 -45442 -42045 -69501 -52169 -60239 -52267 -34059 -96311
13671i6311k1252J779n166M9123K9407L3731J7904m342l4706k1051J7992j8098
$$ -96311 -117563 -115784 -120950 -71827 -42420 -8689 9215 4873 -29833 -50884 -32892 -50990
13659e0990k8929M8126J3405l7831J8676o821J1021n662r909M0305K1555R795
$$ -50990 -79919 -31793 -18388 -56219 -37543 -44364 -33343 -39005 -48914 -8609 12946 22741
13647B2741Q788k002m3432k8290j2665L2956K1270j9755K0981J2078k5040k3019
$$ 22741 31529 29527 -13905 -42195 -54860 -21904 -634 -20389 592 12670 -12370 -35389
13635c5389L699j5926k2610K6875K9349L2888j4615K70k8335N985P651m2632J1265
$$ -35389 -31690 -47616 -70226 -43351 -14002 18886 4271 4541 -23794 -17809 -10158 -52790 -41525
13622d1525m798N960L7773K586J5497o414m1749N800K1671O463M909j8141j5998
$$ -41525 -46323 -40363 -2590 -4 15493 9079 -32670 -26870 -5199 1264 6173 -11968 -27966
13609b7966J8891J8072L4136j7083k5512k3533l6759r535j4571M202K1616N7919
$$ -27966 -9075 8997 43133 26050 538 -22995 -59754 -69289 -83860 -79658 -58042 -123
13597a23K5311k3915j4543j663J3685K5030J5039l710J5965n357k7265l2339k4552
$$ -123 25188 1273 -13270 -14933 -1248 23782 38821 35111 51076 45719 18454 -13885 -38437
13584c8437J5074K8284R26j5127k2665L2917J3520j7399K6548K3252K1867K3676
$$ -38437 -23363 4921 5847 -9280 -31945 972 14492 -2907 23641 46893 68760 92436
13572I2436m6955l5721l7316n1032N456j7644J9020K1590M1379j4939k0927O97
$$ 92436 45481 9760 -27556 -78588 -73132 -90776 -71756 -50166 -8787 -23726 -44653 -43956
13560d3956K5070L3094J5258J324N1610K4955o2656k4101j9407l1353l0161k8569
$$ -43956 -18886 14208 29466 30790 82400 107355 44699 20598 1191 -30162 -60323 -88892
13548h8892l3178m822M7324K8502m1L2040r447L107K3342K2521k0052m9219j1883
$$ -88892 -122070 -126892 -79568 -51066 -51107 -19067 -28514 -25407 -2065 20456 404 -48815 -60698
13535f0698J2283N1968J8342k6466k7555O241K0521J7915K8653M911l6800r338
$$ -60698 -48415 3553 21895 -4571 -32126 -25885 -5364 12551 41204 46115 9315 -23
13523b3K7358m5120j4515J4287q821q130M5689k4801k6455O92R745R372k3653
$$ -23 27335 -17785 -32300 -18013 -26834 -34964 10725 -14076 -40531 -39839 -30094 -20722 -44375
13510d4375l2852o379O114M9962m8j1230K8425L9667j7587k7159l7087J223J6453
$$ -44375 -77227 -83606 -77492 -27530 -27578 -38808 -10383 29284 11697 -15462 -52549 -51326 -34873
13497c4873j058J6941J9227n545O931J5019j7867j3302L2398L3523K7657K2348
$$ -34873 -35931 -18990 237 -5308 1623 16642 -1225 -14527 17871 51394 79051 101399
13485A01399K5171J7577N770m6366k4025k9185l3998j9250L0634K2263p398K3511
$$ 101399 126570 144147 149917 103551 79526 50341 16343 -2907 27727 49990 42592 66103
13473F6103K977l5155l9526k7594N703j9068L4450L8177R57p170J0363j07m4121
$$ 66103 69080 33925 -5601 -33195 -27492 -46560 -12110 26067 27024 19854 30217 30110 -14011
13460a4011k5412L226P613L1782J9710K0371j4169j1720q763J9002j6935k0205
$$ -14011 -39423 -36197 -28584 3198 22908 43279 29110 17390 8627 27629 10694 -9511
13448i511J578l034J4922K5681J0259J808l4116j1366K2500J2992L0868K94k7303
$$ -9511 -7933 -10967 3955 29636 39895 41703 7587 -3779 18721 31713 62581 62875 35572
13435C5572k9758m2205k7842r957j6793M0064K8885m656m2600J604M4506J8854
$$ 35572 5814 -36391 -64233 -74190 -90983 -50919 -22034 -26690 -69290 -67686 -23180 -4326
13423d326k0442J0502R110j3816M368J7955J4239O20L4569j1042L942J0889n0718
$$ -4326 -24768 -14266 -5156 -18972 -14604 3351 17590 18210 52779 41737 45679 56568 5850
13410E850l2312M491K7720L4802k4852j3924K7766K669o228k5285j2201J3838
$$ 5850 -26462 -21971 5749 40551 15699 1775 29541 32210 25982 697 -11504 2334
13398B334j9491k0467j209r657J4796K7402l1951k3853n258J8469M4424r778o4123
$$ 2334 -17157 -37624 -38833 -48490 -33694 -6292 -38243 -62096 -67354 -48885 -4461 -14239 -78362
13385g8362J4838M3048Q626J7708L0973j8728J407j0595m0636m457O015J8980
$$ -78362 -63524 -20476 -11850 5858 36831 18103 19510 8915 -31721 -36178 -30163 -11183
13373a1183k4323n2310J7976K7248J2966L0585Q407m155k8488J6752m771m26j2821
$$ -11183 -35506 -87816 -69840 -42592 -29626 959 9366 5211 -23277 -6525 -11296 -11722 -24543
13360b4543j6699k8894o181n845J6746J3850m43m804J3564J9650o093O95J2073
$$ -24543 -41242 -70136 -76317 -82162 -65416 -51566 -52009 -56813 -43249 -23599 -29692 -28997 -16924
13347a6924k7305N542J6275J3129L2493O430m452q061K4638p573k8697k3305o41
$$ -16924 -44229 -38687 -22412 -9283 23210 29640 25188 17127 41765 34192 5495 -17810 -18451
13334a8451K2108j4612J7745P408l0678j9788J2780J7033k3525j9600j76j2811
$$ -18451 3657 -10955 6790 14198 -16480 -36268 -23488 -6455 -29980 -49580 -49756 -62567
13322f2567j4912L9013L8959j607k1707J6712k8929l7318K306L2701L4032J612
$$ -62567 -77479 -38466 493 -1114 -22821 -6109 -35038 -72356 -70050 -37349 -3317 -1705
13310a705J3653j04J8392j5973L4131J1774j6981R544k543j5454k199J791r566
$$ -1705 11948 11844 30236 14263 48394 60168 43187 52731 50188 34734 32535 34326 24760
13297B4760k3152m4976j7857L8298M506j2953k5167n474J1691R34M7111m002j8398
$$ 24760 1608 -43368 -61225 -22927 -18421 -31374 -56541 -62015 -50324 -49390 -2279 -6281 -24679
13284b4679K568J3408K6518j1862q506k908L055q988J1781l406n525k7716N5279
$$ -24679 -22111 -8703 17815 5953 -2553 -5461 -2406 -11394 387 -3019 -8544 -36260 19019
13271A9019M8846l5938k5165k5721k0616J307q480K5915Q493q98K7125j5118P151
$$ 19019 67865 31927 6762 -18959 -39575 -38268 -46748 -20833 -12340 -13238 13887 -1231 5920
13258E920L4828J1903l6185l4017j0541R913l3352l4588J2832L7586J6130K5534
$$ 5920 40748 52651 16466 -17551 -28092 -18179 -51531 -86119 -73287 -35701 -19571 5963
13246E963M31l5774K5380M1088j2083m5265J4979K7275J42k6849l9721p745J2842
$$ 5963 6394 -29380 -4000 37088 25005 -20260 -5281 21994 22136 -4713 -44434 -52179 -39337
13233c9337L5863j5133k9238R031K5285J2503J4038r3N868M894k0854j2359O50
$$ -39337 -3474 -18607 -47845 -38814 -13529 -1026 13012 12919 18787 23681 2827 -9532 -8882
13220h882N048K1092o911N809Q991k7832J6888N698j173j7378J822R327m0766
$$ -8882 -3834 17258 10347 16156 25147 -2685 14203 19901 18728 1350 3172 12499 -28267
13207b8267l1777N302K0842K981M3640L85k1677o574K6869j0468J8445P734k3757
$$ -28267 -60044 -54742 -33900 -30919 12721 13106 -8571 -15145 11724 1256 19701 27435 3678
13194C678m8170j5619K3727L4603L2923j3421l7622l8226j3421J2195J0943q678
$$ 3678 -44492 -60111 -36384 -1781 31142 17721 -19901 -58127 -71548 -59353 -48410 -57088
13182e7088J1340j2513J1692K1683L2860n967L1117L2377n4612l1146J7538K7728
$$ -57088 -45748 -58261 -46569 -24886 7974 2007 33124 65501 10889 -20257 -2719 25009
13170B5009J6874J176k2434j9933k8455K6690K3414k0197j0695O674K7157j7363
$$ 25009 41883 43059 20625 692 -27763 -1073 22341 2144 -8551 -1877 25280 7917
13158G917P390P392q049l7275k9967O00J8970O223j8033k9303N419Q187K0581
$$ 7917 15307 22699 14650 -22625 -52592 -51992 -33022 -26799 -44832 -74135 -68716 -60529 -39948
13145c9948J3352J2211M474k289k7080J2323k0595o977K9855L906p961k591j4646
$$ -39948 -26596 -14385 -9911 -12200 -39280 -26957 -47552 -54529 -24674 -20768 -28729 -31320 -45966
13132d5966N2148M5208k0369o5887j8984J6301J0130r570Q354j6264N873N241
$$ -45966 6182 51390 31021 -34866 -53850 -37549 -27419 -36989 -28635 -44899 -39026 -33785
13120c3785k1147k4497J2873L4009N888k0767J3923M3586K8873l2115N703n252
$$ -33785 -54932 -79429 -66556 -32547 -26659 -47426 -33503 10083 38956 6841 12544 7292
13108G292P953m767p99q611m788o946k3400k7509k6745N946K9681j9629q558k4480
$$ 7292 15245 10478 9679 1068 -3720 -10666 -34066 -61575 -88320 -82374 -52693 -72322 -80880 -105360
13094a05360J5529J1096j6352m3893k109K7632N4923J9985j6259j0355J029m0900
$$ -105360 -89831 -78735 -95087 -138980 -141089 -113457 -58534 -38549 -54808 -65163 -64134 -105034
13082a05034k6327R531M3057N2445L3637K449K0869o2K359J673J5695j2922j4220
$$ -105034 -131361 -121830 -78773 -26328 7309 9758 30627 30565 32924 34597 50292 37370 23150
13069B3150P044l0432k2796q890K16j2074J6356J9917k8633p893M2035j5170k7740
$$ 23150 30194 -238 -23034 -31924 -31708 -43782 -27426 -7509 -36142 -44035 -2000 -17170 -44910
13056d4910L7989O407k8838P973q613k007M657n929j4174J7716l6722j6781N260
$$ -44910 -6921 -514 -29352 -21379 -29992 -31999 -27342 -33271 -47445 -29729 -66451 -83232 -77972
13043g7972M3396P0055p518m707l1101j3097L8299K6469j8548l8125J2704L5413
$$ -77972 -34576 35479 27961 23254 -7847 -20944 17355 43824 25276 -12849 -145 35268
13031C5268L3580J0006m3332k9872K0700Q002q30o745p9077N867M0782m074J862
$$ 35268 68848 78854 35522 5650 26350 34352 33522 26777 -52300 -46433 -5651 -9725 -7863
13018g863N473n580J8040j92m9710o438n914J8652k1380k1289J9622L8231J3200
$$ -7863 -2390 -7970 10070 9878 -39832 -46270 -52184 -33532 -54912 -76201 -56579 -18348 -5148
13005e148j0000l883O188K9869L6273j5834m865j2132j0376k2561n848r522J0372
$$ -5148 -15148 -19031 -12843 17026 53299 37465 32600 20468 10092 -12469 -18317 -27839 -17467
12992a7467J7833N711k8472k1259P963j2947K2592R603j8960l2088N888K2187
$$ -17467 366 6077 -22395 -43654 -35691 -48638 -26046 -16443 -35403 -67491 -61603 -39416
12980c9416l2556K7604L5986J6614o218K1430M6399j1229K769k3976J546k5459
$$ -39416 -71972 -44368 -8382 8232 2014 23444 69843 58614 61383 37407 38953 13494
12968A3494j3282r946R266j3352k7872J0408J0610k8317J8673J5978J1024l437
$$ 13494 212 -9734 -468 -13820 -41692 -31284 -20674 -48991 -30318 -14340 -3316 -6753
12956f753O02l466k8032J176M591P889P434j1948J3750j942r872j5477K977L2445
$$ -6753 -6151 -9617 -37649 -36473 -31882 -23993 -16559 -28507 -14757 -16699 -26571 -42048 -39071 -6626
12942f626l1475k9399J7619J0026K5888J5310o896J1400k0972k4416p543J1363
$$ -6626 -38101 -67500 -49881 -39855 -13967 1343 -5553 5847 -15125 -39541 -47084 -35721
12930c5721Q131o762l5786j0185j5429j3678K5392L1117l048j175k1186j8399
$$ -35721 -27590 -34352 -70138 -80323 -95752 -109430 -84038 -52921 -55969 -57144 -78330 -96729
12918i6729K9633L0915J6456l425k9279J0838K0834j2395J1675O825j983R7j4775
$$ -96729 -67096 -36181 -19725 -23150 -52429 -41591 -20757 -33152 -21477 -14652 -16635 -16538 -31313
12905c1313k8743L496O598k646n950p913q234l9285K4382M4767k2250j6429L0228
$$ -31313 -60056 -56560 -49962 -52608 -58558 -66471 -74705 -113990 -89608 -44841 -67091 -83520 -53292
12892e3292M4446j7189j8881l8573r310J3341J6859q759J4720K5744j2459j7759
$$ -53292 -8846 -26035 -44916 -83489 -92799 -79458 -62599 -71358 -56638 -30894 -43353 -61112
12880f1112j2939o356K1995j7363L5405L1996L1724k0215P005J6600m520j0304
$$ -61112 -74051 -80407 -58412 -75775 -40370 -8374 23350 3135 10140 26740 22220 11916
12868A1916l6832k3665n099P362K45J6340Q993k0764l029l405O1277K7278j080
$$ 11916 -24916 -48581 -53680 -46318 -46073 -29733 -20740 -41504 -44533 -47938 13339 40617 39537
12855C9537m9408j5281k9161k7986L5605O6389J1264L432k2129K9809M7876n1293
$$ 39537 -9871 -25152 -54313 -82299 -46694 19695 30959 34391 12262 42071 89947 38654
12843C8654p0690j3667r445L7594L0844o618K2695j2282L354J1466K801J8775
$$ 38654 -32036 -45703 -55148 -17554 13290 6672 29367 17085 20439 31905 34706 53481
12831E3481J3715K4385K787r301l5630m0216k047J0269m5302N141K5657M3522
$$ 53481 67196 91581 94368 85067 49437 9221 7174 17443 -27859 -22718 2939 46461
12819D6461Q541j1620k0154k6754j9566o147L0051r991J013M6176J9541l3111
$$ 46461 55002 43382 23228 -3526 -23092 -29239 812 -9179 -8166 38010 57551 24440
12807B4440M193J6190k0196k0233j4010j8043o777O172L736l4648J2753m694m88
$$ 24440 28633 44823 24627 4394 -9616 -27659 -34436 -28264 -24528 -59176 -46423 -51117 -51605
12794e1605K2153l845k6077K034L1841p984k0869K2642J2947j4222J6704k295
$$ -51605 -29452 -33297 -59374 -57340 -25499 -33483 -54352 -31710 -18763 -32985 -16281 -18576
$$ [...]
##END NTUPLES=NMR SPECTRUM
##END=
