##TITLE=Analysis number 315476
Compound Code mo 07773
Project Code adrs
Chemist Name stores
##JCAMPDX= 6.0         $$ Bruker NMR JCAMP-DX V2.0
##DATA TYPE= NMR SPECTRUM
##DATA CLASS= NTUPLES
##ORIGIN= Bruker BioSpin GmbH
##OWNER= NMR
$$ XWIN-NMR		Version 3.5
$$ Mon Nov 21 13:33:16 2005 GMT Standard Time (UT+0h)  MAYBRIDGE\NMR@NMR_250MHZ
##.OBSERVE FREQUENCY= 250.131544655141
##.OBSERVE NUCLEUS= ^1H
##.ACQUISITION MODE= SIMULTANEOUS (DQD)
##.ACQUISITION SCHEME= undefined
##.AVERAGES= 16
##.DIGITISER RES= 18
##SPECTROMETER/DATA SYSTEM= dpx250
##.PULSE SEQUENCE= zg30
##.SOLVENT NAME= DMSO
##.SHIFT REFERENCE= (INTERNAL, DMSO, 0, 16.522)
##AUDIT TRAIL= $$ (NUMBER, WHEN, WHO, WHERE, WHAT)
$$ ##TITLE= Audit trail, XWIN-NMR		Version 3.5
$$ ##JCAMPDX= 5.01
$$ ##ORIGIN= Bruker BioSpin GmbH
$$ ##OWNER= NMR
$$ C:\u/data/dgb/nmr/ADRS/12730/pdata/1/auditp.txt
$$ ##AUDIT TRAIL=  $$ (NUMBER, WHEN, WHO, WHERE, WHAT)
(   1,<2005-11-21 13:32:50.21 +000>,<MAYBRIDGE\NMR>,<NMR_250MHZ>,
      <created by zg, POWCHK disabled, PULCHK disabled
       configuration hash MD5:
       62 19 C7 07 E1 42 D1 B7 37 6C 3D D0 77 39 F9 E6
       data hash MD5: 64K
       B5 AB 62 79 E7 DB DB 66 A1 07 FE 03 A8 A2 94 C4>)
(   2,<2005-11-21 13:33:05.46 +000>,<MAYBRIDGE\NMR>,<NMR_250MHZ>,
      <Start of raw data processing
       ef LB = 0.3 FT_mod = 6 PKNL = 1 SI = 32K 
       data hash MD5: 32K
       ED CC AF 44 C7 83 BA 52 58 A2 DD 2D 0E 08 F7 7C>)
(   3,<2005-11-21 13:33:07.39 +000>,<MAYBRIDGE\NMR>,<NMR_250MHZ>,
      <apk 
       data hash MD5: 32K
       DB 8F 69 EB 8B 45 A9 C2 66 78 BE 1D A1 A6 C7 28>)
(   4,<2005-11-21 13:33:08.17 +000>,<MAYBRIDGE\NMR>,<NMR_250MHZ>,
      <abs ABSG = 5 
       data hash MD5: 32K
       AE 04 6D 3E DC 3C 32 97 AA 25 62 EA A2 A1 BF B3>)
$$ ##END=
$$ 
$$ hash MD5
$$ 6A 35 67 0B 25 5C 31 20 70 75 42 0B 31 6F 2E 43
##$RELAX= 
##$RELAX= 
##$RELAX= 
##$RELAX= 
##$RELAX= 
##$RELAX= 
##$RELAX= 
$$ Bruker specific parameters
$$ --------------------------
##$DU= <C:\u>
##$EXPNO= 12730
##$NAME= <ADRS>
##$PROCNO= 1
##$TYPE= <nmr>
##$USER= <dgb>
##$AMP= (0..31)
100 100 100 100 100 100 100 100 100 100 100 100 100 100 100 100 100 100 
100 100 100 100 100 100 100 100 100 100 100 100 100 100 
##$AQSEQ= 0
##$AQ_mod= 3
##$AUNM= <au_zg>
##$AUTOPOS= <26 >
##$BF1= 250.13
##$BF2= 250.13
##$BF3= 250.13
##$BF4= 250.13
##$BF5= 500.13
##$BF6= 500.13
##$BF7= 500.13
##$BF8= 500.13
##$BYTORDA= 1
##$CFDGTYP= 0
##$CFRGTYP= 5
##$CHEMSTR= <none>
##$CNST= (0..31)
1 1 145 1 1 1 1 1 1 1 1 1 1 1 1 1 1 1 1 1 1 1 1 1 1 1 1 1 1 1 1 1 
##$CPDPRG= <>
##$CPDPRG1= <>
##$CPDPRG2= <>
##$CPDPRG3= <>
##$CPDPRG4= <mlev>
##$CPDPRG5= <mlev>
##$CPDPRG6= <mlev>
##$CPDPRG7= <mlev>
##$CPDPRG8= <mlev>
##$CPDPRGB= <>
##$CPDPRGT= <>
##$D= (0..31)
0 1 0 0 0 0 0 0 0 0.06 0 0 0 0 0 0 0.0002 0 0 0 0 0 0 0 0 0 0 0 0 0 0 
0 
##$DATE= 1132579969
##$DBL= (0..7)
120 120 120 120 120 120 120 120 
##$DBP= (0..7)
150 150 150 150 150 150 150 150 
##$DBP07= 0
##$DBPNAM0= <>
##$DBPNAM1= <>
##$DBPNAM2= <>
$$ [...]
##$SUBNAM7= <"">
##$SUBNAM8= <"">
##$SUBNAM9= <"">
##$SW= 20.6930455092707
##$SWIBOX= (0..15)
0 0 3 0 0 0 0 0 0 0 0 0 0 0 0 0 
##$SW_h= 5175.983436853
##$TD= 65536
##$TD0= 1
##$TE= 294.16
##$TE2= 300
##$TE3= 300
##$TEG= 300
##$TL= (0..7)
0 120 120 120 120 120 120 120 
##$TP= (0..7)
150 150 150 150 150 150 150 150 
##$TP07= 0
##$TPNAME0= <>
##$TPNAME1= <>
##$TPNAME2= <>
##$TPNAME3= <>
##$TPNAME4= <>
##$TPNAME5= <>
##$TPNAME6= <>
##$TPNAME7= <>
##$TPOAL= (0..7)
0.5 0.5 0.5 0.5 0.5 0.5 0.5 0.5 
##$TPOFFS= (0..7)
0 0 0 0 0 0 0 0 
##$TUNHIN= 0
##$TUNHOUT= 0
##$TUNXOUT= 0
##$USERA1= <user>
##$USERA2= <user>
##$USERA3= <user>
##$USERA4= <user>
##$USERA5= <user>
##$V9= 5
##$VALIST= <valist>
##$VCLIST= <CCCCCCCCCCCCCCC>
##$VD= 0
##$VDLIST= <DDDDDDDDDDDDDDD>
##$VPLIST= <PPPPPPPPPPPPPPP>
##$VTLIST= <TTTTTTTTTTTTTTT>
##$WBST= 1024
##$WBSW= 4
##$XGAIN= (0..3)
0 0 0 0 
##$XL= 0
##$YL= 0
##$YMAX_a= 488368
##$YMIN_a= -428626
##$ZGOPTNS= <>
##$ZL1= 120
##$ZL2= 120
##$ZL3= 120
##$ZL4= 120
##$ABSF1= 16.522
##$ABSF2= -4.171173
##$ABSG= 5
##$ABSL= 3
##$ALPHA= 0
##$AQORDER= 0
##$ASSFAC= 0
##$ASSFACI= 0
##$ASSFACX= 0
##$ASSWID= 0
##$AUNMP= <proc_1d>
##$AZFE= 0.1
##$AZFW= 0.1
##$BCFW= 0
##$BC_mod= 0
##$BYTORDP= 0
##$COROFFS= 0
##$CY= 12.5
##$DATMOD= 1
##$DC= 0
##$DFILT= <>
##$DTYPP= 0
##$F1P= 14.0000005364418
##$F2P= -0.99999901652339
##$FCOR= 0.5
##$FTSIZE= 32768
##$FT_mod= 6
##$GAMMA= 0
##$GB= 0
##$INTBC= 1
##$INTSCL= 1
##$ISEN= 128
##$LB= 0.3
##$LEV0= 0
##$LPBIN= 0
##$MAXI= 10000
##$MC2= 0
##$MEAN= 0
##$ME_mod= 0
##$MI= 0
##$NCOEF= 0
##$NC_proc= -5
##$NLEV= 6
##$NOISF1= 0
##$NOISF2= 0
##$NSP= 0
##$NTH_PI= 0
##$NZP= 0
##$OFFSET= 16.522
##$PC= 1
##$PHC0= 72.05072
##$PHC1= 7.495407
##$PH_mod= 1
##$PKNL= yes
##$PPARMOD= 0
##$PSCAL= 4
##$PSIGN= 0
##$REVERSE= no
##$SF= 250.13
##$SI= 32768
##$SIGF1= 0
##$SIGF2= 0
##$SINO= 400
##$SIOLD= 32768
##$SREGLST= <1H.DMSO>
##$SSB= 0
##$STSI= 32768
##$STSR= 0
##$SW_p= 5175.98343685301
##$SYMM= 0
##$S_DEV= 0
##$TDeff= 65536
##$TDoff= 0
##$TI= <Analysis number 999999
Compound Code 99
Book Reference 9
Project Code 9>
##$TILT= no
##$TM1= 0
##$TM2= 0
##$TOPLEV= 0
##$USERP1= <user>
##$USERP2= <user>
##$USERP3= <user>
##$USERP4= <user>
##$USERP5= <user>
##$WDW= 1
##$XDIM= 32768
##$YMAX_p= 300984188
##$YMIN_p= -495540
$$ End of Bruker specific parameters
$$ ---------------------------------
##NTUPLES= NMR SPECTRUM
##VAR_NAME=  FREQUENCY,     SPECTRUM/REAL,   SPECTRUM/IMAG
##SYMBOL=    X,             R,               I
##VAR_TYPE=  INDEPENDENT,   DEPENDENT,       DEPENDENT
##VAR_FORM=  AFFN,          ASDF,            ASDF
##VAR_DIM=   32768,         32768,           32768
##UNITS=     HZ,            ARBITRARY UNITS, ARBITRARY UNITS
##FACTOR=    0.157963299565203, 1,           1
##FIRST=     4132.6476996994, 0,             0
##LAST=      -1043.33573715361, 0,           0
##MIN=       -1043.33573715361, -495540,     0
##MAX=       4132.6476996994, 300984188,     0
$$ Real data points
##PAGE= N=1
##DATA TABLE= (X++(R..R)), XYDATA
$$ [...]
15833b3779P4451k7199m8719J12723n778j8904o5542P2776Q8935j07679j1452
15822C9833M9754q893R8105K1128N1627J7185l2432j2526j44326r8481j6998j2299
15810d8323L2634J28863r7554l4461M6809n1596L3667Q9115J98260r3828j95345
15799H241O0991k1180L4439j26652j091J89006j63n3833N601m9181R991R4227
15787A50396K3506k8672n245j60802p1457J47106J46545J8768j01670r4879q1428
15776e7832K8179R705L5627k5370J59381J10818M633K9061p0825j79245q7565
15765d3433J21748k00L9837k759J2048j03363q4655m1395j8019o071p5225j11255
15753c12742R3851P6138Q6227m6225j89074l2333J05924L8798R467R3909m2735
$$ plain form
15833 -23779 50672 23473 -25246 87477 81699 62795 -2747 70029 158964 51285 39833
15822 39833 89587 80694 178799 199927 251554 268739 236307 223781 79455 -19026 -36024 -48323
15810 -48323 -15689 113174 15620 -18841 27968 -23628 10039 99154 297414 203586 8241
15799 8241 69232 48052 82491 -44161 -45252 143754 143591 89758 95359 46178 56169 150396
15787 150396 173902 145230 139985 -20817 -92274 54832 201377 220145 118475 23596 -57832
15776 -57832 -29653 -19948 15679 -9691 149690 260508 265141 294202 223377 44132 -43433
15765 -43433 78315 78115 117952 115193 127241 23878 -60777 -102172 -120191 -126262 -201487 -312742
15753 -312742 -218891 -142753 -56526 -102751 -291825 -324158 -218234 -179436 -169969 -76060 -118795
15742a18795r8167J5673p4423j40016L6763J30018J95533J05090r6092j0480R4198
15731C9302Q6718M4197p6305j67412n8221l3728J87257J15802l1175j21243O8171
15720E3363L2550j23858m6434n729j21676j25296L3004N6115R3372k467l1875
15709a88931J16312J93800r5258n7716m1671l3765L4490L5883J7345J13141Q710
15698A02340M2819P8565k4801m8801j47988q3386n8997J26278Q4497k800j2086
15687E5640j28901m3336Q3670j04434k0890O9174P522p4851L6447p0878J0908
15676a79929Q5542L9946k4467R8921l1105j53602q7021Q1661J79097J13644q2368
15665D0319j08011m9696l1625J36747j6906m5044J16888N537p9644l1566J9886
$$ plain form
15742 -118795 -216962 -201289 -275712 -415728 -378965 -248947 -53414 51676 -44416 -54896 39302
15731 39302 126020 170217 93912 -73500 -131721 -165449 21808 137610 106435 -14808 53363
15720 53363 85913 -37945 -84379 -90108 -211784 -337080 -304076 -247961 -154589 -157056 -188931
15709 -188931 -72619 121181 25923 -31793 -73464 -107229 -72739 -36856 -19511 93630 102340
15698 102340 145159 223724 198923 150122 2134 -81252 -140249 -13971 70526 67726 55640
15687 55640 -73261 -116597 -32927 -137361 -158251 -89077 -81555 -156406 -119959 -190837 -179929
15676 -179929 -94387 -54441 -78908 20013 -11092 -164694 -251715 -170054 9043 122687 40319
15665 40319 -67692 -117388 -149013 -12266 -29172 -74216 42672 48209 -31435 -63001 -43115
15654d3115L7517J12285m8964l9143k0834q2536O1427k759r588l3126L6887N1960
15642B0011n1498p9061l7954j06300k9895m4240K8113P4619J66649J32264J38742
15631B11450j9870j71772j65651q817M6076j279l1987R006l099O6399k2034o7098
15619a58676J1035r374L7391L4824o7430j07211R127J12340L8228J15329j9590
15608d007J5129L8874J11439j02400k08425r593N9804j08361P3352J16885K298
15597a5005k3706k6697j19870M594r881J82722L3470N3380K7546l1316p1253j20821
15585a16837r236J66677P1347j17684q3697j70818M4644P1335m2379N1465J53378
15574A8195J67280Q3452j77880p9115O9174m5618n065n7914p3811J37407j0473
$$ plain form
15654 -43115 -5598 106687 57723 18580 -2254 -84790 -23363 -26122 -35710 -68836 -31949 20011
15642 20011 -31487 -110548 -148502 -254802 -284697 -328937 -300824 -226205 -59556 72708 211450
15631 211450 191580 19808 -145843 -154660 -108584 -109863 -141850 -132844 -135943 -69544 -91578 -158676
15619 -158676 -147641 -157015 -119624 -84800 -152230 -259441 -250314 -137974 -99746 15583 -4007
15608 -4007 11122 49996 161435 59035 -149390 -158983 -99179 -207540 -134188 -17303 -15005
15597 -15005 -38711 -65408 -185278 -180684 -190565 -7843 25627 79007 106553 75237 3984 -116837
15585 -116837 -126073 40604 111951 -5733 -89430 -260248 -215604 -144269 -186648 -135183 18195
15574 18195 185475 268927 91047 11932 81106 35488 30423 -27491 -101302 36105 25632
15563B5632p522k7577k3374J01568L0592J5231R0034j21528j11216l2485O4124
15552C479J57954j8098q1395q4000L2186j04483q1419M8594M4300K00736J41842
15541B59696J1131J0358K4408l0908j00295J626o1368J8831R2425L9346l183j37986
15529A24081j20716N6131k91j13851n8623J60122R6556K2319p5259J3006O8992
15518A72467R1107k800k22163q1941K186R3306R0899j07578l6165m9274m7129
15507i7085O3369M1132O1306J8599j7394j21201O6988P1058p4649l8465p9156
15496a05498j9945N8235k8830n0072P4435J21198n1922k6109R7983q4190N384
15485i331k0287l8196K7288J47232J21513n3641k7701k12561j1893J246J55817
$$ plain form
15563 25632 18110 -9467 -32841 68727 99319 114550 204584 83056 -28160 -60645 3479
15552 3479 161433 143335 61940 -22060 10126 -94357 -175776 -127182 -82882 117854 259696
15541 259696 270827 281185 305593 274685 174390 176016 114648 133479 225904 265250 262067 124081
15529 124081 3365 59496 59205 -54646 -113269 46853 143409 165728 90469 103475 172467
15518 172467 263574 260774 38611 -43330 -41144 52162 143061 35483 -682 -49956 -97085
15507 -97085 -33716 7416 68722 87321 69927 -51274 15714 86772 12123 -26342 -105498
15496 -105498 -125443 -67208 -96038 -146110 -71675 49523 -2399 -28508 69475 -14715 -9331
15485 -9331 -29618 -67814 -40526 106706 228219 174578 146877 -65684 -77577 -76331 79486
15474G9486K83683m0833j11080j51994K798k6924J8221o9940j61802l2079M0527
15463a69937J32535O8590k1084k8194Q5187L2181j16509n2689L0348M769J190
15452c3613l0415q9951j02032m7087K7330J09748J59659r1801p2684N2990L9480
15441g8376p6532K4670O6222N9605j15755q7304J21404J64091O7831j77805r1485
15430a23434n2483O5045O6997m370P3103p01M6599k6631P7080J55202j48392k21301
15418i3286j88176l4308L248J28908J10660n0301N3444j6469r1296p3101P5666
15407a75011J13353P1479J08897J88297j9842j68223l6436k3290n9507n8472p3524
15396a32279l5144M5278R3861J94132R0741j14244j45469j532r0935J01034M0958
$$ plain form
15474 79486 363169 322336 211256 59262 62060 35136 53357 -16583 -178385 -210464 -169937
15463 -169937 -37402 31188 10104 -18090 67097 99278 -17231 -69920 -39572 -34803 -33613
15452 -33613 -64028 -153979 -256011 -303098 -275768 -166020 -6361 -98162 -170846 -117856 -78376
15441 -78376 -154908 -130238 -64016 -4411 -120166 -207470 -86066 78025 145856 -31949 -123434
15430 -123434 -175917 -110872 -43875 -48245 24858 24157 70756 44125 121205 276407 128015 -93286
15418 -93286 -281462 -315770 -312522 -183614 -72954 -123255 -69811 -86280 -177576 -250677 -175011
15407 -175011 -61658 9821 118718 307015 287173 118950 82514 59224 -283 -58755 -132279
15396 -132279 -167423 -122145 -28284 165848 256589 142345 -3124 -4656 -95591 5443 46401
15385D6401q072q5551Q9164j9156J63Q146j8604j04931N7979N2635m3149p6054
15373a01029J0909J53756K92j57966n6250O4948O0454J04095K807J0148L4112
15362A26276p610m8758N7094r0038j12993r1082j28012L2421J17707o9092L8365
15351a75722P957j01952R52J03377J26541M9477j4934l7883m2384l197m1377p6399
15339b05544J05828L8920J48958N238k63611l6553L1906R0829K2809l7916Q1371
15328a7765J0712L7698R993l0046k1589p7030m2560N9466J7726j1950L0934j0623
15316d5034L628l455J30082K1062r1295r5814l7436m6872o0479k738J52644M990
15304g0717P861J9706j5601L9262N3841j7816m9354J9722o9359o2097m2547p3543
$$ plain form
15385 46401 38329 -47222 41942 22786 22949 31095 12491 -92440 -34461 18174 -24975 -101029
15373 -101029 -90120 63636 63928 -94038 -150288 -85340 -24886 79209 82016 92164 126276
15362 126276 118666 69908 127002 36964 -76029 -167111 -295123 -262702 -144995 -214087 -175722
15351 -175722 -167765 -269717 -268765 -165388 -38847 10630 -4304 -42187 -84571 -87768 -129145 -205544
15339 -205544 -99716 -60796 88162 93400 -170211 -206764 -174858 -84029 -61220 -99136 -17765
15328 -17765 -7053 30645 40638 10592 -10997 -88027 -130587 -71121 -53395 -65345 -34411 -45034
15316 -45034 -41406 -44861 85221 106283 14988 -80826 -118262 -165134 -225613 -228351 -75707 -70717
15304 -70717 -62856 -43150 -58751 -19489 34352 16536 -32818 -13096 -82455 -144552 -187099 -260642
15292b60642K5272J70131J54030p308j18866n6311L2704k39248O9138J12058n0594
15281a69636J74863J41399j06028q3480K5281j39064j16288J04099J88332M4481
15271F3959l7835O4865J06266N8237j41709p4602N5755k8303J05121p1864m5399
15260E4491n6180M2975R47J8094O1134o4717m6476j3359l0469J24802j2127l0990
15248D8125j5993j61265j29702Q833M0773R5905J87366J16680r7437M533j8533
15237G9285q0870l0671P7348N5910N0603N9254R90J076j66022p9661j80975k9967
15225b43700M9181r7742J09673Q7462J0083p6458J1699n9742R6414M3748R9765
15214C0383J0147p3892j39723Q203k5915O7324R7280m2223m0708m9562J67651
$$ plain form
15292 -260642 -235370 -65239 88791 81483 -37383 -93694 -60990 -300238 -231100 -119042 -169636
15281 -169636 5227 146626 40598 -42882 -17601 -156665 -272953 -168854 19478 63959
15271 63959 26124 90989 197255 255492 113783 39181 94936 66633 171754 99890 54491
15260 54491 -1689 41286 42233 60327 121461 56744 10268 -3091 -33560 91242 79115 48125
15248 48125 32132 -129133 -258835 -250002 -209229 -113324 74042 190722 93285 97818 79285
15237 79285 -1585 -32256 45092 101002 151605 210859 211849 212925 46903 -32758 -213733 -243700
15225 -243700 -194519 -292261 -182588 -95126 -85043 -161501 -149802 -209544 -113130 -69382 30383
15214 30383 40530 -33362 -173085 -164882 -190797 -123473 -26193 -68416 -109124 -158686 8965
15203H965m2901M976J24925P3902M338J9584l2914m9634N134J29314q7440j49395
15191H854l855q3929n8736P4668O8352L3689J4831j41896k3042m9476k5551q6977
15179b73068j32958J44925J46770J5401j66667l0988N9449P5326R6381L9792M8136
15168B2499K3410J3592M2379j5301l5354r9843M6839J12067N160j72309p6999
15157a33860o4525J43894J34161N5766j58436o6730j5886M3572J49564K3505M3889
15146A54914M7912k2857k27941N947O6268j10Q7133L8920N5464M377j08618R5638
15134A97047J1961j08847j02798q422n4291j20643o6213j1629Q9917L9154o0509
15123a95273K3002Q8996J40780K2592J6210r0161n4207p969p6643R0026R3786
$$ plain form
15203 8965 -33936 -28960 95965 169867 174205 193789 160875 111241 116375 245689 158249 8854
15191 8854 4999 -78930 -137666 -62998 5354 39043 53874 -88022 -111064 -160540 -186091 -273068
15179 -273068 -406026 -261101 -114331 -98930 -265597 -296585 -237136 -161810 -65429 -25637 22499
15168 22499 45909 59501 101880 86579 51225 -48618 -1779 110288 115448 -56861 -133860
15157 -133860 -198385 -54491 79670 135436 -23000 -89730 -105616 -62044 87520 111025 154914
15146 154914 202826 179969 -47972 -42025 24243 24133 111266 150186 205650 210027 101409 197047
15134 197047 209008 100161 -2637 -11059 -65350 -185993 -252206 -263835 -173918 -134764 -195273
15123 -195273 -172271 -83275 57505 80097 96307 6146 -48061 -56030 -132673 -42647 51139
15112E1139o9537j61731j54354J29657P3953Q3514J55111R5243j16497j47558
15102f1060m6522k4519m2607j05857R7864J11616J65896J71787o7026j66482P8353
15091A11443k6758m7399r635p416N5999O5657j0284R1147J43119O8376j33345
15080C00904j05778k2845r3573m5753r2572j0219r0210q7939J40687O7566J88783
15069A49051m411j01439l9498q80J37941P4481J6592m1744j57322J44280K3642
15058B00693o7963k4771j0686k0629q7333j7414n2940q6709K0269J04984K28147
15047A85648l8660p5926n3469j24571l6915K227n873l2067M2134P6319P8200Q9302
15035A06349O1601r6403j1277j70618O46M2337p5087k3306j02227j637l7763J57878
$$ plain form
15112 51139 -18398 -180129 -334483 -204826 -130873 -47359 107752 202995 86498 -61060
15102 -61060 -107582 -132101 -174708 -280565 -182701 -71085 94811 266598 199572 33090 111443
15091 111443 84685 37286 27651 20235 76234 141891 131607 222754 365873 434249 300904
15080 300904 195126 172281 78708 32955 -59617 -69836 -160046 -247985 -107298 -39732 149051
15069 149051 144640 43201 3703 2823 140764 215245 231837 190093 32771 177051 200693
15058 200693 132730 107959 97273 76644 -10689 -28103 -81043 -167752 -147483 -42499 185648
15047 185648 146988 71062 17593 -106978 -143893 -141666 -147539 -179606 -137472 -61153 17047 106349
15035 106349 167950 71547 60270 -110348 -109702 -67365 -142452 -165758 -267985 -269622 -307385 -149507
15023a49507l3396j18433J3692J75336N0281o8847J3419L390P9304J72683M7530
15012A85452n721o0833j43508j15512L8719J04047J06153J17221N693o1796n4705
15001A15210l3098j31808m0115j62472J7662J31493J86287L145r8637r0048o4050
14990a66431r10M8422J22349j34722k1681j1371J3567L2055R7796J00550J2470
14979I2094k6183K9917j49753j34250J54569o3567N2462m2562j59267P9823J71154
14968D437J5251Q9807Q9649p9278p2069p9682p1535l480J50121N7360J2162l8431
14956G4312k4618j42607j47141J543O1702M3645J5382n7396Q0862J51425K1833
14945G8942m9312j4778M5192m3975j7037r2099l1700R1521M5572j12609k0622
$$ plain form
15023 -149507 -182903 -301336 -287644 -112308 -62027 -130874 -117455 -114065 -34761 137922 185452
15012 185452 179731 118898 -24610 -140122 -101403 2644 108797 226018 231711 169915 115210
15001 115210 82112 -49696 -89811 -252283 -234621 -103128 83159 86304 -12333 -102381 -166431
14990 -166431 -167341 -118919 3430 -131292 -152973 -164344 -150777 -118722 -20926 79624 92094
14979 92094 65911 95828 -53925 -188175 -33606 -97173 -44711 -87273 -246540 -166717 4437
14968 4437 19688 109495 199144 119866 47797 -31885 -103420 -106900 43221 100581 112743 74312
14956 74312 49694 -92913 -240054 -238511 -176809 -133164 -117782 -175178 -94316 57109 78942
14945 78942 29630 14852 60044 16069 -968 -93067 -124767 -33246 12326 -100283 -120905
14934a20905P7090K041M8391k5565M6269k1523M9332j632q9609O7886j6458l1397
14922a6080K1048Q8451p7783Q875K078l0882k6679P813m6310l7005M7429l6541
14910i5586q9889j51278r3475K13778J55632K0962n5666M537m5959k8864p044
14899a72852J08790R8532q882O2429M4394M0107r0222o450j12142j48746r4976
14888b80018J2335O2775K12703J65746p2399j23692L1486M406n7775J1108J73762
14877A40437Q7520K1685j05395j65611k7625K2809Q520l8311K2425L4128j07303
14866a06721R8752K8210l7946K16928Q4244k07475j12160r2390J43748l402J43217
14855A55005L8284j11255o4954r5384K1109J27699L0477Q3708j8058j3304k4323
$$ plain form
14934 -120905 -43815 -41774 6617 -18948 27321 5798 55130 53498 -36111 31775 15317 -16080
14922 -16080 4968 93419 15636 24511 26589 -4293 -30972 -23159 -69469 -106474 -59045 -95586
14910 -95586 -185475 -336753 -430228 -216450 -60818 -39856 -95522 -90985 -136944 -165808 -172852
14899 -172852 -64062 34470 25588 88017 132411 172518 82296 75846 -36296 -185042 -280018
14888 -280018 -267683 -204908 7795 173541 101142 -22550 8936 13342 -44433 -33325 140437
14877 140437 227957 249642 144247 -21364 -48989 -26180 -17660 -55971 -33546 582 -106721
14866 -106721 -7969 20241 -17705 199223 283467 75992 -36168 -128558 15190 11788 155005
14855 155005 193289 82034 17080 -78304 -57195 70504 100981 184689 166631 153327 129004
14844A29004p7324j3927L4900p491l310L8994J09300n9767N1090j3375j51219
14833C6875j15394N3429P1760J10903j45282j96278l2207O5177k5702O248J02453
14822f8018M3211n3059L5413J34389N0848p1691q2693k4854R48J5994J7105j1487
14810a3894p92k7934j88392q787L3076M9926P8977N8101J9461o0315j34251p7171
14798b71995O7828J27579J98266N4124m6259j57167k5343j23767m974Q6801m6238
14787a41145j6206M1749J07310N7893n8522j34797n1894J18513J16409M7426r876
14776G6860n6215j19976m6867P7573r252l1599J08317J68905O9729q1867k20195
14765f4587J6929Q4804J7580j03591n3591q511M4935p3056j17468K0959O5158
$$ plain form
14844 129004 51680 37753 72653 65162 61852 100846 210146 150379 201469 188094 36875
14833 36875 -78519 -25090 46670 157573 12291 -183987 -216194 -151017 -176719 -170471 -68018
14822 -68018 -24807 -77866 -42453 91936 142784 71093 -11600 -36454 -35506 -19512 -2407 -13894
14810 -13894 -14686 -42620 -231012 -239799 -206723 -156797 -77820 -19719 -258 -60573 -194824 -271995
14798 -271995 -204167 -76588 121678 175802 129543 -27624 -52967 -176734 -181708 -94907 -141145
14787 -141145 -157351 -115602 -8292 49601 -8921 -143718 -195612 -77099 39310 86736 76860
14776 76860 20645 -99331 -146198 -68625 -77877 -109476 -1159 167746 237475 155608 -64587
14765 -64587 -47658 37146 54726 -48865 -102456 -110967 -66032 -139088 -256556 -235597 -170439
14754a70439J8414L8488J43298P1351m9268l8016J58939O2659r3699k19950m126
14743h2349M1995k5437j20397m3990O0647J30526R7120J37297J14190K0908j12902
14732B17608p0194q8677k9075R2631M5700j16633r0014q8142m7692L6783m5981
14721a83686p0988J10453N9018J04909J9417j40896K4195k7310N4500m1788N6771
14710c5405M9963K4295j21124o5635K3696M6810o265M4447L0450M3524p3015p4416
14698a12675j60812O792J30420K06432Q1228M2516l4303k4160j15906m7158J32932
14687A05306o0706J1322j1048q1953J08632Q4739j94999r9203L5289M8566n6369
14676a10424R6551R6994p6889r8050j38646J65526J78112r7758o1786J15827J14461
$$ plain form
14754 -170439 -152025 -113537 29761 101112 51844 13828 172767 235426 141727 -78223 -82349
14743 -82349 -40354 -65791 -186188 -230178 -169531 -39005 58115 195412 309602 330510 217608
14732 217608 147414 58737 29662 122293 167993 51360 -38654 -126796 -174488 -137705 -183686
14721 -183686 -254674 -144221 -85203 19706 39123 -101773 -77578 -104888 -50388 -92176 -35405
14710 -35405 14558 38853 -82271 -147906 -124210 -77400 -83665 -39218 -8768 34756 -38259 -112675
14698 -112675 -273487 -266695 -136275 70157 151385 193901 159598 135438 19532 -27626 105306
14687 105306 44600 55922 44874 -37079 71553 156292 -38707 -137910 -102621 -54055 -110424
14676 -110424 -13873 83121 6232 -91818 -230464 -64938 113174 15416 -46370 69457 183918
14665A83918p4350k0937p2461q3281N9589O017Q409K8336k2271m9314R4635o7488
14653i198j00342n083J38561J3075P6063K6137O5976K7596J4351j08237l0291
14642A08608J81718n117j91603j57057M1522J70509K2427K4893l3304l1690n8524
14631G2382k6974n5459J06935J93n7349M2971J97098K0739j15462o2825q6151
14620C6098M5573m2171n017m9732j24110j2856m7974j4137Q9322K03765J41244
14609B20005j99278j06621J21359J331j5243R586l2782K1092m7850p1402q023
14598a07826M9218N5517L5065j19719j32654o1690p7754P3697l6575J49747J52297
14587b0677N4793K86P6459l086j3188j87837j7834n6523k1678J27889J02989N31
$$ plain form
14665 183918 109568 88631 16170 -67111 -7522 -1505 6904 35240 12969 -36345 58290 -9198
14653 -9198 -109540 -114623 23938 37013 113076 139213 205189 232785 247136 138899 108608
14642 108608 290326 285209 93606 -63451 -21929 148580 171007 195900 162596 130906 72382
14631 72382 45408 -10051 96884 97077 39728 82699 279797 300536 185074 122249 36098
14620 36098 81671 39500 34483 -15249 -139359 -152215 -200189 -214326 -125004 78761 220005
14609 220005 20727 -85894 35465 36796 21553 31139 -1643 19449 -28401 -99803 -107826
14598 -107826 -58608 -3091 31974 -87745 -220399 -282089 -359843 -286146 -322721 -172974 -20677
14587 -20677 34116 34402 110861 107775 94587 -93250 -111084 -167607 -189285 -61396 41593 42124
14575D2124Q9154M6524j15884p1386j3312p5278p8727q835J13333O796l9258k8668
14563a33417k9036L740O9503K1205n0861m4186J16335Q431j20425N9481J19967
14552B0737N5574Q3923m9562k9712j33823n2035O2008J59261j41985q5328p0P093
14540a03919m5186j8898J10252O6206l767j02733j79445Q219J11472L4574l2759
14529a55984l2048J22879J16222J02713K7740o3718j2339M2215q7002k5109m9412
14518a3843j39649q6743O9507J27381o4514O4508L8901Q6381R0460n8183l8480
14507G5726j07074N281N3632p9035l8350M2664J40085K6589n8605n2332j24692
14496a16111r5249L4579R5291o1607j34324l0550J29249P5233O8407K6391o2570
$$ plain form
14575 42124 131278 177802 61918 -9468 -22780 -98058 -176785 -185620 -72287 -65491 -104749 -133417
14563 -133417 -162453 -158713 -89210 -68005 -118866 -163052 -46717 -38286 -158711 -99230 20737
14552 20737 76311 160234 110672 80960 -52863 -104898 -42890 116371 -25614 -110942 -111012 -103919
14540 -103919 -149105 -168003 -57751 8455 4688 -98045 -277490 -269271 -157799 -123225 -155984
14529 -155984 -188032 -65153 51069 153782 181522 117804 105465 147680 60678 35569 -13843
14518 -13843 -153492 -240235 -170728 -43347 -107861 -43353 -4452 81929 172389 114206 75726
14507 75726 -31348 -26067 27565 -51470 -89820 -47156 92929 119518 60913 8581 -116111
14496 -116111 -211360 -176781 -81490 -143097 -277421 -307971 -178722 -103489 -35082 -8691 -71261
14485g1261j37937P7395j4499J52034J51028o0524M5226j8524j19080j40941M2549
14474i4534Q664O7406J03976M075p6166L6006P2746j33275k30149j00436Q3079
14463b58608P9583P6316n9015K3119m7057n5655m978R3042l711j19791m1015J77844
14451a39926O3108P8952M3392m1213j11587j7621Q4444n8882j83549J31028J28427
14440b3427M8479M1597k6499r2622j40268m9316o1498o779K12831l9969q4258
14429b21729J23073J55201p6809j94176l5943k9863p7485K08038L6817M1055J67633
14418I5812R3520j13714K4637O1819k20718o5166O2571J45673l8790J00781l7757
14407A08668j71596q8564J17794n7764L300J3274J21781j4788n3870q655J79529
$$ plain form
14485 -71261 -209198 -131803 -146302 5732 156760 96236 141462 122938 3858 -137083 -94534
14474 -94534 -85870 -18464 85512 89587 13421 49427 122173 -11102 -241251 -341687 -258608
14463 -258608 -179025 -102709 -161724 -138605 -185662 -241317 -246295 -153253 -156964 -276755 -317770 -139926
14451 -139926 -76818 2134 45526 4313 -107274 -124895 -40451 -99333 -282882 -151854 -23427
14440 -23427 25052 66649 40150 -52472 -192740 -242056 -303554 -310333 -97502 -137471 -221729
14429 -221729 -98656 56545 -20264 -214440 -250383 -280246 -357731 -149693 -112876 -71821 95812
14418 95812 189332 75618 100255 162074 -58644 -123810 -61239 84434 45644 146425 108668
14407 108668 -62928 -151492 -33698 -91462 -88162 -74888 46893 32105 -21765 -30420 149109
14396A49109J08465r4823j9220r8686o8760j0162m2869n712l7770o6618M098J33744
14384d9204O6308O1161q8669j14236P0374k455j34207j712J55570J27025j28544
14373c8589P1734M5702j01142l0950O8052n8236n8157J1912O1109L8162o5408
14362e5811p9730K2034L8017P310n8458n6866K5754R8323j05184P0887K6495n9018
14350a26247j8780J03075p3629N2968P3140n5103M4529J02016q6762q0231l4880
14339i9904j38548L2093J66840n4640j94645J61666J54386o0453k5099M9003q4058
14328i3359n2744R416k5090N8364n5879p7977J38580R0652N6718j6857N2382J81114
14316B65320o1894m6543Q1445m5862k3056q8275j90636K8346L8195J5037J887
$$ plain form
14396 149109 257574 162751 143531 44845 -23915 -34077 -76946 -82658 -120428 -187046 -182948 -49204
14384 -49204 17104 78265 -10404 -124640 -54266 -56721 -190928 -192640 -37070 89955 -38589
14373 -38589 33145 78847 -22295 -53245 14807 -43429 -101586 -89674 -28565 9597 -55811
14362 -55811 -135541 -113507 -75490 -68180 -126638 -183504 -157750 -59427 -164611 -93724 -67229 -126247
14350 -126247 -145027 -41952 -115581 -62613 10527 -44576 -47 101969 15207 -65024 -99904
14339 -99904 -238452 -206359 -39519 -94159 -288804 -127138 27248 -33205 -58304 -9301 -93359
14328 -93359 -146103 -136687 -161777 -103413 -159292 -237269 -98689 -8037 48681 31824 84206 265320
14316 265320 203426 156883 238328 192466 169410 81135 -109501 -81155 -42960 -27923 -26036
14305b6036m6362p0499q664K6923J29060N1127L0920Q1843Q812k04041j09513
14294a36430O3412m2430l4417M6599K9920J0729k6327K7613J11124O3042m5868
14283F6967l7935L6722q6610L7399M5177M8774r111J2793k1726n4151J4541J18583
14271A71423n1546K8319k2235p8817N16j14529Q249J1329J5767K0825L9173M3700
14259G2174Q5453k1988j4777m6948j00738n469K1021l255J00600M2900n1374P6474
14247A54073O8486M2757r9327p5951m6314q2426j16306R802Q2145Q7468k0406
14236D001n7530K3850J9070N026J2115k4937N0850M9168n7311n5811j92871n9015
14224b83395n6474J58859Q0379q4987l1492J13863K6904R783m5734P1726j3022
$$ plain form
14305 -26036 -72398 -142897 -151561 -124638 4422 55549 86469 168312 177124 -26917 -136430
14294 -136430 -73018 -115448 -149865 -103266 -73346 -62617 -88944 -61331 49793 112835 66967
14283 66967 29032 65754 -20856 16543 61720 110494 101383 114176 92450 38299 52840 171423
14271 171423 119877 148196 125961 47144 47660 -66869 -58620 -47291 -31524 -10699 28474 72174
14259 72174 157627 135639 120862 73914 -26824 -32293 -11272 -14527 86073 128973 77599 154073
14247 154073 222559 265316 165989 90038 43724 -38702 -155008 -145206 -63061 24407 4001
14236 4001 -53529 -29679 -10609 -5583 6532 -18405 32445 81613 24302 -31509 -224380 -283395
14224 -283395 -339869 -181010 -100631 -185618 -217110 -103247 -76343 -66560 -112294 -40568 -53590
14213e3590o4912J4167J51299R7129N5392P0026j22016r48r8198j73357o1287
14202a86295n8257R9761O6673n6178j14667R4039r739O9660K5608j87946J55337
14191a02004J05299N2972j9370l7923j17614R2314J09057O0936J9946o3403n4429
14180D5781q0727O2818o34p5559R7462J1804p2162J6298k4444k4289j11559m0037
14168a95248k4113O6038O2642k8343m2085K9199P3250R5514J38265N4207L7051
14157B66377J24854j22594k79604j68762J74783J18365P8421o4880j25186r6217
14147i4443K4217N1045J66090m4822N2364m5366j00030k5445P405J2413p3157
14136f9729O0411J45549j4433j66330j17300J5943P6550M3027k1924o7721j15281
$$ plain form
14213 -53590 -118502 -104335 46964 144093 199485 269511 147495 146547 48349 -125008 -186295
14202 -186295 -244552 -144791 -78118 -134296 -248963 -154924 -164663 -95003 -69395 -257341 -102004
14191 -102004 3295 56267 36897 -1026 -118640 -26326 82731 143667 163613 100210 45781
14180 45781 -34946 27872 27238 -48321 49141 60945 -11217 5081 -19363 -43652 -155211 -195248
14168 -195248 -219361 -153323 -90681 -119024 -161109 -131910 -58660 36854 175119 229326 266377
14157 266377 391231 268637 -10967 -179729 -4946 113419 191840 126960 1774 -94443
14147 -94443 -70226 -19181 146909 102087 154451 109085 9055 -16390 -8985 3428 -69729
14136 -69729 -9318 136231 121798 -44532 -161832 -145889 -69339 -26312 -48236 -115957 -231238
14125b31238M6915m2019m9240P5408J34760K0966k3162K6751m248k151m5975n3280
14113a46513J23681M451j0928J39132O9263n4671j76652J4111J78070m7261j95904
14102a03221p8776J28549O7827n9652p6876r2993J01073L5487M231K3754L2371
14091a8226j34999m3608J57824N0187R2865m7070q9876N0156l1869p6585J36282
14080D5081J14804k2041P6054m5076j23160j17764L8630J13558L8677P5313L6538
14069B30614Q1270K6018r4656j58056j31611L6124L9202n3101k6263k2649p0895
14058a44003k0042o67N4606L0592N9686l2314j03965N5571J42415j2202l3530
14047c853n4892n973M116K3390M3358L4722n3338m9297M9637l8059m4473K5718
$$ plain form
14125 -231238 -184323 -226342 -275582 -200174 -65414 -44448 -67610 -40859 -45107 -47258 -93233 -146513
14113 -146513 -22832 -18381 -29309 109823 179086 124415 -52237 -38126 139944 92683 -103221
14102 -103221 -181997 -53448 14379 -45273 -122149 -215142 -114069 -78582 -74351 -50597 -18226
14091 -18226 -153225 -196833 -39009 11178 104043 56973 -32903 17253 -14616 -91201 45081
14080 45081 159885 137844 213898 168822 45662 -72102 -33472 80086 118763 194076 230614
14069 230614 311884 337902 243246 85190 -46421 -10297 28905 -24196 -50459 -73108 -144003
14058 -144003 -164045 -164712 -110106 -79514 -19828 -52142 -156107 -100536 41879 29677 -3853
14047 -3853 -58745 -64718 -60602 -37212 6146 40868 -12470 -61767 -12130 -50189 -94662 -68944
14035f8944r95k86n9859j02950O8376J04104r4777N213N6203J71154m8335j28772
14023i9868j19261N8522o9520J74458K32392L0604n9822k06580n3423Q4464p4801
14012a02835L7144J88530l4144o3755m6346J4548P5148m8734k3124m244J49075
14001A41263k6994j03660L4868J28877O5422n9946k78098k0004L697r246O065
13990a17756L4884j2271k0928J9059J4425P0604P7643K7454J21547j14068k17736
13979a17143O5370J33516R1195q647k13126o6970Q9443K3357n3629L2501O5522
13968D1389k2727q827n814p6784P2242K3498R6203J95888j02539j95844J2618
13957B9303r5878K7714J70515n045m0893N3736q1726j46089K0779Q9259M4148
$$ plain form
14035 -68944 -69939 -70225 -130084 -233034 -164658 -60554 -155331 -150118 -93915 77239 28904 -99868
14023 -99868 -219129 -160607 -230127 -55669 176723 207327 147505 -59075 -112498 -28034 -102835
14012 -102835 -65691 122839 88695 24940 -21406 -6858 68290 19556 -3568 -7812 141263
14001 141263 114269 10609 45477 174354 239776 179830 -98268 -118272 -114575 -123821 -117756
13990 -117756 -82872 -95143 -116071 -97012 -82587 -11983 65660 93114 214661 100593 -117143
13979 -117143 -51773 81743 172938 164291 -48835 -115805 -26362 -3005 -56634 -24133 41389
13968 41389 18662 9835 4021 -72763 -521 22977 119180 315068 212529 16685 29303
13957 29303 -66575 -38861 131654 126609 85716 139452 57726 -88363 -67584 21675 65823
13946F5823L9975K555R289p1032q6395Q806J16680K7434o8986K7634p79q0748
13934i744o0864l4565P3106Q4606j33549p1665K5908J05953JK5006J00335k987
13922A01541j3143J0219q8311j27062N6467J62120O5627n4631j32328M2852k845
13911B0506n1773J4801N6696J19339o6365o8221N7985L6341q5270k6615p389m9628
13899d9593k0542k0469L2755J03816l4506n2529J1975r2951J20488L1066p3949
13888d4439R2942o815p3739J39464J9702o9818P0970o1628j41492K0292n6479
13877a11040j1148P8227O4708m8116q8679j41393J01624J50521K08355q3101j61605
13866d1647k4650L1459Q8956M6170O606P8484L4811q6076J8920L782k207j58089
$$ plain form
13946 65823 105798 108353 117642 46610 -39785 -30979 85701 113135 44149 71783 71004 -9744
13934 -9744 -70608 -105173 -32067 52539 -81010 -152675 -126767 -20814 -20813 4193 104528 101541
13922 101541 88398 98617 10306 -116756 -60289 101831 167458 112827 -19501 23351 20506
13911 20506 -31267 -16466 40230 159569 93204 24983 82968 119309 34039 7424 35 -49593
13899 -49593 -70135 -90604 -57849 45967 11461 -41068 -29093 -122044 -1556 29510 -44439
13888 -44439 48503 41688 -32051 107413 127115 57297 128267 66639 -74853 -54561 -111040
13877 -111040 -122188 -43961 20747 -27369 -116048 -257441 -155817 -5296 203059 119958 -41647
13866 -41647 -66297 -34838 54118 100288 106894 185378 220189 134113 153033 156815 154608 -3481
13854c481r6002r919L307J995K55468Q3355q0190j53068L3006N5772r7798o8829
13842g6384K3641l5952j10078M0736m3923J06311N6998P7211n4612L2828M5672
13831F2448n0853j76896j27235J2176O0226P5560r001P80k081o4371k2181n6129
13819b97557N1457K10272J33667p0793n3418j1629j2760J3841J45029J1421q1776
13808C7754M822o5294j47450j06173K4889J54333J63513k5162k8586j08271j2548
13797a08173k2477L26Q4363P7346p2872k9001J4814O964k9512J09487L3374o5024
13785c85N8289J09071m2419j08883Q3956p8062r7731m3016K0667R049p3127n1077
13773b13668Q2348L5907k0899J16387O0149P254K5530p3293o1566n4851l2009
$$ plain form
13854 -3481 -99483 -109402 -106095 -104100 151368 234723 154533 1465 34471 90243 -7555 -76384
13842 -76384 -52743 -88695 -198773 -158037 -201960 -95649 -38651 38560 -16052 16776 62448
13831 62448 11595 -165301 -292536 -280360 -220134 -144574 -153575 -152795 -154876 -219247 -241428 -297557
13819 -297557 -246100 -35828 97839 27046 -26372 -38001 -50761 -36920 108109 119530 37754
13808 37754 42576 -22718 -170168 -276341 -251452 -97119 66394 41232 12646 -95625 -108173
13797 -108173 -130650 -130324 -45961 31385 -41487 -70488 -55674 -48710 -78222 31265 64639 -385
13785 -385 57904 166975 124556 15673 99629 21567 -76164 -119180 -98513 -89464 -162591 -213668
13773 -213668 -131320 -95413 -116312 75 60224 67478 93008 19715 -41851 -96702 -128711
13762a28711J7149k0181n6400q1064j7995R0207J90514J11676k2612j44922K0627
13751d1712m5688j0185p647R9593J36809M2115q5645r7543R6936p4785r1249o5364
13739a44365N1188P956O1869k0019J3808J7658n5291O7750n4969k4464K7626r2342
13727a43595l1280O143P9145L3572o178o4611j3264j02369n2358J3912J34986
13716a45897R880k1427J11827L5319N1064J6519j6980l5148l132K4287R5593r192
13704A12713o5698m0262r0991j22247N8672J12246N7449j316L0340L7965m989
13693H3882L8298j661l9461N197L0473J8457L6642Q2044O1902J1450N548p6844
13681B55927r0984n5346n4470p3193q1685n70J06753N1690k497q1741n48O4855
$$ plain form
13762 -128711 -111562 -131743 -188143 -269207 -287202 -196995 -6481 105195 82583 -62339 -41712
13751 -41712 -87400 -97585 -105232 -5639 131170 173285 87640 -9903 87033 12248 -79001 -144365
13739 -144365 -93177 -85221 -23352 -43371 -29563 -11905 -67196 554 -54415 -78879 -51253 -143595
13727 -143595 -174875 -168732 -89587 -56015 -62193 -126804 -140068 -242437 -294795 -280883 -145897
13716 -145897 -136017 -157444 -45617 -10298 40766 57285 40305 5157 2025 26312 121905 112713
13704 112713 47015 6753 -84238 -206485 -147813 -35567 21882 20566 50906 88871 83882
13693 83882 122180 120519 81058 86255 116728 135185 171827 253871 315773 327223 332771 255927
13681 255927 164943 109597 55127 -18066 -99751 -100321 6432 58122 55625 -26116 -26664 38191
13669C8191R5110k7488r3069j6519o129J1365P7362p8531j3763J13522R5893m7023
13657A48921L8854o5647j74626j8070P7861K0745N8453K6100j33372r7756J7834
13646a00703Q0666m9855j17312j60176Q7029J04159L6529J47599L611p7518k2361
13635f8332O8283r7484m6452k5606L8591L3823j6160J85973K9773j17193j41398
13624a56182r200L2782R1624P4752r8600O4682L6261j15302M4192l434p1616j2617
13612a22658o91j5194J19220p300J31523o4725o0232j73091p1721L6324j6545
13601b45090j2059K8930J36096N4047n2573M9764n6525J5954r5663q1093N8598
13590a99614L2877J8949l0881M7041m0873N529m6973P6088N4675L0771L1319N1814
$$ plain form
13669 38191 133301 105813 12744 -3775 -9904 1461 78823 292 -13471 100051 195944 148921
13657 148921 187775 122128 -52498 -70568 7293 28038 86491 112591 -20781 -118537 -100703
13646 -100703 -20037 -69892 -187204 -347380 -260351 -156192 -119663 27936 31547 -45971 -68332
13635 -68332 -49 -97533 -143985 -169591 -131000 -97177 -113337 72636 102409 -14784 -156182
13624 -156182 -165382 -132600 -40976 33776 -64824 -142 36119 -79183 -34991 -38425 -110041 -122658
13612 -122658 -123349 -138543 -19323 -26623 104900 40175 -20057 -193148 -264869 -228545 -245090
13601 -245090 -257149 -228219 -92123 -38076 -90649 -40885 -97410 -81456 -177119 -258212 -199614
13590 -199614 -166737 -147788 -178669 -131628 -172501 -166972 -213945 -137857 -83182 -52411 -21092 30722
13578C0722j10260j50313J09668K75185k5951o0476j4669o7420j24352k1745J65255
13567E644J90096q6057p2297R2445j16505k11456r1105J14376R4838L1012n2752
13556a01761k0891m719q7257K5566R7482K8845J04505L5764n7298P4992l2896
13545F2332j7298O4617j8640j60667m0666N5233n9246j18441k8722p3280o1420
13534c96198P7381J76426J36986K4778L6182L4435R6388j49665r1386R2741O6642
13523A04710M8387m8320j07698L6887J5926J4464M4607j5156N861R522N106j0862
13511A03434m1962L0844j21414l0044L0792K5866L85m6493J2204M7386J6227N3667
13499H0892J0722q2707K7748l5631L3592r2137j90008J16672J69923j4550q9075
$$ plain form
13578 30722 -79538 -229851 -120183 155002 129051 68575 53906 -13514 -137866 -159611 5644
13567 5644 195740 109683 37386 129831 13326 -198130 -289235 -174859 -80021 -49009 -101761
13556 -101761 -122652 -127371 -214628 -189062 -91580 -62735 41770 77534 20236 95228 62332
13545 62332 45034 109651 91011 -69656 -110322 -55089 -114335 -232776 -261498 -334778 -396198
13534 -396198 -318817 -142391 -5405 19373 55555 89990 186378 36713 -54673 38068 104710
13523 104710 153097 104777 -2921 33966 49892 64356 108963 93807 99668 109190 114296 103434
13511 103434 61472 92316 -29098 -59142 -28350 -2484 -2099 -48592 -36388 10998 27225 80892
13499 80892 91614 8907 36655 1024 34616 -57521 -247529 -130857 39066 24516 -64559
13488f4559q3169o4592L4992J4897N599o2717O1872N5905N4486K0602k05609j05919
13476c38212q6655M4752R5030J57110O7676K0773k3961J6695j6829j6409R600
13465g0430l6952r769J28546J79103k2229j03701L2047n0417k2853M0144P5167
13454A38656K7798O478j40203o8378R948N7769j044q972l7023r2483L6874O9628
13442i52M5609q7841o4466J9442o5860R5783J13596N4095l6577n0347l4619q7749
13430i9886k616M6387l4059O496J4020N0237k8965R1327R1258o3795N9622N7397
13418A87423j86170j26582P4349L2682n0798r2422M0572P9458O1313n1104k12146
13407b43425m4218J50316J2490O6802R5090l6923j05825l7892J2545J00730j13654
$$ plain form
13488 -64559 -147728 -212320 -177328 -162431 -156832 -219549 -157677 -101772 -47286 -26684 -232293 -338212
13476 -338212 -424867 -380115 -285085 -127975 -60299 -39526 -63487 -46792 -63621 -80030 -70430
13465 -70430 -107382 -117151 11395 190498 168269 64568 96615 46198 23345 63489 138656
13454 138656 166454 172932 32729 -35649 -25701 32068 31024 22052 -14971 -107454 -70580 -952
13442 -952 44657 -43184 -107650 -88208 -154068 -58285 55311 109406 72829 22482 -12137 -99886
13430 -99886 -102502 -56115 -90174 -83678 -69658 -19421 -48386 42941 134199 70404 130026 187423
13418 187423 1253 -125329 -50980 -18298 -69096 -161518 -120946 -41488 19825 -31279 -243425
13407 -243425 -287643 -137327 -124837 -58035 37055 132 -105693 -143585 -131040 -30310 -143964
13396a43964Q9295N4457P299O7198l4609J815m2159N9283l211j19864r3536Q3611
13384g4385M6343Q4910O1994l9125q3357M2168P595L8612r681K8891K2577m2258
13372H4284K6092O7530j59180j75329J8325O9694m4018q00o93P0679J2434J3990
13360a6992j932n5398j3365P2521J00899M5481L3052l00453j24374R9222Q9971
13349g1368M5477p9220o727m0079R1007O3517J12332J28215M4584j61465j65036
13338c8763j6855J18385O5619q7453o4803j8697j2264m2530l8204p0117n0832
13327b56514J61035Q1385O6582R5880k7803L8355o2397M917R9717l6347l4509
13316A30301K1583o0922j13975q7612k6029R4275J07781R555J8874P4027j95285
$$ plain form
13396 -143964 -54669 -212 7087 74285 39676 41491 -668 58615 55404 -64460 -157996 -74385
13384 -74385 -28042 56868 118862 79737 -3620 38548 46143 84755 75074 103965 126542 84284
13372 84284 110376 177906 18726 -156603 -138278 -68584 -112602 -113402 -114095 -43416 -30982 -16992
13360 -16992 -18924 -74322 -87687 -15166 85733 131214 164266 -136187 -260561 -161339 -71368
13349 -71368 -25891 -105111 -111838 -151917 -60910 2607 114939 243154 287738 126273 -38763
13338 -38763 -55618 62767 128386 40933 -23870 -42567 -54831 -97361 -135565 -205682 -256514
13327 -256514 -95479 -14094 52488 148368 120565 158920 96523 101440 201157 164810 130301
13316 130301 151884 90962 -23013 -110625 -136654 -42379 65402 74957 93831 167858 -27427
13305b7427q0684m4175k0494o0986K5186J54092L6976m164k1435M2296k0962J06193
13293H4416J07372j43233q8299J16902o0189j11372l7020o3872R0363N3842O5537
13282A4447M2809p2706q2527j06923P597M5085K0875Q1583O3599k6017K1087l355
13270E554p8515j19852j0718N2569L2354j15195o144O4633P6359J28414o2800
13259c3341r7380j78490J30683K41757J4018j52208J00291J28308r072O3039N9846
13248B67451q0660j23738N1401J08380J5790N4739j49384j84277p5936J89573
13238G3339J30494r3478L3433n0062P935L5828j13398j43300o4824J1226J4558
13227a58249K1800J9277K9011o7042n3497J6314n0352k0572K51505R1446q4819
$$ plain form
13305 -27427 -108111 -152286 -172780 -233766 -208580 -54488 -17512 -21676 -43111 -815 -21777 84416
13293 84416 191788 48555 -39744 77158 16969 -94403 -131423 -195295 -104932 -51090 14447
13282 14447 57256 -15450 -97977 -204900 -197303 -152218 -131343 -49760 13839 -12178 8909 5554
13270 5554 -72961 -192813 -203531 -150962 -118608 -233803 -239947 -175314 -98955 29459 -33341
13259 -33341 -130721 -309211 -178528 63229 77247 -74961 25330 153638 144566 207605 267451
13248 267451 186791 63053 114454 222834 238624 293363 143979 -40298 -116234 73339
13238 73339 203833 110355 143788 93726 101661 137489 24091 -119209 -184033 -172807 -158249
13227 -158249 -136449 -117172 -88161 -155203 -208700 -192386 -242738 -263310 -11805 79641 -5178
13216e178m854J41592j07635j97585l3626K224N4285J25677k7249r6687q3455
13205b32491J62082J28190k8730l5144j0890L7784L4999l4385K0012k6083j13663
13194i8319o3493O28n3195P0552l2916R8755J24572p1801l2644j5487N3947N6536
13182C7135M2458K7692j3872m4471L1704p7392o3742j8188L7589l027k9801n0042
13170a23957k4173j15058R3156J83650L8741p3974L2855o459j5330m9963K6158
13159c4354P4727p9227j08860q0547J07043R4958k2745J02133J47062L4100r9564
13148A34726q377j28314j13513O95L2735p1019N6285k1865n2340O4163Q5836J02058
13136H1070j7582j14220l2839J10593M0892k2047l7409J18339o6233o3384m1431
$$ plain form
13216 -5178 -10032 131560 23925 -173660 -207286 -205062 -150777 -25100 -52349 -149036 -232491
13205 -232491 -70409 57781 29051 -6093 -16983 20801 55800 21415 41427 15344 -98319
13194 -98319 -161812 -161184 -214379 -143827 -176743 -77988 46584 -25217 -57861 -73348 -19401 37135
13182 37135 79593 107285 93413 48942 80646 3254 -60488 -78676 -41087 -44114 -73915 -123957
13170 -123957 -148130 -263188 -170032 13618 52359 -21615 11240 4781 -10549 -60512 -34354
13159 -34354 40373 -38854 -147714 -228261 -121218 -26260 -49005 53128 200190 234290 134726
13148 134726 126349 -1965 -115478 -114783 -82048 -153067 -96782 -118647 -170987 -106824 -20988 81070
13136 81070 63488 -50732 -83571 27022 67914 45867 8458 126797 60564 -2820 -44251
13125d4251j31856M743L0877J32051m7778k6694o6684l0733R2525k1949o7636
13114a77385J15098N7793M8814J5817J22800m797q9771M3538Q8064l9006j05917
13103G5048O0549R465o9136o4893k0296P5403Q829K3718o7612k2280J02659N4248
13091A65702j2076j08806j24531k583n1454j1116k4738K16728o4729O709j34890
13080a45784O18Q8465N7134Q1013j58345M0272J26114k5070o7188Q3203J20673
13069B01105n4474m2345j21750N6312J77300k2252k20398j10374M0884o6677J36968
13058b5701J78888j03321l8530O589O3635n1116J1531L093j8238l9623o1822L2780
13046d1835J24325J01511M0816j85804k00407j143q744J2150j6504n3770J56243
$$ plain form
13125 -44251 -176107 -171364 -140487 -8436 -56214 -82908 -149592 -180325 -87800 -109749 -177385
13114 -177385 -62287 -4494 44320 60137 182937 178140 88369 131907 219971 180965 75048
13103 75048 135597 145062 75926 11033 -9263 66140 74969 98687 31075 8795 111454 165702
13091 165702 153626 44820 -79711 -82294 -133748 -144864 -169602 47126 -17603 -10894 -145784
13080 -145784 -145166 -56701 433 81446 -76899 -36627 89487 64417 -2771 80432 201105
13069 201105 146631 104286 -17464 38848 216148 193896 -26502 -136876 -95992 -162669 -25701
13058 -25701 153187 49866 11336 17925 81560 30444 41975 45068 26830 -12793 -74615 -41835
13046 -41835 82490 184001 224817 39013 -161394 -162537 -171281 -159131 -175635 -229405 -73162
13035g3162R1551m400j51902l0737R1875J60268L882m6787M437j04858l7887J29829
13023C2109J9956M5712j14335j28573l4369K3313J8075K4458j8323O9612J53451
13012I1086k3683j19241k29067K6378J64600J54425L1924k6339p9602r4367L729
13001a00157m642Q2994j3214m9337N080J09742p43j781K0648r955j9374L0063
12989D9324k3365p9006q4677r7201n3404J8314J71224J788J7869J56029J2214
12978H9109o794Q2107q2201k3313l9224j01829m7563J1424k9771P0163M9166m7982
12966g6708j7630K9491J0595o6525L409R4729P0921R896O8868j66690n6309m6762
12954a42715J5543K9787L531J0308J00131Q1767r2799j25614j11386n1270p8122
$$ plain form
13035 -73162 18389 13989 -137913 -168650 -76775 83493 87375 40588 45025 -59833 -97720 32109
13023 32109 52065 97777 -16558 -145131 -179500 -156187 -138112 -113654 -131977 -62365 91086
13012 91086 67403 -51838 -280905 -254527 -89927 64498 96422 70083 -9519 -103886 -100157
13001 -100157 -104799 -21805 -35019 -84356 -79276 30466 29723 27942 48590 38635 19261 49324
12989 49324 25959 -53047 -137724 -234925 -288329 -270015 -98791 -97003 -79134 76895 89109
12978 89109 82315 164422 82221 58908 19684 -82145 -129708 -118284 -148055 -77892 -28726 -76708
12966 -76708 -94338 -64847 -54252 -120777 -117368 -22639 48282 58178 127046 -39644 -95953 -142715
12954 -142715 -127172 -97385 -93854 -83546 16585 98352 5553 -120061 -231447 -282717 -360839
12943c60839K7426J44729M9233P153R065j766q1773p03O4396N8916K5562j0590
12931f9191L5542Q271k6146k2567k6237n4530q5700J39019M1169N4170L6769L895
12919C4464l8662J30553L1442J720j06600O9630Q8425k957p6265j9498m7252l6151
12907B8849J929N8126j40918j95021O620j3074M4399J35383L6197m7450p0669
12896a55629J2653o6130m1718J80860j06498k8568K8057L4587M0174M6890P3141
12885A7819n2202j34619Q1731J88095M5438j30205j2219J73266O0229j76610l1827
12874B8896q4019M3359J42931l7812r312j8477N8124L105M537J10179l8202j42197
12862F1112l3200l3007J6992L7550m6607m9454p7643j23614j5144K8481K09998
$$ plain form
12943 -360839 -333413 -188684 -139451 -132298 -123233 -124999 -206772 -207475 -143079 -84163 -58601 -69191
12931 -69191 -33649 -25378 -51524 -74091 -100328 -154858 -240558 -101539 -60370 -6200 30569 34464
12919 34464 -4198 126355 157797 159517 52917 122547 210972 208015 131750 112252 65000 28849
12907 28849 30778 88904 -52014 -247035 -240415 -253489 -209090 -73707 -37510 -84960 -155629
12896 -155629 -142976 -209106 -250824 -69964 -176462 -205030 -176973 -142386 -102212 -55322 17819
12885 17819 -34383 -169002 -87271 100824 146262 16057 3838 177104 237333 60723 28896
12874 28896 -55123 -11764 131167 93355 84043 65566 123690 126795 131332 241511 203309 61112
12862 61112 27912 -5095 11897 49447 2840 -46614 -124257 -247871 -263015 -234534 -24536
12851b4536j4734j18269J620k9829n3327K6804O6472l3201r4295j3535J07348
12840a79482J82462k7626j11202P5677P3164K5204m8713q5503N2993p1378o8959
12829a83363J06748m6240k6208K5257J68564l543L9916K9870l3336m7731l05j9417
12817A0212j7463J4262o568j07933J7360R1229K53541o5887j90752q3837l0368
12806a16204n0037k4343l1057K2591J42539J07154l9444k19876j890K0789O2022
12795a27756o8962J10569R2679o1838P4643R0250j52513j9434J22105K1106M7404
12784A28253L017q994O5049k526m5397M7645N6668j6056k10021j87659l7319N9509
12772a47831n2262m4206J10365K05033O8548m721q8011k22487M755J00692L7513
$$ plain form
12851 -24536 -39270 -157539 -155919 -185748 -239075 -212271 -145799 -179000 -273295 -286830 -179482
12840 -179482 2980 -24646 -135848 -60171 12993 38197 -10516 -96019 -43026 -114404 -183363
12829 -183363 -76615 -122855 -149063 -123806 44758 41215 81131 111001 77665 29934 29629 10212
12817 10212 -7251 7011 443 -107490 -90130 1099 254640 188753 -1999 -85836 -116204
12806 -116204 -166241 -190584 -221641 -199050 -56511 50643 11199 -208677 -210567 -189778 -127756
12795 -127756 -196718 -86149 6530 -55308 19335 109585 -42928 -62362 59743 80849 128253
12784 128253 131270 122276 187325 184799 139402 187047 243715 227659 17638 -170021 -207340 -147831
12772 -147831 -200093 -244299 -133934 71099 139647 134926 46915 -175572 -170817 -70125 -32612
12761c2612m197J00282N4111n9600o4482j27120j29188J67219R5226l8556J16005
12750G7088M8850l7131k8220p450K2314J47055N5641o5785j5790j24916l8560
12739C3096j1313l4515l4763o507M2573m1160j16992O4940K7997M1663J40342
12728A05361R4587o2676j13607M2510r3613r1747j04316j06249Q1004K6314K4992
12717a97440J67695N7499l5206M463j01375P953J21530m88o0955N9292R7065j509
12705A18524n0585M3523L0460O6935j65073o3607R934P7763L4136p8806O1755
12694H4959r0258o2201j2306N1382N2097o4169k2002J2693j98345j38268l331
12683c89749J58935O8813M1063l8979K5792M1651Q8396K7807M0408M3789P1262
$$ plain form
12761 -32612 -36809 63473 117584 57984 -6498 -133618 -262806 -95587 -361 -38917 77088
12750 77088 125938 88807 60587 53137 75451 222506 278147 212362 196572 71656 33096
12739 33096 21783 -12732 -47495 -54002 -11429 -52589 -169581 -104641 -76644 -34981 105361
12728 105361 199948 137272 23665 66175 -27438 -119185 -223501 -329750 -248746 -222432 -197440
12717 -197440 -29745 27754 -7452 -2989 -104364 -96411 25119 24631 -36324 22968 120033 118524
12705 118524 67939 111462 141922 208857 43784 -19823 -9889 67874 102010 23204 84959
12694 84959 -5299 -67500 -79806 -28424 23673 -40496 -62498 -49805 -248150 -386418 -389749
12683 -389749 -230814 -162001 -120938 -159917 -134125 -92474 -4078 23729 64137 107926 179188
12672A79188p9879j27887K8829m1299l2591J65454L9826k57934l9936Q6753K9162
12661e0314Q2356r3397j2321L7342k9966j22279j20461O8472J61339P1933J9975
12650A2679r2346j28602J50286J14839M6368q6562K9011n5292j57758J37518M4479
12639A4620J9062R1876l6681k5837j47421k6392R1687L9719k3949K3922k4733
12628d127m7139n1141k6613J89584N3596p323l8349N2875J63378p9072j21931
12617H3738j3833m5466j8164m64R9913J67615q2907r2668K2371N824k8295q3237
12605A4427N0114J25130l5849L2989N5644l7884l9939m5296j57976j20099R9421
12594e9318J05733o973p7911O3771J96221J14808k04020j23273P202O0328J18179
$$ plain form
12672 179188 99309 -28578 251 -41048 -73639 91815 131641 -126293 -166229 -79476 -50314
12661 -50314 32042 -61355 -73676 -36334 -66300 -188579 -309040 -240568 -79229 -7296 12679
12650 12679 -79667 -208269 -57983 56856 103224 16662 45673 -9619 -167377 -29859 14620
12639 14620 33682 125558 88877 63040 -84381 -110773 -19086 20633 -3316 20606 -4127
12628 -4127 -51266 -102407 -129020 60564 114160 106837 68488 121363 284741 205669 83738
12617 83738 69905 24439 6275 5811 105724 273339 190432 97764 120135 125959 97664 14427
12605 14427 64541 189671 153822 186811 242455 204571 164632 119336 -38640 -158739 -59318
12594 -59318 46415 39442 -38469 25302 221523 336331 132311 9038 16240 76568 194747
12583A94747o3868l3029O5678k5137M950K0247j43994r0854J12063Q808J03656
12572A53267p485J3228l5839n6058n3098N8578P9400o9454j29399m5209J46213
12561E4144l2960l1050j2767K0093R9655L8473J4641O8141L170q4523r8395O4737
12549A03359N139j3429n7053o7556P6567k1637Q1516Q9970j8272N2768J0719r0351
12537A51740Q7791j5374j30251n1398m0867k7249m7302R835M5489O4047q5620
12526c9159j40230J74105J12736m4429n4252J10216K590q774j4937j496j8703
12515G7667r1436j93573q8228K2641M1667M797J85565J30118j09919q7644J02814
12504e531J3038Q3379K48640q2181j94121r9443k9866O0788L5960o274n7585l7427
$$ plain form
12583 194747 130879 97850 163528 138391 143341 163588 19594 -71260 40803 49611 153267
12572 153267 145782 159010 123171 67113 14015 72593 151993 82539 -46860 -92069 54144
12561 54144 21184 -9866 -22633 -2540 97115 135588 150229 218370 221540 137017 38622 103359
12549 103359 108498 95069 38016 -29540 47027 25390 106906 196876 178604 231372 242091 151740
12537 151740 239531 224157 93906 42508 1641 -25608 -72910 -63075 -17586 46461 -39159
12526 -39159 -179389 -5284 107452 63023 8771 118987 121577 112803 97866 96370 77667
12515 77667 -13769 -207342 -295570 -272929 -231262 -226465 -40900 89218 -20701 -108345 -5531
12504 -5531 7507 90886 339526 257345 63224 -36219 -66085 -5297 30663 24389 -33196 -70623
12492g0623J58390N9614m6452K0196M3719O4841n131O090n3375j6026K7503o3363
12480A25383p5815l3745o7152N7031K1722j8341q2214o1076j025k134K4397J21115
12468H146J54137M5624L6293J4511K8583N102j72042j1164N1085M6638q3369q784
12456A14760P0151m4752j29178l0646p996K1273R4650p6700j01389L092j45852
12445b32587P9804K14323q6994p59Q5062n7108O072O4493N2376J6662j54348Q6975
12433G3971O3915j09840n7030k528J3374J05433r1300o4454r2141J57907J04345
12422A01652M4552l443o5321q6102m9429M2302J24040J21828p0938l433l6798
12411A18910l1948j8630J3672m8503n3236J58254P8566k5988j714j8537q7508
$$ plain form
12492 -70623 87767 147381 100929 121125 164844 229685 224554 230644 177269 161243 188746 125383
12480 125383 49568 15823 -51329 5702 27424 9083 -73131 -134207 -135232 -137366 -112969 8146
12468 8146 162283 207907 244200 258711 287294 292396 120354 109190 160275 206913 123544 114760
12456 114760 184911 140159 10981 -19665 -27661 -6388 88262 11562 -89827 -86735 -232587
12445 -232587 -152783 61540 -25454 -26213 58849 1741 7813 72306 124682 141344 -13004 73971
12433 73971 137886 28046 -28984 -31512 -18138 87295 -4005 -68459 -160600 -2693 101652
12422 101652 146204 142761 77440 -8662 -58091 -15789 108251 230079 159141 155708 118910
12411 118910 86962 68332 82004 33501 -19735 138519 217085 191097 189383 170846 83338
12400H3338n6444J12162N4464j56350r6726k1969N3669O5636J1612K32322k8252
12389B53462n0172l5068n0027M976J14762J54409j89253k11544l076L6424P3912
12378I8805M6006J4274O832P0737j4742r292j13420K5531J46496J5876n4281P57
12366B33579P0375l2414k7944j87333m6893N6459L8747L7341J28398J01904n7916
12355C14303r8419j6016P6526J08484J1808j03972r5177m0553n9492J32485J09260
12344C39237m4840o2675n4872P5987j21898j2516J14900j4220n5495J4810K6784
12333B05202j2869N373j26696J04526L6739m3298m3934j21752m0333K923K8640
12322e479P3880K7011K3304n9853k2183P3835j1590P7363q6939j37606j04755
$$ plain form
12400 83338 26894 139056 193520 37170 -59556 -81525 -27856 37780 49392 281714 253462
12389 253462 203290 168222 118195 123171 237933 392342 203089 -8455 -11531 24893 98805
12378 98805 144811 159085 165917 236654 221912 212620 99200 124731 271227 287103 232822 233579
12366 233579 303954 271540 243596 56263 9370 65829 104576 141917 270315 372219 314303
12355 314303 215884 199868 276394 384878 396686 292714 197537 156984 97492 229977 339237
12344 339237 294397 231722 176850 252837 130939 118423 233323 219103 163608 178418 205202
12333 205202 192333 197706 71010 175536 212275 168977 125043 3291 -37042 -34119 -5479
12322 -5479 68401 95412 118716 58863 36680 110515 98925 176288 89349 -48257 -153012
12311a53012k7005R2873m110P2502P1658L7058J7754J23185J5823N2567O9640
12300C68933j10987k030K9616m432M8618o8054k1449j9673p6109L2103M5427j9439
12288B02524l8521J41507R8146j90263q523k0728o394P5548k1226n3812K6888
12277B05146O6523m095m7295o266J19489N8869o1701j55026K0354Q8755L9773
12266C24526j22342o3911K8049j34107m1536J7564P855J00697J25068n4761n5456
12255A31646R0341n7362l3412r857N5716P0994J7952r5246j00750O505l942J3916
12243H6501N9700P9007J2021M1350P9007K1694M3393O6585n7593j88820P5692
12232C18537N7190j2244j84236j5757J13751M3752o322q8133j5911l0428K9610
$$ plain form
12311 -153012 -180017 -87144 -91254 -18752 52906 89964 107718 230903 246726 299293 368933
12300 368933 257946 255916 285532 281100 329718 261664 240215 220542 144433 176536 221963 202524
12288 202524 164003 305510 403656 213393 204870 184142 177748 253296 232070 178258 205146
12277 205146 271669 267574 220279 214013 333502 392371 330670 175644 195998 284753 324526
12266 324526 202184 138273 166322 32215 -9321 8243 16098 116795 241863 187102 131646
12255 131646 221987 164625 131213 121356 177072 248066 266018 170772 70022 76527 72585 86501
12243 86501 146201 225208 237229 278579 357586 379280 422673 489258 431665 242845 318537
12232 318537 375727 363483 179247 163490 277241 320993 314671 226538 210627 180199 209809
12221B09809N8152P0315J45180k3312M7028J30606K4631j61724m7521p5589L9158
12210D16733J55665j9435j07890j47988n9869j5149Q6527J02795R7983Q2689L6331
12199F28392r091M5734j7531M6481j31817j26986L2370m232Q6886J16585k1898
12188F44893j0750r1640j23348J040O2802j5238n4344m9026j7983k518P9561p6005
12176C47444J19336R0791L1093P263n4652n6211K2461l9864J5951J82596J0596
12165F76804n8971J5085L0642J4857l9792k3792r1654L2546O5789J6782L5021
12154F73317l7662J3520l4300N8443J57447J3762n2611p0339R513J2058k972m1455
12142F98721K8897k0928r3282J8952P432Q1682J5904K4290J3091r4882P8768J17884
$$ plain form
12221 209809 267961 338276 483456 460144 507172 637778 662409 500685 453164 377575 416733
12210 416733 572398 552963 445073 297085 237216 222067 308594 411389 509372 592061 628392
12199 628392 619301 665035 647504 693985 562168 435182 467552 463320 550206 666791 644893
12188 644893 634143 542503 419155 420195 482997 467759 413415 364389 346406 343888 423449 347444
12176 347444 466780 557571 588664 595927 541275 485064 507525 467661 483612 666208 676804
12165 676804 617833 632918 663560 678417 638625 614833 523179 555725 621514 638296 673317
12154 673317 635655 649175 614875 673318 830765 844527 791916 721577 731090 743148 740176 698721
12142 698721 727618 706690 613408 632360 639792 721474 737378 761668 774759 679877 758645 876529
12130H76529j661o0593L9110n5701k6731Q971K20102J62504q437j89434j90287
12119G74372j3563J09395q5663k02407j4096L1464N0643k6627o7283L7880J28445
12108G22560O7211J0043L4889K3869J7906J24341K02691p8051r7386K1925M3999
12097A093997m8448j39677l3525J20786J44576J91771Q5417K4613k0128K239p4806
12086A346815r7668M8399K8163Q694j6677n8607N8974Q3097j53197n1893J02947
12075A299047J45205L8532j3708p5292l4700n410O6530J68287M2706j890j2112
12064A617195m9291M5617O49Q0713J1361J01808J47889J0252l0445o773j2325
12053A916650J47577p1014R189J25798K1182O4012O5218L8904Q7806O3556n1173
$$ plain form
12130 876529 874868 814275 853385 797684 770953 779924 1000026 1162530 1154093 964659 774372
12119 774372 760809 870204 784541 582134 568038 599502 650145 623518 556235 594115 722560
12108 722560 789771 799814 834703 858572 876478 1000819 1203510 1125459 1028073 1049998 1093997
12097 1093997 1045549 905872 872347 993133 1137709 1329480 1414897 1439510 1419382 1421621 1346815
12086 1346815 1249147 1297546 1325709 1334403 1317726 1259119 1318093 1401190 1247993 1196100 1299047
12075 1299047 1444252 1482784 1469076 1393784 1359084 1353674 1420204 1588491 1631197 1629307 1617195
12064 1617195 1567904 1613521 1614170 1694883 1706244 1808052 1955941 1966193 1935748 1928975 1916650
12053 1916650 2064227 1993213 2002402 2128200 2149382 2213394 2278612 2317516 2405322 2468878 2417705
12042B417705J40967Q6284r3048P6455R2813J09415N2735M5110M5269o6977l9206
12031B867522l1138J6681J01424N3562J95215J77426J97684N1480K5245P2697
12021C727798J4732P6009J15147j20033L9704K8365J32088J70747Q1579N8337
12011D324473J68816K16375K3823M1202O8382J28021M3953J48519N4736J28428
12001E346728L43303K40860N9585J16953l1145R5921J48371L40823K02193K45595
11991G109187N8808P9513J85999K59619M70179K01537K90228J88540J94616L20541
11981I358767L28785K62254J89212J51700L39619M48132L27980L84863M21942
11972A2213254M66981N91052N55386M11280N72526O38811O03894O32427O94657
$$ plain form
12042 2417705 2558672 2644956 2551908 2628363 2721176 2830591 2883326 2928436 2973705 2906728 2867522
12031 2867522 2836384 2853065 2954489 3008051 3203266 3380692 3578376 3629856 3655101 3727798
12021 3727798 3742530 3818539 3933686 3813653 3853357 3881722 4013810 4184557 4266136 4324473
12011 4324473 4493289 4709664 4733487 4774689 4843071 4971092 5015045 5163564 5218300 5346728
12001 5346728 5690031 5930891 5990476 6107429 6076284 6172205 6320576 6661399 6863592 7109187
11991 7109187 7167995 7247508 7433507 7693126 8163305 8364842 8655070 8843610 9038226 9358767
11981 9358767 9687552 9949806 10139018 10290718 10630337 11078469 11406449 11791312 12213254
11972 12213254 12680235 13271287 13826673 14237953 14810479 15449290 16053184 16685611 17380268
11963A7380268P20112O39610P00381Q05288Q52515R64282Q66324R85716J150379
11954B5064875J192891J195183J237662J330651J385959J581018J523090J548872
11946C6060201J476504J542284J764235J893249J758367J865411J984411K068967
11938E0413629K063037K141912K087524J986018K016994J868141J712211J607557
11930F5897023J322146J281080J159217O85542K83386L42666J17962l74060o12527
11921G0102435q88031j094743j084710j300133j608310j823531j793314j782127
11913E8727536j959064k051035j965512j947978j814055j806163j862076j865595
11905D3456058j789006j764646j644281j585648j546908j308412j392432j328267
$$ plain form
11963 17380268 18100380 18739990 19440371 20245659 21098174 22062456 22928780 23914496 25064875
11954 25064875 26257766 27452949 28690611 30021262 31407221 32988239 34511329 36060201
11946 36060201 37536705 39078989 40843224 42736473 44494840 46360251 48344662 50413629
11938 50413629 52476666 54618578 56706102 58692120 60709114 62577255 64289466 65897023
11930 65897023 67219169 68500249 69659466 70345008 70628394 70971060 71089022 70714962 70102435
11921 70102435 69214404 68119661 67034951 65734818 64126508 62302977 60509663 58727536
11913 58727536 56768472 54717437 52751925 50803947 48989892 47183729 45321653 43456058
11905 43456058 41667052 39902406 38258125 36672477 35125569 33817157 32424725 31096458
11897C1096458j370913j254311r93920r65583j069040j054701j051772r18811
11889B2417407q52826q75494q19034o98399p96010n90620o39334n39576n68780
11880A6037334n55663n21319n69502m79844m34672m03830l88296n62798n13477
11871A1607933l03244l18768n31082l08180k92021l73770k20842k24393k38506
11862H797127l10638k19979j04260k60807k34099k33165j95155j33549r3881j91521
11852F820073o1845q3597k15679k04353l29714k57354j30951j03576p6571q5135
11842E271298j09277j18725l254L5022j36496q2631j08894j84080r0414j32435
11832D340114j93620k19j97955j34118K1774O4549j3735k29977j65258m7419j58828
$$ plain form
11897 31096458 29725545 28471234 27477314 26511731 25442691 24387990 23336218 22417407
11889 22417407 21564581 20689087 19870053 19171654 18375644 17785024 17145690 16606114 16037334
11880 16037334 15481671 14960352 14390850 13911006 13476334 13072504 12684208 12121410 11607933
11871 11607933 11304689 10985921 10454839 10146659 9854638 9480868 9260026 9035633 8797127
11862 8797127 8486489 8266510 8162250 7901443 7667344 7434179 7239024 7105475 7011594 6820073
11852 6820073 6758228 6674631 6458952 6254599 5924885 5667531 5536580 5433004 5356433 5271298
11842 5271298 5162021 5043296 5040042 5075064 4938568 4855937 4747043 4562963 4472549 4340114
11832 4340114 4146494 4146275 3948320 3814202 3835976 3900525 3886790 3656813 3491555 3444136 3285308
11821C285308j00331p6138J8354k4587K149j19190o2825m8745k400l0514j26574
11810B714507o8425L1172l8299n6422j47487r5660q9902J02590Q2885p8049p5783
11799B281127Q7114j47851p6744m5639r3399L9661n2362m5447m6987O3828k389
11788A960912K6202O6678q8789j02925N2431L4097m9976k12415k20307J1130k3576
11777A453462N0834p2958m7493M5044J0753O5896J15820M9323l0136M8694o4171
11766A625068q8858j81913K2198n167M2733M9078q0324J7091j22013q4837m1818
11755A151238Q4493M1637j5088L2965M9226r3053O1358Q7984n3285p2796q5581
11744A189098n8175K2445p0350n7675M8939L7167k8446M9558k6875j40839j08959
$$ plain form
11821 3285308 3184977 3108839 3127193 3102606 3104755 2985565 2922740 2873995 2871595 2841081 2714507
11810 2714507 2646082 2677254 2638955 2582533 2435046 2339386 2249484 2352074 2434959 2356910 2281127
11799 2281127 2368241 2220390 2143646 2098007 2004608 2044269 1991907 1946460 1899473 1963301 1960912
11788 1960912 1987114 2053792 1965003 1862078 1914509 1948606 1898630 1686215 1465908 1477038 1453462
11777 1453462 1504296 1431338 1383845 1428889 1439642 1505538 1621358 1670681 1640545 1689239 1625068
11766 1625068 1536210 1354297 1376495 1371328 1414061 1463139 1382815 1399906 1277893 1193056 1151238
11755 1151238 1235731 1277368 1262280 1295245 1344471 1251418 1312776 1400760 1347475 1274679 1189098
11744 1189098 1130923 1153368 1083018 1025343 1074282 1111449 1083003 1132561 1105686 964847 855888
11733H55888o2301Q4107J31930K2916M1155j07140J5071j02527p329N5398m5894
11722H81274K1085j25016j57977j1305O3256R3307Q0298l1865j2835O0846r5692
11711G65376q5739R5698l7040o1693j32697R271J83973k3221m0185L977j7477
11700F60243l7000P0128R1465K9374j63998j36069Q5574J7914p9956O8186J12380
11689G18241l240o176j356J888L6404j8761m8067M467J4153q0450j52725K1953
11677D86331J27023P1676K2292R4014R0288j50155j43646q2419m9683L1971J60168
11666F57860L2668p4928j36105n7830Q543J45898K946p8827M277O8046k2335J7203
11654E67416o814o9984j88046j3641P1363r997J2825k7078R6154R325j26530n1611
$$ plain form
11733 855888 793587 877694 1009624 1032540 1073695 966555 981626 879099 871770 927168 881274
11722 881274 902359 777343 619366 608061 671317 764624 844922 813057 800222 861068 765376
11711 765376 679637 775335 738295 676602 543905 553176 737149 713928 673743 677720 660243
11700 660243 623243 693371 784836 814210 650212 514143 599717 617631 537675 605861 718241
11689 718241 715001 708825 707469 709357 745761 727000 678933 683400 697553 617103 464378 486331
11677 486331 613354 685030 707322 801336 891624 741469 597823 515404 465721 497692 657860
11666 657860 690528 615600 479495 421665 430208 576106 579052 500225 504502 572548 550213 567416
11654 567416 560602 490618 302572 288931 360294 350297 363122 336044 432198 441523 314993 263382
11642B63382M7836M1138P9292K0047j6207j39838j14624J21598J02397l9909m2756
11631C22356J36893K1109Q000P5325r2758k0682K2865J37291K349n6894k9774
11620E26080q2326m7609M9870L4280N9979j22537j08592n1666O2294k1213q2692
11609B15868Q5489P4138l8870l5771M9843N7740J377n329k359R8042M8382m0085
11597E08465j55738r3122R6186M2590r5816l8116O8318Q2074j67806j29125K8456
11586A46366J5707p2314K1197P3849J14206o282o2876l7107L193k1600K8741k33
11574B02847j0395J4112k5269j07287O3812J79895k8962p9204j21317O7096K17333
11563C72661n208j41504j68690l4484M5377R4106K920N1327R1898L141j64693
$$ plain form
11642 263382 311218 352356 431648 451695 435488 295650 181026 302624 405021 365112 322356
11631 322356 459249 480358 488358 563683 470925 450243 473108 610399 612748 555854 526080
11620 526080 443754 396145 446015 480295 540274 417737 309145 257479 319773 298560 215868
11609 215868 301357 375495 336625 300854 350697 408437 409814 404485 402126 500168 548550 508465
11597 508465 352727 259605 355791 398381 302565 264449 332767 414841 247035 117910 146366
11586 146366 162073 89759 110956 184805 299011 292729 229853 192746 195939 174339 203080 202847
11574 202847 192452 206564 181295 74008 137820 317715 288753 209549 88232 155328 372661
11563 372661 367453 225949 57259 22775 68152 162258 165178 216505 308403 311544 146851
11552A46851Q7248k7861k0924N3963O2532m4874j19733q2063p302N9122m9010
11541E7949P0927J02697J28348K6618j23156j16895L6745L0299j14056N4903j76019
11530b1640N0614J52822J43548N6161l9774n2982l003K8838p5246j05406j8067
11519A15865p2940N1593m2175J2012P1557J2348N1931n2009L6841j02070p8610
11508D343J32639Q1921j21291j12868J93331R8778K4808j20819P4781K05571J10545
11497E71739p1374j22535n7178p5850J35363M611r2181j59087k491j16705M3602
11486E7914Q6705r0559p4889O720r4528M6118O9980N9741Q5346N452k9608p86
11474A27606K0070j76430K3209P9301j0499n1082L5438J61027R156p2533n4753
$$ plain form
11552 146851 234099 206238 185314 239277 301809 256935 137202 55139 47837 106959 57949
11541 57949 128876 231573 359921 386539 263383 146488 183233 213532 99476 154379 -21640
11530 -21640 28974 181796 325344 381505 341731 288749 285746 314584 239338 133932 115865
11519 115865 42925 94518 52343 64355 135912 148260 200191 148182 185023 82953 4343
11508 4343 136982 218903 97612 -15256 178075 276853 301661 180842 255623 461194 571739
11497 571739 500365 377830 320652 244802 380165 384776 292595 133508 131017 14312 57914
11486 57914 144619 54060 -20829 -14109 -108637 -62519 7461 67202 152548 158000 128392 127606
11474 127606 147676 -28754 -5545 73756 63257 12175 47613 208640 217796 145263 90510
11463I0510R221p2604o1715O0297k7521J28900O0407l854j21001j00566P587O5711
11451C5372M8784M9473R2404J668M1634k2704j26200j35871n9960K4306O730P5820
11439C1456M9301r519n5353N9137p7598l5945R2024p2446k4288K0945Q523M8919
11427C5156m4839j620J44084j9780j06793o2805m1887M8770N9056M6257k5187
11416C0412o9259J2872P7141K2221J63926K02493l8373n9013j01050J21648M2766
11405D05784j06716j56628k9220P9549o4709o6577J404P5301L2321j23904n4094
11394g489J08048K6139k5670q8029K9378K1850j2727m1045r0630j46670J23868
11383a02977Q5957k2590J4201O5188K0177K0177o2623L0739J09703M2241M3983
$$ plain form
11463 90510 99731 27127 -34588 25709 -1812 127088 187495 183641 62640 -37926 -30339 35372
11451 35372 84156 133629 226033 227701 269335 246631 120431 -15440 -75400 -51094 -44364 31456
11439 31456 80757 71238 15885 75022 -2576 -38521 53503 -18943 -43231 -22286 -13763 35156
11427 35156 -9683 -11303 132781 113001 6208 -56597 -98484 -49714 9342 55599 30412
11416 30412 -38847 -25975 51166 73387 237313 439806 401433 342420 241370 363018 405784
11405 405784 299068 142440 113220 192769 128060 61483 62887 138188 170509 46605 -7489
11394 -7489 100559 126698 101028 12999 42377 64227 51500 10455 -80175 -226845 -102977
11383 -102977 -17020 -39610 -25409 39779 59956 80133 17510 48249 157952 200193 244176
11372B44176N7806l1851j42487j1603L8247k3474O1816N7348J0533j1890O137
11361B54758o2052q2422J0534N8817j35281O6172n0632j2856J1547m0676J58981
11350A76890J2806j54185j02810j0052J14414L2352k5084J08195j0614l1669L6737
11339A46980O9252L1065q0230j2880Q86R574k73P1673j82337m3927P7772K5650
11327A13205j00795j23982J10240K48915K71145n6041o2385m4373j0467q4512
11317B60950n9762M5328K4885q4388J6214J35040L4403k2196j44912j6238N270
11306A94594J1367r2382l6715R7463J74296n6632j42784k1327R5995j4377k3607
11295A85891R859n751J35092R9717k3445j6756J3757j7093o9286J065R437N6344
$$ plain form
11372 244176 301982 270131 127644 116041 154288 130814 192630 249978 260511 248621 254758
11361 254758 192706 110284 120818 179635 44354 110526 59894 47038 58585 17909 176890
11350 176890 189696 35511 -67299 -77351 37063 69415 44331 152526 141912 110243 146980
11339 146980 216232 247297 167067 154187 155073 164647 164374 236047 53710 9783 87555 113205
11327 113205 12410 -111572 -1332 247583 518728 462687 400302 355929 345462 260950
11317 260950 201188 246516 271401 187013 203227 338267 372670 350474 205562 189324 194594
11306 194594 205961 113579 76864 174327 348623 291991 149207 127880 223875 209498 185891
11295 185891 195750 189999 325091 424808 401363 384607 398364 381271 311985 313050 322487 378831
11283C78831L8157O9955M5314o9367J1621K4370J5475J06049o262j15926o8921
11272D29296J48234J6554n904J42858k1196n515K2383Q1954j57302k52959Q6415
11261D84818R4872N4531p7054l6805m2728Q4755o3060j44121p1748p3755j02661
11250A07044J29202J19409j04080p6211P1941J1637P6816P31J47660L6281n6559
11239D63871q4588q1365j42171J52543J56620N245J57301O1524P7706o0252j03149
11228F03285n90K352j9470r1473M5625r8144j62744J12819j21328j20636M941
11217A54637N4591J27886K069k6633L5499o5064r9682p4884K6578P5648n7940
11206A52705n9456o0879j20066j32238J75329J42967K9527j5512J5144K1865j34558
$$ plain form
11283 378831 416988 486943 532257 462890 474511 498881 514356 620405 614143 498217 429296
11272 429296 577530 594084 588180 731038 709842 704327 726710 808664 651362 398403 484818
11261 484818 579690 634221 557167 520362 477634 562389 499329 355208 283460 209705 107044
11250 107044 236246 355655 251575 175364 247305 258942 335758 336489 484149 520430 463871
11239 463871 379283 297918 155747 308290 464910 470155 627456 688980 766686 706434 603285
11228 603285 602695 605047 585577 494104 539729 441585 278841 391660 270332 149696 154637
11217 154637 209228 337114 339183 312550 348049 282985 183303 108419 134997 210645 152705
11206 152705 93249 32370 -87696 -219934 -44605 98362 127889 112377 127521 149386 14828
11195A4828j45496p3731P7207J07775K1081k433j19372n9706K62168P7914Q667
11184A68902j9199K5269j25259n6960L7649J4227J19229J87435M4698o8360j46403
11173A81228j21336P2127J3829M5596j2792k4513p5290R582O9286J54993M0831
11162C53541j94938j30356p910J38356L7466k7931j01198O9142J1005o4084j20607
11151c7514R0727R2345K0783l7557J37541j0197j3045j6306M9279n6146k7226
11140A92684J349J5519n8928O5950J047j28555j6178L8353j30485k325O7348O1288
11128A07067l81j26933j7572Q8448m0309j4201K06308P2348K0144o653k5817j01574
11116A60875j0652O1219l2113K9637N8365o4184M3072Q3427k8837j31287k4449
$$ plain form
11195 14828 -130668 -204399 -127192 -19417 1664 -769 -120141 -179847 82321 160235 168902
11184 168902 149703 174972 49713 -7247 30402 44629 163858 351293 395991 327631 181228
11173 181228 59892 132019 145848 191444 178652 154139 78849 88431 157717 312710 353541
11162 353541 158603 28247 20337 158693 196159 168228 67030 136172 147177 83093 -37514
11151 -37514 53213 145558 166341 128784 266325 256128 243083 226777 276056 219910 192684
11140 192684 194033 209552 150624 216574 217621 89066 72888 111241 -19244 -21569 45779 107067
11128 107067 106686 -20247 -37819 50629 10320 -3881 202427 274775 294919 288266 262449 160875
11116 160875 150223 211442 179329 208966 267331 203147 246219 329646 300809 169522 145073
11105A45073O9384N2729n0556o4782l9552j840j8906M5854l4456K191K1287R8544
11093B24970J4315M5799j14693j74175j00879J50468J02811m2149n8183P4252
11083A22536J49537N0745J1552L0082O3035p6295r3391l5677j9728J55345j1907
11072C45834o0343l053q6q5648j10736J883q4087J06422J48765O7002Q7798R6451
11060E10202n2107m7537N8628J06477j34649N5568l9811l3769N3961j13384j84182
11049A79397N9899J06299K7978k2045J184n3997J01374j9736K8467P8074K33845
11038G20739J59267P4324o5557j2884O0705L6827J6223j04322R8533P4438n6467
11027A001826P6455J47619N3695j7616l7595q8613k4770J8280Q0822J31413K0703
$$ plain form
11105 145073 214457 267186 216630 151848 112296 110456 91550 137404 102948 105139 126426 224970
11093 224970 239285 285084 170391 -3784 -104663 45805 148616 106467 48284 122536
11083 122536 272073 322818 334370 364452 427487 351192 257801 222124 202396 357741 345834
11072 345834 285491 282438 282352 196704 85968 87851 3764 110186 258951 325953 413751 510202
11060 510202 458095 410558 469186 575663 441014 496582 456771 423002 476963 363579 179397
11049 179397 239296 345595 373573 351528 352712 298715 400089 380353 408820 486894 720739
11038 720739 880006 954330 888773 875889 936594 973421 989644 885322 983855 1058293 1001826
11027 1001826 1078281 1225900 1279595 1261979 1224384 1135771 1111001 1129281 1210103 1341516 1362219
11016A362219K78310J73240n3238L5045K6559L3724M8548k2020q2135l4090j03905
11005A662257k11220J67602J01676l6336k1799P586q8866m3384j9149j1830j07441
10994A399096j52772o930J39307m091J9356l6212j08158Q7356J22319m9465j54739
10983A255067o6486P3151J08687p5319k5603J28840J04996o271j3234n2830M1409
10972A472407J50434J37336K6897J22837R5671j21585r9819K9701J29418q3928
10962A859369p8761l1904o4639L1259J18560N655q1770j15733m8797O3401J88090
10951A844730J63620m2496m0922m0521p4525J99383K07099J59721R9653P2228
10941B547970Qj9157M0563J26575J93322J64363K30625J70860J64463J65200L07991
$$ plain form
11016 1362219 1640529 1813769 1760531 1795576 1822135 1855859 1904407 1882387 1800252 1766162 1662257
11005 1662257 1451037 1618639 1720315 1683979 1662180 1669766 1580900 1537516 1518367 1506537 1399096
10994 1399096 1246324 1239394 1378701 1374610 1393966 1357754 1249596 1336952 1459271 1409806 1255067
10983 1255067 1188581 1261732 1370419 1295100 1269497 1398337 1503333 1497062 1483828 1430998 1472407
10972 1472407 1622841 1760177 1787074 1909911 2005582 1883997 1784178 1813879 1943297 1859369
10962 1859369 1780608 1748704 1684065 1715324 1833884 1839539 1757769 1642036 1593239 1656640 1844730
10951 1844730 2008350 1965854 1924932 1884411 1809886 2009269 2216368 2376089 2475742 2547970
10941 2547970 2547978 2528821 2569384 2695959 2889281 3053644 3284269 3455129 3619592 3784792 4092783
10930D092783K67516K35028K79709M32794M50992O12956M40473N34760O79051
10921H026062P15437O77624J008353J175687J429828J687700K119818K399892
10913A9240401K962670L457664M065324M599612M527674M367628L801821K840400
10905D9863194J768217J137803N16640L55583J87607k62844p18999j571978k309659
10896D8965564l007606l221744l291907k955496k742119k246457j848849j649514
10888B8001872j105029n90203l66265O992K50682N20627P47022J080446J263048
10879B9809192J588857K488890L013752L611826M558334N688804P310027R054788
10871F7124470J1073457J2934306J4437724J4651086J2669955Q481425L185143
$$ plain form
10930 4092783 4360299 4595327 4875036 5307830 5758822 6371778 6812251 7347011 8026062
10921 8026062 8741499 9419123 10427476 11603163 13032991 14720691 16840509 19240401
10913 19240401 22203071 25660735 29726059 34325671 38853345 43220973 47022794 49863194
10905 49863194 51631411 52769214 53285854 53641437 53829044 53566200 52847201 51275223 48965564
10896 48965564 45957958 42736214 39444307 36488811 33746692 31500235 29651386 28001872
10888 28001872 26896843 26306640 25940375 25947367 26198049 26718676 27465698 28546144 29809192
10879 29809192 31398049 33886939 36900691 40512517 45070851 50759655 58069682 67124470
10871 67124470 78197927 91132233 105569957 120221043 132890998 141372423 144557566
10864A44557566j859682n645150q388505r716068r891028q650694o913965m574574
10856H8917900j829062R45270L405288L988945K697675l63862l942359o602989
10848H7216806q244344q703059q098848p014465n625488m408725l147453k407951
10840C9566473j668516j096449n22996K3781N80439R70533J675254K260836L062073
10831D4851428L966247N006723O197488P721767R168438J0112821J0315262R312595
10823A06652769P152712L348667r23258n009335q261435r971149j0606784j0653635
10815G1728552r406203p767118o223443m439736k966499j590497l43536L32656
10807C9324176K22799o43148j827266k625328l111721l194627l042047k712527
$$ plain form
10864 144557566 142697884 137052734 128664229 118948161 109057133 100406439 93492474 88917900
10856 88917900 87088838 88034108 91439396 95428341 98126016 97762154 93819795 87216806
10848 87216806 78972462 70269403 62170555 55156090 49530602 45121877 41974424 39566473
10840 39566473 37897957 36801508 36278512 36302293 36882732 37853265 39528519 41789355 44851428
10831 44851428 48817675 53824398 60021886 67743653 76912091 87024912 97340174 106652769
10823 106652769 113805481 117154148 116230890 111221555 102960120 92988971 82382187 71728552
10815 71728552 62322349 54555231 48331788 43892052 40925553 39335056 38991520 39324176
10807 39324176 39546975 38903827 37076561 34451233 31339512 28144885 25102838 22390311
10799B2390311k325428k027814j698664j512460j233460r56527j049803r05515
10791A0680640o66930n01756n56042n93972n20138n30262m78994k64646l74466
10782F193434l79195j32292j96827l32027k27775j71027l26749k62559l02912
10773C862071k02438P311j26251m8581j61399j25896j61553q2522N8499M0903
10763C060144O533j29761k9860J06309J4577J6624K035j05386o1722p2465Q1300
10752B888328J88470Q4636j28307m7247j48215k69723j79208l8990j87426j16424
10742B045894J03222P4163J5252N2367J14453N2188L1256q7726q4598m0504j15627
10731B160340q8737L433j27523J4126j4999O6129N7677N3140k2930J7881j51223
$$ plain form
10799 22390311 20064883 18037069 16338405 14825945 13592485 12635958 11586155 10680640
10791 10680640 10013710 9511954 8955912 8361940 7841802 7311540 6832546 6567900 6193434
10782 6193434 5814239 5681947 5485120 5153093 4925318 4754291 4427542 4164983 3862071
10773 3862071 3659633 3666944 3540693 3492112 3330713 3204817 3043264 2960742 3019241 3060144
10763 3060144 3066677 2936916 2907056 3013365 3027942 3044566 3046601 2941215 2879493 2807028 2888328
10752 2888328 3076798 3161434 3033127 2985880 2837665 2567942 2388734 2349744 2162318 2045894
10742 2045894 2149116 2223279 2238531 2290898 2405351 2457539 2488795 2401069 2316471 2275967 2160340
10731 2160340 2071603 2075036 1947513 1961639 1946640 2012769 2070446 2123586 2100656 2118537 1967314
10720A967314r163k8217P913o7705K0924Q5145m5731M2558J27491J31714J17330
10709B349573J97087J43989L3578j24255o8511k16472Q653J47727J13555P096
10699B592020k419r8113L9886p4046J22497q6711j43999L0439J52545N2991J77702
10688B762792K33571M4179j6876m0856k9373J74286K53528P4255p0578J11314
10678C496242J59363M9057L9566J54865K05305J93169O9020J11489J01211P1705
10668D650992J18353L13341L55078M31970L51280M34177M59354N69318O87869
10659H371732O54029P76841Q35970Q40579J096652J428287J669821J909359K322433
10650A9905703K746730L248613L389889K969020K257831J378847M69565K20414
$$ plain form
10720 1967314 1958151 1929934 1937847 1870142 1891066 1976211 1930480 1973038 2100529 2232243 2349573
10709 2349573 2546660 2690649 2724227 2599972 2531461 2314989 2323642 2471369 2584924 2592020
10699 2592020 2589601 2491488 2531374 2457328 2579825 2493114 2349115 2379554 2532099 2585090 2762792
10688 2762792 2996363 3040542 3023666 2982810 2953437 3127723 3381251 3455506 3384928 3496242
10678 3496242 3655605 3704662 3744228 3899093 4104398 4297567 4366587 4478076 4579287 4650992
10668 4650992 4769345 5082686 5437764 5869734 6221014 6655191 7114545 7683863 8371732
10659 8371732 9025761 9802602 10638572 11479151 12575803 14004090 15673911 17583270 19905703
10650 19905703 22652433 25901046 29290935 32259955 34517786 35896633 36366198 36586612
10642C6586612L84919J090706K021246L388356N204864P133126R155011J0961502
10634G5926342J2332084J2349918J0514070O903633J953551k795487o529386q780760
10626A01873965r670892r883876q963556p625679o356563m965809l723499k905764
10618D7778327k027071j034625j35941O07123J561898K752648M568610O626227
10610F0697196Q996136J1423763J2952942J2971750J1354061J0128927R626134
10603A38150909Q548707O199704L417714K378747M412855Q379624J3270801J6329843
10595B01088904J4609447Q688824M060494K425196K563096M057258P147058J0183201
10587B54823478J1590497J2416131J2654149R499933m41530j4337175k3298300
$$ plain form
10642 36586612 36971531 38062237 40083483 43471839 48676703 55809829 64964840 75926342
10634 75926342 88258426 100608344 111122414 118026047 119979598 117184111 110654725 101873965
10626 101873965 92203073 82319197 73355641 65729962 59373399 54407590 50684091 47778327
10618 47778327 45751256 44716631 44580690 45187813 46749711 49502359 54070969 60697196
10610 60697196 69693332 81117095 94070037 107041787 118395848 128524775 138150909
10603 138150909 146699616 152899320 156317034 158695781 163108636 171488260 184759061 201088904
10595 201088904 215698351 224387175 228447669 230872865 233435961 237493219 244640277 254823478
10587 254823478 266413975 278830106 291484255 300984188 300542658 286205483 262907183
10580B62907183k6303081k6374872k3372133j7672777j0664640l585004K678963
10573A57613639P011922P106769J427104o745959j2442442j4470685j4744565
10566A24755783j3123857r737007n716726j846533J373380L280182L442404J383755
10558A03811381j565705l743891m584697m971929n199883m766689m099519l268422
10550G1610646k494678j669241j337936j276591j868339l074660m071352m648028
10542E1169821n138461n248476m731100m171120l500857l138854k793157k135390
10534B0312406j859715j582096j347768j101372r09185p65377p74970p22579o62227
10525A0587117o14511o14848m80724l78460n38627n47178m83598m52000m28463
$$ plain form
10580 262907183 236604102 210229230 186857097 169184320 158519680 154934676 157613639
10573 157613639 164625561 171732330 173159434 166413475 153971033 139500348 124755783
10566 124755783 111631926 101894919 96178193 94331660 95705040 98985222 102427626 103811381
10558 103811381 102245676 98501785 93917088 88945159 83745276 78978587 74879068 71610646
10550 71610646 69115968 67446727 66108791 64832200 62963861 59889201 55817849 51169821
10542 51169821 46031360 40782884 36051784 31880664 28379807 25240953 22447796 20312406
10534 20312406 18452691 16870595 15522827 14421455 13512270 12746893 11971923 11249344 10587117
10525 10587117 9972606 9357758 8877034 8498574 7959947 7412769 6929171 6477171 6048708
10516F048708k74682k56446j98634k33689j64701o7911j07766k54860l00456n0864
10506D138699k9742k03743k03481j38074j54081j11369j26086n1489K5649n684
10496C140599n0006m5693O931o2884n8184L1325N1300J8464M9117L0467P041j35787
10484B982690j11823R090m2830n0027j86834k55126k35160n9677m6177Q7878K08156
10473B300160M7741K1522p7089j33023j97279j1175l2926l241n8699q5354j54135
10462A616502j38429q716m1339p3232M6063J8131J70202R0200N8876J4299j25738
10451A626819j39595J04896Q2073J7810p3961p9421j53328n8393J23960P8117
10441A528977O9005J40230J98724M16588O1488p6864j40679o4383Q7175j84658
$$ plain form
10516 6048708 5774026 5517580 5318946 5085257 4920556 4852645 4744879 4490019 4189563 4138699
10506 4138699 4108957 3905214 3701733 3563659 3409578 3298209 3172123 3120634 3146283 3140599
10496 3140599 3090593 3044900 3051831 2988947 2930763 2962088 3013388 3031852 3080969 3111436 3118477 2982690
10484 2982690 2870867 2879957 2837127 2787100 2600266 2345140 2109980 2050303 2004126 2092004 2300160
10473 2300160 2347901 2369423 2292334 2159311 1962032 1950857 1917931 1914690 1855991 1770637 1616502
10462 1616502 1478073 1469357 1428018 1354786 1400849 1418980 1589182 1679382 1738258 1752557 1626819
10451 1626819 1487224 1592120 1674193 1692003 1618042 1538621 1385293 1326900 1450860 1528977
10441 1528977 1597982 1738212 1936936 2353524 2415012 2338148 2197469 2133086 2220261 2035603
10431B035603k65258k16732j93351o7359L4350Q6219j5192J13108J8992r2859
10421A437521k374o9588j55342j53587j2227L4867M8366j6894O2264N297q0978
10410A097325K7200p5657k9107J45475L2384L9238K327q9658N0683N3763J07553
10399A361526l4510j13781j82995J19100Q9337p8547l6931j07214R3267o0238
10389A049014J07846K8881k5673j63443o4567K6606k3641R9057L8698q9222j4106
10378I69450l8830M4928j24763K0216L5694k001M0747k12477r7833J09869J58189
10367I03189M4798j01727j2675Q8415K0016m3616l0787n7804q6568K050Q0485
10356H05776J91102L3258j96149p9129p2261j56052m1764J74373M1270j9265k4694
$$ plain form
10431 2035603 1770345 1553613 1360262 1292903 1327253 1413472 1398280 1511388 1530380 1437521
10421 1437521 1435147 1365559 1210217 1056630 1044403 1079270 1127636 1110742 1173006 1178303 1097325
10410 1097325 1124525 1048868 1019761 1165236 1197620 1236858 1239185 1149527 1200210 1253973 1361526
10399 1361526 1327016 1213235 1030240 1149340 1238677 1160130 1123199 1015985 1109252 1049014
10389 1049014 1156860 1185741 1160068 996625 932058 958664 935023 1034080 1072778 983556 969450
10378 969450 930620 975548 850785 871001 906695 904694 945441 732964 635131 745000 903189
10367 903189 947987 846260 833585 922000 942016 898400 867613 809809 723241 725291 805776
10356 805776 996878 1030136 833987 754858 682597 526545 484781 659154 700424 681159 656465
10345F56465Q3948q0273m6184J1502j06O6915r2641P0299J9663K3980n0887J7709
10333F80390J04950l4638o6542p957k44100p2912N8714o6297L9297J04635L7585
10322E33125R6160k291m9920j21375j28187P9242J5010O1045N888J8929N3686
10311E61312o3704m2148k2010L0660N459q9163N8830l0387j5353P6339k0388j14470
10299C34977R7886M029j39129j28772j26533J13021K15269J56066n483j63572
10289C57759L0973J5203M1782p6330k1575N2112j8270k19898p8472N4820l0597
10278A07507R3949Q3388J7577p0034P5480J9656j714O6496j075L3524J14982J86850
10266G26586K19495K39816K46245K85468J13684Q1897R6083j5478o4138k0723
$$ plain form
10345 656465 740413 660140 613956 625458 625352 692267 599626 669925 689588 713568 662681 680390
10333 680390 785340 750702 684160 676203 432103 359191 417905 351608 390905 495540 533125
10322 533125 629285 626994 577074 455699 327512 406754 421764 482809 488697 507626 561312
10311 561312 497608 455460 433450 464110 469569 380406 439236 408849 393496 469835 449447 334977
10299 334977 432863 436892 297763 168991 42458 155479 370748 526814 521331 357759
10289 357759 388732 403935 445717 369387 347812 399924 381654 161756 83284 138104 107507
10278 107507 201456 284844 302421 232387 307867 327523 325809 392305 391230 424754 539736 726586
10266 726586 946081 1185897 1432142 1717610 1831294 1913191 2009274 1993796 1929658 1908935
10256A908935j37482j06744j07733j71388k23828j62317m5873j97462j46781j39240
10246D70087P2596J02469j33213r3946N2345m6176N090P9136M5757Q3321r2574
10235E44892L7170J31888J34272N1901j14199j93651j23366O2652K44558M6841
10225H22958j03599o2000J91479Q2688J03612j17707j78149L8787J8359j93270
10215F03158n4619j53934K1894r6646q630J33643R4373p5621M4107p8579Q8866
10204E18012O2480j28144m4800O0582R5239J07179P99Q8544n982k0363k1854n0415
10192F61277K806L7355J42619j5156j2971L3194M5015k4949n7216J9163j2223
10181H18914p0842j8376J17911J39999k2643M6806l461N0127q9228j12151J4000
$$ plain form
10256 1908935 1771453 1664709 1556976 1385588 1161760 999443 953570 756108 609327 470087
10246 470087 542683 645152 511939 417993 470338 424162 429252 508388 554145 637466 544892
10235 544892 582062 713950 848222 900123 785924 592273 468907 531559 776117 822958
10225 822958 719359 657359 848838 931526 1035138 917431 739282 778069 796428 603158
10215 603158 548539 394605 416499 319853 311223 444866 539239 463618 507725 429146 518012
10204 518012 580492 452348 407548 468130 563369 670548 671347 759891 753909 733546 711692 661277
10192 661277 664083 701438 844057 828901 815930 849124 894139 869190 811974 831137 818914
10181 818914 748072 729696 847607 987606 964963 1011769 1008308 1058435 969207 857056 871056
10170H71056R0408J70059j29370j86625k8970J20103L0139M5703P9443M160O5851
10159A131957M6369M0167j35259j34275l7581l0490Q2328K22441R1813J5621L0269
10148A323360P8650k2092m1993M3940p8667M9188n9017m9628N2375l2056N7122
10137A321182q8912J4433R6786l6308j92556m630L8132j9858j93715o1598K4170
10126H97126j43957o1787P5649J35736j8346p7456j14849q0801J08422L6601j51118
10115F05220j74971Q5223k8221j08693r3773O8763p8133r8250J79277J09905m1566
10104D24781j25871j04573o1017p2463J06931J06674L272q566r1866p099J12053
10093B82256M9257j27186r9990R909M7150j4659K2100m4951J22371J51703K0595
$$ plain form
10170 871056 961464 1131523 1002153 815528 786558 906661 936800 982503 1061946 1066106 1131957
10159 1131957 1178326 1218493 1083234 948959 911378 880888 963216 1185657 1277470 1293091 1323360
10148 1323360 1402010 1379918 1337925 1381865 1303198 1352386 1293369 1243741 1296116 1264060 1321182
10137 1321182 1232270 1246703 1343489 1307181 1114625 1109995 1148127 1128269 934554 872956 897126
10126 897126 753169 691382 767031 902767 884421 806965 692116 611315 719737 756338 605220
10115 605220 430249 515472 487251 378558 284785 353548 275415 177165 356442 466347 424781
10104 424781 298910 194337 133320 60857 167788 274462 277734 269168 177302 170203 282256
10093 282256 331513 204327 104337 114246 161396 146737 168837 123886 246257 397960 418555
10082D18555j42617j26770O284j2571o338Q121J45455J06811j26430j42022L1402
10071A59880m9646j12904l6779K0569P5616L9979l8254N5778O3975J39805j38909
10060A79110o224N9287l1835p6258n450R9195l5683O8474l731j52715j2762O0908
10048A42316O0149k2083j7557R7505Q545J33061J45419O1752R5670j87365k32578
10037B84834k314n3743L7568j11470j21722P332J13709J46005Q5142Q255j40530
10026B53066j69477m2362L7020J21115N6204k5280P61J09774j4819k4817J5402
10015C16587K286J76861J18452r7380j71509o8235q8844l2677K6688j6400o95
10004A65134k3364l685J24021O7426L1908l6949j27975m389L5766l4226Q6916
$$ plain form
10082 418555 275938 149168 155452 142881 136543 144664 290119 396930 270500 128478 159880
10071 159880 110234 -2670 -39449 -18880 56736 96715 58461 114239 178214 318019 179110
10060 179110 172886 232173 200338 124080 118630 217825 182142 250616 246885 94170 81408 142316
10048 142316 202465 180382 162825 260330 268875 401936 547355 609107 704777 517412 284834
10037 284834 282520 228777 266345 154875 33153 40485 154194 300199 385341 393596 253066
10026 253066 83589 41227 78247 199362 255566 230286 231047 340821 326002 301185 316587
10015 316587 318873 495734 614186 516806 345297 277062 188218 155541 182229 165829 165134
10004 165134 141770 138085 262106 329532 361440 324491 196516 192127 227893 193667 280583
9993B80583J30409L030j13569r666R9825M6179j50096l3966p9626P3888K3098
9982B70089o4768q0884P5957j4754j14991l2370j9888J40115l3749n1658N4966
9971A28065J07597R9966L4115o3519O2821n4827J9471j9407k01575m2215L7111
9960A07603P9273l823J69475n2329j34252j00685J1825J7128M7592j21525N8218
9949G8500l6366L2235l8891k1890P1426o9165k0460j5459J6322J4392L1896J33809
9937A76349P4048o3206j56785o4064R4419J27673N9263j17783q8791K1415P7444
9926A39982M0933M107J04116N7975Q3822j139o0746k05129j16899N9678Q7626
9915A94326k1539q8938K373J1884K922J58844p3866j54759O6179K473j208J10276
$$ plain form
9993 280583 410992 414022 300453 290787 390612 436791 286695 252729 173103 246991 270089
9982 270089 205321 124437 200394 185640 70649 38279 18391 158506 124757 73099 128065
9971 128065 235662 335628 369743 306224 369045 314218 333689 314282 112707 70492 107603
9960 107603 186876 183053 352528 300199 165947 65262 77087 94215 141807 20282 78500
9949 78500 42134 74369 35478 13588 85014 15849 -4611 -20070 -3748 10644 42540 176349
9937 176349 250397 187191 30406 -33658 60761 188434 247697 129914 41123 62538 139982
9926 139982 180915 185022 289138 347113 430935 429796 369050 163921 47022 106700 194326
9915 194326 172787 83849 86222 98106 101028 259872 186006 31247 97426 99899 98691 208967
9903B08967j17829o2723J24292K55676Q3844j38832j8225q4010j44012j44675
9893c7527M9592J69110J37557j82068O24P8474l4248j03040j16520j23915L8143
9882a23818N5288P2832k149O3094m2602j13953J5407j531P980N8111l3578k12955
9870b57874Q6220K3642N8277O6255J38822P7457N0182j00825m3100p192m197J9122
9858A06789L8434o7789o1236Q7177o4411k9696Q1180Q4505O8402L0001O7090O792
9846C47238M9606m1956o1980K3279r6749j174q578m5144Q1224J3099M3776O0993
9834C63634K6272j07569j43413r1406q5688j6444j8J34063M4404K2297N3576k9216
9822A70492j05627n6651N8154j32956J16924j8330l2099o1681J06113K4135J502
$$ plain form
9903 208967 91138 28415 152707 408383 492227 353395 335170 251160 107148 -37527
9893 -37527 12065 181175 318732 136664 137288 215762 181514 78474 -38046 -161961 -123818
9882 -123818 -68530 4302 2153 65247 22645 -91308 -75901 -77432 -69452 -11341 -44919 -257874
9870 -257874 -171654 -148012 -89735 -23480 115342 192799 242981 142156 99056 91864 87667 106789
9858 106789 145223 77434 16198 103375 38964 9268 90448 174953 243355 273356 340446 347238
9846 347238 396844 354888 292908 316187 219438 218264 209686 164542 245766 258865 302641 363634
9834 363634 389906 282337 138924 47518 -38170 -54614 -54632 79431 123835 146132 199708 170492
9822 170492 64865 8214 66368 -66588 50336 32006 -93 -61774 44339 68474 69976
9811F9976J48405L2788q0034J6665Q6957J6509P305j27699k2475J4748j00246
9800F2899K7367j0763j21221J9805J7607m9057r9197J01101R7856J11985J5452
9789A73834j29081N1168J16734R542K7030j08724j55710q9107P3541M5899M5686
9778F0812P0073K04301j03190j20692j11991Q8083J5271L6995P8783n8929k1770
9767A37746M9644K3494K0783l012j5522m310j16206L53N5183K6328j6464j26523
9755C1494m3699o8559L760N5514k760K3772Q7806m9921n8752J07812k8792k1669
9743C6006R0897J62200L5324p0168k4308j33667n2224K9220m8658m7049M0112
9732A7685Q2340J7203n7243k9683M2982L2840m959M3612k2479R787n4475m2840
$$ plain form
9811 69976 218381 251169 171135 187800 274757 291266 298571 170872 148397 163145 62899
9800 62899 90266 79503 -41718 -21913 -4306 -53363 -152560 -51459 46397 158382 173834
9789 173834 44753 95921 212655 222197 249227 140503 -15207 -104314 -30773 15126 60812
9778 60812 130885 335186 231996 111304 -687 87396 102667 139662 218445 159516 137746
9767 137746 187390 210884 231667 228655 213133 208823 92617 92970 148153 174481 158017 31494
9755 31494 -12205 -80764 -77004 -21490 -24250 -478 87328 37407 -21345 86467 57675 36006
9743 36006 126903 289103 324427 254259 229951 96284 44060 73280 24622 -22427 17685
9732 17685 100025 117228 59985 30302 73284 106124 101165 144777 122298 132085 77610 34770
9720C4770j04871O388J33388Q3405J21446l7263j17282j6173j0146Q6469m1839
9709A38292j01300J5051P6211M2987p319O9338J04334k9778j5860l3858q5388
9698A72710J7443m1013q6516j40702P1606J82710J4499l3020l9973J09600J39092
9687C66436L2825k146k31348j84903J5997J48280P1484K8849j84349o0523J11974
9676A12576J06921j58674j0022J04641J3884J6754K1884o2486j05184j4603o2964
9665c7273P7120k0491j0143K2148J753j43199o1197J52000J22449j33354r1127
9654a21314J18475J58712J15166M1956o804j35105K6344K06501J34051o9279p3479
9643C95224k1697n7712o9336m1781j26313J5963j16586O8960J03310j1810j9588
$$ plain form
9720 34770 -70101 -63713 69675 153080 274526 237263 119981 103808 93662 180131 138292
9709 138292 36992 52043 128254 171241 163922 233260 337594 307816 291956 258098 172710
9698 172710 190153 149140 62624 -78078 -6472 176238 190737 157717 117744 227344 366436
9687 366436 399261 397115 165767 -19136 -3139 145141 216625 245474 61125 602 112576
9676 112576 219497 60823 50801 155442 169326 186080 207964 145478 40294 25691 -37273
9665 -37273 39847 19356 9213 31361 33114 -110085 -171282 -19282 103167 -30187 -121314
9654 -121314 -2839 155873 271039 312995 306191 171086 197430 403931 537982 468703 395224
9643 395224 373527 315815 246479 204698 78385 94348 -22238 46722 150032 138222 118634
9632A18634J3603m8449N804N633K5519M99n6339p7754n4237P9125P6288n0432
9620C7894J03354J24927j14676L5381n9038r689l8203n001j34401O7577J41228
9609A49353n9387P316J3968K4556o3459K5261m223q821J423J22550r6663j16250
9597d376P4879L7855N2055J77143J31917j59603j69908j08225q3978l1845q4016
9586a68102q088Q1771j9700n3588O8666P7908p6488r2215p3750J6253o1548M4459
9574b64422J44691m0039O8692O5779K9108k9547o1809J05746J06O0621M2275l1506
9562H9695r0009K284J23842O8332J06409J5744p8002r37l8152q5967k2651K1847
9550A12435r4476O2266R0784j97405k29933K5968J35809j21906J6520J52203Q393
$$ plain form
9632 118634 132237 83788 89592 95225 120744 121243 64904 -12850 -67087 12038 88326 37894
9620 37894 141248 266175 151499 186880 127842 118153 79950 74949 -59452 8125 149353
9609 149353 89966 97282 111250 135806 72347 97608 93385 84564 85987 208537 111874 -4376
9597 -4376 70503 108358 160413 337556 469473 309870 139962 31737 -52241 -84086 -168102
9586 -168102 -176190 -94419 -114119 -167707 -99041 -21133 -97621 -189836 -263586 -247333 -308881 -264422
9574 -264422 -119731 -159770 -91078 -25299 3809 -25738 -87547 18199 18305 78926 121201 89695
9562 89695 -314 1970 125812 194144 300553 316297 238295 237358 199206 113239 90588 112435
9550 112435 17959 80225 171009 -26396 -256329 -230361 -94552 -216458 -199938 -47735 -39342
9539c9342J28164M1722J7204K3147o2393o0889l8679j10036L3248N5007L2803
9528A9956L842q0330N7862J55961J19611O7799q4005j66152o2231j69352K6520
9517a10519J26812M5909q6975k8221J36976Q7533L703j34786k14473L37n637L3073
9505a46268k7798Q7289J70510N9479N8883R6453r6314k7733j11413p5657R0520
9494G7951K1778j21218r2098R9327P6578l354l4112J35634K6189M4539l1159j65818
9482C4237o9740k3293Q1208k8403j28186L0934j0378m169K4919L4814p932N1684
9470a4305Q0543j6379P756o6265j21726J39153J17930o6361j40806J12418N5105
9459H7063j33405j39591O3793R7096J40416L3809K4603p4758j17201q433P8338
$$ plain form
9539 -39342 88822 130544 147748 170895 108502 47613 8934 -101102 -67854 -12847 19956
9528 19956 23798 -56532 1330 157291 276902 344701 260696 94544 32313 -137039 -110519
9517 -110519 16293 62202 -24773 -52994 83982 171515 175218 40432 -174041 -173704 -179341 -146268
9505 -146268 -174066 -86777 83733 143212 202095 298548 202234 174501 63088 -12569 77951
9494 77951 99729 -21489 -113587 -14260 62318 58964 24852 160486 186675 231214 200055 34237
9482 34237 -35503 -58796 22412 -5991 -134177 -103243 -113621 -117790 -92871 -58057 -65989 -14305
9470 -14305 66238 49859 57615 -8650 -130376 8777 126707 60346 -80460 31958 87063
9459 87063 -46342 -185933 -122140 -25044 115372 149181 173784 99026 -18175 -26608 51730
9448E1730O6471r7705o8810M5132M1208N183J1388O3377l0832J3751o171l5570
9436E9152L3376J30093K5884q8784K5285l4166l2047L1365K5212r1402q4439J01051
9424A00580o3863J1682Q9635j96742j01445P2412K0063m0715N573J07009J7042
9413B1231r651m8193K8265N837M0919j4450J35145q9751j44187K3766K9819Q2788
9401F1538N1944o4305p4697O9223J58676K1842j02887q3557j06546Q5255J53272
9390A69758r815n7057o9920N6747p9052k52412k7014J29918J09099M0858o6025
9379e4915J51403Q3811K5745o5313o6338j09559j44128p4481J12806K09427p757
9368F0701O9823m8247l1017o2513M2683L8489O6914m7532k09731o7883K53587
$$ plain form
9448 51730 118201 20496 -48314 -3182 38026 43209 54597 117974 87142 100893 94722 59152
9436 59152 92528 222621 248505 159721 185006 150840 118793 150158 175370 83968 -471 100580
9424 100580 36717 48399 138034 -58708 -160153 -87741 -67678 -108393 -102820 4189 21231
9413 21231 11580 -36613 -8348 -2511 38408 23958 159103 69352 -74835 -51069 -21250 61538
9401 61538 113482 49177 -25520 43703 202379 224221 121334 37777 -68769 16486 169758
9390 169758 159943 102886 32966 89713 10661 -241751 -268765 -138847 -29748 11110 -54915
9379 -54915 96488 180299 206044 140731 74393 -35166 -179294 -253775 -140969 68458 60701
9368 60701 130524 82277 51260 -11253 31430 69919 136833 89301 -120430 -188313 65274
9357F5274O2939n6805m8872k9398J54685k675n7396q3714o706M8626J27768P5473
9345B49199r3349j03482n2231J9628R6522M5767j66355j4097l2033k7380k3032
9334a00843Q0715P5666j7807P4389J8357n8666J7817j39188K7837K6485j36854
9323a32092k2875J3793N0341J47880K2976l7954N8826K9911j20406k01244j3356
9312b04200J48057J42462J34951q7940j39588l7272j3974P675N8226J32348j34441
9301F304K9079r105m8603q3500K799R2230K2671O8351m9217m9111P49O5724J9604
9288F7975J34j29430J98014M6951l9776L3921O9511L3497j05973j4570L6780k3081
9276A73953j06415j11998M9840M7773r9119o4702j1751n016o8575K1777P9609
$$ plain form
9357 65274 128213 71408 22536 -6862 147823 145148 87752 4038 -2668 45958 173726 249199
9345 249199 155850 52368 137 19765 116287 162054 -4301 -18398 -50431 -77811 -100843
9334 -100843 -20128 55538 37731 112120 130477 71811 89628 -49560 -21723 4762 -132092
9323 -132092 -154967 -141174 -90833 57047 80023 42069 100895 130806 10400 -190844 -204200
9312 -204200 -56143 86319 221270 133330 -6258 -43530 -57504 -49829 8397 140745 6304
9301 6304 35383 26278 -22325 -105825 -103026 -10796 11875 80226 31009 -18102 -17353 48371 67975
9288 67975 68109 -61321 136693 183644 143868 177789 247300 280797 174824 160254 197034 173953
9276 173953 67538 -44460 5380 53153 -45966 -110668 -122419 -127435 -196010 -174233 -94624
9265i4624O6896n5145L5322j4684J24555M3947p7948J02472O7968o2271m7488
9254H9000O443M6621j29126q662n5516j01823J7778M1323L6263l9456r304k7251
9242a33710n763R2808O0672l9906j9426R604k9715k2407R6916J47659P4298o5592
9230A65438k28926m2073P7012j6462J83803Q3205o5452k51074q2020J86234J32591
9219A42276m1848j08524r6948k7015J8004M0243P6788N3071R0427j15678j03202
9208g2406p5505J0516K17563J32685n6096R176q8098k3687K5228m2093J17009
9197A54292J2591o6710n9440o0803k0996M6208J78386L9831m3287r539J26836
9186B97369l3556r8925j23932l393r2235j05222j25465J20322N0889J9318K02497
$$ plain form
9265 -94624 -27728 -82873 -47551 -62235 62320 106267 28319 130791 198759 136488 89000
9254 89000 95443 142064 12938 4276 -51240 -153063 -135285 -93962 -57699 -97155 -106459 -133710
9242 -133710 -139473 -46665 14007 -25899 -45325 -35721 -65436 -87843 9073 156732 231030 165438
9230 165438 -63488 -105561 -28549 -45011 138792 221997 156545 -94529 -176549 9685 142276
9219 142276 100428 -8096 -105044 -132059 -114055 -73812 2976 56047 146474 30796 -72406
9208 -72406 -147911 -137395 80168 212853 156757 165933 77835 54148 79376 37283 154292
9197 154292 166883 100173 40733 -20070 -41066 5142 183528 223359 180072 170533 297369
9186 297369 263813 164888 40956 37563 -54672 -159894 -285359 -165037 -114148 -94830 107667
9175A07667P2496j23828j38701m7438R8278o8202o4059P1164j5186P4462O3624
9164C0277J7858L3460p9257j07103J28344Q1905j19982J65923O7283K9989k9595
9153B19102m6754j28410J838O5702J880q4189r9556J89593J19594k13876j49553
9142a24629p3214J49480O8114j7230l8148m1486j0456Q01K8629J29517J47574
9131B18952J0065j35655j96705l9753R5261k269N4194r1884k0025J4430M3875
9120d9514j00589l7576R0633J21030J2213L8544n486l5451K8491J12010r4333
9109G9972j99199J7871P1532K4549R6783K1960p9856o4756m1570M3510k630P5136
9097D3302O0079J09171j8384k2822j53211q2829K9870J70275o9940q3676K7710
$$ plain form
9175 107667 180163 56335 -82366 -129804 -31526 -99728 -163787 -92623 -107809 -33347 30277
9164 30277 48135 81595 2338 -104765 23579 105484 -14498 151425 218708 248697 219102
9153 219102 172348 43938 45776 111478 113358 29169 -70387 119206 238800 24924 -124629
9142 -124629 -197843 -48363 19751 2521 -35627 -77113 -87569 -86768 -58139 71378 218952
9131 218952 229017 93362 -103343 -143096 -47835 -50104 4090 -87794 -107819 -93389 -49514
9120 -49514 -150103 -187679 -97046 23984 36197 74741 69255 33804 62295 174305 79972
9109 79972 -119227 -101356 -29824 -5275 91508 113468 33612 -31144 -72714 -29204 -31834 43302
9097 43302 103381 212552 194168 171346 18135 -64694 -34824 135451 65511 -18165 9545
9086I545P032j3662N2922O687j7350M8977k9501o3096j36996l2044r9630J27898
9074a39218L5870Q8442Q5874J7700k9953j023n6013j41141j4880M1275L7277Q2124
9062F334K4687j58330O6098P8582n5929J7614J55521J3240j7210j20885L6581
9051D6303M1704l264j86235k855J04097O0551m4932n746n897m6133r4723j8000
9039a55130n5348Q4141N6656R9523Q2372n2913k4658P8488m3176q8331Q9680N7112
9027A28416O5548r1645j2628R3885l2180j05440j06663o8885p2239P2630O1622
9016f7579N4331P9788M8216j09238O3310J59850l1779j92573j18418P7235O7631
9005C0774J48881M992J9677R4149j4529n0627r3392k03734j37532O2646k2809
$$ plain form
9086 9545 16577 2915 55837 62524 45174 94151 64650 1554 -135442 -167486 -267116 -139218
9074 -139218 -103348 -14906 70968 88668 58715 57692 1679 -139462 -154342 -113067 -75790 6334
9062 6334 31021 -127309 -61211 17371 -38558 -20944 134577 147817 130607 9722 46303
9051 46303 88007 84743 -101492 -104347 -250 60301 15369 9623 3726 -42407 -137130 -155130
9039 -155130 -210478 -126337 -69681 29842 112214 59301 34643 113131 69955 -18376 71304 128416
9027 128416 193964 102319 89691 183576 151396 45956 -60707 -129592 -201831 -129201 -67579
9016 -67579 -13248 66540 114756 5518 68828 228678 196899 4326 -114092 -36857 30774
9005 30774 179655 184647 204324 298473 283944 233317 139925 -63809 -201341 -138695 -161504
8994a61504o9458R5424J13227L6506o8286k6337N3097n1302j6922N6248J23122
8983H3815j5169j92861j5074J69977Q0838J1139o4176j6497R9555m04r9852L7224
8971G8515l9364K7429L6549J20505q7070K963j47808j04536J23770Q0561R2366
8960A83880j5854j16675j29931l812m4072n3928M1715J0343m573R5727J44430
8949A07250P4061M405l339J55839K8459j67620j43777j28131L900P2996M5373
8938D9416N3585k5118j5550k6607k0589K1756p1429Q6611M0394k4657k6404o7497
8926b6089R523O9235J11418m7258k14978N942Q9671P5201j4535N99j3223R581
8914E5087l9841l4023O5423l6842o6353M3338L5111r6268q323k2613K7087J38070
$$ plain form
8994 -161504 -230962 -135538 -22311 14195 -54091 -80428 -27331 -78633 -95555 -39307 83815
8983 83815 68646 -124215 -139289 30688 111526 122665 58489 41992 141547 141143 41291 78515
8971 78515 39151 66580 103129 223634 136564 139527 -8281 -112817 10953 91514 183880
8960 183880 168026 51351 -78580 -82392 -126464 -180392 -138677 -128334 -132907 -37180 107250
8949 107250 181311 185716 182377 338216 366675 199055 55278 -72853 -68953 4043 49416
8938 49416 103001 77883 62333 35726 15137 36893 -34536 52075 92469 67812 41408 -26089
8926 -26089 -16566 52669 164087 116829 -98149 -92207 -2536 72665 58130 58729 45506 55087
8914 55087 15246 -18777 46646 9804 -56549 -13211 21900 -74368 -82691 -105304 -78217 59853
8902E9853J00073j42409l5849J2905J09432K9590n3519n5537p030J10554l7446
8891I0617j11567m75J07300n590J8829j00094K8392j8159m7117R3844O6985J916
8879A24881K8900o6954o3809J06888J912k4596J3518M9611m6414p1282r7605J85988
8867A41038l9491j19845N2226K23658J0331M2099r2343j41845m8889J62461R5850
8856B85250j24660j23984K1858O4441O7606l3871M263o7464n0623q4869R0799
8845D8746Q385j30163J7644M9105M8585j0636o5371J4157N2120r9295p409J28826
8833E4694K05326P0966j55772k05638p0195M1277l1570k3205K28928r712k4147
8822H0952L9876j07049N2755J19771j9514j92786j65345r72O3463J31706j21418
$$ plain form
8902 59853 159926 17517 -18332 -5427 104005 133595 80076 24539 17509 128063 90617
8891 90617 -20950 -21425 85875 80285 99114 -980 27412 9253 -37864 55980 122965 124881
8879 124881 153781 86827 23018 129906 131818 107222 120740 170351 123937 52655 -44950 141038
8867 141038 101547 -18298 33928 257586 267917 310016 217673 75828 26939 189400 285250
8856 285250 160590 36606 58464 122905 190511 156640 160903 93439 42816 -42053 48746
8845 48746 57131 -73032 -55388 -6283 42302 31666 -33705 -19548 32572 -66723 -74132 54694
8833 54694 260020 330986 175214 -30424 -100619 -59342 -90912 -114117 114811 105099 80952
8822 80952 120828 13779 66534 186305 166791 -25995 -191340 -192312 -128849 2857 -118561
8811a18561N3542L3613P1469L9074k0245r270j29401l8668K2099J03487J96651
8800B03790J17952j19656j90196m7135J42644J49293p8080j79536L7345N8098
8790I4519n876k6015J21570l4646j43186r64J0224j49781k8507l2038N2612j2428
8778a54516J05036O0190n347j419n6959J4261R0888Q9313q9979o2010J1965O6939
8766F8362K6501j44782j14444Q5366L06548n1944r8170k07112l9983J13238p0139
8755a26559k9993J4198O9827O7515J6374l4578n2081k4959O6968Q9048o0590O3047
8743E8217n569L4037N9415j6916k0951k5152Q380l2181p8013m8811M5179K27858
8731B05493K9623j24355q7525J00852P0856j46661n1432J22318K39051P7047k68449
$$ plain form
8811 -118561 -65019 -31406 40063 79137 58892 49622 -79779 -118447 -96348 7139 203790
8800 203790 321742 202086 11890 -35245 107399 256692 178612 -924 36421 94519
8790 94519 88643 62628 184198 149552 6366 5402 15626 -134155 -162662 -194700 -142088 -154516
8778 -154516 -49480 10710 5363 3944 -53015 -38754 52134 141447 51468 -10542 1423 68362
8766 68362 94863 -49919 -164363 -78997 227551 175607 77437 -129675 -169658 -56420 -126559
8755 -126559 -156552 -142354 -72527 -5012 11362 -23216 -75297 -100256 -33288 55760 -4830 58217
8743 58217 52648 86685 146100 129184 108233 83081 91461 59280 -18733 -67544 -22365 205493
8731 205493 235116 110761 23236 124088 194944 48283 -3149 119169 358220 435267 166818
8720A66818k05770j4497N0519M3987O6918k7079n0598L600M248L9712q4830L1244
8708B4272O9898J27683J05513m4526j93718r0764o7073j82959L3901J16086L8189
8697f3498l7622Q3020Q7618j2680p6152M1639J10563j37311j14040m83O4464J15426
8685F0944M3970N159J31841K1467r2931j8697j73961k4982O7227p3977q7016K5061
8673a15895M2846p5375L4857R8734L4354j34645j4625Q8578Q9471j60609l7124
8662a49433J78777J92246o3326r4027K3544O6018K4627j88040l0253L8060J31428
8651A29621N9306o0358n965m3161N2283k4398n5695j21077M3646J46250j18364
8640B088j19555k701J24189J9623o8464o4254q6408l5723J37470J80823R2250
$$ plain form
8720 166818 -38952 -53449 -2930 41057 107975 80896 30298 33898 38146 77858 -6972 24272
8708 24272 94170 221853 327366 282840 89122 -1642 -68715 -251674 -217773 -101687 -63498
8697 -63498 -101120 -18100 69518 56838 -19314 22325 132888 -4423 -118463 -118946 -54482 60944
8685 60944 104914 110073 241914 263381 170450 151753 -22208 -47190 20037 -53940 -140956 -115895
8673 -115895 -73049 -148424 -113567 -14833 19521 -115124 -129749 -41171 48300 -112309 -149433
8662 -149433 29344 221590 158264 64237 87781 153799 178426 -9614 -39867 -1807 129621
8651 129621 188927 128569 122604 79443 131726 107328 51633 -69444 -25798 120452 2088
8640 2088 -117467 -120168 4021 23644 -44820 -109074 -195482 -231205 -93735 87088 179338
8629A79338o5848N329J76576J12435k16385k47159J8847o7913j9768K246Q0791
8618d1511R1076k8667j65159o026m6954m9009K12305R894J1045J2583r314J05978
8606I6241K9334p5438j9719L9206j8631k8548n6536R437m085K9508O2724K07735
8594B71228l5268q0501k0795j05736m1190Q7867R4288Q0148J7211j03845n5644
8583A07763N2719M1386p6900M417K5603P3559L7960j07641J19341P9542p761j67718
8571A82270k19085q0860j4012J70564J88098l5716m1574n4953K8649N4395q109
8560A69667p6016N5772Q0236J17555j16603q6822J3852k7299K7980n9306r1545
8549G471o3024q5755l6497N3000L8898M5743k1981O131J41070j2081n1289J0718
$$ plain form
8629 179338 113490 118819 295395 407830 191445 -55714 -36867 -104780 -124548 -122302 -41511
8618 -41511 49565 20898 -144261 -150287 -197241 -246250 -33945 -24051 -13006 -423 -9737 96241
8606 96241 125575 50137 30418 69624 50993 22445 -34091 -24654 -28739 769 63493 271228
8594 271228 235960 155459 134664 28928 -12262 75605 169893 250041 267252 163407 107763
8583 107763 160482 201868 124968 129385 154988 228547 266507 158866 278207 357749 349988 182270
8571 182270 -36815 -117675 -131687 38877 226975 191259 149685 94732 123381 177776 169667
8560 169667 93651 149423 229659 347214 230611 143789 157641 130342 158322 99016 7471
8549 7471 -55553 -141308 -177805 -124805 -85907 -40164 -62145 -56014 85056 72975 21686 32404
8537C2404L5712J90307J22817J775j17831o1536m7192Q5853M9118K2209l6525
8526B77111L4356m6574p6259q1874O3019j15988J1233J3774M1767n644j86398
8515g1477j9450J52722J67984l1979n7618p0949n6633O4281L8975k578j35960
8504b2682o5848n4255J33911K17742J46719n2962j14367o9562k0342q448k5101
8493F4805K7549l7045N8374k6797j12680k23131O2119J04506K9362M0699P0714
8482E8475j890l3047j9805N3054R1717p381n1563O9255j48628j1849r2126n7801
8470a51589P0952J62361R8497J28587o7524j33642k8563n4206L7501P5725p2920
8459F5179n1240K6743j20715j16271M2783R9148J80349L8982p9789m263J24692
$$ plain form
8537 32404 68116 258423 381240 383015 265184 203648 156456 242309 291427 313636 277111
8526 277111 311467 264893 188634 106760 169779 53791 65024 78798 120565 114921 -71477
8515 -71477 -90927 61795 229779 197800 140182 69233 12600 76881 115856 113278 -22682
8504 -22682 -88530 -142785 -8874 208868 355587 302625 188258 118696 98354 89906 64805
8493 64805 92354 55309 113683 86886 -25794 -248925 -186806 -82300 -52938 -12239 58475
8482 58475 56585 23538 3733 56787 148504 141123 89560 158815 10187 -1662 -93788 -151589
8470 -151589 -80637 81724 180221 308808 241284 107642 79079 24873 62374 138099 65179
8459 65179 13939 40682 -80033 -196304 -153521 -54373 125976 164958 85169 80906 205598
8448B05598O8284n58j10710q6055J9667J09702R2126k5749k11701o1595J91997
8437A91006L8740k3637j70337j9449J61718P6067q587O1706k7956k11109r0672
8426b2510K8455O0096O7117N1248j1937l9014j01896j6362J42653K2882j83222
8415b490j02662P5931J27615J7193j41139l9201l4923R2104L4713K9410O4438
8404A20989J8052n9992n5872R8384k4646K2843J4347J00018P1282L4488n2104
8393B87789j80176j63842j33873n39M0458j4569N5316p3613o0671N0039J47125
8382d6556R5739Q3384j3484K2662Q2584M267p3494m9366j7475o5923j0489P9314
8370I1163m3943L0010N6308j257n9298k1785J24095m7862N860N5244q4966j81272
$$ plain form
8448 205598 273882 273324 162614 76559 96226 205928 298054 272305 60604 -991 191006
8437 191006 229746 206109 35772 16323 178041 254108 245521 307227 279271 68162 -22510
8426 -22510 5945 66041 133158 184406 172469 133455 31559 15197 157850 180732 -2490
8415 -2490 -105152 -29221 98394 115587 -25552 -64753 -99676 -7572 27141 56551 120989
8404 120989 139041 79049 23177 121561 96915 119758 134105 234123 305405 339893 287789
8393 287789 107613 -56229 -190102 -190641 -150183 -164752 -109436 -183049 -243720 -193681 -46556
8382 -46556 49183 132567 119083 141745 224329 228596 155102 105736 88261 22338 11849 91163
8370 91163 47220 77230 133538 132281 72983 51198 175293 127431 133291 188535 103569 -77703
8358g7703j19670k1358L8491J81973N204p507M901Q5921J8326J7829j9469n7060
8346D9878o0678J64624J14656j67566k03618M7208M4000J08051k5266p5221k3120
8335b7052J09326J27750j43243J5253J7596j6136O4598k9951O1549M904j35669
8324D8925P3772q4086q5271J9134p4537J5325R9354M0724m5954p2126n3423R9231
8312a8932M917m4680M2562J40371l3367q0035o2681j3205J16989q5559j23208
8301a56828k8019J02543J07497K2580j07132j63029N3239J46996J57489Q1868
8291B17204j6972k5209O7700j28760p6105K3131o3740n8070L2935K4865p5977
8280g8998Q571Q9887n8073J3923J35076o8143Q098n625l2579J38590N8974n7689
$$ plain form
8358 -77703 -197373 -218731 -180240 1733 6937 -570 4331 90252 108578 126407 106938 49878
8346 49878 -10800 153824 268480 100914 -102704 -55496 -11496 96555 71289 -3932 -27052
8335 -27052 82274 210024 66781 82034 99630 83494 148092 118141 179690 184594 48925
8324 48925 122697 38611 -46660 -27526 -102063 -86738 12616 53340 7386 -64740 -118163 -18932
8312 -18932 -14015 -58695 -16133 124238 90871 10836 -51845 -65050 51939 -33620 -156828
8301 -156828 -184847 -82304 25193 47773 -59359 -222388 -169149 -22153 135336 217204
8291 217204 200232 175023 242723 113963 37858 60989 -2751 -60821 -27886 -3021 -78998
8280 -78998 -70427 19460 -38613 -24690 110386 42243 50341 44716 12137 150727 209701 152012
8268A52012k809O3118J23789J08946m8133q8612j18509o8123l8848p934O483j46263
8256f4883n8768R3787J65687q3170j30562j3599K9443J34227N963k7301J4366
8245F5190P3496P8356P734j97975k04803K1755J19334k5323M0528K4416J5500
8234A8208p8027K7641O6724j3402J55L2681J33537K2088r5115r7472J8506m7680
8222a2156L6814L813l6007p4248j26585M1381J20699k6296l5054o7961J06832
8211f8768P8851M9157L0341j74850l511K6314m4836m693L5824q563j6748O0870
8199d0612L4123J54709L7667k07342o1507J89369K17201q1788k30516q3423P6520
8188D401O9577n7164K5363j1146j5043P1672N0956k429M168l2722j1273J8275
$$ plain form
8268 152012 149203 212321 336110 445056 396923 308311 189802 121679 82831 74897 81380 -64883
8256 -64883 -123651 -29864 135823 52653 -77909 -91508 -62065 72162 78125 50824 65190
8245 65190 138686 217042 224776 26801 -178002 -156247 -36913 -62236 -21708 2708 18208
8234 18208 -59819 -32178 34546 21144 21299 53980 187517 209605 114490 17018 35524 -12156
8222 -12156 24658 28471 -7536 -81784 -208369 -166988 -46289 -72585 -107639 -175600 -68768
8211 -68768 10083 59240 89581 -85269 -88780 -62466 -107302 -111995 -76171 -84734 -101482 -40612
8199 -40612 -6489 148220 185887 -21455 -82962 106407 323608 241820 11304 -72119 4401
8188 4401 73978 16814 42177 31031 15988 87660 138616 136187 140355 107633 96360 114635
8176A14635J1010j4249j02413O61M9061k3600j5792q4406l9515k2886N0078j32313
8164b09729m1389Q3744J60557m4390n4202J31980J35870P1775l8969n3279M3838
8153A85806M2051O1513q4449j70786q0150O7145J59550J4874K0165M9541Q1421
8142C46681q4638j28176l9245r3076j2337O5624k4652j15993j01115J3611Q5283
8131h8033p077p6927J49303P5859N8567J02470L0510r838j02084j8684j3001N4545
8119A55610j16427r0004j6556q248j8537J6358M4713J28371l7701N0121J02238
8108B09938L1345j05795p4759n9713p7242j13725j3995Q4241P8615M4624Q350
8097A1884M6366j2541r5921l0598r409m6697M0467m1780q5704J90368L3320m5588
$$ plain form
8176 114635 125645 111396 8983 9644 58705 35105 19313 -65093 -104608 -127494 -77416 -209729
8164 -209729 -251118 -167374 -6817 -51207 -105409 26571 162441 234216 195247 141968 185806
8153 185806 227857 289370 204921 34135 -46015 21130 180680 195554 215719 265260 346681
8142 346681 262043 133867 94622 1546 -10791 54833 30181 -85812 -186927 -173316 -88033
8131 -88033 -95110 -172037 -22734 53125 111692 214162 244672 234834 132750 114066 101065 155610
8119 155610 39183 -50821 -67377 -75625 -94162 -77804 -33091 95280 57579 107700 209938
8108 209938 241283 135488 60729 1016 -76226 -189951 -203946 -119705 -41090 3534 11884
8097 11884 58250 45709 -50212 -80810 -90219 -136916 -96449 -138229 -223933 -33565 -245 -45833
8085d5833p8973O3341O4270O9775q7017j4964P6850M9237O9509j00123L174N2498
8073A21744j637L3959j42809j2467J23180k2853j8565N9012J08171K3198j11544
8062A59389j53200j19205j1052j0489N4458J46077P526n4024K9484L7573j62266
8051g5729L9246l8338l5090m3798R1589O5833R8491J16743j8315j13958p7048
8040I626k7660j33407o1773N1632Q0859K1142m1893P780K28464J48589n785J802
8028B79376k7613j40027J7888N4595n9153l1602o7392m876L1307Q3980j08243
8017B8240j17681r7390M7202L6631O7529M7422j51198N999K53025O8814j7999
8006A70594j7297m2815n5628m0942K3028J3161O8954p6210m2204k6917j16063
$$ plain form
8085 -45833 -124806 -61465 2805 72580 -14437 -29401 47449 96686 166195 66072 69246 121744
8073 121744 120107 154066 11257 -1210 121970 99117 80552 139564 247735 270933 159389
8062 159389 6189 -113016 -124068 -134557 -80099 65978 73504 19480 48964 86537 -75729
8051 -75729 -36483 -74821 -109911 -153709 -62120 3713 102204 218947 200632 86674 9626
8040 9626 -18034 -151441 -213214 -161582 -80723 -59581 -101474 -93694 134770 283359 277574 279376
8028 279376 251763 111736 129624 184219 125066 93464 26072 21196 52503 136483 28240
8017 28240 -89441 -186831 -139629 -102998 -35469 11953 -139245 -133246 119779 188593 170594
8006 170594 153297 110482 54854 13912 36940 50101 119055 42845 641 -26276 -142339
7995a42339q907N7733P5162M7774J4358J47855L8716P863q6799n3397M8183O5322
7983B11524r4601j31023m2191R7285l2145j89636l4122J34472j29808k4177O3539
7972a70883o1224J05407K52109J25521j08915p1198j59472l5111m586Q1778J27752
7961H1178R8482r5672k3567J2545M8953j19659O4398q744j90306O2202J27609
7950E7419K6461j02019J70344J18218n3397p7715j55962l1424k1147N9571n7146
7939f6797J3135J109j8145j70737Q4988j8956p261K6669N2313O4430j11842o6386
7927b17480j0837J29006L1596j1614r7641j1268O0170O8280O6182J3710J1332
7916C1436M9906M7100q8823J5969j4538j26147k3021J8406j63957m9928O6350
$$ plain form
7995 -142339 -151246 -93513 -18351 29423 43781 191636 230352 238215 151416 98019 146202 211524
7983 211524 116923 -14100 -56291 40994 8849 -180787 -214909 -80437 -210245 -234422 -170883
7972 -170883 -232107 -126700 125409 250930 142015 70817 -88655 -123766 -128352 -46574 81178
7961 81178 179660 83988 60421 72966 121919 2260 66658 57914 -132392 -70190 57419
7950 57419 83880 -18139 152205 270423 217026 139311 -16651 -48075 -69222 -9651 -66797
7939 -66797 -53662 -52553 -70698 -241435 -156447 -175403 -182664 -155995 -103682 -39252 -151094 -217480
7927 -217480 -228317 -99311 -67715 -79329 -176970 -188238 -128068 -59788 6394 20104 31436
7916 31436 81342 128442 39619 55588 41050 -85097 -108118 -89712 -253669 -303597 -237247
7905b37247R7231R9035k9436J5946k8371M0550K1396N9315N7256M6993P3098o4172
7893A51594k08938l3893J43854N6798q3681j02918j92124q4954K07649M9412J57731
7882F0530K28308o7930j47706j034N7980r9299k5538Q5631j35184o4580L224O6881
7870c8717k1524J46505N460r6748j59762l7536o3219J3615N1507P6535J32415
7859H531j27300j1754Q8578k7596j35840P1074P9004M7133k511J09176M7401k00418
7847e4522q7833N3716K7160o4442o7732L4499J10245k6330O1196J08224j0373
7836H3808o9170M4238l6668N94m8218O0544q8j47040N9085L6126m5941n9403r8864
7823b20997k182J1275K17168m9359j21579m8556J21161K21574j5002o9907m2140
$$ plain form
7905 -237247 -140016 -40981 -70417 -54471 -82842 -42292 -20896 38419 95675 142668 215766 151594
7893 151594 -57344 -91237 52617 109415 25734 -77184 -269308 -354262 -146613 -97201 60530
7882 60530 288838 220908 73202 72168 130148 30849 5311 90942 -44242 -108822 -105598 -38717
7870 -38717 -60241 86264 91724 -5024 -164786 -202322 -265541 -251926 -200419 -123884 8531
7859 8531 -118769 -130523 -41945 -69541 -205381 -134307 -55303 -8170 -10681 98495 145896 -54522
7847 -54522 -142355 -88639 -61479 -125921 -193653 -159154 -48909 -75239 -14043 94181 83808
7836 83808 14638 58876 22208 22802 -25416 35128 35040 -112000 -52915 -16789 -62730 -122133 -220997
7823 -220997 -223179 -211904 5264 -44095 -165674 -214230 -93069 128505 113503 43596 1456
7812A456Q24P4952M7015l1925n9257M8731O2832k6l6315o2866N8027R6717N672
7799B05837j11183j67722j9281K3967P0627J30933P0548p4710k2870O4287J26964
7788B97397m1618j01219k8242O989k31687l9005n6912n8494J63715N4106L5270
7777C00O9734L4200R3241j24219K8219K5712j09005k13311J3441J02446L483m6369
7765a22128P5118k4442L3863J12213M0743k2602q627j14650j01894J35214N0557
7754E3365j7434K1868m2981L1980N7194P5604m4899j022p5998N5262L6228L6890
7742A86057k8919q8275n5870R2898l2823l155j0639k4913j55892k06306J32093
7731a95744J68213n530l6175q0032j16848J1059J31290N2637M1332k2342M7608
$$ plain form
7812 1456 2280 77232 124247 92322 33065 81796 144628 144602 108287 45421 103448 200165 205837
7799 205837 94654 -73068 -92349 -68382 2245 133178 203726 129016 106146 170433 297397
7788 297397 255779 154560 126318 133307 -98380 -137385 -194297 -252791 -89076 -34970 300
7777 300 70034 104234 197475 73256 101475 127187 18182 -195129 -181688 -79242 -75759 -122128
7765 -122128 -47010 -71452 -37589 74624 115367 92765 84138 -30512 -132406 2808 53365
7754 53365 35931 57799 14818 46798 103992 179596 134697 133675 57677 112939 149167 186057
7742 186057 157138 68863 12993 105891 73068 69913 59274 34361 -121531 -327837 -195744
7731 -195744 -27531 -33061 -69236 -149268 -266116 -255057 -123767 -71130 -29798 -52140 -4532
7720d532p8477q409p0321p132O374J33994Q1064q8665j12088j534P8296P0794
7708f36P2644l2037j29062j08638j48698q6646M9945J40295J41754R0423n0487
7697f1143p4243P5528M4577M3263m2830J1627K3334j03359p3590J01516J22093
7686F6773J19104j41840n3497R4310j26334K4568N0873Q828K301J12987O2108
7675B20181j29931L0188R2235p3070j29833J6340M9977K6570o7527j14426q3835
7664a63131p626R743J976J27485J3858k0033n5715q9998j24245q7214K26795K01927
7652C3822M605o2855O3244k12953o3672J39442J39544M0685p5736J00811m1900
7641F5037q9065N89m0725L2072L7837r4878J35173J47565P6706k6046k99686j43128
$$ plain form
7720 -4532 -83009 -91418 -161739 -168871 -162497 -28503 52561 -36104 -148192 -149726 -71430 -636
7708 -636 72008 39971 -89091 -197729 -346427 -433073 -383128 -242833 -101079 -10656 -61143
7697 -61143 -135386 -59858 -15281 27982 -14848 -3221 20113 -83246 -156836 -55320 66773
7686 66773 185877 44037 -9460 84850 -41484 -16916 33957 42785 45086 158073 220181
7675 220181 90250 120438 212673 139603 9770 26110 76087 102657 35130 -79296 -163131
7664 -163131 -170757 -161014 -159038 -31553 -17695 -37728 -93443 -183441 -307686 -394900 -168105 33822
7652 33822 38427 -24428 38816 -174137 -237809 -98367 41177 81862 6126 106937 65037
7641 65037 -24028 -23439 -64164 -32092 5745 -89133 46040 193605 270311 244265 -55421 -198549
7629a98549j6611j9332M4371P3933m7708q6832N7706J70415J10411j36926j35866
7618a84988K5823O1640L110j72733K0878J81111O8316J8705L363n6269n9670j64685
7606b55399p695J03931M2326M9214o0376j05305Q2746J33638M5471j18157J5458
7595g4148q4253J42194J02424j59076j31272L8016J04702L2794N4996N6339K4794
7584A07510l7150P550j2771k0489p0251j85780l9952J96454J10601J15423j39428
7573C1717L767J52482L953j20667o1394j54987m1079J08405J62281M8613k02594
7562f9503p9301N9986R8271J0851j03920j27887P5213J08198J7915K8178M7337
7551F5338o9427j75269N246J48770L4408q9796j5575j1119Q9440J9673o767p7221
$$ plain form
7629 -198549 -215160 -234492 -190121 -116188 -163896 -250728 -193022 -22607 87804 -49122 -184988
7618 -184988 -159165 -97525 -94415 -267148 -246270 -65159 3157 21862 25225 -31044 -90714 -255399
7606 -255399 -263094 -159163 -116837 -67623 -127999 -233304 -150558 -16920 28551 -89606 -74148
7595 -74148 -158401 -16207 86217 -72859 -204131 -166115 -61413 -28619 26377 82716 107510
7584 107510 70360 77910 65139 44650 -25601 -211381 -251333 -54879 55722 171145 31717
7573 31717 35484 187966 191919 71252 9858 -145129 -186208 -77803 84478 133091 -69503
7562 -69503 -148804 -88818 9453 20304 -83616 -211503 -136290 -28092 -10177 18001 65338
7551 65338 -4089 -179358 -174112 -25342 9066 -80730 -96305 -107424 -17984 1689 -5078 -82299
7539h2299L3485N7894Q2651m1138j96561l9230J19596K0356j03722k9515k0707
7528a99190J1211J695M202K0765J9684L5980N3797N2112m719M5710K745p4367
7516c0375o63J54187Q8994n2557j20383p5502r3268j19181P4354l0325M6670J0382
7504a47667K0638m911j1401o6482k891J02195Q2760R4465j5032q6658q149q8600
7492a31733J948O2242k1870J15591R5355q3767j17576O6802J18459p6937l3757
7481e243m0926k4179o2615J04030J38907O8316j07760q9724J4174Q8926k1365
7470F2541j35188J5394K3600R8590K6654p6145m2221K8704q8996O0472O2811j4506
7458B1710j5060l3660O847M608L0909J3710J38214K3245j53019j35883k3961J40662
$$ plain form
7539 -82299 -48814 9080 91731 50593 -145968 -185198 -65602 -45246 -148968 -178483 -199190
7528 -199190 -187979 -186284 -182082 -161317 -141633 -105653 -51856 256 -4463 41247 43992 -30375
7516 -30375 -31038 123149 212143 159586 39203 -36299 -129567 -248748 -174394 -204719 -158049 -147667
7504 -147667 -127029 -131940 -143341 -209823 -212714 -110519 -27759 66706 51674 -34984 -43133 -131733
7492 -131733 -129785 -67543 -89413 26178 121533 37766 -79810 -13008 105451 28514 -5243
7481 -5243 -46169 -70348 -132963 -28933 109974 178290 70530 -19194 -5020 83906 62541
7470 62541 -72647 -57253 -33653 64937 91591 15446 -26775 1929 -87067 -26595 36216 21710
7458 21710 6650 -27010 -20163 -15555 15354 29064 167278 190523 37504 -98379 -122340 18322
7446A8322K3053J6407q7815l6981K4702m7453O971P6582j62845J42673J08362
7435H1978L9330j38754j46065L2239L3649R9292N1895J1184J5982j2464J14658
7424A82924Q9923j4744J0827n8560j13276j90895r5991J8075k8291O7152P6038
7413e6818p0510J703j1113N7098R4472j26448P4639J4508j53075j42095p6400
7402c94039J01655J27990o5430o5809J6942Q2356J09729o6601R3242M3963m315
7391b0317N3878r971p3908p7888m3744m4643R2863J73655J23163J5055p4531l5816
7379G7796j07191K395J0411M8502m3834m3677j8143j38349m7736n3314P7399J3237
7367b22504K555j10632K1366P1495N8808p4991J23801J33689k614l8600N1629
$$ plain form
7446 18322 41375 57782 -30033 -67014 -42312 -89765 -82794 -6212 -169057 -26384 81978
7435 81978 121308 -17446 -163511 -131272 -97623 1669 53564 64748 80730 68266 182924
7424 182924 272847 258103 268930 210370 97094 -93801 -189792 -171717 -200008 -132856 -56818
7413 -56818 -127328 -125625 -136738 -79640 14832 -111616 -36977 -22469 -175544 -317639 -394039
7402 -394039 -292384 -164394 -229824 -295633 -278691 -196335 -86606 -153207 -59965 -16002 -20317
7391 -20317 33561 23590 -50318 -128206 -171950 -216593 -123730 49925 173088 188143 113612 77796
7379 77796 -29395 -27000 -16589 31913 -11921 -55598 -73741 -212090 -259826 -313140 -235741 -222504
7367 -222504 -219949 -330581 -309215 -237720 -178912 -253903 -130102 3587 973 -37627 14002
7356A4002n8962N3450p3920L8419m0535k02443P839N5538o637N5648o2633l1669
7344b51903R1852J61704N2905r477O113M0776j9458l3887n6784J2265J5268J1983
7332B1357l3122p1452p7219o8320M8356K1733N5091K51k1753K30327J8646j59373
7320c5478j3475M8392L497p4871p9164n8942l494J0430q2631J0954J36634N4971
7308h3177N6134M0585q4759O9710N9902Q627n641O4136Q127j13638n4505j1197
7296d5696j77570J4565M1903m8818P15P1157J30110p8169r4093N1172J43101J538
7284I915M1899o111j05714j08258K0787N9934K1097R2376J80607M8408n2007r8328
7272A04605j12958j77675J49012J01335J1126n6773j43007k91L7707L2861K1422
$$ plain form
7356 14002 -44960 8490 -65430 -27011 -67546 -269989 -262150 -206612 -213249 -157601 -220234 -251903
7344 -251903 -160051 1653 54558 45081 51194 91970 72512 38625 -18159 -5894 9374 21357
7332 21357 -11765 -83217 -160436 -228756 -180400 -158667 -103576 -103325 -125078 105249 123895 -35478
7320 -35478 -48953 -561 2936 -71935 -151099 -210041 -213535 -203105 -285736 -274782 -138148 -83177
7308 -83177 -27043 13542 -71217 -1507 58395 67022 61381 125517 133644 20006 -34499 -45696
7296 -45696 -223266 -208701 -166798 -215616 -214901 -143744 -13634 -91803 -185896 -134724 8377 9915
7284 9915 51814 45703 -60011 -168269 -147482 -87548 -66451 25925 206532 254940 202933 104605
7272 104605 -8353 -186028 -37016 64319 75445 18672 -124335 -124626 -86919 -54058 -32636
7261c2636K9550p74o4671r6280p5052n8743J54310J35492l4161m8J5062L5026
7249G075p1964k0872J61740O6390j47423n6173R4192p4308m631J08081l9336m0779
7237a8008l0541j77576Q2940J18218J13479k4573l5739J20583J1796j05702j16083
7226f1206p8215p3400P0619J16106L5618j1041N4069K2344J481l5557R499K8661
7214G8978o1486r3586M9833P3652k6404j21396j30726K6361K6897L027k9513k1640
7202b26003J8726m2222k2459Q4617R5963N3915P3255r9455J4934K14820N61j81829
7190a5177L5440J2540J2813K1926R6934Q5563m1081k08665K1R2784L7443J5128
7178A45669n4587j06109M9627K9078k7693M2566M8463Q03O81j80503j84894l1227
$$ plain form
7261 -32636 -3086 -3860 -68531 -164811 -239863 -298606 -144296 -8804 -42965 -43013 -27951 7075
7249 7075 -64889 -85761 75979 142369 -5054 -61227 32965 -41343 -45974 62107 22771 -18008
7237 -18008 -48549 -226125 -143185 -24967 88512 63939 28200 148783 160579 54877 -61206
7226 -61206 -139421 -212821 -142202 -26096 9522 -1519 52550 74894 76375 40818 50317 78978
7214 78978 17492 -76094 -26261 47391 20987 -100409 -231135 -204774 -177877 -174850 -204363 -226003
7202 -226003 -207277 -249499 -271958 -187341 -91378 -37463 35792 -63663 -48729 166091 166652 -15177
7190 -15177 20263 32803 45616 67542 164476 250039 208958 293 314 93098 130541 145669
7178 145669 91082 -15027 34600 63678 35985 78551 127014 127817 128498 -52005 -236899 -268126
7166b68126J02878J23472J32844J48770j54719p6198J7250l50l9390m198L3231
7155A5464m8668r2578R0730J95914p0950L1564Q1341l4236o5402p59r3855j74890
7143a66325K8415J07502J12027L6092r4302m7719j8742j17239k5836J1793r68
7132a75302K3676Q7044L1471J29305l7041m9223K3591M2281m6517j52439r4764
7121b17918L256J03654k5609J2859m8024J63635R1820Q2441L7587L4765l8376
7110B00090j28405J77O298j22572n9845p7104M3783K8666P4286Q2332P2175J7576
7098A37457j5955j62599j73889j52248J80510J93337R9030J4615n6481j09787
7088d6010r1416R7643M9042J7067k0775K2293J98K1980o9108Q598K47286K6549
$$ plain form
7166 -268126 -165248 -41776 91068 239838 85119 8921 26171 25821 -13569 -17767 15464
7155 15464 -33204 -125782 -35052 160862 89912 121476 202817 168581 103179 102420 8565 -166325
7143 -166325 -137910 -30408 81619 117711 23409 -24310 -43052 -160291 -186127 -174334 -175302
7132 -175302 -151626 -64582 -33111 96194 59153 9930 33521 75802 29285 -123154 -217918
7121 -217918 -214662 -111008 -136617 -123758 -171782 -8147 83673 166114 203701 238466 200090
7110 200090 71685 71862 78160 -44412 -104257 -181361 -137578 -108912 -34626 47706 119881 137457
7098 137457 121502 -41097 -214986 -367234 -186724 6613 105643 120258 63777 -46010
7088 -46010 -137426 -39783 9259 26326 5551 27844 28042 50022 -19086 -10488 236798 263347
7076B63347j83134j7238L916k5494n7379p8083J06848O98l4236j20336j8537J97239
7064C7611k8955q01m3777k1866M1942q0706m9669M3266K04421Q3565K6003K7304
7052B38338n1701n0552J1953m089l5698K2487J6217p8453p9339R9332P5842J21806
7040B86143R7803m1208j42468q7353j56830M7715O3513j16046n9762J28854J08712
7029A29073K1466j89501m6133Q7100L1197M9285k9959Q4690Q2395m7583p5371
7018I6659j41277K0954Q0801n579j23681j61138j02938Q0879J32899J33827j1259
7007A47j3981L3442R7584Q9440k39081J2549r5671p7465P6123l734P3546l9289
6995h6390l2598O578J24812j18537j57484m7660J1827J15108P4125J37892j5707
$$ plain form
7076 263347 80213 62975 66891 41397 -15982 -94065 12783 13481 -20755 -141091 -159628 37611
7064 37611 8656 7855 -35922 -57788 -15846 -96552 -146221 -102955 101466 185031 211034 238338
7052 238338 186637 136085 148038 143949 108251 130738 146955 68502 -10837 88495 164337 286143
7040 286143 383946 342738 200270 112917 -43913 3802 67315 -48731 -108493 20361 129073
7029 129073 150539 -38962 -85095 2005 33202 82487 52528 137218 219613 172030 96659
7018 96659 -44618 -23664 57137 51558 -72123 -233261 -336199 -255320 -122421 11406 147
7007 147 -13834 19608 117192 206632 -32449 -19900 -115571 -193036 -116913 -120647 -47101 -86390
6995 -86390 -118988 -112410 12402 -106135 -263619 -311279 -299452 -184344 -110219 27673 11966
6984A1966j95001O9918J58746P1469O4168R0402k8659j30635j20668m3234m3411
6973i4939m4001J05287K38084R3253j79952j51299n3239Q601m9374J4568J02103
6962a0908j880j06622q9852N3368N8752p93l5511L3973N5422r2754J6538J83795
6950F3528J4029q0510j47815P2226J53313j7826o8504M105P8729m8741M3068o8439
6938b837r0404p4806P3487K7819n7101j347J9097O640J16975k7004j62230j08140
6926b79851N5934J3359K9481K0082l8497l6437Q9867N2802J1539n0103J6631j22463
6914b37656k0436O5822N6990J20317K7553K5717L1494L0778N8801K0618n5572
6903A24426m4394n2031P5070O4390o1361J666n6402j49499q1366l0002j2246K7035
$$ plain form
6984 11966 -183035 -113117 45629 117098 181266 271668 243009 112374 -8294 -51528 -94939
6973 -94939 -138940 -33653 204431 297684 117732 -33567 -86806 -78205 -127579 -113011 -10908
6962 -10908 -12788 -119410 -209262 -155894 -97142 -97935 -133446 -99473 -44051 -136805 -120267 63528
6950 63528 77557 -2953 -150768 -78542 74771 56945 -11559 -7454 71275 22534 65602 -2837
6938 -2837 -93241 -168047 -94560 -66741 -123842 -125189 -106092 -99452 17523 -9481 -171711 -279851
6926 -279851 -223917 -210558 -181077 -160995 -199492 -235929 -146062 -93260 -81721 -131824 -115193 -237656
6914 -237656 -258092 -192270 -135280 -14963 12590 38307 69801 100579 159380 179998 124426
6903 124426 80032 28001 103071 167461 106100 107766 51364 -98135 -179501 -209503 -221749 -194714
6891a94714P9412m0391p5211M3600P6351J09791j01485l3058p5473J0048k007
6880b03137m9037K6894Q7661Q9960J98695L2432j69908p6036K2990m1805p0648
6869a51939J07214j0031K9639J682l006N3606J48086m0990j13989q8674K9359
6858c9043j5393Q2407M0517j527L7488q388J9188M785n8283K1587N7194K6839
6846A67371p5902m8907J65772J10272j91775M006M7242j20218j15169q1392o619
6835a45319O3229P5818P3903P6914K3874j47146q384M588P5448k5889o0445Q9728
6823I6319k9985r3207r3602o0071p5990J22348J39148J19682q587j12865l0891
6812b7701J38470L3487p0913m1682n3502o5128j877N3692r619L1993N932j3783
$$ plain form
6891 -194714 -115302 -155693 -230904 -187304 -110953 -1162 -102647 -135705 -211178 -201130 -203137
6880 -203137 -252174 -225280 -137619 -47659 151036 183468 13560 -62476 -39486 -81291 -151939
6869 -151939 -44725 -54756 -25117 -23435 -26441 27165 175251 134261 20272 -68402 -39043
6858 -39043 -54436 27971 68488 66961 104449 96061 115249 120034 61751 83338 140532 167371
6846 167371 91469 42562 208334 318606 126831 130837 178079 57861 -57308 -138700 -145319
6835 -145319 -82090 -6272 67631 144545 168419 21273 12889 17477 92925 67036 6591 96319
6823 96319 66334 -26873 -120475 -180546 -256536 -134188 4960 124642 116055 3190 -27701
6812 -27701 110769 144256 73343 31661 -21841 -86969 -88846 -35154 -44773 -12780 -6848 -20631
6800b0631m1124r6852O2469J37469j02819R828l0762k4858P6025K0940K9403q886
6788A0202o2364o5654N3527O1342k7578P8704j12984O4339J32720j9267q2466
6777C0521p7432m3281K6269m2458J02481J7643R544P8224o0928r1327J3591k778
6765c9931j850n4530j08184r7301k7282J13154K373O0656M680J7999M6831J42229
6753E8844L3688j09160j9152l4645l8114r0172o4580J51851J67042P8403J17708
6742B51713p351r0616K7674j05519k25108m8693Q4838L4579K8634J997l0222K9932
6730d8142p2185O0730J96827m1050q4932k167o6571p645R0779N0892O3717K746
6718A42999r3117n388N0277m2665l9423j92452q1483K5852K6954n7808l6745l888
$$ plain form
6800 -20631 -61755 -158607 -96138 41331 -61488 -51660 -82422 -107280 -31255 -10315 19088 10202
6788 10202 -52162 -117816 -64289 -2947 -30525 48179 -64805 -466 132254 112987 30521
6777 30521 -46911 -90192 -63923 -106381 -3900 13743 23287 101511 40583 -50744 -37153 -39931
6765 -39931 -41781 -96311 -204495 -301796 -329078 -215924 -213551 -152895 -148215 -130216 -83385 58844
6753 58844 92532 -16628 -35780 -70425 -108539 -198711 -263291 -111440 55602 134005 251713
6742 251713 244362 153746 181420 75901 -149207 -197900 -113062 -78483 -49849 -47852 -78074 -48142
6730 -48142 -120327 -59597 137230 96180 11248 9081 -57490 -65135 25644 76536 140253 142999
6718 142999 49882 44494 94771 52106 12683 -179769 -261252 -235400 -208446 -266254 -302999 -306887
6706c06887n8391J7194J0066L1066R2464K12737j5890j36123M33N6997j4348l3772
6694a44454P8542j28914l8348R9314K9314P5048R9094K7532p5914k19385r691
6683b07862Q0724j4898n2756P4775P0724L777p4788j40922N9140J62181J766M2107
6671C968o4588o7440q9751j07742r5321j829K28195J52210m2573n527J61264M1855
6659A12721J9003M84O428M3790j45909k23671R013M6281J14488J16386j18253
6648a9239Q9926o978q4026j5468R6099J96939k2663j12144j17102q0321p3886
6637a48863J05962J70071m1753j5341P6661j8475j21949L9372l0766n4986l9906
6626g9973m325j6181Q7779j04188P7807O1312j11588K5631M2181j8156K6278R5206
$$ plain form
6706 -306887 -365278 -348084 -338018 -306952 -214488 -1751 -17641 -153764 -153331 -96334 -110682 -144454
6694 -144454 -65912 -194826 -233174 -133860 -104546 -29498 69596 97128 21214 -198171 -207862
6683 -207862 -127138 -142036 -194792 -120017 -49293 -45516 -120304 -261226 -202086 -39905 -38139 3968
6671 3968 -60620 -128060 -217811 -325553 -420874 -422703 -194508 -42298 -84871 -90398 70866 112721
6659 112721 131724 132208 138636 182426 36517 -187154 -178141 -131860 -17372 99014 -19239
6648 -19239 70687 63709 -20317 -35785 60314 257253 234590 122446 5344 -74977 -148863
6637 -148863 -42901 127170 85417 70076 146737 128262 6313 45685 14919 -40067 -79973
6626 -79973 -84298 -100479 -12700 -116888 -39081 22231 -89357 -63726 -21545 -39701 -13423 81783
6614H1783j3985n0826o6911q6026L5860O3131J31970l9979n9115q6910p5124j04898
6602b71030J11515Q022j24762k3091J26117K41491J8584L1275o1047m981l0355
6591B1738O5380K33184j7986j18582j79415M2702J21015N1280o6540r2704l883
6580E6189N9217o4724j48677J12543Q7733P9066N3921n4499p8356M5480Q586j30473
6568B6006j10044j23241J49237L9746K8040q2421l0039O7036M7865m3413j9484
6557e0712j4333j16503j8142N6854r1502N7853P0537J386K9843m6140k8057J51723
6545B807J29918l3175p1807K0379l6554r3973J0634N2658M7004K7613K1903M9923
6533A27330j06452l9881O1245l6579j3217P71q3351l0472J09698j42921q4711
$$ plain form
6614 81783 67798 16972 -49939 -135965 -100105 -36974 94996 55017 -4098 -91008 -166132 -271030
6602 -271030 -159515 -151493 -276255 -299346 -173229 68262 86846 118121 57074 52093 21738
6591 21738 87118 320302 302316 183734 4319 47021 168036 219316 152776 60072 56189
6580 56189 115406 50682 -97995 14548 102281 181347 235268 180769 102413 147893 156479 26006
6568 26006 -84038 -207279 -58042 -18296 9744 -72677 -102716 -35680 12185 -31228 -50712
6557 -50712 -65045 -181548 -199690 -142836 -234338 -176485 -105948 -104562 -74719 -120859 -148916 2807
6545 2807 132725 99550 27743 48122 11568 -82405 -71771 -19113 27891 55504 77407 127330
6533 127330 20878 -19003 42242 5663 -7554 -6783 -90134 -120606 -10908 -153829 -238540
6522b38540J20173Q755l9304N4773M131n4809o2835O9191J25197M0639l1869J64465
6510A59967P8331j17104n1442j7619j3962j04819j72944K2198M108k5153J27748
6499a10691O5214j5716j19069q1863K39116O8392q0597q2270p3319k2544r2657
6488c06004P6829J01096J31062R2767P6178j31283k2573J82592m5099l649L7166
6477A89082r5881q2644M8794J57161O6809O1300q392j51451j17647r0546N483
6466a7932p481K7929m5449p6635J26555p458k0688r9389j75538L0343J32206K57566
6454A24029M6813k2445K9848M1319J06826j02613j72791o4134k8637p8401r4417
6443b14603O2910P0876k1628J73335J56161j39636j31228k831O2507R6441k16868
$$ plain form
6522 -238540 -118367 -109612 -148916 -94143 -90012 -144821 -207656 -138465 -13268 27371 -4498 159967
6510 159967 238298 121194 69752 52133 38171 -66648 -239592 -217394 -213286 -238439 -110691
6499 -110691 -45477 -61193 -180262 -262125 -23009 45383 -35214 -117484 -190803 -213347 -306004
6488 -306004 -229175 -128079 2983 95750 171928 40645 18072 200664 155565 151916 189082
6477 189082 93201 10557 59351 216512 283321 344621 336229 184778 67131 -23415 -17932
6466 -17932 -25413 2516 -42933 -119568 6987 -471 -21159 -120548 -296086 -265743 -133537 124029
6454 124029 170842 148397 178245 219564 326390 223777 50986 -13148 -41785 -120186 -214603
6443 -214603 -151693 -80817 -102445 70890 227051 87415 -43813 -46644 15863 112304 -104564
6432a04564j3601J46600K7055r5655M463R6601n1118J8850O1582J3510j08323
6421d600L040Q0402M9165j39738k4852l1755j39501q5664Q2519N4129o253O4399
6409i8709J31782j745o1524k67r6451m7484J8207J33539J30528M446N7698j25909
6397D4111q3833r319n5935p8156m2372l4966J34314J95760R0922O8824O5982l2056
6385B63276j20903j51727K7558l9951r3967n4348q898J60834R6419j30399l8352
6374i0458k6093j5768K1817J43362J57476K2381k6569j203k4721l595j44434m2932
6362c0737j47907j1244M0114N0538K0680J1449q054o3603K348L332j241l220P4652
6349f2893k2438p8772M0681J93273j3385P193n8891K2305m4952j10864n5253J02238
$$ plain form
6432 -104564 -118165 28435 55490 -40165 -35702 60899 9781 28631 90213 103723 -4600
6421 -4600 -1560 78842 128007 -11731 -36583 -68338 -207839 -293503 -210984 -156855 -163108 -98709
6409 -98709 33073 31328 -30196 -30463 -126914 -174398 -156191 -22652 107876 112322 170020 44111
6397 44111 -39722 -49041 -104976 -183132 -225504 -260470 -126156 69604 160526 229350 295332 263276
6385 263276 142373 -9354 18204 -21747 -115714 -170062 -178960 -18126 78293 -52106 -90458
6374 -90458 -116551 -132319 -110502 32860 190336 212717 186148 184945 160224 156629 12195 -30737
6362 -30737 -178644 -189888 -149774 -99236 -78556 -67107 -75161 -138764 -136416 -133084 -134325 -137545 -62893
6349 -62893 -85331 -164103 -123422 69851 56466 63659 4768 27073 -17879 -128743 -183996 -81758
6337h1758m9632j2331l6269J52576n9542j89040o808Q7705M5633L3850l0369O0908
6325h5077L1995O9193J0879J1685P6012K2068N1978r9278q8069j31486J00396
6314b9704J16860K038L1940K9029o5589j63366o6974K5596j4999Q1171R0846j47232
6302a10384j28344N0331L6157o9479l1639n662K04106J12349N6183K1972k5593
6291A09997j05771n3259j5539p1772J17063Q2440j43992m0887N0118J06963k0434
6280A4927l8751j02633k2283o5193J29841J95467p6507J6232P5530R7979m0046
6269A84563K2676p4953J27208l3691o9096p7411J7094q0411j4243j7733L9826
6258B3829J7721K9142K465k396M0219J8419J4661m8443K6857K7001n5993j08311
$$ plain form
6337 -81758 -131390 -143721 -179990 -27414 -86956 -275996 -282804 -195099 -149466 -115616 -145985 -85077
6325 -85077 -53082 16111 26990 38675 114687 136755 188733 89455 1386 -130100 -29704
6314 -29704 87156 89194 121134 150163 84574 -78792 -145766 -120170 -135169 -53998 36848 -110384
6302 -110384 -238728 -188397 -152240 -221719 -253358 -259020 -54914 57435 113618 135590 109997
6291 109997 4226 -49033 -64572 -136344 -19281 63159 -80833 -121720 -71602 35361 14927
6280 14927 -23824 -126457 -148740 -213933 -84092 111375 34868 51100 126630 224609 184563
6269 184563 207239 132286 259494 225803 156707 79296 96390 15979 1736 -15997 23829
6258 23829 41550 70692 73157 70761 110980 129399 144060 95617 122474 149475 93482 -14829
6246a4829Q643j8298j0359J10855J41492j07440M4229p6859j57477L6467P1452
6235B7876m2072K3731l2247n6165K4386M5306J95988q974m7853N058p3276L6847
6223I8605N5916J9159O4250k5980m1186q1627k6338l1243K7572P7314j9183k0348
6211I6911r4348P2717q6626l3974Q2969K13272Q8119j33102n4647p0427O3085
6200A43949o2732r4849k1998R3559R8072O0993O1314k16116r4890K4500o2790
6189g0988o4113l673J45003K9483R198k0869J854p0700l6605r005j46111l5034
6177b71560j5881j2211L4915J42739O0771M4384Q8786j9696R588q6426M8023l3408
6165i976j53186q9589m8724n6627N039R6126R5590O7052O9030L6404k5578j88931
$$ plain form
6246 -14829 -6186 -24484 -34843 76012 217504 110064 154293 77434 -80043 -43576 27876
6235 27876 -14196 9535 -22712 -78877 -54491 -9185 186803 177829 129976 135034 61758 98605
6223 98605 154521 173680 237930 211950 170764 89137 62799 31556 59128 136442 117259 96911
6211 96911 2563 75280 -11346 -45320 37649 250921 339040 205938 151291 80864 143949
6200 143949 81217 -13632 -35630 57929 156001 216994 278308 62192 -32698 -8198 -70988
6189 -70988 -135101 -138774 6229 35712 44910 24041 25895 -44805 -81410 -90415 -236526 -271560
6177 -271560 -287441 -299652 -264737 -121998 -61227 -16843 71943 52247 61835 -24591 23432 -9976
6165 -9976 -163162 -252751 -301475 -358102 -353063 -256937 -161347 -94295 -25265 11139 -14439 -203370
6153b03370k2289J94791J29853j2604N6854k2497j08893j3683j81173J71071J44148
6142A32208l6935q64Q1561j2983p7097m1339k3692r4626p5432L993P7840j12468
6130a79834p7573P2041l7782L7141K3557Q283K62L1083R8630K5837o2977j40210
6118b01542L3596P7480Q5232J08046o7126r2149l9286j34157j2746J8712l473
6107b27413M6438l327O8139l9294j27728L919R6772K2760J01540O1128P190j73959
6095a63835j410P4438L0656K3000k865N679P1759J6956o4211n9633O0278l9731
6083d8919n1330N5841J56987O4796j22236N0485J8361J4843k9608j38103J6359
6072a2524k7821j7589n1472l3856P6980J09843J3375j0665r1685K076q6151O6868
$$ plain form
6153 -203370 -225659 -30868 98985 86381 143235 120738 11845 -1838 -183011 -11940 132208
6142 132208 95273 94409 175970 162987 85890 44551 20859 -73767 -149199 -145206 -67366 -179834
6130 -179834 -257407 -185366 -223148 -186007 -162450 -154167 -153905 -122822 -24192 1645 -61332 -201542
6118 -201542 -167946 -90466 -5234 102812 35686 -56463 -95749 -229906 -242652 -223940 -227413
6107 -227413 -180975 -184302 -116163 -155457 -283185 -279266 -182494 -159734 -58194 2934 10124 -163835
6095 -163835 -165245 -90807 -60151 -37151 -40016 -34337 37422 54378 -9833 -69466 -9188 -48919
6083 -48919 -100249 -44408 112579 177375 55139 105624 123985 138828 109220 -28883 -12524
6072 -12524 -40345 -57934 -109406 -143262 -66282 43561 56936 46271 -45414 -43338 -129489 -62621
6060f2621P4978Q6967K9819J05119j31526l01138j00958J06444J49535J2482j57634
6049a88533j6715N6769l7280r0460L1469J30094M2032k8833L8859p0530k9735
6038a62863R1252P6053O9861p2798j71709L0531m9525n9062Q4750Q6381j5318
6027i2447J49383K662Q060r7190n9437k7905k751J65781j4596m8701L0671j23842
6015a10312l1329N6989J30447p0319k00298M5349J91699j4619j87171j9138Q6617
6004a22085O7415j36018j4847n1291q9308j15J48787k7928m7144O8325M6974J02543
5992e4692K1859L1085m7014l4285M2894l1806j22979r7444J48502P7573N2011
5981a4296J6290j13092j66657n5832j11885L428J16185J16703O9770J26127k2729
$$ plain form
6060 -62621 12357 99324 129143 234262 102736 -198402 -299360 -192916 -43381 -30899 -188533
6049 -188533 -205248 -148479 -185759 -276219 -244750 -114656 -72624 -101457 -62598 -133128 -162863
6038 -162863 -71611 4442 74303 1505 -170204 -139673 -189198 -248260 -163510 -77129 -92447
6027 -92447 56936 59598 67658 -29532 -88969 -116874 -119625 46156 31560 -17141 13530 -110312
6015 -110312 -141641 -84652 45795 -24524 -224822 -179473 12226 -2393 -189564 -208702 -122085
6004 -122085 -54670 -190688 -205535 -256826 -346134 -346249 -197462 -225390 -272534 -204209 -157235 -54692
5992 -54692 -32833 -1748 -48762 -83047 -40153 -71959 -194938 -292382 -143880 -66307 -14296
5981 -14296 1994 -111098 -277755 -333587 -445472 -442044 -325859 -209156 -139386 -13259 -35988
5970c5988j00601n447k1655j25983J07086K44797k6917k03539k15409k0469k3973
5959d28098P7874J41295L3561N8401q0274K7644J25811j6563l3651k2590r1838
5948b08428O1133J80857J09952m5628j64245p3911j4450J591J15374l967P217
5937c4505R2366j16089K5684J51814l5700o1498m8980j910j9428O0213L1681q2943
5925c9295n4309k7067l7182Q9655K3538p0243J00778K8283q5011j832J15121M4062
5913H6498K8504P7367M5185O0646k5217j34748j74851p569R1754J3142m8707k12924
5901b00920j15465P7941O3145j4383J9963l6507R7810J24477j10995p3738L1048
5890a37624P6666N694M8407N7464O4662n1106j9346J2756j24459M5491p6276o4661
$$ plain form
5970 -35988 -136589 -142036 -163691 -289674 -182588 62209 35292 -168247 -383656 -404125 -428098
5959 -428098 -350224 -208929 -175368 -116967 -197241 -169597 -43786 -60349 -94000 -116590 -208428
5948 -208428 -147295 33562 143514 97886 -66359 -140270 -154720 -153129 -37755 -41722 -34505
5937 -34505 57861 -58228 -32544 119270 83570 22072 -26908 -28818 -48246 11967 43648 -39295
5925 -39295 -93604 -120671 -157853 -68198 -44660 -114903 -14125 14158 -70853 -72685 42436 86498
5913 86498 115002 192369 237554 298200 272983 138235 -36616 -44185 47569 60711 12004 -200920
5901 -200920 -316385 -238444 -175299 -189682 -169719 -206226 -108416 16061 -94934 -168672 -137624
5890 -137624 -60958 -55264 -6857 50607 115269 64163 44817 57573 -66886 -21395 -97671 -162332
5878a62332L2482Q2269J56854J06893j45920j67318m5599K1908N3171k6858J5681
5867g8769o63k226J04975n0753k38226J9043N5572J64918K1431q8460j11640P6162
5855a28636L6802Q7816q3943j20822l2207l6502m3977M5054J19911K04565o4667
5844a6606r5199J53440k4369q3455l3648L0823p7998j38056J44049P7419J11074
5833D7474Q7723j06118m0916P6929K5666j4828L3269m9895m1287j02350N5981
5822b8352J8037n8015J06773L4407k9219q7083J773J37917R8006j36389L065q1165
5810b0245p7099L5740O7677R5316j59333k6203O518q3907j8980J37499J32764
5799H9747r2842m1179J7968M8693P7829J2047l8962N1821R538l2040n4286o4326
$$ plain form
5878 -162332 -129850 -47581 109273 216166 70246 -97072 -142671 -120763 -67592 -94450 -78769
5867 -78769 -79432 -81658 23317 -27436 -265662 -246619 -191047 -26129 -4698 -93158 -204798 -128636
5855 -128636 -91834 -4018 -87961 -208783 -240990 -277492 -321469 -276415 -156504 48061 -16606
5844 -16606 -111805 41635 17266 -66189 -99837 -69014 -147012 -285068 -141019 -63600 47474
5833 47474 135197 29079 -11837 65092 90758 75930 109199 59304 18017 -84333 -28352
5822 -28352 -10315 -68330 38443 72850 43631 -43452 -41679 96238 194244 57855 60920 -20245
5810 -20245 -97344 -61604 6073 101389 -57944 -84147 -77629 -161536 -180516 -43017 89747
5799 89747 -3095 -44274 -26306 22387 100216 112263 73301 125122 134660 102620 48334 -15992
5787a5992R791R725j16221o3274L4905j00639k1086P5092m5660j4747J13530O2583
5775g1993l8987k0210J6445O2546N6936n7862l8327J4473J69004P4143O3064R1242
5763C20474k81233j19777J5964M4174J6048p8905m6472o3286n890m4867P8573
5752a65197O6571n820k1530J57751J04242l8296N2171P5375k26834k28673M5035
5741a85205J8964J17523n5973L0544O6110n3073r218l8976P4048K8701O1310J6209
5729G0964J9452R040K8302l0218n2759j04334j5852P0705P5729j21833j32565
5718a83369k8330j43931J88433K42991l694M0143O0641l2768j26914L3651m1032
5707E821M4297m7620n4129m5467l1430j04508Q033o6301j6024K19845Q4469j66990
$$ plain form
5787 -15992 -6201 3524 -112697 -175971 -141066 -241705 -262791 -187699 -233359 -248106 -134576 -71993
5775 -71993 -110980 -131190 -114745 -52199 4737 -53125 -91452 -76979 92025 166168 229232 320474
5763 320474 39241 -80536 -64572 -20398 -4350 -83255 -129727 -193013 -198903 -243770 -165197
5752 -165197 -98626 -104446 -125976 31775 136017 97721 149892 225267 -1567 -230240 -185205
5741 -185205 -166241 -48718 -104691 -74147 -8037 -61110 -70328 -109304 -35256 -6555 54755 70964
5729 70964 90416 99456 127758 97540 44781 -59553 -75405 -4700 71029 -50804 -183369
5718 -183369 -211699 -355630 -167197 75794 72100 112243 172884 140116 13202 46853 5821
5707 5821 50118 2498 -51631 -97098 -128528 -233036 -225003 -291304 -307328 -87483 -3014 -170004
5695a70004k0037L2118j20214O302Q2471P7205J5497k2875O9667J02819J25463
5684A78412j3605J7437n2063K2044Q098r3242j8075N8442m5018m5645j2914J33093
5672A36964R5696k5082q5593j55965r413K7340k0492O9818p7321n0974r978M8791
5660e6209J4349n752m6953K7267Q689n9845L3751m2378k7290M9545N9458j25091
5648a70459j10233n2937P7758R2427O1515n9764P407J29187J03675R692Q5911
5637A74179N316l9415J1350P5138j8713q8689j19952j16185M7549M1180L0059
5626A817M853J25435O0493j80048r8055k7915O0891j192K0372n0805P8293N3763
5614D7902K1359N7232R454j37322l5733J47679l5092l0744P52o4154L6251k476
$$ plain form
5695 -170004 -190041 -157923 -278137 -271835 -189364 -112159 -96662 -119537 -49870 52949 178412
5684 178412 164807 182244 130181 152225 160323 67081 49006 107448 62430 16785 3871 136964
5672 136964 232660 207578 121985 -33980 -43393 -16053 -36545 33273 -44048 -95022 -105000 -56209
5660 -56209 -41860 -47612 -94565 -67298 -58609 -118454 -84703 -127081 -154371 -104826 -45368 -170459
5648 -170459 -280692 -333629 -255871 -163444 -101929 -161693 -154286 -25099 78576 88268 174179
5637 174179 179495 140080 151430 226568 207855 119166 -786 -116971 -69422 -28242 1817
5626 1817 6670 132105 192598 12550 -85505 -113420 -52529 -53721 -33349 -84154 -5861 47902
5614 47902 69261 126493 135947 -1375 -37108 110571 75479 44735 45487 -18667 17584 15108
5602A5108L3249l5683r526o1386L560J61351M4193j08090k01054N2466J39263
5591C3451J05157J6193L4289l0750j47556k4960O2146n4944o1221J04687R794
5580D6286o6722m2353J6219j9098m020k36249r6109J51737J8719k226p730K7523
5568b14023n9467M9356J35972J211O209k7704m003J33323r6890q7490j7854O9272
5556a12088K1924O6616L8046p3471n8946L0548m6526l6523P0224J63567J61090
5545B24461j06003j4161q3593r5173m772m9325j09766J51412J52303P6395j00820
5534D0958M4990J00740o2751j72590j38766O9989O26N5823Q9452R0189J3462M8260
5522A80382l9717r2775q215k1566o2972p4415J08408M4302m880o5698q8040j22585
$$ plain form
5602 15108 48357 12674 3148 -58238 -54678 106673 150866 42776 -158278 -105812 33451
5591 33451 138608 154801 189090 158340 10784 -14176 47970 -6974 -68195 36492 46286
5580 46286 -20436 -62789 -46570 -65668 -69688 -305937 -402046 -250309 -231590 -233816 -241546 -214023
5568 -214023 -273490 -224134 -88162 -86951 -80742 -108446 -112449 20874 -76016 -163506 -181360 -112088
5556 -112088 -90164 -23548 14498 -58973 -117919 -87371 -133897 -170420 -100196 63371 224461
5545 224461 118458 104297 20704 -74469 -79241 -128566 -238332 -86920 65383 141778 40958
5534 40958 85948 186688 123937 -48653 -187419 -117430 -116804 -60981 28471 118660 132122 180382
5522 180382 140665 47890 39675 18109 -44863 -119278 -10870 33432 28552 -37146 -125186 -247771
5510b47771Q2697J15523l776q4943r2694J26516K9006m5073r258J33605K7203
5499C1035j26584j53459n866M8801R3421J51299R399j33279m8555J27253O7621
5488F1086o480n4152j228Q5647k9273l0581J6178m7030J316K19355L3416j06017
5476A42237l636J5249j23754o0047M2690J6683R63J1021M0584K0780m0569j41038
5464g8837o1235M6040J23624K6300j0100o9684r1770j6397P8073l6255L576l0020
5452a16685P2501O3732j52408L3441L9717j18602R5011J89042L2569K0640k6100
5441A32858K8446M4135n0821o9437J7854r1992j41964n5921L7185J43218K28531
5430B22092J20673q8279r3691q2737p3030p2845r6310k1224L8161J9391O4864
$$ plain form
5510 -247771 -165074 -49551 -53327 -138270 -230964 -104448 -75442 -120515 -129773 3832 31035
5499 31035 -95549 -249008 -254874 -206073 -112652 38647 48046 -85233 -133788 -6535 61086
5488 61086 54606 454 -774 84873 55600 25019 41197 -5833 -4517 214838 248254 142237
5476 142237 138601 153850 30096 -29951 12739 29422 30385 41406 81990 102770 62201 -78837
5464 -78837 -140072 -94032 29592 55892 45792 -23892 -115662 -132059 -53986 -90241 -86665 -116685
5452 -116685 -44184 19548 -132860 -99419 -59702 -178304 -83293 105749 138318 158958 132858
5441 132858 161304 205439 154618 85181 103035 11043 -130921 -186842 -149657 -6439 222092
5430 222092 342765 254486 160795 78058 5028 -67817 -164127 -185351 -147190 -127799 -62935
5419f2935l3474o2031K5527L4612n099R3718P6574r9913j03607p4524o9763N4517
5407b26398j5343j7020K6638P4632Q5348J60947k4450p9385J32223K1653j95661
5396e6816p7348l3295P7828Q7195L3530J2509k3589K1398q4182L8627Q7276R9434
5384A82567l4125r2141j0271O248J0118N9619n8559k0228J14264j6251j20713
5373B0528o7863o9800K0491K9128J32351R8475r9041q7976J4775j06942j49338
5362b65212J6708M4478J37411K76348k4274j87413m0170n7878J22793J43751K4286
5351A90828j06177l0855L0068N7443J37814q3666j28592l2593m3632M3066P6216
5340A09920l6677j42960r1457N6450j50534R9050J73163L3968k6397J73846m9460
$$ plain form
5419 -62935 -96409 -158440 -132913 -98301 -103400 -9682 66892 -33021 -136628 -211152 -280915 -226398
5407 -226398 -241741 -258761 -232123 -157491 -72143 88804 64354 -15031 117192 138845 -56816
5396 -56816 -134164 -167459 -89631 -2436 31094 43603 20014 41412 -42770 -4143 83133 182567
5384 182567 148442 56301 46030 52278 62396 122015 63456 43228 157492 141241 20528
5373 20528 -47335 -117135 -96644 -67516 64835 163310 64269 -23707 -8932 -115874 -265212
5362 -265212 -248504 -204026 -66615 209733 185459 -1954 -42124 -100002 22791 166542 190828
5351 190828 84651 53796 83864 141307 279121 195455 66863 34270 -9362 33704 109920
5340 109920 73243 -69717 -161174 -104724 -255258 -156208 16955 50923 24526 198372 148912
5329A48912r089l008p8811L305M0304q4797J7697J12929L7657j71239L055j19625
5317a02710j32194j4214J26408J98823P5247K502j13997j32429j9167J03838P1205
5306F3312j12789l1225O1492n833J25587R3847L1422n3001r1161K5515j18464
5295a1298k9871K4999M4788L7915L8946l3775L2728J12674L9605k93231j16082
5284a52602J23683K2461J3980J7222J5964J8127p3056P282J0013P4904J1403j14001
5272b4620m0807o9229r7500m4019l4135Q5648J98767Q7458k3128q5507J37244
5261I0172r2963m9186k0676j19746j15440m3794J52075J14174Q6631N3134j09061
5250e4680K7674Q318l7104n3809J06632J22503r785o8300j19885L9616p551K3782
$$ plain form
5329 148912 139823 136815 58004 61309 101613 16816 34513 147442 185099 13860 16915 -102710
5317 -102710 -234904 -249118 -122710 76113 151360 153862 39865 -92564 -111731 -7893 63312
5306 63312 -49477 -80702 -19210 -25043 100544 194391 225813 172812 81651 107166 -11298
5295 -11298 -41169 -16170 28618 66533 105479 71704 104432 217106 256711 -36520 -152602
5284 -152602 -28919 -6458 7522 24744 40708 58835 -14221 -6939 3074 77978 89381 -24620
5272 -24620 -65427 -134656 -232156 -276175 -310310 -224662 -25895 61563 38435 -47072 90172
5261 90172 -2791 -51977 -72653 -192399 -307839 -351633 -199558 -85384 1247 54381 -54680
5250 -54680 -27006 -18688 -55792 -109601 -2969 119534 109749 41449 -78436 -38820 -46371 -22589
5238b2589k3121q155q7244Q4260N5023q4901j08048k4922J04519P5776J9445J12485
5226I2528n437j1262m2952J7499l087k9175q5763Q0322J5601r9342l5119j03495
5214b09682j7039J02842J22300J8515k8800r67N6022j18767l8789P6544J36296
5203I8475R2205P6287m2492j00906j72922J14444R9427o3477j1201M5242k1652
5192A13430q5195J09492J81822L3630k20456l3119R7514p9658Q326J8138m9011
5181I4913o1674k0272J05712N5536j09998j2210P9921L2971j25941m3049q8141
5170i2232j50121n6457K90J2157R0306J35614n5466m7545O8466R9842O1437R5539
5158A61830n7276j00861j08260o2159l1213l8164M4039J14535N2355k9171K1214
$$ plain form
5238 -22589 -45710 -53865 -141109 -56849 -1826 -86727 -194775 -219697 -115178 -39402 -19957 92528
5226 92528 87091 75829 32877 50376 47289 18114 -67649 12673 28274 -71068 -106187 -209682
5214 -209682 -226721 -123879 -1579 16936 -11864 -12831 43191 -75576 -114365 -37821 98475
5203 98475 190680 266967 224475 123569 -49353 65091 164518 101041 89840 135082 113430
5192 113430 28235 137727 319549 353179 132723 99604 197118 117460 125786 143924 94913
5181 94913 33239 12967 118679 174215 64217 52007 131928 164899 38958 -4091 -92232
5170 -92232 -242353 -298810 -298520 -286363 -196057 -60443 -115909 -163454 -94988 4854 66291 161830
5158 161830 104554 3693 -104567 -166726 -197939 -236103 -192064 -77529 -25174 -54345 -33131
5147c3131J05646p322j00369j16400n1622L7428M4789J20092k315r4775j324l3928
5135a33231q2395J19477J90401Q1315o1308n9257j01266j04192n0972J00468J37671
$$ plain form
5147 -33131 72515 65193 -35176 -151576 -203198 -165770 -120981 -889 -3204 -97979 -99303 -133231
5135 -133231 -215626 -96149 94252 175567 114259 55002 -46264 -150456 -201428 -100960 36711
$$ [...]
##END NTUPLES=NMR SPECTRUM
##END=
