##TITLE=Analysis number 324040
Compound Code mo 07912
Project Code adrs
Chemist Name fudan
##JCAMPDX= 6.0         $$ Bruker NMR JCAMP-DX V2.0
##DATA TYPE= NMR SPECTRUM
##DATA CLASS= NTUPLES
##ORIGIN= Bruker BioSpin GmbH
##OWNER= nmr
$$ XWIN-NMR		Version 3.5
$$ Tue Nov 14 09:24:19 2006 GMT Standard Time (UT+0h)  MAYBRIDGE\nmr@NMR_250MHZ
##.OBSERVE FREQUENCY= 250.131544655141
##.OBSERVE NUCLEUS= ^1H
##.ACQUISITION MODE= SIMULTANEOUS (DQD)
##.ACQUISITION SCHEME= undefined
##.AVERAGES= 16
##.DIGITISER RES= 18
##SPECTROMETER/DATA SYSTEM= dpx250
##.PULSE SEQUENCE= zg30
##.SOLVENT NAME= CDCl3
##.SHIFT REFERENCE= (INTERNAL, CDCl3, 0, 16.5037)
##AUDIT TRAIL= $$ (NUMBER, WHEN, WHO, WHERE, WHAT)
$$ ##TITLE= Audit trail, XWIN-NMR		Version 3.5
$$ ##JCAMPDX= 5.01
$$ ##ORIGIN= Bruker BioSpin GmbH
$$ ##OWNER= nmr
$$ C:\u/data/dgb/nmr/ADRS/90/pdata/1/auditp.txt
$$ ##AUDIT TRAIL=  $$ (NUMBER, WHEN, WHO, WHERE, WHAT)
(   1,<2006-11-14 09:23:55.39 +000>,<MAYBRIDGE\nmr>,<NMR_250MHZ>,
      <created by zg, POWCHK disabled, PULCHK disabled
       configuration hash MD5:
       49 4B E0 1D 92 C2 6B 37 9F E6 65 BC 52 41 86 1D
       data hash MD5: 64K
       9A 7D D7 A9 0D 3F 82 3C E5 FF 5A C1 A0 24 F9 E5>)
(   2,<2006-11-14 09:24:07.44 +000>,<MAYBRIDGE\nmr>,<NMR_250MHZ>,
      <Start of raw data processing
       ef LB = 0.3 FT_mod = 6 PKNL = 1 SI = 32K 
       data hash MD5: 32K
       FD 7B 05 89 49 5C BB 41 41 6F D5 FC D5 15 43 31>)
(   3,<2006-11-14 09:24:09.34 +000>,<MAYBRIDGE\nmr>,<NMR_250MHZ>,
      <apk 
       data hash MD5: 32K
       0F 6B F3 8A FF 0D FE A3 E3 4E 4D 43 2B FD 7A 17>)
(   4,<2006-11-14 09:24:10.22 +000>,<MAYBRIDGE\nmr>,<NMR_250MHZ>,
      <abs ABSG = 5 
       data hash MD5: 32K
       B7 6D CB 2E A0 3B 94 88 51 64 BF E2 F2 D5 13 F8>)
$$ ##END=
$$ 
$$ hash MD5
$$ 51 0C 3B 00 8A 4D 9B 2D 15 7B FF B3 C9 7C AE BA
##$RELAX= 
##$RELAX= 
##$RELAX= 
##$RELAX= 
##$RELAX= 
##$RELAX= 
##$RELAX= 
$$ Bruker specific parameters
$$ --------------------------
##$DU= <C:\u>
##$EXPNO= 90
##$NAME= <ADRS>
##$PROCNO= 1
##$TYPE= <nmr>
##$USER= <dgb>
##$AMP= (0..31)
100 100 100 100 100 100 100 100 100 100 100 100 100 100 100 100 100 100 
100 100 100 100 100 100 100 100 100 100 100 100 100 100 
##$AQSEQ= 0
##$AQ_mod= 3
##$AUNM= <au_zg>
##$AUTOPOS= <10 >
##$BF1= 250.13
##$BF2= 250.13
##$BF3= 250.13
##$BF4= 250.13
##$BF5= 500.13
##$BF6= 500.13
##$BF7= 500.13
##$BF8= 500.13
##$BYTORDA= 1
##$CFDGTYP= 0
##$CFRGTYP= 5
##$CHEMSTR= <none>
##$CNST= (0..31)
1 1 145 1 1 1 1 1 1 1 1 1 1 1 1 1 1 1 1 1 1 1 1 1 1 1 1 1 1 1 1 1 
##$CPDPRG= <>
##$CPDPRG1= <>
##$CPDPRG2= <>
##$CPDPRG3= <>
##$CPDPRG4= <mlev>
##$CPDPRG5= <mlev>
##$CPDPRG6= <mlev>
##$CPDPRG7= <mlev>
##$CPDPRG8= <mlev>
##$CPDPRGB= <>
##$CPDPRGT= <>
##$D= (0..31)
0 1 0 0 0 0 0 0 0 0.06 0 0 0 0 0 0 0.0002 0 0 0 0 0 0 0 0 0 0 0 0 0 0 
0 
##$DATE= 1163496234
##$DBL= (0..7)
120 120 120 120 120 120 120 120 
##$DBP= (0..7)
150 150 150 150 150 150 150 150 
##$DBP07= 0
##$DBPNAM0= <>
##$DBPNAM1= <>
##$DBPNAM2= <>
##$DBPNAM3= <>
$$ [...]
##$SUBNAM7= <"">
##$SUBNAM8= <"">
##$SUBNAM9= <"">
##$SW= 20.6930455092707
##$SWIBOX= (0..15)
0 0 3 0 0 0 0 0 0 0 0 0 0 0 0 0 
##$SW_h= 5175.983436853
##$TD= 65536
##$TD0= 1
##$TE= 683.16
##$TE2= 300
##$TE3= 300
##$TEG= 300
##$TL= (0..7)
0 120 120 120 120 120 120 120 
##$TP= (0..7)
150 150 150 150 150 150 150 150 
##$TP07= 0
##$TPNAME0= <>
##$TPNAME1= <>
##$TPNAME2= <>
##$TPNAME3= <>
##$TPNAME4= <>
##$TPNAME5= <>
##$TPNAME6= <>
##$TPNAME7= <>
##$TPOAL= (0..7)
0.5 0.5 0.5 0.5 0.5 0.5 0.5 0.5 
##$TPOFFS= (0..7)
0 0 0 0 0 0 0 0 
##$TUNHIN= 0
##$TUNHOUT= 0
##$TUNXOUT= 0
##$USERA1= <user>
##$USERA2= <user>
##$USERA3= <user>
##$USERA4= <user>
##$USERA5= <user>
##$V9= 5
##$VALIST= <valist>
##$VCLIST= <CCCCCCCCCCCCCCC>
##$VD= 0
##$VDLIST= <DDDDDDDDDDDDDDD>
##$VPLIST= <PPPPPPPPPPPPPPP>
##$VTLIST= <TTTTTTTTTTTTTTT>
##$WBST= 1024
##$WBSW= 4
##$XGAIN= (0..3)
0 0 0 0 
##$XL= 0
##$YL= 0
##$YMAX_a= 444049
##$YMIN_a= -553764
##$ZGOPTNS= <>
##$ZL1= 120
##$ZL2= 120
##$ZL3= 120
##$ZL4= 120
##$ABSF1= 16.50373
##$ABSF2= -4.189442
##$ABSG= 5
##$ABSL= 3
##$ALPHA= 0
##$AQORDER= 0
##$ASSFAC= 0
##$ASSFACI= 0
##$ASSFACX= 0
##$ASSWID= 0
##$AUNMP= <proc_1d>
##$AZFE= 0.1
##$AZFW= 0.1
##$BCFW= 0
##$BC_mod= 0
##$BYTORDP= 0
##$COROFFS= 0
##$CY= 12.5
##$DATMOD= 1
##$DC= 0
##$DFILT= <>
##$DTYPP= 0
##$F1P= 14.0000005364418
##$F2P= -0.99999901652339
##$FCOR= 0.5
##$FTSIZE= 32768
##$FT_mod= 6
##$GAMMA= 0
##$GB= 0
##$INTBC= 1
##$INTSCL= 1
##$ISEN= 128
##$LB= 0.3
##$LEV0= 0
##$LPBIN= 0
##$MAXI= 10000
##$MC2= 0
##$MEAN= 0
##$ME_mod= 0
##$MI= 0
##$NCOEF= 0
##$NC_proc= -2
##$NLEV= 6
##$NOISF1= 0
##$NOISF2= 0
##$NSP= 0
##$NTH_PI= 0
##$NZP= 0
##$OFFSET= 16.50373
##$PC= 1
##$PHC0= 158.9511
##$PHC1= 6.131417
##$PH_mod= 1
##$PKNL= yes
##$PPARMOD= 0
##$PSCAL= 4
##$PSIGN= 0
##$REVERSE= no
##$SF= 250.130004567571
##$SI= 32768
##$SIGF1= 0
##$SIGF2= 0
##$SINO= 400
##$SIOLD= 32768
##$SREGLST= <1H.CDCl3>
##$SSB= 0
##$STSI= 32768
##$STSR= 0
##$SW_p= 5175.98343685301
##$SYMM= 0
##$S_DEV= 0
##$TDeff= 65536
##$TDoff= 0
##$TI= <Analysis number 999999
Compound Code 99
Book Reference 9
Project Code 9>
##$TILT= no
##$TM1= 0
##$TM2= 0
##$TOPLEV= 0
##$USERP1= <user>
##$USERP2= <user>
##$USERP3= <user>
##$USERP4= <user>
##$USERP5= <user>
##$WDW= 1
##$XDIM= 32768
##$YMAX_p= 300568452
##$YMIN_p= -40916
$$ End of Bruker specific parameters
$$ ---------------------------------
##NTUPLES= NMR SPECTRUM
##VAR_NAME=  FREQUENCY,     SPECTRUM/REAL,   SPECTRUM/IMAG
##SYMBOL=    X,             R,               I
##VAR_TYPE=  INDEPENDENT,   DEPENDENT,       DEPENDENT
##VAR_FORM=  AFFN,          ASDF,            ASDF
##VAR_DIM=   32768,         32768,           32768
##UNITS=     HZ,            ARBITRARY UNITS, ARBITRARY UNITS
##FACTOR=    0.157963299565203, 1,           1
##FIRST=     4128.07825386402, 0,            0
##LAST=      -1047.90518298899, 0,           0
##MIN=       -1047.90518298899, -40916,      0
##MAX=       4128.07825386402, 300568452,    0
$$ Real data points
##PAGE= N=1
##DATA TABLE= (X++(R..R)), XYDATA
$$ [...]
18320 273009 283110 295971 310603 325156 341255 362829 392126 427580 468756 518871 581426
18309 581426 660812 757833 865977 975483 1072842 1145381 1191912 1221907 1246613 1283315 1333914
18298 1333914 1388199 1438148 1491866 1570617 1678886 1817108 1987638 2181516 2398588 2674255
18288 2674255 3002647 3310637 3528223 3596015 3480761 3276035 3075524 2920021 2839390 2820024
18278 2820024 2836439 2874853 2915732 2975623 3087551 3258240 3495178 3791241 4128203 4505543
18268 4505543 4943699 5446882 6054857 6865994 7973590 9468895 11441255 13806068 16274625
18259 16274625 18501124 20058858 20887166 21840182 23695857 26419993 29503998 32706351
18251 32706351 35125471 35333045 33538141 30769743 27346022 23189332 19183630 16414040
18243 16414040 15109600 15023621 15868928 17428380 19524315 21818595 23948435 25714848
18235 25714848 26773718 26769229 25817698 24024668 21669192 19421764 17720158 16738153 16488830
18226 16488830 16818576 17480340 18348300 19479739 20757417 22230116 24014430 25752329
18218 25752329 26695834 26919468 27162120 27179031 26193388 24072135 20853487 16931957 13376749
18209 13376749 10733376 8921729 7726527 6942552 6423991 6068376 5831733 5720137 5739420
18200 5739420 5840298 5931087 5924767 5708535 5311799 4921492 4634457 4449706 4321709 4223859
18190 4223859 4135393 4029589 3941691 3933977 4043420 4287101 4655277 5088234 5478827 5697132
18180 5697132 5622425 5312259 4996530 4817454 4821976 5057206 5505163 6074813 6647739 7085331
18170 7085331 7332026 7647649 8312062 9358182 10546250 11398624 11509615 10771798 9241384
18161 9241384 7614173 6327767 5462243 4966252 4743222 4701444 4775465 4947967 5240617
18152 5240617 5658650 6174619 6732837 7228611 7581278 7687515 7489421 7111916 6631245
18143 6631245 6031935 5403720 4912691 4611209 4484453 4519851 4669624 4828892 4868290 4685387
18133 4685387 4320209 3952743 3702351 3577388 3525783 3510085 3494876 3405429 3228599 3095960
18123 3095960 3064583 3135965 3299467 3565337 3899863 4228275 4436795 4466839 4450722 4555347
18113 4555347 4917359 5627935 6606246 7565723 8297559 8508688 7382147 5906724 4768883
18104 4768883 3962240 3421714 3071408 2827004 2593603 2335520 2101038 1912523 1752832
18095 1752832 1607802 1487906 1411890 1386186 1416365 1505071 1665323 1887750 2139103 2373732
18085 2373732 2521216 2501507 2351801 2149285 1961136 1842885 1806633 1830617 1867116 1862213
18075 1862213 1750083 1578394 1451579 1394284 1395616 1432055 1472059 1488771 1444377 1325139 1177526
18064 1177526 1046559 947647 888175 871230 891410 944291 1017525 1080403 1105769 1074039 973092
18053 973092 835653 703528 594779 513503 455811 413285 385725 364697 348211 333795 324174
18042 324174 320809 317778 315855 316813 314838 309430 304649 304204 304959 305366 301816 286027 258843 235203
18028 235203 216559 199841 189315 181757 174789 165075 157745 153472 149230 147793 145376 143725 141759
18015 141759 139646 138312 137044 134362 129448 124111 119061 113132 109375 107560 105482 103840 103578 100550
18001 100550 99254 99105 99090 97410 94726 91204 90241 87708 85115 84506 83509 81517 80864 82540 82144 79673
17985 79673 77580 76591 76825 77209 76712 75326 75082 70885 68856 67192 66018 64411 59657 57953 59425 59983
17969 59983 58031 55079 54070 54745 53626 55097 56305 55069 52569 53426 51453 48222 45294 44107 43906
17954 43906 41335 39941 40356 41529 43392 44462 44060 41816 38555 35844 33746 32305 32371 35688 41031
17939 41031 43105 40830 42448 43744 44257 45207 45103 43197 42711 39008 35633 31278 29811 31336 32714
17924 32714 32758 35645 35107 29430 25808 24240 24183 25184 24049 25103 24757 20743 17876 16186 13892 13677
17908 13677 12755 16450 20127 22327 21791 21939 21900 22411 22651 21070 20139 23358 23773 23373 21290 20360 21709
17891 21709 22486 24656 26441 26381 25525 24958 25152 25753 24592 20545 17048 16351 16754 17441 17225 14113 13017
17874 13017 14293 13125 13875 17276 20544 23948 24142 25007 24265 21124 20939 18494 18060 18697 17705 15036
17858 15036 11825 12206 11722 14064 13262 11659 11127 8147 8451 8407 6551 6750 8718 9717 8076 8501 10170
17841 10170 11109 6807 6542 9034 8387 7439 8424 9639 6557 4757 6182 6756 9178 10115 7775 5796
17825 5796 5692 4382 5440 8857 9416 6998 4786 4556 6028 6479 6913 7786 7310 7627 7148 8944 7591
17808 7591 8884 9136 7498 7655 7707 6779 6351 7745 10859 12620 11464 8170 7489 8892 11451 14984
17792 14984 19473 21576 25044 33430 40880 45657 49455 55376 62982 68295 74861 82866 87195 90841
17778 90841 91903 89843 87069 86992 84934 82216 80660 78455 78146 76873 77379 79301 84154 85954 87886
17763 87886 88616 88784 89847 88548 89014 84776 77637 71282 69190 65924 64220 63643 63569 63871 61570 56068
17747 56068 50774 47450 46897 45940 47431 51738 56531 59531 60306 63105 62995 65336 68832 69912 73428
17732 73428 76369 80086 83844 87984 90713 93940 99047 103002 102482 102345 102590 103728 105199 110453 110947
17717 110947 111042 108974 106630 103337 100058 98077 97889 96131 93530 88817 84081 76921 71064 66056 61850
17702 61850 60763 58812 54333 50017 44591 43870 40468 36944 35256 33288 31625 31915 31281 30540 28393
17687 28393 26804 26534 25100 22553 22012 23062 25181 29235 31698 35283 40695 46434 51848 55941 58479
17672 58479 60267 62038 60522 59040 56773 52697 47361 43463 39705 35987 33369 35216 40406 43904
17658 43904 44392 46258 47434 46134 41349 36255 33008 30312 28802 26813 25256 29155 29528 31276 31458
17643 31458 28266 27078 26538 26926 27824 29173 30749 29778 30231 32492 32678 31694 27607 23853 22296 22066
17627 22066 19743 16410 16238 19220 20043 18946 18217 20602 21153 22006 22625 27036 29611 31582 33546 34936
17611 34936 36373 33561 32084 30229 25919 21671 21444 20403 21237 21508 20335 16871 15442 16464 14370
17596 14370 12768 14681 16631 17747 18673 19890 20305 21460 20862 22583 22371 19916 18518 19663 20614 23018
17580 23018 24106 24974 22593 20583 20403 17780 15530 14478 10783 6745 6708 5067 5179 7136 8122 8445
17564 8445 8031 7224 9107 12805 12997 13367 14186 14052 13968 14696 11571 10394 11436 10980 7512 4670 3635
17547 3635 2222 2328 4456 5380 4833 3701 2933 1175 576 1326 2084 4045 4519 4803 3868 4323 3577 1752
17529 1752 2043 2636 1113 1142 2894 2361 1578 2421 4441 5843 3912 5156 3807 1677 3126 2152 3035
17512 3035 4274 5333 4415 4592 5110 4163 1151 418 2410 1446 143 -510 -371 -315 -205 2755 6181
17495 6181 5051 4193 5325 4907 1203 1106 913 -38 -142 -775 2209 4391 2007 1230 1413 2695 3082
17478 3082 1199 -554 -735 1666 5882 5473 3159 1859 2007 949 1521 1816 1319 2400 3207 1889
17462 1889 1530 254 443 881 703 -398 97 135 -677 -618 -1484 82 5396 8169 8905 8917 6884 6584
17444 6584 8515 12351 14285 16026 13015 10062 7007 3603 3636 4908 4344 3070 2907 3659 2087 769
17428 769 535 379 559 1916 4742 5507 3818 2893 -1589 -1745 1856 3368 2516 3129 2806 1175 1001
17411 1001 -82 1634 2017 2092 2221 2855 2901 2918 2416 2230 2684 4845 4556 2504 -26 -1913 -2358 -649
17393 -649 232 429 2233 2811 1107 -320 4152 4620 2694 1185 -1552 -1144 181 -442 125 1639 2525
17376 2525 1557 1070 3342 4545 5820 6421 4198 3374 673 348 2623 4009 1295 320 335 256 1537
17359 1537 455 -2170 -3264 -3098 -1250 -1278 -271 -2788 -2155 -3297 -1168 1193 2340 2709 3241 4761
17343 4761 3246 3064 1952 3300 2510 697 1409 2413 1526 2602 1443 -1079 -4335 -6104 -5132 -1902
17327 -1902 373 159 -109 2257 3742 4043 3580 1425 -1495 -5344 -5175 -5114 -3500 -1894 664 1721
17311 1721 1723 -1093 -554 295 -735 -340 1111 1888 1496 1393 1323 1143 -361 -483 -228 -1590 -1968 -2858 -3109
17292 -3109 -2636 -3348 -5342 -5085 -5321 -5934 -2258 -650 -1263 -321 -1018 -779 -2325 -1909 -1602 -297 316 -2165
17274 -2165 -3959 -5993 -5839 -5276 -4791 -4643 -3907 -3281 -2596 -2631 -3013 -638 412 -227 -560 -1852 -2479 -1291
17256 -1291 -830 -3737 -5104 -4741 -7244 -7479 -6323 -3842 -3284 -1873 605 1110 1530 -358 -1055 -2419
17240 -2419 -2807 -2053 -1130 -132 226 -1968 -1698 374 -618 -1853 -2575 -2693 -1516 -773 -2498 -3898 -3866 -2212
17222 -2212 -2320 -1903 -3031 -3456 -3530 -1064 3385 2879 1215 0 1498 1806 945 2998 2217 1761 3130
17205 3130 3514 4626 314 -1987 -2377 -2592 -733 -239 250 1909 3700 5721 5485 4708 2718 1920 1755
17188 1755 2045 2059 1447 1325 906 248 -336 -1650 -1709 -3240 -2673 -1417 -1232 -760 489 458 -1186 -2444
17170 -2444 -3102 -3118 -830 -638 -1029 -1219 1144 -540 254 1550 -198 -3193 -2388 -3059 -2862 -1645 -2186
17153 -2186 -1091 1582 409 -2187 -3315 -2104 -1902 -985 -796 -491 -3225 -4762 -6010 -7433 -5893 -4230
17137 -4230 -4517 -4322 -3077 -2599 -317 -842 -3604 -4840 -2742 520 -372 -714 -1126 -1932 -1453 -2646 -3305
17120 -3305 -3435 -3325 -3063 -2881 -3748 -2907 -2665 -4411 -5623 -5101 -2597 -3252 -3869 -3268 -4361 -7335 -5135
17103 -5135 -4495 -4024 -2762 -2932 -4389 -6756 -7322 -3931 -978 -1271 -1731 -2569 -5446 -6121 -4809 -2432 -1676
17086 -1676 -1769 -383 -1548 -751 2712 1203 -2366 -4299 -3826 -4276 -3307 -1820 -4836 -5580 -3718 -172
17070 -172 -801 -678 -306 -753 -1624 -3405 -6534 -7928 -4299 -1615 -3153 -3498 -2690 -2083 -2493 -2491 -2638 -1487
17052 -1487 310 -2909 -5379 -6033 -2273 2332 3318 -154 -3062 -1484 -304 -732 -821 -2503 -2388 247
17036 247 -910 -3202 -3492 -4905 -3100 -3725 -7833 -6986 -4839 -5552 -5507 -5215 -4756 -4515 -4490 -5033 -5607 -5415
17018 -5415 -4261 -2099 -3022 -3342 -2916 -5500 -5620 -2449 -1199 -2283 -1338 -319 133 -1173 -2251 -3013
17002 -3013 -2393 -1600 -992 -841 -927 -2261 -5275 -4421 -2578 -3469 -2614 -2638 -2040 -2882 -6393 -7933 -9239 -7805
16984 -7805 -6559 -5654 -3672 -2255 160 -907 -6079 -4072 -1281 -2347 -2401 -612 -1762 -2844 -563
16969 -563 1955 1986 1122 774 -619 -1898 -3837 -4078 -1677 462 2030 2641 119 -2291 -4250 -5124 -5575
16952 -5575 -5001 -3196 -2129 -1963 -2258 -3632 -2602 -1779 2114 3085 3524 1069 579 1926 827 -1138
16936 -1138 1586 5308 5927 2205 860 -184 1375 2972 2492 2120 401 -969 -684 -312 -762 -1084
16920 -1084 -2767 -1879 -2622 -4138 -6014 -4781 -1131 -1519 -2378 -1205 -919 -310 532 -998 -1694 -2221 -612
16903 -612 1252 -1202 -1466 -960 822 2895 1450 -1790 -3631 -3935 -3274 -2842 -3972 -6711 -9183 -7800
16887 -7800 -5036 -2600 -2056 -3047 -3717 -4090 -2265 929 1600 523 -1973 -2757 -134 -776 -2082 -3622
16871 -3622 -2135 -2443 -2213 -2447 -7283 -7422 -5192 -4869 -3760 -3703 -4742 -3742 -2984 -922 377 -1748 -1910
16854 -1910 -1666 -2323 -4022 -5809 -7383 -6189 -3928 -5576 -5814 -4122 -4412 -4852 -4767 -4490 -2606 -2239 -3260
16837 -3260 -4233 -4090 -4958 -8051 -10965 -12226 -8565 -6089 -4851 -5128 -6883 -7223 -6387 -3722 -1079 -909
16821 -909 -4040 -6060 -5903 -4428 -5509 -7660 -7717 -6703 -5267 -2959 -3679 -5892 -5877 -4610 -2258 -2934 -4247
16804 -4247 -3933 -3353 -4215 -2347 -1200 -2364 -1449 -1407 -1714 -1518 357 2832 -269 -2620 -5217 -5794 -2362
16787 -2362 -1923 -2735 -2876 -5646 -5727 -3938 -4287 -5602 -7480 -7329 -5307 -5004 -4320 -3553 -4663 -7785 -5171
16770 -5171 -3044 -3152 -4698 -3381 -5154 -5780 -1989 -3269 -7056 -7420 -6631 -8964 -9538 -7272 -5407 -3840
16754 -3840 -2488 -5678 -5208 -5505 -6092 -7449 -10771 -9252 -7171 -6734 -3934 -4137 -3347 -18 -1881 -6826
16738 -6826 -5849 -6296 -4100 -3253 -3929 -3516 -2085 -2008 -3372 -5326 -4543 -4940 -3739 -3870 -5220 -4715 -5696 -6659
16720 -6659 -4744 -4896 -4389 -5043 -4424 -2029 -1871 -2476 -4834 -6302 -5359 -3149 -1482 -539 -228 -2029 -4482
16703 -4482 -4872 -3063 -3361 -1939 -927 -4178 -7439 -6650 -6728 -4189 -3292 -2621 -2096 -2545 -6168 -7080 -5703
16686 -5703 -6870 -6940 -7038 -5807 -3214 -4457 -4831 -3169 -2558 -1808 -2169 -3523 -1428 -247 -2452 -4297 -6358
16669 -6358 -4587 -3985 -3613 -5774 -5523 -4379 -5279 -5433 -6200 -7245 -5686 -3118 -1125 -1326 -2664 -3962
16653 -3962 -5033 -4260 -3842 -3485 -3131 -2533 -1551 -1142 -1527 -2252 -2079 -3841 -6271 -4479 -3680 -5997 -6432 -6455
16635 -6455 -4854 -2540 -2086 -961 107 1321 -1025 -3482 -6123 -4399 -2490 -2286 -580 -668 -3697 -6747
16619 -6747 -7703 -7719 -7681 -4393 -3250 -4999 -6957 -5464 -3031 -2611 -3954 -1623 -3905 -6552 -5613 -4800 -4493
16602 -4493 -5900 -5494 -5299 -4008 -3239 -3032 -2854 -2976 -1529 -4180 -4407 -1669 -1760 -610 -570 -1211 -3244 -5743
16584 -5743 -3195 -2496 -4282 -5544 -4755 -4342 -4723 -4376 -3113 -2508 -3120 -237 -2593 -3758 -4065 -5996 -8034
16567 -8034 -6744 -4608 -4149 -4944 -3865 -3604 -3742 -5541 -5730 -5439 -7516 -9140 -6902 -3069 -3446 -6241
16551 -6241 -6785 -6743 -4336 -1583 -2890 -4209 -5979 -5229 -4699 -2560 -2519 -1194 -405 -290 -301 -3293 -6048
16534 -6048 -6825 -4385 -2398 -3175 -4121 -3824 -5000 -6885 -4496 -2974 -4450 -4714 -6538 -8074 -9467 -10754
16518 -10754 -8883 -5033 -1488 -806 -2004 -4976 -4177 -4847 -2701 -1080 -1989 -4191 -5778 -7141 -9006
16503 -9006 -9145 -8055 -6052 -4978 -2902 -3775 -6611 -8412 -6556 -3951 -1839 -2491 -4892 -3799 -4455 -7014
16487 -7014 -10112 -8148 -4880 -3347 -3999 -5538 -3559 -4137 -4170 -4059 -4679 -4633 -3393 -4983 -6827 -8567 -9007
16470 -9007 -6808 -4404 -4995 -6197 -5857 -5396 -8354 -8008 -6969 -6864 -5247 -6179 -8122 -5097 -5311 -3348
16454 -3348 -405 -2467 -5364 -7792 -5155 -6246 -4928 -3568 -3476 -5394 -6192 -4853 -6197 -9031 -7414
16439 -7414 -4848 -5790 -4880 -5774 -5956 -4803 -4559 -4376 -4397 -3749 -4790 -3381 -4335 -7114 -7387 -5358 -4402 -5061
16421 -5061 -4835 -4314 -4004 -4849 -5633 -6414 -4596 -2502 -3289 -2814 -4336 -5229 -4264 -4955 -6112 -6964 -5688 -4366
16403 -4366 -3194 -1357 -2263 -2375 -2167 -4373 -5183 -2030 -2114 -2401 -4057 -5003 -3978 -4187 -1538 -1379 -3271
16386 -3271 -5327 -5550 -6680 -7631 -5831 -4396 -5008 -3994 -3835 -3980 -5085 -4245 -3776 -4206 -6388 -6655 -6620
16369 -6620 -4421 -5659 -4517 -2560 -2673 -1641 -450 -1135 -2679 -5572 -7955 -7326 -6111 -7562 -8743
16354 -8743 -9406 -9213 -7830 -6905 -5440 -4656 -5876 -4873 -3854 -5097 -5660 -1255 1632 3099 1107 -3080
16338 -3080 -4196 -4815 -4203 -2656 -1615 -549 -2058 -3236 -3662 -2370 -1874 -1501 -4261 -6433 -3448 -947
16322 -947 -1171 -3853 -5916 -7499 -9437 -8805 -7650 -7202 -6733 -5410 -4373 -4734 -4433 -2876 -3087 -2843 -3574
16305 -3574 -4265 -3749 -3423 -1458 -808 -1336 -1844 -2749 -4368 -5905 -5190 -2062 -1593 -2333 -3282 -3552 -4743 -4342
16287 -4342 -3196 -1231 565 1090 1903 3206 4542 3633 2667 3228 6589 9889 11666 10576 6373 3798
16271 3798 5947 9393 13356 13182 12103 10457 9606 9404 9929 8902 6740 3596 2123 2953 3323 5705
16255 5705 5350 2868 2433 2336 1805 596 387 140 -372 -577 -1298 -1607 168 -912 -1724 -4670 -4747 -3732
16237 -3732 -1860 -1608 -1778 -1887 -2690 -3495 -5111 -7539 -6821 -2731 -636 -238 -2994 -4231 -758 1095
16221 1095 -507 -2427 -3103 -4272 -4998 -4305 -3778 -4269 -4794 -4879 -6995 -7676 -8075 -7953 -5438 -4855 -5062 -3438
16203 -3438 -4570 -5789 -5755 -2314 -1537 -5247 -7060 -6825 -5859 -5055 -4031 -2962 -2294 -1089 -691 -1562 -3711
16186 -3711 -2706 -2168 -4221 -5937 -5157 -4839 -3351 -4827 -5840 -3459 -5310 -6786 -5200 -3111 -3595 -3483
16170 -3483 -3225 -4072 -3360 -3401 -2774 -1764 303 1011 3114 2807 3245 887 -780 94 2207 2099 2369 3969
16152 3969 5773 7961 8173 5625 4504 2618 2585 3313 2118 4430 9300 11349 8673 5362 3044 2692
16136 2692 732 3110 3023 1708 483 -1649 -783 -829 406 8 -3588 -5357 -2718 -3109 -5280 -5828 -4203
16119 -4203 -5163 -4232 -5009 -6371 -5344 -6829 -6831 -5709 -5502 -3128 -3132 -5653 -7729 -10430 -9903 -7717 -6145
16102 -6145 -8426 -12029 -12330 -7955 -7980 -8774 -7199 -6713 -6101 -4370 -6109 -4985 -5504 -6475 -6433 -5884 -5103 -7773
16084 -7773 -6875 -6678 -6780 -7701 -7760 -7121 -5633 -6394 -6538 -3334 -4149 -6989 -7908 -6716 -5700 -5126 -6734 -6256
16066 -6256 -4345 -5236 -5695 -5537 -2769 -5052 -6984 -5800 -7123 -9840 -7358 -6637 -6311 -5876 -6435 -7223 -6887
16049 -6887 -4862 -3150 -61 1041 -2737 -4939 -5679 -6703 -6358 -5766 -3944 -4459 -7300 -7948 -6733 -5808
16033 -5808 -6203 -6357 -3458 -3289 -6287 -7340 -7541 -3235 -2555 -5444 -5390 -4636 -4185 -5303 -7549 -9282 -9616
16016 -9616 -9736 -8760 -5684 -5467 -5876 -7429 -5222 -3694 -5924 -8060 -7994 -6624 -7622 -9924 -8713 -7179
16000 -7179 -7908 -7851 -5466 -4257 -3857 -4505 -7590 -8543 -8813 -8176 -7471 -5764 -4893 -4647 -6382 -8505 -7682 -5126
15982 -5126 -4745 -3735 -3922 -5134 -5725 -3428 -2332 -4974 -6795 -6948 -5723 -3488 -1385 -3007 -5431 -6681
15966 -6681 -7010 -7176 -7488 -5918 -5380 -5961 -5825 -6320 -7614 -4801 -3437 -3556 -3310 -2790 -2362 -2760 -3432 -3471
15948 -3471 -4175 -3865 -3142 -3137 -2870 -3725 -3976 -3860 -4504 -3850 -2238 -2263 -2563 -1577 -3150 -5024 -4805 -7777 -8601
15929 -8601 -6604 -5169 -4796 -5793 -7734 -10373 -8567 -6903 -9006 -8677 -6902 -7529 -5481 -4167 -5533 -4282
15913 -4282 -1920 -1585 -2756 -3504 -2938 -3208 -6057 -5412 -3301 -3744 -3456 -3017 -4428 -5958 -6020 -3582 -1911
15896 -1911 -2131 -1122 -2118 -307 1305 -422 -713 244 -588 -2209 -3494 -4147 -2708 -4716 -7749 -6213
15880 -6213 -5374 -4886 -3274 -4030 -1708 -750 -2713 -2924 -2716 -1853 -1358 -1153 -1338 -2610 -3931 -4287 -3031
15863 -3031 -2167 -1666 -1966 -1863 -3908 -2836 -1517 -3591 -4787 -4551 -5487 -3827 -4122 -3562 -2451 -2704 -3540
15846 -3540 -1950 -1380 3694 5521 3839 1171 -1263 -1813 -878 -667 -2801 -2152 -2826 -3855 -3802 -3506 -4427
15829 -4427 -5420 -4295 -4194 -3781 -998 -1209 -2756 -2784 -1659 -2945 -4650 -6225 -5344 -4309 -1955 -1627 -3149
15812 -3149 -4394 -4185 -5133 -4879 -4757 -4016 -3032 -1700 929 2782 2902 4785 5442 5129 1982 706 -106
15795 -106 20 785 -375 -976 -962 -1293 -3599 -4668 -3830 -3877 -3914 -3098 -2342 -3066 -5048 -4210 -1363 -721 -2601
15776 -2601 -2563 -3816 -2914 -3982 -3748 -3830 -4216 -4567 -3509 -3973 -5311 -4377 -3953 -3825 -4923 -2920 -1514 -1479
15758 -1479 -1634 -2984 -1749 -1944 -3308 -2789 -1071 -3367 -6123 -5297 -4755 -4149 -5914 -4496 -2917 -4262
15742 -4262 -2201 -2650 -1437 224 3971 3674 1677 1323 -33 587 -2213 -4591 -5501 -7054 -4983 -3414
15726 -3414 -2739 -5409 -4680 -4270 -5397 -5072 -4211 -4291 -5681 -6219 -5024 -3704 -6378 -7278 -5883 -5797 -6578 -5538
15708 -5538 -3957 -5359 -3802 -5903 -7365 -5692 -5835 -6988 -4878 -5331 -4005 -2217 -511 -1141 -2774
15693 -2774 -2683 466 -2048 -4575 -5128 -4699 -3265 -2336 -3366 -2493 -2514 -2924 -5525 -6057 -2124 -601 -4110
15676 -4110 -4962 -6859 -7241 -6313 -5520 -3903 -2791 -2708 -2782 -3904 -3657 -2460 -3246 -4751 -1110 616 -2345
15659 -2345 -7266 -8144 -6774 -5802 -8335 -8586 -7064 -5466 -4561 -4771 -4198 -3945 -7029 -9005 -8689 -5577 -2756
15642 -2756 -3515 -6636 -9209 -10703 -10078 -6833 -4682 -5099 -6084 -5067 -2717 -3199 -3429 -978 1204 -83
15626 -83 -1259 -3555 -3913 -3766 -3227 -3374 -4606 -4931 -2924 -2262 -1535 -1450 -5830 -5373 -2148 -431 -1338 -3193
15608 -3193 -4335 -1516 -2237 -2610 -3403 -3715 -3169 -2219 -6436 -10142 -9776 -8746 -8109 -6301 -5460 -7752 -8860
15591 -8860 -7475 -5563 -6171 -4964 -3815 -3358 -4957 -5270 -5585 -6076 -6239 -5152 -6659 -9280 -10959 -9006
15575 -9006 -7074 -7809 -8374 -9239 -9146 -5926 -3905 -3415 -3562 -1259 -3348 -7800 -8218 -4285 -3431 -3582 -5376
15558 -5376 -7312 -8323 -8542 -5132 -2710 -3616 -3128 -1977 -1743 189 4777 10362 13067 17693 30625
15543 30625 51725 82292 115285 139742 154375 118882 72036 43710 25762 15136 9908 6098
15531 6098 4149 2670 1515 -511 -2001 -1434 -2252 -2449 316 3612 952 -2575 -2864 -3455 -4534 -8124
15515 -8124 -7277 -2873 -2448 -2743 -5444 -6110 -4783 -3304 -4338 -5944 -6341 -9128 -9059 -7522 -5945 -4264
15499 -4264 -3492 -6029 -7073 -5995 -4581 -1459 -2880 -2850 -2232 -3604 -4417 -2911 -4013 -6989 -6101 -5045
15483 -5045 -4226 -5514 -6586 -7357 -6545 -5659 -6383 -7013 -6680 -6752 -6652 -4777 -3371 -3021 -3628 -4148 -5396 -5842
15465 -5842 -6733 -4107 -3114 -6761 -5047 -5735 -4178 -3376 -3183 -4030 -5256 -5976 -6091 -4516 -1630 -1262 -3269
15448 -3269 -2342 -899 265 3170 3698 3193 1961 -2111 -5663 -4983 -3600 -4565 -3993 -3580 -3395 -5065 -5982
15431 -5982 -6686 -5518 -6150 -8628 -7445 -7209 -5953 -4614 -5781 -5908 -2441 -2665 -3160 -4797 -4958 -4771 -6026
15414 -6026 -4578 -4013 -2900 -3268 -1213 -1912 -1332 -462 -1191 -1132 577 1118 1648 963 -1025 355 2106
15397 2106 -211 -3358 -5205 -5293 -4611 -1569 2327 2257 2932 2214 1396 -438 -2651 -750 876 990 2438
15380 2438 1300 1050 1625 1902 2019 14 -1783 -3498 -2139 -2221 -3149 -1094 -632 -3176 -4881 -3858 -3192
15363 -3192 -185 228 -2077 -2683 -3307 -3162 -3819 -2972 -2741 -4946 -3881 -6190 -8386 -8013 -7079 -6536 -6300
15346 -6300 -6511 -4974 -3090 -3984 -5575 -5173 -6449 -6789 -3836 -3588 -7363 -7977 -9119 -9843 -9486 -8066 -7497
15329 -7497 -5210 -3457 -5230 -6338 -4349 -3362 -956 -1430 -2966 -5480 -6998 -5154 -6572 -6132 -7369
15314 -7369 -7725 -5350 -2664 -323 -2074 -4836 -5618 -6348 -4396 -4447 -9172 -9458 -9322 -9740 -10171 -7411 -6217
15297 -6217 -6948 -6582 -5999 -5138 -2893 -1956 -1432 -2270 -4926 -3132 -1293 -3392 -6806 -8513 -8819 -10453 -12372
15280 -12372 -10904 -6499 -5949 -7714 -8686 -8293 -7887 -3884 -3976 -5875 -9773 -9941 -8105 -7295 -7204 -6876 -7190
15263 -7190 -9697 -8498 -6145 -7748 -8322 -7180 -6675 -6416 -6699 -5591 -3684 -4836 -5898 -5602 -4662 -4448
15247 -4448 -4642 -4188 -1955 -802 1505 3079 5098 5229 7367 8891 11406 15659 19495 17860 8817
15232 8817 2010 -2531 -6020 -6753 -6919 -7352 -7872 -7974 -5875 -4223 -3438 -6617 -8535 -8185 -9084 -9642 -7464
15215 -7464 -7077 -4285 -4922 -5918 -4100 -4047 -3373 -1754 -3412 -5777 -7203 -5712 -7121 -8233 -7017 -7402
15199 -7402 -6678 -6679 -6915 -6544 -5118 -3789 -4940 -7482 -9843 -9981 -9328 -9579 -9373 -9838 -7672 -5393 -5206 -5039
15181 -5039 -1666 -802 -304 -1987 -2737 -2997 -1261 -851 -3892 -7767 -13393 -17163 -19728 -20932 -15025 -10182
15165 -10182 -10659 -12518 -14632 -13262 -11118 -7056 -4363 -5744 -10901 -12134 -10298 -7877 -6632 -5452 -4798
15150 -4798 -3454 -3956 -2162 -1921 -1556 -239 335 675 -2071 -4125 -4152 -3754 -1425 45 364 1186 -1154
15133 -1154 -1911 -2567 -4601 -4099 -3614 -1684 -306 1683 733 1057 2463 2611 3887 6442 7748 9635
15117 9635 9857 7178 6066 6652 7836 9150 13294 23424 36427 44281 38241 28082 19857 13952
15103 13952 8112 8396 7815 7258 5367 3972 5996 6092 4923 4619 7279 9929 11178 12213 10092 10621
15087 10621 9860 10018 7590 8113 8755 11622 11743 13236 12913 10883 9415 8102 9802 10672 9981 12177
15071 12177 15163 17531 15218 15211 13932 13128 13147 11993 9950 11062 11404 10152 11509 13237 14907 17049
15055 17049 19634 23420 24062 25420 27447 27125 27996 29363 28867 29300 25944 24775 27710 29993 31525 29574
15039 29574 30873 33018 32924 33130 35640 38625 41434 47480 51472 54383 57849 59678 59332 58276 57797 57373
15023 57373 60430 65816 70852 79303 87311 91547 92699 96321 97888 99888 105828 117286 130867 144928
15009 144928 158996 168692 176489 189448 208218 236322 273669 307278 332746 364892 413164 473288
14997 473288 546440 635527 738806 864218 1025652 1243868 1556242 2030576 2778595 3994939
14987 3994939 6009432 9378182 14713287 21093521 26179520 29922255 27060630 17607584
14979 17607584 10909554 7034690 4842573 3599553 2878712 2419278 2082899 1812503 1582569
14970 1582569 1386526 1223992 1089521 982677 894733 813702 743460 679480 622962 575704
14960 575704 537840 513573 487044 452380 419687 395647 374320 356435 341789 329633 315062
14949 315062 299116 279685 263985 253023 241290 229859 222865 215474 205839 196650 188498 179976 171461
14936 171461 162536 154189 149653 144234 141208 139031 133634 127946 121290 119805 118175 113713 107986 102869
14922 102869 98757 95436 94015 89485 85364 80228 75173 68935 65222 65047 64609 63375 64774 67307 68202
14907 68202 66153 62579 58709 55973 55297 53404 50508 49264 46836 41920 37217 34808 36764 38480 36912
14892 36912 34959 33522 30850 28823 30661 30456 27096 25830 21733 19945 20354 22695 24020 23292 23214 20359
14876 20359 19887 20351 18537 20075 20636 19798 22257 25865 24679 23606 23357 21112 16784 15269 16944 20156
14860 20156 20573 23201 27505 29058 29906 30266 29667 25990 19689 15855 15116 15844 14222 11608 9479 10462
14844 10462 10790 7286 5821 5499 6619 8117 10002 10716 12912 14002 11580 9244 10371 10763 10951 11045
14828 11045 12420 15519 14981 13150 14516 16393 17057 21872 28224 31173 36721 41634 46590 48301 49643
14813 49643 46897 40931 35341 30967 24939 18706 15656 13430 13669 15167 17686 20171 22873 23871 26609
14798 26609 28235 29431 30503 29924 21485 14686 8067 3227 2153 1116 -409 757 1854 244 -1777
14783 -1777 -1232 1623 2027 2350 4648 4807 3816 4069 3856 4245 3876 1640 -858 1141 2053 363 847
14766 847 1919 2984 2200 2084 2915 2253 570 -40 1044 401 -2334 -2777 -219 1489 1371 1233 1057
14749 1057 -413 -439 638 -1914 -4613 -5518 -4973 -4801 -5675 -5828 -4360 -4623 -3942 -51 808 1741 2520 2815
14731 2815 4925 4452 3431 4216 2715 -857 -3882 -3420 -2937 -2671 -3430 -1430 -181 -1443 -2785 -3683
14715 -3683 -4186 -3962 -3659 -6305 -7508 -7389 -7381 -3725 -2662 -1584 -2166 -4593 -5019 -4919 -6215 -6683 -8577
14698 -8577 -10485 -9619 -8709 -9085 -6335 -4332 -3934 -3588 -5722 -7008 -6839 -7112 -6642 -4022 -2445 -704 1756
14681 1756 1703 2136 -1233 -4585 -7064 -10832 -10927 -9951 -9238 -7408 -5430 -3185 -878 -2700 -4920 -5530 -4531
14664 -4531 -3197 -2684 -2410 -1623 -602 395 1593 1187 1770 -2456 -5559 -7632 -9631 -8648 -6110 -2884
14648 -2884 -1548 -3356 -4245 -3155 -6553 -9319 -9848 -9601 -8840 -9090 -8000 -5533 -6531 -9409 -9010 -6769
14632 -6769 -8364 -9989 -9982 -8232 -8216 -6726 -6375 -8745 -8393 -7652 -6284 -6706 -8048 -10153 -12555 -13450 -9976
14615 -9976 -5754 -4706 -7644 -9648 -10656 -8345 -6914 -5918 -5678 -3756 -3154 -3665 -3996 -4533 -4878 -8308
14599 -8308 -9795 -7647 -8850 -9350 -7326 -4692 -4401 -5951 -4960 -3191 -1587 -2828 -2132 -2605 -4551 -2469
14583 -2469 -566 881 2716 5335 8428 5606 2211 1243 2034 2217 2636 3823 1339 1545 4063 5840
14567 5840 7165 7122 3778 1439 779 -1269 -4956 -3399 -5153 -4389 -2565 -3722 -3296 -3130 -2523 -2374 -3753
14550 -3753 -3052 -3437 -3971 -4497 -3614 -2437 -4094 -2242 -158 -481 -3982 -6408 -6457 -6078 -8401 -9226 -9189 -10180
14532 -10180 -8174 -6583 -7515 -7423 -7148 -8224 -8811 -8846 -10179 -14013 -15508 -13974 -10422 -9592 -7915 -8892 -8278
14515 -8278 -6393 -4825 -3042 -4649 -4734 -6115 -8788 -9634 -6948 -2717 -41 905 -565 -1501 -383 -111
14499 -111 -1933 -3677 -5066 -6532 -5123 -3066 -1899 -2120 -1401 -2679 -3219 -2555 -3317 -1690 -428 -3069
14483 -3069 -3745 -1863 -2176 -2367 -5500 -6924 -5766 -3343 -4194 -4585 -4262 -3081 258 47 -1210 -133
14467 -133 1684 2603 888 3661 6248 8171 10967 9755 11164 16035 19575 20787 18802 15356 11480
14452 11480 7015 4403 5299 9402 11247 11053 10772 7243 4331 4172 4079 5771 6121 4352 1993 3049
14436 3049 1844 2869 4605 3436 2186 1491 28 -2229 -2147 -1668 -693 -393 2247 7147 12620 20720
14420 20720 38523 63932 98957 130336 151442 150865 101491 60914 34982 22133 15306 11690
14408 11690 10045 6941 1088 -93 -839 -667 -538 -517 932 3370 3057 2185 3190 1989 2364 5941
14392 5941 8120 9279 10999 8262 5195 3206 3788 4842 7449 8080 9804 10622 10141 7619 5461 4152
14376 4152 1114 -2552 -6608 -7387 -4929 -4086 -3856 -1812 -2203 -1613 -1887 -2802 -4787 -6005 -5334 -5551 -5284
14359 -5284 -5434 -5765 -6728 -6223 -6819 -6416 -5627 -6505 -8892 -6895 -5832 -5837 -5915 -3490 -3001 -4958 -4836 -5757 -5298
14340 -5298 -4228 -3948 -2816 -1910 -3037 -5718 -8061 -8069 -7259 -5578 -3444 -4260 -5867 -6336 -4699 -3609 -3988
14323 -3988 -4491 -4917 -6489 -7154 -4826 -6901 -7789 -11365 -10981 -9826 -9812 -10270 -8754 -8249 -9835 -11679 -13340
14306 -13340 -11700 -10831 -13749 -14972 -10919 -7133 -7871 -9362 -9058 -8856 -9056 -8730 -6843 -6984 -8261 -6302
14290 -6302 -5107 -6779 -10602 -12786 -13444 -12605 -10137 -11914 -10639 -9977 -7481 -8435 -7707 -6719 -8080 -7551
14274 -7551 -7869 -6886 -4957 -3064 -3822 -5094 -4763 -2795 -4344 -6445 -7715 -8523 -6423 -5840 -6347 -4342
14258 -4342 -4589 -3935 -4499 -7307 -8137 -6448 -5806 -6467 -7127 -9590 -8526 -7007 -6684 -7652 -7441 -8312 -10146
14241 -10146 -10092 -10488 -9484 -9828 -8757 -9054 -9348 -11514 -10065 -6666 -3340 -4255 -3968 -3799 -3774 -3614 -6134
14224 -6134 -5433 -4784 -3621 -4210 -6719 -8847 -8536 -8262 -7402 -6627 -6181 -7005 -5587 -5384 -6448 -6494 -6468 -3569
14206 -3569 -3739 -4975 -8191 -10746 -9758 -6104 -5553 -8554 -8616 -8636 -9109 -6841 -5719 -6445 -5400 -4315 -5172
14189 -5172 -5078 -6201 -9141 -8207 -8439 -7887 -6554 -4255 -4197 -5780 -7544 -9187 -9077 -9262 -11182 -11410 -10674
14172 -10674 -9976 -7775 -7247 -4564 -3274 -3612 -4291 -6262 -6378 -9406 -9529 -7899 -5228 -4662 -5009 -5599 -7895
14155 -7895 -9869 -10132 -9232 -8653 -7596 -7599 -7998 -7358 -4275 -4894 -5620 -4510 -7068 -8560 -8320 -8801 -6613 -4599
14137 -4599 -6004 -7585 -6965 -8876 -8049 -9699 -7382 -5431 -7018 -8364 -8088 -9214 -10052 -9935 -9905 -9909 -9549
14120 -9549 -10141 -13651 -12954 -10150 -9002 -7136 -8316 -10094 -7333 -6827 -9543 -8870 -6718 -6132 -8666 -6529
14104 -6529 -4017 -5042 -7462 -8606 -8505 -8622 -7356 -6148 -7353 -5979 -6704 -7145 -6070 -5899 -8553 -8385
14088 -8385 -8966 -7800 -6883 -7685 -7820 -8421 -6365 -6218 -8331 -9836 -11092 -12562 -10474 -6642 -5746 -9467
14072 -9467 -12829 -13616 -12588 -12597 -11971 -12076 -11119 -10543 -13316 -11832 -8125 -6821 -7177 -7054 -7504 -6516 -6435 -10523
14054 -10523 -9087 -8101 -8118 -6631 -5014 -4819 -3499 -2785 837 5895 10118 10246 9593 8761 6793 4288
14038 4288 2594 999 1021 1442 3408 2355 1549 379 -1207 -5201 -5312 -3697 -3827 -2622 -3601 -3811 -5134
14021 -5134 -4741 -4124 -4265 -5873 -6975 -8410 -9352 -8244 -6057 -6419 -6379 -6803 -8119 -7981 -8020 -6501 -4106
14004 -4106 -4265 -5069 -8154 -8633 -8044 -6537 -4910 -6513 -8195 -7375 -5992 -9695 -10220 -8266 -7961 -5672
13988 -5672 -5797 -7091 -6158 -4031 -7562 -7985 -7214 -7179 -6828 -6523 -6368 -5095 -5562 -4981 -4144 -5856 -6744 -8376
13970 -8376 -7202 -4193 -6001 -8083 -9609 -8168 -6607 -5128 -6369 -7611 -8274 -7907 -7324 -5939 -3428
13955 -3428 -2798 -2357 -4833 -6024 -6145 -5938 -4438 -5072 -5784 -5453 -3861 -4291 -5382 -3563 -3380 -4266 -4213 -2248
13937 -2248 -1460 531 639 -106 394 212 -102 -892 -1308 379 1887 2188 301 666 2896 4975 4129
13920 4129 5673 5345 4952 4475 3752 6235 7162 5254 5470 5625 2258 -1880 -773 -202 -3045 -1980 -1772
13903 -1772 -2099 -1157 -1179 -1452 -1031 -707 -1080 -1590 -3325 -3153 -2545 -3508 -5088 -4945 -5318 -3668 -3994 -4136 -4332
13884 -4332 -4587 -3017 -3238 -2552 -3142 -4881 -4875 -517 1793 842 -1649 -3297 -269 585 -1556 -494 -65
13867 -65 -1414 -3056 -4313 -5608 -7914 -6726 -5758 -3225 -1505 -2889 -4139 -4420 -6096 -3980 -2293 -1709
13851 -1709 -1547 -4335 -6533 -6656 -6379 -3057 662 580 -134 -2386 -5005 -6970 -7410 -6677 -4837 -5745 -4985
13834 -4985 -7582 -7666 -6578 -5709 -4909 -4450 -3126 -3965 -4937 -6798 -7181 -4242 -3895 -4436 -2419 -519 -1225
13817 -1225 -2947 -4192 -2285 -909 -973 1707 1998 -995 -630 -1498 -3316 -4573 -5320 -4238 -4866 -4423 -4224
13800 -4224 -4260 -3693 -3988 -4341 -4473 -3574 -4138 -6806 -6006 -1865 -1728 -5273 -6953 -7339 -7484 -4732 -3525 -2497
13782 -2497 -4472 -5626 -3840 -1766 -3044 -4680 -5348 -6362 -4600 -6424 -4883 -2073 -2624 -2232 -784
13767 -784 -3319 -6059 -5825 -5939 -6663 -6908 -6683 -7963 -7942 -6731 -4390 -4397 -4091 -3042 -2517 -3928 -3820 -5307
13749 -5307 -3938 -3059 -2291 -3257 -2462 -3068 -2327 -3212 -4103 -4083 -3493 -3709 -3188 -3858 -4261 -3873 -4136 -5396 -4622
13730 -4622 -4345 -4825 -6311 -4953 -4208 -5856 -4558 -2701 -2558 -1310 20 -2633 -3935 -4109 -1964 -447
13714 -447 -1673 -4791 -3814 -2272 -2794 -3988 -4605 -7609 -7372 -4199 -1277 -2101 -2299 -1976 -2358 -1903 -1532
13697 -1532 622 2190 2774 2460 -1138 -1896 -472 1303 1767 2110 -314 -3328 -1885 1018 -306 -2455
13681 -2455 -3805 -1670 -346 -2759 -1785 -67 -1776 -3976 -5280 -5123 -3890 -4039 -2702 -2448 -2388 -1379
13665 -1379 -534 -129 386 -1167 -2290 -3512 -4659 -4032 -4022 -3642 357 3389 3820 6129 5849 5355 7657
13648 7657 7621 7561 7866 7221 5087 4749 2412 1464 1513 2404 -50 -3595 -4973 -7551 -9025 -9067 -5241 -1489
13630 -1489 -691 -3486 -5081 -3488 -5312 -5300 -5583 -5384 -2712 -1278 -398 -41 901 -798 -1750 -2135 -2708
13613 -2708 -5241 -3300 -2987 -2847 -2270 -1074 -491 -2556 -1540 -1571 -938 -1383 -2892 -1431 -2321 -2762 -3491
13596 -3491 -4678 -7137 -7213 -4854 -3480 -2025 -196 3092 6310 6103 2676 -775 -3721 -2490 -2221 -2070
13580 -2070 -1292 82 1020 1277 7 -1706 -195 2252 3275 2697 -332 -5422 -7150 -4325 255 1058
13564 1058 1861 4247 5377 4788 5011 6057 3747 3392 4493 4702 1905 395 -89 653 -997 -262 1487
13547 1487 1505 1799 1522 908 623 1668 4069 5443 4954 5306 5829 7438 8618 7776 8421 11552 12016 8733
13529 8733 9521 9110 9243 11110 11461 10435 10326 9800 7760 5599 6791 9333 9632 8376 7664 8693 6308
13512 6308 6066 4212 3065 3282 2928 1504 2270 3994 4024 3748 3893 2529 -1822 -3557 -3342 -627 -1238
13495 -1238 -3079 -1955 1066 1991 -256 -1047 1146 2937 4958 7961 7129 7178 6681 6101 6574 5687 7718
13478 7718 9893 9243 9813 11717 12353 12748 11979 9742 8293 8461 11316 12627 13690 13560 12265 9718
13462 9718 9120 8977 9142 8447 7974 7170 6333 4957 5290 7816 7857 8108 6447 4130 3713 4192 5546 4734
13444 4734 924 -2128 -4195 -4877 -3321 -5124 -5076 -1607 893 5306 4279 2299 2422 -309 -3161 -3858
13428 -3858 -2233 315 2585 3301 591 506 1329 206 -552 -1826 -1290 -2121 -2719 -2140 -1087 149 2015
13411 2015 2580 1314 -82 1888 3582 3971 4142 7699 9914 11685 13614 11895 11423 13661 16079 22457
13395 22457 29335 32283 32661 31775 28640 23150 19490 15382 14249 12318 8655 6187 6237 7629 7789 8010
13379 8010 7260 9455 10516 11825 12278 11477 11276 11993 12828 14290 16136 19449 22866 25769 28564 31040
13363 31040 34585 33955 29163 22888 17572 15484 11543 7617 5628 5614 5114 6357 5011 91 -1490
13348 -1490 2977 5423 5305 5677 4380 2630 3034 1377 -165 1281 2701 3532 7593 11188 13542 14926
13332 14926 17786 21698 26101 31641 34618 37731 38780 38289 32638 26797 21563 16137 14371 12770 11785
13317 11785 8070 6994 6507 4696 2484 2673 5993 8219 8714 7790 7889 11425 13831 16267 18703 23051
13301 23051 29100 34123 36752 37918 38270 37211 33362 30251 27303 20654 14916 12518 11267 8989 9917
13286 9917 9430 9505 7449 3526 3381 2874 4221 4486 1911 1260 3882 4193 4853 5887 4851 2829 1367
13269 1367 173 -900 -430 -11 -447 247 757 587 897 2371 3114 1867 1902 2526 3302 2526 525 -739
13251 -739 -179 1697 3016 3728 5839 6622 4726 4100 5100 4660 3324 2896 2530 5915 7750 8594 7640
13234 7640 7328 7262 8993 10216 10793 9823 8098 9043 8786 7434 7230 9394 7781 7356 3845 2820 3531
13217 3531 5170 6804 5167 961 343 416 1269 2539 1183 1744 2842 4874 7452 8076 7457 9411
13201 9411 9267 10194 12106 13651 15406 15025 14911 11710 13208 15295 14586 14111 16704 16405 16218 17192 22144
13184 22144 25877 25210 19560 16168 14239 9606 5338 3502 4137 5787 8075 6954 6913 6986 7167 7840
13168 7840 7870 7740 9640 9794 11626 12335 15944 18848 19201 15673 14242 11275 10806 9164 9195 9220 9513 9771
13150 9771 9314 8297 6832 6117 6472 10170 11469 11027 13178 15087 14747 11626 9405 7901 9018 12837
13134 12837 15151 16754 15827 15640 17674 20032 20018 20260 20647 20263 20739 22378 18811 16724 15851 17711 17678
13117 17678 17971 18613 17370 17476 15832 16889 14846 13602 15319 17626 14721 15166 16093 18103 19326 20934
13101 20934 18379 17518 16218 15765 16985 15787 15726 13238 10673 10847 10748 7693 4879 5414 7333 5486
13085 5486 4760 5823 8048 8617 8318 9460 11306 12170 12790 12793 14377 17121 19526 17718 15551 16108 16347
13068 16347 17527 20837 22211 21990 18510 14254 12537 11735 11289 12672 11891 12972 13596 13945 11205 12545
13052 12545 13016 13156 14781 15034 14762 15094 17155 17097 14997 15229 18826 19375 19513 21934 24724 26097 26257
13035 26257 26682 24834 21101 20096 20283 19648 18386 16269 15333 15427 16147 16963 18007 19471 18928 18324 18512
13018 18512 20611 24237 26119 24536 24477 27136 27824 28446 27725 26547 29657 32975 34102 36512 39256 39596
13002 39596 39850 41809 46231 48896 50868 49982 50645 49813 47599 46592 48800 50315 49720 49517 50800 51794
12986 51794 53954 55923 56851 57800 62285 67202 67396 68719 70554 73993 79293 82001 85731 90989 94737
12971 94737 101461 108676 116043 121686 128374 133189 139676 149594 162891 177922 195724 218291 240876
12958 240876 263714 286392 311862 344388 386432 439637 507868 598832 719459 881105 1095387
12947 1095387 1382923 1770766 2294896 3001389 3918021 4986427 6036549 6805978 7017990
12938 7017990 6505356 5455435 4297539 3321303 2612645 2127545 1789469 1539416 1348815
12929 1348815 1204447 1092978 1013814 958689 928152 922011 936905 976741 1049418 1157066 1312387
12918 1312387 1528365 1826570 2236422 2806923 3584538 4585295 5726144 6793743 7495098
12909 7495098 7538147 6787806 5542678 4286178 3289176 2591321 2119665 1784044 1523978
12900 1523978 1318012 1158756 1036786 945517 878959 834656 807845 795082 788394 784706 785106
12889 785106 795037 816536 855528 917501 1004211 1130538 1308573 1555584 1891233 2347965 2972174
12878 2972174 3828672 4966588 6349559 7786839 8957004 9475181 9031906 7746431 6177625
12869 6177625 4785717 3745105 3029936 2538146 2180990 1910009 1701171 1542664 1420386
12860 1420386 1336998 1290582 1272195 1283828 1331429 1416956 1546636 1731741 1989688 2345584
12850 2345584 2836610 3505233 4400017 5551356 6894572 8208045 9169693 9426946 8760619
12841 8760619 7388024 5835174 4502911 3513616 2819962 2326648 1951751 1654250 1415496
12832 1415496 1225461 1072881 952645 858234 782191 718682 667020 621029 579656 539525 503669
12821 503669 468385 438350 408496 381902 361331 343220 325920 311195 295878 282103 268850
12810 268850 257197 246553 235039 228834 222393 215036 208059 205596 201729 196506 190512 185530 182804
12797 182804 180239 177454 175174 173663 173559 172281 171055 173272 176084 182825 191193 201187 212325 224276
12783 224276 236012 250550 262945 266913 268809 273884 280327 281575 282174 281293 278135 272432 262743 248870
12769 248870 229195 209106 187381 166586 151264 138952 129784 120072 111132 103040 97187 92489 89855
12756 89855 87069 83197 79531 77687 74532 72360 70369 70495 66751 61090 58133 58509 57730 57083 54736
12741 54736 56918 57308 56426 55320 55206 55265 52267 48346 48934 48707 45021 42033 42726 43491 42663 41376 40127
12724 40127 41793 40022 38545 39488 40830 43615 44473 44517 44186 43806 41862 41278 40321 40507 39945 38026 36601
12707 36601 34480 32259 30390 29932 28993 30591 31997 31603 32916 32883 32644 30607 29482 30973 32315 33277
12691 33277 36670 37684 36816 34403 34273 33535 31857 31916 30164 27720 28354 29848 28083 27042 26046 27859
12675 27859 30923 28932 28910 32119 32289 32236 31284 32459 31982 29178 28099 27643 26759 27661 30538 32454 36026
12658 36026 37747 40358 44667 44709 41756 39893 37390 35507 34494 35589 36764 38521 39378 37411 37787
12643 37787 39617 36095 37030 37665 36341 34088 32763 30557 26999 25396 24331 23419 24925 25431 26839
12628 26839 28215 30222 29105 31230 33574 36418 39298 40390 45029 47351 49577 51905 58322 60587
12614 60587 63744 64888 62471 62316 61899 60747 58897 55604 52222 46258 44027 41836 41330 41380 41501 42476
12598 42476 44544 45152 45258 46233 47960 47035 45759 43440 43724 42134 40583 43152 46957 47701 46945 48879
12582 48879 49489 44967 41815 40943 41321 41650 44119 47104 48941 45107 44034 43705 42480 41610 42453 42750
12566 42750 43188 44355 45361 45398 44275 42695 45404 48130 51291 56047 56105 57621 58910 59224 58016 57131
12550 57131 54586 51927 47018 42030 39648 37263 34314 33106 33460 34016 37522 42851 45037 45693 48479
12535 48479 51236 56625 61054 65001 68356 70872 71655 75874 74600 72099 67518 68139 70162 71548 74384
12520 74384 75666 79509 83879 86358 91029 94781 99097 103760 109623 110159 109785 112521 113020 112185 114612
12505 114612 117480 117249 117299 121060 126105 130954 134200 136850 140796 146420 154843 163165 171759 182147 192551
12490 192551 204114 216707 228419 242122 252676 264489 275215 284141 297105 313532 329418 347892
12478 347892 368562 390782 411151 436826 473277 522072 585733 665882 767065 897588 1059587
12467 1059587 1262425 1519492 1856942 2305913 2922205 3770413 4887950 6218070 7557929
12458 7557929 8602128 9003505 8523874 7313785 5883193 4638608 3735222 3152101 2806273
12449 2806273 2615259 2509319 2445937 2400827 2348181 2250378 2087259 1867658 1618632 1377854
12439 1377854 1174571 1021899 915562 844331 792436 755498 732055 714422 698003 690878 688734
12428 688734 688857 689363 693361 701746 715306 731772 757643 795519 847209 909808 984620 1074336 1191258
12415 1191258 1335347 1512032 1732454 2008525 2358757 2819878 3446421 4304729 5448939
12406 5448939 6848686 8328525 9596836 10296947 10132444 9129871 7765534 6551699
12398 6551699 5738226 5375640 5432646 5856847 6565895 7404465 8142468 8508807 8249728 7353544
12388 7353544 6167932 5074557 4253478 3722864 3418457 3264546 3203308 3208268 3267497 3367937
12378 3367937 3526251 3736674 3998512 4317086 4715628 5229455 5907325 6825508 8076264
12369 8076264 9762175 11973868 14769587 18143322 21973665 26020213 29979092 33435975
12361 33435975 35955488 37313055 37577948 37141789 36483250 35806157 34850173 33120398 30330313
12352 30330313 26587084 22378869 18349248 14979035 12430792 10617959 9375794 8542305
12344 8542305 8016184 7760980 7781521 8099081 8692161 9450980 10156481 10525193 10270697 9277868
12334 9277868 7836280 6394898 5222021 4367355 3769194 3340038 3000897 2714547 2468995
12325 2468995 2254280 2067290 1906109 1771142 1653939 1549783 1456666 1377312 1304589 1240830
12315 1240830 1185539 1136522 1089787 1043391 999778 960994 926378 893343 860611 829842 803405
12304 803405 775950 750142 722898 697976 674857 651194 627182 605763 586810 569177 554635
12293 554635 543171 533001 522649 512357 506950 506025 503592 499697 496877 496445 502259 513425 533490
12280 533490 571602 628379 710266 822649 962239 1115652 1267697 1397065 1472188 1467142 1370906
12269 1370906 1195100 984281 791997 644858 544766 476419 428516 395827 373569 356145
12259 356145 342048 327464 317419 307938 294405 281468 269715 262741 255048 247548 244460 241534 238912
12246 238912 235921 231503 229255 226248 222036 219468 216322 215072 214477 214992 214352 213132 211785 206830 202383
12231 202383 198589 190258 184035 177109 173715 172602 169559 165348 160828 160013 162380 163276 160933 159868 156219
12216 156219 154547 152281 146809 139351 133914 131889 132331 130576 129436 132009 132582 131274 131213 134680 138995
12201 138995 142966 146548 149001 148878 148344 143845 137822 132610 127078 125018 124122 121620 120826 122039 124503
12186 124503 122407 123108 123991 125353 127678 128741 130340 128634 126667 122797 120189 119940 118846 118442 119081
12171 119081 118121 118024 118823 121771 125885 127683 130099 131574 134566 134218 134998 138711 139836 141886 141316 141717
12155 141717 140370 139581 140456 137531 133941 132607 129389 128111 125847 122042 122328 122419 123674 126762 128438
12140 128438 128627 129648 131383 133858 133314 133101 136313 135424 135240 135070 133269 128478 123925 119960 114634 111031
12124 111031 107565 102657 100771 100082 96233 90285 89115 91622 91523 92002 90132 86478 83918 80989 78064
12109 78064 75819 73583 72834 72253 70928 69448 68279 65631 62820 60055 55817 53081 49455 45284 42873
12094 42873 42704 44740 43850 44882 47037 47286 49492 51193 54817 57145 56772 57200 58262 57091 56412 58963
12078 58963 56530 56256 55574 54533 54048 53829 52215 49948 49883 51757 51637 50770 50086 47853 47686 51094 49133
12061 49133 48053 48085 46327 45078 46266 47928 48728 47851 47951 47325 48278 48130 48851 46446 44153 42512 42645
12044 42645 43571 42876 42111 40971 42368 41456 40593 44076 44678 45977 47927 48300 49179 49940 47192 45360 44838
12027 44838 48005 50256 53142 55157 58561 61093 62657 62017 61412 60301 59891 58399 60728 64006 62489
12012 62489 59263 57880 59105 60228 62564 66211 68479 71081 73901 75810 70061 62669 58255 54504
11998 54504 51796 47420 42125 37642 35449 36357 35637 33976 31002 28416 26301 26880 28826 29685 31645
11983 31645 30657 30838 29536 28260 27220 26778 25163 24786 24827 23717 22263 21316 20916 21491 20550 19285 17892
11966 17892 17911 19625 22271 24690 26449 29410 29979 31360 32725 33458 38002 44302 48820 54791 63747
11951 63747 71986 79627 86084 92270 96894 98767 109166 121663 136839 160504 185038 207064 226874
11938 226874 242168 250625 251712 241968 230291 215830 202255 185548 168000 153408 136007 116209
11926 116209 102649 90279 81090 74331 68013 63972 61343 56286 51769 50623 49806 49321 50410 49227
11912 49227 49070 51516 52438 54438 53478 51372 48992 46262 42126 39531 38277 37146 36824 35533 34365
11897 34365 35111 33759 29788 27641 30737 33765 36907 38518 42362 45679 49504 54845 61324 68914 73781
11882 73781 74378 70165 65294 61677 58242 55462 51276 50153 48169 47290 48214 50307 48935 48855 48931 47047
11866 47047 44861 48212 49147 48325 49750 51526 52753 54264 56278 55330 57190 58508 61439 64077 67714
11851 67714 70928 75555 79014 82855 88070 89200 87309 86812 86341 88452 86540 85335 84819 86094 88149
11836 88149 91999 94107 99307 102961 106522 110310 112187 115423 122228 127838 135882 142666 149292 153963
11822 153963 161549 172237 180390 189372 195788 204155 216117 230651 248468 265496 286137 311561
11810 311561 343686 381302 430538 492869 570982 672108 803492 980196 1213196 1514306
11800 1514306 1881476 2290879 2697717 3031046 3218154 3220162 3050053 2771359 2463442 2196307
11790 2196307 2004809 1903938 1890125 1963832 2127862 2379631 2702772 3061579 3394028 3624783
11780 3624783 3676790 3519937 3189473 2766467 2342465 1984851 1715049 1525939 1401758 1329918
11770 1329918 1307670 1332324 1406054 1538704 1743265 2025339 2384905 2804087 3231427 3591359
11760 3591359 3800449 3802576 3607244 3283632 2925154 2607696 2369535 2232058 2199494 2267770
11750 2267770 2434587 2695857 3041286 3431312 3804172 4071662 4147732 3986182 3619477 3137754
11740 3137754 2647651 2229327 1911174 1690017 1551371 1478715 1463229 1502721 1602479 1772093
11730 1772093 2024850 2362059 2766308 3195827 3574910 3820636 3865965 3705692 3401340 3044194
11720 3044194 2711720 2454825 2297211 2237727 2278195 2418250 2658502 2991611 3378685 3758957
11710 3758957 4055309 4178176 4069218 3743181 3282825 2794038 2359621 2018578 1774615
11701 1774615 1611971 1511989 1466430 1471964 1530974 1650532 1839637 2111087 2466747 2892291
11691 2892291 3341037 3745161 4019210 4090359 3940985 3629285 3251868 2894982 2612431 2430295
11681 2430295 2353544 2382926 2517436 2757375 3089981 3486118 3883891 4195534 4327154 4217874
11671 4217874 3873201 3367577 2812865 2298371 1873594 1547759 1302980 1119118 976890
11662 976890 866651 775587 701412 639511 589705 543155 501733 466045 434883 408792 385960
11651 385960 364308 344124 328963 311851 296091 282199 268242 255006 243894 233909 220904 210827
11639 210827 201539 192379 185145 178098 170428 163737 159858 153836 148103 142695 137499 132690 128325 123115
11625 123115 119040 116370 112839 111534 108295 105204 102591 97830 95289 93933 92582 90094 87152 87794
11611 87794 86226 83128 78859 77624 78458 77088 75554 75070 72342 71771 70297 68157 68856 69387 66236 64482
11595 64482 62047 58925 58107 55956 54251 53104 53724 52905 48874 46414 47542 47820 51426 52314 52204 50997
11579 50997 51207 50726 48834 47004 45468 46146 47321 46290 43693 43071 40885 39926 41581 43532 45339 43958
11563 43958 42784 43603 42382 42680 40188 40123 42032 39541 37556 38446 39098 36558 37713 39493 40772 40986
11547 40986 39488 38392 37605 37844 36640 35894 37112 36174 36789 36278 35490 37429 35813 34574 32080 32361
11531 32361 34131 33352 35572 34940 34447 36442 38111 39744 42665 43417 46606 47384 47653 47515 46254 46827
11515 46827 52713 61785 69048 77488 88599 100398 109541 119957 131074 140122 149886 158504 165071
11502 165071 166346 165641 159665 153489 149122 146334 142953 137861 137735 139262 144966 148209 153276 159026 162475
11487 162475 161309 160420 158953 152308 143837 134861 125583 118451 111306 103045 95332 88462 83406 77434
11473 77434 73534 70979 69573 71540 73261 72249 70057 70989 72201 73522 75252 75556 77744 77902 78846
11458 78846 79613 81586 83154 88050 92809 96269 102416 108833 112621 117537 120742 126007 133391 139227 145823
11443 145823 154655 162824 174701 187014 203232 219722 238007 263947 291944 323319 365610 418561
11431 418561 483098 568356 678435 816595 978817 1155180 1333412 1486284 1593273 1644554
11421 1644554 1644443 1608940 1561184 1530059 1539761 1610261 1752300 1969806 2249437 2556270 2841686
11410 2841686 3050181 3145438 3139075 3064708 2966354 2880964 2836891 2854140 2944668 3101079 3289049
11399 3289049 3459921 3564304 3573695 3500352 3366192 3176862 2937932 2669318 2415425 2227383
11389 2227383 2130065 2123358 2197272 2326992 2483819 2630265 2722498 2733644 2677430 2607587 2586776
11378 2586776 2643019 2759243 2896034 2998549 3027127 2991537 2939120 2923988 2972050 3070182 3175413
11367 3175413 3241756 3236401 3173704 3098022 3055434 3068819 3120472 3178309 3200719 3160939 3076497
11356 3076497 2992150 2960868 2999818 3087862 3191395 3274334 3321259 3358148 3434175 3593313 3836316
11345 3836316 4118131 4354389 4461856 4381754 4106981 3709457 3293087 2939331 2686785 2539772
11335 2539772 2494096 2545195 2678779 2883526 3140257 3410516 3640539 3772645 3759633 3572102
11325 3572102 3229840 2801855 2375963 2019995 1753081 1568730 1446552 1375712 1346704 1353042
11315 1353042 1395983 1481770 1615888 1793316 1999478 2209705 2376819 2451283 2412297 2271477
11305 2271477 2074380 1870760 1695132 1562951 1482562 1452458 1466646 1527190 1629659 1769740
11295 1769740 1927977 2073007 2163691 2162774 2050826 1844005 1591207 1344530 1136703 969899
11285 969899 841556 743537 669176 612186 564989 524408 493204 467243 443485 423789 407573
11274 407573 397197 389135 385773 388630 397158 408676 420704 433032 439504 440433 435142 426038 417333
11261 417333 407602 397709 382939 365864 353461 348589 351632 358717 366716 372883 374802 370159 361447
11248 361447 348815 333975 315647 294500 272009 253379 234335 215407 197419 183460 173163
11237 173163 160492 152841 148006 143695 137598 134970 133861 132816 129793 128568 125468 121991 118904 117263
11223 117263 115245 112696 106968 103546 100748 98896 98896 96333 91596 88665 89134 88631 84001 80128 77621
11208 77621 76954 76572 75557 73724 72361 71684 72292 70583 68714 69784 71164 69930 66990 64867 64216 62949
11192 62949 60029 57782 55059 53433 50022 47402 47931 50807 49946 49546 48757 47921 46747 42666 41264 41779
11176 41779 39330 38650 40665 41299 41610 44054 44417 45329 45412 45696 47974 49031 51007 52255 50646 50064 47801
11159 47801 48569 50753 51025 51850 53305 51341 49821 49346 49483 49889 49878 50201 48946 46641 47043 47689 46312
11142 46312 46436 49724 50822 51500 52907 52996 52250 52161 54347 52736 51318 50710 50877 48968 47204 48426 46957
11125 46957 48328 47900 44474 42631 45271 47074 45907 45746 44716 43661 43074 41841 40968 41792 46607 49353
11109 49353 48233 47319 49121 48635 46247 46409 45443 43898 43939 48746 52873 56373 55464 53931 52217 51361
11093 51361 50474 50096 50854 52878 52634 50624 49470 51016 53078 52872 52677 54223 54418 55499 56020 58617
11077 58617 61393 62753 66625 70967 77059 83224 87626 92751 95208 96019 98903 100714 101096 103535 106738
11062 106738 107313 107132 106077 104322 105896 108739 111423 116188 123849 131852 137027 145791 154472 168211
11048 168211 183574 196782 216891 245003 276448 315154 371525 449374 550759 675511 817145
11037 817145 964902 1096681 1186590 1226008 1232754 1230848 1242773 1269828 1296305 1300875 1259084 1169402
11025 1169402 1042029 906603 787852 694756 626735 582293 553712 539785 536630 539313 550409
11014 550409 572650 610244 670634 753144 864769 1004552 1166897 1337897 1494649 1625310
11004 1625310 1727879 1828980 1951969 2095260 2236052 2341785 2375681 2328451 2222454 2095268
10994 2095268 1987735 1911422 1847820 1772002 1666132 1541566 1433413 1367724 1355311 1398367
10984 1398367 1491087 1614335 1749851 1870654 1963336 2042697 2148932 2314792 2541359 2805113
10974 2805113 3060186 3251521 3331734 3311396 3252826 3188650 3130301 3085330 3049310 2996304 2900238
10963 2900238 2754844 2578332 2384387 2175888 1976506 1821527 1732319 1710927 1747868 1829783
10953 1829783 1943993 2075718 2213822 2363266 2543496 2778848 3075188 3403032 3706682
10944 3706682 3929746 4031194 4023920 3983541 3984999 4050709 4142515 4192231 4124219 3908020 3586228
10933 3586228 3246902 2959055 2746171 2584998 2443720 2297658 2146414 2009190 1915885 1887566
10923 1887566 1925981 2034923 2199472 2389926 2571166 2707085 2792433 2855182 2924932 3005912
10913 3005912 3103442 3215124 3317753 3374607 3358045 3280198 3146305 2947469 2709434 2497520
10903 2497520 2346786 2258925 2206715 2159485 2082532 1958143 1805540 1667967 1582974 1561460
10893 1561460 1601888 1692478 1813602 1944787 2061608 2150004 2224041 2312552 2431515 2569388
10883 2569388 2687727 2733348 2687635 2558457 2388702 2226412 2095902 1989172 1877441 1728909
10873 1728909 1538269 1333771 1148890 1002303 890807 808408 750710 712976 686677 668726
10863 668726 660532 666592 684172 717541 769522 840888 935105 1045067 1160480 1262714 1331249
10852 1331249 1357006 1352803 1339192 1335349 1343504 1355477 1349390 1301120 1196947 1047296 886666
10841 886666 740496 620313 528824 462142 415335 378672 344636 317908 297943 281039 265871
10830 265871 252654 241475 233176 224046 212912 205004 197981 188641 180360 172491 166271 162519 157341
10817 157341 150867 144551 141356 137852 135272 132895 128169 125778 123461 123549 124864 125474 126574 126454 125612
10802 125612 125621 124795 123460 124135 126184 128383 127900 123608 121647 124309 125245 124409 125332 129019 134545 139330
10786 139330 143917 150627 158559 168732 180928 195303 209516 220943 235061 251817 272535 297765
10774 297765 329384 371730 429873 507764 615661 756827 926929 1118400 1303911 1447714
10764 1447714 1510197 1476585 1387941 1306420 1276056 1299934 1358971 1415869 1429664 1369311 1231962
10753 1231962 1056659 889125 751096 643101 565182 511099 469874 436673 410890 393511
10743 393511 382401 378076 377987 386941 402508 426609 465742 519719 593738 695826 819342 949099
10731 949099 1059267 1122284 1114580 1051969 981056 942871 952199 993728 1040012 1061948 1027438 931199
10719 931199 810598 705048 626411 575648 545137 527827 521894 520204 529626 551348 580915 624543
10707 624543 689587 787368 922604 1110104 1361401 1674723 2021058 2347378 2582837 2648468
10697 2648468 2534080 2358370 2248909 2261883 2383734 2554805 2699751 2728829 2582903 2301810
10687 2301810 2022220 1834153 1759529 1797465 1928239 2119999 2320250 2474274 2530033 2470627
10677 2470627 2358818 2278574 2277919 2347508 2456119 2552653 2596367 2566393 2506319 2491018 2570719
10666 2570719 2741205 2956972 3143669 3233758 3179601 3034734 2914890 2894249 2981848 3119366
10656 3119366 3229844 3222413 3025259 2664775 2256752 1896412 1610445 1395008 1223816 1085366
10646 1085366 970450 879146 810866 754458 709943 675476 646506 623342 607093 592858 580818
10635 580818 575400 573006 573859 578005 584797 595868 612565 634028 663231 703551 757831 828400 918577
10622 918577 1034505 1194712 1422296 1737370 2161316 2690693 3280636 3840542 4252079 4383233
10612 4383233 4217031 3952975 3811190 3863176 4066213 4303738 4441282 4338954 3942913 3395443
10602 3395443 2888331 2515033 2278744 2159440 2140462 2207099 2366338 2627497 3005357 3506592
10592 3506592 4120987 4796800 5449996 5981914 6312847 6459835 6530631 6617130 6707518 6718297
10582 6718297 6575504 6305852 6057328 5983546 6159767 6582579 7180116 7842909 8436757 8839617
10572 8839617 8974751 8851027 8551934 8215053 7954483 7810042 7725652 7587577 7306319 6831206
10562 6831206 6166996 5366208 4523821 3744501 3100179 2606743 2243547 1967888 1753364
10553 1753364 1582991 1443008 1326619 1232062 1153237 1083642 1026420 977503 938053 906171 880232
10542 880232 857129 837227 824203 816367 813210 812923 819086 830710 847092 870298 898056 937043
10530 937043 991451 1063524 1164321 1297424 1476873 1718540 2036967 2446483 2951640 3527474
10520 3527474 4112872 4626634 4984087 5119979 5024055 4731586 4303246 3813507 3341838 2954638
10510 2954638 2673967 2496496 2409261 2409065 2492607 2671515 2968941 3401461 3978322 4685422
10500 4685422 5465621 6219590 6810272 7122636 7092093 6719114 6068736 5247725 4376108 3570720
10490 3570720 2907731 2399268 2021897 1737864 1521622 1349724 1212615 1098066 999089 917158
10480 917158 847127 788273 738190 693665 654366 620329 591881 571449 551613 535799 523073
10469 523073 514190 510107 508247 513118 518196 521680 516510 513023 518186 534608 564453 610997 677638
10456 677638 766297 868456 975645 1070950 1136902 1161969 1146266 1094973 1024708 952280 888845
10445 888845 847377 831405 836762 865941 919299 1001491 1124561 1293258 1517263 1807741 2157494
10434 2157494 2542822 2922527 3236975 3429713 3464261 3333144 3057588 2685049 2273688 1880478
10424 1880478 1552015 1298323 1107049 961063 849963 764642 695091 642952 602226 570202
10414 570202 547112 534747 530025 533443 551874 582598 626647 684450 752205 827019 901524 971551
10402 971551 1028974 1068290 1086779 1087461 1063117 1011886 941223 858121 770142 690844 627371 577997
10390 577997 543756 525120 525131 546478 590040 644958 694115 733060 717392 644086 587026 555069
10378 555069 539585 535728 540610 552402 567650 590840 621862 658749 705725 765965 837894 930029
10366 930029 1052640 1216224 1438123 1740228 2147198 2682381 3350338 4107837 4846267 5402153
10356 5402153 5596498 5321260 4675501 3913949 3235547 2708939 2326336 2059854 1879390
10347 1879390 1762995 1696948 1674208 1696101 1771790 1913157 2147320 2496062 2975445 3555451
10337 3555451 4144728 4606464 4779109 4527579 3962574 3372132 2922988 2647878 2527049
10328 2527049 2535449 2658019 2896630 3261303 3750760 4341268 4976402 5580953 6075207 6420642
10318 6420642 6675020 6991957 7533972 8388487 9512240 10716811 11720824 12218862 12015660
10309 12015660 11172576 9942757 8568042 7208473 5969397 4919054 4078469 3429215
10301 3429215 2933340 2551878 2254517 2019026 1828215 1670319 1542119 1437387 1351670 1284740
10291 1284740 1226773 1179008 1137544 1102552 1077326 1062913 1057372 1062524 1082516 1121176 1180272 1264238
10279 1264238 1387116 1569514 1824680 2169076 2607273 3105120 3578444 3910863 3984002 3737643
10269 3737643 3285563 2822081 2451813 2195969 2037690 1958226 1939071 1969971 2051921 2191875
10259 2191875 2402592 2705368 3135820 3730453 4541360 5612530 6939167 8454527 10028547
10250 10028547 11460356 12524241 13140608 13340836 13124387 12551690 11908107 11500784 11430980
10241 11430980 11602106 11804188 11787826 11377312 10541658 9380126 8051360 6728405 5552791
10232 5552791 4590616 3840435 3269866 2835476 2491813 2214872 1986801 1799769 1639700
10223 1639700 1497709 1375363 1268056 1176238 1097498 1029507 969498 916559 871328 828219 786175
10212 786175 747875 716371 687911 662553 639453 620045 603898 589838 578990 569023 563389 560683
10200 560683 560681 564108 571051 580539 591816 607867 632477 659870 695232 741846 803912 884590 984228
10187 984228 1107889 1271832 1493848 1795718 2201947 2729028 3372986 4102226 4843216 5482717
10177 5482717 5901718 6012876 5793403 5303300 4645547 3924801 3233415 2639207 2162936
10168 2162936 1802852 1542205 1349915 1203480 1092314 1006556 936530 871739 812480 758276
10158 758276 711364 668983 628536 590345 550348 508679 467932 431651 401693 375600 353760
10147 353760 335158 319727 305939 293731 281547 268991 254848 243725 233614 224046 214309 205203
10135 205203 196746 193182 190345 185176 180500 175335 169438 165240 161665 159628 157623 153980 149548 147294
10121 147294 142389 138615 136276 132597 131913 131086 128480 126019 122389 120379 119719 120636 119014 117581 118809
10106 118809 120800 121217 122153 123569 127026 132449 135112 132398 127752 123636 117085 110852 107566 104874 103165
10091 103165 102252 99463 97442 94216 93069 92054 89924 90123 90856 90057 89742 90354 92390 94112 96742 97838
10075 97838 98254 97255 93496 88754 83506 77053 75085 74077 72090 71189 72810 71541 67026 65630 66120
10060 66120 65706 62456 60550 57890 59079 59974 59890 61040 59887 57224 56857 56234 54041 54959 54862 52299 51856
10043 51856 48874 48778 49540 48366 47179 48526 49462 51939 56655 59299 62034 62369 64228 61631 56067 52292
10027 52292 53618 54726 52484 52978 51679 51771 49937 47832 48079 48281 49415 49876 50525 52472 56301 59352
10011 59352 59207 55931 55103 54430 53119 51744 51780 52124 50491 48287 47806 49711 51118 52114 53847 53589 51463
9994 51463 48708 47303 46949 50167 49610 48632 47674 47497 45949 43536 43429 41657 41459 41090 41324 42854 42925
9977 42925 41843 41161 42413 42679 40755 41312 43776 44529 43483 42140 42658 41056 40471 41471 40537 40020 43196
9960 43196 44232 47321 48418 46893 47090 47571 50616 53005 53008 51637 52001 53449 55696 59160 62203 63490
9944 63490 66550 68236 70838 71820 71375 70651 67953 63754 64357 64421 65894 69750 72407 73550 75781 73462
9928 73462 71235 72598 74644 77711 82894 85196 89270 96854 104343 109568 109471 108637 106443 100149 94239
9913 94239 88958 85906 86236 86164 86498 87014 90291 94197 95558 101602 113739 133694 157593 178591 193629
9898 193629 196971 178874 159841 148808 141017 135900 131493 129743 128902 126100 125458 125982 125059 126175 126471
9883 126471 128904 130347 123067 117180 113905 110667 109297 109937 108610 104904 102822 104151 104573 105144 109093
9868 109093 110838 113511 113939 111829 110817 115055 117514 119060 119707 121954 126794 132208 133533 135307 137770
9853 137770 139339 140534 140849 141492 139215 140018 138812 139097 138666 138897 139400 141473 144901 147214 147588 149104
9837 149104 152652 157231 163766 169379 174637 182013 191897 199517 207289 211815 215324 214917 210036 204620 201946
9822 201946 201246 198925 196438 193983 196043 197124 192695 186763 180384 176706 172206 169599 167375 164256 161665
9807 161665 161635 161600 161776 166028 166905 165835 163879 160236 153651 150292 149180 150120 150174 150223 149113 149067 148263 147646
9789 147646 147878 148969 149371 149376 148286 147568 149812 149175 149264 149799 146395 143105 142283 142776 145053 146348 145952 142845
9771 142845 140108 141039 142654 141673 142100 146831 149861 150876 149824 151456 152865 154632 155837 156300 153913
9756 153913 151070 147943 143849 139162 136177 133875 131326 129285 124990 120078 118168 118741 118249 116334 108684
9741 108684 103690 105630 105698 106326 108425 106193 99635 96223 96913 98579 99509 98472 97476 96906 97010 93443
9725 93443 93695 95204 93359 92114 93371 95069 95972 95507 93991 93391 91521 92122 92665 89023 86297 87493
9709 87493 86054 83691 83030 83998 84893 85961 89294 90035 93124 91986 87825 87439 88362 90754 93207 94071
9693 94071 93971 90157 86379 85699 82876 80544 78108 78122 76986 75175 70181 66298 62767 59457 57904 55941
9677 55941 51476 50066 54214 57375 57323 52727 50779 50323 51494 52105 51123 48564 50288 52277 53486 50464
9661 50464 48859 50193 51086 52596 54031 52591 50981 52677 54307 54580 54899 55372 53901 54629 54943 53255
9645 53255 52721 51294 51617 51353 48775 46689 40877 37220 39476 38374 37755 39168 40889 38905 35143 34001
9629 34001 32295 34072 35788 35293 33662 31815 32707 31744 31790 31039 31402 30360 27571 26652 28176 29179 31695
9612 31695 32536 31608 31872 30766 27784 26453 26837 25710 24678 25316 25305 25949 25932 26628 27475 27826 28590 28611 29417
9593 29417 30781 30561 30184 28565 27702 28764 28412 31408 33868 33838 32724 31690 32932 32731 32542 32372 33232
9576 33232 33426 32990 29789 28724 29550 30187 28861 28209 28223 28780 27867 26523 24794 20310 18089 21575 21926
9559 21926 20657 21145 24378 26705 28996 26893 27510 26602 25187 22782 20237 18482 20769 22888 20636
9544 20636 19102 20186 21155 20106 18390 17927 19458 20669 20612 20543 16926 15726 16854 19851 21598 18788
9528 18788 16855 18237 19196 20163 19521 18761 19379 19728 16615 16820 15832 14277 13531 16614 17548 19687 17354
9511 17354 16120 16839 16218 15938 18834 19196 18380 17580 18412 16880 16484 16567 15545 12407 13776 15154 14613
9494 14613 15739 17721 17593 18569 19801 18536 18599 19496 19667 18772 18153 18897 19452 20278 20837 21016 18627 17550
9476 17550 16557 18275 21983 25076 21847 21356 26468 26625 22247 19527 20792 23366 23698 22430 22925 22871
9460 22871 23230 23866 23750 23315 24665 27004 26078 23764 23441 22387 20912 22319 21066 21408 24936 25367 23872
9443 23872 18964 14177 18098 18932 19347 19826 18280 15776 16203 19167 19677 22015 22845 22262 23497 23908 25957
9426 25957 27440 30135 32937 28832 24445 23796 26676 25508 24041 26243 25621 24658 23262 24413 24220 26531
9410 26531 25987 23150 22414 27001 29675 29233 29759 31781 32691 32816 34808 33460 33609 34376 31804 30627 31932
9393 31932 33186 35589 37370 35400 33337 32437 32792 33248 33835 33983 34068 34260 33575 32379 31152 29011 29817
9376 29817 32737 35689 36070 33821 34385 34860 33942 32530 30661 30577 29962 29096 28267 28210 28379 28952 23604 18238
9358 18238 18196 20786 22091 23098 24611 24786 24833 25310 25436 24113 24385 24283 25087 24232 23706 22137 21402 21068
9340 21068 22569 22775 23153 23743 23073 22101 20717 18399 20568 24780 24231 23278 25019 24528 25305 23036 20747
9323 20747 21492 21857 21598 20930 20431 21001 21962 20195 19346 18352 16801 16384 16927 16746 15733 16582 17378 17953
9305 17953 17695 16330 15214 12036 12998 14619 14460 14974 16393 17090 17187 19209 20893 20862 21878 20918 19021
9288 19021 19555 21590 23131 25624 24467 22581 22761 22288 22441 24791 25504 25187 24384 24167 25794 25094 27649
9271 27649 26242 25245 25054 21746 19021 21085 22734 23373 24996 23929 23722 23517 25203 24697 26749 29862
9255 29862 29273 28015 29054 29011 29131 27345 26732 27777 28874 28287 27126 25632 24003 25355 25846 25230 24840
9238 24840 22015 20872 22914 23482 23743 22564 22585 22895 23556 24230 22512 22290 24212 26345 33801 44588
9222 44588 54522 57180 49264 40212 33490 33636 38973 43432 50769 56118 53187 43596 31538 24023 22836
9207 22836 25244 30714 29997 27712 24139 23094 23972 25682 29384 29754 27557 28636 28830 30532 28720 28338
9191 28338 27309 27237 27995 25618 24748 25864 24743 22275 23517 23327 25777 26504 24767 27245 28313 27948
9175 27948 25652 25684 26317 26287 26655 25789 24454 24002 25948 24968 23683 23235 23755 24227 25893 26801 28397 26988
9157 26988 24215 23299 22711 22746 22631 22923 24431 24865 25430 24942 24840 28130 31493 31481 29264 27737 27200 28154
9139 28154 28915 26106 22837 25464 27959 26921 27250 28104 27986 30558 29980 27452 27360 27955 30073 30079 31686
9122 31686 33725 33409 34756 34723 34269 32827 33521 33949 34994 32178 31604 29873 31971 29767 27376 25101
9106 25101 22079 21104 22271 21625 22704 23925 23723 22470 22661 21358 18429 17997 18860 21313 20678 16414
9090 16414 14096 14343 15880 16344 17602 15763 14909 15173 17899 18908 19273 16140 13712 14091 13114 14250
9074 14250 16662 19960 21037 17707 17838 18496 18057 18658 16065 16354 17139 16931 17902 18165 17307 15171 14101
9057 14101 13812 11191 12793 15301 14594 14288 13578 11548 13737 14204 15621 14553 13824 16016 18215 19042
9041 19042 19308 16673 15386 15933 17615 18110 16438 16132 17413 16454 14203 15896 17100 19166 18284 16914
9025 16914 14924 14101 14858 14254 15160 14966 14053 13150 14576 15857 16230 15855 16140 15846 15843 16025 14095 11129
9007 11129 10216 12943 12816 15871 20198 17910 17141 19724 19060 15751 15087 15885 15840 14275 13505 14838 15059
8990 15059 13884 12037 13521 13007 10159 10926 12085 10637 10846 9376 9809 11392 12816 13398 13233 12371
8974 12371 13141 12661 12288 12075 12548 12608 11754 11231 11685 12099 13285 16178 16236 14837 15284 14095 13539 15014
8956 15014 15561 16100 16168 17209 15939 13538 14469 16529 14036 14089 15717 13767 14494 13008 12061 15802 18689
8939 18689 19171 18960 15912 11726 10819 11205 12305 11335 11650 13082 16234 18892 19187 20630 21253 20682 21992
8922 21992 22204 23805 27208 28539 27756 25005 24057 23373 21818 20262 19424 17106 17519 17085 12854 13758 16036
8905 16036 14412 14926 14422 14944 15266 17155 17904 19153 22078 24372 24877 25073 25667 28868 29689 33273 33556
8888 33556 33382 36434 41789 49535 59288 66885 76921 94208 117165 147920 184024 221427 251550
8875 251550 266712 259239 228347 194701 166300 138307 114594 94177 79740 72102 64777 55903
8863 55903 51657 47803 48753 48900 45011 43019 40663 41039 37398 33702 31931 29365 27921 26996 28942 28925
8847 28925 29461 28283 27683 27756 27590 28360 30281 29654 30970 30811 27683 27262 29936 31666 27681 26531 28605
8830 28605 28539 27966 26747 28305 29965 29741 28098 24983 23231 24061 24588 25659 28065 26807 26534 24581
8814 24581 22219 22454 24111 25385 25696 27557 26734 25014 26163 29088 27974 28090 26844 26516 28516 29498
8798 29498 27707 28992 31932 31280 30868 32395 32027 32782 35612 39689 40871 39575 39138 41775 41410 40646
8782 40646 42724 42763 45546 48875 50326 51113 50326 48954 47820 48310 50340 51452 50390 48948 44645 45914
8766 45914 49651 50325 50468 52354 57334 60924 59736 59226 60056 61262 62618 65916 73195 77135 76329 77422
8750 77422 81529 84834 88190 93062 98111 105538 110618 116153 124327 138447 156097 179302 205418 232162
8736 232162 260069 282451 285733 270151 244045 217604 192024 172913 161154 152975 144938 136876
8724 136876 131321 129623 129073 127731 127694 127393 123640 121315 120299 118894 120372 125565 128718 132782 136076
8709 136076 139755 144725 147558 151621 156994 161872 166745 172783 176802 180148 186828 189447 193865 199639
8695 199639 204209 210903 216650 222582 226647 231003 235196 235231 236099 238120 241038 242637 240344 238642 239201
8680 239201 239536 239226 241590 249332 256173 259831 262830 268077 273914 279379 287798 296640 305181 316981 329289
8665 329289 341856 354601 365463 374947 387974 402079 417628 438527 469036 504428 548646 595594
8653 595594 636960 658399 645882 611964 581775 564365 560276 565998 575935 594916 621865 654694
8641 654694 689757 728432 769026 808521 848126 889190 932881 976407 1023038 1071588 1116811 1161398
8629 1161398 1206808 1249422 1288949 1327416 1367496 1403643 1439587 1484602 1537536 1598801 1672271
8618 1672271 1761692 1871291 2005613 2165891 2357408 2575421 2819461 3089168 3360508 3598807
8608 3598807 3759419 3792698 3668538 3378338 2973528 2543912 2153733 1832885 1574839 1369623
8598 1369623 1207160 1076485 971532 883274 806655 740782 683943 633733 590078 552821 520073
8587 520073 488458 459117 433830 412241 396601 382456 367932 352619 340864 329832 320255 311861
8575 311861 303807 294581 288272 283767 277125 270370 261926 253149 244581 240257 236602 231919 225994 223012
8561 223012 217569 211769 205604 199415 195878 191137 186837 184964 185599 185592 183537 181558 178115 178776 178057 176456
8545 176456 175189 171562 167768 162995 156618 149214 145324 142359 139196 133172 125355 117964 112194 109635
8531 109635 108788 105868 104041 99909 95404 93361 90655 86781 86960 86356 84741 82147 81160 82720 82925 81150
8515 81150 81361 78662 76771 78693 74789 71958 70575 70779 72571 72436 71449 72613 74343 73191 76858 83074
8499 83074 86697 86728 83207 80491 77901 76470 74217 71736 69426 64793 63759 62908 58383 57017 56985 55200
8483 55200 54709 54286 53463 52641 52158 53435 50420 49168 49491 51070 55754 57033 59233 62816 65973 64641
8467 64641 64147 61578 58942 55172 55378 58817 62742 65060 63442 64571 63108 62384 62411 60769 55585 50524
8451 50524 49162 50507 51981 52388 50704 50818 53597 54184 53336 53948 56683 56873 57232 58421 58834 56408 55259
8434 55259 56400 61410 62714 62173 59663 55024 56722 59615 65849 73473 79541 83473 82750 77448 71033
8419 71033 66302 62883 59980 55449 51321 49745 50001 49887 48414 47094 45709 46908 46784 44625 44674 45488
8403 45488 43800 44503 43363 42092 41881 41696 44067 45581 50977 56436 61377 66637 72736 81797 86553
8388 86553 85207 79673 70813 62279 56998 52580 50258 49687 50708 54274 57482 59483 54863 49939 49571
8373 49571 50096 54053 58676 61835 61798 57979 54796 52745 52416 49907 47312 46360 46216 47323 51284 54457
8357 54457 52170 50919 49945 50244 49247 49065 49843 50659 53072 59399 67265 74425 80506 82186 86965 96716
8341 96716 106270 117051 125677 130905 136348 137736 142907 147524 152945 166339 184880 213373 257439
8328 257439 318624 401776 513205 656292 830333 1021481 1201833 1336941 1394788 1355769
8318 1355769 1233121 1056519 862968 684316 540661 432712 355950 300971 263820 240377
8308 240377 220153 204987 192131 182683 174210 167353 159508 151594 142578 133761 124847 116316 106939 99888
8294 99888 92956 87924 85478 82170 78628 70760 66382 66128 65513 64344 64438 59467 55239 52251 50617 49051
8278 49051 48622 48658 50730 50770 52423 53597 58051 61446 62665 63524 65822 67648 67962 66669 65607 63165
8262 63165 64396 65273 65990 66526 67870 69312 68880 66739 64598 62621 58556 57290 55042 54594 53730 51734
8246 51734 53103 52590 55335 60668 65096 67285 72137 79004 86092 91216 92964 96409 99617 98215 88279
8231 88279 68582 42276 22454 16000 17449 21659 26179 31620 36406 39984 47169 53501 54202 54725
8217 54725 56982 55619 54199 57173 59858 61819 63055 62940 61811 59752 57987 56058 55067 57854 61551
8202 61551 65776 70202 77024 83490 86881 90140 93965 92705 88028 89482 93688 95091 98947 105555 117385
8187 117385 137587 170282 211661 260402 304051 341265 375641 394829 366415 293998 217454 158959
8175 158959 122616 102528 91421 88151 86520 89187 93641 97751 98079 97659 97754 97535 95924 95247 95939
8160 95939 96395 94834 93099 92937 91282 87933 83284 76499 69772 62174 54564 52292 52355 52905 54412 54150
8144 54150 54219 58752 63362 69450 74381 79935 85445 87682 88595 88791 84105 78073 74034 77691 85842 100166
8128 100166 114314 122001 128334 137308 139604 138618 141006 145586 149240 139803 123458 94691 54294 13388
8114 13388 -22485 -40916 -23570 13152 42814 61624 72620 77277 86253 95840 106224 116660
8102 116660 124328 125892 123658 118998 113674 114427 121232 136867 156507 179208 201874 221430 242803
8089 242803 266374 286598 300068 312396 330832 358462 383982 394745 388098 387469 392619 405244
8077 405244 422641 448494 484943 536682 613231 720432 882042 1131563 1514343 2087021 2840831
8066 2840831 3600105 4208504 4504465 3871510 2806235 2068463 1648214 1419091 1300197
8057 1300197 1244765 1237274 1272073 1335261 1378115 1357887 1283781 1209030 1169351 1166203 1178619 1190748
8045 1190748 1183258 1135318 1070427 1014300 980455 960950 949464 950518 967070 997817 1042589 1107438
8033 1107438 1195751 1307753 1441812 1580212 1696027 1745564 1705242 1636671 1599472 1597428 1620525
8022 1620525 1663892 1725611 1804003 1888419 1969368 2015388 1976800 1853578 1719902 1617380 1547138
8011 1547138 1490276 1447296 1427364 1425649 1448985 1519049 1637961 1799180 1971463 2114563 2163643
8000 2163643 2048037 1837311 1648748 1520359 1443497 1396980 1365725 1335671 1307876 1293686 1294410
7989 1294410 1305309 1323685 1351550 1385608 1418875 1452257 1490253 1532249 1575203 1626069 1688751
7978 1688751 1766865 1858487 1959855 2070155 2183478 2301697 2434609 2596555 2805714 3045795
7968 3045795 3280954 3476049 3542310 3453910 3346119 3297700 3313222 3380781 3488950 3644114
7958 3644114 3856408 4135314 4493914 4933359 5469528 6151239 7054279 8275123 9923517
7949 9923517 12062203 14517683 16915528 18903664 19822625 19169779 18189384 17859992 18378340
7940 18378340 19793476 22139804 25475175 30020893 36208153 44760341 57273434 76090740
7932 76090740 103888874 142803674 190873325 238832319 277607852 300568452 288300444
7925 288300444 234136419 172549041 124716635 92024282 70628859 56715986 47466402
7918 47466402 41013764 36221536 32483575 29477209 26972913 25164171 24300085 24238559 24495694
7909 24495694 24580827 24012802 21939296 18698326 15748299 13536158 11911123 10674832 9712967
7900 9712967 8957377 8343958 7828207 7378815 6972629 6589287 6220820 5875716 5559177 5279627
7890 5279627 5030612 4808447 4604733 4414401 4223681 4031931 3848323 3672250 3504229 3352663
7880 3352663 3214818 3088456 2980699 2886884 2798872 2710717 2623545 2535098 2444413 2352823 2263936
7869 2263936 2180337 2101402 2024900 1957057 1892797 1828282 1762095 1692961 1626868 1563935 1507560
7858 1507560 1462197 1422410 1390132 1362950 1339444 1315539 1290325 1262390 1233285 1207131 1177676
7847 1177676 1144570 1109056 1073077 1035894 1001868 968969 935820 904884 876130 847601 821951
7836 821951 801585 785920 769973 750160 732946 718961 702149 686944 673762 661197 653761 647235
7824 647235 633934 621241 606017 590643 579816 574697 573632 572985 571951 572538 572869 563928 547066 526945
7810 526945 509876 496302 490309 493872 508876 532395 558795 580658 599599 620495 634787 630076
7798 630076 591046 531285 475545 437518 412740 394275 381920 373489 363411 351034 341608 335547
7786 335547 331484 329739 330057 327724 326359 324080 319645 310903 296005 280705 273295 272590 277917 283094
7772 283094 288752 282403 268447 254777 244087 236478 229313 226688 228373 233334 238021 242307 243120 247671
7758 247671 251155 251284 249443 239377 229122 219342 213023 215527 222253 230991 242265 248583 252293 259051
7744 259051 272873 289879 303269 314211 312554 278115 226745 180863 146168 126420 119190 116645
7732 116645 117485 120345 120828 122708 126153 128994 133533 141241 147400 148795 147305 140636 133492 126801 122183
7717 122183 121783 122947 127922 132802 135554 136533 133602 132497 132328 132356 132307 130388 128099 123729 116902 108764
7701 108764 99939 93030 93144 93700 92943 93734 95224 95772 98346 99991 98561 95865 95898 93913 91686 92934
7685 92934 94054 97954 105052 111111 114882 116919 115252 112079 117093 125516 128557 125973 124780 123051 116103
7670 116103 108931 105203 103828 102361 97101 89162 80704 73966 69031 62604 57147 53353 51184 52102 55103
7655 55103 56497 58642 63142 68161 72325 74081 71932 67193 62257 57236 52761 46255 42943 43446 45295
7640 45295 50497 54802 55568 50964 51459 52731 51794 53629 58275 65323 72084 77917 82062 83323 79593
7625 79593 70167 58952 40249 17444 749 -7804 -1374 7731 12387 15478 18924 22225 27544 33293
7611 33293 35011 36605 36111 38497 38459 37635 37293 35602 33450 30504 27525 23466 20074 18388 16971 18776
7595 18776 21278 23550 23794 21900 20772 20081 17204 15074 15215 16378 19092 22005 28165 34301 37055
7580 37055 38972 42544 45787 46530 46457 47504 47694 47865 45529 44314 44987 46207 47237 46937 45070 44217 43617
7563 43617 43056 43087 42938 42297 41602 42756 46741 52204 55004 59135 64522 70988 79119 88301 94181 99105
7547 99105 106519 111035 111126 114133 120932 129526 139510 157590 181618 215973 264081 333366 432728 564719
7533 564719 726556 912043 1099474 1256767 1353229 1357484 1268990 1111556 921737 733146
7523 733146 571082 446921 355215 291093 243097 209426 185615 173283 165664 158815 152309 147217
7511 147217 141135 134507 124586 111198 101697 92157 84723 78841 76216 71754 65582 62736 58010 54613
7497 54613 52331 53612 52826 50817 47847 43367 40054 37094 32767 29757 24458 21577 22110 25601 26669
7482 26669 28216 30008 31255 32593 32549 30421 29207 27086 26140 23392 20003 14644 10447 4204 -4352
7467 -4352 -13078 -14883 -15373 -14586 -9698 -1721 5461 11721 18693 21736 22020 19660 17021 16614 18224 19958
7451 19958 20690 20490 19822 20730 19563 18352 18460 19862 19265 18967 19051 19099 17378 16208 16951 16195 14010 15549
7433 15549 15464 15630 15066 14992 15431 16147 17876 16727 15379 14892 14727 15273 14800 13746 11566 11557 13779 15193
7415 15193 13768 13083 15826 16918 16581 16081 17079 16166 17334 19561 19263 19288 20152 18058 16404 14290 11799
7398 11799 10764 11766 11268 12066 8870 8373 11867 14377 17614 17158 16673 15815 12928 11997 11665 12259 14191
7381 14191 14872 11390 9567 8625 10055 10628 9087 9746 10523 9683 10149 11438 11197 12313 11132 9218 8059
7364 8059 5852 5223 6105 5439 4373 5513 4928 3981 3741 4559 6008 7515 7474 6813 8142 10454 10220 9235
7346 9235 11458 10288 7219 5770 6105 5721 4246 4484 2114 1110 2536 743 -531 812 5217 8102
7330 8102 9614 7956 6212 4227 4266 5044 7296 7540 6715 8070 7461 8592 9094 10201 9654 8782 8276
7313 8276 9247 8092 8951 8628 8894 8787 8292 7443 5476 5177 9377 12164 13369 9702 8808 12103 11968
7296 11968 9060 6913 6048 8508 8761 8861 11189 13313 13138 13458 12945 11401 8556 8896 9298 7813 4891
7279 4891 3039 2833 2319 3586 5721 6805 9225 10774 12654 11481 10323 8855 8970 7209 7408 8814
7263 8814 11819 14351 15143 12592 9235 8034 8077 10358 9749 8422 9365 9725 8500 9924 12177 10924
7247 10924 8937 10347 12525 14289 13255 10664 8850 8556 10237 12670 13251 10919 10815 12877 13417 11579
7231 11579 11709 12633 13006 13998 13448 8763 8554 12425 13477 10955 7126 7580 8732 8457 8652 9536 11038
7214 11038 12291 10845 9928 10582 11527 11192 9330 7975 6276 6142 7244 8787 11290 11739 9786 9967
7198 9967 10517 8678 9613 9699 8068 8810 8309 8239 10395 8445 5555 3649 5388 4693 4343 3258 3699 6127
7180 6127 6281 5397 3789 4031 5171 5312 3234 2102 2409 2889 6720 8059 7065 6489 7026 4815 3945
7163 3945 4888 3570 2983 3089 2660 2309 2700 2652 4736 7824 9279 11462 14392 14355 15533 16575 15273
7146 15273 16023 19467 19469 18292 19369 20276 19338 20555 25104 23129 22656 23716 21757 19174 16496 13596
7130 13596 12944 12585 10721 8864 9770 9495 6192 5978 6437 7011 9750 10687 11331 10675 11568 8468 7345
7113 7345 9043 9205 7309 7313 9334 12545 13356 14494 18832 24385 25324 23999 24286 24326 22587 22771 25836
7096 25836 28156 29239 28238 27070 25343 22800 18246 15758 12525 13094 15198 17398 17974 16925 17661
7081 17661 16607 18123 18601 18313 16624 16507 15842 15823 15533 17047 16751 12568 11568 8859 7939 9758 12196
7064 12196 13166 15929 17836 16384 16159 14189 15047 19569 20457 21534 23210 24610 24424 23700 22600 22752
7048 22752 20791 20603 20230 23465 26267 28699 29745 29653 29435 29772 30213 32794 38101 45044 50639 49912 47283
7031 47283 47588 49393 50915 54135 58056 63095 71284 79672 88632 104044 127432 160586 211413 280802
7017 280802 364319 454742 537485 596494 613866 598161 564163 535629 531891 553754 589306 614615
7005 614615 601722 548851 464581 366992 279584 213381 167803 139477 120627 106951 96715 89401
6993 89401 81692 75883 70156 63132 59924 58938 59797 57081 55922 55457 55693 52577 50247 46932 43719 41434
6977 41434 40054 40616 41531 41561 41273 40595 39366 38514 35934 33805 34958 34280 32868 31393 29186 28493 29818
6960 29818 31156 29664 28204 26701 26416 29508 33376 34892 34611 32655 36060 39287 41723 39961 36879
6945 36879 34215 31390 26731 23638 24549 25153 24717 20628 15612 10674 7540 7584 7479 9540 12407 15192
6929 15192 17079 21071 22509 21940 23179 24967 24823 25393 25378 23611 20951 19873 20433 19797 20212 21964 27896
6912 27896 31559 30611 32001 36039 40051 41094 41352 43135 46138 51574 57298 62615 72038 82816 97360
6897 97360 110038 123751 137996 148613 153825 153290 146817 143150 142070 143330 139160 130770 114543 95506
6883 95506 76626 60183 49808 42302 37176 34580 32871 35446 34634 32783 31479 31074 30134 30339 31427
6868 31427 29773 32457 33372 31682 32032 27624 23961 22789 20818 18928 14595 12636 11910 14336 15654
6853 15654 15790 14538 19329 24472 24423 21268 19687 19856 22130 26569 31023 32997 32737 33769 36592 38929
6837 38929 39840 40827 42951 44552 41450 35018 28542 19413 8885 835 -3215 -5098 -4387 -6185 -12189
6822 -12189 -19399 -26748 -29220 -25174 -19694 -10187 996 8271 10563 10863 14693 20133 23970 26406 27477
6807 27477 30397 33918 38889 44516 44202 47608 50206 55046 59803 64120 71590 76173 78904 80376 79921
6792 79921 78188 80168 83554 87716 93904 103844 118332 134454 150481 165160 178750 183660 177340
6779 177340 175909 181686 190831 204727 221214 237676 260632 293189 338205 405767 503640 651817
6767 651817 871379 1201207 1675141 2207592 2654998 2967375 2714208 1942244 1342684 972215
6757 972215 744754 604277 515462 460724 426251 403617 389743 383127 380616 380326 380752 385121 392212
6744 392212 398465 400035 402692 403941 395010 392679 393210 392788 385068 373585 372969 382518 396678 413660
6730 413660 431369 447199 452923 435275 415875 409268 412021 426789 448265 469703 497124 539036
6718 539036 600804 692951 810905 933461 1036054 1080479 1007286 882739 785176 717788 670012
6707 670012 640099 625833 621422 625112 635699 644297 648573 645440 640274 636171 636626 639232 646244 658017
6693 658017 673430 688576 706017 720869 741026 765722 790437 818783 849418 885205 927347 970068
6681 970068 1014954 1059412 1102801 1147995 1200930 1264456 1340355 1432948 1543528 1677087 1831065
6670 1831065 2002655 2196119 2447961 2795141 3268600 3886473 4621922 5401283 6134186 6651363
6660 6651363 6869680 6980197 7075181 7323017 7821909 8571300 9487674 10499766 11611643
6651 11611643 13069796 15243778 18616085 23819274 31520792 42313042 56369825 72831317
6643 72831317 89891900 104929678 114420233 118135804 115930768 110869445 108558630 110801844
6635 110801844 115561153 118429845 114936322 103063924 87076525 69231879 53202140
6628 53202140 40747066 31894558 26021543 22190473 19615921 17778067 16344606 15073071
6620 15073071 13895122 12752732 11730515 10929887 10347237 9889970 9422080 8815818 8063995
6611 8063995 7279572 6519602 5863138 5325885 4897042 4553066 4268512 4020110 3796102 3589751
6601 3589751 3396697 3216562 3047314 2890870 2748479 2620599 2505669 2402055 2304415 2213586
6591 2213586 2126030 2041460 1963515 1888205 1814388 1744631 1678937 1621919 1569400 1518273 1470185
6580 1470185 1421153 1373220 1326081 1278813 1229831 1180621 1136198 1096708 1058497 1022722 990024
6569 990024 960339 932832 906096 882663 858809 837889 816882 795158 774272 754706 740620 722853
6557 722853 701037 681489 662797 642082 621545 603126 584824 566292 549258 532829 516735 500789
6545 500789 484965 472452 461345 451682 443107 436624 425955 416661 409059 402117 395041 388074 382433
6532 382433 379061 375799 372981 367235 361093 353678 348004 344161 338209 333079 330132 330261 335162 343330 348950
6517 348950 350315 354089 356592 357256 355777 356362 350457 340495 334502 331703 328074 321421 310504 295113
6503 295113 277353 259200 244480 233365 227533 223935 223299 223104 219029 212602 206438 202335 195024 190491
6489 190491 190843 190050 188205 186909 186373 178248 169714 164057 159941 158700 157398 156533 154484 153786 153830 151009
6473 151009 148537 150207 149960 146790 146886 148873 148426 149713 151182 151989 154389 154544 153889 154543 156841 160070
6457 160070 166789 174997 180310 180358 173106 163492 151893 144404 139451 137081 135372 128071 120055 106389
6443 106389 90292 81469 78961 77189 79856 84109 83136 81275 79841 81219 81653 84346 87401 90830 90161
6428 90161 90906 91543 88522 83984 81821 84021 88251 88581 86397 85280 80855 77288 76518 73298 70822 68184
6412 68184 67466 67517 67065 64243 62335 61993 62451 63455 59684 57189 58229 60868 62129 62463 63770 68160
6396 68160 68228 64566 62964 62546 62824 67417 72471 77831 81276 83102 81724 81296 80940 79150 76641 75236
6380 75236 71408 67963 62662 58332 51473 46081 43789 43115 42614 42952 43151 41031 39679 36675 37357 40159
6364 40159 40886 40464 40555 42277 39665 37996 39192 38908 36283 34283 33760 35467 34002 33270 31173 28548
6348 28548 29388 32448 34160 37524 40905 41623 42651 43742 44783 46091 45002 39076 32853 28699 27024
6333 27024 28614 27048 22312 19185 13577 8199 7876 12248 14339 15748 18845 21680 20481 19717 21099
6318 21099 23110 23583 23947 23591 19939 18266 17971 16937 15549 16474 15133 14150 14052 11821 10966 12164 15356
6301 15356 16342 16612 16611 16123 17650 19745 25226 28384 28435 30907 31050 32728 36247 41672 49059 52712 53112
6284 53112 54224 55072 56030 53999 53943 57659 61695 66998 70414 76250 83711 92462 108980 135785 172568
6269 172568 225352 298017 387956 480126 556359 601104 603795 580314 542371 520780 529702 561662
6257 561662 599904 623977 600992 539135 450302 352756 268070 206659 162985 135350 119527 109244
6245 109244 99528 88507 80540 74797 70817 67862 63896 63209 62157 60646 56749 52294 45358 40153
6231 40153 38419 37359 37969 37328 36735 33174 31972 30254 27323 28590 28875 24869 24194 24787 23863 23971 22271
6214 22271 20794 20809 20365 19785 18881 19398 21353 20552 19661 20981 22272 21445 20025 18710 17121 16032 18009
6197 18009 18423 18314 18067 17799 15810 15227 16228 17235 17369 17231 18160 17297 15240 11140 6917 3440 2418
6180 2418 -286 -3964 -3976 -1595 616 1362 2528 2884 2878 2293 4233 6123 8879 9927 10333 12161 14533
6163 14533 16035 14823 15466 14794 15394 17330 15521 11462 10122 12782 12420 11727 11459 10652 10312 8905 10760
6146 10760 11452 13073 14585 14173 13128 13888 13744 13335 11378 8893 8191 10936 12059 11889 12974 16275
6130 16275 15560 13985 12281 10525 8320 10478 12632 13048 11957 10717 12823 9766 9553 10760 12368
6115 12368 11962 12610 13772 11434 8531 10412 8853 8268 8912 10667 11303 11214 11513 11328 11563 11828 11083 11708
6097 11708 11773 10074 8388 10182 12956 13004 12214 10992 10715 12228 11764 13201 13629 13966 14244 15050 17732
6080 17732 20952 17629 13617 10094 9822 11389 11591 11613 12435 13219 10954 10483 11910 12399 12150 10937 10182
6063 10182 4569 292 -1373 1581 5252 8211 7148 8434 9096 9197 6620 6713 7708 5636 6215 7011
6047 7011 5175 1743 3454 6236 7924 9549 8134 7435 5165 5086 3911 2825 4908 5717 5468 4763
6031 4763 5071 7017 6649 3630 3866 3809 4008 4249 4735 6043 7637 7489 6330 5760 5344 4820 3328 3925
6013 3925 6958 9013 8672 6589 2493 3355 5552 4570 3967 6038 9358 8726 6846 7549 7639 8908 8586
5996 8586 7871 6407 5420 5541 8839 10967 8772 8104 8132 8926 8464 8858 5789 3495 2873 3500 3605 3406
5978 3406 3132 5059 4650 5133 6541 8755 10598 12290 10317 5931 4773 6543 7790 9284 10266 8730
5962 8730 7879 7979 6157 5318 6414 5647 4479 4708 4489 5721 6348 5405 6592 7605 10415 10243 8750
5945 8750 8346 7956 4662 1981 3445 3424 2748 4258 4395 4570 3381 3853 3951 1804 1993 3028 3192 4229
5927 4229 5970 4808 7315 9490 9561 8859 8364 6529 5538 4607 4528 6644 6944 8367 10164 11399 9917
5910 9917 9457 10020 9959 10367 9608 6413 4658 5130 5140 5538 6271 6346 5549 5650 4761 5271 5080 1803 1771 958
5890 958 3311 4087 4499 4524 2992 3857 3745 5899 5939 5045 5113 6187 9366 10372 8547 8031 6235 5487
5872 5487 5736 4582 5048 5287 4952 5212 4602 3784 5036 7017 8167 8070 6378 5923 7958 9013 9619 9494
5854 9494 8420 9903 9982 8364 7711 7262 9087 6970 8608 11291 8739 6889 7457 7346 6815 7093 6883
5837 6883 8897 9447 9099 8242 6921 7144 9812 7160 3050 4248 6969 5971 4360 5035 5318 5025 4191
5820 4191 5222 6694 6616 6785 5769 4025 4692 7684 8265 6396 7265 6023 4862 4442 4238 5503 5265
5803 5265 1969 2332 1590 1004 2222 3759 4413 2955 1235 2668 4141 4096 2601 2358 306 884 1710
5786 1710 4435 7103 7795 7364 3404 2303 1699 1555 2957 3416 6086 5295 5177 5992 4929 4353 3216
5769 3216 2285 1739 3712 5085 4689 6143 6434 6702 5513 6056 6868 7288 7337 7303 4524 5208 4743 6998
5751 6998 7329 5839 5263 7339 8252 5912 5663 7338 8115 6933 7477 6817 6451 6910 5893 6921 4675
5734 4675 3704 3185 2478 2525 3563 4721 3215 1819 -1277 259 745 -865 -3825 -2043 1129 4615
5718 4615 5630 5666 7322 6964 5813 4493 4448 5372 4952 5184 4227 2261 2304 1951 2121 1961 2866 3603 3045
5699 3045 3090 6253 7160 5865 5647 6738 6805 8029 7387 7470 6994 6389 4410 6321 8190 8360 8436 7813 7679
5680 7679 4798 6064 7404 6804 4815 5985 7271 7093 3626 1228 529 -636 -1519 281 251 1650
5664 1650 1241 -1820 -524 2849 3384 2990 1510 1867 3541 3736 6160 5539 4345 5082 4463 2616 1732
5647 1732 1309 2950 1591 1516 3416 6935 8246 7100 6839 4781 2831 3011 4190 2326 153 1878
5631 1878 3234 535 799 1829 1296 219 -839 -1934 -358 65 897 1791 2693 3721 3830 3386 3906
5614 3906 4260 4759 3526 2817 6166 7583 8927 9054 7054 3404 1922 705 954 1501 472 3461
5598 3461 3953 3797 4750 4399 5957 6090 4465 3330 3939 3960 3035 3340 854 1920 2873 4819 7008 7024
5580 7024 5855 3886 2028 1822 3320 3930 4506 6855 6184 4434 3819 3573 2159 1635 1117 318 591
5563 591 2002 3082 1492 1230 399 -660 -1059 1069 2918 4380 924 -4185 -3915 -1547 300 2523
5547 2523 4678 7582 6416 3698 1814 2132 1798 154 -840 -1244 -584 -690 202 -48 657 3404 2711
5530 2711 -46 -1832 675 -696 -1599 219 1490 3965 6289 6661 4795 2926 2354 3707 3998 3724
5514 3724 1911 1218 2042 5376 6573 5559 5503 5792 6307 5920 3390 4973 6469 7724 3789 4950 8696
5497 8696 6398 2818 1899 1222 -632 1094 2988 1043 1047 4614 6550 5149 6353 5453 4737 3859 1394
5480 1394 -1812 -1653 -2549 -624 22 1456 1441 455 2313 2282 640 -1599 -2140 334 134 -2635 -2779 416
5462 416 1573 1837 2564 4497 7207 5978 4589 1314 382 300 586 542 2677 3767 3622 4297 5691 4594
5444 4594 5292 2005 -1783 -987 -375 -1040 356 1262 3120 2083 -2151 -1197 274 1624 4046 5860
5428 5860 2951 1294 1213 1090 1391 2682 4118 4329 2496 2873 4045 4122 3734 2401 213 1386 3086
5411 3086 2982 4790 4563 6574 5421 1285 1111 1898 592 539 2991 2601 1419 1562 1444 1765 2061 2414
5393 2414 2356 4645 4457 3137 3904 4770 2032 237 638 318 294 1753 2243 1616 1480 1642 2142 2330 1887
5374 1887 3082 1077 1202 -690 -1275 490 85 823 1004 -1129 -1682 -1584 -1862 394 135 343 1299 1974
5356 1974 4114 5175 5013 4014 1245 814 2433 4328 5014 4690 4341 2830 2252 1229 2473 3642 2868
5339 2868 1055 -644 -743 642 504 21 987 -1513 -3387 -4186 -4451 -3754 -2054 -814 134 845 1859
5322 1859 1534 1425 -346 -1471 -1022 -1369 -2749 -2126 -1151 -1592 -2063 -2655 -1422 881 2168 2910 1472
5305 1472 830 -396 -469 913 2075 1164 1436 1492 -890 -636 -1988 -1897 -693 3188 4253 5285 5081 3639
5287 3639 2901 3360 2582 4048 5084 5372 5293 4677 3467 353 1558 503 -703 152 -548 -1088 316
5270 316 -316 774 2949 2809 1230 47 -669 -1144 -754 -241 -1281 -2057 -2623 -2482 -872 425 390 592
5252 592 -726 -4144 -5229 -4696 -4807 -875 2220 1042 -2040 -3374 -2396 -1340 625 -662 767 3739
5236 3739 2433 1164 3139 2600 1191 730 -1159 -4056 -4209 478 -891 -3728 -1722 -1219 -3050 -2173
5220 -2173 -1947 -3130 -2944 -305 1761 2113 2641 1064 1508 1787 2977 3024 2366 -371 -1592 -101 -579
5203 -579 -1013 -391 -386 -2563 -4149 -4329 -3778 -3733 -2895 440 3037 -233 -549 -164 -1171 -1199 -2336 -3312 -737
5184 -737 -90 -733 -2688 -2530 -1888 -3276 -2913 -1750 -1710 -1891 254 -1384 -4322 -3203 -1711 -2487 -6933
5167 -6933 -6491 -2869 -2451 -1368 -1784 -1752 -2301 -973 -61 -1518 -3513 -3203 -2488 -1172 -695 -2197 -2566 -1223
5149 -1223 -90 -237 157 -713 538 21 -2890 -893 1623 -988 -1290 -1437 463 -4 1885 1378 -969
5132 -969 -947 3015 2758 2641 905 187 1629 1257 -1818 -956 1520 2697 3354 4439 1330 933 2494
5115 2494 1876 -464 -456 -2243 -3679 -2444 -634 643 878 -446 -1858 -1876 -2075 -3311 -4862 -4125 -2144
5098 -2144 -918 2014 2426 1392 -636 -1570 -682 2121 2037 754 1458 1692 1224 -2780 -3790 -2004 -659
5081 -659 -562 -954 -2118 -2640 -2171 -1363 199 900 2440 3128 2474 1266 465 -1860 -2392 -424 -15 -345
5063 -345 -2881 -2669 -1180 -3662 -3716 1302 3279 3212 4203 3571 1428 -1148 307 10 -1524 -3608 -4235
5046 -4235 -3560 -1652 -251 275 1899 2397 633 169 812 305 -164 -3340 -6551 -7310 -5249 -4016 -4722
5029 -4722 -4687 -2361 -1826 -1055 -626 -1304 -1414 -3517 -2423 -1734 -295 -133 1083 1625 -931 -2203 -138
5012 -138 1121 -1368 -1503 -161 -118 854 2452 -54 -1160 -3324 -3767 -3084 -2212 -1148 -2714 -5184 -4718
4995 -4718 -2802 -1033 -1206 -3851 -4268 -1302 114 -404 -2903 -3543 -1956 -1492 -1880 -1318 -306 1410 -817
4978 -817 -706 -1271 -609 -1202 -2459 -3512 -3894 -3577 -126 -1457 -2967 -5104 -5226 -3143 -3128 -3387 -4479 -3840
4960 -3840 -4093 -994 1325 85 -561 -2520 -2980 -2146 -4048 -5135 -2799 -693 -909 266 1588 916
4944 916 774 2540 4309 3945 4323 1928 -176 -365 -424 -673 -1720 -906 -368 -28 -2310 -5141 -5915 -3680
4926 -3680 -2286 -383 1094 2588 2607 1029 1222 581 419 845 1575 2361 1141 -99 -1324 -2087 1982
4909 1982 2505 33 490 -731 -602 -1182 -1810 -3431 -3589 -3981 -3814 -320 567 2291 4328 3449 831
4892 831 3890 5112 4797 2399 1324 831 410 748 2345 917 842 1894 1620 3736 2254 -1252 -2761
4875 -2761 -3342 -3362 -2942 -2790 -276 819 -1896 -4707 -5591 -2994 -2983 -1498 -15 38 -648 -376 1205 207
4857 207 1649 881 621 -39 -2354 -4291 -4909 -5079 -4114 -3317 -653 926 2123 948 -2553 -4901 -2456
4840 -2456 -2585 -2520 -2647 -1005 -1524 -2801 -1168 755 1510 245 1347 2466 3108 3255 976 -232 -2438
4823 -2438 -781 -1455 -3790 -2175 -108 -1408 -2220 -1349 -1514 -2386 -4446 -5264 -6223 -6156 -4545 -5382 -7239
4806 -7239 -6819 -6543 -6165 -6391 -5100 -3275 787 2872 2092 -1986 -2416 -2687 -2028 -2951 -3657 -5223 -6197 -4800
4788 -4800 -3240 -3875 -3170 -4492 -3540 -3154 -2736 -1367 -551 806 3300 1218 -550 -1190 -2007 -2469 -2273
4771 -2273 -1469 -799 -142 640 3035 3211 3806 3120 1292 295 1553 336 -1162 -1006 -1179 -3339 -3359 -2411
4753 -2411 -3309 -1604 572 313 197 110 83 779 -1584 -1873 -4277 -6152 -4123 -4751 -4379 -5515 -3701 -2140
4735 -2140 -3267 -2839 -2469 -1312 66 -194 -453 1565 660 -1074 -303 -17 -653 -367 -97 -1196 -2694
4718 -2694 -2887 387 721 -480 -1212 414 2284 1197 1510 1486 2623 789 -352 -541 453 -335 -110
4701 -110 0 -2786 -5464 -6854 -5141 -1935 -2034 -3599 -3757 -3960 -2542 -896 301 1539 1014 -2378 -2921
4684 -2921 -2668 -3829 -5643 -4654 -3059 -2006 -1569 -2195 -3564 -4439 -4094 -1766 481 -517 -1418 -1379 923
4667 923 733 -1782 -3894 -1995 -1843 -3207 -2570 -1824 -288 -2319 -1114 564 -1055 -2209 -2811 -1352
4651 -1352 -2605 -4046 -3130 61 -606 -4906 -4763 -1262 -2864 -5143 -5641 -6787 -6025 -4032 -3371 -3701 -5677
4634 -5677 -4941 -3340 -1331 446 -1096 -2526 -1425 -972 -424 699 751 -865 -1279 32 2374 2670 1743
4617 1743 2397 1829 661 -1848 -505 2721 5828 4861 4002 2406 -1043 -3332 -2226 -1376 562 406
4601 406 -2644 -1693 -2084 -5262 -4422 -2877 -1404 -1458 -3983 -4207 -3138 -2742 -2096 -1957 -2621 -359 901 2534
4583 2534 2244 1706 2077 1969 -735 -2120 -670 -831 -1147 673 -416 -2693 -11 939 442 184 -2767
4566 -2767 -2516 453 2133 2400 1393 -23 -1542 -1760 -2802 -3011 -2004 -494 88 -766 -1723 1063 -243
4549 -243 -2064 -1132 -682 -2183 -4257 -4277 -2085 -1232 -2612 -3047 -2194 -1712 -1564 -97 -838 -2058 -2387 -2749
4531 -2749 -1130 -413 -1848 -5191 -4737 -3688 -3192 -3183 -4277 -5042 -4533 -4128 -2729 -1634 -3276 -5144 -4223
4514 -4223 -743 36 -909 -2141 -1023 -386 740 -222 186 1468 2362 2308 1123 800 854 762 1468 645 -907
4495 -907 -1680 -2214 -911 -1074 117 -1695 -196 -1623 -4207 -4538 -3683 -4847 -6948 -6041 -3069 450 210
4478 210 -1489 -3260 -2589 -2077 -2654 -2496 -2089 -2191 -1334 956 614 1072 2805 1371 177 -1638 -190
4461 -190 2680 1692 -1715 -2417 -2028 -898 -647 -879 -1416 -1733 -927 -743 -1208 -2391 -1218 -1798 -2276 345
4443 345 -2073 -4565 -2797 -2163 -3291 -1973 -1836 -1983 -2152 -3398 -5129 -3966 -3752 -3908 -5263 -6266 -5961
4426 -5961 -5309 -5387 -6021 -4540 -4321 -5203 -6564 -5234 -3857 -1847 536 -1252 -3629 -1018 -1505 -2274 -2672
4409 -2672 -3272 -5786 -7638 -5715 -3186 -2480 -2774 -1533 -3053 -3770 -3265 -637 1180 -264 -1345 -1782
4393 -1782 -2288 -4258 -4742 -3356 -4304 -5933 -4095 -1783 -2401 -5286 -7959 -8377 -7457 -5398 -1811 -215
4377 -215 534 1549 2141 2201 657 1606 2916 1222 841 2109 230 321 2191 -70 -2313 -2707 -391
4360 -391 1837 -635 -2226 -217 1146 997 1690 1034 2663 1394 -904 -1416 -585 -3270 -3601 -1762 -1764
4343 -1764 -1018 -1936 -2676 -3509 -4268 -4629 -5956 -7271 -7931 -5833 -3927 -3746 -2189 -3201 -3776 -5681 -2920
4326 -2920 -1350 551 -460 -2269 -4498 -2345 -19 749 -465 -2190 -1319 -60 1663 2021 -417 1085
4310 1085 378 -2868 -1779 -1080 485 -131 -611 551 1129 -725 -3826 -3744 -2834 -2198 -2742 -3163 -3091 -3254
4292 -3254 1038 1926 574 -726 -2271 -4293 -3968 -4861 -3990 -1820 611 -535 -1805 -2411 -5892 -5643
4276 -5643 -2567 -1774 -2954 -619 2986 879 -3744 -5233 -5376 -3006 -2579 -3598 -4002 -1395 -1849 -5290
4260 -5290 -5364 -4451 -4183 -2389 -1480 -706 -228 469 2411 1210 899 1691 2006 -162 -2107 -2833 -3706 -2977
4242 -2977 -3804 -2712 -2002 -1397 -1396 -1343 -3035 -4446 -2546 1186 1915 3149 2247 -1177 -2103 -2011 -4714 -6931
4224 -6931 -5108 -1499 -1896 -4037 -4834 -4365 -3152 -2007 -1931 -609 806 1580 -728 -3075 -3240 -4507 -3095
4207 -3095 46 1174 2892 2260 790 -540 -4357 -6057 -6793 -6813 -5286 -2955 -1842 -985 -1591 -3168
4191 -3168 -4468 -3123 -813 -1547 -596 -2552 -6172 -4274 -3276 -3083 -1149 -420 -2001 -1177 299 -297 -1347
4174 -1347 -2057 -2261 -1580 -468 -646 -3314 -2082 204 -2008 -1324 1822 963 -431 -1952 -1975 -2154 -3872
4157 -3872 -3650 -4014 -3046 1635 2546 63 -2906 -841 -2004 -2740 -909 -1500 -3762 -4165 -4634 -5910 -4728
4140 -4728 -3943 -5870 -4514 -2476 -3352 -2709 -3393 -3112 -3651 -3792 -470 -1358 -4782 -6282 -5182 -3976 -5006
4123 -5006 -3501 -4420 -5123 -2923 -944 -1735 -2043 -3692 -5702 -6417 -4598 -4433 -3084 -1451 -583 227 873
4106 873 -2123 -5023 -4409 -3394 -4373 -4905 -2655 -1303 1998 2417 121 -453 733 1187 2046 2861 1731
4089 1731 -1653 -1492 647 1161 -245 1325 1094 -1929 -3031 -1886 -757 119 -226 207 350 -146 321
4072 321 -955 -1284 -2952 -2830 -2912 -557 -838 -162 -458 -2141 -5297 -4049 -1469 -1327 -1592 -1250 -1127 -2678
4054 -2678 -6215 -7879 -7899 -7864 -6219 -5487 -3894 -2570 -4309 -4050 -3552 -1934 -1676 -3141 -3183 -1745 454
4037 454 598 -3037 -3916 -4768 -5049 -4976 -5902 -4642 -1210 -1164 -2587 -2743 142 -91 36 -22 -2391 -3321 -3379
4018 -3379 -1846 -2210 -3937 -3147 -1660 342 925 151 -777 -713 -2163 -4018 -3725 -2557 -1839 -1571 -2012 -2711
4000 -2711 -2868 -3677 -4591 -1990 27 -1158 -2009 -3661 -2770 -1787 -743 90 673 404 -2468 -2767 -1427
3983 -1427 561 -1189 -2698 -3617 -789 1571 1924 -335 -1005 -3136 -1373 816 751 -826 547 1704
3967 1704 501 1154 1058 1072 -1620 -3534 -2501 -977 -1127 -4596 -5967 -5263 -3165 -1093 -974 -381 1174
3950 1174 1292 979 1021 -1587 -4571 -4056 -2369 -1927 -690 -610 -3776 -4411 -4453 -3624 -4153 -3450 -4487 -2580
3932 -2580 2015 1755 988 -982 -1369 -2204 -2208 -981 -1004 -238 -1342 -391 -318 -3013 -3609 -3899 -2190 -1659 -3689
3913 -3689 -6025 -6407 -4730 -3735 -2200 -907 -3660 -4263 -1165 76 -2588 -2928 -2510 -1313 -131 255
3897 255 -706 407 1706 1876 1936 2187 861 761 644 -553 -831 -1253 -4645 -3501 -2229 -1759 -532 2103
3879 2103 2818 757 -757 439 1364 766 -273 -1187 -2202 -3701 -3792 -2786 -3010 -2244 -1849 -1496 894
3862 894 1028 369 -1244 -1169 -1469 -2287 -2685 -2125 -2284 -1734 -2636 -3185 -3837 -3882 -483 -604 -2929 -824 2836
3843 2836 3329 -349 -3047 -2597 -971 -2455 -2864 -867 1614 3002 1972 2527 2026 2169 2167 -2481 -2774
3826 -2774 -821 -2764 -3589 -2830 -1200 -584 238 -1069 -2514 -3339 -3247 -3161 -4251 -6337 -5685 -3138 114
3809 114 250 183 388 -441 -3532 -4441 -3446 -2434 -1650 -2645 -2822 -3312 -488 518 220 -2213 -2942 -2755 -2750
3790 -2750 -3232 -2196 -2204 -2906 -3910 -4103 -3076 -1805 1371 1846 1275 -1 -805 1467 990 -2720 -3264 -2191
3772 -2191 -1764 -1401 -2691 -1960 -2249 -2361 -2685 -3217 -2967 -2295 -2196 -329 -4221 -5334 -1794 1960 1866 2046
3754 2046 -962 -3820 -5468 -6010 -7445 -8734 -8167 -4996 -2773 -2461 -2095 -3093 -3903 -2303 -973 -4845
3738 -4845 -6378 -8062 -3639 50 -704 -1753 -1252 -1120 -288 -687 -1379 -2750 -1882 -1846 -2383 -3739 -4370 -6428
3720 -6428 -6775 -3979 -2869 -2790 -3040 -4440 -4618 -3435 171 -1646 -2552 -3376 -649 -1826 -1127 -1532 -2790
3703 -2790 -1827 -793 2420 2106 866 -1079 -1757 -575 -2188 -3651 -5132 -1997 183 -1468 -2044 -2857
3687 -2857 -4026 -2786 -2151 -2196 -1393 -1841 -1434 -5 3020 1557 271 -3267 -6013 -7356 -4730 -374
3671 -374 3985 626 -3590 -4508 -5665 -3810 -2828 -289 1367 280 1259 3920 3541 1391 577 879 1212
3654 1212 -434 -1761 -1557 -1710 -2265 -2563 -5235 -3566 -1622 -3174 -3510 -2643 -3896 -3729 -3735 -3852 -3263 -3327
3636 -3327 -3747 -1753 -636 461 84 -578 -2012 -1600 -1424 -1639 -1355 742 975 -1336 -3847 -3081 775
3619 775 1514 127 1180 615 327 1439 2703 1095 -1898 -3336 -3628 -4203 -2896 -2171 -1439 889 2213
3602 2213 4203 4588 2089 -1467 -4772 -3235 -1851 -1939 -2307 -634 -493 -2422 -2861 -3115 304 1560 1607
3585 1607 1498 2206 837 -1673 -3263 -3004 -3631 -4248 -2938 307 2646 3134 277 -2012 -2117 -1802 -1247
3568 -1247 -2054 -4574 -5456 -5776 -3126 -1787 -730 -732 -1489 42 2361 2598 715 -303 -1546 -1408 1367
3551 1367 1055 -1093 -2064 -2177 -1446 -3031 -2568 -3620 -1760 -2731 -1288 -2095 -3626 -3399 -1235 -230 -603
3534 -603 -2809 -3778 -919 402 136 1659 -483 -3315 -2707 -3236 -3739 -2242 -1030 -1835 -325 1124 1526
3517 1526 3 463 -635 -2874 -3765 -4280 -5301 -5940 -6234 -5921 -5043 -4436 -4796 -4072 -2909 -300 2440
3500 2440 2192 1237 1811 3460 388 -1309 -1738 -263 492 925 -2278 -2150 -4157 -3466 -3503 -3314 -3035 -5279
3482 -5279 -3206 -3893 -8057 -7643 -6263 -5408 -4129 -2780 -903 -364 -1307 -3633 -3413 -3335 -2730 -3946 -3617
3465 -3617 -2048 -2075 -2099 -2595 -5188 -5396 -5503 -2911 -2251 -746 1003 4566 5886 5935 4242 4034 2152 -247
3447 -247 -2423 -3397 -2540 -2550 315 1009 -3116 -2828 -3088 -2008 -549 216 -1239 -2600 -2160 -1909 -2402 -3048
3429 -3048 -3913 -2607 -2013 -1547 -1390 -100 -3390 -3537 -3937 -3564 -3095 -4589 -4202 -4158 -3658 -3593 -4535 -4500 -1136
3410 -1136 340 -496 -351 -2699 -3889 -2848 -2920 -1455 -1257 -2585 -4369 -1586 2683 4682 3274 653
3394 653 -1339 -4681 -6876 -5179 -2823 -3852 -3506 -1326 -3359 -3670 -2389 -48 1432 874 163 1151
3378 1151 3302 1859 288 -131 -2712 -4698 -5212 -4895 -6727 -7841 -3313 -1832 -3740 -2540 -4259 -3931
3362 -3931 -2414 705 3352 2494 2405 1757 2379 1478 -2553 -5832 -5041 -2858 -4706 -6341 -6733 -4733 -299
3345 -299 1969 3405 148 -2240 -223 649 -1658 -1859 -2885 -2330 218 20 277 37 -1530 -1619 -388
3328 -388 -754 -1461 -2871 -2541 -1387 -2710 -1507 -789 594 -1263 -2942 -2700 -1864 -2431 -1931 -2909 -2603 -2226
3310 -2226 -381 -564 -3047 -4514 -4154 -4327 -7318 -8335 -7873 -5712 -6302 -6671 -4806 -4447 -4284 -3277 -3552
3293 -3552 -2680 -382 -176 -1583 -3646 -2938 -2336 472 191 -692 -198 -1634 -3278 -2392 -956 -1329 -5767
3276 -5767 -4513 -3558 -2885 -962 1597 1102 -1524 -2531 -3345 -4952 -5978 -4189 -281 2942 620 -287
3260 -287 1410 1021 1174 2886 262 -2132 -302 -252 -776 -437 -337 -1356 -3092 -2994 -1614 -1958 -1401 -1950
3242 -1950 -2552 -4248 -6338 -6192 -4870 -5153 -3633 -4149 -3173 -3450 -2773 -2717 -887 -1254 204 -221 371 -595
3224 -595 -1451 -1782 -3076 -966 -1387 -2541 -1020 -2252 -3641 14 1979 -1410 -972 -460 1123 2955
3208 2955 1409 1245 2380 -189 -158 1667 2145 -630 -1019 -474 1421 -935 -3182 -5434 -5311 -2085 -165
3191 -165 608 1328 -1265 -1794 -96 -735 -830 982 1810 290 -2427 -3230 -1883 1188 1205 475 -674 -924
3173 -924 -1602 -1946 -691 -2880 -1697 -1851 -939 -2228 -4032 -2728 -3022 -5964 -7827 -7052 -6184 -5484 -3464
3156 -3464 -2909 -3997 -5154 -2120 370 -2102 -3730 -2971 -3053 -4067 -3836 -2868 -519 2472 3025 1202 278
3139 278 1206 -154 -1903 -4533 -6052 -6478 -5552 -3669 -2029 -1660 79 1404 -949 -3507 -4496 -2366
3123 -2366 -2125 -2473 -544 -501 -593 189 -1842 -3428 -2306 -1618 -608 -693 -3753 -4221 -2174 -3584 -3172 -1846
3105 -1846 1899 1841 -278 -2824 -4554 -3020 -1433 -2673 -5411 -4268 -5097 -3224 -2557 -2821 -4720 -5642
3089 -5642 -7177 -6103 -5936 -5374 -2513 -2603 -3552 -2210 -2049 -3083 -3877 -3946 -1624 903 1163 -2601 -3710
3072 -3710 -2457 1834 828 -1289 -2002 -1878 -3152 -2307 -50 588 2014 1635 784 232 -2504 -3728 -2582
3055 -2582 -3046 -1751 -1160 -2817 -1975 -2784 -5518 -5490 -5423 -7378 -4813 -1864 -1152 -1472 -1808 -1286 -1249 -1740 -2767
3036 -2767 -3331 -4136 -3016 -2306 -2227 -3073 -1333 1853 1485 -1241 -2482 -1713 -712 1927 719 1974 2475
3019 2475 -191 -2082 -645 790 -810 -361 955 1808 3124 1926 1348 1692 -695 -2712 -3705 -4263
3003 -4263 -3901 -2455 -496 817 145 -3749 -4445 -4142 -1837 -3543 -2552 -1338 -1088 -659 -1279 -2212 -3160
2986 -3160 -2414 -941 -581 -855 -1745 -2448 -3609 -4251 -2222 -1968 -2527 -2344 -1997 -1790 -4098 -4726 -4126 -5736
2968 -5736 -5859 -1247 427 123 -563 590 1175 -1879 -1978 -3874 -2765 -5501 -5816 -4242 -2497 -136 -1141
2951 -1141 -2226 -2759 -4198 -4184 -2470 1110 769 436 -872 -774 117 2299 1171 -317 -1656 -1113 -695
2934 -695 1045 -454 -66 2155 2998 2275 1661 1964 185 -415 202 -1075 -1370 -927 327 2732 778
2917 778 -1529 -1567 -1592 -1005 434 -3373 -4228 -4713 -6995 -6492 -6967 -7660 -5070 -1347 2188 816 -1008 -147
2899 -147 855 4891 3155 3118 1369 476 -436 -3516 -3605 -457 579 883 -1276 -2298 -3046 -5377 -5777
2882 -5777 -6326 -4371 -3913 -3323 -4477 -6351 -4400 -1650 -2614 -2287 -587 -2795 -4005 -4094 -3248 -5423 -5160
2865 -5160 -4077 -5335 -2880 -2332 -2651 -5227 -3981 -1267 -2157 -4319 -4283 -2388 -1881 -1705 -1700 -1141 -2528 -4457
2847 -4457 -2682 -467 233 -1145 -3941 -5692 -2131 -1870 -2609 -12 2500 384 -1665 -260 -1514 -4745
2831 -4745 -4137 -3730 -5177 -8769 -7400 -3077 -3165 -1576 670 3046 3060 1640 1170 939 -763 -2626 -2767
2814 -2767 -2559 -3187 -4128 -5692 -4711 -4438 -5158 -5603 -4884 -1987 -798 -2489 -2940 -3644 -2830 -643 -163 2892
2796 2892 4049 -218 -1702 -1613 -2459 -3710 -3750 -2088 -2410 -2607 -4184 -3584 -309 -1031 -2614 -3634 -3053
2779 -3053 -2033 1054 2023 -943 -794 -1203 -188 2428 1319 327 -343 -1120 -574 806 1508 2187 2485
2762 2485 3431 4122 1785 -1192 -676 545 807 -945 -1688 -2819 -5202 -6052 -5493 -4161 -3610 -3508 -1722
2745 -1722 -107 -481 -331 -85 815 -894 1110 3227 -686 -325 538 579 -1329 -2893 -4116 -4729 -4844
2728 -4844 -4085 -3611 -4078 -3006 -1286 -2555 -4382 -5232 -5440 -4046 -3572 -620 435 -220 -102 1255 353
2711 353 -1403 -1952 -3231 -4704 -5167 -6751 -3662 -1382 -2599 -2170 246 -1160 -781 1679 2486 4380
2695 4380 3931 2721 -237 -1989 -815 -1724 -2539 -1749 1092 569 -1927 -801 -647 -1663 -4233 -4205 -1937
2678 -1937 -2309 -1201 -1980 -2405 -582 241 -1928 -3901 -2047 -436 -1045 1355 1412 555 312 49 -794 -1513
2660 -1513 678 383 2071 -284 -4050 -2497 -327 -251 775 492 -1359 -845 133 -315 -2373 -5728 -4649
2643 -4649 -2008 -4134 -1988 343 2549 600 215 2893 4970 2396 -1213 -930 -584 -1438 -1883 -2777
2627 -2777 -2186 -1518 -642 -621 -752 -942 -1032 -1132 11 1056 -285 -3754 -2442 -2382 -2048 -117 1427 3483
2609 3483 1139 1278 4969 5626 4469 2412 -632 -2835 -3558 -2926 -4020 -4476 -2449 752 2037 1059
2593 1059 -118 726 1700 2324 1461 -295 -488 -703 -2491 -1455 1748 3830 772 -1349 -2021 493 428
2576 428 -64 1591 1166 -1780 -3598 -3889 -4093 -4412 -3846 -1082 -218 -1543 -3499 -3647 -1030 -1986 -2812 38
2558 38 2554 3400 -283 -3864 -3314 -4422 -3632 -3108 -2405 -1125 -1907 -1304 -1121 -1219 -1020 710 1227 -333
2540 -333 -2151 -3790 -4805 -4643 -1970 335 1442 2370 -14 -844 -28 1462 1190 -1030 -786 -885 -2484
2523 -2484 -4012 -2810 -1305 -2412 -609 872 880 2332 1663 -102 -787 -2127 379 2115 1028 406
2507 406 1779 1214 -870 -3939 -1385 638 1374 754 -2244 -448 -1092 -2742 -2126 1205 5286 3407
2491 3407 -661 -3250 -4127 -2566 -1849 -1577 228 1196 1447 1661 630 479 -1039 168 -464 -1317 -1684
2474 -1684 -1913 -1482 1238 1940 -693 -2023 -1588 -791 108 -590 -1793 -3234 -3099 -4292 -3375 -3395 -3634 470
2456 470 2014 -861 -2034 -2095 -1211 -40 915 148 236 -428 -2232 -3225 -2063 -595 -519 -2003 -4505 -4156
2438 -4156 -2518 -1733 -3541 -2020 -11 -41 -1504 -711 295 -2313 -1355 -1160 -1257 1009 334 -903 -873 17
2420 17 1614 3134 1725 -182 -1068 -930 -464 139 -9 6 -60 -2119 -3537 -3139 -2414 -1862 -848 -2766
2402 -2766 -2783 -2692 -2226 -758 -1834 -993 585 959 432 -73 1681 2334 -1098 -1878 -193 204 1565 -536
2384 -536 -1053 -909 442 2091 175 -2229 -2653 31 1127 455 -983 -1091 -1849 -2210 -1322 -907 -999 686
2366 686 1318 211 2115 4446 3627 2773 3089 1665 2510 1774 -1914 -4310 -5321 -3015 828 3519 1346
2349 1346 -1949 -5296 -5200 -3508 -3656 -3775 -3291 -81 2529 3494 447 -1183 -674 -1133 318 673 1510
2332 1510 -1219 -2879 -3130 -1829 -1371 -2070 -2196 -2130 -2945 -5322 -5424 -4370 -1757 -1600 -2909 -2709 -1842 -652
2314 -652 310 359 779 989 -826 -2198 -1543 -2459 -1789 -1147 668 -31 -387 -1867 -1768 -1859 -847 1597 1563
2295 1563 -256 -1605 -639 -2069 -1825 -565 899 -480 -1963 -2149 297 -199 -884 4 -724 -1407 -324
2278 -324 318 -1178 -665 -1211 737 546 -268 1392 915 515 18 -1063 -2140 -665 130 349 -266 485
2260 485 1069 -241 -1875 -1792 804 3091 2528 608 -163 -2185 -3583 -1691 -1999 -2311 -892 -116 -1829
2243 -1829 -2373 1028 2637 38 -4125 -4427 -2886 -2596 -1094 -1330 -2288 -1647 -1483 1277 1045 1129 2773
2226 2773 2925 1855 1040 643 746 1344 2711 2461 -137 848 4843 5302 5197 6248 6387 2959 3276 2216
2208 2216 1308 1021 2192 3006 3087 2120 1874 4153 5200 6269 5260 565 -1656 -2747 -939 -831 -291
2191 -291 -388 967 -1170 -2279 -3250 -2928 -1994 148 646 -94 773 -716 -744 1372 3224 3036 1732 -795
2173 -795 -1642 -614 1402 4120 4189 1615 -1111 -1201 882 3150 1790 -596 -3340 -2792 -1865 -1262 -1992
2156 -1992 -1666 270 4043 6698 5593 2838 1690 1882 1737 -124 -2038 762 2666 3759 1961 2517
2140 2517 3669 3574 1435 304 -386 -289 51 3052 4140 3165 3004 2942 1353 1668 3201 4415 2508 2249
2122 2249 1884 -951 4 -565 354 1727 1512 858 342 -1985 -2802 -1638 546 -1751 -4440 -5480 -3666
2105 -3666 -1319 -1393 -763 -797 -2329 -3855 -2873 -149 2494 2865 3406 3849 3555 2913 2862 2716 2582 425 142
2086 142 768 1349 516 -1060 102 2120 2223 1290 183 -488 -581 1440 2881 2954 3252 2959 4848 4622
2068 4622 -227 -1341 -753 -3158 -4732 -2594 -1443 -201 -329 187 528 -1756 -833 858 2203 2918
2052 2918 2783 2058 1882 838 -1988 1097 3598 1872 -932 -2627 -1427 531 -307 -1606 -993 -1614
2036 -1614 -3352 -2633 -2847 -2507 -2905 -1908 -1776 -3755 -3960 -2176 -2153 -3380 -4399 -2364 93 235 -1631
2019 -1631 -3809 -2091 -3769 -6838 -2684 -101 -1518 177 -488 -2079 -1750 -1647 -3524 -2558 -1622 -1848
2003 -1848 -2700 -2743 -2004 -391 3198 4465 6183 7268 6674 3975 3911 2378 1446 595 1800 875 1337 1515
1985 1515 1022 -71 -769 81 190 -1244 -2647 204 2478 2208 2541 4024 1601 354 1490 1705 -320
1968 -320 -207 1102 488 -739 490 -177 -1469 -957 383 1495 950 1426 3617 1996 1141 2412 2667
1951 2667 2442 1383 -593 -610 -1391 -1321 -1492 -3786 -726 803 3259 5992 5944 4890 3484 2420 3938
1934 3938 4864 4356 3236 926 188 2968 3205 1817 2459 2432 1242 -219 -1246 -3697 -3427 -3272 -3417
1917 -3417 -2548 -3463 101 1312 2878 4172 2522 3234 3862 2121 2696 3975 2952 1466 141 -934
1901 -934 -1160 -4207 -3676 392 1417 -83 -23 1003 175 -547 1566 2465 1854 1101 584 216 2040 539
1883 539 -120 493 670 835 2198 -378 -2672 -3241 -1792 -1449 -2629 -2746 -2031 -1483 -689 -730 -2849 -2603
1865 -2603 -1800 -2637 -1676 -2153 1599 1369 -160 749 3110 4994 2893 2612 1535 -450 -2681 -1689 1086
1848 1086 1887 -772 -241 578 505 234 -1996 -4760 -2920 -1145 -1273 -403 -2437 -4308 -2534 -2744 -2708 -955
1830 -955 -1284 -288 1352 -456 -5249 -4817 -6447 -6073 -6277 -5551 -4799 -3811 -3158 -1588 -2357 -2150 -3250 -2649
1812 -2649 -1067 -3080 -2089 -1465 -1697 -725 -755 -2367 -1637 721 1787 -70 -2187 -1526 -1118 -31 -3228
1795 -3228 -3955 -2111 -573 1476 1499 -26 584 599 2994 5001 5045 2246 2399 1630 3136 1793 -301
1778 -301 -1808 -2105 400 2490 2135 1843 1156 -1813 -4843 -5094 -3257 -3268 -4310 -4610 -4870 -4905 -3033 -211
1760 -211 699 236 -1332 -1112 948 2412 924 -524 -668 1246 3383 5085 2366 225 -621 -993 826
1743 826 1635 180 565 3686 5064 3313 3616 4130 961 -1593 -2082 1147 499 -586 406 1685 1352
1726 1352 4149 6353 4584 3013 2713 2759 527 1679 2507 1505 -786 -984 -3024 -3662 -1678 -1333 514
1709 514 2180 1738 1269 2161 4457 6034 5190 2909 2822 2451 1247 1653 1457 166 -172 -3776 -6126 -1808
1691 -1808 690 -1451 1698 3968 3810 2298 2837 5076 3581 2150 1055 1563 1483 2083 1226 130 871
1674 871 2696 2848 393 -111 -1277 700 1860 3678 3238 1992 278 950 1303 1359 1993 3484 3484 3928
1656 3928 4019 3011 2498 490 -587 -346 -1224 990 1189 -1596 -2524 -2201 -2217 -1927 142 2381 1162 35
1638 35 647 -1000 -1720 1399 3000 1070 588 110 604 955 1125 -496 -2996 -3427 -1804 -2087 -1701 -2461
1620 -2461 -2465 -2140 -266 1623 3742 2804 -263 7 946 1501 1155 -1582 -976 -1893 -1803 -1546 -733 373 1205
1601 1205 501 278 -300 -818 -773 311 -47 682 2855 3036 1197 2036 5639 8250 6250 5204 3490
1584 3490 992 -116 804 315 4150 4166 1221 -1295 -2468 -3112 -1301 -362 -1070 -907 -1278 -184 -909
1567 -909 -794 145 160 -235 -365 -1464 -1514 -1348 2335 1995 25 32 -1277 1861 5557 6074 5293 5168 2632
1548 2632 2872 3240 2951 -330 269 -87 1599 3884 2222 655 56 1771 3727 2093 3365 4507
1532 4507 1983 1444 -1335 39 2446 4036 2699 264 -1017 1321 1948 301 228 -1258 -2483 -1945
1516 -1945 -1264 -1149 607 2238 866 1479 4291 3471 451 840 -703 -2733 -1238 754 1644 -219
1500 -219 878 1588 -61 -2001 -1109 1240 2346 2749 3536 3824 1481 2441 5530 3622 -32 -151 353
1483 353 145 1336 1493 2836 2537 2581 2198 1721 3105 -1331 -2903 -3650 -4245 -3679 -2115 1087 2545 2270
1465 2270 965 -949 590 2634 1229 20 1966 3164 4269 4290 5411 5449 2986 3101 3308 2017
1449 2017 2814 4218 5120 5998 5176 4565 3658 1823 1075 3607 4938 4530 3545 2593 3243 4300 5962 3125
1431 3125 1772 790 -7 1740 885 1737 2506 2776 2863 2346 1077 838 1461 1084 2074 4501 5444 4185
1413 4185 2179 877 1229 722 952 3125 2538 906 3113 4204 2628 1656 2451 2821 6198 5372 3324
1396 3324 2804 2084 2458 3234 2440 2140 1437 1293 2633 2742 149 -836 97 -1202 -2791 -2760 -3697 -3661 -1643
1377 -1643 -492 198 1510 -755 577 -135 -3004 -2699 -779 121 -1310 -2788 -1737 1069 -334 -919
1361 -919 -413 -1101 517 1011 1768 1993 2728 2633 3134 3263 4615 3242 2606 2928 926 -910 1147 2156
1343 2156 1892 1396 1491 -159 -1595 -565 -335 -2058 -2132 -556 2218 2118 768 1879 2111 1184 -536
1326 -536 -430 1870 944 267 1342 1253 3499 3714 3240 3371 688 -2346 -326 2131 3205 1572 2074
1309 2074 2448 336 -1513 -1907 -2917 -3643 -1165 -719 -2386 -1120 1017 1468 461 -664 -404 1078
1293 1078 2449 3659 4575 3642 3858 3086 3029 1581 254 314 3024 -463 -2624 -585 2149 4168 3720
1276 3720 2714 4259 6380 4336 2100 1615 1613 152 2804 5692 5336 3313 4440 1937 127 -1575
1260 -1575 -2682 -2583 -2409 -3708 -3104 -3507 -2519 -345 1397 1125 779 -1611 -2463 -3263 -2046 938 1007 1496
1242 1496 104 594 483 870 151 -438 -1010 292 1156 4002 5781 3435 -1422 -2004 752 2148 2875
1225 2875 -574 529 2327 3385 2656 1655 -1145 -1241 63 1705 1797 1197 2257 5580 6568 4767 4903
1208 4903 3824 3770 3172 3483 1671 3031 5228 4824 3775 4454 5329 4057 3622 1140 -1096 -481 -551 -495
1190 -495 -499 187 -1253 188 419 1067 -659 760 4045 4039 2469 1026 915 -670 -845 1033 2306 3548
1172 3548 3623 2560 2572 2399 2197 1156 162 -2094 -3004 217 1435 -150 -332 464 1278 1536 2062 1746
1154 1746 2015 2632 3337 6325 7625 5254 4458 3694 564 -1520 -959 -755 -2309 -3211 -2150 1252 2154
1137 2154 622 -1423 -577 -37 427 465 -1205 -315 -443 -2939 -3529 -753 379 -813 -691 -1180 148
1120 148 -2089 31 1106 2369 1479 2077 2708 -16 -83 1414 762 651 -2561 -2046 -1738 -883 355 1899
1102 1899 4027 1983 1664 5231 2916 543 -875 819 3329 4062 3356 -239 473 4135 4356 3173
1086 3173 2686 2971 3104 4827 6980 5809 4766 2600 140 537 488 -919 -231 -336 -881 -237 -320 -668
1068 -668 3793 3126 1988 2077 465 908 284 -371 -2560 -1600 922 1964 -179 -1085 1841 1142 -309
1051 -309 -409 224 849 1198 611 922 -341 1383 600 -390 -580 332 893 -1135 -4158 -6045 -4614 -1851
1033 -1851 432 2030 819 -77 -344 979 2605 2250 -585 1477 1889 786 1703 2313 3202 2425 -85
1016 -85 652 2387 2066 115 -546 -505 169 832 3973 4354 3810 3353 3683 3811 3860 3486 3876 2578 2776 2145
996 2145 1506 715 5078 6415 4591 2528 2269 2024 535 -696 1942 2223 2381 1973 827 -825 -465
979 -465 2057 4384 2842 2398 2265 2712 4457 1513 2358 4348 5574 4077 2946 1214 482 1911 3958
962 3958 4041 3422 3277 3774 4820 3461 2263 738 -1412 -123 2913 2283 1278 -182 1099 2528 3379
945 3379 3089 862 1197 1515 426 713 380 1307 980 1790 1788 1983 1190 -244 322 2326 1925 3472 4038
926 4038 2656 3247 3377 1509 2427 1021 1922 5896 5883 1537 1038 1119 1466 2282 1564 1879 3893 3624 3944
907 3944 3547 1779 1436 3168 1321 2209 2553 1977 845 3872 3726 4677 3755 3774 3551 4473 6680 7225
889 7225 7936 5262 4530 5646 5507 3264 2729 5295 9464 8574 5841 5722 4335 91 1090 12484 16625
872 16625 9894 6632 9041 4570 -3023 -7071 -1214 7597 6748 2451 290 -2304 -1631 -2708 -1418
857 -1418 380 -339 1701 4265 2998 3688 3243 2024 3363 5775 6554 4862 2906 685 592 54 722
840 722 1837 1460 1461 2712 3985 3941 4900 4079 2114 -727 -460 -449 -440 -1852 -2079 -242 -680 -1261 392 413
820 413 1375 3998 3702 5414 8493 8803 8763 9323 8445 8936 6379 6467 6190 3740 3601 5651 6321 5099 4450
801 4450 4106 5059 6301 7720 5818 4852 5682 4276 5288 6585 6558 6144 6809 7338 6702 5531 4302 3434
783 3434 1583 3925 4439 6738 7283 6392 5576 5682 3924 2554 1788 807 582 1118 371 1246 1943 3845
765 3845 2551 1923 3857 6341 7278 6008 5014 5182 5335 5231 5474 3616 792 1003 2491 1478 531
748 531 3000 4280 4297 4100 3436 3729 5325 7214 7503 6303 5541 6027 5255 4466 4646 4191 4631 5066 5958
729 5958 7701 6593 5915 3472 1493 2516 4765 7848 7918 6527 6869 5186 6851 9009 8669 6062
713 6062 3175 4445 5083 5919 6647 7493 6735 4743 3694 2161 2757 3521 4773 5153 5366 6939 3955
696 3955 2350 4106 6063 5059 4946 5805 5428 7820 8317 6962 6952 7153 4524 2521 2089 1661 2629 3441
678 3441 5717 7982 7305 7160 8663 11228 10135 7186 5438 4126 5164 6054 5625 4380 2601 2273
662 2273 3502 2763 3962 3057 3668 6439 6750 8371 9491 7178 4405 2929 1751 1157 3860 4148 5737
645 5737 6558 6663 7472 7383 5945 5059 6184 6192 4915 4089 4898 8165 8434 5339 6275 7625 5320 4461 1615
626 1615 1480 2860 5574 3931 4696 5174 4376 5723 7129 6009 6951 6024 6235 8813 9110 8589 6238
609 6238 7107 8376 7430 4984 5357 6565 6659 6678 5114 5684 7320 7821 7585 7610 5977 5627 4769 2559 2522
590 2522 3014 3064 6436 7144 9098 7798 4318 4322 6376 5616 6348 7402 7587 7850 6409 5028 3675 1419
572 1419 1853 2028 2865 5486 6308 7683 9959 7443 5193 6595 8389 7420 7393 7435 7012 6368 4937 6143
554 6143 6801 5166 5695 3800 3954 6803 6617 6370 5608 2821 1664 2465 5875 10483 13653 13254 11921
537 11921 8772 6429 2760 1997 2315 3947 6275 7151 5540 6110 6896 7953 7351 8259 8762 8313 6635
520 6635 4150 3952 4169 2802 3798 4358 5811 6396 5713 4928 5606 6528 4681 6803 8675 7842 8367 8255
502 8255 6746 4868 3365 1544 1062 3319 5336 5029 3911 4112 3609 2017 2539 5006 6700 7448 8820
485 8820 9205 6927 6384 5291 6032 7148 9957 7492 6387 8229 7131 6995 7947 4244 3650 3757 3170
468 3170 4274 4439 2670 2049 2587 3494 6114 6059 7162 7912 4560 2145 2240 4167 6301 4989 4886 2724
450 2724 394 1977 2717 2074 2225 3641 4169 4723 5939 5183 4465 2986 2913 4232 3866 1765 5324 3409
432 3409 1511 2281 3799 3651 3747 3212 908 1181 2013 3481 5346 5697 5077 3934 3035 3595 5575 6534
414 6534 6120 5696 8573 10070 8272 5854 6643 5681 4228 2751 2381 3692 6265 6688 5751 2445 1404
397 1404 2319 3945 4406 4169 4248 5062 9406 11784 10484 8152 6570 6989 5750 5968 6725 7076 5733 6236
379 6236 8134 9140 5835 2501 1739 2396 6550 7853 5761 4363 4950 5881 6150 4332 4852 3327 5126
362 5126 7540 6560 7256 7422 5924 5660 3511 3262 2842 2741 2105 2627 3522 1799 1605 3642 3488 1510
344 1510 3667 3991 3320 4132 5151 4690 4929 4341 4574 6030 7392 9003 9314 7662 7964 5950 5701 6714
326 6714 8470 10408 9760 8330 5959 5880 7675 7464 7906 9140 8872 9591 8097 3759 3384 4964 6516
309 6516 8499 8330 7733 7838 5882 5859 7105 6905 7483 6020 5531 7143 6312 6162 6757 5599 4190 3350
291 3350 5070 7443 7612 6869 6348 6084 6074 5543 5113 5823 5995 6234 5948 6721 8987 9391 9722 8804 8187
272 8187 6932 5609 6140 7336 7879 8318 7945 8908 8244 4923 4944 4409 2975 2911 2229 4561 6649 7045
254 7045 4609 3509 4834 5592 5912 5492 4869 4997 7455 7924 6949 6193 6721 5787 3716 6211 4852 3314
236 3314 872 1307 2097 3483 5818 4616 3453 2528 2919 2482 2438 5089 7030 8065 8953 9951 8786
219 8786 7790 6930 6726 5871 6156 5959 5253 3363 2951 3555 4987 4483 4616 4989 5184 6295 6278 5906 6263
200 6263 5730 7621 9835 12102 10961 6153 3855 6164 7309 7582 7014 7416 9078 8705 7892 9021 10424
183 10424 9435 8252 7715 5223 5830 6475 6122 6612 6199 4759 3422 2334 2923 5598 6503 5667 6405 6849
165 6849 5014 5135 7050 7538 7915 7951 8844 7483 7943 7550 6694 5697 5600 4941 5175 5305 4836 5333 5889 5717
145 5717 6385 7506 6784 8601 10220 8177 6161 6230 6017 6117 7292 7023 4775 2580 1089 713 1889
128 1889 1161 1198 3082 2746 3629 5220 5920 5653 4400 4471 4498 6560 7870 6998 6837 7696 6146 5660 6883
109 6883 6848 5817 4662 4708 4082 3197 2656 2892 3037 4612 5825 6059 5786 6444 6959 6084 4963 4389 5289
90 5289 6500 6890 5331 4244 3122 1306 3300 4893 5164 6213 5710 5265 4630 6614 7617 7074 6988
73 6988 6983 6559 5736 5462 6010 6878 6195 6935 6908 4986 4425 5176 5925 5028 5266 5434 3952 3389 3047 2634 1221
52 1221 2486 4826 5548 5688 5115 6329 6392 6469 7043 6566 5508 6469 6457 6919 5717 3226 4083 7242 9893
33 9893 9764 8942 7577 5447 4865 4590 5389 5230 5816 7176 6532 6580 5582 5323 6231 5982 8587 10445 9675
14 9675 8517 6350 6768 5793 5081 5950 6442 7282 7280 7337 7589 5564 4373 5266
0 5266
$$ Imaginary data points
##PAGE= N=2
##DATA TABLE= (X++(I..I)), XYDATA
32767 19882 19823 19686 20557 22784 23342 25695 26343 28174 30443 30066 30899 31411 30818 30077 29533 30446 30276 31976
32749 31976 33535 33698 33126 32697 33138 36570 37172 35486 36903 37826 38014 35823 35199 35778 37117 37540 39271
32732 39271 40390 43056 44607 46913 47254 46326 46085 45060 46389 48320 48372 48172 49601 50059 48847 49178
32716 49178 50755 52365 52802 52961 52719 51875 53650 56292 57255 56742 56646 56968 58454 59076 58994 60085 61319
32699 61319 59888 59946 60633 62141 63417 63050 64067 64592 64264 64412 66451 68397 68278 68794 68224 66479 67142
32682 67142 67629 68586 70487 71437 71701 72549 72931 72846 74235 76383 76097 77736 79623 78302 76793 77917 79361
32665 79361 81762 82414 80417 79508 80564 82808 85981 87326 87757 86306 87458 86531 86300 86855 87553 87283
32649 87283 87899 87758 88212 88300 88336 90895 92709 94863 95267 93885 94843 96374 95981 95933 95111 96427 97856 98270
32631 98270 98081 96671 98263 100245 101608 101717 101096 102609 105185 102979 103308 104592 105109 105774 106237 105700
32615 105700 105336 107689 109550 110516 111249 111719 113055 112830 112537 110327 111992 113845 113549 112034 111675 112390
32599 112390 112337 112473 112747 113630 114102 114377 115218 116669 117831 119385 120362 120188 120938 121852 121941 121001 120722 122746
32581 122746 122937 122388 125835 126844 126799 125664 125403 124587 126033 128340 129234 129279 128400 127740 128541 129425 129772 130186
32563 130186 131133 131373 131255 130841 130813 132839 133362 133680 131882 130567 132758 134791 134982 135167 136137 136045 136376 139339
32545 139339 141464 140918 141616 142382 141565 140993 143236 144162 141744 140421 143437 144653 143103 144017 145272 146069
32529 146069 145846 144944 145365 146386 146346 146550 145815 146079 146646 147323 147861 149051 150206 150851 149533 149913 150587 149154
32511 149154 150023 152298 152503 153007 152019 151473 152203 153529 155211 156980 157917 157698 155389 154956 156840 157430 157234
32494 157234 158767 160044 157288 156463 158546 160917 160233 159700 161330 160229 159895 161896 161408 160261 159924 161317
32478 161317 160601 160205 161555 162509 164510 165253 164035 163573 163899 164255 165531 163397 163443 165870 167761 169182
32462 169182 168677 166583 165483 167360 168302 168543 168948 170109 169673 167834 167486 168346 169822 170851 171035 170583
32446 170583 167278 167208 169335 170212 172113 172802 174904 173762 170216 169624 173022 175413 175756 175386 177406 177876
32430 177876 177231 176262 175515 176621 177916 178681 178779 179445 180729 178014 177782 179012 180371 182228 182178 182388 181881
32413 181881 182999 183310 182712 183954 181775 181509 182041 183126 185379 183454 179434 181340 182795 184303 185666
32398 185666 185765 186662 185242 183440 181735 182946 184504 186493 187226 186854 187951 188610 189901 189871 189524 188174
32382 188174 186853 187050 187172 188707 189695 188131 185906 185305 186410 190282 192527 192075 193193 192303 192408 192657
32366 192657 193005 193117 193852 194020 192798 193955 193869 190757 188317 192082 196615 195752 192122 192359 195487 199640
32350 199640 198466 197058 196231 195517 195095 194453 193184 194110 194246 192941 194270 194098 194820 197088 197455 196725 197071
32333 197071 197373 197792 195671 193193 192230 194991 194959 196177 196946 197004 195090 195338 196977 197295 198731 198770 195726
32316 195726 194455 195445 197079 197956 198855 197550 199149 198806 199236 198921 198567 199282 200566 200044 202485 203371 201943
32299 201943 201196 200550 200020 200826 201509 201282 202141 203526 202102 198846 198927 199868 199390 198396 199704 198985 200191
32282 200191 199089 198658 199047 199802 200784 199673 200943 205133 204365 201946 202965 204943 203413 200955 200643 201681
32266 201681 203078 204307 203940 205420 206601 209449 210650 209889 208629 204880 202765 204660 206234 206947 205665
32251 205665 204347 205834 205777 205609 207869 207481 208679 209964 208660 208829 208009 210555 212085 208097 204169 204541
32235 204541 204030 203925 205598 208913 209500 209107 208917 209152 206679 205996 207029 206753 208573 207303 205819 204822
32219 204822 206433 208769 208874 209816 211216 212196 210449 209122 207952 208693 208741 207648 205152 206883 208285 208577
32203 208577 208919 211053 210298 209312 208411 207928 207122 207476 208057 209836 210774 209425 208551 208217 208727 208732 208385 208510
32185 208510 207513 207881 208085 209638 210752 211402 212314 212416 210933 208857 208351 209931 211066 208661 206753 209173
32169 209173 208852 209749 212040 211756 210470 209307 209892 210839 212247 213665 213592 213610 212959 214364 213454 211623 211259
32152 211259 209346 209172 209516 208036 210882 214163 213151 209989 210618 209886 209692 210307 211641 211423 210055 209371
32136 209371 211778 213629 211032 210096 212646 212767 211936 210312 208606 208995 210238 210579 208580 206710 207519 209284
32120 209284 208045 208422 206509 206503 207487 208572 211337 211631 211397 211648 210987 210530 209045 209791 211023 212436 213492
32103 213492 212957 213148 213069 213490 212545 214509 214590 215548 215453 213638 212091 208805 207883 208831 210024 211321 215139
32086 215139 213680 212345 212116 209899 207297 209779 211802 211006 212441 213332 213308 213682 215648 216411 216915 217851
32070 217851 216211 215322 214023 211277 210331 212037 213204 213708 213716 214637 215484 213690 210937 211751 215247 216714
32054 216714 217723 215463 216172 216304 212117 213123 214359 214154 212600 211408 212024 213525 215051 214726 212349
32039 212349 213031 214052 214614 215227 212318 211541 213874 214902 216771 217619 215325 213802 213124 214333 215655 215032
32023 215032 214341 212003 212260 210535 210024 210494 210522 214082 213513 213509 214175 216250 214016 213220 213197 213766 213309 214392
32005 214392 214442 214322 213845 211881 211975 212211 213710 212131 211514 213090 214462 215597 215155 215990 215071 213180 211531
31988 211531 212621 212970 212421 214063 214485 213311 214072 212644 213287 214604 213760 214865 215944 217711 218828 218529
31972 218529 215673 212010 212366 214024 216455 217093 213955 213679 214469 217047 216850 215600 215336 215292 215802 215092 215496
31955 215496 213623 211947 210918 210590 213734 214540 214829 215945 214657 211328 213154 215047 215783 218121 218416
31940 218416 215634 215857 216924 216377 217635 218431 218253 215333 212016 211952 214497 216271 213175 213097 215240 215760
31924 215760 213427 212264 213115 213093 214428 214486 213909 215494 216161 217013 218427 218865 218038 216062 214703 213278 213848
31907 213848 213564 214872 214733 216028 215653 215519 215569 214818 214350 217422 214225 213717 215653 216160 216613 217070 214675
31890 214675 215760 217777 217126 214373 212701 212206 212506 211685 212449 216188 217465 219336 217628 215418 211844
31875 211844 212583 213479 212827 213355 214699 215497 215903 212587 212523 213327 210593 211217 214233 214183 214438 214182 214638 215522
31857 215522 214065 216227 218168 217915 219524 217574 216161 215679 214567 214230 213738 212996 212401 214001 213384 213783
31841 213783 214219 213707 213767 214294 214237 214489 215069 216319 217488 217588 216208 214322 215058 215008 212247 212044 215247 215464
31823 215464 215188 214981 213408 213310 216511 219907 221787 221804 219430 215613 214059 212937 215112 214166 213533 214979
31807 214979 214116 213007 213784 212853 210416 209628 211473 214128 215780 214691 213775 216282 218480 221136 220865 218522
31791 218522 217725 215615 215423 216626 215550 212872 211648 213752 213066 213541 216744 216085 215379 216139 215602 215120
31775 215120 214699 215832 216333 216685 218312 219780 218577 217808 218300 215694 215028 216011 217990 217211 217564 216905 213410
31758 213410 213585 214739 214929 215915 217412 216543 216090 217014 217763 217322 215260 214363 214901 214903 215242 214932 214879 217121
31740 217121 217393 214365 215417 216379 218690 221791 222716 221971 220786 220509 218829 216919 215823 219843 221689
31725 221689 221279 223539 222492 221347 220347 221248 220638 218508 218743 218706 216946 216469 215320 213536 215191 217163
31709 217163 218421 220885 221154 218185 217488 219490 218937 216424 214547 212518 210142 210766 213873 216429 217552
31694 217552 218160 220785 221539 219727 218422 217769 219573 220961 221243 219006 218494 217603 214893 215588 217656 215643
31678 215643 216689 217294 217883 217957 219937 220662 219955 220421 218986 217474 219295 218914 219312 217558 216282 216521 215794
31661 215794 215405 216340 214627 216753 217345 218242 218668 217217 216115 216824 217874 218465 220273 221109 220726 222517
31645 222517 223972 223916 223179 223079 221769 221539 220618 221267 219337 218942 216197 215407 215922 217893 220516 217836 215114
31628 215114 213429 212973 215037 215758 214707 216439 217533 217487 217529 219046 221695 220031 218889 220299 220056 220882
31612 220882 221061 222112 219832 219514 220026 219499 218715 220797 221338 221095 221743 222148 220404 218735 216016 214885
31596 214885 215710 217817 220281 219822 217351 215416 214657 214241 214403 215295 216343 216475 217452 216605 216251 216393 214465
31579 214465 213724 215831 216341 217663 217241 219524 219071 218296 217914 218830 217424 216446 215561 216764 217993 216694
31563 216694 216480 216373 219288 219339 220771 222213 221124 222451 220511 220791 222706 220225 219706 219547 215465 214307
31547 214307 217493 220457 221701 220144 219248 219784 221350 221328 220271 218306 217660 218125 218630 219239 220140 220595 220775
31530 220775 219798 219834 218732 216302 217409 219420 219646 219958 218452 217832 217528 220419 220888 219944 217460 216478 217209
31513 217209 217332 217158 217031 218042 219106 218738 218847 217824 218033 219821 218490 217659 219290 219296 222252 222366 221945
31496 221945 220602 220356 219941 217868 216551 216840 216927 216129 216614 216359 219210 218902 218307 218160 219391 219918 220104
31479 220104 218631 217505 218531 222797 222320 221726 221426 220921 219613 219113 219337 221419 222290 220858 220229 222019
31463 222019 221469 215796 214905 218715 219116 219312 219479 218276 219074 216623 215947 215786 216652 218473 220284 219065
31447 219065 217785 216043 216583 216554 215831 216714 218104 219598 217520 216794 217642 219965 222327 223554 222665 221748
31431 221748 220428 219437 218891 222164 222788 222560 221718 220263 219080 219615 221922 221034 219236 219102 219439 219199 220043
31414 220043 219606 222534 223670 225131 223377 220616 219466 219703 220511 218894 220650 220931 222555 222115 224061
31399 224061 221696 221316 221773 220598 218707 218559 218878 219018 219998 220955 222052 221194 221955 221896 221505 220324 219021
31382 219021 221646 221960 219979 218387 219949 222193 222800 221015 219133 218832 220274 219391 216233 216197 216884 217832
31366 217832 221380 223263 224355 220062 217435 219313 219317 218608 217713 220919 222018 221832 221402 220488 218572 219545
31350 219545 224755 226411 224097 220758 222066 221641 219866 219442 219802 219562 220162 220561 221164 221408 220942 220785 222608
31333 222608 224205 223256 223015 220819 220250 219402 219518 219173 218935 219913 220783 219292 218021 219197 221494 219424
31317 219424 218197 219019 221482 221891 221431 222422 222494 222749 221578 221135 223062 222897 220698 219049 219789 218210 218229
31300 218229 221694 223256 222325 224835 225969 224996 227171 225655 224784 224557 222453 220948 222797 224202 223373
31285 223373 223486 221540 219903 221116 221912 220003 219648 221691 221822 223391 224374 222502 221779 221660 219874 219812
31269 219812 220555 218248 217717 218593 219475 217225 219460 221115 222398 221610 220081 218672 218239 218725 220979 222030
31253 222030 223431 222812 225279 225269 224824 224623 225613 222331 222426 224512 225335 223381 219511 216612 217027 219939 220300
31236 220300 220017 222526 224060 226360 226271 225293 224921 224781 224179 225101 224485 224965 226848 228914 227507 226422 227795
31219 227795 225837 224598 223996 223326 224645 225423 224441 223883 225412 227245 226827 226474 225654 225943 227937 226703
31203 226703 225091 223819 223745 225366 225307 224629 222812 221809 223281 223109 222965 223966 223179 220442 218821 218926
31187 218926 221781 220875 221131 223275 222959 221852 222943 223531 223877 224410 226229 226157 227334 227954 225177 222868
31171 222868 221036 220317 221197 221275 220713 219578 219122 218133 219154 218026 219561 222688 223470 225059 227268 227573
31155 227573 225340 223272 223594 225173 226161 228343 228148 225024 222138 219400 221972 224426 223270 222370 222978
31140 222978 223854 224824 224473 223542 225778 225259 224327 225453 225315 224497 225091 224977 225802 227176 225672 227044 227354
31123 227354 226133 224327 224474 225651 224977 222608 222021 222248 222070 220354 221079 222443 223332 224996 226620 228573
31107 228573 227852 226852 228303 228927 226785 226263 225026 222807 225032 227503 226126 222920 224227 224107 225294
31092 225294 226669 225098 225312 223779 224061 224219 222264 219693 217921 217946 218595 221560 222035 221333 223517 224797
31076 224797 225754 225117 223907 224443 225425 228257 227355 226677 225837 223949 221948 223149 224729 225929 225195 224787
31060 224787 225310 224468 223246 224066 225241 226580 226960 227160 227294 226560 225316 224310 225896 226785 225396 224857
31044 224857 227073 225450 225858 225173 220663 219908 220873 223160 223190 219870 221455 224795 226479 226108 225553 223834
31028 223834 219877 217439 218507 220673 219862 220669 222428 224923 223616 222062 221375 220998 222132 225091 225520
31013 225520 224754 222930 223023 222428 223331 222521 224342 225035 226100 224279 222253 223493 222427 223250 221745 221187
30997 221187 222674 223157 224029 221897 223516 224284 223197 222336 224379 224483 224994 225298 227250 225983 225960 227328
30981 227328 226562 225722 227688 229326 228183 225862 223427 222873 223632 221824 222154 223215 225463 226391 227073 227953
30965 227953 227969 227516 227822 224499 223656 226803 228843 229095 229289 228241 227107 227679 227840 228054 227641 226242 224815
30948 224815 223727 226729 228269 227930 227717 227424 226086 223435 225766 227486 227279 224897 223855 224608 227038
30933 227038 228253 228263 228062 228854 228584 227797 227964 228227 228580 227337 227414 228483 228808 229253 228638 226531 228040 227760
30915 227760 226691 226674 226878 225666 225296 225469 227609 230599 230573 227020 226560 228003 228524 228175 230211 230735 230040
30898 230040 226333 226409 227960 226262 225938 226222 226931 224236 223622 222393 222516 225136 227222 227289 227987 228276 224850
30881 224850 225536 226498 225566 225736 226385 227071 226854 229383 230573 229337 226806 227323 225703 224637 222943 223333
30865 223333 222608 224703 227673 227018 225524 224847 226749 226470 223793 226562 228720 225663 224700 225497 228051 228625
30849 228625 226050 223992 223691 223391 227007 228885 229525 230063 228243 225460 224728 225102 225007 225076 225947 224885 225363
30832 225363 225033 225010 226285 227379 225840 225635 227005 229509 229017 229402 228457 227923 228574 227319 227193 226172 226101
30815 226101 228721 231238 231351 229218 227764 229531 230068 228768 227294 229787 229018 228297 228575 228588 228659 228659 228681 231098
30797 231098 230917 228064 227293 228126 227719 228956 230889 229539 229143 229545 227383 226679 227246 229043 229580 231600
30781 231600 230037 225918 225496 227043 227090 226276 226026 227127 225407 225627 226766 228954 228788 228383 228731 228028 227018
30764 227018 225530 227724 228310 224288 221897 222392 225480 226439 226791 229142 229359 230126 230012 232188 232922 231418
30748 231418 227912 226467 226797 226969 226521 225522 225641 225984 226762 227510 226544 224663 225202 226384 225718 225362 226889
30731 226889 229636 228302 224626 224088 224664 224809 227438 229472 229577 229997 230573 230724 230398 229356 229811 233840
30715 233840 233510 229651 227158 227444 226356 226509 228279 229128 227654 226612 229472 230362 228421 228786 228454 227604
30699 227604 229096 229859 228966 226606 228211 230827 232836 232188 230312 229999 231442 231128 230243 229248 229009 231576
30683 231576 232412 231694 231938 229096 228049 226938 228447 230439 232355 232467 232495 230351 228409 230763 231109 229440
30667 229440 225646 225155 229507 231418 231950 231207 230694 227473 227204 227940 226285 228326 231683 232081 229367 228130
30651 228130 225449 226018 227549 230085 230094 232064 233156 231109 229600 230023 229976 228685 228647 229785 230777 230910 229011
30634 229011 228336 228076 227521 228817 229963 231116 233469 234631 232624 227555 225459 227419 231013 232331 230619
30619 230619 231175 231416 230533 232035 230177 228390 228255 229338 233054 233760 231845 231505 231656 232022 231494 229758
30603 229758 229651 230180 231938 231751 233661 235398 236298 235311 232736 231849 231693 231784 229772 230038 231271 229503 233042
30586 233042 234873 231636 231396 230512 231974 231515 228001 228985 231819 231508 231439 232021 231180 232165 235801 235693 235604
30569 235604 235174 233503 229723 229024 228646 226872 226728 226560 227635 230190 231681 232310 229248 228588 228627 231114
30553 231114 234033 234822 233487 232117 231382 230855 231089 231412 233266 233476 232799 234449 234461 233912 231944 231836 230888
30536 230888 229180 225467 225503 228159 227698 227756 229681 229345 228766 228397 229223 229654 230568 233375 235270 235537 234977
30519 234977 235779 234748 233809 234618 232422 230244 228843 230045 231899 231018 232637 236048 235145 232723 232576 232651
30503 232651 232499 232681 232697 232909 234238 235039 233474 232633 232396 233737 233517 232373 230396 229560 229998 231339 230825
30486 230825 230685 231558 231455 230638 229860 229124 229419 231045 234985 235213 234471 235626 235099 233447 233864 233372 231341
30469 231341 232132 235693 236050 233813 231398 230290 230355 228925 227473 229103 230457 231373 233011 234804 235326 234128
30453 234128 235122 236266 236398 238026 237736 236562 235082 234934 235809 234452 233055 232359 234261 234527 233289 232014
30437 232014 231079 230578 230133 230750 231830 232641 232624 231504 230808 228748 227602 226175 226497 228326 229426 229026 231194
30420 231194 233285 230540 228934 231305 233753 235142 233324 232224 233936 234468 233904 234244 234942 235512 235889 235114
30404 235114 233667 231530 231607 231193 231669 234654 235660 232086 231114 234590 236395 235794 234156 233172 236508 237619
30388 237619 236674 234412 234330 233484 233856 231376 230149 231163 234100 236018 237493 236538 232431 229933 230692 232336
30372 232336 234144 234310 232284 231670 233179 233074 231744 231869 235662 235382 231749 230328 232458 232066 230800 230708
30356 230708 230856 233278 234553 234066 232693 232987 234769 236154 234287 232847 232608 230332 229757 232512 236301
30341 236301 235540 233674 232549 232018 231838 232434 230918 231456 231822 234258 232532 233548 235052 235422 234774 232599
30325 232599 231995 231226 232124 232223 232468 233048 234416 231314 230763 230580 230228 230984 233454 232919 232543 233580 234135 236005
30307 236005 238393 236980 235471 237698 238151 236660 235343 236242 235636 234375 236145 235098 232960 232587 233366
30292 233366 232332 231939 233919 234642 230920 232057 234561 237056 239433 238825 237660 238208 238774 235388 235251 237274
30276 237274 237371 237508 237430 235634 235102 235721 237869 236646 234248 233874 234006 233151 231826 232877 232999 232640 229401
30259 229401 229137 229608 232107 233244 232239 233241 233314 233645 235870 236076 237513 239367 238490 237159 236637 236601 237749
30242 237749 235598 234944 235746 234591 234279 235001 235783 236378 235641 232826 228687 230351 233105 235801 237634 237980
30226 237980 238946 239547 242187 243097 240936 239145 238057 236748 236025 236308 236426 235539 234941 234912 232949 233937 235680
30209 235680 235737 238476 240500 238925 238359 239373 238452 235589 234804 238350 239408 238127 236800 235535 235470 235076
30193 235076 236556 238363 240136 237131 236873 239875 241655 241485 238929 236732 235765 233286 232674 233519 234021 235126
30177 235126 235617 234751 236596 235043 232762 233272 233123 236953 236764 234088 235531 237158 237074 236669 236359 237152 236070
30160 236070 234693 235353 233905 232556 233533 234845 237287 237000 235269 234595 236074 235223 233876 231684 231459 231457
30144 231457 233546 233246 235183 236272 237857 241544 242420 240968 238613 236293 235794 234596 236042 239201 238577
30129 238577 238630 235744 235930 234545 233881 236033 233580 233196 234807 232850 232350 235545 237429 238251 237908 236641
30113 236641 236433 236487 236837 239579 239008 236573 237675 240009 239985 241659 241921 238262 236927 236415 236002 235867 239169
30096 239169 239644 239375 238674 238106 236944 236520 240242 240981 240632 239396 238936 240639 240049 237973 238020 236550 236942
30079 236942 237558 235990 234098 234951 234056 234829 234435 234774 236607 237428 236043 236262 236654 237149 237886 239758 239602
30062 239602 238872 238486 237866 239720 242613 242793 239742 237566 234791 236214 236688 236748 236579 235352 239183 241463
30046 241463 241503 239536 238887 238296 238048 238291 238125 237983 238581 239654 239531 235807 233886 236301 237752 234938 236310
30029 236310 238812 240238 237454 236497 235724 237054 235619 235090 234732 235081 236689 235030 232483 232543 231612 230431
30013 230431 231546 233643 236259 236684 235450 234460 236526 237269 238152 237688 236350 236461 235971 238058 239702 238612
29997 238612 238650 241390 240955 239694 240255 241505 240924 239499 239457 241753 240630 239502 238136 237046 236802 234916
29981 234916 236783 236542 238356 239702 240413 242372 239405 236782 235231 235614 236537 235887 236520 236355 238272 239000
29965 239000 238029 235302 236658 238714 238808 237144 237313 238173 237057 237959 240339 240122 240218 238869 237439 235004
29949 235004 234498 236105 237119 237339 238969 238247 237519 239312 240465 239531 238268 240172 239819 238118 239394 243395
29933 243395 243518 243052 240193 238364 239104 240377 239012 237281 236958 238517 239235 239890 240093 238164 238226 240388
29917 240388 239938 238740 237991 239750 239852 238336 236328 236408 237327 238779 239625 239449 239872 236820 237296 239674 235238
29900 235238 235176 238071 239868 237809 236919 237535 237486 239004 240749 240382 238387 238737 241768 242097 242828 242503 240553
29883 240553 240260 240666 241159 240282 239123 241992 245214 246107 245397 242071 238082 235590 236738 236937 237142 239326
29867 239326 239905 237980 237885 237865 239688 239646 240301 240365 240289 238385 238309 236207 239576 239660 237356 237350 238943 243640 244855
29848 244855 243416 242987 245096 243216 241684 241231 238909 237902 237940 238638 238573 240016 238479 238361 238244 240567
29832 240567 242040 239968 239542 238766 242227 245347 243985 241255 239637 242805 242535 241610 242578 242916 242461 244577
29816 244577 243278 242055 241706 242646 242324 242100 243537 244772 242287 242155 244431 245794 244802 244652 244047 243882
29800 243882 243150 242442 243252 241913 241831 243848 244435 245694 242515 240494 241073 239736 240958 242996 244155 242780
29784 242780 242664 243157 243958 244024 242885 241891 243557 243045 243007 244625 243785 243237 244014 243201 242816 242973 243313 243513
29766 243513 242467 243381 242439 242097 243271 243966 246044 245416 243609 243291 244072 244458 242358 242752 245575 245451 244184
29749 244184 241199 241050 240807 242076 245151 247170 248033 246251 242137 241928 245189 245899 244616 242951 240439
29734 240439 239823 241530 242570 242584 239706 238270 239230 239394 240119 242337 241665 242373 243450 243540 244337 245488 244589
29717 244589 243608 243497 243139 245386 243803 240541 241177 242428 243877 242507 242587 242633 242390 242622 243427 242238 243535
29700 243535 243604 242923 242858 243000 240275 240437 240916 241344 240504 239892 240583 240624 241157 242328 242114 242857 242871 243081 243331
29681 243331 242431 243075 247132 245453 242587 242417 242816 242363 240593 239778 241803 241448 240045 239592 240657 241083
29665 241083 240514 241992 243091 244899 242847 242442 242043 242266 242552 244005 242675 243242 244824 244922 244940 244667 245587
29648 245587 245674 245493 244131 242836 243793 245825 246181 243898 243975 244547 246009 244628 241615 242684 243939 246691
29632 246691 248192 247192 246033 245541 244479 244037 244383 244537 243328 241671 242947 243820 244010 244174 243088 240900
29616 240900 242630 242920 241324 243585 244485 245081 243361 242321 242848 243281 245167 247434 246794 244275 244879 245845
29600 245845 245222 244848 245392 246927 244792 242562 241536 241839 242922 243332 242978 244003 244928 246503 245479 245802
29584 245802 247346 246701 244862 241180 239276 238654 240924 242506 242652 244949 244821 243766 246673 248254 248535
29569 248535 247992 245395 243998 243921 242067 238444 236909 238476 242691 245912 247672 247071 243744 243621 243416 243596
29553 243596 244909 246072 245961 244846 244743 243114 241219 239211 238767 240551 240828 241660 242198 242871 242152 241533
29537 241533 242418 245427 246338 244902 243248 243944 244170 243889 244625 243630 242920 240558 242689 243568 244628 244346 242745
29520 242745 243314 242879 243114 244533 242899 244496 246719 246786 244189 243378 246223 246668 244345 247271 249765 248357
29504 248357 247713 245507 242203 242539 244188 245569 246298 247343 245757 243712 242544 241517 238859 241978 244915
29489 244915 245179 245929 245430 243889 241780 242023 243282 243594 243678 242576 244771 244645 242909 242827 243330 244438 246914
29472 246914 246895 244733 244123 244596 245269 246106 247584 245979 244375 241254 240056 239948 240194 244431 247364 249333
29456 249333 249451 246553 245731 247825 247857 246810 245251 243054 242935 245355 245353 247990 249174 247169 246046 246278
29440 246278 244724 244508 246358 248194 246689 247589 247197 246455 246181 247562 248328 248014 249610 251106 246787 243986
29424 243986 245392 247741 247632 248271 248686 248468 247820 246415 246252 246400 245936 245192 243631 245115 250079 248551
29408 248551 246531 247526 247334 245606 243777 244515 246329 246843 247548 249013 246705 242110 241771 244674 246770 246077
29392 246077 245948 247856 246739 245613 249933 252754 251404 251285 249266 247258 245323 244778 246957 247311 250452
29377 250452 251548 251777 252969 252352 249525 247264 246414 246826 247591 248777 250281 249565 247977 247802 246829 245153
29361 245153 242786 241156 241279 241497 242601 245098 247674 246352 245862 247527 246093 245366 247932 249375 247817
29346 247817 246141 245114 244918 247644 249692 248980 248236 248704 247851 248369 249446 248833 249688 250215 246668 246380 246121
29329 246121 245070 245233 245439 246856 248815 251148 250674 250590 250737 251626 248679 247280 249505 252617 253569 253886
29313 253886 253810 253285 251561 250106 250485 251303 251559 252228 252558 251431 249552 249800 249865 250748 250249 248425 247625 248531
29295 248531 248801 248188 247342 246240 248145 249357 247880 247687 246202 243554 244231 242761 242507 243139 244399 248870
29279 248870 251210 250902 249117 248007 246004 247697 250675 250850 251769 251781 251649 250684 250917 248363 248888 252267
29263 252267 252438 251196 250659 250748 249032 246980 246091 246273 247599 249921 249209 248287 248209 248834 248407 248273 248516 246849
29245 246849 248662 249504 247260 245752 246012 246905 248773 249086 249337 248160 250131 251755 251347 251132 249551 249061
29229 249061 247578 249321 252556 252775 252559 251758 251984 250463 249862 251783 252023 252765 252998 249690 249815 252502
29213 252502 252321 248804 248077 250652 252854 252930 252248 250174 246609 247231 248902 252557 250795 249373 248070 249238
29197 249238 249366 247230 246767 246004 249399 250497 249121 248597 248118 247044 247559 247392 248226 246210 246196 246835 247142
29180 247142 247899 249211 249602 249020 249088 250006 250705 252236 250748 249775 248995 248612 246270 246435 247907 247019 249197
29163 249197 251044 251362 249744 248964 248398 244744 246234 251284 251497 250312 250185 250995 250196 251215 252807 253018
29147 253018 252355 252804 253146 252888 251372 251031 251032 250605 247888 245781 248640 250813 253525 254309 253512 252997 253328
29130 253328 252036 251625 252410 253284 254187 251051 250363 249199 248265 250232 251565 251066 249624 247106 248406 248675
29114 248675 247877 247625 246706 248453 250416 252747 253193 253497 250602 247518 246209 246472 248808 247894 246478 245219
29098 245219 246352 248205 250550 253099 253431 253233 255371 254793 254810 251673 249117 248254 250046 254169 255531 253759
29082 253759 251618 253145 254020 251972 249771 251108 252124 252456 254350 254123 254065 252239 248633 248458 248696 247612
29066 247612 249688 252499 253938 254112 252589 252927 254344 257168 255324 253239 251427 252363 253987 254469 255624
29051 255624 254235 253133 253079 252574 253144 252844 253266 253405 254519 254409 254405 254901 252767 252599 251205 252649 252612 252265
29033 252265 251944 249822 251324 250745 251093 251197 250970 252211 257810 257832 254763 252564 251601 250816 251399 250993 249235
29016 249235 248997 249582 248041 246951 249764 249386 248650 249541 250122 250919 252007 252129 250601 251032 251440 250919 251146
28999 251146 251514 250528 248585 248651 251286 253092 253611 253335 253046 252321 251961 253693 254689 253606 252766 251819 251956
28982 251956 252186 250525 250261 251172 252838 253883 251901 249835 251066 251841 250166 252026 250644 254000 256358
28967 256358 255028 254017 253036 253657 255192 255363 256269 255058 253381 251583 253685 254636 252982 249590 250200 252113
28951 252113 250556 248503 248559 250010 252491 253701 251206 247920 249224 252208 248776 247217 249035 251557 253024
28936 253024 252750 252010 251135 253333 254274 255116 255170 254924 253025 254411 253837 253478 253674 254057 250262 249610 248513
28919 248513 248923 250993 252419 254162 257176 255521 255650 256476 255939 254401 252071 252853 253548 254287 254841 255637
28903 255637 256309 255482 255571 255554 256901 257658 257835 259235 257788 258061 255845 255286 253633 253056 252333 252087 252112 253481
28885 253481 254168 255674 256469 255653 258127 262119 262438 260672 259562 255589 253994 252767 253552 255241 255106 254328
28869 254328 254231 253682 255599 256171 254544 253155 254152 256330 254832 254271 252372 252406 254373 254216 256873 255768
28853 255768 254297 254681 253067 253202 254676 254626 253071 252342 253418 253657 253527 254115 255545 256265 256733 256324 255674
$$ [...]
##END NTUPLES=NMR SPECTRUM
##END=
