##TITLE=Analysis number 325048
Compound Code mo 07945
Book Reference 451/191
Project Code adrs
Chemist Name evam
##JCAMPDX= 6.0         $$ Bruker NMR JCAMP-DX V2.0
##DATA TYPE= NMR SPECTRUM
##DATA CLASS= NTUPLES
##ORIGIN= Bruker BioSpin GmbH
##OWNER= nmr
$$ XWIN-NMR		Version 3.5
$$ Fri Dec  8 09:54:39 2006 GMT Standard Time (UT+0h)  MAYBRIDGE\nmr@NMR_250MHZ
##.OBSERVE FREQUENCY= 250.131544655141
##.OBSERVE NUCLEUS= ^1H
##.ACQUISITION MODE= SIMULTANEOUS (DQD)
##.ACQUISITION SCHEME= undefined
##.AVERAGES= 16
##.DIGITISER RES= 18
##SPECTROMETER/DATA SYSTEM= dpx250
##.PULSE SEQUENCE= zg30
##.SOLVENT NAME= CDCl3
##.SHIFT REFERENCE= (INTERNAL, CDCl3, 0, 16.4474)
##AUDIT TRAIL= $$ (NUMBER, WHEN, WHO, WHERE, WHAT)
$$ ##TITLE= Audit trail, XWIN-NMR		Version 3.5
$$ ##JCAMPDX= 5.01
$$ ##ORIGIN= Bruker BioSpin GmbH
$$ ##OWNER= nmr
$$ C:\u/data/dgb/nmr/ADRS/530/pdata/1/auditp.txt
$$ ##AUDIT TRAIL=  $$ (NUMBER, WHEN, WHO, WHERE, WHAT)
(   1,<2006-12-08 09:54:16.16 +000>,<MAYBRIDGE\nmr>,<NMR_250MHZ>,
      <created by zg, POWCHK disabled, PULCHK disabled
       configuration hash MD5:
       49 4B E0 1D 92 C2 6B 37 9F E6 65 BC 52 41 86 1D
       data hash MD5: 64K
       56 31 72 91 A6 54 18 6C CD CF 20 55 E1 4F 3D AD>)
(   2,<2006-12-08 09:54:30.21 +000>,<MAYBRIDGE\nmr>,<NMR_250MHZ>,
      <Start of raw data processing
       ef LB = 0.3 FT_mod = 6 PKNL = 1 SI = 32K 
       data hash MD5: 32K
       86 EC 7E 67 08 CE 59 B5 5E 0E 17 C9 10 54 C5 86>)
(   3,<2006-12-08 09:54:32.05 +000>,<MAYBRIDGE\nmr>,<NMR_250MHZ>,
      <apk 
       data hash MD5: 32K
       97 4A DE C8 11 61 7D C2 F4 3F 38 FC BC AB 26 7F>)
(   4,<2006-12-08 09:54:33.10 +000>,<MAYBRIDGE\nmr>,<NMR_250MHZ>,
      <abs ABSG = 5 
       data hash MD5: 32K
       EF BB 25 62 30 D5 8A B6 E1 80 B9 4A 04 DC 7B DB>)
$$ ##END=
$$ 
$$ hash MD5
$$ 99 5C 4E 1F D1 C6 F7 D3 18 31 11 3B 29 2A B0 AD
##$RELAX= 
##$RELAX= 
##$RELAX= 
##$RELAX= 
##$RELAX= 
##$RELAX= 
##$RELAX= 
$$ Bruker specific parameters
$$ --------------------------
##$DU= <C:\u>
##$EXPNO= 530
##$NAME= <ADRS>
##$PROCNO= 1
##$TYPE= <nmr>
##$USER= <dgb>
##$AMP= (0..31)
100 100 100 100 100 100 100 100 100 100 100 100 100 100 100 100 100 100 
100 100 100 100 100 100 100 100 100 100 100 100 100 100 
##$AQSEQ= 0
##$AQ_mod= 3
##$AUNM= <au_zg>
##$AUTOPOS= <11 >
##$BF1= 250.13
##$BF2= 250.13
##$BF3= 250.13
##$BF4= 250.13
##$BF5= 500.13
##$BF6= 500.13
##$BF7= 500.13
##$BF8= 500.13
##$BYTORDA= 1
##$CFDGTYP= 0
##$CFRGTYP= 5
##$CHEMSTR= <none>
##$CNST= (0..31)
1 1 145 1 1 1 1 1 1 1 1 1 1 1 1 1 1 1 1 1 1 1 1 1 1 1 1 1 1 1 1 1 
##$CPDPRG= <>
##$CPDPRG1= <>
##$CPDPRG2= <>
##$CPDPRG3= <>
##$CPDPRG4= <mlev>
##$CPDPRG5= <mlev>
##$CPDPRG6= <mlev>
##$CPDPRG7= <mlev>
##$CPDPRG8= <mlev>
##$CPDPRGB= <>
##$CPDPRGT= <>
##$D= (0..31)
0 1 0 0 0 0 0 0 0 0.06 0 0 0 0 0 0 0.0002 0 0 0 0 0 0 0 0 0 0 0 0 0 0 
0 
##$DATE= 1165571655
##$DBL= (0..7)
120 120 120 120 120 120 120 120 
##$DBP= (0..7)
150 150 150 150 150 150 150 150 
##$DBP07= 0
##$DBPNAM0= <>
##$DBPNAM1= <>
$$ [...]
##$SUBNAM7= <"">
##$SUBNAM8= <"">
##$SUBNAM9= <"">
##$SW= 20.6930455092707
##$SWIBOX= (0..15)
0 0 3 0 0 0 0 0 0 0 0 0 0 0 0 0 
##$SW_h= 5175.983436853
##$TD= 65536
##$TD0= 1
##$TE= 295.16
##$TE2= 300
##$TE3= 300
##$TEG= 300
##$TL= (0..7)
0 120 120 120 120 120 120 120 
##$TP= (0..7)
150 150 150 150 150 150 150 150 
##$TP07= 0
##$TPNAME0= <>
##$TPNAME1= <>
##$TPNAME2= <>
##$TPNAME3= <>
##$TPNAME4= <>
##$TPNAME5= <>
##$TPNAME6= <>
##$TPNAME7= <>
##$TPOAL= (0..7)
0.5 0.5 0.5 0.5 0.5 0.5 0.5 0.5 
##$TPOFFS= (0..7)
0 0 0 0 0 0 0 0 
##$TUNHIN= 0
##$TUNHOUT= 0
##$TUNXOUT= 0
##$USERA1= <user>
##$USERA2= <user>
##$USERA3= <user>
##$USERA4= <user>
##$USERA5= <user>
##$V9= 5
##$VALIST= <valist>
##$VCLIST= <CCCCCCCCCCCCCCC>
##$VD= 0
##$VDLIST= <DDDDDDDDDDDDDDD>
##$VPLIST= <PPPPPPPPPPPPPPP>
##$VTLIST= <TTTTTTTTTTTTTTT>
##$WBST= 1024
##$WBSW= 4
##$XGAIN= (0..3)
0 0 0 0 
##$XL= 0
##$YL= 0
##$YMAX_a= 286216
##$YMIN_a= -355051
##$ZGOPTNS= <>
##$ZL1= 120
##$ZL2= 120
##$ZL3= 120
##$ZL4= 120
##$ABSF1= 16.44741
##$ABSF2= -4.245762
##$ABSG= 5
##$ABSL= 3
##$ALPHA= 0
##$AQORDER= 0
##$ASSFAC= 0
##$ASSFACI= 0
##$ASSFACX= 0
##$ASSWID= 0
##$AUNMP= <proc_1d>
##$AZFE= 0.1
##$AZFW= 0.1
##$BCFW= 0
##$BC_mod= 0
##$BYTORDP= 0
##$COROFFS= 0
##$CY= 12.5
##$DATMOD= 1
##$DC= 0
##$DFILT= <>
##$DTYPP= 0
##$F1P= 14.0000005364418
##$F2P= -0.99999901652339
##$FCOR= 0.5
##$FTSIZE= 32768
##$FT_mod= 6
##$GAMMA= 0
##$GB= 0
##$INTBC= 1
##$INTSCL= 1
##$ISEN= 128
##$LB= 0.3
##$LEV0= 0
##$LPBIN= 0
##$MAXI= 10000
##$MC2= 0
##$MEAN= 0
##$ME_mod= 0
##$MI= 0
##$NCOEF= 0
##$NC_proc= -3
##$NLEV= 6
##$NOISF1= 0
##$NOISF2= 0
##$NSP= 0
##$NTH_PI= 0
##$NZP= 0
##$OFFSET= 16.44741
##$PC= 1
##$PHC0= 231.3245
##$PHC1= 5.268313
##$PH_mod= 1
##$PKNL= yes
##$PPARMOD= 0
##$PSCAL= 4
##$PSIGN= 0
##$REVERSE= no
##$SF= 250.130018656726
##$SI= 32768
##$SIGF1= 0
##$SIGF2= 0
##$SINO= 400
##$SIOLD= 32768
##$SREGLST= <1H.CDCl3>
##$SSB= 0
##$STSI= 32768
##$STSR= 0
##$SW_p= 5175.98343685301
##$SYMM= 0
##$S_DEV= 0
##$TDeff= 65536
##$TDoff= 0
##$TI= <Analysis number 999999
Compound Code 99
Book Reference 9
Project Code 9>
##$TILT= no
##$TM1= 0
##$TM2= 0
##$TOPLEV= 0
##$USERP1= <user>
##$USERP2= <user>
##$USERP3= <user>
##$USERP4= <user>
##$USERP5= <user>
##$WDW= 1
##$XDIM= 32768
##$YMAX_p= 329535739
##$YMIN_p= -158765
$$ End of Bruker specific parameters
$$ ---------------------------------
##NTUPLES= NMR SPECTRUM
##VAR_NAME=  FREQUENCY,     SPECTRUM/REAL,   SPECTRUM/IMAG
##SYMBOL=    X,             R,               I
##VAR_TYPE=  INDEPENDENT,   DEPENDENT,       DEPENDENT
##VAR_FORM=  AFFN,          ASDF,            ASDF
##VAR_DIM=   32768,         32768,           32768
##UNITS=     HZ,            ARBITRARY UNITS, ARBITRARY UNITS
##FACTOR=    0.157963299565203, 1,           1
##FIRST=     4113.99111610471, 0,            0
##LAST=      -1061.9923207483, 0,            0
##MIN=       -1061.9923207483, -158765,      0
##MAX=       4113.99111610471, 329535739,    0
$$ Real data points
##PAGE= N=1
##DATA TABLE= (X++(R..R)), XYDATA
$$ [...]
20465C6142j3872q804K909p572L2968Q481l1956Q146O61j0194j479K7798j4369
20452B8859l7104k9612j2132J2131L6646L135m6312k2264J3197L2351j2191J8808
20440a4488k026K320J7939k2498k167r833J8478J5346L7916K6307j2969j740m5061
20427G524m261j6011k4419J3831K8809J1228q820k0820l0957M7N6203l3053j3849
20414c4548K1553k4523r333M3868J6274l6014k6721l3435L4649L2369l3810j3834
20402f3505K6645J7546N2539K2364o21K7637p428j4693n3007n0820K9904O5076
20390E1637J1152m6678l4296L0417J3805j3331K7694q450j6849k4473j8324k1073
20378d8769J638L8770L5930p086k1411J5724j5558m6406J0208N780j8305K7735
$$ y = [36142, 22270, 13466, 16375, 8803, 41771, 50252, 18296, 26442, 27103, 16909, 15430, 43228, 28859, -8245, -37857, -49989, -37858, -1212, 1923, -44389, -66653, -53456, -21105, -33296, -14488, -16514, -14194, 3745, -18753, -20920, -30753, -12275, 3071, 40987, 67294, 54325, 52585, 7524, 3263, -12748, -37167, -23336, 5473, 16701, 7881, -12939, -43896, -43849, 12354, -20699, -34548, -12995, -37518, -46851, -2983, 13291, -22723, -49444, -82879, -48230, -15861, -49671, -63505, -36860, -19314, 33225, 55589, 54968, 82605, 75177, 60484, 7477, -43343, -13439, 51637, 62789, 16111, -18185, 12232, 26037, 12706, 40400, 31950, 15101, -9372, -27696, -48769, -47131, -8361, 27569, 20483, -928, 14796, -762, -47168, -36960, -31180, -49485, -21750]
20366b1750n65n172K8132N7339J829m1973j1944L8053K0879L343l1335J3678j228
20353D9286k5269P185j66l765K0154j3462k5033m167M808O1K4552J6463k2737
20340B7910n3178j2775L3399j7067J1320L6506p792J3075n560j9577k2223k4530
20328d0492j0336L3441P52L4754K8465j6254k0191k0367k1454K6592j3616R584
20316i122k0189L5579J7760l4366J060o339q059L9721J3216k1261j9628j2877
20304b4505j5421L0480l318j4252J2603j3641K5154L8768M831P0j0149J0188k6844
20291A3964l0082M0825P225k4898O493J6169j4547k3670J2846K9900j1927k8185
20279e887k3317j8688P182K2746J9280K9733M1544K1751J6584n2552o2317o9841
$$ y = [-21750, -22315, -27487, 645, 57984, 59813, 17840, 5896, 43949, 64828, 68171, 36836, 50514, 49286, 24017, 31202, 31036, 27271, 47425, 33963, 8930, 4763, 9571, 9632, 34184, 50647, 27910, -25268, -38043, -4644, -21711, -10391, 26115, 18323, 31398, 25838, 6261, -15962, -40492, -50828, -17387, -16635, 18119, 46584, 30330, 10139, -10228, -31682, -5090, -18706, -9122, -29311, 6268, 24028, -10338, -9278, -15617, -23676, 16045, 29261, 8000, -11628, -24505, -39926, -9446, -12764, -27016, -14413, -28054, -2900, 35868, 40699, 40769, 30620, 40808, 13964, -16118, 24707, 31932, 7034, 13527, 29696, 15149, -8521, 4325, 34225, 22298, -5887, -29204, -47892, -40710, -17964, 1316, 31049, 72593, 94344, 110928, 58376, -3941, -73782]
20267g3782J0543r877J2183L1315K9997Q9o1801J920K4253J5688J4256M815k6813
20254b7214m0548l0401Q731M9523M4498M3074k0469k9015m959J1114o786l0374
20242c2826Q21K0402K9238R025j8582L137K0638K2634k6810o599k4054j7430p037
20229b7443J0843J676j0289p995j7998j027N6617O7172K580l2335J8065O916m682
20216F2100j1279j3246o7990j193K141q398O585O208L6169K0133k3576k6563J2384
20203f525M4179k5187K3337M3427k7925o1556m4294j5471M0401N5613J9354k4191
20191B1162N69L526m9651k5124J1335J4846L2724L4172J5458K1924j8052m7760
20179A5129l0721q364L3069j4925j6408Q060j9089j7767p702J1529q62K4878r738
$$ y = [-73782, -63239, -73116, -60933, -29618, 379, 468, -61333, -59413, -35160, -19472, -5216, -401, -27214, -67762, -98163, -89432, -39909, 4589, 47663, 27194, -1821, -6780, 4334, -2452, -32826, -32005, -11603, 17635, 26660, 8078, 11215, 31853, 54487, 27677, 21078, -2976, -20406, -27443, -16600, -14924, -25213, -33208, -51206, -52233, 4384, 71556, 74136, 41801, 59866, 66782, 62100, 50821, 37575, -30415, -31608, -29467, -37865, -31280, -25072, 11097, 31230, 7654, -18909, -6525, 37654, 12467, 35804, 79231, 51306, -10250, -54544, -70015, -29614, 25999, 45353, 21162, 21731, 25257, -24394, -49518, -38183, -23337, 9387, 43559, 59017, 80941, 62889, 15129, -15592, -23956, 9113, -5812, -22220, -14160, -33249, -51016, -58718, -47189, -48051, -23173, -32911]
20166c2911o562n808K6794J5126J0709K1499k0579j1757M4939m5407k8263O953
20154b5267N405P097J048j0056p966K4274K9225m959K1277j780j6676Q182k3474
20141F330j4194O552L3446N191j1671K2651J1356L134K7754n8987j6613L0800
20129D5749o731l2210l9719n035M2335M1128J575k3979j4146K338J8798P9212
20117A09315q02o5593l6507j317j0613M4573J7229k5091k5671j9906k0549m1737
20105g6669L3877O6440J3072m9641J26O7892J6137k2164L0401q623k2824m3807
20093D217j7776O2512N2523K1624K380m1916m1930q482L9950L203k9116J2719
20081E9908j9465k9817K4883J1419J2838m00k1558j6036O256o88m2343m790J2449
$$ y = [-32911, -39473, -45281, -18487, -3361, 7348, 28847, 8268, -3489, 41450, -3957, -32220, -25267, -19862, -12765, -11717, -21773, -29739, -5465, 23760, 18801, 40078, 38298, 21622, 29804, 6330, -7864, -1312, 32134, 37325, 25654, 48305, 59661, 62795, 90549, 31562, 14949, 45749, 39018, 6808, -32911, -37946, 4389, 45517, 47092, 23113, 8967, 11305, 30103, 109315, 108513, 42920, 6413, 5096, -5517, 39056, 56285, 31194, 5523, -14383, -34932, -76669, -42792, 23648, 36720, -12921, -12795, 55097, 71234, 49070, 79471, 70848, 48024, 4217, -13559, 48953, 101476, 123100, 125480, 83564, 41634, 33152, 73102, 76305, 47189, 59908, 40443, 10626, 35509, 46928, 59766, 59366, 37808, 21772, 28028, 27340, -15003, -19793, -7344]
20068g344l1206k6325m515J2000M5551J1086j6151L9285n0356Q350J7059L4877
20056C2311R134k1915k7240M688K4555J4697Q152L42n2107j94k3935J2712J7231
20043a569K6613j2198o430l6321n0840m3391M6602O0471K2231j0926J3819R640
20031A7701j9483k8264q45J0944k423L958L5838j00l2035m0186K1327J4182O4389
20018D5003R698j7093l1560j5121K972J0574K2618O122L74P428J8963l2259M943
20005C2662J769J8456M348k459K0400K0299l9868J2178j9758l6787j1674K337
19993A903j451l957n4910l1113M7578M2175r707l6940L8087J5887K812J3183Q919
19980C2466j8662j256o3972m2308J7710k5552J1799K2619L8589J7696O947Q404
$$ y = [-7344, -38550, -64875, -69390, -57390, -11839, -753, -16904, 22381, -27975, -19625, -2566, 32311, 41445, 19530, -7710, -3022, 21533, 36230, 44382, 44724, -7383, -7577, -31512, -18800, -1569, 25044, 12846, 6416, -29905, -80745, -124136, -77534, -17063, 5168, -5758, 8061, 17701, -1782, -30046, -30891, -19947, -22370, -18412, 17426, 17326, -14709, -54895, -33568, -19386, 45003, 54701, 37608, 6048, -9073, -6101, 4473, 27091, 33213, 33587, 41015, 59978, 27719, 32662, 34431, 52887, 57235, 54776, 75176, 95475, 55607, 67785, 48027, 11240, -434, 1903, 452, -3505, -58415, -89528, -41950, 225, -9482, -46422, -8335, 7552, 10364, 23547, 32466, 13804, 12548, -51424, -93732, -76022, -101574, -89775, -67156, -28567, -10871, -3924, 4480]
19968D480l1290l5679K3145r956m3034L2100J7236m4716Q906K2116M808K8292
19956b3592N5688J9795l7514j4840r498K0635l734J7345k9446k8419O215n634
19944c2999k0337l3761l2883N0612K9737L473N4245M3933n36j7093l9950k1691
19932a7250j0425L0088O998O0175r345j9889j2502o225j8833M112K2526L227j2576
19919B0081m7819p497j1262J5757j0226K8728O6162K4487k7817K0673p748l3002
19907C0517k6504r589k2267K1755o749J7316O1443P710n7197m2085k4683l265
19895e3598J2427L8842L7021k7964j9286J6108J1284j306j7575m9146J3180m534
19883d4547J4979j6491k2682L0958J7452K7088L1427l7320j9852p425r948j9058
$$ y = [4480, -26810, -62489, -39344, -49300, -92334, -60234, -42998, -87714, -78808, -56692, -51884, -23592, 32096, 51891, 14377, -463, -9961, 10674, 6940, 24285, -5161, -33580, -27365, -32999, -53336, -87097, -119980, -69368, -39631, -36158, 18087, 62020, 61484, 44391, 4441, -17250, -27675, 2413, 9411, 69586, 60241, 40352, 27850, 21625, 2792, 6904, 29430, 32657, 20081, -27738, -35235, -46497, -30740, -40966, -12238, 53924, 78411, 50594, 71267, 63519, 30517, 4013, -5576, -27843, -6088, -12837, 4479, 65922, 73632, 16435, -25650, -50333, -53598, -41171, -2329, 34692, 6728, -12558, 3550, 14834, 13528, -4047, -53193, -40013, -44547, -29568, -46059, -68741, -37783, -20331, 6757, 38184, 864, -18988, -26413, -36361, -55419]
19871e5419J5027k1486l4932L8328M4980J7664K9533N957k3452k8805l2312j1528
19859e6445N1515K1927k9746j839k8550J9741L6202J038r290M4883J9057K4871
19847I3364L846M108k8490q720l3972M058j2326J3409k5674r731l125j6294J8495
19834a052K8604N9670J2789j8545k7059k1530j6995o151N4367M4880k4143o4656
19822B0179n4923J9454L8377M5831n622l016K5243m15l0501j7735j1507p332M921
19809B2954N495k5816j8012J9824J7760J3960k108k7180J3423J8899j2246K0607
19797D7560m7723j7485n3761L3404K7304J1891R303l8116j8468P139Q549k9902
19785f0305l603K9764J5552l6016M4246K2203M976r79l2306k1810j7185R151Q465
$$ y = [-55419, -40392, -61878, -96810, -58482, -13502, 4162, 33695, 39652, 16200, -12605, -44917, -56445, -4930, 16997, -12749, -14588, -43138, -23397, 12805, 13843, 4553, 49436, 68493, 93364, 97210, 101318, 72828, 64108, 30136, 34194, 21868, 35277, 9603, -128, -3253, -19547, -1052, 27552, 87222, 100011, 81466, 54407, 32877, 15882, 9731, 64098, 108978, 84835, 20179, -34744, -15290, 23087, 68918, 63296, 60280, 85523, 85108, 54607, 36872, 25365, 18033, 22954, 28449, 2633, -15379, 4445, 22205, 36165, 34057, 6877, 20300, 39199, 26953, 47560, -163, -17648, -71409, -38005, -10701, 1190, 10493, -27623, -46091, -38952, -30403, -60305, -63908, -34144, -18592, -54608, -10362, 11841, 16817, 15838, -16468, -38278, -55463, -46312, -37847]
19772c7847k7763K8640K9613j5895j5047J9125K7924L128K0606K3572L6554l0079
19760F2531l9997j8102o229m171J7257r484k8885o115K478K1078K1155M9007j6982
19747D3541j451J491R268j8068M3012O908l6900m9623j9702J8393K3655J539J1254
19734C3317J3316k030o594M1699J0070k4929k4954l0792j4372K3828k5829K967
19722d303m693j7507m7500L9197P1102N9302j0845k8100l676j346K5103m2766
19710C3968R225J6813l1813j257L1420O118l3035l7135k7860j3370O258K6428
19698a4240K7188O798l7676j552m18l4379j9838J8535j0567N0296M7231M4879
19686G6257L9647j1090J6774k030m3246k4742k7012P424J7277l9937j7995o685
$$ y = [-37847, -65610, -36970, -7357, -23252, -38299, -19174, 8750, 11878, 32484, 56056, 92610, 62531, 22534, 4432, -1797, -5968, 11289, 1805, -27080, -33195, -30717, -9639, 11516, 60523, 43541, 42090, 43581, 52849, 34781, 77793, 84701, 47801, -1822, -21524, -3131, 20524, 22063, 33317, 46633, 44603, 38009, 79708, 89778, 64849, 39895, 9103, -5269, 18559, -7270, -4303, -8996, -26503, -74003, -34806, 36296, 95598, 84753, 56653, 52977, 51631, 76734, 33968, 43193, 60006, 28193, 26936, 58356, 64474, 31439, -5696, -33556, -46926, -40668, -14240, 12948, 19746, -17930, -19482, -19900, -54279, -74117, -55582, -66149, -15853, 31378, 76257, 115904, 104814, 121588, 119558, 76312, 51570, 24558, 31982, 49259, 9322, -8673, -15358]
19674a5358L2583j4046l0784P441K4621j2043n434k5401o786M9517J9706J5217
19662C9233l408q0237J1757L5251k0430K7289L8671L2126m329m7419J2102J5736
19650E6342k3597O813l5414m4006l7190j147L7308J1183Q261J1524R883J5000
19638A4960k7598L707O3850P496R697J0678J962l0538m5797m5494j5114J5968
19626c6223J5342j2319m93K7576l0100l5964P706O1131M5014k906m67m547r056
19613B4694m9988j2828M429J6063J715K1184L2322j5327O913l2446j7184M0680
19601B0227K6986r960j6869k1880K6510J8739J4643l2596J6771L940j545J637
19589D6603j1937k6264j0326J6315O972q751j0177J6993J4319O0413J7595l2654
$$ y = [-15358, 17225, 3179, -27605, -20164, 4457, -7586, -13020, -38421, -45207, 4310, 24016, 39233, 35825, -44412, -32655, 2596, -17834, 9455, 48126, 80252, 75923, 28504, 40606, 56342, 32745, 39558, 4144, -39862, -77052, -78199, -40891, -29708, -21447, -9923, -40, 14960, -12638, -8931, 54919, 62415, 72112, 82790, 84752, 54214, 8417, -37077, -52191, -36223, -20881, -33200, -33693, -6117, -36217, -72181, -64475, -3344, 41670, 38764, 38297, 33750, 24694, -25294, -38122, -33693, -17630, -15915, 5269, 37591, 22264, 29177, -3269, -20453, 20227, 47213, 37253, 20384, -1496, 25014, 43753, 58396, 25800, 42571, 46511, 44966, 46603, 34666, 8402, -1924, 14391, 21363, 12612, 2435, 19428, 33747, 94160, 111755, 79101]
19577G9101m0023k8011l1643M424Q06j9134J6626k4819k9542J6465J0759O1125
19565A6134K9365j7869q85n4598n0138m2503J4940K1256O415K1869M3156L4669
19553B1811J2449o8251J8392l0007o5052N483P0838M8860L3791k5732m2081P994
19541a1505j1214j52K8361L763j3583k530J5482J8321J2602J6692n6695l6840
19529c7298J460K4086L038J2336l4476L0559M3702l1070m39K0943k7396l7719
19517c2274L6066k8674k8623Q002L9933J2441p055J4119J20j1691O2599L0011
19505I4974l3525M932n424P03j2217q152j3444J9425K5221k1324l4057k0910R889
19492F091K2235J2180m563K891k6505k3477M821K1168L5157j9646l2844k5537
$$ y = [79101, 39078, 11067, -20576, -16152, -15346, -34480, -17854, -42673, -72215, -55750, -44991, 16134, 45499, 27630, 26745, -27853, -77991, -120494, -105554, -84298, -77883, -56014, -12858, 21811, 34260, -33991, -15599, -45606, -110658, -105175, -34337, 14523, 48314, 22582, -19499, -11505, -22719, -22871, 5490, 9253, -4330, -6860, 8622, 26943, 39545, 56237, -458, -37298, -35838, -11752, -8714, 3622, -30854, -295, 43407, 12337, 11898, 32841, 5445, -32274, 3792, -24882, -53505, -45503, -5570, 6871, -184, 13935, 14055, 2364, 64963, 94974, 61449, 66381, 60957, 61660, 49443, 41291, 27847, 47272, 72493, 51169, 17112, -3798, 6091, 28326, 40506, 35943, 38834, 12329, -11148, -6327, 14841, 49998, 30352, -2492, -28029]
19480b8029J4303R228k1767K2568K8212P870l0253J879M2356L3918m809k0759
19468E4717j129J114j3935j5343j018j2271N853K5413L9828j0031n8929l0400
19456a6131m694K221J3178J5578J6553P297J5085k2040k0986Q773k740l1834J0072
19443i668J5054L8439O0420L076k2316l9029J9530k9176j0844o767k505n1K901
19430A9064j429J9852m803n0066K5736K8216L2637l115m7040k4444J326j1499
19418a5565J8210j5139p415k5683k3819L4648J9709J6112M846J8461N495l0053
19406a93l2478N142O7688N731M1856K1220m7854l3430k5672l6834k4053P3193
19394A4316M5932J7217l430m6385k8805l5641j5329K1305R9995o06l1658l3840
$$ y = [-28029, -13726, -4498, -26265, -3697, 24515, 32385, 2132, 4011, 46367, 80285, 75476, 54717, 53588, 54702, 40767, 25424, 24406, 12135, 17988, 43401, 83229, 73198, 14269, -16131, -20825, -18604, -5426, 10152, 26705, 34002, 49087, 27047, 6061, 14834, 12094, -19740, -9668, 5386, 43825, 104245, 107321, 85005, 45976, 65506, 36330, 25486, 18719, 16214, 16163, 19064, 17635, 37487, 32684, -17382, 8354, 36570, 69207, 66092, 19052, -5392, -4066, -15565, 2645, -12494, -19909, -45592, -69411, -34763, -15054, 1058, 5904, 24365, 29860, -193, -32671, -27529, 40159, 45890, 87746, 108966, 61112, 27682, 2010, -34824, -58877, 14316, 60248, 77465, 74035, 27650, -1155, -36796, -52125, -30820, 69175, 68569, 36911, 3071]
19382C071j7467L9721J2494l4507l1540J5494M6379L3118j7133j0987J7617M894
19370F1154K3396R700l3294j5154J4601N7096O5634P4238L363R74J8150j8363
19358B61495m2723k5361j868j3725M2606K5750j939M578j4081j5228m7681o8561
19346A03262m4743K434k797k2285Q226J8195m2274Q308J3853j765l4070O28j7966
19333a0994j6122M4304K8784L2184P488l059p455k0865K4413J8869Q184k5436
19321H0295n8640m253j5177R697N9114q4J6878M2190J7898L5376N6986J0411j4170
19308B36521j4540m2442k8075L1477P5145L6494L8801j4458l5182k7254o5159
19297A91328o1958o7040m1160J0985L2086N2358Q777o8915m6489O879M4018J8600
$$ y = [3071, -14396, 25325, 37819, 3312, -28228, -12734, 33645, 66763, 49630, 38643, 56260, 61154, 84550, 94250, 60956, 45802, 60403, 117499, 183133, 257371, 260734, 261708, 279858, 261495, 218772, 193411, 191543, 177818, 220424, 246174, 244235, 248813, 234732, 219504, 171823, 103262, 58519, 60953, 58156, 35871, 44097, 62292, 20018, 28326, 42179, 40414, 6344, 6972, -10994, -27116, 17188, 45972, 78156, 85644, 82585, 75130, 54265, 78678, 97547, 105731, 80295, 21655, 17402, 2225, 11922, 71036, 70952, 87830, 130020, 147918, 183294, 240280, 250691, 236521, 221981, 179539, 151464, 182941, 258086, 294580, 333381, 318923, 283741, 256487, 191328, 129370, 62330, 21170, 32155, 64241, 116599, 125376, 56461, 9972, 16851, 60869, 79469]
19285G9469l3202L0150K0192l7611N531j6989J2819j3110P558K756Q83M7693k5818
19272H0321n8271r326l442J7109N5249l8321k6744K6911j8458k2349P312L0270
19260D0261M4911N462k7324j9597K1664M0294M801n12J7095K1253l7642j4366
19248I6300J1816j203L905k1759k1525J238l982j3453p569J2875l1665J2816Q644
19235D6438J6904M323K9716k8882n1900M3750j2059K6578n836J7866M1398K4579
19223A52875J9574k7956J280N3008O8983q303o3830m4220j7944l645j7392k146
19211A10284N447J1845k044p243M47J5901L5177Q193l6012p516J2440K9932J9690
19198A96541o2866l7471J2031k145J0480K3136k6112O420R896l359O217J4135
$$ y = [79469, 46267, 76417, 96609, 58998, 64529, 47540, 60359, 47249, 54807, 57563, 58446, 106139, 80321, 22050, 12724, 9282, 26391, 81640, 43319, 16575, 43486, 25028, 2679, 9991, 40261, 85172, 90634, 63310, 43713, 65377, 105671, 110472, 109960, 127055, 148308, 110666, 96300, 108116, 106913, 110818, 89059, 67534, 68772, 64790, 51337, 43768, 56643, 24978, 37794, 46438, 63342, 67665, 97381, 68499, 16599, 60349, 48290, 74868, 69032, 86898, 128296, 152875, 172449, 144493, 145773, 198781, 267764, 259461, 195631, 151411, 133467, 129822, 112430, 110284, 115731, 127576, 125532, 118289, 118736, 134637, 169814, 178007, 141995, 134479, 146919, 176851, 196541, 133675, 96204, 108235, 106090, 116570, 139706, 113594, 120014, 129910, 126551, 132768, 146903]
19186A46903o6677l0718M6884l248l3117m3552M960K4429R154L8496J04329O2672
19174B60515K4522L2412j1715j9725n3697R245O272l637N5190q366k3246n7654
19162B10116l96n720J2385L8544J7197J2412J939m2890m1153j9388o5831p0294
19150D6921J3844K2444j2573l5213M09M767j8671k6419J2644M0544L3334o482
19138G5549j7818j3661K6143m576j3816N2163R561K6618J2059m529j7006n152
19126A25535q517n6328j3970L2386L1921N8907L530k935n4451J485M5216q691
19114A54088k1945q8264n3473j876J7126K9248K2665k4895p940j0059k7504j2985
19102b5814O391K5113Q3073Q571j6615j5185O640l097R216L42K1463J3496l1747
$$ y = [146903, 80226, 49508, 96392, 93144, 60027, 16475, 21435, 45864, 55018, 93514, 197843, 260515, 285037, 317449, 305734, 286009, 232312, 241557, 247829, 244192, 299382, 291016, 267770, 210116, 209720, 204000, 216385, 254929, 272126, 284538, 286477, 243587, 202434, 183046, 117215, 46921, 60765, 83209, 70636, 35423, 35832, 40599, 21928, -4491, 8153, 48697, 82031, 75549, 57731, 44070, 70213, 65637, 51821, 103984, 113545, 140163, 152222, 147693, 130687, 125535, 117018, 60690, 46720, 79106, 111027, 169934, 173464, 170529, 116078, 117563, 162779, 154088, 132143, 43879, -9594, -11470, 5656, 34904, 57569, 32674, 24734, 14675, -12829, -25814, -19423, 5690, 88763, 97334, 80719, 65534, 72174, 69077, 78293, 78635, 100098, 113594, 81847]
19089H1847j7128J5217l27J8053r646j0320k2053K268j4252j3137N0723K3213
19077A04458l4767j7493K7486J6768M4844n236j3889l3164k4432J007j8545m3179
19065C858k5658N0937L3222k1031m0971k1680J1378M9360K1618l5039O65K2520
19053D9179J7434k5497l9232l712K3675K0140K2541L0388L4473J3172m6896k6897
19041F8768K8469R658K387O263n4488m6945k9539M7533J3281J2920R142o476J7021
19028G7994R918q805L5023K5690l1860l8409l3055q718K4031K3302M347l5586
19016D3872P448j7837j6889m0418o972K2568M9840M0193n931q708m497r461K0272
19003G3480O8590j3586q4569J556K1271j0536L5599k797l0901p824J9371K6001
$$ y = [81847, 64719, 79936, 79609, 97662, 88016, 77696, 55643, 57911, 43659, 30522, 81245, 104458, 69691, 52198, 79684, 96452, 141296, 136060, 122171, 89007, 64575, 65582, 47037, 3858, -21800, 29137, 62359, 41328, 357, -21323, -9945, 39415, 61033, 25994, 26659, 49179, 66613, 41116, 1884, -1828, 21847, 41987, 64528, 94916, 129389, 142561, 95665, 68768, 97237, 106895, 109282, 115545, 61057, 14112, -15427, 32106, 45387, 58307, 67449, 60973, 77994, 87912, 79107, 114130, 139820, 107960, 69551, 36496, 27778, 51809, 75111, 79458, 43872, 51320, 33483, 16594, -23824, -30796, -8228, 41612, 81805, 75874, 67166, 62669, 53208, 73480, 142070, 128484, 43915, 45471, 66742, 56206, 91805, 89008, 58107, 50283, 69654, 95655]
18991I5655l8080k961j5618j2963N724L8985L0746p615l9208m3723L652J3917
18979B8511n715M2287L5016k0994R593K2801L4185j1868m3589j1331k421k4873
18967E1602J8813Q4408K0533l1583K1323L950K254j9684K3718m02J8818j1207
18955A82543j0699j0891J1338j3291r965L137j2571k370k5558n169j9919J2391
18943I8976J1761L105J0776J1167k028m3493M1678K0546Q558L5179J0913m319
18931B02819j0219M2616K6012m3783J433J3388N308m014l6469K949J1153K2075
18919B33268N554m5131j401p990l5388J4778K4074J9394M5205M4891k8855k0534
18907B47865j9359j2546q737j3096j7446J862M3549K8454l7938J7094L8671k5182
$$ y = [95655, 57575, 54614, 38996, 26033, 31757, 70742, 101488, 93873, 54665, 10942, 14594, 28511, 22796, 65083, 100099, 79105, 88698, 111499, 145684, 133816, 90227, 78896, 76475, 51602, 70415, 154823, 175356, 143773, 165096, 169046, 171300, 151616, 175334, 174932, 193750, 182543, 171844, 160953, 172291, 159000, 149035, 152172, 139601, 137231, 111673, 106504, 86585, 98976, 110737, 113842, 124618, 135785, 133757, 90264, 131942, 152488, 161046, 196225, 207138, 202819, 192600, 235216, 261228, 217445, 218878, 232266, 237574, 233560, 197091, 200040, 211193, 233268, 238822, 193691, 192290, 184300, 148912, 163690, 187764, 207158, 252363, 297254, 268399, 247865, 228506, 215960, 207223, 194127, 176681, 178543, 222092, 250546, 212608, 229702, 268373, 243191]
18895B43191k9830k0248Q3807L1213J1279M3387L6470M6381K905R104K2030j4396
18883D65293L645r191R487P9533O4748r943p3218o0772l6414k8969m3358o038
18871C54803J3491J4563K8937J1506m613K5558O9145N9006P7154O6232P3953M6145
18859H35880P0409N2759Q936Q3563J24452R6503R4247R6711L6657M4770R9764
18848A644651K04741K15690K32626L42733M41651N32875P11554J033575J580886
18839F940982K553680M237708O407371P817837P657381M473383M68838l612365
18831C6944815o033694n193810k195347J815968M465657N105592L199818N07386
18823C8616385j789199m462965o818271o874851n621079l671773k247969j396417
$$ y = [243191, 213361, 193113, 276920, 308133, 319412, 362799, 399269, 445650, 448555, 457659, 479689, 465293, 468938, 459747, 469234, 548767, 613515, 603572, 530354, 469582, 433168, 404199, 360841, 354803, 368294, 382857, 411794, 423300, 418687, 444245, 513390, 572396, 649550, 715782, 789735, 835880, 906289, 959048, 967984, 1051547, 1175999, 1272502, 1366749, 1463460, 1500117, 1544887, 1644651, 1849392, 2065082, 2297708, 2640441, 3082092, 3614967, 4326521, 5360096, 6940982, 9494662, 13732370, 20139741, 27957578, 35614959, 40088342, 40557180, 36944815, 30911121, 25717311, 23521964, 25337932, 29803589, 34909181, 38108999, 38616385, 36827186, 32364221, 25545950, 18671099, 13050020, 9378247, 7130278, 5733861]
18815E733861q85806n81582m41431l12698k09222j53136n9393p6770r6907k7258
18805B889658j7776j4810j835l648N8627J15160R2988P6075K13101K99862M09069
18794D116471N86945P25144Q73279J171755J861974L094910N211335Q280663J0615702
18785C6538178J0375968N118118k138822q210948q757356n454441q08971L697547
18777C0359273O838749P740453M956951j39859n085703r316032r707389p902880
18769A7743563n118553l031405j793358j307003r93379p92995o18090m96306m50728
18760C141746l33464k13709j39222j01502o3274p6020l8876n0547o1656q4490
18750A978986j29271j84224j59573j52121p6212o2783j5633J5262M8779L8588
$$ y = [5733861, 4848055, 4266473, 3825042, 3512344, 3303122, 3149986, 3090593, 3013823, 2916916, 2889658, 2871882, 2857072, 2855237, 2851589, 2910216, 3025376, 3118364, 3194439, 3407540, 3707402, 4116471, 4703416, 5428560, 6301839, 7473594, 9335568, 12430478, 17641813, 25922476, 36538178, 46914146, 52032264, 49893442, 41682494, 32925138, 27470697, 26661726, 30359273, 37198022, 44938475, 49895426, 49755567, 44669864, 35353832, 25646443, 17743563, 12625010, 9593605, 7800247, 6493244, 5499865, 4706870, 4088780, 3592474, 3141746, 2808282, 2594573, 2455351, 2353849, 2290575, 2214555, 2175679, 2125132, 2063476, 1978986, 1849715, 1665491, 1505918, 1353797, 1277585, 1214802, 1199169, 1214431, 1263210, 1301798]
18740A301798l3204m6795m087k2799k0410J4356l6662l070L0699P661P8063Q9303
18728A354853N6926Q1535J20278J22426N4897M6151J06970K44956K15209K46818
18718B651019M05763N26614P40433J073745J735691K884722M331816N334118N910354
18709B5594275N682328K189068J76809k658696n190343m516962l664010j971062
18701A5641407M33265L044554N277790O068966N501446K101635j534011n309811
18693C1225241o710009o259505n143160l482640k166374j349534r08517o02711
18685D602791m63824k84521j35987j01924q4367q4305o2264m1908o5066n0895
18675C227730K8639Q2693J05465J77035L32039N54961P82148J095545J715572
$$ y = [1301798, 1268594, 1221799, 1217712, 1194913, 1174503, 1188859, 1152197, 1149127, 1179826, 1187487, 1265550, 1354853, 1411779, 1493314, 1613592, 1736018, 1790915, 1837066, 1944036, 2188992, 2404201, 2651019, 3056782, 3583396, 4323829, 5397574, 7133265, 10017987, 14349803, 19683921, 25594275, 31276603, 33465671, 33642480, 30983784, 25793441, 21276479, 17612469, 15641407, 16074672, 19119226, 24397016, 30465982, 35967428, 38069063, 36535052, 31225241, 24515232, 18255727, 13112567, 9629927, 7463553, 6114019, 5205502, 4602791, 4138967, 3854446, 3718459, 3616535, 3532168, 3447863, 3385599, 3343691, 3278625, 3227730, 3256369, 3339062, 3444527, 3621562, 3953601, 4508562, 5290710, 6386255, 8101827]
18666H101827K842981M510643N967294O275844P237981N814921J461581L42881
18658D2555953k200562o149414n405587m246754k410043R59471M290285O009492
18650C3402841P187022O247035R80927j528724n860398q714315p755852o836584
18642A7121952n079597l245222k022922j314256q66601o03082m37468k85001j62795
18633C105008j60556j93405k29165k54886k39945k01658j63998j30427p0415p7821
18623A382732n513J8325m0700j3886J7615o5007j12866p5511r2244o3891m0883
18612I08171m0887k6472K9493m7532q7489k1958N35L0447J2367j8726n7048k3714
18600F57187o1450o3730m6981n2481q0283j2819k8981j3845n2971J1648K7051
$$ y = [8101827, 10944808, 15455451, 21422745, 27698589, 34936570, 40751491, 42213072, 42555953, 40355391, 34205977, 28800390, 24553636, 22143593, 23103064, 27393349, 33402841, 40589863, 46836898, 47817825, 46289101, 40428703, 31714388, 23958536, 17121952, 12042355, 8797133, 6774211, 5459955, 4593354, 3990272, 3552804, 3267803, 3105008, 2944452, 2751047, 2521882, 2266996, 2027051, 1825393, 1661395, 1530968, 1460553, 1382732, 1377219, 1395544, 1354844, 1340958, 1358573, 1293566, 1180700, 1105189, 1012945, 949054, 908171, 867284, 840812, 870305, 822773, 735284, 713326, 713861, 744308, 756675, 737949, 680901, 657187, 595737, 532007, 485026, 432545, 352262, 339443, 310462, 296617, 243646, 255294, 282345]
18589B82345M653L8775K3802K351l1071p187l100p7198R898N5015o555m8046P560
18576B51242K317K0076j1359L4637K5930J1727j264O18K9331K9619R495J5776
18564D18145j4594k5524l5234m497l7879J931j5316k4394P266K1075j1432j1473
18552B68074k4919j5827J7527J5855O7688j927j7382l0676N010J6862q043j8983
18540B73259J6502L7226J0772L5919L493l1228m653q043o0442l4100l462K4836
18528B60079k4869j3486l8946K0433M0118N838l6382k1222j9603l3288J1046K5513
18516A75231p551l360N450J826l471J5089j174J9680J5585l3108J3362m605L2126
18503B25080J00400R7191M4979Q631M568j2660l213K6574N456k6427K303J0645
$$ y = [282345, 286998, 325773, 349575, 351926, 320855, 313668, 310568, 233370, 243268, 298283, 291728, 243682, 251242, 253559, 273635, 262276, 296913, 322843, 334570, 333306, 333924, 363255, 392874, 402369, 418145, 403551, 378027, 342793, 338296, 300417, 302348, 287032, 262638, 269904, 290979, 279547, 268074, 243155, 227328, 244855, 260710, 328398, 326471, 309089, 278413, 283423, 300285, 292242, 273259, 289761, 326987, 337759, 373678, 377171, 345943, 341290, 333247, 272805, 238705, 235243, 260079, 235210, 221724, 182778, 203211, 243329, 249167, 212785, 191563, 171960, 138672, 149718, 175231, 167680, 164320, 169770, 171596, 168125, 183214, 182040, 201720, 217305, 184197, 197559, 192954, 225080, 325480, 422671, 467650, 476281, 480849, 468189, 464976, 491550, 497006, 470579, 472882, 483527]
18491D83527O9437J04797K229N8167j3923O134q6539o6449l0641q3566l3829r9156
18479C10188o2735k402O028k8235q053l3211k1636K6897K1268K0420k4748j7228
18467A86553L6812O270J6513L9210J5699l0015j1936L0818K4857k5003o28K4637
18455C13787j8343j681L9098R3035J19005R4622J11361O1463N3025k819J9691
18444H82244J0166L0433M4403k0904m1166L0961J57621J34724J09258N9596j4103
18433A383233m4313k5924R944O6178J27838K19001K88734M07914O79497R60444
18423D072546J497400K440390L742527M316334L274741J47925k689666l448578
18415A3353619k553352p69265J109796L040247M067539L358289N37058l231055
$$ y = [483527, 552964, 657761, 659990, 718157, 704234, 710368, 623829, 557380, 526739, 443173, 409344, 310188, 247453, 245051, 251079, 222844, 214791, 181580, 159944, 186841, 208109, 228529, 203781, 186553, 223365, 229635, 246148, 285358, 301057, 271042, 259106, 289924, 314781, 289778, 289150, 313787, 295444, 293763, 332861, 425896, 544901, 639523, 750884, 812347, 865372, 862553, 882244, 892410, 922843, 967246, 946342, 905176, 936137, 1093758, 1228482, 1337740, 1397336, 1383233, 1338920, 1312996, 1322940, 1389118, 1516956, 1735957, 2024691, 2432605, 3112102, 4072546, 5569946, 8010336, 11752863, 16069197, 19343938, 19491863, 16802197, 13353619, 10800267, 10031002, 11140798, 14181045, 18248584, 21606873, 22143931, 18912876]
18407A8912876m650623m353850k958258j740542j016743o39727m26455k33684
18399B892994j85412j22952j50604j35393n9034o1256m0630m966Q1669J41922
18389B356338J84736J49187L3921k1105L4018J39774K55334L69579N26248P70054
18379D798084J033854J471181K243508L569000N755637Q913386J1007396R263789
18371D8055835K509528n955224r354706p909784l749881O13145M728519P772549
18363C6709981P910489L861088l481931q818676j0089743q013042n225165l221138
18355I631863k026530j331204r71245o75903m78239l88624k95840k21824j53479
18346C088975j88039j96158j19793n1807J5160R1275J40128P9484J21278J04791
$$ y = [18912876, 14262253, 9908403, 6950145, 5209603, 4192860, 3553133, 3126678, 2892994, 2707582, 2584630, 2434026, 2298633, 2239599, 2178343, 2137713, 2132747, 2214416, 2356338, 2541074, 2690261, 2724182, 2703077, 2737095, 2876869, 3132203, 3501782, 4028030, 4798084, 5831938, 7303119, 9546627, 13115627, 18871264, 27784650, 38792046, 48055835, 50565363, 44610139, 35255433, 27345649, 23595768, 24208913, 28937432, 36709981, 44620470, 48481558, 44999627, 36180951, 26091208, 18078166, 12853001, 9631863, 7605333, 6274129, 5302884, 4626981, 4148742, 3760118, 3464278, 3242454, 3088975, 2900936, 2704778, 2584985, 2533178, 2548338, 2639613, 2779741, 2859225, 2980503, 3085294]
18336C085294Q9465Q2876J70339K78777M74513P18057J084876J776643K941545
18327A0702385M877230P221909P607074M605590j783013o192232o740080m539618
18319A5759245j824047N16008K838750M880477N019691K721862k311960n593182
18311B2006844o203688m768376k919435j694521j077942o44496m89822l75743
18303C832821k84411j73494k3128M1149K4686L4818J44032L25026N21411Q19646
18293E262556J215969J924041L192205N141022P595347Q280758N512419j166686
18285C6957631o656641p900870o029206l392395j386993K9857J496606L575967
18277A6693956O390775Q395154O773640N47270o492733q915672p389785m645079
$$ y = [3085294, 3174759, 3257635, 3427974, 3706751, 4181264, 4899321, 5984197, 7760840, 10702385, 15579615, 22801524, 30408598, 35014188, 33231175, 27038943, 20298863, 15759245, 13935198, 14451206, 17289956, 22170433, 27190124, 29911986, 27600026, 22006844, 15803156, 11034780, 8115345, 6420824, 5342882, 4698386, 4208564, 3832821, 3548410, 3374916, 3351788, 3392937, 3417623, 3452441, 3596473, 3921499, 4442910, 5262556, 6478525, 8402566, 11594771, 16735793, 24331140, 32611898, 38124317, 36957631, 30300990, 22400120, 16370914, 12978519, 11591526, 11621383, 13117989, 16693956, 23084731, 31479885, 38253525, 38800795, 32308062, 23392390, 16002605, 11357526]
18269A1357526k646218j579202j107595q43071n79181k65808j53560k33455l01936
18260C647500l20553j89872j34771p2184J2874Q3749J32859J57526Q7376K5493
18250C429997K01094K17685K54144M53003Q10528J222373J928552L168497M898913
18241A6584786O448443O995106N906122L551544P01669l612559o730737o893239
18233B2951135n040382k273569K20419K646473N228986P100377O818956L323411
18225D0975806j449359o801627q502883p456932n046378l103310j976358j296485
18217E342474q79743n38757l77792k85524k51617k40634k39281k47242k21601
18208B060283j31363m2751j7102J6722L4992L1120K2286J6238K6844N2621J46457
$$ y = [11357526, 8711308, 7132106, 6024511, 5181440, 4602259, 4336451, 4182891, 3949436, 3647500, 3326947, 3137075, 3002304, 2930120, 2942994, 3026743, 3159602, 3317128, 3404504, 3429997, 3631091, 3848776, 4102920, 4555923, 5366451, 6588824, 8517376, 11685873, 16584786, 23033229, 30028335, 35934457, 39486001, 40187670, 36575111, 29844374, 22951135, 17910753, 15637184, 15857603, 18504076, 23733062, 30833439, 37652395, 40975806, 39526447, 32724820, 24221937, 16765005, 11718627, 8615317, 6638959, 5342474, 4462731, 3923974, 3546182, 3260658, 3009041, 2768407, 2529126, 2281884, 2060283, 1928920, 1886169, 1869067, 1885789, 1920781, 1951901, 1974187, 1990425, 2017269, 2069890, 2216347]
18197B216347L01060M95486P80364J219624K051223L187469L692516K783085R8374
18188A6825548k559467l467638k839474j586142o05113Q9659Q26543J908134K855925
18179A1447975K754325J326465j539208l202461l232121k304371j385011q51122
18171C014471n97850m71394l17547j83337r8377q7517o7579p4850r5718j04639
18161I15663r6477n9309j6520o384k3430r211n884J2116l1075k6905k9108K251
18149F25727o4523P241l932J8868J1015j8325m4097M3062L8974M4885k0502M1223
18137F79616L6106M994K315k6063k0276o324N5021J13915N7548Q9696Q8153M5645
18125A120346P5960P8866J70247J85250K03723L16126M04424N45638P07649R95696
$$ y = [2216347, 2517407, 3012893, 3793257, 5012881, 7064104, 10251573, 13944089, 16727174, 16825548, 14266081, 10798443, 7958969, 6372827, 5767714, 5857373, 6683916, 8592050, 11447975, 14202300, 15528765, 13989557, 10787096, 7554975, 5250604, 3865593, 3014471, 2416621, 1945227, 1627680, 1444343, 1345966, 1258449, 1190870, 1116020, 1020302, 915663, 819186, 759877, 743357, 736973, 713543, 704332, 698448, 710564, 679489, 652584, 623476, 625727, 561204, 568445, 564513, 583381, 594396, 576071, 531974, 575036, 614010, 658895, 638393, 679616, 715722, 720716, 723031, 696968, 676692, 670368, 725389, 839304, 896852, 986548, 1074701, 1120346, 1196306, 1275172, 1445419, 1630669, 1834392, 2150518, 2554942, 3100580, 3808229, 4803925]
18115D803925J399096K160072L738905P055355J3613815K3311964K8131509l670869
18107H0543772l0311349k1697473j0848828n602966l339982k132205j415630j023366
18099D171973o70020n55220m12912l03403k76676k42114k09585j86723j35054
18090A180266j49543r1336l7308q6825p5228r1601r4918j6511n1152m3817l7748
18079D04279l4258J7292j8562M2959k6897k4452n0301l8548l1846n563p926l4604
18067A91573k4399K1229J7322K4678J0365O2299L7631j5632j0069L8532j3638
18056C39891m7998j8617j817m6006k8183j5123J7412K7127O2318N5838R729l9566
18044C15005n6858p9182m6277o880n1483k5868Q774K0289q916j2656l095N198
$$ y = [4803925, 6203021, 8363093, 12101998, 19157353, 32771168, 56083132, 84214641, 80543772, 50232423, 28534950, 17686122, 12083156, 8743174, 6610969, 5195339, 4171973, 3501953, 2946733, 2533821, 2230418, 1953742, 1711628, 1502043, 1315320, 1180266, 1030723, 939387, 902079, 815254, 740026, 648425, 553507, 536996, 485844, 442027, 404279, 370021, 387313, 368751, 411710, 384813, 360361, 310060, 271512, 239666, 234103, 226177, 191573, 167174, 188403, 205725, 230403, 240768, 303067, 340698, 325066, 314997, 353529, 339891, 291893, 273276, 271459, 225453, 197270, 182147, 199559, 226686, 289004, 344842, 354571, 315005, 258147, 178965, 132688, 125808, 74325, 48457, 57231, 77520, 68604, 55948, 52853, 58051]
18032E8051K1889k5593J3727L8678J9447q810l3355n2529k3736M0772M2294k0583
18020G0252P238N8893K6011J666k0762L9752N2246j9817L39N7759L8252j3407
18008B98422N346q901l1553l5588n4799q192J3132L3623N5762J0533J6603K0907
17996C15295l1685o3906m9134m4496k0259l4807l2138k7716R389K2528m0801m776
17984b506J9144M9362M7447k4086o1180j4241L8504q360M833L990J4324J4571
17972H1802J1296L670n536l2047M327L724L8663o418l491N9227m82j1171m3919
17959I9645q832n278J1532j581J307M367J0724k5944Q608R721n694j4408k7116
17946E7051l6318J2239L1146L2232K5896O439K856k094n0569l7868m6376J2170
$$ y = [58051, 79940, 54347, 68074, 106752, 126199, 117389, 84034, 31505, 7769, 48541, 90835, 70252, 77490, 136383, 162394, 164060, 143298, 183050, 235296, 215479, 215818, 273577, 311829, 298422, 303768, 294867, 263314, 227726, 172927, 164735, 177867, 211490, 267252, 277785, 294388, 315295, 283610, 219704, 170570, 126074, 105815, 71008, 38870, 11154, 20543, 43071, 2270, -2506, 16638, 66000, 113447, 89361, 28181, 13940, 52444, 44084, 48917, 52907, 67231, 81802, 93098, 96768, 91232, 59185, 63512, 67236, 105899, 99481, 95990, 155217, 154735, 143564, 99645, 90813, 85535, 97067, 95486, 96793, 101160, 111884, 85940, 94548, 104269, 98575, 84167, 57051, 20733, 32972, 64118, 96350, 122246, 128685, 131541, 129447, 78878, 41010, -5366, 6804]
17934F804k0470j5869p798J3090J4232K8126K0528K5637M4719Q6997P539j3652
17922A89883p781l7601k0361l008m1078j3306K024l1046p507k2145N2781L215
17910F4070J3481J9910J952p43m673j5463l0560m8168O90M3880j7561Q325j4210
17897B0930j4290k9463L0809J8549O1829O4710l8592J9195K3118l9722k8334J3239
17885A01978J419r574l8256l8682l9899k8941L3704M3458K1286n0874l2395J5258
17873b1518Q320k165j5474J1988K3484m767J2536N5819R191j3169K139j0453k9517
17860B6414O665K9531j4391j3620K4141L5142K8321j3285m5424k020L7346N7633
17848A56453P043M3302O6608L1464k634n4778n0833l0457J678N2678L7243J9032
$$ y = [6804, -13666, -29535, -37333, -24243, -10011, 18115, 38643, 64280, 108999, 195996, 203535, 189883, 182102, 144501, 124140, 121132, 80054, 66748, 68772, 37726, 30219, 8074, 60855, 64070, 77551, 97461, 99413, 98670, 93997, 78534, 47974, -194, 496, 44376, 26815, 35140, 20930, 6640, -22823, 7986, 26535, 88364, 153074, 114482, 133677, 156795, 117073, 88739, 101978, 103397, 93823, 55567, 16885, -23014, -51955, -18251, 25207, 46493, -4381, -36776, -21518, -13198, -15363, -30837, -18849, 4635, -132, 12404, 68223, 77414, 64245, 66384, 55931, 26414, 33079, 62610, 48219, 34599, 58740, 93882, 122203, 108918, 63494, 61474, 98820, 156453, 163496, 206798, 273406, 304870, 302236, 247458, 196625, 166168, 167846, 220524, 257767, 276799]
17836B76799m232q648m5537q1145o6547j4138O58n041J2158k1687R709K6036j780
17823G6605k0972j4604l0701p5099r663L6464O343K4576K1423K7785J0532j6402
17811C6287k6975p433O732M2454K1482l3604j7219k1825M519P025j9868K368L3668
17798B7611L761k8749J4650K8484L0491O470M781K2950l316K669J3187k7164l3218
17785F2607L343O902J1199k1198K817J6445j3775k5802J0400j4020K6966L4286
17773A00170K1724L5933M4044k1428p0946p0036k6743N564R603J8885k1540L9404
17761F4634O4726j1081j3984R960p0078l6198L5820M242O324j9453n7345R087
17749a3346J8643M0245k1868l55j3690P851j8851m3168K5990q18l0761K2615J96
$$ y = [276799, 272567, 263919, 218382, 137237, 70690, 56552, 57210, 52169, 64327, 42640, 52349, 78385, 76605, 55633, 41029, 10328, -64771, -74434, -37970, -31627, -7051, 14372, 42157, 52689, 36287, 9312, 1879, 8611, 51065, 72547, 38943, 21724, -101, 4418, 11443, -8425, -6057, 27611, 31372, 2623, 17273, 45757, 76248, 82718, 87499, 110449, 107133, 109802, 122989, 95825, 62607, 65950, 72852, 84051, 62853, 65670, 82115, 68340, 42538, 52938, 38918, 65884, 100170, 121894, 157827, 201871, 180443, 109497, 39461, 12718, 18282, 27885, 46770, 25230, 64634, 129360, 118279, 104295, 114255, 44177, 7979, 43799, 48041, 54365, 34912, -22433, -13346, 5297, 45542, 23674, 23319, 9629, 17480, -1371, -44539, -18549, -19367, -50128, -27513, -27317]
17736b7317J3173M4951j2855L976J9374m4123p883J3940M5796O1958p246M8888
17724A52632M2203K5346j1173j5414j3779M8732J8101n0455j6767R892k6399l3227
17712A29692L1173J8961k1906m0536L441m0150j7248R975J8557N246M409k1839
17700G9775j3124j3014k0884k785m3771k9203J4584R1J8054k6530k7028J764k2230
17687h4301K8145M5826m313l7415M756k7722J1874K3750K001k233L3440L5815
17675B9623K9620J9410L8234j3034k0562m4581l1504p08L2027L5881o453J2010
17663G9963L7906R948l7857l808R488l6797n7652q046L6379J2702n8590m3775
17651f0139j3933J9888m321J9138K0757L8776l8581m6806j3841K9816O8461M4489
$$ y = [-27317, -14144, 30807, 17952, 21928, 41302, -2821, -10704, 3236, 49032, 110990, 103744, 152632, 194835, 220181, 209008, 193594, 179815, 228547, 246648, 196193, 179426, 189318, 162919, 129692, 160865, 179826, 157920, 117384, 120825, 80675, 63427, 73402, 91959, 97205, 101614, 79775, 66651, 53637, 32753, 29968, -13803, -43006, -28422, -28331, -10277, -36807, -63835, -62071, -84301, -56156, -10330, -14643, -52058, -47302, -75024, -63150, -39400, -37399, -39632, -6192, 29623, 59243, 78653, 116887, 103853, 83291, 38710, 7206, 6498, 38525, 74406, 67953, 79963, 117869, 127817, 89960, 86152, 95640, 58843, 1191, -6855, 29524, 42226, -16364, -60139, -74072, -54184, -58505, -39367, -18610, 20166, -18415, -65221, -79062, -49246, 19215, 63704]
17639F3704m151l2454l2320M2061r990k6168j6932m8024k0853K0777R549M6922
17627g879M0984J4656l297j1010l7821o540J8968R40m6051P886J3187K5202J1629
17614B0854r248j613k242k9136k0313K3935J9548R491j1083k0638k3915k2051
17602f6411l1577R565L4240L0857L9663j8741j8936q988j9932j1723O810n748
17590f0921j0427M4323K4298M063K8831J3540K0912k1570m3450J1240J6940k4715
17578C064j011J3962j1353j3135M113l9638J2118o38j4892J4213l5829m7030K9277
17565h6779N4029K0894j358K1479L0762l0198r571j044N3194L5289j1859j001
17553G3837m9185m5164o369q821q949l4817K8579M7520K1373l1093j0979j5744
$$ y = [63704, 59553, 27099, -5221, 36840, 26850, 682, -16250, -64274, -85127, -64350, -54801, -7879, 33105, 47761, 44464, 33454, -4367, -10907, 8061, 9001, -37050, -29164, -15977, 9225, 20854, 11606, 9993, 7751, -21385, -41698, -17763, 1785, 11276, 193, -20445, -44360, -66411, -97988, -88423, -54183, -23326, 16337, -2404, -21340, -30328, -50260, -61983, -55173, -60921, -71348, -27025, -2727, 1336, 30167, 43707, 64619, 43049, -401, 10839, 27779, 3064, 2053, 16015, 4662, -8473, -4360, -43998, -31880, -32518, -47410, -33197, -69026, -116056, -86779, -32750, -11856, -13214, 8265, 39027, 8829, -742, -1786, 51408, 86697, 74838, 73837, 24652, -20512, -26881, -35702, -44651, -79468, -50889, -3369, 18004, -13089, -24068, -39812]
17541c9812J4297K4891R160J6693m9501m4526o500k8514j9378N5632K8611J5394
17529b3553N021L274l4968o017l3330p304L0483K9425L3010q423k7099l019J7479
17516b5021J6382J722j1535P221p918k5919N683k287j9494J9212J8236M140K342
17503a7236J6445J3307k23j3660k9685k1136R476J3084j6602n409M7987K1375
17491A7723P996J426m1246J3835n840l7482j7030L6586L2509K9646l0105l792
17479D226k6671j0271L3085M4452l003l5562k864j7549k8521k5801J5954J1082
17467d1443j623N3314j9774k6740l025M9471M9036M4907j8201r3173l8501L013
17455d2739L0858J4262K5662J0132K5286J5083j4429K1924m8968J407Q9456J20354
$$ y = [-39812, -25515, -624, 8536, 25229, -24272, -68798, -75298, -103812, -123190, -67558, -38947, -23553, -18532, -15258, -50226, -56243, -89573, -96877, -66394, -36969, -3959, -12382, -39481, -42500, -25021, -8639, -6917, -18452, -11231, -19149, -45068, -39385, -41672, -61166, -41954, -23718, -19578, -17236, -791, 12516, 12293, -1367, -31052, -52188, -42712, -29628, -46230, -51639, -3652, 17723, 25719, 27145, -14101, -266, -6106, -43588, -60618, -24032, 8477, 38123, 8018, 4226, -22445, -32716, 369, 44821, 41818, 6256, 3392, -14157, -42678, -68479, -52525, -41443, -43066, 10248, -9526, -36266, -39291, 10180, 59216, 104123, 85922, -7251, -45752, -42739, -11881, 2381, 28043, 38175, 63461, 78544, 64115, 86039, 37071, 38478, 127934, 248288]
17443B48288J90814J8038j52615j33524n4598k0197l709k9456j2949o850j2202
17432C1040l575n5275k7164K900R116K6726k0439j9258N5753L1234J4990k4141
17420B1907N983J2645j5206m211j6929j0775j0466O221K3081k8205j2978K376
17408b6557J7913l576M796l5872m2774O223p628L6722M6969j3349J765J3361N356
17395C349J7339q649l0850j7442q117L4248O2352j1033o0583j7660o13M1554J9009
17382B2904Q615q634k6403n0448n3003J9900M9543L9239R542n0512M1559K6584
17370B8886l8752k8457n126K36L478j7115q64j1330R821L2445J0776k4740K9502
17357a1240k5343N190L051J0107J0611K3940q504o727L133P58k0505K446J2638
$$ y = [248288, 439102, 457140, 304525, 171001, 116403, 96206, 92497, 63041, 50092, 43242, 31040, 27465, -27810, -54974, -52074, -42958, -16232, -36671, -55929, -176, 31058, 46048, 21907, 27890, 40535, 25329, 21118, 4189, -6586, -17052, -10831, 12250, -15955, -28933, -26557, -8644, -12220, -7424, -43296, -86070, -79847, -87475, -50753, -3784, -17133, -15368, -2007, 3349, 20688, 12039, -18811, -36253, -44370, -10122, 52230, 41197, -19386, -37046, -37659, 3895, 22904, 31519, 22885, -3518, -53966, -106969, -87069, -37526, 1713, 11255, -39257, 2302, 28886, -9866, -38323, -43449, -43213, -39735, -56850, -57714, -69044, -59223, -26778, -16002, -40742, -11240, -36583, -31393, -28342, -18235, -7624, 16316, 7812, 1085, 4218, 4976, -15529, -13083, -445]
17344d45j361j9532j7053L3940J1046J6786k23k6508N937K434K0177O676j8173
17331A3701j7679j2674L1167M4740j7607k0872l4511o5704Q468M7066j7714K5488
17319a6131L8600K0188K591j0076l1898L3459k730O67j6279J0378J0836M4317
17307H3922j2565k1298k9417p525K3752K3905k3075q953k7388k6251L443o6682
17295h8132l073L1578J8674M3821K0497m2875l3647j1450L0589M1357P596n9446
17283d4511k8210N003J1519O110L3480M7049O98J1765k2636j1365L708K7946j8850
17270B1706j0943J7762j1549m8871O559o024K1027L4909k291m37J403J9569K7023
17257F9843Q915n8170n7082k0599K7633L0614M926q782j7191n7107L9406M1295
$$ y = [-445, -1806, -21338, -38391, -4451, 6595, 23381, 23158, -3350, 2587, 5021, 25198, 31874, 13701, -3978, -16652, 14515, 59255, 41648, 20776, -13735, -79439, -70971, -23905, -41619, -16131, 22469, 42657, 45248, 35172, 3274, 36733, 34003, 34670, 18391, 28769, 39605, 83922, 71357, 50059, 20642, 13117, 36869, 60774, 37699, 28746, 1358, -24893, -21450, -88132, -91205, -59627, -40953, 2868, 23365, -19510, -53157, -64607, -34018, 7339, 14935, -44511, -72721, -67718, -56199, -50089, -16609, 30440, 31138, 42903, 20267, 8902, 12610, 40556, 21706, 10763, 28525, 16976, -31895, -25336, -31360, -10333, 24576, 22285, 21848, 23251, 42820, 69843, 78758, 20588, -36494, -57093, -29460, 1154, 6080, -2702, -19893, -77000, -37594, 3701]
17245C701j8033K8559n952p179J3072l5456J1207k49K4427K8078j9518k0453r87
17232A217J0053P016J3348l5807k0297k176m353K8758J6300j6571k1514M8674
17220B4648M7594L703l0254o5298k3974L0015K6158N1757J2987l995n043k1163
17208D7135P95K650O15m4147k2308k0544J617K7079L0888p276j6199o281L321
17195b655L1206m840K625M8384k7851p4874k6591N0382L0602m330j1863K8369
17183C8564J7970K6829Q388n523k7612L006o80r935o4059p0473n268K9328R178
17170e0287p617R09J0671L2642p205n5336o031L3843J2466K4738L0179J5271l4116
17157A27R037M955l4808l2189k6635K9750M3750L0081J0259q292k8841l6440J8604
$$ y = [3701, -14332, 14227, 8275, 1096, 14168, -21288, -10081, -10330, 14097, 42175, 22657, 2204, 1217, 11270, 18286, 31634, -4173, -24470, -26646, -30999, -2241, 14059, -2512, -24026, 24648, 72242, 75945, 45691, -19607, -43581, -13566, 12592, 64349, 77336, 73341, 68298, 47135, 47930, 50580, 51195, 7048, -15260, -35804, -34187, -7108, 23780, 16504, 305, -5976, -2655, 28551, 23711, 26336, 74720, 46869, -28005, -54596, -4214, 26388, 22058, 10195, 38564, 56534, 83363, 91751, 86228, 58616, 61622, 60942, 51007, -13052, -83525, -88793, -59465, -50287, -57904, -56995, -46324, -13682, -20887, -76223, -82254, -48411, -35945, -11207, 18972, 34243, 127, 9164, 14119, -20689, -52878, -79513, -49763, -6013, 24068, 34327, 26035, -2806, -39246, -20642]
17144b0642n138k0421K9731J1504l8290l2198o017j5193M7187K1042M108m5117
17132f9444J0407L6513m995j416L357l0940K8520J4518J7059M508k343r631J3544
17119I657l264R548K1437l5802m1717j707k2660K268K0415Q988J3070P086K0863
17106H182M9405N3042l8166j3938l8306l4932n424k5275m8361L0236J7986K3791
17094b1760k8582L897L9932J8468m0798K756K9974m5179J9301p621R669M1534
17082B1591K7071L4268M486n5109l5733K771k5205J1146R776m5471J2858L7409
17070a42l95p496q184J1110M8447J9551j5718k5931j3126L4444k8421O690j7844
17057B985l2912k5779K7560O6337j465m8020J4074L3414n1952K1417k9139k6119
$$ y = [-20642, -25780, -46201, -16470, -4966, -43256, -75454, -81471, -96664, -49477, -28435, -24327, -69444, -59037, -22524, -27519, -28935, -25578, -56518, -27998, -13480, 3579, 8087, 5744, -3887, 9657, 6393, 15941, 37378, 1576, -40141, -41848, -64508, -62240, -41825, -32837, -19767, -12681, 8182, 57587, 110629, 72463, 58525, 20219, -14713, -20137, -45412, -93773, -63537, -45551, -21760, -50342, -46445, -6513, 11955, -28843, -26087, 3887, -41292, -21991, -29612, -19943, 21591, 48662, 82930, 87416, 32307, -3426, -655, -25860, -14714, -4938, -50409, -37551, -142, -537, -8033, -16217, -5107, 43340, 62891, 47173, 21242, 8116, 42560, 14139, 20829, 2985, -29927, -55706, -28146, 38191, 36726, -11294, 2780, 36194, -15758, 5659, -23480, -49599]
17045d9599k9254O19L01J5636J4849K5896l0176K9211N1980Q18P265k3112K087
17032A6521j5533o006l1330j9664k6187m8822M56K5165Q375l7607N5947N3705
17020b4980M1687N430j7466k6521K1094k7378M760M4404J5317o6318j6N98k0306
17007d9695M8631N7747R269m7248Q793J3890l128k6303J0521Q581j6216q450p210
16994h18J8606L4536l7679l2345j1671n0549k0483K5394K3247p644n640j2540
16982g7586K2273K5948j5205j2938M4016L1834K5816M0000m3397m4432j9492k5829
16970d8992L1973j6029l1464o74M3597K0663k6725l8766K6479J9060R19m2525
16958f2484L5237M4068M18m3573k4948k134J9260J1069j0707o647j0248J8862
$$ y = [-49599, -78853, -78234, -77933, -62297, -47448, -21552, -51728, -22517, 29463, 30281, 37546, 14434, 16521, 988, -5018, -36348, -56012, -82199, -131021, -130565, -105400, -97025, -134632, -78685, -24980, 16707, 22137, 4671, -21850, -756, -28134, -23374, 21030, 36347, -29971, -29987, -29389, -49695, -1064, 56683, 65952, 18704, 27497, 41387, 38259, 11956, 22477, 31058, 14842, 6392, -818, 17788, 52324, 14645, -17700, -29371, -79920, -100403, -75009, -51762, -59406, -65046, -77586, -55313, -29365, -44570, -57508, -13492, 18342, 44158, 84158, 40761, -3671, -23163, -48992, -17019, -33048, -64512, -65186, -21589, -926, -27651, -66417, -39938, -20878, -19959, -62484, -27247, 16821, 17239, -26334, -51282, -53416, -34156, -23087, -33794, -40441, -50689, -31827]
16946c1827J9482n021J4764L1919l4955m2787j5709L2251o216K1370Q025K8064
16934A9360m486m7047m2096q760N299K5780j8438R189L3266J1144m332M9741J9525
16921D8145l9072l4374J5838o148J474o380j5216O1302j4450k4383j7065k2448
16909e2777J9659O8286K2366m3154j1986O245l1402j8760l736N5950q13k4702
16897a4824m4126J3916R137N3582J4571k3864J342j4722K6539j517l5613j1828
16885b7407R571k36m0539j4900j3272N6389J1433p847K372P482J0439k5904J0053
16872b2366M2979L6807j1277k2417k0763k450J0826O627l9216m1505M644J8680
16860c9431o511J6940K9455K305K9905Q030k1378j2757M2281L8280k9409p6529
$$ y = [-31827, -12345, -17366, -2602, 29317, -5638, -48425, -64134, -31883, -38099, -16729, -8704, 19360, 14874, -32173, -74269, -83029, -77730, -51950, -70388, -61199, -27933, -16789, -21121, 28620, 48145, 9073, -25301, -9463, -15611, -14137, -20517, -35733, 25569, 11119, -13264, -30329, -52777, -33118, 35168, 57534, 14380, 2394, 8639, -22763, -41523, -45259, 10691, 9878, -14824, -58950, -45034, -35897, 17685, 32256, 8392, 9734, -4988, 21551, 20034, -15579, -27407, -17836, -18072, -58611, -73511, -86783, -30394, -18961, -26808, -24436, -16954, -6515, -32419, -22366, 20613, 57420, 46143, 23726, 2963, 513, 11339, 17966, -21250, -62755, -58111, -39431, -45942, -29002, 453, 2758, 32663, 40693, 19315, 6558, 48839, 87119, 57710, -18819]
16848a8819k4968J691K6772N8761K0037j3092o372j1339k6783P703k1756k5290
16836c3455L2909J3356J6609j1609K119J4524l50m2703N575l1321j8577k0076
16824g2999K5097N0754o951j9942k1472J6254L0388j5734n875q98J9256N918j493
16811B303m540q513j0849K1276j2497J0043J6359N0629J1118m9752j3057j3837
16799a317J7740l2078N243M577J200J2905J2740J6918O087l0812l9814L1918K6775
16786C2082o141k5276O217q275j5596j1949p923J8361p428l0193q585J3536J6749
16773c4421j719K3122L0803J9338K8215l9065k5750l7504J1945J8807J1650J0457
16761A5878k8530J141r19l1370M533p14n818J9965N2967j9303j4365Q172K1404
$$ y = [-18819, -43787, -42096, -15324, 43437, 63474, 50382, 44010, 32671, 5888, 13591, -8165, -33455, -546, 12810, 29419, 17810, 19929, 34453, 34103, -8600, -3025, -34346, -52923, -72999, -47902, 2852, -4099, -24041, -45513, -29259, 1129, -14605, -20480, -21378, -2122, 3796, 2303, -2237, -10750, -21599, -323, -12820, -2777, 13582, 64211, 75329, 25577, 12520, -1317, 16423, -15655, -10412, -5835, -4635, 8270, 21010, 37928, 44015, 13203, -26611, 5307, 32082, 25941, 665, 6882, -1393, -16989, -28938, -36861, -18500, -25928, -56121, -64706, -51170, -34421, -36140, -13018, 17785, 37123, 65338, 26273, 523, -36981, -25036, -6229, 5421, 15878, -12652, -11511, -12430, -43800, -39267, -39981, -45799, -25834, 27133, 7830, -6535, 1637, 23041]
16748B3041P779k9919j9426J7274q936l6183j7336M5246L0214m0537R022P042
16736a2719J219r849J6841n9508k8337n696L4968L5063k5310J4096q119K255m494
16723d9590J1802K3149K1479L1099M677m6515j8025J994N9989M1725m1352k8715
16711A1717k7153k6751M294N683m785k3708r568J3770L6876K6908j2205l4611
16699c9533j6080K0807O071J6487r47P026N2800J8087k3875k3168l533N810k0286
16686c34N539J0757J6616N6546o270o1882l0951l0562k5875L2715j0768K7812
16674a6657M7110k1053l9299P490L6206m3740Q375L0330l1866m2131m272K1686
16662d7821K4254p367L3366j9098o393j8207J1665J5070J5925j6675j8045M8815
$$ y = [23041, 30820, 901, -18525, -1251, -10187, -46370, -63706, -18460, 11754, -28783, -19761, -12719, -11500, -21349, -4508, -64016, -92353, -98049, -63081, -28018, -53328, -39232, -47351, -45096, -49590, -37788, -14639, 6840, 37939, 42616, -3899, -21924, -19930, 40059, 81784, 40432, 11717, -15436, -42187, -37893, -32210, -36995, -60703, -70271, -56501, -19625, 7283, -4922, -39533, -55613, -34806, -28735, -12248, -13195, -6169, 46631, 64718, 40843, 17675, 14142, 19952, -334, 5205, 15962, 32578, 89124, 82854, 20972, -9979, -40541, -66416, -33701, -44469, -16657, 30453, 9400, -29899, -22409, 13797, -29943, -21568, 8762, -23104, -65235, -69507, -47821, -23567, -30934, 2432, -16666, -23059, -41266, -29601, -14531, 1394, -15281, -33326, 15489]
16650A5489K6486j6246k6776Q661j7259m913J2888J4655n0321k1730o006J8709
16638d6363O4165L3459j1276m5297l8983n377J2615J6548p393J8734J7775J2555
16626B1162J7007n7421l9534M5331L0156J0049L6437M7918j1405l4734q0831k2181
16614c8046L0675J6072k624j8195L321J2642M6844R019l4269K963L4677m0197
16602B2882J144J0518K9279k9193m5392k3366L848L2109l0997l422L3737j9564
16590a8417m2672J7181N0528L1354L5029N1903m4824k1262n704m2193l41J2944
16578B3526j290J3135P28l483j8383q512K846j2832J228K635L8713k0581j4234
16565C496M3053L5210j2071n3614J5833R596o132J5479J2395L7831j0742o0293
$$ y = [15489, 41975, 25729, -1047, 7614, -9645, -14558, -1670, 12985, -37336, -59066, -65072, -46363, 17802, 51261, 39985, -5312, -44295, -49672, -37057, -20509, -27902, -9168, 8607, 21162, 38169, -19252, -58786, -13455, 16701, 26750, 63187, 111105, 99700, 64966, -15865, -38046, -7371, 8701, 6077, -12118, -8797, 3845, 50689, 59708, 25439, 28402, 63079, 22882, 24026, 34544, 63823, 34630, -10762, -34128, -30280, 1829, -29168, -32590, 1147, -18417, -61089, -43908, 6620, 37974, 73003, 124906, 80082, 58820, 53116, 10923, 10582, 23526, 22236, 35371, 36099, 32616, 14233, 5721, 8567, -4265, -3037, -402, 38311, 17730, 3496, 46549, 81759, 69688, 16074, 31907, 41503, 35371, 50850, 63245, 101076, 90334, 30041]
16553C0041l8086k0196j8073J3826K8673M944j1013J821O08Q837j7545m7549j0415
16540g4127P530J7268J8832K7819J2020J3640l7229r956N5678j850n3146J7706
16528e815L2236K572J0565J2169k3411M392K0348o5505l1368J7412j7145l1306
16516g4856j1541K5942L6091J4042N7348r923L4412n445m6978l8429K1716o843
16504d464j9508N2493M498k6081j1419J2559J0369j337l1664j1161L1879j7755
16492a1591k8425L3848K3538m7644n0758k2705K4012Q854N9615M9257j1485j8731
16480G785K7386k6728l163M0230J2350j2157l9840k1354m5445O048K913J456q087
16467e8606j6956M172k211j1253j7407L7126M7719m026N971J6460k0158l4033
$$ y = [30041, -8045, -28241, -46314, -32488, -3815, 1129, -9884, -8063, -7455, 1382, -16163, -63712, -74127, -66597, -49329, -30497, -2678, 9342, 22982, -14247, -24203, 31475, 29625, -23521, -5815, 26421, 28993, 39558, 51727, 28316, 32708, 53056, -12449, -43817, -26405, -43550, -74856, -86397, -60455, -24364, -10322, 47026, 37103, 71515, 66070, 19092, -19337, 2379, -4464, -23972, 28521, 33019, 6938, -4481, 8078, 18447, 17110, -14554, -25715, 6164, -11591, -40016, -6168, 17370, -30274, -81032, -103737, -79725, -70871, -11256, 38001, 26516, 7785, 35171, 8443, 5280, 45510, 57860, 45703, 5863, -15491, -60936, -54888, -51975, -50519, -58606, -75562, -71390, -73601, -84854, -102261, -65135, -17416, -21442, -15471, 989, -19169, -53202]
16455e3202k1862K7772L2169J4409K5712K1445l4399j6801J6202q923j3565L2860
16443B1817K9257k5241o4333j8256L713J8236J9970L8184N4553N0915j2377l8368
16431G8070m6729k4073J2924L165P280n4463k7264L6632L6439j2748l3502k1209
16419d5478j1536r118O6738M0320M343j8708J0018n8075j0848L3034L5950K0954
16407E7594m504m8538J5362k0170j6467r869j9881m561K1106k0571K1028n587
16395c5058L1851L2960O091L666j5656k1005j8090k1642K3628O982m7456O258
16383d7471k466j4097M5597K3958j1803l6211O077N2047J2628k0234l0805p945
16371c0725O009M1615M3902l45k3911k2855Q09m7277m4531L2418N8983K0217k8871
$$ y = [-53202, -75064, -47292, -15123, -714, 24998, 46443, 12044, -4757, 11445, 2522, -11043, 21817, 51074, 25833, -38500, -56756, -53043, -34807, -14837, 23347, 77900, 128815, 116438, 78070, 31341, 7268, 20192, 23357, 30637, -23826, -51090, -14458, 21981, 9233, -24269, -45478, -57014, -66132, 606, 40926, 45269, 26561, 36579, -21496, -32344, 690, 36640, 57594, 53090, 4552, 19914, -256, -16723, -26592, -46473, -51034, -29928, -50499, -29471, -35058, -3207, 29753, 35844, 39510, 23854, 2849, -15241, -36883, -13255, -6273, -53729, -47471, -49937, -64034, -18437, 5521, -6282, -42493, -36416, 15631, 28259, 8025, -22780, -30725, -24716, 16899, 60801, 60456, 36545, 13690, 14499, -32778, -77309, -44891, 14092, 34309, 5438]
16358E438o686j8787R223l5145l722L5295K0833K7593K204K7633j7191M395k6209
16345B4874j0482n4327k524J7319O9917L8586J48j4033j4044q17l8847l4033j8109
16332c6372L5450N5133K6798l0918n8196m3496j3483J8317K5912K1569j1584J547
16320i323J4777K9217j0954m5516K2921L2682j6302k6155N365n887K6471j2385
16308D911J085j8064R677p430J2561k4701J186j439l1132p999J8711N7242K9152
16295D3760J8070m040M737j7857J4484j0652j2567n183K7206m885k1579k2008
16283I486l0227k7118j9815L492L0658M3866J1867j5090l9121n756N6040l5124
16271a6842l8434K862M0415L3271m5128m7744k7975J7262M1135J8909k061K2759
$$ y = [5438, -1248, -20035, -10812, -45957, -49679, -14384, 6449, 34042, 36246, 63879, 46688, 51083, 24874, 14392, -39935, -42459, -25140, 44777, 83363, 83511, 69478, 55434, 54617, 15770, -18263, -36372, -922, 54211, 81009, 50091, -8105, -51601, -65084, -46767, -20855, 714, -10870, -9323, 5454, 34671, 23717, -21799, 1122, 33804, 17502, -8653, -3288, -9175, 17296, 4911, 5996, -12068, -2391, -9821, 2740, -21961, -20775, -22214, -53346, -61345, -42634, 14608, 43760, 61830, 57790, 62527, 44670, 59154, 48502, 35935, 30752, 57958, 53073, 31494, 9486, -20741, -47859, -67674, -64182, -33524, 10342, 22209, 7119, -32002, -37758, 18282, -16842, -55276, -52414, -11999, 21272, -23856, -71600, -99575, -82313, -41178, -22269, -24330, -1571]
16259a571K0739o64k1346k3613l5708k367J3902J9319J8865L4385j2304L625L5669
16246D8931J2914j5990j2123j3131n7K1906q319k5819J6110o367k9191J6615J6948
16233B2427k983q437o2314k8128o779K0171L2031j1914J8210M6485M8245O196
16221G3210j4745J0416M689k8605m0904n0972k1284j2826k011K475J3128J829
16209f5600k680L2679M9582J4852K823l1565m0150O21j0444J7983L0403K8415
16197B6919q056j8013l4927k7614j4934J0666L1172l6108K4661M1731o714k7306
16185c8523L6248M6711J4931j996k8469n1155J6540K1421J2024q577k1361P681
16173E475k9468O972L916J0530j1668L0422q113K5800J6739p28k1293k9375O229
$$ y = [-1571, 19168, 18504, -2842, -26455, -62163, -64530, -50628, -31309, -12444, 21941, 9637, 13262, 48931, 61845, 45855, 33732, 20601, 20544, 42450, 34131, 8312, 24422, 18055, -11136, 5479, 22427, 19444, 11007, -51307, -79435, -86214, -66043, -34012, -45926, -27716, 18769, 67014, 73210, 58465, 68881, 73570, 44965, 4061, -46911, -68195, -81021, -83032, -80557, -67429, -65600, -68280, -35601, 13981, 28833, 31656, 91, -40059, -39438, -49882, -31899, -1496, 26919, 18863, 850, -34077, -61691, -76625, -65959, -34787, -70895, -46234, -4503, -11217, -38523, -2275, 44436, 59367, 57371, 28902, -22253, -5713, 15708, 27732, 19155, -2206, 5475, -23993, -17021, -13105, -2575, -14243, 16179, 8066, 33866, 50605, 49877, 28584, -791, 5438]
16160E438J946l0380p79K2524k0382J3009K7171j513J1442J3906M91L590m0662
16147E801N452l5226J358K8295J0985j8560j545M8329p670k1318L932J3112N2030
16134H4975L9947m1618m5518o0689L6004O8n7805l8049o583K4392M3596M0767
16122A9487n572r09j525q204K5106L7061J5717k5035q303K129k2146j4066L6814
16109E0554k9439n6227k5629K5584K2374l5053l7498N413M1511O6777n055N5814
16097G9126J8266j6645k3899m8383o128p267j2197j4978k2074k2533Q999K7297
16085d0416J8326K2762K914J4265L0020j8864k0713j3910J6898j9715k3491J769
16073c0155L2029M1651K1518p94m6438k1070k4190M8776L3456J0403k0678o3612
$$ y = [5438, 7384, -22996, -23775, -1251, -21633, -8624, 18547, 17034, 28476, 42382, 42873, 46463, 5801, 11253, -23973, -22615, 5680, 16665, -1895, -3440, 44889, 37219, 15901, 19833, 32945, 84975, 124922, 83304, 37786, -22903, 13101, 13169, -44636, -82685, -89268, -64876, -21280, 19487, 13915, 13006, 11481, 3277, 28383, 65444, 81161, 56126, 47823, 49952, 27806, 13740, 50554, 21115, -35112, -60741, -35157, -12783, -47836, -85334, -79921, -38410, 28367, 23312, 79126, 97392, 80747, 56848, 8465, 2337, -4930, -17127, -32105, -54179, -76712, -67713, -40416, -22090, 672, 3586, 17851, 47871, 29007, 8294, -5616, 11282, -8433, -31924, -30155, 1874, 43525, 65043, 64249, 17811, -3259, -27449, 21327, 54783, 65186, 44508, -19104]
16061a9104j4720K4478K8131L0160j3390m9246l0248J0479J0595J3595K4915q938
16049F707K8194j7726m2776J553K1699N383m1467k2740K0010K584l5065J6878
16037e6766l5983P423j8010j9606M0963L7546m630j7284j1121J5141O5306M4676
16025D7655k2145l2041q354K490J0548J3848j0940K144J4243K5023j2731L458
16013C3198k8829l3587L0627k6483o5489J6097J9352J4785O403k131J5751R785
16001a0521k706K8830J134l5853J5203J0423r186J9740k4146j7063K2322L4838
15989C3015P006n0591l1459J4531k4386l1844K9562K1561O480J0726j9165L0090
15977d474l1049j6759M6798q221j2001M524P568K2988K7464K1702j8608K7474
$$ y = [-19104, -33824, -9346, 18785, 48945, 35555, -13691, -43939, -33460, -22865, -9270, 15645, 6707, 34901, 17175, -25601, -24048, -2349, 3034, -38433, -61173, -41163, -38579, -73644, -56766, -92749, -85326, -103336, -122942, -81979, -44433, -49063, -66347, -77468, -62327, 2979, 47655, 25510, -6531, -14885, -12395, -1847, 12001, 1061, 3205, 17448, 42471, 29740, 33198, 4369, -29218, 1409, -25074, -90563, -74466, -55114, -40329, -33926, -36057, -20306, -10521, -13227, 15603, 16737, -19116, -3913, 6510, -2676, 17064, -7082, -24145, -1823, 33015, 40021, -10570, -42029, -27498, -51884, -83728, -54166, -32605, -26125, -15399, -34564, -4474, -35523, -52282, -5484, -13705, -25706, -21182, -13614, 9374, 36838, 58540, 39932, 67406]
15965F7406M4365m1759p6495K7363Q7968K3752o1142m1776j5059k8552K6997M5320
15953E8388m446k377l5426j7097L589J8029K3593m280n988Q615l2212l871k0476
15940a3959m2058j4510L9188J0597j551r203J2938O1876J8173k5520Q557J32m5254
15927e94j652L9030K4274j4423j6625J0558k9j4260k777l4484o3569Q427L0702
15914c5422R894K4778p545K7988J9678m2926l7284r798l525P8204M5363p231n085
15901E7089k5873m02J431l3785j039j774j6583l4643N405R402M6282j0620j3590
15888a8700K6192K140L9266q524l5069k177K4803K304j3487L5118L806L0458j1512
15875G4618o3155O129j1521n869r180l3256r577O3568K0607N966j692K1196p871
$$ y = [67406, 111771, 70012, -6483, 20880, 108848, 132600, 71458, 29682, 14623, -13929, 13068, 58388, 53942, 51565, 16139, -958, 2631, 20660, 44253, 39973, 33985, 42600, 10388, 6517, -13959, -56017, -70527, -31339, -20742, -22293, -31496, -18558, 43318, 61491, 35971, 44528, 44660, -594, -2246, 36784, 61058, 46635, 30010, 40568, 40539, 26279, 23502, -10982, -74551, -66124, -35422, -25528, -750, -8295, 19693, 39371, -3555, -40839, -50637, -54162, 24042, 69405, 62174, 57089, 31216, 30814, 32245, -1540, -2579, -4353, -20936, -55579, -50174, -40772, 5510, -5110, -18700, 7492, 9632, 48898, 40374, 5305, 3128, 27931, 30235, 16748, 51866, 55672, 86130, 74618, 11463, 17592, 6071, 202, -8978, -42234, -51811, 11757, 32364, 38330, 36638, 57834, 49963]
15862D9963k5621n8858j6587M0426O7893M3661l0147m4430k8750O094K807L1103
15850C7554m944r501o1113k4804N7309Q336L2266K3621j5393k7090N656k6788
15838d891O914m647j1018L422L2420K5502K7545o4839n2728K5510M1063M050j0224
15825A8079J1702l936J019j0549M306N214n230j9705j3075K5997L3785o802k8147
15812A2658n5370j8426R540J8214K1001o57J3621P987J8192J4985l8772k8838
15800b5865k706K7114k2750K332k140R393K5471r407l6151j1243M0048K6526k3744
15787c122k593K4205R395m7313l437K4352M638l2573J2962J1494M30O57K7489
15774B6584R422r465k7971K3343J0292J0510j2877J420m3395J071K4798j9856
$$ y = [49963, 24342, -34516, -51103, -10677, 57216, 100877, 70730, 26300, -2450, 3644, 6451, 37554, 32610, 23109, -38004, -62808, -5499, 2837, 35103, 58724, 43331, 16241, 21897, -4891, 2023, -2624, -13642, -10220, 22200, 47702, 75247, 10408, -42320, -16810, 24253, 28303, 18079, 29781, 25845, 26864, 16315, 20621, 25835, 20605, 900, -12175, 13822, 47607, 40805, 12658, -42712, -61138, -51598, -33384, -12383, -13040, 581, 8568, 26760, 41745, 2973, -25865, -28571, -1457, -24207, -21875, -24015, -14622, 10849, 1442, -34709, -45952, -5904, 20622, -3122, -5715, 18490, 27885, -19428, -22865, 1487, 6125, -26448, -13486, -1992, -1562, -905, 26584, 36006, 26541, -1430, 21913, 32205, 42715, 29838, 31258, -12137, -11066, 13732, -6124]
15762f124j1899m8472j3418M2705M5456l925K9841L0392j8634j2186K5537L266
15750F2539l1645k0296J6638l5220j1756j7753o0399K7808K8676M5633K1932k3707
15738B450l1865L4322N5602j9274k2137l530o356J8695N313k1650k1391o486Q649
15725g658J1246M1679J1677k1591P299K8504m2820o2440J1449N1787L3508m3421
15713A9219j7655j9949k8083L2428M8210N1640j5098l2159k3078j4702k1146o380
15701b6753L1382M5306O810k6500j2175K1444j405n1813k6865K9785l8761j8725
15689f8270O698L4409L4335J2371K4191N3590L4209j4802n1016l5436j6104J1448
15677B5623J014J6816K2009O416k1160l1027j2318j445j3778M6800N0025k0144
$$ y = [-6124, -18023, -66495, -79913, -37208, 8248, 4323, 34164, 64556, 45922, 33736, 59273, 62539, 30894, 10598, 27236, -7984, -19740, -37493, -97892, -70084, -41408, 4225, 26157, 2450, -29415, 4907, 60509, 41235, 19098, 15568, 9212, 27907, 33220, 11570, -9821, -16307, -7658, 3588, 45267, 56944, 35353, 42652, 71156, 28336, -34104, -22655, 29132, 62640, 19219, 1564, -18385, -46468, -14040, 34170, 85810, 70712, 38553, 15475, 773, -20373, -26753, 4629, 49935, 56745, 30245, 18070, 39514, 38109, -13704, -40569, -10784, -49545, -68270, -61572, -27163, 7172, 19543, 43734, 97324, 131533, 116731, 65715, 30279, 14175, 25623, 26637, 43453, 65462, 71878, 50718, 19691, 7373, 5928, -7850, 38950, 88975, 68831]
15665F8831k3137j976m6573l3793J5314j6715J8592j795R019J0451l3307L6955
15653A866l108j1740j5076q614N1617K0501m5425m5776k9452J643L4863M161K6902
15640a7638K0271l3665P036l822K1639Q627k2953j4274K0615J2055k0816L2006
15628I081o747P770K239J4923O115L813m666P675l483Q16l9208J2787L029r608
15614D536j1323k9276j2227N927L0278L2790J6765K5380J0220p760m2169j4775
15602H366p059L3198k893j7033k4881l7520K9425M872m5849q821K4555M0141K4668
15589B1169j8820K1280M311L566K1363P933m640j5465n3115p590n36J0364K0823
15576A0643J9430J4439l1088n245J7038K2065M9723k1742k0564j4879k587P647
$$ y = [68831, 45694, 43718, -2855, -36648, -21334, -38049, -19457, -21252, -12233, -1782, -35089, 1866, -1242, -12982, -28058, -36672, 14945, 35446, -9979, -55755, -85207, -83564, -48701, -44540, -17638, 2633, -31032, -23996, -27818, -6179, 2448, -20505, -34779, -14164, -2109, -22925, 9081, 2334, 10104, 12343, 27266, 33381, 37194, 32528, 40203, 36720, 37536, -1672, 11115, 14144, 4536, -6787, -36063, -48290, -42363, -12085, 20705, 37470, 62850, 73070, 65310, 23141, 8366, 1307, 34505, 31612, 14579, -10302, -47822, -18397, -13525, -59374, -68195, -43640, -3499, 21169, 2349, 23629, 27940, 31506, 52869, 60802, 56162, 40697, -12418, -20008, -20544, -10180, 10643, 30073, 44512, 13424, 8179, 25217, 47282, 97005, 75263, 54699, 39820, 37233, 44880]
15564D4880M8246l2641j9095J9738l1477k7544j020p695l1640M6165L349k7066
15552a5800K4910N1405j919k7872l9288o9349K856P166M0545L3478K1895l0079
15540b052l8676N4610N7260j8317j3005m4356k4084L6715N9937K9621m0676p1597
15528a4620n3533n669O481N571M0834O6673K7091m0032j2661j6395K397K490Q535
15515A7162l7992k480O893J603k1044j2233M930K416o900j7657j5101j2223O1854
15502c0772N7231l1439k3658p075L3968L7524m58R114k1575J7863k9867Q745M5917
15489F5518N0901J8994j4187j5758k3946k0761k7877o6833k8337K5982L5560Q448
15477G704M0391M0098K6113m3810k3996M50q05j7473l619L446J053l1130k2498
$$ y = [44880, 93126, 60485, 41390, 61128, 29651, 2107, 1087, -6608, -38248, 7917, 11266, -15800, 9110, 60515, 58596, 30724, -8564, -77913, -75057, -67891, -27346, 6132, 28027, -2052, -40728, 13882, 71142, 52825, 39820, -4536, -28620, 8095, 68032, 97653, 56977, -14620, -68153, -73822, -67341, -61770, -20936, 45737, 72828, 32796, 20135, 3740, 6137, 8627, 17162, -20830, -23310, -16417, -14814, -35858, -48091, -43161, -40745, -47645, -65302, -80403, -92626, -30772, 26459, -4980, -28638, -35713, -1745, 35779, 35321, 44435, 22860, 40723, 10856, 19601, 65518, 116419, 135413, 121226, 105468, 81522, 60761, 32884, -33949, -62286, -36304, -744, 7704, 48095, 88193, 114306, 70496, 46500, 46950, 46145, 28672, 25053, 28499, 29552, -1578, -24076]
15464b4076J9927L1827k7417j6439L0543N4470J5244l5093k2472M0039k6189m0658
15452b94N424L1269j7849m0058k5203o152L711Q806P696j5907K6219J0465N7965
15439D6092j376p762j5360o880n0287Q814J4997J010j4303k7838k0670J1083K7712
15426c4768N5998J4393j7265J5168K9176l3792l9845k126j970J3345O1829j1455
15414D8688l7708k8171p003J5819J5235J0496J167J3597l3884k2997j4037J7622
15402b1176P886P821k4799k1760L1321N811J397j0874m361Q040J4395k8305M185
15389c0419q236r334J9375J9397N0360K4975K0065k3549j8122l2111Q731J0847
15377C1979K3974J9459K3893j1199Q43J200m1170r306l099j0092k5223j0312K1074
$$ y = [-24076, -4149, 27678, 261, -16178, 14365, 68835, 84079, 48986, 26514, 66553, 40364, -294, 5130, 36399, 18550, -21508, -46711, -52863, -49152, -40346, -32650, -48557, -22338, -11873, 46092, 44716, 36954, 21594, 14714, -35573, -26759, -11762, -10752, -25055, -52893, -73563, -62480, -34768, 21230, 35623, 18358, 33526, 62702, 28910, -10935, -13061, -15031, -1686, 60143, 48688, 10980, -17191, -24194, -8375, 6860, 17356, 18523, 32120, -1764, -24761, -38798, -21176, -13290, -5469, -30268, -52028, -20707, -14896, -13499, -24373, -28734, -20694, -6299, -34604, -30419, -38655, -47989, -28614, -9217, 41143, 66118, 86183, 62634, 44512, 12401, 21132, 31979, 55953, 75412, 99305, 88106, 88949, 90149, 48979, 39673, 36574, 26482, 1259, -9053, 12021]
15364A2021j5169l1618K5638J1118k4461j1758M0485k6609j9633j1560q708L947
15352e6307k7295L5739O7554M6115l3860l383k4533J6327K6659Q165K943J8319
15340G6443J3843N1677M101q9157o6335k168M7394p384k4157k098K1094j0588
15328A2665M046L0586J6065k8604j5162j7203J0111R138K1153J5555j9781J4839
15316E3408O717K5442k1035n1293J1093L7696p7002m7157K4801L7182J2931r821
15304B962k947l464N3995J5636k322K1567k4504m3410J0220J0242Q535J3354j8844
15291D1020J3682p528n734L429J2115L4032j6303j3150K1900J7643j5050K515
15279H8571l447j8412J924l983o992j3648l7904K3156O829j010l4923K38R87K0719
$$ y = [12021, -3148, -34766, -9128, 1990, -22471, -34229, 6256, -20353, -39986, -51546, -60254, -56307, -83602, -47863, 19691, 65806, 31946, 28563, 4030, 20357, 47016, 55181, 58124, 76443, 90286, 141963, 146064, 56907, -9428, -11596, 35798, 28414, 4257, 2159, 23253, 12665, 16711, 47297, 63362, 34758, 19596, 2393, 12504, 21642, 42795, 58350, 38569, 53408, 60125, 85567, 64532, 13239, 24332, 62028, -14974, -62131, -37330, -148, 12783, 2962, 15, -3449, 50546, 66182, 63860, 85427, 60923, 17513, 27733, 37975, 46510, 59864, 41020, 54702, 47174, 41440, 44869, 56984, 91016, 74713, 61563, 83463, 101106, 86056, 88571, 85124, 66712, 68636, 64653, 57661, 44013, 6109, 29265, 36094, 35084, 161, 399, 1386, 22105]
15265B2105K2686l3261k0388N6833J1963q618l4192j5230Q314O539J8999L5671
15253G1421R588m2191M6146J9375K2704J3473j4570K9077j0849m0675n2780O906
15241E7625L4770L5819J9482r797L7632k2041n334J6398o187K4545K2573K9514
15229B34999P7722P1628O6495J30558K44161L12909L22013K09902N1338j31646
15219A590079k53630l12946l28741k23492j02923n9907o5079n7322l3845k1579
15209A30615m457L905j6962M910Q717j983j6374M721k0697k7424R880k107q842
15196F3902j1606m146K2762k4900o25J2535L1762K2787l3123L4170Q755j874l2494
15183H7905k6121K0617J2372n2180n0691m1892J4329Q627K1295L741J3672k2186
$$ y = [22105, 44791, 11530, -8858, 47975, 59938, 51320, 17128, 1898, 10212, 16751, 35750, 71421, 81009, 38818, 84964, 104339, 127043, 140516, 125946, 155023, 144174, 103499, 50719, 57625, 92395, 128214, 147696, 137899, 175531, 153490, 148156, 164554, 158367, 182912, 205485, 234999, 312721, 384349, 450844, 581402, 825563, 1138472, 1460485, 1670387, 1721725, 1590079, 1336449, 1023503, 694762, 471270, 368347, 308440, 243361, 186039, 152194, 130615, 126158, 130063, 113101, 118011, 126728, 124745, 108371, 113092, 92395, 64971, 74851, 72744, 63902, 52296, 48150, 70912, 46012, 45387, 57922, 89684, 112471, 79348, 113518, 122273, 120399, 87905, 61784, 82401, 94773, 42593, -8098, -49990, -35661, -27034, -5739, -1998, 11674, -10512]
15171a0512j1020J2803j3000L9600K9650K496j4543P580J1105K0680k6734m1613
15159F492k6133j6652J6620K6567L5471k4948K768M1992N650P259K9583K4266
15147A28935j9885j3568m9254k0785J6467o033J7077K5602K0457n5348l6044o084
15135A537j7964L218K484J8889j3523n801j3382j1688J4110J2362L66N772M5089
15122D1469j3523m4705K4653O2100j9325j6247k493J1401R228J0513K4322J0573
15110I7966k5528p612Q543J5573r590k7883M467j7317J412L5655j8135j7089k1580
15097A8882j5947L3336M5954K4178J955n3094j3109R995j2094k23M855J0598M6585
15084A01871K8503l1894l8005K0155m412L3676L8055l9665l1651M9106o8431j9368
$$ y = [-10512, -21532, -8729, -21729, 17871, 47521, 50017, 35474, 43054, 54159, 74839, 48105, 6492, -19641, -36293, -19673, 6894, 42365, 17417, 20185, 62177, 67827, 75086, 104669, 128935, 109050, 95482, 46228, 25443, 41910, 35877, 52954, 78556, 99013, 43665, 7621, 1537, -16427, -13209, -10725, 8164, -5359, -11160, -24542, -36230, -22120, -9758, -9392, -3620, 41469, 27946, -16759, 7894, 69994, 50669, 34422, 31929, 43330, 52558, 63071, 87393, 97966, 72438, 64826, 73369, 88942, 79352, 51469, 55936, 38619, 40031, 75686, 57551, 40462, 18882, 2935, 36271, 82225, 106403, 108358, 55264, 42155, 52150, 40056, 39833, 44688, 55286, 101871, 130374, 98480, 60475, 80630, 76218, 109894, 147949, 108284, 76633, 125739, 57308, 37940]
15072C7940K7387J1464R817q817o3243k1517L4396l1146L719K7385L3876k0387
15060D0874j1859O053j6978J2258O350j704j6008q11K2234j8435j5194j4833l742
15047a1795L8358K0778j8350J0583N524m3P976N864k259N761R224J5214O22M3833
15033A31290J3030j432j5709k9275k1625P2777O8094K8047N9840J9190j7650l0934
15021B75643o4401j9831J032l4804o6082r399J1200k456K9930M233J8594J3702
15009A57361K9515J17429J14674J91007J35116q4149j54559j58032j00696Q894
14999B56560P900m5466l3051l1017l1949l6317j2200k0503j2496j3601L6470j7487
14987D6843k139m3092P089J3721j8683j3138J416M6523L1826j3522O71m5667J4646
$$ y = [37940, 65327, 76791, 86608, 77791, 14548, -6969, 27427, -3719, 0, 27385, 61261, 40874, 29015, 35068, 18090, 30348, 36698, 34994, 18986, 18175, 40409, 21974, 6780, -8053, -11795, 26563, 47341, 28991, 39574, 45098, 45055, 53031, 58895, 56636, 62397, 71621, 86835, 87457, 131290, 144320, 142888, 127179, 97904, 76279, 149056, 217150, 245197, 305037, 324227, 306577, 275643, 211242, 191411, 192443, 157639, 91557, 82158, 93358, 90902, 120832, 125065, 143659, 157361, 186876, 304305, 418979, 609986, 745102, 660953, 506394, 348362, 247666, 256560, 264460, 218994, 185943, 154926, 122977, 86660, 74460, 53957, 41461, 27860, 64330, 46843, 44704, 1612, 8701, 22422, 3739, -9399, -7983, 38540, 70366, 56844, 57515, 11848, 26494]
14974B6494M1454k1763P347L1366O995K9477N7349k9698j7326K2860J7261J4031
14962A85847J5999R746M5847J3705j2798l6387j9039l5454l6411j0598N468J2315
14950A38240K2032j792l5991n3118J8931J4463M205K4338K2580m571q13j3687
14938A34817L5725R378J9067L1749j9312j4053l5509M4290L53K5275O8289M403
14926C04472K8872R8239J00022J39583K40688M50485N48268N01923L58168Q7044
14916B857764k22125m23198n37000m68438l63837k02187j38905p8254k4925k8164
14906C70731k2269j2426j2308L117M843m9270K5548L9833j0285K018J0169j5214
14894C34487j4224K6827l6403r3396J2209N1603o408l425O048m0593J4992K5225
$$ y = [26494, 67948, 46185, 53532, 84898, 91893, 121370, 178719, 149021, 131695, 154555, 171816, 185847, 201846, 211592, 257439, 271144, 258346, 221959, 202920, 167466, 131055, 120457, 125925, 138240, 160272, 158480, 122489, 69371, 88302, 102765, 106970, 131308, 153888, 149317, 148504, 134817, 170542, 179920, 198987, 230736, 211424, 197371, 161862, 206152, 206505, 231780, 300069, 304472, 333344, 431583, 531605, 671188, 911876, 1362361, 1910629, 2412552, 2770720, 2857764, 2635639, 2212441, 1675441, 1207003, 843166, 640979, 502074, 423820, 398895, 370731, 348462, 336036, 323728, 326845, 331688, 282418, 307966, 347799, 337514, 339532, 349701, 334487, 320263, 347090, 310687, 217291, 229500, 281103, 274695, 271270, 277318, 236725, 251717, 276942]
14882B76942K9442j3530j5972j2247N241J6755l4464k5770J7681P6692p449m7583
14870B65738j0312R227M2621J9547l9195j2310L0948K2701k0233k1926k4631r988
14858B52187R381j3160J1431J4762M851M9809L7365k7632J7777M6456J8860K6875
14846D48962O0413J06582O3403P4478M1699L6953N3647k2244J3317o130m6114
14835H24966m0128l3736l4903K8960J648j1028j6376k7766k006j0673m8020j9600
14823F11338M1102L6879P932R933K5672M0425N4555L0296M7678O2746J46738J23651
14811A238945O8532P3435P5542M2842L1931K1451Q8943J08215J33176K02572J78619
14800B264203J98116J83551J89697K28241K39769L45047M28885N42351P33012
$$ y = [276942, 306384, 292854, 276882, 264635, 269876, 286631, 252167, 226397, 244078, 320770, 313321, 265738, 255426, 264653, 307274, 326821, 287626, 275316, 306264, 328965, 308732, 286806, 262175, 252187, 261568, 248408, 259839, 274601, 279452, 329261, 366626, 338994, 356771, 403227, 422087, 448962, 509375, 615957, 679360, 753838, 795537, 832490, 886137, 863893, 877210, 871080, 824966, 784838, 751102, 716199, 745159, 746807, 735779, 719403, 691637, 689631, 678958, 630938, 611338, 652440, 689319, 697251, 707184, 732856, 773281, 827836, 858132, 905810, 968556, 1115294, 1238945, 1307477, 1380912, 1456454, 1499296, 1531227, 1552678, 1641621, 1749836, 1883012, 2085584, 2264203, 2462319, 2645870, 2835567, 3063808, 3303577, 3648624, 4077509, 4619860, 5352872]
14791E352872J010210J272914J410694J350106J134726Q54499N97247N57035Q96544
14782A4436847J442587K285353L500457N126393P719845J2321563K0571632L4132280
14774A01536957N1381120O4119849O2047067M1598598Q852148k7658995n1979229
14767B49897515o2993838n5694344m1995773k7345660j6660355j0490370p016519
14760B7700656m786378l199654k053181j257546q40460p44858r18726j228832
14752A2671021j559697j694804j590773j335785r95848p26097n75125n31337m16058
14743C245497l44535k56965j92050j58359j36329j41036j28816r3974p7954j19991
14733A595488j46169j41509r3544l6693Q470k8876l7594P3930P2420Q3705J82865
$$ y = [5352872, 6363082, 7635996, 9046690, 10396796, 11531522, 12386021, 12983268, 13540303, 14436847, 15879434, 18164787, 21665244, 26791637, 34511482, 46833045, 67404677, 101536957, 152918077, 217037926, 279084993, 320683591, 329535739, 301876744, 249897515, 186903677, 131209333, 89213560, 61867900, 45207545, 34717175, 27700656, 22914278, 19714624, 17661443, 16403897, 15563437, 14818579, 13899853, 12671021, 11111324, 9416520, 7825747, 6489962, 5494114, 4768017, 4192892, 3661555, 3245497, 2900962, 2643997, 2451947, 2293588, 2157259, 2016223, 1887407, 1793433, 1715479, 1595488, 1449319, 1307810, 1214266, 1177573, 1186043, 1157167, 1119573, 1193503, 1265923, 1349628, 1532493]
14722A532493K16428L21035K79862J55425k0036k18607l60739l98324l33472k60857
14712I13208j81474j15055o0980l4626r864p8236q4327J1654K3401K0941L8043
14701D42685k7387o7634k4758M075j2837n3917m5626p59L1782K9821N0674K9728
14689C55847k6878k284m5834o3337k570K5783J4842J8117J3882l7045m5900k118
14677B02505K4854J2475j5671K979p479J0538k3194m0175j304n0035k2626Q854
14665A01721P6251N4711l6907k4716l9098j5682j892J6331N6757K727r50j5729
14653A73524J6298l8093k3652L4240L2937K0636J18J5203N3098K4202k9948l629
14641B74934K057k6193n8545n7024j5962j1567O055K0138J6251J1980l6860j0931
$$ y = [1532493, 1748921, 2069956, 2349818, 2505243, 2485207, 2266600, 1905861, 1507537, 1174065, 913208, 731734, 616679, 555699, 521073, 511209, 432973, 348646, 360300, 383701, 404642, 442685, 415298, 347664, 322906, 326981, 314144, 260227, 214601, 213842, 245624, 275445, 326119, 355847, 328969, 326685, 280851, 217514, 214944, 240727, 255569, 273686, 287568, 250523, 204623, 202505, 227359, 239834, 224163, 227142, 219663, 230201, 207007, 166832, 165528, 115493, 92867, 101721, 177972, 232683, 195776, 171060, 131962, 116280, 114388, 130719, 187476, 190203, 189253, 173524, 189822, 151729, 128077, 162317, 195254, 215890, 216008, 231211, 284309, 308511, 278563, 274934, 276991, 250798, 192253, 135229, 119267, 107700, 113755, 133893, 150144, 162124, 125264, 114333]
14629A14333J5739L7015L945k624m1192j7899m4101m9777j4641j6435J021K9461
14617A4845J6504K6743l5032K6254J06186J1696k3273l3059m1783J5344l7641
14606D6784j3624K4841k852P2042R626r330n2179J3779j0870L56P247o864j9261
14593E9695n4175n6887J2117L7320J7459j019k6166j0162j227k198R161L202J613
14580a1267L5026n76p2582k1651Q9827L3057j3691l7065J4756O855M1207K8381
14568I2277Q876P761J74m715n095k660l3994o0559n3981j9303J1207Q0469j17
14555B0340k0072K4075K0856L9420L4166j1834r169m1920k0458n845J3208K7537
14543G0304l5248j4134Q415q140J6971m4358p6293m8878N9023P3084j071j6935
$$ y = [114333, 130072, 167087, 171032, 168408, 127216, 109317, 65216, 15439, 798, -15637, -14616, 14845, 31349, 58092, 23060, 49314, 155500, 167196, 143923, 110864, 69081, 84425, 46784, 33160, 58001, 55149, 127191, 136817, 127487, 75308, 89087, 78217, 78573, 85820, 78956, 59695, 5520, -51367, -39250, -1930, 15529, 14510, -11656, -21818, -23045, -25243, -16082, -12880, -11267, 23759, 23183, -49399, -71050, 18777, 51834, 38143, 1078, 15834, 22689, 63896, 92277, 101153, 108914, 109088, 104373, 99278, 96618, 62624, 2065, -51916, -71219, -60012, 20457, 20340, 268, 24343, 45199, 84619, 118785, 106951, 97782, 55862, 35404, 29559, 42767, 70304, 35056, 20922, 29337, 21197, 38168, -6190, -82483, -131361, -72338, 746, -325, -17260]
14531a7260K4074L3118J6187o234k2108J0472m970M891j2166K0897J7348m7257
14519A6992l0701m2130L5931O4848K8002l3073k6122R562J0274o607J1391J4109
14507E2476N801m5384k9697j4124K7571j7403o77J6384L0962k739k0019n631K7769
14494B5289L6113N5679j1288J1336l9691j8711J1679K7504m8740q357L9750M4973
14482A25536k6780k3067m4670l6318M266q718M93R160L2049K0486L1819J0947
14470I5203m704q502l8276l1883j3007q014l4257k4712m937o56J8115O2989o351
14457A008k5123J7481l0284j9914J6121K4232j2963J6579J9825j0325K4202k667
14445A8172m9590J812k9899K1476J9895J3112M6327j6071m3647Q506K3277j5377
$$ y = [-17260, 6814, 39932, 56119, 49885, 27777, 38249, 33279, 38170, 26004, 46901, 64249, 16992, -13709, -55839, -19908, 44940, 72942, 39869, 13747, 23309, 33583, 26976, 38367, 52476, 58277, 12893, -16804, -30928, -3357, -20760, -21437, -5053, 25909, 23170, 3151, -2480, 25289, 61402, 117081, 105793, 117129, 77438, 58727, 70406, 97910, 49170, 40813, 80563, 125536, 98756, 75689, 31019, -5299, -1033, -9751, -9258, -98, 31951, 52437, 84256, 95203, 90499, 81997, 43721, 11838, -1169, -9183, -43440, -68152, -73089, -73745, -55630, 7359, 1008, -24115, -6634, -36918, -56832, -40711, -16479, -29442, -12863, 6962, -3363, 20839, 18172, -31418, -29606, -59505, -38029, -18134, -5022, 41305, 25234, -18413, -9907, 13370, -2007]
14433b007k9454j861L2605l645j7057L4095N5075N509o9314j2922K7465J6591
14421C5080K5766K3112k2364k1019R903J048J3698k2771k8186j2565q273J8238
14409A1667j5847j2151P089M1609m0958l3194L4022J1841k1135L6409R18j4083
14397F187k1103j6401R307N582L8026L6337L3810j7275j2094p896M5233L2752
14385A32465l2975k9411k0309j6059J15o895l2042l4202K2196L7655k2722n809
14373g993K2039L2060O528j4770N769K858j2735k8251K178L6239N3918j1530m0297
14360D6013j7661N6157M9006k0809m8027k8761k0778m338j5469k478l3439j2548
14348e3132J2958K7298Q134K0827o244J1599M0724j8797j4240L8402O2754m1230
$$ y = [-2007, -31461, -33322, -717, -4362, -21419, 12676, 67751, 73260, 3946, -8976, 18489, 35080, 60846, 83958, 61594, 40575, 50478, 51526, 65224, 42453, 14267, 1702, -6571, 11667, -4180, -16331, -9242, 32367, -8591, -41785, -7763, 4078, -17057, 19352, 20270, 6187, -14916, -31317, -22010, -16428, 21598, 57935, 91745, 74470, 62376, 54480, 99713, 132465, 99490, 70079, 49770, 33711, 33826, 26931, -5111, -39313, -17117, 20538, -2184, -7993, 14046, 46106, 52634, 37864, 43633, 46491, 33756, 5505, 7683, 43922, 97840, 86310, 46013, 28352, 84509, 133515, 112706, 64679, 35918, 15140, 10802, -4667, -7145, -40584, -53132, -40174, -12876, -4742, 16085, 9841, 21440, 62164, 43367, 29127, 67529, 130283, 89053]
14336H9053j905L592k1944k4040L0165L6159l396Q193K6915l4862m5356j6869
14324D5705k084M5626L4498N5631J05561O6870J26320K19598L70537L09337K21914
14313A599513J30060p4705k13777k89480k93246k68969j91044j34900r1122R785
14303A82115J5076k296k8164l5413l8477m2994l6184k4265k6967l756M1276N448
14291E399j7262q124J9072N1915J2195N79j0808j761M2582J2312n4897j7152J3052
14278D7102j3565m2681j1356K8875j5966J6271J9562k3041k3242j0214P996L8107
14266A7848O904o519k6536n247j006L201r811j4402M7736J5419N9974J1790k0187
14253G9164m0489j6652K0543J4498j6719p316j6246K0537q921l8729n97J7145
$$ y = [89053, 87148, 90740, 68796, 44756, 74921, 111080, 107684, 115877, 142792, 107930, 62574, 45705, 43621, 89247, 123745, 179376, 284937, 351807, 478127, 697725, 1068262, 1377599, 1599513, 1729573, 1654868, 1441091, 1151611, 858365, 589396, 398352, 263452, 172330, 182115, 197191, 194895, 166731, 131318, 92841, 49847, 13663, -10602, -37569, -41325, -49, 5399, -11863, -19987, -915, 51000, 63195, 63774, 52966, 51205, 93787, 106099, 51202, 34050, 47102, 33537, -9144, -20500, 8375, -7591, 8680, 28242, 5201, -18041, -28255, -20259, 17848, 24752, 18233, -8303, -13550, -14556, -11355, -21166, -35568, 12168, 27587, 87561, 99351, 79164, 38675, 22023, 42566, 57064, 40345, 33029, 16783, 37320, 28399, -10330, -10927, 6218]
14241F218J829L8847l6482k5461k485K4606L9323P960J3172N749k600j5818J4532
14228F9390j888m0297k9448O597K2525q676j745O028R105Q830J0752J2017J6953
14215H0143k5455k5244m5056K1186M5371m196J1182R611r60N82k0494k7941l8125
14202a9396l9200K4635M4475M3727o189p4668Q945L1179J5841J3462k2411O006
14190B6406M153J3775n3035m6947J1902N2540L8865j0316k8326o825k4006K5823
14178D009J7987k3240k0236l236P648J7494J6286m6161j3331k437J0669k2771
14166e7319O378K3429k255o983k0819K6240J2880J0802N9718L2160m2749n805
14154C5677R571r251k8073K4685M639J1308j4329l8953j5124j4343J897J2734
$$ y = [6218, 8047, 46894, 10412, -15049, -17534, 7072, 46395, 54355, 67527, 73276, 70676, 54858, 69390, 67502, 27205, -2243, 4354, 26879, 18203, 16458, 22486, 31591, 40421, 51173, 63190, 80143, 54688, 29444, -15612, 5574, 50945, 46749, 57931, 67542, 66582, 67164, 46670, 18729, -19396, -58596, -33961, 10514, 54241, 48052, -26616, -17671, 13508, 29349, 42811, 20400, 26406, 30559, 44334, -8701, -55648, -43746, 8794, 47659, 37343, 9017, 2192, -21814, 4009, 21996, -1244, -21480, -24716, -17068, 426, 16712, -29449, -42780, -45217, -34548, -57319, -50941, -27512, -29767, -36750, -57569, -31329, -18449, -7647, 52071, 84231, 41482, 35677, 45248, 35997, 7924, 32609, 37248, 48556, 34227, -4726, -19850, -34193, -32296, -19562]
14142a9562o3256L488N9109J1996k5019J4369k505k1555J9265K5896J8187P081
14130B7494p753o517o110p403m6031L533k556K6034l6527OM7134L034j496L0361
14116B3203K5591J2751k1886j6208l9647j5092r875K5009J1384J6878R116j5762
14104E462j0961r796K3174J4397J5257o796K6615J1464n9183R147K0032k847j2651
14091B3314O160M2477J8065l0609j6032J5413K2601L3453K5873P982N5760L1371
14079B35828L65m66O2589J29164J57932K93293L43344L60341K96087J68862p5807
14068A971532k21691l58902l96714l03340k47550j74613j28573l0735K2969j4784
14058A17599q804M1686J1157n573k5311n1320k2419j1346k1777k3332l09L0000
$$ y = [-19562, -82818, -79330, -20221, -8225, -33244, -18875, -21380, -42935, -23670, 2226, 20413, 27494, 19741, 13224, 7114, -289, -46320, -42787, -45343, -19309, -55836, -55830, -8696, -5662, -7158, 23203, 48794, 61545, 39659, 23451, -16196, -31288, -41163, -16154, -4770, 12108, 21224, 5462, -5499, -15295, 7879, 22276, 37533, 30737, 57352, 68816, 9633, 18780, 38812, 35965, 23314, 29474, 71951, 90016, 59407, 43375, 58788, 81389, 114842, 140715, 148697, 204457, 235828, 236193, 235727, 298316, 427480, 585412, 878705, 1222049, 1582390, 1878477, 2047339, 1971532, 1749841, 1390939, 994225, 690885, 443335, 268722, 140149, 109414, 132383, 117599, 108795, 150481, 161638, 156065, 130754, 79434, 57015, 45669, 23892, 560, 251, 30251]
14046C0251N9050J4404p6917o2463j0451J4123N852N7039j6638m0056j8695J9732
14034b4769N2098j2650k6993L137K4086J9611j7800R426J3197m0485n160M5815
14022C9513l4970k0850J6287j3412l6138K4816K669K0513m676J4232q325j3169
14010a3510j2591K824L2627K0490k5418j8801L5947L3639J175k1167l3158k1671
13998a9614M2747K8627J118j5571m880m3683j3347j7254k7461j7352M6543N9971
13986A9844M7719j2063L3687J9549K9735J036j562j5919l423j7517p0645k1951
13974H490q369P950j701O182j4955J1644L5057J369m963p374k4334q702L028R465
13960A2787J3866j8578k7391k5641K6230J8585L6751L3200j8004m404K785r52
$$ y = [30251, 89301, 103705, 26788, -35675, -46126, -32003, -26151, 30888, 14250, -25806, -44501, -24769, 27329, 14679, -12314, -9177, 14909, 34520, 16720, 26146, 39343, -1142, -6302, 39513, 4543, -16307, -20, -13432, -49570, -24754, -22085, -1572, -6248, 7984, -341, -13510, -26101, -23277, 9350, 29840, 4422, -14379, 21568, 55207, 56382, 35215, 2057, -19614, 23133, 51760, 52878, 37307, 32427, -11256, -24603, -41857, -69318, -86670, -40127, 19844, 67563, 55500, 89187, 108736, 138471, 139507, 137945, 122026, 118603, 101086, 30441, 8490, 121, 8071, 6370, 12552, -2403, 9241, 44298, 45667, 40704, 33330, 8996, 294, 3322, 12787, 26653, 8075, -19316, -44957, -18727, -142, 36609, 69809, 51805, 47401, 50186, 49234]
13948D9234K2643l2147k0984J7375L6023j1417L1093J3421N1424O6654L2410q297
13936B47432M851n840m9741l5480L961l5156m8807n1814m7549J5719K2018K9180
13924D8774J3701m298l5860k5985m714N318m527R815J7135j2353q394O94J6482
13911A5788J9641K3305j6439m8154k8839P745M3360j6210j5039l058j9855J3025
13899b4730K683L340M3484O617j1731o198J2258J116J1476j7718k7175o818L0068
13886A6672R007m3447k3646K3064K1559N1111M2688r778k378J4173j5843l2405
13874E0777k2727M9490L2532j8504O715j8044k4952l7286l7927O831L643R634
13862A82M7850j8792k9173j9086m6515L751N371L4698L7752p396k495L9407K873
$$ y = [49234, 71877, 39730, 18746, 36121, 72144, 60727, 91820, 105241, 156665, 223319, 255729, 247432, 252283, 246443, 196702, 161222, 165183, 130027, 81220, 29406, -18143, -2424, 19594, 48774, 62475, 58177, 22317, -3668, -8382, -3064, -7591, 2224, 19359, 7006, -1388, -694, 15788, 35429, 58734, 42295, -5859, -34698, -26953, 16407, 197, -14842, -17900, -37755, -24730, -22047, -18707, 24777, 31394, 19663, 13465, 25723, 26839, 38315, 20597, -6578, -13396, 16672, 25679, -17768, -41414, -18350, 3209, 54320, 97008, 87230, 84852, 99025, 83182, 50777, 28050, 77540, 110072, 91568, 98283, 80239, 55287, 18001, -19926, -13095, -9452, 182, 48032, 29240, 67, -19019, -65534, -61783, -56412, -21714, 16038, 8642, 6147, 45554, 48427]
13849D8427k3170k8178K1992n625n589Q717P049l6708j8705K2133K7504k9079
13837a1232l4928o212J9802k933K3855K3714K2611p30k4806j848J1784l7275J5204
13824b994j148l3124L970o982k646K2712j3760K0800N7841n870k604o277J3271
13811D3189Q082J7517k2649n3959k5084K6795m794K666J5265L4949K9726K391
13799G4094r173k2104j4224J5336j9251L2718N001K7787J3002m430k2725Q454
13787H4485M926P347J3270k4974J3883j2787J5005m6708l7689j2689O727K0909
13775C1705L0605k3172K4285L3355k25o548l4185Q56K7842J92j0720M27l6855
13762C7562k2950P285L2434K5165o0362r852k2949M485P604K3221K2656J4845
$$ y = [48427, 25257, -2921, 19071, 13446, 7857, 16574, 23623, -13085, -31790, -9657, 17847, -11232, -46160, -52372, -32570, -35503, -11648, 12066, 34677, 33947, 9141, 7293, 19077, -18198, -2994, -4142, -37266, -33296, -40278, -42924, -20212, -33972, -13172, 44669, 38799, 36195, 29918, 43189, 51271, 68788, 46139, -7820, -32904, -6109, -10903, -8237, 7028, 41977, 71703, 74094, 64921, 42817, 28593, 43929, 24678, 57396, 62397, 90184, 103186, 98756, 76031, 84485, 89411, 96758, 110028, 85054, 98937, 86150, 101155, 54447, 16758, 4069, 10796, 31705, 62310, 39138, 63423, 96778, 96553, 90005, 55820, 56676, 84518, 84710, 73990, 74417, 37562, 14612, 21897, 54331, 79496, 19134, 9282, -13667, -9182, -1578, 21643, 44299, 59144]
13750E9144j1106r3648j5875j035L4657L4823M051l1971k4129M6629L2554R211
13738D3305k6744L5K0135m651k3542q10K6177J3557j622J2640K721m601j6595
13725D0005j2300K9155J0256m4480J262J309l6043k9715q683J921R456K7197N6492
13712D5832M417j5190k6189K4354k2961k9381r006P331k3946l9944M2842P497
13700c4344K2726K566l9631n6907n906L257P350J4546L7326N1549J8383r374m8904
13687c7363k4988l2037J792J5804j4756Q352K6081r080L7410P2310O8239j4719
13675I7045n9586m3770L0034j8419k3684m678L5404J7729K6571L5672l8724l6877
13663A6717r87k8464j9872k2646J6069K2218K1328k9476R939m161l304k4573M3544
$$ y = [59144, 48038, -45610, -61485, -62520, -27863, 6960, 11011, -20960, -45089, 1540, 34094, 43305, 16561, 16596, 36731, 32080, 8538, 7728, 33905, 47462, 45840, 58480, 61201, 56600, 40005, 27705, 56860, 67116, 22636, 23898, 25207, -10836, -40551, -49234, -47313, -37857, -10660, 45832, 50249, 35059, 8870, 33224, 10263, -19118, -28124, -20793, -44739, -84683, -41841, -34344, -11618, -9052, -48683, -105590, -111496, -108239, -100889, -86343, -49017, 2532, 20915, 11541, -37363, -62351, -94388, -92596, -76792, -91548, -83196, -57115, -66195, -28785, 43525, 111764, 97045, 37459, -6311, 23723, 5304, -18380, -23058, 12346, 30075, 56646, 92318, 53594, 16717, 15730, -12734, -32606, -55252, -39183, -16965, 4363, -25113, -15174, -19335, -22639, -47212, -3668]
13650c668J3576J2445j5104J4998L8302L36M46l0547k4105R358M727P161Q964
13637C6889j0325l7726j969K1649Q383o258q636Q578j1079J5883L2967J0119m983
13624E3492j5280m1668p993m368l4286K1106j6327m8934M2157O4431L1400j2706
13612C1024l0255L4N8866o068N071k3394k2192K068j1225k6412o536N129R486
13599a4404p241O95P591j5467l405J6864M6048K8098k916R779N785o03K2423J0675
13585A03922l2807J923K42K1568m1758l1418l3486L4749j0806l4866L9053K0058
13573C6374M2191L2170J5477l238p7068m4308J0368j4253R649K105M153N7743
13561G1363J1971k2586l2538K4615J7334r385l2218m3286k6293j9286K5089R378
$$ y = [-3668, 9908, 22353, 7249, 22247, 60549, 60885, 61331, 30784, 6679, 16037, 20764, 27925, 36889, 26564, -11162, -13131, 8518, 16901, 10643, 2007, 10585, -494, 15389, 48356, 58475, 53492, 38212, -3456, -11449, -15817, -50103, -28997, -45324, -94258, -52101, 12330, 43730, 31024, 769, 803, 59669, 53601, 58672, 35278, 13086, 15154, 3929, -22483, -29019, -23890, -14404, -21645, -20950, -13359, -28826, -32231, -15367, 30681, 58779, 55863, 65642, 71427, 70824, 93247, 103922, 71115, 73038, 73280, 94848, 53090, 21672, -11814, 22935, 12129, -22737, 16316, 36374, 78565, 110735, 126212, 122974, 45906, 1598, 11966, -2287, 7362, 9467, 13620, 71363, 83334, 60748, 28210, 52825, 70159, 60774, 28556, -14730, -41023, -60309, -35220, -25842]
13549b5842L4417K0974m0590J8802K0538m4873j5251m963k5858j140J1033L1551
13537b1202J68r052l2358m2800K6622N4152O164R530K3051L717N2796k6979m5146
13524a337j6302K1317O9980j9408n3036K4109k0173j8540k4101J7940M5291Q802
13512C4542j1100j486L8658K8850M3832Q258m5513j3765l4551J0409l470P85l2520
13499B2929l7350K3250L7843m8478o1955m3024O2870O0234K401l2090K8015R602
13487B4247J5345j4363j7181j5835L031K1529J8948l4777k2379K9655l622j2835
13475h237j7320L438k2700l367M2125j4545k1696J0619k6007J3618O4246K0731
13463D0905j5770M7695p611k3334k9971m4175k9931M5929N1591j8475n2561r536
$$ y = [-25842, 8575, 29549, -11041, 7761, 28299, -16574, -31825, -36788, -62646, -63786, -52753, -21202, -21034, -30086, -62444, -105244, -78622, -24470, -18306, -8776, 14275, 17992, 70788, 43809, -1337, -17639, 3678, 73658, 54250, 1214, 25323, 5150, -13390, -37491, -19551, 25740, 34542, 23442, 21956, 60614, 89464, 133296, 141554, 96041, 82276, 47725, 58134, 54664, 55449, 22929, -14421, 8829, 46672, -1806, -63761, -106785, -43915, 16319, 18720, -13370, 14645, 24247, 39592, 25229, 8048, -7787, -4756, 16773, 35721, 944, -21435, 8220, 4598, -8237, -25557, -22119, -44819, -48186, -6061, -20606, -42302, -31683, -57690, -44072, 20174, 40905, 25135, 72830, 65219, 41885, 11914, -32261, -62192, -16263, 35328, 16853, -35708, -45244]
13451d5244K3707j735n625P195L7088r730m320m521J0331R857k1678K796k2592
13438b4471k275J3966J4031J854L5899p086O336J7348j9221n7569l9457N133L8852
13425a6660N8089L3754l6713o5155K7791K335K6205J3434n8175o7156N4298K3742
13413d211K397j1465J508j0593j1801n878l251n291l95J6009j5230j6539k8218
13400i2958n3133M6986L9187q849O618M9913j4785M1067L5613J6026J6718m0255
13388D2148k2994N919k635l1299l976j4457J2202K5888j403l2943m956J9371j2465
13375b1600m201K1310Q092L0901l7709k7355M4541R121j352j1747l8710J5019
13363a3690j7263Pl3165R34K2707p352K4718J0796L3119m713J5142M3328j8143
$$ y = [-45244, -21537, -23272, -28897, -21702, 15386, 5656, 1336, -3185, 7146, 17003, -4675, -1879, -24471, -26746, -12780, 1251, 3105, 39004, 31918, 38254, 55602, 36381, -21188, -60645, -55512, -16660, 41429, 75183, 38470, -26685, 1106, 3441, 29646, 43080, -15095, -82251, -27953, -4211, -1814, -13279, -11771, -22364, -34165, -40043, -43294, -48585, -48980, -32971, -48201, -64740, -92958, -146091, -99105, -59918, -68767, -62149, -12236, -27021, 14046, 49659, 65685, 82403, 42148, 19154, 25073, 22438, -8861, -12837, -27294, -15092, 10796, 9393, -23550, -28506, -9135, -21600, -25801, -4491, 3601, 34502, -3207, -30562, 13979, 23100, 21748, 10001, -28709, -13690, -30953, -30946, -64111, -63177, -40470, -47822, -23104, -12308, 20811, 16098, 31240, 74568, 56425]
13350E6425q1362o7844K6968L2284M1676j7649K9155Q90m2265k8784M4030M0383
13338C3907j1291o0431n1275k3984K8468K5706J8431Q06M7070J0086j0033N2504
13326E9964o488l8569l4918j9239k4506j3066Q69O48M2811J7256J5651N9117n491
13313E4039q668o174l2180m8999M946L8368K3599P408j8507k0457k2279Q426K9110
13300H632J0204m2147L062K5702m0907k7484J8840J4843k622L980J9465N467k0783
13287b3748o560J4994L5715j2393j6243k5937n524M0618J5840J7389Q178J755
13275D4084r494l365M5369J7125m480p9180j3453K8216m399l1299M569J8445o650
13262E488n305M710m440Q653L3859j563j7169l4553J5622q370oQ923J4814j5940
$$ y = [56425, -24937, -92781, -65813, -33529, 8147, -9502, 19653, 20543, -21722, -50506, -6476, 33907, 22616, -37815, -89090, -113074, -84606, -58900, -40469, -39663, 7407, 17493, 7460, 59964, 53476, 14907, -20011, -39250, -63756, -76822, -75953, -75305, -32494, -15238, 413, 59530, 54039, 45371, 39197, 7017, -41982, -37036, 1332, 24931, 32339, 13832, -6625, -28904, -20478, 8632, 18836, -23311, -20249, 5453, -35454, -62938, -44098, -29255, -31877, -27897, -8432, -2965, -23748, -30308, -15314, 20401, 8008, -8235, -34172, -39696, 922, 16762, 34151, 42329, 44084, 34590, 31225, 76594, 93719, 89239, 10059, -3394, 24822, 20423, -10876, -6307, 12138, 5488, 183, 4893, 453, 9106, 42965, 41402, 24233, -10320, 5302, -3068, -3074, 5849, 20663, 4723]
13248D723j4776j8924J7815L2237J7482j347K7843J7691K3536k8136r231m7278
13236B1635l0406Q215r567K7369j0086R573Q020o443J028m82q924O56K5396N068
13222D1052l6036r911M258l6037J6308P15k7790L3794K7425n315l8531O622M6386
13209B2940j6678J8660M3154J2050o364j2453j9424k6088l3417K5242n746j8164
13197a6288J6576J9585k1424k4028k682k0543K4951J980K1993K7664R548k4113
13185A3219o1160J0919L8731L0885j4521K1731l1738l7664J2923l956J0573K5343
13173A5285j3966k2743q42K602L032J5204J33R555Q608m4447R228M271J0529J9037
13159A5486n39J4083M55k2146l2005J3370K100K719p723K4882o704k8241M890
$$ y = [4723, -10053, -28977, -11162, 21075, 38557, 37210, 65053, 82744, 106280, 78144, 68913, 21635, -8771, -556, -10123, 17246, 7160, 16733, 24753, 18310, 19338, 18856, 9932, 10588, 35984, 41052, 5016, -4895, -637, -36674, -20366, -19651, -47441, -13647, 13778, 8463, -30068, -23446, 22940, 6262, 24922, 68076, 80126, 73762, 61309, 41885, 15797, -17620, 7622, 1876, -16288, 288, 19873, -1551, -25579, -28261, -48804, -23853, -21873, 120, 27784, 37332, 13219, -47941, -37022, 1709, 32594, 18073, 39804, 8066, -29598, -16675, -20631, -10058, 15285, 1319, -21424, -22266, -19664, -16632, -1428, -1295, 8260, 16868, -27579, -18351, -14080, -3551, 15486, 14947, 29030, 29485, 7339, -24666, -11296, -9196, -6477, -14200, 10682, 3978, -24263, -19373]
13146a9373m698l428K3934M1072J1873m1274k6560J654L1461n324k3674Q629j588
13133g296j6660q944K1169M7101j4470L740l7990o9227j1916J7722N9166J8412
13121H07p707J0243j1035k1635j548K9535o968J7874L8679K3376m3613k8470j3479
13108a3941K349k1257m433j8157J4160M9286o395m033j2658J4686K449K6570J1736
13095D0362j3151m505j2675k1577K443k3102J6039K9169L943n980m1273j7042
13083d7349J5413q017K9072k5279L695J4838j215j8144O8760K7241m0302l376
13071A5337K8827j3708L4620J5596n7080m2290j2787k181J6888L6740K674k9502
13059f866m9421J4932j1128n591k8541k1003K5250J1453J1046K1431O372j5471
$$ y = [-19373, -24071, -27499, -3565, 37507, 49380, 8106, -18454, -16800, 14661, 9337, -14337, -5708, -7296, -23956, -32900, -11731, 35370, 20900, 24640, -13350, -82577, -94493, -76771, -17605, 807, -6900, 3343, -7692, -29327, -30875, -1340, -8308, 9566, 48245, 71621, 28008, -462, -13941, -11592, -32849, -37282, -55439, -41279, 8007, 1612, -2421, -15079, -393, 2056, 28626, 40362, 27211, 22706, 10031, -11546, -9103, -32205, -16166, 13003, 16946, 10966, -30307, -47349, -31936, -39953, -10881, -36160, -32465, -17627, -18842, -36986, 31774, 59015, 18713, 15337, 44164, 30456, 65076, 80672, 23592, -18698, -31485, -33666, -16778, 19962, 22636, -6866, -56287, -41355, -52483, -58074, -86615, -107618, -82368, -70915, -59869, -38438, -32066, -47537]
13047d7537J1532J451L8012M0049m498J5771o63l0572J2523O733m0374k1237j2752
13034c1562j7109M821L5745J1223J0898J8408j3470K110J5735q575q546R645L282
13021C2605o3104L560M9801j3875K3834k5192l8152j8382L5388M1992j032K416
13009B9859l1666J8725K1156j4469p966J1346q262M260j6488j8909L051K5252
12997A5889L364k8288k4909L518M713L5618J7113r255L355j0910L222O6401K2702
12984A02533l4860o2859m233j297j213M6365K3628n904M311k8258m0590J91J4476
12971A2290n2800j2874N4290L5655m079J143M0532k244l9865P421K1150k4511
12959C6108l0080l4777o280N579L589J9408J3919J0636L9211p539j7504k0440
$$ y = [-47537, -36005, -34554, 3458, 43507, 39009, 54780, 54117, 23545, 36068, 42801, 2427, -18810, -31562, -48671, -43850, -8105, 3118, 14016, 32424, 18954, 21064, 36799, 28224, 19678, 29323, 32605, -30499, -26939, 22862, 8987, 32821, 7629, -30523, -48905, -13517, 28475, 27443, 29859, -1807, 16918, 38074, 23605, 15639, 26985, 18723, 22983, 6495, -12414, -9363, 15889, 19253, -9035, -33944, -30426, -25713, 9905, 27018, 17763, 21118, 10208, 13430, 79831, 102533, 67673, 4814, 581, -716, -1929, 44436, 68064, 62160, 66471, 38213, -2377, -2186, 12290, -40510, -53384, 906, 36561, 32482, 33625, 74157, 71913, 32048, 39469, 60619, 36108, 6028, -28749, -35029, -29450, -25861, -6453, 7466, 18102, 57313, 49774, 32270, 11830]
12947A1830j4152q457l6386l814J4191L716j5084j8565k7069o340M7346J8395
12935c4389K2166K7069j8396J5007M2723M342J670j8268k3950l3467J9698J6625
12923B0830l3189K0424M441k244J5577l7375K5421j7562r673l0116j5077K2156
12911c6387J1518J079k2591J3348K4817J846M83M8379L2267K4504L5625n5474
12899G9414j07072j5274J6167J0294J3497N707j1565K9286q858o539l204q975
12887g122k688J5763K9408J8359L3829m7673l0277Q119k910K71o102n0862J5455
12874b6430r394m1510J4683j6799Q251Q317L7899K2389l0421o579L5961K4931
12862B1298J5637Q014L1788m3871l6292L3349m696k6235J4926m335K702n0979
$$ y = [11830, -2322, -10779, -47165, -50979, -36788, -33072, -48156, -66721, -93790, -100130, -52784, -34389, -12223, 14846, -3550, 11457, 54180, 58522, 60192, 41924, 17974, -15493, 4205, 20830, -12359, 8065, 12506, 10262, 25839, -11536, 13885, -3677, -13350, -43466, -58543, -36387, -24869, -23790, -46381, -33033, -8216, -6370, -5887, 42492, 74759, 99263, 134888, 79414, -27658, -42932, -26765, -16471, -2974, 2733, -8832, 20454, 11596, 5057, 1853, -7122, -9810, 5953, 35361, 53720, 87549, 39876, 9599, 17718, 14808, 15079, 8977, -41885, -26430, -35824, -77334, -62651, -79450, -71199, -62882, -24983, -2594, -33015, -39594, -3633, 21298, 36935, 44949, 76737, 32866, -3426, 29923, 25227, -1008, 13918, 9583, 12285, -38694]
12850c8694k7859L2642L4990K0929k1303q176K970M192j6625k2379J8028J1960
12838i325J2399J6077j3402l798L9379L6155l1136o9955m0803J1762N4009J5624
12826A6986j1767L567o4696l1048L1948L4519J6851j0655l984L2225J4596k3607
12814D935j8999O651J0215K88L396n438N301L1878M7740m5375n6561M46N818k9635
12800c9340n380L6126M7676O085k3974o1908o29r529r488M2963N159l1969K104
12787d2104L9018M3866J4632Q97M933k1295n2577Q36N3050K7298j0522l6302L5988
12774E7718J3760J4191m012k8324l2480k9495k8296k334L6196J3278j8128J0945
12762C019k803J7358j7742k2721J6479L844p987k214j4068K942K3631L2683n609
$$ y = [-38694, -66553, -33911, 1079, 22008, 705, -7471, -4501, -309, -16934, -39313, -21285, -9325, 3074, 19151, 5749, 1951, 41330, 77485, 46349, -23606, -64409, -52647, 1362, 16986, 5219, 8786, -55910, -86958, -55010, -20491, -3640, -14295, -18279, 13946, 28542, 4935, -14064, -7413, 2802, 3090, 6486, 1048, 6349, 38227, 85967, 40592, -15969, -15523, -9705, -39340, -44720, -8594, 39082, 45167, 21193, -40715, -41344, -50873, -60361, -17398, -12239, -44208, -42104, -3086, 40780, 55412, 56309, 61242, 39947, -12630, -11794, 41256, 68554, 58032, 21730, 57718, 71478, 85669, 81657, 53333, 20853, -8642, -36938, -39272, -3076, 10202, -7926, 3019, 216, 17574, -168, -22889, -6410, -2566, -10553, -12767, -26835, -23893, -262, 32421, 26812]
12749B6812l5566J0819N894K2049J7731J6176K1975n5359n5899o0997J8258K6329
12737d1778K6212k3783K841K2668L3721j0942J4419K5610J6662k5568l4284R283
12725A5061j4383p549l064l287J6717M2314L933k3578l6012k2862N6438k0870
12713B858N185M3457K3656r33J4866p920l434M3432J43273K05203Q8037j44590
12701D13090j41212j20135n3697l017j26m6148l4638o818J1710j4708P9J9617
12689B3997o709M302k538M0751N7662o1384k8484n821j9199k4681J7345L0658
12677B5899K3383m4174l4213k747j164K7344K8995Q31k1894k1598l5983M2213
12665a3108P7932k1484q5474j1848L2823J7966Q73L3084K7292p141k495m538k3208
$$ y = [26812, -8754, 2065, 7959, 30008, 47739, 63915, 85890, 30531, -25368, -86365, -68107, -41778, -15566, -39349, -36508, -13840, 19881, 8939, 23358, 48968, 65630, 40062, 5778, 15061, 678, -6871, -9935, -13222, 3495, 45809, 49742, 26164, -9848, -32710, 23728, 2858, 8043, 51500, 75156, 74223, 89089, 81169, 77735, 121167, 264440, 469643, 557680, 413090, 271878, 151743, 98046, 95029, 94903, 48755, 14117, 7299, 19009, 4301, 4380, 23997, 17288, 21590, 19052, 59803, 117465, 56081, 27597, 21776, 2577, -22104, -4759, 25899, 49282, 5108, -29105, -31852, -33016, -5672, 23323, 24154, 2260, -19338, -55321, -13108, 64824, 43340, -42134, -53982, -21159, -3193, -2320, 30764, 58056, 50915, 48420, 43882, 20674]
12652B0674k3194m3973J6999l6667k5446N1436J8787m8094J9808M4213l032l1013
12640c9502K9385O104j9598j5009k570J9100M0350j82p420l2241j4309J1149L6218
12627A1475k2065m265o85J5072L9639k2069o6609K0399L4553K7503k5131r384
12615a567j7358j235M9824L9240r992k1649l3186p876l6829k8019J6083L0647
12603b1917J667L518R210J1334k0336n979j5113j0388L1973p474L4556m201J4233
12590B1083K2837l1513l2299l7267J1838K3512j0756P975J3524Q516M0736j4058
12578B4128l528j6736j3394j7835j4140l8115J701M0940R919O9935l8515k161
12566B199J6686O14k5961M9617k3790O333K6263l5540k0262k9476m408J9538K1866
$$ y = [20674, -2520, -46493, -29494, -66161, -91607, -40171, -21384, -69478, -49670, -5457, -8489, -39502, -10117, -4013, -23611, -38620, -41190, -22090, 18260, 18078, 10658, -21583, -35892, -24743, 11475, -10590, -14855, -15540, -468, 39171, 17102, -49507, -29108, 5445, 32948, 7817, -1567, -18925, -20160, 29664, 68904, 58912, 37263, 4077, -3799, -40628, -68647, -52564, -21917, -20250, -16732, -7522, 3812, -16524, -22503, -37616, -48004, -16031, -23505, 11051, 6850, 21083, 43920, 12407, -19892, -57159, -45321, -21809, -32565, -24590, -11066, -2550, 38186, 24128, 20600, 3864, -9530, -27365, -41505, -79620, -77919, -36979, -27060, 42875, 4360, 2199, 18885, 19499, -6462, 43155, 19365, 25698, 51961, 16421, -3841, -33317, -37725, -18187, 3679]
12553C679k1131k8345K0536J7892j0076J9433Q547M4138L8520k1989k7708l5359
12541H137J0802L3300O066j8683k3233k018J8227O083j5796j4732k3499L183j0262
12528b2425K5741K8883m3727K3321n2235o3205M7446K5149j748l6368l5101k8532
12516a32801O462O6097N9745O202q379l0362M3909J1429k182n902l159J3587J42
12503B4788m2813l8293j5983L3673J2043L0872j3671P830m8171l7478j5301J171
12491a01333K9568J6464R225k2373O045N9314Q264J9980l0720j7637q854J3815
12479a8242L8669K2525L0059L105Q824j6542l1431l3781L7702K1085k1922j1618
12467B8433j1788l830j6103m450P272M908J5967P187l0519O541L7141J0189m3870
$$ y = [3679, -17452, -45797, -25261, -7369, -17445, 1988, 10535, 54673, 93193, 71204, 43496, 8137, 18939, 52239, 58305, 39622, 16389, 14371, 32598, 38681, 22885, 8153, -15346, -12163, -22425, 3316, 32199, -11528, 11793, -40442, -103647, -56201, -31052, -32800, -69168, -104269, -132801, -126339, -60242, -497, 5705, -2674, -33036, 10873, 22302, 20120, 14218, 11059, 24646, 24788, -18025, -56318, -72301, -38628, -26585, 4287, -9384, -1554, -49725, -87203, -102504, -101333, -71765, -55301, -46076, -68449, -62404, -3090, 5174, 25154, -5566, -23203, -32057, -18242, 20427, 42952, 73011, 76116, 84940, 68398, 36967, 3186, 40888, 61973, 40051, 28433, 16645, 12815, -3288, -7738, -466, 4442, 20409, 27596, -2923, 3618, 40759, 50948, 7078]
12454G078k6128l606m302M616K0439R308J3059j0220J3042K8516n250j0280k95
12441C5977k2612k517j3767J1110L3575l6899L4857p600l0261n0104m2766J4486
12429g6521N6832M3008j7014q957J1457N482k1910l8144j2371J7732K9271k7806
12417c8941N583J4633R67K9644k2740j1858J3977J3959l0329p070K3640L5007
12405B6472N757M465J0740J7312k9590k2899j2093J9793M468q365L7610p147O040
12392E2563j8162l1212o668k5443l6132L0629L1670j0388J0764r062J3884k7185
12380b4742j7308L3539K510l7441L84k0213j6446Q802K9426J2359L3728L7717
12368D2315M739j8787l0619k3394K1663R536k0457o037P249L5471K5986j4987
$$ y = [7078, -19050, -22656, -26958, -22342, -1903, 7405, 20464, 10244, 23286, 51802, 46552, 36272, 35977, 13365, 10848, -2919, 8191, 41766, 4867, 39724, 32124, 1863, -48241, -91007, -76521, -19689, 23319, 6305, -2652, 8805, 14287, -7623, -45767, -58138, -40406, -11135, -38941, -33358, -18725, -17758, 11886, -10854, -22712, -8735, 5224, -25105, -32175, -8535, 26472, 32229, 36694, 47434, 64746, 35156, 12257, 164, 19957, 24425, 16060, 53670, 46523, 52563, 34401, 3189, -3479, -28922, -65054, -34425, -2755, -13143, -2379, -11441, 2443, -24742, -42050, -8511, -6001, -43442, -43058, -63271, -79717, -70915, -41489, -29130, 4598, 42315, 47054, 28267, -2352, -25746, -4083, 5453, -15004, -21041, -13792, 21679, 47665, 32678]
12356C2678k6295j3742k1831K4618j5785k4857q100l93L722k6682K340L8393P970
12343b7964l5861j1352L5619K5954P450l6985L042N2446K8971j134n3098m3044
12331e5956N1423j8028J4356l068N281M7436k6034k866M3191m0611j8125K3542
12319B0541K0657J8322n717j3487j9715p903j1555k4911K8702q841N944p206Q324
12306C155k6771K0973O1697J344n4685j9708m901r988J7307N3580J4168l6723
12294A9448k8437N6155M033k2450j5226j2270K064K853k9075o140K1698P58j3115
12281a9704L1569M6137J4251l4531l1655K8620l491k2700l9266j4138Q117K3377
12269a3414P010K3822J8035l1194k1987K7511O528L183J015J8425L1390j4282
$$ y = [32678, 6383, -7359, -29190, -4572, -20357, -45214, -53314, -53707, -49985, -76667, -74327, -35934, -27964, -63825, -75177, -39558, -13604, -6154, -43139, -40097, 12349, 41320, 40186, -12912, -55956, -4533, -22561, -8205, -11273, -5992, 41444, 15410, 12544, 55735, 15124, -3001, 20541, 41198, 59520, 53803, 40316, 20601, 12698, 1143, -23768, 4934, -3907, 2037, -5169, 3155, -23616, -2643, 59054, 60398, 5713, -13995, -18896, -28884, -11577, 42003, 56171, 19448, -8989, 47166, 51199, 28749, 13523, 1253, 3317, 6170, -22905, -29045, -7347, -6589, -19704, 11865, 58002, 72253, 37722, 6067, 34687, 31196, 8496, -30770, -44908, -36791, -13414, -6404, 17418, 35453, 4259, -17728, 9783, 16311, 19494, 20509, 38934, 70324, 56042]
12257E6042l8148k1430L2499l7688k0066M6375k0779n2632M192L3K3930k4110
12245e1782l5957L3808K9499L1920K8245P442l3488L2782L2948L265L660m3363
12233C8979m5050M118l6766r941L7407J8467K3611k4230j7197N14N097k2754m4233
12220g1978K3372J2869K7500K5850j3629k0269K3255J7429q631M30l0494p660
12208b1956K2638n908K3681O58l9062j4466K1889N244P737J4084M768k0761k5924
12195b7378r307j7823J4444j91M4940L9810M7223J0226n6198p8054m0326m154
12183g6788j5954K0612O401J4555M3389K5437M0108l9186q601L1511L7657j5157
12171F3984n2380k6416L0249k5971r576J5883k9L0887q410l6597n5719L1117K086
$$ y = [56042, 17894, -3536, 28963, -8725, -28791, 17584, -3195, -55827, -51635, -51602, -27672, -51782, -87739, -53931, -24432, 7488, 35733, 43175, 9687, 42469, 75417, 78682, 82342, 38979, -6071, -1953, -38719, -48660, -11253, 7214, 30825, 6595, -10602, -10088, -4991, -27745, -71978, -48606, -35737, -8237, 17613, 3984, -16285, 6970, 24399, 15768, 16198, -14296, -21956, 682, -5226, 18455, 19113, -19949, -34415, -12526, -7282, 455, 14539, 19307, -1454, -27378, -36685, -54508, -40064, -40255, 4685, 44495, 91718, 101944, 45746, -32308, -72634, -76788, -92742, -72130, -65729, -51174, -7785, 17652, 57760, 18574, 9973, 41484, 79141, 63984, 11604, -14812, 15437, -10534, -20110, -4227, -4256, 26631, 18221, -18376, -74095, -42978, -40892]
12158d0892j9984O2908N0835K7388l6832n2149k0469p037l97K0336l1109K5794
12146b1608K1021K0606k5695K0523J2065M117J8913l0816l6499o424R854J4377
12134D34k9046l5523K9986L6027N577j759n5014j6971K4261K8343M1163J0258
12122C7736R944l9275j8566j1110J8576q623k6376L6719L5852K5194K2321L0611
12110A13003M1350O1707K3941l3563r4632q0041O487j4811j2558n040J336Q427
12098A5606k050j9113n2657M3341M1284J7170J1780j4097n2490k5525K0194P007
12086i550k2831k3863j6090K8356R131J7142L0363n766l8130n532q040K449Q535
12073c3826j6571L134J0261m983j1531L4522N0681L4589J2423m7925J0637M1148
$$ y = [-40892, -60876, 2032, 52867, 80255, 43423, -8726, -29195, -36232, -36629, -16293, -47402, -21608, -587, 20019, -5676, 14847, 26912, 31029, 49942, 19126, -17373, -23797, -13943, 434, -28612, -64135, -34149, 1878, 7455, 5696, -49318, -66289, -42028, -13685, 27478, 37736, 47680, 8405, -10161, -21271, -2695, -11318, -37694, -975, 34877, 60071, 82392, 113003, 154353, 216060, 240001, 206438, 111806, 31765, 38252, 23441, 10883, 5843, 7179, 15606, 13556, -5557, -58214, -14873, 26411, 43581, 55361, 41264, -11226, -36751, -16557, -9550, -32381, -56244, -72334, -43978, -34847, -17705, 12658, 6892, -31238, -36770, -44810, -42361, -33826, -50397, -47263, -37002, -41985, -53516, -18994, 31687, 66276, 78699, 30774, 41411, 82559]
12061H2559m8734l9990j13J3267K720N270j2170k352O383q137K8249Q074l413
12048C1613k1807K9376K8025j4346p004l8516j9387O460L027o849Q646J7279q563
12035G954m0862k6813k1854r581M6639O5085J1711p8645j3726L8117J9349l910
12023f536j0120j1214J1115J7610J4214L951L194k8582N582k2262Q270M1317Q423
12010C4962j949q017N314M727k1128r921j7617l5200K4245O2519l7190p8109l1431
11997a08795j6210O866L0927j1216M7708K2613K2894m966n7202L752M0370k96
11985b3555J1901J5026p438j4454M814m259L5691K0811p292K7927n5665n4690
11973e1183o317K94K3162j1694Q482M3227K9585K4979K6551l9186l7994n5073
$$ y = [82559, 33825, -6165, -6278, 6989, 9709, 14979, 2809, 457, 6840, -1297, 26952, 35026, 31613, 9806, 39182, 67207, 52861, 45857, 7341, -12046, -5586, -2559, -9408, -762, 16517, 7954, -32908, -59721, -81575, -91156, -44517, 20568, 32279, -46366, -60092, -21975, -2626, -6536, -16656, -27870, -16755, 855, 15069, 19020, 22214, -6368, -786, -23048, -14778, 26539, 34962, 33013, 24996, 30310, 35037, 13909, 3988, -13629, -48829, -24584, 37935, 745, -77364, -108795, -125005, -118139, -87212, -98428, -50720, -28107, -5213, -10179, -67381, -63629, -23259, -23555, -11654, 3372, -4066, -18520, -13706, -17965, 17726, 38537, 31245, 59172, 3507, -51183, -57500, -57206, -34044, -45738, -37256, 5971, 35556, 60535, 87086, 47900, 9906, -45167]
11961d5167j0062Q783O6024M080q310j4746l7889l7686j2268O0409M4704J1894
11949B9766j5136j2713J8292P948m791k8938k8711J2886J0112J6977k3504m9803
11937f7615L067N9630J0735j4133J285l3008J0918L0970n408M266K9727J6510
11925D6944r064k7586o885j70L7582P125r786q2105J2388m997J9770J6588k992
11912c188r547N227J0474k4075l9132n3734L2581N5432L8315J9557l9945o4351
11900g2386k2678M2529M4220n043K775O856j1385k667K530j1625N002L4898k2978
11887i952L597J8537j5754j4056J2969m172j5710K5067k2301k3714L45P970j2847
11874e0021j9353k1724J5781N4217K8l4617j1062J637K5135q372J103L16L0471
$$ y = [-45167, -55229, -46446, 19578, 23658, 15348, 602, -37287, -74973, -87241, -26832, 17872, 29766, 14630, 1917, 20209, 28157, 23366, -5572, -34283, -21397, -11285, 5692, -17812, -67615, -64548, -4918, 5817, -8316, -7031, -40039, -29121, 1849, -3559, 707, 30434, 46944, 37880, 10294, 3409, 3239, 40821, 47946, 38160, -43945, -31557, -36554, -16784, -196, -3188, -12735, -7508, 2966, -21109, -60241, -113975, -81394, -25962, 12353, 31910, -8035, -72386, -95064, -52535, -8315, -13358, -10583, -3727, -15112, -17779, -15249, -26874, -21872, 13026, -9952, -6355, 12182, -3572, -17628, -4659, -8831, -24541, 526, -21775, -45489, -45144, -37174, -50021, -69374, -91098, -75317, -21100, -21072, -55689, -66751, -65114, -39979, -48351, -47248, -46932, -16461]
11861a6461P0069L6493m4228p9013O181L1192k58J1860J315p149J9348P58N596
11848C5703k698L199o008m5173m2883J1075O8738o252m9351j7995k492L5765M240
11835a4132k0445M1878m039k5766Q624J4220K444k9852j2359k9433K4422j355
11823d5793L6195k966p4713l2815L6712J1532q485q185P769K1846J8222L3881
11811f800J0747L124J6416M7372k4706l7680j4335L6312j245l5327m2338l3070
11799h1530J9298J5868J2129L6098J7475m1837n1537J1129N6237K4439n609P533
11787A9693j6429J7398J0121k0362O36J8821L7941j9540m9750j8791K8487L981
11775A2206k0606J8260k1419O223L2004R285m990m7084o360L4927K7608K3141
$$ y = [-16461, 53608, 90101, 45873, -33140, -26959, 4233, 3975, 15835, 17150, 10001, 29349, 30107, 35703, 33005, 36204, 30196, -14977, -57860, -46785, 21953, 15701, -33650, -51645, -54137, -18372, -14132, -34577, 7301, 3262, -22504, -13880, 340, 2784, -27068, -39427, -68860, -44438, -45793, -9598, -12564, -87277, -120092, -83380, -71848, -80333, -88518, -80749, -58903, -40681, -6800, 3947, 7071, 23487, 70859, 46153, 8473, -5862, 30450, 29205, -6122, -48460, -81530, -62232, -46364, -34235, 1863, 19338, -22499, -74036, -62907, -6670, 17769, 12160, 19693, 3264, 20662, 30783, 10421, 11057, 29878, 67819, 48279, -1471, -20262, 8225, 12206, -8400, 9860, -11559, -5336, 26668, 35953, 30963, -16121, -22481, 12446, 40054, 63195]
11763F3195J9739j3229p535m3444m9358j5231O3182q66J1420j0976K6667L669
11751D7233j5481o247K2738n511r676m4057k758j222k888M8342O971j5832L104
11738B4716l5256l0706K125j2n8224l7730K3872N3786K8607J1834K4261m848l6615
11725c4190k2079J5490r836J1277M213J7344k943k8895l3512L4315J9665J6469
11713a2682J8720K3715p096j9742j6884l1928K1213L9922j0097l4141j9598K3055
11701b5543L3523J4973k4577j7327L4279L2930R887p9670m6716J2845O1792j9790
11689a3394k1230J5872K9428K8196N3542l2540n2630L820m007J5604k3237k0400
11677b0976N7482l5579k575K5451k9814j5283J0423p585k5769L4777K6962k39
$$ y = [63195, 82934, 69705, 62170, 18726, -30632, -45863, 17319, 16453, 27873, 16897, 43564, 47233, 31752, 25505, 48243, 42732, 33056, -11001, -13759, -14981, -17869, 30473, 37444, 21612, 24716, -10540, -41246, -39121, -39133, -97357, -135087, -111215, -57429, -28822, -16988, 7273, 2425, -34190, -56269, -40779, -50615, -39338, -35125, -17781, -20724, -49619, -83131, -48816, -29151, -12682, 6038, 29753, 22657, 2915, -13969, -45897, -24684, 15238, 5141, -29000, -48598, -25543, 7980, 22953, -1624, -18951, 15328, 48258, 58145, -21525, -68241, -55396, 6396, -13394, -34624, -18752, 10676, 38872, 92414, 59874, 7244, 11064, 7057, 22661, -576, -20976, 36506, 927, -1648, 23803, -6011, -21294, -10871, -18456, -44225, -9448, 17514, 17275]
11665A7275j7141m5438j9411J0028J0965L3847j7237n2270K5457K1543n014K6925
11653a0471q76J286J9891m5176j8775l0988p55j2228K7207M6813J2144j8492j3673
11640d4093j3161j3372k0369K1952M4576O8101J5275K419M5407L9929k6685k5339
11628I4640k2112j8905J4136J5173l4852l748p826k5812q790Q620q210K7445R446
11615C9205j7034o045L016k6074j0605L099N4881K0368l692k6512l3614O034j6342
11602a3315R054L7563L7184k045P326L058l7680o2543l1775K7234R533J8897r847
11589g356p221o011L846Q792k1501j5175N732P330K220o453k6534J2356L2849
11576a7126o42J4214J1318p396k9028L3157N7704o155l6966j0207R613n797k3207
$$ y = [17275, 134, -45304, -64715, -54687, -43722, -9875, -27112, -79382, -53925, -32382, -37396, -10471, -11347, -10061, 9830, -35346, -54121, -85109, -85864, -98092, -70885, -24072, -11928, -30420, -44093, -57254, -70626, -90995, -69043, -24467, 43634, 58909, 61328, 106735, 146664, 119979, 94640, 72528, 53623, 67759, 82932, 48080, 44332, 36506, 10694, 1904, 10524, 2314, 29759, 39205, 22171, 16126, 19142, -6932, -17537, -14438, 40443, 60811, 57119, 30607, -3007, 3027, -13315, -4261, 33302, 70486, 68441, 75767, 78825, 41145, -21398, -53173, -25939, -16406, 2491, -7356, -14577, -20588, -16742, -7950, -29451, -44626, -38894, -31564, -29344, -35797, -62331, -49975, -17126, -17768, -3554, 7764, 368, -28660, 4497, 62201, 56046, 19080, 8873, 18486, 12689, -10518]
11563a0518J285n171J913N807p860l2640J3963J0603K3681L1282R983J9606j2506
11550D9428j3025K5953k5534J0378M0849k1517J812j4284k9069j4203j6407M843
11538g76R050l061l4009m1896L2998M8897J3764l670k629L87J0160L9630J5043
11525H3888P16j4505M82p84j7677k7299k3021J51J1585L216J4735J6536L3520
11512H1543m713l2437l6372Q371L5905J1904j484j867j1829l2528L4132j1531
11500C9094m6513m1457l2821m279L2069M7815O186n0120o144O21M8957K9499K7513
11487E0420p015p948k4106j1552k1777l5089j7027j3317K3603K4763J1530o089
11475c3604J4318J2390L6057q223m2390m171N6709K5156l4120l5140K6900l1521
$$ y = [-10518, -9233, -14404, -12491, -6684, -14544, -47184, -33221, -22618, 1063, 32345, 42328, 61934, 49428, 36403, 62356, 36822, 47200, 88049, 66532, 68344, 54060, 24991, 10788, -5619, -776, 8274, 5213, -28796, -70692, -37694, 11203, 24967, 21297, 18668, 19055, 29215, 68845, 83888, 84604, 70099, 70581, 69797, 52120, 24821, 1800, 1951, 13536, 16752, 31487, 48023, 81543, 76830, 44393, 8021, 16392, 52297, 64201, 62717, 60850, 49021, 16493, 50625, 39094, -7419, -48876, -81697, -85976, -53907, -6092, 94, -50026, -56170, -55549, -6592, 22907, 50420, 43405, 35457, 11351, -201, -21978, -57067, -74094, -87411, -63808, -39045, -27515, -33604, -19286, -6896, 29161, 20938, -21452, -25623, 31086, 56242, 22122, -13018, 13882, -17639]
11463a7639l8427j2077K224N195j292O145P443k1822J6035K196K6995M7517j3624
11450H869m1857l0836J4473L7888L1483J734o5111j4781J3547M1912J8456K1682
11438C7459l4762k1370M7963L5356J9629Q185k907l2807j2932o2996K2578M1796
11426D5192l716r594J1078L943L651k0978q524K3770j8446k6883L64K6542j4737
11413A1662l1448j1402L323L6108N984J0822J3335J6025Q770O92K869k2619m0785
11400C336j7927k6854l3401M6716L0388k275J3178L8727K5839M796j9538q177
11388E4808p583P609L838k2952M934N924j2848K879L2991K8267Q257k0290n0450
11375C5384k8171k6571m4520j0227L0349O8320Q644j6899j9669J8940K1162n4772
$$ y = [-17639, -56066, -68143, -65919, -60724, -62016, -55871, -48428, -70250, -54215, -52019, -25024, 22493, 8869, -32988, -63824, -49351, -11463, 20020, 21754, -43357, -58138, -44591, -2679, 15777, 37459, 2697, -18673, 29290, 64646, 84275, 92460, 89553, 56746, 43814, -19182, 3396, 45192, 41476, 31882, 42960, 46903, 50554, 29576, 21052, 44822, 26376, -507, -143, 26399, 11662, -19786, -31188, -27865, 8243, 14227, 25049, 38384, 54409, 63179, 63871, 66740, 44121, 3336, -14591, -41445, -74846, -28130, 2258, -17, 13161, 51888, 77727, 82523, 62985, 54808, 47225, 54834, 58672, 35720, 40654, 46578, 33730, 36609, 69600, 97867, 106124, 85834, 35384, 7213, -19358, -63878, -74105, -43756, 24564, 33208, 16309, -3360, 15580, 36742, -18030]
11363a8030L170j752J5562k225Q620P717o8732j0629P074q682L4610N2094J4267
11350C3064j6159r405j4697L009j6332j8645M9963L1526n1920m9942R087J7435
11338c3016M5808J2340K668M6295l855k1872o3564m1774P627M6020J8545L0378
11326D5600L1437o0078M963j4705k4930k2284n5212j9314R905L4748k0449l7565
11314a27884P3349L0028l132J6996j8144J5792N1743K6099j0182k1630M1048j6393
11302E7690m8459r269o558j5870J0484l428o893K7269P419j692n846J5208J5691
11289C5746p935J424q959j7438p443k064j5575p103m3844l3748J6764K9011L2053
11276b9111r912K3775J7323k1963o121J8956j6741j7428N552L471j9239L4240
$$ y = [-18030, -14860, -16612, -1050, -3275, 5345, 13062, -55670, -66299, -59225, -67907, -33297, 18797, 33064, 16905, 7500, -7197, -4188, -20520, -39165, 10798, 42324, -9596, -59538, -50451, -33016, 12792, 25132, 27800, 74095, 70240, 48368, -15196, -56970, -49343, -3323, 15222, 45600, 77037, 16959, 21922, 7217, -17713, -39997, -95209, -114523, -104618, -69870, -90319, -127884, -54535, -24507, -27639, -10643, -28787, -12995, 38748, 64847, 54665, 33035, 74083, 57690, 9231, -38, -6596, -22466, -11982, -15410, -22303, 4966, 12385, 10693, 4847, 20055, 35746, 27811, 29235, 20276, 2838, -4605, -6669, -22244, -29347, -73191, -106939, -90175, -61164, -29111, -39023, -15248, 2075, -19888, -26009, -7053, -23794, -41222, -35670, -32199, -51438, -17198]
11264a7198K5317l751K040l7816m0529j4619j4888K8657N5888N3556J2754L1722
11252H1133j7515K7305j7232n9134n3234K9133L0009L9375l2164j3038l2646j1067
11240b9075M4640J3261k4218n0909Q51K0307M1831J8000k9606R947M2035o63j7198
11227C9203l7076l6929K7373R566j6742l3864j8912j8351K9299k987k4968K4736
11215e9652L901L4621N5417k4259J4068j8692j5211j1011J157K1023r279j9544
11203b7461N2421k5666K1332J5245M0304j6504j6678K01k1692n2970j0011L0972
11191a0507K8346P801Q136j9740l0015l3598K0160J9168l8567O23k671N860L5424
11178i580K2011O09J2574K8908k7921m2699R666N8630J6402j3381l4390j3090
$$ y = [-17198, 8119, 4368, 6408, -31408, -71937, -86556, -101444, -72787, -16899, 36657, 49411, 81133, 63618, 90923, 73691, 14557, -38677, -9544, 20465, 59840, 27676, 14638, -18008, -29075, 15565, 28826, 4608, -46301, -45450, -25143, 16688, 34688, 5082, 15029, 57064, 56401, 39203, 2127, -34802, -7429, 2137, -14605, -48469, -67381, -85732, -56433, -59420, -84388, -59652, -55751, -21130, 34287, 10028, 24096, 5404, -9807, -20818, -19661, 1362, -7917, -27461, 24960, -706, 20626, 35871, 76175, 59671, 42993, 43194, 21502, -31468, -41479, -10507, 17839, 25640, 33776, 14036, -15979, -49577, -29417, -10249, -48816, -48193, -50864, -45004, -9580, 12431, 13040, 25614, 54522, 26601, -16098, -6432, 52198, 68600, 55219, 20829, 7739]
11166G739k1989m6376k5416J181L7946J1307J7195J2556K8852j7369J7155m5084
11154b2303m0832L2147L0642j0755L081J8184k2867J6678J3257L2130k5848k3044
11142D70J0819K5306p221M870L4361J3812m647k3928j1347m8268M340M642k8117
11129b4908j1857j0115J7995J7808N2468K4569j1882q652J039K6756K8000J2220
11117A13441k4457m9294m4527m2954j5136J6328O489j8686J4908K0620Q695q134
11105b2707L403L0210K0251l5921J7609j0181l4228k7860j6363J8061N2150L5334
11093B9758m4981j4967K6182J1238N497j1589J5543j291k0601J5107Q116j9657
11081a645k6732J0751K6592K8110j9091n1510K4430J8976j0827k4706k9750R083
$$ y = [7739, -14250, -60626, -86042, -84861, -46915, -35608, -18413, -5857, 22995, 5626, 22781, -22303, -63135, -30988, -346, -11101, -8020, 10164, -12703, 3975, 17232, 49362, 23514, 470, 11289, 36595, 29374, 34244, 68605, 82417, 77770, 53842, 42495, -5773, -1433, 3209, -24908, -36765, -46880, -28885, -11077, 41391, 65960, 54078, 45426, 46465, 73221, 101221, 113441, 88984, 39690, -4837, -47791, -62927, -46599, -40110, -58796, -43888, -23268, -14573, -22707, -19304, 10906, 31157, -4764, 12845, 2664, -31564, -59424, -75787, -57726, -5576, 29758, -15223, -30190, -4008, 7230, 12727, 1138, 16681, 15390, -5211, 9896, 18012, -1645, -28377, -17626, 8966, 37076, 17985, -33525, -9095, 9881, -946, -25652, -55402, -46319]
11069d6319L6624O939J4495J9535N1220J7844p217o0815j4938k9951k9654L3217
11057i020J3646k7828m0845J592K0160K6107j879J7438J3193k3421o310Q549L5539
11044B6921L3524j823k9064m0125j3077K3974J2645n5569k4363J7813j4748j0268
11032g4160j4489J0888k89J1415J831L3607K3685K0813L2940j8108n8467m768
11020c5102M6432k0757k5381N1284l123j7412J321K7075j4263l335k8186K8407
11008F960j4434k84l8572K898J4084j7463k2587q570p534N4304N1775K0236J6963
10995E7776k5123k5438j6121j434k1747J0533K1756L896l4508L6977j7459l9535
10983e0427k1401K231r128K2192L3706N0456M6030J4122J4595m5011l2550k2763
$$ y = [-46319, -9695, -2756, 11739, 31274, 82494, 100338, 93121, 32306, 17368, -12583, -42237, -9020, 4626, -23202, -64047, -62455, -42295, -16188, -18067, -629, 12564, -10857, -17167, -8618, 26921, 60445, 58622, 29558, -10567, -23644, 330, 12975, -42594, -66957, -49144, -63892, -74160, -88649, -77761, -78050, -66635, -64804, -31197, -7512, 13301, 46241, 28133, -30334, -35102, 11330, -9427, -34808, 16476, 13353, -4059, -2738, 24337, 10074, 6739, -21447, 6960, -7474, -7758, -46330, -43432, -29348, -46811, -69398, -77968, -85502, -31198, 20577, 40813, 57776, 32653, 7215, -8906, -10340, -32087, -21554, 202, 4098, -30410, 6567, -10892, -50427, -71828, -69597, -78725, -56533, -22827, 27629, 73659, 87781, 102376, 57365, 24815, 2052]
10971B052j7952N9100M2512L854l9348r313N013k3170j3565O1017R859j1559j6366
10958E2134j9734n5528k7750O062J6633L3504L3119R318j5390j8601J7874m0030
10946h389r84K9567J587o0197O322J763L7652Q067M1742K3819j3561o2070l9660
10933c4342k2601Q504L5475m806n0010L1275M3141P009M2045J5206m7722k5301
10921b127j2320J3855K27j4976p669K8821k3270j9502N4038j251k9356o217N244
10908a4503J3488P981j1903o130k8336l1114J5700O0375J3213M025j5502j0778
10896c484J4023J0387k7975k3R829j8718o408K0494P6623j417j9028k1501l749
10883B9053Q095M410m7793J004J192K5732J7269k9230K131R616n236j916J2481
$$ y = [2052, -15900, 43200, 85712, 89566, 50218, 40905, 45918, 22748, 9183, 70200, 80059, 68500, 52134, 32400, -23128, -50878, -44816, -28183, 5321, 38440, 47758, 32368, 13767, 31641, -8389, -9373, 20194, 21781, -38416, -32094, -30331, 7321, 15388, 57130, 80949, 67388, 5318, -34342, -56943, -48439, -12964, -17770, -67780, -36505, 6636, 13645, 55690, 70896, 23174, -2127, -14447, -592, -365, -15341, -23010, 5811, -17459, -36961, 17077, 15826, -13530, -19747, -14503, -1015, 6966, -4937, -11067, -39403, -70517, -54817, 5558, 18771, 22796, 7294, -3484, 10539, 20926, -7049, -7072, 2757, -15961, -22369, -1875, 74748, 73331, 54303, 32802, 29053, 37148, 41558, -6235, -5231, -4039, 21693, 38962, 9732, 11863, 21479, 16243, 14327, 26808]
10870B6808j5583J7277P643m0189k4809J1006n86J9634J6884j7977j6605K2379
10858E882J2156o975K5306K580l0120M1666K8256O625j1335k0169m340K6983J5473
10845I1988k9304l2199P042K2120m8352j5191J5511K1498k4604o401L2564p322
10833B7350k7700J6990l6050K3007j0266m7090k588M6944K7099R331N770K5763
10821E8560J5383m1446o9691l8278K0421j3630L1396L8342k1110k7902R901J3456
10809b4598N6459J7360k806k249n9932m4177L3824J9871j3334j2206q380k3977
10797f4145J4844M7555J1661k6064k2762K8599j5221m1986r471K2025L0412j2581
10785c7134L5623J0819j2208J6429M816p83K3000K9911k054k0723l4680r271Q514
$$ y = [26808, 11225, 28502, 36145, -4044, -28853, -17847, -18433, 1201, 18085, 108, -16497, 5882, 18038, 11063, 36369, 38949, 8829, 50495, 78751, 85376, 74041, 53872, 49532, 76515, 91988, 62684, 30485, 37527, 59647, 11295, -3896, 11615, 33113, 8509, 2108, 34672, 27350, -350, 16640, -19410, 3597, -6669, -53759, -56347, -9403, 17696, 27027, 32797, 58560, 73943, 32497, -37194, -75472, -55051, -68681, -37285, 1057, -20053, -47955, -38054, -24598, 31861, 49221, 46415, 44166, -15766, -59943, -26119, -6248, -19582, -31788, -40168, -64145, -49301, -1746, 9915, -16149, -38911, -10312, -25533, -67519, -76990, -54965, -24553, -37134, -1511, 9308, -2900, 13529, 18345, 17562, 40562, 70473, 68419, 47696, 13016, 3745, 12259]
10772A2259l674j6966m0711J8334N7474J0509l2684o14k8268n670l598L5264j4052
10759a2397j5093K0789q647J7850L238k9681m905p882p090L522K0567L3863p499
10746F635k314o985j465n163k4954j9521J7419O351l0557q19L6048P401l275M8220
10732B7021k1738O145J4601J573j2349j4445r859P153l5983J3582l3542q008J4179
10719e1670K9309K4238K7268K7912K4438k154k3634k501k0922O90n711j3568K4535
10706C8230k4649j0669J0117p018j5861r446J9586K1610o658J5243K7666l492
10694E4659K7126L630k6331m9742m6624k6783J9099J9804J4667J2291J8529J0885
10682C1210k1903l1719j7663k5951q494J2306N8697j524P772R478r377l017o388
$$ y = [12259, 8585, -8381, -49092, -30758, 26716, 37225, 4541, 3927, -24341, -30011, -33609, 1655, -12397, -27490, -6701, -15348, 2502, 5740, -23941, -28846, -36728, -43818, -40296, -19729, 14134, 6635, 4321, -2664, -4129, -9292, -34246, -53767, -36348, -29997, -60554, -61373, -25325, -17924, -21199, 27021, 5283, 11428, 26029, 27602, 15253, 808, -9051, -1898, -37881, -24299, -57841, -65849, -51670, -22361, 1877, 29145, 57057, 81495, 79341, 55707, 53206, 32284, 32974, 27263, 13695, 38230, 13581, 2912, 13029, 6011, -9850, -19296, 290, 21900, 15242, 30485, 58151, 54659, 81785, 85415, 59084, 9342, -37282, -64065, -44966, -25162, -10495, 1796, 20325, 31210, 9307, -22412, -40075, -66026, -74520, -62214, -3517, -5041, 2731, 12209, 2832, -185, -6573]
10669f573K2809Q043L101N453m276l9298l8163j0372M4434j466k2089j5473J203
10656e2667K6208P747M219k8710K7137L7303q190l7904k6660J5162L1477j2121
10644a6999J384j1224j2889L7711l5351J4329K4216p420k8144J980J8699j4140
10632b7848k4319J3106k013J8741k5655k0651j930L5770K1142K1457O3909j0430
10620F1279L2969m0667k5094J4729p529N198k4490l560J3780r483k2294m9373
10608e4535J148k0885j094L3579J9818K7514o516M979m795M401j6279n5217k65
10595f8147M327K0884n524n964O9427j8351j3777P676J0459j3188K6522m461k5959
10582a6076j2002k4537j1596j673k7432J3038O6987K0806Q234n2053k857K1754
$$ y = [-6573, 16236, 24279, 27380, 32833, 28557, -10741, -48904, -59276, -14842, -16308, -38397, -53870, -52667, -26459, -18712, -14493, -43203, -16066, 21237, 13047, -24857, -51517, -36355, -4878, -16999, -15615, -26839, -39728, -2017, -37368, -23039, 1177, -6243, -34387, -32407, -13708, -27848, -52167, -39061, -41074, -22333, -47988, -68639, -70569, -34799, -13657, 7800, 71709, 61279, 94248, 53581, 28487, 43216, 35687, 40885, 16395, 12835, 26615, 17132, -5162, -54535, -53387, -74272, -75366, -41787, -21969, 5545, -971, 4008, -787, 3614, -12665, -67882, -68147, -63820, -42936, -48460, -54424, 15003, -3348, -17125, -9449, 1010, -12178, 14344, 9883, -16076, -28078, -52615, -64211, -65884, -93316, -80278, -13291, 7515, 15749, -36304, -39161, -17407]
10570a7407L5388M343K963J4584R150J0690N579m8118j8541K5325L120j4302K8307
10557D1081M523Q966l8K3893J0438k6840m4358l0355L7246l5641J131O373l0262
10544c3843J3168K8726l9745j9L5662j0034J565L0333l9776p865R272J6035L3259
10531C6738O774j8139n6295l9143J5008r347R8J5382J7181K2629N4289J0506l8238
10518A7443k9249K9379j0729p402j1220k920j0894K5177J0649r373K0041L4524
10506E5426j9544m3180J1721J8407J4808K1196k6231o3086O48N1831J7142P534
10494D6672n1419o9775K2634J9117L7323O689j8328m0281K0445J4293L5258K3582
10482D6210l1906m1482k2186J5381K0056K6440Q570p063R438P912o229k0847k0933
$$ y = [-17407, 17981, 22324, 25287, 39871, 49021, 59711, 65290, 17172, -1369, 23956, 27076, 12774, 41081, 45604, 54570, 54532, 78425, 88863, 62023, 17665, -12690, 24556, -11085, -9954, -3581, -33843, -20675, 8051, -31694, -31713, 3949, -6085, -4520, 25813, -13963, -21828, -12556, 3479, 36738, 43512, 25373, -30922, -70065, -55057, -64404, -64306, -48924, -31743, -9114, 45175, 55681, 17443, -11806, 17573, 6844, -558, -11778, -14698, -25592, -415, 10234, 861, 20902, 55426, 35882, -7298, 4423, 22830, 37638, 58834, 32603, -30483, -29835, 21996, 39138, 46672, -4747, -74522, -51888, -32771, 4552, 11241, -7087, -47368, -26923, -12630, 22628, 46210, 14304, -27178, -49364, -33983, -13927, 12513, 21083, 14020, 23458, 31370, 25141, 4294, -16639]
10469a6639j4758J0524K0441L577O928m9528l884L4489L8051l3496j9469j4068
10457c7832J2693J4399R638M6058J8062M982L867l1654l2650L0032L9503p9892
10445b794R105j9820J4560J3486J9265J4943l1530j7790K6869J780j612m3069
10433a6607l9025O158J3965l7259p6589L8323M5359K0166p558L5071N2828J1203
10421D6035m3485j4000m621K2910K9486J322j4452j1778k1191P081Q389o471L6661
10408C5886l6169m0828m506q874j1097N828K5082K4915n397n37m819K6457M7637
10395E3578k892m2972j5616R295j2068J8787k742q249o494J142k3352J8559K3081
10382A0057j4868J6734J146m1747K0864L896j943j4985r960n583q284o884K6986
$$ y = [-16639, -31397, -20873, -432, 3145, 10073, -39455, -43339, -8850, 29201, -4295, -23764, -37832, -25139, -10740, -1102, 44956, 63018, 68000, 71867, 40213, 7563, 37595, 77098, -2794, 6311, -13509, 1051, 14537, 33802, 48745, 17215, -575, 26294, 28074, 26462, -16607, -55632, -49474, -35509, -72768, -149357, -111034, -65675, -45509, -53067, -17996, 34832, 46035, 2550, -11450, -16071, 6839, 36325, 37647, 23195, 11417, -9774, -2693, 5696, -775, 35886, -283, -41111, -45617, -54491, -65588, -59760, -34678, -9763, -15160, -15697, -20516, 5941, 53578, 50686, 7714, -7902, 1393, -10675, 8112, 5370, -2879, -9373, -8231, -31583, -13024, 10057, -4811, 11923, 13069, -28678, -7814, -3918, -5861, -20846, -30806, -36389, -44673, -51557, -24571]
10369b4571K5493R164j3794l8253l6636j0623J8622M4326K0794k2556K9509K0093
10357B1568j7170j0593j3527l0538j4574N0368N7252j3501l3184j0472p385m0124
10345f1880r457L0755J2345N21P839Q708k7837R645j0308J3811k7386M6842J9500
10332A3098k018N483p400M063L9064j6086q660K4477P194m915k1472m3491o218
10319a6881J4392p16p953q020k7677l0543M0748K6262k9646N6238J1872l1232
10307c156j2195j7047J4905J0042j0877M6087r767l3659l3873m466O110q971O1070
10294D203J0710j318j8351k3403p547Q564k0791j9892N256k557L4801L8766l4459
10281b6018R437Q402j4590K541n136l6866K0441N9509J8260j6105j6604n43K1344
$$ y = [-24571, 922, 10086, -3708, -41961, -78597, -89220, -70598, -26272, -5478, -28034, 1475, 21568, 4398, -6195, -19722, -50260, -64834, -14466, 42786, 29285, -3899, -14371, -21756, -61880, -71337, -40582, -28237, -27716, -19877, -11169, -39006, -29361, -39669, -25858, -53244, -6402, 13098, 11080, 16563, 9163, 13226, 52290, 36204, 27544, 52021, 59215, 54300, 32828, -10663, -16881, -2489, -3205, -11158, -19178, -46855, -77398, -36650, -10388, -40034, 16204, 28076, -3156, -15351, -32398, -17493, -7451, -18328, 27759, 17992, -15667, -49540, -54006, -47896, -56867, 4203, 14913, 13595, -4756, -28159, -35706, -27142, -47933, -67825, -62569, -65126, -30325, 8441, -26018, -16581, -8179, -22769, -20228, -25364, -62230, -41789, 17720, 35980, 19875, 3271, 2728, 24072]
10268B4072k9579n3976m268j578j0758O0495m094j1285j306L051j1870M118J2188
10255b4790L0131j0100J7161k762k7689r183K2524r659m2812J5151M6004J805
10243E781N767J5146N100l2677M783K005n77J2427K4783j1876l7596j1119r831
10230b7884j3280N1184K258j6218J0664K037j90K378j6307l2923l8667l3738N4113
10217e6573M3268o025j4018J0069Q311L4967J2718j4715p194J1242M561k0316
10205F295p719N579M456J1017J0555N331l5319k7185m3045O646K1904J8407o857
10192b9935l3770K0320M2087K7866L4721j7184q760k3935j7564K3733K5351N535
10180D8465o3264O093N9339J5546l1292l1229m9979o082j1220L4683J3002l0605
$$ y = [24072, -5507, -59483, -63751, -65329, -76087, -15592, -19686, -30971, -32277, -29226, -41096, -36978, -24790, 5341, -4759, 12402, 9640, -18049, -27232, -4708, -14367, -57179, -42028, 3976, 5781, 11548, 26694, 31794, -883, 3900, 5905, 5328, 17755, 42538, 30662, -6934, -18053, -27884, -41164, 10020, 12278, -3940, 6724, 8761, 8571, 10949, -5358, -38281, -76948, -110686, -56573, -13305, -19330, -33348, -23279, -14968, 19999, 32717, 18002, 10808, 22050, 26611, 6295, -1424, 4155, 8611, 19628, 30183, 35514, 195, -26990, -70035, -63389, -41485, -23078, -29935, -63705, -43385, -1298, 26568, 61289, 44105, 35345, 11410, -6154, 17579, 42930, 48465, -14799, -8706, 50633, 66179, 34887, 3658, -46321, -52403, -63623, -28940, -15938, -46543]
10168d6543l10O205p299k86L1799K1712J2446Q478J9702J4769k840j1187J0389
10155E7035j2533l1195m4002j3770L3046N7847N465k4796k7723J6057m8516j3635
10143d6720N2426L0050k2634n8124M5937K3858l1306J9994r446L635l524j5412
10131a1266l5314J0427J0640J1536k5200j0886J7534J6364k4802L294J1459N0689
10119B4475K0674n698j3779p148j1393o438R681j3668K454q664J6320n198J1259
10106A2877l6258j3386N626l7480o627K1839M6146J2962k1406J0826j6734m8527
10094g0142N731j060J4913M2055L2658K393K2407l3287k29M2012Q878l9618m3277
10081a6566k4325o815k4179M0081M3031K4053K3753r142k0144l6470N746j4050
$$ y = [-46543, -46853, -40648, -47947, -48233, -16434, 5278, 17724, 26202, 45904, 60673, 57833, 46646, 57035, 44502, 13307, -30695, -44465, -11419, 46428, 51893, 27097, -626, 15431, -33085, -46720, 5706, 35756, 13122, -45002, 935, 24793, -6513, 13481, 4035, 7670, 4146, -11266, -46580, -36153, -25513, -13977, -39177, -50063, -32529, -16165, -40967, -37673, -26214, 24475, 45149, 39451, 25672, 18524, 7131, 693, 10374, -3294, -840, -9504, 6816, 1618, 12877, -23381, -36767, -31141, -68621, -75248, -53409, -7263, 5699, -15707, -4881, -21615, -70142, -64411, -65471, -50558, -8503, 24155, 26548, 48955, 15668, 15439, 57451, 66329, 26711, -16566, -40891, -47706, -71885, -31804, 11227, 35280, 59033, 49891, 29747, -6723, -977, -15027]
10069a5027L8173L6763J2086R147m4680n6354j4840M6968J1412k1066l9538K2580
10057a4376R290K9943j1466R479l5084n4109k634M6639N595K578J5850K371K426
10044F502j4385O343J5486J9978P389l34l0799l537P825J3335L468k0064j8418
10031g211K3753J2244k298Q062K630n637J3482j6518l3235k9337J8808L9445L3684
10018E7872k4374k118K7635M9702L4327J4990J02917K25573L12677J53686r9875
10007H53012k71278k05060j11293j17699n6269j3617R235j5480j4496J1886m9275
9996A9666k7113K6442N315k1080j1411J345N327j3247J1213K266k3761N839Q864
9983a0335j9555j1531M4627L963n3141m614M6617K6396q036J9017r512j3837j0655
$$ y = [-15027, 23146, 59909, 71995, 81142, 36462, -19892, -34732, 12236, 23648, 2582, -36956, -14376, -5086, 24857, 13391, 22870, -12214, -66323, -68957, -22318, -16723, -14145, 1705, 4076, 6502, -7883, -1540, 13946, 33924, 41313, 40979, 10180, 6643, 14468, 27803, 31271, 11207, -7211, 16542, 28786, 26488, 34550, 37180, 31543, 45025, 28507, -4728, -34065, -15257, 24188, 57872, 33498, 31380, 59015, 108717, 143044, 158034, 260951, 486524, 799201, 952887, 853012, 581734, 376674, 265381, 147682, 91413, 77796, 87031, 71551, 57055, 68941, 19666, -7447, 18995, 24310, 3230, -8181, -6836, -1509, -14756, -3543, -1277, -25038, -19199, -10335, -29890, -41421, 3206, 7169, -45972, -50586, -3969, 22427, 14391, 33408, 23896, 10059, -596]
9970e96q718p04J8734J9123J7896J581p139p0932j0513L6227j7330O631N773K4090
9956A4123l3111J0802k3632m8296N3559M7681n893l9830j5670P4897N8541L3227
9944A26398p0671m6187l07K8445l072J401p248l0504O034P473N526p432J066K6297
9930C7219l874k8276J0169J4486L677O748k1778j6486K49m821q076L5884J5413
9917D0534J8609m6191K992J1908J518P988J3508j0769l2853Q938l6649j4961N2356
9904A6928J7397k3400n772p142j3172j5775m530M0320R651o012J7584K0035k5721
9891B0391r324J8708j6672l132K3389j0560k0936m438p585J036M2673L3298p482
9878E9366k0114j6252K8458N4974k2079l5869p307K111P592k5405j6165m58L9780
$$ y = [-596, -9314, -10018, 8716, 27839, 45735, 47316, 40177, -30755, -41268, -5041, -22371, -15740, -9967, 14123, -18988, -8186, -31818, -80114, -26555, 21126, 15233, -24597, -40267, 34630, 93171, 126398, 55727, 9540, 9233, 37678, 34606, 36007, 28759, -1745, 4289, 11762, 17288, 9856, 10922, 37219, 33345, 5069, 15238, 29724, 33401, 40149, 18371, 1885, 2134, -2687, -10763, 25121, 40534, 59143, 12952, 15944, 27852, 29370, 37358, 50866, 40097, 7244, 16182, -20467, -35428, 16928, 34325, 10925, 5153, -1989, -15161, -30936, -35466, 4854, 14505, 8493, 26077, 46112, 20391, 11067, 29775, 13103, 9971, 33360, 22800, 1864, -2574, -10159, -9123, 33550, 66848, 59366, 39252, 23000, 51458, 106432, 84353, 48484, 41177, 43288, 50880, 25475, 9310, 8852, 48632]
9865D8632k9802n6871K8898M4748J0177l6031j2754J2491l3159O3076l9348j2718
9853a2661J9379K0692j1793j0587j2708k5020k5088K1679L890p900j855j4580
9841e6552k4610m0827J5104M501k680L3652K1988J5341L106l1611l4960R156K4239
9828f4153L9032p893q251K9433K3505P039q560L1261k8942j0999J6871J9033K8074
9815F5450l9309l2041J3504l5727L918M602K022l0343l8966M9487L2628l3577
9803c8352o96L9814k0639l8784J2573L7537J249M9330J1760m0665j7722Q082J0710
9790A4197k7157k5504J4243J1919K8311j4956j5464J4385k1424L663J7197J4973
9778A4383J1295M1097j3808j7491q425j8109l1428q3r954L1895P3423j1933m7747
$$ y = [48632, 18830, -38041, -9143, 35605, 45782, 9751, -3003, 9488, -23671, 39405, 57, -12661, 6718, 27410, 15617, 5030, -7678, -32698, -57786, -36107, -32217, -40117, -41972, -56552, -81162, -121989, -106885, -102384, -105064, -71412, -49424, -34083, -30977, -62588, -97548, -88392, -64153, -25121, -33014, -41265, -11832, 11673, 18712, 10152, 41413, 12471, 1472, 18343, 37376, 65450, 26141, -5900, 7604, -28123, -24205, -19603, -17581, -47924, -86890, -37403, -4775, -38352, -39048, 766, -19873, -58657, -46084, -8547, -7298, 42032, 53792, 13127, -4595, 3487, 14197, -12960, -38464, -24221, -12302, 16009, 1053, -14411, -26, -21450, -17787, -590, 14383, 25678, 66775, 52967, 35476, 27051, 8942, -22486, -22569, -32523, -628, 72795, 60862, 13115]
9765A3115L979j5200m1041K4039K1093l37J9112k8852r674l7407m88o27k8625
9752h0913o9450L7524J3708J8624K5269P383M5383Q940P660j9464o0K0977n878
9739I703N018p575J0147j0071r845K0553J3065j7529K0090l7703k1046J9914m612
9726i891k354M0558k2408j104L1744L6487j6458k1419m7147l8241L8036q106n2616
9713g2919k1381K8703K8138L1372l699J8795L1327P922M961j048r914j751m174
9700C6332m3040l7394q661j1658J9674J9672m4431n194L8230J1558k2349J5257
9688c2004k368J0865M865l3307p614M7596n502l4070M0304O532m753m081k604
9675a6141l9001n175M9871O0819J88J3804P440p539r394n0321o8187m56J1562
$$ y = [13115, 17094, 1894, -39147, -15108, 5985, 5648, 24760, -4092, -13766, -51173, -51661, -52288, -80913, -150363, -112839, -99131, -80507, -55238, -47855, -2472, 6468, 14128, -5336, -5396, 15581, 9703, 14721, 7146, 17293, 7222, -2623, 17930, 30995, 13466, 33556, -4147, -25193, -5279, -9891, -12245, 28313, 5905, 4801, 36545, 73032, 56574, 35155, -11992, -50233, -12197, -20303, -72919, -94300, -65597, -37459, -6087, -9786, 9009, 40336, 48258, 53219, 52171, 42257, 40506, 36332, -6708, -44102, -52763, -64421, -44747, -25075, -69506, -74700, -36470, -24912, -47261, -32004, -34372, -23507, -18642, -51949, -59563, -11967, -17469, -51539, -11235, -4703, -9456, -13537, -16141, -55142, -60317, -10446, 50373, 50561, 64365, 71805, 64266, 54872, 4551, -63636, -64092, -52530]
9662e2530l611K379Q465M8336K150o596L1777N1124r397k2829k9696Q881k8366
9649H7J5847K8577j9835P895o795j5271l8244N0133L3611K8238q321m5603r775
9636B0544o342l8061n607k2145m3041N1369L4000k4618o967M6579J0402o9072
9624e2959k4761r805k2033L7008J6876N3869K9963l4484M8614L9369r290l667
9612F8700k1300l0025o048l0313k930m255l848L561J0574J8731L9017M1691l344
9599H0211o4320k2048R859K0386j5812k3946J7386j605m7682J9982O8667J2855
9587E3933p3281L421N0206k6626k7693J9081J1445j5742k2674Q947J0268L0918
9575B2203j0729l568l7834k172J1772P320J6317K2990J7154l592N519M3444m7519
$$ y = [-52530, -56141, -53762, -45297, 3039, 5189, -1407, 30370, 81494, 72097, 49268, 19572, 28453, 87, 15934, 44511, 24676, 32571, 25776, 10505, -27739, 22394, 56005, 84243, 75922, 30319, 20544, 14202, -23859, -29466, -51611, -94652, -43283, -9283, -33901, -40868, 5711, 16113, -52959, -77720, -87525, -109558, -72550, -55674, -1805, 28158, -6326, 42288, 81657, 72367, 68700, 47400, 17375, 11327, -18986, -21916, -26171, -30019, -26458, -15884, 2847, 41864, 83555, 80211, 15891, -6157, 3702, 24088, 8276, -15670, 1716, 111, -47571, -27589, 41078, 53933, -19348, -15927, 34279, 7653, -20040, -959, 10486, -5256, -27930, -18983, -8715, 22203, 11474, 7906, -29928, -32100, -20328, -13008, 3309, 26299, 43453, 39861, 45380, 88824, 41305]
9562D1305n2595o499K6770L7064k8216j4846l926J2075l726k012k5596P967l9288
9549e1523k1912N3109J0178j4833J1482j3929J9046J7083k3657n240k9362k4831
9537g4389k723M8585K3368O958P330j0175N398o830J7017J0615j3807q376Q774
9524A1745K8150n666l0876K3947k2437n637o741J3498j5819l1840L3959N7681
9512D9964N63l8471m168K0063o801l6359R535K3450q096J8603j9147l0974q247
9499c0085o665O536M1979p519q77m334j8271K9502M949j8190k452M9717j6680
9486B7610L9335Q298n27q111q424j0342l7289k7474k5450L0842K1455r715j117
9473i09m7957n619R831k8841m1780k0507L4977N5344K9883J906k551o339L0934
$$ y = [41305, -11290, -17789, 8981, 46045, 17829, 2983, -943, 11132, 7406, 5394, -20202, -12235, -51523, -73435, -20326, -10148, -24981, -13499, -27428, -8382, 8701, -14956, -20196, -49558, -74389, -77112, -28527, -5159, 1799, 9129, -1046, 4352, -2478, 14539, 25154, 11347, 2971, 11745, 39895, 34229, 3353, 27300, 4863, -774, -7515, 5983, -9836, -41676, -7717, 49964, 50527, 12056, 7888, 27951, 21150, -15209, -5674, 17776, 9680, 28283, 9136, -21838, -30085, -36750, -30214, 11765, 4246, 3369, -965, -19236, 10266, 15215, -2975, -5427, 44290, 27610, 66945, 75243, 74716, 66605, 58181, 47839, 10550, -16924, -42374, -11532, 9923, 208, -909, -48866, -54485, -44654, -73495, -115275, -135782, -100805, -45461, -15578, -13672, -16223, -22562, 8372]
9460H372j8509m6180p1415J1832L1480L0456J689k9868n495L5693L4911p049o295
9447c0378k0791M166K9268R740k3572Q734K2220K0973J6898l9788l0145J4385
9435a8290j0017J4616J4690P941k7843r933R433N3309Q80l1149j3162J9222J1801
9422B1498k8709k2829o805k5085J4454K6964K3378K866r551J8400m5058K2536
9410g941K55J0881L3365R341l0027K5928m736r545k7414M820l3397j1041Q039
9397c1472K8474k4899K5978M3942n342o513K5676k656J0147l5663j5571l8294
9385b6193M4225O8001k0432j9548m0186j978n822k5541j0284j0644J9050M6271
9373A6919J3063k5387P450J8465j321P766K1852L00k0n8962n1729P501J0386K6988
$$ y = [8372, -10137, -56317, -127732, -115900, -84420, -53964, -52275, -82143, -87638, -51945, -17034, -24083, -30378, -51169, -47003, -17735, -7995, -31567, -22833, -613, 20360, 37258, -2530, -32675, -18290, -28307, -13691, 999, 8940, -18903, -28836, -19403, 33906, 34786, 3637, -9525, 9697, 21498, -7211, -30040, -36845, -61930, -47476, -20512, 2866, 5732, -3819, 14581, -30477, -7941, -7686, 3195, 36560, 45901, 15874, 41802, 37066, 27521, 107, 4927, -28470, -39511, -31472, -2998, -27897, -1919, 42023, 36681, 30168, 55844, 53188, 63335, 27672, 12101, -26193, 18032, 86033, 65601, 46053, 5867, 3889, -1933, -27474, -37758, -48402, -29352, 16919, 29982, 4595, 12045, 30510, 29189, 36955, 58807, 59107, 59087, 125, -51604, -44103, -33717, -6729]
9359f729M7129J6398k4347l4813k5630m486L7045J6664N1147L2595O000k424O032
9346A14581j1511j7406O382J4786m6716m9876l1679J7382J9856J8709J9277j6838
9334C6947n7966n2807R432L1500J3409M956J1610Q905j7949n4775K0330K2868
9322b3540J1590k9945j6799J3911o330k152O7224L551l1719j9268P798n842q902
9309d0423J0014o159m8292J9563N6293K7480l8763j0775J9558J3457L4366j6935
9297A9384mj3541k4643k5037N127j2305K3542M0119L0024k5953L256j5791J5395
9284A9573m968Q150Q849L416o633k064j6281O068j6693j1393j400J2004L0581
9271B9209n038J2945j946k176L6058p1l0884k066L362Q488j773J8588l5817j8164
$$ y = [-6729, 40400, 56798, 32451, -2362, -27992, -32478, 4567, 21231, 72378, 104973, 110973, 108549, 114581, 103070, 85664, 92046, 106832, 60116, 10240, -21439, -4057, 15799, 34508, 53785, 36947, -21019, -73826, -64394, -32894, -19485, -14529, -2919, 5986, -11963, -66738, -46408, -23540, -11950, -41895, -58694, -44783, -51113, -53265, 13959, 17510, -14209, -33477, -25679, -31521, -40423, -30409, -36568, -84860, -65297, -9004, 18476, -20287, -31062, -11504, 1953, 36319, 19384, 19380, 5839, -18804, -43841, -38714, -51019, -27477, 12642, 42666, 16713, 19969, 4178, 19573, 14605, 22755, 31604, 35020, 28387, 26323, 10042, 16110, -583, -11976, -13376, -1372, 29209, 24171, 37116, 35170, 32994, 69052, 68981, 38097, 36031, 39393, 47881, 46108, 64696, 28879, 10715]
9257A0715j1898K0567m063J6755j3792k4878j371m6123J7390M5693J6596r708
9245A5883K1328K9891l1616m4587o09L6939L7143l5858j0237O465p836K7120n083
9232C8943o1581j4097j601k568J0238P666K5786K1388J050r932l8873p272k5194
9219e6047j0985J4968K9377o957R761L4900m167o1M4395M049l0566n9753M4620
9206A3534j6281j1946j9455j3021o600N558J820L4461J554J258j4331j5892K2412
9193a6929q678k4131K2373M7180J0278l1962L397L9863l0661J705N021n2738j3110
9180d8392o55M7812K9628n78p097j1256k2027k1786L903J4815k4281K671K8688
9167h555q871l0106l0907l294L518Q9293L9175k6628N074O803l1583q04q143K0774
$$ y = [10715, -1183, 19384, 15321, 32076, 18284, -6594, -7965, -54088, -36698, 8995, 25591, 15883, 37211, 67102, 35486, -9101, -9710, 27229, 64372, 28514, 18277, 24742, 16906, 44026, 38943, -22638, -36735, -38336, -40904, -30666, -23000, 2786, 24174, 25224, 15292, -23581, -30853, -56047, -67032, -52064, -22687, -29644, -19883, 15017, 10850, 10789, 55184, 59233, 28667, -31086, 13534, -2747, -14693, -34148, -47169, -53769, -48211, -46391, -11930, -10376, -9118, -23449, -39341, -16929, -25607, -49738, -27365, 19815, 30093, -1869, 1528, 41391, 10730, 12435, 17456, -35282, -48392, -49047, -1235, 28393, 27815, 20718, 9462, -12565, -34351, -30448, -15633, -39914, -37243, -8555, -17426, -47532, -78439, -81733, -78215, 11078, 50253, 23625, 28699, 35502, 3919, 3115, -5028, 15746]
9153A5746L7448k4099l0118n8040O235J5937k500P0216L8391J3963m1071l5714
9141F394m5655K6430K322K3427K9528n872k9444n562N7917L0996L1573k3561m9770
9128D8723k9197k2566K9230J4399K4461o728J226m888k0596k5660J8140J0818
9116C7362M3719j199q545N4280J9113J7275k6602m4783k4502K8039L2077q73q346
9103A17015J6297L0428J6910j0438j2578k9261k0358J8792N9872M689k2913L3012
9091B01467L6900j7j3321k21K6781M1567L164k0503J4828M6044Q2396N3867J6713
9078D89665o105M9549R2111Q4187J38399J17170J65569K19748K48632K63952L61906
9067B224783N48395P11150Q48404R59914J027972R52888N24399j33513p81362
$$ y = [15746, 53194, 29095, -1023, -59063, -52828, -36891, -39391, 30825, 69216, 83179, 42108, 6394, -39261, -12831, -10509, 12918, 42446, 36574, 7130, 1568, 59485, 90481, 122054, 98493, 48723, 19526, -3040, 26190, 40589, 65050, 58322, 59548, 54660, 34064, 8404, 26544, 37362, 81081, 79882, 71337, 125617, 144730, 162005, 135403, 90620, 66118, 94157, 126234, 125361, 117015, 133312, 163740, 180650, 170212, 157634, 128373, 108015, 126807, 186679, 191368, 168455, 201467, 238367, 238350, 225029, 224808, 251589, 293156, 296320, 275817, 290645, 336689, 419085, 472952, 489665, 483560, 533109, 625220, 709407, 847806, 964976, 1130545, 1350293, 1598925, 1862877, 2224783, 2773178, 3484328, 4332732, 5292646, 6320618, 7273506, 7797905, 7664392, 6883030]
9058F883030j069255j065533r31660p16300n06998m41565l69361l06823k37874
9049A237661j66233j02324j22683j09073j20875j04477k7045o197n6520o9393
9039C52841l9732k0059m6339k8979K62j0815J8596K074l9092l40l1963p0464J1058
9026I7048L4080p192l5218J3496J3751P902k1695l1943K0233N4744p435j7895
9014A19876r134o4080l0432J01592Q552l2921R236J3578k9170l4327n1148j0195
9002h573j9018j3413J0515J8350K780O994M0722k4208j3277m771L5621O521j1330
8989B6913L1733J5618j0250m9910m320M823j2930j443J9564K6299J5566n286m4598
8976A1779K3517K9653N49k3992J1297k776P641n7101J0985P1141k1600l7556p222
$$ y = [6883030, 5813775, 4748242, 3816582, 3100282, 2593284, 2151719, 1782358, 1475535, 1237661, 1071428, 969104, 846421, 737348, 616473, 511996, 484951, 478754, 422234, 352841, 313109, 293050, 246711, 217732, 217994, 207179, 225775, 227849, 188757, 188417, 156454, 85990, 97048, 131128, 123936, 88718, 102214, 115965, 123867, 102172, 70229, 90462, 145206, 137771, 119876, 110742, 46662, 16230, 117822, 126374, 93453, 102689, 116267, 87097, 52770, 1622, -8573, -27591, -41004, -30489, -12139, -9359, -2365, 38357, 14149, 872, -3899, 31722, 38243, 26913, 58646, 74264, 64014, 14104, 9784, 14607, 1677, 234, 19798, 46097, 61663, 56377, 11779, 35296, 64949, 65498, 41506, 52803, 50027, 57668, 567, 11552, 82693, 61093, 23537, 16315]
8963A6315M3922K1979J0879J368k0470j8972m2672m7850J4026K850K9391l238
8951G528k0142k55q634K1449O1863J2380l5315J361j2764J3218o051n909k9975
8938a246K8252M455J1374J0710k6540J702m540r332J6895n172l2850l021K6684
8925A7371l3109J6783j898p585o295J252j3106j9797N0574L2324J4064R561L1296
8912I1435J4609L116j9057l9136J0688p382p632J391K0686j5099J355J0280k5117
8899D0137m251j6295K3232M997J1350j3077l8682l32J1067n268l9203m0312J9742
8886d6895R142L2526m6462m0376O801L3790M6625R948j7308k1820Q869o557K5933
8873e784j3057O362m527k2855m122J9770J2687j4488j5068J0071k3341m5036J0130
$$ y = [16315, 60237, 82216, 93095, 94463, 73993, 55021, 12349, -35501, -21475, -18625, 10766, 7528, -12614, -12869, -21503, -54, 61809, 74189, 38874, 40235, 27471, 40689, 34638, 28729, -1246, 27006, 31461, 42835, 53545, 27005, 28707, 24167, 14835, 31730, 26558, -6292, -9313, 17371, -15738, 1045, -853, -8438, -14733, -13481, -26587, -46384, 4190, 36514, 50578, 60139, 91435, 106044, 109160, 90103, 50967, 61655, 54273, 46641, 48032, 68718, 53619, 54974, 65254, 40137, 35886, 19591, 42823, 47820, 59170, 46093, 7411, 7079, 18146, 12878, -26325, -66637, -46895, -37753, -5227, -51689, -92065, -85264, -51474, -4849, 5099, -12209, -34029, -25160, -31717, -5784, -18841, -12479, -17006, -39861, -43983, -24213, -11526, -26014, -41082, -31011, -54352, -99388, -89258]
8860h9258M4550P5101l9462j6503L3089K3125k1382P171N496K854l1566p716L2281
8847A7780R500l4089J0908K1386l2125J4310p459R571k6318k965R536M2137L6538
8834F8710l7615k7465J0435p467j6547K0368K4923J8803J3575L912k0347j3258
8822C8027J0925J6139J8661j3896K196m0217m6791J6920J8073L2672j237l0782
8810B0690k535R461m4491l9831P835j4738M5895L6046J3286J531l4625r815M3711
8797C2420K3658l6766l0745n7653j4070N2479N1409L455j5934n608K9104J3447
8785D5196q983Q071m7342l0220M6251K569k9338j7396l3690l750L3491J8126j2192
$$ y = [-89258, -44708, 30393, -9069, -25572, 7517, 30642, 9260, 16431, 21927, 24781, -6785, -14501, 17780, 27280, -6809, 4099, 25485, -6640, 7670, 211, 9782, -16536, -19501, -9965, 32172, 68710, 31095, 3630, 14065, 6598, -9949, 10419, 35342, 54145, 67720, 71632, 51285, 38027, 48952, 65091, 83752, 69856, 72052, 31835, -14956, 1964, 20037, 52709, 51472, 20690, 18155, 27616, -16875, -56706, -48871, -63609, -17714, 18332, 31618, 33149, -1476, -11291, 32420, 56078, 19312, -11433, -69086, -83156, -30677, 20732, 24187, 8253, 2645, 31749, 45196, 36213, 44284, -3058, -33278, 12973, 15542, -13796, -31192, -64882, -68632, -35141, -17015, -29207]
$$ [...]
##END NTUPLES=NMR SPECTRUM
##END=
