##TITLE=Analysis number 323522
Compound Code mo 07996
Project Code adrs
Chemist Name ians
##JCAMPDX= 6.0         $$ Bruker NMR JCAMP-DX V2.0
##DATA TYPE= NMR SPECTRUM
##DATA CLASS= NTUPLES
##ORIGIN= Bruker BioSpin GmbH
##OWNER= nmr
$$ XWIN-NMR		Version 3.5
$$ Thu Oct 26 10:40:37 2006 GMT Daylight Time (UT+1h)  MAYBRIDGE\nmr@NMR_250MHZ
##.OBSERVE FREQUENCY= 250.131544655141
##.OBSERVE NUCLEUS= ^1H
##.ACQUISITION MODE= SIMULTANEOUS (DQD)
##.ACQUISITION SCHEME= undefined
##.AVERAGES= 16
##.DIGITISER RES= 18
##SPECTROMETER/DATA SYSTEM= dpx250
##.PULSE SEQUENCE= zg30
##.SOLVENT NAME= DMSO
##.SHIFT REFERENCE= (INTERNAL, DMSO, 0, 16.522)
##AUDIT TRAIL= $$ (NUMBER, WHEN, WHO, WHERE, WHAT)
$$ ##TITLE= Audit trail, XWIN-NMR		Version 3.5
$$ ##JCAMPDX= 5.01
$$ ##ORIGIN= Bruker BioSpin GmbH
$$ ##OWNER= nmr
$$ C:\u/data/dgb/nmr/ADRS/1760/pdata/1/auditp.txt
$$ ##AUDIT TRAIL=  $$ (NUMBER, WHEN, WHO, WHERE, WHAT)
(   1,<2006-10-26 10:40:00.40 +100>,<MAYBRIDGE\nmr>,<NMR_250MHZ>,
      <created by zg, POWCHK disabled, PULCHK disabled
       configuration hash MD5:
       49 4B E0 1D 92 C2 6B 37 9F E6 65 BC 52 41 86 1D
       data hash MD5: 64K
       6D E0 4B A3 4D 97 8B FC 01 A3 0A 85 B6 F7 FF 4F>)
(   2,<2006-10-26 10:40:17.95 +100>,<MAYBRIDGE\nmr>,<NMR_250MHZ>,
      <Start of raw data processing
       ef LB = 0.3 FT_mod = 6 PKNL = 1 SI = 32K 
       data hash MD5: 32K
       0C CA 3F 2D DF F2 29 A8 E0 D5 25 3F B0 E8 E2 B7>)
(   3,<2006-10-26 10:40:22.56 +100>,<MAYBRIDGE\nmr>,<NMR_250MHZ>,
      <apk 
       data hash MD5: 32K
       46 7A A1 66 92 16 9C 43 61 8D 80 9A C7 66 1A 0C>)
(   4,<2006-10-26 10:40:24.12 +100>,<MAYBRIDGE\nmr>,<NMR_250MHZ>,
      <abs ABSG = 5 
       data hash MD5: 32K
       38 4B 85 0C 50 55 6F 2C C0 53 48 98 8A FB 62 B9>)
$$ ##END=
$$ 
$$ hash MD5
$$ 2E E5 0A AD B6 69 A4 FA 31 C2 CC 58 EC 95 A8 65
##$RELAX= 
##$RELAX= 
##$RELAX= 
##$RELAX= 
##$RELAX= 
##$RELAX= 
##$RELAX= 
$$ Bruker specific parameters
$$ --------------------------
##$DU= <C:\u>
##$EXPNO= 1760
##$NAME= <ADRS>
##$PROCNO= 1
##$TYPE= <nmr>
##$USER= <dgb>
##$AMP= (0..31)
100 100 100 100 100 100 100 100 100 100 100 100 100 100 100 100 100 100 
100 100 100 100 100 100 100 100 100 100 100 100 100 100 
##$AQSEQ= 0
##$AQ_mod= 3
##$AUNM= <au_zg>
##$AUTOPOS= <16 >
##$BF1= 250.13
##$BF2= 250.13
##$BF3= 250.13
##$BF4= 250.13
##$BF5= 500.13
##$BF6= 500.13
##$BF7= 500.13
##$BF8= 500.13
##$BYTORDA= 1
##$CFDGTYP= 0
##$CFRGTYP= 5
##$CHEMSTR= <none>
##$CNST= (0..31)
1 1 145 1 1 1 1 1 1 1 1 1 1 1 1 1 1 1 1 1 1 1 1 1 1 1 1 1 1 1 1 1 
##$CPDPRG= <>
##$CPDPRG1= <>
##$CPDPRG2= <>
##$CPDPRG3= <>
##$CPDPRG4= <mlev>
##$CPDPRG5= <mlev>
##$CPDPRG6= <mlev>
##$CPDPRG7= <mlev>
##$CPDPRG8= <mlev>
##$CPDPRGB= <>
##$CPDPRGT= <>
##$D= (0..31)
0 1 0 0 0 0 0 0 0 0.06 0 0 0 0 0 0 0.0002 0 0 0 0 0 0 0 0 0 0 0 0 0 0 
0 
##$DATE= 1161855599
##$DBL= (0..7)
120 120 120 120 120 120 120 120 
##$DBP= (0..7)
150 150 150 150 150 150 150 150 
##$DBP07= 0
##$DBPNAM0= <>
##$DBPNAM1= <>
##$DBPNAM2= <>
##$DBPNAM3= <>
$$ [...]
##$SUBNAM7= <"">
##$SUBNAM8= <"">
##$SUBNAM9= <"">
##$SW= 20.6930455092707
##$SWIBOX= (0..15)
0 0 3 0 0 0 0 0 0 0 0 0 0 0 0 0 
##$SW_h= 5175.983436853
##$TD= 65536
##$TD0= 1
##$TE= 683.16
##$TE2= 300
##$TE3= 300
##$TEG= 300
##$TL= (0..7)
0 120 120 120 120 120 120 120 
##$TP= (0..7)
150 150 150 150 150 150 150 150 
##$TP07= 0
##$TPNAME0= <>
##$TPNAME1= <>
##$TPNAME2= <>
##$TPNAME3= <>
##$TPNAME4= <>
##$TPNAME5= <>
##$TPNAME6= <>
##$TPNAME7= <>
##$TPOAL= (0..7)
0.5 0.5 0.5 0.5 0.5 0.5 0.5 0.5 
##$TPOFFS= (0..7)
0 0 0 0 0 0 0 0 
##$TUNHIN= 0
##$TUNHOUT= 0
##$TUNXOUT= 0
##$USERA1= <user>
##$USERA2= <user>
##$USERA3= <user>
##$USERA4= <user>
##$USERA5= <user>
##$V9= 5
##$VALIST= <valist>
##$VCLIST= <CCCCCCCCCCCCCCC>
##$VD= 0
##$VDLIST= <DDDDDDDDDDDDDDD>
##$VPLIST= <PPPPPPPPPPPPPPP>
##$VTLIST= <TTTTTTTTTTTTTTT>
##$WBST= 1024
##$WBSW= 4
##$XGAIN= (0..3)
0 0 0 0 
##$XL= 0
##$YL= 0
##$YMAX_a= 439873
##$YMIN_a= -334388
##$ZGOPTNS= <>
##$ZL1= 120
##$ZL2= 120
##$ZL3= 120
##$ZL4= 120
##$ABSF1= 16.522
##$ABSF2= -4.171173
##$ABSG= 5
##$ABSL= 3
##$ALPHA= 0
##$AQORDER= 0
##$ASSFAC= 0
##$ASSFACI= 0
##$ASSFACX= 0
##$ASSWID= 0
##$AUNMP= <proc_1d>
##$AZFE= 0.1
##$AZFW= 0.1
##$BCFW= 0
##$BC_mod= 0
##$BYTORDP= 0
##$COROFFS= 0
##$CY= 12.5
##$DATMOD= 1
##$DC= 0
##$DFILT= <>
##$DTYPP= 0
##$F1P= 14.0000005364418
##$F2P= -0.99999901652339
##$FCOR= 0.5
##$FTSIZE= 32768
##$FT_mod= 6
##$GAMMA= 0
##$GB= 0
##$INTBC= 1
##$INTSCL= 1
##$ISEN= 128
##$LB= 0.3
##$LEV0= 0
##$LPBIN= 0
##$MAXI= 10000
##$MC2= 0
##$MEAN= 0
##$ME_mod= 0
##$MI= 0
##$NCOEF= 0
##$NC_proc= -4
##$NLEV= 6
##$NOISF1= 0
##$NOISF2= 0
##$NSP= 0
##$NTH_PI= 0
##$NZP= 0
##$OFFSET= 16.522
##$PC= 1
##$PHC0= -51.17335
##$PHC1= 7.41808
##$PH_mod= 1
##$PKNL= yes
##$PPARMOD= 0
##$PSCAL= 4
##$PSIGN= 0
##$REVERSE= no
##$SF= 250.13
##$SI= 32768
##$SIGF1= 0
##$SIGF2= 0
##$SINO= 400
##$SIOLD= 32768
##$SREGLST= <1H.DMSO>
##$SSB= 0
##$STSI= 32768
##$STSR= 0
##$SW_p= 5175.98343685301
##$SYMM= 0
##$S_DEV= 0
##$TDeff= 65536
##$TDoff= 0
##$TI= <Analysis number 999999
Compound Code 99
Book Reference 9
Project Code 9>
##$TILT= no
##$TM1= 0
##$TM2= 0
##$TOPLEV= 0
##$USERP1= <user>
##$USERP2= <user>
##$USERP3= <user>
##$USERP4= <user>
##$USERP5= <user>
##$WDW= 1
##$XDIM= 32768
##$YMAX_p= 296349307
##$YMIN_p= -370862
$$ End of Bruker specific parameters
$$ ---------------------------------
##NTUPLES= NMR SPECTRUM
##VAR_NAME=  FREQUENCY,     SPECTRUM/REAL,   SPECTRUM/IMAG
##SYMBOL=    X,             R,               I
##VAR_TYPE=  INDEPENDENT,   DEPENDENT,       DEPENDENT
##VAR_FORM=  AFFN,          ASDF,            ASDF
##VAR_DIM=   32768,         32768,           32768
##UNITS=     HZ,            ARBITRARY UNITS, ARBITRARY UNITS
##FACTOR=    0.157963299565203, 1,           1
##FIRST=     4132.6476996994, 0,             0
##LAST=      -1043.33573715361, 0,           0
##MIN=       -1043.33573715361, -370862,     0
##MAX=       4132.6476996994, 296349307,     0
$$ Real data points
##PAGE= N=1
##DATA TABLE= (X++(R..R)), XYDATA
$$ [...]
17296G556J52801k2772j32189r167P7185N1264l834Q1778l5794l0018L3372M0535
$$ 7556 160357 137585 5396 -3771 73414 124678 120844 202622 166828 136810 170182 210717
17284B10717r003j01414j7818m3547j41948k2550J07002J5658j17783n2596N1907
$$ 210717 201714 100300 82482 38935 -103013 -125563 -18561 -2903 -120686 -173282 -121375
17273a21375J25647l7170k1367K1261l3643J4839M0764R2185M4533o496j3706
$$ -121375 4272 -32898 -54265 -33004 -66647 -51808 -11044 81141 125674 119178 105472
17262A05472L745n0040q8986k2917O2456Q977K0191N9568K4755n6807j26061l2308
$$ 105472 109217 59177 -29809 -52726 9730 18707 38898 98466 123221 66414 -59647 -91955
17250i1955O6505N9748J57274j5204j3174J37951N9064o7091m8137r3880j34304
$$ -91955 -25450 34298 191572 176368 163194 301145 360209 293118 244981 151101 16797
17239A6797L6560M2618m2213o4162P4702p662M8524j4720l9860k1833J020P9948
$$ 16797 53357 95975 53762 -10400 64302 56640 105164 90444 50584 28751 29771 109719
17227A09719J1176j47743o2041J25346R1584o5360j49066j08785N1777J47934
$$ 109719 120895 -26848 -88889 36457 128041 62681 -86385 -195170 -143393 4541
17217D541Q9784R656q6363j6199j11205n7195P854L8262R2170Q0860k0827P536
$$ 4541 94325 103981 17618 1419 -109786 -166981 -159127 -120865 -28695 52165 31338 38874
17205C8874l7066K3411J673P2716O0805R386P0564k9136o7638n4529q0900N0667
$$ 38874 1808 25219 26892 99608 160413 169799 240363 211227 143589 89060 8160 58827
17193E8827j09904L2148R855L6090Q0710Q9377O2492L5868j11171j8281J19456
$$ 58827 -51077 -18929 -9074 27016 107726 197103 259595 295463 184292 166011 285467
17182B85467M6920m9672M9622M9274j438M0584m8552p9290k0310J45112Q0925
$$ 285467 332387 282715 332337 381611 380173 420757 372205 292915 272605 417717 498642
17171D98642O0556m1916o3306Q441P6462P4577J4288J8768K1735q7845J2543O9143
$$ 498642 559198 517282 453976 462417 538879 613456 627744 646512 668247 580402 592945 662088
17159F62088q0114O421J50791K2422j81322j62165q5597L7739j8494P9485Q573
$$ 662088 581974 588395 739186 761608 580286 418121 332524 370263 351769 431254 439827
17148D39827J5866j2497r7566j55869p0130l9205R9451M3926j0461k5339K9189
$$ 439827 455693 443196 345630 189761 119631 80426 179877 223803 213342 188003 217192
17137B17192k4129l1186q5178M1114Q7731J4691o2405r4979J6294J31437J167
$$ 217192 193063 161877 76699 117813 205544 220235 157830 62851 79145 210582 211749
17126B11749L8982J11543K7295n1672r2186p7010p6111l0576Q389O3757J23649
$$ 211749 250731 362274 389569 337897 245711 168701 92590 62014 70403 134160 257809
17115B57809o9460j9881M3622j0428o4825p4018O4799K8679P305k3744l1362j5840
$$ 257809 188349 168468 212090 201662 136837 62819 127618 156297 163602 139858 108496 92656
17103I2656L9728L7463K7182n4206k0072n9197n9740N996O5398k863J2990O4648
$$ 92656 132384 169847 197029 142823 122751 63554 3814 9810 75208 72345 85335 149983
17091A49983j76835j9309Q4268L4857M8669k6670l7383l7111j9652K4828N1443
$$ 149983 -26852 -46161 38107 72964 121633 94963 57580 20469 817 25645 77088
17080G7088N8662j0692j12072p0266m5280l3402J4256P7424q8880O4503J12828
$$ 77088 135750 125058 12986 -57280 -102560 -135962 -121706 -44282 -133162 -68659 44169
17069D4169r538k2869N9281L8568n2993m7816k5945K4438J15923k993j857k0678
$$ 44169 34631 11762 71043 109611 56618 8802 -17143 7295 123218 120225 118368 97690
17057I7690o2738l464N6666j22227N6856J7871K3347O4620l3259j1726J949l1795
$$ 97690 34952 31488 88154 -34073 22783 40654 64001 128621 95362 83636 85585 53790
17045E3790j2666k6392O9215Q6898M5185J4605n4275j03057k1501l6660J5766
$$ 53790 41124 14732 83947 170845 216030 230635 176360 73303 51802 15142 30908
17034C0908P1592J06115n5435o3333n8267o0713L0933P0106P8652P578LN4378
$$ 30908 102500 208615 153180 89847 31580 -29133 1800 71906 150558 158136 158139 212517
17022B12517P1814P1852r0539p3901j1826J1683j0679K7214J02385J15559j4086
$$ 212517 284331 356183 265644 191743 179917 191600 180921 208135 310520 426079 411993
17011D11993m6036l7917L1306m7418j12076n2582M385k544K4187m9110k7032M9615
$$ 411993 365957 328040 359346 311928 199852 147270 151655 149111 173298 124188 97156 146771
16999A46771J31377l184j3681m2908k2312L0565P5007j6461P0308r3998j56311
$$ 146771 278148 274964 261283 218375 196063 226628 301635 285174 355482 261484 105173
16988A05173J2251L1984m9907M5549Q0453o0483n7542J3339J6089J24921N1625
$$ 105173 117424 149408 99501 145050 225503 165020 107478 120817 136906 261827 313452
16977C13452O2663l2539m0378n5636q0103n4323l9435L3137l0493n1897M7393
$$ 313452 376115 343576 303198 247562 167459 113136 73701 106838 76345 24448 71841
16966G1841Q3880k8419R3260J55540P697J2822O2255p0327J571N6176N9913O9579
$$ 71841 155721 127302 220562 376102 383799 396621 458876 388549 390120 446296 506209 575788
16954E75788p474o4845o9105J05194J5232M1269O0274R1355J01769N0870O1336
$$ 575788 568314 503469 434364 539558 554790 596059 656333 747688 849457 900327 961663
16943I61663P1687J05004o3019o183J22438J80870L4692n590k4503J873P6694
$$ 961663 1033350 1138354 1075335 1069152 1191590 1372460 1407152 1401562 1377059 1378932 1455626
16932A455626J01115M2820J34636K16759K61315J98789K11460K70815L19716L63338
$$ 1455626 1556741 1599561 1734197 1950956 2212271 2411060 2622520 2893335 3213051 3576389
16922C576389M32517P16805R53283J020656J349942K031642K702486L490143M322460
$$ 3576389 4008906 4725711 5678994 6699650 8049592 10081234 12783720 16273863 20596323
16913B0596323M896805N412591N802070O134487N600606L855860K020883J138994
$$ 20596323 25493128 30905719 36707789 42842276 48442882 52298742 54319625 55458619
16905E5458619N63001j251774m287138n770616n024402m054281l586712k860357
$$ 55458619 56021620 54769846 50482708 44712092 39687690 35633409 32046697 29186340
16897B9186340j450956J69758J708408K860358L734728M493202M989296M697878
$$ 29186340 27735384 27905142 29613550 32473908 36208636 40701838 45691134 50389012
16889E0389012L122809J284539K95809j65151j713532m516223o339954n895523
$$ 50389012 53511821 54796360 55092169 54927018 53213486 48697263 42357309 36461786
16881C6461786n242835m973691m540497l732819k907686k011068j429819j045417
$$ 36461786 31218951 26245260 21704763 17971944 15064258 13053190 11623371 10577954
16873A0577954o87659l90663k88762k42777k6908J42312L20423O05213R99833
$$ 10577954 9890295 9499632 9210870 8968093 8941185 9083497 9403920 10009133 11008966
16864A1008966J362957J994228K606659L389230M106379M673647N163071N657771
$$ 11008966 12371923 14366151 16972810 20362040 24468419 29142066 34305137 39962908
16856C9962908N487041M255701K402340J193096P33308l85642k950433n283963
$$ 39962908 45449949 49705650 52107990 53301086 54034394 53648752 50698319 45414356
16848D5414356n315574m309828l715471l117006j941508m58293R62041K293975
$$ 45414356 40098782 35788954 32073483 28956477 27014969 26556676 27518717 29812692
16840B9812692L048575L743552M504760M654407L563502J772873N25960P7694
$$ 29812692 32861267 36604819 41109579 45763986 49327488 51100361 51626321 51704015
16832E1704015p43531l107178n696717o034752n302348m870181m634736l983430
$$ 51704015 50960484 47853306 42156589 36121837 30819489 25949308 21314572 17331142
16824A7331142l158225k378687j688617j271279j090391q18513o30551m92293
$$ 17331142 14172917 11794230 10105613 8834334 7743943 6925430 6294879 5802586
16816E802586m86303m35791k68981l91160l31019k91270k25930j38696j39897
$$ 5802586 5316283 4880492 4611511 4220351 3889332 3598062 3372132 3233436 3093539
16807C093539p5325j14776j04186k12296k15386j11550n3728m4065p068j6848
$$ 3093539 3018214 2903438 2799252 2586956 2371570 2260020 2206292 2162227 2155159 2138311
16797B138311p5033p7737j08083q3283p8969j5803M3146M8785j41884k47829j42034
$$ 2138311 2063278 1985541 1877458 1794175 1715206 1699403 1742549 1791334 1649450 1401621 1259587
16786A259587m9046l7545J976j9624j20395q9906L5928j4q3700j760k640K6061
$$ 1259587 1210541 1172996 1174972 1155348 1034953 945047 980975 980961 897261 895501 892861 918922
16774I18922k1444q5216j4293m3359k4182m5489K8154M3878q7247j16844n0076
$$ 918922 897478 812262 797969 754610 730428 684939 713093 756971 669724 552880 502804
16763E02804r9097K4046J02051J142J3056L7943l8378j25386o5725R5031O5305
$$ 502804 403707 427753 529804 530946 544002 581945 543567 418181 352456 447487 512792
16752E12792O184l6483o7817j15184l2183k339k6461M5315M7952m1733k125K1492
$$ 512792 518976 482493 414676 299492 267309 264970 238509 283824 331776 290043 287918 309410
16740C09410p2184M6863J3916J4821N4988K7101K9382O428j86476q6827M845o5418
$$ 309410 237226 284089 298005 312826 367814 394915 424297 430725 244249 157422 162267 96849
16728I6849P1853R4571J44221K7725P4594q6508p6721m3825p5466O722Q6931J1767
$$ 96849 168702 263273 407494 435219 509813 423305 346584 302759 227293 234015 320946 332713
16716C32713n6980j29037n9608L135J02622J9001r6367o7567j01018K0756N5865
$$ 332713 275733 146696 87088 90223 192845 211846 115479 47912 -53106 -32350 23515
16705B3515o1911R4808L6619L7854O3088l7640M4894J1575M405p645l9724q7716
$$ 23515 -38396 56412 93031 130885 193973 156333 201227 212802 217207 209562 169838 82122
16693H2122j8436M7022P6393q3208K1589l2451p6266j8890N6542P902p2569p1049
$$ 82122 63686 110708 187101 103893 125482 93031 16765 -2125 54417 62319 -10250 -81299
16681h1299L7648M7006k9680N075m2502o2218k0185j85J13601R5077k1976j42226
$$ -81299 -43651 3355 -26325 -21250 -63752 -125970 -146155 -146340 -32739 62338 40362 -101864
16669a01864R671O7561O8358Q9455M8691M6038J7011l4324j02087m8384M7916
$$ -101864 -92193 -24632 43726 133181 181872 227910 244921 210597 108510 60126 108042
16658A08042O8730l9211j12428n973K3607j0545p92p2781m3758K026M7478m6789
$$ 108042 176772 137561 25133 19160 42767 32222 31430 -41351 -85109 -83083 -35605 -82394
16646h2394k2225O4188n2198J7575J8839j6419J9218O4296O1651j08740j6318
$$ -82394 -104619 -40431 -92629 -75054 -56215 -72634 -53416 10880 72531 -36209 -52527
16635e2527J3560J4817L7584j4071O0244p6804j8501j6687j8098O3192m1007o0785
$$ -52527 -38967 -24150 13434 -637 59607 -17197 -35698 -52385 -70483 -7291 -48298 -109083
16623a09083K0059o6614j27766Q2498L3701R8894K716l1246N1502L6629p697n9704
$$ -109083 -89024 -155638 -283404 -200906 -167205 -68311 -65595 -96841 -45339 -8710 -16407 -76111
16611g6111n3529l4475R9735K5809K3763O9550k940K3567J41868m0742p7438m4703
$$ -76111 -129640 -164115 -64380 -38571 -14808 54742 51802 75369 217237 176495 99057 54354
16599E4354q1753m2170Q8921J15375j5064p750k5804r3618K583N3936k4948m1225
$$ 54354 -27399 -69569 19352 134727 119663 111913 86109 -7509 -4926 49010 24062 -17163
16587a7163M5528j30499o9554J03352L324p315J9544k0453P1292n6505q8683N3451
$$ -17163 28365 -102134 -171688 -68336 -65012 -72327 -52783 -73236 -1944 -58449 -147132 -93681
16575i3681N929K4983q2019j9506J17489K4307J7930L4194o884N4678m2737p8875
$$ -93681 -87752 -62769 -144788 -164294 -46805 -22498 -4568 29626 22742 77420 34683 -44192
16563d4192J2802J69Q3019l7711j3022k9770j0735O3484N0434p6417N5664j0388
$$ -44192 -31390 -31221 51798 14087 1065 -28705 -39440 24044 74478 -1939 53725 43337
16551D3337m5564q7928K8206P6664n9239m4170M0607L4646q4607l5053N6O0651
$$ 43337 -2227 -90155 -61949 14715 -44524 -88694 -48087 -13441 -98048 -133101 -133045 -72394
16539g2394O5240m1725q74n8257P3219Q882k5269k5257R8098O1833j21913L2975
$$ -72394 -7154 -48879 -49753 -108010 -34791 -25909 -51178 -76435 21663 83496 -38417 -5442
16527e442j3860j9220l7532P4967k5500j10439N007L4146J06939J1037m4609N3106
$$ -5442 -19302 -38522 -76054 -1087 -26587 -137026 -132019 -97873 9066 20103 -24506 28600
16515B8600N3112n2467Q49j1374o8641j6227M0459L6649L7418Q1410k108J8517
$$ 28600 81712 29245 30094 18720 -49921 -66148 -25689 10960 48378 129788 127680 146197
16503A46197q6458q9014K5742k591o9482j69525R6242O2149J1492N9345m5870
$$ 146197 59739 -29275 -3533 -6124 -75606 -245131 -148889 -86740 -75248 -15903 -61773
16492f1773r7452J0321Q5097J1846L5644l0007j14153j14887J00207J08002o9405
$$ -61773 -159225 -148904 -63807 -51961 -16317 -46324 -160477 -275364 -175157 -67155 -136560
16481a36560J01161K2351k3422m5890N9173r983o4853R4204J42118K1318l1507
$$ -136560 -35399 -13048 -36470 -82360 -23187 -33170 -98023 -3819 138299 159617 128110
16470A28110r5105m31J11505r327j10369j01632R7265N8549K774l0386r7339n080
$$ 128110 33005 32574 144079 134752 24383 -77249 20016 78565 81339 50953 -46386 -51466
16458e1466P6017j10229k7188P5367K2192M0671K0195J1650o3462l8337j8105
$$ -51466 24551 -85678 -112866 -37499 -15307 25364 45559 57209 -6253 -44590 -62695
16447f2695M7049Q1143J43170j07540j55706o9803j05581L2465Q2400J20868n753
$$ -62695 -15646 65497 208667 101127 -54579 -124382 -229963 -197498 -115098 5770 17
16436A7j2339j9548O1628N1231j12283K6341n056q1393j14262o3359J5440Q6413
$$ 17 -12322 -31870 29758 80989 -31294 -4953 -10009 -91402 -205664 -269023 -253583 -167170
16424a67170J19465Q5935L1266l8494j1298k9008o0097R341o8948M5541J6390
$$ -167170 -47705 38230 69496 31002 19704 -9304 -69401 -60060 -129008 -83467 -67077
16413f7077J10228R6254k9492m2914m328K2306p4975n2339j0945L0605N8756j4427
$$ -67077 43151 139405 109913 66999 62671 84977 10002 -42337 -53282 -22677 36079 21652
16401B1652M1176O7769Q4864o6452j63063k5532M0945L7492j7665j363m8191k8254
$$ 21652 62828 130597 215461 149009 -14054 -39586 1359 38851 21186 19823 -28368 -56622
16389e6622N8218j0641K3687P4687N1166j27642l7698j19R6703J24555J43714
$$ -56622 1596 -9045 14642 89329 140495 12853 -24845 -24964 71739 196294 340008
16378C40008k2761r5275q0098r4528J16449O1744M5679M5025M6987q2195p4521
$$ 340008 317247 221972 141874 47346 163795 225539 271218 316243 363230 281035 206514
16367B06514o3693K2031o4942o1819M0511P2471o5362j27736j1833k7994M5193
$$ 206514 142821 164852 99910 38091 78602 151073 85711 -42025 -53858 -81852 -36659
16356c6659k1120J4593Q5086k8424m9564M8018L8192J2207m38N8250L3343n1492
$$ -36659 -57779 -43186 41900 13476 -36088 11930 50122 62329 61891 120141 153484 101992
16344A01992p5663K1236O4129O4641N0065k8779R7346Q8182j30408q3308m840
$$ 101992 26329 47565 111694 176335 226400 197621 294967 383149 252741 169433 164593
16333A64593O8778q2411M948M5129j6429o9519n2772J8424O3476P2956J0147k6455
$$ 164593 233371 150960 155908 201037 184608 115089 62317 80741 144217 217173 227320 200865
16321B00865o725m0444k8156N908j0425j5116J2046m2474j6994J36357j3367n0986
$$ 200865 194140 153696 125540 131448 121023 105907 117953 75479 58485 194842 181475 130489
16309A30489M4116j9200l4862o9231k7988M1825R4317k4229r8194p0999N6644
$$ 130489 174605 155405 120543 51312 23324 65149 159466 135237 37043 -33956 22688
16298B2688Q8382l9330n2038Q940o7734l7236K5859P8692K5924J9711n9312p6371
$$ 22688 111070 71740 19702 28642 -39092 -76328 -50469 28223 54147 73858 14546 -61825
16286f1825j3124Q5364Q7935k0724k1721n7150J23038L901m7579r6439k1008M0785
$$ -61825 -74949 10415 98350 77626 55905 -1245 121793 125694 78115 -18324 -39332 1453
16274A453N654P378P1339j9640n5052K7111m0947r729k4649K0869K529L3745R3639
$$ 1453 7107 14485 85824 66184 11132 38243 -2704 -12433 -37082 -16213 -13684 20061 113700
16261A13700j4329l0948p7407p3414M0742j095L7435O5379L1325q419J5024J1461
$$ 113700 99371 68423 -8984 -82398 -41656 -42751 -5316 60063 91388 82969 97993 109454
16249A09454k3984j26114r4808l8724J4767O2194O5984R2079L6267J0673p7869
$$ 109454 85470 -40644 -135452 -174176 -159409 -97215 -31231 60848 97115 107788 29919
16238B9919m8234o1770q958N3392j8292l0313j6012N8795K1291n7927l734j3234
$$ 29919 -18315 -80085 -89043 -35651 -53943 -84256 -100268 -41473 -20182 -78109 -81843 -95077
16226i5077k166L5414J1510j9500k3906J648O5950k5844p2621J06801O5802n9295
$$ -95077 -97243 -61829 -50319 -69819 -93725 -92077 -26127 -51971 -124592 -17791 48011 -11284
16214a1284L1572o169j39679K4197L4814J101K3561k3983o6110L9721R3059M3941
$$ -11284 20288 14119 -125560 -101363 -66549 -65448 -41887 -65870 -131980 -92259 800 44741
16202D4741n4599q6033o6454K3705K3924L2066Q0167k4752O052J5226K4144l0224
$$ 44741 -9858 -95891 -162345 -138640 -114716 -82650 -2483 -27235 -21183 -5957 18187 -12037
16190a2037o1916M4465j4065j08783M7917R6435J09111l9200o8052J172q932j26540
$$ -12037 -73953 -29488 -43553 -152336 -104419 -7984 101127 61927 -6125 -4953 -13885 -140425
16178a40425J0434k4201j00405L1759R6609l2636K5363K5130m7757n8151M2448
$$ -140425 -129991 -154192 -254597 -222838 -126229 -158865 -133502 -108372 -156129 -214280 -171832
16167a71832R410P8710M2279o967o5588n2078O9322J20095p7691k5244Q1303j12759
$$ -171832 -162422 -83712 -41433 -48400 -113988 -166066 -96744 23351 -54340 -79584 1719 -111040
16155a11040O4160J44418M1409q0126o5431j10481j06108j09375O170J829J19050
$$ -111040 -46880 97538 138947 58821 -6610 -117091 -223199 -332574 -326404 -324575 -205525
16144b05525J15357J0160j14006q3359m3791l38J12990J48081N9328k8043M8611
$$ -205525 -90168 -80008 -194014 -277373 -321164 -321502 -208512 -60431 -1103 -29146 19465
16133A9465r3205p2785O1242J01435K1609K5575L09m8768O0226M4266j713q9453
$$ 19465 -73740 -146525 -85283 16152 37761 63336 63645 14877 75103 119369 117656 28203
16121B8203q5199J1133N3628n3019L962L3289R7275N5378j59137j33867L4089
$$ 28203 -56996 -45863 7765 -45254 -41292 -8003 89272 144650 -14487 -148354 -114265
16110a14265Q2919k7428L8986R2027q3995n1840m0970q4335j4615N0667K9419
$$ -114265 -31346 -58774 -19788 72239 -11756 -63596 -104566 -188901 -203516 -152849 -123430
16099a23430n6609o2854J02693P7126L5484M623j10281j3222L2739Q0123M4945
$$ -123430 -180039 -242893 -140200 -63074 -27590 -22967 -133248 -146470 -113731 -33608 11337
16088A1337j8860m1452m9j16080l9959J02753J06495k517j0004j0747P637N4836
$$ 11337 -7523 -48975 -49024 -165104 -205063 -102310 4185 1668 -8336 -19083 -11446 43390
16076D3390Q7029J5410j8663o633j1965m0572m8847j54583m122J04641m4811j09499
$$ 43390 130419 145829 127166 120533 108568 67996 19149 -135434 -139556 -34915 -79726 -189225
16064a89225O6208R2083j45280k711J05784l5512L0768R3459k7567m5860j3174
$$ -189225 -123017 -30934 -176214 -178925 -73141 -108653 -77885 15574 -11993 -57853 -71027
16053g1027p0164P744K0837P9914R5515r6063j07174K8086P1667o4585r1698n963
$$ -71027 -141191 -133447 -112610 -32696 62819 -33244 -140418 -112332 -40665 -105250 -196948 -202911
16041b02911j0162L3386Q9692N3651M6141p5777m6516M6804J021j2040k208p7211
$$ -202911 -213073 -179687 -89995 -36344 9797 -65980 -112496 -65692 -64671 -76711 -78919 -156130
16029a56130O4773K9325l5659j6026O1228q776M6457N5687j3030r8025j9482J23482
$$ -156130 -91357 -62032 -97691 -113717 -52489 -61265 -14808 40879 27849 -70176 -89658 33824
16017C3824M6855P9415L6894j30451q9634r5685J04912P8957k8848o6012L9860
$$ 33824 80679 160094 196988 66537 -23097 -118782 -13870 65087 36239 -29773 10087
16006A0087n6201K7224L6582q0012n3071m8380N1222L7457l61k0014O3539K1512
$$ 10087 -46114 -18890 17692 -62320 -115391 -163771 -112549 -75092 -75453 -95467 -31928 -10416
15994a0416n5615m1266O5735Q1000J194N8222n2782p4802j11218p1804K6876M3496
$$ -10416 -66031 -107297 -41562 39438 40632 98854 46072 -28730 -139948 -211752 -184876 -141380
15982a41380L5487L0243J7589m654K1752k9557o7229K6186k743J6190l5581N5589
$$ -141380 -105893 -75650 -58061 -62715 -40963 -70520 -137749 -111563 -114306 -98116 -133697 -78108
15970g8108Q8286l9605K951j4869n6532m2615N7138M9092n0792J1341M0178M4117
$$ -78108 10178 -29427 -26476 -41345 -97877 -140492 -83354 -34262 -85054 -73713 -33535 10582
15958A0582q994K8046m234q5813j1291L157j00978l4491J11318P4644k071k174
$$ 10582 1588 29634 25400 -60413 -71704 -68547 -169525 -204016 -92698 -18054 -20125 -22299
15946b2299l1609K5762m1171r5833l9777j6681J06151J24351Q0861m472j47356
$$ -22299 -53908 -28146 -69317 -165150 -204927 -221608 -115457 8894 89755 85283 -62073
15935f2073j20969k1607N6214J60747M6191P80l340n5242K4490K0187j6325N838
$$ -62073 -183042 -204649 -148435 12312 58503 59283 55943 701 25191 45378 29053 34891
15923C4891p9717L0243j1214O6639P0167k5106j20978J5597p3049l0943R002q721
$$ 34891 -44826 -14583 -25797 40842 111009 85903 -35075 -19478 -92527 -123470 -114468 -123189
15911a23189n2613K2899k9079Q0601O1934j7277M6285o4599M9671j8237L3956
$$ -123189 -175802 -152903 -181982 -101381 -39447 -56724 -10439 -75038 -25367 -43604 -9648
15900i648m32N017n1090q099O7380O8425m8027m9193K6275p3767M5694R5072k8142
$$ -9648 -10080 -5063 -56153 -64252 3128 71553 23526 -25667 608 -73159 -27465 67607 39465
15887C9465N7256Q4574p9195n2941l9277o1387p3987j3244M8822j9007K8786N6483
$$ 39465 96721 181295 102100 49159 9882 -51505 -125492 -138736 -89914 -108921 -80135 -23652
15875b3652M6381k5424p3889l8890l3326Q4344P5449K9787j3752q7308k2618K4958
$$ -23652 22729 -2695 -76584 -115474 -148800 -64456 10993 40780 27028 -60280 -82898 -57940
15863e7940Q7100o0299j23054Q319N9214O946R184L3656m339P339l1417M4997
$$ -57940 29160 -31139 -154193 -145874 -86660 -79714 -70530 -36874 -41213 -33874 -65291 -20294
15851b0294k5713L7936K4437j11050K7436J3268k090L2084O2314m5675q3751p09
$$ -20294 -46007 -8071 16366 -94684 -67248 -53980 -56070 -23986 38328 -7347 -91098 -91807
15839i1807K6326p3936r737k1229R1889L140q2209r3476O0184L6210k7687K6306
$$ -91807 -65481 -139417 -149154 -170383 -78494 -75354 -157563 -251039 -190855 -154645 -182332 -156026
15827a56026K0996j4396l253J090P3269J9151N403j8822l7255j30420M7762N7160
$$ -156026 -135030 -149426 -152679 -151589 -78320 -59169 -53766 -72588 -109843 -240263 -192501 -135341
15815a35341P4037m3515K051O0371J3044k2432q465K08M0791k5744O7465N1366
$$ -135341 -61304 -104819 -102768 -42397 -29353 -51785 -60250 -60042 -19251 -44995 22470 73836
15803G3836K6683p0447q4419m2160J9571q5634K374N2469p4650m1758N8092O1762
$$ 73836 100519 30072 -54347 -96507 -76936 -162570 -160196 -107727 -182377 -224135 -166043 -104281
15791a04281L9941j20269P4713J32845Q105p8686j9478M4828k1208J860J4616
$$ -104281 -64340 -184609 -109896 22949 31054 -47632 -67110 -22282 -43490 -41630 -27014
15780b7014l8319j77913N50J37889M2788P4838L475m4769k0747J3922K3719j01121
$$ -27014 -65333 -243246 -242696 -104807 -62019 12819 16294 -28475 -49222 -35300 -11581 -112702
15768a12702K6202Q8112j8473o4926K1273N2908j26415O826L1466p578k3908k6093
$$ -112702 -86500 1612 -16861 -81787 -60514 -7606 -134021 -127195 -95729 -103307 -127215 -153308
15756a53308J9362O841Q692Q5015J9225o6086j5372O1853L0675J9583j3250o1792
$$ -153308 -133946 -127105 -118413 -33398 -14173 -80259 -95631 -33778 -3103 16480 3230 -58562
15744e8562N9252l9807l5441k2548J7957Q369k0214k1816J1535P5743n215j7003
$$ -58562 690 -39117 -74558 -97106 -79149 -70780 -90994 -112810 -101275 -25532 -30747 -47750
15732d7750K813R739p3583o3931J21667N9350K1451K8595q9418q6589m6480O0113
$$ -47750 -44937 -35198 -108781 -172712 -51045 8305 29756 58351 -31067 -117656 -164136 -104023
15720a04023N2020k9039n6215L8704O5567k1367m5878j6798p2231m9542p76O5457
$$ -104023 -52003 -81042 -137257 -98553 -32986 -54353 -100231 -117029 -189260 -238802 -239578 -174121
15708a74121n1117j7157P8088J37611J67436k040j10844r7580M1960O4492J9394
$$ -174121 -225238 -242395 -164307 -26696 140740 138700 27856 -69724 -27764 36728 56122
15697E6122n9457M3969O1731K3012n6643L7167o5457o9325N8196N8869J60625
$$ 56122 -3335 40634 102365 125377 68734 105901 40444 -28881 29315 88184 248809
15686B48809l9152o9055m1798p4465O6648p4958j1702l8301N7920m2353p4075
$$ 248809 209657 140602 98804 24339 90987 16029 4327 -33974 23946 -18407 -92482
15675i2482M6244J30825L1242r1489q5932N730m0236n1209J9137J52341O8353
$$ -92482 -46238 84587 115829 24340 -61592 -55862 -96098 -147307 -128170 24171 92524
15664I2524k8181n5620r3743p1816l5544J21656J23630o5501r9771j143M3387
$$ 92524 64343 8723 -85020 -156836 -192380 -70724 52906 -12595 -112366 -113509 -70122
15653g0122m652P933P7117N9196l6730r5048j25807j3274L3455N0758Q1615k882
$$ -70122 -74774 -66841 10276 69472 32742 -62306 -188113 -201387 -167932 -117174 -35559 -38441
15641c8441K7593M6773j940n510N3342m6013m5715Q8740J35394m7890k3159j18923
$$ -38441 -10848 35925 33985 28475 81817 35804 -9911 78829 214223 166333 143174 24251
15629B4251k3410J07326K5743r2921J958k2551J1297O434j9548m9689j27834K940
$$ 24251 841 108167 133910 40989 42947 20396 31693 38127 18579 -31110 -158944 -156004
15617a56004J37872p6851l258j6438L8385o1956j6717r625P0085N4008R5934l7248
$$ -156004 -18132 -94983 -98241 -114679 -76294 -138250 -154967 -164592 -94507 -40499 55435 18187
15605A8187M238P3102N2824j26807q0315K6707K4157k5616O1742N4554k0602j33621
$$ 18187 22425 95527 148351 21544 -58771 -32064 -7907 -33523 28219 82773 62171 -71450
15593g1450o249l1934n035R6351O5993n1587k6130K433k637r1333j2979J25245
$$ -71450 -77699 -109633 -114668 -18317 47676 -3911 -30041 -27608 -30245 -121578 -134557 -9312
15581i312K9978l7963k6657Q4274N5346o9836j7762m9378l9884p4778N4948N5222
$$ -9312 20666 -17297 -43954 40320 95666 25830 8068 -41310 -81194 -155972 -101024 -45802
15569d5802N6522j11763L482m8256M3803K01766k303j73661m0257R3973N9599
$$ -45802 10720 -101043 -97561 -145817 -102014 99752 97449 -76212 -116469 -22496 37103
15558C7103j4642k9122K8803m1336L2658M8263L6705m0111o486j9521o5239o5903
$$ 37103 22461 -6661 22142 -19194 13464 61727 98432 58321 51835 32314 -32925 -98828
15546i8828k9659K4206n8437m1323j4823M825k5559r474J01006J35374O5443n0281
$$ -98828 -128487 -104281 -162718 -204041 -218864 -214039 -239598 -249072 -148066 -12692 52751 2470
15534B470n2334m7840o2692J14180K6268p4516n0420L8110P380R2383j18450p1867
$$ 2470 -49864 -97704 -160396 -46216 -19948 -94464 -144884 -106774 -99394 -7011 -125461 -197328
15522a97328P5887L0286k9162O7329O6618N7528K2258k4911n3677J7610m3057
$$ -197328 -121441 -91155 -120317 -52988 13630 71158 93416 68505 14828 32438 -10619
15511a0619J9244o2365N3492L1508j7490n7929p2325J9706M587K2558O546o8722
$$ -10619 8625 -53740 -248 31260 13770 -44159 -116484 -96778 -92191 -69633 -63087 -131809
15499a31809m7171j6281n720O9307P310L9313O9680M8888M4143o214p1338j09758
$$ -131809 -178980 -195261 -200981 -131674 -124364 -85051 -15371 33517 77660 71446 108 -109650
15487a09650J7187J09754N1888q2522j7407P1347n8694P4151L2292q8864p0298
$$ -109650 -92463 17291 69179 -13343 -30750 40597 -18097 56054 88346 -518 -70816
15476g0816M4904J6521n8164J01369Q4506r6477j22704K1967n994N6072J7428
$$ -70816 -25912 -9391 -67555 33814 118320 21843 -100861 -78894 -84888 -28816 -11388
15465a1388n6673Q9693K9999J5278J9223J5586K4490Q5050j1377j53032o9258
$$ -11388 -68061 21632 51631 66909 86132 101718 126208 211258 199881 46849 -22409
15454b2409Q4928K7813N799K101p9968j0630m6812J9693O5722K720q1440p479
$$ -22409 62519 90332 96131 98232 18264 7634 -39178 -19485 46237 48957 -32483 -39962
15442c9962n1083L7372J28060L1472o6956R7168O3453j23960r92n3865k9484J01905
$$ -39962 -91045 -53673 74387 105859 38903 136071 199524 75564 74572 20707 -8777 93128
15430I3128R6103k1933j05989q2492K9618O5390J46622K3145l5820N852k2896
$$ 93128 189231 167298 61309 -21183 8435 73825 220447 243592 207772 213624 190728
15419A90728j33860J1319P2481l5260P350m0980O3913L8991P9181m0694m3126
$$ 190728 56868 68187 140668 105408 112758 71778 135691 174682 253863 213169 170043
15408A70043Q5577n044r7839j10187j5212L5892J3989l7822n2662M6966O5274
$$ 170043 255620 250576 152737 42550 27338 63230 77219 39397 -13265 33701 98975
15397I8975J7403P1104P1661P847P6145l1386k7036M1617k434J2079M435k423
$$ 98975 116378 187482 259143 266990 343135 311749 284713 326330 323896 335975 340410 337987
15385C37987j7093N7360L0746l5798Q0127R5606m5002J6910M4674P2146K4626
$$ 337987 320894 378254 409000 373202 453329 548935 503933 520843 565517 637663 662289
15374F62289p4908j57001m0334R566q1991N216J06528N8813n345j97386p8658
$$ 662289 587381 430380 390046 399612 317621 322837 429365 488178 482833 285447 206789
15363B06789k1994K5649N55J41878J0706J0739J09709Q9127L3389q477m2284P6186
$$ 206789 184795 210444 210999 352877 363583 374322 484031 573158 606547 598070 555786 631972
15351F31972M2205L494K7400J11391P3655l7728K2388J13812J74548J38101l9691
$$ 631972 674177 677671 705071 816462 890117 852389 874777 988589 1163137 1301238 1261547
15340A261547k03173k34995j08750l9882n2405r2620L4667M4634j38276r3115
$$ 1261547 1058374 823379 714629 674747 622342 529722 564389 609023 470747 377632
15330C77632k3358N5318J56913m7551m4719j914k3535J04160M9023J9013J09408
$$ 377632 354274 409592 566505 518954 474235 472321 448786 552946 601969 620982 730390
15319G30390K8688l9289n1786l2603r2735l4247l8396N1886P4903Q9502L6735
$$ 730390 759078 719789 668003 635400 542665 508418 470022 521908 596811 686313 723048
15308G23048m1268k7593K539L7873n041L22o6933j7243k970m4141k4186k4784
$$ 723048 681780 654187 656726 694599 689558 689880 622947 605704 602734 558593 534407 509623
15296E09623O1760N5967P6830q8435j45081n4728p5216L1465J27425N3301j7741
$$ 509623 571383 627350 704180 615745 470664 415936 340720 372185 499610 552911 535170
15285E35170j373P2463r620n6170m0803l4735m9959q7325J6412j0203P2893Q2608
$$ 535170 533797 606260 596640 540470 499667 464932 414973 327648 344060 333857 406750 489358
15273D89358m2842j40297O9334P2309k9353J3298P0816R7429J9709l7947r232
$$ 489358 446516 306219 375553 447862 418509 431807 502623 600052 619761 581814 572582
15262E72582J09292Q6408J737L5640P4236J09527L0596q5074p8082j3631N8899
$$ 572582 681874 768282 770019 805659 879895 989422 1020018 934944 856862 843231 902130
15251I02130l70N0896R4703O2039K8211J09672L0382J3020l473j068Q5864J00990
$$ 902130 901760 952656 1047359 1109398 1137609 1247281 1277663 1290683 1287210 1286142 1372006 1472996
15239A472996j9996J05759J86753J81103N8817J14879J49609K06476K72526J68922
$$ 1472996 1453000 1558759 1745512 1926615 1985432 2100311 2249920 2456396 2728922 2897844
15229B897844J93705K39634K99142L29533L07415N21843N23347O10539P29968
$$ 2897844 3091549 3331183 3630325 3959858 4267273 4789116 5312463 5923002 6652970
15220F652970Q69120Q87655J043399J452953J839431K323849K736308L115222
$$ 6652970 7522090 8409745 9453144 10906097 12745528 15069377 17805685 20920907
15212B0920907L450397L616061L521184L119639K682060J976824J155271J25556
$$ 20920907 24371304 27987365 31508549 34628188 37310248 39287072 40442343 40567899
15204D0567899j118417k312851l109190l581685l539926l070006k554799k039933
$$ 40567899 39449482 37136631 34027441 30445756 26905830 23835824 21281025 19241092
15196A9241092j730951j311606r14595o21060m54610j80222j0902K24724L84062
$$ 19241092 17510141 16198535 15283940 14662880 14208270 14028048 14017146 14241870 14625932
15187A4625932M95002O70255J098177J498717J914782K401684L062919L873164
$$ 14625932 15120934 15791189 16889366 18388083 20302865 22704549 25767468 29640632
15179B9640632M865566N891814O932389P921568Q310624P983283O939048N241382
$$ 29640632 34506198 40398012 47330401 55251969 63562593 71545876 78484924 83726306
15171H3726306L295386J124294j208299m028741o817106q714028r157668q522574
$$ 83726306 87021692 88145986 86937687 82908946 76091840 67377812 58220144 49697570
15163D9697570p306818n932183m674553l746836k984541k297977j851653j616316
$$ 49697570 42390752 36458569 31784016 28037180 25052639 22754662 20903009 19286693
15155A9286693j218858q14030o80697m42934k71161o5724K06028M58976P41194
$$ 19286693 18067835 17253805 16573108 16130174 15859013 15793289 15999317 16458293 17199487
15146A7199487J013657J380548J866762K353426K715843L162121L487823L554392
$$ 17199487 18213144 19593692 21460454 23813880 26529723 29691844 33179667 36734059
15138C6734059L188755K625998J879598R70075l31223j503689k624339l735478
$$ 36734059 39922814 42548812 44428410 45398485 45067262 43563573 40939234 37203756
15130C7203756m336355m325974l805890l356191k779297k352167j932506j526594
$$ 37203756 32867401 28541427 24735537 21379346 18600049 16247882 14315376 12788782
15122A2788782j233947j172775r24004r09168p49810n89664n97395l55695l57563
$$ 12788782 11554835 10382060 9458056 8548888 7799078 7209414 6612019 6256324 5898761
15113E898761m73963l65515l48691k60099j96732j56805j95974k80578k20875
$$ 5898761 5424798 5059283 4710592 4450493 4253761 4096956 3900982 3620404 3399529
15104C399529j20981j18873j73829q3830o2745m2445j50393r0511p5218n3611
$$ 3399529 3278548 3159675 2985846 2902016 2839271 2796826 2646433 2555922 2480704 2427093
15094B427093r1473j14116q0771r6929j70397j22813j16418o0284m2367m1659
$$ 2427093 2335620 2221504 2140733 2043804 1873407 1750594 1634176 1573892 1531525 1489866
15084A489866n4224k3284q9159m124m2962p0973K430K3847O589m2436o947j487
$$ 1489866 1435642 1412358 1323199 1319075 1276113 1205140 1207570 1231417 1238006 1195570 1188623 1187136
15072A187136m0484n7540m5796l8940K1600l3520q2872j2272L7132J6184j60513
$$ 1187136 1146652 1089112 1043316 1004376 1025976 992456 909584 897312 934444 950628 790115
15061G90115o8104J6126J75106K1544o5967j10953p0828j28496M3904o176M7067
$$ 790115 722011 738137 913243 934787 868820 757867 687039 558543 602447 596271 643338
15050F43338L648o0968j25841K4254k9765O5965R4141Q198r3095p7223m084J674
$$ 643338 646986 586018 460177 484431 454666 520631 614772 622970 529875 452652 448568 450242
15038D50242m2745l3906J28209N7485n8511j72374k3259Q0733k0092l3509J29336
$$ 450242 407497 373591 501800 559285 500774 328400 305141 385874 365782 332273 461609
15027D61609J6427m4078J9562o0652K2143L3494q0104p765P3665P2253K2521o5817
$$ 461609 478036 433958 453520 392868 415011 448505 368401 360636 434301 506554 529075 463258
15015D63258r0423j5467M3455O894j0879l7787n0338l4526j7068R3935o5509k3210
$$ 463258 372835 357368 400823 407717 396838 359051 308713 274187 257119 351054 285545 262335
15003B62335K7952J2516p4457r7403q8803Q7211J02487K4233R378N363p1295q2090
$$ 262335 290287 302803 228346 130943 42140 129351 231838 256071 265449 270812 199517 117427
14991A17427N6593M4563j06896p2722M9244N4640P4883J35664M4645Q7015p6513
$$ 117427 174020 218583 111687 38965 88209 142849 217732 353396 398041 485056 408543
14980D08543j97236j29614J9974o7704m3262L9574q980j7366m5551P228P5033
$$ 408543 211307 81693 101667 33963 -9299 30275 21295 3929 -41622 -34394 40639
14969D0639L9001J355n9227o3985N2854P0301o2235r1362N6568J17791L8355n9587
$$ 40639 79640 80995 21768 -42217 10637 80938 18703 -72659 -16091 101700 140055 80468
14957H0468l0746l0984J7210n0768j873O9078N8473m057j7950q9915k3890p1056
$$ 80468 49722 18738 35948 -14820 -16693 52385 110858 106801 88851 -1064 -24954 -96010
14945i6010J00754R1076m6024M5866q916n2438o7019M2631j2008M0154l4823P3163
$$ -96010 4744 95820 49796 95662 86746 34308 -32711 9920 -2088 38066 3243 76406
14933G6406k4591j18984L9912l5458q0349N4809P6812M6772J29475m0620K099
$$ 76406 51815 -67169 -27257 -62715 -143064 -88255 -11443 35329 164804 124184 126283
14922A26283L6635P5374Q686n8855j75764j17568J1887N0955k4689L1264O2777
$$ 126283 162918 238292 246978 188123 12359 -105209 -93322 -42367 -67056 -35792 26985
14911B6985M8927J8807l2777J6232o154p3194q9093K8250Q8532L720k3028J1524
$$ 26985 75912 94719 61942 78174 72020 -1174 -90267 -62017 26515 30235 7207 18731
14899A8731K0029J05586k1172K1979m5980n3547L2812P742J15182K4159q313j27614
$$ 18731 38760 144346 123174 145153 99173 45626 78438 86180 201362 225521 217208 89594
14887H9594j3688j5790p9088M9020L103j02455p4318L4313P2498j1440L0136j1571
$$ 89594 75906 60116 -18972 30048 33151 -69304 -143622 -109309 -36811 -48251 -18115 -29686
14875b9686p8068R546R7046R5757k4287l2095o0977k9542N6074M8461P985j06142
$$ -29686 -107754 -98208 -1162 94595 70308 38213 -22764 -52306 3768 52229 60214 -45928
14863d5928M5458N6003L9102O2666l7145o474O626l8427p2075n7772L3200M5002
$$ -45928 -470 55533 94635 157301 120156 113682 120308 81881 9806 -47966 -14766 30236
14851C0236M2614p4150Q7739P5333q2777j46410l768L4420L5009N9658M9293J4788
$$ 30236 72850 -1300 86439 161772 78995 -67415 -71183 -36763 -1754 57904 107197 121985
14839A21985k2342k3599J09430M2209k2852r0155o6451m2840p435P810p0146o204
$$ 121985 99643 76044 185474 227683 204831 114676 48225 5385 -2050 5760 -64386 -70590
14827g0590J1532M9256k0154p5167M8431O7752J6931r4910p7099k0198L2951J0510
$$ -70590 -59058 -9802 -29956 -105123 -56692 11060 27991 -66919 -144018 -164216 -131265 -120755
14815a20755J9090M2380l2612N4129J11629N5965o8636j067m364k4185O6040l5951
$$ -120755 -101665 -59285 -91897 -37768 73861 129826 61190 60123 55759 31574 97614 61663
14803F1663l1501q6801o8457J01958Q0541n8557L0164l345q3287n7289R4384J3574
$$ 61663 30162 -56639 -125096 -23138 57403 -1154 29010 25665 -57622 -114911 -20527 -6953
14791f953k267J6630k369M2717j2340j18333k3920m574n018Q4913o3646j44824
$$ -6953 -9220 7410 5041 47758 35418 -82915 -106835 -111409 -116427 -31514 -95160 -239984
14779b39984o8691J28594K709k5393Q5908M2284L7930j8303P4736K6502j82463
$$ -239984 -308675 -180081 -177372 -202765 -116857 -74573 -36643 -54946 19790 46292 -136171
14768a36171k4485q535M8876K1475J3966L5435O5530L56J0586O917k2252o4142
$$ -136171 -160656 -169191 -120315 -98840 -84874 -49439 16091 16447 27033 33950 11698 -52444
14756e2444j16639k1873l914q4333R4658P5380j5948m0432m9600Q3269K0552J67753
$$ -52444 -169083 -190956 -194870 -279203 -184545 -109165 -125113 -165545 -215145 -131876 -111324 56429
14744E6429Q5864n9417j7099K640q734l5833k0990m4297R436J092J9289K0228
$$ 56429 142293 82876 65777 68417 59683 23850 2860 -41437 -32001 -30909 -11620 8608
14732H608J2955Q201M067k7552o723K0582J10680m4238o2490j15322m8461m7566
$$ 8608 21563 29764 33831 6279 -444 20138 130818 86580 24090 -91232 -139693 -187259
14720a87259K653M5582M8059j46645J6842J52466O6665J01390J55947m5820j14532
$$ -187259 -184606 -139024 -90965 -237610 -220768 -68302 -1637 99753 255700 209880 95348
14709I5348l6671m2903K5630m3179n9591P7419m596k9550J00078k6353o9839p6085
$$ 95348 58677 15774 41404 -1775 -61366 16053 11457 -18093 81985 55632 -14207 -90292
14697i0292K2348M6652R6991m3578q2096K892o0673o1673R2950L5092j8864J00856
$$ -90292 -67944 -21292 75699 32121 -49975 -47083 -107756 -169429 -76479 -41387 -60251 40605
14685D0605l3275k572J5132J05042L3570l2414j09924m5276P6501K7388K1752
$$ 40605 7330 4758 19890 124932 158502 126088 16164 -29112 47389 74777 96529
14674I6529k8255k5805K4029m5288q8167O4242P8125l9630j5356k0214J8995j48584
$$ 96529 68274 42469 66498 21210 -66957 -2715 75410 35780 20424 210 19205 -129379
14662a29379j650K4051R5194L0210O670p0327N6635Q0904q5905N13k8888R3117
$$ -129379 -131029 -106978 -11784 18426 25096 -45231 11404 92308 6403 6916 -21972 71145
14650G1145m1595n2380K543l4220P4566n317k4077L999M653P7769m0050o9714
$$ 71145 29550 -22830 -20287 -54507 20059 14742 -9335 -5336 -683 77086 37036 -32678
14638c2678l5715R5919p9551p8538L1676M7547J01456l0159o3177j2285j4595
$$ -32678 -68393 27526 -52025 -130563 -98887 -51340 50116 19957 -43220 -55505 -70100
14627g0100j9753k8162p1028L8850L2256M9157N5257n6253J5499J9768j1174K9301
$$ -70100 -89853 -118015 -189043 -150193 -117937 -68780 -13523 -69776 -54277 -34509 -45683 -16382
14615a6382n8306q8039N0248K01472L3531p7894p0391J1964R641j4985n6572p8009
$$ -16382 -74688 -162727 -112479 88993 122524 44630 -25761 -13797 -4156 -19141 -75713 -153722
14603a53722P8338M2022M4419j693K7905K2938q78n4424m9501k0699J0866O2965
$$ -153722 -75384 -33362 11057 9364 37269 60207 59329 4905 -44596 -65295 -54429 8536
14591H536J9235n9707L7465l4838r677P3851l3971l3862J8471k4882k7510j5183
$$ 8536 27771 -31936 5529 -29309 -38986 34865 894 -32968 -14497 -39379 -66889 -82072
14579h2072J9894r7021j0288J4792q163K2593Q6281L651m2222Q583p870M147q0219
$$ -82072 -62178 -159199 -169487 -154695 -162858 -140265 -53984 -50333 -92555 -83972 -91842 -87695 -167914
14566a67914k5156r405o889Q4361O3198J00299M1714j09802J000K6921j01686
$$ -167914 -193070 -202475 -209364 -125003 -61805 38494 80208 -29594 -28594 -1673 -103359
14555a03359k3382M9666j9390K5323Q2832q1655l2729J13803k6502k8477j3893
$$ -103359 -126741 -77075 -96465 -71142 11690 -69965 -102694 11109 -15393 -43870 -57763
14544e7763J07981j0255M6055l8279o6652j45408l9514R9442M7503P4631N4847
$$ -57763 50218 39963 86018 47739 -18913 -164321 -203835 -104393 -56890 17741 72588
14533G2588n6529J2963J072p2270k1143R3875K8929q5225p7548P3917M8205l1381
$$ 72588 16059 29022 30094 -42176 -63319 30556 59485 -25740 -103288 -29371 18834 -12547
14521a2547r131j5459n1996J4835J1939M2290N8964J2409n102k6925o0264l1200
$$ -12547 -21678 -37137 -89133 -74298 -62359 -20069 38895 51304 46202 19277 -40987 -72187
14509g2187P1714k2649M4482P7462p3394l6454Q061o4164n0570j2852O8513J9387
$$ -72187 -473 -23122 21360 98822 25428 -11026 -2965 -67129 -117699 -130551 -62038 -42651
14497d2651o7504l8775K3860O244J0404R2746N673m467R098N3280L9503r8560
$$ -42651 -110155 -148930 -125070 -118826 -108422 -15676 -10003 -14470 -5372 47908 87411 -11149
14485a1149m4796l2984o0661J7279P4298Q0825k2504j00464j69114M0206R8251
$$ -11149 -55945 -88929 -149590 -132311 -58013 22812 308 -100156 -269270 -229064 -130813
14474a30813J06179P1101J8089j49534J3586n5139K118M1416Q4067L3394K4508
$$ -130813 -24634 46467 64556 -84978 -71392 -126531 -124413 -82997 1070 34464 58972
14463E8972L3667n6597J4861M9260r8460m5997N794n0210N4190R9642M9446o1110
$$ 58972 92639 36042 50903 100163 1703 -44294 -38500 -88710 -34520 65122 114568 53458
14451E3458K4994o4210m0539N6701Q9997p9741p8196o7528N0978P9919p2299L190
$$ 53458 78452 14242 -26297 30404 120401 40660 -37536 -105064 -54086 25833 -46466 -43276
14439d3276L3889M1802R6212p6807j01312r6235P512J5996j4461L0593O4823J05170
$$ -43276 -9387 32415 128627 51820 -49492 -145727 -138215 -122219 -136680 -106087 -41264 63906
14427F3906j4157n2304J03565n882k5872j18662N8805q3831j1901J8804m9112
$$ 63906 49749 -2555 101010 95128 69256 -49406 9399 -74432 -86333 -67529 -116641
14416a16641K244J01594M4857N2782j14833j02766Q4298j801p532n1420j10882
$$ -116641 -114397 -12803 32054 84836 -29997 -132763 -48465 -50266 -57798 -109218 -220100
14405b20100K6507O0022J9262o831K7325K6334j3391L6588R9313q96j9927K6718
$$ -220100 -193593 -133571 -114309 -121140 -93815 -67481 -80872 -44284 55029 54133 34206 60924
14393F0924M5248K6505J7632p7801p0104j2454J4278p9385r923j0870l1287m6098
$$ 60924 106172 132677 150309 72508 2404 -10050 4228 -75157 -85080 -95950 -127237 -173335
14381a73335R2127J09073L1018n3601n6874q2144L8871L5829N8674N0920O0214
$$ -173335 -81208 27865 58883 5282 -51592 -133736 -94865 -59036 -362 50558 110772
14370A10772L2687j1958p6287O0084K6151r516j1090n8914m0893q5915m8649P4601
$$ 110772 143459 131501 55214 115298 141449 131933 120843 61929 21036 -64879 -113528 -38927
14358c8927M8880l4365O3455Q6159o1162k7251p5503j27959j8452J00013Q4359
$$ -38927 9953 -24412 39043 125202 64040 36789 -38714 -166673 -185125 -85112 -753
14347g53l0886r6213M3547P151j7659O7839R292N1443k0299q3137j5867J7962
$$ -753 -31639 -127852 -84305 -77154 -94813 -26974 -17682 33761 13462 -69675 -85542 -67580
14335f7580K5387k045J01797O6119r956o1839q576K6702k399m1004p588P7636
$$ -67580 -42193 -44238 57559 123678 113722 51883 43307 70009 67610 26606 19018 96654
14323I6654J5213N360l8312k4059P33P2821r8552j11394m6121K0408R925J9171
$$ 96654 111867 117227 78915 54856 55589 128410 29858 -81536 -127657 -107249 -97324 -78153
14311g8153J9106n4132j41717J4106R6170K6392K6621J1296M2859J26358l6210
$$ -78153 -59047 -113179 -254896 -240790 -144620 -118228 -91607 -80311 -37452 88906 52696
14300E2696p5704p5935J7267J06631N3124j37121p9140M1854j3980L683J05096
$$ 52696 -23008 -98943 -81676 24955 78079 -59042 -138182 -96328 -110308 -106625 -1529
14289a529R4681q7373p0628N638K6299M4962R924o700p5422j0434n1822q9007
$$ -1529 93152 5779 -64849 -59211 -32912 12050 21974 15274 -60148 -70582 -122404 -211411
14277b11411k6739M5499L5481O6911J13141k1582N218R487K1486L648j1458j11969
$$ -211411 -238150 -192651 -157170 -90259 22882 1300 6518 16005 37491 41139 29681 -82288
14265h2288K9301j1003r7894p8135j7871j1411K5236J15005J32275J1085q206
$$ -82288 -52987 -63990 -161884 -240019 -257890 -269301 -244065 -129060 3215 14300 6094
14254F094L8156J53087j578r2593j27846n5324J2066m4367j16564j9331M511R4329
$$ 6094 44250 197337 195759 103166 -24680 -80004 -67938 -112305 -228869 -248200 -243689 -149360
14242a49360n1973M4160M1124L147M4495j10558j0368j6785l7138N0030Q715m0615
$$ -149360 -201333 -157173 -116049 -112902 -68407 -178965 -189333 -206118 -243256 -193226 -184511 -225126
14230b25126l24J3644J14162k6333k6555N9452J746l9135Q3513j4818r9973l990
$$ -225126 -225450 -211806 -97644 -123977 -150532 -91080 -89334 -128469 -44956 -59774 -159747 -163737
14218a63737J04509l2528j00983l7126n3947J13415J8287r7053N3591N3418j8503
$$ -163737 -59228 -91756 -192739 -229865 -283812 -170397 -152110 -249163 -195572 -142154 -160657
14207a60657O159m2365Q5401J41002m4896n4697K3565k9628K3605L8525J964n4726
$$ -160657 -154498 -196863 -111462 29540 -15356 -70053 -46488 -76116 -52511 -13986 -12022 -66748
14195f6748j4540k7543R376M3192L4656L4747m816M579K3647l3555o4859J836
$$ -66748 -81288 -108831 -99455 -56263 -21607 13140 8324 12903 36550 2995 -61864 -60028
14183f0028j9769q3762q3034K2090m3351O7184m833j1366Q8003L5437P6707j29239
$$ -60028 -79797 -163559 -246593 -224503 -267854 -200670 -205503 -216869 -128866 -93429 -16722 -145961
14171a45961p692l3142J5060P5861K3460K0697P9799L9547m1243n5179R253M4204
$$ -145961 -153653 -186795 -171735 -95874 -72414 -51717 28082 67629 26386 -28793 -19540 24664
14159B4664m9637n1892N3920P631k0416o356o8347j2547O4449k1941j3285J877
$$ 24664 -24973 -76865 -22945 -15314 -35730 -42086 -110433 -122980 -58531 -80472 -93757 -91880
14147i1880J4961M894R564p229P2819k1111J4563n2226l1462J23962M4327j3061
$$ -91880 -76919 -72025 -62461 -69690 3129 -17982 -3419 -55645 -87107 36855 81182 68121
14135F8121m2332P1804p1520j17075j9093J1488J12326j4096J15122p8101Q705
$$ 68121 25789 97593 26073 -91002 -110095 -98607 13719 -377 114745 36644 45349
14124D5349m7806p2945q266l3822M0767O157J08391O1486q7029j33401Q3697l737
$$ 45349 -2457 -75402 -83668 -117490 -76723 -70566 37825 99311 12282 -121119 -37422 -41159
14112d1159j7621L6698l1794J6582O7739j4629m085r172k964K3216J4021L5862
$$ -41159 -58780 -22082 -53876 -37294 30445 15816 11731 2559 -405 22811 36832 72694
14100G2694N653k6359M2707K0404l8631o9544l4324o9106j9064K4389K362Q378
$$ 72694 78347 51988 94695 115099 76468 6924 -27400 -96506 -115570 -91181 -88819 -80441
14088h0441R704l5803M2895J15459O075q3337m5728K1241o1551l9785J16578J4036
$$ -80441 -70737 -106540 -63645 51814 57889 -25448 -71176 -49935 -111486 -151271 -34693 -20657
14076b0657k2721K0650O2344Q6607n8599o0644l6783J4344j1204J11562l2930
$$ -20657 -43378 -22728 39616 126223 67624 6980 -29803 -15459 -26663 84899 51969
14065E1969n7491l1528p8974m192p3562K9222Q0506j653O2831n3774N6416J44100
$$ 51969 -5522 -37050 -116024 -120216 -193778 -164556 -84050 -85703 -22872 -76646 -20230 123870
14053A23870J3836R543q5854m8020j7030m4680n8124k5822J28544R5900m8861
$$ 123870 137706 147249 61395 13375 -3655 -48335 -106459 -132281 -3737 92163 43302
14042D3302j22853j14659r9709M9925N3544J70634j5464j78344l815J0917N9863
$$ 43302 -79551 -194210 -293919 -243994 -190450 -19816 -35280 -213624 -217439 -206522 -146659
14031a46659L1125Q6770O7686M0026j2671l5022M589n6449q7327l4363J22561
$$ -146659 -115534 -28764 38922 78948 66277 31255 35844 -20605 -107932 -142295 -19734
14020a9734R3215O3454m7174R509q6170K3973L0361K4899L3501m8696o0360P6054
$$ -19734 73481 136935 89761 99270 13100 37073 67434 92333 125834 77138 16778 92832
14008I2832M8764l0136J03350k6235p5723m7870o6529o4952m7689O5381P5061
$$ 92832 141596 111460 214810 188575 112852 64982 -1547 -66499 -114188 -48807 26254
13997B6254R8831K4155l1083J4457l1176r1955l1027Q0051P1195n9417o0863n3640
$$ 26254 125085 149240 118157 132614 101438 9483 -21544 58507 129702 70285 9422 -44218
13985d4218n5480q1926K7259Q8037O4041p3203k2461j1493m9104M3097R8543n0160
$$ -44218 -99698 -181624 -154365 -66328 -2287 -75490 -97951 -109444 -158548 -115451 -16908 -67068
13973f7068o7917P1692K3255m3714J375J3902M3688O4500q1199k9081Q7383p4647
$$ -67068 -134985 -63293 -40038 -83752 -82377 -68475 -24787 39713 -41486 -70567 16816 -57831
13961e7831l5532m7179Q323L4509J553R0628O0893M8865Q6102q6986j08275q3427
$$ -57831 -93363 -140542 -132219 -97710 -96157 -5529 55364 104229 190331 103345 -4930 -88357
13949h8357O044j9715M5880J2751m365l9791K8714R1181l764M4526m8469l0510
$$ -88357 -82313 -102028 -56148 -43397 -47762 -87553 -58839 32342 28578 73104 24635 -5875
13937e875M8322k6014q1263o708r7117M468R5382P3681Q3832n7703J4992L9786
$$ -5875 42447 16433 -64830 -71538 -168655 -164187 -68805 4876 88708 31005 45997 85783
13925H5783o0635N980j07369o6569O9304k4516M1206J04792n5845m8695m4435
$$ 85783 25148 31128 -76241 -142810 -73506 -98022 -56816 47976 -7869 -56564 -100999
13914a00999O8104R7193j1375K8662J74480O0698k159P0816J21547l0671N7923
$$ -100999 -32895 64298 52923 81585 256065 316763 314604 385420 506967 476296 534219
13903E34219K3743J0360N2761J31137L65j62638l609j9526p9903J5204J73848
$$ 534219 557962 568322 621083 752220 752585 589947 586338 566812 486909 502113 675961
13892F75961k825j25184q1330j84632p6905N9625Q5582O5879M0435m0326l7283
$$ 675961 673136 547952 466622 281990 205085 264710 350292 416171 456606 416280 378997
13881C78997r3080n8810O5715N6472J7459R8750J04427n2863M1707k8559n1495
$$ 378997 285917 227107 292822 349294 366753 465503 569930 517067 558774 530215 478720
13870D78720J0514P3544Q8283L8877p9992l3252o214J6677M5556k9058n4913j3957
$$ 478720 489234 562778 651061 689938 609946 576694 570480 587157 632713 603655 548742 534785
13858E34785k1741j31743q7652O7087L9917q4368J8698r2748j05153o736M6233
$$ 534785 513044 381301 293649 360736 400653 316285 334983 242235 137082 130346 176579
13847A76579M0105r7856m9309q0218j55793o452J11734k151j25849m4355J81231
$$ 176579 216684 118828 69519 -10699 -166492 -172944 -61210 -63361 -189210 -233565 -52334
13836e2334J2941j59495j3516L2391J18387O462l5295J24357m3913l4909l2049
$$ -52334 -39393 -198888 -212404 -180013 -61626 -55164 -90459 33898 -10015 -44924 -76973
13825g6973k3862k6766k747J8581N1096j6473J0864L3128J01293p4314m0976o729
$$ -76973 -100835 -127601 -130348 -111767 -60671 -77144 -66280 -33152 68141 -6173 -47149 -53878
13813e3878M8391o4819k6041L9780O1117l0678k0560q366L7556j7486j17737P3602
$$ -53878 -5487 -70306 -96347 -56567 4550 -26128 -46688 -55054 -17498 -34984 -152721 -79119
13801g9119R7841m150j44127N8066Q5544k6023M209O4796q6507j8711L2554k785
$$ -79119 18722 14572 -129555 -71489 14055 -11968 -7759 57037 -29470 -48181 -15627 -18412
13789a8412l6041q1893J8870N3597J44982M5639K7227L6667j10914l7839K9236
$$ -18412 -54453 -136346 -117476 -63879 81103 126742 153969 190636 79722 41883 71119
13778G1119R1387k5567j51325k1476l2654K972k2091k893m5937Q7981M2821j24643
$$ 71119 162506 136939 -14386 -35862 -68516 -65544 -87635 -90528 -136465 -48484 -5663 -130306
13766a30306j39248Q3781J6384l6249Q4596M3708L1078k6221J1283K5919L991
$$ -130306 -269554 -185773 -169389 -205638 -121042 -77334 -46256 -72477 -61194 -35275 -31284
13755c1284M7559L8634k5314j8206r676N8016n0301p6443k3173O004K0472m1232
$$ -31284 16275 54909 29595 11389 1713 59729 9428 -67015 -90188 -84184 -63712 -104944
13743a04944p3117q7290M0894J18770L2670r8199L6052J28241m2087N861r361
$$ -104944 -178061 -265351 -224457 -105687 -73017 -171216 -135164 -6923 -49010 -43149 -52510
13732e2510N1722J04382J2918P2933j32663m0061J7776r2066J45502J05121k8960
$$ -52510 -788 103594 116512 189445 56782 16721 34497 -57569 87933 193054 164094
13721A64094N4728M2970P855K2593M109k1190k1648P501J04975L5003j05584R007
$$ 164094 218822 261792 269647 292240 296349 275159 253511 261012 365987 400990 295406 304413
13709C04413k9109j9531N1528R4220k2108k3333j6858N9004n6887n7664L1169
$$ 304413 275304 255773 307301 401521 379413 356080 339222 398226 341339 283675 314844
13698C14844J7436J0914K8700o0756r2407l9087L3369j6379j4819K7012J37838
$$ 314844 332280 343194 371894 311138 218731 179644 213013 196634 181815 208827 346665
13687C46665J25065L9028P395N672j4242O5547K0748o317P4820J0137j05759n5472
$$ 346665 471730 510758 518153 523825 509583 575130 595878 589561 664381 674518 568759 513287
13675E13287m3786p5499m472M2352M5338Q7639O8927j18556j43366M6746l8849
$$ 513287 469501 394002 389530 431882 477220 564859 633786 515230 371864 418610 379761
13664C79761r4521J15087R491q1042J3408j6827j5035J9282n169j39796n3562
$$ 379761 285240 400327 409818 328776 342184 325357 310322 329604 324435 184639 131077
13653A31077o676M7708K3453l1772j01386m1200J18109N3966l2321N3228N0550
$$ 131077 124401 172109 195562 163790 62404 21204 139313 193279 160958 214186 264736
13642B64736N8299K2753l5400o5871L9196o9969m6886J4112J993P9469N8087k1984
$$ 264736 323035 345788 310388 244517 283713 213744 166858 180970 182963 262432 320519 298535
13630B98535j51883r0780o5216M4206J5735K3459P3587O3910K6686o8479l033
$$ 298535 146652 55872 -9344 34862 50597 74056 147643 211553 238239 169760 166727
13619A66727r594J02012L1725j42404l8746j0776J9329J01574L4972j7058L8779
$$ 166727 157133 259145 290870 148466 109720 98944 118273 219847 254819 237761 276540
13608B76540j5630n8319J5771Q8055m9135r8843q2727J9313m3096J3143J19513
$$ 276540 260910 202591 218362 306417 257282 158439 75712 95025 51929 65072 184585
13597A84585r669L0724Q0748j5456K274R4109m7377m0468M2574R162k1862J5715
$$ 184585 174916 205640 286388 270932 273206 367315 319938 279470 322044 331206 309344 325059
13585C25059J55710m541j05354m0265n4409L2947P7085L361J01708K9460p3023
$$ 325059 480769 476228 370874 330609 276200 309147 386232 389593 491301 520761 447738
13574D47738o4841K2030m0347l3829M9434O9730R8477L7176l3040p7092j12509
$$ 447738 382897 404927 364580 330751 380185 449915 548392 585568 552528 475436 362927
13563C62927p4001M7815L8376J7975O931N4257M2293Q8559q949l6970j5067q429
$$ 362927 288926 336741 375117 393092 400023 454280 496573 585132 576183 539213 524146 515717
13551E15717J6552Q47j445O7039K1720M0397N4981M7472K7125k713O1Q611K6328
$$ 515717 532269 533116 531671 598710 620430 660827 715808 763280 790405 787692 787753 796364 822692
13538H22692q9856j00821J04461L2612K0344N8673k2401j30370r180J60943P3177
$$ 822692 732836 632015 736476 769088 789432 848105 825704 695334 686154 847097 920274
13527I20274O6724K7898m2844l1028m3544R9943J04784m4622n7838J8303J1941
$$ 920274 986998 1014896 972052 941024 897480 997423 1102207 1057585 999747 1018050 1029991
13516A029991P4775R7930m1107o255L9620J64147J26006J7077q048q3836J8186
$$ 1029991 1104766 1202696 1161589 1155334 1194954 1359101 1485107 1502184 1494136 1410300 1428486
13505A428486J64701P3978N1583J7881K06008J74501O4556K3173m0869R5289J14512
$$ 1428486 1593187 1667165 1718748 1736629 1942637 2117138 2181694 2204867 2163998 2259287 2373799
13494B373799J31271J29304J41298K26342L25123L12999K03122K75084L79915
$$ 2373799 2505070 2634374 2775672 3002014 3327137 3640136 3843258 4118342 4498257
13485D498257L91794L58206M24937N07589O17880P20483P65901Q57638J034227
$$ 4498257 4890051 5248257 5673194 6180783 6798663 7519146 8285047 9142685 10176912
13476A0176912J187711J449411J628479J992747K554315L146963L599669M462786
$$ 10176912 11364623 12814034 14442513 16435260 18989575 22136538 25736207 30198993
13468C0198993N554728O854745Q262509R315916J0588162J1572379J2312808J2583521
$$ 30198993 35753721 42608466 50870975 60186891 70775053 82347432 94660240 107243761
13460A07243761J2469218J1449975R515992P084968M543295K119376n13330l332647
$$ 107243761 119712979 131162954 140678946 147763914 152307209 154426585 153913255 150580608
13452A50580608o153046q459503r752856j0355940j0567641j0492715r993463
$$ 150580608 144427562 135968059 126215203 115859263 105291622 94798907 84805444
13445H4805444q825963p420067o003863m647233l590750k581213j518384n66411
$$ 84805444 75979481 68559414 62555551 57908318 54317568 51736355 50217971 49651560
13437D9651560K02176J001843J777623K767068L971263N057408O391967P707218
$$ 49651560 49853736 50855579 52633202 55400270 59371533 64428941 70820908 78528126
13429G8528126Q939229R765975J0324358J0631204J0534840R497768P808754N507262
$$ 78528126 87467355 97233330 107557688 118188892 128723732 138221500 146030254 151537516
13421A51537516K871361M24245k086738m939071p672035r967334j1241216j1712943
$$ 151537516 154408877 154833122 152746384 147807313 140135278 130167944 118926728 107213785
13413A07213785j1854057j1657423j1026619r955059q671725p249099n789199
$$ 107213785 95359728 83702305 72675686 62720627 54048902 46799803 41010604
13406D1010604m761799l850500l244433k745384k398314k206320j836482j567442
$$ 41010604 36248805 32398305 29153872 26408488 24010174 21803854 19967372 18399930
13398A8399930j440716j353648j161052j005765r16599p87537p18762n86248o01900
$$ 18399930 16959214 15605566 14444514 13438749 12522150 11734613 11015851 10429603 9827703
13389I827703n90333m11510l69675m02834l52647l27562k22110k47191k34627
$$ 9827703 9237370 8825860 8456185 8053351 7700704 7373142 7151032 6903841 6669214
13380F669214k54365j48325j29681q6835j36256o3605q4417j18414K8256l7601
$$ 6669214 6414849 6266524 6136843 6050008 5913752 5850147 5765730 5647316 5675572 5637971
13370E637971j69199q2374r6288j76186j29033j47378k16393l41880l22984j35902
$$ 5637971 5468772 5386398 5290110 5113924 4984891 4837513 4621120 4279240 3956256 3820354
13360C820354j79084k44537k49842k58774l9866n4872q5079j71606j02880p9228
$$ 3820354 3641270 3396733 3146891 2888117 2848251 2793379 2708300 2536694 2433814 2354586
13350B354586j73317r4351m1423q4441J77j20429m0547J1326j24432q5131p1620
$$ 2354586 2181269 2086918 2045495 1961054 1961231 1840802 1800255 1811581 1687149 1602018 1530398
13339A530398L3875l8111J2519P0084l5033r0856r1621n6722n7921j6917O1842
$$ 1530398 1564273 1526162 1538681 1608765 1573732 1482876 1391255 1334533 1276612 1259695 1321537
13328A321537K5171o9819j2668K5244q7519j37850l804N7009K0303K7866K4962
$$ 1321537 1346708 1276889 1264221 1289465 1201946 1064096 1060292 1117301 1137604 1165470 1190432
13317A190432l5476o6956K8086m7701p0261j44344m7333N6285m0248l8538L5701
$$ 1190432 1154956 1088000 1116086 1068385 998124 853780 806447 862732 822484 783946 819647
13306H19647M3682k3155K3439M364k6357O7972J6196r939k5179p1212j39915J01479
$$ 819647 863329 840174 863613 867977 841620 909592 925788 915849 890670 819458 679543 781022
13294G81022M0285j95929k0218K5001K3871O1060o667l4749q1479r3810l8130
$$ 781022 821307 625378 605160 630161 654032 715092 708425 673676 592197 498387 460257
13283D60257P5863O3479o654q8965l5031L2244J3110M3850J9649m2596m3481n7697
$$ 460257 536120 599599 592945 503980 468949 501193 514303 558153 577802 535206 491725 434028
13271D34028j4347K8815Q595K8211O670o9384P478K1440L1996l4547j0726l210
$$ 434028 419681 448496 457091 485302 491972 422588 430066 451506 483502 448955 438229 435019
13259D35019j02320r4161Q7202l6424j98O0431N4428j09270j0474M5757j3202
$$ 435019 332699 238538 325740 289316 289118 349549 403977 294707 284233 329990 316788
13248C16788j55626j01261J2831j7007K2192j5779L3605k2440q875M7002k4720
$$ 316788 161162 59901 72732 55725 77917 62138 95743 73303 64428 111430 86710
13237H6710k2372q538J02560P1620R5058P9417l678r8710j77462p1772p8406J13685
$$ 86710 64338 55800 158360 229980 325038 404455 400777 302067 124605 52833 -25573 88112
13225H8112M6823O5111J14157J5208j41687k9377P8150M6771m2896J1567P6313
$$ 88112 134935 200046 314203 329411 187724 158347 236497 283268 240372 251939 328252
13214C28252m0081j10225J412L9895J8442j4874j21098n6923k4190J10167n074
$$ 328252 288171 177946 179358 219253 237695 222821 101723 44800 20610 130777 125703
13203A25703l8402k5442m0526K0203j01720l7539N4540K2238M0220K8829Q2540
$$ 125703 87301 61859 21333 41536 -60184 -97723 -43183 -20945 19275 48104 130644
13192A30644J16505J518j29713l4951J5871L1530j4329m9790k7883J11755N2224
$$ 130644 247149 248667 118954 84003 99874 131404 117075 67285 39402 151157 203381
13181B03381j9696J8655k8208p2635p402l9087l092N8136M7614j9435k0577r7255
$$ 203381 183685 202340 174132 101497 94095 55008 51916 110052 157666 138231 117654 20399
13169B0399m6071Q1498R1632Q898N7634O9101j10314p181K9400Q5185n6972j57121
$$ 20399 -25672 55826 147458 156356 213990 283091 172777 165596 194996 280181 223209 66088
13157F6088L5343O1350j89103m7580L2377Q3822K7359O595j08365l3531O8736
$$ 66088 101431 162781 -26322 -73902 -41525 42297 69656 76251 -32114 -65645 3091
13146C091J02584j4194L6768O3183q179l919K1061m7625l3243J7364J2578l5496
$$ 3091 105675 91481 128249 191432 183253 179334 200395 152770 119527 136891 149469 113973
13134A13973q8430O0708J35459N3896j1713q2598k1190J5416J6618J0607m6047
$$ 113973 25543 86251 221710 275606 263893 181295 160105 175521 192139 202746 156699
13123A56699j76420j1570P1882j0188j8132J628r3554J361P6533J09289R6088
$$ 156699 -19721 -31291 40591 30403 12271 13899 -79655 -78294 -1761 107528 203616
13112B03616P5489M0270k4762j13045j45250k6204L537J1573l3944p1454N1581
$$ 203616 279105 319375 294613 181568 36318 10114 13651 25224 -8720 -80174 -28593
13101b8593J50472j6874r5859J002J13619L4254M9655M4081j08528l3687j6906
$$ -28593 121879 105005 9146 10148 123767 158021 207676 251757 143229 109542 92636
13090I2636j4716j4772J8613O9832O6104k8046Q4088k7655L6293J32244M6854
$$ 92636 77920 63148 81761 151593 217697 189651 273739 246084 282377 414621 461475
13079D61475r6723O7812J5937L2566m7134q0809j02316p0541O0615M707l4702
$$ 461475 364752 432564 448501 481067 433933 353124 250808 180267 240882 245589 210887
13068B10887l9881K195J0268m1808k4185J26730M3020m222j5827n9049r557l2339
$$ 210887 171006 173201 183469 141661 117476 244206 287226 283004 267177 208128 198571 166232
13056A66232k0396n2417p2760k7897O7737k705j9435J6359N4393N0626O6675O7869
$$ 166232 145836 93419 20659 -7238 60499 57794 38359 54718 109111 159737 226412 294281
13044B94281j03648j27874m1256J73558R1238Q1286J10194J93552K29310J55745
$$ 294281 190633 62759 21503 195061 286299 367585 477779 671331 900641 1056386
13034A056386M6079Q8272O3248j2782K6094o958k24712k08413k47342j75733m8165
$$ 1056386 1102465 1190737 1253985 1241203 1267297 1260339 1035627 827214 579872 404139 355974
13023C55974Q9756j8341m3301N3095j4295m9293R117M2941L8448m4173N850Q0018
$$ 355974 445730 427389 384088 437183 422888 373595 382712 425653 464101 419928 425778 505796
13011E05796K8184Q4012R0423k727L5625K5522L0762J18017j9307l3116J6727
$$ 505796 533980 617992 708415 705688 741313 766835 797597 915614 896307 863191 879918
13000H79918K8289n1249m1783n2724j7952J6253K6581Q8200L7347M9843L8485
$$ 879918 908207 856958 815175 762451 744499 760752 787333 875533 912880 962723 1001208
12989A001208N9872K03777J41853Q8106l2128j03239p7983q7533j61040j54188
$$ 1001208 1061080 1264857 1406710 1494816 1462688 1359449 1281466 1193933 1032893 878705
12979H78705j32746n8335o3773p9938L9846M5217L0514n95J3420J27267k4838
$$ 878705 745959 687624 623851 543913 583759 628976 659490 658895 672315 799582 774744
12968G74744p942O9969N6551k5729m6593j37871j18369o3034m9192r5240j6847
$$ 774744 766802 836771 893322 867593 821000 683129 564760 501726 452534 357294 340447
12957C40447n6623k1115l1132m6200r2054j36631J33028J69378J36038p6553q4230
$$ 340447 283824 262709 231577 185377 93323 -43308 89720 259098 395136 318583 234353
12946B34353K0236J02537M5159j9638J3708P8856M4167M080n5403o6633q7567
$$ 234353 254589 357126 402285 382647 396355 475211 519378 523458 468055 401422 313855
12935C13855q7699n0692l0959j4474q8176M6519J09388n7193j15630O2958J84147
$$ 313855 226156 175464 144505 130031 41855 88374 197762 140569 24939 87897 272044
12924B72044M7246j14436j18136j72800O1889J19147O998p924j18882l3708L7315
$$ 272044 319290 204854 86718 -86082 -24193 94954 101952 94028 -24854 -58562 -21247
12913b1247k8946m2281K0190p8030N5050K4384R1924J9388J1717m8210L7533k6259
$$ -21247 -50193 -92474 -72284 -150314 -95264 -70880 21044 40432 52149 3939 41472 15213
12901A5213m7613P7707N2527k0348O0195m4364k9354n0399R650L184M2780L8415
$$ 15213 -32400 45307 97834 77486 137681 93317 63963 13564 23214 26398 69178 107593
12889A07593l7328n6498J8576L2365n7604q8035j0587k1200L5593L777K0598k3875
$$ 107593 70265 13767 32343 64708 7104 -80931 -91518 -112718 -77125 -73348 -52750 -76625
12877g6625L8260J4671l6753Q7521P4031M2444l2003n8488M7321M1977l8602j03880
$$ -76625 -38365 -23694 -60447 27074 101105 143549 111546 53058 100379 142356 103754 -126
12865a26m0078M8831n5515J2410O3062M5066K208n431k7198o7722m8969k5252
$$ -126 -40204 8627 -46888 -34478 28584 73650 75858 70427 43229 -24493 -73462 -98714
12853i8714K2940p3755l902N2826J8369l8810m0432L6675Q4619J61998r2261j22974
$$ -98714 -75774 -149529 -153431 -100605 -82236 -121046 -161478 -124803 -40184 121814 29553 -93421
12841i3421J6434K8112O5638J05655L6048o6622k6941M2221q2981j22585j5031
$$ -93421 -76987 -48875 16763 122418 158466 91844 64903 107124 24143 -98442 -113473
12830a13473n0090J07322N2447j803Q972j73874J9424K4520J3566L9835n558K1409
$$ -113473 -163563 -56241 -3794 -5597 3375 -170499 -151075 -126555 -112989 -73154 -78712 -57303
12818e7303K9705L435J5052l6769L8124J2777l9685m2892R0236M6661K27n9074
$$ -57303 -27598 -24163 -9111 -45880 -7756 5021 -34664 -77556 12680 59341 59568 494
12806D94j01028p848M3430O7950J00279m2819k4879n3295n8743j2092k9467O1750
$$ 494 -100534 -108382 -64952 2998 103277 60458 35579 -17716 -76459 -88551 -118018 -56268
12794e6268J63455K3432j4781k632p5765o1045q7886k8553O5916j3474o824p6268
$$ -56268 107187 130619 115838 113206 37441 -23604 -111490 -140043 -74127 -87601 -94425 -170693
12782a70693J5737K3326N7996J4264N6876K6196j148L8236J521R929r7499p8823
$$ -170693 -154956 -131630 -73634 -59370 -2494 23702 22554 60790 62311 72240 -25259 -104082
12770a04082Q6749J7996M2240j8049p2580p6573K0836J08771N7674n6370m8984
$$ -104082 -17333 663 42903 24854 -47726 -124299 -103463 5308 62982 6612 -42372
12759d2372o603n9455n6619K0462Q5629J1436q0194k8489k7213J11607J47276
$$ -42372 -48975 -108430 -165049 -144587 -58958 -47522 -127716 -156205 -183418 -71811 75465
12748G5465Q091n1899m4357n3380k591r527r8368L743Q8349L166K0914p544K9327
$$ 75465 83556 31657 -12700 -66080 -68671 -78198 -176566 -172823 -84474 -81308 -60394 -67938 -38611
12735c8611M3825K9688n5597m2333j16883P2090l5974L6208J16995L396j15125
$$ -38611 5214 34902 -20695 -63028 -179911 -107821 -143795 -107587 9408 12804 -102321
12724a02321j14134O9242L7116J0908M7709N6001p84P2043R878p2920m1775n1350
$$ -102321 -216455 -147213 -110097 -99189 -51480 4521 3737 75780 85658 12738 -29037 -80387
12712h0387M5359Q3815J8117J4247P3010P9521j5109n1531j50319o9439L7468
$$ -80387 -35028 48787 66904 81151 154161 233682 218573 167042 16723 -52716 -15248
12701a5248J07610J30260p9561o5113m7441p4065j09711j6307j1612J6299N7147
$$ -15248 92362 222622 143061 77948 30507 -43558 -153269 -169576 -181188 -164889 -107742
12690a07742J12286O7514k0244j62443j674O1552P9140P0100K928k6479p0364
$$ -107742 4544 72058 51814 -110629 -112303 -50751 28389 98489 101417 74938 4574
12679D574J0921n4956K254L4098P4082l3950r9131J86N3104N9707o3335o1892
$$ 4574 15495 -39461 -37207 -3109 70973 37023 -62108 -61922 -8818 50889 -12446 -74338
12667g4338N7550K6139K0111j1024R128N3604l722Q8332P0911j12791j47936n8576
$$ -74338 -16788 9351 29462 18438 27566 81170 77448 165780 236691 123900 -24036 -82612
12655h2612O8298J26058L7566n8982k7957p3395K4696K1625L8955L8749k441n1100
$$ -82612 -14314 111744 149310 90328 62371 -11024 13672 35297 74252 113001 110560 59460
12643E9460l045r7010n6552m6730n8941K8659J55007J0615M1715p4324o7899R6705
$$ 59460 56415 -40595 -97147 -143877 -202818 -174159 -19152 -8537 33178 -41146 -109045 -12340
12631a2340L820K5272j3745q2862l4321m2629J06444L1293m1236N722M4848M0743
$$ -12340 -8520 16752 3007 -79855 -114176 -156805 -50361 -19068 -60304 -54582 -9734 31009
12619C1009k9893K282J18067j8273j9420J17075o9070q1430J09289P7197j15052
$$ 31009 1116 3398 121465 103192 83772 200847 131777 50347 159636 236833 121781
12608A21781j49330k2556N5872O7256j26123M577N2467M4714J0008Q6656k0619
$$ 121781 -27549 -50105 5767 73023 -53100 -48523 3944 48658 58666 145322 124703
12597A24703m6749n7739J01289Q3749K6887r4747R5948J33952M782j04540K4220
$$ 124703 77954 20215 121504 205253 232140 137393 233341 367293 372075 267535 291755
12586B91755p0134k7167k230o6069j2682L2908Q568p8455k2181O7722R4820j4513
$$ 291755 221621 194454 192224 126155 113473 146381 154949 76494 54313 122035 216855 202342
12574B02342q6004J3960p5525j56605m8099L7441J9004P9302K9211n0684m9338
$$ 202342 116338 130298 54773 -101832 -149931 -112490 -93486 -14184 15027 -35657 -84995
12563h4995M0751J8096M460N677j0011o0355l1846J2045Q9486J55987J6089P107
$$ -84995 -44244 -26148 -21688 -16011 -26022 -86377 -118223 -106178 -16692 139295 155384 162491
12551A62491n4418m3388o7460Q652J6136Q0527m519p6044j48745l6721P7727R0757
$$ 162491 108073 64685 -2775 5877 22013 102540 98021 21977 -126768 -163489 -85762 4995
12539D995K8391L670P9049Q5930l8132r5918J4012k77m8301l1881O9250Q3842
$$ 4995 33386 37056 116105 202035 163903 67985 81997 81720 33419 1538 70788 154630
12527A54630o2294q3277k8924Q008l1295k6374q7131p5642p929J25675J91575
$$ 154630 92336 9059 -19865 -11857 -43152 -69526 -156657 -232299 -240228 -114553 77022
12516G7022O4603j57565j15543l873l4543P1856M4140L7808K5222m177J4831j19972
$$ 77022 141625 -15940 -131483 -135356 -169899 -98043 -53903 -16095 9127 4950 19781 -100191
12504a00191p5628J2817M7251J43734J50448K4407r621k9474m3750o1648J2952
$$ -100191 -175819 -163002 -115751 27983 178431 202838 193217 163743 119993 58345 71297
12493G1297Q8393N4553p90K5625n7682n7141m7554L1435n4908j94701N1008N8752
$$ 71297 159690 214243 213453 239078 181396 124255 76701 108136 53228 -141473 -90465 -31713
12481c1713n626J7836m8978n8206P0303R9870J23024j17746o4446l4089L4672
$$ -31713 -37339 -19503 -68481 -126687 -56384 43486 166510 48764 -15682 -49771 -15099
12470a5099M0445M3959O0067R9291l703r8501k638l1441k909J9734k4287J4277
$$ -15099 25346 69305 129372 228663 224960 126459 123821 92380 89471 109205 84918 99195
12458I9195O504L7119o4776l0844l8526M338k3616L3491q271J9194R0444K3968
$$ 99195 105699 142818 78042 47198 8672 13010 -10606 22885 14614 33808 124252 148220
12446A48220m4883k7352m6272j2617M4060p799K2486k6775r8889j03006J6299
$$ 148220 103337 75985 29713 17096 61156 53357 75843 49068 -49821 -152827 -136528
12435a36528M1254M3911O9133O1102P2115J116J1095R1445n7337j15373n6747
$$ -136528 -95274 -51363 17770 78872 150987 152103 163198 254643 197306 81933 25186
12424B5186n4327k1822P8704K9563j06161k2475N7127M3507P9305J1627l8236
$$ 25186 -29141 -50963 27741 57304 -48857 -71332 -14205 29302 108607 120234 81998
12413H1998m7997j6935l9986j143O789k8859R544l7813j9735P4353J13622O0401
$$ 81998 34001 17066 -22920 -24063 -17274 -46133 -36589 -74402 -94137 -19784 93838 154239
12401A54239j348m4449q2761M2930P4132l2519j81530o1827k9456M3521O6236
$$ 154239 152891 108442 25681 68611 142743 110224 -71306 -133133 -162589 -119068 -52832
12390e2832l7004M618J1399l1382l9609M9868J22118J21088n6720o8444N9L4153
$$ -52832 -89836 -85218 -73819 -105201 -144810 -94942 27176 148264 91544 23100 23159 57312
12378E7312J11721p9143J8866m2235o0396l5275J6261M7673N8697k6444L5301
$$ 57312 169033 89890 108756 66521 6125 -29150 -12889 34784 93481 67037 102338
12367A02338J6600l0827j083M1675K0439m2431k5963Q320R4831n8544r5398m381
$$ 102338 118938 88111 87028 128703 149142 106711 80748 89068 183899 125355 29957 25576
12355B5576Q78r8983M7503N2507R684o2838K7998l0692j30807J25120L9334q9002
$$ 25576 26454 -72529 -25026 27481 37165 -25673 2325 -28367 -159174 -34054 5280 -83722
12343h3722N1989R0136O445j4961j03977k5589l2122P7390K5863M4762j6652k9807
$$ -83722 -31733 58403 64848 49887 -54090 -79679 -111801 -34411 -8548 36214 19562 -10245
12331a0245l0048r005P6606J23401k0670O5790Q9977k680r1951p0575R6933K5885
$$ -10245 -40293 -49298 27308 150709 130039 195829 285806 283126 191175 120600 217533 243418
12319B43418q2251p4559l5844k620J7586k5221k5717k4739k3735K3965M8274l9356
$$ 243418 161167 86608 50764 48144 65730 40509 14792 -9947 -33682 -9717 38557 -799
12307g99j11822J4645J3063J38005k1805J9171l20n8876J6102J9268m4912j8229
$$ -799 -112621 -97976 -84913 53092 31287 50458 50138 -8738 7364 26632 -18280 -36509
12295c6509m8600N0609K4975N5910k1k6741N7983J60309J63317j05426j35211
$$ -36509 -85109 -34500 -9525 46385 46364 19623 77606 237915 401232 295806 160595
12284A60595r3727n1423J13966k1991j1981l5697k1386J9502r163L3256J0098
$$ 160595 66868 15445 129411 107420 95439 59742 38356 57858 48695 81951 92049
12273I2049L4002L4388q538p5912k8766n7249n1220J3665K0517L336P1572l4263
$$ 92049 126051 160439 151901 75989 47223 -10026 -61246 -47581 -27064 -23728 47844 13581
12261A3581l0906K5476k1185k0426m3290p6362j8014O0185K8702N2229L2912N4652
$$ 13581 -17325 8151 -13034 -33460 -76750 -153112 -171126 -110941 -82239 -30010 2902 57554
12249E7554k438j3701J7766j05393m3285K0360O2579O5696J4836q4841j21126
$$ 57554 55116 41415 59181 -46212 -89497 -69137 -6558 59138 73974 -10867 -131993
12238a31993j1495j14708L0002J23435Q4796J3992Q7582K4568m9321P4369r1369
$$ -131993 -143488 -258196 -228194 -104759 -19963 -5971 81611 106179 56858 131227 39858
12227C9858l7911o003p4689J7994j2758K2797J5018Q390J8429Q8204l5335j30945
$$ 39858 1947 -4056 -78745 -60751 -73509 -50712 -35694 -27304 -8875 79329 43994 -86951
12215h6951L1431K0663l9133P0670Q3669R6474p4914n9554j691p9940k1939R6851
$$ -86951 -55520 -34857 -73990 -3320 80349 176823 101909 42355 40664 -39276 -61215 35636
12203C5636n6299P154P8355k662k9706O6936j0573l3618N2662O5079m8995m1229
$$ 35636 -20663 -13509 64846 62184 32478 99414 88841 55223 107885 172964 123969 82740
12191H2740k8989M6956P8169R7230O3118l6662j11965N2276J51013O1316n0200
$$ 82740 53751 100707 178876 276106 339224 302562 190597 242873 393886 455202 405002
12180D05002M449j618J7874p781m2016j00424o1505o3879j01222Q942K6739o920
$$ 405002 409451 407833 425707 417926 375910 275486 213981 150102 48880 57822 84561 77641
12168G7641N4716L9305l5474n3573L100M1721j488n1578j5126J2527j00120j06422
$$ 77641 132357 171662 136188 82615 85715 127436 125948 74370 59244 71771 -28349 -134771
12156a34771P6690J41855L0628n7956l0051j9565K0648j16385j1695K0495N8944
$$ -134771 -58081 83774 114402 56446 26395 6830 27478 -88907 -100602 -80107 -21163
12145b1163o534j03383j0633n4318J6076Q8106O8767N8792k1571J5021k3534L1398
$$ -21163 -27697 -131080 -141713 -196031 -179955 -91849 -23082 35710 14139 29160 5626 37024
12133C7024M2703q7064j0809N1806J9007M4844K0002J00352o3732j11154l545
$$ 37024 79727 -7337 -18146 33660 52667 97511 117513 217865 154133 42979 39434
12122C9434J04467J26415n97j8659j15031j09232J2872M3058o236o321n8726n1355
$$ 39434 143901 270316 269719 251060 136029 26797 39669 82727 76491 70170 11444 -39911
12110c9911k8401j869o6629M8600P2963J4916Q4318l8069l9824O452M0941l25
$$ -39911 -68312 -70181 -136810 -88210 -15247 -331 83987 45918 6094 12546 53487 53162
12098E3162k9642o0960M6239K5031k7641K0706o9283l6969R0346O6379n2286J7589
$$ 53162 23520 -37440 8799 33830 6189 26895 -42388 -79357 10989 77368 25082 42671
12086D2671N9805J4767o4722n3154J32281Q5027m8847o899J8861L2280o5145R900
$$ 42671 102476 117243 52521 -633 131648 216675 167828 160929 179790 212070 146925 156825
12074A56825M7113j3318P8127r6553q8862N566O8086J01927R0588O0269j02228
$$ 156825 203938 190620 268747 172194 83332 88898 156984 258911 349499 409768 307540
12063C07540j48135p9988j8196M0591J97179j041J5764L8593M4751l6376K9688
$$ 307540 159405 79417 61221 101812 298991 297950 313714 352307 397058 360682 390370
12052C90370k877l1917J09392L5552j2432m8099j59728k2824n0730l3079R0204
$$ 390370 387493 355576 464968 500520 488088 439989 280261 257437 206707 173628 263832
12041B63832O595j9552P7367R1053R029l1386N2070j0311j03681M0959L5725l1336
$$ 263832 270427 250875 328242 419295 428324 396938 449008 438697 335016 375975 411700 380364
12029C80364N594l8208j0747J8558j400m4852o9000N7514J81821J08860l125j41344
$$ 380364 385958 347750 337003 355561 354161 309309 240309 297823 479644 588504 585379 444035
12017D44035J3755n187P5467P3216Q247Q9733Q8741l54n4955k8217o9301J10643
$$ 444035 457790 452603 528070 601286 609533 699266 788007 787653 732698 704481 635180 745823
12005G45823J52652k8957j36177l8519M5472l1641k0021J089J44270O3003k5190
$$ 745823 898475 869518 733341 694822 740294 708653 688632 689721 833991 896994 871804
11994H71804M2953J09950L5084L7350J65309N6454q104J5207K0954R0134J5544
$$ 871804 914757 1024707 1059791 1097141 1262450 1318904 1310800 1326007 1346961 1437095 1452639
11983A452639Q8542K8132J7367J28133J28375R0365J3086n1944J03714J95052
$$ 1452639 1541181 1569313 1586680 1714813 1843188 1933553 1946639 1894695 1998409 2193461
11973B193461J70816J64514J84981J01268J17056L26823L02884K07685J91663
$$ 2193461 2364277 2528791 2713772 2815040 2932096 3258919 3561803 3769488 3961151
11964C961151K04374K37211L07103K55210L98625L34761M68825O41143N39735
$$ 3961151 4165525 4402736 4709839 4965049 5363674 5698435 6167260 6808403 7348138
11955G348138O23211P18632Q18382R59974J112048J278852J517700J907536K278467
$$ 7348138 7971349 8689981 9508363 10468337 11580385 12859237 14376937 16284473 18562940
11946A8562940K679648L224430M088193N184315O610515Q849490J1926717J5865865
$$ 18562940 21242588 24467018 28555211 33739526 40350041 49199531 61126248 76992113
11938G6992113K1110059K6923452L2398049L5768297L4697990K8334492J9607974
$$ 76992113 98102172 125025624 157423673 193191970 227889960 256224452 275832426
11931B75832426J2786291P730590j353003j8043993l6254266m4582491m1025658
$$ 275832426 288618717 296349307 294996304 276952311 240698045 196115554 155089896
11924A55089896l2712833k4546180j8240099j3809730j0400950p872156o198992
$$ 155089896 122377063 97830883 79590784 65781054 55380104 47507948 41308956
11917D1308956m733203l770239l088473k676202k230932j986501j823983j747386
$$ 41308956 36575753 32805514 29717041 27040839 24809907 22823406 20999423 19252037
11909A9252037j493411j267142j038657r24033p93807o37232p54729o38227m93743
$$ 19252037 17758626 16491484 15452827 14528794 13734987 13097755 12343026 11704799 11211056
11900A1211056n22546m75314k42337k64867k04153k71802l61496k84056k47227
$$ 11211056 10688510 10213196 9970859 9705992 9501839 9230037 8868541 8584485 8337258
11891H337258l40145l25698k69142l83603l38242l10079k28932l57265m41457
$$ 8337258 7997113 7671415 7402273 7018670 6680428 6370349 6141417 5784152 5342695
11882E342695j90551j66553j86158k53539l24999j58780j01589k19376k00975
$$ 5342695 5152144 4985591 4799433 4545894 4220895 4062115 3960526 3741150 3540175
11873C540175p2660j9100k07603k22393j78412n8999j17547k1642q5272o8556
$$ 3540175 3467515 3448415 3240812 3018419 2840007 2781008 2663461 2641819 2556547 2487991
11863B487991k23765n4057l1607l1685l3680j86275M3349K2682j32389n0131j10437
$$ 2487991 2264226 2210169 2178562 2146877 2113197 1926922 1970271 1992953 1860564 1810433 1699996
11852A699996p0604j05133o6925J4088l2985m6626J0058m8938P4816k5175q4092
$$ 1699996 1629392 1524259 1457334 1471422 1438437 1391811 1401869 1352931 1427747 1402572 1318480
11841A318480q2417j2249P1399l6285N6211j0911n6562j10834l7100P5446J05410
$$ 1318480 1236063 1223814 1295213 1258928 1315139 1304228 1247666 1136832 1099732 1175178 1280588
11830A280588p6918j73517k39866o5218Q0396O6353L3640l2764n5014M0914m07
$$ 1280588 1203670 1030153 790287 725069 805465 871818 905458 872694 817680 858594 858187
11819H58187l1363j952l8047j6797J2134o6678j06098o4832J58475O4869j3949
$$ 858187 826824 824872 786825 770028 782162 715484 609386 544554 703029 767898 753949
11808G53949K6594O8469m3379j3000k4475K1547L9418R526N6720k7857m5832r3040
$$ 753949 780543 849012 805633 792633 768158 789705 829123 838649 895369 867512 821680 728640
11796G28640r9193k8082o9714J09130q2009j5065K954k3117J804j02597K0778
$$ 728640 629447 601365 531651 640781 558772 543707 546661 523544 525348 422751 443529
11785D43529j01485l8793J38588K7405r7034q1594k7033K3592N1580J9765R0403
$$ 443529 342044 303251 441839 469244 372210 290616 263583 287175 338755 358520 448923
11774D48923j1962n7089l2888p1684n104L3282L5534P9205j02800r8306K1047
$$ 448923 436961 379872 346984 275300 270196 303478 339012 418217 315417 217111 238158
11763B38158o2094K652J11315j4842k6902n3019N5134P8405k1019n5461l0881
$$ 238158 176064 178716 290031 275189 248287 195268 250402 328807 307788 252327 221446
11752B21446P3775L322o5277m874J4003l3599l1344R053J0330l5526o4914j898
$$ 221446 295221 298543 233266 228392 242395 208796 177452 186505 196835 161309 96395 94497
11740I4497J2120L5527m267O4514O1013l7588N3456M0677p5035r2493l4146J46046
$$ 94497 106617 142144 137877 202391 263404 225816 279272 319949 244914 152421 118275 264321
11728B64321J9940j9069j4240j37277K887K0533k9953k9247N2015M7810p3564
$$ 264321 284261 265192 250952 113675 116562 137095 107142 77895 129910 177720 104156
11717A04156r8827J4428J08016L3803q4132M3520M9755L6990j5362j53359p7282
$$ 104156 5329 19757 127773 161576 77444 120964 170719 207709 192347 38988 -38294
11706c8294M1770k5215J33053Q7186q5848j24614N417J39459R6969o154J0985
$$ -38294 3476 -21739 111314 198500 112652 -11962 -6545 132914 229883 223729 234714
11695B34714r0192K5630O422j4413q3824j45048J00773L729L9562L1635j2561
$$ 234714 144522 170152 176574 162161 78337 -66711 34062 37791 77353 108988 96427
11684I6427l4572l1768L1241M3683J58243M4999l3096k2137q5492o9290o5011
$$ 96427 61855 30087 61328 105011 263254 308253 275157 253020 167528 98238 33227
11673C3227j7788L636k6433J641K4536l425K9495Q9799q731m5210J11413N1616
$$ 33227 15439 19075 -7358 -5717 18819 15394 44889 134688 125957 80747 192160 243776
11661B43776k0829l8086M2599j5737q6573j16874k6590j6919M044k5017M3824
$$ 243776 222947 184861 227460 211723 125150 8276 -18314 -35233 -31189 -56206 -12382
11650a2382M2464k701r5227J48529N2149p7605K5440P8656j5761n1390M267r2922
$$ -12382 30082 27381 -67846 80683 132832 55227 80667 159323 143562 92172 96439 3517
11638C517K7666J834O6852l5110n4531J01539l2598J9327k6179j6554k274l570
$$ 3517 31183 33017 99869 64759 10228 111767 79169 98496 72317 55763 53489 49919
11626D9919k7335R7868k7230p3412k1992N1315m3357J654j20154J6475J17427
$$ 49919 22584 120452 93222 19810 -2182 49133 5776 7430 -112724 -96249 21178
11615B1178L6908J16565K4865j32103K4644m4162n8608o3747p669J02172O7881
$$ 21178 58086 174651 199516 67413 92057 47895 -10713 -74460 -82129 20043 87924
11604H7924l7599q0580N1750L6940Q380P3610j6640n9737K3980l6191O3799L4670
$$ 87924 50325 -30255 21495 58435 66815 140425 123785 64048 88028 51837 115636 150306
11592A50306o4313K9376o2161n6171r9585p0729j732K7820L6554J07691J17926
$$ 150306 85993 115369 53208 -2963 -102548 -173277 -175009 -147189 -110635 -2944 114982
11581A14982M2534j4677o0205j2075J8186O0063p8024q6481J1445k7404J4360
$$ 114982 157516 142839 82634 70559 88745 148808 70784 -15697 -4252 -31656 -17296
11570a7296J60J4032j4138M5924N2553n8810p5923j1225J7951n5519k0306L2728
$$ -17296 -17136 -3104 -17242 28682 81235 22425 -53498 -64723 -46772 -102291 -122597 -89869
11558h9869J69558J50433O0093j58406m5346l5058n4941k2918k1436J1242n2366
$$ -89869 79689 230122 290215 131809 86463 51405 -3536 -26454 -47890 -36648 -89014
11547h9014R3592Q0282q408J6091N4850L9623J9227j2465K8553j13483m1755O508
$$ -89014 4578 84860 76452 92543 147393 187016 206243 193778 222331 108848 67093 73601
11535G3601M178l1394J6279K0975m3006m0765m5920N3429R6350M0885k7676r5565
$$ 73601 77779 46385 62664 83639 40633 -132 -46052 7377 103727 144612 116936 21371
11523B1371J2094N1847J8316p3049q2744m4743R5591J48822Q33p8191j01813Q366
$$ 21371 33465 85312 103628 30579 -52165 -96908 -1317 147505 148338 70147 -31666 -23300
11511b3300M747n1355J15384L8276M4750j4680K2587K3711k0232n1718n4832M138
$$ -23300 -18553 -69908 45476 83752 128502 113822 136409 160120 139888 88170 33338 37476
11499C7476J3139j14643j29851O0479P2923Q9982O9369p3001r7557j8765m9744
$$ 37476 50615 -64028 -193879 -133400 -60477 29505 98874 25873 -71684 -90449 -140193
11488a40193M7844N4021k1998N9656J91023N8947m7376k1036M169O5798K3109
$$ -140193 -92349 -38328 -60326 -670 190353 249300 201924 180888 185057 250855 273964
11477B73964j9434J6612l0036k0679k9746l337q6252p2873K9186K7168L1974j03295
$$ 273964 254530 271142 241106 220427 190681 187344 101092 28219 57405 84573 116547 13252
11465A3252K69K9964K2403o1168l7068K3075M3442k9142L029M0226O2425j1237
$$ 13252 13521 43485 65888 4720 -32348 -9273 34169 5027 8056 48282 110707 99470
11453I9470k1793j06372j30213O0027K01989L3584l2609l6755j6899L9115l9606
$$ 99470 77677 -28695 -158908 -98881 103108 136692 104083 67328 50429 89544 49938
11442D9938j15201K1724k918r4444L0033O0918l3617Q699R9915O2566j29148P086
$$ 49938 -65263 -43539 -46457 -140901 -110868 -49950 -83567 -74868 25047 87613 -41535 -34449
11430c4449P4190q6059r9088K0652N3762L0258l2726O4853J55688j895m7532r5579
$$ -34449 39741 -46318 -145406 -124754 -70992 -40734 -73460 -8607 147081 145186 97654 2075
11418B075l8303K1960K2665n8564K7495K1568r262l3997J8707J00364O4407p0664
$$ 2075 -36228 -14268 8397 -50167 -22672 -1104 -10366 -44363 -25656 74708 139115 68451
11406F8451m9429J725l9183j4871q4586L3857J18233q612m8295q5037o7321Q1775
$$ 68451 19022 20747 -18436 -33307 -117893 -84036 34197 25585 -22710 -107747 -175068 -93293
11394i3293j7939n3235k9599q275J35003Q2578k017j40737k0724R6030M0719O4434
$$ -93293 -111232 -164467 -194066 -202341 -67338 15240 13223 -127514 -148238 -52208 -11489 52945
11382E2945J6708q9201l4015N4980j1222K1068P4055K601M788L5337k1570n4904
$$ 52945 69653 -19548 -53563 1417 -9805 11263 85318 87919 92707 128044 106474 51570
11370E1570k2207l355j6480r847p6432o8981P7733M2824M2312N2045J7607N135
$$ 51570 29363 26008 9528 -319 -76751 -145732 -67999 -25175 17137 69182 86789 91924
11358I1924k1048p6376r8868p773J02780p993l5678O4247J05060j5303k2141k6839
$$ 91924 70876 -5500 -104368 -112141 -9361 -17354 -53032 11215 116275 100972 78831 51992
11346E1992j01117L1494L8074K077Q8322r1342J970L2657Q4127L6082j43724r1304
$$ 51992 -49125 -17631 20443 22520 110842 19500 21470 54127 138254 174336 30612 -60692
11334f0692J31617Q2731J3793l8724m5061J4714p5902k0581Q6006r8730o8691
$$ -60692 70925 153656 167449 128725 83664 98378 22476 1895 87901 -10829 -79520
11323g9520M9266M6978r8192o8498K9987M7091M6572R0337j577j00678n9660R595
$$ -79520 -30254 16724 -81468 -149966 -119979 -72888 -26316 64021 62444 -38234 -97894 -88299
11311h8299L0435P969N0724P0263o0168r1148K5454N5874p3183j2315Q9170N3393
$$ -88299 -57864 -49895 829 71092 10924 -80224 -54770 1104 -72079 -84394 4776 58169
11299E8169j3234n3144l4159M3135m3355M6694j3219m0260J62907j6638o6327
$$ 58169 44935 -8209 -42368 767 -42588 4106 -9113 -49373 113534 96896 30569
11288C0569j02404k2165K3306P5873L3752n3493j14454l2447K5286M008j0780
$$ 30569 -71835 -94000 -70694 5179 38931 -14562 -129016 -161463 -136177 -132169 -142949
11277a42949N2213L7745J12619M9517k5524k268j26777J4412P9159o0778J5929
$$ -142949 -90736 -52991 59628 109145 83621 81353 -45424 -31012 48147 -12631 3298
11266C298O8483K7178j1551j37304j34490q4111Q4182J43719Q5200J760l4822
$$ 3298 71781 98959 87408 -49896 -184386 -268497 -184315 -40596 44604 46364 11542
11255A1542p2763K2672l187J1403J07020q4290k813m9082p8464J1707J41484N4664
$$ 11542 -61221 -38549 -41736 -30333 76687 -7603 -10416 -59498 -137962 -126255 15229 69893
11243F9893k8616l0320q0102N0242l9998K0989M7361P269j31632m7803j6663K8702
$$ 69893 41277 10957 -69145 -18903 -58901 -37912 9449 16718 -114914 -162717 -179380 -150678
11231a50678L2169J4106J07991J07541k9108o4299O6586O080o6108J5746L2707
$$ -150678 -118509 -104403 3588 111129 82021 17722 84308 90388 24280 40026 72733
11220G2733N6762J2630r410k0885K6075M8295l8207n4401J9750p9317m3073m6153
$$ 72733 129495 142125 132715 111830 137905 186200 147993 93592 113342 34025 -9048 -55201
11208e5201k1803K3718N7806O0526R166k7725q2548j2555m2974R542j3601o3316
$$ -55201 -77004 -53286 4520 65046 74212 46487 -36061 -48616 -91590 -82048 -95649 -158965
11196a58965M9187J04755K3323p8268l0719m5412j1024O1667K01089J28253o1377
$$ -158965 -109778 -5023 18300 -59968 -90687 -136099 -147123 -85456 115633 243886 182509
11185A82509k8895j12062n9613K2480O3092P452j9044n0656q6212O3801k3608
$$ 182509 153614 41552 -18061 4419 67511 74963 55919 5263 -80949 -17148 -40756
11174d0756L4006o7365n0695l9946K7513M2744R9484J59796J5231m8023o4574
$$ -40756 -6750 -74115 -124810 -164756 -137243 -94499 4985 164781 180012 131989 67415
11163F7415J7290J31680J0652j06594j03402Q277R0990Q5630k1103q4587j06791
$$ 67415 84705 216385 227037 120443 17041 25318 116308 201938 180835 96248 -10543
11152a0543j5128j31671j6085J06117N5612l5356L483j0498K4119j7670K8690
$$ -10543 -25671 -157342 -173427 -67310 -11698 -47054 -43571 -54069 -29950 -47620 -18930
11141a8930J0945j9793J00683O5714L7656L0397J0016j3072J2842L5834n9797
$$ -18930 -7985 -27778 72905 138619 176275 206672 216688 203616 216458 252292 192495
11130A92495k2486p9262l4972r2772m1701J0040K2105J34973R7537O225p0553
$$ 192495 170009 90747 55775 -36997 -78698 -68658 -46553 88420 185957 192182 121629
11119A21629P0165l2554K73j02722o2092n9663N8179N5518J7579j6989P600l5314
$$ 121629 191794 159240 159513 56791 -5301 -64964 -6785 48733 66312 49323 56923 21609
11107B1609k7326J1369L7855P7464j292J307m5322o114N2901j87N9687m0821j04354
$$ 21609 -5717 5652 43507 120971 119679 120986 75664 69550 122451 122264 181951 141130 36776
11094C6776k6428K9282N1772k6251q1171J59672K5297j3139r5241m4411k8541
$$ 36776 10348 39630 91402 65151 -16020 143652 168949 155810 60569 16158 -12383
11083a2383q5603L6664O3078L8034O7327N9763j17888j08339q4047K0745K2897
$$ -12383 -97986 -61322 1756 39790 107117 166880 48992 -59347 -143394 -122649 -99752
11072i9752J4188L4670N5189K3932n4349l5456j0167M4675P6374J0512q0933j03188
$$ -99752 -85564 -50894 4295 28227 -26122 -61578 -71745 -27070 49304 59816 -21117 -124305
11060a24305P7590Q3143q301o4460O2479j9870k1229m0751N8143J19624N2554
$$ -124305 -46715 36428 28127 -36333 26146 6276 -14953 -55704 2439 122063 174617
11049A74617M765P0162O5181q2213l6914J847P871O8966m8089p6715L4478O2777
$$ 174617 179382 249544 314725 232512 195598 197445 205316 274282 226193 149478 183956 246733
11037B46733P479P0188N4522P7627N3276L8985p3449p3261j01232K1940J12017
$$ 246733 254212 324400 378922 456549 509825 548810 475361 402100 300868 322808 434825
11026D34825o9000k9050J18846L8848m2470j09091o5528m172m6526J8761j5807
$$ 434825 365825 336775 455621 494469 451999 342908 277380 273208 226682 245443 229636
11015B29636O1631N1146o850M6836K1082L9821n0093j36122l5252O890J4328j5264
$$ 229636 291267 342413 335563 382399 403481 443302 393209 257087 221835 228725 243053 227789
11003B27789k4826m7142l2802J00993o715q496K1975k9014p9599j1781p0943L8106
$$ 227789 202963 155821 123019 224012 217297 208801 230776 201762 122163 110382 39439 77545
10991G7545J88873K0573n8461j27210o4355l9837K0650J9238M8532L4663J3739
$$ 77545 266418 286991 228530 101320 36965 -2872 17778 37016 85548 120211 133950
10980A33950q8549j13305O5362k2830k533l2113P65P1657K7540N708P1238N8427
$$ 133950 45401 -67904 -2542 -25372 -27905 -60018 -59253 12404 39944 45652 116890 175317
10968A75317p2226j50410l939P3403L6484j6080L6005J09381l6204n3478q3011
$$ 175317 103091 -47319 -51258 22145 58629 42549 78554 187935 151731 98253 15242
10957A5242m6393N3463J04131L1582m9698j17815q9689N5619J93593N679j25833
$$ 15242 -31151 22312 126443 158025 108327 -9488 -99177 -43558 150035 155714 29881
10946B9881j04877j6500L3017P7178n2088p0090q4251Q0476n2752r7285R3609
$$ 29881 -74996 -91496 -58479 18699 -33389 -103479 -187730 -107254 -160006 -257291 -163682
10935a63682J74318P3135k6435K430M5754o9739q5446j7193K8821K7863J0902
$$ -163682 10636 83771 57336 59766 105520 35781 -49665 -66858 -38037 -10174 728
10924G28J7018O5110J3755m0798j30179Q6016J6841P451o4997l4390P835L1010
$$ 728 17746 82856 96611 55813 -74366 11650 28491 35942 -29055 -63445 -55610 -24600
10912b4600J3893m8006n14M6971l1929K4317O6516p5770q0299j8950J13222L9685
$$ -24600 -10707 -58713 -59227 -12256 -44185 -19868 46648 -29122 -109421 -128371 -15149 24536
10900B4536m2465O0626M7632l5579j6209Q2772o8541L4430K6981J0268k8288j4738
$$ 24536 -17929 42697 90329 54750 38541 121313 52772 87202 114183 124451 96163 81425
10888H1425K7467L3753l5956j2274J10479K6605j54274p9053Q315o2754R8558
$$ 81425 108892 142645 106689 94415 204894 231499 77225 -1828 6487 -56267 42291
10877D2291k8106j1856N3837N7416J9984r5651j89027J1901J07623Q9374L6143
$$ 42291 14185 2329 56166 113582 133566 37915 -151112 -139211 -31588 57786 93929
10866I3929L7385L0916q9737o9791J2411N1595O4238m7014j06463P0707J1891
$$ 93929 131314 162230 72493 2702 15113 66708 130946 83932 -22531 48176 60067
10855F0067o1991N2763Q5643k1273Q493r669o9720m5787K4709m6054M8321M3593
$$ 60067 -1924 50839 136482 115209 123702 114033 44313 -1474 23235 -22819 25502 69095
10843F9095n3127o452M283L4798L8078N2570J8277Q4230L7755j31967j08399l7494
$$ 69095 15968 9516 13799 48597 86675 139245 157522 241752 279507 147540 39141 1647
10831A647q777j3341j5114J9053P1281j251R8099M0116m8799j1809p9272K409
$$ 1647 -7130 -20471 -35585 -16532 54749 53498 151597 191713 142914 131105 51833 54242
10819E4242j10284p3307m5442P9798L9756n5450Q2465R8036L9118k7562p3278
$$ 54242 -56042 -129349 -174791 -94993 -55237 -110687 -28222 69814 108932 81370 8092
10808H092l4007l1896M7569L3028r5988L0108J02065K6284n0252m6372O634O2274
$$ 8092 -25915 -57811 -10242 22786 -73202 -43094 58971 85255 35003 -11369 -4735 57539
10796E7539K4482n776o6509r5246n6624n8357L9390N0024n376J8761l8168m3854
$$ 57539 82021 76245 9736 -85510 -142134 -200491 -161101 -111077 -116453 -97692 -135860 -179714
10784a79714N9215o4222q0221r88L5076L9567J45528m4317m8178M9564Q5249q625
$$ -179714 -120499 -184721 -264942 -265930 -230854 -191287 -45759 -90076 -138254 -88690 -3441 -12066
10772a2066p1001l4375J611Q1230J21310j35132p3867Q2495Q9760N6944N3659
$$ -12066 -83067 -117442 -115831 -34601 86709 -48423 -122290 -39795 49965 106909 160568
10761A60568q8448q1368k410k9512k6521L5790r191j383J5988J04793k2169q0478
$$ 160568 72120 -9248 -11658 -41170 -67691 -31901 -41092 -42475 -26487 78306 56137 -24341
10749b4341n1201M6876J24905j9425j9153m4881l4110K9101J19341Q9089o3445
$$ -24341 -75542 -28666 96239 76814 57661 12780 -21330 7771 127112 216201 152756
10738A52756o0349K2207O316R753N3087k9847k6682K506r1056Q788L302N329J08902
$$ 152756 92407 114614 120930 130683 183770 153923 127241 129747 38691 47479 50781 56110 165012
10725A65012M1590m5869q2559P7763M2410r1352m4247M3274R6356K3781q3958
$$ 165012 206602 160733 78174 155937 198347 106995 62748 106022 202378 226159 142201
10714A42201K2782p5202m6878K8908K040K4711P1594r112m5647J3866m3184k1712
$$ 142201 164983 89781 42903 71811 73851 98562 170156 161044 115397 129263 86079 64367
10702F4367M3755m8624N2152K0736j5314K3527M2864k1506J9700J14196J1147
$$ 64367 108122 59498 111650 132386 117072 140599 183463 161957 181657 295853 307000
10691C07000r3740J0667Q495j07724O6239K3052j0782Q308L9578P0844J9962n6152
$$ 307000 213260 223927 232422 124698 190937 213989 203207 211515 251093 321937 341899 285747
10679B85747j25476q9735R478K0015j256K8511N896P2639M540r502k1247l446
$$ 285747 160271 70536 80014 100029 98773 127284 133180 205819 210359 200857 179610 176164
10667A76164Q9097k1282K4646Q3135m6219o5262N2064l4588K0483O9740J03562
$$ 176164 265261 243979 268625 351760 305541 240279 292343 257755 278238 347978 451540
10656D51540j5547J974o702K7194J58038J1739k6746j3976n08J22381J13997M2268
$$ 451540 435993 437967 431265 458459 616497 628236 601490 587514 587006 709387 823384 865652
10644H65652Q2636K5918R0581Q1786M6536R8663K01880K64508J75609K91352J27471
$$ 865652 948288 974206 1064787 1146573 1193109 1291772 1493652 1758160 1933769 2225121 2352592
10633B352592K28659M52592M28427M65368O22913O15906Q98509J319658J653146
$$ 2352592 2581251 3033843 3462270 3927638 4550551 5166457 6064966 7384624 9037770
10624I037770K076989K640330L087877L245232L198161K975434K808240K579062
$$ 9037770 11114759 13755089 16842966 20088198 23286359 26261793 29070033 31649095
10616C1649095K313460K015182J545260J361690J954306L095477M238472N068901
$$ 31649095 33962555 35977737 37522997 38884687 40838993 43934470 48172942 53241843
10608E3241843N057279M316349L609917L191299K734640J631525M919q97505p3366
$$ 53241843 58299122 62615471 66225388 69416687 72151327 73782852 73787771 72890266 72816900
10599G2816900J908735L916255M973106M723353L527286K481253J814979O60223
$$ 72816900 74725635 78641890 83614996 88338349 91865635 94346888 96161867 96822090
10591I6822090j735115m653454o333817n649596l517018j393285N3204K81438
$$ 96822090 95086975 90433521 84099704 78450108 74933090 73539805 73593009 73874447
10583G3874447j05831o47783r95770j710481l354271n247265o062379n395632
$$ 73874447 73768616 73120833 72125063 70414582 67060311 61813046 55750667 50355035
10575E0355035m065882k774296j942123j580491j470429j537002j610848k069751
$$ 50355035 46289153 43514857 41572734 39992243 38521814 36984812 35373964 33304213
10567C3304213k867389l471032l637565l569408l081792k454170j883969j510404
$$ 33304213 30436824 26965792 23328227 19758819 16677027 14222857 12338888 10828484
10559A0828484j135935r51457q36618p24666n17697m85064l44227m01070m49087
$$ 10828484 9692549 8741092 7904474 7179808 6662111 6177047 5832820 5431750 4982663
10550D982663k83225j95247k60469l66328k13698j07322k41121j33227j07753
$$ 4982663 4699438 4504191 4243722 3877394 3663696 3556374 3315253 3182026 3074273
10541C074273p5099j36985m6469l6051j46295j56570q2961N8357p7487j76347
$$ 3074273 2999174 2862189 2815720 2779669 2633374 2476804 2393843 2452200 2374713 2198366
10531B198366j33346q3974j36860j37485N1913M4998r6494q251p2623K2619m9914
$$ 2198366 2065020 1981046 1844186 1706701 1758614 1803612 1707118 1698867 1626244 1648863 1598949
10520A598949o1371j01229P734N012p3551j25492q1972j6511k9855M9641j24310
$$ 1598949 1537578 1436349 1444083 1449095 1375544 1250052 1168080 1151569 1121714 1171355 1047045
10509A047045r625n9450k8729J4199j4517p0888l7614n9280j77373q8616j4244
$$ 1047045 1037420 977970 949241 963440 948923 878035 840421 781141 603768 515152 500908
10498E00908J06512K000P197o5638n8113j7496Q0605J3277o9899P8547N4567q5843
$$ 500908 607420 609420 616617 550979 492866 475370 555975 569252 499353 577900 632467 546624
10486E46624m5727n8224N6875o9859n3906k7578N2961j3609Q2897J18192p9041
$$ 546624 500897 442673 499548 429689 375783 348205 401166 387557 470454 588646 509605
10475E09605n8049L431n4600m2994N3353J05299N2034M0266j37106m6906L8589
$$ 509605 451556 454987 400387 357393 410746 516045 568079 608345 471239 424333 462922
10464D62922J7011M4216k1041r801m0066j54146o1959m6j8454q601O0842k110
$$ 462922 479933 524149 503108 493307 453241 299095 237136 237090 218636 210035 270877 268767
10452B68767p0951P4575M1894r392n6954q779P7470P5137j1728k8212k1511K1852
$$ 268767 197816 272391 314285 304893 247939 239160 316630 391767 380039 351827 330316 352168
10440C52168j9915J789Q3441N1272L4741m3504k15539r1134J7090P3848J0510
$$ 352168 332253 334042 417483 468755 503496 459992 244453 153319 170409 244257 254767
10429B54767o6860k6815m8847K3130M6046J0547K9143j5153j08550M5339J9835
$$ 254767 187907 161092 112245 135375 181421 191968 221111 205958 97408 142747 162582
10418A62582N5825j027J01045M7690M903M064p230P3946j1375j58330j01365n4079
$$ 162582 218407 217380 318425 366115 371018 375082 367852 441798 430423 272093 170728 116649
10406A16649n0798N1385K6357O064n9661l4905o5497j2586J14566J0747j15464
$$ 116649 65851 117236 143593 149657 89996 55091 -10406 -22992 91574 102321 -13143
10395a3143j15149R1794K0423J7556m486P2477J03272M2635N4475r692j3479N2322
$$ -13143 -128292 -36498 -16075 1481 -3005 69472 172744 215379 269854 260162 246683 299005
10383B99005Q751n0716q4986q2818N3746j2737p3135j2640K8237r0486o4127l700
$$ 299005 307756 257040 172054 89236 142982 130245 57110 44470 72707 -17779 -81906 -85606
10371h5606m4757j3018O6974Q8580J60876M6220p5406j16408q2820n0344Q8849
$$ -85606 -130363 -143381 -76407 12173 173049 219269 143863 27455 -55365 -105709 -16860
10360a6860K3728L4615O153n1325L437R8024k7592k2576q1020n1434n5710K2244
$$ -16860 6868 41483 47636 -3689 -252 97772 70180 47604 -33416 -84850 -140560 -118316
10348a18316J74200J06117n7200J2239n313m1886j3006J5614O1290o149m7072
$$ -118316 55884 162001 104801 117040 111727 69841 56835 72449 133739 127590 80518
10337H0518N7448p7480n6901M3921P5228j6810r8343K4073l7856K0742K6541p4265
$$ 80518 137966 60486 3585 47506 122734 105924 7581 31654 -6202 14540 41081 -33184
10325c3184n3633M6800K0127k3063j0082J03698J44102J3293q0791q5511p4702
$$ -33184 -86817 -40017 -19890 -42953 -53035 50663 194765 208058 127267 41756 -32946
10314c2946j4624L2051R0184N4266n7422r9789n4277O9980J29140J16291j86817
$$ -32946 -47570 -15519 74665 128931 71509 -28280 -82557 -12577 116563 232854 46037
10303D6037j88794r5045J8963P4553P9411m10L2308n9576K8095N9635J3584m9556
$$ 46037 -142757 -237802 -218839 -144286 -64875 -65285 -32977 -92553 -64458 -4823 8761 -40795
10291d0795J41473J13684M7919r1878r9609j07346m3384k0670M0691O4440K9186
$$ -40795 100678 214362 262281 170403 70794 -36552 -79936 -100606 -59915 4525 33711
10280C3711N2277K9696m6119l8914M2634M3648k7291j04752j44783o4366O6593
$$ 33711 85988 115684 69565 30651 73285 116933 89642 -15110 -159893 -224259 -157666
10269a57666P6422K5054L3941N0089p8918p3674N0615P3464M2042j1013j7318
$$ -157666 -81244 -56190 -22249 27840 -51078 -124752 -74137 -673 41369 30356 13038
10258A3038R2161O1732m9174j1987K0344q4706k7666p523O6968r1357l3513j270
$$ 13038 105199 166931 117757 105770 126114 41408 13742 6219 73187 -18170 -51683 -52953
10246e2953Q3750q519l349k2079q0056K6500J18466O6117k4615M359L0293k2664
$$ -52953 30797 22278 18929 -3150 -83206 -56706 61760 127877 103262 107621 137914 115250
10234A15250R41k2440J3423P5849k0809K2144L300n5421K3837n3m913m7994l1884
$$ 115250 116191 93751 107174 183023 162214 184358 187658 132237 156074 156021 151108 103114 71230
10221G1230K5920R1064R2695r211o5296k9978n0992n6409L5093N0864p3388j5667
$$ 71230 97150 188214 280909 271698 206402 176424 125432 69023 104116 154980 81592 65925
10209F5925Q5276k844N1028M6719o4301q4163k2456Q3232j5238j46463j673O6985
$$ 65925 151201 148357 199385 246104 181803 97640 75184 158416 143178 -3285 -4958 62027
10197F2027K7920M3015J8596O7312p6977j36239l7379Q0501L8463N0940N3754
$$ 62027 89947 132962 151558 218870 141893 5654 -31725 48776 87239 138179 191933
10186A91933J0307J8778O583K8329N1885O1039K8203o0167q4275L6003j3146p4180
$$ 191933 202240 221018 227601 255930 307815 368854 397057 336890 252615 288618 275472 201292
10174B01292N7398J72649J31814K2344n9706q0378n1249q3753k3958O7585L6140
$$ 201292 258690 431339 563153 585497 525791 445413 394164 310411 286453 354038 390178
10163C90178P9761j5929P828r2911r6Q5492Q9818K4165O0848n6103j18364n8590
$$ 390178 469939 454010 461838 368927 368831 454323 544141 568306 629154 573051 454687 396097
10151C96097K8865K4761o8480P4130K2022n7962n2876r3361m6950k1882m5650
$$ 396097 424962 449723 381243 455373 477395 419433 366557 273196 226246 204364 158714
10140A58714o915k9575P5533O287O5651k124k3532p981J3291j3730p8394K3817
$$ 158714 151799 122224 197757 204044 269695 267571 244039 236058 249349 235619 157225 181042
10128A81042J79639l057j23034j35072o1642k0017l8364m6949m54O8575O6007
$$ 181042 360681 357624 234590 99518 37876 17859 -20505 -67454 -67908 667 66674
10117F6674O7027n839n1320j2649N8812J976N0447M6047j37467l6936N0853P4936
$$ 66674 133701 127862 76542 63893 122705 124681 175128 221175 83708 46772 97625 172561
10105A72561j5446m4952J6483n5477J1528n2487j37781l1745J5473J8161J4541
$$ 172561 157115 112163 128646 73169 84697 32210 -105571 -137316 -121843 -103682 -89141
10094h9141o1458l0981N4666J58313J19643j21202r1301K2901J44289J560m740
$$ -89141 -150599 -181580 -126914 31399 151042 29840 -61461 -38560 105729 107289 102549
10083A02549l5493n046K5487k4q0079K4317Q5656k7875j40846l2590P4939k5651
$$ 102549 67056 62010 87497 87473 7394 31711 117367 89492 -51354 -83944 -9005 -34656
10071c4656o682K0958J8378N6498o6413K1585j9852m3212M1212m4752L6511J1315
$$ -34656 -41338 -20380 -2002 54496 -11917 9668 -10184 -53396 -12184 -56936 -20425 -9110
10059i110p9519P4069J26605J04167j2619j4478J1255q9943M61Q4143k0489k22614
$$ -9110 -88629 -14560 112045 216212 203593 189115 200370 110427 110888 195031 174542 -48072
10047d8072K4971L0282m0417J3856P421n0227p0185n5428J43057O6279M2564p8297
$$ -48072 -23101 7181 -33236 -19380 -11959 -62186 -132371 -187799 -44742 21537 64101 -14196
10035a4196j13008k084J29984k550n7858P7733J41675J3675p5128M6728L5503
$$ -14196 -127204 -129288 696 -1854 -59712 18021 159696 173371 98243 144971 180474
10024A80474m7013m9035j4145K8657k6020M1009o5744j03548l2961K7665N0349
$$ 180474 133461 84426 70281 98938 72918 113927 48183 -55365 -88326 -60661 -10312
10013a0312M2017n8188K9304k0958r3409j3145M2311K8922p8043P7362j6473K4316
$$ -10312 31705 -26483 2821 -18137 -111546 -124691 -82380 -53458 -131501 -54139 -70612 -46296
10001d6296k047j43j61872j33081J63336K3239N7418P3090p328m7633K3939J13677
$$ -46296 -48343 -48486 -210358 -343439 -180103 -156864 -99446 -26356 -33684 -81317 -57378 56299
9989E6299P9682k1128q9707o0356j759J6910N7884l5170j14735l1667J87476K9447
$$ 56299 135981 114853 25146 -35210 -36969 -20059 37825 2655 -112080 -143747 43729 73176
9977G3176J6922j36965n7926K6395p333N0567l920R8721J8488j9750Q159J0018
$$ 73176 90098 -46867 -104793 -78398 -85731 -35164 -39084 59637 78125 58375 66534 76552
9965G6552o4307j14382N3369Q8664m410M9763P3096m4914j3083j55284k8286J29372
$$ 76552 12245 -102137 -48768 39896 35486 85249 158345 113431 100348 -54936 -83222 46150
9953D6150N944m7083K3855J0546L3096k3436l5605J0855l8655r0729R280K5120
$$ 46150 52094 5011 28866 39412 72508 49072 13467 24322 -14333 -105062 -95782 -70662
9941g0662O8288j5930N6870O7205r215o9499l8075M1886j69Q5639m6126p3328
$$ -70662 -2374 -18304 38566 105771 96556 27057 -11018 30868 30699 116338 70212 -3116
9929c116K5316o1581l4159L0179l0153k1671R2581N3752J763m0460r4753k3130
$$ -3116 22200 -39381 -73540 -43361 -73514 -95185 -2604 51148 52911 12451 -82302 -105432
9917a05432O6376O1818q910J7867K0493n5906j04979r7970M119P7749N5789k7243
$$ -105432 -39056 22762 13852 31719 52212 -3694 -108673 -206643 -202524 -124775 -68986 -96229
9905i6229r6150k6451J30266J9874m8160Q655Q2371N6747N4626j8338o8661j7656
$$ -96229 -192379 -218830 -88564 -68690 -116850 -108195 -25824 30923 85549 67211 -1450 -19106
9893a9106P1379J06566L7215j14398r4246l34n1875m3586J4123j9503M3994K3551
$$ -19106 52273 158839 196054 81656 -12590 -12924 -64799 -108385 -94262 -113765 -69771 -46220
9881d6220L4607m7573j7808j061P565M3957k6154j6132K0436N7334O7775o722
$$ -46220 -11613 -59186 -76994 -78055 -70490 -26533 -52687 -68819 -48383 8951 76726 70004
9869G0004M6583j10586j47417K1523j5257L0231R1538k7228j566N8172Q9297k7687
$$ 70004 116587 6001 -141416 -119893 -135150 -104919 -13381 -40609 -42175 15997 105294 77607
9857G7607k8792K1457K5673L3520N0129M9307o4361p5704p0716j3137q56q327
$$ 77607 48815 70272 95945 129465 179594 228901 164540 88836 18120 4983 4127 -4200
9845d200M0769k4186k9702l9421M5376J75350J7678l6505p5779j03068n466n0781
$$ -4200 36569 12383 -17319 -56740 -11364 163986 181664 145159 69380 -33688 -39154 -89935
9833h9935j7390J4384R0515K0617P6667J14325n5438o6487o9226p0596L3250J83070
$$ -89935 -107325 -92941 -2426 18191 94858 209183 153745 87258 18032 -52564 -19314 163756
9821A63756J44402n9467j17033r5822K7584R4500l9523n7072q8844l5660L9380
$$ 163756 308158 248691 131658 35836 63420 157920 118397 61325 -27519 -63179 -23799
9810b3799R8569m9898L9874K0653J85958q123j0703j7396l0850o8883n4914P7376
$$ -23799 74770 24872 64746 85399 271357 263234 252531 235135 204285 135402 80488 157864
9798A57864J15149L0345q0630j1512j0719J22438J2107l710J35774K43817K19270
$$ 157864 273013 303358 222728 211216 200497 322935 335042 331332 467106 710923 930193
9787I30193M10319N50389P42690Q63531O87108M19959J64735R0119J84185j48212
$$ 930193 1340512 1890901 2633591 3497122 4184230 4604189 4768924 4859043 5043228 4895016
9777D895016o49927r39212r72819p16386m68269l27367k26977j99088k05215k1294
$$ 4895016 4245089 3305877 2333058 1616672 1148403 821036 594059 394971 189756 168462
9767A68462J86786O7204n2613n0998o2337J9858O0657p3861r5159j33413l8618
$$ 168462 355248 422452 369839 318841 256504 276362 337019 263158 167999 34586 -4032
9756d032K4551J12286l4083j15792m1876N5618J22127k5923m8800O4670K8515
$$ -4032 20519 132805 98722 -17070 -58946 -3328 118799 92876 44076 108746 137261
9745A37261j22889q3077L0841J23673J30623p082q2160p0850L1213J14411o7528
$$ 137261 14372 -68705 -37864 85809 216432 209350 127190 56340 87553 201964 134436
9734A34436o5067k2640q8K6824p5578k5238J27249J04632O797m7000o6298q0938
$$ 134436 69369 46729 46641 73465 -2113 -27351 99898 204530 211327 164327 98029 17091
9722A7091j2182k1433K662K3095m4086N5813N8960n5568l8602j025L931O2572
$$ 17091 4909 -16524 -13862 9233 -34853 20960 79920 24352 -14250 -15275 -11344 51228
9710E1228n1562p8009J4997J15193o321n1125O881n9480M6467N8442K5819k6340
$$ 51228 -334 -78343 -63346 51847 45526 -5599 1282 -58198 -11731 46711 72530 46190
9698D6190L2071J7402m4769l7176M7014L3016j13521r7157J49048J37899O6316
$$ 46190 78261 95663 50894 13718 60732 93748 -19773 -116930 32118 170017 236333
9687B36333p5043K222N349j9033k31043p8841N6274o1394k4981J02476j0514N0
$$ 236333 161290 163512 168861 149828 -81215 -160056 -103782 -165176 -190157 -87681 -98195 -98145
9675i8145L6648L2407K6791m8310n6789p587L2946P4620L4441M5092M1441K4854
$$ -98145 -61497 -29090 -2299 -50609 -107398 -114985 -82039 -7419 27022 72114 113555 138409
9663A38409j8488j2809j3027k6265j23707j8955L4597l1491J04256P8764m4412
$$ 138409 119921 107112 94085 67820 -55887 -74842 -40245 -71736 32520 111284 66872
9652F6872o3493M1727Q2508N8082r4775N1101P7047L2491j2911o953k4323l4155
$$ 66872 3379 45106 127614 185696 90921 142022 219069 251560 238649 231696 207373 173218
9640A73218l4787r0211q7732m1286k3068O9386N2130n734J6467L0277M1024R3773
$$ 173218 138431 48220 -39512 -80798 -103866 -34480 17650 11916 28383 58660 99684 193457
9628A93457l7440j10961j19432N8119J0980M1371o769J29641j0578m2503o7219
$$ 193457 156017 45056 -74376 -16257 -5277 36094 29325 158966 148388 105885 38666
9617C8666j12484K3122N9333r5223q9246L6571J5610l0495P2815O7334J1839L5529
$$ 38666 -73818 -50696 8637 -86586 -175832 -139261 -123651 -154146 -81331 -13997 -2158 33371
9605C3371J5405P931L8814o256J6252P993n7077o973l1362l1312M9480J2995m0501
$$ 33371 48776 56707 95521 89265 105517 113510 56433 49460 18098 -13214 36266 49261 8760
9592H760J7534l0620Q0430L4587M020l9720R955l4641k478L0308j0038R36K5122
$$ 8760 26294 -4326 76104 110691 114711 74991 84946 50305 47827 78135 68097 69033 94155
9579I4155K1249j02556m5521K4318l7348n775j26983k2758R6823m3424N2102P8117
$$ 94155 115404 12848 -32673 -8355 -45703 -51478 -178461 -201219 -104396 -147820 -95718 -17601
9567a7601L7359K6437j03820k6673O0654J03878m8750n6728q573n7284K8499J13986
$$ -17601 19758 46195 -57625 -84298 -23644 80234 31484 -25244 -33817 -91101 -62602 51384
9555E1384M1204K556j04618k5283P2577Q770j33129r2183P3632N3080n3791P92
$$ 51384 92588 95144 -9474 -34757 37820 46590 -86539 -178722 -105090 -52010 -105801 -105009
9543a05009l5442L5244k4219P2575J48139M1971k39n6578r566K7786p2298p2137
$$ -105009 -140451 -105207 -129426 -56851 91288 133259 133020 76442 66876 94662 22364 -49773
9531d9773L0189O0904J4833M2849L654j8703n1106Q1450k4452r3871k780j483
$$ -49773 -19584 41320 56153 99002 102656 83953 32847 114297 89845 -4026 -6806 -8289
9519h289j55132j5221J00318R5004M1421p9212r4781k042K5259J1128J9210J13525
$$ -8289 -163421 -178642 -78324 16680 58101 -21111 -115892 -117934 -92675 -81547 -62337 51188
9507E1188m2542j02241N4494Q9200k8284r8151N3054J304k0410q04N7123K0874
$$ 51188 8646 -93595 -39101 50099 21815 -76336 -23282 -21978 -42388 -43192 13931 34805
9495C4805m7952P9376J23917P079n1661j25648q4804p1139l0121Q9775J02888
$$ 34805 -13147 66229 190146 197225 145564 19916 -64888 -136027 -166148 -76373 26515
9484B6515Q489n0844r2250r1911l9032J55327O6968m728l30l1471q7753j3760
$$ 26515 35004 -15840 -108090 -200001 -239033 -83706 -16738 -21466 -21796 -53267 -141020 -154780
9472a54780l1737K722R9141R540O0598o0908Q625K1856L93m0413R2178P3918r1233
$$ -154780 -186517 -183795 -84654 -75114 -14516 -75424 -66799 -44943 -44550 -84963 7215 81133 -10100
9459a0100o0579p29N1795r680J607K7770k8606J6079J419N4353n365p4894K4572
$$ -10100 -70679 -71408 -19613 -29293 -27686 84 -28522 -12443 -11024 43329 37964 -36930 -12358
9446a2358q1928n8168J67414L5300R4760k2762r70L4006j03366q9961o1507k2302
$$ -12358 -94286 -152454 14960 50260 145020 122258 121288 155294 51928 -38033 -99540 -121842
9434a21842Q1293M1957J23040K8100l2586o1318o4067l0353L5435j53139j02090
$$ -121842 -40549 1408 124448 152548 119962 58644 -5423 -35776 -341 -153480 -255570
9423b55570O2859N4287Q5714Q7600k7336p4937r5494M8998J02279k4122K1929
$$ -255570 -192711 -138424 -52710 34890 7554 -67383 -162877 -113879 -11600 -35722 -13793
9412a3793O0350K5195k4218n8285O809j01388M650J28514Q724m0763M2526P5282
$$ -13793 46557 71752 47534 -10751 -3942 -105330 -100680 27834 36558 -4205 38321 113603
9400A13603o0027l3470r1987p549r693N7430m8837M9179m3142m1553l3772L5163
$$ 113603 53576 20106 -71881 -79430 -89123 -31693 -80530 -31351 -74493 -116046 -149818 -114655
9388a14655K600J52105N4590l3184L3075o5611p3975l5522N9777J2502J679O1290
$$ -114655 -112055 40050 94640 61456 94531 28920 -45055 -80577 -20800 -8298 -6619 54671
9376E4671n1233O6904J2559M5581p23p6465j8867L1254k9443q7658j2767M9746
$$ 54671 3438 70342 82901 128482 127759 51294 32427 63681 34238 -53420 -66187 -16441
9364a6441o6721j9230K65J2399O1041k2339r2189N2087O5665k7778p2130O5136
$$ -16441 -83162 -102392 -102127 -89728 -28687 -51026 -143215 -91128 -25463 -53241 -125371 -60235
9352f0235O8545n9022n377R0078M9322O426P8768k8309m6669j17501k5486j2619
$$ -60235 8310 -50712 -56089 33989 83311 89737 168505 140196 93527 -23974 -49460 -62079
9340f2079K4739m8086M9968J6660N0639J7870K1736J1663J5900l4741m2779Q854
$$ -62079 -37340 -85426 -35458 -18798 31841 49711 71447 83110 99010 64269 21490 30344
9328C0344m9281m2040j4575j4174O6624M2941k0087O4398J28486o5966p8380P576
$$ 30344 -18937 -60977 -75552 -89726 -23102 19839 -248 64150 192636 126670 48290 55866
9316E5866r882l1391m5648k9825O939k4678k2990M9625r5624M0154N6185K3449
$$ 55866 45984 14593 -31055 -60880 -53941 -78619 -101609 -51984 -147608 -107454 -51269 -27820
9304b7820L7641J5456M157r1498j00351P854Q6481j2695J1578L977m0221R9090
$$ -27820 9821 25277 29434 -62064 -162415 -154561 -68080 -80775 -69197 -65220 -105441 -6351
9292f351J52581j0810o6538r0300n4935J66716L7887n7491k8882o0866o7511j10503
$$ -6351 146230 135420 68882 -21418 -76353 90363 128250 70759 41877 -18989 -86500 -197003
9280a97003M3537p0987l827M855O9369O2567O2865K3342j4287n4023M635M7013
$$ -197003 -153466 -224453 -228280 -223425 -154056 -91489 -28624 -5282 -19569 -73592 -68957 -21944
9268b1944M9504p6388M9487N2622k7385j94319k9127m165Q763L9730l7775P0286
$$ -21944 27560 -48828 659 53281 25896 -168423 -197550 -201715 -192952 -153222 -190997 -120711
9256a20711O9018o1078j3813O5515N8329o6208q1394M5271J930J14555Q524j1523
$$ -120711 -51693 -112771 -126584 -61069 -2740 -68948 -150342 -105071 -103141 11414 19938 8415
9244H415m0582m9532m6163M0091M6600j5446J6831j9838N1500m5040K539l9430
$$ 8415 -32167 -81699 -127862 -87771 -41171 -56617 -39786 -59624 -8124 -53164 -50625 -90055
9232i0055N5181K3597j10667j4067Q0493M1449O4625o1514q1216L9796J32357
$$ -90055 -34874 -11277 -121944 -136011 -55518 -14069 50556 -10958 -92174 -52378 79979
9221G9979J6109k7543q9158n786P9378Q2426j2388j23184n2818J7891K1593N3494
$$ 79979 96088 68545 -20613 -26399 52979 135405 123017 -167 -52985 -35094 -13501 39993
9209C9993m1656o9815M2922r163l5513K9091J61116o1366q1239k426j9837J2877
$$ 39993 -1663 -71478 -28556 -37719 -73232 -44141 116975 55609 -25630 -28056 -47893 -35016
9197c5016Q968p662J2029J01014N6724L9425l8676j60139q9895M9479L9016O0392
$$ -35016 -26048 -33710 -21681 79333 136057 175482 136806 -23333 -113228 -63749 -24733 35659
9185C5659p4501k0099J26746J07136n7438l2531k3870k0657J2495m3648L7971
$$ 35659 -38842 -58941 67805 174941 117503 84972 61102 40445 52940 9292 47263
9174D7263J8965K60j8287M290n9394j323J06191M2008k2906o790l4229K0102K3091
$$ 47263 66228 66488 48201 52491 -6903 -8226 97965 139973 117067 110277 76048 96150 119241
9161A19241P2296O6418j51009p8980m7425q7574j21413j069N6865R5272J88548
$$ 119241 191537 257955 106946 27966 -19459 -107033 -228446 -229515 -172650 -77378 111170
9150A11170M9571j00068j34442L8501K0521Q2711L3472r2053q7193M0591r723
$$ 111170 160741 60673 -73769 -35268 -14747 67964 101436 9383 -77810 -37219 -46942
9139d6942J38969J24346n7557q1328j36363o6368r397J3241O1220j0181p6556
$$ -46942 92027 216373 158816 77488 -58875 -125243 -134640 -121399 -60179 -70360 -146916
9128a46916k9161L2294N9304O1866L2216L2695j05055j0083L3144M1976m4924
$$ -146916 -176077 -143783 -84479 -22613 9603 42298 -62757 -72840 -39696 2280 -42644
9117d2644m0687o083o5201o4252n2634q4575J9933P0019k1621q695P0800J34834
$$ -42644 -83331 -89414 -154615 -218867 -271501 -356076 -336143 -266124 -287745 -296440 -225640 -90806
9105i0806J07106L8370L4803j60952k5193Q4169J13017m8085j02758p0238P2205
$$ -90806 16300 54670 89473 -71479 -96672 -12503 100514 52429 -50329 -120567 -48362
9094d8362R9814M0056n5392K3046q368k9100n4739J654j2939J2792N4674O1826
$$ -48362 51452 91508 36116 59162 50794 21694 -33045 -31391 -44330 -31538 23136 84962
9082H4962o5356j14180m5831O9659m5593k3332R1500R7137j6791j12169k412P7091
$$ 84962 19606 -94574 -140405 -70746 -116339 -139671 -48171 48966 32175 -79994 -82406 -5315
9070e315n7529m159O0704j663k4355L7635R1504R23k7997p0698l4125L5160n4061
$$ -5315 -62844 -67003 -6299 -7962 -32317 5318 96822 97745 69748 -950 -35075 85 -53976
9057e3976k0726O2350M6146n739J7674m1794Q095m3281O377Q1709m0797o3185
$$ -53976 -74702 -12352 33794 28055 45729 3935 12030 -31251 -24874 56835 16038 -47147
9045d7147J7444o635o9111P4006O7818P8469m5025j4836K4405k3909n4098o2522
$$ -47147 -29703 -36338 -105449 -31443 36375 114844 69819 54983 79388 55479 1381 -61141
9033f1141l2286j8522J11079L4099R455J04928m8108n1750p9493r3476Q7861Q6585
$$ -61141 -93427 -111949 -870 33229 42684 147612 99504 47754 -31739 -125215 -37354 49231
9021D9231J0962M1626M0616p6616j4629Q08N3078q1298j12556l2135M991L0873
$$ 49231 60193 101819 142435 65819 51190 51998 105076 23778 -88778 -120913 -115922 -85049
9009h5049k5835L6863Q5171Q9145P6385M7404K8147j22285r2078o4251R0149Q0817
$$ -85049 -110884 -74021 11150 100295 176680 224084 252231 129946 37868 -26383 63766 144583
8997A44583l8271L096r0479R0011L9737n3964k1969l4058n366M6072J02952N1898
$$ 144583 106312 109408 18929 108940 148677 94713 72744 38686 33320 79392 182344 234242
8985B34242n8494j61098M0634J5863r3945k4867J13342O5961m7174k3273m4213
$$ 234242 175748 14650 55284 71147 -22798 -47665 65677 131638 84464 61191 16978
8974A6978J8083j2114l9689O0945l0994j7732M9572O3261n9315r7130k3022N7047
$$ 16978 35061 22947 -16742 44203 13209 -4523 45049 108310 48995 -48135 -71157 -14110
8962a4110R6146L637Q075m1249L2772R3631j5536j8883l0418n1448P3863j8308
$$ -14110 82036 85673 93748 52499 85271 178902 163366 144483 114065 62617 136480 118172
8950A18172o6434j0516L8334p8963Q309o5319j4147R1851L812L5164j3567j5199
$$ 118172 51738 41222 79556 593 8902 -56417 -70564 21287 25099 60263 46696 31497
8938C1497j0782J01809K7963n4737L5404J0294j26754j14619J34123L8779l3692
$$ 31497 20715 122524 150487 95750 131154 141448 14694 -99925 34198 72977 39285
8927C9285n183O0143m2138J3788J974k2544p2805j35342M4031P5899O690M1017
$$ 39285 34102 94245 52107 65895 67869 45325 -27480 -162822 -118791 -42892 -36202 4815
8915D815k5235J7640J05663O8646O8412j27178n5920L5179J2485J0646J4817m4781
$$ 4815 -20420 -2780 102883 171529 239941 112763 56843 92022 104507 115153 129970 85189
8903H5189j06749k2512N3818m977J7991n3888r006j5281M7969J6394m0045L1030
$$ 85189 -21560 -44072 9746 4769 22760 -31128 -40134 -55415 -7446 8948 -31097 -67
8891f7p5818j8324n501N08J1512j3434K3477J8618j5358J40367M8117l4773j39993
$$ -67 -75885 -94209 -99710 -99202 -87690 -101124 -77647 -59029 -74387 65980 114097 79324 -60669
8878f0669j10182R1619R3648n8130O7327m3796k7534r3585k9576K4355K757L5261
$$ -60669 -170851 -79232 14416 -43714 23613 -20183 -47717 -141302 -170878 -146523 -143766 -108505
8866a08505L9265J01385R2710p5369j48941j4658j5692m9461J34476M0911m5349
$$ -108505 -69240 32145 124855 49486 -99455 -114113 -129805 -179266 -44790 -3879 -49228
8855d9228L2311M0859O853q884q9270L904J22088p0L6767o2669P551J1705K3802
$$ -49228 -16917 23942 30795 21911 -67359 -63455 58633 58563 95330 32661 40212 51917 75719
8842G5719l936n9983O269P2761P0334o0016q5516K0370K3180m909j9491N1734
$$ 75719 71783 11800 18069 90830 161164 101148 15632 36002 59182 54273 34782 86516
8830H6516n6454k0790K0934K168L1293N7396o0196j12195m1801N6491Q2487J37486
$$ 86516 30062 9272 30206 32374 63667 121063 60867 -51328 -93129 -36638 45849 183335
8818A83335r2690J798M3751Q539q3980r6089p3549r722M0982K7505N3298k2388
$$ 183335 90645 92443 136194 144733 60753 -35336 -108885 -118607 -77625 -50120 3178 -19210
8806a9210l4829R301k9531j18693J00919J82917N7727j8967r6143J2173n2988
$$ -19210 -54039 -44738 -74269 -192962 -92043 90874 148601 129634 33491 45664 -7324
8795g324n7172M625N0246Q1426m964l3514l8960o3737o4680j2642N9314M7660
$$ -7324 -64496 -59871 -9625 71801 66837 33323 -5637 -69374 -134054 -146696 -87382 -39722
8783c9722J7275j25906j7814Q6294M1957j221j880k3291p7560r466Q7194L8596
$$ -39722 -22447 -148353 -166167 -79873 -37916 -39137 -41017 -64308 -141868 -151334 -64140 -25544
8771b5544J00317k4558p2506J8031J6772o7073J1450m9219j4618J61815j7435
$$ -25544 74773 50215 -22291 -4260 12512 -54561 -43111 -92330 -106948 54867 37432
8760C7432o3627L9520J189k1817N0476J0734l483P7134L105r0843j5531J385l3254
$$ 37432 -26195 13325 14514 -7303 43173 53907 50424 127558 130663 39820 24289 25674 -7580
8747g580n4002L4217Q4775J3682r9256l8235j1684j3905K329r365p3111j952j377
$$ -7580 -61582 -27365 57410 71092 -28164 -66399 -78083 -91988 -89659 -99024 -172135 -174087 -175464
8734a75464Q3006R4330j15724j8412k1608P5823O0055p7645n0562q933j0813l0100
$$ -175464 -92458 1872 -113852 -132264 -153872 -78049 -17994 -95639 -146201 -155134 -165947 -196047
8722a96047K658J7023J2672K8508Q9688L7592j9603Q2051k4031j0521n5472j1924
$$ -196047 -193389 -176366 -163694 -135186 -45498 -7906 -27509 54542 30511 19990 -35482 -47406
8710d7406m3915Q3700N5324m4649L7767N8834n8693o140k0264l0637Q2705n4158
$$ -47406 -91321 -7621 47703 3054 40821 99655 40962 34822 14558 -16079 66626 12468
8698A2468q5814P7293N6577K2787o0300K726J8076q4598L5099J47411M63j8217
$$ 12468 -73346 3947 60524 83311 23011 25737 43813 -40785 -5686 141725 142188 123971
8686A23971j06296o8526n9453j7952o696M7085J66135O733p9965k1070j8143J12565
$$ 123971 17675 -50851 -110304 -128256 -134952 -87867 78268 85001 5036 -16034 -34177 78388
8674G8388J6297l0917K7319j04831l3209m3401j6083M1883J08282J14240j9066
$$ 78388 94685 63768 91087 -13744 -46953 -90354 -106437 -64554 43728 157968 138902
8663A38902j02518j4928Q5843M5192K8565o2491o1279j4047k2981J9257j4135
$$ 138902 36384 21456 107299 152491 181056 118565 57286 43239 20258 39515 25380
8652B5380J4579J8838N270j35914m1685l608p74O1452M1054p3202l3612P9124
$$ 25380 39959 58797 64067 -71847 -113532 -117140 -117914 -56462 -15408 -88610 -122222 -43098
8640d3098K725k9474P9330P3258n14k0895R277J9660j4916m6312p9633K5459P3366
$$ -43098 -40373 -69847 9483 82741 82227 61332 70609 90269 75353 29041 -50592 -25133 48233
8627D8233j6287j0240n8591q5500R0632K3867R2007O0050L2851n3395l8599J823
$$ 48233 31946 21706 -36885 -122385 -31753 -7886 84121 144171 177022 123627 85028 86851
8615H6851K0175o772j31294l1750M1703P4254R8712m1538m8590N4129J62346p0540
$$ 86851 107026 100254 -31040 -62790 -21087 53167 151879 110341 61751 115880 278226 207686
8603B07686n950J4375m1832q2483j3591o2609o9705P8781J02980R423l2239J6121
$$ 207686 201736 216111 174279 91796 78205 15596 -54109 24672 127652 137075 104836 120957
8591A20957M1371o8576q2609Q3802N9118P6545J1974J9570J0632q0636m7274J2245
$$ 120957 162328 93752 11143 94945 154063 230608 242582 262152 272784 192148 144874 157119
8579A57119J19735J10876m0440j07559r7199j39537p4386K6969o0007q2655K0088
$$ 157119 276854 387730 347290 239731 142532 2995 -71391 -44422 -104429 -187084 -166996
8568a66996J62257n6996q1916R1872J1719N5955Q9027k6733r3420l63j0060J2968
$$ -166996 -4739 -61735 -143651 -51779 -40060 15895 104922 78189 -15231 -15594 -25654 -12686
8556a2686l5676j75158q2034J50008J28495M9732m1597Q7849J5116Q4916M4955
$$ -12686 -48362 -223520 -305554 -155546 -27051 22681 -18916 68933 84049 168965 213920
8545B13920o2494P6690J62706O2262J01416O1179J48775K75537J45888L5146q5882
$$ 213920 151426 228116 390822 453084 554500 615679 764454 1039991 1185879 1221025 1135143
8534A135143J7254J27237N9323j14146l67416l10742j76265q4807O596o6103N1764
$$ 1135143 1152397 1279634 1338957 1224811 857395 546653 370388 285581 292177 226074 277838
8523B77838J3161j24153l5217j15569k7475K4234Q4859J00095p6084k5433n403
$$ 277838 290999 166846 131629 16060 -11415 12819 97678 197773 121689 96256 90853
8512I0853l8716k4031Q151J8173J5706M4236k3088n8908k381K3144O6513J71076
$$ 90853 52137 28106 36257 54430 70136 114372 91284 32376 29995 53139 119652 290728
8500B90728L8595M496l2680N8439K30109M02636M39949L51192L09886J98173K2417
$$ 290728 329323 333819 301139 359578 589687 992323 1432272 1783464 2093350 2291523 2313940
8489B313940N8013K51958J27017l75784o59861m89049k60528k84298k30961j39145
$$ 2313940 2371953 2623911 2750928 2375144 1715283 1226234 965706 681408 450447 311302
8479C11302j05766l6433N8133q3259o8403J769m2191m8412q626N5896O4896m7067
$$ 311302 205536 169103 227236 143977 75574 77343 35152 -13260 -21886 34010 98906 51839
8467E1839N1664L5870L5931q704m9188k2855q408P2206n648o0557K4188K2513
$$ 51839 103503 139373 175304 166600 117412 94557 86149 158355 152707 92150 116338 138851
8455A38851K7630J01664J04824j637O173J35395J62320K66913J92830J25313j7361
$$ 138851 166481 268145 372969 371332 377505 512900 675220 942133 1134963 1260276 1242915
8444A242915K4891M1568M7815j08596l29055l55892k00941j82826l1946R5767
$$ 1242915 1267806 1309374 1357189 1248593 919538 563646 362705 179879 147933 243700
8434B43700l7464n6944M3726l667j05192m5364k821O4434l8019k9454m0843R3846
$$ 243700 206236 149292 193018 189351 84159 38795 35974 100408 62389 32935 -7908 85938
8422H5938M3471J3875m3185l388K4952L0357j06732j50819J6620P5258K2335M9138
$$ 85938 129409 143284 100099 96711 121663 152020 45288 -105531 -88911 -13653 8682 57820
8410E7820m8729M0984k1589l4969L5878R096n9646o0165J28837P5187j0166j03688
$$ 57820 9091 50075 28486 -6483 29395 38491 -21155 -81320 47517 122704 112538 8850
8398H850k3599j2567R817j4411n2845n5240N0066P3931l963j2429p4509O439O8125
$$ 8850 -14749 -27316 -17499 -31910 -84755 -139995 -89929 -15998 -19961 -32390 -106899 -100460 -32335
8385c2335k0037K1250M3789q7012n4106J57268Q8246l6035m8024L9949m9334n4181
$$ -32335 -52372 -31122 12667 -74345 -128451 28817 117063 81028 33004 72953 23619 -30562
8373c0562k0552M9061M78K4392K2859j716P161O7759n04m3572N4773P3274j07775
$$ -30562 -51114 -2053 -1575 22817 45676 43960 51121 118880 118376 74804 129577 202851 95076
8360I5076l7221r7090P5913L3740O8908K4906r9309j4195n2295O4579M6309N199
$$ 95076 57855 -39235 36678 70418 139326 164232 64923 50728 -1567 63012 109321 114520
8348A14520r816j5175m9962m4467M6682J9297k2053P3544N100r0569p8588k2569
$$ 114520 104704 89529 39567 -4900 41782 61079 39026 112570 117670 27101 -51487 -74056
8336g4056r129J0527r795P7472m5722n9590L3664L8862L7849M2202J18878Q477
$$ -74056 -83185 -72658 -82453 -4981 -50703 -110293 -76629 -37767 82 42284 161162 169639
8324A69639r7280p101o3051q859l842P1514p1657j77130R5616J14275j6623n5660
$$ 169639 72359 65258 2207 -6652 -10494 61020 -10637 -187767 -92151 22124 5501 -50159
8312e0159J0259L6066J44403m9183n9992l1242j8165L597j7098k1103N4373P6197
$$ -50159 -39900 -3834 140569 91386 31394 152 -18013 -14416 -31514 -52617 1756 77953
8300G7953N7244k6627q9478l4098J0067k4599J17331O7390q0703J4249l5000r6495
$$ 77953 135197 108570 19092 -15006 -4939 -29538 87793 155183 74480 88729 53729 -42766
8288d2766k7624M4074P805r1795j2194Q8048N9667l5507k7537P906K977R600o4412
$$ -42766 -70390 -26316 -18511 -110306 -122500 -34452 25215 -10292 -37829 -29923 -26946 -17346 -81758
8275h1758j15210O7788O2248O636R12J9180m6759m6617K5498n8347Q4069J44763
$$ -81758 -196968 -129180 -66932 -60296 -59384 -40204 -86963 -133580 -108082 -166429 -82360 62403
8263F2403J13871r2128k6979N1753L4309j8384m9461n0465J3558M6700j2477m7202
$$ 62403 176274 84146 57167 108920 143229 124845 75384 24919 38477 85177 72700 25498
8251B5498l8501r7217o7199Q1570P7509N542k024k979k3725Q8510R529j33077
$$ 25498 -13003 -110220 -177419 -95849 -18340 -12798 -14822 -17801 -41526 46984 56513 -76564
8239g6564o9128O3598K7998m2612L9725P8040O3101l6971M9634k2507n9923N5404
$$ -76564 -145692 -82094 -54096 -96708 -56983 21057 84158 47187 96821 74314 14391 69795
8227F9795N1625O738r7761J3353Q658n5251j9581J7922n8248k3576q778k9062
$$ 69795 121420 128158 30397 43750 52408 -2843 -22424 -4502 -62750 -86326 -95104 -124166
8215a24166J32539R4566j19123o7126j6168j9462m5956L0885L3856m5056n4458
$$ -124166 8373 102939 -16184 -83310 -99478 -118940 -164896 -134011 -100155 -145211 -199669
8204a99669j10371N0244Q6743P4185J81467N9027k7912k7915n4733l9184k3838
$$ -199669 -310040 -259796 -173053 -98868 82599 141626 113714 85799 31066 -8118 -31956
8193c1956l1341J02442R8555K2233n909l2339j8374o1635q3245j463j2522k4685
$$ -31956 -63297 39145 137700 159933 154024 121685 103311 41676 -41569 -43032 -55554 -80239
8181h0239N9275L274p6193q4273J09072J25483l9580p7450l3371N0443K7646N779
$$ -80239 -20964 -17690 -93883 -178156 -69084 56399 16819 -60631 -94002 -43559 -15913 -10134
8169a0134n8483j9860o6519k151J5413K7884P7256K7131K3671O7092l1712k7650
$$ -10134 -68617 -88477 -154996 -157147 -141734 -113850 -36594 -9463 14208 81300 49588 21938
8157B1938p3692o9991R5283l2446p4924o0284N3089K10033J25366m8700r7798
$$ 21938 -51754 -121745 -26462 -58908 -133832 -194116 -141027 69006 194372 145672 47874
8146D7874j08651Q798J17945K5427j48317l195J061P6784J01245p6271n7154j0033
$$ 47874 -60777 -51979 65966 91393 -56924 -60119 -59058 17726 118971 42700 -14454 -24487
8134b4487J3837L3526j2722n2142k9868K1707P8009m2861J6256N9070P0136j360
$$ -24487 -10650 22876 10154 -41988 -71856 -50149 27860 -15001 1255 60325 130461 129101
8122A29101p7850L2383j3368o6823o9403L2322r347J1959l2805M6805Q6515K131
$$ 129101 51251 83634 70266 3443 -65960 -33638 -42985 -31026 -63831 -17026 69489 71620
8110G1620p0007O0654L0225j30186J9259L0979k0759K5673K2259n5308J974Q7409
$$ 71620 1613 62267 92492 -37694 -18435 12544 -8215 17458 39717 -15591 -13617 73792
8098G3792k8284n8634j1405m851L2586L327K0356j5816P8542O1244K4898l3409
$$ 73792 45508 -13126 -24531 -29382 3204 6531 26887 11071 89613 150857 175755 142346
8086A42346j5895m4913m7805l9845N140m2980R264j00008l3196J66719O8856j47655
$$ 142346 126451 81538 33733 -6112 -972 -43952 -34688 -134696 -167892 -1173 67683 -79972
8074g9972l5402N321k4245l1355P7959R0870R8958n165K6227p2468J6768j2683
$$ -79972 -115374 -110053 -134298 -165653 -87694 3176 102134 96969 123196 50728 67496 54813
8062E4813m5307J3158l7490j14010k126L9356Q1621L0395k8817l8413p8476j9223
$$ 54813 9506 22664 -14826 -128836 -130962 -91606 -9985 20410 -8407 -46820 -125296 -144519
8050a44519K2856J44748K5204p5054L2226l2509J0744L3866l0134r3994J243j4984
$$ -144519 -121663 23085 48289 -26765 5461 -27048 -16304 17562 -12572 -106566 -105323 -120307
8038a20307Q3408R3370O3185o3838m3177P7589j7029l5655M3036J4712j0577q7084
$$ -120307 -36899 56471 119656 55818 12641 90230 73201 37546 80582 95294 84717 -2367
8026b367K132m097k5349n233Q3313k616K4427N2274L6612k342p3840o9218k7770
$$ -2367 -235 -4332 -29681 -34914 48399 45783 70210 122484 159096 156754 82914 13696 -14074
8013a4074R4461j7797j8518K4975J506j8692P885o743q7101K0588O2554n1347
$$ -14074 80387 62590 44072 69047 70553 51861 59746 53003 -34098 -13510 49044 -2303
8001b303P7240J42771l640j39324J4510j8308p0677O4544L8793l0720j31513p5261
$$ -2303 74937 217708 214068 74744 89254 70946 269 64813 103606 72886 -58627 -133888
7989a33888L2204K9541J04370N1120n9768k2773K9658m6050m0041O9371R0562
$$ -133888 -101684 -72143 32227 83347 23579 806 30464 -15586 -55627 13744 104306
7978A04306L188L6544k3565J0973N3765k1668n0442N4967J19010k4173m3632J7309
$$ 104306 107494 144038 120473 131446 185211 163543 113101 168068 287078 262905 219273 236582
7966B36582k980n0656q9382m3501K2123O7402k6387j50866j08323O50J01782K9004
$$ 236582 233602 182946 93564 50063 72186 139588 113201 -37665 -145988 -145338 -43556 -14552
7954a4552n1815M824P8959J5531k370q5622m4143N6124J00067L9950r4531k2821
$$ -14552 -66367 -61543 17416 32947 30577 -55045 -99188 -43064 57003 96953 2422 -20399
7942b0399J7374N7971m5606J3210N1048j8363j6083K8142m574k5399m4632k2936
$$ -20399 -3025 54946 9340 22550 73598 55235 39152 67294 62720 37321 -7311 -30247
7930c0247l1525K7584K4522L6074j0906k6334R1495J3336n5838j69835k9764R5881
$$ -30247 -61772 -34188 -9666 26408 15502 -10832 80663 93999 38161 -131674 -161438 -65557
7918f5557J4492o88Q6882J31062M798k21100r7747Q3594R8928J8465o5962N206
$$ -65557 -51065 -51753 35129 166191 170989 -50111 -147858 -64264 34664 53129 -12833 -7627
7906g627j0881J0257m5526m6713p331j1125n7836O8495R7845P8135r0874N664
$$ -7627 -18508 -8251 -53777 -100490 -107821 -118946 -176782 -108287 -10442 67693 -23181 -17517
7894a7517P5092J2998J6859J1405l5866n6068L1995J3243N4038L5861o1883p6691
$$ -17517 57575 70573 87432 98837 62971 6903 38898 52141 106179 142040 80157 3466
7882C466L1628j693J5922P8252J8334m8930p4772j05765n9458Q5957L9419j2049
$$ 3466 35094 33401 49323 127575 145909 96979 22207 -83558 -143016 -57059 -17640 -29689
7870b9689k6041k1186m1140L8916K8634O731q188l4786n0644j5544Q2407J11956
$$ -29689 -55730 -76916 -118056 -79140 -50506 -43775 -51963 -86749 -137393 -152937 -70530 41426
7858D1426M5373L4221l1714q9720N3046J4856p0159r6158p3361O1244J7417O8601
$$ 41426 86799 121020 89306 -414 52632 67488 -2671 -98829 -172190 -110946 -93529 -24928
7846b4928k1094p3581m6907N25o8857J33861J8704n5684k1615J27455J98740j2652
$$ -24928 -46022 -119603 -166510 -165985 -234842 -100981 -82277 -137961 -159576 -32121 166619 153967
7834A53967r7709o8999k4439L5045k2623m5846P5034R563j3307K6286n7153l3435
$$ 153967 56258 -12741 -37180 -2135 -24758 -70604 4430 13993 686 26972 -30181 -63616
7822f3616n5897k546K9596N1021k6551Q5597l6715k6801O5083m4073n8254O2100
$$ -63616 -119513 -122059 -92463 -41442 -67993 17604 -19111 -45912 19171 -24902 -83156 -21056
7810b1056J1906L6232N2961r1957j44560j9349J27630M0264L056j1893N7585r72
$$ -21056 -9150 27082 80043 -11914 -156474 -175823 -48193 -7929 -4873 -16766 40819 39847
7798C9847p5692m2259J7842L4380M198p2436K2277m8631q4854O4555j5323l2188
$$ 39847 -35845 -78104 -60262 -25882 -21684 -94120 -71843 -120474 -205328 -140773 -156096 -188284
7786a88284l154O0778O264m0897P5430O4065J19077Q6844p7492J8127M4964q4333
$$ -188284 -191438 -130660 -124396 -165293 -89863 -25798 93279 180123 102631 120758 165722 81389
7774H1389j8731M116J355k9959M4232N9014q1544r7876k2175K9469O7963Q910
$$ 81389 62658 66774 68129 38170 82402 141416 59872 -38004 -60179 -30710 37253 46163
7762D6163J15105J5579J2814o7288l5591k0682M0335p1775o9698k4771n7248l1859
$$ 46163 161268 176847 189661 122373 86782 66100 106435 34660 -35038 -59809 -117057 -148916
7750a48916N9874M9343M8213M2616l7981j02973N427P7689j0744p984j2964J5449
$$ -148916 -89042 -39699 8514 51130 13149 -89824 -84397 -6708 -17452 -25436 -38400 -22951
7738b2951J1737J5083n64o0586J11760k8544j6044K6117L5341m9165j59888q2426
$$ -22951 -11214 3869 3305 -57281 54479 25935 9891 36008 71349 22184 -137704 -220130
7726b20130L727J7190m7317J45771M7046o0332J0005R0517m9167K1077O4722M8371
$$ -220130 -216403 -199213 -246530 -100759 -53713 -114045 -104040 -13523 -62690 -41613 23109 71480
7714G1480K7421q317m4488o1248O386O2139O2315J2045k4054j00221K0443J05314
$$ 71480 98901 90584 46096 -15152 -8766 53373 115688 127733 103679 3458 23901 129215
7702A29215M5385r5160o249O5717j00944k04742L4583N0463q6196J0634R8403
$$ 129215 174600 79440 73191 138908 37964 -166778 -132195 -81732 -167928 -157294 -58891
7691e8891Q2162Q8579N848L4188q4748q0790j431N4490n6992o2805O1509L484
$$ -58891 23271 111850 117698 151886 67138 -13652 -15083 39407 -17585 -80390 -18881 -15397
7679a5397o6830j2170j316M3594O542l7250K8050r5621p3574L9435Q3016P2371
$$ -15397 -82227 -94397 -95713 -52119 -45577 -82827 -54777 -150398 -223972 -184537 -101521 -29150
7667b9150R1174k5690n1300J0893P5541P191j1945L3488J9255j0030q7386k0763
$$ -29150 62024 36334 -14966 -4073 71468 78659 66714 100202 119457 109427 22041 1278
7655A278m1677N4620K124j28067j8411P5529J4769p769J01818Q9375J8289j8844
$$ 1278 -40399 14221 16345 -111722 -130133 -54604 -39835 -47604 54214 143589 161878 143034
7643A43034n4429m5572K93k745l1418o2019j2417J1126K3136K3000M5373J1231
$$ 143034 88605 43033 43326 40581 9163 -52856 -65273 -54147 -31011 -8011 37362 48593
7631D8593N801L9218K1364p5167l3730o64k5099j5539p5934j5675J22540M8054
$$ 48593 54394 93612 114976 39809 6079 5415 -19684 -35223 -111157 -126832 -4292 43762
7619D3762k4641k9491j904P0894M605r4541p9586L2450Q5947m2675M1013P4706
$$ 43762 19121 -10370 -12274 58620 63225 -31316 -110902 -78452 7495 -35180 5833 80539
7607H0539m4957K0131Q9964l6506q5278o0110j80494p5512J21898K27732m0832
$$ 80539 35582 55713 145677 109171 23893 -36217 -216711 -292223 -170325 57407 16575
7596A6575p2581K8066J34256O9162O033j31360j08389J7746Q9339K8795r063k6410
$$ 16575 -56006 -27940 106316 175478 181511 50151 -58238 -40492 48847 77642 68579 42169
7584D2169M9881l3774l5217R901P0295J5175m407J07253o5985j60511q421m8610
$$ 42169 92050 58276 23059 32960 103255 118430 114023 221276 155291 -5220 -13641 -62251
7572f2251k1231m9895M419J22373M4799l2178j9244o3546R6459J23155L6382j00236
$$ -62251 -83482 -133377 -128958 -6585 38214 6036 -13208 -76754 19705 142860 179242 79006
7560G9006j00064J31528m9005j59795j2014R0901J48436P7935K6299o2478j1082
$$ 79006 -21058 110470 61465 -98330 -110344 -19443 128993 206928 233227 170749 159667
7549A59667j25743k7689r3765L2142O7819m5920J10413L1784K8985n775j13056
$$ 159667 33924 6235 -87530 -55388 12431 -33489 76924 108708 137693 131918 18862
7538A8862L6479J59948n2868p4913k9231L1353k6564j02688r9312l7101M5547
$$ 18862 55341 215289 162421 87508 58277 89630 63066 -39622 -138934 -176035 -130488
7527a30488L4505O8122L3503k1817N6418j0251M7319m016j5983o9120j6824l2125
$$ -130488 -95983 -27861 5642 -16175 40243 29992 77311 73295 57312 -11808 -28632 -60757
7515f0757n7953n585m8876J0667J25856K6129q5164r2624J3225Q1942m4189M7904
$$ -60757 -118710 -124295 -173171 -162504 -36648 -10519 -95683 -188307 -175082 -93140 -137329 -89425
7503h9425M269O0892Q9550R90p6967N810j0392p3751n036r2356O9156Q0064j9460
$$ -89425 -85156 -24264 65286 66276 -10691 -4881 -15273 -89024 -94060 -186416 -117260 -37196 -56656
7490e6656L9282p217L8565O0351j6721l7638o6466M7634M521l3742K0346l0300
$$ -56656 -17374 -24591 13974 74325 57604 19966 -46500 1134 5655 -28087 -7741 -38041
7478c8041K4927J7498k0719Q0776N4957k4888k3137m0843m4166j3134Q7507O3971
$$ -38041 -13114 4384 -16335 64441 119398 94510 71373 30530 -13636 -26770 60737 124708
7466A24708J4989j8216p1281q812n2850k2934p8298n6227M3062J05151k5172q8510
$$ 124708 139697 121481 50200 41388 -11462 -34396 -112694 -168921 -125859 -20708 -45880 -134390
7454a34390K6825J54635r711m960K7324r4732K9763O0337r8319o1076R9024K8774
$$ -134390 -107565 47070 37359 32399 59723 -35009 -5246 55091 -43228 -104304 -5280 23494
7442B3494m0067L8529j4109K5760O3060l0351j03767q7081m5111O7293L6746n0568
$$ 23494 -16573 21956 7847 33607 96667 66316 -37451 -124532 -169643 -102350 -65604 -116172
7430a16172j9273N9462o1525K4042O8927l2357p2542J7127Q3235J48864o0844
$$ -116172 -135445 -75983 -137508 -113466 -44539 -76896 -149438 -132311 -49076 99788 38944
7419C8944m822l0608j907P5851j15903j5574J20133j4493j3582K9544J498Q82
$$ 38944 34122 3514 1607 77458 -38445 -54019 66114 51621 38039 67583 69081 69963
7407F9963n4640R187M5171j018k9716M5859n6770m5755l5264K2155L9834J4560
$$ 69963 15323 24510 69681 68663 38947 84806 28036 -17719 -52983 -30828 9006 23566
7395B3566k3739j9944k3885j9069q9263j0409j0477l7277O2320Q3332O1835k1556
$$ 23566 -173 -20117 -44002 -63071 -152334 -162743 -173220 -210497 -148177 -64845 -3010 -24566
7383b4566m3761M4175L7911m1177J086Q6937M0052n4563p2255p6437J429o960
$$ -24566 -68327 -24152 13759 -27418 -26332 60605 100657 46094 -26161 -102598 -101169 -108129
7371a08129L1358M0621j036p3057M8418K3889j0327O7256m0759l6985J3511m4936
$$ -108129 -76771 -36150 -37186 -110243 -61825 -37936 -48263 18993 -21766 -58751 -45240 -90176
7359i0176m0311P0205J54155O8097q2923K3991j771k7589J5643k7561n9577k2139
$$ -90176 -130487 -60282 93873 161970 79047 103038 101267 73678 89321 61760 2183 -19956
7347a9956P7608J1313n4252j06955N9091L0689m8713L9205p6301j07134K9724
$$ -19956 57652 68965 14713 -92242 -33151 -2462 -51175 -11970 -88271 -195405 -165681
7336a65681K2120L0873J58261O3521m1285n6022m839m4792j5323k1492Q977M6515
$$ -165681 -143561 -112688 45573 109094 67809 11787 6948 -37844 -53167 -74659 -65682 -19167
7324a9167J23937M1340j8694J165Q5240q9062q9669n191K2145O003q4133j2261
$$ -19167 104770 146110 127416 128581 213821 124759 35090 29899 52044 58047 -26086 -38347
7312c8347P3261Q7074m4632q5818q2009r847M0512k4454K9750p3331N244O9444
$$ -38347 34914 121988 77356 -8462 -90471 -100318 -59806 -84260 -54510 -127841 -122597 -53153
7300e3153J04680P7343o2969r7666Q489O5435N3665j2316M4472p3654m4585l2909
$$ -53153 51527 128870 65901 -31765 -23276 42159 95824 83508 127980 54326 9741 -23168
7288b3168K8493o7173k1380Q9071J3929O0645J0042o898k028o4167k6476L7616
$$ -23168 5325 -61848 -83228 5843 19772 80417 90459 83561 81533 17366 -9110 28506
7276B8506K5948J9530k6630J4982K200j1905k8640k3597K4888j16304l4665N6486
$$ 28506 54454 73984 47354 62336 64536 52631 23991 394 25282 -91022 -125687 -69201
7264f9201Q5052R6952O498k0762o4530n7046K6331j27530N048N4383N6244q0742
$$ -69201 15851 112803 119301 98539 34009 -23037 3294 -124236 -119188 -64805 -8561 -89303
7252h9303m2735m17J04858L9334k722K5203K0576K2277q3601n2542O306j5704
$$ -89303 -132038 -132455 -27597 11737 9015 34218 54794 77071 -6530 -59072 -52766 -68470
7240f8470J8496P0083Q0925l4436N450l4285N8761l3025m9181L0737P3641k9045
$$ -68470 -49974 20109 101034 66598 72048 37763 96524 63499 14318 45055 118696 89651
7228H9651m2055l3544k3739Q9148n7216o8259M6960N7955O7633k1177m5137J5550
$$ 89651 47596 14052 -9687 79461 22245 -46014 946 58901 126534 105357 60220 75770
7216G5770r2856M9736J0352k2160n1758L2582K3002L5330O3609p894M9066O661
$$ 75770 -17086 32650 43002 20842 -30916 1666 24668 59998 123607 115713 164779 171440
7204A71440j29r9913l6998L5897m9071k7645O1906o223l3046k917M7878k5117
$$ 171440 171311 71398 34400 70297 21226 -6419 55487 49264 16218 13301 61179 36062
7192C6062K4688k1020k5009j4363j9232j15521p6866K5260K8399O0936k2564R066
$$ 36062 60750 39730 14721 358 -18874 -134395 -211261 -186001 -157602 -96666 -119230 -110164
7180a10164J5047k7826R6150M3832n2096k1105l8732r8969o4272K3077P1054M0850
$$ -110164 -95117 -122943 -26793 17039 -35057 -56162 -94894 -193863 -258135 -235058 -164004 -123154
7168a23154O6028L5421k010K9872j0993j6479p9951k4611N7720l6149q2953j9288
$$ -123154 -57126 -21705 -23715 6157 -4836 -21315 -101266 -125877 -68157 -104306 -187259 -206547
7156b06547M9553J842J0512q310K8997P6225K3831P2462K960n9116o6472q661
$$ -206547 -156994 -155152 -144640 -152950 -123953 -47728 -23897 48565 51525 -7591 -74063 -82724
7144h2724R2479R3898p2614o7135K5559p195J425l7796N5384K0637J2337O4744
$$ -82724 9755 103653 31039 -36096 -10537 -17732 -16307 -54103 1281 21918 34255 98999
7132I8999j2090K9115K5022q3525n9779j4036n8574O520L9099r9631J00162M8730
$$ 98999 86909 116024 141046 57521 -2258 -16294 -74868 -68348 -29249 -128880 -28718 20012
7120B0012o8204p142k6411j63599J8773P3263Q6589R9738k3639n0110j6363n5184
$$ 20012 -48192 -55334 -81745 -245344 -226571 -153308 -66719 33019 9380 -40730 -57093 -112277
7108a12277J11220P8105m8130j15487K8609M3916L7608n3802K2165j777k4835
$$ -112277 -1057 77048 28918 -86569 -57960 -14044 23564 -30238 -8073 -9850 -34685
7097c4685n9970j5696L320O191n576L1640L4571k9598N3067N5957q2207q7460
$$ -34685 -94655 -110351 -107031 -100840 -106416 -74776 -40205 -69803 -16736 39221 -42986 -130446
7085a30446m8546k7876j7265j4289P3032M3220P7046J8474k9169K7688Q4747J57917
$$ -130446 -178992 -206868 -224133 -238422 -165390 -122170 -45124 -26650 -55819 -28131 56616 214533
7073B14533M5488p7215r5168p9118J6297O1892j4551k6840p305j3538L1287l5634
$$ 214533 260021 182806 87638 8520 24817 86709 72158 45318 38013 24475 55762 20128
7061B0128q8010m3081J3062N5878N3234K0967j24625P8L006J3072P8513L0737
$$ 20128 -67882 -110963 -97901 -42023 11211 32178 -92447 -92369 -89363 -76291 2222 32959
7049C2959p427n0424R7q0770J8361K9671m7211M1579L7298R087K3092O1256j04701
$$ 32959 25532 -24892 -24795 -105565 -87204 -57533 -104744 -63165 -25867 -16780 6312 67568 -37133
7036c7133r3391J02540J15494k1739r1206j00580K3404L0180j127R137j1296m7842
$$ -37133 -130524 -27984 87510 65771 -25435 -126015 -102611 -72431 -73558 -64421 -75717 -123559
7024a23559l5560M0079J05241r0477R008N5494O0246N049M4885l6126P583o1898
$$ -123559 -159119 -119040 -13799 -104276 -95268 -39774 20472 25521 70406 34280 41863 -20035
7012b0035q9694J5068K040J7113j8021m687R7947j1689k0289o5881J1521M2056
$$ -20035 -109729 -94661 -92621 -75508 -93529 -98216 -269 -11958 -32247 -98128 -86607 -44551
7000d4551l162M3389o1349L3686L8924k4767q8657L1623k5048L0422k3079j8226
$$ -44551 -47713 -4324 -65673 -31987 6937 -17830 -106487 -74864 -99912 -69490 -92569 -110795
6988a10795R8853j9825M2136j2944o1343l643l8437K0492Q4382Q8908r645j15533
$$ -110795 -11942 -31767 10369 -2575 -63918 -67561 -105998 -85506 -1124 87784 78139 -37394
6976c7394o321j6997J239j25415M5810O4470K2800K1613J6450j39083r551J06769
$$ -37394 -43715 -60712 -59473 -184888 -139078 -74608 -51808 -30195 -13745 -152828 -162379 -55610
6964e5610M8973k3098m7777k5194o7689p2611q8759O2637J16902J40205K25l6464
$$ -55610 -6637 -29735 -77512 -102706 -170395 -243006 -331765 -269128 -152226 -12021 -11796 -48260
6952d8260k1542m2221R527j6167M283o8255M3713j09721n4566M0629J02138Q2245
$$ -48260 -69802 -112023 -102496 -118663 -114380 -182635 -138922 -248643 -303209 -262580 -160442 -78197
6940g8197N8384k2827j9562M2321K8376j7123L0527l5965m4629R725O9666K059
$$ -78197 -19813 -42640 -62202 -19881 8495 -8628 21899 -14066 -58695 -48970 20696 22755
6928B2755r9071L6432O6807M2920n2636L8766P7334j3745q1619n8708N1172J6416
$$ 22755 -76316 -39884 26923 69843 17207 55973 133307 119562 37943 -20765 30407 46823
6916D6823L672P951n001p4091J6122L7365L7303m2840j07015p2720n0061k8443
$$ 46823 50495 58446 53445 -20646 -4524 32841 70144 27304 -79711 -152431 -202492 -230935
6904b30935J10134R9941J32523n2242j14419J6225N2259M1088k7590L5732N158
$$ -230935 -120801 -20860 111663 59421 -54998 -38773 13486 54574 26984 62716 67874
6893F7874J64m3953k8253j929k7824p1402M2051J09515R0429j8911r8604P59J766
$$ 67874 68038 24085 -4168 -6097 -33921 -105323 -63272 46243 136672 117761 19157 19916 21682
6880B1682J6210o210K9466K3202M2798J1522r2894p6764r2115Q1395R9423o0890
$$ 21682 37892 31682 61148 84350 127148 138670 45776 -30988 -123103 -41708 57715 -3175
6868c175J7214l863q0720j831k2210o1074M0279N0368N885j0363p8692N646L1825
$$ -3175 14039 10176 -70544 -72375 -94585 -155659 -115380 -65012 -59127 -69490 -148182 -142536 -110711
6855a10711J35288P047o4881K3295M9818l3696K7463L54j11266k6745M2056Q1402
$$ -110711 24577 31624 -33257 -9962 39856 6160 33623 33977 -77289 -104034 -61978 19424
6843A9424L8161M6125k9713o9315M2512n1299O3763p4043j21436J027n5203q4043
$$ 19424 57585 103710 73997 4682 47194 -4105 59658 -14385 -135821 -134794 -189997 -274040
6831b74040Q8795R0963K5135O9087M4010r872q6284l8593k3025k8474M5569J01877
$$ -274040 -185245 -94282 -69147 -60 43950 34078 -52206 -90799 -113824 -142298 -96729 5148
6819E148l9591j7318K2728m6243k847R8404k8882j05558q2041Q0906J23772j985
$$ 5148 -34443 -51761 -29033 -75276 -78123 20281 -8601 -114159 -196200 -115294 8478 6493
6807F493j26150J159O5262J09150L0614q1624K3468O1327J8373L3296k1528q7975
$$ 6493 -119657 -118498 -53236 55914 86528 4904 28372 89699 108072 141368 119840 31865
6795C1865M0194J34752l3048r5577q9857K179n914k4072K7902L6430L5490j8343
$$ 31865 72059 206811 173763 78186 -11671 -9492 -15406 -39478 -11576 24854 60344 42001
6783D2001O8113L6085o5515M7745L3585q8863m9690n7437O4568k1535l2505l1704
$$ 42001 110114 146199 80684 128429 162014 73151 23461 -33976 30592 9057 -23448 -55152
6771e5152m6326L8698j5047k895J851L9198l2042j31787J4138P7390L0577L9121
$$ -55152 -101478 -62780 -77827 -80722 -78871 -39673 -71715 -203502 -189364 -111974 -81397 -42276
6759d2276P6254R2175j44459j9062K2118m4777l4898p1301O3133J29681j09737
$$ -42276 33978 126153 -18306 -37368 -15250 -60027 -94925 -166226 -103093 26588 -83149
6748h3149M9511L5061j3932O2669r2411j05912l8987K6340J0435q2823J8922q612
$$ -83149 -33638 1423 -12509 50160 -42251 -148163 -187150 -160810 -150375 -233198 -214276 -222888
6736b22888m3469R7559J46183P1814J23755l7405j74165r4133O8852J7242L9292
$$ -222888 -266357 -168798 -22615 49199 172954 135549 -38616 -132749 -63897 -46655 -7363
6725g363m765o5053n435L5813J338k1555n3308P9984M4223j9981J1409j2875n3971
$$ -7363 -12128 -77181 -82616 -46803 -45465 -67020 -120328 -40344 3879 -16102 -4693 -17568 -71539
6712g1539k6048l6221p9743N28N0517j3910M288J851m4520M8791O2507R9814o1227
$$ -71539 -97587 -133808 -213551 -213023 -162506 -176416 -172128 -170277 -214797 -166006 -103499 -3685 -64912
6699f4912O5165R9642N6162R528Q411K970k5543k9815L2490j7745M0789l6627
$$ -64912 253 99895 156057 165585 173996 176966 151423 121608 154098 136353 177142 140515
6687A40515L043o1860J3986j3030n7128k3786R984M3686O5275n6377r2485m4743
$$ 140515 143558 81698 95684 82654 25526 1740 11724 55410 120685 64308 -28177 -72920
6675g2920j30215Q9702Q6261R3452q7899o1549J209j8303k8470q7319l9337M8843
$$ -72920 -203135 -113433 -27172 66280 -21619 -83168 -81959 -100262 -128732 -216051 -255388 -206545
6663b06545J6140N8056K791J17523K8719L4524R0332p452j08272p8504Q0281P6617
$$ -206545 -190405 -132349 -129558 -12035 16684 51208 141540 134088 25816 -52688 27593 104210
6651A04210R494j7699J9768o771k3216l9079m1072r9769r3156K9967P8401M5209
$$ 104210 113704 96005 115773 109002 85786 46707 5635 -94134 -187290 -157323 -78922 -33713
6639c3713j0295L4716o2135k1965J21417K1004O396L3802M1958k0039k7639n2459
$$ -33713 -44008 -9292 -71427 -93392 28025 49029 55425 89227 131185 111146 83507 31048
6627C1048q0009n4355o8651P8492N827J2775j8652j1347r3895q2367K8510N2408
$$ 31048 -48961 -103316 -171967 -93475 -87648 -74873 -93525 -104872 -198767 -281134 -252624 -200216
6615b00216J9572K6139N3434O3097N0500l213j9256K1108n2056j16867j8559M9505
$$ -200216 -180644 -154505 -101071 -37974 12526 9313 -9943 11165 -40891 -157758 -176317 -126812
6603a26812l961o6319R4574K7403k0642k9013L4154Q0990L0262J07578q9827j00548
$$ -126812 -130773 -197092 -102518 -75115 -95757 -124770 -90616 -9626 20636 128214 38387 -62161
6591f2161l7927M9420k9228p3661N2582j9972o4032r836O489K0357J90997O7676
$$ -62161 -100088 -50668 -79896 -153557 -100975 -120947 -184979 -194815 -188326 -167969 23028 90704
6579I0704P6672n4480k7155m3965j06396j5891q0964m2667O8040L9375q3926P7956
$$ 90704 167376 112896 85741 41776 -64620 -80511 -161475 -204142 -136102 -96727 -180653 -102697
6567a02697J40668J07856j12004k9334j2248k5849L7412J8993Q962k7394k83k0535
$$ -102697 37971 145827 33823 4489 -7759 -33608 3804 22797 31759 4365 4082 -16453
6555a6453N9450K1777L3172n9653r4745L0969R472Q3014o1364r217K6808j29647
$$ -16453 42997 64774 97946 38293 -56452 -25483 -16011 67003 5639 -3578 23230 -106417
6543a06417l1013N5969Q722M3610q0999P3458J1589M3328r0295j26311j7044J04722
$$ -106417 -137430 -81461 -72739 -29129 -110128 -36670 -25081 18247 -72048 -198359 -215403 -110681
6531a10681J63556Q7274l8563n2912j02009r38K1430L1219J12601K4819j27239
$$ -110681 52875 140149 101586 48674 -53335 -54273 -32843 -1624 110977 135796 8557
6520H557p9945o9044l1791Q2327J07863R7782K512m8948r9922o8511P1176N3256
$$ 8557 -71388 -140432 -172223 -89896 17967 115749 118261 69313 -30609 -99120 -27944 25312
6508B5312K0772o8520p1745L3864N8397p60L1673P8990j8300L5009p9087j01781
$$ 25312 46084 -22436 -94181 -60317 -1920 -2680 28993 107983 89683 124692 45605 -56176
6496e6176m5366j00000l3111J29541M0882J5835p0328n7565Q935J4573M7090L5219
$$ -56176 -101542 -201542 -234653 -105112 -64230 -48395 -118723 -176288 -167353 -152780 -105690 -70471
6484g0471K8114Q2155L3842P7771l8738m0268N4179n504K5026k3493L0732n4751
$$ -70471 -42357 39798 73640 151411 112673 72405 126584 121080 146106 122613 153345 98594
6472I8594M626n1200j06109j5454M8400O5162j6965L2973P426P1892M0855o5132
$$ 98594 103220 52020 -54089 -69543 -21143 44019 27054 60027 67453 139345 180200 115068
6460A15068j45682L1907n2288k3895L4114o852j720p1289j1653L3719L0866J1246
$$ 115068 -30614 1293 -50995 -74890 -40776 -47628 -49348 -120637 -132290 -98571 -67705 -56459
6448e6459M0713k0274k5642L4184N4551M5216j3484q7790j31305R3108l333j4012
$$ -56459 -15746 -36020 -61662 -27478 27073 72289 58805 -28985 -160290 -67182 -70515 -84527
6436h4527L6155P5821J71970l1004j16433m5769P4118j6673j23062m7673q3132
$$ -84527 -48372 27449 199419 168415 51982 6213 80331 63658 -59404 -107077 -190209
6425a90209K7767j418q406o5748o502P9814L5166J36411l0627j20785P2878M5113
$$ -190209 -162442 -163860 -172266 -238014 -244516 -164702 -129536 6875 -23752 -144537 -71659 -26546
6413b6546M4685J453Q9949J71696O492j74346r8547j964j0401M6863k9132L336
$$ -26546 18139 19592 109541 281237 287729 113383 14836 12872 2471 49334 20202 23538
6401B3538L8398K7358k0960L7263k6492k7363N5956R5332o2648j23633j17743
$$ 23538 61936 89294 68334 105597 79105 51742 107698 203030 140382 16749 -100994
6390a00994P6116J38945j4245q3018O097j2232K6987l003l9669J5574P1193m3216
$$ -100994 -24878 114067 99822 16804 22901 10669 37656 34653 -5016 10558 81751 38535
6378C8535j2138j5620p4686L6791K5700k2484Q8819M3662k5850n5015j71234l5775
$$ 38535 26397 10777 -63909 -27118 -1418 -23902 64917 108579 82729 27714 -143520 -179295
6366a79295Q6775m015k1156O9617K8581P6597m6609o8684r770J6490R2323J047
$$ -179295 -92520 -96535 -117691 -48074 -19493 57104 10495 -58189 -67959 -51469 40854 41901
6354D1901L8835L260j7904r9388J8721m193o286n0127J2287O9891J11628N0947
$$ 41901 80736 83996 66092 -33296 -14575 -18768 -25054 -75181 -62894 6997 118625 169572
$$ [...]
##END NTUPLES=NMR SPECTRUM
##END=
