##TITLE=Analysis number 324993
Compound Code mo 08007
Book Reference 503/150/3
Project Code adrs
Chemist Name victoriam
##JCAMPDX= 6.0         $$ Bruker NMR JCAMP-DX V2.0
##DATA TYPE= NMR SPECTRUM
##DATA CLASS= NTUPLES
##ORIGIN= Bruker BioSpin GmbH
##OWNER= nmr
$$ XWIN-NMR		Version 3.5
$$ Wed Dec  6 10:58:48 2006 GMT Standard Time (UT+0h)  MAYBRIDGE\nmr@NMR_250MHZ
##.OBSERVE FREQUENCY= 250.131544655141
##.OBSERVE NUCLEUS= ^1H
##.ACQUISITION MODE= SIMULTANEOUS (DQD)
##.ACQUISITION SCHEME= undefined
##.AVERAGES= 16
##.DIGITISER RES= 18
##SPECTROMETER/DATA SYSTEM= dpx250
##.PULSE SEQUENCE= zg30
##.SOLVENT NAME= DMSO
##.SHIFT REFERENCE= (INTERNAL, DMSO, 0, 16.522)
##AUDIT TRAIL= $$ (NUMBER, WHEN, WHO, WHERE, WHAT)
$$ ##TITLE= Audit trail, XWIN-NMR		Version 3.5
$$ ##JCAMPDX= 5.01
$$ ##ORIGIN= Bruker BioSpin GmbH
$$ ##OWNER= nmr
$$ C:\u/data/dgb/nmr/ADRS/400/pdata/1/auditp.txt
$$ ##AUDIT TRAIL=  $$ (NUMBER, WHEN, WHO, WHERE, WHAT)
(   1,<2006-12-06 10:58:29.39 +000>,<MAYBRIDGE\nmr>,<NMR_250MHZ>,
      <created by zg, POWCHK disabled, PULCHK disabled
       configuration hash MD5:
       49 4B E0 1D 92 C2 6B 37 9F E6 65 BC 52 41 86 1D
       data hash MD5: 64K
       42 12 10 DB 29 04 48 B0 44 3B F2 C6 15 52 D5 54>)
(   2,<2006-12-06 10:58:40.03 +000>,<MAYBRIDGE\nmr>,<NMR_250MHZ>,
      <Start of raw data processing
       ef LB = 0.3 FT_mod = 6 PKNL = 1 SI = 32K 
       data hash MD5: 32K
       BD 86 07 C0 B2 D7 F0 71 D5 22 CC B2 4B 94 08 9D>)
(   3,<2006-12-06 10:58:41.59 +000>,<MAYBRIDGE\nmr>,<NMR_250MHZ>,
      <apk 
       data hash MD5: 32K
       8A 21 62 7D 41 A2 06 73 A4 A8 71 EC 7B 2A F5 08>)
(   4,<2006-12-06 10:58:42.34 +000>,<MAYBRIDGE\nmr>,<NMR_250MHZ>,
      <abs ABSG = 5 
       data hash MD5: 32K
       B9 36 C2 68 41 55 B0 24 06 7A B9 2F 0B 87 69 56>)
$$ ##END=
$$ 
$$ hash MD5
$$ 55 6E 9B 25 50 6F 9E D0 3D 26 B8 7B 89 13 51 9C
##$RELAX= 
##$RELAX= 
##$RELAX= 
##$RELAX= 
##$RELAX= 
##$RELAX= 
##$RELAX= 
$$ Bruker specific parameters
$$ --------------------------
##$DU= <C:\u>
##$EXPNO= 400
##$NAME= <ADRS>
##$PROCNO= 1
##$TYPE= <nmr>
##$USER= <dgb>
##$AMP= (0..31)
100 100 100 100 100 100 100 100 100 100 100 100 100 100 100 100 100 100 
100 100 100 100 100 100 100 100 100 100 100 100 100 100 
##$AQSEQ= 0
##$AQ_mod= 3
##$AUNM= <au_zg>
##$AUTOPOS= <39 >
##$BF1= 250.13
##$BF2= 250.13
##$BF3= 250.13
##$BF4= 250.13
##$BF5= 500.13
##$BF6= 500.13
##$BF7= 500.13
##$BF8= 500.13
##$BYTORDA= 1
##$CFDGTYP= 0
##$CFRGTYP= 5
##$CHEMSTR= <none>
##$CNST= (0..31)
1 1 145 1 1 1 1 1 1 1 1 1 1 1 1 1 1 1 1 1 1 1 1 1 1 1 1 1 1 1 1 1 
##$CPDPRG= <>
##$CPDPRG1= <>
##$CPDPRG2= <>
##$CPDPRG3= <>
##$CPDPRG4= <mlev>
##$CPDPRG5= <mlev>
##$CPDPRG6= <mlev>
##$CPDPRG7= <mlev>
##$CPDPRG8= <mlev>
##$CPDPRGB= <>
##$CPDPRGT= <>
##$D= (0..31)
0 1 0 0 0 0 0 0 0 0.06 0 0 0 0 0 0 0.0002 0 0 0 0 0 0 0 0 0 0 0 0 0 0 
0 
##$DATE= 1165402708
##$DBL= (0..7)
120 120 120 120 120 120 120 120 
##$DBP= (0..7)
150 150 150 150 150 150 150 150 
##$DBP07= 0
##$DBPNAM0= <>
##$DBPNAM1= <>
$$ [...]
##$SUBNAM7= <"">
##$SUBNAM8= <"">
##$SUBNAM9= <"">
##$SW= 20.6930455092707
##$SWIBOX= (0..15)
0 0 3 0 0 0 0 0 0 0 0 0 0 0 0 0 
##$SW_h= 5175.983436853
##$TD= 65536
##$TD0= 1
##$TE= 295.16
##$TE2= 300
##$TE3= 300
##$TEG= 300
##$TL= (0..7)
0 120 120 120 120 120 120 120 
##$TP= (0..7)
150 150 150 150 150 150 150 150 
##$TP07= 0
##$TPNAME0= <>
##$TPNAME1= <>
##$TPNAME2= <>
##$TPNAME3= <>
##$TPNAME4= <>
##$TPNAME5= <>
##$TPNAME6= <>
##$TPNAME7= <>
##$TPOAL= (0..7)
0.5 0.5 0.5 0.5 0.5 0.5 0.5 0.5 
##$TPOFFS= (0..7)
0 0 0 0 0 0 0 0 
##$TUNHIN= 0
##$TUNHOUT= 0
##$TUNXOUT= 0
##$USERA1= <user>
##$USERA2= <user>
##$USERA3= <user>
##$USERA4= <user>
##$USERA5= <user>
##$V9= 5
##$VALIST= <valist>
##$VCLIST= <CCCCCCCCCCCCCCC>
##$VD= 0
##$VDLIST= <DDDDDDDDDDDDDDD>
##$VPLIST= <PPPPPPPPPPPPPPP>
##$VTLIST= <TTTTTTTTTTTTTTT>
##$WBST= 1024
##$WBSW= 4
##$XGAIN= (0..3)
0 0 0 0 
##$XL= 0
##$YL= 0
##$YMAX_a= 221413
##$YMIN_a= -201984
##$ZGOPTNS= <>
##$ZL1= 120
##$ZL2= 120
##$ZL3= 120
##$ZL4= 120
##$ABSF1= 16.522
##$ABSF2= -4.171173
##$ABSG= 5
##$ABSL= 3
##$ALPHA= 0
##$AQORDER= 0
##$ASSFAC= 0
##$ASSFACI= 0
##$ASSFACX= 0
##$ASSWID= 0
##$AUNMP= <proc_1d>
##$AZFE= 0.1
##$AZFW= 0.1
##$BCFW= 0
##$BC_mod= 0
##$BYTORDP= 0
##$COROFFS= 0
##$CY= 12.5
##$DATMOD= 1
##$DC= 0
##$DFILT= <>
##$DTYPP= 0
##$F1P= 14.0000005364418
##$F2P= -0.99999901652339
##$FCOR= 0.5
##$FTSIZE= 32768
##$FT_mod= 6
##$GAMMA= 0
##$GB= 0
##$INTBC= 1
##$INTSCL= 1
##$ISEN= 128
##$LB= 0.3
##$LEV0= 0
##$LPBIN= 0
##$MAXI= 10000
##$MC2= 0
##$MEAN= 0
##$ME_mod= 0
##$MI= 0
##$NCOEF= 0
##$NC_proc= -4
##$NLEV= 6
##$NOISF1= 0
##$NOISF2= 0
##$NSP= 0
##$NTH_PI= 0
##$NZP= 0
##$OFFSET= 16.522
##$PC= 1
##$PHC0= 219.1602
##$PHC1= 5.278054
##$PH_mod= 1
##$PKNL= yes
##$PPARMOD= 0
##$PSCAL= 4
##$PSIGN= 0
##$REVERSE= no
##$SF= 250.13
##$SI= 32768
##$SIGF1= 0
##$SIGF2= 0
##$SINO= 400
##$SIOLD= 32768
##$SREGLST= <1H.DMSO>
##$SSB= 0
##$STSI= 32768
##$STSR= 0
##$SW_p= 5175.98343685301
##$SYMM= 0
##$S_DEV= 0
##$TDeff= 65536
##$TDoff= 0
##$TI= <Analysis number 999999
Compound Code 99
Book Reference 9
Project Code 9>
##$TILT= no
##$TM1= 0
##$TM2= 0
##$TOPLEV= 0
##$USERP1= <user>
##$USERP2= <user>
##$USERP3= <user>
##$USERP4= <user>
##$USERP5= <user>
##$WDW= 1
##$XDIM= 32768
##$YMAX_p= 572070737
##$YMIN_p= -383399
$$ End of Bruker specific parameters
$$ ---------------------------------
##NTUPLES= NMR SPECTRUM
##VAR_NAME=  FREQUENCY,     SPECTRUM/REAL,   SPECTRUM/IMAG
##SYMBOL=    X,             R,               I
##VAR_TYPE=  INDEPENDENT,   DEPENDENT,       DEPENDENT
##VAR_FORM=  AFFN,          ASDF,            ASDF
##VAR_DIM=   32768,         32768,           32768
##UNITS=     HZ,            ARBITRARY UNITS, ARBITRARY UNITS
##FACTOR=    0.157963299565203, 1,           1
##FIRST=     4132.6476996994, 0,             0
##LAST=      -1043.33573715361, 0,           0
##MIN=       -1043.33573715361, -383399,     0
##MAX=       4132.6476996994, 572070737,     0
$$ Real data points
##PAGE= N=1
##DATA TABLE= (X++(R..R)), XYDATA
$$ [...]
##PAGE= N=2
##DATA TABLE= (X++(I..I)), XYDATA
$$ plain form
16937 -199783 -161998 -229023 -279589 -233866 -239546 -304132 -364038 -321147 -308248 -266490 -258391 -215060
16925 -215060 -177919 -170933 -187613 -194657 -213322 -173130 -217431 -253548 -229172 -164849 -116115 -186394
16913 -186394 -245906 -278418 -301151 -257598 -256816 -329211 -284145 -249420 -223585 -196176 -237196 -393758
16901 -393758 -422073 -364755 -338185 -223418 -165474 -141403 -99021 -126565 -152728 -174851 -212941
16890 -212941 -231091 -264987 -254683 -231562 -285168 -303438 -215735 -157147 -181983 -259569 -239597
16879 -239597 -99866 -107359 -123476 -111505 -83063 -134019 -242121 -311900 -293577 -352921 -334266
16868 -334266 -291527 -221497 -166210 -268836 -250023 -280924 -229626 -279551 -293624 -365203 -390439
16857 -390439 -313707 -280118 -339226 -330719 -285051 -225943 -156308 -175550 -266060 -316179 -349343 -314875
$$ packed form
16937a99783L7785o7025n0566M5723n680o4586n9906M2891J2899M1758Q099M3331
16925b15060L7141O986j6680p044j8665M0192m4301l6117K4376O4323M8734p0279
16913a86394n9512l2512k2733M3553P82p2395M5066L4725K5835K7409m1020j56562
16901c93758k8315N7318K6570J14767N7944K4071M2382k7544k6163k2123l8090
16890b12941j8150l3896J0304K3121n3606j8270Q7703N8588k4836p7586J9972
16879b39597J39731p493j6117J1971K8442n0956j08102o9779J8323n9344J8655
16868c34266M2739P0030N5287j02626J8813l0901N1298m9925j4073p1579k5236
16857c90439P6732L3589n9108Q507M5668N9108O9635j9242r0510n0119l3164L4468
$$ plain form
16845 -314875 -278782 -266681 -214551 -234384 -238245 -151632 -158537 -235166 -251093 -203581 -148240 -130484
16833 -130484 -200943 -110968 -48532 -30842 -66953 -95555 -140424 -204784 -242238 -259456 -249636 -208195
16821 -208195 -107279 -165147 -251394 -273369 -233046 -221955 -167318 -196027 -238534 -216548 -197952
16810 -197952 -121238 -69154 3066 33288 -35066 -23514 -44002 -40805 -179224 -283621 -232775
16799 -232775 -191294 -194274 -173378 -135078 -92968 -132525 -127445 -110988 -113019 -176893 -209314 -77882
16787 -77882 -44988 -53978 -58019 -72409 -55593 -62878 -120326 -264790 -354915 -287309 -267282 -214621
16775 -214621 -149241 -119305 -187442 -165390 -64206 12629 -1825 -34308 -121405 -167660 -81134
16764 -81134 -1735 -87652 -207992 -211812 -181178 -124368 -62364 -29974 -35933 -189399 -161815 -61622
$$ packed form
16845c14875L6093J2101N2130j9833l861Q6613o905p6629j5927M7512N5341J7756
16833a30484p0459Q9975O2436J7690l6111k8602m4869o4360l7454j7218R820M1441
16821b08195J00916n7868q6247k1975M0323J1091N4637k8709m2507K1986J8596
16810a97952P6714N2084P2220L0222o8354J1552k0488L197j38419j04397N0846
16799b32775M1481k980K0896L8300M2110l9557N080J6457k031o3874l2421J31432
16787g7882L2894q990m041j4390J6816p285n7448j44464r0125O7606K0027N2661
16775b14621O5380K9936o8137K2052J01184P6835j4454l2483q7097m6255Q6526
16764h1134P9399q5917j20340l820L0634N6810O2004L2390n959j53466K7584J00193
$$ plain form
16752 -61622 -78172 -112323 -152410 -247981 -208909 -223016 -211342 -107628 -140455 -160965 -131888
16741 -131888 -57979 -52795 -64489 -29385 -67342 -75087 -30435 -42159 -44468 -8817 -16256 -51720
16729 -51720 -54514 -34758 -35246 -62584 -128423 -85136 -18006 -35290 -65654 -116778 -130728 -144238
16717 -144238 -157614 -125779 -115988 -36022 -73482 -105731 -84640 -35498 -100798 -126425 -104142 -55626
16705 -55626 -67232 -41533 -14700 -82433 -142043 -153889 -161185 -97537 -154356 -180737 -105320 -87708
16693 -87708 -57919 -20463 -166506 -176796 -144264 -67307 -145151 -267734 -254973 -219394 -179036
16682 -179036 -100006 -55025 -30910 -37776 -80191 -67999 -40451 27206 38073 -5712 -63205 -64017
16670 -64017 -41180 -56377 -54423 -114316 -77472 51358 16545 6415 39432 -47267 -51216 -47221
$$ packed form
16752f1622j6550l4151m0087r5571L9072j4107J1674J03714l2827k0510K9077
16741a31888P3909N184j1694L5104l7957p745M4652j1724k309L5651p439l5464
16729e1720k794J9756m88k7338o5839M3287O7130j7284l0364n1124j3950j3510
16717a44238j3376L1835R791P9966l7460l2249K1091M9142o5300k5627K2283M8516
16705e5626j1606K5699K6833o7733n9610j1846p296O3648n6819k6381P5417J7612
16693h7708K9789L7456j46043j0290L2532P6957p7844j22583J2761L5579M0358
16682a79036P9030M4981K4115o866m2415J2192K7548O7657J0867m3785n7493q12
16670f4017K2837j5197J954n9893L6844J28830l4813j0130L3017q6699l949L995
$$ plain form
16658 -47221 -3640 37503 22456 -77708 -162742 -125255 -174624 -162127 -163504 -163913 -151823 -114147
16646 -114147 -100187 -48517 -23577 -39339 -30992 4752 -89993 -104420 -83388 -75407 -27307 -94888
16634 -94888 -198234 -151388 36643 62819 70289 87675 132810 129618 34020 -93049 -130133
16623 -130133 -122190 -202851 -224477 -187475 -90804 -10101 -14539 -38266 -63388 -156734 -175741 -144980
16611 -144980 -100488 -21070 -16279 -40850 5623 40902 64379 15194 -26063 -4012 48453 -787
16599 -787 -70427 -45225 -78914 -84164 -134522 -109257 -47237 -9819 -8590 39464 -38877 -81314
16587 -81314 -35245 -149882 -132802 -86813 -124422 -123322 -67013 -37244 -99854 -101440 93766 91414
16575 91414 14022 67957 90863 64431 -29905 -8525 51507 110033 137776 86842 -13312
$$ packed form
16658d7221M3581M1143j5047j00164q5034L7487m9369J2497j377m09J2090L7676
16646a14147J3960N1670K4940j5762Q347L5744r4745j4427K1032P981M8100o7581
16634i4888j03346M6846J88031K6176P470J7386M5135l192r5598j27069l7084
16623a30133P943q0661k1626L7002R6671Q0703m438k3727k5122r3346j9007L0761
16611a44980M4492P9418M791k4571M6473L5279K3477m9185m1257K2051N2465m9240
16599g87o9640K5202l3689n250n0358K5265O2020L7418J229M8054p8341m2437
16587h1314M6069j14637J7080M5989l7609J100N6309K9769o2610j586J95206k352
16575I1414p7392N3935K2906k6432r4336K1380O0032N8526K7743n0934j00154
$$ plain form
16564 -13312 -31790 -64758 -74782 -98346 -16692 -45418 -69691 34706 107288 104505 107182 78641
16552 78641 -8577 -98007 -93283 -4031 -37924 -40352 -39761 -106046 -91329 -108923 -68200 -48527
16540 -48527 3130 79625 79409 59134 -23401 -59579 -44793 -79481 -148665 -66856 44025 112655
16528 112655 68829 -31403 -5560 42539 -32606 -12857 62168 90041 50378 69849 60991
16517 60991 11318 -29444 -32234 7575 -15568 -61118 -65226 -3463 62802 76857 86219 117253
16505 117253 83938 102294 121861 87975 92470 113285 181092 98002 39767 75359 114177 119811
16493 119811 147210 198489 220436 181579 123180 26246 78834 58795 21880 27636 -1107 -4113
16481 -4113 18552 73518 62402 67430 13327 -22216 31254 -14684 6400 -35607 -23208 34007
$$ packed form
16564a3312j8478l2968j0024k3564Q1654k8726k4273J04397P2582k783K677k8541
16552G8641q7218q9430M724Q9252l3893k428N91o6285J4717j7594M0723J9673
16540d8527N1657P6495k16k0275q2535l6178J4786l4688o9184Q1809J10881O8630
16528A12655m3826j00232K5843M8099p5145J9749P5025K7873l9663J9471q858
16517F0991m9673m0762k790L9809k3143m5550m108O1763O6265J4055R362L1034
16505A17253l3315J8356J9567l3886M495K0815O7807q3090n8235L5592L8818N634
16493A19811K7399N1279K1947l8857n8399r6934N2588k0039l6915N756k8743l006
16481d113K2665N4966j1116N028n4103l5543N3470m5938K1084m2007J2399N7215
$$ plain form
16469 34007 84211 161804 139747 115324 80182 -50263 -181204 -134497 -78974 -21235 58825
16458 58825 154228 184947 178444 116277 77692 45510 -38571 -16433 121337 82018 9515 15119
16446 15119 -32132 -93208 -123729 -106816 -80248 -22642 46209 34648 18446 38826 41644 48368
16434 48368 32638 65362 99165 10324 -52545 -86285 -77903 -107165 -75788 -6845 75625 75759
16422 75759 29839 20802 97190 138867 100115 58930 62922 24675 51257 106639 176459 192138
16410 192138 179102 203105 144420 136788 74101 49331 37049 74903 105130 81491 20242 -50995
16398 -50995 -29251 49981 54720 106451 136398 173058 184269 121789 52569 6936 -12040 9714
16386 9714 31896 38189 77163 72263 24712 -27351 43692 63536 120539 173471 221199 182546
$$ packed form
16469C4007N0204P7593k2057k4423l5142j30445j30941M6707N5523N7739Q0060
16458E8825R5403L0719o503o2167l8585l2182q4081K2138J37770l9319p2503N604
16446A5119m7251o1076l0521J6913K6568N7606O8851j1561j6202K0380K818O724
16434D8368j5730L2724L3803q8841o2869l3740Q382k9262L1377O8943Q2470J34
16422G5759m5920r037P6388M1677l8752m1185L992l8247K6582N5382O9820J5679
16410A92138j3036K4003n8685p632o2687k4770j2282L7854L0227k3639o1249p1237
16398e0995K1744P9232M739N1731K9947L6660J1211o2480o9220m5633j8976K1754
16386I714K2182O293L8974m900m7551n2063P1043J9844N7003N2932M7728l8653
$$ plain form
16374 182546 123103 84188 67036 38614 74990 49019 -9523 -47545 26896 57112 48962 58876
16362 58876 23333 28473 81710 70040 -12420 36891 99440 77283 61684 30180 -15056 -448
16350 -448 58147 4274 7812 -8201 -2394 -43560 -35087 -55899 -38033 -9281 -48995 -23353 5217
16337 5217 59538 14683 -47793 -54085 -4305 -9559 41720 182563 175879 53971 33890 25415
16325 25415 -9244 36596 63640 127445 189584 162728 190223 151136 90920 103593 164135 197859
16313 197859 153642 130907 188606 208167 118264 49831 47138 49820 -6739 21394 77287 71891
16301 71891 20527 17100 -33139 -1655 71030 70226 43824 36815 124920 147624 167455 127141
16289 127141 114627 125391 123804 33028 -2482 45788 112707 77969 100904 189144 203617 210037
$$ packed form
16374A82546n9443l8915j7152k8422L6376k5971n8542l8022P4441L0216q150R914
16362E8876l5543N140N3237j1670q2460M9311O2549k2157j5599l1504m5236J4608
16350d48N8595n3873L538j6013N807m1166Q473k0812J7866K8752l9714K5642K8570
16337E217N4321m4855o2476o292M9780n254N1279J40843o684j21908k0081q475
16325B5415l4659M5840K7044O3805O2139k6856K7495l9087o0216J2673O0542L3724
16313A97859m4217k2735N7699J9561q9903o8433k693K682n6559K8133N5893n396
16301G1891n1364l427n0239L1484P2685q04k6402p009Q8105K2704J9831m0314
16289A27141j2514J0764j587r0776l5510M8270O6919l4738K2935Q8240J4473O420
$$ plain form
16277 210037 164130 112111 28850 6142 30094 24056 106061 140788 116903 107141 49223 1383
16265 1383 48239 143639 174798 78306 38118 104729 138893 199810 174257 127115 114156 103263
16253 103263 86095 65297 102010 65870 7844 61154 128178 93048 35029 20779 9327
16242 9327 57690 141331 185292 286217 248436 212783 133416 126033 162657 178583 169790 221729
16230 221729 227937 120321 138213 146974 30038 -5911 101604 143520 202091 261344 228022
16219 228022 165752 204191 215043 280527 272725 227993 198179 199829 90909 8685 8125 -10119
16207 -10119 51814 133940 106122 130334 177153 199334 206559 193169 219604 157667 176179 279905
16195 279905 219983 223741 315181 405206 307251 151587 126165 122417 197073 304400 292593
$$ packed form
16277B10037m5907n2019q3261k2708K3952o038Q2005L4727k3885r762n7918m7840
16265A383M6856R5400L1159r6492m0188O6611L4164O0917k5553m7142j2959j0893
16253A03263j7168k0798L6713l6140n8026N3310O7024l5130n8019j4250j1452
16242I327M8363Q3641M3961J00925l7781l5653p9367p383L6624J5926q793N1939
16230B21729O208j07616J7892Q761j16936l5949J07515M1916N8571N9253l3322
16219B28022o2270L8439J0852O5484p802m4732k9814J650j08920q2224n60j8244
16207a0119O1933Q2126k7818K4212M6819K2181P225j3390K6435o1937J8512J03726
16195B79905n9922L758R1440R0025r7955j55664k5422l748P4656J07327j1807
$$ plain form
16184 292593 166615 89690 131093 172667 179196 45827 -16923 -7965 30219 74303 129983
16173 129983 103984 106796 106606 87443 42376 70613 146865 99310 80932 100842 103974 139716
16161 139716 146825 131334 131599 120250 152314 242104 158762 130327 237011 298874 275310 275628
16149 275628 225364 241796 275040 256285 391574 417929 282068 191842 141038 98456 43500
16138 43500 93201 109191 157124 220567 266886 209159 180442 238029 267719 271850 268850 166828
16126 166828 112517 72754 86113 150171 264255 353429 333650 264457 235820 164999 85355
16115 85355 133703 186149 249010 319709 227561 240516 252134 317749 267494 174344 135286 129114
16103 129114 128126 118655 85105 148159 179237 171004 148232 108589 157703 133988 91599 48729
$$ packed form
16184B92593j25978p6925M1403M1574O529j33369o2750Q958L8184M4084N5680
16173A29983k5999K812j90j9163m5067K8237P6252m7555j8378J9910L132L5742
16161A39716P109j5491K65j1349L2064Q9790q3342k8435J06684O1863k3564L18
16149B75628n0264J6432L3244j8755J35289K6355j35861r0226n0804m2582n4956
16138D3500M9701J5990M7933O3443M6319n7727k8717N7587K9690M131l000j02022
16126A66828n4311l9763J3359O4058J14084Q9174j9779o9193k8637p0821p9644
16115H5355M8348N2446O2861P0699r2148J2955J1618O5615n0255r3150l9058o172
16103A29114r88r471l3550O3054L1078q233k2772l9643M9114k3715m2389m2870
$$ plain form
16091 48729 173645 294786 265211 205447 164529 146446 156333 130001 86364 178037 268126
16080 268126 250906 162672 110984 247134 283894 241448 220012 321018 350696 328453 205267
16069 205267 253815 295435 234311 139680 153914 120114 212224 210048 191570 286654 317136 277581
16057 277581 243287 289484 274483 228041 218007 278541 279077 282349 250095 245120 239163 283434
16045 283434 325527 379218 366199 326166 275084 184130 106301 144654 189207 243511 245137 193171
16033 193171 199794 281023 257189 262992 260742 188349 157843 184816 237894 177816 146231 164178
16021 164178 191261 225354 241537 341851 390749 378415 333133 251060 277473 336147 259957
16010 259957 265917 307576 233780 146415 185509 188350 196119 197663 216093 286799 310516 341114
$$ packed form
16091D8729J24916J21141k9575n9764m0918j8083R887k6332m3637R1673R0089
16080B68126j7220q8234n1688J36150L6760m2446k1436J01006K9678k2243j23186
16069B05267M8548M1620o1124r4631J4234l3800R2110k176j8478R5084L0482l9555
16057B77581l4294M6197j5001m6442j0034O0534N36L272l2254m975n957M4271
16045B83434M2093N3691j3019m0033n1082r0954p7829L8353M4553N4304J626n1966
16033A93171O623Q1229k3834N803k250p2393l0506K6973N3078o0078l1585J7947
16021A64178K7083L4093J6183J00314M8898j2334m5282q2073K6413N8674p6190
16010B59957N960M1659p3796q7365L9094K841P769J544J8430P0706K3717L0598
$$ plain form
15998 341114 292599 278485 306341 304390 321586 351240 314939 329554 359590 377894 375913 358690
15986 358690 352512 255045 208837 221163 239410 263967 219143 183408 178265 157006 179553 204298
15974 204298 164355 169738 217147 156700 122920 199249 179302 202009 160155 124680 175266 144545
15962 144545 147769 134699 131711 222178 222656 167038 206357 202097 180047 310849 330350 273227
15950 273227 277115 299564 231085 272915 217010 196974 235602 250656 199739 181947 129266 91133
15938 91133 100807 163596 183108 254201 229020 248100 304836 280954 252677 338114 344956 277318
15926 277318 298631 278709 178897 214913 311983 331277 324015 380455 326256 317173 280595 331779
15914 331779 309550 220112 206673 131759 151292 254149 250768 296010 302691 228406 232587 266018
$$ packed form
15998C41114m8515j4114K7856j951J7196K9654l6301J4615L0036J8304j981j7223
15986C58690o178r7467m6208J2326J8247K4557m4824l5735n143k1259K2547K4745
15974B04298l9943N383M7409o0447l3780P6329j9947K2707m1854l5475N0586l0721
15962A44545L224j3070k988R0467M78n5618L9319m260k2050J30802J9501n7123
15950B73227L888K2449o8479M1830n5905k0036L8628J5054n0917j7792n2681l8133
15938I1133R674O2789J9512P1093k5181J9080N6736k3882k8277Q5437O842o7638
15926B77318K1313j9922r9812L6016R7070J9294p262N6440n4199r083l6578N1184
15914C31779k2229q9438j3439p4914J9533J02857l381M5242O681p4285M181L3431
$$ plain form
15902 266018 261130 287161 285700 260084 177943 174425 294294 409989 487162 461401 329491
15891 329491 222025 192112 210928 254308 240740 209062 163378 141869 246690 288003 271244
15880 271244 241945 293709 297272 379525 457392 492704 476574 447014 452574 471971 440048 390885
15868 390885 336524 314115 312288 295312 242753 174318 208265 236264 272756 344081 334305 181343
15856 181343 208886 286979 315777 288842 284110 393784 440078 405427 352076 338992 363932
15845 363932 284667 198566 249919 284510 315770 254186 207371 222064 244786 190422 263176
15834 263176 289432 261503 234339 219097 203842 238477 245384 292850 247650 296579 329170 287207
15822 287207 290194 236444 252000 253080 297772 334391 282844 350755 468429 431080 356456 288106
$$ packed form
15902B66018m888K6031j461k5616q2141l518J19869J15695P7173k5761j31910
15891C29491j07466k9913J8816M3380j3568l1678m5684k1509J04821M1313j6759
15880B71244k9299N1764L563Q2253P7867L5312j6130k9560N560J9397l1923m9163
15868C90885n4361k2409j827j6976n2559o8435L3947K7999L6492P1325r776j52962
15856A81343K7543P8093K8798k6935m732J09674M6294l4651n3351j3084K4940
15845C63932p9265q6101N1353L4591L1260o1584m6815J4693K2722n4364P2754
15834B63176K6256k7929k7164j5242j5255L4635O907M7466m5200M8929L2591m1963
15822B87207K987n3750J5556J080M4692L6619n1547O7911J17674l7349p4624o8350
$$ plain form
15810 288106 251109 266711 324294 381907 367993 438958 446049 437831 409876 366001 368790 401670
15798 401670 323901 276460 222288 254354 315430 369241 343135 328662 274649 228376 189791
15787 189791 223605 205560 231305 298354 324837 296094 210116 238064 302904 348401 359366
15776 359366 328873 407191 345464 244863 281034 345987 434522 425252 374963 318262 310053 272950
15764 272950 241954 188708 166031 296209 324003 353533 360612 334616 240446 188154 210293
15753 210293 282652 351363 372611 441659 469360 461513 457718 455384 336940 321040 356840 272880
15741 272880 248977 329440 468397 553755 600281 631037 521291 429708 320631 284191 336102
15730 336102 426135 445232 465273 484290 454123 373940 296550 357033 405849 416712 324017
$$ packed form
15810B88106l6997J5602N7583N7613j3914P0965P091q218k7955m3875K789L2880
15798D01670p7769m7441n4172L2066O1076N3811k6106j4473n4013m6273l8585
15787A89791L3814j8045K5745O7049K6483k8743q5978K7948O4840M5497J0965
15776C59366l0493P8318o1727j00601L6171O4953Q8535r270n0289n6701q209l7103
15764B72950l0996n3246k2677J30178K7794K9530P079k5996r4170n2292K2139
15753B10293P2359O8711K1248O9048K7701p847l795k334j18444j5900L5800q3960
15741B72880k3903Q0463J38957Q5358M6526L0756j09746r1583j09077l6440N1911
15730C36102R0033J9097K0041J9017l0167q0183p7390O0483M8816J0863r2695
$$ plain form
15719 324017 273360 257357 299621 346834 330665 331391 336428 309306 291778 333029 391381 393464
15707 393464 325462 311031 342755 365017 349488 387457 389011 371556 431392 486308 409189 322791
15695 322791 345973 304943 350520 433761 375860 373388 382037 348024 284485 306950 271074 258939
15683 258939 276510 259391 238267 219788 228025 281118 281534 355495 455780 485944 492817 464031
15671 464031 375435 355823 343560 390430 342105 329058 378225 421799 425075 431086 395915 317594
15659 317594 285116 303286 308338 322535 353468 390436 434221 402782 345176 354367 348694 373919
15647 373919 432560 389770 376198 317884 242267 221864 193539 261636 396470 500645 555980
15636 555980 534863 486906 464789 450994 381138 329597 340748 486436 461581 446021 368078
$$ packed form
15719C24017n0657j6003M2264M7213j6169P26N037k7122j7528M1251N8352K083
15707C93464o8002j4431L1724K2262j5529L7969J554j7455N9836N4916p7119q6398
15695C22791K3182m1030M5577Q3241n7901k472Q649l4013o3539K2465l5876j2135
15683B58939J7571j7119k1124j8479Q237N3093M16P3961J00285L0164O873k8786
15671D64031q8596j9612j2263M6870m8325j3047M9167M3574L276O011l5171p8321
15659C17594l2478J8170N052J4197L0933L6968M3785l1439n7606R191n673K5225
15647C73919N8641m2790j3572n8314p5617k0403k8325O8097J34834J04175N5335
15636E55980k1117m7957k2117j3795o9856n1541J1151J45688k4855j5560p7943
$$ plain form
15625 368078 386358 401117 425053 422344 340110 268812 258641 240527 194927 207976 216596 337836
15613 337836 349800 334835 360428 333489 357202 332431 285432 333568 342305 333799 381039 382960
15601 382960 367916 329741 271625 360988 473673 469143 506326 450471 312498 307301 366427
15590 366427 317574 239604 234706 382265 396083 324565 330629 322912 315947 270282 217701 275130
15578 275130 381967 434817 452437 442441 474143 448018 411062 313978 288967 425897 578586
15567 578586 570988 466485 377255 346739 398750 438232 352878 288554 360955 419636 360056
15556 360056 361389 372938 416855 429134 484918 487296 488998 433769 355718 334305 350106 405900
15544 405900 474066 503135 499884 552710 579290 567104 542946 543338 534819 509314 549591 569486
$$ packed form
15625C68078J8280J4759K3936k709q2234p1298j0171j8114m5600J3049Q620J21240
15613C37836J1964j4965K5593k6939K3713k4771m6999M8136Q737q506M7240J921
15601C82960j5044l8175n8116Q9363J12685m530L7183n5855j37973n197N9126
15590C66427m8853p7970m898J47559J3818p1518O064p717o965m5665n2581N7429
15578B75130J06837N2850J7620r996L1702k6125l6956r7084k5011J36930J52689
15567E78586p598j04503q9230l0516N2011L9482q5354o4324P2401N8681n9580
15556C60056J333J1549M3917J2279N5784K378J702n5229p8051k1413J5801N5794
15544D05900O8166K9069l251N2826K6580j2186k4158L92q519k5505M0277J9895
$$ plain form
15532 569486 512561 413358 409740 438370 490337 572941 545400 549252 472837 394905 440600 475857
15520 475857 441532 418885 408887 399543 389193 367260 344172 356431 485466 510939 513173 510989
15508 510989 507951 436183 451122 430840 462434 488260 519467 532893 514959 542161 566388 580498
15496 580498 575590 500248 498930 484070 502665 525104 500641 420127 299842 276310 365545 465967
15484 465967 460525 409506 380969 274680 280196 385276 359973 451751 463818 410338 310591
15473 310591 288785 369974 405911 339718 391657 422381 462808 436198 490061 417820 404274
15462 404274 412013 404521 429759 476622 449781 375422 410747 423932 439210 411207 454497 472224
15450 472224 419778 374331 421368 486029 563925 561421 516948 494647 442470 419954 382761 442141
$$ packed form
15532E69486n6925r9203l618K8630N1967Q2604k7541L852p6415p7932M5695L5257
15520D75857l4325k2647r998r344j0350k1933k3088J2259J29035K5473K234k184
15508E10989l038p1768J4939k0282L1594K5826L1207J3426j7934K7202K4227J4110
15496E80498m908p5342j318j4860J8595K2439k4463q0514j20285k3532Q9235J00422
15484D65967n442n1019k8537j06289N516J05080k5303R1778J2067n3480r9747
15473C10591k1806Q1189L5937o6193N1939L0724M0427k6610N3863p2241j3546
15462D04274P739p492K5238M6863k6841p4359L5325J3185J5278k8003M3290J7727
15450D72224n2446m5447M7037O4661P7896k504m4473k2301n2177k2516l7193N9380
$$ plain form
15438 442141 430580 422344 426554 353083 338915 334140 402634 495956 593302 493438 406476 454773
15426 454773 454352 459793 511441 473709 401862 329977 347938 420604 485762 351530 342836 455844
15414 455844 481708 515452 540526 490273 394062 441128 497913 517895 599489 611535 566292
15403 566292 429582 439399 469725 455707 468364 516631 533815 493986 443376 410550 443349
15392 443349 460921 466736 424881 448980 430422 353001 358080 447680 489623 409586 421941 417973
15380 417973 378664 320585 396357 455308 520687 548789 583053 528236 455093 418508 392157
15369 392157 306905 271790 338648 395462 397901 402483 405356 437841 512465 549767 485891 428850
15357 428850 442483 436538 489211 582945 573129 522485 524355 532059 585554 588142 554603 524906
$$ packed form
15438D42141j1561q236M210p3471j4168m775O8494R3322R7346r9864q6962M8297
15426D54773m21N441N1648l7732p1847p1885J7961P2666O5158j34232q694J13008
15414D55844K5864L3744K5074n0253r6211M7066N6785J9982Q1594J2046m5243
15403E66292j36710R817L0326j4018J2657M8267J7184l9829n0610l2826L2799
15392D43349J7572N815m1855K4099j8558p7421N079Q9600M1943q0037J2355l968
15380D17973l9309n8079P5772N8951O5379K8102L4264n4817p3143l6585k6351
15369C92157q5252l5115O6858N6814K439M582K873L2485P4624L7302o3876n7041
15357D28850J3633n945N2673R3734r816n0644J870P704N3495K588l3539k9697
$$ plain form
15345 524906 602292 502587 401271 442851 483182 496180 559076 599544 635766 614199 597336
15334 597336 636862 602835 530986 554418 580193 529661 523755 536497 570381 565029 544334 548418
15322 548418 583155 543448 469650 440583 490988 546358 529393 466453 492524 539420 543292 542272
15310 542272 513355 498860 488430 504898 518912 556282 604489 638400 618891 642533 571019
15299 571019 531928 495631 455394 523221 561844 505635 509185 565697 657015 676407 593917 480648
15287 480648 440770 455225 363109 354667 455738 475144 459320 504010 587785 556026 441105
15276 441105 419263 455627 472247 417236 334960 292892 403702 362435 396897 461369 477904
15265 477904 487623 511190 439961 467177 542308 611930 613927 529893 491658 545992 582352 519580
$$ packed form
15345E24906P7386r9705j01316M1580M0331J2998O2896M0468L6222k1567j6863
15334E97336L9526l4027p1849K3432K5775n0532n906J2742L3884n352k0695M084
15322E48418L4737l9707p3798k9067N0405N5370j6965o2940K6071M6896L872j020
15310E42272k8917j4495j0430J6468J4014L7370M8207L3911j9509K3642p1514
15299E71019l9091l6297m0237O7827L8623n6209L550N6512R1318J9392q2490j13269
15287D80648l9878J4455r2116q442J01071J9406j5824M4690Q3775l1759j14921
15276D41105k1842L6364J6620n5011q2276m2068J10810m1267L4462O4472J6535
15265D77904R719K3567p1229K7216P5131O9622J997q4034l8235N4334L6360o2772
$$ plain form
15253 519580 518851 572468 466354 390554 450601 498853 540309 565733 481640 527394 524034 533024
15241 533024 548610 549722 545734 546381 549048 645150 649005 577622 505591 494812 534290 544124 514201
15228 514201 452508 478092 471176 409788 487807 629856 523084 452106 383807 477593 537646
15217 537646 475861 466438 516608 550006 558900 602070 561945 562628 531218 604588 644171 624398
15205 624398 504196 525859 600162 588686 543573 586714 509321 425800 509681 544772 520712
15194 520712 521147 463558 420971 411988 454576 405024 314084 369189 513587 595045 618739 548782
15182 548782 613937 602316 571634 570773 576627 506151 477503 489458 399976 467309 514078 483810
15170 483810 390816 355983 410162 527692 619591 567016 658524 723065 678700 641752 594955
$$ packed form
15253E19580p29N3617j06114p5800O0047M8252M1456K5424q4093M5754l360Q990
15241E33024J5586J112l988O47K667R6102L855p1383p2031j0779L9478R834k9923
15228E14201o1693K5584o916o1388P8019J42049j06772p0978o8299R3786O0053
15217E37646o1785r423N0170L3398Q894M3170m0125O83l1410P3370L9583j9773
15205F24398j20202K1663P4303j1476m5113M3141p7393q3521Q3881L5091k4060
15194E20712M35n7589m2587q983M2588m9552r0940N5105J44398Q1458K3694o9957
15182E48782O5155j1621l0682q61N854p0476k8648J1955q9482O7333M6769l0268
15170D83810r2994l4833N4179J17530R1899n2575R1508O4541m4365l6948m6797
$$ plain form
15159 594955 539511 559319 529325 437682 423500 443023 446969 509103 547959 530891 545577 554303
15147 554303 555846 571767 571505 597874 584601 552107 608355 610456 570107 542532 631094 635241
15135 635241 623154 649994 663279 713200 746017 645199 678468 680676 632550 612437 602353
15124 602353 543285 437614 482584 507979 603753 598959 525922 470598 449028 481215 579242
15113 579242 577426 584103 555865 516299 561514 642527 578137 470949 473309 528164 523413 461839
15101 461839 574803 648440 590065 497690 503733 570388 584963 569200 549903 594140 598232 634318
15089 634318 646077 631734 629493 596565 628042 689656 637155 620989 661122 643990 639959 552509
15077 552509 525257 465267 513211 594133 602346 516564 507686 483329 518181 586014 627507 670020
$$ packed form
15159E94955n5444J9808k9994r1643j4182J9523L946O2134L8856j7068J4686Q726
15147E54303J543J5921k62K6369j3273l2494N6248K101m0349k7575Q8562M147
15135F35241j2087K6840J3285M9921L2817j00818L3269K208m8126k0113j0084
15124F02353n9068j05671M4970K5395R5774m794p3037n5324k1570L2187R8027
15113E79242j816O677k8238l9566M5215Q1013o4390j07188K360N4855m751o1574
15101D61839J12964P3637n8375r2375O043O6655J4575j5763j9297M4237M092L6086
15089F34318J1759j4343k241l2928L1477O1614n2501j6166M0133j7132m031q7450
15077E52509k7252n9990M7944Q0922Q213q5782q878k4357L4852O7833M1493M2513
$$ plain form
15065 670020 673367 637267 625565 582457 554132 516219 479238 523005 591566 677058 696781 548084
15053 548084 543082 518349 479394 527418 464265 425333 498810 536056 510370 492624 548895 579588
15041 579588 587758 614708 547013 514776 486167 446054 439103 453607 432586 364339 382548 485674
15029 485674 600764 661670 623300 596130 587231 571108 630744 711872 733139 625109 617843
15018 617843 665136 706978 670623 588546 540642 610864 619366 633678 706867 706775 696794 678578
15006 678578 661837 722235 652473 521233 468982 485553 492917 486822 510713 554713 518799 536578
14994 536578 500224 477645 560287 517044 484527 540462 558814 601290 591605 479396 502643
14983 502643 550288 583023 620219 728423 705075 648225 591184 544741 507397 553539 616738
$$ packed form
15065F70020L347l6100j1702m3108k8325l7913l6981M3767O8561Q5492J9723j48697
15053E48084n002k4733l8955M8024o3153l8932P3477L7246k5686j7746N6271L0693
15041E79588Q170K6950o7695l2237k8609m0113o951J4504k1021o8247J8209J03126
15029D85674J15090O0906l8370k7170q899j6123N9636Q1128K1267j08030p266
15018F17843M7293M1842l6355q2077m7904P0222Q502J4312P3189r2r981j8216
15006F78578j6741O0398o9762j31240n2251J6571P364o095K3891M4000l5914J7779
14994E36578l6354k2579Q2642m3243l2517N5935J8352M2476r685j12209K3247
14983E02643M7645L2735L7196J08204k3348n6850n7041m6443l7344M6142O3199
$$ plain form
14972 616738 597224 581516 604542 677582 653211 625163 617976 610883 564526 536132 593335 650466
14960 650466 698104 738934 820950 832667 725263 690845 670935 671919 664477 640259 708483 694490
14948 694490 626098 567295 476290 427742 422932 417369 478414 538796 609544 616996 625509 618996
14936 618996 561498 496814 570270 601824 637831 669180 602743 610284 678048 674403 694680 696530
14924 696530 628474 599969 627537 605260 477964 434752 501712 698901 754200 685139 574980
14913 574980 560559 682464 711450 689912 700438 666060 639594 611511 654079 662276 711740
14902 711740 739159 640944 609516 630995 614555 586340 584365 594427 624727 653223 717877 704101
14890 704101 636997 597673 597629 629906 630916 596352 627894 676195 683010 720814 704469 704825 719523
$$ packed form
14972F16738j9514j5708K3026P3040k4371k8048p187p093m6357k8394N7203N7131
14960F50466M7638M0830Q2016J1717j07404l4418j9910R84p442k4218O8224j3993
14948F94490o8392n8803r1005m8548m810n563O1045O0382P0748P452Q513o513
14936F18996n7498o4684P3456L1554L6007L1349o6437P541O7764l645K0277J850
14924F96530o8056k8505K7568k2277j27296m3212O6960J97189N5299o9061j10159
14913E74980j4421J21905K8986k1538J0526l4378k6466k8083M2568Q197M9464
14902G11740K7419r8215l1428K1479j6440k8215j975J0062L0300K8496O4654j3776
14890G04101o7104l9324m4L2277J010l4564L1542M8301O815L7804j6345L56J4698
$$ plain form
14877 719523 632769 649285 715931 684292 657715 762912 714621 617332 658887 585756 579356
14866 579356 653437 678128 657105 616739 571637 474516 482643 571794 620414 658483 626366 563364
14854 563364 526687 529424 675830 703511 614751 544453 561716 597440 604464 642123 587112 617024
14842 617024 612540 573107 581663 677734 696975 671807 634226 661270 723639 705299 717540 758878
14830 758878 667483 653422 630210 685671 705850 699731 657928 656760 673567 681575 597237 621290
14818 621290 616200 662841 663124 674846 681029 732900 722462 829506 895491 801947 780764 735885
14806 735885 732834 739146 728348 613691 593066 706520 712992 724060 828766 789150 786667 732187
14794 732187 658172 650125 685551 615659 598819 651808 589022 612485 648733 699676 724628 650937
$$ packed form
14877G19523q6754J6516O6646l1639k6577J05197m8291r7289M1555p3131o400
14866E79356P4081K4691k1023m0366m5102r7121Q127Q9151M8620L8069l2117o3002
14854E63364l6677K737J46406K7681q8760p0298J7263L5724P024L7659n5011K9912
14842F17024m484l9433Q556R6071J9241k5168l7581K7044O2369j8340J2241M1338
14830G58878r1395j4061k3212N5461K0179o119m1803j168J6807Q008q4338K4053
14818F21290n090M6641K83J1722O183N1871j0438J07044O5985r3544k1183m4879
14806G35885l051O312j0798j14657k0625J13454O472J1068J04706l9616k483n4480
14794G32187p4015q047L5426o9892j6840N2989o2786K3463L6248N0943K4952p3691
$$ plain form
14782 650937 616534 672261 655664 554264 584384 701549 689485 639663 720294 783637 720833
14771 720833 783049 770670 678319 689362 713386 727299 783194 785927 711915 656582 664830 639704
14759 639704 627051 640478 668867 726284 721186 732290 711447 728860 775950 836900 791084 733689
14747 733689 640911 613312 633502 677507 686638 682475 690231 674862 709818 644097 613211 654598
14735 654598 654054 619465 621800 576660 538673 531816 576924 602217 660747 601477 688056 817874
14723 817874 708277 560363 553097 598706 677415 770288 800364 758487 741781 786744 786448 752588
14711 752588 816359 750750 702154 670079 660605 579117 564192 624216 628493 696852 693698 651790
14699 651790 729987 831864 770265 725357 656773 584892 596323 569592 544479 559524 551933
$$ packed form
14782F50937l4403N5727j6597j01400L0120J17165j2064m9822Q0631O3343o2804
14771G20833O2216j2379r2351J1043K4024J3913N5895K733p4012n5333Q248k5126
14759F39704j2653J3427K8389N7417n098J1104k0843J7413M7090O0950m5816n7395
14747G33689r2778k7599K0190M4005R131m163P756j5369L4956o5721l0886M1387
14735F54598n44l4589K335m5140l7987o857M5108K5293N8530n9270Q6579J29818
14723H17874j09597j47914p266M5609P8709R2873L0076m1877j6706M4963k96l3860
14711G52588O3771o5609m8596l2075r474q1488j4925O0024M277O8359l154m1908
14699F51790P8197J01877o1599m4908o8584p1881J1431k6731k5113J5045p591
$$ plain form
14688 551933 566143 643870 606587 662531 720531 704427 707134 710145 742344 750078 755072 750882
14676 750882 776236 793258 854376 837829 836748 790735 741115 746209 730855 700843 703836 717673
14664 717673 675611 664327 720286 731543 764514 770775 731023 668630 712202 712686 712416 739767
14652 739767 679154 745944 792339 818966 786980 735255 688558 698660 763150 768869 688559 663038
14640 663038 682308 635182 703726 782715 803724 784482 741489 693954 716580 754766 810132
14629 810132 826363 724922 667821 702336 796249 853123 767401 664298 622347 622682 593667
14618 593667 611784 719091 773069 753279 696360 663887 680895 676230 621609 613302 688378 743130
14606 743130 846997 823595 821154 841674 800231 727486 689588 738521 731665 703802 711735 739292
$$ packed form
14688E51933J4210P7727l7283N5944N8000j6104K707L011L2199P734M994m190
14676G50882K5354J7022O1118j6547j081m6013m9620N094j5354l0012K993J3837
14664G17673m2062j1284N5959J1257L2971O261l9752o2393M3572M84k70K7351
14652G39767o0613O6790M6395K6627l1986n1725m6697J0102O4490N719q0310k5521
14640F63038J9270m7126O8544P8989K1009j9242m2993m7535K2626L8186N5366
14629H10132J6231j01441n7101L4515R3913N6874q5722j03103m1951L35k9015
14618E93667J8117J07307N3978j9790n6919l2473J7008m665n4621q307P5076N4752
14606G43130J03867k3402k441K0520m1443p2745l7898M8933o856k7863P933K7557
$$ plain form
14594 739292 673544 666947 682539 762316 813687 823318 792943 771499 808402 772041 750518 785625
14582 785625 749682 774544 837586 821710 836369 883979 870676 826674 791776 812183 862348
14571 862348 802712 851684 750100 766754 773573 796152 844327 817064 802200 875657 855883
14560 855883 845613 793357 775534 814703 827127 822358 875614 830539 798513 769084 730441 722786
14548 722786 769137 794399 821983 862313 933915 836552 787089 859044 905348 924234 932232 908144
14536 908144 879722 827247 827818 772760 750154 773498 780039 721286 684895 682703 708361 675963
14524 675963 712141 770997 837338 838603 721325 685847 761598 791431 736688 759803 903018
14513 903018 891250 888960 862495 870468 902694 879009 869462 803291 742549 773359 839233 807799
$$ packed form
14594G39292o5748o597J5592P9777N1371R631l0375k1444L6903l6361k1523L5107
14582G85625l5943K4862O3042j5876J4659M7610j3303m4002l4898K0407N0165
14571H62348n9636M8972j01584J6654O819K2579M8175k7263j4864P3457j9774
14560H55883j0270n2256j7823L9169J2424m769N3256m5075l2026k9429l8643p655
14548G22786M6351K5262K7584M0330P1602r7363m9463P1955M6304J8886P998k4088
14536I08144k8422n2475N71n5058k2606K3344O541n8753l6391k192K5658l2398
14524F75963L6178N8856O6341J265j17278l5478P5751K9833n4743K3115J43215
14513I03018j1768k290k6465P973L2226k3685r547o6171o0742L0810O5874l1434
$$ plain form
14501 807799 731464 765907 796508 842973 806594 825705 924147 987963 948319 891967 851653
14490 851653 784706 811966 830259 811574 833711 812640 848181 889334 865218 862400 813795 831493
14478 831493 903517 908726 861514 757868 846925 908318 898407 919092 902449 846534 863222 871552
14466 871552 912899 950109 1000931 991758 922154 887744 897969 866531 827086 828172 860677 936527
14454 936527 953568 953581 923312 844275 801662 793907 822259 824204 812237 805104 870071 773440 750009
14441 750009 788900 782188 792242 817409 823321 813634 769520 716318 696691 681509 683017 791190
14429 791190 815245 761565 712421 718049 875841 969539 1095527 1066634 1041257 972389 924596
14418 924596 829954 831182 782209 718632 797855 802484 811138 809245 715679 692293 735231 817747
$$ packed form
14501H07799p6335L4443L0601M6465l6379J9111R8442O3816l9644n6352m0314
14490H51653o6947K7260J8293j8685K2137k1071L5541M1153k4116k818m8605J7698
14478H31493P2024N209m7212j03646Q9057O1393r911K0685j6643n5915J6688Q330
14466H71552M1347L7210N0822r173o9604l4410J0225l1438l9445J086L2505P5850
14454I36527J7041J3l0269p9037m2613p755K8352J945j1967p133O4967r6631k3431
14441G50009L8891o712J0054K5167N912r687m4114n3202j9627j5182J508J08173
14429G91190K4055n3680m9144N628J57792R3698J25988k8893k5377o8868m7793
14418I24596r4642J228m8973o3577P9223M629Q654j893r3566k3386M2938Q2516
$$ plain form
14406 817747 856140 913370 945576 922524 841739 747166 792739 823312 836286 785257 795602
14395 795602 815389 848464 890130 983061 998014 868153 901684 986438 975900 959813 882105
14384 882105 898462 940549 928916 913757 925265 880595 883838 901614 936713 875164 889931 813044
14372 813044 847613 908105 918951 856246 760876 819786 838234 859185 917822 961862 956153 920611
14360 920611 907438 960658 902211 822474 844529 819544 806397 811689 754271 762570 762317 756441
14348 756441 774837 842801 832358 828934 811215 808841 856675 854600 785053 797291 857073 848628
14336 848628 843398 845529 767242 746704 857988 870555 837853 827303 884568 886444 855298 816270
14324 816270 841129 826958 856558 931010 918172 921927 892641 785554 774459 795803 870238
$$ packed form
14406H17747L8393N7230L2206k3052q0785r4573M5573L0573J2974n1029J0345
14395G95602J9787L3075M1666R2931J4953j29861L3531Q4754j0538j6087p7708
14384H82105J6357M2087j1633j5159J1508m4670L243J7776L5099o1549J4767p6887
14372H13044L4569O0492J0846o2705r5370N8910J8448K0951N8637M4040n709l5542
14360I20611j3173N3220n8447p9737K2055k4985j3147N292n7418Q299k53n876
14348G56441J8396O7964j0443l424j7719k374M7834k075o9547J2238N9782q445
14336H48628n230K131p8287k0538J11284J2567l2702j0550N7265J876l1146l9028
14324H16270K4859j4171K9600P4452j2838L755k9286j07087j1095K1344P4435
$$ plain form
14313 870238 994854 1035963 1032073 1046866 953016 899551 907102 908141 923685 1012558 983781 982995
14301 982995 975430 996304 924671 895200 883306 881946 826661 897945 976772 1031777 993456 989393
14289 989393 941816 907037 950198 901400 832476 836978 832017 813954 796829 778329 809450 810939
14277 810939 897311 906341 889446 895362 952476 963573 905048 846347 879918 912154 974253 1043170
14265 1043170 1003713 985561 987680 1018327 998988 962127 921563 868215 822184 907447 986518
14254 986518 909435 919498 980669 1078743 1089986 1070536 911977 840302 830646 961925 977615
14243 977615 878433 852580 891996 877642 910744 956616 964971 949944 997996 950336 869728 939759
14231 939759 983641 938571 914294 845648 830348 915471 973624 979601 902223 795707 715726
$$ packed form
14313H70238J24616M1109l890J4793r3850n3465P551J039J5544Q8873k8777p86
14301I82995p565K0874p1633k9471j1894j360n5285P1284P8827N5005l8321m063
14289I89393m7577l4779M3161m8798o8924M502m961j8063j7125j8500L1121J489
14277H10939Q6372R030j6895N916N7114J1097n8525n8701L3571L2236O2099O8917
14265A043170l9457j8152K119L0647j9339l6861m0564n3348m6031Q5263P9071
14254I86518p7083J0063O1171R8074J1243j9450j58559p1675r656J31279J5690
14243I77615r9182k5853L9416j4354L3102M5872Q355j5027M8052m7660q0608P0031
14231I39759M3882m5070k4277o8646j5300Q5123N8153N977p7378j06516p9981
$$ plain form
14220 715726 690158 686060 852312 871213 910901 1017982 1132223 1164645 1172116 1069833 988044
14209 988044 904074 817021 948367 1005507 972942 892218 778944 809895 969578 988646 989761
14198 989761 1017350 1019142 987116 936486 909808 900000 957568 1011310 1030971 943449 857156 860071
14186 860071 829409 926258 1036175 1024135 1044732 1018906 944165 922152 872169 949429 963660
14175 963660 915297 916801 950110 1083390 1103226 1046371 1025236 1006950 1018411 1090505 1110965
14164 1110965 1100328 1023799 1005221 1053897 1001324 938276 899033 900282 931898 898901 844978
14153 844978 740409 809449 948259 941620 992751 1002340 980125 992742 1040784 1013488 1021935 992764
14141 992764 885935 838224 846140 898975 984605 1042396 1116388 1016243 889135 875158 933808
$$ packed form
14220G15726k5568m098J66252J8901L9688J07081J14241L2422P471j02283q1789
14209I88044q3970q7053J31346N7140l2565q0724j13274L0951J59683J9068J115
14198I89761K7589J792l2026n0630k6678r808N7568N3742J9661q7522q6293K915
14186H60071l0662R6849J09917j2040K0597k5826p4741k2013m9983P7260J4231
14175I63660m8363J504L3309J33280J9836n6855k1135j8286J1461P2094K0460
14164A110965j0637p6529j8578M8676n2573o3048l9243J249L1616l2997n3923
14153H44978j04569O9040J38810o639N1131R589k2215J2617M8042k7296Q447k9171
14141I92764j06829m7711P916N2835Q5630N7791P3992j00145j27108j3977N8650
$$ plain form
14130 933808 927326 868769 901203 998511 1044306 1053744 1078681 1045503 1058697 1004646 955797 898634
14118 898634 946606 1012406 1108238 1027246 1019915 1053456 1041407 958474 907001 920002 946998 953962
14106 953962 951738 923503 900164 928223 962606 1036739 1014016 1122362 1130742 1010634 931605
14095 931605 861150 903692 987579 1044524 1057229 1007499 937421 913475 938355 931230 889240 829975
14083 829975 858640 971919 1061490 1069309 1020277 1011751 990171 1038496 1010184 968549 1001844 972970
14071 972970 1021340 1003177 1055213 1127049 1116045 1138540 1116947 1057594 1023135 1135560 1190763
14060 1190763 1158770 1067931 1057960 1087554 1023344 1039848 992191 1004417 1038557 1050123 1032796
14049 1032796 967341 851367 947652 988165 968447 1053228 999245 899420 885052 971766 1053255
$$ packed form
14130I33808o482n8557L2434R7308M5795R438K4937l3178J3194n4051m8849n7163
14118H98634M7972O5800R5832q0992p331L3541j2049q2933n1473J3001K6996O964
14106I53962k224k8235k3339K8059L4383P4133k2723J08346Q380j20108p9029
14095I31605p0455M2542Q3887N6945J2705m9730p0078k3946K4880p125m1990n9265
14083H29975K8665J13279Q9571P819m9032q526k1580M8325k8312m1635L3295k8874
14071I72970M8370j8163N2036P1836j1004K2495k1593n9353l4459J12425N5203
14060A190763l1993r0839r971K9594o4210J6504m7657J2226L4140J1566j7327
14049A032796o5455j15974R6285M0513j9718Q4781n3983r9825j4368Q6714Q1489
$$ plain form
14038 1053255 1023808 1062747 1061744 1095924 1049135 990006 956976 984050 995026 1025630 1038594
14027 1038594 1013572 968892 960652 1124504 1130388 1094486 1159123 1173127 1127096 1142895 1190949
14016 1190949 1182073 1152766 1051183 986093 973085 1019594 1096528 1098489 1077113 1043299 1029796
14005 1029796 1020581 1019548 1007820 1072296 1161327 1184319 1129001 1089686 1074716 1115747 1119984 1093676
13993 1093676 1043184 1098886 1105054 1031888 995096 1042387 1061412 1170717 1275630 1223452 1188012
13982 1188012 1104147 1092260 1085777 1014925 1036426 1015587 1055614 1025723 1015975 1035519 1088035 1168054
13970 1168054 1141896 1122000 1058788 1051701 1078911 1131597 1165292 1054208 991482 1070355 1086057
13959 1086057 1072824 1042910 1090306 1130089 1144450 1139521 1098316 1033906 1030438 1039818 1045999 1079798
$$ packed form
14038A053255k9447L8939j003L4180m6789n9129l3030K7074J0976L0604J2964
14027A038594k5022m4680q240J63852N884l5902O4637J4004m6031J5799M8054
14016A190949q876k9307j01583o5090j3008M6509P6934J961k1376l3814j3503
14005A029796r215j033j1728O4476Q9031K2992n5318l9315j4970M1031M237k6308
13993A093676n0492N5702O168p3166l6792M7291J9025J09305J04913n2178l5440
13982A188012q3865j1887o483p0852K1501k0839M0027k9891r748J9544N2516Q0019
13970A168054k6158j9896o3212p087K7210N2686L3695j11084o2726P8873J5702
13959A086057j3233k9914M7396L9783J4361m929m1205o4410l468R380O181L3799
$$ plain form
13947 1079798 1150278 1224055 1239973 1238613 1315421 1280787 1183996 1124068 1080801 1005319 1094219
13936 1094219 1113345 1109905 1105322 1113275 1103979 967781 990205 1026242 1055198 1059350 1085130 1089253
13924 1089253 1120316 1087812 1097678 1096891 1205785 1259569 1191181 1132934 1124073 1113994 1155481 1193772
13912 1193772 1228317 1262146 1168612 1021409 964766 1032426 1104778 1168433 1245287 1284743 1205888
13901 1205888 1136561 1114554 1114862 1228649 1289641 1267987 1281652 1266410 1278571 1338112 1352810
13890 1352810 1305726 1210836 1241165 1295813 1322288 1261671 1319493 1306629 1301468 1285675 1235291
13879 1235291 1198402 1220267 1203051 1181781 1195088 1217914 1132494 1057742 978266 1032315 1092713
13868 1092713 1110713 1134283 1135108 1059819 967701 947537 975347 1117030 1106756 1045677 1070978
$$ packed form
13947A079798P0480P3777J5918j360P6808l4634r6791n9928m3267p5482Q8900
13936A094219J9126l440m583P953r296j36198K2424L6037K8956M152K5780M123
13924A089253L1063l2504R866p87J08894N3784o8388n8247q861j0079M1487L8291
13912A193772L4545L3829r3534j47203n6643O7660P2352O3655P6854L9456p8855
13901A205888o9327k2007L08J13787O0992k1654J3665j5242J2161N9541J4698
13890A352810m7084r4890L0329N4648K6475o0617N7822j2864n161j5793n0384
13879A235291l6889K1865j7216k1270J3307K2826q5420p4752p9476N4049O0398
13868A092713J8000K3570Q25p5289r2118k0164K7810J41683j0274o1079K5301
$$ plain form
13857 1070978 1110406 1202036 1230208 1155658 1055603 1059651 1130825 1154910 1142658 1085973 1085751 1101293
13845 1101293 1115606 1079728 1017033 1024746 1064338 1142549 1195054 1178948 1184543 1177495 1162599 1196708
13833 1196708 1219065 1248918 1180776 1124376 1118936 1170786 1155778 1111422 1156089 1200320 1173042
13822 1173042 1219010 1245335 1131002 1035300 1085128 1142533 1202105 1133159 1058993 1027569 1033549
13811 1033549 1032827 1021444 1002139 1015046 1025378 1094472 1064354 1062175 1086704 1082044 1098613 1087945
13799 1087945 1113536 1121325 1123886 1050675 1160641 1264712 1236426 1217852 1241934 1216147 1182625
13788 1182625 1144423 1180536 1202708 1242151 1272913 1194356 1205450 1169390 1155050 1218134 1253772
13777 1253772 1234226 1317392 1294721 1269374 1261187 1251343 1260610 1203942 1226198 1209176 1196072 1237598
$$ packed form
13857A070978L9428R1630K8172p4550j00055M048P1174K4085j2252n6685k22J5542
13845A101293J4313l5878o2695P713L9592P8211N2505j6106N595p048j4896L4109
13833A196708K2357K9853o8142n6400n440N1850j5008m4356M4667M4231k7278
13822A173042M5968K6325j14333r5702M9828N7405N9572o8946p4166l1424N980
13811A033549p22j1383j9305J2907J0332O9094l0118k179K4529m660J6569j0668
13799A087945K5591P789K561p3211J09966J04071k8286j8574K4082k5787l3522
13788A182625l8202L6113K2172L9443L0762p8557J1094l6060j4340O3084L5638
13777A253772j9546Q3166k2671k5347q187r844R267n6668K2256j7022j3104M1526
$$ plain form
13765 1237598 1210888 1235214 1295911 1229301 1128994 1092577 1165976 1217844 1185564 1191109 1285161
13754 1285161 1237664 1087038 1053234 1073124 1085132 1074922 1133510 1148899 1229699 1268891 1241240
13743 1241240 1250005 1277295 1280028 1324961 1326546 1231148 1157025 1187511 1196270 1230497 1258973 1305734
13731 1305734 1300303 1258497 1190807 1230272 1302640 1319630 1338806 1281177 1227914 1118256 1101709
13720 1101709 1120922 1104311 1163521 1263890 1320316 1290140 1216884 1232072 1318822 1292123 1210826
13709 1210826 1241442 1203229 1034379 1011997 1100445 1179960 1130635 1218115 1344664 1345873 1417525
13698 1417525 1466416 1433647 1445842 1498097 1422564 1365093 1292208 1314364 1324533 1321311 1246383
13687 1246383 1288024 1201991 1094139 1089102 1132201 1162353 1217296 1219813 1153747 1132919 1211279
$$ packed form
13765A237598k6710K4326O0697o6610j00307l6417P3399N1868l2280N545R4052
13754A285161m7497j50626l3804J9890J2008j0210N8588J5389Q0800L9192k7651
13743A241240Q765K7290K733M4933J585r5398p4123L0486Q759L4227K8476M6761
13731A305734n431m1806o7690L9465P2368J6990J9176n7629n3263j09658j6547
13720A101709J9213j6611N9210J00369N6426l0176p3256J5188Q6750k6699q1297
13709A210826L0616l8213j68850k2382Q8448P9515m9325Q7480J26549J209P1652
13698A417525M8891l2769J2195N2255p5533n7471p2885K2156J0169l222p4928
13687A246383M1641q6033j07852n037M3099L0152N4943K517o6066k0828P8360
$$ plain form
13676 1211279 1268336 1303303 1308025 1381583 1365280 1316915 1270296 1277943 1347865 1385766 1366466 1381115
13664 1381115 1351832 1328348 1299410 1228356 1201412 1272726 1269229 1326641 1299666 1236104 1231668 1279399
13652 1279399 1330778 1383338 1326201 1369683 1363433 1308439 1316680 1296395 1281200 1301894 1257140 1259233
13640 1259233 1271392 1214305 1208053 1266963 1245662 1271188 1321280 1314740 1293880 1325015 1447889
13629 1447889 1555720 1602292 1558309 1465761 1448631 1397359 1363061 1356408 1252827 1215303 1254999
13618 1254999 1278815 1230268 1259161 1300245 1301738 1264907 1202650 1176458 1187990 1199577 1246025
13607 1246025 1277257 1311749 1413809 1474528 1477113 1439483 1440854 1394475 1387738 1329775 1300105 1307806
13595 1307806 1331467 1313500 1327890 1314675 1253818 1296901 1319888 1289925 1292382 1315387 1384441
$$ packed form
13676A211279N7057L4967M722P3558j6303m8365m6619P647O9922L7901j9300J4649
13664A381115k9283k3484k8938p1054k6944P1314l497N7412k6975o3562m436M7731
13652A279399N1379N2560n7137M3482o250n4994Q241k0285j5195K0694m4754K093
13640A259233J2159n7087o252N8910k1301K5526N0092o540k0860L1135J22874
13629A447889J07831M6572m3983r2548j7130n1272l4298o653j03581l7524L9696
13618A254999K3816m8547K8893M1084J493l6831o2257k6192J1532J1587M6448
13607A246025L1232L4492J02060O0719K585l7630J371m6379o737n7963k9670P701
13595A307806K3661j7967J4390j3215o0857M3083K2987k9963K457K3005O9054
$$ plain form
13584 1384441 1432918 1304955 1299344 1279943 1297640 1325753 1326714 1314589 1349903 1384753 1385760 1367475
13572 1367475 1391751 1415501 1459395 1419752 1332339 1244889 1264589 1363192 1442045 1532808 1573549
13561 1573549 1483001 1394568 1352271 1324118 1310963 1283933 1235780 1252117 1202641 1208188 1284915
13550 1284915 1297696 1327594 1261328 1253807 1268793 1301080 1309042 1419200 1471283 1433207 1483281
13539 1483281 1517260 1455357 1372084 1297283 1343234 1346513 1277015 1263445 1344598 1407899 1447775
13528 1447775 1454200 1441094 1451201 1402895 1412506 1494974 1389036 1302847 1305616 1284104 1313624 1385260
13516 1385260 1444172 1375014 1357515 1397423 1466226 1456700 1510757 1462196 1412810 1453542 1456595 1434208
13504 1434208 1365536 1226108 1240967 1268847 1354085 1417129 1432655 1488355 1454759 1409886 1402624
$$ packed form
13584A384441M8477j27963n611j9401J7697K8113R61j2125L5314L4850J007j8285
13572A367475K4276K3750M3894l9643q7413q7450J9700R8603P8853R0763M0741
13561A573549r0548q8433m2297k8153j3155k7030m8153J6337m9476N547P6727
13550A284915J2781K9898o6266p521J4986L2287P962J10158N2083l8076N0074
13539A483281L3979o1903q3273p4801M5951L279o9498j3570Q1153O3301L9876
13528A447775O425j3106J0107m8306R611Q2468j05938q6189K769k1512K9520P1636
13516A385260N8912o9158j7499L9908O8803r526N4057m8561m9386M0732L053k2387
13504A434208o8672j39428J4859K7880Q5238O3044J5526N5700l3596m4873p262
$$ plain form
13493 1402624 1431881 1431893 1424335 1372874 1348261 1390410 1374888 1344490 1435649 1388192 1343004 1400174
13481 1400174 1483168 1340800 1300080 1413666 1401281 1377769 1379684 1430223 1392894 1408395 1402954
13470 1402954 1383627 1429505 1368540 1362926 1430624 1442508 1495603 1414212 1319852 1320931 1403169 1391437
13458 1391437 1492920 1543321 1528073 1495996 1491211 1514628 1469081 1467638 1468117 1535856 1613498 1575791
13446 1575791 1487536 1372378 1424472 1456701 1393847 1442969 1468244 1439646 1457729 1411720 1378638
13435 1378638 1418128 1484319 1560569 1536394 1468732 1544498 1590501 1559567 1589413 1587792 1629850
13424 1629850 1594852 1511967 1538702 1498009 1479799 1496472 1462095 1498834 1514047 1488379 1516367
13413 1516367 1470227 1440453 1406635 1349834 1329751 1464020 1570556 1588473 1481584 1434223 1465176
$$ packed form
13493A402624K9257J2p558n1461k4613M2149j5522l0398R1159m7457m5188N7170
13481A400174Q2994j42368m0720J13586j2385k3512J915N0539l7329J5501n441
13470A402954j9327M5878o0965n614O7698J1884N3095q1391r4360J079Q2238j1732
13458A391437J01483N0401j5248l2077m785K3417m5547j443M79O7739P7642l7707
13446A575791q8255j15158N2094L2229o2854M9122K5275k8598J8083m6009l3082
13435A378638L9490O6191P6250k4175o7662P5766M6003l0934K9846j621M2058
13424A629850l4998q2885K6735m0693j8210J6673l4377L6739J5213k5668K7988
13413A516367m6140k9774l3818n6801k0083J34269J06536J7917j06889m7361L0953
$$ plain form
13402 1465176 1415687 1502813 1611055 1623226 1618598 1612378 1622972 1692177 1656574 1582179 1660727
13391 1660727 1718639 1643772 1607918 1577659 1671923 1684898 1574929 1566436 1552630 1518918 1518008 1538192
13379 1538192 1528997 1509316 1475054 1554214 1598004 1599232 1481296 1363746 1450130 1485062 1479586
13368 1479586 1420343 1413530 1436298 1470179 1454385 1480979 1515770 1566871 1555674 1475340 1484905 1540441
13356 1540441 1600226 1562784 1511000 1548130 1529360 1521972 1547481 1535785 1530162 1543767 1536254 1578969
13344 1578969 1600414 1598410 1636121 1642810 1562086 1522478 1499905 1526360 1562258 1589478 1607750 1636983
13332 1636983 1617418 1653310 1689097 1679618 1622265 1517684 1505614 1541809 1585839 1573956 1578400
13321 1578400 1581020 1555420 1618612 1646366 1635982 1596359 1640592 1602576 1569792 1517828 1646993
$$ packed form
13402A465176m9489Q7126J08242J2171m628o220J0594O9205l5603p4395P8548
13391A660727N7912p4867l5854l0259R4264J2975j09969q493j3806l3712r10K0184
13379A538192r195j9681l4262P9160M3790J228j17936j17550Q6384L4932n476
13368A479586n9243o813K2768L3881j5794K6594L4791N1101j1197q0334R565N5536
13356A540441N9785l7442n1784L7130j8770p388K5509j1696n623J3605p513M2715
13344A578969K1445k004L7711O689q0724l9608k2573K6455L5898K7220J8272K9233
13332A636983j9565L5892L5787r479n7353j04581j2070L6195M4030j1883M444
13321A578400K620k5600O3192K7754j0384l9623M4233l8016l2784n1964J29165
$$ plain form
13310 1646993 1647495 1660238 1648132 1615837 1602158 1557766 1528933 1537250 1533249 1555628 1612236 1729082
13298 1729082 1705435 1675791 1600766 1568075 1585202 1679690 1712018 1727332 1701260 1673672 1622664
13287 1622664 1551278 1601728 1652377 1770725 1726345 1680848 1607653 1536840 1623535 1650578 1629842
13276 1629842 1634197 1637336 1623307 1602396 1608432 1659894 1599741 1572744 1664112 1662833 1667708 1701509
13264 1701509 1726336 1793226 1742754 1671927 1616929 1611547 1665477 1738995 1711715 1664118 1635833
13253 1635833 1718451 1709476 1653457 1601946 1557545 1564885 1632760 1668460 1665686 1571517 1505452 1568062
13241 1568062 1680492 1758710 1664798 1611159 1726606 1751615 1636362 1643365 1615728 1624406 1680372
13230 1680372 1625139 1643219 1780012 1802195 1796864 1734372 1706759 1765350 1806766 1815148 1831025
$$ packed form
13310A646993N02J2743j2106l2295j3679m4392k8833Q317m001K2379N6608J16846
13298A729082k3647k9644p5025l2691J7127R4488L2328J5314k6072k7588n1008
13287A622664p1386N0450N0649J18348m4380m5497p3195p0813Q6695K7043k0736
13276A629842M355L139j4029k0911O036N1462o0153k6997R1368j279M875L3801
13264A701509K4827O6890n0472p0827n4998n382N3930P3518k7280m7597k8285
13253A635833Q2618q975n6019n1511m4401P340O7875L5700k774r4169o6065O2610
13241A568062J12430P8218r3912n3639J15447K5009j15253P003k7637Q678N5966
13230A680372n5233J8080J36793K2183n331o2492k7613N8591M1416Q382J5877
$$ plain form
13219 1831025 1834431 1826127 1880794 1819599 1784870 1706797 1571567 1538109 1548492 1599870 1569773
13208 1569773 1623348 1656803 1607534 1558262 1593092 1713729 1718798 1703289 1712922 1733896 1776224
13197 1776224 1789816 1740467 1640920 1619529 1621310 1582553 1577282 1599340 1679919 1713459 1751188 1752708
13185 1752708 1698719 1678761 1742470 1817965 1854785 1703586 1645055 1599910 1657684 1664629 1615805
13174 1615805 1652079 1658453 1609109 1643589 1628393 1668190 1706465 1699965 1697504 1733335 1747906 1763507
13162 1763507 1833035 1797777 1802681 1821990 1841682 1852166 1857216 1854414 1807268 1815794 1885888 1868899
13150 1868899 1804995 1768009 1792093 1874650 1888932 1915741 1993215 1967166 1957446 1986856 1972255
13139 1972255 1876030 1822488 1836678 1830698 1899821 1933515 1871701 1821644 1824773 1801935 1787570 1728128
$$ packed form
13219A831025L406q304N4667o1195l4729p8073j35230l3458J0383N1378l0097
13208A569773N3575L3455m9269m9272L4830J20637N069j5509R633K0974M2328
13197A776224J3592m9349r9547k1391J781l8757n271K2058Q0579L3540L7729J520
13185A752708n3989j9958O3709P5495L6820j51199n8531m5145N7774O945m8824
13174A615805L6274O374m9344L4480j5196L9797L8275o500k461L5831J4571J5601
13162A763507O9528l5258M904J9309J9692J0484N050k802m7146Q526P0094j6989
13150A868899o3904l6986K4084Q2557J4282K6809P7474k6049r720K9410j4601
13139A972255r6225n3542J4190n980O9123L3694o1814n0057L129k2838j4365n9442
$$ plain form
13127 1728128 1718798 1778453 1824193 1789964 1732218 1792957 1738211 1797468 1832635 1829699 1812252 1815805
13115 1815805 1750410 1710780 1751397 1798000 1799463 1758334 1789590 1837646 1796901 1779775 1764847
13104 1764847 1731849 1743333 1740636 1735123 1736118 1741762 1673344 1734120 1710425 1706881 1731724 1722735 1749405
13091 1749405 1759393 1878016 1889479 1904680 1897555 1844690 1788465 1791859 1904952 1924047 1850737
13080 1850737 1804953 1859029 1902761 1882105 1812016 1862072 1864016 1884280 1916625 1959043 1965616 2023459
13068 2023459 1973491 1867889 1859493 1899429 1903507 1943724 1929977 1867250 1860001 1843419 1821653 1793905
13056 1793905 1867260 1897050 1856429 1821766 1794338 1740872 1794269 1835773 1847629 1883457 2007041
13045 2007041 2033977 2067446 1974089 1882743 1854242 1862564 1930949 1973860 2007232 2023037 1954118
$$ packed form
13127A728128r330N9655M5740l4229n7746O0739n4746N9257L5167k936j7447L553
13115A815805o5395l9630M0617M6603J463m1129L1256M8056m0745j7126j4928
13104A764847l2998J1484k697n513R95N644o8418O0776k3695l544K4843q989K6670
13091A749405R988J18623J1463J5201p125n2865n6225L394J13093J9095p3310
13080A850737m5784N4076M3732k0656p0089N0056J944K0264L2345M2418O573N7843
13068B023459m9968j05602q396L9936M078M0217j3747o2727p249j6582k1766k7748
13056A793905P3355K9790m0621l4663k7428n3466N3397M1504J1856L5828J23584
13045B007041K6936L3469r3357r1346k8501Q322O8385M2911L3372J5805o8919
$$ plain form
13034 1954118 1890780 1915371 1886435 1786193 1818119 1905619 1922327 1915877 1944157 1977499 1989442
13023 1989442 2001746 1954068 1948546 1966581 1980941 2000711 1962906 1990870 1975264 1884520 1877904 1919633
13011 1919633 1887045 1853072 1910141 1968812 1980778 1979464 1940071 1955865 1980933 1961808 1993038
13000 1993038 2028471 1975126 2003731 2024540 2029096 1995406 1985929 1935503 1954445 2116214 2139047
12989 2139047 2041096 1957019 1945669 1957068 1978586 2023055 2068739 2119466 2156019 2106317 2057552
12978 2057552 2121198 2176208 2057087 1927606 1882435 1931721 1971717 2020251 2056905 2051916 2038258
12967 2038258 2035333 2052419 2086721 2075540 2035799 2047760 2042489 2008053 2013887 2092354 2187523 2206992
12955 2206992 2197081 2153910 2134139 2164655 2112308 2077418 2044202 2019482 2066501 2091639 2145503
$$ packed form
13034A954118o3338K4591k8936j00242L1926Q7500J6708o450K8280L3342J1943
13023A989442J2304m7678n522J8035J4360J9770l7805K7964j5606r0744o616M1729
13011A919633l2588l3973N7069N8671J1966j314l9393J5794K5068j9125L1230
13000A993038L5433n3345K8605K0809M556l3690r477n0426J8942J61769K2833
12989B139047r7951q4077j1350J1399K1518M4469M5684N0727L6553m9702m8765
12978B057552O3646N5010j19121j29481m5171M9286L9996M8534L6654m989j3658
12967B038258k925J7086L4302j1181l9741J1961n271l4436N834P8467R5169J9469
12955B206992r911m3171j9771L0516n2347l4890l3216k4720M7019K5138N3864
$$ plain form
12944 2145503 2180892 2182883 2260620 2261137 2265116 2215888 2201281 2160580 2133132 2134925 2138316 2068881
12932 2068881 2039205 2109237 2141350 2156833 2160032 2144823 2257239 2312672 2257785 2216418 2232402
12921 2232402 2211760 2197166 2182097 2051361 2049389 2124506 2208598 2161423 2092938 2030618 2041963
12910 2041963 2067002 2057640 2056200 2039209 2081932 2100148 2089160 2122562 2097657 2114311 2147840 2162849
12898 2162849 2133399 2132648 2061350 2099805 2152228 2260976 2267276 2262332 2245328 2250072 2169997 2107723
12886 2107723 2031942 2072838 2078883 1969481 2028990 2045896 2077596 2122840 2176120 2217804 2210997
12875 2210997 2128048 2165266 2169555 2172907 2168882 2152639 2164220 2188418 2287131 2311777 2246024 2225962
12863 2225962 2211537 2219573 2254250 2269287 2230171 2271027 2348720 2407026 2338353 2401102 2489610
$$ packed form
12944B145503L5389J991P7737N17L979m9228j4607m0701k7448J793L391o9435
12932B068881k9676P0032L2113J5483L199j5209J12416N5433n4887m1367J5984
12921B232402k0642j4594j5069j30736j972P5117Q4092m7175o8485o2320J1345
12910B041963K5039r362j440j6991M2723J8216j0988L3402k4905J6654L3529J5009
12898B162849k9450p51p1298L8455N2423J08748O300m944j7004M744q0075o2274
12886B107723p5781M0896O045j09402N9509J6906L1700M5244N3280M1684o807
12875B210997q2949L7218M289L352m025j6243J1581K4198R8713K4646o5753k0062
12863B225962j4425Q036L4677J5037l9116M0856P7693N8306o8673O2749Q8508
$$ plain form
12852 2489610 2487110 2390031 2332882 2375323 2390800 2393676 2504328 2558851 2507488 2466414 2413881
12841 2413881 2415276 2424208 2367332 2268878 2182590 2149005 2182936 2221734 2290957 2364445 2397035 2403462
12829 2403462 2406766 2369864 2318247 2371094 2383555 2288610 2323846 2338511 2348388 2341604 2305686 2332897
12817 2332897 2344963 2334783 2344066 2374023 2441156 2535762 2509756 2450113 2391683 2309968 2278135
12806 2278135 2307623 2356875 2480526 2534640 2491618 2390854 2390049 2411320 2394992 2372854 2335704
12795 2335704 2389196 2485416 2422342 2315157 2332910 2379017 2377381 2444813 2451267 2446699 2425006 2411591
12783 2411591 2338085 2415935 2479642 2440376 2406865 2370370 2331723 2411966 2454854 2437011 2444496
12772 2444496 2419098 2387623 2328347 2294632 2327357 2410252 2443513 2511174 2547829 2521177 2441435
$$ packed form
12852B489610k500r7079n7149M2441J5477K876J10652N4523n1363m1074n2533
12841B413881J395Q932n6876r8454q6288l3585L3931L8798O9223P3488L2590O427
12829B403462L304l6902n1617N2847J2461r4945L5236J4665R877o784l5918K7211
12817B332897J2066j0180R283K9957O7133R4606k6006n9643n8430q1715l1833
12806B278135K9488M9252J23651N4114m3022j00764q05K1271j6328k2138l7150
12795B335704N3492R6220o3074j07185J7753M6107j636O7432O454m568k1693j3415
12783B411591p3506P7850O3707l9266l3511l6495l8647Q0243M2888j7843P485
12772B444496k5398l1475n9276l3715L2725Q2895L3261O7661L6655k6652p9742
$$ plain form
12761 2441435 2445393 2433192 2497480 2477111 2442173 2570846 2608672 2655983 2616111 2627849 2634790
12750 2634790 2629716 2627041 2618686 2627798 2637485 2582505 2554851 2563137 2599469 2580489 2655783 2772651
12738 2772651 2770684 2675848 2595266 2525496 2496364 2565125 2571533 2580661 2656391 2698211 2562004 2560324
12726 2560324 2571952 2597754 2627644 2657851 2656397 2631067 2604366 2650420 2659392 2634675 2578165 2562118
12714 2562118 2663421 2707335 2659554 2595244 2605395 2658584 2762693 2726966 2697848 2734903 2698370
12703 2698370 2643761 2683305 2764699 2800311 2806755 2849565 2820647 2774018 2760185 2691152 2651652
12692 2651652 2611889 2627903 2654713 2662264 2630976 2529531 2555609 2637307 2715968 2721493 2717686 2758899
12680 2758899 2800125 2710865 2658574 2649107 2688938 2721319 2715666 2733017 2764229 2711521 2717828 2720344
$$ packed form
12761B441435L958j2201O4288k0369l4938J28673L7826M7311l9872J1738O941
12750B634790n074k675q355R112R687n4980k7654Q286L6332j8980P5294J16868
12738B772651j967r4836q0582o9770k9132O8761O408R128P5730M1820j36207j680
12726B560324J1628K5802K9890L0207j454k5330k6701M6054Q972k4717n6510j6047
12714B562118J01303M3914m7781o4310J0151N3189J04109l5727k9118L7055l6533
12703B698370n4609L9544Q1394L5612O444M2810k8918m6629j3833o9033l9500
12692B651652l9763J6014K6810P551l1288j01445K6078Q1698P8661N525l807M1213
12680B758899M1226q9260n2291r467L9831L2381n653J7351L1212n2708O307K516
$$ plain form
12668 2720344 2795595 2749086 2789220 2790989 2789486 2829260 2862673 2830054 2792877 2837626 2817845 2786748
12656 2786748 2804735 2828730 2796860 2787816 2796148 2868016 2881041 2824274 2744435 2774881 2798128 2817983
12644 2817983 2823775 2845103 2896646 2883303 2805997 2802013 2835261 2863628 2856733 2892441 2903756 2914501
12632 2914501 2906712 2874792 2815889 2803333 2820538 2802648 2882435 3002873 3103000 2998893 2983987
12621 2983987 3004873 2974265 2929183 2931478 2904549 2852775 2822346 2836796 2883157 2893691 2941096
12610 2941096 2930109 2895544 2855911 2899108 3032718 3170354 3177429 3142643 3052412 2933979 2977510
12599 2977510 3052254 3072425 3090008 3139682 3197210 3185699 3140124 3143946 3120424 3140403 3089217
12588 3089217 3148666 3163773 3114916 3109816 3157283 3096363 3103913 3162524 3150895 3184927 3278026 3281096
$$ packed form
12668B720344P5251m6509M0134J769j503L9774L3413l2619l7177M4749j9781l1097
12656B786748J7987K3995l1870r044Q332P1868J3025n6767p9839L0446K3247J9855
12644B817983N792K1328N1543j3343p7306l984L3248K8367o895L5708J1315J0745
12632B914501p789l1920n8903j2556J7205j7890P9787J20438J00127j04107j4906
12621B983987K0886l0608m5082K295k6929n1774l0429J4450M6361J0534M7405
12610B941096j0987l4565l9633M3197J33610J37636P075l4786r0231j18433M3531
12599B977510P4744K0171J7583M9674N7528j1511m5575L822k3522J9979n1186
12588C089217N9449J5107m8857n100M7467o0920P550N8611j1629L4032R3099L070
$$ plain form
12576 3281096 3257841 3286842 3345697 3284656 3243991 3174728 3145615 3152915 3169590 3206154 3246675
12565 3246675 3257951 3254269 3235721 3209988 3180408 3210058 3186165 3137230 3187623 3237510 3350863
12554 3350863 3308157 3292400 3211387 3202472 3291894 3297811 3279656 3327353 3254909 3191984 3218924 3125112
12542 3125112 3069997 3030413 3110437 3174000 3203969 3311242 3373769 3409088 3419847 3383642 3311646
12531 3311646 3326178 3393204 3386276 3332621 3300895 3353792 3390639 3331144 3265107 3315441 3353457
12520 3353457 3362764 3325140 3328857 3352044 3392839 3417266 3335654 3295932 3295603 3387142 3373592 3343349
12508 3343349 3404518 3403353 3396455 3425279 3452703 3508404 3515773 3424764 3369878 3340246 3386774 3366112
12496 3366112 3321442 3378727 3387668 3384788 3431023 3522787 3561737 3494949 3476905 3511241 3524400 3530501
$$ packed form
12576C281096k3255K9001N8855o1041m0665o9263k9113P300J6675L6564M0521
12565C246675J1276l682j8548k5733k9580K9650k3893m8935N0393M9887J13353
12554C350863m2706j5757q1013q915Q9422N917j8155M7697p2444o2925K6940r3812
12542C125112n5115l9584Q0024O3563K9969J07273O2527L5319J0759l6205p1996
12531C311646J4532O7026o928n3655l1726N2897L6847n9495o6037N0334L8016
12520C353457R307l7624L717K3187M0795K4427q1612l9722l29R1539j3550l0243
12508C343349O1169j165o898K8824K7424N5701P369r1009n4886k9632M6528k0662
12496C366112m4670N7285Q941k880M6235R1764L8950o6788j8044L4336J3159O101
$$ plain form
12484 3530501 3542225 3548280 3533584 3491486 3441521 3450774 3554693 3574263 3602553 3579171 3558594
12473 3558594 3561694 3512672 3497012 3492569 3562393 3609395 3594797 3634892 3627034 3611906 3544828 3516868
12461 3516868 3641759 3642519 3612235 3622664 3683159 3789754 3763260 3712345 3663081 3654385 3668420
12450 3668420 3636048 3609348 3606760 3617905 3615315 3656231 3721009 3733569 3748559 3719081 3764141 3793182
12438 3793182 3761174 3734879 3743453 3734767 3701321 3706859 3712085 3643270 3670245 3715517 3772761 3812856
12426 3812856 3887146 3814794 3714690 3714108 3721091 3760950 3767353 3768129 3768961 3820288 3842914 3899487 3914625
12413 3914625 3981475 3946894 3911077 3925013 3966270 3948441 3950780 3955565 3932659 3954151 3964368 3931380
12401 3931380 3938955 3966563 4018247 4058174 3977530 3967467 4004375 3935500 3929160 3891835 3829427 3892613
$$ packed form
12484C530501J1724O055j4696m2098m9965R253J03919J9570K8290k3382k0577
12473C558594L100m9022j5660m443O9824M7002j4598M0095p858j5128o7078k7960
12461C516868J24891P60l0284J0429O0495J06595k6494n0915m9264q696J4035
12450C668420l2372k6700k588J1145k590M0916O4778J2560J4990k9478M5060K9041
12438C793182l2008k6295Q574q686l3446N538N226o8815K6975M5272N7244M0095
12426C812856P4290p2352j00104n82O983L9859O403P76Q32N1327K2626N6573J5138
12413C914625O6850l4581l5817J3936M1257j7829K339M785k2906K1492J0217l2988
12401C931380P575K7608N1684L9927q0644j0063L6908o8875o340l7325o2408O3186
$$ plain form
12389 3892613 3927387 3937427 3932688 3986088 4009729 4036507 4120253 4204338 4168884 4194692 4235027
12378 4235027 4210155 4155241 4127697 4201078 4260588 4272777 4292535 4170147 4145138 4186247 4202603
12367 4202603 4200981 4222208 4224478 4304386 4272982 4292671 4288801 4235203 4107864 4223848 4253609
12356 4253609 4292753 4294100 4282142 4328960 4331975 4308011 4372712 4511707 4471537 4437960 4427403
12345 4427403 4387565 4327620 4342432 4396092 4422650 4363522 4356205 4428909 4513208 4574607 4584734
12334 4584734 4591241 4673656 4635395 4541213 4583775 4654122 4621817 4627583 4560137 4533714 4584175 4644547
12322 4644547 4572199 4528198 4502558 4520528 4611584 4640580 4726602 4692558 4631468 4704256 4743292
12311 4743292 4739835 4760562 4765462 4703611 4726593 4753465 4793986 4740273 4735113 4764726 4818685 4818970
$$ packed form
12389C892613L4774J0040m739N3400K3641K6778Q3746Q4085l5454K5808M0335
12378D235027k4872n4914k7544P3381N9510J2189J9758j22388k5009M1109J6356
12367D202603j622K1227K270P9908l1404J9689l870n3598j27339J15984K9761
12356D253609L9144J347j1958M6818L015k3964O4701J38995m0170l3577j0557
12345D427403l9838n9945J4812N3660K6558n9128p317P2704Q4299O1399J0127
12334D584734O507Q2415l8261r4182M2562P0347l2305N766o7446k6423N0461O0372
12322D644547p2348m4001k5640J7970R1056K8996Q6022l4044o1090P2788L9036
12311D743292l457K0727M900o1851K2982K6872M0521n3713n160K9613N3959K85
$$ plain form
12299 4818970 4929552 4909220 4888505 4981484 4946172 4834828 4878578 4978996 5027343 4963583 4916968
12288 4916968 4929530 4960798 5035858 5137882 5071053 4973986 4986610 5020414 5029021 5053134 5090469
12277 5090469 5132141 5146921 5193754 5252988 5243386 5192548 5259784 5296234 5338951 5359311 5303800
12266 5303800 5344492 5362108 5419179 5497892 5465174 5335592 5339174 5357815 5426761 5496455 5495126
12255 5495126 5529031 5551622 5566048 5499306 5471678 5429978 5430782 5474431 5534623 5531338 5539242 5556259
12243 5556259 5607315 5527949 5533896 5623529 5669510 5667682 5663995 5718430 5711838 5784810 5820692 5844134
12231 5844134 5837203 5879011 5859057 5753784 5563773 5538347 5569321 5537212 5609552 5690767 5813950
12220 5813950 5869376 5867895 5883616 5938342 6017247 6019776 6125911 6193111 6100743 6072546 6098960
$$ packed form
12299D818970J10582k0332k0715R2979l5312j11344M3750J00418M8347o3760m6615
12288D916968J2562L1268P5060J02024o6829r7067J2624L3804Q607K4113L7335
12277E090469M1672J4780M6833N9234r602n0838O7236L6450M2717K0360n5511
12266E303800M0692J7616N7071P8713l2718j29582L582J8641O8946O9694j329
12255E495126L3905K2591J4426o6742k7628m1700Q04M3649O0192l285P904J7017
12243E556259N1056p9366N947Q9633M5981j828l687N4435o592P2972L5882K3442
12231E844134o931M1808j9954j05273j90011k5426L0974l2109P2340Q1215J23183
12220E813950N5426j481J5721N4726P8905K529J06135O7200r2368k8197K6414
$$ plain form
12209 6098960 6159444 6203590 6201813 6207603 6251890 6260398 6307885 6317606 6310399 6314604 6343576 6409430
12197 6409430 6503216 6464913 6445247 6519679 6583061 6636843 6624014 6598294 6643306 6618068 6668750
12186 6668750 6655187 6668146 6609220 6653751 6658976 6622786 6677889 6716098 6793952 6876699 6919528
12175 6919528 6909365 6890110 6939320 7028676 7043939 6947549 6831865 6863109 6926153 6984216 7025900
12164 7025900 7054338 7056103 7068365 7050883 7085480 7090140 7056185 7051660 7096327 7098275 7151629 7340158
12152 7340158 7440276 7415453 7440840 7443298 7503754 7636806 7698776 7690375 7631406 7579920 7612969
12141 7612969 7598718 7632696 7811822 7951229 7930081 7909509 7965980 8027475 8090367 8106423 8026080
12130 8026080 8016138 8165045 8195751 8169024 8198188 8279221 8312950 8309507 8373508 8448037 8508290
$$ packed form
12209F098960O0484M4146j777N790M4287Q508M7487R721p207M205K8972O5854
12197F409430R3786l8303j9666P4432O3382N3782j2829k5720M5012k5238N0682
12186F668750j3563J2959n8926M4531N225l6190N5103L8209P7854Q2747M2829
12175F919528j0163j9255M9210Q9356J5263r6390j15684L1244O3044N8063M1684
12164G025900K8438J765J2262j7482L4597M660l3955m525M4667J948N3354J88529
12152G340158J00118k4823K5387K458O0456J33052O1970q401n8969n1486L3049
12141G612969j4251L3978J79126J39407k1148k0572N6471O1495O2892J6056q0343
12130H026080r942J48907L0706k6727K9164Q1033L3729l443O4001P4529O0253
$$ plain form
12119 8508290 8460136 8436096 8499611 8543022 8663638 8686684 8626126 8691504 8742275 8734720 8796004
12108 8796004 8859804 8835762 8863587 8959321 9074129 9122694 9247525 9211348 9280279 9379660 9311142
12097 9311142 9350629 9463977 9598128 9598629 9663386 9652390 9675692 9604348 9634539 9820672 9892389
12086 9892389 9968286 9990950 9987128 10040330 10066118 10162963 10313001 10387449 10330791 10321263 10346588
12075 10346588 10385462 10448969 10504083 10663558 10723749 10742517 10832058 10849183 10886766 10947542 11097009
12064 11097009 11297875 11384961 11440622 11501100 11560156 11647193 11758826 11801293 11846901 11892999 11976811
12053 11976811 12080985 12187982 12164599 12297628 12420434 12442343 12515608 12520826 12663864 12793790
12043 12793790 12750479 12554996 12405391 12496396 12692876 12817844 12918192 13106773 13261396 13432267
$$ packed form
12119H508290m8154k4040O3515M3411J20616K3046o0558O5378N0771p555O1284
12108H796004O3800k4042K7825R5734J14808M8565J24831l6177O8931R9381o8518
12097I311142L9487J13348J34151N01O4757j0996K3302p1344L0191J86133P1717
12086I892389P5897K2664l822N3202K5788R6845J50038P4448n6658r528K5325
12075A0346588L8874O3507N5114J59475O0191J8768Q9541J7125L7583O0776J49467
12064A1097009K00866Q7086N5661O0478N9056Q7037J11633M2467M5608M6098Q3812
12053A1976811J04174J06997k3383J33029J22806K1909P3265N218J43038J29926
12043A2793790m3311j95483j49605R1005J96480J24968J00348J88581J54623J70871
$$ plain form
12033 13432267 13637296 13828896 14007459 14159282 14237341 14338485 14483753 14602163 14707396
12024 14707396 14873953 15018829 15178420 15349168 15505497 15683567 15845243 15922934 16015475 16229257
12014 16229257 16468701 16610956 16771406 16933167 17170215 17398497 17535548 17586066 17742743
12005 17742743 17887392 18121386 18326370 18464908 18635438 18877660 19082591 19313676 19506508
11996 19506508 19800071 20033911 20339554 20716012 20969053 21126441 21354696 21739710 22010834
11987 22010834 22332820 22646827 22916000 23238233 23599204 23909964 24224119 24598268 25037578
11978 25037578 25523528 25926755 26335019 26803135 27291019 27743127 28240093 28672042 29202873
11969 29202873 29733164 30270414 30903375 31562783 32152522 32814503 33547970 34251972 35016217
$$ packed form
12033A3432267K05029J91600J78563J51823P8059J01144J45268J18410J05233
12024A4707396J66557J44876J59591J70748J56329J78070J61676P7691R2541K13782
12014A6229257K39444J42255J60450J61761K37048K28282J37051N0518J56677
12005A7742743J44649K33994K04984J38538J70530K42222K04931K31085J92832
11996A9506508K93563K33840L05643L76458K53041J57388K28255L85014K71124
11987B2010834L21986L14007K69173L22233L60971L10760L14155L74149M39310
11978B5037578M85950M03227M08264M68116M87884M52108M96966M31949N30831
11969B9202873N30291N37250O32961O59408N89739O61981P33467P04002P64245
$$ plain form
11960 35016217 35827462 36738000 37641159 38513278 39508916 40527100 41635000 42851950 44087663
11951 44087663 45355942 46703618 48100487 49626958 51354706 53137380 55029009 57092010
11943 57092010 59217089 61527037 64136708 67118888 70337819 73849504 77719135 81924573
11935 81924573 86557564 91803945 97661745 104220857 111748714 120521339 130804275 143033481
11927 143033481 157643866 175182079 196590321 222306159 251672966 280754602 296962595
11920 296962595 272482937 162569748 -42152157 -220968829 -282294034 -274506087 -247748671
11913 -247748671 -220306976 -196315259 -175976952 -158928235 -144594091 -132529719 -122070576
11906 -122070576 -113036107 -105090685 -98061930 -91927977 -86499027 -81703536 -77372373 -73484580
$$ packed form
11960C5016217Q11245R10538R03159Q72119R95638J018184J107900J216950J235713
11951D4087663J268279J347676J396869J526471J727748J782674J891629K063001
11943E7092010K125079K309948K609671K982180L218931L511685L869631M205438
11935H1924573M632991N246381N857800O559112P527857Q772625J0282936J2229206
11927A43033481J4610385J7538213K1408242K5715838K9366807K9081636J6207993
11920B96962595k4479658j09913189k04721905j78816672o1325205P787947K6757416
11913b47748671K7441695K3991717K0338307J7048717J4334144J2064372J0459143
11906a22070576R034469P945422P028755O133953N428950M795491M331163L887793
$$ plain form
11898 -73484580 -69935511 -66774680 -63850740 -61208864 -58716711 -56368938 -54187027 -52172268
11890 -52172268 -50295333 -48529064 -46913040 -45319762 -43795321 -42505919 -41350901 -40127904
11882 -40127904 -38977217 -37951391 -36928659 -35865547 -34907134 -34062027 -33285072 -32578405 -31836084
11873 -31836084 -31070795 -30287293 -29666217 -29161544 -28536978 -27884036 -27312224 -26744818 -26146756
11864 -26146756 -25580083 -25106793 -24684472 -24224351 -23764131 -23267753 -22772136 -22345323 -22025905
11855 -22025905 -21721305 -21338238 -20946508 -20606907 -20365560 -20102971 -19818605 -19584859 -19257355
11846 -19257355 -18867788 -18494772 -18174399 -17918748 -17715830 -17399768 -17150946 -16878473 -16593381
11837 -16593381 -16439868 -16337113 -16222747 -16059163 -15845753 -15614984 -15384517 -15084395 -14875664
$$ packed form
11898g3484580L549069L160831K923940K641876K492153K347773K181911K014759
11890e2172268J876935J766269J616024J593278J524441J289402J155018J222997
11882d0127904J150687J025826J022732J063112R58413Q45107P76955P06667P42321
11873c1836084P65289P83502O21076N04673O24566O52942N71812N67406N98062
11864b6146756N66673M73290M22321M60121M60220M96378M95617M26813L19418
11855b2025905L04600L83067L91730L39601K41347K62589K84366K33746L27504
11846a9257355L89567L73016L20373K55651K02918L16062K48822K72473K85092
11837a6593381J53513J02755J14366J63584K13410K30769K30467L00122K08731
$$ plain form
11828 -14875664 -14644610 -14402926 -14276734 -14049054 -13882322 -13726759 -13546903 -13348972 -13181616
11819 -13181616 -13156444 -13055687 -12943953 -12795326 -12602698 -12433961 -12348815 -12203924 -12162636 -12059527
11809 -12059527 -11837715 -11747236 -11684891 -11522660 -11396698 -11234059 -11106982 -11052759 -11038404 -10950934
11799 -10950934 -10804154 -10729483 -10797167 -10928084 -10916338 -10635601 -10333065 -10100116 -10021473 -9993299
11789 -9993299 -9918191 -9852884 -9742083 -9641327 -9529073 -9447797 -9376294 -9305272 -9152393 -9094100
11779 -9094100 -8991820 -8827626 -8767255 -8671418 -8622829 -8609590 -8546140 -8464159 -8338707 -8250719 -8201815
11768 -8201815 -8131168 -8053609 -8017873 -7908068 -7797565 -7757254 -7733216 -7689142 -7536247 -7438922 -7527336
11757 -7527336 -7600840 -7576122 -7397808 -7374207 -7367039 -7246778 -7130629 -7131205 -7092653 -6999889 -6915650
$$ packed form
11828a4875664K31054K41684J26192K27680J66732J55563J79856J97931J67356
11819a3181616K5172J00757J11734J48627J92628J68737Q5146J44891M1288J03109
11809a2059527K21812R0479O2345J62231J25962J62639J27077N4223J4355Q7470
11799a0950934J46780P4671o7684j30917J1746K80737L02536K32949P8643K8174
11789i993299P5108O5307J10801J00756J12254Q1276P1503P1022J52879N8293
11779i094100J02280J64194O0371R5837M8589J3239O3450Q1981J25452Q7988M8904
11768h201815P0647P7559L5736J09805J10503M0311K4038M4074J52895R7325q8414
11757g527336p3504K4718J78314K3601P168J20261J16149n76L8552R2764Q4239
$$ plain form
11746 -6915650 -6846448 -6759107 -6719202 -6705316 -6580721 -6424500 -6433854 -6453872 -6384719 -6369157 -6284022
11735 -6284022 -6202074 -6118389 -6170437 -6193923 -6227620 -6265773 -6278259 -6219955 -6105528 -5996909 -5927390
11724 -5927390 -5838411 -5787408 -5722820 -5679921 -5626153 -5613744 -5672698 -5639219 -5555449 -5593900 -5640468
11713 -5640468 -5557610 -5495106 -5369223 -5281628 -5343790 -5321976 -5224078 -5150048 -5122925 -5171174 -5067173
11702 -5067173 -4994318 -5014078 -4998183 -4927126 -4911566 -4916201 -4910896 -4891966 -4866079 -4768370 -4642916
11691 -4642916 -4622922 -4625399 -4583622 -4600593 -4567438 -4530858 -4432323 -4438951 -4402580 -4326639 -4271785 -4256451
11679 -4256451 -4322824 -4366858 -4347891 -4394630 -4288811 -4214053 -4074136 -4079997 -4043462 -4056381 -4152238
11668 -4152238 -4146442 -4113889 -4081095 -4061417 -4052462 -3925399 -3894122 -3900505 -3888129 -3886515 -3900238 -3915542
$$ packed form
11746f915650O9202Q7341L9905J3886J24595J56221r354k0018O9153J5562Q5135
11735f284022Q1948Q3685n2048k3486l3697l8153j2486N8304J14427J08619O9519
11724e927390Q8979N1003O4588M2899N3768J2409n8954L3479Q3770l8451m6568
11713e640468Q2858O2504J25883Q7595o2162K1814R7898P4030K7123m8249J04001
11702e067173P2855j9760J5895P1057J5560m635N305J8930K5887R7709J25454
11691d642916J9994k477M1777j6971L3155L6580R8535o628L6371P5941N4854J5334
11679d256451o6373m4034J8967m6739J05819P4758J39917n861L6535j2919r5857
11668d152238N796L2553L2794J9678Q955J27063L1277o383J2376J614j3723j5304
$$ plain form
11656 -3915542 -3902256 -3958356 -3921243 -3833875 -3770094 -3730701 -3734731 -3719720 -3706878 -3658333 -3621711
11645 -3621711 -3637335 -3607902 -3583669 -3519675 -3514831 -3513636 -3485482 -3411286 -3417136 -3426890 -3359795 -3272611
11633 -3272611 -3177725 -3190093 -3256399 -3270325 -3186809 -3118888 -3116976 -3071499 -3091583 -3180819 -3242926
11622 -3242926 -3203118 -3124905 -3115120 -3021766 -2989364 -2957352 -2948248 -2999310 -3007270 -3022531 -3193563 -3239102
11610 -3239102 -3162227 -3014971 -2928691 -2960668 -2938608 -2910530 -2882670 -2836977 -2761444 -2671549 -2650998
11599 -2650998 -2612485 -2569816 -2651221 -2659085 -2645238 -2583191 -2537878 -2524461 -2515985 -2481240 -2442475 -2405815
11587 -2405815 -2402072 -2379839 -2463103 -2440971 -2394828 -2389622 -2333582 -2332652 -2282629 -2203225 -2170860 -2106868
11575 -2106868 -2138153 -2235867 -2246059 -2205257 -2083357 -2079404 -2100986 -2074685 -2055378 -2059531 -2082573
$$ packed form
11656c915542J3286n6100L7113Q7368O3781L9393m030J5011J2842M8545L6622
11645c621711j5624K9433K4233O3994M844J195K8154P4196n850r754O7095Q7184
11633c272611R4886j2368o6306j3926Q3516O7921J912M5477k0084q9236o2107
11622c242926L9808P8213R785R3354L2402L2012R104n1062p960j5261j71032m5539
11610c239102P6875J47256Q6280l1977K2060K8078K7860M5693P5533Q9895K0551
11599b650998L8513M2669q1405p864J3847O2047M5313J3417Q476L4745L8765L6660
11587b405815L743K2233q3264K2132M6143N206N6040R30N0023P9404L2365O3992
11575b106868l1285r7714j0192M0802J21900L953k1582K6301J9307m153k3042
$$ plain form
11564 -2082573 -2101803 -2090595 -2071677 -2068839 -2073938 -2124908 -2125954 -2114277 -2084309 -2079599 -2078834 -2003694
11552 -2003694 -1975180 -1967435 -1997098 -2004579 -1977212 -1880854 -1874632 -1836055 -1838079 -1860843 -1795619 -1705031
11540 -1705031 -1675679 -1708771 -1667193 -1717305 -1779606 -1768877 -1733312 -1684507 -1674427 -1651760 -1648110
11529 -1648110 -1653026 -1548864 -1414795 -1457699 -1507361 -1519188 -1501398 -1530524 -1563456 -1514326 -1490415
11518 -1490415 -1410469 -1359925 -1467111 -1553405 -1470888 -1408012 -1377900 -1369055 -1442942 -1532969 -1549312
11507 -1549312 -1510241 -1436652 -1420577 -1414755 -1391168 -1370687 -1413086 -1424552 -1410694 -1323945 -1181757
11496 -1181757 -1145776 -1227883 -1267251 -1234658 -1211545 -1201051 -1210116 -1202517 -1199017 -1249015 -1283555 -1302848
11484 -1302848 -1278486 -1210678 -1210055 -1269361 -1246632 -1271891 -1294876 -1349326 -1325384 -1267619 -1147761
$$ packed form
11564b082573j9230J1208J8918K838n099n0970j046J1677K9968M710P65P5140
11552b003694K8514P745k9663p481K7367R6358O222L8577k024k2764O5224R0588
11540a705031K9352l3092M1578n0112o2301J0729L5565M8805J0080K2667L650
11529a648110m916J04162J34069m2904m9662j1827J7790k9126l2932M9130K3911
11518a490415P9946N0544j07186q6294Q2517O2876L0112Q845p3887r0027j6343
11507a549312L9071P3589J6075N822K3587K0481m2399j1466J3858Q6749J42188
11496a181757L5981q2107l9368L2593K3113J0494r065P599L500m9998l4540j9293
11484a302848K4362O7808O23n9306K2729k5259k2985n4450K3942N7765J19858
$$ plain form
11473 -1147761 -912578 -862899 -865670 -844143 -856790 -917534 -911677 -906673 -848036 -807575 -870112 -865089
11461 -865089 -864855 -940257 -927707 -824771 -799333 -837437 -884001 -850372 -770442 -701651 -718740 -760566
11449 -760566 -822373 -827305 -777543 -812823 -814064 -739557 -744241 -742394 -626928 -625873 -651460 -698710
11437 -698710 -776758 -784099 -685661 -632406 -636621 -738903 -754611 -759081 -662926 -579158 -557303 -569617
11425 -569617 -545698 -536676 -492832 -454450 -420755 -434862 -432008 -404221 -437574 -440785 -385508 -388796
11413 -388796 -361150 -298073 -277223 -239968 -281594 -354857 -387736 -294994 -215621 -225255 -318012 -368562
11401 -368562 -296745 -274979 -272748 -262257 -208021 -282051 -276304 -250521 -213513 -258350 -211480 -149681
11389 -149681 -140609 -108239 -108972 -160579 -136944 -171309 -201746 -254566 -255520 -164009 -66509 -27793
$$ packed form
11473a147761K35183M9679k771K1527j2647o0744N857N004N8637M0461o2537N023
11461h65089K34p5402J2550J02936K5438l8104m6564L3629P9930O8791j7089m1826
11449g60566o1807m932M9762l5280j241P4507m684J847J15466J055k5587m7250
11437f98710p8048p341R8438N3255m215j02282j5708m470R6155Q3768K1855j2314
11425e69617K3919R022M3844L8382L3695j4107K854K7787l3353l211N5277l288
11413c88796K7646O3077K0850L7255m1626p3263l2879R2742P9373r634r2757n0550
11401c68562P1817K1766K231J0491N4236p4030N747K5783L7008m4837M6870O1799
11389a49681R072L2370p33n1607K3635l4365l0437n2820r54R1511R7500L8716
$$ plain form
11377 -27793 -88110 -168381 -208437 -86650 -6211 -17505 40572 77718 -11222 -20748 -50097 -93803
11365 -93803 -96678 -50275 -13513 24616 3427 -54321 -62312 -60997 -65310 -7080 54732 88633
11353 88633 108336 173097 123865 118398 130953 119629 176981 149647 133568 145124 206373 211737
11341 211737 236061 179437 111718 153901 227469 263403 268041 282513 273269 263127 299944 342801
11329 342801 289440 269209 380446 408598 354187 343404 379732 325022 336718 395482 336514
11318 336514 384375 513192 538921 394580 318540 335268 337957 352185 383973 459078 470478
11307 470478 408680 372492 366594 443703 592668 647938 592103 568823 598356 598110 569047 563074
11295 563074 609837 665173 706542 751195 724259 704758 611516 501801 448860 512399 613705
$$ packed form
11377b7793o0317q0271m0056J21787Q0439j1294N8077L7146q8940r526k9349m3706
11365i3803k875M6403L6762L8129k1189n7748p991J315m313N8230O1812L3901
11353H8633J9703O4761m9232n467J2555j1324N7352k7334j6079J1556O1249N364
11341B11737K4324n6624o7719M2183P3568L5934M638J4472r244j0142L6817M2857
11329C42801n3361k0231J11237K8152n4411j0783L6328n4710J1696N8764n8968
11318C36514M7861J28817K5729j44341p6040J6728K689J4228L1788P5105J1400
11307D70478o1798l6188n898P7109J48965N5270n5835k3280K9533k46k9063n973
11295E63074M6763N5336M1369M4653k6936j9501r3242j09715n2941O3539J01306
$$ plain form
11284 613705 597715 593099 597101 637931 711089 687326 728168 729294 689725 720493 716203 712249
11272 712249 751837 739142 754147 755604 704374 687379 743172 743705 683347 714088 756798 830703
11260 830703 831341 839201 825460 842542 849853 854642 894480 894510 918900 964396 1006304 1027144 1030326
11247 1030326 1009080 1014261 1010480 1015726 1048271 1112441 1095907 1020162 963155 1026179 1110854 1065065
11235 1065065 1078476 1119393 1081984 1026478 968437 967480 1027548 1100410 1137047 1117621 1111023 1075227
11223 1075227 1057706 1117507 1099722 1149640 1252221 1215986 1203715 1162527 1142845 1194414 1176020
11212 1176020 1170841 1227163 1260191 1290044 1367330 1399595 1373007 1319202 1316970 1257661 1298688 1326151
11200 1326151 1274753 1281681 1347461 1366205 1348739 1310534 1271891 1314255 1348715 1275577 1259495
$$ packed form
11284F13705j5990m616M002M0830P3158k3763M0842J126l9569L0768m290l954
11272G12249L9588j2695J5005J457n1230j6995N5793N33o0358L0741M2710P3905
11260H30703O38P860j3741J7082P311M789L9838L0K4390M5496M1908K0840L182
11247A030326k1246N181l781N246L2545O4170j6534p5745n7007O3024Q4675m5789
11235A065065J3411M0917l7409n5506n8041r57O0068P2862L6637j9426o598l5796
11223A075227j7521N9801j7785M9918J02581l6235j2271m1188j9682N1569j8394
11212A176020n179N6322L3028K9853P7286L2265k6588n3805k232n9309M1027K7463
11200A326151n1398O928O5780J8744j7466l8205l8643M2364L4460p3138j6082
$$ plain form
11189 1259495 1345252 1391686 1394579 1445087 1503960 1564873 1654038 1634892 1651792 1552314 1471660
11178 1471660 1472520 1556278 1647908 1607180 1635827 1661465 1640045 1589635 1565260 1559932 1705989 1738911
11166 1738911 1701375 1677731 1697681 1649807 1622344 1729368 1878321 1967461 1912073 1850840 1771308
11155 1771308 1742616 1760558 1786979 1802905 1702492 1672927 1797626 1809130 1836488 1815067 1707219
11144 1707219 1739472 1831762 1857157 1824536 1930083 2023014 2080347 2057215 2170312 2213509 2144463
11133 2144463 2094790 2096719 2113992 2072349 2024204 2091593 2142443 2141658 2129897 2157512 2111512 2105620
11121 2105620 2190256 2137647 2050520 2055242 2168295 2236498 2260373 2329784 2400349 2483455 2424811
11110 2424811 2393294 2415477 2416651 2367798 2414773 2438498 2367274 2398276 2378133 2299054 2335316
$$ packed form
11189A259495Q5757M6434K893N0508N8873O0913Q9165j9146J6900r9478q0654
11178A471660Q60Q3758R1630m0728K8647K5638k1420n0410k4375n328J46057L2922
11166A738911l7536k3644J9950m7874k7463J07024J48953Q9140n5388o1233p9532
11155A771308k8692J7942K6421J5926j00413k9565J24699J1504K7358k1421j07848
11144A707219L2253R2290K5395l2621J05547R2931N7333k3132J13097M3197o9046
11133B144463m9673J929J7273m1643m8145O7389N0850p85j1761K7615m6000n892
11121B105620Q4636n2609q7127M722J13053O8203K3875O9411P0565Q3106n8644
11110B424811l1517K2183J174m8853M6975K3725p1224L1002k0143p9079L6262
$$ plain form
11099 2335316 2359453 2411776 2490356 2570344 2561835 2451252 2412688 2441845 2591305 2640482 2587067
11088 2587067 2555326 2635165 2584397 2486148 2463455 2476549 2577195 2639423 2656279 2631481 2706688
11077 2706688 2645388 2546106 2676520 2752532 2771670 2804669 2808289 2819426 2887651 2936740 2962176
11066 2962176 2914981 2904920 2936134 3007373 3126546 3079990 2994537 2994238 3068915 3122750 3121369 3140094
11054 3140094 3205344 3208380 3257860 3304410 3298493 3331627 3339743 3338662 3345961 3349410 3368310 3278942
11042 3278942 3299643 3362017 3416823 3448453 3501583 3539370 3535763 3542746 3378691 3283954 3170866
11031 3170866 3147832 3254730 3292006 3410636 3511747 3582954 3483887 3435321 3368532 3186589
11021 3186589 2938972 2851421 2897836 3036785 3019044 3038021 3112468 3141226 3130194 3088480 2941964
$$ packed form
11099B335316K4137N2323P8580P9988q509j10583l8564K9157J49460M9177n3415
11088B587067l1741P9839n0768r8249k2693J3094J00646O2228J6856k4798P5207
11077B706688o1300r9282J30414P6012J9138L2999L620J1137O8225M9089K5436
11066B962176m7195j0061L1214P1239J19173m6556q5453k99P4677N3835j381J8725
11054C140094O5250L036M9480M6550n917L3134Q116j081P299L449J8900q9368
11042C278942K0701O2374N4806L1630N3130L7787l607O983j64055r4737j13088
11031C170866k3034J06898L7276J18630J01111P1207r9067m8566o6789j81943
11021C186589k47617q7551M6415J38949j7741J8977P4447K8758j1032m1714j46516
$$ plain form
11010 2941964 2721072 2633436 2609234 2728213 2771375 2667182 2694888 2902256 2999951 3028513
11000 3028513 2996279 2929894 2869125 2864746 2793360 2764045 2803682 2864647 2964640 3036961 3059587
10989 3059587 3074487 3153452 3197148 3233746 3345788 3401907 3475084 3501348 3420174 3443712 3565543
10978 3565543 3572763 3542769 3473515 3521159 3613572 3723420 3726208 3756866 3762649 3739617 3802967 3817172
10966 3817172 3861141 3859434 3889967 3939519 3933372 3927448 4006485 3979235 3941122 3903132 3933578 4016123
10954 4016123 4095579 4123247 4005535 4016595 4060738 4068152 4088732 4160232 4184893 4346946 4367437
10943 4367437 4389511 4379692 4331358 4366931 4361521 4465084 4508433 4485268 4542414 4516715 4522442 4642322
10931 4642322 4667573 4654563 4670768 4702254 4716538 4748570 4748838 4728886 4797894 4865370 4816001 4836499
$$ packed form
11010B941964k20892q7636k4202J18979M3162j04193K7706K07368R7695K8562
11000C028513l2234o6385o0769m379p1386k9315L9637O0965R9993P2321K2626
10989C059587J4900P8965M3696L6598J12042N6119P3177K6264q1174K3538J21831
10978C565543P220k9994o9254M7644R2413J09848K788L0658N783k3032O3350J4205
10966C817172M3969j707L0533M9552o147n924P9037k7250l8113l7990L0446Q2545
10954D016123P9456K7668j17712J1060M4143P414K0580P1500K4661J62053K0491
10943D367437K2074r819m8334L5573n410J03563M3349k3165N7146k5699N727J19880
10931D642322K5251j3010J6205L1486J4284L2032K68j9952O9008O7476m9369K0498
$$ plain form
10919 4836499 4875024 4843722 4896055 4915108 4820173 4833522 4993702 5009601 4954073 4957110 4924287
10908 4924287 4975029 5090480 5201550 5216009 5212705 5158876 5195124 5289556 5279079 5322094 5362314
10897 5362314 5405519 5420039 5476543 5486848 5524548 5455990 5444481 5490003 5510286 5593885 5596923
10886 5596923 5630973 5662924 5706763 5754328 5756363 5795832 5869645 5881391 5863708 5882105 5879788 5885323
10874 5885323 5905782 5865699 5971435 6051197 6083800 6109202 6101890 6133275 6146735 6190530 6187082
10863 6187082 6227266 6330388 6390439 6410720 6373763 6420042 6452910 6461927 6571075 6582761 6543685
10852 6543685 6522996 6574065 6630803 6620831 6665821 6693360 6687836 6713113 6828180 6949825 7017457
10841 7017457 7059254 7130665 7139169 7169305 7202234 7310049 7307325 7289726 7372582 7454667 7416350
$$ packed form
10919D836499L8525l1302N2333J9053r4935J3349J60180J5899n5528L037l2823
10908D924287N0742J15451J11070J4459l304n3829L6248R4432j0477M3015M0220
10897E362314M3205J4520N6504J0305L7700o8558j1509M5522K0283Q3599L038
10886E596923L4050L1951M3839M7565K035L9469P3813J1746j7683J8397k317N535
10874E885323K0459m0083J05736P9762L2603K5402p312L1385J3460M3795l448
10863F187082M0184J03122O0051K0281l6957M6279L2868R017J09148J1686l9076
10852F543685k0689N1069N6738r972M4990K7539n524K5277J15067J21645O7632
10841G017457M1797P1411Q504L0136L2929J07815k724j7599Q2856Q2085l8317
$$ plain form
10830 7416350 7465690 7553871 7539903 7476088 7500834 7546228 7547074 7540288 7582999 7663104 7761145 7843217
10818 7843217 7898127 7955373 8028123 8088689 8061721 8103511 8152383 8113922 8169712 8181564 8230330
10807 8230330 8324113 8517064 8655085 8618427 8573356 8659012 8667208 8663023 8740764 8794757 8778696
10796 8778696 8812773 8815078 8921812 8985379 9016329 9116829 9191297 9353407 9442992 9447899 9451385
10785 9451385 9447839 9478046 9639053 9783216 9897088 10018000 10070149 10087301 10178280 10198820 10308817
10774 10308817 10425170 10534126 10705713 10732706 10728848 10792366 10904803 10929594 10943168 11042861
10764 11042861 11162303 11156191 11155063 11265235 11387272 11458315 11439757 11484100 11577371 11750305 11913824
10753 11913824 12046983 12105911 12173077 12246385 12354130 12402926 12487540 12616258 12706463 12809847
$$ packed form
10830G416350M9340Q8181j3968o3815K4746M5394Q46o786M2711Q0105R8041Q2072
10818G843217N4910N7246P2750O0566k6968M1790M8872l8461N5790J1852M8766
10807H230330R3783J92951J38021l6658m5071Q5656Q196m185P7741N3993j6061
10796H778696L4077K305J06734O3567L0950J00500P4468J62110Q9585M907L486
10785I451385l546L0207J61007J44163J13872J20912N2149J7152R0979K0540J09997
10774A0308817J16353J08956J71587K6993l858O3518J12437K4791J3574R9693
10764A1042861J19442o112j128J10172J22037P1043j8558M4343R3271J72934J63519
10753A1913824J33159N8928O7166P3308J07745M8796Q4614J28718R0205J03384
$$ plain form
10743 12809847 12994700 13025015 13017623 13071419 13104122 13224049 13330473 13511699 13566539 13661932
10733 13661932 13787782 13893936 14012081 14128780 14186170 14250035 14347980 14476708 14567749 14699427
10723 14699427 14876707 15057764 15198392 15325679 15437836 15563699 15698278 15791156 15889847 15994669
10713 15994669 16175827 16348703 16570496 16799702 17015600 17164171 17272043 17357045 17451908 17651089
10703 17651089 17856204 18088274 18307144 18446047 18615530 18758258 19011224 19331268 19600067
10694 19600067 19950751 20229351 20405066 20558498 20758059 20940152 21219080 21625002 21869382
10685 21869382 22132909 22445803 22705376 22928789 23221273 23473306 23769943 24197968 24496077
10676 24496077 24879909 25199919 25527233 25971085 26308735 26662457 27038600 27429712 27847512
$$ packed form
10743A2809847J84853L0315p392N3796L2703J19927J06424J81226N4840R5393
10733A3661932J25850J06154J18145J16699N7390O3865R7945J28728R1041J31678
10723A4699427J77280J81057J40628J27287J12157J25863J34579R2878R8691J04822
10713A5994669J81158J72876K21793K29206K15898J48571J07872Q5002R4863J99181
10703A7651089K05115K32070K18870J38903J69483J42728K52966L20044K68799
10694A9600067L50684K78600J75715J53432J99561J82093K78928M05922K44380
10685B1869382K63527L12894K59573K23413K92484K52033K96637M28025K98109
10676B4496077L83832L20010L27314M43852L37650L53722L76143L91112M17800
$$ plain form
10667 27847512 28296333 28823534 29278925 29737646 30297221 30814255 31364582 31985434 32566679
10658 32566679 33216954 33898211 34545165 35176832 35687275 36248483 36898389 37599844 38101166
10649 38101166 38419106 39092672 40147984 41180207 42270520 43433539 44645128 45854415
10641 45854415 47171664 48654527 50192013 51793346 53374003 54965455 56491441 57942692
10633 57942692 59163951 60361603 61930212 64071901 66758593 69809773 73250313 76989674
10625 76989674 81123683 85635624 90520638 95367618 99868638 103734846 106523858 106847757
10617 106847757 103090153 95326920 86719164 81263889 80681903 84422928 90906463 98964824
10609 98964824 107274312 114455045 118064775 114183136 99147250 74221766 48467512 32281407
$$ packed form
10667B7847512M48821N27201M55391M58721N59575N17034N50327O20852N81245
10658C2566679O50275O81257O46954O31667N10443N61208O49906P01455N01322
10649C8101166L17940O73566J055312J032223J090313J163019J211589J209287
10641D5854415J317249J482863J537486J601333J580657J591452J525986J451251
10633E7942692J221259J197652J568609K141689K686692L051180L440540L739361
10625G6989674M134009M511941M885014M846980M501020L866208K789012L23899
10617A06847757l757604p763233q607756n455275n81986L741025O483535Q058361
10609I8964824Q309488P180733L609730l881639j5035886k4925484k5754254j6186105
$$ plain form
10601 32281407 28233635 32862615 42287608 53768638 65002274 73255202 74509558 63251620
10593 63251620 35412115 -5386206 -44613226 -68165202 -74821385 -70511527 -60962339
10586 -60962339 -49780168 -39250812 -31692455 -30128017 -37888826 -56815961 -83159325
10579 -83159325 -106816803 -119085460 -120052967 -114411719 -106118902 -97494075 -90025878 -84700800
10571 -84700800 -82618597 -84868994 -91449162 -100341901 -107727041 -110805974 -109521536 -105657027
10563 -105657027 -100659900 -95589802 -90817247 -86456293 -82337586 -78671548 -75447965 -72515318
10555 -72515318 -69837181 -67336283 -64947603 -62819577 -60914961 -59068162 -57210487 -55519111
10547 -55519111 -54026040 -52654915 -51291415 -50022273 -48828051 -47598180 -46412470 -45466836
$$ packed form
10601C2281407m047772M628980R424993J1481030J1233636Q252928J254356j1257938
10593F3251620k7839505m0798321l9227020k3551976o656183M309858R549188
10586f0962339J1182171J0529356P558357J564438p760809j8927135k6343364
10579h3159325k3657478j2268657r67507N641248Q292817Q624827P468197N325078
10571h4700800K082203k250397o580168q892739p385140l078933J284438L864509
10563a05657027M997127N070098M772555M360954M118707L666038L223583K932647
10555g2515318K678137K500898K388680K128026J904616J846799J857675J691376
10547e5519111J493071J371125J363500J269142J194222J229871J185710R45634
$$ plain form
10539 -45466836 -44450826 -43462752 -42609267 -41824777 -41021249 -40152754 -39307987 -38598992 -37967774
10530 -37967774 -37377521 -36729122 -36109512 -35503770 -34918927 -34357190 -33880678 -33346322 -32935658
10521 -32935658 -32486465 -31940868 -31390930 -30914177 -30501422 -30056910 -29635672 -29278611 -28919136
10512 -28919136 -28474826 -28167470 -27895317 -27564843 -27294705 -26915404 -26458013 -26087936 -25872029
10503 -25872029 -25614660 -25366549 -25141742 -24866868 -24511392 -24241856 -24054530 -23797862 -23507699
10494 -23507699 -23242873 -23075979 -22875273 -22619659 -22447032 -22260528 -22060291 -21918540 -21707201
10485 -21707201 -21457552 -21220838 -21035013 -20923764 -20804979 -20688355 -20464035 -20315704 -20104463
10476 -20104463 -19950291 -19792895 -19611127 -19411800 -19276752 -19147623 -19044031 -18934058 -18744464
$$ packed form
10539d5466836J016010R88074Q53485P84490Q03528Q68495Q44767P08995O31218
10530c7967774N90253O48399O19610O05742N84843N61737M76512N34356M10664
10521c2935658M49193N45597N49938M76753M12755M44512M21238L57061L59475
10512b8919136M44310L07356K72153L30474K70138L79301M57391L70077K15907
10503b5872029K57369K48111K24807K74874L55476K69536J87326K56668K90163
10494b3507699K64826J66894K00706K55614J72627J86504K00237J41751K11339
10485b1707201K49649K36714J85825J11249J18785J16624K24320J48331K11241
10476b0104463J54172J57396J81768J99327J35048J29129J03592J09973J89594
$$ plain form
10467 -18744464 -18428481 -18260839 -18217769 -18174651 -18128998 -18021935 -17842345 -17669117 -17532587 -17406954
10457 -17406954 -17223192 -17147077 -17023271 -16899221 -16750489 -16650558 -16506923 -16277428 -16114344 -16036180
10447 -16036180 -16009811 -15926412 -15736113 -15612129 -15645228 -15540477 -15397142 -15304618 -15261975 -15217899
10437 -15217899 -15122447 -15044206 -14896298 -14774017 -14696655 -14569934 -14579174 -14516328 -14360358 -14329910
10427 -14329910 -14333113 -14189018 -14048400 -13959300 -13822344 -13749011 -13628184 -13549814 -13505312 -13579334
10417 -13579334 -13545125 -13437753 -13297943 -13166029 -13210104 -13164459 -13081300 -13009474 -12963293 -12911685
10407 -12911685 -12899708 -12782953 -12614170 -12494407 -12488867 -12455253 -12303510 -12193156 -12160617 -12126662
10397 -12126662 -12059393 -11963173 -11856668 -11803908 -11796858 -11786363 -11796406 -11815817 -11727827 -11631959 -11504997
$$ packed form
10467a8744464L15983J67642M3070M3118M5653J07063J79590J73228J36530J25633
10457a7406954J83762P6115J23806J24050J48732R9931J43635K29495J63084P8164
10447a6036180K6369Q3399J90299J23984l3099J04751J43335R2524M2643M4076
10437a5217899R5452P8241J47908J22281P7362J26721r240O2846J55970L0448
10427a4329910l203J44095J40618Q9100J36956P3333J20827P8370M4502p4022
10417a3579334L4209J07372J39810J31914m4075M5645Q3159P1826M6181N1608
10407a2911685J1977J16755J68783J19763N540L3614J51743J10354L2539L3955
10397a2126662O7269R6220J06505N2760P050J0495j0043j9411Q7990R5868J26962
$$ plain form
10386 -11504997 -11394537 -11293947 -11186641 -11233644 -11284352 -11212816 -11105054 -11048364 -11074956 -10933127
10376 -10933127 -10845396 -10903864 -10879809 -10840002 -10831201 -10792075 -10737798 -10786374 -10799172 -10760414 -10620505
10365 -10620505 -10510038 -10446568 -10428703 -10364623 -10294358 -10221376 -10196330 -10215777 -10170447 -10133671 -10109372
10354 -10109372 -10047762 -9932638 -9924603 -9949622 -9911381 -9884400 -9837367 -9762137 -9699652 -9765188 -9722426
10343 -9722426 -9613825 -9531626 -9462817 -9404768 -9404442 -9415377 -9389755 -9327082 -9325337 -9299280 -9288509 -9187982
10331 -9187982 -9204089 -9138784 -9124041 -9141402 -9247730 -9185730 -9052605 -9059854 -9039994 -8953199 -8997727
10320 -8997727 -8996386 -8910476 -8930985 -8928040 -8853956 -8788275 -8757088 -8806380 -8773413 -8740257 -8704234 -8633568
10308 -8633568 -8615272 -8569126 -8546131 -8436724 -8422242 -8438859 -8480598 -8418014 -8360203 -8341426 -8311014
$$ packed form
10386a1504997J10460J00590J07306m7003n0708P1536J07762N6690k6592J41829
10376a0933127Q7731n8468K4055L9807Q801L9126N4277m8576j2798L8758J39909
10365a0620505J10467O3470J7865O4080P0265P2982K5046j9447M5330L6776K4299
10354a0109372O1610J15124Q035k5019L8241K6981M7033P5230O2485o5536M2762
10343i722426J08601Q2199O8809N8049L26j0935K5622O2673J745K6057J0771J00527
10331i187982j6107O5305J4743j7361j06328O2000J33125p249J9860Q6795m4528
10320h997727J341Q5910k0509K945P4084O5681L1187m9292L2967L3156L6023P0666
10308h633568J8296M6146K2995J09407J4482j6617m1739O2584N7811J8777L0412
$$ plain form
10297 -8311014 -8283820 -8271777 -8217828 -8131381 -8213047 -8182694 -8068035 -8057762 -8072394 -8002813 -7921018
10286 -7921018 -7857325 -7858816 -7898224 -7837722 -7771830 -7759262 -7746339 -7754516 -7742158 -7735399 -7715460 -7637846
10274 -7637846 -7637321 -7635358 -7700237 -7726120 -7653369 -7584448 -7508229 -7491347 -7558593 -7540754 -7510096 -7541772
10262 -7541772 -7454330 -7357977 -7294217 -7291031 -7268507 -7298489 -7254386 -7245632 -7209217 -7223282 -7226488 -7292267
10250 -7292267 -7352444 -7288632 -7221415 -7186949 -7197946 -7133593 -7032436 -7051794 -7039737 -7027765 -6992947
10239 -6992947 -6906928 -6820302 -6731698 -6683083 -6792942 -6830282 -6831283 -6775374 -6715668 -6700725 -6781683
10228 -6781683 -6795769 -6756328 -6739072 -6746101 -6596733 -6471222 -6520130 -6554576 -6527705 -6505936 -6560027
10217 -6560027 -6545370 -6518758 -6539173 -6500347 -6451852 -6459743 -6464355 -6417647 -6370054 -6293463 -6306670 -6316099
$$ packed form
10297h311014K7194J2043N3949Q6447q1666L0353J14659J0273j4632O9581Q1795
10286g921018O3693j491l9408O0502O5892J2568J2923q177J2358O759J9939P7614
10274g637846N25J963o4879k5883P2751O8921P6219J6882o7246J7839L0658l1676
10262g541772Q7442R6353O3760L186K2524k9982M4103Q754L6415j4065l206o5779
10250g292267o0177O3812O7217L4466j0997O4353J01157j9358J2057J1972L4818
10239f992947Q6019Q6626Q8604M8615j09859l7340j001N5909N9706J4943q0958
10228f781683j4086L9441J7256p029J49368J25511m8908l4446K6871K1769n4091
10217f560027J4657K6612k0415L8826M8495p891m612M6708M7593P6591j3207r429
$$ plain form
10205 -6316099 -6330234 -6327609 -6240853 -6139807 -6096694 -6083181 -6087849 -6057083 -6023420 -6009956 -5964655
10194 -5964655 -5877618 -5830965 -5853610 -5775718 -5799378 -5784946 -5728201 -5642296 -5625711 -5643678 -5633850
10183 -5633850 -5644903 -5566619 -5492959 -5520458 -5617543 -5676533 -5613597 -5649149 -5604679 -5594704 -5585486 -5587653
10171 -5587653 -5500040 -5350503 -5314439 -5390916 -5524740 -5612555 -5661900 -5700211 -5612073 -5527319 -5533291
10160 -5533291 -5487439 -5443472 -5507099 -5501049 -5637243 -5873863 -6036418 -6086525 -6067103 -6025419 -5974780
10149 -5974780 -5826270 -5744233 -5738303 -5844175 -5841314 -5956928 -6129836 -6247382 -6250168 -6102538 -6009836
10138 -6009836 -6014244 -5897391 -5730910 -5670031 -5701080 -5758440 -5760372 -5725078 -5727158 -5671587 -5624244
10127 -5624244 -5536439 -5446510 -5276823 -5133686 -4971965 -4822898 -4701137 -4809001 -5120228 -5799661
$$ packed form
10205f316099j4135K625Q6756J01046M3113J3513m668L0766L3663J3464M5301
10194e964655Q7037M6653k2645P7892k3660J4432N6745Q5905J6585j7967R828
10183e633850j1053P8284P3660k7499r7085n8990O2936l5552M4470R975R218k167
10171e587653Q7613J49537L6064p6477j33824q7815m9345l8311Q8138Q4754n972
10160e533291M5852M3967o3627O050j36194k36620j62555n0107J9422M1684N0639
10149e974780J48510Q2037N930j05872K861j15614j72908j17546k786J47630R2702
10138f009836m408J16853J66481O0879l1049n7360j932L5294k080N5571M7343
10127e624244Q7805Q9929J69687J43137J61721J49067J21761j07864l11227o79433
$$ plain form
10117 -5799661 -6417634 -6718275 -6774526 -6707629 -6611669 -6488630 -6357383 -6191513 -6118724 -6194615
10107 -6194615 -6237133 -6190865 -6049937 -5976920 -6026057 -5999917 -5956276 -5961916 -5857618 -5833393 -5788069
10096 -5788069 -5753870 -5779033 -5833935 -5869578 -5846545 -5758193 -5688235 -5622158 -5619636 -5590418 -5530827
10085 -5530827 -5562417 -5632900 -5618447 -5576522 -5585080 -5547885 -5499033 -5446032 -5503115 -5621074 -5624395
10074 -5624395 -5608330 -5466696 -5403366 -5335662 -5326797 -5386501 -5421306 -5457048 -5413565 -5403901 -5236636
10063 -5236636 -5211602 -5253352 -5194615 -5163187 -5219585 -5238715 -5220662 -5106373 -5082154 -5138735 -5158191
10052 -5158191 -5084140 -5054978 -5076487 -5071530 -4965037 -4989345 -5081703 -5136944 -5212943 -5182098 -5056003
10041 -5056003 -5012439 -4976088 -4981937 -5049727 -5026457 -4980938 -5015841 -4990115 -4978611 -4964855 -4894542
$$ packed form
10117e799661o17973l00641n6251O6897R5960J23039J31247J65870P2789p5891
10107f194615m2518M6268J40928P3017m9137K6140M3641n640J04298K4225M5324
10096e788069L4199k5163n4902l5643K3033Q8352O9958O6077K522K9218N9591
10085e530827l1590p0483J4453M1925q558L7195M8852N3001n7083j17959l321
10074e624395J6065J41634O3330O7704Q865n9704l4805l5742M3483R664J67265
10063e236636K5034m1750N8737L1428n6398j9130J8053J14289K4219n6581j9456
10052e158191P4051K9162k1509M957J06493k4308r2358n5241p5999L0845J26095
10041e056003M3564L6351n849o7790K3270M5519l4903K5726J1504J3756P0313
$$ plain form
10030 -4894542 -4889128 -4872986 -4797758 -4762318 -4757694 -4779212 -4739448 -4762832 -4827445 -4875758 -4880639 -4860379
10018 -4860379 -4854413 -4811499 -4816051 -4813993 -4764225 -4692192 -4695472 -4673691 -4719948 -4746027 -4730217 -4697419
10006 -4697419 -4700025 -4664114 -4702697 -4701225 -4713801 -4667796 -4600179 -4616384 -4657614 -4644213 -4583048 -4624431
9994 -4624431 -4633663 -4633298 -4626058 -4570719 -4553673 -4582848 -4527785 -4556957 -4542987 -4519893 -4523534 -4491312
9982 -4491312 -4503567 -4515635 -4554535 -4586773 -4585601 -4560039 -4491908 -4411969 -4403455 -4403200 -4412879 -4433784
9970 -4433784 -4447412 -4445039 -4489155 -4495173 -4513738 -4552641 -4501493 -4437038 -4382441 -4305752 -4334722 -4417655
9958 -4417655 -4458679 -4460160 -4449456 -4396747 -4347566 -4405997 -4399749 -4376787 -4429490 -4352962 -4301236 -4224385
9946 -4224385 -4248672 -4295131 -4279682 -4247926 -4227136 -4149193 -4166589 -4249714 -4273085 -4267178 -4237190 -4254684
$$ packed form
10030d894542N414J6142P5228L5440M624k1518L9764k3384o4613m8313m881K0260
10018d860379N966M2914m552K058M9768P2033l280K1781m6257k6079J5810L2798
10006d697419k606L5911l8583J472j2576M6005O7617j6205m1230J3401O1165m1383
9994d624431r232L65P240N5339J7046k9175N5063k9172J3970K3094l641L2222
9982d491312j2255j2068l8900l2238J172K5562O8131P9939Q514K55r679k0905
9970d433784j3628K373m4116o018j8565l8903N1148O4455N4597P6689k8970q2933
9958d417655m1024j481J0704N2709M9181n8431O248K2962n2703P6528N1726P6851
9946d224385k4287m6459J5449L1756K0790P7943j7396q3125k3371N907K9988j7494
$$ plain form
9934 -4254684 -4245092 -4257823 -4317116 -4310994 -4232319 -4213132 -4155495 -4197601 -4169993 -4148236 -4176083 -4134209
9922 -4134209 -4058638 -4082512 -4090678 -4134791 -4142030 -4162231 -4150120 -4130441 -4082351 -4063799 -4141139 -4155940
9910 -4155940 -4126320 -4208896 -4238175 -4199638 -4152048 -4084096 -3982258 -3975026 -4030559 -4012834 -4013599 -4030185
9898 -4030185 -3985462 -3960380 -4054974 -4108100 -4087025 -4036204 -3942376 -3889500 -3802129 -3832034 -3842957
9887 -3842957 -3941624 -4012733 -3945546 -3806567 -3806459 -3873905 -3957248 -3970740 -3971133 -3972220 -4006843 -4001321
9875 -4001321 -4026015 -3936661 -3818235 -3841685 -3882740 -3934220 -3898525 -3855700 -3832767 -3812168 -3852722
9864 -3852722 -3914940 -3908314 -3846914 -3861458 -3787594 -3787483 -3789827 -3831796 -3873454 -3894756 -3859117 -3831972
9852 -3831972 -3763525 -3772991 -3733367 -3674615 -3573531 -3648565 -3654999 -3670026 -3725943 -3695774 -3680835 -3807173
$$ packed form
9934d254684R592j2731n9293O122P8675J9187N7637m2106K7608K1757k7847M1874
9922d134209P5571k3874q166m4113p239k0201J2111J9679M8090J8552p7340j4801
9910d155940K9620q2576k9279L8537M7590O7952J01838P232n5533J7725p65j6586
9898d030185M4723K5082r4594n3126K1075N0821R3828N2876Q7371k9905j0923
9887c842957r8667p1109O7187J38979J08o7446q3343j3492l93j087l4623N522
9875d001321k4694Q9354J18426k3450m1055n1480L5695M2825K2933K0599m0554
9864c852722o2218O626O1400j4544P3864J11k344m1969m1658k1302L5639K7145
9852c831972O8447r466L9624N8752J01084p5034o434j5027n5917L0169J4939j26338
$$ plain form
9840 -3807173 -3879165 -3753952 -3660852 -3593134 -3611955 -3741764 -3850930 -3900489 -3916563 -3865454 -3722237
9829 -3722237 -3639586 -3666311 -3722770 -3722639 -3725513 -3680431 -3692962 -3684813 -3657537 -3614904 -3561853 -3587228
9817 -3587228 -3565263 -3567633 -3614320 -3628503 -3528175 -3515919 -3573925 -3651804 -3628310 -3628159 -3627955 -3516526
9805 -3516526 -3458487 -3481675 -3478029 -3486072 -3566765 -3674922 -3684545 -3598149 -3587066 -3546043 -3486006 -3542894
9793 -3542894 -3518324 -3477197 -3484996 -3599538 -3662432 -3611977 -3553214 -3515582 -3433057 -3443406 -3498849
9782 -3498849 -3514864 -3531009 -3555680 -3582070 -3582788 -3577982 -3637065 -3605192 -3466490 -3382807 -3528815 -3584265
9770 -3584265 -3491740 -3459962 -3444373 -3417551 -3342419 -3414938 -3392907 -3369839 -3410185 -3416994 -3382036 -3377003
9758 -3377003 -3421302 -3426106 -3416859 -3462314 -3383027 -3309209 -3312327 -3266344 -3226166 -3219500 -3274162 -3325637
$$ packed form
9840c807173p1992J25213R3100O7718j8821j29809j09166m9559j6074N1109J43217
9829c722237Q2651k6725n6459J31k874M5082j2531Q149K7276M2633N3051k5375
9817c587228K1965k370m6687j4183J00328J2256n8006p7879K3494J51K04J11429
9805c516526N8039k3188L646q043q0693j08157r623Q6396J1083M1023O0037n6888
9793c542894K4570M1127p799j14542o2894N0455N8763L7632Q2525j0349n5443
9782c498849j6015j6145k4671k6390p18M806n9083L1873J38702Q3683j46008n5450
9770c584265R2525L1778J5589K6822P5132p2519K2031K3068m0346o809L4958N033
9758c377003m4299m804R247m5455P9287P3818l118M5983M0178O666n4662n1475
$$ plain form
9746 -3325637 -3295024 -3329794 -3343719 -3315721 -3212802 -3168946 -3191370 -3147719 -3128000 -3219920 -3327357
9735 -3327357 -3246186 -3239540 -3196989 -3161125 -3178636 -3164771 -3157382 -3149942 -3168041 -3212204 -3234288 -3232223
9723 -3232223 -3186268 -3162834 -3210084 -3183546 -3243299 -3218514 -3143912 -3100745 -3128359 -3091666 -3048199
9712 -3048199 -3044415 -3010461 -3028076 -3074399 -3110141 -3073784 -3005558 -2941669 -2935249 -3014832 -3009144 -3059888
9700 -3059888 -3086145 -3055666 -2985084 -2968296 -3019251 -3109925 -3084609 -3046379 -3050832 -3078964 -3145465 -3087491
9688 -3087491 -3058685 -2962228 -2892345 -2849740 -2828034 -2841290 -2833104 -2775266 -2658392 -2639391 -2703255
9677 -2703255 -2760785 -2702319 -2622159 -2649633 -2708060 -2736137 -2642956 -2552876 -2504336 -2529407 -2457402
9666 -2457402 -2336756 -2216878 -2089864 -1987313 -1914718 -1777957 -1616382 -1424332 -1186591 -842471
$$ packed form
9746c325637L0613l4770j3925K7998J02919M3856k2424M3651J9719r1920j07437
9735c327357Q1171O646M2551L5864j7511J3865P389P440j8099m4163k2084K065
9723c232223M5955K3434m7250K6538n9753K4785P4602M3167k7614L6693M3467
9712c048199L784L3954j7615m6323l5742L6357O8226O3889O420p9583N688n0744
9700c059888k6257L0479P0582J6788n0955r0674K5316L8230m453k8132o6501N7974
9688c087491K8806R6457O9883M2605K1706j3256Q186N7838J16874J9001o3864
9677b703255n7530N8466Q0160k7474n8427k8077R3181R0080M8540k5071P2005
9666b457402J20646J19878J27014J02551P2595J36761J61575J92050K37741L44120
$$ plain form
9656 -842471 -396981 -86685 -38996 -944745 -3338478 -5780028 -6324720 -6052710 -5692021 -5376051
9646 -5376051 -5077561 -4800229 -4605379 -4430592 -4342909 -4259787 -4170730 -4068258 -3970769 -3956752
9636 -3956752 -3973689 -3912606 -3876539 -3810625 -3756700 -3772276 -3671299 -3522471 -3504948 -3508731 -3454178
9625 -3454178 -3419390 -3470304 -3513447 -3492708 -3460000 -3436552 -3458104 -3535976 -3508566 -3536683 -3489261
9614 -3489261 -3469300 -3509011 -3480040 -3424328 -3393235 -3335285 -3283988 -3267414 -3256545 -3252829 -3293761 -3300762
9602 -3300762 -3284970 -3266201 -3260698 -3234732 -3202541 -3294443 -3383401 -3352577 -3331903 -3354698 -3380078 -3224563
9590 -3224563 -3129441 -3180666 -3158513 -3100286 -3114910 -3116332 -3101552 -3190795 -3175836 -3159247 -3105842 -3152932
9578 -3152932 -3182098 -3125804 -3069950 -3047246 -3051474 -3123199 -3161296 -3129715 -3095284 -3112233 -3182632 -3098795
$$ packed form
9656h42471M45490L10296M7689r05749k393733k441550n44692K72010L60689L15970
9646e376051K98490K77332J94850J74787Q7683Q3122Q9057J02472R7489J4017
9636c956752j6937O1083L6067O5914N3925j5576J00977J48828J7523l783N4553
9625c454178L4788n0914m3143K0739L2708K3448k1552p7872K7410k8117M7422
9614c489261J9961l9711K8971N5712L1093N7950N1297J6574J0869L716m0932p001
9602c300762J5792J8769N503K5966L2191r1902q8958L0824K0674k2795k5380J55515
9590c224563R5122n1225K2153N8227j4624j422J4780q9243J4959J6589N3405m7090
9578c152932k9166N6294N5854K2704m228p1725l8097L1581L4431j6949p0399Q3837
$$ plain form
9566 -3098795 -3046661 -3071595 -3099741 -3052200 -3017463 -3029651 -3095022 -3080961 -3077389 -3049525 -2962456 -2959866
9554 -2959866 -3026768 -3047712 -3009525 -2964638 -2920400 -2953495 -2955390 -2976758 -2956291 -2981349 -2948356 -2903915
9542 -2903915 -2914206 -2978178 -3003027 -3003138 -2984591 -3013567 -3007912 -3018854 -3004363 -3002053 -3077354 -3076152
9530 -3076152 -3041039 -2999020 -2983131 -2986536 -2999617 -2970990 -2977282 -2958641 -3030601 -3062414 -2989152 -2883916
9518 -2883916 -2850795 -2901320 -2894212 -2918524 -2895255 -2787610 -2693763 -2690965 -2752273 -2774254 -2798660 -2924882
9506 -2924882 -2926008 -2859743 -2795931 -2829811 -2864436 -2856910 -2865118 -2858756 -2846812 -2826292 -2820084 -2808983
9494 -2808983 -2833013 -2884086 -2858858 -2833612 -2960059 -2952569 -2954822 -2997095 -2980176 -2922383 -2902879 -2879716
9482 -2879716 -2760405 -2720807 -2764780 -2781755 -2772264 -2783650 -2826381 -2826469 -2800794 -2908843 -2908926 -2857765
$$ packed form
9566c098795N2134k4934k8146M7541L4737j2188o5371J4061L572K7864Q7069K590
9554b959866o6902k0944L8187M4887M4238l3095j895k1368K0467k5058L2993M4441
9542b903915j0291o3972k4849j11J8547k8976N655j0942J4491K310p5301J202
9530c076152L5113M2019J5889l405j3081K8627o292J8641p1960l1813P3262J05236
9518b883916L3121n0525P108k4312K3269J07645R3847K798o1308k1981k4406j26222
9506b924882j126O6265O3812l3880l4625P526q208O362J1944K0520O208J1101
9494b808983k4030n1073K5228K5246j26447P490k253m2273J6919N7793J9504K3163
9482b879716J19311L9598m3973j6975R491j1386m2731q8K5675j08049q3N1161
$$ plain form
9470 -2857765 -2780005 -2809783 -2865640 -2895770 -2870235 -2837702 -2815862 -2854534 -2798785 -2645605 -2697391
9459 -2697391 -2708893 -2791952 -2810977 -2822120 -2799819 -2759128 -2748110 -2783102 -2761587 -2786157 -2823003
9448 -2823003 -2751055 -2764655 -2717453 -2686840 -2741128 -2716707 -2669597 -2666452 -2715659 -2711312 -2710424 -2763783
9436 -2763783 -2700471 -2653323 -2599038 -2675045 -2776908 -2710405 -2664784 -2613018 -2629594 -2595250 -2571601
9425 -2571601 -2634464 -2720633 -2736280 -2753779 -2643355 -2697414 -2785876 -2716806 -2717965 -2795945 -2805695 -2837506
9413 -2837506 -2802548 -2704966 -2647973 -2657047 -2676907 -2661527 -2700858 -2761372 -2826790 -2770734 -2702845 -2706544
9401 -2706544 -2723499 -2662720 -2620579 -2654969 -2704559 -2652788 -2677438 -2689724 -2593721 -2552842 -2611712
9390 -2611712 -2718647 -2695549 -2584813 -2482555 -2510295 -2524370 -2545652 -2588723 -2629718 -2613965 -2522445
$$ packed form
9470b857765P7760k9778n5857l0130K5535L2533K1840l8672N5749J53180n1786
9459b697391j1502q3059j9025j1143K2301M0691J1018l4992K1515k4570l6846
9448b823003P1948j3600M7202L0613n4288K4421M7110L145m9207M347Q88n3359
9436b763783O3312M7148N4285p6007j01863O6503M5621N1766j6576L4344K3649
9425b571601o2863q6169j5647j7499J10424n4059q8462O9070j159p7980r750l1811
9413b837506L4958R7582N6993r074j9860J5380l9331o0514o5418N6056O7889l699
9401b706544j6955O0779M2141l4390m9590N1771k4650j2286R6003M0879n8870
9390b611712j06935K3098J10736J02258k7740j4075k1282m3071m0995J5753R1520
$$ plain form
9379 -2522445 -2611938 -2602314 -2499544 -2563079 -2631324 -2667012 -2690885 -2672286 -2591478 -2584599 -2563786 -2621845
9367 -2621845 -2675728 -2671544 -2634448 -2673274 -2693998 -2749863 -2726378 -2689542 -2684696 -2599482 -2551219 -2522931
9355 -2522931 -2508058 -2530067 -2588420 -2571836 -2514367 -2484661 -2542164 -2500198 -2517235 -2564979 -2568724 -2559388
9343 -2559388 -2560995 -2511217 -2475796 -2447875 -2396757 -2500383 -2520390 -2436217 -2443296 -2400644 -2430033 -2391367
9331 -2391367 -2406769 -2464980 -2521790 -2523291 -2501386 -2517061 -2490650 -2493265 -2461161 -2518675 -2522253 -2506130
9319 -2506130 -2469871 -2340987 -2309393 -2392960 -2335113 -2284858 -2341639 -2392020 -2422654 -2466680 -2476211
9308 -2476211 -2466151 -2508231 -2474118 -2433470 -2403562 -2444063 -2465207 -2388659 -2371393 -2460662 -2491000
9297 -2491000 -2492160 -2489324 -2531974 -2493503 -2396843 -2338845 -2343420 -2368843 -2393005 -2412934 -2432579 -2441331
$$ packed form
9379b522445q9493R624J02770o3535o8245l5688k3873J8599Q0808O879K0813n8059
9367b621845n3883M184L7096l8826k0724n5865K3485L6836M846Q5214M8263K8288
9355b522931J4873k2009n8353J6584N7469K9706n7503M1966j7037m7744l745R336
9343b559388j607M9778L5421K7921N1118j03626k0007Q4173p079M2652k9389L8666
9331b391367j5402n8211n6810j501K1905j5675K6411k615L2104n7514l578J6123
9319b506130L6259J28884L1594q3567N7847N0255n6781n0381l0634m4026r531
9308b476211J0060m2080L4113M0648K9908m0501k1144P6548J7266q9269l0338
9297b491000j160K836m2650L8471R6660N7998m575k5423k4162j9929j9645q752
$$ plain form
9285 -2441331 -2420825 -2402800 -2334154 -2330511 -2419777 -2458772 -2398925 -2374976 -2409300 -2441295 -2431401 -2410126
9273 -2410126 -2441168 -2412630 -2359904 -2261397 -2269780 -2322050 -2371651 -2398568 -2446901 -2385254 -2297837 -2369039
9261 -2369039 -2347679 -2420178 -2352116 -2420545 -2382513 -2381008 -2387587 -2393024 -2416696 -2385480 -2336996 -2364551
9249 -2364551 -2443850 -2512391 -2429298 -2403270 -2426132 -2460733 -2416094 -2334769 -2281066 -2340926 -2335703 -2302613
9237 -2302613 -2269504 -2199792 -2213720 -2274291 -2239880 -2249785 -2249001 -2330743 -2246377 -2125449 -2198432 -2240464
9225 -2240464 -2272115 -2261655 -2287080 -2364887 -2303154 -2347417 -2372072 -2382530 -2410732 -2505399 -2464972
9214 -2464972 -2421815 -2376945 -2388662 -2389048 -2274679 -2249675 -2257689 -2310403 -2390332 -2418859 -2372979 -2355388
9202 -2355388 -2391430 -2394343 -2352752 -2380584 -2440344 -2447691 -2389927 -2391411 -2372825 -2324501 -2260593 -2267078
$$ packed form
9285b441331K0506J8025O8646L643q9266l8995N9847K3949l4324l1995R894K1275
9273b410126l1042K8538N2726R8507q383n2270m9601k6917m8333O1647Q7417p1202
9261b369039K1360p2499O8062o8429L8032J505o579n437k3672L1216M8484k7555
9249b364551p9299o8541Q3093K6028k2862l4601M4639Q1325N3703n9860N223L3090
9237b302613L3109O9712j3928o0571L4411r905P84q1742Q4366J20928p2983m2032
9225b240464l1651J0460k5425p7807O1733m4263k4655j0458k8202r4667M0427
9214b464972M3157M4870j1717l86J14369K5004q014n2714p9929k8527M5880J7591
9202b355388l6042k913M1591k7832n9760p347N7764j484J8586M8324O3908o485
$$ plain form
9190 -2267078 -2286364 -2189217 -2129182 -2180407 -2161070 -2216085 -2271635 -2287586 -2214463 -2222682 -2250910 -2358886
9178 -2358886 -2342275 -2370595 -2388595 -2362791 -2402162 -2353687 -2314584 -2375905 -2410305 -2400005 -2363786
9167 -2363786 -2323988 -2332754 -2332392 -2363774 -2346578 -2333937 -2290752 -2234495 -2189274 -2262789 -2333354 -2290698
9155 -2290698 -2284058 -2314292 -2344521 -2296277 -2308629 -2340457 -2332963 -2307308 -2309776 -2277921 -2286323 -2216604
9143 -2216604 -2197327 -2198657 -2179287 -2168367 -2144535 -2141866 -2242163 -2213579 -2151970 -2253677 -2325329
9132 -2325329 -2315014 -2339684 -2297221 -2231203 -2204023 -2217447 -2169837 -2078116 -2045530 -2156742 -2208791
9121 -2208791 -2134297 -2117747 -2185906 -2187704 -2126968 -2132991 -2148552 -2210090 -2197625 -2147527 -2134853 -2175068
9109 -2175068 -2238074 -2253638 -2266760 -2289197 -2303890 -2275627 -2173652 -2157188 -2150266 -2141990 -2117225 -2183507
$$ packed form
9190b267078j9286R7147O0035n1225J9337n5015n5550j5951P3123q219k8228j07976
9178b358886J6611k8320j8000K5804l9371M8475L9103o1321l4400J0300L6219
9167b363786L9798q766L62l1382J7196J2641M3185N6257M5221p3515p0565M2656
9155b290698O640l0234l0229M8244j2352l1828P494K5655k468L1855q402O9719
9143b216604J9277j330J9370J0920K3832K669j00297K8584O1609j01707p1652
9132b325329J0315k4670M2463O6018K7180j3424M7610R1721L2586j11212n2049
9121b208791P4494J6550o8159j798O0736o023j5561o1538J2465N0098J2674m0215
9109b175068o3006j5564j3122k2437j4693K8263J01975J6464O922Q276K4765o6282
$$ plain form
9097 -2183507 -2274885 -2267405 -2167829 -2165542 -2203119 -2207454 -2124490 -2114455 -2100500 -2131084 -2149516 -2167322
9085 -2167322 -2155129 -2161685 -2127932 -2152080 -2158318 -2153005 -2135044 -2163122 -2206557 -2136249 -2156904 -2152834
9073 -2152834 -2171009 -2190430 -2165890 -2161131 -2176502 -2246783 -2253606 -2184499 -2170367 -2196689 -2220477 -2170579
9061 -2170579 -2021049 -2041851 -2039487 -1970114 -2021073 -2085403 -2039331 -2038583 -2088867 -2118409 -2145436 -2129233
9049 -2129233 -2125027 -2107597 -2080930 -2031464 -2085101 -2114126 -2118234 -2106939 -2124618 -2093249 -2055473 -2029577
9037 -2029577 -2024746 -2056307 -2043839 -2034816 -2012565 -2051623 -2164557 -2200116 -2068859 -2054257 -2091180
9026 -2091180 -2135356 -2163016 -2172454 -2162613 -2243041 -2201517 -2205714 -2148386 -2024893 -1968077 -1966312 -1985948
9014 -1985948 -2035419 -2124422 -2206741 -2184597 -2073043 -2020295 -2030885 -2059770 -2131228 -2196883 -2126184
$$ packed form
9097b183507r1378P480R9576K287l7577m335Q2964J0035J3955l0584j8432j7806
9085b167322J2193o556L3753k4148o238N313J7961k8078m3435P0308k0655M070
9073b152834j8175j9421K4540M759j5371p0281o823O9107J4132k6322k3788M9898
9061b170579J49530k0802K364O9373n0959o4330M6072P48n0284k9542k7027J6203
9049b129233M206J7430K6667M9466n3637k9025m108J1295j7679L1369L7776K5896
9037b029577M831l1561J2468R023K2251l9058j12934l5559J31257J4602l6923
9026b091180m4176k7660r438R841q0428M1524m197N7328J23493N6816J765j9636
9014a985948m9471q9003q2319K2144J11554N2748j0590k8885p1458o5655P0699
$$ plain form
9003 -2126184 -2078748 -2021431 -1972428 -2002705 -2117214 -2165796 -2150491 -2197055 -2191420 -2158605 -2130385
8992 -2130385 -2057677 -2097385 -2105190 -2093455 -2135828 -2156826 -2152764 -2125022 -2123655 -2144067 -2049372 -1920263
8980 -1920263 -1948833 -2032759 -2036931 -2015960 -1958517 -1959341 -1952694 -1913693 -1880455 -1920371 -1992207 -2036534
8968 -2036534 -2057428 -2036587 -2079466 -2015618 -1956689 -1927298 -1952322 -2034892 -2051987 -1940418 -1928042
8957 -1928042 -2022615 -2106852 -2083761 -2068665 -2107498 -2132214 -2078373 -1980945 -1956526 -1976988 -1947084
8946 -1947084 -1962484 -2049441 -2033876 -2095786 -2100056 -2062782 -2070384 -2096399 -2094317 -2090044 -2082857 -2037694
8934 -2037694 -2102488 -2060641 -2003929 -1971539 -1975956 -2033883 -2049620 -2098721 -2088836 -2102251 -2021722 -2060517
8922 -2060517 -2033802 -2017521 -2076784 -2134801 -2114782 -2028016 -1957962 -1968333 -1933030 -1926638 -1937726 -1916399
$$ packed form
9003b126184M7436N7317M9003l0277j14509m8582J5305m6564N635L2815K8220
8992b130385P2708l9708p805J1735m2373k0998M062K7742J367k0412R4695J29109
8980a920263k8570q3926m172K0971N7443q24O647L9001L3238l9916p1836m4327
8968b036534k0894K0841m2879O3848N8929K9391k5024q2570j7095J11569J2376
8957a928042r4573q4237K3091J5096l8833k4716N3841R7428K4419k0462K9904
8946a947084j5400q6957J5565o1910m270L7274p602k6015K082M273P187M5163
8934b037694o4794M1847N6712L2390m417n7927j5737m9101R885j3415Q0529l8795
8922b060517K6715J6281n9263n8017K0019Q6766P0054j0371L5303O392j1088K1327
$$ plain form
8910 -1916399 -1995329 -2106933 -2076164 -2049238 -2024828 -2058128 -2099940 -2030043 -1962513 -1949901 -1960319
8899 -1960319 -1966702 -1900914 -1903844 -1907637 -1914744 -1907400 -1943111 -1992324 -2015050 -2016820 -2029143 -2064132 -2109310
8886 -2109310 -2079945 -2039378 -2051271 -2049916 -2014952 -2049649 -2009666 -2020287 -2001590 -2018394 -2040138 -2062025
8874 -2062025 -2043096 -2035794 -2046530 -1979771 -1942571 -1928543 -1925371 -1896929 -1903502 -1870958 -1829764 -1865279
8862 -1865279 -1937044 -1876251 -1818513 -1792103 -1862260 -1906053 -1878684 -1877494 -1912905 -1972446 -1987958 -1995792
8850 -1995792 -2064384 -2057395 -2031282 -1988209 -1942233 -1809971 -1805505 -1847961 -1902039 -1892741 -1976640 -2010088
8838 -2010088 -1933718 -1860256 -1916148 -1909241 -1957607 -1932263 -1845267 -1825731 -1879059 -1956953 -1917309 -1896033
8826 -1896033 -1948733 -1899261 -1857382 -1937170 -2066765 -2102018 -2054214 -1944066 -1852618 -1861120 -1820872
$$ packed form
8910a916399p8930j11604L0769K6926K4410l3300m1812O9897O7530J2612j0418
8899a960319o383O5788k930l793p107P344l5711m9213k2726j770j2323l4989m5178
8886b109310K9365M0567j1893J355L4964l4697L9983j0621J8697j6804k1744k1887
8874b062025J8929P302j0736O6759L7200J4028L172K8442o573L2544M1194l5515
8862a865279p1765O0793N7738K6410p0157m3793K7369J190l5411n9541j5512p834
8850a995792o8592O989K6113M3073M5976J32262M466m2456n4078R298q3899l3448
8838b010088P6370P3462n5892O907m8366K5344Q6996J9536n3328p7894L9644K1276
8826a896033n2700M9472M1879p9788j29595l5253M7804J10148R1448q502M0248
$$ plain form
8815 -1820872 -1760036 -1753240 -1842341 -1856845 -1781497 -1791448 -1904858 -1858089 -1840336 -1833855 -1869767 -1889434
8803 -1889434 -1845212 -1898877 -1988351 -2011714 -1997407 -1847479 -1785617 -1820245 -1807153 -1788409 -1801495
8792 -1801495 -1803342 -1728786 -1743037 -1693339 -1664931 -1706616 -1804304 -1831448 -1913824 -1977627 -2010384 -1894112
8780 -1894112 -1879036 -1918295 -1901656 -1830863 -1798693 -1866820 -1861995 -1808578 -1829082 -1910338 -1862944 -1826803
8768 -1826803 -1883470 -1910003 -1838725 -1818672 -1838731 -1828072 -1758730 -1812845 -1875037 -1912405 -1861778
8757 -1861778 -1859239 -1805870 -1828954 -1808686 -1800883 -1815320 -1848583 -1835940 -1809552 -1895699 -1858969 -1781231
8745 -1781231 -1749488 -1703337 -1747897 -1840798 -1834274 -1832461 -1841167 -1899154 -1848684 -1874975 -1883605 -1850615
8733 -1850615 -1835424 -1824327 -1767430 -1768233 -1756651 -1728922 -1744844 -1789633 -1793419 -1840038 -1903204 -1949795
$$ packed form
8815a820872O0836O796q9101j4504P5348r951j13410M6769J7753O481l5912j9667
8803a889434M4222n3665q9474k3363J4307J49928O1862l4628J3092J8744j3086
8792a801495j847P4556j4251M9698K8408m1685r7688k7144q2376o3803l2757J16272
8780a894112J5076l9259J6639P0793L2170o8127M825N3417k0504q1256M7394L6141
8768a826803n6667k6533P1278K0053k0059J0659O9342n4115o2192l7368N0627
8757a861778K539N3369k3084K0268P803j4437l3263J2643K6388q6147L6730P7738
8745a781231L1743M6151m4560r2901O524J813q706n7987N0470k6291q630L2990
8733a850615J5191J1097N6897q03J1582K7729j5922m4789l786m6619o3166m6591
$$ plain form
8721 -1949795 -1972069 -2023311 -2011819 -1920748 -1819374 -1712786 -1699767 -1790337 -1855210 -1781558 -1752175
8710 -1752175 -1729212 -1765693 -1805248 -1760046 -1608338 -1678595 -1741050 -1742153 -1717207 -1659937 -1697489
8699 -1697489 -1751734 -1702287 -1676836 -1748318 -1742256 -1713265 -1680992 -1762846 -1833522 -1754421 -1713539 -1670475
8687 -1670475 -1726190 -1745943 -1746646 -1690413 -1703547 -1738849 -1660909 -1556201 -1474139 -1557564 -1651032 -1718554
8675 -1718554 -1687970 -1721939 -1752718 -1783136 -1814792 -1839766 -1774688 -1767856 -1764838 -1693367 -1617992 -1648646
8663 -1648646 -1596257 -1524697 -1520949 -1624512 -1691290 -1695781 -1731339 -1787507 -1749002 -1739194 -1640665 -1526570
8651 -1526570 -1539132 -1607746 -1728122 -1741328 -1708114 -1649109 -1708941 -1719778 -1743482 -1821629 -1809958
8640 -1809958 -1818766 -1794630 -1786000 -1722784 -1759886 -1745905 -1705570 -1725871 -1783515 -1832881 -1873148 -1891607
$$ packed form
8721a949795k2274n1242J1492R1071J01374J06588J3019r0570o4873P3652K9383
8710a752175K2963l6481l9555M5202J51708p0257o2455j103K4946N7270l7552
8699a697489n4245M9447K5451p1482O062K8991L2273q1854p0676P9101M0882M3064
8687a670475n5715j9753p03N6233j3134l5302P7940J04708Q2062q3425r3468o7522
8675a718554L0584l3969l0779l0418l1656k4974O5078O832L018P1471P5375l0654
8663a648646N2389P1560L748j03563o6778m491l5558n6168L8505R808R8529J14095
8651a526570j2562o8614j20376j3206L3214N9005n9832j0837k3704p8147J1671
8640a809958q808K4136Q630O3216l7102J3981M0335k0301n7644m9366m0267j8459
$$ plain form
8628 -1891607 -1862681 -1826410 -1828219 -1816792 -1690430 -1619125 -1663433 -1722522 -1686226 -1654811 -1686289
8617 -1686289 -1668633 -1636475 -1612978 -1704558 -1691344 -1643950 -1585393 -1655635 -1724296 -1722109 -1662412 -1674448
8605 -1674448 -1720056 -1674512 -1644028 -1622876 -1629701 -1699915 -1721619 -1760450 -1712181 -1723308 -1725273 -1753031
8593 -1753031 -1751987 -1748183 -1733667 -1734046 -1721422 -1742322 -1803699 -1806190 -1742729 -1694412 -1713029 -1751183
8581 -1751183 -1785937 -1839874 -1778874 -1744009 -1607501 -1587311 -1655002 -1640417 -1664103 -1762779 -1740369
8570 -1740369 -1666990 -1696202 -1697363 -1721790 -1756612 -1732912 -1726732 -1692713 -1783938 -1756135 -1722113 -1695471
8558 -1695471 -1665717 -1663181 -1592488 -1526815 -1547883 -1571357 -1581930 -1609576 -1734362 -1712098 -1751734
8547 -1751734 -1751242 -1784795 -1836577 -1819008 -1733615 -1657437 -1621717 -1656139 -1749291 -1739207 -1647587 -1630337
$$ packed form
8628a891607K8926L6271j809J1427J26362P1305m4308n9089L6296L1415l1478
8617a686289J7656L2158K3497r1580J3214M7394N8557p0242o8661K187N9697j2036
8605a674448m5608M5544L0484K1152o825p0214k1704l8831M8269j1127j965k7758
8593a753031J044L804J4516l79J2624k0900o1377k491O3461M8317j8617l8154
8581a751183l4754n3937O1000L4865J36508K0190o7691J4585k3686r8676K2410
8570a740369P3379k9212j161k4427l4822K3700O180L4019r1225K7803L4022K6642
8558a695471K9754K536P0693O5673k1068k3474j0573k7646j24786K2264l9636
8547a751734M92l3553n1782J7569Q5393P6178L5720l4422r3152J0084R1620J7250
$$ plain form
8535 -1630337 -1664343 -1701829 -1683554 -1706922 -1794312 -1822992 -1820684 -1784834 -1688709 -1706828 -1681405 -1650737
8523 -1650737 -1684327 -1730058 -1824369 -1882002 -1870679 -1824393 -1691701 -1631055 -1704251 -1731348 -1717169
8512 -1717169 -1715946 -1736256 -1705776 -1710536 -1755469 -1776944 -1762005 -1812552 -1824139 -1798777 -1808594 -1778290
8500 -1778290 -1733817 -1658428 -1644567 -1610077 -1602821 -1658016 -1728002 -1750514 -1744196 -1758185 -1762924 -1669146
8488 -1669146 -1677696 -1638208 -1692281 -1752565 -1748363 -1676318 -1614545 -1616481 -1596972 -1604184 -1648038 -1655579
8476 -1655579 -1654108 -1685939 -1757729 -1802882 -1755684 -1727202 -1695558 -1774747 -1824523 -1847062 -1831616 -1823575
8464 -1823575 -1768908 -1718769 -1759465 -1716859 -1603660 -1596558 -1698855 -1707230 -1632076 -1588046 -1614795
8453 -1614795 -1579405 -1535385 -1528314 -1569896 -1606074 -1592192 -1581632 -1539185 -1564136 -1562084 -1583726 -1582075
$$ packed form
8535a630337l4006l7486J8275k3368q7390k8680K308L5850R6125j8119K5423L0668
8523a650737l3590m5731r4311n7633J1323M6286J32692O0646p3196k7097J4179
8512a717169J223k0310L0480m760m4933k1475J4939n0547j1587K5362r817L0304
8500a778290M4473P5389J3861L4490P256n5195o9986k2512O318j3989m739R3778
8488a669146q550L9488n4073o0284M202P2045O1773j936J9509p212m3854p541
8476a655579J471l1831p1790m5153M7198K8482L1644p9189m9776k2539J5446Q041
8464a823575N4667N0139m0696M2606J13199P102j02297q375P5154M4030k6749
8453a614795L5390M4020P071m1582l6178J3882J0560M2447k4951K052k1642J651
$$ plain form
8441 -1582075 -1500857 -1518686 -1525784 -1530076 -1504121 -1524017 -1580230 -1606991 -1594164 -1572671 -1615424 -1687780
8429 -1687780 -1682186 -1643306 -1592023 -1565415 -1640085 -1698625 -1689018 -1630193 -1570470 -1598218 -1619111 -1591998
8417 -1591998 -1632672 -1659375 -1664366 -1647006 -1642070 -1616937 -1602816 -1572180 -1683725 -1726916 -1718847 -1708911
8405 -1708911 -1692549 -1665995 -1695844 -1670058 -1574048 -1547975 -1482692 -1514737 -1604566 -1627998 -1723300
8394 -1723300 -1720038 -1710419 -1728079 -1771286 -1794356 -1793810 -1776825 -1706327 -1643937 -1641224 -1689069 -1638155
8382 -1638155 -1616171 -1634040 -1578278 -1569497 -1531829 -1576550 -1600903 -1593174 -1570730 -1524884 -1525014 -1539850
8370 -1539850 -1494242 -1596404 -1729442 -1750465 -1596405 -1560247 -1573095 -1607282 -1637954 -1621057 -1630668
8359 -1630668 -1573496 -1586163 -1560868 -1548116 -1535511 -1476105 -1474284 -1539527 -1618728 -1578179 -1542992 -1519251
$$ packed form
8441a582075Q1218j7829p098m292K5955j9896n6213k6761J2827K1493m2753p2356
8429a687780N594L8880N1283K6608p4670n8540R607N8825N9723k7748k0893K7113
8417a591998m0674k6703m991J7360M936K5133J4121L0636j11545m3191Q069R936
8405a708911J6362K6554k9849K5786R6010K6073O5283l2045q9829k3432r5302
8394a723300L262R619j7660m3207k3070N46J6985P0498O2390K713m7845N0914
8382a638155K1984j7869N5762Q781L7668m4721k4353P729K2444M5846j30j4836
8370a539850M5608j02162j33038k1023J54060L6158j2848l4187l0672J6897r611
8359a630668N7172j2667K5295J2752J2605N9406J821o5243p9201M0549L5187K3741
$$ plain form
8347 -1519251 -1561705 -1657143 -1719592 -1701787 -1630865 -1587221 -1541625 -1575314 -1553354 -1531660 -1542051
8336 -1542051 -1514062 -1415688 -1417834 -1529876 -1555077 -1551788 -1561834 -1566523 -1586196 -1557070 -1551697 -1550018
8324 -1550018 -1595697 -1654279 -1643209 -1636558 -1591030 -1541866 -1580285 -1615676 -1623274 -1629602 -1594335 -1587197
8312 -1587197 -1657270 -1671635 -1655793 -1600087 -1600015 -1598885 -1493843 -1486259 -1626621 -1679411 -1722692 -1681219
8300 -1681219 -1677170 -1557521 -1550756 -1541814 -1514745 -1516498 -1528329 -1615701 -1631799 -1534202 -1444255 -1468942
8288 -1468942 -1521942 -1566703 -1553489 -1554503 -1533751 -1573030 -1588723 -1624402 -1656855 -1677941 -1648435 -1611007
8276 -1611007 -1568213 -1492858 -1507231 -1562441 -1573105 -1615212 -1581697 -1525040 -1445431 -1473780 -1442288
8265 -1442288 -1414433 -1530478 -1590909 -1606498 -1525243 -1542464 -1528076 -1504182 -1507995 -1567533 -1603860
$$ packed form
8347a519251m2454r5438o2449J7805P0922M3644M5596l3689K1960K1694j0391
8336a542051K7989R8374k146j12042k5201L289j0046m689j9673K9126N373J679
8324a550018m5679n8582J1070O651M5528M9164l8419l5391p598o328L5267P138
8312a587197p0073j4365J5842N5706P2J130J05042P584j40362n2790m3281M1473
8300a681219M049J19649O765Q942K7069j753j1831q7372j6098R7597Q9947k4687
8288a468942n3000m4761J3214j014K0752l9279j5693l5679l2453k1086K9506L7428
8276a611007M2794P5355j4373n5210j0664m2107L3515N6657P9609k8349L1492
8265a442288K7855j16045o0431j5589Q1255j7221J4388K3894l813n9538l6327
$$ plain form
8254 -1603860 -1577729 -1564871 -1551869 -1519061 -1493663 -1545822 -1624744 -1636460 -1624486 -1597225 -1551799
8243 -1551799 -1552049 -1556982 -1524913 -1495880 -1551180 -1631225 -1723522 -1700213 -1711943 -1704191 -1653572 -1524212
8231 -1524212 -1484095 -1525861 -1471131 -1479284 -1457393 -1423551 -1502067 -1563305 -1557117 -1484785 -1487097 -1563654
8219 -1563654 -1537969 -1473258 -1505587 -1540824 -1601611 -1495157 -1460689 -1554119 -1571923 -1617336 -1593503
8208 -1593503 -1540635 -1541777 -1537314 -1508836 -1437227 -1466332 -1546901 -1505433 -1442733 -1474667 -1471820 -1530499
8196 -1530499 -1515233 -1444784 -1431678 -1453527 -1423454 -1377072 -1411792 -1517815 -1576815 -1584892 -1582892 -1567147
8184 -1567147 -1532288 -1514866 -1568494 -1608097 -1578386 -1556999 -1543238 -1596834 -1616367 -1655182 -1634901
8173 -1634901 -1570252 -1567183 -1594389 -1667237 -1647043 -1510666 -1459035 -1477934 -1360720 -1302278 -1299738
$$ packed form
8254a603860K6131J2858J3002L2808K5398n2159p8922j1716J1974K7261M5426
8243a551799k50m933L2069K9033n5300q0045r2297K3309j1730P752N0619J29360
8231a524212M0117m1766N4730q153K1891L3842p8516o1238O188P2332k312p6557
8219a563654K5685O4711l2329l5237o0787J06454L4468r3430j7804m5413K3833
8208a593503N2868j142M463K8478P1609k9105q0569M1468O2700l1934K847n8679
8196a530499J5266P0449J3106k1849L0073M6382l4720j06023n9000q077K000J5745
8184a567147L4859J7422n3628l9603K9711K1387J3761n3596j9533l8815K0281
8173a634901O4649L069k7206p2848K0194J36377N1631j8899J17214N8442K540
$$ plain form
8162 -1299738 -1368973 -1415871 -1441145 -1329703 -1372781 -1459461 -1499557 -1442461 -1399345 -1332975 -1317044
8151 -1317044 -1385763 -1453778 -1475355 -1414244 -1419421 -1413862 -1441286 -1514495 -1606413 -1604615 -1512259 -1430507
8139 -1430507 -1363115 -1402264 -1440667 -1440165 -1495235 -1544859 -1566561 -1583678 -1577652 -1531230 -1446906 -1413416
8127 -1413416 -1429543 -1401477 -1357807 -1367480 -1371316 -1402218 -1398022 -1420383 -1309987 -1314542 -1412492 -1494435
8115 -1494435 -1556354 -1523655 -1519515 -1521531 -1422074 -1346315 -1430654 -1401305 -1343781 -1379197 -1438408 -1425534
8103 -1425534 -1442865 -1442414 -1478142 -1494308 -1465031 -1497748 -1501790 -1388632 -1404724 -1398565 -1437078 -1421525
8091 -1421525 -1399508 -1428649 -1464378 -1519311 -1450341 -1451390 -1413812 -1381610 -1358642 -1316617 -1356265 -1345140
8079 -1345140 -1327142 -1270389 -1306483 -1382409 -1378462 -1397023 -1439568 -1408012 -1394876 -1372532 -1438380 -1425263
$$ packed form
8162a299738o9235m6898k5274J11442m3078q6680m0096N7096M3116O6370J5931
8151a317044o8719o8015k1577O1111n177N559k7424p3209r1918J798R2356Q1752
8139a430507O7392l9149l8403N02n5070m9624k1702j7117O026M6422Q4324L3490
8127a413416j6127K8066M3670r673l836l0902M196k2361J10396m555r7950q1943
8115a494435o1919L2699M140k016R9457P5759q4339K9349N7524l5416n9211J2874
8103a425534j7331M51l5728j6166K9277l2717m042J13158j6092O159l8513J5553
8091a421525K2017k9141l5729n4933O8970j049L7578L2202K2968M2025l9648J1125
8079a345140J7998N6753l6094p5926L947j8561m2545L1556J3136K2344o5848J3117
$$ plain form
8067 -1425263 -1402880 -1395547 -1410861 -1378613 -1381131 -1427171 -1542888 -1538313 -1509747 -1516060 -1467214 -1385886
8055 -1385886 -1333992 -1368272 -1426334 -1477475 -1475142 -1483126 -1489601 -1477851 -1368863 -1370900 -1440811 -1466416
8043 -1466416 -1416291 -1418690 -1398009 -1464142 -1496424 -1449571 -1366888 -1359949 -1376642 -1393343 -1430866 -1449773
8031 -1449773 -1419552 -1386126 -1446959 -1453563 -1374002 -1291471 -1326156 -1415858 -1368115 -1266961 -1330982
8020 -1330982 -1469272 -1466638 -1422722 -1370260 -1325043 -1386182 -1434363 -1490047 -1544769 -1523991 -1453527
8009 -1453527 -1426661 -1377942 -1295500 -1289501 -1336785 -1381088 -1407753 -1498913 -1516672 -1546794 -1484145 -1446541
7997 -1446541 -1454648 -1498872 -1508955 -1471473 -1486974 -1476877 -1481064 -1366866 -1312129 -1396909 -1458196 -1418855
7985 -1418855 -1358369 -1334766 -1276400 -1252443 -1244812 -1290892 -1343327 -1344038 -1332511 -1324845 -1351842 -1311864
$$ packed form
8067a425263K2383P333j5314L2248k518m6040j15717M575K8566o313M8846Q1328
8055a385886N1894l4280n8062n1141K333p984o475J1750J08988k037o9911k5605
8043a466416N0125k399K0681o6133l2282M6853Q2683O939j6693j6701l7523j8907
8031a449773L0221L3426o0833o604P9561Q2531l4685q9702M7743J01154o4021
8020a330982j38290K634M3916N2462M5217o1139m8181n5684n4722K0778P0464
8009a453527K6866M8719Q2442N999m7284m4303k6665r1160j7759l0122O2649L7604
7997a446541q107m4224j0083L7482j5501J0097m187J14198N4737q4780o1287L9341
7985a418855O0486K3603N8366K3957P631m6080n2435p11J1527P666k6997L9978
$$ plain form
7973 -1311864 -1383432 -1404034 -1363982 -1337900 -1426588 -1454737 -1437065 -1487681 -1524555 -1449780 -1405054
7962 -1405054 -1398560 -1422007 -1443920 -1444052 -1370214 -1377647 -1401487 -1407475 -1401667 -1410351 -1475180 -1549157 -1510009
7949 -1510009 -1422579 -1427279 -1508567 -1535109 -1533111 -1508189 -1546633 -1539960 -1520543 -1478966 -1459035 -1462520
7937 -1462520 -1443742 -1444715 -1448495 -1375239 -1461582 -1435795 -1392777 -1412303 -1464619 -1385515 -1335415 -1278049
7925 -1278049 -1339081 -1394434 -1395858 -1428108 -1442445 -1414913 -1443553 -1380507 -1379045 -1350336 -1293719 -1281919
7913 -1281919 -1280665 -1247193 -1221450 -1240724 -1216840 -1226377 -1249370 -1368127 -1378813 -1342047 -1284524 -1277238
7901 -1277238 -1235532 -1225882 -1273806 -1310542 -1310055 -1298159 -1308754 -1320589 -1316796 -1391755 -1413001 -1349795
7889 -1349795 -1358909 -1335519 -1282336 -1346582 -1409374 -1369429 -1352690 -1376907 -1350673 -1356975 -1409889 -1457161
$$ packed form
7973a311864p1568k0602M0052K6082q8688k8149J7672n0616l6874P4775M4726
7962a405054O494k3447k1913j32P3838p433k3840n988N808q684o4829p3977L9148
7949a510009Q7430m700q1288k6542J998K4922l8444O673J9417M1577J9931l485
7937a462520J8778r73l780P3256q6343K5787M3018j9526n2316P9104N0100N7366
7925a278049o1032n5353j424l2250j4337K7532k8640O3046J462K8709N6617J1800
7913a281919J254L3472K5743j9274K3884r537k2993j18757j0686L6766N7523P286
7901a277238M1706R650m7924l6736M87J1896j0595j1835L793p4959k1246O3206
7889a349795r114K3390N3183o4246o2792L9945J6739k4217K6234o302n2914m7272
$$ plain form
7877 -1457161 -1487082 -1447691 -1430859 -1459221 -1429256 -1368445 -1374599 -1303748 -1189674 -1166001 -1268444
7866 -1268444 -1445506 -1428304 -1348328 -1356393 -1385617 -1327736 -1357841 -1329487 -1313835 -1424452 -1477708
7855 -1477708 -1409945 -1343237 -1352358 -1335680 -1288561 -1328308 -1395862 -1336883 -1326033 -1356431 -1396206 -1357027
7843 -1357027 -1305690 -1340553 -1403778 -1398430 -1413807 -1329345 -1331021 -1377356 -1420985 -1456052 -1443214 -1487784
7831 -1487784 -1520433 -1498928 -1385933 -1249439 -1222930 -1211533 -1206477 -1241308 -1283828 -1305334 -1321896
7820 -1321896 -1268760 -1285526 -1264651 -1232251 -1224434 -1234978 -1236839 -1322604 -1273264 -1224569 -1171044 -1131122
7808 -1131122 -1179388 -1191171 -1163162 -1180949 -1255807 -1275987 -1269818 -1356017 -1458701 -1429677 -1433997 -1422027
7796 -1422027 -1431419 -1378443 -1350310 -1326271 -1304082 -1264157 -1199818 -1243637 -1302608 -1347219 -1346731 -1368043
$$ packed form
7877a457161k9921L9391J6832k8362K9965O0811o154P0851J14074K3673j02443
7866a268444j77062J7202P9976q065k9224N7881l0105K8354J5652j10617n3256
7855a477708O7763O6708r121J6678M7119l9747o7554N8979J0850l0398l9775L9179
7843a357027N1337l4863o3225N348j5377Q4462j676m6335m3629l5067J2838m4570
7831a487784l2649K1505J12995J36494K6509J1397N056l4831m2520k1506j6562
7820a321896N3136j6766K0875L2400P817j0544j861q5765M9340M8695N3525L9922
7808a131122m8266j1783K8009j7787p4858k0180O169q6199j02684K9024m320J1970
7796a422027r392N2976K8133K4039K2189L9925O4339m3819n8971m4611M88k1312
$$ plain form
7784 -1368043 -1383195 -1336722 -1335566 -1374628 -1375710 -1373104 -1301617 -1250417 -1299094 -1334736 -1309191 -1309162 -1376066
7771 -1376066 -1428913 -1453016 -1396721 -1278064 -1261576 -1275496 -1249973 -1299564 -1255453 -1215997 -1178858
7760 -1178858 -1257359 -1320340 -1316381 -1264548 -1266060 -1239587 -1264884 -1341800 -1357040 -1352312 -1310678 -1284164
7748 -1284164 -1277031 -1275334 -1293653 -1258516 -1302807 -1378811 -1398562 -1367860 -1345766 -1368465 -1418554 -1439349
7736 -1439349 -1410586 -1393043 -1402827 -1365379 -1309219 -1320816 -1369052 -1363753 -1358094 -1375051 -1311671 -1248922
7724 -1248922 -1207283 -1227427 -1293121 -1217905 -1145372 -1166494 -1185460 -1224967 -1213184 -1222007 -1219680 -1188680
7712 -1188680 -1191662 -1171927 -1136235 -1131735 -1245276 -1313007 -1379738 -1487101 -1517755 -1392586 -1267503
7701 -1267503 -1254334 -1316155 -1318479 -1339962 -1301600 -1281508 -1309597 -1304140 -1263934 -1276909 -1246799 -1259291
$$ packed form
7784a368043j5152M6473J156l9062j082K606P1487N1200m8677l5642K5545K9o6904
7771a376066n2847k4103N6295J18657J6488j3920K5523m9591M4111L9456L7139
7760a178858p8501o2981L959N1833j512K6473k5297p6916j5240M728M1634K6514
7748a284164P133J697j8319L5137m4291p6004j9751L0702K2094k2699n0089k0795
7736a439349K8763J7543r784L7448N6160j1597m8236N299N659j6957O3380O2749
7724a248922M1639k0144o5694P5216P2533k1122j8966l9507J1783q823K327L1000
7712a188680k982J9735L5692M500j13541o7731o6731j07363l0654J25169J25083
7701a267503J3169o1821k324k1483L8362K0092k8089N457M0206j2975L0110j2492
$$ plain form
7689 -1259291 -1293177 -1325253 -1290285 -1381943 -1447276 -1383420 -1339113 -1341986 -1351825 -1353794 -1294895 -1241594
7677 -1241594 -1204967 -1179160 -1170627 -1204202 -1297236 -1352294 -1387860 -1317725 -1280387 -1265476 -1331564 -1375575
7665 -1375575 -1301395 -1222808 -1275549 -1309624 -1310430 -1240659 -1229117 -1223374 -1180935 -1149168 -1233081 -1273199
7653 -1273199 -1242314 -1253050 -1266800 -1170060 -1130833 -1159441 -1247131 -1350882 -1306188 -1331050 -1387247
7642 -1387247 -1260434 -1265461 -1334828 -1283454 -1286152 -1294717 -1405906 -1412338 -1290021 -1231710 -1187636 -1143792
7630 -1143792 -1247163 -1330554 -1313674 -1327829 -1272457 -1230897 -1273188 -1291923 -1285580 -1265726 -1301566
7619 -1301566 -1304137 -1201246 -1162119 -1194476 -1243823 -1264256 -1271965 -1306463 -1382713 -1380515 -1321751 -1271651
7607 -1271651 -1282081 -1390288 -1399833 -1398722 -1366504 -1367805 -1285838 -1164111 -1160807 -1189462 -1332401 -1329289
$$ packed form
7689a259291l3886l2076L4968r1658o5333O3856M4307k873r839j969N8899N3301
7677a241594L6627K5807Q533l3575r3034n5058l5566P0135L7338J4911o6088m4011
7665a375575P4180P8587n2741l4075q06O9771J1542N743M2439L1767q3913m0118
7653a273199L0885j0736j3750R6740L9227k8608q7690j03751M4694k4862n6197
7642a387247J26813n027o9367N1374k698q565j11189o432J22317N8311M4074M3844
7630a143792j03371q3391J6880j4155N5372M1560m2291j8735O343J9854l5840
7619a301566k571J02891L9127l2357m9347k0433p709l4498p6250K198N8764N0100
7607a271651j0430j08207r545J111L2218j301Q1967J21727L304k8655j42939L112
$$ plain form
7595 -1329289 -1208940 -1134508 -1149686 -1240213 -1281229 -1208304 -1190233 -1218199 -1315760 -1306036 -1290332
7584 -1290332 -1267243 -1269708 -1239486 -1277509 -1354356 -1321352 -1285302 -1311299 -1310253 -1243276 -1110936 -1070741
7572 -1070741 -1099020 -1168015 -1257652 -1291815 -1281366 -1253967 -1257581 -1259803 -1167767 -1171233 -1268386 -1270993
7560 -1270993 -1173340 -1071548 -1094195 -1155766 -1234211 -1233785 -1225943 -1219099 -1178614 -1204809 -1205389 -1171974
7548 -1171974 -1212954 -1216888 -1213832 -1200179 -1198777 -1160351 -1197684 -1249828 -1216674 -1210005 -1134791 -1096113
7536 -1096113 -1123960 -1142564 -1124441 -1136455 -1144391 -1166175 -1195071 -1124276 -1143234 -1210686 -1144529 -1118532
7524 -1118532 -1112141 -1186530 -1197622 -1147703 -1157010 -1139209 -1165788 -1217510 -1206927 -1234627 -1227020 -1274522
7512 -1274522 -1275311 -1157098 -1118484 -1091463 -1136199 -1150473 -1080716 -1121951 -1118033 -1177609 -1189588 -1130151
$$ packed form
7595a329289J20349P4432j5178r0527m1016P2925J8071k7966r7561R724J5704
7584a290332K3089k465L0222l8023p6847L3004L6050k5997J046O6977J32340M0195
7572a070741k8279o8995q9637l4163J0449K7399l614k222R2036l466r7153k607
7560a270993R7653J01792k2647o1571p8445M26P842O844M0485k6195n80L3415
7548a171974m0980l934L056J3653J402L8426l7333n2144L3154O669P5214L8678
7536a096113k7847j8604J8123j2014p936k1784k8896P0795j8958o7452O6157K5997
7524a118532O391p4389j1092M9919r307J7801k6579n1722J0583k7700P607m7502
7512a274522p89J18213L8614K7021m4736j4274O9757m1235L918n9576j1979N9437
$$ plain form
7500 -1130151 -1185252 -1271112 -1251020 -1203298 -1178021 -1189018 -1240685 -1195290 -1150148 -1133610 -1116527
7489 -1116527 -1063979 -1085946 -1115131 -1080700 -1060737 -1133075 -1234942 -1238196 -1285283 -1301795 -1298964 -1253256
7477 -1253256 -1132776 -1112887 -1120171 -1114802 -1216221 -1162409 -1123914 -1072269 -1048604 -1085567 -1172026
7466 -1172026 -1211639 -1144062 -1151309 -1149915 -1134424 -1170121 -1184392 -1137687 -1184715 -1163085 -1134818 -1120602
7454 -1120602 -1153728 -1222304 -1285166 -1206568 -1148138 -1106724 -1162185 -1177219 -1239347 -1273177 -1228331
7443 -1228331 -1158780 -1311064 -1293400 -1223347 -1218859 -1203870 -1207571 -1311082 -1418169 -1410229 -1327147
7432 -1327147 -1161593 -1180611 -1210703 -1218463 -1246257 -1260989 -1209315 -1195024 -1223280 -1192132 -1195474 -1227909
7420 -1227909 -1304321 -1303233 -1295504 -1309345 -1248291 -1222623 -1197624 -1200398 -1301856 -1270809 -1265555 -1259886
$$ packed form
7500a130151n5101q5860K0092M7722K5277j0997n1667M5395M5142J6538J7083
7489a116527N2548k1967k9185L4431J9963p2338j01867l254m7087j6512K831M5708
7477a253256J20480J9889p284N369j01419N3812L8495N1645K3665l6963q6459
7466a172026l9613O7577p247J394J5491l5697j4271M6705m7028K1630K8267J4216
7454a120602l3126o8576o2862P8598N8430M1414n5461j5034o2128l3830M4846
7443a228331O9551j52284J7664P0053M488J4989l701j03511j07087P940Q3082
7432a327147J65554j9018l0092p760k7794j4732N1674J4291k8256L1148l342l2435
7420a227909p6412J088P729j3841O1054K5668K4999k774j01458L1047N254N669
$$ plain form
7408 -1259886 -1241494 -1175954 -1216467 -1277660 -1315509 -1210290 -1234009 -1309034 -1262059 -1176379 -1131407
7397 -1131407 -1156990 -1185669 -1107622 -1032735 -1038966 -1093712 -1175660 -1224807 -1203266 -1321850 -1289295
7386 -1289295 -1300748 -1328936 -1286430 -1227571 -1238184 -1158351 -1174061 -1212654 -1237772 -1252232 -1292456
7375 -1292456 -1283042 -1263734 -1284406 -1319896 -1327485 -1239853 -1229298 -1295398 -1225974 -1145347 -1160898 -1265509
7363 -1265509 -1329541 -1266874 -1251847 -1259729 -1295058 -1243563 -1224500 -1256843 -1293541 -1240338 -1261895 -1268825
7351 -1268825 -1191096 -1144738 -1176633 -1150348 -1130693 -1116903 -1065804 -1097030 -1155649 -1110324 -1096380
7340 -1096380 -1152636 -1227082 -1206876 -1182202 -1145568 -1120621 -1167219 -1200963 -1252673 -1212282 -1137992
7329 -1137992 -1071327 -1069044 -1082309 -1170748 -1200769 -1120295 -1094587 -1110795 -1166950 -1180513 -1190946 -1197665
$$ packed form
7408a259886J8392O5540m0513o1193l7849J05219k3719p5025M6975Q5680M4972
7397a131407k5583k8679P8047P4887o231n4746q1948m9147K1541j18584L2555
7386a289295j1453k8188M2506N8859j0613P9833j5710l8593k5118j4460m0224
7375a292456R414J9308k0672l5490p589Q7632J0555o6100O9424Q0627j5551j04611
7363a265509o4032O2667J5027p882l5329N1495J9063l2343l6698N3203k1557o930
7351a268825P7729M6358l1895K6285J9655J3790N1099l1226n8619M5325J3944
7340a096380n6256p4446K0206K4674L6634K4947m6598l3744n1710M0391P4290
7329a137992O6665K283j3265q8439l0021Q0474K5708j6208n6155j3563j0433o719
$$ plain form
7317 -1197665 -1142566 -1172602 -1193929 -1213146 -1237344 -1188682 -1152819 -1133208 -1161713 -1218465 -1241094
7306 -1241094 -1230193 -1151153 -1197496 -1201010 -1139308 -1114031 -1107181 -1128952 -1151842 -1169395 -1215535 -1222028
7294 -1222028 -1288805 -1225791 -1116963 -1147111 -1222145 -1266412 -1323548 -1319597 -1302437 -1208954 -1125356
7283 -1125356 -1080894 -1138056 -1162990 -1176492 -1279059 -1192865 -1105167 -1175946 -1187518 -1156863 -1179905
7272 -1179905 -1209951 -1320509 -1335649 -1173591 -1038783 -1015790 -1084737 -1208327 -1233038 -1229479 -1215770
7261 -1215770 -1160055 -1114890 -1098763 -1063504 -1057829 -1154488 -1155160 -1094675 -1087846 -1091692 -1120689 -1183200
7249 -1183200 -1158173 -1184763 -1171192 -1095311 -1121721 -1182918 -1148485 -1138719 -1145448 -1204611 -1118165 -1110881
7237 -1110881 -1157165 -1196304 -1168633 -1134110 -1125734 -1118756 -1099669 -1244637 -1306042 -1328722 -1254674 -1190115
$$ packed form
7317a197665N5099l0036k1327j9217k4198M8662L5863J9611k8505n6752k2629
7306a241094J0901P9040m6343l514O1702K5277O850k1771k2890j7553m6140o493
7294a222028o6777O3014J08828l0148p5034m4267n7136L951J7160R3483Q3598
7283a125356M4462n7162k4934j3502j02567Q6194Q7698p0779j1572L0655k3042
7272a179905l0046j10558j5140J62058J34808K2993o8947j23590k4711L559J3709
7261a215770N5715M5165J6127L5259N675r6659o72O0485O829l846k8997o2511
7249a183200K5027k6590J3571P5881k6410o1197L4433R766o729n9163Q6446P284
7237a110881m6284l9139K7671L4523Q376O978J9087j44968o1405k2680P4048O4559
$$ plain form
7225 -1190115 -1207573 -1223002 -1218945 -1211871 -1185545 -1200195 -1220239 -1252917 -1213640 -1221702 -1114624 -1106879
7213 -1106879 -1177229 -1125537 -1131670 -1168150 -1137721 -1126650 -1121490 -1036727 -974265 -976313 -997809 -1092604
7201 -1092604 -1146518 -1094505 -1063632 -1075019 -1116423 -1131461 -1099866 -1087782 -1051747 -1081216 -1156369
7190 -1156369 -1148723 -1081816 -1045468 -1090847 -1152888 -1124900 -1131291 -1154549 -1127415 -1054307 -1074494 -1073580
7178 -1073580 -990668 -1031393 -1121142 -1060443 -1088599 -1094605 -1117533 -1152013 -1075327 -994726 -1040986 -1132901
7166 -1132901 -1141894 -1165053 -1187522 -1241416 -1151434 -1171039 -1171850 -1162420 -1207425 -1262514 -1311110 -1317881
7154 -1317881 -1308261 -1207416 -1066846 -1073188 -1126816 -1177990 -1209344 -1175962 -1119853 -1174117 -1213061
7143 -1213061 -1233697 -1225622 -1132767 -1054629 -1076550 -1130114 -1138580 -1136067 -1128392 -1103530 -1111666 -1088023
$$ packed form
7225a190115j7458j5429M057P074K6326j4650k0044l2678L9277q062J07078P745
7213a106879p0350N1692o133l6480L0429J1071N160Q4763O2462k048k1496r4795
7201a092604n3914N2013L0873j1387m1404j5038L1595J2084L6035k9469p5153
7190a156369P646O6907L6348m5379o2041K7988o391k3258K7134P3108k0187R14
7178a073580Q2912m0725q9749O0699k8156o006k2928l4480P6686Q0601m6260r1915
7166a132901q993k3159k2469n3894Q9982j9605q11R430m5005n5089m8596o771
7154a317881R620J00845J40570o342n3628n1174l1354L3382N6109n4264l8944
7143a213061k0636Q075R2855P8138k1921n3564q466K513P675K4862q136K3643
$$ plain form
7131 -1088023 -1196807 -1268017 -1231959 -1215506 -1293319 -1339897 -1227410 -1158613 -1111516 -1117483 -1124549
7120 -1124549 -1135172 -1128103 -1140900 -1116968 -1134967 -1118155 -1097471 -1089275 -1104913 -1072002 -1066690 -1051349
7108 -1051349 -1007787 -1013100 -1041672 -1031114 -1057958 -1012702 -971545 -1027015 -1114171 -1075355 -1101685 -1205395
7096 -1205395 -1220442 -1176240 -1079239 -1049294 -1065362 -1056335 -1030992 -1070631 -1108381 -1124402 -1157721 -1116387
7084 -1116387 -1201667 -1225552 -1151458 -1149222 -1089207 -1016044 -964726 -1100255 -1169927 -1160642 -1118077 -1102150
7072 -1102150 -1105794 -1114505 -1153166 -1215467 -1167122 -1143054 -1073693 -1086675 -1181280 -1203715 -1269499 -1283254
7060 -1283254 -1322736 -1341655 -1280899 -1257313 -1263458 -1246112 -1198327 -1164040 -1234573 -1259053 -1255638 -1135794
7048 -1135794 -1049347 -1093572 -1190864 -1192266 -1203431 -1216300 -1168186 -1115832 -1118649 -1126375 -1127698 -1134187
$$ packed form
7131a088023j08784p1210L6058J6453p7813m6578J12487O8797M7097n967p066
7120a124549j0623P069j2797K3932j7999J6812K0684Q196j5638L2911N312J5341
7108a051349M3562n313k8572J0558k6844M5256M1157n5470q7156L8816k6330j03710
7096a205395j5047M4202R7001K9945j6068R027K5343l9639l7750j6021l3319M1334
7084a116387q5280k3885P4094K236O0015P3163N1318j35529o9672R285M2565J5927
7072a102150l644q711l8661o2301M8345K4068O9361j2982r4605k2435o5784j3755
7060a283254l9482j8919O0756K3586o145J7346M7785L4287p0533k4480L415J19844
7048a135794Q6447m4225r7292j402j1165j2869M8114N2354k817p726j323o489
$$ plain form
7036 -1134187 -1054575 -1083624 -1156264 -1184410 -1160141 -1123425 -1148591 -1174185 -1148714 -1106977 -1103454 -1060612
7024 -1060612 -1068912 -1056700 -1115334 -1137842 -1101273 -1031576 -1046937 -1105893 -1086252 -1011058 -992913 -1017906
7012 -1017906 -1030558 -1049297 -995268 -932179 -950477 -927930 -904099 -915452 -962286 -1061746 -997052
7001 -997052 -901971 -941016 -1021771 -1106567 -1108899 -1017929 -987654 -1050737 -1088215 -1138176 -1224037 -1186239
$$ packed form
7036a134187P9612k9049p2640k8146K4269L6716k5166k5594K5471M1737L523M2842
7024a060612q300J2212n8634k2508L6569O9697j5361n8956J9641P5194J8145k4993
7012a017906j2652j8739N4029O3089j8298K2547K3831j1353m6834r9460O4694
7001i97052R5081l9045q0755q4796k332R0970L0275o3083l7478m9961q5861L7798
$$ [...]
##END NTUPLES=NMR SPECTRUM
##END=
