##TITLE=Analysis number 325922
Compound Code rb 00140
Project Code adrs
Chemist Name endeavour
##JCAMPDX= 6.0         $$ Bruker NMR JCAMP-DX V2.0
##DATA TYPE= NMR SPECTRUM
##DATA CLASS= NTUPLES
##ORIGIN= Bruker BioSpin GmbH
##OWNER= nmr
$$ XWIN-NMR		Version 3.5
$$ Fri Jan 19 09:23:13 2007 GMT Standard Time (UT+0h)  MAYBRIDGE\nmr@NMR_250MHZ
##.OBSERVE FREQUENCY= 250.131544655141
##.OBSERVE NUCLEUS= ^1H
##.ACQUISITION MODE= SIMULTANEOUS (DQD)
##.ACQUISITION SCHEME= undefined
##.AVERAGES= 16
##.DIGITISER RES= 18
##SPECTROMETER/DATA SYSTEM= dpx250
##.PULSE SEQUENCE= zg30
##.SOLVENT NAME= DMSO
##.SHIFT REFERENCE= (INTERNAL, DMSO, 0, 16.522)
##AUDIT TRAIL= $$ (NUMBER, WHEN, WHO, WHERE, WHAT)
$$ ##TITLE= Audit trail, XWIN-NMR		Version 3.5
$$ ##JCAMPDX= 5.01
$$ ##ORIGIN= Bruker BioSpin GmbH
$$ ##OWNER= nmr
$$ C:\u/data/dgb/nmr/ADRS/1430/pdata/1/auditp.txt
$$ ##AUDIT TRAIL=  $$ (NUMBER, WHEN, WHO, WHERE, WHAT)
(   1,<2007-01-19 09:22:50.68 +000>,<MAYBRIDGE\nmr>,<NMR_250MHZ>,
      <created by zg, POWCHK disabled, PULCHK disabled
       configuration hash MD5:
       49 4B E0 1D 92 C2 6B 37 9F E6 65 BC 52 41 86 1D
       data hash MD5: 64K
       BD 2F 5B 2A 72 4E F2 F8 7A 13 D0 87 3B CF 25 68>)
(   2,<2007-01-19 09:23:04.52 +000>,<MAYBRIDGE\nmr>,<NMR_250MHZ>,
      <Start of raw data processing
       ef LB = 0.3 FT_mod = 6 PKNL = 1 SI = 32K 
       data hash MD5: 32K
       81 A8 55 EB C4 E7 B5 AF CF 14 90 F5 24 0A 3E 3E>)
(   3,<2007-01-19 09:23:06.08 +000>,<MAYBRIDGE\nmr>,<NMR_250MHZ>,
      <apk 
       data hash MD5: 32K
       16 F1 2C 05 D4 B7 8C 41 BC D8 1A 60 F9 4F 2B 92>)
(   4,<2007-01-19 09:23:06.77 +000>,<MAYBRIDGE\nmr>,<NMR_250MHZ>,
      <abs ABSG = 5 
       data hash MD5: 32K
       C9 64 67 F8 CF F5 81 09 F9 F7 41 8A D0 91 B9 72>)
$$ ##END=
$$ 
$$ hash MD5
$$ F0 F0 0D A4 B6 22 95 00 3A 24 42 D7 F5 29 2B 96
##$RELAX= 
##$RELAX= 
##$RELAX= 
##$RELAX= 
##$RELAX= 
##$RELAX= 
##$RELAX= 
$$ Bruker specific parameters
$$ --------------------------
##$DU= <C:\u>
##$EXPNO= 1430
##$NAME= <ADRS>
##$PROCNO= 1
##$TYPE= <nmr>
##$USER= <dgb>
##$AMP= (0..31)
100 100 100 100 100 100 100 100 100 100 100 100 100 100 100 100 100 100 
100 100 100 100 100 100 100 100 100 100 100 100 100 100 
##$AQSEQ= 0
##$AQ_mod= 3
##$AUNM= <au_zg>
##$AUTOPOS= <5 >
##$BF1= 250.13
##$BF2= 250.13
##$BF3= 250.13
##$BF4= 250.13
##$BF5= 500.13
##$BF6= 500.13
##$BF7= 500.13
##$BF8= 500.13
##$BYTORDA= 1
##$CFDGTYP= 0
##$CFRGTYP= 5
##$CHEMSTR= <none>
##$CNST= (0..31)
1 1 145 1 1 1 1 1 1 1 1 1 1 1 1 1 1 1 1 1 1 1 1 1 1 1 1 1 1 1 1 1 
##$CPDPRG= <>
##$CPDPRG1= <>
##$CPDPRG2= <>
##$CPDPRG3= <>
##$CPDPRG4= <mlev>
##$CPDPRG5= <mlev>
##$CPDPRG6= <mlev>
##$CPDPRG7= <mlev>
##$CPDPRG8= <mlev>
##$CPDPRGB= <>
##$CPDPRGT= <>
##$D= (0..31)
0 1 0 0 0 0 0 0 0 0.06 0 0 0 0 0 0 0.0002 0 0 0 0 0 0 0 0 0 0 0 0 0 0 
0 
##$DATE= 1169198569
##$DBL= (0..7)
120 120 120 120 120 120 120 120 
##$DBP= (0..7)
150 150 150 150 150 150 150 150 
##$DBP07= 0
##$DBPNAM0= <>
##$DBPNAM1= <>
##$DBPNAM2= <>
$$ [...]
##$SUBNAM7= <"">
##$SUBNAM8= <"">
##$SUBNAM9= <"">
##$SW= 20.6930455092707
##$SWIBOX= (0..15)
0 0 3 0 0 0 0 0 0 0 0 0 0 0 0 0 
##$SW_h= 5175.983436853
##$TD= 65536
##$TD0= 1
##$TE= 294.16
##$TE2= 300
##$TE3= 300
##$TEG= 300
##$TL= (0..7)
0 120 120 120 120 120 120 120 
##$TP= (0..7)
150 150 150 150 150 150 150 150 
##$TP07= 0
##$TPNAME0= <>
##$TPNAME1= <>
##$TPNAME2= <>
##$TPNAME3= <>
##$TPNAME4= <>
##$TPNAME5= <>
##$TPNAME6= <>
##$TPNAME7= <>
##$TPOAL= (0..7)
0.5 0.5 0.5 0.5 0.5 0.5 0.5 0.5 
##$TPOFFS= (0..7)
0 0 0 0 0 0 0 0 
##$TUNHIN= 0
##$TUNHOUT= 0
##$TUNXOUT= 0
##$USERA1= <user>
##$USERA2= <user>
##$USERA3= <user>
##$USERA4= <user>
##$USERA5= <user>
##$V9= 5
##$VALIST= <valist>
##$VCLIST= <CCCCCCCCCCCCCCC>
##$VD= 0
##$VDLIST= <DDDDDDDDDDDDDDD>
##$VPLIST= <PPPPPPPPPPPPPPP>
##$VTLIST= <TTTTTTTTTTTTTTT>
##$WBST= 1024
##$WBSW= 4
##$XGAIN= (0..3)
0 0 0 0 
##$XL= 0
##$YL= 0
##$YMAX_a= 433851
##$YMIN_a= -437662
##$ZGOPTNS= <>
##$ZL1= 120
##$ZL2= 120
##$ZL3= 120
##$ZL4= 120
##$ABSF1= 16.522
##$ABSF2= -4.171173
##$ABSG= 5
##$ABSL= 3
##$ALPHA= 0
##$AQORDER= 0
##$ASSFAC= 0
##$ASSFACI= 0
##$ASSFACX= 0
##$ASSWID= 0
##$AUNMP= <proc_1d>
##$AZFE= 0.1
##$AZFW= 0.1
##$BCFW= 0
##$BC_mod= 0
##$BYTORDP= 0
##$COROFFS= 0
##$CY= 12.5
##$DATMOD= 1
##$DC= 0
##$DFILT= <>
##$DTYPP= 0
##$F1P= 14.0000005364418
##$F2P= -0.99999901652339
##$FCOR= 0.5
##$FTSIZE= 32768
##$FT_mod= 6
##$GAMMA= 0
##$GB= 0
##$INTBC= 1
##$INTSCL= 1
##$ISEN= 128
##$LB= 0.3
##$LEV0= 0
##$LPBIN= 0
##$MAXI= 10000
##$MC2= 0
##$MEAN= 0
##$ME_mod= 0
##$MI= 0
##$NCOEF= 0
##$NC_proc= -5
##$NLEV= 6
##$NOISF1= 0
##$NOISF2= 0
##$NSP= 0
##$NTH_PI= 0
##$NZP= 0
##$OFFSET= 16.522
##$PC= 1
##$PHC0= 216.8664
##$PHC1= 3.246884
##$PH_mod= 1
##$PKNL= yes
##$PPARMOD= 0
##$PSCAL= 4
##$PSIGN= 0
##$REVERSE= no
##$SF= 250.13
##$SI= 32768
##$SIGF1= 0
##$SIGF2= 0
##$SINO= 400
##$SIOLD= 32768
##$SREGLST= <1H.DMSO>
##$SSB= 0
##$STSI= 32768
##$STSR= 0
##$SW_p= 5175.98343685301
##$SYMM= 0
##$S_DEV= 0
##$TDeff= 65536
##$TDoff= 0
##$TI= <Analysis number 999999
Compound Code 99
Book Reference 9
Project Code 9>
##$TILT= no
##$TM1= 0
##$TM2= 0
##$TOPLEV= 0
##$USERP1= <user>
##$USERP2= <user>
##$USERP3= <user>
##$USERP4= <user>
##$USERP5= <user>
##$WDW= 1
##$XDIM= 32768
##$YMAX_p= 564826957
##$YMIN_p= -361498
$$ End of Bruker specific parameters
$$ ---------------------------------
##NTUPLES= NMR SPECTRUM
##VAR_NAME=  FREQUENCY,     SPECTRUM/REAL,   SPECTRUM/IMAG
##SYMBOL=    X,             R,               I
##VAR_TYPE=  INDEPENDENT,   DEPENDENT,       DEPENDENT
##VAR_FORM=  AFFN,          ASDF,            ASDF
##VAR_DIM=   32768,         32768,           32768
##UNITS=     HZ,            ARBITRARY UNITS, ARBITRARY UNITS
##FACTOR=    0.157963299565203, 1,           1
##FIRST=     4132.6476996994, 0,             0
##LAST=      -1043.33573715361, 0,           0
##MIN=       -1043.33573715361, -361498,     0
##MAX=       4132.6476996994, 564826957,     0
$$ Real data points
##PAGE= N=1
##DATA TABLE= (X++(R..R)), XYDATA
$$ [...]
17249A3199L0825R182K3028J3781N7564j3992m1340J06207Q6311j28869n3859
$$ 13199 44024 53206 76234 90015 147579 133587 92247 198454 284765 155896 102037
17238A02037r795k3587r6107r9821k7867R1576L3507O7966R3446K7544J7158N5060
$$ 102037 92242 68655 -27452 -127273 -155140 -63564 -30057 37909 131355 158899 176057 231117
17226B31117M4055j4741j06943p2505m6502q2995j6726n119q3062K8930J03666
$$ 231117 275172 260431 153488 80983 34481 -48514 -65240 -70359 -153421 -124491 -20825
17215b0825O9871J5836m4866m9651L2880L8847L3789O9192q1675o1062O413k9651
$$ -20825 49046 64882 20016 -29635 3245 42092 75881 145073 63398 2336 8749 -20902
17203b0902K4314j2445M7508L3667L3093r8044r0070L4051Q5509J6331J0964K0663
$$ -20902 3412 -9033 38475 72142 105235 7191 -82879 -48828 36681 53012 63976 84639
17191H4639P389L0870k2926q78k0977p3159J6123K2570P0325K0995k6748p2212
$$ 84639 92028 122898 99972 99094 78117 4958 21081 43651 113976 134971 108223 36011
17179C6011M9038p586n261m985J6568Q4829k492o4036l183L838J8959J57972K0857
$$ 36011 85049 77463 72202 67217 83785 168614 166122 102086 98903 102741 121700 279672 300529
17166C00529q4242k8747p3977r2144m6613J00448N7023m4891M1361k1520J4751
$$ 300529 216287 187540 113563 21419 -25194 75254 132277 87386 128747 107227 121978
17155A21978j7096m8924o3269K1505P4318J9389o6081l5518n0130L3945J5601
$$ 121978 104882 55958 -7311 14194 88512 107901 41820 6302 -43828 -9883 5718
17144E718K8106K8014o8785Q8672j4634l8864R82n6776o447r375K0626K9424L4324
$$ 5718 33824 61838 -6947 81725 67091 28227 29209 -27567 -34014 -43389 -22763 6661 40985
17131D0985J9687L2560J2773n6079j9820j1708O6250K6527n7710N1944o5393J5566
$$ 40985 60672 93232 106005 49926 30106 18398 84648 111175 53465 105409 40016 55582
17119E5582n580j6266N3020N6966k3904j8105n3634j9873J2930j0242o693L0644
$$ 55582 50002 33736 86756 143722 119818 101713 48079 28206 41136 30894 24201 54845
17107E4845k8217n0901N8288K0177j0916l031k9045N6737M3817j5867m2911N5689
$$ 54845 26628 -24273 34015 54192 43276 40245 11200 67937 111754 95887 52976 108665
17095A08665L2018j8562l2375m0231M9271l1054l535J016j9042j4990N0315P5802
$$ 108665 140683 122121 89746 49515 98786 67732 64197 65213 46171 31181 81496 157298
17083A57298p3445j11473k0065K1607p028o0457m0319K9029M1559l3823P1117
$$ 157298 83853 -27620 -47685 -26078 -33106 -93563 -133882 -104853 -63294 -97117 -26000
17072b6000M2001M0844n4390j73L8099P489L0684R890o2246j68701L3062P0910
$$ -26000 16001 56845 2455 2282 40381 47870 78554 88444 26198 -142503 -109441 -38531
17060c8531N106P911K8253l7084o0576l2742o6558O3011J0396K9845n4589m4168
$$ -38531 -33425 -25514 2739 -34345 -94921 -127663 -194221 -131210 -120814 -90969 -145558 -189726
17048a89726J37482Q5840j1937n327J1818l7845m5921K7171j6384O8406J1589
$$ -189726 -52244 33596 21659 16332 28150 -9695 -55616 -28445 -44829 23577 35166
17037C5166k3193N2584j8069k9439l6744q0237n1373M8384R7118K5141L3776o567
$$ 35166 11973 64557 46488 17049 -19695 -99932 -151305 -102921 -5803 19338 53114 46547
17025D6547L6092K1141L0923j8925O068M6675r2230r7495l5194N1216R0012R036
$$ 46547 82639 103780 134703 115778 121846 168521 76291 -21204 -56398 -5182 84830 93866
17013I3866j11307K6075J08428L6051o1963M0014R3356k0818o0045r3254k4394
$$ 93866 -17441 8634 117062 153113 91150 131164 224520 203702 143657 50403 26009
17002B6009J21774n173o3083R6666j3672j0380o6779j01562p671N9555k4863l1475
$$ 26009 147783 142610 79527 176193 162521 152141 85362 -16200 -23871 35684 10821 -20654
16990b0654K5460M84q2940p2804J23544J9504l2719J0781L3597l6845m8651J3964
$$ -20654 4806 5290 -77650 -150454 -26910 -7406 -40125 -29344 4253 -32592 -81243 -67279
16978f7279J07107P262r0116J8011J3838m5791p729J3274J4531j0339p4510J8544
$$ -67279 39828 47090 -43026 -25015 -11177 -56968 -64697 -51423 -36892 -47231 -121741 -103197
16966a03197M6207L1897l6127Q5074Q2437l893n9485l8331n2957m2752Q632O667
$$ -103197 -56990 -25093 -61220 23854 106291 102398 42913 4582 -48375 -91127 -82495 -75828
16954g5828N866O6450p5145K6392Q8594M8191n3638j446O2712O9031l008K261
$$ -75828 -69962 -3512 -78657 -52265 36329 84520 30882 29436 92148 161179 158171 160432
16942A60432p3390q4375k7067O1639o6590p0219Q7232Q6789K2597j9247j6416
$$ 160432 87042 2667 -24400 37239 -29351 -99570 -12338 74451 97048 77801 61385
16931F1385j4695L2800J0078K7860l8079n1867J49M2040n8017k1756k3194K7211
$$ 61385 46690 79490 89568 117428 79349 27482 27631 69671 11654 -10102 -33296 -6085
16919f085K9222n4006r2035J3204J7144L7422Q2095O6839L4627K059l9559J5294
$$ -6085 23137 -30869 -122904 -109700 -92556 -55134 26961 93800 128427 130486 90927 106221
16907A06221k1867p4044M0762J2861J9941l9664n0841j04243k4423j3143P196
$$ 106221 84354 10310 51072 63933 83874 44210 -6631 -110874 -135297 -148440 -141244
16896a41244m6910Q642O0498L0174N9806L9226j8939l9476k7169m5361L0213l6915
$$ -141244 -188154 -179512 -119014 -88840 -29034 10192 -8747 -48223 -75392 -120753 -90540 -127455
16884a27455o514K616l564P8067L3460K0830k0189K5757O9702l5149R3153O6797
$$ -127455 -133969 -131353 -134917 -56850 -23390 -2560 -22749 3008 72710 37561 130714 197511
16872A97511o6306q4220j52192r7321N1298P7474j1630M665P9650Q2526j4857
$$ 197511 131205 46985 -105207 -202528 -151230 -73756 -85386 -80721 -1071 81455 66598
16861F6598l3555L9956j5249K771m8680k6663N3572K5067j478j14899j7645j4943
$$ 66598 33043 72999 57750 60521 11841 -14822 38750 63817 62339 -52560 -70205 -85148
16849h5148P1719P7717N3563o5237j7160j31306o7812O7217O0353J7047M6114
$$ -85148 -13429 64288 117851 52614 35454 -95852 -163664 -96447 -36094 -19047 27067
16838B7067r891M2373j9558k6018n1939j38386N1712J27530O9445n2567o2207
$$ 27067 17176 59549 39991 13973 -37966 -176352 -124640 2890 72335 19768 -42439
16827d2439r518J7087N3755L4393J9666k9365n1723p8372k6286M7113K3329n6889
$$ -42439 -51957 -34870 18885 53278 72944 43579 -8144 -86516 -112802 -65689 -42360 -99249
16815i9249Q32Q0804P1813l1772l4962k3110N0361O4860K2249M1713l2396k3550
$$ -99249 -98417 -17613 54200 22428 -12534 -35644 14717 79577 101826 143539 111143 87593
16803H7593J9389l2351J3123K9232L2680j10904j25815N9324r175l7459p4107
$$ 87593 106982 74631 87754 116986 149666 38762 -87053 -27729 -36904 -74363 -148470
16792a48470J7553O39p343o1453k9649M9652P9779K0823K4261P6826o5330p9244
$$ -148470 -130917 -130278 -137621 -199074 -228723 -179071 -99292 -78469 -54208 22618 -42712 -121956
16780a21956L7230j0483M3065Q6507k6399l7641Q7162J4822j38895l3791k597
$$ -121956 -84726 -95209 -52144 34363 7964 -29677 57485 72307 -66588 -100379 -102976
16769a02976K9087O0073J2025m1618O8889N7311l1118j7706P8132L4800l8146
$$ -102976 -73889 -13816 -1791 -43409 25480 82791 51673 33967 112099 146899 108753
16758A08753l8387j10063M5303J24009M5171j24502n3558J405P6032l579K2577
$$ 108753 70366 -39697 5606 129615 174786 50284 -3274 -1869 74163 70584 93161
16747I3161j3211L056j08706j2314R417O461j3574j6699N8764K5173j1981r3972
$$ 93161 79950 83006 -25700 -38014 -28597 -22136 -35710 -52409 6355 31528 19547 -74425
16735g4425P6121n2637J2886P1149p4070q0339N4084P9920M1312k0455p1595l3254
$$ -74425 1696 -50941 -38055 33094 -40976 -121315 -67231 12689 54001 33546 -38049 -71303
16723g1303k0428K2360J6438j6424Q6746N1686M6376n5287p7962n1613R0616Q2726
$$ -71303 -91731 -69371 -52933 -69357 17389 69075 115451 60164 -17798 -69411 21205 103931
16711A03931j13111j75115K5863Q5045J392J16263O6014j02604r0158o2856P005
$$ 103931 -9180 -184295 -158432 -73387 -71995 44268 110282 7678 -82480 -145336 -138331
16700a38331J5064M2495m8063n827J27256M744k1924Q9705q738O421l8414j21453
$$ -138331 -123267 -80772 -128835 -134662 -7406 -2662 -24586 65119 56381 62802 24388 -97065
16688i7065o5137n7674l144Q0641K0831M2728r0621L262n3908L6296K3214N8353
$$ -97065 -162202 -219876 -223020 -142379 -121548 -78820 -169441 -166179 -220087 -183791 -160577 -102224
16676a02224R0875M2356J4278j26093k3362K0239n4318k6034P4426j5014m8960
$$ -102224 -11349 31007 45285 -80808 -104170 -83931 -138249 -164283 -89857 -104871 -153831
16665a53831p583J35761P3214o9926j23720n8275R9176J16742N3656j00051l7962
$$ -153831 -161414 -25653 47561 -22365 -146085 -204360 -105184 11558 65214 -34837 -72799
16654g2799k1270M1896K3618k9719k4509M4726l0376k0191L149k1338Q9814J7752
$$ -72799 -94069 -52173 -28555 -58274 -82783 -38057 -68433 -88624 -85475 -106813 -16999 753
16642G53K2641J4226l0485K4745Q6552L7731j7054j0900j6790l0671j8678O5771
$$ 753 23394 37620 7135 31880 118432 156163 139109 128209 111419 80748 62070 127841
16630A27841R858l0655r2870l7998P6206k9924N821J0355N9457J6778o5544M510
$$ 127841 137699 107044 14174 -23824 52382 22458 28279 38634 98091 114869 49325 53835
16618E3835j8045j28587r5699m0723K6529n6832L9287J51038J3777k9550j209
$$ 53835 35790 -92797 -188496 -229219 -202690 -259522 -220235 -69197 -55420 -84970 -86179
16607h6179n055J03130J09817j0468K4601j28016m2980J9734m8452l6508N0134
$$ -86179 -91234 11896 121713 111245 135846 7830 -35150 -15416 -63868 -100376 -50242
16596e0242M1450k0264j7984Q0686O4349p5706j8359K8222o7150L3486L7428N9536
$$ -50242 -8792 -29056 -47040 33646 97995 22289 3930 32152 -34998 -1512 35916 95452
16584I5452m9176k5047N5952K5943l9539P569p452l0835q5275o5826P7015J73837
$$ 95452 46276 21229 77181 103124 63585 71154 63702 32867 -52408 -118234 -41219 132618
16572A32618p9184o7857M0484m7189o0695n3363n811P5951J8516l7054j9612j2890
$$ 132618 53434 -14423 26061 -21128 -81823 -135186 -140997 -65046 -46530 -83584 -103196 -116086
16560a16086M0939J1506m410p1643j35601Q7653J55558o1676j941O2143m3665
$$ -116086 -75147 -63641 -68051 -139694 -275295 -187642 -32084 -93760 -95701 -33558 -77223
16549g7223P0285Q6499J29434J4591j21675p7266m275n2175j07183k6860P9959
$$ -77223 -6938 79561 208995 223586 101911 24645 20370 -31805 -138988 -165848 -85889
16538h5889J31647r32m964j491L0677m4463j7834N7645l5731j4583K9989J0724
$$ -85889 45758 44826 39862 38371 69048 24585 6751 64396 28665 14082 44071 54795
16526E4795j6780L1374m2971o3168l2783j17205l0039P5578R0931m4511m2862
$$ 54795 38015 69389 26418 -36750 -69533 -186738 -216777 -141199 -50268 -94779 -137641
16515a37641N0210L1521L6795m3727J8557P0108j6603M3764q0958o1578j8848
$$ -137641 -87431 -55910 -19115 -62842 -44285 25823 9220 52984 -27974 -89552 -108400
16504a08400l0805o98M935N5611Q8737M8364L9064j6885K3471r144p0772j29380
$$ -108400 -139205 -139903 -134968 -79357 9380 57744 96808 79923 103394 94250 23478 -105902
16492a05902R827N3509L9654N325j3545j30772l8477L4503p9915n8630J22369
$$ -105902 -96075 -42566 -2912 2413 -11132 -141904 -180381 -145878 -225793 -284423 -162054
16481a62054J26389o6294l4616N3960m7685K005k3411l5957K8889P3728J13648
$$ -162054 -35665 -101959 -136575 -82615 -130300 -128295 -151706 -187663 -158774 -85046 28602
16470B8602J6295j4136L4519m2356n0032K1938m1025k5919k0635n1643l2630p2771
$$ 28602 44897 30761 65280 22924 -27108 -5170 -46195 -72114 -92749 -144392 -177022 -249793
16458b49793P780N7159O1620m167O4164M0078j6125J1658M8584K3439l4007K2992
$$ -249793 -242013 -184854 -123234 -127401 -63237 -23159 -39284 -27626 20958 44397 10390 33382
16446C3382L7349J6700Q2484m2808j678n6910n165r4123k4317J9445N1073k8987
$$ 33382 70731 87431 169915 127107 125429 68519 63354 -30769 -55086 -35641 15432 -13555
16434a3555K1137K4500L7790J15745o2266o1443R5993P3861q9884k01671p8614
$$ -13555 7582 32082 69872 185617 123351 61908 157901 231762 141878 -59793 -138407
16423a38407l050K0951K924P1676Q7354M6693k1072n1250m2115j13563l6093q8281
$$ -138407 -141457 -120506 -117582 -45906 41448 88141 67069 15819 -26296 -139859 -175952 -264233
16411b64233N4659K5141L066R5358J49495R5548n3933l6764q2268J978Q2722r2242
$$ -264233 -209574 -184433 -181367 -86009 63486 159034 105101 68337 -13931 -11953 70769 -21473
16399b1473o0211J00396K0644n9599l4315N3945N2006m2821P2319j1597k1114
$$ -21473 -81684 18712 39356 -20243 -54558 -613 51393 8572 80891 69294 48180
16388D8180k7931o9997L4663J5018P6030k1151j18121k2518L692o5447n0185Q8574
$$ 48180 20249 -49748 -15085 -67 75963 54812 -63309 -85827 -82135 -147582 -197767 -109193
16376a09193Q7732R5423l0873q0310j1584L329o7911m5003q8002M8678J3307L0937
$$ -109193 -21461 73962 43089 -37221 -48805 -45476 -113387 -158390 -246392 -197714 -184407 -153470
16364a53470N5809K9810J14200l1115m6625m9581n8100j1241J8260M7377J13658
$$ -153470 -97661 -67851 46349 15234 -31391 -80972 -139072 -150313 -132053 -84676 28982
16353B8982O6051j25793p8519Q7535N0406m5330L6125N8656j4308r4981o8530
$$ 28982 95033 -30760 -109279 -21744 28662 -16668 19457 78113 63805 -31176 -99706
16342i9706l0711n2912k7977L2358Q655K0985K1984Q403K7754N0150J03212J8905
$$ -99706 -130417 -183329 -211306 -178948 -170293 -149308 -127324 -118921 -91167 -41017 62195 81100
16330H1100r2502o6312o0371N3038N905L9762N5378l8558j2151j4039p358N1980
$$ 81100 -11402 -77714 -138085 -85047 -79142 -39380 15998 -22560 -34711 -48750 -56108 -4128
16318d128l5169P3930K0691j9835J5401O4415R3900o0879q603l4670j690o9849
$$ -4128 -39297 34633 55324 35489 50890 115305 209205 148326 139723 105053 103363 33514
16306C3514K0402k6486l9509r2952P5736J2894n2939O7383O7806p1912j5259n497
$$ 33514 53916 27430 -12079 -105031 -29295 -16401 -69340 -1957 65849 -6063 -21322 -26819
16294b6819m6253k6599K5170m0096K8251P1327k5505p1186L2792N5993N004J9664
$$ -26819 -73072 -99671 -74501 -114597 -86346 -15019 -40524 -111710 -78918 -22925 -17921 1743
16282A743O070l1340l907J5019k8972l862l508N4407L6742J9769m915o4803j5065
$$ 1743 7813 -23527 -27434 -12415 -41387 -45249 -48757 5650 42392 62161 57246 -7557 -22622
16269b2622R8609O9455j11052n9618J5776k5713n166p2660k7721p9069j28884
$$ -22622 75987 145442 34390 -25228 -9452 -35165 -40331 -112991 -140712 -219781 -348665
16258c48665M1503J92504L0624m0179n7147Q0143P0565Q4605q3156n1833O3411
$$ -348665 -307162 -114658 -84034 -124213 -181360 -101217 -30652 53953 -29203 -81036 -17625
16247a7625m2757P3221j029r6705J0426l757K33J28057j1141m0651O115p4970
$$ -17625 -60382 12839 11810 -84895 -74469 -78226 -77993 50064 38923 -1728 4387 -70583
16235g0583R0022M4986j17156j3290P4335p5812O5505L0809n5071j8767n7326
$$ -70583 19439 64425 -52731 -66021 8314 -67498 -1993 28816 -26255 -45022 -102348
16224a02348l2904j35875r0371P0113L8625J50241J0618r165J99L0838Q836N8671
$$ -102348 -135252 -271127 -361498 -291385 -252760 -102519 -91901 -101066 -100867 -70029 -61193 -2522
16212b522O5630K8904l3148j506n8422j320m5893l8086j38975l0330p128k1141
$$ -2522 63108 92012 58864 57358 -1064 -2384 -48277 -86363 -225338 -255668 -262796 -283937
16200b83937m4526J09461j6759P6R0538Q4375J6200q903L3376J1937o0497Q085
$$ -283937 -328463 -219002 -235761 -235685 -145147 -60772 -44572 -53475 -20099 -8162 -68659 -60574
16188f0574M6377K0283J05411J6160L6680m5522l1182j3464m3834N2265k6884
$$ -60574 -14197 6086 111497 127657 164337 118815 87633 74169 30335 82600 55716
16177E5716j9661M587k8696j0695l5330k7726P3741n9033m9860n9220k2126J55277
$$ 55716 36055 40642 11946 1251 -34079 -61805 11936 -47097 -96957 -156177 -178303 -23026
16165b3026P7154m8621j5216M027l664j6630k4428J01595M2590j2855q0720p515
$$ -23026 54128 5507 -9709 -5682 -9346 -25976 -50404 51191 93781 80926 206 -7309
16153g309P0651j4827m3869k7286J06984L5448j8580p7411j9913p496j35811n9746
$$ -7309 63342 48515 4646 -22640 84344 119792 101212 23801 3888 -3608 -139419 -199165
16141a99165J00607M7070K4336J2164P238L2R2929J8158L0090p2068k26K8770
$$ -199165 -98558 -51488 -27152 -14988 -7750 -7718 85211 103369 133459 61391 61165 89935
16129H9935j55657m1007m2544J1598N5830K3240J8500m2632J2668o3823l2499
$$ 89935 -65722 -106729 -149273 -137675 -81845 -58605 -40105 -82737 -70069 -133892 -166391
16118a66391j4647p6185j5929J34897R5744l9682j36535n8315M7555J49130O0646
$$ -166391 -181038 -257223 -273152 -138255 -42511 -82193 -218728 -277043 -229488 -80358 -19712
16107a9712q809k9911p6671m2046M7238L0305N2845k3304M7096m6618n3835m8665
$$ -19712 -28521 -58432 -135103 -177149 -129911 -99606 -46761 -70065 -22969 -69587 -123422 -172087
16095a72087m952n6795L1915J07702K580R0471L574n7547J0186L7920K783l0854
$$ -172087 -177039 -233834 -201919 -94217 -91637 -1166 2408 -55139 -44953 -7033 -4250 -35104
16083c5104m7499M9679M0187j04842j25827m0184R5152J58186L0438j2090j1089
$$ -35104 -82603 -32924 7263 -97579 -223406 -263590 -168438 -10252 20186 8096 -2993
16072b993n9814o7834L202M8018J03582J17755q0524r9884K3539M0548k0101o8424
$$ -2993 -62807 -130641 -127439 -79421 24161 141916 61392 -38492 -14953 25595 5494 -62930
16060f2930M7850K0057J786N6469l378n9433p8229n177J27006J9824j10846J4794
$$ -62930 -15080 4977 6763 63232 59854 421 -77808 -82985 44021 63845 -47001 -32207
16048c2207k3733j3876J5858O3475L9512k3579Q306p7100k3863L5285o0274j061
$$ -32207 -55940 -69816 -53958 9517 49029 25450 33756 -43344 -67207 -31922 -92196 -93257
16036i3257P3056n3833n4673l6148j3500N7808N8903J6579l8230p1771O8969P5242
$$ -93257 -20201 -74034 -128707 -164855 -178355 -120547 -61644 -45065 -83295 -155066 -86097 -10855
16024a0855m9713p753l6531q5664M6008Q8195j3914m3975R5629j9166m7238j5262
$$ -10855 -60568 -68321 -104852 -190516 -144508 -56313 -70227 -114202 -18573 -37739 -84977 -100239
16012a00239J28943q0797p2612n2422Q7427J55067Q893k1603R415N4930O4934
$$ -100239 28704 -52093 -124705 -177127 -89700 65367 74260 52657 62072 117002 181936
16001A81936p7231r8295k9453L0618n6137k1149J68343P4968m8310k9339o0944
$$ 181936 104705 6410 -23043 7575 -48562 -69711 98632 173600 125290 95951 35007
15990C5007K7868l0700o0506J4413O0694N470n3312l550m044P9829j7144m368
$$ 35007 62875 32175 -28331 -13918 46776 52246 -1066 -4616 -8660 71169 54025 49657
15978D9657k9546o3056L4207L0369J5594M4294M1871p7816q7200N8573J06251
$$ 49657 20111 -42945 -8738 21631 37225 81519 123390 45574 -41626 16947 123198
15967A23198P6929p6466n9456r7790l1780m1594P1747J2945j6379q8378k67N5426
$$ 123198 200127 123661 64205 -33585 -65365 -106959 -35212 -22267 -38646 -127024 -127291 -71865
15955g1865J2102J7433L6168M8336l0931l0279J01002L5964o7789o2415j6198
$$ -71865 -59763 -42330 -6162 42174 11243 -19036 81966 117930 50141 -12274 -28472
15944b8472n885p0316j07970M4555O1881K3288l8227J4285N1756k3347k8999J8659
$$ -28472 -34357 -104673 -212643 -168088 -106207 -82919 -121146 -106861 -55105 -78452 -107451 -88792
15932h8792J5049r1385k0740J07057P2967j0101j8710o1776o802R9207n9979m7961
$$ -88792 -73743 -165128 -185868 -78811 -5844 -15945 -34655 -96431 -103233 -4026 -64005 -111966
15920a11966o0095R726J03207K7897O4431j2111o4070o8726N3602L3828J06445
$$ -111966 -172061 -162335 -59128 -31231 33200 21089 -42981 -111707 -58105 -24277 82168
15909H2168j10708p6683k802k1868k3141R7992O5656M5454n5141n4706k4459o4542
$$ 82168 -28540 -105223 -108025 -129893 -153034 -55042 10614 56068 927 -53779 -78238 -142780
15897a42780M45L8836R7839l9714J7211M193K7904L6014j0109N4597K1651J3231
$$ -142780 -142335 -103499 -5660 -45374 -28163 -23970 3934 39948 29839 84436 106087 119318
15885A19318p1459l967m8304k0727L2868q081j9133n5541p1118l4947l0242n3751
$$ 119318 47859 43892 -4412 -25139 7729 -352 -19485 -75026 -146144 -181091 -211333 -265084
15873b65084L7238P9399N4360N9877Q9377O9279J6665j12106p9488l8412M3072
$$ -265084 -227846 -148447 -94087 -34210 55167 124446 141111 29005 -50483 -88895 -45823
15862d5823J2979R0339J278k2728J00810p5014j20284m1474M0644L0650m1542
$$ -45823 -32844 57495 58773 36045 136855 61841 -58443 -99917 -59273 -28623 -70165
15851g0165q7375j1214Q6222O665M9725J1699m417L3589O0488M5865k1405m2018
$$ -70165 -157540 -168754 -82532 -75867 -26142 -14443 -18860 14729 75217 121082 99677 57659
15839E7659m9095j26114j1240P0474M999m078K3181O3235O0356p3185K6837r5478
$$ 57659 8564 -117550 -128790 -58316 -53317 -57395 -34214 29021 89377 16192 43029 -52449
15827e2449r9447P0762N9252j4395l9817m3381M9899n0898k8309M5831Q2962J4626
$$ -52449 -151896 -81134 -21882 -36277 -76094 -119475 -69576 -120474 -148783 -102952 -19990 -5364
15815e364m8899o5481K0554P810J12258L2097k3788q4580l1560N4317Q2353M8115
$$ -5364 -54263 -119744 -99190 -91380 20878 52975 29187 -55393 -86953 -32636 49717 97832
15803I7832p4038N274k1232m4767q2736q6682O9112N6889L7661o3596r8486l3099
$$ 97832 23794 29068 7836 -36931 -119667 -206349 -137237 -80348 -42687 -106283 -204769 -237868
15791b37868J69164P2620j3273k2741p5005Q2327O4253j39407r2765O7296J5948
$$ -237868 -68704 3916 -9357 -32098 -107103 -24776 39477 -99930 -192695 -125399 -109451
15780a09451P6211J07660J12167m8594m2937p084j13918q3820L3767J38883K8039
$$ -109451 -33240 74420 186587 137993 95056 87972 -25946 -109766 -75999 62884 90923
15769I0923m9773m3053M6358K3598n9128k5466O0963R3887j3883o6885o1162o6448
$$ 90923 41150 -1903 44455 68053 8925 -16541 44422 138309 124426 57541 -3621 -70069
15757g0069n3648P3279M0670L3565p2078K6620J3474Q7642o4335l6356J4162n719
$$ -70069 -123717 -50438 -9768 23797 -48281 -21661 -8187 79455 15120 -21236 -7074 -12793
15745a2793J845k8965L002p9826m4421k9717M9641K8657J57784J3467j01490N2797
$$ -12793 -10948 -39913 -36911 -116737 -161158 -190875 -141234 -112577 45207 58674 -42816 9981
15733I981Q5510k5724j706m1830j43624o6695M7493K4242k7004k1592L8989O8924
$$ 9981 95491 69767 68061 26231 -117393 -184088 -136595 -112353 -139357 -160949 -121960 -53036
15721e3036o863p0271k3498Q3084j8792P0551L7045k8002l8765O648J4725N1032
$$ -53036 -59899 -130170 -153668 -70584 -89376 -18825 18220 -9782 -48547 -41899 -27174 23858
15709B3858l3484N5720O7995j9109p7319j09920k5697m9639Q1058M3706J615K4269
$$ 23858 -9626 46094 114089 94980 17661 -92259 -117956 -167595 -86537 -42831 -41216 -16947
15697a6947M2164P504l1229j01230j7920k7476O076r3768O9065J52846n5318o7759
$$ -16947 25217 32721 1492 -99738 -117658 -145134 -139058 -232826 -163761 -10915 -66233 -133992
15685a33992L3538M2444P0518k2551r5483k7559N8907O3931M0462N4789o4951
$$ -133992 -100454 -58010 12508 -10043 -105526 -133085 -74178 -10247 30215 85004 20053
15674B0053o2067K3259j0596l0065M6541L4603j00941l8203J38882J8313j9651
$$ 20053 -42014 -18755 -29351 -59416 -12875 21728 -79213 -117416 21466 39779 20128
15663B0128k7163r4831j34072k4120J11887K06331L6972r3669L3572J7269m0037
$$ 20128 -7035 -101866 -235938 -260058 -148171 58160 95132 1463 35035 52304 12267
15652A2267k1264n6990M929J59691l93j32010j55171p3637J50794P205m9405n8632
$$ 12267 -8997 -65987 -61058 98633 98240 -33770 -188941 -262578 -111784 -104579 -153984 -212616
15640b12616M033O1327K076m701j2348J2083m4899k9038k0668M3887P1546l6825
$$ -212616 -208583 -147256 -145180 -149881 -162229 -150146 -195045 -224083 -244751 -200864 -129318 -166143
15628a66143K2036J9549K0825P9309J17154L131j52752o5660P607J9821O4159
$$ -166143 -144107 -124558 -103733 -24424 92730 95861 -56891 -122551 -114944 -95123 -30964
15617c0964K5446J0170r2200p1154O569K825M720o374J12485Q0121k2399r635
$$ -30964 -5518 4652 -87548 -158702 -152133 -149308 -144588 -150962 -38477 41644 19245 9610
15605I610M345q2997l5302l9365j8201P2354N6339N4902N2140o836J9738n9107
$$ 9610 13955 -69042 -104344 -143709 -161910 -89556 -33217 21685 73825 66989 86727 27620
15593B7620o4680q8751Q944J02060j9342L0153L2031P874P292n0669l5787P128
$$ 27620 -37060 -125811 -116867 -14807 -34149 -3996 28035 35909 43201 -7468 -43255 -36127
15581c6127r752k7751N6197l2614j08234j7343O1314N7744L3456k0293p667R9898
$$ -36127 -45879 -73630 -17433 -50047 -158281 -175624 -114310 -56566 -23110 -43403 -51070 48828
15569D8828l4384l8204J82787N5852m5031q7238l7604j18764j7065N117J27111
$$ 48828 14444 -23760 159027 214879 169848 82610 45006 -73758 -90823 -85706 41405
15558D1405M3140L9437o1653o7459N5402J2046n1277j34328k01266K8448K3923
$$ 41405 84545 123982 62329 -5130 50272 62318 11041 -123287 -324553 -296105 -272182
15547b72182O7938O6829N5049O3258j7505o2762o1376m9929j5362L2150O7676
$$ -272182 -204244 -137415 -82366 -19108 -36613 -99375 -160751 -210680 -226042 -193892 -126216
15536a26216m96R3353L4300j4008j21227m9340J2054J04627j6901j33994o100
$$ -126216 -126712 -33359 941 -13067 -134294 -183634 -171580 -66953 -83854 -217848 -223948
15525b23948P2045k0918N0827J52816O9179m8103N5087J3689q7186m2840J9n201
$$ -223948 -151903 -172821 -121994 30822 100001 51898 106985 120674 33488 -9352 -9333 -14534
15513a4534l6757n1970k4582Q933J5614j9231q356J9182r361n5464l5709L6357
$$ -14534 -51291 -103261 -127843 -118910 -103296 -122527 -130883 -111701 -121062 -176526 -212235 -175878
15501a75878O4543N4996j06038J5476J25580K2705n612n2572m9281M2860l4939
$$ -175878 -111335 -56339 -162377 -146901 -21321 1384 -4228 -56800 -106081 -63221 -98160
15490i8160m1705k4625M3461P8266l8501K8406R5318K1393o3503k5707K8318k2831
$$ -98160 -139865 -164490 -121029 -42763 -81264 -52858 42460 63853 350 -25357 2961 -19870
15478a9870q1963p6685Q280O4735Q0424Q7593o8462l8399n3889l0091N091Q3881
$$ -19870 -101833 -178518 -170238 -105503 -25079 62514 -5948 -44347 -98236 -128327 -123236 -39355
15466c9355j8457N216L1408m88J4828K7028j34850q7436k2043J1796L3372K1206
$$ -39355 -57812 -52596 -21188 -21676 -6848 20180 -114670 -202106 -224149 -212353 -178981 -157775
15454a57775L8805J3978J20378l6169M6406Q8853q5453r0150k2030J08104j1387
$$ -157775 -118970 -104992 15386 -20783 25623 114476 29023 -61127 -83157 24947 13560
15443A3560Q935R3692j8678j82598o0437n765L4398Q182K6592P6178K2093j87
$$ 13560 22495 116187 97509 -85089 -145526 -151291 -116893 -108711 -82119 -5941 16152 15965
15431A5965J6723Q197j3632k5819l963M4655Ln1387l9876O6606p4251k4643K702
$$ 15965 32688 40885 27253 1434 -2529 42126 42129 -9258 -49134 17472 -56779 -81422 -78720
15418g8720q6379J819k3787J5046R3918K4733l9518j9420M7987O7458k9008O7150
$$ -78720 -165099 -163280 -187067 -172021 -78103 -53370 -92888 -112308 -64321 3137 -25871 41279
15406D1279M9219n7824j23683j9374J20284K2243k5050J33563o804n0236j52653
$$ 41279 90498 32674 -91009 -110383 9901 32144 7094 140657 133853 83617 -69036
15395f9036r0644N5181L1437j7970R3050P687K6671k8190n60M1003J0861l9860
$$ -69036 -159680 -104499 -73062 -91032 2018 9705 36376 8186 7626 48629 59490 19630
15383A9630o1922p6726O9733J30388J4024K6891k7374p2097o9806m5054L0345
$$ 19630 -42292 -119018 -49285 81103 95127 122018 94644 22547 -47259 -92313 -61968
15372f1968O3550l3105Q4265M4865N857j14296r8287j6375N0558j4641N8325Q0214
$$ -61968 1582 -31523 52742 97607 103464 -10832 -109119 -125494 -74936 -89577 -31252 48962
15360D8962K3783L4292m5936j910n5026J7325o824j06800p3704o6940l449J30041
$$ 48962 72745 107037 61101 59191 4165 21490 14666 -92134 -165838 -232778 -236227 -106186
15348a06186J02102P455L4313k6475L2r5230p8732J24004J17353O0857o1257J1166
$$ -106186 -4084 3371 37684 11209 11241 -83989 -162721 -38717 78636 139493 78236 89402
15336H9402L6245P1193q4711r2927j6953K2471K7735N7690l6050m0612o7425j05070
$$ 89402 125647 196840 112129 19202 2249 24720 52455 110145 74095 33483 -33942 -139012
15324a39012J551M8606L9626M9752o6728q066P3240m6405o3088n8284R3117R3005
$$ -139012 -137461 -88855 -49229 523 -66205 -74271 -1031 -47436 -110524 -168808 -75691 17314
15312A7314j03550j09110L5726J7284L7180O3298N8032K96r1390k6118O7780M194
$$ 17314 -86236 -195346 -159620 -142336 -105156 -41858 16174 16470 -74920 -101038 -33258 -29064
15300b9064J5972K1685k5310K7558O728m6489J6481J9062k5978m0920o9436p1699
$$ -29064 -13092 8593 -16717 10841 17569 -28920 -12439 6623 -19355 -60275 -129711 -201410
15288b01410Q6004Q3913P9213o06K9203m3252m534m4658l6858j967J176K8764
$$ -201410 -115406 -31493 47720 47114 76317 33065 28531 -16127 -52985 -54952 -53776 -25012
15276b5012N0773m6465r6215O3553O1637k2401q4255K9226R3060K7727l9364q266
$$ -25012 25761 -20704 -116919 -53366 8271 -14130 -98385 -69159 23901 51628 12264 3998
15264C998N1327J67592J5303p5963j59315o4275Q5184L5981n9041M184j40179
$$ 3998 55325 222917 238220 162257 2942 -61333 23851 59832 791 4975 -135204
15253a35204K1369O7150n0821p546L1760Q8297j6914J4482r4577m9965k6596m4424
$$ -135204 -113835 -46685 -97506 -105052 -73292 15005 -1909 12573 -82004 -131969 -158565 -202989
15241b02989N1388n7139p0334J50286p974k1019Q7452J7346N7425M3681n9464
$$ -202989 -151601 -208740 -279074 -128788 -136762 -157781 -70329 -52983 4442 48123 -11341
15230a1341P9142j9822o625l2732n9714k3120j34164o8543Q1897R4462L1613R662
$$ -11341 67801 47979 41354 8622 -51092 -74212 -208376 -276919 -195022 -100560 -68947 -59285
15218e9285j07555k7304L5850Q7182J02762P5968n3044m7440L9804M1440M8138
$$ -59285 -166840 -194144 -158294 -71112 31650 107618 54574 7134 46938 88378 136516
15207A36516m2297k0440L4219O1573K5277m6344j03617k9010Q1115J02539N8405
$$ 136516 94219 73779 107998 169571 194848 148504 44887 15877 96992 199531 257936
15196B57936n5828j31296M8253K7070P9973q0213j22494k5499P4317P5182j17122
$$ 257936 202108 70812 119065 146135 226108 145895 23401 -2098 72219 147401 30279
15185C0279j40054k6397N2893J62360N052K0284N0004r3356J7157k5786p1640
$$ 30279 -109775 -136172 -83279 79081 84133 104417 154421 61065 78222 52436 -19204
15174a9204P8094P5519l0245q8847o5998o9826K0937M4000M607R45J038m7920
$$ -19204 58890 134409 104164 15317 -50681 -120507 -99570 -55570 -50963 -50018 -48980 -96900
15162i6900m0840M9422R6587K0696j7518N1043L9685q4385J9120L9900k3776l4532
$$ -96900 -137740 -88318 8269 28965 11447 62490 102175 17790 36910 76810 53034 18502
15150A8502L6311p3998j9125n8799L1995R1033L8483P839r177j2860M5513K3142
$$ 18502 54813 -19185 -38310 -97109 -65114 25919 64402 72241 63064 50204 95717 118859
15138A18859l7085j09071n9384N0133P4275J0868o259p8415M489l4503o8104J20597
$$ 118859 81774 -27297 -86681 -36548 37727 48595 42336 -36079 -31590 -66093 -134197 -13600
15126a3600R8126j4134l2764o8644k0556m7649j40302m500R5366O4812P3970l4024
$$ -13600 84526 70392 37628 -31016 -51572 -99221 -239523 -244023 -148657 -83845 -9875 -43899
15114d3899N876m9454M4159k5742p1047N704J2869N5503J9358o8620p5229J18490
$$ -43899 -38023 -87477 -43318 -69060 -140107 -134403 -121534 -66031 -46673 -115293 -190522 -72032
15102g2032K01482l087J7819k1302r9100o3974J9494j0034l4247q9276R999L1346
$$ -72032 129450 126363 144182 122880 23780 -40194 -20700 -30734 -64981 -154257 -144258 -112912
15090a12912J20054M3027K5968P9365m2524j33708k8703M5040R6660n4882j2277
$$ -112912 7142 50169 76137 155502 112978 -20730 -49433 -4393 92267 37385 25108
15079B5108K5575m0615l4366j04789M1829J00522J06965L9261J6235n886l4334
$$ 25108 50683 10068 -24298 -129087 -87258 13264 120229 159490 175725 169839 135505
15068A35505q2421k3130M3993P599k1857m0102K8387j50909o7321j8048J5573
$$ 135505 53084 29954 73947 81546 59689 19587 47974 -102935 -170256 -188304 -172731
15057a72731K5129k2437P8737K2111R8699M5893m2555j4501j1246L0416K3335
$$ -172731 -147602 -170039 -91302 -69191 29508 75401 32846 18345 7099 37515 60850
15046F0850M754j6771q8992J7300J101P0030K1117k7809j5318r0630J2815k0436
$$ 60850 65604 48833 -40159 -22859 -21758 48272 69389 41580 26262 -64368 -51553 -71989
15034g1989Q1571J75353l5356r2709o5017r586M8227M5189j08960j1504n8294
$$ -71989 9582 184935 149579 56870 -8147 -17733 30494 75683 -33277 -44781 -103075
15023a03075l1502O4627J00896J9079p4423J0023R2408m4607L8551K283m3513
$$ -103075 -134577 -69950 30946 50025 -24398 -14375 78033 33426 71977 74260 30747
15012C0747o0526m4437k5002J11622J4450o7421n6933l866Q6455Q5085k7369m7373
$$ 30747 -29779 -74216 -99218 12404 26854 -40567 -97500 -101366 -14911 70174 42805 -4568
15000d568j22760o8634R0224M9064M00m2224m1256M7057O1049k2910k9250L135
$$ -4568 -127328 -195962 -105738 -56674 -56274 -98498 -139754 -92697 -31648 -54558 -83808 -80673
14988h0673O1911R8939r830m3857q5394j22167j45283J22463J31092O1311r8412
$$ -80673 -18762 80177 70347 26490 -58904 -181071 -326354 -203891 -72799 -11488 -109900
14977a09900j9943L0778k263J20268K4287J0159j4534M8651j3462j12953j4087
$$ -109900 -129843 -99065 -101328 18940 43227 53386 38852 87503 74041 -38912 -52999
14966e2999n1876N9272l4041j4922l9018L0192O0403l9263K9794L3926O6459P1619
$$ -52999 -104875 -45603 -79644 -94566 -133584 -103392 -42989 -82252 -52458 -18532 47927 119546
14954A19546n1886k2207l603l9395n6055r8160k4565K4250O3995J46225k6203
$$ 119546 67660 45453 41850 2455 -53600 -151760 -176325 -152075 -88080 58145 31942
14943C1942l7718k7604n8916P8813L3356l82n3713O67K3935l6322Q012p8818o2796
$$ 31942 -5776 -33380 -92296 -13483 19873 19491 -34222 -33555 -9620 -45942 -37930 -116748 -179544
14930a79544O9016L2348L8476O1038p8418j17432K044K6538j1150O482Q4263q9855
$$ -179544 -110528 -78180 -39704 21334 -57084 -174516 -172472 -145934 -157084 -150602 -66339 -156194
14918a56194o5644L2627P4614J00098K2952K991n9059j3068J32778R4843n1437
$$ -156194 -221838 -189211 -114597 -14499 8453 11444 -47615 -60683 72095 166938 115501
14907A15501o5794m0825n3844l0371L1010R9972l5701n1369K1103k792l1950n1721
$$ 115501 49707 8882 -44962 -75333 -44323 55649 19948 -31421 -10318 -13110 -45060 -96781
14895i6781P6654L4963J5809k5542N493L5962L6348K800n7922j25699m516L0713
$$ -96781 -20127 14836 30645 5103 10596 46558 82906 85706 27784 -97915 -102431 -71718
14883g1718J3310m3718k1397r4835L063O7756K1903J20551N5878j1730j20104
$$ -71718 -58408 -102126 -123523 -218358 -215295 -147539 -125636 -5085 50793 39063 -81041
14872h1041j9118K3295L910o2742m7114M1702Q5868R7442j01053q7293l9282O8523
$$ -81041 -100159 -76864 -72954 -135696 -182810 -141108 -55240 42202 -58851 -146144 -185426 -116903
14860a16903P3606L2414M5376J0492Q456q195P665j7725N3735k7217l9990k6342
$$ -116903 -43297 -10883 34493 44985 53441 45246 52911 35186 88921 61704 21714 -4628
14848d628O9216M2456l6716q6217K5024k5297j7145K3005M1475M4860K207r7832
$$ -4628 64588 107044 70328 -15889 9135 -16162 -33307 -10302 31173 76033 78240 -19592
14836a9592j218L9199M3176n0732o7518L1734m9184k9480N2666K0396j6386N2026
$$ -19592 -20810 18389 61565 10833 -56685 -24951 -74135 -103615 -50949 -30553 -46939 5087
14824E087k5571j8253j3261n7213q868R2682k6648L595L0415M6257J5741O6493
$$ 5087 -20484 -38737 -51998 -109211 -118079 -25397 -52045 -48450 -18035 28222 43963 110456
14812A10456L6291M5377l896l5929Q598l3070K9575P069q047n3374j17086j35231
$$ 110456 146747 192124 188228 152299 160897 127827 157402 164471 156424 103050 -14036 -149267
14800a49267Q0106l2155j9671l0664o5881Q6108J5918L8668J05236l7208q5676
$$ -149267 -69161 -101316 -120987 -151651 -217532 -131424 -115506 -76838 28398 -8810 -94486
14789i4486O770P3511R3056p2686M2789j16632j48787M575O5670J37168J10987
$$ -94486 -87716 -14205 78851 6165 48954 -67678 -216465 -211890 -146220 -9052 101935
14778A01935r0530m6795J9660n4590K295J10562K5232l7857o7035q2230k1426
$$ 101935 11405 -35390 -15730 -70320 -68025 42537 67769 29912 -37123 -119353 -140779
14767a40779l5562P2830l9224K5188J281O9900p3549l9967K2582N4010q738L9171
$$ -140779 -176341 -103511 -142735 -117547 -116266 -46366 -119915 -159882 -137300 -83290 -92028 -52857
14755e2857L6335m7053L6948M3992j7649J4147N0591l0052L6326j23895L8121
$$ -52857 -16522 -63575 -26627 17365 -284 13863 64454 34402 70728 -53167 -15046
14744a5046o3702j77371R142J65781l3868l7661L1556R5240N2517L2847j38991
$$ -15046 -78748 -256119 -246977 -81196 -115064 -152725 -121169 -25929 26588 59435 -79556
14733g9556K1433O9878R5773j9286R4225k9837j47251j28855j18131L2114J09623
$$ -79556 -58123 11755 107528 88242 182467 152630 5379 -123476 -241607 -209493 -99870
14722i9870N0594m9744k3690P0888M8832j5560o3276j8816N5677K8117j8297R928
$$ -99870 -49276 -99020 -122710 -51822 -2990 -18550 -81826 -100642 -44965 -16848 -35145 -25217
14710b5217O5622K4625M4898m1153Q94N1380q5363p1736O9383P2868n6145o7638
$$ -25217 40405 65030 109928 68775 69669 121049 35686 -36050 33333 106201 50056 -17582
14698a7582P1071Q9379p3569M514J5626l1936r529j1697j9620p5489k2563J37912
$$ -17582 53489 142868 69299 73813 89439 57503 47974 36277 16657 -58832 -81395 56517
14686E6517K1828N9562r6822j40766N1431N5734M4863M718j691J12737L1866m5889
$$ 56517 78345 137907 41085 -99681 -48250 7484 52347 57065 55374 168111 199977 154088
14674A54088l9057j44265n0691M8188k448M8851R41M2629p0644n8209q411j1498
$$ 154088 115031 -29234 -79925 -31737 -34185 14666 15607 58236 -12408 -70617 -79028 -90526
14662i0526J7796P6085o5463l5761k043o3958m3315j8401M1040k6741Q0343M0636
$$ -90526 -72730 3355 -62108 -97869 -99912 -163870 -207185 -225586 -184546 -211287 -130944 -90308
14650i0308N7224L7867L1980r219n6468K0598J8044m3413M673j5427N1493j7782
$$ -90308 -33084 4783 36763 27544 -28924 -8326 9718 -33695 -29022 -44449 7044 -10738
14638a0738M5344O1923n1846r4935j04863M4429J62838J21949k8350o3373k1789
$$ -10738 34606 96529 44683 -50252 -155115 -110686 52152 174101 145751 82378 60589
14627F0589k2661m7878M6485J5143L8250m8629n2768l1925l8352L6406O8622n428
$$ 60589 37928 -9950 36535 51678 89928 41299 -11469 -43394 -81746 -45340 23282 17854
14615A7854k6782L4397J480p0010j6423K5990M4334o9358J615l8785L5401N9172
$$ 17854 -8928 25469 26949 -43061 -59484 -33494 10840 -58518 -56903 -95688 -60287 -1115
14603a115n7376n7043M8113J46n2660l0295M3875P9943P6130j3779o8713m6322
$$ -1115 -58491 -115534 -67421 -67275 -119935 -150230 -106355 -26412 49718 35939 -32774 -79096
14591g9096R0828R7872k0609N9365o9400o2960O197L6706J109j21309l6707K6485
$$ -79096 11732 109604 88995 148360 78960 16000 22197 58903 60012 -61297 -98004 -71519
14579g1519O0462K1574M2511o3832p3690p6926j4285N6353O6732j2848n1227K0650
$$ -71519 -11057 10517 53028 -10804 -84494 -161420 -175705 -119352 -52620 -65468 -116695 -96045
14567i6045J10650l0235j35143M5548P6262J12393q8495O698Q4283P7840q2562
$$ -96045 14605 -15630 -150773 -105225 -28963 83430 -5065 1633 85916 163756 81194
14556H1194j05940k0033L9005k5553M3091M3384l707J3495O0413l6661k9625l0544
$$ 81194 -24746 -44779 -5774 -31327 11764 55148 51441 64936 125349 88688 59063 28519
14544B8519o5029J4692k4130P991L513L997p2848K6262L9015q6280j03039p375
$$ 28519 -36510 -21818 -45948 -37957 -34444 -30447 -103295 -77033 -38018 -124298 -227337 -234712
14532b34712K8678R5094J37939m2842n9252k1755Q4777R8692J9943K2321j52491
$$ -234712 -206034 -110940 26999 -15843 -75095 -96850 -12073 86619 106562 128883 -23608
14521b3608j09513j4650O7012p6330n4053q328l7635O7164O1939P2519R2528K2999
$$ -23608 -133121 -147771 -80759 -157089 -211142 -219470 -257105 -189941 -128002 -55483 37045 60044
14509F0044Q1538P7907M1913r8659j67046p1209M0069l5890P0354K0027r3555
$$ 60044 141582 219489 261402 162743 -4303 -75512 -35443 -71333 -979 19048 -74507
14498g4507p1981j7832M9927J3726J16607O7137o6032p7571n5348o4593Q225P3135
$$ -74507 -146488 -164320 -114393 -100667 15940 83077 17045 -60526 -115874 -180467 -172242 -99107
14486i9107L1441n7494l1306k7981J08029N1213N498p486r7369p4256R4241K0859
$$ -99107 -67666 -125160 -156466 -184447 -76418 -25205 -19707 -27193 -124562 -198818 -104577 -83718
14474h3718o846Q508N5094O2725l8270M146Q1940O2525j20382j37677l2423N3998
$$ -83718 -90564 -82056 -26962 35763 -2507 1639 83579 146104 25722 -111955 -144378 -90380
14462i0380P3100J1354l7382r4157p2456P5140R6951K5708K3548j04717n1258
$$ -90380 -17280 -5926 -43308 -137465 -209921 -134781 -37830 -12122 11426 -93291 -144549
14451a44549R5887r71k4285R511J06904P9427l0942m6061n9509K4069L2089q147
$$ -144549 -48662 -49633 -73918 -64407 42497 121924 90982 44921 -14588 9481 41570 33423
14439C3423M2508l166l196J6106L6945n454k130r2832m8384L0240n9413q8889
$$ 33423 75931 72765 69569 85675 122620 117166 115036 22204 -26180 4060 -55353 -144242
14427a44242N5961J22398M792l8306L916j24557r4144J31467Q7649Q4034O5099
$$ -144242 -88281 34117 38909 603 4519 -120038 -214182 -82715 4934 88968 154067
14416A54067q9466o3775q7944M6887J5552p8421R999J34664J00667l1620k4778
$$ 154067 64601 826 -87118 -40231 -24679 -103100 -93101 41563 142230 110610 85832
14405H5832l8998m8146L2749K6891J4250M3339m7894r0476n0503p747O744O4021
$$ 85832 46834 -1312 31437 58328 72578 115917 68023 -22453 -72956 -80703 -73959 -9938
14393i938N0717j0056l1904q5058O0495R1924Q918O196p7240r5476O4203M5144
$$ -9938 40779 30723 -1181 -86239 -25744 66180 75098 81294 4054 -91422 -27219 17925
14381A7925N357o6206l7919R278M4445m1137M3045k1895n562O0426k8731l3382
$$ 17925 23282 -42924 -80843 -71565 -27120 -68257 -25212 -47107 -52669 7757 -20974 -54356
14369e4356L4488K0258p5916r0617P8342l4866K681n6940m262Q5896P9093R7244
$$ -54356 -19868 390 -75526 -166143 -87801 -122667 -119986 -176926 -181188 -95292 -16199 81045
14357H1045l9663q6238K0128K7994m9517k226M0416m5890j17396N5373J54114
$$ 81045 41382 -44856 -24728 3266 -46251 -48477 -8061 -53951 -171347 -115974 38140
14346C8140R406j00084o6731K1609J07887L001p1771R6986P1691n661K6004l5004
$$ 38140 47546 -52538 -119269 -97660 10227 13228 -58543 38443 110134 104473 130477 95473
14334I5473M852J9867M232o0968l4702m6515K4333o1055L6918O6802j29330p0120
$$ 95473 100325 120192 124424 63456 28754 -17761 6572 -54483 -17565 49237 -80093 -150213
14322a50213k2878K3221J34990o2486j8003Q5335M0575K7316O4195N6760q7249
$$ -150213 -173091 -149870 -14880 -77366 -95369 -10034 30541 57857 122052 178812 91563
14311I1563r3308J9523q2201P098L6038j6314k768P860q7628m474k671K0289J75873
$$ 91563 -1745 17778 -64423 -57325 -21287 -37601 -40369 -32509 -120137 -124611 -127282 -106993 68880
14298F8880J7667k3180k2966J1193n1743m8175q7359L8432P3789L8221r7537l1229
$$ 68880 86547 63367 40401 51594 -149 -48324 -135683 -97251 -23462 14759 -82778 -114007
14286a14007K5622L396k1181L8064K9842l2166L3736Q3499N9612q0646j02907
$$ -114007 -88385 -84989 -106170 -68106 -38264 -70430 -36694 46805 106417 25771 -77136
14275g7136q9698k8806L9981R7484K0955m1067o722l1190n2713m4736J5986N5443
$$ -77136 -166834 -195640 -155659 -58175 -37220 -78287 -85009 -116199 -168912 -213648 -197662 -142219
14263a42219r62M9402K8140k1782K0710j1802k6244O2430R9965K5392l1477p8709
$$ -142219 -143181 -93779 -65639 -87421 -66711 -78513 -104757 -42327 57638 83030 51553 -27156
14251b7156p2920R6102J6700n6484o9849l7344N3913K8337L4101q161N5418K2729
$$ -27156 -100076 -3974 12726 -43758 -113607 -150951 -97038 -68701 -34600 -42761 12657 35386
14239C5386o8121N1825N7007n624j5826L8221n0588n8907O6762o8044L1118k6933
$$ 35386 -32735 19090 76097 70473 54647 92868 42280 -16627 50135 -17909 13209 -13724
14227a3724O1786o9123j4675p2894k2957j1345M8726J5925m8474Q6557P51M1577
$$ -13724 48062 -21061 -35736 -108630 -131587 -142932 -94206 -78281 -126755 -40198 -39447 2130
14215B130K008K9858r9985j8552K9058P724M1266J8619l6684J5202o8910m8094
$$ 2130 4138 33996 -65989 -84541 -55483 -47759 -6493 12126 -24558 -9356 -78266 -126360
14203a26360k849p960m0570j4435O0239m9673K9605P7916L6175J03106O2805L8688
$$ -126360 -129209 -137169 -177739 -192174 -131935 -181608 -152003 -74087 -37912 65194 127999 166687
14191A66687q6593K5649Q1238m3963o5207k5162o120n968Q3970j8193r4290n1098
$$ 166687 80094 105743 186981 143018 77811 52649 46529 40561 124531 106338 12048 -39050
14179c9050O8736j7913n2840j4391k9393l3666j2920p2192k9190P4624Q1469N4261
$$ -39050 29686 11773 -41067 -55458 -84851 -118517 -131437 -203629 -232819 -158195 -76726 -22465
14167b2465O2407J00745k2611n4165K7096j5323k9693o960O1929q9453j3654L8441
$$ -22465 39942 140687 118076 63911 91007 75684 45991 39031 100960 11507 -2147 36294
14155C6294Q206O0728K2214j1121m0333o2043K7842n693L8859J5298J4578p12
$$ 36294 44500 105228 127442 116321 75988 13945 41787 36094 74953 90251 104829 104117
14143A04117k6345o6353q0278o1742O5796J33243M7372N7149N3762p2202o9454
$$ 104117 77772 11419 -68859 -130601 -64805 68438 115810 172959 226721 154519 85065
14132H5065r4594r4060n1948j3768P3914K5381K9202n3645n750K8515n2577l1578
$$ 85065 -9529 -103589 -155537 -169305 -95391 -70010 -40808 -94453 -100203 -71688 -124265 -155843
14120a55843N7478P4945p692k4960j2292j0549Q5080N9991J01826o955p4543l402
$$ -155843 -98365 -23420 -31112 -56072 -68364 -78913 6167 66158 167984 161029 86486 83084
14108H3084J4432K7767j00698o5455J8860N9429R1457R337r9116Q6366O6948o9851
$$ 83084 97516 125283 24585 -40870 -22010 37419 128876 138213 39097 125463 192411 122560
14096A22560j37858N8813L1838L5710j87615j19485N1245R6080p099P5310O1025
$$ 122560 -15298 43515 75353 111063 -76552 -196037 -144792 -48712 -55811 19499 80524
14085H0524R782k3475J7843k1226j09477l5271L2741J9093k8661j2392O6116O6395
$$ 80524 90306 66831 84674 63448 -46029 -81300 -48559 -29466 -58127 -70519 -4403 61992
14073F1992j0351m5651k8162o0645Q7802l6798J3688Q9040J2499k0429J8989n7763
$$ 61992 51641 5990 -22172 -82817 4985 -31813 -18125 70915 83414 62985 81974 24211
14061B4211p5637N7434l4466k0307n6683j9719j5560M8293L7788m9125M3234M1863
$$ 24211 -51426 6008 -28458 -48765 -105448 -125167 -140727 -92434 -54646 -103771 -60537 -18674
14049a8674O2115p0821m9254K2792K6692j08679M7072Q4603J54378L9681l4377
$$ -18674 43441 -27380 -76634 -53842 -27150 -135829 -88757 -4154 150224 189905 155528
14038A55528q5749p1823K6106Q0571m2449O604j5709o4170o0608L1301J34616
$$ 155528 69779 -2044 24062 104633 62184 68788 53079 -11091 -71699 -40398 94218
14027I4218k3493q4436R4665M2862p2052j00160l0208l2234Q4983n7445o8198
$$ 94218 70725 -13711 80954 123816 51764 -48396 -78604 -110838 -25855 -83300 -151498
14016a51498M7626L9681K8229K8561P2612J31823j4073q2320q9433P3732l8854
$$ -151498 -103872 -64191 -35962 -7401 65211 197034 182961 100641 11208 84940 46086
14005D6086r2333m7677K2481k507O05m4606K3045l5589l2460p400M5945R6624
$$ 46086 -46247 -93924 -71443 -73950 -73345 -117951 -94906 -130495 -162955 -170355 -124410 -27786
13993b7786J43920N3060j33883j01092O6553N5569o0308r9685L8058O1648L3943
$$ -27786 116134 169194 35311 -65781 772 56341 -3967 -103652 -65594 -3946 29997
13982B9997j32152m0439J31175M7364p7576l6101j6941L2955K7522L2259J34829
$$ 29997 -102155 -142594 -11419 35945 -41631 -77732 -94673 -61718 -34196 -1937 132892
13971A32892L7502L5644M5372K4587L076q7196q8428q2446r017l4232L693K0591
$$ 132892 170394 206038 251410 275997 279073 191877 103449 21003 11986 -22246 -18553 2038
13959B038k0034N6766J6097O3342o2595k9008O8586L305j52578J622J18110L6207
$$ 2038 -17996 38770 54867 118209 55614 26606 95192 98497 -54081 -52459 65651 101858
13947A01858m1387q206R4422N1973n8751r7689n856o0728j47524q5028R7264J02903
$$ 101858 60471 52265 146687 198660 139909 42220 36364 -24364 -171888 -256916 -159652 -56749
13935e6749n3676p878J7640n3240J03859J77465R6957r9257j32127p4180L8246
$$ -56749 -110425 -118303 -100663 -153903 -50044 127421 224378 125121 -7006 -81186 -42940
13924d2940m995q7025K1629P5392o0992J063r431L0590N4444N8177J23982M7592
$$ -42940 -47935 -134960 -113331 -37939 -98931 -97868 -107299 -76709 -22265 35912 159894 207486
13912B07486j47077m3545k6617k078j3536n0440n3743R5259J6996L5904j5070
$$ 207486 60409 16864 -9753 -11831 -25367 -75807 -129550 -34291 -17295 18609 3539
13901C539j5765O5195P6247m1601j5839J4365j498p0205k3659J8688R5268N9202
$$ 3539 -12226 52969 129216 87615 71776 86141 84643 14438 -9221 9467 104735 163937
13889A63937j00837r3815m6103j2678N9955K6299L9580O0335J681K3803K743o994
$$ 163937 63100 -30715 -76818 -89496 -29541 -3242 36338 96673 98354 122157 124900 117906
13877A17906q116j0984n7818l6420m193p1321P723O5610J3759m7513P3126l9161
$$ 117906 109790 98806 40988 4568 375 -70946 -63223 2387 16146 -31367 41759 2598
13865B598J446P6845L0628l753n4097o2593j19007o404k4160P2653N8712M3627
$$ 2598 4044 80889 111517 107764 53667 -8926 -127933 -134337 -158497 -85844 -27132 16495
13853A6495n4610p0649L4683K1159m0550K2720K8138p5702K2111K2502J5242L638
$$ 16495 -38115 -108764 -74081 -52922 -93472 -70752 -42614 -118316 -96205 -73703 -58461 -54823
13841e4823K8050l2610K3707j14662J5299O2564q171j1263M8981j0400k8755k6779
$$ -54823 -26773 -59383 -35676 -150338 -135039 -72475 -80646 -91909 -42928 -53328 -82083 -108862
13829a08862J110l4708K877J44415k4627j27516l6893R5175J2209O2425N9492
$$ -108862 -107752 -142460 -139583 4832 -19795 -147311 -184204 -89029 -76820 -14395 45097
13818D5097l1030r5987m5059O9412Q5800J11016k3364l15l7615o5495l3685j0917
$$ 45097 14067 -81920 -126979 -57567 28233 139249 115885 115570 77955 12460 -21225 -32142
13806c2142p1780L78J03638k600p3441J4011N9466O1435O2333k6055m398P1195
$$ -32142 -103922 -103544 94 -2506 -75947 -61936 -2470 58965 121298 95243 90845 162040
13794A62040O8441j4829r751r5713q5964r996Q1917K1695p3633k5199m8364j10717
$$ 162040 230481 215652 205901 110188 24224 14228 96145 117840 44207 19008 -29356 -140073
13782a40073J9212m4715K1105k627M2159K8372K9388N9599L0416l7189k8107M6470
$$ -140073 -120861 -165576 -144471 -147098 -104939 -76567 -47179 12420 42836 5647 -22460 24010
13770B4010L4268j6966Q5841L7122q3947l1794l933q0807j09141K8781m338j5040
$$ 24010 58278 41312 127153 164275 80328 48534 44601 -36206 -145347 -116566 -120904 -135944
13758a35944L0465K7469o8164j02262J16671R2213k0121Q0535j2722o4525J2017
$$ -135944 -105479 -78010 -146174 -248436 -131765 -39552 -59673 20862 8140 -56385 -44368
13747d4368j3383q119N972K5285M2717J9822r640N4083N8l3305Q0735l3254o2859
$$ -44368 -57751 -65870 -59898 -34613 8104 27926 18286 72369 72427 39122 119857 86603 23744
13734B3744M8678K5914o9756j017J02694n5059q8075L4089M2706L585p9237k4784
$$ 23744 72422 98336 28580 27563 130257 75198 -12877 21212 63918 67503 -11734 -36518
13722c6518m3272o3084m0327K8121O2520Q1301k00p6677M69J04833O3809J0118
$$ -36518 -79790 -142874 -183201 -155080 -92560 -11259 -11459 -88136 -87667 17166 80975 91093
13710I1093l5797j4023P4103k6181L3406q1920j46062L4066j7253O2246P0977
$$ 91093 55296 41273 115376 89195 122601 40681 -105381 -71315 -88568 -26322 44655
13699D4655K2494K9723k4760l6597l7871k3399O0614K7311r9081k4800N7625J4039
$$ 44655 67149 96872 72112 35515 -2356 -25755 34859 62170 -36911 -61711 -4086 9953
13687I953K9466M8313J8046o8935L2643L2706K9128q0153l330R5915K7520N655
$$ 9953 39419 87732 105778 36843 69486 102192 131320 51167 47837 143752 171272 176927
13675A76927O2798q7727l4904Q4800J3526j11100q9624J34779O3388l4943p1093
$$ 176927 239725 151998 117094 201894 215420 104320 14696 149475 212863 177920 106827
13664A06827n0627L1919R2855M8808n2865j18674j41930n8968K5512m5955k7716
$$ 106827 56200 88119 180974 229782 176917 58243 -83687 -142655 -117143 -163098 -190814
13653a90814j1813M4626L5092l0867J01983J98840J0952j52344l5863O8994Q0567
$$ -190814 -202627 -158001 -122909 -153776 -51793 147047 157999 5655 -30208 38786 119353
13642A19353k264o9549m4456n974j6021l1676K8101M643M3627n6064k330N6951
$$ 119353 117089 47540 3084 -2890 -18911 -50587 -22486 -17843 25784 -30280 -32610 24341
13630B4341l7387j7220P9065J00418j4696j21898j7343J29840j2480p5247N9379
$$ 24341 -13046 -30266 48799 149217 134521 12623 -4720 125120 112640 37393 96772
13619I6772P2927m2168J1672n7434o8496k9966n7398M1276Q7619R0951J00572
$$ 96772 169699 127531 139203 81769 13273 -16693 -74091 -32815 54804 145755 246327
13608B46327P555J5081m6430n8531k5731J562j21840o0652n0393M5444J8386l6953
$$ 246327 253882 268963 222533 164002 138271 139833 17993 -42659 -93052 -47608 -29222 -66175
13596f6175L7777M8479m4100P5945K3078k0451r3448o7943P5357j6812J8010Q473
$$ -66175 -28398 20081 -24019 51926 75004 54553 -38895 -106838 -31481 -48293 -30283 -21810
13584b1810p4350O2843M2310N463k8741M5874o019R697K0057j8065n6930L9558
$$ -21810 -96160 -33317 8993 14456 -14285 31589 25570 35267 55324 37259 -19671 19887
13572A9887L8303q3363o2872o3378n49j8260J12467J27042J4481L0446j8874l4096
$$ 19887 58190 -25173 -88045 -151423 -151972 -170232 -57765 69277 83758 114204 95330 61234
13560F1234k4948l6529n8144R6390O6756p5282p0128J7375O0162N0509o1247j23037
$$ 61234 36286 -243 -58387 38003 104759 29477 -40651 -23276 36886 87395 26148 -96889
13548i6889k3478L9152N3990O3036M5746j6842m4934j1671m0069R667N6887J4242
$$ -96889 -120367 -81215 -27225 35811 81557 64715 19781 8110 -31959 -22292 34595 48837
13536D8837M9368o8348o7483Q332N1729K7102P7202L7160k7229J0090k4375J1182
$$ 48837 98205 29857 -37626 -29294 22435 49537 126739 163899 136670 146760 122385 133567
13524A33567K1991M5342k5450j4578N246J3303o3263m5450n6310n4879N8500P0622
$$ 133567 155558 200900 175450 160872 166118 179421 116158 70708 14398 -40481 18019 88641
13512H8641k0347O1201P6372J6975L8065n7855j08303j6584l9210J1441O176M036
$$ 88641 68294 129495 205867 222842 260907 203052 94749 78165 38955 50396 56572 60608
13500F0608p3511j7228q155N518l3312P3759L5771K6770M2877m1100L0367N3190
$$ 60608 -12903 -30131 -38286 -32768 -66080 7679 43450 70220 113097 71997 102364 155554
13488A55554j8336m2404j8353k3124o1589k4423p934P1706n2601O0480O1354n7279
$$ 155554 137218 94814 76461 53337 -8252 -32675 -40609 31097 -21504 38976 100330 43051
13476D3051m6359l3016J8039l2860m5506O8668K4433l0020m5394J5091l7159M7036
$$ 43051 -3308 -36324 -18285 -51145 -96651 -27983 -3550 -33570 -78964 -63873 -101032 -53996
13464e3996O8272L6903J5116L9298M3613n6639J8365l6588J38314p5178j40123
$$ -53996 14276 51179 66295 105593 149206 92567 110932 74344 212658 137480 -2643
13453b643K2592R7777L9684l7286k5376J197M4743J9896o6061j1571N5814K0992
$$ -2643 19949 117726 157410 120124 94748 95945 140688 160584 94523 82952 138766 159758
13441A59758m3616r7865k7273N5180K070j748n2635m5554k407J02774J27589K0144
$$ 159758 116142 18277 -8996 46184 48254 46506 -6129 -51683 -54090 48684 176273 196417
13429A96417q5403m8011J7826O1650P0768q8604n10l0300l5843L9681K8669p8175
$$ 196417 111014 63003 80829 142479 213247 124643 124133 93833 57990 97671 126340 48165
13417D8165M9620K2754R2719L8557n6912o9090l5102J4867J0828p6003k5889J49708
$$ 48165 97785 120539 213258 251815 194903 125813 90711 105578 116406 40403 14514 164222
13405A64222M5456r2934k6919j819J7808M5448L583n64K5606j2362j1286p34P995
$$ 164222 209678 116744 89825 88006 105814 151262 154845 154281 179887 167525 156239 155505 163500
13392A63500J9334Q6921o2175q275n2100j4363l8917O273o6232L3657J5483j8929
$$ 163500 182834 269755 207580 199305 147205 132842 93925 100198 33966 67623 83106 64177
13380F4177J52349J3891p2695n6474j6546j749l294P8735j09430L9064P8646K7868
$$ 64177 216526 230417 157722 101248 84702 82953 79659 158394 48964 88028 166674 194542
13368A94542l1010k4717L7767K0895q0876k6603K5944N8615n0769o6732m5530
$$ 194542 163532 138815 176582 197477 116601 89998 115942 174557 123788 57056 11526
13357A1526K428R183M8634Q3830k2929k194P2095k326j18060q9121N0045m5224
$$ 11526 13954 23137 71771 155601 132672 130478 202573 200247 82187 -6934 43111 -2113
13345b113o6929R7057K9710j0832k7465m8700L398J13224Q1770L3928N5721l6533
$$ -2113 -69042 28015 57725 46893 19428 -29272 -25874 87350 169120 203048 258769 222236
13333B22236Q867o8121l5556M1861l189q2896L6648Q2263q4176j04390P9937R5999
$$ 222236 231103 162982 127426 169287 166098 83202 119850 202113 117937 13547 93484 189483
13321A89483M5775M3710q2123j4245N8865O6538k6972j24645J7780K7432L2574
$$ 189483 235258 278968 196845 182600 241465 308003 281031 156386 174166 201598 234172
13310B34172J02069r3282N7969p5864l0433k7568o7268J4522m6097M176J35804
$$ 234172 336241 242959 300928 225064 194631 167063 99795 114317 68220 72396 208200
13299B08200L8349j3121m9296j65456m1758K3301L9764O1180N0964K4566J6436
$$ 208200 246549 233428 184132 18676 -23082 219 39983 101163 152127 176693 193129
13288A93129p8190k4695L290r1645o860P4637k2562Q5491P3132P45n9754j8360
$$ 193129 114939 90244 93534 1889 -4971 69666 47104 132595 205727 206472 146718 128358
13276A28358l2399q3379J14607J26780M180o3546m8647R221q476J0409l848n0603
$$ 128358 95959 12580 127187 253967 258147 194601 145954 155175 146699 157108 153260 102657
13264A02657o7288L3219N2295L1027Q9545n0755r9047J1252k8901k1755k8267
$$ 102657 35369 68588 120883 151910 241455 190700 91653 102905 74004 52249 23982
13253B3982K8447k3910K191M3033J27358P5013m8145q0993M2987l5607o7791L0977
$$ 23982 52429 28519 30710 73743 201101 276114 227969 146976 189963 154356 86565 117542
13241A17542N3406L8853j0592L5923l8808N724m8077L6227o793J02929J6554M3197
$$ 117542 170948 209801 199209 235132 196324 202048 153971 190198 183405 286334 302888 346085
13229C46085r0228j16397m18K1312J20758N7065j18151j15440L746N6899J5766
$$ 346085 255857 139460 139042 160354 281112 338177 220026 104586 108332 165231 180997
13218A80997j4578P054k1869k9386m9400k4844Q0211Q4883P695O327j1800J07719
$$ 180997 166419 173473 151604 122218 72818 47974 128185 213068 220763 227090 215290 323009
13206C23009N5508j29102j28079M932N7882k0217q651L2231n6402K0163J0815
$$ 323009 378517 249415 121336 126268 184150 163933 155282 187513 131111 151274 162089
13195A62089r330n996J8550k2909p1144j18757L2467N0386Q9600N9227l1229k5850
$$ 162089 152759 146763 165313 142404 71260 -47497 -15030 35356 124956 184183 152954 127104
13183A27104P5684K0717l0815M7741L6144q5940J7847K1985N0696n6511p7492
$$ 127104 202788 223505 192690 240431 276575 190635 208482 230467 281163 224652 147160
13172A47160k9595n8250l737N0892J12959K8116m8735k7575L121J35478N5420
$$ 147160 117565 59315 55578 106470 219429 247545 198810 171235 174356 309834 365254
13161C65254j26439n838j15843j12350P6792J22330K7006q8370r765m3853M6140
$$ 365254 238815 232977 117134 4784 81576 203906 230912 142542 132777 88924 135064
13150A35064N5488K6528L5944K0972J9917M8713m7545j022k7085m1398J11770
$$ 135064 190552 217080 253024 273996 293913 342626 295081 294059 266974 225576 337346
13139C37346j1170j13983m1987K7613J45158K7706j33398l1414M7600o625L3153
$$ 337346 326176 212193 170206 197819 342977 370683 237285 205871 253471 246846 279999
13128B79999O0672N7187o5193n6197M9220m8430r564l1424o4470q0795K2463M4476
$$ 279999 340671 397858 332665 276468 325688 277258 267694 236270 171800 91005 113468 157944
13116A57944M9671n9630J6464K0951l2153N0802L0902o7517P4698k8454j5394
$$ 157944 207615 147985 164449 185400 153247 204049 234951 167434 242132 213678 198284
13105A98284n99k773j6679k3080k4206P634k8849J11647l6146j19128L2538N2883
$$ 198284 197685 194912 178233 155153 130947 138581 109732 221379 185233 66105 98643 151526
13093A51526K9716k9770j1293k2454L6510J7284l7113p8429l6356k4512N7568
$$ 151526 181242 151472 140179 117725 154235 171519 134406 55977 19621 -4891 52677
13082E2677L8457N6163L2702M0750K7041j4511o6137Q0592o355k9237k6609N4536
$$ 52677 91134 147297 179999 220749 247790 233279 167142 247734 241379 212142 185533 240069
13070B40069n115Q9294r1767k3623K9484N0814L8012L3450o0678p3492L5191J4224
$$ 240069 234954 324248 232481 208858 238342 289156 327168 360618 299940 226448 261639 275863
13058B75863N3031k3726n2251J4003k8709L4050P5409L6125l652M667j2654m251
$$ 275863 328894 305168 252917 266920 238211 272261 347670 383795 380143 384810 372156 367905
13046C67905m2846j29191J3958J10339R0283N0422n9492n6074J6105Q6364j8061
$$ 367905 325059 195868 209826 320165 410448 460870 401378 345304 361409 447773 429712
13035D29712l2509j17510j16219J6951J01044O903N6813M9717n9134n631m5065
$$ 429712 397203 279693 163474 180425 281469 288372 345185 394902 335768 330137 285072
13024B85072N1960N413J9366N293N0139k2965m7780l6961L098N9458J0067P6770
$$ 285072 337032 342445 361811 367104 417243 394278 346498 309537 312635 372093 382160 458930
13012D58930Q9419j6631n2514j25856O7768L6063q8206l1654J06406J01036j7022
$$ 458930 548349 531718 479204 353348 421116 457179 368973 337319 443725 544761 527739
13001E27739j5584L3944N2041k8094n5334J622Q840o74O6558Q8313O2022l3043
$$ 527739 512155 546099 598140 570046 514712 516334 525174 524500 591058 679371 741393 708350
12989G08350n5082K062m2380K15630Q213n0759M5090K9716M1626Q6058J24495
$$ 708350 653268 655330 612950 828580 836793 786034 831124 860840 902466 988524 1113019
12978A113019M6178n4194n3098P0676J53468O6258L9801j884r808M0735l5653
$$ 1113019 1159197 1105003 1051905 1122581 1276049 1342307 1382108 1380224 1370416 1411151 1375498
12967A375498n2330l132K1167l6597l3705o331M0248M6011L4674m5525J2779M6067
$$ 1375498 1323168 1320036 1341203 1304606 1270901 1264570 1304818 1350829 1385503 1339978 1352757 1398824
12955A398824Q382r476N5332Q0658J09829N2485j1879k9870J74776J22405M8118
$$ 1398824 1407206 1397730 1453062 1533720 1643549 1696034 1684155 1654285 1829061 1951466 1999584
12944A999584J11424J0898p5555N7293n3084k1954J4311j937l8654j7130j32514
$$ 1999584 2111008 2121906 2046351 2103644 2050560 2028606 2042917 2040980 2002326 1985196 1852682
12933A852682j30561q0190M6507M2640o863j985j5819l7407J5307N3546j5039
$$ 1852682 1722121 1641931 1688438 1731078 1724215 1722230 1706411 1669004 1684311 1737857 1722818
12922A722818j60575j38483j6376M8581J29934K2259n5813K6383L4054O572l7747
$$ 1722818 1562243 1423760 1407384 1455965 1585899 1608158 1552345 1578728 1612782 1619354 1581607
12911A581607L8568J33938N4888j09257m9413q1330q3017o2441k9254L313j3342
$$ 1581607 1620175 1754113 1809001 1699744 1650331 1569001 1485984 1423543 1394289 1397602 1384260
12900A384260q4038m4836q4522r0870q6850k0255l4040k2109j9871q0598j12152
$$ 1384260 1300222 1255386 1170864 1079994 993144 972889 938849 916740 896869 816271 704119
12889G04119j9425J5072M7624J5056l738K2329n1619J0269K9870K060n6166J1025
$$ 704119 684694 699766 747390 762446 758708 781037 729418 739687 769557 771617 715451 726476
12877G26476K1781j7273o430j2611J09269k8790p3498N7974O0256j6405j10693
$$ 726476 748257 730984 724554 711943 821212 792422 718924 776898 837154 820749 710056
12866G10056q2575m7999k5328p5537l3800P3321L4310Q4315o2430l4205J3167
$$ 710056 627481 579482 554154 478617 444817 518138 552448 636763 574333 540128 553295
12855E53295M7976R8936L198n8554j949j09578j36168N983J44454J73141R0276
$$ 553295 601271 700207 703405 644851 642902 533324 397156 403139 547593 720734 811010
12844H11010N0130j01571M6087O4133p9227k7607N7756R7549N71n4757J6240L8688
$$ 811010 861140 759569 805656 869789 790562 762955 820711 918260 918831 864074 880314 919002
12832I19002l3827j03027q0561m4777l0356R8953m2811q1548l5902M5457P8045
$$ 919002 885175 782148 701587 656810 626454 725407 682596 601048 565146 610603 688648
12821F88648J05797J3135m9762o0408P6637n789k9828Q284j88J4038m5786R7836
$$ 688648 794445 807580 757818 697410 774047 768258 738430 746714 746526 760564 714778 812614
12809H12614J03153Q129l4636K9260m7575m3192K0562l7698o8580J05558L9951
$$ 812614 915767 923896 889260 918520 870945 827753 848315 810617 742037 847595 887546
12798H87546J12659J05395l4264J0052J00898r2136m4441J06631O9436j2988j23451
$$ 887546 1000205 1105600 1071336 1081388 1182286 1090150 1045709 1152340 1221776 1208788 1085337
12787A085337j71055l8599j5031K6075Q7447J38922N5408M4893Q8324J8654M843
$$ 1085337 914282 875683 860652 886727 974174 1113096 1168504 1213397 1301721 1320375 1325218
12776A325218p1162L4960J7180j57795q6235N0810O3980M7020Q0490n1987O0844
$$ 1325218 1254056 1289016 1306196 1148401 1062166 1112976 1176956 1223976 1304466 1252479 1313323
12765A313323J63914L0360n031P195Q8139R5179R8457Q94N7381J07703J12486
$$ 1313323 1477237 1507597 1502566 1509761 1597900 1693079 1791536 1792430 1849811 1957514 2070000
12754B070000J44506J40142J55739J01804O8921J5320l8488l8479N086q1799o4663
$$ 2070000 2214506 2354648 2510387 2612191 2681112 2696432 2657944 2619465 2624551 2542752 2478089
12743B478089l5845j9526L3803l3250n792j00965j99401L8805J83457J31022J1516
$$ 2478089 2442244 2422718 2456521 2423271 2417479 2316514 2117113 2155918 2339375 2470397 2481913
12732B481913J5460Q3998J52097P1604R4192J67227J62735J41289K07723J76912
$$ 2481913 2497373 2581371 2733468 2805072 2899264 3066491 3229226 3370515 3578238 3755150
12722C755150M384L2787P1637M5967q7422k25603j96668m8120k7301m8078q833
$$ 3755150 3759534 3792321 3863958 3909925 3822503 3596900 3400232 3352112 3324811 3276733 3267900
12711C267900j930q3699k7026j13562m8849o5510o6160k8493j52090j9911J69747
$$ 3267900 3265970 3182271 3155245 3041683 2992834 2927324 2861164 2832671 2680581 2660670 2830417
12700B830417J11809M3542O3151P6492O6326N5400J56273K36432J93302K28916
$$ 2830417 2942226 2985768 3048919 3125411 3191737 3247137 3403410 3639842 3833144 4062060
12690D062060Q3939rk5643j07475k19573j05820j46690q3367j41948j35751j19616
$$ 4062060 4145999 4145990 4120347 4012872 3793299 3687479 3540789 3457422 3315474 3179723 3060107
12679C060107j13467j31060j28776M3427J9703p197k600N2498n3738p135J29953
$$ 3060107 2946640 2815580 2686804 2730231 2749934 2742737 2740137 2792635 2738897 2731762 2861715
12668B861715P9901M2111l6882p985O8130Q7958O5211o7934j01475r4167l5168
$$ 2861715 2941616 2983727 2946845 2938860 3006990 3094948 3160159 3092225 2990750 2896583 2861415
12657B861415K5490l2568l7789P327J32796J9831O7745Q2683R1236J37116O9375
$$ 2861415 2886905 2854337 2816548 2823875 2956671 2976502 3044247 3126930 3218166 3355282 3424657
12646C424657k1359r3669M1739O226O1378K892K5702K7498J79473J29715o3226
$$ 3424657 3403298 3309629 3351368 3357594 3418972 3421864 3447566 3475064 3654537 3784252 3721026
12635C721026L2295O0295J20145O6767L461O164L3807J5745L8702O5812N0651
$$ 3721026 3753321 3813616 3933761 4000528 4003989 4010153 4043960 4059705 4098407 4164219 4214870
12624D214870M0592j7240M4308M318J36044J65200J33379o364J04987J85563J80622
$$ 4214870 4255462 4238222 4282530 4286848 4422892 4588092 4721471 4715107 4820094 5005657 5186279
12613E186279J32834J27448P3673N6863Q1595O7387J90863J96681J54278P7595
$$ 5186279 5319113 5446561 5520234 5577097 5658692 5726079 5916942 6113623 6267901 6345496
12603F345496J03696J03771R5874J19855O4939J10208K63684K55983J02033J44899
$$ 6345496 6449192 6552963 6648837 6768692 6833631 6943839 7207523 7463506 7565539 7710438
12593G710438K46243J23314J94621J67566K58208L49183K34532K20584L15869
$$ 7710438 7956681 8079995 8274616 8442182 8700390 9049573 9284105 9504689 9820558
12584I820558L22859K72654M03355M20201L75941L44616M09365N88899M82999
$$ 9820558 10143417 10416071 10819426 11239627 11615568 11960184 12369549 12958448 13441447
12575A3441447N07364M79133N54793N84319P20882P44825P23026Q05624Q45169
$$ 13441447 13948811 14427944 14982737 15567056 16287938 17032763 17755789 18561413 19406582
12566A9406582Q46691J021929J144326J111282J307641J372267J472417J757108
$$ 19406582 20253273 21275202 22419528 23530810 24838451 26210718 27683135 29440243
12558B9440243J984846K038411K203113K542568K800809L232012L746949M133238
$$ 29440243 31425089 33463500 35666613 38209181 41009990 44242002 47988951 52122189
12550E2122189M590037N229324N950626O639717P331516Q175962Q874199R715380
$$ 52122189 56712226 61941550 67892176 74531893 81863409 90039371 98913570 108628950
12542A08628950J0255108J0639026J0617297J0228268R440360Q070166O381854
$$ 108628950 118884058 129523084 140140381 150368649 159809009 167879175 174261029
12535A74261029M441695K493309N60023r86680k130894k748793l035249k854042
$$ 174261029 178702724 181196033 181756056 180769376 178638482 175889689 172854440 170000398
12527A70000398k200250j473355o29846L12987J298748K546306L501093M599908
$$ 170000398 167800148 166326793 165696947 166009934 167308682 169854988 173356081 177955989
12519A77955989N894331P366527Q941994J0473552J2095158J3450951J4286690
$$ 177955989 183850320 191216847 200158841 210632393 222727551 236178502 250465192
12512B50465192J4628107J4287651J3029900J1051313Q411424N286838K080619
$$ 250465192 265093299 279380950 292410850 303462163 311873587 317160425 319241044
12505C19241044q84251l453874n483982o693544p338576p774855p703261p554577
$$ 319241044 318356793 314902919 309418937 302725393 295386817 287611962 279908701 272354124
12497B72354124p330963p281014p318431p208432o991371o503428n616276m382620
$$ 272354124 265023161 257742147 250423716 243215284 236223913 229720485 224104209 219721589
12489B19721589k849520j301087L96210K019951L632559N268319O719381P834481
$$ 219721589 216872069 215570982 215967192 217987143 221619702 226888021 233607402 241441883
12481B41441883Q735281R422433R621376R362860Q022650N573746K400475j421470
$$ 241441883 250177164 259599597 269220973 278583833 286606483 292180229 294580704 293159234
12473B93159234n830010r961579j3451276j6085696j7719969j8392763j8213651
$$ 293159234 287329224 277367645 263916369 247830673 230110704 211717941 193504290
12466A93504290j7398040j6221401j4872723j3437835j1973447j0675797r478949
$$ 193504290 176106250 159884849 145012126 131574291 119600844 108925047 99446098
12459I9446098q571749p556977o797962n930104n169831m735946m267924l776938
$$ 99446098 90874349 83317372 76519410 70589306 65419475 60683529 56415605 52638667
12451E2638667l545509l196704k840739k511265k208065k052628j952392j746916
$$ 52638667 49093158 45896454 43055715 40544450 38336385 36283757 34331365 32584449
12443C2584449j579072j465416j376328j150211j111598r45837q92326q07381
$$ 32584449 31005377 29539961 28163633 27013422 25901824 24955987 24063661 23256280
12435B3256280o78806o42157p09806o35866m95782m13576k61499k58795j45200
$$ 23256280 22577474 21935317 21225511 20589645 20093863 19680287 19418788 19159993 19014793
12426A9014793m1898J59992M35347P41872J015385J315808J557895J443720P95518
$$ 19014793 18972895 19132887 19568234 20310106 21325491 22641299 24199194 25642914 26438432
12417B6438432o8704j024533j541413j805093j829541j747982j451528j179156
$$ 26438432 26369728 25345195 23803782 21998689 20169148 18421166 16969638 15790482
12409A5790482q36832o84037o47914o34235n39534m93566l33755k63883k94728
$$ 15790482 14953650 14269613 13621699 12987464 12447930 11954364 11620609 11356726 11061998
12400A1061998l29634k51334k35862k33070j27534j31344j30350j70396j56686
$$ 11061998 10732364 10481030 10245168 10012098 9884564 9753220 9622870 9452474 9295788
12391I295788j94184j35130k22858j09508l2719r5654j00524o6921j16489k00796
$$ 9295788 9101604 8966474 8743616 8634108 8601389 8505735 8405211 8338290 8221801 8021005
12381H021005j12858l2065m4498n9193r2842J3377P3710j9726M8649O8535O0248
$$ 8021005 7908147 7876082 7831584 7772391 7679549 7692926 7766636 7746910 7795559 7864094 7924342
12370G924342k8713M0023O4121J37866J26800Q7788J92004J77574J69708K34042
$$ 7924342 7895629 7935652 7999773 8137639 8264439 8352227 8544231 8721805 8891513 9125555
12360I125555K59981L23807L39838N03323M25764M49175N76664N75858M95234
$$ 9125555 9385536 9709343 10049181 10552504 10978268 11427443 12004107 12579965 13075199
12351A3075199M96561M84598L61762K65388J04172l8861j10286j94413k77505
$$ 13075199 13571760 14056358 14418120 14683508 14787680 14748819 14638533 14444120 14166615
12342A4166615k83078m22464l78320k89260j67146k22182j31166m8359M6560P3763
$$ 14166615 13883537 13461073 13082753 12793493 12626347 12404165 12272999 12224640 12271200 12344963
12332A2344963J09697J23599J25430K57304K41295L60167L89526M07261N39039
$$ 12344963 12454660 12578259 12703689 12960993 13202288 13562455 13951981 14359242 14898281
12323A4898281N62438N86643O30462P36633Q66628J003554J194046J368073J431449
$$ 14898281 15460719 16047362 16677824 17414457 18281085 19284639 20478685 21846758 23278207
12314B3278207J605947J856564K269590K744905L152322L540830M179075M806560
$$ 23278207 24884154 26740718 29010308 31755213 34907535 38448365 42627440 47434000
12306D7434000N591347O869522Q270537J0023171J2335716J5535456J9641619
$$ 47434000 53025347 59894869 68165406 78188577 90524293 106059749 125701368
12299A25701368K4897391L1445796L8927924M6475434N2100432N2781655M5707350
$$ 125701368 150598759 182044555 220972479 267447913 319548345 372330000 418037350
12292D18037350K9636630P320808j5463126l2440897m0025124l9117704l3431826
$$ 418037350 447673980 454994788 439531662 407090765 367065641 327947937 294516111
12285B94516111k6134165j9680127j5523600j3586717j2934315j2093814r734466
$$ 294516111 268381946 248701819 233178219 219591502 206657187 194563373 184828907
12278A84828907n982839j087227M584652J0497714J6321006K0918874K2648695
$$ 184828907 178846068 177758841 182343493 192841207 209162213 230081087 252729782
12271B52729782K0119963J3777397O380903J506656J412810N497603J2210640
$$ 252729782 272849745 286627142 293008045 294514701 295927511 301425114 313635754
12264C13635754J9461980K5197828K7832133K6515557K1621179J3651983K840508
$$ 313635754 333097734 358295562 386127695 412643252 434264431 447916414 450756922
12257D50756922j0396522k4821370l7138083m3944974m4111767l9073554l1609493
$$ 450756922 440360400 415539030 378400947 334455973 290344206 251270652 219661159
12250B19661159k3901514j6859968j0979240o243057l089598j627754j663794
$$ 219661159 195759645 178899677 167920437 161677380 158587782 156960028 155296234
12243A55296234k589472k999096k211470K04735L779964P881498J2009711J5837982
$$ 155296234 152706762 149707666 147496196 147700931 151480895 159362393 171372104 187210086
12235A87210086J8519624J9032837J6343430J1136576M738076j844811q457852
$$ 187210086 205729710 224762547 241105977 252242553 256980629 255135818 246677966
12228B46677966j5536858k2233396k6407773k7165024k4984110k1265118j7294813
$$ 246677966 231141108 208907712 182499939 155334915 130350805 109085687 91790874
12221I1790874j3794474j0967935q740672p146520n817624m768493m005149l402314
$$ 91790874 77996400 67028465 58287793 51141273 45323649 40555156 36550007 33147693
12213C3147693k875419k570560k196462j882509j713899j574373j286489j107739
$$ 33147693 30272274 27701714 25505252 23622743 21908844 20334471 19047982 17940243
12205A7940243j076394j097656q52175p12096q13240o56657o07159n00417m47106
$$ 17940243 16863849 15766193 14914018 14201922 13388682 12732025 12124866 11624449 11177343
12196A1177343m57429m03967l89172l91978k98114k84533k32693k12738k38646
$$ 11177343 10719914 10315947 9926775 9534797 9236683 8952150 8719457 8506719 8268073
12187H268073k95072k50478j63196j52862k61188k39267j45253j27953k14239
$$ 8268073 7973001 7722523 7559327 7406465 7145277 6906010 6760757 6632804 6418565
12178F418565p8714n3978r0548r0312n4846q37L8471l5667K0967n4400p7037q9321
$$ 6418565 6339851 6285873 6195325 6105013 6050167 6049330 6087801 6052134 6073101 6018701 5941664 5852343
12166E852343j75447j32679k05906k17699k39676j40745j08208j13774n457k4842
$$ 5852343 5676896 5544217 5338311 5120612 4880936 4740191 4631983 4518209 4512752 4487910
12156D487910n0756J1156j88613r7490j8314m4007m5621l8793r728j8236l3744
$$ 4487910 4437154 4448310 4259697 4162207 4143893 4099886 4054265 4015472 4005744 3987508 3953764
12145C953764j17372j76743o3563K3738k4021q1217k5234M8845L6927J02587J2144
$$ 3953764 3836392 3659649 3596086 3619824 3595803 3514586 3489352 3538197 3575124 3677711 3689855
12134C689855m5437j10602q8874q4770n5464j46193o6858j45075j38569j7553
$$ 3689855 3644418 3533816 3444942 3360172 3304708 3158515 3091657 2946582 2808013 2790460
12124B790460n250N2094Q7134J1208J6067L4924L9937o1378K1825j01735j61001
$$ 2790460 2785210 2837304 2924438 2935646 2951713 2986637 3026574 2965196 2987021 2885286 2724285
12113B724285j2101M6096Q4506L6149P096L5380j9782r0210O7449N7939L7807
$$ 2724285 2712184 2758280 2842786 2878935 2886031 2921411 2901629 2811419 2878868 2936807 2974614
12102B974614J62150N2570k34115j74404l5824j1814j3218m0305r179N4665J15062
$$ 2974614 3136764 3189334 2955219 2780815 2744991 2733177 2719959 2679654 2670475 2725140 2840202
12091B840202O7726M7411O1838J07009J34009k1470J0917r687P4445j19829j03673
$$ 2840202 2907928 2955339 3017177 3124186 3258195 3236725 3247642 3237955 3312400 3192571 3088898
12080C088898m7612q8333p2908O5679N8223m8734j02651r8767o7739q2527j6389
$$ 3088898 3041286 2952953 2880045 2945724 3003947 2955213 2852562 2753795 2686056 2603529 2587140
12069B587140J33165J68126M6173k034n4076j9961P151J15562Q1681R7666J05623
$$ 2587140 2720305 2888431 2934604 2932570 2878494 2858533 2865684 2981246 3062927 3160593 3266216
12058C266216l8567r55P05j3944R1436J3703j24730n9886l9576J31386N0513o2137
$$ 3266216 3227649 3226694 3227399 3213455 3304891 3318594 3193864 3133978 3094402 3225788 3276301 3214164
12046C214164q5861j11531j09406j50848j90518j30765p1772m5214K1708K6333
$$ 3214164 3128303 3016772 2907366 2756518 2566000 2435235 2363463 2318249 2339957 2366290
12036B366290j21832o2196J537r561p3763K0427M1960J05500M3108J9161R7923
$$ 2366290 2244458 2182262 2183799 2174238 2100475 2120902 2162862 2268362 2311470 2330631 2428554
12025B428554l9984m6179r5044n8375l4006N5606p9054r3250o3459p5417L2024
$$ 2428554 2388570 2342391 2247347 2188972 2154966 2210572 2131518 2038268 1974809 1899392 1931416
12014A931416J856k8169o0955k8219q5530p0857l0859p142p856k5349r752l7567
$$ 1931416 1933272 1905103 1844148 1815929 1730399 1659542 1628683 1621541 1613685 1588336 1578584 1541017
12002A541017q9142k2226K9073N0551p4610q1587O3781Q9269Q323o0231j04882
$$ 1541017 1451875 1429649 1458722 1509273 1434663 1353076 1416857 1506126 1514449 1454218 1349336
11991A349336m445j719O6205P0811N7328J16215R5611j9906k5334p6803M8966
$$ 1349336 1344891 1343172 1409377 1480188 1537516 1653731 1749342 1729436 1704102 1627299 1676265
11980A676265P0076N1263P9319l4356L0279N5845J42173Q041j41636j04747J46700
$$ 1676265 1746341 1797604 1876923 1842567 1872846 1928691 2070864 2078905 1937269 1832522 1979222
11969A979222O5116Q001R2377Q819j1298J0699L3259J05508J66645J01652J50669
$$ 1979222 2044338 2052339 2144716 2153535 2142237 2152936 2186195 2291703 2458348 2560000 2710669
11958B710669Q5600J24834K20689L18512K16634K47946J11512R2860J10713K54981
$$ 2710669 2796269 2921103 3141792 3460304 3676938 3924884 4036396 4129256 4239969 4494950
11948D494950K51084J94075L66181L55674J70647L87766L46414L69247N61475
$$ 4494950 4746034 4940109 5306290 5661964 5832611 6220377 6566791 6936038 7497513
11939G497513O07605P58242R41624R01420J014954J370176J724064K045044K488593
$$ 7497513 8105118 8863360 9804984 10706404 11721358 13091534 14815598 16860642 19349235
11930A9349235K972960L548529M462941N890014P751863J0637824J5027554K1795279
$$ 19349235 22322195 25870724 30333665 36223679 43975542 54613366 69640920 91436199
11922I1436199L2674158M9954348P4252037J01052434J16443634R0975477Q038670
$$ 91436199 124110357 174064705 248316742 349369176 465812810 556788287 564826957
11915E64826957p3542620j15574291j09759549p8280510n0790066l3238951k2611797
$$ 564826957 491284337 375710046 265950497 187669987 136879921 103640970 81029173
11908H1029173j6106313j1946275q953024o849229n482069m314280l471565k768895
$$ 81029173 64922860 52976585 44023561 37174332 31692263 27377983 23906418 21137523
11900B1137523k211016j864574j603202j343822j194544j055159r91706q15219
$$ 21137523 18926507 17061933 15458731 14114909 12920365 11865206 10873500 10058281
11892A0058281n93566n89512o48798n20435m36240l70580l96076m08265l73387
$$ 10058281 9464715 8875203 8226405 7705970 7269730 6899150 6503074 6094809 5721422
11883E721422l33230l11234l22554k52070j97962j97998k26866j35181j53210
$$ 5721422 5388192 5076958 4754404 4502334 4304372 4106374 3879508 3744327 3591117
11874C591117j92732n0844k6737p6415j73671j16849q4926q7562J150o6936p0586
$$ 3591117 3398385 3347541 3320804 3244389 3070718 2953869 2868943 2781381 2782531 2715595 2645009
11863B645009o7267j09527l8271r5249k9794l5845p1902K5061M7392q8692r1295
$$ 2645009 2577742 2468215 2429944 2334695 2304901 2269056 2197154 2222215 2269607 2180915 2089620
11852B089620N44n3569j874n7528m1609M3634K0432p917J11222K20496J19830
$$ 2089620 2090164 2036595 2034721 1977193 1935584 1979218 1999650 1991733 2102955 2323451 2443281
11841B443281Q6815J41646L0889J39462K09776K18685Q6210N8760n9562k16837
$$ 2443281 2530096 2671742 2702631 2842093 3051869 3270554 3356764 3415524 3355962 3139125
11831C139125j72168k14627k37260k06290j37747q1028M5642r234j08647j18925
$$ 3139125 2966957 2752330 2515070 2308780 2171033 2090005 2135647 2126413 2017766 1898841
11821A898841l631R6490R3537k0542l0132j8644R373K35299J81533O379Q6714
$$ 1898841 1895210 1991700 2085237 2064695 2034563 2015919 2025292 2260591 2442124 2448503 2535217
11810B535217J02076K8911P3860J04206J15932J61528J36794O2075j8046L4190
$$ 2535217 2637293 2666204 2740064 2844270 2960202 3121730 3258524 3320599 3302553 3336743
11800C336743k060p8604k01527o6507k4563q2095j3027q0105j77749j12860j74010
$$ 3336743 3334683 3256079 3054552 2988045 2963482 2881387 2868360 2788255 2610506 2497646 2323636
11789B323636k81093j52565j73124j15263k9273N3465l6141o8128P6312J7969
$$ 2323636 2042543 1889978 1716854 1601591 1572318 1625783 1589642 1521514 1597826 1615795
11779A615795j6164J33307J00512J16850J46506N7252M9867J1541m9750j60686
$$ 1615795 1599631 1732938 1833450 1950300 2096806 2154058 2203925 2215466 2165716 2005030
11769B005030k26338j43371j65861j64308m6851R0796Q8805q0933j46495j84648
$$ 2005030 1778692 1635321 1469460 1305152 1258301 1349097 1437902 1356969 1210474 1025826
11759A025826j27478j020m2250K110k7197k9390m1346P0193j6360n956R923L3875
$$ 1025826 898348 897328 855078 857188 829991 800601 759255 829448 813088 807132 817055 850930
11747H50930J700m3294l6625L3422k7468l2485J1805K8094j7110n7140J5109M8683
$$ 850930 852630 809336 772711 806133 778665 746180 757985 786079 768969 711829 726938 775621
11735G75621l0594o2020m5467l3529K258l0412K692Q410K867o6840l213M5562
$$ 775621 745027 683007 637540 604011 606269 575857 578549 586959 589826 522986 519773 565335
11723E65335K6243j3541L2553k5019k9002m6126l779p7333L0990J10148l8570
$$ 565335 591578 578037 610590 585571 556569 510443 506664 429331 460321 570469 531899
11712E31899k9078R6308L6950K2107J5542j45863n2358J6037j8892r7654O7923
$$ 531899 502821 599129 636079 658186 673728 527865 475507 491544 472652 374998 442921
11701D42921J9181n1800m0465L1215J7600J10975J30151p4586j2269m5801j0466
$$ 442921 462102 410302 369837 401052 418652 529627 659778 585192 572923 527122 516656
11690E16656K2434J2532k7037j6987J8137p1205r192j2856p1727K338J9751M9601
$$ 516656 539090 551622 524585 507598 525735 454530 445338 432482 360755 363093 382844 432445
11678D32445M5849K2422m9772n4414N1438m2729M4385J17919P3245n8142p5605
$$ 432445 478294 500716 450944 396530 447968 405239 449624 567543 640788 582646 507041
11667E07041l323L7097l5178r355r181k0150M9821j8295J0601p1011j48554M9441
$$ 507041 503718 540815 505637 496282 487101 466951 516772 498477 509078 438067 289513 338954
11655C38954R5244L6781j8092K9095Q3631K7884L671o0091K369n9427o3865N4395
$$ 338954 434198 470979 452887 481982 565613 593497 597168 537077 539446 480019 416154 470549
11643D70549k5226o4105n1911l679l8279J9906M8109m517L1895P320o7636l737
$$ 470549 445323 381218 329307 325628 287349 307255 355364 350847 382742 390062 322426 318689
11631C18689p2185n3224J19450j4748n4961n3768o2190N4415N0756m550p6855
$$ 318689 246504 193280 312730 297982 243021 189253 127063 181478 232234 227684 150829
11620A50829Q6769P1718l2483K0414n6494M777N7573R957k31m1621P987O7641
$$ 150829 237598 309316 276833 297247 240753 245530 303103 313060 312829 271208 279195 346836
11608C46836l8664l2778L9336L8492k6536m7304N8521j2692P5536O7278n9385
$$ 346836 308172 275394 314730 353222 326686 279382 337903 325211 400747 468025 408640
11597D08640n6802o7910K4756O2183n66l4032j7157Q5180L5209K7619q4546l3809
$$ 408640 351838 283928 308684 370867 370301 336269 319112 404292 439501 467120 382574 348765
11585C48765L8127n1814m4633q6124q0845R7639O1192n008J19011K3070J0682
$$ 348765 386892 335078 290445 204321 123476 221115 282307 277299 396310 419380 430062
11574D30062j8642L2452M2480q2208m23N257k1396m6680L5837k466l998o8770
$$ 430062 411420 443872 486352 404144 403721 408978 387582 340902 376739 374273 370275 301505
11562C01505p9303O4926K7403o0897l854l3353O858J10429k6399l4957J29920
$$ 301505 222202 287128 314531 253634 249780 216427 223285 333714 307315 272358 402278
11551D02278O1508j05547n8799R129L6858m1q8940k3021Q2282K9068J805o305
$$ 402278 463786 358239 299440 308569 345427 345386 256446 233425 315707 344775 346580 340275
11539C40275m7269m64n4882m48L7641j0675n082J9950P3526o6346k2837N2084
$$ 340275 293006 292542 237660 237212 274853 264178 259096 279046 352572 286226 263389 315473
11527C15473M6846J4115o6660m4119k4604J19063J9082Q5114p0832j34101n6981
$$ 315473 362319 376434 309774 265655 241051 360114 379196 464310 393478 259377 202396
11516B02396R548Q5108M7363n7971o1760M8173Q0147J4845r1982j08415Q668n8249
$$ 202396 211944 297052 344415 286444 224684 272857 353004 367849 275867 167452 176120 117871
11504A17871l2904O8566P5811N2864N2802J8195l3564j10071q2127J2993J5315
$$ 117871 84967 153533 229344 282208 335010 353205 319641 209570 127443 140436 155751
11493A55751j4008j6769J23960O8889M7035l2217K860J3933K4419L148j02956
$$ 155751 141743 124974 248934 317823 364858 332641 335501 349434 373853 377001 274045
11482B74045j39956k5937j3618L7115N7673o969J1843o1275m6681j7700K8709
$$ 274045 134089 108152 94534 131649 189322 182353 194196 132921 86240 68540 97249
11471I7249L1067K3460K6533J7647l2190p0858P906L980j9543j1388K341k235
$$ 97249 128316 151776 178309 195956 163766 92908 100814 104794 85251 73863 76204 73969
11459G3969O591k0901N454O4236Q634j2628j3493M7413J05826O5662l3408k1425
$$ 73969 80560 59659 65113 129349 137983 125355 111862 159275 265101 330763 297355 275930
11447B75930l4383O2348N7442K9039j66663n870j6556P890m5616k1729L6927O8403
$$ 275930 241547 303895 361337 390376 223713 217843 201287 209177 163561 141832 178759 247162
11435B47162N756n9007j3484O7123n2108k7601M7782O0609L2024j21453p0238
$$ 247162 252918 193911 180427 247550 195442 167841 215623 276232 308256 186803 116565
11424A16565N459M6024n4069L506M7612M6075o6736K4943J04403m9109p6752q639
$$ 116565 122024 168048 113979 117485 165097 211172 144436 169379 273782 224673 147921 139282
11412A39282Q6520O1798R1944o0340m5024k2193J5769o4853L8458M5099m2946
$$ 139282 225802 287600 379544 319204 274180 251987 267756 202903 241361 286460 243514
11401B43514L4221K8198q984q3279q0596j3073K8977N6265l5845K0153N1587J9162
$$ 243514 277735 305933 296949 213670 133074 120001 148978 205243 169398 189551 241138 260300
11389B60300L1695l4672q0127O749k3874M1576R9392r32j14394l6219O9727N6585
$$ 260300 291995 257323 177196 183945 160071 201647 301039 300107 185713 149494 219221 275806
11377B75806j15118P9760J34476K5945n6094n7079M7834j3502K9346K6921J3026
$$ 275806 160688 240448 374924 400869 344775 287696 335530 322028 351374 378295 391321
11366C91321n9693q8635j554o564l6266p5205J1112P606k9987L7949k9588j504
$$ 391321 331628 242993 241439 234875 198609 123404 134516 142122 112135 150084 120496 118992
11354A18992L9492J09596p2125j82397N823J06335L7418m1751O5025j9661m2815
$$ 118992 158484 268080 195955 13558 19381 125716 163134 121383 186408 166747 123932
11343A23932K9860O9843J5232p2204j07710n3929J0104R019P5796L1883N1069
$$ 123932 153792 223635 238867 166663 58953 5024 15128 24147 99943 131826 182895
11332A82895j1855m1583m1436k0349K0233R1793J5288M2451L7496L2374k5451
$$ 182895 171040 129457 88021 67672 87905 179698 194986 237437 274933 307307 281856
11321B81856l5197L6672N1010j16036j13130M0627J27690K258p4979P8383p8L3501
$$ 281856 246659 283331 334341 218305 105175 145802 273492 275750 200771 279154 279076 312577
11309C12577k5016J5430o14l9782J958k2227j6457j6592n4404K3400n5541P1162
$$ 312577 287561 302991 302377 262595 264553 242326 225869 209277 154873 178273 122732 193894
11297A93894k5092m3066n2419R289Q158J02150K9791J9344K8315n8037l3713M7996
$$ 193894 168802 125736 73317 82606 90764 192914 222705 242049 270364 212327 178614 226610
11285B26610Q2305n853j86980j03470O5828P164K0992Q3164J3920o1488j8273
$$ 226610 308915 303062 116082 12612 78440 85604 106596 189760 203680 142192 123919
11274A23919n110m4779J3940j7018m9819p293M6729M8793j8059j00717k4672j9853
$$ 123919 118809 74030 87970 70952 21133 13840 60569 109362 91303 -9414 -34086 -53939
11262e3939N3014J09926N6972k4493M904o8422l7544m3379N3969R7288O0668K3538
$$ -53939 -925 109001 165973 141480 146384 77962 40418 -2961 51008 148296 208964 232502
11250B32502n1625Q6987M2252q6395p423P113j3415K912M2558N2871K594l3877
$$ 232502 180877 267864 310116 223721 216298 223411 209996 212908 255466 308337 310931 277054
11238B77054o9820J374r44N8589J3681J0375j1483j17739P552N6787N0720r5472
$$ 277054 207234 208608 207664 266253 279934 290309 278826 161087 168639 225426 276146 180674
11226A80674J891N7147j17445N39Q1928J3953P5248k1346k0017O6402O6986J1693
$$ 180674 182565 239712 122267 122806 204734 218687 293935 272589 252572 318974 385960 397653
11214C97653K3671r8554r0373n3581m8506N45N2516O7688l5552m3104J418Q3742
$$ 397653 421324 322770 232397 178816 130310 130855 183371 251059 215507 172403 173821 257563
11202B57563l3399k6076J5932K7117m3467p4373k981P777J9914k3406j7672n1785
$$ 257563 224164 198088 214020 241137 197670 123297 120316 128093 148007 124601 106929 55144
11190E5144q658l694L6040P9458J27634k1008n8658k9405o87r0618j00476j4901
$$ 55144 46486 42792 78832 158290 285924 264916 206258 176853 176166 85548 -14928 -29829
11178b9829J28497J33574L9185l0170P8532P4699j17969j89266j7073j7445o4680
$$ -29829 98668 232242 271427 241257 319789 394488 276519 87253 70180 52735 -11945
11167a1945J4887P5840M4604k1736o7928R4681J29552Q227l1328j047o8139j14934
$$ -11945 2942 78782 123386 101650 33722 128403 257955 266182 234854 233807 165668 50734
11155E0734k1550O6847P3460j1306k0183o5120k6189P9987P6164L7617k1855N986
$$ 50734 29184 96031 169491 158185 138002 72882 46693 126680 202844 240461 218606 224592
11143B24592r6835M1611J49455j6329N7605n6517j16480k2271j67n2662K6152
$$ 224592 127757 169368 318823 302494 360099 303582 187102 164831 164664 112002 138154
11132A38154l0127n556K3478k6721o0380M6410P4756L508k5100J0576L1058k0919
$$ 138154 108027 102471 125949 99228 38848 85258 160014 163522 138422 148998 180056 159137
11120A59137K2875J3697o6641M391r386p4557o7017l7662N4372J17644l7284n480
$$ 159137 182012 195709 129068 133459 124073 49516 -17501 -55163 -791 116853 79569 74089
11108G4089l3799q032O5375O7685M7900n5705n8535N9354L3711p5074J0496N5266
$$ 74089 40290 32258 97633 165318 213218 157513 98978 158332 192043 116969 127465 182731
11096A82731j10568k3622M5004J12891o071M8525o0803k8769l2740l0958j4617
$$ 182731 72163 48541 93545 206436 200365 248890 188087 159318 126578 95620 81003
11085H1003K592J09392J05377l3335J1236m0302o0595k9830M3317J7981L3464
$$ 81003 83595 192987 298364 265029 276265 235963 175368 145538 188855 206836 240300
11074B40300p2726k7794R669o6982J0292M5307N9514O1113L429o081o5882l2407
$$ 240300 167574 139780 149449 82467 92759 138066 197580 258693 262122 256041 190159 157752
11062A57752j1802K0252R9478k4922o5568J9556Q5183p1688j5100L2048Q9441
$$ 157752 145950 166202 265680 240758 175190 194746 279929 208241 193141 225189 314630
11051C14630N7552L8523l8024j1006r625J09426M7428m1703p0684k7325M768L1709
$$ 314630 372182 410705 372681 361675 352050 461476 508904 467201 396517 369192 373960 405669
11039D05669L6681J10234J64992J07778M9386O9046M1267M8274j069r6846k4832
$$ 405669 442350 552584 717576 825354 874740 943786 985053 1033327 1032258 935412 910580
11028I10580P169k0960J14974N0934Q167N3947J04826J56718R6829j5391j65274
$$ 910580 917749 896789 1011763 1062697 1070864 1124811 1229637 1386355 1483184 1467793 1302519
11017A302519k07047j45041j59241n4424j6155O3972J56457L7795J8805m7387
$$ 1302519 1095472 950431 791190 736766 720611 784583 941040 978835 997640 950253
11007I50253j21464r6959p9976q6898l8789m7914l9898m8993L2039R8522L8328
$$ 950253 828789 731830 651854 564956 526167 478253 438355 389362 421401 519923 558251
10996E58251k0461J125j11700o8010j2446k4174R749m4549l1711j4671n5918l1415
$$ 558251 537790 538915 427215 359205 346759 322585 332334 287785 256074 241403 185485 154070
10984A54070K4284O5527L5072J04607o3255n5266m750J3102K6889K983j17098
$$ 154070 178354 243881 278953 383560 320305 265039 260289 273391 300280 303263 186165
10973A86165n1401p161K1608M9854J0825l938m9715J04295j1470k3818q1461p9652
$$ 186165 134764 127603 149211 199065 209890 205952 156237 260532 249062 225244 143783 64131
10961F4131O9351K8507O4519O0745M9920r789j29218j9501L7060m2436r3683L6143
$$ 64131 133482 161989 226508 287253 337173 327384 198166 178665 215725 173289 79606 115749
10949A15749j852K7692N7752m0304o2307N8529n7335j9869O1928J09459m2666
$$ 115749 113897 141589 199341 159037 96730 155259 97924 78055 139983 249442 206776
10938B06776R1947Q7513o0360m315O5205J10933K6964j67673j22619o2527M1481
$$ 206776 298723 386236 325876 321561 386766 497699 524663 356990 234371 171844 213325
10927B13325N4989M7447n3748j10075J696M2932k315o5591o8837l2700K0531P8582
$$ 213325 268314 315761 262013 151938 153634 196566 194251 128660 59823 27123 47654 126236
10915A26236l4596L310Q5851M088K9216n4323j27966m1559P9227M0768j7873K7321
$$ 126236 91640 94950 180801 184889 214105 159782 31816 -9743 69484 110252 92379 119700
10903A19700J0523L1256n6461m1543O4449J37569o6365M2161L3223k5319r7273
$$ 119700 130223 161479 105018 63475 127924 265493 199128 241289 274512 249193 151920
10892A51920q603M8124M9305j2353j34437J9371N3473N4941K3165o3818n6224
$$ 151920 143317 191441 240746 228393 93956 113327 166800 221741 244906 181088 124864
10881A24864K0539L2118k0694m428r380L4538R492J0758K5937L9315K6390r4115
$$ 124864 145403 177521 156827 152399 143019 177557 187049 197807 223744 263059 289449 195334
10869A95334P2086N7686j4738K2542k6901n3262k4928p4935l1057J935Q1644J02760
$$ 195334 267420 325106 310368 332910 306009 252747 227819 152884 121827 123762 205406 308166
10857C08166P8375j1606k9801K2735n6344j24141l0899J02890Q9493k672p0849
$$ 308166 386541 374935 345134 367869 311525 187384 156485 259375 348868 346196 275347
10846B75347m8598J22109L1120n5758j54723L4280k8125k2198q859l2161L9291
$$ 275347 226749 348858 379978 324220 169497 203777 175652 153454 144595 112434 151725
10835A51725M4275m5895M1810K0078n9712k762m8651q7476m5440P7711Q443J5215
$$ 151725 196000 150105 191915 211993 152281 149519 100868 13392 -32048 45663 54106 69321
10823F9321m9218M7371L8976Q4454Q5631l1124o0567m6193J3004O6620r4214O603
$$ 69321 20103 67474 106450 190904 276535 245411 184844 138651 151655 218275 124061 130664
10811A30664M2497m63l267p2551k7811M8719M2457P0460J263l5259l1659o2269
$$ 130664 173161 172698 169431 96880 69069 117788 160245 230705 231968 196709 165050 102781
10799A02781n119n67L3692k5434R7676P8764J13238j3245l4087q4849J1050J6891
$$ 102781 97662 97095 130787 105353 203029 281793 395031 381786 347699 262850 273900 290791
10787B90791K3700O1118r7161p6220K2494K3652k7790j67873P12P8458O5257l6846
$$ 290791 314491 375609 278448 202228 224722 248374 220584 52711 53423 131881 197138 160292
10775A60292L4428K0262k8279l6952K3514r037o1335l0880Q6340P5040K3961p5371
$$ 160292 194720 214982 186703 149751 173265 164228 102893 72013 158353 233393 257354 181983
10763A81983j12914Q358R3571m8278o6959J2846J29313J48515j5163n0811R072
$$ 181983 69069 77427 170998 122720 55761 68607 197920 346435 331272 280461 289533
10752B89533K0491K8094p4990k8284R0264O2607o415j94058M6687k5652J4888
$$ 289533 310024 338118 263128 234844 325108 387715 381300 187242 233929 208277 223165
10741B23165J07316L1216p0131M1520k4717k7678l946N4414M119J1738j3961l2785
$$ 223165 330481 361697 291566 333086 308369 280691 276745 331159 335278 347016 333055 300270
10729C00270m5870k9951N7078J4399J15505K0836j5946L5691m7691q311K3256
$$ 300270 254400 224449 281527 295926 411431 432267 416321 452012 404321 396010 419266
10718D19266J1876M7601K9449j20518j70293K5817K8190j05851N3542N9704l0551
$$ 419266 431142 478743 508192 387674 217381 243198 271388 165537 219079 278783 248232
10707B48232P7879J2551o8219j9195K2188N4694M5621m5222o1829M2212J23577
$$ 248232 326111 338662 270443 251248 273436 328130 373751 328529 266700 308912 432489
10696D32489O8023m9969m9792j915J12984k787r0864o8542K460N2458p4525n9887
$$ 432489 500512 450543 400751 398836 511820 509033 418169 349627 352087 404545 330020 270133
10684B70133M8011K6516R9645Q9130K377j04114j8741P3898P1274l8834L9215
$$ 270133 318144 344660 444305 533435 535812 431698 412957 486855 558129 519295 558510
10673E58510K2020J5584O0349n1051p3067P7465J44968k692j883J1612M3521N3114
$$ 558510 580530 596114 656463 605412 532345 609810 754778 752086 750203 761815 805336 858450
10661H58450q222j188j8830J01577J15307J2003k1574M0407L3299K4168R1092
$$ 858450 850228 849040 830210 931787 1047094 1059097 1037523 1077930 1111229 1135397 1226489
10650A226489J99678J03852P4605p252L6553J23862R6529Q1526O4471N5404K42092
$$ 1226489 1426167 1530019 1604624 1597372 1633925 1757787 1854316 1935842 2000313 2055717 2297809
10639B297809J85741J47897K08112M16081M24989L83685M35688M64460M36790
$$ 2297809 2483550 2631447 2839559 3255640 3680629 4064314 4500002 4964462 5401252
10630E401252M84371M08591M17029P23114Q99437J020856J403629J836270K655346
$$ 5401252 5885623 6294214 6711243 7434357 8333794 9354650 10758279 12594549 15249895
10621A5249895L584398M762441O254343P703514R038172R557040Q511569N493920
$$ 15249895 18834293 23596734 29851077 37554591 46592763 56149803 64661372 70155292
10613G0155292J739226j220083k011125j026745J392630N042096R300279J3740479
$$ 70155292 71894518 70674435 68663310 67636565 69029195 74071291 83371570 97112049
10605I7112049J7485650J8682943J5213516O853241k881163r636581j1253227
$$ 97112049 114597699 133280642 148494158 155347399 152466236 142829655 131576428
10598A31576428q210206k686575L835317J0575459J7119067K1784340K2128615
$$ 131576428 123366222 120679647 124514964 135090423 152209490 173993830 196122445
10591A96122445J5422398K062265j2216237k1255115k2596373j8409331j1764156
$$ 196122445 211544843 213607108 201390871 180135756 157539383 139130052 127365896
10584A27365896m805324J592511P083146J0454163J0070031M916490m317224j3442727
$$ 127365896 122560572 124153083 131236229 141690392 151760423 156676913 152359689 138916962
10576A38916962j8400084j8157644j4736751j0074148n742654k037759O10596
$$ 138916962 120516878 102359234 87622483 77548335 71805681 69767922 70378518
10569G0378518J893574J494768r88422m674255p944167r570463r555765q232977
$$ 70378518 72272092 73766860 72778438 68104183 60160016 50589553 41033788 32800811
10561C2800811o438771m875552l737420k827866k183887j671370j369317j055820
$$ 32800811 26362040 21486488 17749068 14921202 12737315 11065945 9696628 8640808
10553H640808q55606o93151o56808o03892m85927l71685l55180l23057k61495
$$ 8640808 7785202 7092051 6435243 5831351 5345424 4973739 4618559 4295502 4034007
10544D034007k94110k64852k09510j54037q5981j12939k51881j87375j11942j05954
$$ 4034007 3739897 3475045 3265535 3111498 3025517 2912578 2660697 2473322 2361380 2255426
10534B255426r3941k4486m5484k8330j01649m2417R497o2453j01871j33117n9828
$$ 2255426 2161485 2136999 2091515 2063185 1961536 1919119 1928616 1866163 1764292 1631175 1571347
10523A571347j2735j7383O494m9968r3152p2900o6818M918k0547n4243k9198j08364
$$ 1571347 1558612 1541229 1547723 1497755 1404603 1331703 1264885 1269803 1249256 1195013 1165815 1057451
10511A057451m1550K9932j6278m3966o6798J6206Q8735N8200j09907p612o942
$$ 1057451 1015901 1045833 1029555 985589 918791 934997 1023732 1081932 972025 964413 957471
10500I57471k4927M7582J5906k4354r2502j1844Q4914o1937q0844J7731M4909
$$ 957471 932544 980126 996032 971678 879176 867332 952246 890309 809465 827196 872105
10489H72105J7489j64659j08713Q2104J14396J6814Q8313m4641k2942n834k616
$$ 872105 889594 724935 616222 698326 812722 829536 917849 873208 850266 844432 841816
10478H41816O618N850L172K4987j603n6913r7703O5077L4676p03O0188P1514k4751
$$ 841816 848434 854284 857456 882443 880840 823927 726224 791301 825977 825274 885462 956976 932225
10465I32225m8868j09535n9312j13967l4447N7842k8757o7966q2947J2433l562
$$ 932225 883357 773822 714510 600543 566096 623938 595181 527215 444268 456701 453139
10454D53139L4346q9387j35297p062P8021j0185M9723J673P006Q0949j03869n5362
$$ 453139 487485 398098 262801 255739 333760 323575 373298 374971 381977 462926 359057 303695
10442C03695O7419K2192n7962j30582K341N8487N6599K7299k1525J2193K2705
$$ 303695 371114 393306 335344 204762 207103 265590 322189 349488 327963 340156 362861
10431C62861o0656L6975K2958j07791L879J34138L4518n1705n66p4256j5755P6409
$$ 362861 302205 339180 362138 254347 258226 392364 426882 375177 374611 300355 284600 361009
10419C61009j00517Q679J03240m063q6116n3599k168k6732N2708J2516j77033
$$ 361009 260492 269171 372411 368348 282232 228633 226465 199733 252441 264957 87924
10408H7924r2637N3756k1504J2547J10804J00841J3436m7640k7827J32605l9879
$$ 87924 -4713 49043 27539 40086 150890 251731 265167 217527 189700 322305 282426
10397B82426j14053j51042K5976K34265K8441q2488j6155P1281j2399o4622j7688
$$ 282426 168373 17331 43307 277572 306013 223525 207370 278651 266252 201630 183942
10386A83942R1289K1966j30610r7358N911N7000R125q209M633k7626K5864L1480
$$ 183942 275231 297197 166587 69229 75140 132140 141265 133056 137689 110063 135927 167407
10374A67407P3k1749Q3512J7832o781j07867N7922M0410o9466J8872M4338p0593
$$ 167407 167480 145731 229243 247075 240294 132427 190349 230759 161293 180165 224503 153910
10362A53910N346N0973l8193n9456L5525M2504J0997J6231m0995R3996L051m0566
$$ 153910 159256 210229 172036 112580 148105 190609 201606 217837 176842 270838 273889 233323
10350B33323M1830L9423l3583L5006J5202k6095L1368k0292L9296j48814j11039
$$ 233323 275153 314576 280993 315999 331201 305106 336474 316182 355478 206664 95625
10339I5625N2362N4605j6575l8546K2207P480k1427J24523k692j39572n4677K5299
$$ 95625 147987 202592 186017 147471 169678 177158 155731 280254 277562 137990 83313 108612
10327A08612N4521P765K8521J4941M771j3669J9226o4535p384l0766M3586l1276
$$ 108612 163133 170898 199419 214360 219131 205462 224688 160153 152769 122003 165589 134313
10315A34313j15619j5852N9990k5661j3495n409R4350m356O390J7063J39746K0675
$$ 134313 18694 2842 62832 37171 23676 18267 112617 108261 114651 131714 271460 292135
10303B92135o0395j873L9693p893q9690o5475J5245K5902n2361j4380J28707K2054
$$ 292135 231740 229867 269560 261667 171977 106502 121747 147649 95288 80908 209615 231669
10291B31669r7389r82m089K3324M3258Q676m3359m8312J2820M1322k3073N8021
$$ 231669 134280 133298 129209 152533 195791 204467 161108 112796 125616 166938 143865 201886
10279B01886m2198j1644o8894j04700J6766R4851O7231m0673L7124N927P6439
$$ 201886 159688 148044 79150 -25550 -8784 86067 153298 112625 149749 155676 232115
10268B32115p3979q0996O9304m6587j07621j2467m2644j5923K2302J7156K3102
$$ 232115 158136 77140 146444 99857 -7764 -20231 -62875 -78798 -56496 -39340 -16238
10257a6238M6948K8385n5777K72P9199j6049L8204M2303l3124n8539J2209J20412
$$ -16238 30710 59095 3318 3590 82789 66740 104944 147247 114123 55584 67793 188205
10245A88205k6203k9634J3692j752R9190j8207j14600q6645J7479L293K7456K9924
$$ 188205 162002 132368 146060 144308 243498 225291 110691 24046 41525 44818 72274 102198
10233A02198j3962r1534k7607O1913O233O4483l9215r5562k8259j6840J5564J7106
$$ 102198 88236 -3298 -30905 31008 37241 101724 62509 -33053 -61312 -78152 -62588 -45482
10221d5482j4451Q8527J3574j5965P828J022l3835P3226L1446n4547J46K4647
$$ -45482 -59933 28594 42168 26203 34031 35053 1218 74444 105890 51343 51489 76136
10209G6136Q6836M5754k4915k6592n7150j1378O3524N566k0306l5830n6386l568
$$ 76136 162972 208726 183811 157219 100069 88691 152215 157781 137475 101645 45259 41691
10197D1691j6975r4007J2693p645l1018M2911L6056j7835J6394O9259N9970J4361
$$ 41691 24716 -69291 -56598 -64243 -95261 -52350 -16294 -34129 -17735 51524 111494 125855
10185A25855L9964l2338J5095J17241R7751R5885J10443n2476j7249L2354k5206
$$ 125855 165819 133481 148576 265817 363568 459453 569896 517420 500171 532525 507319
10174E07319k7218m9371K9049P0584R3429J21103J10246Q242L4087K0006n5339
$$ 507319 480101 430730 459779 530363 623792 744895 855141 863383 897470 917476 862137
10163H62137j50738j1476M3569K7423P2073O9444K9074N1892J05870O6754l150
$$ 862137 711399 699923 743492 770915 842988 912432 941506 993398 1099268 1166022 1162872
10152A162872M0326j42036k21394q3035n1418k4910Q4059J97545O990q2935N8598
$$ 1162872 1203198 1061162 839768 756733 705315 680405 764464 962009 968999 886064 944662
10141I44662J30207j39505l08542j71149j34789k0501J25188O5441m8123k1956
$$ 944662 1074869 935364 626822 455673 320884 300383 425571 491012 442889 420933
10131D20933j50234n167K3003l3546M738k9825j08947k8594k1813J4689k1908
$$ 420933 270699 265532 288535 254989 259727 229902 120955 92361 70548 85237 63329
10120F3329M1508M7163N284M5121K1897n1580J8974J9411l5015m0560l3406L5276
$$ 63329 104837 152000 157284 202405 224302 172722 191696 211107 176092 135532 102126 137402
10108A37402K21L3821J13792P955q7438r2283l2238k7012p5884O8447o557N0487
$$ 137402 137623 171444 285236 293191 205753 113470 81232 54220 -21664 46783 40226 90713
10096I0713J1232l1602n4432J7724K5447o9695J5171J24602N9209o4399q1655
$$ 90713 101945 70343 15911 33635 59082 -10613 4558 129160 188369 123970 42315
10085D2315K3452K6452P9211l6858M654j8221m5483m9776l7002L7034J908l6424
$$ 42315 65767 92219 171430 134572 139226 121005 75522 25746 -11256 25778 27686 -8738
10073h738q2615N9580J05347K4239p1674q3063m5315j5075K2457Q5472Q9791K7970
$$ -8738 -91353 -31773 73574 97813 26139 -56924 -102239 -117314 -94857 -9385 80406 108376
10061A08376j32716k5546R843p8827Q884J47843Q0835l8978m3953L1950K6824
$$ 108376 -24340 -49886 -40043 -118870 -109986 37857 118692 79714 35761 67711 94535
10050I4535O5431M2461o1016o5532q7489K5420J35156P3558m1838j32241q2668
$$ 94535 159966 202427 141411 75879 -11610 13810 148966 222524 180686 48445 -34223
10039c4223q4235k4094L851O7949J82483J50007l1474o8957j7876P7887m8858
$$ -34223 -118458 -142552 -138701 -70752 111731 261738 230264 161307 143431 221318 172460
10028A72460j56024j2962O270L9100k5922j5142m0933k3459P3014m5792K4966
$$ 172460 16436 3474 9744 48844 22922 7780 -33153 -56612 16402 -29390 -4424
10017d424N2723J05728J9054l3504j5884j172k822p4896p6978m9132K6808o1630
$$ -4424 48299 154027 173081 139577 123693 122521 119699 44803 -32175 -81307 -54499 -116129
10005a16129k4093P2937J20491M4355j08648q0138J277J8730p260k502N8746Q5140
$$ -116129 -140222 -67285 53206 97561 -11087 -91225 -89948 -71218 -78478 -80980 -22234 62906
9993F2906M5847M505M7281N7346k049j19466j22484n815L5233J4367j30872j4978
$$ 62906 108753 113258 160539 217885 215836 96370 -26114 -31929 3304 17671 -113201 -128179
9981a28179J76955K8108p6385k3878J9632N1343L2495K1590M4772M2741j0531
$$ -128179 48776 76884 499 -23379 -3747 47596 80091 101681 146453 189194 178663
9970A78663m4050k8368O2123j03792o2625M6583j9794p4575N3360J0810m9325
$$ 178663 134613 106245 168368 64576 1951 48534 28740 -45835 7525 18335 -30990
9959c0990L3616N6870l4390k8244q928K8577K4277J8785O1948j5799q3714j0622
$$ -30990 2626 59496 25106 -3138 -12066 16511 40788 59573 121521 105722 22008 11386
9947A1386K6274J29839J3150r0166L573n4799j06052L7004L5369K5775p3592O2512
$$ 11386 37660 167499 180649 90483 94056 39257 -66795 -29791 5578 31353 -42239 20273
9935B0273k7494q4835M3744J08974N2208q8454p0177N5338P5544O1802M500l6639
$$ 20273 -7221 -92056 -48312 60662 112870 24416 -45761 9577 85121 146923 151423 114784
9923A14784l6193N0409j1587o4108M8880j3226k9472R1609o6800j7687j8415n9639
$$ 114784 78591 129000 117413 53305 102185 88959 59487 151096 84296 66609 48194 -11445
9911a1445L2097k4098L3011n3912K2125J07634n3617q644O734P4586j2194o2646
$$ -11445 20652 -3446 29565 -24347 -2222 105412 51795 43151 49885 124471 112277 49631
9899D9631k8296r339o228N3320L7460R923k7309o9196j11832K9344J16731M4516
$$ 49631 21335 11996 5768 59088 96548 106471 79162 9966 -101866 -72522 44209 88725
9887H8725j0187O203p3205k2372j0068k4639L8369J5142l8189P9996J17215m3580
$$ 88725 78538 84741 11536 -10836 -20904 -45543 -7174 7968 -30221 49775 166990 123410
9875A23410q7203m1013K1886j6862Q900M2757k7091q99O7978M9045p8858j31826
$$ 123410 36207 -4806 17080 218 9118 51875 24784 23885 91863 140908 62050 -69776
9863f9776m8512J7737K6057J26341K5933l1303J4712R7038J7343n1649j40192
$$ -69776 -118288 -100551 -74494 51847 77780 46477 61189 158227 175570 123921 -16271
9852a6271J2588M4070L8074P4069J0719j28698p7082n9329K0859O0366O034k6923
$$ -16271 -3683 40387 78461 152530 163249 34551 -42531 -101860 -81001 -20635 -14601 -41524
9840d1524P4748O8980R85M537m8427N8403K5907M5404n5136j09574J6006P5091
$$ -41524 33224 102204 103189 107726 59299 117702 143609 189013 133877 24303 40309 115400
9828A15400L7786q816P722j4358k5337p6391p0057K1737K2414P4783n8695j9597
$$ 115400 153186 144370 152092 137734 112397 36006 -34051 -12314 10100 84883 26188 6591
9816F591L0742M9675k5569j3250N0401j09221k3218k1035n3038o3604L6508J2893
$$ 6591 37333 87008 61439 48189 98590 -10631 -33849 -54884 -107922 -171526 -135018 -122125
9804a22125M1669Q5377l4308q8095K6538L7935L0765j8623L8184R6289K6301n3284
$$ -122125 -80456 4921 -29387 -117482 -90944 -53009 -22244 -40867 -2683 93606 119907 66623
9792F6623n5154J3900l0265M1394L8960M3837l6242N8326N3654l5293o283o0724
$$ 66623 11469 25369 -4896 36498 75458 119295 83053 141379 195033 159740 153457 92733
9780I2733j30323o6408R2654Q0044N3951l5563q5586l6222m5839m9895L0433J38464
$$ 92733 -37590 -103998 -11344 68700 122651 87088 1502 -34720 -80559 -130454 -100021 38443
9768C8443M2115m6129Q4908M3749j85756J8160L1054j5792n8312j3362l5586O533
$$ 38443 80558 34429 119337 163086 -22670 -4510 26544 10752 -47560 -60922 -96508 -89975
9756h9975p367N76Q9060k4284L1131J3822j665o1226N6383J03715J0604p7332
$$ -89975 -97342 -96766 -7706 -31990 -859 12963 11298 -49928 6455 110170 120774 43442
9744D3442j04131m0896L9675J16553J1779o6426r4609k8755L3243L019j5070j7245
$$ 43442 -60689 -101585 -61910 54643 66422 -4 -94613 -123368 -90125 -87106 -102176 -119421
9732a19421o0583L023K8612J44502J09275j3165q8100m2726o0339l3410J7726
$$ -119421 -180004 -176981 -148369 -3867 105408 92243 4143 -38583 -98922 -132332 -114606
9721a14606O7952J02431P6399Q474j13533L7115j8828q2827j0821J469n659m5043
$$ -114606 -46654 55777 132176 140650 27117 64232 45404 -37423 -48244 -46775 -52434 -97477
9709i7477L823J01507J03838n5894k3903j695j7092j0474j4333O3817n9504J2188
$$ -97477 -93654 7853 111691 55797 31894 30199 13107 2633 -11700 52117 -7387 4801
9697D801O2806R9229j19245j85906k6425J28379R3717q5416j6006Q8946k276q3091
$$ 4801 67607 166836 47591 -138315 -164740 -36361 57356 -28060 -44066 44880 42604 -40487
9685d0487k7264o9183m9661J02422N9133L8875o8952j36082j8783J22710J77909
$$ -40487 -67751 -136934 -186595 -84173 -25040 13835 -55117 -191199 -209982 -87272 90637
9674I0637R8133M2969J5309j32912o9646k160J14358O2951k9356q4505j9892N5979
$$ 90637 188770 231739 247048 114136 44490 42330 156688 219639 190283 105778 85886 141865
9662A41865m4924l0873l5472r8328M2584L0938J2501M8397L9050J26404K87641
$$ 141865 96941 66068 30596 -67732 -25148 5790 18291 66688 105738 232142 519783
9651E19783K81142K44804N6916j30979j67395l67348k68732j18445m2950O860
$$ 519783 800925 1045729 1102645 971666 804271 436923 168191 49746 6796 13656
9641A3656K867L8638L8195j3761n7093k9167k3630R7657j6206j12338P2242L5427
$$ 13656 16523 55161 93356 79595 22502 -6665 -30295 67362 51156 -61182 11060 46487
9629D6487p8898k2634J15463K718j02378n6357l9334L3528j2595J27258P8477
$$ 46487 -32411 -55045 60418 63136 -39242 -95599 -134933 -101405 -114000 13258 91735
9618I1735N7816K7561l8157j01239p2029k8524k5011j1597o7743l1119M3804O0962
$$ 91735 149551 177112 138955 37716 -34313 -62837 -87848 -99445 -167188 -198307 -154503 -93541
9606i3541M8702q707r356O6115L7019O6061K3972p726m9073K032K014q5833M5312
$$ -93541 -44839 -53546 -62902 3213 40232 106293 130265 122539 73466 75498 77512 -8321 36991
9593C6991P7954m0437L1833l3541j548L7674k7645m5545m0661m0110k3223j1574
$$ 36991 114945 74508 106341 72800 71252 108926 81281 35736 -4925 -45035 -68258 -79832
9581g9832Q46J41073R1945o9747r6614J7012K062p0755k4076J4956K6967m7001
$$ -79832 -78986 62087 154032 84285 -12329 4683 6745 -64010 -88086 -73130 -46163 -93164
9569i3164R5046J08314j40389j03054O5553K6400n483j6843K4765Q9686P0605
$$ -93164 1882 110196 -30193 -133247 -67694 -41294 -46777 -63620 -38855 50831 121436
9558A21436p1746q2857l4212l1630O4675N8634j0037q377o0703n5610k9294J16768
$$ 121436 49690 -33167 -67379 -99009 -34334 24300 14263 5886 -54817 -110427 -139721 -22953
9546b2953M9321N2437q1309n3297J01244p62l4126m8987K1594R9947Q7050L2809
$$ -22953 26368 78805 -2504 -55801 45443 44681 10555 -38432 -16838 83109 170159 202968
9534B02968r2203k6467k0054r7303j9919L5636K9149K1283L0764M4254q623k6142
$$ 202968 110765 84298 64244 -33059 -52978 -17342 11807 33090 63854 108108 99485 73343
9522G3343l3112J2145j0226m4436p4411j2408K172m9127m0770O0266M5146L8118
$$ 73343 40231 52376 42150 -2286 -76697 -89105 -86933 -136060 -176830 -116564 -71418 -33300
9510c3300m1686k7897k093M2838J7252m5430L057l2318K3489P1510M2076L27j7676
$$ -33300 -74986 -102883 -104976 -62138 -44886 -90316 -87259 -119577 -96088 -24578 17498 17825 149
9497A49n6013j696K63j5485k7209M7167o7217j3218O2664k0366K6726k2779L5691
$$ 149 -55864 -57560 -57297 -72782 -99991 -52824 -120041 -133259 -70595 -90961 -64235 -87014 -51323
9484e1323O949N9884O7383P8570r8224j09684L8531J56702j6748o4866J8736m2233
$$ -51323 -44374 15510 82893 161463 63239 -46445 -7914 148788 132040 67174 85910 43677
9472D3677K3825J02193p6483o7874j9999K0816J3531q596m3369J3831R1133P599
$$ 43677 67502 169695 93212 25338 5339 26155 39686 31090 -12279 1552 92685 100284
9460A00284j45980J9175j8759l6631Q1086J8644l1291Q6348j7489J0894p770l1697
$$ 100284 -45696 -26521 -45280 -81911 -825 17819 -13472 72876 55387 66281 58511 26814
9448B6814J6167m9252K1967l8763k2434o90J5158p7272j09917J25248J14296m9990
$$ 26814 42981 -6271 15696 -23067 -45501 -46191 -31033 -108305 -218222 -92974 21322 -28668
9436b8668k8585P841J49379j07597o4377P8953O8966K5093M0738l6319p8054p7602
$$ -28668 -57253 -49412 99967 -7630 -72007 6946 75912 101005 141743 105424 27370 -50232
9424e0232m1671r882n4761P869J67579O168O4745j8708k9494O4910J7533r3254
$$ -50232 -91903 -101785 -156546 -148677 18902 25070 89815 71107 41613 106523 124056 30802
9412C0802j7188O8292n4478q0057k4223J4180K3248J03n9414n470Q8322P5333
$$ 30802 13614 81906 27428 -52629 -76852 -62672 -39424 -39321 -98735 -104205 -15883 59450
9400E9450Q5629N224j8658k2508N621P572l9798R529J457J514N9573j337p6127
$$ 59450 145079 150303 131645 109137 114758 122330 82532 92061 93518 95032 154605 153268 77141
9387G7141j23333P272k9064k3923p9278J35394K20098M0998k1847n1123k6566
$$ 77141 -46192 -38920 -67984 -91907 -171185 -35791 184307 225305 203458 152335 125769
9376A25769o0300k0716P3348N2383P863j23240j08486J6781J86m9096o590J8417
$$ 125769 65469 44753 118101 170484 178347 55107 -53379 -36598 -36412 -85508 -92098 -73681
9364g3681M4339j3566j0073M3605J5292K7656M5357L776m5549j45520m6053N9054
$$ -73681 -29342 -42908 -52981 -9376 5916 33572 78929 82705 37156 -108364 -154417 -95363
9352i5363R717k7215k4841P934R9866K9237q1457K4719R6344M3853j00412k0078
$$ -95363 -85646 -112861 -137702 -129768 -29902 -665 -82122 -57403 38941 82794 -17618 -37696
9340c7696j710J06495Q1705M5061j4770j24776J8310k4455j08158j10652k1835
$$ -37696 -39406 67089 148794 193855 179085 54309 72619 48164 -59994 -170646 -192481
9329a92481J58203O9103k8167k2549J4422J4641k9456J42N1430M2502J2627m5500
$$ -192481 -34278 34825 6658 -15891 -1469 13172 -16284 -16142 35288 77790 90417 44917
9317D4917L348J846l6331m290k8704J4986L8561K6875O059o4857K6379M9991m3128
$$ 44917 48265 50111 13780 9490 -19214 -4228 34333 61208 67267 2410 28789 78780 35652
9304C5652P107m5835L4891J2307l1376J53185K9824o4274K8636l2714L900P125
$$ 35652 42759 -3076 31815 44122 12746 165931 195755 131481 160117 127403 131303 138428
9292A38428k1595k2702N7276N8231o6520j9824q5739P686j16545l4162P7573k2909
$$ 138428 116833 94131 151407 209638 143118 123294 37555 45241 -71304 -105466 -27893 -50802
9280e0802m028J513L4447L5907p9797j804J25027J0443k2083K2793J1633p0757
$$ -50802 -54830 -53317 -18870 17037 -62760 -64564 60463 70906 48823 71616 83249 12492
9268A2492K0943L2256J06085J3689n5259j45733J8225L9132J36897M5868O9937
$$ 12492 33435 65691 171776 185465 130206 -15527 2698 41830 178727 224595 294532
9257B94532j5199j59059n9348L1396l9882K2907k7308n8345q1497M208J07606
$$ 294532 279333 120274 60926 92322 52440 75347 48039 -10306 -91803 -87595 20011
9246B0011J18048M4135j149j27178m2209J01734P2102k875o6872l1339l3821p4591
$$ 20011 138059 182194 181045 53867 11658 113392 185494 182619 115747 84408 50587 -24004
9234b4004k6492M5445l1767l2853l7502k8779O4029L3896m995N3471M3487L9121
$$ -24004 -50496 -5051 -36818 -69671 -107173 -135952 -71923 -38027 -43022 10449 53936 93057
9222I3057J3783r931j0557q6405L6426k6683Q903r1090l8273M0550K020l9496
$$ 93057 106840 96909 86352 -53 36373 9690 18593 -72497 -110770 -70220 -68200 -107696
9210a07696j7718l4669L1723N7381K5542K0206P6733J9711m9589p8999l5689L3421
$$ -107696 -125414 -160083 -128360 -70979 -45437 -25231 51502 71213 21624 -57375 -93064 -59643
9198e9643L1983M2204P9689n0554p7334J8529J6366k7785p3486J01674M8766p910
$$ -59643 -27660 14544 94233 43679 -33655 -15126 1240 -26545 -100031 1643 50409 42499
9186D2499j9808m0461N9473k0356n0378m121l89J0744q33P1630J7808o4792p1835
$$ 42499 22691 -17770 41703 21347 -29031 -33152 -33541 -22797 -23630 48000 65808 1016 -70819
9173g0819P8731J4323j40196q4854J7291J0753j2838P6492J07626K7573k6997
$$ -70819 7912 22235 -117961 -202815 -185524 -174771 -187609 -111117 -3491 24082 -2915
9162b915L5026J4264p9146l5138n2005l6448k5635M8037m0572K0417P5387P5057
$$ -2915 32111 46375 -32771 -67909 -119914 -156362 -181997 -133960 -174532 -154115 -78728 -3671
9150c671P4010j6975q9313j21799j663M3248O3724M3471J3922m9903j8229J3805
$$ -3671 70339 53364 -35949 -157748 -159411 -116163 -52439 -8968 4954 -44949 -63178 -49373
9138d9373M2506M8138L9011L2451n7899r8220L7236L5208l5547J1612J8506n9194
$$ -49373 -6867 41271 80282 112733 54834 -43386 -6150 29058 -6489 5123 23629 -35565
9126c5565L1193J3104j6330K8221Q8559O3250J2636m8146o7479P2430m9466k8224
$$ -35565 -4372 8732 -7598 20623 109182 172432 185068 136922 69443 141873 92407 64183
9114F4183q5659N036n6040K8342L946j408N6096j20736n5977J2457J1269Q2653
$$ 64183 -21476 -16440 -72480 -44138 -40192 -41600 14496 -106240 -162217 -149760 -138491 -55838
9102e5838o2561Q6354Q0849j6666J7653R2899K3646l7950j01132p3618M8094Q030
$$ -55838 -118399 -32045 48804 32138 49791 142690 166336 128386 27254 -46364 1730 9760
9090I760j11268q324K0605o4497K5145O3130R9533R4787j4799q719j3635J10353
$$ 9760 -101508 -109832 -89227 -153724 -128579 -65449 34084 128871 114072 105353 91718 202071
9078B02071m2530n7659k9387l6611p0527q5373P6399O5234O8001J6887k4448n9772
$$ 202071 159541 101882 72495 35884 -34643 -120016 -43617 21617 89618 106505 82057 22285
9066B2285p09N1547l451P471O5102n0358M8342N4049l1314k2286q072j8025l7841
$$ 22285 21576 73123 69672 77143 142245 91887 140229 194278 162964 140678 132606 114581 76740
9053G6740p7086p4275m3879O5813P3428M1251M1142K0495J5911R198N002O7300
$$ 76740 -346 -74621 -118500 -52687 20741 61992 103134 123629 139540 148738 153740 221040
9041B21040o0643l1046r7060l7009M3276K5442l4193J0543l3385j32251j0352
$$ 221040 160397 129351 32291 -4718 38558 64000 29807 40350 6965 -125286 -135638
9030a35638N7151J6247J2271m8983Q9765O0103j9994K3683m9418q4269J23112
$$ -135638 -78487 -62240 -49969 -98952 -9187 50916 30922 54605 5187 -79082 44030
9019D4030o827m0774j6885l8553J3570N4018n9571k8918N4521J3316K5728K6941
$$ 44030 37203 -3571 -20456 -59009 -45439 8579 -50992 -79910 -25389 -12073 13655 40596
9007D0596k7509r411J4899M3034M1920N5193n1912l4436R85n0122o2743n6823
$$ 40596 13087 3676 18575 61609 103529 158722 106810 72374 73359 23237 -39506 -96329
8995i6329l0355m6205l9655O5234L0630k4682M487J09108J14355N9579K9143j46283
$$ -96329 -126684 -172889 -212544 -147310 -116680 -141362 -136875 -27767 86588 146167 175310 29027
8983B9027n9212M1830J7918r9554p5887N1748N3424K5456J01564N7208j14914
$$ 29027 -30185 11645 29563 -69991 -145878 -94130 -40706 -15250 86314 143522 28608
8972B8608m1635q932K1067N0777N174m3775q3249l95Q1457Q2726o6598k9117Q899
$$ 28608 -13027 -21959 -892 49885 55059 11284 -71965 -72360 9097 91823 25225 -3892 5007
8959E007Q2410j07334p5964n4484r260R8928P8646N6237p5987j25367L7914J88883
$$ 5007 87417 -19917 -95881 -150365 -159625 -60697 17949 74186 -1801 -127168 -89254 99629
8947I9629j5973j17898K0139L6119N6247n7268J7508k0739n1678L3179N5148K0037
$$ 99629 83656 -34242 -14103 22016 78263 20995 38503 17764 -33914 -735 54413 74450
8935G4450m0977j04328q0083j389J23390J06815k6099m8315k2461o6804P048P1924
$$ 74450 33473 -70855 -150938 -152327 -28937 77878 51779 3464 -18997 -85801 -78753 -6829
8923f829k785j5490J7448j4884J15096j7052j6257j6309n9964o172l5281K2969
$$ -6829 -9614 -25104 -7656 -22540 92556 75504 59247 42938 -17026 -23198 -58479 -35510
8911c5510L2843J25922J1114Q601r0343K5105j4249n1596l5364l22k1705N2176
$$ -35510 -2667 123255 134369 142970 52627 77732 63483 11887 -23477 -23799 -45504 6672
8899F672J22350J3719k7514J0936K0766q4273J7843K4058k8251R631M5089p0957
$$ 6672 129022 142741 115227 126163 146929 62656 80499 104557 76306 85937 131026 60069
8887F0069p4076r432N2165Q763l4945l363n3001l0873O6558K5752n1617L3398
$$ 60069 -14007 -23439 28726 37489 2544 -819 -53820 -84693 -18135 7617 -44000 -10602
8875a0602Q7340J44530M6213m2019p1009j55765j0065L3763L2275l901m2137q0172
$$ -10602 76738 221268 267481 225462 154453 -1312 -11377 22386 54661 50760 8623 -71549
8863g1549L5153m4906k0710N5160Q0632L3881n549k6562K6748k7151j9849j06261
$$ -71549 -36396 -81302 -102012 -46852 33780 67661 62112 35550 62298 35147 15298 -90963
8851i0963L8985Q1449n6059l8576k4538o212R1406J23471P1191q6760k881J1766
$$ -90963 -51978 29471 -26588 -65164 -89702 -95914 -4508 118963 190154 103394 100513 112279
8839A12279l6917k8779R8046k8783j03336L7122k7327J8319m2719j3872j8990
$$ 112279 75362 46583 144629 115846 12510 49632 22305 40624 -2095 -15967 -34957
8828c4957n9143k0556J2272J7808l2658J5565J02866O9608n7753k8724M1761j4517
$$ -34957 -94100 -114656 -102384 -84576 -117234 -101669 1197 70805 13052 -15672 26089 11572
8816A1572q2260L772Q7663L2707j6631q9418m4892K2842J9977J5504P5554L0235
$$ 11572 -70688 -66916 20747 53454 36823 -52595 -97487 -74645 -54668 -39164 36390 66625
8804F6625k4934m8080l6581O2852J05778n7623p9763j02062J1597L3021K9727
$$ 66625 41691 -6389 -42970 19882 125660 68037 -11726 -113788 -102191 -69170 -39443
8793c9443j2359q391L4630N2702m7752p5198n0014p5903P1717J44149p9838m1757
$$ -39443 -51802 -60193 -25563 27139 -20613 -95811 -145825 -221728 -150011 -5862 -85700 -127457
8781a27457m9515j2481K09819J13524j18296j20160n8988J32968Q0721l4251M9711
$$ -127457 -176972 -189453 20366 133890 15594 -104566 -163554 -30586 50135 15884 65595
8770F5595r3238K8784P2294j4337l7569o6867J040P739K6534o6485K1087K6015
$$ 65595 -27643 1141 73435 59098 21529 -45338 -44298 -36559 -10025 -76510 -55423 -29408
8758b9408M0559l7768M7756O4630p8531j17110L0558k9925R1120J82786Q419q2586
$$ -29408 11151 -26617 21139 85769 7238 -109872 -79314 -109239 -18119 164667 173086 90500
8746I0500j07167J0713M6311P5823j9959r6884j5581j922J0909j6915l8689M2748
$$ 90500 -16667 -5954 40357 116180 96221 -663 -16244 -18166 -7257 -24172 -62861 -20113
8734b0113J9298L444M933K1273N3352M3493m8966m8696k4300k2620Q8659O3283
$$ -20113 -815 2629 7562 28835 82187 125680 76714 28018 3718 -18902 69757 133040
8722A33040k9728p2030q941q3476n7399q448m2252J23838L8959N3109N2620K3719
$$ 133040 103312 31282 22341 -61135 -118534 -126982 -169234 -45396 -6437 46672 99292 123011
8710A23011q0464K1305p1501n8743j9482p9133o7656q940L3033M7404N2264J6271
$$ 123011 42547 63852 -7649 -66392 -85874 -165007 -232663 -241603 -208570 -161166 -108902 -92631
8698i2631j4101R9269N1357l5302P1379M35q0792j14806L4023P6020R383l4956
$$ -92631 -106732 -7463 43894 8592 79971 80406 -386 -115192 -81169 -5149 4234 -30722
8686c0722r154o712J10160m0272m37J4167r7424o8345j4423j6799k7247N9919
$$ -30722 -39876 -46588 63572 23300 22863 37030 -60394 -128739 -143162 -159961 -187208 -127289
8674a27289k2898J1405J04067Q0711M9312n5057M0410J5362j09166k5687J1580
$$ -127289 -150187 -138782 -34715 45996 95308 40251 80661 96023 -13143 -38830 -27250
8663b7250K1816L4522n1618Q295J8300O6307P4065L4273j3101j1603m0765n5140
$$ -27250 -5434 29088 -22530 -14235 4065 70372 144437 178710 165609 154006 113241 58101
8651E8101l2789L3623j74143q407L1594M4088Q1750K7709l6903o7397m2659K6051
$$ 58101 25312 58935 -115208 -123615 -92021 -47933 33817 61526 24623 -42774 -85433 -59382
8639e9382L6654o2461m9796L8321o126L9090R6134R9160J1742K1832n0834R465
$$ -59382 -22728 -85189 -134985 -96664 -102790 -63700 32434 131594 143336 165168 114334 123799
8627A23799k4970m7213M3813m8062J5659J6927j3266Q9514N4473r2264o2909l4623
$$ 123799 98829 51616 95429 47367 63026 79953 66687 156201 210674 118410 55501 20878
8615B0878r611k6065n8418O4687M7471O4538L2339j26783r1658m6160K7836J1915
$$ 20878 11267 -14798 -73216 -8529 38942 103480 135819 9036 -82622 -128782 -100946 -89031
8603h9031r206k0811o6279J6292P5037N0891j07624j8858O246J2175J931Q5570
$$ -89031 -98237 -119048 -185327 -169035 -93998 -43107 -150731 -169589 -163343 -151168 -149237 -63667
8591f3667l0144K2501j480M338j54164l2722J15639R1515r010P4960Q3779P3153
$$ -63667 -93811 -71310 -72790 -68452 -222616 -255338 -139699 -48184 -57194 17766 101545 174698
8579A74698o1957o6043j6933N4202L0863m7992p6802m7718J4649L9848N0532k6215
$$ 174698 112741 46698 29765 83967 114830 66838 -9964 -57682 -43033 -3185 47347 21132
8567B1132K0867n9869m4376p7837j4257N0068p24l3504p694K3531L0857J4134
$$ 21132 41999 -17870 -62246 -140083 -154340 -104272 -104996 -138500 -146194 -122663 -91806 -77672
8555g7672j2995n1079J3968O0199R0199n7872q8236O1634K2370J9657M5507P1503
$$ -77672 -90667 -141746 -127778 -67579 22620 -35252 -123488 -61854 -39484 -19827 25680 97183
8543I7183K6098m5601j4229l5354p3565j8038j4182J06273N0683K343l7461j11940
$$ 97183 123281 77680 63451 28097 -45468 -63506 -77688 28585 79268 81611 44150 -67790
8531f7790J1512Q2466K8817k88j8348k4405O5209l7554j38875K6448J9759R4524
$$ -67790 -56278 26188 55005 54717 36369 11964 77173 39619 -99256 -72808 -53049 41475
8519D1475O1658M6440l9893r9438j5334R506K8023L4275p0385r2108O653P3898
$$ 41475 103133 149573 109680 10242 -5092 4414 32437 66712 -3673 -95781 -89128 -15230
8507a5230J93957J28707J5587m6514n235q3764r4184p711O787R3739l9452p9752
$$ -15230 178727 307434 323021 276507 271272 187508 93324 85613 92400 186139 146687 66935
8495F6935r4376k4248O3303m8193q759L0922m8939K6216J5728L4845j49278m9596
$$ 66935 -27441 -51689 11614 -36579 -45338 -14416 -63355 -37139 -21411 13434 -135844 -185440
8483a85440O3281L7857J5605j665j7102J6983m6575R6290J53122P0414K0126p9470
$$ -185440 -122159 -84302 -68697 -70362 -87464 -70481 -117056 -20766 132356 202770 222896 143426
8471A43426o3036N156k4262j05322j83259J12186Q4218N717L2421l650p4235q3151
$$ 143426 80390 85546 61284 -44038 -227297 -115111 -30893 -25176 7245 3595 -70640 -153791
8459a53791N2035J05455O0768R3106n0538j3787K5050J9421p731p5713l0954L7791
$$ -153791 -101756 3699 64467 157573 107035 93248 118298 137719 129988 54275 23321 61112
8447F1112o4012K9212N6796Q1575M8844n4874j20317q6441J0377P9508J7151J8340
$$ 61112 -2900 26312 83108 164683 213527 158653 38336 -48105 -37728 41780 58931 77271
8435G7271j8070j1496m0685m0514M5790K1501N4839k6443m6897K0614o4513R18
$$ 77271 59201 47705 7020 -33494 12296 33797 88636 62193 15296 35910 -28603 -27685
8423b7685L9619K179k8951N136P5959p0790q1229q656J39003J42692o6533m3642
$$ -27685 11934 14113 -14838 -9702 66257 -4533 -85762 -94418 44585 187277 120744 77102
8411G7102j7313n9282N1636J00461M0367m3972k8076m1829j10284j4226K6931
$$ 77102 59789 507 52143 152604 192971 148999 120923 79094 -31190 -45416 -18485
8400a8485n7722n7815N6703M9189k4671L170j8358m7925N9943J29215K6284k6143
$$ -18485 -76207 -134022 -77319 -28130 -52801 -49631 -67989 -115914 -55971 73244 99528 73385
8388G3385l6006K0907m6891K1419j9577k5057p214k6609L042N0750p5338j5145
$$ 73385 37379 58286 11395 32814 13237 -11820 -19034 -45643 -42601 8149 -67189 -82334
8376h2334J8796j280K8396l566O0606n749j17734m1202J44544J41640j9229J7937
$$ -82334 -63538 -64818 -36422 -39988 20618 14869 -102865 -144067 477 142117 122888 140825
8364A40825m3950m6120o2136l5828m3694j245j5094L6151N2196J2391R022r030
$$ 140825 96875 50755 -11381 -47209 -90903 -92148 -107242 -71091 -18895 -6504 2518 -6512
8352f512l8137l0318l2545m261R1215R6343J3086j0041K1055j28055k1751Q4507
$$ -6512 -44649 -74967 -107512 -111773 -20558 75785 88871 78830 99885 -28170 -49921 34586
8340C4586K7637n918k2176p4280k5043m0715k3127M7696N7870O7052k4117q0819
$$ 34586 62223 56305 34129 -40151 -65194 -105909 -129036 -81340 -23470 43582 19465 -61354
8328f1354P8248j5876j2124l0111m9994R71J21500J05620L0338r5933j5729j06236
$$ -61354 16894 1018 -11106 -41217 -91211 -90240 31260 136880 167218 71285 55556 -50680
8316e0680l0540l9204m6592r2489N5047R7935P2308J06873M5155p3934j64026
$$ -50680 -81220 -120424 -167016 -259505 -204458 -106523 -34215 72658 117813 43879 -120147
8305a20147L9979J30422Q0207m4558o9101j11144j50759o0423P8934J06893M3036
$$ -120147 -80168 50254 130461 85903 16802 -94342 -245101 -305524 -226590 -119697 -76661
8294g6661l3843N3147O4071o6189l7503M1521O3241m9485p9451M3723K2426J22179
$$ -76661 -110504 -57357 6714 -59475 -96978 -55457 7784 -41701 -121152 -77429 -55003 67176
8282F7176J9187o7832j00341K6744Q6413k4868k2192o2136m4088Q606k1465P5163
$$ 67176 86363 18531 -81810 -55066 31347 6479 -15713 -77849 -121937 -113331 -134796 -59633
8270e9633J16386N581O931J1283J0560p5940n104q6015k6561K7279L2484P7141
$$ -59633 56753 62334 69265 80548 91108 15168 10064 -75951 -102512 -75233 -42749 34392
8258C4392J10200n2356k2196M63o966k0816K6207Q5196m0788j32179m9003M1885
$$ 34392 144592 92236 70040 70503 63537 42721 68928 154124 113336 -18843 -67846 -25961
8246b5961j1485P43L9806P8803J6473q3518m32O3466J0O4014o2042j2828j16064
$$ -25961 -37446 -36703 3103 81906 98379 14861 14429 77895 77905 141919 79877 67049 -49015
8233d9015M4L0132l722P7045L9304K736J1104J7990r6186q9218K2364n4534M5439
$$ -49015 -48971 -18839 -22561 54484 93788 96524 107628 125618 29432 -59786 -37422 -91956 -46517
8220d6517M0753R5381P4636l0082j21323l6003k7186j4951j7732j0145n488R6590
$$ -46517 -5764 89617 164253 134171 12848 -23155 -50341 -65292 -83024 -93169 -98657 -2067
8208b067R2053J8335q327k6923r8258j1121N4095k3642K1710j3919q6983K7332
$$ -2067 89986 108321 99994 73071 -25187 -36308 17787 -5855 15855 1936 -85047 -57715
8196e7715l9915n3669R248J1679N0166K7215p0843j04092L8133P4921L5919R826
$$ -57715 -97630 -151299 -142051 -130372 -80206 -52991 -123834 -227926 -189793 -114872 -78953 -69127
8184f9127M4007l2651o8093r3008N9839P7342j5407r604r611p8544O1181O6829
$$ -69127 -25120 -57771 -125864 -218872 -159033 -81691 -97098 -106702 -116313 -194857 -133676 -66847
8172f6847K3080q7920l2907L3388P2957l5049o1452L9572k824K5985M9906o4101
$$ -66847 -43767 -131687 -164594 -131206 -58249 -93298 -154750 -115178 -118002 -92017 -42111 -106212
8160a06212l340J01001j34863n6891N7682N5153J26836R3509p4271k8247O5033
$$ -106212 -109552 -8551 -143414 -200305 -142623 -87470 39366 132875 58604 30357 95390
8149I5390q0240j66927N002P5264M5301K5690L4778L5672N3512m6508k0794Q3733
$$ 95390 15150 -151777 -146775 -71511 -26210 -520 34258 69930 123442 76934 56140 139873
8137A39873N3785m4073q7592j9801j5168M540N1164k5935l4651K0265J2842n0699
$$ 139873 193658 149585 61993 42192 27024 31564 82728 56793 22142 42407 55249 4550
8125D550k4608m4583P1009j5019m4472p6287l6087P6143j5413n8103L7962M8833
$$ 4550 -20058 -64641 6368 -8651 -53123 -129410 -165497 -89354 -104767 -162870 -124908 -76075
8113g6075M5602m2006N7008l0651n0979p6665P2881l9131j00589j2566L1233J278
$$ -76075 -30473 -72479 -15471 -46122 -97101 -173766 -100885 -140016 -240605 -253171 -221938 -220660
8101b20660J00871J27776M1025M162j02569m2050N5923K6594M0903J5997L4949
$$ -220660 -119789 7987 49012 53174 -49395 -91445 -35522 -8928 31975 47972 82921
8090H2921K5022j07343j4727n3455K3116J24208n0407r8557k0485K6298l1201
$$ 82921 107943 600 -14127 -67582 -44466 79742 29335 -69222 -89707 -63409 -94610
8079i4610M2287Q9467L9274M0190k0951o0087o9362J25408j0821j27648q7686
$$ -94610 -52323 37144 76418 116608 95657 35570 -33792 91616 80795 -46853 -134539
8068a34539R6321O9586l2277l0033J6435J067j0151q928j3614P197k3095l971
$$ -134539 -38218 31368 -909 -30942 -14507 -13440 -23591 -32519 -46133 -38936 -62031 -66002
8056f6002Q4238k0531j15592Q7345L7509m2599M7571O1098J4992p9997m6996O5244
$$ -66002 18236 -2295 -117887 -30542 6967 -35632 11939 73037 88029 8032 -38964 26280
8044B6280o723J9476m2342j10488L2366N1225j5678O925n7679l220P094k1391
$$ 26280 19557 39033 -3309 -113797 -81431 -30206 -45884 -38959 -96638 -99858 -92764 -114155
8032a14155o1951k7631J45297J25143k6167m2121o2K2922N5341j09479k4871k6266
$$ -114155 -176106 -203737 -58440 66703 40536 -1585 -1647 21275 76616 -32863 -57734 -84000
8020h4000J7743R1534k9331k6854n9642l7986j38694L5276L3776N2691L5377N0637
$$ -84000 -66257 25277 -4054 -30908 -90550 -128536 -267230 -231954 -198178 -145487 -110110 -59473
8008e9473n8651r168j7822O9533R7077R1211n8568j03776M6664O4394m4171l4734
$$ -59473 -118124 -127292 -145114 -75581 21496 112707 54139 -49637 -2973 61421 17250 -17484
7996a7484J1008m0819m0796J4937N0253N7938j2499K7305M7325M3398p7499j15044
$$ -17484 -6476 -47295 -88091 -73154 -22901 35037 22538 49843 97168 140566 63067 -51977
7984e1977j5455l9160M9531K9790r9467r392L8908R2835J7916q015J8768p0731
$$ -51977 -67432 -106592 -57061 -27271 -126738 -136130 -97222 -4387 13529 5514 24282 -46449
7972d6449L2547R2398m1556j12497L7278M2733M3536k3144n8726J4206q438j7512
$$ -46449 -13902 78496 36940 -75557 -38279 4454 47990 24846 -33880 -19674 -28112 -45624
7960d5624Q4025m9902j520K4807Q324O692n0684O3240L5686J8297J2669J17729
$$ -45624 38401 -11501 -13021 11786 20110 26802 -23882 39358 75044 93341 106010 223739
7948B23739m2003j7550o0441j38983N5282O4816M5179l6790K9913j627r6895j08211
$$ 223739 181736 164186 103745 -35238 20044 84860 130039 93249 123162 121535 24640 -83571
7936h3571J1392O4659J5143k9568R858J09739Q1481j052K3570k1277q6364J2620
$$ -83571 -72179 -7520 7623 -21945 -12087 97652 179133 178081 201651 180374 94010 106630
7924A06630O1448n3918r4817l425m0425N8807P6315O1426N7144j06044n0130r370
$$ 106630 168078 114160 19343 15918 -24507 34300 110615 172041 229185 123141 73011 63641
7912F3641o4006l7666o205k585k8276K4821P2790j7093R7162j2837q496j369O5373
$$ 63641 -365 -38031 -44236 -46821 -75097 -50276 22514 5421 102583 89746 81250 79881 145254
7899A45254o871q8168j08548P8147N9870n065K2438p417o7074J6866K7154j1083
$$ 145254 138383 50215 -58333 19814 79684 74619 97057 89640 22566 39432 66586 55503
7887E5503j8432j6221Q3718p9267p5941N0613m3608l2422j7164r619j1292k7501
$$ 55503 37071 20850 104568 25301 -50640 -27 -43635 -76057 -93221 -102840 -114132 -141633
7875a41633j0853Q7768M262K5922K9871l6739Q1720j7548n7783j0929j3205m383
$$ -141633 -152486 -64718 -60456 -34534 -4663 -41402 40318 22770 -35013 -45942 -59147 -63530
7863f3530L472O7508j6619L4532m1803j9861j15255J4937n236q8235L7339J6215
$$ -63530 -60058 7450 -9169 25363 -16440 -36301 -151556 -136619 -141855 -230090 -192751 -176536
7851a76536L24J01604M0738R1390N3123O8053q9880j45422R8524N9842o8726j72901
$$ -176536 -176212 -74608 -33870 57520 110643 178696 88816 -56606 41918 101760 33034 -139867
7839a39867m9307N4737L4600o3M8033l0129K5629L1100m784m6728n0922L2604
$$ -139867 -189174 -134437 -99837 -99900 -51867 -81996 -56367 -25267 -30051 -76779 -127701 -95097
7827i5097O1285P3413L6838n3486K8513p9912j17550m4223k771Q0065R3095l0235
$$ -95097 -33812 39601 76439 22953 51466 -28446 -145996 -190219 -192990 -112925 -19830 -50065
7815e0065j01811j5718M8156O9978k3989L1492K2253j099N9624O7567j2923l6025
$$ -50065 -151876 -167594 -119438 -49460 -73449 -41957 -19704 -20803 38821 106388 93465 57440
7803E7440j3171K3485k5027j51475M633O3120q45m7258K1395k8860Q916M3849
$$ 57440 44269 67754 42727 -108748 -104115 -40995 -41840 -89098 -67703 -96563 -87647 -43798
7791d3798P1596R7059K7926o7510p1287j3258p6485o9903n067M3057M9450K9507
$$ -43798 27798 124857 152783 85273 13986 728 -75757 -145660 -150727 -107670 -58220 -28713
7779b8713k9167p682M5452J7734J4988K039q2341o5349m554p826l234P8314N7591
$$ -28713 -57880 -65562 -20110 -2376 12612 14651 -67690 -133039 -137593 -145419 -148653 -70339 -12748
7766a2748k0911q2093l930j7164j4135l062N6079R1954P3831m6212j5680P2880
$$ -12748 -33659 -115752 -119682 -136846 -150981 -154043 -97964 -6010 67821 21609 5929 78809
7754G8809o1480n8989n406j558K7945L2885M7817o3544N3811l1417p0586J5669
$$ 78809 17329 -41660 -47066 -48624 -20679 12206 60023 -3521 50290 18873 -51713 -36044
7742c6044o1970j19290L7295P0604J08990N9238J647o5740j39080o8539j6872
$$ -36044 -98014 -217304 -180009 -109405 -415 58823 60470 -5270 -144350 -212889 -229761
7731b29761N1126J24027J5801p0572j827M4256P6654p9243J5378J09944L8081
$$ -229761 -178635 -54608 -38807 -109379 -111206 -66950 9704 -69539 -54161 55783 93864
7720I3864N9445j10573m1942O2355K4854j9246k2105l8902k9016m9436K9435L3807
$$ 93864 153309 42736 794 63149 88003 68757 46652 7750 -21266 -70702 -41267 -7460
7708g460N7629M6591R0570m7402j26512o7460N8291N9245K7973o1898l119J5442
$$ -7460 50169 96760 187330 139928 13416 -54044 4247 63492 91465 29567 26448 41890
7696D1890N2231j17983j18442j6225m897N698R284J507n3916M4478O5256N2527
$$ 41890 94121 -23862 -142304 -158529 -163426 -157728 -148444 -146937 -200853 -156375 -91119 -38592
7684c8592R5398R93J6076R061p0984r6252K7648L8387N6885n4805r2399K102P9390
$$ -38592 56806 57799 73875 82936 11952 -84300 -56652 -18265 38620 -16185 -108584 -106482 -27092
7671b7092M3819J1516q0957o0609M3496J10251N7746K059K7438O10m022J02669
$$ -27092 16727 28243 -52714 -113323 -69827 40424 98170 100229 127667 128277 124255 226924
7659B26924j27678j06405n0536q8237o4225N4064J21270O1804r1188n7200p553
$$ 226924 99246 -7159 -57695 -145932 -210157 -156093 -34823 26981 -64207 -121407 -128960
7648a28960L0420P2470J07373K015l9856k456J15609M8938p0494K25K6849r8699
$$ -128960 -98540 -26070 81303 83318 43462 41006 156615 205553 135059 135284 162133 63434
7636F3434k9094j1240Q3117n6392j02140l405R9846J8419k9910o8236M3173K047
$$ 63434 34340 23100 106217 49825 -52315 -55720 44126 62545 32635 -35601 7572 9619
7624I619J6398L1504O8786k6341j10848o8477K6868M1350l1282N3591K3164P8731
$$ 9619 26017 57521 126307 99966 -10882 -79359 -52491 -11141 -42423 11168 34332 113063
7612A13063r4036j11306j0984L6343j1035K5638M0173M8916l7221j11106j6958
$$ 113063 19027 -92279 -103263 -66920 -77955 -52317 -12144 36772 -449 -111555 -128513
7601a28513J1477J98262k4688j2096P1008m814k9371j14142j2174R7999k1265
$$ -128513 -117036 81226 56538 44442 115450 110636 81265 -32877 -45051 52948 31683
7590C1683j03712m7345q3382O1366K31399q755l2952n2028l6724J1684L525P2265
$$ 31683 -72029 -119374 -202756 -141390 90009 81254 48302 -3726 -40450 -28766 -25241 47024
7578D7024m469J2128o2588m5557o3560K1583J18494K9758n4369N3968J12019j0856
$$ 47024 42555 54683 -7905 -53462 -117022 -95439 23055 52813 -1556 52412 164431 153575
7566A53575j42027j59131l5071k2316N900n4276O7322M5848O8453J5967k4114
$$ 153575 11548 -147583 -182654 -204970 -199070 -253346 -186024 -140176 -71723 -55756 -79870
7555g9870J06430R1657n4153m4121n0386k5541l7578K0912M0409m8939J5228p247
$$ -79870 26560 118217 64064 19943 -30443 -55984 -93562 -72650 -32241 -81180 -65952 -73199
7543g3199m0632m652j7604L223P9956L3541P5253N3603k2471o3285r9473n3564
$$ -73199 -113831 -118483 -136087 -132864 -52908 -19367 55886 109489 87018 23733 -75740 -129304
7531a29304O9080J11570O5868m4674o5852k659m8296l4509j9503J3573N9529L6811
$$ -129304 -60224 51346 117214 72540 6688 4029 -44267 -78776 -98279 -84706 -25177 11634
7519A1634M9486k5517j38226k0427P5416J62829J03099p5356j00918p1808K4174
$$ 11634 61120 35603 -102623 -123050 -47634 115195 218294 142938 42020 -29788 -5614
7508e614r784J4289M1525Q9643M2004J7180P276q9114p9901n5400J4521J06324
$$ -5614 -15398 -1109 40416 130059 172063 189243 196519 107405 27504 -27896 -13375 92949
7496I2949k5769q2390p9806N0818O9402J1418p7051n3993J5308J06238Q6284K6633
$$ 92949 67180 -15210 -95016 -44198 25204 36622 -40429 -94422 -79114 27124 113408 140041
7484A40041l9775q4949n9951Q927n0105m5419K5302K3521R3785J16599l6532o5611
$$ 140041 100266 15317 -44634 -35707 -85812 -131231 -105929 -82408 11377 127976 91444 25833
7472B5833l7439o66o9272K799Q2060j6205L6643O7804J9570j2950q0187O296K4730
$$ 25833 -11606 -12272 -81544 -78745 3315 -12890 23753 91557 111127 98177 17990 24286 49016
7459D9016k3178k5200k2007j4262K9587m1313k5971k650L2256K0520P1983P5671
$$ 49016 25838 638 -21369 -35631 -6044 -47357 -73328 -75978 -43722 -23202 48781 124452
7447A24452m564n3057K666j9782k8336J4104L326j8778l2892K5260k8503p7491
$$ 124452 119888 66831 69497 49715 21379 35483 38809 20031 -12861 12399 -16104 -93595
7435i3595n5551L1539J79775N5861r5898n1973l360J29071N1336j12649n1229
$$ -93595 -149146 -117607 62168 118029 22131 -29842 -33202 95869 147205 34556 -16673
7424a6673Q201L8387k3196M6756P6030j7848k2956J919O5612m1335m1495q0398
$$ -16673 -8472 29915 6719 53475 129505 111657 88701 90620 156232 114897 73402 -6996
7412f996p0558j0024M6272J18261l691j1792J8401j7610J8033m5362m8689l4040
$$ -6996 -77554 -87578 -41306 76955 73264 61472 79873 62263 80296 34934 -13755 -47795
7400d7795M674R1010l8568j12994K0102P7434K2796o0282m5517K1476N3815q4258
$$ -47795 -43121 47889 9321 -103673 -83571 -6137 16659 -43623 -89140 -67664 -13849 -98107
7388i8107O8685J5678K3464p1729j16405o1683K1807Q2881O5946k1214O5571k9932
$$ -98107 -29422 -13744 9720 -62009 -178414 -240097 -218290 -135409 -69463 -90677 -25106 -55038
7376e5038o6648R3146M6289L415N0733O7241M210q0061M3576M5998m979o510l6837
$$ -55038 -121686 -28540 17749 21164 71897 139138 143348 63287 106863 152861 147882 141372 104535
7363A04535q9717j2702K1659M3707m5755M7530O0983L8988m4353p2693j27070
$$ 104535 14818 2116 23775 67482 21727 69257 130240 169228 124875 52182 -74888
7352g4888p8585O3495j2656M1076m1164P825L7642J15602R757j35914n0008J6415
$$ -74888 -153473 -89978 -102634 -61558 -102722 -94897 -57255 58347 68104 -67810 -117818 -101403
7340a01403L2815N0290m132M994P615m7957m7432k215K5715K1497J8976n8137
$$ -101403 -68588 -18298 -22430 -17436 -9821 -57778 -105210 -107425 -81710 -60213 -41237 -99374
7328i9374O2260Q0058m0639J4742M8735j2358K1575o4041l9437N4229O6576L8963
$$ -99374 -37114 42944 2305 17047 65782 53424 74999 10958 -28479 25750 92326 131289
7316A31289k1912J1026n5837J1572M5968m5214j9482j03576m8426P3843N3563
$$ 131289 109377 120403 64566 76138 122106 76892 57410 -46166 -94592 -20749 32814
7305C2814M9185j5898n1683p5262J14676J00429k488m8630j10075j5009j37444
$$ 32814 81999 66101 14418 -60844 53832 154261 151773 103143 -6932 -21941 -159385
7294a59385k9239M1111J991N5825O1536R7292p9165k6573o2319J8165L2216n7971
$$ -159385 -188624 -147513 -145522 -89697 -28161 69131 -10034 -36607 -98926 -80761 -48545 -106516
7282a06516Q4848J71010L9760p7474j9101n8836r5972N5222J04441o138L9475
$$ -106516 -21668 149342 189102 111628 92527 33691 -62281 -7059 97382 91244 130719
7271A30719k9544L0108j05638j22409J1316N4967N5798k8331k0452M4332L5651
$$ 130719 101175 131283 25645 -96764 -85448 -30481 25317 -3014 -23466 20866 56517
7260E6517M6881j35197j09869M8919K0809p2656P2764J27766k1350p843p5301
$$ 56517 103398 -31799 -141668 -92749 -71940 -144596 -71832 55934 34584 26741 -48560
7249d8560k8835O3086N6042K6123J7821j5160p202N627l0507n8859k9298P819
$$ -48560 -77395 -14309 41733 67856 85677 70517 63315 68942 38435 -20424 -49722 -41903
7237d1903k8136Q1134P0813K1248j1215m0338q362p1743r278Q6082M4835K6174
$$ -41903 -70039 11095 81908 103156 91941 51603 43241 -28502 -37780 48302 93137 119311
7225A19311K3576j6830o6276L0905L4450k2318k8110o7533O4940O0948J8621j7057
$$ 119311 142887 126057 59781 90686 125136 102818 74708 7175 72115 133063 151684 134627
7213A34627q31m0629j07410O0355m699r2265q0319J12577L6346r8312k9154Q8134
$$ 134627 133796 93167 -14243 46112 41413 -50852 -131171 -18594 17752 -80560 -109714 -21580
7201b1580L7946l2498k6331j12270m1177K7750k4426L0561M3695O5784L6517M6849
$$ -21580 16366 -16132 -42463 -154733 -195910 -168160 -192586 -162025 -118330 -52546 -16029 30820
7189C0820M8907l3301m1110k5871m010K2795M7657p7173l4429k4562r0955m7273
$$ 30820 79727 46426 5316 -20555 -24565 -1770 45887 -31286 -65715 -90277 -181232 -228505
7177b28505J4384O7528J3023K294R6226K7050p8636N4791r634m4431k6124N8075
$$ -228505 -214121 -146593 -133570 -131276 -35050 -8000 -86636 -31845 -41479 -85910 -112034 -53959
7165e3959J3723m726L417L46Q0351q2771l2226P6735R5079R4824m1044l5979j8917
$$ -53959 -40236 -44962 -41545 -41199 39152 -43619 -75845 890 95969 190793 149749 113770 94853
7152I4853o8077j5786q022p26L0229m5557j42149n0683P2276M2872N604J6028
$$ 94853 26776 10990 2968 2242 32471 -13086 -155235 -205918 -133642 -90770 -85166 -69138
7140f9138k7266J9323k2613l8250k1427n9632k5282J46250P8355l093p3057K2056
$$ -69138 -96404 -77081 -99694 -137944 -159371 -219003 -244285 -98035 -19680 -22773 -95830 -73774
7128g3774m5904l106J0520P76k4063N5711M3768O2057j5503m8403p9311Q5527
$$ -73774 -119678 -122784 -112264 -111488 -135551 -79840 -36072 25985 10482 -37921 -117232 -31705
7116c1705M1697o4712n4285L437Q253J7148K6592N9634P8333R2849p7243r6048
$$ -31705 9992 -54720 -109005 -105568 -97315 -80167 -53575 6059 84392 177241 99998 3950
7104C950n0609q193j03948O4522J05059K7177j89520l5592P0729K12727M0688
$$ 3950 -46659 -54852 -158800 -94278 10781 37958 -151562 -187154 -116425 96302 136990
7093A36990j09341l5357J2508m733m4369r5024Q7199R8837J6484J0826K665m9142
$$ 136990 27649 -7708 4800 67 -44302 -139326 -52127 46710 63194 74020 76685 27543
7081B7543M933L2296j0799j22387k562O8443P854l6795l1412M2476J02695L4401
$$ 27543 32476 64772 53973 -68414 -70976 -2533 5321 -31474 -62886 -20410 82285 116686
7069A16686l4436q3705o7276k1617K0062j8034j1279P3142N2218n9315l3104m3713
$$ 116686 82250 -1455 -68731 -90348 -70286 -88320 -99599 -26457 25761 -33554 -66658 -110371
7057a10371k646p097M3241J17957M5237p620J6965j66343N7187L124O0220n0747
$$ -110371 -113017 -120114 -76873 41084 86321 78701 95666 -70677 -13490 -10366 49854 -893
7045h93m5885J4044K7357J07967K0937l312J0973m1450o8075M648m8240p7329
$$ -893 -46778 -32734 -5377 102590 123527 120215 131188 89738 21663 26311 -21929 -99258
7033i9258L1524J13159R4028q4682p5562K3986P1883K806j36301k2495L9194J2560
$$ -99258 -67734 45425 139453 54771 -20791 3195 75078 77884 -58417 -80912 -41718 -29158
7021b9158m1058O853j8071M7580N511m5814R484J5549j1219m7303J5025j7198
$$ -29158 -70216 -63363 -81434 -33854 -28343 -74157 -64673 -49124 -60343 -107646 -92621 -109819
7009a09819r8878J2686L9956N3715R063O0306l7463m2762J18781P4942L5934j50564
$$ -109819 -208697 -196011 -156055 -102340 -93277 -32971 -70434 -113196 5585 80527 116461 -34103
6997c4103R452K6364p4468K8581O9673O2675m962j20260j5406R6099M3453Q640
$$ -34103 -24651 1713 -72755 -44174 25499 88174 83212 -37048 -52454 43645 87098 95738
6985I5738j5416k0291j4657J8249M870j2641o0237j0281k8608k1820P5680j4064
$$ 95738 80322 60031 45374 63623 68493 55852 -4385 -14666 -43274 -65094 10586 -3478
6973c478p875k3472o5690M2889M2723L5710m0397N6460K5705k9440n6665O795
$$ -3478 -11353 -34825 -100515 -57626 -14903 20807 -19590 36870 62575 33135 -23530 -16735
6961a6735j1862L7090k0896O4524P0839L5851o8911j07203o8345K6336o977N6078
$$ -16735 -28597 8493 -12403 52121 122960 158811 89900 -17303 -85648 -59312 -66289 -10211
6949a0211P6278K4674q8350j9253R0261L2369j14792n9001m2521L1564O7167j5650
$$ -10211 66067 90741 2391 -16862 73399 105768 -9024 -68025 -110546 -78982 -11815 -27465
6937b7465q3056J2281Q207q5029L0336K1927K6564J19943n1278p874M3667K5481
$$ -27465 -110521 -98240 -90033 -175062 -144726 -122799 -96235 23708 -27570 -35444 8223 33704
6925C3704o7511l8925j6023N004j0816N8515o5739j0560m7125K6803N2471J02114
$$ 33704 -33807 -72732 -88755 -83751 -94567 -36052 -101791 -112351 -159476 -132673 -80202 21912
6913B1912L6711O423O907j4676N9804r5199j31707j2016J12101J03636k8375M5320
$$ 21912 58623 65046 71953 57277 117081 21882 -109825 -121841 -9740 93896 65521 110841
6901A10841n687p8322n8302n5595j5989j3458O4102Q3829M469m036M6009o3681
$$ 110841 105154 26832 -31470 -87065 -103054 -116512 -52410 31419 35888 31852 77861 14180
6889A4180q2296K0165k2516J22324O7132m4562J6393m4241k2935P821O294M7210
$$ 14180 -68116 -47951 -70467 51857 118989 74427 90820 46579 23644 31465 37759 84969
6877H4969J32193N7635j89189j41705l0622N460M8123r0144l6967P7747k3789
$$ 84969 217162 274797 85608 -56097 -86719 -81259 -33136 -123280 -160247 -82500 -106289
6866a06289k3467Q5277L0089j18808O3933M7751N566m5872o5384p4647J7889M7601
$$ -106289 -129756 -44479 -14390 -133198 -69265 -21514 -15948 -61820 -127204 -201851 -183962 -136361
6854a36361j5114M9548j355P5728L8150j3742p8057R3911K0169J3566J7086l0537
$$ -136361 -151475 -101927 -103282 -27554 10596 -3146 -81203 12708 32877 46443 63529 32992
6842C2992N3410n6745K7968K1216M3603q127l1061r3325l6955R4421R4502K8497
$$ 32992 86402 29657 57625 78841 122444 114317 83256 -10069 -47024 47397 141899 170396
6830A70396j04654p5685j07336M4036M1416L0775L0062N7976k4809r2741l2487
$$ 170396 65742 -9943 -117279 -73243 -31827 -1052 29010 86986 62177 -30564 -63051
6819f3051K2147p3952M9857P5548L4633q687l4978r6506P136J3648N727q381L8304
$$ -63051 -40904 -114856 -64999 10549 45182 36495 1517 -94989 -87853 -74205 -68478 -76859 -38555
6806c8555N5252n1804O2022k4936k3487j8690m7258l8461M8161J06730l1359r273
$$ -38555 16697 -35107 26915 1979 -21508 -40198 -87456 -125917 -77756 28974 -2385 -11658
6794a1658L8076o3956p7205L4947N9258n0681l9352l820J1562k4853k3192J01354
$$ -11658 26418 -37538 -114743 -79796 -20538 -71219 -110571 -114391 -102829 -127682 -150874 -49520
6782d9520J00879m5930L2181P5285k7837j4386K8123M5953o4012k7803l6329N557
$$ -49520 51359 5429 37610 112895 85058 70672 98795 144748 80736 52933 16604 22161
6770B2161k4380k9148R4468J13099p1757n8941J376J8087K4825j4734j20241Q372
$$ 22161 -2219 -31367 63101 176200 104443 45502 46878 64965 89790 75056 -45185 -36813
6758c6813L3836J0213J06717q7931k8554N6715l7732q5897N5607P8865O1116m207
$$ -36813 -2977 7236 113953 26022 -2532 54183 16451 -69446 -13839 65026 126142 121935
6746A21935j58231n2404J8491R668J13622j428L5716q0410r5319m7585O4643R4476
$$ 121935 -36296 -88700 -70209 -60541 53081 51653 87369 6959 -88360 -135945 -71302 23174
6734B3174o624k0122j05755K7630J11138m3517j40158q0116J006Q6419O3167m0215
$$ 23174 16550 -3572 -109327 -81697 29441 -14076 -154234 -234350 -233344 -146925 -83758 -123973
6722a23973o3776Q8971J06847p8655k372J7413r4149m8861O3966K0471k529k8322
$$ -123973 -187749 -98778 8069 -70586 -72958 -55545 -149694 -198555 -134589 -114118 -116647 -144969
6710a44969J7288O4710N2341L3182k6663o0039Q8903R3179j4111q0153n5775k3598
$$ -144969 -127681 -62971 -10630 22552 -4111 -64150 24753 117932 103821 23668 -32107 -55705
6698e5705P1148P4940Q166j1258J0611o5401n6023K1723m5796j7858L2122j1507
$$ -55705 15443 90383 98549 87291 97902 32501 -23522 -1799 -47595 -65453 -33331 -44838
6686d4838q5514k1106L1786K1683N8615K7666j5919l6289q723R7162m3653j5041
$$ -44838 -130352 -151458 -119672 -97989 -39374 -11708 -27627 -63916 -72639 24523 -19130 -34171
6674c4171k4826l110n7052o6021L35J2141P5173R1567J2806j0000q2169q5841
$$ -34171 -58997 -62107 -119159 -185180 -184845 -172704 -97531 -5964 6842 -3158 -85327 -171168
6662a71168R967M5864j8986L0332R893J20887J78566o478j29720j34633J4380
$$ -171168 -161201 -115337 -134323 -103991 -94098 26789 205355 198877 69157 -65476 -51096
6651e1096K3747R7862P3287M9761l4936p4500r1457o9893J0642K7310K6750N9378
$$ -51096 -27349 70513 143800 193561 158625 84125 -7332 -77225 -66583 -39273 -12523 46855
6639D6855Q6673k2630p8636P0867n9192r4995m6718M1369k5328k2594O8262K5678
$$ 46855 133528 110898 32262 103129 43937 -51058 -97776 -56407 -81735 -104329 -36067 -10389
6627a0389j3990k1315J1345O9267J8584K7098j5709M4211M1803m9859j8388J3194
$$ -10389 -24379 -45694 -34349 34918 53502 80600 64891 109102 150905 101046 82658 95852
6615I5852j14912r7372J7321Q7218K2484l1736J6426k7572q6044L0089J08419
$$ 95852 -19060 -116432 -99111 -11893 10591 -21145 -4719 -32291 -118335 -88246 20173
6604B0173M5472N1298m3062n1562m7569J0349N7994J9017l7064n0333j69838P2196
$$ 20173 65645 116943 73881 22319 -25250 -14901 43093 62110 25046 -25287 -195125 -122929
6592a22929Q9670j5296l1735M3993K5580R220m8644K1028J48N6345L3003L9670
$$ -122929 -33259 -48555 -80290 -36297 -10717 -1497 -50141 -29113 -28965 27380 60383 100053
6580A00053m3793L4960j17951r3964K2964P0742N0103l6215r3255N11L6339N7326
$$ 100053 56260 91220 -26731 -120695 -97731 -26989 23114 -13101 -106356 -105845 -69506 -12180
6568a2180J05983J7692J2427p5334J2571N4150K7113m8185N0599K6664j27838
$$ -12180 93803 111495 123922 48588 61159 115309 142422 94237 144836 171500 43662
6557D3662j0522q373l0463L825Q0105k6362L4168P2454q2702j4507k2827Q274
$$ 43662 33140 24767 -5696 -1871 78234 51872 86040 158494 75792 61285 38458 46732
6545D6732M0751K0650r6116j05130J0697M3114J1486J0189r0831N0455J08172
$$ 46732 87483 108133 12017 -93113 -82416 -39302 -27816 -17627 -108458 -58003 50169
6534E0169j06265r5521N2549M3618j1933l2203N3087k8780K0907L5242Q6179N5673
$$ 50169 -56096 -151617 -99068 -55450 -67383 -99586 -46499 -75279 -54372 -19130 67049 122722
6522A22722J90m4231r8796N3229J1910j6685j11291k909l2723P888Q5650m7887
$$ 122722 122912 78681 -20115 33114 45024 28339 -82952 -85861 -118584 -110696 -25046 -72933
6510g2933j02897P5325j0246p7544K4443L1453p7026O606O7958R1161N5414k6894
$$ -72933 -175830 -100505 -110751 -188295 -163852 -132399 -209425 -202819 -134861 -43700 11714 -15180
6498a5180M9319K8282m538J9855n084K8104o8253n1764Q3938L2436r5139l4947
$$ -15180 34139 62421 57883 77738 72654 100758 32505 -19259 64679 97115 1976 -32971
6486c2971j1608L9301p041K5898J00899K4539q0189o6735N3972n987o2732O0282
$$ -32971 -44579 -5278 -12319 13579 114478 139017 58828 -7907 46065 40078 -22654 37628
6474C7628k4793j56267L34J06688O7080n297l4037p5260N0566k8272J2062k6N4253
$$ 37628 12835 -143432 -143098 -36410 30670 25373 -8664 -83924 -33358 -61630 -49568 -49594 4659
6461D659K2539P3076P1504P3679J5829m7816j56371j82710M5029M8879m2781N255
$$ 4659 27198 100274 171778 245457 261286 213470 57099 -125611 -80582 -31703 -74484 -69229
6449f9229q815N5395P6962L4351q5063j0197Q1246M359J9309l7977p1698J5983
$$ -69229 -78044 -22649 54313 88664 3601 -6596 74650 79009 98318 60341 -11357 4626
6437D626P4950k7379l5051J02253l3846p9909l0428L3952o1954l5156o0489j8118
$$ 4626 79576 52197 17146 119399 85553 5644 -24784 9168 -52786 -87942 -148431 -166549
6425a66549J35410j3406j1143m9351L5160n0040L9991J5280k1484L4392k2729
$$ -166549 -31139 -44545 -55688 -105039 -69879 -119919 -79928 -64648 -86132 -51740 -74469
6414g4469n2867k0108K1659L9934M415R7233P0727m3630L9904P0365p5464r3695
$$ -74469 -127336 -147444 -125785 -85851 -81436 15797 86524 42894 82798 153163 77699 -15996
6402a5996o4369m9529K6679J21431N1852j0954p9394n6698m451R543Q0804J7882
$$ -15996 -80365 -129894 -103215 18216 70068 59114 -20280 -76978 -81429 -71886 8918 26800
6390B6800R026r6908J3978N9174L2723J6472n2336j15677k3220J20443l071m053
$$ 26800 35826 -61082 -47104 12070 44793 61265 8929 -106748 -129968 -9525 -12596 -16649
6378a6649L687n1451o8691m39K9126J07799q541N7455o39k0254R851L8573J0935
$$ -16649 -12962 -64413 -133104 -133543 -104417 3382 -5159 52296 51657 31403 41254 79827 90762
$$ [...]
##END NTUPLES=NMR SPECTRUM
##END=
